##TITLE=Analysis number 329878
Compound Code cc 67408
Book Reference 522/10
Project Code adrs
Chemist Name stevem
##JCAMPDX= 6.0         $$ Bruker NMR JCAMP-DX V2.0
##DATA TYPE= NMR SPECTRUM
##DATA CLASS= NTUPLES
##ORIGIN= Bruker BioSpin GmbH
##OWNER= nmr
$$ XWIN-NMR		Version 3.5
$$ Mon Oct  8 14:42:23 2007 GMT Daylight Time (UT+1h)  MAYBRIDGE\nmr@NMR_250MHZ
##.OBSERVE FREQUENCY= 250.131544655141
##.OBSERVE NUCLEUS= ^1H
##.ACQUISITION MODE= SIMULTANEOUS (DQD)
##.ACQUISITION SCHEME= undefined
##.AVERAGES= 16
##.DIGITISER RES= 18
##SPECTROMETER/DATA SYSTEM= dpx250
##.PULSE SEQUENCE= zg30
##.SOLVENT NAME= CDCl3
##.SHIFT REFERENCE= (INTERNAL, CDCl3, 0, 16.522)
##AUDIT TRAIL= $$ (NUMBER, WHEN, WHO, WHERE, WHAT)
$$ ##TITLE= Audit trail, XWIN-NMR		Version 3.5
$$ ##JCAMPDX= 5.01
$$ ##ORIGIN= Bruker BioSpin GmbH
$$ ##OWNER= nmr
$$ C:\u/data/dgb/nmr/ADRS/380/pdata/1/auditp.txt
$$ ##AUDIT TRAIL=  $$ (NUMBER, WHEN, WHO, WHERE, WHAT)
(   1,<2007-10-08 14:41:48.23 +100>,<MAYBRIDGE\nmr>,<NMR_250MHZ>,
      <created by zg, POWCHK disabled, PULCHK disabled
       configuration hash MD5:
       76 6E 9A 78 1E 09 19 81 EC 84 63 8F B0 6A 59 2D
       data hash MD5: 64K
       57 BA 43 0B C5 00 F9 54 E9 90 DC 68 FD BA 17 1F>)
(   2,<2007-10-08 14:42:08.12 +100>,<MAYBRIDGE\nmr>,<NMR_250MHZ>,
      <Start of raw data processing
       ef LB = 0.3 FT_mod = 6 PKNL = 1 SI = 32K 
       data hash MD5: 32K
       E7 47 A2 F1 50 8D 64 74 BA 6C 2A CD 4F 60 BC 52>)
(   3,<2007-10-08 14:42:12.00 +100>,<MAYBRIDGE\nmr>,<NMR_250MHZ>,
      <apk 
       data hash MD5: 32K
       9F A6 65 D0 87 BF 40 87 66 4C 5F 8A F0 26 66 09>)
(   4,<2007-10-08 14:42:12.73 +100>,<MAYBRIDGE\nmr>,<NMR_250MHZ>,
      <abs ABSG = 5 
       data hash MD5: 32K
       26 95 58 CF 0C EE 36 56 11 D4 AD 38 59 BB 03 66>)
$$ ##END=
$$ 
$$ hash MD5
$$ 4F 83 B6 60 7C 7D 79 89 68 F2 B4 FA 55 CB 65 92
##$RELAX= 
##$RELAX= 
##$RELAX= 
##$RELAX= 
##$RELAX= 
##$RELAX= 
##$RELAX= 
$$ Bruker specific parameters
$$ --------------------------
##$DU= <C:\u>
##$EXPNO= 380
##$NAME= <ADRS>
##$PROCNO= 1
##$TYPE= <nmr>
##$USER= <dgb>
##$AMP= (0..31)
100 100 100 100 100 100 100 100 100 100 100 100 100 100 100 100 100 100 
100 100 100 100 100 100 100 100 100 100 100 100 100 100 
##$AQSEQ= 0
##$AQ_mod= 3
##$AUNM= <au_zg>
##$AUTOPOS= <14 >
##$BF1= 250.13
##$BF2= 250.13
##$BF3= 250.13
##$BF4= 250.13
##$BF5= 500.13
##$BF6= 500.13
##$BF7= 500.13
##$BF8= 500.13
##$BYTORDA= 1
##$CFDGTYP= 0
##$CFRGTYP= 5
##$CHEMSTR= <none>
##$CNST= (0..31)
1 1 145 1 1 1 1 1 1 1 1 1 1 1 1 1 1 1 1 1 1 1 1 1 1 1 1 1 1 1 1 1 
##$CPDPRG= <>
##$CPDPRG1= <>
##$CPDPRG2= <>
##$CPDPRG3= <>
##$CPDPRG4= <mlev>
##$CPDPRG5= <mlev>
##$CPDPRG6= <mlev>
##$CPDPRG7= <mlev>
##$CPDPRG8= <mlev>
##$CPDPRGB= <>
##$CPDPRGT= <>
##$D= (0..31)
0 1 0 0 0 0 0 0 0 0.06 0 0 0 0 0 0 0.0002 0 0 0 0 0 0 0 0 0 0 0 0 0 0 
0 
##$DATE= 1191850906
##$DBL= (0..7)
120 120 120 120 120 120 120 120 
##$DBP= (0..7)
150 150 150 150 150 150 150 150 
##$DBP07= 0
##$DBPNAM0= <>
##$DBPNAM1= <>
$$ [...]
##$SUBNAM6= <"">
##$SUBNAM7= <"">
##$SUBNAM8= <"">
##$SUBNAM9= <"">
##$SW= 20.6930455092707
##$SWIBOX= (0..15)
0 0 3 0 0 0 0 0 0 0 0 0 0 0 0 0 
##$SW_h= 5175.983436853
##$TD= 65536
##$TD0= 1
##$TE= 296.16
##$TE2= 300
##$TE3= 300
##$TEG= 300
##$TL= (0..7)
0 120 120 120 120 120 120 120 
##$TP= (0..7)
150 150 150 150 150 150 150 150 
##$TP07= 0
##$TPNAME0= <>
##$TPNAME1= <>
##$TPNAME2= <>
##$TPNAME3= <>
##$TPNAME4= <>
##$TPNAME5= <>
##$TPNAME6= <>
##$TPNAME7= <>
##$TPOAL= (0..7)
0.5 0.5 0.5 0.5 0.5 0.5 0.5 0.5 
##$TPOFFS= (0..7)
0 0 0 0 0 0 0 0 
##$TUNHIN= 0
##$TUNHOUT= 0
##$TUNXOUT= 0
##$USERA1= <user>
##$USERA2= <user>
##$USERA3= <user>
##$USERA4= <user>
##$USERA5= <user>
##$V9= 5
##$VALIST= <valist>
##$VCLIST= <CCCCCCCCCCCCCCC>
##$VD= 0
##$VDLIST= <DDDDDDDDDDDDDDD>
##$VPLIST= <PPPPPPPPPPPPPPP>
##$VTLIST= <TTTTTTTTTTTTTTT>
##$WBST= 1024
##$WBSW= 4
##$XGAIN= (0..3)
0 0 0 0 
##$XL= 0
##$YL= 0
##$YMAX_a= 596641
##$YMIN_a= -564165
##$ZGOPTNS= <>
##$ZL1= 120
##$ZL2= 120
##$ZL3= 120
##$ZL4= 120
##$ABSF1= 16.522
##$ABSF2= -4.171173
##$ABSG= 5
##$ABSL= 3
##$ALPHA= 0
##$AQORDER= 0
##$ASSFAC= 0
##$ASSFACI= 0
##$ASSFACX= 0
##$ASSWID= 0
##$AUNMP= <proc_1d>
##$AZFE= 0.1
##$AZFW= 0.1
##$BCFW= 0
##$BC_mod= 0
##$BYTORDP= 0
##$COROFFS= 0
##$CY= 12.5
##$DATMOD= 1
##$DC= 0
##$DFILT= <>
##$DTYPP= 0
##$F1P= 14.0000005364418
##$F2P= -0.99999901652339
##$FCOR= 0.5
##$FTSIZE= 32768
##$FT_mod= 6
##$GAMMA= 0
##$GB= 0
##$INTBC= 1
##$INTSCL= 1
##$ISEN= 128
##$LB= 0.3
##$LEV0= 0
##$LPBIN= 0
##$MAXI= 10000
##$MC2= 0
##$MEAN= 0
##$ME_mod= 0
##$MI= 0
##$NCOEF= 0
##$NC_proc= -4
##$NLEV= 6
##$NOISF1= 0
##$NOISF2= 0
##$NSP= 0
##$NTH_PI= 0
##$NZP= 0
##$OFFSET= 16.522
##$PC= 1
##$PHC0= 153.507
##$PHC1= 9.095277
##$PH_mod= 1
##$PKNL= yes
##$PPARMOD= 0
##$PSCAL= 4
##$PSIGN= 0
##$REVERSE= no
##$SF= 250.13
##$SI= 32768
##$SIGF1= 0
##$SIGF2= 0
##$SINO= 400
##$SIOLD= 32768
##$SREGLST= <1H.CDCl3>
##$SSB= 0
##$STSI= 32768
##$STSR= 0
##$SW_p= 5175.98343685301
##$SYMM= 0
##$S_DEV= 0
##$TDeff= 65536
##$TDoff= 0
##$TI= <Analysis number 999999
Compound Code 99
Book Reference 9
Project Code 9>
##$TILT= no
##$TM1= 0
##$TM2= 0
##$TOPLEV= 0
##$USERP1= <user>
##$USERP2= <user>
##$USERP3= <user>
##$USERP4= <user>
##$USERP5= <user>
##$WDW= 1
##$XDIM= 32768
##$YMAX_p= 321774367
##$YMIN_p= -96295
$$ End of Bruker specific parameters
$$ ---------------------------------
##NTUPLES= NMR SPECTRUM
##VAR_NAME=  FREQUENCY,     SPECTRUM/REAL,   SPECTRUM/IMAG
##SYMBOL=    X,             R,               I
##VAR_TYPE=  INDEPENDENT,   DEPENDENT,       DEPENDENT
##VAR_FORM=  AFFN,          ASDF,            ASDF
##VAR_DIM=   32768,         32768,           32768
##UNITS=     HZ,            ARBITRARY UNITS, ARBITRARY UNITS
##FACTOR=    0.157963299565203, 1,           1
##FIRST=     4132.6476996994, 0,             0
##LAST=      -1043.33573715361, 0,           0
##MIN=       -1043.33573715361, -96295,      0
##MAX=       4132.6476996994, 321774367,     0
$$ Real data points
##PAGE= N=1
##DATA TABLE= (X++(R..R)), XYDATA
$$ [...]
22496 -526 6883 8813 -1996 -25658 -27570 -15855 -5693 -22421 -12127 20843 22230 8693 8400
22483 8400 14425 39645 62748 33393 -16482 -33680 6548 13742 28980 44426 23259 8328
22471 8328 5539 17918 25744 26320 14876 7543 -5343 -3122 -13095 -19882 -15123 -6385 -12525 -3328
22457 -3328 9764 -6793 -16975 -32030 -29987 -17111 -9916 -662 -11456 -10995 2482 8357 22573
22444 22573 11902 -4039 -9540 -22992 -32259 -20420 -13243 -21968 -19196 16234 43169 40814 40922
22431 40922 21742 12157 11725 -16448 -21914 -3031 -7347 -19354 -12030 880 24115 24266 9502
22418 9502 4639 -5894 9950 -9138 -32977 -46193 -11291 10054 242 -14167 -13740 -11471 -28421
22405 -28421 -46306 -8879 22905 17040 -3435 -14751 19487 23164 6535 6838 37852 21984
22393 21984 3032 7119 24110 36168 27402 681 -25431 -11504 5665 5965 14295 2646 -11507
22380 -11507 -7197 19782 6686 -7426 4181 -2869 -1140 -5000 -1150 7230 6954 -463 -15197
22367 -15197 9854 33430 25443 5945 10893 19663 24489 45491 65474 66637 52730 -3298 -2389
22354 -2389 -13721 -6857 10063 -4523 -5611 -26171 -22746 -350 -11179 -9763 5834 14702 10972
22341 10972 26981 16131 4837 10046 5830 -9710 -11499 -6123 14372 23035 22777 30912 34660
22328 34660 -11044 -32772 -6423 15487 13789 20570 19920 18844 7315 18299 6424 -2236 2194
22315 2194 9860 11835 1823 13062 8703 12647 -5261 -14471 -7099 -11461 7383 -16269 2727
22302 2727 17622 11022 19583 -6826 -25030 -6601 -6617 -12152 -1957 -1162 13314 15928 -21675 -33262
22288 -33262 -7327 15313 18785 25167 20294 25682 6041 21364 67582 29251 -9371 -13454 -7761
22275 -7761 -7737 -7352 -16562 -49658 -36565 -21274 -416 -20928 -32779 -23611 -18628 -6601 -7191 -7657
22261 -7657 3991 13241 16984 12656 5105 -6064 4020 7475 -6891 -3097 1793 5240 19582
22248 19582 19944 3972 -10436 -16670 -20206 -24310 -18409 10417 22484 -8941 12801 42582 60666
22235 60666 57007 80959 50002 25036 3053 -16202 -20535 -33479 -45857 -5608 6468 9289
22223 9289 -8076 -6285 7908 16809 8023 4947 -9052 15286 27658 32131 29390 19518 4448
22210 4448 -10764 -15900 4110 2824 -12601 -35029 -65625 -36361 -41651 -57341 -15356 21465
22198 21465 26326 23642 -977 -25037 12560 60385 57106 28878 16997 21597 16403 17692 14645
22185 14645 56656 73651 61183 62821 42051 40453 62666 94441 93798 81982 67146 57297 33961
22172 33961 32153 22250 23894 17029 -3979 -19379 -2384 34453 22639 -2827 6278 18184 4289
22159 4289 16154 11204 -2694 29 5141 9326 25235 28976 7651 7413 -10601 -37559 -73620
22146 -73620 -56311 -59156 -58438 -21662 13768 18254 -12271 -19299 -2088 -9387 -21611 -27230 -48983
22133 -48983 -55569 -38492 -11738 7624 9555 -4952 -20036 -51641 -31536 5028 33617 40864
22121 40864 -858 -1976 25447 35932 30889 26251 31641 32690 4829 -27567 -39489 -30593 -38290
22108 -38290 -22340 -9301 -9513 -13768 3272 155 -20124 -15543 -2837 13340 27121 1943 -20366
22095 -20366 -13337 -19386 -6630 -37104 -40834 -39496 -17588 -4142 -14164 -9784 -8730 8230 -6868
22082 -6868 -26619 -34192 -44542 -25428 -11630 4353 -13842 -3117 9240 6163 9393 -7796
22070 -7796 -17256 -2737 25806 19609 15324 6306 -14538 -19956 7275 22641 4489 3954 539
22057 539 -36592 -40219 -12627 29964 45278 37045 18530 21194 25042 15195 -6057 6752 -3422
22044 -3422 -15168 -7149 21864 34819 21575 804 -5781 9050 30792 48026 25751 -8301
22032 -8301 -15597 -7402 5997 15080 27336 19083 15162 36496 48443 53774 73289 66572 43110
22019 43110 33292 19368 16981 4610 -6247 -24768 -26359 6031 19084 17857 -3401 -4948 6331
22006 6331 -8405 -37114 -71047 -58308 -25796 -912 11279 -8053 -25763 -660 2654 -3309
21994 -3309 -11928 -7677 6418 39766 25594 7285 -9354 -16590 -15460 12497 30833 12818 19960
21981 19960 4916 -11973 -17207 -36587 -32380 -36769 -33564 -18416 6708 15683 15111 14231 4253 23928
21967 23928 51566 27991 27927 41368 38936 11523 -2589 9503 25174 132 -21784 -37159
21955 -37159 -20511 3499 13029 -6934 -8337 1704 8629 26609 17947 23930 22412 -418 -297
21942 -297 -22254 -16907 -13245 -14713 608 -12201 -41978 -51380 -28124 -7731 4720 24011 8295
21929 8295 -16717 -12389 -5330 -5365 -18758 -9432 -19066 -60705 -45789 -1658 -28699 -35878 -37657 -13699
21915 -13699 452 -25203 -37895 -38812 -23957 -18685 -15169 -14526 -9599 -22922 -28915 -11826 9176
21902 9176 5015 6728 13346 -14191 -42177 -45581 16259 31674 6313 -4550 -18410 -8818 64
21889 64 -24029 -11092 -790 8993 19411 18161 13133 3240 -6204 -5041 -8596 -6709 14297 20272
21875 20272 24737 34356 20831 21534 13485 15164 -5629 6554 -23497 -24656 -14375 -4299 6292
21862 6292 31109 36020 26392 34515 42101 38267 17989 10229 7711 -8643 -32960 -29055 -6292
21849 -6292 -3662 -27860 -18684 -11389 3500 16896 18669 -5139 -17183 -3835 22967 39877 60453
21836 60453 39343 17356 -1560 -19224 -19081 -14129 -21282 -24510 -37686 -34790 -18807 -8097 6558
21823 6558 15110 1782 -18846 -17074 5980 14033 9194 3299 -8808 -20678 -20953 -20260 -26966 -25650
21809 -25650 -10596 -14596 2464 13927 11911 3546 -10645 13016 17557 35416 16089 -3805
21797 -3805 814 25103 23672 2032 7400 21345 23793 15476 5444 -6634 -13100 -944 24351
21784 24351 9424 -34961 -22766 827 180 -5464 -31500 -48801 -23541 -13510 -31224 -15967
21772 -15967 -6724 -19003 13548 19375 13202 5608 -4186 -15664 -4554 -17161 -27825 -27411 -32050
21759 -32050 -49108 -72117 -55882 -12173 3317 5120 -5330 -4725 -10206 -42805 -47803 -50645 -39407
21746 -39407 -28352 -4273 12683 -3249 22940 4621 -24505 -40603 -36392 -16720 -10311 -19343
21734 -19343 -30119 -29711 -26991 -13864 9826 22861 24799 11036 6621 18983 -1447 -44170 -63251
21721 -63251 -35067 -16145 32923 28488 7452 29109 13923 -14341 -15244 -11698 -1746 430 17898
21708 17898 10369 -15620 -30412 -5862 7759 5006 -3180 -11692 -14348 -10180 -9510 -32313 -49799
21695 -49799 -63601 -71615 -82760 -50916 -25370 -26845 3040 32698 31499 6738 9718 9628 28106
21682 28106 49683 46307 28014 37313 33083 28204 30725 24337 22187 41598 29419 9327 7295
21669 7295 3185 7320 34544 7651 -9190 -34767 -7729 14880 9738 22905 27923 38238 50899
21656 50899 62359 68086 69889 46393 35795 34842 8180 -4150 2222 -5486 10510 21439 2250
21643 2250 -1402 -3979 7569 12312 16363 -8476 4919 11579 18375 23646 49089 35595 -2806
21630 -2806 -24444 -30118 -13050 -429 -4482 -12003 -10613 -6633 -15232 -30960 9312 4689 -3823
21617 -3823 4896 -11932 -37642 -26067 7050 4451 5391 -1821 -13897 -39466 -37610 -43301 -32921
21604 -32921 -5979 -6715 -99 23533 28064 29828 20967 24647 9477 21671 50687 53487 40998
21591 40998 1175 -10593 -14320 3144 30528 35397 61827 60961 25306 7353 15587 27492 32906
21578 32906 28037 20024 6136 -17857 -32525 -22120 -11667 -5703 10164 14895 9856 20780 10807
21565 10807 8543 16803 48502 37145 3878 5101 7313 11784 7178 -14750 -983 12796 -14103
21552 -14103 -8380 -18893 -16408 -13858 -22053 -47687 -50446 -46810 -47226 -38675 -20326 -4649 2037 -3113
21538 -3113 -12641 -16892 -41042 -41594 -21515 -12582 -26052 -18926 -2743 5161 8777 3161 -2408 9862
21524 9862 28771 14468 12907 12252 24599 7954 -13196 -16510 -9457 -1631 1238 -6861 -6817 -8997
21510 -8997 -16918 -31354 -39524 -22046 -7647 10599 23378 16649 19761 36966 33035 20046 20447
21497 20447 17809 47385 69655 69111 22973 14922 12655 24077 19492 16966 7596 23017 36180
21484 36180 28275 22102 30476 31332 -3454 374 1533 12115 24032 11584 18056 3496 2960 -9581
21470 -9581 -5291 -5416 2294 29697 -2756 -28017 -22326 -13297 -2426 16801 12348 -22783 -16092
21457 -16092 -1961 -15918 -12351 -15851 -3910 21257 9940 18028 24490 8401 -6549 135 -1210
21444 -1210 -4232 -5800 -21304 -16499 378 5359 19529 47851 18224 24512 33636 16982 14356
21431 14356 1308 -13980 -27335 -30170 -23701 -19385 -21866 -25278 -46842 -16961 249 2490 19718
21418 19718 35420 35187 25202 29429 12288 8419 18349 26737 38298 23403 12341 39882 49021
21405 49021 36360 10118 19595 30833 26264 9153 -3244 -50967 -31329 -10410 -7158 -17345
21393 -17345 -22200 -8199 -7428 2708 -19317 -44624 -37421 -22283 -13265 -35482 -24842 -22359 -16830
21380 -16830 -18359 -10061 10178 38598 32201 3250 -1871 6998 11871 27506 20155 -7700 -22800
21367 -22800 -17135 -8050 -752 7443 5420 -18080 -4877 14307 30984 23085 11442 -12820 -17900
21354 -17900 1078 29813 17097 18317 9428 -6642 -11855 -18803 -11207 -20668 -29319 -51804 -40259
21341 -40259 -23266 -41634 -45895 -17307 -3525 -8533 -18846 -16791 -26999 -2111 27367 20933
21329 20933 24235 32872 20183 13502 8931 21415 12614 13085 25065 48799 54480 46598 43774 16441
21315 16441 15614 21044 26211 29448 27757 33604 27582 5427 -22173 -38601 -30885 -33143 -18630 -24362
21301 -24362 -43719 -44133 -23566 -957 5802 -9785 -26226 -30977 -42341 -25437 -30676 -27715 -45211
21288 -45211 -56109 -37143 -19662 -18145 -4138 -5169 -38330 -33733 -14834 -13096 -31291 -22558 2546
21275 2546 6046 18246 26037 18725 -2552 -11590 -9037 -24708 -14574 -18193 -11606 8619 12621
21262 12621 -16663 -46893 -58852 -70298 -80505 -71867 -53738 -23674 -16934 -21237 -31291 -31144 -29298
21249 -29298 -10706 -4841 -2361 9573 15782 9605 23866 30247 16010 -5096 22566 34811 30404
21236 30404 34927 27418 15833 13048 29400 30454 35998 8654 -3157 22118 12652 1171 -1603
21223 -1603 41095 39180 30979 52384 44326 25626 -25802 -5671 30105 34079 30485 5927 16946
21210 16946 30624 22839 12526 -24327 -31282 -20048 6146 7061 333 -1775 -2779 13324 15890
21197 15890 15821 -1305 -11208 -11617 -8447 -22605 -21218 -10315 -2036 -2587 -1272 -23783 -50694 -51903
21183 -51903 -41066 -52291 -61571 -38689 -14950 -18837 -21504 -32175 -22738 6710 20461 23683 -4727
21170 -4727 -18407 -2538 27722 36622 26324 22460 13230 -3843 -18962 -24902 -36109 -15915 -16613
21157 -16613 -17790 -11385 -12555 1731 11066 14602 -2468 -24939 -39936 -43865 -33754 -27512 -24341
21144 -24341 -11337 9594 23843 34035 49805 27606 -12965 -16303 -19035 -7789 -3923 -39174
21132 -39174 -45651 -43830 -24434 -38385 -33706 -34411 -31408 -26904 -16844 -524 -5982 -36647 -47825
21119 -47825 -49268 -15252 13582 30195 35280 8955 15860 30681 33832 23641 25329 42790 39380
21106 39380 307 -47446 -48737 -24261 -21842 -31920 -29692 -9413 33794 25820 5562 11262 2908
21093 2908 -33088 -28398 -5285 4048 7806 1408 8868 -8143 -16214 -19471 -32836 -37297 -32466 -25096
21079 -25096 -34161 -18918 -34075 -30785 -52225 -39492 -11182 -21380 -39471 -48920 -52408 -55039 -39162
21066 -39162 -44182 -29421 3373 25698 3564 6068 2641 -346 4533 687 -11353 10148 12382
21053 12382 5442 2710 6759 28483 26689 31317 23387 28083 37760 16652 -2205 11086 2681
21040 2681 2405 10621 -6873 -18538 -11483 -6769 -8912 -22895 -24836 16107 38859 40455 18372
21027 18372 9443 23610 13219 -5245 300 -10271 -16287 11746 14569 -3390 -48 26324 18482
21014 18482 19435 9672 7759 11560 15992 26846 20926 -9617 -8316 9747 25211 2174 -18052
21001 -18052 -16968 -33272 -7841 10312 17002 2876 7290 1848 -20917 -14093 -14800 -11572 -5763
20988 -5763 -13467 -33388 -38244 -39503 -26057 -15013 -11747 -2909 -21908 -25925 22392 18086 -8051
20975 -8051 -6828 -11774 -27930 -12398 45697 51580 -1008 -20822 -1546 -7534 -1371 -566 -1671
20962 -1671 -6274 7497 39925 39738 29730 7731 -20735 -14925 -27057 -46777 -30896 -16839 -23555
20949 -23555 -20183 -5450 4560 16031 14309 11515 17922 13842 -11247 -22380 -13146 10402 27351
20936 27351 16184 -5336 15813 24884 41121 32360 21248 32683 31968 45390 47893 38028 25667
20923 25667 11973 636 -9808 -5460 -4857 6168 9443 -10826 -37508 -41901 -51068 -20988 -1032
20910 -1032 22202 14676 2444 -3495 -18231 -5240 19337 17105 5810 3467 36483 47626 32224
20897 32224 45467 25850 -5722 -4078 -8879 -2185 5918 32339 30157 23276 11748 15528 33249
20884 33249 23985 13434 -13446 14946 22537 13771 9218 12445 36433 27390 -14014 -13152 -8538
20871 -8538 6642 25601 12008 -15277 -11907 -12809 3691 9522 18916 21947 843 -25537 -21049
20858 -21049 -22869 35166 66595 45880 -15202 -63375 -58728 -27804 -5420 19876 18631 26596
20846 26596 1668 -22368 -14296 -11276 22642 23170 31037 30400 46883 46515 25917 4999 -634 7621
20832 7621 19802 31107 28173 11024 -12349 -10737 3357 -1836 -30407 -12054 -19942 -30998 -26758
20819 -26758 -23663 -26058 -35005 -18221 20560 13937 -16322 -38378 -16487 -12394 -24334 -25433 -1769
20806 -1769 -11503 375 6091 -3277 -12880 11286 27296 3343 -20653 -29247 -35314 -15171 -1877
20793 -1877 -3359 -27175 -52395 -43870 -25746 -6213 12562 33733 15626 29953 46997 60811
20781 60811 32805 -7271 5834 12156 12662 35704 37409 40418 68594 50408 43443 28414 56089
20768 56089 64474 39883 23747 26961 402 6021 27946 43912 16843 7045 -19928 -7036
20756 -7036 26137 34686 47666 49028 31969 11430 -6557 -9878 -6316 -18917 -15491 6017 987
20743 987 -15489 -33083 -46577 -22013 -7968 12816 38827 35007 4193 -33913 -48720 -30946
20731 -30946 1501 1122 -11626 -17695 5459 13282 9668 27943 42010 53137 39879 31441 22717
20718 22717 22570 6540 7108 18409 30730 39168 18283 6354 8806 12090 11703 2081 -2007 11062
20704 11062 14114 -4602 -29490 -44303 -2668 23533 32614 35242 25485 22520 14507 3400 -1691
20691 -1691 -30321 -24541 -37576 -54894 -41603 -48390 -33215 -15285 -28038 -29226 19369 33273
20679 33273 42373 32092 18849 33043 -997 -12127 -23662 -19358 -42934 -20992 -9819 -13296
20667 -13296 -5879 16597 30984 21475 28141 25043 18961 18467 15431 8828 -13494 -15136 5208 4615
20653 4615 2269 33181 50906 35502 20319 40276 65670 21994 -882 5974 24170 34626
20641 34626 36741 29902 44511 29547 10816 577 -11807 8412 11667 18605 6295 17346
20629 17346 41544 31284 44708 17795 -8008 6017 25156 7701 31218 18270 -14720 -17947
20617 -17947 -5324 -9006 -37720 -39880 -49080 -43748 -28611 -9146 -12405 -27455 -39584 -32563 -25957
20604 -25957 -24780 -14298 -5871 -10375 -683 5250 -3393 4358 16666 18956 43398 43107 21365 -6617
20590 -6617 -14191 -22957 -23737 -19762 -30059 -3530 4372 -5481 -19642 -20820 328 21221 24591 10773
20576 10773 -5478 -8645 -22431 -22682 -41005 -42904 -21337 -24840 8207 14666 10700 10302 26768
20563 26768 12366 17567 9004 -6265 -12441 14893 46822 52966 16930 19804 11078 12322 29459
20550 29459 32145 37402 -3201 -16603 -5052 43378 45746 31619 12123 8826 31891 31273 31522
20537 31522 17035 5977 4817 28109 17498 -28150 -44718 -8778 5797 39657 47967 47635
20525 47635 47596 39748 14452 -1578 17744 19417 13410 26488 47970 53690 61940 45903 31749
20512 31749 3624 -16621 -7985 5980 7030 5744 10100 -10469 -42076 -14758 -1377 -5606 -1745
20499 -1745 -1749 -1073 17482 23805 16119 19907 30852 11873 -11400 -7841 8447 11596 2011 -957
20485 -957 1594 -20822 -8507 10884 23104 14165 -11417 -14458 570 -1361 9520 16093 7695
20472 7695 8614 -4506 -322 -21230 -41771 -36421 -30329 -5220 33052 42034 30360 25500 30040
20459 30040 23305 7613 -25010 -14216 -22883 -26329 -50449 -66047 -37566 3841 13358 268
20447 268 -3991 9881 26957 14514 371 -4836 19830 14680 6936 6737 -19958 -26704 -38754
20434 -38754 -24634 -7875 -2526 3931 -7227 -6358 -6378 -8496 -10838 -7573 -17303 -45180 -47799 -56924
20420 -56924 -33465 -9972 -1670 7075 -4388 -22229 -27168 -24815 -17903 -29890 -37509 -43955 -37663
20407 -37663 -28793 -28989 -42749 -14682 5393 -11559 -21044 -43121 -34398 -34290 -34141 11753 -14997
20394 -14997 -44387 -38269 -36468 -32030 -45955 -38482 4580 26531 19719 13310 14665 13143 18579
20381 18579 24397 18635 -2107 1309 266 -1751 2673 -17109 -8931 -18814 -23396 29693 33041 4587
20367 4587 -18974 -20576 -11596 -9585 6473 15765 13065 15475 16717 28371 32463 20219 17603 11666
20353 11666 -9961 -793 5323 -8387 902 17096 -9980 -30306 -25818 -28822 -7677 -21806 -42415
20340 -42415 -24409 -28547 -54698 -55448 -48068 -36057 -20980 3226 10160 -2090 23385 40947 50830
20327 50830 24713 6373 178 -9679 18579 8358 -16668 -35675 -46996 -16517 -7800 -2578
20315 -2578 -15193 -39459 -39325 -11899 15661 17806 -7480 -28605 -23195 -3146 21052 32950 8000
20302 8000 427 15434 -2123 1942 14577 22787 57891 58696 34182 33749 24699 24439 11230 -5412
20288 -5412 13067 35866 51154 48955 33735 23502 7898 -4631 12060 26750 49345 25561
20276 25561 -3415 2770 2595 25995 5819 13633 -9236 -44929 -29560 -10112 6310 -6468
20264 -6468 -15020 6421 22101 -16752 -27306 -21713 -3860 12022 8174 14945 414 -37417 -21202
20251 -21202 -37214 -42334 -26866 -39912 -52353 -56639 -55144 -28602 -365 6324 -16868 -31492
20239 -31492 -6454 5581 15936 2213 -23475 -19384 -13678 -38108 -56414 -31160 -11310 6288
20227 6288 23212 34750 6360 -8803 -27890 -26951 -24350 -7450 1906 10790 8675 969 693 -8324
20213 -8324 -17510 -6270 -7085 -7343 2372 12095 -9025 -9828 -190 -18882 448 4889 -26647 -56792
20199 -56792 -39237 -34735 -20194 -23696 -1320 17546 17679 15663 17120 24660 23393 21726 -16384
20186 -16384 -25552 -12462 -20551 -29119 -20729 -9370 -16605 -33671 -54312 -28412 4157 9703 24291
20173 24291 33530 13022 5334 -4937 -17418 -22512 -19807 -5147 4294 208 -20912 -36048 -24582
20160 -24582 -13918 -21524 -21472 -22773 27360 33863 21622 24436 56687 65624 45419 27446 23405
20147 23405 5676 4677 16689 4655 -10712 2935 11666 16142 -5924 146 20574 5885 23752
20134 23752 42832 12258 3565 4619 -7652 -6120 5412 12502 7971 8886 14206 25050 22199
20121 22199 -10084 -31638 -14488 -1914 -27614 -48235 -50491 -56033 -76717 -83736 -47502 -996
20109 -996 -9513 -24569 -31378 -14104 -14163 -14160 4336 -13747 8039 7914 9570 36426 32835 33743 35275
20094 35275 22508 17018 -26039 -34539 -39743 -38982 -44642 -21809 1602 -1095 -7426 -7472 14925 33411
20080 33411 28704 25146 3046 9668 26615 10518 10252 13632 18981 30640 35469 45426 37067 21893
20066 21893 31433 19540 33522 28672 31519 33707 24290 28518 31001 6972 -8861 -14166 19374
20053 19374 22919 16659 -1733 -512 64 -7667 -34477 -20769 -9290 -26341 -12414 -6591 -2128
20040 -2128 -3210 22999 25494 24299 13421 389 6206 32173 56170 63814 45282 7147 -17325
20027 -17325 4664 20301 18601 -2858 -24563 -25270 3836 -18254 -38216 -16946 -9801 -27311
20015 -27311 -56861 -71433 -61284 -61182 -19295 -13136 -22402 -28189 -33701 -19035 5436 24468 38759
20002 38759 33674 -780 9687 25643 14131 -4115 -19687 -12888 30384 51332 50378 37033
19990 37033 16190 1759 28599 26994 -732 393 10244 46540 48736 13770 31742 19876
19978 19876 -7286 -4005 12738 8748 15496 20566 14485 26418 34988 5370 -5135 20257 19164
19965 19164 15645 -20479 -43639 -29844 -22829 -22239 -15475 7180 37217 16822 4419 26208 33823
19952 33823 27837 24884 -5280 -7246 -43008 -57329 -62368 -53701 7131 30284 27773 31301 5117
19939 5117 -41746 -5045 4766 36341 32337 31488 13185 -188 37340 45437 46180 36957 30027 38852
19925 38852 25841 13811 21935 10539 -14770 -25065 -2126 -2928 -14668 -29772 -18372 -1355
19913 -1355 3766 -9566 -25773 -18814 -32316 -28355 -3208 5990 130 -25881 -10261 20899 22718
19900 22718 23288 27056 11540 34842 32700 2044 18439 10461 6761 3133 -2323 -15829 -43419
19887 -43419 -50792 -24116 -19280 -14450 1070 -22651 -6129 13299 -1616 -8906 -20875 -18133 -15195
19874 -15195 5511 15538 17801 11656 1513 -6994 -12853 -3371 56048 41845 15494 10467 -2718
19861 -2718 -11637 -30446 -39495 -26918 -11796 -1420 13495 13225 11290 21268 33731 21404 29698
19848 29698 28449 45966 36509 -5956 -11489 12258 23312 23912 -17241 -53767 -32564 -29494 -30224
19835 -30224 -15225 20077 28476 19294 15920 -22597 -34702 11378 15657 -12258 10680 26901
19823 26901 29442 9399 420 -19487 -13294 -23950 -3162 -13483 -18788 -14323 -29148 -35547 -30882
19810 -30882 -5778 2037 4904 -21474 -22874 -17905 -17974 -15961 -6502 1471 21073 34321 17002 -18743
19796 -18743 -30749 -20324 7086 25244 19918 21161 25059 47219 39865 18726 33802 50602
19784 50602 33497 27396 26582 13306 24873 25428 17987 12572 -2751 20327 26371 33905 23048
19771 23048 10759 18398 19639 16828 13319 -4722 9543 5995 -12145 12793 -11670 -18692 -17341
19758 -17341 -11943 -37061 -43584 -31899 -880 -2873 -20068 -13734 -29212 -30574 5637 13830 3347
19745 3347 -15495 -9140 -11687 -14428 -28955 -41117 -27109 -13832 -25026 -37297 -47738 -33143
19733 -33143 -27310 -28928 -31614 -19039 -14896 -1137 -5591 -10689 -3256 10452 -1871 9275 -617
19720 -617 -29252 -33963 -8743 -3005 -7366 -14859 -20647 -23017 -4090 1235 -25810 -39057 -10595
19707 -10595 11557 21960 22070 7294 26389 32685 324 -28162 -1425 14434 -13055 -16698
19695 -16698 -525 15742 14436 657 -7082 4808 31517 24368 -5951 -11222 29467 41470
19683 41470 40149 51457 32627 32481 11328 14558 -6364 -30377 -20495 -34674 -24683 -6180 18034
19670 18034 44855 37536 13018 -13475 -2242 12065 2868 -5404 -7663 -10842 -20390 -10203 -28461
19657 -28461 -47956 -23174 -10446 -18373 -977 -15042 -29360 -22031 -9417 -6452 1103 17993
19645 17993 21098 -13301 -32336 -34284 -10399 4312 4937 -7091 -11735 -24496 -5882 -13429 -28865
19632 -28865 -45427 -49898 -40662 -50235 -59899 -46389 -40521 -6360 22885 20794 -10608 -17796 -8352
19619 -8352 3945 15806 2295 16831 -5447 -14961 -8342 2034 14596 -5016 -3734 7184
19607 7184 8559 -9028 -21807 -22274 -20609 -8199 3907 8765 -4475 -4222 -13708 -16129 -14041 -13527
19593 -13527 -16244 -24510 -29288 2221 25602 20289 17239 -3482 -12382 24646 39442 40658 55985
19580 55985 47473 -2323 -18324 -3880 16300 28299 29688 12066 -22421 -40231 -49586 -38259
19568 -38259 -36459 8467 -4193 -30645 -22650 -27459 -27683 5534 6478 -19430 -26494 -29283 -31161 -63118
19554 -63118 -26143 -11353 -47142 -35535 -42451 -56108 -34749 -17772 -24910 -18494 11310 23891
19542 23891 26512 26681 -6439 -17495 -15642 -19269 -35491 -42201 -32902 -24147 -19689 -56931 -64772 -53116
19528 -53116 -47362 -33153 -37106 -38231 -50696 -24166 -3010 -11933 -35917 -28214 -33435 -33150 -42272
19515 -42272 -68951 -56139 -36561 -9159 -13551 -13127 -3004 -4776 2592 -18452 -39405 -45370 -9427
19502 -9427 2137 16213 26033 12344 -12181 4573 15228 15350 42080 50219 38865 14061 12644
19489 12644 -4390 -673 -25717 -19195 -30903 -32318 -24945 -36768 -48335 -48177 -25740 -19327 -39075
19476 -39075 -39532 -34347 -19816 -11473 3819 5733 2986 805 -8107 -33989 -24418 -16386 2389 -5899
19462 -5899 -10175 -1771 4204 27728 2846 4419 9508 28951 41499 11133 -5429 -14412 -2304
19449 -2304 -17300 -26445 -23362 -17380 10341 4682 9853 4824 -22208 -15715 9671 35774 34604
19436 34604 34492 38634 14273 15631 27938 20140 -9898 -5174 1212 3536 -6538 16913 13100
19423 13100 -6287 -35956 -11013 -1247 -6434 5510 -13872 -22152 -22591 15214 13209 -1478 2251
19410 2251 7092 4195 -17220 7872 8529 -10683 -25711 -19106 3455 12744 -9934 2087 5108
19397 5108 151 10559 1115 -6918 1411 -18011 -11671 -12845 -9589 -1183 -1425 -21488 -37747 -30772
19383 -30772 -4683 -10598 4240 14726 8209 9098 12789 29132 41262 31268 7334 5979 12774
19370 12774 -1637 -8238 7933 22628 16154 6556 -14585 -22387 -12462 574 -8367 -8457 -13160 -23198
19356 -23198 -30457 -3020 14266 -3011 2739 5781 12404 18583 35341 16294 10018 2348 -19425
19343 -19425 -30890 -29644 -34988 -19869 -17054 -33660 -11191 4680 3362 -9089 3023 3142 17809
19330 17809 25619 44570 16038 -8287 1277 -14268 -18810 -23078 -38647 -21506 -24685 -24856 -12261
19317 -12261 -14612 -30814 -24518 -20673 10145 8080 5283 -25071 -49423 -59957 -46776 -32676 -24509
19304 -24509 -13891 17194 25776 7917 -17728 1231 -9000 -14552 1486 3335 -7234 -4340
19292 -4340 1270 6563 -11859 -24693 -9095 4144 -2674 -2441 976 20612 -879 -6634 13684
19279 13684 -1371 -12049 -11326 -26207 -43969 -51021 -17056 -11005 -18605 -9625 17223 3456 -4811
19266 -4811 -13388 -16009 -37856 -37716 -25689 -8672 8230 -4770 3901 -23910 -3810 20919 6308
19253 6308 3712 -13028 -18019 5118 14089 16896 -8197 -20539 -1909 -13467 -526 31977 18567
19240 18567 -12127 -16992 -18109 -10442 7334 3855 -18621 -34906 -31684 -28989 -30494 -12342 -10373
19227 -10373 -15980 -22839 -21301 -34403 -10958 -14412 -12514 -10315 -11563 -16335 -12474 4199 19977
19214 19977 -10148 -37642 -46159 -36054 -41604 -31171 -17761 -26648 -33467 -8155 3595 11418 -660
19201 -660 -12508 -9184 21892 31589 15951 -2179 -26194 -30123 -31244 -48210 -70216 -71064 -53301
19188 -53301 -42249 -24860 166 1311 -3291 18949 42423 48510 29776 20352 23628 27487 25518
19175 25518 24124 -21037 2401 34604 29243 14608 17355 22327 30282 12012 -734 11123 18844
19162 18844 -1095 -12929 -739 17186 19792 32047 51800 79026 64588 6708 -19978 -27034
19150 -27034 -30080 20729 22817 2606 20898 31856 30900 4495 -490 159 3314 9508 -26777
19137 -26777 -59349 -31747 -17172 -39619 -73954 -54300 -20861 -31582 -38289 -33520 -30241 -3366
19125 -3366 -5753 9591 15883 7238 2424 8708 27446 9402 2724 -7988 -291 19483 22018
19112 22018 16474 -2011 -10679 -31259 -19539 -7380 -14748 -28400 -38158 -5869 12097 -1754
19100 -1754 -15501 -9131 -6021 -15866 -25416 -40705 -10826 -2801 -26424 -41806 -19941 -37690 -70095
19087 -70095 -72670 -54422 -18741 41258 63602 53807 37979 11584 17481 2008 -17543 -5712
19075 -5712 11452 31330 13515 478 -6170 3708 -31085 -37217 -50703 -50392 -13818 7831 21753
19062 21753 1653 -17926 -5926 -3380 5532 8747 -17312 -5601 11489 1706 -9068 -14026 4907
19049 4907 9408 13243 8666 -27861 -14668 17586 23349 -153 261 25702 24596 38904 47082
19036 47082 54579 46885 21914 -15973 -36428 -18780 2529 26255 21959 12501 870 -5567 -34314
19023 -34314 -42633 -45710 -34316 -37985 -19163 13178 22102 21692 19337 30898 34504 60964 45388
19010 45388 40497 34658 12293 4403 6441 -13025 -16955 -19072 -29542 -24658 -18717 -2819 -12418
18997 -12418 -21798 -38365 -52413 -46559 -22756 26018 15314 975 16676 30831 22304 11032
18985 11032 4279 8970 27108 -5249 -24117 -1932 16504 30511 24235 26457 5608 20908
18973 20908 57402 41284 9548 1547 -4101 10294 23541 11784 -18473 -28894 -36859 -25790
18961 -25790 -5295 7664 15770 16702 22882 25326 20572 -5032 -32171 -15775 9817 -3933 -33635
18948 -33635 -37614 -42177 -43077 -32253 -21879 3440 4519 10175 3468 -5571 -16370 -25355 -37179
18935 -37179 -4266 6115 -4122 42 -1933 2836 782 19068 3341 6718 27073 26317 8937
18922 8937 -16904 -9598 3527 2168 2775 4819 19388 104 -3169 3960 12593 10241 25363 16825
18908 16825 -13638 -28288 -30497 -24139 -2114 12351 15556 15118 -4689 -10870 4826 23641 26567
18895 26567 3420 10990 20639 25634 25033 3898 28552 31473 367 -14985 -18363 -14965 9563
18882 9563 8137 12326 7248 6329 -4990 9700 15328 -3912 -28763 -41183 -48423 -29326 15885
18869 15885 9193 4630 16165 32568 42789 5533 -15985 -33385 -32305 -20602 -2444 -5502
18857 -5502 -24697 -35049 -34156 -31996 -34414 -41806 -41445 -47005 -35085 -25725 -13140 267 -1390 -29807
18843 -29807 -19039 -2305 -12105 18396 47790 32281 30856 27496 1952 11730 44590 20858
18831 20858 33680 22151 7832 10104 -7334 -8269 17746 -2791 -24585 -9172 -36217 -51718
18819 -51718 -14824 -7885 -4012 12722 21877 -9017 -26726 -19773 -13191 3019 -10116 -31919 -40210
18806 -40210 -30880 -39229 -42548 -19397 -31805 -4148 -8281 -2708 13226 11088 -21090 -21969 -18747
18793 -18747 -24638 -20882 -20950 -23179 -1802 15832 21835 28376 29903 46842 66378 71562 61419 49626
18779 49626 41068 32458 28310 25751 40653 58381 83682 100667 102399 118320 168350 209955 255240
18766 255240 246927 174502 119055 61292 18141 18652 48519 43919 13269 7989 901 -12635 -10207
18753 -10207 -2811 8079 -2118 -18827 283 14122 11375 -4087 -3910 231 8531 -3640 -2356
18740 -2356 2663 8133 16539 16017 -13924 -10477 16 26499 29769 680 -15285 -11662 -20662 -32355
18726 -32355 -21407 -24429 -13039 -26735 -43570 -27611 -14382 -8691 9675 14833 -3482 -5920
18714 -5920 32028 53168 41274 14326 7813 27569 3004 -36132 -28174 -27086 -11313 4049
18702 4049 25311 38438 26028 17060 -3538 -25949 16172 35713 16245 17236 37934 32622 24511
18689 24511 9584 5268 3919 18143 12916 4243 7073 15134 26906 35949 33496 33605 33392 16477
18675 16477 -11045 -32383 -11240 5637 -3359 -13854 -4985 -9388 -12414 -5561 -3914 -25533 -12503
18662 -12503 -14271 -16288 -25223 -43027 -34159 -30107 -38214 -44875 -32818 -26610 -29072 -38377 -7172 19819
18648 19819 21497 15845 27628 17547 -11841 -25313 1073 23384 29890 32915 31277 -677 -16029
18635 -16029 -11726 20723 36701 29044 41457 46389 35878 34012 12008 2925 10 -20636 -5450
18622 -5450 13706 33057 29314 43860 8107 2834 -2304 -23509 -13467 993 -255 4468 -7232
18609 -7232 -26550 -10548 -22124 -55115 -42736 -41615 -23819 17826 52044 56409 55841 65441 74493
18596 74493 33041 5153 -366 -6442 20647 29806 50025 76406 62704 23143 47132 45752
18584 45752 20226 17396 30942 -8034 -37723 -30605 -52210 -55483 -26542 -25831 -20490 -20974 -25375
18571 -25375 -32632 -37845 -11895 -5587 -7756 -27726 -54103 -50783 -16873 16451 20566 15822 26697
18558 26697 38785 28852 28808 34491 14269 31454 46356 12283 22967 15754 10789 39084 37049
18545 37049 39599 35626 5978 -29942 -22234 -2685 13565 -5092 -13061 -105 2823 -1634 -9145
18532 -9145 -9556 -17342 -36197 -32416 -15668 10189 30847 13664 -3332 -7030 6721 12625 5101
18519 5101 6801 19504 13641 -11299 -13700 14622 42110 39504 16480 13648 20411 18660 37114
18506 37114 49572 14027 1701 -6143 -21561 -15845 20465 34323 37860 14636 -12737 -8823
18494 -8823 4975 8932 22019 -4225 -4252 -1246 6766 4354 -6903 -11519 19953 32847 20692
18481 20692 16934 36640 47197 38777 15901 -7368 -7490 -10357 7375 25994 22640 1554 3749
18468 3749 2659 -14743 -8473 18245 10108 -8034 -7832 1488 3526 -10705 -20659 -20588 -46320 -77087
18454 -77087 -73225 -30739 -20449 -16763 -6054 15769 -19900 -30274 -9903 10572 13181 8944
18442 8944 6590 -15447 -7468 21242 58826 49711 30054 42149 67633 37388 -14409 -529
18430 -529 10150 -8982 2758 2790 13177 8628 25438 35789 32618 48709 62074 33460 15133
18417 15133 -14618 -6302 15415 26042 13060 -12253 -44978 -40954 -32096 -31499 -47710 -59995 -49184
18404 -49184 -11378 21175 13124 -7727 -59019 -60140 -33330 -39727 -19552 -9428 -24149 -44290
18392 -44290 -34813 -20016 -14353 -20883 -30970 -20864 5968 18392 26767 37173 13035 -20037
18380 -20037 -28886 -38898 -8534 5147 -18546 -7998 14879 40095 42829 35555 24815 2379
18368 2379 -3050 -21342 -31830 -5335 9749 25606 26801 10135 -12731 -20158 -2675 14354
18356 14354 -2309 -1990 -2434 12316 31030 55477 49575 20665 19194 32291 21435 17423 8514
18343 8514 -11799 3513 5279 13261 33881 20797 38359 38433 6285 -35375 -54103 -45295 -19236
18330 -19236 -11493 -409 8947 37382 27345 15691 -1243 -12864 26975 70147 60568 37240
18318 37240 40098 69365 79490 54111 27247 638 10610 21121 34209 52088 56049 65370
18306 65370 54998 65364 57445 28032 16560 17118 12564 16003 15475 -1430 -3723 -2114 13935
18293 13935 32364 32355 34717 36301 26036 -17431 1125 -8311 1839 20046 -3147 -7249 -6103
18280 -6103 32071 66524 41929 15261 15800 32281 43347 35735 5570 207 -14837 -11368 6395
18267 6395 19494 37568 41533 43325 46871 55032 31927 38563 47390 34863 32043 25821 44828
18254 44828 25727 23810 43562 40047 26006 21314 19206 29061 31064 13063 20295 53877 68594
18241 68594 66075 86662 95822 79384 41783 22891 61297 63145 32252 25656 45858 71328
18229 71328 55333 15636 -2259 7020 30613 27238 10811 15680 33518 34601 31880 16817 25252
18216 25252 35135 22687 26718 34627 20305 15076 12261 26553 22984 6155 -231 2473 12185
18203 12185 2599 -3612 19845 47321 69930 75930 65174 57259 43181 19799 30257 36235 44267
18190 44267 24285 3427 30510 63547 81314 87785 92409 96931 91558 87723 92163 94474 88833
18177 88833 78080 72622 63624 81471 68875 72547 57452 19647 6579 19576 52371 84753
18165 84753 78178 82774 101278 92267 88214 113203 108805 102867 97547 124859 155372 157640 170803
18152 170803 166919 175554 225762 248840 238779 234479 237416 235353 237295 233411 235740 266553 293065
18139 293065 310375 324485 353433 400035 426147 462091 501432 546352 576246 647378 769526
18128 769526 904126 1003669 1139610 1360803 1659593 2049815 2516281 2967004 3310116 3624839
18118 3624839 4062215 4676809 5535242 6699322 8343534 10811108 14857474 21033924 28973598
18109 28973598 38931111 46351846 38285296 23294869 13703343 8761571 6072165 4400845
18101 4400845 3303826 2603080 2116095 1695677 1394593 1164091 969575 825679 694429
18092 694429 619791 583025 530128 478240 429597 366444 349551 338053 310413 288638 275255
18081 275255 237177 207337 180813 172113 143478 124327 136465 127732 108898 114347 145392 152078
18069 152078 147258 125382 134308 105031 70594 89233 93220 94794 120608 94221 53443 51666
18057 51666 61754 55413 62024 47913 29753 56452 83436 97705 89848 75356 50317 52592
18045 52592 67362 84454 114188 145782 134449 132956 129979 117332 91066 84353 66703 58251
18033 58251 61956 59114 52976 62734 34029 5505 -8858 -11456 -4255 14906 14958 17908 -183 -11735
18019 -11735 -24945 -32949 -11558 3043 8788 11885 -484 -17261 -13645 -230 12115 -11703
18007 -11703 -3739 -672 -4262 -5824 7657 24707 53411 57442 38528 11767 1114 8339 4532
17994 4532 -15438 -28076 -34346 -7936 5897 2506 30565 37053 30508 54640 84079 98876 123624
17981 123624 125187 135448 116363 88038 64225 73051 88679 118487 128832 105272 83739 101845
17969 101845 112005 97718 115330 123497 110300 84891 39966 20667 5922 29826 61310 47246
17957 47246 42098 46574 23831 12759 16457 27803 54755 76898 101564 102131 92092 71871 38099
17944 38099 9734 -7722 -7471 -17594 2095 18803 13596 44665 29322 12813 63026 110166
17932 110166 112773 86520 43430 14416 9787 -6795 16123 55705 62869 91472 102386 89178
17920 89178 56923 51229 41780 36134 61387 87979 61880 9672 5313 -10970 -15144 11360 6358
17907 6358 1448 2372 31299 56771 53288 60336 47276 21143 19822 4012 -12799 -9829 3732
17894 3732 -17298 6844 28294 38077 20088 -11927 -20668 16893 37702 31771 36170 19595 12873
17881 12873 680 -17501 -34261 -35647 -18873 -16301 -8148 -7174 2388 473 -34744 -13152 -20208
17868 -20208 -13882 25805 8593 -21375 4086 -5843 -22519 -30000 -35752 -20077 3121 26767
17856 26767 30145 5991 -22025 -5013 27933 48489 47752 35537 18884 27692 29736 4071 8229
17843 8229 30931 14268 6675 -6623 -9791 6707 27506 29277 -6055 -50203 -39206 -27044
17831 -27044 -3665 18257 -112 -17158 -5749 -16889 -47446 -58573 -69543 -68223 -32890 10525
17819 10525 24294 11198 -5853 -20556 -13427 -26860 14103 16073 10628 -75 19221 24714
17807 24714 17921 -688 -24118 -34053 -30142 6382 -8290 -28464 -30956 -32961 -25970 -7123 28146
17794 28146 42803 8021 -24409 -39437 -26224 -32932 10618 3461 -29565 -17588 -13544 -38113
17782 -38113 -31050 -19179 -10319 -3311 -16441 -5500 58 16392 19477 33364 13928 -2904 24125
17769 24125 28260 29911 56521 58474 36732 58639 73013 60621 32554 11399 20556 34471
17757 34471 51396 49448 63716 74462 58843 22801 -10000 -1694 7656 -13443 3184 34247
17745 34247 43866 40096 54285 33057 16840 7074 12255 8507 -15781 -41577 -21791 -40517 -66163
17732 -66163 -69559 -51912 -24553 -1554 -34004 -46202 -47401 -22356 -202 5764 -9047 -29016
17720 -29016 -53997 -49839 -27327 -12076 -498 -17635 -32023 -15724 -19254 -17738 1536 3099
17708 3099 2740 11270 23557 22270 -2086 4935 9116 -15812 -13574 -1361 3438 -4706 -21134 -35415
17694 -35415 -31561 -12880 -9240 -16971 -20469 -28482 -17626 -16906 -11865 -14424 -4488 -7782 -17863 -37696
17680 -37696 -27780 -3699 15572 13301 -10020 -21515 6672 16276 17304 15584 8456 472 24681
17667 24681 4584 -18552 -20941 4732 11119 24069 21452 5458 12037 10367 8809 7356 3744
17654 3744 8393 16328 -1438 1820 18950 15294 22101 37875 28041 21068 38558 73814 68211
17641 68211 63104 67107 41166 26193 50690 27108 25471 -17178 -12337 -9020 -15132 -11334 -34241
17628 -34241 -38489 -34075 -24468 -1406 -20062 -19459 -8382 2902 9951 -14267 -27608 -11541 -30500
17615 -30500 -58338 -59999 -53653 -29730 -9657 -24770 -30098 -30752 -41193 -24138 -17895 -1939 -667
17602 -667 20936 4748 -1226 11469 -6377 -13540 -1480 -10604 -23556 -46317 -25332 -8206 -15124
17589 -15124 -52918 -77342 -36789 -16990 -23685 -34649 -24471 -30907 -38968 -16784 25518 -5234
17577 -5234 -6719 12262 6327 -18003 411 20543 24951 24472 32526 33408 11885 5606 -9657 -47170
17563 -47170 -66607 -43251 -38332 -12025 -5897 -16355 -24539 -27147 -23839 -18203 -17027 -29640 -19243
17550 -19243 -13962 -10810 -9545 -4152 -13137 -22452 -47631 -34388 -17576 -13302 -11073 8551 29
17537 29 897 18776 30941 28514 18175 13575 18339 13917 33494 61433 38005 -13357 -43051
17524 -43051 -70356 -74592 -40290 -7969 6729 11543 7780 6389 7171 -21167 -45959 -17104 -20080
17511 -20080 -23307 -17542 -19029 -3701 10017 20834 26741 25976 6688 -14302 -31704 -40097 -24644
17498 -24644 -2058 -13276 -22314 -7278 4014 3703 3301 -2289 6349 16057 11074 6482 -24200 -40314
17484 -40314 -24685 5406 19465 -13892 -67764 -57133 -51635 -16154 -25179 -44143 -25525 -17895
17472 -17895 -9131 -30309 -32835 -17552 -32842 -14262 -14442 -11285 -31017 -17717 -6486 -6566 476
17459 476 -35710 -43376 -26318 -8967 4307 -3679 13698 30701 43136 48791 60578 48352 52037
17446 52037 59092 58955 104623 181934 245719 261052 186166 117991 92958 94960 91206 80359 72584
17433 72584 82236 75305 70013 66617 46427 9487 -3993 -34915 -54794 -30801 -32861 -28759 -25596
17420 -25596 -15610 -21912 -13347 -27363 -23891 2181 10027 -8550 11696 10250 16119 19430 35791
17407 35791 48111 30873 30197 18263 3777 -9607 27440 47381 -7369 -3888 3654 3973 24090
17394 24090 37516 15413 9032 4537 -12197 -13202 -23040 -20608 -19833 3873 19699 16656 -4080
17381 -4080 -3255 11655 4452 -4318 -7300 11358 18901 53367 63881 49288 41340 23189 23694 11051
17367 11051 -14181 -32694 -34313 -27674 -32499 -32421 -30174 -7748 -2060 -7418 -42721 -55021 -56721 -30436
17353 -30436 -2316 20671 19411 -15554 -51320 -76606 -46706 -13845 -19859 13539 7948 1836
17341 1836 -9444 -1870 8796 -3355 -5323 4967 12336 -8452 -36526 -45743 -38934 -25152 -25957
17328 -25957 -34508 -52502 -30485 -38674 -33940 -34055 -38430 -20604 16911 18897 -4929 -5604 10777
17315 10777 5969 -8581 -2856 27394 52653 37352 30621 3017 -15919 -16724 -5597 12288 45065
17302 45065 47316 27314 25768 6953 753 -2784 14440 16504 11017 9513 20308 -720 -18541
17289 -18541 14698 23945 24126 4099 -7284 -15067 -13135 -22083 -34242 -26360 -24675 -4631 -29910
17276 -29910 -39747 -30478 8465 8400 -4083 9942 23450 24031 -5768 -5555 12079 -328 -21323
17263 -21323 -26608 -39390 -45105 -51207 -42636 -48168 -82378 -83875 -68306 -82320 -79135 -44581 -33304
17250 -33304 -13664 -3000 -15695 -18427 -20394 -23399 -25727 -23107 4439 14535 6418 20584 -10129
17237 -10129 -39743 -31166 -9004 -9126 -10983 2658 6567 -8308 -17800 -21110 -16322 -29578 -26668
17224 -26668 10804 16887 952 -18125 -17715 -31138 -43146 -64352 -70689 -38913 -19640 -8442
17212 -8442 -2309 1298 -2050 -9643 -32223 -49245 -44704 -29448 -16202 -28782 -19407 -8017 -22231
17199 -22231 -34143 -8198 15783 5824 6104 10033 18253 4529 2642 32462 12551 -8300 -29905
17186 -29905 -32633 -29192 -37046 -13160 -14387 -13831 -29667 -38428 -14448 -36759 -44900 -22313 -26456
17173 -26456 -10648 -5105 -3205 276 10162 31694 34345 26391 11991 -3246 -29512 -31085 -26100
17160 -26100 -26052 1110 -18518 -32808 -21072 -6493 -2901 2860 -13036 -23799 -24003 -26011 -32501
17147 -32501 -5177 -12077 -26354 -22490 -20863 -38693 -12693 13992 1584 -7635 -13805 -14561 -19811
17134 -19811 -23679 -4816 30927 21384 2258 -8839 -26702 -29517 -30723 -10721 -2435 -10708 -14925
17121 -14925 -15714 -9293 -7564 4077 16020 14999 16274 -20030 -35370 10035 9845 13740 15026 -2557
17107 -2557 -15313 -662 -1648 8130 -3465 -17108 -8141 -19954 -17860 -3901 -175 -11297 -26257
17094 -26257 -56012 -71858 -42449 -33996 -31695 -18794 14110 38948 33695 24735 2560 -4190 -1293
17081 -1293 7234 -14154 -34436 -41474 -36013 -22524 -18362 -10910 -28442 -51530 -35766 19273 40522
17068 40522 29494 -1120 -20332 -34318 -59845 -50913 -38701 -40223 -28546 -40853 -18024 -14950
17056 -14950 -23433 -29500 -40097 -21960 -6767 10825 -7738 -13781 -113 -15245 -27535 -6374
17044 -6374 20115 -1168 -19882 -32193 -31542 -52438 -38900 -5046 -14355 -22653 -32872 -52907 -50074
17031 -50074 -25986 -13120 -6258 7783 23100 8476 -18974 -45164 -54766 -25986 -8241 -553
17019 -553 13517 5647 -2071 1684 8366 31101 15116 3293 -8342 -22996 -40458 -59605 -53718
17006 -53718 -33747 -26712 13544 22331 20646 -1005 -15370 -15729 -15068 -7838 -9254 -31496 -33028 -1800
16992 -1800 16401 990 -2187 1300 -4685 -3511 -14809 7252 29893 29614 22527 19622 2822
16979 2822 2393 -8554 4537 -25758 -36758 -21608 -12376 -13235 -18951 -10014 9139 -19160 -50249
16966 -50249 -38291 -39955 -19556 15047 3643 -9522 -9293 464 -12032 -1968 9375 29140
16954 29140 8312 -16584 12100 2665 21737 18621 -11224 -12702 -3623 9375 -1061 -13091
16942 -13091 -14048 -14871 16539 25208 10945 -24599 -66858 -34439 -9108 -14577 -19679 -17310 -12254
16929 -12254 6278 15434 12162 -15805 -12213 5731 12172 10232 14170 -14041 -20789 1829 31791
16916 31791 42941 39083 42825 24593 10671 -3543 -22200 5929 19603 23492 -4942 -24398
16904 -24398 -11442 -9345 5899 1737 942 11082 615 -9401 11409 3531 -10977 -20170 -10475
16891 -10475 -8912 -922 17283 25742 40389 54914 45581 30447 35966 24030 34577 14762 -20575
16878 -20575 -27478 -10820 4775 -5374 -5838 19493 25917 5003 -11064 -15274 12290 8937 11968
16865 11968 1927 4274 -17700 -22485 4098 19404 20255 7190 -25893 -34844 1039 11359 29305
16852 29305 38843 19773 50843 53330 46481 19633 -13668 -18643 13996 18258 13384 -3184 -8275
16839 -8275 -10352 7838 23359 32900 38487 7873 -2641 20808 9073 -16496 -10464 -30660 -18169
16826 -18169 -16783 -38856 -41581 -28363 -22956 -11103 -16514 -21102 -4583 -1909 1041 -14859 -15463
16813 -15463 -28653 -57134 -63770 -50046 -38967 -33733 -31530 -23382 -20004 -30314 -32455 -17689 17261
16800 17261 34100 11927 -32507 -37861 -29256 -37329 -45331 -39403 -38785 -39103 -21422 -10435 -17023 -32011
16786 -32011 -41160 -35247 -18385 -10622 -9202 -3448 -20770 -45599 -11496 10001 5990 -4945 180
16773 180 -3570 -8262 4091 3715 -2476 -6250 -5021 -6387 -9419 4140 8053 6029 -10039 -21996
16759 -21996 6539 13847 12279 7011 -6486 -43553 -63816 -55825 -31016 -27982 -42033 -46827 -36255
16746 -36255 -25244 -53 977 13960 34057 16849 8027 -16016 -17059 -25810 -26733 -38006 -21766
16733 -21766 -2584 7986 9347 42252 29757 -6428 -50802 -46284 317 5464 -10343 -46819
16721 -46819 -57265 -43859 -15304 -13495 -6893 35772 42134 7039 -24343 -33029 -20297 -670
16709 -670 -10826 -22914 -9680 -22798 -17252 -4852 -8380 -9987 -9802 -6091 -10846 -51829 -86654
16696 -86654 -86504 -76753 -54420 -14342 -3221 4482 14144 1489 6764 -1707 -15927 -34712 -33860
16683 -33860 -36332 -41822 -61508 -65460 -38593 -16508 8051 26419 30020 4185 4555 3806 -9276
16670 -9276 -18551 -18345 -17752 -18154 -25846 -21471 -23243 -18184 -18513 -25525 -12579 -15897 -8154 14562 -9620
16655 -9620 -33037 -52688 -46333 -40890 -48834 -40276 -33809 -35232 -49900 -42633 -24536 -46269 -44870
16642 -44870 -23944 -22468 -23446 -25912 -32840 -18424 -5674 25374 33309 23976 36659 24891 28544
16629 28544 19578 6802 -4635 -13421 -28437 -45574 -38293 -19388 -1442 -6640 3437 12366 -6768
16616 -6768 -23598 -36213 -48223 -29838 -20703 -2763 -10720 4925 -15838 -12651 -3460 36330 42160
16603 42160 17291 4114 -15209 -11056 21276 8450 -7260 -29964 -31664 -639 6536 10784
16591 10784 38304 42845 14048 -14815 -7832 21288 7245 19271 33853 46276 4060 -30539
16579 -30539 -29182 -5614 -3825 241 13099 -1580 9933 4030 5834 -2361 -42063 -29857 10240
16566 10240 15907 3539 1505 -4880 -2273 -8045 -43429 -36592 -9372 20883 26090 13971 1773
16553 1773 25043 42926 26623 -2705 -24695 -1655 27617 34824 25888 6103 -633 -11113
16541 -11113 -14928 -21704 -22461 -31285 -15590 6938 21716 32838 38073 -3322 -19487 -36539 -26758
16528 -26758 -22894 -17412 -13578 -26400 -34920 -37040 -33172 -25139 -6313 -16734 -15241 9037 38322
16515 38322 22210 24068 27821 7990 11326 4571 -9416 5115 7666 30615 52380 23921 -7497
16502 -7497 -4090 -964 6798 25166 36143 27456 2252 -21230 -22590 -6506 -13265 -36548 -34278
16489 -34278 -47146 -43810 -48484 -57649 -38112 -32054 -25060 -7184 -17772 -30464 -33807 -29441 -13405
16476 -13405 10276 7650 -14564 4813 3161 -7190 -8865 12976 28684 20139 -1375 18514
16464 18514 6855 -17047 -28311 -36399 -12550 -828 7371 1632 -17834 -14428 -4437 31452 56412
16451 56412 40353 45209 64500 29914 -32310 -45587 -20321 -3960 6628 10507 -455 -23526
16439 -23526 -28879 -16458 -18897 -14818 1286 -12983 -14933 -18030 -12964 1593 -14301 -25130 -28945
16426 -28945 -46651 -54092 -60926 -48382 -32963 -43937 -15411 -4023 5736 12652 1986 18016
16414 18016 3280 -9450 -31942 -16393 -12846 7980 11499 5932 11653 24049 17313 6491 11395
16401 11395 19176 22002 6751 -24670 -19295 -40925 -62088 -51190 -28433 -5524 -10805 -27708
16389 -27708 -8273 -11571 2675 1186 -21138 -37196 -28918 -6318 -9211 13776 29300 -1436
16377 -1436 -28681 -3938 -10500 -17294 -16026 -12523 -17631 -6743 10679 15886 17000 18570 13759 -17194
16363 -17194 -11058 3496 17408 19856 -5879 -22865 -15741 2314 24082 11175 -15752 -5043
16351 -5043 7973 10353 41450 51083 41225 25401 50118 105077 122646 107292 91294 66917
16339 66917 36901 26673 29561 21034 10979 -3051 -8388 14552 37680 23578 36271 16147
16327 16147 -24339 -20158 -1790 -16229 -14628 5544 20851 5140 -21059 -22201 -17885 -8340 -2537
16314 -2537 -13599 -6069 5812 -13256 -57709 -51187 -21542 -7319 -18935 -27129 -19549 -20006 -4503
16301 -4503 27945 53463 29712 23714 22969 12157 24459 2867 -24774 -47495 -38503 15824 10381
16288 10381 -25639 -47017 -49004 -24767 -9285 -23897 -5965 11685 11899 -756 279 15800
16276 15800 22234 -3691 -20386 -13299 -13639 -4904 12476 11018 7224 7884 12569 -3759 -22275 -4757
16262 -4757 -27713 -17598 -13562 12338 20287 16797 630 12390 39170 7731 5854 5561 -327
16249 -327 -15693 -19447 -33792 -38491 -19799 -20839 -11406 -22904 -50638 -8637 25510 14744 -19446
16236 -19446 -15611 -3499 4134 16183 22345 21142 6515 -15523 -23556 -14674 -31632 -17264 -7706
16223 -7706 -4270 -22825 -13397 -2021 6005 -133 1127 -6379 16777 57048 65258 49282 39432
16210 39432 26603 14027 3579 -2505 -1907 11804 19129 5399 3532 -2446 -13827 -31107 -12851
16197 -12851 14738 11444 -12168 -32981 -42876 -20548 -5132 -17669 -3680 -12702 -17316 -38556
16185 -38556 -32007 -18220 -19926 -29211 -11085 -15158 -14983 -19776 -35490 -21065 -7243 28335 37087
16172 37087 11000 -9482 114 5350 21223 47372 54274 18807 12637 4040 -26399 -35601 -33491
16159 -33491 -8209 22176 26530 8411 12675 -2534 -9883 -3787 -1491 -2223 -11704 -27606 -31809
16146 -31809 -20163 3701 14586 -607 15178 -4353 -5275 -9239 -5681 -20156 -6118 10285
16134 10285 860 -13815 7449 10667 33284 43588 28797 -1729 18753 9815 -2352 -20449
16122 -20449 -23444 -13888 -28040 -23744 -154 -6168 -24330 -12004 -2420 -2544 -1854 -8614 1163 17973
16108 17973 21941 6435 -22949 -15417 21108 50700 27268 6478 -1813 20025 12497 -18111
16096 -18111 -24317 -25501 1892 14492 38725 35158 -12328 -25531 -13215 -9179 -3458 -39656 -36531
16083 -36531 -36429 -37404 -23772 -23356 2800 4399 20991 40798 35433 24010 -7466 -28427 -48120
16070 -48120 -43141 -29464 -22825 -31917 -36223 -19568 -19573 -30249 -49951 -43298 -21237 -3471 9767
16057 9767 -2780 -20089 -15422 -11937 2088 9382 5668 8481 948 -43231 -60693 -45580 -41266
16044 -41266 -19922 1405 29025 18114 10552 81 -1332 -14639 -26358 -33316 -15683 4709
16032 4709 13452 -1892 2543 19669 48764 37046 20613 10379 1201 -47321 -20176 22625
16020 22625 29535 45396 59792 25369 7048 -689 -10188 13406 20652 14922 -4786 -35382 -33973
16007 -33973 -15692 8441 40948 53609 27224 6759 25153 51948 28154 -978 1644 -6029
15995 -6029 67 16915 -11487 -32113 -24342 -31144 -26810 -12725 -18921 -6294 -16539 -32448 -63350
15982 -63350 -50675 -35033 -9791 827 -4158 -10822 2461 15835 7179 15972 23102 36028 32579
15969 32579 20647 10957 -9355 -27074 -31347 -21894 20776 -14501 -16646 -8751 -26815 -46103 -49146
15956 -49146 -46693 -38197 -8089 -2061 27125 53317 9597 -4015 -3710 -9775 3055 7637 22830
15943 22830 15461 -17247 -14773 -30228 -28639 -38822 -22883 -5722 11719 18907 6189 -15002
15931 -15002 -9398 123 -9452 -25902 -53756 -46108 -14862 -40369 -57379 -52445 -56756 -62042 -14752
15918 -14752 26324 23531 23309 1937 712 9692 11859 -10205 1007 -3139 -2302 17695 3554
15905 3554 -15540 -2717 -6591 -13793 -13634 -10290 -23841 -19692 -33730 -28217 -7502 -5244 1749 7751
15891 7751 5703 43635 67197 44989 36035 -1415 24347 47354 27275 2338 -8517 -38650
15879 -38650 -40335 -38905 -43008 -54226 -57379 -38291 -32265 -44279 -31136 1336 11484 -5298 8780
15866 8780 7763 6628 -3482 6642 37265 36901 -406 -29408 -43120 -31892 -10273 37079 75248
15853 75248 54819 23705 28787 899 -28302 -49765 -24410 -13264 -27112 -20407 -15844 -33860
15841 -33860 368 28777 -2650 -3792 2184 -6581 891 -3278 -15964 -13082 -2918 11924 14194
15828 14194 -1178 -12023 -4984 -13048 -34483 -38107 -17691 -4235 -10151 6033 14801 -1381 -23311
15815 -23311 -38735 -36081 -27077 -7454 -20282 -28288 -22539 -16822 -2610 -12284 -29229 -23844 -30513
15802 -30513 -32737 -40147 -28513 -23366 -31926 -35692 -23342 -13131 -20665 -42347 5975 41282 23408
15789 23408 10730 27048 35656 31504 48233 50214 28867 -5213 -9080 -8763 -2100 20793 5469
15776 5469 -7042 -34958 -54802 -54639 -55503 -42367 -28683 -39530 -34614 -34305 -43445 -47992 -56825 -30491
15762 -30491 -12977 19484 35422 4183 -790 -7095 685 31653 56464 66292 19204 -5510
15750 -5510 10199 5639 2880 -11220 -10341 -1975 -10080 -23499 -21674 -5738 6414 -8083 10113
15737 10113 20914 -2872 -14364 -17342 -15995 -6170 -11160 -31740 -34184 -24830 -29625 -18524 1692
15724 1692 14229 5560 -12371 -26031 -14609 -14639 -38067 -74327 -92585 -53554 -30351 -7723 14634
15711 14634 23105 17775 -6126 -14231 -2119 3499 -19490 -11580 1317 -6254 -18435 3688 -3804
15698 -3804 -19768 3128 -15105 -36845 -4723 13249 9454 -7011 -9435 -18705 -12192 24 -1877
15685 -1877 2858 43 9873 12106 -11909 -25215 -21794 -14655 -44699 -58376 -56901 -32446 -17842
15672 -17842 5444 32636 8269 -20155 -21656 3703 35498 47972 49422 19956 6456 -7145
15660 -7145 4038 -17435 -43519 -21868 -19070 -28715 -28727 -34216 -26253 -12317 -24709 -37936 -28216
15647 -28216 -21435 -30420 -31852 -32372 -31718 -40061 -23254 -15709 -2317 6396 -11745 -20667 -16451 -26722
15633 -26722 -46642 -43210 -32576 -3260 29754 30981 22240 10521 -14467 -4111 12447 29213
15621 29213 18210 5350 -1020 -18596 -10217 30528 29907 25394 -1522 -16964 -22559 7656 8273
15608 8273 -7733 3658 18639 7022 4626 -19329 -36251 -24090 -25020 -2600 -19685 -9652
15596 -9652 13754 16477 24684 14743 -14618 -31947 -19137 -2361 12922 12967 -4437 -13282 -5863
15583 -5863 953 7804 6830 17256 9084 -11577 -18187 -15411 -37167 -57870 -36220 -34153 -11879
15570 -11879 -21125 -30194 -29819 -25180 -14125 -49227 -85657 -67948 -41898 -21558 -15698 -21399 -36849
15557 -36849 -57196 -35653 -11378 3241 5381 15652 16572 32275 43175 53119 50578 38300 36258
15544 36258 11916 -19238 -16889 -2216 -130 -24545 -2470 11649 -539 -10404 -19016 16395
15532 16395 27645 24707 46569 43380 11235 -4497 8040 -7424 -35020 -49452 -30943 -10560
15520 -10560 -20139 -42851 -53522 -39607 664 442 -19353 -19541 687 31341 19623 -8875 -976
15507 -976 14764 2752 -11878 4034 -14142 -43270 -60022 -31304 12224 13805 15645 -11849
15495 -11849 -27010 -27731 -30393 -29810 -7755 -6089 10851 15641 12396 -2606 -19035 -15613 -2711
15482 -2711 -7151 -28911 -51526 -39866 -10635 42 -1798 -18601 -26574 -5450 1749 -10561 -3767
15469 -3767 4165 25435 29462 19878 5867 -5465 -15542 -40483 -52250 -13776 -9194 -33559 -15978
15456 -15978 5035 -2640 -24340 -27368 -7852 4678 26951 47527 65124 40027 15902 1408
15444 1408 -3552 -2112 -22075 -37047 -23018 -13363 -15993 2084 7080 29154 25953 -11112 11868
15431 11868 31560 23596 887 11012 26406 -2199 -30453 -8393 6922 -9811 7824 8088
15419 8088 12700 18191 23092 -2008 1047 12744 27535 38013 32238 31215 19207 11790 -786
15406 -786 -7761 -11010 -6581 -20240 -8751 -18443 -21491 -6452 7139 -11934 -20035 -33258 -43610
15393 -43610 8146 43636 36916 15871 6744 -4577 -9039 -3460 -6172 -28957 -42437 -52812 -70454
15380 -70454 -58811 -25595 4838 8720 -2875 -16228 -9360 -16964 -23585 -9273 -18006 -55214 -36491
15367 -36491 -22226 22366 16824 -21493 -32729 -38887 -16746 -9954 -13548 -12558 -15678 -10924 -10715 -2281
15353 -2281 9528 28237 24053 20493 22773 2866 713 13828 22826 36524 26433 10756 1123
15340 1123 -12355 13091 9718 8056 -15898 -39729 -44822 -50849 -11915 -91 1169 -19317 -28159
15327 -28159 -23694 -34532 -22637 -22191 -31410 -53723 -32771 -14368 18356 7961 -32126 -42277
15315 -42277 -53706 -54921 -54646 -69407 -53403 1623 14021 11109 -4492 -28889 -36608 -32958 -8227
15302 -8227 -5518 -9295 -27561 -32952 5368 17657 792 -3516 6357 21403 9584 5368 -2600
15289 -2600 -15054 -30966 -20347 -12010 10603 -3724 -4941 -2164 -8235 -27985 -25055 -7487 21014
15276 21014 28318 3282 -7445 269 4704 -8186 -25771 -19339 11164 18215 7843 -13964 -21475
15263 -21475 -12356 -5629 -5070 -4027 -14003 -7508 3559 2828 1772 1669 -6437 -4433 23696 24308 -12362
15248 -12362 -44350 -36722 -980 5465 -4847 887 3908 -2011 -9869 -11129 6670 17698 11318
15235 11318 5070 12535 1549 -1537 13138 32804 21929 5644 11764 14384 -26059 -13448 -2107
15222 -2107 510 21520 4534 -12886 -22915 -28635 -31143 -17143 -12441 -44820 -47728 -54686 -52999
15209 -52999 -48621 -60628 -52566 -43853 -25856 -30651 -24142 -30806 -49517 -50113 -30932 -9193 -20501
15196 -20501 -26969 -28867 -21494 -4420 -5169 -12864 656 11115 10141 -8421 -9331 -13518 -26285 -14857
15182 -14857 -12926 -11648 -20690 -37695 -24568 -25975 -24431 -11098 6454 -14423 -40509 -38751 -29715
15169 -29715 -1657 -27894 -38226 -6740 23148 24216 -12175 -42920 -46175 -42383 -31599 -28731
15157 -28731 -32416 -29658 -3966 21462 17485 -706 -12310 3009 36529 27204 -16637 -29287
15145 -29287 -35715 -58130 -73283 -44933 -13063 -22631 -14341 8719 11478 -13140 -41834 -26472
15133 -26472 -3670 -10573 -21142 -6046 -7904 -4732 2291 9203 33747 30958 11426 -14629 -38025
15120 -38025 -49231 -31041 -40250 -43210 -23107 -1905 -23509 -59979 -52966 -47120 -46344 -35114 -5135
15107 -5135 -14406 -12809 -14164 -30320 -7187 -16054 -31712 -23233 -24163 -25094 -12824 11717 37549 51377
15093 51377 47259 45207 39296 21821 12498 11784 7297 14352 -12899 -29811 -34749 -32714 -31055 -3899
15079 -3899 22460 11512 22770 28850 15045 -5652 -13802 -44886 -30847 -20799 -34996 -40098
15067 -40098 -45956 -34990 -16849 13159 -5347 -12978 -9728 -11378 9029 18141 6251 20247 42101
15054 42101 36188 10992 -17288 -19718 -41148 -40208 -9414 -3983 4962 15827 14805 -3981 -8275
15041 -8275 10835 21913 49692 26618 25376 43116 32564 -2842 -10434 -21502 -18978 -20554 -30871
15028 -30871 -54655 -27260 -14008 -40674 -19736 -32803 -44986 -31676 -1814 8537 20986 4408
15016 4408 -1261 -1589 -22258 -43024 -37470 -25345 -12952 -11039 9967 26840 -856 -8645 6472
15003 6472 10205 -3658 -2059 -1968 734 -6036 7011 19585 -2709 -29498 -44618 -26842 -973
14990 -973 30507 19620 23347 13327 -5455 -4315 10707 -20583 -25608 -11832 -13572 -25309 -13983
14977 -13983 96 25263 39396 31393 18392 23106 -8917 -19289 -20750 -10724 6162 6480 11636
14964 11636 -4469 -240 9764 917 5829 19838 6797 16498 30963 17679 22180 45441 48068
14951 48068 18608 6536 35098 39500 46833 39881 33744 20296 4192 -15444 -29458 -27240 -11709
14938 -11709 -41364 -42160 -22113 -15195 15630 -4882 -43392 -60113 -41873 -7915 -2445 -10782 -13282
14925 -13282 -5819 11293 16225 10208 -26949 -23488 30518 21070 -3111 -15298 -14828 8152 -675
14912 -675 -15445 -39949 -46769 -29242 -29054 -33246 -38372 -37771 -33295 8749 6566 -20332 -43112 -33950
14898 -33950 -1324 28713 17708 -3366 -12760 -25338 -18397 -9105 -3799 -15715 -23705 -36955 -50165
14885 -50165 -25725 -18966 -19815 649 13494 11925 -15525 -27009 -32122 -26311 -19506 -33989 -49865
14872 -49865 -50429 -35983 -31117 -39542 -14529 20191 19257 33995 20017 5507 -7921 -3073 -19850
14859 -19850 -27017 -36 -14124 -36186 -38254 -36563 -3660 9934 -15508 -17065 -28480 -8019
14847 -8019 32356 39717 22492 27183 12866 24436 43619 46445 24876 21834 19585 34332 20384
14834 20384 12220 -17940 -27859 -6162 5323 12841 -4204 -12618 3232 10611 39176 35298 49574
14821 49574 46295 35032 28702 29589 11888 29035 32286 9736 25278 47687 56948 49740 35454
14808 35454 10332 -14943 7063 5992 -825 11410 5443 -9385 -9700 -17508 -18604 -27533 -32686
14795 -32686 -29776 -7568 -12664 -24847 -12709 -23689 -18756 -22097 -35893 -54296 -57114 -44861 -1489
14782 -1489 20271 -7155 -50531 -46921 -10712 12062 20200 -4019 -30412 -21950 -17547 -1838 26907
14769 26907 41339 44416 32108 -615 -21423 -1738 15912 14317 -1650 9250 -504 -3397
14757 -3397 29707 42641 32056 13991 16814 18381 5659 -10722 -11431 -18071 2995 18430 -7888
14744 -7888 -27348 -11655 -7657 -31252 -12164 -2892 8017 -7069 -45812 -50201 -84020 -84247 -52879
14731 -52879 -60124 -45230 -17635 11427 13884 4795 -14848 -16536 -21191 -41661 -38654 -17461 14691
14718 14691 37584 52725 30601 28323 36641 27067 18048 15696 -3952 -6470 -19050 -2085 8964
14705 8964 -11100 -14016 -14373 20219 34779 24706 1083 -10625 -3892 -25403 -20420 -18961 -36270
14692 -36270 -28046 -28114 -26637 -31961 -40339 -51101 -29622 23591 24740 1391 -22364 -12358 33261
14679 33261 63611 60649 44412 33383 4820 -25991 -16783 -10301 -34164 -35296 16065 14662 -10414
14666 -10414 -18441 12283 33578 25088 5601 -7465 3698 25156 28853 44050 20966 14046
14654 14046 12879 -5404 -36184 -46647 -50901 -26412 9613 4678 31471 31107 18070 23529 22616
14641 22616 45 -28818 -36326 -20619 -35972 -26949 -11547 12226 13182 -25301 -22329 -43384 -54315
14628 -54315 -41143 -39086 -57117 -17409 12513 -5621 -14165 -12713 -18823 -16173 -15174 1039 39107
14615 39107 42770 26006 24525 48858 33900 45799 10076 -1755 -4112 -5199 -2809 -35322 -23328
14602 -23328 4655 7461 5183 2839 13855 23362 27910 12245 14715 23273 23666 19778 19684 23787
14588 23787 2066 -2707 -30466 -25383 7281 7853 22601 42504 33608 5518 17915 9842 -7510
14575 -7510 9034 15707 -12545 -11058 -20323 -40099 -43657 -30145 -24075 -3873 -17111 -32267 -37219
14562 -37219 -63231 -79733 -79444 -67161 -37175 -11098 12543 -1856 -11999 -16885 12145 22830
14550 22830 41905 55243 56909 42482 40291 29183 1563 24306 55887 14617 -8498 -21428
14538 -21428 -13772 4958 -6494 -15733 -3500 12716 -3178 -38654 -60849 -58460 -45706 -36085
14526 -36085 -18415 -8392 -17556 -8471 19899 18371 21958 40994 37379 24447 29445 13074 12201
14513 12201 25294 7329 13635 40018 30275 8181 13869 15531 15234 24052 20546 11562 -59
14500 -59 6980 -14437 10095 25525 34179 27149 23316 29876 40050 19034 18381 -3577 -35384 -21919
14486 -21919 1083 4904 -8447 -789 28690 54735 76229 97461 69803 58090 69698 43919
14474 43919 40906 34071 29870 5695 20468 6968 -3002 26453 15418 -33843 -28816 175 -6662
14461 -6662 -12581 2066 15628 19807 14008 -25215 -29075 -38771 -29688 12688 34217 20631 -13327
14448 -13327 -28356 -52092 -49207 -42863 -37165 -41352 -53952 -81551 -70344 -56479 -40278 -18809
14436 -18809 4263 6328 1141 17032 37361 15574 -677 -23512 -11356 5275 13546 28965
14424 28965 15604 16161 -6918 -12060 1224 -8110 8232 13282 11618 7720 -1299 -18797 -29268
14411 -29268 -20521 -2014 1748 -20994 -38246 -42704 -23254 -10817 -9845 -93 1455 -1821 99
14398 99 -6023 -15292 7324 -2830 -8236 -8067 -5555 -9713 -6162 -12350 -5106 16234 5321 -6052
14384 -6052 3679 2974 8250 15343 7981 6094 367 18764 32008 53231 59016 65921 36738 7174
14370 7174 -913 -1370 8225 18864 14792 -2478 -9011 7930 6787 -17625 -19155 -9427 -19691 -6741
14356 -6741 -22658 -32172 -38282 -33832 -17976 -22219 -10542 2331 -15875 -38045 -42421 -48942 -52847
14343 -52847 -48876 -38075 -36577 -20466 -4643 14198 6421 6189 -1063 -13544 -9174 -285 12367
14330 12367 -4838 -16050 1361 -5722 -12898 -14181 -23542 -21453 -14697 -19339 -40153 -32294 -30190
14317 -30190 -46315 -42144 -19458 2647 22467 39378 12190 -2296 -13888 -19320 4866 21856
14305 21856 1033 -10734 8362 33509 36659 17093 16651 38933 46289 26791 23360 -24148 -41704
14292 -41704 -26559 17841 21263 18562 -4413 22441 64757 40599 3447 26601 40667 41823
14280 41823 31779 3978 -31340 -11632 241 16463 18487 1066 -8587 20698 21289 -19340
14268 -19340 -32973 -20659 -21673 -13862 -27373 -48050 -13365 23566 13672 13472 -6090 -17549 -10686
14255 -10686 1221 3413 8191 6350 2954 -11509 -2984 27003 34195 33499 25830 16932 24067 21451
14241 21451 1489 -2102 16957 -1441 -11418 8231 -8656 -9096 -5570 -3765 10397 32592 37778
14228 37778 11429 7276 22381 28700 32147 29043 8472 24124 20586 33256 34092 13149 -12832
14215 -12832 -16442 -11020 12270 10583 13881 36391 26067 -144 -10168 -13176 -3828 12085 7872
14202 7872 -1375 -21372 -26713 -17014 226 25613 42511 39357 5406 -62 26426 20005 33933
14189 33933 40914 9083 -24883 -24837 -9420 2012 10880 13480 10445 26983 13305 15496 40246
14176 40246 37406 876 -14605 12259 31227 35723 20913 20481 6447 -1466 4773 -7067 -27955
14163 -27955 -7044 20022 21534 19351 12802 12444 25099 20234 -13043 -30842 -3306 19925 -575
14150 -575 -45287 -28219 2006 -5282 87 16941 14734 399 6577 12330 34746 17739 8489
14137 8489 18850 4962 -1733 -8713 -16061 -12746 -20437 -37856 -57675 -44079 -38428 -43403 -17187
14124 -17187 -545 -414 -681 -2602 -16005 -20441 -46033 -41966 5615 28388 -4225 -397 21714
14111 21714 44400 47696 44237 32724 38052 45137 76976 77335 67182 31204 14087 30326 1436
14098 1436 -7453 -3983 -25643 -17016 -25590 2022 -6668 -35099 -31197 -20026 -13276 16545 41600
14085 41600 28857 -3633 -23724 -23943 -2869 4336 15042 12345 11343 -5736 7826 7656 -12624
14072 -12624 -38392 -49603 -34357 -359 2108 -7000 -9095 -6871 6635 -20223 -31917 -22148 -20671
14059 -20671 4117 16762 6617 5913 -8487 20671 34215 10239 15170 32337 29464 25313 28268
14046 28268 39539 50117 49206 37935 42338 21627 -17536 -27511 4015 35848 61883 54268 34482
14033 34482 9102 -18621 -9231 2411 4430 -1682 17362 13227 16457 43610 25325 11709 20091
14020 20091 23720 19281 35579 29921 17838 6934 -19602 -27020 -17477 -3755 17865 31860 33493
14007 33493 35281 38100 51278 46465 4348 -8310 -7448 7550 5185 10530 37900 42139 30748
13994 30748 12736 11224 20718 26660 -878 -14132 -18432 -28412 -25364 -6148 11121 29504 50419
13981 50419 48108 -3142 -12153 14930 41314 25095 10693 18086 23577 42541 37874 41648 49540
13968 49540 20371 3694 4483 900 41514 59253 43242 29564 23644 35817 27641 3446 17004
13955 17004 12541 -14774 -44263 -25479 -20163 -22033 -4202 11677 29078 10280 9960 -4262 -20581
13942 -20581 -14663 11881 23291 22217 34131 43721 28603 1325 9903 29664 28729 56209 44747
13929 44747 35650 25393 20693 9299 -5236 -9242 10896 47078 58890 42588 6594 7113 22210
13916 22210 35663 22998 4265 -9892 -4627 12045 4293 -12801 -15824 12166 7170 -19799
13904 -19799 -12987 -9917 -6048 -8003 -8080 265 -6065 23929 16096 28212 50123 48108 55295 32478
13890 32478 48141 42582 18986 22894 17465 -20515 -19593 -17334 -2269 3696 -19306 -39160 -3901
13877 -3901 -2139 13024 29785 22596 25199 44162 63210 81745 76783 35343 10274 -5018 -16014
13864 -16014 -9856 11563 8623 3242 -798 -8119 -2525 -5365 -346 12758 21674 4007 -22665
13851 -22665 -873 9768 19475 26117 13334 3070 -11263 -1121 6439 5913 36861 38649 28464
13838 28464 14625 35734 56243 40448 14572 28291 12965 15473 34339 24853 9293 -9046
13826 -9046 -3809 29653 29555 46107 43414 42057 47057 52524 11588 10733 35925 24106 7198 -322
13812 -322 5673 26583 7601 -2742 11884 -10454 -24703 -12199 322 -7508 -597 12207 37885
13799 37885 20526 -11538 -13408 -14422 -16887 -593 -4105 6456 26872 33536 37151 24890 -1891
13786 -1891 -9117 -17714 1206 27668 10716 -13417 -1644 -7979 -19370 -29106 -14902 -28364 -27106
13773 -27106 -13030 -6179 -17127 -15837 -2062 17109 -15977 -24029 26180 55334 37981 128
13761 128 -767 11141 17275 24842 59944 73097 53565 27361 13570 17576 38552 54983 37101
13748 37101 24770 12953 2859 10505 54274 76161 40938 3469 -3455 35259 35269 30015 42992
13735 42992 49227 49780 71335 68368 59239 67377 76536 97844 86636 74536 72095 47224 38718
13722 38718 6428 1258 42836 59061 53201 20165 16413 26286 39640 35558 30985 27849 23280
13709 23280 24321 35883 28684 45153 44332 49720 40750 13332 10704 -7545 -4841 -9628 2707
13696 2707 -8277 6670 20714 -2086 7133 18167 6921 -6570 25274 17134 30745 15706
13684 15706 12167 -1951 -16073 -29496 -6916 38550 52431 43677 35807 45085 54675 44726 14923
13671 14923 -5252 11314 7560 11830 13906 21199 23004 2182 -23195 -33306 -25430 -41237 -17981
13658 -17981 -16030 -14353 -29384 965 832 -872 2470 23579 35226 22690 39038 52493 43180
13645 43180 56350 82391 83751 76902 56333 23756 2118 -8555 -26169 -47991 -30360 -7592
13633 -7592 -28359 -23790 -26269 -8013 -8160 -2701 971 -221 -14324 -10663 -10870 8336 -15301 184
13619 184 38927 56025 40475 33219 51065 48111 44269 25504 43945 83770 123468 151218 168184
13606 168184 163852 164393 162222 143986 125286 100694 76467 50723 28971 46380 58486 57047
13594 57047 39864 42425 26961 -2073 -1109 34356 70158 80415 63986 47403 37335 44247
13582 44247 48481 41971 49699 58797 67831 40968 37035 37543 35291 27383 43148 65618 58672 54494
13568 54494 27651 17702 30411 40053 36444 5076 6961 29549 28066 29364 36813 55620 54321
13555 54321 41464 46835 33281 1139 27584 56305 55627 39563 48545 52334 58596 35280 19453
13542 19453 24306 28948 34879 43206 54226 39688 37772 21123 21107 31302 28324 24283 13243 19227
13528 19227 5755 5970 20071 31915 26636 42088 52742 35204 -7221 -13474 -742 -334 28970
13515 28970 40162 36043 26706 29547 -5869 -1543 23019 13943 -16986 -22180 6381 26011 24968
13502 24968 16260 13453 17443 10576 -13703 -3618 7884 8222 14321 11988 -5348 22075 21272 24902
13488 24902 30245 29896 -2300 -2016 654 16985 22972 38418 23324 3486 7314 13181 14539 4507
13474 4507 2437 5227 2365 25279 12722 9488 29536 28297 34612 43621 49070 32059 50221
13461 50221 65741 62879 47165 80269 87229 92589 62686 31675 38149 20696 -10810 -9875 9783
13448 9783 38914 47221 42719 50995 35614 38486 43563 33999 30571 42860 40241 48998 46362 35457
13434 35457 38620 29090 24664 20481 26049 31567 40433 31869 43167 70471 70627 59956 66270 63299
13420 63299 67414 60633 62704 19548 4545 27033 41160 47328 60213 55159 85595 74510 47000
13407 47000 50551 53593 66778 63429 69390 96355 98437 87002 80625 83761 76358 56153 67721
13394 67721 103489 103010 110356 145481 170919 201779 250449 272960 293672 330549 347235 332037
13382 332037 320158 343221 342341 331458 368804 369913 338957 338694 349208 358489 353823 330081 343714
13369 343714 375260 381424 369328 363922 349750 346735 309235 271725 243433 260264 250537 270796
13357 270796 304530 325164 333787 366375 371915 372290 367473 362014 379505 368049 387903 383146 366339
13344 366339 384601 360880 321959 298942 321347 304337 278630 252335 226677 192538 156820
13333 156820 152165 165651 177870 184270 182767 155935 131633 123921 130249 162612 166331 182318 204114
13320 204114 206607 213790 233327 264952 265985 305325 316047 317111 348918 391938 404537 409437
13308 409437 419803 440995 443822 425670 429005 440685 452626 436213 428122 431940 422038 421635 412510
13295 412510 395829 416055 405185 386244 355401 348608 348284 359832 355045 353389 369569 378024 375648
13282 375648 376288 415978 419292 454274 459675 438384 453255 438221 425670 423472 401641 401575 378168
13269 378168 365839 366516 343325 314347 269209 228282 226197 187053 161292 128721 120166 146609
13257 146609 133624 138631 140703 128500 104452 89999 73440 58903 54049 85154 71939 68591
13245 68591 58328 68818 92107 81028 64690 46005 33805 22783 18729 47939 63503 66083
13233 66083 64447 87013 75571 94472 115679 76489 63958 73126 72404 72316 59751 44231 37519
13220 37519 32683 40901 80730 87980 82701 73666 91663 113122 135449 102969 104221 107262 70374
13207 70374 82737 92554 105067 84139 86275 93022 115553 113539 73599 93730 96055 101340 116130
13194 116130 133110 123132 100073 123952 149628 152394 142530 143465 145095 152632 208715 236610 227021
13181 227021 190512 158940 159834 195348 212155 226519 250101 274580 286219 303599 329862 355727
13169 355727 415688 434946 467731 531454 615011 696102 787263 907668 1065001 1227684 1462302
13158 1462302 1722389 1963759 2073643 1997190 1790377 1531958 1304205 1128915 986914 898970
13148 898970 823449 753184 730587 695290 661188 639875 613732 607164 578170 576144 575107 581612
13136 581612 593203 627392 649410 677105 707320 735395 770289 847859 922199 981273 1046593
13125 1046593 1118957 1198316 1332234 1483982 1660194 1928839 2331000 2789668 3304859 3796749
13115 3796749 4048553 3940931 3509217 2879488 2268678 1791391 1502572 1324149 1189766
13106 1189766 1091455 1061804 1011562 935786 897230 851454 819093 794525 780312 772573 756709
13095 756709 768624 819800 813352 831248 845279 876637 898793 927481 980774 1010548 1081543 1136930
13083 1136930 1191484 1236151 1303615 1408784 1503388 1591173 1698220 1762638 1817990 1781710 1667500
13072 1667500 1499318 1284618 1062620 872092 726502 638192 559319 506838 486577 447245
13062 447245 427724 400552 377322 370234 366841 356801 361256 360271 327571 308334 322496 335932
13050 335932 321388 300854 280689 295542 298968 293751 297092 286989 291336 299086 299198 290852 291175
13037 291175 307888 332472 308927 301571 318445 316045 318261 327174 358669 384310 382019 356321
13025 356321 340187 338884 335319 355753 337160 334844 341276 337464 330732 325556 328445 307661 306844
13012 306844 329442 329356 364445 393060 421547 414755 415752 404825 418890 413422 396951 419416 433158
12999 433158 431802 443225 459519 495493 527488 533223 544856 550459 549964 542493 555052 565167 598194
12986 598194 609083 614235 627342 651939 683701 709004 738833 766710 793637 827332 860319 886231
12974 886231 916883 933590 946010 980549 982148 987851 1028628 1079625 1105403 1152731 1185209 1223049
12962 1223049 1288327 1356889 1432752 1509602 1592804 1720489 1849438 1978162 2131548 2285600
12952 2285600 2433013 2620592 2810268 3024927 3313025 3620335 3947641 4326276 4799049
12943 4799049 5365466 6040692 6750852 7529830 8415191 9503299 10908197 12634482 14823896
12934 14823896 17574163 21054742 25561666 31113461 37297196 43192497 47661296 50431311
12926 50431311 52274970 53991005 55813633 57336325 58313238 58979365 59573215 59931706 59510626
12917 59510626 58066174 56420233 56005110 57376517 59510255 60283666 58281713 54330140
12909 54330140 50324535 47248098 44901248 42776212 41083465 40683593 42225117 45689773
12901 45689773 50242863 54537712 57426500 58677694 58870076 58795864 59162406 59752231 60217189
12892 60217189 60710214 61338237 61785933 61465464 60146917 58327130 56970624 56655996 56623825
12883 56623825 55010997 50942559 45506595 40143130 35654041 31706532 27720424 23630379
12875 23630379 19846233 16909270 14972450 13866135 13348402 13207520 13334421 13708117 14284513
12866 14284513 15055563 16095534 17567156 19632805 22488238 26233408 30872445 36100107
12858 36100107 41388004 46447944 51709981 57693519 63627046 67595309 68730178 68046589
12850 68046589 67570931 68296338 69904688 71346056 71649413 70713255 69255547 68019688 67193633
12841 67193633 66714522 66605191 66764142 66541981 64753500 60856162 55860090 51438827 48638997
12832 48638997 47818579 48964341 51613490 54925387 58499909 62340961 66422255 70019147
12824 70019147 71736508 71162550 69369931 68079873 68455792 69897464 70965114 70940991 69996263
12815 69996263 68553972 66692251 64399095 62027793 59787751 57516996 54532411 49958626
12807 49958626 43724650 36637383 29733269 23800919 19175123 15705286 13016028 10923806
12799 10923806 9309209 8106890 7155135 6405480 5797797 5277996 4790977 4314909 3881468
12790 3881468 3551564 3284010 3036210 2815102 2624561 2441870 2302899 2144420 1965491
12781 1965491 1820499 1686655 1560105 1443783 1378054 1289020 1219068 1194412 1162698 1111204
12771 1111204 1063752 1012128 969280 955964 934199 875647 838556 816443 771936 759153 723448
12760 723448 723349 682060 657036 643705 641163 618699 609455 604883 605493 581753 552920 544104 523233
12747 523233 507037 499064 503998 511597 546245 569661 563120 572315 602727 601524 652468 712016 746159
12734 746159 782116 793234 788397 803020 811484 834855 830002 864591 846823 809015 786202 784412
12722 784412 754551 748928 750303 754423 736070 730785 702574 691680 679186 642497 629341 584368
12710 584368 533137 468021 427125 401164 364812 353408 350497 364942 381337 385073 381611 429706
12698 429706 451774 482227 516468 505965 472127 462511 434925 410371 411350 413085 418842 427145 441691
12685 441691 440972 439274 452605 470153 458147 419115 367674 322626 312463 280884 270609 255767
12673 255767 268181 304484 336482 341848 381133 424600 431964 424651 396493 365131 342702 335871
12661 335871 294687 283265 280333 291927 317761 294896 305569 350515 381708 389462 396964 375254
12649 375254 336434 273915 235246 210202 208510 193796 170412 180551 187738 193653 181023 183114
12637 183114 202980 204063 194334 214093 233514 221866 162812 131342 128494 128880 126321 130318 116185
12624 116185 108252 99074 121645 157359 160196 173613 174191 144263 134958 128595 103153 87975 109688
12611 109688 136958 134463 169677 187936 175052 167249 162249 191582 214776 200392 182835 178855
12599 178855 184480 186704 205362 191126 181749 219351 234084 218159 232625 240415 240062 210229 198362
12586 198362 191383 210409 215587 238178 251528 268024 280006 308862 376361 455876 565476 692995
12574 692995 789642 800727 717854 609300 528215 457946 408858 377705 348236 328901 312402
12563 312402 294820 304292 324411 326648 282036 249535 273825 284077 287330 314437 318067 306764
12551 306764 291296 285806 283311 275757 273759 277642 289859 317567 336741 366360 412487 461061
12539 461061 492292 517676 550730 651293 773209 915945 1096553 1264470 1350319 1271872
12529 1271872 1133722 941623 771547 627797 509960 467239 407912 336611 320701 336452
12519 336452 314070 285673 264463 241305 231146 225678 258198 286459 266950 240264 216053 252639
12507 252639 276456 271412 295759 310854 322980 337027 398339 430058 461623 498232 530129 559762
12495 559762 627297 691810 797175 948016 1085282 1228610 1348365 1348246 1163499 923294
12485 923294 755994 656292 602087 570279 527458 503446 514729 513223 536264 597166 638035
12474 638035 628482 587153 520312 471101 456601 425112 420656 401476 419654 451817 462795 460368
12462 460368 499827 519157 529982 539083 505468 482710 485830 468099 472081 464715 455106 441225
12450 441225 451681 436961 431730 430036 425358 406267 376213 354843 348782 354228 373968 408393
12438 408393 416991 417856 412690 407111 439862 456304 475761 509653 552052 583432 601753 595742 594988
12425 594988 605518 618461 695930 751483 767694 791316 826878 900663 970226 997315 978072
12414 978072 981448 951565 928415 875608 800678 713277 698286 714368 737542 809957 878351 924177
12402 924177 958049 997019 1034979 1071958 1105507 1119181 1084851 968167 842399 734109 654484
12391 654484 590380 538276 523722 554840 600729 607855 606546 599040 561317 528443 533340 558231
12379 558231 535396 518743 527287 533349 529820 529723 527408 486167 462166 445615 421761 413547 441158
12366 441158 482288 458333 442557 473124 510204 520062 554543 600162 653729 709490 751004 787819
12354 787819 844033 870832 842500 799568 803959 858788 902030 930375 940991 918786 915896 935364
12342 935364 953929 926521 856311 778008 697774 637661 603133 592444 586264 584674 556803 524560
12330 524560 522878 539167 573109 599572 571048 516680 471232 410676 381912 348294 326237 305563
12318 305563 319283 313899 331210 361661 379906 384455 401833 420136 455872 463668 453738 426316
12306 426316 387856 377652 366391 367535 352023 329427 312507 307740 311149 369271 438241 521327
12294 521327 609657 664017 633216 541462 437806 390508 334985 266818 247240 237516 241525 222463
12282 222463 235311 248701 257158 263033 271207 276136 272715 289831 287813 264374 272205 274934 273859
12269 273859 304827 301231 336279 350304 319753 293424 301477 310961 325900 318558 315019 299747
12257 299747 292617 271372 227254 234558 216126 197737 229548 251658 251365 250725 256610 276344 304882
12244 304882 352078 390668 385768 391975 436051 443461 468203 458208 404336 396941 442498 448781 428310
12231 428310 420859 410306 408806 394596 382776 412817 417408 431902 437984 441456 442317 429468 395371
12218 395371 421107 431004 411301 411363 441649 467373 455355 459844 482705 495166 482812 455370
12206 455370 444416 438708 448142 485781 520285 538054 549246 589411 627543 665719 690184 683323
12194 683323 704100 717732 720428 728083 763715 798420 795493 790191 804522 802328 786214 759188
12182 759188 771427 799325 846505 882744 913715 942173 952759 951085 937583 905045 881572 896426
12170 896426 929009 981609 1038795 1100045 1149940 1233517 1330451 1406730 1475520 1549703 1637817
12159 1637817 1708473 1766395 1817071 1857181 1928819 2067493 2293139 2590093 2852829 3099993
12149 3099993 3292336 3395383 3453502 3422006 3333000 3094671 2816953 2556921 2356472 2199512
12139 2199512 2141197 2146359 2153553 2223909 2318486 2451136 2551087 2628521 2694198 2773268 2878888
12128 2878888 2985105 3108140 3242772 3428245 3691095 3999182 4383615 4838149 5371287
12119 5371287 5987254 6750388 7752328 9007203 10570399 12352578 14058152 15680575
12111 15680575 17316746 19297136 21831766 25115600 29454559 35419169 44059832 56686852
12103 56686852 73960235 95236907 117407562 129776229 120984609 99313347 79575803
12096 79575803 65820998 56544787 50311349 45843270 42235457 39383201 37486312 36169728
12088 36169728 34618768 32401017 29966710 28098453 27354954 27846600 29337025 31363516
12080 31363516 33172158 34169806 34249342 33979467 34368388 36016915 39163671 43667985 49093867
12071 49093867 54760421 60001891 64666272 69682143 76224305 84639847 94625163 106437493
12063 106437493 122145476 144321606 174703390 213928258 261397767 305226884 321774367
12056 321774367 309223282 269588157 214355685 168298518 137317779 116959094 103566658
12049 103566658 95072416 90193661 88319161 88878926 90930692 93808036 96821171 97892543
12041 97892543 94085572 84850706 73143176 62428312 54054779 47654973 42731080 39116341
12033 39116341 36625020 35075986 34403743 34516769 35211248 36349734 37851949 39898233
12025 39898233 42569060 46085683 50586658 55926437 62217094 70650796 82596772 98501530
12017 98501530 117688450 138643526 155640527 153736564 126848534 92426077 65745266
12010 65745266 48463420 37421085 30161423 25332348 22142736 19979035 18545320 17641377
12002 17641377 17098726 16841962 16805885 17068106 17668322 18685133 20160477 22077053 24509633
11993 24509633 27499290 31124325 35304421 40038969 45770706 53194078 62840810 74752976
11985 74752976 88270022 102161246 115308310 126061231 132179030 132797224 128433168 120082747
11977 120082747 110214336 101791074 96588997 95085196 97219126 102424327 109484791 116741018
11969 116741018 122517157 125080473 123040290 116240588 105897624 92958912 78215318
11962 78215318 63474863 50805541 41002162 33662711 28154559 23930645 20613126 17955434
11954 17955434 15797509 14077206 12720763 11674205 10822328 10037714 9337319 8719395 8182283
11945 8182283 7744116 7418484 7180018 7017434 6934860 6863753 6771858 6642180 6479207 6225983
11935 6225983 5968486 5719187 5536677 5460415 5441032 5462885 5554018 5727512 5993469 6298924
11925 6298924 6654462 7097253 7680913 8440964 9369490 10441731 11696413 13172251 14948317
11916 14948317 17051537 19549190 22641562 26663518 31958608 38608666 46562176 55518922
11908 55518922 63933542 69125582 69493832 65460955 58732845 51815743 46422560 43013915
11900 43013915 41672622 42443954 45016000 48732869 52921790 57074003 60689633 62782755
11892 62782755 61490760 55573510 46082987 35846890 27161478 20837718 16573607 13729921
11884 13729921 11675043 10009548 8642009 7616446 6848119 6185386 5572411 5063775 4621245
11875 4621245 4216513 3839581 3478578 3190850 2950744 2773922 2676512 2620639 2601047 2601170
11865 2601170 2555067 2485802 2363002 2188299 1967490 1743804 1553927 1409367 1307715 1239781
11855 1239781 1185862 1115848 1074141 1012533 964905 955736 932134 890336 884189 867245 829305 785595
11843 785595 727008 684606 671412 663002 653525 640767 626509 599282 615695 598162 539739 496302
11831 496302 481295 503303 469342 423349 402154 425166 458004 480502 491044 484157 471128 414211
11819 414211 361611 335921 307083 291892 292771 278354 241585 230979 247333 246278 257618 313022
11807 313022 322299 326876 323738 328593 283185 254858 232206 217465 215619 232380 257982 284632
11795 284632 294685 267122 252598 261590 281147 290269 282074 263911 271472 290166 269507 234669
11783 234669 207673 221176 244539 242668 249322 241783 247060 237773 233182 251641 240473 235109 212389
11770 212389 189280 205610 215396 232561 208556 197234 211374 193835 170862 185949 189212 181101
11758 181101 145459 141996 141167 141333 126121 100423 109686 117061 106418 120634 123232 140225 144419
11745 144419 136299 123659 135324 132040 131925 151697 169186 178706 175014 180175 169512 151318 154454
11732 154454 175973 179005 178284 188695 167206 175637 172649 155412 151874 146119 129591 157099 170841
11719 170841 132783 115562 126860 156348 174361 155841 139713 139035 144408 146117 136521 121678
11707 121678 109800 114480 111208 132976 122419 115938 135031 126703 140198 145096 130507 152601
11695 152601 171116 130860 110561 93792 122022 128499 105579 112695 120171 145628 172618 180506
11683 180506 199324 204915 200180 184397 155890 137746 122346 120019 114917 136206 146825 133047
11671 133047 153998 150864 152819 165001 162656 126839 118021 143210 146611 125839 110944 85897
11659 85897 99826 122121 112735 87706 82433 90551 105394 115915 92479 79466 83568 92765 97481
11646 97481 78248 64766 80416 87146 83007 83829 100732 126359 139056 143354 134160 123187 126692
11633 126692 122455 147358 175373 203018 229738 239797 241829 262478 293242 394806 494097 606127
11621 606127 728391 863094 970220 1004449 963119 896111 822842 735584 662530 616036 570235
11610 570235 522819 502640 479298 464706 493260 526428 555103 570901 565956 592210 588927 553906
11598 553906 492716 415524 375393 363659 356555 337678 344188 356662 352567 371198 421319 429564
11586 429564 439540 445330 475887 515874 560695 674769 831527 998176 1183951 1387216 1500674
11575 1500674 1442266 1288411 1023880 791028 592303 437771 374326 326291 281345 266317
11565 266317 256831 236272 205566 190063 161589 143321 150261 165088 201188 220516 233256 240725
11553 240725 256584 276533 284417 286921 326516 390710 442155 481464 531773 629558 769769 864309
11541 864309 946899 1021699 1061375 1100972 1123314 1186912 1261160 1319430 1352057 1317657 1189048
11530 1189048 1054081 982843 934424 881570 817499 737575 684411 612869 509741 421651 330618
11519 330618 281752 248654 209920 198807 172588 169152 166319 145224 115816 89601 89254 89650 80001
11506 80001 99747 110032 114677 89020 88397 99825 114363 89524 80618 72612 89013 128504 120987
11493 120987 99332 78801 49893 22762 37706 29841 35377 45071 59617 64904 55991 54436 68289
11480 68289 91552 97051 102655 97215 116680 130139 128200 130667 142984 163278 211257 296893 377517
11467 377517 409547 439412 418601 370717 325798 320218 318791 284466 283025 269164 272847 298715
11455 298715 322958 351663 380143 391146 368429 332826 272541 196823 126557 89207 93911 97706
11443 97706 91615 107559 97600 90086 70786 43971 23482 1040 -11 24068 56033 73523
11431 73523 70567 46742 31452 35313 41372 26368 7005 -300 -24773 -16385 -17533 -14185 -40076
11418 -40076 -33494 21092 70155 88821 87875 90560 66476 27856 19083 34107 45845 41255 31440
11405 31440 33284 26242 23533 40265 37822 13892 15382 19296 8437 1990 -10038 -14491 1420
11392 1420 31935 13299 20894 23202 13256 29330 21759 16240 31722 48647 29716 -12631 -12280
11379 -12280 12345 13722 2357 -7409 13110 39494 30469 14334 13773 23633 28885 26581 19731
11366 19731 -2622 -21214 -1887 17179 12653 19589 1772 -7466 -13160 -5920 9258 34301 27221
11353 27221 19578 25612 21386 21400 -6759 -9503 -11885 2444 9591 18660 32747 40207 24134 14978
11339 14978 -8349 -13317 1069 7245 21204 26252 25364 3830 19138 -23950 -30102 -31218 -31594
11326 -31594 -8900 18310 4528 5936 5271 -9150 -12905 -2184 11603 -7423 -10063 19767 22314
11313 22314 11524 21552 27156 -3210 -6209 -9951 -31023 -25649 816 14843 9743 35086 34273
11300 34273 26993 -5735 -26007 -22026 7068 12946 33261 24004 18156 6378 -12224 -13670 -20102
11287 -20102 -14242 -25966 -10614 -19115 -48351 -48371 -39813 -33410 -13770 26265 26528 21339 15810 -16897
11273 -16897 -18986 -38674 -18329 -22649 -58833 -18088 1714 -2608 23002 28342 12735 -10199
11261 -10199 24065 29383 22266 19781 -2719 -24000 -36403 -28422 -5299 12287 18869 -24991 -45434
11248 -45434 -33216 -12473 -14558 -4957 -13501 -27015 -26778 -27138 -20426 -26254 -34831 -20985 -10908 22765
11234 22765 37792 35823 32622 23104 12741 -6041 -11144 7203 4485 -8612 168 -11602 -24428
11221 -24428 -35326 -26664 -18690 -6994 -19253 -41183 -31420 -4514 9620 12886 -24838 -55347
11209 -55347 -46298 -37683 -33586 -44529 -29596 19712 46481 1225 -27776 -4576 -1988 -707 -10410
11196 -10410 -15812 22072 28504 18871 167 -41816 -59699 -36905 -17918 -14816 -3197 14551
11184 14551 13527 -378 13996 3854 -36982 -6576 32910 30008 6366 23113 49381 45018
11172 45018 25312 5987 13410 13220 2349 -2890 9650 0 -13815 -25261 313 -8417 -27545
11159 -27545 -12952 -11711 -11813 -9666 19888 10025 2853 44189 56697 45939 23164 -285 -23237
11146 -23237 -12730 5293 15789 -8004 -46794 -30706 -18004 -7411 22413 48933 45188 20659
11134 20659 11864 14687 49609 57601 48111 5370 -24003 -21231 -11445 -15943 -48337 -13180 10065
11121 10065 9376 13055 19717 9344 -14447 -3657 6384 -7201 17283 39865 46530 37722 16645
11108 16645 11737 -13274 -26016 3396 8938 -8171 -15851 5271 22103 41266 38502 23214
11096 23214 10061 -19030 -25698 -30176 -23100 -12590 -15093 -13202 -32862 -46474 -30976 -10652 2134
11083 2134 -8645 -44474 -49342 -29441 -15071 -30787 -26958 -43284 -33923 17167 22913 1428 -25560
11070 -25560 -40155 -42702 -59164 -69555 -53589 -22296 680 -4021 -39223 -38839 4581 952 -2055
11057 -2055 3589 12929 -1300 -28603 -7969 -7570 -9733 -22843 -39606 -36189 -20235 -14546 -7746
11044 -7746 24676 20126 8204 3457 8775 -6247 -20586 -22040 -22103 17355 48198 28609 23360
11031 23360 30219 21087 19248 25989 29288 7218 5596 -13218 -47947 -30858 -42019 -31436 -8019
11018 -8019 -10674 -10333 -30971 -18848 -22716 -18120 -27618 -12298 -7341 18070 -2020 -11192 -421
11005 -421 -3931 -16734 -17093 -9144 -16071 -24607 -14628 -9576 -12503 12600 7418 -14918 -24885 -10163
10991 -10163 -17470 -41482 -31815 -3196 -4491 -442 -11452 -22119 -44414 -32251 -14228 -21918 -24689
10978 -24689 -19821 -59343 -74386 -83323 -52280 -26356 -27546 -40023 -34325 -40190 -32465 1616 24217
10965 24217 30737 16191 22579 35026 17206 17848 24000 9378 6429 -10187 -6765 7725 1891
10952 1891 -8471 8110 14756 -11118 1798 7103 3166 -12643 -10476 -25265 -17581 -11630 -18233
10939 -18233 -16242 135 15092 48588 64262 34610 21797 23139 14658 -14069 -23988 -21943 -48426
10926 -48426 -55400 -56791 -41256 -15326 -21709 -19633 10730 16506 25747 29576 32420 21630 -162
10913 -162 -4612 -12032 -2375 4909 10680 -9257 -4129 -17540 -54216 -39386 2066 13933 35089
10900 35089 32594 24883 6455 -8115 -7734 8527 21202 19592 9155 30736 31478 3100 -18448
10887 -18448 -25597 -11911 1164 6023 15906 20098 10167 431 -15221 -24509 -32137 -36580 -35960 -38110
10873 -38110 -66837 -73255 -68002 -43625 -28505 -25430 -31815 -32313 -2138 2343 -30149 -26920 -3848
10860 -3848 -7303 10573 -2696 -16484 -12340 -25112 -30958 -58224 -65587 -41386 -14396 10090 16787
10847 16787 -12639 -24638 -37711 -26667 -19929 -18674 11645 5703 -8494 8912 9398 -1233 10807
10834 10807 38425 21439 -9492 -12363 -22246 -13398 9576 33617 33124 6242 -1702 -16385 -9280
10821 -9280 -4744 6090 13489 761 10865 -2024 1460 14446 -14864 -20794 -4369 15628 37162
10808 37162 20835 -4912 -10351 -34839 -24440 5148 45151 24487 17939 -4585 -1302 -4477
10796 -4477 -14473 -14126 -19493 7821 4443 -25075 -30640 -17967 626 7056 -835 -16209 -6285 29113
10782 29113 32492 17660 13776 6141 -2668 17517 10880 -5063 9141 10752 -8989 20480 32651
10769 32651 23264 20459 28315 44564 34765 23887 14739 35266 31230 13985 23564 3854 -154
10756 -154 -8138 -16863 -16182 -19276 -2253 10160 -11869 1192 17238 23959 3390 -12534 -34936
10743 -34936 -55883 -47864 -36570 -13872 16313 17000 -9047 -8877 -17057 -20950 -4713 -12467 -43316
10730 -43316 -79579 -36115 -1643 -13578 -23549 -25592 -42874 -29484 -12742 -17672 -15930 -25456 -46373
10717 -46373 -40623 -37475 -45479 -54763 -37689 -21406 -8407 -14507 -26843 -31418 -51891 -31284 -838
10704 -838 15567 -3024 -23240 -29651 -20477 7432 -9052 -35632 -58408 -53533 -35139 -26405 -10829
10691 -10829 -7246 -6562 5191 9856 14788 31091 21700 -20429 -36536 -26112 -45796 -31988 -2428
10678 -2428 -3883 11817 -10125 -25055 -28443 -4026 -25493 -26292 -9582 -20441 -27792 -678 25682
10665 25682 42914 41890 35025 35026 37969 22365 -2081 9147 28707 45764 43184 39803 2094
10652 2094 -26007 -6385 -12252 -31699 -7670 12399 24062 29326 4836 -1694 -31551 -20892
10640 -20892 17743 27194 18637 15731 21764 43442 44844 44562 35089 16731 -24171 -54605 -40995
10627 -40995 -37523 -35024 -34132 -31978 -37348 -38404 -26608 3047 -2089 -15951 -7266 15210 6512 7334
10613 7334 17492 22527 14109 -10287 -2883 -226 14299 2885 -1688 -5394 5812 30838 48067
10600 48067 67670 49122 36626 41490 47270 51769 47963 26865 17619 30752 34645 22352 17393
10587 17393 14707 28158 37026 43450 23772 2975 -17165 -15859 -17719 -16797 3464 42448 73929
10574 73929 49794 15684 772 -11301 -21115 -33921 -32978 -8812 16725 17561 31406 30635 17348
10561 17348 22283 -5160 -31611 -23649 -31433 -30246 -15974 -21922 -25016 -14513 11245 -4336 6628
10548 6628 29750 22926 37414 54444 71254 56231 41919 20454 -6043 7940 43235 72980
10536 72980 58734 79607 75219 81073 106541 130307 180578 205813 236869 311293 361331 383859
10524 383859 350225 298437 235249 195006 157551 100664 68556 45552 35803 44373 86180 82083
10512 82083 46502 20512 47816 48501 30749 51059 72002 47748 27843 42043 63614 68425
10500 68425 49810 46166 27303 30429 43460 44463 29503 30434 35315 64890 58046 60748 88175
10487 88175 100655 133931 190466 211749 216758 194819 179657 171606 167882 209582 267628 297683
10475 297683 288668 286960 292379 290572 275587 274117 259612 239819 212624 227691 216373 225550 187692
10462 187692 130481 93395 123091 126142 108283 84066 61029 49379 43475 57599 56858 36880
10450 36880 30198 23141 6693 14820 8592 4352 5580 23876 26672 43535 90433 73920 66175
10437 66175 61918 63754 57428 74084 68007 52753 70049 85767 86933 116868 164881 195428 228610
10424 228610 255501 267003 321612 328054 288327 228188 148678 116573 71860 39117 56321 82208
10412 82208 87547 84002 57292 25464 18630 25707 22876 35062 25985 -602 10234 22084 3681
10399 3681 11054 391 -4419 12358 14780 25980 17159 8519 2041 -20741 -23121 6664 12783
10386 12783 5570 17865 14267 17979 -589 1495 38589 44916 34942 28409 22066 19878 10234 -3821
10372 -3821 23267 49835 41098 12813 29260 29708 20227 20451 3221 8892 27963 27396 33420 30109
10358 30109 7652 14195 30253 9780 2812 -19638 -50022 -24200 -24431 -30729 -14130 -8690 -1960
10345 -1960 13170 32009 24329 29636 8611 4787 30494 52034 46660 50137 67443 103088 101761
10332 101761 137399 162884 223525 266801 293282 297770 310991 348591 359236 372124 368911 313438
10320 313438 268933 216849 168528 141221 134369 109506 106332 116587 124988 118346 102159 62668
10308 62668 62176 71034 51511 47760 39093 28385 24902 10564 39466 33013 8178 3723 -16161
10295 -16161 -18964 20430 7594 -18953 -16750 7887 14661 23938 34431 51864 81475 45238
10283 45238 12166 -2998 24430 34006 34896 48763 45978 26056 33329 31634 5638 31192 2953
10270 2953 21243 33679 21411 12863 27673 19494 19 -14964 -3612 21678 41651 46352
10258 46352 68232 84462 69814 58356 57234 80104 94590 129806 158221 124669 97982 99906
10246 99906 92342 72661 30183 31132 70898 96075 93907 118954 128599 150830 140055 165009 217652
10233 217652 263875 299527 287106 231947 168267 109997 73953 75296 71513 65805 48794 56123
10221 56123 49469 39518 26948 -20840 -18464 13891 -3494 3555 21150 53334 58611 63187 73153
10208 73153 70576 27592 -2746 29257 40911 44418 28584 21791 29125 -1997 21178 34034
10196 34034 69445 74709 92808 117470 111376 95444 103061 112721 116085 111987 109498 127466 162755
10183 162755 190565 205042 215576 210663 174009 126925 108479 93210 85346 87651 95445 59147
10171 59147 40255 36904 27021 46688 64639 66523 76751 55844 38290 28034 33333 41809 36146
10158 36146 32889 38420 54613 57759 41711 29871 -1896 -3123 34809 36682 5356 -2269 15580
10145 15580 46087 35625 21394 32606 38546 27443 22606 46951 37454 921 8317 13373 -1354
10132 -1354 -15069 9890 48152 73038 43675 46374 38167 56287 67977 52353 -2376 -16336
10120 -16336 3270 48900 64947 92462 105150 88914 68747 30066 26595 42763 44165 57231
10108 57231 30844 30095 43097 42683 50963 31271 26857 26978 27173 8468 2924 14319 -15993 5992
10094 5992 29085 42101 44413 31252 19166 20632 132 3494 2562 21299 35785 37879 43709
10081 43709 63292 57226 27602 12196 427 4216 38978 35726 19246 8849 -17851 -2573
10069 -2573 -16743 -23499 -10409 3361 3110 6192 15587 13569 -19832 -27981 -23657 13210 42703
10056 42703 72411 74935 63669 63346 53554 42345 19283 30163 67773 52778 27446 3009
10044 3009 -27149 -20691 -14520 -5844 -6515 -8233 -10133 -11163 -21448 -15427 5947 24946 34082 -7325
10030 -7325 -26893 -14750 5472 9647 29627 16070 -2830 -5599 21276 -12255 -14557 12980
10018 12980 7095 -12040 -23198 -22718 -24186 -8537 -4242 1560 4505 -1673 12388 22082 22923 35542
10004 35542 38111 46308 36728 31299 37295 37385 22689 2596 -11198 -38781 -40285 -5890 3056 -1775
9990 -1775 25413 9146 8879 41028 35221 6640 6498 3787 20093 31915 61325 55385 57647 65784
9976 65784 89073 93069 72401 69531 53829 65690 60518 70796 59715 43177 24296 19265 28032
9963 28032 34884 47861 51060 51129 41869 27927 12479 16618 15752 34867 68096 78963 92030 60683
9949 60683 68130 93285 117472 138860 157468 190280 229238 260605 263652 310434 399425 445823
9937 445823 448598 426633 367476 299965 283885 279160 263399 248005 211866 167242 135385 87346
9925 87346 67635 96876 125792 99440 109026 142039 144232 122712 110948 86189 82311 80185 84970
9912 84970 128319 165983 205385 209998 220387 271850 317272 352659 373646 400854 425417 455632
9900 455632 506350 597057 732238 849043 964393 1077718 1143584 1125491 1054247 949591 810026
9889 810026 689095 594156 519733 454341 410905 393519 384919 387023 380270 408914 425007 426087
9877 426087 438877 405519 409809 412221 442010 498057 513446 514518 565351 656162 750987 894806
9865 894806 1035642 1148143 1302687 1488172 1703687 1974040 2293054 2543916 2724397 2913447
9855 2913447 3200573 3591244 4136205 4841132 5694987 6572218 7677665 9398185 11990264
9846 11990264 15442295 19215773 21353057 19565390 14782364 10066115 6918988 5072434
9838 5072434 3965585 3274120 2781970 2419686 2121593 1867770 1690233 1601634 1528896 1482256
9828 1482256 1479659 1515198 1529626 1565255 1655017 1828635 2124584 2476833 2809763 2961067 2720353
9817 2720353 2198885 1754317 1457066 1299326 1227751 1200936 1247348 1286343 1309030 1304651 1281803
9806 1281803 1267485 1259708 1237307 1242984 1281848 1314049 1290899 1269217 1270706 1273401 1214505 1086212
9794 1086212 942152 841256 777866 711682 710844 724560 754020 804377 770266 704960 727679
9783 727679 805108 883367 946219 993952 976721 849331 695038 608074 566927 547517 541392
9772 541392 510311 481821 471210 473407 463842 457488 447756 445625 452154 460380 506548 497430 477459
9759 477459 481339 481022 474402 460046 452774 464047 505033 526506 513872 454119 429040 430735 402814
9746 402814 383059 358671 335016 336934 335501 361497 378480 349807 310709 316142 318018 332973
9734 332973 328492 341785 340749 349901 332270 341879 349461 345341 338922 343194 357177 353910 343194
9721 343194 346300 379257 393909 377681 342829 322063 322301 345138 364739 349364 304194 278027
9709 278027 289160 318345 368911 380238 356108 316061 296022 315556 308238 312339 348455 370199
9697 370199 371446 358895 339955 341165 377105 405374 405565 427198 425533 427546 428263 404407 404223 422938
9683 422938 439548 467579 502129 540917 549931 549358 570780 579910 615945 614164 602115 587016 561792
9670 561792 569715 581262 573390 593734 604877 598897 612542 633203 656548 651568 611660 584328
9658 584328 569033 585524 591187 538038 495877 501333 515480 496064 506954 543100 575204 639282
9646 639282 690912 709755 720027 713967 705730 693741 681139 659244 616203 563459 549571 517968
9634 517968 520927 546028 516076 478987 486778 493049 516134 511970 531803 547933 562666 592836
9622 592836 596615 568325 567786 593203 601670 642089 672202 669777 696695 746348 780659 814658 857842
9609 857842 923496 970577 1024806 1090143 1130759 1156036 1228795 1318007 1389574 1450247 1518832 1533058
9597 1533058 1468183 1417722 1386069 1319855 1262686 1218784 1190824 1177667 1186515 1161624 1161483 1183915
9585 1183915 1197868 1202364 1173810 1151767 1174696 1189254 1225560 1262318 1312700 1349550 1395946 1422136
9573 1422136 1475214 1565560 1628796 1715758 1847990 1996597 2145878 2275115 2400395 2565987
9563 2565987 2704848 2839314 3040319 3353282 3785922 4311424 4980530 5702089 6357375 6891681
9553 6891681 7406592 8073547 8990032 10121110 11542524 13441793 15990515 19197848 22686626
9544 22686626 25200127 25496154 24070699 22262460 20975724 20844568 21875991 23427780
9536 23427780 24677711 25008336 24428254 22997322 20974778 18872796 16921897 15112564
9528 15112564 13599819 12582689 12050201 11763774 11511817 11279743 11188040 11334873 11716856
9519 11716856 12330958 13159690 14228640 15509964 17028720 18887081 21126168 23886363
9511 23886363 27214761 31197104 36081074 42274080 49957187 58555599 67023931 74961380
9503 74961380 82635886 90474015 98392590 104194029 104736420 100509007 95290563 91385646
9495 91385646 87656261 82044684 74870647 68273882 63160097 58845799 54709206 50942084
9487 50942084 47700605 44690232 41893986 39961957 39481961 40381595 42019132 43832126
9479 43832126 45632448 47824302 50932813 55138400 60114621 65554865 71550471 78475800
9471 78475800 86309546 93358389 95691440 91731050 85610393 81748087 81399830 83821390
9463 83821390 88100976 94754272 104999176 119214804 136031084 150932461 158757376 159492742
9455 159492742 155151754 145061798 128628009 109318619 91514799 77303523 67161608
9448 67161608 60597757 56592935 54041766 51871148 49559817 47287843 45537401 44849548
9440 44849548 45595859 47814285 51005662 54252650 56841333 58331965 58363450 57222989 55917923
9431 55917923 55651578 57056240 60055329 64152599 68596505 72752913 75853259 76680097
9423 76680097 75243775 74094522 75389882 78992522 82593247 83483561 81369097 78116849
9415 78116849 74876144 71069226 66088797 60621986 55740961 51250641 46606044 42347771
9407 42347771 39101834 36706457 34763616 33275933 32402353 32086260 31994113 31663046 30702752
9398 30702752 28976309 26644052 23987556 21316465 18905814 16986499 15591880 14785262
9390 14785262 14502348 14650326 15150350 15944957 16876223 17808527 18643352 19177004 19305748
9381 19305748 19072161 18673354 18396456 18422329 18766669 19246376 19523015 19374223 18701662 17655273
9371 17655273 16492721 15452402 14701023 14347559 14497888 15228926 16502446 18228157 20231171
9362 20231171 22068350 23240209 23458396 22653436 21113855 19236554 17376559 15775185
9354 15775185 14632063 14003881 13766004 13790178 13984536 14201845 14332937 14193277 13797795
9345 13797795 13245373 12728298 12467256 12609378 13155770 13995404 14896916 15529282 15686434
9336 15686434 15287303 14466707 13501578 12678409 12245397 12301625 12831124 13720847 14761127
9327 14761127 15777595 16560492 16897918 16657685 15808047 14484242 13004876 11715933 10789291
9318 10789291 10325994 10286428 10575682 11030129 11400437 11550251 11372093 10938133 10327112 9733927
9308 9733927 9351510 9225481 9436498 9988673 10756027 11550439 12202683 12565967 12611258 12342191
9298 12342191 11953867 11599243 11494793 11728804 12320027 13231554 14350519 15567286 16778535
9289 16778535 18062304 19613459 21785150 24908610 28846980 33014011 36013590 35975353
9281 35975353 32502973 27459890 22762185 19022243 16101854 13729884 11756672 10058920
9273 10058920 8607564 7440006 6518027 5817201 5270068 4876810 4569040 4338467 4219068
9264 4219068 4142614 4143655 4260197 4481362 4814411 5259478 5813049 6438528 7059989 7498465
9254 7498465 7529771 7108705 6381286 5541089 4780588 4216566 3822883 3538604 3358981 3265848
9244 3265848 3223604 3229307 3259136 3313736 3416080 3606791 3851196 4141847 4488282 4915551
9234 4915551 5444848 6106116 6828009 7652407 8642573 9822793 11188777 12673455 14212770
9225 14212770 15823787 17500975 19247297 20986345 22745862 24483671 26276509 28338011
9217 28338011 30776355 33674860 36993192 40526936 43885151 46921370 49609100 51864293
9209 51864293 53571057 54707197 55404997 55756989 55944321 56057689 56400644 57280728 58650771
9200 58650771 60228850 61646233 62637110 63052544 62895062 62297714 61450917 60633312 59957836
9191 59957836 59370919 58786674 58022558 56961781 55775874 54563796 53358488 52312216 51401114
9182 51401114 50241831 48644912 46917881 45614768 45023452 44785267 44132182 42495273 39975992
9173 39975992 37004117 33886131 30728102 27736868 25060966 22912529 21363749 20272010
9165 20272010 19454735 18845577 18399207 17825205 16999452 16000485 14959371 13967215 13005304
9156 13005304 12050917 11203857 10549894 10197036 10117749 10334457 10875474 11716857 12878551
9147 12878551 14415397 16304127 18435028 20551622 22492856 24217642 25721271 26981048
9139 26981048 28073511 29228033 30752325 32907429 35783565 39446873 43930524 49083904
9131 49083904 54540538 59844840 64548936 68383040 71220349 73066889 74077517 74834010
9123 74834010 75893280 77525301 79781773 82505167 85458194 88318870 90716534 92424701
9115 92424701 93524991 94204393 94450237 94060694 93151491 92027948 90896986 90022593 89341087
9106 89341087 88414722 86860129 84497877 81274672 77561680 74037181 71267395 69211453
9098 69211453 67345931 65349996 63084110 60479715 57734573 54940049 52077996 49096031
9090 49096031 45806766 42013234 37843450 33779954 30305521 27619838 25649673 24233799
9082 24233799 23024085 21709711 20110331 18277977 16393181 14627729 12994574 11527090
9074 11527090 10161183 8953006 7906154 6963617 6159929 5513496 4973369 4547751 4205207
9065 4205207 3930555 3694612 3504762 3373781 3246750 3127061 3026256 2932519 2844539 2761680
9055 2761680 2664895 2608080 2579967 2552522 2537836 2517776 2496657 2499494 2488633 2528601 2610430 2704611
9043 2704611 2787064 2863364 2925146 2925328 2836829 2673535 2465406 2238778 2032037 1884103 1761201
9032 1761201 1671385 1605249 1519948 1455927 1406148 1371940 1402214 1417302 1392345 1375584 1371159 1345367
9020 1345367 1294435 1257331 1234921 1232044 1189553 1143951 1123630 1097811 1089779 1067920 1019725 1005500
9008 1005500 994487 994367 984601 970862 969035 995848 1035946 1082180 1138504 1215865 1235510 1234029
8996 1234029 1220196 1219777 1211639 1159302 1135660 1102990 1018109 938392 908277 845735 842865 829406
8984 829406 805643 777704 756688 764761 740855 738526 709151 685627 679347 670859 648492 635880
8972 635880 612165 590066 591951 586530 581520 594932 570651 538963 528877 522574 524259 517504 514954
8959 514954 545989 570821 560897 573178 564843 573191 562031 556804 556355 519083 504906 534356 550098
8946 550098 542471 523516 526211 525648 521804 496752 467160 467712 456238 452475 474560 456382 414249
8933 414249 450090 477911 485566 526394 555770 542079 534986 549239 566832 571353 549516 505986
8921 505986 525074 558620 557651 535815 517877 517546 525548 545940 557169 533405 505758 506552 502404
8908 502404 484356 488025 501909 516361 487144 467292 464117 466727 454505 438892 449279 446174
8896 446174 455385 430331 388840 383581 399541 433084 431888 445464 482441 494427 478707 468210
8884 468210 454499 459061 479999 522512 510445 485397 484278 482198 498222 518904 542708 595222
8872 595222 612699 565126 569192 581007 591166 614829 670207 713820 760146 826589 908507 1024125
8860 1024125 1174471 1321241 1325472 1183564 1027257 924962 851001 784834 751104 747526 758934
8849 758934 800360 791856 763156 733404 735187 775517 775738 781765 786680 801124 798065 804845 831452
8836 831452 860136 887531 889909 913299 952219 992570 1015604 1054787 1121124 1191641 1247403 1319438
8824 1319438 1387889 1443131 1511564 1618779 1684434 1746170 1813520 1842809 1840962 1851543 1889271
8813 1889271 1946362 2050131 2162880 2283070 2390109 2469253 2510224 2540668 2630576 2757966
8803 2757966 2861049 2959599 2961668 2893535 2853887 2907367 3053212 3231086 3453052 3731803 4046067
8792 4046067 4412265 4802779 5209778 5658340 6176545 6742928 7437657 8315217 9437525
8783 9437525 10847240 12547511 14525728 16810015 19407511 22271001 25043355 27191735
8775 27191735 28261538 28131011 27102311 25575182 23743986 21772859 19878665 18210344
8767 18210344 16826184 15601197 14551078 13712656 13163056 12965798 13002466 13187619 13471042
8758 13471042 13804892 14150196 14597589 15202621 16082874 17356755 19000248 20925904 23070224
8749 23070224 25342435 27481539 29014312 29491005 28948033 27788579 26443518 25052680
8741 25052680 23614424 22250241 21005194 19810169 18597296 17361253 16183542 15227127
8733 15227127 14533931 14107240 13897172 13828265 13827224 13765553 13619724 13373546 13040685 12835856
8723 12835856 12844153 13053413 13465334 13987364 14540860 15103568 15793309 16733253 18003905 19580209
8713 19580209 21524177 23783975 26266784 28878600 31579704 34350371 37112395 39673162
8705 39673162 41784199 43375431 44670235 45928956 47194578 48258815 48719800 48261025
8697 48261025 47104206 45837326 44849163 44334942 44300777 44413017 44209610 43375729 41830764
8688 41830764 39869123 37983611 36633087 36029225 36124242 36682017 37600142 38803836 40226308
8679 40226308 41833201 43476652 44915305 46011021 46759115 47464222 48431183 49744833 51032863
8670 51032863 51562433 50861291 49189779 47114670 45081325 43310038 42007759 40971099
8662 40971099 39785127 38108479 35881270 33311870 30619890 28100120 25985226 24364307
8654 24364307 23219932 22384223 21800986 21366444 20922415 20407398 19822003 19283788 18897148
8645 18897148 18784573 18964629 19415961 20046823 20797373 21592346 22434835 23361010 24449595
8636 24449595 25693905 27209645 29010490 30986621 33040647 35152346 37269796 39199740
8628 39199740 40474034 40917941 40677912 40081042 39513077 39362474 39744792 40347664 40682269
8619 40682269 40492269 39752565 38719683 37692629 36813158 35993207 34907426 33534347 32096769
8610 32096769 30836479 29952873 29514081 29605091 30259277 31456755 33075112 34950555 36892649
8601 36892649 38711759 40076274 40647752 40297216 39078875 37427573 36009718 35102792 34760249
8592 34760249 34797459 34896765 34668512 33886212 32610012 31133468 29657842 28193003 26522964
8583 26522964 24452814 22121561 19814658 17738760 16014302 14615971 13479619 12608626
8575 12608626 11999868 11588889 11274236 10975870 10663399 10359326 10052842 9823841 9709845
8566 9709845 9701640 9756576 9876459 10006654 10129999 10207883 10272249 10341642 10476346 10744814 11206372
8555 11206372 11863720 12606621 13329403 13998500 14529277 14899812 15175537 15441953 15777993
8546 15777993 16168914 16554213 16855162 16914994 16597907 15805050 14541483 13018142 11511063
8537 11511063 10211529 9166315 8403101 7883514 7581555 7462691 7463553 7614892 7901888 8283693
8527 8283693 8745708 9277755 9904657 10554871 11173518 11745149 12286953 12797607 13262747 13623472
8517 13623472 13849373 13860728 13629350 13177596 12372406 11092502 9500473 7915802 6566802
8508 6566802 5536494 4776232 4205191 3773634 3450517 3163467 2912481 2663082 2438279
8499 2438279 2232394 2042293 1891324 1768522 1655376 1584387 1516086 1477163 1451719 1430819
8489 1430819 1374642 1313566 1266777 1260631 1257631 1244064 1249469 1254482 1280172 1360699 1448373 1584738
8477 1584738 1709669 1761631 1705268 1586036 1453539 1309295 1210602 1131765 1038814 956109 893767
8466 893767 841102 790237 778867 745746 712175 704101 711286 725776 714216 673590 622744 611924
8454 611924 590649 582160 575294 581082 566584 550976 536070 511240 501885 507366 493178 535245 547373
8441 547373 573777 635109 715046 770507 745096 676075 582549 498385 461105 424794 394644 397435
8429 397435 384502 385881 368463 354658 335277 357162 352363 321589 325889 341732 318440 280058
8417 280058 263168 239862 245469 266760 293024 300123 301597 297857 274462 260998 276037 292811
8405 292811 292622 274273 241771 245287 260199 262314 283513 254828 239578 261927 265565 277042 304148
8392 304148 290233 277781 283974 307212 335744 335950 320375 331328 316958 288055 318503 331388
8380 331388 313507 292336 292711 321607 348738 330825 329870 359244 383060 389364 356363 311163 332713
8367 332713 344875 314343 335423 334047 316965 295531 270701 243711 251420 246773 243843 234985 260360
8354 260360 284902 289876 294270 295987 293799 267647 273299 308344 337180 366720 414649 402367 358875
8341 358875 344962 316318 297599 271329 270067 258710 249991 242254 253539 285888 275025 246833
8329 246833 250594 236712 220091 213533 221087 243046 256400 247340 240789 249045 261201 236024 256449
8316 256449 288461 281994 308623 308377 278321 279342 287066 313802 325342 320152 344818 351599 342972
8303 342972 337280 358034 390638 412714 432675 446989 448548 455740 451165 436947 414739 383001
8291 383001 356961 353643 363350 373249 364352 360428 343640 335705 332828 311937 284829 307323 313749
8278 313749 324146 346735 361718 353255 343006 365152 400605 401223 386576 384061 366844 357582 374561
8265 374561 379154 344919 339090 361459 375404 375466 345625 317182 308440 322152 308553 299515 261444
8252 261444 222309 225481 234185 260503 248977 247390 252898 265432 265946 259316 254898 275773 297797
8239 297797 312097 322365 296607 303573 315201 296585 275466 262760 256086 258996 271984 318427
8227 318427 360862 372886 393536 386808 376432 347305 307496 300251 303915 302486 304333 304851 310455
8214 310455 346840 344845 330026 308713 284351 283585 265865 263071 268855 245150 243317 245774 266663
8201 266663 261501 266065 304837 331153 337827 316238 321179 317796 281025 278941 295180 310693 306821
8188 306821 301568 287741 259785 235771 245008 249629 225070 193402 175726 165689 156058 147340 153660
8175 153660 152601 153489 144942 152063 170094 162669 162646 157393 154783 135060 130405 111182 132702 145578
8161 145578 128298 117887 132534 151586 151396 132496 113556 124748 149115 139748 123024 148469
8149 148469 172271 173697 161300 166023 176919 190587 199634 201282 221163 230371 202936 176673 178293
8136 178293 160454 119821 101863 108935 123794 103117 96895 108964 128468 119062 82660 99137
8124 99137 144289 154486 136032 100240 101115 150117 174785 170870 171437 184369 198591 210135 202721
8111 202721 199762 173922 155271 134226 93613 87458 105092 97006 119291 135234 103448 92112
8099 92112 117109 141062 147374 160737 159507 173170 182508 170039 136840 141719 172224 159899 158350
8086 158350 161451 164160 158096 143071 117184 100755 102546 93679 80851 100424 117857 122228 93557
8073 93557 90535 94414 106011 103031 94677 95297 99439 96122 97344 92949 129541 138140 124514 103784
8059 103784 132770 128025 125026 159185 154770 129428 147364 162534 126531 115217 90318 124219
8047 124219 154323 152548 131515 130030 129914 115412 119841 119780 108367 137254 163640 148595 110219
8034 110219 107377 100142 89934 75135 82596 88202 92689 93939 111996 98835 100527 115473 126079
8021 126079 127731 129487 134761 151204 164012 151920 150664 161597 166084 158117 175666 179326 186893
8008 186893 211504 193528 186693 172544 137863 142945 166052 159187 167336 158330 151337 132175 138179
7995 138179 158697 142742 135065 155736 175688 210949 192932 192214 183001 167325 159864 174193 189931
7982 189931 175984 146746 142559 139787 119657 111553 99240 86409 90520 118909 118772 117223 121203
7969 121203 119082 94677 94007 89142 99314 144273 200288 188344 160826 162691 173677 206327 195673
7956 195673 180999 211620 180748 147012 136389 142021 166276 177546 165857 151740 191749 182329
7944 182329 161850 183502 204899 206884 186169 150784 145406 139913 121544 146643 140918 123343
7932 123343 83161 75461 124890 130480 121232 96694 92725 102234 108649 108221 125907 114491 72217
7919 72217 65604 79193 94198 113498 117156 121227 143314 148233 126996 126031 113727 116570 134194
7906 134194 124294 101594 80598 79198 78093 102941 120059 127385 108346 80752 103559 122890
7894 122890 103240 92608 95693 131406 132044 120702 141771 131902 134938 119870 114519 101244 109921
7881 109921 107757 104909 123740 119811 109225 94300 76171 53860 42593 63525 91780 79082
7869 79082 70825 80210 83772 90408 93833 89320 62307 48249 59712 77574 86160 107064 102405
7856 102405 105507 96526 56337 52381 27599 33817 51412 91191 82742 24970 25940 32082 59917
7843 59917 95250 92988 88538 90644 89956 85629 59547 61946 102791 110078 90530 75494 61665
7830 61665 48365 47571 36566 30704 6458 23254 44753 66275 81172 100288 66309 35893
7818 35893 37131 52475 58521 38801 39278 49700 44731 50918 42356 41934 55434 59719 67143 50949
7804 50949 -889 -38860 -31964 -4884 49718 62992 73448 91532 120194 124066 80796 46714
7792 46714 12284 7743 26453 17898 29581 63523 78630 78332 61160 24535 19846 19274 -97
7779 -97 -19380 -10637 -2537 171 2075 -27634 -31615 -26031 -27902 -134 -10303 -2513 18461 9247
7765 9247 -1949 9874 35542 41445 62523 95445 107376 86301 51456 24637 21162 58537
7753 58537 70924 66380 40234 22061 45777 56870 36055 59725 76938 45234 21152 34058
7741 34058 49107 54571 41588 26402 40954 58018 45483 39825 21960 13397 16657 39822 64960
7728 64960 51358 23330 43686 51410 28716 29820 48673 43169 33327 42202 18225 18330 4521
7715 4521 8402 21687 -5958 -24222 -12051 2775 20568 39244 55998 54941 71732 66814 40173
7702 40173 15828 14819 25975 32791 37128 54221 63951 80573 70652 47627 26819 27506 59385
7689 59385 64667 49807 14233 -5626 22257 33980 39331 23750 15990 8749 1332 12799 6367
7676 6367 18038 34763 42921 52613 15104 -18115 -6130 12971 19860 11613 19570 15911 1360
7663 1360 -591 13046 48207 48731 13713 -9276 -10907 -2318 9806 5287 -3263 2779 11332 18647
7649 18647 40040 56589 18016 -971 -20514 5171 39694 63909 106857 104831 81230 71192
7637 71192 61013 72345 72015 70903 71650 36088 27616 46771 55708 63055 58632 52377 40050 60477
7623 60477 66260 30695 16981 3081 33041 68903 55115 31625 16264 751 2756 -1674
7611 -1674 3096 12714 22037 14623 18591 -5744 7428 18698 23531 11348 16851 28199 45579
7598 45579 46122 20213 5054 44840 59511 41991 13034 -8905 28550 42999 41421 15949
7586 15949 35196 56427 71293 58484 31874 37446 32635 35305 42888 38413 45312 37980 47341
7573 47341 26304 12068 32145 76516 64554 52807 31072 27692 11460 3940 9498 22316
7561 22316 46097 58504 46089 17405 19204 17749 7161 8060 17878 36022 51018 43369 18161
7548 18161 41070 61568 36103 25473 25195 38929 31970 19558 18066 8827 9559 10153 39202 43489
7534 43489 8828 -23412 -7539 8188 19270 26133 35403 39267 23542 -10067 -17147 10955 28074
7521 28074 14094 -3012 -25936 3498 52075 56341 49182 43944 8202 9903 20941 -4057 18633
7508 18633 31123 19195 24393 35200 23962 8129 33665 45760 43238 41249 34227 23408 28784
7495 28784 14687 14365 36140 19456 30684 27983 14070 -10498 -23663 -27537 -29529 -8844 -3264
7482 -3264 7272 26556 11793 454 -15217 -21777 -2934 -438 16393 55028 59865 62016 48348
7469 48348 33208 36821 39215 33163 19236 33531 39383 32427 20689 3204 -7109 23968 53905
7456 53905 58020 24566 14895 21271 11082 1320 14667 19616 39884 60358 53612 27551 4063
7443 4063 4194 20661 28470 51924 50550 34538 4323 -28897 -16255 19582 16124 17419 13924
7430 13924 37494 29591 15276 23232 57932 42938 12271 29745 61162 58508 61391 64277 30504
7417 30504 -1176 -2018 -7169 -21596 -18226 -8392 4890 25910 52228 39748 28817 30458 33790
7404 33790 30695 21692 36352 53703 30493 11092 -1985 -19954 24850 33356 33617 8354 17642
7391 17642 25764 19857 23794 7267 -1036 17410 12745 19952 15249 6879 -13751 -12992 -13369 2596
7377 2596 25615 51076 53135 51196 48932 51948 45392 42907 47942 37968 -2422 7814 10838 15521
7363 15521 29179 28742 -16509 -34349 4814 36848 30954 6882 2475 -12674 -14737 7859 18422
7350 18422 14952 24151 26274 32709 50840 43753 31299 25419 18222 7803 -2704 -19930 13889
7337 13889 48353 57443 45237 23923 38425 35070 587 8090 8165 4178 12589 18676 23890 23711
7323 23711 8735 -5464 11270 19008 31985 79186 78285 66377 40340 17955 -6492 8536
7311 8536 21942 27294 31773 23667 43476 39833 3742 -29238 -30154 -36314 1854 9654 10405 4235
7297 4235 -22011 -31722 -6281 16162 -6350 -21338 -18381 -1935 17041 30420 20989 30058 46061
7284 46061 18267 35120 42267 38041 28363 37419 74165 56972 46808 53896 40999 21056 -14162
7271 -14162 -37440 -15850 20105 33603 16908 35323 59588 59937 51888 61875 57821 56655 36207
7258 36207 26808 22236 -2660 -5426 -673 4259 17582 36929 45484 11830 4249 -6661 -3455
7245 -3455 23662 54616 76410 61360 32374 16598 15974 677 3245 17632 -859 -13962 -25028
7232 -25028 -3222 6241 28882 46151 42896 26099 13199 25214 39522 26739 39334 40751
7220 40751 27926 22207 16601 22582 -6854 -8421 -30200 -10591 15270 14823 31286 43265 57933
7207 57933 47466 38410 31276 15830 8646 -6200 -4299 22143 37925 20958 37515 40665 35032
7194 35032 47071 42919 30934 27236 37929 28929 23054 24884 26569 1830 -9511 16589 16151
7181 16151 45246 31179 26865 42014 33798 9787 -14029 -7573 -4436 -14516 -10924 -13401 -19981
7168 -19981 -18766 -11116 -4014 16346 43386 41848 24629 23210 8124 2294 19460 25444 46290
7155 46290 30972 28906 21359 35319 24179 11632 -39104 -21395 22171 14824 7236 -17858 -6965
7142 -6965 584 -6253 -20686 -35488 -7531 6157 28285 52254 64622 26743 10970 2811 -14155
7129 -14155 -14131 -4972 -13831 -8388 -7911 -1676 -19181 -20589 -14362 7307 -7234 248 5212 120 -19494
7114 -19494 -19684 -9574 -27302 -12807 -14215 -34465 2082 22367 16367 21284 944 -463 2197
7101 2197 -20413 -27618 8164 18140 34921 66877 28451 -9423 26941 37183 36072 49152 9751
7088 9751 3265 13660 41140 35126 4398 -11373 -4564 9263 25849 45047 23906 -457 -1944
7075 -1944 10084 1728 6092 3317 -6344 3571 26504 32921 25911 42183 36244 25405 21688 41614
7061 41614 50325 63879 63178 57132 78109 66185 46329 33240 34980 55342 82548 72553 33960
7048 33960 6147 5619 7513 27326 24738 14381 13297 20536 7922 3018 17881 8772 23801
7035 23801 20925 20198 19838 17361 -2266 -7111 -988 20444 52522 45827 21565 11236 5945 -11648
7021 -11648 23555 36187 25078 26204 32338 34283 25265 -216 -623 4467 -11549 -1983 22627
7008 22627 26623 10063 -8993 -8830 8649 9502 14331 14750 10923 8729 7118 -4070 6299 5585
6994 5585 16247 35605 46101 17636 4097 -3446 -19627 -49406 -53691 -52840 -31865 -11698 6871
6981 6871 26591 46072 19646 -8957 -9077 -18144 -14238 -10793 -20754 -28577 -41697 -10894 -10464 -26444
6967 -26444 -6570 15982 6428 -16360 -3569 24549 30694 -2366 -11882 14129 24161 30138 28338
6954 28338 22196 28911 23160 11826 19112 31262 9457 5399 -2431 15080 30422 54240 63168
6941 63168 56777 20790 16111 15456 9323 27120 21751 35620 34155 22952 20392 11196 13172 18430
6927 18430 12206 -11615 -6055 13936 37398 39026 37129 5635 -17898 -17893 5947 24317 15013 16321
6913 16321 27146 17767 -24499 -40729 -43166 -27734 -6248 51359 58055 42514 16223 22387 27166
6900 27166 -256 -132 16842 15199 3482 33546 35925 9429 -3250 -11050 -8846 -16117 -13697
6887 -13697 -32651 -50089 -62573 -41121 -12465 8643 -28312 -29486 -21340 6453 38039 56583
6875 56583 56389 39254 51533 38763 31689 54060 54391 46267 28759 8974 3392 -188 32322
6862 32322 52221 57462 39482 9463 13856 11682 -1350 25927 53295 29345 28685 17094 13059
6849 13059 30305 45558 62964 35628 19463 15016 15065 5934 -4432 3739 20275 29854 27769
6836 27769 34211 44586 35736 26396 23356 225 -5639 17583 34563 23755 18560 5822 -19584
6823 -19584 -21926 -18038 -14285 -1939 1047 -3468 8962 -18742 -19093 23531 42948 27621 4052
6810 4052 19214 56048 52746 45121 40839 47792 45174 17932 27433 39425 29287 40266 70045
6797 70045 43865 -9159 -15982 -30611 -23767 -9376 6825 27381 14280 8640 7841 -5147 4405
6784 4405 24748 -4025 -22263 -50085 -47732 -20790 -40136 -9993 25565 36561 51611 31884
6772 31884 1021 12129 -3706 -11174 18962 34734 30128 12804 18715 26431 53748 31240 -16411
6759 -16411 -28184 -3841 8503 16044 11485 25353 39531 30628 28840 34020 14633 -10822 -9401
6746 -9401 6097 20390 -4526 -1540 -3083 -9708 -8177 -23905 1544 19420 -2812 -28215 -20758
6733 -20758 -7964 -14565 -10778 6023 7704 15090 12445 21348 42918 55731 27704 10564 -6908
6720 -6908 20853 25386 22978 42382 61362 53348 41449 32642 57843 59312 37111 22069 12585
6707 12585 29387 33811 20077 27506 53297 62201 40898 -2921 15078 26288 35107 44363 12027
6694 12027 -15739 -23843 -32854 -27204 -38071 -18583 11376 17875 14442 10992 14456 -8039 11869
6681 11869 28934 35893 7791 -1184 -23946 -15454 16245 25354 -9031 -23508 -26105 -4454 -23861
6668 -23861 -31766 -10871 27053 32055 7130 23661 54803 62532 36903 16289 18244 35827 33939
6655 33939 6374 5703 -9048 -25479 -46184 -44529 -6673 20784 19225 8028 17547 31673 7698
6642 7698 7447 15154 10804 19239 26429 37763 39815 36913 42408 38971 42269 21690 -19204 -38043
6628 -38043 -41786 -29266 -28757 -27824 -29442 7185 22837 5423 -10444 -11743 3253 -1139 -6144 -12071
6614 -12071 -21219 -10746 -4881 -6908 -34541 -38638 -31942 4637 24259 8194 -3771 -600 -2461
6601 -2461 -4598 7848 10005 17733 10240 7160 8105 -3121 -38610 -46673 -37225 -16327 -3265 -30858
6587 -30858 -50589 -35983 -27449 -36787 -25312 -42186 -20363 -7101 5154 18934 23439 14491 2048
6574 2048 -3205 -11485 9739 27909 35648 32138 24599 42982 48359 69691 35531 -4353 -3963 -26138
6560 -26138 -31509 -16079 -28707 -37189 -19365 -17798 -2291 2557 -3444 -17446 -2728 25573 44881
6547 44881 27720 29816 31196 17891 19322 22831 24103 6852 29346 19270 22090 26638 17157
6534 17157 -15057 -34764 5354 21218 4223 17224 17680 22339 22524 -4851 -35864 -56480 -13570
6521 -13570 5889 10238 30151 44571 53985 44642 47500 31946 12509 3271 -25830 -37224 -36140
6508 -36140 -31883 -24827 -17144 -34875 -45492 -22524 -2165 -993 3210 9457 1254 5610 27670
6495 27670 12343 -13834 -23036 -28748 -27252 -16490 -23601 -32400 -26886 -21728 -20061 -11845 6341 -5727
6481 -5727 -2374 21125 21121 12981 -13174 -20455 -22965 -4191 22882 33102 5043 -20663 -35308 -16514
6467 -16514 -15594 8290 8606 1943 10010 4242 42587 52023 52705 36496 16357 1911 -1358 1063
6453 1063 7643 -1555 6058 33335 48549 23203 -572 -26705 -38333 -35210 -9726 6023 6807
6440 6807 -16265 -22065 -22219 -16602 -5245 3337 -2090 -10452 -13820 -19675 -16432 3130 6677 -15909
6426 -15909 -28661 -10654 7942 -17368 -9999 -41536 -38334 -43273 -45260 -50835 -31294 -18484 -9912
6413 -9912 -4737 3069 13964 22849 29549 20782 21396 23981 9015 -7967 -4666 9866 6753 13163
6399 13163 32583 17865 -22872 -7212 20428 6687 55 -25752 -39355 -30177 -13523 -1188
6387 -1188 16979 41148 33091 40367 40196 25931 17673 8312 19732 14951 -205 -2286 -35368 -41601
6373 -41601 -27915 -32969 -15357 -4540 10874 42728 46761 10748 9160 10394 3690 18512 9109
6360 9109 -3593 12232 10148 -8761 -6268 7243 5503 -6721 -29469 -27251 8591 43300 57465
6347 57465 38403 7892 12508 31157 21021 770 936 305 -3928 -31706 -20317 -7882 1067
6334 1067 -3048 6162 4450 3947 18390 24963 10081 -14120 -14025 -19626 -46283 -59279 -21967 -3134
6320 -3134 -47549 -32017 -144 27459 17403 -4360 -30082 -29849 -17666 8892 5673 -32099 -15324
6307 -15324 7550 4851 25729 53282 12827 17100 34964 31682 18319 3968 -8074 -11847 -11759
6294 -11759 -16163 -16677 -16219 7813 -4585 -30671 -19955 6363 5579 12571 -13724 -5833 -5396 -3922
6280 -3922 18348 28797 47365 41255 17811 8659 34845 48087 53820 35146 16226 26211 36060
6267 36060 21667 7119 -3366 -27915 -43453 -49449 -33692 -26530 -21860 -6368 -6615 4228 14700
6254 14700 1911 -2205 5451 -12872 8179 37862 26029 -307 -17545 -28114 -28975 -11855 -9533
6241 -9533 -22266 -27902 -7908 23604 21688 -13745 -2082 11819 -3382 2203 20724 29361 35089
6228 35089 24387 -1302 -20023 -23353 -23237 -5247 -12111 2562 16082 31015 44587 29883 12414
6215 12414 -2906 -30261 -35789 -30710 -9319 7291 20812 25069 11016 21065 43652 26364
6203 26364 3211 -29894 -54726 -39942 -34734 -30138 -20429 -7282 12680 14713 9241 -5025 -5973
6190 -5973 -15162 -18707 277 -16328 -16575 11542 25043 46113 42735 53180 40923 17536 12010
6177 12010 20333 10526 -922 284 39182 62612 74195 48515 41094 22331 14570 -16373 -46803
6164 -46803 -18042 -16311 4277 19897 18978 -19711 -39788 -27223 -22729 -22774 -14209 4010 15081
6151 15081 13827 35270 14624 20295 20692 20806 25697 26255 1425 -10537 12497 -12031 -38193 -33705
6137 -33705 -26640 -38014 -6000 26600 22203 -4460 -9645 -8133 -12774 -25401 -25709 -17303 -27438
6124 -27438 -40662 -32088 -3928 -1720 -5387 2090 -1441 -2066 15156 28062 15663 21562 36450
6111 36450 20351 16071 23680 22554 8275 -23448 -26913 -18862 -23858 -20000 6031 -26457 -31172
6098 -31172 -24652 -18289 2783 23391 47370 36098 32833 25096 -2109 -17406 -49202 -59607 -53447
6085 -53447 -46388 -33960 -52579 -62078 -42157 -41023 -24585 5664 7904 -19558 -17174 8428 29559
6072 29559 22840 3448 -3559 26526 13783 -14083 9434 5488 23645 33257 9898 -1465 -2136
6059 -2136 12166 24146 8923 -505 7034 -6516 -38846 -43745 -34323 -26560 -2018 10078 -15356
6046 -15356 -35212 -36278 -64579 -50484 -4160 33530 44727 24540 -8349 10260 27200 43459
6034 43459 41038 46523 54935 44463 44016 67649 42002 21483 1679 -5436 -12500 -13345 -24538 -14713
6020 -14713 20236 17583 -4775 -2688 12231 -948 -8732 -1004 18835 17828 3032 -3376 14482
6007 14482 -17180 -46909 -40809 -24752 -1075 2429 -5174 -20327 498 8161 25020 27839 14600
5994 14600 88 -15466 -18990 -154 3405 -15352 -13757 -5274 10646 -6917 -22727 -9402 -15914
5981 -15914 -9801 -19741 2300 12233 5734 -13838 -31732 -28543 -17349 1306 13466 22388 491
5968 491 8607 16657 14951 2944 -553 23169 57092 41901 55048 65260 62677 30880 2273
5955 2273 -20268 -30458 -51190 -52945 -43126 -11825 -4938 -26606 -19104 8431 8996 25322 -6331
5942 -6331 -3619 25989 44952 50743 48785 41889 57074 29861 24922 20702 -1514 -8175 11764
5929 11764 20406 26310 39292 32871 22649 2134 6864 20024 -9133 11464 2354 11496 16064
5916 16064 21242 20229 8136 -22628 -18304 -32603 -10848 -7131 -24186 -24377 -24502 -35150 -64032
5903 -64032 -45447 -28602 -34475 -19598 1101 27668 13801 -19359 -28205 9761 22896 38870
5891 38870 26765 18589 -21394 -60526 -29266 -1143 -8385 10386 25595 1314 -19305 -6041
5879 -6041 -7877 -31410 -21547 -5315 -4218 -22701 -20445 -5092 -10748 -11574 588 30164 29859 7175
5865 7175 2172 31796 50711 49567 40469 31507 34686 20979 -1123 -40240 -12101 -4422 17318
5852 17318 50751 22128 -2740 5144 -17791 -13710 13099 19246 40156 37956 15037 -4245 8111
5839 8111 9986 5239 39286 64678 21519 -16075 -17793 -5855 15518 42911 41916 41107 40665 26649
5825 26649 2359 -21645 -5760 26605 27580 -18810 -39599 -23369 -9198 -9219 -13218 -26205 -37184
5812 -37184 -21301 -13545 -19558 4851 4098 -17341 -19009 13231 42503 34796 12716 -114 -11800
5799 -11800 -13268 -2417 11881 1759 -34934 -24103 -1767 -17835 -13751 21533 23605 -21162
5787 -21162 -29454 -37946 -21955 -160 14452 -3332 -34765 -23657 -11961 7925 8387 -13398 558
5774 558 3483 -17897 -24307 -49437 -29550 -11284 -18013 -22457 -34255 -33492 784 25935 46138
5761 46138 31090 21667 11967 1617 2341 -5551 9532 1069 936 -2568 34567 53927 32178 -22857
5747 -22857 -47735 -41477 -16920 8807 12458 31288 -803 -23578 -37861 -68180 -41531 -12871
5735 -12871 -2330 19714 24010 48054 58386 30435 -4467 -13345 -10629 -24666 -29819 -5385 -12388
5722 -12388 -18966 -34118 -49468 -33963 -27309 -579 9119 12173 15080 13377 -20094 -39746 -20812
5709 -20812 11251 13076 12928 5156 -14132 3869 20730 4156 -18440 3560 253 -10326 -32406
5696 -32406 -25189 -18246 -24499 1877 -13996 -18130 13884 34848 14056 -15812 -42798 -56724 -40036
5683 -40036 -52995 -44179 -36301 -22046 7527 -3342 -911 7102 -27303 -45316 -35453 -10346 -1129
5670 -1129 6649 -3546 -10816 -16404 -23156 -15631 -15881 -12015 -15949 -37322 -51000 -10350 -363 6743
5656 6743 30772 38144 26276 17855 16606 3617 -39292 -43722 -28270 -22804 -2120 24384 10116
5643 10116 7274 10470 -27453 -38885 -24992 -22672 -19758 13981 34508 40694 19971 -37 5491
5630 5491 -7252 -19728 -3630 -14019 -5520 2605 -3040 8777 8567 -3238 -2079 -22054 -2791
5617 -2791 17615 35683 34840 29243 650 -42337 -55554 -49381 -53555 -74542 -70434 -51913 -19081
5604 -19081 6334 -5964 -22576 -12391 8121 6241 528 -4616 17408 27375 5504 10697 13860
5591 13860 -1371 1182 13394 -17209 -32043 -47800 -37491 -23236 15121 54825 72325 60334
5579 60334 37289 47767 54361 38595 51395 44824 8588 50 -10894 -4266 25629 33927 8530
5566 8530 -35840 -45304 -42726 -21481 -27735 5664 25667 7700 -24951 -41059 -66069 -60041 -11789
5553 -11789 21327 39941 15504 10642 12134 -1442 -3988 4926 29055 43614 44176 45634 21357
5540 21357 2862 10022 33031 64399 63155 51984 38985 13685 7395 20678 39772 72765
5528 72765 49068 24509 43088 23204 3013 -28879 -32667 -53766 -58312 -25419 9135 1199
5516 1199 1554 -3721 2454 4576 6972 7643 -9018 4782 18334 5636 1831 18194 -14426 -19498
5502 -19498 43 25597 30406 10174 -8140 -14109 -7240 24489 30975 -6719 -33410 -10531 5421
5489 5421 10115 -8850 1145 14203 -2206 15636 19355 13028 15459 17238 36365 54519 28890
5476 28890 11729 -11127 -3109 20247 17893 23759 1648 -14166 -33908 -25222 320 -1450 8921
5463 8921 554 16056 20454 6026 -416 8831 -1999 -3932 31180 48092 36266 28566 14275
5450 14275 26045 14602 23944 12156 13063 7931 -16660 -30551 -24703 -17245 -20901 -16518 4622
5437 4622 16210 -5236 -23475 -24583 -45581 -27856 5615 -9156 -2623 27229 35655 29807 26651
5424 26651 30365 26173 8653 -8854 -10502 -21939 -32692 -36293 -12607 11487 5082 10192 1307
5411 1307 3505 18321 18858 49287 14695 -36946 -38380 -32243 -41644 -42520 -53919 -57195 -45154 -36656
5397 -36656 -14756 -1836 -3096 -18686 -30640 -34740 -22707 -13476 -10146 -10739 -2680 -10941 -3595 20439
5383 20439 18864 35743 61082 46189 23370 2520 2199 -9021 -14114 -48809 -47746 -14226 -1468
5370 -1468 -8319 4924 14324 29414 23483 4255 5013 9985 12191 16486 7955 -3578 -21149 -12066
5356 -12066 -27824 -43372 -53972 -72587 -48741 -17320 -34232 -25233 -19500 -24805 -23007 -8003 -6358
5343 -6358 -19733 -17067 -9117 26600 10195 17410 29172 30082 16764 -23268 -55255 -55290 -10080 15888
5329 15888 1635 5230 7552 221 3300 -16218 -13659 -10737 -8469 2658 8019 32040 54444
5316 54444 52031 12142 5968 9697 25298 8011 -23175 -2818 4681 -29163 -34456 -38693 -39555
5303 -39555 -21212 -10384 103 28284 23285 26073 17322 11350 -8991 -27211 -30616 -20511 -18927
5290 -18927 -29399 -44792 -42279 -29096 -50258 -23236 -2797 -20229 -19626 -8565 3244 -13754
5278 -13754 1346 36851 47044 45822 38034 28814 22501 29452 7674 -20536 -59758 -65848 -62875
5265 -62875 -52681 -38757 -8562 3389 -3189 -30274 -15352 -7714 6254 14863 1184 1010 17731
5252 17731 25339 17522 15195 19361 5468 -34290 -27379 -743 4385 16821 16457 20311 27677 29323
5238 29323 16746 25102 34276 10102 -10352 -14094 -20752 -9489 -10038 -22418 -22115 -21964 -18675 -3386
5224 -3386 -17125 -19714 -24339 -17016 -20146 -15533 -18669 -31279 -33932 -10709 8340 -1004 -20078 -34235
5210 -34235 -40877 -36023 -1102 6867 1162 -3616 -9513 8461 14498 -8291 -40667 -20664 11534
5197 11534 22750 34459 18035 -1774 -11868 -6168 -16687 -27301 -26653 -37468 -41053 -6581 17444
5184 17444 2478 -24006 -51884 -42231 -26068 -7933 -10279 -9201 -25366 -15035 1071 7368 38376
5171 38376 45729 18100 -407 3648 23943 22195 8796 34845 38402 31162 4325 -1904 5181
5158 5181 8502 -10566 3276 27119 15384 8111 7496 32076 47342 60103 48484 19100 -3119
5145 -3119 -33548 -55945 -31650 378 -4534 -16565 -41205 -47161 -34325 2707 16627 12136 19068
5132 19068 12163 7677 11387 -27551 -42088 -5093 11731 -3221 14450 -1345 -20966 1141
5120 1141 42777 38615 10504 -13639 -19576 -33610 -28021 -42363 -40383 -32246 -10109 -16038 -10571
5107 -10571 -3325 -11079 -28750 -46183 -64082 -29826 -5652 19419 6871 -26492 -30790 -20877 -7653
5094 -7653 -28476 -45827 -46523 -12882 -6341 -31337 -37634 -27518 -14411 -20727 -15849 -7572 -28052
5081 -28052 -22621 -33430 -28756 4535 27739 15893 18755 21609 -8166 -22695 -28413 -42743 -4529
5068 -4529 9832 4131 14076 -1411 -26585 -36703 -27458 -6464 -19533 -26384 -29758 -15345 3827
5055 3827 -2755 -11392 -1133 3895 -5094 2154 7880 -14757 -8387 -11385 -42914 -52799 -6641 22605
5041 22605 36375 17065 -34931 -59558 -71575 -26712 -5248 9143 27259 29263 16009 -9639
5029 -9639 -20457 -1510 5373 25918 23310 16662 -1067 1119 -27437 -26622 -17817 -16373 -19338 -16029
5015 -16029 -33261 -32630 -17046 969 17762 6926 -1985 -514 64 2485 3004 -5743 -39054 -42681
5001 -42681 -21766 -25911 -12400 -15018 -19703 -34674 -34050 -53933 -75415 -42822 -24622 -15026 -19999
4988 -19999 -31721 -50232 -34492 -9054 -14137 -53724 -52263 -27928 -2306 -1181 5292 14214 -3795
4975 -3795 -27390 -25384 -14202 -12715 -6521 50 4290 7881 -16006 -45789 -24734 -19818 -64431
4962 -64431 -72122 -65201 -43000 -48309 -54894 -58999 -54051 -38187 -23890 -47861 -28200 13547 656
4949 656 10873 34151 44426 33881 23989 12104 -14557 -8512 19777 15581 -20898 -19695 -43537
4936 -43537 -20621 -5714 3985 -33843 -50991 -16357 -7547 5952 14912 11726 -26378 -30397 -8712
4923 -8712 -34646 -54416 -48038 -62781 -45909 -34787 -31213 -40588 -29874 -42124 -21216 1282 -20106
4910 -20106 -8435 -9314 812 11291 8425 1036 -15185 -6495 -3079 -4151 6414 -14674 -22448
4897 -22448 -2383 25773 15132 -5000 9690 -3840 5554 -16820 -19649 -10209 8425 13732 -4281
4884 -4281 7962 28015 26528 15707 20557 38102 31675 -15195 -13776 -7919 22850 17020 -6214
4871 -6214 -7419 -28390 -58206 -29300 -27483 -43300 -57278 -46069 -34608 -27591 -23923 -47216 -62277
4858 -62277 -56742 -60076 -23374 -6925 8752 -3928 -28561 -25712 -25724 5619 7995 12267 -5745
4845 -5745 -64 -13780 -30763 -32001 -23971 -23989 -28965 -39789 -38706 -6635 17964 22624 23577 40705
4831 40705 43916 31098 14530 -2414 -9181 -8452 -15545 -17964 -25916 -32659 17410 35562 8724
4818 8724 -19787 -31664 -17873 9161 -659 -41307 -37768 -12359 -11268 -8088 14458 32189 25575
4805 25575 5331 4995 31381 39722 37404 16468 8517 25564 -1092 -25450 -32170 -10394 -5319
4792 -5319 14688 8687 10291 -1029 -28523 -48727 -48792 -30872 7417 470 -28118 -9197 5934
4779 5934 23542 46606 49007 40108 21581 33067 68165 94775 74153 38227 11200 32464
4767 32464 18775 1710 -11508 -6189 23515 38804 29847 13128 12978 34246 30407 30337 19871
4754 19871 21281 4150 8847 5041 2435 -13475 -45159 -62335 -58840 -3738 23941 -3612 -24127
4741 -24127 -26461 -21776 -16804 -1961 25 -11488 -1993 3076 28439 -4187 -21229 -17290 -5691
4728 -5691 -13668 -19959 -17412 7049 2364 -41163 -62962 -42853 -33543 -16600 -23015 -1700 -10273
4715 -10273 3591 1434 2499 18851 10392 -2267 16257 16121 5801 1079 2767 19350 17914
4702 17914 -1405 3582 12057 -3779 -11954 2599 23300 39685 29810 -2723 -527 -3383 -17615
4689 -17615 -5879 -2119 -16535 -32373 -46667 -24644 12048 38449 43321 34168 15874 4220
4677 4220 1997 -4442 20539 44772 34700 25054 20470 30739 39527 21052 -33296 -20462 -8274
4664 -8274 -33812 -30509 -17716 -27157 -64842 -84065 -77919 -40994 -26171 -13670 16620 53521 59459
4651 59459 64810 51218 40873 33471 39120 31359 8851 -14578 -7895 7886 13234 18092 17355 15164
4637 15164 1309 13370 32641 2909 -12638 497 3373 -34390 -27161 -29188 -38613 -43803 -48158
4624 -48158 -39463 -46422 -67750 -76764 -55217 -39449 -20583 -18971 -29499 -47382 -45652 -44714 -44672 -28001
4610 -28001 -16402 -21336 -33904 -15935 28960 36717 7699 22211 21857 2713 2643 -17897 -29512
4597 -29512 -41071 -48602 -40442 -20764 -18751 7622 25313 12526 -7504 -38749 -29330 15279 32366
4584 32366 22737 30665 23024 6580 19701 24997 12792 -5881 2724 -19841 -9570 4629 -113
4571 -113 -13272 -7072 436 -16587 -22463 -5456 12789 -1651 10106 15171 48969 18828 4002
4558 4002 -1872 11392 28425 26853 17416 5081 11813 9352 13900 15546 -28228 -18230 -4370 -18452
4544 -18452 -19212 2769 8098 4311 -18183 -27528 1585 10691 -15541 -41453 -28954 -4138 -10000
4531 -10000 -7296 -23565 -21549 -12676 -7215 -17395 -22242 -21325 -43268 -49385 -41448 -19796 -33069 -30238
4517 -30238 -16537 8913 1005 4370 17335 21703 21529 -5094 27854 42280 32267 9603 -6599
4504 -6599 -7011 3430 -9623 -18898 -19428 -18955 -6423 -10738 -11811 4243 12601 2271 -13680 -25209
4490 -25209 -32015 -12330 -26995 -19745 -10195 -12567 -15462 -9333 -30725 -50239 -43355 -59086 -55610
4477 -55610 -33798 -27573 -13841 -13052 -14687 -20110 -55937 -60197 -26333 -40344 -42957 -37526 -48240
4464 -48240 -16328 -14416 -45648 -32060 -27816 -26658 -32024 -53057 -85590 -27472 4225 1862 5149
4451 5149 -4320 -2524 -20868 -28490 -18548 -16380 -25633 -44421 -48041 -69425 -60098 -61032 -55805 -37081
4437 -37081 -9995 -9407 -8007 19724 32063 44235 36044 18288 13005 15980 31459 40986 19553
4424 19553 16438 29529 58345 33177 11913 -2979 -4900 14481 -9565 -21127 -20674 -14279 -8489
4411 -8489 2727 -4676 -14479 -11287 -36015 -51075 -42354 -44983 -39136 -46809 -42751 -47727 -39196 -38431
4397 -38431 -51506 -52550 -38262 -39838 -13697 -14627 -15627 8641 -8488 -44486 -37840 -12942 -15906
4384 -15906 -29457 -31059 -12555 16519 -9733 -13312 -27582 -35246 -41125 -24789 -18344 -13087 -22994
4371 -22994 4933 30177 48605 35872 10711 19570 -3163 -10126 -15339 -6998 9565 6026 -17153
4358 -17153 -41115 -47207 -46305 -21723 -18594 -48471 -44265 -41058 -43779 -29844 -16062 3419 26969
4345 26969 22830 10264 -3066 2161 -266 -11440 -20570 -40063 -39081 -34343 -37163 -35876 -30959 -5602
4331 -5602 10686 -11976 -37627 -45980 -12433 19478 -260 -11793 -16332 -15572 -20142 -35718 -6908
4318 -6908 7007 -2036 8033 5345 -21865 -41699 -50946 -48660 -42241 -34179 -25160 -22744 -28516 -35350
4304 -35350 -38112 -69440 -52087 -42845 -35440 -13402 -11460 -35111 -14695 10275 -4523 -34998 -51508
4291 -51508 -22129 19574 5746 -17627 -14158 -11763 4575 16301 1897 -12701 -16908 -27504
4279 -27504 -24056 -22555 -28364 -14498 -1432 23879 25424 26539 80 2329 -20786 -47693 -45919
4266 -45919 -19237 13338 10487 -26605 -36546 -8903 -1359 -4771 9391 14852 9071 12661 -4168
4253 -4168 -23903 -24201 -2681 -2444 -13006 -29768 -19998 -18079 -5786 -14571 -8092 -11764 -2689 -12164
4239 -12164 -10621 -8231 -16943 -5523 19430 26218 -20488 -55284 -45605 -21235 10595 8065 12575
4226 12575 730 3560 5475 -3690 -6890 -40859 -31087 4496 12994 7464 -3426 -8446 4581
4213 4581 -32749 -64126 -63442 -38485 -46002 -48504 -24414 -34 19781 11199 15637 16158 5450 -4607
4199 -4607 -9016 -6125 1920 -2102 -16752 -3021 31020 6883 -7634 -35601 -45243 -32558 -15437
4186 -15437 -20946 -35121 -15167 -8481 14265 11480 -16601 6366 12959 24593 18931 12223 13842
4173 13842 17474 24702 14176 12706 -3705 4895 -1501 -16620 13473 42956 22598 823 9670
4160 9670 32455 19885 -20887 -20084 -17834 1078 13106 24878 19504 30287 20703 -10172 -44176
4147 -44176 -25799 -22979 -24914 -12983 -14265 -23773 -31286 -27839 -25184 -47906 -56264 -42684 -34811 -4840
4133 -4840 -1653 12303 17514 7946 -133 -1064 -5542 21082 14477 13343 20710 4673 -1968 -10769
4119 -10769 -30562 -35128 -21125 -5431 7088 -22830 -48474 -48805 -48364 -34754 -12427 -10631 -19223
4106 -19223 -9906 -15685 -20975 -12316 -46894 -78729 -56885 -34874 -43583 -61657 -30663 32309 43054
4093 43054 14164 -15348 -36219 -44701 -34037 -36520 -45756 -33434 -11497 7056 10840 20527 6539
4080 6539 -20153 6721 18219 15123 5956 44875 43827 32290 22281 -7479 6138 22994 13113
4067 13113 14445 22835 11359 35270 51142 17104 6501 30836 32761 10527 -11634 -15275 -22783
4054 -22783 -50161 -52081 933 45388 66303 50766 43956 37430 26244 -13518 -8933 8128 -19293
4041 -19293 -27951 -24366 -20965 -14620 -15807 -19099 -7839 18152 22299 12271 -3904 -40377 -41061 -15629
4027 -15629 2180 -22047 -69107 -49653 -14414 -10941 14550 6745 -2699 4555 1308 -15576 -8737
4014 -8737 -4030 -6493 -6792 8128 2752 3150 -8088 8832 20170 34745 50636 46991 31009 11677
4000 11677 4914 -15981 2260 12375 35003 48523 48399 23044 -9277 -18832 -19806 677 14143
3987 14143 -4000 20686 41734 6685 -27652 -4154 4792 20559 12827 -13654 -15132 -2615
3975 -2615 3820 -11242 -23787 -21288 -30297 -1058 22155 12301 -17846 -1663 12898 11530 -6974
3962 -6974 -26056 -27048 -2901 9870 -3336 -29977 -37875 -19100 -13348 -29378 -29787 -16009 -11818
3949 -11818 6053 25512 35250 52627 56032 51751 31185 21931 27175 19511 5356 -17154 -49779
3936 -49779 -64072 -40684 -22737 -35542 -52662 -47670 -32704 -60 35481 27996 24985 31764 13876
3923 13876 -1351 16510 15377 12722 21806 12651 -33745 -26495 -9147 -9886 8431 10234 -7330
3910 -7330 -26526 -26815 -33073 -24503 -44760 -65073 -64985 -81191 -77791 -48180 -34495 -18614 221 -6397
3896 -6397 -29117 -18544 -5208 6252 -3790 -24360 -46063 -39799 -42079 -48721 -51995 -43568 -54389
3883 -54389 -34088 13509 20672 -4208 -25605 -34763 -42220 -21974 -94 -11127 -24587 -21925 4280
3870 4280 26876 35039 20434 15643 14673 29436 51323 67260 70558 47894 12204 496 978
3857 978 -442 -14389 -14561 -4251 -7100 -32469 -34163 -21712 -20271 -24744 -9503 -10917 -13098 19812
3843 19812 29203 43877 31610 21139 -6491 -8391 -21056 -25387 -24087 -18500 -27329 -37955 -36274
3830 -36274 -14139 -8605 -21115 -35271 -52549 -33524 -22155 -20588 -32281 -48681 -46577 -51944 -49493
3817 -49493 -57366 -31703 -16849 -27704 -52533 -41971 -33067 -5256 16805 13073 20387 20417 16698
3804 16698 4906 -615 23687 16945 11615 -3313 8551 35767 54480 17879 5193 10072 -6393
3791 -6393 -11288 -10230 -25916 -30216 -34974 -25289 4547 15802 3329 801 11664 -4815 -1273
3778 -1273 9026 3380 -6169 -6863 11562 -3462 2970 -7704 -18978 -20850 -29927 -31559 -24967 -25514
3764 -25514 -7818 -6717 -17891 -3814 -4971 3367 -8884 -32263 -57864 -47821 -20066 -12678 -11388
3751 -11388 -6442 -8900 -27994 -56556 -47678 -13472 -6981 -10510 -13169 -14041 -37208 -34262 4277 -520
3737 -520 -25983 -30893 -22447 -8147 -11444 17968 17756 -12555 -26756 -31030 -35829 -29555 -39013 -1059
3723 -1059 17311 6379 -15378 3454 3986 -12127 -37648 -16002 10939 14909 28014 10195 -13728
3710 -13728 -61715 -85618 -68220 -43407 -20430 8771 13420 8458 -2151 -8862 -2538 -827 -1736
3697 -1736 -27958 -57685 -32718 -24894 -33598 -42956 -5445 -1234 -3868 11280 15076 4864 -12462
3684 -12462 -11172 11610 36056 -689 -13348 -2704 -29325 -44370 -43035 -62665 -49436 -5525
3672 -5525 1796 -23545 -25874 -2607 35588 54383 42151 8211 -29646 -12516 22794 44096
3660 44096 36217 22855 18139 8921 10635 13940 14224 -20312 -21367 -10723 -31950 -52862 -40892
3647 -40892 -19317 -18250 -35674 -31747 -7927 -3204 2004 19788 -1585 -34133 -46079 -27015 3279
3634 3279 -23309 -34134 -19715 -33811 -32151 -11832 -7316 -9530 -3070 -25735 -41523 -53323 -78275
3621 -78275 -78058 -72184 -77856 -52857 -11491 -17859 -19465 -1945 -5521 -30377 -36812 -17134 -36021
3608 -36021 -65484 -62531 -54672 -43248 -17548 8938 -2847 -8425 -732 -7583 -16062 -436 19752
3595 19752 -209 10593 8104 28441 28934 15833 1290 18956 58556 47721 26963 17583 -7884
3582 -7884 -14689 7812 47586 49657 35839 13357 14903 3675 -32814 -41215 -38739 -44008 -60846
3569 -60846 -46974 -55294 -58329 -57643 -53486 -39236 -33710 -26392 -22824 -11333 8784 11184 19026 26784
3555 26784 33532 30619 28096 11252 4404 17694 17267 13803 13015 18700 20299 -41438 -49765 -34125
3541 -34125 -30596 -9994 1221 -22004 -30412 -4079 -12747 -15958 -8016 -4380 -33511 -42201 -32548
3528 -32548 -17935 6538 11144 -10052 -14929 -21004 -36748 -39284 -49067 -47468 -25099 -24847 -11971
3515 -11971 21626 4122 -19760 -25484 -31801 -31279 -16962 1739 -418 -9591 -35902 -44627 -48814
3502 -48814 -51219 -6319 114 9546 -379 -13649 -13778 -15796 -19780 -27879 -2223 -2394 4053 13405
3488 13405 27551 27497 28113 -10335 -14682 7482 -15674 -24478 -13926 -4285 -16806 -8909 2924 -3446
3474 -3446 -19830 980 11287 -20064 -11678 -10682 -21122 -26661 -2721 2263 -4657 5442 -5473
3461 -5473 5985 -4522 -10603 -12746 13641 26636 18918 -7385 3371 3429 647 15170 9850 10519
3447 10519 1978 -3683 -7337 -37303 -54927 -64458 -59867 -39919 -6967 9832 18006 6476 -4577
3434 -4577 -3292 -7083 -25147 -32501 -30804 -31393 -37602 -7103 -21266 -45461 -42387 -31264 -11588 -9376
3420 -9376 -17612 -39525 -50844 -58229 -64862 -65277 -58924 -54650 -53510 -25046 -27711 -36966 -21843 7702
3406 7702 11212 11737 -2611 -29662 -70232 -88853 -68255 -61834 -44453 -33527 -9242 -8917 -9973
3393 -9973 -19937 -20135 -6240 4564 8407 3103 -3124 -14035 -20848 -23425 -28314 -43794 -38398 -4575
3379 -4575 12258 -7382 25335 37081 567 -3254 28118 27277 6404 -19012 -1537 1031 -13426
3366 -13426 -29070 -27981 -38073 -39783 -1803 -8729 -18223 -10888 -14172 -20268 -38314 -55829 -50110
3353 -50110 -68044 -53596 -30405 -8318 11053 7906 -7872 -40217 -47029 -37138 -20799 -2726
3341 -2726 -16232 -20727 -3226 -8253 -24872 -6406 8443 -1874 5089 13500 -5388 -13752 22063
3328 22063 43026 -4213 -22439 -1027 19409 16896 1389 4410 1161 17949 15551 -9378 -21244
3315 -21244 -16850 -23424 -17593 438 -4171 -9922 9178 13531 14905 10032 8695 -1110 -32318 -31732
3301 -31732 -33290 -46514 -24297 -28436 -10861 -6190 -16254 -29147 -16106 -11201 -4213 10131 5873
3288 5873 11569 -5311 -14858 -12472 -5742 -18682 -19238 -17586 -41402 -34821 -34704 -49468 -34365 -225
3274 -225 36772 18131 5096 10027 -13665 -11761 -11174 4410 13098 -2031 -8172 -3981 9293 43675
3260 43675 3823 -24783 -39838 -45873 -44499 -22036 -36257 -31495 -16460 -41654 -46488 -38699 -28975
3247 -28975 -18365 -31038 -32687 -1903 9235 8967 11761 22801 20600 17185 -2320 -36760 -44775
3234 -44775 -17967 3318 -19180 -22680 -17088 -19006 -1474 19166 39810 32637 5372 -4019 -11775
3221 -11775 -16149 -784 18650 22126 16539 7494 20336 11806 -12964 -3379 -10358 -41269 -35958
3208 -35958 -37838 -25370 -26305 -18445 -34472 -35945 -45 30709 10502 -12623 -14076 -10015 -9737 5951
3194 5951 12815 2369 -18405 -28111 -34519 -53587 -37406 -19618 -39080 -64401 -49720 -31448 -5180
3181 -5180 -15032 -20251 -23095 -41415 -42814 -33360 -10967 -38629 -55251 -20123 9477 -1630 -10797
3168 -10797 -30622 -17907 -12468 -2111 -5110 -26275 -21141 -5224 10454 5821 -7895 -7583 -34790
3155 -34790 -25149 -29806 -41299 -37664 -46061 -44099 -43324 -27184 -27428 -36368 -24334 -24635 -28925 -1805
3141 -1805 8792 -2401 15937 48507 -3079 -21865 2415 12147 9642 22580 1617 -29547
3129 -29547 -45956 -29216 -15054 5257 835 4709 9188 23402 2631 16098 8988 -6849 -9912
3116 -9912 8460 19996 4368 -21347 -32444 -22442 -20204 -9548 -17019 -20416 -3367 9607 -2284
3103 -2284 -14406 -9218 -33082 -26721 6450 15389 -6314 -1843 -6976 -10848 -12603 -12314 -35530 -30269
3089 -30269 -18397 -21616 -7730 -832 1889 23105 13266 18711 -1018 -688 -1100 -14781 -26870 -51842
3075 -51842 -59344 -68452 -29471 13095 7098 4086 21168 25196 -6795 -16419 -8128 -11284 -38401
3062 -38401 -55782 -21381 9310 12892 46887 37602 25387 -3955 -24562 -24204 -44198 -38246 -31470
3049 -31470 -51906 -60541 -21835 -4976 -21091 -26138 3092 7968 -25009 -46827 -35099 -20196
3037 -20196 -11454 -9320 -18468 -32644 -11318 6174 -29865 -24498 -3386 -1235 -9452 -10843 10616
3024 10616 1755 -2122 9372 12871 11958 12106 13050 28816 25603 305 14059 15036 -459 -28108
3010 -28108 -48245 -63056 -45193 -10821 9763 41 -14083 -2928 6402 -20607 -23016 -17493 -29148
2997 -29148 -41418 12082 35919 23244 -604 -3173 -5029 5315 12433 33414 28864 12372 -15386
2984 -15386 -14280 -13420 -35809 -68350 -66869 -42416 4244 1543 -28778 -27238 628 6515 -14875
2971 -14875 -28187 -56995 -31273 1630 17473 6322 -21020 -16939 -4912 -23 -23542 -53154
2959 -53154 -57220 -59752 -42847 -15613 -10988 -17298 -22865 -30633 -3702 8121 -31913 -35914 -9276
2946 -9276 23982 37326 26973 2715 -17981 -3900 44027 17746 1791 3748 15282 -25640
2934 -25640 -17684 9826 24761 34991 27899 31875 49035 24332 32432 50067 51869 25731 25763
2921 25763 17327 45796 57387 34972 31496 17857 8998 14736 38930 36741 15832 11460 7237
2908 7237 4334 -13961 -11504 1616 41468 44466 64255 112696 110403 70842 17330 21996 2889
2895 2889 -11630 -17452 11419 54654 29762 17935 4053 -38004 -27525 -18679 -20724 -2720 5200
2882 5200 -2161 -4600 -6219 -29699 -48293 -25233 -41751 -55296 -28036 -1462 -1952 -18179 -27661
2869 -27661 -17145 -20895 -4776 24037 38699 60686 52787 34406 24147 1861 13325 30582
2857 30582 11504 -28323 -44521 -39231 -13042 -932 34450 19738 30877 43095 31548 1640
2845 1640 -23895 -12855 -8564 8170 -877 9561 -2150 -9268 6359 -7895 -23512 -35997 -27619
2832 -27619 -30877 -63934 -54895 -34250 -17851 23189 62617 33752 14252 19706 5910 -4878
2820 -4878 -19081 -33761 -18395 -43509 -33735 -10843 -18815 -59616 -58092 -50211 -54557 -63323 -74060
2807 -74060 -75256 -62121 -50666 -30034 -19622 -12316 -7034 10810 26075 13072 13926 7089 -11557
2794 -11557 -26589 -9502 15729 3475 -18577 -29979 -46147 -46257 -22034 -24752 -14930 -28490 -9504
2781 -9504 26106 20405 19927 34559 65051 14555 -6751 8646 -9115 -10981 -19443 -21691 -42851
2768 -42851 -7787 -9113 -20268 -29014 -21044 6026 16643 -17384 -35653 -43498 -40458 -40159 -45539
2755 -45539 -14928 10707 35801 33705 5834 910 18481 34571 55598 71021 57903 31575
2743 31575 11311 7165 -9703 -10035 -5136 386 -12998 -11276 4293 27783 28114 34185 35407 36357
2729 36357 29795 13574 -24584 -24159 -19309 3703 38755 36288 -1243 -10743 -9084 -13952 -1750
2716 -1750 31807 32288 14453 1974 6020 7967 12445 -12774 3086 28128 55956 43805 35500
2703 35500 25393 -2738 5423 23561 25509 24218 30288 32820 22987 37426 37378 8393 -9084 -13980
2689 -13980 -264 -22699 -26739 -10061 -34609 -29216 -3702 11569 10798 24898 470 -42999 -36110
2676 -36110 -2229 1627 -15829 -22861 -18418 4209 1449 -13347 9390 21147 37784 41502 14298
2663 14298 -12479 -2750 18535 24155 35064 13518 965 28715 50469 45323 43431 11550 -8617
2650 -8617 18886 14338 -30779 -25116 1095 19796 11605 20054 2537 9789 386 -8803 -4714 -3815
2636 -3815 -7679 -9512 23609 29386 39939 51951 20316 -3616 -21403 -37825 -52495 -36903 -30212
2623 -30212 -7121 15800 32619 11284 19278 -993 -13793 2397 27831 28265 32737 31447 19245
2610 19245 -2837 2723 -349 3808 5503 2627 -23893 -4624 29466 39616 17680 -2658 -12478
2597 -12478 -10923 -21058 -39343 -5975 5163 -2415 22463 11568 -16033 -19666 -9629 -20619
2585 -20619 -17772 -5470 6400 20636 6651 -1431 -13193 -17951 -6108 8840 25861 31593 14863
2572 14863 9317 3531 5290 29180 38152 3735 -7144 6887 -10863 -40374 -33452 -26504 -22619
2559 -22619 -36800 -30932 971 39825 44157 25190 19731 20266 25056 30741 26971 21262 10042 12330
2545 12330 3449 -9495 -25664 -31841 -38265 -54185 -44601 -36944 -26556 -11560 -13026 11317 3649
2532 3649 -11899 -10417 -13975 451 -2202 -5524 -9195 2645 13478 17788 18979 16290 -12690 -15767
2518 -15767 -14450 -3194 -19087 -14547 30091 16255 -24764 -12426 -7106 -5112 18283 24872 13916
2505 13916 -4157 11033 32891 60068 70276 30800 8552 2820 19350 21752 3619 -2599
2493 -2599 2166 10674 17769 21006 8589 22626 26158 -13403 -5976 9365 20865 25216 28403 13242
2479 13242 -1708 -27214 -10093 10383 27417 38778 32765 28192 12907 12579 37249 11400 -5226
2466 -5226 21067 36664 30653 37039 45706 21124 22420 19567 20065 7836 15470 30459 44007 21163
2452 21163 9012 -4399 -10206 -21466 -31663 -16856 -3048 -3236 -7059 -7417 23412 15162 -15755
2439 -15755 9314 -14040 -3857 13898 22510 14155 10678 -13955 -36379 -31268 -16007 9883 10574
2426 10574 -5467 -25199 -20801 -15905 6982 4275 23636 7810 -10410 -10042 -6594 -7682 -1559
2413 -1559 -19104 -25638 -16143 9886 48579 59114 46294 38717 -3447 -21222 -17917 -23851 -19163
2400 -19163 -14541 3077 24530 13527 -21137 -12380 6988 -863 -12645 -38949 -37411 -27544 -45958
2387 -45958 -44922 -35854 -3522 22485 15255 19253 18015 7568 6212 13863 33358 49188 33528
2374 33528 -2173 -11491 -19951 -22530 13906 9034 -2359 36901 23196 -15491 -28881 -49779 -69910
2361 -69910 -62059 -14704 3605 8514 -12212 -16040 -29460 -22058 6102 24469 875 -31692 -47420
2348 -47420 -68028 -55448 -23725 -38255 -66030 -63655 -34688 -20411 -35868 -28809 -9018 -21601
2336 -21601 -23864 -27523 -18660 12310 -1458 -10844 -5616 13364 2032 16730 33173 19349 -170
2323 -170 -23734 -2876 27823 33247 33754 33239 17370 5955 -8612 -12955 7037 351 -3327 -2961
2309 -2961 -1373 42533 12915 -25040 -21888 10799 26968 22918 24538 15842 -864 -9320 -30751
2296 -30751 -10663 -18562 4756 20629 19837 33484 31842 44562 32329 15208 -830 -22228 -7982
2283 -7982 -19234 -10511 13077 20842 17101 8125 870 16697 10985 -7671 -17737 -11893 31828
2270 31828 21857 8106 3570 -2747 -3228 13866 46851 57924 35776 8245 -3741 5397 -6412
2257 -6412 -9322 4412 2687 -26208 -33163 4427 18901 12666 -17381 -21364 -33554 -33171 -14721
2244 -14721 -340 -15547 -14236 -11467 -27495 -55532 -39231 -48554 -36892 -45032 -33194 -25536 -4624
2231 -4624 -5685 17981 8245 9695 22148 14076 13029 -16264 -44294 -40383 -61257 -64152 -65510 -49282
2217 -49282 -25502 -15243 13451 18825 20167 13024 22114 2202 27189 54736 27599 2476 11354
2204 11354 34548 26393 11541 -10132 -11178 14214 6604 2391 -3166 -16218 -30705 -23703 -8413
2191 -8413 8253 -21169 -14575 -7918 -26140 -14387 12509 4624 -8180 -26293 -36097 -9939 8475
2178 8475 2986 16329 7523 11650 20376 28002 67031 57465 34563 48452 68731 105235 96551
2165 96551 65443 58406 46170 26770 42628 48514 17911 -11670 -16987 -26646 2854 31446 47162
2152 47162 45427 12354 6391 -16704 -13585 4096 -6316 -14573 -12940 -17540 -25235 -33141 -58893
2139 -58893 -54269 -59070 -41477 -19807 -7746 4544 2728 -9173 -23935 -22870 -11333 -7158 -18852
2126 -18852 -21667 -35549 -28232 -19101 -26503 -36456 -17370 11358 34991 68735 60005 27937 -13287
2113 -13287 -27958 -35458 -35133 -1621 15867 46587 35266 4574 13085 25755 25512 33823 26186
2100 26186 -1278 -13853 9089 -17295 -32397 -51966 -34399 -3768 -10662 -54639 -57815 -31863
2088 -31863 14321 26097 18877 7979 -4346 21644 15406 -6413 -15480 -6848 -15038 -37553 -38101
2075 -38101 -23263 -26212 -34690 -54328 -38559 -16899 14694 28156 457 -3660 2743 12156 13466
2062 13466 11191 -8998 -15968 2629 20629 40648 30887 16775 31393 44062 32026 6106
2050 6106 1037 4871 8106 23419 30913 32062 3998 -2346 5523 12049 11204 17464 2303 -42888
2036 -42888 -56815 -58374 -33112 -38642 -29581 -15967 -35452 -48461 -19229 -12555 -51920 -42855 -29827
2023 -29827 -18247 -16275 5460 8861 6035 -865 -5592 -10879 -37815 -18782 -8020 6262 -3981
2010 -3981 -4805 5275 10292 795 -2026 -3833 -19240 -7732 -23476 -25989 -20066 -6442 -8995 5695
1996 5695 1954 12233 -1959 6405 15967 14548 6406 12482 28567 40797 22201 -22181 -36323
1983 -36323 -31869 -35631 -38906 -22854 -429 -6251 -20357 -3610 15413 3371 732 -14085 -1842
1970 -1842 -11065 -27005 -16248 -9979 -19963 -33410 -35665 -20559 -9787 2093 17907 14490 -12062
1957 -12062 -13417 -1277 -3507 -6017 -3808 -10076 -16750 -15087 -2983 -10626 -8943 -14008 -17019 -8625
1943 -8625 -14070 -19143 -9967 5026 -1465 -16223 -19927 -17051 -17626 -28421 -37188 -7477 -13931 -31303
1929 -31303 -11158 17417 20372 13987 -3291 9451 37245 25650 8269 18469 7123 -5437
1917 -5437 11036 13562 16551 -3226 -37723 -39332 -39645 -33724 -31055 8139 35276 7897 16114 19635
1903 19635 6503 9642 -5850 -13265 -37110 -40791 -6127 9159 13412 23216 20346 21902 35821
1890 35821 46511 39480 38450 26076 28685 30839 14306 -12475 -23247 -9772 16508 27416 40857
1877 40857 35662 25754 -8864 5690 42302 29951 -10089 -20146 -10609 -14747 -10862 -17276 -32245
1864 -32245 -23173 -3279 1444 -5719 -23510 13332 42596 48922 47939 43433 19231 -554 6362
$$ [...]
##END NTUPLES=NMR SPECTRUM
##END=
