##TITLE=Analysis number 329980
Compound Code cc 67808
Book Reference 521/125
Project Code adrs
Chemist Name evam
##JCAMPDX= 6.0         $$ Bruker NMR JCAMP-DX V2.0
##DATA TYPE= NMR SPECTRUM
##DATA CLASS= NTUPLES
##ORIGIN= Bruker BioSpin GmbH
##OWNER= nmr
$$ XWIN-NMR		Version 3.5
$$ Wed Oct 17 13:24:09 2007 GMT Daylight Time (UT+1h)  MAYBRIDGE\nmr@NMR_250MHZ
##.OBSERVE FREQUENCY= 250.131544655141
##.OBSERVE NUCLEUS= ^1H
##.ACQUISITION MODE= SIMULTANEOUS (DQD)
##.ACQUISITION SCHEME= undefined
##.AVERAGES= 16
##.DIGITISER RES= 18
##SPECTROMETER/DATA SYSTEM= dpx250
##.PULSE SEQUENCE= zg30
##.SOLVENT NAME= CDCl3
##.SHIFT REFERENCE= (INTERNAL, CDCl3, 0, 16.522)
##AUDIT TRAIL= $$ (NUMBER, WHEN, WHO, WHERE, WHAT)
$$ ##TITLE= Audit trail, XWIN-NMR		Version 3.5
$$ ##JCAMPDX= 5.01
$$ ##ORIGIN= Bruker BioSpin GmbH
$$ ##OWNER= nmr
$$ C:\u/data/dgb/nmr/ADRS/840/pdata/1/auditp.txt
$$ ##AUDIT TRAIL=  $$ (NUMBER, WHEN, WHO, WHERE, WHAT)
(   1,<2007-10-17 13:23:43.91 +100>,<MAYBRIDGE\nmr>,<NMR_250MHZ>,
      <created by zg, POWCHK disabled, PULCHK disabled
       configuration hash MD5:
       76 6E 9A 78 1E 09 19 81 EC 84 63 8F B0 6A 59 2D
       data hash MD5: 64K
       81 E2 B0 EF 20 9B AD 2C E7 7C 7B DD 34 8F 92 D6>)
(   2,<2007-10-17 13:23:58.69 +100>,<MAYBRIDGE\nmr>,<NMR_250MHZ>,
      <Start of raw data processing
       ef LB = 0.3 FT_mod = 6 PKNL = 1 SI = 32K 
       data hash MD5: 32K
       EC 0E 8D 5A DF 44 54 F7 36 19 55 AF 69 9F 02 6C>)
(   3,<2007-10-17 13:24:00.30 +100>,<MAYBRIDGE\nmr>,<NMR_250MHZ>,
      <apk 
       data hash MD5: 32K
       6B 58 52 6D D2 84 20 1B 25 0B 47 E3 74 67 E1 2D>)
(   4,<2007-10-17 13:24:01.07 +100>,<MAYBRIDGE\nmr>,<NMR_250MHZ>,
      <abs ABSG = 5 
       data hash MD5: 32K
       90 1D 4F 9F 4E 39 DE 99 0C 97 2E 3F F1 F8 E3 DE>)
$$ ##END=
$$ 
$$ hash MD5
$$ BF D0 6F A6 DD 05 CB 57 3D 59 62 B8 B7 54 9B 1F
##$RELAX= 
##$RELAX= 
##$RELAX= 
##$RELAX= 
##$RELAX= 
##$RELAX= 
##$RELAX= 
$$ Bruker specific parameters
$$ --------------------------
##$DU= <C:\u>
##$EXPNO= 840
##$NAME= <ADRS>
##$PROCNO= 1
##$TYPE= <nmr>
##$USER= <dgb>
##$AMP= (0..31)
100 100 100 100 100 100 100 100 100 100 100 100 100 100 100 100 100 100 
100 100 100 100 100 100 100 100 100 100 100 100 100 100 
##$AQSEQ= 0
##$AQ_mod= 3
##$AUNM= <au_zg>
##$AUTOPOS= <26 >
##$BF1= 250.13
##$BF2= 250.13
##$BF3= 250.13
##$BF4= 250.13
##$BF5= 500.13
##$BF6= 500.13
##$BF7= 500.13
##$BF8= 500.13
##$BYTORDA= 1
##$CFDGTYP= 0
##$CFRGTYP= 5
##$CHEMSTR= <none>
##$CNST= (0..31)
1 1 145 1 1 1 1 1 1 1 1 1 1 1 1 1 1 1 1 1 1 1 1 1 1 1 1 1 1 1 1 1 
##$CPDPRG= <>
##$CPDPRG1= <>
##$CPDPRG2= <>
##$CPDPRG3= <>
##$CPDPRG4= <mlev>
##$CPDPRG5= <mlev>
##$CPDPRG6= <mlev>
##$CPDPRG7= <mlev>
##$CPDPRG8= <mlev>
##$CPDPRGB= <>
##$CPDPRGT= <>
##$D= (0..31)
0 1 0 0 0 0 0 0 0 0.06 0 0 0 0 0 0 0.0002 0 0 0 0 0 0 0 0 0 0 0 0 0 0 
0 
##$DATE= 1192623822
##$DBL= (0..7)
120 120 120 120 120 120 120 120 
##$DBP= (0..7)
150 150 150 150 150 150 150 150 
##$DBP07= 0
##$DBPNAM0= <>
##$DBPNAM1= <>
$$ [...]
##$SUBNAM6= <"">
##$SUBNAM7= <"">
##$SUBNAM8= <"">
##$SUBNAM9= <"">
##$SW= 20.6930455092707
##$SWIBOX= (0..15)
0 0 3 0 0 0 0 0 0 0 0 0 0 0 0 0 
##$SW_h= 5175.983436853
##$TD= 65536
##$TD0= 1
##$TE= 296.16
##$TE2= 300
##$TE3= 300
##$TEG= 300
##$TL= (0..7)
0 120 120 120 120 120 120 120 
##$TP= (0..7)
150 150 150 150 150 150 150 150 
##$TP07= 0
##$TPNAME0= <>
##$TPNAME1= <>
##$TPNAME2= <>
##$TPNAME3= <>
##$TPNAME4= <>
##$TPNAME5= <>
##$TPNAME6= <>
##$TPNAME7= <>
##$TPOAL= (0..7)
0.5 0.5 0.5 0.5 0.5 0.5 0.5 0.5 
##$TPOFFS= (0..7)
0 0 0 0 0 0 0 0 
##$TUNHIN= 0
##$TUNHOUT= 0
##$TUNXOUT= 0
##$USERA1= <user>
##$USERA2= <user>
##$USERA3= <user>
##$USERA4= <user>
##$USERA5= <user>
##$V9= 5
##$VALIST= <valist>
##$VCLIST= <CCCCCCCCCCCCCCC>
##$VD= 0
##$VDLIST= <DDDDDDDDDDDDDDD>
##$VPLIST= <PPPPPPPPPPPPPPP>
##$VTLIST= <TTTTTTTTTTTTTTT>
##$WBST= 1024
##$WBSW= 4
##$XGAIN= (0..3)
0 0 0 0 
##$XL= 0
##$YL= 0
##$YMAX_a= 431198
##$YMIN_a= -492187
##$ZGOPTNS= <>
##$ZL1= 120
##$ZL2= 120
##$ZL3= 120
##$ZL4= 120
##$ABSF1= 16.522
##$ABSF2= -4.171173
##$ABSG= 5
##$ABSL= 3
##$ALPHA= 0
##$AQORDER= 0
##$ASSFAC= 0
##$ASSFACI= 0
##$ASSFACX= 0
##$ASSWID= 0
##$AUNMP= <proc_1d>
##$AZFE= 0.1
##$AZFW= 0.1
##$BCFW= 0
##$BC_mod= 0
##$BYTORDP= 0
##$COROFFS= 0
##$CY= 12.5
##$DATMOD= 1
##$DC= 0
##$DFILT= <>
##$DTYPP= 0
##$F1P= 14.0000005364418
##$F2P= -0.99999901652339
##$FCOR= 0.5
##$FTSIZE= 32768
##$FT_mod= 6
##$GAMMA= 0
##$GB= 0
##$INTBC= 1
##$INTSCL= 1
##$ISEN= 128
##$LB= 0.3
##$LEV0= 0
##$LPBIN= 0
##$MAXI= 10000
##$MC2= 0
##$MEAN= 0
##$ME_mod= 0
##$MI= 0
##$NCOEF= 0
##$NC_proc= -3
##$NLEV= 6
##$NOISF1= 0
##$NOISF2= 0
##$NSP= 0
##$NTH_PI= 0
##$NZP= 0
##$OFFSET= 16.522
##$PC= 1
##$PHC0= 155.822
##$PHC1= 6.196874
##$PH_mod= 1
##$PKNL= yes
##$PPARMOD= 0
##$PSCAL= 4
##$PSIGN= 0
##$REVERSE= no
##$SF= 250.13
##$SI= 32768
##$SIGF1= 0
##$SIGF2= 0
##$SINO= 400
##$SIOLD= 32768
##$SREGLST= <1H.CDCl3>
##$SSB= 0
##$STSI= 32768
##$STSR= 0
##$SW_p= 5175.98343685301
##$SYMM= 0
##$S_DEV= 0
##$TDeff= 65536
##$TDoff= 0
##$TI= <Analysis number 999999
Compound Code 99
Book Reference 9
Project Code 9>
##$TILT= no
##$TM1= 0
##$TM2= 0
##$TOPLEV= 0
##$USERP1= <user>
##$USERP2= <user>
##$USERP3= <user>
##$USERP4= <user>
##$USERP5= <user>
##$WDW= 1
##$XDIM= 32768
##$YMAX_p= 309948133
##$YMIN_p= -54221
$$ End of Bruker specific parameters
$$ ---------------------------------
##NTUPLES= NMR SPECTRUM
##VAR_NAME=  FREQUENCY,     SPECTRUM/REAL,   SPECTRUM/IMAG
##SYMBOL=    X,             R,               I
##VAR_TYPE=  INDEPENDENT,   DEPENDENT,       DEPENDENT
##VAR_FORM=  AFFN,          ASDF,            ASDF
##VAR_DIM=   32768,         32768,           32768
##UNITS=     HZ,            ARBITRARY UNITS, ARBITRARY UNITS
##FACTOR=    0.157963299565203, 1,           1
##FIRST=     4132.6476996994, 0,             0
##LAST=      -1043.33573715361, 0,           0
##MIN=       -1043.33573715361, -54221,      0
##MAX=       4132.6476996994, 309948133,     0
$$ Real data points
##PAGE= N=1
##DATA TABLE= (X++(R..R)), XYDATA
$$ [...]
19842B3017j0941q659M73J0689L703k712k135p706l473P685J304m911R08N412
19828A2654r06o254J922J5376J7388j2290j7488r401L446j468P52J0728p515j0938
19814c994j996J1446o888J4628m974j2003l130k151J2034R824K141R571j0399
19801A4109K633r842M542k598j4843m708R313N508R441Q030l342p063M957l278
19787A2859o765n270r32Q783J5797O178k48j3251j5819N673N401N074o820o692
19773C968q56N888o413o97R34J2563j0411j8102K387J7184L190m380M019q339
19759I35K051p255r40K815k007J8998J1461m086q132M993L021j8684O864J8233
19745B8267O305j5566J4570R254j7356j8591n17j292k618j755l108n260j001O226
$$ y = [23017, 12076, 3417, 3890, 14579, 18282, 15570, 13435, 5729, 2256, 9941, 11245, 6334, 7242, 12654, 11748, 5494, 7416, 22792, 40180, 27890, 10402, 1001, 4447, 2979, 3731, 14459, 6944, -3994, -5990, 5456, -1432, 13196, 8222, -3781, -6911, -9062, 2972, 12796, 14937, 24508, 14109, 16742, 6900, 11442, 8844, -5999, -10707, -1394, 4114, 13555, 21585, 18243, 11180, 16137, 12859, 6094, 824, -108, 8675, 24472, 30650, 30402, 17151, 1332, 7005, 12406, 17480, 10660, 3968, 3112, 9000, 2587, 1890, 2824, 15387, 4976, -13126, -10739, 6445, 9635, 5255, 9274, 935, 2986, -4269, -5209, -2394, -4401, 14597, 26058, 21972, 13840, 18833, 21854, 3170, 10034, 28267, 34572, 19006, 33576, 42830, 25474, 6883, 6366, 5074, 2456, 701, -2407, -7667, -8668, -2442]
19731b442l551l924J6024Q884n192N688P202P258O227J13j4538p085o170Q12J0503
19716A9809J60j651j1471l472M552J746l288N774j33l044Q082Q796m772q411J2527
19701B5204K510r017m725J730j603l835P063R68l260L290L044J2836o623r85Q677
19686C5274P745r300j9102j1639N63K027Q083J0628J0214o001q733m751Q720j2399
19672A1329l198K894r22j5052l011K912M128K802N295l297K291L755K846J7024
19658B9796J7812L434j0776j2876j2023m671K011J1566k142j223J802n813k476
19645A4421J350j609l649J3634p68m285n498M124k940j5714k595J197p063J1330
19631A935K0172J1632Q954J6176K2702J8328K3911L1974K3425k407j5547l4701
$$ y = [-2442, -5993, -9917, 6107, 14991, 9799, 15487, 22689, 29947, 36174, 36287, 21749, 14664, 8494, 9306, 19809, 19969, 18318, 6847, 3375, 7927, 9673, 6385, 12159, 12026, 8982, 17064, 25860, 21088, 12677, 25204, 27714, 18697, 13972, 15702, 14099, 10264, 17327, 18295, 15035, 18325, 21369, 34205, 27582, 26597, 35274, 43019, 33719, 14617, 2978, 3541, 5568, 13651, 24279, 34493, 28492, 19759, 15008, 23728, 11329, 8131, 11025, 10103, -4949, -7960, -5048, -920, 1882, 7177, 3880, 6171, 9926, 12772, 29796, 47608, 51042, 40266, 27390, 15367, 10696, 12707, 24273, 22131, 20908, 22710, 16897, 14421, 15771, 14162, 10513, 24147, 23379, 19094, 13596, 17720, 14780, -934, -3529, -2332, -9395, 1935, 22107, 33739, 42693, 58869, 81571, 99899, 123810, 155784, 179209, 176802, 161255, 126554]
19619A26554l0768q721j2559k4091k241k480j1120p704L023n762J547o130l31
19606A9217m999j677o512p836o637j330m023j6J5746J7214J1401j196j6149k448
19592A0755l805j4354P578J5449P00j2946p202k617K949K2854k041j6534M23l469
19578b260Q107P726K017N691M028j0946m226o541P697J06O488J405l896n513p904
19563A979r156P941O524O586J0288Q583j911j1947l25M152J1758N89q748n035
19549B1278J77R040n757j4749M849N487J0061j1583k028K516j6547O503M444m769
19535H922L565N15O586J0357J0730K96n911j2344j1049n09K396J0050N158l248
19521B5514n831J660p294j2747K183K929K382j3272O460R019p396p463J2296Q242
$$ y = [126554, 95786, 87065, 74506, 50415, 48174, 45694, 34574, 26870, 29893, 24131, 25678, 19548, 19217, 14218, 12541, 6029, -1807, -8444, -9774, -13797, -13813, 1933, 19147, 30548, 29352, 13203, 10755, 6950, -7404, 174, 15623, 16323, 3377, -3825, -6442, -3493, 19361, 17320, 786, 1209, -2260, 5847, 13573, 15590, 21281, 25309, 14363, 10137, 3596, 11293, 11399, 17887, 19292, 15396, 9883, 1979, -7177, 764, 7288, 13874, 24162, 32745, 30834, 18887, 18562, 22714, 34472, 35061, 26313, 21278, 21455, 30495, 24738, 9989, 14838, 20325, 30386, 18803, 16775, 19291, 2744, 9247, 13691, 8922, 12487, 13002, 19588, 29945, 40675, 40971, 35060, 22716, 11667, 11158, 13554, 23604, 28762, 25514, 19683, 21343, 14049, 1302, 3485, 6414, 8796, -4476, 1984, 11003, 3607, -3856, 8440, 16682]
19507A6682m277k01k019o732L499J1371j625Q242Q841o47m475L09O385j7768r234
19492H351J4381Q033M592J221j2694n324l728l317Q870j1005l300K814K065l085
19478G874O602L066m826P301o601j387K177L564m328m427P260Q876j884l322j1407
19463H538K291J0013K634L114J3344j3306j6237J0161k072j1619l820J4912O650
19450B4603K4012R960j6479j8749m944l438J1574m036J122P538J9295N653j0110
19437D6001K451m559j3453J210L125k169j5689j6983n009P888R036R216j623P321
19423B6763k740o232j808J5389J5631m819j3721K645o60j619J5218O971q87N633
19409E5764j3124k821J65M994J757n259J5575r51p284p012k979j750k800J218
$$ y = [16682, 12405, 12204, 10185, 3453, 6952, 18323, 16698, 24940, 33781, 33134, 28659, 28968, 35353, 17585, 8351, 22732, 30765, 35357, 36578, 23884, 18560, 14832, 11515, 20385, 9380, 6080, 8894, 10959, 7874, 14476, 17542, 12716, 20017, 13416, 12029, 14206, 17770, 13442, 9015, 16275, 25151, 23267, 19945, 8538, 10829, 20842, 23476, 26590, 39934, 26628, 10391, 20552, 18480, 6861, 3041, 17953, 24603, 48615, 58575, 42096, 23347, 18403, 14965, 26539, 22503, 23625, 31163, 50458, 56111, 46001, 48452, 43893, 30440, 31650, 34775, 32606, 16917, -66, -5075, 2813, 11849, 21065, 19442, 26763, 24023, 17791, 15983, 31372, 47003, 42184, 28463, 31108, 30448, 28829, 44047, 51018, 50131, 55764, 42640, 39819, 39984, 44978, 46735, 41476, 57051, 56100, 48816, 41804, 38825, 37075, 34275, 35493]
19395C5493r482r158L08J1169P616P087q026k4063j3243Q388J7363J414l248j3450
19381H168K543Q403O953M165K004l76k726m737p019n871m533O41O555J2462m338
19366B2294j2908P091J79r095l995J3975N400p594r053j0542J1040J6106Q396
19353C1294N94J2792n397M461L261L443o8j7348o749o660Q15R558P982R294Q342
19338E5614j4732R50j175K140j1397N708J2760Q077o099l716j0128m763K733r032
19324B6940q948N285M213M361K373j368l106m421j0887j667q057n696K3751Q776
19310C1549j0209j3871j1475J3253J0376J708m13R857J5355N967q086J557M15
19297D5983m903J867Q326j827M778m598J711K82N023j218J967q832j2412L26J6678
$$ y = [35493, 26011, 16853, 17161, 28330, 35946, 43033, 35007, 10944, -2299, 6089, 23452, 24866, 21618, 8168, 10711, 19114, 26067, 30232, 32236, 31860, 29134, 24397, 17378, 11507, 6974, 7615, 14170, 26632, 22294, 9386, 16477, 16656, 7561, 3566, 17541, 22941, 15347, 6294, -4248, 6792, 22898, 31294, 31888, 44680, 39283, 43744, 47005, 50448, 50380, 33032, 26283, 19623, 20438, 29996, 37978, 47272, 55614, 40882, 41832, 40657, 42797, 31400, 37108, 49868, 57945, 51846, 48130, 38002, 33239, 35972, 26940, 17992, 23277, 27490, 31851, 34224, 32856, 29750, 25329, 14442, 12775, 4718, -978, 22773, 31549, 21340, 7469, -4006, 9247, 19623, 21331, 20918, 30775, 46130, 52097, 44011, 45568, 45983, 41080, 42947, 51273, 49446, 54224, 49626, 51337, 51619, 56642, 55424, 57391, 48559, 36147, 36473, 53151]
19282E3151L749L121q444o369K028m027m59J9275J8353J5584J2402O303R998L1550
19268A56215N0247M7914O1616N9235K1705p029k9987n4658n1233k0511J560M43
19256B35517k380K4947J4492L1439N9757N5623J3864k1719k6408j4956j21j1299
19244C58756m0498k6493l1546l3847l9101l1081l2078j9681j3939m07J5691K661
19232A08437O670j1233l206K742k011J6639K5978J5839J2149J7923K613k8790
19220A63750q381j1754k806o57j205J1104L3448N6655O1017O1519N2075M2857
19208D57622L2580J0303j7635k0739k2854j7671k3948j9190n166Q393J6130k97
19196C97528k2408n0707m8445n3808m4927k2865o250M199q562k6741j2742j5979
$$ y = [53151, 56900, 60021, 51577, 45208, 47236, 43209, 42750, 62025, 80378, 95962, 108364, 114667, 124665, 156215, 206462, 254376, 315992, 375227, 396932, 389903, 359916, 305258, 254025, 233514, 235074, 235517, 233137, 258084, 272576, 304015, 363772, 419395, 433259, 411540, 385132, 370176, 370055, 358756, 318258, 291765, 260219, 226372, 187271, 156190, 124112, 104431, 90492, 90085, 105776, 108437, 115107, 103874, 100668, 103410, 101399, 118038, 144016, 159855, 172004, 189927, 192540, 163750, 155369, 143615, 140809, 140152, 138947, 150051, 183499, 240154, 301171, 362690, 414765, 457622, 490202, 500505, 482870, 462131, 439277, 421606, 397658, 378468, 373302, 381695, 397825, 397528, 375120, 324413, 275968, 222160, 177233, 154368, 148118, 152317, 143755, 117014, 104272, 88293]
19184H8293j8273p080J2416J2419M918o504o570N993p236k124N596J853j2176
19171G1525j9347n943l190J721n997L530j388n135K563M541N860J1669M362j1138
19157E3633p082k073K733J0078m673j7205j8338n600J8101J0979j552j1260J2421
19144D0162J6128K826j1477p396k812N512J516J1251p79p112P027Q775M063J824
19130F9508k665Q45j5577L559l900j1534O233Q211o475M504R425j683j0108o904
19116D3439m848O022L311J811r01p638L298l59K520Q26M829Q805P902R155J745
19101G9917j4083k314K087J290n718j3451l208K364Q381l694p675L291o050N578
19087D6715K0393j1759r381R496N367q93m616j517m007l374p055m413J994L47
$$ y = [88293, 70020, 62940, 75356, 87775, 92693, 86189, 79619, 85612, 78376, 76252, 81848, 83701, 71525, 52178, 46235, 43045, 44766, 38769, 42299, 40911, 35776, 38339, 42880, 48740, 60409, 64771, 53633, 46551, 44478, 47211, 57289, 52616, 35411, 17073, 11473, 29574, 40553, 39001, 27741, 40162, 56290, 59116, 47639, 40243, 37431, 42943, 44459, 55710, 54931, 47819, 54846, 63621, 67684, 69508, 66843, 67688, 52111, 55670, 51770, 40236, 46469, 54680, 48205, 52709, 62134, 60451, 50343, 43439, 38591, 44613, 47924, 49735, 48834, 41196, 44494, 44135, 46655, 47481, 52310, 61115, 69017, 78172, 79917, 65834, 63520, 65607, 66897, 61179, 47728, 44520, 46884, 55265, 51571, 43896, 47187, 41137, 46715, 67108, 55349, 45968, 55464, 60831, 59938, 55322, 53805, 49798, 46424, 39369, 34956, 36950, 37297]
19073C7297k210P758J2793n360J760o808o304j1399n183L722m849R451J1282Q525
19059E0475N525k025q614Q59J4631K4177o520k347J4719j1102j1402k963j823
19046F3590o077r537k589O088J1272J8494N855O718J250j4014p848l196K359P090
19032G9455J020j4943J161L4J5763L406p529q652K531J1113q137j2230J0707K4134
19018I7833J3364q234q571N380m421K17n847Q130J7364J9324M933L595l714Q68
19004A40221K607N284m308M284p13j1511k0153j3829j1858R26k890j53J4391N184
18990A07482K0107O043R486J9j3499l387l032N057R051o94o630j9431m274K4696
18976A30994L0034J1802L027q766J3197K9097K9437L7389K2508K2342L1603K0876
$$ y = [37297, 35087, 42845, 55638, 50278, 52038, 45230, 38926, 27527, 22344, 26066, 21217, 30668, 41950, 50475, 56000, 53975, 45361, 46220, 60851, 85028, 78508, 76161, 90880, 79778, 68376, 65413, 63590, 57513, 47976, 45387, 51475, 62747, 81241, 87096, 93814, 95064, 81050, 73202, 70006, 72365, 79455, 80475, 65532, 66693, 66727, 82490, 85896, 78367, 69715, 72246, 83359, 75222, 62992, 73699, 97833, 111197, 102963, 94392, 99772, 95351, 95568, 89721, 97851, 115215, 134539, 139472, 143067, 139353, 140221, 142828, 148112, 143804, 148088, 147375, 135864, 115711, 101882, 90024, 90950, 88060, 87907, 102298, 107482, 127589, 133632, 143118, 143137, 129638, 126251, 123219, 128276, 137327, 136633, 130003, 110572, 106298, 130994, 161028, 172830, 175857, 167091, 180288, 209385, 238822, 276211, 298719, 321061, 352664, 373540]
18964C73540Q200j0662j0973r912p097o235n756K0118N8230L8717K7127L2405
18952E07702J8413j9191l0492l7834m4447l5692l7112k9228n407Q687K953j9923
18940B78429o658q622j3902p986n358j5523j272Q813L025l731k269p957N156l102
18926B19043n370K731K4414K0150R991L3279K4622K9061J7117m867k550r398J2094
18913C70317M8822M1966M5233O8275M4506J5888Q300j8712l8750l9107l1624l5419
18901D79695j3558J6005J4543L7771M7828Q638j6602l5177p0040m8250k9560l5104
18889C56189l5868m0175k3871k5469k4469j8559r264j605M483O522Q669P092n310
18876A98365J4805K4634L683o852J863M410P870j741j2918l349K546l744O851
$$ y = [373540, 381740, 371078, 360105, 350193, 343096, 336861, 331105, 351223, 409453, 448170, 475297, 507702, 526115, 506924, 476432, 438598, 394151, 358459, 321347, 292119, 286712, 295399, 298352, 278429, 271771, 263149, 249247, 241261, 235903, 220380, 219108, 227921, 230946, 227215, 224946, 216989, 222145, 219043, 213673, 216404, 240818, 260968, 270959, 304238, 328860, 357921, 375038, 370171, 367621, 358223, 370317, 419139, 461105, 506338, 574613, 619119, 635007, 643307, 624595, 585845, 546738, 515114, 479695, 466137, 482142, 496685, 534456, 582284, 590922, 574320, 539143, 469103, 420853, 391293, 356189, 320321, 280146, 256275, 230806, 206337, 187778, 178514, 176909, 181392, 187914, 196583, 203675, 198365, 213170, 237804, 241487, 234635, 236498, 240908, 248778, 247037, 234119, 230770, 233316, 229572, 236423]
18863B36423j0328O468n700L011J0683q33J207k599R516L0506L534J4809K8234
18850C24931Q872k2836j1213P31M134R698p983j4858m175K3499J320j2497M482
18837C04105K2049K3639l106k2705j2383K895J2243J1733O72j3893Q527J6493
18825C50269L4603L5686K6228J7535J1498N481N701K344l544Q177p06M498K1429
18812E19199K0329l133K937Q9M49R408J2332J6196J3565K3221K9356M3532L9335
18799G26815L3222J6607M1462N7301M5500M3290K3137M5148O1764P1428Q5799
18788A251473J09606J10167J18419J06173J20793J53442J60950J67147K08167
18779B506337K64862L18213L61565L51432K17794J43683J64638K53331L97922
$$ y = [236423, 226095, 232563, 226863, 229874, 240557, 239724, 240931, 238332, 247848, 278354, 281888, 296697, 324931, 333803, 310967, 299754, 300485, 304619, 314317, 306334, 291476, 287301, 310800, 312120, 299623, 304105, 326154, 349793, 346687, 323982, 311599, 314494, 326737, 338470, 339142, 325249, 333776, 350269, 384872, 420558, 446786, 464321, 475819, 481300, 487001, 489345, 485801, 493978, 493272, 497770, 519199, 539528, 536395, 539332, 539421, 539870, 549278, 561610, 577806, 591371, 614592, 643948, 687480, 726815, 760037, 776644, 818106, 875407, 920907, 964197, 987334, 1032482, 1094246, 1165674, 1251473, 1361079, 1471246, 1589665, 1695838, 1816631, 1970073, 2131023, 2298170, 2506337, 2771199, 3089412, 3450977, 3802409, 4020203, 4163886, 4328524, 4581855, 4979777]
18770D979777N54414P80646J124562J627169K163336K469369K268372J331154
18762A7298799K77584l26583l45484L09236J349708K732661M744723P778437J2141874
18753D5960955J6558044J8178481J5018230N931841j209144o467594r542674j2276150
18745G2151989j2565565j1489132q477804m723230j067734J775524K785124J425983
18737C9815155j892250m586643o003351n775158m569315l252975k145452j372663
18729A0217348q66262n04207k03584k3700J06687J60883J47906J48916J55199
18720I339186K64812M98034Q11444J285960J941988K850192M172224N890251P371118
18711C4425209P497628N360073J181614k065326l584246k713940q6806L663123
$$ y = [4979777, 5534191, 6314837, 7439399, 9066568, 11229904, 13699273, 15967645, 17298799, 17576383, 17249800, 16904316, 17213552, 18563260, 21295921, 26040644, 33819081, 45960955, 62518999, 80697480, 95715710, 101647551, 100438407, 93970813, 84428139, 72151989, 59586424, 48097292, 39619488, 34896258, 33828524, 35604048, 38389172, 39815155, 37922905, 33336262, 27332911, 21557753, 16988438, 13735463, 11590011, 10217348, 9351086, 8846879, 8643295, 8619595, 8726282, 8887165, 9035071, 9183987, 9339186, 9603998, 10102032, 10913476, 12199436, 14141424, 16991616, 21163840, 27054091, 34425209, 41922837, 47282910, 48464524, 46399198, 42814952, 40101012, 40014206, 43677329]
18703D3677329Q514748J3916427J8373427K1063976J9708467J5968017Q334703
18696A49557094n117646j7647141k4099779k5102571k0496409j4756809r509588
18689C2827151n551263k704880n60087P07421P96021n82697k392047l471536l780112
18680A5287971l214162k451788j721828j196272q27766n90034m18259l01889k72113
18671D293860k79238k69044k71425k47038k06207j96525j92984k14346j92987
18662B224066j74622j64960j50021j39122j19781q8319m8919m0860m5736m4748
18652A206978o8929n9588l1678k1766j724j407N736j6670k9378l1280m1568n8381
18640H50345n3135o3424m6497l3784k0923M669p094j1232j9734M480K377J7393
$$ y = [43677329, 52192077, 66108504, 84481931, 105545907, 125254374, 141222391, 149557094, 144439448, 126792307, 102692528, 77589957, 57093548, 42336739, 32827151, 27275888, 24571008, 24010921, 24718342, 25514363, 24931666, 22539619, 19068083, 15287971, 12073809, 9622021, 7900193, 6703921, 5876155, 5286121, 4867862, 4565973, 4293860, 4014622, 3745578, 3474153, 3227115, 3020908, 2824383, 2631399, 2417053, 2224066, 2049444, 1884484, 1734463, 1595341, 1475560, 1387241, 1338322, 1297462, 1251726, 1206978, 1138049, 1078461, 1046783, 1025017, 1023293, 1021886, 1027622, 1010952, 981574, 950294, 908726, 850345, 797210, 733786, 687289, 653505, 632582, 637251, 630157, 618925, 599191, 603671, 606048, 623441]
18628F23441K4981J3826J5317J2643M332r92o322l553J9552M5610O1763R9275
18616I09873J13877R9260Q3344L8974k7031q1203j07503j42831j42299q9742l9253
18605F15466k4092j1504j8046p725n874j9096j0250k346j7728P992L2259K7200
18593E66256K4949J7956p094j7358m4875n2993l2783k9609k0462q446r401k1836
18581C64304J0517K1365L69k678j572K2373L0401M6515O2268O2431O0412M0832
18569G17537J4851j25j7215j2509k9954m8253m7045k8118j9711j2694o155j1752
18557D98857l484J0815J632k0231k537K665k3865j7169M868J9889N749j0090J8811
18544D85910K1664K355K9506L5640K5864K7120K2970o811k9717j6193n625L041
$$ y = [623441, 648422, 662248, 677565, 690208, 694540, 693548, 687226, 683673, 703225, 748835, 810598, 909873, 1023750, 1123010, 1206354, 1245328, 1218297, 1137094, 1029591, 886760, 744461, 654719, 615466, 591374, 579870, 561824, 554099, 548225, 529129, 518879, 516533, 498805, 506797, 539056, 566256, 591205, 609161, 602067, 584709, 539834, 486841, 454058, 424449, 403987, 395541, 386140, 364304, 374821, 396186, 396555, 393877, 392305, 414678, 445079, 491594, 553862, 616293, 676705, 717537, 732388, 732263, 715048, 702539, 672585, 624332, 577287, 549169, 529458, 516764, 510609, 498857, 495373, 506188, 507820, 487589, 485052, 487717, 463852, 446683, 451551, 471440, 477189, 467099, 485910, 507574, 509929, 539435, 575075, 600939, 628059, 651029, 644218, 614501, 598308, 592683, 595724]
18532E95724J1863J1849j543r708p010N795J1150J0589M1745O6052P9809Q4730
18520I01045Q2143Q9019N2152m392j7130m9934o4285q3486o4592j8829j7810k2305
18508G81596J989J1481L9673K1997m936L806Q372L3186K6061L2458L6190L4012
18496A025885M5239N8637N2168N1701O8330P7914Q1063Q8584R2329J00837R4766
18485A837453J12099J52366J77063J93477K45459L09224L21473L25910L59254
18476D033778L19844K86651L29243L96056M82743O72102R02635J234242J674107
18467A0331401K287925K947764L175667L164324L063998J694179O93259N67501
18459B7926018N57594J727459L775464O800842J1364000J6436486J8868841K0001443
$$ y = [595724, 607587, 619436, 617893, 608185, 601175, 606970, 618120, 628709, 670454, 736506, 816315, 901045, 983188, 1072207, 1124359, 1119967, 1102837, 1052903, 988618, 905132, 840540, 821711, 803901, 781596, 783585, 795066, 834739, 856736, 851800, 855606, 863978, 897164, 923225, 955683, 991873, 1025885, 1071124, 1129761, 1181929, 1233630, 1301960, 1379874, 1460937, 1549521, 1641850, 1742687, 1837453, 1949552, 2101918, 2278981, 2472458, 2717917, 3027141, 3348614, 3674524, 4033778, 4353622, 4640273, 4969516, 5365572, 5848315, 6520417, 7423052, 8657294, 10331401, 12619326, 15567090, 18742757, 21907081, 24971079, 26665258, 27358517, 27926018, 28483612, 30211071, 33986535, 40787377, 52151377, 68587863, 87456704, 107458147]
18451A07458147K0093538R852245J21161m219724j3766798j8617915j7099244
18444H3821410j6474911j3082355q335699m266340r70278P37371J592621M98007
18436D3519826k436445l946927n312297n951345n123478m074897k970510j974800
18428A1729127j255652p49926l33432j26781p8133r1749p8210k9130P8714K35188
18418I300016M33012P56452J205881J799545K685504L836216M715455M820254
18410B9552335M816954L450131Q15458j54656o82778r2932K398072N223814P318701
18401E2645099J0211340J1976126R327455P129584N397579p76238q926499j1083797
18393G5900649j3967061j4551801j1549011q711305n835189l362402j645191o80227
$$ y = [107458147, 127551685, 137403930, 137525091, 133305367, 119538569, 100920654, 83821410, 67346499, 54264144, 45928445, 41662105, 40691827, 41429198, 43021819, 43519826, 41083381, 37136454, 31824157, 25872812, 20749334, 16674437, 13703927, 11729127, 10473475, 9723549, 9390117, 9263336, 9185203, 9093454, 9015244, 8986114, 9064828, 9300016, 9733028, 10489480, 11695361, 13494906, 16180410, 20016626, 24732081, 29552335, 34369289, 37819420, 38634878, 38480222, 37797444, 37704512, 40102584, 45326398, 52645099, 62856439, 74832565, 84160020, 91289604, 96687183, 95910945, 86984446, 75900649, 61933588, 47381787, 35832776, 27121471, 21286282, 17923880, 16278689, 15598462]
18385A5598462j52030J08503n39398j166992j419407j817713j765162j464307
18377G381956j163054q52842n82122m06140k46660r7576n4739j50102j77574j96388
18367C454759k46924k75248k49182k50218k53367k19173j92427j61966j26552
18358A479702q2692n3083k2821j2991l356l0343n6774o1528m9258n3655m0369
18347A012832l1993k2649p860n10J0038L1634L5934O6627J17943J50803P0526
18336A433325o9336j16926j22302q3488j6180L3178n476m281J3309K0218J0801
18325A092842l9982o8187p2709o3276l2844R666L7861N0978Q7314J11542J24426
18314A237631L9362o1468j30696j46205j13324q5422p7817o9589n5410k7964k1006
$$ y = [15598462, 15446432, 15554935, 15015537, 13848545, 12429138, 10611425, 8846263, 7381956, 6218902, 5366060, 4783938, 4377798, 4131138, 4033562, 3978823, 3828721, 3651147, 3454759, 3207835, 2932587, 2683405, 2433187, 2179820, 1960647, 1768220, 1606254, 1479702, 1397010, 1343927, 1321106, 1308115, 1304759, 1274416, 1217642, 1156114, 1106856, 1053201, 1012832, 980839, 958190, 950330, 949820, 959858, 991492, 1027426, 1094053, 1211996, 1362799, 1433325, 1363989, 1247063, 1124761, 1041273, 1025093, 1058271, 1052795, 1048514, 1061823, 1082041, 1092842, 1052860, 984673, 911964, 848688, 815844, 825510, 863371, 914349, 1001663, 1113205, 1237631, 1276993, 1215525, 1084829, 938624, 825300, 739878, 662061, 592472, 537062, 509098, 488092]
18303D88092j6041j1332j3842L187j8289l7470j4475j8329j6761k2915j2299J613
18291C11139l023j2069p006J2993P880l611N508M311j3025j4168j6076m27J0205
18278B82631P609K1188L6599O1997O0803O485o865j6640j510R863K098J1306K1470
18265D97034J6760N676k98Q235J0670L888L293P755K1448L548m184l271P790J1298
18251E89642R020M230J174J7271L3243L2976M9974P7644J13269J51300J78373
18240A258116J02602M341j6904n6373l7256K6530Q3078P8401K9880M989j1991
18229A465413k8278N289L3140L2879K9146N4321J14270J30648J3522q4276l4190
18218A731884J2784K445k5060n5875o5762k9117N4814J14814J06064J4537j9547
$$ y = [488092, 472051, 460719, 446877, 450064, 431775, 394305, 379830, 361501, 344740, 321825, 309526, 311139, 308116, 296047, 289041, 302034, 309914, 306303, 311811, 316122, 303097, 288929, 272853, 272426, 282631, 290240, 311428, 348027, 410024, 470827, 477312, 470447, 453807, 452297, 462160, 464258, 475564, 497034, 513794, 519470, 519172, 527407, 538077, 541965, 545258, 553013, 574461, 578009, 573825, 570554, 578344, 589642, 598662, 602892, 604066, 621337, 654580, 687556, 737530, 815174, 928443, 1079743, 1258116, 1360718, 1365059, 1348155, 1291782, 1254526, 1281056, 1364134, 1442535, 1472415, 1477404, 1465413, 1437135, 1442424, 1475564, 1508443, 1537589, 1591910, 1706180, 1836828, 1850350, 1766074, 1731884, 1744668, 1747113, 1722053, 1666178, 1600416, 1571299, 1626113, 1740927, 1846991, 1861528, 1841981]
18207A841981j5747K1055P6080J35513J77568K60891L18325L92862N20035O53503
18197D382066P48459P26762O23484O94605Q51481J042963J262372J751770K500331
18188A4584293L528143N251158Q441548J4327512K4928648L1214239N169533j8731636
18180H8713438j9982211k2226916j5759749r020403n376643l485771k341256j597933
18172H922556j047175o53328l34437l7061J00833M2099J26021K50650L64588M95018
18162H229764L90135L25867N07394P28857J022208J383452J990008K787234M156093
18153B1521012O764946J1098435J8934984L2166036L5042152j148511k3040375
18146A01338679k4393490k5756699j7172358r948871o126782m037653k811691
$$ y = [1841981, 1826234, 1847289, 1923369, 2058882, 2236450, 2497341, 2815666, 3208528, 3728563, 4382066, 5130525, 5857287, 6480771, 7175376, 8026857, 9069820, 10332192, 12083962, 14584293, 18112436, 23363594, 31805142, 46132654, 71061302, 102275541, 107445074, 88713438, 68731227, 46504311, 30744562, 21724159, 16347516, 12861745, 10520489, 8922556, 7875381, 7222053, 6887616, 6850555, 6951388, 6993487, 7119508, 7370158, 7734746, 8229764, 8619899, 8945766, 9453160, 10182017, 11204225, 12587677, 14577685, 17364919, 21521012, 28285958, 39384393, 58319377, 90485413, 125527565, 124379054, 101338679, 76945189, 51188490, 34016132, 24067261, 17940479, 13902826, 11091135]
18139A1091135j978834j384142r97309o38404l71522l72145m65236m27987m47237
18130D008319m55623l81999k99751k08052j25555m9810l4455m5470k8852j0539
18120B368213J0758M5223J36125K26237L36785M76579Q02096J338513K286249
18111H026778M059974O703890N534301k407243m412272m780263m493030k676927
18103E555208j499755r39100o20996m46501l11741j91224j24527j04405j25726
18094A191233j20495r8303p4426o7787m0603l6475l6745k5134q855p447j0372
18083F64591l8073m5846l2405m0572l1912j9135j7896J5746r001m413K6703J5429
18071D83216j6378l2537l1911r085K0187M7773Q2901Q7059j884m3571j6676K4038
$$ y = [11091135, 9112301, 7728159, 6730850, 6092446, 5720924, 5348779, 4883543, 4455556, 4008319, 3552696, 3170697, 2870946, 2662894, 2537339, 2487529, 2453074, 2407604, 2378752, 2368213, 2378971, 2424194, 2560319, 2786556, 3123341, 3599920, 4402016, 5740529, 8026778, 12086752, 18790642, 24324943, 21917700, 17505428, 12725165, 8232135, 5555208, 4055453, 3116353, 2495357, 2048856, 1737115, 1545891, 1421364, 1316959, 1191233, 1070738, 972435, 898009, 830222, 789619, 753144, 716399, 691265, 682410, 674963, 664591, 626518, 580672, 548267, 507695, 475783, 456648, 438752, 454498, 445497, 441084, 467787, 483216, 466838, 434301, 402390, 393305, 413492, 461265, 544166, 631225, 629341, 585770, 569094, 593132]
18059E93132M2145j9211n7970n0477m3576k3020L6308O8466J08062R5768j6533
18048G33094r2619j04285j11683p9058l2790j8433k3721o361P064J7754K846j5901
18036B75907k6988j5859N145K7463N2318O6173J3922o3681o0970l6917k6395k0737
18024A89381q535O116R865J4275L349J594K8728R257L546q224j1734O829L1095
18011B75542N4855R3210J41863R5168m810l0740p5017r1921n4096k1776L2731
18000D15009N4064J6962p3650r4170r0653m2981k2832p544L336N111M478R934
17988A77064n216j6100k133l47P51l140m294R538P673j5461J6000J5485J0999
17975A90819K5830K4327K4144K5450j8872k6511l1933k8346m702l660j884P383
$$ y = [593132, 635277, 616066, 558096, 507619, 464043, 441023, 477331, 545797, 653859, 749627, 733094, 640475, 536190, 424507, 345449, 312659, 294226, 270505, 264144, 271208, 288962, 291808, 275907, 248919, 233060, 238205, 265668, 317986, 384159, 398081, 334400, 273430, 236513, 210118, 189381, 180846, 186962, 196827, 211102, 214451, 216045, 244773, 254030, 257576, 249352, 237618, 244447, 275542, 330397, 423607, 565470, 660638, 655828, 625088, 550071, 458150, 404054, 382278, 415009, 469073, 486035, 412385, 318215, 227562, 184581, 161749, 154205, 157541, 162652, 167130, 177064, 171848, 155748, 153615, 153268, 154019, 150879, 146585, 156123, 163796, 148335, 164335, 179820, 190819, 216649, 240976, 265120, 290570, 271698, 245187, 213254, 184908, 180206, 176546, 174662, 182045]
17963A82045j3884o142J4563M4994J7574J46Q621J3283J8326K2465L6196K6692
17951C64879J5489J6963K4810L7809M0127L7901N7579J6030J4921J2248Q090K0629
17939F67475J6118Q688j6239n1335o1083o0471o9142o0012m7430l699J82k633
17927C20419j6981j6986j0364N365P597k4703j6446j4304q983p591j5617j5402
17915A86004K1099L7895K9224L2495J7144l823j268J6501J1395J6503J2319M2491
17903D17979O6708L7340L8115K4869R505l534o804j289m309j3167k8512m9322
17891D87579l7617k3460o049K9506K2822J5536M2178O1789L2843J9349k9044l2643
17879E82789k6674l4886l6092l3077K842K1014N7764R8120J27046P9551l7952
$$ y = [182045, 168161, 162019, 176582, 221576, 239150, 239296, 247917, 261200, 279526, 301991, 338187, 364879, 380368, 397331, 422141, 459950, 500077, 537978, 595557, 611587, 626508, 638756, 646846, 667475, 683593, 692281, 676042, 624707, 563624, 503153, 434011, 373999, 326569, 322870, 323052, 320419, 303438, 286452, 276088, 281453, 289050, 264347, 247901, 233597, 224614, 217023, 201406, 186004, 207103, 244998, 274222, 306717, 323861, 320038, 318770, 335271, 346666, 363169, 375488, 417979, 484687, 522027, 560142, 585011, 594516, 590982, 584178, 582889, 578580, 565413, 536901, 487579, 449962, 426502, 420453, 449959, 472781, 488317, 530495, 592284, 625127, 644476, 615432, 582789, 556115, 521229, 485137, 452060, 454902, 475916, 533680, 631800, 758846, 838397, 800445]
17868H00445o0719p2174o3759k5972q15K4282L9227M1813M4926L6470K5264K7291
17856H16279M5440L6016K2023N6712P2938N6281R1561J50102K15127K08636J75411
17845A946526K30929J68208Q410M6203R6271K14745M20817N10660M10048L39002
17835D391819L79352L76248M74849O33594Q10192R87346J270466J694346K208906
17826A3227118K746086L957809O314507J0474983J7758979L0400155L7481321
17819A22360958N984227k2627432k4704213k6928165j8582242j0538985o215835
17812A8748313l852847k467388j857859j592311j244327r37590o05510k69894
17804E920587R793R9803J69181K32831J39871J98085L61249N73001Q34465J104700
$$ y = [800445, 739726, 667552, 603793, 577821, 577006, 601288, 640515, 682328, 727254, 763724, 788988, 816279, 861719, 897735, 919758, 976470, 1049408, 1105689, 1197250, 1347352, 1562479, 1771115, 1946526, 2177455, 2345663, 2354073, 2400276, 2496547, 2711292, 3132109, 3642769, 4052817, 4391819, 4771171, 5147419, 5622268, 6255862, 7066054, 8053400, 9323866, 11018212, 13227118, 15973204, 19931013, 26245520, 36720503, 54479482, 84879637, 122360958, 128345185, 105717753, 81013540, 54085375, 35503133, 24964148, 18748313, 14895466, 12428078, 10570219, 8977908, 7733581, 6795991, 6190481, 5920587, 5930380, 6030183, 6199364, 6432195, 6572066, 6770151, 7131400, 7704401, 8538866, 9643566]
17794I643566J303374J657008K125039L289560N516677R334364J6017106K7155794
17786G6042488K9740194j278715j9954708k1425258k2049221j4264690q028677
17779A8781413m797174l046933k076297j598705j300531j009908p93950o01048
17771C556867m35202k59770j29568o1946o9465j70298j97117j74911r8288L0302
17761A990604J7425j92447k42616k47755k38637j47216r1057p7930p8377p2717
17751F19277m0647m7322m7018m1310m2239j5317P105J748q514r326o765p302J048
17738C63418j6014j5686j2736l607r15k511p420m445j679J6763J3026J474J3938
17725C43606J4290k7668l0912k4617k8094j8881j0882m217J319K345m882L811
$$ y = [9643566, 10946940, 12603948, 14728987, 18018547, 23535224, 32869588, 48886694, 76042488, 105782682, 104503967, 84549259, 63124001, 41074780, 26810090, 18781413, 13984239, 10937306, 8861009, 7262304, 5961773, 4951865, 4157915, 3556867, 3121665, 2861895, 2732327, 2670381, 2600916, 2430618, 2233501, 2058590, 1960302, 1990604, 2008029, 1815582, 1572966, 1325211, 1086574, 939358, 848301, 770371, 691994, 619277, 578630, 531308, 484290, 442980, 400741, 385424, 392529, 394277, 385763, 376437, 369672, 362370, 363418, 347404, 331718, 318982, 315375, 314460, 311949, 304529, 300084, 298405, 315168, 328194, 329668, 343606, 357896, 330228, 299316, 274699, 246605, 227724, 216842, 212625, 213944, 216289, 211407, 215218]
17713B15218M96J5061M2736L0528J1073M470q736J6505O4309P2337k6491p6719
17701C60787p3802n6229l2939l7880l6009k3983j2319q359N301J7167J4620L3076
17689A49431K8806J2641j0171k0477j3641j2381L701J3003L704J784J2674J6042
17677A85116L2611K8426j4416j1055j3144J5413L3744O6374k023n4347n7228o0917
17665A48554m9317j4883o289m303J0278L786j954J4498J5045r51j0553P284K310
17652A13505n244r061m618o682j6369o227O215Q562N793Q322J0041q39k0233j5635
17638F7530p74J992j6733j9532J0469l962J925J5257N706J3759P906K537J160
17625H7240L714k932n222j8966j9132J56r65M353p000L603J9173o95l366n248
$$ y = [215218, 215714, 230775, 273511, 304039, 315112, 319582, 310846, 327351, 391660, 463997, 437506, 360787, 286985, 230756, 197817, 159937, 123928, 99945, 87626, 79267, 84568, 101735, 116355, 149431, 178237, 190878, 180707, 160230, 146589, 134208, 137909, 150912, 154616, 156400, 169074, 185116, 217727, 246153, 231737, 220682, 207538, 222951, 256695, 323069, 321046, 266699, 209471, 148554, 99237, 84354, 78065, 73762, 84040, 87826, 85872, 100370, 115415, 114464, 103911, 111195, 113505, 108261, 99200, 94582, 87900, 71531, 65304, 71519, 80081, 85874, 94196, 104237, 103398, 83165, 67530, 66756, 68748, 52015, 32483, 42952, 38990, 40915, 56172, 61878, 75637, 83543, 86080, 87240, 90954, 88022, 82800, 63834, 44702, 44858, 43893, 48246, 41246, 44849, 64022, 63327, 59961, 54713]
17611E4713k127R23P135J4890l342j9252j4042L663J0713R808l123j3760r621
17598C6578J1777L9R118M301l319J8307J6071K0473o089j0645o84J4732K2042
17585A32701K9746K6091L8802M8369J03277J56447J33073p809r6142j23067j20116
17574C21372q1212m8610m1343l3724k0694q074k546J198L176K165j2722j9116
17562E9870l038J4602p103j6587j522R235O201j374J672R227Q372J7655K5008
17549A22218K5456L9859Q0916J33267R8233j6166p5853r4442r0773o0227l6138
17538A26350k5913k1421k2896j1397j2733R017J4694n333j2386j4397K510J776
17526B7871o438l769j3563n198j704Q683K2610p248j3911K035j3045q240O839
$$ y = [54713, 52586, 53509, 60644, 75534, 72192, 52940, 38898, 42561, 53274, 63082, 59959, 46199, 36578, 48355, 48394, 57512, 61813, 58494, 76801, 92872, 113345, 107256, 96611, 95927, 110659, 132701, 162447, 188538, 227340, 275709, 378986, 535433, 668506, 660697, 564555, 441488, 321372, 240160, 191550, 150207, 116483, 95789, 87715, 85169, 86367, 89543, 91708, 78986, 59870, 56832, 71434, 64331, 47744, 46222, 55457, 61658, 60284, 61956, 71183, 79555, 97210, 122218, 147674, 187533, 268449, 401716, 499949, 483783, 407930, 313488, 222715, 162488, 126350, 100437, 79016, 56120, 44723, 31990, 41007, 55701, 50368, 37982, 23585, 26095, 27871, 21433, 17664, 4101, -1097, -2801, 5882, 28492, 21244, 7333, 9368, -3677, -11917, -5078]
17513e078Q846J1965Q391O320P858k686j636j4280J62R368M008l210k1q855j3917
17498G235NJ3928J567m611N02m079n310m39q351q950l566J648K975J2161K147
17483F862j7592j823K4226N545J163j4796j2208l233P734P637J1816l509m258
17470G564p65m56J1348P184J474Q724k0747j5654o000k565p456K4015N336q35
17456A1167J5886R571q305j281j0927o376J550J7447J3925P765k658N153K7927
17443H0844M2693R36k8396k9076k2472m474k1959k300k653o53n278o228l81p109
17429f506j0522l218j593O019J6097J3849J8983J4439j0502k3296j774j969J8438
17416B8445O152k006J302N430j2259n554J3897L547L801J7210q314j415J733Q839
$$ y = [-5078, 3768, 15733, 24124, 30444, 38302, 35616, 33980, 19700, 19862, 29230, 33238, 30028, 30007, 21152, 7235, 7240, 21168, 22735, 18124, 18626, 14547, 9237, 8798, 447, -8503, -12069, -10421, -7446, 4715, 6862, -10730, -12553, 11673, 17218, 18381, 3585, -8623, -11856, -4122, 3515, 15331, 11822, 7564, 6799, 6343, 17691, 24875, 26349, 35073, 14326, -1328, -7328, -9893, -17349, 6666, 12002, 11167, 27053, 36624, 28319, 27038, 16111, 9735, 11285, 28732, 42657, 50422, 47764, 52917, 80844, 123537, 124473, 96077, 67001, 44529, 40055, 18096, 15796, 13143, 12490, 7212, 984, 603, -6506, -17028, -20246, -21839, -15820, 277, 14126, 33109, 47548, 37046, 13750, 11976, 10007, 28445, 34597, 32591, 33893, 39323, 27064, 21510, 35407, 38954, 42755, 59965, 51651, 50236, 51969, 60808]
17402F0808J2868K6721K1200M702j5165l5466j4892J1924j0121j4077k0897j0559
17390A7046J1247L325K076k0864j5363Q682j434j6728p81K3093J3639j4173j6980
17377g215j3305R854K918J4248P175O292q913m736j0728o58r620J3354j144j0933
17363a3411J503J3907J2128q701r857J1094M628j2224J868O267o563J605K621
17350D865L935j8539j1797Q460J0260j2432P95R417J7820Q54n290r251r210j130
17336a1243j972n380l601J0092Q185J1336K638Q524L663J99j3624J534K0252m542
17322B6061p395J909l788k979J650m36j2608j0111p390K242J1009q73k1801p825
17308c2335M710J4650J1644J163Q468J0700n287r730N543m570o056n29J476L030
$$ y = [60808, 73676, 100397, 121597, 126299, 111134, 75668, 60776, 72700, 62579, 48502, 27605, 17046, 28293, 31618, 33694, 12830, -2533, 6149, 4715, -12013, -12794, 10299, 23938, 9765, -7215, -20520, -10666, -7748, 6500, 13675, 19967, 11054, 6318, -4410, -5068, -14688, -1334, -2478, -13411, -11908, 1999, 14127, 5426, -4431, 6663, 11291, -933, 935, 7202, 639, 2244, 4865, 8800, -9739, -21536, -13076, -2816, -15248, -14453, -5036, 12784, 13638, 8348, -903, -10113, -11243, -13215, -18595, -22196, -12104, -3919, 7417, 10055, 18579, 22242, 22441, 8817, 10351, 30603, 26061, 18666, 20575, 16787, 13808, 15458, 15022, 2414, -7697, -15087, -12845, -1836, -2709, -24510, -32335, -27625, -12975, -1331, -168, 8300, 19000, 13713, 3983, 9526, 4956, -1100, -1629, -153, 2877]
17294B877n530l653n925Q123M065P327L675q128N865j217m591m607k097L403Q926
17279H513J4250O853Q600k495N511P653R587J9890K3699K4401J7896M7714P2835
17266B64907J09195J36574O3061n4738r4305j08733q5257o6854m7230l0177r786
17255G6657j4411j8903M357k222o580j7972j0424M795K558J2806J664R514P127
17242D8966M783n973p701N807Q978J7783J2566L0845L9227O8188J23993J40167
17230D87629N2634o0107q9113j19370r1476n2314k9179j7418j5499q644j3431
17219D3712l964j3104J458R962q793k324j297l086q680n165j875L56n649k960
17205a409k90k92J618j585k84O852j063p831m459Q976K54o335J658K675J0134
$$ y = [2877, -2653, -6306, -12231, -4108, -43, 7284, 10959, 2831, 8696, 7479, 2888, -1719, -3816, -413, 8513, 22763, 29616, 38216, 35721, 41232, 48885, 58472, 78362, 102061, 126462, 144358, 192072, 264907, 374102, 510676, 573737, 518999, 424694, 315961, 230704, 163850, 116620, 86443, 76657, 62246, 43343, 47700, 45478, 38898, 20926, 10502, 15297, 17855, 30661, 32325, 41839, 48966, 53749, 47776, 40075, 45882, 54860, 72643, 85209, 116054, 155281, 223469, 347462, 487629, 540263, 480156, 391043, 271673, 180197, 127883, 98704, 81286, 65787, 57143, 43712, 39748, 26644, 28102, 38064, 29271, 26947, 25650, 22564, 13884, 8719, 6844, 7200, 1551, -1409, -1699, -1991, -373, -1958, -2242, 4610, 3547, -4284, -8743, 233, 487, -5848, -4190, -1515, 8619]
17190H619n291j0467P8J1079N778K451k316m045J118K952j4886j850J7172Q763
17176A9155j1913m972o152O793l163j0477N327o129L683N677j3257k258j0130
17163b7816P064Q224n30j48N901K487J0351j697q447j2114L122J857M440l65N523
17148b148m371l730r658K561O783n224J155J475j638Q460J1350n042r013p143
17134a6183r2P595k418j1404J327Q401J7605J3897j6696K444m996J769p420o994
17120a3165l461R97R00J3976o190k456k525m494R28M80K57n11p12J832N665J2322
17104C843j1113j820j303j2131J1563K8362j0257k5341r113J4170J7875l003j6299
17091a4567q693L237M485p288j8810J2592L0691l983n515j832L338k913l162P087
$$ y = [8619, 3328, -7139, -7061, 4018, 9796, 12247, 9931, 5886, 7004, 9956, -4930, -6780, 10392, 19155, 7242, 2270, -3882, 2911, -252, -10729, -5402, -11531, -7848, -2171, -15428, -17686, -27816, -20752, -12528, -13058, -13206, -7305, -4818, 5533, 3836, -4611, -16725, -13603, -11746, -7306, -7671, -2148, -6519, -10249, -19907, -17346, -10563, -15787, -14632, -13157, -14795, -6335, 5015, -27, -9040, -16183, -16275, -8680, -11098, -22502, -21175, -12774, 4831, 18728, 2032, 4476, -520, 1249, -6171, -13165, -16626, -15629, -14729, -753, -6943, -9399, -11924, -16418, -15490, -15010, -14753, -15264, -15976, -14144, -8479, 3843, -7270, -9090, -10393, -22524, -10961, 17401, 7144, -18197, -27310, -13140, 4735, 1732, -14567, -23260, -20023, -15538, -22826, -41636, -29044, 1647, -2336, -7851, -9683, -6345, -9258, -12420, -5333]
17077e333Q900r162n286O745R416M486R05q963j2868q860P392L270m51K795M144
17062b870q632k703J57N431J5051m268k6118k411K285P781J027K776R066p443
17048a0871k84O716k725o94m272O117O238k766j949Q025j3717j1413K1338K4121
17034B3864L532l639j709Q216K388j8135j1790l152N529n566J675q47J0079n05
17020I940j1556O557k21r069r206O317K312r957J3139L958l895l048p28P527l911
17005a841o144M749L743Q265p137k769k530N430K705O091M08N112l950M314j463
16990A4983n52j400r881M197M818n514l787L92r897j3839O945J1869N690q201
16976d177o054J3336J1157p98j0254q866K93m13q853J294o748L617N217M933L475
$$ y = [-5333, 3567, -5595, -10881, -4136, 5280, 9766, 10671, 1708, -11160, -20020, -12628, -9358, -9809, -7014, -2870, -11502, -14205, -14048, -8617, 6434, 2166, -23952, -26363, -24078, -16297, -15270, -12494, -3428, -10871, -11155, -4439, -7164, -7858, -12130, -6013, 225, -2541, -4490, 3535, -10182, -21595, -257, 23864, 27396, 23757, 22048, 30264, 32652, 14517, 2727, -425, 5104, -462, 1213, 366, 10445, 9940, -1616, 4941, 4720, -4349, -13555, -7238, -4926, -14883, -1744, 2214, -1681, -4729, -5457, 2070, -1841, -7985, -3236, 507, 8772, 1635, -1134, -3664, 1766, 4471, 10562, 10970, 16082, 12132, 16446, 14983, 14431, 13031, 3150, 7347, 12165, 6651, 2864, 3256, -6641, -20480, -13535, -1666, 4024, -4177, -10231, 3105, 14262, 13464, 3210, -5656, -5363, -5776, -14629, -13335, -20083, -16466, -11249, -6316, -2841]
16961b841j5610O422O832m713N202j204o894J75J389J832l934q180k881n410P624
16946b2191k760L789M263J155N194M048M226j657R07K888Q81j722n505O210J0847
16931A0573M719k0854J550L614j3142R012O378l807j2578q010Q606J3950O01j5930
16917a5318j1340P087M070n159N522J0898k9m18J962O224l673p80K410k0757p242
16902b6543R040R189n179o818M204M89J0357k272L53q31j127J849K193k271L851
16887c516J1062j2682R84O586m044j3699l651p481L752O570R446L013K747j0219
16873a1132r309m53P810J34r022L768J2666J3128n595j669j516j1117p094N781
16859a3620j1787k320K745l399L643M824l428L104J5867J152J859J95r694L816
$$ y = [-2841, -18451, -12029, -5197, -9910, -4708, -5912, -12806, -12631, -11242, -9410, -13344, -21524, -24405, -29815, -22191, -24951, -21162, -16899, -15744, -10550, -6502, -2276, -3933, -3026, -138, 743, -979, -6484, -274, 10573, 15292, -5562, -4012, -398, -13540, -4528, 1850, -1957, -14535, -22545, -13939, 11, 612, -15318, -26658, -19571, -15501, -20660, -15138, -4240, -4269, -4687, -2725, 3499, -174, -954, 1456, -19301, -26543, -17503, -8314, -13493, -20311, -16107, -15618, -5261, -7533, -7180, -8011, -9138, -7289, -5096, -7367, -3516, 7546, -5136, -4152, 2434, -1610, -15309, -18960, -26441, -22689, -16119, -6673, -3660, -913, -11132, -20441, -20894, -13084, -12950, -21972, -18204, -5538, 7590, 1995, 326, -1190, -12307, -19401, -13620, -25407, -27727, -24982, -28381, -24738, -19914, -23342, -20238, -4371, -3219, -1360, -1165, -10859, -7043]
16845g043K0977n278K373j446j2661r060q3k380q44N770P554K765j358L806n442
16830b350j548p57p682j1108Q863K58p071N267Q134P390R457K638r392j2199K326
16815g774J1982Q162q834j2362m137O722L235m911l40p70K543O765j2315j2341
16801b4375J1106Q221M871P041j3750k0987K125J0450l04K272N709J4630P384
16788A4393M038j0061j690K058k047J4745j259O719q129m098l4090j7180N48P546
16774b8507N687J6674P447o584L546K347K819K982K901k037k064r606j2739j922
16760a9056J3237J1596J594l255N16j2013j4913J1426q012r817j141J339N524
16747b2975Q576j0986n053O492l121M329l040m918P943N971o495J2927Q872o541
$$ y = [-7043, 13934, 8656, 11029, 9583, -3078, -12138, -12221, -14601, -15445, -9675, -2121, 644, -714, 3092, -2350, -3898, -4655, -12337, -23445, -14582, -14324, -21395, -16128, -7994, -604, 8853, 11491, 2099, -10100, -7774, 4208, 12370, 3536, -8826, -12963, -6241, -3006, -7917, -8257, -9027, -6484, 281, -12034, -24375, -13269, -5048, -177, 6864, -6886, -27873, -25748, -15298, -15602, -13330, -7621, 7009, 14393, 18431, 8370, 6680, 8738, 6691, 21436, 20177, 26896, 18767, 14669, -19421, -36601, -36053, -28507, -22820, -6146, 1301, -5283, -1737, 610, 3429, 6411, 9312, 7275, 5211, -4395, -17134, -19056, -5819, 5777, 7371, 4116, 4632, -7381, -22294, -10868, -18880, -28697, -29838, -28499, -22975, -14399, -25385, -30438, -23946, -27067, -22738, -25778, -30696, -22753, -16782, -23277, -10350, -1478, -8019]
16733h019O907O384j606j2624N452j381r488j0365N478J2071M910n736J6530N520
16719A4033j5538j4191J3817J1309M228q535j5959j3965m65Q064J5848K56k558
16706c656j7735L877Q289n784o599Q131J3771o847o437j2651n937J2367J0962
16693h249L983j912J120K384p13l802M24R578p931o937k753N453J6342K500n604
16678C883P984m566O61q027p955k083O627o958o001o631j234N920l025j896J4159
16663i142N03j761m23k720k187J2524Q475q75j5493r005j731L019P97J8779Q886
16648I646j0857O876Q717l338p100j0442P390n942p245l619O555k058j147n229
16634a7793l103J515k93Q45L575q47O882k210q730J958J2502P221k580p268m26
$$ y = [-8019, -1112, 5272, 3666, -8958, -3506, -4887, -14375, -24740, -19262, -7191, -2281, -8017, 8513, 14033, -1505, -15696, -1879, 9430, 13658, 5123, -10836, -24801, -25266, -17202, -1354, -1098, -3656, -21391, -17514, -9225, -15009, -21608, -13477, 294, -6553, -12990, -25641, -31578, -19211, -8249, -4266, -6178, -5058, -2674, -3387, -7189, -6765, 2813, -5118, -12055, -14808, -9355, 6987, 9487, 3883, 11867, 7301, 7962, -65, -8020, -10103, -3476, -10434, -16435, -23066, -24300, -18380, -21405, -23301, -9142, -8639, -10400, -10823, -13543, -15730, -3206, 5269, 4394, -11099, -20104, -21835, -18816, -18019, 760, 9646, -1211, 5665, 14382, 11044, 3944, -6498, 892, -5050, -12295, -15914, -9359, -11417, -12564, -17793, -20896, -19381, -19674, -18829, -15254, -16101, -9219, -11429, -20159, -18201, -5699, 1522, -1058, -8326, -8752]
16619h752O403j7J1077K194j5914r494J924P754J113r049J3830P757j792l436
16605C598L720K922j0228k270r438n379K693j433l597J0882K9549J7785j4785
16592B4019k9349P382N746J640m77p324r688N828n213J872l771p057l450K607
16578a7235o61Q831p107j5376R968J6123j5724j7680M386J4344Q197O355m890
16565a0469o105P944O717K96j6355j2022j600K737J285O725J7021O650J983k263
16551B544n100j2228j977m977N337l175p564L089K205Q487N976m66q246P959P843
16536b93k904m648r764N569n18n41q948J0585J5987j6755q102J0198R213p153
16522h074j049J9815M263k4785j4511m844L004j33M757N885O193o322J1226k912
$$ y = [-8752, -2349, -2366, 8711, 10905, -5009, -14503, -12579, -4825, -3712, -12761, 1069, 8826, 7034, 3598, 7318, 10240, 12, -2258, -11696, -17075, -14382, -15815, -19412, -8530, 21019, 38804, 24019, -5330, 2052, 7798, 9438, 8961, 1637, -8051, -2223, -7436, -5564, -9335, -16392, -19842, -17235, -17896, -9065, -16172, -31548, -21580, -5457, -21181, -38861, -34475, -20131, -11934, -5579, -10469, -16574, -8630, -1913, -1617, -17972, -29994, -31594, -28857, -27572, -20847, -3826, 2824, 4807, 2544, -2556, -14784, -16761, -21738, -16401, -19576, -27140, -24051, -21846, -13359, -7383, -7849, -16095, -8136, -293, -3197, -7845, -17609, -12040, -12558, -13099, -22047, -11462, 4525, -12230, -20332, -10134, -921, -8074, -9123, 10692, 14955, -9830, -24341, -29185, -26181, -26314, -21557, -15672, -9479, -15801, -4575, -7487]
16508g487j0339k0737k697J1108J6075K637Q580O410K838j92O565n305l062j5145
16494a0751r969p9J5487Q649M920o189k002Q070K911n383q928j703L871J1893
16480A0797q279j0506O991M581J120J643p085o156o220p41J6204M023o476N446
16466E342p28n064J927j0798j0690P884q461K156J4864M010o404j565M157k675
16452f045j3825l113q2j1006N943J5251n271l404K537J1607m278p158l331J215
16438b0960m17K947Q801Q252k085j6928M740J1691R843n739P530K509K74l768
16424F690j1083L94R613J999j1575j3279m983o855O937R293m461r148N458R494
16410a1506N305j009M37N407Q713n720j743M803O61P275m107j5234k170o877j1623
$$ y = [-7487, -17826, -38563, -41260, -30152, -14077, -11440, -2860, 3550, 6388, 6196, 12761, 7456, 4394, -10751, -20720, -20799, -5312, 3337, 8257, 2068, 66, 8136, 11047, 5664, -3264, -4967, -1096, 10797, 2518, -7988, -997, 3584, 4704, 6347, -738, -6894, -13114, -13855, 2349, 6372, -104, 5342, 4614, -450, 1477, -9321, -20011, -12127, -20588, -18432, -3568, 442, -5962, -7527, -3370, -6045, -19870, -22983, -23065, -34071, -28128, -12877, -18148, -21552, -19015, -7408, -11686, -18844, -22175, -20960, -21377, -18430, -9629, -1377, -3462, -20390, -15650, -3959, 5884, 145, 7675, 10184, 10458, 6690, -4393, -3999, 5614, 7613, -3962, -17241, -22224, -29079, -22142, -12849, -17310, -26458, -21000, -11506, -6201, -7210, -6773, -1366, 7347, 1627, -116, 4687, 5348, 12623, 8516, -6718, -8888, -15765, -27388]
16395b7388R225k66J4748K261O020K1841j973p972n637j2836r650K466p088K505
16381a3744N047q965L060N413J2218r456j504K161M993R761Lj7090j0047K53j0539
16366b8436M328M49l015n538M551M152J151Q810m567K74p7J7239P238j795J282
16351F046k851J958n012K309P93J0325N584o402j8717K138J5010J2375j0256j3220
16337H0q750j4736O060J1371j962j289n523R508J0792J386j2187m155K597J544
16323e264J0789q12O107N542K5r424n049L706L975J745o351M403l164p233r067
16308a0072l81K41P300M24j5113l615K1428j1821q733J0392P582K32j1382p061
16294b0579N826N520n425n275k981M354R460l070j4103n858K376K1434N170k642
$$ y = [-27388, -18163, -18429, -3681, -1420, 4600, 26441, 24468, 16496, 10859, -1977, -11627, -9161, -16249, -13744, -8697, -17662, -14602, -9189, 3029, -6427, -7931, -5770, -777, 8984, 8987, -8103, -18150, -17897, -28436, -24108, -23659, -26674, -32212, -27661, -23509, -22358, -13548, -18115, -17841, -17918, -679, 6559, 4764, 6046, 3195, 5153, 141, 2450, 3243, 13568, 19152, 12750, -5967, -3829, 11181, 23556, 13300, 80, -8670, -23406, -17346, -5975, -7937, -9226, -14749, -5241, 5551, 6937, -5250, -9405, -6808, -5264, 5525, 4713, 10820, 16362, 16387, 6963, 1914, 5620, 9595, 11340, 4989, 9392, 6228, -1005, -10072, -10453, -10212, -2912, -2488, -17601, -21216, 212, -11609, -20342, -9950, -2368, -2136, -13518, -20579, -14753, -9233, -14658, -19933, -22914, -18560, -9100, -12170, -26273, -32131, -29755, -8321, -3151, -5793]
16280e793n828J5415r657j6889p512K561J3569L85l89r963o839o24R376Q119p410
16265b1479K403J6048J2450n262K626O255j353m661n204J4770Q841l334m480j0560
16251G060M788j859j294j0196O403O945K494o399j0773j234R224K360P788k767
16237A2540K716J2335R84j6885j3614O273J3484n029p874J554O685j2766j2308
16224a1905p290k700p46J0223O895L686O452M876r493n86P405L556n375j3334
16210h336m94M473J849L251j865q855J3171J2079J2294k72j5472o828p055n066
16196g126j688P237J0422k491J0071j811j2597j4648j317J0609o950k786L711
16183i364K653L69L233P779K111J3543J0313l065K795k365M702J6508k3365k7889
$$ y = [-5793, -11621, 3794, -5863, -22752, -30264, -27703, -14134, -13749, -14138, -24101, -30940, -31564, -22188, -14069, -21479, -19076, -3028, 9422, 4160, 6786, 13041, 11688, 7027, 1823, 16593, 25434, 22100, 17620, 7060, 11848, 9989, 8695, -1501, 4902, 11847, 14341, 7942, -2831, -4065, 5159, 7519, 15307, 12540, 15256, 27591, 28575, 11690, -1924, 4349, 17833, 12804, 4930, 6484, 13169, 403, -11905, -19195, -21895, -22641, -12418, -5523, -1837, 4615, 9491, -2, -588, 6817, 10373, 4998, -8336, -8830, -4357, -2508, 743, -1122, -9977, 3194, 15273, 27567, 27295, 11823, 4995, -2060, -7126, -8814, -1577, 8845, 6354, 16425, 14614, 2017, -12631, -13948, -3339, -10289, -13075, -9364, -6711, -6342, -3109, 4670, 6781, 20324, 30637, 27572, 30367, 28002, 32704, 49212, 25847, -2042]
16169b042j135J296m271Q119l600K597q224j0992J0939J2718L962l186j0121K3
16155c917o062o186q096J971O344K715l021o106N553J1237L005j214N340j598
16141c5j238J0760n981l851j646m269o46J6753L206j0259p344L474p418P713K0813
16126B0032O534j4192j6768j2678K0195J07m588q637j2685j508J3851Q087K698
16113D48l209R574o859p711j381O308j413q640l617J1464O183P780p287p639n067
16098a1066r786k522M378M414p300M907N296Q258O685O660M412q175k707p967
16084d513l99l17j666K696Q082J1198k0353k4549L310P962K378L182n985j3007
16070c1981L945J735J3467p265m789Q856j089J6138k457o037n492J575R711J0063
$$ y = [-2042, -3177, -1881, -6152, 1967, -1633, 964, -7260, -18252, -7313, 5405, 9367, 6181, -3940, -3917, -9979, -16165, -24261, -22290, -15946, -13231, -16252, -22358, -16805, -5568, -2563, -3777, 1563, -35, -1273, 9487, 3506, -345, -1991, -6260, -6906, 9847, 13053, 2794, -4550, -1076, -8494, -781, 20032, 26566, 12374, -4394, -17072, 3123, 3230, -1358, -9995, -22680, -24188, -10337, -2250, 448, -2761, 6813, -46, -7757, -9138, -2830, -4243, -12883, -16500, -5036, 1147, 8927, 1640, -5999, -11066, -20852, -23374, -18996, -14582, -21882, -16975, -11679, -3421, 3264, 9924, 14336, 6161, 3454, -4513, -4912, -5229, -6895, -4199, 3883, 15081, -5272, -29821, -26511, -18549, -16171, -12989, -18974, -31981, -28036, -26301, -12834, -20099, -24888, -16032, -17121, -983, -3440, -9477, -14969, -13394, -3683, 6380]
16056F380m337m091Q693m01p431J4062J4454k222l023r080j6307Q423J022J4288
16042B0430l87m160o860m608m987j4247j312L432K08M915j899J3717M373p550
16028A065n037R886N056q603M069j822p101j3753K471P533L507J803n431k670
16014i027K977J2606O06K030j1365L482q672p302k202j398J4655J9582K1751j1970
16000B5753j4460j701k671M135j3449p275J1785M020Q549q261p275L056l020K146
15986A332p176r11p795J621M728N912R140J1131m101n075M076o931j3230k2172
15972b9451M771J4578j886Q37N060n17q872o150M603k187N945r26M055N282J1530
15957F672M22k649l096n080l071K865M764r83j4144J3618J8850J4246q956q427
$$ y = [6380, 2043, -2048, 6645, 6244, -1187, 12875, 27329, 25107, 22084, 13004, -3303, 5120, 6142, 20430, 20043, 15883, 9023, 4415, -572, -14819, -16131, -12699, -12491, -7576, -9475, 4242, 8615, 1065, -3972, 5914, 10970, 2367, 6436, 4614, -2487, -16240, -13769, -6236, -2729, -926, -6357, -9027, -6050, 6556, 7162, 9192, -2173, 1309, -7363, -14665, -16867, -18265, -3610, 15972, 37723, 25753, 11293, 9592, 6921, 11056, -2393, -9668, 2117, 6137, 14686, 6425, -850, 2206, -814, 1332, -5844, -6755, -14550, -12929, -8201, -2289, 6851, 17982, 13881, 8806, 12882, 5951, -7279, -29451, -24680, -10102, -11988, -11151, -6091, -6608, -15480, -21630, -17027, -19214, -13269, -14195, -10140, -4858, 6672, 7094, 4445, 1349, -3731, -6802, -3937, 827, -156, -14300, -682, 18168, 32414, 23458, 15031]
15943A5031O229J0957p101j3944p834L175n515n308N289j0358L122r384N43J1171
15929c927k823J336L414j831L428p287P12M468m079j2863K792O037L421O568n829
15914f463p480l151K831J2066k369K764K944N073L30o057j1402r347k820Q108
15900a4973J414P650r616L904J7325N205J126m788O912N399L467k7954j7084J2176
15886i837J1663j0615M398J0478L197r18k113q730J4009p136o620R546j4976n132
15872a2786j739O739J413l651l0k788L518J3948j3o89J354R593K0065L984k5052
15857A3866j5889J129L928O644k246o45o342n683k343j1495j815O000Q848K334
15843c709r05N153r05Q979j345p750R261N488j4727n028Q831p981j4830L495J8944
$$ y = [15031, 21260, 32217, 25116, 11172, 3338, 6513, 998, -4310, 979, -9379, -6257, -15641, -15098, -3927, -6750, -5414, -2000, -3831, -403, -7690, -6978, -2510, -6589, -19452, -16660, -10623, -7202, -634, -6463, -13943, -17094, -14263, -2197, -4566, -1802, 1142, 6215, 6545, 488, -10914, -20261, -23081, -14973, -13559, -5909, -15525, -11621, 5704, 10909, 12035, 7247, 14159, 19558, 23025, -4929, -22013, -9837, 1826, -8789, -4391, 6087, 9284, 8366, 6253, -2477, 11532, 4396, -2224, 7322, -7654, -12786, -14525, -7786, -6373, -10024, -10054, -12842, -9324, 4624, 4611, 3922, 5276, 14869, 34934, 38918, 13866, -2023, -894, 3034, 9678, 7432, 6787, 445, -5238, -7581, -19076, -20891, -14891, -6043, -3709, -4614, 539, -366, 8613, 7268, -482, 8779, 14267, -460, -5488, 3343, -4638, -19468, -15973, 2971]
15828B971O827l151L184j0125j669N290r202M374l914p988j977L920O64j0168
15814b0964R242M607n161k208J3309L351k515k054j90P391M533m377l511O542
15800G995l044l901j1048R82P909j1987J84L570P218K783r482p991k325J2492
15786f645K331l06l095J0215J3271m459j7718Q982Q842j9273j135K331j0990J391
15772a6258K063p280O279J0295j329M575J7998n487r289j3722j608J279K876j6837
15758b6445Q559J1277J3345n627p208m065k135j2337m382J3529J4383O554N524
15745A0972j972p167o349P976J743j991M570j1820L133J515p5N076O80P31M412
15730A1434J603N198l810o040l885m612K961L920m050K319o117r175J3632J0906
$$ y = [2971, 9798, 6647, 9831, -294, -1963, 3327, -5875, -1501, -5415, -13403, -15380, -11460, -10796, -20964, -11722, -7115, -12276, -14484, -1175, 2176, -339, -2393, -2583, 4808, 9341, 4964, 1453, 7995, 4951, 1050, -9998, -9016, -1107, -13094, -12910, -9340, -2122, 661, -8821, -16812, -19137, -6645, -4314, -4620, -7715, 2500, 15771, 11312, -6406, 2576, 11418, -7855, -8990, -6659, -17649, -16258, -14195, -21475, -15196, -4901, -6230, -1655, 16343, 10856, 1567, -12155, -13763, -12484, -9608, -26445, -17886, -6609, 6736, 1109, -6099, -10164, -12299, -24636, -29018, -15489, -1106, 5448, 10972, 9000, 1833, -4516, 3460, 5203, 3212, 7782, -4038, -905, 610, 535, 5611, 6291, 7022, 11434, 13037, 18235, 14425, 8385, 4500, -112, 2849, 6769, 2719, 5038, -1079, -10254, 3378, 14284]
15716A4284k0126K71N775l686J176P99o938L369Q43m861L678j606O089J924j0488
15701i497j0304r764J2366J0127O635O910O957k160J51L174P73k717o815o64j749
15686C423p956L07k887j2025l814J4633R836k402n545N139J0674Q58P982j211
15672A7012j606p968n541r154k649O47q210J372J2298J0171j2368j5034N398p843
15658b3475R390J1837O195R743n5j669j1335n541j420K910j8044J601R369J3543
15644C049j0072j1253L416J3068J1698M624j558p493k285p178L289R026K55k955
15630E631K627r04p229m907J6125O193j7044j8804J2238J7353N940L112m031N512
15616B1812J3898j025j392j1455j809o024j3677O092K443j5456j7131L167J8067
$$ y = [14284, -5842, -5571, 204, -3482, -2306, -1507, -8445, -5076, -4233, -9094, -5416, -7022, -933, 991, -9497, -19801, -29565, -17199, -7072, -437, 6473, 13430, 11270, 11421, 14595, 15368, 12651, 5836, 5172, 3423, -4533, -4226, -7113, -19138, -22952, -8319, 1517, -885, -6430, -1291, 9383, 10241, 18223, 17012, 15406, 7438, 1897, -7257, -9906, -9259, -17469, -16097, -3799, 6372, -5996, -21030, -15632, -23475, -14085, -2248, 3947, 13690, 13635, 11966, 631, -4910, -6330, -3420, -21464, -19863, -10494, 3049, -7023, -18276, -14860, -1792, 9906, 14530, 12972, 5479, 3194, -3984, -695, 8331, 8586, 5631, 8258, 7354, 125, -4782, 11343, 17536, 492, -18312, -6074, 11279, 17219, 20331, 16300, 21812, 35710, 34685, 33293, 21838, 20029, 14005, 328, 6420, 8863, -6593, -23724, -20557, -2490]
15603b490o734l964O825o003j675R660K686j569o074J1931R692M046n020j3283
15589a972k415k923o814J465L310J1196J2654m648p50N97M803R501m194p603O084
15574A8291O306m343n910p529L182J0149N681q074p088j2804l60K21L872N390
15560F984q273n490J5507J0673l282M127R47j4955o599j6001l641N300J7463J2446
15546A5206m75r153r451j2427J1535O437q196j2764q685J5953J4533N649K414
15533A0576J4837p236k610J384p693j9919j0815N642J0268J5041m51r556q789
15520i321j1870k014J8830O860M479k548m702q694p764j03P843J4039l854r273
15506h092j169J1859l921K842l81N312k312m948n540P079J787j2283k472K549
$$ y = [-2490, -9224, -13188, -6363, -12366, -14041, -4381, -1695, -3264, -9338, 2593, 12285, 16331, 11311, -1972, -4387, -7310, -14124, -12659, -9349, 1847, 14501, 9853, 9103, 9700, 14503, 24004, 19810, 12207, 18291, 24597, 20254, 14344, 6815, 9997, 20146, 25827, 17753, 10665, -2139, -2499, -2278, 1594, 6984, -1289, -6779, 8728, 19401, 16119, 20246, 21193, 6238, -361, -16362, -20003, -14703, 2760, 15206, 14731, 5578, -3873, -16300, -4765, 1672, -6524, -19288, -27973, -12020, 2513, 8162, 10576, 25413, 18177, 15567, 16951, 9258, -10661, -21476, -15834, -5566, 9475, 9024, -532, -9321, -21191, -23205, -4375, 2485, 6964, 4416, -286, -8980, -16744, -16847, -9004, 5035, 1181, -8092, -9261, 2598, -1323, 1519, 1138, 6450, 4138, -810, -6350, 729, 2516, -9767, -12239, -9690]
15492i690l634R202R039R173m134k913Q443l546n536q920j8374M446N185J1576
15478C17J1928J2576J133j8257O48q063O521L431p94L172n406O734M323j060m828
15463A2375m512M514j0401q000j766n066J2106J0562o439P118J889L277J1957
15450B7614n474m919m594l669j6666j0591J2090L220q245j0529J937O708L574
15437i544O809k050q6r644j0870Q87J1432J218J4780p61j1119p968o537l630J3586
15422a3497N667K696J2848O949n147j0655r906j0922l122L254J0837O143M457
15409c98N764j6612q471R336L82J028K880Q334p368p477n338L37M811J0188N759
15394C155j333q315o114R41J860k528O839R011n819j040J0906r543P302N658n906
$$ y = [-9690, -13324, -4122, 4917, 14090, 9956, 7043, 15486, 11940, 6404, -2516, -20890, -16444, -11259, 317, 12245, 24821, 25954, 7697, 8345, 282, 6803, 10234, 9440, 12612, 7206, 13940, 18263, 17203, 12375, 7863, 12377, 1976, -6024, -7790, -12856, -750, 9812, 3373, 10491, 12380, 15657, 27614, 22140, 17221, 12627, 8958, -7708, -18299, -6209, -2989, -11234, -21763, -19826, -13118, -9544, -2735, -4785, -4871, -14515, -25385, -24498, -13066, -11848, 2932, 2171, -8948, -16916, -23453, -27083, -13497, -7830, -5134, 7714, 14663, 9516, -1139, -11045, -21967, -25089, -21835, -10998, -4855, -398, 5366, -11246, -19717, -10381, -9999, -8971, -6091, 2243, -5125, -12602, -17940, -17603, -12792, -2604, 3155, 1822, -6493, -12607, -11666, -9806, -12334, -5495, 3516, -2303, -3343, 7563, -1980, 5322, 10980, 5074]
15379E074O27j503k378k483n135n247q208K32K3796Q879R78j2410j0136l473o305
15364a7692O9L895J3029M461j0336q810R070K838N574j329k902J6012J5344k165
15350B7058j885q279l215k974L399o160j0224J992O834m243o664n902j872J9714
15336G579n854j4720j0915O304N120J9871j393j6488K569o680n684n30M576J620
15322a4625P72P663J409n851p819J5478J8477k1428o669P544j6341n855k83j050
15308b8578J4142r168Q057J2854N841j2012j5614k485K684J5787k093J0102M247
15295C764L70j0113N271P126J913j611j1512j9676J371M1J7430O318j2410k471
15281a4189k285n36P607r424L63K5084K1474j7664n824N413O561M295l352j4528
$$ y = [5074, 5701, 4198, 1820, -663, -5798, -11045, -19253, -19021, 4775, 13654, 14632, 2222, -7914, -11387, -17692, -17623, -13728, -699, 3762, -6574, -15384, -6314, -3476, 2098, 769, -2133, 13879, 29223, 27058, 25173, 16894, 13679, 10705, 14104, 7944, -2280, -288, 6546, 2303, -4361, -10263, -12135, 7579, 1725, -12995, -23910, -17606, -12486, 7385, 5992, -10496, -7927, -14607, -20291, -20821, -16245, -14625, -13853, -6190, -4781, -10632, -18451, -2973, 15504, -5924, -12593, -5049, -21390, -27245, -27528, -28578, -14436, -23604, -15547, -2693, 3148, -8864, -24478, -26963, -24279, -8492, -10585, -483, 3764, 4134, -5979, -708, 6418, 8331, 6720, -4792, -24468, -23097, -23056, -5626, 692, -11718, -14189, -16474, -17010, -9403, -18827, -18464, 6620, 28094, 10430, 4606, 10019, 16580, 20875, 17523, 2995]
15267B995n66Q253j004P137K037j4749M837J4621m512j1395j890L524L064P27
15253A3079l432J6363N020q550M21R335O254p331J3847L4854K1645J9087L4183
15240A54775P842j1167j6288j3161j8953k3588l2551k0505n775p846m465J239
15228I557k70P585j0636j1434M373O19J0923n980J042J831P162o343m694j4442
15214a0707N14J5092O789K825r081N628K525o859K008q342m563M109o939L561
15200c440j272j0556k71o037L054Q014J3726K328j5454p406j635N984K748P130
15186c087J0631j3259l325K985M858J3334j6304l233l361P365O839L86j988j765
15172G6o217J687O523qM61j1233r591J454J0546J8792O105K078M571q692j0016
$$ y = [2995, 2429, 10682, 9678, 16815, 18852, 4103, 8940, 23561, 19049, 7654, 5764, 9288, 12352, 13079, 9647, 26010, 31030, 22480, 22901, 32236, 38490, 31159, 45006, 79860, 101505, 120592, 154775, 162617, 151450, 135162, 122001, 103048, 79460, 46909, 26404, 20629, 12783, 8318, 9557, 9287, 16872, 6236, -5198, -825, -206, 10717, 4737, 5779, 7610, 14772, 8429, 3735, -10707, -10193, 4899, 11688, 14513, 5432, 11060, 13585, 6726, 8734, 392, -4171, -62, -7001, -3440, -4712, -15268, -15539, -21576, -18522, -10508, 3218, 5546, -9908, -17314, -18949, -12965, -10217, -3087, 7544, -5715, -9040, -6055, -1197, 12137, -4167, -7400, -10761, -3396, 3443, 3829, 1841, 76, -6141, -4454, 2069, 2061, 2522, -8711, -18302, -16848, -6302, 12490, 18595, 20673, 25244, 16552, 6536]
15157F536j225j1989p046P323o73k135J860J3203o488j0816N591K848n26N207
15143A670q339o636J53O684J006N27o494l788Q628m929j2236J229K1024p68R137
15128F868q257O502l62J0745J3806J2108K241o882j2305p545p378J814J400r663
15114C092K628R53j0763j0038J0012p27j313J1189M262j697q893n47O57j3243
15100a4428l257l790M245R430j409j7026r459O219Q070J1461O927R705j809K604
15086G483p568q600j994M892k239j189p901q185J2561J7704N447l68O171j1452
15072D762j1311J1644N238N628o00j0441r421N446J0306p671k749R039J730K461
15058A4061J2806M409j305r798n805r020r030j0629M079J9036R140n549k3771
$$ y = [6536, 5311, -6678, -13724, -6401, -7074, -9209, -7349, 5854, -634, -11450, -5859, -3011, -3537, 1670, -6669, -13305, -13152, -6468, -5462, -4935, -11429, -15217, -6589, -11518, -23754, -22525, -1501, -2269, 6868, -1389, 5113, 4751, 15496, 29302, 41410, 43651, 36769, 24464, 16919, 9541, 11355, 12755, 3092, 5720, 6673, -4090, -14128, -4116, -4843, -6156, 5033, 9295, 7598, -1295, -1842, -1185, -14428, -17685, -21475, -17230, -7800, -9209, -26235, -35694, -29475, -21405, -9944, -3017, 6688, 4879, 7483, -85, -8685, -10679, -5787, -8026, -9215, -17116, -25301, -12740, 4964, 10411, 10043, 16214, 4762, -6549, 5095, 10333, 15961, 15361, 4920, -4501, 945, 11251, 3580, 831, 9870, 11600, 14061, 26867, 31276, 29971, 20173, 14368, 5348, -3682, -14311, -10232, 8804, 17944, 12395, -11376]
15045a1376j0696K116R684P147o21o292J854K6855J5083j3110j4150M122O914
15032A7530o093l456L697r96j1957O752j800o152J4400J0529p184j2156q276M81
15018d681P073R625l303l577J4076L900J0300J010q860r93j2707q348J7056K3507
15004D4078K5297N626o024j4215q154o606o932k1029P647L217q720k62p786J192
14990G329p248p044J732O614o869j3893q153J2613J1451Q862J7291l720r136Q381
14976A8210J204m236m862m126l948n412k003J0072J338N569M711n877m061L198
14962I777m074K94O515p227r452k352L682J1889l41j9316j5099J2462J3914n14
14948A58j2867M80J6991J0916N971J4160k043j8346j0313K46J863M970J0721m091
$$ y = [-11376, -22072, -19956, -10272, -3125, -3746, -10038, -8184, 18671, 33754, 20644, 6494, 10616, 17530, 11437, 7981, 11678, 10682, -1275, 5477, 3677, -2475, 11925, 22454, 15270, 3114, -5162, -4681, 2392, 12017, 8714, 5137, 19213, 23113, 33413, 34423, 25563, 24570, 11863, 3515, 20571, 44078, 69375, 75001, 68977, 54762, 46608, 40002, 33070, 12041, 19688, 22905, 14185, 13923, 6137, 7329, 81, -6963, -5231, 1383, -5486, -19379, -27532, -14919, -3468, 5394, 22685, 18965, 9829, 18210, 19414, 15178, 10316, 6190, 2242, -3170, -5173, 4899, 6237, 11806, 16517, 10640, 6579, 9777, 5703, 5997, 12512, 5285, -4167, -6519, -2837, 9052, 8711, -10605, -25704, -13242, 672, 158, -12709, -12229, 4762, 15678, 21649, 35809, 33766, 15420, 5107, 5353, 7216, 12186, 22907, 18816]
14934A8816j1272J1635O223j810j5681j1389K573N006J4299O168J1832L050j210
14921C8240j5057j4378j176l499n560L334p141j9286M338J3109J3460M934n092
14908F226m89J0490J110p222L042O231l398m819L625j308m412r428q583M003O821
14893A889P169N268j136j0220j2757K440J6781N370O032L145j1468j2806m789
14880e082q10P665J1114o56J4250J818j4501J216K322k710J0555m245J269J552
14866B3757k562l279m408m140l549n035p067l983M476N119J4570J3396j7728j0894
14852a327L745O937j0552p642L069J5782L860k755J059j8156q008P263K627p706
14838a1804k544n866O738J4897j220p984k90o507j918J1183J4239N722Q742R468
$$ y = [18816, 7544, 19179, 25402, 23592, 7911, -3478, -905, 4101, 18400, 24568, 36400, 39450, 38240, 23183, 8805, 7629, 4130, -1430, 1904, -5237, -24523, -20185, -7076, 6384, 11318, 6226, 5737, 16227, 17337, 10115, 13157, 19388, 15990, 11171, 14796, 13488, 9076, -352, -8935, -4932, 1889, 9058, 14326, 13190, 2970, -9787, -7347, 9434, 14804, 20836, 23981, 12513, -293, -5082, -5892, 1773, 12887, 12231, 26481, 28299, 13798, 15014, 17336, 14626, 25181, 20936, 22205, 23757, 21195, 17916, 13508, 9368, 5819, 784, -6283, -10266, -5790, -671, 13899, 27295, 9567, -1327, 2418, 9355, -1197, -8839, -5770, 10012, 13872, 11117, 12176, -5980, -13988, -6725, -4098, -11804, -14348, -20214, -13476, 1421, 201, -7783, -8073, -14580, -16498, -5315, 8924, 14646, 23388, 32856]
14824C2856l116r314j1738p470j189L04J208j3631K349K053R608N427L403P80
14810A1530K489k315p215k0295q807K0889J0958K270k154L22m803Q43P426K439
14796A3577k191q489k868l101J2541K681M326q697j0799N92J2750l49j0243l170
14782c440P364P983Q472P056k348j1130p091m046J876k081j90LQ05P556l309j0287
14766b807r069J056K5602Q818j468K71o394j5294L075M787K0354L989j329o215
14752B5376l378r824p546j100J5426p62j4419n704R057J2144J700m771O059p921
14738A4337j1827n372k695k92R604O022m507j628J354P385q717n564J4751J754
14724A4605j2038m916J4479K087K515o56m938p66o042N08R895N586j2472L556
$$ y = [32856, 29740, 20426, 8688, 1218, 29, 333, 1541, -12090, -9741, -7688, 1920, 7347, 10750, 11530, 14019, 11704, 4489, -15806, -24613, -3724, 7234, 9504, 7350, 7672, 2869, 3712, 11138, 13577, 11386, 2897, 29, -3072, 9469, 12150, 16476, 7779, -3020, -2428, 10322, 9973, -270, -3440, 3924, 11907, 20379, 27435, 25087, 13957, 6866, 2820, 4696, 2615, 2425, 2428, 3233, 10789, 7480, -2807, -11876, -10820, 14782, 23600, 22132, 22403, 16009, 715, 3790, 8577, 28931, 32920, 31591, 25376, 21998, 12174, 4628, 3528, 18954, 18192, 3773, -1931, 7126, 19270, 20970, 16199, 22258, 14337, 2510, -2862, -5557, -5849, 3755, 9777, 5270, 3642, 4996, 12381, 3664, -1900, 12851, 14605, 2567, -2349, 12130, 14217, 16732, 16076, 11138, 10372, 4330, 4838, 14733, 20319, 7847, 11403]
14710A1403K928l562Q16o156j319O299q365L678O89M180L22m588N52L015L72L719
14694A3983M72n908P334r474L933L689p368q149q915l707j061k126J9723J4184
14680A6610q234N142K650j0023j5004k896l936Q888J2410J0264p600o749J8386
14667A9908P568J357m844k823J132O863j7218j3749L710m075k856R8n704L636
14653f997l601k759l425p534j0669j1477N539R126J9578J2249k35R290P644l955
14639A2774m029J027Q487l280m885n755n23P302p344l137J346q118P13K0760J6093
14624C1431j2549j9417Q248m657j2530j0962J965L596J853M427J0175J312o308
14611c416L711P681K991j503r476L33K639J437K104Q975j3560j3139l444P894
$$ y = [11403, 14331, 10769, 11585, 5429, 4110, 10409, 2044, 5722, 6411, 10591, 10913, 6325, 6877, 9892, 10264, 13983, 14455, 8547, 15881, 6407, 10340, 14029, 6661, -1488, -10403, -14110, -15171, -17297, 2426, 16610, 8376, 13518, 16168, 6145, -8859, -11755, -15691, -6803, 5607, 15871, 8271, 1522, 19908, 27476, 28833, 23989, 21166, 22298, 29161, 11943, -1806, 1904, -2171, -5027, -4929, -10633, -6997, -10598, -13357, -16782, -24316, -34985, -46462, -40923, -31797, -12219, 30, -205, 9085, 16729, 12774, 8745, 9772, 18259, 14979, 10094, 4339, 3816, 11118, 3774, 637, 1983, -6135, -5422, 15338, 31431, 18882, -535, 7713, 3056, -9474, -20436, -18471, -14875, -13022, -8595, 1580, 2892, -3416, 295, 7976, 10967, 9464, -12, 321, 2960, 4397, 6501, 15476, 1916, -11223, -14667, -6773]
14597f773R808J817j9394j7776J6396J7966N427r028p549L653n846l565L791N416
14583e657J7546P218p66k99j0495j538r799n067j0678R208j76J727O718j687M104
14568C59q20J6878Q665o661m146L903m912k462o126K166O429K011j0826r97Q635
14553A2096k505Q397O440r536O618j5403P601Q692j963k00j3371N757K1291q236
14539B5678j6211m888m159J0147O123R386k21r512j3391J692j1086o489j115J637
14525a2409o479J2041O007M383J7915L64k0384j204J254q476p51O477k059J642
14511a679r63O77J9731M511n895m713q069M468M618j3815j714Q717R850J544n46
14496A6722J858p037m017j2477j2701K990p931M574J1067K385N839O721j556Q041
$$ y = [-6773, 3035, 4852, -14542, -32318, -15922, 2044, 7471, -1557, -9106, -5453, -11299, -14864, -11073, -5657, 11889, 19107, 18341, 18042, 7547, 6009, -3790, -8857, -19535, -10327, -10503, -8776, -2058, -3745, 359, -461, 16417, 25082, 18421, 14275, 18178, 13266, 10804, 4678, 6844, 13273, 15284, 4458, 3461, 12096, 9591, 17988, 24428, 14892, 21510, 6107, 13708, 22400, 20437, 20237, 6866, 12623, 33914, 25678, 9467, 4579, 420, 10567, 16690, 26076, 25855, 16343, 2952, 4644, -6442, -12931, -14046, -12409, -18888, -6847, -840, 3543, 21458, 21822, 1438, 234, 1488, -6988, -7739, -1262, -3321, -1679, -2642, -1965, 17766, 22277, 16382, 11669, 3600, 8068, 12686, -1129, -2843, 5874, 15724, 17268, 16722, 18580, 11543, 7526, -4951, -17652, -14662, -22593, -18019, -6952, -4567, 1272, 7993, 6437, 14478]
14482A4478N27l961j336O454r343O381N150j7891r957P395J3132m568L482n629
14468D314p88R03M180L071p33l794K736l08J766J9691J0339p243j6861k028J6815
14453C2060J0851k854M024q807n251K55l611L325n11j3282j7275n593j169K674
14439e164l68k633j0575P819J0803J2252K842L866l135J2468L987O391j7101j6223
14425E229r468m554K498Q221O368J997j802J5043R788K713n891k353K576j643
14411B8722M0L060r340p002k528P782P726j0412J480J1167l572o077j142Q542
14397B8446P80j0531M533M274L061K248k225j577m983k2300J6762R43l407p798
14383H226l242J1893O382k516m797j4593P463O645p643Q70k613Q037l926N036
$$ y = [14478, 15005, 11044, 9708, 16162, 6819, 13200, 18350, 459, -9498, -2103, 11029, 6461, 9943, 4314, 3526, 4429, 8609, 11680, 10947, 7153, 9889, 9581, 11347, 31038, 41377, 34134, 17273, 15245, 32060, 42911, 40057, 44081, 35274, 30023, 30278, 26667, 29992, 29481, 16199, -1076, -6669, -7838, -5164, -5532, -8165, -18740, -10921, -118, 12134, 14976, 18842, 15707, 28175, 32162, 38553, 21452, 5229, -4239, -8793, -6295, 1926, 8294, 10291, 8489, 23532, 33320, 36033, 30142, 27789, 30365, 28722, 28762, 31822, 22482, 15480, 12952, 20734, 28460, 18048, 19528, 30695, 27123, 21046, 19904, 28446, 29226, 18695, 23228, 27502, 30563, 32811, 30586, 29009, 24026, 1726, 18488, 19431, 16024, 8226, 4984, 16877, 23259, 20743, 15946, 1353, 8816, 15461, 7818, 8688, 6075, 14112, 10186, 15222]
14369A5222q597O490j666L165k45M603O346q54Q639N313l931m282j4642J076J1212
14354B7849O762j79j5177K579j618j5126p435L986r79L587J220J0272N121J297
14340B2159R887N420J498N772O823n705j4883k1497K885P066m717J844R010J8731
14326D4293k41j2908q886k822P078J1378n132j712J2990j6356O558J4304m100
14313D4444j9571r856j2817R258J3309K489O980Q603k743L946j026J3141l951
14300E2206k1422m678j66j0264J0687J9468R487J651J4404L0974J0101N540o1
14287A17927K596J7905K6496J8988J1994J5366J7268J9576L6576M4533Q5160J31671
14275E46056J79921K29601K35240K34630J60784P7141l0431j39080k18854k47492
$$ y = [15222, 6625, 13115, 11449, 14614, 14369, 18972, 25318, 24464, 33103, 38416, 34485, 30203, 15561, 16637, 27849, 34611, 34432, 19255, 21834, 20216, 5090, -2345, 1641, 662, 4249, 5469, 15741, 20862, 22159, 32046, 37466, 38964, 44736, 51559, 45854, 30971, 9474, 12359, 19425, 14708, 16552, 25562, 44293, 44052, 31144, 22258, 19436, 26514, 37892, 32760, 31048, 44038, 27682, 34240, 48544, 44444, 24873, 15017, 2200, 11458, 24767, 27256, 34236, 42839, 40096, 44042, 43016, 56157, 52206, 30784, 26106, 25940, 15676, 26363, 45831, 55318, 56969, 71373, 102347, 112448, 117988, 117927, 120523, 138428, 164924, 183912, 195906, 211272, 228540, 248116, 284692, 329225, 414385, 546056, 725977, 955578, 1190818, 1425448, 1586232, 1663373, 1632942, 1493862, 1275008, 1027516]
14265A027516k42834j99363j49572r5330o2369n2184m1896k4088j6176r087l0778
14254A03839j0381M279o331j2373r900k217j955q1j0017p561J142L982L70m820
14240D7976j0320j6294P908J2882K301r6j809n136q8J1879m451J448p250N916
14226D4866l91J8594P3j3090M155N101p675n456p243l514L108M004k0184m501
14212A7847J1952J2273o133q589L349R17J707o703r670j0022J484J2239J1842
14199C2493K117o73j7656j2504K07k757Q830Q98l872k493K3108J199N926P240
14185D2063L663l1K774j709r362r303n297Q761p802r609p064M779J1482K1403
14171D4748K248j6358j1556q549J309O616O094J7303j068q580q535o201q14J238
$$ y = [1027516, 784682, 585319, 435747, 340417, 278048, 225864, 183968, 159880, 143704, 134617, 103839, 93458, 97737, 91406, 79033, 69133, 66916, 64961, 64880, 54863, 47302, 48444, 52426, 52796, 47976, 37656, 21362, 29270, 42152, 44453, 44357, 42548, 37412, 37324, 49203, 44752, 46200, 38950, 44866, 44475, 63069, 63142, 50052, 54207, 59308, 51633, 46177, 38934, 35420, 38528, 42532, 22348, 17847, 29799, 42072, 35939, 27350, 30699, 31616, 33323, 26620, 16950, 6928, 8412, 20651, 32493, 34610, 33937, 16281, 3777, 3984, 1227, 10057, 10955, 7083, 4590, 27698, 28897, 34823, 42063, 45726, 45695, 48469, 46760, 37398, 28095, 22798, 31559, 23757, 14148, 7084, 11863, 23345, 44748, 46996, 30638, 19082, 10533, 11842, 18458, 24552, 41855, 40787, 32207, 23672, 17471, 16657, 17895]
14157A7895J0526J2052J3663J3751j3877j169Q857q527K605M457L145o992l207
14144E3179J5456k777Q65K957Q839j494j0950m94M602n677p770k097J4118P937
14130G6694p374j9775j0455K199l718r03L044j201Q600J7864R625n518n802r244
14116E4036o821n877L232j886j5617J998J926L082O788j267j3395q753p327o875
14102C244Q960J2119j0587P951J8948K1824J1048P275J4540Q942L227O127j0624
14089A02994k685j3355j4037P801K677R147n58j6330j0527j231J0605l569j744
14076F9188m735N332M10l853L353q641j1018j642n750k338M381J7339j030J3513
14062G4509P173K914j244j378o038k479k239PJ9358J3338J6405R650Q274M733
$$ y = [17895, 28421, 40473, 54136, 67887, 54010, 52841, 61698, 53171, 55776, 60233, 63378, 56386, 53179, 68635, 65858, 66723, 69680, 78519, 77025, 66075, 65581, 70183, 64506, 56736, 54639, 68757, 76694, 69320, 49545, 39090, 41289, 37571, 36668, 39712, 38511, 47111, 64975, 74600, 69082, 63280, 54036, 47215, 41338, 44570, 42684, 27067, 29065, 30991, 34073, 40861, 39594, 26199, 17446, 10119, 3244, 12204, 24323, 13736, 21687, 40635, 62459, 73507, 80782, 95322, 104264, 107491, 113618, 102994, 100309, 86954, 72917, 80718, 83395, 92542, 91984, 75654, 65127, 63896, 74501, 70932, 69188, 64453, 69785, 70195, 66342, 69695, 61054, 50036, 48394, 42644, 40306, 44687, 62026, 60996, 74509, 81682, 84596, 83352, 81974, 75936, 73457, 71218, 71225, 90583, 103921, 120326, 129976, 138250, 142983]
14048A42983N345K6224L7134J8766J2121K3993J1704j2307k0699m3499l8889k1468
14036A41408j0280k2981j0704k3106r51j4373n254p725J676J2522L424k784J3083
14023G3955J3306N378K586l106l243j2933o588n23J0498Q212N978q772M70p06
14009H4512k060j8792j6788m439n545P893J0483M424J781K333k91j169q465K069
13995E5946O589J1905J6093K339n349M082J2771Q909j1687p737j3924j0839o027
13982F3071j1871K2641J1102L5228J4462J1921L7103L4299N2202N5740Q1724Q4077
13970D91699O1632O5511O1870M2473K0666K070l3423n3245n5740q1746q2517o6974
13958C72276o2319m6075l2477k9808k1792m617j4318K960k24J94J1094J6981K4553
$$ y = [142983, 148328, 174552, 211686, 230452, 242573, 266566, 278270, 265963, 245264, 201765, 162876, 141408, 131128, 108147, 97443, 74337, 73386, 59013, 53759, 46034, 47710, 60232, 63656, 60872, 73955, 87261, 92639, 95225, 92119, 88876, 75943, 69355, 68832, 79330, 87542, 93520, 84748, 85218, 84512, 82452, 63660, 46872, 42433, 36888, 44781, 55264, 59688, 61469, 63802, 63511, 62342, 53877, 55946, 62535, 74440, 90533, 92872, 87523, 91605, 104376, 113285, 101598, 93861, 79937, 69098, 63071, 51200, 73841, 84943, 120171, 134633, 146554, 183657, 217956, 270158, 325898, 407622, 491699, 553331, 618842, 680712, 723185, 743851, 745921, 712498, 659253, 603513, 521767, 439250, 372276, 309957, 263882, 231405, 201597, 179805, 175188, 160870, 163830, 163606, 163800, 174894, 191875, 216428]
13945B16428J3060J4227K1249j295j8394k6120l000j5695J332N203j3485j6734
13933A76776j574Q596J621m144Q437M817J847n561l585j5504j6041j3336L502
13920A45851N810J159J1452L6189N2558M8324L2536R756K642J331K954j3609r110
13907C27843J5454j0051k1316j3280j5430m791q213J766p59J1864l133O650J0424
13894B97028R142L891J4207J3764L721J3194Q605J2121K0429O675L566o946J939
13881D01336J0549J0189O624N058O728j3412P021J7136J6275K3038n876q02M398
13868D88262J0618J6463M529J6801K3180Q053J7590J8802J6670J4206J3564J5479
13856F64217N489P415K7696M3068L5377L2991L8994K1570K6876J2253J1183J9717
$$ y = [216428, 229488, 243715, 264964, 263669, 245275, 219155, 216155, 200460, 201792, 206995, 193510, 176776, 175202, 183798, 185419, 181275, 189712, 194529, 196376, 190815, 187230, 171726, 155685, 142349, 145851, 151661, 152820, 164272, 200461, 253019, 301343, 333879, 343635, 346277, 347608, 350562, 336953, 327843, 343297, 333246, 311930, 298650, 283220, 278429, 270216, 271982, 271223, 283087, 279954, 286604, 297028, 306170, 310061, 324268, 338032, 341753, 354947, 363552, 375673, 396102, 402777, 406343, 399397, 401336, 411885, 422074, 428698, 433756, 440484, 427072, 434093, 451229, 467504, 490542, 484666, 483864, 488262, 498880, 515343, 519872, 536673, 559853, 567906, 585496, 604298, 620968, 635174, 648738, 664217, 669706, 677121, 704817, 747885, 783262, 816253, 855247, 876817, 903693, 915946, 927129, 946846]
13844I46846K6532L6933M9862M6760N1286N7994N8093P8677Q5130R5236J07992
13833A641341J00281J00457J19707J15473J16212J27127J44145J53101J59050
13824B776894J50889J43224J54643J74514K10148K27757K94186L37407M00953
13815D870615N19729O59896Q15411J007955J249792J491537J755806J928082K064894
13806A6363717K126874K158872K315550K566429K971056L666207M691443O333366
13798D3193514Q907663J3063059J9687447K8885646L8235534M5674535M6834924
13791B44482322L8654527K4696382K114902j8183890l5511908m6008233m6168034
13784A64076068m1859386l2561340k3358897j5991090j0626957p142609m918108
$$ y = [946846, 973378, 1010311, 1060173, 1106933, 1158219, 1216213, 1274306, 1352983, 1438113, 1533349, 1641341, 1741622, 1842079, 1961786, 2077259, 2193471, 2320598, 2464743, 2617844, 2776894, 2927783, 3071007, 3225650, 3400164, 3610312, 3838069, 4132255, 4469662, 4870615, 5390344, 6050240, 6865651, 7873606, 9123398, 10614935, 12370741, 14298823, 16363717, 18490591, 20649463, 22965013, 25531442, 28502498, 32168705, 36860148, 43193514, 52101177, 65164236, 84851683, 113737329, 151972863, 197647398, 244482322, 283136849, 307833231, 309948133, 291764243, 256252335, 210244102, 164076068, 122216682, 89655342, 66296445, 50305355, 39678398, 32535789, 27617681]
13777B7617681l487994k493917j865658j544972j441545j511422j579002j657265
13769A2035906j596424j412483j203539r55521p67095n88172m34514l50460k67596
13760D460102k15779j48207j01932j09320j36848j88824k36630k89263l00895
13751B732404k85003k53034k15010j59845j19753q9216p7078p3142p1253o0702
13741A328368l1418l7103r352j5338j7761l2492m4005l8671m7699n2419l7539
13730I64571l1866k5177r880o169j876N807J5960M2107R0324J03265J11230J03840
13718A362136N7735j4234q1466j35305j59291j27981j10992r0943n3395m1076
13708F05188n3831m1773m895j5681p46L2733N5448O5709M4177J46l0980o2045
$$ y = [27617681, 24129687, 21635770, 19770112, 18225140, 16783595, 15272173, 13693171, 12035906, 10439482, 9026999, 7823460, 6867939, 6100844, 5512672, 5078158, 4727698, 4460102, 4244323, 4096116, 3994184, 3884864, 3748016, 3559192, 3322562, 3033299, 2732404, 2447401, 2194367, 1979357, 1819512, 1699759, 1610543, 1533465, 1460323, 1389070, 1328368, 1296950, 1259847, 1250495, 1235157, 1217396, 1184904, 1140899, 1102228, 1054529, 1002110, 964571, 932705, 907528, 897648, 891479, 889603, 895410, 911370, 953477, 1043801, 1147066, 1258296, 1362136, 1419871, 1405637, 1324171, 1188866, 1029575, 901594, 790602, 699659, 646264, 605188, 551357, 509584, 504689, 489008, 488262, 520995, 576443, 642152, 686329, 686475, 655495, 593450]
13696E93450p8753n7364n0311n4431m0617k2536L762m537j8247r581K613L594
13684B67042J1144k35K766j0736j4681k4430k2636j5568p917m448k3759j6365
13672A40177n438j5094j5445k149O660J403K382L105J9188J6130L4474L9788L6196
13659B61377L1351J3039J0128P825j0583k1599k2203k7618k2895k0821r94l390
13647A93617J0890Q149O000J4277Q103J7719K022j8039j9085j7204j5596k2923
13635A67930k3282j8204Q075J3413J1367p450j735j0808J197L11k648Q408q634
13622A37940j8948l636J4377J4709l116j0905p380J8234M251q986K68Q759J425
13609A46992j3535j2253j0870q390J0793J4872Q5K032J8007P383O511j6712j5992
$$ y = [593450, 514697, 457333, 407022, 352591, 311974, 289438, 293200, 288663, 270416, 260835, 263448, 267042, 278186, 277951, 280717, 269981, 255300, 230870, 208234, 192666, 184749, 180301, 156542, 140177, 134739, 119645, 104200, 102051, 108711, 110114, 112496, 115601, 134789, 150919, 185393, 225181, 261377, 292728, 305767, 315895, 323720, 313137, 291538, 269335, 241717, 218822, 198001, 197007, 193617, 204507, 212656, 218656, 232933, 241036, 258755, 260777, 242738, 223653, 206449, 190853, 167930, 144648, 126444, 134519, 147932, 159299, 151849, 150114, 139306, 140503, 140814, 138166, 146574, 137940, 118992, 115356, 129733, 144442, 141326, 130421, 123041, 141275, 145526, 136540, 136808, 145567, 146992, 133457, 121204, 110334, 101944, 112737, 127609, 127694, 129726, 147733, 155116, 161627, 144915, 128923]
13596A28923o693M586R04p858k435j0004n305j1255J497J1776j7682l548J597
13583H4503l334J3593P90L363J3190m374n680k352p118k96r800o920Q185j206
13569H2544k1678j3940Q072K880J208o571j2873n959q729M758k03l693o502O982
13555B6296N474P704N234J2553J7872N553J1926J1157o792o069q660j3121N481
13542G4608L823k294m811m961j839J9236O844q612q566r612j9009k0024K435J474
13528B8692r109j0813m604M825Q902M604K430P788J2677j266j2254p420j0834
13515A3618K075l019J7165K134j2387Q22q89l625J894N485J534r341k113J7689
13501C1042R258J1745j770j3563j986J743j3176N9M440P529l84J115j5410q433
$$ y = [128923, 122230, 126816, 127720, 119862, 117427, 107423, 102118, 90863, 92360, 104136, 86454, 82906, 84503, 81169, 94762, 95552, 98915, 112105, 107731, 102051, 99699, 92581, 92285, 82485, 75565, 83750, 82544, 60866, 46926, 54998, 57878, 59086, 52515, 39642, 33683, 24954, 29712, 29509, 25816, 19314, 26296, 31770, 39474, 44708, 57261, 75133, 80686, 92612, 103769, 96977, 90908, 82248, 69127, 74608, 78431, 76137, 71326, 66365, 64526, 83762, 90606, 81994, 73428, 63816, 44807, 24783, 27218, 28692, 19583, 8770, 4166, 8991, 17893, 22497, 24927, 32715, 45392, 44126, 31872, 24452, 13618, 15693, 12674, 29839, 31973, 19586, 20408, 19519, 15894, 17788, 23273, 24807, 15466, 13353, 31042, 40300, 52045, 50275, 36712, 34726, 36469, 23293, 23352, 27792, 35321, 34937, 36052, 20642, 12209]
13487A2209j0594j5437r48n653J088L094J0911K8190J3715J2894R293K42m510
13474E4494n561N37n333j3855K980r596p033O121J0260J8977N307n061P742J1879
13460G1858L686R6k696j6227j7044j189L918M654p868J0596j7123j3177j1332
13447H152N467M999j1884K21K3359R068k2583O79K965M743p532j5672j2779M709
13433f088P627l965N079P698j566J2398K215J1327J183j5506j2870J717O710p94
13419A5165Q65PJ2210K150l620j0131j2958M855R123P042P273k792k777L656p782
13404B2286o342P140N450p898j765j648K038m332q921j1916J5905J5281m183J703
13390B2798p292j9680m076n758J1621Q376j0852L385R469J1567K477p008j0716
$$ y = [12209, 1615, -13822, -14770, -20423, -19335, -16241, -5330, 22860, 36575, 49469, 58762, 59004, 54494, 48933, 49470, 44137, 30282, 33262, 23666, 16633, 22754, 33014, 51991, 57298, 52237, 59979, 71858, 75544, 75640, 72944, 56717, 39673, 38484, 42402, 47056, 39188, 49784, 32661, 19484, 8152, 13619, 18618, 6734, 6955, 30314, 39382, 16799, 17478, 20443, 25186, 17654, 1982, -10797, -6088, 1539, -2426, 2653, 10351, 8785, 21183, 23398, 34725, 35908, 20402, 7532, 9249, 15959, 15165, 16030, 16037, 28247, 30397, 26777, 16646, 3688, 8543, 17666, 24708, 31981, 29189, 26412, 30068, 22286, 15944, 23084, 28534, 20636, 18871, 17223, 19261, 14929, 6008, -5908, 9997, 25278, 21095, 22798, 15506, -4174, -8250, -14008, -2387, 5989, -4863, -1478, 7991, 19558, 22035, 15027, 4311]
13377D311K085Q849Q391Q188r73Q546m031k3241J459R750J2846r681l600o31p55
13362B1513q851n367J385P764J0900M613j7088K021O657p295M645k774j1784K391
13348H730m537k471M156n943l600q4M175P498M46J3272J4784O713R102p7j1904
13333D0260q018J471k716m587Q389J1972N004l588K74J7143K0939J8352O563n13
13319A10945J5860J4992K108Q830K3807J7084J0847K3959K5015N4307Q8348J33974
13307E30076J91677K36212K45378K28970J97327R2594l4650j43652k26077k46017
13297A071838k34189j94069j57907j15422q4769o0605l9035k5918k2195k2592
13287A15137j3403m370m356j9237m188L042j7275r931J2414O971p816K687K145
$$ y = [4311, 6396, 15245, 23636, 31824, 30851, 39397, 35366, 12125, 13584, 23334, 36180, 26499, 22899, 22268, 21513, 12662, 7295, 8680, 16444, 27344, 31957, 14869, 16890, 23547, 16252, 20897, 18123, 6339, 8730, 4193, 1722, 5878, -65, -3665, -3749, 426, 7924, 8370, 21642, 36426, 43139, 52241, 52164, 40260, 32242, 33713, 30997, 26410, 34799, 46771, 51775, 48187, 48461, 65604, 86543, 104895, 111458, 110945, 126805, 141797, 143905, 152735, 176542, 193626, 204473, 228432, 253447, 307754, 396102, 530076, 721753, 957965, 1203343, 1432313, 1629640, 1722234, 1687584, 1543932, 1317855, 1071838, 837649, 643580, 485673, 370251, 285482, 224877, 185842, 159924, 137729, 115137, 101734, 97364, 93008, 73771, 69583, 72625, 55350, 45419, 57833, 64804, 56988, 59675, 61820]
13274F1820k293J0792J746r014j3844j0058J4324N588M355J512J3033K3084K9486
13261A30531L7851N5182M4465J3075l073n3436n4049l4756l3178j8208j7589q495
13249E8320Q325K2703P471J3892J867j4449j4143k3045k3528k830R008P562j2193
13236C8960K195J2190j711j5324K867J1217J743q794j4311L564P959M803Q265
13223E3623r04J4036J8843N92O782K4100L2198L9786O2983M9134J6757l2565l7855
13210B47510m9660l9941l0665L416j975R148L7194N4220O4143L2896k078l6170
13198B88038o6483n7155l4167j7184j6856j1392l584r02j5305j2947Q08J8499
13186G1370K0259K9514K3402K5292K2999J0724k125j016L686k499q833j274O969
$$ y = [61820, 59527, 70319, 72065, 63051, 49207, 39149, 53473, 59061, 63416, 64928, 77961, 101045, 130531, 168382, 223564, 268029, 281104, 278031, 224595, 170546, 135790, 102612, 84404, 66815, 58320, 66645, 89348, 96819, 110711, 112578, 98129, 83986, 60941, 37413, 34583, 43591, 51153, 38960, 41155, 53345, 51634, 36310, 39177, 50394, 52137, 43343, 29032, 32596, 40555, 45358, 53623, 52719, 66755, 85598, 86190, 92972, 117072, 149270, 189056, 252039, 301173, 317930, 285365, 247510, 197850, 157909, 127244, 130660, 128685, 137833, 175027, 229247, 293390, 326286, 324208, 288038, 221555, 164400, 130233, 113049, 96193, 84801, 81217, 80315, 65010, 52063, 52871, 71370, 91629, 121143, 144545, 169837, 192836, 203560, 201435, 200419, 204105, 201606, 192773, 191499, 198468]
13173A98468Q97j6949m548M216J5214p03k6066m2115k0954p880o533J7812L579
13160A14438K0906M9686N0447O9054L3272l4435o2255n8993m3273k6381k3469
13149H8997l2280j0443r091o838n657P475R170r9J9834K0364J9416n800j4544
13136H0504o261J307m289k1451j2329J524R56J1106M66L020K278m006r754j483
13122D1588j289p564p612J5628L015k161J522J5879K691J1964L9354L96k2090
13109I1321k7725l862j8842j4048o404j419j2827K530m979Q674n230p14Q213l00
13095A4388j914M178m924l273r953k129K914m41j4706L334J2791P303K259R940
13081A9767n369j0952l57l859R428L671j5632n926j0429j935P271J1565k298L589
$$ y = [198468, 199365, 182416, 177868, 182084, 197298, 196595, 170529, 128414, 107460, 99580, 93047, 110859, 114438, 135344, 185030, 235477, 304531, 337803, 303368, 241113, 182120, 138847, 112466, 88997, 56717, 46274, 37183, 30345, 24688, 32163, 41333, 41234, 61068, 81432, 100848, 95048, 80504, 74243, 75550, 71261, 49810, 37481, 39005, 39961, 51067, 51533, 54553, 56831, 52825, 43071, 41588, 40299, 32735, 25123, 40751, 43766, 41605, 43127, 59006, 61697, 73661, 113015, 113411, 91321, 63596, 59734, 40892, 26844, 20440, 19021, 6194, 8724, 3745, 12419, 7189, 6475, 14688, 14388, 12474, 16652, 11728, 8455, -1498, -3627, -713, -1154, -15860, -12526, 265, 7568, 9827, 19767, 14398, 3446, 3089, -770, 8658, 12329, -3303, -9229, -19658, -21593, -14322, -2757, -5055, -1466]
13067a466P189Q592J2106l795r95o453o756k47O248l850k867l453L403l847o321
13052b512j562J387Q885J30J1565o226n817j0084j708n088K515J8114P832n101
13038A2330J496Q3k480m642p757L335J6749O033O44R36n238P80m862j338J832
13023A7901P46M717J681j3824j0037q056M010q601p937J3689J6358P985j1656
13010F976k751P879q308m596J67J889o933N999m513K885J5714J4760M452j0190
12996B3430j5428O225M526j0486o745L209P826Q783J1264M559j0307p341O984
12983B6499n682k678J3665k483J0698q855j2116j0785p504M088P264j343N766
12970A6534J057m945o291O079J1654l559j3238O95p047k040p996q1K3919J0681
$$ y = [-1466, 5723, 14315, 26421, 22626, 21631, 15178, 8422, 8175, 14423, 10573, 7706, 4253, 7656, 3809, -2512, -4074, -2687, 6198, 6328, 17893, 11667, 5850, -4234, -5942, -11030, -8515, 9599, 17431, 12330, 13826, 13909, 11429, 6787, -970, 2365, 19114, 25147, 25791, 26727, 21489, 22269, 17407, 16069, 17901, 18647, 23364, 25045, 11221, 1184, -6872, -2862, -11463, -19400, -5711, 10647, 18632, 6976, 4225, 12104, 3796, -800, -633, 1256, -5677, 322, -4191, -1306, 14408, 29168, 33620, 23430, 8002, 14227, 18753, 8267, 1522, 4731, 12557, 21340, 32604, 37163, 26856, 19515, 26499, 20817, 18139, 31804, 29321, 40019, 31164, 19048, 8263, 759, 4847, 12111, 10768, 16534, 17591, 12646, 6355, 12434, 24088, 20529, 7291, 7986, 939, -1101, -9097, -9178, 14741, 25422]
12956B5422n124k569L712r072k2374q464L969J1091p38j538n61J2197N754N66
12942A2271o597n983j120R424K321M47K016j1188M965N177j0584L306M658Q072
12928A7185M036j601j307p415P810N550K88j535J784q606j3324N330R014J541
12914A8750r724M12J772o075r309n90J2167J3008J490j2750r418p492j1973J0474
12900i258P632L970k431R241J0617n223k3769m114J7038J4810J5893j8197r146
12887G063k610K289n144j834q899p78J0510N048j893N115J698j0889o661Q166
12873A181J0224N970j481Q489K746j8154l772M41M227j6350l167o859m752R989
12859a1268K1021P893O746o129j4155J416p237n988k994R979L337M99M339n988
$$ y = [25422, 20298, 17729, 21441, 12369, -10005, -18469, -14500, -3409, -4147, -5685, -6246, 5951, 11705, 12271, 5674, -309, -1429, 7995, 10316, 10763, 12779, 1591, 6556, 11733, 1149, 4455, 9113, 17185, 21221, 19620, 18313, 10898, 18708, 24258, 24546, 23011, 24795, 16189, 2865, 8195, 17209, 18750, 9026, 9438, 11210, 5135, -4174, -4764, 7403, 20411, 21901, 9151, -267, -7759, -19732, -9258, -1626, 2344, -87, 9154, 19771, 14548, -9221, -13335, 3703, 18513, 34406, 16209, 7063, 4453, 6742, 1598, -236, -9135, -9913, 597, 5645, 3752, 8867, 10565, -324, -6985, 1181, 11405, 17375, 15894, 24383, 27129, 8975, 5203, 5644, 9871, -6479, -9646, -16505, -21257, -11268, 9753, 17646, 24392, 18263, 4108, 5524, -1713, -7701, -10695, -716, 2621, 3120, 7459, 1471]
12845A471k4006q339J897Q034N538Q621o33J590O029P337N352J703j394r778J806
12830E228Q024q280l323J2160k461j2641l554N255K173j0436p04J1036J8456q673
12816A2260j3160n145p995O112O80L622M054j0435o944J8494L50l259k201J270
12802b297Q840J903k618O76Q733q8l003j0074p792m774l31K650j658j745L191
12787h387o81P984m616J1507j357K109K671J1844o5j7186O835o092l934p407l364
12772a0139o507K777J4475m857n723N387m631p575n661q267P554J6322O828j258
12758a275k680l97J0149m872q404r647l426n006J4256R123J105p70P632O185M457
12743A6430k291o025J211k928J0808J1284n31j9070m632j6815p320R459P917L244
$$ y = [1471, -22535, -30874, -28977, -20943, -15405, -6784, -7417, -5827, 202, 7539, 12891, 14594, 13200, 3422, 5228, 13252, 4972, 1649, 13809, 11348, -1293, -4847, 408, 2581, -7855, -8559, 2477, 20933, 12260, -900, -6045, -14040, -7928, -7248, -3626, 428, -10007, -16951, 1543, 1893, -1366, -3567, -2297, 6543, 8446, 5828, 6504, 15237, 15149, 12146, 2072, -5720, -10494, -10825, -8175, -9833, -11578, -8387, -9068, -1084, -5700, 5807, 4450, 6559, 9230, 21074, 21009, 3823, 10658, 4566, 632, -6775, -10139, -16646, -13869, 606, -4251, -9974, -4587, -9218, -16793, -22454, -30721, -23167, -6845, -17, -1275, -3955, -4352, 5797, 925, -7479, -17126, -20552, -25558, -11302, -2179, -1074, -1844, 5788, 11973, 16430, 14139, 8114, 9325, 6397, 17205, 28489, 27958, 8888, 4256, -12559, -19879, -10420, -2503, 741]
12729G41J110j504r00J656K2052J7762p255j1880j3469p523j1826j21j773j317
12715a4247K2704J3965j2769r106p465Q017L501J390P709J414q314j3303j144
12702g648L772J1940P498j8384j6649O60L0j2488p872R600J099J3304J3778K574
12688A214O395p951L381k547j8103m226J1459q704j7259n217J9860Q915p36J2561
12674i58N38j5236P036J0005N814o448n373R220J0892J7m640n322j4389l3J5412
12659F535N87j1572N378Q489J2675J2286q034j5421k776K053k5J1712P190j3093
12645A5984j4770p628L196N200l991k525l942M524k398j8182J457J8685J2835
12632H445r077j2757P338O50P153L360p67K134n632k444k808M241m245Q844J2645
$$ y = [741, 1851, 347, -553, 1103, 23155, 40917, 33662, 21782, 8313, 790, -11036, -11157, -12930, -14247, 8457, 22422, 9653, 547, -6918, 1099, 4600, 5990, 13699, 15113, 6799, -6504, -7648, -3876, 8064, 15562, -2822, -19471, -18811, -18781, -31269, -39141, -29541, -28442, -15138, -1360, 1214, 7609, -342, 3039, 492, -17611, -21837, -10378, -19082, -36341, -41558, -21698, -12783, -13519, -958, -420, -15656, -8620, 1385, 7199, 751, -4622, 4598, 15490, 15507, 10867, 5545, -8844, -8877, 6535, 7122, -4450, 928, 9417, 22092, 34378, 26344, 10923, 8147, 10200, 10175, 21887, 29077, 15984, 1214, -6414, -3218, 1982, -2009, -4534, -8476, -3952, -6350, -24532, -23075, -4390, 8445, -632, -13389, -6051, -5401, 1752, 5112, 4345, 6479, 847, -1597, -4405, -164, -4409, 4435, 17080]
12617A7080r280q086o278L347N59n62N047J4524K945j3166Q15K401M840Q790o818
12602A6158j0601o61n454l925J47r996J16j357J5348J3923k816k0169j3707M842
12588a8152o703J8139J2887q649o542N554K236n295m185M624L530K460L806R418
12574A3128j582j8882m307J487K229P420K294j5981o519J4033q848Q852M132k76
12560b820J644j076L61o116j3323J4800J4663j4185n942l528O596J0257J051l758
12546a376n004R989L570l423l358m622J95j5743m377k648L380n427j109o201J1828
12531b4326K1976P271n892l812j128R804J6306k191k622L425q442o442J17j2585
12517h541j569o503j4810p156J1320J0407l78R416J3463L048q123j3698J3118
$$ y = [17080, 7800, -286, -6564, -3217, -2658, -3220, 1827, 16351, 19296, 6130, 6945, 9346, 14186, 22976, 16158, 5557, 4896, -558, -4483, -4336, -14332, -14216, -15573, -225, 13698, 10882, -9287, -22994, -18152, -24855, -6716, 6171, -2478, -9020, -3466, -1230, -6525, -10710, -6086, -2556, -96, 3710, 13128, 11546, -7336, -11643, -10156, -7927, -507, 1787, -14194, -20713, -6680, -15528, -6676, -2544, -2820, -1176, -2252, -1891, -8007, -21330, -6530, 8133, -6052, -11994, -15522, -8926, 1331, 2382, -1376, -6380, 3609, 7179, 3756, 398, -4224, -4029, -19772, -24149, -26797, -23417, -28844, -29953, -36154, -24326, -2350, 4921, -971, -4783, -5911, 3893, 20199, 18008, 15386, 18811, 10369, 3927, 4044, -8541, -10110, -16613, -31423, -38579, -27259, -16852, -17230, -7814, 5649, 8697, 574, -13124, -6]
12504fL343j3009j6417P883R596N045r998R83K75j2405j0684J4134J5605J866
12490c789J805l119o651P288P44J7961Q357l869r743j105r05o106K211P719r692
12475A106Nm357O75M988r235p858N8k282j3442j932K557k777J4160N810R385J0254
12459G115K280l866l506N382j5964O14K886n901m471n545K608r897R543J6531
12445b191N688l347r866M059J5952M033j0432p386j059P78j736n468l872M147
12431a0700J888P901J4325O586j8300j2567K410J879p850O374M266j1224O913
12418h099O102R73N701j0174j194q969M312Q953O627J415N094K182j757L12n84
12403A0894j398L572j0472L551P195Q514o177m971J1939J467j3276p687j302J5902
$$ y = [-6, 3337, -9672, -26089, -18206, -8610, -3565, -13563, -12580, -12305, -24710, -35394, -21260, -5655, -3789, -1984, -5103, -11754, -4466, -3722, 14239, 22596, 18727, 8984, 7879, 6974, 868, 3079, 10798, 1106, 1111, -3246, -2571, 2417, -6818, -14676, -14618, -16900, -30342, -32274, -29717, -32494, -18334, -12524, -3139, 7115, 9395, 5529, 2023, 7405, -8559, -7945, -5059, -10960, -15431, -20976, -18368, -28265, -18722, -2191, 3497, 150, -9716, -5657, 10295, 14328, 3896, -3490, -4549, -3771, -5507, -10975, -14847, -10700, -8812, -911, 13414, 20000, 1700, -10867, -8457, -6578, -14428, -8054, -3788, -15012, -8099, -1997, -1024, 4677, -5497, -6691, -15660, -11348, -2395, 4232, 5647, 10741, 12923, 11166, 11478, 10894, 9496, 13068, 2596, 6147, 13342, 21856, 15679, 10708, 22647, 24114, 10838, 3151, 1849, 17751]
12389A7751J095q122J4743n466o296j1965j3806J0411M93R695Q436j5755j9700
12376a8486j128K2854J2601M026j2872n398K171j081j0757m631k219J0203O744
12363B027O95j2733M437K1448J1610r797j1240J0193N14q697J781n69l84K426
12349A1711p281j4719p344J0240K744R110N860N688n664j4146k259J1254K83j0630
12335e153m667K767n713J06J933j791P440O15j92n610N822o282l907K020K4607
12320A1995J5865M10r125j3136j061N544o924m856L737P321l755j168j0076l359
12306h588L666M537J3396J4138o897j194n650r318l823N640J2248p699n775l943
12292G38K175l742n999J750K1766m388j1189l139J5451l018n118J70n851O067
$$ y = [17751, 18846, 10724, 25467, 20001, 13705, 1740, -12066, -1655, -1162, 8533, 16969, 1214, -18486, -19614, 3240, 15841, 19867, 6995, 1597, 3768, 2687, -8070, -12701, -14920, -4717, 2027, 2722, -10011, -5574, 15874, 27484, 17687, 6447, 16640, 17154, 8457, 10238, 9669, 9285, 11711, 4430, -10289, -17633, -7393, -4649, 4461, 10321, 16009, 10345, -3801, -6060, 5194, 5477, -5153, -9820, -7053, -12766, -12660, -10727, -12518, -5078, -4463, -4655, -10265, -4443, -10725, -14632, -12612, 11995, 27860, 28270, 19145, 6009, 4948, 10492, 3568, -1288, 2449, 9770, 6015, 4847, -5229, -8588, -4922, -385, 13011, 27149, 20252, 19058, 13408, 4090, 267, 5907, 18155, 10456, 4681, 738, 2913, -829, -6828, -5078, 16688, 12300, 1111, -2028, 13423, 10405, 5287, 5457, -394, 5673]
12278E673j00j58N435j5628j2061N987P417J6685J2899m64j0097j1084N146p488
12264B162M899N407M753M379m775j3249r222k585K377L459N377J825q463o982
12250a0638j3932M52P566P463M928r978l509j1769j7417J906N867J7600J9409
12237b052J5940n700q534l566J188p09M921L124j2549n634K24m339M789P908q397
12222a3386k549J1044k688r700j0404k95N112J4805P285Q071J3994o665K44k764
12208A2104N866L97n9k27j4866k309l540K713O639j1071l757q44M963L458n581
12193f114m749m247k486R575M738j2876q597j304M720L305J6827l931j1844O491
12179a0492O022o705Q04R971J3313l723j2098n363L535Q790m348n321q63p72l891
$$ y = [5673, 5573, 5415, 10850, -4778, -16839, -10852, -3435, 13250, 26149, 25685, 15588, 4504, 9650, 2162, 7061, 12468, 17221, 21600, 16825, 3576, -5646, -8231, -5854, -2395, 2982, 4807, -3656, -10638, -24570, -24118, -16552, -9089, -4161, -14139, -17648, -29417, -46834, -44928, -39061, -21461, -2052, 13888, 8188, -346, -3912, -2724, -3433, 1488, 4612, -7937, -13571, -13347, -17686, -12897, -4989, -13386, -15935, -4891, -7579, -17279, -27683, -27978, -22866, -8061, -776, 7295, 21289, 14624, 14868, 12104, 17970, 18367, 18308, 18081, 3215, 906, -2634, 79, 6718, -4353, -8110, -8954, -3991, -533, -6114, -10863, -15110, -17596, -8021, -3283, -16159, -24756, -26060, -21340, -18035, -1208, -5139, -16983, -10492, -4470, -11175, -10371, -400, 12913, 9190, -2908, -8271, -4736, 4054, -294, -5615, -6478, -7250, -11141]
12164a1141Q717N409l718r498j4945Q532R769J1864L538j15N211J2951Q088m566
12150C0096O656l202q106n735m711m824k256j1815j5740P241K560q84n160J888
12136a3992Q976O319K726j1323j3243o68J0050J2800K290j2464q208J1056M894
12123g87m096N028m719L164Q929o682j1194r767J2530Q482m571k098k638J2978
12109D559P148M273p298j6564p692M706j3584M12J819n7J8254M038l187K794j1915
12094a2294J6563J4901K688O426j171j1318q782m408P426L09l687j589J2013o597
12080A0480j667P361l505j1011k0006Q787K1140N478j0589k638N491n451m637
12067g67r298M988K675p99J2842n065o951K347O239k752N23j620n534N705N45
$$ y = [-11141, -2424, 2985, -733, -10231, -25176, -16644, -6875, 4989, 8527, 8412, 13623, 26574, 34662, 30096, 36752, 33550, 25444, 19709, 14998, 10174, 7918, -3897, -19637, -12396, -9836, -10720, -15880, -13992, -5016, 1303, 4029, -7294, -20537, -21205, -11155, 1645, 3935, -8529, -16737, -5681, -787, -4883, 145, -4574, -1410, 7519, 837, -10357, -20124, -7594, 888, -3683, -5781, -8419, 4559, 11707, 15980, 8682, -7882, -15574, -10868, -24452, -24040, -22221, -22278, -4024, 14, -3173, -379, -12294, 4269, 19170, 21858, 28284, 27113, 15795, 7013, 2605, 10031, 10340, 6653, 5064, 17077, 10480, 8813, 16174, 12669, 1658, -18348, -9561, 11579, 17057, 6468, 3830, 9321, 3870, -767, -10065, -5077, -2402, -3201, 9641, 4576, -2375, -28, 6211, 3459, 3982, 2362, -3172, 2533, 3078]
12052C078M952M032j7309J781P728l458m256k783O325L036K750j946j4202j41
12038a0413o445p111N462K0053P091j0226j5977j080J4899K280L05j3284n228
12025a9674M370R814mL077q217M362M400j1435m162N323r735m360L169Q245K0210
12010E383l320k1300n699M071r633l983J1086Q203l23o305J7945J0958J006J4340
11996B2429l263j3608n636j2357n006j0412m968J6889K535l296J4647K395l111
11983b762j0525N395k416n92J0345J3474L308p817k673p184m206q297j1136J394
11969b3692J57R574K278p551M297K2534J5540j7153o475L760J6544Q473j0400
11956A7886j0733P993o526l985J5784r535l923K885q747p28q310m427p686J2027
$$ y = [3078, 8030, 12062, -5247, -3466, 4262, 804, -3452, -6235, 90, 3126, 5876, 3930, -10272, -10413, -16858, -23969, -18507, 1546, 8637, -1589, -17566, -18646, -3747, -1467, -1162, -14446, -19674, -15304, -5490, -5494, -2417, -10634, -6272, -1872, -13307, -17469, -12146, -21881, -26241, -23072, -14827, 5383, 2063, -19237, -24936, -20865, -30498, -34481, -23395, -15192, -15515, -21820, -3875, 7083, 8089, 22429, 19166, 5558, -78, -12435, -17441, -27853, -32821, -15932, -13397, -16693, -2046, 349, -2762, -13287, -7892, -10308, -10900, -555, 12919, 16227, 8410, 5737, -1447, -5653, -13950, -25086, -23692, -23535, -13961, -11683, -19234, -14937, 7597, 23137, 5984, -491, 3269, 19813, 28286, 17886, 7153, 15146, 8620, 4635, 20419, 10884, 6961, 9846, 1099, 371, -7939, -12366, -20052, -8025]
11942h025J2660J0445K167j4007n312m022M347p410m993J2607k951j5221P837
11929a1878M701p26o346j915K610Q480J1152j907r049R621O691J423q185m398
11915B74m705n157p833k367K0765O279R32j9243J1817J0506O194k789N441k007
11901A8107o548m450J906j8337n161j661l82k119Q784P137O65p065k815p04j2506
11886b5149O856O701J1309N659j954j539J93r288l32J258m496l7R800O052J0420
11871A5453q375j0966j4768o565M282J6802J0047M693k5780m151R900P184P04
11858a540K027j0371r200o971M218l302k388o58L402M472J3558k994O199J5335
11844A1787L385l8j0299M620p993n327n602q65J589j4488O924R473o105j2909
$$ y = [-8025, 4635, 15080, 17247, 3240, -2072, -6094, -1747, -9157, -14150, -1543, -4494, -19715, -11878, -7177, -7903, -14249, -16164, -13554, -5074, 6078, 4171, -4878, 4743, 11434, 12857, 4672, 274, -4431, -9588, -17421, -19788, 977, 7256, 8188, -11055, 762, 11268, 17462, 14673, 20114, 18107, 11559, 7109, 9015, -9322, -14483, -16144, -16526, -18645, -9861, -2724, -2059, -9124, -11939, -12643, -25149, -18293, -11592, -283, 5376, 3422, 1883, 2076, -7212, -7544, -6286, -10782, -10819, -1019, 5033, 15453, 7078, -3888, -18656, -25221, -20939, -4137, 5910, 10603, -15177, -19328, -9428, -2244, -1540, 487, -9884, -19084, -26055, -21837, -25139, -27527, -28185, -24783, -20311, -6753, -9747, -3548, 11787, 15172, 15134, 4835, 9455, 1462, -3865, -9467, -10332, -8743, -23231, -16307, -6834, -12939, -25848]
11830b5848N831J4187J0953p605k040j385m428J657n334q65j4419l273J1520J2346
11816h703L450P917j0627N868m451j292M148j8187k174l569L203o2L772P785L121
11801i801m973n36Q392j4607q168k526J2315R739n883p296R104J0421K037Q207
11787F425k194R50J4967o011j0178R37j0201J4223j1241j6018M495j3239K888
11774b4197J7769Q069p232q20L257P360n835j951l174l092j650K273l153n838
11760a8214q749P922J0157J5549Q499p87j0646P742l525L72o205k516N505J1270
11746A6374K988r64j0863r598r370r075j905J7143R605L9o686L999L894m407m079
11731b905p080K302N550L792n80m081r667j6156J0726P040j918Q348J0287k318
$$ y = [-25848, -20017, -5830, 5123, -2482, -4522, -5907, -10335, -8678, -14012, -14877, -29296, -32569, -21049, -8703, -5253, 2664, -7963, -2095, -6546, -7838, -3690, -21877, -24051, -27620, -24417, -24479, -20707, -12922, -9801, -14774, -15310, -6918, -21525, -29693, -32219, -19904, -10165, -16048, -23344, -14240, -3819, -1782, 6425, 4231, 5181, 20148, 14137, 3959, 4896, -5305, 8918, -2323, -18341, -13846, -27085, -24197, -6428, 1641, -5591, -6411, -3154, 4206, -1629, -3580, -6754, -9846, -11496, -9223, -12376, -18214, -26963, -19041, -8884, 6665, 15164, 14377, 3731, 11473, 7948, 8320, 2115, -401, 5104, 16374, 19362, 18398, 7535, -2063, -11433, -20508, -22413, -5270, 4335, 4374, -2312, 1687, 5581, 1174, -2905, -9985, -7683, -2133, 1659, 1079, -3002, -12669, -28825, -18099, -11059, -12977, -4629, 5658, 3340]
11717C340J445L346j0073p762N02J9298O855r221j0551M49Q094O076p315O38m93
11702D628q009j1904j025J3336J7230K838m938j857q833O498q778P861j2350k453
11688g756Q681N643o116Q940l867j2155kJ8253J5263r084o079o296j2733j005
11674h313K554p787N415r576o081J7250O176L276K629J617R305M933l338o932
11660A1128j6579P512m77n588J0805k914o076j0484j0919L808Q863M171o185j664
11646a4599o804J2403Q045j1178l617r168K27l632j1889J183J7674M937J3503
11633b915J1324o72j3847J717K370n86m429p021O461n686Q67n95p868r405j2985
11618d3270Q520J3885J0131n226j3024O428M02j162Q499m769Q785P033l074O724
$$ y = [3340, 4785, 8131, -1942, -9704, -9202, 10096, 16951, 7730, -2821, -2372, 5722, 11798, 4483, 5121, 4628, -3381, -15285, -16310, -2974, 14256, 17094, 12156, 10299, 1466, 7964, -814, 7047, -5303, -7756, 925, 6568, 452, 9392, 5525, -6630, -6632, 11621, 26884, 17800, 11721, 5425, -7308, -8313, -5759, -13546, -8131, -17707, -23788, -6538, -362, 2914, 5543, 7160, 16465, 21398, 18060, 11128, -5451, 2061, 1584, -4004, 6801, 3887, -2189, -12673, -23592, -19784, -10921, -6750, -12935, -14599, -21403, -9000, -955, -12133, -15750, -24918, -24691, -28323, -40212, -39029, -21355, -16418, -2915, 8409, 7737, -6110, -4393, -2023, -2609, -7038, -14059, -7598, -13284, -12417, -13012, -20880, -30285, -43270, -34750, -20865, -10734, -15960, -28984, -22556, -22154, -23316, -14817, -19586, -10801, -3768, -6842, -118]
11604a18j0709O93Q661p473q341J0917L503n819M727j6003j310N876J0171L641
11590a584j347P103j849o09O225q281m140L860K181q573n701j660l809J8898K948
11575C662Q633N847j2527k3879j0702L300J4938J607L421P797k365j044o93J3097
11561A1092R329j4699j0976q068n92J1131J0130n919l190M205K921J0086l155
11548A2295r919J520o876m157l455j2019q053J0186R950m196N295J9447N929J149
11534A7096n044j2637m609J3733O962r258p912K499r687n115P615j2329j393n517
11520b5596j101L385Q061L699J1347M096l840J0484O407p593O131q06j3572l495
11506b393j270L076J812J2103J1073J171m449q455j2150n211L825L424O002m805
$$ y = [-118, -10827, -10134, -1473, -8946, -17287, -6370, -2867, -8686, -3959, -19962, -21272, -15396, -5225, -1584, -2931, 4172, 2323, 1714, 7939, -342, -4482, -622, 1559, -7014, -12715, -14375, -18184, 714, 3662, 12295, 18142, 5615, -18264, -28966, -25666, -10728, -9121, -5700, 2097, -268, -1312, -2005, 11092, 20421, 5722, -5254, -13322, -13914, -2783, 7347, 1428, -1762, 2443, 5364, 15450, 12295, 2376, 3896, -2980, -7137, -10592, -22611, -30664, -20478, -10528, -14724, -9429, 10018, 15947, 17096, 12052, -585, -5194, 8539, 15501, 6243, -1669, 830, -8857, -13972, -6357, -18686, -20079, -25596, -26697, -23312, -15251, -11552, -205, 3891, 51, 10535, 16942, 9349, 15480, 14674, 1102, -2393, -3663, -587, 1225, 13328, 24401, 25572, 21123, 12668, 518, -4693, -868, 2556, 8558, 3753]
11492C753n797O83j73l806k2518n478K54J406J6636P698j1341j2395n102J2453
11478b3727K489P479o359J409N58p842O920J0367L691J032n421N920N455J927
11464C898O62j3840j0493j002J1070K1209p623l419m775n209k396j0078n00M470
11450a8026o665Q334J793q444L742P303r820k520R285J987l00L865L925j1418
11436a6959m267J130O009J98o739J2968p112k047M292J528r700k953J2648L652
11422g352J950O492l976k751P959N190p243j5822K959m10L111M1J307J458J636
11407e451k507Q993J0349J690M286l629l889N693J0246o955k565o481r774J0611
11393A0617n577K888n34O235Q692r346j4865r358L833q138p512o590O779n221
$$ y = [3753, -2044, -1361, -1534, -5340, -27858, -33336, -33082, -31676, -15040, -7342, -18683, -31078, -36180, -23727, -21238, -13759, -20118, -18709, -18151, -25993, -19073, -8706, -5015, -3983, -9404, -3484, 1971, 3898, 4560, -9280, -19773, -20775, -9705, 11504, 3881, 462, -4313, -9522, -11918, -21996, -22496, -18026, -24691, -16357, -14564, -23008, -19266, -11963, -21783, -24303, -15018, -13031, -13331, -9466, -5541, -16959, -21226, -20096, -14087, -13889, -20628, -7660, -14772, -16819, -12527, -10999, -20699, -23652, -11004, -7352, -5402, 1090, -2886, -5637, 2322, 7512, 269, -15553, -12594, -13004, -9893, -9852, -8545, -7087, -5451, -7958, 1035, 11384, 13074, 17360, 13731, 9842, 15535, 25781, 18826, 16261, 9780, 6, 10617, 5040, 7928, 7394, 13629, 22321, 12975, -1890, -11248, -7415, -15553, -23065, -29655, -22876, -28097]
11379b8097J2495J5310n63R394L341j4887M68P016Q855Q755M882j7128k6909N826
11365a1242J8964R328K688k2164j0845J2462n41q551o809n948N092J4245J3445
11352A0124O60n820j0115L642M895R176j919j4182K376o32p808P56Q70m508m162
11337a6647p597j0744N026J3849N115q260l953k609k467j282j904O827Q260M340
11323a2046J5041j056r513q240M111L286j1302J169O158k900L672q055n388J0768
11309a4295J170P077L312j3183n074N049O117Q127q751q448k823n471L428o469
11295c0234r91R098J9342O33r217l225p05j574K391L707K972M937R863n537k448
11280i88O946p730q780Q40r259J099J292j394J4232M431j8032J6074P949q190
$$ y = [-28097, -15602, -292, -855, 8539, 11880, -3007, -2539, 4477, 13332, 22087, 26969, 9841, -17068, -11242, 7722, 17050, 19738, -2426, -13271, -809, -1350, -9901, -16710, -22658, -17566, -3321, 10124, 10784, 4964, -5151, -1509, 3386, 12562, 10643, -3539, -1163, -1795, -9603, -8847, -7977, -12485, -16647, -24244, -34988, -29962, -16113, -10998, -19258, -23211, -25820, -28287, -29569, -31473, -24646, -16386, -12046, 2995, 1939, -7574, -15814, -11703, -8417, -19719, -18550, -12392, -15292, -11620, -19675, -25063, -14295, -13125, -6048, -2736, -15919, -20993, -15944, -9827, -1700, -10451, -18899, -21722, -27193, -23765, -30234, -31225, -22127, -2785, -2152, -11369, -14594, -15299, -16873, -14482, -10775, -7803, -2866, 6997, 1460, -988, 5958, -1772, -10552, -9712, -18971, -17872, -16580, -17974, -3742, 689, -17343, -1269, 6680, -1510]
11266a510j1862K659Q94j03N818J6437J2593n359j8421J3946R550j2125q341k1071
11252a6895J642n422j653J9299J6666R47n541r299m24P524o096J1403K1436L683
11238C7270j8150j5066m644l959L349j7051k769J9611M974J4021j898n905n304
11225D479j474O022n981j3062r080j2517M388J6433N942L477K030q415j519L392
11211e885J309M218k069p826J2692J5095L17o546k672L820j1729K890L972m787
11197B799o606M691M250q12j5558r994M840J7485Q337r461j4168m713J0917J3163
11183E170P610J6310l98k649k049j3620l769M270m643J0347L771p183J049K788
11169A7004q36j9972j757P041r23j83J0681L283j810L861j269n332N419p955j2134
$$ y = [-1510, -13372, -10713, -9819, -9922, -4104, 12333, 24926, 19567, 1146, 15092, 24642, 12517, 4176, -16895, -15253, -20675, -22328, -3029, 13637, 14584, 9043, -256, -680, 6844, 748, 12151, 33587, 37270, 19120, 4054, -590, -4549, -1200, -18251, -21020, -1409, 3565, 17586, 15688, 9783, 4479, 3005, 9027, 3046, -10016, -19096, -31613, -27225, -10792, -4850, -1373, 657, -7758, -9277, -5885, -4576, -358, -2427, -10253, 2439, 17534, 17851, 11305, 8633, 12453, 724, 3614, 7586, 2799, -3807, 884, 5134, 4322, -11236, -21230, -16390, 1095, 9432, -29, -14197, -18910, -7993, 5170, 12780, 29090, 28692, 26043, 23994, 10374, 6605, 10875, 6232, 16579, 20350, 13167, 14216, 17004, 16168, -3804, -5561, 1480, 557, 374, 11055, 14338, 12528, 16389, 15120, 9788, 15207, 7252, -4882]
11154d882l377O894j4564j1142J2990P839n856P193L199L462l849o348o422J0843
11140d020J1464j2596j3062R716J8705O704j2106n090R592r204r670p561Q081
11127i047K966j3711J78J1948P939Q798n634k439J3747m223n318o190n127M267
11113a846M050N779l405j427j1022k392K310N7M090q113Q775J175L626L082K231
11098F970N340L78q478j9486O57L595R903M429r91j1898n981R419M486J0470R556
11083A8369J3155j2873j1792l541K549q663p446J0926J3714r904m415j587l797
11070e305J1764N492l055L477M558j4376j703k778R004k618k127m702R2n942n987
11055a4206L391J0231M944L724q144j9635j567J0958j672j1227R951R576L584
$$ y = [-4882, -8259, -1365, -15929, -27071, -14081, -6242, -12098, -4905, -1706, 1756, -2093, -8441, -14863, -4020, 7444, -5152, -18214, -8498, 10207, 16911, 4805, -285, 9307, 103, -9567, -17128, -9047, -6081, -19792, -19614, -7666, 273, 9071, 3437, 998, 14745, 10522, 5204, -986, -6113, -1846, 2204, 7983, 4578, 3151, -7871, -10263, -7953, -7896, -3806, -11919, -3144, -1969, 1657, 4739, 6970, 12310, 12688, 4210, -15276, -14619, -11024, -1121, 3308, 2317, -9581, -15562, -6143, -1657, 8813, 18369, 31524, 18651, 6859, 3318, 5867, -2796, -10242, 684, 14398, 4494, 79, -1508, -5305, 6459, 11951, 8896, 12373, 16931, 2555, 852, -1926, 7078, 4460, 2333, -2369, -2277, -8219, -14206, -10815, -584, 4360, 8084, -60, -19695, -21262, -10304, -11976, -23203, -13252, -3676, -92]
11042i2q84M670L398j2151L851J1229L57l086J2828j1331j3187N762J014p88j775
11027a85j6904m652R529j427Q015L547j2244n62J251N991k890p69j569o35k283
11012a5787J674O637K349m008l448j0068J725O737l132O387R606K535l586o342
10998h721Q760J0200j3856j3817P269M654o450M859J558m69m73J4199R132l218
10984A3627j0792l224j459J0579L929O55k813L217j5697q120K668l428n432Q294
10970g996M649j5347l138P229R370O874J1883n796o042J409o53J4l180O871k929
10955C218k097k392n065l623O416J860M095L496p233n332O975J4016k162q057
10941D115j7397m050J1563J0967J3491J792m273j6272J025O214k432j285R0Q593
$$ y = [-92, -976, 3694, 7092, -5059, -1208, 10021, 10378, 7292, 20120, 8789, -4398, 1364, 2378, 1590, -185, -17089, -21741, -12212, -13639, -5624, -2077, -14321, -14883, -13632, -7641, -10531, -11300, -12869, -13504, -15787, -14113, -7476, -5127, -9135, -12583, -22651, -20926, -14189, -17321, -10934, -1328, 1207, -2379, -8721, 39, 10239, -3617, -17434, -10165, -5511, -11961, -7102, -5544, -6013, -6486, 7713, 16845, 13627, 2835, -389, -1848, 8731, 12660, 13315, 10502, 13719, -1978, -10098, -7430, -10858, -16290, -7996, -3347, -18694, -21832, -14603, -5233, 1641, 13524, 7728, 1686, 3095, 2442, 2456, -724, 6147, 3218, 1121, -1271, -6336, -9959, -3543, -1683, 2412, 5908, -1325, -6657, 318, 14334, 12172, 4115, -13282, -17332, -5769, 5198, 18689, 20481, 16208, -64, 961, 7175, 4743, 3458, 3548, 12141]
10927A2141M247k468l915j1372m467J583m652Q967O639O374j1330L864r142o090
10913i621q51n184n582J1628o655j086l399J6023J1519R265l171n824q21J758
10899G999j4273j7084m166J5994J4294O764o221j1874l440M778J2628J2535J625
10886A9559q083N17l230K865p914p245J662j5922L540N221O070J2540k967l208
10872C405j419n107j2561J005M815K66J4761k729K354J0797m894m704j363K114
10858F740n249j4477j1227N963J0000o845j515J3638K1944J785j5972j683K503
10845E605j35j0212k789j1930j361K6430K1557l29M404M306N186J16j5816j2947
10831A2085j4159P876Q43l777M841M392L817j0927l212J3377Q951p74n57j0615
$$ y = [12141, 16388, 13920, 10005, -1367, -5834, -4251, -8903, 64, 6703, 13077, 1747, 5611, -3531, -9621, -10472, -15656, -21238, -9610, -16265, -17351, -20750, -4727, 6792, 16057, 12886, 7062, 6241, 7999, -6274, -23358, -27524, -11530, 2764, 9528, 3307, -8567, -12007, -7229, 5399, 17934, 19559, 11476, 11993, 8763, 11628, 3714, -3531, -1869, -17791, -14251, -9030, -2960, 9580, 6613, 3405, 1986, -3121, -15682, -14677, -9862, -9596, 5165, 2436, 4790, 15587, 10693, 5989, 4626, 6740, 1491, -12986, -24213, -18250, -8250, -15095, -16610, -2972, 18972, 20757, 4785, 3102, 5605, 5470, -4742, -7531, -19461, -20822, 5608, 27165, 26836, 31240, 35546, 40732, 40848, 25032, 12085, -2074, 5802, 6645, 2868, 7709, 12101, 15918, 4991, 1779, 15156, 24107, 23333, 22776, 12161]
10817A2161r662n163L637L604k608K821j5784J2172J1069L640j993m406L951K0718
10803C4157j769j1849l105r073j0736l577K664n964K264J291q322j2532K834N969
10789a7748P607l702m611J0869J0704O716j64J2605k48l371o051N90o192j9172
10775a2168j2690J3849J3647K741J4337J0391j3545j6598j0425J4823J3438j784
10763A6016q929l164O094O713j3619k04m258n911jQ173J0574l101k128j4822n038
10748a3605P011P032j010n544j5103m71K619P886Q031K961N596n027j551p387
10734h562L594r388j3729K159L387Q529p904O462J0979P878L987o758l67J0801
10720A1068K268o946k6480O142K4607N039q704J78j2963m433p62j0371R352J6347
$$ y = [12161, 2499, -2664, 973, 4577, 1969, 4790, -10994, 1178, 12247, 15887, 13894, 9488, 13439, 34157, 32388, 20539, 17434, 8361, -2375, -5952, -3288, -9252, -6988, -5697, -14019, -26551, -23717, -17748, -10141, -13843, -18454, -7585, 3119, 9835, 9671, 22276, 22028, 18657, 12606, 13196, 7004, -12168, -24858, -11009, 2638, 5379, 19716, 30107, 16562, -36, -10461, 4362, 17800, 16016, 7087, 3923, 10017, 16730, 3111, 2907, -1351, -7262, -7263, 910, 11484, 8383, 6255, -8567, -13605, -6594, 438, -572, -6116, -21219, -21690, -19071, -11185, -3154, -193, 5403, 376, -1175, -8562, -4968, -14356, -28085, -25926, -22539, -14010, -21914, -15452, -4473, 3405, 7392, 634, 267, 11068, 13336, 6390, -20090, -13948, 10659, 15698, 6994, 7172, -5791, -10224, -10986, -21357, -12005, 4342]
10706D342o304L619n100K975L399r867K679j4042j0250R372N689k831J6977l01
10692C57L184J16o314O710J951n880K847o836n176J0376m574n680J4570K0542
10678B6193O447j9499k4975L122j005P605n181M98l167j1910j459N697P199n888
10664a6323k494J4715N071P468L063j0362l405k290j595O255n62r570M765O956
10650A692M000R840R886k857k1020k384M70k093lL724q312j2618J6460J2198Q36
10635I819p448n745o15J2991J5079j6153j0972J00Q36J1518P534j1009p290J182
10621a73J490P374n779J542J2362J2282J1686R037J2947k934L502N532N851J4488
10607H9207Q212K2552K2297K2743J8090L0625L1592J1785l35J0453P615J6205
$$ y = [4342, -1962, 1657, -3443, -468, 2931, -6936, -4257, -18299, -28549, -19177, -13488, -16319, 658, 357, 3541, 3657, -2657, 4053, 6004, 124, 2971, -3865, -9041, 1335, -3239, -8919, 5651, 26193, 32640, 13141, -11834, -8712, -9717, -2112, -7293, -6795, -9962, -21872, -23331, -17634, -10435, -16323, -18817, -4102, 969, 8437, 11500, 1138, -2267, -4557, -6152, 103, -459, -10029, -5264, 1692, 5692, 15532, 25418, 22561, 1541, -843, -373, -2466, -2469, 1255, -7057, -19675, -3215, 8983, 9819, 2371, -3374, -3989, 9002, 24081, 7928, -3044, -2944, -2108, 9410, 16944, 5935, -1355, -173, 1317, 8691, 2912, 4454, 16816, 29098, 40784, 49821, 62768, 59834, 63336, 68868, 74719, 89207, 97419, 119971, 142268, 165011, 183101, 213726, 245318, 257103, 256768, 267221, 274836, 291041]
10595B91041K0822J0889K223n438k3340k9763j5498j5576l4871l8631k8258l5124
10583I8476k9036j990n949K70o356j8570m692R085p4j8385j1919r40Q25L234N278
10568A9257q510J994j052K168J2063N145j1709k0920K163k92M44J3596O515L600
10554B4462R0m708P40r722q012J3222K767M457r172m715n87o544j027J3886m548
10539A0589j4203o330q402P916Q664j280M998P951K083Q230p265j0355j1608j896
10525a0908Q002J2314j56j0236M131Q708O694p792q446P274R534M871M41j687
10511B2744k0475j0482J6232K785n617K637J373Q087j0322m183J1446o059m669
10498C497j739n585K740N698p375j970R00K178K089o714M576J0107N554J0630
$$ y = [291041, 311863, 322752, 324975, 319537, 296197, 266434, 250936, 235360, 200489, 161858, 133600, 98476, 69440, 67450, 61501, 61771, 55415, 36845, 32153, 41238, 41164, 22779, 10860, 9920, 10745, 13979, 19257, 10747, 12741, 11689, 13857, 25920, 31065, 19356, -1564, 599, 307, 751, 14347, 20862, 24462, 24552, 19844, 20584, 10862, 2850, 16072, 18839, 23296, 14124, 9409, 8822, 2278, 1251, 15137, 10589, -3614, -9944, -18346, -10430, -1766, -3046, 1952, 9903, 11986, 20216, 12951, 2596, -9012, -10908, -2906, 9408, 9252, -984, 3147, 11855, 18549, 10757, 2311, 9585, 19119, 23990, 24431, 22744, 2269, -8213, 8019, 10804, 5187, 7824, 9197, 17284, 6962, 2779, 14225, 8166, 3497, 1758, -3827, -1087, 4611, -2764, -4734, -3834, -1656, 433, -6281, -1705, 8402, 13956, 24586]
10484B4586k147j5749K948N035j0934n561j0626R935Q608j0460J0366M569k3451
10471a2881l096J6673K0839k1007k0525J4527J1482n741j1848N867N481R213m80
10458H504p796l419O010N853j2756j3146O21n108J3389J0722P209j549M821k652
10444A0703k60k082n139l550M644p42K705k726l465M40M815Q077P407j877n465
10429A3485J242o121K808l133K106J4153N066m956l657k639P82j974L953K590
10415B3705p139K37r603j804p315K253J046p31M30j755K50Q240M433J345J6036
10400B9628o89j5728j9535j982J0655J0842O432j0537J127J6990j1903k2978o385
10387a4063J941j1800L352P722P903P050J78j6105j5674J7603J8925M971k059
$$ y = [24586, 22439, 6690, 9638, 14673, 3739, -1822, -12448, -2513, 6095, -4365, 6001, 10570, -12881, -15977, 696, 21535, 528, -19997, -5470, 6012, 271, -11577, -5710, -229, 8984, 8504, 708, -2711, 3299, 9152, -3604, -16750, -16129, -21237, -7848, 2874, 10083, 8534, 13355, 10703, 10443, 8361, 3222, -328, 4316, 3574, 6279, 3553, 88, 528, 5343, 13420, 20827, 18950, 13485, 14727, 8606, 11414, 8281, 10387, 24540, 29606, 24650, 20993, 18354, 19136, 17162, 21115, 23705, 16566, 16803, 7200, 5396, -1919, 334, 1380, 649, 1079, -676, -426, 7814, 12247, 13592, 29628, 28939, 13211, -6324, -8306, 2349, 13191, 19623, 9086, 10213, 27203, 15300, -7678, -14063, -12122, -23922, -20570, -12848, -4945, 2105, 2283, -13822, -29496, -11893, 7032, 12003, 9944]
10374I944o98J882L63l486K039M800K120o908j4181L418J3966J937p303j1079
10360c186J101o475P771Q568K591l143O591J957K739r49j4318J98R445K255L456
10345A8601n254R62j2257o720k91j0780j504P329j8L414O324o860J6231O874K956
10330A9007r099J447p35j470m314k483M610L901k2053j4269L310N048J7071J8261
10316A8232o737j6590K637J1193Q176j609n136q934k503o097Q883J2500o09j3780
10302c74j0002K532J2804J270m293R09J978k248J954l503l25J725J8564J9533
10288D0524j2553j7999M642N517M425J3402o670j194j431N665J1491J3060R536
10275F8415r88j440m663k4564j3814M457L110m496j2948r99J5117j604n336K1
$$ y = [9944, 9246, 11128, 11491, 8005, 10044, 14844, 16964, 10056, -4125, -707, 13259, 15196, 7893, -3186, -2085, -8560, -789, 7779, 10370, 7227, 13818, 15775, 18514, 17565, 3247, 3445, 12890, 15145, 18601, 13347, 14309, 2052, -4668, -4959, -15739, -17243, -9914, -9932, -6518, -194, -7054, 9177, 16051, 19007, 9908, 11355, 10620, 9150, 4836, 2353, 6963, 10864, -11189, -25458, -22148, -17100, -29, 18232, 11495, -5095, -2458, 8735, 16911, 15302, 10166, 1232, -1271, -7368, 1515, 14015, 13406, -374, -10376, -7844, 4960, 6230, 1937, 2846, 4824, 2576, 4530, 1027, 702, 2427, 20991, 40524, 27971, 9972, 14614, 20131, 24556, 37958, 31288, 30094, 28663, 34328, 45819, 58879, 68415, 67427, 65987, 61324, 36760, 22946, 27403, 30513, 26017, 13069, 12070, 27187, 25583, 20247, 20268]
10261B0268m095j916j2125j0036J2947K1273K1291Q29n837O330o937n373o782
10248B9837j0197M03J0574N762l766j1535Q995K205L836O89L887L791R265j901
10234E1845J9911L7321K5825K5359Q659j0676J515j2170k7563k8150k3944k3771
10222D4161j8227l943J196n649M543j2876j0244J84M541l415K317L175L823O616
10208A6202j1509j4350n977R943k053N013K282R678o954r228K022l014L873q730
10194a2802n411o66R134J5901O454j2811O883J3392Q011r846l313q542J104P779
10180A5267P807o409l8P498j964j8959p680l653K456N487M992J1476M659m318
10166A6621N947L767j0352k157M326r845K724J06r304K821o756N599R847R210
$$ y = [20268, 16173, 14257, 2132, -7904, 5043, 26316, 47607, 48436, 42599, 48929, 41992, 36619, 29837, 19640, 20043, 30617, 36379, 32613, 21078, 30073, 32278, 36114, 36803, 40690, 44481, 53746, 51845, 71756, 109077, 134902, 160261, 168920, 158244, 159759, 147589, 120026, 91876, 67932, 44161, 25934, 21991, 23187, 17538, 22081, 9205, -1039, -855, 3686, 271, 2588, 5763, 9586, 16202, 4693, -9657, -15634, -5691, -7744, -2731, -449, 9229, 2275, -6953, -4931, -7945, -4072, -12802, -18213, -18879, -9745, 6156, 12610, -201, 6682, 20074, 28085, 18239, 14926, 6384, 7488, 15267, 23074, 16665, 16627, 24125, 22161, 3202, -4478, -8131, -5675, -188, 4804, 16280, 20939, 16621, 22568, 26335, 15983, 13826, 18152, 8307, 11031, 11137, 1833, 4654, -2102, 3497, 13344, 22554]
10152B2554K987m703p177j7727m150k593J953J398O709J5549j869l868p188J793
10138C668O236q678n235Q322O554r30O355J082J3528j171j4663n224j3529o904
10124a0589J166m551j360r844P253J2485O619K28j2151J853r372j4072O195O875
10110a9265J2576Q569r906p49J3585L807q319N897N559k124M214M395p001j2572
10096a334k849r569k627J6047Q421J4779o495n747j4768K25J2165N133J0473j0829
10082A3025j2661j0120K507J2790L445o823o904k815J1308o767N936K591K396
10069G908J3057J3827j3589q866J0322p472o431O470M350m570r55l947p340P328
10055A0092R249m271K29l588r568P10Q858j0280j8949j302Q466J6117R074r425
$$ y = [22554, 25541, 20838, 13661, -4066, -8216, -10809, -8856, -7458, -749, 14800, 12931, 9063, 1875, 3668, 9904, 1226, -4009, 4313, 10867, 9937, 16292, 17374, 30902, 29731, 15068, 9844, -3685, -10589, -9423, -13974, -15334, -25178, -17925, -5440, 1179, 1407, -10744, -8891, -18263, -32335, -26140, -19265, -6689, 1880, -8026, -8775, 4810, 8617, 298, 6195, 11754, 9630, 13844, 18239, 11238, -1334, -4183, -13752, -16379, -332, 8089, 22868, 16373, 10626, -4142, -3917, 8248, 13381, 23854, 13025, 364, -9756, -7249, 5541, 8986, 2163, -4741, -7556, 3752, -3015, 2921, 5512, 7908, 20965, 34792, 21203, 12337, 22659, 15187, 8756, 15226, 19576, 15006, 14051, 10104, 2764, 10092, 19341, 15070, 15299, 11711, 2143, 2853, 11711, 1431, -17518, -18820, -10354, 5763, 14837, 5412]
10041E412Q58J1575Q160J0312L61j0843j5922m057n051M731j4486k1884O138J0958
10027a3738K0174R205q535k556l079k429p966m363Q542P316o49k340j4711j3036
10013b8165J5179J8599O097j1059j2679n785r96K6266j803n636J7476l329q154
10000F011J2828n291p215n579M931J0845K0594j007j9193o248P020Q967K811o256
9986B3218j3860r033J1813J3925L368j1277j363R024o882j3663j3193n141Q799
9973d265J1888k769P337R151j0488m318J1481P758j0701m970N998k295k565r912
9959A330J2564J0801J7201L373M461K800p605q472j7184r581j4033j0620R269
9946e696k855N025l352L552J8572R036k786m688j2833L74n949O096P779m573m423
$$ y = [5412, 6270, 17845, 26005, 36317, 36678, 25835, 9913, 5856, 805, 5536, -8950, -30834, -24696, -13738, 6436, 15641, 7106, 4550, 1471, -958, -8924, -13287, -4745, 2571, 1922, -418, -15129, -28165, -12986, 5613, 11710, 651, -12028, -17813, -18809, 7457, 5654, 18, 17494, 14165, 6011, 18839, 13548, 6333, 754, 5685, 16530, 37124, 36117, 16924, 10676, 17696, 26663, 29474, 23218, 9358, 325, 12138, 26063, 29431, 18154, 16791, 25815, 18933, 5270, -7923, -13064, -4265, 7623, 4854, 12191, 21342, 10854, 6536, 18017, 25775, 15074, 10104, 16102, 13807, 11242, 1330, 13894, 24695, 41896, 45269, 49730, 52530, 44925, 36453, 19269, 9688, -4345, -14965, -5696, -8551, -3526, -6878, -3326, 15246, 24282, 21496, 16808, 3975, 4349, -1600, 4496, 12275, 7702, 3279]
9931C279r09O505j885p72j093l158Q49J154j2050o62J988L806l889O885o073j7074
9915b3099Q70K472p195r491K924J2393J6886K2535P220M72l653j4191J6237k799
9901B1581l5l211Q586J0037K282OK084j3896j8266o531M385m239O747q81n684
9886B965q321q128m255N177K2407Q989K922P340R698J0449J5776K8729M0410M3331
9872A77489L2230k452l4814l3977k4873m1902m0605j745J4212k733r674j8128
9860A3028l859j611J368J3783M755q640j1978m614j1568q447k019L359J5426M690
9846C673j4605J0736j039j3411R972O73J1277n685n102M578J4301J1510j7029
9833I849J1525m686r137j4420m885Q042L884j0644M22J2698L270K667R47K182
$$ y = [3279, 2370, 8875, 6990, 6218, 5125, 1967, 2816, 3970, -8080, -8742, -6754, -2948, -6837, 48, -6025, -23099, -22229, -19757, -26952, -36443, -33519, -21126, -4240, 18295, 25515, 25987, 22334, 8143, 24380, 21581, 21546, 18335, 26921, 36958, 39240, 39246, 41330, 27434, 9168, 2637, 7022, 2783, 9530, 8649, 2965, -5356, -13484, -17739, -12562, 9845, 18834, 21756, 29096, 38794, 49243, 65019, 93748, 134158, 177489, 209719, 207267, 172453, 138476, 113603, 71701, 31096, 29351, 43563, 40830, 31156, 13028, 9169, 7558, 8926, 22709, 27464, 18824, 6846, 2232, -9336, -17783, -19802, -16443, -1017, 3673, -10932, -196, -1235, -14646, -4674, -4001, 7276, 1591, -3511, 1067, 15368, 26878, 9849, 21374, 16688, 7551, -6869, -11754, -3712, 172, -10472, -10050, 2648, 5918, 8585, 9532, 11714]
9819A1714j199L349n037P59N991j6568j3604O317R454K732o04o081M083K1484
9805B2790j111j5579j4322o708J0340J5370J4321R298j5617m199J6447k642k552
9792B5836K744L969m593n653K576j0404o675o720P913J0091N101j0747j7048K709
9778i01R110J472k333K74j027J035L653J565k5274N125M156m015J0412P582J771
9763A2605J005j964J882j161o070j8116j7231q453L216K0145K0569j1575k610
9750g758J894M755n522j469n604k184J1879J3925J869l513o27K281O980n091N700
9735A7515q923L208k498R152R12K363j2048n31r856N494J5111O564o175j3046
9721G242p250R57M945n745p0l476M799J1517r58L533k694r304r743k079N884k676
$$ y = [11714, 10515, 13864, 8827, 9586, 15577, -991, -14595, -8278, 1176, 3908, 3304, -2777, 1306, 22790, 21679, 6100, -8222, -14930, -4590, 10780, 25101, 34399, 18782, 14583, 31030, 28388, 25836, 28580, 32549, 27956, 22303, 24879, 14475, 7800, 1080, 8993, 19084, 24185, 13438, -3610, -901, 8209, 9681, 7348, 7622, 6595, 7630, 11283, 12848, -12426, -7301, -3145, -7160, 3252, 10834, 12605, 13610, 11646, 13528, 12367, 6297, -11819, -29050, -37503, -34287, -14142, 6427, -5148, -7758, -5864, -1109, -6631, -8100, -13704, -15888, -4009, 9916, 11785, 8272, 7645, 9926, 16906, 11815, 17515, 8592, 11800, 9302, 18454, 19366, 21729, 9681, 9150, -706, 4788, 19899, 26463, 20288, 7242, -8, 949, 5894, 149, 79, -3397, 1402, 12919, 11961, 15494, 12800, 3496, -6247, -8326, -2442, -5118]
9705e118O402j109n044j4449m229R900j2545J412J2183K272J0046j229K036P554
9691H082M425L814j805n530n947n364k963R818p61K289j814K0179J4819m070j858
9676C3314O397j4583K545Q463j5458j3103J1372K817k940L308O978M700j0749
9663B3061L18R707k298J534J090o505j1273k0476o688J4965J2109j5140k22O269
9649F451k7154N079R183O235o951P207P274K550j2717m034Q200O442M429j0300
9635A894L88M79R706r723j406N922P243J115J8091K097j0339n852r843J0727k16
9620B0283P034J652P541q041M018m564l662r717n489k128q951K166J258N851K571
9605I822k492j1917M394j372j5899q329J1516J0714m743J3138O978j327j0044
$$ y = [-5118, 1284, 175, -4869, -19318, -23547, -13647, -26192, -24780, -12597, -10325, -279, -1508, 528, 8082, 12507, 16321, 14516, 8986, 3039, -2325, -5288, 4530, 3769, 6058, 4244, 24423, 39242, 35172, 33314, 39711, 25128, 27673, 36136, 20678, 7575, 18947, 21764, 18824, 22132, 29110, 33810, 23061, 23379, 33086, 30788, 32322, 33412, 26907, 15634, -4842, -11530, 3435, 15544, 404, 182, 6451, -20703, -15624, -6441, -206, -7157, 50, 7324, 9874, -2843, -6877, 1323, 7765, 12194, 1894, 2282, 2761, 12467, 2744, 1338, 7260, 14503, 15618, 33709, 35806, 25467, 19615, 9772, 20499, 20283, 27317, 28969, 36510, 28469, 32487, 27923, 24261, 14544, 9055, 6927, -2024, 142, 1400, 7251, 9822, 7330, -4587, -193, -1565, -17464, -25793, -14277, -3563, -8306, 4832, 11810, 10483, 439]
9592D39m501M655O590J5705J8738o153Q79J445J3848P02k0300l717J1391M096
9578D3817K248Q74j1223j0832K141m409J766L186n308l842l66K405j068O478m727
9563B1140j760o855J8J2147N4q189L167o49K457p352m998Q561P091R84l595o197
9547A6024m857K725P39K748j3198m812P120M71J6403J0983l042k033N367o829
9533B7809k287J3146l222j3484j2581J640k027K454Q519J0872K998k595N426p947
9519B8721q487L591J2038o86j8264K908o350j4177J912K483O255k527j1750K811
9505a522J0990J1700P126o557m455o375p637L108o717P202j181j4331J629K806
9491d214J2479J0819k015R000J164o144o117O401Q591q209j0340p237l931J8333
$$ y = [439, -4062, 593, 7183, 22888, 41626, 35473, 36352, 37797, 51645, 52347, 32047, 28330, 39721, 43817, 46065, 46939, 35716, 24884, 27025, 22616, 24382, 27568, 22260, 18418, 18052, 20457, 19389, 25867, 21140, 19380, 12525, 12543, 24690, 24744, 16555, 19722, 19073, 21530, 14178, 9180, 17741, 24832, 25816, 22221, 16024, 11167, 13892, 14631, 17379, 4181, -631, 6489, 6960, 23363, 34346, 31304, 29271, 34638, 27809, 25522, 38668, 35446, 21962, 9381, 11021, 8994, 11448, 19967, 30839, 33837, 31242, 36668, 28721, 20234, 23825, 35863, 35177, 16913, 19821, 13471, -706, 1206, 3689, 9944, 7417, -4333, -1522, 9468, 21168, 28294, 21737, 17282, 10907, 3270, 6378, -339, 6863, 5682, -8649, -7020, -4214, 8265, 19084, 17069, 26069, 27233, 21089, 14972, 21373, 29964, 21755, 11415, 4178, 247, 18580]
9477A8580J3745l612L186r637n449j811P310L847Q48J0426l212q761j530m653
9463A9277j023O875j3354j109J0271J234n970L486O754p132q15j2110N673N687
9449A7744K323L757Q24o421n128k003K022M813r839K783L292K563m448m475L593
9434A1400J1694R004p864j1697j794j473j320J1661J142N875k250m764n54m065
9420A4995M902J9639R854k970r901j3026O403J164O932l186l123k744O89J581
9406C1209j339J73K255P107N78j4906N695J8501J3605R779m071j1153j2120j4481
9392C0832J12N519j4560M827Q200j0204p064M521j4943K336J2671J5133J0008
9379D7388Q056L155l299j0383l023p406o937m036O432J158l821N013O02p897r963
$$ y = [18580, 32325, 28713, 31899, 22262, 16813, 15002, 22312, 26159, 27007, 37433, 34221, 25460, 23930, 19277, 18254, 25129, 11775, 10666, 20937, 22171, 16201, 19687, 26441, 19309, 18494, 6384, 12057, 17744, 20067, 23824, 24648, 18227, 13099, 11096, 13118, 17931, 8092, 10875, 14167, 16730, 12282, 7807, 11400, 23094, 32098, 24234, 12537, 10743, 9270, 7950, 19611, 20753, 26628, 24378, 19614, 19060, 14995, 19897, 39536, 49390, 46420, 36519, 23493, 29896, 31060, 37992, 34806, 31683, 28939, 29628, 31209, 29870, 30043, 32298, 39405, 39983, 25077, 30772, 49273, 62878, 72657, 68586, 57433, 45313, 30832, 30944, 36463, 21903, 26730, 34930, 24726, 17662, 22183, 7240, 9576, 22247, 37380, 47388, 55444, 58599, 55300, 44917, 41894, 34488, 27551, 23515, 29947, 31105, 27284, 32297, 32899, 25002, 15039]
9364A5039R498o99M770m359J2523J1795O09L998O059j1087j9994J978O194l156
9350C3168l258M456j0158n414J2691r96j229Q65o371K507m24Q377j735N872q042
9335C0309J12P580N926J0377p541j8158j1326Q064m071J1L976M116P237J2213
9321D8825N689J814m50k058l871j5011M076J3575O784j0931K117j2225J877j332
9307C8879J245O530n278M752J419l693K1L189M846m106K2175J741n600m448R295
9292G0967R555j7761j7146L965q372o173j639R854K156q39J103l148J225J4299
9278E8046k178k744m847q296k495O322P514r753j40N763P99j0375q093R774o612
9263C2685N452J564o244P101l522J554o77l581M528L348K534r740j2262q70O275
$$ y = [15039, 24537, 23838, 28608, 24249, 36772, 48567, 49176, 53174, 59233, 48146, 28152, 30130, 36324, 33168, 29910, 34366, 24208, 18794, 31485, 30489, 29260, 30125, 23754, 26261, 25837, 34214, 32479, 38351, 30309, 30421, 38001, 43927, 54304, 46763, 28605, 17279, 25343, 21272, 21283, 25259, 29375, 36612, 48825, 54514, 56328, 55878, 53820, 49949, 34938, 39014, 52589, 59373, 48442, 50559, 38334, 40211, 38879, 40124, 46654, 41376, 46128, 47547, 43854, 43875, 47064, 51910, 47804, 69979, 71720, 66120, 61672, 70967, 80522, 62761, 45615, 49580, 41208, 35035, 33396, 43250, 45406, 44567, 45670, 42522, 43747, 58046, 55868, 53124, 48277, 39981, 37486, 43808, 51322, 41569, 41429, 47192, 47991, 37616, 29523, 39297, 32685, 38137, 39701, 33457, 40558, 37036, 38590, 37913, 34332, 38860, 42208, 44742, 35002, 22740, 21870, 28145]
9248B8145J9537j828k197p010o622P080J6709j4886n089K2528L471j2538J285
9235D8585J4521p60Q670j5481j1637n352p589k556P566Q302O729J845O594n102
9221E4335r853K74J4174Q915k329k0002k052j452R145K565q157m081N89O588M602
9206E3261j982J520K238k463j9025j097R916o837P360J7355J3869N114j4513j6639
9192D8077O720R201M708P242K197j320K159l598M12l865l223p835N06j961M705
9177F4125J0103J0491l000r721M508K877N562L054n315m307j729L736k647m830
9163G2907M092J3813L527m539j741m334L69o624j0153O853N493o501O656J5439
9149I5257N435m630Q170p077K250o652r021j3037k453l758J699J7139M430m837
$$ y = [28145, 47682, 45854, 43657, 36647, 30025, 37105, 53814, 38928, 33839, 56367, 59838, 47300, 48585, 63106, 62346, 71016, 55535, 43898, 38546, 30957, 28401, 35967, 44269, 50998, 52843, 59437, 54335, 44482, 44756, 58930, 67845, 65516, 45514, 43462, 42010, 51155, 53720, 45563, 41482, 42071, 48659, 53261, 51279, 52799, 55037, 52574, 33549, 32452, 42368, 35531, 42891, 60246, 74115, 79229, 64716, 48077, 54797, 63998, 68706, 75948, 78145, 76825, 78984, 75386, 75798, 71933, 68710, 60875, 61381, 59420, 64125, 74228, 84719, 81719, 71998, 76506, 79383, 84945, 87999, 82684, 78377, 76648, 80384, 77737, 72907, 76999, 90812, 94339, 89800, 88059, 83725, 84094, 77470, 67317, 74170, 79663, 73162, 79818, 95257, 100692, 96062, 104232, 97155, 99405, 92753, 83732, 70695, 68242, 64484, 66183, 83322, 87752, 82915]
9135H2915n851Q925O607P005J0927N707R85j4015o551J727q000q723j810L419
9121H3267J6581R003n1M029p484j669J1302K053j6660k455L19J298q787J2742
9107A03488Q689q23p414M708K0286m433K253K20J2617k41K359K2460Q667j76q37
9092A71823J1996R869J2722N692P623J0540P522O156J2828L2347L3047K4400L6335
9079C82900M1927N5423O3997O2302N5881O2352R0185J00436J34138J72212K09016
9068A430769K42707L05679M00516M43555M96025M66248L12281R8868j37282l29690
9058C729676m50519m81879m36215l80723l13929k57358k04736j88677j49146j01764
9048G64730r6921p9683o5050n0478l7492m0235j9456k4033k7665k6641k3664j0170
$$ y = [82915, 77064, 85989, 92596, 99601, 110528, 116235, 117220, 103205, 96654, 98381, 90381, 81658, 79848, 83267, 99848, 108851, 108800, 112829, 105345, 103676, 114978, 117031, 100371, 97916, 98235, 99533, 90746, 103488, 112177, 111354, 103940, 108648, 128934, 124501, 126754, 126974, 139591, 139350, 141709, 164169, 172836, 172660, 171823, 183819, 193688, 206410, 212102, 219725, 230265, 237787, 243943, 256771, 289118, 322165, 346565, 382900, 424827, 480250, 544247, 606549, 662430, 724782, 814967, 915403, 1049541, 1221753, 1430769, 1673476, 1979155, 2379671, 2823226, 3319251, 3785499, 4097780, 4196648, 4059366, 3729676, 3279157, 2797278, 2361063, 1980340, 1666411, 1409053, 1204317, 1015640, 866494, 764730, 667809, 588126, 523076, 472598, 435106, 394871, 375415, 351382, 323717, 297076, 273412, 263242]
9036B63242j0856j8920k9272j7522j9130k678N263L1m235q882j8795k085j0286
9023A25875n618K876q148j2245Q003K710l170j9984q644k137o240m052M873J1504
9009H5603o697j3221l659K767l13n219q484M185L564M611J1474l242p239q863
8995E5267R489K574R111j2120j0969Q629k390j1584j0244l379j915Q684N933j1886
8981C5200M850L911p777O08p002k1996J4998K0221p535K328L708q393k869O440
8967C6692J2398J1345K910m913r712r420L571j981P67m610o39k242M103L642J255
8952D3166M779m037j2004n224k5332p779J4870Q203r792l14K6299Q691l569j1922
8938B6035o894n845k843j5026j6463O631J5736J2272M997l42K745J467L304J8470
$$ y = [263242, 252386, 233466, 204194, 186672, 167542, 164864, 170127, 170158, 165923, 157041, 138246, 136161, 125875, 120257, 123133, 114985, 102740, 110743, 113453, 110283, 90299, 81655, 79518, 73278, 69226, 74099, 85603, 78906, 65685, 62026, 64793, 64480, 59261, 50777, 54962, 58526, 63137, 74611, 71369, 64130, 55267, 64756, 67330, 76441, 64321, 53352, 61981, 59591, 48007, 37763, 34384, 32469, 41153, 47086, 35200, 40050, 43961, 36184, 36792, 29790, 7794, 22792, 43013, 35478, 37806, 41514, 33121, 30252, 36692, 49090, 60435, 63345, 58432, 48720, 39300, 42871, 40890, 41657, 37047, 36408, 34166, 38269, 41911, 43166, 47945, 43908, 31904, 26680, 1348, -6431, 8439, 16642, 6850, 6536, 32835, 41526, 37957, 26035, 19141, 13296, 10453, -4573, -21036, -14405, 1331, 13603, 18600, 18258, 21003, 22470, 25774, 44244]
8924D4244P635j104J779k0611j3670j459J6672Q990j4847q096q507Q558J2075
8911C1659O477J0448N598q999l462K3358K78N737O972j3885J3419J0043P332P118
8897A02093L8766O5654P5313J3789k8007l6877n5044m8527l3826j5831j0076p370
8885F0057N459q187p759P404J5799r916j7121j8045l862P484P725R803j942q098
8871C8801J0436N262P933j0814k9421k713M863J3107m690J588j2209P471M743
8858C4357n091k700J8002J0583p815L358R6L871J4420J6879Q871J952J2368K2390
8844A31541M6772O9510J07037J01708O8759J2783l5346q3147q6883q8371o6345
8833A78018m5756k5223o041j970j9230k2352j7686j6627J0488J9750J0984j837
$$ y = [44244, 51879, 50775, 52554, 31943, 18273, 16814, 33486, 42476, 27629, 19533, 11026, 19584, 31659, 38136, 48584, 54182, 45183, 41721, 65079, 65357, 71094, 78066, 64181, 77600, 87643, 94975, 102093, 140859, 206513, 281826, 295615, 267608, 230731, 175687, 127160, 93334, 77503, 67427, 60057, 65516, 57329, 49570, 56974, 72773, 62857, 45736, 27691, 23829, 31313, 39038, 48841, 46899, 38801, 49237, 54499, 62432, 51618, 22197, 19484, 24347, 37454, 32764, 34352, 22143, 29614, 34357, 29266, 26566, 44568, 55151, 47336, 50694, 50790, 54661, 69081, 85960, 94831, 96783, 109151, 131541, 178313, 247823, 354860, 456568, 525327, 538110, 502764, 419617, 332734, 244363, 178018, 132262, 107039, 100998, 99028, 79798, 57446, 39760, 23133, 33621, 53371, 64355, 62518]
8821F2518o84n660k0489k974p613k612j173P927J3537K172J9273J6239J5662J6916
8807A13039L897p476q147J5084M3936L4625L0726N5627Q9504J43901J89770J91343
8795H95829J47942K622j11115j80025j95452j61909j24684q5035n7052j4135j2285
8784A04701k0070m56M378j920o723j1485L174q861l926P048N646j2509J219J9130
8770G9346n91m647O167K547L753r37J1350L908J3748P942m3j455l579P667J4814
8755A39990L6442M9567P2821R4895Q6392N9673p530o5689r5354p4286o2613o3932
8743A70376m3836j5456k2788p664J31M373l887M585n035o006L214n402J121q31
8729G2895K350r868j217Q727m454P744J8628R453K812J4582j1919j9891l795L989
$$ y = [62518, 61834, 56174, 35685, 32711, 25098, 22486, 21313, 29240, 42777, 44949, 64222, 80461, 96123, 113039, 116936, 109460, 101313, 116397, 160333, 194958, 225684, 281311, 370815, 514716, 704486, 895829, 1043771, 1046393, 935278, 755253, 559801, 397892, 273208, 188173, 131121, 116986, 104701, 84631, 84175, 88553, 86633, 79910, 68425, 71599, 62738, 58812, 65860, 71506, 58997, 60216, 79346, 78755, 74108, 80275, 82822, 86575, 85638, 96988, 100896, 114644, 122586, 122543, 121088, 117509, 125176, 139990, 176432, 225999, 298820, 393715, 480107, 539780, 532250, 466561, 371207, 296921, 234308, 170376, 126540, 111084, 88296, 80632, 80763, 85136, 81249, 85834, 80799, 74793, 78007, 72605, 73726, 72895, 75245, 65377, 64160, 72887, 68433, 76177, 94805, 104258, 107070, 121652, 109733, 89842, 86047, 90036]
8715I0036o73m357n370j0222j148J2188K787P664J432n183j9820j986J1404J7430
8701I4182M235p099K41j2211L926M521L69P294M984k316J4512R250k822l357j1
8686A15698R052R590P288L735L25P594j057P956L566n126j897R950P344n955P910
8671A75973L0429J2905o151j0026q041o585J5739J2534J3124J3709O829J1588
8659B62027J5360J4168R552K5664K1081R931J9750J7158J7785J5865O984J1028
8647D46353Q585m583l391L976m730k8503j1776j3953j9892j4584q214m058N622
8634C50852N903J1897J5263J3399Q584J3370K0801J1132q164k2457l8924m5849
8622C35807m8610k5858k1027l1268k7617k1516k4614j0807p048j0064L922P104
$$ y = [90036, 89363, 85006, 79636, 69414, 68266, 80454, 83241, 90905, 92337, 87154, 67334, 65348, 76752, 94182, 98417, 91318, 91559, 79348, 83274, 87795, 88164, 95458, 100442, 98126, 112638, 121888, 119066, 115709, 115698, 124750, 134340, 141628, 145363, 145688, 153282, 152225, 160181, 163747, 158621, 156724, 166674, 174018, 168063, 175973, 206402, 219307, 213156, 203130, 195089, 188504, 204243, 216777, 229901, 243610, 250439, 262027, 277387, 291555, 301107, 326771, 347852, 357783, 377533, 394691, 412476, 428341, 435325, 446353, 454938, 450355, 446964, 450940, 446210, 417707, 405931, 391978, 372086, 357502, 349288, 345230, 350852, 356755, 368652, 383915, 397314, 405898, 419268, 440069, 451201, 443037, 420580, 381656, 335807, 287197, 261339, 240312, 209044, 181427, 159911, 135297, 124490, 117442, 107378, 111300, 118404]
8610A18404j05K426j278j5572j1445l369j113N56R700k399j2633j6105M681J3932
8596H5680o561j2021j4838j2904P853N116M771P953N870n872M1p704j0795L935
8582E0524J4010J0600l030L266J438l614L598k806p463l5o981j0180L890j856
8568E1361J187j6507r409j766m623l677o790J1182K961l654J468J1396n325j0535
8554A7269M0M846m285Q804k571Q130J3292J0188j5291l731J450L068o069k917
8540C2223p860j5665j3451J763R715M388L671o571Q417Q457O778L798l061l666
8526B8936j4557j74P304n298N26J950J524j5956k611M205m738P543r009k309J3046
8511A0382K3325n248O940N406l463n520J358r780j5554Q492R491j1548j4038K45
$$ y = [118404, 118299, 120725, 119447, 103875, 92430, 89061, 87948, 88504, 98204, 95805, 83172, 67067, 71748, 85680, 79119, 67098, 52260, 39356, 47209, 52325, 57096, 65049, 70919, 65047, 65088, 57384, 46589, 50524, 64534, 75134, 72104, 75370, 76808, 73194, 76792, 73986, 66523, 66488, 59507, 49327, 53217, 51361, 52548, 36041, 26632, 24866, 20243, 16566, 9776, 20958, 23919, 20265, 21733, 33129, 27804, 17269, 17309, 22155, 17870, 26674, 24103, 32233, 45525, 55713, 40422, 36691, 38141, 41209, 35140, 32223, 24363, 8698, -4753, -2990, 6725, 11113, 14784, 8213, 16630, 25087, 31865, 35663, 32602, 28936, 14379, 14205, 21509, 16211, 16737, 18687, 20211, 4255, 1644, 5849, 1111, 8654, -355, -2664, 10382, 33707, 28459, 35399, 40805, 37342, 31822, 33180, 23400, 7846, 16338, 25829, 14281, 243, 488]
8497D88P134J5982J2859p959j8624J2077K2404L387j2608j1907j481l869P836
8484B5719M37Q252P216j6033o908Q621J6680p307m999j3447j133k044K548J1093
8470B8695P859M243m684r542O92k488P893M174j0291o462N79J4192J2320Q88r653
8455C8415R803L772l994R329M05N480J254j5383j0209j1348Q021J7054K710j5086
8441D0223N585n460r555O255O78j3367j9305j422q729R936J0513m16J3833N642
8427C4411o914l902Q92n173j3388k882J4375J6585P3k926J539Q848R702L342q097
8412D6485n793j2538L423J46N435n393j1114P45m802j0780K41R122J0693L821
8398B9691K955p521j8352j1496P085N317Q038p224k025J1078o96N037N004P99
$$ y = [488, 7622, 23604, 36463, 28504, 9880, 21957, 44361, 47748, 35140, 23233, 21752, 17883, 25719, 26156, 34408, 41624, 25591, 18683, 27304, 43984, 36677, 31678, 18231, 17098, 15054, 17602, 28695, 36554, 40797, 36113, 26571, 27263, 24775, 32668, 36842, 26551, 20089, 20668, 34860, 47180, 48068, 38415, 48218, 51990, 47996, 57325, 57730, 63210, 64464, 49081, 38872, 27524, 35545, 52599, 55309, 40223, 45808, 40348, 30793, 37048, 37726, 24359, 5054, 3632, -5097, 4839, 15352, 14936, 28769, 34411, 27497, 23595, 24487, 19314, 5926, 3044, 17419, 34004, 34077, 31151, 32690, 41538, 51240, 54582, 46485, 40692, 28154, 31577, 31723, 37158, 31765, 20651, 21396, 16594, 5814, 6055, 15177, 25870, 29691, 32646, 25125, 6773, -4723, 2362, 7679, 15717, 8493, 6468, 17546, 16850, 21887, 26891, 27690]
8384B7690j661L044K064n821j65j858R301P211j4265j9282L247O874r07j394o18
8369A3460k223N507J884q752j3035P035P355k921n937K887O123o238r813J014
8355c654q658R550J2072l809l343J4351M498j3187j3632J1626J9277J3147j314
8342C6924j0810q669L855J081L416p759J299L988R713M927r336j2113M510P449
8328B8475P705O987l711r499q405J1457R595o488l228K575P167o919k564p761
8314B5386o291J8474j0788j5462O224J0106q411j0040J428J0268R919o079j3672
8301A1062J56J1607J4304K821j0633J1915J3225p706j6086J286j0739M003P361
8288C2576L925j5608L106J7254m760p803M090K549m979J489Q934r472n236K59
$$ y = [27690, 26029, 29073, 31137, 25316, 25151, 23293, 32594, 39805, 25540, 6258, 9505, 16379, 15472, 14078, 13460, 11237, 16744, 18628, 9876, -3159, 3876, 11231, 8310, 2373, 5260, 11383, 5145, -4668, -3654, -12312, -2762, 9310, 5501, 2158, 16509, 21007, 7820, -5812, 5814, 25091, 38238, 36924, 26114, 17445, 21300, 22381, 25797, 18038, 19337, 23325, 33038, 37965, 28629, 16516, 21026, 28475, 36180, 43167, 39456, 29957, 21552, 33009, 42604, 36116, 32888, 35463, 42630, 35711, 33147, 25386, 19095, 37569, 26781, 11319, 17543, 27649, 19238, 9198, 10626, 20894, 30813, 24734, 11062, 11218, 22825, 37129, 39950, 29317, 41232, 54457, 46751, 30665, 31951, 21212, 25215, 32576, 36501, 20893, 23999, 41253, 36493, 28690, 32780, 35329, 30350, 31839, 40773, 31301, 26065, 26324]
8274B6324N661q2o321J136j377k77m764M673m691J279l391j2456N379K432j520
8259A2005P982J0182j1749J827j3131m459L028N276q100r346l294J1499m024Q44
8245a460J3090J504p26j733j927lo52q316N044J3642k013o858R822O184j3072
8230A2526j1165j0201J1688O483j767j482O679N30O678L89o667j0231r76l811
8216a327n134n99p906R890K6007M443j3739r842J336J460r448K613L278J370N344
8201G746Q687J2974r455K683J3094J121N751J456J7318K0015M0094M3245L9393
8188B04122J1229m3782n2413l8278k8478m552j1531j2381K007j9510J432J922
8176I787k425N654N941J1936R590O794r271l0798j6314J738m97R670JK945l357
$$ y = [26324, 31985, 31903, 25582, 26718, 25341, 25064, 20300, 24973, 20282, 21561, 18170, 5714, 11093, 13525, 12005, 19987, 30169, 18420, 20247, 7116, 2657, 5685, 10961, 2861, -6485, -9779, 1720, -2304, -1460, 11630, 13134, 12408, 10675, 8748, 8745, 8093, -223, 4821, 18463, 16450, 9592, 19414, 25598, 12526, 1361, -8840, 2848, 9331, 7564, 6082, 12761, 13291, 19969, 20358, 13691, 3460, 2484, -1327, -6461, -7060, -14966, -5076, 20931, 25374, 11635, 1793, 3129, 4589, -4859, -2246, 1032, 2402, 7746, 16433, 29407, 19952, 22635, 35729, 36850, 42601, 44057, 61375, 81390, 121484, 164729, 204122, 215351, 171569, 119156, 80878, 52400, 47848, 36317, 23936, 25943, 6433, 7865, 9787, 7362, 13016, 18957, 30893, 40483, 47277, 38006, 7208, -9106, -7368, -7865, 1805, 1806, 4751, 1394]
8161A394m068q737K211P824q715J1269K0825P832K0083N152J8987L8632M2876
8148A55565K6082L815j6477l4383l5792k5794k9328k1188j515N833K876J0019
8136C9713m184k1484R75m611j595k091P058o891L886L621n680j6945L811J6156
8122A1739o53j0227J9226L835K419k908n08O012l30j2526j937M050J0706N073
8108C3971P877j7971n928J0896J0950O621P10j0531o114K009K507p217J4815J8573
8094F1168J6221n786l467m837r614n415O971J2377J2842J4221J0176J2614K8646
8081A46117J5127l765l74K944K735L64J1870j234j227K214R905J4388O450j6729
8067A88785j9721j4218j0994N18k047k133j0248o521j850R166J2627q834q596
$$ y = [1394, -2674, -11411, -9200, -1376, -10091, 1178, 22003, 29835, 49918, 55070, 74057, 112689, 155565, 181647, 185462, 168985, 134602, 98810, 73016, 43688, 22500, 20985, 26818, 29694, 39713, 35529, 14045, 15020, 10409, 8814, 6723, 13781, 6890, 10776, 14397, 8717, -8228, -4417, 11739, 11086, 859, 20085, 23920, 26339, 23431, 22923, 28935, 28605, 16079, 14142, 18192, 28898, 33971, 41848, 23877, 17949, 28845, 39795, 46416, 47126, 36595, 30481, 32490, 34997, 27780, 42595, 61168, 77389, 71603, 68136, 63299, 53685, 48270, 55241, 67618, 80460, 94681, 104857, 117471, 146117, 161244, 157479, 157105, 160049, 162784, 163148, 175018, 173784, 172557, 174771, 184676, 199064, 205514, 188785, 169064, 154846, 143852, 144370, 142323, 140190, 129942, 123421, 121571, 130737, 143364, 134530, 125934]
8054A25934m081K836p709R175J3072K850K0086J3546O582R148L0562O2751M8340
8041C33092P2669Q6907Q8705M0325k9939o7990q4192p2136n1919l4054m285K6723
8029C03906L9749N7914M1035L6915j7709p3756p7604o1193l2509k7990m8735q523
8017A31500j32j8526k2271j356J1743Q736O779K0401O314l194J809L35l30j486
8003A40322q438J747J6501N479K8590M6035M1403N5916M6740K6153P5j8903k3723
7990C57897j7956j5585j3170l100M3093N2826L213k8755m1816n7852l9949l5702
7978B03144l8758k8940j5722j1143j5303l4162o873J414M223N407Q447j285l205
7965F7244K981L865q059m027j658P267r461j6535L202J5314J3974J2119L772J8174
$$ y = [125934, 121853, 124689, 116980, 126155, 139227, 142077, 162163, 175709, 182291, 191439, 222001, 284752, 333092, 405761, 492668, 581373, 621698, 591759, 523769, 439577, 367441, 315522, 281468, 277183, 303906, 343655, 401569, 442604, 479519, 461810, 388054, 310450, 249257, 216748, 188758, 140023, 131500, 131368, 112842, 90571, 89215, 100958, 109694, 116473, 136874, 143188, 139994, 141803, 142138, 141808, 140322, 131884, 133631, 150132, 155611, 184201, 230236, 271639, 327555, 374295, 400448, 400523, 381620, 357897, 339941, 324356, 311186, 308086, 351179, 404005, 407218, 378463, 336647, 278795, 238846, 203144, 164386, 135446, 119724, 108581, 93278, 59116, 52243, 53657, 57880, 63287, 71734, 70449, 67244, 70225, 74090, 66031, 62004, 60346, 67613, 58152, 41617, 44819, 60133, 74107, 86226, 89998, 108172]
7951A08172J4581k7903j6798M89p067j7155Q845J091O243O825p889k658m311r894
7937E2571j4827o901M228K122k536j2374j3360N623q69N245J0053j9018j2491
7924b534Q575J7499M10M780R633k360j2954n086m990m274J339p198m08p629P882
7909B685K020q136K826o144K37n410L046J328Q506L36k193n189j2208o86k292
7894b1274n37O913J1833O296J1725j0379p965j0937q565L981J2279K1r885j2984
7880b9478J4485J4217M380K414q923r23K387M415j0085l495J5602O209j5424k0262
7866b4481m947Q727J4824N310M562k436l958k869N13K072q551j1559K595J2712
7852g486J454J1942J1382o34M291q735N717N195M48K264l322r795j4420R994J0622
$$ y = [108172, 122753, 94850, 78052, 78541, 71474, 54319, 63164, 64255, 70498, 77323, 69434, 66776, 62465, 52571, 37744, 30843, 35071, 37193, 34657, 22283, 8923, 14546, 13677, 18922, 28975, 9957, -2534, 6041, 23540, 23950, 28730, 38363, 36003, 23049, 17963, 12973, 8699, 10038, 2840, 2432, -5197, 2685, 4705, -3431, -605, -6749, -6512, -11922, -8876, -7548, 958, 1294, -899, -6088, -18296, -18982, -21274, -21811, -14898, -3065, 3231, 14956, 4577, -3388, -14325, -22890, -18909, -6630, -6609, -16494, -29478, -14993, -776, 3604, 6018, -2905, -3828, -1441, 2974, -7111, -10606, 4996, 11205, -4219, -24481, -29428, -20701, -5877, -567, 3995, 1559, -2399, -5268, -4755, -2683, -11234, -22793, -20198, -7486, -6032, 5910, 17292, 16658, 20949, 12214, 17931, 23126, 23574, 25838, 22516, 12721, -1699, 8295, 18917]
7837A8917k75m698p91M80m323J461m964j853q358N09l168j1046p650j209J2018
7822a4950J7725o490j0160Q898p373P0J693j123K448l022q262K338K539l077l617
7807b2363J0793J6222L29r347r476q165J0931l38J543p143P560J3573J0039K25
7793A4383J595K167O26k445q255k645Q608n699q365j1387J1807Q080l239m973
7779B58n763p2k253O436j2307o266P505J0366m040O58n27K547k919J009L469P34
7763a165n481R435Q105j0j3225j071k165j1514Q403L951Q911Q593N501o103j9479
7748g314l641K801k41J4823k08K025J1752O697o962q252j0262j2995K040R2q551
7733a8196o840P693R380P296N561P21j686j7709k303n05M654K144L233p37j049
$$ y = [18917, 18642, 13944, 13153, 13633, 9310, 10771, 5807, 3954, -4404, -3895, -7063, -18109, -25759, -26968, -14950, 2775, -3715, -13875, -4977, -12350, -12280, -10587, -11710, -9262, -12284, -20546, -18208, -15669, -18746, -22363, -11570, 4652, 4981, -4366, -13842, -22007, -11076, -11414, -9871, -17014, -9454, 4119, 14158, 14383, 15978, 18145, 18771, 16326, 8071, 5426, 14034, 8335, -30, -11417, 390, 8470, 5231, 258, -5505, -5577, -7830, -1394, -13701, -19967, -12462, -2096, -6136, -5478, -6005, -3458, -6377, -5368, -1899, -1165, -6646, 2789, 10894, 10884, -2341, -3412, -5577, -17091, -8688, -4737, 4174, 12767, 18268, 12165, -7314, -10955, -8154, -8395, 6428, 6220, 8245, 19997, 26694, 19732, 11480, 1218, -11777, -9737, -9645, -18196, -25036, -17343, -7963, -667, 4894, 5615, 3929, -13780, -16083, -16588, -11934, -9790, -6557, -7294, -8343]
7718h343J9008k525o166q978J085P91r64r038p887J642K565J0952P985J0892j2407
7703a388l368O438M458r4O714j4999j0198N42Q035R791j022J1017P146j2004k1296
7688a0228j3109J2176J2284l748K260q272K6m248k098K222R944m054K050L541
7674a254M648q981J1714O604k489n601K192L308r969j7104m399J5073J0869N570
7660A0181p178r828j0750n340Q950J4142L015q166O846r992L120m996k979R608
7646c367k29l81p643J1299LJ667l098K200R538j6554k026J0814R710m713k3673
7631a6453j170J5099k596j1439J1640J2075j552j3121q709K746n850Q744J1308
7618G22J3067k762j6728j2924J727Q573r972r278Q396J1838J771o16m042j039
$$ y = [-8343, 10665, 8140, 1974, -7004, -5919, -5128, -6092, -15130, -23017, -21375, -18810, -7858, 127, 11019, -1388, -4756, 1682, 6140, 6046, 12760, -2239, -12437, -11895, -3860, 5931, 4909, 15926, 23072, 11068, -10228, -23337, -11161, 1123, -2625, -365, -8637, -8611, -12859, -14957, -12735, -2791, -6845, -4795, -1254, 3394, -5587, 6127, 12731, 10242, 4641, 6833, 10141, 172, -16932, -21331, -6258, 4611, 10181, 3003, -6825, -17575, -22915, -13965, 177, 3192, -4974, 1872, -8120, -5000, -9996, -12975, -3367, -3596, -3977, -11620, -321, -318, 1349, -1749, 451, 9989, -6565, -8591, 2223, 11933, 7220, -16453, -17623, -2524, -5120, -16559, -4919, 7156, 5604, -7517, -16226, -13480, -19330, -10586, 722, 13789, 11027, -5701, -18625, -16898, -8325, -18297, -27575, -19179, -7341, -5570, -6186, -10228, -11267]
7604a1267M189K096n338l865l303O134J3946n83L11l889P922P557n86l113r583
7589F28M538J362N052l104j0724M87J0348r22j257m074l871j4203m133P3J2297
7574g503J5459L815n433n238j5345n290K3072M808K804n018l693K944j0723m629
7560i970J738N52j725p525N155q497m492M982R347m816n202j529L258J1689Q161
7545A126O219o459k901m01L042j0605J634J2348j1108r659Q671N213L904O211
7531G235N280m071p590k709Q032l821N35q909j1420L376P318j2164O556L242l792
7516a2902P969O606r493m981J2911N741n788M171J2068p883R27q164q204k841
7502i863n148J330J1607O249l044J0930o715q56Q76R109o587j2210J343j890K138
$$ y = [-11267, -7078, -4982, -10320, -14185, -17488, -11354, 2592, 2009, 2320, -1569, 6353, 13910, 13324, 10211, 628, 5166, 6528, 11580, 8476, -2248, -1761, 8587, 7665, 6408, 2334, -1537, -15740, -19873, -19800, -7503, 7956, 11771, 6338, 1100, -14245, -19535, 3537, 8345, 11149, 6131, 2438, 5382, -5341, -9970, -8232, -7680, -9405, -16930, -11775, -20272, -24764, -19782, -10435, -15251, -20453, -21982, -18724, -7035, 1126, 7345, 886, -2015, -2416, 626, -9979, -8345, 4003, -7105, -16764, -8093, -2880, 1024, 7235, 12515, 8444, 854, -1855, 6177, 2356, 2891, -6018, -17438, -14062, -6744, -18908, -12352, -9110, -12902, -4933, 1673, -7820, -12801, 110, 5851, 63, 4234, 16302, 8419, 9346, 1182, -7022, -9863, -15011, -13681, -2074, 4175, 1131, 12061, 5346, 4490, 5366, 14475, 7888, -4322, -2979, -4869, -2731]
7487b731j2753j214m203n42k56O778R75N893J6933N082j1205j1951J0115r424
7473h503L091P175j0798N544j2217j573k348L220P59O712Q268o833r330j308N647
7458a2494o550n376q535J2377J8808R873j45l575m263P124O309j0253p960l120
7444g780j89n433k954L23J2932l193k015m067l13J4231Q726q128K631J2164J1895
7429B8830r826m832m795O979j890r293O238k532j674l552m882m026q009N717O582
7414i65M169O980N541k545Q286L93j5816n011r35r721l579R60l237L550l912j358
7398a7200J2721j2913r923r3J8502K651J8393n32r787p523l914M047k598o407
7384a4576j8121Q91K5541o32m489r601j274P640P754M971n394m505J2933j809
$$ y = [-2731, -15484, -16698, -20901, -21443, -21699, -14921, -13946, -8053, 8880, 13962, 2757, -9194, 921, -8503, -5412, 1763, -9035, -3491, -15708, -17281, -19629, -16409, -15650, -8938, -670, -7503, -16833, -18141, -12494, -19044, -24420, -32955, -20578, -1770, 8103, 7958, 4383, 120, 7244, 13553, 3300, -4660, -7780, -7969, -13402, -16356, -16033, -3101, -6294, -8309, -12376, -12689, 1542, 10268, 2140, 4771, 16935, 28830, 19004, 14172, 9377, 16356, 14466, 5173, 11411, 8879, 7205, 3653, -1229, -5255, -13264, -7547, -965, 3204, 10184, 15725, 13180, 21466, 21859, 6043, 1032, 97, -9624, -13203, -12243, -15480, -11930, -15842, -17200, -4479, -17392, -27315, -27408, -8906, -6255, 12138, 11606, 1819, -5704, -9618, -5571, -8169, -14576, -32697, -31806, -6265, -6897, -11386, -20987, -22261, -14621, -6867, -1896, -7290, -11795, 1138, -671]
7370f71j285J141j689j0254J9551M279l63k144j3409p978J539M367m235Q597M498
7355A944k092P403M992j1662q499j1805L429r50L864J2521M251J281L926r670
7341a067J1670K241n537q349m788m459j840j124Q028J2766Q439r02J2817l032
7327B4863j3252M63j0968k781O189j312j0159n039j0521p019j4866m650J8452
7314c0600J7569J169j3360K138J0148m839k710j852R16r30Q935K706K855k329
$$ y = [-671, -1956, -815, -2504, -12758, 6793, 11072, 10709, 8565, -4844, -12822, -11283, -6916, -11151, -2554, 1944, -148, 7255, 12247, 585, -7914, -19719, -16290, -17240, -13376, -855, 3396, 4677, 8603, -1067, 10603, 12844, 7307, -1042, -5830, -10289, -12129, -13253, -5225, 7541, 15980, 15078, 27895, 24863, 11611, 12074, 1106, -1675, 4514, 3202, -6957, -11996, -22517, -29536, -44402, -49052, -30600, -13031, -11862, -25222, -23084, -12936, -17775, -20485, -22337, -21421, -22351, -13416, -10710, -7855, -10184]
$$ [...]
##END NTUPLES=NMR SPECTRUM
##END=
