##TITLE=Analysis number 330454
Compound Code cc 68414
Book Reference 437/109
Project Code adrs
Chemist Name wendyb
##JCAMPDX= 6.0         $$ Bruker NMR JCAMP-DX V2.0
##DATA TYPE= NMR SPECTRUM
##DATA CLASS= NTUPLES
##ORIGIN= Bruker BioSpin GmbH
##OWNER= nmr
$$ XWIN-NMR		Version 3.5
$$ Tue Nov 27 11:11:22 2007 GMT Standard Time (UT+0h)  MAYBRIDGE\nmr@NMR_250MHZ
##.OBSERVE FREQUENCY= 250.131544655141
##.OBSERVE NUCLEUS= ^1H
##.ACQUISITION MODE= SIMULTANEOUS (DQD)
##.ACQUISITION SCHEME= undefined
##.AVERAGES= 16
##.DIGITISER RES= 18
##SPECTROMETER/DATA SYSTEM= dpx250
##.PULSE SEQUENCE= zg30
##.SOLVENT NAME= CDCl3
##.SHIFT REFERENCE= (INTERNAL, CDCl3, 0, 16.522)
##AUDIT TRAIL= $$ (NUMBER, WHEN, WHO, WHERE, WHAT)
$$ ##TITLE= Audit trail, XWIN-NMR		Version 3.5
$$ ##JCAMPDX= 5.01
$$ ##ORIGIN= Bruker BioSpin GmbH
$$ ##OWNER= nmr
$$ C:\u/data/dgb/nmr/ADRS/2300/pdata/1/auditp.txt
$$ ##AUDIT TRAIL=  $$ (NUMBER, WHEN, WHO, WHERE, WHAT)
(   1,<2007-11-27 11:10:51.73 +000>,<MAYBRIDGE\nmr>,<NMR_250MHZ>,
      <created by zg, POWCHK disabled, PULCHK disabled
       configuration hash MD5:
       76 6E 9A 78 1E 09 19 81 EC 84 63 8F B0 6A 59 2D
       data hash MD5: 64K
       3A 3B C9 65 51 34 9D 98 58 FE E4 97 FD 34 AF C7>)
(   2,<2007-11-27 11:11:08.76 +000>,<MAYBRIDGE\nmr>,<NMR_250MHZ>,
      <Start of raw data processing
       ef LB = 0.3 FT_mod = 6 PKNL = 1 SI = 32K 
       data hash MD5: 32K
       DB FD 4F EE 73 F0 7E 6F 04 19 C0 9D D8 98 7D E5>)
(   3,<2007-11-27 11:11:10.64 +000>,<MAYBRIDGE\nmr>,<NMR_250MHZ>,
      <apk 
       data hash MD5: 32K
       7F EA C3 F7 1F 63 68 8D 66 42 85 05 36 BB 07 11>)
(   4,<2007-11-27 11:11:11.50 +000>,<MAYBRIDGE\nmr>,<NMR_250MHZ>,
      <abs ABSG = 5 
       data hash MD5: 32K
       12 4D 9D 11 81 29 A7 4B 14 C5 90 4C 91 D9 D1 AC>)
$$ ##END=
$$ 
$$ hash MD5
$$ FA EC B7 1B 6F 9F 39 10 6E 7B 45 2E 1F 4A E8 65
##$RELAX= 
##$RELAX= 
##$RELAX= 
##$RELAX= 
##$RELAX= 
##$RELAX= 
##$RELAX= 
$$ Bruker specific parameters
$$ --------------------------
##$DU= <C:\u>
##$EXPNO= 2300
##$NAME= <ADRS>
##$PROCNO= 1
##$TYPE= <nmr>
##$USER= <dgb>
##$AMP= (0..31)
100 100 100 100 100 100 100 100 100 100 100 100 100 100 100 100 100 100 
100 100 100 100 100 100 100 100 100 100 100 100 100 100 
##$AQSEQ= 0
##$AQ_mod= 3
##$AUNM= <au_zg>
##$AUTOPOS= <50 >
##$BF1= 250.13
##$BF2= 250.13
##$BF3= 250.13
##$BF4= 250.13
##$BF5= 500.13
##$BF6= 500.13
##$BF7= 500.13
##$BF8= 500.13
##$BYTORDA= 1
##$CFDGTYP= 0
##$CFRGTYP= 5
##$CHEMSTR= <none>
##$CNST= (0..31)
1 1 145 1 1 1 1 1 1 1 1 1 1 1 1 1 1 1 1 1 1 1 1 1 1 1 1 1 1 1 1 1 
##$CPDPRG= <>
##$CPDPRG1= <>
##$CPDPRG2= <>
##$CPDPRG3= <>
##$CPDPRG4= <mlev>
##$CPDPRG5= <mlev>
##$CPDPRG6= <mlev>
##$CPDPRG7= <mlev>
##$CPDPRG8= <mlev>
##$CPDPRGB= <>
##$CPDPRGT= <>
##$D= (0..31)
0 1 0 0 0 0 0 0 0 0.06 0 0 0 0 0 0 0.0002 0 0 0 0 0 0 0 0 0 0 0 0 0 0 
0 
##$DATE= 1196161848
##$DBL= (0..7)
120 120 120 120 120 120 120 120 
##$DBP= (0..7)
150 150 150 150 150 150 150 150 
##$DBP07= 0
##$DBPNAM0= <>
##$DBPNAM1= <>
$$ [...]
##$SUBNAM7= <"">
##$SUBNAM8= <"">
##$SUBNAM9= <"">
##$SW= 20.6930455092707
##$SWIBOX= (0..15)
0 0 3 0 0 0 0 0 0 0 0 0 0 0 0 0 
##$SW_h= 5175.983436853
##$TD= 65536
##$TD0= 1
##$TE= 295.16
##$TE2= 300
##$TE3= 300
##$TEG= 300
##$TL= (0..7)
0 120 120 120 120 120 120 120 
##$TP= (0..7)
150 150 150 150 150 150 150 150 
##$TP07= 0
##$TPNAME0= <>
##$TPNAME1= <>
##$TPNAME2= <>
##$TPNAME3= <>
##$TPNAME4= <>
##$TPNAME5= <>
##$TPNAME6= <>
##$TPNAME7= <>
##$TPOAL= (0..7)
0.5 0.5 0.5 0.5 0.5 0.5 0.5 0.5 
##$TPOFFS= (0..7)
0 0 0 0 0 0 0 0 
##$TUNHIN= 0
##$TUNHOUT= 0
##$TUNXOUT= 0
##$USERA1= <user>
##$USERA2= <user>
##$USERA3= <user>
##$USERA4= <user>
##$USERA5= <user>
##$V9= 5
##$VALIST= <valist>
##$VCLIST= <CCCCCCCCCCCCCCC>
##$VD= 0
##$VDLIST= <DDDDDDDDDDDDDDD>
##$VPLIST= <PPPPPPPPPPPPPPP>
##$VTLIST= <TTTTTTTTTTTTTTT>
##$WBST= 1024
##$WBSW= 4
##$XGAIN= (0..3)
0 0 0 0 
##$XL= 0
##$YL= 0
##$YMAX_a= 227712
##$YMIN_a= -319388
##$ZGOPTNS= <>
##$ZL1= 120
##$ZL2= 120
##$ZL3= 120
##$ZL4= 120
##$ABSF1= 16.522
##$ABSF2= -4.171173
##$ABSG= 5
##$ABSL= 3
##$ALPHA= 0
##$AQORDER= 0
##$ASSFAC= 0
##$ASSFACI= 0
##$ASSFACX= 0
##$ASSWID= 0
##$AUNMP= <proc_1d>
##$AZFE= 0.1
##$AZFW= 0.1
##$BCFW= 0
##$BC_mod= 0
##$BYTORDP= 0
##$COROFFS= 0
##$CY= 12.5
##$DATMOD= 1
##$DC= 0
##$DFILT= <>
##$DTYPP= 0
##$F1P= 14.0000005364418
##$F2P= -0.99999901652339
##$FCOR= 0.5
##$FTSIZE= 32768
##$FT_mod= 6
##$GAMMA= 0
##$GB= 0
##$INTBC= 1
##$INTSCL= 1
##$ISEN= 128
##$LB= 0.3
##$LEV0= 0
##$LPBIN= 0
##$MAXI= 10000
##$MC2= 0
##$MEAN= 0
##$ME_mod= 0
##$MI= 0
##$NCOEF= 0
##$NC_proc= -3
##$NLEV= 6
##$NOISF1= 0
##$NOISF2= 0
##$NSP= 0
##$NTH_PI= 0
##$NZP= 0
##$OFFSET= 16.522
##$PC= 1
##$PHC0= 173.1151
##$PHC1= 7.414925
##$PH_mod= 1
##$PKNL= yes
##$PPARMOD= 0
##$PSCAL= 4
##$PSIGN= 0
##$REVERSE= no
##$SF= 250.13
##$SI= 32768
##$SIGF1= 0
##$SIGF2= 0
##$SINO= 400
##$SIOLD= 32768
##$SREGLST= <1H.CDCl3>
##$SSB= 0
##$STSI= 32768
##$STSR= 0
##$SW_p= 5175.98343685301
##$SYMM= 0
##$S_DEV= 0
##$TDeff= 65536
##$TDoff= 0
##$TI= <Analysis number 999999
Compound Code 99
Book Reference 9
Project Code 9>
##$TILT= no
##$TM1= 0
##$TM2= 0
##$TOPLEV= 0
##$USERP1= <user>
##$USERP2= <user>
##$USERP3= <user>
##$USERP4= <user>
##$USERP5= <user>
##$WDW= 1
##$XDIM= 32768
##$YMAX_p= 402004325
##$YMIN_p= -180961
$$ End of Bruker specific parameters
$$ ---------------------------------
##NTUPLES= NMR SPECTRUM
##VAR_NAME=  FREQUENCY,     SPECTRUM/REAL,   SPECTRUM/IMAG
##SYMBOL=    X,             R,               I
##VAR_TYPE=  INDEPENDENT,   DEPENDENT,       DEPENDENT
##VAR_FORM=  AFFN,          ASDF,            ASDF
##VAR_DIM=   32768,         32768,           32768
##UNITS=     HZ,            ARBITRARY UNITS, ARBITRARY UNITS
##FACTOR=    0.157963299565203, 1,           1
##FIRST=     4132.6476996994, 0,             0
##LAST=      -1043.33573715361, 0,           0
##MIN=       -1043.33573715361, -180961,     0
##MAX=       4132.6476996994, 402004325,     0
$$ Real data points
##PAGE= N=1
##DATA TABLE= (X++(R..R)), XYDATA
$$ [...]
21133 -14844 -10810 30561 -314 -34852 -18013 -9328 13847 7885 -23773 -55371 -71623 -41476
21121 -41476 -40065 -48243 -34410 -32423 -37800 -32252 -9956 -13188 -11349 -25596 5215 20382 22233
21108 22233 13690 8218 -22452 -15446 18923 21467 -5179 -26577 -22798 -10576 11060 3154 22188
21095 22188 28061 -11861 -34916 -23664 -24285 -54748 -46642 -54468 -94502 -93326 -102990 -58189 -24391
21082 -24391 -29821 -51495 -32426 -14562 -31213 -27736 -35528 -44002 -39211 -70215 -79373 -54617 -30033
21069 -30033 -17882 -13709 21491 -14877 -29932 -42426 -55913 -33247 -56901 -74128 -96480 -82865
21057 -82865 -52006 -45221 -35224 -16327 -14352 7265 2340 -7029 4983 -11864 -34689 2820 4290
21044 4290 -15696 -15206 -29134 -36204 -4059 -39331 -61182 7433 6265 38079 6097 -38158 -45000
21031 -45000 8806 32101 -17087 -31945 -3721 15833 44490 42630 39674 14592 -12232 -12926
21019 -12926 -1952 30808 -13918 -72619 -54086 -62549 -80973 -47004 -29929 -21748 -17651 -3866
21007 -3866 -1085 19612 21402 -11320 -29476 -22571 5260 22600 6047 24237 31104 22067 7439
20994 7439 -12030 -26617 -13187 -9127 1854 19856 5393 30092 64712 22846 -24367 -58482
20982 -58482 -55680 -46194 -37017 39834 56252 41888 53989 1786 -36091 -39053 -54371 -98118
20970 -98118 -82905 -87394 -85740 -49738 -31174 -52977 -72421 -52630 -41419 8493 27503 29804
20958 29804 42042 51542 27730 23863 22956 22131 -21800 -91141 -135501 -108198 -53485 -34301 -40349
20945 -40349 -56242 -58822 -19968 -13759 -39336 -56864 -74597 -26105 -21166 -20462 -19961 -51671 -74802
20932 -74802 -75379 -27526 8830 43834 26861 71757 77161 24951 12645 44398 57639 15609
20920 15609 -21924 -13344 -549 4325 67439 94097 59464 22918 -19912 -20204 18165 -7208
20908 -7208 -20910 -77663 -108947 -51719 7113 9891 -18021 -27882 -23447 -31415 -32613 -16279 26608
20895 26608 56621 50621 33354 26607 6386 -15776 -44940 -32215 -13798 -33367 -56177 -66406
20883 -66406 -47740 -35059 -2975 -31783 -70638 -105476 -92051 -34904 -19298 -25388 -6157 -33523
20871 -33523 -59650 -60185 -28567 18958 17360 18588 15689 -10589 -7258 -42559 -30698 9337 -1027
20858 -1027 -26363 14621 38651 29848 -37513 -61316 -25754 -2557 -30959 -23977 -27123 9829
20846 9829 25241 12767 219 -54089 -95942 -60537 -48911 -57437 -9963 7502 27777 4878
20834 4878 -32132 -32983 -15052 -7640 -18524 -10170 2637 11993 45108 42968 35282 4686 -350
20821 -350 4851 14705 -15588 -45517 -42154 -37872 -46549 -55431 -28515 17256 38982 13882 -42385
20808 -42385 -60059 -29597 -40797 -81050 -78714 -48380 -18684 34562 58554 44033 25596 29616
20796 29616 56868 68202 71190 65440 57508 59632 101223 120080 78033 44583 27261 45766
20784 45766 -18429 -66095 -74422 -27483 -44635 -104566 -110275 -76181 -24922 -5935 -37080 -65027
20772 -65027 -71959 -43818 -23637 -45347 -41660 -49988 -17127 3360 -16733 -66433 -75219 -37950
20760 -37950 26065 34527 33922 -11729 -4329 12027 8587 7935 -16184 -41342 -7453 -13463 -31161
20747 -31161 -57514 -93093 -92313 -56808 -64236 -73116 5097 79561 65901 56862 48228 3853 28190
20734 28190 56110 84563 82771 32150 -14469 -53492 -13803 3572 -6665 -12570 -2660 14307
20722 14307 6438 5729 30522 -23313 -81633 -66253 -45182 -20425 -69004 -57524 -10601 -38326
20710 -38326 -73521 -58923 -30739 -48969 -26741 -14480 -34531 8745 61354 62854 43225 29562
20698 29562 53079 56334 45343 44048 23646 14531 28554 14897 12593 -14031 -37710 -26073
20686 -26073 -51698 -49208 -2416 17204 28118 33051 5611 -31844 -64477 -22065 -5362 -2118
20674 -2118 -558 -35729 -55281 -21162 -28405 -44502 -80693 -116855 -102822 -81459 -93916 -65902
20662 -65902 10364 15301 -43654 -74221 -23302 -37943 -52804 -17651 95 2373 38015 34086
20650 34086 583 -15588 -39205 -22821 -7268 -22703 -21477 -17399 -24714 -28991 -25513 -36619 -29235
20637 -29235 -41401 -63638 -33902 -26862 -11565 -25643 12441 -36765 -27703 -35182 -73639 -42647
20625 -42647 -48281 -56164 -84483 -89262 -41383 -15322 -34567 -37871 -30647 -16605 -39957 -24466 12339
20612 12339 12925 -28733 -33562 -38833 -35599 -43559 -30183 -21217 -42227 -32662 -28320 -32949 -34274 -27818
20598 -27818 -36062 -13323 15173 -3137 -64998 -83089 -44932 -3924 -31393 -67189 -29356 18539
20586 18539 2875 -1033 19120 30175 59466 65072 17194 -15247 -5880 -6103 -32172 -71462 -85887
20573 -85887 -49686 -46257 -59566 -19916 12242 -58568 -58955 -18691 7325 18580 -41221 -58728
20561 -58728 -37751 -21037 -553 37342 55354 20679 4118 -371 17615 21028 -34640 -25697
20549 -25697 34824 41040 32854 7341 -39340 -18599 30917 12569 -24171 -7372 -9399 10582
20537 10582 31593 18035 -4748 -11437 -31840 -79061 -84573 -76358 -78208 -60655 -26651 -44638
20525 -44638 -36962 -50638 -39735 -25934 -32592 -32232 -35994 -26316 43543 60821 14734 -33352 -43340
20512 -43340 -45887 -49090 -39642 -7141 -5957 -46412 -19264 -12541 -3277 17804 -9613 2786 -9361
20499 -9361 -23333 36306 76219 33428 -4982 -2827 16156 31857 37259 21623 -13339 -10529
20487 -10529 -4979 -47060 -84353 -110443 -86045 -83936 -32771 -5010 4231 -683 34096 61450
20475 61450 98247 70861 -3811 26954 54793 39016 15767 17259 31829 24026 6565 2126
20463 2126 -31449 -23730 -18856 42824 28994 -11512 -39011 -33556 -69358 -71361 -9095 16504 -370
20450 -370 11355 -14501 -22907 -6232 16232 25745 32855 45294 25553 -15230 -18431 -41387 -33632
20437 -33632 -11508 1508 -24796 -6625 5557 -2871 -21821 -71520 -88265 -64260 835 7557
20425 7557 27890 2641 -39264 -40302 -27244 17595 44723 75920 76664 59319 -2622 -12951
20413 -12951 -12477 -2851 14716 -9476 -45417 -32156 19118 55290 32667 51320 113812 116491
20401 116491 70360 24565 17346 -18642 -65395 -74438 -73174 -76429 -50376 -31890 -1652 20285
20389 20285 -1773 19695 -27192 -35051 -39332 -55562 -61084 -59421 -17284 15536 33962 -2891
20377 -2891 5198 31879 40134 32622 39088 28576 -22276 -11379 19837 19914 -21332 14992 -783
20364 -783 -11958 -62343 -76595 -62299 -80443 -66900 -42571 -22207 -18610 -40209 -9654 2096
20352 2096 10420 29785 86408 106144 143696 80776 43414 58805 71579 67534 48388 32882
20340 32882 -2675 18246 17252 16182 838 -19165 -10316 -30722 -67870 -56827 -72395 -64219 -50788
20327 -50788 12571 46457 73435 50791 -1890 -1436 -6881 -33636 -15656 -16224 -7877 2651 54058
20314 54058 65640 -2709 -30689 -56219 -77745 -72624 -57513 -5450 42615 60567 59298 78111
20302 78111 98496 93035 82996 69973 35588 -11267 -33053 -40605 -36151 -15618 -14975 -4039 -11832
20289 -11832 1033 -28538 -65141 -71112 -39287 5632 -37842 -61102 -31941 -27646 -2597 8783
20277 8783 2482 -15871 -32151 -87483 -85229 -53131 -33682 -26151 -40311 -38774 -77062 -103055 -110392
20264 -110392 -92311 -57182 -44955 -61746 -13365 -11784 -33977 -21549 20310 32058 12455 43661
20252 43661 47892 -18085 1669 12061 -42748 -60044 -36823 -45818 -35802 2373 -11619 -46851
20240 -46851 -69262 -70773 -38317 3615 24698 31350 10942 12378 -1361 -15921 -26973 -49904
20228 -49904 -41570 -19619 -15114 -6594 7483 9983 26935 34424 21216 -27442 -45881 -25722 -9062
20215 -9062 -42907 -41259 -10960 -10701 -32181 -20376 6736 -19661 -15861 -6407 -14186 -34453 8007
20202 8007 48862 43151 1671 13776 27640 17670 -10733 -26712 -7757 -2091 25250 71432
20190 71432 108192 112359 100523 50985 29668 21655 18610 30376 -19518 -20644 24481 -5068
20178 -5068 -20942 5786 17668 22443 36220 28826 15081 47746 36930 -22001 -63987 -71603
20166 -71603 -88256 -75532 -74992 -31180 3672 -16063 -27729 -16340 48031 62422 11745 -3876
20154 -3876 -15046 -2238 35101 86376 79206 76525 40722 -16587 -60787 -51085 -53718 -64417 -55129
20141 -55129 -67708 -40406 -49419 -41027 -15433 -18731 -14197 -11037 -33693 -22045 -28511 -56369 -72239
20128 -72239 -48956 -18978 8202 21249 15302 17797 -30565 -66966 -9814 33041 28768 54363
20116 54363 47375 32161 -14217 -43124 -67252 -16476 25270 34936 -23390 -74234 -54077 -11132
20104 -11132 539 24213 60770 85515 67267 50530 36144 4455 10034 31286 46764 76746
20092 76746 96472 106294 85896 35529 36352 31418 20916 -7010 -33196 -19577 17472 3269
20080 3269 300 -3234 32931 15376 -7359 -17567 -1643 17899 -27892 -45653 -18952 -1144
20068 -1144 19355 31575 58473 27627 15720 17738 4653 8971 -23261 -20718 19544 6643
20056 6643 -26672 -921 4900 13342 5300 39842 83322 67084 35483 42293 61001 31000 10007
20043 10007 19952 25789 24425 16789 25531 5773 2200 3947 44417 16223 3549 40423 26080
20030 26080 40006 29343 -6322 -12206 -32262 -12890 -27186 -31349 -26460 -50651 -11740 8672
20018 8672 -24412 -27257 -63281 -87292 -62938 -42260 -49397 -50434 -44049 -87326 -84335 -82690 -72309
20005 -72309 -18579 -6552 1181 -3012 667 -5874 45060 43537 26883 36727 43394 51823 28484
19992 28484 -19479 -43004 -26815 -30139 2364 3459 -4521 10061 -8934 -11142 -1684 -26284 -31139
19979 -31139 -21764 -7887 -9748 40350 58033 49476 -3190 -3491 -3764 -44927 -60579 -27570 6608
19966 6608 5561 -1359 27071 8877 4322 14098 -33137 -70870 -43825 20609 41805 46048 33527
19953 33527 53327 66079 37975 16754 9657 -794 -9980 17349 22075 209 -11298 -19602
19941 -19602 -39942 -51413 4487 9896 -1765 20116 29597 38147 81107 100738 84777 79229
19929 79229 57609 21733 42722 101453 119019 124417 55538 -9458 -4209 -19496 -12513 10477
19917 10477 -78 -26750 -45662 -52464 -32205 -29125 -21508 7249 14828 -34964 -90165 -64224
19905 -64224 -62938 -40272 -59315 -53391 -16276 -27212 -4795 21087 39743 34640 15043 552
19893 552 25067 19467 -30953 -26452 -16390 11624 49797 18905 -21346 -24128 -45352 -48828 15396
19880 15396 2084 -33764 -31858 35379 26168 -15830 -20244 -15231 4546 -6971 -29719 -21988 -6205
19867 -6205 -33466 -80477 -117024 -85590 -61767 -20241 -24704 -26411 -15468 31370 61509 72134
19855 72134 36343 20306 -21173 -3687 2699 -14165 7143 1647 -24503 7171 52479 63499
19843 63499 61487 29697 -14445 -37971 -52932 -53919 -22680 -45779 -66708 -74185 -60078 -17598
19831 -17598 -56651 -30279 1528 -29398 -72748 -46184 -21285 -47320 -32541 43660 36033 12368
19819 12368 46642 3751 -14531 8295 8598 1317 -22743 -29864 33321 34259 14951 17146 26019
19806 26019 34352 -12651 -18843 6452 17362 5163 -24876 -59653 -59538 -66654 -12019 -10872 -38872
19793 -38872 -30523 -9990 -43090 -60225 -15758 6564 -18391 -17338 -19586 -42174 -48757 -32312
19781 -32312 -41879 -34719 -7845 -23563 -32533 -56107 -72893 -36999 -13831 2224 30429 31985
19769 31985 10609 -42443 -60873 -60221 -63223 -86734 -51927 -23556 -14560 -25258 -25271 -22342 -28856
19756 -28856 -11100 26891 29375 18759 4768 -32808 -43847 -49849 -34827 8181 54604 43436
19744 43436 19737 20420 9295 -3526 31907 43896 17260 -14057 -7040 7761 18651 34886
19732 34886 14326 -9009 -2679 -12416 4951 -991 -33655 -66984 -77959 -43666 -3758 -6972
19720 -6972 18879 788 -27299 -47706 -61104 -71501 -75227 -52668 -27678 -24148 -17767 -33329
19708 -33329 -392 1295 -18062 -26379 -26753 -16634 -45874 -43669 -48468 -55879 -35921 -12697 22835
19695 22835 44274 23296 -20180 -43819 -24202 -18740 -37546 -69734 -60500 -66723 -70867 -73975 -42092
19682 -42092 -37098 -40027 -36143 -6590 7075 -10771 -5062 -49236 -36633 -14755 -11290 -20112 -71024
19669 -71024 -70845 -35842 -23576 -34910 -57025 -62207 -32448 -22945 -9446 -36816 -48643 -42947 9968
19656 9968 28138 -7089 -38323 -41287 -48920 -9435 5316 31992 9303 9919 2139 -34590 -48205
19643 -48205 -54782 -18836 33645 -9040 -50230 -41568 -53211 -69970 -60727 -56598 -28430 -3550
19631 -3550 22875 3418 -25061 -28872 -24781 -11316 -251 29477 16667 26371 41650 18247
19619 18247 39384 51996 80723 21000 -27394 -8595 55975 72642 31948 16887 17583 14964
19607 14964 22485 -930 -6142 -4908 -7401 -32259 -48054 -34643 -7215 16461 52803 38614
19595 38614 6847 25821 26623 31073 24257 35795 75583 50179 50464 60760 24261 13797 14966
19582 14966 16762 23994 57957 69762 20433 -25109 -32427 -16761 -7294 -50542 -32261 22572
19570 22572 30584 -4046 -19120 -18346 -26767 -19304 -7000 -1812 -45406 -68525 -77496 -60351 -75096
19557 -75096 -31140 -7894 10850 37771 31660 26418 29614 76690 65757 29134 -11152 -43595
19545 -43595 -19234 -10290 -40611 -24762 -17301 1126 4002 26435 44388 50966 16000 1723
19533 1723 15049 29571 -8368 22623 37140 -12945 3199 786 -143 -13513 -9288 -21673 -1404
19520 -1404 16299 -3271 -58535 -43055 -11800 -22311 -5775 -12611 -15650 -6057 -43367 -63469
19508 -63469 -48433 -67691 -59300 -59977 -11197 5052 1093 9726 18914 17286 4219 5929 20826
19495 20826 39042 24303 20870 -14027 -40264 -91220 -64501 -13737 -27229 -29688 -14121 -1171
19483 -1171 -2076 -18843 -15399 6271 21276 -4372 -41154 -53833 -5806 20060 -8766 -9093 26347
19470 26347 67824 57052 39508 49829 59850 11919 -20590 3528 -8913 -13352 -31492 -50979
19458 -50979 -73171 -73509 -20033 12276 60870 91111 174391 223826 291705 358509 442139 438468
19446 438468 400037 373797 302306 221261 155285 122354 91351 53304 39095 60971 103210
19435 103210 144543 188554 263892 315910 331250 260166 158025 151551 141976 124871 96223 129345
19423 129345 120798 136694 136065 189830 273052 336690 426330 442672 424747 387487 301695 230358
19411 230358 185625 201142 246351 232378 268338 342896 363209 269322 189725 162681 144072
19400 144072 102010 69400 13433 20153 7102 53452 106671 123546 159099 238882 281636 361714
19388 361714 439697 455637 485743 470124 347077 236599 124097 79132 68835 73879 71376
19377 71376 83341 72061 46255 18620 -3466 22754 67096 53898 51121 38144 61874 93912
19365 93912 115287 105410 58713 20103 -30972 -46940 -12591 -17476 -12731 13142 45708 27741
19353 27741 4869 -28877 -62693 -37219 23540 40111 24246 3197 -39138 -37938 -35881 -81301
19341 -81301 -83039 -39796 -30333 -39907 -37571 -48288 -22905 -2406 -36661 -57416 -19004 -26124 -19245
19328 -19245 -24332 -52718 3188 47134 69979 67555 -20325 -83739 -92098 -70347 -49057 -26769
19316 -26769 -28987 -29283 -34107 80 34801 22997 -4672 -6019 20632 45790 51086 84782 77072
19303 77072 51482 49385 6326 -16237 1723 36799 58778 57694 30023 14206 52783 48749
19291 48749 10513 15127 41744 46776 50397 70570 65814 37391 18265 1170 -17042 19568
19279 19568 48193 30493 93208 121173 71606 59327 58252 53527 90591 117262 176704 296551
19267 296551 362151 408253 448951 437555 384218 225973 145163 95158 86716 95023 95468 96428
19255 96428 97999 105540 105887 106232 123580 118575 198699 300473 362784 300840 235274 188367 159051
19242 159051 186054 202987 238932 390777 493565 548430 527196 404706 297277 221214 151107
19231 151107 70146 26143 26768 39193 88965 119553 139602 141240 129150 176575 273048 359892
19219 359892 326104 207036 142098 115854 103787 100257 123905 129072 130415 178823 264836 394204
19207 394204 473623 486621 502043 463227 377601 249630 164925 130371 122049 71899 45767
19196 45767 60213 53802 42755 938 -11592 -32043 -4651 14840 18047 36250 51097 90834
19184 90834 145753 128932 95480 62619 49097 16989 4086 -10612 7146 -3399 -24801 -33674
19172 -33674 -6001 46091 26522 7938 11878 53153 72376 48823 55420 46867 44034 43548 22062
19159 22062 -17397 -97449 -80496 -46827 -59262 -70332 -26175 30475 63810 80917 11299 -40406
19147 -40406 -60571 -10315 -31470 -63027 -40226 -36785 -61653 -57223 -8779 -25027 -61203 -34530
19135 -34530 24172 36012 42117 36859 33679 19158 -601 14988 13537 1359 8144 49190 51592
19122 51592 31359 43336 48173 23983 -6702 776 31856 40872 65529 22283 3917 -12632
19110 -12632 -22895 -39572 -21275 25900 43919 57603 43856 27710 -18255 21084 1122 10290
19098 10290 -4507 -707 -41312 -49671 -20063 -3194 -38114 -109021 -74465 -32149 -7323 5603
19086 5603 12779 9510 -35737 -61483 -38525 -6472 -38002 -48189 -52618 -23073 10030 15769 16760
19073 16760 6727 -2930 6731 39527 24061 24200 13702 -417 6632 24679 7277 10396 44312
19060 44312 24236 4483 -33367 -35337 -22520 -11166 6620 6678 5550 -40232 -35634 5229 45421
19047 45421 35070 23635 1865 13697 36318 38639 47067 -3916 -18340 -16304 -21889 22096
19035 22096 41606 84171 115420 166338 240949 347193 456449 470096 444459 441674 355315
19024 355315 285316 279205 280692 241744 252609 312392 415991 505385 501157 397529 294526
19013 294526 200923 150218 100119 104344 52340 -1712 -35366 -3087 36724 27890 19869 8326
19001 8326 14896 62160 32137 13422 21338 -3887 -30480 24816 56888 30626 26366 57576
18989 57576 76643 52670 59892 122090 186612 254783 344679 437487 424047 433709 530257 548987
18977 548987 465518 361767 303427 304320 340336 392437 484979 532507 496658 470126 378857 246807
18965 246807 136315 69318 47956 8928 13766 27048 28869 -16891 -34029 -16587 -26004 -22075
18953 -22075 -1735 -4470 -4756 54162 48111 9806 -12107 29881 71511 62989 86833 120112 152687
18940 152687 164615 167811 205068 239519 213320 119809 80526 67177 91701 104808 134993 143936
18928 143936 142627 150759 121991 94671 45667 -35261 -51757 22918 28809 28056 38947 -703
18916 -703 -10725 -15782 -29827 -41365 18799 39408 16366 -45334 -77243 -34333 16948 30844
18904 30844 -54904 -103421 -99694 -60059 -46948 -23220 11372 27878 43208 35003 22232 -11047
18892 -11047 4288 53284 98337 121861 159205 172181 194868 207670 197178 202405 190026 191201
18880 191201 214581 240846 243150 213246 190720 144280 44215 19919 43278 69270 56604
18869 56604 23979 18532 50321 74027 104711 99057 67326 44860 52497 54119 40598 -24143
18857 -24143 -67033 -5370 38713 48840 15354 61288 71868 18645 -20181 -48518 -59167 -51397
18845 -51397 -11741 41918 21408 31955 52604 58139 95252 88147 39885 62288 35451 37634
18833 37634 72827 167781 261668 296998 382138 427230 464003 468668 372559 302866 323782 303790
18821 303790 297802 345774 419683 434976 387132 411205 409813 375638 334329 241425 166632 114693
18809 114693 105925 82747 34137 25580 42646 29520 52840 40314 27796 25757 31736 13782
18797 13782 5915 -19027 4828 69561 85978 99084 71059 52233 84168 73835 36921 30283
18785 30283 56158 107776 215868 332436 502604 657658 685483 586542 460894 372177 295426
18774 295426 295666 336256 449956 578942 759266 898022 994995 1088848 877664 571994 390082
18763 390082 259260 188032 120080 140388 102076 38127 55671 77678 95548 106260 116371
18752 116371 110761 109821 81683 73310 44130 34130 -2521 -12019 5619 23073 46243 46372 -13453
18739 -13453 -37410 4926 33875 12206 14248 3009 822 -22761 -10407 -6834 -12752 -8965 -12186
18726 -12186 -18549 -37294 -44901 -14597 -17929 -50890 -36592 17035 27089 -8454 -16477 -18560 -3409
18713 -3409 15375 54288 48384 81556 97614 73211 57828 60899 56524 24019 31658 -14995 -27027
18700 -27027 -26054 -18507 -17920 -1478 13293 15758 -19165 -14103 -22614 -43534 -11662 30254 32340
18687 32340 4812 14010 45878 77771 52391 19841 10151 9074 -11477 2204 36824 32753
18675 32753 27888 59054 90213 57854 47768 76403 77112 57912 32005 -372 55067 103153
18663 103153 104381 130220 142890 183880 238328 342600 495304 691411 704850 516929 314314
18652 314314 214071 160106 124355 153852 146629 120446 128671 78093 41832 35389 42625 87252
18640 87252 82183 52593 64326 130345 118851 67857 10944 -10165 7201 -3151 -3208 11152
18628 11152 15913 33536 50687 77350 122606 176363 178597 170686 221291 214862 189882 148640
18616 148640 104745 65738 60718 73564 101339 176302 222484 225867 174666 102921 68098 34154
18604 34154 47670 51585 67702 67073 66985 83030 96281 113460 95807 66386 95110 122923 129422
18591 129422 103699 79046 84212 42466 11800 40701 66189 83209 122912 136794 108283 112780
18579 112780 112073 99843 153986 288306 389979 496613 611375 662106 567848 424751 360992
18568 360992 317439 283275 293581 319106 423940 516812 596129 590339 493813 354156 257487
18557 257487 241139 215667 167838 123759 105639 106079 105490 91910 88662 120994 117195 126960 136983
18544 136983 130689 71146 67272 90932 139538 128366 119606 118251 117517 109783 78888 124036 147223
18531 147223 114431 135196 193075 261443 382021 503044 560017 476235 386020 293025 236396
18520 236396 198332 236698 287633 325625 366134 428160 552174 629761 625902 638478 643089 589233
18508 589233 527745 441297 350674 321652 310193 342863 415399 469401 527083 664406 753431
18497 753431 658470 507461 407445 324614 247885 223989 227581 217903 213080 257027 254720 256321
18485 256321 249291 224119 206504 199303 228794 224871 261645 268294 328315 411255 444831 438395
18473 438395 512686 559560 601429 588388 571536 631211 779191 905287 994039 1174131 1422355
18462 1422355 1604051 1637611 1605823 1607966 1630640 1763714 2018967 2465619 3139249 4174366
18452 4174366 5767121 8259930 12022677 17609630 24851792 28441234 23405403 16539838
18444 16539838 12140871 9878265 9239830 10064393 12475765 16811483 22904560 27049056
18436 27049056 26737765 23251416 17024952 11875882 8840566 7245122 6560928 5995914
18428 5995914 4990598 3951401 3251286 2774982 2522146 2380192 2337147 2349151 2397041 2466132
18418 2466132 2659497 3075598 3788581 4682503 5165104 4780656 4087286 3627942 3411392
18409 3411392 3361906 3275728 3113610 3128941 3315237 3661249 4186024 4979440 6271987 8455839
18399 8455839 12056413 17700009 25533060 31698907 28564021 20932104 15721147 13392716
18391 13392716 13415696 15716221 20312401 26366328 29664235 28856059 24135617 16844802
18383 16844802 11278199 7860336 5740590 4399563 3517690 2902197 2527268 2348400 2265210
18374 2265210 2248464 2201767 2072499 1961009 1912016 1803295 1632214 1401673 1229497 1127679
18364 1127679 1084361 1080477 1044408 1017780 1023312 1035019 1078350 1163385 1130191 898326 696412
18353 696412 607439 544499 534273 548031 522704 542921 619158 737866 840717 948816 951143
18342 951143 875857 864358 932001 941965 841185 697135 565578 494478 439634 392587 349896
18331 349896 337111 371512 429323 541586 660945 741522 678583 578066 507599 496963 469335
18320 469335 358053 335624 421131 437564 480340 614186 793415 964305 1027591 1013129 940602
18309 940602 758980 588737 477513 402969 306152 252340 244580 222843 214745 177361 117732
18298 117732 106838 82172 126494 171697 156933 161355 176908 199422 223819 266361 310960 345150
18286 345150 376251 467947 593933 907439 1429265 2151964 2888644 2857441 2023037 1279349
18276 1279349 814770 556479 404468 305813 238600 224232 236777 235976 180353 115499 120685
18265 120685 182210 213411 192754 166030 144763 152791 127360 98178 71997 85087 91195 77222
18253 77222 79047 82974 77768 62590 122571 170631 120709 90022 109958 113941 156051 193134
18241 193134 161533 161278 225204 259080 239921 263848 354977 466648 594371 860498 1339213
18230 1339213 2100143 2910962 2916807 2010156 1245465 872288 634526 481388 403110 356466
18220 356466 346783 329613 233062 186568 163063 186336 172843 169732 168149 127232 100624 92784
18208 92784 77211 63152 77548 120085 153750 167826 147938 165846 189244 172731 162570 128613
18196 128613 107184 116506 76261 57270 52826 44679 51416 78967 79787 87409 85829 120533 174917
18183 174917 178798 212685 185712 181233 164262 150522 143709 132621 93314 95522 123285 135626
18171 135626 117377 132532 116223 104911 175442 206776 229874 224476 223125 196269 184940 168774
18159 168774 173792 189427 232577 237743 245998 228833 171015 193967 267918 296661 306544 322232
18147 322232 294717 266298 293791 295922 329449 321701 338460 359257 337195 373075 385722 407079
18135 407079 449135 541199 619493 687644 757790 801436 841682 895027 976875 1145221 1266392
18124 1266392 1422484 1617791 1903136 2222507 2594464 3082709 3767957 4817713 6306177
18115 6306177 8545594 12236065 18545658 29310728 46877024 74014261 101742173 87284670
18107 87284670 53853646 32572775 20929878 14355581 10425501 7926341 6278051 5126987
18099 5126987 4289096 3624646 3114482 2743626 2500190 2342958 2290851 2254272 2343117 2500715
18089 2500715 2650107 2585959 2394103 2314816 2419908 2637684 2972396 3357924 3612724 3772592
18079 3772592 4075278 4563529 5379277 6703542 8724826 11798892 16699870 24642129 37864710
18070 37864710 59888873 93971959 132292788 131200104 89625744 54654492 34590943
18063 34590943 23402394 16595907 12197566 9311153 7349242 6004889 4982899 4204153
18055 4204153 3629565 3259111 3004639 2855164 2769534 2667294 2362813 2034133 1925806 2000015
18045 2000015 1986986 1748654 1447947 1235063 1086427 916017 811337 733381 716626 685778
18035 685778 635130 577495 571734 595506 553320 504419 508656 514187 434636 424525 399626 326629
18023 326629 304973 295773 323880 355704 375140 334596 276930 237608 248817 243276 243694 230524
18011 230524 203212 221794 261380 273645 290085 311150 322360 321203 285437 245185 252279 274069
17999 274069 239584 233318 205367 160463 171454 222979 236104 195162 190657 183343 194019 224471
17987 224471 262070 251069 303379 378454 419713 459253 432179 416011 395409 391096 404572 379652
17975 379652 401151 442207 461895 487394 499795 522806 530556 615726 709650 805832 957526
17964 957526 1168631 1517889 1883938 2460799 3414914 4947020 7332072 10654255 13594346
17955 13594346 12910174 9628407 7029860 5635106 5163507 5398495 6345904 8247590 11180436
17946 11180436 13828824 12860901 9268472 6320369 4489343 3390247 2675718 2168841
17938 2168841 1844363 1627997 1452787 1343265 1246569 1214106 1261487 1281639 1355413 1412695
17928 1412695 1461414 1461124 1406531 1349923 1341171 1380889 1459318 1576028 1709444 1862948 2043647
17917 2043647 2330475 2707302 3326472 4274630 5788920 8217140 11904147 17015747 22033124
17908 22033124 23462082 23407512 23693311 21429328 17818501 16156589 17016186 19417417 20075118
17899 20075118 17146098 14317587 13712484 15270609 18010452 18271918 14237813 9901629
17891 9901629 7061449 5365266 4258138 3483875 2885974 2430313 2145739 1924220 1749106
17882 1749106 1616924 1545674 1472396 1417227 1357965 1319261 1335350 1299005 1280516 1300752 1347809
17871 1347809 1431584 1546928 1709459 1936250 2233202 2568717 3009489 3797413 5141844
17862 5141844 7520262 11164162 15931622 19398075 17337520 12657982 9263344 7498656
17854 7498656 6866853 7232403 8781513 11609474 15616888 18495610 16240542 11385256
17846 11385256 7627192 5288048 3855078 2942328 2314931 1857202 1543610 1324274 1174529
17837 1174529 1068052 975106 914092 831361 772435 747862 678977 564354 479839 463002 431352
17826 431352 445005 443222 452477 468921 511511 483647 438788 414972 385835 334982 278005 277760
17814 277760 314677 336101 355837 362499 388062 370829 322240 282694 274237 304752 384696 431980
17802 431980 413150 398746 408451 408019 374929 300044 233771 211499 180973 173265 186109 138450
17790 138450 105830 146700 181606 163424 183500 164478 165873 175864 145656 105123 68519 42433
17778 42433 53076 76297 126758 115033 141663 135658 112604 137538 121022 163893 155000 109699
17766 109699 117421 79702 59297 55146 61893 27639 48109 105368 90864 107468 111822 87652
17754 87652 57214 77356 128125 106860 100618 80679 29957 37221 76283 92071 96734 96777 101167
17741 101167 89379 68481 57308 50809 26753 10742 -10937 31290 72931 87422 96027 71854
17729 71854 34734 24691 4675 17728 51123 43260 60290 61397 50848 20067 12665 31046
17717 31046 3969 -38514 -40995 7795 72196 77198 49139 64817 93428 101111 43155 21253
17705 21253 33781 50832 16689 -51762 -61774 -42508 -35375 -18277 -59777 -79336 -36447 13740
17693 13740 23374 26850 20379 -10308 -31870 914 32511 28979 14562 10652 12618 43489 7415
17680 7415 -43996 -50405 -53436 7253 29673 44024 57699 31521 1812 -37214 -14737 26710
17668 26710 41367 55494 24335 26877 63322 68344 52949 7390 -58137 -66744 -67050 -57908 -25601
17655 -25601 26969 25249 19312 30856 3133 -4508 -9689 -10691 18745 26314 42168 54211 58556
17642 58556 39655 -11802 -30592 -18476 -3979 1403 -9946 -10797 23952 45945 36921 -13
17630 -13 -16391 641 -8336 5652 2951 644 -71456 -69841 -76855 -74642 -75443 -92511 -99339 -101243
17616 -101243 -86408 -83005 -119399 -62576 -25623 -25164 -18678 -16831 -12847 -22135 3202 75712 128825
17603 128825 87260 45757 16229 37951 33349 24859 36103 19661 55169 68246 43631 50811
17591 50811 15487 -15537 -18846 -5729 -27021 -15752 24782 26941 37655 42369 16810 -40671
17579 -40671 -62310 -66094 -54985 -82653 -51361 -33123 7625 32667 8180 -10998 -13991 12935
17567 12935 28825 52501 66291 88896 74499 56390 70126 62762 48731 2657 4200 30610
17555 30610 12099 3500 -6500 -214 13469 34552 56940 11688 -32319 -14578 5253 22295
17543 22295 19688 24495 -28086 -39498 -17631 11878 36498 58311 25997 10157 14812 -1919
17531 -1919 35036 59943 57507 43487 28622 43707 33607 -15187 -28084 -60624 -11699 37672
17519 37672 106725 76580 23304 31878 30055 -1588 -38488 -31379 -56529 -70234 -31894 -19782
17507 -19782 40207 105683 115207 72398 33231 53956 45419 58399 44630 57197 60561 64614
17495 64614 65669 72334 52122 18753 30146 48664 66875 122696 95866 86997 97155 103007
17483 103007 120854 139145 112001 95433 104917 131763 172523 230046 306968 435040 667528
17472 667528 767585 584470 369800 219582 211368 194122 136901 78062 43142 99354 79732
17461 79732 36499 9149 -18369 1464 37714 10594 16287 60106 54531 37032 34485 51431
17449 51431 71968 129987 164291 236840 307480 440769 606131 602117 433588 295063 239254
17438 239254 157972 99870 83203 103345 112669 116677 127295 146009 107429 80329 92072 79296
17426 79296 35345 41213 69944 113458 92958 102470 132231 123378 115045 126522 154630 140281
17414 140281 99180 117048 114638 109259 104678 97003 100036 131635 148778 167019 181120 178286 154325
17401 154325 161910 205306 248413 246988 229988 216789 210985 172331 145845 156901 148784 131316
17389 131316 165619 172944 152502 124764 92950 67261 79273 72504 71256 70850 131347 115124
17377 115124 162245 253287 282523 278405 263006 273559 270441 339497 424461 507661 590670 682160
17365 682160 693688 644846 587143 608964 658322 725655 759346 773535 816957 856980 959838
17354 959838 1036133 1154495 1287023 1433182 1642349 1934263 2379909 3006193 3909953 5310752
17344 5310752 7427838 10018195 11129039 9945439 9146853 9668399 11699873 15604097
17336 15604097 21614283 28486609 29138850 22407782 16512641 13402050 12434405 13352359
17328 13352359 16298485 21820231 30380816 40101005 41601399 32683043 24091860 19539945
17320 19539945 18477475 20397442 25387901 32122576 33411918 25801978 17710893 12402286
17312 12402286 9218432 7256854 5978810 5183197 4685082 4309114 4036155 3894787 3863099
17303 3863099 3980947 4299681 4862451 5782300 7271099 9664792 13151475 17536334 19971221
17294 19971221 20334275 22792462 27984065 31924865 30399459 29360998 30678006 28696117
17286 28696117 23570764 20741374 20516853 19587209 15797001 12491515 10953694 10977055 12530250
17277 12530250 15895026 21429204 27881659 30038890 28224442 24033011 19187211 16779382
17269 16779382 17118372 20052926 24369136 26845092 26825328 22368342 15845821 11025750
17261 11025750 8001141 6151920 5000919 4217700 3687043 3392567 3196014 3094037 3186957
17252 3186957 3560315 4233527 5360006 7228121 10179719 14453803 18744308 17749830 13061170
17243 13061170 9654765 8144561 8017802 9060118 11131028 12963651 11201786 7727575
17235 7727575 5217121 3684519 2760684 2151407 1771464 1524846 1343912 1173251 1015725
17226 1015725 867448 769982 684396 637870 632076 629259 586853 542303 488882 457545 460581 471093
17214 471093 405422 391239 406067 352362 313601 307839 288907 251030 265783 269852 226706 223272
17202 223272 250166 238331 200745 189419 168279 194456 211970 155420 144596 128088 106298
17191 106298 112486 105695 96025 100621 102133 86997 67713 78339 117184 169750 154437 138591
17179 138591 114809 122025 132365 116765 150442 146576 133989 106978 125732 134377 124742 162144
17167 162144 138040 66880 6953 5391 31691 27737 28423 48644 67152 43903 -14078 22452
17155 22452 51944 23479 -19312 42744 96053 86893 95126 87544 91217 66896 34597 7003
17143 7003 5714 -13330 260 -9816 13760 24937 18756 8029 39411 18609 10073 -17809
17131 -17809 -37518 -12352 -6233 1300 -11667 -13914 2384 31857 37982 797 13373 55743
17119 55743 39197 9840 58770 36963 -4891 24434 49906 33610 32097 13194 -20647 -39699
17107 -39699 -36553 -21667 1852 -1098 -7144 -19905 16306 1245 9449 63569 76789 57127
17095 57127 55633 55677 27029 21746 -2628 32384 34723 22813 18475 -14471 -51023 -39019 -21550
17082 -21550 11616 32280 5378 -9011 -5183 -26740 -37028 -50997 -19982 -24553 -31930 -29836
17070 -29836 -9545 -21238 -16420 -7396 18251 40593 87763 111328 50782 -15780 -11414 -4122
17058 -4122 -11831 -1436 1843 34093 33825 11979 6789 12119 60915 44463 26524 64107 86613
17045 86613 37890 -16379 8705 1513 12602 2112 -28722 2444 36554 -2109 -251 22988
17033 22988 36859 40563 15110 36401 61614 79835 38027 31320 69443 48962 42178 68857
17021 68857 30410 51318 64115 8385 -15453 -35050 -34256 -12235 18286 55948 34120 17963
17009 17963 1340 39538 46407 23770 25910 45415 17574 -13129 -43675 -54406 -20433 -6
16997 -6 89 3709 14644 28017 51401 9018 11511 -4903 -35506 -22698 -1790 10556 -33656
16984 -33656 -44101 -13601 -1943 10549 7996 11224 -5445 -32334 -60878 -44322 -48448 -10748
16972 -10748 38362 22584 -33837 -36760 -11603 22680 36123 23842 3370 -12208 -24490 -40773
16960 -40773 -47210 -65019 -42734 24452 38297 22520 33104 49703 2166 -10936 41753 25489
16948 25489 -15759 -425 -9764 21854 32099 32633 6315 13751 9111 20889 6871 2381 13685
16935 13685 -15132 -17741 4101 -12592 -54876 -98287 -71345 -49607 -12128 -7839 -17626 -33888
16923 -33888 -33772 -34208 -30905 -50275 -40360 -54783 -42818 -64613 -50030 -14151 -26601 -76385 -70930
16910 -70930 -40937 -5624 -3697 -34874 -70589 -62694 -27174 -17672 -38206 -31374 17287 19005 24475
16897 24475 47786 49896 44114 32809 4185 -19680 21177 21112 -20353 -6808 -54680 -67075 -39583
16884 -39583 -15340 -12588 11488 40127 12702 -39464 -69240 -51689 -44770 -37587 -12130 -1064
16872 -1064 -11130 -5041 -37641 -27496 -20210 -37429 -62062 -56891 -16960 -4944 -1625 -42742 -74136
16859 -74136 -93637 -111187 -73920 -27852 -4673 -40623 -44857 -62115 -65838 -28990 -27577 36
16847 36 -20835 -71708 -53601 -36909 -30156 -7151 48692 6804 -32143 -48664 -55560 -73583 -57026
16834 -57026 10527 35221 69421 131191 197357 257120 292264 261929 237453 212420 209043 223201
16822 223201 210897 227762 226797 179898 171410 141880 47946 24234 -10992 -40786 -28730 -48911
16810 -48911 14744 43831 30392 21883 50313 38235 33516 62762 32766 70575 72772 3609
16798 3609 -43353 -19831 -2580 1355 -151 -15644 14890 -1820 10836 5172 -8258 13907
16786 13907 49939 83816 89906 114931 129999 160111 221270 291585 266781 217662 198290 216098
16774 216098 287271 297088 257223 226676 193879 191831 174525 133277 101299 65828 53832 76739
16762 76739 93066 67665 58089 19443 6544 -7475 -6310 -13418 7153 -6555 -10252 -9776 -41028
16749 -41028 -30526 16511 76471 36627 10140 -26706 -14614 -24700 -7855 -23258 -29529 19884
16737 19884 47687 39815 69811 91753 90193 132060 140463 100231 47295 50300 55445 71235 82799
16724 82799 59010 38322 -6184 -21767 -20777 -30378 -45351 -52610 -80813 -53162 -43157 -28113
16712 -28113 -75191 -81988 -63212 -33004 820 2924 -23820 -13617 -5366 9578 24253 22767
16700 22767 22721 2026 -30294 -88276 -83659 -67371 -40050 -17152 -16683 -23373 -8117 -27836 -19257
16687 -19257 -41670 -42310 -12575 14774 21699 22227 26627 6879 -18750 -38581 -48232 3795 18516
16674 18516 17321 23949 12524 -6791 8797 2439 24211 37974 5301 3704 -12996 9243
16662 9243 8141 -141 -13402 -48431 -43921 -21263 -21780 -73621 -76418 -23843 4184 12568 12358 12745
16648 12745 17882 9975 -30695 -36367 -55531 -30887 15865 15164 4612 15065 22402 30212 15327
16635 15327 -10553 -5955 -737 -6631 5189 33405 10627 -17065 -73725 -90103 -85182 -53114
16623 -53114 -183 25879 2506 -11761 -30917 -2566 23341 18847 38799 55786 37547 9803
16611 9803 28558 10037 -12396 -12345 -8507 -39184 -85578 -81240 -24222 -1712 -21887 -54650 -72502
16598 -72502 -93526 -66640 -36242 -26006 2716 42525 86835 75399 44078 13009 -8483 -1985
16586 -1985 -8497 17947 60174 70537 47952 -131 -2514 951 12495 4210 -5717 -28325 -40214
16573 -40214 -36506 -16443 -5005 -51842 -46143 -14112 -17334 8001 -7513 -41681 -15225 27787
16561 27787 47216 55306 41475 31653 -12789 -22433 -19545 -40720 -38752 -25239 -19633 -38447 -45618
16548 -45618 -26981 -30597 -89021 -92807 -85373 -73729 -22117 94 -6451 -18967 -59771 -46097
16536 -46097 -23020 4538 14281 -42560 -75453 -34819 1124 17728 -7772 -38038 -26608 16079
16524 16079 50740 76238 86469 70743 16299 -8090 959 22156 25865 10646 -37461 -38453
16512 -38453 -7062 -9374 -5511 27183 47152 20760 -26847 -47366 -5 25125 75856 69874
16500 69874 9171 2911 40141 41303 20395 11494 24993 34518 13445 14109 -40100 -49308 -23896
16487 -23896 -8494 4868 -13960 1059 48930 56025 65909 53767 -18103 -23422 591 -9552
16475 -9552 -62741 -39591 -18958 -20627 -9363 44693 66059 54286 588 -19472 -44215 -64536
16463 -64536 -83020 -64323 -59787 -23036 -71 23081 18859 -29068 -27413 -35951 -29405 -20103 21571
16450 21571 20954 -5767 -10856 -9340 31526 8166 11184 32407 51065 36566 22986 9348 20419
16437 20419 22996 25783 19241 -29340 -27046 -14404 -24297 -20933 -19877 -63333 -73309 -39177 -17517
16424 -17517 -7961 -16058 -12568 8682 -57479 -97144 -62945 -26269 -59159 -85212 -14442 40144
16412 40144 16100 13819 34800 19416 -10567 -70708 -69210 -12924 1978 -9256 -43533 -22261
16400 -22261 -19525 -9000 48078 66417 72820 52169 33492 24739 31772 4476 -11606 -7056 13585
16387 13585 33739 36172 38581 40550 37322 17083 17985 61068 43549 20221 7064 -43648 -46708
16374 -46708 -60182 -47496 -40723 -19872 -11352 -6739 19467 30099 21750 -10347 -24398 -2849
16362 -2849 -16467 -485 29221 18335 37439 64675 40120 -9614 -23679 -28075 -47553 -36024
16350 -36024 10002 -23852 -46976 -36028 15132 5588 16051 4239 -25164 -31052 -2837 3106
16338 3106 -795 -11472 -14111 -8139 3433 18230 59879 31224 20574 -19239 -32073 -17657
16326 -17657 180 34018 18420 -19523 7390 4024 -7041 5136 -33108 2775 -19786 -46103
16314 -46103 -65726 -69657 -32067 21069 57313 50473 39520 29083 35533 12127 -7132 -2411
16302 -2411 -40435 -75992 -22060 -8656 -2217 31085 11507 15182 27975 3770 -27052 -9997
16290 -9997 -22982 -15588 5282 7833 -2657 -6692 1748 29694 24571 -10404 -41238 -38580 -1942
16277 -1942 -32356 -48700 -29242 23962 21576 -30580 -48221 -16389 -1282 4655 30315 17197
16265 17197 -4176 2202 -16412 -24553 597 30722 35312 33126 26147 58421 76086 9901 6774
16252 6774 18033 19760 10173 32420 65248 58910 3040 23493 11802 11338 10078 8455 -17332
16239 -17332 -62229 -57150 6194 58706 42748 25575 36477 41291 44715 40966 44518 60125 33777
16226 33777 23781 -15080 -52897 -25643 -17835 -1977 33796 44276 39551 34076 35022 8433 -4542
16213 -4542 11970 46503 22412 -9434 -6476 -4311 -5238 -34247 -46092 -29610 -25484 -23426 -20764
16200 -20764 -16032 -7540 7946 28020 24625 50548 19981 -34230 -31269 -45331 -36049 18257 37298
16187 37298 28636 55775 82036 40263 26289 41393 19207 30713 21903 -12642 7513 9811
16175 9811 37054 51800 39364 15631 752 38980 56252 53991 26491 41878 29811 12310
16163 12310 22066 -14972 -19625 11004 9516 -31327 9863 31248 30026 9625 -1371 -6223 26588
16150 26588 -300 -13995 4787 -18178 -55367 -55838 -5705 30156 39764 16561 -22497 -20453
16138 -20453 14356 38933 9723 -11787 -41979 -51086 -2880 34810 45691 -21551 23593 31264
16126 31264 8527 2822 -35087 -40057 15512 31888 19850 19870 23582 32727 67289 63489 51608
16113 51608 -5376 -19929 -54242 -8057 36296 20290 -30051 -30034 10366 5130 2018 -23473 -21056
16100 -21056 -35480 -54640 -72259 -57160 -85353 -79246 -34793 7430 15936 7638 -27887 -15655
16088 -15655 1674 22091 -2000 -5818 -1678 22409 53928 64834 48034 30713 -8468 -10117
16076 -10117 -18305 -509 52326 41440 -9733 -49342 -23843 -23893 -16992 -8297 -35586 -44930 -64470
16063 -64470 -53102 -19310 -3569 -21542 -39831 -73207 -57383 -17943 9489 -4507 360 174
16051 174 14317 16159 4445 -9657 -5982 -35415 -49210 -33502 18072 43413 51526 54847 53161
16038 53161 69838 85212 64685 43877 70190 101417 91653 94615 34670 -32929 -6047 30489
16026 30489 29856 16530 2895 4179 40350 60522 55491 81723 59197 4116 -6598 -2526 10970
16013 10970 2799 -8236 -17176 -273 5104 7528 46039 92800 90548 76492 70145 103746 88518
16000 88518 56880 84236 43288 62808 64504 48757 54018 81417 77815 45029 30355 969
15988 969 -25095 -31529 -24138 9029 6994 7854 24564 40732 21782 -1333 10856 -7556 -3391
15975 -3391 -192 24820 -12266 -42741 -13990 -165 8670 -19548 -54516 -1681 28177 6659
15963 6659 22745 46245 14147 -51857 -17030 11035 31723 13906 -45476 -70280 -54724 -54220
15951 -54220 -43320 -2602 -7203 -19562 -39928 -44552 -28499 -45654 -85891 -59735 13494 14600
15939 14600 -25785 -52328 -53284 -24191 4585 -24619 -17236 -25200 -39997 -32703 -14909 824 16719
15926 16719 -4222 39171 37596 5912 12226 -21573 -50530 -46807 -33745 -30813 6374 19468
15914 19468 3176 8547 13318 12932 36568 36704 24679 77972 53972 36049 71400 105401 85972
15901 85972 18571 -26577 -49769 -55120 -36317 -33107 -55313 -94380 -86839 -56021 -13867 16921
15889 16921 51478 58243 36772 -13962 25655 31856 7647 27721 -2365 -8289 3950 6419
15877 6419 -37785 -21642 7319 -37032 -55613 -44093 -47065 -36152 -34918 -52325 -36506 -3615
15865 -3615 -14304 8388 4160 2548 13883 9558 -671 2411 28112 20090 -14271 -56892 -59813
15852 -59813 -50149 -41192 -11442 34521 77139 93941 29153 60717 118119 124859 76038 48625
15840 48625 95185 59669 -6870 2607 29903 46005 53596 42290 5531 -2885 -35100 -27985
15828 -27985 11483 38939 29807 30748 41972 75622 50959 22158 -1535 6445 18214 43268
15816 43268 15407 4498 -31160 -31731 -9136 4918 40174 85649 97841 42804 61373 45826
15804 45826 -8919 -30243 -49402 -43088 -22295 21581 64112 57233 24787 30226 50237 55215
15792 55215 44666 57547 58240 40958 21178 19110 20017 29759 42312 67518 103296 75932 43446
15779 43446 31329 13645 43136 26526 -12504 -24266 -57063 -25019 -17162 -31719 -50242 -13005
15767 -13005 -16984 10562 3973 20623 33872 55398 23485 -27223 -20104 49991 37830 -4845
15755 -4845 -53041 -27533 27558 28344 55983 40742 48114 42521 60453 48224 64601 75871 35157
15742 35157 59985 34257 -22429 -53836 -41163 -42603 -12438 -3849 -45827 -76610 -69926 -91557
15730 -91557 -94774 -69758 -23229 -21282 -38963 -68117 -71915 -57219 -23524 -45747 -53635 -35986
15718 -35986 -23959 1540 -58057 -78686 -55917 -30595 14961 30704 -2955 -37666 -25096 -49922
15706 -49922 -35389 23240 32438 7668 -8083 10516 -1870 8113 18795 6228 5350 40851
15694 40851 43795 40250 65660 84355 91986 100927 105676 62334 51230 53556 32836 -10859 -13778
15681 -13778 4841 5850 -7369 -17312 18770 46678 81193 87241 61931 -1834 -14433 25355
15669 25355 33763 18182 -18066 -22538 17131 11338 -8153 2005 89743 120538 91623 87605
15657 87605 46997 43443 47618 52575 57450 35790 38407 75997 112857 61381 7989 -5412 -8109
15644 -8109 -23789 -33680 -35226 -45695 -76525 -75965 -60057 -18493 23078 23971 4947 -36740 -25235
15631 -25235 -3441 -19403 -4750 466 57415 50814 26224 51633 65417 64493 12554 -9202
15619 -9202 8340 41844 12050 18033 72528 55641 34287 39292 22137 21492 47214 19174 18777
15606 18777 10247 50943 111634 69379 19628 -19042 -11678 37621 65260 59527 52920 40011
15594 40011 33404 61166 37466 14459 12078 22643 76768 87285 98608 93674 118173 114488
15582 114488 98424 110345 81323 53453 47744 47432 48181 55113 46507 14890 18217 51070 48972
15569 48972 22193 -27158 -89968 -88522 -59601 -33137 -20934 -20814 -12193 3154 14142 4429 3032
15556 3032 17576 39265 93295 55553 -3720 -18534 6487 46545 58506 65394 39141 23678
15544 23678 30686 69279 61314 46851 26794 47711 36250 21102 46284 59331 30827 31309
15532 31309 20340 14569 18523 23656 64028 78385 49195 46978 62292 85188 81029 62159 34050
15519 34050 27674 58059 27983 19451 27750 76773 66932 23042 17957 14005 13029 45945 115011
15506 115011 146484 157298 120039 71659 32802 45584 34571 17867 87893 123689 88177
15495 88177 81062 85827 57444 45289 33090 14925 10205 28744 68636 69720 84082 117279
15483 117279 149175 118206 103326 88959 70883 11207 13245 59067 106078 120610 70932 52759
15471 52759 97855 58040 22139 -14065 -24685 -19285 22845 18062 30221 96431 142771 111736
15459 111736 62324 60564 75452 110320 111382 109548 101154 93447 68366 46603 42431 69102 49099
15446 49099 3889 -41142 -35328 -52139 -43882 32338 59588 87186 95363 78312 65323 46182
15434 46182 34022 41609 83415 58970 36173 55711 100020 126308 141460 177326 129776 120870
15422 120870 147677 164128 151521 117734 99122 130763 71340 28362 29530 38653 69653 61344
15410 61344 35470 1665 15458 57557 47884 56493 99641 120805 142912 125227 110369 138986
15398 138986 154501 175790 170402 118975 80425 50527 49087 68707 74160 31651 20439 77576
15386 77576 87464 41769 39170 74794 79834 60416 61933 65743 36129 63791 87361 60471 28550
15373 28550 58928 84175 78595 78214 100576 97834 60068 62624 59446 71135 111704 81583 78769
15360 78769 78003 78872 86552 113403 99630 106886 92850 107604 128936 140556 165214 212470 233682
15347 233682 162727 140559 151469 124074 101719 102516 101723 62740 70478 41661 24188 -8953
15335 -8953 -10030 36088 85948 67151 72668 86237 79740 48700 38071 43862 24503 53507 121069
15322 121069 77966 66902 58668 90198 98661 80306 58096 86762 134753 148669 174283 205071
15310 205071 185616 156840 147558 157905 96518 66029 60580 80032 111769 100042 98374 119472
15298 119472 142973 156911 176318 160996 110917 99745 125817 133081 123061 101423 115404 161838
15286 161838 146332 101575 97985 133013 170029 176051 144795 153788 135018 135815 157644 205623
15274 205623 216390 160489 141945 120644 110175 95268 94989 116473 149269 147712 141827 139697
15262 139697 149787 146194 166074 186953 161999 104834 113458 93628 93913 149722 170726 179495
15250 179495 206438 221571 178874 151781 154652 153490 110024 88463 125416 125382 151023 198618
15238 198618 227897 173598 141430 161400 177670 162156 181503 218337 228282 189971 155397 145883
15226 145883 118762 117880 160932 168735 178054 233125 220314 200555 232751 218852 162522 185370
15214 185370 236271 280023 303358 286785 233825 229878 224876 213099 221826 221422 214357 215817 204372
15201 204372 207355 194985 179407 233975 249051 239045 256905 232274 241748 220927 243882 275071
15189 275071 324818 322582 294321 251511 239200 260800 256940 236271 251490 288180 284463 306467
15177 306467 332905 317737 292086 310283 332262 289217 285807 330667 308549 301439 337151 331703
15165 331703 315978 299004 316821 331314 362583 378948 356173 323919 327989 276615 309481 284930
15153 284930 287222 294584 317460 361590 355950 368566 393804 380721 372581 383519 387176 362844
15141 362844 347483 363024 425179 459596 474193 418653 348861 342048 330114 334329 373971 395808
15129 395808 391699 386204 414268 442822 428056 428553 432573 391135 389392 431537 446889 419006 437158
15116 437158 430562 494039 485575 456274 480389 479051 462923 491440 535234 532896 497455 491221
15104 491221 486482 497824 554714 528764 536697 533147 547229 566466 607400 617745 638346 625278
15092 625278 609779 629798 688577 715614 720940 753656 777103 759310 727865 674195 690983 717743
15080 717743 698295 664007 667476 737245 785526 777091 739497 716748 737667 732396 778592 805829
15068 805829 809489 799143 824297 858959 912194 919542 923594 933904 910881 948978 999600 983292
15056 983292 952837 987861 961025 981859 990384 998284 1051794 1110938 1089366 1096970 1170213 1154578
15044 1154578 1173469 1181321 1232773 1291444 1295961 1249197 1271443 1335776 1350402 1405385 1428877 1443115
15032 1443115 1489589 1517612 1504302 1540050 1580860 1608221 1621873 1685324 1716407 1724183 1729195 1787660
15020 1787660 1857368 1885568 1953890 2011011 2037333 2041833 2063129 2099361 2145968 2164695 2213752
15009 2213752 2281749 2330790 2373200 2446531 2486703 2553257 2632388 2680082 2761971 2875693 2948676
14998 2948676 2995250 3048694 3086803 3135482 3218819 3297043 3425950 3540830 3635032 3700760 3845446
14987 3845446 3996915 4127045 4215115 4294600 4447139 4608829 4740155 4860637 4965604 5083005
14977 5083005 5294803 5539566 5695956 5844195 6073424 6312195 6502906 6675521 6895080
14968 6895080 7153783 7356772 7618647 7925222 8194820 8436961 8713822 9065340 9461281
14959 9461281 9835769 10238284 10583671 10954989 11295892 11690581 12118862 12557377 13025462
14950 13025462 13454848 13925136 14381111 14854167 15301484 15745839 16192296 16690208 17187168
14941 17187168 17672565 18124342 18552739 18939504 19258676 19623978 19979011 20286245 20512620
14932 20512620 20667867 20807428 20908130 20949288 20953039 20884841 20755007 20607586 20376361 20143891
14922 20143891 19859234 19508411 19154859 18759380 18332452 17891444 17416104 16990394 16586782
14913 16586782 16106780 15621351 15135992 14652002 14174805 13733371 13323437 12866152 12450797
14904 12450797 12059585 11667351 11268542 10870051 10497231 10148291 9792604 9406394 9048851
14895 9048851 8738580 8467192 8179934 7897194 7677269 7439195 7166946 6883412 6661613
14886 6661613 6474116 6252593 6058352 5893354 5738314 5617681 5476144 5288160 5111004
14877 5111004 4962671 4822895 4736788 4639776 4510535 4373773 4268666 4076369 3928715 3840606
14867 3840606 3737609 3639206 3510834 3465194 3418814 3276638 3162603 3070895 2945608 2881595
14857 2881595 2846067 2800896 2743856 2669673 2589175 2523748 2494783 2451468 2393815 2313965 2283380
14846 2283380 2273313 2260119 2234689 2205161 2112926 2066092 2009800 1975556 1974566 1956825 1897577 1844033
14834 1844033 1797903 1764941 1732658 1645728 1627016 1604551 1571162 1535433 1499967 1476916 1476550 1481301
14822 1481301 1449820 1404685 1358417 1340769 1349996 1360032 1308358 1250821 1205441 1194625 1190819 1202574
14810 1202574 1198289 1174337 1156838 1114955 1084616 1038309 990438 974591 1023068 1023628 994843 1017141
14798 1017141 989741 938658 886431 873784 866213 841193 815434 856311 891285 912118 894902
14787 894902 812041 762104 801777 828073 846802 803487 775256 776650 761429 747223 725490 737329
14775 737329 718888 664117 630812 631530 655410 693853 642630 630383 663367 692292 716871 717807
14763 717807 663025 644494 621684 586407 575572 575917 557225 509018 503327 549371 527531 461643
14751 461643 433911 462840 525352 547677 551753 549529 522617 511202 467928 472859 534633 502592
14739 502592 464979 437060 436065 431164 398708 407652 438690 481011 465970 419993 369483 372520
14727 372520 398782 425831 411958 407947 433660 452718 448557 463088 407302 333962 312253 345659
14715 345659 377716 368517 351964 355205 329120 335958 347382 367741 331075 344794 346690 353828
14703 353828 367994 373940 356288 355359 327039 296570 298817 249173 262457 296750 318689 334800
14691 334800 336225 321292 306566 272073 274555 259362 265823 295031 272354 278408 329408 370040
14679 370040 337811 271483 278890 288415 271317 287869 300261 278148 215406 208038 223481 248691
14667 248691 262329 296756 309048 303291 241079 182180 182003 177079 196744 222535 227764 248521
14655 248521 231154 208343 197285 196762 227417 235145 224223 238449 229373 204711 219153 239648
14643 239648 284506 253437 197945 186937 170884 163651 187738 223135 250714 270007 269429 267543
14631 267543 224697 211998 228573 183155 165231 210906 243586 199436 182759 185868 167760 149852
14619 149852 130712 109333 145345 196760 207902 202959 205531 203411 206000 179097 166054 166721 167800
14606 167800 162884 143744 178741 209366 199168 198740 184574 151423 138736 112096 123203 111434
14594 111434 82937 89584 107994 137818 134668 126121 132180 116925 108382 90492 100512 136383
14582 136383 108146 98728 96492 125539 130487 118126 134998 171084 182180 173275 156845 162128
14570 162128 168587 168428 139823 112630 147596 184134 197866 183761 127078 103640 101102 122428
14558 122428 115581 115900 76780 29958 37886 100468 165783 144613 137911 151320 104126 46301
14546 46301 55547 87697 133953 115889 112347 63835 43794 41958 55876 47948 48010 55269 79978
14533 79978 87899 36547 5095 30162 89504 134033 117744 102970 77208 57161 57865 74550
14521 74550 87801 59105 61877 69581 121061 150619 133240 66455 74106 67200 80993 70035
14509 70035 77371 107947 84692 117343 141820 151211 161082 144463 168764 205336 199683 155684
14497 155684 114333 89878 48387 32446 45806 44423 44208 81489 85823 120356 82165 50006
14485 50006 18176 50117 126861 122309 65600 68028 133254 179434 142342 141160 171049 133108
14473 133108 72812 32743 36487 71952 54252 28238 67193 79084 44549 35514 81528 81587
14461 81587 79241 101862 63003 4195 10972 31272 19278 63592 57478 47491 38176 63144 61998
14448 61998 26477 -33159 -32153 -25890 3801 5882 -24960 -15817 -2595 3686 25861 29442 28182
14435 28182 15173 -9515 -6534 36029 57185 63551 60334 65501 84082 44583 69676 50929
14423 50929 -12075 -19838 11122 38934 87895 62556 8704 -11629 56690 120192 163959 169971
14411 169971 127770 110663 73579 68083 71193 74204 42131 -8201 -22961 -15408 -3629 -2357
14399 -2357 -12460 69879 92777 39915 281 4392 9350 44058 56006 32910 32261 -258 22516
14386 22516 51310 43157 24896 25340 50536 58256 46645 33344 17712 29349 50968 21560
14374 21560 11173 48589 78128 59072 62010 51287 26316 -17343 19445 5710 -6724 -37059
14362 -37059 -41547 -26403 20362 21886 27018 64270 46741 61662 93210 125028 138006 111111
14350 111111 62151 68438 75875 49311 27744 23283 22508 -21802 -44294 -23118 -13101 -4363 26347
14337 26347 20390 17980 43481 75728 83730 64763 42474 39487 13596 -19688 4113 16324
14325 16324 27421 18016 848 -29226 -33010 -2568 25016 -12697 -20219 -2604 6758 -15145
14313 -15145 -26126 5253 62358 91678 105796 87348 83323 72363 103559 85749 43126 12892
14301 12892 -12673 -2131 18926 27883 22108 12033 -2941 9289 43910 41006 38587 38673 68619
14288 68619 80154 43281 -30868 -44246 -929 9971 32744 23023 -4962 -40861 24853 50981
14276 50981 -8536 -24377 -42707 -61927 -37206 42071 73696 54327 70255 87897 63917 41210
14264 41210 56912 58654 73137 38350 24412 50012 18919 -19274 -11017 -5439 8640 10363
14252 10363 39709 -8410 -29735 -34944 -25214 -47035 -86871 -91624 -45416 6110 19386 15994
14240 15994 47512 86060 49904 39955 50184 49153 27538 3230 -6973 1190 37631 74482
14228 74482 97675 132942 83692 653 14737 59282 41476 17126 17272 29733 19719 20993
14216 20993 42849 53112 31292 -3779 4958 -7273 -17214 -2816 13140 25067 9973 16241
14204 16241 34986 41960 -13666 -48813 -28334 19364 57555 40359 -29926 -54626 -45654 -27364
14192 -27364 -6988 -16351 -20878 52052 91629 52595 4058 15618 -4615 -22632 -3776 58304
14180 58304 67260 72058 41156 5064 -16309 -66742 -41120 25873 67422 40375 22697 41355
14168 41355 36112 23361 -748 -20931 -65846 -28105 -45492 -36694 9043 69780 110838 78261
14156 78261 86284 81177 58785 16339 -40343 -51977 -41962 -9071 36332 83033 107760 82704
14144 82704 33961 10359 9549 43357 12748 14625 55638 90636 83156 65007 62486 67622 41721
14131 41721 7779 -3609 47681 70453 59252 39076 2413 -3495 -14729 28041 29448 59100
14119 59100 39489 15644 46402 124345 103516 30564 -689 31081 69748 88605 61658 59234
14107 59234 79596 55884 68841 76678 93138 74467 55224 5279 17136 48786 21796 -3266
14095 -3266 2141 33222 11574 -9793 3703 -21033 -40145 31165 56034 90913 80987 50444
14083 50444 73203 96861 82934 39510 30365 -4570 8678 34993 60531 89840 65088 32123
14071 32123 18083 37564 74624 100580 103555 74746 50525 27401 52253 53203 67686 85526
14059 85526 85152 41140 31962 47487 71107 78283 61457 49720 7620 -20866 -51211 -43802 4193
14046 4193 17653 14453 9695 -27 -51986 -65175 -44375 4630 28589 -8532 -41098 4951
14034 4951 5606 32813 37055 21295 -14811 -23833 -47949 -73031 -58844 -282 21786 -1360 25655
14021 25655 21821 20591 31382 8445 -24067 -29433 -17381 -29432 -27456 -35334 -26270 9032 22754
14008 22754 40314 15190 -16325 11854 65959 49369 17804 -26684 -31029 -40666 -45160 -61169
13996 -61169 -15752 12743 -8233 5416 21082 5956 -31647 -47377 -66278 -42800 -16897 -47393
13984 -47393 -48167 -33141 -21196 -15714 -29940 -35128 -35640 -10 -3857 -28790 -18227 -7534 -35646
13971 -35646 -52873 16508 7721 -29091 -24546 -45875 -45282 -33854 -43814 -36640 -15702 28351 20844
13958 20844 314 -7554 34357 -750 -20604 -9575 27067 15870 -18128 -26942 -15289 -4905
13946 -4905 24997 -26713 -76157 -34420 -25181 -24185 -40388 -28982 5613 -11564 -319 61141
13934 61141 98007 85442 72608 35262 53201 65135 57814 55075 63756 45255 57636 76672
13922 76672 85737 103484 132054 128313 97004 39139 -33084 -42991 -49430 -34555 -12722 7201
13910 7201 -940 -866 -14298 -12001 2136 9668 28579 21104 31524 40286 35554 4892 46708 49650
13896 49650 32880 -13463 -40868 -46623 -10358 -2496 6550 1328 -10367 33827 41088 36583 61656
13883 61656 100500 84366 28040 15760 44487 59195 69040 2442 -36858 -19290 -1968 22058
13871 22058 41652 11885 -25132 -53655 -45056 -25743 9201 31796 52077 12839 -2301 2425
13859 2425 29056 17537 10916 32986 41637 5736 2852 35796 17471 24364 -2280 5900 -17781
13846 -17781 -1123 -26210 -21753 -27540 -28287 -74169 -104633 -116564 -113568 -81763 -49998 -14043 -5538
13833 -5538 -25651 -22559 -56763 -41410 10466 69479 46771 39130 -16091 -15250 16337 5163 4113
13820 4113 -21375 -37388 -14212 26663 6635 -46644 -45880 -29934 -23374 -27644 4852 -8731 -16327
13807 -16327 -9495 -12572 -16218 13996 2266 3741 -12791 28794 10724 1990 5811 -572 18138
13794 18138 35755 22331 14660 18453 42866 2634 28423 25556 24642 42105 71108 71505 57539
13781 57539 12153 -14959 -26968 24714 54051 31525 10625 5014 34560 24465 -9218 14530
13769 14530 4790 -15556 17045 55597 16604 -9359 -53231 -53994 -49690 -30996 -19173 12764
13757 12764 25577 53814 45027 35508 8697 30258 36782 22466 41028 33450 35590 40744 21939
13744 21939 438 16327 -2088 -39135 -45669 -45700 -24139 20040 12089 -29115 -21085 -40351 -57152
13731 -57152 -39830 -18031 -44884 -18295 -14830 4076 57993 11999 15531 54451 93177 119624
13719 119624 77217 41743 5392 -25235 -40452 -58708 -87575 -38469 -18560 -52709 -33685
13708 -33685 7895 18264 16371 -17684 -23615 -30305 -16049 -57321 -60545 -8010 10360 -45490
13696 -45490 -77519 -86110 -50045 -28596 -23500 -11754 3958 20687 10418 44931 37791 28930
13684 28930 45534 8804 -33266 -18442 6823 1290 1020 50894 38675 45935 60872 26487
13672 26487 12366 -9120 -21661 -24611 -4476 -24258 -34951 -21837 -2653 4128 -18958 -36962
13660 -36962 -66547 -90341 -76474 -41294 -61333 -56927 -45994 -53383 -54908 -24228 19155 58227
13648 58227 21913 -30989 5751 37976 28174 -7412 -20838 925 6209 -2365 5016 20795
13636 20795 -16518 2568 9525 -1950 -33249 -17882 11931 35850 39558 30643 67820 72217
13624 72217 6509 -8445 21789 19939 36285 70387 43708 4398 30660 63406 39996 8210
13612 8210 32409 -21568 -75913 -66299 -39299 -9623 19217 35093 10830 25222 11078 -18342
13600 -18342 -30708 -56326 -38205 -1888 40727 55836 30534 6437 -6756 -22105 -32285 -21085
13588 -21085 3460 36631 39741 18139 12951 -15813 -3289 -29023 -33757 36070 68933 27546
13576 27546 -8934 -28468 -55667 -54833 -8826 37486 -10415 -71330 -73985 -67158 -65794 -15007 -49058
13563 -49058 -94377 -76338 -68442 -25240 44839 86900 46462 -15284 -54928 -75881 -69100 -49118
13551 -49118 -48424 -58910 -18132 13243 27310 3610 -20086 -23953 13985 39999 5438 -63135
13539 -63135 -46412 -29807 -20236 -25705 -24068 -6587 20033 -6269 -56968 -99792 -50347 -50180 -53858
13526 -53858 -75243 -82860 -26954 48854 70333 87457 56998 9558 22777 36042 8920 1142
13514 1142 4440 -33434 -8830 -901 -6059 -6100 11509 34767 8481 -12969 10423 7542 -19754
13501 -19754 -22566 9294 30989 21953 -2138 31301 65729 99411 95196 16501 -17575 -2389
13489 -2389 -25263 -49322 -77145 -71714 -37824 -16126 -44028 -71433 -37967 -15308 -37918 -45365
13477 -45365 -36063 -32389 -5003 16914 -5483 -59765 -68939 -75803 -24294 -1896 -36021 -45621 -38920
13464 -38920 -28814 -34093 -19614 -26489 7836 -11017 -30718 -15925 -39426 -60777 -78235 -130841
13452 -130841 -142107 -93924 -77815 -109932 -117298 -63899 -30132 -35649 -5400 28319 9120 -15664
13440 -15664 -22160 -4641 -12872 -19340 -22008 15918 18844 2567 -29867 -34232 -73790 -72928 -26157
13427 -26157 28027 80715 106671 65782 31012 19542 31379 18678 7966 11312 23803 29735
13415 29735 36941 17869 5007 22252 -3707 -57067 -23286 20556 47503 34780 19644 18831
13403 18831 46984 22629 43877 44932 21332 29681 71571 89330 61714 7416 -2693 14231
13391 14231 18951 -3383 7252 29352 32431 -8581 11244 64971 37721 8196 32884 46920
13379 46920 44685 54168 18085 -3852 -45866 -74584 -42708 -1945 31406 32054 9384 172 -24562
13366 -24562 -42398 -42141 4476 7711 -9141 -14675 6197 -21834 -65240 -29836 8615 15457 754
13353 754 7712 -319 -22028 3287 33077 26181 -1498 -26263 -5072 20657 15581 -15528 -35609
13340 -35609 -28960 -14203 -8528 -21433 -21091 -27979 -29063 -15126 24932 46001 28633 9515 29351
13327 29351 37979 19750 -9708 -50422 -46383 -42939 -51255 -67441 -62939 -13884 5407 -19751 -25257
13314 -25257 -24205 8432 39379 23391 -4703 24692 41036 19922 -10149 -30137 -46702 -129
13302 -129 80131 86127 55850 31093 34565 32491 12781 8566 -36494 -35559 -11443 15731 -24708
13289 -24708 -9590 12391 -13935 -68600 -76584 -15516 -943 -2053 -10529 28547 57208 41719
13277 41719 -1974 -34662 3835 58641 76363 25153 -52037 -59649 -65457 -58375 -47244 -30896
13265 -30896 14503 7520 -11520 10596 24934 27802 20546 1530 18420 11933 -10115 33347
13253 33347 54188 61204 43925 23724 -7446 -36699 -29479 -64057 -60298 9821 18967 -10113
13241 -10113 -19102 -64044 -73569 -4367 26904 4147 14761 -15889 -12778 -29546 -15044 -28826
13229 -28826 -199 23026 17201 27297 30731 185 -22599 -24318 -21536 -55754 -80151 -55865
13217 -55865 -36708 -40636 -18408 -14430 -31215 -51607 -122204 -126252 -71100 -30389 -6020 -4841
13205 -4841 -26381 22168 33038 20935 -3145 -42190 -31295 1119 35598 39871 11641 -28268
13193 -28268 -29975 -32957 -53995 -40308 24808 32414 32294 35663 5563 -13387 -3420 -27591 -53420
13180 -53420 -72205 -87541 -59531 -65015 -82946 -81758 -42879 -37292 -19555 6611 11216 -21425
13168 -21425 -35938 -40472 -2794 15620 -3093 -25619 10785 57298 31785 -30544 -28204 -2796
13156 -2796 -40635 -65614 -37219 -29880 -33001 -21186 -33084 -37138 23305 43143 4258 -31586
13144 -31586 -53235 -19884 16511 19958 29706 30769 31620 5002 8489 26252 -1902 -40186 -6815
13131 -6815 19716 16188 29558 35730 28904 28949 31985 -992 28961 26848 15754 -3629 -26671
13118 -26671 -90093 -85654 -57702 -72709 -54915 -44102 -2387 3706 -17161 9108 40523 55819
13106 55819 48017 27044 -7710 6012 42611 19648 -10814 -17034 -23981 -53306 -59687 -66338 -70849
13093 -70849 -32302 8285 -16492 -24151 -14891 -11633 -7379 -4041 17638 30154 8037 -5853 -1432
13080 -1432 -48166 -39084 973 24152 23419 46825 54593 67230 41238 23952 2758 -30787 -34020
13067 -34020 -41170 -24071 10616 -16092 -20932 -15466 -18089 -17822 -20161 -40147 -39174 -30144 -14585 -24935
13053 -24935 -60133 -56251 -570 45641 34885 2733 -9090 31393 49904 3196 -12401 -5002
13041 -5002 3485 23080 27742 45707 55592 39786 -13207 -53426 -65595 -3527 11544 21966
13029 21966 11600 8362 -3169 -39918 -39544 -27921 -45848 -14660 -2057 -28210 -46782 -51874
13017 -51874 -53019 -32399 -66371 -97047 -95175 -68119 -47632 -52857 -74226 -86300 -75417 -86413
13005 -86413 -56041 -29934 -34060 -49111 -42976 -4245 6440 -16030 -42622 -72431 -57328 -57247 -51406
12992 -51406 -9429 26391 36067 8990 -38356 -71004 -42136 -22235 -22637 -23088 -22406 -25402 4902
12979 4902 -2318 8385 -11194 -26579 -12048 -5055 -2808 34225 31725 34824 -3854 -10285 -18591
12966 -18591 -26818 -54792 -71239 -94805 -110317 -108596 -69620 -18476 14334 1763 -3273 -6359
12954 -6359 8283 9132 -3555 -24550 -18656 -16667 16621 41365 10180 -20318 -20879 15241 9695
12941 9695 -9631 -10857 -29429 -10483 7776 -24779 24513 81373 80769 48023 17119 -12550
12929 -12550 -26922 -34331 -35851 -13324 4477 -8780 -1503 -26973 -67309 -65156 -45154 -28283
12917 -28283 -493 -7794 -17417 2368 -8150 -3251 -25098 -63197 -89692 -80338 -76633 -68798 -59816
12904 -59816 -51334 -76878 -79377 -31664 37949 41376 38719 -12599 -8108 9364 -2016 -39852 -18519
12891 -18519 -11990 -10691 -41629 -26988 -26272 -40870 1546 37599 35095 36537 1139 -46360 -65934
12878 -65934 -50740 -55075 -76848 -49612 -62922 -74257 -33543 -7765 -2090 13239 306 8109
12866 8109 12170 -5023 39668 34170 -16079 -4830 25551 28403 55548 53919 40371 -6875 -37725
12853 -37725 10993 2665 -27319 -6621 17040 29471 22917 -13956 -19767 5209 10557 -27556
12841 -27556 -40465 -8789 19708 7341 7225 -22658 -34815 -8723 -22536 -13293 -18480 3364
12829 3364 22266 -36075 -101178 -83279 -51889 -35690 -16136 550 24084 -1984 1512 40488
12817 40488 10292 -46491 -65820 -36683 -14901 -18464 -18067 7189 31939 88589 93028 54388
12805 54388 20829 -1708 -12738 5178 15444 2616 -38573 -46167 -36310 -76898 -56109 2076
12793 2076 15651 -1150 -11456 -26969 -24667 -7730 421 -9914 -22541 -43571 -69986 -35246
12781 -35246 -10133 -23411 -4379 -8885 -41182 -39416 -25722 11353 44662 58552 65524 71051
12769 71051 23166 34048 46640 27660 26425 8121 3709 6443 -27900 -62015 -74313 -55202
12757 -55202 -7946 -19501 -51555 -79964 -73279 -47756 -19185 18725 -12139 -24026 -19248 -53577
12745 -53577 -47307 19927 3016 -23011 -25972 -50356 -72952 -55919 -33742 18953 8288 -83
12733 -83 17698 26717 22878 -14268 -59103 -70138 -52527 -61722 -48395 10398 28718 10141 19404
12720 19404 8769 -3826 -26113 -18471 3520 7386 34875 20114 -18562 -42722 -34308 -17294
12708 -17294 -21192 -10035 -20867 -42357 -52665 -38781 -18084 7860 -25505 -49632 -39457 -32498
12696 -32498 -20388 -41011 -73213 -80275 -55021 -21978 -2298 15937 -5950 -21013 957 -18858
12684 -18858 -39596 -16129 1255 -20908 -67459 -10974 19764 9549 3359 -2195 13447 14796
12672 14796 -19516 -66514 -85767 -87548 -55904 -27990 -32823 -51432 -66194 -100179 -113814 -82881
12660 -82881 -68325 1491 33903 4235 -51551 -65517 -87022 -57249 -1932 -6920 -10227 -37325
12648 -37325 -38434 -25876 -13124 16957 7575 3395 -12383 35413 75289 49717 11665 -3418
12636 -3418 -29159 -20639 42043 58520 56404 24152 34852 16281 -18049 8343 36032 64234
12624 64234 50982 25052 -18321 -40651 -25950 -1492 -15172 4377 -17501 -51325 -52645 -22168
12612 -22168 -11500 -39980 -62292 -38625 -20775 -29685 -75041 -67662 15202 37593 2834 -27646
12600 -27646 -36674 -35302 -30547 8368 39282 43192 -2109 -54318 -64066 -20076 -33909 4279 -3789
12587 -3789 707 -17193 -6891 38713 6182 -67386 -38937 8524 12056 16319 -23615 -75016
12575 -75016 -99273 -51788 -56450 -39329 -29894 -14259 2058 11672 25063 21532 -3815 -2304 7650
12562 7650 -1157 -1816 -16272 -8433 21356 50938 72273 21676 -24761 -9119 -10047 9790 2989
12549 2989 1407 -11888 9430 47117 15907 5574 -24192 -29313 -11319 -33971 945 25345
12537 25345 49788 53414 -9931 -22833 -23505 -18797 -12814 -37181 8148 7088 33232 53432 45008
12524 45008 43558 58300 57410 41674 -10843 -41771 16755 43829 -4828 -44570 -62290 -43781
12512 -43781 -53523 -76725 -69354 -48665 -15479 -38114 -42805 -6018 330 -16553 -19647 -40590 -39738
12499 -39738 -47732 -53723 -18108 -14343 -8287 -31649 -49031 -58846 -39853 -36437 -23971 -29466 -65642
12486 -65642 -40367 12174 1679 -19413 -39107 -28279 -27734 -29933 -13461 -30798 -46747 -26593
12474 -26593 -34642 -45547 -20530 -7246 -42767 -70168 -73734 -108908 -125310 -103961 -88778 -107169
12462 -107169 -98055 -90653 -14850 6969 7991 36600 27895 5485 20730 15047 4815 -37317
12450 -37317 -66135 -64409 -54021 -41482 -42688 -19596 -43920 -42595 -40060 -76098 -54294 -13282
12438 -13282 -3344 -28925 -26869 7760 12258 9753 7762 -838 -28543 -56849 -49384 -31218 11345
12425 11345 -11423 -39891 -50361 -65385 -35851 -3449 -7630 -48653 -46464 -42592 -25274 -15840
12413 -15840 -22927 -61362 -70702 -30029 -40502 -41102 -39266 -30695 7663 30046 -3336 -11982 -12294
12400 -12294 65087 68862 31977 8550 15287 -5081 -67230 -47302 -84643 -57684 -46517 -86917
12388 -86917 -88179 -70569 -93342 -51707 -8199 16763 -12359 -45154 -9356 4518 -10383 -7391
12376 -7391 22119 22664 480 10221 288 -13099 -35500 -37251 9578 27266 36357 37498 15922
12363 15922 -17133 2861 546 -20269 -3218 14002 -22789 -53719 -54855 -56486 -28366 -27126
12351 -27126 -40070 -56472 -51865 -40315 -34939 12520 48053 54713 42751 44608 9574 -10379
12339 -10379 4926 -2389 -16543 21776 48968 23178 8227 -1598 7690 25254 -32556 -46604
12327 -46604 -15122 11103 -6837 -2022 63999 44517 14571 3913 19527 -16386 4164 -7425
12315 -7425 -6611 -3538 -20027 -54870 -79858 -81487 -20069 4407 550 -19392 -5754 407 23857
12302 23857 10254 11422 -19588 -28130 -32296 -35063 -53365 -90142 -50295 -10379 4299 6857 -33583
12289 -33583 8147 9002 11496 21591 18654 -10772 -31761 -32971 -19522 -22760 -52007 -8338 26644
12276 26644 12650 1622 11386 -15477 -22105 -2059 -17359 -60707 -84744 -91140 -104439 -77309
12264 -77309 -77461 -80630 -75412 -82030 -58023 -20727 -8332 -20695 -61539 -84949 -67338 -33272 -18860
12251 -18860 -19924 -6480 -17156 -23943 -37914 -127701 -100875 -19683 6053 -3610 -10388 26405
12239 26405 19287 4053 -59575 -61158 -58430 -25700 -23982 -67838 -2043 49075 60930 41614
12227 41614 6994 2047 -23380 -13532 -40799 -50507 -82263 -69623 -74475 -112291 -88630 -54764
12215 -54764 -63939 -37708 -28553 -36975 -38316 -4756 31926 12778 -13418 11158 2455 794 25830
12202 25830 69730 93688 85552 46820 14223 51029 80056 51653 8572 -18566 -51877 -64094
12190 -64094 29160 50030 23568 1955 -39335 -49891 -18751 -9331 -12230 -43796 -63421 -71802
12178 -71802 -93697 -58003 -32944 -52590 -57380 -11911 65573 64249 72554 107862 82815 27633
12166 27633 14498 -17404 -27273 -62654 -45710 613 22506 28655 12878 7071 13806 27565
12154 27565 11406 -23718 -13763 6787 24309 16830 2489 13708 -26259 -42606 13728 25556
12142 25556 19079 10844 31940 62986 36942 27886 11454 -21211 -32854 -7348 -42167 -35974
12130 -35974 -13081 17041 17853 -2378 -24600 -64030 -59153 -55192 -12986 -2300 7213 22149 49430
12117 49430 20490 24413 22386 5302 12317 13792 -47586 -27312 31893 9679 -26728 -69013
12105 -69013 -63672 -9425 -107 -20629 -59222 -91062 -100307 -101268 -73709 -42177 -46946 -21260 -20307
12092 -20307 -44620 -13085 -3882 9904 19708 45616 32794 30289 23418 14903 -47898 -92944 -101527
12079 -101527 -61985 -16824 -44082 -30325 15165 43505 36278 -12902 -24544 -28044 2691 9698
12067 9698 11170 -14158 -2896 7467 17779 -19241 -15525 8346 3415 -25581 -11664 -11571 -13896
12054 -13896 -31628 -71836 -76643 -59252 -62663 -48990 -38896 -57017 -69039 -127407 -111288 -80216
12042 -80216 -66362 -37093 -46682 -49964 -20205 -13112 583 -3421 -10917 -8091 7315 748 -20718
12029 -20718 3769 -1794 -37097 -59018 -27596 -21978 -32882 -22313 -32053 -29288 -62935 -77904
12017 -77904 -52461 -59183 -70919 -51948 -68712 -27446 13587 36096 33623 21892 18987 9535
12005 9535 38429 31547 17021 17476 -28270 -35470 -13776 -8033 -13914 -25410 -35640 -29881 -36992
11992 -36992 -10045 1528 -2566 29951 87692 34848 22356 -2081 -36924 -44203 -66289 -72132
11980 -72132 -79455 -83038 -52672 -17343 -37838 -56862 -36638 -12792 -15776 12359 -7681 -18928
11968 -18928 5205 49646 20655 -3291 -26744 -59496 -94080 -78006 -72531 -60339 -54346 -39379
11956 -39379 -41806 -59927 -44326 -9465 -18335 -29745 -34398 -24932 -19491 -32106 -38848 -40152 -36087
11943 -36087 3043 -2016 -6615 -47869 -49207 -46255 -45430 -42162 -77361 -69255 -33584 -39532 -46401 -37202
11929 -37202 -46260 -67155 -59433 -10411 37022 40804 18452 8612 -5136 -121 -1436 -322 -14646
11916 -14646 -24638 9712 17527 56469 76305 83478 65405 39542 14452 -41159 -48549 -49074 -43694
11903 -43694 -43598 -47871 -54828 -35539 -30811 -37490 -76743 -26665 -27607 -24558 8107 3075 17018 39283
11889 39283 15956 -29793 -61967 -68155 -52103 -51177 -62565 -50639 -30895 -31286 9492 16628 43293
11876 43293 62569 56642 34552 14669 -12800 7336 24495 27127 29184 20581 4892 14099 35248
11863 35248 89951 62175 22940 -17665 -43885 11772 42660 62110 32541 -29747 -86630 -120416
11851 -120416 -80291 -53396 -53126 -39731 -14526 34787 73011 97359 77405 8043 -20185 16298
11839 16298 19403 -5617 -18995 18616 34130 4764 10133 13171 -3819 10713 26845 12810
11827 12810 -6449 -30181 -14823 23477 14922 -14667 -434 47742 30197 15001 14151 57034
11815 57034 59590 -6091 -72485 -63007 -25146 30105 34475 35206 1536 -41100 -47286 -25577 -28717
11802 -28717 -10688 -17698 -53868 -62253 -83111 -33630 6082 34349 24041 9481 -33591 -23350
11790 -23350 7322 17382 8800 -16312 -8678 1796 14726 42746 32739 6322 30093 38768
11778 38768 31378 26267 -343 -82381 -63080 -15708 -25824 -46515 -37417 -24398 -30273 -15847
11766 -15847 -20092 -12389 24026 28367 12879 -35626 -38530 -40698 -58401 -83024 -29992 18287 -14742
11753 -14742 -24388 -15503 17227 38170 10165 -64910 -27099 118 -34048 -29431 -33540 -41356 -30401
11740 -30401 -75130 -71748 -80436 -40138 7534 -31151 -76886 -86509 -32947 -29831 -44374 -48870 -15833
11727 -15833 -5187 -12244 2075 -6658 -7485 -23420 -22373 -10881 -33127 -36001 -7499 560 -27091
11714 -27091 -9427 -11870 -1177 15115 -4718 -35136 12084 49715 71229 49867 19582 -9752
11702 -9752 -21768 -10658 13448 -6165 6580 -20845 256 27181 -28451 -76166 -60754 -81517
11690 -81517 -48054 -4285 18980 36475 33550 42802 79527 143563 119953 44090 -11197 18644
11678 18644 37491 28242 45353 24186 21294 5843 12222 65159 61608 30190 -7489 -18599
11666 -18599 -13020 9858 18903 19529 523 7313 -17375 -32047 -61879 -32093 -797 11654 38853
11653 38853 49940 -4519 -23140 -40625 -49040 -9859 -6767 -14747 -19766 -28764 -51321 -16796 31802
11640 31802 56828 45374 10907 -57165 -69115 -97803 -89145 -22668 41205 66082 38326 -6228
11628 -6228 -56611 -55997 -3537 22832 -15087 -64176 -72912 -71550 -67248 -47902 -21296 29708 20094
11615 20094 20875 -15055 -53863 -49815 -25505 -14608 -17342 -33308 -9457 25162 16765 21294 -2627
11602 -2627 -51163 -58307 6600 16009 7340 -14076 -20145 3734 -23084 -26506 -33837 -55081 -27597
11589 -27597 -43580 -64243 -89779 -86025 -77366 -82764 -45947 -35826 -10511 9565 1843 -54679
11577 -54679 -117205 -125897 -51909 -30774 -611 4113 -16222 -3355 5674 -15005 -44169 -61987
11565 -61987 -73828 -37894 -51496 -18589 -3989 -30413 -48383 -17578 -18763 -53541 -78725 -72016
11553 -72016 -58880 -69987 -50227 -7772 17922 8623 -12450 -16671 3745 -12311 -23973 -20221
11541 -20221 -28116 6123 11926 -129 -635 367 22798 10487 -34209 -53687 -32792 -30461 -61942
11528 -61942 -99858 -83273 -73040 -26155 17030 22415 32778 48844 60442 37875 -600 -2443
11516 -2443 -6877 -13710 -11205 -70650 -111817 -106586 -74507 -31255 -18606 -13170 17079 24653 53194
11503 53194 58645 8205 -6892 12320 23340 10145 -11337 -19414 -21239 8222 66460 42609
11491 42609 8442 6743 -21599 13090 31109 43442 15956 -24186 -49411 -31218 4077 31174
11479 31174 68000 82083 43535 16105 10486 17176 -6686 -12656 -3732 -6807 -47397 -35823 -22153
11466 -22153 -16728 24035 -21748 -56275 -59655 -62213 -97962 -78233 -49187 -44439 -39915 -38214 -45791
11453 -45791 -36376 -40558 -74700 -65850 -6520 27266 33502 11680 -2842 -17302 -28909 -49939
11441 -49939 -51760 -48968 -40179 -12661 -29289 -46376 -31508 -56076 -46318 3632 -11409 -1163
11429 -1163 -28441 -21265 26205 35777 -29000 -49567 -11802 -36632 -24881 8813 36821 30898
11417 30898 55039 73341 76925 117593 151437 164720 257568 426869 706042 1071348 1578876
11406 1578876 2068436 1950739 1301742 848321 570818 381595 260421 205286 144950 97751
11396 97751 80944 95065 88916 77308 90585 98002 84134 34074 37467 31349 10841 -17638
11384 -17638 -6822 17667 48504 22497 13076 46423 12702 3903 38409 30654 -677 5164
11372 5164 16618 13452 31612 10197 -13132 186 16590 23780 39338 52149 29755 -17630
11360 -17630 -10237 1547 -16537 -26651 -47107 -42234 -17145 22224 -174 -19486 -29575 -18617
11348 -18617 -17525 -4836 -20243 -13761 16856 32214 46451 53536 58800 54279 66257 48010 76006
11335 76006 91257 33677 -728 16333 25180 40410 55443 78859 121526 76459 55688 32055
11323 32055 -13182 -39807 -51436 -58282 -10928 7685 44415 46667 -6984 -47078 -8007 22428
11311 22428 32424 54314 42503 23459 34510 73852 112277 73433 -11486 -75884 -108138 -160232
11299 -160232 -125854 -101488 -87761 -71331 -19622 30907 35688 37019 21719 42753 -484 -18868
11287 -18868 670 20580 25971 19265 -4614 -15896 -10656 854 4041 18042 42541 19332
11275 19332 -534 -15434 -39180 -11572 21402 53593 70857 15384 16222 40601 41982 2497
11263 2497 -22487 1027 -3865 14121 14264 37301 73891 82766 153916 207422 230958 258171 260669
11250 260669 146213 98513 128489 87170 51183 35858 51325 -3446 -16349 6865 23050
11239 23050 11295 4584 -12390 -31486 -198 27826 24717 1908 14522 -1648 -5508 7558
11227 7558 -61080 -70697 -35478 -32671 -14462 -65204 -64699 -54164 -36359 -18121 -4121 32569 53611
11214 53611 81588 68808 87317 45274 17305 31193 32362 43609 56605 67455 93437 118968
11202 118968 94330 2618 2275 91616 133924 101340 83746 26385 14360 55809 38849 -9552
11190 -9552 -45356 -41940 -70452 -89267 -69092 -46742 -27783 7378 12581 -22383 -27044 -12274
11178 -12274 -1254 10347 48484 -6344 -41244 -48184 -35145 -3757 29569 -12207 -63743 -74294
11166 -74294 -49791 -36016 -41553 -59964 -71399 -64205 -56483 -8081 28492 -6390 -18788 -23575
11154 -23575 -9656 -11295 6051 8868 11726 48137 45837 59298 61644 66543 53318 55549 35501
11141 35501 50646 29690 16110 14679 18761 -4007 17282 41549 39953 44694 26185 19266 54050
11128 54050 98105 126497 160410 171495 128011 148521 137813 99824 85153 75608 84175 78334
11116 78334 34870 47698 70406 83307 95727 108707 99517 105422 139708 107067 110020 56338
11104 56338 76312 116961 115133 110667 116738 125089 127119 152453 124945 124125 107507 105834 128401
11091 128401 121436 125441 142995 153897 135655 153131 146416 122135 77897 51533 95064 121925
11079 121925 133586 158489 178971 189043 202692 194002 225705 238272 230409 227006 200772 221399
11067 221399 292661 267215 210103 192086 216202 242972 249116 244011 238147 247627 233357 240623
11055 240623 271489 326020 381187 375242 360174 426197 490157 553197 617427 628698 571725 568439
11043 568439 595851 622539 661077 733136 775158 789267 787778 776409 796472 862825 912050 990303
11031 990303 1088905 1191975 1315552 1431531 1574256 1783242 1972217 2261051 2679425 3330589
11021 3330589 4143026 4927361 4933978 4606470 4531784 4669522 4995775 5517660 6151284 6937175
11011 6937175 8023208 9356321 11039796 13212890 16211070 20489008 26246159 34872554
11003 34872554 48603122 71036071 108150846 167392240 256234776 369991890 402004325
10996 402004325 291262698 184921704 119866070 80819943 57027163 42289723 32732520
10989 32732520 26234726 21480351 17651042 14657208 12358602 10640862 9256363 8108284
10981 8108284 7173987 6460858 5888015 5395920 5109167 5042109 5116207 5440287 5554162 4869433
10971 4869433 4083726 3486036 3031635 2710680 2437519 2271342 2177157 2086546 1986019 1893148
10961 1893148 1791350 1712740 1593910 1488078 1381076 1280307 1219173 1168719 1144483 1152487
10951 1152487 1158835 1220940 1268284 1387163 1509109 1771365 2235133 2906728 3936601 5402119
10941 5402119 7330295 8514810 7282593 5223255 3643206 2679911 2085457 1661468 1364940
10932 1364940 1174681 1052532 911121 787680 693518 648382 661032 598824 558076 556669 539400
10921 539400 512790 547871 587930 595858 582555 560591 536024 500750 421740 379225 375753 324347
10909 324347 297534 315090 326424 316494 283428 264637 267659 263050 261524 266931 223065 215920 207815
10896 207815 143977 161927 221157 254155 214395 222512 186534 165010 233036 200623 158369 150354
10884 150354 162626 141414 144710 208721 206942 180329 175275 173905 229978 229860 210730 210620 194968
10871 194968 217783 190071 196662 199984 201032 204917 201022 156579 148684 155127 161386 175186 153991
10858 153991 207027 236906 219145 198633 199254 208337 210922 231121 204058 200640 200349 265574 294323
10845 294323 348853 433079 498290 602967 825909 1148017 1606127 2323489 3445151 5154808
10835 5154808 7258908 8166942 6492307 4384229 2951730 2071469 1450118 1055840 841225
10826 841225 712945 587892 497877 473713 425746 332403 273772 230316 184604 153464 94059
10815 94059 121206 120172 135635 188351 198113 230567 263966 270464 211945 155568 138629 136965
10803 136965 115545 115735 112124 88613 66785 33392 -3638 9987 62622 47289 -24255 -6756
10791 -6756 11878 -34450 -38866 -11574 835 16354 63884 10995 24116 54564 77582 69857
10779 69857 50138 45104 14869 9623 59863 97911 129823 140696 158303 84218 46879 24537
10767 24537 34813 51405 74032 58034 25457 43160 66644 54006 78478 131143 106166 98297
10755 98297 115026 95152 117738 130458 114914 89868 100731 147014 191554 169693 141442 132772
10743 132772 88247 68308 83255 94835 78209 75660 75712 69939 35962 28871 45738 46832 99304
10730 99304 98503 83660 94587 62361 59730 68572 84737 77185 110332 99116 81202 75111 122485
10717 122485 137375 111928 93301 40935 33965 43742 28540 37414 44132 4033 22570 61917
10705 61917 93485 109520 111361 104492 87577 93233 124955 147166 150081 189347 159868 131004
10693 131004 122945 29354 -47965 -80999 -32880 -11269 21927 11048 22208 63211 52615 34835
10681 34835 24906 66168 53258 36259 17471 28354 35817 58003 83131 88117 120547 127055
10669 127055 51472 26304 72229 89810 73484 105808 119313 59807 2831 43882 50013 46871
10657 46871 42642 47333 28766 6472 18305 31151 27815 22845 33079 9933 -8346 21643
10645 21643 44844 33336 45762 61763 46998 41592 63376 42938 5357 7947 15114 33908
10633 33908 -1259 -69614 -48391 -34703 6219 40148 39023 49621 37711 18671 22721 66942
10621 66942 76920 85042 111436 119456 108806 95314 131209 85973 54696 35695 21580 42019
10609 42019 77463 95445 70347 64289 80005 100079 128341 134690 117769 78748 43187 65825
10597 65825 93919 102185 126483 101157 86292 127292 174725 172793 239619 401412 630351 968955
10585 968955 1480235 2046053 2088764 1508874 1007410 669546 460673 314828 219670 147810
10575 147810 91157 82545 59127 16841 35928 48197 45817 67037 84063 79604 54954 81284
10563 81284 68835 62843 34176 29919 47177 55305 108427 106862 62523 38988 86596 48427
10551 48427 7825 29265 9864 -17242 20884 66169 64401 42414 45871 47309 64796 58835
10539 58835 55692 32492 58125 62042 67977 64350 76389 71819 44243 41532 97312 127784 109599
10526 109599 102570 126232 62728 43795 91398 89094 35565 -44561 -58015 -41751 -28952 -36092
10514 -36092 -39612 -52349 -63352 -67484 -36890 -18142 -80 -7512 -27638 -54667 -97128 -123930
10502 -123930 -95981 -37756 -19034 4512 59482 51512 -8968 -25088 -9308 -19572 3810 12973
10490 12973 -5934 10692 16273 -27787 -59573 -58437 -58551 -51991 -40102 -69320 -66290 -61615 -16436
10477 -16436 12432 23671 29389 587 3477 -13282 -27705 -30147 -14153 -9187 -32413 -44754
10465 -44754 -16469 51325 58263 19228 43234 71137 119754 146500 143685 139447 99877 54514
10453 54514 29209 76475 57944 -26192 -57254 -47710 -76167 -100751 -89813 -53202 -7759 -47817
10441 -47817 -75312 -50328 -19254 -30627 -36966 9983 57689 53864 -2676 -47700 -71969 -63199
10429 -63199 -60255 -25209 -32 -7161 7640 25716 -4120 -2520 -14537 24443 61621 68066
10417 68066 46130 21304 36041 32960 37510 52498 74019 46467 55180 16612 -7088 11682
10405 11682 24468 20750 43509 6380 -26252 -55946 -74995 -59253 35457 45636 -4995 -51648
10393 -51648 -48380 -20241 35827 49848 15836 11811 -13019 -49075 -35996 8941 9257 -2433
10381 -2433 -21585 -21853 13687 303 -24946 -50597 -58799 -4299 31167 16532 28163 4774
10369 4774 10479 5864 6795 35213 5628 -12338 -4507 -1876 2507 38107 48613 4668 -38918
10356 -38918 -11189 25820 82155 58943 2113 -17820 1327 -13581 -8378 28455 59610 86196
10344 86196 98860 88478 96562 93749 79608 65293 67565 65065 34040 14119 1786 -15811
10332 -15811 -56769 -73136 -55178 -8260 1652 -14592 -13886 55212 76378 89130 96629 38175
10320 38175 -31486 -42088 -38811 -78980 -103562 -94173 -18072 10453 -17668 536 6405 9160
10308 9160 2586 5132 28719 6199 -23597 -16608 5258 20560 30542 12079 -358 23159 24034
10295 24034 21827 -8499 -2856 47935 54468 32521 51113 42259 16964 -5241 -67985 -57244
10283 -57244 -35558 -29944 -13689 -3498 27170 22914 3542 41389 51983 16646 55174 95736
10271 95736 51294 52017 29304 2545 13288 27184 18114 50072 78269 60082 52618 39851
10259 39851 44634 24270 -40517 -65624 -60303 -26558 29384 18927 -2067 54750 72606 83509
10247 83509 64549 59917 28384 41526 -506 -38224 -34331 10805 15237 776 -55637 -14022
10235 -14022 -42522 -50479 -40267 -21812 12459 18663 6833 -30108 -38291 -38645 12240 49552 26980
10222 26980 25576 20904 11388 3328 78168 90652 62901 39142 37421 36096 7481 4870 1939
10209 1939 -11036 -13021 -47787 -54478 -19497 -14866 -13016 -201 11849 14709 20511 30840 20207
10196 20207 15234 4392 2682 -1921 30705 88779 89909 44798 10971 21574 23241 33490 40651
10183 40651 27692 -5949 -1148 32514 41205 39425 46746 67084 85094 97365 73341 -15311
10171 -15311 -3104 14187 20599 1579 16417 5604 24673 -35187 -44311 -65137 -45302 -4782
10159 -4782 -1676 -19405 -10244 -482 11022 27681 42485 12750 -9384 -42579 -43920 22193 45519
10146 45519 -637 12699 20235 43549 76257 78659 67120 51147 67410 19515 33988 13369
10134 13369 -14818 -32398 -18170 26809 47842 35569 40700 50381 27331 31693 53264 38551
10122 38551 20758 23797 21211 5258 -478 4808 13844 -2275 -28943 -29654 -49439 -69077 -68420
10109 -68420 -38190 2475 33318 19593 7029 5879 -554 18430 24096 34729 47179 54868
10097 54868 41663 -6394 -7370 -5267 -38661 -38368 268 26357 -13358 -30055 -25779 -38171 -17952
10084 -17952 -2765 7370 -42055 -55393 -54526 -36413 -11697 30610 16936 -8635 21988 72885
10072 72885 72934 43940 26692 -12664 16861 47668 37097 43679 43510 48877 68779 145951 199884
10059 199884 296369 446754 686269 1102039 1722766 2113844 1533623 866285 525706 402671
10049 402671 302696 211985 193243 209115 174813 128384 118260 129903 143287 95344 82246
10038 82246 48928 26452 21751 -5931 -20809 -23184 -28159 -29350 -53054 -54665 -63298 -57718 -21984
10025 -21984 -15489 -13332 31789 63000 72709 67072 59501 38021 41077 41117 24914 -17221 40243
10012 40243 72116 82056 55675 27987 34887 5676 -10422 -20453 -38929 -40559 14995 30355
10000 30355 48473 33823 20936 4447 9595 9974 -1305 -14811 -25103 -25228 -35549 -44163 -3143
9987 -3143 -9896 -48706 -61136 -14135 10439 6461 31330 57322 48732 46931 68002 59631 136
9974 136 -36524 -39892 -23739 -10230 -4383 -31081 -30135 -19494 34578 100236 63582 8422 -21561
9961 -21561 -45911 -79601 -83829 -57080 -7559 15310 -20808 -34300 -32176 -18873 -5442 -42600
9949 -42600 -39445 -50734 -65640 -74749 -36061 31176 64399 46849 60814 38016 20486 -10347
9937 -10347 -51810 -63349 -78650 -123108 -82286 -67400 -73754 -67785 -69430 -53737 17125 4690
9925 4690 8927 -6305 -16710 -16843 -18326 -3828 44013 97542 50854 14193 36321 39827 52753
9912 52753 53283 25726 39759 44479 27891 20704 9741 -14909 -3472 19765 36624 45644 59516
9899 59516 16105 791 57057 59054 12023 20481 66019 30425 -19218 18430 27947 11802
9887 11802 24097 45973 33478 12112 -24399 -20836 -20802 -20731 -267 29318 14305 13346 32060 48329
9873 48329 36944 7003 -42880 -24172 39956 62119 87778 104927 95594 68080 22258 34920
9861 34920 79693 126852 104038 73194 83445 100725 92963 80421 96299 83936 45484 47036
9849 47036 41448 50826 37629 -2288 -16893 6327 -193 -19506 -28648 -5460 -7032 -55174 -28271
9836 -28271 6497 -14578 -9546 11017 3833 31243 74149 59114 68416 67881 81909 78193 74500
9823 74500 84567 60536 9016 33799 42880 8753 45056 26261 13965 37189 68683 41935
9811 41935 53999 30529 2689 -9955 6238 51036 55126 19294 -15109 -33738 -45055 2762
9799 2762 32823 48786 47644 46373 45386 32126 43610 29466 26902 10034 -39675 -48065 -72896
9786 -72896 -65752 -62212 -29663 23592 -24483 -54447 -49050 -55815 -75167 -78636 -30008 22738 39031
9773 39031 31927 47863 26185 6666 11121 26850 5562 -25499 -20963 12923 57534 45205
9761 45205 8153 -16788 -30302 -36021 -46963 -39260 -24544 -41743 -59328 -47134 -66363 -72186
9749 -72186 -32710 -13832 -13778 -37097 -24398 -46092 -17129 -11222 -9022 38375 40526 27419 22061
9736 22061 58379 101814 91816 81922 62552 44652 -1204 -25477 -39584 -33679 -14982 -2164
9724 -2164 -32918 -1994 9827 43001 48173 36683 22997 17670 51041 74462 66962 22882 27456
9711 27456 22367 37727 71575 84864 122550 141365 136059 115480 66159 21486 5451 -16960
9699 -16960 -10777 22415 -336 -28143 -12798 32222 -10328 -30808 -27843 -23613 -138 3506 -2294
9686 -2294 -31199 -780 3195 -27765 8544 26298 -2006 -41185 -49605 -25853 20871 43241
9674 43241 41911 -13143 -60928 -57168 1877 33937 36204 34561 34413 31866 8125 4554 37263
9661 37263 303 -32084 -24029 -27284 -31589 -4999 46473 42924 45460 31151 20501 -198 17087
9648 17087 30364 41717 27841 39436 43821 51084 56571 56334 90995 61933 33590 48594 67973
9635 67973 78631 49137 20283 6347 3931 53 -4946 -11692 -33026 -41032 -45172 -41405 -13177
9622 -13177 -15992 -27032 -3018 44513 58783 57149 45818 66521 114681 131348 78728 22131
9610 22131 -13725 -937 9310 19442 9103 34468 14405 6412 22956 54947 52416 38905
9598 38905 28131 -2784 -31824 -11493 -39607 -8029 15613 296 -1707 2348 -40256 -43857
9586 -43857 -25138 -12923 -8391 -6975 42422 63415 36987 -2315 -11804 1977 -26985 -38459
9574 -38459 -13891 -21631 -15716 692 8796 22587 3823 -13180 -13865 3467 -4488 -27390 -18869
9561 -18869 14865 5006 19551 63009 53443 28237 8904 11292 -20616 -36846 -2172 50356
9549 50356 45667 13526 -10646 13688 9987 30850 48747 101818 121003 50005 4176 -10004
9537 -10004 -18547 -18793 -22341 -44549 -13061 -11634 -2321 7769 -955 -10744 4669 37299 33925 30182
9523 30182 12346 -29633 -8773 24177 23505 23249 -11097 -46638 -33329 -21347 -14498 46993 82958
9510 82958 86483 61208 90979 70554 27229 68457 77143 39479 44941 19278 17697 -11859 -36965
9497 -36965 -30375 -18261 -20798 -601 -2893 -5206 3386 8807 -3014 34951 47641 19246 27014
9484 27014 13936 16512 35243 37550 61979 24323 12947 19227 6900 -1510 33367 76518 61444
9471 61444 26345 42435 5403 -10801 31811 7266 15336 61887 86176 33293 -16202 -57736
9459 -57736 -39464 -43230 -40709 4191 21731 50988 73810 53691 -14711 -30865 -35977 -41325 -22159
9446 -22159 -14325 32112 54359 77516 86882 24286 -14271 20614 75004 68745 41111 52054
9434 52054 48216 14223 18323 32674 48886 45060 27402 34794 50809 41032 14270 19758 -4949
9421 -4949 -53146 -39194 -43235 -41282 2761 -6997 5867 15355 40063 42889 88292 105327 99097
9408 99097 42263 11677 37503 43948 10416 7880 26972 36550 44306 64517 71119 68386 61000
9395 61000 81185 94667 151335 113286 57952 40638 -1175 -17125 -94621 -108828 -64564 -29106
9383 -29106 3766 48402 49650 73269 105881 100587 66649 48695 51186 51528 53972 59591 51768
9370 51768 48875 83503 116525 99928 66681 30826 -1987 -2141 21546 53263 57145 30930 38303
9357 38303 64130 39102 11775 -7205 -8316 19820 19578 27850 16223 3638 5725 -99 28439
9344 28439 41460 28690 49689 33882 29334 41434 32087 66606 67856 31761 7190 6471 27126
9331 27126 84585 81615 52038 23322 6287 -14898 1075 334 14983 17670 -24087 -41940 -237
9318 -237 7903 32265 46006 86948 84780 82186 76818 52106 10625 -35506 -47049 -42505 -10869
9305 -10869 32749 -720 -4048 -6236 -43455 47321 75520 70890 47021 -11572 -20547 2690 66920
9292 66920 107677 54716 -6470 -44460 -32494 10270 -16404 -22668 33042 72751 37103 35254
9280 35254 55185 47684 80380 78912 57999 60128 84453 118184 137975 124783 81047 46109
9268 46109 55773 25319 45859 77647 74493 49705 15587 -3375 29275 72186 62443 54981 24404
9255 24404 -6146 61219 94587 64510 41898 71171 123189 98390 119831 117091 82249 67697
9243 67697 80380 88997 135418 121350 97918 113168 125084 92794 151634 185257 100392 75996
9231 75996 76694 66339 77487 90652 100400 88879 79158 64424 34886 -1626 -194 6037 10097
9218 10097 19190 8227 46362 70199 60313 90604 106932 120941 136359 138288 148064 155424 125773
9205 125773 113650 132270 165802 157697 136306 154434 134465 127972 198372 193676 158801 148668
9193 148668 145011 122044 117227 86755 81555 92143 163293 176134 118751 106852 105648 127108
9181 127108 144622 137389 99610 89857 125552 105027 90387 77295 90621 87597 136127 168801
9169 168801 143526 105797 81972 85213 123823 99696 127615 150188 140587 164882 148031 147540
9157 147540 168883 185164 204773 253464 263813 280866 287293 288885 300522 308661 301616 331555
9145 331555 328033 350005 319015 297848 326641 319814 347132 371529 336957 365751 396362 421148
9133 421148 464953 493573 482640 474743 477318 496191 523735 551232 575888 594649 606459 702011
9121 702011 751037 824878 941840 1081877 1200367 1346022 1477465 1623754 1740090 1953540
9111 1953540 2152770 2407127 2740115 3135329 3647108 4223843 4901373 5783065 6806683
9102 6806683 7953450 9125094 10193612 11056561 11507343 11489853 10959872 10061180 8936724
9093 8936724 7780978 6718816 5824516 5014377 4316781 3734041 3213184 2820821 2539503
9084 2539503 2243397 1948344 1775674 1656995 1506350 1413711 1293930 1201109 1106350 968042
9074 968042 874239 835018 784167 754810 720626 641129 617564 584253 572777 559573 533978 504915
9062 504915 495695 499769 496420 473144 475684 447715 377724 384619 392478 362798 308142 283417 243869
9049 243869 206753 203705 219118 230138 215841 177808 207713 210383 229964 223969 227576 248788
9037 248788 249713 264812 280723 267583 263762 255573 195640 132932 120471 172554 193680 181393
9025 181393 161981 117436 109888 122445 142284 137142 161025 158426 141294 135301 128857 106164 86181
9012 86181 74882 73847 87231 102349 152002 118614 96461 98010 78752 79720 51742 59204 84953
8999 84953 112415 141869 160422 186649 198717 201391 206770 189828 182836 151769 117248 81581
8987 81581 44646 28441 2087 59857 119235 118734 91413 58916 20758 721 21940 48384
8975 48384 34070 55032 79212 91012 104020 78937 57815 22353 36665 78959 78750 96614
8963 96614 105965 43275 -1342 32731 43952 46700 56471 89602 100922 65346 45969 41660 55478
8950 55478 32734 12593 748 26114 52991 63267 52255 81648 100519 151860 153748 146582
8938 146582 144718 154087 122753 98412 87071 57896 46084 58039 69329 60560 86134 92407
8926 92407 77973 21246 31169 89051 129819 75734 31228 46740 37809 47364 45923 28588 35091
8913 35091 33351 25813 41076 56930 105991 106867 88591 77975 69003 101248 78450 25615 47964
8900 47964 77898 63001 65313 41042 40109 77380 88942 114022 103520 106600 90908 83409 50132
8887 50132 -12940 -39021 -68352 -50197 -56450 -76604 -62294 -19932 -4448 55662 58485 60560
8875 60560 101617 128091 129864 99478 62528 89211 86921 33388 44431 96548 101164 119842
8863 119842 60244 55888 61823 11665 -14705 21731 38531 31334 16470 68097 59619 28308
8851 28308 -22268 -6224 9635 38743 55569 38417 31616 28602 25566 23990 22415 31933 50234
8838 50234 53979 41613 41943 12053 -2918 8718 -501 9526 5980 4200 29048 27682 31369
8825 31369 17419 -16052 -7750 -1270 47039 38912 16943 28207 34679 9822 13466 22199 8585
8812 8585 32283 78190 29856 28885 10311 -18088 -39071 -58820 29026 47735 34482 44189 48343
8799 48343 22232 8965 14571 13035 28494 51691 67829 84473 131574 99277 50991 52592
8787 52592 44862 47348 70492 77701 48607 18922 -34613 -50479 -51168 -42467 -38383 -30140 -41640
8774 -41640 -72329 -51637 -11956 -63356 -57147 -547 5250 33694 57971 55655 27767 1475
8762 1475 32616 91244 116538 84461 57510 39275 34243 37504 34483 41279 26182 10568 27001
8749 27001 22258 -33156 -42279 -44981 -10689 16412 -3650 -12430 38958 36557 -1391 -33455 9852
8736 9852 66862 93086 62809 16225 10552 -14744 -29848 -17306 -12406 -5643 15249 5446 24053
8723 24053 31795 33983 -8114 -57775 -72279 -85706 -68331 -45981 -40410 -12817 15019 43480
8711 43480 27296 27599 9067 -28199 -24548 -2702 10558 958 28023 -12227 -39100 -19231 -24037
8698 -24037 -19899 -9154 23149 23401 11665 -21062 14732 -7022 2416 -6026 -9639 -8377 16474
8685 16474 29558 -13270 -12275 31624 48218 36880 -748 4250 14792 30865 22813 -13116 17172
8672 17172 45297 18175 32055 -8638 24305 79883 59942 21325 -6214 -17850 27493 69929
8660 69929 81414 56547 20463 -1704 -21923 -59814 -23488 2503 43832 64548 70163 54553
8648 54553 52143 24917 -16997 -39584 -46438 -12319 47444 86637 79792 70698 100501 137982 128688
8635 128688 79342 95247 65442 28740 25474 97280 123211 135616 76123 36141 44856 31933
8623 31933 51372 74335 87441 86194 103777 125597 121995 95163 84504 34869 -19708 -3395
8611 -3395 74978 57292 77173 88070 77878 79416 56807 100555 108414 115800 104288 62660 34137
8598 34137 18252 30298 64669 46512 37192 19576 -17037 -48271 -6110 -1464 35918 44601
8586 44601 -15639 -35366 -15792 8162 19680 14370 41140 86531 85701 57617 66676 48619 14162
8573 14162 -9372 -64255 -82127 -91286 -54675 -18103 3164 -1336 -16016 -42779 -101042 -117376
8561 -117376 -110269 -119558 -85985 -45340 -54124 -28338 -8336 -17284 -40832 -25989 -14290 -12577 21094
8548 21094 33366 52212 12659 1834 48729 39333 8713 23739 34411 37249 11238 51258
8536 51258 37798 76385 58610 23100 43528 85009 115102 71400 56483 66166 42917 13838
8524 13838 22497 18348 36397 50241 51196 44523 84967 65247 82181 60737 33900 23327 22028
8511 22028 39777 37491 14597 10432 47256 94513 89941 53852 13864 50991 62145 57623 37744
8498 37744 13738 -7445 -20066 -30129 -34147 4220 -33420 -2434 34428 24807 -1007 -12130
8486 -12130 -7605 -17063 -12087 5123 -4829 -23113 6317 -26133 -27503 -34443 -22909 -14895 448
8473 448 28192 40281 58965 84920 76264 83485 37834 31255 29669 51299 44385 26434 13801
8460 13801 26756 30328 34847 38489 36553 -11773 -45031 -42398 -14919 -18279 -19955 450 -7592
8447 -7592 1846 -9939 -34860 -82511 -38584 10049 5746 27819 45623 41399 30220 53589 70002
8434 70002 65163 25612 8865 -31284 -27962 -58040 -92716 -55045 38175 50131 45903 15811
8422 15811 4460 -8814 -14211 7396 1301 -12213 440 35364 75557 48824 36078 72947
8410 72947 73339 25245 -27768 -87639 -70304 -50296 368 15418 43674 43412 22805 20823 27194
8397 27194 31483 38365 570 20864 20785 12871 38251 50440 32236 26197 -5614 -21537 -27620
8384 -27620 -24839 1535 16687 21598 21187 7337 45005 42726 14099 11175 17407 3115 -10689
8371 -10689 -27578 -47781 -37192 27294 45775 45786 69073 43394 27263 25793 9491 21472 -20167
8358 -20167 -9345 -24772 -11678 3625 -53031 -66529 -62624 -36927 -25277 -2197 18343 44876
8346 44876 42275 32801 47719 52819 22970 809 28047 32413 27157 10114 545 -12255 -2877
8333 -2877 30735 23152 10475 7148 -4894 7937 44554 75852 88615 98791 85087 31681
8321 31681 30729 24327 15327 -18243 -5560 36203 85226 74805 17466 -15823 -11192 -5293 5851
8308 5851 50136 59631 38618 -11536 23469 42095 30258 3860 5355 -4087 20509 9698 -16758
8295 -16758 -10332 17841 4062 13633 -27010 -14832 -15447 -32218 -34976 -40459 -76727 -18352 13211
8282 13211 -22325 -13134 8504 -4281 -28513 -21947 -23909 49051 56505 28812 5533 -35047 -63509
8269 -63509 -98102 -72706 -42646 -28689 -16598 5800 17562 33627 -2804 -28319 -8152 -36419
8257 -36419 -69454 -37044 30609 37567 55285 53235 63403 47160 40190 19936 18494 1613 11871
8244 11871 36505 59567 -3319 -28142 4065 7026 -18514 -16998 -55734 -51385 -21560 -9089
8232 -9089 -20800 -47838 -8431 64552 -4389 -60241 -34969 -1938 17479 18726 -723 -8476
8220 -8476 11818 35493 61998 70656 49550 -9014 -8536 -29750 -28488 -1939 657 12331 8926
8207 8926 11863 19667 17993 3431 56644 35730 9097 634 -23083 -7892 -24803 -30711 946
8194 946 -5779 25729 41468 62866 58860 43537 19263 13638 539 27224 38473 -3806 -43613
8181 -43613 -71792 -123381 -152994 -128129 -88114 -52138 -17765 -3454 -5878 -30551 -47868 -39213
8169 -39213 -9862 11905 1485 -7725 24171 39683 14680 -7856 -592 -10383 -3619 -9689 7085
8156 7085 10466 14738 5393 16736 32992 34661 50404 51978 -12199 -5278 7153 4527 10558 -2127
8142 -2127 2355 41670 36126 40349 47953 17113 1190 17013 17967 -3493 -53304 -49524 -25670
8129 -25670 1337 -13572 -37700 -16028 -47047 -46328 -23516 -4946 -25779 -50765 -26223 15820
8117 15820 24713 12074 -16629 -36339 -78434 -53992 -9044 41200 48389 8787 -13842 -26989
8105 -26989 -15592 -54121 -63438 -62667 -71840 -111631 -105440 -82555 -45233 22427 9798 13002 23593
8092 23593 43132 21416 -5951 -9496 21052 -418 -21961 -8748 10873 75989 86142 38835
8080 38835 39310 55029 62937 27849 -7162 19143 -20114 -56090 -74868 -57187 -52620 -44329 -27448
8067 -27448 -2855 15904 -3952 -9576 -8700 -67341 -70906 -30323 -22312 -25684 1010 7000 -384
8054 -384 24286 28908 41252 47410 -3821 -9263 19296 4390 7575 -3784 -10647 -34751 -48360
8041 -48360 -29967 -25099 -65249 -71087 -74086 -53920 -15892 -13426 -19608 -35538 3424 -6874 7861
8028 7861 -669 4753 -581 -32907 -18062 679 14488 44164 18305 -25484 -1606 77509 93345
8015 93345 55063 105234 157005 120496 73319 45430 56560 75251 102547 83371 71798 66571
8003 66571 63841 96790 71732 40887 69663 71975 17223 9283 64450 52442 38750 41098 40657
7990 40657 51078 52148 33799 37306 50821 -6580 -35881 -34258 17963 61841 75954 79726 56716
7977 56716 10203 -49259 -62585 -50616 12402 76491 123048 107114 44323 33351 57373 34292
7965 34292 39414 44841 15931 3395 20408 28117 44131 33200 -34303 -33765 -28840 -16019 36863
7952 36863 25330 -1860 24992 19193 38746 36041 -3953 -22544 -30883 7497 6431 20149 21071
7939 21071 42776 48568 22082 23455 12216 5427 -4340 -8909 -6060 7671 13491 -1787 -13688
7926 -13688 -2348 23104 22728 -10486 -46142 -61570 -26567 -34869 -30753 -914 18246 2220 24644
7913 24644 45523 10120 9842 18866 -18408 -50812 -24237 8454 -1829 -911 10680 57258 80230
7900 80230 46220 38358 61159 34086 -4297 -400 21090 9129 685 -9252 -6157 36681 18468
7887 18468 -3177 8388 6102 -1415 14045 23921 69307 19432 -6576 -30604 -11575 15121
7875 15121 11178 -8345 -10000 -156 29442 42364 53904 41522 73684 74957 11721 -33889 10463
7862 10463 60412 27901 -8871 -26862 -2904 43242 5433 -29722 -21712 1007 -15896 -18007
7850 -18007 -4727 -32204 -21456 27195 42507 39320 6869 -38378 -47567 2823 71711 46538
7838 46538 9358 6371 54196 48568 57403 19315 5416 13992 23246 45278 5998 -5645 -11044
7825 -11044 8966 -39472 -47968 -28122 9109 49528 28556 -24082 -32272 -4971 -18952 -60326
7813 -60326 -67453 -55681 -27678 -49009 -54033 -86227 -90550 -74229 -49356 -25802 -20262 8204 37456
7800 37456 8710 4308 27265 48580 19310 22235 -1173 20344 31340 4317 -16868 -40879
7788 -40879 -63704 -40047 -4233 2123 3451 -11028 11218 26728 39005 -31097 -48297 -32620
7776 -32620 -19481 -6546 -30023 -25773 -44918 -62956 -80094 -101220 -79186 -42913 -61585 -25998
7764 -25998 -7904 -53254 -87856 -77147 -90330 -48201 -30707 -51507 -70699 -71481 -74529 -67850 -76927
7751 -76927 -31807 -26658 -33041 -34569 -7448 -26008 -52987 -72031 -90263 -73036 -70996 -58156 -56187
7738 -56187 1582 38837 50544 61972 77414 39471 13793 6809 20589 33741 40927 88505
7726 88505 69156 60569 12076 22418 8748 -37647 -51993 -15090 -24410 -20978 -16525 -44137 -65103
7713 -65103 -35668 21052 40286 -8690 -42349 -65102 -55342 -49788 -62337 -51751 25804 61275
7701 61275 31904 29096 34111 17128 5594 24812 29609 13923 -2449 -35730 -45105 -41585 -46088
7688 -46088 -13225 35682 48444 3195 -1968 -15944 -70964 -69038 -48988 -32181 -12896 -16072
7676 -16072 -31229 -21444 14926 7137 -11117 4323 -13090 -27931 -34078 -12713 -37827 -48140
7664 -48140 -53363 -43757 -25728 -33128 -41783 -27269 -47280 -77014 -49915 -30092 -19254 51724 40362
7651 40362 12769 5859 31308 31408 10977 -10260 -13298 -31117 -66684 -96975 -101219 -112617 -81406
7638 -81406 -43832 -25599 -21707 34339 19646 2288 -10509 -46399 -83580 -78054 -42971 -1730
7626 -1730 -7983 -2811 -622 41379 50836 39921 -341 717 41612 50267 49577 42727 37854 16991
7612 16991 -30988 -73668 -63155 -53090 -45896 -22873 3310 -4081 -23934 -43547 -13883 -42903
7600 -42903 -39694 -38818 -1095 22154 37717 33055 27805 16009 28217 43129 53665 30741 -3617
7587 -3617 -27073 -23162 -7172 26325 12890 -18434 -22798 -24994 16756 6428 31693 53297 42230
7574 42230 11627 16045 35078 15286 -21724 -19447 -32372 5680 21946 -32633 -68730 -74836
7562 -74836 -62441 -15031 -7196 -10825 3155 -21739 -50155 -51048 -50600 -22476 43045 74178 46040
7549 46040 13438 14505 26268 43691 65568 62695 19706 19150 31142 -11469 -54738 -54630 -61623
7536 -61623 -53192 -53087 -36128 -38548 9550 2361 -12773 -14326 -12864 -22745 -10471 -30440 -42641
7523 -42641 -22610 -42814 -30382 10455 5790 38696 82496 77927 69761 14475 -36044 -38184 -26490
7510 -26490 -9363 -26107 -57533 -36264 8741 24616 38922 77647 51362 -5720 -66468 -57575
7498 -57575 10990 83235 49462 -20113 -74083 -66064 11024 36330 8447 1139 -2630 -15757
7486 -15757 4540 24472 -10665 -40164 -43781 -30578 -23387 -27124 -9403 24861 21749 -12986 -63271
7473 -63271 -107374 -60489 -11183 -17788 -14580 12788 32443 -953 -22272 -41974 -73317 -59618
7461 -59618 1409 16337 -1108 -11045 -21843 -37960 -23520 8139 7588 -36907 -65155 -83070
7449 -83070 -26576 -11960 16894 25059 23248 14807 13145 45850 77741 54794 27280 41152 67249
7436 67249 40407 -1342 13865 21358 7012 9357 -766 -19372 -10455 1823 55531 85700
7424 85700 33920 3609 6683 21527 35568 51736 47857 2160 -2534 1212 -4563 7016 29231
7411 29231 76419 90203 106306 98614 71066 55688 29154 11556 38191 27188 52918 43393
7399 43393 34367 16865 -76 -19958 -54510 -52854 -6643 26713 42515 6264 -35521 -3414
7387 -3414 9757 -7187 -18185 5199 12082 28855 21646 11545 6638 18387 38952 38680 -7661
7374 -7661 -51387 -38119 16115 43668 46083 56790 36410 319 -2679 17661 46260 5740
7362 5740 -35517 -53033 -10571 22445 10169 -331 27095 33197 -3900 10131 8416 6867 -15748
7349 -15748 -34197 -56652 -10520 26756 -1916 -12461 18289 21486 3580 -42197 -18835 6876
7337 6876 -14432 -8828 -8214 -17700 -20645 -48748 -39252 -30241 -44174 -32257 4703 15735 29915
7324 29915 22291 2311 -26336 -60328 -30731 6642 2181 -23353 -37251 -67324 -68792 -41222
7312 -41222 -5831 34782 47540 22541 29971 29441 8486 7788 -66 8971 17655 31673 46612
7299 46612 34356 -35848 -59790 -32638 -110 8845 12989 39382 55061 31903 18837 -4747
7287 -4747 -56844 -96475 -76438 -18436 2416 11853 27496 -24055 -40571 -25154 -35634 -10191
7275 -10191 6313 181 -39682 -21166 30667 31257 30111 39078 44605 20203 -11721 -1068 -18435
7262 -18435 -38279 -3576 -548 -6354 9430 -15153 -40367 -27142 -34308 -171 10846 12747 16127
7249 16127 43149 36300 31774 13683 -11165 -16879 -25518 -74803 -60048 -16667 -6252 881 -8096
7236 -8096 3223 15555 12974 9756 3396 8066 -3343 -47862 -50206 -45787 -10071 3357 -47226
7223 -47226 -35272 -6487 2108 -4194 -19467 -38033 -30514 -22798 -25951 -31067 -42498 -67081 -120145
7210 -120145 -102660 -40359 11260 53889 35369 -25069 -20451 -28718 -9649 5259 -18275 -59908
7198 -59908 -52356 -19378 14143 33185 52903 19892 -50237 -52467 -7438 25035 -31431 -42961
7186 -42961 -14457 -25487 -33832 -50113 -41455 -26171 -37622 -42485 -12945 23442 28885 -2300 -1770
7173 -1770 20658 18279 -11536 -4157 -23060 -76386 -28995 -14426 -12039 -120 -810 -36468 -38482
7160 -38482 4828 18318 -9636 -45868 -54520 -56186 -91961 -59955 -47472 -19598 11321 -1792
7148 -1792 -8521 -23792 -35840 -43149 -81437 -91739 -74001 -23357 -16519 -29007 45470 84871 40995
7135 40995 18271 -26839 -90055 -76584 -27470 -32510 -60879 -59466 -62829 -85922 -78697 -100841 -61135
7122 -61135 -29743 -7402 7020 -889 -26116 -41233 -36347 -36691 -25067 -18900 -23691 -54987 -83325
7109 -83325 -87744 -87682 -41048 -50605 -73708 -74307 -32184 -18334 -30573 -37477 -35474 -13870 21961 6026
7095 6026 -32903 -39611 -23297 4222 10505 -6269 -9969 -33981 -42966 -52340 -37061 -5436 -13449
7082 -13449 -32392 -17484 -720 10686 -33034 -71311 -58590 -16063 -5553 -36052 -40264 -14297
7070 -14297 1021 19651 54161 24722 -20105 -31591 -37528 -17160 4656 21611 16168 -9948
7058 -9948 5350 -12211 -30074 -35129 -34839 -26145 154 3862 11612 -1658 3739 20479 37014
7045 37014 24302 12671 31891 29720 46651 -1708 -37264 -61485 -80293 -34225 -25183 -20976
7033 -20976 -40829 -1671 35014 63696 37617 3176 7331 -22404 -15726 1929 12326 -775
7021 -775 4312 -9020 -26184 34653 43428 33216 42028 15255 11716 60507 47861 8013 -19652
7008 -19652 5477 13087 -4161 -5519 -8333 -43138 -21735 -9889 -46473 -56295 -41566 -65183 -82516
6995 -82516 -71342 -4094 14035 31172 12416 12124 2306 -8335 2530 3614 9276 -46734 -96534
6982 -96534 -122493 -132468 -148636 -79317 -51928 -5416 -21118 -60325 -21484 28907 46611 34690
6970 34690 32121 11395 11716 3612 5816 -20142 -19546 6533 -8840 -24963 -17801 -33426 -94890
6957 -94890 -69682 -18728 13205 -1115 8868 31114 -1478 -38445 -39987 -58506 -69929 -38349
6945 -38349 -17729 -34944 -49412 -49306 -33467 -67547 -77426 -49725 -24418 -12995 -8392 -29203 2491
6932 2491 5329 -2897 -12628 -19356 -22942 11731 31969 49881 22240 17344 37387 56922 44028
6919 44028 50336 56123 -16313 -26448 -21600 -8628 1585 27729 16384 9625 8391 -4725 31625
6906 31625 34988 -7634 -38911 -50282 -61895 -76358 -60055 -48117 -37942 -26211 -27844 -22706
6894 -22706 -6692 2328 364 -3595 2625 929 41976 22957 -7543 -15465 32063 48439 14568
6881 14568 29370 76070 81700 52312 29698 44804 10934 -13740 8436 -2395 18614 27394
6869 27394 7526 19227 -4938 -14745 -26059 9815 30816 33539 15106 -12801 -12003 -15235 -31507
6856 -31507 -96560 -107507 -52161 -2507 6791 -40497 -34785 -29819 -1619 79072 97238 60772
6844 60772 7087 -11646 -45445 -41900 -14972 -18729 -20503 -30285 -22403 -38160 -33210 -43979 -58679
6831 -58679 -47598 -85212 -98215 -76923 -43585 -9521 -32113 -28229 -19939 -24708 7528 44313
6819 44313 51289 -983 -42018 -49498 -6429 32363 16630 -6845 -37521 -29534 -27666 -33046 -14896
6806 -14896 -10016 -2944 -5939 -9912 -26908 3848 42046 41938 52311 9980 -5924 -384 -49249
6793 -49249 -59298 -10478 -24041 -49424 -30876 5907 21051 8723 -10425 -27072 -29420 -25929
6781 -25929 -33251 -25857 4355 -13500 -46259 -76740 -98104 -87040 -36744 -33890 -71205 -75308 -57396
6768 -57396 -28200 -35646 -60146 -92486 -118734 -126598 -112681 -80795 -46492 -10174 18224 15912
6756 15912 17502 -6622 -19385 10748 28716 39878 10963 -24088 -32545 -34625 -33065 -45631 -37846
6743 -37846 -18159 -17944 -48179 -28301 -22125 -49530 -27065 -98 -2275 -3946 29768 46011 25766
6730 25766 7412 42504 33158 -1876 16162 34751 55017 33889 -20755 -53827 -77491 -76015
6718 -76015 -50545 -37114 -22042 -13395 -52047 -55444 -24550 1071 2702 -7746 25131 58177
6706 58177 21448 -29588 -40760 -41210 -48335 -58918 -66569 -35952 -1472 25542 12933 20488 27233
6693 27233 -3973 -17461 -18993 -24054 1847 -20634 -23810 -60988 -105862 -86426 -17167 -8641 -39402
6680 -39402 -25637 -21421 -61305 -14879 -14600 -25360 -29017 -16320 -35180 -97306 -127264 -91698 -51173
6667 -51173 -17267 -6821 -15290 -39827 -28839 22177 6406 12495 8158 -11521 -27373 -50645
6655 -50645 -77743 -102000 -70705 -81540 -86559 -83153 -74074 -32607 -4078 5147 -8160 -6794 -18139
6642 -18139 -26770 -36398 -24277 -27439 -19237 -28460 -32146 -77416 -75516 -64485 -36342 -42907 -61486
6629 -61486 -99106 -86903 -91169 -105988 -115627 -142692 -128688 -105075 -114834 -142674 -100643 -59539
6617 -59539 -44364 -26332 -17556 5555 -33888 -48890 -58790 -81660 -58973 -28995 -17435 -14604
6605 -14604 -25468 -46247 -23099 15391 41494 34252 29599 51751 106276 73375 21343 23396
6593 23396 51975 45610 5708 -16441 -50921 -76563 -73977 -51086 -20373 10660 11524 28044 14741
6580 14741 1520 -14057 -6062 12523 14851 4668 -24107 -33728 -22602 -38341 -24382 -35257
6568 -35257 -38970 -69100 -73270 -11184 35679 56375 36312 -6543 -44704 -427 43186 3855
6556 3855 508 -36139 -66574 -78807 -67178 -39714 -17806 -15738 -32762 -38942 -24973 -20956 -49744
6543 -49744 -71072 -82905 -44616 -2203 22933 62825 67198 58157 92725 117600 75674 66806
6531 66806 38643 17870 12696 -25879 -40559 -31674 -53833 -36138 -39581 -11570 -17881 -16495 -33310
6518 -33310 -7533 -45925 -52937 -49334 -34136 -20291 -17516 -51934 -63506 -100399 -105456 -66406 -20020
6505 -20020 25829 11410 32850 46305 38652 8701 23786 61140 21518 11679 -4326 4788
6493 4788 7493 2449 -47527 -31894 23208 17367 -1332 -1237 -59701 -62762 -49406 -37357 -9366
6480 -9366 28499 60029 56671 48214 28421 -19565 24108 61198 15161 14241 2115 -24910 -11578
6467 -11578 23251 -11829 -29508 -54060 -35550 -12728 -22038 -24091 -17505 -11555 10062 -2288 -33811
6454 -33811 -26233 -15954 -27236 -33187 -27612 -4802 -10611 -25116 -34815 -44489 -48962 -30533 -37605
6441 -37605 -58447 -71861 -78088 -54672 -70427 -97925 -98561 -80008 -92342 -132330 -155608 -175893
6429 -175893 -180961 -109485 -43897 -333 -14452 -57225 -63349 -38703 11571 28588 33415 -8306
6417 -8306 -23899 -22600 -29212 -30839 -22777 -70663 -99241 -36610 -15588 -6209 7252 28755 74002
6404 74002 91524 50223 43167 -7778 -45073 -41388 -20713 -26609 -21143 -19391 -7252 10904 -10862
6391 -10862 -28179 -14595 18650 46558 66845 48055 31288 -2448 6526 15129 -28459 -97109
6379 -97109 -71916 -64010 -23751 8645 20674 40045 49556 40360 -8682 86 -30295 -57586 -66891
6366 -66891 -25730 15720 -20552 -5397 9248 6704 28682 43489 12117 -6842 19263 30853
6354 30853 54938 41266 6601 9300 19834 -37650 -57001 -15172 -4444 -11412 13741 5708
6342 5708 -22898 -57123 -51622 -89809 -96950 -76252 -64928 -55439 -32998 -48145 -59481 -61504 -38313
6329 -38313 -35127 12517 21727 -27113 -67984 -61728 -40698 -50189 -16507 -3799 -19472 -21553 19062
6316 19062 -1968 -21013 -33224 -2243 -19446 -38036 -71633 -81635 -83103 -86785 -50311 -36644
6304 -36644 -8294 -1002 11942 8212 30245 48111 64213 21560 -33188 -30197 5097 11858 7734
6291 7734 26430 56794 76727 106409 120892 71823 -2530 -42026 -36168 4924 -6152 -39947
6279 -39947 -48731 -51557 -20948 -27734 -7058 45290 79103 36711 10524 -32607 -39280 -66195 -23976
6266 -23976 -20048 15821 23722 13677 -41215 -40369 -56892 -54896 -30460 -37204 -25663 -31085 -42027
6253 -42027 -68450 -28407 6189 26232 9417 -6941 -39533 -88287 -71097 -48351 -48111 -22738
6241 -22738 -5396 10955 16349 -4910 -14893 3776 -18559 -53802 -56232 -76014 -52701 -12097
6229 -12097 -25338 -13666 -2381 -31912 -9112 22142 63767 65971 55335 41108 16723 -14709
6217 -14709 -12629 -7998 1711 -34650 -47834 -23556 -21411 -34312 -10783 10604 -12786 2606 -33458
6204 -33458 -48529 -62798 -70456 -51621 -22319 -32866 -20337 -33908 -41289 -28454 -54642 -56368
6192 -56368 -48370 -34683 -13865 22632 42545 45424 32182 23399 24880 9792 -12386 -3986 2199
6179 2199 -10586 -27242 -14882 21821 54876 39993 36760 9191 11298 10718 27170 15602 31955
6166 31955 22147 7041 9785 4055 5375 -31653 -47226 -57106 -54625 -57003 -55398 -72709 -91684
6153 -91684 -91001 -69335 -63655 -63634 -93082 -68057 -3795 28063 16572 -10926 -25231 -67334 -64081
6140 -64081 -59601 -52349 17322 45244 34535 50674 69648 37428 39359 15366 32636 6778
6128 6778 -9889 23279 44259 40557 7110 -23699 -18231 -83080 -120223 -55366 -14852 46804
6116 46804 55920 61017 82225 29572 -27698 -53941 -26600 -21418 -13823 10461 41153 48150 8247
6103 8247 -32568 -3526 30714 14060 8135 38650 43581 44362 22520 21672 14621 -28591 -36646 -62399
6089 -62399 -53659 -37934 -20739 -28216 -24563 20095 21526 9367 13720 -12561 -18114 -15063 -41969
6076 -41969 -55071 -10987 29890 -15712 -35314 -3912 7642 -31612 -5015 2501 -2753 18725
6064 18725 11639 8430 36736 53122 26766 -2632 11209 15230 -46984 -72445 -53722 -25938
6052 -25938 -18258 -43823 -79472 -65291 -59738 -90108 -67275 -47866 -38504 -12443 18185 -25688
6040 -25688 -73890 -73572 -42660 -34880 8014 39441 73570 40414 -14104 22266 93689 108067
6028 108067 67969 48700 21041 55586 35339 38505 32039 -19468 -59711 -73804 -67599 -14235
6016 -14235 4438 2420 -36876 -43224 -35720 -28965 -11616 -32575 -14357 -19706 -35449 -57899 -35823
6003 -35823 -27121 -14818 -4946 -54044 -81124 -61571 -41487 -3935 -41979 -38354 -20467 -4425
5991 -4425 -7250 28141 59848 40359 20837 22459 41821 -2998 -47504 -77224 -60711 -83654
5979 -83654 -77097 -67585 -32535 5521 21398 1588 9625 22986 27196 3813 -7990 -1438 -40790
5966 -40790 -86291 -126166 -103184 -108665 -48886 6510 -11984 -48901 -66745 -88766 -117769 -92420
5954 -92420 -70660 -74109 -75501 -71546 -62180 -51137 -46222 -30327 11427 20572 -17660 -14742 16546
5941 16546 26723 -12783 -25097 -36146 -49164 -9355 -17878 -30195 -36556 -25839 -5357 29770
5929 29770 34099 2993 947 62 -3014 -20272 -42158 -15834 3271 16477 22516 20601 -12384
5916 -12384 -39303 -49407 -39616 -6694 25781 51099 3962 -10420 8002 26548 34843 -6280
5904 -6280 -25583 -11735 -12179 -20408 -45327 -27390 -26910 -20600 -18207 -43032 -62142 -30430 2072
5891 2072 25922 41138 12207 -15076 -26979 -45685 -72425 -82968 -57982 -62611 -4066 26693
5879 26693 -51914 -47178 36905 32536 15836 37864 26376 2525 3245 38680 38254 61140 53019
5866 53019 52446 12936 -25903 -20459 21 8269 19061 15204 3203 5170 -7000 -25761 -28940
5853 -28940 -23429 -31729 -16402 -26854 -2455 -7140 -10755 -8225 1617 3379 -20588 4909 5986
5840 5986 14406 4069 -14475 -18386 -26901 -33588 1086 31555 1749 7920 10083 -26312 -50747
5827 -50747 -47029 -54492 -98129 -68517 -46725 -29687 -51063 -43481 -6957 21657 31428 22135 -37290
5814 -37290 -20694 29461 17433 -9676 -32378 -37059 -7700 -3880 -8217 -17768 568 10102 8405
5801 8405 43919 52823 33110 13536 9927 22765 -802 -16647 -10954 18493 22469 10753 8679
5788 8679 29688 34050 -17018 -53454 -15539 -12027 -13842 -14646 24929 31153 -41610 -64895 -46313
5775 -46313 -65209 -63871 -30876 10384 -18645 -26531 -7283 -3508 -2404 -11516 -32551 -50313 -20900
5762 -20900 5380 13335 904 14915 -845 -58135 -87323 -93005 -73100 -20801 -23299 -37028
5750 -37028 -4908 -16351 -28912 -39051 -52315 -52738 -32295 -29038 -43548 -56050 -10420 35673
5738 35673 52205 2895 -23192 -37060 -32763 -24884 -953 -13472 -41474 13928 54668 39895
5726 39895 42595 43486 -10443 -14080 6405 -41278 -61597 -20879 30843 -3662 6145 -132 -376
5713 -376 -28619 -59085 -31551 -15885 -3738 12265 -2498 -7958 3001 63286 46290 27386
5701 27386 9375 -41082 -60345 -37733 -12792 -11876 -39353 -37563 -97964 -66711 -38992 -7439
5689 -7439 21507 37821 13063 18600 27537 -17220 -77280 -111726 -75987 -44917 -25916 -60747
5677 -60747 -64024 -95027 -115704 -92378 -69266 -57161 -46229 -6436 -1216 -25455 -1509 -30551
5665 -30551 -64779 -46849 -7093 24357 21966 -17965 26884 45197 -7010 -27488 -17167 -26814
5653 -26814 8814 11496 -10139 36825 15018 19017 21776 17942 -13767 1048 6902 -19850 -11849
5640 -11849 -7730 12126 759 -14633 -14565 -38557 -39863 12110 44550 63569 40938 3464 -1996
5627 -1996 -2158 -19343 -28926 -8350 -36200 -33193 4467 31067 56175 37019 -14212 -7248 8086
5614 8086 23038 29768 40895 71936 55283 74091 98381 75979 74579 95580 92715 27607 -162
5601 -162 7161 -28515 -70587 -58084 -35012 -38567 -17109 13180 -13128 -33563 -42078 -34292 -24900
5588 -24900 -29543 -11836 -30468 -13550 17122 -4307 -24942 -31461 -26600 -19276 -40846 -72349 -65471
5575 -65471 -85641 -68912 -45698 -26933 -2197 -8968 -16617 -46831 -32119 -10876 -28570 -83884
5563 -83884 -59110 -14902 -604 -8821 28199 32694 -31619 -77468 -75503 -64434 -49697 -23397
5551 -23397 30849 53072 40281 32417 5542 -1557 17119 80857 83349 37528 40364 54071 42542
5538 42542 9927 -68455 -78407 -54497 -55858 -31340 -12326 -37193 -37044 16905 29505 9279 11989
5525 11989 15755 23530 51128 53389 43210 35427 -127 -34493 -22207 -14221 -11005 -11604 -19223 -9550
5511 -9550 44867 14298 -24608 -44674 -70210 -82242 -76225 -41369 -16122 -31846 -38183 -19091
5499 -19091 -7267 -7043 12323 2377 -4111 -30019 -35377 -54391 -65591 -78877 -117700 -96525 -15667
5486 -15667 2166 -21099 -10529 -4662 -59144 -58482 -27546 -26627 -17060 -42961 -49044 -43070 -64774
5473 -64774 -51730 -50353 -35381 -47983 -36546 -11245 -9875 -34386 14687 52402 41061 33120
5461 33120 22567 16417 5195 19475 17004 2387 9757 22089 -5288 -49 -19023 -24530 -12459
5448 -12459 -17675 -47126 -27207 17897 23704 -6476 -17167 495 -2164 2526 2066 27659 7203
5435 7203 -7386 26966 -2570 -2354 -453 27517 33213 63186 67837 48069 9228 9150 19041 19396
5421 19396 -1708 -25199 -22395 -13041 -42387 -47401 -8836 -7948 -14508 1971 49665 58576 35246
5408 35246 16238 -10137 4353 21520 47164 25132 -20128 -15868 35118 58502 10249 8224
5396 8224 3606 -3045 -17099 -29223 -13084 11907 18848 38233 28191 22886 -25988 -27357 -24321
5383 -24321 -27631 -17605 -32740 -45731 -45076 -13275 -9917 10048 14315 31050 17256 23190 5825
5370 5825 -17126 8562 40541 16937 -579 -5585 -11230 -24674 -13647 19465 23216 5534 23616
5357 23616 -10162 -53241 -18126 19966 28189 39898 63914 90045 69445 3906 -18164 -28021
5345 -28021 -5743 15379 30933 21860 -12708 -56373 -63463 -87922 -81255 -51845 -33825 -44323
5333 -44323 -43313 -26139 -33533 -41589 -25705 10617 37165 45056 33978 1033 -13544 -13667 -9021
5320 -9021 -7740 -19603 -37254 -72423 -48258 -44059 -57466 -113705 -94670 -51141 -13122 -10815 -9887
5307 -9887 -3959 -1452 -21901 -24352 -27315 -21086 10542 18878 19400 -28700 -56977 -58182 -47636 -31311
5293 -31311 20771 19459 -22084 -15527 -22810 -5649 -13711 -21178 26175 89202 51846 8524 15732
5280 15732 -15032 -48473 -53276 -41360 -39780 -47638 -47545 -42309 -21545 -15458 -27747 -39856 -56437
5267 -56437 -66666 -76972 -52354 -41783 -70998 -75889 -57637 -23896 -10241 -51315 -59011 -64603
5255 -64603 -69159 -9861 9263 25161 37452 26579 53887 47735 3003 3178 -13931 -5330 -3825
5242 -3825 32529 40840 17140 25141 48328 66719 15059 -43960 -49522 -22051 -584 9275 31002
5229 31002 27021 -2946 3329 -40015 -82648 -18192 -21475 -22448 -15939 7142 29352 8188 20614
5216 20614 11816 48199 32365 -615 11836 -1588 -42428 -39409 -9841 25985 19934 -2318
5204 -2318 -43310 -48838 -46236 -22921 14442 -2831 -55444 -74168 -53312 -30345 -14473 -35995
5192 -35995 -12844 -1658 -22675 -54094 -71057 -93881 -56912 -34841 -42082 -34577 -41371 -54244
5180 -54244 -46172 17005 35216 41444 6147 -10454 -17626 -11884 -3540 1248 -24955 -46899 -49849
5167 -49849 -27455 -2210 9242 -21349 -44235 -1925 21196 31812 26806 50210 69716 30858
5155 30858 -5923 21260 58764 51739 31480 4247 -45285 -40233 9927 24665 39107 66678
5143 66678 108211 95571 103335 110777 95076 101728 80391 74851 92900 116023 70452 60438 78071
5130 78071 42670 27113 7585 -35732 -32343 -35352 -20418 -712 -7933 -36692 -29654 8456 -13438
5117 -13438 -19546 -3591 28065 50446 468 -44929 -31861 14061 48068 49637 40530 20191
5105 20191 8440 12296 19870 -27494 -53507 -48478 1964 36931 57845 57255 31762 36576 -5224
5092 -5224 -28553 -56397 -81123 -85426 -73804 -64977 -38071 -56561 -78697 -69464 -74084 -85769 -47636
5079 -47636 6695 6002 45520 41329 48178 66416 108406 96223 56512 25904 -940 2865 -15937
5066 -15937 -5999 27367 27780 16735 7461 -24207 -47240 -39161 -50736 -63933 -59034 -95822 -60065
5053 -60065 -14792 -30755 -44136 -50710 -32123 -24934 -24983 -35364 -15434 -3828 28006 38541 48468
5040 48468 39737 7844 -26365 -35329 -18931 7129 -33582 -22377 -40898 -49009 -59636 -45890
5028 -45890 -34282 -44652 -26101 -29116 -10153 -9387 -3939 37468 61493 74551 99932 107124 124437
5015 124437 96988 95672 104015 95689 35911 65694 63275 -21518 -45013 -33161 -34787 -45845 -31222
5002 -31222 -19109 -33779 -38613 10061 16532 -4361 -10259 -19657 -34714 -50390 -12645 23840 2361
4989 2361 -17850 -35533 -35862 -17351 -17781 -27146 -4164 -29508 -39613 -49625 -48165 -16676 -7062
4976 -7062 -26441 -63879 -55680 -25065 -36317 -86627 -89338 -89539 -29756 11401 22877 9972 -3925
4963 -3925 8028 25505 14851 41064 63829 64005 52468 30950 11869 9733 29322 71756 36142
4950 36142 23167 4373 -34062 -54693 -46077 -42486 -68255 -38475 24094 38938 33060 36159 21996
4937 21996 -14830 -17988 -29051 -25864 -9045 -19907 -3113 12837 -21439 -47927 -47981 -53292 -45863
4924 -45863 -4506 -3514 -500 1920 5474 21322 20437 41080 49939 42709 -1002 1507 -30862 -63414
4910 -63414 -18686 -8632 2618 11032 33433 29864 43245 84839 107362 63183 52382 55923
4898 55923 67819 65482 84084 52194 24823 -1595 -28424 -36407 -37739 -57043 -20563 3465
4886 3465 29070 22886 21584 26314 -12175 -34747 -19325 29464 28718 30227 48100 26334 -2525
4873 -2525 -8515 13252 3666 -18677 -35460 -41079 -41876 -74339 -107489 -87118 -50748 -13955 2529
4860 2529 17948 4436 -13673 -56061 -62944 -36532 -27668 -31199 18642 2363 -20368 -56155 -22689
4847 -22689 -21544 -26105 13843 17496 9014 -5879 -56578 -55728 -32185 -23403 -18447 -41277 -32544 -7263
4833 -7263 -11182 -18736 -25846 -31421 -4373 -14342 40704 45986 13873 -19167 -10817 -34029 -36130 -36154
4819 -36154 7463 -2139 -7283 -13383 -12960 -15969 -3902 6007 -29830 -31239 -2173 -13858 24500
4806 24500 55429 59065 15091 -283 -2737 18257 19295 30069 -4421 -8251 9383 24463 35704
4793 35704 29167 50438 16043 13060 -4353 -14812 -6813 -3964 -13470 -50422 -73587 -64685 -23040
4780 -23040 -34368 -90140 -115668 -92860 -79708 -62552 -50833 -25719 15801 18462 12557 -19535
4768 -19535 -40645 -33990 -36120 -36422 -48419 -46654 -19658 8998 22616 2292 -17543 2133 -10269
4755 -10269 -42821 -31193 16478 33046 21363 7755 -6875 12590 68255 92048 89535 74658
4743 74658 41079 48305 55096 76474 35947 31772 38386 11345 -11877 -17327 -30527 -19323 733
4730 733 -5364 1457 -34509 -66146 -71512 -9986 41350 12376 -19990 15859 7814 16433 54107
4717 54107 34981 65506 59868 43788 55123 20497 -2559 -16042 -3998 13916 5280 15181
4705 15181 47198 77349 62389 23475 19100 25187 39163 26263 5072 -41320 -22633 -4802
4693 -4802 16859 11653 34874 53002 31001 4879 42763 42244 18739 2286 6294 -11898 20760
4680 20760 23098 16261 647 19128 -9079 -40351 -13475 -30875 -34935 18558 9839 25476 23061
4667 23061 5971 3703 6737 41650 70645 90245 77455 42001 -8938 -8129 4892 -27560 -53149
4654 -53149 -37617 -24157 -46236 -3058 471 16192 18099 12317 9638 -12282 -35189 -57882 -17287
4641 -17287 10955 2789 -1810 -12270 -34651 -44877 -4701 41878 54169 50302 122901 129313 84396
4628 84396 45424 62493 63696 12898 79 -712 -36900 -37186 -51002 -64722 -32350 -23439 3723
4615 3723 14280 7853 17506 18159 45071 44463 52152 52651 100832 38862 -24387 -8143 3735 -22316
4601 -22316 -20912 8081 45223 78251 61299 62300 41090 3050 -38215 -25929 -19075 -21328 -1942
4588 -1942 2680 724 -45023 -91458 -34570 -16066 24355 19390 18960 17091 33988 8269 2925
4575 2925 55575 66389 47490 31092 8435 4361 22023 28659 61563 61458 21280 9509 -8249
4562 -8249 -32944 -10187 17811 22468 20869 50229 77297 79580 64884 69527 46366 63108 51514
4549 51514 -18140 -60938 -49985 -13091 10409 -9637 -31257 -40795 -9215 -24752 -25801 -12212
4537 -12212 4102 -24080 -31533 -5061 -12224 -42653 -32400 -12210 -33300 -60764 -42164 -15900
4525 -15900 -13084 -28164 -38942 3063 19727 50434 48231 28353 -2284 -43184 -20899 5091
4513 5091 39607 31140 52372 43304 27956 36650 -7883 -16383 -16607 -36119 -29787 -46771 -38637 -40016
4499 -40016 -1194 37837 34344 49513 54085 37492 40762 80324 41894 -10361 -46212 8390
4487 8390 36960 -335 28519 24184 32794 18571 -28813 -26397 -39279 -79995 -79461 -50904 -33997
4474 -33997 -45934 12234 68959 65974 14727 4684 -5830 -36138 -35701 -4800 -21651 -25351 -30363
4461 -30363 -12173 14648 16328 17073 6039 -10328 -30083 -24119 -27384 -40182 -29729 -65117 -61688
4448 -61688 -53559 -32282 -15623 -41535 -31486 24718 21760 9215 41771 46951 7499 -51470
4436 -51470 -53344 -13124 26584 70449 63900 59218 50129 28108 -8169 21495 58147 1000 -11688
4423 -11688 21644 5 5940 20581 67518 71513 64983 56392 -3736 -16114 7989 21968 7748
4410 7748 18284 40216 72549 92586 118387 68426 47883 61944 23031 46807 45994 42299 47006
4397 47006 34068 -1492 4213 -4569 -20288 -330 9363 -2354 -12650 -13752 -23763 -20392 4376
4384 4376 27617 -13074 -20030 -25122 -62611 -77662 7805 52508 81180 80074 44836 4046 -52438
4371 -52438 -71073 -53915 -47471 -24629 -5907 -404 20411 -6920 -46967 -50910 -23167 -24928 -24263
4358 -24263 782 28384 28894 31954 46669 -736 317 -11280 -20086 -19181 14509 4010 9192
4345 9192 46430 29174 -17520 -39727 -102317 -120811 -156522 -167866 -97462 -64448 -2208 47874
4333 47874 68043 58090 33125 5590 12713 3304 11330 -16825 -14916 17281 -899 -19058 -14662
4320 -14662 19167 2920 12864 20594 8741 17254 3013 14034 24468 17156 3918 -37546 -19487
4307 -19487 -13721 -21517 -65461 -47048 -21201 -44215 -36721 17484 56778 71675 48133 51752 76707
4294 76707 78520 43086 38818 60561 10394 -4804 -256 25461 33696 7803 31181 -3279 -3144
4281 -3144 15028 28306 6527 21301 73031 41317 37420 64722 50541 14690 -52057 -73545
4269 -73545 -55547 -48935 -209 11136 -18401 -54613 2705 19499 46501 48579 24604 28634
4257 28634 4296 10183 -8851 -33588 -19452 1867 11484 35750 -5722 -34914 -15479 35354
4245 35354 52680 -17177 -68235 -43600 -28709 -30272 51730 88165 80210 29998 7177 -8771
4233 -8771 -29987 -1840 14399 26868 5221 10097 15294 3214 9813 -4565 -1221 -11665 -42417
4220 -42417 -46184 -42787 -28093 -14112 -14104 -20727 -2838 98 -17898 -5999 -5290 -37287 -7615 49398
4206 49398 59755 25000 3351 13868 -17138 -25375 12496 16539 -36433 -33020 24162 89746
4194 89746 87896 7418 -13534 -14488 42378 47689 11328 -4432 2619 13079 8241 22954 22578
4181 22578 31419 38146 51674 38194 4936 -8324 5591 -12585 -7550 -13851 -12893 -2847 26471
4168 26471 26860 -1468 -14180 7256 7351 9526 11115 -4821 -21539 -12722 -46199 -17520 -10298 -19030
4154 -19030 -2866 -1388 -17313 -37967 -53134 -47914 -36167 -32081 -8967 -5612 2363 25803 -1400
4141 -1400 -24995 -47510 -101706 -91848 -55406 -19229 4262 -1299 31980 46024 58764 37008
4129 37008 29780 52125 30221 26480 36523 54466 38651 16734 24375 -15164 2574 -395 -16177
4116 -16177 16935 6311 -33465 -50480 -3460 10687 -16109 -55934 -15694 -27322 -37673 -67475
4104 -67475 -75121 -16976 15890 24513 29135 16946 -18457 -33358 -7546 14816 53646 65705
4092 65705 83131 115066 78995 52204 29799 7948 -5466 -9914 -38469 -37361 -20838 18088
4080 18088 57410 53311 61188 60172 50387 24416 6240 -20321 -35863 3940 6427 48147 14459
4067 14459 -21628 -35963 -18235 -47216 -34213 -40321 -11414 15038 -12263 -6407 41307 48193
4055 48193 23910 22567 -460 11915 -6206 -12827 -30359 -17272 20917 10498 13092 14705 33786
4042 33786 16649 -17593 -10223 -44529 -38516 19577 50141 35897 15920 10559 36328 70417
4030 70417 55150 18501 -18785 -69329 -55347 16539 28335 -16883 31520 59424 -5082 182
4018 182 18675 23338 39398 1255 -49238 -31796 -40257 -49696 1698 -16368 -21069 -10655 21119
4005 21119 27616 -7756 9672 35188 39435 15368 6664 -25981 -6012 10551 -706 -15169
3993 -15169 -37450 -34416 -13158 -17746 -50977 -19128 -5427 -549 -7551 670 -20850 -22070 -67182
3980 -67182 -64457 -34643 -11230 -16014 -12382 -15991 -6244 19049 -6738 -10906 -14702 -96 -33764
3967 -33764 -34967 3522 25006 28792 19456 9957 5004 31624 56955 -8064 -47706 -20300 -4871
3954 -4871 -7364 10377 -6426 7226 63191 53203 30376 -29496 -79269 -101300 -80835 -84259 -61182
3941 -61182 -45073 -18041 7987 -32063 -22601 885 -34285 -9322 27355 9951 35465 47854
3929 47854 77852 116309 132454 113774 40679 12282 -15908 14012 57518 49318 27783 7500
3917 7500 -58142 -86732 -37576 -35445 -58711 -42965 -32958 -27927 -15774 16582 19816 -2480 -30973
3904 -30973 -27299 -35197 -19397 2481 -7706 3602 2463 11676 31873 24502 -6051 1573 -7099
3891 -7099 -43180 -108900 -127649 -73515 -23464 19770 2951 -62800 -62858 -22451 58167 54779 28520
3878 28520 -13256 -25371 -37227 -33915 -48918 2433 29548 12332 743 38430 38002 17018
3866 17018 -40826 -31622 14419 81736 83017 44405 16377 -3488 -29361 -14002 12083 -6221
3854 -6221 -37149 30932 80557 43941 -11418 -46480 -11783 28454 24626 53686 29408 12812
3842 12812 -2601 -34547 -80592 -65757 -33 -2083 7190 -1819 -27804 -32216 86 49341 35183
3829 35183 12695 2638 4334 5836 -11978 -24207 -25164 27678 51458 35984 14259 -22417 -49162
3816 -49162 -43346 -49184 -44480 -26625 23791 45415 15367 -7350 -20958 -14300 -13354 8119 4380
3803 4380 33016 52986 79555 46560 6885 -5286 -15976 -52005 -58921 -72100 -41562 876
3791 876 28776 -9070 -8426 21633 22044 55618 75465 98770 48165 41303 38071 31649 32200 40179
3777 40179 33726 35682 6714 26586 57399 68116 14069 -31126 -22664 21547 55262 39437
3765 39437 30151 10142 -4658 14132 10374 -3901 -7129 25286 4982 -16734 -8810 398 -8407
3752 -8407 -18736 -45075 -3079 33554 47979 10197 -35830 -54624 -1897 8753 16538 915
3740 915 -10558 5260 31121 42124 15661 14368 33157 24376 11717 -3369 -43748 -3182 11583
3727 11583 -3302 18356 37447 41892 53404 82086 69275 67690 87395 117733 98149 39519
3715 39519 -19106 13662 61653 19789 22668 16240 51949 41143 26758 22465 17831 -22483 -58419
3702 -58419 -88499 -42618 16693 52956 67892 15919 -11286 -10604 27463 28741 3495 -10934
3690 -10934 -36986 -42927 6801 24209 21006 27498 10812 16495 13842 14242 -13358 -86884 -61257
3677 -61257 -37320 -47754 -62664 -61677 -49143 -10675 16330 38158 13848 714 -10927 -44968
3665 -44968 -50105 -50106 -62731 -46104 -30006 -48791 -66822 -62285 3198 46058 40151 30572 2187
3652 2187 9373 40201 49582 21229 7313 38407 46793 14339 37316 18171 14850 57778 72766
3639 72766 77842 72784 31599 53438 39117 8478 2917 -25205 -32227 10885 8247 11773 -6658
3626 -6658 -2995 32806 35338 33651 36566 50127 2160 -19061 -54632 -56387 -27710 -31740 -56232
3613 -56232 -22795 -5829 -17068 -33706 -36297 -18789 18986 3008 -28086 -39012 -25365 -26678
3601 -26678 -56057 -68129 -61672 -28865 15367 33948 26870 -18807 -26199 -31877 -21843 18970 47406
3588 47406 36823 -6397 -31348 -17513 -16150 -30541 970 11493 -42191 -53139 -44007 -47458
3576 -47458 -29937 9342 32979 13267 -25967 -47319 -78929 -32217 -12814 -23593 -9729 -18532
3564 -18532 -5304 -30821 -35726 -3868 14686 1173 -7669 -12522 26902 88003 118327 93300
3552 93300 57055 39625 17896 -424 12515 -2075 13770 44652 67202 53457 68153 20377
3540 20377 2279 17421 8460 -22357 -40895 -24855 21289 46672 25932 8702 -12969 45446
3528 45446 56063 15761 -7005 -21513 -4427 25003 1904 -19272 -58212 -44512 -11534 -3175
3516 -3175 12287 35370 53249 27895 -1187 -39341 -49178 -70793 -76960 -35987 -38256 25751 59527
3503 59527 22775 -3475 -32224 -64179 -38972 -28283 -24344 26583 99289 136960 86782 56654
3491 56654 33209 40488 15440 -44871 -31464 -29529 -4965 27067 14398 27476 42507 37111
3479 37111 29869 9472 8660 -37197 -30579 55539 40303 11735 21747 64310 98737 89631 72597
3466 72597 60020 14054 -39060 -69364 -41409 9666 36737 50874 69022 38422 17289 7476
3454 7476 32160 55704 9703 -13971 -15277 -26009 -35314 -49177 -52692 -46785 -22588 -33066 -73632
3441 -73632 -71353 -50857 -26356 -1996 11808 1632 -7215 6765 44974 12781 -33761 -34934
3429 -34934 2344 9044 32317 40912 29376 20002 8283 -392 -609 6413 12770 14425 13770 17330
3415 17330 12157 -6178 11979 50918 36677 1124 -4352 10724 35431 60169 56317 57292 67237
3402 67237 35169 8155 9959 -39163 -53734 -55812 -11378 27217 49895 55920 45211 20451
3390 20451 -7899 -3867 26841 19412 30591 39632 9605 -29334 -11806 1390 31411 31805 41803
3377 41803 54559 22192 -8875 -22832 -31252 -61549 -39825 -32535 -49093 -49629 -16588 -6451 -19612
3364 -19612 -1151 -11998 -72052 -59033 -54533 -26803 -12594 -29087 -34146 -30738 -18629 -38813
3352 -38813 -94375 -73942 -40128 682 14992 -16484 -53676 -59759 -42843 -44184 -42382 -50469 -57433
3339 -57433 -48669 -55853 -63819 -28696 -3258 25807 15286 -7786 -37990 -63999 -76136 -66232 -39078
3326 -39078 -33134 -806 38806 20670 5080 571 3047 10845 -23432 -14757 18083 -30102 -41778
3313 -41778 -52352 -58850 -44153 1645 31074 -13628 -45164 -69704 -97860 -46808 -13795 -29492
3301 -29492 -43206 -33582 11230 16645 -4908 -5896 -29579 -16650 12488 1587 -2535 -31409 -43993
3288 -43993 -35001 -45028 -52231 -28955 -3114 24553 36023 32690 -33469 -38171 -23273 17666 19516
3275 19516 6419 10262 1717 10026 25601 19284 -16664 -36863 -53103 -81493 -61437 -12637 14256
3262 14256 5682 30147 34857 -6343 -44906 -29647 -4557 -5240 -7746 -14708 6860 -7087 -34648
3249 -34648 -23223 -38534 -72081 -91321 -99491 -66426 -20037 -10754 -12785 33881 53603 2544
3237 2544 -29515 -44235 -88429 -106036 -125095 -114835 -36384 -686 6594 754 26142 25658 -12374
3224 -12374 -25496 -2869 -2235 -19046 -24504 -481 -49398 -71674 -33376 -7852 -14541 2617 28236
3211 28236 17799 -27584 -38861 -38708 -25397 -18217 -40633 -32831 -6041 44546 37279 37176 41611
3198 41611 52549 19406 -11585 -16550 -21807 -9575 18856 17252 1199 4384 -5205 12531 14877
3185 14877 38074 30267 10032 -5504 -20307 15614 23468 2410 -22093 -19707 -11078 -21134 -6780
3172 -6780 39579 59547 42393 64599 63277 55362 10984 -1623 17814 42436 6965 -38404
3160 -38404 -90628 -65588 6882 14451 36143 41084 6213 -25380 -14034 24759 33738 6138
3148 6138 -46163 -53903 -18053 3207 -18016 -20694 -1384 7228 45739 109719 123492 116941 59921
3135 59921 64303 131183 70752 72 -14269 8406 10913 38688 46635 42145 39939 12271 -8040
3122 -8040 -16468 -40807 -21378 -21881 -28957 -31521 -15928 35093 16879 -14631 -26870 -36110 -13272
3109 -13272 25048 38081 13056 -12697 -26678 -50024 -80436 -43232 586 23065 27878 11980
3097 11980 -21848 -61868 -68719 -53938 -47765 -67755 -31755 -1942 13203 40360 106131 95991
3085 95991 23614 -1648 8185 51377 38654 10885 3840 -635 -33150 -15377 11096 19681 -7629
3072 -7629 -43333 -47274 19113 29088 -21554 -33273 -23613 1945 10294 -20630 -53802 -41271 -6580
3059 -6580 -24791 -2402 4400 -8232 -6236 -42615 -20151 -5546 -31604 -71058 -29877 -8665
3047 -8665 -52025 -34146 -58736 -52069 -12135 -22353 -49012 -67358 -31687 -6382 19271 46052
3035 46052 39884 -47856 -90207 -51953 -35142 4017 34809 31495 11460 -11173 -45058 3107
3023 3107 12650 6314 -6289 -11462 -9447 -19663 -54491 -66258 -2232 19223 21678 35503 72104
3010 72104 105791 48810 -6892 13897 5821 -14709 -32028 -52339 -78043 -66472 -17493 32588
2998 32588 14652 21475 26099 35382 50788 15196 8919 -27314 -102318 -82953 -65590 -69775 -81360
2985 -81360 -13656 66152 140107 126341 99575 40301 -45611 12901 61122 33978 8678 14622
2973 14622 17902 2878 -17854 -52992 -57316 -58602 -54990 -33926 -22173 -63873 -48525 -41519 -25344
2960 -25344 15125 21436 22079 -20625 -56451 -24668 30017 72156 51905 43720 64179 67869 31632
2947 31632 32660 17052 9019 6263 -31883 -23341 -8715 20136 29024 19951 -16994 -5195 18787
2934 18787 54198 54553 26624 34771 47299 -2820 -3466 16123 -7032 -748 1783 12304 10350
2921 10350 -7384 -29878 -33892 -26665 -35203 11358 45828 -13709 -38901 -77460 -75811 -8501 11996
2908 11996 -22434 -57980 -57124 -26251 12663 -2883 3160 22801 63352 60210 66423 65585 1802
2895 1802 -5607 -13541 -28096 -28384 -33924 -34111 11456 31498 -1703 21802 12653 -1566 16260 -63613
2881 -63613 -33303 -2212 -25369 -32341 -46670 2799 36539 26067 32760 61507 79976 49584
2869 49584 -24269 -21761 -44945 -85162 -99454 -46562 -47392 -51807 -18931 27647 56238 68961 72916
2856 72916 61565 -9303 -10953 50465 61955 30899 -14358 -25482 -11808 6595 8111 16444
2844 16444 29409 36526 46265 49166 53644 28225 35759 22360 18384 36783 37201 11852 -235
2831 -235 -35137 -50615 -40369 -41389 -38691 -47391 -19544 -15604 14555 58271 22488 6430 10872
2818 10872 19512 30194 7490 -14329 4618 1733 4060 -15961 -19721 -25685 -20977 16532 68484
2805 68484 57546 34877 60381 48108 40652 59196 66053 62694 90816 90962 89433 28260 22859
2792 22859 9294 16107 20718 9567 -52665 -40246 1488 -3737 -28516 -17333 -24935 -1946 -32413
2779 -32413 -67164 -64085 -46529 13707 13772 -37981 -21759 -2033 8783 -8403 -15030 -14168 13282
2766 13282 1242 -9116 -8940 7640 24955 41501 29828 -301 -39818 -81875 -48354 12455
2754 12455 29063 874 -25180 -42032 -43784 10681 40466 34216 28002 -21696 -32796 2886
2742 2886 22674 6245 -28168 -680 25725 64802 33573 -12917 -43327 -51492 -70829 -41718
2730 -41718 -26256 -28563 -60704 -45010 18959 42567 -14698 -60487 -84260 -46121 -16544 7384
2718 7384 -1071 1051 -19019 -23647 -32718 -2243 22252 25676 11900 -4583 -19106 -39315 -39867
2705 -39867 -2419 -8661 16275 65914 76647 85011 40629 811 -12901 -28762 -13022 -36293
2693 -36293 -37168 -2507 45289 47082 14729 23651 26219 54260 96268 67964 67990 10255 -25844
2680 -25844 -9869 19502 25513 31212 7981 -22582 -32307 -31146 -18633 -50943 -64567 -73903 -103333
2667 -103333 -79160 -50335 -26377 -26777 -43750 -57770 -38634 9074 -16222 -28725 -30838 -49490
2655 -49490 -16339 9121 -2211 4161 28431 7787 -19290 -33295 8099 12214 13496 21439 6994
2642 6994 17880 9883 15796 -1698 -9286 10285 -3940 -39417 -33635 -10304 -23613 -29697 -35311
2629 -35311 -17693 5326 -13125 31016 19424 9578 20713 12303 10763 28271 2469 28656
2617 28656 39871 48962 45042 60967 50677 -6693 6436 -20534 31131 93075 73256 32267
2605 32267 24313 58645 44345 43101 23440 -10841 -3463 7343 -37782 -64361 -104831 -136434
2593 -136434 -82435 -24327 -9395 -29434 -42243 -65343 -90947 -83361 16560 42777 16374 3008
2581 3008 29974 48480 66003 38723 28121 -1804 13344 -11599 -17710 2239 -24513 -45224
2569 -45224 -9121 19774 39425 31574 17518 3460 -18817 7732 13617 63778 72842 47636
2557 47636 -2857 -9858 -1350 30071 14534 -17265 -21445 -9770 -15644 -40759 -39673 -2791 14349
2544 14349 8895 -4641 -15315 -38317 -41762 -18233 -13529 -29410 -54929 -65350 -58507 -50767 -45273
2531 -45273 -7453 23558 36184 27679 27676 37581 31913 30301 35343 42459 7546 16341 36209 45620
2517 45620 51946 17889 -7362 -17802 -35110 -58707 -33793 7961 26305 7575 -27827 -41973
2505 -41973 -19682 -43866 -63146 -53466 -67310 -100214 -38047 -5720 14350 -13745 30516 32205
2493 32205 -8193 16622 42362 11329 2086 1714 11966 7046 8493 32048 30638 8701 14638
2480 14638 44208 49866 18680 -1862 -18708 9146 28508 21379 -5681 26800 37047 26485
2468 26485 36224 1152 -11165 12644 39247 47764 42517 32394 -2950 -25903 -24397 -57064 -64543
2455 -64543 -48621 -40672 -77878 -82297 -27122 -15439 -28534 -27245 -21279 7057 12982 8605 -6268
2442 -6268 -24104 -45638 -31957 -25678 -4980 9181 24117 69669 75058 40804 32409 22028 -5159
2429 -5159 -22826 -24675 -20925 7521 13611 27351 40625 51178 23747 -25528 -13654 -9021 -3760
2416 -3760 -44945 -79303 -99875 -86290 -36993 -6683 19704 -5671 4608 -9805 -6477 3828
2404 3828 -22443 -38635 -7911 18244 14150 24081 -17997 -44146 -13996 22571 -13259 -6185 -24437
2391 -24437 -6796 7309 -16157 -20942 -37834 -63262 -51538 -25310 -33655 -95945 -73814 -33772
2379 -33772 -22179 -21911 -14304 3607 35526 35679 75832 54511 9522 34789 39913 14958 20351
2366 20351 22316 35043 68279 69114 59537 44111 17150 -63704 -98882 -83361 -62616 -5221 -2486
2353 -2486 -6222 -4352 -13763 -11293 28413 66983 64290 40004 6725 -54198 -75283 -60732 -21116
2340 -21116 17963 26422 19385 -19738 17248 18218 -39052 -97461 -74238 -63794 -69575 -41018 -23493
2327 -23493 -2937 23397 -9912 -3005 7682 10295 -10803 -44171 -4818 -2258 -35299 -40155 -57450
2314 -57450 -76080 -100599 -57337 -44968 -2336 58450 79570 40461 2082 -17085 5311 31981
2302 31981 -3454 -18302 33729 61133 43187 46923 62190 51740 60425 15388 -7308 -25710
2290 -25710 -29730 -5014 -16534 -49698 -13658 8408 -3116 1098 9800 4200 7793 -12791 -17158
2277 -17158 4221 36899 21080 33111 44739 37962 48239 23740 7506 11769 22834 9581
2265 9581 -27530 -37853 -13150 -6841 31233 56257 21533 2343 -31916 -21560 20306 60083
2253 60083 63694 75521 53814 9521 -19398 -7194 8486 -5596 -7525 18180 14320 6021 6403
2240 6403 1748 -7588 5263 21833 32385 41689 41886 31471 14991 20298 406 9559 36681
2227 36681 67273 38211 24294 2903 19232 60791 36301 24152 16030 10352 1664 -9152
2215 -9152 -14451 -19894 -5824 15447 7091 -31649 -44265 -14272 70264 55785 12501 19461 22902
2202 22902 21564 -14433 -21416 4710 38049 59775 63807 74459 52920 26445 -21218 10454
2190 10454 29681 32469 58096 77522 71295 15961 -10960 13895 23213 31081 30078 -26824 -36077
2177 -36077 -35856 -17456 23406 -1838 -38050 -8135 8870 23788 -11301 -52359 -61121 8614
2165 8614 11478 43540 46556 7816 -8408 1878 32313 14810 35213 4179 -43618 -4028
2153 -4028 40832 47079 40589 36307 25937 52555 76271 32446 -11618 3499 10591 9253 9757
2140 9757 10345 10047 -14272 16557 37196 18693 -14683 -42255 -62848 -88566 -86936 -55366 6444
2127 6444 20802 273 -29802 -27556 -32064 -26106 -39582 -21116 -822 3175 3123 7035 -26460 -41712
2113 -41712 -34818 -16405 -17052 -60641 -73966 -23400 -28977 -1367 20008 -25051 -14644 -13992 -25705
2100 -25705 -18140 -10961 1952 6974 56937 55690 27371 9042 -37085 -67220 -60445 -51614 -82268
2087 -82268 -59595 -71840 -68903 -19881 2323 -11359 -21851 -40737 -16649 3596 -3262 -4213 -14612
2074 -14612 35446 59845 60348 28660 -280 12840 1919 -11889 1434 -6607 -17762 -19401 -3361
2061 -3361 11534 25185 52866 33849 31964 51046 27463 38154 54744 20658 9500 13971
2049 13971 -6636 -15258 17895 -13781 -53660 -73322 -59813 -75339 -43791 -22990 -71825 -92521
2037 -92521 -63117 -72043 -30607 15534 -9792 10637 43900 59951 62061 43303 22272 36945
2025 36945 27543 -4393 -7292 8104 -751 12505 19052 8551 -4023 3165 -5491 2230 2671 -29666
2011 -29666 -20490 -4764 -15436 -44728 -19551 -9923 -11236 -44569 -50665 -58699 -27528 -19220 -26369
1998 -26369 -2742 44084 44501 10804 -11334 -31210 -41764 -22590 -12091 -8313 -19984 -49247
1986 -49247 -29061 28635 53308 84128 91140 55680 36230 4867 -1539 48764 71540 95409
1974 95409 96777 69369 36607 -8705 -10507 8845 -29484 -55086 -50974 -49683 -15687 7549 -7582
1961 -7582 -17113 4845 23456 5181 -42780 -93593 -107768 -68835 -5563 7348 2010 -26090
1949 -26090 -37066 -17605 -16949 -10838 -16467 -16441 -19638 -20431 7047 23420 24330 -6043 -34823 -66636
1935 -66636 -45608 -36322 -23020 31487 57793 55523 77264 39222 -7967 -1513 -32978 -68179
1923 -68179 -35664 -28679 -45368 -38561 14367 46614 48783 -9266 -34302 12790 64231 55809 68759
1910 68759 26750 -1338 -8926 -12789 -57232 -28349 27444 34206 -4958 -9113 25537 15421 18345
1897 18345 33014 21807 13527 32909 52898 42722 4129 11973 15598 -13400 -18140 -27484 -23075
1884 -23075 -25471 -40062 -55754 -24260 1094 -666 16783 33276 15518 7424 3158 9055 25051
1871 25051 41811 -15238 -11725 71691 79687 48300 20787 25855 64419 121910 117391 76293 19878
1858 19878 -16726 -26289 -10438 16132 17676 2068 22957 50272 24655 -14759 -11195 -29217
1846 -29217 -22665 8274 21914 -15565 -2459 25807 15389 8754 27169 23313 -6051 -27981
1834 -27981 -13105 5292 16601 4078 -7592 9324 14047 508 4182 -19978 9220 11293
1822 11293 -32073 -43794 -46565 -26999 -30445 -4097 -49890 -100566 -90082 -58288 -89165 -109169
1810 -109169 -52659 -47703 -74992 -52933 43881 39560 -8710 -33376 -41340 -25577 28939 71611
1798 71611 59126 27419 -7886 -4496 -23219 -66882 -50154 -26472 -14904 -42530 -86174 -38471
1786 -38471 3432 19204 15168 -35628 -79456 -69124 -43019 -40670 -53100 -64274 -44646 -83374
1774 -83374 -84383 -14551 20124 34311 9499 -2558 16918 25579 33834 37201 48008 82527 50992
1761 50992 22056 10366 11826 31225 66388 80843 83819 40646 50353 21516 15567 24151 25654
1748 25654 26822 -58519 -91089 -43633 -18115 -15137 -15646 -21102 -30906 -48547 -53893 -24843 -15281
1735 -15281 -17697 -15384 -54849 -29357 -21312 -35160 -18807 -2374 -798 -1389 12153 -3560 -15562
1722 -15562 -12916 -57290 -39508 4946 21479 27322 -11161 -38210 -64910 -72596 -32965 -50547
1710 -50547 -37175 9062 41546 60448 72822 67619 38007 -27300 -47841 -17522 -23806 -41261
1698 -41261 -34028 -12965 7343 20955 -21926 -9414 14818 5158 8547 50405 61853 41131
1686 41131 761 -33483 -21383 3891 14255 11187 15900 14233 3189 11265 -1905 -1415 26752
1673 26752 86385 55233 47851 9085 -45505 -10060 22579 36624 47521 39781 26673 19804
1661 19804 -7860 -39220 -80964 -103956 -92775 -105079 -68179 6369 8360 9408 -44313 -71676
1649 -71676 -64305 -42944 -25528 246 54330 26552 19660 11042 -16023 -21512 11481 24638 38712
1636 38712 29564 -12652 -33531 -24209 -41430 -55421 -57551 -37365 19052 39800 53322 37070
1624 37070 -43250 -42820 -25890 -28314 -33661 -43052 -16641 5582 54135 83356 86142 34076 -25589
1611 -25589 -49294 -31802 -9777 -28788 3110 34322 27460 27604 17892 42587 91145 77274 55747
1598 55747 50434 7956 -17495 -39363 -3751 5161 2538 16354 -2167 -25712 -20035 -36205 -65896
1585 -65896 -54436 -44997 -45130 -29151 -5218 -31924 -49123 -38186 -36088 -33175 -13402 384 12919
1572 12919 11908 -21358 -45411 -29651 -19103 -28092 -15253 -41763 -48934 -51183 7657 21429 23028
1559 23028 1408 -2044 776 5101 -3293 -25190 -28060 -42418 -68980 -25113 50617 39493 37591
1546 37591 33178 44111 41376 44267 52803 38521 13385 14601 -12354 -1280 9928 40566 30586
1533 30586 -16629 -14048 10364 31632 31525 26178 64957 73032 50769 10949 -37571 -30787 -2754
1520 -2754 19157 27883 13666 -24668 -45391 -9007 -123 -8547 29386 31452 -12194 -19601 -21556
1507 -21556 -4738 -33117 -51902 -32520 -12444 -553 4947 -3420 -26263 -19629 8038 -27053
1495 -27053 -33452 -25270 -51975 -44803 -23430 -53681 -59857 6737 35480 9754 -190 -30626 8509
1482 8509 18002 28007 34531 61379 38119 -31314 738 43338 59736 60593 49748 44302 38721
1469 38721 21659 13303 32395 44590 53987 10318 18447 85997 110319 93731 119597 133310
1457 133310 111363 84274 55190 41264 21221 14796 26639 9795 -22601 -44062 -72637 -98093
1445 -98093 -84528 -35146 -7188 -17863 7114 72856 101513 72029 35171 -770 -40958 -32223
1433 -32223 -5958 35530 14061 6495 44197 64353 50280 26161 25239 -5634 -15788 6396
1421 6396 46119 31619 54274 58282 43403 63454 52955 38346 51047 42868 26292 32431 -12451
1408 -12451 -9126 18811 16389 -9844 -23408 1549 18693 21743 54409 72939 64859 17947 -18755
1395 -18755 -38714 -29827 -27247 -30136 -8410 22302 26288 6899 -41405 -57590 -37372 -16320 -42790
1382 -42790 -40945 -10592 32019 43694 52063 97913 78559 54729 70305 57794 33230 45107
1370 45107 33156 27262 8478 31433 64370 66967 49597 24449 9325 -9885 -21124 -6804
1358 -6804 26827 20892 -21982 -38862 -40228 -10312 13479 45697 54969 40714 37850 7407 -3022
1345 -3022 18238 35675 66799 37570 36400 50982 -2792 -32978 1478 2498 -12789 23220
1333 23220 23647 25734 -7392 2908 14277 -2732 -41800 -47759 -31138 16666 23661 747 14788
1320 14788 58206 38491 22608 51355 49572 65858 33340 21937 50700 43584 9494 15582
1308 15582 25096 11097 -11604 -16495 1565 18018 28340 55146 58261 48467 73024 92639 94967
1295 94967 61610 54855 49543 32419 28203 24786 -33512 -25841 -50434 -17749 -13196 -31798 -29045
1282 -29045 -26052 -30786 -31457 -40861 -16448 10460 39091 19936 27229 35071 -1558 23201 52162
1269 52162 33852 19266 -1519 -8727 5802 1309 -34997 -68981 -84627 -88075 -40918 735
1257 735 28634 56105 34543 13126 14920 48697 82563 78934 97187 82839 70392 -1098 -17431
1244 -17431 16147 26286 -5338 -1406 -19294 -24712 2366 -2771 9933 39582 9709 -2180
1232 -2180 -29814 -32794 36136 32474 2632 -12055 -8066 -27267 -57452 -89062 -91619 -61476 -39503
1219 -39503 -61934 -88421 -42074 -19836 -21218 5224 -3635 -41064 -52790 -44693 -27083 14476
1207 14476 4543 121 -6166 9736 7925 53260 29257 11962 -16886 -9427 1841 -4239 -4268 9782
1193 9782 -5416 -74127 -103610 -79099 -24662 5952 4209 943 -26525 -45799 -9868 -24833
1181 -24833 -14353 45550 40572 58185 63555 76940 60572 20349 3827 27770 25056 -2849
1169 -2849 -11575 7443 10349 40620 85873 37342 -12942 -84723 -88419 -28813 5577 22567 -28000
1156 -28000 -75193 -46112 -44810 -47070 -24252 -53342 -92026 -56057 -25265 7683 25219 7154
1144 7154 29168 22770 -1598 -5184 14278 57830 43852 31944 16115 945 16207 -22467
1132 -22467 -16836 -7374 -35050 4967 12752 24294 33239 8954 4534 111 25823 18544 32046
1119 32046 23420 -34389 -52297 -57957 -27622 -719 3258 45768 76348 23576 947 -19930
1107 -19930 -34611 -19970 1277 6199 35324 46858 -152 -33064 -57433 -38748 -24524 11456
1095 11456 -15960 -48348 -84766 -35470 15530 28390 14392 20042 25151 54359 52032 69474
1083 69474 68752 108086 94193 36571 14163 -4287 2634 16811 13297 -39462 -36528 20165 29682
1070 29682 1865 8545 44770 52450 8533 12066 -11053 -53663 -97938 -87368 -67116 -77227
1058 -77227 -33936 18666 2439 -26987 -7334 -15112 -32100 -64946 -43835 -55285 -53674 -279
1046 -279 -5304 -34463 -7347 351 16063 29125 -25833 -58025 -57722 -16249 -14791 10427 20599
1033 20599 19830 51481 24449 12879 22606 14468 3226 4093 33345 23097 -2166 -14777 -23875
1020 -23875 8422 56940 63280 67944 48479 33234 -383 1458 -8906 -22296 3570 17554
1008 17554 19483 15722 28235 -13609 40206 59902 85726 92431 26404 -23511 -51355 -50150 -21978
995 -21978 1590 38300 79641 55177 26491 24211 57649 91383 84138 44356 24158 29527 40056
982 40056 41788 35454 47908 51283 77292 76591 72101 36595 6258 16226 36896 14745 -13782
969 -13782 -21732 -49927 -56457 -15918 12465 35432 26218 -13815 -47976 -10842 18404 25772 32627
956 32627 13703 -5061 9345 37818 51296 65287 33392 27461 13925 27876 50859 42183
944 42183 38923 41692 38009 -19763 -6141 30128 17973 -21238 -19700 -48541 -51057 -16993 -2610
931 -2610 3296 20360 48662 77215 108172 64115 2620 13344 28416 25921 4205 21556 54520
918 54520 29405 -682 18072 50146 39038 32633 23717 -13403 -9040 -11333 31081 43432 49359
905 49359 80606 109097 69576 20857 171 33425 61783 73559 70588 81767 85709 59293
893 59293 43655 263 -32721 -48905 -18378 34815 48689 6118 -52131 -34775 -24720 7620
881 7620 6765 -22935 -34515 10839 46656 49312 39494 36803 31630 -1255 -22603 -21357 -34533 -39587
867 -39587 -32980 11387 28731 24617 46668 62453 18848 -13433 -14255 -3080 -23145 -1243 -18010
854 -18010 -32210 -348 -17989 -38626 -35711 -30627 13888 16916 12013 3992 -46056 -36005 -12567
841 -12567 11408 18910 3398 -17264 16099 16994 6792 1224 -15793 -5639 -17307 4854 47284
828 47284 44567 37446 3750 12320 37133 28535 23156 -10365 -13778 -26653 -40633 -22815 13248
815 13248 65118 59579 72429 86295 65868 35991 16487 19603 35051 57544 50971 60954 66252
802 66252 40623 24693 6867 7358 27429 28229 48983 -3989 -46343 -47112 -36205 -7501 2693
789 2693 -30097 -9520 -17435 -11754 10571 21329 45691 67131 82172 98168 81163 87957 104503
776 104503 51298 41785 52903 28169 1088 6578 34418 29815 5017 6526 45725 34848 -4852
763 -4852 18171 13369 -1223 8057 25229 10998 -19159 19026 4613 -14752 13225 43307 25869
750 25869 -2780 -17231 -36429 -50967 -29234 1200 15624 27939 7709 306 35610 28149
738 28149 11104 28982 29173 37149 44990 28643 -20224 -8534 -22496 -6325 34808 18127 -13764
725 -13764 40853 48401 47545 31455 -25457 -14080 22057 71551 106072 109925 60626 71287 85476
712 85476 64740 34737 18279 43179 56823 54217 25874 24064 40093 57047 50191 23967 -16398
699 -16398 478 1456 19107 45193 68842 61333 44013 6389 -29238 -55205 -75870 -58709 5898
686 5898 7878 -2042 14710 26888 -13393 -22170 -3048 -18156 2634 62395 76575 99846 108308
673 108308 131975 148085 129268 121751 94517 62732 61018 60666 49221 31380 42577 70185 82967
660 82967 62947 35588 25549 16724 -14190 -22345 9733 56178 74795 65551 64159 26098 41769
647 41769 48561 35049 602 -10186 -16045 853 18437 10920 -6954 -13720 7981 -3420 8458
634 8458 24742 4980 6863 12448 2943 1958 -30106 -64484 -63724 -87963 -83643 -19836 23982 23788
620 23788 20444 -837 -3445 13053 32213 45206 61764 30366 -19267 -5168 -7039 -10491 -14776
607 -14776 1396 14060 -2880 -32178 -13838 14615 39890 59556 41644 70936 80291 86094
595 86094 132873 153786 103127 126296 127930 86905 45102 -18597 -23465 47223 61019 74818
583 74818 122788 151012 92019 62002 70908 34895 35261 58639 32772 29281 42734 57189 81429
570 81429 88975 70782 37511 10822 -13146 27588 17720 39593 6300 -8263 6441 25941
558 25941 -13715 -40576 -45659 -14716 43079 57112 6275 10687 53603 30208 555 9417 6735
545 6735 32089 10828 -30226 -26783 -34713 2360 9278 11360 20137 36823 82191 91654 43961
532 43961 19750 15218 -15199 -39918 -3838 10597 -19224 -5156 32246 41035 18188 53693
520 53693 61760 35471 41893 74696 84336 120121 126188 66278 21583 32074 115 15551 26666
507 26666 16997 42573 53169 63874 68838 56283 31168 19386 27094 52032 53277 67067 62595
494 62595 62293 58633 25117 32025 41648 4556 8182 13345 -2067 -17972 7282 25390 39658
481 39658 20137 -51922 -37180 -32172 7242 24840 20673 29931 22699 35233 49284 40931 59052
468 59052 70428 61948 47713 13542 32418 56809 83831 61710 22920 -27124 -39388 -60611
456 -60611 -67667 -71700 -20758 -29525 -42281 -54260 -46228 -74527 -109541 -72018 -80829 -50135 21359
443 21359 59982 62917 64196 46045 29224 14472 -8483 -62239 -24098 33429 25910 22798 42573
430 42573 44187 7352 9822 22725 35402 9013 16363 38564 29813 35552 17497 23353 10248
417 10248 -20835 -19137 9140 42481 48751 45489 7989 19354 37562 67681 56736 19749 6340
404 6340 21663 1511 26423 11525 36384 42910 33989 36397 59181 47670 30287 18957 57297
391 57297 80275 98683 105395 67286 10984 -21649 -18621 -9312 22404 33511 39167 38045 44492
$$ [...]
##END NTUPLES=NMR SPECTRUM
##END=
