##TITLE=Analysis number 317611
Compound Code cc 45404
Book Reference 440/150
Project Code adrs
Chemist Name craigr
##JCAMPDX= 6.0         $$ Bruker NMR JCAMP-DX V2.0
##DATA TYPE= NMR SPECTRUM
##DATA CLASS= NTUPLES
##ORIGIN= Bruker BioSpin GmbH
##OWNER= nmr
$$ XWIN-NMR		Version 3.5
$$ Mon Feb 27 10:39:51 2006 GMT Standard Time (UT+0h)  MAYBRIDGE\nmr@NMR_250MHZ
##.OBSERVE FREQUENCY= 250.131544655141
##.OBSERVE NUCLEUS= ^1H
##.ACQUISITION MODE= SIMULTANEOUS (DQD)
##.ACQUISITION SCHEME= undefined
##.AVERAGES= 16
##.DIGITISER RES= 18
##SPECTROMETER/DATA SYSTEM= dpx250
##.PULSE SEQUENCE= zg30
##.SOLVENT NAME= CDCl3
##.SHIFT REFERENCE= (INTERNAL, CDCl3, 0, 16.4617)
##AUDIT TRAIL= $$ (NUMBER, WHEN, WHO, WHERE, WHAT)
$$ ##TITLE= Audit trail, XWIN-NMR		Version 3.5
$$ ##JCAMPDX= 5.01
$$ ##ORIGIN= Bruker BioSpin GmbH
$$ ##OWNER= nmr
$$ C:\u/data/dgb/nmr/ADRS/16910/pdata/1/auditp.txt
$$ ##AUDIT TRAIL=  $$ (NUMBER, WHEN, WHO, WHERE, WHAT)
(   1,<2006-02-27 10:38:59.26 +000>,<MAYBRIDGE\nmr>,<NMR_250MHZ>,
      <created by zg, POWCHK disabled, PULCHK disabled
       configuration hash MD5:
       84 BC 41 DB A1 6E 1D 46 DA 25 12 A5 C1 ED C5 3A
       data hash MD5: 64K
       82 60 D6 8D A8 86 EF D5 3C F9 EF 03 77 FE C7 4A>)
(   2,<2006-02-27 10:39:22.18 +000>,<MAYBRIDGE\nmr>,<NMR_250MHZ>,
      <Start of raw data processing
       ef LB = 0.3 FT_mod = 6 PKNL = 1 SI = 32K 
       data hash MD5: 32K
       C5 DD F4 62 FF 20 86 A4 32 63 4E 3F 2A 1F DD 1A>)
(   3,<2006-02-27 10:39:26.39 +000>,<MAYBRIDGE\nmr>,<NMR_250MHZ>,
      <apk 
       data hash MD5: 32K
       54 98 D0 8C 57 A4 E8 F7 00 82 43 0D 57 45 C6 1D>)
(   4,<2006-02-27 10:39:27.92 +000>,<MAYBRIDGE\nmr>,<NMR_250MHZ>,
      <abs ABSG = 5 
       data hash MD5: 32K
       0F C6 5C 82 66 24 F1 98 6E 73 A4 DC E9 24 A5 87>)
$$ ##END=
$$ 
$$ hash MD5
$$ 3E C1 9F 75 A4 5F A3 F7 6B 2D DA 59 FD 40 1E 3F
##$RELAX= 
##$RELAX= 
##$RELAX= 
##$RELAX= 
##$RELAX= 
##$RELAX= 
##$RELAX= 
$$ Bruker specific parameters
$$ --------------------------
##$DU= <C:\u>
##$EXPNO= 16910
##$NAME= <ADRS>
##$PROCNO= 1
##$TYPE= <nmr>
##$USER= <dgb>
##$AMP= (0..31)
100 100 100 100 100 100 100 100 100 100 100 100 100 100 100 100 100 100 
100 100 100 100 100 100 100 100 100 100 100 100 100 100 
##$AQSEQ= 0
##$AQ_mod= 3
##$AUNM= <au_zg>
##$AUTOPOS= <10 >
##$BF1= 250.13
##$BF2= 250.13
##$BF3= 250.13
##$BF4= 250.13
##$BF5= 500.13
##$BF6= 500.13
##$BF7= 500.13
##$BF8= 500.13
##$BYTORDA= 1
##$CFDGTYP= 0
##$CFRGTYP= 5
##$CHEMSTR= <none>
##$CNST= (0..31)
1 1 145 1 1 1 1 1 1 1 1 1 1 1 1 1 1 1 1 1 1 1 1 1 1 1 1 1 1 1 1 1 
##$CPDPRG= <>
##$CPDPRG1= <>
##$CPDPRG2= <>
##$CPDPRG3= <>
##$CPDPRG4= <mlev>
##$CPDPRG5= <mlev>
##$CPDPRG6= <mlev>
##$CPDPRG7= <mlev>
##$CPDPRG8= <mlev>
##$CPDPRGB= <>
##$CPDPRGT= <>
##$D= (0..31)
0 1 0 0 0 0 0 0 0 0.06 0 0 0 0 0 0 0.0002 0 0 0 0 0 0 0 0 0 0 0 0 0 0 
0 
##$DATE= 1141036738
##$DBL= (0..7)
120 120 120 120 120 120 120 120 
##$DBP= (0..7)
150 150 150 150 150 150 150 150 
##$DBP07= 0
##$DBPNAM0= <>
##$DBPNAM1= <>
$$ [...]
##$SUBNAM7= <"">
##$SUBNAM8= <"">
##$SUBNAM9= <"">
##$SW= 20.6930455092707
##$SWIBOX= (0..15)
0 0 3 0 0 0 0 0 0 0 0 0 0 0 0 0 
##$SW_h= 5175.983436853
##$TD= 65536
##$TD0= 1
##$TE= 293.16
##$TE2= 300
##$TE3= 300
##$TEG= 300
##$TL= (0..7)
0 120 120 120 120 120 120 120 
##$TP= (0..7)
150 150 150 150 150 150 150 150 
##$TP07= 0
##$TPNAME0= <>
##$TPNAME1= <>
##$TPNAME2= <>
##$TPNAME3= <>
##$TPNAME4= <>
##$TPNAME5= <>
##$TPNAME6= <>
##$TPNAME7= <>
##$TPOAL= (0..7)
0.5 0.5 0.5 0.5 0.5 0.5 0.5 0.5 
##$TPOFFS= (0..7)
0 0 0 0 0 0 0 0 
##$TUNHIN= 0
##$TUNHOUT= 0
##$TUNXOUT= 0
##$USERA1= <user>
##$USERA2= <user>
##$USERA3= <user>
##$USERA4= <user>
##$USERA5= <user>
##$V9= 5
##$VALIST= <valist>
##$VCLIST= <CCCCCCCCCCCCCCC>
##$VD= 0
##$VDLIST= <DDDDDDDDDDDDDDD>
##$VPLIST= <PPPPPPPPPPPPPPP>
##$VTLIST= <TTTTTTTTTTTTTTT>
##$WBST= 1024
##$WBSW= 4
##$XGAIN= (0..3)
0 0 0 0 
##$XL= 0
##$YL= 0
##$YMAX_a= 336762
##$YMIN_a= -537599
##$ZGOPTNS= <>
##$ZL1= 120
##$ZL2= 120
##$ZL3= 120
##$ZL4= 120
##$ABSF1= 16.46169
##$ABSF2= -4.231482
##$ABSG= 5
##$ABSL= 3
##$ALPHA= 0
##$AQORDER= 0
##$ASSFAC= 0
##$ASSFACI= 0
##$ASSFACX= 0
##$ASSWID= 0
##$AUNMP= <proc_1d>
##$AZFE= 0.1
##$AZFW= 0.1
##$BCFW= 0
##$BC_mod= 0
##$BYTORDP= 0
##$COROFFS= 0
##$CY= 12.5
##$DATMOD= 1
##$DC= 0
##$DFILT= <>
##$DTYPP= 0
##$F1P= 14.0000005364418
##$F2P= -0.99999901652339
##$FCOR= 0.5
##$FTSIZE= 32768
##$FT_mod= 6
##$GAMMA= 0
##$GB= 0
##$INTBC= 1
##$INTSCL= 1
##$ISEN= 128
##$LB= 0.3
##$LEV0= 0
##$LPBIN= 0
##$MAXI= 10000
##$MC2= 0
##$MEAN= 0
##$ME_mod= 0
##$MI= 0
##$NCOEF= 0
##$NC_proc= -4
##$NLEV= 6
##$NOISF1= 0
##$NOISF2= 0
##$NSP= 0
##$NTH_PI= 0
##$NZP= 0
##$OFFSET= 16.46169
##$PC= 1
##$PHC0= 243.9339
##$PHC1= 10.43399
##$PH_mod= 1
##$PKNL= yes
##$PPARMOD= 0
##$PSCAL= 4
##$PSIGN= 0
##$REVERSE= no
##$SF= 250.130015084767
##$SI= 32768
##$SIGF1= 0
##$SIGF2= 0
##$SINO= 400
##$SIOLD= 32768
##$SREGLST= <1H.CDCl3>
##$SSB= 0
##$STSI= 32768
##$STSR= 0
##$SW_p= 5175.98343685301
##$SYMM= 0
##$S_DEV= 0
##$TDeff= 65536
##$TDoff= 0
##$TI= <Analysis number 999999
Compound Code 99
Book Reference 9
Project Code 9>
##$TILT= no
##$TM1= 0
##$TM2= 0
##$TOPLEV= 0
##$USERP1= <user>
##$USERP2= <user>
##$USERP3= <user>
##$USERP4= <user>
##$USERP5= <user>
##$WDW= 1
##$XDIM= 32768
##$YMAX_p= 550542994
##$YMIN_p= -314014
$$ End of Bruker specific parameters
$$ ---------------------------------
##NTUPLES= NMR SPECTRUM
##VAR_NAME=  FREQUENCY,     SPECTRUM/REAL,   SPECTRUM/IMAG
##SYMBOL=    X,             R,               I
##VAR_TYPE=  INDEPENDENT,   DEPENDENT,       DEPENDENT
##VAR_FORM=  AFFN,          ASDF,            ASDF
##VAR_DIM=   32768,         32768,           32768
##UNITS=     HZ,            ARBITRARY UNITS, ARBITRARY UNITS
##FACTOR=    0.157963299565203, 1,           1
##FIRST=     4117.56299381561, 0,            0
##LAST=      -1058.4204430374, 0,            0
##MIN=       -1058.4204430374, -314014,      0
##MAX=       4117.56299381561, 550542994,    0
$$ Real data points
##PAGE= N=1
##DATA TABLE= (X++(R..R)), XYDATA
$$ [...]
20565E6499m3212j08469j0558Q3339Q0691j8960j6973L5210L1726o058J3175Q5806
20553A82216k3480O275j3759j18257m7096P4852l7416l4152N7177K6455L3712
20542A06527q94m3328o1820k878j5561K4317M9020J7166L7978K3091o1520l3223
20530C8875m4335l7370k4790M1535M9980M7953j01761k0656O4803K0828k6733
20519H329m4479Q314K8024O9892J9590j2206q922P4493M4227l2450p4021o5298
20507A5493j4413k383N876K479O3473N1330M4907r297m7433j3142n8286l2095
20495F509M5040q962n7111p2012l1197l8957j702J6542J3714M4137N7302J4742
20483a1955L681N109M110M4425o814K1167j1368k6691N4331K8513j6776o695n9775
$$ y = [56499, 13287, -95182, -105740, -22401, 58290, 39330, 22357, 57567, 89293, 83235, 96410, 182216, 158736, 165011, 151252, 32995, -14101, 60751, 23335, -10817, 46360, 72815, 106527, 105633, 62305, 485, -2393, -17954, 6363, 55383, 72549, 110527, 133618, 72098, 38875, -5460, -42830, -67620, -26085, 23895, 71848, -29913, -50569, 14234, 35062, 8329, -36150, -27836, 188, 70080, 89670, 77464, 68542, 143035, 187262, 154812, 80791, 15493, 1080, -1303, 4573, 7052, 70525, 121855, 166762, 157465, 110032, 96890, 38604, 6509, 51549, 42587, -14524, -86536, -117733, -156690, -158392, -141850, -128136, -83999, -26697, -11955, -8274, -3165, 945, 45370, 38556, 59723, 48355, 21664, 75995, 104508, 87732, 81037, 21262]
20470B1262n1712n3929K5382J27167M8813r6864p8436M3706J5168l8922m4809
20459h3174L7005r851P02l414j2484j159M3299J7627L092L5393M7943l5598l3133
20446F248j19161o4320k3736m7676P0009M8241M4582N8256l9084m694K9737J3164
20434b8434l9426K3660m336J1208m8356J2021J02318Q7138l8767m7173P496J4807
20422E2156j6678k5683j5134l2489K8744j1140M555K5907Q5493j7192o269N5952
20410A28222k9385k2740q7423q676p046J9880N6411P3090k2191k5232m988K6710
20398I6632K0688n2934j500n6529m3558J6176K9801L2316M9568k7257m4735K0589
20386C9257j5823r904m7155K5858p3o3867K5639Q2304M1565m6049m1087K444M1846
$$ y = [21262, -30450, -84379, -58997, 68170, 116983, 20119, -58317, -14611, 557, -38365, -83174, -46169, -56020, -55318, -58732, -71216, -72375, -29076, -11449, -8357, 27036, 74979, 39381, 6248, -112913, -177233, -200969, -248645, -178636, -130395, -85813, -27557, -66641, -71335, -41598, -28434, -67860, -44200, -48536, -37328, -85684, -73663, 28655, 115793, 77026, 29853, 37349, 52156, 35478, 9795, -5339, -37828, -9084, -20224, -15669, 10238, 95731, 78539, 72270, 128222, 98837, 76097, -11326, -20002, -27048, -7168, 49243, 122333, 100142, 74910, 69922, 96632, 117320, 64386, 62886, 6357, -37201, -21025, 8776, 41092, 90660, 63403, 18668, 39257, 23434, 13530, -33625, -7767, -7840, -71707, -46068, 36236, 77801, 31752, -9335, -6891, 34955]
20373C4955k2090l1774m157O5329m6842L9595N5206l5642M1707n2992n6516m730
20361a7951l2114J8052Q613q211J5702Q9313k7654R016m0112p9204R588J24092
20349F9130N1528n3808r3507l3831p7054M1142N6544K1244J1597r789m3681o0802
20337a21287K1058K9630M9391L7865L2544J7143j4358l6618k5173M2794p239K7593
20325E3343j344m0627l8566q010r428K4486o977j1423J01351Q7602N961q9956
20313F6412j6395J2402k539r0095l7735L6242N0062k2994K1585N8884j2841k0017
20301D2971n201L3355R690K2066J731j5269j3026R4731r797p1997o6874o325L5307
20288E1362J5668k2260p5739k159N411N1283l3981k8998M8573M3332m1990P109
$$ y = [34955, 12865, -18909, -23066, 42263, -4579, 35016, 90222, 54580, 96287, 43295, -13221, -17951, -50065, -32013, -23400, -31611, -15909, 73404, 45750, 54766, 14654, -64550, -54962, 69130, 120658, 66850, -26657, -60488, -137542, -96400, -39856, -18612, -7015, -16804, -60485, -121287, -100229, -70599, -21208, 16657, 49201, 66344, 51986, 15368, -9805, 32989, 25750, 53343, 51999, 11372, -27194, -35204, -44632, -20146, -27123, -38546, 62805, 150407, 156368, 66412, 50017, 62419, 59880, -30215, -67950, -31708, 18354, -4640, 16945, 75829, 62988, 42971, 37770, 71125, 80815, 102881, 104612, 89343, 76317, 171048, 161251, 89254, 22380, 16055, 51362, 67030, 44770, -30969, -33128, -27717, 23566, -10415, -39413, 9160, 52492, 10502, 17611]
20276A7611N1923k7697q3416k7068J4382L5796M5917l457m553j04658k7747k5196
20264a38163Q06L6605P4676J5745K2681R4888K5228j18858r7118M9560M089J06686
20252G6825N8606j6599J8776l6430M272o8476j24053k0111Q6096M2215L1429L0357
20240H2907n2018o808L5539l3107j0498O8871K0779k0528M7575M258p7282j02530
20228d2842K422M9315M1436l6120M0440O910n1731l9304p3478K6964j3678K3492
20216f6174m4479Q400R4132P1552N729l9950m5666L7025R8196J9225o7496K0405
20204I0899l9718l863K0438L2786L9718N3783n9667o1147j5830k0343L7063P2837
20192A46956j9799r8483k7758m369O647Q3527L2140k2274o890j7225n8972M457
$$ y = [17611, 69534, 41837, -41579, -68647, -54265, -18469, 27448, 23991, 19438, -85220, -112967, -138163, -137357, -100752, -26076, -10331, 12350, 107238, 132466, 13608, -83510, -33950, -29861, 76825, 135431, 118832, 137608, 101178, 105450, 36974, -87079, -107190, -21094, 21121, 52550, 82907, 30889, 24081, 59620, 26513, 16015, 84886, 105665, 85137, 132712, 136970, 59688, -42842, -40420, 8895, 50331, 14211, 54651, 61561, 9830, -29474, -102952, -75988, -89666, -66174, -110653, -102253, -8121, 63431, 69160, 29210, -16456, 20569, 118765, 137990, 70494, 90899, 51181, 47318, 67756, 100542, 140260, 194043, 134376, 73229, 57399, 37056, 74119, 146956, 127157, 28674, 916, -3453, 3194, 86721, 118861, 96587, 89697, 72472, 13500, 17957]
20180A7957N0897m2449P848M1509O1244K6294Q88o0166J0631N8746R2875m363
20168B61911K4979P7613R6037J29239O5776Q6085J37456J84889K19458J85876
20158A469319N6627j05545j23658j90264j35527j27402j99401j35729q5461l1467
20148C91492p6369r3098P5836M5698j782p3963K1438k4859l5873n8559o7487j04708
20136b234K1959K3822N4496k0110L2834L1864m1831J2668o3071l7323O9206O2504
20124A44784q415n3216l5244K4993r0945m393Q0155J7195P9393R8120N5686j12701
20112A95412j00554p404O0210l3923k0106M4972P4289l884r8215k8319o1388l1702
20100a0612J25873K7920j0332j9126K1155J0798J6137j2638o4870l1558L2279
$$ y = [17957, 68854, 26405, 34253, 75762, 137006, 163300, 164188, 104022, 114653, 173399, 266274, 261911, 286890, 364503, 460540, 589779, 655555, 741640, 879096, 1063985, 1283443, 1469319, 1525946, 1420401, 1296743, 1106479, 970952, 843550, 644149, 508420, 422959, 391492, 315123, 222025, 297861, 343559, 341777, 267814, 289252, 264393, 228520, 169961, 102474, -2234, 19725, 43547, 98043, 77933, 110767, 142631, 100800, 113468, 50397, 13074, 82280, 144784, 136369, 83153, 47909, 72902, -18043, -22436, 57719, 74914, 154307, 252427, 308113, 195412, 94858, 87454, 147664, 113741, 93635, 138607, 212896, 209012, 110797, 82478, 21090, -10612, 115261, 143181, 132849, 113723, 134878, 145676, 161813, 149175, 84305, 52747, 85026]
20089H5026M6237J8076n4467o3612k0906R8611L067k504k8924j0536K9244n1853
20077D7459l1339O6138n8198J2140N2813L7784O8879J748p6189N613j6521n3874
20065E6453P02M889R5019M4905j6801j7850n6406l0195M5906J1296o9984L1485
20053I9419J0759k187k3835m1631K1199L91L3595k6407j9733k8062M0451P1340
20041A35299j4084n2856j5630k1695J3337L6050O4546K7542J056l4743l7534n394
20029I5894L6649N4796j7239n1713m3724l5484m033M5564m8961O987l5674K285
20017E347j9002L8509M9381M345l9246j5287R7820P0944n1780q5575m358P7571
20005A28669N409L222j2657l555k4272N417j5657m4460j293q7130l6177J02499
$$ y = [85026, 131263, 149339, 94872, 31260, 10354, 108965, 112032, 109528, 80604, 70068, 99312, 47459, 16120, 82258, 24060, 36200, 89013, 126797, 195676, 197424, 121235, 126848, 110327, 56453, 57155, 62044, 157063, 201968, 185167, 167317, 110911, 80716, 126622, 137918, 67934, 99419, 110178, 107991, 84156, 42525, 63724, 64115, 97710, 71303, 51570, 23508, 63959, 135299, 121215, 68359, 52729, 31034, 44371, 80421, 144967, 172509, 173565, 138822, 101288, 95894, 132543, 187339, 170100, 118387, 74663, 39179, 35146, 80710, 31749, 38736, 3062, 5347, -13655, 24854, 74235, 78580, 39334, 24047, 121867, 192811, 141031, 55456, 51098, 128669, 134078, 137300, 124643, 121088, 96816, 102233, 86576, 42116, 40823, -46307, -82484, 20015]
19993B0015R7147O462m2703O0603l3102l6021Q176l9928n3476L8025N4205M4306
19981A23709M1003j1816n1159m3050L6167q716L13k5992o801m5912N0058M1310
19969I9114O7424K8585m5245K5153L5234q268l8292j7415J2450L322P3248O6261
19957C01571j9589o9663j0395Q525l5832P319N6078l0213k5322k6247K7336k9489
19945A54079j5348N5051j7803p649O70L1037R436j4743K0911J2195j4094n417
19933B08325N2981K4192L4239k4035j2572K0131M9075k2954K9289J20391N9856
19922E38918N9809R6066J24031J81555K18542K02059J24796L2660l7941p8603
19912A461892j61361j84614j74501q8539j66210q1460n7065q4005q3243q3003
$$ y = [20015, 117162, 123624, 80921, 141524, 108422, 72401, 80577, 40649, -12827, 25198, 79403, 123709, 164712, 152896, 101737, 58687, 94854, 86138, 86451, 60459, 53658, 7746, 57804, 99114, 166538, 195123, 149878, 175031, 210265, 201997, 163705, 146290, 158740, 162062, 235310, 301571, 281982, 212319, 201924, 210449, 174617, 181936, 238014, 207801, 182479, 156232, 183568, 154079, 138731, 193782, 175979, 168330, 169000, 200037, 209473, 194730, 215641, 227836, 213742, 208325, 261306, 285498, 319737, 295702, 283130, 303261, 352336, 329382, 358671, 479062, 538918, 598727, 694793, 818824, 1000379, 1218921, 1420980, 1545776, 1578436, 1540495, 1461892, 1300531, 1115917, 941416, 852877, 686667, 605207, 548142, 464137, 380894, 297891]
19902B97891q4508l0809N4365N6174K5693R2926k6639j23754n8057O5133j951
19891B66464n1931N246m163N530K2912J41418J17746R4839O0446j2876K9400R0620
19879G65651M2405j09603j26278P6987J97748J24177J04437R2544k3823N748o3219
19868A086774j54621j14894j08389N9200P9350k4535j7853J9017L4601k2521j20452
19857G15677j24499j78234j18046p4900J9310M7238L4744K0786q021J1576R1210
19846D36841N0308K2505L0673j8193j03999k3316M171p8382j1817R414p5533q2604
19834A60068j3258l0447O0185M3093k9302j3538k8695Q560N6366l0651K0993O4655
19822B68029M752K864r592l3662m2954P4598N5386j9518l1764K122n111J9136
$$ y = [297891, 213383, 182574, 236939, 293113, 318806, 411732, 385093, 261339, 203282, 268415, 266464, 214533, 219779, 215616, 221146, 244058, 385476, 503222, 598061, 658507, 645631, 675031, 765651, 808056, 698453, 572175, 649162, 846910, 971087, 1075524, 1168068, 1144245, 1149993, 1086774, 932153, 817259, 708870, 768070, 847420, 822885, 805032, 824049, 858650, 836129, 715677, 591178, 412944, 294898, 219998, 239308, 286546, 321290, 342076, 334055, 345631, 436841, 487149, 509654, 540327, 522134, 418135, 394819, 398990, 320608, 308791, 318205, 242672, 160068, 146810, 116363, 176548, 219641, 190339, 176801, 148106, 156666, 213032, 182381, 203374, 268029, 272781, 275645, 266053, 232391, 189437, 264035, 319421, 299903, 268139, 270261, 265150, 284286]
19810B84286n9611P006k6728l7686l6571l966M6633P9674m412m6876J179J03301
19798C06229N217n940K9306M816n1958L1650P5931K1955k6292n545m3411j3490
19786C28468K1657K0844M8855n8911r4431J6645K505L0163k9862r256N1983l172
19774C25488J4519l2207N873k203m0511n5501N7600n2844m2052n9093P0575L6281
19762B25925Q505L8535k7908l5791n2232q410N8408P3398L3544O5521j2757k8308
19750C38430L8312R4970l9990l2599k5481L6871M0111K6901m9433o9307q7537
19739B71248q907O7899J3512q4959r7494J8776K2453j539O34M3989K4241q108
19727B61745k7382O830l8004k0615J3337O0373J247N6924O8879L1745m3161q7417
$$ y = [284286, 224675, 231681, 204953, 167267, 130696, 126730, 173363, 253037, 248625, 201749, 202928, 306229, 311446, 305506, 334812, 339628, 287670, 319320, 395251, 417206, 390914, 385369, 341958, 328468, 350125, 370969, 419824, 360913, 266482, 283127, 285632, 315795, 285933, 276677, 328660, 325488, 340007, 307800, 313673, 311470, 270959, 215458, 273058, 220214, 178162, 119069, 189644, 225925, 234430, 272965, 245057, 209266, 157034, 148624, 207032, 280430, 313974, 379495, 366738, 338430, 376742, 471712, 431722, 399123, 373642, 410513, 450624, 477525, 428092, 358785, 271248, 262341, 330240, 343752, 258793, 161299, 180075, 202528, 200989, 201623, 245612, 269853, 261745, 234363, 241193, 203189, 182574, 195911, 256284, 257531, 314455, 383334, 415079, 371918, 284501]
19715B84501o67J50587O1709o0277n9313o6773r4297l9094J8354P7747R0167l2655
19703C29989N1047M5841J7592o6164j06654n1834J5517N1132J7468k1017R9970
19692C82887Q004j7283J7014q27P0406p665j10643j3353Q834N0329M7900k3277
19680D12326K6598P1427l8697m8479L9655N2144m9531p7645J3927O2904n5303
19669D09326l3256l1634q1241m8823P277N139O0330M8446J9744J7626m712j9709
19657C48513J011J8383o143j0002j1207M8882P8727K6096K0705O758p6640k6530
19645D18553n4087r9963j4700O2951M0205J4457R3493m0485n2833j7792M377N5043
19633D09219m80L4284J17541O1126o7154l2501M4469P8554K9477Q2741K4303l1633
$$ y = [284501, 283834, 434421, 496130, 435853, 376540, 309767, 215470, 176376, 194730, 272477, 362644, 329989, 381036, 426877, 444469, 378305, 271651, 219817, 235334, 286466, 303934, 282917, 382887, 390891, 373608, 390622, 389795, 460201, 452536, 341893, 328540, 337374, 387703, 435603, 412326, 438924, 510351, 471654, 423175, 462830, 514974, 465443, 387798, 401725, 464629, 409326, 376070, 344436, 263195, 214372, 221649, 226788, 287118, 335564, 355308, 372934, 368222, 348513, 349524, 367907, 361764, 351762, 340555, 389437, 468164, 494260, 514965, 521723, 445083, 418553, 364466, 264503, 249803, 312754, 352959, 367416, 460909, 420424, 367591, 349799, 354176, 409219, 408739, 443023, 560564, 621690, 554536, 522035, 566504, 645058, 674535, 757276, 781579, 749946]
19621G49946p479O5844l0882j0815L4844m6708j61426m4178J2406m423O3582L115
19609F23826m3201j5259k5190j545J15259M4150K5963O2578L1034l2660Q4316
19598H69271J02423K2684J8173n9789l9218o2540N1712J02322M3394l8486M387
19587A014333K212O6J4601N3962L8051K0004J5403N7362J8637m6736J0483k896
19575A195482N9967R9088L3223K7664l1239J1925j7240k0336L8035q566K5225
19564A413228Q4452R5006N385l856O7859Q3215J05659J50491J05353J07083O7580
19553B281455J80261L47874M10135L09440J93580p799j40669j09059M2548J88584
19543C696350K33762L71711M82007M83599M36051L06748N7694l3146o9878r7519
$$ y = [749946, 742467, 808311, 777429, 766614, 801458, 754750, 593324, 549146, 561552, 557129, 620711, 623826, 580625, 565366, 540176, 538631, 653890, 698040, 724003, 786581, 817615, 784955, 869271, 971694, 994378, 1012551, 952762, 913544, 851004, 902716, 1005038, 1048432, 1009946, 1014333, 1016545, 1016611, 1031212, 1085174, 1123225, 1143229, 1158632, 1215994, 1234631, 1187895, 1198378, 1195482, 1255449, 1354537, 1387760, 1415424, 1384185, 1396110, 1378870, 1358534, 1396569, 1388003, 1413228, 1497680, 1592686, 1598071, 1594215, 1662074, 1745289, 1850948, 2001439, 2106792, 2213875, 2281455, 2461716, 2809590, 3219725, 3529165, 3722745, 3714946, 3574277, 3465218, 3507766, 3696350, 3930112, 4301823, 4783830, 5267429, 5703480, 6010228, 6067922, 6034776, 5964898, 5867379]
19533E867379j24323o29L4237R3598J33236K30240J80164J82580K06386K33945
19523G036813M36774M45580N55163P73702R16457J016401J220257J433210J856983
19514A5691340K280340K770469L455637M297907N605687P408544J0138261J3938961
19506F5587146J8987415K5058635L0877200L5124982L5527045L0009489J8991559
19499B60163471M560126j0981675k3643719l1403992l3974345l1977679k7239552
19492A05502635k1564325j6547607j2517411r587529p354685n787479m573398
19485B7570201l601777k869967k320549j987670j643533j400511j145448j104997
19477A1495749r30027o79124n97856o25062n07921l74409k85820k62966l63938
$$ y = [5867379, 5743056, 5742427, 5776664, 5870262, 6003498, 6233738, 6413902, 6596482, 6802868, 7036813, 7473587, 7919167, 8474330, 9248032, 10164489, 11180890, 12401147, 13834357, 15691340, 17971680, 20742149, 24197786, 28495693, 34101380, 41509924, 51648185, 65587146, 84574561, 109633196, 140510396, 175635378, 211162423, 241171912, 260163471, 264723597, 253741922, 230098203, 198694211, 164719866, 132742187, 105502635, 83938310, 67390703, 54873292, 45285763, 37931078, 32143599, 27570201, 23968424, 21098457, 18777908, 16790238, 15146705, 13746194, 12600746, 11495749, 10565722, 9886598, 9288742, 8663680, 8155759, 7781350, 7495530, 7232564, 6868626]
19468F868626m24757k56908k43551j81422n2454j28505j63377j55185k55713l39100
19458D667654m01516m18144l95644l76803k82160k43231j23771p1110j03649n4998
19448B196628j57409q7208n8747o5063k1683K0534L3986L683L4579j3986k4101
19437A861213j8758j1254Q4887J01168j8539p4499o5456R2953K0510J1694k2662
19426A961257n7303j20333l2213Q680J1994n8264j43514q8743j3054l1837l6383
19415A400287p7639M023m5271p6716k051P079m1182r2743j0325m5098l918J7868
19403A034314j0517M83M4385O8105L1824J7108O3666J0196p2729o6547N8663O1721
19391A240672l7252q9572j0479K4860j5871o4111n3194N2397j8991n0252o9408
$$ y = [6868626, 6443869, 6186961, 5943410, 5761988, 5709534, 5581029, 5417652, 5262467, 5006754, 4667654, 4266138, 3847994, 3452350, 3075547, 2793387, 2550156, 2426385, 2355275, 2251626, 2196628, 2039219, 1952011, 1893264, 1828201, 1806518, 1827052, 1861038, 1864721, 1899300, 1885314, 1861213, 1842455, 1831201, 1916088, 2017256, 1998717, 1924218, 1858762, 1951715, 1972225, 1983919, 1961257, 1903954, 1783621, 1751408, 1760088, 1772082, 1713818, 1570304, 1481561, 1468507, 1436670, 1400287, 1322648, 1326671, 1281400, 1204684, 1202633, 1209712, 1168530, 1075787, 1065462, 1020364, 1016446, 1034314, 1023797, 1024280, 1068665, 1136770, 1168594, 1185702, 1249368, 1259564, 1186835, 1120288, 1178951, 1240672, 1203420, 1113848, 1103369, 1128229, 1112358, 1048247, 995053, 1047450, 1028459, 978207, 908799]
19380I08799N2501J76473J52841N2060o5862j00667l3624p9845n4530l9785q6416
19369H81945j2648J055P0835N8247L0473P7779J02785Q8729Q7267K8283k6721
19358A388029m3727J7113q8197j30955j01107J3463K0401k7949o9242k5747O544
19347I58626K9495P7873M000L5537L3067O2525P0869o0411k3155j7435r442N1670
19335A213219M1214O1238N1342J15739L0707m9946n4606p161L4681K0895O30L4425
19323A492377J3007M6548L1489L4997J23014Q5897M3654Q7831M8778R2563J39684
19312B239839J11115J31622J53605K05053J57364J08064J18872M0351O3576J79538
19302C508999J72341J85316J55841L3661L1406P5317J41127J01093J52795L36005
$$ y = [908799, 961300, 1137773, 1290614, 1342674, 1276812, 1176145, 1142521, 1062676, 1008146, 968361, 881945, 869297, 870352, 941187, 999434, 1029907, 1107686, 1210471, 1299200, 1386467, 1414750, 1388029, 1344302, 1361415, 1273218, 1142263, 1041156, 1054619, 1075020, 1047071, 977829, 952082, 958626, 988121, 1065994, 1069994, 1105531, 1138598, 1201123, 1271992, 1211581, 1188426, 1170991, 1161549, 1213219, 1254433, 1315671, 1367013, 1482752, 1513459, 1463513, 1408907, 1401746, 1436427, 1457322, 1457952, 1492377, 1505384, 1551932, 1583421, 1618418, 1741432, 1827329, 1870983, 1958814, 2007592, 2100155, 2239839, 2350954, 2482576, 2636181, 2841234, 2998598, 3106662, 3225534, 3265885, 3329461, 3508999, 3681340, 3866656, 4022497, 4056158, 4087564, 4162881, 4304008, 4405101, 4557896, 4893901]
19292D893901L23634L29986M11381M29586N78600P32800P71777O46870N33913
19283I652448N30388O31537P95510R08680J084075J401742J583588J943165K471502
19274B1002635L087810L874337M918096O354224Q432596J1238969J5131229K0495310
19266I4535206K7187551L3730875L7757532L5912534K6449488J0615500p766507
19259B58422179k3622181l3217564l5678990l2785264k7294009k1341999j6194613
19252F8287559j2318198r377102p096095n493352m366757l521532k834454k255552
19244B1024517j866253j654980j426895j209867r71682q66691p92756p15582p96940
19235A0722871p20773o71766o89227o41899n36451n34792m96912m41605l80668
$$ y = [4893901, 5217535, 5547521, 5958902, 6388488, 6967088, 7699888, 8471665, 9118535, 9652448, 10182836, 10814373, 11609883, 12518563, 13602638, 15004380, 16587968, 18531133, 21002635, 24090445, 27964782, 32882878, 39237102, 47669698, 58908667, 74039896, 94535206, 121722757, 155453632, 193211164, 229123698, 255573186, 266188686, 258422179, 234799998, 201582434, 165903444, 133118180, 105824171, 84482172, 68287559, 55969361, 46592259, 39496164, 34002812, 29636055, 26114523, 23280069, 21024517, 19158264, 17503284, 16076389, 14866522, 13894840, 13028149, 12235393, 11519811, 10722871, 10002098, 9330332, 8641105, 7999206, 7462755, 6927963, 6431051, 5989446, 5608778]
19226E608778l34140l05753j93133k11071k30185k08197j46925j59882j89639
19217C629853j79063j85679j30723k0042p6364j07524p8970j14278j53841k27701
19207B355668j88584m2024j15697j21903j34188J0439K7044q8692p2315K5463
19197A655211l4167j15582l1051M0767K9075J4064l4832q1839K665L7392j0410
19186A471293P240l2987p4444Q742j06778r3790N3652L097j3571l4803J8951L1051
19174A237653J9951m7680j3878m7293K1148J1431m0573j9627j1437N375L9196
19163A154266J10660M664M822J12238O3606K4384r5463j08081m9601p8302M4348
19152A187541n2569j50688p8450J4404O6110k161P2516K9062k5914J4223k6656
$$ y = [5608778, 5274638, 4968885, 4775752, 4564681, 4334496, 4126299, 3979374, 3819492, 3629853, 3450790, 3265111, 3134388, 3114346, 3037982, 2930458, 2851488, 2737210, 2583369, 2355668, 2167084, 2125060, 2009363, 1887460, 1753272, 1763711, 1790755, 1702063, 1629748, 1655211, 1621044, 1505462, 1474411, 1515178, 1544253, 1558317, 1523485, 1441646, 1444311, 1481703, 1471293, 1478533, 1445546, 1371102, 1379844, 1273066, 1179276, 1232928, 1236025, 1222454, 1187651, 1206602, 1237653, 1257604, 1209924, 1196046, 1148753, 1169901, 1181332, 1140759, 1121132, 1109695, 1115070, 1154266, 1264926, 1269590, 1274412, 1386650, 1450256, 1474640, 1379177, 1271096, 1221495, 1143193, 1187541, 1134972, 984284, 905834, 920238, 986348, 984187, 1056703, 1085765, 1059851, 1074074, 1047418]
19141A047418K6097L6216N1276Q3857J65102K86271M14246L91541K74249J62782
19131B939055M3982n1666j62636j77541j84577k87253l25541k06645n6409l608
19121A527161k7458Q5916M2454M3264O6447M9282Q8557J19951L3551l0420R5616
19110B094321J58887J87884L03868K30370J96290J99616J89371J93553K05345
19101C959505J85423L64542M41075N11920P04077J097674J694986K718198M321173
19092A5998573O006262O807506P058679N769179K124174o68448k808631l852209
19084C6435085k558387L09945L716039O506157R116357J0721728R356255P160467
19076H0763646K933144m015289q862495j1228487j0331856o420116j365440L511109
$$ y = [1047418, 1073515, 1109731, 1161007, 1244864, 1409966, 1696237, 2110483, 2502024, 2776273, 2939055, 2983037, 2931371, 2768735, 2591194, 2406617, 2119364, 1793823, 1587178, 1530769, 1527161, 1499703, 1585619, 1628073, 1671337, 1737784, 1787066, 1875623, 1995574, 2029125, 1998705, 2094321, 2253208, 2441092, 2744960, 2975330, 3171620, 3371236, 3560607, 3754160, 3959505, 4144928, 4509470, 4950545, 5462465, 6166542, 7264216, 8959202, 11677400, 15998573, 22004835, 28812341, 35871020, 41640199, 43764373, 43095925, 40287294, 36435085, 33876698, 34186643, 37902682, 44408839, 53525196, 64246924, 73603179, 80763646, 83696790, 79681501, 70819006, 59590519, 49258663, 42838547, 41473107, 44984216]
19068D4984216O306371O108751J902015l195935p350471r368937q568408o568113
19060B4249489m442521k676720j620312j006343n43110j84714J67723Q95493K032907
19051A6871892L522075M654881M921087N173468N952299M662904J535958p89886
19043D6504678k193409k945984k191862J66643L248414O321223R349419J2622349
19035G0881471J2909957R469897M238078k571830q258119j1637431j2354089r587203
19027E3090731m799023K45792L889691O092988N656722R15178l553769p186553
19019E4351757r989803r887460q324614o319352m350788k893868j978993j397216
19011I209663j037780p80566n30043m28826m20797m15416m38995l38604k49485
$$ y = [44984216, 51290587, 57399338, 59301353, 56105418, 48754947, 39386010, 30817602, 24249489, 19806968, 17130248, 15509936, 14503593, 13960483, 13775769, 13943492, 14838985, 16871892, 20393967, 25048848, 29969935, 35143403, 41095702, 45758606, 47294564, 46504678, 44311269, 41365285, 39173423, 39340066, 42588480, 48909703, 58259122, 70881471, 83791428, 93261325, 97499403, 94927573, 86669454, 75032023, 62677934, 53090731, 48291708, 48537500, 52427191, 58520179, 64176901, 65092079, 61538310, 54351757, 44361954, 34474494, 26149880, 19830528, 15479740, 12585872, 10606879, 9209663, 8171883, 7391317, 6861274, 6432448, 6011651, 5596235, 5157240, 4818636, 4569151]
19002D569151k32817k51246j55062o0509q2726n6102K9185j14561j47692j39342
18992C358279m8721K8290j8701n3657L1458K8660j76605k44285r4151k3307o005
18981B781255J14330P6228Q0998J8638n7976m9595L4953J28023J65481M6199j9539
18970C318995n9803r8700r6481j12524n1788j9826P0011Q2433p024M8897P4228
18959C148418J59235K27823K15989J94640K49598L67547M29639M22659L71680
18950E787228N14394O45451P90105J024467J352619J776081K784800M483360O053700
18941B5212205O404136O421972Q378899J1385642J0763299O444064M536155O096182
18933H5642554P560520N678219L649800K529084L097202O713186J0498218J0249114
$$ y = [4569151, 4336334, 4085088, 3930026, 3869517, 3786791, 3730689, 3759874, 3645313, 3497621, 3358279, 3309558, 3337848, 3319147, 3265490, 3296948, 3325608, 3149003, 2904718, 2810567, 2787260, 2781255, 2895585, 2971813, 3052811, 3071449, 3013473, 2963878, 2998831, 3126854, 3292335, 3338534, 3318995, 3259192, 3160492, 3064011, 2951487, 2899699, 2879873, 2949884, 3032317, 3025293, 3074190, 3148418, 3307653, 3535476, 3751465, 3946105, 4195703, 4563250, 4992889, 5415548, 5787228, 6301622, 6947073, 7737178, 8761645, 10114264, 11890345, 14675145, 19158505, 25212205, 31616341, 38038313, 46417212, 57802854, 68566153, 75010217, 79546372, 85642554, 93203074, 98881293, 102531093, 105060177, 108157379, 114870565, 125368783, 135617897]
18925A35617897N287341J720379L660764O129053O04497p883435j0754807r450062
18917A24931627p168852p480185r400094j0370630p944288m397479m219419p092893
18909F6857787q568456q223099p297865o700740o175033n677118m713623l403316
18901A6098537k242443j686263j362893j016347q86485q04875p97567o14858n05671
18892F181135m91994n54308m97234m11655m01133l85841l07223j61666k22096
18883B747985j62850j87872k05608j37954j22818r1428j08740j21076q4493r919
18873A515227j2462j34704j9335n30n7849k3484k0544L9544K9123n8440l2028
18862A224518p107m9311l252K6165k6163J4198m816q732L9877P1831J14745J22371
$$ y = [135617897, 140905238, 142625617, 146286381, 152415434, 153019931, 145136496, 134381689, 124931627, 117762775, 110282590, 100882496, 90511866, 82567578, 78170099, 73950680, 66857787, 58289331, 50066232, 42768367, 36067627, 29892594, 24215476, 19501853, 16098537, 13856094, 12169831, 10806938, 9790591, 8904106, 8099231, 7301664, 6686806, 6181135, 5689141, 5134833, 4637599, 4225944, 3824811, 3438970, 3131747, 2970081, 2747985, 2585135, 2397263, 2191655, 2053701, 1930883, 1839455, 1730715, 1609639, 1525146, 1515227, 1502765, 1368061, 1348726, 1348196, 1290347, 1266863, 1246319, 1285863, 1314986, 1256546, 1224518, 1217411, 1168100, 1164848, 1191013, 1164850, 1179048, 1174232, 1165500, 1205377, 1277208, 1391953, 1514324]
18850A514324N2396J21779J33969O556j05377j31953r7426o0400n9301q2952k4541
18839A267074L1498P1985J17467K30700J23923J25971Q8033k3357k0002r6726
18829A916566k34332k29690k04579j29687j10126j30016q2761q2953q4202q758
18819F19462k1635L0712n069j2346R099R894p9022j574n1488k9146L1126Q480
18807E08493q943l2498L1387M7182N0991Q7015J24317r544k4065N252J0234M6164
18795H35985n6765o9983m6575j22090q6665l3217K1834N8987L3614K4467O3459
18784F23051P24L3161m3805q6426n2676J054M6510J37172P7981k336n5357k1245
18772F57808N0906j0943l9142J648J28R031N8748K01892J99130M0772p7506k15295
$$ y = [1514324, 1566720, 1688499, 1822468, 1829024, 1723647, 1591694, 1494268, 1433868, 1374567, 1291615, 1267074, 1298572, 1370557, 1488024, 1718724, 1842647, 1968618, 2056651, 2033294, 2013292, 1916566, 1682234, 1452544, 1247965, 1118278, 1008152, 878136, 795375, 712422, 628220, 619462, 597827, 628539, 623470, 611124, 620223, 630117, 551095, 549521, 498033, 468887, 500013, 508493, 499550, 467052, 498439, 545621, 596612, 683627, 807944, 798400, 774335, 779587, 789821, 835985, 779220, 709237, 662662, 540572, 453907, 420690, 442524, 501511, 535125, 559592, 623051, 623775, 656936, 613131, 526705, 474029, 475083, 521593, 658765, 736746, 734410, 679053, 657808, 708714, 697771, 658629, 660277, 660405, 669436, 728184, 930076, 1129206, 1169978, 1092472, 877177]
18760H77177j36287r3682r9920k3859n0138j6938l29J0487J66r607O3930K8217
18748E49217p5030r2884p5710j5357L3269K1133n2768j2191J5625O8869Q2099
18737D46272J11203k933L0684k5854k5110K5914n4050j5446L191N5466Q1773L7085
18725F68195l5630o5987l2105m1049p139k1540k8787K6215j0644k6117J29439
18714E54851N9650J7222j5894K3105K9059J3250j9634q1910k7447j8092L129n7761
18702D79528J8495j6970L8673l8405L3948O7521K3753m8788k2641r462k8669N4148
18690E51131J008k7557K3671L9880k8025M6222M2942K686K2856O716j215L9150
18678G19465P2069M7287K9906K0195q2134j6820L9154O7075l2527p3566k2154
$$ y = [877177, 740890, 647208, 547288, 523429, 473291, 456353, 456024, 466511, 466677, 457070, 521000, 549217, 474187, 381303, 305593, 290236, 323505, 344638, 291870, 279679, 295304, 364173, 446272, 557475, 554542, 585226, 559372, 534262, 560176, 506126, 490680, 493871, 549337, 631110, 668195, 632565, 566578, 534473, 493424, 486285, 464745, 435958, 462173, 451529, 425412, 554851, 614501, 631723, 615829, 638934, 667993, 681243, 661609, 579699, 552252, 534160, 537289, 479528, 498023, 481053, 519726, 481321, 515269, 582790, 606543, 557755, 535114, 525652, 496983, 551131, 552139, 524582, 548253, 588133, 560108, 606330, 649272, 651958, 674814, 681530, 680315, 719465, 791534, 838821, 868727, 888922, 806788, 789968, 829122, 896197, 863670, 790104, 767950]
18667G67950O4578R7417J3797O395P7933R5854O6908R8407N5352O5695J38954
18656A549240O0781L4759P671N5197R7703Q7442o1171k7740m4761M1293J55829
18645A956243K08308K23300K99012M30152O31620R98075J427063K252299L699911
18636A2125983N281945O404611O293072N256279L619867J950216O47248j133112
18628D0446109l169783n198458o318207o179722n030458l590131k291833j528228
18620G139289j022992p39698n71746m03278j91976j45123j32652m2523K9048Q3558
18610D001907J84280K59834K32118J20304K12215L35475J66421J61712J77133
18601E851399K43339L19429M49985N04172O83941R01645J254618K036795L070025
$$ y = [767950, 832528, 929945, 943742, 950137, 1028070, 1123924, 1190832, 1289239, 1344591, 1410286, 1549240, 1610021, 1644780, 1652451, 1707648, 1805351, 1892793, 1831622, 1803882, 1759121, 1800414, 1956243, 2164551, 2387851, 2686863, 3117015, 3748635, 4746710, 6173773, 8426072, 12125983, 17407928, 23812539, 30105611, 35361890, 38981757, 40931973, 41579221, 40446109, 37276326, 32077868, 25759661, 19579939, 14549481, 10959350, 8667517, 7139289, 6116297, 5376599, 4804853, 4401575, 4209599, 4064476, 3931824, 3889301, 3918349, 4001907, 4186187, 4446021, 4678139, 4798443, 5010658, 5346133, 5512554, 5674266, 5851399, 6094738, 6414167, 6864152, 7368324, 8052265, 8953910, 10208528, 12245323, 15315348]
18592A5315348M133020N072044O528510R155835J3820193J9269112K1663505J9325403
18584A14282970J3832217O206040L03784m525389q805799j3554771j7960278j9260651
18576G0518123j7541750j3770555r551540o258737m078659k667350j819114j177801
18568A3652617q10862n95385k20741j6145N5155J37984O3148J73393K83528L39678
18558A3062370N09888O88512Q98898J277620K030212L046908M647055P241771
18550C3403234J0394780J2119368J2926151J6065412J8361806J7020090J8815479
18543A39106320J9188589J2700150L912030l594099r24331P521078J3228722J6001390
18535B07139849J2128278J610024q293024j7390011k2706096k5099203k5559696
$$ y = [15315348, 19448368, 24520412, 31048922, 40204757, 54024950, 73294062, 94957567, 114282970, 128115187, 134321227, 134625011, 130099622, 121293823, 107739052, 89778774, 70518123, 52976373, 39205818, 29654278, 23395541, 19316882, 16649532, 14830418, 13652617, 12841755, 12246370, 12025629, 12009484, 12064639, 12202623, 12265771, 12439164, 12722692, 13062370, 13572258, 14260770, 15159668, 16437288, 18467500, 21514408, 26161463, 33403234, 43798014, 55917382, 68843533, 84908945, 103270751, 120290841, 139106320, 158294909, 170995059, 174907089, 171312990, 170388659, 177909737, 191138459, 207139849, 219268127, 220878151, 212585127, 195195116, 172489020, 147389817, 121830121]
18528A21830121k1252825j4428574n956460R96012M900799P200287L371863l895960
18520I2765263p816803j1960885j3873520j2434326j0429369p881077n422425
18513B2946858l747108k646930j933507j338370j012677q54877n96805l91103
18505A0425481j27888J64986O53563J401101K226032K335540K378991K928998
18497B2386804K039415M2752q50347j546131k104084j862411r35678L63021J379024
18488A8912365K099783L321112L930728K387364M61971j196560k772385l853015
18480B3291363m054720l511102k475570r79634M5213P76503J112361K71779n82070
18471A3894123j223750j958576j896187j724329j567334j116529o79477l97002
$$ y = [121830121, 100577296, 86148722, 80192262, 81188274, 86089073, 93289360, 96661223, 92765263, 84948460, 72987575, 59114055, 46679729, 36250360, 28369283, 22946858, 19199750, 16552820, 14619313, 13280943, 12268266, 11413389, 10816584, 10425481, 10297593, 10462579, 11116142, 12517243, 14743275, 17078815, 19457806, 22386804, 24426219, 24468971, 23618624, 22072493, 19968409, 18105998, 17170320, 17533341, 18912365, 21012148, 24333260, 28263988, 30651352, 31113323, 29916763, 27144378, 23291363, 19236643, 15725541, 13249971, 12270337, 12315550, 13092053, 14204414, 14476193, 13894123, 12670373, 10711797, 8815610, 7091281, 5523947, 4407418, 3727941, 3330939]
18463C330939k92197l20662k03375j45179j96735k12976j81663J2519k2087j01058
18453A667526p7457m5180n9346p5557k4609p8265j22756m3777p1905o8752k2624
18442I77298M713n8061m9030p374Q6892l4655n1770O4762L2597M9959K4970K8162
18430A068463k6097J9762L2101n77p3016l9777L9467M3719J1075L8072p1884j6324
18418A024984L9869J5973M0770L6483J03839o4452l9371J4045r7266j03996n8281
18407I12597l3529q739j1047j14086n5533J3072n71M558p349o7298k8653K2775
18395F26197q996q6759j04120p7134q44J1453j0830K5211J5468M2082L7558o06
18383D68680k7601O0850J8166m4320n0036l2468q6051k6560l6927l9890j5930
$$ y = [3330939, 3038742, 2718080, 2514705, 2369526, 2172791, 1959815, 1778152, 1790671, 1768584, 1667526, 1590069, 1544889, 1485543, 1409986, 1385377, 1307112, 1184356, 1140579, 1068674, 999922, 977298, 982011, 923950, 874920, 867546, 954438, 919783, 868013, 932775, 965372, 1015331, 1040301, 1068463, 1042366, 1062128, 1094229, 1093652, 1020636, 980859, 1020326, 1064045, 1075120, 1113192, 1041308, 1024984, 1064853, 1080826, 1121596, 1158079, 1261918, 1197466, 1158095, 1172140, 1074874, 970878, 912597, 879068, 870329, 859282, 745196, 689663, 702735, 702164, 706722, 699373, 632075, 603422, 626197, 617201, 530442, 426322, 349188, 348344, 359797, 348967, 374178, 389646, 431728, 469286, 468680, 441079, 501929, 520095, 475775, 425739, 393271, 307220, 280660, 243733, 203843, 187913]
18372A87913j0095l3430j3391l8456K4672L8157o1637J141R3185M3710P7849j2868
18360B96750p3147J975R0820O2274o4274q1626m4092m3488n01n4599O6110L2074
18348A88276l6496j7511K1028J0154k4612L6808O6386J3064L3354Q5048O6737
18337D42236j3275o098L585j6409p9138l2908K6519j069q6933K6201J15785K38
18325C78734J3039m0008k933m5920n7723J3812j9985m0799N3089N5538O7675R9443
18313D73962M0265J5565Q4015m1961j00445m1842l8047L0408p330m3988K3975
18302C94577k587m3748n3397j119n8005m4329Q9064P3308L6131K430P3038l9055
18290D26308l6174K8457N9947J17875k9870j37093n6907l0069R2741N4340j5862
$$ y = [187913, 177818, 144388, 130997, 92541, 117213, 155370, 93733, 94874, 188059, 231769, 309618, 296750, 223603, 225578, 316398, 378672, 314398, 232772, 188680, 145192, 144691, 90092, 156202, 188276, 151780, 134269, 155297, 165451, 140839, 177647, 244033, 257097, 290451, 375499, 442236, 428961, 422863, 426448, 410039, 330901, 297993, 324512, 323443, 236510, 262711, 378496, 378734, 391773, 351765, 348832, 302912, 245189, 259001, 239016, 198217, 251306, 306844, 374519, 473962, 514227, 529792, 613807, 571846, 471401, 429559, 391512, 421920, 414590, 370602, 394577, 391990, 348242, 294845, 293726, 235721, 191392, 280456, 353764, 389895, 392325, 465363, 426308, 390134, 418591, 478538, 596413, 566543, 429450, 372543, 342474, 435215, 489555, 473693]
18279D73693k6932k3884M0038J6439O5114j859j08948j18046N2589J9698k5657
18268C62245J5579j372L4913J7540l3277p9354m3777p5179r2126M8262K065k5053
18256A30466P5970R9851L7400m5406j28157J2899Q2562l4607o41k3677p8093j68
18244A28399L3927M1031K9717N2572r8463l6230R6531N9764K7788Q951P422l8942
18232C12467K1194k1696r8587k6646n143j6271O882j0662k1733j5498L8018J08493
18220B70818N7322J4799J1065N0774J5161L947j12295n3209k5890J711M7353K5077
18208C06633K266m0093n2496N2061J06449Q707l6024j9541m6488L9908k9574n0580
18196B41228J8221K8179k3548M3376l363k8009j02458J544K1558L9292j1451P4015
$$ y = [473693, 446761, 422877, 462915, 479354, 544468, 542609, 433661, 315615, 368204, 387902, 362245, 377824, 376452, 411365, 428905, 395628, 316274, 272497, 197318, 105192, 153454, 155519, 130466, 206436, 306287, 343687, 298281, 170124, 183023, 265585, 230978, 230337, 206660, 128567, 128399, 162326, 203357, 233074, 285646, 187183, 150953, 247484, 307248, 335036, 343987, 351409, 312467, 333661, 311965, 213378, 186732, 181589, 165318, 172200, 161538, 139805, 124307, 162325, 270818, 328140, 342939, 354004, 404778, 419939, 423886, 311591, 258382, 232492, 234203, 281556, 306633, 308899, 268806, 216310, 268371, 374820, 383527, 347503, 327962, 281474, 321382, 291808, 241228, 259449, 287628, 264080, 307456, 304093, 276084, 173626, 175170, 196728, 236020, 224569, 298584]
18184B98584N5868l7437j97K5944j5433o6427p0242n6944N6174j1452j734L0289
18172B06993j4003n5062p4355K0025P0367M5208N0370k6556l9704P4009L5458
18161B92750L6173P1947P2815L2426R5975R8421n9035r0610k8396M3848K0923
18150E87237n2241j8989L883N6303K0470n2183l059N7675L5297j4807K7096M2842
18138F89524N1766N0369l2366m4161J5940P9073J12462P28J1349R4386O585M264
18126A039919K3731R5035J18849J33628J52367J30638K04658K07572K89556M45601
18116B841554N49839O78995Q61033J047175J491411K297023L773257O484454J2246767
18107C2271508K4764788M3870459L6037813l819721k1330678l4018737l0447825
$$ y = [298584, 354452, 317015, 316818, 342762, 327329, 260902, 190660, 133716, 189890, 178438, 176704, 206993, 192990, 137928, 63573, 83598, 153965, 199173, 249543, 222987, 183283, 257292, 292750, 328923, 400870, 473685, 506111, 602086, 700507, 641472, 550862, 522466, 566314, 587237, 534996, 516007, 519890, 576193, 596663, 544480, 541421, 599096, 634393, 619586, 646682, 689524, 741290, 791659, 759293, 715132, 731072, 810145, 922607, 923335, 934684, 1029070, 1035655, 1039919, 1063650, 1158685, 1277534, 1411162, 1563529, 1694167, 1898825, 2106397, 2395953, 2841554, 3391393, 4070388, 4931421, 5978596, 7470007, 9767030, 13540287, 20024741, 32271508, 57036296, 100906755, 136944568, 133124847, 111794169, 77775432, 47327607]
18100D7327607j7248719r158835n417750l567634k507281j801826j254521q56383
18092E514658o63540n29524m46491l88551l38237k06278k02580k22256k05863
18083B311338j99598j90858j74470k23954k22739j18039j48863n848p798q0480
18073I38691j6111j0581l6140l2314r5545j44241k1337k4110m3598l6641J6057
18062D94130L7411j4969P277Q6784J38068J57466Q1251K0944N2521l7422l8555
18051I84906o7564p9903p6802j02463k8147j0477o1015n9652N5523L4862j5393
18040E73875M3789J4638J8949M7258l7253k1180M2799k9072n7941p7741l6101
18029D82020J5984O4094m6570q7393K3118o407j06957n5897L9891j2014J7577
$$ y = [47327607, 30078888, 20920053, 15502303, 11934669, 9427388, 7625562, 6371041, 5514658, 4851118, 4321594, 3875103, 3486552, 3148315, 2942037, 2739457, 2517201, 2311338, 2111740, 1920882, 1746412, 1522458, 1299719, 1181680, 1032817, 1026969, 1019171, 938691, 922580, 911999, 875859, 843545, 748000, 603759, 582422, 558312, 514714, 478073, 494130, 531541, 516572, 523849, 610633, 748701, 906167, 987418, 1008362, 1060883, 1023461, 984906, 917342, 837439, 760637, 658174, 630027, 619550, 558535, 498883, 554406, 589268, 573875, 617664, 632302, 651251, 698509, 661256, 640076, 682875, 653803, 595862, 518121, 482020, 498004, 562098, 515528, 428135, 451253, 444846, 337889, 281992, 321883, 309869, 327446]
18018C27446R3750n5433j3858K1434L8129l7326r190K489M2832L2185k1174N5575
18006D76859M3225K8332J10r299r9222J5605K6318o0816J2682k5012K9117O5233
17994E03132l2485k999J6070M4591o0385m5263N8522l5926k6240P5609R89K006
17982D97621J2719n2684r3606k3731k8621J1314M6558l3876q1472j1409J7450
17971B60263L074l9228n6065m3087M1459K7687j3601J079j2162K1833P9942q451
17959B62743l7559n1207j6711J3993k3900k1520p7998N901M6793k8879j3672K9581
17947H7565k1751k1801M6706O2344r930r3394j0618Q7749n8867m4230j5530N6936
17935F5179N4918J0857M3046L7038J5553J1111r1388m0744l0519r861O7904K8833
$$ y = [327446, 421196, 365763, 351905, 373339, 411468, 374142, 364952, 367441, 410273, 442458, 421284, 476859, 520084, 548416, 548526, 539227, 440005, 455610, 481928, 421112, 433794, 408782, 437899, 503132, 470647, 467648, 483718, 528309, 467924, 422661, 481183, 445257, 419017, 494626, 495615, 497621, 510340, 457656, 364050, 340319, 311698, 323012, 369570, 335694, 254222, 242813, 260263, 263337, 224109, 168044, 124957, 166416, 194103, 180502, 181581, 169419, 191252, 271194, 262743, 225184, 173977, 157266, 171259, 147359, 125839, 47841, 53742, 100535, 71656, 57984, 87565, 65814, 44013, 90719, 153063, 143133, 49739, 39121, 126870, 68003, 23773, 8243, 65179, 120097, 130954, 174000, 211038, 226591, 237702, 146314, 105570, 75051, 65190, 133094, 161927]
17923A61927L686q3186K2410K7689k7550q1420J3538M8901Q840K0654j7555M0459
17911A38393J902p8838j01735l1365M3499M7901J20891K8354m3578K7054m0609
17900A11869m9465J4454N5937L1981l1156q4779r2289k5026M5740K5729R2558
17889I5553l1179j13368M3912K1182p133j2949k0776M0791Q0448K9289O4653l5711
17877A54712k6614o8852l5997M7108M5006m9745Q5020L6070k5312j3873P703m4721
17865A10505p7747L4667J8951m3270J2466M103J037K91j10067j8123M4594P2835
17853E0242L6368j2166O014m4710j6206K7061J4595P0425r704K2107J8555n9323
17841A03258o6333k5183J3881K8812n648j0036R4275k890K4223O006j03707j6822
$$ y = [161927, 165613, 82427, 104837, 132526, 104976, 23556, 37094, 85995, 94835, 115489, 97934, 138393, 140295, 61457, -40278, -71643, -28144, 19757, 140648, 169002, 125424, 152478, 111869, 62404, 76858, 132795, 164776, 133620, 48841, -43448, -68474, -22734, 2995, 95553, 64374, -48994, -5082, 16100, 8967, -3982, -24758, 16033, 96481, 125770, 190423, 154712, 128098, 59246, 23249, 70357, 115363, 65618, 150638, 186708, 161396, 147523, 155226, 110505, 32758, 67425, 86376, 43106, 55572, 59675, 60712, 61003, -49064, -67187, -22593, 50242, 86610, 74444, 80458, 35748, 19542, 46603, 61198, 131623, 121919, 144026, 162581, 103258, 36925, 11742, 25623, 54435, 48787, 38751, 133026, 130136, 154359, 160365, 56658, 39836]
17829C9836M87n7786k8719k5078l7467J9706N3797L4584o759J7427L405n6796
17817d3363L6166M2545m6628P217Q5605k3170l7276k5097m1996N6087M8669K7459
17805H6218L6528k4419o2848o6541J9824L1139K4559K517K1551O6162j40k3581
17793A10969q5133k9986K2384l9457n9525j9381O6456J05378N071q6838p6100
17782h6162K5724L4084L9418l1298N799K8702n1350M6646k7618k0792L5817k2585
17770b3615o2600J0017K1764l6260P451K4938J1285l9088p0099Q856N6762K2102
17758f8487l0256L1796j4131l9650j9332L1376Q3535K3892m580k8115J5486L5730
17746A7264j1082p1713n034k339k1848O619M6433l0247q0641r456K850J9275L4230
$$ y = [39836, 40323, -17463, -46182, -71260, -108727, -89021, -35224, -640, -7399, 10028, 13433, -43363, -7197, 35348, -11280, -4063, 81542, 58372, 21096, -4001, -45997, 10090, 58759, 86218, 122746, 98327, 35479, -31062, -11238, 19901, 44460, 46977, 68528, 134690, 134550, 110969, 25836, -4150, 18234, -21223, -80748, -100129, -33673, 71705, 76776, -10062, -86162, -60438, -26354, 13064, -18234, -12435, 16267, -35083, 11563, -16055, -36847, -1030, -23615, -86215, -76198, -54434, -90694, -83243, -58305, -47020, -86108, -156207, -147351, -90589, -68487, -98743, -66947, -81078, -120728, -140060, -108684, -25149, -1257, -5837, -33952, -18466, 17264, 6182, -65531, -70565, -72904, -94752, -88133, -41700, -71947, -152588, -162044, -159194, -139919, -105689]
17733a05689M950k5023q2595P2951Q1314L3084n0956J6563L4128o4840J2052J3567
17721f0494p238j255K2879o422l7158j5804k5118k7818j9882J6353J9036O1984
17709h0937R347J3219J0310o5786j0683j0136M0518P2657k4781j4505Q3167m3935
17697b1545l2557J3223o8317n8671P5315L7360m4492p8560J5578q932L4969Q1946
17685e4683Q871M0407o5011j33250m9847O440L5002L8852L6567P6887M5243L2136
17673A7614J7063j2489m4790l0217l7358J5011N2315K1823o9373O168M1827m1292
17661f3698j8560P0591Q761m6436l2699j1457M2837J1552k6917M0613p364m3222
17649g5999k8450L8113m418J808O5138N7686j3048j28571o4945J0779j5584K6391
$$ y = [-105689, -100739, -125762, -208357, -135406, -54092, -21008, -71964, -55401, -21273, -86113, -74061, -60494, -67732, -68987, -46108, -52530, -89688, -105492, -130610, -158428, -178310, -161957, -142921, -80937, -71590, -58371, -48061, -113847, -124530, -134666, -94148, -21491, -46272, -60777, 22390, -21545, -54102, -40879, -109196, -167867, -92552, -55192, -99684, -178244, -162666, -171598, -136629, -54683, -45812, -5405, -70416, -203666, -253513, -247073, -212071, -173219, -136652, -59765, -14522, 17614, 34677, 22188, -22602, -52819, -90177, -75166, -22851, -1028, -70401, -64233, -22406, -63698, -82258, -11667, -2906, -49342, -82041, -93498, -50661, -39109, -66026, -25413, -32777, -75999, -104449, -66336, -70754, -68946, -3808, 53878, 40830, -87741, -152686, -141907, -157491, -131100]
17637a31100L7599j8144k5304l2045j897L1202J6904M9697j3735p7778j0880M2926
17625a32555M4102q526m589P8767J3877N798L8750l2665j6422p812k0273K177
17613c9371l1941K458K4919k6535j837R121j0232k8495O6253Q1873r946l3645
17601B622M697L827N289k0661j06123n3168R7026M0625r5624o7629M7763L2336
17589a09020n825J6281k9429j3941K2501k1805N588r832o15R437M741l6545M022
17576a64442r536P3J44059K9056j14794j08028o6184P7111O0765j1528M8273K868
17564a12307L0283M1595Q6709N0099p2835n2824k6116L4151K4355l1116L0202
17553B196l6166J8462l36j9675M3429j8999j21816l3946L5338m3093K422J1962
$$ y = [-131100, -93501, -111645, -136949, -168994, -170891, -139689, -122785, -73088, -86823, -164601, -175481, -132555, -88453, -96979, -101568, -22801, -8924, -3126, 35624, 2959, -13463, -21275, -41548, -39371, -71312, -68854, -43935, -70470, -72307, -63186, -73418, -101913, -35660, 46213, 36267, 2622, 7319, 11146, 16435, -4226, -110349, -163517, -66491, -25866, -121490, -189119, -141356, -109020, -114845, -98564, -127993, -141934, -119433, -141238, -135650, -145482, -146097, -136660, -131919, -168464, -164442, -173978, -173905, -29846, -790, -115584, -223612, -289796, -212685, -151920, -163448, -115175, -112307, -82024, -40429, 46280, 96379, 23544, -29280, -55396, -21245, 3110, -28006, 2196, -33970, -15508, -15844, -35519, 7910, -11089, -132905, -166851, -131513, -174606, -172184, -160222]
17541a60222J9426L8058N6773O7008o5870l6288M781K2604L1984K3680L2665l8882
17529d283l0563j0433q383k0922K3732J8700m1313R1718m6361k9783M622j04438
17517a57707M8013N3497J2932P2226l8886l3630l3349r2074K104N7377L4358M7555
17505b7584J5947r957m7283j3371J4168K8911M9310j1636o7562L0862M1797o4136
17493f0534k6177j8746Q819K9349N042M1069O8672J8476J4628k2852m4227j1728
17481A791m5228q0961q884k6633M302J2673L1320Q8085J466l2802l4866N780L2512
17468e1445P3764m3943j02387M1886M6075K1198j0316J1777j9515j2271N9420
17457A4243N1761r145j5577j00303m3595L0809n0365M5722J08180l20K2554N3586
$$ y = [-160222, -140796, -102738, -45965, 21043, -44827, -81115, -76334, -53730, -21746, 1934, 34599, -4283, -34846, -45279, -53662, -74584, -50852, -32152, -73465, 18253, -28108, -57891, -53269, -157707, -109694, -56197, -43265, 28961, -9925, -43555, -76904, -168978, -166874, -109497, -75139, -27584, -11637, -21594, -68877, -82248, -68080, -39169, 10141, -1495, -69057, -38195, 3602, -60534, -86711, -105457, -96638, -67289, -62247, -21178, 47494, 65970, 80598, 57746, 13519, 1791, -43437, -124398, -133282, -159915, -155613, -142940, -111620, -23535, -22069, -54871, -89737, -83957, -51445, 22319, -21624, -124011, -82125, -36050, -14852, -25168, -13391, -32906, -45177, 14243, 66004, 56859, 41282, -59021, -102616, -71807, -122172, -76450, 31730, 31410, 53964, 107550]
17445A07550N3206r22j09023K4067J3573J36623K55703J26928q0760j67185j51720
17434B08040q9831l0916j1202j00555p4526m7802p2692M8961Q4053L4304O8247
17423A6081l072n995r173l2056L7546K3085N7205n1969q2139l7581M2182L9324
17411f562j6922k6781j182j8019Q7381j6523l6373p5943L748K9425p8157o4179
17399b20087J2953J07718M2677M217j2339Q152r1119M0035P5623L5815k026q4377
17387h2758J926L5822K1078Q3598l0632j6883k7645r7393J3816M8698N296k6860
17375g1937n1414K4221K4568M3949P766j062L8719J054k8936p0042L5544J4864
17363c2706p1724K9891M0185K5300l004m9908m8807j8504j5792m4281L8902M0154
$$ y = [107550, 160756, 159834, 50811, 74878, 88451, 225074, 480777, 607705, 526945, 359760, 208040, 118209, 87293, 76091, -24464, -98990, -146792, -219484, -170523, -86470, -52166, 16081, 13009, 7014, -2159, -34215, 3331, 26416, 83621, 31652, -50487, -88068, -45886, -6562, -23484, -50265, -51447, -69466, 17915, 1392, -34981, -110924, -107176, -77751, -155908, -220087, -207134, -99416, -56739, -52522, -64861, -56709, -147828, -107793, -32170, 3645, 1619, -82758, -80832, -45010, -23932, 59666, 29034, 12151, -15494, -112887, -99071, -50373, -45077, -71937, -123351, -99130, -74562, -30613, -22847, -23909, 14810, 15864, -13072, -83114, -47570, -32706, -104430, -74539, -34354, -9054, -12058, -61966, -110773, -129277, -145069, -189350, -150448, -110294]
17351a10294J0211L5908L5416L3149r1369m0502k8404N4750j7027L1810N4106
17340c2246o4906L0494J4832L0309J0458r0891R96l4444j6832J6237N2135Q0062
17328c796O3100k3433q0286k4521N1080k0218j4555n8745k1781j1950K8414M9355
17316f7336O2603j877L069k2151L1957L5656n5489n7114K8731K2649j244N247
17304a5299k347j1089L7087n531m8604r998k0095N7832P2746O076l8461n461O35
17291A7491l0157k7763J06746P2320k3597m9214o0286n5897p8339J9230L7327
17280g2139n885J996J3485J4829l1888j2349N1074j1300K1535J9140L099l5155
17268d3558J4978Q797L7490L2834o673n9908l4763p98Q427n412J5666q3223j3276
$$ y = [-110294, -100083, -64175, -28759, 4390, -86979, -127481, -155885, -101135, -118162, -86352, -32246, -97152, -66658, -51826, -21517, -11059, -101950, -100954, -135398, -152230, -135993, -83858, -3796, 59304, 35871, -44415, -68936, -17856, -38074, -52629, -111374, -133155, -145105, -116691, -67336, -4733, -6610, -3541, -25692, 6265, 41921, -13568, -70682, -41951, -19302, -20546, -15299, -17646, -28735, 8352, 2821, -45783, -55781, -75876, -18044, 54702, 60778, 22317, 16856, 17491, -12666, -40429, 66317, 138637, 115040, 65826, 5540, -50357, -128696, -109466, -72139, -78024, -76028, -62543, -47714, -79602, -91951, -40877, -52177, -30642, -11502, -8403, -43558, -28580, -19783, 17707, 50541, 43868, -16040, -50803, -51601, -43174, -48586, -32920, -116143, -129419]
17255a29419M1156K0262j3250K9856J4471j0619J8763M925o4733r6496N088R0670
17243h9326J7105o6259n1343K9541K354j1681l8117J04994L83l7967J1040Q5912
17231d3364K7245k3479j445l8070o704j2407p4019N9018M8325j0513M106O034
17219f5273L1229L5961l8309k2609K0197n3588j2861K0011J2278o5787L4034N9262
17207d5455M1457K4237m2772j6474m7826K7041M1933j9847q0399r0595L9422Q1176
17195h8102M6940M4410j3661l299k1416n6641q4259L9241K9666L39K7111M9738
17183b9933r891M6141Q649K6479O5040q296j9151q4036n4160J3705L1396n9698
17171g3755m1059j807K930l987K0877m1030P246k9075K1165j1652j2865P008M8777
$$ y = [-129419, -88263, -68001, -81251, -51395, -36924, -47543, -28780, -23855, -88588, -185084, -179996, -89326, -72221, -138480, -189823, -160282, -157928, -169609, -207726, -102732, -102349, -140316, -129276, -43364, -16119, -39598, -41043, -79113, -85817, -98224, -172243, -113225, -64900, -75413, -71307, -65273, -34044, 1917, -36392, -59001, -38804, -92392, -105253, -85242, -72964, -138751, -104717, -45455, -3998, 20239, -22533, -39007, -86833, -59792, -17859, -37706, -118105, -208700, -169278, -88102, -41162, 3248, -10413, -13712, -35128, -91769, -176028, -136787, -107121, -106782, -79671, -29933, -39824, 6317, 14966, 41445, 106485, 98189, 79038, -4998, -59158, -45453, -14057, -73755, -114814, -116621, -113691, -117678, -96801, -137831, -130585, -159660, -138495, -150147, -163012, -156004, -107227]
17158a07227N0950m36k2424n2534O1913K7937N344K0781l01r6519K3595j0070
17146i8991l7880L3185j205J5695P5614k0365P571K6451m6587n8389P596R268
17134h8037N926N9240q139n2140o7117L9955Q0980N7273r567Q371j4493k3037
17122a0785l2729n2355Q321N6027M3810k6250l3311K0936N954L2327L2007m7321
17110c369j8140l9388M6533J747L772J0822O5838K9365p0799J3743l2821m544
17098B759j4468l2808k714P0813K8518k1215k3524k3257J9409M229L6428o6428
17086b2258J5607m5781l988N0773K9386K8694M0202n4953r4611m6541K6413r123
17074h6180P902J7642l5422m5733J9009K502R6491K8390o1000m1506J0369Q5513
$$ y = [-107227, -56277, -56713, -79137, -131671, -69758, -41821, -36477, -15696, -15997, -112516, -88921, -98991, -136871, -103686, -104891, -89196, -13582, -33947, -26376, 75, -46512, -104901, -97305, -88037, -82111, -22871, -31010, -83150, -150267, -110312, -29332, 27941, 18374, 26745, 12252, -10785, -43514, -95869, -87548, -31521, 12289, -13961, -47272, -26336, -20382, 11945, 43952, -3369, -21509, -60897, -14364, -12617, -8845, 1977, 67815, 97180, 26381, 40124, 7303, 2759, -11709, -44517, -47231, 23582, 52100, 30885, 7361, -15896, 3513, 7742, 44170, -22258, -6651, -52432, -56420, -5647, 23739, 52433, 92635, 37682, -56929, -103470, -77057, -86180, -78278, -60636, -96058, -141791, -122782, -120280, -23789, 4601, -56399, -97905, -87536, -2023]
17062b023J5675k2471m5301n7207l385m3308J0099P2275P6532m4177J7923m2843
17050f8211j0167L5336P6569m2269J4371j880n7195k1549J9916R9463J0295j1
17038E4668k7996k4351Q979K0065R163l4815q1967l9404O4608k1504p248N3541
17026b6261M915J4133L2804j2538r179r952L1815Q037j7577J1629J4915K8162
17014G0903o6212j6190l6658j4684N6350L1969n1198n2748j0198O1522j5112L0823
17002a1433M2205j8228n5986P145L6555l4855p2736p73K9450k4321O9647K1253
16990a2077n1984q916O763j2307K3400M1139o653L4121M686J0366p4248J0630
16978c5080O3531j4349m9647k4061m1977m581M7123Q1247K7864M1736M2273J0599
$$ y = [-2023, 13652, -8819, -54120, -111327, -114712, -158020, -147921, -75646, 886, -43291, -25368, -68211, -78378, -43042, 33527, -8742, 5629, 3749, -53446, -74995, -55079, 44384, 54679, 54668, 26672, 2321, 11300, 31365, 40528, 5713, -76254, -115658, -51050, -72554, -79802, -26261, -21346, -7213, 25591, 13053, 3874, -6078, 25737, 33774, 16197, 27826, 42741, 70903, 4691, -11499, -48157, -62841, -6491, 25478, -25720, -78468, -88666, -27144, -42256, -11433, 30772, 12544, -43442, -36297, 258, -34597, -107333, -108106, -78656, -102977, -33330, -12077, -64061, -72977, -66214, -78521, -55121, -13982, -20635, 13486, 18172, 28538, -45710, -35080, 28451, 14102, -35545, -59606, -101583, -106164, -59041, 22206, 50070, 91806, 134079, 144678]
16966A44678m8348k2878L1068m2376o3557q5841M2273M4286R693k3527m3155r9721
16954a57405k0586N9214P1662L5528p5804o3451R204J7134K0795K3332l5283q882
16942a24542M7292K1262N5625O079m4977L8088k1248k1360M1342l2822k0519m1721
16930i7501p1850K9798P2738n2011J1756J03615K1521L8125N2423p5298q109L4663
16918E9870p1328l4710M4298M2667j7375K659N0376M1963o0072K2683j2506p1181
16906b656j5873p0484L147Q3585P7926n7760o9983Q848j8690J6886J19579J05907
16894A80432l8347j07587m9296k0134o809L0397J6800p2622k5720k4087M1469
16883g5504j2980O58k5880N093N1121J7776L7947n952n3134j2043L2225J5300
$$ y = [144678, 96330, 73452, 104520, 62144, -1413, -87254, -44981, -695, 8998, -14529, -57684, -157405, -177991, -118777, -47115, -11587, -87391, -150842, -141638, -124504, -103709, -80377, -115660, -124542, -77250, -55988, -363, 5716, -39261, -1173, -22421, -43781, -2439, -35261, -55780, -97501, -169351, -139553, -66815, -118826, -107070, -3455, 18066, 56191, 108614, 33316, 25207, 59870, -11458, -46168, -1870, 40797, 23422, 26081, 76457, 118420, 58348, 81031, 68525, -2656, -18529, -89013, -85866, -2281, 75645, 17885, -52098, -43250, -61940, -45054, 74525, 180432, 142085, 34498, -14798, -34932, -41741, -11344, 5456, -67166, -92886, -116973, -75504, -88484, -87826, -113706, -108613, -57492, -39716, -1769, -7721, -60855, -72898, -40673, -25373]
16871b5373k5140m3709k3953k7204M0272L6583L5920N6247L7594l1237K6862o837
16859E0025l0131m1q4833m3361l765J9487M088l3929l4613J0791M8703K168J4578
16846h0833j5181Q880Q0912K3109N6691O659n127q6928q2108k3110j2298L1577
16834i7757M8590j8047j5749R0009j217j5880n8383n5411k4434O857P7874M5311
16822a8237L3677l7838l2247J1775k0950k3249k7360j8451j6672J2741n920L5918
16810a06813J3612l2355J9655q91n1242j2621O6904P1645j2795j6003o4842r9726
16798b25472N9137Q3280M0159L7117M4831J253J3625j2613k9703k7143L7950L4643
16786E7064j5493o904J7135n527k727L5438O524j1757r331K4758n2343l9831j1418
$$ y = [-25373, -50513, -94222, -118175, -145379, -105107, -68524, -32604, 23643, 61237, 30000, 56862, 50025, 19894, 19853, -64980, -108341, -112106, -92619, -88531, -122460, -157073, -146282, -97579, -95411, -80833, -96014, -87134, -6222, 16887, 73578, 80237, 75110, -11818, -93926, -117036, -129334, -97757, -49167, -67214, -82963, 7046, 5829, -10051, -68434, -123845, -148279, -141422, -63548, -18237, 15440, -22398, -54645, -42870, -63820, -87069, -114429, -132880, -149552, -136811, -142731, -106813, -93201, -125556, -105901, -106792, -158034, -170655, -103751, -32106, -44901, -60904, -125746, -225472, -166335, -83055, -42896, -5779, 39052, 40305, 53930, 41317, 11614, -15529, 22421, 57064, 41571, 34667, 51802, 46275, 43548, 78986, 85510, 73753, 64422, 89180, 36837, -2994, -14412]
16773a4412K9946n4792k7189J189M2932l2378L5158p556k8580Q065Q1404O047
16761C9834k5858q1503l4229r89p459L1554k8974M3229J06906O4130o0581p9014
16749c2954L583q855l3297J4751r124l0847j6143J1728l5694K1035J02401J0626
16737b790K4992p417J6915M8019k0344m1518N820j2566q864j3244O5905K562j2463
16724D5007k3970o0497o652K5343m18l925N9642l9079l7817l2142M6221k810m5816
16711g6913L4286j1201L8832K6952o5977J7185M3471l5289N9562O428o6626j355
16699c0645L2260N2935O0408p0892n8578k6801J4250m1074N8570K578J0884l9952
16687c6057m1806j5390j9784J5601O138J0856O0396P373k011J0151n2524k7250
$$ y = [-14412, 15534, -39258, -66447, -65258, -22326, -54704, -19546, -27102, -55682, -47617, 33787, 39834, 13976, -67527, -101756, -102745, -110204, -78650, -107624, -64395, 42511, 106641, 46060, -32954, -29371, -38226, -71523, -56772, -65896, -96743, -112886, -101158, -136852, -115817, -13416, -2790, 22202, 14785, 31700, 79719, 59375, 17857, 23677, 11111, 2247, -10997, 54908, 57470, 45007, 21037, -39460, -46112, -20769, -21187, -25112, 34530, -4549, -42366, -74508, -28287, -31097, -76913, -42627, -53828, -14996, 11956, -54021, -36836, 6635, -28654, 30908, 37336, -29290, -30645, 1615, 54550, 114958, 44066, -14512, -41313, -27063, -68137, -9567, -6989, 3895, -36057, -77863, -93253, -113037, -97436, -91298, -80442, -20046, -12673, -14684, -4533, -57057, -84307]
16675h4307k491O4551l8119o6474L8453J08154J9343k3012J4662q205m0193J1587
16663f051k3713o4321j5942L53L2948m849k8538J6754m988O4963m4718o6557J0298
16650a34361Q9486K8609o156j9059n3611P0191L2528J6061o526j1733l5426Q2723
16638E2726J7973p1426p2672k378N7628L3450j3279J0604o677J84M4514K4633
16626G5280N6696J5830J0982l0496J0336k649k8021m8138j24197q1188J1249M0550
16614i3766O3412o8022k2626k2862M882O6809J5630j9493k1120n1743N3414L7493
16602e7992j4418m5605l6048l317J6908Q94J14806N6609K8861p7245o6719m1003
16590a24269J5506K5214L9700M8789J479J9711j7353j264m3420n8773O661N3475
$$ y = [-84307, -86798, -22247, -60366, -126840, -88387, 19767, 39110, 16098, 30760, 22555, -17638, -6051, -29764, -94085, -110027, -109674, -76726, -81575, -110113, -93359, -98347, -33384, -78102, -144659, -134361, -44875, -16266, -22422, -41481, -95092, -24901, 7627, 23688, 17162, 5429, -29997, 52726, 70699, -727, -73399, -75777, -18149, 15301, 2022, 12626, 5949, 6133, 50647, 75280, 131976, 147806, 158788, 128292, 138628, 135979, 107958, 59820, -64377, -145565, -134316, -93766, -30354, -98376, -121002, -143864, -138982, -72173, -56543, -76036, -97156, -148899, -95485, -57992, -72410, -118015, -154063, -157380, -140472, -139578, -24772, 31837, 60698, -16547, -83266, -124269, -108763, -83549, -43849, 4940, 6419, 26130, 8777, 7513, -35907, -94680, -88019, -34544]
16578c4544J4796m2932k8356N3257P371j4255j4764P2112O8947K9064K180O504
16566A19380j6292o0216L5328o833p0603o7515N2012L9799J7598n7053l3821k4189
16554g2405M8637P1884N1546Q744j9290K4031r5667l4591R3026J0702k7474Q134
16542F7277N9365r4937m9101j1813j0017k1387k7998O9683M9878l0431L6014k1822
16530A4711K4574J7192j7675Q3486n909o8915K241O2249J4935p2072n8771m820
16518h774L3802m478n8846O71Q418O0617m8413L175O644k8179k7355j1824m9739
16505a24281N540q1247Q9740L7330J6896O636k544J6739N6659J3825m3156q49
16493h712K3572j0891R726j6742j4218J8244j75m0163k7810M6560P1033k3751
$$ y = [-34544, -19748, -62680, -91036, -37779, -30408, -44663, -59427, 12685, 81632, 110696, 112876, 119380, 103088, 42872, 78200, 71367, 764, -66751, -14739, 25060, 42658, -14395, -48216, -72405, -23768, 48116, 99662, 108406, 89116, 113147, 17480, -17111, 75915, 86617, 59143, 67277, 126642, 31705, -17396, -29209, -39226, -60613, -88611, -18928, 30950, 519, 36533, 14711, 39285, 56477, 38802, 122288, 116379, 47464, 49705, 111954, 126889, 54817, -3954, -8774, 25028, 20550, -38296, -37625, -29207, 31410, -17003, -13828, -7184, -35363, -62718, -74542, -124281, -118741, -199988, -110248, -72918, -56022, -49386, -51930, -35191, 21468, 35293, -7863, -8712, 14860, 3969, 13695, -3047, -17265, 979, 804, -39359, -67169, -20609, 50424, 26673]
16481B6673p6637m7324O6805j2341R733J4013l456k8016L9403N346M5167q0763
16469d1397r2744o3667J15409Q3892j7311p1137m1093J1847M6049N3876L377k6997
16457c9896j0343p515k0037o0668J4991Q965N4465O600O1783j867k4286J9864
16445B056P180K1365J6688k3085m4214j38737M1620p782j431P1267M4541J8367
16433G835j590n301k500j4853P8822J6573q9266K4908L4995M951q358P642j1584
16420D2274K8905J028p4369p8072J114j217R0069J5873P3699m8870r6030K5M2413
16407c158l3560j6354M290M512J0860R203J1459K2641Q67j7354L3732P3565M8996
16394A49699K7029m9531k0231j1240o0421j9370J5725n9190l0837J1060j9581
$$ y = [26673, -49964, -97288, -30483, -42824, -33091, -19078, -22534, -50550, -11147, -5801, 39366, -41397, -134141, -197808, -82399, 1493, -15818, -86955, -128048, -116201, -70152, -16276, -12899, -39896, -50239, -57754, -77791, -138459, -123468, -114503, -60038, -53438, 8345, 6478, -17808, 2056, 9236, 30601, 47289, 24204, -20010, -158747, -117127, -124909, -126340, -55073, -10532, 7835, 6245, 944, -1556, -16409, 62413, 78986, -10280, 14628, 49623, 54574, 46216, 53858, 42274, 71179, 72207, -2162, -80234, -79120, -80337, 9732, 25605, 99304, 50434, -45596, -45571, -3158, -36718, -53072, -48782, -44270, -33410, -24207, -12748, 9893, 10760, -6594, 27138, 100703, 149699, 176728, 127197, 106966, 95726, 35305, 15935, 31660, -27530, -58367, -47307, -66888]
16383f6888l3958L4251J5509j0506l0045N691Q460J6885L5046J6710K9777M2991
16371F3923P748j04559l2993P4853q618l3459J2413K723n0632K6294N102R984
16359b7221M6413L4941K2007m7783m0034o1682n1225J0197P4271K3165J4686l1393
16347c3658l4716J38O7148L8837K9488L942r0720o7046k8249l320K9171l4585
16335a23570L5341Q1491J9525q5214o5454j9559o762L3506L1318R7356J9123M7025
16323F4126J5021k9656l5391M2965O0743L9378O650L2125l1898q503k0054m4290
16311I1216n37N8834L0736k0949o0584p807k8711j6754k4141j8439l1816P1646
16299D2694N8831j7174m615K8912r167n4815j9643R577J8048j1308m1370M5675
$$ y = [-66888, -100846, -66595, -51086, -61592, -91637, -85946, -77486, -60601, -25555, -8845, 20932, 63923, 71671, -32888, -65881, 8972, 354, -33105, -20692, -17969, -68601, -42307, -37205, -27221, 19192, 54133, 76140, 28357, -11677, -73359, -124584, -114387, -40116, -16951, -2265, -33658, -68374, -68236, -1088, 37749, 67237, 71179, -19541, -86587, -114836, -118156, -88985, -123570, -88229, -6738, 12787, -72427, -137881, -157440, -164202, -130696, -99378, -2022, 17101, 64126, 79147, 49491, 14100, 57065, 117808, 157186, 163836, 195961, 164063, 155560, 135506, 91216, 90679, 149513, 180249, 159300, 98716, 90909, 62198, 45444, 21303, 2864, -28952, 42694, 101525, 84351, 79736, 108648, 99481, 44666, 25023, 34600, 52648, 41340, -30, 45645]
16287D5645Q8443J1566L2796J25521K7892q7711j0950J4055j7343J4900n2196
16276A92618j34695k3750O9323l877j6035q160K6205m0601o5895M4161N8893r4648
16264C539N4481L9894L5970Q1772N9631J9543L2094K8736J3448O8203O2329O3142
16252E62782R3129M9534j643L2990J6624m6306j45076j55984q9686j00735p0575
16241A45054k7661J4800R130l1523n9602K44L748M4652k1822p1480L7959K8339
16229G1838l092L5387l697q0432o2305j9435O7696M4580j4008Q1282j7459k7432
16217G2923m4898j1100r691M2627p000K147P9645k4539q2313o9070n4912M4995
16205f1186J8559K974l8049K4755r079O2308M3517J761r61K910j3781J3442k7457
$$ y = [45645, 134088, 145654, 178450, 303971, 331863, 244152, 233202, 247257, 229914, 244814, 192618, 57923, 34173, 103496, 99619, 83584, 75424, 101629, 61028, -4867, 39294, 98187, 3539, 58020, 97914, 133884, 215656, 275287, 294830, 326924, 355660, 369108, 437311, 499640, 562782, 655911, 705445, 703802, 736792, 753416, 707110, 562034, 406050, 316364, 215629, 145054, 117393, 132193, 141323, 109800, 50198, 50442, 54190, 98842, 77020, 5540, 43499, 71838, 68746, 104133, 100436, 20004, -42301, -61736, 5960, 50540, 36532, 117814, 100355, 72923, 28025, 16925, 7234, 49861, 42861, 45008, 124653, 100114, 17801, -51269, -106181, -61186, -42627, -39653, -77702, -52947, -62026, 282, 43799, 45560, 44599, 47509, 33728, 47170, 19713]
16192A9713L0861k6507l3572k289O7063n192j5158J4158k2191p003r0910L6610
16180c4417N9517N1407K9421l4744j0374k1646J6852l1158m2895J8474L3640L6192
16168G0269l8583L606m264n9567j9268r579q538N913o8812R3208N1035j6451J3751
16155A2720J6581K3523N537l8770j8453K2085q584Q2186r777n3867J7539M9778
16143A00498m2561j80850q4608J0884Q2807Q9163n2518q6210k9975L9212N4197
16132i9961k9965M4016J13166O1758k0665l4792O870m7381J8053M2481J8439p583
16120F4436J769J4788o4450n0780k972L6309K450K9933k097J0380j5726k7742
16108c702n8587j9149k1943O5416O5735m6405M1018L5599m8099j15509l0692J8909
$$ y = [19713, 50574, 24067, -9505, -11794, 55269, 50077, 34919, 49077, 26886, 19883, -71027, -34417, 25100, 76507, 105928, 71184, 60810, 39164, 56016, 24858, -18037, 437, 34077, 70269, 31686, 35292, 31028, -28539, -47807, -57386, -65924, -60011, -128823, -35615, 15420, -1031, 12720, 29301, 52824, 58361, 19591, 1138, 23223, 14639, 96825, 87048, 33181, 50720, 100498, 57937, -122913, -207521, -196637, -113830, -24667, -77185, -163395, -193370, -154158, -99961, -129926, -85910, 27256, 89014, 68349, 33557, 40427, -6954, 11099, 53580, 72019, 64436, 66205, 80993, 16543, -34237, -37209, -900, 1550, 31483, 29386, 39766, 24040, -3702, -62289, -81438, -103381, -37965, 27770, -18635, 22383, 57982, 9883, -105626, -136318, -117409]
16096a17409N5414l3600j0670M8885M0772j772k8686M2726O177l4508k0046J2743
16084c9974k1L0113K6115r900j41483l1224O3829N3690Q5895j1263k6269l9936
16072d0428O7567r68o9461m9919K7439k5968k6866l9670L4585K8118L814k1800
16060a13557L7230P3761j6129j7769m2143J6884L1165r010L651Q2453j2570l3735
16048B31p6759o4128M3384L6327k2387Q16R6184L0895o8327l2790j2059L8171
16036c0442L5626p0150k8822L4738N0453J0506l7209L3317L6067k5941m8045L8550
16024a352O6145j6568n6885k4110l1415J3302Q616K921N8522O2600P306o2826
16012B6256j33231j5626J6237P7480L3235k1022l7122o9389N4415M0900M554J0379
$$ y = [-117409, -61995, -95595, -106265, -57380, -16608, -18380, -47066, -4340, 1837, -32671, -52717, -39974, -39995, -9882, 16233, 6333, -135150, -166374, -102545, -48855, 37040, 25777, -492, -40428, 27139, 26171, -43290, -93209, -65770, -91738, -118604, -158274, -123689, -95571, -91757, -113557, -76327, -2566, -18695, -36464, -78607, -61723, -30558, -39568, -35917, 46536, 33966, 231, -76528, -140656, -97272, -60945, -83332, -82516, 13668, 44563, -23764, -56554, -68613, -30442, 5184, -64966, -93788, -59050, -8597, 1909, -35300, -1983, 34084, 8143, -39902, -1352, 64793, 48225, -8660, -32770, -64185, -50883, -42267, -39346, 19176, 81776, 89082, 26256, -106975, -122601, -106364, -28884, 4351, -16671, -53793, -123182, -68767, -27867, -23313, -12934]
16000a2934M3976K7245n5684j3681O461M5234j2519k0654p0680p747K3538n082
15988e2527K4208p806l0209l589n0375O1925R7123K9501l8785j8203j3648k8998
15976c1383L2119R388k8933n9090J6845N812J5060l3797k9453J1555m5029M3567
15964i3339M976m5693q800L3250M9626J128M352q378k4288L3912N4303j8525m0525
15951e8001Q591K5162o416j9321j6471m5459N4147J05739J0716j9229m7355k6746
15939c4643o19P8483Q9825k2189j463m5932p710j9626k261l616P6848Q4899r3355
15926I8641o2349n1645M465R272M7068j0514k9695p669N2458k892m3737k2048
15914a8645k6284m398K5964J2009n3109k356L9065J01704K8354n3950l7669K8214
$$ y = [-12934, 31042, 58287, 2603, -11078, -4617, 40617, 28098, 7444, -63236, -70983, -47445, -52527, -28319, -36125, -66334, -69923, -120298, -58373, 38750, 68251, 29466, 11263, -2385, -31383, 736, 10124, -18809, -77899, -61054, -55242, -40182, -73979, -103432, -91877, -136906, -93339, -88363, -134056, -142856, -109606, -59980, -58852, -54500, -62878, -87166, -53254, 1049, -17476, -58001, -49410, -24248, -30664, -49985, -66456, -111915, -57768, 47971, 58687, 39458, -7897, -34643, -35262, 43221, 133046, 110857, 109394, 63462, 55752, 36126, 33865, 30249, 107097, 191996, 98641, 36292, -15353, -10888, -1616, 45452, 34938, 5243, -2426, 50032, 47140, 3403, -18645, -44929, -49327, -23363, -11354, -64463, -66819, -27754, 73950, 102304, 48354, 10685, 38899]
15902C8899k1363n0253K7597K7199j4682L899L1599L0884j5361N623k1140L808
15890D6709l7323k9599p581J3711L8656K7574n0182o9353n2058M7019p59k4794
15878i7980M2147O7310l2611l6326l9678J0934o7397J06K9760n305M6938J3015
15866f9087o0934o289L0325P7628K707o174R103K5579J1217L660J0976j152k852
15853B4707J0509j6621k2980P32K9961O2346j7868o9852m0892k2606K6810O241
15841b9513J5031m379m4101N3517K2855j04542J1987K8197O6796m8576k0265N5755
15829B762Q0772R291l4216p0272n4732L7029M1956j3085l1350Q1530N4886l1116
15817G3455o5612m3264P5089M3714m0693k0205M7751l232K1708L1346K50n6232
$$ y = [38899, 17536, -32717, -5120, 22079, 7397, 11296, 42895, 73779, 58418, 64041, 42901, 46709, 9386, -20213, -27794, -14083, 24573, 52147, 1965, -67388, -119446, -72427, -73186, -97980, -55833, 11477, -21134, -57460, -97138, -86204, -153601, -153495, -123735, -129040, -82102, -69087, -130021, -136310, -105985, -28357, -25650, -31824, -22721, 2858, 14075, 17735, 28711, 27559, 24707, 35216, 18595, -4385, -3653, 26308, 88654, 70786, 934, -39958, -62564, -35754, -29513, -14482, -18861, -62962, -9445, 13410, -91132, -79145, -50948, 15848, -32728, -52993, 2762, 83534, 92825, 58609, -11663, -66395, -29366, 12590, -495, -31845, 49685, 104571, 73455, 7843, -35421, 39668, 83382, 42689, 22484, 70235, 67003, 88711, 120057, 120307, 64075]
15805F4075K0851l0376N2711p738p5095M3278J4050p5845j8528O5640M644J3160
15793G0827j4112r0166N5114K3314K5588L9898l7996J105q747k2468l5636O128
15781A2849k147j1805K1554N0669l5015m4913p2516j5493N2029k9912N7809J06271
15769H9380j1525m4032J6205o4296p5801M9555l9321K5904J15996N9615k3746
15758I7934n4905m4038M0775l1594k0053j588K0413J6045n1493k8758K3782R7107
15746F3627n002l8332j2063k8441L1571L3441l7624k9325N4312P4598K219n0094
15734E8887l5206p9347J3877l1078m7338M7732O0237J7559J5973J7557J644j5225
15722B5272N9191k7883j03871L5723R1878m3867J4577L5418j6201k1260n2719
$$ y = [64075, 84926, 54550, 107261, 99523, 24428, 67706, 81756, 5911, -12617, 53023, 57667, 70827, 56715, -33451, 21663, 44977, 70565, 110463, 72467, 73572, 64825, 42357, 6721, 12849, 10702, -1103, 20451, 71120, 36105, -8808, -81324, -96817, -44788, -74700, -16891, 89380, 77855, 33823, 50028, -14268, -90069, -40514, -79835, -53931, 62065, 121680, 97934, 43029, -1009, 39766, 8172, -11881, -13469, 6944, 22989, -28504, -57262, -33480, 63627, 58625, 20293, 8230, -20211, 11360, 44801, 7177, -22148, 32164, 106762, 108981, 58887, 23681, -55666, -41789, -72867, -120205, -72473, -12236, 5323, 21296, 38853, 40497, 25272, 84463, 56580, -47291, -11568, 80310, 36443, 51020, 86438, 70237, 48977, -3742]
15711c742n433M2070j4836o1577l7673R1878j793n2741j681J9020J3914l4300
15699d6894R939Q1335O6238j6882k982J7550N3838n0018o4195J2441k390O3780
15687A21760K5193j1520k5280o2470p2315l5460L0392j5755L3783N4445Q918m3670
15675H021m9729k1691N0333L6001P9684O1747O916L658N6514P8314J82296K89563
15663G81627K29536K17916K30967L34345L26079K88907L52573J39626q403n8750
15653B834423j44912k65818l38711l91521l70586k84993k30307j49835j26300
15644E31440q2273l7299l7205l6655p5053L43k4845k5072J8802N753K2056n8048
15632B01944j1528m3155l3712J3443J8603K4484j1278r1230N0640L3775o2801
$$ y = [-3742, -9175, 32895, 18059, -43518, -81191, 10687, 8894, -43847, -45528, -26508, -12594, -46894, -36955, 44380, 110618, 93736, 90754, 108304, 162142, 112124, 47929, 60370, 57980, 121760, 146953, 135433, 110153, 47683, -24632, -60092, -29700, -45455, -11672, 42773, 51691, 8021, -41708, -63399, -13066, 22935, 102619, 164366, 171282, 174940, 231454, 309768, 492064, 781627, 1011163, 1229079, 1460046, 1794391, 2120470, 2409377, 2761950, 2901576, 2893173, 2834423, 2689511, 2423693, 2084982, 1693461, 1322875, 1037882, 807575, 657740, 531440, 449167, 411868, 374663, 338008, 262955, 263298, 238453, 213381, 232183, 237936, 259992, 201944, 190416, 147261, 113549, 126992, 145595, 170079, 158801, 67571, 118211, 151986, 89185]
15621H9185n4574q880K14j5694p393O9064M8204M1462k6303k7168j183L386m620
15608A05700M8809m1260q4063K3992K3372n5369P5673P8810k7384j9385J5003
15597A43898M1810N74n3510m5373M160j6688o2396Q968L4617J2398J2359N9614
15585A40431O924n441k8657l6364o949K0505O999k4084k4565l2965K386m3186
15573b4966J1045J2408k188M469K6049L8586N906l2368L9199K9149M4013M8246
15561A99548N5652k1084l571r1741q5423m937L6763K509m6126L673O9222L5023
15549A49508k1832k197r906n224O5189J8679m6305j1385O2165L6678l0213p6374
15537A28783r7195K1492j0316k8730J3639P8242N303m9765n6966N5068o3802j6701
$$ y = [89185, 34611, 25731, 25945, 10251, 2858, 71922, 120126, 161588, 135285, 108117, 106934, 110320, 105700, 154509, 113249, 29186, 53178, 76550, 21181, 96854, 175664, 148280, 128895, 143898, 185708, 186282, 132772, 87399, 91559, 74871, 12475, 21443, 56060, 68458, 80817, 140431, 147355, 141914, 113257, 76893, 69944, 90449, 97448, 73364, 48799, 15834, 18220, -24966, -13921, -1513, -3701, 768, 26817, 65403, 71309, 38941, 78140, 107289, 151302, 199548, 255200, 234116, 230545, 138804, 53381, 48444, 85207, 87716, 41590, 45263, 114485, 149508, 127676, 125479, 115573, 110349, 175538, 194217, 147912, 136527, 198692, 235370, 205157, 128783, 31588, 53080, 42764, 14034, 27673, 105915, 111218, 61453, 4487, 59555, -4247, -20948]
15525b0948M7333M9680P1239p095J6530J485n170l9779k1758K390k5393k5993
15513D2521M5950j3829Q881k1853m1568J5446M7815k2519k9494p2922q454L2428
15501a7598J3904L2588l4785K3026M8686q47k4994K6214L439k2199O9723L1215
15489A48372o6780j4221o6043o0357j9330L4814K692M3591N4521j7619L1268N0219
15477A21127J5240J1326J9854o2245p4244n127M3438j2580P551J79692N6551n1055
15465B49528l2685J05924Q5148j1009j1149j19885j68528L1701n410k6491n9719
15454C7425j11935K2403O5991K3664l371L603J314N5945l0489j05079j1116L1905
15442a9740j6930n4022P266L8559p667K4036p256J1526j0298K4125M3345Q4478
$$ y = [-20948, 26385, 76065, 147304, 140209, 156739, 158224, 153054, 113275, 91517, 93907, 68514, 42521, 88471, 74642, 83523, 61670, 20102, 35548, 83363, 60844, 31350, -41572, -50026, -17598, -3694, 28894, -5891, 17135, 65821, 64974, 39980, 66194, 69633, 47434, 117157, 148372, 81592, 67371, 1328, -59029, -78359, -43545, -40853, 2738, 57259, 39640, 70908, 121127, 136367, 147693, 167547, 105302, 31058, 25931, 69369, 56789, 64340, 244032, 300583, 249528, 216843, 322767, 407915, 396906, 385757, 265872, 97344, 129045, 123635, 97144, 37425, -74510, -52107, 13884, 37548, 34177, 37780, 39094, 95039, 64550, -40529, -51645, -19740, -36670, -90692, -83426, -44867, -52534, -28498, -35754, -24228, -34526, -10401, 32944, 117422]
15430A17422r876k1243M0411P3034M8852L650J8835l7738j7110n3553j7156l5144
15418A10384J7530n9414k1067j8708p7083N2727K5086K0009M3899n1136m658M0196
15406G7765L865L9195L9193M4450O0553j2046q0663j6332M4097M1829J3780M4873
15394C00559k1010q3527j769O7215k5365m0257l8144J9598n5338l9556m3276K8811
15382F7941R1809R304P0182m2010o8316J7745J5674K0820o7699n2560L2719K4889
15370A20498L715K8399j1307l4361j5388o725N5449N9207M676J1159N0226j0536
15358B55012j6799n9135K3153J2252o1040L3297O1203P1359n322j1977Q3673N5856
15346D41532l7503n339J2473P255M7396M6615O8311k3545J2071R834P3298N1006
$$ y = [117422, 107546, 86303, 126714, 199748, 248600, 252250, 271085, 233347, 216237, 162684, 145528, 110384, 127914, 68500, 47433, 28725, -48358, 4369, 29455, 49464, 93363, 42227, 37569, 77765, 81630, 120825, 160018, 204468, 265021, 252975, 172312, 155980, 200077, 241906, 255686, 300559, 279549, 196022, 194253, 261468, 236103, 195846, 157702, 177300, 121962, 82406, 39130, 67941, 159750, 169054, 239236, 197226, 128910, 146655, 162329, 183149, 115450, 62890, 95609, 120498, 124213, 152612, 141305, 106944, 91556, 84831, 140280, 199487, 204163, 215322, 265548, 255012, 238213, 179078, 202231, 214483, 153443, 186740, 247943, 319302, 313980, 302003, 385676, 441532, 404029, 398690, 411163, 418418, 465814, 512429, 580740, 557195, 569266, 579100, 652398, 703404]
15334G03404m4071j2888k6393l7950l7372k6444n7127m3569l6328m8285J6799
15323C49776R1846j7688o6393K0474O411J787L6749l7123j2383j1302J2421K5615
15311D00190j0445j0427p083P0480R0966l0472l2169j3917k6656l4806O5689N0056
15299E11406r5981o4958M5245N0240J5554J9571j0688o048O9871K3214j0296K1065
15287E68195N4812k7264l969J10749N4110l8065l5503M977P2196L8361O2445K5922
15275H86966J04320R852N1936L7603M8941J16579P6347j3701K4968Q5534O4740
15264A494085N4777N9697K2819P5176N7356Q9211M5656R291R4492J06215J32653
15253B241428J50176J45334J53664J39083J03312J73642K36574K64208K38434
$$ y = [703404, 659333, 646445, 620052, 582102, 544730, 518286, 461159, 417590, 381262, 332977, 349776, 441622, 423934, 357541, 378015, 384426, 386213, 422962, 385839, 373456, 362154, 374575, 400190, 389745, 379318, 372235, 442715, 533681, 503209, 471040, 457123, 430467, 395661, 461350, 511406, 415425, 350467, 395712, 445952, 461506, 481077, 470389, 464341, 534212, 557426, 547130, 568195, 623007, 595743, 591774, 702523, 756633, 718568, 683065, 688042, 760238, 798599, 861044, 886966, 991286, 1001138, 1053074, 1090677, 1139618, 1256197, 1332544, 1318843, 1343811, 1429345, 1494085, 1548862, 1608559, 1631378, 1706554, 1763910, 1853121, 1898777, 1908068, 2002560, 2108775, 2241428, 2391604, 2536938, 2690602, 2829685, 2932997, 3106639, 3343213, 3607421, 3845855]
15244C845855J79574K76096L51647L73213M07667M93358N64715N55259P69429
15235G816813J043682J322278J622750K034144K394092K761049L117790L534640
15227B5647238M014831M610395N523441P155774R838312J4765263K2676243L3139878
15219A27371375M4895942N6746517O5726276O9626564O7145021N7719863M1749901
15212E30981459J9561535m753315k8495475m7950945o1256827o6989981o4682149
15205B76414302n7759165m8137303l7803529k8182622k0361842j4391871j0197826
15198E9580144p656452o090516n129847m444240m033887l650661l274112k824741
15190B2475688k486897k102156j814953j554683j272539j126795r41650q09329
$$ y = [3845855, 4025429, 4301525, 4653172, 5026385, 5434052, 5927410, 6492125, 7047384, 7816813, 8860495, 10182773, 11805523, 13839667, 16233759, 18994808, 22112598, 25647238, 29662069, 34272464, 39795905, 46951679, 56789991, 71555254, 94231497, 127371375, 172267317, 229013834, 294740110, 364366674, 431511695, 489231558, 530981459, 550542994, 545789679, 517294204, 469343259, 408086432, 341096451, 276414302, 218655137, 170517834, 132714305, 104531683, 84169841, 69777970, 59580144, 51923692, 45833176, 40703329, 36259089, 32225202, 28574541, 25300429, 22475688, 19988791, 17886635, 16071682, 14516999, 13244460, 12117665, 11176015, 10366686]
15182A0366686q01192p00779o02276n69742n22353m96932n52651m96001l84374
15173E240386l63378l86010l24525k63192k26613k16349k51191k80878j62234
15164B766016j94384j08937o5468m6724l9612p218q0690j00147m0309m3486J6303
15153B055344j4799o9605K951M717J8099q416p9411j12462l5655K0111q7245k8456
15141A665173o4242j24149j32765r8118m2532j3348k6568k1198L3033l3012n4308
15130A087966J0705J0424J3444k8898L8979L1090r3936l6909j07140q6402l9241
15119H00082m6814j7990R048N0855J3921L7888M5463L4769k3079L6384k8508n2441
15107H59578l2774k5302l244j1935q5673j23734j09567n172j3414m700K4336L199
$$ y = [10366686, 9565494, 8864715, 8262439, 7692697, 7170344, 6673412, 6120761, 5624760, 5240386, 4877008, 4490998, 4166473, 3903281, 3676668, 3460319, 3209128, 2928250, 2766016, 2571632, 2462695, 2397227, 2350503, 2310891, 2303673, 2222983, 2122836, 2082527, 2039041, 2055344, 2040545, 1970940, 1973891, 1978608, 1996707, 1988291, 1908880, 1796418, 1760763, 1780874, 1693629, 1665173, 1600931, 1476782, 1344017, 1245899, 1203367, 1190019, 1163451, 1142253, 1175286, 1142274, 1087966, 1098671, 1109095, 1122539, 1093641, 1132620, 1163710, 1069774, 1032865, 925725, 839323, 800082, 753268, 735278, 744326, 795181, 809102, 846990, 892453, 927222, 904143, 940527, 912019, 859578, 826804, 801502, 798258, 786323, 700650, 576916, 467349, 462177, 448763, 444063, 468399, 471598]
15095D71598j21786p2902Q0400J7271k5433j7266O975L2328K8570M2892M5154
15084D87801N4984K6307J08050M3503J46114P6122J7281J06865R6903l3281J1588
15073A142237L3105q4790k3583l0351m7990l4429m9003j10988p2601q6865l8987
15062E95755Q376K2961q2443k8362j2659M5465M6665r558P9754k5204k9223M3401
15050F54928j5336j2478M6004M8211j5757K8681k1845p8488J2390k2573r395P5729
15038F90071P4939J01144O0819L3281l5420k1151m9982m9106k8934k6275p6783
15027F72603j18322j19570p1359q1421l3778L6981K6279n437q994P8916L1426
15016D07324k1797M4250J7616M422j1603j585j8362n3206k4638k3796m1477m1658
$$ y = [471598, 349812, 276910, 357310, 374581, 349148, 331882, 338857, 371185, 399755, 442647, 487801, 542785, 569092, 677142, 720645, 866759, 942881, 960162, 1067027, 1163930, 1130649, 1142237, 1175342, 1090552, 1066969, 1036618, 988628, 954199, 905196, 794208, 721607, 634742, 595755, 604131, 627092, 544649, 516287, 503628, 549093, 595758, 586200, 665954, 640750, 611527, 654928, 639592, 627114, 673118, 721329, 705572, 734253, 712408, 633920, 646310, 623737, 614342, 690071, 765010, 866154, 926973, 960254, 924834, 903683, 853701, 804595, 775661, 749386, 672603, 554281, 434711, 363352, 281931, 248153, 285134, 311413, 305976, 296982, 375898, 407324, 385527, 429777, 447393, 451815, 440212, 438627, 420265, 367059, 342421, 318625, 277148, 235490]
15004B35490q8824q3342p1696O2636O9647q386j9202L4125m7832o5476K1357J05152
14992A43649R7492n5435O942O7624O2837N6586P1399Q2989K7313m2455J5246m5325
14980D88862q4580m4918j200m7867M7284N5682l8382m0484L1407M8437K3377L7703
14968D75321Q7005J8077j7640J60395P2350J08643J80065J2025k6787n1287l8521
14957I79646j14178j49245q6917j17606j38483r4046q2401L8023l3468p2520O2799
14946A91604k0698o8669n1924K342J80j7315m0071M5505o209K6736M2132L197
14934A06810L4073K4051m2073l3105J7439j1631k824M0000J14895J4642K2377
14923B84654m642j6009n3829j05598Q623M605J3341M8756R836l3242k5762j8560
$$ y = [235490, 146666, 63324, -8372, 54264, 123911, 115525, 96323, 130448, 82616, 17140, 38497, 143649, 241141, 185706, 192648, 260272, 323109, 379695, 451094, 534083, 561396, 518941, 534187, 488862, 404282, 359364, 358164, 310297, 357581, 413263, 374881, 334397, 365804, 414241, 437618, 475321, 562326, 580403, 562763, 723158, 795508, 904151, 1084216, 1096241, 1069454, 1018167, 979646, 865468, 716223, 629306, 511700, 373217, 279171, 196770, 234793, 201325, 128805, 191604, 170906, 102237, 50313, 52655, 52835, 35520, -4551, 40954, 34745, 61481, 103613, 106810, 140883, 164934, 122861, 89756, 107195, 95564, 92740, 132740, 247635, 262277, 284654, 280012, 264003, 210174, 104576, 113199, 117804, 131145, 179901, 189737, 156495, 130733, 112173]
14911A12173j7847k7921l1664k2916K7013P3566r893l3695J3588j2257L4291J511
14899A05949L2620k2094K1220k916o5355r2453p9810N771J26446n2478m2676j110
14887f6886K9613j6573N060O5888J03499K8541q2721K7661N4398l453n6329m2400
14875D6298r480M2264j2555k9550K3320P1271K4609K748l0227m1084L9841p633
14863A19822j1756J0910N2249O1268o410k3675l5519N37O1854p955o3707q8463
14851F9155k7140N6890N9841J6116r2806q3983m4314K2022j821J7889M5030M7501
14839H4380M7954O2674k3424k6238K1223J8646q8934q1964J4774P5152n33n0837
14827E2873J6163j2311K5466o45K2879l9974n7337K995l6131l5381P4411J03390
$$ y = [112173, 94326, 66405, 34741, 11825, 38838, 112404, 102511, 68816, 82404, 70147, 104438, 105949, 138569, 116475, 137695, 134779, 69424, -23029, -102839, -97068, 29378, -23100, -65776, -66886, -37273, -53846, -48786, 17102, 120601, 149142, 66421, 94082, 148480, 145027, 88698, 46298, 36818, 79082, 66527, 36977, 60297, 131568, 156177, 158925, 128698, 87614, 127455, 119822, 108066, 118976, 171225, 232493, 226083, 202408, 166889, 167426, 229280, 221325, 157618, 69155, 42015, 98905, 158746, 174862, 82056, -1927, -46241, -24219, -26040, -8151, 36879, 84380, 132334, 195008, 171584, 145346, 166569, 185215, 96281, 14317, 29091, 104243, 103710, 52873, 69036, 56725, 82191, 81546, 104425, 64451, 7114, 10109, -26022, -61403, 13008, 116398]
14815A16398j7388j8902k9305m9329J0832n682o6652J0317N5997O272n471k6267
14803a9180L5401L7679r1801q6089N8581J09533P6027j4051k7201K0482m302q547
14791H6532J4508j5615K4135n1455l885l1548J8820P273k5054J1030M5113M8304
14779A28158L2970m6179l7802n673Q2913J16809M8725O9711P3964J76076K05468
14768H45140K72153L17526M56679L88187K39284K10490J66864J9003j46430j74090
14758B594806k98762l89957l59035l22825k76226k29122j97268p4237Q280l4744
14748D20910l3426p2503J5614l6838o9348J5136j64j1505q3798L6375J2217N482
14736A98152J0534j7500m7971n0176L882J7549J2919o9249k9805L0388k3450j5072
$$ y = [116398, 99010, 80108, 50803, 1474, 12306, 6624, -60028, -49711, 6286, 12558, 7087, -19180, 16221, 53900, -37901, -123990, -65409, 44124, 120151, 106100, 78899, 99381, 95079, 86532, 101040, 85425, 109560, 58105, 54220, 22672, 41492, 48765, 23711, 34741, 79854, 128158, 161128, 114949, 77147, 71474, 154387, 271196, 319921, 389632, 463596, 639672, 845140, 1117293, 1434819, 1891498, 2279685, 2518969, 2729459, 2896323, 2915326, 2768896, 2594806, 2296044, 1906087, 1547052, 1224227, 948001, 718879, 521611, 447374, 455654, 420910, 387484, 314981, 330595, 293757, 224409, 239545, 239381, 227876, 144078, 180453, 192670, 198152, 208686, 191186, 143215, 93039, 96921, 114470, 127389, 58140, 28335, 58723, 35273, 20201]
14724B0201J5860j229J0030O0516M1403j5799o7317j5658k2657N0659J9045k1163
14712G3891K6599j9338r8023K0874m793q106j250J3402l4965J4973O497l0517
14700d0756L3788N9728j8556j1005L81j4652J9803N6532l839j1486j6225l1339
14688B2374J3423R853j8700j1520O4498N2700m572j8773J6134l3008q5498j9944
14676a3033M6531M0416k8366r0882m6043M7309J30713J17218r615K6223L7769
14665B58240K2614m3816j3966L063L6630n6357j7248J1515q0356o7369K3324k4421
14653E1853K2620K7986k4216k1312j17273L7161M4902Q760N3397J2793O0130M3145
14641A99946K9800m7518r6084n9749j3460J7308Q9837M7488K9943K1416J4747
$$ y = [20201, 36061, 34832, 44862, 105378, 146781, 130982, 63665, 48007, 25350, 76009, 95054, 73891, 100490, 81152, -16871, 4003, -790, -8896, -10146, 3256, -31709, -16736, -10239, -40756, -6968, 52760, 34204, 23199, 23580, 8928, 28731, 85263, 81424, 69938, 53713, 22374, 35797, 45650, 26950, 15430, 79928, 132628, 128056, 109283, 125417, 92409, 6911, -13033, 33498, 73914, 45548, -45334, -91377, -44068, 86645, 203863, 194248, 220471, 258240, 280854, 237038, 223072, 226135, 262765, 206408, 189160, 200675, 120319, 52950, 76274, 51853, 74473, 102459, 78243, 56931, -60342, -23181, 21721, 30481, 83878, 96671, 156801, 199946, 229746, 182228, 86144, 26395, 12935, 30243, 120080, 167568, 197511, 218927, 233674]
14630B33674j8351k8906l5877n5995O9868N442K1684N2160m4171j30521j9740
14619D9267N5134M6277m8832o2276l730k1613k2266m9961o495R0405N8907k3983
14607F0834m86p618n1802J7306M6311R1685K9273l9177k6581P672P488k9193l3427
14594G2285N3610R3281M882j10336r6900k2974n214K8558l1000k206o3087q5697
14582a64798L2106M9100J7165R5023m1280q5411k2439L5862K7967K0842r873l5100
14570h0836l5746O5385J01716Q3569M15J0515j03368n2243L5320M9560K6832L8368
14558A39487l0958q5921J3567l4489R13p552o509J1895L8495L1597l4620n1298
14546a5393m7698n4180L3708P1637J4561K1738L8391L6573m3538J6742K2106L4152
$$ y = [233674, 215323, 186417, 150540, 94545, 164413, 169855, 191539, 243699, 199528, 69007, 49267, 104401, 150678, 101846, 39570, 35840, 14227, -8039, -58000, -64495, 25910, 84817, 60834, 60348, 52730, 928, 18234, 64545, 156230, 185503, 146326, 119745, 127417, 134905, 105712, 72285, 125895, 219176, 224058, 113722, 16822, -6152, -11366, 17192, -13808, -16014, -79101, -164798, -132692, -83592, -66427, 28596, -12684, -98095, -120534, -84672, -56705, -35863, -45736, -80836, -116582, -51197, 50519, 134088, 134503, 145018, 41650, -10593, 24727, 74287, 101119, 139487, 108529, 22608, 36175, 1686, 2599, -4953, -11462, 433, 38928, 70525, 35905, -15393, -63091, -117271, -83563, -11926, 2635, 24373, 62764, 99337, 55799, 72541, 94647, 128799]
14534A28799K0211j8680J4132K6391j8846o3199j8951N2633K8280l291m6921j9620
14522H0938N6338N0395k389Q073m6591j552m7473K378k2715l3103l1582L4991
14510D7708l402n8798o1989j9065k8877p555q609P2923L0190n3686L5314L205
14498e2641r432p881N3368l783j3915l544R3972M0126j9315j12297j5937M859
14486d6420J8232q102R0979J4978j4276r996M9998Q452j168K0789J8157m0579
14474A01044r014Q377m588p362p1021l5770m569l3147O712L4751R618K8025k0221
14461B835K0107p6514M886M801J9982N543n4117M5314L8697N4761Q4864J0664
14449A61823n7065l4204r25k0430q0083p238N4671J0566P707k0414k1101M9957
$$ y = [128799, 149010, 130330, 144462, 170853, 152007, 88808, 69857, 122490, 150770, 147479, 100558, 80938, 137276, 187671, 185282, 193355, 146764, 145212, 97739, 100117, 77402, 44299, 12717, 47708, 44306, -14492, -76481, -95546, -124423, -131978, -140587, -67664, -37474, -91160, -55846, -52641, -62073, -69954, -16586, -20369, -34284, -37828, 56144, 96270, 76955, -35342, -51279, -46420, -28188, -36290, 54689, 69667, 55391, 45395, 95393, 103845, 102677, 123466, 141623, 101044, 92030, 100407, 95819, 88457, 17436, -18334, -22903, -56050, -49338, -14587, -4969, 23056, 2835, 22942, -53572, -48686, -43885, -23903, -18360, -72477, -27163, 11534, 66295, 151159, 161823, 104758, 70554, 69629, 49199, -30884, -38122, 16549, 27115, 34822, 14408, -6693, 43264]
14437D3264M8661m9154o0698m5954M7482O0461p3997Q803L4415k0625j4836M819
14425a7359k7494K2832M2252P3992j9355m7443Q599m308L1155q348K1800P4548
14413A50871M4916r4158l5529p6731p2245k881K7445M7387K4241L912L3349j0303
14401D0274O114Q8909k5302j28813L1912k6336J0429O4145K8440j3856J7997N1491
14389A45404L7276l7234j06059l8200M0561j4808J866K8125j769J0113N3531L7211
14377A56017l3550m7325p6168K648p643N920J0878k8824j2504M0525R236J3465
14365C2675N6009k9555m4545n373K9554m3183l5776K5991j6156O1970P7093L7480
14353A46184o7046n3890K4487K6637j3065J819l2559L0179p518j7491l8621M3821
$$ y = [43264, 91925, 42771, -17927, -63881, -16399, 44062, -29935, -21132, 13283, -7342, -22178, -17359, -44853, -22021, 20231, 94223, 74868, 27425, 36024, 31716, 62871, 54523, 76323, 150871, 195787, 101629, 66100, -10631, -82876, -85757, -58312, -10925, 13316, 17228, 50577, 40274, 46388, 135297, 109995, -18818, 13094, -13242, -2813, 61332, 89772, 75916, 93913, 145404, 182680, 145446, 39387, 1187, 41748, 26940, 28806, 56931, 55162, 65275, 118806, 156017, 122467, 75142, -1026, 1622, -6021, -101, 10777, -18047, -30551, 9974, 19210, 32675, 88684, 59129, 14584, 9211, 38765, -4418, -40194, -14203, -30359, 31611, 108704, 146184, 79138, 25248, 49735, 76372, 63307, 65126, 32567, 62746, 55228, 37737, -884, 42937]
14341D2937J28201k6943K7452J1303j3777o0916N3525J847m8395m2833o850j7089
14329D8462m1412n5002J5316N4766p746J9610K4484L8831O7334K1813l4183n3033
14317I9240j8611Q491j19670m4062M4944j7410k0714l709l3722p0668k9710J8726
14305a86875P4879M6319o118J3514J8257M6723K1490K9787N61l1602k5769l0930
14293b9764J1496j2481o937J624l397l3621K2395J7386L8895P0721J305J7310
14281I4932k4753j06979m8176k8548J10458J07318m1675k3631l1251k1920J21
14270a4104o625Q2844m896j4145J220j8132K092m1303J7317j7278p73K1614R766
14257A7597o6992l0874p4727R733J10346O5959k0043m8089O6622J9006L602K6888
$$ y = [42937, 171138, 144195, 171647, 182950, 169173, 108257, 161782, 163629, 115234, 72401, 65551, 48462, 7050, -47952, -32636, 22130, 14384, 33994, 58478, 97309, 164643, 186456, 152273, 99240, 80629, 89120, -30550, -74612, -29668, -47078, -67792, -71501, -105223, -175891, -205601, -186875, -111996, -65677, -71795, -58281, -40024, 6699, 28189, 57976, 58537, 26935, 1166, -29764, -18268, -30749, -37686, -36062, -39459, -73080, -50685, -33299, 5596, 76317, 77622, 94932, 70179, -36800, -84976, -113524, -3066, 104252, 62577, 38946, 7695, -14225, -14104, -20729, 62115, 57219, 43074, 44294, 26162, 28254, -13049, 4268, -13010, -13783, 7831, 17597, -49395, -80269, -154996, -145263, -34917, 31042, 10999, -37090, 29532, 48538, 52140, 79028]
14245G9028j4740K1737o5466p8209O5008O211p579k2826L2090O1370L936L2138
14233A12698n8380o8228K7351J3866Q090J851m4743j0824J4580n2016J0458K8897
14221a6400K191M9788J1173o0908j8736M9682L2431N2415K9692N715r3982n8083
14209a5022J8267k6868l8560l7307P9348P6307M207j7519p4186k7506N7079R1722
14197H9962K9838n4489o2290M3461j5723j261j1404l6176J9662j4024K8601k1055
14185d898l5156l1771j5407j9810n1205J9299K6177Q0989j6443k0955K2581N1035
14173D436J8914J2203K6958O3949n7313j03836n0822l7208J07818K2497l9382
14162c1786q8459o9587J2186L0733J33919N4302J0403m1867K859J3035j132Q03
$$ y = [79028, 64288, 86025, 20559, -57650, 7358, 13569, 5990, -16836, 15254, 76624, 80560, 112698, 54318, -13910, 13441, 27307, 35397, 37248, -7495, -18319, -3739, -55755, -45297, -16400, -14209, 35579, 46752, -14156, -32892, 16790, 49221, 101636, 131328, 137043, 43061, -15022, 3245, -23623, -62183, -99490, -20142, 56165, 60372, 42853, -31333, -58839, -1760, 89962, 119800, 65311, 3021, 46482, 30759, 29498, 18094, -18082, 1580, -12444, 16157, -4898, -40054, -71825, -87232, -107042, -158247, -138948, -112771, -31782, -48225, -69180, -46599, 4436, 23350, 35553, 62511, 126460, 69147, -34689, -85511, -122719, -14901, 7596, -31786, -120245, -189832, -177646, -146913, -12994, 41308, 51711, 9844, 12703, 25738, 24606, 25409]
14150B5409m3332q871K191J5389M990p290K7641K2890m1287P150l0077J6373K495
14137f329J2026m8013r5910M3839N0685P6748K9488m955Q466J0818j4035j496
14125F1332o0973r3900M7935J05590j154j5028M3697N2705m5355p0896K0336k6689
14113A7600k5827J6606p3854j575K7677J8526K0976p1790l1528M4813K4652J9428
14101a4296K1630n4687l9875N4415K5709L3837n5455l3673l4685N1570Q204k8456
14089f5762L2441J41317J01211L649j14556o9166q511p972R268j6183m6236J8429
14077b2071l130l0392L9914M5586N3700J45883N3304r0855j15795q0771q519k2876
14065c6022O193M8765L9779n7621L2722L1458J8502m4368k2141j0363k9343l940
$$ y = [25409, -17923, -26794, -24603, -9214, -4224, -11514, 16127, 39017, -2270, 4880, -25197, -8824, -6329, 5697, -42316, -138226, -94387, -43702, 33046, 62534, 57579, 66045, 76863, 62828, 61332, 359, -93541, -45606, 59984, 58830, 43802, 87499, 140204, 94849, 23953, 44289, 17600, -8227, 8379, -65475, -67050, -39373, -20847, 129, -71661, -103189, -58376, -33724, -14296, 7334, -47353, -87228, -32813, -7104, 26733, -28722, -62395, -97080, -45510, -37306, -65762, -33321, 107996, 209207, 212856, 98300, 29134, 20623, 12651, 21919, 5736, -40500, -22071, -25201, -55593, -15679, 29907, 83607, 229490, 282794, 191939, 76144, -4627, -13146, -36022, -29829, 18936, 58715, 1094, 33816, 65274, 83776, 39408, 17267, 6904, -22439, -26379]
14053b6379R8041K9027l8956q0312k0910k3627k1194N3527j3300L8722j4096l1206
14041e0663p12O0064J00689l7978j02134J3752M8864j8972m291K7243N2864L1651
14029A20377l3547r929m4793p321Q8684N484q3671Q005n70K1878L7637p210l9565
14016E5459N088P474j7793J717N3211m0525J5401j184l1618j8084M344l1854K2831
14003B4467L3164L3119o2881p1737q781M1500k6632K59J5274N2162J5138m6762
13991a710l3186J3074j3089l3133R2949K4664M0043K0975r180m2764K7753r466
13979G6930k0398l6910l8410M8537P4782J2399m9626k6667m5413j3857m8512k4410
13967i1555P7760L0326L0546K7364m451p745M548l755N2714r2247m8257O0364
$$ y = [-26379, 71662, 100689, 61733, -18579, -39489, -63116, -84310, -30783, -44083, -5361, -19457, -50663, -51375, 8689, 109378, 71400, -30734, -16982, 31882, 12910, 8619, 35862, 88726, 120377, 86830, 76901, 32108, 24787, 113471, 118955, 35284, 43289, 42719, 64597, 102234, 95024, 55459, 60547, 68021, 50228, 51945, 105156, 64631, 80032, 78848, 47230, 29146, 33490, 1636, 24467, 57631, 90750, 27869, -43868, -52649, -11149, -37781, -37522, -22248, 29914, 45052, -1710, -34896, -21822, -34911, -68044, 24905, 49569, 89612, 110587, 101407, 58643, 86396, 76930, 56532, 19622, -18788, 29749, 104531, 116930, 67304, 40637, -4776, -18633, -67145, -91555, -13795, 16531, 47077, 74441, 69990, 62245, 66793, 63038, 115752, 23505, -24752, 35612]
13955C5612J2961L1541J6414m781J6280K8649r7004m8083O059R1073l3004K6608
13943H2325K8906o9260o1953J17965K5748m3313l3112m908K0537K2938k0904m1963
13931B3006q3441M3386N0744L3897O606J3458K6957k0781q070l1386q8627J7008
13919a7243M4815N1905j1918r230o312k3597M1455j820J2365j9326j5892l6949
13907H253L4186N3702N3017n0408j4905k059J2142q1413j04299k2380L1418K8631
13895e4115P4410K7204k2145o2268m8K7958J27224N2251M5867P622n070K7048
13883B45938O4566O7888M5517L6464m8753j15405n1532K5621j925k9711l1846
13872B06822j2879n2812p5334K0385j5415l2618J09426O1891p6311j4291l6676
$$ y = [35612, 48573, 80114, 96528, 91747, 108027, 136676, 39672, -8411, -2352, 88721, 55717, 82325, 111231, 41971, -19982, 97983, 123731, 80418, 47306, 42398, 62935, 85873, 64969, 23006, -60435, -17049, 33695, 67592, 74198, 87656, 114613, 93832, 85762, 54376, -34251, -17243, 27572, 79477, 67559, 58329, 52017, 28420, 69875, 68055, 80420, 61094, 45202, 8253, 42439, 96141, 149158, 98750, 83845, 81786, 93928, 12515, -91784, -114164, -82746, -54115, 20295, 47499, 25354, -36914, -36962, -9004, 118220, 170471, 216338, 223960, 218890, 245938, 310504, 378392, 423909, 460373, 411620, 296215, 244683, 270304, 268379, 238668, 206822, 193943, 141131, 65797, 86182, 70767, 38149, 147575, 209466, 133155, 118864, 82188]
13861H2188j8715J0113P2994j2003l1483l0506l5410J4142m3736p1571M0253L5506
13849A1772p838N2506K1654L6395N3703R6176M0857o3001o5445L4030j668K5272
13837B34413R998K9563k8827o2168r3434q2480l7049P0416J9638K3621K9848l8375
13825G5164L9582J9014l6926p2714J0686M0235n0368J3872J8974k0243l5611N3006
13813E4671j0043q0462q953L9091l676p291L9535K9462j1181k0289j1661j853
13801G350O8611L8115n848M8571k2509j3119K6395N100l4617L802j0547n196J4980
13788A21088n2163l1275L99k1751j8685J3995J8906J2777p4442J6276L0774J5182
13776C1081M2320m115q5455m1967O6527M9996M5744m8247p5853l4090L9768J3186
$$ y = [82188, 63473, 73586, 146580, 134577, 103094, 72588, 37178, 51320, 7584, -63987, -23734, 11772, 3934, 56440, 78094, 114489, 168192, 264368, 305225, 242224, 176779, 210809, 209141, 234413, 244411, 273974, 245147, 182979, 89545, 7065, -29984, 40432, 60070, 83691, 113539, 75164, 114746, 133760, 96834, 24120, 34806, 75041, 24673, 38545, 57519, 37276, 1665, 54671, 44628, -35834, -44787, -5696, -9372, -16663, 22872, 52334, 41153, 20864, 9203, 7350, 75961, 114076, 108228, 156799, 134290, 121171, 147566, 152666, 118049, 121851, 111304, 106108, 121088, 68925, 37650, 38049, 16298, -2387, 11608, 30514, 43291, -31151, -14875, 15899, 31081, 73401, 69286, -16169, -58136, 8391, 58387, 104131, 55884, -19969, -54059, -14291, -1105]
13764a105j364m8575k8606O4911R7146j0649m6764j4623n8332k8989J4106L675
13752e9169Q2755J19575K2021m7692m4491J3884p396l0911l898r227K65Q6911
13740A22627M8986K3077L8857n7623l3384P706q1294q1311J1625K5062O5230K953
13728I2511l8511o2908j9518P5401K3220l2197o1690M62M2628Q7871l4077k3143
13716E0049k7738R677n9233j0584M1626L1868N098l1003j9974n1123N833L1702
13704b3802J0837M4744M9415M3080K2677o2507J0098P4325L3741k0950j7175j5564
13692A48919q5399j23788j4451J8721M595M7805M522O2346J4946j9850P9612r387
13680A28591m1640M8647J8390p809m7678k4900o0138J7805M034j8034r7935p8162
$$ y = [-1105, -2469, -51044, -79650, -14739, 82407, 71758, 24994, 10371, -47961, -76950, -62844, -59169, 23586, 143161, 165182, 117490, 72999, 86883, 79487, 48576, 44678, 35451, 35716, 122627, 171613, 194690, 233547, 175924, 142540, 150246, 68952, -12359, -734, 24328, 89558, 92511, 54000, -8908, -28426, 46975, 70195, 37998, -23692, -23230, 19398, 107269, 73192, 50049, 22311, 31988, -27245, -37829, 3797, 35665, 40763, 9760, -10214, -61337, -55504, -23802, -12965, 31779, 81194, 124274, 146951, 84444, 94542, 168867, 202608, 181658, 164483, 148919, 63520, -60268, -74719, -55998, -51403, -3598, 924, 63270, 78216, 58366, 137978, 128591, 86951, 135598, 153988, 146179, 98501, 73601, 13463, 31268, 35302, 17268, -80667, -158829]
13668a58829L5991q076O1661k557k6517L7369K3482O4128k3185m4169k6259k6266
13656i3227n6487J7352M0157J23549J43270J4121j3857j12399J8112J6030n6686
13645C9935m7693k3216R0344Q7497K5822j34593m2049K0237L0591J7897k1900
13634D2872J8498n1048n0933k6039N0434L0174L1005l7461n0715k6076k8870K2437
13622g5722k9376j9358J3430K4569K022j5093j6233P9124O0603K2314o4880p3466
13610i2066j379J4300K0029J5805r328q657N4753N5195l2044l5998R793Q850K8679
13597B7932J5505L07K3157O2482J9568m1301J3138j1143m7414m0957m1972J1114
13585i584M1457o83n048K2925Q7415L4402o9583P850k1483M6987J2768m4004J7774
$$ y = [-158829, -122838, -130914, -69253, -71810, -98327, -60958, -37476, 26652, 3467, -40702, -66961, -93227, -149714, -132362, -92205, 31344, 174614, 188735, 174878, 62479, 80591, 96621, 39935, -7758, -30974, 59370, 146867, 172689, 38096, -3953, 16284, 46875, 64772, 42872, 61370, 10322, -40611, -66650, -16216, 13958, 44963, 7502, -43213, -69289, -98159, -75722, -105098, -124456, -111026, -86457, -84435, -99528, -115761, -36637, 23966, 46280, -18600, -92066, -93445, -79145, -59116, -43311, -52639, -61296, -6543, 48652, 16608, -19390, -9597, -747, 27932, 43437, 43744, 66901, 129383, 148951, 107650, 120788, 109645, 62231, 21274, -20698, -9584, 31873, 31190, 26142, 49067, 136482, 170884, 101301, 109151, 87668, 134655, 147423, 103419, 121193]
13572A21193q2129o4000m815J8653k3430o6901J0795J9340P1243M5451J1788K4198
13560H1386m3079p4594j5709n6640J482P7127K6731N4367k8634N9117L0883n2219
13548F0218r7326M605j1495k918J5108K2133l6811J965Q5762q2950k2381P3149
13536I059M0665R120Q10n5200p2534k3179n6470M6821K0562l4208Q5581N6543
13524B7570m4010j1139k3256N1513O4923j1205J8395P622k5805O622k7055K107
13512C6282J6975r257j2097l8665K2072j1916q927O0930l7823j6609j6121J9012
13500C856N164M4229K2310p19N03l2075J060l8973n8731J0362K0717L7147l8642
13487b3792j5701k2867N0099P4046k6679k9732K8163P3516L9182j7732M6903j2663
$$ y = [121193, 39064, -24936, -29751, -11098, -34528, -101429, -90634, -71294, -51, 45400, 57188, 81386, 38307, -36287, -51996, -108636, -107154, -30027, -3296, 51071, 22437, 81554, 112437, 60218, -37108, -32503, -43998, -46916, -31808, -9675, -46486, -44521, 41241, -41709, -64090, 9059, 49724, 58844, 59654, 4454, -68080, -91259, -147729, -100908, -80346, -114554, -28973, 27570, -16440, -27579, -50835, 678, 65601, 54396, 72791, 80413, 54608, 61230, 34175, 36282, 53257, 44000, 31903, -6762, 15310, 3394, -5533, 55397, 17574, 965, -15156, 3856, 9020, 53249, 75559, 74840, 75343, 43268, 44328, 5355, -53376, -43014, -22297, 14850, -23792, -39493, -62360, -12261, 61785, 35106, 5374, 33537, 107053, 146235, 128503, 175406, 162743]
13475A62743m6012l0181k2791M8513K3621L4904K6693p7716l6966l1718o2211
13464a1121P048J8369p654O7811k5750o7598N3172p4299o0261O2498M4492N3345
13452F0052m9133J2425k5344j09324k4875q032O1208M8126j9641M5883m588n7427
13440g0670J7307M9519M8395j0747m9472j982o4264l1513K3941N9175j5713n5554
13428a01578l1907q975N5465J57876R7433l5416j961j6327n8186n8318M585N5602
13416E8293q9274q517j9697p2846j9956M3888j3130M5278O3200N0518n2273K4136
13404I620j648P52l9518N7117P218M565m5850N9544l4115l7941Q7580K9006l3683
13391F2647K1462J4363P7062l5205j27983n4944L6394L3195n0250m0658k8261
$$ y = [162743, 116731, 86550, 63759, 112272, 135893, 170797, 197490, 119774, 82808, 51090, -11121, -4073, 14296, 6642, 74453, 48703, -18895, 34277, -40022, -100283, -37785, 6707, 60052, 10919, 23344, -2000, -111324, -136199, -144231, -83023, -34897, -54538, -8655, -13243, -70670, -53363, -3844, 44551, 33804, -15668, -17650, -81914, -113427, -89486, -30311, -46024, -101578, -133485, -142460, -86995, 70881, 168314, 132898, 130937, 114610, 56424, -1894, 2691, 58293, -30981, -39498, -59195, -132041, -151997, -108109, -121239, -75961, -12761, 37757, -14516, 9620, 7972, 8724, -30794, 26323, 33541, 38106, -7744, 51800, 17685, -20256, 67324, 96330, 62647, 84109, 98472, 175534, 140329, 12346, -42598, -6204, 26991, -23259, -63917, -92178]
13380i2178K9034M471k6892j3254n144J4232N1883O4300N306n9649l0716K8307
13368c0300J4255K9631J41k4574J9772m690j5652J0038K7518K7012M396o3207
13356e660k3524L2936P163j04235J7925L7111O2989o3374j7131m129J8570l0073
13344g1432j1564J7336M3663l999k4031m4744o8219j8907o300R13K744j4279N8833
13331a39986N6561J6189O1380m7824J5773O4693L3167J8890K0182j5701m4394
13320C8930l5518r602R897l4557n1248M2992N7733j3133o1654j0358M1154P7433
13308E2069j8104M576M3313l7717p5743j8169M2166j120p590j5823j1588K9660
13296a4070N9634o504M438l1664N581j6110n9639j3637p031l3713N4199L1636
$$ y = [-92178, -63144, -58673, -85565, -98819, -103963, -89731, -37848, 26452, 31758, -27891, -58607, -30300, -16045, 13586, 13727, -10847, 8925, 4235, -11417, -1379, 26139, 53151, 57547, -5660, -29184, 3752, 10915, -93320, -75395, -38284, 24705, -38669, -55800, -59929, -41359, -71432, -82996, -65660, -21997, -25996, -50027, -94771, -162990, -181897, -188197, -187284, -184540, -198819, -139986, -83425, -67236, -5856, -53680, -37907, 26786, 59953, 78843, 99025, 83324, 38930, 3412, -6190, 3707, -30850, -82098, -39106, 18627, 5494, -56160, -66518, -25364, 52069, 33965, 38541, 81854, 44137, -31606, -49775, -7609, -8729, -16319, -32142, -43730, -14070, 45564, 39060, 43498, 11834, 17415, 1305, -58334, -71971, -79002, -112715, -58516, -26880]
13284b6880j3285k2160p795j2123K0569L7453N9402n4389L550j81k3836j2352
13272e2027J83L2237n896o3863j9703P370O6130L2111N948L0985M2632N2805K6908
13259A55820p3089k7183o7245K1789n304l4240r751n5991O157N4094O7162k298
13247B9921m8490J9766j00594l1999N3897j2369l4030k9314J5704J3032Q9745
13236c4731L7320k3870O3240l0371q602R812L5099n3030k9551j0474K8439Q5129
13224F8410P6721q7369p4411M5046j7193n3980j9197L8569J9360l6568m3400o123
13212i0135M2089k4491N4289M0471J8721r5117O2830N3833o7812m5031J0745L6751
13200b857J3539m3632L8602O0788p795n7768m0537R0826K0174L8996K6205j7196
$$ y = [-26880, -40165, -62325, -70120, -82243, -61674, -24221, 35181, -19208, -15658, -15839, -39675, -52027, -51844, -19607, -25503, -89366, -109069, -101699, -35569, -3458, 2490, 33475, 76107, 128912, 155820, 82731, 55548, -11697, 10092, 4788, -29452, -39203, -95194, -89037, -34943, 32219, 29921, -18569, 1197, -99397, -131396, -77499, -89868, -123898, -153212, -137508, -124476, -34731, 2589, -21281, 41959, 11588, 2986, 12798, 47897, -5133, -34684, -45158, -16719, 68410, 145131, 57762, -16649, 28397, 11204, -42776, -61973, -23404, -4044, -40612, -84012, -90135, -48046, -72537, -18248, 22223, 40944, -54173, 8657, 62490, -5322, -50353, -39608, -2857, 10682, -32950, 5652, 66440, 58645, 877, -39660, 51166, 71340, 110336, 136541, 119345]
13188A19345k7323m4230o1102n3728j503j2501L6305K6505L9666J7058k1021l3317
13176a5846L1346P0785J7921n0593j7307J00147j417p7220l5955L2643p2223O02
13164a7117K4914O242o4691j8088j4704M2531Q348J9394K8527j313l3494l5888
13152e5339j359K9443N2821L0097j085L5274p976k1202l1348n5240k4930j9860
13140g0704M0612O6615K4382n3699l6080Q075L6404J4065K0291J9220K3256n2260
13128D0177o6867n4993O4115P7373o1732Q419L2123l510J2233p312j9910N692
13116B5808m9428o372R103l5146o1007J3544j4190j2480L4534L5440L1390M6008
13104A7204K7047k8612o1484k5094P8092K4750o3310j3906J4786q6511k1722J2106
$$ y = [119345, 92022, 47792, -13310, -67038, -68541, -81042, -44737, -18232, 21434, 38492, 17471, -15846, 15500, 86285, 104206, 53613, 36306, 136453, 135036, 57816, 21861, 54504, -17719, -17117, 7797, 14039, -50652, -68740, -83444, -40913, -32565, -13171, 15356, 14043, -19451, -55339, -56698, -27255, 25566, 55663, 54578, 89852, 81876, 60674, 29326, -25914, -50844, -70704, -30092, 36523, 60905, 7206, -28874, -20799, 15605, 29670, 49961, 69181, 92437, 40177, -26690, -81683, -17568, 59805, -1927, 6492, 38615, 35105, 47338, 40026, 20116, 25808, -23620, -29992, -20889, -56035, -117042, -103498, -117688, -130168, -95634, -60194, -28804, 17204, 44251, 15639, -45845, -70939, 7153, 31903, -31407, -45313, -30527, -117038, -138760, -126654]
13092a26654L7876Q4581N7047l7627n8986q9716k7397O302K3805M6034N888K4728
13080e4119M992J3483J4907K0989J4204o074q4220J2039O7793P6392k8854l9827
13068A1705l08n2486k3053K5054K5628J2237K4714n5536j8005J3457J117L5312
13056a64Q7933o2461o2437l3387k9490n8833N570L5317Q811J2648L5169M2987
13044a8337K506M0262K4289l4504n069K8395k7294o1511J5110l9699k5548O2223
13032c9177O6438j3027M345k2278o0311j0834J5045J1530L4145R8065m9000m0648
13020e707N1034J00357k274j74492j9877j588m7160q327J6080N7271M1491p684
13008h76K3980J844n9868o1160q049l641O2925J5020m4051k1890P5684O111l5951
$$ y = [-126654, -88778, -4197, 52850, 15223, -43763, -133479, -160876, -154574, -130769, -84735, -78847, -54119, -49127, -35644, -20737, 252, 14456, 8382, -75838, -63799, 3994, 80386, 51532, 11705, 11397, -41089, -64142, -39088, -13460, -1223, 23491, -32045, -50050, -36593, -35476, -164, 87769, 25308, -37129, -70516, -100006, -158839, -153269, -117952, -109141, -96493, -61324, -18337, -15831, 24431, 48720, 14216, 9147, 37542, 10248, -51263, -36153, -75852, -101400, -39177, 27261, 14234, 18579, -3699, -64010, -74844, -59799, -48269, -14124, 83941, 34941, -5707, 45327, 145684, 143410, -31082, -50959, -52547, -99707, -108034, -91954, -34683, 6808, -876, 23104, 24948, -34920, -96080, -104129, -107770, -44845, -29825, -73876, -95766, -20082, -13971, -49922]
12995d9922j9722m2394N4721j5560m0312J1310J1991J8581N8663Q579k4220J7883
12983a0402K1752K7141m3789k9928J9297n0070J9791K0980M817n9201j0636N1012
12971c9236P4251O1545n3340k8567l1m2189J7346K8205N5441N5841q2520r7670
12959e0924l8458k8843l551R8019M2764m1467K0348K8704r287P78K6322M3793
12947H8198J4535j2659k5491O2325J9623r5561k6672K7102m7873l2911K7047N7801
12935E5464r931L862N103N3396l8136o7524M9556m5126m2052J823K6370N9868
12923E2673k0984N799L0409p8411n9251J4150j1392M1311P9688k4457o0998n900
12911c7363k3597k748o2194j5267Q0067J7896j1387k0731l3398O3212J07203p725
$$ y = [-49922, -69644, -112038, -57317, -72877, -113189, -101879, -89888, -71307, -12644, -4065, -28285, -10402, 11350, 38491, -5298, -35226, -15929, -65999, -46208, -25228, -20411, -79612, -90248, -39236, 35015, 96560, 43220, 14653, 14622, -27567, -10221, 17984, 73425, 129266, 46746, -50924, -89382, -118225, -121776, -23757, 19007, -22460, -2112, 26592, 17305, 18083, 44405, 88198, 102733, 90074, 64583, 126908, 146531, 50970, 24298, 51400, 3527, -29384, -2337, 55464, 45533, 49395, 54498, 107894, 69758, 2234, 51790, 6664, -35388, -33565, -7195, 52673, 31689, 37488, 67897, -10514, -69765, -55615, -67007, -25696, 53992, 29535, -31463, -37363, -60960, -63708, -125902, -141169, -61102, -43206, -54593, -75324, -108722, -45510, 61693, 53968]
12899E3968l9022m7713K0955k413m213N810O441K9246O6189o538r0467m9355N2965
12886d147O8823Q4240j083j2863j0170l6987j3573L100K76j7109k4615N9170L9122
12873A34184k3943n8373m9734K080m8737m6765P7430N8801K728Nj3770K6483k5297
12860C5092p7485J0590M8010m1029O3959P2014q7806k5538j8851p1491O148J4435
12848g1952O7455l2589O0173j0486j7651m8327n2607j159M6340J22609O607j9938
12836D8475l4409J5747L5693Q101K1157M5345m6514m9021l3525k6539l7409M1037
12824a1862L5929l5404p2m0144K7262M8872k8344m625k7542r959L1567M7973l0896
12811B755J6926J1378K6325l661j8037r1739m6391L9407N2333L3199N9446m2016
$$ y = [53968, 14946, -32767, -11812, -14225, -18438, -12628, -6187, 23059, 89248, 82710, -7757, -57112, -4147, 64676, 148916, 147833, 134970, 124800, 87813, 74240, 77340, 77616, 60507, 35892, 95062, 134184, 110241, 51868, 2134, 4214, -44523, -91288, -13858, 44943, 47671, 47676, 33906, 60389, 35092, -42393, -31803, 16207, -24822, 39137, 111151, 23345, -2193, -21044, -92535, -86387, -71952, -4497, -37086, 23087, 12601, -5050, -53377, -105984, -107143, -60803, 61806, 68413, 48475, 14066, 29813, 65506, 73607, 94764, 140109, 93595, 44574, 11049, -15490, -52899, -11862, 24067, -11337, -11409, -51553, -24291, 24581, -3763, -8388, -35930, -45889, -14322, 33651, 2755, 19681, 31059, 57384, 53723, 35686, -56053, -102444, -63037, -10704, 22495, 81941, 39925]
12799C9925j62617K5439M3240L2442N4102K1405n01Q07k7719J4665k8176M6142
12787E9154P4342L3642l1621o4334j4107P6736q6787j09472l1476O0082Q0041
12776D6200m9782J5971M6867J1770m9609Q049N6584J9797j02883J7409K8664O1139
12764A10176k6615j6123m8335l0047N2248m2075p572L1426k79m4887j2729l9675
12752g4487q6352J5644M8365K6380R0131J376n9598r93M3246O9123K65l2121j3203
12739B7776q753O0664N0260m8684m5646K93L9557m6926K3727J3789p1523j03509
12727a08975J6867L8789J3195J2841P3806P6981o9428m8330l214M0912k139l4158
12715G147l237L4350J1085j6140m7432m3660O1232N1831M4220L811p4599o3929
$$ y = [39925, -122692, -97253, -54013, -21571, 32531, 53936, 53435, 54242, 26523, 41188, 13012, 59154, 133496, 167138, 135517, 71183, 57076, 133812, 47025, -62447, -93923, -33841, 46200, -3582, 12389, 59256, 71026, 21417, 29466, 86050, 105847, 2964, 20373, 49037, 110176, 83561, 67438, 19103, -10944, 41304, -771, -8343, 23083, 22804, -22083, -34812, -74487, -160839, -145195, -96830, -70450, 19681, 21057, -38541, -39534, 3712, 72835, 73100, 40979, 27776, 19023, 79687, 129947, 81263, 35617, 35910, 75467, 28541, 52268, 66057, -5466, -108975, -92108, -53319, -40124, -27283, 46523, 123504, 54076, 5746, 2532, 43444, 41305, 7147, 3910, 38260, 49345, 33205, -14227, -57887, 3345, 55176, 99396, 103207, 28608, -35321]
12703c5321j4001j7912l0502M4234P6277J7048N1064Q6566M1344o3870m0986m8470
12691F5471n3958O006M6584q5372L0966N8416k8639L198n2417l8939r3728m4530
12679a86942o028M2945L4245K0573Q893P0518J9298P9073O7525n3250j01773o1241
12667f6164q8301j3324J75707O5611j4976l892p831l4507M653j0165o794k9362
12655b9345J8809l925k7419J3999K8253L9351L8506j8033q5205M462N0338L4951
12643F4742M7669J5760n0934q8044k0042l3789q2306k3377R0181J20441M1868
12632H2169r2486n363R434m1121o030o875L2004K6809N2992r187j9467M041n4223
12619b7303K9277P3029K7057m2955k8728j5063L0733M0175n1056J1217M263K7208
$$ y = [-35321, -49322, -67234, -97736, -53502, 22775, 39823, 90887, 177453, 218797, 154927, 113941, 65471, 11513, 17519, 64103, -21269, 9697, 68113, 39474, 42672, -9745, -48684, -142412, -186942, -192970, -150025, -115780, -95207, -86314, -15796, 3502, 82575, 150100, 96850, -4923, -66164, -154465, -167789, 7918, 73529, 58553, 54661, 46830, 12323, 16976, 6811, 17, -29345, -10536, -14461, -41880, -27881, 372, 39723, 78229, 60196, -25009, -20547, 29791, 64742, 112411, 128171, 77237, -10807, -30849, -64638, -146944, -170321, -80140, 40301, 82169, -10317, -15680, -6246, -47367, -53397, -60272, -28268, -1459, 51533, 42346, 22879, 26920, -27303, 1974, 75003, 102060, 59105, 30377, 15314, 46047, 86222, 35166, 46383, 50646, 77854]
12607G7854q972l2836L2706J3092j4097l6088m2850P0039N7301p87p6825q800
12595B9737k444K9221l2672m2544o4396J06625N5391k7756o0714O8621J5299l9575
12583C4793o8705n6041N9641O3622N8616J1439n6105n4943j317j3519n6963J9500
12571e9982j0573l5185O7763O3332J14697L9863K3462m3947l5535o0616L5744
12560I9023J7994j2771j6518p205j5697o2410k5186l6689o8398J2054K7442M3634
12548d4727M5998L5451L5497o8581k6407M2880M1531n8662m3915L4286J4290m8374
12536d0733L7344P350p2651M9236M5730J9403L4008j4503p8625o2585j2145L3854
12524e4317R812M1215r336o6580P731N9076L615K1747J3997m356K5461L527N2122
$$ y = [77854, 68882, 36046, 68752, 81844, 67747, 31659, -11191, 58848, 116149, 115362, 38537, 29737, 27293, 56514, 23842, -18702, -83098, 23527, 78918, 51162, -9552, 59069, 74368, 34793, -33912, -89953, -30312, 33310, 91926, 103365, 47260, -7683, -9000, -22519, -79482, -59982, -70555, -105740, -37977, 25355, 140052, 179915, 203377, 159430, 123895, 63279, 99023, 117017, 104246, 87728, 80523, 64826, 2416, -22770, -59459, -127857, -115803, -88361, -44727, 1271, 36722, 72219, 3638, -22769, 20111, 61642, 2980, -40935, -6649, 7641, -40733, -3389, 3961, -68690, -19454, 26276, 45679, 79687, 65184, -13441, -76026, -88171, -54317, -44505, -3290, -12626, -79206, -71475, -12399, -8784, 12963, 26960, 22604, 48065, 51592, 103714]
12511A03714m2060L708L0683p4165q3350m7942O6670J16085k74j7927k9035k0331
12499E776l9178N3860L8492R274K2802k9536K3079r353m9057m8174K5759N0360
12487E4104j6933L556N54m2125K8742M9350j7044j2150k1534j4033K0203M8057
12475H0747j7215l6590L4910L524j6677M2668L1361L2988o0413j04828O3397k4633
12463B9239j2034l0498j9840L7715P5825O1630r082l4908K8684q522k9440K8392
12451A17161j7954k5769J474R814q39L8791J1493J2488k4053J05499K5012l3082
12439B20035r4164q3668J2623M2491l1168n0040K0163o7410o0820j6728Q4263
12428b4423J09957j8691j2875O238j4455q701M0803n5469P551l5615O61O8759
$$ y = [103714, 61654, 65362, 96045, 21880, -61470, -109412, -42742, 73343, 73069, 55142, 26107, 5776, -33402, 20458, 58950, 68224, 91026, 61490, 84569, 75216, 26159, -22015, 3744, 54104, 37171, 40727, 41281, -844, 27898, 77248, 60204, 48054, 26520, 12487, 32690, 80747, 63532, 26942, 61852, 65376, 48699, 91367, 122728, 155716, 95303, -9525, 53872, 29239, 17205, -13293, -33133, 4582, 80407, 142037, 132955, 98047, 126731, 118209, 88769, 117161, 99207, 73438, 74912, 84726, 83887, 122678, 134171, 146659, 122606, 228105, 253117, 220035, 125871, 42203, 54826, 97317, 66149, 16109, 36272, -31138, -91958, -108686, -24423, 85534, 66843, 53968, 60206, 45751, 37050, 77853, 22384, 29935, -5680, -5019, 63740]
12416F3740L7395K1994m3392K2709K3427J9438K2704O822M781l0457l8908k4139
12404H6114M0053L685m0183K1375J8478n1370m0827L6830o7439o0058K1966N8551
12392B7175J5049k1457Q0040K2559o1712R012l910j05865q301M6629j6890k330
12380b0001O2720l4805o0938m6015k1596M6712L5494k6609r903L0844Q5683N7068
12368I8654k6954o0762L9419N5365J6441j666N3561k3051q1374l6012L8118L3243
12356A04982k9294k6336l1291N403M6708k2147k6337j7781L77R215n0479Q41k8156
12343f4295o641n904j5967j2446l5997l382L4867P3254k7231j5213N0400J312
12331b7243l5415O4264M4853K233o7419L0542l8807K0758L20o0933L0782J3500
$$ y = [63740, 101135, 123129, 79737, 102446, 125873, 145311, 168015, 174837, 179618, 149161, 110253, 86114, 126167, 129852, 89669, 111044, 129522, 78152, 37325, 74155, 6716, -53342, -31376, 27175, 42224, 20767, 100807, 123366, 61654, 70666, 66756, -39109, -47410, -781, -17671, -20001, 42719, 7914, -53024, -99039, -120635, -73923, -38429, -65038, -74941, -44097, 41586, 98654, 71700, 10938, 50357, 105722, 122163, 120497, 174058, 151007, 69633, 33621, 71739, 104982, 75688, 49352, 18061, 23464, 70172, 48025, 21688, 3907, 4284, 13499, -36980, -36139, -64295, -70936, -76840, -92807, -105253, -141250, -144632, -109765, -36511, -63742, -78955, -28555, -27243, -62658, 1606, 46459, 48692, -18727, 11815, -26992, -6234, -5914, -66847, -36065, -22565]
12319b2565N2220j8026l8991K3208M6525M4330l5505n5121j2117k0742M4303J5658
12307B3177P9210M8369M9763m9440o2558J6584m6969k2287L104J2835r615K8199
12295G0372j7235m9528n3156L1802K2746n4502M2448L8139J1958l2616q850P9344
12283H0922m5167j05303n4557M3369O0879J0742k3244l1827J4967n768J7310O9299
12271C1622O1820L8386l4124r2501j1835M8285M5883k0873j4768m2734K3837p2812
12259c9814q7738L9719O4545j2037j4696R3199R2265L6617p3797l1240M6383m8690
12247F4716m3710j3483k7827L0863p4331j2290R2913Q7669K7355q0272l5958k9831
12235a4186N1962O1014J4041L6651m5638p9804L553j220n7973J9368J3497j2927
$$ y = [-22565, 29655, 11629, -27362, -4154, 42371, 86701, 51196, -3925, -16042, -36784, 7519, 23177, 102387, 150756, 200519, 151079, 88521, 105105, 58136, 35849, 38953, 51788, 42173, 70372, 53137, 3609, -49547, -17745, 5001, -49501, -7053, 31086, 43044, 10428, 1578, 80922, 35755, -69548, -124105, -80736, -19857, -9115, -32359, -64186, -49219, -54987, -37677, 31622, 93442, 131828, 97704, 5203, -6632, 41653, 87536, 66663, 51895, 9161, 32998, -39814, -127552, -87833, -23288, -35325, -50021, 43178, 135443, 172060, 98263, 67023, 113406, 64716, 21006, 7523, -20304, 10559, -63772, -76062, 16851, 104520, 131875, 51603, 15645, -14186, 37776, 98790, 112831, 149482, 103844, 24040, 27593, 26373, -31600, -12232, 1265, -11662]
12223a1662p456j9880N5245R8071O385n0293J1317p2108n3630K5036N513p3837
12211h7299M8190M6794k8286J3124q4261j2984M8368M511l7364l1398o9251N0742
12199a39114q922N9406J8920K3204L7193j9129K2682R2356l5456j01495o1734
12188a12089k6522M2827L7643L6453N0758j1798J0057N1677L8651J5075k6080
12177A06652k0205K1590k9999k0503N262K3069l156j6307O671m8513M3524M9962
12165A18047o42M6003L4185p6256L9229M1218q8146k9538k2637m776J02483K6071
12153A85241J0937q7566l9126j0033P614J4312M8881n6172j03692o5877j0102
12142a05583J5244O8819m209n3091L2719K4675K3931k4700L2261O4465L6478p2543
$$ y = [-11662, -19118, -38998, 16247, 114318, 120703, 70410, 81727, 9619, -44011, -18975, -13462, -87299, -39109, 7685, -20601, -7477, -91738, -104722, -56354, -51843, -89207, -120605, -189856, -139114, -148036, -88630, -69710, -46506, -9313, -28442, -5760, 86596, 51140, -50355, -112089, -138611, -95784, -58141, -21688, 29070, 17272, 27329, 79006, 117657, 132732, 106652, 86447, 108037, 78038, 57535, 62797, 85866, 82710, 66403, 73074, 24561, 68085, 118047, 117405, 163408, 197593, 121337, 160566, 201784, 113638, 84100, 61463, 56687, 159170, 185241, 196178, 108612, 69486, 59453, 67067, 81379, 130260, 74088, -29604, -95481, -105583, -90339, -21520, -25729, -78820, -46101, -21426, 2505, -22195, 10066, 74531, 111009, 38466]
12130C8466p7086q308K5464O5046m0936o0741j3687K1375M6385K9159R7885k8654
12118I4368o2234j9652J4503O871n6190k7744P6317J22520Q3470J8194o2016p6554
12106A11853l1637l344m2055L348P647k9246l071K0463J755m3339r63r087K0597
12093B921M6316M5609n7899p7876J9201N8137L8464m3850m7936j4404N0201L4329
12081E3213n9765m0672K4309P9511p6916n169K8084R871P654J9168J30882l6322
12069A33848p3539k8005M0285M1114j9779Q237n4945q0019l3282n3626L9141M7049
12057c3521K3076j1189K472N3048J7936m8373m0647J5829L5574L1195p2O205r843
12044D1690k3592J1139k7468k0926j4543J8172j8890k0323j1488K7785R163m0989
$$ y = [38466, -38620, -46928, -21464, 43582, 2646, -58095, -71782, -50407, -4022, 25137, 123022, 94368, 32134, 12482, 26985, 33856, -22334, -50078, 26239, 148759, 232229, 250423, 188407, 111853, 80216, 76872, 34817, 38165, 45812, 16566, 13495, 33958, 35713, -7626, -8589, -17676, 2921, 49237, 94846, 36947, -40929, -21728, 36409, 74873, 31023, -16913, -31317, 18884, 53213, -6552, -47224, -22915, 56596, -20320, -25489, 2595, 12466, 20120, 39288, 170170, 133848, 60309, 32304, 72589, 113703, 93924, 102161, 47216, -32803, -66085, -119711, -80570, -33521, -10445, -21634, -19162, 33886, 51822, 3449, -37198, -21369, 14205, 45400, 45328, 51533, 41690, 18098, 29237, 1769, -19157, -33700, -15528, -34418, -54741, -66229, -38444, -29281, -70270]
12032g0270n9183j0599R7681L0611p186r975k5134Q775j1173K2353K2082J778
12020a0240J8890K1468K0439q1996j2727N6645k2639j5840L1544J3283J640n4390
12008c3923k0687J1182N7562O0683q60K4048P531K8118n3452l820k1398l0579
11996B4405P9309L9039R31l1940j2847n2265o6345K8961M4087J174K7443j6781
11984F5171m7828j3556K1929j729j4167l8918J1126L4835K6017K8899n270P471
11972G3980p9423n7165K6455K1887r6826o8022j9916L8559J17806l318m5731j4568
11960a06282n5674Q191Q2181L4437L0722J5612k5334M0103k1603j5809R0284M2002
11948A18830r1328j6118J7831N3037j4233m8514o4529J5845m153j7305p096Q115
$$ y = [-70270, -129453, -140052, -42371, -11760, -18946, -28921, -54055, -45280, -56453, -34100, -12018, -10240, 8650, 30118, 50557, -31439, -44166, 12479, -10160, -26000, 5544, 18827, 20467, -33923, -54610, -43428, 14134, 74817, 73957, 98005, 105536, 133654, 80202, 76382, 54984, 24405, 103714, 142753, 143684, 111744, 98897, 46632, -19713, 9248, 53335, 54509, 81952, 65171, 17343, 3787, 25716, 23987, 9820, -29098, -17972, 16863, 42880, 71779, 66509, 73980, -5443, -62608, -36153, -14266, -111092, -179114, -199030, -160471, -42665, -45983, -91714, -106282, -161956, -153765, -71584, -37147, -6425, 9187, -16147, 23956, 2353, -13456, 76828, 118830, 27502, 11384, 29215, 82252, 68019, 19505, -45024, -29179, -33332, -50637, -57733, -49618]
11936d9618J0034Q7841Q6922J1561m0287o1906l3379K7736k9805m3238j4003m6387
11924i4529j1310j4085L6732P7318K2427k4042L3929j2905k1739L6149K3653j9753
11912C1845j0167j915j5502O573K9962J14572m5078n8067n5153o7117O259P1477
11900G689O0907l4599o293L4468K4434j0256o8287j02736O9435k0576NP2673P9011
11887A05875P32m8946L9142m9015j00320m1333m6091J3944m1691J3295M6369Q5238
11875b2801R2094n527j0626l2575L8369J762l5267o4167M161O1684m9729K0944
11863a678L8730k9282k9068K8915J07729K2349q868l9691j4494n0136l4948k7800
11851c8242l3966Q8590j8737k1194n4030L1005K8332M743J0606j0911j2584m0473
$$ y = [-49618, -39584, 48257, 135179, 146740, 106453, 44547, 11168, 38904, 9099, -34139, -48142, -94529, -105839, -119924, -83192, -5874, 16553, -7489, 26440, 13535, -8204, 27945, 51598, 31845, 21678, 19763, 4261, 10834, 40796, 155368, 110290, 52223, -2930, -70047, -63788, 7689, 68596, 33997, 27704, 62172, 86606, 76350, 8063, -94673, -25238, -45814, -45809, 26864, 105875, 106607, 57661, 96803, 47788, -52532, -93865, -139956, -126012, -167703, -154408, -108039, -22801, 69293, 63766, 53140, 20565, 58934, 60696, 25429, -38738, -34577, 27107, -22622, -1678, 37052, 7770, -21298, 7617, 115346, 137695, 128827, 89136, 74642, 24506, -10442, -38242, -72208, 16382, -2355, -23549, -77579, -46574, -18242, -13499, -2893, -13804, -26388, -66861]
11839f6861J9281l3573q729R873j5236J5627N4176l6235j8314J472J3031J1724
11827e3764l9256J2130J2701l713j2827j5739K0807k5605k812K9252O348M5730
11815b6748m2855k6704N7076l0193M2751k4107L7275R453n1523N8302L0950q3419
11803d9742k6420M524K0744N8981L4815k7656q2145l0475M3617P8396K7223K9733
11791H1595q506l8667J968k2436m5893q27m492K5086L8970l0325l0263n6938m0468
11778a31196Q158N4350J3260J0536p286M8374K4807l091j527J26j6141m1999L5164
11765f465K8375k6263R100q35q306l1791L897K0882m0021n2475q6473P744M9149
11752a33482M1111P9851Q8560q440k6046J1103j922j3177r044N767K2937o5186
$$ y = [-66861, -47580, -81153, -89882, -80009, -95245, -79618, -25442, -61677, -79991, -78519, -65488, -53764, -93020, -80890, -68189, -71902, -84729, -100468, -79661, -105266, -108078, -78826, -72478, -26748, -69603, -96307, -39231, -69424, -26673, -50780, -13505, -4052, -55575, 2727, 33677, -49742, -76162, -71638, -50894, 8087, 42902, 15246, -66899, -97374, -53757, 24639, 51862, 81595, 73089, 34422, 36390, 13954, -31939, -32766, -37258, -12172, 26798, -3527, -33790, -90728, -131196, -123038, -68688, -55428, -44892, -52178, -3804, 21003, 17912, 16385, 16511, 370, -41629, -6465, 21910, -4353, 4747, 3912, -4394, -36185, -32288, -11406, -51427, -103902, -190375, -182631, -133482, -92371, -12520, 76040, 67600, 41554, 52657, 50735, 37558, 28514, 34281, 57218, -7968]
11740g968n1974l1386J6957K5657j8396O710j4166O183K9392Q130L5064j0586
11728f383L3399P1043M4814m7408j51364p0328N895J3588J3322K2352j2669L0169
11716e3570o093J1382K828m7594k9652L7184L6793J3644k562K7638l1043l8238
11704g9283K7161M3629M5236N2450M1768l6364o8043p494n3756o9837Q8000K2838
11692F305n911n5886l4106L2888J4712k2087J4714k8938M9278m7498l0972M6703
11680f0798L5j3772r5912j1454L4302P4861L9577N3576j192k8736l4656p4453
11668a18622p912m1802J4837j7250K723K035L7969o974M6168m6964N6234M2450
11656c7108M4184J00703j7280k7919r986l0399m0048j6862o9036L281m4992l111
$$ y = [-7968, -59942, -91328, -74371, -48714, -67110, -60400, -74566, -68383, -38991, -30861, 4203, -6383, 27016, 98059, 142873, 95465, -55899, -126227, -120332, -106744, -93422, -71070, -83739, -53570, -59663, -48281, -45453, -93047, -122699, -85515, -48722, -35078, -37640, -10002, -41045, -79283, -52122, -8493, 36743, 89193, 130961, 94597, 26554, 19060, -34696, -104533, -16533, 6305, 394, -55492, -89598, -56710, -41998, -64085, -49371, -78309, -29031, -76529, -107501, -60798, -60763, -74535, -170447, -181901, -147599, -72738, -33161, 20415, 19223, -9513, -44169, -118622, -126534, -168336, -153499, -170749, -168026, -165991, -128022, -134996, -88828, -135792, -79558, -37108, 7076, 107779, 90499, 62580, 52594, 22195, -17853, -34715, -103751, -100470, -145462, -148573]
11644a48573q563J10314P3574K4154n2431l3248l1354O4955k9320l6269L6051
11633c0710J6713L820j7038k1019P652L2445P3748M866L0570k2214m0555r689
11621B8589J6858J8891n033M2364m0348o8195K0410m962n6118Q249k9929L7780
11609c1444P7901k6923l9944k9073J879P893N353M6691p0247q2528K3382N3656
11597f3404L92N1893M0918m6464j9744j5528n9541N2288L8672J9920o8043q082
11585g6723L2097R8868J2672p8495j951N5958p360k5793J700k3773l6413l300
11573e2513j5285R491k0649q152Q9104k0021j9483K8165J0165J5647K4360J889
11561D2718M489k4361l0094O3988L2490j9182j2049K734l8914M274j3039k2659
$$ y = [-148573, -157136, -46822, 26752, 50906, -1525, -34773, -66127, -1172, -30492, -66761, -30710, -13997, -10177, -27215, -48234, -40582, -8137, 65611, 70477, 101047, 78833, 38278, 28589, 45447, 64338, 59305, 101669, 61321, -6874, 13536, 8574, -47544, -39295, -69224, -31444, 46457, 19534, -20410, -49483, -47604, -39711, -34358, 12333, -57914, -140442, -117060, -63404, -63012, -11119, 29799, -16665, -36409, -51937, -111478, -59190, -20518, -598, -68641, -76723, -44626, 54242, 66914, -11581, -13532, 42426, 35066, 9273, 10973, -12800, -49213, -52513, -67798, -58307, -78956, -87108, 1996, -18025, -37508, -9343, 822, 16469, 40829, 42718, 47207, 22846, -7248, 56740, 89230, 70048, 57999, 60733, 21819, 26093, 13054, -9605]
11549i605K1556M8615O8172k6361q5801p7392o5872j0313L1818P5217K7186J2436
11537I656o6102K6625L2022n7999r8828k2610J20860L3730p9799M9860j1156q7336
11525a51077K2525J9213M7884O8543j9374l2901p486M2870L681L5818O0194m1111
11513D8779o0609m1735K1895K9214R3069k9649K6490K2395m397J3875m184n0528
11501F4615k5809M4862j2336k3618j7184K6014r6332l4447l047K798M459k4105
11489i4130M4407J2941q356l9960j6587K94L6605Q728L0188J5710J608N973J0779
11476H200k1852l9318K146R0858J00635M102k9343n4626j4942P081N374N949n9085
11463E179m97J1935n948J9356L3194K8941k4660L9161L3217j8780n6296m1565
$$ y = [-9605, 11951, 60566, 128738, 102377, 16576, -60816, -126688, -137001, -105183, -29966, -2780, 9656, -56446, -29821, 2201, -55798, -154626, -177236, -56376, -22646, -102445, -52585, -63741, -151077, -128552, -109339, -61455, 7088, -12286, -45187, -52673, -9803, -6122, 29696, 89890, 48779, -11830, -53565, -31670, -2456, 90613, 60964, 87454, 109849, 105452, 119327, 115143, 64615, 38806, 83668, 71332, 47714, 30530, 56544, -39788, -74235, -77282, -74484, -70025, -94130, -49723, -36782, -45138, -85098, -101685, -101391, -64786, -56058, -25870, -10160, -8552, -2579, 8200, -13652, -52970, -50824, 40034, 140669, 144771, 115428, 60802, 45860, 52941, 58315, 64264, 5179, 4682, 16617, 10669, 30025, 63219, 92160, 67500, 106661, 139878, 121098, 64802, 23237]
11451B3237k9210L8109N6881M029q4375l4508l5870K4468O9473k1859p765L6743
11439C9353k6348j7801N6289M693m1754l5107L0513L1173K1591J7964l6685r069
11427C4812N6122m0649o2093K2587J4890L2599m9346K7222M672m2911M0801J2752
11415E1458K1990j4473m070l0325O442L0695m2006m4760R042q934r666o095M5207
11402D505j3192J3390K8168k1428k0614j7688l4310L550m77K0888N7953r786l0067
11389a9108M0406l5056J7737l1555l7797l2243K4025Q0681J2962o5270j0289k0343
11377g5850K847J9552O8606j4619o879k7961j316L7095M9839m3340m7714j6455
11365e6195j7295M4349K5875J5838k9416j8239k0605K3639K7981J198n1869m3277
$$ y = [23237, -5973, 32136, 89017, 93046, 8671, -25837, -61707, -37239, 32234, 10375, 2610, 39353, 13005, -4796, 51493, 56186, 14432, -20675, 9838, 41011, 62602, 80566, 43881, 34812, 90934, 50285, -11808, 10779, 25669, 58268, 8922, 36144, 40816, -2095, 38706, 51458, 73448, 58975, 54905, 24580, 31022, 61717, 19711, -25049, -16007, -24941, -34607, -40702, 4505, -8687, 4703, 32871, 11443, -9171, -26859, -61169, -57619, -58096, -37208, 20745, 10959, -19108, 21298, -13758, 3979, -27576, -65373, -97616, -73591, 7090, 20052, -45218, -55507, -75850, -73003, -53451, 15155, 536, -6343, -34304, -35620, 1475, 51314, 7974, -39740, -56195, -73490, -29141, -3266, 12572, -16844, -35083, -55688, -32049, -4068, -2870, -54739, -98016]
11353i8016N6681M6304m1621p9450m3639M8232n783j0576J1143L9201j8596J9562
11341g6558N3047M3511m269k9929M60N3993L6375k951k3529J7428O1949M7837
11329A77364j0503k7386j3678p3745m0803r5854m4607L9863N5360P6156P7683
11318A19850K6005K3909o1126P3840N3544K1163o346l4466p7806j25352l2446
11307a9231Q1906j3642k3801J4796l7491R7246J7556p267p7465o8044K2590j3603
11295b6450Q341k9582r357O901N8985L7811j4700m511M09L2475K8375j7174j35692
11282f4169k4832N2689j5073N5434J7130k8103K0899R4821N613m1248j24312J5734
11270c5417M2526N4029o4879m8207m2083L6017Q5650J6688o3096m2012J6464M4398
$$ y = [-98016, -41335, 4969, -36652, -116102, -159741, -111509, -117292, -127868, -116725, -77524, -96120, -76558, -23511, 20000, 15731, -14198, -13738, 40255, 76630, 73679, 50150, 67578, 129527, 177364, 166861, 139475, 125797, 52052, 11249, -84605, -129212, -89349, -33989, 42167, 119850, 145855, 169764, 108638, 182478, 236022, 257185, 250839, 216373, 138567, 13215, -19231, 62675, 49033, 25232, 40028, 2537, 99783, 117339, 110072, 32607, -35437, -12847, -26450, -18109, -47691, -57048, -50147, 8838, 46649, 31949, 27438, 27847, 60322, 88697, 71523, -64169, -89001, -36312, -51385, 4049, 21179, -6924, 13975, 108796, 114409, 73161, -51151, -35417, 7109, 61138, -3741, -51948, -94031, -58014, 27636, 44324, -18772, -60784, -44320, 78]
11258G8O021m5609n3312p3774k6369J09199Q4365M2738l1182o0609N6593j2739
11246d600O058p0767l6593P4737N3988P0514K4193j3732l3999j9598J6059j3472
11234E2788l2846J454l2387R696K8279j04639l7675Q4229J05747J300l2240j2247
11222C1459o9038j9612j9708K6034M2149k1665m887J0542L2269j6513O3467p3729
11210a9232m420N1751n9361n740L8972l315K1999r611K1513P1825K4969o0137
11198F9213n949m1908p3975m3508L5900J1137j3745p348P9120k833M9222K7549
11186H2875l0940j6651n833L7627J826J2072J5272K5341J8966L0786N3562k7611
11174A97292N7568R7322N3023r3993j02664l2808p6920m3196L9098n6043n5986
$$ y = [78, 6099, -39510, -92822, -166596, -192965, -83766, 599, 43337, 12155, -48454, 8139, -4600, 1458, -69309, -105902, -31165, 22823, 93337, 117530, 103798, 69799, 50201, 66260, 52788, 19942, 21396, -10991, -1295, 26984, -77655, -115330, -31101, 74646, 75946, 43706, 31459, -37579, -57191, -76899, -50865, -8716, -30381, -35268, -24726, 7543, -8970, 54497, -19232, -23652, 28099, -31262, -37002, 1970, -1345, 20654, 11043, 32556, 104381, 129350, 69213, 63264, 21356, -52619, -96127, -60227, -49090, -62835, -70183, 8937, 6104, 55326, 82875, 51935, 35284, 29451, 67078, 68904, 80976, 96248, 121589, 140555, 171341, 224903, 197292, 254860, 352182, 405205, 311212, 208548, 175740, 98820, 55624, 94722, 38679, -17307]
11163a7307N9166L7800q53k91n5690j6297N4532l9611k7149q399L7955l6373m619
11150a7136j8477J8129p3108p617R950M9416O30P819P0007J5573O080O111n6946
11137A0431L5632J1588m6307M757O493q650j5976J0682j6602j3792N3594l3574
11125a724P10R8160l9880m7439o7556m3947K4199l2850m153o291P9170L5077L1779
11112B5255N4364J4233j7051j1156m770l4974n9842L3208j5885k9579K5379N8275
11100C7457K0303k4485K2295O7643J6556o6750n5295K4078o7564j5707o224m6299
11088i3992M0203O2142L8306k2452o9160j2881P2659P5176L29k2316n78q749L5472
11075I4159j6033l541q1915j1167o627n1769K061j370P1812N0273m4596j5158
$$ y = [-17307, 41859, 79659, 78806, 78515, 22825, 6528, 61060, 21449, -5700, -14099, 23856, -12517, -17136, -35613, -17484, -90592, -98209, -88259, -38843, -38213, -30394, 39613, 55186, 61266, 67377, 10431, 46063, 57651, 11344, 16101, 22594, 13944, -2032, 8650, -7952, -21744, 31850, -1724, -1014, 97146, 57266, 9827, -57729, -101676, -77477, -110327, -114480, -120771, -41601, -6524, 25255, 79619, 93852, 76801, 65645, 60875, 25901, -33941, -733, -16618, -46197, -20818, 37457, 57760, 33275, 55570, 123213, 139769, 73019, 17724, 41802, -25762, -41469, -47693, -93992, -53789, 8353, 46659, 24207, -44953, -57834, 14825, 90001, 90330, 68014, 67436, 58687, 94159, 78126, 74585, -7330, -18497, -25124, -76893, -74832, -76202, -4390, 45883, 1287, -13871]
11063a3871M2176K1974M2926k4082l7339j9479k5462L4612N6488j1371n4658l4077
11051b2163j5618k6798j0128L1714M1960J3737J6673M0993j7109m77j4688K143
11039D0239k4138j09133k2647L3711K3669K4628K8740M2485L4570k310j6378R3815
11027A47251J04920R1908L4069q7978J0153p9810r3193m2719K0273J9026n4397
11016F9503K7513J9371N659p8511k7926L6454N6450J5315k7910k6756k4958L7075
11004H1279R423L102n5833k4387l8774n193p252k5148O357m2741O1767Q1702k669
10991D1633j7376o307k7013K2515j0372l5456J2027P059j9394J4433N6874o4898
10979b6275q6791K3145K7892j1533J1718J00574l096l8770l9647m1428j0243R501
$$ y = [-13871, 28305, 50279, 93205, 69123, 31784, 12305, -13157, 21455, 77943, 66572, 11914, -22163, -37781, -64579, -74707, -42993, -1033, 12704, 29377, 70370, 53261, 52784, 38096, 40239, 16101, -93032, -115679, -81968, -58299, -33671, -4931, 37554, 72124, 69814, 53436, 147251, 252171, 344079, 378148, 290170, 300323, 220513, 127320, 84601, 104874, 123900, 69503, 97016, 116387, 122046, 43535, 15609, 52063, 108513, 123828, 95918, 69162, 44204, 81279, 90702, 93804, 37971, 13584, -25190, -30383, -37635, -62783, -56426, -99167, -37400, 44302, 41633, 24257, 17950, -9063, 13452, 3080, -32376, -20349, -13290, -32684, -18251, 38623, -26275, -113066, -89921, -62029, -73562, -61844, 38730, 35634, -3136, -42783, -84211, -94454, -84953]
10967h4953o6233J1677Q7916N4676J6324n6604r283J7805k5649K2980L0559o7911
10955f8696m1646K2738k4191R685j7520o0575K6749J2683Q6485K0707M2505l1941
10943b3017j04703M4760O0050M1345o39l7838l8067l2073M9517K5177k5614L7445
10931c657P4169J583l8669k7766p7147Q4543J7707j2738l300j2939Q281J085n0622
10918c9470j3430J28638j3541o5567r9637m1443n0872m478K5713n934Q7693K3681
10906f8647K9412J6868J2167n3646K082L4737l5612k1881L4684q041L9603o978
10894b5252K3308J1436q9083o8399M3996N8897j015l8501m3226R3800P330m6977
10882g3686l6472j01957k7749O5461Q6798J6549K0399j984q177k8443M3725k2878
$$ y = [-84953, -151186, -139509, -51593, 3083, 19407, -37197, -46480, -28675, -54324, -31344, -785, -68696, -110342, -87604, -111795, -102110, -119630, -180205, -153456, -140773, -54288, -33581, 8924, -23017, -127720, -82960, -22910, 18435, 17796, -20042, -58109, -90182, -40665, -15488, -41102, -3657, 70512, 72095, 33426, 5660, -71487, 13056, 30763, 18025, 14725, 1786, 10067, 11152, -39470, -52900, 75738, 62197, -3370, -103007, -144450, -195322, -199800, -174087, -180021, -92328, -68647, -39235, -22367, -10200, -63846, -61764, -27027, -62639, -84520, -49836, -57877, -18274, -25252, -1944, 9492, -79591, -147990, -103994, -45097, -46112, -84613, -127839, -34039, -26709, -73686, -110158, -212115, -239864, -174403, -87605, -71056, -50657, -52641, -60818, -89261, -45536, -68414]
10870f8414n0210l5866O7516J01373o4732K2246L638j56N188l089p923Q432m1172
10857f3169n6988P565p5602l3197M5359N929O0980P818q950K2236P1746j6645
10845c2918K1734r680J3712J11314n1042n4263j227L0045L7774p261l2557R358
10833C4989L4317n4921m0275K0552J5892j0966n7161l3582M8739L573K1083O7090
10821D9330K6083K6854r9769K5320J9033k8199p63M136J2626j4206J4010l1041
10809C414k985n1212k8207r649m1451j5415R4742M0231P1321R5412k605n5176
10797I8420l7109k2265k3439J8097o065m697L713m6055q9515J5941N2651L2128
10785h195L1732k5984l1057M2525k892Q122N9207P852p7548k1791m112k6058N800
$$ y = [-68414, -118624, -154490, -86974, 14399, -50333, -28087, -24449, -24605, -19417, -22506, -30429, -21997, -63169, -120157, -112592, -188194, -221391, -176032, -170103, -109123, -101305, -110255, -88019, -16273, -32918, -11184, -20864, -7152, 104162, 53120, -1143, -2370, 27675, 65449, 58188, 25631, 34989, 69306, 14385, -25890, -5338, 10554, -412, -57573, -91155, -42416, -38843, -17760, 49330, 75413, 102267, 2498, 27818, 46851, 18652, 17889, 22025, 34651, 20445, 34455, 3414, 429, -50783, -78990, -88639, -130090, -145505, -50763, -10532, 60789, 156201, 153596, 98420, 61311, 39046, 15607, 33704, 27639, 22942, 26655, -19400, -108915, -92974, -40323, -8195, 23537, -2447, -33504, 9021, 6129, 14251, 73458, 81310, 3762, -18029, -22141, -48199, -42399]
10772d2399N316K8919M0012k8868j1850n9388j2503O1754R614l3074l7405L1519
10760d8353P510n5173J7898n2335q4496J9902M8271J12066K4160J348l8895n189
10748e3286k4567O9297R096l9460O4264K6750m3962p8767k3390J8943P408L643
10736f4031J6162K1329l6177m7710K7573P1888L6208m024k754r2636m3417n1223
10724a68812M7909J4746J6593q997k8120K3465O8608J4830L8451k1467m4108K6736
10712b0166o3830q5126k5763O2143N1852L7650k7412o0045M5457L0419p6603L4494
10700i6930L6279k45O1861J3528l1308L5199p856q1843r2307M7094J9236m3930
10688a41222l3942M4569O4898K6647j6291n5085M7552J49242k6543p1405n6565
$$ y = [-42399, -37083, -8164, 31848, 2980, -8870, -68258, -80761, -19007, -9393, -42467, -79872, -48353, -40843, -96016, -78118, -130453, -214949, -195047, -146776, -34710, -10550, -9202, -48097, -53286, -77853, -8556, 540, -38920, 25344, 52094, 8132, -70635, -94025, -75082, -67674, -64031, -47869, -26540, -62717, -110427, -82854, -10966, 25242, 21218, 18464, -74172, -117589, -168812, -120903, -106157, -89564, -98561, -126681, -103216, -34608, -19778, 18673, -2794, -46902, -20166, -83996, -169122, -194885, -132742, -80890, -43240, -70652, -130697, -85240, -54821, -131424, -96930, -60651, -60896, 965, 14493, -16815, 18384, 10528, -71315, -163622, -116528, -97292, -141222, -175164, -130595, -65697, -39050, -55341, -110426, -62874, 86368, 59825, -11580, -68145]
10677f8145m5170M376l7622J1702N4413K6796M7215m878l2973Nk2602M531O6094
10664C742L631L813k3651q111n1099K6030L898m8393o1033M3878J05795j07m9204
10651e0811p533J4417Q9848l7139n2592l6117m759N590J0839o5186J526O3367
10639f8550P034j0835L132m6811k2242L4567l0959l2474l9306N1610Q9422K2124
10627d3288K7317m1713k742M703m0697N603R0148O2939m1966O478m2661j1961
10615b7840R9554L4519l4136P611L728k9606l263k4141L980m3244j3644J039L7469
10602A2026M9738P2395J9554n246m1364j08112p9873L4233K8621n913k2609m4247
10590i0797M1932J9124m6645l3497R0953M1974j1217n961K7338k2911k7225n4802
$$ y = [-68145, -113315, -108939, -146561, -134859, -80446, -53650, -6435, -11313, -44286, -44281, -66883, -62352, 3742, 7373, 11186, -12465, -20576, -71675, -45645, -41747, -90140, -151173, -107295, -1500, -1607, -50811, -58344, -43927, 45921, 8782, -43810, -79927, -84686, -79096, -68257, -133443, -131917, -68550, -61516, -72351, -69219, -116030, -138272, -103705, -134664, -167138, -206444, -154834, -65412, -43288, -15971, -57684, -60426, -55723, -96420, -90817, -669, 62270, 20304, 26782, -15879, -27840, 71714, 106233, 72097, 79708, 83436, 53830, 50567, 26426, 30406, -12838, -26482, -25443, 12026, 61764, 134159, 153713, 148467, 107103, -1009, -80882, -46649, -18028, -23941, -46550, -90797, -48865, -29741, -76386, -109883, -18930, 23044, 11827, 5866, 33204, 10293, -16932, -71734]
10578g1734r2582N3731O5777K5235L5771j8149q8450q9174K0926O1080N1522j2663
10566e8710J8119L1359L5443L0304k7857k0487m7432J13959k4569j2103N9449
10555I7475k0207N8255%l8434m2606M5505n9365q8738j3025M9664L6107q059k3527
10542f955M1976L9216R892m6891q565k2470o1201J2334L4362M2844k8527l3694
10530b7679n9314o0447N158N8382J09979O5752j04069n0530J122l211K8307M4583
10518H033k3971L5501P4406L0315q476R612j6483L2920L0548k8202r4526j7713
10506C1964M7157j41820p0805K6697K8624k4015k716R4736N977n9118O1567j5311
10494a7063K268k320L9484K0665L1578l9860m7914m087k305j2266K0733P648O946
$$ y = [-71734, -164316, -110585, -44808, -19573, 16198, -1951, -90401, -179575, -158649, -97569, -46047, -58710, -40591, -9232, 26211, 56515, 28658, 8171, -39261, 74698, 50129, 38026, 97475, 77268, 135523, 135523, 97089, 54483, 99988, 40623, -48115, -61140, -11476, 24631, 16572, -6955, 35021, 74237, 84129, 37238, 28673, 6203, -54998, -42664, -8302, 34542, 6015, -27679, -86993, -147440, -142282, -83900, 26079, 91831, -12238, -62768, -61646, -64857, -36550, 8033, -15938, 19563, 93969, 124284, 115808, 125420, 108937, 141857, 172405, 144203, 49677, 31964, 79121, -62699, -133504, -106807, -78183, -102198, -104914, -10178, -4201, -63319, -1752, -17063, -14795, -17115, 22369, 43034, 74612, 34752, -13162, -17249, -19554, -31820, -11087, -3439, 3507]
10481C507k550k3795J2953j5502m4901k5178l861o67m905j8252J01195P1611r6282
10468d6627n3896J4989P9179M4811l9444J486n6933J2606K0147R3267R6070k4751
10456A40904m5181l726J11740O9788j1538q2735M4151L6419m9471r5416o0966
10445E3969K1632n1763m7005M0201N5806m9211p9478o1988q3472k3507Q4057P5643
10433f5116K0051K3836k104l1069p5196k6139P6662K3920N3587M1543l8376p4468
10421g2869m1045M9147O3199N4217K634j1100j7959o3022K4384n9303o0427n5973
10409a88117Q1414J27031N7835o2660J8903J1681n1231o5j0521K5600L5736n4119
10397h513m8298Q778K2526J178j5904n3184P7060J0881m4886m6778j5458m2279
$$ y = [3507, 957, -22838, -9885, -25387, -70288, -95466, -99327, -99994, -104899, -123151, -21956, 49655, -46627, -100523, -85534, -6355, 38456, -988, 498, -56435, -43829, -23682, 69585, 165655, 140904, 95723, 91997, 203737, 273525, 261987, 179252, 223403, 259822, 210351, 114935, 53969, 75601, 23838, -23167, 17034, 72840, 23629, -55849, -117837, -201309, -224816, -140759, -65116, -45065, -21229, -23333, -54402, -129598, -155737, -79075, -55155, -1568, 39975, 1599, -72869, -113914, -64767, -1568, 52649, 55283, 44183, 26224, -36798, -12414, -71717, -132144, -188117, -106703, 20328, 78163, 15503, 34406, 46087, -5144, -5209, -15730, 9870, 45606, -8513, -56811, -48033, -25507, -24329, -40233, -93417, -16357, -5476, -50362, -97140, -112598, -154877]
10385a54877o8592J6308J47170P6617k6314K8828J4112n4978o1136K3496l2718
10374i2084j8554J3555k2475L8914K2931O712J6565N6080K7954p8848q3419r131
10362a21800Q3068l8589j9617k9030O0642J18686l7180K0976k3805n5341M0331
10351a659M9097L847n1331o2839k7603J4275j9140N7613r714l6515l910j0361
10339i8240k7821Q3178n2115m3707O6925l1283J1438L9065J4469R3389K2517M2436
10327A20251J7764o4681n3577K1560L2569K2101M0433M1770N4184j1352J6405
10316B37427n787k7571q2185o4138L102p9933m9796l5817M3626J2826K1514k4496
10304e1228R336K5961Q3613J8116l157o2251K4691L1146n2717N132M200L520J6478
$$ y = [-154877, -223469, -207161, -59991, 16626, -9688, 19140, 33252, -21726, -82862, -59366, -92084, -110638, -97083, -119558, -80644, -57713, -51001, -34436, 21644, 49598, -29250, -112669, -121800, -38732, -77321, -96938, -125968, -65326, 53360, 16180, 37156, 13351, -41990, -1659, 47438, 51285, -46, -62885, -90488, -76213, -95353, -37740, -47454, -83969, -87879, -98240, -126061, -42883, -94998, -138705, -71780, -103063, -91625, -52560, -38091, 55298, 77815, 120251, 138015, 73334, 19757, 41317, 73886, 95987, 136420, 178190, 232374, 221022, 237427, 231640, 204069, 121884, 57746, 60848, -19085, -68881, -104698, -61072, -48246, -26732, -51228, -41892, -15931, 67682, 85798, 82641, 20390, 45081, 76227, 23510, 28642, 32842, 36362, 52840]
10291E2840m4901p4245j2419N5088N724q252K4482P8702n4645l3326L7840O3362
10279I0250l463o9625n1500m1845J2381N4532L7420L8667O6814r2616q4536j0479
10267e4000O183n6512N7768j924k8069K6919k6041l2921J030P3514K5511K0024
10255A1482M0720m2394l8582k5927K57Q1742j3639J5621j9218r9596n9625J4442
10243a34717N40M3452M8309k3949j1521L2366N0410l1688P820L1924j174l9162
10231b7390M6575L0743n2245M8546L811j7528K1507K162k4957j9278P832Q329
10219B8107k7094o8136L0939l8459p9874o1681l3417O5893R3075J5160J148L0165
10207d4174j6188N6338L1165K7249M3125k5051m4748k6575Q200M1277k4128k0749
$$ y = [52840, 7939, -66306, -78725, -23637, -17913, -26165, -1683, 77019, 22374, -10952, 26888, 90250, 86787, 17162, -34338, -76183, -63802, -9270, 28150, 66817, 133631, 41015, -43521, -54000, -47817, -104329, -46561, -48485, -76554, -49635, -75676, -108597, -107567, -34053, -8542, 11482, 52202, 9808, -28774, -54701, -54444, 27298, 13659, 29280, 10062, -89534, -149159, -134717, -134177, -90725, -42416, -66365, -77886, -45520, 4890, -26798, -18978, 12946, 11772, -27390, 19185, 49928, -2317, 46229, 50040, 32512, 54019, 56181, 31224, 11946, 19778, 28107, 1013, -67123, -36184, -74643, -154517, -216198, -249615, -183722, -90647, -75487, -74339, -44174, -60362, -4024, 27141, 54390, 97515, 72464, 27716, 1141, 9341, 50618, 26490, 5741]
10195E741m029K5977J6704q0470q215J4812J0997M0399K4756p9130j3955J1457
10183c4956P8236J3665n052L7381K9085L6291j8250n5769j2324k6382J0153m5782
10171F296O0539o217k5035Q6767k6800o8062L333Q4610k4858K4015P36p0399j25959
10158h1034Q706n32J16830K7946j8316n6074K7607P46J1325p6863n5263N3491
10146d1431k1152J0670J995j2873m4037K0320m7401K6412M1760L0525K059o0313
10134i3466j611m166Q2102N5374m4522n427K1715M860m72r725K5330J4179o0702
10121a6531n5575K7041o1676M7832J20701K0942m3529p3414n6516m4486M5073
10110i0138N8372K1001O2018J0695o6646n6951m2160j3792N584K3803k7513J4065
$$ y = [5741, 1712, 27689, 44393, -36077, -44292, -29480, -18483, 21916, 46672, -32458, -46413, -34956, 43280, 56945, 51893, 89274, 118359, 154650, 136400, 80631, 68307, 41925, 52078, 6296, 66835, 60618, 35583, 122350, 95550, 27488, 30821, 115431, 90573, 114588, 115324, 44925, -81034, -72328, -72860, 43970, 71916, 53600, -2474, 25133, 25879, 37204, -39659, -94922, -41431, -62583, -51913, -49918, -62791, -106828, -86508, -133909, -107497, -65737, -35212, -33153, -93466, -95077, -99243, -17141, 38233, -6289, -11716, 9999, 14859, 14387, 4662, 29992, 44171, -16531, -72106, -45065, -106741, -58909, 61792, 82734, 39205, -34209, -90725, -135211, -90138, -31766, -10765, 51253, 61948, -4698, -61649, -103809, -117601, -112017, -88214, -115727, -101662]
10098a01662Q4200N3158Q817n6846J7900M0708J5527l0169j9336M7873J5305o5699
10086I776l7570J8579J7650N8141k09k8025L3006M6688K3593p4018j08122l5274
10074g5785R0693N5344P111m0502j8732M8009j8736P36j7930J7425L8309l5581
10062E0361j0392Q746j5871k5381n5060r8754K4603N7213N6784P74k0256j3817
10050d1050J3373M1146J2579M1104r0321l4776j2449O6779o556j6557K6386Q5112
10038H4770P3552J1908o377k5013j6639k0516L2135l388J6312m4920J0J9000l3580
10025H7254m0309o0544n2134J4502N9746j2592p404K3482N2951M9967j1063m9473
10013E4383m237l3836l1601J9678L4919n2512j24069M1667N1156L284j0338j4042
$$ y = [-101662, -17462, 35696, 44513, -12333, 5567, 46275, 61802, 31633, 12297, 60170, 75475, 9776, -27794, -9215, 8435, 66576, 66367, 38342, 71348, 118036, 141629, 67611, -40511, -75785, 14908, 70252, 77363, 36861, 18129, 66138, 47402, 48138, 30208, 47633, 85942, 50361, 39969, 48715, 32844, 7463, -47597, -146351, -121748, -64535, -7751, -6977, -27233, -41050, -27677, 13469, 26048, 67152, -23169, -57945, -70394, -3615, -10171, -26728, -342, 84770, 158322, 170230, 163853, 138840, 122201, 101685, 133820, 130432, 146744, 101824, 101834, 120834, 87254, 46945, -13599, -65733, -51231, 8515, -4077, -11481, 12001, 64952, 114919, 103856, 54383, 50146, 16310, -15291, 4387, 39306, -13206, -137275, -95608, -44452, -41168, -51506, -65548]
10001f5548N3357L3269M1420J9211P8305q3661q2785K1318J8760o1315k330m726
9989c4725J11Q067K7163M27J4258l5028J031k3574k9581j5331N3061Q1611J5603
9976F3093k2181J3465k3372l6335P4535J2870l3796o5401P426N5037K2869j4927
9964E3283k7629m206J906M2321J6941j055O8213m8142n3778l2257K2774K1326
9952E9697O276j8081k6835j3086K0527j01625n7520N8969k2986m258O4768M6744
9940A2590K7789l5337P477L5739K0170J6386J2482j9816j7756L0027q0639q4034
9928g4922j1413N1621M379K828L6236M3174n7026n1234J2858O1898l538K2396
9916C7257j9162l9712l2244L1390O7422m6149M070r3699l3525k1723L5423J08662
$$ y = [-65548, -12191, 21078, 62498, 81709, 160014, 76353, -6432, 14886, 33646, -27669, -29999, -34725, -34614, -26547, 616, 1043, 15301, -19727, -18696, -42270, -71851, -87182, -34121, 47490, 63093, 40912, 54377, 31005, -5330, 69205, 82075, 48279, -17122, -9696, 45341, 68210, 53283, 25654, 21448, 23354, 65675, 82616, 81561, 149774, 101632, 47854, 15597, 38371, 59697, 65973, 47892, 21057, 7971, 28498, -73127, -130647, -71678, -94664, -98922, -34154, 12590, 40379, 5042, 12519, 48258, 68428, 84814, 97296, 77480, 59724, 89751, 9112, -74922, -86335, -34714, -30335, -27507, 8729, 51903, -5123, -56357, -43499, 18399, 14861, 37257, 18095, -21617, -53861, -22471, 44951, -1198, 2872, -90827, -124352, -146075, -110652, -1990]
9904a990P488j9602M0642J9207j29121o3632J0000o1000K8641M8083J8889k8211
9892a30606M7490K2104k529N1451K5591q1503n4619J6204M018L4189O1341J29738
9880A22869J733p8846L9347p797r2191M3749K2480Q179M2573P5817J5264p931
9868A85246o5m4983n5274m6397o9179n7577j7707M6870N7185o234m8059l7798
9856i3972P5741N3314P5609p4740q7755k8084m291K8693K1486K0259P6194M8526
9844A10980p3161K8538K4610o3225o9054R32K6843P8167k661q5983l1859l5279
9832i1152q5009l3847K5311N5965P5105K4234J4288m7575l1939l5909o9779j2161
9820b12468P5847O0147L6003M147k2029J48057L3260k5746j2421l8380m2810K8111
$$ y = [-1990, 5498, -14104, 26538, 45745, -83376, -147008, -137008, -198008, -169367, -121284, -102395, -130606, -83116, -61012, -63541, -12090, 13501, -68002, -122621, -106417, -102399, -68210, -6869, 122869, 124602, 45756, 85103, 77306, -14885, 28864, 51344, 59523, 102096, 177913, 193177, 185246, 185181, 140198, 84924, 38527, -30652, -88229, -105936, -59066, -1881, -8115, -56174, -93972, -18231, 35083, 110692, 35952, -51803, -79887, -84178, -55485, -33999, -13740, 62454, 110980, 37819, 66357, 90967, 27742, -41312, -40380, -13537, 64630, 61969, -24014, -55873, -91152, -176161, -210008, -184697, -128732, -53627, -29393, -15105, -62680, -94619, -130528, -200307, -212468, -136621, -76474, -40471, -36324, -58353, 89704, 122964, 97218, 84797, 46417, 3607, 31718]
9808C1718k272m1571q971n4492l4521K6206J2748J0856Q3553K3622p7710J030
9796b9804N6645K1459l3168j4271j0264R994K8896M1846j9959k7255j7853j580
9784D686r154M478K421J5235J8157r410q1596K7064L2149m4996J8950L7463L739
9771A9186Q699q911k1526O6155L9477L802m1982o0091N564j3927k8611P27j4630
9758d6068P1618K4985l365n6104L2646j8008k7812N0474L5789k238m6637k1208
9746e928K5489J9958K5228L577p248o5855r094j2240k5326M0161k1056N3871P3815
9733I5352j7397K5477o1103J6151K5691K784n0069j589P5539m1118k3083M321
9721E0956l4422K7462J816J4697K1186p4941J0326R783o3437M7062M3297j1978
$$ y = [31718, 29446, -12125, -21096, -75588, -110109, -83903, -71155, -60299, 23254, 46876, -30834, -29804, 26841, 48300, 15132, 861, -9403, 591, 29487, 71333, 51374, 24119, 6266, 4686, -4468, 10, 2431, 17666, 35823, 26413, -55183, -28119, 4030, -40966, -22016, 15447, 19186, 27885, 18974, -2552, 63603, 103080, 106882, 64900, 4809, 10373, -3554, -32165, -31438, -46068, 25550, 50535, 47170, -8934, 23712, 5704, -22108, 28366, 64155, 61917, 15280, -5928, 19561, 39519, 64747, 68324, 61076, -4779, -13873, -26113, -51439, -11278, -32334, 21537, 95352, 77955, 103432, 42329, 58480, 84171, 86955, 36886, 35297, 110836, 69718, 46635, 50956, 16534, 43996, 45812, 60509, 81695, 6754, 17080, 26863, -36574, 10488, 53785, 41807]
9709D1807l5788P1720O0160j8521p801R293l8935j0466j3246J6163m4328j4438
9697A5620M5768k7831o1092j8642P221l6441N8251M1074n6641o1365J8121J31497
9685E5540M6657l1792k6562K257O8951K105j00819q1155J8365k740j10006J7342
9673a41857R5012M1819k994M5032k17p2516k3309K2962k4712m6737p725J0091
9661a05151L0115Q1525M4866L524r88r0333K6413O9028k2585R125k6851K1254
9649C9942n3490j18022j4629N6751Q073k9560K1851M314j8660J10705J18961n8628
9637F7608l9592R286p67j2538K0709P036o4498l0502K1456M71l1299L2474K2619
9624B463P211o2635p4234L5501O4879N8514M5346j06396n7082m228k4967L659
$$ y = [41807, 6019, 77739, 137899, 119378, 111577, 120870, 81935, 71469, 58223, 74386, 30058, 15620, 61388, 33557, -27535, -46177, -38956, -75397, -17146, 23928, -32713, -94078, -75957, 55540, 102197, 70405, 43843, 46100, 115051, 117156, 16337, -64818, -46453, -49193, -159199, -141857, -46845, -5026, -8020, 37012, 36795, -35721, -59030, -36068, -60780, -107517, -115242, -105151, -75036, 6489, 51355, 54879, 53891, -36442, -10029, 58999, 36414, 45539, 18688, 39942, -13548, -131570, -146199, -89448, -81375, -110935, -89084, -84770, -103430, 7275, 126236, 67608, 28016, 37302, 36535, 23997, 44706, 51742, -12756, -43258, -21802, -21331, -52630, -20156, 2463, 9674, -52961, -127195, -91694, -26815, 31699, 77045, -29351, -86433, -90661, -115628, -111969]
9612a11969M6195K4695Q913Q998R070K4140k2402j8181l0191m4621K5917M5927
9600c3509O3891J5690J0388O292M94o4731k9940K8923J7184n2698L9094P5943
9588G7021l8458m2119K5761q34j2315N239K5060o287j1566L1466L8004L0742m4014
9575G7700m7546o97l6350m3881L5763K9686j84j5146J9579k2268J5572J4711N0133
9562G7072P297J8656n3218Q305K4245L6418m556q1707n4081r200J5838j5983N3578
9549B2664L1922r724p914k3087K4090j6334m1705j5983l3422n2111l1719N3776
9537i9547O3635K4734M8204J4122j8612L1740J3949J8606k2050j7103k3821o2042
9525b8185L8657M0200L460p9022m7192J3359M3354N2187r339K1607L3759K0319
$$ y = [-111969, -65774, -41079, -32166, -23168, -14098, 10042, -12360, -30541, -60732, -105353, -79436, -33509, 30382, 46072, 56460, 62752, 63246, -1485, -31425, -2502, 14682, -38016, 1078, 77021, 38563, -3556, 22205, 21371, 9056, 14295, 39355, 33068, 21502, 52968, 90972, 121714, 77700, 30154, 29457, -6893, -50774, -15011, 14675, 14491, -655, 18924, -3344, 12228, 26939, 77072, 84369, 103025, 49807, 58112, 82357, 118775, 114219, 32512, -21569, -30769, -14931, -30914, 22664, 54586, 44862, 36948, 13861, 37951, 21617, -20088, -36071, -69493, -121604, -153323, -99547, -35912, -11178, 37026, 51148, 32536, 64276, 78225, 96831, 74781, 57678, 33857, -28185, 10472, 50672, 54132, -24890, -72082, -58723, -15369, 36818, 27479, 49086, 82845, 103164]
9513A03164k3269q3625P5755R1441n2084n6518l8439r2345O0288O1967K1493m0201
9501B7627j3480k227l3803l2620J7898N1610N6940P8527O2721j2556n5640n9050
$$ y = [103164, 79895, -3730, 72025, 163466, 111382, 54864, 16425, -75920, -15632, 46335, 67828, 27627, 14147, 11920, -21883, -54503, -36605, 15005, 71945, 150472, 213193, 200637, 144997, 85947]
$$ [...]
##END NTUPLES=NMR SPECTRUM
##END=
