##TITLE=Analysis number 316860
Compound Code cc 45411
Book Reference 382/160/1
Project Code adrs
Chemist Name simons
##JCAMPDX= 6.0         $$ Bruker NMR JCAMP-DX V2.0
##DATA TYPE= NMR SPECTRUM
##DATA CLASS= NTUPLES
##ORIGIN= Bruker BioSpin GmbH
##OWNER= nmr
$$ XWIN-NMR		Version 3.5
$$ Mon Jan 30 10:44:11 2006 GMT Standard Time (UT+0h)  MAYBRIDGE\nmr@NMR_250MHZ
##.OBSERVE FREQUENCY= 250.131544655141
##.OBSERVE NUCLEUS= ^1H
##.ACQUISITION MODE= SIMULTANEOUS (DQD)
##.ACQUISITION SCHEME= undefined
##.AVERAGES= 16
##.DIGITISER RES= 18
##SPECTROMETER/DATA SYSTEM= dpx250
##.PULSE SEQUENCE= zg30
##.SOLVENT NAME= CDCl3
##.SHIFT REFERENCE= (INTERNAL, CDCl3, 0, 16.4605)
##AUDIT TRAIL= $$ (NUMBER, WHEN, WHO, WHERE, WHAT)
$$ ##TITLE= Audit trail, XWIN-NMR		Version 3.5
$$ ##JCAMPDX= 5.01
$$ ##ORIGIN= Bruker BioSpin GmbH
$$ ##OWNER= nmr
$$ C:\u/data/dgb/nmr/ADRS/15370/pdata/1/auditp.txt
$$ ##AUDIT TRAIL=  $$ (NUMBER, WHEN, WHO, WHERE, WHAT)
(   1,<2006-01-30 10:43:17.28 +000>,<MAYBRIDGE\nmr>,<NMR_250MHZ>,
      <created by zg, POWCHK disabled, PULCHK disabled
       configuration hash MD5:
       62 19 C7 07 E1 42 D1 B7 37 6C 3D D0 77 39 F9 E6
       data hash MD5: 64K
       B0 21 50 59 22 48 E9 C5 7F 3E 5B 85 AE 92 3F 3D>)
(   2,<2006-01-30 10:43:43.13 +000>,<MAYBRIDGE\nmr>,<NMR_250MHZ>,
      <Start of raw data processing
       ef LB = 0.3 FT_mod = 6 PKNL = 1 SI = 32K 
       data hash MD5: 32K
       AF 3B 34 C2 0B 24 50 25 F5 E8 F9 08 9A C9 96 C5>)
(   3,<2006-01-30 10:43:46.17 +000>,<MAYBRIDGE\nmr>,<NMR_250MHZ>,
      <apk 
       data hash MD5: 32K
       25 A2 89 15 4E 6B 67 0A 35 BB C3 C7 98 E4 BE ED>)
(   4,<2006-01-30 10:43:47.81 +000>,<MAYBRIDGE\nmr>,<NMR_250MHZ>,
      <abs ABSG = 5 
       data hash MD5: 32K
       2E 50 C4 51 30 0A C3 D1 46 09 EC 07 F5 0D 62 7F>)
$$ ##END=
$$ 
$$ hash MD5
$$ F2 04 E9 11 BB CD 14 CE BE 16 92 CC 47 C9 98 1C
##$RELAX= 
##$RELAX= 
##$RELAX= 
##$RELAX= 
##$RELAX= 
##$RELAX= 
##$RELAX= 
$$ Bruker specific parameters
$$ --------------------------
##$DU= <C:\u>
##$EXPNO= 15370
##$NAME= <ADRS>
##$PROCNO= 1
##$TYPE= <nmr>
##$USER= <dgb>
##$AMP= (0..31)
100 100 100 100 100 100 100 100 100 100 100 100 100 100 100 100 100 100 
100 100 100 100 100 100 100 100 100 100 100 100 100 100 
##$AQSEQ= 0
##$AQ_mod= 3
##$AUNM= <au_zg>
##$AUTOPOS= <16 >
##$BF1= 250.13
##$BF2= 250.13
##$BF3= 250.13
##$BF4= 250.13
##$BF5= 500.13
##$BF6= 500.13
##$BF7= 500.13
##$BF8= 500.13
##$BYTORDA= 1
##$CFDGTYP= 0
##$CFRGTYP= 5
##$CHEMSTR= <none>
##$CNST= (0..31)
1 1 145 1 1 1 1 1 1 1 1 1 1 1 1 1 1 1 1 1 1 1 1 1 1 1 1 1 1 1 1 1 
##$CPDPRG= <>
##$CPDPRG1= <>
##$CPDPRG2= <>
##$CPDPRG3= <>
##$CPDPRG4= <mlev>
##$CPDPRG5= <mlev>
##$CPDPRG6= <mlev>
##$CPDPRG7= <mlev>
##$CPDPRG8= <mlev>
##$CPDPRGB= <>
##$CPDPRGT= <>
##$D= (0..31)
0 1 0 0 0 0 0 0 0 0.06 0 0 0 0 0 0 0.0002 0 0 0 0 0 0 0 0 0 0 0 0 0 0 
0 
##$DATE= 1138617795
##$DBL= (0..7)
120 120 120 120 120 120 120 120 
##$DBP= (0..7)
150 150 150 150 150 150 150 150 
##$DBP07= 0
##$DBPNAM0= <>
##$DBPNAM1= <>
$$ [...]
##$SUBNAM7= <"">
##$SUBNAM8= <"">
##$SUBNAM9= <"">
##$SW= 20.6930455092707
##$SWIBOX= (0..15)
0 0 3 0 0 0 0 0 0 0 0 0 0 0 0 0 
##$SW_h= 5175.983436853
##$TD= 65536
##$TD0= 1
##$TE= 293.16
##$TE2= 300
##$TE3= 300
##$TEG= 300
##$TL= (0..7)
0 120 120 120 120 120 120 120 
##$TP= (0..7)
150 150 150 150 150 150 150 150 
##$TP07= 0
##$TPNAME0= <>
##$TPNAME1= <>
##$TPNAME2= <>
##$TPNAME3= <>
##$TPNAME4= <>
##$TPNAME5= <>
##$TPNAME6= <>
##$TPNAME7= <>
##$TPOAL= (0..7)
0.5 0.5 0.5 0.5 0.5 0.5 0.5 0.5 
##$TPOFFS= (0..7)
0 0 0 0 0 0 0 0 
##$TUNHIN= 0
##$TUNHOUT= 0
##$TUNXOUT= 0
##$USERA1= <user>
##$USERA2= <user>
##$USERA3= <user>
##$USERA4= <user>
##$USERA5= <user>
##$V9= 5
##$VALIST= <valist>
##$VCLIST= <CCCCCCCCCCCCCCC>
##$VD= 0
##$VDLIST= <DDDDDDDDDDDDDDD>
##$VPLIST= <PPPPPPPPPPPPPPP>
##$VTLIST= <TTTTTTTTTTTTTTT>
##$WBST= 1024
##$WBSW= 4
##$XGAIN= (0..3)
0 0 0 0 
##$XL= 0
##$YL= 0
##$YMAX_a= 344127
##$YMIN_a= -604119
##$ZGOPTNS= <>
##$ZL1= 120
##$ZL2= 120
##$ZL3= 120
##$ZL4= 120
##$ABSF1= 16.46054
##$ABSF2= -4.232632
##$ABSG= 5
##$ABSL= 3
##$ALPHA= 0
##$AQORDER= 0
##$ASSFAC= 0
##$ASSFACI= 0
##$ASSFACX= 0
##$ASSWID= 0
##$AUNMP= <proc_1d>
##$AZFE= 0.1
##$AZFW= 0.1
##$BCFW= 0
##$BC_mod= 0
##$BYTORDP= 0
##$COROFFS= 0
##$CY= 12.5
##$DATMOD= 1
##$DC= 0
##$DFILT= <>
##$DTYPP= 0
##$F1P= 14.0000005364418
##$F2P= -0.99999901652339
##$FCOR= 0.5
##$FTSIZE= 32768
##$FT_mod= 6
##$GAMMA= 0
##$GB= 0
##$INTBC= 1
##$INTSCL= 1
##$ISEN= 128
##$LB= 0.3
##$LEV0= 0
##$LPBIN= 0
##$MAXI= 10000
##$MC2= 0
##$MEAN= 0
##$ME_mod= 0
##$MI= 0
##$NCOEF= 0
##$NC_proc= -3
##$NLEV= 6
##$NOISF1= 0
##$NOISF2= 0
##$NSP= 0
##$NTH_PI= 0
##$NZP= 0
##$OFFSET= 16.46054
##$PC= 1
##$PHC0= 246.552
##$PHC1= 4.927487
##$PH_mod= 1
##$PKNL= yes
##$PPARMOD= 0
##$PSCAL= 4
##$PSIGN= 0
##$REVERSE= no
##$SF= 250.130015371992
##$SI= 32768
##$SIGF1= 0
##$SIGF2= 0
##$SINO= 400
##$SIOLD= 32768
##$SREGLST= <1H.CDCl3>
##$SSB= 0
##$STSI= 32768
##$STSR= 0
##$SW_p= 5175.98343685301
##$SYMM= 0
##$S_DEV= 0
##$TDeff= 65536
##$TDoff= 0
##$TI= <Analysis number 999999
Compound Code 99
Book Reference 9
Project Code 9>
##$TILT= no
##$TM1= 0
##$TM2= 0
##$TOPLEV= 0
##$USERP1= <user>
##$USERP2= <user>
##$USERP3= <user>
##$USERP4= <user>
##$USERP5= <user>
##$WDW= 1
##$XDIM= 32768
##$YMAX_p= 280209207
##$YMIN_p= -246409
$$ End of Bruker specific parameters
$$ ---------------------------------
##NTUPLES= NMR SPECTRUM
##VAR_NAME=  FREQUENCY,     SPECTRUM/REAL,   SPECTRUM/IMAG
##SYMBOL=    X,             R,               I
##VAR_TYPE=  INDEPENDENT,   DEPENDENT,       DEPENDENT
##VAR_FORM=  AFFN,          ASDF,            ASDF
##VAR_DIM=   32768,         32768,           32768
##UNITS=     HZ,            ARBITRARY UNITS, ARBITRARY UNITS
##FACTOR=    0.157963299565203, 1,           1
##FIRST=     4117.27531620269, 0,            0
##LAST=      -1058.70812065032, 0,           0
##MIN=       -1058.70812065032, -246409,     0
##MAX=       4117.27531620269, 280209207,    0
$$ Real data points
##PAGE= N=1
##DATA TABLE= (X++(R..R)), XYDATA
$$ [...]
25120 7058 -26230 -34693 -14109 11897 -5704 -11785 -3337 -24569 -18028 -15513 -38244 -21962 4421
25107 4421 -7065 -36814 -55445 -50415 -33216 -22656 2127 -15350 -2145 6803 -13408 -6002
25095 -6002 12880 -20591 -2774 15412 24922 8573 -1636 -15639 -27867 -41586 -40223 -39383 -28263
25082 -28263 -22622 -13172 -11043 8375 41691 34371 -177 -19370 -21571 -31149 -27095 -11751 -17918
25069 -17918 -15723 -11481 -16272 -7055 -23731 -24454 -32137 -29557 -35041 -48890 -61952 -80520 -47889
25056 -47889 -3296 -23360 -39010 -44377 -21922 14724 29428 17254 30662 19772 -28055 -24182
25044 -24182 -7596 -21452 -8967 9221 1547 -2954 -8286 -8836 -522 -9861 2328 13315 7066
25031 7066 -2277 -1686 -14901 -31094 -34223 -18995 -43328 -25710 2579 13163 18795 15719 12886
25018 12886 8929 11821 -1505 -42663 -33457 -17003 -10847 -31198 -45071 -47547 -44786 -23803 -11800
25005 -11800 -16200 -37221 -42756 13674 66470 42274 19403 5197 -37790 -88638 -46480 -779
24993 -779 26111 24885 29769 12921 14076 17840 27585 35566 -1571 -20662 -3056 -22716 15718
24980 15718 41772 38397 45809 68592 80941 73696 53511 33917 26014 10904 -21421 -36940
24968 -36940 -25535 -7440 -12823 -15987 -11826 -3792 -16127 -41034 -22739 3141 -5920 -247 -16573
24955 -16573 -27354 -24023 13339 22165 -14465 -307 13323 38320 25660 17468 -14241 -15305
24943 -15305 8466 47179 24168 -1339 28007 49133 36443 12336 1381 -4835 -11694 16434
24931 16434 26976 32814 -10106 -35831 -23437 14372 56019 44571 23727 3382 -7943 2556
24919 2556 -9395 -17763 -5144 -504 -808 -5126 -28194 -39453 -27597 -12312 -2381 8721 -15045
24906 -15045 -8979 -10104 6906 18205 4930 -17886 1528 56412 27161 23132 19594 -1415
24894 -1415 -18194 -30002 -33117 -23764 -12577 -14810 -25098 -28205 -25166 -18051 378 -2650 17801
24881 17801 20617 -22164 -35772 -32260 -23314 -14214 10049 32898 55763 43881 11925 -26848
24869 -26848 -16057 3361 4074 -7611 -11192 14001 6134 6888 -5339 -17027 -514 14280 7183
24856 7183 6244 4566 13079 21763 5655 -4460 18176 33126 30280 -4236 -3799 -14053 -22649 -26323
24842 -26323 -22335 -29835 -6271 -38242 -45729 -30501 -50859 -77507 -87487 -45974 -33927 -40111 -39071
24829 -39071 -19186 3796 -639 -980 -18845 -8315 3992 17392 6400 5069 -17792 -13089 -22003
24816 -22003 -9206 14602 26940 45746 31393 15789 -30184 -29495 -17663 -35144 -33964 -3627
24804 -3627 -10042 -9927 -6949 -28334 -20798 -10508 -9339 16789 4816 6373 -13196 -31641 -16744
24791 -16744 -17789 -34564 -47662 -54473 -60014 -30764 24892 40017 37442 38028 21281 12613 -1206
24778 -1206 -12386 -19453 -14641 -12769 9512 9856 5435 11198 9324 17789 35683 38795 24449 27640
24764 27640 22138 19692 928 -10830 355 -7134 -41085 -45431 -24091 -31135 -31490 1804 -7544
24751 -7544 -1949 11128 -13766 -51220 -43330 -45477 -18523 27648 28282 -732 -24118 -823 4624
24738 4624 -4125 6434 22396 31902 51144 18453 -48285 -22271 30204 14718 -19879 -46264
24726 -46264 -49340 -51293 -26717 -26362 -26420 -36491 -51393 -65517 -63245 -29626 -10706 19242 -10016
24713 -10016 -51630 -27735 -16594 -10599 -4457 3287 -37289 -49143 -36590 -44111 -80109 -70577 -42997
24700 -42997 -25245 -33603 -23681 -18830 -19109 -26138 -72521 -54104 -2094 22018 35805 31458 29073
24687 29073 37055 38642 6682 -13820 -26324 -20238 -20639 -11151 16002 30549 29318 46179 32742
24674 32742 -3608 19692 16474 2045 7875 5805 20482 55028 31605 11003 23883 24211 6260
24661 6260 -792 20197 6995 12601 19004 47781 45487 48033 31047 28670 16862 24948 27188
24648 27188 23831 27920 17895 26775 -6278 -17671 -46755 -75125 -32250 10549 8779 25124
24636 25124 41808 48201 64653 58262 19496 7892 3415 13269 -1920 -12356 -2784 -5502 -20593
24623 -20593 -34387 -40310 -68044 -34665 -5256 -16953 -11600 -501 -31663 -32258 -23660 -21945 -30230
24610 -30230 -9983 10350 35422 27785 15692 12647 6217 -6988 -47912 -50980 -24657 -26475 -25521
24597 -25521 -45518 -26059 -6159 -5825 464 9712 13424 40513 50283 38985 18089 11144 -5606
24584 -5606 -35476 -7563 15033 16419 -9431 -8410 -5626 -19540 -43382 -56382 -40981 -37232 -13784
24571 -13784 29705 25336 17336 -5040 -197 29924 43446 60356 56126 54038 54208 20630 4793
24558 4793 8983 18917 31725 10425 -8909 -31903 -27944 -29945 -30861 -42372 -63776 -37773 -43273
24545 -43273 -24720 -11969 -29515 -1351 -2825 -794 6702 19924 29687 17889 -12043 -28066
24533 -28066 -36720 -29920 -28097 -915 18938 10831 37681 66020 75079 51038 30906 12626 -14578
24520 -14578 -25388 -19671 7555 1656 4705 -11071 -1359 -16249 3067 14580 8375 28155 36561
24507 36561 25973 23852 44331 77585 78818 55585 48680 45018 21338 -28708 -45162 -26720
24495 -26720 10533 -5692 -11891 -14852 -16352 8138 440 -6168 -7388 5196 2532 3260 13533
24482 13533 7052 19798 -10447 -33267 -40910 -44025 -25193 -22219 -23439 -7145 20174 38410 4967
24469 4967 -13920 -40627 -37970 -10797 -2823 -4871 6385 9074 -12334 -36261 -23808 -29843 -22830
24456 -22830 -20457 -9743 32901 9145 386 20188 39903 1318 -3969 -1133 4101 9245 13325
24443 13325 14571 29999 13641 -27460 -20311 14473 26564 14285 -11375 -7657 -6854 -34644 -44352
24430 -44352 -33195 -45152 2990 38479 34412 -2782 -38091 -54866 -46085 -35561 -21066 -10128
24418 -10128 -12542 -24843 -18732 1873 24087 21378 9258 -8975 -37090 -38057 -46614 -37872 -28412
24405 -28412 -17092 -11912 -8284 -21896 -12302 -2171 -5715 -22414 -26948 -14268 -931 214 13327
24392 13327 -1352 23422 15256 3821 43248 59541 66706 53201 13035 24307 10190 1310
24380 1310 7052 15670 18923 8082 -24345 -17960 -29119 -66252 -54289 -52908 -47694 -36786 -58468
24367 -58468 -54412 -58126 -47591 -67424 -46776 -33419 -607 25379 45359 29565 36571 27756
24355 27756 -7922 -14636 -1422 22058 48472 29189 24412 7053 21347 17765 11912 7027 8352
24342 8352 19661 38583 38781 15172 9036 8862 -8520 3319 -5693 -22704 -32579 -20610 -28753
24329 -28753 -9951 514 18177 17998 16246 -1756 1843 5480 11022 5499 -11543 -12366 604
24316 604 -17034 -31051 -55378 -55560 -45802 -54562 -27517 12105 46191 35377 -9726 -23515 12733
24303 12733 33234 13390 18895 49314 31687 31315 25095 991 -24887 -51125 -61358 -51020
24291 -51020 -31224 -10513 -17036 -63520 -65893 -30493 4274 6176 5976 7284 -20966 1573 -1777
24278 -1777 -23250 -21104 -22296 -27935 -31774 -4266 20356 11357 3677 12334 11529 -7785 -29851 -43590
24264 -43590 -32395 2905 -20099 -18013 -23824 12821 21618 21166 -1894 4692 12809 11612 15718
24251 15718 5216 -1345 -26360 -19594 12977 1473 -15129 -3024 -11248 -45407 -24198 -10085
24239 -10085 -1024 1368 -5433 19380 -17178 -56167 -45432 -34935 -62411 -66287 -38624 -43513 -41496
24226 -41496 -32460 -36125 -52120 -60526 -40141 -26103 -8176 21294 14990 5244 1299 427 -25991
24213 -25991 -17155 -21857 -40111 -61868 -56786 -30182 -573 5364 -3188 -17808 -16051 -14202 -21604
24200 -21604 -38084 -63565 -41080 -29600 -19713 -21848 -21670 -14430 -30624 -36106 -32275 -4054 -3732
24187 -3732 -21949 -3863 28933 24413 33247 28413 -1851 -5336 -20996 -38269 -38859 -7303 4088
24174 4088 -23771 -34194 -31266 -26000 -27290 -43650 -37752 -26340 11968 295 5269 14022 -2751
24161 -2751 -41501 -38344 -17428 -6572 -16910 -26602 -108 37191 16128 -28509 -59127 -43673
24149 -43673 -42584 -61042 -36058 9476 37027 61773 57176 36040 8960 -26615 -11271 -3245
24137 -3245 11290 27806 -3024 -42516 -59022 -22708 -3457 15954 -10866 442 -9129 -8950
24125 -8950 2611 14918 11568 -2072 2812 -30646 -44204 -38583 -26271 -21397 1497 -19629 -45549
24112 -45549 -84168 -100088 -65384 -14107 2556 -2066 -5294 -19141 -5169 7262 24941 22225
24100 22225 12246 3832 6873 22750 46060 27349 41611 46619 32806 13389 19532 -4012 -13879
24087 -13879 -21430 -23636 -20723 175 12411 -3557 -24162 -29928 -16846 13877 -945 -5323 4499
24074 4499 -943 -24891 -12280 -20257 -28241 -34309 -32917 -47654 -33526 -24679 -34259 -9307 14630
24061 14630 16775 4578 14635 16684 -20118 -24247 -33805 -20607 -18998 -31981 -16523 15657 1518
24048 1518 -2548 -5571 637 2623 -11641 -19306 -32264 -3735 -1910 -21967 -30737 -38246 -25444
24035 -25444 -24299 3579 9212 31605 35215 -33647 -33123 5410 23609 34213 47871 24641 -15293
24022 -15293 -21353 -22995 -11295 -32818 -45199 -25490 18476 29429 -8069 -14744 22079 17564
24010 17564 -25036 -20041 -4708 -4487 -19736 -20660 -21393 -27615 -3760 -13403 -34803 -47742 -40314 -34541
23996 -34541 -17975 440 -11043 320 6959 -10758 -13912 -8070 -1575 -11316 -18528 -19516 -14227
23983 -14227 -23515 -46212 -31193 7146 6059 848 7695 -8647 -17487 537 174 -14898 -24893
23970 -24893 -29494 -25144 -42908 -43650 -19337 -27848 -13455 16605 37912 7878 -7588 -19656 -39210
23957 -39210 -47586 -13178 12694 12600 -6914 -22780 -33124 2218 46255 65249 30230 -10047
23945 -10047 -39583 -9523 23956 5766 2456 947 25271 1096 -13093 -4067 25311 43768
23933 43768 70971 58779 40071 41560 -2878 -47489 -43475 -34209 -6012 5667 -7609 -4336
23921 -4336 18996 23108 25376 -8139 554 22501 17881 16955 23913 32999 -6917 -6819 -13606 -43391
23907 -43391 -67911 -42518 -36554 -20920 -17624 -12495 -12588 -30469 -11761 11624 -3752 -5590 -32577
23894 -32577 -56808 -40870 -1214 29659 29199 11317 15921 36867 51752 74878 35718 13509
23882 13509 -11260 -23445 -3896 -31758 -61062 -74843 -71992 -58522 -19597 16357 37219 38693
23870 38693 17199 -9559 -30621 -8596 -17668 -19049 -4257 -35267 -67637 -75094 -65640 -32456
23858 -32456 -26578 -20422 16180 41216 32906 29590 8254 -21961 -7222 25898 42434 16301
23846 16301 3548 6618 28662 10747 -8059 8464 23502 11661 27329 19720 17143 17084 11249
23833 11249 -6206 3487 11438 6292 -6525 -23541 -50082 -15627 -9480 -17045 -27752 22784 21845
23820 21845 -3433 -13 22362 14267 -15322 -3452 -4865 -34459 -68627 -70123 -57550 -48272 -44864
23807 -44864 -35076 -34041 -26725 -16146 -13757 -7196 -9744 14946 17303 -17163 -6368 5390 1745
23794 1745 -35307 -37158 -43523 -52328 -61960 -54108 -45401 -34561 -15912 -63440 -57027 -26058 -11378
23781 -11378 -28291 -7137 26303 46385 53392 38038 23072 -6592 -28818 -28605 -19594 -32727
23769 -32727 -38609 -12667 21615 4994 -25759 -9921 -7754 -3189 2380 -28191 -52175 -49485 -2885
23756 -2885 -11332 -29002 -28823 -10078 -10932 -16934 3692 25281 39073 8902 22011 11659 8580
23743 8580 45838 52280 42052 58598 28634 26131 24609 23089 33174 24552 13836 -9202 33598
23730 33598 38111 32446 -12071 -9077 2372 -19727 -38513 -45349 -50379 -60646 -41579 -36422 -9620
23717 -9620 34013 24620 -18140 -65326 -58016 -23483 -44254 -26783 -2617 3185 -37970 -62830
23705 -62830 -66613 -29065 -7640 16365 17373 856 -10927 4006 -6558 -16113 3039 28582
23693 28582 16515 8053 6617 4144 -454 -1210 -24244 -43860 -57734 -32011 9056 -9683 -5238
23680 -5238 -6967 -5547 18843 14344 335 9523 -20731 -40465 -55470 -56684 -36413 -43165 -20366
23667 -20366 -17628 -27741 -49927 -37841 10620 6250 -29426 -23862 -19366 -14784 -19247 -52070 -13809
23654 -13809 -5420 -9822 5613 -14568 -27811 -29127 -27607 -8499 4087 -4344 -15468 -10890 6537
23641 6537 -5146 -26551 -14854 -1922 26704 -2735 -13253 -21971 -37410 -24086 7101 6207
23629 6207 12360 -9634 -39251 -46711 -27557 -9242 -12849 -11948 15385 15143 -1083 -3222 -5740 -15615
23615 -15615 -8450 10996 -485 -1952 -13979 -13822 -4870 4357 7571 6975 -4393 -24070 -9859
23602 -9859 -7889 9865 1435 -15008 -28203 -10327 12922 27193 25140 34660 62122 64573 58374
23589 58374 60769 45331 43105 58934 51544 35443 25859 8541 13389 -28142 -15542 9911 37151
23576 37151 44203 18183 9467 -15374 -39726 -25473 -20171 -5403 329 -26037 -55521 -62813 -36572
23563 -36572 -20664 -32559 -48554 -24536 3028 -1769 2267 7197 12677 -9995 -20583 -38361
23551 -38361 -21297 14399 11289 7989 14252 -7956 -47129 -58163 -45196 -36498 3709 26927
23539 26927 43541 34161 13203 13131 37383 53540 14647 -15889 -17301 -7576 6022 -9873 -37899
23526 -37899 -41887 -29367 -35004 -8775 15890 15914 5724 1735 18865 -5262 -43428 -38254 -38957
23513 -38957 -84077 -57842 -34159 -2814 3894 28106 21108 -6025 5283 5847 1764 -34970 -32122
23500 -32122 -30237 -10871 -21016 -43957 -42860 -30424 -22684 -22255 -15373 -22983 -46000 -40312 -8585
23487 -8585 9944 6017 -25169 -35303 -29436 -14991 -23163 -37318 -28025 -5199 -24833 3832 27172
23474 27172 19268 118 581 -1384 15062 -6362 -32234 -43481 -13590 24526 4016 -2122 -8931
23461 -8931 1787 19506 3681 -9822 6989 11806 890 -1597 15399 -8995 -56038 -70336
23449 -70336 -68464 -42488 -30806 -51053 -66245 -57776 -26598 -30582 -34687 -52748 -51419 -13143 -23518
23436 -23518 -32803 -1752 -2001 -9828 -18294 -26829 -28262 -44179 -26051 -18683 -47108 -34685 -23290
23423 -23290 -3581 -10741 -35657 -31621 4253 41609 59235 57053 45018 40760 44240 53070 30427
23410 30427 -1304 -44561 -51705 -43326 -43936 -47192 -25490 -13404 -20962 -10779 -29046 -26404 2030
23397 2030 19119 1650 -9521 -2656 -10513 -973 9162 10613 26174 23859 21655 21249 41868
23384 41868 20288 -8469 -14511 -6972 -11403 -9465 9499 1338 5189 2346 -9125 -23536 -17672
23371 -17672 -26017 -32788 -43998 -25249 -1710 527 -6304 4151 15396 12735 27517 30781 16417
23358 16417 -24010 -36328 -16703 -15674 -37454 -7232 20334 34088 1438 -20169 -38463 -3275
23346 -3275 22369 48 -27978 -25780 -8513 25728 14914 -36752 -66336 -36327 -21308 -19569
23334 -19569 13077 26977 36649 3721 -31451 -36584 -13971 -39331 -73659 -54348 -11853 34157
23322 34157 20271 23846 33051 19580 -3746 -26535 -29263 -4502 14237 12038 338 11703
23310 11703 17783 17360 5624 -3649 -519 -24670 -28849 -12058 -2507 18045 -3825 -48671 -19600
23297 -19600 -25086 17311 59246 43633 25114 -4302 -13989 -442 -11570 -22489 -40532 -49097
23285 -49097 -48395 -47754 -17709 -13778 -59476 -16897 -8218 -45029 -10089 16170 -5988 -38900 -38061
23272 -38061 7190 19857 -35234 -23834 -19603 -11644 -25517 -21662 19583 29831 24895 2792
23260 2792 -770 4763 -11052 -14771 -14762 8273 23411 46459 37420 31862 16919 11532 14727 6390
23246 6390 -6096 -35436 -49289 350 20681 -5908 -15697 -457 8804 -21036 -29643 -35178 -9123
23233 -9123 -1975 -21325 -11958 -22232 -27101 -35077 -59449 -59029 -36200 -20514 -13875 -22578 -22285 11117
23219 11117 11843 -21661 -48361 -41342 -25115 -20179 -23507 -31519 -34584 -52182 -73116 -80205 -35445
23206 -35445 12573 20049 21232 5100 -13544 2820 9634 -13672 -41707 -55194 -21870 483
23194 483 -6263 -42301 -44144 -37649 -12731 -13416 8711 601 -3092 -11734 -34718 -42905 -36485 -4227
23180 -4227 22599 6592 8156 15405 13821 23994 28320 14242 7132 7261 -23342 -712 15848
23167 15848 1397 -17869 -22964 -46718 -32305 -35121 -50284 -19877 1131 23805 32188 26498
23155 26498 26893 23131 14344 30223 14192 10127 1868 -13933 -20628 -4608 372 17094 48560
23142 48560 18264 311 2293 5228 -4585 8023 32536 32337 6017 7291 1878 -15803 -30655
23129 -30655 -49526 -40225 -63923 -45136 -39860 -50107 -53362 -41872 -34720 -42399 -64344 -43969 -16395
23116 -16395 8870 20130 19144 -11660 2930 20659 27129 -19928 -31709 -31344 -26019 -30922 -55002
23103 -55002 -22517 7748 23959 38361 54291 48523 23305 13721 -1036 -44225 -71233 -79166
23091 -79166 -45919 -21504 -19822 -4639 15350 6213 -19495 -37606 -27231 2804 -18380 -37202
23079 -37202 -32677 -20679 -22884 -39709 -40863 -9715 8180 29094 17940 -6016 -18307 -31048
23067 -31048 -30277 -2674 -26849 -36572 -16471 -6113 -58708 -80301 -55220 -36262 -22301 -22501 8603
23054 8603 15608 1327 36326 53467 37336 -5783 -45965 -47782 8634 28847 57441 65363
23042 65363 50633 36870 20733 -5513 15430 20322 -3251 -12159 649 -21869 -39868 -25750
23030 -25750 1691 17027 9284 -16175 -31225 -36472 -11635 3778 -9509 -629 6412 48214
23018 48214 42508 7834 -23778 -19819 -30789 -28798 -49731 -43626 -1435 12037 48073 82560
23006 82560 85732 28996 -2144 -3414 -14899 -24929 -41811 -55660 -61272 -42907 -40527 -25992
22994 -25992 -21280 -33685 -35954 -37333 -51600 -42520 -27792 -4532 28670 16524 -17868 10120
22982 10120 20630 25675 15465 26441 26670 -2887 7875 -10099 -12291 -23802 -40720 -53186
22970 -53186 -42935 -18622 -13767 -52253 -45389 -41677 -45324 -35429 -8020 3445 -24038 -63346 -50238
22957 -50238 2773 16447 26464 12248 -3652 -22823 -11562 5397 -10400 -32836 -46580 -22312
22945 -22312 15478 19310 16373 10006 16633 -9903 -24194 -18641 19844 37374 522 11335 -3639
22932 -3639 -40168 -33323 -26224 -35096 -51879 -55848 -40181 -21785 -41552 -925 55525 51064 39064
22919 39064 54337 46833 12389 -1512 -4862 22337 39999 89130 56832 46714 49258 52456
22907 52456 37430 -11979 -43347 -55346 -36489 2922 45526 40927 15557 -20167 -28631 -32899
22895 -32899 -35926 -36937 -35464 5646 25036 42107 15617 14981 25309 23700 5147 630 -19045
22882 -19045 -8352 2141 -16128 -28888 -31350 -37225 -47537 -11906 -572 -33350 -53631 -52513
22870 -52513 -12158 20707 22734 -5586 -8216 -6970 6659 -37398 -11557 -18816 -58788 -64975 -56901
22857 -56901 -31360 4764 -33301 -16621 3671 4802 15951 20452 31327 27581 -11574 -70271
22845 -70271 -70164 -47383 -39312 -22935 41710 44732 10730 -4845 -2953 9627 3510 9155 29381
22832 29381 28810 21165 -3479 -34753 -70200 -62657 -27075 -9865 -21583 -815 26086 13854
22820 13854 28233 22732 2942 -26742 -18208 -29344 -27300 -8591 -14169 -5874 5652 15711 11650
22807 11650 238 -94 -6528 10358 26945 28612 15798 8194 5985 168 -9916 -22892 -11927
22794 -11927 -36965 -81540 -68438 -61314 -66591 -69839 -47033 -54089 -42464 12645 28732 7557
22782 7557 26210 23629 -10202 -5773 20218 -4480 -8868 -32860 -35798 -6553 10253 -1462 20528
22769 20528 32596 28964 17765 12580 -9421 -7859 -3115 -8579 -17685 -11295 2295 2490 15339
22756 15339 16583 7248 9768 25469 49341 35403 16393 -1856 1499 -6137 -947 2382 14249
22743 14249 26988 52173 48012 26950 5698 -9529 -11492 -13201 -18296 -25999 -17023 -3901 -24671
22730 -24671 -40906 -42087 -21552 9827 10276 9478 16449 -2543 12416 32609 4274 6714 31796
22717 31796 62448 82685 50102 18749 -11676 -12931 -9857 11554 25419 35987 30992 24253
22705 24253 26757 17873 11068 -8737 -31257 -11726 3958 22024 7422 -32452 -44020 -27911
22693 -27911 -28584 -46660 -27932 -15431 -32033 -28323 13476 7242 -13660 -18817 -52584 -69741 -37909
22680 -37909 -18092 8729 -442 -8582 261 22696 31903 42574 43182 21723 3125 -21291 -30599
22667 -30599 -27263 -37013 -21428 -1320 1906 -16534 -16230 -2 9682 8621 -5760 -47869 -64330
22654 -64330 -52003 -49851 -26993 -16550 -14341 11010 33759 27091 -13720 -49672 -71090 -74132
22642 -74132 -69128 -38936 -11378 -6937 -11908 -12865 4776 3136 387 8550 6107 3597 -5638 -37166
22628 -37166 -31864 -15955 -26617 17447 27777 24682 19409 16902 -4526 -4103 20563 24134 32468
22615 32468 5841 2655 14897 30541 23730 28651 27129 14022 40908 27240 -1799 20079
22603 20079 16525 8494 -855 -3085 12107 -864 12086 -10753 -49315 -40617 -21864 -32812 -13887
22590 -13887 -13378 14438 59259 28035 2047 -4560 9077 3565 6420 16098 20965 -3460 -2948
22577 -2948 42444 51421 31115 13969 -3262 10388 16965 -30157 -51622 -53420 -61847 -90049 -90803
22564 -90803 -64666 -30467 -10244 -16299 -25393 -58336 -60027 -27633 -4978 16244 33377 22688
22552 22688 16932 7247 32870 55926 28178 -9719 15119 8471 1344 -10321 -10891 6773 10368
22539 10368 10497 27282 14160 -14633 -25722 -17417 -23804 -2166 4852 18494 41557 60696 72008
22526 72008 40981 10698 -1398 17752 9294 -2013 -4428 34176 64585 59531 37547 538
22514 538 3786 25898 31787 38003 46160 31296 -9357 -11286 2862 -11513 -22581 -21963 -740
22501 -740 -3880 9806 12854 -5636 -5347 11283 29185 22106 -2168 4492 -12955 -34831 -21882
22488 -21882 -882 26626 1929 22482 3497 -27546 -23319 -9385 5313 37455 44432 -2996
22476 -2996 -21725 -37339 -9216 7381 -5921 -8461 -27186 -33789 -19885 5118 17670 40928
22464 40928 62399 64552 26971 1269 -36198 -40894 -17238 -17181 -16866 23123 14283 -982 -4748
22451 -4748 -16286 -41903 -74669 -84650 -56249 -35907 -19780 -28666 -22090 5557 2734 -25469 -38512
22438 -38512 -36292 -47381 -57029 -39148 -27171 661 5002 7887 -19498 -43289 -22913 -12449
22426 -12449 -15939 -11809 -34967 -30014 -6720 23955 36127 37529 24086 25374 12617 -6138 -20506
22413 -20506 -4758 33112 13986 -2095 12369 9350 11369 12748 -9257 -23104 -14111 -9779 19802
22400 19802 49931 29332 -11594 -3214 35397 28776 -4448 18077 40429 30637 4264 -24338
22388 -24338 -31665 -31449 -37105 -33503 -27228 -43470 -22929 7149 7290 -28683 -46721 -23448 -7830
22375 -7830 -4399 15796 -4118 5711 12278 22271 -12424 -12181 53252 58333 10443 2317 17087
22362 17087 24061 815 -205 21053 40568 26319 7383 2171 40987 53358 29169 -13339
22350 -13339 -28802 -10870 -7991 -18936 14605 16189 -4794 -13151 -7810 14886 -1546 25791
22338 25791 57284 52429 40332 40273 48190 46038 43677 28662 37419 60522 100050 78231 69753
22325 69753 36444 21858 49066 62355 74557 35153 -14051 -25050 22927 47891 34433 23218
22313 23218 27856 9382 12752 -33173 -35158 -36635 -29848 18440 16057 6431 29673 53579 29030
22300 29030 21277 26897 21305 15635 14917 21536 48721 28882 8697 -1376 -7494 9061 12693
22287 12693 12400 -1520 12922 39024 53667 39679 36513 30000 -11838 -28119 9816 30662
22275 30662 34917 16462 7994 640 -16859 -12200 3102 18368 -329 8004 9661 31793 20738
22262 20738 -16880 -15544 11941 26454 12319 8449 38806 66723 38151 -17030 -34261 -22867
22250 -22867 -17886 -16712 -648 33417 42830 42713 36963 20559 -3866 -18482 -10614 6963 5308
22237 5308 -32931 -33914 3474 14231 39369 35359 21915 15833 5381 5587 -32757 -22419 -22060
22224 -22060 -27341 -20712 -28794 -61027 -72931 -36106 -59220 -55713 -43835 -9587 11365 30670
22212 30670 11250 -31018 -40586 -29234 -32052 -27025 -42322 -37205 756 33062 37609 34198 12868
22199 12868 -27764 -44049 -25161 -7905 -13478 -18365 -39858 -50646 1609 30253 37161 23234
22187 23234 2400 -16247 -9374 -3787 -3773 21992 56113 19746 -13613 26618 59387 36470 -8078
22174 -8078 -30085 -19067 -19676 -14250 -13668 -8509 -601 -6604 -11437 -31222 -10151 31126 14590 13739
22160 13739 21920 25869 5341 -12553 -1319 9319 -5009 12200 13718 8294 -14168 -13793 -22016
22147 -22016 -9318 -22234 -30724 -23738 1426 32589 21571 7134 24195 34387 4313 -18391
22135 -18391 -23517 -23829 -20080 -15024 22404 20587 2126 -19774 -25465 -9180 -2694 32956 57957
22122 57957 50485 59233 53062 37057 45913 41887 14433 12936 3302 -49730 -25884 13424 9456
22109 9456 -11871 -35548 -44296 -34194 -10369 -20728 -21580 -51190 -47206 4705 35655 7954 -17365
22096 -17365 -36984 -55863 -72943 -90825 -66327 -41357 -18604 15669 14497 -21993 -18355 -41410
22084 -41410 -52333 -49705 -33425 -28431 -33669 -46466 -17803 23651 5061 -11866 -31958 -33067
22072 -33067 -38564 -26726 -19216 10087 56703 53119 19995 18829 8939 21560 -3239 -16828 -5416
22059 -5416 8869 12807 11299 18629 21471 16539 21259 9378 -21876 -21656 -22606 -37619 -30961 -8390
22045 -8390 2511 2275 8406 610 38416 49589 44207 50975 63355 52633 20650 5928 25086
22032 25086 14977 1640 -26890 -37088 -2913 27065 39764 26148 22074 40293 47850 55364
22020 55364 24739 -11014 -26990 -24323 -22969 -20732 -43746 -53219 -45298 -59062 -40443 3266 -3546
22007 -3546 -11757 -1240 4915 21751 30958 31554 36324 24303 10845 -12155 25420 37849 18956
21994 18956 8647 6367 -885 -53451 -43351 1426 23929 37688 9136 -27377 -26931 34731
21982 34731 34626 13318 761 32369 25107 -18302 -31851 -12366 -2122 -20521 11555 7538
21970 7538 9778 14462 11763 -13415 -17981 -7196 12922 20459 14298 -1228 -10283 2768 -23968
21957 -23968 -21730 6758 -16750 -14760 15312 29576 32046 43697 50458 23765 8259 575 -28429
21944 -28429 -430 15541 30335 40554 55212 47195 8719 -22026 -11112 4335 -9040 -30189
21932 -30189 -25138 -19966 7057 27437 13824 -30833 -53462 -28501 -3372 3692 9013 6043 11186
21919 11186 -12487 -5530 -1873 -357 -8569 -9085 -18029 -18680 -11448 -22046 -35211 -46799 -20377 21063
21905 21063 37717 11186 -19240 -27368 4922 34617 33492 11893 -9084 28469 4126 -36884
21893 -36884 -4604 748 -6425 -14413 15928 23159 5326 -39680 -59478 -63188 -34688 367 5092
21880 5092 1801 28790 51875 46361 63007 25082 1692 -10328 -25389 -48639 -44726 -18829
21868 -18829 23415 10554 28682 60828 49076 48427 27696 -4618 -1626 -48858 -58556 -41431
21856 -41431 -29823 -22820 -30263 -23842 -18296 -17363 -21855 -9262 -2329 -46165 -81513 -62560 -22816
21843 -22816 -24816 -51350 -30642 15674 30034 13172 10496 33433 26073 13649 -23162 -14715
21831 -14715 -12011 -12159 -48182 -56371 -46682 -44316 -32644 -22467 -11787 32990 31401 19674 30895
21818 30895 41314 66088 34125 15528 7470 13626 -13053 -14239 -175 -4518 -14515 -18413 -9892
21805 -9892 -28173 -48431 -41515 -33311 -28489 -33518 -42771 -7626 -20 -31518 -51830 -29229 -26077
21792 -26077 -17490 -4900 -14416 -9975 -17754 -20562 -15337 -1812 -15859 -17727 8706 41600 37082
21779 37082 25637 33972 29228 -2352 -28524 -27986 -14926 1590 14003 3925 21573 49643
21767 49643 33865 -3003 -8267 6934 -11833 -3117 14777 7035 -6554 -26177 -35274 -46980
21755 -46980 -59082 -50414 -36115 -24392 -1868 13111 -13684 -28692 -50405 -49259 -15490 2739
21743 2739 12023 13927 -8296 -12180 -10821 71 5078 -4010 -1449 -1971 12456 20407 10597 3927
21729 3927 -6166 4148 18799 22798 -3792 -19549 5990 24564 20098 -20521 -36431 -28714
21717 -28714 -13277 -10186 -8192 -5256 -8836 1008 20051 -2282 -30847 -45720 -59265 -64362 -40409
21704 -40409 -5411 16130 1327 -3501 1607 -5262 23772 46700 25631 14459 -2186 2451
21692 2451 14564 9635 3726 -1407 -21270 -9984 -7430 12671 -2080 -5737 -13954 1586 16363
21679 16363 24740 12625 21416 -2507 -9627 2642 14593 19084 46085 43416 45996 48740 44514
21666 44514 39184 25247 -1778 -10645 -6487 22888 19668 -23130 -48953 -36175 -25685 -18128 -34813
21653 -34813 -28339 -11362 20427 12554 10449 -9296 -40054 -50505 -28362 -28724 -64097 -75083 -90275
21640 -90275 -61549 -28400 5283 21758 -1232 -27871 6547 2660 -11464 -22713 -6552 33072
21628 33072 50971 39856 25759 43135 32305 15768 37220 47381 24930 17204 -213 -5003
21616 -5003 23763 29912 37248 17504 34565 28785 -8281 -32460 -42718 -31144 -13477 -10378 16083
21603 16083 44280 55550 21593 7656 27807 46158 49623 37521 36968 49385 10560 -18170
21591 -18170 -36112 -46985 -38496 6308 -8371 -14104 -28291 -34411 -20050 -4967 -28104 -45891
21579 -45891 -31685 -45351 -40751 26909 31256 3787 10333 18596 -1817 -29669 -19876 -2376 -7334
21566 -7334 8490 18259 20691 1011 -18746 -13353 -13079 -15911 -43985 -37819 -36349 -6789 4717
21553 4717 7816 -18136 -19602 -455 756 -11270 -20615 -20702 -25673 -24125 -17509 -25882 19981 19523
21539 19523 9505 21658 28225 -14404 -19159 -35581 -37049 650 -12513 -5039 48157 52364 40456
21526 40456 22633 24583 11997 9628 8442 -29020 -38527 -42741 -1178 7863 399 23047 36829
21513 36829 47101 23472 10689 28243 23293 11435 1519 -4178 -771 18719 31818 24821 3760
21500 3760 -5125 7727 27403 30202 27371 -1838 -26832 -22176 -8073 22363 38090 43566 7946
21487 7946 -21538 -14716 -6710 10068 18653 -4551 16239 21925 49571 36453 4082 15497 21843
21474 21843 -4337 -2157 29468 32609 21190 10115 6509 -1556 4836 32891 16593 14508 20757
21461 20757 23708 5307 -26484 -16818 -33713 -17568 41053 71630 72977 14785 -30913 -36119
21449 -36119 -30797 -31103 -9303 8989 19174 4714 -771 -12991 -20681 -19350 15663 46246 13576
21436 13576 -4966 -17095 -14256 -54 9472 25254 41676 37519 40705 37669 16947 -5517 -18896
21423 -18896 -20380 -17975 1051 -11228 -4752 7239 18166 13874 15103 -9825 -28112 -16386 -8180
21410 -8180 7415 22695 8521 6206 1029 -41414 -40064 -49325 -48039 -35197 -14148 718 -15504
21397 -15504 -30332 -63523 -46168 -11037 4983 -15605 -25094 -2415 35916 34587 11504 -5038
21385 -5038 -13899 19033 18068 -7437 2950 5061 25565 52960 62563 34370 -25332 -50185 -45743
21372 -45743 9188 -10960 -19380 21254 24835 27538 23217 -392 -9764 2529 -3814 27948 22503
21359 22503 26520 11706 13220 37959 27855 43687 22081 24155 39510 45129 30074 30657 11382
21346 11382 931 29850 31529 16317 38115 50796 28002 -4079 -24258 -24302 -2975 5166 -14137
21333 -14137 -39576 -37076 -451 14011 11468 29403 26657 19927 -2848 7858 1305 -21832 -15456
21320 -15456 -14058 -8637 -4159 -17677 -6740 5423 -2637 -19897 -9752 23032 52247 58872 20588
21307 20588 -10311 -2812 -12808 24108 62110 64266 54356 42649 9565 12422 16812 -16589 -6565
21294 -6565 -6977 -27983 -50601 -49090 -29693 -23565 -15237 -17381 -37836 -36239 -13083 13659 54231
21281 54231 93304 51303 22817 26259 30623 22366 6562 12074 -5847 -8521 9730 17531 5990
21268 5990 26477 14306 -8311 2654 4666 -13230 -20181 -1526 25310 19435 5164 9612 12735
21255 12735 -12837 -44361 -33303 -21061 -28932 -17942 -3161 -1881 5959 30113 18970 5216
21243 5216 -11053 -140 24880 73349 60743 63144 59894 27217 -6659 -20912 -19991 -4689 17033
21230 17033 24378 22495 26992 13628 7778 18628 32233 34696 37673 41966 25751 -10213 9801
21217 9801 8829 8105 -8698 1968 5294 -17706 -10744 4049 -17931 -10426 -3868 3268 3630 -2726
21203 -2726 564 8908 -5722 3020 24 -6085 -5808 2472 -314 -11156 -7749 16645 39366 21570
21189 21570 24729 23775 -267 -31487 -53852 -38945 -20481 -55444 -36515 -28149 -18628 -7235 -27965
21176 -27965 -35289 -14977 -29493 -13021 -21263 -25894 -17055 -38894 -33393 3957 35124 -2100 6157
21163 6157 43095 24402 6449 -11304 -12170 -23114 -30302 -27939 -35724 -34978 -31400 -39770 -22735 13662
21149 13662 4048 -19599 -4217 -16618 -18537 -18126 -10989 -4490 1494 38799 45080 37538 18823
21136 18823 11420 20851 23536 18582 -4046 -19673 17458 28304 9078 -30 24588 38834 29074
21123 29074 31204 25480 17879 17667 34737 23803 17980 30686 44182 54363 42049 44365 41888
21110 41888 25170 29033 30020 7688 -30529 -62757 -70903 -13056 27732 -5916 -43626 -48263 -42688
21097 -42688 -19089 7141 5676 9992 17312 34792 36409 41194 54348 30557 -9556 -25337 -15701
21084 -15701 -7392 -23695 -19184 2282 20039 -7701 -5236 27834 7119 1355 -15674 -35196
21072 -35196 -39843 7863 3048 -249 -11357 -10173 1590 13893 -33258 -18996 5310 13878 24196
21059 24196 -20284 -36328 -26631 640 33659 29577 37053 45153 48913 11995 13028 21825 23437
21046 23437 24165 20913 -6533 -8079 11604 9921 -22663 -40115 -33348 -26749 -13935 -34894 -44940
21033 -44940 -35881 -41144 -19565 -15144 -5994 18767 45119 45135 39359 42761 45294 17354 7998 -9545
21019 -9545 13898 18252 13387 10246 28566 34663 27458 14529 19045 17998 10415 -1843 6447 31365
21005 31365 15789 20548 14983 2301 -6699 -6084 -3040 26551 48959 26161 16298 26033 40313
20992 40313 28731 15978 5853 -13713 14527 27960 17035 21076 40369 33378 17058 -14428
20980 -14428 -22688 -9080 23031 12426 2672 14527 -27837 -43175 -15265 -6624 -24502 -4343
20968 -4343 1893 -24858 -19665 -21131 -56371 -30192 -3716 26861 24579 31475 39730 45320 35959
20955 35959 -13912 -23576 -10349 4781 -27003 -27168 -1620 33488 56917 68564 55965 30245
20943 30245 36927 31485 31519 24415 25200 25841 25465 -4751 -4504 33930 25146 5008 -1036 -25414 15804
20928 15804 18102 7873 27066 51084 56561 40820 9717 13471 47132 40313 25123 22170 5216
20915 5216 44282 56324 29584 1950 -29976 -50431 -48863 18348 39248 28556 34561 7843
20903 7843 17943 41220 29182 -6275 829 -8280 -34208 -39770 -11895 -1434 -19331 -1151
20891 -1151 35824 61912 32495 4086 10758 38990 32750 13608 10884 -15208 -37391 -20236
20879 -20236 20802 46086 61661 51255 45919 52961 46207 45134 31108 21274 30384 54983 89972
20866 89972 95274 85389 65090 86020 90176 91522 71050 84095 99863 111960 116057 124370 148891
20853 148891 172798 192071 225151 272151 322999 385519 477296 537333 567363 531649 468217
20842 468217 393001 294393 203200 155396 149620 138622 141019 134791 135168 122959 92420 69715
20830 69715 57984 84977 106080 125118 139606 114513 74595 52410 62593 72552 78236 69407
20818 69407 82025 108294 126395 114148 62131 59191 60290 34432 43274 57885 26162 25197 30663
20805 30663 25469 5452 25853 50115 51632 43771 21614 3617 5653 44763 58348 22490
20793 22490 4597 -21383 -10514 16748 30217 16392 19561 51435 36804 11708 7476 29526
20781 29526 129 2851 16434 6449 -6833 -5219 14080 22596 46563 31589 35643 12899 -15678
20768 -15678 -12170 -12841 6071 699 37278 47671 38928 54452 68762 78223 83273 51262 33331
20755 33331 52052 45618 25487 2725 -9729 -2763 7240 -25929 -42391 -33634 4797 23051
20743 23051 -272 2442 9350 34256 45389 11230 -7625 -10604 8947 33782 30704 29434 7871
20730 7871 -11319 -24511 -24428 -39354 -13115 22854 53699 56832 30138 8836 -19812 -12921 4931
20717 4931 -13876 9908 23831 36368 50814 16066 24991 46243 68830 58994 61917 74536
20705 74536 74843 58248 16784 -12094 12545 26851 13180 38572 29603 47090 86625 94122
20693 94122 83808 83984 70227 54943 47238 56926 73842 72937 45763 21304 38787 19584 23276
20680 23276 15824 6517 44521 34286 5405 9297 8626 20015 -2892 -2584 25773 33293 11763
20667 11763 2313 16689 48322 70897 82526 39646 3767 17525 9688 -2477 593 26575
20655 26575 29370 34867 39216 16465 -15853 -6277 -11903 14129 33594 34331 22540 5231 11232
20642 11232 -4492 4942 6303 39996 65887 29289 14513 7274 27527 37523 16193 -4850
20630 -4850 12154 6837 -2304 15296 24707 26706 13522 122 -14896 -27520 -9692 20569 18214
20617 18214 -16010 -94 9644 3831 13022 4422 9460 -5656 -2450 4103 6853 -26632 -37659
20604 -37659 -51322 -49571 -22136 -6866 -12858 18306 21544 15469 22739 42473 23079 6493 35871
20591 35871 43189 32759 13785 26251 28350 22042 21175 26204 -9886 -29857 -6872 -12808 -19615
20578 -19615 -793 334 3716 -6745 -4100 -2729 32279 40720 43858 23584 29926 34366 56431
20565 56431 65943 77824 58153 80653 90612 57859 47956 68632 65341 38034 30001 19541 10714
20552 10714 11052 -2714 -1555 8027 24000 16902 23050 10000 -13322 -11513 -6720 -13791 -2895
20539 -2895 18481 699 3302 19521 30221 49220 73120 65980 15364 -9293 -341 14906
20527 14906 6394 9921 31330 33990 71696 77973 58024 49473 38782 53513 55850 75284 58882
20514 58882 50510 33160 -2857 14459 36837 22017 33961 33649 6974 25613 30919 -12526
20502 -12526 -10245 28555 34643 25919 24348 32802 19780 36268 64991 47532 49809 54553 48579
20489 48579 15880 -21359 -1968 -10304 7788 34656 9316 30517 32582 34712 53458 41493
20477 41493 21601 30398 21605 9257 -22626 -4377 -618 -1506 4233 -10877 -18734 -20999 -13603
20464 -13603 89 34638 44814 47091 21151 3227 9576 7716 8657 7733 39082 58219 43316
20451 43316 37266 46820 57786 63696 61276 29523 28123 31080 32619 23286 15164 1784 -2002 36035
20437 36035 27847 24118 9381 8025 11331 -15728 -31361 -18524 -18472 -19764 -9875 -28681 -40789
20424 -40789 -23885 25077 -2380 -42168 3346 44007 38626 44436 32939 35082 45339 25878
20412 25878 10178 -6320 21176 54049 39374 24062 2449 18319 38158 51326 59648 45386
20400 45386 39371 40530 43636 59956 54441 26128 10018 9232 16734 13125 19426 55254 59087 55810
20386 55810 49421 43431 55745 22317 11259 64119 78271 51154 30312 23810 32726 37705 15351
20373 15351 -4068 -9836 -11317 -7740 31512 67537 35672 1082 8021 57009 49851 361 11296
20360 11296 46823 30792 -20960 -12503 21771 37244 60240 52231 62827 53168 57926 49617 47967
20347 47967 28314 13275 19065 41096 58891 25425 10927 3667 6416 31429 69231 74619
20335 74619 46282 8495 11454 39618 37112 31568 46983 25608 17178 13795 7018 9150 21962
20322 21962 13926 11102 7586 23858 44751 47967 53841 46011 70487 115090 73475 46843 10982
20309 10982 7333 6207 -3422 35625 26691 -12419 -39366 -24097 15307 17624 18900 20645 28806
20296 28806 35465 35365 53605 51935 21426 17872 9892 19191 36203 61071 71764 57656 46502
20283 46502 62609 81540 70101 49112 36428 38405 67817 68564 62747 26129 38004 46277 24855
20270 24855 26324 26709 23331 28738 -1755 -9972 -15387 17524 52052 68904 47614 17950 12571
20257 12571 31996 57873 76328 72593 42215 12989 -15911 -20345 1236 28881 36576 44706
20245 44706 47673 21816 20169 74778 79188 66674 60096 89663 118171 124778 108900 64667 33241
20232 33241 39230 35403 49034 80701 92807 84916 74555 44942 33523 48951 57127 61078 80693
20219 80693 82999 64118 49892 22615 36272 29218 30782 39191 30799 -5587 -11369 835 8312
20206 8312 3423 11136 28439 45087 53137 48254 98395 109374 111971 70032 14764 7785 35745
20193 35745 70346 73329 64668 51851 38130 44387 57776 57786 41474 50478 45944 41213 50182 64509
20179 64509 53324 83778 116615 128367 130462 122189 84741 60320 64008 89183 93707 130461
20167 130461 114343 84307 65405 68391 74171 65263 41264 77888 104652 61079 67230 89958
20155 89958 93071 107111 115935 114926 127129 97825 87037 57708 50575 68881 83963 78575 65107
20142 65107 69909 63540 72691 71023 56635 77639 69744 85283 90384 65437 52956 49937 51115
20129 51115 68248 57335 44964 23464 134 -17948 -21853 9338 45579 41673 21650 40834
20117 40834 68999 69893 79819 89030 113257 107022 89280 71783 36368 10968 30877 52230 66174
20104 66174 58163 44906 63812 93667 76218 55830 58204 85542 98096 92828 87845 99773
20092 99773 109106 86059 73447 61305 85072 109465 133749 164657 173457 210508 206750 224947
20080 224947 307710 351681 386210 460800 545776 630436 702477 754474 826581 821886 775706 689926
20068 689926 598706 523441 461555 390368 322872 262850 224538 212835 171237 146471 144424 169752
20056 169752 140093 89972 65760 87960 67487 63061 64311 50407 54717 56279 52895 53976 75702
20043 75702 110657 84375 59293 61312 78973 64800 75927 99146 86256 54741 52014 52189
20031 52189 71754 75785 91277 73680 63514 52291 43414 51639 63661 67216 45308 52969 89764
20018 89764 84521 93217 88669 91170 53014 38020 38308 27495 16736 17223 23279 39252 16573
20005 16573 25568 34346 32804 14550 18345 34960 29887 52796 68328 75353 74939 85036 70146
19992 70146 41850 36883 38261 57734 50486 68008 46861 64842 90110 106257 77975 72957
19980 72957 81099 64441 54056 79797 94118 96825 91958 94549 111341 111494 100383 89298 55611
19967 55611 77305 110147 137001 126804 106882 100596 99354 80329 70976 57683 65304 59513 106164
19954 106164 68790 61230 93482 116068 91355 83936 78046 85739 90761 86389 76035 59291 30662
19941 30662 31339 41242 14092 14838 45750 26560 47735 56879 70612 56430 55466 73467 57800
19928 57800 55361 57552 70978 69259 82252 63625 67971 68475 61470 108984 121588 149217 126926
19915 126926 116046 139028 159920 194039 202431 200746 184372 177459 173127 178954 216674 235909
19903 235909 219883 227216 282607 347631 409393 475317 587576 679101 735427 795570 804349 772954
19891 772954 728014 646215 541887 457869 403293 358810 335573 313043 324166 313375 249551
19880 249551 206712 173481 164136 137288 101506 105395 140048 111519 117880 167423 167667 158804 167815
19867 167815 138896 101541 94529 95766 106337 97723 89261 108130 116706 87152 76578 83599 101096
19854 101096 60508 68326 120216 132379 117859 103784 108826 108465 95093 116821 98394 76299
19842 76299 78557 90026 71206 25816 16887 53287 72349 98980 107841 103409 62450 37703
19830 37703 53489 61273 93763 100774 84682 84044 93659 91548 75137 87119 81588 103781 134599
19817 134599 122692 103592 98194 109020 129400 153360 152316 156155 184532 159733 139163 137954
19805 137954 137980 144157 130179 135053 172762 193533 182467 199405 197404 188723 198549 197089 191354
19792 191354 183755 176369 152955 110546 91218 115003 129092 121702 137262 137717 134781 122387 141231
19779 141231 144164 109946 91094 103720 137508 154239 145901 125018 103048 139253 152409 145880
19767 145880 145569 154669 157790 122379 93460 93807 110753 124228 131173 97027 117797 134520 94084
19754 94084 76340 104114 117741 127441 112090 140498 185179 180521 168632 166763 196598 198701
19742 198701 172046 153720 158507 175009 199925 182859 178857 174548 176045 157520 170752 175657
19730 175657 190088 221724 268841 274824 298137 321175 366597 348397 351004 368647 369735 411213
19718 411213 459955 485743 501430 486682 457908 456086 441551 428027 429938 439072 405499 396886
19706 396886 369242 343801 299054 239559 194361 191467 188075 163723 154002 133045 146042 163981
19694 163981 165658 167631 160675 171792 147989 142542 138334 159343 163109 140167 140598 162185 189289
19681 189289 181013 174434 191804 188519 194435 200373 226045 249896 261537 271738 251344 242782 245836
19668 245836 246060 234629 206416 196389 141821 99124 106500 148092 166169 136031 154360 173242
19656 173242 139974 157765 191774 166449 123717 123823 124043 142838 141311 144184 131449 149802 180202
19643 180202 182167 154539 156806 172818 161265 141801 143124 151298 122944 114893 131395 148465
19631 148465 139933 136362 149362 156816 155766 170660 220620 232973 236491 235165 211844 179835 199379
19618 199379 224475 220494 228794 223256 224590 236670 260493 262838 222164 207846 232065 226055 216671
19605 216671 225503 232684 247983 256560 264591 232832 174549 176573 206881 246925 247989 252468 253977
19592 253977 244127 241432 247259 216934 191490 201602 230881 268412 267779 269491 276957 303799 307653
19579 307653 271501 255928 255845 280596 295882 296177 292574 299015 306726 303176 319877 324707 309472
19566 309472 305254 309604 300879 306896 294480 294875 309162 328996 335689 351993 339960 363127 418394
19553 418394 442190 419534 416292 423639 402714 420033 484232 531057 538892 542053 585054 626822
19541 626822 626865 621557 645815 630694 606408 609702 596806 573110 555892 544582 537323 522430 491811
19528 491811 474631 506417 523683 520954 496152 476959 505626 546154 545325 533151 517664 543306
19516 543306 576282 612580 652824 662762 653375 650791 634225 626772 624288 624627 637360 632515 642123
19503 642123 666049 685414 687830 698828 714122 709007 706332 731499 779040 779044 778516 775442 796820
19490 796820 817153 811444 799227 791894 800188 807601 841089 849514 857570 875299 891569 896521 909350
19477 909350 964721 1006142 1060067 1130248 1184277 1221411 1249674 1260367 1289441 1314753 1358666
19466 1358666 1423521 1481536 1531680 1617491 1691006 1778844 1864211 1978399 2098294 2242143 2434074
19455 2434074 2617490 2799572 3011011 3207514 3392163 3556966 3658756 3728631 3821504 3916069
19445 3916069 3997616 4105489 4281020 4500210 4714213 4970192 5244956 5590393 5970859 6453546
19435 6453546 7024017 7687108 8495814 9402835 10453030 11719620 13247834 14996789 17037181
19426 17037181 19443002 22307688 25783031 30167404 35789118 43136754 52679360 64656942
19418 64656942 78861990 94452229 109924157 123028194 131708438 134600441 131116553
19411 131116553 121985929 108930004 93841022 78575284 64650162 52757315 43034309
19404 43034309 35341563 29375334 24708946 21045945 18110543 15767640 13904716 12342785
19396 12342785 11057374 10002648 9116033 8337815 7663286 7103009 6619831 6194105 5862380
19387 5862380 5535201 5251188 4964621 4708951 4480736 4292647 4150808 3994772 3842496
19378 3842496 3734108 3642711 3542634 3402351 3216096 3017321 2811537 2614190 2421224 2226135
19368 2226135 2094506 1980044 1891322 1788727 1685330 1610698 1561356 1490354 1427550 1378162
19358 1378162 1318820 1293895 1239071 1204767 1159161 1160253 1132861 1111352 1081880 1079673 1066181 1070037
19346 1070037 1086639 1070134 1010544 993450 1016289 1015284 1002668 980964 965409 936106 926003
19335 926003 946507 957255 952816 940491 955933 948267 936906 899900 888353 933149 951499 963791
19323 963791 974701 985639 1021477 1055608 1046406 1083963 1126142 1147675 1153416 1187719 1234437 1279986
19311 1279986 1309032 1370002 1378660 1365888 1411027 1417381 1399768 1391943 1425843 1451513 1471952 1523477
19299 1523477 1531111 1514962 1552061 1580149 1607918 1649238 1708605 1771332 1865447 1974534 2059764
19288 2059764 2184331 2308329 2401909 2432801 2491300 2549613 2639918 2721738 2816706 2919779 3028114
19277 3028114 3134076 3252829 3362957 3525480 3743523 3943238 4139485 4381835 4685125
19268 4685125 5012356 5386408 5836075 6294137 6795017 7321228 7853342 8425874 9049538
19259 9049538 9783242 10624598 11658872 12836833 14222153 15906540 17997710 20620569
19251 20620569 23848509 27919084 33109310 39741225 48275146 59131769 72607424 88399485
19243 88399485 105233193 120764231 132043929 136647835 133729609 124139889 110014465
19236 110014465 93952439 78154751 64117518 52478977 43195975 35939037 30218480
19229 30218480 25721051 22167627 19298622 16993436 15096248 13531358 12239104 11184208
19221 11184208 10305247 9556509 8927775 8391438 7924824 7504267 7111370 6738344 6303670
19212 6303670 5817736 5357092 4915015 4500977 4132996 3855002 3571460 3318461 3118283
19203 3118283 2956287 2818306 2697777 2601852 2514251 2407824 2288397 2169916 2074235 1997255
19193 1997255 1935008 1864329 1797156 1761046 1678753 1580101 1476899 1381872 1283900 1235108 1187043
19182 1187043 1124290 1092444 1083415 1052930 1073891 1122455 1130281 1116215 1119780 1101756 1077711 1037867
19170 1037867 984483 980639 1005754 1012362 1011360 1036773 1072779 1110609 1090051 1076049 1069512 1031719
19158 1031719 958387 897216 869677 863874 821593 781400 774259 766542 748197 745492 693733 628006
19146 628006 584474 539114 490676 461813 442093 416860 398001 411002 408476 405381 398077 417730
19134 417730 445010 438498 413769 394670 399947 393591 369037 339112 343241 341393 335289 332044 325946
19121 325946 346297 361850 339100 349253 367954 374927 383655 396386 400220 381722 372497 372126 334729
19108 334729 305153 283084 286808 290927 274202 282574 285211 278305 256066 262444 275788 270237 255705
19095 255705 247387 277441 272326 246213 232874 239618 237558 221042 227305 226362 258168 272456 274271
19082 274271 272411 262733 238495 236478 236995 227847 204627 213590 208351 208624 194069 168137 167761 187862
19068 187862 194657 191578 195734 204932 220861 240361 243387 222762 206766 195534 186441 163414 203404
19055 203404 243684 245034 212347 218236 232030 232031 201219 207239 248030 255665 199320 192922 206885
19042 206885 207303 213507 238871 209205 199135 208029 221366 229593 238205 256167 254060 220277 208942
19029 208942 210042 204609 195076 198707 194357 174400 180014 178337 159424 174874 190922 190313 223063
19016 223063 248889 198183 153630 148991 180414 196063 195998 200524 177996 185627 192021 227201 257753
19003 257753 247930 271943 234523 202657 157570 171861 181046 207921 208233 186109 185754 193211 242350
18990 242350 263520 264042 290613 281162 255344 235929 221213 214772 224173 209826 216382 193915 189520
18977 189520 223444 217547 198254 207455 188785 209400 235780 219855 179325 185163 197481 212483
18965 212483 237900 250970 246802 233282 230153 220890 213365 228547 224673 207285 215880 238132 258553
18952 258553 282760 266766 240588 251207 267564 264966 254939 257348 252155 234330 210447 187638
18940 187638 158806 158996 181520 207268 214032 195913 200246 228863 236193 215646 217919 261028 302136
18927 302136 285563 229930 227606 236651 259318 264257 287208 310008 300338 271721 295707 310363
18915 310363 327305 352508 377432 365742 316673 311891 322211 333550 351922 342197 343941 351372
18903 351372 327789 346198 363135 408261 459977 456486 453618 476837 477344 450803 460406 501118
18891 501118 494869 516573 556878 556608 564363 598916 611963 586048 539643 534378 551310 573207
18879 573207 549727 556309 573751 587386 575094 559060 539307 545249 552015 524293 506862 486607
18867 486607 483261 503891 508256 471953 478035 469417 455676 479290 480706 452707 416759 423399 446882
18854 446882 433129 449594 503730 550100 539761 535524 552468 561323 555243 586922 609447 599846
18842 599846 614098 605850 620894 655550 730458 785511 770697 767959 790117 814989 842628 855775
18830 855775 887243 914364 941764 936985 937956 1011114 1086459 1119745 1161214 1221291 1281843 1375465
18818 1375465 1478159 1595002 1710020 1791176 1859418 1973010 2114782 2265377 2435677 2626116
18808 2626116 2829813 3086050 3389197 3774939 4204955 4727221 5450230 6458866 7877363
18799 7877363 9927836 12735331 16070318 19610561 23335336 26230909 27643249 28755559
18791 28755559 29732429 30737541 32445039 35314724 39065052 41979437 43973622 45613357
18783 45613357 45218563 42852493 40418526 38056667 35989125 34767983 34442325 34540860 33242580
18774 33242580 30768372 27826258 23847764 19636789 16088417 13172289 10926559 9374154
18766 9374154 8303522 7577963 7098922 6766892 6482804 6266745 6155799 6143854 6164785 6248203
18756 6248203 6427474 6729042 7183564 7824752 8715061 10039262 12040519 14854221 18330930
18747 18330930 22094637 26048810 29381813 31047279 32122723 33034037 33936777 35629836
18739 35629836 38550729 42624574 46238764 48799863 50898173 51007676 48637775 45885514
18731 45885514 43133894 40657171 39202491 38740294 38785932 37416256 34573386 31116496
18723 31116496 26495354 21568486 17279823 13731205 11026262 9077976 7701687 6675206
18715 6675206 5885121 5262883 4797684 4437282 4120064 3865206 3670369 3505071 3376348
18706 3376348 3269293 3135310 2996279 2898226 2808121 2716028 2637988 2565325 2499505 2454548 2410595
18695 2410595 2414729 2415012 2450387 2506938 2548498 2559110 2600012 2630263 2635943 2684217 2745038 2823350
18683 2823350 2944687 3036656 3184275 3373553 3533014 3709630 3901131 4071968 4241347 4464875
18673 4464875 4735596 5069052 5474400 5946683 6542584 7279126 8219650 9399131 11016253
18664 11016253 13260667 16375144 20388738 24892179 29941853 35994497 41972962 46325193
18656 46325193 49905860 53333489 54970153 55490007 57152355 59959325 62822042 66775352
18648 66775352 73097316 79467951 82929708 85207186 87032290 84669828 79108306 73705227
18640 73705227 68380879 62372586 57396618 54703784 52973239 50776596 48769509 47177190
18632 47177190 44034729 39470914 34887612 30220112 25308052 20815402 17118973 14093406
18624 14093406 11697585 9908037 8539850 7526717 6698585 6029878 5453157 4949734 4542736
18615 4542736 4183131 3859801 3547961 3280328 3038457 2828239 2589609 2381562 2206610
18606 2206610 2039343 1873027 1711531 1618317 1524575 1401779 1324419 1264361 1159560 1072920
18596 1072920 1044879 990710 962529 918339 902282 931741 929790 902363 894255 920995 933216 962594
18584 962594 1016563 1049610 1103578 1147271 1223874 1305474 1339178 1318384 1255479 1163902 1087277
18573 1087277 1010612 893320 774621 692173 674244 646581 596079 573106 546152 517274 506570
18562 506570 512207 507533 509808 506368 485672 473494 509742 521642 526862 528809 553956 546558 528744
18549 528744 524015 513958 492748 474025 419011 416810 465990 463786 438459 421563 420271 421252 406316
18536 406316 367641 351538 333339 311642 287846 299138 317077 333356 363937 365284 339394 340766
18524 340766 337017 344992 311991 323150 345113 347081 357465 348896 355089 388494 428520 436083 410389
18511 410389 416511 428453 426493 428183 422295 416549 433836 467656 474856 474174 450123 464543 463144
18498 463144 431149 412637 403493 347284 333979 355506 362384 322324 295733 282814 255225 284354
18486 284354 308548 313918 299730 297195 319141 324740 358161 416389 424002 472000 537216 556221
18474 556221 566772 597633 594042 594699 587904 639152 680297 700237 720519 792337 834036 812207
18462 812207 768661 713251 645145 613243 610866 625268 621428 659336 650494 595648 537927 469145
18450 469145 401045 321385 273395 271746 274067 269655 231722 218298 248203 251089 238484 214537
18438 214537 210663 214746 238147 249050 240804 271462 342084 406380 456883 515668 584552 640850
18426 640850 650429 626141 594321 610565 658650 692445 771944 904747 979798 1012127 1063881
18415 1063881 1137049 1155962 1119996 1087112 1030207 983004 945139 935840 922483 882041 800716
18404 800716 740098 668150 554039 476522 420503 352397 279804 229398 203658 157745 143017
18393 143017 176638 175382 187274 193812 164720 168175 197928 227476 241051 238303 214861 213998 199156
18380 199156 211436 191249 204627 255419 242249 223554 215428 205493 214024 250669 271132 281711
18368 281711 323720 391621 476418 557411 628725 718389 751104 714669 619145 518098 478330
18357 478330 436691 331331 273994 268192 246492 203965 192809 196019 207819 208856 202860 237548
18345 237548 217039 199579 198930 208024 184264 198771 241343 297319 351248 388713 421093 488060
18333 488060 594877 720594 822664 888617 946302 1011613 1096844 1100821 1122876 1180832 1212132
18322 1212132 1264675 1352057 1466717 1566526 1667797 1731179 1748256 1749836 1741977 1687544 1595120
18311 1595120 1476254 1353686 1236414 1163136 1117291 1055308 1006232 959278 869145 794775 744753
18300 744753 640707 502507 406078 366129 345262 341623 328284 298899 287256 294772 294673 313837
18288 313837 319686 335791 302484 265679 257842 269730 264907 264649 293153 316700 320081 331720 343961
18275 343961 335679 334620 338825 332094 326162 327315 354433 341619 305499 315166 343871 363752 387480
18262 387480 421648 445132 416777 398090 410164 415197 419778 436449 438390 483095 511077 499414
18250 499414 430813 408025 379462 359114 369793 373021 393665 404404 408246 401753 364947 348556
18238 348556 340215 302198 290508 305811 291798 298726 321890 364894 355422 379439 388516 365306
18226 365306 360334 373291 403794 404094 411822 444889 453345 473644 520954 565901 585287 594753 625429
18213 625429 630169 621896 650461 678839 672812 669869 666825 648068 675706 726180 756417 751835 747947
18200 747947 729981 694770 690302 668958 635360 637883 623279 600812 539735 490251 485181 524786
18188 524786 596273 639845 723951 812086 877213 928604 909474 862219 787548 715628 625074
18177 625074 562012 532436 495728 515478 526417 535972 563549 555225 532443 539228 546587 588929
18165 588929 647024 652662 654688 630365 637314 650473 688781 701636 697446 704485 729286 739621
18153 739621 726412 731366 703069 723621 716681 697087 717826 705164 676999 694966 704704 697712
18141 697712 721144 759256 816569 858916 894717 919057 955503 976492 1025033 1121233 1199153
18130 1199153 1300178 1417000 1557056 1737165 1929118 2133865 2319277 2471574 2577273
18121 2577273 2608818 2651481 2710201 2815850 2959511 3192515 3503227 3875284 4390712 5113458
18111 5113458 6137946 7708736 10257798 14461092 21446248 32125919 43251604 44947758
18103 44947758 40021423 34120656 25760860 17812662 12560453 9333526 7239055 5794311
18095 5794311 4776253 4051467 3502520 3123997 2862131 2661242 2512508 2399312 2344869
18086 2344869 2270526 2241075 2254776 2326905 2401854 2479171 2627292 2867936 3185323 3510014
18076 3510014 3803804 4074452 4285278 4388475 4328666 4283648 4278544 4332177 4501022 4912093
18066 4912093 5497738 6336918 7569606 9307270 11399967 13396634 15522180 18106826
18058 18106826 20498534 21863774 23157765 24860362 26143254 27134209 28947667 31181597
18050 31181597 32200590 32407604 33097020 33192478 31778186 30283834 29280653 27845248 26171936
18041 26171936 25282845 24884551 23723957 21801136 20051520 18205379 15877134 13598961
18033 13598961 11706120 10090962 8805184 7963154 7476830 7192684 7018375 6935969 6916724
18024 6916724 6878834 6831660 6842907 6990690 7255032 7725106 8461668 9569220 11230103 13610594
18014 13610594 16915186 20702365 24392788 28434358 33218888 37206308 39377112 41511446
18006 41511446 44054126 45684797 47161135 50222731 53693113 55207318 56085641 57784124
17998 57784124 57974605 55523219 53100377 51117329 48023152 44722128 42806050 41461701
17990 41461701 38740645 35225218 32129173 28707255 24627807 20676221 17255668 14179222
17982 14179222 11629141 9735830 8374459 7343759 6572613 5956694 5450099 4970230 4541907
17973 4541907 4158881 3815212 3485663 3194454 2936118 2723797 2502084 2283990 2077991
17964 2077991 1916445 1797652 1665018 1562130 1506341 1433591 1354826 1293604 1252225 1194389
17954 1194389 1173575 1175978 1147944 1137934 1147983 1198000 1224072 1223256 1204742 1229421 1259394 1293380
17942 1293380 1328451 1341135 1350641 1374511 1434191 1498962 1519909 1503383 1519570 1572821 1617586
17931 1617586 1687395 1752413 1812455 1872301 1883516 1892561 1878855 1892795 1950465 1982106 2024465
17920 2024465 2075600 2091163 2105777 2155760 2229750 2323916 2474932 2671367 2908820 3222848
17910 3222848 3578772 3992719 4519237 5140984 5930232 6948424 8357399 10292534 13116884
17901 13116884 17284731 23456065 31991931 42279169 52485463 60318828 64660265 64448442
17893 64448442 59093918 50464235 40783499 31590800 23956788 18228248 14205202 11439385
17885 11439385 9499475 8130753 7094938 6324952 5769827 5349525 4969591 4655096 4435982
17876 4435982 4297021 4224890 4191874 4166166 4206355 4234815 4241384 4243358 4232035 4243186 4277814
17865 4277814 4406944 4619710 4901780 5259095 5677819 6187889 6781968 7522144 8546653
17856 8546653 9901558 11761650 14415570 18270492 24008364 32569556 44496106 58896871
17848 58896871 73269388 84355171 90453364 90111220 82503054 70294262 56599267 43605745
17840 43605745 32782831 24659810 18951884 15002761 12187898 10114268 8562692 7396912
17832 7396912 6468298 5731534 5170617 4729388 4378566 4082467 3873486 3767864 3677040 3649910
17822 3649910 3643876 3610730 3554655 3457189 3390914 3277672 3203322 3221220 3270979 3330072 3418471
17811 3418471 3505912 3644471 3838534 4095646 4514207 5112053 6042978 7489397 9691340
17802 9691340 12955593 17512040 22972621 28372835 32473488 34653616 34320105 31235988
17794 31235988 26509419 21295148 16384072 12346421 9337611 7204321 5734593 4694746
17786 4694746 3936423 3343381 2865221 2495459 2184220 1904520 1701109 1568531 1467500
17777 1467500 1375272 1314707 1270781 1219766 1194055 1192379 1163493 1145536 1106771 1072153 1005634
17766 1005634 949225 933998 877299 803361 743514 698106 664779 602407 517019 451321 402438
17755 402438 366538 343237 362710 394949 393276 362638 357587 349583 357986 366663 355187 337170
17743 337170 329533 335088 351031 355648 367292 341903 323008 304670 284386 255794 269456 303935
17731 303935 277444 255029 187283 150688 144949 125368 148443 196018 213223 243365 239758 232489
17719 232489 213319 212752 182415 139028 90939 79011 64674 80287 96990 76769 76629 105923
17707 105923 123646 103864 105708 136796 134349 105316 98181 103289 109816 92735 81233 76546 63229
17694 63229 68544 76311 71427 63854 57821 61594 78469 116968 114400 58983 50253 57608 39689
17681 39689 8289 -16284 -45151 -65147 -68160 -41835 -20626 8907 18284 35960 37537 44026
17669 44026 57782 70138 71239 35752 48243 17171 -15905 -25641 -15091 25665 13099 39
17657 39 -2740 -9272 -5524 12662 27282 45868 24337 12175 -2959 -15829 5762 56515 57308
17644 57308 49398 50358 19890 12372 1344 10246 17097 26868 25106 -13413 3375 11456 22176
17631 22176 5790 -1956 -29853 -9459 16090 4746 -13084 -7348 -22179 -28914 -7190 3390
17619 3390 22740 23875 22456 -2947 2720 43286 44391 14707 13451 12683 7750 -1858 -3717 -766
17605 -766 -49252 -64360 -59611 -30086 -26143 -17435 -7850 -8519 -13916 14632 24250 21443 16395 -6896
17591 -6896 -16909 -19378 -19307 -3094 -20621 -6499 43948 51115 43882 58081 55598 35510 -13915
17578 -13915 -30759 4895 -875 5103 -1567 9931 13740 24318 -133 -6811 -11243 -32418 -35932
17565 -35932 -20317 -39101 -20814 -20397 -31478 -37496 -21841 10908 24569 47531 34946 3933
17553 3933 998 33979 36217 39312 59789 76008 89095 56744 65761 127980 154773 148002 149273
17540 149273 179838 210474 251759 265028 289075 311777 279725 266138 283450 288671 263038 258992
17528 258992 231699 203564 203176 216039 196204 168195 134838 107325 85786 89460 95714 110975
17516 110975 119271 83206 29936 25771 25082 -1237 -22722 -6534 24225 43313 29607 -2039
17504 -2039 4982 -3547 -22524 -1441 5225 17342 51739 49757 28669 54340 90779 76207 66976
17491 66976 77282 101858 132328 154316 192946 215160 217825 228761 225056 239279 218434 200868
17479 200868 180827 178543 158386 157864 155270 144020 133937 110848 83381 42401 11937 23903
17467 23903 33022 16595 12394 17731 5744 2652 -20462 -26891 -23524 -14943 8460 26787 11911
17454 11911 5908 15178 -2757 1511 14728 17427 1635 8498 25266 26484 32671 45461 46711
17441 46711 69611 130067 208302 256558 234245 203504 166344 100930 72423 55814 27442 -16720
17429 -16720 -39742 -6832 23297 50063 32301 -3973 -19578 -6043 39354 74585 53408 26199
17417 26199 1656 -17843 -14097 -1012 -6298 -8679 -25451 -32682 -15382 -5589 1245 35442 53274
17404 53274 46092 3679 -26781 12438 32412 28456 26674 41889 51922 36889 17466 16413
17392 16413 14780 32565 35926 49516 62920 66978 67294 92727 149755 230932 301875 309212 303354
17379 303354 312604 306458 263494 203193 144664 95570 68321 62018 49515 45465 57051 85815
17367 85815 84710 75402 28706 -15263 -3840 -17001 2132 -6121 -20203 -24793 -5969 12829
17355 12829 39535 13744 27249 37467 38721 14054 -538 -1674 1141 13011 39541 89690
17343 89690 65662 57948 67115 86788 112854 111285 157787 203914 224378 248470 310779 397044
17331 397044 470905 519553 522662 455916 383337 285259 212244 183325 150611 111240 79943 61784
17319 61784 61676 38300 21731 18258 9512 -7626 -13136 9053 29716 21639 24955 1835 -9632
17306 -9632 -9713 -5368 2212 1508 -20575 -42646 -48434 -20021 -7081 4377 15359 -8616 -6604 -1353
17292 -1353 -9044 -18852 -15667 2285 14359 34222 71835 130399 183778 190165 179515 189118 218238
17279 218238 222783 189994 145151 75094 54105 58124 33441 43512 33204 7530 2066 1541
17267 1541 11089 20082 7947 -1604 -18744 -41364 -42639 -41367 -13247 -13066 -31816 -13925 19635
17254 19635 35452 7791 -30251 -51500 -62638 -49641 -35440 -59413 -41232 -20470 2960 28390
17242 28390 10993 1787 19370 10859 5642 -5379 -35830 -60146 -37097 -11379 -25321 -36652
17230 -36652 -38472 -19198 186 4982 -1806 -21885 -11951 -7218 -1723 20931 21846 20957 11341 -14077
17216 -14077 10843 4988 -26730 -21743 -24030 -22121 -30439 -35540 -14352 3147 -17107 -27865 -3018
17203 -3018 -8703 -23201 -45608 -40547 -17034 -2097 -2260 234 3063 -21327 -8681 -13663 -9984
17190 -9984 -16067 -25058 -14348 -34687 -58803 -29014 13540 21079 -133 -2121 -29522 -23627 29526
17177 29526 29518 5063 34543 38719 -2831 -20975 -2076 -12639 -6862 13469 32705 1532 -44791
17164 -44791 -45309 -25456 -15342 643 -2023 -15845 -11932 -3559 1999 -18589 -52768 -49275 -21889
17151 -21889 -18594 -17054 40600 63832 27894 -7363 -21351 -23295 -14884 -16127 9363 4298 -23688
17138 -23688 -26313 -24636 -21305 -15338 -11102 -13125 -14813 -7751 7774 -11007 -6608 -14287 -24915 -13984
17124 -13984 -362 7729 3998 -15696 -19450 -21947 -30405 -48852 -60254 -67767 -61914 -39303 -44701
17111 -44701 -50394 -33853 -35406 -40464 -32072 -8297 -31920 -65034 -51272 -30514 -45045 -27101
17099 -27101 -22778 -36667 -18291 -30951 -39659 -37192 -23587 -40608 -42838 -35928 -36297 -21759 -40817
17086 -40817 -37747 -33370 -25034 -43656 -51650 -50475 -56391 -33245 5579 9028 -9924 2795 21651
17073 21651 12960 3087 4804 -22901 -29456 -46739 -55144 -31382 -4428 -9042 -28617 -40858 -51669
17060 -51669 -2819 17736 40986 35928 25613 30412 31428 36311 18261 20793 25936 4773 -8973
17047 -8973 -26383 -54692 -48879 -29692 -12201 1739 23035 45850 43464 18333 17628 6040 24172
17034 24172 10366 -5976 -26508 -28467 -39204 -33281 -35130 -14969 -22674 -22167 -34522 -38256 -36501
17021 -36501 -1036 3165 -20634 -42853 -24475 -25961 -22299 -5479 -11952 -17720 -30778 -41354 -29681
17008 -29681 -38037 -36323 -7744 22802 17211 -3923 17962 5767 -6530 -22557 -10553 -1118
16996 -1118 -11218 -55496 -59614 -54695 -84641 -83081 -78787 -79849 -100532 -100576 -74851 -63240 -44879
16983 -44879 -37038 -40138 -7152 -13328 -46046 -23454 -39519 -29185 -13258 6277 26267 27002 569
16970 569 -19729 -29953 13367 61948 68783 30323 12770 -9558 -49066 13931 9420 -26603
16958 -26603 -21606 -18624 -34300 -46183 -50303 -36256 -14636 26893 25159 33559 40422 23643 6128
16945 6128 -19559 -43689 -50859 -30732 -15870 9614 16245 7397 15005 -9727 -3215 18232 15608
16932 15608 -13093 -24270 -37213 -14533 -41758 -58253 -52336 -50940 -25405 -30791 -6134 -27752
16920 -27752 -37524 -19259 -30491 -51411 -36388 -30955 -44735 -49804 -52624 -41741 5905 -2439 -5685
16907 -5685 -6735 3778 17826 -14556 -38509 -30588 -21679 -14784 -20102 -14382 -61791 -66939 -55660
16894 -55660 -36980 -3001 26761 -2716 -19585 -27675 -24598 -15656 -1430 -21252 -73808 -85829
16882 -85829 -52742 -28991 -14019 -21635 -35040 -32430 3368 20803 16613 17929 31795 18205
16870 18205 3306 -4460 -5079 19953 2198 -41437 -35167 -25571 -14804 -5494 -22816 -50413 -39293
16857 -39293 -6760 -1873 10262 24908 17809 1950 10528 23283 25228 42761 3964 10599 45310
16844 45310 55987 21591 -9685 -25673 -25603 -43603 -44875 -22588 -846 -18443 -6862 1942 15537
16831 15537 33990 10535 -16176 -11321 -23866 -47515 -21972 62477 71724 34913 25103 33998
16819 33998 41635 20597 34048 14398 -3471 14114 29908 13645 -6018 -6855 3125 8602 -24604
16806 -24604 -36569 -36980 -18792 8655 -9576 -993 14670 11672 -15850 -5352 -2296 -6062 12618
16793 12618 7005 -22278 -63478 -46553 -24474 -3452 4823 16198 11736 -9633 -14762 -19562 -34464
16780 -34464 -32764 -28643 -40222 -34263 -42317 -11838 14429 -1746 1989 -25951 -35629 -37663 -17780
16767 -17780 -20243 -32472 2679 50811 71514 40768 31255 26339 27659 -12061 6449 27616
16755 27616 27791 22999 9049 -27700 -22062 -21777 -32817 -17421 5505 -8762 9780 10879 12081
16742 12081 12733 5323 222 -23184 -46059 -33792 -43432 -62277 -50195 -60281 -63560 -55623 -47417
16729 -47417 -26091 18154 56348 48513 37172 28031 17358 -28981 -17999 7745 -6860 -12595
16717 -12595 13598 -18849 -43670 -49758 -45524 -19263 7022 -6284 -20387 -17463 4009 34576
16705 34576 26949 6190 8632 14541 -11623 -22128 -14904 3450 14970 -1850 3842 29742 44450
16692 44450 28895 -8482 -18101 -30099 -34681 -10656 -6354 -14697 -4958 3826 17403 19710 -517
16679 -517 -52491 -62347 -46580 -47190 -14145 25476 26776 7726 -7512 -2877 2072 3307 2582 4135
16665 4135 12853 14512 15483 28001 6373 1937 -21406 -24300 20179 11951 -18251 -29082 -43598
16652 -43598 -45117 -25793 -22580 -39368 -1037 20698 2635 5512 5112 -13778 -25650 -17719 -1343
16639 -1343 -15584 -20221 -36955 -44126 -49240 -55223 -35330 7272 28567 20706 15735 18500 32554
16626 32554 3426 -40131 -19469 8812 -12991 -56108 -66016 -48419 -28126 -7518 -21803 -22421
16614 -22421 -53 -19941 -35162 -26024 -44086 -36312 5681 -7362 -14916 -28924 -63297 -59357
16602 -59357 -30755 -18482 -28896 -29869 -18738 -909 -12554 -29197 -15846 13391 35360 60481
16590 60481 27890 3550 -1450 37784 26550 -13726 -51358 -48660 -949 23481 27418 50998
16578 50998 36905 -810 -30393 -16727 -15213 -50576 -52322 -45064 -56754 -52523 -51927 -42820 -26870
16565 -26870 -22921 -23630 -38362 -72571 -70453 -57976 -36397 -20143 -14102 6702 -6507 3697 4711
16552 4711 3186 -4736 -3274 -2538 -9963 -8596 -570 -3914 -3709 14715 15799 -4147 19810 31410
16538 31410 46257 34339 3528 4816 16628 2971 -6889 -3277 219 -12280 -44185 -49350 -51614
16525 -51614 -49783 -48167 -13437 446 -27536 -19820 -23506 -17097 -48876 -67472 -46508 -11210 -12071
16512 -12071 -46417 -42158 -1636 19371 -16590 -50604 -27962 4019 -3735 -39044 -56831 -59102
16500 -59102 -43805 -10061 -2778 5022 -2408 -13076 -10131 -19815 -27944 -9027 -22634 -920 21145
16487 21145 26270 21257 35333 20733 -5436 -7336 8498 22382 35325 -3415 -33902 -18332
16475 -18332 27433 35711 -596 -34656 -35361 -26411 -12149 -5733 -15747 -36980 -40404 -10734 4422
16462 4422 -9202 -28624 -29209 -15681 -38984 -39327 -22523 -23752 -11960 10385 30485 23668 13100
16449 13100 -7458 -32825 -34196 -16594 -21344 26052 47344 -6624 -42348 -41843 -38937 -40554 -58830
16436 -58830 -39007 673 23050 39551 10932 -9048 -32107 -38135 -21894 12305 15058 -28881
16424 -28881 -25602 -652 13672 25351 30324 22649 15678 22087 15643 5274 14163 23835 3978
16411 3978 7737 20611 54186 35318 28599 57114 17437 -25985 -45194 -36319 -38714 -40105 -14947
16398 -14947 -22759 -13046 22003 36177 33807 42287 23853 38014 46451 49007 18169 -17771 -38002
16385 -38002 -42181 -59250 -67656 -48097 -23824 1294 -2878 -7879 -8557 -26993 -12959 -22602 -10025
16372 -10025 20056 26189 448 -14032 -23382 5494 62134 64640 39383 -762 -9857 -25215
16360 -25215 -7362 -10051 9655 36617 57779 18388 8411 15405 -21294 -45496 -35143 -13017
16348 -13017 3966 48941 83020 80124 71477 62937 39109 15154 22649 42476 5024 28790
16336 28790 22902 34881 33049 25688 67287 67810 60957 58289 47393 45675 31243 3426 -13761
16323 -13761 19575 15730 13020 30673 27386 29064 13217 -16703 -14393 26021 33838 19766 7763
16310 7763 -3951 -29369 -49324 -47965 -24727 -19538 -42618 -45589 -41476 -45477 -28281 -25137 -43875
16297 -43875 -37414 -18647 -25593 -38189 -14122 -25049 -38805 -7289 6265 -29138 -52261 -47050
16285 -47050 -36120 -12699 8768 40659 69097 78851 41184 26363 24847 52995 71536 92493
16273 92493 104053 86394 28344 -22495 -27251 -2270 18196 49844 74039 83785 88401 58418
16261 58418 53827 62914 79280 59357 16753 11571 17693 29026 47152 47475 58991 77717 56584
16248 56584 65354 69052 52380 24271 16523 33988 51541 62234 32137 13309 12422 30170 58653
16235 58653 68396 58705 37128 52568 40763 6181 -4285 32994 57955 42882 43184 29898
16223 29898 29517 44328 71468 63897 76345 94641 114450 90685 54072 32382 29707 42676
16211 42676 35201 24253 42526 19569 43498 57544 35492 25775 32303 31472 17498 13965 45059
16198 45059 45948 9342 17157 33450 5149 10407 47632 65007 34216 24591 6896 35736 73827
16185 73827 77375 69960 50726 52504 101497 93181 57097 46630 19376 54923 63681 22085 19444
16172 19444 3632 24384 51517 49411 37643 39316 41812 50620 44873 37250 31785 15539 10804
16159 10804 15206 470 -25983 -12664 14029 30268 29588 27700 39413 56930 31065 -17991
16147 -17991 -5136 4932 4178 -13794 -23312 -6622 -9420 -8940 -16727 -475 35210 35024 41098 57874
16133 57874 70212 44020 3252 -4323 30832 40955 -7433 -9368 23577 21334 9522 15701
16121 15701 12 -5176 18805 30605 29729 17948 23351 49701 34509 18778 -4727 8625
16109 8625 51536 56259 39128 29476 41654 44226 14712 20411 31787 -6381 -22379 18905 -1467
16096 -1467 -1336 49733 51073 27416 22256 15626 -272 -7638 -6344 -26935 21553 28742 30423 20222
16082 20222 13762 -6266 -11098 12810 20755 40170 17070 -13609 858 28292 22021 -9256
16070 -9256 -36321 -26790 -11454 46785 63490 62799 50501 55620 35588 35482 17686 38841 64755
16057 64755 27737 -15009 11071 27206 21872 6157 -7884 14774 32712 17127 6704 17479
16045 17479 29074 41391 30243 39577 17855 -3407 -10103 3033 -179 4750 39325 68186
16033 68186 35178 -29090 -21800 -1711 3634 -6845 -17307 722 -13431 22480 49048 64561
16021 64561 53086 25397 10987 13159 43165 42426 72173 73211 59496 53835 69236 57433 36169
16008 36169 39727 12965 22688 46631 57842 11022 -9349 10063 22660 23684 53599 54930
15996 54930 51576 43485 25940 39740 59658 32057 4099 19541 49054 58595 70230 88114
15984 88114 51731 45172 66567 65649 66534 69768 51339 75285 67999 53765 58320 54298 69985
15971 69985 101882 101169 71476 57247 58553 60007 54573 53595 32836 49088 42551 32784 28568 23102
15957 23102 18922 30005 28743 42106 44984 32433 36650 25336 8330 -5078 32874 45039
15945 45039 21810 13738 26613 37824 42401 44845 60556 37602 5887 4001 16642 44836
15933 44836 64854 73503 55510 13140 13002 21089 26581 46747 15824 12274 -1884 -43340 -17769
15920 -17769 3080 3601 -5657 11562 46827 36513 27077 9901 37368 85581 138662 144563 97506
15907 97506 99884 95253 78274 69533 48157 20647 -5617 -14121 -2606 7867 19514 31557
15895 31557 56756 86290 82930 66028 63295 19628 20981 24384 8216 11535 -4108 39363 46315
15882 46315 42306 31520 24043 4045 -20764 -11193 24689 41830 34899 47831 68923 59046 62422
15869 62422 57040 41645 21077 55212 71059 57884 16005 -39813 -83488 -70522 -39277 -5512
15857 -5512 19625 21882 33713 30640 58495 70656 51511 18736 14739 17776 20506 23001 17512
15844 17512 16301 12510 13044 -10210 -21585 -9874 -17578 -15523 -29001 -17699 -24753 -24023 -3049
15831 -3049 8043 -16014 -17168 -12454 -20244 -43553 -5172 11421 -35593 -37209 -9278 12652 29050
15818 29050 21670 -7480 -3245 12260 16887 2192 4812 12048 22410 18650 25189 12507 -5098
15805 -5098 -15647 -35199 -18258 -4711 17471 34215 48666 14766 -12614 -34381 -26556 10293
15793 10293 13597 -19539 -2114 11486 19548 24439 -5449 -46342 -66683 -46881 -18788 -33914
15781 -33914 -45767 -17931 -7808 -9675 -13421 -31985 -8304 22590 30949 24119 45134 41287 4665
15768 4665 -6247 31637 55499 54009 34230 34006 42489 1207 -35745 -25928 -2530 46889 54789
15755 54789 3392 -49994 -41194 -19934 -28782 -24265 388 4786 -557 5151 -12079 -52903 -39578
15742 -39578 -23252 -11214 -8848 -18630 28838 24514 20014 31241 7262 -9273 -1246 7553 329
15729 329 5572 -4332 5072 13506 252 25280 31876 18474 29699 37905 48883 41608 26298
15716 26298 16543 6953 7501 18414 13323 -11468 -9906 768 -13994 -7314 14308 33724 31213
15703 31213 43502 45018 52755 70766 63910 47310 11021 -17710 -12471 -10036 -8398 11086 12779
15690 12779 6734 17300 30783 40844 32560 37542 54099 42501 6316 6901 -3335 6163 25782
15677 25782 15795 -21892 -22282 49057 37541 -5373 -18052 -38441 -53156 -34164 255 12403
15665 12403 23402 41972 30330 46699 66837 65947 74681 63677 62414 24410 -12070 26389
15653 26389 31936 28200 278 -5211 7199 18341 -12109 -18957 -872 -4699 3606 -7983 -15051
15640 -15051 -6747 11103 16031 22622 18126 47989 61229 54293 24882 28288 40913 44680 30555
15627 30555 25348 11214 -22781 -11082 10338 6811 15682 69819 103798 86788 41911 17524
15615 17524 -18208 -38506 -9745 -18447 -23524 12481 26582 34264 25392 53729 55766 31223 16071
15602 16071 47291 67047 48309 48006 71870 106284 87676 62607 44991 16586 -21735 -19531
15590 -19531 -23912 -23475 -27307 -34516 -6429 6089 -16497 -23071 3918 -4105 16904 33071 11761
15577 11761 25988 49121 55075 53637 56750 48190 23044 -6252 -19945 31898 54324 43678
15565 43678 39509 42791 28113 5607 -2780 29640 32736 21908 -13418 -26955 -18736 23931 25944
15552 25944 24273 44349 58853 51064 40621 38161 34100 38947 28910 15110 -6127 34149 40231
15539 40231 36981 50042 40253 47082 78506 103485 70784 34025 9917 34549 60677 61197 69790
15526 69790 57937 21796 801 21246 5816 23160 38284 32185 20378 34556 59645 40116
15514 40116 43897 60327 42822 24671 -849 -547 25972 44617 17839 -5874 12970 17546
15502 17546 5246 -7538 -10161 -15392 10031 17421 16922 30287 41643 28576 7449 -5175 3036
15489 3036 20935 30957 16106 56230 88640 84081 38756 32468 52221 75113 73107 98354
15477 98354 111017 110548 98112 92496 100500 98481 83723 74223 64522 74753 108453 89278 65201
15464 65201 75084 110815 114578 104401 99028 90468 98449 95063 78709 106008 115230 92442 98831
15451 98831 87299 73316 95256 118331 126576 120486 118522 116137 113264 95173 133171 145473 149554
15438 149554 138548 138799 141559 161856 163952 175083 234391 262286 270414 285092 274286 294486
15426 294486 303778 330335 389273 483102 566690 708772 858663 982037 1118794 1271037 1412419
15415 1412419 1505006 1528100 1473862 1389898 1280399 1129545 991325 858331 728499 598028
15405 598028 478733 416066 349035 300379 258138 246112 225373 197716 192992 214099 214473 195007
15393 195007 132825 119962 100338 96196 91988 93681 98969 94968 115374 137134 140240 139815 122178
15380 122178 108452 107393 103856 109850 116553 104592 100897 111499 125082 123176 135648 144776 146940
15367 146940 113548 113348 150782 178024 199328 165790 123773 126444 112599 103271 113689 139929
15355 139929 178395 141216 131423 121619 123749 139380 140373 125392 150206 153217 128522 106115 133324
15342 133324 161174 170660 134334 107221 145666 185771 158126 151174 151813 175827 187435 184250
15330 184250 168255 175038 207315 198305 170753 149561 138504 141146 151782 170301 201426 186646
15318 186646 175413 176258 176030 180628 211892 226283 203063 202076 217777 202952 203279 211293 216330 229992
15304 229992 208917 210040 237072 212319 196022 215018 221954 217026 203055 212460 216811 199074
15292 199074 171709 181447 173031 208783 215873 205785 264552 312451 300346 291647 305813 267463
15280 267463 229185 212053 212969 221891 223555 234153 251374 273448 269850 230114 237608 244840 257972
15267 257972 279062 261098 260086 244770 206520 166404 176370 203293 200660 215487 228937 216869
15255 216869 208817 197586 216937 217172 212369 205665 189429 186897 174682 192342 196957 203512 197402
15242 197402 199980 190376 164631 173708 169604 178834 213229 253232 256080 265566 273551 305391 332818
15229 332818 353904 374345 352965 347464 337290 333605 334294 295337 257015 208690 223377 244128
15217 244128 228975 190952 166246 171681 176538 159650 177064 217243 250598 284338 282645 269144
15205 269144 234435 224274 222884 222563 234796 233069 227977 232361 205107 176565 159998 168287 191421
15192 191421 197710 187899 183883 188567 181685 199319 221260 237509 244079 252564 242031 231173 255446
15179 255446 259590 279208 275362 264205 268060 241849 214531 193661 193411 202083 181863 151515 179098
15166 179098 212031 227393 203805 205926 192597 211395 223947 252085 277127 272416 272349 271711 262152
15153 262152 266727 252862 226581 224956 236789 253791 277314 297866 286974 313926 345760 358033
15141 358033 361917 349062 349427 350135 302369 325464 337384 340645 314989 297069 306999 299240 302718
15128 302718 306461 307336 289772 287324 304468 319812 341128 334510 309198 264237 287278 329578
15116 329578 337811 338445 317015 290582 328502 347317 331863 349484 350292 351382 362361 341601 325971
15103 325971 335962 350919 335250 316896 322525 344794 401943 432636 472481 484482 488312 481864
15091 481864 446388 440717 417474 404835 408797 450538 453987 460375 503796 482973 464308 494349
15079 494349 495683 489232 487168 492032 548255 604707 650678 660808 688586 692714 706741 717260
15067 717260 740842 753592 764699 774282 788769 795734 805547 813803 824205 843300 867509 885520
15055 885520 897147 932952 945298 957229 966394 998562 1008533 1033779 1052586 1052441 1079532 1105483
15043 1105483 1152462 1180678 1152643 1169365 1212751 1255833 1347033 1435091 1499340 1555515 1653861
15032 1653861 1770112 1919604 2025797 2130971 2292582 2473759 2735947 3065088 3452270
15023 3452270 3934319 4497627 5100927 5702010 6254882 6742986 7079296 7212485 7149879 6966720
15013 6966720 6695221 6296876 5899162 5542139 5212045 4940672 4798647 4793231 4822731 4911155
15003 4911155 5036494 5258094 5497176 5775663 6117465 6519234 7026024 7607645 8313760
14994 8313760 9157014 10151251 11330018 12747625 14408473 16271558 18420436 20860267
14986 20860267 23662574 26909512 30795684 35672838 42077642 50830883 62840231 78779512
14978 78779512 99094755 123912785 152489519 183113990 213387853 240829653 262664247
14971 262664247 276344069 280209207 274134679 258932640 236135049 208126403 177909126
14964 177909126 148138918 120677326 96904749 77512306 62426632 51023536 42522137
14957 42522137 36181446 31318266 27397342 24136056 21361249 18958822 16871268 15020612
14949 15020612 13371699 11956698 10761120 9763790 8919234 8146451 7469825 6886567 6352688
14940 6352688 5834620 5355118 4929255 4565533 4196727 3876859 3588266 3310733 3058635
14931 3058635 2862466 2668377 2476998 2338533 2207803 2093410 1998729 1904380 1783273 1698340
14921 1698340 1637549 1564951 1479074 1387094 1303958 1229096 1173680 1148626 1112451 1101130 1065123
14910 1065123 1018389 999505 935223 863053 827513 824635 796816 745894 705441 667645 643113
14899 643113 646450 629563 601947 565672 529422 527639 496377 491498 488730 503422 519339 497723
14887 497723 462703 427023 392423 385638 410676 403130 381544 382400 380672 366677 334784 317385
14875 317385 317453 322982 309033 294583 311770 329452 312829 292972 293884 309763 295673 267368 271357
14862 271357 298846 300354 291345 281773 308639 326509 311399 318794 297954 286454 306296 334788
14850 334788 366836 393212 408545 416653 428373 406868 403621 410751 411833 421609 395382 321979
14838 321979 265905 214935 193128 173221 154342 131803 143904 155192 155479 131431 136635 114880
14826 114880 70346 61688 77004 108200 137916 165344 175039 175408 186560 163174 126322 140945
14814 140945 124483 109322 141056 142838 114433 122138 127335 114143 88404 88636 87892 74684 90270
14801 90270 100328 103491 79435 63424 63341 61241 64180 56658 56508 56125 32916 16626 5703 7151
14787 7151 17339 6450 28927 44875 27496 10041 -4688 6290 21819 42637 84466 106471
14775 106471 109690 94473 111453 124512 123611 109177 75900 50071 33632 57675 80953 65274
14763 65274 71961 57007 52773 49008 47460 39350 49880 37205 38592 32393 28997 10978 -16270
14750 -16270 15311 49705 55025 40241 35710 49144 71592 67783 10886 -3490 9877 38377
14738 38377 10140 9741 12843 11630 28590 18209 32341 49882 48039 41586 -15578 -15424 -360
14725 -360 31483 36989 28206 14506 9579 34264 42582 26684 68692 72355 11354 -20942 8959
14712 8959 24409 37347 36360 37315 38173 8753 -4396 8233 17318 35061 45420 60886 43441
14699 43441 58791 42183 17352 -10594 -5068 11015 -359 27394 47670 51984 25263 7735
14687 7735 -942 34463 55119 43094 43564 41047 18321 -6215 -22334 -24304 -38871 -40507 -66112
14674 -66112 -90257 -117638 -109952 -78844 -74571 -90901 -105062 -104068 -47039 1403 -7175 -6501 -28841
14661 -28841 -63404 -83971 -68968 -60848 -81222 -86000 -60243 -75138 -93531 -78475 -58504 -40363
14649 -40363 -22615 -30994 -45313 -48632 -58529 -51528 -62106 -59900 -61987 -38884 -5666 1731 21541
14636 21541 -15877 -34065 -21066 -9598 -22802 -21618 -3739 -28797 -56559 -37515 -20594 -56325
14624 -56325 -79670 -67272 -46131 -36106 -23583 -58569 -70146 -83704 -66076 -45746 -31983 -25495
14612 -25495 -20482 -13372 -14575 -45714 -41845 -108 11619 27618 43934 52709 61786 24728 10439
14599 10439 15194 -19415 -12400 19433 40374 31614 32542 42627 46348 15546 13348 -5779 -40637
14586 -40637 -18094 15994 30969 20252 -7925 -6803 14123 24642 21983 1441 -15148 8716
14574 8716 11817 3634 -5323 16407 33433 20932 5725 16499 36285 9591 -11254 13793
14562 13793 46892 51835 53897 51944 50871 41540 41236 28071 46120 37957 6465 25169 65864
14549 65864 78878 61216 48723 40079 34335 66491 103391 111509 108577 103568 91832 76341 79218
14536 79218 106051 130869 162040 194945 198587 209285 266773 371175 480387 567907 673697
14525 673697 838028 1009525 1158024 1304362 1426163 1465803 1441458 1339744 1187428 1057334
14515 1057334 945871 794490 619649 509089 424390 344646 281984 225932 174393 151061
14505 151061 129808 107159 92541 108273 80627 62897 75784 74585 50123 32365 30146 -12183
14493 -12183 -411 -10571 -24054 -2865 10572 14009 7673 17502 20156 34218 20908 22809 13398
14480 13398 17646 27928 8340 -11295 -1195 2256 5234 8514 2088 -11114 14729 36500 30088
14467 30088 13512 8992 15622 -7882 -32355 -15310 -19435 -7077 -27790 -26764 -14352 -21574 -17565
14454 -17565 -12953 -12685 -32695 -42424 -48931 -40603 -22447 -21970 8204 -3704 -22571 -22299 -31519 -42821
14440 -42821 -32005 -21263 -15070 -19367 -31652 -30519 -10121 13718 20317 -12647 -36574 4508
14428 4508 32814 28463 33309 22660 11249 2802 8460 -5594 -4588 -15551 -9934 -5044 11471
14415 11471 4806 -32606 -162 31286 18447 -8030 8583 33134 25621 30675 34728 64211
14403 64211 65984 53704 11091 8274 -16011 -45478 -34006 -38351 -37412 -17070 -10859 15266 33776
14390 33776 38699 45123 62795 77825 77600 95410 134515 187668 190582 194498 227645 275306 356658
14377 356658 418994 509808 605377 637294 708936 778859 820350 798601 722573 624126 554805
14366 554805 512678 447967 370386 293625 237380 233871 200404 154797 124163 107473 106102 114996
14354 114996 101741 117133 106497 81766 60583 57670 45571 29783 28725 24051 65129 69170
14342 69170 47876 25397 27831 40475 51330 39559 72045 82922 73879 63852 72669 86574
14330 86574 80833 65737 75731 102892 109116 102891 101759 111144 121229 102193 108215 106553 103247
14317 103247 88535 91736 99480 90238 67172 39158 41858 66376 57395 39681 22250 -117
14305 -117 -6769 3073 45519 47910 44289 52360 911 -17573 -17220 4464 -5101 -1972 9626 5186
14291 5186 -22389 -39882 -24520 -26591 -7667 50150 64311 27893 36181 26717 23003 13336 -23552
14278 -23552 -973 19532 12023 -2228 -17893 -55537 -75236 -57247 -10912 8723 -8912 -15686
14266 -15686 -29493 -39007 -23611 -31530 -42021 -30256 -42099 -64633 -61186 -67542 -42485 -15211
14254 -15211 -16000 -44789 -55656 -24432 7091 -16695 -18714 -12492 5542 -4774 -15962 -13396 -19341
14241 -19341 -14022 -12560 -13536 -22377 -43353 -27031 -15192 -10190 11159 11974 11759 10434 -11200 -15223
14227 -15223 -5129 13683 3954 -19594 -13645 -15838 -63 34958 1392 -5675 11491 319
14215 319 -6702 22258 14556 -17014 -20666 -19357 -1426 -22833 -30235 -49697 -47981 -18094 32307
14202 32307 20869 -2843 -14419 -24273 -31835 -51650 -31315 -13760 -11739 -20637 -16440 -2571 -3051
14189 -3051 572 -14988 -44904 -39508 -15757 32911 37588 2392 -18391 -33471 -8608 -26552
14177 -26552 -27798 -31707 -38979 -39100 -41266 -28481 -30152 -34484 -21230 -11357 -2948 21268 28540 15704
14163 15704 -4876 -5856 -5893 -265 46882 61816 47303 42239 34334 -1304 -8793 7178 29347
14150 29347 14761 2673 -13910 -14165 -7881 -3594 -14853 7956 20454 4626 8183 -12724 -5312
14137 -5312 -11199 -10648 -2103 -10868 86 19165 36690 33297 30305 90146 81626 63837 51340
14124 51340 60700 84756 108609 145101 150289 210539 268451 295012 397940 517121 586534 665175
14112 665175 734493 779121 805837 792774 753880 693135 654337 577393 461570 370814 284076
14101 284076 208661 176282 144100 140179 135169 148195 129489 105517 110517 89169 85887 43648
14089 43648 29111 -12428 -28680 -7467 32575 39342 33954 17359 2275 17984 14839 13375
14077 13375 15482 -3404 -18558 -6673 25715 49127 44086 48839 45604 13325 15944 -9811 -7629
14064 -7629 20144 2072 -13791 -2820 1049 -2831 -5336 -9349 -21065 -6486 -16940 -12409 3659
14051 3659 -17666 -37186 -28789 -551 -2240 14744 40981 19820 -10307 -18672 17070 65628
14039 65628 54482 12425 4402 29656 40068 18139 13608 18187 25559 18747 3620 7505 29534
14026 29534 43147 32340 46932 32275 39430 47161 19707 -2997 1879 4118 27297 17697 12554
14013 12554 10826 13273 -17567 -41485 -50004 -23684 12581 30844 30899 11399 39749 46485 21483
14000 21483 39647 62386 59833 26969 8540 19195 10119 14085 14855 -1155 -31706 -48707 -18074
13987 -18074 10149 -7438 -41561 -39895 -24256 2329 28264 49012 35692 8608 -5998 -9741
13975 -9741 -7560 -7062 -25697 -1082 1588 8425 9184 11773 21956 43882 65670 20995 -28427
13962 -28427 -29827 -24305 -28247 -44301 -13974 30876 33600 47518 59122 32391 -138 7342 11899
13949 11899 4236 -18958 -11361 -3748 8405 -2485 13008 -4901 -28650 -52073 -60825 -31764
13937 -31764 -32406 -17475 -26669 -26973 -13971 -9898 21162 17727 13029 24157 33718 29328 11067 19873
13923 19873 24118 43089 33872 56595 54992 41926 13777 -24185 -29948 -29591 -10892 -29631 -51938
13910 -51938 -36041 -38583 -16709 -30084 -10787 2647 -8175 -4239 -7806 -22832 -21617 -2793
13898 -2793 -2320 20530 33249 -6281 -29012 -5052 15279 4842 15637 23086 15336 31561 21564
13885 21564 -1601 -14494 -5444 -5663 7934 -14921 -8243 14099 23132 13215 29241 34762 9377
13872 9377 -3177 -11949 -25715 -27774 -42179 -63227 -65103 -59027 -21767 3535 18273 4195 11471
13859 11471 5583 -32538 -68281 -60524 -28590 -9076 8245 19900 33889 28805 -4793 -24629
13847 -24629 -26381 -23889 -6862 13717 7660 -2954 -16918 -26794 -21364 -2389 13015 11963 343
13834 343 -37555 -65188 -65578 -29400 4212 -749 -18236 -18551 16853 39605 63585 55211 41825
13821 41825 14921 13480 -5907 -2553 16277 19667 14368 14502 4765 -1407 -25874 -38207 -17990
13808 -17990 -14938 -10927 -7918 -22667 -8455 -22453 -25439 -8549 5836 7151 21483 10118 12951
13795 12951 6423 -25046 -37299 -42224 -31423 -60754 -81003 -89292 -81774 -94025 -64572 -24549
13783 -24549 -16262 -29448 -2990 -6460 -7731 19675 19739 20030 36334 13336 -5627 -8223 -13203 6917
13769 6917 4876 -18016 -6089 -6562 -24803 -23380 -18809 -28838 -14664 6342 12954 11783 12461 6539
13755 6539 5360 21106 46733 50029 73126 58153 30477 51499 45111 9662 1633 7374 6554
13742 6554 16780 17788 14956 21903 -1247 27593 60740 64850 77908 61394 32533 35948 23018
13729 23018 -13992 -246 18653 20355 27859 45784 47974 24069 22007 49489 49490 52552 19987
13716 19987 -36852 -38413 -8193 24679 28339 36524 21575 22587 9111 41175 77580 73899 38653
13703 38653 -11179 -38348 -44709 2348 -3958 11189 14846 24697 28803 40013 52803 53385 64596
13690 64596 51186 18859 37131 38636 44500 47883 28490 35737 72936 82017 61102 36788 35636
13677 35636 36642 36097 -8902 -5313 4385 7100 1173 13361 27306 40389 34495 17420 14081
13664 14081 1988 -10323 16228 36606 65157 91997 94066 79950 81185 112533 179636 193112
13652 193112 251808 316613 377596 452426 479985 513315 545914 553272 568246 539584 515726 505406
13640 505406 474658 427643 379969 348045 317818 286141 255159 246864 269579 263447 235115 222853
13628 222853 246008 249836 219111 189640 198935 249712 256910 219126 209304 248886 246011 239153 260478
13615 260478 286464 299748 310207 363170 452186 482843 498524 540702 616151 655917 635934
13604 635934 602240 564251 508472 467181 461473 408421 362830 315318 270348 215388 150335 153117
13592 153117 148919 151114 131794 116304 105704 108871 141712 170061 133969 96915 104198 146636
13580 146636 148409 148111 160894 146582 133723 122620 111196 134915 134443 133321 146544 117599 95488
13567 95488 100492 108758 103297 82227 81744 83131 111095 107333 86608 93878 135268 169712 164958
13554 164958 177129 157717 164063 178467 180774 196514 210927 215863 278522 316287 331425 322786
13542 322786 329914 361177 418087 469085 536348 586845 646996 711473 750756 768452 756781 713790
13530 713790 669313 605577 562715 516704 467098 398431 306745 245366 215489 185396 168154
13519 168154 136351 118797 111670 107508 117294 137289 173237 164523 156960 184717 167017 165590 175448
13506 175448 186762 163245 116916 114304 118860 103203 94364 57128 8349 -6198 -12378 -19422
13494 -19422 6842 43944 58638 42700 34004 7964 -18757 -19785 1158 19813 19450 3009
13482 3009 -29292 -4925 14557 -379 -15039 -1630 19143 3233 6096 12047 -28581 -23843
13470 -23843 -3883 3793 17695 4974 -10576 6873 27085 16376 29148 10850 -24030 -22015
13458 -22015 1870 14715 12528 5304 -5155 -10646 5631 23776 35210 17290 -6809 -31955
13446 -31955 -53942 -42490 -28707 -26046 -3929 25663 38220 53782 52414 62140 66284 59492 40950
13433 40950 35988 57915 102333 145743 156667 152807 132744 134313 147241 124625 68196 45668
13421 45668 55336 62830 43558 28517 3000 -4055 211 428 8743 14055 -1735 368 9426 4452
13407 4452 36800 57799 55720 25072 11028 -17412 1943 -10746 -22689 -19771 -25808 -12007
13395 -12007 4803 26003 14105 -719 7055 34484 39490 26049 -736 -31581 -66900 -31574
13383 -31574 -33770 -4221 19903 25081 34598 12714 -15742 -19794 -18726 -12863 -13189 -11752 -11754 -16019
13369 -16019 -15323 -50712 -57291 -26101 -3293 -4009 -12727 3355 21559 41430 34438 8258 -37174
13356 -37174 -46246 -17481 -5740 23941 21227 -10883 -15050 -22711 1404 29161 -2131 -11617 579
13343 579 6631 -7861 10269 481 -23978 -33147 -25136 -10528 -6632 17177 6375 6004 -15633
13330 -15633 -9913 -8264 -1031 -45707 -45105 -32049 -9241 -1875 -17221 -16681 -13565 -19415 -41749 -34042
13316 -34042 -23544 -35588 -33343 -20397 -398 6872 18650 23605 28319 2956 -13456 -2084
13304 -2084 34238 19306 13738 -14422 -20231 -28667 -16731 -18884 3115 20643 17295 24726 24669 18898
13290 18898 11379 16319 24323 31832 27024 30847 37666 47621 11143 13445 22550 42130 21895 25084
13276 25084 44399 30929 17027 23034 35456 20692 24386 48500 43991 -5725 -5822 -3532 -21799
13263 -21799 -24070 -24298 -12321 -9763 -2347 6386 36415 35452 19151 28868 45998 43745 34191 7118
13249 7118 3436 30844 21412 13640 13814 -5559 2905 3913 -9661 -25854 -22207 16553 21691 46228
13235 46228 55443 19776 10472 12262 8429 7399 -9077 -14625 -7902 -10932 -26801 -41411 -206
13222 -206 20098 -3324 -1927 45166 32517 -23423 -15951 3055 32719 28583 39949 54274 73150
13209 73150 73926 42271 13817 9968 6202 14788 -227 8244 -686 -28064 -48305 -34876 -26297
13196 -26297 -30621 -16887 -1387 -39393 -12506 19004 30858 49119 76319 74376 28347 11559
13184 11559 47101 59688 73632 98812 128879 157495 166779 151361 101984 73848 57128 18167
13172 18167 15131 21253 10004 -644 8702 -2976 -17181 -24390 -28154 -44772 -43615 -6972 19950
13159 19950 40227 40900 -6970 -10750 -6883 3146 1354 -11293 -26948 -22816 12497 33620 28196
13146 28196 -16592 -32822 -20604 13412 39065 31929 108741 155856 194101 267277 360877 439024
13134 439024 506685 531278 486317 375460 286485 200681 136995 64674 40241 23520 23465 41627
13122 41627 25947 -2002 -2070 1604 2932 17241 5905 -29485 -24705 -8174 -25742 -17541 -5862
13109 -5862 5879 -17818 -14972 -15507 -6762 -4761 -3637 24996 23912 26023 31563 43548 64223 69724
13095 69724 87431 96575 137409 209962 332408 450922 532060 524429 452842 386291 299974 189506
13083 189506 119541 74149 56201 46983 35600 11385 3077 59646 92924 79593 51829 26861
13071 26861 35270 59402 45208 46910 32237 22601 -11161 8100 15353 21713 24465 27614 41177
13058 41177 35467 5546 -8660 -9696 -3655 10174 -22942 -9467 22603 34602 48627 69228
13046 69228 124976 182291 197803 200601 178468 161017 141057 103748 88401 55404 40887 56789
13034 56789 49473 27829 5079 -2667 -1860 -11599 -642 -17599 -41389 -66419 -48119 -38656 -54003
13021 -54003 -43873 -33366 -51365 -75634 -71102 -16867 31390 26970 -11373 -44007 -48123 -34866
13009 -34866 -10913 -16693 -51016 -64803 -55625 -26832 -41305 -61423 -37464 -14147 -19112 -40006
12997 -40006 -35553 -22112 10015 -1632 1084 -10744 -2638 12991 -9574 -19055 -3744 -172 17987
12984 17987 25227 -763 -8547 1620 -7518 -5947 -7908 -2043 9845 10135 13064 1873 10532 12342
12970 12342 14349 -757 2664 -1746 -43102 -55816 -40806 -10884 -1221 3915 -6737 -41594 -61427
12957 -61427 -53580 -37264 -52823 -56936 -43384 -10120 -2636 -783 -6830 7299 29136 35154 27422
12944 27422 17588 22453 55319 7143 -18424 -44228 -31349 -12330 15475 30872 51508 26523
12932 26523 22026 33627 29631 11018 9791 -4911 5041 25766 13279 22397 17698 14116 955
12919 955 -2416 7206 -3956 -10012 -4098 -11236 11367 39430 57757 57345 24070 -18934 -32526
12906 -32526 -1983 -11521 -3602 28518 48823 46365 15956 -10779 -38023 -56261 -51336 -51395 -71669
12893 -71669 -35326 26449 3097 394 3974 5272 -380 -3404 13418 20231 40442 49501 37852
12880 37852 21805 8120 2191 12826 18696 19835 34014 13331 5633 15340 3871 26924 51778
12867 51778 12040 3239 8548 21646 58255 81528 36637 -8608 -9511 1031 11612 19362 15115
12854 15115 4951 13693 -958 8650 1464 21306 21420 -7788 -35379 -39380 -27671 4545 -14849
12841 -14849 -21739 -10443 -3789 -14458 -12724 3978 759 -229 -4849 7933 13570 9433 6000 -21105
12827 -21105 -1380 31473 37415 26519 31346 12337 -14167 -18167 -29257 -25043 -32263 -18696 9341
12814 9341 31435 38945 48443 34096 -7869 -28146 -23386 -37939 -41838 -37907 -21898 -3790 -3238
12801 -3238 -11434 4189 12983 14210 -1389 19328 6680 -18621 9103 25524 2945 -10855
12789 -10855 6602 57602 39533 -31688 -31943 11555 -24982 -50682 -38122 -28524 -26953 -47141
12777 -47141 -53218 -52575 -23872 7998 34836 23141 10982 -143 -15841 -19137 -23628 -13422 17859
12764 17859 3572 -8546 -523 26553 28294 25271 14193 21186 18600 30527 24094 -13770 -27633
12751 -27633 -44911 -65936 -53592 -45587 -26303 -21472 -15039 28433 54281 29236 19286 20220 -21294
12738 -21294 -42786 -9144 -8330 -5704 -42221 -39962 -46938 -46645 -60879 -60830 -30375 -25044 -33846 -53144
12724 -53144 -22668 -2748 4080 23947 19720 6752 21248 35001 17501 -12269 1877 12103
12712 12103 -46261 -59191 -16799 15177 14948 3749 -21740 -31144 -10880 -12708 -24284 -43907
12700 -43907 -54733 -48437 -10574 4529 -19673 -38093 -9395 7870 20198 357 1387 21716
12688 21716 29822 24030 6924 -10257 -12807 -16424 -46427 -38469 -26453 -27848 -11541 685 -10069
12675 -10069 -49957 -43699 -15170 -21637 -22441 -11043 15784 5147 -13088 11657 10863 6114 24356
12662 24356 33554 8241 2415 -9865 -32689 -37135 -24350 -14122 19121 70652 62962 53997 29536
12649 29536 24640 8969 5092 -16047 -14657 19488 4165 13607 1687 -26695 -11229 21529
12637 21529 39319 37848 31453 -6835 -36946 -39860 -11657 -2017 5850 16604 16532 19731 7395
12624 7395 -27436 -21576 -27315 -26575 -27619 -42193 -61440 -26014 7476 34302 44964 44288 27813
12611 27813 33063 306 -27956 -23618 -433 31980 41078 22436 -2882 -24244 -24755 -10905 -32860
12598 -32860 -22323 -21508 -38670 -29004 -14824 -11214 -19617 -12285 -6127 -9960 -30551 -41171 -37154
12585 -37154 -42547 -31412 -27462 -14931 16360 20631 15415 -1807 -4240 -14169 -22418 -23937 -18413
12572 -18413 -14842 -40817 -60998 -71709 -63359 -32431 -12523 -5312 -27430 -31128 -15016 19577
12560 19577 90 -12787 -6209 24393 34364 16255 -10016 -23362 10449 1646 -27548 -27089 -19656
12547 -19656 -14282 -2843 -10247 5533 20155 18363 5797 -10502 -8151 -6477 4209 10693 -5869
12534 -5869 -15034 -4929 17482 16276 25478 36996 43246 48537 33978 30702 47684 38206 -2811
12521 -2811 -31613 -60905 -82612 -71238 -19410 -6405 -23434 -26415 -64 34220 40654 36012
12509 36012 21665 -311 -4892 -2972 17535 32954 -13112 -50788 -26257 -9881 122 8880
12497 8880 5739 -4879 -27190 -33437 -38441 -42162 -43767 -21799 -23905 -2259 -414 -17386 -51207
12484 -51207 -77252 -63683 -27546 -14254 16698 48014 34674 34789 41114 28479 -14798 -18587
12472 -18587 6423 10900 716 -5094 -20352 -18858 3262 -15810 -16998 -39826 -35522 -48167 -67537
12459 -67537 -56745 -1750 45342 46929 43733 39007 56748 60770 64070 53689 36185 19471 13118
12446 13118 20468 22412 16449 14671 3411 -6516 -17695 -45979 -45511 -33820 -7063 -23452 -15017
12433 -15017 -26171 -33632 -44817 -41700 -59257 -51768 -31167 -32741 -35847 -34116 -38712 -26207 -7628
12420 -7628 -2998 -2074 4146 -40243 -43297 -16324 -10578 -27380 -5937 30951 41883 11970 -14296
12407 -14296 -17305 -29538 -32135 -17140 -19341 -14723 -35789 -36448 -54769 -55553 -63253 -29495 14891
12394 14891 38628 15776 -10605 -20674 -27309 -20047 -49987 -77401 -63661 -48224 -17793 -35359
12382 -35359 -17463 4725 -54176 -47362 -26163 -17714 -20197 -39773 -24384 -22834 -30522 -21664 -8616
12369 -8616 -4344 -19055 -45811 -39542 -28325 -25282 -43583 -48902 -27836 -20705 -33766 -28475 -14505
12356 -14505 -20024 2211 -16416 -27186 -42966 -33871 -45427 -42149 -40637 -32462 -42973 -61212 -64905
12343 -64905 -42334 -21541 -53718 -46189 -34202 1082 -2611 -394 -24067 -37152 -45137 -11630
12331 -11630 2128 -19531 -16158 10425 3357 -14157 -468 -14363 -17627 -23808 -25699 -24998 -19450
12318 -19450 17445 -10814 -28606 -40454 -42154 -9821 25439 22339 -6856 -48330 -75785 -49382
12306 -49382 -23044 -41307 -30517 -32064 -49573 -37937 -20359 -45151 -23238 9298 13405 7567
12294 7567 14301 -37424 -26887 16300 11876 -17781 -10391 26987 27150 19707 -40519 -53660 -65658
12281 -65658 -62117 -34127 6226 26737 55641 37504 31187 39045 16643 -1857 -10059 9581
12269 9581 15029 2286 6321 11559 -4934 -31791 -29534 -17561 -18511 4063 1439 11217 17942 3592
12255 3592 19566 -7109 -26761 -29607 -14089 8820 6166 -13256 -35503 -9069 11877 14815
12243 14815 10605 13408 1776 10618 13404 45191 53835 65211 21324 -7393 -22753 -35496 -31518
12230 -31518 -8817 -30497 -16404 -32618 -40992 -16645 -13477 -21171 -46863 -64554 -51278 -32208
12218 -32208 -54277 -57075 -48663 2023 -13696 -13959 -18775 -19443 -24822 -5840 10386 14958 26410
12205 26410 38582 8814 4668 15408 3289 27646 -4690 -22529 -28159 -3089 -9304 -17908
12193 -17908 -32874 -15216 -13641 -2227 2207 8519 -5644 8289 37951 52861 50442 29466
12181 29466 22367 5872 -18001 -29312 -22906 -37131 -29309 -22616 -29312 -16733 -14875 -12777 -4905
12168 -4905 36201 50658 33687 5893 -12212 -7793 -1452 -11804 -13692 -31256 -53659 -36172
12156 -36172 -28453 -26905 -30496 -53477 -53508 -42528 -35162 6052 17911 -10195 -39470 -32756 -45381
12143 -45381 -56477 -26271 -11476 -23473 -11995 -12815 -24651 -1090 2470 2751 18826 24016 43148
12130 43148 45834 28377 18037 20676 4877 -25988 -34929 -21834 -23493 -47113 -66688 -44278
12118 -44278 -16079 3494 7161 -44429 -46018 -23847 -13096 -27916 -42365 -1622 5714 -3581
12106 -3581 -5841 -22358 -40654 -29828 -11112 1893 -7345 2260 14692 58605 47251 5874
12094 5874 -20809 -48967 -15759 44707 54622 25553 -13481 -54304 -48030 -35508 -35113 -20947 -12963
12081 -12963 -19385 -19015 -19548 -18159 -10809 -11458 -22554 -20522 -40060 -57422 -69158 -68040 -66282 -72107
12067 -72107 -77615 -57393 -53103 -41459 -43970 -43415 -17133 -41137 -29019 -52876 -47042 -40797 -38437
12054 -38437 -18720 -22382 5774 18537 19192 9531 9462 5037 6218 -6069 -19473 -15268 -28732 -46847
12040 -46847 -35218 -45258 -36121 -33826 -50178 -36889 -48763 -69883 -77447 -56088 -36539 -28425
12028 -28425 -26578 -34224 -16154 -10854 -5822 209 -22269 -42214 -19039 -8617 -17675 -18140 -22749
12015 -22749 -41590 -56432 -44038 -20585 -32448 -28527 -34124 -50573 -63843 -75033 -51453 -41482
12003 -41482 -49504 -25269 3299 7935 20752 46194 35641 55432 38269 -6336 -7458 6893
11991 6893 6129 -5813 -12378 -36773 -51376 -43491 -44539 -38931 -52946 -55461 -24434 -31922 -21543
11978 -21543 -22966 -14421 -37828 -25392 -6579 -6218 -2919 8404 6613 1639 11247 49530 18746
11965 18746 3601 31220 37503 38457 7984 1958 2412 22460 16068 -7083 -9003 -11483 -4394 2329
11951 2329 2396 20318 14189 -2750 25780 48548 28197 7284 13581 17876 28522 37217 64713
11938 64713 52909 38564 24951 -13922 -10118 38105 28240 26665 24614 7969 5951 17819 7741
11925 7741 14102 40473 31796 -17531 -24906 -23970 10971 55511 57801 20867 13617 17174 25200 1467
11911 1467 -5927 1116 -2120 -34744 -52159 -59377 -28763 -20778 -17965 -30559 -37732 -21984 8630
11898 8630 8502 -8864 -2774 -28492 -37989 -25392 -2524 11550 1662 9840 28451 51703 54543
11885 54543 26871 -10548 -22193 -23377 -18403 1560 -1205 22749 38972 47641 35962 31799 17341
11872 17341 -11153 -49344 -67917 -22431 -14371 -49812 -50071 -25708 -9014 -22707 -71866 -46309
11860 -46309 -20630 -26787 -31427 -50181 -42327 -20178 -4864 -18159 -12762 19308 10440 -7679 -1670
11847 -1670 697 -846 21145 47823 28894 -4676 -22493 -26976 -20913 -28104 -5166 34587 34546
11834 34546 -9897 -45122 -28961 2563 1609 844 -13981 -18592 -15016 -3342 -20980 -38871 -42596
11821 -42596 -45886 -52808 -32293 -29782 -14541 -22720 -37376 -63695 -42061 -40167 -67712 -61955 -64158
11808 -64158 -45503 -33221 -14593 -31998 -36787 -23625 -32173 -48330 -44226 -73431 -75982 -53579
11796 -53579 -33563 -41512 -66681 -43741 27563 60458 64443 19905 -33820 -64054 -48566 -40452
11784 -40452 -44378 -48696 -48948 -16876 -17107 13062 16402 -18412 -44101 -32497 -19683 -13796 4083
11771 4083 -25927 -25499 -1271 18423 34069 20166 414 -4613 -14862 -13955 -3085 -26726 -49966
11758 -49966 -37897 810 16628 17887 -4857 -1348 14257 -30260 -34878 -11629 3519 -2644
11746 -2644 -29413 -39858 -33762 -48531 -60043 -29820 -8743 -4283 -20600 -5676 29933 16018
11734 16018 -26074 -49538 -71466 -45620 -31654 -19176 -25625 -42822 -62154 -76755 -58923 -39815
11722 -39815 -37748 -61370 -62996 -43992 -53933 -50979 -45473 -52727 -24795 -22523 -17567 -24908 -37220
11709 -37220 -56109 -28322 -33529 -27343 -9032 -14098 -34806 -36476 -62360 -44295 -27968 -25287 -6070
11696 -6070 1723 4265 -17591 -37383 -34549 -28382 -40944 -52497 -61682 -74073 -62712 -42723 -37092
11683 -37092 -43323 -33719 -42943 -18896 24234 15561 10457 5556 -19641 -47068 -36471 -26651 -20135
11670 -20135 -636 16294 -7490 -6672 4428 -26667 -43702 -8439 19942 20163 17499 31640 23000
11657 23000 7914 -5695 -31049 -50935 -60270 -68297 -43952 17817 42603 21829 -7793 -23525
11645 -23525 -28130 -186 4962 -4876 450 -10592 -4788 2053 23871 54081 53467 52128 29086
11632 29086 17224 22210 32991 40615 22243 -4258 11208 15366 -5594 -44074 -34697 -22515
11620 -22515 1366 -109 -5628 -5109 1689 12916 -1360 5236 13133 -3356 -4622 22562 25307
11607 25307 -4053 -51389 -62206 -53024 -39797 -32530 -25102 -10005 8189 12639 -8223 -17725 -41947
11594 -41947 -31476 -20664 -40838 -52664 -57182 -47129 -41560 -25267 17200 27563 37483 35946
11582 35946 23235 -1293 -18809 -39945 8114 10716 -8225 -13545 -35271 -1136 8757 -15608
11570 -15608 -4211 -5615 -32892 -12729 -11107 -44910 -49342 -49547 -43692 -9019 3014 -39005 -38454
11557 -38454 -25083 -15008 -18305 -15516 -24697 -61575 -89986 -55126 -25648 -45488 -69885 -53490
11545 -53490 -64846 -49500 -27343 -30032 1621 14943 -9709 -7775 -14324 -5469 14005 14144 27358
11532 27358 31881 -4761 -18990 -15408 -30391 -28567 -39475 -27857 24609 4678 15715 11631
11520 11631 13209 20555 -28895 -51395 -47384 -9277 12302 4874 -13536 -38341 -47259 -16740 16433
11507 16433 5067 -39572 -38521 -29023 -17561 -33000 -32944 -18578 12850 3531 6963 -14186 -25801
11494 -25801 -42224 -33660 -6087 -3951 -408 12905 19109 -2101 -26434 -61587 -94919 -98354 -74835
11481 -74835 -52834 -20496 -16881 -28404 -22046 -36280 -46294 -49466 -44893 -42901 -11528 -6381 -14328
11468 -14328 5077 3215 -27644 -14364 -15412 -17735 -2988 -20015 -15076 4834 5420 1240 -1430
11455 -1430 -27467 -1867 27398 7347 -19007 -14777 -13151 -23697 -42345 -2367 17978 6504
11443 6504 -11284 -32458 -44796 -44227 -53662 -67647 -59385 -51394 -80369 -72441 -36176 -27101 -11282
11430 -11282 -4821 -8179 -18092 -38827 -27482 3750 12158 21081 7661 -16669 -29090 -43512 -51039
11417 -51039 -30692 -7060 -10490 -20489 -4627 -23524 -36354 -21362 -18411 -19279 -21952 -10879 5662
11404 5662 8116 6960 2794 -27114 -12281 309 1218 6654 9469 11562 -4856 -36440 -41106 -45984
11390 -45984 -41800 -25746 8653 6228 3883 13144 15095 7999 5708 9731 23415 8194 -1215
11377 -1215 30621 58831 83371 67087 27466 7853 -3937 -5157 19636 -31649 -61534 -61630 -56361
11364 -56361 -32899 4489 13727 8027 -2870 10157 1580 16892 3913 -22180 -21264 -38353 -38664
11351 -38664 -44496 -59177 -37137 -15376 -8317 -43413 -38577 -50300 -34300 -3807 -8583 -38142
11339 -38142 -23104 -1292 13224 49838 42295 3732 -8128 5763 3803 12151 26973 7539
11327 7539 17883 -13131 -19519 -23673 -33345 -12043 -12784 -22866 -27759 -53091 -62644 -40458 -18090
11314 -18090 -33464 -13543 5633 19087 27089 -1381 -29354 -41588 -847 26761 2778 -2380
11302 -2380 -3601 23872 23813 -3057 15174 15174 -11332 -31788 -18418 2090 22594 45211 74233
11289 74233 69802 40954 57348 78492 75169 50960 5869 14894 29112 20238 34165 48583
11277 48583 70589 56461 24947 -5003 -10377 -7250 -7305 -5585 -13006 -7029 -16451 -6501 10126 24720
11263 24720 18396 27310 12792 1752 -7598 -3462 -14343 -40595 -70930 -56043 -50467 -70287 -79496
11250 -79496 -70705 -49755 -8356 4499 17105 4452 913 2683 -25171 -8872 -18942 -44691
11238 -44691 -30554 6501 -2269 -8540 -34197 -39231 -55690 -56142 -43787 -43680 -35481 -34465 -9219
11225 -9219 -14468 -43186 -31101 -22558 -37504 -21043 -6490 -9394 22361 23236 -11499 -26971 -32751
11212 -32751 -6966 -15573 -42342 -66394 -40044 4448 8169 -9097 -39805 -58000 -37238 -26732
11200 -26732 -15219 -27036 -45945 -27306 -24137 -7758 12883 2243 -4656 -17115 -26478 -900
11188 -900 -12169 -46087 -67195 -33237 -32852 -41944 -29637 -20132 -33738 -33669 -20986 6599 16824
11175 16824 34104 50167 25270 14930 -9209 -28911 -33181 -22030 -13184 7686 26227 36893
11163 36893 45805 6672 4210 17412 36718 21268 6886 -28945 -50970 -3928 -2072 -29917
11151 -29917 -60831 -46641 -28535 -31704 -11852 17775 12044 -5829 -9513 -35384 -58591 -9960
11139 -9960 -4913 -10434 -35406 -19724 20536 32381 5309 1225 15384 5136 -2625 -10377 -45251
11126 -45251 -59709 -49260 -28220 -17948 -7816 -23302 -57012 -39672 -46553 -36016 -12732 -5465
11114 -5465 -39521 -77304 -83039 -85707 -66797 -61612 -52687 -69315 -98635 -103000 -71039 -54655 -22831
11101 -22831 -893 -19518 -32880 -46164 -49181 -57535 -36700 -35390 -26797 -5089 -12977 -43546 -56121
11088 -56121 -7806 -152 -40561 -39341 -16480 -15384 -54039 -54493 -17488 -10994 -25668 -18468 25063
11075 25063 19970 13724 21401 20735 8209 -13059 -34314 -46576 -49291 -29518 -21793 -38526 -28321
11062 -28321 -13869 -2690 -13193 -37712 -43106 -26467 -36090 -56385 -23896 -10130 -29279 -58362
11050 -58362 -71887 -51158 -53178 -60071 -41374 -11769 16935 4825 13822 6353 31686 39606 41017
11037 41017 22005 -3603 -38764 -40749 -27890 -6131 -12425 -24847 -19373 -15485 2725 -24059
11025 -24059 -4805 11764 -3243 -14601 -19624 -39843 -54150 -24493 -16446 17200 23777 61783
11013 61783 38567 -14490 -37149 -36544 -25894 -51182 -22352 -26116 -19180 -22471 -34741 -12527 -7380
11000 -7380 -29190 -24334 2752 -7688 7875 16261 20921 25370 20105 29292 -274 -103 10741
10987 10741 2962 33567 45674 23535 224 -2496 1370 30198 33979 30136 -4312 -29803 -15598
10974 -15598 -4906 -393 -17997 -14851 -14714 -18640 -27970 -22586 -14590 -5305 -19915 -27099 -37276 -33805
10960 -33805 -39527 -46936 -84392 -75707 -33625 -30873 -60904 -59853 -36531 -3314 9394 4278 1685
10947 1685 677 15167 5682 4980 15676 37581 43220 28696 13879 10150 2580 577 -25836
10934 -25836 5512 20266 3959 -32228 -24433 -10214 -12369 -28515 -31682 -13629 -8049 5695
10922 5695 2611 -8017 -19636 -23321 -30423 -2772 9518 15944 -1422 -2936 -16741 -12973 -9148
10909 -9148 -15963 -15019 -16704 -14723 -24533 -13290 -10350 28915 18761 -3684 -10785 2028 6782 37718
10895 37718 47940 36930 31515 21707 8447 5656 -9781 -26243 -29220 -50380 -37699 -9285
10883 -9285 20914 23864 10322 21490 10896 4925 -5824 866 11086 -12661 -15211 -2651 4873
10870 4873 -460 -10000 -33637 -58457 -63859 -68545 -65215 -44772 -46318 -55415 -34270 -11685 3311
10857 3311 13245 -339 6922 13692 17094 1224 3465 -26668 -7203 17886 -6366 -3526 -19596
10844 -19596 -28902 8255 17236 9651 16930 16672 48622 60737 68258 75897 42819 -6516 -48094
10831 -48094 -16365 4461 -3898 -2906 15405 8762 -25690 -26981 12575 10988 33144 51004 38566
10818 38566 20846 -4115 -45800 -52776 -25519 -17945 -31947 -45824 -65678 -85904 -61334 -20294
10806 -20294 -18772 -41023 -33670 1236 45695 36565 10257 16300 -7541 -22514 -36946 -26837
10794 -26837 -16433 -23904 -32532 -44264 -35080 -47897 -73396 -47057 -50044 -55014 -23140 -3324 -1319
10781 -1319 -27179 -22978 2434 21165 13986 3005 -19957 4508 -8758 -16464 -23062 -43961 -42766
10768 -42766 -17039 -20021 -22091 -19338 -41914 -59688 -17657 1955 -2030 14704 10943 46463 35808
10755 35808 -4087 4683 12793 4711 -1451 9551 11126 6492 6997 -9887 -15183 -16635 -7033 -10273
10741 -10273 -21945 -33340 -8497 6846 30972 23209 29719 7926 -5734 -2491 15452 71154
10729 71154 104610 109506 74230 16633 -19888 -29295 -8726 -10885 3506 1362 -25111 -35912
10717 -35912 -41380 -57942 -55970 -40109 -32275 -54105 -36093 -25326 -30909 -41215 -63050 -40846
10705 -40846 -9081 -1126 -1214 -13087 16458 55208 43503 15279 2747 -18075 -10253 58 -3298
10692 -3298 -6623 -33350 -40730 -24290 5259 15273 2916 -4197 -3764 -52444 -83236 -80333 -71350
10679 -71350 -95001 -111343 -105021 -77189 -50377 -22707 -2228 -9185 -21479 -37165 -6699 28170
10667 28170 -11432 -41223 -45591 -11001 24948 61984 41544 29975 -487 -12450 -32047 -46370
10655 -46370 -56403 -20690 -9570 -22658 -13089 -5810 -11271 -5358 3647 -2692 5038 29777 10221
10642 10221 -22977 -70 34704 24499 10359 -22333 -54578 -67251 -59799 -27355 -13349 -8736
10630 -8736 -8798 -16325 -31628 -28688 -14802 4759 -3463 -37081 -90454 -54682 -36282 -27384 -11637
10617 -11637 -4439 16945 38761 44741 1868 -15134 -16861 -27556 -32462 -8597 13768 18382 -30591
10604 -30591 -44429 -39982 -28186 -39274 -15248 19790 -16183 -18880 -2003 -169 14718 28579
10592 28579 35606 5046 -19529 -2213 -18350 -2017 9787 -41880 -43004 -31550 1946 13549
10580 13549 -3183 -25236 -9169 1151 22252 16726 -672 -13349 -21463 -1546 11798 8212
10568 8212 9390 22408 38990 54364 11266 -25209 -39574 -26111 -10823 -17622 -38358 -40699
10556 -40699 -20264 -38465 -58349 -61338 -14547 3428 24682 19227 -12800 -27704 -40587 -26453
10544 -26453 -46499 -75617 -35210 -10739 649 2928 -28166 -42845 -61912 -76417 -56980 -21207
10532 -21207 -19455 -23988 -10423 -1979 3307 14536 32792 17060 -7875 -11124 -6520 -1304 2076
10519 2076 172 3698 9375 18346 32199 48779 48069 53649 41880 -6646 -11011 -17213 24012 24744
10505 24744 31118 34682 8844 -40640 -39171 -22817 -1081 245 -15872 6964 19376 20576 14910
10492 14910 12585 18171 12272 17697 -729 -45955 -22163 -18822 -29298 -15701 -2031 -34806 -36622
10479 -36622 -34291 -18353 -11244 -25081 -15637 -19978 -29122 -32392 -25391 -12586 -54073 -54421 -45990 -16479
10465 -16479 -18055 -34899 -37580 -59226 -52679 -6841 24605 -5619 -9995 645 -17070 -16808 -15571
10452 -15571 20863 6411 -6097 13495 7691 4972 12150 3268 10520 -16148 -32369 -39390 -61427
10439 -61427 -38243 -20552 -21521 -13764 -31255 -24554 -24661 -22727 -30355 -31881 -5127 -4037 -13345 -4338
10425 -4338 9342 11262 -2454 -599 5193 10909 4184 4901 3081 -5053 -7124 5491 -8145 -33909
10411 -33909 -64535 -86499 -50520 -51438 -64760 -55555 -27956 -36608 -41678 -30167 -24181 -24064 -27508
10398 -27508 -14075 24122 39332 20740 19309 15525 20996 9006 -12531 3921 27540 17390
10386 17390 17130 19735 33574 23454 -15707 -31227 -87790 -96346 -48237 -9874 -29523 -28016 -24631
10373 -24631 -21861 -33492 -38877 -56198 -26620 -14889 -44097 -49895 -40208 -50539 -55529 -62854 -31880
10360 -31880 -3207 -48211 -56878 -48803 -40999 -46818 -55469 -49182 -33437 -7824 3676 -5705 4478
10347 4478 24955 477 -4969 -34132 -30728 -11283 26788 21730 48123 36522 34654 40184 27801
10334 27801 40036 66046 51973 24561 -2299 -24213 -26220 -5931 18168 3836 -17786 -7888
10322 -7888 -1947 20353 9938 5290 -14606 -22965 -255 16709 18947 35490 45085 -4245 -34490
10309 -34490 -45708 -59718 -46660 -21216 -7392 1010 9134 16111 8554 -16907 -50421 -55926 -18765
10296 -18765 6375 8591 5594 5439 -988 -25347 -12764 -17280 -15535 1975 631 -26589 -22663
10283 -22663 -12182 -33635 -30922 15102 46964 34052 26315 36353 33699 20499 -2333 -17628
10271 -17628 -2507 -8240 -13785 -17541 -5590 -1094 -12872 -27370 -7373 58893 69013 47993
10259 47993 43612 54460 41480 42677 65702 46720 46314 49927 4394 14073 53935 45215 31661
10246 31661 20030 9361 -20444 -49751 -29687 11993 46576 48085 3021 -771 -4688 11815
10234 11815 35003 55335 40310 13729 16686 39379 22561 8104 5738 -11817 -25125 -17672
10222 -17672 -21760 -32746 -49488 -64694 -79056 -56929 -24807 -11555 -5838 -3383 8094 -18446
10210 -18446 -13174 20398 3357 24021 21557 14012 36805 29532 23716 9414 14660 10044 -10563
10197 -10563 -24244 -9216 6173 9474 23251 21702 12790 14708 14937 7278 -30827 -28674 -32319
10184 -32319 -26524 -18548 -6106 -4059 6666 22393 18945 -13858 -20236 -8720 6675 16560 5761
10171 5761 12141 12095 3432 -5632 -10424 -31904 -49496 -35820 -726 23810 40284 52803 40142
10158 40142 28227 11116 23728 35214 27792 63445 65073 8821 -30988 -1014 42392 33857
10146 33857 41554 43499 20523 -6393 -39372 -51004 -55773 -36829 -30924 13577 39189 23087
10134 23087 16619 26448 16571 14696 8461 21837 37574 29183 7933 15304 26034 23229 -1561
10121 -1561 3741 31521 33976 7473 -23231 -19357 -5831 -8877 23139 30223 22525 16728 21394
10108 21394 23400 6839 11946 1627 -5050 27692 26849 19802 38481 25669 29008 28576 19938 -24124
10094 -24124 -33364 -18831 -4351 27449 14688 12538 44123 68995 36850 3560 27093 10640
10082 10640 -24244 -58957 -47704 -12445 1312 2194 13891 12747 -3427 8706 16201 -28313
10070 -28313 -30296 929 13526 26202 44544 44201 51051 69207 47984 53556 43954 -8574 -32019
10057 -32019 -29391 -11467 3820 10961 -15691 -47158 9495 48786 42358 21892 29372 40707
10045 40707 29189 26634 40390 82241 74325 68668 83694 100502 117796 124036 169472 266907
10033 266907 339056 471222 708745 1071463 1526791 1784173 1675713 1469694 1137068 766648
10023 766648 533343 354169 267092 208660 149804 117676 125280 132873 115784 72478 59620
10012 59620 69043 90710 61388 83408 68910 55026 47486 37370 16876 -31601 -53065 -63052
10000 -63052 -29113 -4814 16923 18236 26769 17277 4196 15045 29487 35339 47524 49770 30747
9987 30747 -2523 -23545 -14552 -7894 -26103 -14808 10063 11454 -35950 -51567 -11853 6335
9975 6335 -6006 9974 24554 7012 12540 -2993 -14477 -16100 2187 30263 33251 26444 44057
9962 44057 56313 33329 27746 32474 37301 42637 31202 31591 28933 26159 45497 40958 21379 -2710
9948 -2710 -22056 -37258 -38674 9401 39212 19870 21262 19568 -8716 -19594 -23006 -39551 -58862
9935 -58862 -26232 -5137 -4506 -1809 15605 33457 31220 20615 40967 2277 -28694 -4527 -5576
9922 -5576 -31780 -26291 -19792 -25168 -50869 -34919 -22870 -960 -15557 2106 29835 82627 98785
9909 98785 65539 57103 39419 27663 28096 15015 1256 -9740 14868 50421 66490 47026
9897 47026 53836 39898 23568 31675 40976 43286 52461 33870 27636 26677 40694 49815 28264 45448
9883 45448 35148 41818 34536 27811 20309 33859 38452 7471 11548 3921 -31623 -2250 52424
9870 52424 79581 89295 50765 35054 47218 46469 6174 10483 26898 19070 273 25134 70915
9857 70915 59625 49301 20281 26508 36665 34850 43755 72707 89138 88198 95363 96043 84058
9844 84058 103114 137169 197365 242413 280035 296846 311762 379769 497137 618670 804231
9833 804231 1095870 1510725 1994599 2514772 2817646 2724587 2392847 1928479 1464291 1091763
9823 1091763 842807 656100 529938 443374 384971 329132 287605 243154 202911 176429 175174
9812 175174 155088 137671 137383 152044 139771 114906 121739 58461 35116 56747 75679 102580
9800 102580 128543 123843 125666 150331 131536 89415 77193 91846 109556 123282 98677 83487
9788 83487 62217 39425 45323 65257 69680 84292 81460 50924 17548 -8216 -15989 -19466 -12591
9775 -12591 -2998 -3423 18333 6497 -10726 -5528 -5301 5174 35675 25251 7598 -2124 -10751
9762 -10751 -26509 -12440 -26164 -31411 -6673 34101 37763 36055 41399 42312 30081 20295 -6
9749 -6 9889 34322 27906 16595 -15279 -18833 22740 43893 46930 16221 22317 11982 -7384 -29279
9735 -29279 -42792 -21104 5990 -2437 -2203 9748 15152 31043 34170 26212 22794 26849 15370
9722 15370 20431 4630 33536 47861 30081 17053 24378 11266 1079 18116 38527 14918
9710 14918 5888 28359 37848 48265 59018 45045 56392 63638 50541 59086 51454 31054 26176
9697 26176 37781 63551 94578 100199 74520 93324 79507 65323 59621 60510 43183 30355 31603
9684 31603 62765 70932 66660 59168 39821 32245 60394 68124 23815 -18124 -25459 -9397 18617
9671 18617 66559 82459 86189 92162 73736 90688 100660 73102 23436 37127 72629 74685 47038
9658 47038 50519 78636 93805 85130 56535 62561 62777 64119 64491 47944 26889 -3728 29702
9645 29702 44201 53726 28784 58432 64395 43390 54109 63013 99875 99221 111297 127509 125901
9632 125901 122259 146697 153228 123513 121904 138442 136597 117097 148172 156436 138487 147106 154748
9619 154748 161516 152232 146032 146285 139091 133094 135199 139885 138904 102376 90492 91574 109543 152225
9605 152225 186654 212594 199856 190117 202529 194561 195375 226280 224182 206996 231098 237295 240068
9592 240068 254361 262452 272603 281196 276298 256198 259489 258784 294768 334573 366083 369784 351402
9579 351402 350909 340113 314106 307506 339679 350359 362199 392663 430909 437509 446518 456146 478731
9566 478731 529583 564867 577430 597848 616080 641930 627762 642141 678893 686604 677759 674614
9554 674614 684170 703158 735232 743664 721563 721486 758896 778475 783757 787917 796041 796384 808531 834674
9540 834674 829079 827150 852956 850946 852358 858025 843378 807382 799325 780956 763040 741081 734028
9527 734028 723346 687508 657518 654877 648989 622010 613088 607697 600645 600711 557070 534891 519740
9514 519740 534798 531703 525030 505855 448796 407257 378560 381691 387080 372255 355372 343498
9502 343498 328249 351194 353858 300475 270622 219025 189730 208341 224804 240605 258405 251843
9490 251843 261787 245254 219968 198669 196423 190763 188451 194568 193536 213451 180968 186733 206899
9477 206899 206568 186902 183257 199062 206733 190193 173947 173724 172747 165143 147975 131765 122570 136687
9463 136687 116419 94250 77961 78323 77504 71352 46705 68051 95133 100142 97702 135502 137029
9450 137029 138124 135251 94595 61677 75080 71210 68797 99218 106160 79678 41820 70653 65427
9437 65427 39621 66974 58570 64567 66284 48727 42278 72354 80886 93947 66946 44031 67081
9424 67081 57997 47472 35050 12942 23673 29820 50069 58708 42053 50240 53374 72035 72342
9411 72342 67977 60452 90583 101775 71680 79629 103080 84364 88991 68846 43496 46909 41769
9398 41769 20781 40491 32819 28973 33450 35925 48533 29749 21989 13572 34727 56142 22954
9385 22954 -4408 3965 27576 26775 17735 -28211 -8062 -1651 7435 14739 27165 45002 46512
9372 46512 56918 67772 64376 45234 17141 31503 34329 31076 33199 19094 9073 18564 54332
9359 54332 47739 34254 56592 79538 68188 45528 34758 58752 53086 22050 31490 53052
9347 53052 50311 39288 19923 8992 9584 22383 35638 49289 69618 51700 19259 36423
9335 36423 29456 19934 30002 37234 15408 18081 50138 46396 -6441 -26442 -16777 -5531 -3693
9322 -3693 20081 46641 45263 37432 38390 36802 6873 -24056 -33881 9996 19543 22254 30939 60481
9308 60481 73877 79826 57170 54592 46705 39057 16547 19386 43912 45497 19656 -27281 -37501
9295 -37501 -31930 -20855 -29060 -15677 3510 20685 4430 -16680 -27909 -19633 -18039 -18501 -7616
9282 -7616 -10451 14804 17771 22958 13627 1073 -13233 -9947 2238 11891 -8321 -32159 -13712
9269 -13712 -13643 -33398 -29562 -9850 -18403 6205 20407 6889 -6544 -13204 -6107 49874 72344
9256 72344 46543 78634 80177 52105 43074 27429 16193 17436 24244 38592 47947 34350 31906
9243 31906 34945 20567 -1228 -12845 52124 75013 46996 36173 10812 5876 1503 -1618 -28474
9230 -28474 -30882 -31393 -20097 3152 18938 8206 -21411 -14193 1586 30124 34343 74 24375
9217 24375 23818 24120 15486 17060 35169 36269 2819 -7730 -33489 -29393 -12886 -31697 -19289
9204 -19289 -16690 14841 -4976 -22382 -25080 -13538 11052 23489 8627 15629 17561 39250 32950
9191 32950 32353 36629 -1941 -1282 15174 18611 23384 42907 48367 14242 3724 17347 57484
9178 57484 37210 3898 16352 25800 17391 29639 40180 64556 64126 23521 15831 39314 45421
9165 45421 35734 35765 52557 17865 -5925 30743 60405 72850 56540 55942 44249 33692 10929
9152 10929 9608 -4650 37960 60860 26097 14245 30383 33327 13798 -2253 -3327 18053
9140 18053 10054 26197 45424 50593 43001 28427 -3890 -24380 1737 20629 23842 7680 -39651
9127 -39651 -63030 -51183 -481 34718 5072 -16845 -28081 -39944 -16708 6746 -5394 3100
9115 3100 35648 50656 29331 14439 15162 19526 1324 -15221 -14191 -14019 -32443 -27929 -41118
9102 -41118 -23548 -6096 2588 8173 -2842 -16596 -3597 12208 9924 15626 6608 4926 12406
9089 12406 35346 52708 42828 46894 43582 45053 16377 -7703 -6739 -14695 -23685 -23504 -26859 -9279
9075 -9279 -2734 -24484 -62925 -46254 8522 -4979 -21485 3519 42669 45949 34501 19312
9063 19312 -21278 -43196 -28097 -15237 -5724 7971 11156 -4718 -22825 -26379 -8366 28687
9051 28687 44514 30657 33949 26716 -30055 -45831 -45376 -29814 -28799 -25353 -9654 35159 21539
9038 21539 16027 20838 -23930 -9962 563 45913 70090 40689 12096 -18548 -1 -11899
9026 -11899 -42658 -55602 -33436 -44030 -52296 -39974 -46961 -33355 -2523 -8251 -28340 -23458 -36546
9013 -36546 -61105 -45267 -42444 -41135 -37477 -4673 -27021 -24080 -5908 -3976 -22114 -47665 -16618
9000 -16618 -7341 -5321 -14001 -10357 -33579 -39988 -26882 -30756 -36110 -50770 -48624 -38352 -21988
8987 -21988 21269 22569 32478 51340 28889 -8959 -18125 3969 14997 23943 21138 17726 13231
8974 13231 19643 27392 33550 28097 23748 29703 -2661 -1718 16340 30532 24951 29900 6929 13727
8960 13727 34203 13796 12784 7182 -24405 11012 26697 31071 16523 -3712 -25762 -42516
8948 -42516 -25463 2095 1845 12647 4562 -27201 -28652 8787 20539 29457 38197 -11382 -59009
8935 -59009 -42069 -35242 -32014 -16642 -7530 -5632 -14443 -25638 -27904 -44246 -23457 14057 19922
8922 19922 13638 43038 38942 37617 19364 29017 23019 20708 50554 58142 15141 -6991 -32826
8909 -32826 -46347 -10820 20821 17405 13125 3416 471 6324 -15134 -21370 -34269 -27618 -14443
8896 -14443 -19658 -33675 -44436 -30538 1650 18769 11080 -32 -5427 -4755 -7694 10072 13545
8883 13545 9628 -857 -19079 1155 32689 58646 31545 13727 1823 -8734 -10241 -22933
8871 -22933 -35621 -16411 -11216 2170 -23830 -17003 -21266 -34569 -28344 -14542 -9583 -17344 -26079
8858 -26079 -19646 3341 10366 2415 -13495 -17812 -12496 -36207 -35177 -9774 6260 21943 19830
8845 19830 2839 -2045 3319 -11379 -37238 -58056 -54575 -23415 -37526 -43664 -10740 23075 25327
8832 25327 2840 2833 19501 35399 20667 17128 34223 9958 -30090 -42536 -16114 -7386 -36648
8819 -36648 -57976 -53050 -4742 -14966 -22149 -18616 -10961 -12417 -2281 1334 -16179 -16877 -12991 -2392
8805 -2392 27552 21669 28753 26999 50796 37295 32150 15909 26050 26156 16614 -5982 17096
8792 17096 13907 19561 38150 35946 39041 28785 40800 55332 78298 53402 35334 36369 20559
8779 20559 -27088 -22936 19591 48091 45062 55831 46412 70738 51205 66961 54809 38116
8767 38116 20567 22148 21286 31186 12887 13851 4920 9092 -3941 25936 19942 8214 26370 40159
8753 40159 10372 31378 13634 16746 11472 25230 -1720 5007 24154 5895 -15114 -10809 -22819
8740 -22819 -7122 -9386 2714 37122 46718 68799 70601 83633 55423 62966 59639 33637 1202
8727 1202 13915 23969 26243 25747 32964 72172 70493 50161 6320 60 42024 53950 80432
8714 80432 89434 78178 94962 106368 92015 63026 28553 -7057 -34335 -23747 2941 17748
8702 17748 32143 30145 44559 54600 1406 -1557 20295 21473 46801 57102 61471 78249 103481
8689 103481 115842 94126 62705 50264 58201 54611 61718 63457 72656 77587 79236 107051 105167
8676 105167 124147 126342 117944 113368 78467 72354 73137 57861 54155 50975 45230 64626 76261
8663 76261 79287 85888 89286 92822 64706 57841 91557 116930 88357 74118 81295 102751 79552
8650 79552 70791 61137 69332 72844 104020 93540 80089 64375 57938 53317 63659 63241 109338
8637 109338 145637 149526 125943 138217 156330 165045 196409 264609 391088 539935 621167 576768
8625 576768 500650 456181 360809 266454 220035 186963 147957 153438 164372 126759 66818 44130
8613 44130 72356 106630 99129 117584 112250 98814 113974 99760 66274 52377 50826 48684 92168
8600 92168 104743 109666 117682 152508 174193 205632 219161 207302 209066 235144 240033 272607 313891
8587 313891 378221 459029 597671 838761 1190732 1453929 1470299 1367527 1230844 1049983
8577 1049983 920800 776555 639201 564641 540796 506567 494291 448998 400150 351950 334920
8566 334920 310311 267473 245199 219176 155509 104938 110477 138558 157359 142389 130187 107088
8554 107088 64740 1535 2382 27553 82449 112850 129925 174328 166797 137447 111512 103763
8542 103763 117669 185071 267657 347522 481511 613591 683191 656455 562320 436572 323144
8531 323144 229453 169133 147733 117980 89694 65674 90583 77160 64443 78208 70766 60263
8519 60263 78197 78741 55311 59543 53734 59952 51123 83811 92326 67506 44593 26425 52730
8506 52730 81756 95155 58067 9673 -1736 -7965 -27566 -18559 20798 56850 42950 -50
8494 -50 2346 -33 -3177 -788 -4513 8284 -2764 2525 19081 3099 21819 18041 59528 40485
8480 40485 -2619 -15903 2847 18869 21691 31477 44988 36070 40077 55780 19982 14770 14510
8467 14510 -8779 -30234 -15783 -27194 -22739 -15500 -27818 2801 19758 -3579 -1347 41759
8455 41759 41562 29805 22981 7963 9507 4956 -10776 9839 63831 50240 21776 -6923 -8019
8442 -8019 12846 31659 45027 40510 44530 32638 59018 74516 42472 31879 20898 -8266
8430 -8266 1001 9739 1836 1794 37144 68533 57876 70266 27574 -17433 6571 25050 25152 20010
8416 20010 24857 43334 41173 52601 34477 35644 31739 19002 33946 23488 16624 6389 23140
8403 23140 40866 25277 7816 7939 17074 35370 33901 11710 -15266 -34230 -11457 -9225 10956
8390 10956 32785 40506 47249 24006 22332 17701 32484 45590 42225 -2587 -12722 5516 27530
8377 27530 30907 22186 8206 -15073 -6557 -16083 -35649 -66358 -63986 -13677 256 -12663 -3864
8364 -3864 -3864 -860 -8149 1997 15921 9975 34652 18150 -2808 37450 81670 73843 42280 23298
8350 23298 26931 45699 43833 10733 -6572 30673 15415 -7685 49875 69047 18197 21309
8338 21309 33208 45432 37916 28310 14719 41196 49781 59615 63784 58357 53292 53967 49694 58446
8324 58446 42714 34882 9772 29806 62189 58094 51949 23820 -11168 -10219 38511 34814 27991
8311 27991 18925 -4675 -17609 245 20299 22375 43581 52460 53698 61314 42701 10446 -12718
8298 -12718 -24167 -25306 -2870 2906 15244 35970 31202 2324 15226 5885 6867 -10486 11610
8285 11610 48003 53758 61829 24560 -24067 -1432 -7980 -16331 -17444 6661 5393 -21002 -13214
8272 -13214 -27019 -29873 -23544 -19802 -10599 -9993 -45015 -41542 -16105 -18267 -29281 -21066 -27471 -16859
8258 -16859 -18335 -18700 -1791 32435 33435 52480 53459 82286 66574 29444 19324 22894 47215
8245 47215 54221 17909 -6634 -20042 -56920 -71609 -69409 -73916 -97429 -80790 -27836 15969
8233 15969 -2257 -36781 -22749 13830 7772 22764 60910 50510 22867 1472 5612 11672
8221 11672 12196 -44423 -75198 -59921 -27948 -21661 -32051 366 1594 23188 33069 15147 1251
8208 1251 -2286 17819 18266 8448 5749 54034 50243 4357 1675 -949 -11937 -33541 -34770 -25471
8194 -25471 6486 6793 -27240 -49653 -61238 -58351 -41836 -21287 -26600 -30111 -40343 -42534 -36505
8181 -36505 -11603 149 334 11651 13241 -3192 -11159 -30313 -42605 -6592 -2469 -27240 -18015
8168 -18015 -19164 -23910 -26187 -33367 -17816 6959 -2042 -4616 -33543 -42056 -23444 25071 12146
8155 12146 -6360 -4013 9540 43438 47447 55001 41630 45080 80263 79255 48405 19561 23652
8142 23652 11255 2274 -7900 3170 1680 5247 42363 57418 60556 32005 24107 5075 -14800
8129 -14800 7176 6727 -16699 10320 27560 4383 -37324 -27470 -1258 14317 9953 9535 22845
8116 22845 42476 24675 10535 -14425 -40266 -17058 19475 6465 21153 10865 -4300 -18054
8104 -18054 9451 36561 37019 1929 4526 10686 20246 28058 33119 42173 53622 43878 35015 38132
8090 38132 36218 38436 25442 25879 27884 -2292 1574 35679 44881 38598 45139 60175 64841 42302
8076 42302 46253 77394 74560 59864 68981 57469 53510 79646 83905 57932 35408 21946 4328
8063 4328 -10151 33332 17910 16856 22905 36508 44334 27209 42760 61520 65445 59328 75296
8050 75296 90981 105411 96462 100463 107638 92041 80024 80317 117107 164288 138237 141672 110186
8037 110186 52988 39024 71047 76600 103701 107097 105980 56063 45525 71705 82409 73462
8025 73462 81999 86853 114331 99798 96652 99492 62339 25619 47305 58036 75656 88303 73269
8012 73269 74502 58758 43701 64276 67720 55335 63387 48874 57374 69640 73985 74615 76288
7999 76288 90811 92712 92730 90728 98700 107627 124414 112505 133184 147510 131590 135899 103042
7986 103042 87687 69687 44749 58720 100713 109867 124202 140259 151229 150626 102655 89521
7974 89521 111175 110016 87930 78367 92918 79401 43485 37739 30591 17901 37199 42870 30456
7961 30456 5509 25737 46929 44262 40319 63438 37792 26951 37796 47675 49300 41353 44939
7948 44939 37787 28063 49618 73322 55596 33062 48296 77236 58399 30397 26764 30858 60511
7935 60511 75727 102679 108524 95827 62974 59169 65093 68132 65217 50564 43174 21130 6402
7922 6402 15643 -10475 -16660 4561 17934 12987 58807 96817 118251 104314 86482 65459 35058
7909 35058 43057 43633 89621 94731 56236 60525 48981 11483 -16957 5378 28924 -7343 -22777
7896 -22777 -7522 -20116 -12961 -17101 -34316 -5541 235 -4309 -13196 -6466 14559 4713 15224
7883 15224 29341 11235 23816 39755 49818 37044 34799 18012 -21097 -14979 -7471 12989
7871 12989 25908 34204 36089 21705 43715 19545 2739 4660 18039 13631 8859 -2052 -6448
7858 -6448 -14648 2383 -17385 -19271 -10526 -976 -9780 -10712 -25645 -16061 16923 28490 16910 3811
7844 3811 10724 20947 -13690 -1159 -3157 8836 23077 17791 33402 27943 25469 3634 -14639
7831 -14639 -2303 10173 16024 23482 14162 19647 6951 -24661 -13962 -23275 -19043 -11307 -9281
7818 -9281 -21642 -21481 5927 30689 34181 33135 29283 11082 11003 21042 23645 11142 -9630 -13434
7804 -13434 19348 35178 40667 22552 4937 8836 24583 42156 29700 31101 18143 16268 -13072
7791 -13072 -28561 -17255 -2459 -34548 -29333 -13970 -24709 -32084 -26549 -550 10116 12931 2983
7778 2983 -62143 -90317 -80169 -76037 -71255 -75934 -67829 -52996 -816 19450 -7241 -25888 -9075
7765 -9075 20224 1096 -28131 -21045 -5406 597 -35031 -18842 -12772 -16254 -11018 -24114 -52273
7752 -52273 -49300 -36900 -68722 -79564 -48153 -41278 -69107 -48924 -34243 -28172 -19221 2542 30289
7739 30289 37371 18100 -2097 11749 15522 -9272 -8536 -6657 6872 4880 5785 20687 32598
7726 32598 9848 -12511 -42889 -7687 38126 33604 396 692 13216 21112 10863 -7224 -22236
7713 -22236 -14512 -11280 -21700 -11859 5240 16461 8358 25477 18533 1887 10968 32718 26095
7700 26095 36554 48665 44657 6857 -31711 -24699 -21476 471 -2479 -27662 -38745 -29610 -7455
7687 -7455 -495 -20057 -20394 -571 3583 -14574 -20767 4760 5392 -507 1440 3254 13134 14026 38036
7672 38036 61131 46408 32842 11296 21234 19302 21364 27184 13671 11261 -11242 -5636 15745
7659 15745 917 8149 17152 16768 17362 12112 24319 23004 19643 10845 17772 10148 -7827 -33881
7645 -33881 -29345 -9354 21078 22994 42851 24253 8514 14153 31471 16786 22323 45541 35867
7632 35867 24652 11136 -10893 15776 47098 36029 14912 -2443 10799 26697 3162 -7496
7620 -7496 22638 10540 21006 34208 24420 1210 -5054 -14546 -27412 -50569 -38662 -26645 -30409
7607 -30409 -34247 -17161 33343 53306 -542 -25546 -19813 -35693 -33226 -18477 -20833 97 20315
7594 20315 9586 -9160 5167 6269 -525 20528 5799 -7266 -31719 -39792 -37627 -4298 1406
7581 1406 23383 15132 5062 5229 -1556 11192 39493 55579 65542 52175 17410 14018 7116
7568 7116 -5333 363 3181 21069 8000 -4049 -10444 12161 10762 5551 11277 2869 -1049 26778
7554 26778 18173 -12504 -21553 -16135 -6036 -7760 -15617 -14882 -9819 -17118 -43349 -42034 -23148 -13515
7540 -13515 -27021 -36217 -28656 -2167 -5725 -6686 -95 -8483 -16054 -34536 -40370 -26974 8656 24463
7526 24463 24300 -2666 -22002 -11853 878 20747 4196 -9096 -25860 -1179 4490 -10769
7514 -10769 -30725 -26909 -11391 -28360 -6075 3917 -11362 -29716 -41620 -34937 -9322 27770
7502 27770 26633 16593 2482 -4559 -25109 -54486 -60157 -56272 -36988 -24749 -18124 10863 11118
7489 11118 6172 -15514 -40381 -14476 -492 -37409 -30794 -25083 -7039 -19460 -31373 -7305
7477 -7305 -7167 8699 -16144 -60787 -77705 -83442 -56205 -50447 -42668 -14492 -7867 -29966 -56265
7464 -56265 -53706 -54004 -19517 205 -6036 -9853 -16870 -36139 -57701 -68210 -49367 -29990 -48300
7451 -48300 -26130 -23959 -61965 -45701 -24451 -30149 -49470 -61798 -26412 -41527 -35162 -49993
7439 -49993 -49451 -44323 -17953 13026 10070 -6266 -11642 -22133 -35967 -31328 -47553 -81968 -76131
7426 -76131 -57479 -28638 5489 19500 45084 36996 -4472 -32750 -45537 -29847 -13784 -770
7414 -770 217 -23559 2180 24548 -12507 -19572 1077 11454 -3896 -4230 -442 -5493 -17609 -28218
7400 -28218 -34377 -9476 -25621 -37488 -15045 -7028 -17692 -13241 -2022 22673 30142 32830 36586
7387 36586 35139 37553 18671 -14504 -48921 -36178 -45924 -61515 -68309 -33931 -2174 11319 -8328
7374 -8328 -38506 -44657 -35949 -29036 1490 6545 -2145 14173 42753 22256 14200 14086 8198 31638
7360 31638 47583 78016 78400 52995 51504 30603 -9666 -34985 -45366 -23128 6938 36123
7348 36123 57540 26556 15442 4641 16025 32727 -4171 -3746 -21120 -49261 -52955 -43430 -6546
7335 -6546 -9849 7423 16202 12775 9953 18500 11588 26203 6234 -6141 -16976 -33687 -20638
7322 -20638 -33963 -50441 -42410 -38690 -49947 -25840 -23231 -18361 18246 32934 20344 26156 15940
7309 15940 -14706 -21891 -41867 -28601 -13676 -19028 12374 37469 43927 54939 54472 55615 30751
7296 30751 27014 24658 43538 51119 29491 36014 25458 -8976 -21490 -11380 -7375 -6060 -25161
7283 -25161 -34342 -55530 -57858 -47565 -47735 -56890 -52232 -40475 -29652 -41970 -34265 -30785 -42254
7270 -42254 -23967 -12837 -33695 -37860 -34084 -27859 -20074 -43221 -45457 -26712 -12087 -2569 7278
7257 7278 -4206 -8715 -20118 -23745 16219 39704 41468 17174 -14140 -3431 -11115 -14169 14
7244 14 14804 29711 18903 3350 -3514 -6561 -16403 -419 -26630 -30460 -29776 -38909 -36870 -7563
7230 -7563 -34932 -46864 -33779 -46026 -44716 -48433 -50424 -48207 -38501 -25655 -9291 4908 6001
7217 6001 9851 15529 36066 18710 662 -7226 8425 14605 2759 17879 24957 11370 7527
7204 7527 3507 19414 24693 21166 14920 -13936 1793 15519 3649 -9444 4601 -12443 -7726
7191 -7726 -7615 -34956 -26723 10764 -1179 -14805 13451 3210 -6093 -14206 -5414 -28649 -29219 -7247
7177 -7247 -7136 -22821 -8323 5907 -19318 -36789 -16551 446 9979 6096 23294 8874 -11370
7164 -11370 -4555 -17946 -11948 -13431 -10969 4130 17397 -21240 -25565 -8638 -11201 -984 -12524
7151 -12524 -56847 -88960 -76552 -48479 -34880 -25897 -15294 31411 32804 -1519 -21147 -9931
7139 -9931 -1838 -20480 -27054 -19536 -24952 -14282 -18279 -27260 -36594 -29240 -19449 -1848 -1809 -22156
7125 -22156 -36109 -27671 -28302 -12125 21026 32661 31868 15530 14501 32018 29838 25718 19799 -30300
7111 -30300 -24312 24389 24716 9335 22781 8 -16090 11275 25794 14380 4859 -6392 13842
7098 13842 32986 62514 30576 16717 41590 59959 55277 41607 26491 36736 47111 48120
7086 48120 62560 53244 25864 35154 53626 86916 125886 121535 109967 113033 119482 154042 156697
7073 156697 124444 85787 102666 88001 64666 56452 28131 -3561 -17011 -32083 -38462 -39342
7061 -39342 -52389 -58183 -46957 -42381 -42560 -33968 -29138 -10370 8690 -383 -46519 -78145 -40276
7048 -40276 16789 -22812 -28450 14866 6451 9057 -10748 -17159 10745 -29 -21847 -17737 -1253
7035 -1253 2805 -15176 -38141 -23832 -30374 -60891 -49492 -37052 -27924 -1747 2554 2310 10414
7022 10414 -10990 -54325 -33470 9677 24434 19507 -9415 -13621 -13767 -16651 -28812 -27782 6794
7009 6794 20280 2648 -2212 1442 -5483 -25200 1585 5409 -1025 4440 10283 21881 45391
6996 45391 48869 7040 -23592 -43163 -43802 -55014 -57730 -33140 -23956 -11028 11981 58373 40780
6983 40780 20076 12941 3794 659 -26230 -45206 -53021 -37392 -22074 -9303 -9552 -33994 -54775
6970 -54775 -43030 2755 17898 22670 2411 -16709 -7886 -6446 42282 46886 41422 40943 16033
6957 16033 -12776 -3201 2805 -7011 -4204 -5175 490 29089 26854 1826 -3800 -16938 -24726 -36070
6943 -36070 -35512 -36615 -8629 3443 -2415 14451 20012 40183 38613 25054 -4312 4662 16705
6930 16705 11174 1758 -7371 -20883 -10311 -8352 5375 -2109 29313 16097 9087 10146 23451
6917 23451 37618 27346 24884 19629 -3428 -19905 -62820 -70832 -66172 -63285 -39346 -26111 -27912
6904 -27912 -945 1086 19342 37006 -13351 -48196 -51635 -58712 -48684 -38277 -10782 14630
6892 14630 15393 14445 2827 -1821 -196 15245 48664 49317 23150 -15274 -13732 -29960 -33076 -16281
6878 -16281 5705 26811 48355 43738 30667 663 -21900 -45729 -25359 5591 -24158 -42702
6866 -42702 -14195 9090 31450 41218 -1467 -26687 -42892 -27745 -23952 1445 25453 32529
6854 32529 27078 7747 21717 -683 -10747 10737 19591 -15904 -21223 -15564 11188 21310 10904
6841 10904 42407 32876 9581 4978 5590 3197 6279 15896 970 -30368 -44969 -33495 -4140
6828 -4140 3980 5027 2637 5101 19149 44582 62442 34542 -9843 -14972 -18830 -13189 -14553 15940
6814 15940 42015 41329 50768 59099 67646 66427 77106 108769 117368 140629 136579 107633 65214
6801 65214 63928 76160 105685 105996 91786 79883 75756 59780 34159 22639 37923 61392 68038
6788 68038 37765 39789 50788 59868 88095 84935 64421 87314 83153 56557 28521 34453 43102
6775 43102 7767 -8540 21336 48694 60664 54114 36667 67717 129639 165830 171138 144011
6763 144011 119073 122476 87819 100311 119543 131459 158329 144757 107150 91933 97980 117137
6751 117137 113382 112547 90849 100482 137785 126857 135721 147680 168159 201722 241716 282374 315754
6738 315754 298955 291516 336244 386725 427975 432277 465677 571411 696116 813581 907046
6727 907046 1009979 1072022 1044092 1007987 967001 919769 884071 840935 876373 973910 1082851
6716 1082851 1211699 1350508 1530007 1740741 2017331 2417515 3023444 3837094 4940764
6707 4940764 6528980 8864012 12034188 15776354 18620859 18723390 16840081 14076869
6699 14076869 10803270 7864346 5745519 4320787 3345470 2649524 2111025 1711281 1445050
6690 1445050 1231963 1068032 933692 841187 746594 704330 690991 648860 656890 686684 746853
6679 746853 770698 738163 672420 594661 464713 390231 344390 256850 212495 198755 192627 210113
6667 210113 224948 264174 231526 222910 219826 197407 197884 168145 156561 168150 146934 108187
6655 108187 81744 67164 91785 80879 45775 13578 11108 36000 60519 58254 15351 -9740
6643 -9740 1670 19235 20210 35081 16098 18558 182 6999 -22484 -28820 -23928 -56078 -21048
6630 -21048 9836 15961 10566 12915 7581 12045 12498 55631 83161 59894 -8499 -42060 -40766
6617 -40766 -38656 -18520 -3565 16299 36857 17397 -659 4065 317 -3880 22893 40215 38876
6604 38876 18038 -1520 -26896 -1934 13595 1625 25222 16302 7283 16404 6600 4741 16658
6591 16658 15364 4141 16408 5008 8519 17701 42175 26385 -102 21936 53889 45713 12919
6578 12919 -19952 -37611 -30634 -5743 -5431 31505 55237 67935 50250 15494 -24048 -19261 9907
6565 9907 -9691 -10363 18738 -355 -13289 4421 -4686 -27693 1601 24595 12331 14490 10459
6552 10459 8815 -8392 -15451 -30933 -43151 -29412 -37654 -44923 10056 14947 -1634 -1626 -2916 -11696
6538 -11696 -18969 -25121 1805 -40 13438 -2979 3246 -851 1193 -16207 -37461 -62308 -41332
6525 -41332 -13239 11813 7923 -23854 -51297 -47390 -40748 -34915 -27755 -15607 -20322 5606 1237
6512 1237 -1420 -598 -3570 -14272 753 21412 20477 31551 1951 -21510 -29544 -13739 -13029 -420
6498 -420 21854 31317 13475 -3730 564 15552 5387 -25013 -42870 -53190 -60058 -67628 -60581
6485 -60581 -77738 -48033 -24569 -11049 25913 22014 20504 33690 9550 4056 31458 29838 19763
6472 19763 35561 31461 27088 12349 22186 13655 -9892 4553 8615 -1062 25814 4184 -8631
6459 -8631 -3986 3129 2605 22823 23352 34066 40805 40828 31094 25101 32466 58666 40744 17062 -9058
6444 -9058 -50112 -85154 -76869 -60410 -28856 -6783 -37838 -57197 -45040 -62888 -59921 -51515 -28960
6431 -28960 -28341 -4017 18474 -12897 -9554 7144 15130 -1432 -11756 -12871 -17796 -13395 -23747
6418 -23747 8427 35635 33410 16835 -7600 -17421 -15479 555 12950 -19221 -67207 -50801
6406 -50801 -33171 -29126 -30603 -23807 -34220 -31011 -23387 -4258 -3907 -34729 -27201 -3238 -36528
6393 -36528 -57119 -51604 -3910 1960 -17881 -12676 11842 13246 2261 19570 15694 6473 -4949
6380 -4949 3343 1929 15481 23524 11979 -36299 -69327 -63621 -64705 -41466 -28202 -24226 -45947
6367 -45947 -63932 -58868 -17319 -7038 -13592 5131 30404 27047 2194 -22375 1240 9278 9046
6354 9046 10157 -11572 -40195 -39416 -13913 43251 32444 15857 3765 -349 17253 17755 -27953
6341 -27953 -35391 -38294 -36222 -32984 -34561 -9781 -34 29741 55662 64113 102226 126731 96588
6328 96588 84297 69212 57206 58568 50544 59467 73915 64649 23147 31201 37433 26261 18284
6315 18284 16197 21049 19886 -7867 -10642 -8609 -12934 -49017 -68745 -33708 -13849 9459 28518
6302 28518 30114 19343 -20824 -53165 -40640 -45229 -32730 -6326 -8798 -1914 16758 -1078 -17793
6289 -17793 -3138 31863 39455 5287 -3540 6551 38577 41588 6982 -34655 -329 19331
6277 19331 27288 17494 6071 3430 -24024 -38091 -28439 -14428 -33158 -31288 -16368 -13019 3405
6264 3405 -3531 -4054 8749 -2275 250 12198 -11474 -46311 -59008 -61647 -34555 -36244 -35637 -14608
6250 -14608 -2620 4596 31690 38778 -4178 -2310 -15860 -17 -6755 -41279 -49834 -41380 -7158
6237 -7158 15227 14402 19842 13956 16863 17749 6594 -797 -5059 6381 28626 21914 -8197 -39634
6223 -39634 -59212 -46118 -29737 -13512 24823 27146 15010 2398 -9388 -9319 5857 -19860 -1537
6210 -1537 25914 16738 3682 -7953 -23761 -11451 29125 40006 20602 -20663 -39239 -18029
6198 -18029 -18093 -32279 -13541 -37470 -17961 -28276 -38852 -39053 -9181 21122 36793 -683 -16457
6185 -16457 -7225 -30463 -3746 19759 29345 2512 5960 56406 37542 -3216 -11570 -10438 3856
6172 3856 -20330 -49416 -43036 -62409 -41127 -8464 -2272 -18404 -10215 -29554 -22697 -14542 -31994
6159 -31994 -44256 -65793 -82716 -78968 -39582 -28376 7921 -6861 -14173 -16559 -1148 -8508 -14730
6146 -14730 -32514 -21565 6835 21777 39250 21530 729 -18060 -2710 3129 23144 5721
6134 5721 11800 6567 362 1190 -10564 -15994 -22753 -8906 3481 -4979 -19907 -26852 -9854 -6318
6120 -6318 -9389 -12001 -40546 -21802 14236 11152 -13738 -4019 23249 17430 12106 14738 47106
6107 47106 41150 -975 22211 51982 39188 11255 24612 -15702 -16297 32050 34241 -12798 -33579
6094 -33579 -27352 -21255 -35910 -69358 -57647 -16198 12208 14655 29919 11667 9372 8109 -15879
6081 -15879 -41380 -25653 13455 21179 -6726 7065 -3211 704 19359 36591 61326 60759 48700
6068 48700 2415 -28898 -27212 -12533 -17035 -1233 -1473 4575 -6498 -18131 13785 8903 -30697
6055 -30697 -36007 -31291 -22799 25962 37511 38624 -1088 -24835 2419 6849 -22265 -37379 -39604
6042 -39604 -52191 -53420 -37996 -5098 18364 13122 -12887 -23574 -6526 -1042 -3199 -1541 -10718
6029 -10718 -32139 116 16823 18657 32483 31662 -14757 -40860 -36949 -37570 -51835 -35483 -17510
6016 -17510 2252 21319 26926 14544 -199 -24338 -21045 -21698 -19915 -13883 15499 37419 40412
6003 40412 20837 37378 39103 4781 -2800 8131 26158 32271 22392 10770 9571 10245 16127
5990 16127 6195 -20722 -20534 3683 24530 36294 23854 5797 -12929 -1473 22766 39478
5978 39478 28838 -1832 -11346 -28063 -34981 -30376 -18073 -29520 -42889 -37073 -23837 6675 9072
5965 9072 5798 1179 309 -2167 -11895 -23693 -4923 23462 36391 26532 1284 -9463 -18654 -1763
5951 -1763 33416 -1335 -3290 -11587 -13235 41 37722 24337 -10083 -37264 -57243 -35155 -15729
5938 -15729 3036 5018 -24221 -20248 -23399 -9458 -17945 9668 31410 41833 25824 -20796 -34079
5925 -34079 -42341 -62387 -39398 -28859 -19625 28632 52939 30295 -26422 -24615 -18953 -2708 -10298
5912 -10298 -4231 -6588 3569 -1234 173 -8094 -39290 -40493 -39683 -35961 3041 -8801 -731 8096
5898 8096 18749 11084 22734 33594 14038 -10836 -12252 -42399 -25705 2143 857 -13558 -14384
5885 -14384 11215 17847 34257 58417 32470 11435 5350 28955 46808 -8 -15497 -6160
5873 -6160 -17228 -640 33648 46809 36736 39165 44313 41420 44952 30481 19817 27128 16798
5860 16798 5322 -22762 -11927 13250 -1610 21169 39723 51488 47431 68566 71969 54384
5848 54384 57381 75125 58203 31279 26101 2143 -36654 -26613 -5816 4242 -15706 12212
5836 12212 4284 -27980 -12766 -7412 4776 -21149 -22825 -3709 1938 -5232 4659 8002 13345
5823 13345 24419 42617 20105 23166 11287 -25971 -40595 -35783 -28687 -22246 9626 -5912 -28726
5810 -28726 -27299 -1657 12018 28138 9200 5463 10840 -4756 16175 24762 16302 22634 39440
5797 39440 54870 73761 45717 24696 20050 42244 56170 45175 38665 8322 -7078 7061
5785 7061 8536 177 -2764 -24874 -24494 -12865 -8416 -6735 -14243 -31222 -34362 -38728 -31927 -42861
5771 -42861 -55859 -56483 -25776 14951 23991 15943 19381 3799 -4736 977 -12438 2283 13029
5758 13029 -2819 -30227 -5687 12588 26919 65006 49207 -8625 -24096 -26923 -49725 -47409
5746 -47409 -36400 -37917 -16354 -1997 5600 -2994 19562 21073 -8404 24338 18743 7100 22729
5733 22729 44373 35758 18328 25560 24546 -10865 -30997 -42790 -48697 -48346 -34159 2509 419
5720 419 -6382 -4000 -16443 -40670 -35688 -3613 21680 35805 36330 42116 -934 -10336 -27097 -31516
5706 -31516 2062 -1352 -9539 -9747 -8832 7298 22463 -16019 -35406 -52196 -54058 -66769 -68133
5693 -68133 -58753 -47314 -52438 -37059 -29305 -39928 -34677 -29009 -44927 -39023 -52548 -65395 -52240
5680 -52240 -35276 -31299 -37578 -67326 -33526 -16889 -18878 -23413 -12091 -20434 -23942 -177 25867
5667 25867 26041 -4399 -6443 18011 32338 14159 -23358 -24030 -7441 -17707 -5446 -36717 -12248
5654 -12248 -5468 -3062 -8879 -37776 -25577 -23131 -17443 21714 39177 53733 55685 27811 24735
5641 24735 30784 5622 -3787 14900 39075 51671 44036 6464 -53122 -60782 -53548 -55860 -27525
5628 -27525 7627 5655 -7595 -10310 -27339 -64182 -103855 -96828 -34256 7943 -25537 -53246
5616 -53246 -30006 -10953 5160 -1846 -9384 5987 13023 6425 970 14664 16965 -6937 -36321
5603 -36321 -22790 6555 12412 -9347 -17350 -7515 -10154 -11508 -17545 -11414 12185 27600 14495
5590 14495 -11009 -25614 1996 38444 37046 11182 -26609 -47146 -14171 15518 -7168 11395
5578 11395 5473 -14493 -4523 12481 17712 22794 27101 19563 19731 6216 14393 41976 49254 12600
5564 12600 -6611 -17909 -2710 -2901 -24492 -13058 4620 19923 12117 20043 -8061 -11095 39105
5551 39105 45915 23950 8140 -4439 6735 7666 9703 -15461 -17446 -22232 -43229 -30683 -2594
5538 -2594 11760 9639 -1207 -12598 8652 10319 18350 -3373 -11800 -11606 -23148 -30018 764
5525 764 14292 26603 4773 -16945 9128 27139 27905 21664 -8640 -1746 449 62 -25060 -29345
5511 -29345 -6145 17055 -5698 -7647 2439 -23044 -482 42774 48728 47773 36840 45858 43242
5498 43242 17496 -16760 -36109 -9252 13003 -3078 6618 18220 4270 -3866 -11807 -38875
5486 -38875 -41812 10404 21056 -4947 -17390 -37482 -57872 -64624 -47794 -19139 -30996 -50099
5474 -50099 -57768 -40340 11258 -968 -10295 -37091 -46272 -50368 -2533 1746 -28807 -58414 -66773
5461 -66773 -46119 -15967 -21069 -29216 -23224 2522 23889 33086 40207 33708 42422 24172 -7604
5448 -7604 -36374 -7083 -8447 -27168 -44672 -46076 -51754 -40324 -43766 -39501 -31061 -56377 -55427 -19403
5434 -19403 -24897 -12275 -2761 -19600 -10492 -1220 -12650 -30661 -36949 -56868 -48019 -31025 -15437
5421 -15437 -3071 22152 24341 47600 39036 14921 27900 40102 33735 4393 -8095 -34392
5409 -34392 -49060 -28468 -20182 2079 -10414 -30711 -15533 7775 26516 54714 53760 21978
5397 21978 2218 -10216 -49888 -78677 -109621 -82591 -61506 -48527 -46217 -74498 -45464 -17927
5385 -17927 -21739 -61293 -74334 -21379 -15147 -24135 -32724 -18045 -17868 -38686 -43007 -32862 2510
5372 2510 1959 2802 34841 42510 26679 27630 38523 47893 63903 61236 29620 -9292 -25849 -33978
5358 -33978 -42640 -42949 -17476 23801 -4701 11586 10787 3625 -5534 -15555 -1221 36440 14444
5345 14444 -2994 -39923 -48258 -41984 -53096 -48613 -55494 -71684 -92753 -83510 -46228 -13064 -6899
5332 -6899 -3106 -25417 -20318 -16148 -24263 -14694 -1063 -12961 -19895 -27264 -52861 -54476 -44935 -30624
5318 -30624 -11696 -295 -20829 -15563 -14547 -46620 -50726 -70423 -35516 -11188 -24068 -24201 -9499
5305 -9499 -1250 9912 4269 13519 17634 22848 3629 -12074 -38845 -24857 -11290 13961 24308
5292 24308 19561 25879 40202 28972 29519 22339 4421 6516 8272 13093 -7325 -10442 -26651 -43894
5278 -43894 -72465 -85033 -69450 -46149 -5975 29855 36898 4487 4286 9340 -377 -24134 -49526
5265 -49526 -29160 -10529 10585 35642 32535 36161 43845 9072 -10848 29759 39258 33129 38490
5252 38490 11165 -8162 553 -3391 10724 23947 36486 30104 36409 39772 -7118 -45161 -41457
5239 -41457 -33486 12931 31205 18820 -1810 -34716 -37663 -43139 -29284 -7670 -9362 -29915 -15435
5226 -15435 13108 17299 36411 17508 28117 34489 2135 -9076 -11589 -16803 -23523 -11696 -29419
5213 -29419 -29649 -13860 -21480 -41696 -30285 -23588 -19120 18360 20389 11576 35489 29390 13063
5200 13063 13467 11879 15171 -19027 -41971 -18082 15001 24203 10695 14012 59155 41242 273
5187 273 10466 -3027 -23237 -52319 -54546 -17881 -1942 -14547 -24002 -23416 -48980 -56982 -37923
5174 -37923 -38400 -41601 -27722 -39471 -26345 -13361 37498 58969 27940 5866 -9035 11846
5162 11846 15760 9853 4183 -13819 22607 34170 23588 -25258 -44047 -57009 -48773 -39368 -15568
5149 -15568 -17949 -32108 -17985 16497 13969 3702 -4312 -3943 -10001 -17594 -28738 -22102 1779
5136 1779 -14330 -22319 -10941 -36376 -52917 -44327 -19164 -15592 -48798 -60167 -23912 -6363 -6898
5123 -6898 -6583 -10824 -16792 -10895 491 -3817 15906 22035 5317 -15635 -27035 -19171 -17551 4848
5109 4848 -8751 -18442 -1018 -6725 -36764 -6979 -513 -2138 3202 5427 22743 5249 10780
5096 10780 3050 4539 -8465 -19456 -12568 -31053 -82419 -94196 -99425 -61356 -34375 -8596 26389
5083 26389 1991 -33026 -14879 26994 56050 39723 55574 51043 33118 33295 13311 26337
5071 26337 25063 14503 3423 3469 2353 -5842 -54553 -65678 -38445 -33599 -1198 25169 -1862
5058 -1862 -5594 17770 17165 -2845 -19521 -26669 -19736 -24980 -25591 -8429 41306 13347 4843 4686
5044 4686 -48102 -42645 795 18978 -250 10075 -16385 -28224 -4554 19318 20106 43731 34350
5031 34350 3603 -12573 1925 3148 6835 -94 -29324 -15167 -26765 -39514 -15619 20769
5019 20769 39040 25427 47741 26522 28872 6518 -18298 -13656 -20396 -12008 -693 -19150 -15024
5006 -15024 27404 36820 -3934 -44452 -47286 -27459 -36778 -35646 -17958 -29279 -20405 -2090 -3793
4993 -3793 7321 10750 -16337 -2297 -1216 9427 41010 53827 37303 -8745 -16622 -34692 -13228
4980 -13228 6422 8206 4638 5691 13888 15718 18535 -607 -20805 -1530 -2983 13108 -8531
4967 -8531 -12370 -5676 -18233 7340 20567 -5876 -22285 -16168 -17902 -362 -17096 -3090 -731
4954 -731 14467 26707 48821 48718 7764 -28567 -31051 -12683 -10908 -12672 -18630 -34716 -11364
4941 -11364 7027 28991 2568 1331 5147 13407 7462 3953 7237 -983 28022 39542 24884
4928 24884 39541 41759 -12748 -33572 -35905 -33462 -3013 -512 -23326 -29267 3968 48670 49799
4915 49799 -3095 -32425 -58103 -39913 -10314 6955 8646 -24883 -50715 -45619 -47072 -48195 -36157
4902 -36157 -30546 -27597 -53748 -61849 -22684 -2240 31215 64898 32231 21117 23184 42432 42048
4889 42048 -9197 18138 11042 -7325 -9644 -15544 -35102 -28833 3609 11271 29192 27582 23119
4876 23119 29676 27121 15901 8953 -8422 -43136 -40118 -31069 -23042 -13783 -2623 -26829 -56451
4863 -56451 -38569 -35926 -61641 -37472 -6622 -21899 -16048 11835 5934 -4559 -22479 -53832
4851 -53832 -64455 -22423 -2387 6040 14573 11366 -3594 -22217 -42287 -48580 -41407 -24587 -7117
4838 -7117 22350 28900 19851 49202 46025 -4769 6644 6700 -2484 3378 13440 4956 -7683 -9862
4824 -9862 4365 14868 13773 -5042 7018 21869 -1657 -22021 -22401 -8352 1389 18608 35441
4811 35441 49471 40500 33626 48716 40190 44495 38399 -963 -9830 31738 52956 50328 43101
4798 43101 15353 -14661 13735 22249 26781 17470 5692 -839 -22880 1388 -4456 -17122 1272
4785 1272 22727 3302 -15263 9479 50643 56736 38644 5165 29585 31581 9424 10632 21670
4772 21670 29234 16506 23145 27311 -8122 -21916 -33737 -12102 7925 5568 21046 30202 28210
4759 28210 20566 17063 42177 65933 59685 11715 2265 5330 15404 11896 7204 25354 13828
4746 13828 -6827 -52323 -35470 -16350 -25410 -12320 27118 33869 8978 3094 -4034 17209 34400
4733 34400 14094 8899 21650 30001 28744 7985 -17024 19497 63581 37809 27769 30943 47803
4720 47803 27101 25465 42690 41664 41813 28626 37669 36560 41493 26827 9503 5165 13976 11268
4706 11268 -23920 -48516 -42010 -57007 -33338 -16065 10996 -7364 1662 10821 -17431 -528
4694 -528 -13072 -29474 -29102 3792 10140 8078 12986 3400 6855 -740 -5509 11125 26120 17926
4680 17926 8919 4702 7335 45475 64746 80081 87442 60427 27121 27540 41005 41346 8555
4667 8555 1121 -13131 8534 -19481 -19303 -19086 -2541 -12998 -24093 12788 1388 -17496 7163
4654 7163 21673 -11195 -24446 -12417 10817 10527 10287 4802 21899 38987 50451 28502 17020
4641 17020 -7629 -36320 -42741 -10905 -5260 2711 5897 26788 50323 38778 26871 9962 -5958
4628 -5958 6250 -7462 -17672 -5392 -18711 -55223 -66520 -45652 -7100 -3298 -12860 -13989 -25419
4615 -25419 2519 -18294 -21365 -8064 -19971 -45639 -47398 -28634 6779 -1466 -24779 -44191
4603 -44191 -27531 -25609 -20672 -1722 -17682 -55768 -46162 -32280 -36755 -26649 -22654 -15650 -25116
4590 -25116 -17386 -33139 -2532 12845 5748 21569 15214 8872 -62446 -69948 -65944 -27791 -23062
4577 -23062 -33732 -10848 -6907 -8362 5730 7139 8191 -17313 -27240 -18823 12010 -10115 -37621
4564 -37621 -23726 -10399 -14291 -3119 22297 1529 -13920 -17625 22955 32124 33015 16088 5453
4551 5453 10799 13887 30872 25247 -8021 -2340 2045 -17863 -41053 -32297 -17809 979 -1981
4538 -1981 -1592 33 -11950 -13692 11057 -393 -20247 -19646 -49031 -60269 -41260 -38422 -45289 -51256
4524 -51256 -33911 -56222 -77549 -58885 -66696 -50072 -1206 40163 48161 11691 -42767 -56378
4512 -56378 -37409 2853 4884 -16579 -42510 -24410 12282 14131 12428 31890 49125 22161
4500 22161 22770 23169 5359 2537 4127 8261 21452 10999 19359 26881 31201 22610 -8305 -10724
4486 -10724 -19134 -35624 -31365 -16206 -4718 -3288 -13863 -45822 -46876 -34809 -8453 -9613 -50972
4473 -50972 -68657 -62275 -52368 -28946 -36899 -29093 -41648 -38133 -30525 -15786 -25677 -10018 5303
4460 5303 -8902 -13499 -34272 -56772 -56290 -65777 -55381 -51793 -43564 -42975 -45375 -42116 -34837 -17113
4446 -17113 -20122 -5340 -8034 -17601 -16949 -977 383 18488 18389 24536 32611 17078 16424 2735
4432 2735 -2728 33599 18345 -20624 -38713 -52054 -32301 -13204 -15736 -9473 34763 46004 41267
4419 41267 28241 45765 41630 -13493 -38273 -41145 -32055 -5484 12223 -8234 -36059 -23034
4407 -23034 9151 5444 -1927 -4416 8928 22304 -18 7897 -6214 -20450 -24610 -29982 -21365
4394 -21365 -19818 -38660 -56540 -28190 -19528 -31580 -25219 -18383 -416 1830 6637 28129 25867
4381 25867 30856 15141 -6720 -15990 -35390 -42917 -28937 -20959 -9498 -19991 -22127 -26742 -3387
4368 -3387 7480 -1274 11592 -2512 -10423 -7586 -14254 -39848 -40390 -6655 11134 776 -28241
$$ [...]
##END NTUPLES=NMR SPECTRUM
##END=
