##TITLE=Analysis number 318009
Compound Code cc 45446
Book Reference 440/154
Project Code adrs
Chemist Name craigr
##JCAMPDX= 6.0         $$ Bruker NMR JCAMP-DX V2.0
##DATA TYPE= NMR SPECTRUM
##DATA CLASS= NTUPLES
##ORIGIN= Bruker BioSpin GmbH
##OWNER= nmr
$$ XWIN-NMR		Version 3.5
$$ Mon Mar 13 08:49:36 2006 GMT Standard Time (UT+0h)  MAYBRIDGE\nmr@NMR_250MHZ
##.OBSERVE FREQUENCY= 250.131544655141
##.OBSERVE NUCLEUS= ^1H
##.ACQUISITION MODE= SIMULTANEOUS (DQD)
##.ACQUISITION SCHEME= undefined
##.AVERAGES= 16
##.DIGITISER RES= 18
##SPECTROMETER/DATA SYSTEM= dpx250
##.PULSE SEQUENCE= zg30
##.SOLVENT NAME= CDCl3
##.SHIFT REFERENCE= (INTERNAL, CDCl3, 0, 16.522)
##AUDIT TRAIL= $$ (NUMBER, WHEN, WHO, WHERE, WHAT)
$$ ##TITLE= Audit trail, XWIN-NMR		Version 3.5
$$ ##JCAMPDX= 5.01
$$ ##ORIGIN= Bruker BioSpin GmbH
$$ ##OWNER= nmr
$$ C:\u/data/dgb/nmr/ADRS/550/pdata/1/auditp.txt
$$ ##AUDIT TRAIL=  $$ (NUMBER, WHEN, WHO, WHERE, WHAT)
(   1,<2006-03-13 08:49:11.13 +000>,<MAYBRIDGE\nmr>,<NMR_250MHZ>,
      <created by zg, POWCHK disabled, PULCHK disabled
       configuration hash MD5:
       84 BC 41 DB A1 6E 1D 46 DA 25 12 A5 C1 ED C5 3A
       data hash MD5: 64K
       11 7E 13 3F D8 23 D6 6B 2A 90 FD B0 ED C8 F3 B8>)
(   2,<2006-03-13 08:49:25.77 +000>,<MAYBRIDGE\nmr>,<NMR_250MHZ>,
      <Start of raw data processing
       ef LB = 0.3 FT_mod = 6 PKNL = 1 SI = 32K 
       data hash MD5: 32K
       A2 07 3D C8 ED 69 FE A2 52 E6 68 1C 18 19 C0 A1>)
(   3,<2006-03-13 08:49:27.31 +000>,<MAYBRIDGE\nmr>,<NMR_250MHZ>,
      <apk 
       data hash MD5: 32K
       D1 71 BC 90 B4 96 75 07 BF E7 68 7F A0 84 8C 4A>)
(   4,<2006-03-13 08:49:28.03 +000>,<MAYBRIDGE\nmr>,<NMR_250MHZ>,
      <abs ABSG = 5 
       data hash MD5: 32K
       1F 7B 92 03 4A 46 B4 11 73 C9 B3 F0 9A 0A B7 8D>)
$$ ##END=
$$ 
$$ hash MD5
$$ D8 18 C5 3C 14 B8 58 CB AF 8D 63 B9 82 95 F9 04
##$RELAX= 
##$RELAX= 
##$RELAX= 
##$RELAX= 
##$RELAX= 
##$RELAX= 
##$RELAX= 
$$ Bruker specific parameters
$$ --------------------------
##$DU= <C:\u>
##$EXPNO= 550
##$NAME= <ADRS>
##$PROCNO= 1
##$TYPE= <nmr>
##$USER= <dgb>
##$AMP= (0..31)
100 100 100 100 100 100 100 100 100 100 100 100 100 100 100 100 100 100 
100 100 100 100 100 100 100 100 100 100 100 100 100 100 
##$AQSEQ= 0
##$AQ_mod= 3
##$AUNM= <au_zg>
##$AUTOPOS= <6 >
##$BF1= 250.13
##$BF2= 250.13
##$BF3= 250.13
##$BF4= 250.13
##$BF5= 500.13
##$BF6= 500.13
##$BF7= 500.13
##$BF8= 500.13
##$BYTORDA= 1
##$CFDGTYP= 0
##$CFRGTYP= 5
##$CHEMSTR= <none>
##$CNST= (0..31)
1 1 145 1 1 1 1 1 1 1 1 1 1 1 1 1 1 1 1 1 1 1 1 1 1 1 1 1 1 1 1 1 
##$CPDPRG= <>
##$CPDPRG1= <>
##$CPDPRG2= <>
##$CPDPRG3= <>
##$CPDPRG4= <mlev>
##$CPDPRG5= <mlev>
##$CPDPRG6= <mlev>
##$CPDPRG7= <mlev>
##$CPDPRG8= <mlev>
##$CPDPRGB= <>
##$CPDPRGT= <>
##$D= (0..31)
0 1 0 0 0 0 0 0 0 0.06 0 0 0 0 0 0 0.0002 0 0 0 0 0 0 0 0 0 0 0 0 0 0 
0 
##$DATE= 1142239749
##$DBL= (0..7)
120 120 120 120 120 120 120 120 
##$DBP= (0..7)
150 150 150 150 150 150 150 150 
##$DBP07= 0
##$DBPNAM0= <>
##$DBPNAM1= <>
$$ [...]
##$SUBNAM7= <"">
##$SUBNAM8= <"">
##$SUBNAM9= <"">
##$SW= 20.6930455092707
##$SWIBOX= (0..15)
0 0 3 0 0 0 0 0 0 0 0 0 0 0 0 0 
##$SW_h= 5175.983436853
##$TD= 65536
##$TD0= 1
##$TE= 293.16
##$TE2= 300
##$TE3= 300
##$TEG= 300
##$TL= (0..7)
0 120 120 120 120 120 120 120 
##$TP= (0..7)
150 150 150 150 150 150 150 150 
##$TP07= 0
##$TPNAME0= <>
##$TPNAME1= <>
##$TPNAME2= <>
##$TPNAME3= <>
##$TPNAME4= <>
##$TPNAME5= <>
##$TPNAME6= <>
##$TPNAME7= <>
##$TPOAL= (0..7)
0.5 0.5 0.5 0.5 0.5 0.5 0.5 0.5 
##$TPOFFS= (0..7)
0 0 0 0 0 0 0 0 
##$TUNHIN= 0
##$TUNHOUT= 0
##$TUNXOUT= 0
##$USERA1= <user>
##$USERA2= <user>
##$USERA3= <user>
##$USERA4= <user>
##$USERA5= <user>
##$V9= 5
##$VALIST= <valist>
##$VCLIST= <CCCCCCCCCCCCCCC>
##$VD= 0
##$VDLIST= <DDDDDDDDDDDDDDD>
##$VPLIST= <PPPPPPPPPPPPPPP>
##$VTLIST= <TTTTTTTTTTTTTTT>
##$WBST= 1024
##$WBSW= 4
##$XGAIN= (0..3)
0 0 0 0 
##$XL= 0
##$YL= 0
##$YMAX_a= 317867
##$YMIN_a= -464226
##$ZGOPTNS= <>
##$ZL1= 120
##$ZL2= 120
##$ZL3= 120
##$ZL4= 120
##$ABSF1= 16.522
##$ABSF2= -4.171173
##$ABSG= 5
##$ABSL= 3
##$ALPHA= 0
##$AQORDER= 0
##$ASSFAC= 0
##$ASSFACI= 0
##$ASSFACX= 0
##$ASSWID= 0
##$AUNMP= <proc_1d>
##$AZFE= 0.1
##$AZFW= 0.1
##$BCFW= 0
##$BC_mod= 0
##$BYTORDP= 0
##$COROFFS= 0
##$CY= 12.5
##$DATMOD= 1
##$DC= 0
##$DFILT= <>
##$DTYPP= 0
##$F1P= 14.0000005364418
##$F2P= -0.99999901652339
##$FCOR= 0.5
##$FTSIZE= 32768
##$FT_mod= 6
##$GAMMA= 0
##$GB= 0
##$INTBC= 1
##$INTSCL= 1
##$ISEN= 128
##$LB= 0.3
##$LEV0= 0
##$LPBIN= 0
##$MAXI= 10000
##$MC2= 0
##$MEAN= 0
##$ME_mod= 0
##$MI= 0
##$NCOEF= 0
##$NC_proc= -3
##$NLEV= 6
##$NOISF1= 0
##$NOISF2= 0
##$NSP= 0
##$NTH_PI= 0
##$NZP= 0
##$OFFSET= 16.522
##$PC= 1
##$PHC0= 170.8008
##$PHC1= 6.415151
##$PH_mod= 1
##$PKNL= yes
##$PPARMOD= 0
##$PSCAL= 4
##$PSIGN= 0
##$REVERSE= no
##$SF= 250.13
##$SI= 32768
##$SIGF1= 0
##$SIGF2= 0
##$SINO= 400
##$SIOLD= 32768
##$SREGLST= <1H.CDCl3>
##$SSB= 0
##$STSI= 32768
##$STSR= 0
##$SW_p= 5175.98343685301
##$SYMM= 0
##$S_DEV= 0
##$TDeff= 65536
##$TDoff= 0
##$TI= <Analysis number 999999
Compound Code 99
Book Reference 9
Project Code 9>
##$TILT= no
##$TM1= 0
##$TM2= 0
##$TOPLEV= 0
##$USERP1= <user>
##$USERP2= <user>
##$USERP3= <user>
##$USERP4= <user>
##$USERP5= <user>
##$WDW= 1
##$XDIM= 32768
##$YMAX_p= 333657241
##$YMIN_p= -69798
$$ End of Bruker specific parameters
$$ ---------------------------------
##NTUPLES= NMR SPECTRUM
##VAR_NAME=  FREQUENCY,     SPECTRUM/REAL,   SPECTRUM/IMAG
##SYMBOL=    X,             R,               I
##VAR_TYPE=  INDEPENDENT,   DEPENDENT,       DEPENDENT
##VAR_FORM=  AFFN,          ASDF,            ASDF
##VAR_DIM=   32768,         32768,           32768
##UNITS=     HZ,            ARBITRARY UNITS, ARBITRARY UNITS
##FACTOR=    0.157963299565203, 1,           1
##FIRST=     4132.6476996994, 0,             0
##LAST=      -1043.33573715361, 0,           0
##MIN=       -1043.33573715361, -69798,      0
##MAX=       4132.6476996994, 333657241,     0
$$ Real data points
##PAGE= N=1
##DATA TABLE= (X++(R..R)), XYDATA
$$ [...]
20855 -6699 -14965 -18262 -17365 -16543 -15917 2380 15163 19009 20806 5747 5146 4045 13492 16240 27749
20840 27749 17760 18490 13330 3422 -8817 5588 9671 2964 -160 6057 4970 3083 -5031 -8886
20826 -8886 -21172 -21887 -17701 -20034 -15174 -9674 -2562 13732 16664 13297 -1804 -2986 -5792 -19585
20812 -19585 -14087 -1905 -7595 3704 11739 8894 1202 -12383 -3461 -5432 -15293 -22894 -12938 1762
20798 1762 4444 -9572 -10185 -10252 -3554 3913 -7948 -11377 -13694 -31794 -23906 -8460 -14701 -22587
20784 -22587 -11716 -1747 2881 11691 4385 -4225 -11927 -21340 -27502 -21423 -15807 -9398 7751 16489
20770 16489 8714 -1149 11144 8893 2251 5498 -7168 -26128 -25998 -13818 -12075 -13449 -8815 -4736
20756 -4736 -9925 -7399 -589 10178 17373 18365 18022 1239 -6315 139 -8659 -24792 -33650 -24638
20742 -24638 -23402 -7537 -8898 2214 7137 7749 13944 15327 12915 1372 -922 19355 23765 24029
20728 24029 17653 4689 -5785 -6168 -11186 -6671 -178 4511 18990 33583 35973 31737 32049 30789
20714 30789 23781 19594 28098 15575 8402 1321 -11103 -15418 -13823 -10748 -5654 -3094 4608 2811
20700 2811 -5598 -14894 -17060 -15391 1793 13175 10821 13471 2240 -16655 -21082 -16513 -5812
20687 -5812 -2025 -3359 -4967 -5099 -13709 -19390 -28795 -24035 -23031 -13546 -2450 -6183 4798 6497
20673 6497 -5659 -18121 -32158 -19834 -6170 1692 5252 -1069 -1591 315 13878 3001 -16074
20660 -16074 -20135 -22881 -14487 323 521 8182 13298 17701 23298 14839 1907 -5554 -884 -2438
20646 -2438 -7958 -8603 -4644 -5 16988 30544 22138 -166 -9604 7464 7936 10078 3977 -6218
20632 -6218 -15113 -13650 -1457 -3805 -13224 -3494 -1750 5154 11652 21404 17056 16717 4010 6226
20618 6226 8168 3720 1590 6224 12515 7598 -6981 -6068 -6670 1403 7103 2598 6350 10764 22598
20603 22598 22455 21289 16718 18456 2919 572 1617 678 -1663 -3288 -54 13678 17367 20342
20589 20342 17018 8731 8599 9624 1381 -8443 -280 -10145 -2267 -135 -7192 -5376 -11860 -14242 -21651
20574 -21651 -34550 -39643 -34738 -17089 -22214 -13887 9942 3710 6390 3393 5421 1740 5767 5386
20560 5386 10330 9432 8945 11847 13772 19650 11523 4204 13442 13451 5623 -5033 -6693 -7363 -15429 -25431
20544 -25431 -14637 803 19004 18479 21670 11511 -11637 -24917 -21010 -11883 -9451 -9116 -734
20531 -734 2122 1385 6790 18651 15490 13577 15895 6072 -8444 -15244 -4414 -4845 -24778 -21480
20517 -21480 59 15714 11778 -3393 -16600 -13001 537 8102 6345 6573 444 1104 -4160 5637
20503 5637 15493 7475 12050 9904 -6551 866 6175 8444 15831 20256 10883 9758 21486 24664
20489 24664 19074 7067 -9365 -15204 -1174 9580 7112 760 -11039 -15553 -22097 -22853 -22777 -25180
20475 -25180 -20659 -16579 -5961 4197 6697 13126 23123 21694 12980 8081 3960 14083 8979 2544
20461 2544 -1308 4398 -2723 -14707 -20787 -23004 -14519 -12852 2068 7714 5439 -15292 -28836 -15275
20447 -15275 263 498 11841 1584 -14193 -17871 -12357 -8531 4328 -10876 -15952 -30105 -42411
20434 -42411 -24117 -13562 4194 14416 22119 4090 -1379 1298 11044 5462 -11315 -19746 -27847
20421 -27847 -22487 -15092 -17757 -24051 -16924 -11831 -7926 -18365 -23733 -22340 -27310 -24360 -24339 -17286 -3757
20406 -3757 -4388 -7660 3350 -8722 -31158 -15181 -10457 -3497 1734 13106 10082 3685 9777 15802
20392 15802 17029 17286 5849 941 -15509 -22839 -10053 -7553 6699 6671 -497 -4059 -7200 878
20378 878 -3374 -6835 5763 -5490 -12003 -12651 -15616 -7140 21129 23082 17645 18358 469 -10506
20364 -10506 -10549 5501 17397 10550 2803 3738 7985 1119 -1712 4309 -2594 -3056 -22389 -26628 -23321
20349 -23321 -20625 -17856 -15622 -7351 -1465 7584 3568 9989 6871 4794 3750 -1687 -3468 -3211 5062
20334 5062 305 -12736 -18591 -12000 -15343 -14927 -30314 -43473 -53333 -46273 -45715 -50287 -33117 -26836
20320 -26836 -44791 -31721 -23203 -15802 -18321 -27418 -30156 -6201 9298 6435 9962 13766 -4841
20307 -4841 -11259 -1812 -5091 -13333 -5027 10337 7017 -5144 -12970 -9189 -5054 -16557 -33211 -43046
20293 -43046 -33600 -12872 -8974 -9451 -7798 -9375 -13555 -2046 -1849 331 2737 8024 276 -4844
20279 -4844 998 4741 4187 -7255 -9620 -10210 2539 23179 24508 11666 6289 3916 6348 1464
20265 1464 1873 8704 9509 18415 12093 -5237 -13804 -19797 -16873 -13827 -8808 -2036 4034 -15010 -41697
20250 -41697 -33942 -22767 -8908 -535 -2867 4074 2071 7704 11123 -201 2715 2920 3394 12654
20236 12654 17484 17464 16005 19825 2010 -11405 -15305 -13481 -4840 -12074 -9364 6184 12041 24822
20222 24822 37027 29294 24944 23408 14526 11386 19948 19939 7307 -1974 13129 15996 5765 16496
20208 16496 15109 2646 1599 5772 6547 9499 1879 -12692 -12042 -18719 -2987 7735 5530 -1705
20194 -1705 1400 -5483 -1884 10919 25858 28214 12646 5298 9705 13036 19586 20708 21025 21971
20180 21971 4537 2166 -4725 -2706 -4971 -15769 -4422 2617 13584 25826 32601 32792 29888
20167 29888 20641 14960 25037 26171 14375 10114 23002 17114 15476 22230 23759 23884 22373 16451
20153 16451 12586 18896 20804 28439 23440 11571 -1947 -13158 -7746 -9803 -4835 8702 -2132
20140 -2132 -22861 -17233 -11661 -15403 -10319 3224 17065 28186 18657 9121 9907 11111 8904 10889
20126 10889 6067 21346 23070 9806 60 -2867 -4302 -621 2621 3123 2322 -4235 -11735 -4417
20112 -4417 -4459 -10720 -17416 -22946 -15801 -3884 -1906 -11862 -10238 -5538 -5908 -6437 -7450 -3738 8398
20097 8398 -7291 -7902 -5131 -1275 8178 6636 5467 2082 -1460 -8494 -20746 -23747 -14889 4129
20083 4129 9131 78 -8421 -10352 -1753 -10995 -9981 -2683 -3045 -5599 -2683 -1726 -7919 -7451 -3932
20068 -3932 2224 17989 17592 11444 5598 14827 23382 18304 14049 11428 8697 13895 21349 28168 24789
20053 24789 24512 28676 30991 35198 38268 39446 29239 25623 24690 40669 40197 33518 42142 64092
20039 64092 72764 98901 138087 165625 207852 265331 317319 345280 373325 383883 373710 340176
20027 340176 287759 234740 186244 156184 137446 121386 103944 82369 64664 53447 46062 31371
20015 31371 33673 41252 31934 43407 68034 66678 56283 43274 32220 28418 25421 28065 29493
20002 29493 35509 37266 31674 20919 13511 20185 28832 26453 24135 23669 30874 34598 30456 35234
19988 35234 28438 13899 20373 26330 34837 45636 28943 15497 12137 8905 -4129 -3078 11252
19975 11252 20622 21522 12955 13726 20942 22189 20403 16973 16114 30425 37953 23929 17318 14819 3169
19960 3169 -6814 -21582 -27696 -13049 -5534 -2184 3568 8360 14942 25135 29583 19342 9933 8805
19946 8805 26756 37852 46842 24097 4520 2953 4618 1740 -3094 1597 19025 22883 25955
19933 25955 9253 1310 -1951 -9291 -7381 -6891 334 10202 -308 -478 2098 23893 47743 35491
19919 35491 35035 33855 35266 22764 15614 18628 13055 5851 10053 14046 12432 11198 7304 8158 -2156
19904 -2156 -8635 -2566 8753 8244 2288 11314 26411 29539 29585 30486 23641 28618 20525 10417 18469
19889 18469 23452 16785 11739 7792 541 -6545 2171 3708 3962 -3728 3957 9609 2611 7613 17296
19874 17296 18205 9952 20456 34693 33739 26419 24213 26670 24141 20534 27323 39081 35154 32823
19860 32823 50115 51665 59641 69657 69489 80323 104458 107865 111302 151309 188821 219352 267662
19847 267662 326069 373585 391679 402394 395587 354656 293656 240251 192012 145307 125906 107946
19835 107946 81921 75733 73151 76643 79660 71096 40548 34665 42255 31699 34967 36677 23067
19822 23067 26884 33132 37419 33612 33179 45151 45951 38645 29631 28443 29988 30058 31622 37016 30643
19807 30643 19759 17049 25854 25292 18921 19071 17605 10484 19609 37429 36483 25858 11324 15758
19793 15758 18638 18144 23248 22050 13767 11324 24348 37058 31728 23319 19296 15652 18243 24031
19779 24031 33129 21080 4821 8885 21346 21322 19018 25635 18110 35004 43839 30145 17338
19766 17338 28854 38961 33074 22750 13162 8050 8755 961 -11842 -9035 605 10263 22380
19753 22380 7339 14754 28961 37757 35996 29240 19008 5700 12455 20449 21110 20198 18068 5122
19739 5122 -5903 11387 17639 12472 19121 14133 5839 4590 9048 4957 13859 24387 29625 43822
19725 43822 51861 55327 58947 57186 43140 33269 46372 53465 57199 74815 98774 116033 113737
19712 113737 113083 116797 100834 85457 65728 48165 52625 51790 57829 50664 55982 61590 61007 56244
19698 56244 63924 57317 63114 64390 59650 61938 63574 70416 56266 56554 41755 28914 44500 58622
19684 58622 72083 81310 84913 83737 75947 73427 67727 59134 55534 62381 60521 44229 36486 44140
19670 44140 54088 50676 42010 42262 40015 37388 21374 7799 18383 20863 22754 33086 47718
19657 47718 46121 35980 25577 18924 14294 20681 23935 21790 20551 17483 27667 47451 53058
19644 53058 57190 57377 43861 30985 33907 36235 44987 59955 57761 43062 47190 58972 66571
19631 66571 67290 58316 57056 64509 72114 79433 73663 62703 67534 81998 61862 41416 46037 54948
19617 54948 58572 56860 44234 36077 24832 39653 42060 38893 50678 46870 44934 38353 27722
19604 27722 29388 39182 47514 41962 29620 20434 17875 16072 16993 24813 28040 32794 33779 51724
19590 51724 61572 69898 72787 62372 50540 46039 47964 43755 47579 49050 42682 31765 32461 37916
19576 37916 23567 27225 32667 31468 28593 25776 36888 32523 19605 29289 23990 13439 27143
19563 27143 28056 18786 16175 24635 46471 75339 84243 79229 79411 69758 62051 64441 79743 80817
19549 80817 80748 75005 68687 55484 57447 55705 58882 69392 74123 85196 76100 51448 43761 43100
19535 43100 61499 88345 109420 110277 106242 90996 99499 97193 97311 101091 92088 109486 109827 97808
19521 97808 90669 92032 90856 99354 85844 84391 93867 130660 137323 114469 94158 95582 107758
19508 107758 122532 128656 124706 134751 144154 141504 151087 165180 167365 162244 158183 153562 142898
19495 142898 135533 127815 130239 128784 124140 130642 131663 128016 112260 105365 127142 137279 138067 147430
19481 147430 150115 146243 137980 129456 120262 136578 137428 143033 157961 166444 166816 156768 158573 151634
19467 151634 145435 166071 190092 202458 206732 198678 198603 194721 205636 219174 215781 220210 219106
19454 219106 215948 226597 233710 226881 230596 234738 237832 243838 252336 268994 269786 261496 268320 292787
19440 292787 295013 296612 281526 268966 276569 304674 323761 325396 316921 309339 309100 328973 349971
19427 349971 359968 359246 358312 383896 402167 412837 427926 452257 481504 519045 560430 621327
19415 621327 674985 758853 861835 970017 1079775 1179172 1262338 1320889 1348022 1348562 1335288
19404 1335288 1334917 1339702 1332434 1357122 1402473 1462146 1541499 1617921 1681440 1764739 1888483 2018777
19392 2018777 2188020 2392496 2648104 2981592 3384581 3882048 4476867 5204161 6123884
19383 6123884 7317751 8890118 11008744 13940628 18016337 23527111 30647856 39239516
19375 39239516 48773613 58164465 65902206 70719553 71728649 68656941 62344676 54025182
19367 54025182 45021991 36521512 29196198 23272879 18724411 15286083 12686940 10680246
19359 10680246 9105162 7835281 6824296 6023938 5364785 4825478 4369310 3967046 3623803
19350 3623803 3314999 3050035 2829969 2641377 2481735 2368094 2272469 2196803 2131973 2074563
19340 2074563 2047747 2049775 2073520 2150952 2260828 2435829 2647561 2851597 3046617 3186657
19330 3186657 3251080 3228016 3095661 2882144 2618215 2340720 2068292 1829108 1603812 1409071
19320 1409071 1270240 1172129 1106677 1070393 1054975 1077973 1133647 1240154 1374591 1546865
19310 1546865 1750886 1944104 2086376 2145170 2082850 1943361 1753100 1519620 1288496 1095753
19300 1095753 931858 807516 721881 654622 581553 530626 497866 472561 457538 436388 420280
19289 420280 408825 407876 402766 396322 404349 410280 405429 386451 377815 369265 360020 354638 345417 341128
19275 341128 333446 319269 332386 333600 338076 344997 349209 337637 328567 328202 341336 346677 337380
19262 337380 336622 348781 344998 358918 362336 367062 353424 361172 378375 386951 385920 384838 397476
19249 397476 396260 415898 441916 463554 495259 523445 548468 569713 617887 657365 684079 708764
19237 708764 739330 749414 773829 803181 849411 908196 939330 974117 1021480 1049581 1088355
19226 1088355 1122115 1164694 1228794 1301749 1380024 1489978 1617502 1780097 1964971 2132590
19216 2132590 2273350 2421890 2564436 2722821 2918469 3165141 3466533 3837759 4303060
19207 4303060 4880470 5589704 6466694 7592392 9049578 10970548 13560022 17075534 21851835
19198 21851835 28314087 36770935 47097046 58294221 68384851 75070739 76621005 72656180
19190 72656180 64413796 54023704 43577672 34478460 27233527 21757850 17665377 14588248
19182 14588248 12247290 10452247 9072113 7994372 7179934 6557699 6060499 5609123 5185320
19173 5185320 4794673 4414259 4079850 3784345 3507092 3244668 2998268 2768114 2548321
19164 2548321 2345772 2169358 1997695 1841423 1724198 1628273 1561543 1530791 1512696 1514061
19154 1514061 1581935 1691839 1836723 2017626 2242246 2479861 2645824 2722521 2660667 2464991
19144 2464991 2188996 1878651 1588044 1352884 1169368 1014885 896132 793140 720631 661184
19134 661184 612715 574134 539259 505588 481293 448805 426008 402975 386261 365910 351812
19123 351812 347739 350286 356014 352238 338416 344286 321809 299586 285576 263359 243845 231298
19111 231298 228239 213108 189943 177637 191761 203013 190309 175698 171223 169494 170730 164773
19099 164773 165064 165922 165472 158903 141834 130609 127359 108251 102278 115971 132267 131358 105972 87143
19085 87143 72040 82173 103235 111430 104582 108503 112124 117101 105607 105326 102559 101028 103454 98333
19071 98333 86178 85677 74271 83761 84961 87004 87273 75681 64839 42186 48150 65953 78772
19058 78772 71323 77468 78397 78261 83541 89317 80781 83141 71296 62262 57116 49015 38513 30198
19044 30198 29975 35142 42257 41844 43959 48539 45501 41915 49889 52879 50848 53810 55109 49394 43698
19029 43698 31995 29410 25468 16883 37060 47019 39936 27263 33790 40892 48646 46881 45176 45544
19015 45544 31723 33178 28904 21039 29659 42024 39608 30996 30356 41958 62225 69009 96703
19002 96703 111612 95140 82586 84925 76589 73109 67199 58349 52862 42573 40734 36351 44275
18989 44275 55329 42285 31509 40745 63228 61226 50043 55136 70368 52450 36638 30691
18977 30691 35716 39578 53116 65747 58306 58734 61349 91826 113187 105661 90254 86472 69339
18964 69339 60104 52138 39292 38135 46520 45747 35522 34595 35359 29986 41899 46116 49247 44915
18950 44915 34203 23252 33119 45573 39038 27477 28984 34331 37028 50191 50856 47131 54081
18937 54081 61799 72756 60806 55000 61171 53924 40817 38837 51278 44080 40720 40403 38922 33523
18923 33523 10097 16343 22923 21401 21651 24344 33127 39214 47509 56342 58909 41381 18004 -4222
18909 -4222 2056 13420 22678 9974 10579 13550 10984 20647 28567 32999 49005 60402 61492 56138
18895 56138 43901 49878 39901 23318 19064 22220 8319 -2617 -5607 -7180 -9160 -7334 -6080
18882 -6080 -12970 -13562 -8869 701 15248 15642 20248 23833 34953 37276 30716 27381 15111 6351
18868 6351 6239 8474 17087 30365 41940 29338 28155 24925 24884 12374 6129 9712 19986 10562
18854 10562 16202 7758 4861 7273 -1045 -1250 7071 15048 11593 1638 3818 4738 10257 12076 18154
18839 18154 26397 26416 16672 6898 21101 25965 29737 23308 30089 40777 44135 35676 36387 16782
18825 16782 4608 2850 11354 21082 22430 24499 23013 16723 15547 39208 55884 51087 42871 30415
18811 30415 18854 14850 29192 33166 17310 24248 40256 42420 37486 31134 57204 74701 64410
18798 64410 54819 36888 32462 43891 38583 32800 16323 22872 35690 50425 49786 57000 72300
18785 72300 66482 54188 42861 42829 57655 59001 48082 31895 22883 17408 12102 21940 26591 16890
18771 16890 7066 20845 21421 22805 54436 97710 137281 176061 199240 195945 185137 161177 143097
18758 143097 137689 134953 134019 132687 110773 79881 69279 66802 52193 54437 70348 68105 52276
18745 52276 33931 24178 30125 29826 27175 37936 53846 68871 57443 45762 25314 10193 17337
18732 17337 27964 36659 32332 33790 41013 49829 63841 71263 72902 71169 79515 80994 73647 75870
18718 75870 85784 91856 114685 159986 221546 266992 307300 364116 407217 444897 499797 563662
18706 563662 597605 601897 578994 554006 518785 456773 407792 352054 303448 262575 229825 213979
18694 213979 196778 174471 165497 172909 164219 149651 146279 136131 133844 117269 97618 93393 86991
18681 86991 74801 71331 63653 62756 89642 86667 79578 89761 95070 89166 87619 92057 92597 104646
18667 104646 126577 132392 147326 172013 211465 238711 248030 245501 244210 234409 222494 208140
18655 208140 193907 188308 190524 184866 185885 175781 171836 167944 168873 159693 142526 129860 128976 129068
18641 129068 129445 130757 125984 110849 108353 95854 82752 79602 77462 69136 69953 72915 71090 60398
18627 60398 65376 80170 83747 81980 87175 79701 74217 64396 64217 53323 33668 39203 60558 71549
18613 71549 79520 74211 74957 78098 87103 96204 110154 104024 118172 128545 151919 167221 157999
18600 157999 168241 178301 173480 180186 201100 201883 212890 236519 239477 224899 228716 240317 242709
18587 242709 244014 237156 238709 226397 214801 198622 180294 165507 158620 155778 144161 123174
18575 123174 121883 108924 88762 94205 97791 86466 78693 64445 53653 57507 60904 68528 58776
18562 58776 53555 54067 64102 76518 85408 87702 72676 58320 56454 66090 60142 65803 77889
18549 77889 83819 81679 69459 73672 66878 67924 80556 91611 87896 99125 112526 142021 178603
18536 178603 214353 257278 319901 378035 442788 471726 459231 431935 382628 332903 295279
18525 295279 262868 215762 173890 156311 148339 138074 119098 109319 104449 107728 113565 110953 107346
18512 107346 89258 71392 62981 61991 79783 94588 100348 89946 79234 74944 72534 77221 91133
18499 91133 86080 70682 64773 67718 63730 69223 77495 88977 100272 104241 91377 87833 87330 90841
18485 90841 94645 94044 99748 92616 79353 80077 89800 92566 80196 88851 92301 102285 93592 82606
18471 82606 85716 87034 65476 61846 69017 74055 78797 88942 73705 62031 64605 72460 91000
18458 91000 98858 101195 103693 109532 104758 101850 101903 105882 108946 111286 112243 104355 110568 123492 127522
18443 127522 129315 124798 123152 130741 125927 132234 121937 111542 115436 134129 160976 167892 171613
18430 171613 191401 193514 194398 201366 186574 180580 165518 160986 161353 179447 185243 167268 154489
18417 154489 160959 162931 167622 157261 143191 129768 131058 125506 120828 126592 124949 119022 124946
18404 124946 135420 145736 138620 147019 156719 166360 162641 163954 162150 157879 156145 153963 144687 146495
18390 146495 155935 157107 168883 157927 152199 151685 143498 114449 90488 90936 86378 87506 88879 97934
18376 97934 95571 93833 104146 97270 78762 96573 104213 113803 121892 134370 133621 117491 111652
18363 111652 127930 134590 142326 148676 158351 162362 163184 160727 167463 169308 167746 166394 138978 133826
18349 133826 134563 127151 130522 127418 126652 128786 129984 135868 156413 168325 162110 152094 149476 147382
18335 147382 152233 153168 147233 151396 152506 137686 138574 143653 156246 155393 144884 162548 180841 184018
18321 184018 184673 174884 160489 166630 183700 183138 174515 186825 196157 185798 192525 190768 180891 184759
18307 184759 178628 177570 186104 202619 202015 195451 201208 221179 224445 226445 238785 232372 235546 248407
18293 248407 254542 253653 260990 265440 282049 324808 359461 379701 406723 418436 434092 450769
18281 450769 445278 423780 421734 441383 468575 485992 527813 586645 657406 763367 918725
18270 918725 1166547 1585619 2188812 2990502 3824668 4454078 4820788 5032696 5163315 5178083
18260 5178083 4958635 4412676 3653948 2883121 2259894 1832042 1556079 1377733 1253684
18251 1253684 1163338 1092371 1040790 1012439 986170 982777 993907 1018613 1060217 1146677 1265665
18240 1265665 1363661 1463824 1547519 1608146 1661535 1727537 1791118 1840540 1884791 1966346 2114850
18229 2114850 2300903 2517936 2742999 3043931 3491134 4230813 5357313 6947577 9282983
18220 9282983 12724174 17269716 22131155 25941034 28183194 29359024 30012023 30049503 28803445
18211 28803445 25931185 21867105 17558863 14032680 11726976 10538721 10235510 10704766
18203 10704766 11861947 13582583 15664910 17806917 19625783 20761757 21135315 20937203
18195 20937203 20524936 20392349 20814685 21821883 23262272 24870359 26318796 27271770 27741048
18186 27741048 28027978 28801907 31263278 36876928 46435261 57741425 65616515 67665174
18178 67665174 65065116 60755438 59495763 62902393 67206005 68839209 66939972 60704343
18170 60704343 51941956 42792348 34151194 26751492 20987141 16756862 13746170 11631005
18162 11631005 10154856 9094443 8290247 7653626 7123463 6686726 6376317 6206805 6222023
18153 6222023 6364743 6626257 6942613 7222979 7412688 7481134 7501853 7564761 7766709 8104331
18143 8104331 8526297 8944621 9300915 9510607 9531365 9351181 8901594 8263889 7545606 6855700
18133 6855700 6360036 6041106 5835283 5639548 5430498 5225644 5076406 5057877 5247343 5641216
18123 5641216 6178762 6824817 7580585 8515252 9701567 11127645 12742215 14551055 16619994
18114 16619994 18784168 20843757 22837925 24956021 27301810 30009897 33681729 39332219
18106 39332219 47170616 53381251 54592996 53197726 48901979 44551541 42341309 41164852
18098 41164852 40126598 39051397 37786910 36184932 34379544 32368125 30129411 27819239
18090 27819239 25580371 23442982 21413823 19406389 17421379 15551745 13775999 12079215
18082 12079215 10519632 9125642 7898134 6873531 6046822 5388259 4866097 4447005 4101638
18073 4101638 3804050 3548198 3336321 3166386 3028645 2895612 2771401 2659276 2553075
18064 2553075 2455408 2351170 2214934 2073530 1951471 1846790 1755430 1643360 1546834 1457867
18054 1457867 1376006 1285940 1201980 1133327 1065115 992077 933107 878741 833071 795178 760691
18043 760691 731404 703073 674810 652149 619907 588690 565365 547525 523807 502611 477407
18032 477407 450883 439800 431007 426690 428831 427950 442944 475964 494468 493796 513570 557946 595521
18019 595521 627511 662329 691823 712671 751413 803728 829866 854946 882341 916920 936841
18008 936841 952571 979930 1018716 1053892 1074381 1070320 1080804 1100421 1117300 1127549 1114237 1098152
17996 1098152 1074755 1046502 1018638 980029 963591 962292 964839 972487 1015999 1090316 1223738 1458336
17984 1458336 1796617 2212281 2604839 2850604 2855567 2700312 2454189 2235704 2167241 2286866
17974 2286866 2483653 2620509 2587250 2399594 2129926 1865061 1670819 1561265 1522184 1526177
17964 1526177 1570155 1663554 1821646 2095369 2478903 3032054 3818205 4878697 6199717
17955 6199717 7731304 9323657 10854342 12228851 13181428 13597612 13598807 13202390 12576417
17946 12576417 11989749 11599670 11482740 11713380 12229884 12914331 13685161 14330843 14806260
17937 14806260 15240708 15722053 16321190 17071251 17741447 17925108 17386690 16211637 14660463
17928 14660463 13153263 12115096 11793172 12226709 13217900 14415723 15427643 15935517 15922073
17919 15922073 15354132 14370131 13313460 12478109 11956442 11541792 11101654 10672805 10294268
17910 10294268 10033134 9823796 9624756 9508676 9542808 9675651 9900195 10273329 10867951
17901 10867951 11620128 12360070 13042306 13635650 14129327 14424281 14343984 13864816 13085136
17892 13085136 12124644 11153374 10305590 9661006 9308356 9217271 9307564 9529106 9722770 9705787
17882 9705787 9426682 8902091 8125190 7217523 6294806 5417477 4623729 3982636 3484111
17873 3484111 3117340 2876594 2693210 2540800 2398819 2272844 2155360 2077821 1994530 1905880
17863 1905880 1807534 1703652 1626983 1551860 1475963 1404509 1337459 1279220 1241020 1197543 1151036
17852 1151036 1111198 1074329 1056701 1034901 993106 948213 894934 858488 834429 791796 739550
17841 739550 671611 622515 582653 536446 508966 487716 464173 440654 432403 427561 400182 373451
17829 373451 343199 325375 288087 257318 244040 229938 215447 217170 224002 212789 209564 209207
17817 209207 204718 193466 179852 174183 164533 158106 145544 132210 118068 107904 108995 118981 120014
17804 120014 117546 106784 101504 93200 82263 82002 72415 61490 61742 65449 55089 49595 39147
17791 39147 41428 53864 62978 78135 77108 65824 62391 63230 61525 43008 38619 47758 58725
17778 58725 57170 59345 49379 56803 52805 37534 48345 52931 43919 34123 27660 26850 21219 6874
17764 6874 -2826 9107 17282 16815 25451 26184 26477 30416 34576 36496 32435 29029 17153 25777 44027
17749 44027 64568 64578 59166 60732 70129 72842 84651 88049 98555 120183 143477 162422 181002
17736 181002 183387 184680 177421 170793 152863 125452 115032 106428 97078 86133 66861 55935 47036
17723 47036 34737 35564 30743 40422 47968 44260 42373 48090 52673 62261 52086 52967 62158 85852
17709 85852 92361 100872 107538 114111 108533 111985 131772 145362 144696 137037 142275 156409 160992 176434
17695 176434 195526 218906 245946 284379 306756 333707 348408 350156 329796 309470 284751 248533
17683 248533 212773 179949 154664 140271 119622 103128 66857 42076 47012 54521 53771 47052
17671 47052 40577 35198 33887 43553 47094 44891 51341 65572 73810 70842 63202 58193 68902 75808
17657 75808 83028 84367 86595 97839 106924 107638 98138 102409 110621 115010 132839 150464 155394 152350
17643 152350 158475 171639 200221 200524 183381 164925 148388 144869 134429 121841 96087 72195
17631 72195 76712 73602 50442 20597 33925 63031 72013 60522 53581 60916 71782 78415 102589
17618 102589 123736 138732 165336 171313 174530 170921 168445 183362 199980 194505 189890 199201 225484
17605 225484 229857 227480 225200 221162 201506 195416 201317 177349 162917 146493 133848 138251 129733
17592 129733 118150 93547 88282 91042 76975 77043 76559 66671 67989 60577 53347 45843 31030 12317
17578 12317 25119 25814 11282 6110 8982 16025 16496 12119 10623 9537 13999 14882 338 -10181
17564 -10181 -4344 22417 26804 14758 17275 14066 12284 15110 18395 9095 18755 35573 12412
17551 12412 7176 16154 36998 36089 27219 17104 4171 379 63 -7771 -20976 -24611 -3375 15072
17537 15072 23776 23996 5998 12673 22230 14690 16546 19127 19276 -220 -9304 -400 -10303 -13286
17523 -13286 181 -7212 -6313 -1083 -9586 2112 11681 18275 27196 17663 11065 8697 12019 17668
17509 17668 22647 20807 17211 8610 6672 -5758 -9137 -8627 7557 -867 -10920 -18227 -14313 3679
17495 3679 6067 -4863 -9542 4925 13766 12666 -6879 -9817 -12699 -19410 -14477 -6096 -3157 -5478
17481 -5478 -8334 -7416 -5894 -7466 -5960 -4997 -15277 -19662 -20841 -21521 -24342 -27372 -24435 -12755 -5048
17466 -5048 -9476 -27418 -32329 -27357 -35595 -33994 -25563 -20045 -5157 5075 7714 -2295 -2747 -3816
17452 -3816 2464 15002 27711 28393 41326 40438 31166 46861 58360 59454 58886 54529 73756 119384
17438 119384 146585 155669 164761 160375 151926 126820 117462 114042 94845 73663 68083 60741 45814
17425 45814 57080 61432 79818 96631 88015 67244 52672 34825 19335 8830 6986 24595
17413 24595 27799 41527 54326 61457 64806 71884 66637 61630 58154 55903 47275 41473 38275 44422
17399 44422 48640 53205 72682 85910 93357 94730 104155 98816 91332 91344 77370 83016 81826 78734
17385 78734 63709 48644 52671 53627 70995 76488 62331 44566 50977 53283 49609 53994 58530
17372 58530 58477 53279 33148 24544 12068 7877 15758 12560 6258 13722 22514 22986 9757 10744 8983
17357 8983 18966 35433 39517 29115 25443 5221 -117 2338 17013 30639 25627 23683 17924
17344 17924 1136 3386 27698 30572 16844 7216 -14911 -12052 3305 1617 7935 12084 14103
17331 14103 2131 -6738 3118 10278 -7915 -8454 1333 19338 28349 32710 22277 15255 16356 33471
17317 33471 44446 35372 20928 18988 24173 33286 39535 19852 17583 24238 22916 13659 -2496
17304 -2496 -6786 -7399 16860 27960 18469 10359 4326 -3958 -6732 -4972 -12312 -13950 -21784 -16298
17290 -16298 -1283 -713 -7842 -11935 5447 14145 20106 16425 11496 3106 -4231 -4541 -4034 6179
17276 6179 13878 15927 4342 -1571 8900 -702 -6371 -11383 -9418 1994 -10275 -21488 -23456
17263 -23456 -9160 3452 14044 6780 2133 6589 -3650 -10841 -7486 -5473 -12386 -4895 -4327 -14829
17249 -14829 -29954 -23294 -5317 2336 3692 2710 6887 74 -4369 -5190 -6834 656 -10956 -28556
17235 -28556 -24835 -17721 -5049 7346 15255 22343 18067 17712 23297 19248 5964 -13021 -24949
17222 -24949 -18680 -9131 -13338 -13859 -29102 -26711 -10859 -15057 -18125 -5202 -5985 -10852 -10707 -11744
17208 -11744 -12505 -13158 -9567 -9422 -12695 -17241 -12932 -4949 578 -3893 1642 5715 -946 -7707 -5205
17193 -5205 -16870 -17020 -29491 -28450 -15403 -5101 -9251 8020 6770 2807 -9607 -10124 -6106 -1029
17179 -1029 -3971 -652 -3465 -1888 -1087 -1940 -13738 -16053 -23278 -18636 -10527 -10692 -11101 -7122 -4800
17164 -4800 -7228 1516 8877 -1229 -14013 -17535 -25467 -20776 -15325 -20116 -23206 -25372 -24101 -14837
17150 -14837 -17796 -14061 -13332 -19474 -10561 -7943 -19762 -12612 -3764 15946 17517 2950 -515 -11465
17136 -11465 -16303 -16340 -12848 -15169 -14205 -5870 -4365 -4698 -9288 -19971 -13802 -7838 -16639 -27394 -16246
17121 -16246 -8560 851 16737 28554 22336 9923 11992 12686 13288 11562 6042 5454 -148 9357
17107 9357 27944 35254 26213 12038 6424 -7793 -22282 -25692 -25526 -27674 -33360 -21181 11082
17094 11082 19538 12231 976 -5123 -2485 152 -10680 -15028 -2970 8177 13069 -7773 -2467
17081 -2467 16337 25750 15529 8322 2131 -5901 -10215 -668 -4858 -14493 -12445 -10144 -6157 -1658
17067 -1658 -2250 9117 -6493 -19353 -14144 -15088 -18439 -27627 -39430 -33130 -38185 -47651 -40252 -32678
17053 -32678 -26815 -13223 -6713 -8212 -4440 -16659 -17390 -11667 -17922 -21754 -27898 -28264 -30764 -14944
17039 -14944 -4388 -6379 -17311 -26225 -23451 -11169 -15819 -18452 -27405 -12026 -6278 -12619 -2714
17026 -2714 -3543 -14766 -14363 -4560 8073 -6406 -11370 -23754 -16001 -7375 -4206 -4284 -8874 -26288
17012 -26288 -25952 -17859 -9128 -13927 -24872 -16502 -9344 -11371 -11001 -9941 -9723 -17129 -23927 -23272 -10947
16997 -10947 577 -10204 -39602 -46884 -26843 -22255 -25299 -19643 -16784 -7694 -7280 -21417 -29777
16984 -29777 -21897 -26616 -18442 -20096 -18075 -21122 -30229 -25330 -14821 4880 2290 -21170 -26651 -22861
16970 -22861 -15227 -9643 -13608 -6790 -6739 -9860 -5552 -10823 -23516 -47140 -51667 -37436 -8743 5072
16956 5072 5418 -5971 -17729 -9536 -19329 -27813 -20832 -12279 -10615 -6320 -21425 -24271 -16648 -6808
16942 -6808 -14993 -8426 -2691 -14501 -27622 -36059 -29448 -21664 2057 10676 7134 8867 -1073 -7703
16928 -7703 4910 8926 2760 -5304 -1266 -10251 -24903 -25155 -26368 -36720 -35845 -27195 -19411 -12755
16914 -12755 -20854 -26412 -10946 -2585 -16868 -36890 -42195 -39255 -29397 -30961 -18243 -13733 -21322
16901 -21322 -40826 -36378 -22876 -18867 -10889 -6233 -9436 -16950 -1671 7376 -3807 -690 -274 -14958
16887 -14958 -14585 -11037 -8366 -18476 -27099 -20603 -12572 -8780 -10916 -8643 -6358 -3855 -1833 -3876
16873 -3876 -19489 -18655 -8631 1569 -1724 -7334 -12508 -11690 -22012 -22472 -14358 11133 12528 186
16859 186 -2936 -10558 -18122 -8816 2484 -11395 -17618 -17573 -12540 -3938 3852 7718 -5010 -3069 4178
16844 4178 16836 12154 4853 3471 2340 2117 1319 8924 8921 22422 18947 19230 8093 16066 2973
16829 2973 -119 10289 22163 22751 15619 9622 3935 10950 13363 2895 -4338 10600 20066 10648
16815 10648 4612 733 -11980 -23897 -25764 -14066 -5316 2927 12322 12210 315 -15048 -13282
16802 -13282 -2588 -12512 -17902 -8800 -12115 -17397 -4821 -9773 -13234 -9736 -16697 -862 -4750 -7657
16788 -7657 -4596 -8357 -508 -5397 -18481 -11023 -6092 3571 10425 -16474 -35482 -22477 -10378
16775 -10378 -15561 -14027 -5995 -4065 5563 68 8285 -7236 -17065 -23539 -28506 -29219 -24106 -7628
16761 -7628 -1677 -4052 -903 -3909 2037 7700 16032 9425 -12053 -22800 -31267 -31599 -26679 -10606
16747 -10606 -5043 -7826 -6955 -16656 -11825 -14230 -8923 -9870 -9914 -7270 -8019 -17219 -26260 -23529 -13697 -6152
16731 -6152 -8556 -10476 -10228 -17223 -11751 -8888 -3241 -6618 -16303 -12149 -16945 -19542 -18476 -22160 -20261
16716 -20261 -28663 -42851 -43425 -39805 -35254 -36069 -23711 -27162 -34482 -28565 -12035 -4462 -14483 -11557
16702 -11557 3183 10711 6866 -7494 -5460 -7803 -4352 511 11442 7690 -15550 -34216 -31555
16689 -31555 -24381 -25174 -19608 -15699 -6574 -5188 -9552 -21190 -22118 -26037 -20921 -21606 -25923 -30557 -30789
16674 -30789 -25186 -16683 -8386 -2184 -2647 -1570 -8032 -15677 -19115 -15418 -14983 -14509 -14981 -20293 -21215 -26206
16658 -26206 -25027 -11364 -12866 -15861 -28970 -32919 -22800 -21620 -30134 -38240 -19526 -2449 14124
16645 14124 22095 28585 4960 -13989 -22390 -11728 -4045 -5698 -6728 -14165 -15738 -524 7118
16632 7118 6167 -2430 -11511 -1115 6092 8774 3580 -9822 -19194 -24786 -31559 -27434 -30730 -32834
16618 -32834 -47884 -45744 -34968 -24130 -7002 -11353 -33468 -24681 -7533 -8605 -11923 -11997 -17203
16605 -17203 -12028 -12206 -11620 -10575 -4653 -1708 -11363 -13395 -31602 -27939 -19246 -4018 -5179 -10225
16591 -10225 -7966 -2629 -4401 -8391 -10409 -16385 -12819 -3645 276 -2368 1613 6670 972 -5158
16577 -5158 -935 6946 8107 -786 -20180 -20157 -20437 -17270 -19451 -33325 -31312 -20200 -27565 -29823 -36835
16562 -36835 -38606 -39255 -36857 -28713 -19838 -1449 3726 3476 -2609 -5831 -937 2200 -8167 -15167
16548 -15167 -17128 -10217 -10075 -8745 -237 -3003 -14061 -5467 2836 -10746 -19315 -19204 -12182 -16127
16534 -16127 -16242 510 -7382 -18828 -10160 -6032 -14563 -15391 -10935 1552 9520 22317 14011 -15304
16520 -15304 -18979 -15971 -4215 125 -10782 -60 5295 5425 -8703 -15086 -10495 -11622 -23506
16507 -23506 -25077 -23135 -7870 4456 -6093 -16175 -10506 -20916 -10338 -13153 4741 6593 -1561
16494 -1561 -1702 -6488 4834 9735 -3270 -19331 -14033 -5677 -14910 -18593 -22610 -29888 -39230 -38788
16480 -38788 -33881 -13961 -2090 -735 -9384 -16269 -24086 -6506 8073 -6049 -13834 -13612 -17543
16467 -17543 1880 2647 -6124 -17583 -21521 -20208 -1911 -9065 -12021 -17215 -7331 -3851 -6590 6507
16453 6507 17669 -4166 -20809 -23329 -28426 -35112 -34952 -20892 -6973 -11084 -5592 11159 7453
16440 7453 -7099 -20222 -38740 -45070 -46855 -43681 -39389 -48406 -37966 -20584 -10478 -5157 -11498
16427 -11498 -3393 8158 7665 6354 18766 6225 332 -1514 -1830 3758 4007 10149 14210 -2570
16413 -2570 -17003 -21354 -21912 -10250 -8239 -5489 7108 1039 -1322 9213 4732 13532 17257 5222
16399 5222 -10001 -12055 -7383 -8533 -1288 -3737 -2967 -12991 -22363 -9593 -4941 -6494 -4569 2247
16385 2247 -2291 5284 29037 28046 9216 9059 6259 -9702 -14377 -12850 -10322 -9334 -6099 -4263 -15251
16370 -15251 -21164 -11574 -6854 -11954 562 -9042 -28156 -42687 -25671 -17829 -15143 -5881 173
16357 173 -14811 -24229 -18107 -7112 -4272 -11325 -19496 -12393 255 -1455 -9823 -16276 -24131 -14498
16343 -14498 -16585 -10554 -9285 -18056 -27465 -28430 -39820 -43582 -50002 -30911 -9653 -818 -5699 -15252
16329 -15252 -15824 -8482 -7914 -9668 -15925 -22085 -20723 -15809 -5974 6736 2960 1965 10142 12224 1472
16314 1472 -876 -10247 -16453 -3908 -5078 -14057 -7985 -734 -14149 -10080 -962 -5492 -10017 -4931
16300 -4931 -7586 -13029 -14147 5958 10247 -6896 -5392 -10234 -19558 -28016 -18051 -5563 -8190 -22213
16286 -22213 -24887 -19112 -23573 -12567 -1278 -7769 -18889 -10237 -3665 -11290 -18274 -27556 -22750 -21926
16272 -21926 -23751 -5840 -6049 -14489 -7144 -12135 -15350 -6294 15950 18765 2037 -1988 -11599 -12791
16258 -12791 -17660 -19986 -19752 -21359 -16662 -5524 -3681 -1287 2924 7040 4263 -13963 -11914 -5672
16244 -5672 -10519 -16520 -18926 -16781 -19154 -25944 -28782 -18183 -12937 3474 7185 -8793 -26750 -30259
16230 -30259 -23657 -18856 -21954 -17390 1590 17057 29649 41636 27381 3903 -2625 1332 6643
16217 6643 8527 18229 30861 27621 27811 17297 9686 16604 17868 16032 1962 3573 -545 -7127
16203 -7127 -17254 -15608 -12037 -6583 2886 4693 2333 -12903 -12493 -15947 -11804 -10418 -1666 -9453
16189 -9453 -13756 -10890 -1355 8128 11800 6868 1366 -7155 -17401 -12140 -1602 3185 6026 -1907
16175 -1907 -15808 -23460 -18290 -22550 -36274 -22922 -15688 -30716 -32603 -29655 -16479 -29768 -30584
16162 -30584 -25778 -26480 -6079 -5781 -15107 -19253 -16513 -17747 -23465 -13917 -11007 -18139 -23010 -17196 -6641
16147 -6641 -6234 8866 8114 17160 8980 -5054 -8550 -10731 -20035 -23847 -21897 -6698 -4129 -1681
16133 -1681 10608 7495 9107 2894 4270 21275 28205 19472 9293 -5338 -12463 -18133 -18898 -15409
16119 -15409 -6264 4361 1295 -361 -3375 5057 3263 -8244 -14072 -18220 -20631 -7164 -2039 2361
16105 2361 -3711 -1690 -3879 -5790 -13834 -17054 -27234 -25956 -16051 -10515 -9132 -6465 -1722 -2423 -7700
16090 -7700 -17225 -6681 9 -7916 -19681 -18758 -4319 4225 -1783 728 9723 -8908 -35629 -42666
16076 -42666 -39938 -25921 -21673 -19356 -11250 -70 -3837 8291 14270 16376 10472 -4750 -7341
16063 -7341 -12846 -8467 -17461 -30399 -15112 -13916 -20957 -19657 -30640 -12779 -8045 -10809 -10368 -5923
16049 -5923 -4062 -20390 -17764 1036 17757 15704 21168 12053 -3733 -3863 11127 -8905 -22830
16036 -22830 -29617 -4910 17751 30622 24884 25583 34269 38866 34476 38708 37221 34776 41994 41578
16022 41578 38480 50243 57304 66744 65747 48369 23956 17063 1851 -1949 4202 6589 -12966
16009 -12966 -11758 2961 732 4174 833 4265 16444 18852 15433 5834 19291 30342 27554
15996 27554 15121 12915 23963 21612 -7336 -20702 -26270 -25986 -17674 -13710 -6496 6199 -881
15983 -881 -17479 -17062 -17878 -10004 -8013 2032 5869 7685 9014 -2212 -60 4246 11776 16680 4647
15968 4647 -8942 -14555 -762 7766 16465 3730 17175 19195 5070 1178 -9424 -18827 -27637
15955 -27637 -13225 3717 2022 -1201 -3860 -1734 -10934 -9556 1652 749 -7971 5205 4340 -1842
15941 -1842 3701 -3521 -5372 -4433 -3182 -4207 -2733 3844 4238 -6598 -9856 -9609 -17646 -15926 -21067
15926 -21067 -21786 -13125 -23807 -33475 -26101 -21802 -35307 -37554 -21578 -5047 -4774 8893 14834 15893
15912 15893 14926 3377 -1370 10985 24015 18313 -78 -8615 249 4906 12746 14868 -2978
15899 -2978 -9953 -9931 -3769 877 74 3238 -1682 -3310 -7969 6178 6346 -2665 -9838 -8681 -12127
15884 -12127 -17232 -11352 -20083 -9100 1222 7684 10417 12237 899 -9979 -9263 -16849 -17373 -10301
15870 -10301 -7618 -14641 9041 20187 20679 1076 -3641 -993 6223 9880 17877 9301 10193 21057
15856 21057 13812 5282 7355 11873 1414 3469 11561 7529 16538 23116 24224 11680 -3419 -15678
15842 -15678 -15340 -20906 -17930 6342 6998 -5238 -15033 -14104 -4566 1526 2952 4812 1125 -2283 -7958
15827 -7958 -19888 -26203 -23966 -19960 -19373 -11663 -5023 -2404 -14121 -7466 -4428 -7841 -6868 -23153
15813 -23153 -23765 -13872 -3726 -18286 -32473 -24378 -9745 -2824 -1730 2874 12174 11891 6168 -16979
15799 -16979 -39950 -31334 -23700 -13185 -3579 7466 19040 17929 9392 17105 14060 5538 -2059
15786 -2059 -2540 1339 5752 19268 28776 16368 14946 16073 10163 1011 -1433 -1016 2806 -5499 -14547
15771 -14547 -12626 -7116 -7738 2556 2888 -17744 -18159 -11837 -5879 2673 59 1178 4243 8353 1202
15756 1202 -5840 -1942 -1563 -2714 -14810 -13602 635 -2403 -17625 -11785 -15438 -9964 -9459 -18842
15742 -18842 -17063 -34471 -30829 -9451 -8527 -18613 -18286 -702 7139 -8497 -11141 -5459 -9164 -10913
15728 -10913 -21455 -29502 -36247 -41271 -22338 -4034 -12753 -14310 -18157 -20285 -22674 -22901 -17646 -18712
15714 -18712 -17596 -21415 -28281 -15919 -2585 -4825 -14200 -24946 -14020 -6159 -8769 -7492 -3354
15701 -3354 -3378 -7692 -19316 -33896 -13252 1144 -770 -4235 134 2590 2968 -9672 -15214 -7203
15687 -7203 -16263 -21820 -11305 -2571 -10795 -11025 -807 755 -110 -2089 -10577 -10789 -3111 -6053 -7090
15672 -7090 -6255 -8851 -1629 2049 3671 10318 12451 13330 1197 5903 641 -8563 -5985 8847 16875
15657 16875 12595 1258 -16074 -14826 1557 8082 -3685 13625 23756 24812 12248 9134 5428
15644 5428 -12483 -16022 -9579 7879 5404 -8574 -33560 -41112 -8564 4900 9113 97 -6428
15631 -6428 -9651 -19790 -18171 -14692 -9892 6604 21218 27239 22248 13450 8059 4956 -1317 -14276
15617 -14276 -9128 -8 -2653 -1561 3901 8479 932 -14303 -13774 -14034 770 12394 21474 9809
15603 9809 3231 -5312 -7117 -20831 -18364 -20953 -18845 -22444 -14364 -1450 6104 6991 3567 650
15589 650 615 10287 11496 16734 22403 16613 20996 26285 23079 28243 25840 23367 15897 13589 15898
15574 15898 16613 16000 17862 23220 21130 11157 10065 13796 14296 5380 -1340 -16220 -20014 -4257 11959
15559 11959 11418 -2260 -4119 -3458 -5149 -8724 -10768 -14502 6875 14748 13474 9841 8183 11057
15545 11057 24205 28241 22097 1940 -7748 11894 15034 4986 -6213 1657 -5610 -9990 -10147
15532 -10147 71 -7198 10143 25347 30237 23718 10598 9713 13695 12197 108 -5933 -11807
15519 -11807 -4530 9261 12478 18395 29593 30137 19420 11721 9150 18331 23539 22295 19134 12577
15505 12577 -3396 -12167 -11883 3586 7683 5205 22052 31464 29884 36205 43169 42178 42012 40367
15491 40367 43931 56017 67673 75101 78002 85733 101665 125261 159147 203944 260532 345110
15479 345110 444398 538472 629041 699207 741622 767453 754750 724098 667807 590906 498773
15468 498773 419903 345403 277709 215576 164904 132355 117179 109370 111412 94162 79852 71640
15456 71640 58936 57673 53359 48472 43020 51921 68575 60139 41720 40938 38191 36754 38022 25656
15442 25656 18409 22033 27752 22024 15912 18164 19334 13300 13637 16594 18237 15438 26166 18022
15428 18022 12900 21338 16796 16902 30337 22488 25032 32599 27038 29381 38625 40881 26793 12648
15414 12648 14288 14873 9168 14585 24150 27925 33725 27661 25481 27746 11063 13248 24054 34417
15400 34417 33359 20282 11255 8898 8789 12995 3767 1574 -12935 -12878 -12616 -13901 -9298 -5298 1386
15385 1386 1166 -5206 -11627 1807 12818 10842 11089 15920 27148 39070 45026 44276 38529 32690
15371 32690 28014 38305 27641 17411 22493 37225 39662 32057 28359 33153 35089 31567 32560 22960
15357 22960 20025 11468 25356 47771 50292 43923 29463 26071 26375 30446 33117 50216 55652 40671
15343 40671 46370 59191 46884 53303 52793 61042 60769 47250 43090 36915 29050 22833 16639 10321
15329 10321 13059 28642 31431 22528 18942 17275 10726 6949 6618 8129 1832 490 11412 24052
15315 24052 16898 10492 622 -2596 -3488 -2831 5087 24591 24538 14318 15251 11390 20055 29226 24435
15300 24435 24589 24475 25878 22136 32086 38694 43906 59966 71814 68420 75181 68246 71777 85273
15286 85273 89607 89199 97384 105322 102761 91172 86789 74535 66189 63789 59950 50220 32922 33601
15272 33601 31219 21338 8689 3930 8937 9021 24066 28577 23961 20003 30614 39849 47978 40990
15258 40990 40531 43591 40151 42341 23265 8818 14572 18782 19312 15300 29112 39947 34982 35486
15244 35486 21480 9780 18783 17770 8310 4089 1985 -9194 -12957 -8694 -9154 -2484 -1649 -17356
15230 -17356 -33551 -25411 -23868 -38308 -23928 -17455 -19959 -21950 -16373 -11219 -1000 9816 21230
15217 21230 33832 38815 46905 54929 55169 69182 68338 62506 54434 44250 47997 53086 54864 53352
15203 53352 62275 69270 62627 47261 49818 71482 96934 106751 105303 91039 78729 79923 76300
15190 76300 72965 80056 87737 82266 88843 93640 96278 95126 98772 95428 92327 86669 85872 71345
15176 71345 80921 96279 92867 88321 91267 87291 75689 72821 75115 72830 74006 81701 76248 74175
15162 74175 99840 130545 128126 136118 141994 149100 145712 152582 166824 155499 157191 158017 139319
15149 139319 131128 142919 150377 143936 131932 133559 132545 128699 133771 149075 153171 157261 151695
15136 151695 157454 168047 180642 189402 183465 180086 187474 185487 183449 189992 190179 190673 201282 213850
15122 213850 221307 223564 241176 255668 258703 259183 250901 252038 252318 252577 257407 260020 259426 261336 266885
15107 266885 286475 296359 302425 309328 309292 303974 327903 360270 370908 363986 374385 384118 396619
15094 396619 390699 394642 392812 395323 417921 439376 461116 465908 461722 471701 489550 518345 531740
15081 531740 516123 506166 509466 522637 539145 568928 622595 679469 720162 763061 821111 898677
15069 898677 960230 1015471 1074592 1148869 1223044 1296494 1391550 1490344 1598373 1701937 1831374
15058 1831374 1979708 2160474 2370977 2620009 2937564 3316777 3772512 4338786 5012688
15049 5012688 5781239 6656748 7629979 8727835 10019152 11578931 13602241 16393226 20470791
15040 20470791 26595791 35567517 47769600 62900383 80345423 99019434 116997038
15033 116997038 132005085 142416227 147142047 145581049 138054016 125748321 110296926
15026 110296926 93496778 77030654 62093809 49417714 39238276 31450332 25718800
15019 25718800 21569617 18516517 16203655 14380415 12906007 11724166 10764644 9972356
15011 9972356 9338884 8840573 8444512 8077239 7719570 7330083 6905368 6404623 5852820
15002 5852820 5272942 4719826 4194579 3721884 3299074 2954068 2673388 2437584 2242945
14993 2242945 2081758 1957935 1855200 1772473 1708297 1642461 1560993 1483703 1410720 1333698 1266246
14982 1266246 1192916 1113001 1018239 936139 853218 803276 761258 711632 669646 626790 592873
14971 592873 555004 525640 508225 483952 464968 441879 410884 404365 391605 372385 379265 379798
14959 379798 381840 368826 341345 306166 295882 288799 267594 248626 236439 232444 240968 253034
14947 253034 268154 250877 239687 232980 216924 201316 199513 191904 177732 163562 156637 141053
14935 141053 131448 123663 117033 116302 122637 116714 111816 101680 99302 109454 114014 112873 100896 99771
14921 99771 97345 97265 98512 100407 96417 104812 107450 110019 102651 106652 109335 89364 87219 95636 102246
14906 102246 102534 87438 72736 86299 91433 86596 77438 80757 87791 88321 79520 83571 80507 89500
14892 89500 103767 99474 87624 69500 63983 35656 36267 39631 34143 25809 18644 34774 41034
14879 41034 41879 31880 33715 38434 29271 41004 41271 32365 35251 35094 41063 38750 28586 16491
14865 16491 22106 16846 9151 6479 29034 37566 33999 20646 18281 12311 12223 24453 27892 35475
14851 35475 37943 26167 31121 35344 29701 26824 27426 43448 71409 82275 87145 90159 91732 96875
14837 96875 98926 88956 84044 91169 104213 102779 87200 76728 73445 65492 59816 56803 68373
14824 68373 68854 58342 54863 50448 47815 39101 34087 42652 51305 55292 44739 28435 19436 27728
14810 27728 26633 11193 8077 14422 10079 5924 31040 41299 39728 29791 24100 35348 48014
14797 48014 46410 56256 59765 56436 58659 55208 42517 41558 51764 55622 58297 48499 41359 40869
14783 40869 39232 44323 42500 39876 42692 48186 41071 34638 19466 12028 10702 28576 38860 50678
14769 50678 45973 31866 29321 37946 42817 43987 43553 43652 28922 25811 39349 31764 32672 27686 19094
14754 19094 25897 34470 40287 41998 42663 48288 27183 9485 7861 9558 6728 8201 12876 9743
14740 9743 -2039 -9390 -7875 7963 10677 27062 35011 23055 18374 16897 17452 8246 -12134 -16963
14726 -16963 -26357 -26480 -10474 -18664 -36672 -61719 -69798 -52656 -48975 -33225 -28354 -25359 -33347
14713 -33347 -36255 -28322 -30548 -36865 -39705 -40388 -28395 -15539 -13518 -9685 4165 17344 14323 2248
14699 2248 4997 14710 16622 13084 6524 -4648 -12785 -26718 -30781 -30231 -13341 -2441 1583 2848
14685 2848 -3790 -4975 -1508 2806 1482 13912 27114 32039 15802 10715 8150 3984 8522 12386
14671 12386 14893 -3137 -14295 -23522 -19704 -2537 5083 4059 2643 6807 4524 -953 -3647 -15671
14657 -15671 -18881 -12785 -7378 -1561 513 -18010 -19280 -8783 5619 7647 -110 818 12342 14756
14643 14756 12722 14274 23831 -552 -10752 -8881 -3136 12902 15856 7350 -10345 -14804 1314
14630 1314 17019 11075 6257 13299 12439 -4920 -3399 2879 14214 19213 8791 8393 16466 12541
14616 12541 -3679 -8057 -263 14829 20794 21199 13751 -15322 -27389 -21836 -13967 -6968 -3135 3040
14602 3040 10339 21333 28618 34452 48233 66849 86091 87882 94720 105310 125637 149728 192650
14589 192650 261866 343021 429020 517051 592258 665883 723857 747293 736981 707313 643806
14578 643806 569130 477985 411836 343245 283055 221098 178838 154772 137894 104410 80752
14567 80752 75632 61444 48748 49455 59771 59781 65883 69021 51680 40546 37402 31866 29486 26335
14553 26335 22604 17561 26257 17609 5184 -2578 -18788 -7438 10620 17836 20090 15483 7370
14540 7370 10604 11778 8874 12530 13423 4270 -10990 -4972 3745 -6232 -9970 5621 15253 28100
14526 28100 15270 5286 -1521 -11418 -24534 -17234 -13322 -8650 4382 -3586 17 -1558 -10000 -11297
14512 -11297 -11668 -12666 -7889 -419 8441 12898 5534 -6413 -4668 -10670 -11757 -9301 -9143 -18768 -29273
14497 -29273 -37230 -26529 -82 11139 9844 1357 -9021 -2158 6544 -3258 -8245 -10788 -12906
14484 -12906 -28737 -39353 -27862 -10132 -10465 13 11097 9518 14074 20965 15755 10729 -2689
14471 -2689 -9687 -5891 -17670 -30120 -26083 -14029 -6813 2066 -1037 8339 18342 11227 9139 6325
14457 6325 19623 25683 20603 7316 4475 6439 -6435 -8351 -4610 -16969 -7090 517 -6821 -8528
14443 -8528 -9605 -6616 -13743 -14726 -9141 -10332 -20563 -16250 -20294 -18534 -7092 1424 -7705 -8543 3340
14428 3340 13797 -4706 -10087 -1679 38 -8870 -20693 -32055 -28618 -15185 -10832 -8968 -13528
14415 -13528 -6785 1600 -2028 -15993 -12096 -25242 -36406 -28793 -29850 -37837 -28281 -20851 -13855 -2040
14401 -2040 -3254 -9869 1011 11526 11429 -9130 -22904 -14592 5630 1346 -2441 -392 -743 845
14387 845 -3617 -3430 -18899 -12524 -6663 90 -10217 -22955 -25425 -22921 -23463 -23440 -18446 -12473 -4255
14372 -4255 3171 8690 5297 -1092 -10006 -8091 -1515 -4783 -3589 2678 2277 -11021 -16541 -8238 -2744
14357 -2744 -8423 -6893 -9046 -22541 -29732 -25819 -11013 8531 16005 -1044 -2307 14846 12349
14344 12349 8945 5680 5883 14395 -2334 -4640 4668 7667 7100 6194 -1241 -15088 -12575 -8060 -2147
14329 -2147 878 1235 695 2757 -6823 -3617 -3808 825 -2035 -12923 -2324 11048 17469 16696 6194
14314 6194 -304 -261 -3718 -10133 -5192 -18697 -29862 -28431 -29255 -23494 -26619 -26755 -19214 -9697 6792
14299 6792 10819 4333 -2591 14942 19637 12362 -2421 -12673 -5071 -17984 -20303 -19866 -21184 -23466
14285 -23466 -39142 -41315 -25632 -28151 -28660 -21109 -13950 -13570 -12710 -15488 -3847 18824 21422 17386
14271 17386 4208 -8004 -15552 -7775 -11761 -8483 -16099 -27772 -26979 -11142 -7662 901 3859 -2911
14257 -2911 11138 23534 6253 3991 9967 2344 6020 11308 24321 29813 12866 816 -7450
14244 -7450 -14776 -13458 -9882 -3577 -2552 2082 -6754 -17056 -9914 -11875 -4355 -14469 -9123 -8048
14230 -8048 -7580 -10810 -6939 -23331 -16220 -17632 -15047 -5898 1774 -7009 -11371 -11669 -20204 -30247 -35729
14215 -35729 -26322 -8319 -4726 9407 23679 6464 -11145 -11506 1812 -272 -12049 -9171 17128
14202 17128 21084 11806 3504 10635 8773 5547 15176 -1345 -20582 -22990 -23073 -13454 -4991 -4602 -6712
14187 -6712 -21300 -24705 -15110 -5782 -3754 -11941 2146 11452 16906 11307 15746 7451 -3728 -13274
14173 -13274 -5105 5944 6571 10955 15602 13518 8934 6336 12165 -2918 -11683 6642 2955 -6048
14159 -6048 -9988 -8253 -13011 -24846 -8564 7368 4358 -9420 -22391 -30197 -26559 -9932 -2144
14146 -2144 5362 1731 -1565 11706 13711 3614 14565 10333 -13703 -30167 -28979 -20083 -11892
14133 -11892 -23042 -25452 -20263 -12644 -13497 -7386 -3440 -11388 -11352 -11309 -25784 -36653 -10075 6297
14119 6297 5239 21178 16982 2952 2969 5481 12554 16982 18677 10302 10579 6496 -2603 -1152 -4030
14104 -4030 -9347 -3799 -8217 -24934 -8921 -6483 -13905 -10893 -3298 -13 11043 9529 -8064 -16499
14090 -16499 -2799 4210 8704 13679 14408 15177 8576 4246 3723 -4582 -4777 -9685 -6068 805 -4337
14075 -4337 -6523 -686 -12493 -7513 10265 16112 1123 16351 30744 26988 15794 -18261 -20664
14062 -20664 -17581 -17098 -13299 -17811 -4997 -6579 -12553 -24139 -13071 -8972 -17042 -13090 -12320 -5098
14048 -5098 -15181 -25417 -15073 8832 14305 9068 8339 9205 14607 5225 -8401 -11941 -11251 -14005
14034 -14005 -14241 54 935 603 -2008 -2084 -2908 -10274 -8772 -11990 -12012 -7476 -7486 -6192 -7381 -143 4001
14017 4001 8779 19078 22619 27430 30149 29012 27315 12368 -14740 -20841 -8268 -2238 5502 308
14003 308 -687 1781 216 -13651 -10672 -2043 -6267 -18125 -5348 -2063 9363 27083 19525 13147
13989 13147 19076 40263 52405 60305 72599 75803 76006 104439 141480 171660 211518 304589 418825
13976 418825 552240 683605 797409 884118 965721 1009826 1015241 974271 888531 763261 637834
13965 637834 528588 425510 342968 289050 232563 178879 156366 141081 115953 91372 67839
13954 67839 65964 72085 63409 42851 30074 33764 32071 19398 16363 14601 11801 11950 30343 42052
13940 42052 38616 18058 7739 1011 -2361 5053 2098 -12805 -21102 -17832 -7864 10054 21277
13927 21277 26869 36910 42298 28511 17284 26247 50757 68322 57061 52805 43499 38555 38255
13914 38255 34720 31868 21708 3877 -3184 -258 3311 2541 5626 14661 14989 23504 29654 13794
13900 13794 -2544 -8608 -13750 -18594 -8808 -994 -10963 -16240 -10934 -17000 -13429 -10554 -6203 -5524
13886 -5524 -9607 -4530 -7299 -13221 -15726 4382 14924 7758 -7036 11664 19664 15730 14631 14153
13872 14153 14379 -5840 -21505 -33085 -11304 -2408 2772 -5177 -11636 -7730 -5266 -5974 103 -9305
13858 -9305 -16044 -16862 -11770 -7639 9982 13157 10587 8055 19353 28749 23078 13327 18526 13618
13844 13618 8910 9597 12088 21661 19597 26089 13450 -8132 -8964 -5626 -16893 -13333 2636 8733
13830 8733 4548 9813 1411 -14417 -17755 -31223 -28254 -7076 5473 9989 10959 12219 24130 20525
13816 20525 19383 33620 37667 42911 35508 30840 26960 13622 16588 13283 -3321 -10600 -14658 -1817
13802 -1817 15241 12519 -15 -4282 -957 -18962 -25061 -16510 -18359 -7119 -6198 -9753 -7207 -2354
13788 -2354 -5647 -11109 -5246 -18249 -18136 -1656 -296 8326 -2698 -3183 12 8958 16521 17320 23028
13773 23028 14508 8030 -7006 1396 21194 20143 17452 13784 -2516 10158 10650 246 -76 5517
13759 5517 146 5881 11795 4049 564 2855 8929 7353 13095 16881 -3523 -2953 -2457 -2653 -4689
13744 -4689 -1517 8770 19043 21228 16032 11525 8024 12415 18111 24222 18978 34437 57211 69285
13730 69285 62781 49699 45736 52423 60478 64577 56346 67376 80520 77148 62506 47310 40066
13717 40066 37265 28584 25517 31894 30038 17334 15059 17949 15879 1762 -6301 10157 18319 28581
13703 28581 28929 26604 23301 9407 6586 -12065 -40140 -32817 -9058 -5170 -10352 -14945 -6061 -9687
13689 -9687 -6868 7211 13905 13235 2186 -3040 -16366 -17544 -14501 -21372 -13323 3654 13414 13482
13675 13482 17411 11436 19408 23927 17144 6540 -9972 -10908 -10715 -9761 -14582 -13077 -24458 -20854
13661 -20854 -5813 -11118 -16377 -9201 -6602 -5939 -19809 -35933 -30971 -21466 -24581 -19106 -4593 -8787
13647 -8787 -12214 -9491 9472 17477 5911 -4995 -14307 -5594 14211 10160 6927 19467 28415
13634 28415 19343 12226 18494 21635 19557 19941 8752 -334 -10804 -15186 -11979 -12918 -3005 13816
13620 13816 23347 5246 -3455 -14994 -10554 3997 7463 -1977 -3859 5469 -1184 -711 5193 7776
13606 7776 5385 9461 14943 9929 6028 4465 11628 2514 2352 15333 6706 -2642 -1968 9600 21661
13591 21661 19783 15964 7640 6413 8958 2432 639 8620 6934 8635 12116 8908 7148 1788
13577 1788 7470 3088 -411 -1822 13478 27008 24708 17138 14827 25849 29917 30668 25748 12774
13563 12774 9235 -2279 -22704 -24335 -15785 2755 16910 17125 21836 22182 22022 15862 9921 15976
13549 15976 19496 20376 28879 30126 26364 21076 20551 11297 408 3744 20425 22895 22282 17362 18420
13534 18420 40250 37659 32879 31956 63648 72410 82495 90541 101441 110998 111252 100222 85279
13521 85279 89773 100094 90205 67464 46852 46399 35212 18676 24219 29409 13013 -6399 840
13508 840 -1836 -5690 4553 11723 28255 32020 29126 29823 21671 14574 5275 5997 112 -9057 -18111
13493 -18111 -14516 -11589 -59 1807 -1889 10962 3629 -11228 -17883 -3407 362 -3524 -9180
13480 -9180 1253 4182 -1133 -5484 -4350 -2516 -739 -1009 5319 -8484 -7643 16828 12988 -5646
13466 -5646 -11270 -12329 -13341 -18635 -10649 -14990 -8288 -5692 -8256 -9388 -7124 -1446 -13262 -11968
13452 -11968 -6503 -5197 -1441 -17012 -30868 -26248 -22648 -8259 -4766 -9895 -19724 -12307 6581
13439 6581 13908 3799 -6374 -19594 -28429 -21492 -14093 -3325 961 -2331 -7314 -10203 1674
13426 1674 10973 8138 4397 -614 8385 6621 -1403 -2529 13385 11650 13743 -1762 -15761 -17549
13412 -17549 -26992 -36415 -35753 -26090 -18853 -14894 -6942 9724 459 -650 13847 14616 10608 9878 10058
13397 10058 2185 -3698 -5484 3899 -5552 -14982 -11848 -9776 8246 12091 15150 17298 12240 1238
13383 1238 -174 -11331 276 -5431 1702 8064 2584 9699 5903 2020 -6692 1603 18648 19810
13369 19810 18006 16517 11363 -3892 1825 -1512 10059 5195 -5147 12133 24205 31056 21062
13356 21062 18857 27932 27801 18722 13292 12273 7690 2843 7141 1871 635 4695 2720 -2060 -11349
13341 -11349 -4476 -3879 -18145 -10049 -7565 -12707 -8187 -1520 6547 5019 6430 13927 22677 18818
13327 18818 13552 20023 23001 25529 24538 32170 37619 31775 20811 16602 30685 35953 24213 20453
13313 20453 29927 26890 23673 29447 27860 22081 22895 27094 12414 9481 18541 14250 21178 28646
13299 28646 32153 24556 3926 -4527 3916 3925 2156 1763 3059 -11600 -10498 -15005 -11356 9203 24521
13284 24521 31624 21821 17717 14411 11127 4808 -11793 -14513 1651 22825 22772 34089 43769 39898
13270 39898 34285 25005 18846 16602 8534 -6601 -2627 6373 9902 8975 6475 -3202 3722 -956
13256 -956 -6760 -7948 -502 9154 5372 15537 23320 15039 9479 -5456 -2783 13506 18317 -702
13242 -702 -12655 3547 21700 16669 7158 14440 13265 18410 25915 24409 12965 2452 4791 10253
13228 10253 1078 -14840 -19007 -19370 -5065 4556 5383 10965 19086 22595 20317 21139 1825 -15457
13214 -15457 -6521 3456 3529 6905 8049 11271 10433 6914 4343 6057 13370 8472 9972 12964 20126
13199 20126 21318 22167 32957 27598 19488 18271 14268 23019 38954 38373 16669 -11535 -11139 14263
13185 14263 6406 6164 24202 21970 18316 19201 16013 13477 4712 7531 12399 27744 23880 412
13171 412 -738 4409 -2106 -22072 -30767 -37052 -23389 -11722 -8701 -14815 -12455 -4633 -876 10494
13157 10494 4534 9834 19183 22000 17660 16490 22887 24598 21062 16341 30142 31662 14116 9042
13143 9042 5830 6832 5112 9115 8043 11111 5601 -3793 -2886 1932 16838 15805 8002 3220 10637
13128 10637 -22 -11283 -15651 -7294 -6955 5126 13104 9496 -10876 -4713 7051 10654 6190
13115 6190 11037 14723 12401 11122 13801 18573 25965 30560 38814 42928 41991 26308 14381 19069
13101 19069 24453 17298 18779 15224 9416 30202 33083 26594 31776 28727 21061 12169 24627 31046
13087 31046 27646 31840 43567 44230 41780 30857 4510 12357 32379 42708 53146 50954 47785
13074 47785 39186 37997 32270 23300 15437 32538 48171 31771 21022 31089 36773 39040 32244
13061 32244 16611 20027 32813 36026 45683 48181 31726 20703 21970 29247 31096 23311 31513
13048 31513 34758 27492 26035 34211 50509 69388 54000 30013 19498 19705 15037 21089 29883
13035 29883 32223 28210 30675 32893 34539 41762 33142 12956 12042 14598 4638 3347 9690 15995
13021 15995 35335 36519 32426 25685 18374 15039 11972 3237 -2279 2258 6248 9210 16852 14956
13007 14956 12679 14055 7220 8361 19586 12346 11527 8938 8546 6709 11034 12661 7969 12515 13859
12992 13859 9517 5980 36285 47977 23278 23858 28829 33984 33293 40766 28751 24425 16315 12530
12978 12530 11322 8262 7770 23329 51010 71570 84538 94457 99120 113264 148398 186032 239663
12965 239663 307205 394659 482758 566794 664369 736763 769305 778144 749847 701439 628182 539047
12953 539047 443266 363821 304628 261929 210073 178946 165219 153175 132479 117044 97733
12942 97733 95989 90349 59536 35546 30144 45758 46654 39085 34334 19837 18833 11046 2720 9366
12928 9366 22783 13800 11177 19954 22280 32070 24511 30672 37970 35451 20569 16634 18053 23730
12914 23730 27826 27497 23667 29288 28700 16369 8508 9234 19164 23258 31452 29292 26360 32017 26189
12899 26189 18132 12197 20333 25629 38165 39098 32852 24797 19599 26724 33239 28941 23183 23013 19507
12884 19507 18278 24936 27823 42654 51087 43209 34960 36454 48035 49668 25883 16940 12409 18129
12870 18129 17575 26733 35098 40154 42371 41344 36008 21443 7198 9149 11843 16246 28084 34364
12856 34364 21832 22786 17763 28965 37011 41961 43943 52579 59689 52271 53124 75124 90180 87905
12842 87905 80412 60565 44402 32301 21423 15996 24931 52649 62923 39270 18466 16663
12830 16663 18112 22893 38125 43037 42913 32983 18693 14728 22073 16444 15598 14824 42183 37318
12816 37318 27671 34070 30286 39484 46883 41048 26039 9282 18826 31501 34574 42691 43346 29341
12802 29341 32031 40887 48212 64569 72470 89446 90796 97190 119115 122762 116854 123276 130934 136897
12788 136897 125568 112953 119928 117382 100092 84873 78943 66903 55791 53854 60102 44604
12776 44604 40046 38093 30961 28259 40322 55190 51757 36009 20802 20423 29887 37694 26477
12763 26477 19399 21989 28232 29763 36476 35989 27853 43482 61923 52660 46813 47638 49969 47010
12749 47010 30901 15179 16418 21557 1867 6131 26391 16036 12886 876 -7870 -2584 10118
12736 10118 13730 6899 303 -8896 -19825 -19971 -28411 -41128 -36352 -17790 265 30338 30970 49452
12722 49452 77306 83514 76633 70572 68417 93216 97162 85232 95683 107068 112402 112569 101395
12709 101395 96761 98894 102567 100373 100208 110376 99632 97974 94379 90763 108565 117989 103553
12696 103553 90559 95464 109577 108961 95656 95401 105814 104236 119146 130743 126207 119583 129776
12683 129776 124709 114875 106451 117782 124717 115729 104567 106962 116267 112584 100031 103771 115873
12670 115873 119602 130893 143325 133554 127365 134985 147682 180140 182027 165467 172738 174446 175307
12657 175307 181936 170954 159470 161298 162815 170196 171210 166570 177700 184568 181557 170450 169039
12644 169039 163372 174743 176113 184717 184789 171327 178028 184313 198914 215848 201020 181361 181848
12631 181848 182887 187845 199892 216505 213303 209153 208058 227580 255620 271211 282654 290529 287652
12618 287652 290486 298966 298650 302500 306407 309901 325795 348987 363537 369104 365490 376319 392962
12605 392962 397684 401747 415919 446873 483757 513029 530595 545499 562609 576700 567741 562371
12593 562371 582750 594274 589937 585969 598584 606028 600156 598355 609744 623969 635429 649238
12581 649238 680211 713675 753738 798586 857192 923330 993558 1055580 1118417 1181570 1241101
12570 1241101 1297092 1364243 1449071 1544319 1639396 1753805 1889534 2034854 2205754 2422188
12560 2422188 2675316 2973036 3363195 3874961 4517099 5288603 6195356 7178928 8241617
12551 8241617 9376121 10590330 11943292 13586866 15786522 18981227 23823624 31251945
12543 31251945 42335044 57681396 76559918 96825700 115899703 131813976 143175916
12536 143175916 148346777 145970912 136316644 121198133 103151530 84769770 67990142
12529 67990142 53683753 42120621 33325090 26986209 22514749 19305944 16926283 15068736
12521 15068736 13513220 12144058 10889580 9723189 8635919 7642718 6773917 6016293
12513 6016293 5338613 4781635 4332461 3962309 3646282 3357255 3109098 2887985 2688266
12504 2688266 2501830 2336128 2188538 2055974 1956133 1857818 1756975 1677319 1619691 1552662
12494 1552662 1502273 1450726 1392220 1343263 1293690 1250163 1184838 1113030 1034577 952035 892245
12483 892245 837528 781256 713335 661810 636515 613987 608584 591405 545701 515096 496793 486761
12471 486761 472341 457579 450065 441022 420453 407270 407711 405335 401210 381600 351508 353518 358922
12458 358922 370234 369044 354344 327144 292824 269842 257552 245275 241928 227416 209733 214397
12446 214397 214033 214323 214555 218340 224735 202331 176856 169630 183052 177960 169097 166565 153321 143857
12432 143857 140625 140899 131348 136149 135776 134889 147233 139895 133378 149613 142609 148270 146772 146981 146807
12417 146807 138484 137025 142026 157501 185704 194083 171103 165513 162830 154032 149085 147961 148627 159281
12403 159281 166770 162028 151871 142733 152408 166981 148626 141126 143957 149668 148072 145124 137554
12390 137554 124883 116409 104450 96550 95192 98101 98972 100210 119129 115905 117576 134265 143075
12377 143075 155842 161571 172714 199046 220026 228713 255044 285099 308260 347985 384466 413857
12365 413857 452160 518309 554618 565324 577821 578361 581749 561468 548893 563912 573498 574917
12353 574917 598616 633092 685056 755381 857866 944258 957955 895988 779612 657937 548283
12342 548283 467825 403382 350849 314788 286756 247224 220405 220518 198627 187660 183933 189160
12330 189160 193765 189370 185199 192091 193043 184995 176577 171564 149834 147445 142786 135100 138965 143431
12316 143431 151996 153991 158903 160789 151982 160088 177822 180802 167727 158558 142903 139950 129881
12303 129881 124528 116297 114831 124446 125427 124383 128037 126890 136238 143390 133480 139771 149434 138233
12289 138233 130271 135805 145342 162838 178556 187850 182834 182836 184187 198779 191939 189017 200338 216839
12275 216839 237792 267809 293978 320477 339151 364472 403770 450152 518039 597185 717246
12264 717246 854306 1017967 1229899 1472615 1737876 2002443 2238496 2404361 2523571 2573066
12254 2573066 2529996 2407313 2237397 2007134 1743070 1492962 1275752 1080014 911497 778768
12244 778768 668136 573845 508095 455685 411898 371665 341364 310228 279254 254836 242524
12233 242524 243209 206339 184310 167662 142832 122428 105752 93013 85237 77753 82894 89657 98870
12220 98870 92908 77946 86463 80401 72697 76936 84670 82441 75165 70961 82531 99026 97120 92001
12206 92001 105115 112865 108487 102188 98368 80355 71820 67255 65107 61079 63001 48926 59252
12193 59252 58957 51521 49056 43356 42659 52431 49187 41716 41572 43298 35619 36852 31204 36289 38286
12178 38286 32415 30139 49084 58679 48111 45669 56295 61804 67760 57315 63044 66244 62859
12165 62859 49379 45968 47978 45358 64794 70846 62684 67774 82277 82092 65261 65855 80341 75967
12151 75967 74531 84807 75686 79699 91672 96932 92229 80969 80482 88001 96647 124653 149936
12138 149936 168638 188219 187627 164797 161106 136198 108064 102283 103342 106912 106151 112370 121232
12125 121232 138926 150661 168599 180832 185961 197088 214801 226051 248373 276716 303055 363737
12113 363737 433158 516340 600443 669418 746669 808133 831541 824690 768718 685750 592927 513288
12101 513288 440959 373502 312860 269646 229852 214122 199460 171864 164028 171739 175153 173116
12089 173116 177544 181615 176211 179917 200718 226471 266025 300091 324455 343329 374635 411613
12077 411613 420659 403981 394698 370966 327083 290868 249672 218011 203513 166898 142672 131662
12065 131662 127149 117316 108323 124912 138186 135949 135366 128594 113489 116248 114875 116125 116097 117215
12051 117215 116531 117191 97194 77991 67245 74527 72018 74043 87605 86138 70833 70018 87376
12038 87376 87178 59351 52652 69693 83659 100419 95926 90026 90153 94225 95133 82483 75634 68855
12024 68855 64082 63884 62079 51734 51564 54684 47742 50102 55098 56392 63540 51450 52867 65593
12010 65593 68369 73196 88798 99188 95310 94836 96606 116171 124067 131736 159028 171306 158618
11997 158618 166443 178834 193732 213950 227041 248701 283452 306958 327900 377948 462325 563321
11985 563321 688835 910137 1201841 1559651 1962776 2395700 2830598 3215803 3487946 3625150
11975 3625150 3601624 3433431 3150462 2767712 2346751 1934033 1562916 1236959 968345 776045
11965 776045 631404 538731 479863 428709 396720 356997 322955 297708 257552 224039 207475
11954 207475 189526 177836 169877 150067 133980 129631 119621 115617 112816 107119 87635 81264 78967
11941 78967 75057 78025 76836 64856 52089 57291 64282 47315 48229 36445 42262 52175 55150 46325
11927 46325 39154 35395 20347 12231 18955 16556 23442 30766 17414 -461 1544 10190 16508 24876
11913 24876 31364 38749 32579 34186 34648 17894 15379 21375 23668 29574 34857 35836 34181 30532 12996
11898 12996 13787 30820 28124 11069 5754 22528 22930 14325 25912 25466 25435 23023 10868 19750
11884 19750 16001 6563 15154 16800 16374 11697 5429 13432 32112 3944 -20990 -16363 -7725 3750
11870 3750 -7873 -12483 -14534 141 2512 -6282 -17646 -9649 -741 -7256 14025 27818 9874
11857 9874 20683 17841 4768 -6712 4473 8511 221 -15282 -3972 27015 20084 18769 17965
11844 17965 6857 -2247 3946 24399 25932 6100 -20080 -17749 12281 30334 26337 33951 37665
11831 37665 17806 11510 8737 6045 13046 22940 28517 9892 13448 8484 7317 3649 -189 -10177
11817 -10177 -13138 -2988 -6862 -17076 -18213 -10314 4313 6548 9489 3842 2055 14729 20901
11804 20901 14141 11378 13717 8906 9375 15140 2456 -6970 1218 5572 -4591 -10213 -7517 -16911
11790 -16911 -12921 -11674 -15778 -6210 4685 12965 17415 7114 -9585 -14497 3110 11596 10664 19363
11776 19363 16235 -7696 -8895 -2612 -5099 -24954 -23840 -21201 -15957 -13886 -16953 -9594 973 959
11762 959 -3725 -12460 -13513 -2822 939 -10579 -26499 -23012 -14641 3733 10683 16891 6420 3476
11748 3476 8016 6304 -5151 -11845 3185 -2691 -9944 -25497 -27373 -22895 -10104 1642 9392
11735 9392 -2281 -11306 -6151 1352 1464 3280 9636 18375 16424 7969 -19909 -32025 -25558 -21591
11721 -21591 -21587 -21551 -16710 -14777 6820 13151 4782 14593 16875 11918 3993 3973 -5214 -14361 -15607 -17094
11705 -17094 -11049 -12368 -13408 -2119 1338 -9077 -20048 -12512 -3567 2033 7979 -1285 4755 15792
11691 15792 14420 16180 6836 9695 8593 12975 16306 19479 16939 20256 27396 33203 33869 31969 14339
11676 14339 -11847 -11891 7119 8830 10402 12255 -693 16 7589 8212 10623 8182 872 4509 13920
11661 13920 13452 19799 33162 30076 23017 18908 22409 22108 24711 10538 1350 -2642 -13084 -13789
11647 -13789 3438 13041 4868 -2548 8106 22904 19822 10326 -5569 -793 10315 10704 -1880
11634 -1880 -2088 -9616 -10369 1976 5873 13089 14785 -533 -7358 4243 -2520 7939 11336 9538
11620 9538 10047 -1288 -9225 -6329 -10543 -8702 -6176 268 3199 -6540 -330 -632 -5883 -2082 -4192
11605 -4192 -4397 -16216 -10562 -6882 -3119 6182 3667 -2043 11879 16249 14896 8692 5430 6888
11591 6888 17180 23673 18309 7526 -3415 -20034 -23284 -8400 14 -2649 2472 148 162 6247
11577 6247 -79 -4918 -1722 6671 18959 29740 6058 -14715 -12781 -10822 4887 18667 18542
11564 18542 18470 13921 2506 -537 15829 30388 48868 36339 18488 21638 26092 25395 28880 13334
11550 13334 4922 -689 369 -3703 -15580 -24297 -2920 592 -2075 -13574 -19347 -11353 4712
11537 4712 13480 20469 9458 -5947 8148 12981 10266 -880 -12307 -27106 -22633 -4428 -6586
11524 -6586 -10199 1669 22315 14603 -156 3503 -743 -437 -8010 -16289 -17149 -4236 -8719 -19044
11510 -19044 -20907 -17182 -15397 -7332 -7750 -7987 -12987 -3599 4258 8963 6423 7372 8278 -3870 -12239
11495 -12239 -8782 -301 -2202 1930 -3940 -6059 -10351 -4236 -7539 -4412 -2814 -5093 -2340 7912
11481 7912 5498 -10969 -14837 -7763 -2284 -5372 -2967 -9225 -805 -1696 8918 29293 35758 17691
11467 17691 4243 -7114 -8376 -5798 1585 2692 11623 23000 33464 33570 20448 17315 21697
11454 21697 5930 -7240 -1784 5856 13527 21720 13876 4835 20810 30679 18280 16618 9020
11441 9020 11547 10324 15674 17666 28211 38463 30286 6693 14251 17127 21227 28247 26927 22938
11427 22938 8414 -8764 -8902 -2691 -9716 -2170 4250 -9563 5223 12199 10035 13186 9714 4528
11413 4528 -1240 -2390 -4471 6931 9250 14995 24512 22559 3482 -4062 -9709 -4978 -4784 10308
11399 10308 30767 31584 29509 40065 45780 36104 22027 19010 10421 8937 4476 -2076 -4860 13898
11385 13898 27427 24081 14071 13256 10707 9953 -5108 -3586 21831 13531 7809 13423 21558 36545
11371 36545 32142 21551 18027 19904 11864 11527 10663 1999 11186 13921 26410 29226 28535 22778 30534
11356 30534 34339 22094 29836 41136 52954 61592 55769 52946 48152 54123 44174 43986 55903 48015
11342 48015 33226 49866 55152 53602 58927 65076 80075 89577 109443 121314 117117 107917 98252
11329 98252 112290 126500 137622 161532 157675 165021 201304 239885 279118 322456 394983 492644
11317 492644 618917 788557 1017702 1273686 1506379 1649252 1645127 1526542 1332897 1109807
11307 1109807 891644 716203 597842 510510 455008 398314 335987 276724 237275 218689 196844
11296 196844 176756 153861 143713 138266 113639 94034 93055 89795 90333 82013 73377 55921 46069
11283 46069 68696 81932 67465 60509 62920 72132 64414 51199 45763 43167 50196 58020 48997
11270 48997 55821 58678 62121 53893 45233 51545 62223 67026 71551 68406 84348 106617 128372
11257 128372 140027 139968 130102 115695 105582 83190 66574 64427 50114 51933 51156 39466 44448
11244 44448 47574 39383 40068 48323 52784 44882 51399 43491 36478 32635 30991 40118 36454 29969 24150
11229 24150 28774 38689 51192 58607 68152 51907 41816 31903 30817 31639 42379 48684 55599 46122
11215 46122 49576 43312 46818 47872 50988 64061 78422 74177 64104 69630 71392 67769 58159 51336
11201 51336 72168 80398 85546 102017 113141 106447 94883 85425 72543 60931 58469 58503 57441
11188 57441 64724 54395 33438 34692 57375 64520 61852 58153 52923 36856 29351 22031 16672
11175 16672 12077 22257 27819 31756 37967 39553 23970 25083 30336 33210 24371 11223 -4514
11162 -4514 7580 32056 40730 27029 30233 25256 22822 15799 12417 18620 18952 26044 27774 36070
11148 36070 39719 37645 52039 63878 64824 74016 87850 101145 106030 100862 117222 134670 138339
11135 138339 118423 93634 66815 58595 58294 51718 46901 37029 41295 49010 54753 47052 43877 43952
11121 43952 43415 39330 23442 34773 40672 42733 39788 49307 57356 47075 49276 51766 48535 44938
11107 44938 34061 36247 41545 63362 69527 78154 103475 113528 125678 136036 143973 141480 138612
11094 138612 125403 103712 96727 85262 75132 81449 79334 75362 76701 99071 129375 152915
11082 152915 158640 155357 150400 130629 117471 110881 102926 101145 92205 76221 74741 70614 70442 70847
11068 70847 70937 74979 74554 79499 78289 86036 85978 82996 90443 100576 102501 100395 95698 99846 93680
11053 93680 104009 93267 90841 89951 83145 73862 69358 73996 78218 85742 74104 64332 55441 55493
11039 55493 51593 52479 53908 66263 60973 69651 87434 89232 76649 67174 60768 46369 48480 57391
11025 57391 53483 57891 57832 53615 48206 34442 31758 54413 73790 84376 69697 53354 53704 61747
11011 61747 53931 55459 48591 51727 63933 72309 61495 66636 75915 87704 70543 69901 69362 73261
10997 73261 87561 90385 95747 94457 89017 69207 56813 59378 60703 63125 56817 64074 73761 75987
10983 75987 98571 119537 144239 181296 209691 222109 235980 233376 226852 200695 177518 165062
10971 165062 149805 145662 149207 153744 153880 173541 181829 185136 176348 167700 170840 179399 169106 152751
10957 152751 125013 115814 110227 104725 104840 103802 87409 101341 105614 99844 87141 90112 102133
10944 102133 100211 100535 86847 92739 104475 95344 86220 87196 82259 84645 92185 99861 105026 95837
10930 95837 92044 83888 77749 75238 85989 89758 98686 108074 102225 94781 92698 89691 97059 102941
10916 102941 105840 115950 111470 102418 107620 124531 132153 132682 125472 120145 117233 117710 121014 115253
10902 115253 121041 126988 142811 147071 157758 162345 165534 171857 177863 183283 180261 171519 165895 173495
10888 173495 180567 194001 194622 212780 235363 257537 260364 286648 312005 361290 437992 559085
10876 559085 750396 1042069 1405737 1748304 1912236 1837401 1591421 1265398 969883 758854
10866 758854 621377 528349 455884 401159 367610 333645 327944 321162 309624 302948 300202 308477
10854 308477 315134 310600 283005 258554 251558 262341 274365 281784 282118 280287 276542 277318 290526
10841 290526 299219 309156 317640 311669 308481 307828 324210 329769 318024 327246 329476 330405 349394 358928
10827 358928 353713 351837 355247 364221 361091 345910 353785 368192 372603 382007 393264 406135 411363
10814 411363 396889 401581 419385 433459 449209 449817 453497 466364 459191 473712 493134 501273 513601
10801 513601 528077 529553 531827 560069 580738 583133 587670 595570 609330 634702 652093 677155
10789 677155 685588 693676 711715 719042 723571 737458 766740 797215 813503 843524 870877 891006
10777 891006 916139 937276 968128 1005375 1033902 1061427 1083988 1105368 1125302 1164416 1222269
10766 1222269 1257527 1306636 1358917 1434341 1512670 1574376 1625478 1680711 1726795 1773088 1824597
10755 1824597 1886215 1960386 2052747 2142905 2229088 2326810 2444395 2567666 2700352 2852540
10745 2852540 3006908 3174323 3355078 3551994 3757815 3977289 4238471 4512936 4811606
10736 4811606 5148567 5517884 5915038 6353073 6833900 7371352 7989382 8693916 9478332
10727 9478332 10344220 11319771 12431620 13692345 15096096 16658481 18391449 20305607
10719 20305607 22434255 24711063 27104990 29540385 31918319 34105953 35963948 37358508
10711 37358508 38167667 38314353 37780944 36638683 35002007 33024333 30870107 28607792
10703 28607792 26298554 24066248 21980166 20046727 18276876 16665729 15214582 13915636
10695 13915636 12764729 11725098 10788547 9946715 9207337 8536198 7924375 7371327 6879348
10686 6879348 6431396 6024991 5647717 5289171 4951014 4634182 4371550 4146040 3919082
10677 3919082 3711305 3529287 3357440 3201554 3049603 2904732 2774215 2641422 2528623
10668 2528623 2429545 2336270 2251019 2147707 2061055 1969628 1885557 1820301 1736362 1661991 1575000
10657 1575000 1496494 1434919 1381428 1330960 1281323 1240615 1207979 1170961 1120476 1065476 1028383
10646 1028383 983501 934338 868654 812079 779337 788048 833762 859097 872809 858267 838068
10635 838068 824501 796171 774341 756124 744082 717893 697176 696142 687817 676058 667652 657107
10623 657107 643193 633678 625876 613135 604996 576506 565524 557244 538850 531110 542349 527709
10611 527709 534578 534455 525205 511465 492748 492340 499759 511780 538116 549798 538128 511881 494689
10598 494689 479283 458665 444868 420039 400403 395106 399421 393467 388590 386787 373891 374091 383111
10585 383111 379016 371431 375589 387311 407346 429069 436407 431291 431515 437736 455033 452477 445234
10572 445234 436085 414221 391308 365320 355016 355151 357862 355057 360407 354709 352708 355649 352376
10559 352376 362699 373850 372008 354911 358662 371245 384268 399688 422125 432962 427367 431953
10547 431953 434124 421406 441872 444919 454100 457293 463010 455615 446131 437456 452082 459764 465363
10534 465363 485471 532218 555048 558865 543638 520931 522047 550985 559348 560887 569231 582588
10522 582588 572871 571555 577925 575042 580223 598275 616753 629433 652390 668982 678087 717843 747686
10509 747686 763752 776729 797494 827995 848534 871155 865750 852417 846451 828955 821503 835233
10497 835233 859255 918223 975114 1056492 1163746 1279431 1416507 1570253 1707147 1852598
10487 1852598 1988834 2086680 2161879 2209204 2231075 2266806 2333908 2439486 2609907 2840462
10477 2840462 3108514 3401826 3679109 3947315 4242052 4644719 5218061 5993613 6907371
10468 6907371 7851493 8783706 9720423 10735064 11965592 13573587 15674186 18448499 22244648
10459 22244648 27639666 35666345 48053009 67789901 99916883 150853753 222003376
10452 222003376 294917740 333657241 325521610 281133674 214770071 152479632 108441900
10445 108441900 79818665 60836589 47758686 38455589 31621364 26478048 22550432
10438 22550432 19543213 17317374 15718812 14580834 13650527 12687985 11605746 10437176
10430 10437176 9292356 8273294 7426700 6722564 6136515 5650640 5261065 4942033 4655865
10421 4655865 4373636 4097179 3832407 3578926 3333123 3121458 2922032 2761537 2627056
10412 2627056 2517491 2428454 2356762 2298587 2216998 2148624 2088870 2008366 1915567 1809849 1682753
10401 1682753 1554018 1431640 1326770 1225768 1140882 1077724 1050237 1015823 954263 900375
10391 900375 847360 795037 764050 739552 731705 714347 709086 681086 649975 632597 621024 599090
10379 599090 580572 569262 557809 550092 531985 522535 497611 458240 433618 412600 396836 374546
10367 374546 375929 369134 357706 356536 364030 374027 378692 369809 349509 331904 323789 320468 301911
10354 301911 292771 276661 267630 254882 248595 247853 250064 253328 262277 274747 269418 243930 221972
10341 221972 210235 204311 205435 224642 238820 251869 247307 241679 240917 216487 197183 192885 200770
10328 200770 179377 122685 107480 173230 218420 197934 177258 177525 183375 192875 209889 213341
10316 213341 210683 216234 206029 193508 186801 194572 190928 188228 190860 183010 178879 168255 158448
10303 158448 151120 143133 159929 182893 209337 218182 209623 205539 194982 170699 162492 147043 160768
10290 160768 179175 192426 191725 190181 200164 184985 187403 190321 175117 142641 137917 144163 138986
10277 138986 125245 123451 122486 122225 128624 122677 109630 124710 109665 85548 89810 97080 90143
10264 90143 87214 94892 129417 201492 248813 273670 273911 256548 242713 229147 221633 200302 175488
10251 175488 162963 159599 161285 174086 179041 187724 185292 170461 155704 148718 145714 140211 125563
10238 125563 131458 139567 130598 115901 93416 80543 86333 93315 104075 102065 90161 88393 105205
10225 105205 114178 118043 134981 141889 156115 152245 130227 107420 100554 102163 117328 125857 106645
10212 106645 125945 137969 139648 131339 140647 149529 153145 149441 150343 152678 165445 171959 169450 164483
10198 164483 156199 146060 144058 145534 124310 107768 99070 107424 111488 111995 106138 124068 139863
10185 139863 133981 130249 117050 117503 112539 116722 129458 140821 143596 139196 140320 126734 110904
10172 110904 94655 100164 97730 93995 110072 121188 120889 100639 91407 95541 110408 104781 89239
10159 89239 81635 88359 103358 124949 131344 126481 133062 143137 154843 170641 176590 166472 164183
10146 164183 156083 145006 121143 110133 103432 104548 115506 159565 214396 263182 313274 356226
10134 356226 387082 421077 462116 493263 524714 543828 542086 529681 521935 550777 587120 628486
10122 628486 673189 715562 766841 838726 911563 1021716 1199326 1468005 1862221 2460001
10112 2460001 3397434 4895964 7191713 10283466 13558980 15810170 16150689 14623761
10104 14623761 11861137 8874101 6428311 4718390 3591007 2806852 2245479 1841981
10096 1841981 1556295 1335699 1163260 1041871 961190 907709 855404 800066 740352 663508
10086 663508 596959 540574 487727 442720 404426 374965 353798 327592 308325 305343 312075 304103
10074 304103 284434 279296 260569 260409 250425 241272 251274 246110 245108 255196 272043 277930 277324
10061 277324 292455 310374 309912 314703 342464 373718 402791 440017 468328 485384 493967 523730
10049 523730 562582 616492 699781 801926 936705 1141507 1436281 1845765 2403168 3120447
10039 3120447 3912673 4645530 5152556 5286076 5010704 4445433 3746227 3080989 2520008
10030 2520008 2128155 1889868 1795494 1874034 2122073 2479302 2800593 2898078 2728044 2340405
10020 2340405 1874631 1471273 1165195 942335 779368 656044 568156 496263 428807 392578
10010 392578 366034 349991 344447 335303 327136 320407 294510 264750 251794 245153 260595 288337
9998 288337 302588 321878 345881 341947 320710 291911 275364 263941 237262 202970 190891 182610
9986 182610 168257 159262 161770 165077 154419 147992 153366 157739 164582 182315 192668 186549 182415
9973 182415 165044 156809 149244 143809 120707 108536 96523 88623 88368 74078 79742 86484 75189
9960 75189 60385 68917 101459 142383 157378 163995 177733 182194 177607 151303 122817 93004 80957
9947 80957 86234 99675 82466 60088 42702 43204 47183 60082 67568 58334 43994 40338 40278 36285
9933 36285 39023 47917 45578 41298 49514 50237 38144 42703 63487 86089 97784 76561 51500
9920 51500 54422 54130 32231 35172 44462 60785 63071 55387 52024 37991 47612 46580 41208 27670
9906 27670 20468 25513 39383 30467 15681 23162 27859 31461 39365 48726 50347 50705 46399 46990 49798
9891 49798 42205 23545 5999 4974 41227 71600 69122 47761 32512 29063 35116 28076 30891
9878 30891 40422 48593 34183 40537 35093 33839 18762 7532 7908 27849 26167 19340 35320 34678
9864 34678 22226 38368 41809 32220 28745 27069 29294 16163 14640 9012 11000 19088 28862 25882
9850 25882 35850 35328 29828 19827 15191 22050 22773 12601 23490 31185 28651 26036 26152 26677 45684
9835 45684 66741 55084 39812 34177 21911 18287 17400 14787 19798 31214 23998 20694 21579 29719
9821 29719 39512 47651 46667 28951 4608 1109 13714 16901 23014 29599 33838 29515 29006 38471
9807 38471 16422 1945 5466 13088 7045 5637 22584 32834 27781 23302 22421 22610 15089 10723
9793 10723 13732 23254 33408 26195 35396 39118 34733 42771 36355 25971 27688 36383 45508 37411
9779 37411 44607 46948 33408 25770 27341 21611 14919 27847 21505 23280 29822 40268 34388 27712
9765 27712 6731 -4691 -5277 2013 13269 2826 4244 21704 28525 34487 40164 37720 38753 41115
9751 41115 32395 23494 15218 15882 11711 20773 37670 38063 34149 34216 34398 18682 -6323 11218 26126
9736 26126 25925 4742 47 29899 44843 34105 20863 12794 12306 9784 1812 11507 14080 19616
9722 19616 19944 14423 11543 22350 26279 15477 12408 27716 39066 31176 32738 23028 12397 5631
9708 5631 13983 14904 22309 20579 17021 24406 22597 18334 27402 30377 15523 12598 29486 38974 47638
9693 47638 42047 35534 24700 21083 30098 57584 56628 49084 49250 50351 65562 58536 50307 55595
9679 55595 69046 87892 83367 71353 53735 47004 43331 32982 29132 29594 44622 51957 51235 64906
9665 64906 61077 54279 65967 79573 90632 101799 128285 152386 189356 229705 288336 385419
9653 385419 501124 608627 684319 679627 601804 487821 383913 282729 204809 172669 137247
9642 137247 106582 97693 75711 51181 42363 51173 50602 31208 21083 20429 31022 39640 27519
9629 27519 29305 39412 47702 39733 36144 26421 38337 35958 26465 18438 7340 7884 5850 8365
9615 8365 7526 11194 23632 46728 45902 28367 15052 7372 10726 16912 12872 13429 8631 14125 21657
9600 21657 15325 10788 15614 7700 14165 23302 32233 26073 17760 18963 23235 24458 19313 -2441
9586 -2441 -1175 4969 8637 19705 21472 10166 5308 4265 8040 13601 12511 5932 3411 9451
9572 9451 12901 25510 27713 30840 19357 16979 11098 3240 3691 12669 5892 -6712 -10790 -12042
9558 -12042 1965 2159 -9933 -3434 5178 -2154 1478 5214 10299 20073 16586 -1332 -9354 -1861
9544 -1861 7546 18164 26561 30409 30937 15695 6676 -3720 -7810 -15835 -3067 21014 32663 21953
9530 21953 24856 39930 39276 35534 19910 20883 32573 32778 22157 9624 2147 -1479 -2448 -3498
9516 -3498 -3935 9961 3687 -11744 -7400 3818 -556 -17456 -15752 3118 4242 -10802 -17133 196
9502 196 7099 -1427 11152 9241 1593 -589 7654 17853 25818 26563 16520 17263 28032 10361
9488 10361 -13889 -12190 1525 6806 13452 10552 19876 17892 14457 21818 18985 31802 10926 -4711
9474 -4711 -12736 -12003 -2379 -2125 2771 3271 1987 -12738 -8682 -16247 -25292 -19807 -30389 -26333 -15254
9459 -15254 -3312 11953 26428 38073 32689 14016 14867 20865 19269 13015 7400 7945 10755 10232
9445 10232 11904 7597 -4058 -2151 3413 -1744 4153 7533 15385 22044 36389 35607 13694 5311
9431 5311 3344 12216 14172 3973 8322 3131 7997 22893 15495 362 -5380 -872 -7923 -23920
9417 -23920 -30893 -25446 -10088 11601 6100 -2990 1693 -534 -10117 -13384 -8765 2673 4734 4827
9403 4827 3434 -845 -652 7272 23977 17863 10243 -5074 -1719 3108 17734 26003 33152 28163
9389 28163 -586 4894 13398 9474 13764 10832 15949 23651 15686 7157 3945 13471 26329 37601
9375 37601 36798 34507 35154 40745 58465 66469 53500 41333 37508 35541 36740 38621 37926 33819 27382
9360 27382 21508 19021 11578 20470 35143 34915 36165 31897 24054 22469 29299 38048 29787 20489 23683
9345 23683 17149 14091 18873 17808 7957 7221 23773 15122 7725 5952 3034 -3737 20113 24586
9331 24586 14253 21617 14203 20930 22115 18916 28573 36042 27277 7452 10505 13381 15427 35880
9317 35880 28748 29989 32940 31049 20238 19031 30248 31870 25075 24569 20538 1138 4419 5549
9303 5549 13424 30718 33151 34633 37744 28151 17085 19254 26441 29849 28714 14784 14643 27740
9289 27740 28947 28154 29413 30253 19949 15295 35771 45406 69398 76368 80454 60409 41557 37719
9275 37719 34933 30930 19308 16311 15018 17119 17371 23041 26880 45973 64429 65625 55645 60478
9261 60478 61998 59821 49130 46396 31954 24047 25932 18193 -3193 -3731 -157 -1099 -425 4354 8146
9246 8146 10376 6672 17595 12943 -8053 -7108 -5245 6877 5340 23693 18260 14302 14674 20743
9232 20743 11046 20151 13275 -1515 15962 22311 14323 10978 3822 4142 8590 20356 24587 30620
9218 30620 42853 23688 12177 14197 27290 50661 56673 51275 47905 44693 51528 60276 52451
9205 52451 44052 35500 32115 29550 28469 25849 32582 39523 27952 37538 41404 23283 14398 20080
9191 20080 20687 21379 24584 36432 35870 43890 60147 42914 31250 29147 37036 41815 40373 32744
9177 32744 34587 46221 37153 20689 17568 20180 23078 24270 32725 39829 51465 56347 65536 82667
9163 82667 80365 63027 61451 72707 76743 64048 65328 75115 75729 75176 68823 81036 82276 64922
9149 64922 76227 87925 90044 92585 92957 106863 117706 124503 103935 106035 110750 109361 96052
9136 96052 97480 110413 112097 97391 95532 84765 76883 65504 58796 54738 57510 89186 95431
9123 95431 78525 62252 61542 65871 68765 58562 71289 69283 62499 62545 66560 72049 74773 69196
9109 69196 78874 85501 97816 85510 77857 87946 82393 74624 67158 59307 48063 49632 63258
9096 63258 60900 55178 47405 51759 49376 38536 42217 47639 39758 31991 31920 37965 49044 54682 46968
9081 46968 45382 53129 56334 54918 56983 44788 52498 58482 60540 71980 66446 69420 66434 63923
9067 63923 71026 59087 55322 55732 62400 61885 55931 51951 60074 72881 71306 53626 38365 26615
9053 26615 32016 43561 44850 44315 41807 49004 43407 52722 52998 51891 58747 55199 40868 43216 44863
9038 44863 21049 25276 26830 26137 38803 41674 42864 54971 47166 40910 39400 37281 41512 42848
9024 42848 51346 54241 47619 45822 56032 55975 61546 69378 65660 64845 46747 40729 37892 49314 39241
9009 39241 44014 44420 45465 32138 30061 30974 37428 32463 23743 19108 27488 37842 27964 14064
8995 14064 8808 21058 38590 38181 28066 32718 43346 36616 53370 44552 34533 38911 53190
8982 53190 47290 43146 35308 42785 48014 54668 60900 51327 61456 65644 58249 37762 27385 26910
8968 26910 25813 20005 25190 36070 31468 18237 20463 32822 38199 29270 27842 26248 21691 24213
8954 24213 28531 23130 3860 -4486 16727 42678 43775 49257 55006 55924 52227 43705 51236 53921
8940 53921 50057 55348 61626 64884 54679 34211 26260 32281 39572 32005 9171 9485 17995 31482
8926 31482 35103 20159 17449 25670 16314 18455 37309 45866 50169 46523 45604 30757 24642 39813
8912 39813 53355 37261 27491 26750 30869 35589 43244 52830 63364 60364 46551 34285 31238 42211
8898 42211 40900 40179 43912 49845 36697 29034 27138 32009 46769 52502 66200 76394 65598 57398
8884 57398 64284 77698 66651 70299 73035 65497 64970 63381 63294 51768 49385 47094 47375 45606 46240
8869 46240 54608 48525 37257 34142 29839 16201 20000 25541 21888 41280 63836 60337 46354
8856 46354 36430 48453 48240 54768 62268 58320 59605 52349 38857 31809 35489 31848 45341 61065
8842 61065 58177 49420 48708 46602 47002 53396 51485 57065 60836 54642 64347 71327 71117 68905 69616 66624
8826 66624 55999 50226 40468 34213 39193 34799 28088 33821 39469 41577 37818 46890 50568 67240
8812 67240 79514 69684 65132 64893 74543 63728 54622 35404 40070 53804 50177 33415 23979 22312
8798 22312 15744 21524 36030 42718 41707 40069 41297 37212 25572 27542 45769 50718 53243 58116
8784 58116 63023 60291 55038 48711 45670 49585 55672 64502 60723 57962 48410 38581 51548 58401
8770 58401 59199 54856 45435 42935 37116 45267 50174 46776 44113 38806 53170 55181 51873 61074 68532
8755 68532 79747 77073 72485 77241 81682 78000 72750 66412 58344 58956 53840 41443 44834 51262
8741 51262 67021 80636 80632 84921 80348 78173 59143 51502 62309 71363 79063 79575 87095 100465
8727 100465 113529 125355 126879 113321 116411 112710 93499 94522 98964 96956 82347 93800 116551
8714 116551 130200 149172 195710 254589 298555 309060 318437 305738 260166 217558 187610 159646
8702 159646 138325 133678 110473 101954 107825 121670 132239 122796 112083 103504 98877 90968 101361
8689 101361 105609 110708 109328 110848 108412 107092 110158 112090 111516 109027 106785 113486 123489 127428
8675 127428 122214 123289 120547 107010 100734 96616 95265 90508 96043 106876 104652 98160 103322 98734
8661 98734 92517 87848 94952 101386 117024 124237 133038 131782 129683 132505 130050 140389 162648 174321
8647 174321 170708 162736 160420 167221 173802 159770 159706 155907 168363 170497 166891 163431 158450 166308
8633 166308 188621 205898 213843 208484 215721 212125 200073 191100 206870 209780 202030 201739 199763 213502
8619 213502 221663 216525 202277 205738 227931 238476 230487 237791 245305 261680 268662 274578 286445
8606 286445 293334 315039 334062 356090 376304 410437 467019 552389 645998 751606 837042 869797
8594 869797 860269 806815 722627 632220 585074 542134 504612 484206 487637 487680 493630 504607 531425
8581 531425 559134 577201 598639 627932 663663 696040 729442 762028 805974 847443 904947 980004
8569 980004 1034247 1092618 1144197 1168679 1176161 1157601 1126812 1086050 1029305 958298 887249 826014
8557 826014 767288 724140 676979 648705 637964 605808 597863 611142 637463 659239 672397 684118
8545 684118 681954 669756 686423 717350 792028 890025 1005429 1164752 1366574 1593654 1815061
8534 1815061 1980077 2130640 2334833 2606582 2737246 2566946 2213571 1720978 1263901 988670
8524 988670 834328 729289 646544 582346 523702 459758 410999 390015 358984 331876 327598
8513 327598 332642 329475 340442 365158 391195 392437 368916 331168 296912 260012 225867 199902
8501 199902 187035 178617 166709 155574 152286 138787 139951 132784 123858 128781 121849 121618 115531 121403
8487 121403 115543 110467 102305 100575 109869 126329 120444 118110 125526 147079 159598 148935 126605
8474 126605 114896 104470 102014 91335 87343 91709 91767 99476 99463 89442 89394 87122 78222 70531 76811
8459 76811 75201 72212 72127 71668 78853 76359 65222 54610 61402 70482 82395 93489 93923 70266
8445 70266 56024 58732 59803 66140 83996 81257 83340 91787 93240 86714 95161 113195 117953 108872
8431 108872 108847 110390 118928 113491 95502 75917 84800 83571 81474 75342 78076 94613 109247 102257
8417 102257 102957 104898 110381 112992 120129 132792 137220 131697 133551 135476 146808 171900 182663 177515
8403 177515 186576 183311 175813 166451 153425 140378 136291 131689 129075 111609 101843 104749 96347 82408
8389 82408 92150 95830 99427 107760 107590 110663 111549 106933 111593 120048 132060 133369 136466 136181 144871
8374 144871 144241 136692 150424 164092 166516 177228 188926 201620 218588 214628 206727 212449 196538
8361 196538 158582 140896 125320 113001 103582 114202 137432 129628 141568 179144 212521 230549
8349 230549 245552 234427 213955 173024 130992 104814 90615 77597 80803 88019 77404 70710
8337 70710 81666 79453 79133 82386 87985 92085 102074 91154 68584 72223 73252 62214 65849 76913
8323 76913 79237 66596 69155 70143 71749 71232 59903 67537 60119 65090 73835 89749 101532 104722
8309 104722 113104 140326 200170 289866 375345 406486 396897 337229 264984 214175 168591 131908
8297 131908 106872 113984 111633 103377 84269 83504 83083 76452 85712 96708 102657 104581 119306 127124
8283 127124 139768 157578 154934 138189 119671 99484 76913 72530 77943 76000 92348 89242 84635
8270 84635 68766 60660 62078 58705 54322 78163 101278 119875 125300 145184 165534 190776 211078
8257 211078 196230 145170 97138 64001 53129 62503 62222 59540 49557 52684 65018 54991 76304
8244 76304 93739 120865 137070 150993 141258 130813 115025 99123 79016 55110 49616 57923
8232 57923 55906 47319 46205 46312 35921 36168 26686 22028 31475 21122 19772 30793 27795 20011
8218 20011 9520 13939 29598 27684 31057 37607 37660 21617 16186 20680 19195 24098 23619 31302 34820
8203 34820 35612 34133 24084 25337 42040 50489 52201 51220 36967 18796 14994 18710 22736 29060
8189 29060 28195 35386 24708 20728 24773 32323 19107 17116 24677 28730 27156 7373 -3671 4334
8175 4334 1460 14455 27686 26454 17806 23155 25290 27844 25872 19817 17325 19756 15633 23858
8161 23858 37208 27364 20351 11578 13952 11542 16589 17077 13991 14900 18848 17871 31039 27806 30038
8146 30038 30300 21955 25747 34440 27911 25029 27556 20995 14704 25256 30944 34565 35754 33029 30081
8131 30081 40255 40262 21746 29603 32067 31077 42196 34739 36882 41815 30013 30977 42337 48819 36258
8116 36258 25547 14144 10469 9268 9208 7467 24151 29947 26146 33733 37138 37377 49624 51809
8102 51809 58272 52546 33146 40391 46461 36338 34746 40623 46031 47103 36765 27745 37213 29642
8088 29642 20637 19256 19663 25845 31095 29753 35483 38580 45224 36874 27962 32495 34210 38103 28137
8073 28137 21197 24428 16053 29833 41825 58713 61746 50033 47050 46746 28373 28869 19902 15730
8059 15730 21778 29946 33758 25853 36601 51684 54826 50223 51218 59874 68772 80737 90630 88581
8045 88581 80074 75360 67010 65631 66507 63193 49886 57438 67657 64943 70936 73808 76544 77872
8031 77872 85021 84509 84730 79483 71005 73435 80436 85117 101054 105825 90057 99236 93881 83772
8017 83772 91368 98093 116324 125577 132417 136175 135214 122787 115324 121960 139663 149482 136335 135437
8003 135437 144801 151741 150016 134672 133305 135784 148935 128042 114213 115930 126598 135139 131087
7990 131087 107493 94657 104878 110681 115119 128022 127862 129415 125482 132496 160752 172782 173598
7977 173598 183271 214568 240386 249129 255866 264378 282429 303341 296679 289180 277978 265414 253125
7964 253125 243787 237940 204812 185724 178591 175353 167620 172487 172400 174714 174181 156733 149933 147936
7950 147936 143183 137425 140148 140716 142841 125469 109805 140029 155279 155715 164253 171943 181402 193873
7936 193873 216364 237612 246121 242722 258714 252130 242119 231739 247011 261925 256541 255392 254570
7923 254570 255932 251019 245066 233972 219368 199626 191416 178857 164170 156668 144033 120924 126684
7910 126684 135271 135619 131882 123351 113210 111998 114934 113158 108633 103757 110829 110037 113096 116116 117217
7895 117217 119719 138284 140357 132330 129708 125468 124117 128168 122548 115866 107042 97200 105254 110943
7881 110943 122188 115647 113952 105812 85759 82015 90897 85514 76227 84179 87171 93229 93252 71604
7867 71604 54918 58649 62688 49955 40006 60523 60141 57537 61520 67305 78061 67283 52946
7854 52946 46594 31974 40810 56240 54003 39807 23950 18688 29843 35957 44685 46325 49181
7841 49181 54313 62809 62609 50699 43743 25927 28208 35684 45332 50176 37708 43900 47949 29320
7827 29320 27841 32545 15276 9954 4872 -204 8552 34521 43258 31924 27502 30440 29048 33102
7813 33102 42667 39620 48955 53915 40313 28017 23172 23636 22832 20879 25757 26393 29216 22559 7312
7798 7312 8735 3239 10437 12476 3467 7557 15021 10695 -4383 -5581 2762 555 1838 2608 -336
7783 -336 3730 -1434 -854 7315 17376 12346 9025 19762 19773 10874 -6960 -9805 11931 21963 26446
7768 26446 25972 26972 28566 21862 8848 -280 -9756 -1294 10700 26017 25350 13652 20158 34283
7754 34283 37776 27994 20122 27094 30224 18420 24083 18611 7532 12361 13319 5686 7722 13215
7740 13215 9898 17958 16409 13572 23837 13346 1037 2624 1430 2136 -5434 -5183 4438 8023
7726 8023 -581 -11511 -8016 -12000 -9083 -1303 6306 17863 7356 14833 20392 12599 16848 14854
7712 14854 14081 8884 2908 -1848 -4877 10418 13424 19060 14771 10173 -1625 -8330 -12226 -2635
7698 -2635 3523 47 -4839 -3740 -13510 -29749 -24028 -15204 -2656 6595 -1224 20190 22160 21102
7684 21102 18133 5483 -1347 -5666 -10961 8882 7501 3802 4659 -404 -553 -1674 6641 12957 6588
7669 6588 -4225 -6229 -76 2781 -8764 -3996 -1009 -1792 -13973 -20973 -14980 -23912 -28253 -17806
7655 -17806 -8507 -7458 -2976 -2106 3070 -6387 -15378 -18923 -5148 -6567 -6747 1636 -5572 -1412 3895
7640 3895 9370 16666 9730 25 -11886 -14357 -15464 -11757 -13071 -4820 8898 4929 -5589 -13164
7626 -13164 -18986 -11141 -694 -7345 -20423 -15952 -5078 2003 10189 10519 -1533 -9394 -17842 -20384
7612 -20384 -8338 7801 3492 -4195 -12005 -16367 -6012 -1410 -17340 -13200 -17313 -11879 -18372 -15409
7598 -15409 706 21131 23320 24710 26670 20778 25858 18911 9411 3642 -1553 -14223 -21750 -27767
7584 -27767 -21749 -13089 -14203 -4543 7002 21845 27748 35917 13529 183 -6228 -17744 -18988
7571 -18988 -19358 -30352 -26841 -12623 1568 -418 -17027 -2088 4905 -8455 -8213 -7657 1022 1452
7557 1452 2688 2000 8560 7341 10377 15206 -2126 14449 20932 8728 9587 16959 6831 -8985
7543 -8985 -938 9103 14178 14041 10462 6662 -3948 3265 13762 7089 8496 11495 4614 -7159
7529 -7159 -1437 5594 6028 -3286 -11239 7301 8225 11171 17251 14633 2312 -13937 -5593 -6060 -9326
7514 -9326 -12780 -11228 -8734 329 -498 -8503 -12801 632 -3092 -7027 3521 5244 3233 -1077 -11853
7499 -11853 -26525 -19947 -8142 -3588 -3712 -5898 -3809 -6877 -9730 -13006 -10241 4042 1428 11524
7485 11524 12701 -10047 -17219 -23375 -24936 -16460 -13331 -4971 -262 5833 2038 5867 4374 -3659
7471 -3659 -2322 1654 -11012 -16482 -805 5414 11545 -428 -4085 6862 16334 11441 10997 14990
7457 14990 5203 6661 49 -10245 -7789 12223 7198 5598 -835 8935 8355 2952 376 4927
7443 4927 -1957 568 -9682 -8473 -13540 -10833 -4123 692 3768 -7426 -14639 -14440 -16608 -5153
7429 -5153 -7453 -7024 -1939 3622 -6566 -12183 -20185 -22036 -14080 -2838 -6656 -16402 -18177 -16131 -5865
7414 -5865 5423 -6706 -23107 -20438 -12942 -19912 -29164 -23841 -29154 -25511 -16365 -6799 4422 20930
7400 20930 10828 -8779 -9727 -14130 -11455 8970 15721 17201 19381 20856 13507 25788 22347 4229
7386 4229 -8271 -6802 1825 645 11401 3089 -16784 -10963 -8471 -492 10998 13012 -1155 -1543
7372 -1543 2663 9151 -3115 -9923 -19838 -16708 -3766 955 7411 9791 13396 -3599 -11322 -13761
7358 -13761 -21229 -19884 -4377 -13390 -15903 -285 2271 -4704 -17473 -16966 -9268 -13432 -19465 -14691
7344 -14691 -1884 5249 13574 14161 11561 6019 3665 -3545 -10623 -7489 -20475 -31265 -27436 -22651
7330 -22651 -17858 -21159 -14901 -16738 -14768 -11315 -15566 -6983 1493 5942 6709 7525 16336 -4897 -15831
7315 -15831 5853 10194 -12592 -14253 -20836 -24376 -18000 -10739 10076 33804 39313 38120 38403 21594
7301 21594 6049 6304 5325 -2546 -10333 -7274 -9274 -20143 -26063 -22714 -19388 -7686 -2165 -3368
7287 -3368 3466 1543 -13279 -7062 -7855 -6055 2399 8422 -2445 -23261 -28308 -25567 -8929 -8724
7273 -8724 -11106 -17454 -16300 -6344 83 -8067 -13665 -22205 -4850 -15632 -34191 -27289 -29567 -24233
7259 -24233 -16166 -17457 -29388 -29744 -32708 -38477 -28355 -25177 -23983 -22332 -11113 -16203 -17642 -10672
7245 -10672 -3046 -4227 -6136 -7637 -3945 -13595 -12517 -7131 -6841 -3626 -7592 -14327 -14074 -17902 -8531
7230 -8531 -10410 -5503 1185 -2635 5702 -3065 -6365 -14 1520 -4964 -12219 -29275 -40444 -33357
7216 -33357 -13179 -3372 -1319 -2966 1045 -8078 -20102 -22541 -22413 -20876 -22148 -17075 -11753 -11807 -19807
7201 -19807 -15065 -7443 2991 -4747 -18569 -23003 -14462 -10794 10468 13542 1203 -3429 -12464 -15182
7187 -15182 -11377 -3899 -5203 -13760 -20659 -29102 -20129 -17139 451 14067 19125 23427 15591 2454
7173 2454 -6891 -16139 -12712 -13013 -9691 -15285 -21520 -10455 -28163 -21086 -6443 -6475 -13005 4120 20069
7158 20069 2957 -5958 -3246 -14254 -21206 -335 17085 6452 -11079 -16911 -11030 -20711 -26446
7145 -26446 -16037 -16542 -15763 -24764 -30662 -23241 -38241 -31253 -14738 -6725 -4900 -8092 -5242 -10561
7131 -10561 -5606 3690 3533 9444 7951 8427 13713 16130 5516 5841 14153 1280 -4931 -3914 -5903
7116 -5903 -8214 -8775 -10406 -11454 -14774 393 10217 10519 5992 5009 -7775 -13513 -14114 126 5937
7101 5937 -3055 -20022 -18457 -12153 -4561 -10816 -21220 -17768 -13092 -18768 -10590 -3994 -17937 -14358
7087 -14358 -13547 -16290 -19035 -13615 -1332 3661 -8086 -16365 -13385 -9968 -20384 -27419 -17338 -2662
7073 -2662 1406 5393 7549 10042 -4796 -1801 -2281 -16733 -13110 -19958 -24854 -11857 1787 -914
7059 -914 1312 226 -9837 -8221 -10410 -18709 -25348 -28949 -23861 -13801 -2317 -2617 -4775 -972 -1172
7044 -1172 -299 -5431 -19642 -12051 -12604 -14900 -11538 -12495 -12966 -11231 -16732 -12329 -3606 -297 5864 -1401
7028 -1401 -12472 -11553 -6992 3834 4910 6198 -4945 -5382 -7749 -12278 -7269 -13824 -8721 -2790 -6344
7013 -6344 -8267 -17593 -20031 -21372 -11803 -7135 -4110 4907 9115 12602 5473 -8044 -11557 -543
6999 -543 -1277 -10555 -8261 -17620 -26407 -17642 -7192 -6374 -4090 -12364 -10871 -10146 -22367 -13600 -3604
6984 -3604 -7754 -6600 -7134 -10927 -11771 -15926 -11146 -21064 -19820 -2279 4392 7522 4035 -5661 9438
6969 9438 19168 14931 10336 12182 3177 2598 -4623 2517 -6169 -7386 -12814 -71 -8326 -8747 -3578
6954 -3578 -8465 -5798 10086 15337 9788 8708 -15327 -24515 -16002 -3612 2046 -3622 -15823 -9424
6940 -9424 -3465 -11463 -6163 -13259 -8577 -3726 7498 6699 -1501 -9707 -3339 -10542 -4550 -8877 -14543
6925 -14543 -12174 -10273 -4694 -907 7235 24770 22607 2944 1558 1006 -8926 -25164 -3569 17126
6911 17126 14182 10470 -616 -13813 -15842 -9478 3824 9681 2530 -4107 -13123 1745 12379
6898 12379 4145 5927 18071 19402 2250 -10565 -18940 -12808 -13695 -4184 9249 17635 21370 18326
6884 18326 173 -14601 -9224 386 7164 651 -3009 -1546 -5987 252 8781 4137 8572 6392
6870 6392 18643 21819 9421 -1078 -6316 12 -3942 -16788 -20299 -20755 -12760 -14107 -13546 -4742
6856 -4742 2313 -5057 -12141 -4370 1780 3868 -3045 -22918 -23777 -27818 -30097 -12104 -6260 9669
6842 9669 2514 3100 8115 11333 4905 -6855 10049 16005 7598 1199 1479 -5183 1105 3869 20157
6827 20157 12587 -14959 -6952 -8410 -12596 -4611 -2857 -4769 -241 2358 1574 -6855 -20712 -13476
6813 -13476 -14857 -16923 -6042 -12545 -16813 -25210 -25947 -24971 -33306 -23942 -6689 458 2223 -5909 -30353
6798 -30353 -42011 -28637 -22391 -23771 -23196 -30306 -32885 -23816 -16065 -15554 -13506 -7129 -4542 2754 10262
6783 10262 14364 21183 9480 -926 -8173 -1812 5172 1821 -4023 -12403 -23871 -23823 -6169 9701
6769 9701 562 11145 16051 -927 -3634 14077 8480 3420 8043 6619 -2933 -2573 1876 15846
6755 15846 17235 14073 14293 -3056 -16167 -16883 -12294 125 5719 -9682 -10408 -3489 2482 -203
6741 -203 -10017 -7642 6429 -4353 -20609 -38099 -44911 -25867 -6022 -21092 -26628 -23142 -25743
6728 -25743 -24751 -17949 -13307 953 15729 13755 3989 -5400 -10193 -23189 -26020 -22454 -19949 -13874
6714 -13874 -15071 -17210 -4935 -266 -12390 -14004 1819 5215 6698 -3266 -7975 -12514 2485 8979
6700 8979 23695 30803 35931 48967 50565 62595 85215 91830 88629 60755 50403 37229 19809
6687 19809 19761 5378 -6305 759 7582 8952 -17905 -32600 -15314 6937 11451 390 -7675
6674 -7675 -23375 -21801 -8255 -1897 3679 -4472 -8178 -10317 -1415 321 -1610 -5933 -15470 -12085
6660 -12085 -1924 1730 -2297 -2777 2908 3734 1935 -12804 -16258 -14486 -12951 -11376 -5336 -803 -1834
6645 -1834 -12301 -6154 741 9498 14895 13724 7952 3356 2373 5887 8560 17501 12129 13444 8765
6630 8765 8601 -5455 -18533 -16087 -13134 323 4147 -4271 5201 3232 -17032 -24294 -13602 -20612
6616 -20612 -14637 1143 6138 -2377 -28930 -29689 -8284 15423 12504 3979 -14835 -24059 -23721 -9585
6602 -9585 -4411 6760 17162 10568 836 1221 7822 4469 11144 23781 26302 14545 12249 19511
6588 19511 12937 4754 6870 -1280 -14509 -8652 994 15006 9226 -3980 -24574 -29862 -18918
6575 -18918 -9758 2422 7178 4368 10289 3583 -4281 -10837 -22807 -11261 -2631 -4387 -6481 -13929
6561 -13929 -16872 -21367 -17701 -7451 -4699 -14391 -25390 -20069 -10290 -5609 -12713 -11453 -4688 14779
6547 14779 14941 14475 10095 12672 13381 4329 -8839 -23330 -27145 -20682 -6186 2436 14444 15038 23017
6532 23017 25634 27602 21692 19165 14493 -627 -10976 -5465 -4702 -11865 -16628 -20070 -21963 -20237
6518 -20237 -24709 -13691 -1825 -656 -7777 -4098 -644 -6838 -16937 -21903 -24885 -20637 1324 23135
6504 23135 25756 24499 5516 -3051 -15469 -16006 -8797 -7355 -9626 -13358 -7872 4775 12842 6784
6490 6784 4807 10934 7969 -3587 -11268 -20525 -16149 3961 13921 12695 8208 11518 -292 -9603
6476 -9603 -4954 1729 -9390 -15088 -13519 -14322 -20402 -16543 -20812 -4555 16142 391 -7980 -7880
6462 -7880 -19198 -6287 5518 -6636 -6645 -9737 -9578 -13017 -11685 -14821 -16592 -20068 -14639 -13289 -4586
6447 -4586 -3489 -9822 -9730 -4025 -6781 -8208 -12233 -13287 -15710 -5647 3784 10392 4975 13837 18225
6432 18225 -2359 -14917 -12536 -11230 -14741 -23037 -11956 -8237 -10748 -12232 -15520 -20003 -23687 -22211
6418 -22211 -19015 -6773 5002 9320 1726 -12421 386 5813 769 8645 5635 -5257 -9816
6405 -9816 -2911 -4413 451 16741 10106 7622 23871 17678 8313 2222 6687 8842 17792 7706
6391 7706 -4041 -7142 -14138 -33349 -35665 -34927 -38879 -34957 -32244 -20266 -21769 -16589 -14842 -14815 -17305
6376 -17305 -15738 3981 7852 -5100 -8523 8119 4772 -2716 2259 13090 22088 36538 42559
6363 42559 29065 26769 25914 10287 -8427 -16812 -4948 4250 -8082 -11505 -9729 2342 10526
6350 10526 6747 -11901 -5544 -2979 2900 1301 -17786 -10141 4279 4410 1317 2098 6511 -3228
6336 -3228 -9147 -11807 -21887 -15940 -13291 -6171 11699 17089 6801 -8403 -1960 14467 33258
6323 33258 28785 9305 9 5693 8724 14326 7361 -1408 504 -3262 12937 30290 22416 -1299
6309 -1299 -3434 13259 16858 11121 12773 16052 21263 12600 -2022 5497 -3681 -12980 -14949 -3157
6295 -3157 1286 15723 14156 12170 10550 -1346 -3919 -9977 -6769 5787 13 -6016 -8827 -6191
6281 -6191 -8928 -5846 -3201 -8551 -1720 8916 11590 12322 14891 9568 8275 3735 9124 10308 5164
6266 5164 -9990 -23441 -14530 -2719 -6398 -8572 -10726 -19842 -14895 -15940 -18410 -23850 -16391 -288
6252 -288 3437 -902 -19055 -15811 -10386 -26656 -29427 -12837 15432 26879 20403 7902 -332 -4400
6238 -4400 -2000 -6714 -13714 -17445 -28652 -18134 -11742 -7476 -949 -2153 4874 3342 10686 21072
6224 21072 8683 -3151 512 5392 -4687 -16323 -19620 -30040 -32576 -29776 -12899 -9307 -25234
6211 -25234 -30559 -3329 10741 -7965 -21822 -19656 137 18949 13938 -1418 -2562 -2460 2233
6198 2233 -854 -1135 471 -10429 -22131 -25582 -9692 -16786 -23751 -28117 -12305 -10777 -25175 -21675
6184 -21675 -18590 -23262 -20971 -23017 -2341 -91 8776 7745 -6050 -7281 -10895 3275 14589 22347
6170 22347 20885 4687 -12555 -11146 -3697 1120 2011 -5529 -22203 -21937 -19842 -19474 -17399 -5696
6156 -5696 -3969 -19055 -20259 -7043 -4465 -12572 -13172 -14928 -27592 -23126 -15750 -16013 -9234 -4746 7242
6141 7242 5895 -2446 -6762 7070 18892 11929 15439 6675 -8470 -4265 16048 18578 16819 9225
6127 9225 -5594 -25301 -31140 -20132 2591 12990 26531 14796 -6819 -18633 -14283 -9725 -15989
6114 -15989 -21579 -19334 -6439 -8192 -5612 -551 -3828 -2673 13213 15882 6179 -5837 1344 12153
6100 12153 14913 8184 5756 -1368 -2876 -9132 -17146 -13140 9650 26451 18029 4245 -9202 -23383
6086 -23383 -20569 1978 4251 -5774 -7796 -1331 3653 2953 -4553 -7931 2058 8059 18271 15745
6072 15745 205 -6567 -10380 6393 7150 1323 -1053 -11926 -17563 -15673 -9784 -5868 -5271 -4955 -7588
6057 -7588 -4444 -3796 -19745 -19443 -15503 -3055 6096 7570 1526 -1167 -10671 -11416 -9153 -4306 577
6042 577 -4341 -24726 -27268 -33533 -39123 -29056 -18091 -8123 -8598 -3837 -12780 -23519 -16325 -2680
6028 -2680 -3659 -591 1992 155 -8344 -7822 -2479 -5432 -12570 -5899 12263 8534 9677 15631 111
6013 111 -14280 -13995 -8041 -8900 -20473 -18334 -11116 5494 13494 -1377 -9022 -10478 -22818 -26380
5999 -26380 -22032 -14905 -7569 -15609 -18827 143 113 -4043 -5835 -6645 -10784 -8620 -4924 -3910 10434
5984 10434 15992 22029 27688 22916 23204 -3324 -12723 5603 9513 -10568 -17164 -13355 -8591 -8941
5970 -8941 1012 -4705 2671 5029 2685 1300 -7049 8814 10020 4503 4418 7393 7517 -260 -7297
5955 -7297 -17434 -5215 -1419 -9866 -4701 -15749 -20963 -14596 -23165 -27514 -29074 -20226 -7326 8511
5941 8511 5818 -4842 7774 10296 11081 7813 2983 -7735 -5057 9739 13794 10443 9160 16044
5927 16044 11735 -388 -8726 -18930 -16709 -2200 3964 3077 10040 4947 15909 -1415 -2897 4887
5913 4887 11039 14040 11163 7880 5705 3107 10859 20935 14664 -9349 -11733 -11591 -14221 -8971 -9308
5898 -9308 -22110 -25172 -5870 -1530 -9349 -17739 -8187 16955 17002 812 -4354 -14276 -23242 -13381
5884 -13381 920 -1219 -5261 -6643 11457 17909 23433 22080 22231 29790 42052 43095 32117 27931
5870 27931 36289 33144 24916 21748 17588 -1500 -12789 -16881 -24248 -36366 -45345 -31728 -11858
5857 -11858 -10826 -18750 -14899 -8247 -20505 -26997 -33821 -41464 -33547 -32936 -14678 -12669 -15389 -9441
5843 -9441 302 -8350 -16021 -10021 -12402 -16804 -5520 -8001 -11450 -13351 -10688 15293 26518 4166
5829 4166 -13868 -6900 -12507 -16137 -18442 -15632 -15862 -17521 -3110 21292 27988 2003 -5890 -7905
5815 -7905 -14039 -12589 -18377 -29817 -22243 -5529 6922 7359 5175 -9418 -17542 -20713 -25611 -17868
5801 -17868 -15377 -13134 -17499 -14857 -3878 2235 -2544 1366 2252 4643 -10565 -28728 -29788 -40565
5787 -40565 -32362 -18730 -10037 13969 30538 24191 1233 -15045 -11573 8734 30099 36109 24471
5774 24471 -3780 -8357 -10665 -13969 -16585 -19459 -3396 -12603 -25520 -21742 -28955 -25680 -23075 -18991
5760 -18991 -11654 -5956 -4161 172 3529 -4212 -3243 -3411 -6169 -12263 -12478 -12615 4863 -8432 -20481
5745 -20481 -15219 -13792 -17262 -20141 -4734 5845 5770 13789 15942 16774 26283 24933 16602 4904 -5713
5730 -5713 2071 14080 18237 15830 11142 197 -2121 1032 15612 23009 7797 7822 3489 -10962
5716 -10962 -8011 -2118 -7865 -14793 -16264 -8503 -3295 -21713 -17090 -13229 -3335 1939 7935 8180 17018
5701 17018 13447 1836 6926 11066 -7310 -9409 -10615 -28639 -16105 -4826 -8181 -9269 -15258
5688 -15258 -23347 -25349 -18648 -13374 -8122 -10130 -13117 -7159 5600 12576 1173 1613 1427 6933 1912
5673 1912 3070 -2355 -6445 8459 18175 30918 26713 4847 5910 22925 16788 11012 3788 5434
5659 5434 -1130 -5928 394 12269 7640 3205 -521 7716 651 -4586 -7928 -7600 3285 5784 5881
5644 5881 -806 1495 7893 21197 14209 11108 6063 9596 8425 -2703 -4442 6152 15987 14477
5630 14477 -2787 -7319 -8524 -19886 -17954 -12365 -11087 -10944 -2443 -2904 -13110 -7809 6783 7495
5616 7495 7223 964 -3285 13743 17504 3850 8776 14042 4848 5575 7327 -2797 4837 7105 1819
5601 1819 3618 14517 17895 11363 -2205 -2838 -4803 9359 16615 6695 12507 15227 3522 3767
5587 3767 2857 -3506 -8038 -4297 8257 1462 -15345 -22168 -33321 -29124 -27037 -25008 -32906 -24995
5573 -24995 -1192 6573 3844 4722 14721 21175 4008 -14887 -16780 -3772 -4726 -17059 -15542 -22996
5559 -22996 -21312 -25441 -22781 -31860 -38505 -21874 -7869 -4292 -2777 -1316 -1265 4339 3996 -7472 -11012
5544 -11012 -11311 -15559 -17442 4008 3698 -6238 -12695 -9978 -13266 -4887 -2059 591 -15157 -8005 -9151
5529 -9151 -9665 -9259 -16644 -22051 -11776 10339 775 -11139 -27336 -21406 -14739 -9277 1269 2207
5515 2207 -5536 -17690 -21518 -24268 -10168 11298 12586 7410 13833 7535 -4619 -13682 -22154 -19787
5501 -19787 -24476 -20321 -16233 -11872 -4081 -6868 -15579 -11040 -14543 -24359 -8979 -2192 -463 -2171
5487 -2171 -26446 -34841 -21147 -4195 1361 -623 3251 -432 201 -2796 3835 916 603 13701
5473 13701 14746 -7723 -24426 -26800 -26993 -22879 -18645 -22135 -18542 -9751 -7253 4030 -2528 -9412
5459 -9412 -10623 -8597 -10088 -4987 1135 -2171 -12120 -21803 -10635 -8233 -17419 -27424 -11886 -9200
5445 -9200 -7429 -9649 -6921 -9397 -8385 -13106 -19898 -18878 -12914 -16755 -25392 -31457 -43069 -31405
5431 -31405 -12563 -5651 -10524 -4878 8528 11006 19911 13167 6272 2652 6492 5558 -3122 -8707
5417 -8707 -9539 14348 20170 12581 -749 729 -3316 -6911 -9643 -14998 -12663 -10205 -15319 -24138 -21027
5402 -21027 -13555 -10945 -7873 2487 2859 8504 9806 4583 -6509 -8100 -145 -9382 -8343 1365
5388 1365 7590 13967 4529 5729 697 -9643 -499 -1251 1453 9409 1284 -4599 -9241 -12582 -15034
5373 -15034 -10502 -12940 -16488 -13927 -17689 -18895 -20317 -22475 -10225 4663 9773 9168 -4092 2733
5359 2733 -18 -3606 -2118 -3416 5253 25771 25699 27260 23708 20410 16123 15510 266 -1801 11408
5344 11408 20795 21358 -1295 -15606 -12424 -4007 2366 1522 -13685 -19183 -11288 -13895 -12347 -18391
5330 -18391 -12813 -10196 -6905 -10000 -406 4247 -4487 -945 -5751 -10176 177 -2929 -8474 -10211
5316 -10211 -9495 -5786 -10812 -9859 165 6003 8582 -16839 -30171 -17807 -346 897 -1773 7529
5302 7529 1432 -13050 -20207 -10740 5918 8226 -4029 -8568 852 6657 5338 -9210 -20117 -6875
5288 -6875 4989 -6813 -17649 -7248 5975 7859 1004 1387 13328 5329 4679 4398 -2608 -13826
5274 -13826 -5481 -8747 -826 -3100 -18655 -24375 -30729 -17016 -13189 -17273 -16303 -12873 -13650 -21082 -19864
5259 -19864 -19595 -12893 -12789 -11206 -11166 -13696 -21924 -13336 -16270 -10947 -4400 -4688 -9039 -19972 -15708 -7790
5243 -7790 -6729 -18518 -13392 -1650 -5140 -2421 3135 4289 -10985 -20816 -17943 -11839 -626 -9424
5229 -9424 -19612 -10151 -12732 -8608 -10237 -9340 -17634 -29981 -24549 -8584 -6123 -8362 -7090 -4014
5215 -4014 -7435 -11934 -6174 -14721 -9114 -832 -7939 -4879 -7733 -10099 3132 5435 7190 6310 -5696
5200 -5696 -15586 -5964 -3673 9539 7687 -2471 -10377 -19793 -10472 8598 29382 27004 10576 -7336
5186 -7336 -25142 -23898 -14974 -15374 -8853 -2986 -6740 -7203 -15728 -11934 -3238 -12838 -9519 7847 22445
5171 22445 4548 5455 2373 -7370 -6523 -961 5115 13627 15876 16869 5495 -630 2238 -10572 -25861
5156 -25861 -28656 -20342 -13368 -13040 -13104 -17372 -9592 -7517 -7344 -6895 -75 -1341 -6171 -8900 -9795 2144
5140 2144 -933 -10481 -19890 -16143 -25116 -17123 -14313 -10642 -14342 -14008 -8469 -3417 4852 18420 19681
5125 19681 13123 19809 17326 1533 330 158 -4182 -10589 -6193 1801 -6733 -4798 -2775 -1557 4293
5110 4293 8727 3930 -2182 13755 10500 547 -5238 -17744 -16839 -16860 -11708 465 -3936 -17911 -29878
5095 -29878 -22469 -7304 10169 11809 7849 -7601 -15600 -9563 -1758 11670 10142 -7113 -9949
5082 -9949 -166 -3829 311 17201 13244 13745 -115 -10164 1255 -5949 -3261 -4510 -5193 5026
5068 5026 15037 14583 17371 14142 9650 7454 -3091 5112 3502 -5332 2561 1449 9059 6742 -2748
5053 -2748 -4093 4781 -397 -1044 -5933 -12687 -6501 4202 10174 12272 18852 14232 751 1090 18209
5038 18209 12744 4117 -2177 -6178 -3550 978 -6096 -19356 -27610 -23610 -17015 -11326 -15975 -17938
5024 -17938 -15191 -15697 -20731 -31708 -15422 6 -4318 -15427 -18081 -18746 -25075 -25621 -18134 -21376
5010 -21376 -20254 -15118 -22531 -20801 -19373 -22810 -15869 -13642 -18506 -18052 -23760 -24272 -8760 3063 2394
4995 2394 -2567 -2260 -2085 -3503 -563 -2805 -6916 -2018 13237 16836 15983 6139 -7224 -16138 -15372
4980 -15372 -15448 -9715 -11132 -6876 -2248 4094 13151 19493 26459 28296 17196 939 -12885 -20363
4966 -20363 -26990 -34530 -36772 -26927 -13472 -7483 -7296 -3352 2901 14104 21262 8939 -3038 -3306
4952 -3306 -1756 -1796 10506 21566 33063 12734 1154 9235 -729 -6909 -6408 -1696 -6456 958
4938 958 3103 6172 1065 -301 -5465 -7977 -20889 -21671 -11393 -1715 -9026 3729 5004 -15286
4924 -15286 -26472 -26483 -26795 -17842 -387 1549 -16372 -22822 -7589 4681 -1301 -1973 -3993 -5668
4910 -5668 -7656 -142 17116 21250 9372 -9617 -3732 17707 4909 -10705 -7291 -8727 -24438
4897 -24438 -16148 755 8806 2842 -6618 -16579 -10055 -2802 3170 2126 -9553 -10279 -9101 -11132
4883 -11132 -12115 -10702 -1233 11727 20010 18695 4859 -3435 4077 -8541 -9237 2609 5846 14079
4869 14079 -11381 -10611 -5944 -6455 1313 6913 -5836 -12718 -4273 -7768 -652 19263 16065 4597
4855 4597 -1851 -12871 -19672 -14783 -13581 -10098 -11618 -8326 -8970 -6092 695 -8904 -7727 2410 -2196
4840 -2196 6084 17877 21162 5219 -2972 -10244 -607 11727 8743 -4215 -13954 -21906 -23441 -12792
4826 -12792 -8098 -6139 7479 15704 -1666 5227 5502 -2680 5832 15978 4686 -2541 -6745 -5057
4812 -5057 11907 21246 26475 28795 22930 18087 16692 17710 13159 -7850 -887 13074 18092 13475
4798 13475 1346 13361 5742 -999 3286 -366 479 2029 6118 3358 4916 6889 10350 2273
4784 2273 7119 11742 -5344 -13688 -23342 -21225 -9731 332 3007 6226 11769 11026 8189 11786
4770 11786 6220 -20017 -14388 -6330 -7710 5368 13963 -6608 -6814 1183 -822 -10638 -3352 4907
4756 4907 4343 -348 -19033 -21446 -13168 -14552 -8427 -3471 -2227 -13 919 376 -2336 -1414 13093
4741 13093 4844 -5560 -8498 2802 1054 -4562 -6640 3220 8395 2299 5273 -16821 -17860 -13928
4727 -13928 -2786 4039 5571 7631 26281 20752 -208 -6400 2901 9475 -423 -8660 -19374 -18756
4713 -18756 -2782 -2200 -2576 10064 4817 -1339 6825 6832 11391 4156 -6971 8089 -41 1578 20718
4698 20718 14482 2448 5925 26472 44198 31934 23909 9019 8894 12940 15312 17595 15455 7484
4684 7484 1643 6954 16071 14496 15501 22218 21575 20799 21273 26330 22335 19978 7155 -148 -7339
4669 -7339 -11756 -5893 -4676 -15654 -23105 -16638 -23700 -30041 -27274 -7876 -11522 -21494 -15502 -9843
4655 -9843 -5444 2097 1961 -174 725 8846 27820 16891 2101 4359 20836 19206 6040 5208
4641 5208 3045 7905 13414 19201 9634 7486 1228 -3694 -5372 2957 3355 -11733 -33106 -37194 -25246
4626 -25246 -14059 -4793 -2822 -3030 -1708 -2056 4934 3615 -4249 3338 8180 -1246 -5071 -719 7272
4611 7272 13694 8125 -3606 -9448 -12785 -23840 -27739 -21886 -10084 -4422 -176 7763 20899 14871
4597 14871 7224 8379 10402 -4168 -27041 -25475 -20835 -14610 -5236 14676 21340 20078 4319 -8916
4583 -8916 -3317 8426 -5461 -10767 4132 11053 15199 8094 10295 8592 4422 9141 820 11051
4569 11051 -1183 -225 -10481 -8893 -8980 -14999 -6424 -4050 -5152 14781 14377 21650 20729 3769 1361
4554 1361 -8114 -7710 -5980 -6195 -10987 -11307 2879 14638 6433 14403 -10496 -7782 1756 -5326 92
4539 92 9741 12063 1149 2503 -7076 -7532 -5388 -5060 697 -5844 -19138 -22669 -10572 -15550 -18701
4524 -18701 -23611 -23015 -8496 -11952 -8293 1163 2473 1556 -6324 3980 -2601 -6872 -1089 865 -11840
4509 -11840 -14995 -15402 -9710 258 -11546 -9633 4639 -6267 -9811 -6666 12425 12164 599 -9117
4495 -9117 6917 1505 8686 8333 2108 -12185 -16675 -3429 4910 -4946 -5989 -2422 646 17887
4481 17887 20181 15254 8843 8607 14561 -572 -15599 -11903 1707 -5546 -23567 -14440 -930 3146
4467 3146 -8966 -16686 -10976 -15911 -1199 203 -4475 2464 888 -10533 -5376 -2865 -430 -1881
4453 -1881 -7754 -17101 -3680 -9044 -7876 -1424 -11840 -7487 -12047 -20995 -7423 -1503 -11814 -19564
4439 -19564 -26458 -23717 -24303 -28162 -17655 -930 9474 -1216 -7701 -4405 -366 -10632 -5146 4976
4425 4976 19449 32830 30154 24710 26252 18057 1636 -9058 -4592 -208 4280 8469 13061 9068
4411 9068 -2850 -634 5687 9447 688 8942 27251 24111 14241 -10444 -13791 -3809 -15882 -16950
4397 -16950 -14396 -11813 -1318 22487 17983 14685 19916 21034 15363 8449 27604 20315 7463 19161
4383 19161 20422 13685 11958 11042 13614 10914 -1575 -2092 -7090 -14323 -13519 -11919 -2776 168 -1829
4368 -1829 1587 15228 16354 21282 21562 17275 -2710 -16303 -22317 -17279 -2039 1831 14003 2743
4354 2743 -10672 -1670 121 -4572 -11953 -4060 -10220 -15781 -21316 -13242 -1931 12449 4467 659
4340 659 -4180 -11303 -11673 -9228 -10600 -16628 -19804 -19136 -24475 -32434 -30522 -27042 -26045 -1041 14980
4325 14980 10500 9735 9181 2951 2538 -3689 398 -670 5952 15001 15176 -242 -8227 -19746 -22947
4310 -22947 -17850 -15799 -9040 -1037 -3049 4181 8783 -213 -17783 -17044 -10008 -8603 -12212 -3545 7848
4295 7848 15656 10059 5536 6773 -15870 -19874 -8807 -13154 -20174 -22645 -26008 -21712 -17481 1565
4281 1565 8482 21891 13448 5163 -923 61 6153 4418 -471 354 -1310 9757 12044 -5532 -14727
4266 -14727 -20692 -16846 -6529 3496 6372 -4934 -16423 -13036 -5882 -17297 -20708 -13009 -16436
4253 -16436 -18785 -11579 1872 -2921 -11203 -9470 -3572 -8082 -17625 -12679 -1948 -8705 -12664 -11861
4239 -11861 7242 24100 22984 17976 5623 9645 11650 4830 -5989 -17834 -22837 -23457 -23003 -32813
4225 -32813 -11440 -10964 -21473 -14050 2234 -2915 9788 21961 12027 -5220 339 7246 4661
4212 4661 455 7152 2957 1337 11590 15046 7113 3684 -2228 -11614 -13735 -8763 -6146 4956
4198 4956 24738 11637 2338 3049 5009 9314 18629 17339 13261 1662 -9455 -16452 -15368 -5986
4184 -5986 -4879 -12015 -24234 -24081 -19355 -7515 11051 463 -15097 -11186 -5424 3409 11196 18296
4170 18296 19460 13906 6430 -4816 3005 5647 6074 6290 5737 1687 -4672 16398 29869 27622 20399
4155 20399 23110 6155 -8339 -13265 -3486 -611 -6068 -6933 -13490 -5082 11617 9638 14517 22737
4141 22737 21328 7429 -7882 -715 22302 11988 2033 -6846 -12004 -17670 -17284 -17349 -16843 7272
4127 7272 12131 2756 -6163 -10999 -3515 -2070 -15477 -23151 -24959 -7975 1303 8806 2418 -27905
4113 -27905 -28398 -8823 -6431 -7907 -12259 -14528 -5995 -9095 -8141 -10752 -9577 3332 5045 -3249 -4236
4098 -4236 -6060 -5262 -14518 -24020 -17103 3825 6762 4990 -12587 -17992 -9692 2772 11122 12760
4084 12760 5409 8730 2735 -4394 -5102 -8140 -4599 3388 2941 9539 18085 24390 24614 5676 -2460
4069 -2460 -954 -8458 -16336 -27574 -27596 -23234 -3205 4207 -10988 -14413 -22440 -22470 -10327 -3657 19
4054 19 -6862 11298 25929 13013 -3274 -20380 -37785 -24144 -7874 -6438 -1468 2075 -3815
4041 -3815 -7902 -17145 -5682 1694 282 5968 7725 1750 5631 2659 -18519 -34660 -17392 -16079
4027 -16079 -9289 -8368 -12346 -10145 2027 4238 1459 -3907 -12289 -1172 -6203 -17334 -8642 8601
4013 8601 -4459 -13912 -15551 -25687 -24073 -27171 -13589 2536 303 -1808 -1143 1140 -7909 -15964
3999 -15964 -9485 175 5445 -6750 -14340 -2408 -4866 -16817 -25011 -11452 -10124 -15792 -22063 -22468
3985 -22468 -19341 -23608 -30188 -13412 -1795 1007 -8403 -10301 4790 3126 -5745 -3255 -4311 -6517
3971 -6517 -9292 -8325 -4238 -8514 -16551 -4291 3541 -5202 -5190 -7729 2535 3590 -5052 -12457 -6829
3956 -6829 -13174 -1728 10675 14742 22062 23573 25793 31273 35602 34108 28552 17001 4913 -9182
3942 -9182 -11561 -17027 -13144 -11155 -22945 -11073 -8195 -4181 -6116 2279 5441 6126 4809 -10627
3928 -10627 -9400 7678 5096 -3542 -15913 -18231 -15245 -13875 -18069 -4741 -3319 1710 -14286 -16678
3914 -16678 5401 11918 5832 4468 -4853 -13996 -14025 -7881 -2248 -13773 -23961 -26380 -23140 -14083
3900 -14083 -6008 -9027 -19487 -10909 -4679 -9258 -4009 -2180 -15372 -27603 -17292 -1580 -2957
3887 -2957 -15915 -14787 8 14490 30108 36767 16797 -4212 -3311 -1722 -7161 146 6611 4509
3873 4509 360 -6770 -3561 -22820 -48299 -41762 -25525 -12600 -7131 -19313 -28369 -32849 -19209
3860 -19209 -5717 -2263 4062 -10918 -15432 -815 1714 3170 4362 -9645 -7684 -5699 -19888
3847 -19888 -23903 -30034 -18734 -99 19325 16198 11787 9786 4011 5676 3270 -8776 2029
3834 2029 16271 15528 11039 14908 5843 -4484 -6962 3788 16351 3556 2459 8905 14012 8880
3820 8880 4868 -16376 -34234 -22886 -16990 -15693 -18353 -13943 6022 19028 28544 25966 19055 9527
3806 9527 -3716 -4667 -2296 -17757 -13173 -15630 -9427 12022 8840 4412 9818 3143 2328 13119
3792 13119 10273 2665 -9226 -10324 -5377 -17155 -35131 -19143 -2485 -191 -15828 -11806 4807
3779 4807 -3652 -5188 -3357 -2884 -3752 5531 12204 10746 7120 -608 -12922 -6122 3514 8589 16143
3764 16143 11009 -1864 -1268 17565 25649 27547 23682 23363 5766 -2920 2945 9108 -956 -12769
3750 -12769 -21558 -24848 -9707 8743 18390 20957 3276 9723 20868 23441 22259 24449 6932
3737 6932 -12022 4496 6547 12596 9611 -672 3729 -10290 -19250 -19699 -19358 -9583 -1355 5498
3723 5498 14945 7402 2775 12585 15350 10344 13045 11801 15958 36048 20724 5189 -4564 5273
3709 5273 2737 1490 -8089 -15488 -17481 -19015 -23315 -14033 -15779 -22475 -12625 -8921 -7805 -2770 10771
3694 10771 9477 -18860 -42367 -25463 -26060 -19268 -11695 -9067 -6401 -8978 -10128 -3821 4018 -3504
3680 -3504 -9897 -4494 -1322 5276 2284 -252 -19881 -19925 -13180 -13136 -12408 -8960 -1350 -2083 -10351 -15156
3664 -15156 -12476 1865 10494 14199 9229 -4689 -3070 709 -8503 -2404 17499 25952 16027 14743
3650 14743 15541 13656 12008 7070 8362 -2190 -2040 -5161 7159 6035 -649 10052 4108 4931 4865
3635 4865 -9382 -9997 -9356 -16408 -8589 -7201 -9191 -10172 -2522 4595 343 -14368 -4953 22472 8450
3620 8450 -21488 -11521 7624 5434 -6795 -4420 103 -1896 2139 8515 13414 11524 9784 -403
3606 -403 -20249 -25147 -16756 -5482 -7265 -20287 -30427 -26394 -18508 -9007 -14930 -18836 -4239 -443
3592 -443 2721 14393 10140 3684 926 -13242 -12481 -9597 -18439 -15701 -7746 5665 15445 12219 -355
3577 -355 -1047 -13953 -5413 66 1414 -413 -12150 -14974 -12617 -9512 -16904 -11055 -9779 -4352 4602
3562 4602 729 132 -6735 -8908 -11636 -7123 12965 17192 17541 14557 5615 5491 10293 867 8132
3547 8132 25748 28645 8768 -3361 7764 11273 8704 5053 1255 1725 7289 10584 8966 8455
3533 8455 -1447 -4466 11023 6373 3413 2746 9158 14310 3238 8339 -1182 -13381 -15166 -16871
3519 -16871 -8808 2747 -8650 -18121 -10641 -10615 -16003 -16731 -20787 -27981 -13371 2532 5350 18688
3505 18688 22571 10037 16330 16671 4568 4926 -3856 -22452 -29367 -17207 -10708 -6619 3499 2074
3491 2074 -8502 -6851 -7523 -9682 1228 6017 -11167 -9178 -6491 -13818 -19563 -11474 -4804 334
3477 334 10914 7785 -995 7097 8671 5225 16961 13816 -928 4672 10801 13922 5121 5678 6347
3462 6347 14549 22290 10709 -5805 -9933 -10999 -12204 -8444 3259 26263 24689 17028 12882 13609
3448 13609 1918 -1576 3604 4883 -2812 5407 4958 -10881 -12821 -5969 -15801 -20233 -11764 -2008
3434 -2008 3375 7594 1041 -6978 -9642 2023 12524 1647 8588 19243 18695 16043 10281 6964
3420 6964 9685 8497 5237 12311 11075 4974 -20842 -18673 -5655 -8944 -11279 -22444 -8813 -1877
3406 -1877 3120 -4353 -110 10618 21242 22242 13847 3338 783 4404 9264 13286 12920 16241
3392 16241 11170 -16980 -20681 -15667 -21814 -21958 -12228 3199 4830 8227 3269 3955 -16621 -27904
3378 -27904 -25842 -22404 -18902 -10069 -563 3418 6342 2170 6587 12601 6628 -2131 -3187 -3425 -2893
3363 -2893 15420 21922 23550 13093 -5472 -2787 5873 -1197 -21706 -39704 -31157 -22173 -30551 -21837
3349 -21837 -15804 -3489 -4389 -16502 -17794 -19073 -26951 -17334 -3687 13016 3460 12897 20850 -6362
3335 -6362 -7948 1065 15693 25400 19372 18521 10137 -8793 -19827 -14153 -3785 4369 1833 154
3321 154 -17554 -19584 -15697 -3344 11106 17784 10236 -4526 -7423 8341 8683 5606 -19 -14240
3307 -14240 -11092 -475 4003 105 8169 1501 -1085 -4509 -9478 1059 14349 23407 18836 19718
3293 19718 9373 610 9670 7315 576 -6395 -5305 -7584 -2719 -4001 -19051 -28771 -34641 -24391
3279 -24391 -1365 -3630 -2539 -8301 -2302 3044 -4203 -11641 -17375 -15040 -17534 -21596 -17246 -2686
3265 -2686 11776 17612 17104 17191 21897 20636 12917 5771 591 -4592 4415 12144 672 -10702 -3097
3250 -3097 -2131 1399 -14191 -10177 2881 -11500 -33275 -16321 -163 13131 20061 3834 11580
3237 11580 27445 20583 14545 17917 21636 15455 4845 -3463 -2415 -4200 -14685 -8039 -6178 -4670
3223 -4670 3170 -1897 -3981 8926 14105 9976 9026 12589 -8023 -16316 -4927 -5395 -1438 -2705 -12987
3208 -12987 2525 10940 3321 -8131 892 4870 -3161 2366 8774 2443 -686 1638 7160 8205
3194 8205 18048 13400 2104 2445 13132 12486 -4949 -10303 -13705 2312 18008 17412 5643 6242
3180 6242 12444 1211 -8195 -15999 -8538 -2483 13448 17656 15747 8630 -587 -10507 -20043 -13689
3166 -13689 -5455 -11655 -19395 -19459 -19947 -16583 -23988 -34022 -20580 -21999 -16890 -11791 -9255 3667 13176
3151 13176 10140 4308 10608 4274 -9065 -22531 -22394 -11950 -3591 -10731 235 9452 53 -8343
3137 -8343 -13486 -17643 -21503 -22346 -19221 -6171 12447 8183 -523 984 -1288 249 -5259 -1664 1526
3122 1526 7554 5632 2540 -2527 2426 -971 6348 8431 5538 3464 17416 25116 29627 25599 32018
3107 32018 30816 24899 16003 9510 17899 6941 6259 11049 2357 5881 20385 22204 10018 12905
3093 12905 11376 7877 6234 -4563 -8779 516 8940 6472 1428 685 -3624 -2597 6406 5780 -2042
3078 -2042 11579 12575 16428 7382 13144 6546 -8575 -7444 -15153 -2770 3456 2670 6280 14544 23857
3063 23857 17545 19927 7640 10812 31045 25330 20188 19216 18478 21262 20832 12418 9377 -2897 -3289
3048 -3289 -3169 -473 -2584 -11000 -16055 -19036 -21946 -2353 9309 -7152 -20071 -27504 -9844 1425
3034 1425 4220 13928 5060 -2853 5637 13633 -486 8680 15719 2961 -2122 -272 -894 8032 11334
3019 11334 13521 25505 31802 12581 12764 6058 13726 15385 6047 -2178 7095 2887 4201 9202
3005 9202 13850 3696 -7529 -8052 -6463 1982 -6646 243 13428 16112 8783 4465 7995 1737
2991 1737 4137 15336 6322 13288 17926 15728 12662 14812 25128 6966 3774 8011 9239 12797
2977 12797 15898 10517 -4796 -1020 -2368 4709 17430 9918 8239 19166 21236 16780 6004 3914
2963 3914 16114 25916 24613 21261 20905 5518 -4729 3408 14665 17882 13190 13757 13925 11955 15927
2948 15927 13195 7295 -5652 -2190 -7263 -11605 -19797 -16208 -18261 -13550 -11042 -4447 7998 12809
2934 12809 12568 12027 13431 11562 5742 7761 22029 15682 425 -1620 13464 18649 5365 -12840
2920 -12840 -11884 -16276 -5076 -3242 -417 -88 6942 3798 623 11272 4744 5545 2394 -5580 -10241
2905 -10241 -7591 6505 8823 4671 3165 -121 1218 13521 23664 26035 13931 -1774 -11311
2892 -11311 -6111 -2636 -5985 -3937 8028 11017 4214 7757 1673 -4256 -9990 -8165 -12189 -27503
2878 -27503 -3724 2190 -1503 -5729 -9172 -16956 -15030 -12617 -28563 -29323 -23171 -15887 -10301 118
2864 118 1430 -8931 -16673 -25444 -23386 -22657 -24046 -17370 -7389 -15704 -15648 -7492 -16222 -23163 -11807
2849 -11807 -19659 -37657 -33692 -9280 -2740 -11809 -11447 -4625 3091 5151 6486 -3703 -1518 1206
2835 1206 7415 12569 -1004 -225 8324 7163 15723 31089 37273 29160 19438 18670 25812 5617 -6806
2820 -6806 -10755 5285 6233 -4871 -7757 -4642 633 844 -7053 5557 9047 4660 5285 7081 9618
2805 9618 12290 4447 -10564 -5649 -654 16124 18978 13141 22653 32029 12724 -17113 -17376 -12315
2791 -12315 758 3956 -8832 -7264 3948 5862 137 -11007 -12044 6083 -750 -1888 8372
2778 8372 8107 9116 8265 13092 37378 51419 39449 22353 13951 -4121 -3428 4581 13241 21288
2764 21288 37771 23454 12041 -4218 -16027 -6515 -15855 -12665 -9149 -9225 -1869 3938 -3149 -6676
2750 -6676 -17059 -24984 -27044 -23832 -33070 -23475 -20686 -28687 -21977 -10515 8442 5523 7751 -3811
2736 -3811 -7196 -7551 -5810 -16088 -22675 -11305 6493 6348 3869 -13570 -35507 -37414 -22110 -12964
2722 -12964 -3259 2890 -4556 -18453 -22516 -19901 -11404 -7121 -3573 -5239 -9792 -3944 -6204 -6546 -16933
2707 -16933 -14364 -7709 -4930 -3019 13185 15716 8451 6576 19703 29960 25622 38548 31577 20303
2693 20303 13968 27322 33008 19809 1011 2221 15497 20754 27548 20710 -1612 -12014 -33028
2680 -33028 -28071 -20822 -19176 -4906 3959 7763 1761 -4407 -677 9542 11325 3556 -330 7536
2666 7536 17413 6815 -4225 2025 222 1761 8740 11872 7536 -1992 -18401 -29245 -22369 -11627
2652 -11627 2768 1230 -14188 -23549 -19586 -17957 -13651 -11053 -18978 -16114 -7614 -4205 -23962 -20177
2638 -20177 -1470 2346 18109 10450 9809 11305 21205 10493 6768 -4374 -12942 -14092 -47 321
2624 321 -42 -1882 -1617 4137 -8546 -18476 -28070 -25038 -22474 -26454 -13101 -2873 15070 10254 9070
2609 9070 3596 5077 7436 15428 22299 16627 21693 18284 9190 -911 -13964 -11286 -6013 -17428
2595 -17428 -39231 -40669 -14641 -7058 -5279 1157 -14848 -22243 -27236 -23112 -16131 -8986 -5448 -251
2581 -251 13427 11028 1663 -1207 848 868 12740 16542 -330 -4843 -2045 -8386 -8437 -10710 -7327
2566 -7327 -20124 -15706 -3966 -1335 107 4278 -6762 -25254 -17178 -6459 -1258 2188 10019 5383
2552 5383 3161 995 -2329 4008 -1357 8023 3375 -5609 -1978 -3828 -1783 -9618 -7988 -8671 -4203
2537 -4203 595 12043 32369 32496 35686 24912 18759 26879 14445 1622 7477 20175 16720 8300
2523 8300 15745 9701 11094 9682 4648 2900 -624 -8322 -18436 -23450 -23593 -13911 3359 6591 3832
2508 3832 151 555 742 7618 6981 7844 16574 9132 6328 5674 5298 -933 -2182 5236 4458 6970 5694
2491 5694 11105 7977 9494 10367 2086 -244 -7462 -6393 -2360 -13167 -5755 5008 202 -8832 -9391
2476 -9391 4133 34529 33223 25872 20170 15123 -24 5451 11356 23508 22584 16061 22916 25097
2462 25097 7388 7468 12073 63 1291 19709 12952 11858 8812 2262 -1487 -4841 -6116 -3665
2448 -3665 -9130 -13127 -5351 -10368 -9194 -11620 -1619 -6001 -3500 14790 7081 17329 16460 15969 13181
2433 13181 19587 19280 15159 17250 14829 2119 -14959 -11479 2985 -1531 -4653 -521 -5774 -11960
2419 -11960 -2391 6348 23585 23361 18042 5596 -3285 -38 16653 3176 -213 1500 -7717 -16330
2405 -16330 -5272 -7274 14913 22595 16050 4142 -5288 -2414 4325 2824 12351 13553 1841 -14712
2391 -14712 -4963 15506 19996 16037 18900 23516 21499 11975 14893 15228 17816 8242 -1009 -8178 -11098
2376 -11098 5078 25176 29519 37655 22959 13670 -3865 -25759 -12336 -3306 -1261 9751 6395
2363 6395 -607 -10396 -11723 -4752 8533 24964 35832 29626 24978 23272 16068 7235 10710 14317
2349 14317 17791 14965 13770 6166 8207 -49 5643 20061 26515 7967 -8110 -20243 4051
2336 4051 -282 920 3990 3890 -9046 -17695 -19791 -17564 -8709 8537 7395 4504 12808 17209 18641
2321 18641 18094 9175 19545 17266 -377 -276 4448 7417 14437 12800 13381 17301 18159 19013 17308
2306 17308 10823 125 768 -325 -11369 -15565 -7865 -6279 -6849 -9113 -4016 2916 16956 25908
2292 25908 16569 12050 8535 9233 14336 6525 6966 4883 22514 12460 10911 16107 -1528 -4870
2278 -4870 6129 11992 9283 781 1040 8715 9446 12488 23611 23644 28174 26212 15040 19735 11670
2263 11670 1011 2963 6765 -7270 -8389 3521 2016 -5770 -7814 -7217 -20291 -20044 -11713 -2407
2249 -2407 5685 -3816 -2708 5014 5104 17390 19168 7006 2728 -8962 692 2639 22040 27625
2235 27625 20183 2085 -3820 223 5815 2840 -733 4801 8831 -3005 140 7348 -409 -6481
2221 -6481 -244 8995 7546 9845 3909 -6243 -4425 3694 2005 10689 14576 14910 10607 2314 -7008
2206 -7008 -3557 7174 10552 -4148 -2335 3719 4067 4514 6737 -2394 2397 -2264 -8907 -13666 -20290
2191 -20290 -14399 -12057 -19268 -27070 -16546 -4208 -18074 -13542 -1802 -5352 -10472 5469 6841
2178 6841 7314 1419 -6225 -4993 -1049 1201 -15151 -20769 -12018 -8046 -2930 -2623 -6049 -5777 -5514 3384
2162 3384 4078 15533 7047 -4418 -7781 -1972 5089 -4071 -2614 6918 9278 11050 13888 -4742
2148 -4742 -11377 -26159 -28124 -25114 -14319 -10923 -9905 -8390 160 2964 -7416 -6745 -12031 -10203
2134 -10203 -5495 -4599 -12105 -10464 6194 14985 3359 2311 8331 2817 -4797 2794 9898 31173
2120 31173 29346 21530 16329 -13517 -16773 -22670 -22590 -20830 -18733 -10518 -236 20544 -2460 -14326
2106 -14326 -5778 9563 11790 12213 13650 13996 5376 3497 -1291 -7783 -18858 -4750 7907 -670
2092 -670 -16939 -35636 -36519 -37608 -28110 -1784 9249 9681 11169 6242 -838 259 -428 3931 6053
2077 6053 8026 1749 -10502 -15774 -15136 -7149 10141 17373 7627 -5112 -9950 -13737 -29647 -33653
2063 -33653 -20620 -12408 -16376 -7211 3551 -466 -2106 1070 7296 4134 -4129 -7740 -11614 -4474
2049 -4474 -8503 2381 4467 -285 -9787 -3520 -7777 -10818 -1959 4249 1258 -12456 -22266 -26201
2035 -26201 -14557 136 2669 -3026 -10682 -8645 -11320 -9441 -8185 -6232 5280 -7941 -14571 -21049
2021 -21049 -13498 -11568 -5589 11856 12667 10926 11044 18573 28164 28269 29844 19550 10227 4309 9719
2006 9719 4148 8100 10309 10205 -4768 -12791 -16381 -20811 -5913 9662 7292 7422 11925 6143 11814
1991 11814 12900 -2427 -11328 -5761 -6459 8175 23638 8165 6722 6903 5727 -7239 -10244 -11802
1977 -11802 -10943 993 17496 17238 6456 -11579 -3866 2913 -1958 -342 679 1911 2450 -4653
1963 -4653 720 15404 13048 27066 31519 16896 9699 8988 18106 19432 16800 16953 -3668 -3044 4741
1948 4741 12225 12619 4619 10961 11366 13829 2924 -1317 3949 13593 24708 35381 35483 32785 28623
1933 28623 25145 24047 16015 27214 13653 6590 7059 -239 14598 28907 23513 6921 1534 -12595
1919 -12595 -19321 -21689 -26995 -28961 -22008 -24356 -23301 -12391 3745 108 -8622 -13527 -7369 -2228
1905 -2228 3314 -7525 -7929 -6812 -3387 -49 4271 1958 -5897 -1339 8541 5519 4216 13072 17496
1890 17496 13213 17976 15724 -3120 -8644 -15263 -20366 -12978 -6167 -5530 3535 3610 10732 3942 10635
1875 10635 22465 24923 19761 9572 -4138 -6582 11261 25748 17106 17178 11289 3975 6597 316
1861 316 -9515 -5961 -9859 9830 26396 16041 18873 19081 8934 1388 -15 1959 14236 25908
1847 25908 30603 12655 -3502 648 6108 -3984 -9707 -4162 1675 -5801 -9843 -3729 -6701 -463
1833 -463 -2075 -10505 -12608 -14287 -5830 6588 5307 12531 21738 29640 20788 13231 18457 12520 -3282
1818 -3282 -6526 -3568 -9347 -4518 -12766 -26547 -24073 -20496 -22733 -19709 -6048 -3523 1567 907 16271
1803 16271 30986 23754 14330 2934 -6124 -24093 -24340 -16652 -13622 -16058 -3157 9128 7143 11766
1789 11766 7963 10771 7417 -9707 -11103 1685 -5186 -7949 -22989 -23291 -8282 3186 3884 7054
1775 7054 15089 9648 5195 5709 -522 -23081 -24244 -19845 -11994 -7070 9678 11424 -14026 -25731
1761 -25731 -18185 5980 11040 5886 131 7582 11931 9618 -9293 -13419 -11012 -5242 -6338 -793
1747 -793 -1363 -2279 -8499 -12378 -4812 -9029 -9513 6410 9820 5866 4256 -13927 -17383 -21548 -10090
1732 -10090 5132 23287 31932 22524 17900 -4271 -10836 -9609 -10748 -1359 212 15897 23122 6025
1718 6025 2189 261 -14993 -20804 -20051 -6912 10859 32669 24583 9438 14981 10040 21527 14039
1704 14039 -9267 -6064 -2580 4860 18302 3483 -10898 -9701 963 6239 5516 -9637 -8803 -15
1690 -15 5644 14465 15279 17022 17459 8479 4426 13481 27238 11683 12401 15874 20637 25345 21302 11441
1674 11441 523 -7301 -5582 -5718 -18885 -2994 4701 16236 15590 10305 14583 10078 791 -17955
1660 -17955 -16881 -13507 -25383 -31106 -18858 -11349 -6093 -1770 -8178 -4807 6655 -4071 -8670 -5502
1646 -5502 2988 -7597 -18733 -20004 -17708 -16601 -6802 -7744 -12369 5037 -1148 -16363 -19299 -16705
1632 -16705 -6974 3075 -3921 -11701 -15154 -4221 -2913 -8006 5609 951 -5408 -3373 -8698 2344
1618 2344 13989 11888 7886 8959 5057 -4611 -11137 -2637 12392 16017 16320 20567 30283 29867 22814
1603 22814 5509 -7424 5108 6076 -4352 -5088 -11258 -4717 -7662 -29712 -20655 -8978 11420
1590 11420 14225 27404 26171 12066 8562 7226 57 3542 -2370 -6660 -12910 -1972 2251 -3343
1576 -3343 5201 17250 26183 13438 -2155 13420 4713 -2867 -4104 -3524 -6225 -6590 2845 9225
1562 9225 5840 3906 580 -229 9682 23006 23423 14990 1256 -7053 2613 6156 -3633 -9312 -17742
1547 -17742 -9226 -2880 -13537 -13387 -1256 -6817 -17282 -14974 -16767 -20770 -14856 -14969 -17526 -8960
1533 -8960 -924 7750 12910 19819 24271 17643 -9794 -8487 -4750 -16510 -21787 -8148 -14669 -9299
1519 -9299 3760 4319 14884 14164 6092 11113 13322 1906 960 -2876 -10344 -6780 487 2113 4432
1504 4432 -8156 -11679 1227 6704 4123 -4035 -4694 -3074 13251 7004 -4207 3489 12776 14241
1490 14241 14870 15262 10872 6014 -1608 -10304 -1571 9709 -5118 -11722 5509 26411 23074 10408
1476 10408 2023 4218 4572 3480 -224 10381 16062 7826 2815 3485 1819 5169 3884 -1719 -12144
1461 -12144 -4199 -2157 7546 11577 7873 11468 10173 8380 13753 17849 6019 -1367 3322 10977
1447 10977 18838 12297 17420 24919 30146 24960 24226 12141 -2313 -9231 -7109 -4419 3387 1490
1433 1490 1112 5690 10016 23308 26729 24498 10810 2170 -3233 11094 27028 19667 10686 5666
1419 5666 9067 2717 -7037 -6557 3185 725 -1659 -4666 1705 7561 -5913 -1122 7265 27946 25398
1404 25398 9916 4050 6939 8737 2762 -12178 -14829 -9850 -18904 -19666 -7083 -4616 -8325 -15734
1390 -15734 -4662 7486 5762 2246 -4819 -6376 -5958 -3979 183 9759 10224 -1944 -248 9692
1376 9692 5513 -1317 -9465 -18993 -28800 -30586 -31775 -35325 -35832 -34278 -10286 -17736 -11440 -9264 -8179
1361 -8179 -6260 9759 27046 12946 -8685 -4149 14463 11348 -4907 -13246 -2081 -1287 3145
1348 3145 -55 -2829 -7102 5946 12824 15753 12684 9774 13398 18460 11198 14746 1843 7606
1334 7606 29717 29714 4314 -4954 11963 915 -3925 -4398 -4726 6865 6368 10021 3978 -16364 -13909
1319 -13909 -3575 -3348 -7336 -3508 -8823 -8202 -4860 -8477 -19743 -17826 -17494 -12706 -4901 2869 8877
1304 8877 14282 10224 18093 26725 26391 17890 7142 -5690 -12671 -13398 -1816 7482 10450 -8604
1290 -8604 -14978 -16827 -10251 -7090 -6351 -26371 -27056 -25621 -21878 443 358 -10391 -7038 -8924 -12481
1275 -12481 -12649 -13119 -9704 -4760 -12063 -2671 6572 9738 7750 7656 17172 17756 1586 -697 -980 -3228
1259 -3228 -13567 -8100 -2616 -5226 9578 9893 19090 15819 15006 636 -14311 -2712 1761 -2837
1245 -2837 -7105 -5548 -3745 -5212 -5918 -2568 6690 -3580 -3273 -3717 -8358 -7085 -821 6739 -616
1230 -616 7760 11892 11864 17525 22094 16046 3735 845 -1316 10668 10480 16388 15478 15945 12884 10651
1214 10651 13930 19810 13285 129 -14422 -4235 -2754 -12540 -12756 -10760 -5430 -2740 1004 6477
1200 6477 6607 6177 12189 13682 20545 17706 5168 -8345 -14560 -12201 -9711 -1041 17652 15979 1296
1185 1296 -2760 -1578 -7712 -3893 3839 8923 14312 2462 1950 11003 16949 14687 -3012 -14825
1171 -14825 -15879 -10144 -5576 -10896 -14818 -11028 -1062 6982 13745 14696 14547 16531 10652 12911 19750
1156 19750 16289 10815 14638 8149 15284 20696 -1225 -12029 11501 30752 31613 18729 13300 8809
1142 8809 702 -7191 -8421 18473 20845 7770 15878 10568 -6593 -2723 -3157 -3468 1472 -1881 -3251
1127 -3251 -7023 -1596 -3501 -13702 -23997 -23389 -10901 4859 7963 19103 24795 17735 17277 19309
1113 19309 17980 10151 -4900 -5907 298 11057 11090 5367 4435 15859 13119 15928 16762 20631 20695
1098 20695 12554 2597 7650 5462 643 -13362 -19203 -22416 -14868 -18930 -15378 3279 18033 28629
1084 28629 22948 -391 1841 9996 11954 5885 -2777 16444 20191 17631 11854 12603 13824 9118
1070 9118 14190 7899 -1160 -3166 4249 -3012 -5853 830 17980 20453 15479 10826 9409 -1254
1056 -1254 -1431 6502 -2129 -1578 969 -492 3122 -242 939 4039 4348 14347 17197 5530 -310
1041 -310 7850 1995 -6821 -16659 -9211 -2599 -60 2049 -5740 -9616 -9878 -18537 -17024 -4198 2267
1026 2267 -255 -3539 8551 -3726 -19396 -3985 10921 14865 3742 1700 17875 12889 10995
1013 10995 14660 -126 -10335 -6620 -5199 -464 -4819 -5705 -13059 -25050 -22165 -3835 1002 7712
999 7712 -5423 -22101 -6019 7650 1780 7352 16502 6386 1679 4857 -9168 -21034 -6125
986 -6125 14738 13574 8183 -622 -9411 -5195 2683 7830 17366 39899 31551 30566 23052 18071 28974
971 28974 36035 21335 7205 -219 -2182 -8730 -12133 -16852 -19306 -16813 -12799 -7602 -14561 -18059
957 -18059 -26795 -22213 -2038 6760 4825 -266 2874 26857 21777 14254 14737 9945 -420 7571
943 7571 14183 13553 15468 -3386 -10017 3815 7786 12104 7206 -751 -5154 -12095 -1822 -7427 -7350
928 -7350 -6423 7588 29136 17805 17338 20089 20080 13265 1120 -10973 -10357 -11630 -248 537 3896
913 3896 -505 -487 -1605 6060 1408 -8765 -6893 -7438 -11783 -7546 -8422 6977 16823 23930 13207
898 13207 2765 2758 5390 17052 18737 9515 -6652 -1994 1076 14266 18094 10604 10102 6268 3034
883 3034 1126 7047 9842 -933 -12862 -20348 -34442 -45752 -38706 -18563 -11930 -49 19300
870 19300 11278 -1308 3269 -12240 -27639 -14120 -14393 -7321 18712 17718 12039 6589 4253 409
856 409 -5232 -7978 -1908 13198 16035 -1966 -19147 -31097 -28122 -21244 -19453 -18984 -22587 -18627 300
841 300 13767 8207 11320 8230 10386 -136 -12020 -15407 -6320 -11153 -4583 14857 15958 5243
827 5243 6200 -1124 -8777 -8318 2104 8451 7306 2289 8088 10098 6650 8320 2417 1057 -7588
812 -7588 -9482 -11638 -15337 -14976 -3669 3401 -3934 697 -4983 5299 -5018 -17802 -16250 6339
798 6339 27007 14094 -7219 3728 17372 10387 -6519 -3641 1209 -10433 -22518 -39988 -42317
785 -42317 -25235 -27095 -23576 -23301 -23542 -9508 -7761 -16764 -17131 -11392 -7714 -7581 2474 4353 -2290
770 -2290 -11386 -16962 -317 9742 9472 -6228 -3855 3483 10773 22952 22374 11401 3069 -2398
756 -2398 -2731 -16672 -18230 -8816 -13732 -19131 -4126 13104 17020 3955 1493 10033 3475 485
742 485 6327 2019 1861 6675 7338 10423 1142 -13965 -11925 -748 6985 10931 9665 2610 -7118
727 -7118 -11663 -16435 -18127 -5047 6069 51 -6431 -1893 2144 14644 17462 -4277 -17880 -11190
713 -11190 1662 -5442 -12389 -15213 -16820 -8652 -9974 -5211 -5502 -5205 7554 16787 9402 -3700 -16763
698 -16763 -9514 3412 1197 4800 5803 -2168 -4237 -1602 5036 4675 4628 -2750 -15432 -19771 -14310
683 -14310 -271 -573 8860 5509 -4698 -2188 5062 20824 22290 14199 7482 5108 -5661 -5685 391
668 391 -2065 -11506 -4554 5234 8673 7483 7832 17212 19403 12918 4117 -13561 -19091 -10747 2150
653 2150 2959 15506 9197 3530 6688 2251 -13720 -13698 -16591 -23200 -3637 -4308 2701 -149 778 -1193
637 -1193 4277 -11347 -22112 -10971 3233 16311 8926 7181 16286 9910 -7231 -8458 5364
624 5364 15090 3589 1923 -1002 1253 3120 2919 1393 -6055 -6525 2768 -14331 -11044 -6844 3825
609 3825 13950 3576 -11648 -24161 -22661 -18817 -16939 -24456 -31922 -43881 -44704 -29230 5702 4302
595 4302 -6530 1285 -3977 -17811 -13797 -8999 -8972 -8930 -6328 -4611 -12816 -10183 -2419 -4413 -1127 -16204
579 -16204 -40307 -42734 -39985 -19447 -17672 -26572 -18406 -9770 -12737 -7569 -11767 -8545 758 6396
565 6396 -13221 -21868 -17938 -25834 -14052 -8337 -9443 -251 6018 10634 7978 -2026 -2870 -11491 -17953
550 -17953 -19872 -13298 -2599 730 -11449 -16593 -12037 -10016 -6003 15040 13197 5797 4765 1573
536 1573 -10299 -9734 4021 2571 4201 -313 12377 22543 13433 3695 -797 -4034 325 16548
522 16548 29787 25772 15589 10058 17420 20519 14583 9997 -5602 -7603 -11928 -4070 9495 12135
508 12135 16630 22133 8414 -10265 -10632 -7315 -10863 5345 18831 8562 -9861 -10127 -2207 14674
494 14674 10845 -955 -7879 -6681 -11147 -14343 -4009 -2961 -3357 3216 -8725 -20490 -10331 -9068
480 -9068 -8755 -10654 -19237 -17344 5100 17502 12399 5261 5481 7573 -2902 -5614 -11499 -7610 -6116
465 -6116 -8236 -23507 -29594 -38522 -22266 271 19082 10172 -3080 -11422 -12307 -3360 -6806 -9236
451 -9236 -10046 9042 21424 16597 -1969 -8411 -13295 3241 1461 -5379 -13210 -19867 -3195 8710
437 8710 6539 15807 15041 10634 5057 4402 7061 -98 10751 8068 -5517 -12260 -12639 -9575 -12096
422 -12096 -17884 -9749 -3756 -10183 -11279 -4760 -9937 -21689 -26305 -17731 -18860 -18388 -5625 14135
408 14135 23265 14929 -7583 -24702 -29452 -34510 -27590 -6107 8803 1492 705 8182 12557 26462
394 26462 24558 24063 9292 3766 985 5570 11438 6847 2172 -4632 -4316 -1815 6522 11898 6529
379 6529 -9030 -22942 -23452 -20360 -15148 -12727 -20329 -25018 -17765 -557 15168 5541 -30 -9046
365 -9046 798 20355 15823 14099 4208 -9044 -11386 -5131 -6947 -7633 -15653 -16672 -9180 -3342 3806
350 3806 3255 6226 4678 4577 2263 -8717 4191 8925 -7211 -13111 -7583 -10251 -6275 -5714 -2232
335 -2232 2765 -2242 -9202 -11267 -19409 -24601 -12835 3618 -2091 -3301 472 -172 3858 8562 1304
320 1304 1160 -2010 -18820 -23804 -26934 -18893 -5717 3748 3817 3451 -6787 -3614 12158 7901 1015
305 1015 11333 10519 12401 10784 16008 15328 13029 11201 6604 11476 9222 6189 80 -12778 -15243
290 -15243 1716 16726 19625 13291 3555 -17294 -23868 -12453 -8064 -8890 -2644 23359 37449 21005
276 21005 1828 -4970 -6088 -419 -8862 -24961 -24531 -21588 -20798 -16276 -8977 -1768 -10591 -18333 -15244
261 -15244 -6831 -16505 -12929 -16963 -15376 -6725 -2898 -7264 -13919 -11334 -1396 8674 5973 2002 9749
246 9749 12679 2466 -3316 -3747 3206 11977 17266 20620 15707 6605 1180 7523 -2566 -17252 -13101
231 -13101 -9179 -3429 -7895 -8636 -19158 -23316 -29100 -22841 -12587 -4159 -2316 4617 3513 1195 6410
216 6410 4429 5962 149 -6027 -4660 241 -3508 -4416 -10942 -9144 -7923 -5206 -13960 -4393 -5573
201 -5573 -6391 -6942 -1229 20041 19938 16848 7983 8394 2952 -7386 -7217 -10940 -21040 -24699 -24180 -22442
185 -22442 -1288 14850 16458 17426 7358 5865 -3078 -10215 -18633 -17934 -15817 -2920 9736 10848
171 10848 9630 -1019 -7849 2648 -1596 1735 -927 -2634 -8536 -6813 -3804 -10929 -13975 -9321
157 -9321 -3483 -11993 -14982 984 12298 12249 3766 -3559 2602 10509 8504 10425 4591 7645 11089
142 11089 15578 16481 12766 3752 -5757 3011 2576 -1175 -4653 2185 4204 4788 -464 145 -3970 -750
126 -750 -1300 -5146 -6841 -10022 -17583 -23139 -22112 -10510 -7848 -12452 -3791 13717 18682 9508 178
111 178 -1790 -7348 -15231 -14409 -14464 -15459 -21060 -22682 -25730 -10197 5190 9832 7229 5584 2064 -4333
95 -4333 -7798 -2550 -151 5003 7958 2793 -3148 -5569 -2033 -5594 -5954 -18706 -17577 -5163 5213
80 5213 -383 -3119 -7385 -14133 -25882 -32279 -27357 -10558 -3265 -6551 -2999 -3364 -4402 -2404 -913
65 -913 -9076 -9716 -11512 -16383 -10943 -3241 -1159 -3354 -9054 -10191 -14960 -11863 -2027 1275 -714 3384
49 3384 -4010 -8439 -4514 -508 -5459 -9841 -9795 -40 2874 1455 7898 14237 9961 13962 15869 13568
33 13568 3293 6448 2229 4998 1507 3042 -5348 -755 -2228 1608 7310 9202 10217 7683 10893
18 10893 12149 4645 -2240 -3495 -2455 -5286 -3197 3321 4936 -620 -5256 -19974 -16733 -7073 1384
3 1384 -6818 -19763 -20621
0 -20621
$$ Imaginary data points
##PAGE= N=2
##DATA TABLE= (X++(I..I)), XYDATA
32767 90014 93082 91986 93041 96744 105386 111271 102992 89038 84933 93114 102034 100128 87625 86502
32753 86502 96302 97532 93941 92038 99273 106614 102519 105655 104481 102086 90317 89762 88959 93503 102747
32738 102747 105701 108673 110648 107923 108104 103470 100940 117028 130952 133535 118964 115373 120699 123877
32724 123877 126945 125487 133063 131525 132884 129210 116335 105177 107623 118391 123883 118681 118544 117026
32710 117026 118255 124759 125128 126079 126046 126222 128255 126402 133647 141482 147133 140336 143293 149227 146538
32695 146538 137786 135924 136298 140526 137953 126271 134308 142411 145924 151138 154741 152466 158245 154568
32681 154568 153540 164319 169039 151998 145001 147153 148863 154740 162179 164664 159393 152028 147429 160707
32667 160707 169323 160421 155660 158262 159327 166869 173965 165825 161646 161542 171898 171659 165316 166275 170638
32652 170638 185316 184848 169042 162610 163189 168652 174317 176213 180741 187694 185490 183675 182361 176739
32638 176739 173502 178751 179734 178896 177314 179722 185733 191552 191155 187702 193599 197772 184835 179829 181557
32623 181557 181682 184781 186115 199215 209482 201847 198262 193974 188679 192788 193328 200981 195647 186918
32609 186918 189121 197927 206244 203756 189826 182473 180766 183286 193734 206351 203648 197848 193920
32596 193920 190860 189686 195127 199582 201695 199636 199702 198445 201637 206979 207074 205981 207216 202865 210568
32581 210568 212489 200889 189271 200784 208656 221527 233257 229227 219814 219798 218808 224710 227396 217186
32567 217186 205052 209343 215374 221924 220033 220407 231642 238827 237859 221867 220375 224895 231055 221845
32553 221845 215540 223152 224084 231539 225680 229092 234293 229924 221029 227678 238226 251091 256805 253593
32539 253593 250778 245205 240938 228996 220581 226137 231946 231207 234781 225542 225257 241787 257412 252621
32525 252621 254471 247494 240854 242120 254131 257915 258614 265569 264241 263213 259286 252654 253951 249848
32511 249848 247492 259558 268037 263434 263224 255115 253541 257998 260885 266091 271251 277663 269835 258622
32497 258622 251081 245048 245837 244350 248271 249100 255516 267752 280226 286231 295392 287818 268553 259120
32483 259120 253874 263737 259135 269246 282542 287187 281236 273401 278151 285335 275730 271901 270190 275840
32469 275840 278826 282559 280007 276907 273753 276702 266127 259422 263110 260834 268677 279775 268774
32456 268774 251166 252714 258145 257099 260907 280654 286052 284313 276906 266876 264661 264625 261289 255429
32442 255429 260794 273360 286272 284999 278314 265463 266788 285663 292970 291146 286611 288279 280332
32429 280332 270129 282688 291660 289613 288663 301679 302609 291028 273478 259729 259157 257273 279384
32416 279384 292204 301773 294242 286059 289230 284121 295252 299347 296583 295270 290377 292169 292853 295312
32402 295312 293451 294258 304189 304971 308572 313619 321099 330749 316361 297337 290504 273008 271276 273707
32388 273707 288481 299459 292510 303257 306470 302748 297900 300941 297719 314084 320978 327073 334776
32375 334776 335989 327358 326347 324341 319161 313174 314092 308656 312910 312147 308351 304344 301691 320945
32361 320945 315687 312431 320494 321510 328566 320500 298278 283895 293516 306192 320418 323546 310538
32348 310538 303236 305547 296148 296076 291946 298416 307319 320958 324315 304755 307567 322802 325365 327853
32334 327853 314273 312385 310977 308434 303969 302467 305913 304625 308583 305676 297164 298015 317861 330187
32320 330187 342854 338043 342245 340245 325723 314442 308477 315366 334704 327283 313728 306575 304482
32307 304482 307295 316042 326037 340109 343420 336612 330053 332680 332820 324432 319979 320915 331046 332520
32293 332520 338733 337708 334551 327194 317623 314396 321457 312027 320022 322403 304426 300906 305604 311447
32279 311447 321728 331160 316561 309446 316487 322449 325931 314717 322452 324822 316824 331696 336691
32266 336691 331009 308860 310413 324953 324042 318212 332832 334532 344371 355941 339612 329782 329137
32253 329137 318392 313433 330623 337733 337313 337718 329598 327079 322614 335236 341811 351095 344010 331499
32239 331499 332503 326291 325168 321378 322893 329559 336990 318007 317882 320276 316870 321378 317158 306625
32225 306625 298362 311559 308294 322921 333649 341679 348564 353246 347439 338992 340492 346178 344406
32212 344406 338392 330036 337792 337431 333782 327904 330592 329699 333013 347287 344914 345992 341548 346701
32198 346701 351115 351554 347023 340322 345063 344857 353461 356251 351157 337024 321963 319362 312391 298275
32184 298275 302968 310624 312994 310495 321915 326352 325754 334915 349988 348241 336018 328617 324819 326943
32170 326943 318798 326174 318610 327807 321240 308314 317100 324198 325151 327383 331597 343868 339870 331615
32156 331615 312180 315204 325859 321489 311855 310319 311553 312333 318480 323418 330086 335424 334557 332566
32142 332566 336628 342521 343375 337250 339828 346365 337251 330895 327327 337524 337364 327248 328738 329283
32128 329283 331030 338053 348627 345461 347843 351785 341887 346790 349423 336362 336264 335209 344070 353509
32114 353509 344605 334265 320448 317105 317732 323660 327655 328322 338617 340149 336869 341440 345368 337136
32100 337136 336858 333505 340936 350543 356908 349070 334596 330702 329540 330957 338486 340363 325902 316340
32086 316340 312545 315499 325040 336621 338843 341911 330945 333017 338249 346032 336671 331025 332600 337955
32072 337955 341234 350163 359662 371038 359240 337989 326915 320357 308868 318773 327540 334255 328274
$$ [...]
##END NTUPLES=NMR SPECTRUM
##END=
