##TITLE=Analysis number 314249
Compound Code cc 45516
Book Reference 440/78
Project Code qc-cat
Chemist Name craigr
##JCAMPDX= 6.0         $$ Bruker NMR JCAMP-DX V2.0
##DATA TYPE= NMR SPECTRUM
##DATA CLASS= NTUPLES
##ORIGIN= Bruker BioSpin GmbH
##OWNER= NMR
$$ XWIN-NMR		Version 3.5
$$ Tue Oct 11 13:16:42 2005 GMT Daylight Time (UT+1h)  MAYBRIDGE\NMR@NMR_250MHZ
##.OBSERVE FREQUENCY= 250.131544655141
##.OBSERVE NUCLEUS= ^1H
##.ACQUISITION MODE= SIMULTANEOUS (DQD)
##.ACQUISITION SCHEME= undefined
##.AVERAGES= 16
##.DIGITISER RES= 18
##SPECTROMETER/DATA SYSTEM= dpx250
##.PULSE SEQUENCE= zg30
##.SOLVENT NAME= CDCl3
##.SHIFT REFERENCE= (INTERNAL, CDCl3, 0, 16.4553)
##AUDIT TRAIL= $$ (NUMBER, WHEN, WHO, WHERE, WHAT)
$$ ##TITLE= Audit trail, XWIN-NMR		Version 3.5
$$ ##JCAMPDX= 5.01
$$ ##ORIGIN= Bruker BioSpin GmbH
$$ ##OWNER= NMR
$$ C:\u/data/dgb/nmr/ADRS/10710/pdata/1/auditp.txt
$$ ##AUDIT TRAIL=  $$ (NUMBER, WHEN, WHO, WHERE, WHAT)
(   1,<2005-10-11 13:16:26.10 +100>,<MAYBRIDGE\NMR>,<NMR_250MHZ>,
      <created by zg, POWCHK disabled, PULCHK disabled
       configuration hash MD5:
       62 19 C7 07 E1 42 D1 B7 37 6C 3D D0 77 39 F9 E6
       data hash MD5: 64K
       8E 49 2C BC ED 03 1E E2 C0 02 20 0A 74 7F 0E 73>)
(   2,<2005-10-11 13:16:36.24 +100>,<MAYBRIDGE\NMR>,<NMR_250MHZ>,
      <Start of raw data processing
       ef LB = 0.3 FT_mod = 6 PKNL = 1 SI = 32K 
       data hash MD5: 32K
       DA 5C EC 32 D0 0C 60 E7 5C 8E E6 B5 2D ED FC DB>)
(   3,<2005-10-11 13:16:37.85 +100>,<MAYBRIDGE\NMR>,<NMR_250MHZ>,
      <apk 
       data hash MD5: 32K
       E4 6C 62 F8 F4 A9 8C 5D DB 99 23 9B 46 86 AE B3>)
(   4,<2005-10-11 13:16:38.50 +100>,<MAYBRIDGE\NMR>,<NMR_250MHZ>,
      <abs ABSG = 5 
       data hash MD5: 32K
       F8 B6 2A ED E7 CC 8E 45 27 A1 7A DB D0 E1 E4 23>)
$$ ##END=
$$ 
$$ hash MD5
$$ 20 75 94 A4 D0 0C 1C EE E9 E5 17 6C 84 56 D8 91
##$RELAX= 
##$RELAX= 
##$RELAX= 
##$RELAX= 
##$RELAX= 
##$RELAX= 
##$RELAX= 
$$ Bruker specific parameters
$$ --------------------------
##$DU= <C:\u>
##$EXPNO= 10710
##$NAME= <ADRS>
##$PROCNO= 1
##$TYPE= <nmr>
##$USER= <dgb>
##$AMP= (0..31)
100 100 100 100 100 100 100 100 100 100 100 100 100 100 100 100 100 100 
100 100 100 100 100 100 100 100 100 100 100 100 100 100 
##$AQSEQ= 0
##$AQ_mod= 3
##$AUNM= <au_zg>
##$AUTOPOS= <15 >
##$BF1= 250.13
##$BF2= 250.13
##$BF3= 250.13
##$BF4= 250.13
##$BF5= 500.13
##$BF6= 500.13
##$BF7= 500.13
##$BF8= 500.13
##$BYTORDA= 1
##$CFDGTYP= 0
##$CFRGTYP= 5
##$CHEMSTR= <none>
##$CNST= (0..31)
1 1 145 1 1 1 1 1 1 1 1 1 1 1 1 1 1 1 1 1 1 1 1 1 1 1 1 1 1 1 1 1 
##$CPDPRG= <>
##$CPDPRG1= <>
##$CPDPRG2= <>
##$CPDPRG3= <>
##$CPDPRG4= <mlev>
##$CPDPRG5= <mlev>
##$CPDPRG6= <mlev>
##$CPDPRG7= <mlev>
##$CPDPRG8= <mlev>
##$CPDPRGB= <>
##$CPDPRGT= <>
##$D= (0..31)
0 1 0 0 0 0 0 0 0 0.06 0 0 0 0 0 0 0.0002 0 0 0 0 0 0 0 0 0 0 0 0 0 0 
0 
##$DATE= 1129032985
##$DBL= (0..7)
120 120 120 120 120 120 120 120 
##$DBP= (0..7)
150 150 150 150 150 150 150 150 
##$DBP07= 0
##$DBPNAM0= <>
##$DBPNAM1= <>
$$ [...]
##$SUBNAM7= <"">
##$SUBNAM8= <"">
##$SUBNAM9= <"">
##$SW= 20.6930455092707
##$SWIBOX= (0..15)
0 0 3 0 0 0 0 0 0 0 0 0 0 0 0 0 
##$SW_h= 5175.983436853
##$TD= 65536
##$TD0= 1
##$TE= 295.16
##$TE2= 300
##$TE3= 300
##$TEG= 300
##$TL= (0..7)
0 120 120 120 120 120 120 120 
##$TP= (0..7)
150 150 150 150 150 150 150 150 
##$TP07= 0
##$TPNAME0= <>
##$TPNAME1= <>
##$TPNAME2= <>
##$TPNAME3= <>
##$TPNAME4= <>
##$TPNAME5= <>
##$TPNAME6= <>
##$TPNAME7= <>
##$TPOAL= (0..7)
0.5 0.5 0.5 0.5 0.5 0.5 0.5 0.5 
##$TPOFFS= (0..7)
0 0 0 0 0 0 0 0 
##$TUNHIN= 0
##$TUNHOUT= 0
##$TUNXOUT= 0
##$USERA1= <user>
##$USERA2= <user>
##$USERA3= <user>
##$USERA4= <user>
##$USERA5= <user>
##$V9= 5
##$VALIST= <valist>
##$VCLIST= <CCCCCCCCCCCCCCC>
##$VD= 0
##$VDLIST= <DDDDDDDDDDDDDDD>
##$VPLIST= <PPPPPPPPPPPPPPP>
##$VTLIST= <TTTTTTTTTTTTTTT>
##$WBST= 1024
##$WBSW= 4
##$XGAIN= (0..3)
0 0 0 0 
##$XL= 0
##$YL= 0
##$YMAX_a= 486717
##$YMIN_a= -574478
##$ZGOPTNS= <>
##$ZL1= 120
##$ZL2= 120
##$ZL3= 120
##$ZL4= 120
##$ABSF1= 16.45529
##$ABSF2= -4.237883
##$ABSG= 5
##$ABSL= 3
##$ALPHA= 0
##$AQORDER= 0
##$ASSFAC= 0
##$ASSFACI= 0
##$ASSFACX= 0
##$ASSWID= 0
##$AUNMP= <proc_1d>
##$AZFE= 0.1
##$AZFW= 0.1
##$BCFW= 0
##$BC_mod= 0
##$BYTORDP= 0
##$COROFFS= 0
##$CY= 12.5
##$DATMOD= 1
##$DC= 0
##$DFILT= <>
##$DTYPP= 0
##$F1P= 14.0000005364418
##$F2P= -0.99999901652339
##$FCOR= 0.5
##$FTSIZE= 32768
##$FT_mod= 6
##$GAMMA= 0
##$GB= 0
##$INTBC= 1
##$INTSCL= 1
##$ISEN= 128
##$LB= 0.3
##$LEV0= 0
##$LPBIN= 0
##$MAXI= 10000
##$MC2= 0
##$MEAN= 0
##$ME_mod= 0
##$MI= 0
##$NCOEF= 0
##$NC_proc= -4
##$NLEV= 6
##$NOISF1= 0
##$NOISF2= 0
##$NSP= 0
##$NTH_PI= 0
##$NZP= 0
##$OFFSET= 16.45529
##$PC= 1
##$PHC0= -69.63673
##$PHC1= 6.159291
##$PH_mod= 1
##$PKNL= yes
##$PPARMOD= 0
##$PSCAL= 4
##$PSIGN= 0
##$REVERSE= no
##$SF= 250.130016685331
##$SI= 32768
##$SIGF1= 0
##$SIGF2= 0
##$SINO= 400
##$SIOLD= 32768
##$SREGLST= <1H.CDCl3>
##$SSB= 0
##$STSI= 32768
##$STSR= 0
##$SW_p= 5175.98343685301
##$SYMM= 0
##$S_DEV= 0
##$TDeff= 65536
##$TDoff= 0
##$TI= <Analysis number 999999
Compound Code 99
Book Reference 9
Project Code 9>
##$TILT= no
##$TM1= 0
##$TM2= 0
##$TOPLEV= 0
##$USERP1= <user>
##$USERP2= <user>
##$USERP3= <user>
##$USERP4= <user>
##$USERP5= <user>
##$WDW= 1
##$XDIM= 32768
##$YMAX_p= 298722832
##$YMIN_p= -136902
$$ End of Bruker specific parameters
$$ ---------------------------------
##NTUPLES= NMR SPECTRUM
##VAR_NAME=  FREQUENCY,     SPECTRUM/REAL,   SPECTRUM/IMAG
##SYMBOL=    X,             R,               I
##VAR_TYPE=  INDEPENDENT,   DEPENDENT,       DEPENDENT
##VAR_FORM=  AFFN,          ASDF,            ASDF
##VAR_DIM=   32768,         32768,           32768
##UNITS=     HZ,            ARBITRARY UNITS, ARBITRARY UNITS
##FACTOR=    0.157963299565203, 1,           1
##FIRST=     4115.96192241581, 0,            0
##LAST=      -1060.0215144372, 0,            0
##MIN=       -1060.0215144372, -136902,      0
##MAX=       4115.96192241581, 298722832,    0
$$ Real data points
##PAGE= N=1
##DATA TABLE= (X++(R..R)), XYDATA
$$ [...]
18115B430845L62041M37322N27582O73691J051546J707481K848463N042767Q847838
$$ 2430845 2792886 3230208 3757790 4431481 5483027 7190508 10038971 15081738 23929576
18106B3929576J2452993P130027o159295j0301029p444283m629584l100758k165125
$$ 23929576 36382569 43512596 37353301 27052272 19607989 14978405 11877647 9712522
18098I712522j583804j171463q53913o20039m26669l02184j53743q1341o9022
$$ 9712522 8128718 6957255 6103342 5483303 5056634 4754450 4600707 4519366 4450344
18089D450344j91683l61917l93232l17907k24604j99547k40462j96672j30356
$$ 4450344 4258661 3896744 3503512 3185605 2961001 2761454 2520992 2324320 2193964
18080B193964j30136j26655j23253j18069o5959r8704j02165n2322l6999n0199
$$ 2193964 2063828 1937173 1813920 1695851 1629892 1531188 1429023 1376701 1339702 1289503
18070A289503p2546r7728r9716p2388n0179n2481n651L577m859L4544L5057m7653
$$ 1289503 1216957 1119229 1019513 947125 896946 844465 838814 842391 837532 872076 907133 859480
18058H59480q3275q0241r8065q9043k2541m9841n6278o575j268k3113l6190l4134
$$ 859480 776205 695964 597899 508856 486315 436474 380196 373621 372353 349240 313050 278916
18046B78916R545R76k5060M594q623j1854j3007j4293P406o743k6679k1255K0290
$$ 278916 288461 289437 264377 268971 260348 248494 235487 221194 228600 221857 195178 173923 194213
18033A94213j1916l7600J6489K3024l868n274R36k1931l5678o622j5066J9725
$$ 194213 182297 144697 161186 184210 180342 175068 176004 154073 118395 111773 96707 116432
18021A16432R791J2642O883K64j4621l4420o809l592P977K9610L390o990L826
$$ 116432 126223 138865 145748 146012 131391 96971 90162 86570 94547 124157 127547 120557 124383
18008A24383M0712j2107r883j1326q53M51m330j688m0826p595K6836J0949Q205
$$ 124383 165095 152988 143105 131779 130926 131377 127047 125359 84533 76938 103774 114723 122928
17995A22928K2789j148O189P647j7540j0269l4497m04j495l962K1066J2231J5049
$$ 122928 145717 144569 150758 158405 140865 130596 96099 95695 94200 90238 111304 123535 138584
17982A38584q391J2127J5428J7205P699m8938j5151k846r631j0440j4676Q729
$$ 138584 130193 142320 157748 174953 182652 133714 118563 115717 106086 95646 80970 89699
17970H9699J0554P713j1467j989j0325j131j1922o132j0536J5887K0567N369p308
$$ 89699 100253 107966 96499 94510 84185 83054 71132 65000 54464 70351 90918 96287 88979
17957H8979p191R382k463k2695J1268J4752j705j407N299J9051L448k0232l5373
$$ 88979 81788 91170 88707 66012 77280 92032 90327 88920 94219 113270 116718 96486 61113
17944F1113l968l963J7214M3565J8649R623K136J0869j4526q531J911q32j6257
$$ 61113 57145 53182 70396 113961 132610 142233 144369 155238 140712 132181 134092 133260 117003
17931A17003O822P843J6967j1204R106m0242j7764L3665j150J6287k0026p877
$$ 117003 123825 131668 148635 137431 146537 106295 88531 122196 121046 137333 117307 109430
17919A09430l888k6139r054q450K672J4743l373K8002K2097K527r835K104K2323
$$ 109430 105542 79403 70349 61899 64571 79314 75941 103943 126040 128567 118732 120836 143159
17906A43159J8198N9218M5685L9444K0223M0942M6929L9730L0683r648J4194M2050
$$ 143159 161357 220575 266260 305704 325927 366869 413798 453528 484211 474563 488757 530807
17894E30807N1052Q6607L2308k1616k1473k0253l752L10m4334q2163k5388j6028
$$ 530807 581859 668466 700774 679158 657685 637432 633680 633990 589656 507493 482105 466077
17882D66077n1979l1668j3781n0681k6099J3107k7108j4906J463M331j6371K149
$$ 466077 414098 382430 368649 317968 291869 304976 277868 262962 264425 268756 252385 254534
17870B54534j743m0618M370j2200o877q560K7550M996k6366k2376n355K7118J3766
$$ 254534 252791 212173 216543 204343 197466 188906 216456 221452 195086 172710 167355 194473 208239
17857B08239K4615M7032L5752o2J0324K6794O539J4535M2040M8491L9479j3219
$$ 208239 232854 279886 315638 315576 325900 352694 359233 373768 415808 464299 503778 490559
17845D90559m242R003l2907k411J7868j5531p555j4886P609M0113L7000K5521
$$ 490559 486317 495320 462413 460002 477870 462339 454784 439898 447507 487620 524620 550141
17833E50141l989m0253r0391m5701j7494j2908l1362j7661l2080j2739q863P17
$$ 550141 546152 505899 415508 369807 352313 339405 308043 290382 258302 245563 236700 237417
17821B37417j1065j8877j486j0330k4840R22j5329k9308o915n624r855n048J7017
$$ 237417 226352 207475 205989 195659 170819 171741 156412 127104 120189 114565 104710 99662 116679
17808A16679j2975k2050J778R329K3068R582q255k1547k2565k0421j4044J8977
$$ 116679 103704 81654 83432 92761 115829 125411 117156 95609 73044 52623 38579 57556
17796E7556J2038l6219N260K331o040J0570J0345m198J6381O948j0834k352P887
$$ 57556 69594 33375 38635 40966 34926 45496 55841 51643 68024 74972 64138 61786 69673
17783F9673k929j0876j246J8422J098J1159j896k1149m345J0428j634J3818j0789
$$ 69673 66744 55868 54622 73044 74142 85301 83405 62256 57911 68339 66705 80523 69734
17770F9734J9579P298j2431k8676r206J3285J9493k267k3388m0039K1470J9104
$$ 69734 89313 96611 84180 55504 46298 59583 79076 76809 53421 13382 34852 53956
17758E3956p962J3588j8796n744J4068m423L13R179k330J3443K661l405J219j47
$$ 53956 45994 59582 40786 35042 49110 44687 45000 54179 51849 65292 67953 64548 65767 65620
17744F5620q506l187n858j4746R156J5146j6583p023K3965m034J3832l167K633
$$ 65620 57114 53927 48069 33323 42479 57625 41042 34019 57984 53950 67782 64615 67248
17731F7248n501Q560j5641l4371l781O004o686j3044K1629O087J871J6708J7244
$$ 67248 61747 70307 54666 20295 16514 22518 15832 2788 24417 30504 32375 49083 66327
17718F6327J9024k358j8969P83k0670j466J0094j4675m477l65K5514N704n173
$$ 66327 85351 82993 64024 64807 44137 42671 52765 38090 33613 33248 58762 64466 59293
17705E9293R144m129N420j3341j1496o910j2547j7929m4772J2985J7901J4574
$$ 59293 68437 64308 69728 56387 44891 37981 25434 7505 -37267 -24282 -6381 8193
17693H193M239n9J3118r095j3616k3149J2881M284j0891j1009J2827J931J3152
$$ 8193 12432 12373 25491 16396 2780 -20369 -7488 -3204 -14095 -25104 -12277 -10346 2806
17680B806J3470m323O215K3934j4265K1036L5925J2181m6459j4953K6769n645
$$ 2806 16276 11953 18168 42102 27837 48873 84798 96979 50520 35567 62336 56691
17668E6691n475q224k050k0519k0448P687K5263m423K389j4653l4730j0720J746
$$ 56691 51216 42992 40942 20423 -25 7662 32925 28502 30891 16238 -18492 -29212 -27466
17655b7466J294J82P775L1857O832p308Q382L278L475J6046k4884j7031J4604
$$ -27466 -26172 -25990 -18215 13642 20474 13166 21548 24826 28301 44347 19463 2432 17036
17642A7036J7972q924j7298L0849Q982K440k278k6126Q45N134K775J6957K3338
$$ 17036 35008 26084 8786 39635 48617 51057 48779 22653 23498 28632 31407 48364 71702
17629G1702j7539j5058l84R295l684j2497J2162J6936N445j3773P174j4080n737
$$ 71702 54163 39105 38721 48016 44332 31835 43997 60933 66378 52605 59779 45699 39962
17616C9962k979K9589j8164l4634j5322j4564q208K8437K1585l084J9127J5062
$$ 39962 36983 66572 48408 13774 -1548 -16112 -24320 4117 25702 22618 41745 56807
17604E6807R018k199O89J39m0999P530j7315Q219J5383K1485J511j2075N058k890
$$ 56807 65825 63626 64315 64454 23455 30985 13670 21889 37272 58757 60268 48193 53251 50361
17590E0361o89l625j1007k3371P190K1023l182L0566J4725n657k5018j7540M354
$$ 50361 49672 46047 35040 11669 18859 39882 36700 67266 81991 76334 51316 33776 38130
17577C8130o067j3831J2273P472j935l9186k3872J9302M4353J9273j4376r73k772
$$ 38130 32063 18232 30505 37977 36042 -3144 -27016 -7714 36639 55912 41536 40563 37791
17564C7791k9072j6744P3L2145K4295R371k4116m117K424j1926k5785m015j9373
$$ 37791 8719 -8025 -7952 24193 48488 57859 33743 29626 32050 20124 -5661 -9676 -29049
17551b9049K4374K4067O81O23K8986R291k8306k6620K3744K1239P596o459k6812
$$ -29049 -4675 19392 20073 20696 49682 58973 30667 4047 27791 49030 56626 50167 23355
17538B3355j5982j0134J6661R841O503k0266J540R595N099j1873n309J590J4527
$$ 23355 7373 -2761 13900 23741 30244 9978 11518 21113 26212 14339 9030 10620 25147
17525B5147L452N657q473p538j3150j0860L086J9514J3884M346k3410K3006j916
$$ 25147 28599 34256 25783 18245 5095 -5765 -2679 16835 30719 35065 11655 34661 32745
17512C2745k420L2486L220k9766o095J7145q66j8648m362k5572m663J0173l283
$$ 32745 30325 62811 66031 36265 30170 47315 46449 27801 23439 -2133 -6796 3377 94
17499I4Q414J8052j9267k9566J1162o691P492Q504M841N998o399o843L606Q559
$$ 94 8508 26560 7293 -22273 -11111 -17802 -10310 -1806 3035 9033 2634 -4209 -603 7956
17485G956j962Q82K2823P616j1856l0201k592K3398k5377n805M0433K9720N403
$$ 7956 5994 6876 29699 37315 25459 -4742 -7334 16064 -9313 -15118 25315 55035 60438
17472F0438l0030j2028M520k1973k1769K4648J9667J8182p410j6392q447j5118
$$ 60438 30408 18380 22900 927 -20842 3806 23473 41655 34245 17853 9406 -5712
17460e712J506K2037K4530p401j1377n482L6363n093k7451J6252j3423K290Q673
$$ -5712 -4206 17831 42361 34960 23583 18101 54464 49371 21920 38172 24749 27039 35712
17447C5712p194j0844j4726K3029L5642O411L4138N7661Q5260K5836n5791l7660
$$ 35712 28518 17674 2948 25977 61619 68030 102168 159829 245089 270925 215134 177474
17435A77474o6474n9135k5250L25L558j8465J7382J1707k4898l0207q545N934
$$ 177474 111000 51865 26615 26940 30498 12033 29415 41122 16224 -13983 -22528 -16594
17423a6594J3365J0694Q298K1802K0289J2084j940r390j1428J0916r877k9994
$$ -16594 -3229 7465 15763 37565 57854 69938 67998 58608 47180 58096 48219 18225
17411A8225Q959M065j2653p455k521q142K0735M957j7789j4243j5842K2040O111
$$ 18225 27184 31249 18596 11141 8620 478 21213 26170 8381 -5862 -21704 336 6447
17398F447j9856J0097J8524L9560P914p862m431O02r219j8296K0578J0331j6683
$$ 6447 -13409 -3312 15212 54772 62686 54824 50393 50995 41776 23480 44058 54389 37706
17385C7706n755k0247j2459J6870p583k529k836j2367k0819q524L1577L1531l058
$$ 37706 31951 11704 -755 16115 8532 6003 3167 -9200 -30019 -38543 -6966 24565 21507
17372B1507k1531k4058J6097J3463p06l772r982J0335J2201j2227k9165Q896K7753
$$ 21507 -24 -24082 -7985 5478 4772 1000 -8982 1353 13554 1327 -27838 -18942 8811
17359H811K8827j7072k3868J4997J156j8845J2016J2195J6756J4121J8391n415
$$ 8811 37638 20566 -3302 11695 12851 -5994 6022 18217 34973 49094 67485 62070
17347F2070j1263j694k2434J0563J0637j6563k2577M884J631K4164o777k3118
$$ 62070 50807 49113 26679 37242 47879 31316 8739 13623 15254 39418 32641 9523
17335I523j3148O846P493j0959r198R23k222O190K3845L5815m812j7657P377r677
$$ 9523 -3625 3221 10714 -245 -9443 -8520 -10742 -4552 19293 55108 50296 32639 40016 30339
17321C0339j5339Q542J4043j1833N700J0307M894q532J0443n106n0488M412J9613
$$ 30339 15000 23542 37585 25752 31452 41759 46653 38121 48564 43458 -7030 -2618 16995
17308A6995q440R355P075j7182Q953L4203J1147k1086q092J960O860k823j1281
$$ 16995 8555 17910 24985 7803 16756 50959 62106 41020 32928 34888 41748 38925 27644
17295B7644M261j3017N093J1677j4173m921J6834M595K671p197m0o581k2518n603
$$ 27644 31905 18888 23981 35658 21485 16564 33398 37993 40664 33467 33427 26846 4328 -1275
17281a275K0692L8200r06j8078l455r946m685k9713M80K446N298N427J2085J4923
$$ -1275 19417 57617 56711 38633 35178 25232 20547 -9166 -8686 -6240 -942 4485 16570 31493
17267C1493k9717k49J024o240Q462k260j658k5570j165J4477r480J1858L5151
$$ 31493 1776 1527 2551 -3689 4773 2513 855 -24715 -25880 -11403 -20883 -9025 26126
17254B6126o384j2953J5379J3809p079k2535k4001p1J3607L2111K9209r106L2031
$$ 26126 19742 6789 22168 35977 28898 6363 -17638 -17709 -4102 28009 57218 48112 80143
17241H0143R944l1326l5757j3149K4447p381j8177J3863J5171L7026j9698j6067
$$ 80143 90087 58761 23004 9855 34302 26921 8744 22607 37778 74804 55106 39039
17229C9039k1100j5378L536j7715M811J2305M317R920J0231k5200N758N56n408
$$ 39039 17939 2561 6097 -11618 -6807 5498 9815 19735 29966 4766 10524 11080 5672
17216E672K291J4070R841K2996j6939k6974k4458J24o846K1375L0596L324j6236
$$ 5672 7963 22033 31874 54870 37931 10957 -13501 -13377 -20223 1152 31748 35072 18836
17203A8836P124q563J1133L743m670N402l0479k3300l116L5159L1941j0533j6087
$$ 18836 25960 17397 28530 32273 27603 33005 2526 -20774 -23890 11269 43210 32677 16590
17190A6590K64K4241j2353O682J2444o754l38m068Q98j1360k3227J2291p320n898
$$ 16590 16854 41095 28742 35424 47868 41114 40776 36708 37606 26246 3019 15310 7990 2092
17176B092o825m839J8985p349j8908J3958J1499M822m903J236j3645q133L7088
$$ 2092 -4733 -9572 9413 2064 -16844 -2886 8613 13435 8532 9768 -3877 -12010 25078
17163B5078K9600m5676J344p489J1070J3246J1119J089l0771O813J0765n836L190
$$ 25078 54678 9002 10346 2857 13927 27173 38292 39381 8610 15423 26188 20352 23542
17150B3542K4919j3460j0012r781j4921J4914n690L885q321j4340J7232K5923
$$ 23542 48461 35001 24989 15208 287 15201 9511 13396 5075 -9265 7967 33890
17138C3890m604j1160J6506O049j847M395j7610k6854Q505p000J1281J8509J628
$$ 33890 29286 18126 34632 40681 38834 43229 25619 -1235 7270 270 11551 30060 31688
17125C1688J2504j5005k226j4791l0545K531j1630J8818J1953n556R48j7796K5148
$$ 31688 44192 29187 26961 12170 -18375 -15844 -27474 -8656 3297 -2259 -1311 -19107 6041
17112F041J6490j210P390K0289J0842L709M070n280p254N439P407k2446J6731
$$ 6041 22531 21321 28711 49000 59842 63551 67621 62341 55087 60526 67933 45487 62218
17099F2218J0381p076n6994j4495L5233o000M893L3927J8983r879k553K2245k853
$$ 62218 72599 65523 8529 -5966 29267 23267 28160 62087 81070 71191 68638 90883 88030
17086H8030j5421j9147N606j5726o827J0116J845K905L917j1893k5996j263j3495
$$ 88030 72609 53462 59068 43342 36515 46631 48476 51381 55298 43405 17409 16146 2651
17073B651Q269J6385r072K4961J7546k9240m5063k5340J0358o485L3684L5075
$$ 2651 10920 27305 18233 43194 60740 31500 -13563 -38903 -28545 -35030 -1346 33729
17061C3729R418j489r736l2168K76p368L240k5582L5863J2316N939q059O360o803
$$ 33729 43147 41658 31922 -246 30 -7338 -4098 -29680 6183 18499 24438 16379 22739 15936
17047A5936N113J2671p03k7277L62P421R9K1527K5286l136m413N291j8539k1480
$$ 15936 21049 33720 33017 5740 6102 13523 13622 35149 60435 57299 52886 58177 39638 18158
17033A8158J4293k1824j3023j0046J3583O138K4895j0506p536O88Q344N691p381
$$ 18158 32451 10627 -2396 -12442 1141 7279 32174 21668 14132 14820 23164 28855 21474
17020B1474o301k2870P806K2137J3056j6146N830n46o581L2066n039k8232R369
$$ 21474 15173 -7697 109 22246 35302 19156 24986 24440 17859 49925 44886 16654 26023
17007B6023J2648k6048r276J4465J0862j3609l3426J0109L4235l226l961J0077
$$ 26023 38671 12623 3347 17812 28674 15065 -18361 -8252 25983 22757 18796 28873
16995B8873j1502m7689j2551M5445L51Q516P909n830Q29R635Q611k3881j2540
$$ 28873 17371 -30318 -42869 2576 2927 11443 19352 13522 14351 23986 32597 8716 -3824
16982c824K4857j2144J5861r483J3174j3877k3958J0486M1006N141j4248O720
$$ -3824 21033 8889 24750 15267 28441 14564 -9394 1092 42098 47239 32991 39711
16970C9711n2598j0234L3099J0211p428j6437J2209J1447J6366q590k2364r633
$$ 39711 -12887 -23121 9978 20189 12761 -3676 8533 19980 36346 27756 5392 -4241
16958d241J0900K227o746l2932p736J589q204M0686K2729R950j3788k1613k1740
$$ -4241 6659 8886 2140 -30792 -38528 -36939 -45143 -4457 18272 28222 14434 -7179 -28919
16945b8919N002n917K955L537J7736N685P721J5576J4883L5415M231j4540j8501
$$ -28919 -23917 -29834 -26879 -23342 -5606 79 7800 23376 38259 73674 77905 63365 44864
16932D4864m972k3371r272P928J461Q48K0368j4926m058n521L224L422R927J327
$$ 44864 39892 16521 7249 15177 16638 17486 37854 22928 18870 13349 16573 19995 29922 31249
16918C1249j9843l511j6494q591J71J0289p457J976K9096K2526k4931j3272q758
$$ 31249 11406 7895 -8599 -17190 -17019 -6730 -14187 -12211 16885 39411 14480 1208 -7550
16905g550J0529n603q118l0335K275k1585K8746L0574K1293r553k3606M00m530
$$ -7550 2979 -2624 -10742 -41077 -38802 -60387 -31641 -1067 20226 10673 -12933 -12533 -17063
16892a7063J9175L162j6840j5162j3982M143J7690L6746m138j0765J497j2487
$$ -17063 2112 5274 -11566 -26728 -40710 -36567 -18877 17869 13731 2966 4463 -8024
16880h024J3510R608l408J7168j8990j4734J0495k0669L663j101j3714N696j1407
$$ -8024 5486 15094 11686 28854 9864 -4870 5625 -15044 -11381 -12482 -26196 -20500 -31907
16867c1907K0884L138j6023J0175K4579P424k1983j0110M1632M296j1971m269
$$ -31907 -11023 -7885 -23908 -13733 10846 18270 -3713 -13823 27809 32105 20134 15865
16855A5865k4733j5876p045J305M6603J1606n390K309j2771k562o089J725N269
$$ 15865 -8868 -24744 -31789 -30484 16119 27725 22335 24644 11873 9311 3222 4947 10216
16842A0216o831K623j1373j9735K7593K5841J4131p204L601j8678n2783m8P309
$$ 10216 3385 6008 -5365 -25100 2493 28334 42465 35261 38862 20184 -32599 -32647 -25338
16829b5338K1090J9068R842o194Q406J532j9140j796j3522p165M295m765J0538
$$ -25338 -4248 14820 24662 18468 26874 28406 9266 7470 -6052 -13217 -8922 -13687 -3149
16816c149K1604j5188p730O30J1970P317J408P984L619k1998o735K8140N490j7891
$$ -3149 18455 3267 -4463 -3833 8137 15454 16862 24846 28465 6467 -268 27872 33362 15471
16802A5471J4047L819J7294k0635K6015j1439m843M251k8957j2703r211M158j6526
$$ 15471 29518 33337 50631 29996 56011 44572 39729 43980 15023 2320 -6891 -2733 -19259
16789a9259n259J6502R745j202j9327K0089K3624N320j1630l2084j8604J2553
$$ -19259 -24518 -8016 1729 527 -18800 1289 24913 30233 18603 -13481 -32085 -19532
16777a9532p27n496J4239M434j3178K370L714j867k1577Q897J432L15m825J0658
$$ -19532 -20259 -25755 -11516 -7082 -20260 -17890 -14176 -16043 -37620 -28723 -27291 -26976 -31801 -21143
16763b1143K3856L378J5290j3677L346J4044k8355r718N942n033n369j3585l0130
$$ -21143 2713 6091 21381 7704 11050 25094 -3261 -12979 -7037 -12070 -17439 -31024 -61154
16750f1154J2466K1818K9281m330k156R700M346m2894r031J6646K0454m977P00
$$ -61154 -48688 -26870 2411 -1919 -4075 5625 9971 -32923 -41954 -25308 -4854 -9831 -9131
16737i131J646J0384j403R036m981l334q362K3857J4569j5433J3514P197J9005
$$ -9131 -7485 2899 1496 10532 5551 2217 -6145 17712 32281 16848 30362 37559 56564
16724E6564j6681q179p111L092j8673n170p046o715r028M341j2791N090r138j0980
$$ 56564 39883 31704 24593 27685 9012 3842 -3204 -9919 -18947 -14606 -27397 -22307 -31445 -42425
16710d2425J4346J1418j0223R001l1516j8233J1120j1733K4133M2669J0061k026
$$ -42425 -28079 -16661 -26884 -17883 -49399 -67632 -56512 -68245 -44112 -1443 8618 6592
16698F592J1505n114m893K3797N692l3914j6505O348L1324J3464j037k1361K990
$$ 6592 18097 12983 8090 31887 37579 3665 -12840 -6492 24832 38296 37259 15898 18888
16685A8888J506j4147q669k949J3231J1726R239k6169l6907Q023J1372J7286l882
$$ 18888 20394 6247 -2422 -5371 7860 19586 28825 2656 -34251 -26228 -14856 2430 -1452
16672a452j0731K375L4403K6615k0351l72k7654j0565q343M946j3453n585O126
$$ -1452 -12183 -9808 24595 51210 30859 30487 2833 -7732 -16075 -11129 -24582 -30167 -24041
16659b4041J6158K061j2823j1094O168M975R99K3446j2902j4447K5653J9228r630
$$ -24041 -7883 -5822 -18645 -29739 -23571 -18596 -17597 5849 -7053 -21500 4153 23381 13751
16646A3751p918J5582L67j6606k8353J0209J4224L285m031k3962o806J9724k0641
$$ 13751 5833 21415 21782 5176 -23177 -12968 1256 4541 510 -23452 -30258 -10534 -31175
16633c1175l843J5580M872P125L453j7519n440q346K5810J4692K5278p418j2113
$$ -31175 -35018 -19438 -14566 -7441 -3988 -21507 -26947 -35293 -9483 5209 30487 23069 10956
16620A0956k4105m325M3057j1347k9715p662o138j936J0848j702Q616J4058j3590
$$ 10956 -13149 -17474 25583 14236 -15479 -23141 -29279 -31215 -20367 -22069 -13453 605 -12985
16607a2985j5607o131Q223O474K0975j8595j2520M416R817K4407o746l2896L319
$$ -12985 -28592 -34723 -26500 -20026 949 -17646 -30166 -25750 -15933 8474 1728 -31168 -27849
16594b7849L0267J8723J5478j5732j2479k4455R551K86j7138K2967J4157j5493
$$ -27849 2418 21141 36619 20887 8408 -16047 -6496 -6210 -23348 -381 13776 -1717
16582a717q746K1064m654l2326O342J5204J2728K859k0723L691k411J5234J6574
$$ -1717 -10463 10601 5947 -26379 -20037 -4833 7895 10754 -9969 -6278 -8689 6545 23119
16569B3119J1460Q462j2627m294k3305L168j044k7683J2823m9j5510J2937J6785
$$ 23119 34579 43041 30414 26120 2815 5983 4939 -22744 -9921 -9970 -25480 -12543 4242
16556D242j3426J5710K328L52M861J2735P85k6432j0798n916K970J8748r878J9818
$$ 4242 -9184 6526 8854 9206 14067 26802 27587 1155 -9643 -15559 -12589 6159 -3719 16099
16542A6099L3138j9312m1569m669J5583J540j5457O038J5764J7277j7438j1842
$$ 16099 49237 29925 -11644 -16313 -730 810 -14647 -8609 7155 24432 6994 -4848
16530d848J1749k2565j3405K3965r91n330q204j4104J470J919K4007J9689L105
$$ -4848 6901 -15664 -29069 -5104 -6095 -11425 -19629 -33733 -32263 -30344 -6337 13352 16457
16517A6457J8526P222J9041n101l9120j7722J5022q662l611j5132K3699J2436
$$ 16457 34983 42205 61246 56145 17025 -697 14325 5663 2052 -13080 10619 23055
16505B3055n502j6643j8109P829L795m135n90J4389J6840j8342l75p846M227K2375
$$ 23055 17553 910 -17199 -9370 -5575 -9710 -10300 4089 20929 2587 2212 -5634 -1407 20968
16491B0968J469l99l4J0549j2708j1997k3265o11J5692j1665j8212N303J7414
$$ 20968 22437 22038 22004 32553 19845 7848 -15417 -16028 -336 -12001 -30213 -24910 -7496
16478g496K7038L2304q980k1639p433J308n995l006j1134J2369p923L910l332
$$ -7496 19542 51846 42866 21227 13794 15102 9107 6101 -5033 7336 -587 3323 -9
16465ik6710j6108K8336P091j7552M455J1758K648o579r138O043J3766J2722q718
$$ -9 -26719 -42827 -14491 -7400 -24952 -20497 -8739 -6091 -12670 -21808 -15765 -1999 10723 2005
16451B005r588o436P844m566o814j3851M296K9229J6611K263k5296l2434O897
$$ 2005 -7583 -14019 -6175 -10741 -17555 -31406 -27110 2119 18730 20993 -4303 -36737 -29840
16438b9840J1389L3327j7851J1716J3141j1877j5702q385L441J5671J4866o648
$$ -29840 -18451 14876 -2975 8741 21882 10005 -5697 -14082 -10641 5030 19896 13248
16426A3248O559K3457K2163J1930j6878m7721k2286q913m428j0872k5284L1381
$$ 13248 19807 43264 65427 77357 60479 12758 -9528 -18441 -22869 -33741 -59025 -27644
16414b7644L1357L9328j5607p14j8496m083J1871o528J2044L1976r064L909j7440
$$ -27644 3713 43041 27434 26720 8224 4141 16012 9484 21528 53504 44440 48349 30909
16401C0909j7362j6387j2716K7985n56j5491j8159J7537L3269L289M107k9855
$$ 30909 13547 -2840 -15556 12429 11873 -3618 -21777 -4240 29029 32318 36425 6570
16389F570p995J6348j5633J227K2166j1731l2059j0952o50J7445J1764J8217j9939
$$ 6570 -1425 14923 -710 517 22683 10952 -21107 -32059 -32709 -15264 -3500 14717 -5222
16376e222J2695J2501l0963j1223K6758J5132J9063j4979l0833K672k434k6245
$$ -5222 7473 19974 -10989 -22212 4546 19678 38741 23762 -7071 -4399 -6833 -33078
16364c3078J543J7681O989L8870j6150k7069O410q791j2714P844O1k422o460k2867
$$ -33078 -31535 -13854 -6865 32005 15855 -11214 -4804 -13595 -26309 -18465 -18404 -20826 -27286 -50153
16350e0153j9839K2258K089K9272R169J5706j876J5163K9458j7341k2447R915
$$ -50153 -69992 -47734 -45645 -16373 -7204 8502 6626 21789 51247 33906 11459 21374
16338B1374N824L339J0035J0609k5321l435J4576p387m479j5884j5601J7899m640
$$ 21374 27198 30537 40572 51181 25860 22425 37001 29614 25135 9251 -6350 11549 6909
16325F909J999o197k382R47j6632k3653J7059J9531K1700L492m6384l6982J5688
$$ 6909 8908 2711 329 1276 -15356 -39009 -21950 -2419 19281 22773 -23611 -60593 -44905
16312d4905K0727J0313Q982N684m521j5202K7528K7496j4494J3792P700j2843
$$ -44905 -24178 -13865 -4883 801 -3720 -18922 8606 36102 21608 35400 43100 30257
16300C0257m1289m6973O557L9116J1603O816j5306o143O752j7545J0658o27k5770
$$ 30257 -11032 -58005 -51448 -12332 -729 6087 -9219 -15362 -8610 -26155 -15497 -16124 -41894
16287d1894o01R781q315K1803L8735l994k4416K054J3413K4092j6585j5504K654
$$ -41894 -42495 -32714 -41029 -19226 19509 15515 -8901 -6847 6566 30658 14073 -1431 1223
16274A223k6183J9828j453l5316p723K0805J8375K419J0828o508J5043j372n327
$$ 1223 -24960 -5132 -6585 -41901 -49624 -28819 -10444 -8025 2803 -3705 11338 9966 4639
16261D639K1155Q845k8415l0576J3850J8716J6913j4818P552L677N70j5972j7297
$$ 4639 25794 34639 6224 -24352 -10502 8214 25127 10309 17861 21538 22108 6136 -11161
16248a1161K3477J0014J2851l663j4103k2601P208L5183Q063J7715r824m2760
$$ -11161 12316 22330 35181 31518 17415 -5186 2022 37205 45268 62983 53159 10399
16236A0399j9969j4048P748K127J0923k0309n537j6218m427K3554j5221K3962
$$ 10399 -9570 -23618 -15870 -13743 -2820 -23129 -28666 -44884 -49311 -25757 -40978 -17016
16224a7016N487J021J4685P801k8814k8356L0501L1104o269R738j3694k5468Q336
$$ -17016 -11529 -10508 4177 11978 -16836 -45192 -14691 16413 10144 19882 6188 -19280 -10944
16211a0944p085j5178j652J1911N92j8281L954M919R150J6140K4520K1279j5048
$$ -10944 -18029 -33207 -34859 -22948 -22356 -40637 -36683 -31764 -22614 -6474 18046 39325 24277
16198B4277m365q561j0575n803j8295l662K4869K52M674j3044O343O96O598k5037
$$ 24277 19912 11351 776 -5027 -23322 -26984 -2115 -1863 2811 -10233 -3890 -3194 3404 -21633
16184b1633m115K1951j713o444r160m895L4045K0599L31k1322j4991K1292K5511
$$ -21633 -25748 -3797 -5510 -11954 -21114 -26009 8036 28635 28966 7644 -7347 13945 39456
16171C9456l773p937j7602j4265j4373R530J3416J9083o439l4345L906r094r326
$$ 39456 35683 27746 10144 -4121 -18494 -8964 4452 23535 17096 -17249 -13343 -22437 -31763
16158c1763J9112K164k3071q632n801j066Q917J4751L731J444J0620J8856J05
$$ -31763 -12651 -10487 -33558 -42190 -47991 -49057 -40140 -25389 -21658 -20214 -9594 9262 9367
16145I367j0302j1983j6010q93j2682k766K437K0596J2092N225k9359L214M078
$$ 9367 -935 -12918 -28928 -29821 -42503 -45269 -42832 -22236 -10144 -4919 -34278 -31064 -26986
16132b6986j4112J8984P765k446J4659R936m46j706j0018K2359K6135k8979p392
$$ -26986 -41098 -22114 -14349 -16795 -2136 7800 7354 5648 -4370 17989 44124 15145 7753
16119G753J4534P026J0164J8367j7277m6792l3102N907o332K23R032K2013K0826
$$ 7753 22287 29313 39477 57844 40567 -6225 -39327 -33420 -39752 -39529 -30497 -8484 12342
16106A2342j9257r390j516o628J7741j1100k068l051J3220N62K8059m027j6390
$$ 12342 -6915 -16305 -17821 -24449 -6708 -17808 -19876 -22927 -9707 -9145 18914 14887 -1503
16093a503J2021r602q113J330M238P870r888R423j1985j8688J9004p371j7286
$$ -1503 10518 916 -7197 -5867 -1629 6241 -3647 5776 -6209 -24897 -5893 -13264 -30550
16080c0550m928L452J8487J3086j1161j4336k747J6398J0636J192J1069J8030
$$ -30550 -35478 -32026 -13539 -453 -11614 -25950 -28697 -12299 -1663 -471 10598 28628
16068B8628m856j7746M446K1215j6142k5426L0476M200j3923L364R262O257P772
$$ 28628 23772 6026 10472 31687 15545 -9881 20595 24795 10872 14236 23498 29755 37527
16055C7527j8277J742K844J0039K0348r373j0782r049M233k30J6082j5317l2031
$$ 37527 19250 20992 23836 33875 54223 44850 34068 25019 29252 29022 45104 29787 -2244
16042b244j4529Q645K3643J8876K8242r879j4874o355j383L895j3859p977J725
$$ -2244 -16773 -8128 15515 34391 62633 52754 37880 31525 30142 34037 20178 12201 13926
16029A3926k3677j9507j4902k1216K833J8445J6477M7604J1480j2775Q281Q911
$$ 13926 -9751 -29258 -44160 -65376 -62543 -44098 -27621 19983 31463 18688 26969 35880
16017C5880N538l5179l4131Q943K0257K3153J0281K0114j1391j3512Q823J2330
$$ 35880 41418 6239 -27892 -18949 1308 24461 34742 54856 43465 29953 38776 51106
16005E1106j2489k4925R77J34j1124M431r399K609m826k7921R133P848J3069R161
$$ 51106 38617 13692 14669 14803 3679 8110 -1289 1320 -3506 -31427 -22294 -14446 -1377 7784
15991G784K680o336k1868k422J2382J747J463j2928J7812j4789M88J5525K4395
$$ 7784 10464 4128 -17740 -20162 -7780 -6033 -4570 -17498 314 -14475 -13987 1538 25933
15978B5933K617o073j1859k0574Q662m956J9551J0862j5337L138j2282l4834j9795
$$ 25933 28550 22477 10618 -9956 -1294 -6250 13301 24163 8826 11964 -318 -35152 -54947
15965e4947K8613J4257j4143J0345K3756k4062k1353J3869K2157J4027j978M314
$$ -54947 -26334 -12077 -26220 -15875 7881 -16181 -37534 -23665 -1508 12519 10541 14855
15953A4855p796L350j6343j2976J2869J3534J3568j2044K2028K937k1638j2530
$$ 14855 7059 10409 -5934 -18910 -6041 7493 21061 9017 31045 33982 12344 -186
15941a86k1339r212K84j1050p118j060K5223L0872K785q554N865J8428Q50j7579
$$ -186 -21525 -30737 -30453 -41503 -48621 -49681 -24458 6414 9199 645 6510 24938 25788 8209
15927H209J2585q570j0127K2444j0514j7792R86J6380q89p320k1314N521m127
$$ 8209 20794 12224 2097 24541 14027 -3765 -2779 13601 12712 5392 -15922 -10401 -14528
15914a4528j7306n211j2829J1562K3350m947l355L619L22k138K820M050q452K6138
$$ -14528 -31834 -37045 -49874 -38312 -14962 -19909 -23264 -19645 -19323 -21461 -18641 -14591 -23043 3095
15900C095L4155J391J6757j218j4840l3051j5522m36J3830O457J9515N864j0320
$$ 3095 37250 38641 55398 54180 39340 6289 -9233 -9669 4161 10618 30133 35997 25677
15887B5677k3937n835j3207k6800K8952N0859j6385k8141J0606j305k2440J4147
$$ 25677 1740 -4095 -17302 -44102 -15150 35709 19324 -8817 1789 484 -21956 -7809
15875g809K40l392J7835K7156j3080l2749J8781j731j3263l481o057q164J6846
$$ -7809 -7569 -10961 6874 34030 20950 -11799 6982 5251 -8012 -11493 -17550 -25714 -8868
15862h868R439J2037j267l2672N668N602j570j9441p824J0751K1949M2098J128
$$ -8868 571 12608 11341 -21331 -15663 -10061 -11631 -31072 -38896 -28145 -6196 35902 37030
15849C7030j2179k4045O699j2844j0697m903R29L3450J0121k5876J790J2848J8102
$$ 37030 24851 806 7505 -5339 -16036 -20939 -20010 13440 23561 -2315 -525 12323 30425
15836C0425R620j8781k3577L761l2484q233L4881l73k8191p857J6192J0332r656
$$ 30425 40045 21264 -2313 1448 -31036 -39269 -4388 -4761 -32952 -40809 -24617 -14285 -23941
15823b3941J7650K3096l096j7120j1960l2476Q510K7646n366J977o498K461k384
$$ -23941 -6291 16805 13709 -3411 -15371 -47847 -39337 -11691 -17057 -15080 -21578 -19117 -21501
15810b1501o071R202j8475O665J2313J5966j1578j9874J2755p831j1193j1236
$$ -21501 -27572 -18370 -36845 -30180 -17867 -1901 -13479 -33353 -20598 -28429 -39622 -50858
15798e0858J4920K743K6357J0954J076j8400p504K9818K8732k0471k5034j4012
$$ -50858 -35938 -33195 -6838 4116 5192 -13208 -20712 9106 37838 17367 -7667 -21679
15786b1679j647K2845J7183K6055l8613N170M0092n218j6315j4871j5288J313
$$ -21679 -23326 -481 16702 42757 4144 9314 49406 44188 27873 13002 -2286 -973
15774i73J4386R307j049r08j9739j2649n984j4639j0260j1307O067K5977K319
$$ -973 13413 22720 21671 20763 1024 -11625 -17609 -32248 -42508 -53815 -47748 -21771 -19452
15761a9452N68k8718M24K7049J0581M102m437J0095j9298j2078L4852P247J3253
$$ -19452 -18884 -47602 -47178 -20129 -9548 -5446 -9883 212 -19086 -31164 3688 10935 24188
15748B4188k0281k6497m164qj0321R443J1794j0913k0649J5179K0288R990J2207
$$ 24188 3907 -22590 -26754 -26762 -37083 -27640 -15846 -26759 -47408 -32229 -11941 -1951 10256
15735A0256o26J0620J0629p509l334K7891j5150j8139K0726N104k3173j4318m452
$$ 10256 9630 20250 30879 23370 20036 47927 32777 14638 35364 40468 17295 2977 -1475
15722a475R757P341k1373j5933J5712R876M378l3060l2123O896O523M1380K5337
$$ -1475 8282 15623 -5750 -21683 -5971 3905 8283 -24777 -56900 -50004 -43481 -2101 23236
15709B3236n998j7539Q696M573j5789j2541N849j0150Q514O047J2493N58J3178
$$ 23236 17238 -301 8395 12968 -2821 -15362 -9513 -19663 -11149 -5102 7391 7949 21127
15696B1127L314j820J0606M748k095j9897J791l1913K534P039R63k8826M465J567
$$ 21127 24441 22621 33227 37975 35880 15983 17774 -14139 -11605 -4566 -3603 -32429 -27964 -26397
15682b6397j0333J7587J1600k3662j0838N448J8904J4356K1629J2934l2568j1681
$$ -26397 -36730 -19143 -7543 -31205 -42043 -36595 -17691 -3335 18294 31228 -1340 -13021
15670a3021K3826N357k7803Q25M1983p592J9782Q647l7850l6807j4277L9367O217
$$ -13021 10805 16162 -11641 -10816 31167 23575 43357 52004 14154 -22653 -36930 2437 8654
15657H654k103R863o246l875k2368r377J1593M4197j0254k1695l4745M786J5870
$$ 8654 6551 16414 10168 6293 -16075 -25452 -13859 30338 20084 -1611 -36356 -31570 -15700
15644a5700j5305j0823K3068J319n474m84j6091J6261J6883P269Q010p755J0239
$$ -15700 -31005 -41828 -18760 -17441 -22915 -23399 -39490 -23229 -6346 923 8933 1178 11417
15631A1417J7412k4991l0271k0559O518K1355Q799j2575k1990J0776J5323J0249
$$ 11417 28829 3838 -26433 -46992 -40474 -19119 -10320 -22895 -44885 -34109 -18786 -8537
15619h537q696J7781R898l757O498K8268j0089o560j039k7147K521K000J2369
$$ -8537 -17233 548 10446 6689 13187 41455 31366 24806 23767 -3380 -859 1141 13510
15606A3510l6710j7764R41K0716J2818J1495o048o41R811J1783P59J8292K1793
$$ 13510 -23200 -40964 -40023 -19307 -6489 5006 -1042 -1683 8128 19911 20670 38962 60755
15593F0755k3050k9997l826J0056j3764o764J7413j5011J1068j459p966j0643
$$ 60755 37705 7708 3882 13938 174 -6590 10823 -4188 6880 5421 -2545 -13188
15581a3188M682N056K418m351J0952k6217j7284o549J562J1598P17n379j756J3590
$$ -13188 -8506 -3450 -1032 -5383 5569 -20648 -37932 -44481 -42919 -31321 -30604 -35983 -37739 -24149
15567b4149P799K578k1817j2088J8256J7086m161K4163K6112k5569J2344M023
$$ -24149 -16350 -13772 -35589 -47677 -29421 -12335 -16496 7667 33779 8210 20554 24577
15555B4577l9266j3457q383P840K3450J5011k0706j8576l543O366M636j1338N905
$$ 24577 -14689 -28146 -36529 -28689 -5239 9772 -10934 -29510 -33053 -26687 -22051 -33389 -27484
15542b7484o938j3663P563J7791P332J0481K858N816J8379J8773j0184j2672k9799
$$ -27484 -34422 -48085 -40522 -22731 -15399 -4918 -2060 3756 22135 40908 30724 18052 -11747
15529a1747k0482j3831R533P043O316J327m158O064m2M992L6250O788n99r879
$$ -11747 -32229 -46060 -36527 -29484 -23168 -21841 -25999 -19935 -19977 -14985 21265 28053 27454 17575
15515A7575k4102m652k1475J385m957j9383R696L2280K238R983j9740J9609O676
$$ 17575 -6527 -11179 -32654 -31269 -36226 -55609 -45913 -13633 -11395 -1412 -21152 -1543 5133
15502E133L795J0590N967m200j898J3261k865l0345O821J0334K399p704L976m832
$$ 5133 8928 19518 25485 21285 19387 32648 29783 -562 6259 16593 18992 11288 15264 10432
15488A0432j360j2716k8496j0382j6080J8416L1308j6415k1741j0495j162K1753
$$ 10432 9072 -3644 -32140 -42522 -58602 -40186 -8878 -25293 -47034 -57529 -58691 -36938
15476c6938J5993J390Q081L719J0021n428M986P146m4548m0151J7246K1270Q863
$$ -36938 -20945 -19555 -11474 -7755 2266 -3162 1824 8970 -35578 -75729 -58483 -37213 -28350
15463b8350k944N138J6074P630k3422l610J3896K7004o164M675j5854J3097M326
$$ -28350 -31294 -26156 -10082 -2452 -25874 -29484 -15588 11416 5252 9927 -5927 7170 11496
15450A1496j3016k7689j027J1936p388j2135K845q075K9355K1858l31j0373j2081
$$ 11496 -1520 -29209 -30236 -18300 -25688 -37823 -34978 -43053 -13698 8160 7829 -2544 -14625
15437a4625O876R393J527J672k0513k3331K54K6466n517j5929K928J9791K8430
$$ -14625 -7749 1644 3171 4843 -15670 -39001 -38747 -12281 -17798 -33727 -30799 -11008 17422
15424A7422k0389L071J9688j3566r878r837K0227k1875J0043r857o955P180k4038
$$ 17422 -2967 104 19792 6226 -3652 -13489 6738 -15137 -5094 -14951 -21906 -14726 -38764
15411c8764m634J4245o995J1585K601j980j1986j0298j6553J6441J3852L0022
$$ -38764 -43398 -29153 -36148 -24563 -21962 -23942 -35928 -46226 -62779 -46338 -32486 -2464
15399b464M6590N182k6800j6389J3911K5560J3888j3311k8681j5583k54J8484
$$ -2464 44126 49308 22508 6119 20030 45590 59478 46167 17486 1903 1649 20133
15387B0133K7775j3072P708J4699J214P745k3719m5399k1331J2710P952J9331
$$ 20133 47908 34836 42544 57243 58457 66202 42483 -2916 -24247 -11537 -3585 15746
15375A5746j771j6860M434j488k8687q828K248k3400J1435M0041J8780n647q097
$$ 15746 13975 -2885 1549 61 -28626 -37454 -35206 -58606 -47171 -7130 11650 6003 -2094
15362b094q745K6556J0227j7262j9615Q67J0426Q923J0796j2889k4993j7081K8975
$$ -2094 -10839 15717 25944 8682 -10933 -10066 360 9283 20079 7190 -17803 -34884 -5909
15349e909o417j6829J0196J1699r765k9245M0K5294J3003J5496j3879J667J2994
$$ -5909 -12326 -29155 -18959 -7260 -17025 -46270 -46230 -20936 -7933 7563 -6316 -4649 8345
15336H345K0789O200j3192j2070k86K721L96n19J6432J1023r103k4493j0937p444
$$ 8345 29134 35334 22142 10072 9786 12507 12903 12384 28816 39839 30736 6243 -4694 -12138
15322a2138J098L1626J9526J4858J5327j7122l7117j9645n896R1j7628k0205M1773
$$ -12138 -11040 20586 40112 54970 70297 53175 16058 -3587 -9483 -9392 -27020 -47225 -5452
15309e452L7201O947l2848j4299K3029Q393r167k3029M274j9176j4431J4241K2441
$$ -5452 31749 38696 5848 -8451 14578 22971 13804 -9225 -4951 -24127 -38558 -24317 -1876
15296a876J963l337k2513P31j0429J9943L0868N44k9242J6673K2481j7135q073
$$ -1876 87 -3250 -25763 -25032 -35461 -15518 15350 15894 -13348 3325 25806 8671 598
15283E98N329j3174j0901r687K0909K984r866J7607j3552M490K0961N99o1955
$$ 598 5927 -7247 -18148 -27835 -6926 -3942 -13808 3799 -9753 -5263 15698 16297 -45658
15270d5658l7340J3285J1950K1918J4572O922J5477n828k38j0184K6402J3592
$$ -45658 -82998 -69713 -57763 -35845 -21273 -14351 1126 -4702 -4940 -15124 11278 24870
15258B4870j3775j4632j0101j319k735J2206p494Q718r357j0006J8048m475R882
$$ 24870 11095 -3537 -13638 -14957 -17692 -5486 -12980 -4262 -13619 -23625 -5577 -10052 -170
15245a70M286l2766j699K2592j2758j976R244O774J1668J1316O437m2697p128
$$ -170 4116 -28650 -30349 -7757 -20515 -22491 -13247 -6473 5195 16511 22948 -19749 -26877
15232b6877j3778L505J7303J7979j4448K818J927O73p700K1174J3595K739K3800
$$ -26877 -40655 -37150 -19847 -1868 -16316 -13498 -11571 -10898 -18598 2576 16171 18910 42710
15219D2710K1693j5579l4961j8890R604J5222L3150J0941l687Q846m8073l9798
$$ 42710 64403 48824 13863 -5027 4577 19799 52949 63890 60203 69049 20976 -18822
15207a8822r365j589j6828k6532O087Q201J9443k3329R970J0543k2174j9135K4400
$$ -18822 -28187 -29776 -46604 -73136 -67049 -58848 -39405 -62734 -52764 -42221 -64395 -83530 -59130
15194e9130L8678m127j9997R611L929J2004k9007K0490o666R419K7508q264j0018
$$ -59130 -20452 -24579 -44576 -34965 -31036 -19032 -48039 -27549 -34215 -24796 2712 -5552 -15570
15181a5570r436J166J893J2709m515n843N12j7325j1511J5405L1923o342k5719
$$ -15570 -25006 -23840 -21947 -9238 -13753 -19596 -19084 -36409 -47920 -32515 -592 -6934 -32653
15168c2653M299K4804N412l0926L430K1580J9324J3956j2788k6546r777J7877
$$ -32653 -28354 -3550 1862 -29064 -25634 -4054 15270 29226 16438 -10108 -19885 -2008
15156b008r654L724M86k226J5063J9190L856j3101k3293k9533P494r903J778K6928
$$ -2008 -11662 -7938 -7452 -9678 5385 24575 28431 15330 -7963 -37496 -30002 -39905 -38127 -11199
15142a1199J9075j6634P529K6163J4359k097l594l4402j6010M769P604n65J0990
$$ -11199 7876 -8758 -1229 24934 39293 37196 33602 -800 -16810 -12041 -4437 -5002 5988
15129E988R121j6083k6969n449J2079K0733J1344j0442j5162j4743k6900K9759
$$ 5988 15109 -974 -27943 -33392 -21313 -580 10764 322 -14840 -29583 -56483 -26724
15117b6724L3224N924q674O325J1755l8661j566K4542J8924J053j9526l112j2984
$$ -26724 6500 12424 3750 10075 21830 -16831 -18397 6145 25069 26122 6596 3484 -9500
15104i500M760J495j8911j1422L997k3822K4256L845k3583r611K1570K0488j4638
$$ -9500 -4740 -3245 -22156 -33578 -29581 -53403 -29147 -25302 -48885 -58496 -36926 -16438 -31076
15091c1076j1056K9855J4493j7854L165n622j1931R848J829j0616j4803p028K2305
$$ -31076 -42132 -12277 2216 -15638 -12473 -18095 -30026 -20178 -18349 -28965 -43768 -50796 -28491
15078b8491p205k0255J843l4531J1556M6218L8628Q473k2813O878N179j737l9070
$$ -28491 -35696 -55951 -54108 -88639 -77083 -30865 7763 16236 -6577 301 5480 3743 -35327
15065c5327j8770J9627N788K6527J9980k774q215p457J4685Q23j1397r210J5729
$$ -35327 -54097 -34470 -28682 -2155 17825 15051 6836 -621 14064 14887 3490 -5720 10009
15052A0009K3085M249j873P679k0867m8863j7149J3348L4701K1581j3533J2864
$$ 10009 33094 37343 35470 43149 22282 -26581 -43730 -30382 4319 25900 12367 25231
15040B5231k4810J008R60k933K678R063J5127j6626J576K0415J8579o525o835
$$ 25231 421 1429 2389 -544 2134 11197 26324 9698 11274 31689 50268 43743 36908
15027C6908j9940k8987l2584j1881O056J4848L4179M639K3293K466p705j1406
$$ 36908 16968 -12019 -44603 -56484 -50428 -35580 -1401 3238 26531 28997 21292 9886
15015I886j7810J6583k7294j0275K2191J5821j5036k0099q918k6349J6339r08
$$ 9886 -7924 8659 -18635 -28910 -6719 9102 -5934 -26033 -34951 -61300 -44961 -45869
15003d5869J4812M4668j0789m4207M497J8515K5528k2089l064J8766K4802j4544
$$ -45869 -31057 13611 2822 -41385 -36888 -18373 7155 -14934 -17998 768 25570 11026
14991A1026j0653J0935k2171o364N120r360L845N495l512K0782p154j5182J0794
$$ 11026 373 11308 -10863 -17227 -12107 -21467 -17622 -12127 -15639 5143 -2011 -17193 -6399
14978f399M332n241K4328P410m1298k1041J6306j488m962J5715k82k2348l569
$$ -6399 -2067 -7308 17020 24430 -16868 -37909 -21603 -23091 -28053 -12338 -12620 -34968 -38537
14965c8537j745K320L3535Q147j7068k072K4489K4027j4921j7172j1781Q377K317
$$ -38537 -40282 -37962 -4427 3720 -13348 -15420 9069 33096 18175 1003 -10778 -2401 -84
14952h4L613J0161j6714j734N4r084j1616O192K4266m715q631j5872l93J4277
$$ -84 3529 13690 -3024 -4758 -4704 -13788 -25404 -19212 5054 339 -8292 -24164 -24557 -10280
14938a0280N219j6624m7962m230K0825K326K9644K2724R546r316l0924R508M815
$$ -10280 -5061 -21685 -69647 -73877 -53052 -50726 -21082 1642 11188 1872 -29052 -19544 -14729
14925a4729M023L24r946J3427j1192r447J5267J096Q904k0481l2774P881J877
$$ -14729 -10706 -10382 -20328 -6901 -18093 -27540 -12273 -11177 -2273 -22754 -55528 -47647 -45770
14912d5770J2627R555k6668j996J577Q591J0741J7662j278j8460j0754K3726J6901
$$ -45770 -33143 -23588 -50256 -52252 -50675 -42084 -31343 -13681 -14959 -33419 -44173 -20447 -3546
14899c546L692J241J50m353L046k1397J893Q296P30j0919l838R627n300J9002
$$ -3546 146 1387 1537 -2816 230 -21167 -19274 -10978 -10248 -21167 -25005 -15378 -20678 -1676
14885a676M9347j1104k1291l2177J556P336J7795k2889K647P336k3480R447K4828
$$ -1676 47671 36567 15276 -16901 -15345 -8009 9786 -13103 -10456 -3120 -26600 -17153 7675
14872G675k0573K0067L1775R979l2146p687j1996j2480J2883j3656p184O90J329
$$ 7675 -12898 7169 38944 48923 16777 9090 -2906 -15386 -2503 -16159 -23343 -22653 -21324
14859b1324K703J0624p67R122l604r309J4054J6445p330l027pj7624j4144M717
$$ -21324 -18621 -7997 -8764 358 -3246 -12555 1499 17944 10614 7587 7580 -10044 -24188 -19471
14845a9471r372L960L2322J0952j9221j6658l524K3156o695n497L2878k1748m8436
$$ -19471 -28843 -24883 7439 18391 -830 -17488 -21012 2144 -4551 -10048 22830 1082 -47354
14832d7354L445q669o707l098M129J588p992L3131K4295L554j997J473J4586N758
$$ -47354 -43909 -52578 -59285 -62383 -58254 -56666 -64658 -31527 -7232 -3678 -5675 -4202 10384 16142
14818A6142k3554k6210J044J671k3499k8316J9246M6900J1660j5960j618k0389
$$ 16142 -7412 -33622 -32578 -30907 -54406 -82722 -63476 -16576 -4916 -20876 -22494 -42883
14806d2883k4072m1068j1966N4111K1859K091M1623N239j5398k2041j0842O34
$$ -42883 -66955 -108023 -119989 -65878 -44019 -41928 -305 4934 -10464 -32505 -43347 -42713
14794d2713m567J941r944K3904j7750m860M1933J9762k1354J1823K874j5136J1229
$$ -42713 -47280 -45339 -55283 -31379 -49129 -53989 -12056 7706 -13648 -1825 1049 -14087 -2858
14781b858l2158j9390j546O036J0183K961J6179m702Q032j6539k2693J6047m699
$$ -2858 -35016 -54406 -55952 -49916 -39733 -36772 -20593 -25295 -17263 -33802 -56495 -40448 -45147
14768d5147K30J5874M1158O070J270j797k2323J201J3605K009n823m6955J356
$$ -45147 -44917 -29043 12115 18185 19455 17658 -4665 -3464 10141 12150 6327 -40628 -39272
14755c9272J5529K0422Q115m352q068R54K0256J9053M854k5426n120j013j9750
$$ -39272 -23743 -3321 4794 442 -7626 -6672 13584 32637 37491 12065 6945 5932 -13818
14742a3818j5952J7347J3631J497k5638l042K2727j0525k2428J5216O346k2890
$$ -13818 -29770 -12423 1208 2705 -22933 -25975 -3248 -13773 -36201 -20985 -14639 -37529
14730c7529L1177K4722j0799k6219j654j2327o560M095j8991o787m47L6299j9933
$$ -37529 -6352 18370 7571 -18648 -20302 -32629 -39189 -35094 -54085 -60872 -61319 -25020 -44953
14717d4953j955K0110J4349j0563j1407K027R793J596m969k8374L67J0115L6718
$$ -44953 -46908 -26798 -12449 -23012 -34419 -32392 -22599 -21003 -25972 -54346 -53979 -43864 -7146
14704g146J7979k2713K657J8516J9694Q16k5347q525K7554j7886l3739O191k0265
$$ -7146 10833 -11880 -9223 9293 28987 29803 4456 -4069 23485 5599 -28140 -21949 -42214
14691d2214m269r541L115n576K8150R983q595J680K1656j2507l0853P308K6720
$$ -42214 -46483 -56024 -52909 -58485 -30335 -20352 -28947 -27267 -5611 -18118 -48971 -41663 -14943
14678a4943o759j6686n113L7846Q369j183O460r39n362R230q017j9747J2041K3833
$$ -14943 -21702 -38388 -43501 -5655 2714 1531 7991 7052 1690 10920 2903 -16844 -4803 19030
14664A9030o306k5447J0323J7j2258j0141j731J7418r631j0091k407J047J3305
$$ 19030 12724 -12723 -2400 -2383 -14641 -24782 -26513 -9095 -18726 -28817 -31224 -30177 -16872
14651a6872j317J7537P886n120J2007K5116p536k4954k2745k3023N335Q060J4550
$$ -16872 -18189 -652 7234 2114 14121 39237 31701 6747 -15998 -39021 -33686 -25626 -11076
14638a1076l798L131k6695k4189l130J2999M0456P591j3628J3865Q992J7211m4729
$$ -11076 -14874 -11743 -38438 -62627 -65757 -52758 -12302 -4711 -18339 -4474 4518 21729 -23000
14625b3000l0013R465j0173K3964K4482k579k0285j9030J3961n268P401J9068
$$ -23000 -53013 -43548 -53721 -29757 -5275 -7854 -28139 -47169 -33208 -38476 -31075 -12007
14613a2007K3664k0427k3960m542l3260K8429K1028J4008J1388J8916O030J858
$$ -12007 11657 -8770 -32730 -37272 -70532 -42103 -21075 -7067 4321 23237 29267 31125
14601C1125n866l554R816m344j6242l4132k3008N25L4546O732m725j3028J6885
$$ 31125 25259 21705 31521 27177 10935 -23197 -46205 -45680 -11134 -4402 -9127 -22155 -5270
14588e270k209P252J8512j5977l6862k0257j5515M2123K5277r540j3060M55k0897
$$ -5270 -7479 -227 18285 2308 -34554 -54811 -70326 -28203 -2926 -12466 -25526 -25071 -45968
14575d5968L1938K1818n051j3937o963k527j2476k703j8256L5J8709L3275J345
$$ -45968 -14030 7788 2737 -11200 -18163 -20690 -33166 -35869 -54125 -54090 -35381 -2106 -761
14562g61j0996N852Q204k0342j1080p444Q343J1055K0858J2386k0498j4671q826
$$ -761 -11757 -5905 2299 -18043 -29123 -36567 -28224 -17169 3689 16075 -4423 -19094 -27920
14549b7920j2160J67Q644J8528j1642k5755o935k4927n084J7817K1892R993J564
$$ -27920 -40080 -39913 -31269 -12741 -24383 -50138 -57073 -82000 -87084 -69267 -47375 -37382 -35818
14536c5818J2543K5378j4855k0606J4422l338J636l527J2306M289j4026J198P084
$$ -35818 -23275 2103 -12752 -33358 -18936 -22274 -20638 -24165 -11859 -7570 -21596 -20398 -13314
14523a3314o073N693j838J3304J6814o985m071J2278J1578j7278m9382j8420L1638
$$ -13314 -19387 -13694 -15532 -2228 14586 7601 3530 15808 27386 10108 -39274 -57694 -26056
14510b6056K5238K4329o652O544J525j6985j8674K7480J6829k4538K0655j1972
$$ -26056 -818 23511 16859 23403 24928 7943 -10731 16749 33578 9040 29695 17723
14498A7723j6453P418r160k0754J5538K2928J1113j1223n231J8610l4136k8696
$$ 17723 1270 8688 -472 -21226 -5688 17240 28353 17130 11899 30509 -3627 -32323
14486c2323R44j9875j9342R789j5678m06J4534K9424R333K3236J8947L355J8369
$$ -32323 -31379 -51254 -70596 -60807 -76485 -76891 -62357 -32933 -23600 -364 18583 21938 40307
14473D0307J0513j2836m914j6273k6889K587J4573J1867l4663k9561N512J2161
$$ 40307 50820 37984 33070 16797 -10092 -7505 7068 18935 -15728 -45289 -39777 -27616
14461b7616K622m026Q040K2584J3743K4622J2468J5018j3912k6569k7820k2890
$$ -27616 -24994 -29020 -20980 1604 15347 39969 52437 67455 53543 26974 -846 -23736
14449b3736R239J6110j9778N401O933L582J1951Q011L63m3225j3432L2184J8566
$$ -23736 -14497 1613 -18165 -12764 -5831 -2249 9702 17713 18076 -25149 -38581 -6397 12169
14436A2169j752k826J096O552J9743R956k7473l2761J7631J0790Q983J2424L856
$$ 12169 10417 7591 8687 15239 34982 44938 17465 -15296 2335 13125 22108 34532 38388
14423C8388j5882l873r691k18J1043j9443J7433L74J5900j0740J0348j8393l7803
$$ 38388 22506 18633 8942 8724 19767 324 17757 18131 34031 23291 33639 15246 -22557
14410b2557n02P777J1677P010l833K1187K5381K3086k123l5478k4108j8867j398
$$ -22557 -23059 -15282 -3605 3405 -428 20759 46140 69226 67103 31625 7517 -11350 -12748
14397a2748K1045M493o466k2338l5601n430j2001K8101N993L615j0030l808k699
$$ -12748 8297 12790 6324 -16014 -51615 -57045 -69046 -40945 -34952 -31337 -41367 -45175 -47874
14384d7874K3443J6388m133O431p86j3403K4020j5847N012J386J0370Q266L968
$$ -47874 -24431 -8043 -12176 -5745 -6531 -19934 4086 -11761 -6749 -5363 5007 13273 17241
14371A7241j915j8756j5349q462M214J1341j8959k546J8140K775J2137o36K0503
$$ 17241 15326 -3430 -18779 -27241 -23027 -11686 -30645 -33191 -15051 -12276 -139 -775 19728
14358A9728J682l96j0760j5176l0104l7013O102M5219J3171Q080l416L458M848
$$ 19728 21410 21014 10254 -4922 -35026 -72039 -65937 -20718 -7547 533 -2883 575 5423
14345E423J4347N466l3982j2998K3191K3955j5184j4025J5654J9799j5635j884
$$ 5423 19770 25236 -8746 -21744 1447 25402 10218 -3807 11847 31646 16011 14127
14333A4127J3567j7575O975K790l7777j4571Q020l079Q363K487L27p007K3222
$$ 14127 27694 10119 17094 19884 -17893 -32464 -24444 -27523 -19160 -16673 -16346 -23353 -131
14320a31K4014r802j9156r792J819K314r472j5274n802M938M842J5670J4522O491
$$ -131 23883 14081 -5075 -14867 -13048 -10734 -20206 -35480 -41282 -36344 -31502 -15832 -1310 5181
14306E181K1448J0457J4087r786q705k0523m742j1726q706k0465q525K7412K6406
$$ 5181 26629 37086 51173 41387 32682 12159 7417 -4309 -13015 -33480 -42005 -14593 11813
14293A1813J5885l6879r07M1365k0603m3817r635J6568R637O171L1564j5825O640
$$ 11813 27698 -9181 -10088 31277 10674 -33143 -42778 -26210 -16573 -10402 21162 5337 11977
14280A1977j5356J0597Q003p888p883j3043N134o692k859R273l860k1328k0234
$$ 11977 -3379 7218 15221 7333 -550 -13593 -8459 -15151 -18010 -8737 -12597 -33925 -54159
14267e4159M2744J6841n0k6362j8799M249j9978m091j1758m150J8173L5917R800
$$ -54159 -11415 5426 5376 -20986 -39785 -35536 -55514 -59605 -71363 -75513 -57340 -21423 -11623
14254a1623k304n211m923J9732P727J2879l547p548m1812l567O565j6503R948
$$ -11623 -13927 -19138 -24061 -4329 3398 16277 12730 5182 -36630 -40197 -33632 -50135 -40187
14241d0187j0227Q364J4344J1018J2604N644n828j9853j6205K4605R213j355j6478
$$ -40187 -50414 -42050 -27706 -16688 -4084 1560 -4268 -24121 -40326 -15721 -6508 -7863 -24341
14228b4341O142N578O582K2526K165l9375n934L1484m833k5557r771J2545J159
$$ -24341 -18199 -12621 -6039 16487 18652 -20723 -26657 4827 -6 -25563 -35334 -22789 -21630
14215b1630l1323r896L0585j1458q243P932J2331j3726J011J8764J340o886K100
$$ -21630 -52953 -62849 -32264 -43722 -51965 -44033 -31702 -45428 -44417 -25653 -24313 -31199 -29099
14202b9099M188P816J151J4734J3937J1249q003k3318j2142R233k2578k613K6632
$$ -29099 -24911 -17095 -15944 -1210 12727 23976 15973 -7345 -19487 -10254 -32832 -35445 -8813
14189h813J4859j9389j2105J967J6878J0572j3686M632P101j4325L407j6847P86
$$ -8813 6046 -13343 -25448 -23481 -6603 3969 -9717 -5085 2016 -12309 -8902 -25749 -24963
14176b4963K2012M284m159K25j7418Q932M617M2827J9708J8186K6398J1916J3054
$$ -24963 -2951 1333 -2826 -2601 -20019 -11087 -6470 36357 56065 74251 100649 112565 125619
14163A25619r37j5726R027J5235j1949l9596k4953n607j8599r16M809j3293j0123
$$ 125619 124682 108956 117983 133218 121269 81673 56720 51113 32514 31598 36407 23114 12991
14150A2991m23O775L1911P028k0934j3350j0396J1504J6865q600k991o384k5946
$$ 12991 12568 19343 51254 58282 37348 23998 13602 25106 41971 33371 30380 23996 -1950
14137a950l5746n797K3641R123Q056j3651k2402l951j0454J0986K2979P331j0877
$$ -1950 -37696 -43493 -19852 -10729 -2673 -16324 -38726 -42677 -53131 -42145 -19166 -11835 -22712
14124b2712J0416K4168R004j659j8761k4284k3162j1547M7600J5302K360J1199
$$ -22712 -12296 11872 20876 19217 456 -23828 -46990 -58537 -10937 4365 6725 17924
14112A7924k221k6519k4752n317q642K9347L3513J3380o821j8272J3432Q098j6968
$$ 17924 15703 -10816 -35568 -40885 -49527 -20180 13333 26713 19892 1620 15052 23150 6182
14099F182j6478J3181M603j1893k529J871j3479j2122J8815j02j1035J5355n680
$$ 6182 -10296 2885 7488 -4405 -6934 -5063 -18542 -30664 -11849 -11951 -22986 -7631 -13311
14086a3311l559q880k8981k4501K1400K0968l3835J6179K7753J4309J2887K2728
$$ -13311 -16870 -25750 -54731 -79232 -57832 -36864 -70699 -54520 -26767 -12458 429 23157
14074B3157J035j6944j8213q340K7528L6534j0371j9634k1869k0998k241L841
$$ 23157 24192 7248 -10965 -19305 8223 44757 34386 14752 -7117 -28115 -30356 -26515
14062b6515J9041K2691o716k6596L100K6400l98j5346k0120j5545j9154K0886
$$ -26515 -7474 15217 8501 -18095 -14995 11405 11007 -4339 -24459 -40004 -59158 -38272
14050c8272N1570j0306k0535k304J5473P786Q394J0512j0888l1797P632L16j3257
$$ -38272 13298 2992 -17543 -19847 -4374 3412 11806 22318 11430 -20367 -12735 -12419 -25676
14037b5676r222P816K2218L428k1548k5358M118L0448J4195m406j9803l5529p662
$$ -25676 -34898 -27082 -4864 -1436 -22984 -48342 -44224 -13776 419 -3987 -23790 -59319 -66981
14024f6981J3066P652L5672n460k0785j10J0557j3378R494M92M705j96j6407P960
$$ -66981 -53915 -46263 -10591 -16051 -36836 -36946 -26389 -39767 -30273 -29781 -25076 -25272 -41679 -33719
14010c3719J48o200j0945M653P527O134K4473j058M31k769p230M155l111M888
$$ -33719 -33571 -39771 -50716 -46063 -38536 -32402 -7929 -8987 -8556 -11325 -18555 -14400 -17511 -12623
13996a2623j6761j0694j9521j4370J3548J6826K3090N769J0052j4056j8442O529
$$ -12623 -29384 -40078 -59599 -73969 -60421 -43595 -20505 -14736 -4684 -18740 -37182 -30653
13984c0653k012l6075l043L3598K7235J7r327r630r29N146j481J211J0339l716
$$ -30653 -32665 -68740 -71783 -38185 -10950 -10933 -20260 -29890 -30819 -25673 -27154 -25943 -15604 -19320
13970a9320J9017N795o86Q940J8458j9737M694m070k3498j3192Q200n817K8807
$$ -19320 -303 5492 4806 13746 32204 12467 17161 13091 -10407 -23599 -15399 -21216 7591
13957G591O32n39j087J1870Q811j1003l8048k9503N122J797N860p041l399K0713
$$ 7591 8223 7684 6597 18467 27278 16275 -21773 -51276 -46154 -44357 -38497 -45538 -48937 -28224
13943b8224m768J8064M804j6436l82p790J1157J6432o17k3837j8808j261K4161
$$ -28224 -32992 -14928 -10124 -26560 -26942 -34732 -23575 -7143 -7760 -31597 -50405 -51666 -27505
13930b7505L8931J9386j4231q009m005L539j1860l17o161J7615j0389j6013L337
$$ -27505 11426 30812 16581 8572 4567 8106 -3754 -4071 -10232 7383 -3006 -19019 -15682
13917a5682j7118k307q89M138O016j4406J164j2872L0718j234m0730K25K5083
$$ -15682 -32800 -35107 -35996 -31858 -25842 -40248 -39084 -51956 -21238 -22472 -63202 -62977 -37894
13904c7894K3501Q644J3675q642j7541J3j2823j819J4122L833p565M829J6810
$$ -37894 -14393 -5749 7926 -716 -18257 -18244 -31067 -32886 -18764 -14931 -22496 -17667 -857
13891h57P295j6779k4784l9198Q537K6397j6607k9423L3548L4659q975K914j1001
$$ -857 6438 -10341 -35125 -74323 -65786 -39389 -55996 -85419 -51871 -17212 -26187 -23273 -34274
13878c4274q259K653J0091n65m188N902j0142k4737M369m925O649P161L221n058
$$ -34274 -42533 -39880 -29789 -30354 -34542 -28640 -38782 -63519 -59150 -64075 -57426 -50265 -47044 -52102
13864e2102j4254J2566K6600J0849J1334Q04l3087k933Q548n275k3369p586J473
$$ -52102 -66356 -53790 -27190 -16341 -5007 -4203 -37290 -40223 -31675 -36950 -60319 -67905 -66432
13851f6432j2226J4773J3133Q149j6415j1137j2392J5427J9098J7670j6361k0985
$$ -66432 -78658 -63885 -50752 -42603 -59018 -70155 -82547 -67120 -48022 -30352 -46713 -67698
13839f7698p564K410R918J7486o524J3165L1763k5498l4257K3064K5588K6153
$$ -67698 -75262 -72852 -62934 -45448 -51972 -38807 -7044 -32542 -66799 -43735 -18147 8006
13827H006j951k2736l0804M960r312J9250K9197n495l5512j8156J4714j9899L54
$$ 8006 6055 -16681 -47485 -42525 -51837 -32587 -3390 -8885 -44397 -62553 -47839 -67738 -67384
13814f7384J7535J4392K3220m402m382j5375R750r699r043m180J6573K3171J0414
$$ -67384 -49849 -35457 -12237 -16639 -21021 -36396 -26646 -36345 -45388 -49568 -32995 -9824 590
13801E90J2608R246j1263k7353k1113J7505j0723j2705K4039M307k9189P317L3306
$$ 590 13198 22444 11181 -16172 -37285 -19780 -30503 -43208 -19169 -14862 -44051 -36734 -3428
13788c428K0989l6604j3175j8536J0191Q580k8032J0811O085J1662M708j4964
$$ -3428 17561 -19043 -32218 -50754 -40563 -31983 -60015 -49204 -43119 -31457 -26749 -41713
13776d1713k9448n579K2720Q483k7871k8187K2602N9551N493q737n242p393p403
$$ -41713 -71161 -76740 -54020 -45537 -73408 -101595 -78993 -19442 -13949 -22686 -27928 -35321 -42724
13763d2724N420r277r86q605p83J6842q879M59K1480R283o819k0254N822M183
$$ -42724 -37304 -46581 -47567 -56172 -56955 -40113 -48992 -48533 -27053 -17770 -24589 -44843 -39021 -34838
13749c4838Q557M58j7004q981K6131J9419P074L180l6055p617L6956K5391j2982
$$ -34838 -26281 -25823 -42827 -51808 -25677 -6258 816 3996 -32059 -39676 -2720 22671 9689
13736I689J31j7529l0420N657J6944K2185k3032l9637k7264j5062p319L5047L2162
$$ 9689 9820 -7709 -38129 -32472 -15528 6657 -16375 -56012 -83276 -98338 -105657 -70610 -38448
13723c8448j5K2936J0524j0840R939r457j6542j314J2191k6504j9465o124j2512
$$ -38448 -38463 -15527 -5003 -15843 -5904 -15361 -31903 -33217 -21026 -47530 -66995 -73119 -85631
13710h5631J9438O236m426j2309P336Q264K2959Q736p718Q843L0157l437r425
$$ -85631 -66193 -59957 -64383 -76692 -69356 -61092 -38133 -29397 -37115 -28272 1885 -1552 -10977
13697a0977j8175j9140K3805K0941j576j2571j677O598p567k1540K224N705O232
$$ -10977 -29152 -48292 -24487 -3546 -5122 -17693 -19370 -12772 -20339 -41879 -39655 -33950 -27718
13684b7718j1199m6521j2473Q850Q549K0354J4741M4077K3844J308m7171k3629
$$ -27718 -38917 -85438 -97911 -89061 -80512 -60158 -45417 -1340 22504 23812 -23359 -46988
13672d6988P581j0675Q362l879J4655J3993n301l669k0882J3449L753k2412N515
$$ -46988 -39407 -50082 -41720 -45599 -30944 -16951 -22252 -25921 -46803 -33354 -29601 -52013 -46498
13659d6498m641J7583Q629j4869j664N672n233m149K66j9687j0306J9746L9327
$$ -46498 -51139 -33556 -24927 -39796 -41460 -35788 -41021 -45170 -44904 -64591 -74897 -55151 -15824
13646a5824J644j101R663j5242j6629J3736L2276k1542k7648j3579M974K3443
$$ -15824 -14180 -15281 -5618 -20860 -37489 -23753 8523 -13019 -40667 -54246 -49272 -25829
13634b5829J9870k5387j4580k37j65J7819J7536q694j2874Q123o816j7938J4657
$$ -25829 -5959 -31346 -45926 -46163 -46328 -28509 -10973 -19667 -32541 -24418 -31234 -49172 -34515
13621c4515K1676r200j8576k4777k8196M1531J6045J698o01j5892k9r803J1651
$$ -34515 -12839 -22039 -40615 -65392 -93588 -52057 -36012 -34314 -34915 -50807 -50836 -60639 -48988
13608d8988K9973J2407j0104Q741K5170k2846k0049K1043J3684j3451J556n879
$$ -48988 -19015 -6608 -16712 -7971 17199 -5647 -25696 -4653 9031 -4420 -2864 -8743
13596h743Q06J3271J2614j1529J2690j7132j6818K388N813N802K5469K0941l2207
$$ -8743 -7937 5334 17948 6419 19109 1977 -14841 -12453 -6640 -838 24631 45572 13365
13583A3365l2502l1059K731k283J4805P17k6924Q940L188K3852L8456l476j8382
$$ 13365 -19137 -50196 -47465 -49748 -34943 -34226 -61150 -52210 -49022 -25170 13286 9810 -8572
13570h572m2969j474K0160K7945j7685j1613j1439o206k66K634J598L079K0618
$$ -8572 -51541 -53015 -32855 -4910 -22595 -34208 -45647 -51853 -52119 -49485 -47887 -44808 -24190
13557b4190J7199q992j263J1631k2626K6356l658R171Q884J0587L714j7720n1773
$$ -24190 -6991 -15983 -17246 -5615 -28241 -1885 -5543 3628 12512 23099 26813 9093 -42680
13544d2680k2067J5629J1914N65j245L895j5389m362q721P290M311J32O995M971
$$ -42680 -64747 -49118 -37204 -36639 -37884 -33989 -49378 -53740 -62461 -55171 -50860 -50728 -43733 -38762
13530c8762Q228J5099M237j5625j6567P245L1544j5896p398l731K4145J5777k6538
$$ -38762 -30534 -15435 -11198 -26823 -43390 -36145 -4601 -20497 -27895 -31626 -7481 8296 -18242
13517a8242K6377K546N233J9508j6370j8705k2846j5210l619J5248j7318J303
$$ -18242 8135 10681 15914 35422 19052 347 -22499 -37709 -41328 -26080 -43398 -42095
13505d2095K6557l680j0843K2174K5528r548k7673J1447j3844l17j8721l070K982
$$ -42095 -15538 -19218 -30061 -7887 17641 8093 -19580 -8133 -21977 -22294 -41015 -44085 -41103
13492d1103O047N3725m127j4408j0315o122k083q400j2088J5956p968p304P124
$$ -41103 -35056 18669 14542 134 -10181 -16303 -18386 -26786 -38874 -22918 -30886 -38190 -31066
13479c1066J3288j1865l34J1323j1643j3082R121J1066o518M842r272p63j8037
$$ -31066 -17778 -29643 -29977 -18654 -30297 -43379 -34258 -23192 -29710 -24868 -34140 -34903 -52940
13466e2940k0303K1272K6610K4537o184K1194j5159l0144j9176M0698K1007j8848
$$ -52940 -73243 -51971 -25361 -824 -7008 14186 -973 -31117 -50293 -9595 11412 -7436
13454g436k1978O311M831K4791L0431j3119k6772l2477j564L2573p854j6271K686
$$ -7436 -29414 -23103 -18272 6519 36950 23831 -2941 -35418 -36982 -4409 -12263 -28534 -25848
13441b5848o985j61M990K3095m2j2233R915n962j6212q754k5399J83O301N871
$$ -25848 -32833 -32994 -28004 -4909 -4951 -17184 -7269 -13231 -29443 -38197 -63596 -63413 -57112 -51241
13427e1241k652l92J6386j5982K4314P270R008O776J2618n321N65k390N050k5701
$$ -51241 -53893 -54285 -37899 -53881 -29567 -22297 -13289 -6513 6105 784 1349 -1041 4009 -21692
13413b1692M871Q288n176k1144P277n578j2350K6402J1512P399j6654n426J2589
$$ -21692 -16821 -8533 -13709 -34853 -27576 -33154 -45504 -19102 -7590 -191 -16845 -22271 -9682
13400i682N744K8711L111j9079m2639q131j2727L986K6788J1810p326m048p588
$$ -9682 -3938 24773 27884 8805 -33834 -41965 -54692 -50706 -23918 -12108 -19434 -23482 -31070
13387c1070k0698j6874J6650J5406l290n577O767Q06m760M633J1904j1395j833
$$ -31070 -51768 -68642 -51992 -36586 -39876 -45453 -38686 -37880 -42640 -38007 -26103 -37498 -39331
13374c9331K0714m337j2637m09n497j175O621K1243j3384q526j531L510J1920
$$ -39331 -18617 -22954 -35591 -36000 -41497 -42672 -36051 -14808 -28192 -36718 -38249 -34739 -22819
13361b2819K9784k5279k7782J3511K2188J9966M956J3843j8897j0116j3668j9753
$$ -22819 6965 -18314 -46096 -32585 -10397 9569 14525 28368 9471 -645 -14313 -34066
13349c4066j7481J6122J6572n886p389J92j0358J4269J067K874O960j1594n212
$$ -34066 -51547 -35425 -18853 -24739 -32128 -31936 -42294 -28025 -26958 -24084 -17124 -28718 -33930
13336c3930R776J1107L892L2523K1082k9565l3816r569J114j579j6230k0138n805
$$ -33930 -24154 -13047 -9155 23368 44450 14885 -18931 -28500 -27386 -28965 -45195 -65333 -71138
13323g1138L3458M7508j428k1694p579j4187J0939o445j3482j1681j1951l4399
$$ -71138 -37680 9828 8400 -13294 -20873 -35060 -24121 -30566 -44048 -55729 -67680 -102079
13311a02079J7011N832o816J0656M6705J2394Q392j2935K2875l793n620J832k2006
$$ -102079 -85068 -79236 -86052 -75396 -28691 -16297 -7905 -20840 2035 -1758 -7378 -5546 -27552
13298b7552j501N655J0634N777N411r902n822J0126l17P522J8505K1880Q074m0406
$$ -27552 -29053 -23398 -12764 -6987 -1576 -11478 -17300 -7174 -7491 31 18536 40416 48490 8084
13284H084l2740j1105J5004J7947J5854K179l5504O947j302j0921j7013J3350
$$ 8084 -24656 -35761 -20757 -2810 13044 15223 -20281 -13334 -14636 -25557 -42570 -29220
13272b9220K2734R833j8605k4492K1465K7728P383R9k8706l0477O402N010N25
$$ -29220 -6486 3347 -15258 -39750 -18285 9443 16826 16925 -11781 -42258 -35856 -30846 -30321
13259c0321r663k437J1509j255l7208j0056J2222J9627P40Q577R418q075J2251
$$ -30321 -39984 -42421 -30912 -32167 -69375 -79431 -67209 -47582 -46842 -38265 -28847 -36922 -24671
13246b4671N214J81k0240R571K7103J405N124j6329L548N217j6068j0409l474
$$ -24671 -19457 -19276 -39516 -29945 -2842 -1437 3687 -12642 -9094 -3877 -19945 -30354 -33828
13233c3828k7524j4730K1420J4381q438m514k6J8716j1929P206J3255j0891L948
$$ -33828 -61352 -76082 -54662 -40281 -48719 -53233 -53259 -34543 -46472 -39266 -26011 -36902 -32954
13220c2954j0963P25K1926r38R363k6263o746l245k575q595M25K0785J0958q162
$$ -32954 -43917 -43192 -21266 -22204 -12841 -39104 -45850 -49095 -51670 -60265 -59840 -39055 -28097 -36259
13206c6259j1905Q730J5641l395K1871L7034j4039j1738p160j3116J4005K6879
$$ -36259 -48164 -39434 -23793 -27188 -5317 31717 17678 5940 -1220 -14336 -331 26548
13194B6548k5509j3315r879K5996K7462l2795k4039P512q20M446j2798j7675k9344
$$ 26548 1039 -12276 -22155 3841 31303 -1492 -25531 -18019 -18839 -14393 -27191 -44866 -74210
13181g4210R922J9103j096r736n0K0027J5209j3218k7808l451L7932l430m852
$$ -74210 -64288 -45185 -46281 -56017 -56067 -36040 -20831 -34049 -61857 -65308 -27376 -30806 -35658
13168c5658J0637k5692l2941j6224L388O369j074R674p871Q246J1156J6735J447
$$ -35658 -25021 -50713 -83654 -99878 -96490 -90121 -91195 -81521 -89392 -81146 -69990 -53255 -51808
13155e1808j3725r774J1440Q536J7466K0164L6788O5298O3769M1300J2587k3266
$$ -51808 -65533 -75307 -63867 -55331 -37865 -17701 19087 84385 148154 189454 202041 178775
13143A78775j2997n0411n8670k0135J1928K313k4154l4902P118J5212l3932k5600
$$ 178775 165778 115367 56697 36562 48490 50803 26649 -8253 -1135 14077 -19855 -45455
13131d5455K4768J3331J7681p132p210L234j6033J216K4629J6531p892j3912K1705
$$ -45455 -20687 -7356 10325 3193 -4017 -783 -16816 -15600 9029 25560 17668 3756 25461
13118B5461l7594k5461K6356K491m214J1389J711m3121p155J1715K2765R077J4598
$$ 25461 -12133 -37594 -11238 -8747 -12961 -1572 139 -42982 -50137 -38422 -15657 -6580 8018
13105H018K0538l286J8338P5367P9726K3351j943l5655n7985k9006j3513k4216
$$ 8018 28556 25270 43608 118975 198701 222052 220109 184454 126469 97463 83950 59734
13093E9734m4585P908J4764q483j5011k2572j4590K2990L3001j2554j4793j6897
$$ 59734 15149 23057 37821 29338 14327 -8245 -22835 155 33156 20602 5809 -11088
13081a1088l3655j1775J9417L1707k812k1663J0905J3713K7374j7717j6619N384
$$ -11088 -44743 -56518 -37101 -5394 -8206 -29869 -18964 -5251 22123 4406 -12213 -6829
13069f829L996J6591k1398m0347k399J8965k575k759J6661L3842L862Q982M4075
$$ -6829 -2833 13758 -7640 -47987 -50386 -31421 -33996 -36755 -20094 13748 17610 26592 70667
13056G0667J1558m457l7094m783j7101j7089k0404j7739j8050J0260J1646r885
$$ 70667 82225 77768 40674 35891 18790 1701 -18703 -36442 -54492 -44232 -32586 -42471
13044d2471J254J4711J0105J0142J489k5633k1455Q578N858J5201K7261K181m7214
$$ -42471 -41217 -26506 -16401 -6259 -4770 -30403 -51858 -43280 -37422 -22221 5040 7221 -39993
13031c9993m0054J7696J3640K9121L6298P468J187k3665j8176J1575J63k0035
$$ -39993 -80047 -62351 -48711 -19590 16708 24176 25363 1698 -16478 -4903 -4740 -24775
13019b4775l0340p829J7548j603J27j0664j0274K1463K9957K898J1407J627j9994
$$ -24775 -55115 -62944 -45396 -46999 -46872 -57536 -67810 -46347 -16390 -13492 -2085 -458 -20452
13006b0452J2496J8179K022k6801J5244K8898J3372K404l0089l7037n332j1401
$$ -20452 -7956 10223 12245 -14556 688 29586 42958 45362 15273 -21764 -27096 -38497
12994c8497j2765J2527L1762l7600o463J3098J6864K6974j4358j018l942j547
$$ -38497 -51262 -38735 -6973 -44573 -51036 -37938 -21074 5900 -8458 -9476 -13418 -14965
12982a4965N174J2291M06K441n019l6140j2128j0860k3403k869N2585N78q122
$$ -14965 -9791 2500 2906 5347 328 -35812 -47940 -58800 -82203 -85072 -32487 -31909 -40031
12969d0031K2181N171M859p72R097k726j0598O037J5292J1417J477J0402J4133
$$ -40031 -17850 -12679 -7820 -8592 505 -2221 -12819 -6782 8510 19927 21404 31806 45939
12956D5939j9781j4996J5120J3931r8k9520m9858j3480n778P804P074J9506J0006
$$ 45939 26158 11162 26282 40213 40115 10595 -39263 -52743 -58521 -50717 -43643 -24137 -14131
12943a4131J0320m261M868O851o221o585k7354l6231j6663K53n617L9832O1056
$$ -14131 -3811 -8072 -3204 3647 -2574 -9159 -36513 -72744 -89407 -89154 -94771 -54939 6117
12930F117J6651j074j1175k4671J0309o205k291k293j4759k984j1686n495K7132
$$ 6117 22768 21694 10519 -14152 -3843 -10048 -12339 -14632 -29391 -32375 -44061 -49556 -22424
12917b2424K0880J4515o724k5534j9364L2746K1716K1203J3164j1068k4133k7551
$$ -22424 -1544 12971 6247 -19287 -38651 -5905 15811 37014 50178 39110 14977 -12574
12905a2574J1417J1292L814L1101j4051k6397l2915R724J2476J9287k127l199
$$ -12574 -1157 10135 13949 45050 30999 4602 -28313 -18589 -6113 13174 11047 7848
12893G848J4493L1473N906q506m467n385L528j2260j5025k3490J2620r120l0666
$$ 7848 22341 53814 59720 51214 46747 41362 44890 32630 17605 -5885 6735 -2385 -33051
12880c3051J4573O921j8257K222N696L230j6002l0970L257K5602L6679J9283j4165
$$ -33051 -18478 -11557 -29814 -27592 -21896 -18666 -34668 -65638 -62381 -36779 -100 19183 5018
12867E018Q014L668j3743o411j1918j0571r598J3679L0413O593j4028k8618q854
$$ 5018 13032 16700 2957 -3454 -15372 -25943 -35541 -21862 8551 15144 1116 -27502 -36356
12854c6356K1226J7039j9836M561J4189K5837K2469l8820l7548J6115R551J8353
$$ -36356 -15130 1909 -17927 -13366 823 26660 49129 10309 -27239 -11124 -1573 16780
12842A6780m207k8872m268K2961J5438l904q021o170L336O724j4614p167j9669
$$ 16780 12573 -16299 -20567 2394 17832 13928 5907 -263 3073 9797 -4817 -11984 -31653
12829c1653j1704M443o759J2985m176J4232j6445J4710M990n4187k3142J3425
$$ -31653 -43357 -38914 -45673 -32688 -36864 -22632 -39077 -24367 -19377 -73564 -96706 -83281
12817h3281J6277n951J8245K0836K5559j1735O980R747j435j3467j1856N769k2477
$$ -83281 -67004 -72955 -54710 -33874 -8315 -20050 -13070 -3323 -4758 -18225 -30081 -24312 -46789
12804d6789l000J299J9281R046P126L1238j1587j2241N622j0103r140j0293k653
$$ -46789 -49789 -48490 -29209 -20163 -13037 18201 6614 -5627 -5 -10108 -19248 -29541 -32194
12791c2194j4861N327j3863K9841J290J25k0507q20j826j2912n902M718J8615
$$ -32194 -47055 -41728 -55591 -25750 -24460 -24335 -44842 -45662 -47488 -60400 -66302 -61584 -42969
12778d2969J2844j7955k1033L237J0636L506L422M9594J521m672k8840j0084r268
$$ -42969 -30125 -48080 -69113 -65876 -55240 -51734 -48312 1282 2803 -1869 -30709 -40793 -50061
12765e0061p040L766M6057M448n337K3553N315j6154l2192l7247k696K8453M5227
$$ -50061 -57101 -53335 -7278 -2830 -8167 15386 20701 4547 -27645 -64892 -67588 -39135 6092
12752F092j6805j4604J6256J0832l875j88r188k7130R706k0856l0536p553L043
$$ 6092 -10713 -25317 -9061 1771 -2104 -2292 -11480 -38610 -28904 -49760 -80296 -87849 -84806
12739h4806m171Q831k916K1035L1549r033k0403Q654J9248J091K2778O103M049
$$ -84806 -88977 -80146 -83062 -62027 -30478 -39511 -59914 -51260 -32012 -30921 -8143 -2040 2009
12726B009J3356m877j7178Q383J5728j1633j3802k486n159j354K4329n848j2006
$$ 2009 15365 10488 -6690 1693 17421 5788 -8014 -10500 -15659 -17013 7316 1468 -10538
12713a0538k2965j4498J1717o472M628J8399o216k871J7907j0104k5999j2196
$$ -10538 -33503 -48001 -36284 -42756 -38128 -19729 -25945 -28816 -10909 -21013 -47012 -59208
12701e9208K841K436J9800J4809l0374L551L6096J1041j0067L182l954J5768J1779
$$ -59208 -56367 -53931 -34131 -19322 -49696 -46145 -10049 992 -9075 -5893 -9847 5921 17700
12688A7700j2811o012K0657M891n482k7901k8094n931j9728l9554m604K2071J6210
$$ 17700 4889 -1123 19534 24425 18943 -8958 -37052 -42983 -62711 -102265 -106869 -84798 -68588
12675f8588J038l546k59k270n723Q761J8905J8459N853j0446k3493J7749q520
$$ -68588 -67550 -71096 -71355 -73625 -79348 -70587 -51682 -33223 -27370 -37816 -61309 -43560 -52080
12662e2080l009J1465J9340K3749j931j282J2546J4144K464L515n388j5978j4106
$$ -52080 -55089 -43624 -24284 -535 -2466 -3748 8798 22942 25406 28921 23533 7555 -6551
12649f551j2492K943M006O764J0402J0174j2471l3107n95J2514K0517L867J4621
$$ -6551 -19043 -16100 -12094 -5330 5072 15246 2775 -30332 -30927 -18413 2104 5971 20592
12636B0592J6187k9480J3487p181k7869m1341J169J216M180m660K1150j1262l130
$$ 20592 36779 7299 20786 13605 -14264 -55605 -54436 -53220 -49040 -53700 -32550 -43812 -46942
12623d6942K6149L154J4272j1314J2059j1825n5793J718R967R274j1539K5986
$$ -46942 -20793 -17639 -3367 -14681 -2622 -14447 -70240 -68522 -58555 -49281 -60820 -34834
12611c4834N333k0719k1572j3356J3845J7488p752K131k2345k8075J447J8616
$$ -34834 -29501 -50220 -71792 -85148 -71303 -53815 -61567 -59436 -81781 -109856 -108409 -89793
12599h9793K300L0470R656k4620O599J1490p173o479O949K2921K0591P425p668
$$ -89793 -87493 -57023 -47367 -71987 -65388 -53898 -61071 -67550 -60601 -37680 -17089 -9664 -17332
12586a7332j8481p096P668K0484Q25p382K7375L178k296j180j6333j2711K9539
$$ -17332 -35813 -42909 -35241 -14757 -13932 -21314 6061 9239 6943 5763 -10570 -23281 6258
12573F258M9634R865O917j0813j6921k0543q747L4085K5679J811Q794M3194L8250
$$ 6258 55892 65757 72674 61861 44940 24397 15650 49735 75414 77225 86019 129213 167463
12560A67463L8443N4144N6242R9865J32558J41721J61673J54046J55984J29871
$$ 167463 205906 260050 316292 416157 548715 690436 852109 1006155 1162139 1292010
12550A292010J24307N2784J293j7167q6266j43274j63477j24426j16886j25131
$$ 1292010 1416317 1469101 1470394 1453227 1366961 1223687 1060210 935784 818898 693767
12540F93767j08594n8194m1328m6175n1637m9704k6088q975r768j9716k1473n6634
$$ 693767 585173 526979 485651 439476 387839 338135 312047 303072 293304 273588 252115 195481
12528A95481m6816j8280k5716m655J1573j8921J0989R342j0753p857L738k5865
$$ 195481 148665 130385 104669 100014 111587 92666 103655 112997 102244 94387 98125 72260
12516G2260l4890k3679j764J5133k287q055l183J0617r399j8733k5649K5760K1811
$$ 72260 37370 13691 11927 27060 24773 16718 13535 24152 14753 -3980 -29629 -3869 17942
12503A7942K2470j8973k2797K0458k925j0562j4964k525K5308K3847K1043n954
$$ 17942 40412 21439 -1358 19100 16175 5613 -9351 -11876 13432 37279 58322 52368
12491E2368j0507j1717Q64M616R728o816j6415j9935k4217j7428J8119J8844k18
$$ 52368 41861 30144 31008 35624 45352 38536 22121 2186 -22031 -39459 -21340 -2496 -2714
12478b714O272M581J1894R6k0772P564K5982j6022J0265n368l7738O961K218J5461
$$ -2714 3558 8139 20033 20129 -643 6921 32903 16881 27146 21778 -15960 -8999 -6781 8680
12464H680J8473J8738L994k0971j661J2776J1192k8879m7482j2458K8007R987
$$ 8680 27153 45891 49885 28914 27253 40029 51221 22342 -25140 -37598 -9591 396
12452C96J8156K429j9743N804J455O535o72K4976L5769N610Q447J50r395l3175
$$ 396 18552 20981 1238 7042 8497 15032 14360 39336 75105 80715 89162 89312 79917 46742
12438D6742k1517k3205J643K5623J6343j9200m553K2135P528K2258j2990m4884
$$ 46742 25225 2020 3663 29286 45629 26429 21876 44011 51539 73797 60807 15923
12426A5923k7618J0825K7590j799k520j3548J5371K5715O10j736m87J2648j0269
$$ 15923 -11695 -870 26720 24921 22401 8853 24224 49939 50549 48813 48326 60974 50705
12413E0705l7496O850R505k5831P452K6942j5329j3023j6738Q158j1879Q621K8048
$$ 50705 13209 20059 29564 3733 11185 38127 22798 9775 -6963 1195 -10684 -2063 25985
12400B5985P379l503J7019K3954J9399K8494J3762J7956M047K2793J1544K410
$$ 25985 33364 29861 46880 70834 90233 118727 132489 150445 154492 177285 188829 191239
12388A91239k430J7968K2991K3903k7054k4418k0396j9828k5419j1056j3386n73
$$ 191239 188809 206777 229768 253671 226617 202199 181803 161975 136556 125500 112114 111541
12376A11541J781P677J3688N978j5465k0342J354j1824j1620R908j2723j1408
$$ 111541 113322 120999 134687 140665 125200 104858 106212 94388 82768 92676 79953 68545
12364F8545J1897J4714k7708j0333j2748L768r444J3673j6431K373L5862K6127
$$ 68545 80442 95156 67448 57115 44367 48135 38691 52364 35933 38306 74168 100295
12352A00295j6210m130J48k405n513j091k1927N657Q105J8953J4754J201P716
$$ 100295 84085 79955 80103 77698 72185 71094 49167 54824 62929 81882 96636 97837 105553
12339A05553m018L6084L6120J0559p079O795J3981J1572j4794j2516K5802M468
$$ 105553 101535 137619 173739 184298 177219 184014 197995 209567 194773 182257 208059 212527
12327B12527j6867k5847k3425L276j7292o747k2926o1403m2724j7457m0761l7709
$$ 212527 195660 169813 146388 149664 132372 125625 102699 41296 -1428 -18885 -59646 -97355
12315i7355l2382o787l78J820R739O112N200L3122K0695L483O493L7719k032k4337
$$ -97355 -129737 -136524 -136902 -135082 -125343 -119231 -114031 -80909 -60214 -56731 -50238 -12519 -14551 -38888
12301c8888j3943j6387J750M7040J999j4918r889j9357M408l342K284j818m950
$$ -38888 -52831 -69218 -67468 -20428 -18429 -33347 -43236 -62593 -58185 -61527 -59243 -61061 -66011
12288f6011j3858q148o70j9405K8508K3288k4043j8126K0501K9847L2120L2248
$$ -66011 -79869 -88017 -88687 -108092 -79584 -56296 -80339 -98465 -77964 -48117 -15997 16251
12276A6251L998K60K7396K3673K2025k7012k0959J1111L6363j5493k670K1240
$$ 16251 20249 20509 47905 71578 93603 66591 45632 56743 93106 77613 74943 96183
12264I6183J2630K0830J7465P375j0541j0078P92k7127l4300k2852l06j7654m1018
$$ 96183 108813 129643 147108 154483 143942 133864 134656 107529 73229 50377 50071 32417 -8601
12251h601J253o414J6932j749J6294L9697J9354J3155K9068j9137J4329M4957
$$ -8601 -7348 -13762 3170 1421 17715 57412 76766 89921 118989 99852 114181 159138
12239A59138L8087J4644q686J0422j9362N722R403n19j0567L7867N1202K0387
$$ 159138 197225 211869 203183 213605 194243 199965 209368 208849 198282 236149 287351 307738
12227C07738K502N2334N9136J7652k0281o889l63q461K2078R390l5544m5704l0097
$$ 307738 310240 362574 421710 439362 419081 412192 411829 403368 425446 434836 399292 353588 323491
12214C23491L3893J4326K2540l684k0037J2170M85j9175J7419L4637L7250j4373
$$ 323491 357384 371710 394250 390566 370529 382699 383184 364009 381428 416065 453315 438942
12202D38942O350L529j6359J8495j1012k1933J5750L682L4547K2232j3452q333
$$ 438942 445292 448821 432462 450957 439945 418012 433762 437444 471991 494223 480771 472438
12190D72438L5753P3410O0587N1260O4339O3885Q8220Q4616O7084P2755P1178
$$ 472438 508191 581601 642188 693448 757787 821672 909892 994508 1061592 1134347 1205525
12179A205525L8839J0717L3521Q9198P2642O6195J03363J13884J11073J09279
$$ 1205525 1244364 1255081 1288602 1377800 1450442 1516637 1620000 1733884 1844957 1954236
12169A954236J50286K01291J61048J97761K41591K75140K96744L28019L78228
$$ 1954236 2104522 2305813 2466861 2664622 2906213 3181353 3478097 3806116 4184344
12160D184344M12443N26046O26629P39372R12431J178414J435520J703142J961466
$$ 4184344 4596787 5122833 5749462 6488834 7401265 8579679 10015199 11718341 13679807
12151A3679807K180520K376622K651921K947340L302991L903673M812204O411351
$$ 13679807 15860327 18236949 20888870 23836210 27139201 31042874 35855078 42266429
12143D2266429R071282J3242233J9061264K5429930L0311351L2759661L2846646
$$ 42266429 51337711 64579944 83641208 109071138 139382489 172142150 204988796
12136B04988796L1502746K8333528K1958777J1938985q41687j1769662j9759049
$$ 204988796 236491542 264825070 286783847 298722832 297881145 286111483 266352434
12129B66352434k4283623k7342272k8963955k8358894k5056352j9731492j4589082
$$ 266352434 242068811 214726539 185762584 157403690 132347338 112615846 98026764
12122I8026764j0697788q045887o315174n283872m743234m569767m476913m448416
$$ 98026764 87328976 79283089 72967915 67684043 62940809 58371042 53894129 49445713
12114D9445713m416847m288364m090079l820823l479468l117933k688741k341076
$$ 49445713 45028866 40740502 36650423 32829600 29350132 26232199 23543458 21202382
12106B1202382k047915j789870j573350j385469j226721j061675r64043q89284
$$ 21202382 19154467 17364597 15791247 14405778 13179057 12117382 11153339 10264055
12098A0264055p91750p15595o40399o09760n49429m78836m44408m41770m20052
$$ 10264055 9472305 8756710 8116311 7506551 6957122 6478286 6033878 5592108 5172056
12089E172056l89199l58415l16070k96343k67578k38626k06133j56256j28918
$$ 5172056 4782857 4424442 4108372 3812029 3544451 3305825 3099692 2943436 2814518
12080B814518j40450j57065j44440j09171j32152j25900q9794r6286r6522j07915
$$ 2814518 2674068 2517003 2372563 2263392 2131240 2005340 1915546 1819260 1722738 1614823
12070A614823p1993l2783k8422m9930o0331o5627l5241l2447n9380j9175j3008
$$ 1614823 1542830 1510047 1481625 1431695 1371364 1305737 1270496 1238049 1178669 1159494 1146486
12059A146486j0865q494j6327k9636j5773l8593k6125j7570k9393n6736l1810
$$ 1146486 1135621 1127127 1110800 1081164 1065391 1026798 1000673 983103 953710 896974 865164
12048H65164l1651k0620m0448k2343K337j8142l566k4270r916P711j5432n282
$$ 865164 833513 812893 772445 750102 752439 734297 730731 706461 696545 704256 688824 683542
12036F83542l161O253j1136j7256n589K8274J1312j0971k8376M786R313k1176
$$ 683542 680381 686634 675498 658242 652653 680927 692239 681268 652892 657678 666991 645815
12024F45815j2289N158L298j0471j2860k4245R944K7211j386N342P457K2353N6236
$$ 645815 633526 638684 641982 631511 618651 594406 604350 631561 630175 635517 642974 665327 721563
12011G21563N2407j4819k4976O23J261j8822l583j6688n9258o8966n1154k5423
$$ 721563 773970 759151 734175 734798 736059 717237 713654 696966 637708 568742 517588 492165
11999D92165j5559L782J327K828j7850j0443L442J4833j797p158J4936q520R055
$$ 492165 476606 480388 481715 484543 466693 456250 459692 474525 472728 465570 480506 471986 481041
11986D81041K660O008J8341r158N757k1652j6441j1445M456L194N540J9055q634
$$ 481041 483701 489709 508050 498892 504649 482997 466556 455111 459567 462761 468301 487356 478722
11973D78722j7156n3245k676J2323k2611j4884J548j1870k0603j9577j3211o078
$$ 478722 461566 408321 405645 417968 395357 380473 382021 370151 349548 329971 316760 310682
11961C10682J116J6904K3964J5473K537j0672j7545J2206j0875k0971M1130J7223
$$ 310682 311798 328702 352666 368139 370676 360004 342459 354665 343790 322819 363949 381172
11949C81172J802j4642k6987j2865l9906n1490l0348q641j7987k9097n0135m3009
$$ 381172 382974 368332 341345 328480 288574 237084 206736 198095 180108 151011 100876 57867
11937E7867j6315k6209p243k7297j4219m3P775K8372M2606Q292n676o385J7934
$$ 57867 41552 15343 8100 -19197 -33416 -33459 -25684 2688 45294 53586 47910 41525 59459
11924E9459j5101m801r29R065K6670j0096j3440j6186o158L762k6323O289O588
$$ 59459 44358 39557 38628 47693 74363 64267 50827 34641 28483 32245 5922 12211 18799
11911A8799L7581K2916l765k4030l2369J1562J6871o682j7610K5085L3894k8483
$$ 18799 56380 79296 75531 51501 19132 30694 47565 40883 23273 48358 82252 53769
11899E3769O902R332K6604R91k0004J0015m910J8005K6652j7130k4928l452k0306
$$ 53769 60671 70003 96607 97598 77594 87609 82699 100704 127356 110226 85298 81846 61540
11886F1540P718J1848J1925R112k8827N383K9423L812R331q848l8983l1072j451
$$ 61540 69258 81106 93031 102143 73316 78699 108122 111934 121265 112417 73434 42362 40911
11873D0911K3690N137j3084l6181Q629P479j2470k2980j1725n4J2296J4971J3816
$$ 40911 64601 69738 56654 20473 29102 36581 24111 1131 -10594 -10648 1648 16619 30435
11860C0435O227k064o74J4609J0912K1022j1587j2408l4859J7464J3743M0499
$$ 30435 36662 34598 33924 48533 59445 80467 68880 56472 21613 39077 52820 93319
11848I3319J978j7005N677J6330M345R77j4374N83R314K6423j2906j35L8040m561
$$ 93319 95297 78292 83969 100299 104644 105621 91247 91830 101144 127567 114661 114526 152566 148005
11834A48005m4841l4596j5961J0436j0323k0203j1240K826l404K6279m582Q090
$$ 148005 103164 68568 52607 63043 52720 32517 21277 24103 20699 46978 42396 50486
11822E0486N046k5902j9586K319j324k4008o631M3866K5453j1009l5572j2883
$$ 50486 55532 29630 10044 12363 11039 -12969 -19600 24266 49719 38710 3138 -9745
11810i745P283K3552K1132j3698J7661p824q797O63J4511O659R548o785l853K6817
$$ -9745 -2462 21090 42222 28524 46185 38361 29564 30227 44738 51397 60945 54160 50307 77124
11796G7124K1730m941k5794J4235K1095k3504r856p105l2595M021L3944K8809
$$ 77124 98854 93913 68119 82354 103449 79945 70089 62984 30389 34410 68354 97163
11784I7163R295k733j6336k8963k8386N468K4395J7131q39K585k4568R275k101
$$ 97163 106458 103725 87389 58426 30040 35508 59903 77034 76195 78780 54212 63487 61386
11771F1386m846J4266m804l5655k1399K1015j6747K743l262p768l604J227R973
$$ 61386 56540 70806 66002 30347 8948 29963 13216 15959 12697 4929 1325 2552 12525
11758A2525N380r800K2807J8391n86k594k0809k073j866L744K9747M5101j0100
$$ 12525 17905 8105 30912 49303 48717 46123 25314 23241 21375 25119 54866 99967 89867
11745H9867j5492L4922J5514j2767j3201J1585m6847k4716K3627L7173R087k776
$$ 89867 74375 109297 124811 112044 98843 110428 63581 38865 62492 99665 108752 105976
11733A05976J0042j2877o057J1775R019J023K7877J3097J9740J8224J3362M2952
$$ 105976 116018 103141 97084 108859 117878 118901 146778 159875 179615 197839 211201 254153
11721B54153M0990O5136J23244J19132J56599J46817J67205J86188J39101J13610
$$ 254153 295143 360279 483523 602655 759254 906071 1073276 1259464 1398565 1512175
11711A512175O8359r83n2744q5393j37187j42316j65170j31365j34695j25656
$$ 1512175 1580534 1579551 1526807 1441414 1304227 1161911 996741 865376 730681 605025
11701F05025m9723n0511n8946m9695k9302M896l3080l8909k8481k8835l8478j1159
$$ 605025 555302 504791 445845 396150 366848 371744 338664 299755 271274 242439 203961 192802
11689A92802k6617k3333k474j2412j9979J5117J3532j1099p837J309q69p814j0827
$$ 192802 166185 142852 140378 127966 107987 123104 136636 125537 117700 119009 118140 110326 99499
11676I9499j0731j7856J4512j759J923J095n907l514j6650n750l8k437k1230L155
$$ 99499 88768 70912 85424 83665 85588 86683 80776 77262 60612 54862 54824 52387 31157 34312
11662C4312J9306J8286K828N735K948o830j7295m318R825k4078k8709m863L068
$$ 34312 53618 71904 74732 80467 83415 76585 59290 54972 64797 40719 12010 7147 10215
11649A0215J6272M630r968O66K7080Q862L499o518q290o266r84r696k2419J8768
$$ 10215 26487 31117 21149 21815 48895 57757 61256 54738 46448 40182 39198 29502 7083 25851
11635B5851j2722j5587J1778J7752q109p301j2014N545J6376K0170P71L51J0472
$$ 25851 13129 -2458 9320 27072 18963 11662 -352 5193 21569 41739 42510 42861 53333
11622E3333r760l9289j3664J2181K4923j5437m386J3783L1353j0456J455j6124
$$ 53333 43573 4284 -9380 2801 27724 12287 7901 21684 53037 42581 44036 27912
11610B7912m3757k0098K2548M4500r513j5441J2044K7818J6432j2014m8844j7808
$$ 27912 -15845 -35943 -13395 31105 21592 6151 18195 46013 62445 50431 1587 -16221
11598a6221J0550M654j1266J5406K6541R702K1112J982j6906J9097j172J6699
$$ -16221 -5671 -1017 -12283 3123 29664 39366 60478 62460 45554 64651 63479 80178
11586H0178k202k0368k6375j5129K0713j1543R884k633k1691j323Q746J086j0313
$$ 80178 77976 57608 31233 16104 36817 25274 35158 32525 10834 9511 18257 19343 9030
11573I030o567j1634l310j2880Q608R909p481o254j449J704J5142J3461k347n801
$$ 9030 2463 -9171 -12481 -25361 -16753 -6844 -14325 -20579 -22028 -20324 -5182 8279 5932 131
11559A31l6023k675K9707K0237k7289K0539K5525k254j2038j7008J3461k800j9688
$$ 131 -35892 -38567 -8860 11377 -15912 4627 30152 27898 15860 -1148 12313 9513 -10175
11546a0175J011K8662M903R217R357l731k0899l3142r795p264j0280L465K3656
$$ -10175 -9164 19498 24401 33618 42975 39244 18345 -14797 -24592 -31856 -42136 -38671 -15015
11533a5015L4012K7692m630k6761k9558r750M0344l453k3502j730J077l075J9293
$$ -15015 18997 46689 42059 15298 -14260 -24010 16334 12881 -10621 -12351 -11274 -14349 4944
11520D944K6298K3108m971k3560l8512j0122J4134K6673M314n012J0305j278K156
$$ 4944 31242 54350 49379 25819 -12693 -22815 -8681 17992 22306 17294 27599 26321 28477
11507B8477O437O30j9441k553J8486q840j037K7424L7716k313j5320k6371p155
$$ 28477 34914 35544 16103 13550 32036 23196 22159 49583 87299 84986 69666 43295 36140
11494C6140K13N615M198p580p127J1462K3522L063j0266j4804j2000M957J9346
$$ 36140 36353 41968 46166 38586 31459 42921 66443 69506 59240 44436 32436 37393 56739
11481E6739O55o259l1201k0541j4968K9348K0343N862O664k589N386k24j2403
$$ 56739 57394 51135 19934 -607 -15575 13773 34116 39978 46642 44053 49439 49215 36812
11468C6812J2614L67j7841J948k4840M14R698J0248K268j5695j3684q984J5217
$$ 36812 49426 49793 31952 33900 9060 9474 19172 29420 31688 15993 2309 -6675 8542
11455H542K7001J3641J6809k418m843k3522j8668n435p856l073q810K7603k663
$$ 8542 35543 49184 65993 63575 58732 35210 16542 11107 3251 178 -8632 18971 16308
11442A6308j9916J230q081p597M655p728j077j25K466Q483J9824J9859p26N367
$$ 16308 -3608 -2378 -10459 -18056 -13401 -21129 -22206 -22331 -19865 -11382 8442 28301 27575 32942
11428C2942k1617r479K089J3749J9731J5402l0965n964K5645N909j9196K91J2267
$$ 32942 11325 1846 3935 17684 37415 52817 21852 15888 41533 47442 28246 28537 40804
11415D0804k70j5375k7253m719j8463j4954K2466J8624j3663l2530M0554M3330
$$ 40804 40534 25159 -2094 -6813 -25276 -40230 -17764 860 -12803 -45333 -4779 38551
11403C8551k666k3558k6928K1717q65j2611j6956N53M2374P447m4390j0308k8523
$$ 38551 35885 12327 -14601 7116 6251 -6360 -23316 -22763 19611 27058 -17332 -27640 -56163
11390e6163M584K278J7339J489O762L2957j1205J264J8216k1315r841J26K5970
$$ -56163 -51579 -49301 -31962 -30473 -23711 9246 -1959 -695 17521 -3794 -13635 -13509 12461
11377A2461J2310p787j2196J169J471l129J0277P228j0984j5797O409J2221q578
$$ 12461 24771 16984 4788 5957 7428 4299 14576 21804 10820 -4977 1432 13653 5075
11364E075l2108j470J9870M430J3056O585L2929K5952n107p194j0544J840p240
$$ 5075 -27033 -28503 -8633 -4203 8853 15438 48367 74319 69212 62018 51474 53314 46074
11351D6074k912L008l3298k0669Q181R527j3550j0978J223J8970P978J3365J770
$$ 46074 43162 46170 12872 -7797 384 9911 -3639 -14617 -13394 5576 13554 26919 28689
11338B8689q737o773J0706k3036K128M6314J0871J847j1053j6973K054K510o561
$$ 28689 19952 13179 23885 849 2977 49291 60162 62009 50956 33983 36037 38547 31986
11325C1986l3715p495m324k0872J0430K1764K190k4606K31O905m097J5212J2102
$$ 31986 -1729 -9224 -13548 -34420 -23990 -2226 -36 -24642 -24411 -17506 -21603 -6391 5711
11312E711n41j4214J0964L370Q572O874r15N901p014k2042k4916J8005L975k23
$$ 5711 5170 -9044 1920 5290 13862 20736 19821 25722 18708 -3334 -28250 -10245 -6270 -6493
11298f493O384Q1M3366l733k2672l0921J9564K2831k338K723J569q913m2868j2694
$$ -6493 -109 -28 43338 39605 16933 -13988 5576 28407 26069 28792 30361 21448 -21420 -34114
11284c4114K0535L060n246L9024m44r588l141k6000q684n547q965R368R486q43
$$ -34114 -13579 -10519 -15765 23259 22815 13227 10086 -15914 -24598 -30145 -39110 -29742 -20256 -21099
11270b1099l0683M003K1930J76J7125J0890r844O29J1000L831j6935K1435K1366
$$ -21099 -51782 -47779 -25849 -25673 -8548 2342 -7502 -6873 4127 7958 -8977 12458 33824
11257C3824P449j4895J8958o953k3733n741Q428n96k4997l0188J7531K3420J8705
$$ 33824 41273 26378 45336 38383 14650 8909 17337 16741 -8256 -38444 -20913 2507 21212
11244B1212l10n559k2026p335J6360j2092N57K7211K1865l240k3464j848M4926
$$ 21212 20902 15343 -6683 -14018 2342 -9750 -9193 18018 39883 36643 13179 11331 56257
11231E6257L937l1623j341k6205j0479j3374N407P078Q494J1252l942l0155N938
$$ 56257 60194 28571 27230 1025 -9454 -22828 -17421 -10343 -1849 9403 5461 -24694 -18756
11218a8756M3479J330P69L564P508O608l4307k8984Q375M178R984L143j9816k109
$$ -18756 24723 26053 26822 30386 37894 44502 10195 -18789 -10414 -6236 3748 6891 -12925 -15034
11204a5034J8698r41M380O502J2498J3856K851O899o28j2122j2662J194K1918
$$ -15034 3664 2723 7103 13605 26103 39959 42810 49709 49081 36959 24297 25491 47409
11191D7409M381k681p991j8314j6687r462L06J0496Q413k5573J6746K5546J4665
$$ 47409 51790 49109 41118 22804 6117 -3345 -3039 7457 15870 -9703 7043 32589 47254
11178D7254l641k7Q92p060N328K007m164N261m644n461j4893j1483Q337j9170
$$ 47254 43613 43586 44478 37418 42746 44753 40589 45850 41206 35745 20852 9369 17706 -1464
11164a464m018L2897K5795J137o056p646q183j5408J050K0896j6619k4065q137
$$ -1464 -5482 27415 53210 54347 48291 40645 32462 17054 18104 39000 22381 -1684 -9821
11151i821J8740K0435L097J3574P754r504q309K9639J0721Q797j896j9845n7070
$$ -9821 8919 29354 32451 46025 53779 44275 35966 65605 76326 85123 83227 63382 6312
11138F312l4462l440p839K6207K2819K96k4763R463J6955J2531J775k914N0456
$$ 6312 -28150 -31590 -39429 -13222 9597 9893 -14870 -5407 11548 24079 25854 22940 73396
11125G3396j982j9393p053j519j1122J3701J8514j5752j5191J2508j27J6876O032
$$ 73396 71414 52021 44968 43449 32327 46028 64542 48790 33599 46107 45980 62856 68888
11112F8888r861o063M540j6010k7723K9119J5630j1907J6731L0660p375m8916
$$ 68888 59027 52964 57504 41494 13771 42890 58520 46613 63344 94004 86629 37713
11100C7713j0893K6420p742p495K1328j5242n8281p817M0256K4683L716P138N619
$$ 37713 26820 53240 45498 38003 59331 44089 -14192 -22009 18247 42930 46646 53784 59403
11087E9403K3561J0652K869K862j0003K869L287j865n28J7887J0556K0325j4593
$$ 59403 82964 93616 96485 99347 89344 92213 95500 93635 93107 110994 121550 141875 127282
11074A27282m185l0220k2983K02K1514O843P745J1457J306k823L243J0075k4042
$$ 127282 123097 92877 69894 70096 91610 98453 106198 117655 118961 116138 119381 129456 105414
11061A05414j7213K2960M529j1856J987O523J1514o866K3557J1737j5659j204
$$ 105414 88201 111161 115690 103834 105821 112344 123858 116992 140549 152286 136627 135423
11049A35423l009K4670J7943l273q306J0441j8449J2755K922r995m044L733l284
$$ 135423 132414 157084 175027 171754 163448 173889 155440 168195 171117 161122 157078 160811 157527
11036A57527j6321J2444Q487J6919J513k921j3186k9088j9445j161K5833L802
$$ 157527 141206 153650 162137 179056 180569 177648 164462 135374 115929 114768 140601 144403
11024A44403k677l6330P49L073l482l044O660O159Q930p395L223J5274J3739j7720
$$ 144403 141726 105396 106145 109218 105736 102692 109352 115511 124441 117046 120269 135543 149282 131562
11010A31562k1765L320l886j4452K2445O331j7387j7805Q887q491O928m960k4005
$$ 131562 109797 113117 109231 94779 117224 123555 106168 88363 97250 88759 95687 90727 66722
10997F6722K3689K6513k8097k3180K4640O41l2151l67o529J2946R422j0998K004
$$ 66722 90411 116924 88827 65647 90287 90928 58777 58410 51881 64827 74249 63251 65255
10984F5255P879j557o5J5465N619p065r891R885J1582j4944k9135o742J606R366
$$ 65255 73134 71577 71512 86977 92596 85531 75640 85525 97107 82163 53028 46286 47892 57258
10970E7258J0750R890K4489k477l2263m197j591l616j8782M549Q792p407L070
$$ 57258 68008 77898 102387 99910 67647 63450 61859 58243 39461 44010 52802 45395 48465
10957D8465j1354L445J9023k608k4221J1085J9707k771p219J0499k228k7961m27
$$ 48465 37111 40556 59579 56971 32750 43835 63542 60771 53552 64051 61823 33862 33435
10944C3435L4581L1570N122j7334l6350L058j977O85N480L071k805n965J0342
$$ 33435 68016 99586 104708 87374 51024 54082 52105 52790 58270 61341 58536 52571 62913
10931F2913q948L057P163l023J8246j8766l592k3764J8811J3967J8746J8820J4615
$$ 62913 53965 57022 64185 61162 79408 60642 57050 33286 52097 66064 84810 103630 118245
10918A18245l5100k9876l920j1815J7898J1523J2355k150K316j3351j5742j0229
$$ 118245 83145 53269 49349 37534 55432 66955 79310 77160 79476 66125 50383 40154
10906D0154J6308m380o644M521l0556l341Q764J9636K7956K4517N487L285l1571
$$ 40154 56462 52082 45438 49959 19403 16062 24826 44462 72418 96935 102422 105707 74136
10893G4136j5404J0109j1076j3053j865K9161P589J9812j169j0083K733m128j7747
$$ 74136 58732 68841 57765 44712 42847 72008 79597 99409 98240 88157 90890 86762 69015
10880F9015j1686r562o000O616Q535J2584J4556k0245k4221R047o872M2827J2777
$$ 69015 57329 47767 41767 48383 56918 69502 84058 63813 39592 48639 41767 84594 97371
10867I7371k5680R945J0484K9047J1685k3918J0209J590l1110k8556O205J7161
$$ 97371 71691 81636 92120 121167 132852 108934 119143 120733 89623 61067 67272 84433
10855H4433p817R005M588r384n4K5346J5620J6528o643j478q312k9128N40j643
$$ 84433 76616 85621 90209 80825 80771 106117 121737 138265 131622 130144 121832 92704 93244 91601
10841I1601L89L0598m429k5014J817j7251j3659J2561M8085O876r062M096J729
$$ 91601 91990 122588 118159 93145 94962 77711 64052 76613 124698 131574 122512 126608 128337
10828A28337r978r24K761L261K2778K491O490P571l2299k5140o662K4282K2956
$$ 128337 118359 117435 120196 123457 146235 148726 155216 162787 130488 105348 98686 122968 145924
10815A45924r933J1591K1393j1867j4743l17j1398n425J108P096k343J1051K1358
$$ 145924 135991 147582 168975 157108 142365 142048 130650 125225 126333 133429 131086 142137 163495
10802A63495P963m736J1544J1957O474o34K5766r928Q009K1970M4811M1828L297
$$ 163495 171458 166722 178266 190223 196697 196063 221829 211901 219910 241880 286691 328519 331816
10789C31816M208R510K1326J2564L5985R695J5065J2311k1989J0557J8227R652
$$ 331816 336024 345534 366860 379424 415409 425104 440169 452480 430491 441048 459275 468927
10777D68927J5648L1232J8872L992o209j624K9140K0007R822J105J284Q510J7792
$$ 468927 484575 515807 534679 538671 532462 530838 559978 579985 589807 590912 592196 600706 618498
10764F18498J2681j070j9743j6981m918J6896J7995J0258J8433L3513j0650O152
$$ 618498 631179 630109 610366 593385 588467 605363 623358 633616 652049 685562 674912 681064
10752F81064K2414J6611R998J3028j3297K2244K4885K8660J3317L1497J7075j7872
$$ 681064 703478 720089 730087 743115 729818 752062 776947 805607 818924 850421 867496 849624
10740H49624j864J1438r326m6274n2891q963P493K71j2774j4281J5028j510o049
$$ 849624 847760 859198 849872 803598 750707 741744 749237 749508 736734 722453 737481 735971 729922
10727G29922n3965r347P388k8504n464M42K617M639K6414J3664k3024R368N3279
$$ 729922 675957 666610 673998 645494 640030 640472 643089 647728 674142 687806 664782 674150 727429
10714G27429K196k5756j1304j8596j0650J5036Q320l2953k8396j5158J0828k9700
$$ 727429 729625 703869 692565 673969 663319 678355 686675 653722 625326 610168 620996 591296
10702E91296l2156j967p391l4345k1908K357j3969j9331K765j1699k3582L128
$$ 591296 559140 557173 549782 515437 493529 495886 481917 462586 465351 453652 430070 433198
10690D33198J2353j402j7944k8526n768J3841J6453n114l8263l2240P618J2076
$$ 433198 445551 444149 426205 397679 391911 405752 422205 417091 378828 346588 354206 366282
10678C66282l9999m7430J7368M499K4893L439O404r590O66k1478J2727L3458P81
$$ 366282 326283 278853 296221 300720 325613 329052 335456 325866 326532 305054 317781 351239 352020
10665C52020q436r762K2561j2145j9407j2186m209j6846K0559L056J4014R89J056
$$ 352020 343584 333822 356383 344238 324831 312645 308436 291590 312149 315205 329219 330208 331264
10652C31264k812j2094j1911J5025J6819L1059Q964j035p802k3373q975J879K1374
$$ 331264 328452 316358 304447 319472 336291 367350 376314 375279 367477 344104 335129 337008 358382
10639C58382k321n12J9661J0626l926p572k0465l70J8078r90J2759J7794j8490
$$ 358382 356061 355549 375210 385836 381910 374338 353873 353503 371581 370591 383350 401144 382654
10626C82654m926k105n098K903J3515K9523K7400j789m438j3531J4385K8720Q073
$$ 382654 377728 375623 370525 373428 386943 416466 443866 442077 437639 424108 438493 467213 475286
10613D75286j5095o001L5121K1373k5774q966L3151j9k2435k8383q40K1264K2024
$$ 475286 460191 454190 489311 510684 484910 475944 509095 509076 486641 458258 457418 478682 500706
10600E00706J966J7032j5805n897K4158j1734O06J5759L2422N71k9175j730M312
$$ 500706 502672 519704 503899 498002 522160 510426 511032 526791 559213 559784 530609 528879 533191
10587E33191M8O618J9012K1579k2885J833J8567J8287j3650p431K2977K8433N517
$$ 533191 533239 539857 558869 580448 557563 559396 577963 596250 582600 575169 598146 626579 632096
10574F32096k845j5179K3792l887Q276K2609K2951L3914j6176j4618J259N628
$$ 632096 629251 614072 637864 633977 642253 664862 687813 721727 705551 690933 692192 697820
10562F97820J3002Q373K6601q309k4853j3962N041J5372K2031J7604j1627K3313
$$ 697820 710822 719195 745796 737487 712634 698672 703713 719085 741116 758720 747093 770406
10550G70406K2060J886q038P472J5945j6892q872n277j997K893k4163j0643J3539
$$ 770406 792466 794352 786314 793786 809731 792839 783967 778690 776693 779586 755423 744780 758319
10537G58319J1793L1332K473j9559j4795K0868K0268R927L582J4280K2751Q712
$$ 758319 770112 801444 803917 784358 769563 790431 810699 820626 824208 838488 861239 869951
10525H69951J3225Q735O492K068l2671j9319n403l2485m226K9393J6001J8549
$$ 869951 883176 891911 898403 900471 867800 848481 843078 810593 806367 835760 851761 870310
10513H70310j1245K8285O737L439R02J5297J792R456M2871K1631J9592N803K2115
$$ 870310 859065 887350 894087 897526 898428 913725 915517 924973 967844 989475 1009067 1014870 1036985
10500A036985N615J2185M7563K0895Q339L3972M0013K0526K3505r247j3893o861
$$ 1036985 1042600 1054785 1102348 1123243 1131582 1165554 1205567 1226093 1249598 1240351 1226458 1219597
10488A219597K2167K3262K1427p917J7918L3417j0907N960l150J9370M2146N1516
$$ 1219597 1241764 1265026 1286453 1278536 1296454 1329871 1318964 1324924 1321774 1341144 1383290 1434806
10476A434806L1100J6760N133L6993J8071J2355Q784J4410J2455L1339L4156K7894
$$ 1434806 1465906 1482666 1487799 1524792 1542863 1555218 1564002 1578412 1590867 1622206 1656362 1684256
10464A684256J0738J5248M0247J8718O6396O3593M7009N0309L9785L1069L1858
$$ 1684256 1694994 1710242 1750489 1769207 1835603 1899196 1946205 1996514 2036299 2067368 2099226
10453B099226N2364M0390M2064M6162M6625O2993O5742L6726Q8339J46689J13875
$$ 2099226 2151590 2191980 2234044 2280206 2326831 2389824 2455566 2492292 2580631 2727320 2841195
10442B841195J65135K24973K64380L18645L14463L07043L15419K75638K13831
$$ 2841195 3006330 3231303 3495683 3814328 4128791 4435834 4751253 5026891 5240722
10433E240722J48799L0520m0888r4851j52385j50031j29495j07766p7921m3585
$$ 5240722 5389521 5420041 5379153 5284302 5131917 4981886 4852391 4744625 4666704 4623119
10423D623119J9503O1402P6543O2667P9731R0254R7387P3576R5032J39082J39487
$$ 4623119 4642622 4704024 4780567 4843234 4922965 5013219 5110606 5184182 5279214 5418296 5557783
10412E557783J55807J74608J63835J59212J82145J95723K01921K35187K51745
$$ 5557783 5713590 5888198 6052033 6211245 6393390 6589113 6791034 7026221 7277966
10403G277966L05934L22224L06798L29380L75467L76900M38092M69565M97196
$$ 7277966 7583900 7906124 8212922 8542302 8917769 9294669 9732761 10202326 10699522
10394A0699522N11781N90943O47045O70770P40732P80399Q58541R25753J001536
$$ 10699522 11211303 11802246 12449291 13120061 13860793 14641192 15499733 16425486 17427022
10385A7427022J087574J212261J344497J466603J615225J729146J916537K081775
$$ 17427022 18514596 19726857 21071354 22537957 24153182 25882328 27798865 29880640
10377B9880640K249182K459136K666106K869052L100696L312058L493724L611306
$$ 29880640 32129822 34588958 37255064 40124116 43224812 46536870 50030594 53641900
10369E3641900L724013L737628L655950L512488L270374K914988K514861K045957
$$ 53641900 57365913 61103541 64759491 68271979 71542353 74457341 76972202 79018159
10361G9018159J591316J138662P10339M10358J92281K4625k5476n1332J9317J28220
$$ 79018159 80609475 81748137 82458476 82868834 83061115 83085740 83060264 83008932 83028249 83156469
10351H3156469L25892N11476P53531J019532J305265J592416J844611K115454
$$ 83156469 83482361 83993837 84747368 85766900 87072165 88664581 90509192 92624646
10343I2624646K380282K649042K856637K996343L101718L110246L058225K878285
$$ 92624646 95004928 97653970 100510607 103506950 106608668 109718914 112777139 115655424
10335A15655424K647523K294382J874120J431244J024353N30019N0696m05808
$$ 115655424 118302947 120597329 122471449 123902693 124927046 125457065 125507761 125101953
10327A25101953q21043j210740j531632j810670k021708k249786k395004k523188
$$ 125101953 124280910 123070170 121538538 119727868 117706160 115456374 113061370 110538182
10319A10538182k538780k533361k513819k404358k240146k065610j844838j556245
$$ 110538182 107999402 105466041 102952222 100547864 98307718 96242108 94397270 92841025
10311I2841025j279434j022844o69894l44539n131L13142O26821Q62716J100772
$$ 92841025 91561591 90538747 89868853 89524314 89519183 89832325 90459146 91321862 92422634
10302I2422634J275345J307699J250448J086920P84622L57776j85702q61755j485089
$$ 92422634 93697979 95005678 96256126 97343046 98127668 98485444 98299742 97437987 95952898
10293I5952898k121599k673377l179677l529345l762173l867073l838438l839336
$$ 95952898 93831299 91157922 87978245 84448900 80686727 76819654 72981216 69141880
10285F9141880l790402l588289l430254l280702l111460k906516k759881k604831
$$ 69141880 65351478 61763189 58332935 55052233 51940773 49034257 46274376 43669545
10277D3669545k457831k334940k184565k073600j927766j800350j705962j623987
$$ 43669545 41211714 38876774 36692209 34618609 32690843 30890493 29184531 27560544
10269B7560544j516989j392039j310561j211526j157636j082099r91042r22844
$$ 27560544 26043555 24651516 23340955 22129429 20971793 19889694 18898652 17975808
10261A7975808q48498p88031p23748p26020p08385o46614n63233n21447n12308
$$ 17975808 17127310 16339279 15615531 14889511 14181126 13534512 12971279 12449832 11937524
10252A1937524m97506m66762m09720l83440l90511l74812l36753l27094k92075
$$ 11937524 11440018 10973256 10563536 10180096 9789585 9414773 9078020 8750926 8458851
10243H458851k76440k62390k40885k21746k17179k35689k13108j90372j69051
$$ 8458851 8182411 7920021 7679136 7457390 7240211 7004522 6791414 6601042 6431991
10234F431991j68954j56078j57838j69567j73066j40466j21094j43818j10875
$$ 6431991 6263037 6106959 5949121 5779554 5606488 5466022 5344928 5201110 5090235
10225E090235j11958q7765o0239j12970j28171r5603j03324n6280r1516j01659
$$ 5090235 4978277 4890512 4830273 4717303 4589132 4493529 4390205 4333925 4242409 4140750
10215D140750q0866o5374p6119l1039m7398p5448o9103n4980q3322p5705m0566
$$ 4140750 4059884 3994510 3918391 3887352 3839954 3764506 3695403 3640423 3557101 3481396 3440830
10204C440830l4793o2889n8502o3545m0957k0203k6354l8137o0467k7883l7786
$$ 3440830 3406037 3343148 3284646 3221101 3180144 3159941 3133587 3095450 3034983 3007100 2969314
10193B969314k9300k2388o4206k9501l5423m7078j1589k346k5927l9602m1816
$$ 2969314 2940014 2917626 2853420 2823919 2788496 2741418 2729829 2727483 2701556 2661954 2620138
10182B620138j6895m3501k1208k6803r309j4195k4466k5582j2854p128m3783m0944
$$ 2620138 2603243 2559742 2538534 2511731 2502422 2488227 2463761 2438179 2425325 2418197 2374414 2333470
10170B333470k1257k7039l4419n9182o4886l8829k1523l8977m4443k1766N385
$$ 2333470 2312213 2285174 2250755 2191573 2126687 2087858 2066335 2027358 1982915 1961149 1966534
10159A966534M453l9537n3660n7048m6912k1481j1464k0113m988j658m4182l7943
$$ 1966534 1970987 1931450 1877790 1820742 1773830 1752349 1740885 1720772 1715784 1714126 1669944 1632001
10147A632001k7627j7041m5575m1049j1044k9959m9551k9623j4596j3035J6270
$$ 1632001 1604374 1587333 1541758 1500709 1489665 1459706 1410155 1380532 1365936 1352901 1369171
10136A369171j3294m8507l0471p779l6820k6793O176m800m4272m6102j7029J5794
$$ 1369171 1355877 1307370 1276899 1269120 1232300 1205507 1211683 1206883 1162611 1116509 1099480 1115274
10124A115274o399l3916j4286L115p529k8661j8581j6133j4057k0964j0096m024
$$ 1115274 1108875 1074959 1060673 1063788 1056259 1027598 1009017 992884 978827 957863 947767 943743
10112I43743R534n026k7109J0356j5900K281J2147j7066l4558n081O041j2464
$$ 943743 953277 948251 921142 931498 915598 917879 930026 912960 878402 873321 879362 866898
10100H66898k2236k5999j5314j2596j0887j6452J6369l12n0454j7484K2528J5082
$$ 866898 844662 818663 803349 790753 779866 763414 779783 779471 729017 711533 734061 749143
10088G49143j4225l1885m69J933l694j3033O399K6041Q180j2753l5241r186J4271
$$ 749143 734918 703033 702564 704497 700803 687770 694169 720210 728390 715637 680396 671210 685481
10075F85481j242j8446O171l031j1180k2188j605M62r476j4566O219r525k2480
$$ 685481 684239 665793 671964 668933 657753 635565 633960 634422 624946 610380 616599 607074 584594
10062E84594J3212j750m967k241J7363J9708k4234k4527l806m820q102O334r87
$$ 584594 597806 596056 591089 588848 606211 625919 601685 577158 573352 568532 560430 566764 565777
10049E65777J366N781j1064j0814k388j139K3265M1306R1846J28020R0025m1794
$$ 565777 567143 572924 561860 551046 548658 547519 570784 612090 703936 831956 921981 880187
10037H80187q7725q1458m3495m1242k8681j8043l5086J2732m16j1471J2814l0823
$$ 880187 792462 711004 667509 626267 597586 579543 544457 557189 556773 545302 558116 527293
10025E27293k8037j6755Q770K079m8677j544L803R890K0683j6745k027P368L42
$$ 527293 499256 482501 491271 493350 444673 443129 446932 456822 477505 460760 458733 466101 466443
10012D66443r347j5080j5447k3271J1161L9351J7917r386l9121k4972j531k673
$$ 466443 457096 442016 426569 403298 414459 453810 471727 462341 423220 398248 396717 394044
10000C94044o556m92M2292j3993m563O389K4608P48j3703m788n039j4288O234
$$ 394044 387488 386996 429288 415295 410732 417121 441729 442477 428774 423986 418947 404659 410893
9987D10893J8699m283m12k4635m7928J1177P191M1981L0094O002j1719k0139j4967
$$ 410893 429592 425309 424897 400262 352334 363511 370702 412683 442777 448779 437060 416921 401954
9974D01954K420p531j43j0205J3336k23j5538p955K1105K6247J1227Q052o97J1459
$$ 401954 404374 396843 396700 386495 399831 399608 384070 376115 397220 423467 434694 442746 442049 453508
9960D53508L3487K5381j1013m1242L0314J6950K2477L9038N192N069J5299P68
$$ 453508 486995 512376 501363 460121 490435 507385 529862 568900 574092 579161 594460 595228
9948E95228R972K3294L2666Q188K8063K2454K1413J4399R96Q833J5781R798L374
$$ 595228 605200 628494 661160 669348 697411 719865 741278 755677 756673 765506 781287 791085 794459
9935G94459l8211j9504l0011k1556j363L4442O325J147J2891p275J7371K0173
$$ 794459 756248 736744 706733 685177 683814 718256 724581 725728 738619 731344 748715 768888
9923G68888r247J098K4058K5679J6272L106P429M7880L6765Q128J928j6573Q979
$$ 768888 759641 760739 784797 810476 826748 829854 837283 885163 921928 930056 931984 915411 924390
9910I24390K8551q869j2358J252o033P679j8841j1472j7164l0716k0456J0403
$$ 924390 952941 944072 931714 932966 926933 934612 915771 904299 887135 856419 835963 846366
9898H46366K344J0003p772k3149k4619M102K6028l0331l0498L727l3774k913K9912
$$ 846366 848710 858713 850941 827792 803173 807275 833303 802972 772474 776201 742427 739514 769426
9885G69426K2488j8476M32J9194N912J2571K601j8660m885Q846j2182j2340o274
$$ 769426 791914 773438 773870 793064 798976 811547 814148 795488 790603 799449 787267 774927 768653
9872G68653j7833p97k4180j0612n123m2691l2293k7302m0525j4492o695R919k7336
$$ 768653 750820 750023 725843 715231 710108 667417 635124 607822 567297 552805 546110 556029 528693
9859E28693l8103k785P794j7328j1254k415k7298J629j5779l9850J7283J3230
$$ 528693 490590 487805 495599 478271 467017 464602 437304 438933 423154 383304 400587 413817
9847D13817j353J9867k65p698L0378O8058M5836J12224J67904K80279J71236j6577
$$ 413817 412464 432331 432066 424368 454746 522804 568640 680864 848768 1129047 1300283 1283706
9835A283706j76634k08599j63757r9298p0706m8666j1959l339o0735j3313l0073
$$ 1283706 1107072 898473 734716 635418 564712 516046 504087 500748 440013 426700 396627
9824C96627k1521M842k1126q607J1184j241j7138r363J3676P042r583j5482l6364
$$ 396627 375106 379948 358822 350215 361399 360158 343020 333657 347333 354375 344792 329310 292946
9811B92946j1062l406q757j1383r720p067K188r84K9862J5186k7725k6107j7664
$$ 292946 281884 278478 269721 258338 248618 241551 243739 242755 272617 287803 260078 233971 216307
9798B16307l427K4752L6047J5255J700j3988k5925j4778k276K3125Q345l128k1789
$$ 216307 212880 237632 273679 288934 290634 276646 250721 235943 233667 256792 265137 262009 240220
9785B40220o051m702k902j2072J8429J0117k6801m074J7056K40J8661R354n212
$$ 240220 234169 229467 226565 214493 232922 243039 216238 212164 229220 229460 248121 257475 252263
9772B52263k1096k0514k2562K0291J8691R470J656m299L487j2607j3615l460K467
$$ 252263 231167 210653 188091 208382 227073 236543 238199 233900 237387 224780 211165 207705 210172
9759B10172j9763j3428J6639L6887M224o411j4870J2958j801j021M833j5614k9398
$$ 210172 190409 176981 193620 230507 234731 228320 213450 226408 224607 223586 228419 212805 183407
9746A83407J3353M3632j8280j8107O846K7989r534k0700J3711p24J3898j0377
$$ 183407 196760 240392 222112 204005 210851 238840 229306 208606 222317 221593 235491 225114
9734B25114L1192J867m0722m7185l0664O060L7600M9688J4624j7834j5024O942
$$ 225114 256306 258173 217451 170266 139602 145662 183262 232950 247574 229740 214716 221658
9722B21658K150O022k3911O273O115p599O57J1185k9726L7771J3966k5825o616
$$ 221658 223808 229830 205919 212192 218307 210708 211365 222550 192824 230595 244561 218736 212120
9709B12120m619k2407p76k5291J2811P850K0140N799k4810J9775L3934n236l8742
$$ 212120 207501 185094 184318 159027 171838 179688 199828 205627 180817 200592 234526 229290 190548
9696A90548j1100J9673J4568o078O783J3847j627J7884M056j4120q571J2257K6491
$$ 190548 179448 199121 213689 207611 214394 228241 226614 244498 248554 234434 225863 238120 264611
9683B64611J8401O692K42J0793p904j359L960O300j706j7623k0786N568j4307
$$ 264611 283012 289704 289946 300739 292835 291476 295436 301736 300030 282407 261621 267189 252882
9670B52882J4781K5024J7024J7560N661j032j0546J8168J0332j313J267N813j0142
$$ 252882 267663 292687 309711 327271 332932 331900 321354 339522 349854 348541 349808 355621 345479
9657C45479k010L1266L5806Q621N045J5297q705J1658J5096j8192j2125P618j4226
$$ 345479 343469 374735 410541 419162 424207 439504 430799 442457 457553 439361 427236 434854 420628
9644D20628O437K6544o755k658K9010M1006J950N030o146r019K1517L79j0245
$$ 420628 427065 453609 446854 444196 473206 514212 516162 521192 515046 506027 527544 527923 517678
9631E17678O432j3680J5038P078K3131J9069M2706J1305k0919n17J8135J4622
$$ 517678 524110 510430 525468 532546 555677 574746 617452 628757 607838 607321 625456 640078
9619F40078R60n010J8448N009L8736O6265L5838O713Q188j1585j036K8339N8052
$$ 640078 641038 636028 654476 659485 698221 764486 800324 807037 815225 803640 802604 830943 888995
9606H88995K3108L1288J6859l626J3181J9975K8122J4476P596K7659K2295L5530
$$ 888995 912103 943391 960250 956624 969805 989780 1017902 1032378 1039974 1067633 1089928 1125458
9594A125458L3076M5875R230K5036R81j0231K6784N2204K3474K3058K4071K4863
$$ 1125458 1158534 1204409 1213639 1238675 1239656 1229425 1256209 1308413 1331887 1354945 1379016 1403879
9582A403879M4593K5381M640J0341P93O112Q400K5216P950p524l054r733K0064
$$ 1403879 1448472 1473853 1478493 1488834 1489627 1495739 1504139 1529355 1537305 1529781 1526727 1516994 1537058
9569A537058K1179K5464Q861m208j5364n542J7298k8368L824L1753N411K2379
$$ 1537058 1558237 1583701 1592562 1588354 1572990 1567448 1584746 1556378 1560202 1591955 1597366 1619745
9557A619745M81J6221m0519o5987l3043Q59m4508o8322m4050r281r462k2675j4610
$$ 1619745 1620226 1636447 1595928 1529941 1496898 1497757 1453249 1384927 1340877 1331596 1322134 1299459 1284849
9544A284849P671j8809k0045k5599k8067j5229k4530j0889k1652k0192j0227K7399
$$ 1284849 1292520 1273711 1253666 1228067 1200000 1184771 1160241 1149352 1127700 1107508 1097281 1124680
9532A124680O851j7288K305L2087J7339J3167J7370J9083J3276K0479L195k9003
$$ 1124680 1131531 1114243 1116548 1148635 1165974 1179141 1196511 1215594 1228870 1249349 1252544 1223541
9520A223541j6676m620O148q623j9086p660l9886n6625l8726j7416m6660m2111
$$ 1223541 1206865 1202245 1208393 1199770 1180684 1173024 1133138 1076513 1037787 1020371 973711 931600
9508I31600l6116m0423r636Q499L359q983j6811J61P595K26J5599j6877L61K8400
$$ 931600 895484 855061 845425 853924 857283 848300 831489 831650 839245 839471 855070 838193 838554 866954
9494H66954M4329n1P401L6277J9743J9340L9855L0293L0594J4678m168P013q284
$$ 866954 911283 911232 918633 954910 974653 993993 1033848 1064141 1094735 1109413 1105245 1112258 1103974
9481A103974p030r56m8921n9662k0781j1859m6501l0824m5940l5448k3775j8161
$$ 1103974 1096944 1095988 1047067 987405 966624 954765 908264 877440 831500 796052 772277 754116
9469G54116L712j462k7948m031o890k4601m2081J0557N53J7385J7507L5977k0935
$$ 754116 757828 756366 728418 724387 717497 692896 650815 661372 661925 679310 696817 732794 711859
9456G11859k5823J8985L8138J1687J3220J2343R181J2737l434K1158l1166m124
$$ 711859 686036 705021 743159 754846 768066 780409 789590 802327 798893 820051 788885 784761
9444G84761q378j2229n538m4503l2664r066j8507l3378o263l0390k4563k5462
$$ 784761 776383 764154 758616 714113 681449 672383 653876 620498 614235 583845 559282 533820
9432E33820k4344j3328j3043k2209l2518J201J8887j6556j3408j3395K3724o321
$$ 533820 509476 496148 483105 460896 428378 429579 448466 431910 418502 405107 428831 422510
9420D22510J9731M091J5166o993K8251k499k871k3811J6581L099q107j1781k5828
$$ 422510 442241 446332 461498 454505 482756 480257 477386 453575 470156 473255 465148 453367 427539
9407D27539k7748k3538k4326j3442j0473l0031K3604K9050k2080k2838m669J6757
$$ 427539 399791 376253 351927 338485 328012 297981 321585 350635 328555 305717 301048 317805
9395C17805M959j4682k0101j2901j1272J7260K3095J1006P87k756n567P237J2978
$$ 317805 322764 308082 287981 275080 263808 281068 304163 315169 315956 313200 307633 314870 327848
9382C27848k1125l0947n805L5544J7663j9243k087J4383K7894N929k4717l1442
$$ 327848 306723 275776 269971 305515 323178 303935 301848 316231 344125 350054 325337 293895
9370B93895M00M33J9894j094j7696j2362p887m227J9116K8388K8545J8544p486
$$ 293895 294295 294728 314622 313528 295832 283470 275583 271356 290472 318860 347405 365949 358463
9357C58463N608q453j3414R431J7024J1207m366K823l96j2210J8402K5261j1796
$$ 358463 364071 355618 342204 351635 368659 379866 375500 378323 377927 365717 384119 409380 397584
9344C97584L170K4032m41k1250k0188J5903J3409L3251j185M656m446l1732L3696
$$ 397584 400754 424786 424345 403095 382907 398810 412219 445470 444285 448941 444495 412763 446459
9331D46459K0396p653O778Q936j3666M293P423K1765J6664j497l524k6713j7428
$$ 446459 466855 459202 465980 474916 461250 465543 472966 494731 511395 509898 506374 479661 462233
9318D62233K3671J0387J5615J3069k2102K926R396j3455r927R506J6860j333Q615
$$ 462233 485904 496291 511906 524975 502873 505799 515195 501740 491813 501319 518179 516846 525461
9305E25461J722K3301J3589o0788k7140r760K0438M4356k0741N657L9033K3775
$$ 525461 527183 550484 564073 503285 476145 466385 486823 531179 510438 516095 555128 578903
9293E78903l506J5741P1969J4070k7818K641L8721J3342J6018K0278j2238m1566
$$ 578903 575397 591138 663107 677177 649359 652000 690721 704063 720081 740359 728121 686555
9281F86555l2115k4508k262M614k9844J817p995J3837K5650j1679j5112L306j0590
$$ 686555 654440 629932 627670 632284 602440 604257 596262 610099 635749 624070 608958 612264 601674
9268F01674k682J5508J0652k1451m334j5831K1961M1019J7730j1878J2608K9608
$$ 601674 598992 614500 625152 603701 599367 583536 605497 646516 664246 652368 664976 694584
9256F94584K3087J1956O145q619M4165L7528j986k7424K74k3101k0234n028j174
$$ 694584 717671 729627 735772 727153 771318 808846 806860 779436 779710 756609 736375 731347 730173
9243G30173r964j3158j0569k7157j0677k7274J675j8570j0445O678L2698L0132
$$ 730173 720209 707051 696482 669325 658648 631374 633049 614479 604034 610712 643410 673542
9231F73542M0852l171j3408l290J4234J537j5420J4365K4567j1734J8324J7391
$$ 673542 714394 711223 697815 694525 708759 710296 694876 709241 733808 722074 740398 757789
9219G57789K7331K9738J7702j0728j889Q233L2640O901j0982J1017k8560R620
$$ 757789 785120 814858 832560 821832 819943 828176 860816 867717 856735 867752 839192 848812
9207H48812J6537J4504k3230M781N920M8319J4950K3917J6314L7255K3560K549
$$ 848812 865349 879853 856623 861404 867324 915643 930593 954510 970824 1008079 1031639 1034188
9195A034188M3382L7830j068N9072M7231P7536O7252O0184M1160L5522P6737J15589
$$ 1034188 1077570 1115400 1114332 1173404 1220635 1298171 1365423 1425607 1466767 1502289 1579026 1694615
9183A694615J25822J39866J49572J63798K04556K45084K78671L23847M14283M65258
$$ 1694615 1820437 1960303 2109875 2273673 2478229 2723313 3001984 3325831 3740114 4205372
9173D205372N54216O99060Q73975J012690J119258J240969J364866J565260J759970
$$ 4205372 4759588 5458648 6332623 7345313 8464571 9705540 11070406 12635666 14395636
9164A4395636J921137J992047K050069K097995J968306J588117R32260J37987
$$ 14395636 16316773 18308820 20358889 22456884 24425190 26013307 26945567 27083554
9156B7083554o34442j183132j387349j412379j310186j106423r00095o62690m29158
$$ 27083554 26449112 25265980 23878631 22466252 21156066 20049643 19149548 18486858 18057700
9147A8057700j37167J70886M53287P40228J027057J268051J445117J600238J824716
$$ 18057700 17920533 18091419 18544706 19284934 20311991 21580042 23025159 24625397 26450113
9138B6450113K076654K356173K714484L119048L507613L793136L902983L890381
$$ 26450113 28526767 30882940 33597424 36716472 40224085 44017221 47920204 51810585
9130E1810585L750618L462057L051058K651410K362851K131085J902682J717719
$$ 51810585 55561203 59023260 62074318 64725728 67088579 69219664 71122346 72840065
9122G2840065J443479J131946O65430K4626o43754j240616j601231j753865j762885
$$ 72840065 74283544 75415490 76080920 76105546 75461792 74221176 72619945 70866080 69103195
9113F9103195j734688j673097j484017j167999p52565k79402K28306P48556J143051
$$ 69103195 67368507 65695410 64211393 63043394 62290829 62011427 62239733 62988289 64131340
9104F4131340J484125J767874K062431K348084K721627L108683L464777L829806
$$ 64131340 65615465 67383339 69445770 71793854 74515481 77624164 81088941 84918747
9096H4918747M220401M539766M771739M821939M814897M765723M653929M397009
$$ 84918747 89139148 93678914 98450653 103272592 108087489 112853212 117507141 121904150
9088A21904150L757333K554744Q79896r47604k531388l676996m380229m812688
$$ 121904150 125661483 128216227 129096123 128148519 125617131 121940135 117559906 112747218
9080A12747218m970879m876266m581574m171557l688009l157844k659467k196263
$$ 112747218 107776339 102900073 98318499 94146942 90458933 87301089 84641622 82445359
9072H2445359j755049j349400r41449n71465j59955L00580P60859J230086J698902
$$ 82445359 80690310 79340910 78399461 77827996 77668041 77968621 78729480 79959566 81658468
9063H1658468K171498K591132K893512L078156L153985L071454K884501K483239
$$ 81658468 83829966 86421098 89314610 92392766 95546751 98618205 101502706 103985945
9055A03985945J970131J282005L84095o34920j714440k662151l371420l928162
$$ 103985945 105956076 107238081 107622176 106987256 105272816 102610665 99239245 95311083
9047I5311083m249128m333678m259893m110886l875749l600727l338122l084338
$$ 95311083 91061955 86728277 82468384 78357498 74481749 70881022 67542900 64458562
9039F4458562k849471k604018k360376k119410j957827j738117j541086j278103
$$ 64458562 61609091 59005073 56644697 54525287 52567460 50829343 49288257 48010154
9031D8010154j027364p27152l83421l9772K93322N85373P43289P65566O86760
$$ 48010154 46982790 46255638 45872217 45832445 46125767 46711140 47454429 48219995 48906755
9022D8906755N88741M11359L0505o05074j354651j996799k336956k454787k362003
$$ 48906755 49495496 49906855 49937360 49332286 47977635 45980836 43643880 41189093 38827090
9013C8827090k130392j855160j627985j508511j535943j576087j605709j655969
$$ 38827090 36696698 34841538 33213553 31705042 30169099 28593012 26987303 25331334
9005B5331334j618728j584832j518088j400581j258543j148164j063296r72594
$$ 25331334 23712606 22127774 20609686 19209105 17950562 16802398 15739102 14766508
8997A4766508q99971q26686p42764o98990o48966n85982n44050m79311m23160
$$ 14766508 13866537 13039851 12297087 11598097 10949131 10363149 9819099 9339788 8916628
8988H916628l89332l78508l12414k49320k21938j89217j36929r9340r9377o5472
$$ 8916628 8527296 8148788 7836374 7587054 7365116 7175899 7038970 6939630 6840253 6774781
8978F774781j5511K5237L4236O9820J14318J28526J40847J27215J18112J41780
$$ 6774781 6759270 6784507 6818743 6888563 7002881 7131407 7272254 7399469 7517581 7659361
8968G659361J87480J87960K28209K51568K80819L00072L64415L95094M94010N72116
$$ 7659361 7846841 8034801 8263010 8514578 8795397 9095469 9459884 9854978 10348988 10921104
8958A0921104O12483O53241O82442P29955P83726P86137P57022P29608P19889
$$ 10921104 11533587 12186828 12869270 13599225 14382951 15169088 15926110 16655718 17375607
8949A7375607P40405O98162O82117O75964P26718Q10935Q55763R65984J078451
$$ 17375607 18116012 18814174 19496291 20172255 20898973 21709908 22565671 23531655 24610106
8940B4610106J116709J102594R58156P20888M57582J39126r4059k45190k86912
$$ 24610106 25726815 26829409 27787565 28508453 28966035 29105161 29011102 28765912 28479000
8931B8479000k08372l9989J38141K89656M96156O53136P28348P11381O04906M57900
$$ 28479000 28270628 28230639 28368780 28658436 29154592 29807728 30536076 31247457 31852363 32310263
8921C2310263L14412K22954J50696J66700K39229L60877M93071O56383Q61164
$$ 32310263 32624675 32847629 32998325 33165025 33404254 33765131 34258202 34914585 35775749
8912C5775749J060872J226344J418289J561026J647821J654606J560672J351931
$$ 35775749 36836621 38062965 39481254 41042280 42690101 44344707 45905379 47257310
8904D7257310J107802P85016M95588K39245P7980p4564k27499l63931m69585n55128
$$ 47257310 48365112 49150128 49645716 49884961 49962941 49888377 49660878 49296947 48827362 48272234
8894D8272234o10240o74085p82066r09457r78608j063652j068431j031218r09475
$$ 48272234 47661994 46987909 46205843 45296386 44317778 43254126 42185695 41154477 40245002
8885D0245002p40314n19386l02848r4261J76415M14077O74262R17859J164015
$$ 40245002 39504688 38985302 38682454 38588193 38764608 39178685 39852947 40770806 41934821
8876D1934821J376000J465222J455097J337941J125241P88482M37840J08095k31122
$$ 41934821 43310821 44776043 46231140 47569081 48694322 49482804 49920644 50028739 49797617
8867D9797617m50129o42234p86225q98130r60549r86963j028075j043220j072616
$$ 49797617 49347488 48705254 47919029 47020899 46060350 45073387 44045312 43002092 41929476
8858D1929476j080179j057630j025512r77758q67252p54097o60728n84702n99974
$$ 41929476 40849297 39791667 38766155 37788397 36921145 36167048 35506320 34921618 34321644
8849C4321644o51094p23364p72640q45152q82782p98372o87246n46629m28351
$$ 34321644 33670550 32947186 32174546 31329394 30446612 29648240 28960994 28414365 27986014
8840B7986014l28205k20522j48302j19912j57426j88308k28306l17186l66865
$$ 27986014 27657809 27437287 27288985 27169073 27011647 26823339 26595033 26277847 25910982
8831B5910982l61034l17131l06750k60623k05943k15054k52791l15939m36035
$$ 25910982 25549948 25232817 24926067 24665444 24459501 24244447 23991656 23675717 23239682
8822B3239682n58071p14687q80258j004211j070112j116477j072838j035980r49734
$$ 23239682 22681611 21966924 21086666 20082455 19012343 17895866 16823028 15787048 14837314
8813A4837314q36052p06263n83986n30483m69461l73721k36499j72219j32763
$$ 14837314 14001262 13294999 12711013 12180530 11711069 11337348 11100849 10928630 10795867
8804A0795867j01286q5721j46410j94284k61046l42956l34409k97772k56331k09563
$$ 10795867 10694581 10608860 10462450 10268166 10007120 9664164 9329755 9031983 8775652 8566089
8794H566089j54430j13158j23505j15358j47023k26709l02292l47885l85114l99057
$$ 8566089 8411659 8298501 8174996 8059638 7912615 7685906 7383614 7035729 6650615 6251558
8784F251558m35826l84723l35182l11419k73972k69547k41478k13957j85589j62003
$$ 6251558 5815732 5431009 5095827 4784408 4510436 4240889 3999411 3785454 3599865 3437862
8774C437862j70148j34245j24384j29587j26425j09910j09067j04272r0225p4386
$$ 3437862 3267714 3133469 3009085 2879498 2753073 2643163 2534096 2429824 2339599 2265213
8764B265213o2018r5906p4816l9779m3758n5743n1205l153j7397p4564n4130k2063
$$ 2265213 2203195 2107289 2032473 1992694 1948936 1893193 1841988 1838835 1821438 1746874 1692744 1670681
8752A670681l940o682q838p626k6802k9493n491k2635l1988l14k9555j7498l6754
$$ 1670681 1666741 1660059 1651221 1643595 1616793 1587300 1581809 1559174 1527186 1526872 1497317 1479819 1443065
8739A443065l8319l3511m4005k9011j0684q595j8186j7401r069r54k1934l618
$$ 1443065 1404746 1371235 1327230 1298219 1287535 1278940 1260754 1243353 1234284 1233330 1211396 1207778
8727A207778j0759J8772J9864m872M4020J6435k64k0953o546J8653J1057K2657
$$ 1207778 1197019 1215791 1235655 1230783 1274803 1291238 1290974 1270021 1263475 1282128 1293185 1315842
8715A315842L0993L8215Q511j2696J4074j2916j945P226j5084l3336j8756j3871
$$ 1315842 1346835 1385050 1393561 1380865 1394939 1382023 1380078 1387304 1372220 1338884 1320128 1306257
8703A306257k5947l2678m4624k3555j8740k5398l3955p737N336L364j8304K47
$$ 1306257 1280310 1247632 1203008 1179453 1160713 1135315 1101360 1093623 1098959 1102323 1084019 1084266
8691A084266J7889j7582j8702O708K9890K2002J693J404L1977K3989j976M019
$$ 1084266 1102155 1084573 1065871 1072579 1102469 1124471 1126164 1127568 1159545 1183534 1181558 1185577
8679A185577M2110K4863Q993P77j6898k8112k2680j6001q652k7146k4209j6020
$$ 1185577 1227687 1252550 1261543 1262320 1245422 1217310 1194630 1178629 1169977 1142831 1118622 1102602
8667A102602l1623l7157l8250m3619l600k2750k8041k1057l1866P983K28o691
$$ 1102602 1070979 1033822 995572 951953 948353 925603 897562 876505 844639 852622 852850 846159
8655H46159j6008j0380j6519j8985Q403L1406L3317P006J1462k082l3008r466
$$ 846159 830151 819771 803252 784267 792670 824076 857393 864399 875861 873779 840771 831305
8643H31305K518K3631L1918J3615J9563P506Q5253L8426k8557r5570q2884m7820
$$ 831305 833823 857454 889372 902987 922550 930056 1015309 1053735 1025178 929608 846724 798904
8631G98904l9227m4435m2940k0087k0877o117P279m43k8635m2458n911J6392j2109
$$ 798904 759677 715242 672302 652215 631338 625221 632500 632057 603422 560964 555053 571445 559336
8618E59336j7672l7316m1010P318J9956J8945J5918j4878p604r369m0277r554
$$ 559336 541664 504348 463338 470656 490612 509557 525475 510597 502993 493624 453347 443793
8606D43793k371J3795j0875o072M5036K2555m964j2605l5126K115L7117L9828
$$ 443793 441422 455217 444342 438270 483306 505861 500897 488292 453166 455281 492398 532226
8594E32226M7469R4966J44026O5847n1251r3914p6921n5789n1072m5691j7912
$$ 532226 579695 674661 818687 884534 833283 739369 662448 606659 555587 509896 491984
8583D91984q570o3276q225L6698n530j4603n826m2732o884J1309q390K31p751
$$ 491984 483414 420138 411913 448611 443081 428478 422652 379920 373036 384345 375955 376186 368435
8570C68435L195J6966P55j2477k4170j7546J2706j4310J1270K1923o27j5294j8721
$$ 368435 371630 388596 389351 376874 352704 335158 347864 333554 344824 366747 366120 350826 332105
8557C32105q567l521K3874J3376J9533O379K884K0389L4520O1930Q3014L2459
$$ 332105 323538 320017 343891 357267 376800 383179 386063 406452 440972 502902 585916 618375
8545F18375j2301n6177q0025k4279k1298m4183l075Q303J1883P536K969j0695
$$ 618375 606074 549897 469872 445593 424295 380112 377037 385340 397223 404759 407728 397033
8533C97033p8312k9892M762J6407J4641j863q657J7604J1453P060K007K2599L588
$$ 397033 318721 288829 293591 309998 324639 322776 314119 331723 343176 350236 352243 374842 378430
8520C78430j6435K683k895K6786K4947m03R746K739R579n39J4351p966o140l541
$$ 378430 361995 364678 361783 388569 413516 413113 422859 425598 435177 434638 448989 441023 434883 431342
8506D31342j1761J1862q07J9571K7228k421j4609j751n8098p713K3520j5859O387
$$ 431342 419581 431443 430636 450207 477435 475014 460405 458654 400556 392843 416363 400504 406891
8493D06891P6k4637l1717K98P666l669J2094J6400L764j6255K497k2769J3980
$$ 406891 406967 382330 350613 350911 358577 354908 367002 383402 387166 370911 373408 350639 364619
8480C64619K7957Q49k159K2096K5054L6288J9758P280K3862J8311J0984k0089
$$ 364619 392576 393425 391266 413362 438416 474704 494462 501742 525604 543915 554899 534810
8468E34810l5652l4632l4148p810J6167J6255j0494k1372l447l705l300k316j8801
$$ 534810 499158 464526 430378 422568 438735 454990 444496 423124 419677 415972 412672 410356 391555
8455C91555l3863r085M990j7844O106o575k2693K9895L4455J2587l466l7581K3926
$$ 391555 357692 348607 353597 335753 341859 335284 312591 342486 376941 389528 386062 348481 372407
8442C72407p690k4229p943N333k408N804N386R087M104q574j3283J2872M1943
$$ 372407 364717 340488 332545 337878 335470 341274 346660 355747 359851 351277 337994 350866 392809
8429C92809q987l1744P87K3393J1100p420L749m267j7803j4719p241m5512q080
$$ 392809 383822 352078 352865 376258 387358 379938 383687 379420 361617 346898 339657 294145 286065
8416B86065K4324k8756j6997K627l595J0990K776m6482m6281K54J4370M0087k1168
$$ 286065 310389 281633 264636 267263 263668 274658 277434 230952 184671 184925 199295 239382 218214
8403B18214q477L0530n72k0202l6220p731N539R584j1204J7524L2204N302l342
$$ 218214 209737 240267 239695 219493 183273 175542 181081 190665 179461 196985 229189 234491 231149
8390B31149L5962K829j076O396k236O630L651j9493J187j2706k6998o720j3228
$$ 231149 267111 269940 268864 275260 273024 279654 283305 263812 264999 252293 225295 218575 205347
8377B05347K744m73j1927j407R156O505j4390k5812k8690K6656K2064j0843l187
$$ 205347 208091 207618 195691 194284 203440 209945 195555 169743 141053 167709 189773 178930 175743
8364A75743j6885q510Q718j4162j01k081N597J7901j2770o926k999k1069j126
$$ 175743 158858 150348 159066 144904 144803 142722 148319 166220 153450 146524 143525 122456 121330
8351A21330O154J6384N892J3880J37l2501k577k2395J1074L6491l998N671j7261
$$ 121330 127484 143868 149760 163640 163777 131276 128699 106304 117378 153869 149871 155542 138281
8338A38281j6222l124L3224N659Q630j1531k2134K868j0900n059r443J140j6856
$$ 138281 122059 118935 152159 157818 166448 154917 132783 135651 124751 119692 110249 111389 94533
8325I4533j9148J9623K4324J5701O396j1858j6026J8022j93l455Q105l694k1430
$$ 94533 75385 95008 119332 135033 141429 129571 113545 131567 131374 127919 136024 132330 110900
8312A10900j8364N08J5966j2910J0373J5608k9832m196q132K0568O198l09j6100
$$ 110900 92536 93044 109010 96100 106473 122081 92249 88053 79921 100489 106687 106378 90278
8299I0278p031j7439r467K8721J1388J4396O203O973J1882o523k3390k5123j5670
$$ 90278 83247 65808 56341 85062 96450 110846 117049 124022 135904 129381 105991 80868 65198
8286F5198J5827J1704P701P271J0283r56p341l4266J2355K8831M611n87O26M407
$$ 65198 81025 92729 100430 107701 117984 117028 109687 75421 87776 116607 121218 120631 121257 125664
8272A25664k053j798p885l22J3914k6985n762k695j6077K2808J9481r318N867
$$ 125664 123611 121813 113928 113606 127520 100535 94773 92078 76001 98809 118290 108972 114839
8259A14839j7119k1782K476L717J8718Q589Q194L492L819j9981k0158Q013K503
$$ 114839 97720 75938 78414 82131 100849 109438 117632 121124 124943 104962 84804 92817 95320
8246I5320Q81Q657m29O421N554m089k143J029j70j3473k742j6728o300k2379O243
$$ 95320 96201 104858 104429 110850 116404 112315 110172 111201 111031 97558 94816 78088 71788 49409 55652
8231E5652L5545J9568k48j7257j2312R021Q313k9537j1372R745N750J624j4497
$$ 55652 91197 110765 110517 93260 80948 89969 98282 68745 57373 67118 72868 74492 59995
8218E9995J2215K2451o296k0213r041J2659R752M873l1081k3940Q900J5843M850
$$ 59995 72210 94661 88365 68152 59111 71770 81522 86395 55314 31374 40274 56117 60967
8205F0967J8650Q922j9145K203j9919J048L3666J0378k462j727L728m582j0427
$$ 60967 79617 88539 69394 71597 51678 52726 86392 96770 94308 92581 96309 91727 81300
8192H1300j0336p305L6321p78j4604j508r409J8183k653j8422L628P938R936L2888
$$ 81300 70964 63659 99980 99202 84598 83090 73681 91864 89211 70789 74417 82355 92291 125179
8178A25179k248j0988N618L070j56j5650R307J8288p768j124J0593j8824j0402
$$ 125179 122931 111943 117561 120631 120475 104825 114132 132420 124652 123528 134121 115297 104895
8165A04895o856k4994L480p378j8690J0144m710J8516K7728J1301r985p289j5948
$$ 104895 98039 73045 76525 69147 50457 60601 55891 74407 102135 113436 103451 96162 80214
8152H0214J8612J9697q69K472k951p33J7798j3342l9816r836j2632o051R445K281
$$ 80214 98826 118523 117654 120126 117175 116442 134240 120898 81082 71246 58614 52563 62008 64289
8138F4289J1410N466j3019p790J7522J4290k8818k480K4057J9346K6196o87j1843
$$ 64289 75699 81165 68146 60356 77878 92168 63350 60870 84927 104273 130469 129782 117939
8125A17939o735K2714k8046j9489M533p14K7126r048k6635l1684N432K2316J4401
$$ 117939 111204 133918 105872 86383 90916 90202 117328 108280 81645 49961 55393 77709 92110
8112I2110j2798M217O956r674O036N406J0956j3433M876P793j3951O347k043J936
$$ 92110 79312 83529 90485 80811 86847 92253 103209 89776 94652 102445 88494 94841 92798 94734
8098I4734L8235J1047j8200n647K7153p427l3625l2158J9097K1792J8239P092
$$ 94734 132969 144016 125816 120169 147322 139895 106270 74112 93209 115001 133240 140332
8086A40332j6107Q84k995j9919j1618j240L9172R678k5447j4364N73j1021l3484
$$ 140332 124225 125109 122114 102195 90577 89337 128509 138187 112740 98376 98949 87928 54444
8073E4444k3323J8178P302K479K2848Q289n0908r590K5817q106J4993J0263K390
$$ 54444 31121 49299 56601 59080 81928 90217 39309 29719 55536 47430 62423 72686 75076
8060G5076k145J5460J8067K7520K610R923K4763l481K14k9523m5682l4931N778
$$ 75076 72931 88391 106458 133978 136588 146511 171274 167793 168007 138484 92802 57871 63649
8047F3649j2548K6278K1143L3660K8781k333j1470j3244q274o791o256K635k62
$$ 63649 51101 77379 98522 132182 160963 158630 147160 133916 125642 118851 112595 115230 114968
8034A14968n815j3826J4016j4655K233N105J1565J9420j0586j1006M402k1709
$$ 114968 109153 95327 109343 94688 96921 102026 113591 133011 122425 111419 115821 94112
8022I4112O199Q46l799O125q654o892K3594P587J8236J2492m406l7515j7653J8767
$$ 94112 100311 101157 97358 103483 94829 87937 111531 119118 137354 149846 145440 107925 90272 109039
8008A09039J410L18L720m929j4810L5674j3807p929J0283m252q780Q101L9J1449
$$ 109039 110449 110767 114487 109558 94748 130422 116615 108686 118969 114717 105937 114038 114077 125526
7994A25526K544o928l3339Q984o95Q746K9263L658L098j3368k6053k1000k5274
$$ 125526 128070 121142 87803 96787 96092 104838 134101 137759 140857 127489 101436 80436 55162
7981E5162K6211J1839K839R579N014l055m3946k4433J9842r517J4775j1223j4743
$$ 55162 81373 93212 96051 105630 110644 107589 63643 39210 59052 49535 64310 53087 38344
7968C8344P344n820J3906K3391N330l644L5708m232j8957j9083p105k1086P618
$$ 38344 45688 39868 53774 77165 82495 78851 114559 110327 91370 72287 65182 44096 51714
7955E1714R503K5733M430j2599k0975r805J3315L1498J4060J9382n280j6824l541
$$ 51714 61217 86950 91380 78781 57806 48001 61316 92814 106874 126256 120976 104152 100611
7942A00611j8219k407J3969K2630j7036k0146m01m337n624j4084J272J5599K415
$$ 100611 82392 79985 93954 116584 99548 79402 79001 74664 69040 54956 56228 71827 74242
7929G4242j5906j0294M422K2194K953j4287n469j530K276O661k124k0212O066
$$ 74242 58336 48042 52464 74658 77611 63324 57855 56325 58601 65262 63138 42926 48992
7916D8992o200J8907K9138J2343j8246j9384J4137j910J2961J1994J902L228J2932
$$ 48992 42792 61699 90837 103180 84934 65550 79687 77777 90738 102732 104634 107862 120794
7903A20794p611k7411j1951n629J5806N119k6099k771j8882N858j8785K171K1815
$$ 120794 113183 85772 73821 68192 83998 89117 63018 60247 41365 47223 28438 30609 52424
7890E2424J3949K1451m480k4780J457R634K235n304R217k2249Q383K5248R897
$$ 52424 66373 87824 83344 58564 60021 69655 71890 66586 75803 53554 61937 87185 97082
7877I7082l0184m9520J3892L1171L347R38k4612R151o334j5391q454J2101q316
$$ 97082 66898 17378 31270 62441 65788 66726 42114 51265 44931 29540 21086 33187 24871
7864B4871K7625L6018j723j1600n723j7522k2181J0898J09K3044K6695l8327j4178
$$ 24871 52496 88514 86791 75191 69468 51946 29765 40663 40772 63816 90511 52184 38006
7851C8006M414O868J0975m936k6513J393K0105Q071J0524J1842M485p220o334
$$ 38006 42420 49288 60263 55327 28814 30207 50312 58383 68907 80749 85234 78014 71680
7838G1680j9656j683k037N752j6908L746J133j0113q721J0223J5026K1716m727
$$ 71680 52024 50341 48304 54056 37148 40894 42027 31914 23193 33416 48442 70158 65431
7825F5431N365L2911p995j5546J517K1934Q71k87j7873r343K0k3710k729j8927
$$ 65431 70796 103707 95712 80166 81683 103617 104488 104201 86328 76985 77005 53295 50566 31639
7811C1639p871j9099J6363J4392j4412J4905N144j3589k7110J2477j851l406K6585
$$ 31639 23768 4669 21032 35424 21012 35917 41061 27472 362 12839 10988 7582 34167
7798C4167K879m854l153j6399j6685K4301R143L756j201j8225J8121R181n81r743
$$ 34167 37046 32192 29039 12640 -4045 20256 29399 33155 31954 13729 31850 41031 40450 30707
7784C0707j4750k258L4048j5445k8426M872l919K8458k865n218o465k2076j3811
$$ 30707 15957 13699 47747 32302 3876 8748 4829 33287 30422 25204 18739 -3337 -17148
7771a7148K6303K2525j4418K9587j4798m831J3193j9262M312J6890J1307j594
$$ -17148 9155 31680 17262 46849 32051 27220 40413 21151 25463 42353 53660 52066
7759E2066k1348j8902J8255L499m485p389J0373M220K633j0244j7046K9839J6380
$$ 52066 30718 11816 30071 33570 29085 21696 32069 36289 38922 28678 11632 41471 57851
7746E7851k8466j6975P477J4374p907o74K2105J6472J5547j6781k6863p929K2478
$$ 57851 29385 12410 19887 34261 26354 25680 47785 64257 79804 63023 36160 28231 50709
7733E0709J7092r94M925r219k9422N028L2486J0983j2942j2282Q440j6645k5084
$$ 50709 67801 66807 71732 62513 33091 38119 70605 81588 68646 56364 64804 48159 23075
7720B3075j43q465R00j0264O257K9437J865l1006j1063m453K3908J5291L3451
$$ 23075 22932 14467 15367 5103 11360 40797 42662 11656 593 -3860 20048 35339 68790
7707F8790J0417N910r525p939M3l953l4493l973O348O390k5393j0224M417k630
$$ 68790 79207 85117 75592 67653 67696 63743 29250 25277 31625 38015 12622 2398 6815 4185
7693D185N064J7347J3254J298O848J3181j3921j7777k2257N787J2243P772J2438
$$ 4185 9249 26596 39850 41148 47996 61177 47256 29479 7222 13009 25252 33024 45462
7680D5462p501k2815k982J4229r013k0395K8033J6351p912L745K2673k6k7433
$$ 45462 37961 15146 12164 26393 17380 -3015 25018 41369 33457 37202 59875 59849 32416
7667C2416O348Q712R162j416Q668j8531l1525J4882K3142j7796j7707j2340n153
$$ 32416 38764 47476 56638 55222 63890 45359 13834 28716 51858 34062 16355 4015 -1138
7654a138J1013O738J3972J5305r830O580J5733J0188k0367k8318Q60K2303J5482
$$ -1138 9875 16613 30585 45890 36060 42640 58373 68561 48194 19876 20736 43039 58521
7641E8521M138J0392l209l4653p963J7002j0321J250N137O001K8994k6477k7998
$$ 58521 62659 73051 69842 35189 27226 44228 33907 35157 40294 46295 75289 48812 20814
7628B0814R058K2770K684l8078k4923l972k328J9284K3894j4776J5964P39P601
$$ 20814 29872 52642 55326 17248 -7675 -11647 -13975 5309 29203 14427 30391 31130 38731
7615C8731J573M984L418l742N547J4798j6955k1010r936n661m851K3268M467J1612
$$ 38731 40304 45288 48706 44964 50511 65309 48354 27344 17408 11747 6896 30164 34631 46243
7601D6243M490M68n592r065r212L214N071j4861N403j3093j7029p928l6485K936
$$ 46243 50733 51201 45609 36544 27332 30546 35617 20756 26159 13066 -3963 -11891 -48376 -45440
7587d5440N3691J7807p617K2299o638J1238l667N595k2879n299j5960j3704J8830
$$ -45440 8251 26058 18441 40740 34102 45340 41673 47268 24389 19090 3130 -10574 8256
7574H256M1659j444m354r576l4141k6141O105O935J4019O438P048K9864q420j9711
$$ 8256 49915 48471 44117 34541 400 -25741 -19636 -12701 1318 7756 14804 44668 36248 16537
7560A6537p649l026J5043J1908Q405N606k3492j6177J3866K7789j8230j3734N302
$$ 16537 8888 5862 20905 32813 41218 46824 23332 7155 21021 48810 30580 16846 22148
7547B2148K902K1994l2200o221K0806R449l1355j6254J4733J4850r740M278j5972
$$ 22148 25050 47044 14844 8623 29429 38878 7523 -8731 6002 20852 11112 15390 -582
7534e82J3289P400K044l6678l739R14K5993K621q946n952j0140k695P945o030
$$ -582 12707 20107 22151 -14527 -18266 -17352 8641 11262 2316 -3636 -13776 -16471 -8526 -14556
7520a4556m630K529j0634q422N493L45L0555L3039N870J6238M940j0961l7260
$$ -14556 -19186 -16657 -27291 -35713 -30220 -29875 680 33719 39589 55827 60767 49806 12546
7507A2546j923K4488L2218N179l4879l1235K07j720o384L2605K0485j8819J4282
$$ 12546 10623 35111 67329 72508 37629 6394 6601 4881 -1503 31102 51587 32768 47050
7494D7050J2172q385J94J9955j0557k3785L396J027L914j6210P81J5747K2194
$$ 47050 59222 50837 51031 70986 60429 36644 40040 41067 44981 28771 29552 45299 67493
7481F7493j9295l4144j6352j247K3350K46j4671J7114J0905J5452J3545J57O154
$$ 67493 48198 14054 -2298 -3545 19805 20051 5380 22494 33399 48851 62396 62553 68707
7468F8707k4451k1390L592M415j516J022q117p637Q991k6094k4286Q384J7448
$$ 68707 44256 22866 26458 30873 29357 30379 22262 14625 23616 -2478 -26764 -18380 -932
7455i32J0199j3191J5832n47q747n144J0821K872J5439P910j7349r036O800K6213
$$ -932 9267 -3924 11908 11361 2614 -2530 8291 11163 26602 34512 17163 8127 14927 41140
7441D1140r774K3777j242m0484m0747q115J9480J9987K1502L289o003J390K556
$$ 41140 31366 55143 53901 13417 -27330 -35445 -15965 4022 25524 28813 22810 24200 26756
7428B6756K1156j90j9651j3681j6718K6541R131j3692j9039J416L4459k60R343
$$ 26756 47912 47722 28071 14390 -2328 24213 33344 19652 613 2029 36488 36228 45571
7415D5571p624m503j7492p942o841m170J5653M876j4058N863l060J6910J2036
$$ 45571 37947 33444 15952 8010 1169 -3001 12652 17528 3470 9333 6273 23183 35219
7402C5219j1135J8370P233j8998n985n066J3543n571J6929J3782J2491J8903k0266
$$ 35219 24084 42454 49687 30689 24704 19638 33181 27610 44539 58321 70812 89715 69449
7389F9449K704j4830m8680k6860O856p116K9238K7518k7126j1036N147Q467j3924
$$ 69449 72153 57323 8643 -18217 -11361 -18477 10761 38279 11153 117 5264 13731 -193
7376a93J8737N290o754K4228J8972P973k7206o27l488j6343L46j66k8701O171
$$ -193 18544 23834 17080 41308 60280 68253 41047 40420 36932 20589 20935 20769 -7932 -1761
7362a761K3144j5073K624j116p406M951L402J6590N3295O184r807j9164j7958
$$ -1761 21383 6310 8934 7818 412 5363 8765 25355 78650 84834 75027 55863 37905
7349C7905L1l1134o890J6541M011n128J6160L4003j569j4672Q496J2539j8772
$$ 37905 37936 6802 -88 16453 20464 15336 31496 65499 63930 49258 57754 70293 51521
7336E1521p353l3171k868O385L300J8075Q390J3497o811o598q190j5717J4973
$$ 51521 44168 10997 8129 14514 17814 35889 44279 57776 50965 44367 36177 20460 35433
7323C5433J8603j0153J9436K3790p540j2521o191j7530m9483K40J1690M235R808
$$ 35433 54036 43883 63319 87109 79569 67048 60857 43327 -6156 -5916 5774 10009 19817
7310A9817Q967k0227k2696q812n34O587Q952K816K4691j4601Q104K0515K3604
$$ 19817 28784 8557 -14139 -22951 -23485 -16898 -7946 -5130 19561 4960 13064 33579 57183
7297E7183J3420l2654j1536k045N06l671l298R781k6251J4329J3589n945K101
$$ 57183 70603 37949 26413 24368 24874 21203 17905 27686 1435 15764 29353 23408 25509
7284B5509K6840L360j0913j1383P597j125J3892L2538Q608q377m1218k9412M1485
$$ 25509 52349 55709 44796 33413 41010 39885 53777 86315 94923 86546 45328 15916 57401
7271E7401J2210k7856k0777p654j2951L706j201r651j4274K6388J8754O713M460
$$ 57401 69611 41755 20978 13324 373 4079 2878 -6773 -21047 5341 24095 30808 35268
7258C5268J3117J4462j6334p069q95r458r605J7020O923k8200Q532j4057l8454
$$ 35268 48385 62847 46513 39444 38549 29091 19486 36506 43429 15229 23761 9704 -28750
7245b8750J6965M3775O789K9357J555j2188P13K627j0399k911P629k448J3946
$$ -28750 -11785 31990 38779 68136 69691 57503 58216 60843 50444 47533 55162 52714 66660
7232F6660K008k6483l459j4695o101Q443N513J3281P201n968k5303N63n195k8183
$$ 66660 68668 42185 38726 24031 17930 26373 31886 45167 52368 46400 21097 21660 16465 -11718
7218a1718J5304Q652Q600j1281J197k5738j1196J7085j934R200M445o086K185
$$ -11718 3586 12238 20838 9557 10754 -14984 -26180 -9095 -11029 -1829 2616 -3470 -1285
7205a285K6043L166n147K35k685j3325J6471r711k9388J3637L1334j7504K83J1879
$$ -1285 24758 27924 22777 23012 20327 7002 23473 13762 -15626 -1989 29345 11841 12124 24003
7191B4003Q625q074k7124l2242j6836j68K2870L346J6906Q610J8582J4103p986
$$ 24003 32628 24554 -2570 -34812 -51648 -51816 -28946 -25600 -8694 -84 18498 32601 24615
7178B4615J403J4698J886N130N919l608j2761n653j2238j9881j1305m0156m02
$$ 24615 26018 40716 42602 47732 53651 50043 37282 31629 19391 -490 -11795 -51951 -52353
7165e2353M3360L5239K7247k1255n0359j5485J4001J8244J6629J1033L248K708
$$ -52353 -8993 26246 53493 32238 -18121 -33606 -19605 -1361 15268 26301 29549 32257
7153C2257j4420J9497K1455r035q295j5676j6043j697J8282j9501k8023Q401O091
$$ 32257 17837 37334 58789 49754 41459 25783 9740 8043 26325 6824 -21199 -12798 -6707
7140f707r156j180J3997K0184P692J297M151q804L30L518r490j7624q721j76m940
$$ -6707 -15863 -17043 -3046 17138 24830 26127 30278 21474 21804 25322 15832 -1792 -10513 -10689 -15629
7125a5629R60L0427M0887k9365k4664O429J7462k147j6495J0678l723K886j8681
$$ -15629 -14669 15758 56645 27280 2616 9045 26507 24360 7865 18543 14820 17706 -975
7112i75j9178L331k4049J3566Q226J1175j1135O548J6466J4426Q454k264j8346
$$ -975 -20153 -16822 -40871 -27305 -19079 -7904 -19039 -12491 3975 18401 26855 24591 6245
7099F245k1705K2181K0291j2676l7419j9474K7286K9355M305m542O563j0180k1320
$$ 6245 -15460 6721 27012 14336 -23083 -42557 -15271 14084 18389 13847 20410 10230 -11090
7086a1090J3937J9778O330R839j7480j597K1430j047j0927k9971j5685L2259J8978
$$ -11090 2847 22625 28955 38794 21314 19717 41147 40100 29173 -798 -16483 15776 34754
7073C4754j6238j4653J0217l037k0117k207q85M1683J7805j4319m3852l9445L6839
$$ 34754 18516 3863 14080 11043 -9074 -11281 -12166 29517 47322 33003 -10849 -50294 -13455
7060a3455M5085J8343m6980p21j4648k3238J6235K7997N61j791P618j1923j4275
$$ -13455 31630 49973 2993 2272 -12376 -35614 -19379 8618 9179 7388 15006 3083 -11192
7047a1192K6866Q910M966l0443k5844Q70J8143K0329N300r455j6881k673k4545
$$ -11192 15674 24584 29550 -893 -26737 -25867 -7724 12605 17905 8450 -8431 -11104 -35649
7034c5649r552K971K1773J3439J338K1571J5466J4669P826P553L617Q362j157
$$ -35649 -45201 -42230 -20457 -7018 -5680 15891 31357 46026 53852 61405 65022 73384 72227
7021G2227k8049n390K143M930K583q725Q19J3901k9103l160M6566P335l0073l6865
$$ 72227 44178 38788 40931 45861 48444 39719 40538 54439 25336 22176 68742 76077 46004 9139
7007I139l7876j5661O4870K1474m91l141k0845K7658M969j0515q106l2873l8634
$$ 9139 -28737 -44398 20472 41946 41455 38314 17469 45127 50096 39581 31475 -1398 -40032
6994d0032j0511L4833N143j1711K2977J5351k5056j8497J1075R047P981L010k2374
$$ -40032 -50543 -15710 -10567 -22278 699 16050 -9006 -27503 -16428 -7381 600 3610 -18764
6981a8764n651m414J9138L2282N743l7372%J7311k1067K786j9579J5721R251n279
$$ -18764 -24415 -28829 -9691 22591 28334 -9038 -9038 8273 -12794 -10008 -29587 -13866 -4615 -9894
6967i894l0064j2834j4433j2826J5701K3958L3011j329J384J571k1707q112O073
$$ -9894 -39958 -52792 -67225 -80051 -64350 -40392 -7381 -8710 -7326 -5755 -27462 -35574 -29501
6954b9501O045q596L2658K0617k4064p366j2836m563L939K0322j1528j5222Q967
$$ -29501 -23456 -32052 606 21223 -2841 -10207 -23043 -27606 -23667 -3345 -14873 -30095 -21128
6941b1128j3132J7476O826J7549K172m85p941N860j0937R002J5441J321q025J1716
$$ -21128 -34260 -16784 -9958 7591 9763 9278 1337 7197 -3740 5262 20703 22024 13999 25715
6927B5715j6986j3672J6365k5745l0749O700L4400J7929j413k2671L466J5688
$$ 25715 8729 -4943 11422 -14323 -45072 -38372 -3972 13957 12544 -10127 -6661 9027
6915I027j4219l0279j5790R321Q068J5389o56J3077J4048M737J7100Q476J307
$$ 9027 -5192 -35471 -51261 -41940 -33872 -18483 -19139 -6062 7986 12723 29823 38299 39606
6902C9606k0774j0290k492l7671J0091K3830N679k755M778J0077J2915j0780k1796
$$ 39606 18832 8542 6050 -31621 -21530 2300 7979 5224 10002 20079 32994 22214 418
6889D18o892j0389R290q473p232K2255J380K6701L925k4040j1625K4036J1637
$$ 418 -6474 -16863 -7573 -16046 -23278 -1023 357 27058 30983 6943 -4682 19354 30991
6876C0991J976M729j1458k1253k6450p247o31K205K1985K5818K79k3238j1157
$$ 30991 32967 37696 26238 4985 -21465 -28712 -29343 -27138 -5153 20665 20944 -2294 -13451
6863a3451J0487J7004k3798j5925Q201J9441L34p986p933J1165j721l925M756
$$ -13451 -2964 14040 -9758 -25683 -17482 1959 2293 -5693 -13626 -2461 -4182 -8107 -3351
6850c351J944p489r193J9633O958K2054J9776J6879q845l4652j1309k5982k169
$$ -3351 -1407 -8896 -18089 1544 8502 30556 50332 67211 58366 23714 12405 -13577 -15746
6837a5746M636J5365J4971J2853k7381N342k280N965Q17N045k2260j1875J9364
$$ -15746 -11110 4255 19226 32079 4698 10040 7760 13725 14542 19587 -2673 -14548 4816
6824D816j764k887K0401l51j1049O877J7713j999j8654l863k944q187K2957K1453
$$ 4816 3052 165 20566 20215 9166 16043 33756 31757 13103 9240 6296 -1891 21066 42519
6810D2519Q399L8833l530j9324j5499q316k577k4054p409R233L1606Q333j418
$$ 42519 50918 89751 86221 66897 51398 43082 40505 16451 9042 18275 49881 58214 56796
6797E6796n2100J805J114L65p36p303R544q762K02k037m0550L061K1914N029r459
$$ 56796 4696 6501 7615 7980 7244 -59 9485 723 925 -1112 -41662 -38601 -16687 -11658 -21117
6782b1117k3829M7978M3848j7612j0211l4763j8140N833R036k70K4454P00l066
$$ -21117 -44946 3032 46880 29268 19057 -15706 -33846 -28013 -18977 -19247 5207 5907 2841
6769B841j7906L7901K4318m8179k7334N210K0530J8997N355K1252O556q31L153
$$ 2841 -15065 22836 47154 -1025 -28359 -23149 -2619 16378 21733 42985 49541 48710 51863
6756E1863J4317j1986l1063n533j2497l2750K5582J8456L0463j4578p999R822
$$ 51863 66180 54194 23131 17598 5101 -27649 -2067 16389 46852 32274 24275 34097
6744C4097J2136K886K2759L2920K2581l573K5380n081P885j044k5253j215o377
$$ 34097 46233 49119 71878 104798 127379 123806 149186 144105 151990 150946 125693 124478 118101
6731A18101k6745j3670J8391k845j0819K941L0048K5312q586n633K2445K4562
$$ 118101 91356 77686 96077 93232 82413 85354 115402 140714 132128 126495 148940 173502
6719A73502M7077P7049Q8043J41881J58037K34493L36053L94547K69144r6453
$$ 173502 220579 297628 385671 527552 685589 920082 1256135 1650682 1919826 1823373
6709A823373l77021l44546k25836j55176j43877q7833m4792m6849l9846n743j7326
$$ 1823373 1446352 1101806 875970 720794 576917 489084 444292 397443 357597 351854 334528
6698C34528j0776k5415k7566k8477l8164m1243R575J2377k8040l3590M95m996
$$ 334528 323752 298337 270771 242294 204130 162887 172462 184839 156799 123209 123704 118708
6686A18708j7577l9945p531o102J012N747J7142k288n691J1744m071k1027J4712
$$ 118708 101131 61186 53655 47553 48565 54312 71454 69166 63475 75219 71148 50121 64833
6673F4833Q379J7687Q984k2742k6164k1283j0656r45j4454j1419M244K8181o818
$$ 64833 73212 90899 99883 77141 50977 29694 19038 18093 3639 -7780 -3536 24645 17827
6660A7827j4408J8910N925k041J6044L8301k1489k0601L294m667j8913q430k990
$$ 17827 3419 22329 28254 26213 42257 80558 59069 38468 41762 37095 18182 9752 6762
6647F762K9310K7561k7989k9029R759j4329K0964P360j0173q812J12k0761M4L2561
$$ 6762 36072 63633 35644 6615 16374 2045 23009 30369 20196 11384 11496 -9265 -9221 23340
6633B3340L3317j0541j4483k836j5665J6693j7322O699k2626p933J3074J9572
$$ 23340 56657 46116 31633 28797 13132 29825 12503 19202 -3424 -11357 1717 21289
6621B1289o786Q890j0486O184P015j6269j3721r698K633J4254j0470j095L5074
$$ 21289 14503 23393 12907 19091 26106 9837 -3884 -13582 -10949 3305 -7165 -8260 26814
6608B6814K2967o373j4844k1895m0394r071M7121J8880o139j5704j649K2062l447
$$ 26814 49781 43408 28564 6669 -33725 -42796 4325 23205 17066 1362 -287 21775 18328
6595A8328Q88K6383J9014J0453Q418j5400l4560l7238P201J7038P266j2910n746
$$ 18328 19216 45599 64613 75066 83484 68084 33524 -3714 3487 20525 27791 14881 9135
6582I135J4280K1926q482m301K4421j9935m1643m3009L298L0472M7942J6493k310
$$ 9135 23415 45341 36859 32558 56979 37044 -4599 -47608 -44310 -13838 34104 50597 48287
6569D8287j9802K580j4554k0807l866P100K258Q299J9058j5432k7844K905M218
$$ 48287 28485 31065 16511 -4296 -8162 -1062 1196 9495 28553 13121 -14723 -11818 -7600
6556g600L0843J150O674O462j1537l7312j2648K3688O707j4217p033L414m543
$$ -7600 23243 24393 31067 37529 25992 -11320 -23968 -280 6427 -7790 -14823 -11409 -15952
6543a5952j1014J2263j2624J989K3598J1865J7940R24j160J3984k1k2948k475
$$ -15952 -26966 -14703 -27327 -25338 -1740 10125 28065 28989 27829 41813 41792 18844 16369
6530A6369L800j6823Q068J5169k7863l2962j4979K7312r992j3209J2264P365r442
$$ 16369 20169 3346 11414 26583 -1280 -34242 -49221 -21909 -31901 -45110 -32846 -25481 -34923
6517c4923K2983J3263l733L835k1280j6423J5727L1597Q723K059R438J5735J2990
$$ -34923 -11940 1323 -2410 1425 -19855 -36278 -20551 11046 19769 21828 31266 47001 59991
6504E9991J2011K795j6441k7578m22k3555o196k6187q756n45R608j5615J2376
$$ 59991 72002 74797 58356 30778 30356 6801 605 -25582 -34338 -34883 -25275 -40890 -28514
6491b8514J4492m797k0748r015J2216J194J2681K3275j476j2480K5275k1133k4177
$$ -28514 -14022 -18819 -39567 -48582 -36366 -35172 -22491 784 -692 -13172 12103 -9030 -33207
6478c3207J5879J6526J442k094j0806N526l468k3665k1874K1561K5728K0386j9688
$$ -33207 -17328 -802 640 -1454 -12260 -6734 -10202 -33867 -55741 -34180 -8452 11934 -7754
6465g754j655j1594j2797J5401Q003n686j5153k3961J6316K2552K750L843n459
$$ -7754 -9409 -21003 -33800 -18399 -10396 -16082 -31235 -55196 -38880 -16328 -13578 -9735 -15194
6452a5194R613J3542m476k8298k2508J2571J0947P791j7106J477J5297J7545l481
$$ -15194 -5581 7961 3485 -24813 -47321 -34750 -23803 -16012 -33118 -31641 -16344 1201 -2280
6439b280L655K0625j3061l740L288J5492k0062j1286j8193J542K1192J3205J1292
$$ -2280 1375 22000 8939 5199 8487 23979 3917 -7369 -25562 -24020 -2828 10377 21669
6426B1669j374J934j5131J448l279k4294k510J2114K8787R27J1880J2010l2256
$$ 21669 20295 22229 7098 8546 5267 -19027 -21537 -9423 19364 20291 32171 44181 11925
6413A1925k3048j8307q789K346j4253p245L1007L4319L108j4238K889J4298J4061
$$ 11925 -11123 -29430 -38219 -35873 -50126 -57371 -26364 7955 11063 -3175 -286 14012 28073
$$ [...]
##END NTUPLES=NMR SPECTRUM
##END=
