##TITLE=Analysis number 316271
Compound Code cc 45539
Book Reference 440/112
Project Code adrs
Chemist Name craigr
##JCAMPDX= 6.0         $$ Bruker NMR JCAMP-DX V2.0
##DATA TYPE= NMR SPECTRUM
##DATA CLASS= NTUPLES
##ORIGIN= Bruker BioSpin GmbH
##OWNER= nmr
$$ XWIN-NMR		Version 3.5
$$ Mon Jan  9 10:20:48 2006 GMT Standard Time (UT+0h)  MAYBRIDGE\nmr@NMR_250MHZ
##.OBSERVE FREQUENCY= 250.131544655141
##.OBSERVE NUCLEUS= ^1H
##.ACQUISITION MODE= SIMULTANEOUS (DQD)
##.ACQUISITION SCHEME= undefined
##.AVERAGES= 16
##.DIGITISER RES= 18
##SPECTROMETER/DATA SYSTEM= dpx250
##.PULSE SEQUENCE= zg30
##.SOLVENT NAME= CDCl3
##.SHIFT REFERENCE= (INTERNAL, CDCl3, 0, 16.4449)
##AUDIT TRAIL= $$ (NUMBER, WHEN, WHO, WHERE, WHAT)
$$ ##TITLE= Audit trail, XWIN-NMR		Version 3.5
$$ ##JCAMPDX= 5.01
$$ ##ORIGIN= Bruker BioSpin GmbH
$$ ##OWNER= nmr
$$ C:\u/data/dgb/nmr/ADRS/14380/pdata/1/auditp.txt
$$ ##AUDIT TRAIL=  $$ (NUMBER, WHEN, WHO, WHERE, WHAT)
(   1,<2006-01-09 10:20:25.73 +000>,<MAYBRIDGE\nmr>,<NMR_250MHZ>,
      <created by zg, POWCHK disabled, PULCHK disabled
       configuration hash MD5:
       62 19 C7 07 E1 42 D1 B7 37 6C 3D D0 77 39 F9 E6
       data hash MD5: 64K
       A8 C7 44 61 08 F7 70 82 8E 78 70 9F E5 98 E5 18>)
(   2,<2006-01-09 10:20:38.74 +000>,<MAYBRIDGE\nmr>,<NMR_250MHZ>,
      <Start of raw data processing
       ef LB = 0.3 FT_mod = 6 PKNL = 1 SI = 32K 
       data hash MD5: 32K
       C8 3A 6C 1B 29 CF AE 18 B4 B7 41 99 5E 8A A0 B8>)
(   3,<2006-01-09 10:20:40.66 +000>,<MAYBRIDGE\nmr>,<NMR_250MHZ>,
      <apk 
       data hash MD5: 32K
       D9 A5 EE D3 5E 61 77 8B 94 FE 50 7F C2 14 88 EA>)
(   4,<2006-01-09 10:20:41.41 +000>,<MAYBRIDGE\nmr>,<NMR_250MHZ>,
      <abs ABSG = 5 
       data hash MD5: 32K
       8C 42 57 50 5F 59 70 F9 3D 73 ED 69 F4 77 90 B5>)
$$ ##END=
$$ 
$$ hash MD5
$$ 07 6B 72 49 05 CA 9B BE E8 46 C1 5B AD DA 90 68
##$RELAX= 
##$RELAX= 
##$RELAX= 
##$RELAX= 
##$RELAX= 
##$RELAX= 
##$RELAX= 
$$ Bruker specific parameters
$$ --------------------------
##$DU= <C:\u>
##$EXPNO= 14380
##$NAME= <ADRS>
##$PROCNO= 1
##$TYPE= <nmr>
##$USER= <dgb>
##$AMP= (0..31)
100 100 100 100 100 100 100 100 100 100 100 100 100 100 100 100 100 100 
100 100 100 100 100 100 100 100 100 100 100 100 100 100 
##$AQSEQ= 0
##$AQ_mod= 3
##$AUNM= <au_zg>
##$AUTOPOS= <9 >
##$BF1= 250.13
##$BF2= 250.13
##$BF3= 250.13
##$BF4= 250.13
##$BF5= 500.13
##$BF6= 500.13
##$BF7= 500.13
##$BF8= 500.13
##$BYTORDA= 1
##$CFDGTYP= 0
##$CFRGTYP= 5
##$CHEMSTR= <none>
##$CNST= (0..31)
1 1 145 1 1 1 1 1 1 1 1 1 1 1 1 1 1 1 1 1 1 1 1 1 1 1 1 1 1 1 1 1 
##$CPDPRG= <>
##$CPDPRG1= <>
##$CPDPRG2= <>
##$CPDPRG3= <>
##$CPDPRG4= <mlev>
##$CPDPRG5= <mlev>
##$CPDPRG6= <mlev>
##$CPDPRG7= <mlev>
##$CPDPRG8= <mlev>
##$CPDPRGB= <>
##$CPDPRGT= <>
##$D= (0..31)
0 1 0 0 0 0 0 0 0 0.06 0 0 0 0 0 0 0.0002 0 0 0 0 0 0 0 0 0 0 0 0 0 0 
0 
##$DATE= 1136802024
##$DBL= (0..7)
120 120 120 120 120 120 120 120 
##$DBP= (0..7)
150 150 150 150 150 150 150 150 
##$DBP07= 0
##$DBPNAM0= <>
##$DBPNAM1= <>
$$ [...]
##$SUBNAM7= <"">
##$SUBNAM8= <"">
##$SUBNAM9= <"">
##$SW= 20.6930455092707
##$SWIBOX= (0..15)
0 0 3 0 0 0 0 0 0 0 0 0 0 0 0 0 
##$SW_h= 5175.983436853
##$TD= 65536
##$TD0= 1
##$TE= 294.16
##$TE2= 300
##$TE3= 300
##$TEG= 300
##$TL= (0..7)
0 120 120 120 120 120 120 120 
##$TP= (0..7)
150 150 150 150 150 150 150 150 
##$TP07= 0
##$TPNAME0= <>
##$TPNAME1= <>
##$TPNAME2= <>
##$TPNAME3= <>
##$TPNAME4= <>
##$TPNAME5= <>
##$TPNAME6= <>
##$TPNAME7= <>
##$TPOAL= (0..7)
0.5 0.5 0.5 0.5 0.5 0.5 0.5 0.5 
##$TPOFFS= (0..7)
0 0 0 0 0 0 0 0 
##$TUNHIN= 0
##$TUNHOUT= 0
##$TUNXOUT= 0
##$USERA1= <user>
##$USERA2= <user>
##$USERA3= <user>
##$USERA4= <user>
##$USERA5= <user>
##$V9= 5
##$VALIST= <valist>
##$VCLIST= <CCCCCCCCCCCCCCC>
##$VD= 0
##$VDLIST= <DDDDDDDDDDDDDDD>
##$VPLIST= <PPPPPPPPPPPPPPP>
##$VTLIST= <TTTTTTTTTTTTTTT>
##$WBST= 1024
##$WBSW= 4
##$XGAIN= (0..3)
0 0 0 0 
##$XL= 0
##$YL= 0
##$YMAX_a= 591445
##$YMIN_a= -537653
##$ZGOPTNS= <>
##$ZL1= 120
##$ZL2= 120
##$ZL3= 120
##$ZL4= 120
##$ABSF1= 16.44492
##$ABSF2= -4.248253
##$ABSG= 5
##$ABSL= 3
##$ALPHA= 0
##$AQORDER= 0
##$ASSFAC= 0
##$ASSFACI= 0
##$ASSFACX= 0
##$ASSWID= 0
##$AUNMP= <proc_1d>
##$AZFE= 0.1
##$AZFW= 0.1
##$BCFW= 0
##$BC_mod= 0
##$BYTORDP= 0
##$COROFFS= 0
##$CY= 12.5
##$DATMOD= 1
##$DC= 0
##$DFILT= <>
##$DTYPP= 0
##$F1P= 14.0000005364418
##$F2P= -0.99999901652339
##$FCOR= 0.5
##$FTSIZE= 32768
##$FT_mod= 6
##$GAMMA= 0
##$GB= 0
##$INTBC= 1
##$INTSCL= 1
##$ISEN= 128
##$LB= 0.3
##$LEV0= 0
##$LPBIN= 0
##$MAXI= 10000
##$MC2= 0
##$MEAN= 0
##$ME_mod= 0
##$MI= 0
##$NCOEF= 0
##$NC_proc= -2
##$NLEV= 6
##$NOISF1= 0
##$NOISF2= 0
##$NSP= 0
##$NTH_PI= 0
##$NZP= 0
##$OFFSET= 16.44492
##$PC= 1
##$PHC0= 87.41987
##$PHC1= 4.779793
##$PH_mod= 1
##$PKNL= yes
##$PPARMOD= 0
##$PSCAL= 4
##$PSIGN= 0
##$REVERSE= no
##$SF= 250.130019279613
##$SI= 32768
##$SIGF1= 0
##$SIGF2= 0
##$SINO= 400
##$SIOLD= 32768
##$SREGLST= <1H.CDCl3>
##$SSB= 0
##$STSI= 32768
##$STSR= 0
##$SW_p= 5175.98343685301
##$SYMM= 0
##$S_DEV= 0
##$TDeff= 65536
##$TDoff= 0
##$TI= <Analysis number 999999
Compound Code 99
Book Reference 9
Project Code 9>
##$TILT= no
##$TM1= 0
##$TM2= 0
##$TOPLEV= 0
##$USERP1= <user>
##$USERP2= <user>
##$USERP3= <user>
##$USERP4= <user>
##$USERP5= <user>
##$WDW= 1
##$XDIM= 32768
##$YMAX_p= 397888867
##$YMIN_p= -29699
$$ End of Bruker specific parameters
$$ ---------------------------------
##NTUPLES= NMR SPECTRUM
##VAR_NAME=  FREQUENCY,     SPECTRUM/REAL,   SPECTRUM/IMAG
##SYMBOL=    X,             R,               I
##VAR_TYPE=  INDEPENDENT,   DEPENDENT,       DEPENDENT
##VAR_FORM=  AFFN,          ASDF,            ASDF
##VAR_DIM=   32768,         32768,           32768
##UNITS=     HZ,            ARBITRARY UNITS, ARBITRARY UNITS
##FACTOR=    0.157963299565203, 1,           1
##FIRST=     4113.3680531433, 0,             0
##LAST=      -1062.61538370971, 0,           0
##MIN=       -1062.61538370971, -29699,      0
##MAX=       4113.3680531433, 397888867,     0
$$ Real data points
##PAGE= N=1
##DATA TABLE= (X++(R..R)), XYDATA
$$ [...]
15257C549k548J779j462k104k301k900l664L890M636q06j094R22J58O00l994j480
15241f819j18J323J203p758K56J799M352M651k131J885K453K262M130k164k765
15226B559m333m064K81l72J531M720l882l419K266m051M022R30L514K212j765
15211A49l230q56j838M114pk352O13N510M976J154m851L76j912j659R31R83N360
15194G461n555n814J084m796J126M234L073L128O30q7k189n710j312r35k252N709
15178b205P457k208l172K253K694J584O84K610l189M295m242j3155q145P911K131
15163d697P009J747m685n89L613k623q569l822M706J3076M004k802r394m098O955
15148a69l360j291K251n340J583L156k337k810n226J716M254p99l422N827M20
$$ y = [3549, 1001, 2780, 1318, -786, -3087, -5987, -9651, -5761, -1125, -1931, -3025, -2103, -1945, -1345, -5339, -6819, -6937, -5614, -4411, -12169, -11913, -10114, -5762, -1111, -3242, -1357, 1096, 3358, 7488, 5324, 2559, -1774, -5838, -5557, -5929, -4398, 322, -3560, -6979, -4713, -8764, -4742, -3812, -298, 1914, 149, -3081, -3937, -5775, -1661, -1668, -4020, -3407, 2103, 7079, 8233, 3382, 3758, 1846, 187, 1118, 2101, 7461, 1906, -3908, -2824, -7620, -6494, -2260, 813, 3941, 4571, 4484, 2295, -3415, -4727, -5662, -7914, -2205, 5252, 3044, -128, 2125, 4819, 6403, 7087, 9697, 6508, 10803, 6561, -6594, -14739, -6828, -4697, 2312, 4059, -626, -1215, 2398, -225, -8794, -12616, -7910, 5166, 9170, 6368, -3026, -7124, -169, -3529, -4820, -2569, -7909, -6326, -3170, -5507, -8317, -13543, -11827, -7573, -8372, -11794, -5967, -5547]
15133e547J389n622o739L925N620l916j140m523O440R027p80l658N518K573k302
15118B65l826j462n01l51m2K595n436J22M172J925k180j179P721L377m108m279
15102c187l749j986J381J706J529J3230J651l798o508l647r121Q56J930l26L808
15087f231O802k546J235P449j23k313o566r0Q149K813k569n232j809j461p201
15072i693l055L335j877L12N839O469R17M46l075k132j346l300q823m53M317M403
15056g716J0947O01P39P15k547K33J486K530j2193p517K929J0246k08L346K282
15041E873k542j188o78k291o85p738M543N674K211r5m438m372j81M742l140j3389
15025a7694k133K045R01Q370M208n19N437L85k841k305n96n558q182L497M481
$$ y = [-5547, -4158, -9780, -16519, -12594, -6974, -10890, -12030, -16553, -10113, -1086, -1866, -5524, -6, 2567, 265, -3561, -5023, -5524, -5875, -5917, -3322, -8758, -8636, -4464, -2539, -4719, -5898, 1823, 5200, 1092, -3187, -6936, -8922, -7541, -5835, -4306, 8924, 10575, 6777, 269, -3378, -12499, -11643, -9713, -10039, -6231, 571, -1975, -740, 6709, 6586, 4273, -2293, -2383, 5766, 8579, 6010, 778, -1031, -2492, -9693, -12748, -9413, -11290, -10978, -5139, 1330, 2247, 2693, -382, -2514, -3860, -7160, -15983, -16436, -12119, -7716, 3231, 3832, 4571, 5286, 2739, 2972, 4458, 6988, -5205, -12722, -9793, 453, 245, 3591, 5873, 3331, 2143, 1465, -826, -1511, -9249, -4706, 968, 3179, 3084, -1354, -5726, -5907, -1165, -4305, -17694, -19827, -17782, -16881, -8511, -4303, -4822, 615, 1000, -1841, -4146, -4742, -10300, -18482, -14985, -10504]
15010a0504J602M689M412q93N11N01l092L88N236k527J934k041M08K194N026L414
14994A1258o928p650k389J367j1285o971P666Q596j135l173l9P542k67n38L301
14979f45k276K558P88J907L256j952m544K003k915j0228L585Q449L260L2o988
14964c710k295k978o338m648K460K375J931K772l77K643J0792j722r573K338j36
14949f466j149P464N092o988j210M277J019q973j638j107M531K197J155l770m601
14934a0167K853m119j383M516J201M710k755j288j128m599L330J970K609O827
14920B577M768O050l59j8410m60O067M079p306k503k184l436o223M209O412O570
14905a49J774m463j691J925Q93n744k737O369k748p281j124l487J685Q535N141
$$ y = [-10504, -8902, -4213, 199, -694, -183, 318, -2774, -2386, 2850, 323, 2257, 216, 624, 2818, 7844, 11258, 4330, -3320, -5709, -4342, -15627, -22598, -14932, -6336, -7471, -10644, -10683, -3141, -3408, -3946, -645, -2921, -363, 425, 2332, 5588, 3636, -908, 1095, -1820, -12048, -8463, -14, 3246, 3278, -3710, -6005, -8983, -15321, -19969, -17509, -15134, -13203, -10431, -10808, -8165, 2627, 905, -8668, -6330, -6466, -7615, -151, 4941, -2047, -3257, 1020, 2039, -6934, -8572, -9679, -5148, -2951, -1796, -5566, -10167, -7314, -11433, -12816, -8300, -7099, -2389, -5144, -6432, -7560, -12159, -8829, -6859, -4250, 2577, 7345, 13395, 13036, -5374, -5834, 233, 4312, -2994, -5497, -7681, -11117, -17340, -13131, -6719, -149, 1625, -2838, -4529, -2604, -1711, -7455, -10192, -3823, -6571, -13852, -14976, -18463, -16778, -8243, -3102]
14890c102n187M05L337o85L140k935m98l818N943Q014J600O32K12l239q526j833
14874f540L433J978L292k786J853M942k965J367j822n355j141o23J722m637Q57
14859f425P2k779j332l10M207K591k448k736K651P034R899k399n413m93q44j672
14843c97p573K065N391k04m846L925L617p662R1Q86o660l870J590Q174N861L681
14827D069N111p492m388k324M083K673K234K059j172l836j732k537N079R6L942
14812E865J553p811o563n60n671n667k930N521M731L424K81L88m375J5M845J36
14796f818n681P75L923L394K894J88K011L317Q94p638m167l946O790O231j357
14781H10p440k704m097R134j575p969L398K715p925o06N687O821L785j027p250
$$ y = [-3102, -8289, -7884, -4547, -5232, -2092, -5027, -5525, -9343, -3400, 4614, 6214, 6846, 7058, 3819, -4707, -6540, -3107, -1129, 2163, -623, 1230, 6172, 3207, 4574, 2752, -2603, -3744, -4367, -2645, -7282, -6425, -6353, -9132, -10464, -10774, -6567, -3976, -6424, -9160, -6509, 525, 10424, 8025, 2612, 2119, 1275, -397, -7970, -5905, -514, -718, -5564, -1639, 1978, -5684, -5593, -4707, -11367, -15237, -13647, -5473, 388, 4069, 9180, 1688, -2700, -5024, -941, 1732, 3966, 6025, 4853, 1017, -715, -3252, 1827, 1923, 5865, 7418, -393, -6956, -7516, -13187, -18854, -21784, -16263, -11532, -8108, -7827, -7439, -11814, -11799, -6954, -6818, -12499, -11724, -7801, -4407, -1513, -1325, 686, 4003, 4897, -2741, -6908, -10854, -4064, 2167, 810, -6630, -9334, -13431, -4297, -5872, -13841, -10443, -7728, -15653, -16259, -10572, -3751, 34, -993, -8243]
14766h243n555m94K984J623L738j365M222lN69P46L76l040M480L601j101k202
14750C36P45K824J674L125l954l654n28J601l192P56M74O246Q982q32o602p835
14734A66l729o441m988m972M743M577Q705K354p301k286L520R318n99o55M237
14719F649L731l642N480p17p870J967o719j931O002J146p0l094k660L937m737
14704b528J595l06k645M360n122p536N737M132l528K705R157m463Q86L62k262
14689E44r26k402l45P78n587p93P250o866n270m818L256O374N934J640N315J488
14673E572j957p686n40K506l904q09L380J283j141o389m878n59n071L389Q833
14658g971L852L00L521m18k634p794M39J665N671j36Q13j330R29m380K12M03J0969
$$ y = [-8243, -13798, -14292, -11308, -9685, -5947, -7312, -3090, -3093, -2524, -1778, -1402, -4442, 38, 3639, 2538, 336, 1081, 3905, 5579, 8704, 4750, 1096, 568, 2169, -1023, -267, 207, 6453, 15435, 14603, 8001, 166, -3563, -10004, -14992, -19964, -15221, -10644, -1939, 415, -6886, -9172, -5652, 3666, 3067, 2412, 6649, 10380, 6738, 12218, 11501, 3631, 5598, -1121, -3052, 2950, 4096, 4026, 932, -1728, 2209, -2528, -933, -1239, -3884, 476, -4646, -12182, -6445, -2313, -5841, -3136, 6021, 1558, 2444, 2806, 544, -382, -2784, -3129, -2351, -7938, -8731, -1481, -8347, -13617, -18435, -15179, -8805, -2871, -1231, 4084, 5572, 3615, -4071, -4611, -2105, -6009, -6818, -3438, -2155, -3296, -9685, -14563, -15122, -20193, -16804, -7971, -4119, -3819, -298, -716, -3350, -11144, -10705, -9040, -3369, -3505, -2692, -4022, -3093, -7473, -7261, -6858, 4111]
14641D111K368k432J883l66o233n644j165K973K747o5k549k731R04M409l101q97
14625e788j123l562j632j237O287M372l986q46K632o211L545J97l932l569j57
14610a5010M02L21K199L527J30M908P184J557n920o674k434k410M996R019L522
14595E317j945l089m801K916k969k455k348N476J298l912j173J621o502K664R03
14580h999J09M421M721o32j688k543k895O60l996P943J318o605n739q003J275
14565b0653R135N52J0850K175k837j221k574J280M064j414o373L141j803J177
14551d501r72k53o449j807R06N148J11M325O979j024l488q332r549M491Q019n81
14535f977J830Q76k627j037M58K974k282k912M347L226j874N306O198j199O87
$$ y = [4111, 6479, 4047, 5930, 5564, -669, -6313, -7478, -4505, -1758, -1823, -4372, -7103, -6199, -1790, -4891, -5788, -6911, -10473, -12105, -13342, -7055, -2683, -6669, -7515, -4883, -11094, -7549, -7352, -11284, -14853, -15010, -14608, -14287, -12088, -8561, -8431, -3523, 3661, 5218, -702, -7376, -9810, -12220, -7224, 1795, 5317, 3372, 283, -4518, -1602, -4571, -7026, -9374, -3898, -2600, -6512, -7685, -6064, -12566, -9902, -8999, -8890, -4469, 252, -380, -2068, -4611, -7506, -6846, -10842, -2899, -1581, -8186, -13925, -21928, -20653, -11518, -10966, -116, 2059, -778, -1999, -4573, -3293, 771, -643, -7016, -3875, -5678, -4501, -5473, -5726, -12175, -13982, -13076, -7928, -7817, -3492, 3487, 2463, -1025, -9357, -18906, -14415, -6396, -6977, -5147, -4271, -6898, -7935, -7477, -4503, -6785, -9697, -5350, -2124, -3998, 1308, 7506, 6307, 6994]
14520F994q531o032J876P112K751k008l117M25J536j257n418j2842J1632N312
14506a567l210m118P127P800K472j385n947p288j715J657N899K475J325K922k514
14491C933m456L325O764m686j0781p794r32K442M504m776k72Q524J406q32R883
14476F252M608p185l473J806m397J63K590j878O20n378j1150l257M369K719l002
14461a6593N984J3220L33p061k851P35J273J479N925j60K174j038p954m719L310
14446e943j749K184j520L98K81L612J246k475N56o77K15j356P906J753k05n74
14430C652j862j0623n674K203N291l24m988n25K995N215J455M59m075k00m16l975
14414a1392K761L840L428l251k259P285n033l048L082O189r26k185k093J935K874
$$ y = [6994, -1537, -7569, -5693, 1419, 4170, 2162, -955, -530, 1006, -251, -5669, -18511, -6879, -1567, -4777, -8895, -1768, 6032, 8504, 7119, 1172, -6116, -7831, -6174, -275, 2200, 3525, 6447, 3933, -523, 2802, 9566, 4880, -5901, -13695, -14627, -12185, -7681, -12457, -12729, -4205, -2799, -3631, 6252, 10860, 3675, 202, 2008, -2389, -2226, 364, -1514, -894, -6272, -17422, -20679, -16310, -13591, -16593, -10609, 2611, 2944, -4117, -6968, -6233, -4960, -3481, 2444, 2284, 4458, 3420, -4534, -9253, -5943, -7692, -5508, -7028, -6630, -6349, -2737, -1491, -3966, -3410, -4087, -3872, -5228, 2678, 4431, 4226, 3652, 1790, -8833, -14507, -12304, -7013, -7337, -12325, -12850, -9855, -4640, -3185, -2726, -6801, -7001, -7417, -11392, -8631, -4791, -1363, -4614, -6873, 412, -4621, -7669, -4587, 1602, 676, -1509, -3602, -1667, 1207]
14399A207K81n815m551j834M530N162J605q45q07L828m240m160j907P442K079
14384A975p821M45K233K796k467p237o696L285M562j185n414k781J0784l219M059
14369f681L199M2J76M728L870J430m351q459J4K031l3K994J2175L787q114p838
14353a030J520p968m38K056N47K175k060L61q17L276L540K940o825m823L798P037
14337C289M455j930o104M677L590p991r536O557j475L635j978j0082K647J68J717
14322h361M674k654l679J614q753J925O139P14J77N270k162k893m311k499j621
14307a6420k042P034P25K650J799n050M711P638n12M501M493M96q974m584P39
14292b796K814J446O758j187o018M221k839n365J171J014m803j815K379p57o58
$$ y = [1207, 1488, -4327, -8878, -10712, -6182, -1020, 585, -260, -1067, 2761, -1479, -5639, -7546, -104, 1975, -5846, -5401, -3168, -372, -2839, -10076, -16772, -13487, -8925, -10110, -15524, -18305, -7521, -10740, -6681, -3482, -3440, -3264, 1464, 5334, 6764, 2413, -6046, -6032, -4001, -4034, -1040, 11135, 14922, 6808, -1030, 490, -7478, -7916, -5860, -5313, -3138, -5198, -4837, -5654, -2378, 1162, 4102, -2723, -7546, -3748, 3289, 7744, 5814, -290, 4387, 7977, -14, -9550, -2993, -4468, -833, -2811, -12893, -10246, -10078, -8361, -3687, -6341, -10020, -8406, -17159, -15234, -9095, -8381, -8204, -2934, -5096, -7989, -12300, -14799, -16420, -18462, -11428, -10703, -8053, -6254, -11304, -6593, 1045, 533, 5034, 9527, 10023, 1049, -3535, -2796, 18, 1464, 8222, 7035, 1017, 5238, 2399, -2966, -1795, -781, -5584, -7399, -5020, -5777, -6435]
14277f435Q362O685l840q10m273N08Q53q62r767P90O307q45j089l296K159P304
14261A751k276k390L972k04j626Q931q75m951J047m48l770o469j533k61J131K021
14245e950m149K007o9j097M955k307R13J172Q322J286j0040r96j676j59R66J633
14229e189J459j600K51n949o452m19L359m66O052J469j332q046J703Q351Q770
14214A961P730k198n901o948m312m251N823Q034K565J453l159K545k340k057K704
14199A649L298k414o113r904q0j296j22l05O988J080n368m115P106L970k686k646
14183a0958J298R69L745l279n92J551k661L452Q19k758l17N159P19p556J173P02
14167h534q63K461K313j82J361j310K91J015K082p119n578j329J0272Q14k737
$$ y = [-6435, 1927, 8612, 4772, 3962, -311, 197, 1050, 188, -9579, -8789, -2482, -3327, -4416, -7712, -5553, 1751, -525, -2915, 1057, 853, -773, 8158, 7283, 2332, 3379, 2931, -839, -7308, -8841, -9102, -7971, -5950, -10099, -8092, -8161, -9258, -4303, -6610, -5697, -4525, 3797, 5083, -4957, -5953, -7629, -7788, -6822, -5189, -3730, -5330, -5079, -11028, -17480, -17899, -14540, -15006, -8954, -7485, -8817, -16863, -15160, -6809, 1961, 9691, 7493, 1592, -5356, -9668, -13919, -8096, -62, 2503, 3956, 797, 3342, 1002, -1055, 1649, 4947, 2533, -3580, -13484, -13564, -14860, -14982, -15287, -8299, -7219, -12587, -16702, -9596, -5626, -8312, -10958, -9660, -8691, -4946, -8225, -8817, -7266, -9927, -6475, -5656, -8414, -8731, -3572, -2853, -10409, -9236, -8534, -9397, -6936, -4623, -4805, -3444, -4754, -4463, -3448, -1366, -8485, -14063, -15392, -5120, -4306, -7043]
14152g043K001j40l315r470l870K190L036J2436j629o461M981K653n57k157n220
14137a2565L74m281m830M547J932K695L716N169k191j065M739k629J076r76j676
14122e965L379n554K416k687J936j089l210K648Q5j058K503K167L422k997K869
14107a135m381j374L053K464o992o751M129R174K018n486N612J2060R30q540j0949
14092f168j984K006m356l286j386J749L794M440K969j636k658N544O873r12l65
14077D624n050m168m99l285L456M603K926l118j988L711N724K472K561m17M002
14062A5554n865l069k774K789n312p338L915K977p37l678k423K718L156K904k252
14047E65n907m181L166J0113l139N33K110n13m67l405n831K416M905O684j106
$$ y = [-7043, -5042, -5182, -8497, -17967, -21837, -19647, -16611, -4175, -5804, -12265, -7284, -4631, -5188, -7345, -12565, -12191, -16472, -21302, -16755, -14823, -12128, -8412, -3243, -5434, -6499, -1760, -4389, -3313, -4289, -5965, -2586, -8140, -5724, -8411, -6475, -7564, -10774, -8126, -8041, -9099, -6596, -4429, -1007, -4004, -1135, -5516, -6890, -3837, -1373, -8365, -15116, -10987, -1813, 205, -5281, 331, 12391, 13321, 4781, -6168, -8152, -6146, -10502, -13788, -15174, -13425, -9631, -5191, -2222, -3858, -6516, -972, 5901, 4989, 4624, -426, -4594, -5093, -8378, -4922, -319, 2607, -511, -2499, 1212, 6936, 9408, 11969, 11552, 15554, 9689, 6620, 3846, 6635, 1323, -6015, -2100, 877, 140, -3538, -5961, -3243, -87, 2817, 565, -5342, -9523, -6357, 3756, 617, 1150, 3260, 2747, 2280, -1125, -6956, -4540, 365, 7049, 5943]
14032E943m627l427K762K50k606k490k563k431k693N37P604O669j938n333J895
14017b448q91o70P52R594L745p431J253N274q536o680K511j545q30K78R83k582
14001g223j992J423M57q293n432L070K559j774N26N571K224L50J274R62N885L020
13985B607Q43m734l688j8O376L901L122J838m588k947p86l65n317k257O110L044
13969C141j1840k556M325p152l360q19L522J3379O814L0k281m220q073P072L617
13954A599n609l176M238K761k486j670L623L071j248j602K981N754L759j0039
13940A956n158J347J504j709j3220K312K395l263K846O684J021k753J191l8l863
13925h748n402N220M823l433m607P29K498O364m729m957M894M392l750q33K649
$$ y = [5943, 1316, -2111, 651, 901, -1705, -4195, -6758, -9189, -11882, -11345, -3741, 2928, 990, -4343, -2448, -3339, -4009, -3257, 6337, 10082, 2651, 3904, 9178, 642, -6038, -3527, -5072, -5902, -5624, -4641, -7223, -9215, -7792, -7335, -15628, -21060, -17990, -15431, -17205, -16679, -11108, -8884, -8534, -7260, -6298, -413, 2607, 3450, -1284, -4972, -4990, 1386, 5287, 8409, 10247, 5659, 2712, 1926, 1561, -3756, -6013, 97, 3141, -8699, -11255, -6930, -14082, -17442, -18261, -14739, -1360, 5454, 5484, 3203, -1017, -9090, -2018, 1599, -4010, -7186, -2948, -187, -2673, -4343, -720, 2351, 1103, -499, 2482, 8236, 11995, 1956, -3202, -1855, -351, -2060, -15280, -12968, -10573, -13836, -10990, -4306, -3285, -6038, -4847, -4885, -8748, -14150, -8930, -4107, -7540, -12147, -11418, -8920, -2556, -7285, -12242, -7348, -2956, -6706, -7539, -4890]
13910d890k233Q7Q134N589j251p031m901k737N92J309J714r20J897o09j325K468
13894d107Q67l265k452j399k630m974P24M881J885K149L207k499n74M381j832
13879e638K623K765Q45j66L963l92o538M838L743O291l043l642n046l108k40K350
13863c95n100k816M803M415J049j361m237m587N533Q977l428J11m418q689n414
13848a5557L002J3220O567j581j1291p845N370M246K151J773k811o533K641R890
13834C242L308q02j732l949R03k92k080l110m328p4P373Q15k087N439N576L079
13818A1281k961p046m776l331m018j104j383k879J547K96K737M190j58l010J778
13803h837K952p107p64K70P361P354O74j919q416k846K928P13L810N320K842m189
$$ y = [-4890, -7123, -7036, 1098, 6687, 5436, -1595, -6496, -9233, -8641, -7332, -5618, -6538, -4641, -5250, -6575, -4107, -3240, -6505, -8957, -10356, -12986, -17960, -17236, -12355, -10470, -8321, -5114, -7613, -8187, -3806, -5638, -3015, -250, 595, 429, 4392, 4000, -2538, 2300, 6043, 12334, 9291, 5649, 603, -2505, -2745, -395, -5495, -8311, -3508, 907, 1956, 595, -3642, -8229, -2696, 6281, 2853, 2964, -1454, -10143, -15557, -12555, 665, 7232, 5651, -5640, -13485, -8115, -3869, -1718, 55, -2756, -9289, -6648, 3242, 6550, 5748, 4016, 67, 970, 678, -1402, -4512, -8840, -8914, -1541, -726, -2813, 2626, 8202, 11281, 8320, 1274, -3502, -6833, -10851, -11955, -13338, -16217, -14670, -14374, -11637, -7447, -7605, -10615, -8837, -5885, -12992, -13756, -13486, -6125, 1229, 1903, -16, -8432, -11278, -8350, -7637, -3827, 1493, 4335, 146]
13787A46M832L987n777k889l546M525l593n867r58J250k519J060O802J2224l846
13772E831k814K913j570n865l193J98k158k768k660J865q05N558K01l816L842
13757e241L580L706O056K6n003k363l518k584j672j16k047q94j329P424N805J462
13741C292J279j472j0039m48K324P994M732j995j685K953L396m230m108J534M002
13726G529K1n019k846k359K070O081k663J245K865q537o491L638N473Q065L36
13711I408o753p250l467J370n08L379r9m588m010J67L253j045K194k099N617K631
13695a800m497k646mk009k310J138L019P75J70Q406N6j985o99m409J929q34K238
13678c462Q330l479m062r799O006J3859K12r161k196o19o064m28O614O967l390
$$ y = [146, 4978, 8965, 3188, 299, -3247, 1278, -2315, -8182, -9140, -7890, -10409, -9349, -2547, 9677, 5831, 3017, 5930, 4360, -1505, -4698, -4500, -6658, -9426, -12086, -10221, -11026, -5468, -5267, -9083, -5241, -1661, 2045, 8101, 8127, 3124, 761, -2757, -5341, -7013, -7129, -9176, -10070, -11399, -3975, 1830, 3292, 4571, 3099, -6940, -7388, -5064, 2930, 7662, 5667, 3982, 6935, 10331, 6101, 1993, 3527, 7529, 7550, 2531, -315, -2674, -604, 5477, 2814, 4059, 6924, -1613, -8104, -4466, 1007, 9072, 9408, 2655, -4595, -8062, -6692, -7200, -3821, -3920, -8508, -12518, -12351, -9098, -10143, -7949, -10048, -4431, -1800, -6297, -8943, -8947, -10956, -13266, -12128, -9109, -8334, -8164, 242, 298, -1687, -2386, -6795, -4866, -5700, -3462, 4868, 1389, -2673, -12472, -6466, 7393, 7605, -1556, -3752, -4371, -10435, -10863, -4249, 2718, -672]
13663f72l585P022L177L705O61m206k87K256l698K878N528m514P195K077o234
13648A1303l950n942j342j192j596k149k842N714J359L920o79p43K97o902O999
13633B255J032p327q51M98O110J238N142R296k541j811p90r277l401m982k670
13618h079M284P22q042l29L61l108J1829P280K68l441o85q96k307q865K800O110
13602b098l76N673r78K077l1n618n336k537P705k811j709m430l518M505O37J205
13586g640j514m426L565M585j367M75M800J575r83l765l96k525K420Q641K951
13571F396k644q535J550L903R38K290L241J265l854k586Q170j4Q09M313n198k096
13555G948p05K754l621p237l850L390L112j092L610m030l233R84K118p7O305L643
$$ y = [-672, -4257, 2765, 5942, 9647, 10308, 6102, 5815, 8071, 4373, 7251, 12779, 8265, 15460, 17537, 11303, 7353, 1411, 69, -1123, -2719, -4868, -7710, -1996, -637, 3283, 2604, 1861, 2158, -4744, 2255, 3287, -4040, -4891, -4393, 1717, 2955, 8097, 17393, 14852, 13041, 12251, 2974, -427, -5409, -8079, -3795, -3073, -11115, -11444, -11083, -14191, -2362, 4918, 5186, 1745, 1060, 164, -2143, -11008, -8208, -2098, -2474, 3199, 2221, 4298, 4267, -1351, -6687, -9224, -1519, -4330, -6039, -10469, -13987, -9482, -8845, -7640, -9154, -13580, -10015, -5430, -6797, -6322, -1522, 53, -930, -4695, -5091, -7616, -5196, 3445, 6396, 3752, -4783, -3233, 670, 1608, 3898, 7139, 8404, 4550, 1964, 10134, 10120, 10929, 15242, 10044, 7948, 7243, 9997, 6376, -861, -4711, -1321, 1791, 699, 4309, 279, -2954, -1970, 148, 71, 6376, 10019]
13539A0019k721l300l037m89J504k314m513n965K41J532J916J002K854Q072j467
13524C334o808N126N157M716o629m872L292j189K006K168l725k160j028q97l89
13509a898L847m100n6M044j401l692N053N56l191j941m99L241j661j729N613l834
13493a648k824l31k516N546K402j596K463N298n048j964K186n473N974j735J124
13478A858P803R372l417j758k51q907l626n43L918M77r398j1078L413O205q185
13463a4117M561Q508M363J850j034j991m692P67K194M132L691l614j1090o57p840
13448a4969o860O412l91M117l104M37K345o337M633Q58k647N042K770L00K209
13433e185M00n866P398O234K091q4p125K382J2130k478r774l174o344j514O769
$$ y = [10019, 7298, 3998, 961, 472, 1976, -338, -4851, -10816, -10575, -9043, -7127, -6125, -3271, 4801, 3334, -3474, 1652, 6809, 11525, 4896, 24, 3316, 2127, 4133, 6301, 2576, 416, -612, -1509, -1898, 1949, -2151, -2207, 1837, 436, -3256, 1797, 2353, -838, -2779, -3278, -37, -1698, -3427, 2186, -1648, -4472, -4803, -7319, -1773, 629, -967, 1496, 6794, 1746, -218, 1968, -3505, 2469, 734, 1858, 9661, 19033, 15616, 13858, 13607, 4700, 1074, 531, 4449, 4926, -4472, -15550, -12137, -5932, -14117, -9556, -1048, 3315, 5165, 4131, 2140, -2552, -1785, 409, 4541, 8232, 4618, -6472, -7129, -14969, -21829, -15417, -15808, -11691, -14795, -14358, -12013, -18350, -13717, -12859, -15506, -10464, -7694, -7394, -5185, -4785, -10651, -3253, 2981, 5072, 4988, -2137, 245, 12375, 9897, 123, -3051, -9395, -10909, -4140]
13418d140J939j438L483L453m864n903j027M881L387O078O500l75o548n194o475
13403f243q364K192l35M299j701n265l345j269O602L063m099J676Q93J223L475
13388g198J506n038L211L023P473k459q990j491r044l3R235J99J01l076N915N080
13372a586M034j49l790L148J765P35j019m152J72J119q99J846J897M64J739N452
13356A0776J219q219r665M525J5J419M235j639k008r364p048M591K184K574j201
13341g606o689m733Q067J2055P194K963l892m122R21K938L91l998K992L653J462
13326A1596l914r061L271j77l071p12M360k26j128K227K887N501L787m21j831
13311A3088p693j210p394k69L031K50j303m628Q218O768n386n174m405L747K208
$$ y = [-4140, -2201, -3639, -156, 3297, -1567, -7470, -8497, -3616, -229, 5849, 12349, 11974, 5426, 232, -6243, -14607, -12415, -12750, -8451, -10152, -15417, -18762, -20031, -13429, -10366, -14465, -12789, -11896, -10673, -7198, -5692, -10730, -7519, -4496, 2977, 518, -8472, -9963, -19007, -19040, -9805, -9606, -9505, -12581, -6666, -1586, 2448, 2299, -1491, 1657, 3422, 4157, 3138, -1014, -842, 277, -622, 1224, 3121, 3585, 5324, 10776, 11995, 3776, -5889, -1364, -1349, 70, 4305, 2666, 658, -8706, -15754, -11163, -8979, -6405, -7606, -14295, -19028, -10961, 1094, 8288, 11251, 7359, 3237, 4158, 7096, 7487, 3489, 6481, 10134, 11596, 7682, -1379, 1892, 1715, -1356, -2068, 2292, 2066, 938, 3165, 6052, 11553, 15340, 14919, 13088, 5395, 4185, -3209, -3478, -447, -197, -1500, -6128, 2090, 8858, 3472, -1702, -6107, -2360, -152]
13296a52n93l055k496J718Q19j36P467L734K98j707J117k482L382l834p187n235
13280h342Q691L770m711q186J606K786P195j046j205k251K52O355m169N31p03
13265E73n226K618k62J77M228J61k612m578m209J829k998l504P041K938J964l301
13249e161j593K07q37o7j67J143n577L340Q49k744k824K613k661l757k236p81
13233b0253P121k331j37M627k703k348j870M827O821o586m620j234N107P233k804
13218i150m07N240m432J211J892l606R7N607l358L029k041o266j951M057n60L145
13202g493N27k531l56J180K995O292m483M083l238n498M695j019K17K360N864
13187C595K267L633o020l346k078K68n509k514P550L63q596n091N531j726l274
$$ y = [-152, -745, -3800, -6296, -4578, -3759, -3895, 3572, 7306, 7604, 5897, 7014, 4532, 7914, 4080, -3107, -8342, 349, 4119, -592, -8778, -7172, -4386, 2809, 1763, 558, -1693, -1441, 4914, 745, 1276, 573, -4653, -2035, -2297, -2120, 2108, 2269, -343, -4921, -9130, -7301, -10299, -13803, -6762, -3824, -1860, -5161, -6754, -6547, -7384, -7451, -7618, -6475, -12052, -8712, -7863, -10607, -13431, -10818, -13479, -17236, -19472, -20253, -13132, -15463, -15600, -10973, -13676, -16024, -17894, -13067, -6246, -12832, -17452, -18686, -13579, -6346, -9150, -9557, -4317, -8749, -7538, -5646, -9252, -9155, -3548, -6906, -3877, -5918, -12184, -14135, -10078, -10638, -7493, -6966, -9497, -9853, -8673, -5678, 614, -3869, 214, -3024, -8522, -3827, -4846, -4629, -2269, 3595, 5862, 9495, 3475, 129, -1949, -1681, -7190, -9704, -2154, -1791, -10387, -15478, -9947, -11673, -14947]
13172a4947N716K355J547l406N79M071N695m550k079R052Q725j757j051r82k121
13157F847L156R35l287j0227Q38N200p949p04N354J359M96J193L559k229j799
13142B742J86n216j675P57L336o143J218k241n393R0O311M026K898k021L248L109
13126E232J845M48l539n374k81N212P207M170P226J0865K897n186j4135q066n519
13111C002K200Q999j755m700L03J701k868k595l479l181O502O252o487r430j160
13096f696M560L420O887K719R0M0j898m454l283P388k840n849k920l103j369L655
13080c653Q733K327r981R60j701M78R894K104j628j06m65o519k445N524O668m102
13064F088O53J1450K520q70j735o387j181l493n511p013j474N99Q509j285J600
$$ y = [-14947, -9231, -6876, -5329, -8735, -8156, -4085, 1610, -2940, -5019, 4033, 12758, 11001, 9950, 8968, 6847, 10003, 10938, 7651, -2576, -1738, 3462, -4487, -5191, 163, 1522, 2018, 3211, 6770, 4541, 2742, 2928, -2288, -3963, -3206, 130, -6013, -4795, -7036, -12429, -12339, -6028, -2002, 896, -1125, 2123, 5232, 7077, 7525, 3986, -1388, -1669, 3543, 10750, 14920, 22146, 33011, 35908, 30722, 16587, 8521, 3002, 5202, 14201, 12446, 7746, 8049, 9750, 6882, 4287, 808, -2373, 4129, 10381, 3894, -5536, -6696, -2136, 1284, 8171, 10890, 10980, 11020, 9122, 4668, 1385, 8773, 5933, 84, -2836, -5939, -7308, -3653, 5080, 7407, -2574, -1614, -3315, -2837, 7057, 9161, 7533, 7427, 6962, 443, -2002, 3522, 10190, 6088, 6741, 18191, 20711, 19841, 18106, 11719, 10538, 7045, 1534, -5479, -6953, -6354, 2155, 870, 2470]
13049B470J34k641J136j957M452J175k931Q588j668j558q868n594l027N545m26
13034e170l364J543K0J00M267N817J277j018k220o004j750O534N662n770q228
13019h304j413K609P179N632n812k454k289Q362M585J241k02p200K53k937j478
13004b228n71J536M259l144M8M156N122m467n860K016q767r746N218K465P067
12989b896M309l007o64n304j949L55K675O96m596k192N43K236M580N91j759L383
12973b999O777K961J227j759l324k694r29K758O107L40l671l812J672l045k124
12958b515K123k462p043l621J170N614J0729O229j132n923m036q286L54K173K814
12943c812P254n16l240K512J419o367n808Q447L146l938n224K407L737L006j48
$$ y = [2470, 2604, -37, 1099, -858, 3594, 4769, 1838, 10426, 8758, 7200, -1668, -7262, -10289, -4744, -5170, -8534, -6991, -6971, -6871, -2604, 3213, 4490, 3472, 1252, -4752, -6502, 32, 5694, -76, -8304, -9717, -7108, 71, 5703, -109, -2563, -4852, 3510, 8095, 9336, 9134, 1934, 2187, -750, -2228, -2799, -1263, 2996, -148, -100, 4056, 9178, 4711, -1149, 867, -7900, -17646, -12428, -9963, -2896, 1413, -1594, -2258, -7562, -9511, -9156, -6481, -5785, -10381, -12573, -12030, -9794, -5214, -4623, -6382, -2999, 3778, 6739, 7966, 6207, 2883, 189, -740, 2018, 8125, 8465, 4794, 982, 2654, -391, -2515, -392, -2854, -9897, -13518, -12348, -6734, 3995, 10224, 9092, 3169, -867, -9153, -8799, -6626, -3812, 3442, 2926, -314, 2198, 3617, -2750, -8558, -111, 3035, -903, -6127, -3720, 17, 3023, 2875]
12928B875k75k468m787j002J468K394l863m273m57O946L056M602M179M676m811
12913H260l038l863q088p373O181j48k718j473J2016M471K445q859j931Q769m941
12898b90k410l44m668K615k32o91r78O550N269n997P60m274O382N98p883o359
12882a1952k97J877Q209n06O484K605k240n529M84K377j984m358L722J590L584
12867D066m612l381M212k717L896O994M620L127J058K4n246k041q07J29r704j0370
12851a0752j203J500N121m505j98L757J2010J118J736L73l522o838K027P76l132
12836a732K25j504K897K828r18N3l57R36O052O38M08j494n096j1580n958l042
12820a7644N653Q254Q270j561M808k828P35M213K683j444p450r332j46N143L135
$$ y = [2875, 2600, 132, -4655, -5657, -4189, -1795, -5658, -9931, -10388, -3442, -386, 4216, 8395, 13071, 8260, 5222, 1359, -6729, -14102, -7921, -8069, -10787, -12260, -244, 4227, 6672, -2187, -4118, 4651, -290, -2700, -3044, -7712, -5097, -5329, -6020, -6998, -448, 4821, -1176, -416, -4690, 1692, 2290, -5593, -11952, -12249, -10372, -2163, -2669, 3815, 6420, 4180, -1349, -865, 1512, -472, -4830, -1108, 482, 4066, -546, -3927, 285, -2432, 1464, 8458, 13078, 16205, 17263, 17287, 12041, 10000, 9193, 9322, -382, -10752, -11955, -10455, -5334, -9839, -10037, -6280, 5730, 6848, 8584, 8957, 5435, -1403, 624, 1400, -1732, -1507, -3011, -114, 2714, 1796, 1849, 1492, 2428, 8480, 9118, 9526, 8032, 2936, -8644, -14602, -17644, -11991, -3737, 4533, 2972, 7780, 4952, 5687, 9900, 12583, 11139, 3689, -5643, -5789, -646, 2489]
12805B489j337p08M22M076m665L548l27M816j907K124o625n159K563J418k209
12790a481N411K1j000k056m975k704N307l2J463N80j944p503M787M452M761l464
12774A623j724N601K642l203J841L108l186K971n118n098j995k74K847n97K925
12759B363q83k460M048j883J239j475n628L062n841K290J277M05K568j775K373
12744c20j497q828o49J823j321L694K342j776l338l151Q239N633j882k078n222
12729h331l579K62L886j003m999K734P456K853J940J116K388M20M507O1Q62l959
12713F614J235J512j159j581m365K61j817O579N687m816m247n965j438m9j3K052
12697a510K589j499j023n692o268L89M861J0698J130o747p874K37K336p53L902
$$ y = [2489, 1152, 444, 866, 4942, 277, 3825, 3498, 8314, 6407, 8531, 1906, -3253, -690, 728, -1481, 3930, 3951, 2951, 895, -4080, -6784, -1477, -1509, -46, 534, -1410, -8913, -4126, 326, 5087, 1623, -101, 5500, 8142, 4939, 6780, 9888, 6702, 9673, 4555, -543, -2538, -2812, 35, -562, 2363, 1480, -980, 3068, 1185, 2424, 949, -4679, -1617, -7458, -5168, -3891, -3486, -918, -2693, -320, -1817, -10645, -11294, -9471, -10792, -7098, -4756, -6532, -9870, -13021, -4782, 851, -1031, -3109, -8331, -11910, -11648, -7762, -8765, -13764, -11030, -3574, -721, 1219, 2335, 4723, 5143, 9650, 9711, 10573, 6614, 7849, 9361, 8202, 6621, 2256, 2517, 700, 7279, 12966, 8150, 3903, -2062, -3500, -3549, -3562, -1510, 1079, -420, -1443, -7135, -13403, -13014, -8153, 2545, 3675, -3072, -10946, -10709, -8373, -9126, -5224]
12682e224j573K907k551Q88J673O240Q745k833j050l16n21o659l151K513q465
12667i377k26N006J502l273J769P413N36k766n367l68N077O545q662m98l176j382
12651g247M345j720O303J71n551o374P41N265M286k934J312O175L593K123q959
12636A529m127p109K484L648J054K75P990j484J337m59M811l62M39l426j063l73
12620E164l233N710r75o41m17M228m706p790q010J0680O122P690R757q451K565
12605A7693N324o399r204j132L459j850M703P031L317k193q48r186n125K734O334
12590A4658L918m11L356k713R72N500N734l108k051L133Q440N594O542j254L281
12575E1591L906M092M175P300K729N08N059K481J917Q465J3239P412Q837k071
$$ y = [-5224, -6797, -3890, -6441, -5553, -3880, 2360, 11105, 8272, 7222, 6906, 6385, -274, -3425, -912, -9377, -9603, -4597, -3095, -6368, -4599, 2814, 3350, 584, -4783, -5151, -74, 6471, -2191, -2689, -5865, -7247, -2902, -4622, 1681, 1852, -3699, -10073, -9332, -4067, 219, -2715, -1403, 4772, 8365, 10488, 1529, -2598, -9707, -7223, -3575, -2521, -2246, 5744, 4260, 5597, 5138, 9949, 9587, 10026, 6600, 5537, 5164, 1931, 7641, 6666, 6025, 5608, 9836, 5130, -2660, -10670, 10, 6132, 13822, 23579, 15128, 17693, 23017, 16618, 7414, 6282, 9741, 7891, 12594, 19625, 22942, 20749, 19901, 10715, 5590, 8324, 14658, 18576, 18165, 21521, 18808, 19780, 25280, 31014, 27906, 25855, 28988, 37428, 43022, 49564, 48310, 51591, 55497, 59589, 63764, 71064, 73793, 74301, 79360, 81841, 83758, 92223, 105462, 112874, 121711, 119640]
12561A19640J083m760q107m194j328J995M065M624N983p4J4366K1787J9219K6661
12547B00960K7266J8181J2634R776O745l386r009j2504k4139k2203j2412j5683
12535A76226k1809q067j293k978M203J2466R544K0595M544O208J0687J5553J5749
12522B41628K2659K7052O120l478r560j0174j2971k1418k0431j8515j6949k6465
12510A57498k0181j5598r399l197o192n246j65k596p095l909J104k744k253m589
12496G5438l399j528R840O220N776N080K551N235P580K165J801n22J2511J9843
12482A48591J8815J9880K4209K3450J1222J0771K2391J0811j982j0023j8473j5654
12470B44008k0271k6054j8023k1539j9387j3772j5675j1709j0559j2550r892j6031
$$ y = [119640, 120723, 115963, 107856, 103662, 102334, 104329, 108394, 113018, 119001, 118927, 133293, 155080, 174299, 200960, 228226, 246407, 259041, 268817, 275562, 272176, 263167, 250663, 226524, 204321, 191909, 176226, 154417, 146350, 145057, 142079, 146282, 158748, 168292, 188887, 193431, 199639, 210326, 225879, 241628, 264287, 291339, 297459, 293981, 284421, 274247, 261276, 239858, 219427, 200912, 183963, 157498, 137317, 121719, 112320, 109123, 102931, 97685, 97520, 94924, 87829, 83920, 85024, 82280, 80027, 75438, 72039, 70511, 80351, 86571, 92347, 97427, 99978, 105213, 112793, 114958, 116759, 116237, 128748, 148591, 167406, 187286, 211495, 234945, 246167, 256938, 279329, 290140, 288158, 278135, 259662, 244008, 223737, 197683, 179660, 158121, 138734, 124962, 109287, 97578, 87019, 74469, 64577, 48546]
12458D8546l627k411J198l448J847L570l898o911n672k814L308N104k130N304
12444C7966O004k204l735L313L221L040k562P344J1586N617R117J0428Q164O428
12430A03727N150o555n103m440m115m473j2146o055j1336o343l662K415K207k477
12416D6794m105p133p781R24p2k152n452m667N70M95O35K331l709j396M037q843
12400A0476j891p90L023J0248N228K326k615m060O39k114O96J214l26J0808Q305
12385D1167J1724K754m073o091J27J509N7m066k067q48m980n293n405o148K871
12370B1238M802J470p90n289l571M219K312l449k008L46k011L43O818O41j13n156
12354A9802J815L025J446j342P605K828k20n648o278k026M660P39j845J540J226
$$ y = [48546, 44919, 42508, 43706, 40258, 42105, 45675, 41777, 34866, 29194, 26380, 29688, 34792, 32662, 37966, 43970, 41766, 38031, 41344, 44565, 47605, 45043, 52387, 63973, 69590, 78707, 89135, 97299, 103727, 108877, 102322, 97219, 92779, 88664, 84191, 72045, 65990, 54654, 48311, 44649, 47064, 49271, 46794, 42689, 35556, 27775, 28699, 28627, 26475, 21023, 16356, 16926, 17421, 18056, 20387, 16678, 15282, 19319, 10476, 8585, 7795, 10818, 21066, 26294, 28620, 26005, 21945, 22584, 20470, 21166, 22380, 22054, 32862, 41167, 52891, 55645, 51572, 45481, 45608, 47117, 47174, 43108, 41041, 40193, 35213, 29920, 24515, 18367, 21238, 26040, 27510, 26720, 21431, 17860, 22079, 24391, 20942, 18934, 19280, 17269, 17612, 24430, 25071, 24958, 19802, 21617, 24642, 26088, 24746, 32351, 35179, 34959, 29311, 23033, 21007, 25667, 26406, 24561, 26101, 27327]
12339B7327q451m318J14N765M662K409q619m43M655N335J361r400O34L816L167
12324B8014m350j630O859k253l529o834m857L566j809j93L02J968K521k987k173
12309A2615L500l01l162L523J11p62k501p31J589M512J0851Q212j0145j2493L16
12294A5134N376Q045O79O107m037l391k774N848J023l238m910M41K106N762p38
12279C1433K25l663J615k078M815O326J103J131j965Q39m024n342K896M313l384
12264C4240J156N923M300m756j24Q651P615L768m798l534R960N646P169p10o334
12249F8172m945q88K933L105Q739O808N57o553k423j908J595k099K323K030P492
12234H4938Q574K546o33O814N71m55q825m89O289Q22N678l420J813P561J1242
$$ y = [27327, 18876, 14558, 14672, 20437, 25099, 27508, 18889, 18446, 23101, 28436, 29797, 20397, 21031, 24847, 28014, 23664, 22034, 28893, 26640, 23111, 16277, 11420, 14986, 13177, 12984, 13286, 15254, 17775, 14788, 12615, 16115, 15814, 12652, 16175, 16286, 15524, 13023, 12292, 13881, 18393, 29244, 37456, 27311, 14818, 15134, 20510, 28555, 29234, 35341, 31304, 27913, 25139, 30987, 32010, 28772, 23862, 24303, 26409, 32171, 31433, 31658, 27995, 29610, 27532, 32347, 38673, 39776, 40907, 38942, 39781, 35757, 30415, 33311, 37624, 34240, 35396, 41319, 45619, 40863, 40739, 49390, 57005, 60773, 55975, 52441, 62401, 68047, 75216, 74506, 68172, 63227, 62339, 65272, 68377, 77116, 83924, 84481, 77928, 75505, 73597, 75192, 73093, 75416, 77446, 84938, 93512, 96058, 95425, 102239, 102810, 102355, 93530, 93041, 99330, 100152, 105830, 102410, 104223, 111784, 123026]
12219A23026J971m537L25P970M042N535M863m327m927O640Q178K526N74J498R064
12204A62421K558K511L646J321P835O717M793Q536J245Q90R293J0663M447P011
12190B33887N510J995R479J7167J3847O461N179J2758J7772K0838J9201J1013
12178C75107J4800K2175K0797K6583K5907K6360K9101K5901L3293K6368L1389
12167F57781L9592M9424M3398M9170N6835O8326P7905Q8430Q5634R7346J18097
12156A431938J41445J55596J73785K04987K28215K68240L16118L78323M41152
12147C739799M91923N31245N68344O12256O55242P00846P93750R53324J232476
12138A0279205J670912K301909L135781M065136M848665N243719N146866M546864
$$ y = [123026, 124997, 120460, 120785, 128755, 132797, 138332, 143195, 138868, 133941, 140581, 148759, 151285, 151859, 153357, 162421, 164979, 167490, 171136, 172457, 180292, 187009, 191802, 200338, 201583, 202473, 211766, 222429, 226876, 233887, 239397, 241392, 250871, 268038, 281885, 288346, 293525, 306283, 324055, 344893, 364094, 375107, 389907, 412082, 432879, 459462, 485369, 511729, 540830, 566731, 600024, 626392, 657781, 697373, 746797, 790195, 839365, 896200, 964526, 1042431, 1130861, 1216495, 1313841, 1431938, 1573383, 1728979, 1902764, 2107751, 2335966, 2604206, 2920324, 3298647, 3739799, 4231722, 4762967, 5331311, 5943567, 6598809, 7299655, 8093405, 9046729, 10279205, 11950117, 14252026, 17387807, 21452943, 26301608, 31545327, 36692193, 41239057]
12130D1239057L450574J832660j70655k233518l918142n000597n515587n539827
12122B4143965n129134m328825l315807k367570j628019j123719q01543o10270
12114D839078n00844m36620l83024l56213l32275l00177k68889k42139k16048
12105A802849j99549j89317j66117j30834j08823q6393p4154o1214n2989m7166
12095F86293m1206l3590m1670l0169l0860k8383l0773k3602j6734k1555j3129
12084C74622j3923j9103j3656r420j1606j3473l911r682q105r095r530p946m081
12071B41091n961o126r937q813k723r538r948R84p618m974p712n414p569j1954
12057A43788o867o361o101j933K67m689n918n540k462j750l068r25r193m279P170
$$ y = [41239057, 44689631, 46522291, 46351636, 44118118, 40199976, 35199379, 29683792, 24143965, 19014831, 14686006, 11370199, 9002629, 7374610, 6250891, 5449348, 4839078, 4338234, 3901614, 3518590, 3162377, 2830102, 2529925, 2261036, 2018897, 1802849, 1603300, 1413983, 1247866, 1117032, 1008209, 921816, 847662, 786448, 733459, 686293, 645087, 611497, 569827, 539658, 508798, 480415, 449642, 426040, 409306, 387751, 374622, 360699, 341596, 327940, 318520, 306914, 293441, 289530, 279848, 271743, 262648, 253118, 245172, 241091, 235130, 229004, 219067, 210254, 207531, 197993, 188045, 189029, 181411, 176437, 168725, 163311, 155742, 143788, 136921, 130560, 124459, 122526, 122793, 118104, 112186, 106646, 104184, 102434, 99366, 98441, 89248, 84969, 92139]
12042I2139k940k023j387k218l990J109j52j959n326o429M57j915m272k174p103
12027E1817m294O14j81j333L567K822j94K715k498j998k801r503l046j33R71M564
12011D1089j116N531N030K486n219R75J723k138m041J99n13J595O391M79o14J427
11995E3284K407l027J219J193M321J153l458K648m359o43J392n116K25J556j19
11980E2676m948n318Q81k242m542j932j409p78O574Q540j537O82l750p897m026
11965C0974m139J863Q017p92j938J709n778p310N474R428j796p500o689N880R172
11950C6575N191m338j924n52j798m884k833K355L352n46j0569m986K138l492m293
11935I396k362M233K098o971l42J115l279J628j455j608N953k240N556L260n292
$$ y = [92139, 89199, 87176, 85789, 83571, 79581, 80690, 80538, 78579, 73253, 66824, 67281, 65366, 61094, 58920, 51817, 47523, 48137, 47956, 46623, 50190, 53012, 52818, 55533, 53035, 51037, 48236, 38733, 35687, 35554, 36525, 41089, 39973, 45504, 50534, 53020, 47801, 48776, 50499, 48361, 44320, 44519, 44006, 45601, 51992, 52471, 51857, 53284, 55691, 52664, 53883, 55076, 59397, 60550, 57092, 59740, 55381, 54738, 56130, 51014, 51239, 52795, 52676, 47728, 42410, 43291, 41049, 36507, 34575, 33166, 32388, 38962, 47502, 45965, 46647, 42897, 35000, 30974, 26835, 28698, 36715, 35923, 33985, 35694, 29916, 22606, 28080, 37508, 35712, 28212, 21523, 27403, 36575, 41766, 37428, 35504, 34952, 33154, 28270, 25437, 27792, 31144, 30598, 20029, 15043, 17181, 13689, 9396, 7034, 11267, 13365, 6394, 6052, 7167, 3888, 5516, 4061, 2453, 8406, 6166, 11722, 14982, 9690]
11920I690n538O39M421j322Q58l766p329q2M717N847J366R489l594m039o14J865
11904A2608k057J522P886N02N284r709p208J055o40n258K376R294N324l918l834
11889A3227p906K378M565j570O98K675L53r611K250J337N816k77j315j573j982
11874I065J509q13l348L01O179Q69m469J42L199k181k378j770P793P406o159J728
11858A7073l7m942q40L202L030L99r238L267K767M4k444j190o600m222K146J525
11842C940R25K696k609o168M29O097Q236k557j118N88j552o681n585J521Q864
11827G026J240k637K038q42K307L959Q2q92P289J463k017j263J278K015n666m183
11811A1197J16M043J423J092n675l857J052n72k651m412N209R290J378m908k248
$$ y = [9690, 4152, 4791, 9212, 7890, 8748, 4982, -2347, -2429, 2288, 8135, 9501, 18990, 15396, 11357, 10743, 12608, 10551, 12073, 19959, 20461, 25745, 16036, 8828, 9883, 9243, 3985, 6361, 15655, 20979, 17061, 13227, 5321, 7699, 12264, 10694, 11392, 14067, 14420, 4809, 7059, 8396, 14212, 13935, 12620, 11047, 9065, 10574, 9761, 6413, 6714, 12893, 13762, 9293, 9435, 12634, 10453, 8075, 6305, 14098, 21504, 15345, 17073, 17036, 12094, 11254, 14456, 17486, 17885, 8647, 11914, 14681, 14725, 12281, 11091, 4491, 269, 2415, 3940, 4865, 7561, 4952, -1216, -787, 5310, 13546, 10989, 9871, 10459, 8907, 2226, -3359, -1838, 7026, 8266, 5629, 7667, 6825, 9132, 13091, 13173, 12281, 19570, 21033, 19016, 17753, 19031, 21046, 15380, 11197, 11313, 15356, 16779, 17871, 12196, 8339, 9391, 8819, 6168, 1756, 6965, 16255, 17633, 12725, 10477]
11796A0477n145k930k350L238M445l109J925l077l940J495K554j416l217N910
11782D860R960k1k276j138j846k030P56L64k735o29K378R91O56P337O860r332
11766A4155j5322n363k631N968L689K455K804m919J21J092M860J441k556K946
11752H740K816o08M096K287J209m963r719l955O376K811k180L097N933l359k252
11737A0329K056p67q23J725P17q995K545J0533L820l085N24M789O595K694N312
11722C7969P931O810R065O97M040M026J5696J4102R942K0281L1021K6427J9354
11709B07361P353J0414O830q979k3505k9737k4588j6843k0419k5687j7207j411
11697F3582r690n294j554l459n276k198l027r559m541n754j506n025l467j252
$$ y = [10477, 5332, 2402, 52, 3290, 7735, 4626, 6551, 3474, -466, 1029, 3583, 2167, -1050, 4860, 14820, 14799, 12523, 11385, 9539, 7509, 8265, 8629, 5894, 5265, 7643, 8634, 9290, 16627, 23487, 14155, -1167, -6530, -9161, -3193, 496, 2951, 5755, 836, 957, 2049, 6909, 8350, 5794, 8740, 11556, 10948, 15044, 17331, 18540, 13577, 3858, -97, 6279, 9090, 6910, 10007, 15940, 12581, 10329, 12385, 11618, 10795, 12520, 13237, 4242, 6787, 17320, 21140, 18055, 18579, 23368, 29963, 32657, 37969, 45900, 52710, 61775, 62472, 66512, 70538, 86234, 100336, 110278, 130559, 161580, 188007, 207361, 214714, 225128, 231958, 222979, 199474, 169737, 145149, 128306, 107887, 82200, 64993, 63582, 53892, 48598, 47044, 43585, 38309, 36111, 33084, 23525, 18984, 13230, 11724, 6699, 3232, 1980]
11683A980M461R515n854j0078m363O11K016M180j79K504M111l575N88j844J153
11668E226N482N274o253J433k477l006l589N947r05l48K429m153N1L901l673k343
11652B996n03L939l232m588R727j636n783p458J854Q71M861K533R043K28j732
11637A1120J093k059j51k300j0434k204O893Q369n030k368N224l705j1380L55
11623f577J0541l455K298m319p14N961M084o478j717k083j252J305M712K158K407
11608F871P574q74q614N02k900R16Q749l78p043o472R745L841L059k511j702j199
11592I564k071l261q000O766R523j437m826J822N579K188l051m475n890p324n709
11577a0602k090K103J0673N230k013K967j502J165L155r12j383l97O967j708n213
$$ y = [1980, 6441, 15956, 10102, 24, -4339, -3728, -1712, 2468, 2289, 4793, 8904, 5329, 5917, 4073, 5226, 10708, 15982, 9729, 11162, 8685, 5679, 2090, 8037, 7132, 6784, 9213, 5060, 5111, 9012, 5339, 2996, 2493, 6432, 3200, -1388, 8339, 6703, 920, -6538, -4684, -3813, 1048, 3581, 12624, 12852, 11120, 12213, 10154, 10003, 7703, -2731, -4935, 1958, 10327, 5297, 2929, 8153, 4448, -6932, -6577, 3964, 509, 2807, -1512, -2226, 3735, 7819, 1341, -376, -2459, -3711, -2406, 2306, 4464, 6871, 14445, 13571, 4957, 5459, 2559, 3475, 12224, 11846, 4803, -1669, 8076, 11917, 14976, 12465, 10763, 9564, 7493, 4232, -3768, 2998, 12521, 11084, 6258, 8080, 13659, 15847, 12796, 8321, 2431, -4893, -10602, -12692, -10589, 84, 5314, 3301, 6268, 4766, 5931, 9086, 8174, 6791, 6394, 13361, 11653, 6440]
11562F440J195k428Q346L334o900j2482l731k09M604K076J587K351k392o76M667
11547E782j969o24k749k488Q87K320M241O14j195M7j918j310k319m484M736N133
11531D704L765J217J546k657o146L489j426j1904l403O879j033K8n206K229R592
11516A674L616l00oLl733q46Q7k159r435j247L065l44P986N318k509k623l972
11499e425M64L812M09L909P448k638k160j161n402j784P870Q11k191O192l155
11484F999l320L403K150k478R268j935k710j038o267L6l550l055L316O40m888
11469c429J507P317L203K715j305j0198k835J102K862M723O457p457N37l338j239
11454F22j711O92M636O793M036M471j649l403q57k979L913l854k298m243q347
$$ y = [6440, 7635, 5207, 13553, 16887, 9987, -2495, -6226, -6435, -1831, 245, 1832, 4183, 1791, 1115, 5782, 3813, 3189, 440, -2048, -1161, 1159, 5400, 6014, 4819, 4866, 2948, 1638, -681, -5165, -429, 4704, 8469, 9686, 11232, 8575, 2429, 5918, 4492, -7412, -10815, -3936, -4969, -4941, -10147, -7918, 1674, 5290, 4990, 4984, 4987, 1254, 408, 495, -1664, -11099, -12346, -9281, -9625, -1639, 3679, 1170, -1453, -5425, -4961, -1149, -740, 3169, 10617, 7979, 5819, 4658, -744, -2528, 5342, 6153, 3962, 10154, 6999, 3679, 7082, 9232, 6754, 16022, 14087, 11377, 10339, 4072, 4108, 558, -2497, 819, 1459, -3429, -1922, 5395, 8598, 11313, 10008, -190, -3025, -1923, 939, 5662, 12119, 4662, 5199, 1861, 622, -1089, -397, 4239, 11032, 15068, 19539, 17890, 14487, 13630, 10651, 14564, 10710, 8412, 4169, -4178]
11439d178Q62O261O770j873n140n402j462O623Q605M441q004n359n546n182l013
11424a1597M790J851j533N29Q535O680j303K198r632J637P116M012l028p382j01
11409B772k294l555k241m893K216O528J1000P006m198l757K120k929K334N52l481
11394G180o456o413l698J3387O596K470J227k761j307j871r412q578P36L244J173
11379d483L39P308J769k235o714M048Q346K175m066l350k424K818K532l413j753
11364H97l029j830k385N24k9K97J594P75N571L558J407l255J430n6K3N252J381
11347A2125l682j823o185M52M151m16P149J914n325j992l295o758j915P37m239
11332i102M915k238j364L051L687J862K300L861k62L994j262n883o015Q784j835
$$ y = [-4178, -3316, 2945, 9715, 7842, 2702, -2700, -4162, 2461, 11066, 15507, 7503, 2144, -3402, -8584, -11597, -6807, -4956, -6489, -5960, 2575, 9255, 7952, 10150, 518, 2155, 9271, 13283, 10255, 2873, 2772, 478, -3077, -5318, -10211, -7995, -1467, 9533, 16539, 12341, 8584, 10704, 7775, 10109, 10661, 7180, 724, -5689, -9387, 4000, 10596, 13066, 14293, 11532, 10225, 8354, -1058, -9636, -8900, -5656, -4483, -4144, 3164, 4933, 2698, -4016, 32, 8378, 10553, 6487, 3137, 713, 3531, 6063, 2650, 897, -2132, -3962, -6347, -5823, -5852, -5555, -3961, -3186, 2385, 5943, 7350, 4095, 5525, 5469, 5492, 10744, 12125, 8443, 6620, 435, 887, 5038, 4622, 11771, 13685, 8360, 6368, 3073, -3685, -5600, -4863, -9102, -4187, -6425, -7789, -4738, -1051, 811, 3111, 6972, 6710, 10704, 9442, 3559, -2456, 6328, 4493]
11317D493J77j660M03j050J121L979O692q21n992l521j365J96K688j731p710p16
11301d817N054N351L118j471l917J167k611N196j018m409l59L421N994P134o878
11286A0955r921j337M665m896N124M877L64j662J781M569o791n939Q019O715N782
11271B2305M256m381n644k641N30N582l708m152L014N155n317q02j08M87M836
11256A9412N292l105P164L850l300J3601N580n721L587K0498K8019K7493K4392
11243A46762J9237J5070O186o988n654j7140k4976k4692k2071j9777j1649p366
11231D6942K454n243o788q505m530j43k086P76r278M986P975K039j408k456K198
11216B6933L021q245j1646m894M359k347M313M823p845m281k599M835j762p188
$$ y = [4493, 4670, 3010, 3413, 2363, 3484, 7463, 14155, 13334, 7342, 3821, 2456, 2652, 5340, 3609, -4101, -4817, 237, 5588, 8706, 7235, 3318, 4485, 1874, 7070, 6052, 1643, 1284, 4705, 10699, 17833, 10955, 1034, -303, 4362, -534, 4590, 9467, 9831, 8169, 9950, 14519, 7728, 1789, 9808, 16523, 22305, 26561, 22180, 16536, 13895, 14425, 20007, 16299, 12147, 15161, 20316, 14999, 14197, 14089, 14576, 19412, 24704, 21599, 28763, 32613, 29313, 42914, 48494, 42773, 46360, 66858, 94877, 122370, 146762, 165999, 181069, 187255, 180267, 174613, 157473, 132497, 107805, 85734, 65957, 54308, 46942, 49396, 44153, 37365, 28860, 24330, 24187, 22101, 22877, 13599, 18585, 26560, 28599, 27191, 24735, 26933, 29954, 21709, 10063, 5169, 9528, 7181, 11494, 16317, 8472, 4191, 1592, 6427, 4665, -2523]
11202b523l331l148M138L672M643R25j358J360n244Q431L079M101m861l636Q062
11187A4310O682L062O24j218j56m297l062o521P72N407M222l942J74P004n08m583
11171A7970m148o209m30L923L538k409j886m387n531k870M027L016R2J615K36
11156F547K946M692P2J205j683j304j80J251m54M011j1540p575O201Q985m56j809
11140A0909J458M947o336m794q201Q68O310L928J634n5m32l262k61L074L692k27
11124A3252L19o575m545J138K636l027o824L116P296L052q463K964O141p5o068
11109D337j291K80J710K450l626j063J322j736N607J0027j03m215n170n548P139
11094A0120K737j798J720L777L152l027r4m6L982j398j433m883M38k709J863L07
$$ y = [-2523, -5854, -9002, -4864, -1192, 3451, 4376, 3018, 4378, -866, 7565, 10644, 14745, 9884, 6248, 14310, 20992, 24054, 24678, 23460, 23304, 19007, 15945, 9424, 10196, 15603, 19825, 15883, 16057, 23061, 22553, 17970, 13822, 7613, 7183, 11106, 14644, 12235, 10349, 5962, 431, -2439, 1588, 4604, 4696, 6311, 6547, 9493, 14185, 14257, 15462, 13779, 12475, 12295, 13546, 13092, 17103, 5563, -2012, 4189, 13174, 12718, 10909, 12367, 17314, 10978, 6184, -2017, -1149, 5161, 9089, 10723, 10668, 10236, 6974, 6713, 9787, 13479, 13252, 13571, 6996, 2451, 3589, 6225, 3198, -3626, -510, 6786, 9838, 1375, 4339, 10480, 10405, 4337, 3046, 3326, 5036, 7486, 3860, 2797, 4119, 2383, 7990, 18017, 17914, 13699, 8529, 2981, 10120, 12857, 11059, 12779, 16556, 19708, 16681, 16587, 16541, 20523, 19125, 17692, 12809, 13247, 10538, 12401, 12708]
11078A2708N333m59n696j097m41j101M04K255n421q630M415O089k234j2068j1757
11063a7700L254R151Q802M931K395K282k874k593o40J245K962q31o719k652N77
11048A590N919L526K607l65p10O759L658r017n376m31o40P79q48R12j296l747
11032C320P251L006j861r11O89M529J770o137o522M164J529M709J83J312O959
11017B3990o547l718J689R855K314m681r650L083J068l835n269j533K507l405
11003E868l691J686P521N930o25l604j068K978K55K892j193J74j878k525M949
10988A7669L662k623k642l800k882K635J226j593l021m040R167N40l601R03M788
10973A6388L667K38K836L29l492q413J662j732l647L228p67M472N687k220N800
$$ y = [12708, 18041, 17582, 11886, 10789, 10348, 9247, 9651, 11906, 6485, -2145, 2270, 8359, 6125, -5943, -17700, -14446, -5295, 3507, 8438, 10833, 13115, 10241, 7648, 7008, 8253, 11215, 10384, 3665, 1013, 1590, 7509, 11035, 13642, 13277, 12567, 19326, 22984, 13967, 8591, 8160, 7520, 8299, 7451, 8363, 7067, 3320, 10571, 13577, 11716, 10805, 11494, 16023, 17793, 11656, 5134, 9298, 10827, 15536, 15719, 17031, 23990, 17443, 13725, 15414, 25269, 27583, 22902, 13252, 16335, 17403, 13568, 8299, 6766, 9273, 5868, 2177, 3863, 11384, 17314, 16689, 13085, 12017, 14995, 15250, 18142, 16949, 17123, 15245, 12720, 17669, 21331, 18708, 16066, 12266, 9384, 12019, 13245, 11652, 8631, 4591, 13758, 14298, 10697, 11600, 16388, 20055, 20293, 23129, 23458, 19966, 11553, 13215, 11483, 7836, 11064, 10297, 14769, 20456, 18236, 24036]
10958B4036M732m654n037k177J959k431M252N072K306n75n329m781l775O512O843
10943B6953k684k83j229m080O71M703J929J543n93p512p908k974N087Q34o940
10928G517Q57O015O95J131l039q961k601N188J0026O307r128m291J2093Q600k125
10913B8284o972l402M086P547K864j728n452R45m189P82O646p5m455l168q70m258
10897A6585o70o51k355L383N962m395O161M728k745L670l481R82m986j0207N104
10882A7085R929O481J300k723l454m245k273k184P393M482R02m35m754p399J0269
10867C0374Q739k558j0219l011j646n14k743j451K873L635J998M434J88R76n609
10852B5466K922L845K639J057p02N505j123j513L749L712m172p103k268M902K041
$$ y = [24036, 28768, 24114, 19077, 16900, 18859, 16428, 20680, 25752, 28058, 27483, 22154, 17373, 13598, 20110, 26953, 24269, 23986, 22757, 18677, 19348, 24051, 25980, 27523, 26930, 19418, 11510, 8536, 13623, 14457, 7517, 8374, 14389, 15084, 16215, 13176, 4215, 1614, 6802, 16828, 23135, 14007, 9716, 21809, 30409, 28284, 21312, 17910, 21996, 29543, 32407, 30679, 25227, 26172, 21983, 22765, 29411, 29336, 24881, 21713, 20843, 16585, 15915, 15264, 12909, 16292, 22254, 17859, 24020, 28748, 26003, 29673, 26192, 27174, 22188, 11981, 17085, 27014, 33495, 34795, 32072, 28618, 24373, 22100, 19916, 27309, 31791, 32693, 32258, 27504, 20105, 30374, 39113, 36555, 26336, 23325, 21679, 21165, 18422, 16971, 19844, 23479, 25477, 29911, 30099, 31075, 25466, 28388, 32233, 34872, 35929, 35227, 40732, 39609, 38096, 41845, 45557, 41385, 34282, 32014, 36916, 38957]
10837C8957n05o171n764P739O512K276p01n632L287J746k729QO773P483L443R15
10821E7637L168m83q242l756l895K288L174J0162J048l472n224j088J270P940
10807F0527O40m994L330O389M93L638Q243J559J856K405l875m761j342J1278K073
10792H7459k449N332L874j640j456K778J240Q06l372n565N107N340N838l080m09
10777I9803O249j152K603j744M347N766J408L89J804Q163J832J414j223k305O217
10762A33571L039M524N40L763K508l478n409j087L442o350J427Q59J388m199j0999
10747A23539n613P9M246J517p417k64J344q901J146O666n6L200j23n348k960K849
10731A13904p651o61M391N266K034m368p362l131O065N148J33J240o871n22O380
$$ y = [38957, 38452, 32281, 26517, 34256, 40768, 43044, 42343, 36711, 39998, 41744, 39015, 39023, 45796, 53279, 56722, 57637, 60805, 60322, 52080, 48324, 44429, 46717, 49891, 60053, 61101, 57629, 52405, 51317, 52587, 60527, 61167, 56173, 59503, 65892, 66385, 70023, 78266, 79825, 81681, 84086, 80211, 75450, 74108, 85386, 87459, 85010, 90342, 94216, 92576, 91120, 93898, 95138, 95944, 92572, 87007, 92114, 97454, 103292, 100212, 99803, 106052, 104900, 107503, 105759, 110106, 115872, 117280, 117669, 119473, 127636, 129468, 130882, 129659, 127354, 133571, 136610, 141134, 141674, 145437, 147945, 144467, 139058, 137971, 141413, 135063, 136490, 137349, 138737, 134538, 123539, 117926, 118005, 122251, 123768, 116351, 116087, 117431, 108530, 109676, 116342, 116286, 119486, 119363, 114015, 111055, 113904, 106253, 105592, 109983, 115249, 117283, 112915, 105553, 102422, 108487, 113635, 113768, 115008, 108137, 107615, 113995]
10716A13995j006o226q461p461j435N47m897J2O835J554n599n745J850k601m813
10701G6549l998K107m954k850M901M904L37N86N70P203l820j682J807r9O06j330
10685H0837l292o73m65m462k444p957L86M589N226K04r186m229K359J182j107
10670F0968K844l296M403Q107J489O696k747j0011k43M928K086j0661p219N405
10656F2749M514P652k978M410O37K894l20q265m896M842R950R70m682l757m671
10641F9049L151K639j669N28M778J1273M098j521p073m089J483l612L07N498K32
10626H5072J1714J0932j86o555n657n278L120K218P846j206j140M42n863j524
10612I3935M848M546M035J292m428R36M240J62j853k48r08n991J359N088Q192
$$ y = [113995, 112989, 106763, 98302, 90841, 89406, 89953, 85056, 85068, 91903, 93457, 87858, 82113, 83963, 81362, 76549, 72551, 74658, 69704, 66854, 71755, 76659, 76996, 77582, 78152, 85355, 81535, 79853, 81660, 81561, 82167, 80837, 77545, 76872, 76407, 71945, 69501, 61544, 61930, 66519, 71745, 71949, 62763, 58534, 60893, 62075, 60968, 63812, 60516, 64919, 73026, 74515, 81211, 78464, 68453, 68210, 73138, 75224, 64563, 57344, 62749, 67263, 74915, 71937, 76347, 76984, 79878, 79558, 71293, 66397, 71239, 81189, 82159, 77477, 73720, 69049, 72200, 74839, 73170, 73698, 78476, 89749, 93847, 92326, 85253, 81164, 82647, 79035, 79342, 84840, 85072, 96786, 107718, 107532, 100977, 95320, 90042, 93162, 95380, 103226, 102020, 100880, 101322, 95459, 93935, 98783, 103329, 107364, 108656, 104228, 105164, 109404, 109566, 107713, 107465, 106557, 100566, 101925, 107013, 115205]
10597A15205L248j570L355J038n74J234M289Q66K126N856P206m906j0517K195
10583A29051K311P121L613k081l364l48o113j296J0419L570j836j479n147l247
10569A31174P597M617k722J039J97m493L802J1769J434j372J462M94K124K682
10555A59804K41j704J978K055K796P635J583J21K421m999k804o80M653P465R599
10540A90164n025j5139o72J0345J4112L364o044M131J228r51N63j677N704l052
10526A97051m556Q562O137L089o96K680K706Q355K414K302L067Q09J168K109J830
10511B37027R414J0747O18J721O603q56L807P467K255L728L054N208j829N300
10497B94264J7226R617O27k678O062J2578P055J969K33j740l28Q689P284N339
$$ y = [115205, 118453, 116883, 120238, 121276, 120702, 121936, 126225, 127091, 129217, 135073, 142279, 137373, 126856, 129051, 131362, 138483, 142096, 140015, 136651, 136303, 130190, 128894, 139313, 142883, 141047, 139568, 134421, 131174, 138771, 143388, 140666, 141705, 141902, 137409, 141211, 152980, 154414, 153042, 154504, 154998, 157122, 159804, 160045, 158341, 160319, 162374, 165170, 172805, 174388, 174509, 176930, 171931, 169127, 168447, 173100, 180565, 190164, 185139, 170000, 169328, 179673, 193785, 197149, 191105, 195236, 196464, 195513, 196076, 194399, 200103, 197051, 192495, 201057, 207194, 210283, 209587, 212267, 214973, 223328, 225742, 228044, 231111, 231920, 233088, 235197, 237027, 246441, 257188, 257806, 259527, 266130, 265274, 269081, 276548, 278803, 282531, 285585, 290793, 288964, 294264, 311490, 321107, 321734, 319056, 325118, 337696, 344751, 346720, 346953, 345213, 344885, 353574, 360858, 366197]
10483C66197O024O045J2269O360K928J554Q375L908M822Q383M022K573O904Q189
10469D48553J9024J1311K883R332L017M655J2868J2436J4031J0195J1228J0644
10457E70177J3290J6253Q695J0722J0752J9160J0206R639J2965J7452J0727J7861
10445G27899J8895J7125J1232J6298K2127J6187K0103K1606K5375K6243K8699
10434I51789K6609L2974L5423K8193K6043K5695K8640L7554M4073M6053L7569
10423A320615L2733N0954M5112N0328N7838O2621O4909O4212N7204O7672P8763
10412A952961Q2543Q6120R0083R4370J02089J08881J22358J30912J39144J48513
10402C057974J50849J62045J81030J89486K02447K19765K37458K49625K64414
$$ y = [366197, 372221, 378266, 390535, 396895, 399823, 401377, 409752, 413660, 418482, 426865, 430887, 433460, 440364, 448553, 467577, 478888, 481771, 491103, 494120, 498775, 511643, 524079, 538110, 548305, 559533, 570177, 583467, 599720, 608415, 619137, 629889, 649049, 659255, 668894, 681859, 699311, 710038, 727899, 746794, 763919, 775151, 791449, 813576, 829763, 849866, 871472, 896847, 923090, 951789, 978398, 1011372, 1046795, 1074988, 1101031, 1126726, 1155366, 1192920, 1236993, 1283046, 1320615, 1353348, 1404302, 1449414, 1499742, 1557580, 1620201, 1685110, 1749322, 1806526, 1874198, 1952961, 2035504, 2121624, 2211707, 2306077, 2408166, 2517047, 2639405, 2770317, 2909461, 3057974, 3208823, 3370868, 3551898, 3741384, 3943831, 4163596, 4401054, 4650679, 4915093]
10393D915093K74921K94701L21020L47718L64099L80089L96332M14205M24451
10384H132629M39847M48971M43484M43810M24393L97643L69504L21285K74661
10375A1696227K37365J93759J46743J05786Q7063P4989P6703R2628J32399J94300
10365A3037962K63337L39384L86756M09433M22184M15228L94311L33526K34281
10356A6236402J39548P0354L0524J9725J5327N651J3138L8257P2247Q4477O8243
10345A6793893L9710K998l6340o7763j16084j69868k19297k34115k60573k88137
10335A5444424k99478l20106l33239l17854l06081k95240k68658k49904k32570
10326A2821294k14883j80066j38688j12457q2325m7701j6469M589K6137L6548
$$ y = [4915093, 5190014, 5484715, 5805735, 6153453, 6517552, 6897641, 7293973, 7708178, 8132629, 8572476, 9021447, 9464931, 9908741, 10333134, 10730777, 11100281, 11421566, 11696227, 11933592, 12127351, 12274094, 12379880, 12466943, 12541932, 12618635, 12711263, 12843662, 13037962, 13301299, 13640683, 14027439, 14436872, 14859056, 15274284, 15668595, 16002121, 16236402, 16375950, 16446304, 16476828, 16496553, 16511880, 16517531, 16530669, 16568926, 16641173, 16725650, 16793893, 16833603, 16836601, 16800261, 16732498, 16616414, 16446546, 16227249, 15993134, 15732561, 15444424, 15144946, 14824840, 14491601, 14173747, 13867666, 13572426, 13303768, 13053864, 12821294, 12606411, 12426345, 12287657, 12175200, 12092875, 12045174, 12028705, 12033294, 12059431, 12095979]
10316A2095979M6547N9731N0847K7386o150l9187p5139j36714j96341k53284l05342
10305A1268333l57747m11201m47308m64360m79404m83028m76780m68745m43212
10296G236548m24942m07595l87395l66067l37643l12224k95119k69913k50974
10287D184676k36977k21749k00322j87044j76554j55422j41929j37516j34050
10278B593113j25304j11510j07738r9725q8135q3409q5629p9102o6052o2744n8518
10267A625247n8563n6199m8209m9349m7219n3050m3256m1684l8973l1424l0127
10256A127194l6421l1376k6237l3652k8971l1825k3876k8058j8698k1332k4980
10245H21768k2526j6931j8020j3897j6839j7819j7876j7780k0218j8706j5065
$$ y = [12095979, 12142526, 12202257, 12253104, 12280490, 12274340, 12235153, 12160014, 12023300, 11826959, 11573675, 11268333, 10910586, 10499385, 10052077, 9587717, 9108313, 8625285, 8148505, 7679760, 7236548, 6811606, 6404011, 6016616, 5650549, 5312906, 5000682, 4705563, 4435650, 4184676, 3947699, 3725950, 3525628, 3338584, 3162030, 3006608, 2864679, 2727163, 2593113, 2467809, 2356299, 2248561, 2148836, 2060701, 1977292, 1891663, 1812561, 1746509, 1683765, 1625247, 1566684, 1510485, 1462276, 1412927, 1365708, 1312658, 1269402, 1227718, 1188745, 1157321, 1127194, 1090773, 1059397, 1033160, 999508, 970537, 938712, 914836, 886778, 868080, 846748, 821768, 799242, 782311, 764291, 750394, 733555, 715736, 697860, 680080, 659862, 641156, 626091]
10234F26091r959p922o795j7421o448p227j6142q248r155r752j467k960j7502
10221E05093o541k559j0228j1321r303j2359q569n489J464o987m565p627r810
10208D11199L092j961j857j789p492l210r627m959n484n921K593j763n320j0717
10194C56784j0053j1091k959m204J472K180q953j1525q864j31K888J694j983K503
10180C07758k540j5960q062K992l331m398m678n676l263l817p430p808j12m02
10166B43273l365k162m413n179N65j868n850m930q322o189j941m519L909K590
10152B01599p225J616p209n488K708k518j826q557k087j223q23M472j86m541m76
10137A68236n964k22k199n643q57j311M128p567k48O877l783j525n42k916m887
$$ y = [626091, 616132, 608210, 601415, 583994, 577546, 570319, 554177, 545929, 536774, 527022, 525555, 522595, 505093, 498552, 495993, 485765, 474444, 465141, 452782, 444213, 438724, 440188, 433201, 428636, 421009, 411199, 414291, 412330, 410473, 408684, 401192, 397982, 388355, 383396, 377912, 371991, 374584, 372821, 367501, 356784, 346731, 335640, 332681, 328477, 329949, 332129, 323176, 311651, 302787, 302656, 305544, 307238, 305255, 307758, 305218, 289258, 281196, 284188, 280857, 276459, 271781, 266105, 262842, 259025, 251595, 243787, 243675, 243273, 239908, 237746, 233333, 228154, 228719, 226851, 221001, 216071, 207749, 201560, 199619, 195100, 199009, 201599, 194374, 195990, 188781, 183293, 186001, 183483, 181657, 173100, 171013, 169790, 168967, 173439, 173253, 168712, 168236, 162272, 162050, 159851, 154208, 153351, 152040, 156168, 148601, 148353, 155230, 151447, 149922, 149380, 146464, 141577]
10122A41577k448l334l266R37K405p53J326j261j143L770O878j337j1299k901
10108A29151q154p950J134J1820N211n274j5188m804N740Q576k581n96k856m927
10094A09302k330K369j573k645J546k127j610q92J754K401l845K761l319j5N091
10079A06868O08m084q528l176N2J0155J278q382K361M0M119J546N241J502o312
10064A03288n743O163K695m566N62m521L901j057l029R65j313J883J0186K801
10050A12215j5705n938k310p074O060L616L259o763j731J365Q37L141j289j940
10036H7743n97l446M13j035p58L409K77m750l698K417K388j014j153j186K718
10021H1728N033M087p208l972n058l109J963K139J233k912K848O35J747j605k415
$$ y = [141577, 139129, 135795, 132529, 133466, 135871, 135118, 136444, 135183, 134040, 137810, 144688, 143351, 132052, 129151, 120997, 113047, 114181, 126001, 131212, 125938, 110750, 105946, 111686, 120262, 117681, 117085, 114229, 109302, 106972, 109341, 107768, 105123, 106669, 104542, 102932, 102040, 103794, 106195, 102350, 105111, 101792, 101777, 106868, 107476, 103392, 94864, 91688, 91740, 101895, 103173, 94791, 97152, 97192, 101311, 102857, 108098, 109600, 103288, 97545, 103708, 106403, 101837, 102399, 97878, 101779, 100722, 97693, 98658, 97345, 99228, 109414, 112215, 96510, 90572, 88262, 81188, 87248, 90864, 94123, 87360, 85629, 86994, 87831, 90972, 89683, 87743, 87146, 83700, 84113, 83078, 82320, 85729, 86006, 81256, 77558, 79975, 82363, 81349, 80196, 79010, 81728, 86761, 90848, 83640, 79668, 74610, 71501, 73464, 75603, 76836, 73924, 76772, 77407, 79154, 77549, 75134]
10006G5134k022j61O173J367k72K14n284r41L319M512r910l95K298j357m684O31
9990F8622L823J679J32K705k612r401M08N641M607N476P799j966j719o045j325
9975G7824K815j452R97J0642M52j124o75K186L595N767L244L503j103l843P853
9960A10681j425n54M557N182J214n973O46k597O296Q56L742O167L443k564k636
9945A27035j68q071j2164p492K356O639j95n561l188P168K809J798Q772L188p86
9930A22140k364K902L134N202O576o586q947K817O139J138j289J64k536k507o785
9915A19198k675K620J299J263j177m626o009p21k161m587j452j14o06L129O037
9900A09418J389l617J927J196j516J800J906r85m457o360K355p00n592o749p4
$$ y = [75134, 73112, 72951, 79124, 80491, 80219, 80433, 75149, 74208, 77527, 82039, 72129, 71734, 74032, 72675, 67991, 68622, 72445, 74124, 74256, 76961, 74349, 64948, 65356, 70997, 75604, 81080, 88879, 86913, 85194, 79149, 77824, 80639, 79187, 80184, 90826, 91278, 90154, 89479, 91665, 95260, 101027, 104271, 107774, 106671, 102828, 110681, 109256, 108702, 113259, 118441, 119655, 113682, 114328, 111731, 118027, 118883, 122625, 128792, 132235, 129671, 127035, 126867, 118796, 106632, 99140, 101496, 108135, 107940, 102379, 99191, 106359, 109168, 110966, 119738, 122926, 122140, 119776, 122678, 125812, 131014, 137590, 131004, 122057, 124874, 131013, 132151, 130862, 131026, 128490, 125983, 119198, 116523, 119143, 120442, 121705, 120528, 115902, 109893, 109172, 107011, 102424, 100972, 100858, 100252, 103381, 109418, 110807, 107190, 109117, 110313, 108797, 110597, 112503, 111518, 107061, 100701, 103056, 102356, 96764, 90015, 89941]
9885H9941k857J715j036k958k025j2535q127M38J213m50J46k732O088K93l477
9870F3637J91J20o379k505J611j946N947K862n378p74k093j749J0955J3754K1390
9855I9643J4534Q642O64j9179k1499k0207l275k861l905k244k314L168p65n070
9841D5332K965M034K026o883n430O829M180k282q155j917k894J605l796m507O501
9826C7608J2767K670o585j605J742P149r73j3612m074l214L123R639K353q236
9812C8752q195l276l368j432J909L456l532j01N094Q758K900q78l124p213M531
9797C4281M573P834L204l431j2239l221M749j315M888j299m096N182N756k783
9783D2083l394k434M105j602p27l561K111N438K723m179j637l707k172m928n222
$$ y = [89941, 87084, 88799, 87763, 84805, 82780, 70245, 62118, 62556, 63769, 63319, 63465, 60733, 66821, 67114, 63637, 63828, 63948, 57569, 55064, 56675, 54729, 60676, 63538, 58160, 57386, 55293, 53544, 64499, 78253, 99643, 114177, 122819, 123483, 104304, 82805, 62598, 59323, 56462, 52557, 50313, 47999, 51167, 50402, 45332, 48297, 52331, 54357, 47474, 42044, 48873, 53053, 50771, 42616, 40699, 37805, 39410, 35614, 31107, 37608, 50375, 53045, 46460, 44855, 46597, 53746, 52773, 39161, 35087, 31873, 34996, 44635, 46988, 38752, 30557, 27281, 23913, 22481, 24390, 27846, 24314, 24213, 29307, 38065, 40965, 40087, 36963, 29750, 34281, 38854, 46688, 49892, 46461, 34222, 31001, 35750, 34435, 39323, 38024, 33928, 39110, 44866, 42083, 38689, 36255, 40360, 38758, 38031, 34470, 36581, 42019, 44742, 40563, 38926, 35219, 33047, 28119, 22897]
9768B2897M881N486M965J058P189o842m012k72l346Q74P72J034l700l639p47L828
9752C0426R78p33M047M514M437L157K592J272n79l855p850j153q278l324Q227
9737C3878j214l396k314L841N578M557M468l6m096n072P21K281O011j619q440
9722C5148k039P19J438N102l229L886Q61o299p265P46M543K539r57j196m871l001
9706B6125N426M756O828P581L554j399l838K154j0055K989M628L499J145j0813
9692D2580n289n665m19P601L413J543Q18m732K820J912N426k253n197k254m714
9677C5590k300O706k448p261J780P240L785L374J088o211o362K240K619M323P28
9662D4891L331R219L713o425r583J29m117K879J849k099N893N852L411j307J174
$$ y = [22897, 27778, 33264, 38229, 39287, 46476, 39634, 35622, 35350, 32004, 32878, 33650, 34684, 30984, 27345, 26598, 30426, 31404, 30671, 34718, 39232, 43669, 46826, 49418, 50690, 50111, 46256, 38406, 37253, 28975, 25651, 33878, 32664, 29268, 26954, 30795, 36373, 40930, 45398, 45362, 41266, 36194, 36915, 39196, 45207, 43588, 35148, 33109, 33828, 35266, 40368, 37139, 41025, 41886, 35587, 28322, 29068, 33611, 36150, 35193, 33997, 29126, 26125, 31551, 36307, 43135, 50716, 54270, 52871, 49033, 51187, 41132, 44121, 48749, 52248, 53393, 42580, 37291, 31626, 31207, 38808, 42221, 43764, 44582, 39850, 42670, 44582, 50008, 47755, 42558, 40304, 35590, 33290, 39996, 37548, 30287, 32067, 39307, 43092, 46466, 47554, 41343, 34981, 37221, 39840, 44163, 44891, 48222, 57441, 61154, 54729, 45146, 45275, 41158, 44037, 45886, 43787, 49680, 55532, 58943, 57636, 58810]
9647E8810K008L114L514p391l341k054O327N231M430o064o751o468o142P543J2059
9632F4825K377o796p50J244L916L189L343l025J177Q188m67j737O123L675j776
9617H3506k062l236k102N129o03J487k302K460K813q54R37M110K613Q65N101j487
9601I6375r33M238M354M016L465j436j946L682P831Q199J002O482J366n54J989
9586A38130K996K513j91K43R440P407M727J106O565M01L423J3167Q735K582q36
9571B00408j601J995M173L591N858J1533k583j905N704K66K508M951J882M222
9557B41002K944M678M826K443O452l960p357O049J194N044J253k92j632q338l679
9542B50627n316j0752p107q191n707k648J846p460j568n791k958j534k372J182
$$ y = [58810, 60818, 63932, 67446, 60055, 56714, 54660, 60987, 66218, 70648, 64584, 57833, 51365, 45223, 52766, 64825, 67202, 60406, 59656, 60900, 64816, 68005, 71348, 68323, 69500, 77688, 77221, 75484, 81607, 85282, 83506, 81444, 78208, 76106, 81235, 80632, 82119, 79817, 82277, 85090, 84236, 85173, 89283, 91896, 92761, 97862, 96375, 95442, 99680, 104034, 108050, 111515, 110079, 108133, 111815, 119646, 127845, 128847, 135329, 136695, 136141, 138130, 141126, 143639, 143448, 143691, 153131, 160538, 165265, 166371, 172936, 173337, 176760, 189927, 198662, 201244, 200408, 198807, 200802, 204975, 208566, 214424, 225957, 223374, 221469, 227173, 227439, 229947, 234898, 236780, 241002, 243946, 248624, 253450, 255893, 262345, 258385, 251028, 257077, 258271, 263315, 264568, 264276, 262644, 254306, 250627, 245311, 234559, 227452, 219261, 213554, 210906, 212752, 205292, 203724, 197933, 194975, 193441, 191069, 192251]
9528A92251m191m222L087P085n34l190j06L925r96m460M342N225Q279M338m148
9513B06685l448o2n076q770k861J012q422J258l330m285K130p288o557l717p709
9498A49560m54n944r49K539k186M83P39M550R924P61N233j89K837O400L528J492
9482A78324n231q13K547L024M426N103k240p070l492J752p436r402q070J982l412
9467A49992p28m843j0249n936O386O858m539j2275j981q030K082j791m990l898
9453A06058N64P937N127R759o55P369K058m504p482M997J0107j724o351m310p577
9438A21373N56q602q99j855q599m140l545n660J293O027j284l853L072L8o64R74
9422I4232n419l226M070n330M7L892q81J655l346m660j268K622j669O444j254
$$ y = [192251, 188060, 183838, 186925, 194010, 193476, 190286, 190180, 194105, 193109, 188649, 192991, 198216, 206495, 210833, 206685, 203237, 203175, 198099, 189329, 186468, 187480, 179058, 180316, 176986, 172701, 174831, 167543, 160986, 157269, 149560, 149106, 143162, 142213, 144752, 142566, 143049, 143788, 148338, 158262, 159023, 164256, 164067, 166904, 173304, 176832, 178324, 173093, 172280, 174827, 177851, 182277, 187380, 185140, 178070, 174578, 176330, 168894, 159492, 151422, 153404, 149992, 149264, 144421, 134172, 128236, 134622, 141480, 136941, 124666, 122685, 114655, 116737, 114946, 109956, 106058, 106622, 114559, 119686, 129445, 128790, 136159, 138217, 133713, 126231, 131228, 141335, 139611, 133260, 128950, 121373, 121929, 113327, 112428, 110573, 101974, 97834, 94289, 88629, 89922, 95949, 94665, 90812, 93884, 93922, 93258, 94232, 88813, 85587, 89657, 84327, 84374, 88266, 87385, 89040, 85694, 81034, 79766, 82388, 80719, 87163, 85909]
9407H5909m490p35R57n434m146L494M183K143l49m140k660J33m187n428p875m270
9391E3105L11M653M990r3J378M453l229m848N474L247PJ930P887K5n417K153O871
9374H2897J271k059l008j247L23L896n412l442j514k833K426R09k788n77K204
9359G1046L962P598K031l96j436n006j177l4l256L130K140K385k166l663q2M429
9343G9505J767j063K211n02j020N237L324K507k051k109J300O324O150n442R23
9328I7061O463k210o518K289n162K659J0315P626J029M70o586p519O46M607l179
9313A01991j453P008Q265l109J976M783R229M591L388J237p765r164o69r22k391
9298A16995K067J392n352k166N908M938J476K856K910k565J90O764O310k746m132
$$ y = [85909, 81419, 80684, 81641, 76207, 72061, 75555, 79738, 81881, 81532, 77392, 74732, 74865, 70678, 65250, 57375, 53105, 53416, 58069, 63059, 62966, 64344, 68797, 65568, 60720, 66194, 69441, 69448, 71378, 79265, 79290, 73873, 76026, 82897, 84168, 82109, 79101, 77854, 78177, 82073, 76661, 73219, 71705, 68872, 71298, 72207, 69419, 68842, 71046, 75008, 82606, 84637, 84241, 82805, 77799, 76622, 76588, 73332, 76462, 78602, 80987, 78821, 75158, 75076, 79505, 81272, 80209, 82420, 81918, 80898, 86135, 89459, 91966, 89915, 87806, 89106, 95430, 101580, 96138, 97061, 103524, 101314, 94796, 97085, 91923, 94582, 104897, 112523, 113552, 114022, 107436, 99917, 100563, 105170, 101991, 100538, 107546, 115811, 112702, 114678, 119461, 128690, 133281, 136669, 137906, 130141, 120977, 120308, 119386, 116995, 119062, 120454, 115102, 112936, 118844, 123782, 125258, 128114, 131024, 128459, 128649, 135413, 141723, 138977, 134845]
9283A34845k005M71q78P457j216n662j867j029R391J0909M056J0633J970m569
9269A62506q26q20K159o20j970N191K600M789M780N84p489j107Q334Q976k431
9254A84656n713k722n47k576k969j945k97J984N09L727k296O84L611J0312O986
9239A93404J0210L007j323N919r86K699O683L039R6R41L230L663J1293M086k232
9224B43729k029p50k857J377K181K64p710n89K143M660N056N489J3625J4258L512
9209B82359j02J469O656J2200L183J215Q208Q710J2920O602L703L056N459Q358
9195C63996n72M796N990J1212R973Q776R904J2935J1238J4615J9124J0883J7129
9182D99999K4205J9763K3598K7285L6590L4536M8324M6725M6262M7953N4491N9780
$$ y = [134845, 132840, 133311, 132433, 139890, 138674, 133012, 131145, 130116, 139507, 150416, 154472, 165105, 167075, 162506, 161680, 160860, 163019, 162399, 160429, 165620, 168220, 173009, 177789, 178373, 170884, 169777, 178111, 187087, 184656, 178943, 176221, 175674, 173098, 170129, 168184, 167887, 169871, 170380, 174107, 171811, 172495, 176106, 186418, 193404, 203614, 206621, 205298, 211217, 210231, 212930, 219613, 222652, 222748, 223689, 226919, 230582, 241875, 245961, 243729, 241700, 240950, 238093, 239470, 241651, 241915, 234205, 233616, 235759, 240419, 245475, 250964, 264589, 278847, 282359, 282257, 283726, 290382, 302582, 305765, 306980, 315188, 323898, 336818, 343420, 347123, 350179, 355638, 363996, 363424, 368220, 374210, 385422, 395395, 404171, 414075, 427010, 438248, 452863, 471987, 482870, 499999, 524204, 543967, 567565, 594850, 631440, 665976, 714300, 761025, 807287, 855240, 909731, 969511]
9170I69511P3973Q9560J06141J17329J29733J50049J74761J98299K11839K28480
9160B449675K54998K78538K92540K91263K85400K57984K06374J36804M3155n1202
9150D445529j28991j80295j92324j86469j53520j09900o1174k3996J9213Q0635
9140C508708J32495J91550K49429L05994L65792M21060M79511N19916N32773N17748
9130G224976N03834M92449M70798M42380M26074M02636L70496L24266K80155K30793
9120A1168857J86272J52219J20350Q8611L3920j2267p2388j53728k25381k74003
9110A1012462k92884l09240l08259k90000k43751j85933j17554m5516K7291J10079
9100I356695J76634K51734L13190L73832M29380M85255N25283N70262O11108O52550
$$ y = [969511, 1043484, 1133044, 1239185, 1356514, 1486247, 1636296, 1811057, 2009356, 2221195, 2449675, 2704673, 2983211, 3275751, 3567014, 3852414, 4110398, 4316772, 4453576, 4496731, 4445529, 4316538, 4136243, 3943919, 3757450, 3603930, 3494030, 3432856, 3408860, 3428073, 3508708, 3641203, 3832753, 4082182, 4388176, 4753968, 5175028, 5654539, 6174455, 6707228, 7224976, 7728810, 8221259, 8692057, 9134437, 9560511, 9963147, 10333643, 10657909, 10938064, 11168857, 11355129, 11507348, 11627698, 11716309, 11750229, 11737962, 11665574, 11511846, 11286465, 11012462, 10719578, 10410338, 10102079, 9812079, 9568328, 9382395, 9264841, 9219325, 9246616, 9356695, 9533329, 9785063, 10098253, 10472085, 10901465, 11386720, 11912003, 12482265, 13093373, 13745923]
9090A3745923O66123O68014O50882O26404N90965N32528M62392L66253K40731
9081A8550215Q2519j13790l31487n32212o73075p65754q11180q11334p87260p23347
9071A3083295o51594n58880m65275l81821k89381k17782j34392n4888K2154R3162
9061A0444598J63262K17288K86207L47856L96861M34584M54513M67099M58158
9052A3670426M21127L69337K79449J81675N7338q6692k67112m33841n64788o57505
9042A2969414o98022p05464p10796o98587o67356o20730n64026n10358m58801
9033G335274m16035l73968l31960k64739k17802j81206j30197p8834k9106K5027
9023E336454O4903J19456J59695J84443J96223J79961J42831Q8893K4394n7023
$$ y = [13745923, 14412046, 15080060, 15730942, 16357346, 16948311, 17480839, 17943231, 18309484, 18550215, 18632734, 18518944, 18187457, 17655245, 16982170, 16216416, 15405236, 14593902, 13806642, 13083295, 12431701, 11872821, 11407546, 11025725, 10736344, 10518562, 10384170, 10329282, 10351436, 10444598, 10607860, 10825148, 11111355, 11459211, 11856072, 12290656, 12745169, 13212268, 13670426, 14091553, 14460890, 14740339, 14922014, 14979352, 14892660, 14625548, 14191707, 13626919, 12969414, 12271392, 11565928, 10855132, 10156545, 9489189, 8868459, 8304433, 7794075, 7335274, 6919239, 6545271, 6213311, 5948572, 5730770, 5549564, 5419367, 5340533, 5311427, 5336454, 5401357, 5520813, 5680508, 5864951, 6061174, 6241135, 6383966, 6472859, 6497253, 6440230]
9013F440230j41273k23341k97181l58629l91903l99428l76694l45606l13290k68219
9003C324666k35791k07018j82576j60751j43218j37151j27065j32829j21931j12285
8993A764051j08337q7434p8053o0610k6570n040r949k8885m1474n0387m2297l6959
8981A188056l6163l2037m4952m3400l4471l2128k4298j1971l255n513r358m545
8969I05965m996n929m42M84O671J2301N846R943J6887K0050J3093J4571Q464J6616
8955A019524K8674K4625L0690J8531K2862L4774K5199J6414K4158L1322M1329
8944A318102L4973M9363O1178P0911P8190Q4800Q6136P8465P5614P7249P7067
8933B092048P7881Q3876R0038R6699R6572R1010J02062J12316J20781J19323J18142
$$ y = [6440230, 6298957, 6075616, 5778435, 5419806, 5027903, 4628475, 4251781, 3906175, 3592885, 3324666, 3088875, 2881857, 2699281, 2538530, 2395312, 2258161, 2131096, 1998267, 1876336, 1764051, 1655714, 1568280, 1490227, 1429617, 1403047, 1398007, 1388058, 1359173, 1317699, 1267312, 1225015, 1188056, 1151893, 1119856, 1074904, 1031504, 997033, 964905, 940607, 928636, 925381, 919868, 910510, 905965, 900969, 895040, 894598, 895082, 901753, 914054, 919900, 929843, 946730, 966780, 979873, 994444, 1002908, 1019524, 1048198, 1072823, 1103513, 1122044, 1144906, 1179680, 1204879, 1221293, 1245451, 1276773, 1318102, 1353075, 1402438, 1463616, 1534527, 1612717, 1697517, 1783653, 1862118, 1937732, 2014981, 2092048, 2169929, 2253805, 2343843, 2440542, 2537114, 2628124, 2730186, 2842502, 2963283, 3082606, 3200748]
8922C200748J08212J20325J33882J44958J58907J43861J21627R0354M7460Q881
8912D279215k0790n2085n9606n1378k5294N69L1201O3668R1207J07994J15335
8901D480036J18843J13410J01290Q7150O9243N3824N1090N4990O3093Q2706Q9070
8890E364745J09254J29033J71516K12561K29971K27800K22144J97468J67608J35976
8880G168076R4408N9090K9416O635j8609m5427p3290q9874j10085j24854j25872
8869F769614j42993j45290j51471j59813j47969j32623j06756o6971l5098J803
8859E682433K6309P3500J31189J76751J95313J96345K00329K08801K08880J90323
8849G290173J67893J33380Q7843J3372m4561q7632j30046j60798j78558j87961
$$ y = [3200748, 3308960, 3429285, 3563167, 3708125, 3867032, 4010893, 4132520, 4222874, 4270334, 4279215, 4258425, 4206340, 4146734, 4095356, 4070062, 4070631, 4101832, 4165500, 4256707, 4364701, 4480036, 4598879, 4712289, 4813579, 4900729, 4969972, 5023796, 5074886, 5129876, 5192969, 5275675, 5364745, 5473999, 5603032, 5774548, 5987109, 6217080, 6444880, 6667024, 6864492, 7032100, 7168076, 7262484, 7321574, 7350990, 7357625, 7339016, 7293589, 7220299, 7130425, 7020340, 6895486, 6769614, 6626621, 6481331, 6329860, 6170047, 6022078, 5889455, 5782699, 5715728, 5680630, 5682433, 5708742, 5782242, 5913431, 6090182, 6285495, 6481840, 6682169, 6890970, 7099850, 7290173, 7458066, 7591446, 7679289, 7692661, 7648100, 7560468, 7430422, 7269624, 7091066, 6903105]
8839F903105j85414j70462j63341j66853j60078j53040j50310j43139j15536j08910
8829E386022q8121p3938o4498n4949o1254p3746q6436r0487p7130n8729m1178
8818D615556k3501j1168P834J1751M974l348o676j1072m952j0754k8260k7797
8806D512587p596p937n855j2178k6930l4273o6440q8468r5861r8421r4156q9742
8794C884730q4389q4390p1426n6182m0361k6832N654K6545M9514P0370Q4472J01365
8782C859070J18382J14499J18259J24008J22355J38682J49415J62017J75454J82047
8772E264188J89686K02796K22422K58165K95741L31410L55952L84469M38457N03017
8762H446303N91289O65949P49771Q52770R61552J072460J199167J359485J582252
$$ y = [6903105, 6717691, 6547229, 6383888, 6217035, 6056957, 5903917, 5753607, 5610468, 5494932, 5386022, 5297901, 5223963, 5159465, 5104516, 5043262, 4969516, 4883080, 4792593, 4715463, 4656734, 4615556, 4592055, 4580887, 4588721, 4600472, 4605446, 4602098, 4595422, 4584350, 4579398, 4568644, 4540384, 4512587, 4504991, 4497054, 4491199, 4479021, 4452091, 4417818, 4351378, 4262910, 4167049, 4068628, 3974472, 3884730, 3800341, 3715951, 3644525, 3588343, 3547982, 3521150, 3526804, 3553349, 3602863, 3673233, 3757705, 3859070, 3977452, 4091951, 4210210, 4334218, 4456573, 4595255, 4744670, 4906687, 5082141, 5264188, 5453874, 5656670, 5879092, 6137257, 6432998, 6764408, 7120360, 7504829, 7943286, 8446303, 9037592, 9703541, 10453312, 11306082, 12267634, 13340094, 14539261, 15898746, 17480998]
8753A7480998J869065K211713K637377L164013L789887M443339M915940M866804
8745D5379136M422216M329774M883852N903641P524068J0137306J4214272K0356994
8737A17151259K9325635M1577032N5940546O6443609O0527283K6923503k5503225
8730C72385642o4898443p3337176o1764862m5090488l0974132k1104893j4610099
8723F0605549j0311397p454143n639605m499166l702198l175224k920107k764500
8715B0139209k518937k186626j824391j495487j239745j045837q96451p68387
8707H163348o52614n48818m66495m03039l64631l29152k97614k77183k69886k51486
8697D302430k37810k12841j95119j85257j79231j76080j59247j40458j18517j04064
$$ y = [17480998, 19350063, 21561776, 24199153, 27363166, 31153053, 35596392, 40512332, 45379136, 49801352, 54131126, 59014978, 64918619, 72442687, 82579993, 96794265, 117151259, 146476894, 188053926, 243994472, 310438081, 370965364, 397888867, 372385642, 307487199, 234150023, 172385161, 127294673, 96320541, 75215648, 60605549, 50294152, 42840009, 37200404, 32701238, 28999040, 25823816, 22903709, 20139209, 17620272, 15433646, 13609255, 12113768, 10874023, 9828186, 8931735, 8163348, 7510734, 6961916, 6495421, 6092382, 5727751, 5398599, 5100985, 4823802, 4553916, 4302430, 4064620, 3851779, 3656660, 3471403, 3292172, 3116092, 2956845, 2816387, 2697870, 2593806]
8687B593806j06494j02878r5456q8451p7561p2548o6132n1492l8223m5812m5918
8676A802841l8324m4500n4689n0063m9134m4254m3462k9450l8432l4826m2343
8665A333364o0663o4299m6057m2788m3811l6003j8495k3920l5993l4481k5590
8654I01264k2017k4628l4168k9919j9520j5694o584p448j0675j2190j3049j4247
8642F91125j2685j5931j6964r243l557L327l891j0731l735j3296j7702j5339p506
8629E63872K111J2321K2931L1281O1188J07120J52998J75360R7591r1421k09426
8618I25926j89350j27490p6896m5368k4542k0025j3751r27J3493K1881K9976K3421
8606E16348J5672K564l14J7892K5812K2747L2434M4486L8710J6836k0480m0650
$$ y = [2593806, 2487312, 2384434, 2288978, 2200527, 2122966, 2050418, 1984286, 1932794, 1894571, 1848759, 1802841, 1764517, 1720017, 1665328, 1615265, 1566131, 1521877, 1478415, 1448965, 1410533, 1375707, 1333364, 1272701, 1208402, 1162345, 1119557, 1075746, 1039743, 1021248, 997328, 961335, 926854, 901264, 879247, 854619, 820451, 790532, 771012, 755318, 748734, 741286, 730611, 718421, 705372, 691125, 678440, 662509, 645545, 636302, 632745, 636072, 632181, 621450, 617715, 604419, 586717, 571378, 563872, 565983, 578304, 601235, 632516, 693704, 800824, 953822, 1129182, 1226773, 1135352, 925926, 736576, 609086, 532190, 486822, 462280, 442255, 428504, 427577, 441070, 462951, 492927, 516348, 532020, 534584, 534270, 552162, 577974, 600721, 633155, 677641, 716351, 733187, 712707, 672057]
8594F72057k8606j7663j045J1113J3533K5446L6583K4728q92k6926k1981n448
8582F80899L4747Q7888J78350K98256M03381L49102r392l95899m45138l16267
8572H65927j86732j11886p4362n7554l7728k4139j8090o604o658K541K433M378
8560C51526l161M030j348r767j1168j236k976r794q382p987p373M1k742l006j920
8545B84737P37n259p486o112j590J4871K7166M3356O5214R0494J40756J89165
8533H36049K01403Q5075j42805k62624k10840j30031q3546m2863k2233k678j281
8522B23626j664m236j2821j8043j9894j3564j9972j9978j2344n504k926M354L784
8509A00818M240L091L547R126M725P21J602N006J1762M224J073L209R600K401
$$ y = [672057, 643451, 625788, 624743, 635856, 649389, 674835, 711418, 736146, 735254, 708328, 686347, 680899, 715646, 803534, 981884, 1280140, 1683521, 2032623, 2023231, 1627332, 1182194, 865927, 679195, 567309, 492947, 435393, 397665, 373526, 355436, 348832, 342174, 344715, 347148, 351526, 348365, 352395, 351047, 341280, 330112, 328876, 325900, 316106, 307724, 299737, 292364, 292405, 289663, 286657, 284737, 285474, 280215, 272729, 266617, 265027, 279898, 307064, 350420, 415634, 506128, 646884, 836049, 1037452, 1122527, 979722, 717098, 506258, 376227, 292681, 249818, 227585, 224907, 223626, 221962, 217726, 204905, 186862, 166968, 153404, 133432, 113454, 101110, 95606, 92680, 97034, 100818, 105058, 108149, 111696, 120822, 125547, 126268, 127870, 132876, 144638, 148862, 149935, 153144, 162744, 165145]
8495A65145k700m744j762R53n938r20o401k474P529J0689R181M424P169J140j0453
8480A70838j667l309n643r302J438K691P695k754r193o096q08m475j0611p571
8466A21233j692k35k732l02J516R36j811k10l826J99o180n266O649K088O042R743
8450A26152K741p040l211O61L47k250k237J489j474l005L58m018m714N09L529
8435A07837k869k0m671m322j328k236Q338J3328J1790Q445J9899K6761L2200L9056
8421B52208J6578m404k7123k7881j9581j8824j0798l449k272k155o691q887j0813
8408A25908q78l901m787o614k771j120m556r195m156K773P2j95o792p094k531
8393G4163k611L497M737N439k653k074o593r900l40P67n759j7036M329O491L208
$$ y = [165145, 162445, 157701, 155939, 156892, 150954, 150034, 143633, 141159, 148688, 159377, 168558, 172982, 180151, 181291, 170838, 169171, 165862, 160219, 150917, 152355, 155046, 162741, 159987, 150794, 144698, 143890, 139415, 128804, 121233, 119541, 119306, 116574, 116272, 117788, 118724, 116913, 116703, 112877, 113076, 106896, 101630, 108279, 110367, 116409, 126152, 128893, 121853, 118642, 119303, 119650, 117400, 115163, 116652, 115178, 112173, 112531, 108513, 103799, 104308, 107837, 104968, 104948, 100277, 95955, 94627, 92391, 100729, 114057, 125847, 134292, 154191, 180952, 213152, 252208, 268786, 264382, 237259, 209378, 189797, 170973, 160175, 156726, 154454, 152299, 145608, 136721, 125908, 125030, 121129, 116342, 109728, 106957, 105837, 101281, 92086, 87930, 90703, 90775, 90580, 83788, 76694, 74163, 71552, 75049, 79786, 85225, 82572, 80498, 73905, 64005, 63665, 64432, 58673, 41637, 45966, 52457, 55665]
8378E5665L495n65L467J58K023N885j351N873j13J57k31O203m422p149K634j704
8362G0025n439k149K805J2487R829P097N003N969J855Q619J2827J0329J6512Q945
8348A64714J0061J9744K2638J9162K7046K2148K6067K7744L7679N0915O3564P1481
8336E62963R2521J22432J36287J46780J49053J38178R9695M6767r967p7999j30284
8325A276426j53811j58664j59977j42688j15381r7997p1636o0747m7310l5598
8315B32617l2081k3277j9281j3501j6738k0717k3997r771j667l650m721o645M007
8302F0578r01l48n353q092J976k414J303O509J147r808m146j033N81k870n372
8287C1757R07N775o99j553M67l952r6m290j388O593Q386n055o260K303n2j286
$$ y = [55665, 59160, 58595, 62062, 62220, 64243, 70128, 68777, 74650, 74537, 74694, 74463, 80666, 76244, 69095, 71729, 70025, 64586, 62437, 65242, 77729, 87558, 94655, 99658, 105627, 107482, 116101, 128928, 139257, 155769, 164714, 174775, 194519, 217157, 236319, 263365, 285513, 311580, 339324, 377003, 427918, 491482, 562963, 655484, 777916, 914203, 1060983, 1210036, 1348214, 1447909, 1494676, 1484709, 1406710, 1276426, 1122615, 963951, 803974, 661286, 545905, 447908, 376272, 315525, 268215, 232617, 200536, 177259, 157978, 144477, 127739, 107022, 83025, 73254, 71587, 67937, 63216, 56571, 60578, 59677, 59329, 53976, 45884, 47860, 45446, 46749, 53258, 54405, 44597, 40451, 39418, 39999, 37129, 31757, 32664, 38439, 37740, 36187, 36654, 32702, 32606, 28316, 26928, 33521, 41907, 36852, 30592, 32895, 32843, 31557]
8271C1557n525P580j234L09l300l245j14N674n848m663L673m5p380r93N408K595
8255B4449J957P1L703O395N599K121l546M23J96k024l57o802j714o70n417j462
8239B2922K328j159N457k953k838K955O54o821p062M028J606P727N254k864J738
8224C0972R37l920P58n869j058o23L915J1049m313n63M382m894r771m061L73P90
8208A8104l273L1P497j180j321L243O821L541k187m019p243o32K537N706M329
8193C1954M936N993r22K17p903o147n929M61n971n139N131Q035K059K733q908
8178B0600r612l341J0842m512k122L771N974O98l121M036N001j950n09J749l600
8163B3904n198o470m355k920M5N234p0J583m7M879O440l129l721K7M63l124P722
$$ y = [31557, 26032, 33612, 32378, 32687, 29387, 26142, 26028, 31702, 25854, 21191, 24864, 24819, 17439, 16446, 21854, 24449, 26406, 26477, 30180, 36575, 42174, 44295, 40749, 41172, 41368, 39344, 38987, 32185, 30471, 29801, 24384, 22922, 25250, 24091, 29548, 26595, 23757, 26712, 27366, 20545, 13483, 17511, 19117, 26844, 32098, 29234, 30972, 31909, 27989, 28747, 22878, 21820, 21197, 25112, 36161, 31848, 31285, 35667, 30773, 21002, 16941, 17314, 18104, 14831, 14862, 22359, 21179, 19858, 23101, 29922, 33463, 31276, 27257, 20014, 19382, 21919, 27625, 31954, 36890, 42883, 41961, 42178, 34275, 28128, 22199, 22660, 16689, 11550, 16681, 24716, 26775, 29508, 20600, 10988, 7647, 18489, 13977, 11855, 15626, 21600, 22298, 19177, 23213, 28214, 26264, 25755, 27504, 23904, 18706, 12236, 7881, 4961, 5006, 10240, 10170, 11753, 11706, 16585, 23025, 19896, 16175, 16202, 16665, 13541, 21263]
8146B1263L28o129n63K265L633M51m307M42j333m629K185J1994O151k576L63k876
8130B6662j792j30n62L6j3584r293L509P369J262n319o97k55m672j459r08L757
8114C924K596j570k40Q360P700M425p673r579j965Q81J326N264J915l490n218
8099F656M659J175l138L569L011rk350n704j913k117k431P551R28L418L009K007
8083A8321N42l148l874M180j791l553l255J006O763n787j396O532L285K511K273
8068B2609Q23k55J755k411n464k169L641Q83o028j222J357o116j245J449k469
8053E138K762o69L397J876j372k705K661j519m656o73j850J527m683J856N640
8038F730K85M612n573K591N056j102k1j348K425K880P603J874m828j0302o643
$$ y = [21263, 21591, 15462, 14899, 17164, 20797, 21248, 16941, 17383, 16050, 11421, 13606, 25600, 31751, 29175, 29538, 26662, 24870, 24740, 24178, 24214, 10630, 1337, 4846, 12215, 13477, 8158, 7461, 7206, 2534, 1075, 167, 3924, 6520, 4950, 4710, 13070, 20770, 25195, 17522, 7943, 5978, 6859, 8185, 13449, 15364, 11874, 6656, 11315, 12490, 9352, 12921, 15932, 15923, 13573, 7869, 5956, 3839, 1408, 8959, 9887, 13305, 16314, 18321, 18863, 15715, 11841, 16021, 14230, 10677, 7422, 8428, 15191, 9404, 8008, 14540, 17825, 20336, 22609, 23432, 23177, 24932, 22521, 17057, 14888, 18529, 19412, 13384, 12162, 13519, 7403, 6158, 7607, 5138, 7900, 7231, 10628, 12504, 11132, 8427, 11088, 9569, 4913, 4240, 2390, 3917, -766, 1090, 6730, 7015, 11627, 6054, 8645, 13701, 12599, 12578, 11230, 13655, 16535, 24138, 26012, 21184, 10882, 4239]
8023D239M875k874o74Q306Q80l547l250J414l63O125l152o375J267J913p459n598
8007d273L083P563J747K808M353O640k545j1921p528K245j598K303J877p4j273
7992C407K054P939J740j657R64N470r708q622M961M765L047j502n334l020M211
7977H715J70J011J950O918m850k871j656k611j554m48R82L694L86K687J093p22
7961A2894l46L892L882J90k413N1k249m759o320q94k963m406J263L713j373p56
7945e94K280j070J607j125M599N830k555n005J225L383L207k11m138k705J495
7930F223L064k068k006L846j169o0l999k61M091J340k33K02j223O20l453L779
7914H693Q065n042k282k202J794K228m705j786P346M142Q374n934m726M765K501
$$ y = [4239, 9114, 6240, 5566, 13872, 14752, 11205, 7955, 9369, 9006, 15131, 11979, 5604, 6871, 8784, 1325, -4273, -1190, 6373, 8120, 10928, 15281, 21921, 19376, 7455, -73, 2172, 574, 2877, 4754, 4680, 3407, 5461, 13400, 15140, 13483, 14447, 19917, 10209, 1587, 6548, 11313, 14360, 12858, 7524, 4504, 8715, 8885, 9896, 11846, 18764, 13914, 11043, 9387, 6776, 5222, 4774, 5756, 9450, 9836, 12523, 13616, 12894, 12548, 16440, 20322, 20512, 18099, 18150, 15901, 11142, 4822, 3928, 965, -3441, -2178, 1535, 162, -594, 1686, 616, 2223, 1098, 5697, 11527, 8972, 3967, 5192, 8575, 11782, 11571, 7433, 4728, 6223, 9287, 7219, 5213, 9059, 7890, 7830, 3831, 3570, 7661, 9001, 8768, 8970, 7747, 8367, 4914, 8693, 16758, 11716, 9434, 7232, 9026, 11254, 6549, 4763, 12109, 16251, 24625, 18691, 13965, 18730, 21231]
7899B1231q187l275L615j274o537J545L396m834n454o823L234Q060K345p713l67
7884a038O01K593O420K013K31m860p180r89j196O90K570j597K568J2467L497j847
7868A4943j361r630q134j627j560P09k048m274k202K368Q466M786k167m654j929
7853h314K128N607L753M784l197O02O03r12L319l940k337K751m177o438l335P07
7837h396M82K510Q561Q258L119k993J64r590l760O842k41M206M982l366n883J879
7821F774O602k68m208j270k001K431J711L562L407r360o815k911j384R446R9k185
7805C630j603j274n890j563P333L970j832K817r808j671N854J546Q523K011K193
7790A4236l770j733j426N936L511l57n872n079J403K661k91q146L620K984m077
$$ y = [21231, 13044, 9769, 13384, 12110, 5573, 7118, 10514, 5680, 226, -6597, -3363, 4697, 7042, -671, -1038, -437, 2156, 8576, 10589, 10820, 5960, -1220, -2209, -3405, -2715, -145, -1742, 826, 13293, 16790, 14943, 13582, 3952, -4182, -5809, -7369, -6660, -8708, -12982, -15184, -12816, -4350, 436, -1731, -6385, -8314, -6186, -579, 3174, 7958, 4761, 5363, 5966, 5054, 8373, 4433, 2096, 4847, 670, -5768, -9103, -8396, -7914, -5404, 3157, 11415, 14534, 11541, 11705, 2115, -1645, 5197, 4956, 9162, 14144, 10778, 4895, 6774, 13376, 13108, 8900, 7630, 5629, 8060, 9771, 13333, 16740, 7380, 565, -2346, -3730, 5716, 5815, 3630, 2027, 753, -5137, -6700, 633, 4603, 2771, 5588, -4220, -5891, -37, 1509, 10032, 12043, 14236, 10466, 8733, 7307, 13243, 16754, 16397, 10525, 5446, 6849, 9510, 9219, 1073, 4693, 7677, 3600]
7775C600j825J183P011m213m350J740qK248L952q946m319O569L873j151o848j0033
7759a1517J33J1071K184l426L192Q723L385o91N392l280r542o014j851Q4M826
7744B669p40k089n77L238J076k186P707M945O046q02j0986r043L557N582o47l396
7728D354Q32L040J997j970j0803k260k648K735M198M314j297j841L871r84n976
7713b438O155K111m385L242L27R37L136k15o406O79N601r97k536p56l299O22k730
7696i52m127J172k271p30K134k135n943N292K250J891J617o869m429M692L342
7681e066j135J785R555N910J431J998K507q738j868J689l286o218N099J989Q60
7666F512l367m011L00L325l989m828j255J650J660J061n82L189j783k721Q859
$$ y = [3600, 1775, 2958, 9969, 5756, 1406, 3146, 3138, 5386, 9338, 392, -3927, 2642, 6515, 5364, -1484, -11517, -11384, -313, 1871, -1555, 1637, 10360, 13745, 13054, 18446, 15166, 5624, -390, -2241, -2157, 2669, 1929, -160, -737, 2501, 3577, 1391, 9098, 14043, 20089, 19287, 8301, -742, 2815, 8397, 7750, 4354, 5186, 8226, 10223, 8253, -2550, -4810, -7458, -4723, -525, 3789, 2492, 651, 4522, 3538, -2438, 3717, 5828, 1443, 4685, 5012, 5949, 9085, 8870, 2464, 3143, 8744, 7747, 5211, 4455, 1156, 1778, -952, -5079, -3907, -6178, -6908, -4774, -6909, -12852, -7560, -5310, -3419, -1802, -8671, -13100, -8408, -5066, -6201, -4416, 5139, 11049, 12480, 14478, 16985, 8247, 6379, 8068, 4782, -1436, 3663, 5652, 6512, 3145, -866, -566, 2759, -1230, -6058, -7313, -5663, -4003, -2942, -3524, -335, -2118, -4839, 4020]
7651D020J486l922k5l811k532m57M721P615L618m149k992L406k409m938k840k32
7635c441K846Q276J639P03m14Mj987q247m687J42P332O528J57j476j091j207l796
7618A281O09K728M060k535O872K748p266j923J161L175K69l402p559m522k383
7603f687N180J625n8K780L253l898k342K914o582m04N685O357p90p1n207L548
7587E303M681L07l523j1026P68Q2P50j606j96M622N578k009K886M493n049o526
7571d65M70l824K404K572l144j416j939l172l110P619P97j1155j511Q280N448
7556b146k223Q22p87j480O592O45L300K476K833m227p316p668J521M159J90N114
7540A805q96n167L911N579o940l657j277P752m602l844Q567O219J457k416N7J157
$$ y = [4020, 5506, 1584, 1559, -2252, -4784, -5241, -520, 7095, 10713, 6564, 3572, 6978, 4569, -369, -3209, -3441, -595, 7681, 9320, 10023, 9609, 9613, 7626, -621, -5308, -5166, 2166, 8694, 8851, 7375, 6284, 5077, 1281, 1890, 4618, 8678, 6143, 13015, 15763, 8497, 6574, 7735, 10910, 11179, 7777, 218, -4304, -6687, -1507, 118, 60, 2840, 6093, 2195, -147, 2767, -3815, -4219, 1466, 7823, 7033, 6962, 1755, 5303, 9984, 10291, 6768, -4258, -3490, -3408, -2658, -4264, -4460, 162, 5740, 3731, 6617, 11110, 6061, -465, 5, -3819, -1415, 1157, -1987, -3403, -5342, -8514, -11624, -4005, -3208, -14363, -15874, -7594, -2146, -4369, -3547, -4334, -5814, 778, 1423, 4723, 7199, 10032, 5805, -1511, -9179, -7658, -3499, -3309, 1805, 909, -4258, -347, 5232, -1708, -5365, -6642, 1110, -3492, -7336, 1231, 7450, 8907, 6491, 6548, 7705]
7524G705Q308n28j797k719m112p224m94J894k134Q73L061l838n343J048L187J679
7508d34r77L133l256K286P830N346k701l327n3J890r0m128n751J46m005L01O953
7491C163j360M835m905l879j509M594L288L128o92p65K812j775l739j087k133
7476b4k051J663k946o211J290J61l497J130q64j937L678N735L339m511k274K883
7460d436N414m981n004P324k553Q45L334k252L681N440k039L551m375K19j306
7445B862J444l667n329l007m21N085k700m211L66R651l174N62j792J730L353m889
7429d137J306M99N131m661m555L611J0670J508n821m909j912K900Q81o900K108
7414d281J655K17m984n652M314Q014K271p372n482J404l972o437L024O494P615
$$ y = [7705, 16013, 15485, 13688, 10969, 6857, -367, -861, 1033, -1101, -228, 2833, -1005, -6348, -5300, -2113, -434, -1411, 1722, -1534, 752, 8582, 13928, 11227, 7900, 7847, 9737, 9647, 5519, -232, -86, -4091, -3790, 3163, 1803, 6638, 1733, -2146, -3655, 939, 4227, 7355, 6663, 5898, 8710, 6935, 3196, 2109, -24, -2075, -412, -3358, -9569, -8279, -8118, -11615, -10485, -11349, -13286, -9608, -3873, -534, -5045, -7319, -4436, 978, -4003, -9007, -1683, -4236, -3391, -57, -2309, 1372, 6812, 4773, 8324, 3949, 4168, 2862, 4306, 639, -4690, -7697, -8118, -3033, -5733, -9944, -9578, 73, -3101, -2539, -4331, -2601, 752, -4137, -2831, -2332, 2799, -1862, -6417, -2806, 7864, 9372, 3551, -1358, -3270, -370, 511, -6389, -4281, -2626, -2409, -7393, -13045, -8731, -717, 1554, -5818, -11300, -9896, -13868, -20305, -17281, -10787, -3172]
7399c172O786l585n26j61K169L784l081l470k849l657K10j428J2356K214L509
7384I099J831L742j604l796o372n574N663O88l009k350o232j892P755J4488k986
7369I451k590j575p084p385r25P998R114j213m401r66O4O857m488n855k688O747
7353A061P225M365J151o877k737J77J281k515m228r68Q189q24j32J905l122q663
7337d712l504O75n38j61J260L327P47L078N49j242J103k291q514m023K537L801
7321g908R129q68o455j011M89l529K169m434K761l097p384M303O667P028K797
7306F57J122J652M631k196p61p962l968L551L138o56K484j269O280O63n951N05
7290A920M919n637l65N494J520q982n437M83J688O533J755j498k289O500m381
$$ y = [-3172, 3614, 29, -497, -658, 1511, 5295, 2214, -1256, -4105, -7762, -7552, -8980, 3376, 5590, 9099, 10930, 14672, 13068, 9272, 2900, -2674, 2989, 3677, 668, -1682, -7914, -9806, -2051, 12437, 9451, 6861, 5286, -1798, -9183, -10108, -2110, 7004, 5791, 1390, 424, 488, 7345, 2857, -2998, -5686, 1061, 8286, 12651, 13802, 6925, 4188, 4365, 5646, 3131, -1097, -2065, 6124, 5300, 5168, 7073, 3951, -4712, -8216, -7541, -8079, -8240, -6980, -3653, -2906, 172, 721, -521, 582, -1709, -10223, -14246, -11709, -7908, 1221, 353, -6102, -7113, -6624, -10153, -7984, -12418, -9657, -12754, -20138, -15835, -9168, -2140, 657, 1779, 3431, 8062, 5866, 5105, -2857, -6825, -3274, -136, -792, 1692, 423, 6703, 7366, 1415, 1920, 6839, 1202, 837, 6331, 7851, -1131, -6568, -6085, -4397, 2136, 3891, 2393, 104, 6604, 2223]
7275B223q036o606k198J986N136Q019R878r833p604J788K185O483N878l744o181
7260f26l840J224L550J798R27L638j709n320k33l401k870N306lj546p579n715
7244a6399k470K880J983P580K697j063K875J378l265p371j883M023Q481L116L668
7229F230N541L061k552j136O864l442q33o071q572o607J267k692o228l72M371
7214a1171Q391P655M714j125l747j336L465k317P61n5n520m421J85K177P247M644
7198I547m073k463k307l487l368q849j918P875N798K690O056M684k923m090o489
7183c317J427M948r49K741k907n678P10L115o458L665P076J289p615m186K368
7168c771K608j636J34k179j062O993L184j737J528J2053O38j906n00q328k188
$$ y = [2223, -5813, -12419, -14617, -12631, -7495, 524, 10402, 569, -7035, -5247, -3062, 3421, 9299, 5555, -626, -4466, -3242, 308, 2106, 3033, 6671, 4962, -358, -591, -3992, -6862, -1556, -1559, -3105, -10684, -16399, -18869, -15989, -14006, -6426, -3729, -4792, -1917, -539, -3804, -11175, -13058, -9035, -554, 2562, 6230, 11771, 14832, 12280, 11144, 18008, 14566, 13733, 7662, -910, -7517, -6250, -8942, -15170, -15542, -11171, -2780, 4875, 9589, 8464, 4717, 3381, 6846, 4529, 5290, 5235, -285, -4706, -4521, -2344, 4903, 9547, 5474, 3011, 704, -2783, -6151, -15000, -16918, -9043, -3245, -555, 5501, 10185, 7262, 3172, -3317, -1890, 3058, 2109, 4850, 1943, -3735, -3025, 90, -6368, -2703, 4373, 5662, -1953, -6139, -3771, -1163, -2799, -2665, -4844, -5906, 1087, 4271, 2534, 4062, 16115, 16753, 14847, 14347, 6019, 3831]
7153C831r35j494n437n943o797m589O919M898J511L191K171j865L231N742J284
7138E718o469n006P176m513o320K502P084K025j443Q817N523k50j1126j1250K531
7123e001n54l374L122J233K980K44K8k053n2L027K609o832j991K258K178N72o1
7106a667k674L273k589K187M843j890l930p054j164K510j00j068Q941R767J261
7091A0646k665n503r353q023J498L173L898J709k676m180j093L013L878j530j19
7076g327k41k425L435K883j527P597J493m029M154J453p629K431J0832J779k600
7061A0279k222N804k67l966q124O004j117O745M367l315n215n261m602m032o661
7046a1583j91R62L398K392N36p99K83O23L540M335M877l165L111J633J46j426
$$ y = [3831, 2896, 1402, -4035, -9978, -16775, -21364, -14445, -9547, -8036, -4845, -2674, -4539, -1308, 4434, 5718, -751, -5757, 1419, -3094, -9414, -6912, 172, 2197, 754, 9571, 15094, 14844, 3718, -7532, -5001, -5555, -8929, -5807, -4574, -1594, -1350, -1322, -3375, -3427, -400, 2209, -4623, -6614, -4356, -2178, -1606, -1667, -4341, -1068, -3657, -1470, 3373, 1483, -2447, -9501, -10665, -8155, -8255, -9323, -382, 9385, 10646, 7981, 2478, -6875, -14898, -13400, -10227, -6329, -4620, -7296, -11476, -12569, -9556, -5678, -7208, -7327, -7568, -9993, -6558, -3675, -5202, 2395, 3888, -141, 4013, 5466, -2163, 268, 11100, 12879, 10279, 8057, 13861, 13594, 9628, 1504, 7508, 6391, 13136, 17503, 14188, 8973, 3712, -890, -4922, -11583, -11774, -10812, -7414, -5022, -4486, -5285, -5002, -4379, -839, 3496, 8373, 5208, 8319, 9952, 10098, 8672]
7030H672J125l696L216K784o713n346K680l16J5P89q66j308L748k111k870k876
7014c073m859L772M748l649m811n169o68m039J591O988O106L012k711p426Q81
6999i307j060m895P96Q950K164l291L340L359K370l55j088k247o606k783o94L051
6983h296K739K159Q500q70j938j245n611M755L004J982p0L74J384P22k934R36
6967E591L75k942Q89k739J769N166m268k963k218k160N825Q173p379o900k745
6952f526J825L371j791m599o784Q520N588L268K618j994o638n583K490J244m35
6937e426L195Q072M005j080m985m411J120n56j727J55k000K233Q1k254k084l94
6921f056K412P836P710r423j3469K690m46N498k622k865N811K802r17O77O584
$$ y = [8672, 9797, 6101, 9317, 12101, 5388, 42, 2722, 2406, 2421, 3210, 2344, 1036, 4784, 2673, -197, -3073, -7932, -4160, 588, -3061, -7872, -13041, -13709, -17748, -16157, -9169, -3063, -51, -2762, -10188, -9307, -10367, -15262, -14466, -5516, -3352, -6643, -3303, 56, 2426, 2071, 983, -1264, -7870, -10653, -11347, -8296, -5557, -3398, 5102, 4232, 2294, 1049, -4562, 193, 3197, 5179, 5109, 5483, 6867, 7589, 4655, 5591, 5966, 3024, 3913, 1174, 2943, 8109, 3841, 878, -1340, -3500, 2325, 10498, 3119, -3781, -6526, -4701, -1330, -3121, -7720, -14504, -5984, -396, 2872, 5490, 3496, -3142, -8725, -6235, -4991, -5426, -2231, 5841, 9846, 8766, 3781, -630, 490, -66, -1793, -1638, -3638, -1405, -1324, -3578, -5662, -6056, -3644, 4192, 11902, 2479, -10990, -8300, -8746, -3248, -5870, -8735, -2924, -122, -1039, -362, 6222]
6906F222N78k643m862m513j372Q710Q452k875o168q55l652l772P530M362o41N719
6890A0220K660j0232l438J419M151M492k185n262p066l453l544K94P852J232L452
6875E92p561o288N983K163j113j764l605n78L566L554L854k906M01l312q750n684
6859b1448P039P025K720L858L251j182L525M496k634N082J21k641r865k4J418
6844G41j746o071j76Q11L349N709j213K762J971r104n284R488R532L885r46l280
6828A0428m625r121J291N708N217p675n475J984L240q175m010J115l271N3P649
6813e667J0241J168o856r354M412j976k160l89K346Q139M301K197m1o05J10P264
6797A3130p52k46n287j588j919k67l487J398m02O58L829K219J515m157K022k511
$$ y = [6222, 6800, 4157, -705, -5218, -6590, 2120, 10572, 7697, 1529, 674, -2978, -6750, 780, 5142, 4501, 10220, 12880, 2648, -790, 629, 4780, 9272, 7087, 1825, -5241, -8694, -12238, -11944, -4092, -2860, 592, -6969, -13257, -7274, -5111, -6224, -7988, -11593, -12171, -8605, -5051, -1197, -4103, -3702, -7014, -15764, -21448, -14409, -7384, -4664, -806, 2445, 1263, 4788, 9284, 6650, 11732, 11853, 9212, -653, -677, 741, -1005, -7076, -7252, -6441, -3092, 2617, 1404, 4166, 6137, -2967, -8251, 1237, 10769, 14654, 13708, 10428, 5803, -3318, -2027, 3681, 8898, 1223, -4252, -2268, 972, -7203, -11213, -10098, -13369, -13316, -5667, 4574, 5742, -1114, -10468, -6056, -8032, -10192, -10581, -8235, -96, 4205, 6402, 6361, 5756, 5866, 13130, 12378, 12132, 6845, 5257, 3338, 3071, -416, 982, 580, 1238, 5067, 7286, 8801, 4644, 6666, 4155]
6781D155m977K359K358L306O114J246l471N613P184L061l640P43L00k155n9m482
6765A7655K16N895K554L801J113J964J908R913J0611J2877K2141K7366R615N415
6751A33044O15j456p16L359K678J450J361n17O334Q936J7906J7920K8440L1127
6737B50481K5550L9821N3507Q6507J26790J77391K57374L78695M85704M62816
6727B344636J55919l42876o13153n17701l32080k09710j30103q0845o1119m1062
6717A71906l3144k6686j7160j0438q063l906j142l755m953k26N481P212j251N404
6703G9279k434j7057n855q600j0596n733L160O079n832m258r130o036L03P854
6689B1144Q551Q361J42n260r286l482j946m192j905m648M43K349j967o75k250
$$ y = [4155, -822, 1537, 3895, 7201, 13315, 14561, 11090, 16703, 23887, 26948, 23308, 24051, 24351, 22196, 22137, 17655, 17871, 23766, 26320, 30121, 31234, 33198, 35106, 45019, 55630, 68507, 90648, 118014, 127629, 133044, 133659, 132203, 131487, 134846, 137524, 138974, 140335, 139818, 146152, 155088, 172994, 190914, 219354, 250481, 276031, 315852, 369359, 455866, 582656, 760047, 1017421, 1396116, 1881820, 2344636, 2500555, 2157679, 1544526, 1026825, 694745, 485035, 354932, 274087, 212968, 171906, 138762, 112076, 94916, 84478, 76415, 72509, 71367, 67612, 62659, 62433, 67914, 75126, 73875, 79279, 76845, 59788, 53933, 45333, 34737, 29004, 32164, 38243, 32411, 28153, 19023, 12987, 13290, 21144, 29695, 38056, 38198, 32938, 23652, 20170, 18224, 14032, 12127, 7479, 7922, 10271, 8304, 7629, 5379]
6674E379m228Q34K890j309j31J984k779m105L853l056n525o087L903O480N74n782
6658g105J115J547O88j445J501O072N33k027n426L100N693o542l380k653p463
6643a5792N867J1175n33l002K189M831k065j453l847M00O981N44k988k113p21
6628e27O41m623p01N86j223P50o53L211M456mL905l304k875L690N179j51k655
6611E702N49l617l069k702J480Q77m71j366o970p441j237N064L543j365j130O21
6595a1532K077K739Q801Q34O96n16l451n289M619K499k204K679M508j329p050
6580a919j943Q626j471o636O08o63O356N976o102o432k356k796P043j83l219k530
6564g641M430O590L339L432j0006O325K94n492q542r773M697J997L076l952L935
$$ y = [5379, 1151, 1985, 4875, 3566, 3435, 5419, 2640, -1465, 2388, -668, -6193, -12280, -8377, -1897, -1323, -7105, -5990, -4443, -3755, -5200, -3699, 2373, 2906, 879, -4547, -1447, 4246, -2296, -5676, -8329, -15792, -9925, 1250, 717, -2285, -96, 4735, 2670, 1217, -2630, -2230, 4751, 5295, 2307, 194, -527, 114, -4509, -5210, -4624, -5847, -5097, -5750, -2539, 1917, 1913, 5818, 2514, -361, 3329, 8508, 8357, 5702, 6251, 2634, -435, -3137, -1657, -780, -1251, -2617, -9587, -17028, -18265, -13201, -9658, -11023, -12153, -11532, -9455, -6716, 2085, 2919, 3615, 3099, -352, -5641, -1022, 1477, -727, 1952, 6460, 5131, -1919, -3862, 4764, 3293, -3343, -2735, -3398, 2958, 8934, 2832, -3600, -5956, -8752, -1709, -1892, -5111, -7641, -3211, 3379, 6718, 10150, 144, 6469, 6763, 1271, -7271, -17044, -12347, -10350, -7274, -11226, -7291]
6549g291K464l722k614j573J395N091k192o823l088M297M435J312M871N981M258
6534F801o871j643J627J1426P509l397j4107l066Q74j619K416J59j38K936n658
6519b751k992M499L391o415o1N143j397m238J531M517j32q655m410M176J434K867
6503c493O25j860K693J378M34M098J45q766q88M436K620N486J978m897m335J597
6487A251j187M35q02M496R22K768K603K509o46o139l428M277L92m606l660n207
6471f022j752j874l867n270N961N866Q158N875Q533L136j1993m999m786r23P098
6456C141pj203m188J164j159M602K616m913J654n478q990O308L024Q87J430l481
6440d593p42n168K652Q43K137K188m098j027o395M168l804P254R456l963r79Q18
$$ y = [-7291, -4827, -8549, -11163, -12736, -11341, -6250, -8442, -15265, -18353, -14056, -9621, -8309, -3438, 2543, 6801, -70, -1713, -86, 11340, 18849, 15452, 1345, -1721, -847, -2466, -50, 109, -29, 2907, -2751, -5743, -1244, 2147, -4268, -4329, 814, -583, -4821, -3290, 1227, 1095, -7560, -11970, -7794, -6360, -3493, -2868, -4728, -2035, -657, -223, 3875, 4020, -4746, -5634, -1198, 1422, 6908, 8886, 3989, -346, 1251, 64, 499, -303, 4193, 5115, 7883, 10486, 12995, 12349, 6210, 2782, 7059, 7451, 2845, -815, -6022, -7774, -9648, -13515, -18785, -12824, -6958, 1200, 7075, 15608, 18744, 6751, 1752, -3034, -3957, 3141, 3134, 1931, -2257, -1093, -2252, 2350, 4966, 53, 1707, -3771, -12761, -6453, -3429, -2542, -1112, -4593, -5335, -10503, -7851, -7008, -4871, -2683, -6781, -7808, -14203, -10035, -13839, -6585, 2871, -1092, -2071, -1253]
6424a253K320k659o36J772j487o657N072L361J376l03J116N450j258o572L132
6409B774K634k3l848k395L64J385N05p88q02l872l402N765j781m218k362M214
6393e850M037J670L08k910M99K86M109O317O83p226o647Q440K001J951j904p743
6377a979m175M051L537n872l34J875J707J11j796P027l148j508J621l244q78o854
6361i859l546R257L988Q15Q85J2239L166n357J374o204R36j693m341M284k298
6346C646m280k148n587j449L710K590N37P8j087m840k259L626l688N712L996J824
6330C81n442o47l405N50L346j06K369j045N882m306K390J519m818J63J998K581
6314A410l25m263m160m578M127R97O7K427J829l352L902J549Q91K818j457m310
$$ y = [-1253, 1067, -1592, -2228, -456, -1943, -8600, -3528, -167, 1209, 906, 2022, 7472, 6214, -358, 2774, 5408, 5385, 1537, -858, -494, 891, 1396, 608, -194, -4066, -7468, -1703, -3484, -7702, -10064, -5850, -1813, -143, 165, -2745, -2246, -1960, 2149, 8466, 9149, 1923, -4724, 3716, 5717, 7668, 5764, -1979, -6154, -2103, 1434, -4438, -4772, -2897, -1190, -1079, -2875, 4152, 1004, -504, 1117, -2127, -3005, -9859, -13405, -4148, -160, 655, 1540, 13779, 16945, 11588, 12962, 6758, 7694, 6001, 1660, 5944, 3646, -634, -2782, -8369, -9818, -6108, -3518, -2981, -2903, -3990, -8830, -11089, -7463, -11151, -5439, -1443, 381, -5061, -5708, -9113, -8563, -5217, -5323, -2954, -3999, 1883, -2423, -33, 1486, -3332, -3169, -1171, 1410, 1085, -3178, -7338, -11916, -7789, -6792, -6725, -4298, -2469, -5821, -1919, -370, 521, 3339, 1882, -2428]
6298b428m816l603K317M103P427J676j797K287M353k779m053r74M096J819l025
6283D603r966J613Q146J18k868j113N645m728l883N015l930j732j542K803r35
6268b754k2l705L187K082k607k185R351K791p966m698j241j666J324L428l08j832
6252f821l424k789P069L545k93J698j580J769j851N193J326l269K499O64j827
6237A909k327J953p795p427r93J495M573N311M194M209m110m532m418k315L35
6222i938m9J654J149P589N463J888p700r431K095J814p479j263K937O191M130
6207i50o731p30J52m100N586J0387K306k578m296m083k581j933K620K907L163
6192h61N01j0481m264O221P780L292L927l691K581l587l443j321n932L0P243J540
$$ y = [-2428, -7244, -10847, -8530, -4427, 3000, 4676, 2879, 5166, 9519, 6740, 2687, 1713, 5809, 7628, 4603, -5363, -3750, 4396, 4514, 1646, 533, 6178, 1450, -2433, 2582, -1348, -3080, -4622, -1819, -2754, -2776, -6481, -3294, -1212, -3819, -6004, 3347, 6138, -1828, -6526, -7767, -9433, -8109, -4681, -4989, -6821, -10245, -13034, -5965, -2420, -2713, -1015, -2595, -826, -2677, 2516, 3842, 573, 3072, 3736, 1909, -418, 1535, -6260, -13687, -14680, -13185, -8612, -3301, 893, 5102, 992, -3540, -7958, -10273, -9938, -9987, -8333, -7184, 405, 5868, 7756, 56, -9375, -7280, -5466, -12945, -14208, -11271, -5080, -950, -7681, -8411, -8259, -12359, -6773, 3614, 5920, 3342, -954, -5037, -7618, -9551, -6931, -4024, -861, -360, -10841, -15105, -8884, -1104, 2188, 6115, 2424, 5005, 1418, -2025, -3346, -9278, -9248, -2005, -465]
6176d65l340k626j395l407k008N381M358J494q246K079P060L84P71N217K694p136
6160H15k849p177L354Q710M97N42j26j321m904l8K630m82J300O562j430L235M96
6143I814k213o581k69N597m571j537Q11M715l708l70p163P225N665O862M944n963
6127A3258q060l549j046K310J213Q7m024k222M270l252O47k390n784P629K699
6112A786L517j778p68l181j388N84p864l172O871K42J012O638j551o182m50K444
6096c240O508L265q818m444k585m885O070L142J309J26o613l812Q971J643J405
6081a958Q492K585J12r259p268n524J562M182O853K356O76M360n980k597k964
6066d372K674K376n20o393n272l934j96R833N852L547j6p957l566j85J795O467
$$ y = [-465, -3805, -6431, -7826, -11233, -13241, -7860, -3502, -2008, -10254, -8175, -1115, -731, 40, 5257, 7951, 815, -2034, -9211, -5857, 2853, 3350, 3892, 3766, 2445, -2459, -2497, 133, -349, 951, 7513, 6083, 9318, 9814, 7601, 1020, 751, 6348, 1777, 240, 1051, 5766, 2058, 1688, -5475, 1750, 7415, 14277, 19221, 13258, 5198, 1649, 603, 2913, 4126, 4213, 189, -2033, 2237, -1015, -368, -2758, -8542, -913, 1786, 5303, 3525, 2757, -424, -1812, -1228, -9092, -12264, -5393, -5151, -4139, 2499, 948, -5234, -5684, -3240, 3268, 6533, -2285, -6729, -9314, -14199, -8129, -4987, -3678, -3552, -10165, -13977, -5006, -3363, -1958, 6534, 9119, 9231, -28, -7296, -12820, -11258, -7076, -223, 2133, 2809, 7169, 1189, -1408, -4372, -1698, 678, 158, -6235, -11507, -15441, -15637, -5804, 48, 3595, 3579, -4378, -7944, -8129, -6334, 133]
6050A33P907l343o540n477J028K068K913l049k707n893k417J1036K448J613n183
6035e463o73J652L295k820K245o83L272L446k530j85k216r364p40J0604J2632
6020A2472K241m773n485M473k952j766O03p344j0324K084j826q50N085O974m211
6005e599K12o205o2O647J650M274L210p48o475m599K38J024L936N188K310l869
5989A132n374j163n717P10J0691K317L755J501k152L678K66K049J683m695j328
5974G353k806m137j813L881N651J787m24J478m499k99o522j0974m313L302J734
5959a0601M949L625j564K46n86m665J319m595m171j668k6J2105O155k901k175
5944d553j50r606Q23p36L45L495P57N224M268K534m821p860M423k8j971J142J793
$$ y = [133, 8040, 4697, -1843, -7320, -6292, -4224, -1311, -4360, -7067, -12960, -15377, -4341, -1893, -280, -5463, -6136, -4484, -1189, -4009, -1764, -2447, 825, 4271, 1741, 1556, -660, -10024, -10764, -160, 12472, 14713, 9940, 4455, 8928, 5976, 4210, 4813, -2531, -12855, -10771, -12597, -13447, -8362, -1388, -5599, -5387, -11592, -11654, -5007, -3357, 917, 4127, 3379, -3096, -7695, -7457, -6433, -2497, 2691, 5001, 1132, -4242, -5405, -11122, -10412, 279, 2596, 6351, 7852, 5700, 9378, 9644, 11693, 13376, 8681, 7353, 4547, 410, -1403, 2478, 8129, 9916, 9492, 10970, 6471, 6172, -350, -11324, -15637, -12335, -10601, -5652, -2027, -3591, -3345, -3931, -8596, -7277, -11872, -16043, -17711, -17737, -5632, 523, -2378, -4553, -4703, -14309, -13486, -14222, -13877, -10382, -9625, -4401, -133, 2401, -2420, -10280, -5857, -5885, -7856, -6714, -4921]
5927d921M366n741j278N499n57L712K186j2896m847K784K038J1939K547l231n849
5912d249k186l618o108L879Q831J213L075L030o381r76r82M323m588k325k749
5897i811N838k48L551O254n880j349j228L784J505m25m345m155l507K853R316
5882B153L747k440o458o578k712K735K417n278m1O897j04j249Q98O209N018n861
5866f47o923R2k099k547L522M811p965p26L921P468J720o069p574L117k242l48
5850a2489J534K946Q687M180O043o087p280n623L784P601j77j27L480J886O04
5835H962o127M209N129l563o662l023n513p290l738j829N749N797k320K611J401
5820f207l66l309J343L966K641o863K31L099j069p223K661J915N180k286m839
$$ y = [-4921, -555, -6296, -7574, -2075, -2632, 1080, 3266, -9630, -14477, -11693, -9655, 2284, 4831, 1600, -4249, -6435, -10053, -16161, -12282, -3451, -2238, 837, 3867, -2514, -3490, -4472, -149, -4737, -7062, -9811, -3973, -4221, -670, 5584, -296, -1645, -2873, 911, 2416, 1991, -2354, -6509, -10016, -7163, 2153, 5900, 3460, -2998, -9576, -12288, -9553, -7136, -12414, -12455, -5558, -5662, -6911, -6013, 196, 5214, -647, -7570, -7478, -9577, -12124, -8602, -3791, -11756, -12482, -8561, -1093, 627, -5442, -13016, -9899, -12141, -12489, -10955, -8009, 678, 4858, 10901, 4814, -2466, -8089, -4305, 3296, 3119, 2992, 6472, 8358, 8962, 2835, 7044, 12173, 8610, 1948, -1075, -6588, -13878, -17616, -19445, -13696, -7899, -10219, -7608, -6207, -6573, -9882, -8539, -4573, -1932, -8795, -8564, -5465, -6534, -13757, -11096, -9181, -4001, -6287, -11126]
5805a1126J547K369N319n34M33R74J606M59r989q237L571O818J386J273j579K225
5789c485J588Q651O588J430k037m306P865M329o079p770o73k750q55l341j264
5774b109m71n300m447o108N140m8j381Q221L963O28r26L238L700M090l775r384
5758d969J505M639K075m623M050L870m571M001M508j210n103m171j902O896K887
5743G882L261K363l644j931m728P28o622p461K324L531m372k407L805j03L463
5728c911M431K917m108m901L604K612M718j005n622p244K695K607J748M714j892
5713A363j1201O526J0418n415l112L611M713j921K71J636k64k70M855l79M93m054
5697G270p593j1255M00j960m13P998J0032P073P7J689o323j3468k787K223M942
$$ y = [-11126, -9579, -7210, -1891, -2425, -1992, -1018, 588, 1047, -8942, -17179, -13608, -6790, -5404, -4131, -5710, -3485, -1897, 6754, 13342, 14772, 12735, 8429, 16294, 20623, 14544, 6774, 6101, 3351, 2496, -845, -2109, -2580, -7880, -12327, -18435, -13295, -13343, -14724, -6503, -2540, -1912, -2838, 400, 4100, 8190, 4415, -4969, -3464, 1175, 3250, -1373, 2677, 6547, 1976, 5977, 10485, 9275, 4172, 1, -1901, 4995, 7882, 11143, 13506, 9862, 7931, 3203, 3931, -2691, -10152, -7828, -4297, -8669, -11076, -7271, -7374, -3911, 520, 3437, -671, -5572, -1968, 644, 5362, 4357, -1265, -8509, -5814, -3207, -1459, 3255, 1363, -9838, -3312, 7106, 1691, -1421, 2190, 6903, 4982, 5253, 6889, 6625, 6355, 11210, 10831, 11324, 7270, -323, -11578, -11178, -13138, -13551, -5553, 4479, 11552, 11629, 13318, 6995, -6473, -9260, -7037, -2095]
5682b095j340N191P10j606J625K776P498l756p682r746j920P433P218J761k878
5667C189p83L79l928k829j221m167N53j596P584M52n280M433J062Q62n734m015
5651a1039L873K848m116K223K215K335m499m518J277L934N187M23O314k725j0356
5636f624j957N341K849J229P0O074n06m806O53j515n749j461L604M714N538K464
5620I918l72K520o298j0099n497j733K457P285J424M467k397L256p11k706l810
5605b296m27O88N571J085j758rM173k445m709j1362j0437J2056J4684N723p731
5590B806r897n002l403K736N295O422J347L894J27M06j769o685j695K57n292o184
5574a6637P286R775k612j4540p565L507N886O261L423M147q044K438K586j512
$$ y = [-2095, -3435, 1756, 2466, 860, 2485, 5261, 12759, 9003, 1321, -8425, -10345, -2912, 4306, 6067, 3189, 2406, 2785, -1143, -3972, -5193, -9360, -8807, -10403, -2819, -2367, -7647, -3214, -2152, -1290, -7024, -11039, -7166, -4318, -8434, -6211, -3996, -1661, -6160, -10678, -9401, -5467, -280, 143, 6457, 3732, -6624, -8581, -3240, -391, 838, 908, 6982, 6476, 1670, 2323, 808, -4941, -6402, -2798, 1916, 7454, 9918, 9546, 12066, 5768, -4331, -9828, -11561, -9104, -1819, -395, 4072, 1675, 4931, 4220, 1514, -2296, -2723, -2035, 3536, 4621, 2863, 2854, 7027, 4582, -127, -11489, -21926, -9870, 4814, 10537, 2806, -7091, -12093, -15496, -12760, -7465, -1043, 304, 4198, 4325, 4731, 2962, -3723, -5418, -5161, -10453, -16637, -9351, 424, -2188, -16728, -24293, -20786, -14900, -8639, -5216, -1069, -9113, -6675, -4089, -5601]
5560e601m404O212J311P094O048k046j3906l556J603K631L745M246J89p439p190
5545a1063l989R275J833J092m858K89j545l775J490L758L881k345R22M854k54
5530d35o298o913L266N999n15M768M683K761m757p746n072k10k264k075M636O349
5514c823L288M613O352l79K325n94n135n404j008n36L939r177K223J639j112N493
5498B704j405j3J886m150j502O907J593m304j925O897K331K072o338l076k342
5483f65M597l254p13K554K375M308o195k228q95L710n169j943p271l191N334Q841
5467A95k439m230k879j431K894N291P05l942R06M111k47M88O01j89n525J89p232
5450a2734L17J0825N139j195j0584j363L723N868J261J218j025K483j700j864
$$ y = [-5601, -10005, -3793, -2482, 4612, 10660, 8614, -5292, -8848, -7245, -4614, -869, 3377, 3566, -3873, -11063, -15052, -5777, -3944, -2852, -7710, -7421, -8966, -12741, -11251, -7493, -3612, -5957, -5035, -181, -435, -6733, -13646, -10380, -4381, -4896, -128, 4555, 7316, 2559, -5187, -10259, -10469, -12733, -14808, -10172, -3823, -535, 4078, 10430, 10051, 12376, 11782, 6647, 1243, 235, -301, 3638, -5539, -3316, -1677, -2789, 2704, 1299, 1286, 3172, -978, -2480, 4427, 6020, 1716, -209, 6688, 9019, 11091, 4753, 1677, -665, 3932, 678, -35, 2519, 4894, 9202, 3007, 779, -116, 3594, -1575, -3518, -10789, -13980, -8646, 195, -2244, -6474, -9353, -10784, -7890, -2599, -1894, -5836, -4930, -819, -1066, -578, 23, -166, -5691, -5502, -12734, -12417, -1592, 3547, 2352, -8232, -9595, -5872, -4, 1257, 2475, 1450, 3933, 2233, 369]
5436C69k652l095O127K69J723j534L03m079j491J743P538k32r11K456M329p133
5420C730n41j494k680J278k668Q644J59k571k893l156m553j391M407K108l747
5405e368J573Q633Q47p872l601M312R65j39O042L920L761J285k379n402j0142
5390c565k894J882j435O356N587j206l294k879N063L452q287l242J835J812K624
5375A809J095k927J975n112m275o256m87O200J068o438k579k774L190J2453K527
5360e31m491M707l727l810K982l200K923J686n446O15M377Q19L823K539J606j737
5344C135p742k878K671L906q15k571J196m50K566l394m988R13Q039N08m509K966
5328a447k513p983p68K102J376n79l36L858K16L534j401M82n324l973N355r39
$$ y = [369, -2283, -5378, 749, 1018, 2741, 1207, 1510, -2569, -4060, -2317, 5221, 4989, 4078, 6534, 10863, 3730, 3189, 1695, -985, 293, -2375, 6269, 6428, 3857, 964, -2192, -6745, -8136, -3729, -1621, -5368, -3795, 4838, 5685, -2187, -5788, -1476, -511, -650, 5392, 9312, 13073, 14358, 11979, 6577, -3565, -6459, -4577, -6012, 344, 5931, 4725, 1431, -1448, 3615, 7067, -1220, -4462, -2627, -815, 1809, 2904, -23, 1952, -3160, -7435, -13691, -14178, -7978, -6910, -13348, -15927, -18701, -15511, -3058, -531, -5022, -315, -4042, -7852, -4870, -8070, -5147, -3461, -8907, -8292, -3915, -3096, 727, 3266, 4872, 3135, -4607, -7485, -4814, -908, -1723, -4294, -3098, -3548, -982, -4376, -9364, -8451, -412, 96, -4413, -1447, -3960, -11943, -12711, -10609, -9233, -9812, -10148, -6290, -6074, -2540, -3941, -3459, -8783, -12756, -7401, -8340]
5312h340J237N802m8J95N348N863O09q471k861m352J235O573L566k177m091M503
5296D591p22k266l104q460m66Q099R21J255M287J77k206l617L686r88j950P11
5280e2P161L616K38K743l211j2134M006L786j763n519m054N384k39J436M727J73
5264F298q913n23K581j10m159m803J860N49K637O045p95L400k355l739Q52K403
5248A228K221L700q14j389l077m735j690J584j885n05l76p364q50L928L750M311
5232a963m95m275k393L013M622j323O880j620q436p84J681j695l809k393L079
5217i911Q903j185M41K83k8J974m4L74j879p00M648J204R80j260r458j0731k656
5200a9045P485L453J154K833L901k935j880N057N629K590k837o049p033M82K583
$$ y = [-8340, -7103, -1301, -1349, -1154, 4194, 10057, 10666, 2195, -666, -5018, -3783, 2790, 6356, 4179, 88, 4591, 3869, 1603, -1501, -9961, -10427, -2328, -1407, -152, 4135, 4312, 2106, -1511, 2175, 1187, -763, -52, 7109, 10725, 10963, 13706, 10495, -1639, 2367, 6153, 4390, -1129, -5183, 201, -38, 1398, 6125, 6298, -2615, -3138, -557, -667, -4826, -9629, -7769, -7220, -4583, 1462, 667, 4067, 1712, -2027, -1175, 1228, 3449, 7149, 6335, 4946, 1869, -2866, -4556, -2972, -4857, -5362, -5738, -13102, -13952, -10024, -6274, -1963, -2458, -6733, -9126, -6113, -1491, -2814, 4066, 2446, -5990, -6774, -5093, -6788, -10597, -12990, -9911, -1008, -2193, -1752, -1469, -1497, 477, 433, 807, -1072, -1772, 2876, 4080, 5060, 3800, -5658, -16389, -19045, -11560, -8107, -6953, -4120, -219, -3154, -5034, 23, 5652, 8242, 5405, -644, -7677, -7195, -4612]
5185d612N345j915m671N280o4n346n707m458L733m099J567N168O104j452m908
5170a0035l950O102K286m265L508K457M636j612m106M834L368n23m082j393Q584
5155E809R254m81o158o303q532L939K282l8M587k217q018L533n491k081j432L135
5139h212N052K558m587j584L732J865k010j229R34J798P765o811o341m588k184
5124a3842Q69p71K354k190J0960K047n196l909l542l273L251L309P811J218l471
5109d375m865k499J289J232r42j606R107R64l465O163J423O338m498m307P897
5094G856j997r52P40m102P049L075n395N346o876q074m828P09J776Q05J546J423
5078a899q03L971L191n594o907J492M798l297J71N160j273l237k763p29K287R139
$$ y = [-4612, 733, -1182, -5853, -573, -637, -5983, -11690, -16148, -12415, -16514, -14947, -9779, -3675, -5127, -10035, -13985, -7883, -5597, -9862, -6354, -3897, 739, -873, -4979, -145, 3223, 2700, -1382, -2775, 5809, 15063, 14582, 8424, 2121, -6411, -2472, -190, -228, 4359, 2142, -5876, -2343, -7834, -9915, -11347, -8212, -3160, -602, -5189, -6773, -3041, -1176, -3186, -4415, -3481, -1683, 6082, -729, -7070, -11658, -13842, -12973, -13744, -11390, -13580, -2620, -573, -5769, -9678, -13220, -16493, -13242, -9933, -2122, -904, -4375, -9240, -11739, -10450, -9218, -10160, -11766, -2659, -1695, -5160, 1003, 2426, 8764, 4266, -41, 7856, 5859, 4907, 5647, 1545, 8594, 11669, 6274, 11620, 4744, -3330, -8158, -7449, -5673, -4868, -3322, -1899, -2702, 1269, 4460, -1134, -8041, -6549, -1751, -5048, -4877, 283, -990, -4227, -6990, -7719, -5432, 3707]
5062C707J706l221o423l040N602L49J097j096n927m684L828P071L272l840k903
5047d502K931n99j12L358L418m572o420J170j868m336q768L518M249O451M352
5032a730k094L089N276l784j0327q277l001N009M026M85J396L922K256J2696j236
5017G706o403j643j315j624j599N92q62j99n205O486J93j468L848N542L66j971
5001B444n679j238O67M887n10k498j796M092L783l652J352l607l739L775M864
4986C145Q755j311q350M72k087m727j562l106J4092L925j0385j874R538M319p694
4971C150K96j80k619m687k731j349j050R03l474M953j212K363Q903R466M746m661
4955A2817o193n155j343j426m367n214n137N022R663l31M3m959M897P629j795
$$ y = [3707, 5413, 2192, -4231, -7271, -1669, -1320, -223, -1319, -7246, -11930, -8102, -1031, 2241, -1599, -4502, -1571, -2170, -2282, 1076, 4494, -78, -6498, -5328, -7196, -11532, -20300, -16782, -12533, -6082, -1730, -3824, -735, 4541, 757, -9570, -17847, -20848, -15839, -11813, -11328, -9932, -6010, -3754, 8942, 7706, 1303, -340, -1655, -3279, -4878, -4286, -5148, -5347, -10552, -4066, -3873, -5341, -1493, 4049, 4415, 2444, -3235, -4473, -3806, 1081, 571, -1927, -3723, 369, 4152, 500, 1852, -1755, -5494, -1719, 3145, 11900, 10589, 2239, 2711, 624, -4103, -5665, -8771, 5321, 9246, -1139, -3013, 6525, 10844, 3150, 3446, 3266, 647, -4040, -6771, -8120, -9170, -8267, -11741, -6788, -8000, -5637, 3266, 12732, 17478, 12817, 6624, 1469, 126, -1300, -5667, -10881, -16018, -10996, -1333, -1664, -1621, -6580, -1683, 5946, 4151]
4940D151l055k454L038j464m588j305j397n960o394M62O851Q995P128J132m064
4925A076j017k933l426n368K490L475J9M323K735l94o754k693l781O376N210N721
4909E059O026M14q535o765k963M5k32K54M888j238m32m922J647r13K182M092Q196
4892F803k661k863j759L297K937k980j0680L541J3319r41r269J341M337k084l70
4877A968K650P48m498K749k463l818k406n528J162j180J554P813L541Q04N15L85
4861C996j152K29q2p376N87m577k750L651L66J156J750K666L907m64O46q437k218
4844h102K25l648k941N508K666J85j378j400L82R17j873m279R28N530K781O10
4828c889L303l490j338L099l728M166R112J64j51o935j0391k333L541Q601n61
$$ y = [4151, 1096, -1358, 1680, 216, -4372, -5677, -7074, -13034, -19428, -18966, -12115, -3120, 4008, 5140, 1076, 59, -2874, -6300, -11668, -9178, -5703, -5684, -1361, 1374, 980, -5774, -8467, -12248, -5872, -662, 5059, 11085, 11499, 2964, -3801, -6764, -6719, -6951, -6697, -1809, -3047, -3479, -8401, -6754, -7667, -5485, -1393, 6803, 4142, 1279, -480, 2817, 5754, 2774, -7906, -4365, 8954, 8013, -1256, 85, 4422, 2338, 1968, 4618, 5366, 868, 3617, 1154, -2664, -5070, -10598, -9436, -10616, -9062, -1249, 2292, 3096, 3611, 3996, 2844, 3073, 2991, -4385, -3798, -8375, -11125, -7474, -7108, -5952, -4202, -1536, 2371, 1907, 2553, -5884, -8102, -7877, -11525, -14466, -8958, -6292, -6107, -7485, -8885, -8503, -7586, -9459, -13738, -12810, -7280, -4499, -3889, -586, -4076, -5414, -2315, -6043, -1877, 7235, 7399, 7248, 313, -10078, -12411, -8870, -269, -830]
4813h30j823j441O908r67J530N506K25k258j215o960m647m863j96L380J192n21
4797f980m57P234N901j463L398q135q934N876O211n916J082m729m94n786J885
4782a1307K43N657k203L556M17L631k552o293J719P436O745j381m464o606j078
4767f480P853Q280m36n932N64j289n133p964k42N167J666J402M515L612j814L237
4751G006M412k395j756q20k658k454m493P470K334O17k136m578J001N244m18O49
4735G025n237J417r969O59J798O954J041k332m105j603M406k556p976N756N929
4720A207K396K20J279J74m669k863l892O984R762n061o436L730L480o331k579
4705b599R59O153Q42l599p766n985O353K194j888J747J008n891m314M029Q004
$$ y = [-830, -2653, -4094, 2814, 1847, 3377, 8883, 9108, 6850, 5635, -1325, -5972, -10835, -11031, -7651, -6459, -6980, -7437, -203, 5698, 4235, 7633, -502, -9436, -3560, 2651, -3265, -2183, -6912, -7406, -13192, -11307, -11064, -5407, -7610, -4054, -3637, -6, -2558, -8851, -7132, 304, 7049, 5668, 1204, -5402, -6480, 1373, 9653, 9217, 3285, 3849, 2560, -2573, -10537, -10779, -5612, -3946, -2544, 1971, 5583, 3769, 7006, 11418, 9023, 7267, 6447, 3789, 1335, -3158, 4312, 6646, 7263, 5127, 549, 1550, 6794, 6376, 7025, 1788, 3205, -6764, -6105, -4307, 2647, 3688, 1356, -2749, -4352, 54, -2502, -10478, -4722, 1207, 3603, 3823, 5102, 5276, 607, -2256, -6148, 836, 10598, 5537, -899, 2831, 6311, -20, -2599, -1640, 4513, 5355, 1756, -6010, -11995, -5642, -3448, -5336, -3589, -2581, -8472, -12786, -8757, -753]
4690g53M638l708K386O02O73N801j022l672j053o822p502J2555Q056k350N887
4675A3716m804n58K654l967m923N48k8J52R62j429M80r80k50o357q533j281Q943
4658e655N453K838l631n273l078J214K373R357q27m279j3373P21O758P209p03
4643h96L42l999o40O935L780r64l605O319P920o047p392J925J160p50j732q71
4627A485l362J699n68j597j122J946L638M269q83J009J34n717m792k71O024M753
4611F645l159n448l080L22n022P381R382j832j967J415p956N49K442K138p165
4596e355N307j844j503Q097J538k531K436q05J012l544j77J665m757m575k287
4581g323L071L979p954p809M238J980j058M741L392J952N58Q77P29j614k39R19
$$ y = [-753, 3885, 177, 2563, 3165, 3838, 9639, 8617, 4945, 3892, -2930, -10432, 2123, 10179, 7829, 13716, 8912, 8354, 11008, 7041, 2118, 2666, 2638, 2790, 3752, 2323, 2803, 1823, 1573, -4784, -13317, -14598, -5655, -202, 2636, -995, -6268, -9346, -8132, -5759, 3598, 2771, -1508, -14881, -14160, -7402, -193, -896, -554, -4553, -5193, 1742, 5522, 4558, 953, 7272, 15192, 9145, 1753, 3678, 4838, 4088, 2356, 1485, -1877, -178, -746, -2343, -3465, -1519, 2119, 6388, 5505, 6514, 6648, 931, -3861, -4132, 1892, 6645, 3486, -1962, -5042, -4720, -9742, -2361, 7021, 5189, 3222, 4637, -3319, -2770, -328, 1810, -5355, -48, -1892, -3395, 4702, 6240, 3709, 6145, 5340, 6352, 2808, 2631, 4296, -461, -5036, -7323, -4252, -273, -8227, -16036, -11798, -9818, -10876, -6135, -2743, -791, -233, 644, 1373, -241, -480, 439]
4565D39n678j095Q220J525p333j237j992O39J2925J532q363k720J42K067N270
4550D341k848k619N864o117R5L177J374j165n330M757M595J855j708p871q539
4535a0139n393J289J860J427l025n79J391Q906K734O49P456M520n193J004j925
4520D982p484k918R451K263q30j442j253j100N278N60m670k885l997q065M169
4505g941J376j0538J584Q958m95n31O789l040m873l624j503l483L285l015K899
4490a4152J0460M789L595j602N24l026n133J51L545M501K32j575k603L701J984
4475E391j998L238L570o285p858l618m276J311Q580q98N457m998k814o90k921
4460h809L778L346P36m221j0433K689J4222l684l446O320L428o765k550J512N08
$$ y = [439, -5239, -6334, 1886, 3411, -3922, -5159, -7151, -6512, 6413, 7945, -418, -3138, -2996, -929, 4341, 1493, -1126, 4738, -1379, -1284, 1893, 3267, 2102, -3228, 1529, 6124, 7979, 6271, -1600, -10139, -15532, -14243, -12383, -10956, -13981, -14560, -13169, -4263, -1529, -880, 6576, 11096, 5903, 6907, 4982, -2502, -5420, 4031, 6294, 5464, 4022, 2769, 1669, 6947, 7507, 2837, -48, -4045, -12110, -7941, -6565, -17103, -15519, -6561, -7056, -7587, -798, -3838, -8711, -12335, -13838, -17321, -14036, -17051, -14152, -3692, 1097, 4692, 3090, 3614, 588, -4545, -4394, -849, 3652, 3884, 2309, -294, 3407, 5391, 3393, 6631, 10201, 3916, -3942, -7560, -11836, -10525, -1945, -2843, 2614, -2384, -5198, -5888, -8809, -5031, -1685, -949, -5170, -15603, -12914, 1308, -2376, -5822, 498, 3926, -2839, -5389, -3877, -3369]
4445c369O574N300l576j587n739n41j121k540O70L094O67L026j968k506J371L974
4429A729L424k309o5O7J599l358J719L448J932m371n586K154M249K737L962M221
4413A5552o435j5158O92L536K491o32M930Q015m047q883p280r40L062j547o64
4398g308O28N771J03K821K794K966o033m160p70J258q860k611J1505N128j526
4383A706j790M1j992p709k300O78N008n182L759M448q12K109l240N336J683m929
4367c186O83J253k353L593L305M088p54O153j766k950j415n170K270o035m531
4352f815p67n440j685P398P762k344N17J087j267l365L531J06q406n455N765J954
4336g424M148J2860O135o564r992n975j729o243j034K444P741K422l307J95N108
$$ y = [-3369, 3205, 8505, 4929, 3342, -2397, -2938, -4059, -6599, -5929, -2835, -2168, 858, -1110, -3616, -2245, 1729, 5153, 2844, 2779, 2846, 4445, 1087, 2806, 6254, 8186, 3815, -1771, 383, 4632, 7369, 11331, 15552, 9117, -6041, -5349, -1813, 678, 46, 4976, 12991, 8944, 61, -7219, -8159, -5097, -6644, -7308, -6680, -909, -806, 2015, 4809, 7775, 1742, -2418, -3188, -1930, -10790, -13401, -1896, 3232, 1706, -84, -43, -2035, -9744, -12044, -11366, -6358, -11540, -7781, -3333, -4145, -2036, -5276, 60, 1743, -3186, -2503, -1250, -3603, -10, 3295, 7383, 6629, 12782, 11016, 8066, 6651, 1481, 3751, -2284, -6815, -7582, -13022, -14707, -7309, 453, -1891, -1374, -287, -1554, -4919, -1388, -1282, -9688, -15143, -9378, -7424, -3276, 9584, 15719, 9155, -837, -6812, -8541, -14784, -15818, -13374, -5633, -3211, -6518, -6323, -1215]
4321a215Q083R213j959j4379n545o2L099J48R67m958N890Q123j385p472j202N430
4305B776L927n033j478N46L490l806l411n95K728P861N42n056j339J733R520l294
4289I111p465k331m10L394j916o142k344J074n50M662N573O644J860J672j647
4274A1185r482n197j745J21k673N007L6j394l143l156Q156O07j875j621K738K365
4258g1o984J162J984K794J955p507k105N193j625l093k498P790M633n542k826
4243f740M343K294Q82n95K285J568o08m159l516j779n744L782O399l882M405J487
4227D22L916R30J350j278m81J22M744j681m309j1427o196o9R386M329M598M098
4211H454K336k409m213l308j73P83p566l190M239J202M045o741q89M74k133O478
$$ y = [-1215, 6868, 16081, 14122, -257, -5802, -5864, -2765, -2617, -1650, -6608, -718, 7405, 6020, -1452, -2654, 2776, 6703, 1670, 192, 738, 4228, 422, -2989, -3584, -856, 7005, 7547, 2491, 1152, 2885, 12405, 9111, 1646, -685, -1095, 2299, 383, -5759, -8103, -7029, -7579, -2917, 2656, 9300, 11160, 12832, 11185, 1703, -3494, -5239, -5118, -7791, -2784, -2748, -4142, -7285, -10441, -2285, -1678, -3553, -5174, -2436, -71, -7055, -5893, -3909, -1115, 840, -6667, -8772, -3579, -5204, -8297, -10795, -3005, 1628, -3914, -6740, -2397, -103, 779, 184, 2469, 4037, 3429, -730, -4246, -6025, -11769, -7987, -1588, -5470, -1065, 422, 4338, 5268, 6618, 5340, 4859, 4981, 9725, 8044, 3735, -7692, -13888, -13957, -4571, -242, 4356, 8454, 10790, 8381, 4168, 860, 687, 1470, -6096, -9286, -5047, -3845, 200, -6541, -7430, -6956, -9089, -2611]
4195b611m029N18L845j544K984O109k210k159k309m916K106K405m96l675N348
4180f34K613M625m808L420N154q641p596k8j396j2550j992N19R28j002P376M795
4164i217j406n733K808R228o49K48O169l317p325l878k080K120R030J0673j4149
4149g478m391J957O833L56l010k958L268L060Q42r07N194Q32o826o338m98k42
4133a0306l697o32Q55K585L355N437r14l834J844N700M310L171M535o482n773
4118A54J939k508j151n784j464L073p76J740K453K561K357j54L596K813p173r417
4102g741N58K442L159p01J873M409j552l438j0628j295J876q113m191K106K391
4087a8845M115K925K44l374L565K223R98j95N587l413K426k747r02L765l330L128
$$ y = [-2611, -6640, -6122, -2277, -3821, -837, 5272, 3062, 903, -1406, -6322, -4216, -1811, -2307, -5982, -634, 1979, 6604, 1796, 5216, 10370, 1729, -5867, -5895, -7291, -19841, -21833, -21314, -20386, -21388, -14012, -9217, -10623, -16356, -13548, -4320, -4969, -4721, 1448, -1869, -9194, -13072, -15152, -13032, -4002, 6671, -7478, -11869, -9912, -3079, -2723, -5733, -8691, -5423, -2363, -1521, -2428, 2766, 3598, -3228, -9566, -10064, -10306, -14003, -14635, -13780, -11195, -7840, -2403, -3317, -7151, -5307, 393, 4703, 7874, 12409, 5927, 154, 2093, -415, -1566, -7350, -8814, -5741, -6517, -4777, -2324, 237, 2594, 2440, 6036, 8849, 1676, -7741, -7183, -4741, -1582, -2283, -410, 3999, 2447, -991, -11619, -12914, -11038, -19151, -23342, -21236, -18845, -14730, -11805, -11561, -14935, -11370, -9147, -8149, -8344, -2757, -6170, -3744, -6491, -7393, -3628, -6958, -3830]
4071c830O415N75K15n210K723o688j267J762k834N419J82m799p564J174k68J292
4055a2703j425M545P040m80J239j742m181k193K733L343q00j473j215O37J011
4040e664N117o2L181N628n43K591m799M377j465k902p431k955Q609O207m413k967
4024B509k043j956k086k523j648M087K318j033l745n070l68O875m61P932J214
4009D002l936l797l295K940L949L489l961k616L96P02J146O65p75o333l669l214
3993a4307K548m44KN789P278m224o985l79k972L150O259K961j263k540j966m514
3977a1607L093N828Q66M130O222n50L489L512n210m584p163k128Q227k240k523
3962f38L221j254j411K320K110L08J085n84J428k76N02M45l749l385N231N312
$$ y = [-3830, 2585, 3160, 3375, -1835, 888, -5800, -7067, -5305, -8139, -2720, -2538, -7337, -14901, -13727, -13995, -12703, -14128, -9583, -2543, -3023, -1784, -3526, -7707, -9900, -7167, -3824, -4624, -6097, -7312, -6675, -5664, -547, -609, 2572, 8200, 7657, 10248, 5449, 9826, 8361, 5459, -1972, -4927, 3682, 9889, 5476, 2509, 466, -1490, -3576, -6099, -7747, -3660, -1342, -2375, -6120, -11190, -11558, -4683, -5144, 2788, 4002, 66, -3731, -7026, -4086, -137, 3352, -609, -3225, -2829, -2127, -981, -316, -1091, -7424, -11093, -14307, -11759, -12203, -12201, -6412, 866, -3358, -10343, -10722, -13694, -10544, -4285, -1324, -2587, -5127, -7093, -11607, -8514, -2686, -1820, 2310, 8532, 7982, 11471, 14983, 9773, 5189, -1974, -4102, 4125, 1885, -638, 2583, 1329, -82, 2238, 4348, 4656, 5741, 5157, 6585, 6309, 6811, 7256, 3507, 122, 5353, 10665]
3946A0665P0M112L673p511l164l258m625R36k148k977k69k634O095M257j744p659
3930f181N673N851r127L686P001J698J218j530k842j587J133J238K101L697m116
3915G913l066l495k115j226j596O3J122l735l306K94J31j476r03j146K838Q411
3899a292O144k451k894l263j138N416L788J086j951n310L25l706o998r85m639
3884a7868j223L709Q555M93l56L004Q30j714M508K314j589q507j272P023M917
3869B824K44j2J279j884j683k184K529l248j740M86l512n286N602k217N784l807
3853f825j056N829k120r64K046L556J0643K943m872q737p314m02J159k60Q64j528
3837g038K50J536O438n21n912j044J065K720O336n57J925K713o871j522O969O389
$$ y = [10665, 10735, 14847, 18520, 11009, 7845, 4587, -38, 898, -1250, -4227, -4496, -7130, -1035, 3222, 1478, -6181, -508, 5343, -3784, -98, 6903, 8601, 9819, 8289, 5447, 3860, 4993, 6231, 8332, 12029, 7913, 4847, 1352, -763, -1989, -3585, -3522, -2400, -6135, -9441, -9147, -9016, -10492, -11395, -12541, -9703, -1292, 4852, 2401, -493, -3756, -4894, 522, 4310, 5396, 3445, -1865, -1540, -5246, -12244, -13229, -17868, -19091, -15382, -6827, -6334, -6690, -3686, -2856, -4570, -62, 2252, 663, -7844, -9116, -2093, 2824, 3068, 3056, 4335, 2451, 768, -1416, 1113, -2135, -3875, -3389, -6901, -12187, -6585, -8802, -3018, -6825, -7881, -2052, -4172, -5136, -3090, 466, 11109, 14052, 9180, 443, -6871, -7273, -6114, -6374, -5510, -7038, -6788, -5252, 1186, 665, -5247, -6291, -5226, -2506, 3830, 3273, 5198, 7911, 1040, -482, 6487, 12876]
3821A2876r55o694o670o690O212N886j245m103o69L25K230k998K014n676O147
3806a0N671o379k842j0722L427J112K430J507m112Q8M0j210L803r72k385J690
3790h864K255l288K394q40l201l867K670M887K522m004J965J899m49K059j14l225
3774g201L462M181k594q552j933R89N002M877k424o242K657P505r75p418n272
3759a3938L833k77M00N099K584j82J119J945m62N28J477N84n497k740n0P698N433
3742G554K423j174l542J433j777l688J328P088N42l558k91k845J287k345n074
3727b639n606K596L129J76j507l189M352l413K431P186K571o482r70o469l375
3712a1209p56K48r8J0791P491l600j2502N438P905M11p338l050l17L820O945Q863
$$ y = [12876, 11921, 5227, -1443, -8133, -1921, 3965, 2720, -1383, -2052, -1727, 503, -2495, -481, -6157, -10, 5661, -718, -3560, -14282, -10855, -9743, -7313, -5806, -9918, -9830, -9790, -11000, -7197, -8169, -10554, -8864, -6609, -9897, -7503, -8343, -11544, -15411, -12741, -7854, -5332, -9336, -7371, -5472, -5921, -3862, -3976, -7201, -3739, 442, -2152, -10704, -12637, -11648, -6646, -1769, -4193, -10435, -7778, -273, -1248, -8666, -13938, -10105, -10382, -9982, -4883, -2299, -2481, -1362, 583, 121, 649, 2126, 2710, -2787, -5527, -5577, 2121, 7554, 9977, 8803, 5261, 6694, 4917, 1229, 2557, 9645, 10187, 6629, 6338, 3493, 4780, 2435, -2639, -8245, -5649, -2520, -2344, -3851, -7040, -2688, -6101, -3670, 3516, 6087, -395, -1365, -7834, -11209, -11965, -11717, -11815, -1024, 6467, 2867, -9635, -4197, 3708, 4119, -3219, -6269, -6586, -2766, 4179, 13042]
3696A3042m892J308l125n244l746m35M954N381M973p990k185m190l010o69K500
3681c328m531O90L796k31J661O1J12K644R37o768m410n52P211r31k126O25O176
3664A036p27K901L278K565m992l006l01J09J653J181O256O415o691j0833j996
3649c152P776L358l352M546k405m870m143l054N075k320J568J831L501M679j325
3634G713j179J867L393j858l579l345j649K33J140K774n507r884K350L660n017
3619h888q304L600j208l882P342R804J0401L793K636m400q302l573j500M48J584
3604d49O54m527r13m258L750N195Q56N282J705m226m11q60M51K907O43R84p46
3587F037o627m864K024l38N485L972k884k759L359Q602J469n354q077p25K216
$$ y = [13042, 8150, 9458, 6333, 1089, -2657, -3092, 1862, 7243, 12216, 4226, 2041, -2149, -5159, -5828, -3328, -7859, -7169, -3373, -3604, -1943, -1882, -1770, 874, 1811, -4957, -9367, -9919, -2708, -3639, -5765, -5140, 1036, 309, 3210, 6488, 9053, 4061, 1055, 754, 863, 2516, 3697, 9953, 16368, 9677, -1156, -3152, 4624, 7982, 4630, 9176, 6771, 1901, -2242, -5296, -221, -2541, -973, 858, 4359, 9038, 7713, 6534, 8401, 11794, 9936, 6357, 3012, 1363, 1596, 2736, 5510, 3, -9881, -7531, -3871, -8888, -17192, -13592, -14800, -18682, -11340, -1536, 8865, 12658, 15294, 10894, 2592, -981, -2481, -2033, -449, 205, -4322, -5235, -9493, -5743, -548, 308, 5590, 7295, 3069, 2658, 1798, 2249, 5156, 5799, 6783, 6037, -590, -5454, -3430, -3768, 1717, 5689, 2805, 46, 3405, 12007, 13476, 8122, 45, -680, 1536]
3572A536M550l368q576O20k446O88L0k000P227N375j77J20k103l027k377L546
3556c82Q404Q259N05q270n970k160k677n057O877L71p767n830p48R238R544O72
3540E009j8n440l226o06K876M881k926j0598p213O256O561N467K485l703l148
3525c343p94O452l245m642k901L138r41O33L047R91l49J966M18k14r207k023P481
3508c533J0886j967p795P396M126n724K93o908l550P50O435K363L210k369m961
3493a348j893k386N870L312j335N455k133j893J363o653l194j23N590O223j98
3478F657n708j274p342K442J225O634L466J645m569q624n308P506J283m972m095
3463a1034P54K819N286Q12k861q93K093M942q68m128n722N101O581M278o22l256
$$ y = [1536, 6086, 2718, -5858, -5238, -7684, -6996, -6966, -8966, -1739, 3636, 3459, 3579, 1476, -1551, -3928, -382, 8022, 16281, 16786, 8516, 2546, 386, -2291, -7348, -471, -100, -7867, -13697, -14445, -5207, 4337, 5009, 4991, -449, -3675, -4281, -1405, 3476, 550, -10048, -17261, -11005, -4444, 1023, 3508, -195, -3343, -4137, 2315, -930, -5572, -8473, -5335, -6276, -5643, -2596, -1605, -1954, 12, 430, 216, -8991, -11014, -3533, 7353, 5386, -2409, 4987, 9113, 3389, 3682, -3226, -6776, -6026, 409, 2772, 5982, 3613, -1348, -3241, -5627, 243, 3555, 2220, 7675, 5542, 3649, 5012, -1641, -4835, -4958, 632, 6855, 6657, 949, -325, -7667, -5225, -4000, 2634, 6100, 7745, 3176, -5448, -10756, -3250, -1967, -6939, -11034, -10280, -7461, -2175, -1363, -4224, -5117, -3024, 1918, 1050, -3078, -8800, -3699, 2882, 7160, 6538, 3282]
3447C282n541p172l381N654O459M045k017l881j1165L491L990l082K714J768j300
3432f136O597L673K405n574n039l247L153O897L297q27k257m194k485l254j585
3417h576M218O206K308k518m457m680j0068n782L863J1464J503N230J386k309
3403b212N77L500l608R77K724n791l132r68q51j207P33N17J963L784O622K789
3387F417Q033j178K698N77j2832n687l799K131P165k451j080K658P565M274m459
3372A0032j962J977l873j361M69j158L87L19o57q058l428L784J916L923r439o91
3356g820K193p80n805o484K239L124O103M182L313l840l686N508M808L548l137
3341C466o355k61M1k229L935M788N440K156n782j2524l50J030J432l194P87M516
$$ y = [3282, -2259, -9431, -12812, -7158, -699, 3346, 1329, -2552, -13717, -10226, -6236, -9318, -6604, -4836, -6136, 461, 4134, 6539, 965, -4074, -7321, -4168, 2729, 6026, 5199, 2942, -1252, -3737, -6991, -8576, -4358, 1848, 4156, 1638, -2819, -7499, -17567, -23349, -19486, -8022, -6519, -1289, 97, -2212, -1635, 1865, -1743, -766, 1958, -3833, -6965, -7933, -8784, -9991, -9258, -8741, -6778, -2994, 3628, 6417, 14450, 13272, 15970, 16547, 3715, -1972, -5771, -3640, 3525, 1074, -6, 2652, 10217, 14491, 10032, 8070, 10047, 6174, 4813, 5282, 4124, 4511, 4830, 4173, -3885, -7313, -3529, -1613, 2310, -7129, -7820, -5627, -6407, -12212, -18696, -16457, -13333, -7230, -3048, 265, -3575, -7261, -1753, 3055, 6603, 3466, -2889, -3150, -3109, -5338, -1403, 3385, 8825, 10981, 5199, -7325, -7675, -6645, -5213, -8407, -7620, -3104]
3325c104J76n567K848P522R198p659m497n227K819l616m001o52P807M12M95j217
3309d263k435K855j3k158Lk029M190O336K047m250o377n502j803N250J777K945
3293c427O332m96n692l605K416R502J213l845J330M826P169m077q349l504k301
3278b508j33k29o34j347P84j472K007k363k58N203J786P25R29j376k638J421J740
3261A637J14o95K805j823o444J460k754r418n01J160K901j563P274J068K03k542
3245g118n040r37J0038n41l677k107L404J597l226K290R66p826m202J137J033
3230a4209o140K293O315M542K034L691K664J612j905r504k734M775L179N72M70
3215b345n63N618r09j60K755R1l712K9P126J080p606m139J871j365o091p239M
$$ y = [-3104, -2928, -8495, -5647, 1875, 11073, 3414, -1083, -6310, -3491, -7107, -11108, -11760, -3953, -3541, -3046, -4263, -6698, -3843, -3856, -6014, -6011, -8040, -3850, 2486, 4533, 283, -6094, -11596, -13399, -8149, -6372, -3427, 2905, 2409, -3283, -6888, -4472, 5030, 6243, 2398, 3728, 8554, 15723, 11646, 3297, -207, -2508, -2641, -2870, -3504, -4851, -4067, -5539, -3532, -5895, -6153, -950, 836, 1561, 2490, 1114, -1524, -103, 1637, 1751, 1056, 3861, 2038, -4406, -2946, -5700, -15118, -15619, -14459, -11558, -13121, -5847, -4779, -4576, -7118, -12158, -13095, -3057, -3598, -7275, -9382, -5978, -4381, -7607, -5317, -4351, -12177, -16379, -15242, -14209, -20349, -18056, -11741, -7199, -5165, -1474, 1190, 2802, 897, -8607, -11341, -6566, -3387, -2815, -2345, -2908, 2710, 1801, 1641, 4396, 4487, 775, 804, 7930, 9010, 1404, -2735, -864, -2229, -8320, -15559, -15555]
3198a5555O930Q555J497n058j853k257K398k800j961K82m68K642K814P577L119
3183E862O27m055K160j61N98l334p444m172j609j717R107P82j335P167K304l685
3167A095k550O410L831J508j404n755p78j911j041P210M956L07n725o668n51J86
3151h80J788j32l648K539O18j623l097N386m191k360L785m548j190j104K098J049
3135e510M489K998L388j581k979p00r79j282k732J831l64j205k100M617N088k306
3119F73l266k258M340k491l255J259P63L276K159Q46m989J639N515K78m974l485
3103c970k515k591K420Q101J891P504n62o265n731p575M054M96l198L601N716
3088A376O009K761q005l634J2180O914k799p032n610N82N400J380M418n188o603
$$ y = [-15555, -8625, -70, 1427, -3631, -5484, -7741, -5343, -8143, -10104, -9822, -10290, -7648, -4834, 2743, 5862, 6489, 2434, 4594, 4433, 5031, 1697, -5747, -9919, -11528, -13245, -4138, -3356, -4691, 2476, 4780, 1095, -1455, 4955, 8786, 10294, 8890, 3135, 2357, 446, -595, 6615, 11571, 11878, 6153, -515, -1066, -880, 908, 776, -2872, -333, 285, -1338, -4435, 951, -3240, -5600, -1815, -6363, -7553, -8657, -6559, -5510, -1021, 1977, 5365, 3784, 805, 105, -874, -2156, -4888, -3057, -3421, -4626, -6726, -2109, 2979, 673, -2593, -4851, -511, -3002, -6257, -4998, -4235, -959, 1200, 2046, -2943, -1304, 4211, 4489, -485, -3970, -6485, -9076, -6656, 1445, 3336, 10840, 10278, 4013, -1718, -9293, -5239, -4743, -7941, -4340, 1376, 7385, 10146, 2141, -1493, 10687, 17601, 14802, 7770, 2160, 2742, 8142, 9522, 13940, 8752, 2149]
3073B149l900K391O834K192j424J964M822j629j1542m617L492r530n494N622K846
3058e824K10j618K255m908J717N538p31p72O865L353J910p24n847K518j039l999
3042a096k766K75N587j847J18L396R58j744k183j289M864j246k793j508L841m276
3026a709j0118j99J160k758K592R639L922n470k784N130j004M835q8l159m045
3011d056j329M325k060o34Q84L729J957J458o771p167M704O59j0044l295M440
2996a3200L564Q023J622J850q62R57n366Q82J390L38j981m21k744M393m25n20
2980b500J492K728R66j523j486l600K357O586K185j106L747O37o897N39M617k124
2964F618j548k635l516q0J8k294J847l661k114L798m389O679M244j343m86M57
$$ y = [2149, -1751, 640, 7474, 9666, 8242, 10206, 15028, 13399, 1857, -2760, 732, -8798, -14292, -8670, -5824, -5614, -7232, -4977, -9885, -8168, -2630, -3361, -4133, 2732, 6085, 7995, 7271, 1424, 3942, 2903, -1096, -3862, -3587, 2000, 153, 271, 3667, 4625, 2881, 698, -591, 4273, 3027, 234, -1274, 2567, -1709, -11827, -12026, -10866, -13624, -11032, -1393, 2529, -2941, -5725, -595, -1599, 3236, 3148, -11, -4056, -5385, -1060, -3120, -3754, -2870, 859, 2816, 4274, -2497, -9664, -4960, -4301, -14345, -17640, -13200, -9636, -1613, 9, 1859, 997, 1954, -3412, -2530, -1140, -802, -2783, -3204, -5948, -1555, -1980, -2500, -1008, 1720, 2686, 1163, -323, -3923, -1566, 5020, 7205, 6099, 9846, 10483, 3586, 4125, 8742, 6618, 5070, 2435, -1081, -1161, -1143, -3437, -1590, -5251, -7365, -3567, -7956, -1277, 2967, 1624, 1138, 1595]
2948A595j697J637o210P92J549K662K037K22j813K657j665l465k172J553k251
2933d569q24m83o236P50N573J264O373Q899j326j1021r782J174K041m823p431
2918b0421J999M442O182P345j1752M003R703O473M43l772l531O551K241m485q913
2903c492j792n72k154P130P013k915m563m297L970O259O825K628q18o371k626
2888D225k107Q07l300k873L246k556j903n438J281R705j535l144O479m27l794
2873a334J017R72j85N016M440J210J189m458p239j701Q19n437N787M761m945k15
2857c03k444n846j402K056N691J629j105P542M358L8o003m301M568p535l873k083
2841i013M468M450j52n418L213o50n323r04O958Q973N897n034r961o606k465M653
$$ y = [1595, -102, 1535, -4675, -3883, -2334, 328, 2365, 2587, 774, 3431, 1766, -1699, -3871, -2318, -4569, -5393, -5876, -12112, -11362, -5789, -4525, 1848, 10747, 9421, -1600, -11382, -10208, -8167, -12990, -20421, -18422, -13980, -7798, -453, -12205, -8202, 1501, 7974, 8417, 4645, 1114, 7665, 9906, 5421, -3492, -5284, -5856, -8010, -880, 6133, 3218, -1345, -5642, -1672, 4587, 11412, 14040, 13222, 6851, 4225, 2118, 2925, -375, -3248, -2, -2558, -4461, -9899, -8618, 1087, -448, -3592, 2887, 2460, -1334, -317, 655, 470, 5486, 9926, 11136, 12325, 7867, 628, -1073, -254, -5691, 96, 4857, -88, -303, -2747, -8593, -9995, -7939, -2248, -619, -1724, 5818, 10176, 10214, 4211, -90, 4478, -3057, -6930, -9013, -4545, -95, -247, -5665, -2452, -3102, -8425, -9329, -2371, 6602, 12499, 7465, -2496, -9102, -11567, -6914]
2825f914p319m420P234L970P791N294n028l490k516K721J902R292l609j2821n58
2810h471M704L987n429l664N396L365P578J934l450l541j982j743Q403K508L709
2795A3304o084r632l800K753L509K384j818p02J430k931j738J67J339M23j578
2780b974l438j929M591N383j348p685k920N540R190j948k472q736m362R279N883
2765B054K904m143m753k580K01K148P571P129j698o625o858J0307J396j1534j198
2750e679n91P277J318n523k371j460N095n13n119n112P463j809j316j13K903R77
2734d573P18m073k384N453K097M717R412j056o707n783m800J529N847J855J078
2719C330O7o752m644J230n702R695M644k773n322P874r49j185q477P38L003o24
$$ y = [-6914, -14233, -18653, -11419, -7449, 342, 5636, 608, -2882, -5398, -2677, -775, 8517, 4908, -7913, -8471, -3767, 220, -5209, -8873, -3477, -112, 7466, 9400, 5950, 2409, 427, -1316, 7087, 9595, 13304, 7220, -2412, -6212, -3459, 50, 2434, 616, -86, 1344, -1587, -3325, -3158, -1819, -1396, -2974, -6412, -8341, -3750, 1633, 285, -7400, -10320, -4780, 4410, 2462, -10, -8746, -13108, -3829, 2054, 4958, 815, -3938, -6518, -6317, -4169, 3402, 10531, 8833, 2208, -4650, 5657, 7053, -4481, -5679, -6270, 1007, 2325, -3198, -5569, -7029, -1934, -2447, -7566, -12678, -5215, -7024, -8340, -8453, -5550, -4573, -3855, -7928, -10312, -4859, -2762, 1955, 11367, 10311, 3604, -2179, -6979, -5450, 397, 2252, 3330, 3397, -3355, -7999, -6769, -12471, -2776, 1868, -905, -6227, 1647, 698, -487, -8964, -8226, -5223, -5847]
2703e847j666L414j829k490k511R545K10n105P70M203P594K274n058m838j205
2688b539j214o346M398K496Q628o78N381o34m628p384O456J199j345m208L75O086
2672F043m185N171k68n614p89l248j05l241N453L205m863j0904k459J0789L558
2657a457n720l383q74l2J955O803J642K569n53m997K202K639k010J629k859m284
2641f730k90N362O842R39J85k913L961k027j507n615j967P881j04o974l743O858
2625A58P942j127k27m643j090P105j762K45k01r90Q78k719m243J720k573l579
2609e106l428k604J132L573J556k261mJ733j432j770N328O773l145K883K376m904
2593G00l866j353L093j125L53L081k720j956l328J659L467j401k02R63R65m216
$$ y = [-5847, -7513, -4099, -5928, -8418, -10929, -1384, -1174, -6279, -5509, -1306, 6288, 8562, 3504, -1334, -2539, -3753, -10099, -5701, -3205, 5423, 4745, 10126, 9492, 4864, -2520, 3936, 5135, 3790, -418, -43, 6043, 1858, 7029, 6761, 1147, 358, -2890, -2995, -6236, -783, 2422, -2441, -13345, -15804, -5015, -1457, -7177, -10560, -11434, -11466, -9511, -2708, -1066, 1503, 950, -4047, -1845, 794, -1216, 413, -2446, -6730, -7020, -1658, 5184, 6123, 6308, 3395, 7356, 5329, 3822, -1793, -3760, 4121, 4017, -2957, -6700, 158, 8100, 6973, 6746, 2103, 1013, 8118, 6356, 6601, 6400, 5410, 6288, 3569, -674, 1046, -1527, -5106, -8534, -11138, -10006, -6433, -4877, -7138, -7142, -5409, -6841, -8611, -3283, 3490, 345, 3228, 5604, 700, -3166, -4519, -1426, -2551, -2198, 883, -1837, -3793, -7121, -5462, -1995, -3396, -3598, -2635, -1670, -5886]
2577e886J457n914j168O312M361p46K096N703J95m483L120K047n162p038l563
2562h669P34N88K979N304O332j573p26m393l482k566K09r24O596L291q270P836
2546C266L702o52k634q240o320K732Q285L096M65m264j547k493K933P820K989
2531I138r41O036M793j149n116o662q668q624j813M840O434R7j522N70L19M069
2515A801Q464J364L722K263o27j990n70l754k353j00J49J348n470k234n38M02
2499A877M57M048M440O512l262r027q952k005L842L964k473N26J548m713k614
2484e832N13M78M221N480N89j584K182J893r817o398J868N103l399k938J352N256
2468a033L020J726J405l694o729l179P499P067L794k326r254l965Q997M843m886
$$ y = [-5886, -4429, -10343, -11511, -5199, -838, -1584, 512, 6215, 6410, 1927, 5047, 7094, 1932, -5106, -8669, -7935, -7347, -4368, 936, 7268, 5695, 4969, 576, -2906, -5472, -5263, -6187, 409, 3700, -4570, 3266, 6968, 6316, 3682, -4558, -10878, -8146, 139, 3235, 3700, -564, -2111, -4604, -1671, 6149, 9138, 8197, 14233, 19026, 17877, 12761, 6099, -2569, -11193, -13006, -8166, -1732, -1635, -3157, -2587, -2268, 1801, 10265, 11629, 15351, 17614, 16987, 14997, 14427, 10673, 8320, 8220, 8369, 9717, 4247, 2013, 1475, 1877, 2334, 6382, 10822, 17334, 14072, 5045, -3907, -5912, -2070, 1894, -579, -53, 1495, -3218, -5832, -5319, -4841, -620, 4860, 5449, 3865, 6047, 7940, -1877, -8275, -6407, -1304, -4703, -7641, -6289, -1033, 1987, 3713, 5118, 1424, -5305, -8484, -985, 6082, 9876, 7550, -1704, -5669, 3328, 8171, 3285]
2453C285K173J96R26j165l020M427j778q473N065M900k173m02J190M875n360O13
2437E279l757l214j921j879o76M063K393K837k033o871j167J0819J004P76L052
2422H705n055n660K766j959r95Q92j308n66Q496l216p030l267R944L598k35J280
2406F390k93k308m834M7N224P94j487R157q71q357O58n013q822O636M652j343
2390B30N419J164q40p136q52L3k27J599j596j215M958L292J17n127k707L69L667
2373A148O78p84l342M310l217m889L853K156K506oK73n30l488l600O526M595q8
2356F101k2J258J95m3K242J805j378j064M136j598K005k575n170p925K275n53
2340c11M727j957l240K008J176J86k268l535k565k703K487K650p44l100J102K375
$$ y = [3285, 5458, 5654, 6580, 5415, 2395, 6822, 5044, -3429, 1636, 6536, 4363, 3961, 5151, 10026, 4666, 5279, 1522, -1692, -3613, -5492, -6168, -2105, 288, 3125, 1092, -5779, -6946, 3873, 4877, 5653, 8705, 3650, -2010, 756, -1203, -2198, -1306, -2614, -3180, 5316, 2100, -4930, -8197, 1747, 5345, 5110, 6390, 6097, 3789, -1045, -998, 4226, 5020, 3533, 12690, 11819, 3462, 4120, -893, -9715, -3079, 1573, 230, 5649, 6813, 5973, -1163, -2015, -1982, -2209, -610, -2206, -3421, 1537, 4829, 4946, -181, -2888, -2519, 1148, 1826, 1042, -2300, 2010, -1207, -6096, -2243, -87, 2419, 2413, 2686, 2156, -1332, -4932, 1594, 6189, 6101, 6079, 7337, 7532, 7489, 9731, 11536, 10158, 9094, 13230, 11632, 13637, 11062, 5892, -2033, 242, -311, 4416, 2459, -781, 1227, 2403, 2589, 321, -3214, -5779, -8482, -5995, -3345, -4089, -7189, -6087, -3712]
2324c712L354o961l969M03L150K163M652K431q077o036M944P44L223P5L759J911
2308B054L166K422K309j28m168O36j06o71j829k10L26n000n477p14M022l404m524
2291a1296k374N855N550j638N152J47p77k150m52J037l39q10k752o64N487N77
2275E53n279j525N425o69K784J367n768p717M37O047j720K305o49j358J842k435
2259f360m697J4O206N026l840J028j569l41p50O53j993J124j852P440J699O43
2243B431L72M825r90n929p386j807j95R37J0218K334m729l557o401L894N437N778
2227E232j127J996j1615k780J3358M815m569j1014j774j797q400N872M876O530
2213c97J417m299L88M160m24Q433j931m759J023l213O8N478j465K99m404j891
$$ y = [-3712, -358, -7319, -11288, -10885, -7735, -5572, -920, 1511, -6566, -12602, -7658, -6914, -3691, -3616, 143, 2054, 5220, 7642, 9951, 9823, 5655, 6291, 6185, 5514, 3685, 3475, 3801, -1199, -6676, -7390, -3368, -6772, -11296, -13670, -7815, -2265, -3903, 1249, 1396, 619, -1531, -1983, -946, -1285, -2095, -4847, -5511, -24, 553, -4726, -6251, -826, -1495, 1289, 2656, -3112, -10829, -10392, -4345, -6065, -3760, -4409, -5767, -3925, -6360, -11057, -11043, -4837, 189, -3651, -2623, -4192, -4533, -5283, -4630, -6623, -5499, -7351, 89, 1788, 2431, 2803, 7628, 6638, 709, -6677, -8484, -8679, -7742, 2476, 4810, 81, -3476, -9877, -5983, -546, 5232, 4105, 6101, -5514, -8294, 5064, 9879, 5310, -5704, -7478, -9275, -17675, -11803, -6927, -397, 1020, -3279, -2891, 1269, 845, 9278, 7347, 2588, 3611, 398, 466, 5944, 4479, 4778, 374, -1517]
2197a517n009m223J588J033j59O220N924N63p013q01N183n940n753k550P40j166
2181a2880L967M569l34l829m961j506R357K836Q355n654p447n360N425N745k442
2166d159j96L569L351K345n549N0L545N097j37n072l867K504K314O461K737p681
2150E312l284k670O083O442j065n403j780j223l280N132N768m290J406J983m444
2135D687l438n211m930L467K656L285j953J683J961P44J070J673o62n406l915
2120d289J160j060q00O913Q019q79o995j298N002l034J249l486m295l244J471
2105e566R37N647L082j097o060j600N990L903M247O462j095r840J482M271l486
2090G277o470l022J493J275O40m102L119M830k113M89n87L097k442j983P383j570
$$ y = [-1517, -6526, -10749, -9161, -8128, -8287, -2067, 3857, 4420, -2593, -3394, 1789, -4151, -9904, -12454, -11714, -12880, -8913, -4344, -4678, -8507, -13468, -14974, -5617, -2781, 5574, -80, -7527, -12887, -7462, -1717, -4159, -4355, -786, 2565, 4910, -639, -589, 2956, 8053, 7916, 2844, -1023, 1481, 3795, 10256, 12993, 5312, 2028, -642, 5441, 11883, 10818, 5415, 3635, 2412, -868, 4264, 10032, 5742, 7148, 9131, 4687, 1249, -3962, -8892, -5425, -2769, 516, -1437, 246, 2207, 2951, 4021, 5694, 5032, -374, -4289, -3129, -4189, -4989, 1924, 9943, 9064, 2069, 771, 5773, 2739, 3988, 502, -3793, -7037, -5566, -4629, 1018, 4100, 3003, -3057, -4657, 1333, 5236, 9483, 15945, 14850, 5010, 6492, 10763, 7277, 807, -2215, -722, 553, 1193, -2909, 210, 5040, 2927, 3416, 2829, 5926, 3484, 1501, 8884, 7314]
2074G314p391J878j215j623N77J510O057j701m317m20N275J296m296J790M444
2059I178o426o990M960K45p269l64J053o86J288M250N703N284k618k763j191j240
2043B414q466m3R35l003J112Q545L749l711p703l336J903o457l473M108J2587
2028h39P194M210L210n232m899J174J059m484j069M59M178R467M763m345k135
2013A2711n571P864m29j0281m922K995R607k375m762N810L015k387o339J386p39
1998E583n652p93k328o17N841J618m234j01P996L28p026p10p92R1M615N131k457
1981F493k777J111k080J578l73r13N408L05l507O006J902k308M018m952J990q550
1965C351q677l777N22K653j243n665J267O645J0449K002J011o242K208j09J2L611
$$ y = [7314, -77, 1801, 586, -1037, -460, 1050, 7107, 5406, 1089, 669, 5944, 7240, 2944, 4734, 9178, 2752, -4238, 722, 967, -6302, -6666, -5613, -6299, -5011, -761, 4942, 10226, 7608, 4845, 3654, 2414, -6052, -6095, -5160, -8163, -7051, 1494, 5243, 1532, -6171, -9507, -7604, -14061, -17534, -13426, -839, 6355, 10565, 13775, 8543, 3644, 4818, 5877, 1393, 324, 783, 4961, 14428, 19191, 14846, 12711, 7140, 15004, 14575, 4294, -628, 2367, 11974, 9599, 4837, 10647, 13662, 11275, 4936, 6322, 5583, -69, -862, -3190, -3807, 2034, 3652, -582, -683, 7313, 7641, 615, -95, -887, -796, 3819, 8950, 6493, 3716, 4827, 2747, 4325, 3952, 3039, 8447, 8752, 5245, 11251, 13153, 10845, 14863, 9911, 11901, 3351, -5326, -9103, -8581, -5928, -7171, -12836, -11569, -4924, 5525, 7527, 8538, 2296, 4504, 4395, 4407, 8018]
1949H018k112L854p92J457r41r665n45q53l445m368N9N421l687o5n024N443J878
1932e367J130k664k092J541j427l781K065J642n487N282P875N018L171p958k845
1917c897O08R429M395j432K757j413j300MK98m188j275o258k244Q82k503J871
1901d266P060k517M333m61K485O34q457n795O943N038J262K254k408n230M46O096
1885G417K351k239n974n359o887L038M528J709p89L048q346n303M484L967m07
1870d762O737J087L327n50J533P50j367J254l903o579M112J092K994L579k682
1855F622L29q91q493J6N011j162M404j261m982k884m786Q01r70J580J745m11j952
1838g284N869l031J356K460j640P52K370L70M846M19k420J0o240L333k792m242
$$ y = [8018, 5906, 9760, 8968, 10425, 9484, -181, -726, -1579, -5024, -9392, -9333, -3912, -7599, -7664, -12688, -7245, -5367, -4237, -6901, -8993, -7452, -8879, -12660, -10595, -8953, -14440, -9158, -1283, 3735, 6906, -1052, -3897, -3289, 6140, 10535, 9103, 11860, 10447, 9147, 9151, 9449, 5261, 3986, -2272, -4516, -3634, -6137, -4266, 2794, 277, 4610, 4149, 6634, 7268, -1189, -6984, -41, 4997, 6259, 8513, 6105, 875, 1321, 7417, 9768, 7529, 1555, -3804, -10691, -7653, -3125, -1416, -2205, 843, -7503, -12806, -8322, -4355, -4762, 1975, 3062, 6389, 5839, 7372, 8122, 6755, 8009, 4106, -2473, 1639, 2731, 5725, 9304, 6622, 6951, 6060, -2433, -2417, 2594, 1432, 5836, 4575, -407, -3291, -8077, -7276, -8246, -6666, -4921, -5332, -7284, -1415, -4446, -3090, -630, -2270, -1518, 852, 1222, 6068, 6487, 4067, 4077, -2163, 1170, -1622, -5864]
1822e864k315L624M119J019L026l828L648K630K112K459q577m296N760O306M57
1807A0280m239m962J420q113Q93L621K052j892J261J923k337k710L91J452J130
1792A70J243R574j050n980j2151j895O592Q332k756l14j36m898p477M102L671
1777b973m151N173J429L233o790o861P658R20n18J21L882M382J173M033j162K14
1761I763j05k502q20L921j404n623o253q456k835J0195L795M030K757K699O62
1746I824m093m04N846P49p739k342m977k227J0293M282N24J00n137k96j0104o502
1730a2203K477J602r78j343N081n88M464K109N826M503o970m470q899J789J0624
1715C024J361l705j609l393N823n22q097k152K602K297M247J1077J786J101n984
$$ y = [-5864, -8179, -4555, -436, 583, 3609, -219, 3429, 6059, 8171, 10630, 2053, -2243, 3517, 9823, 10280, 6041, 1079, 2499, -5614, -4721, -1100, 952, -940, 321, 2244, -93, -2803, -2412, -960, 170, 1413, 10987, 9937, 3957, -8194, -10089, -3497, 4835, 2079, 1765, 1629, -3269, -10746, -6644, -2973, -7124, -1951, -522, 2711, -4079, -10940, -3282, -2362, -2880, -2759, 1123, 5505, 6678, 10711, 9549, 9763, 9658, 7156, 6336, 10257, 8853, 3230, -3023, -11479, -14314, -4119, -324, 3706, 6463, 9162, 9824, 5731, 5327, 11173, 11922, 4183, 1841, -3136, -5363, 4930, 9212, 9736, 9836, 4699, 4403, -5701, -12203, -9726, -8124, -9102, -10445, -5364, -5952, -1488, 621, 6447, 10950, 3980, -490, -9389, -7600, 3024, 4385, 680, -929, -4322, 1501, 979, -7118, -9270, -6668, -4371, -124, 10953, 12739, 13840, 7856]
$$ [...]
##END NTUPLES=NMR SPECTRUM
##END=
