##TITLE=Analysis number 314406
Compound Code cc 45711
Book Reference 382/130/1
Project Code adrs
Chemist Name simons
##JCAMPDX= 6.0         $$ Bruker NMR JCAMP-DX V2.0
##DATA TYPE= NMR SPECTRUM
##DATA CLASS= NTUPLES
##ORIGIN= Bruker BioSpin GmbH
##OWNER= NMR
$$ XWIN-NMR		Version 3.5
$$ Tue Oct 18 09:30:33 2005 GMT Daylight Time (UT+1h)  MAYBRIDGE\NMR@NMR_250MHZ
##.OBSERVE FREQUENCY= 250.131544655141
##.OBSERVE NUCLEUS= ^1H
##.ACQUISITION MODE= SIMULTANEOUS (DQD)
##.ACQUISITION SCHEME= undefined
##.AVERAGES= 16
##.DIGITISER RES= 18
##SPECTROMETER/DATA SYSTEM= dpx250
##.PULSE SEQUENCE= zg30
##.SOLVENT NAME= CDCl3
##.SHIFT REFERENCE= (INTERNAL, CDCl3, 0, 16.522)
##AUDIT TRAIL= $$ (NUMBER, WHEN, WHO, WHERE, WHAT)
$$ ##TITLE= Audit trail, XWIN-NMR		Version 3.5
$$ ##JCAMPDX= 5.01
$$ ##ORIGIN= Bruker BioSpin GmbH
$$ ##OWNER= NMR
$$ C:\u/data/dgb/nmr/ADRS/10920/pdata/1/auditp.txt
$$ ##AUDIT TRAIL=  $$ (NUMBER, WHEN, WHO, WHERE, WHAT)
(   1,<2005-10-18 09:30:15.74 +100>,<MAYBRIDGE\NMR>,<NMR_250MHZ>,
      <created by zg, POWCHK disabled, PULCHK disabled
       configuration hash MD5:
       62 19 C7 07 E1 42 D1 B7 37 6C 3D D0 77 39 F9 E6
       data hash MD5: 64K
       5B C2 D7 3C D0 08 A9 CA 49 88 BC 4B 87 07 47 AA>)
(   2,<2005-10-18 09:30:27.24 +100>,<MAYBRIDGE\NMR>,<NMR_250MHZ>,
      <Start of raw data processing
       ef LB = 0.3 FT_mod = 6 PKNL = 1 SI = 32K 
       data hash MD5: 32K
       BB 16 F7 ED EB 09 DB E4 74 B4 CA 98 14 7F CB 27>)
(   3,<2005-10-18 09:30:28.82 +100>,<MAYBRIDGE\NMR>,<NMR_250MHZ>,
      <apk 
       data hash MD5: 32K
       C7 12 E3 61 3F 6F 1F FA BF 9C 43 35 1F 23 0F AE>)
(   4,<2005-10-18 09:30:29.50 +100>,<MAYBRIDGE\NMR>,<NMR_250MHZ>,
      <abs ABSG = 5 
       data hash MD5: 32K
       70 4E 5F 75 2D D6 D5 D8 2D BA 32 7B 0E 5C E9 85>)
$$ ##END=
$$ 
$$ hash MD5
$$ 42 E6 A2 FC F7 84 15 C5 81 EE D0 F8 51 C0 C6 19
##$RELAX= 
##$RELAX= 
##$RELAX= 
##$RELAX= 
##$RELAX= 
##$RELAX= 
##$RELAX= 
$$ Bruker specific parameters
$$ --------------------------
##$DU= <C:\u>
##$EXPNO= 10920
##$NAME= <ADRS>
##$PROCNO= 1
##$TYPE= <nmr>
##$USER= <dgb>
##$AMP= (0..31)
100 100 100 100 100 100 100 100 100 100 100 100 100 100 100 100 100 100 
100 100 100 100 100 100 100 100 100 100 100 100 100 100 
##$AQSEQ= 0
##$AQ_mod= 3
##$AUNM= <au_zg>
##$AUTOPOS= <9 >
##$BF1= 250.13
##$BF2= 250.13
##$BF3= 250.13
##$BF4= 250.13
##$BF5= 500.13
##$BF6= 500.13
##$BF7= 500.13
##$BF8= 500.13
##$BYTORDA= 1
##$CFDGTYP= 0
##$CFRGTYP= 5
##$CHEMSTR= <none>
##$CNST= (0..31)
1 1 145 1 1 1 1 1 1 1 1 1 1 1 1 1 1 1 1 1 1 1 1 1 1 1 1 1 1 1 1 1 
##$CPDPRG= <>
##$CPDPRG1= <>
##$CPDPRG2= <>
##$CPDPRG3= <>
##$CPDPRG4= <mlev>
##$CPDPRG5= <mlev>
##$CPDPRG6= <mlev>
##$CPDPRG7= <mlev>
##$CPDPRG8= <mlev>
##$CPDPRGB= <>
##$CPDPRGT= <>
##$D= (0..31)
0 1 0 0 0 0 0 0 0 0.06 0 0 0 0 0 0 0.0002 0 0 0 0 0 0 0 0 0 0 0 0 0 0 
0 
##$DATE= 1129624214
##$DBL= (0..7)
120 120 120 120 120 120 120 120 
##$DBP= (0..7)
150 150 150 150 150 150 150 150 
##$DBP07= 0
##$DBPNAM0= <>
##$DBPNAM1= <>
$$ [...]
##$SUBNAM7= <"">
##$SUBNAM8= <"">
##$SUBNAM9= <"">
##$SW= 20.6930455092707
##$SWIBOX= (0..15)
0 0 3 0 0 0 0 0 0 0 0 0 0 0 0 0 
##$SW_h= 5175.983436853
##$TD= 65536
##$TD0= 1
##$TE= 294.16
##$TE2= 300
##$TE3= 300
##$TEG= 300
##$TL= (0..7)
0 120 120 120 120 120 120 120 
##$TP= (0..7)
150 150 150 150 150 150 150 150 
##$TP07= 0
##$TPNAME0= <>
##$TPNAME1= <>
##$TPNAME2= <>
##$TPNAME3= <>
##$TPNAME4= <>
##$TPNAME5= <>
##$TPNAME6= <>
##$TPNAME7= <>
##$TPOAL= (0..7)
0.5 0.5 0.5 0.5 0.5 0.5 0.5 0.5 
##$TPOFFS= (0..7)
0 0 0 0 0 0 0 0 
##$TUNHIN= 0
##$TUNHOUT= 0
##$TUNXOUT= 0
##$USERA1= <user>
##$USERA2= <user>
##$USERA3= <user>
##$USERA4= <user>
##$USERA5= <user>
##$V9= 5
##$VALIST= <valist>
##$VCLIST= <CCCCCCCCCCCCCCC>
##$VD= 0
##$VDLIST= <DDDDDDDDDDDDDDD>
##$VPLIST= <PPPPPPPPPPPPPPP>
##$VTLIST= <TTTTTTTTTTTTTTT>
##$WBST= 1024
##$WBSW= 4
##$XGAIN= (0..3)
0 0 0 0 
##$XL= 0
##$YL= 0
##$YMAX_a= 336863
##$YMIN_a= -204897
##$ZGOPTNS= <>
##$ZL1= 120
##$ZL2= 120
##$ZL3= 120
##$ZL4= 120
##$ABSF1= 16.522
##$ABSF2= -4.171173
##$ABSG= 5
##$ABSL= 3
##$ALPHA= 0
##$AQORDER= 0
##$ASSFAC= 0
##$ASSFACI= 0
##$ASSFACX= 0
##$ASSWID= 0
##$AUNMP= <proc_1d>
##$AZFE= 0.1
##$AZFW= 0.1
##$BCFW= 0
##$BC_mod= 0
##$BYTORDP= 0
##$COROFFS= 0
##$CY= 12.5
##$DATMOD= 1
##$DC= 0
##$DFILT= <>
##$DTYPP= 0
##$F1P= 14.0000005364418
##$F2P= -0.99999901652339
##$FCOR= 0.5
##$FTSIZE= 32768
##$FT_mod= 6
##$GAMMA= 0
##$GB= 0
##$INTBC= 1
##$INTSCL= 1
##$ISEN= 128
##$LB= 0.3
##$LEV0= 0
##$LPBIN= 0
##$MAXI= 10000
##$MC2= 0
##$MEAN= 0
##$ME_mod= 0
##$MI= 0
##$NCOEF= 0
##$NC_proc= -5
##$NLEV= 6
##$NOISF1= 0
##$NOISF2= 0
##$NSP= 0
##$NTH_PI= 0
##$NZP= 0
##$OFFSET= 16.522
##$PC= 1
##$PHC0= -64.01172
##$PHC1= 5.85299
##$PH_mod= 1
##$PKNL= yes
##$PPARMOD= 0
##$PSCAL= 4
##$PSIGN= 0
##$REVERSE= no
##$SF= 250.13
##$SI= 32768
##$SIGF1= 0
##$SIGF2= 0
##$SINO= 400
##$SIOLD= 32768
##$SREGLST= <1H.CDCl3>
##$SSB= 0
##$STSI= 32768
##$STSR= 0
##$SW_p= 5175.98343685301
##$SYMM= 0
##$S_DEV= 0
##$TDeff= 65536
##$TDoff= 0
##$TI= <Analysis number 999999
Compound Code 99
Book Reference 9
Project Code 9>
##$TILT= no
##$TM1= 0
##$TM2= 0
##$TOPLEV= 0
##$USERP1= <user>
##$USERP2= <user>
##$USERP3= <user>
##$USERP4= <user>
##$USERP5= <user>
##$WDW= 1
##$XDIM= 32768
##$YMAX_p= 467820974
##$YMIN_p= -669999
$$ End of Bruker specific parameters
$$ ---------------------------------
##NTUPLES= NMR SPECTRUM
##VAR_NAME=  FREQUENCY,     SPECTRUM/REAL,   SPECTRUM/IMAG
##SYMBOL=    X,             R,               I
##VAR_TYPE=  INDEPENDENT,   DEPENDENT,       DEPENDENT
##VAR_FORM=  AFFN,          ASDF,            ASDF
##VAR_DIM=   32768,         32768,           32768
##UNITS=     HZ,            ARBITRARY UNITS, ARBITRARY UNITS
##FACTOR=    0.157963299565203, 1,           1
##FIRST=     4132.6476996994, 0,             0
##LAST=      -1043.33573715361, 0,           0
##MIN=       -1043.33573715361, -669999,     0
##MAX=       4132.6476996994, 467820974,     0
$$ Real data points
##PAGE= N=1
##DATA TABLE= (X++(R..R)), XYDATA
$$ [...]
19989D76811l3041j91908q2979m7271M4848o4298j48438J14585N9936K58890J41948
$$ 476811 443770 251862 168883 121612 166460 102162 -46276 68309 128245 387135 529083
19978E29083J37914k00166o5794O6657m3338p9498l3477j8860j28631m0989J43870
$$ 529083 666997 466831 401037 467694 424356 344858 311381 292521 163890 122901 266771
19967B66771m0265N8567J9536m1463j42068q6295J43275J697J540n8481J6119
$$ 266771 226506 285073 304609 263146 121078 34783 178058 179755 181295 122814 138933
19956A38933j88462K2868N2258o1644O957J91798J97458R023j78917J2184r299
$$ 138933 -49529 -26661 25597 -36047 -29090 162708 360166 369189 190272 202456 193157
19945A93157k1735N0378K3280K5743m668l2577j72r6266j59681O9069J58083P4841
$$ 193157 171422 221800 245080 270823 266155 233578 233406 137140 -22541 46528 204611 279452
19933B79452p671k8040L3469l4449k6938O2071J99441N052J4690j02587J3278
$$ 279452 271781 243741 277210 242761 215823 277894 477335 482387 497077 394490 407768
19922D07768k3184j0677k7591j23512J22308J2535j70863r8023N1021O362K233
$$ 407768 384584 373907 346316 222804 345112 357647 186784 88761 139782 146144 148377
19911A48377K3761J07180J5923m2470R3360q8745j85029J42953J43085j89725
$$ 148377 172138 279318 295241 252771 346131 257386 72357 215310 358395 168670
19901A68670j51221k5109J48559K79997M7822j09317n2845P1228J30883O5606
$$ 168670 17449 -7660 140899 420896 468718 359401 306556 377784 508667 574273
19891E74273K26193N7774p0641O9893J23531J05287J45677J33309j32982k6780
$$ 574273 800466 858240 787599 857492 981023 1086310 1231987 1365296 1232314 1205534
19881A205534J1393J4307O7883j0790k41627k22985J20554N0123m6234o5628j57160
$$ 1205534 1216927 1231234 1299117 1288327 1046700 823715 944269 994392 948158 882530 725370
19870G25370o2041j40897n2632q8177j10231l8356j02092l1535k3827J02115R5525
$$ 725370 663329 522432 469800 381623 271392 233036 130944 99409 75582 177697 273222
19859B73222K4522J1798m3439O003n3993m8731k4982j14804l9597R7898J9086
$$ 273222 297744 309542 266103 272106 218113 169382 144400 29596 -10001 87897 106983
19848A06983l6851j19258L4658l2986J83452J42150M4363J3761m2736L6150J84056
$$ 106983 70132 -49126 -14468 -47454 135998 278148 322511 336272 293536 329686 513742
19837E13742p1407K3584j51313n6512j28426j07739K07502K5963j13913o310m8114
$$ 513742 442335 465919 314606 258094 129668 21929 229431 255394 141481 135171 87057
19826H7057Q6760K6875M8199m0206r2405j64639R8769J49622q4352M2629j28701
$$ 87057 173817 200692 248891 208685 116280 -48359 50410 200032 115680 158309 29608
19815B9608p2274R6239J65343j293J49487J31676m3972j8204K4683m8762j69940
$$ 29608 -42666 53573 218916 217623 367110 498786 454814 436610 461293 412531 242591
19804B42591l4274M1888n7986J7546Q9303J863n5551r9429Q817L3535O9677J9126
$$ 242591 208317 250205 192219 209765 299068 300931 245380 145951 154768 188303 257980 277106
19792B77106J9492j25307k20878p9853Q8418K70027R1032o7335o6126j83701R349
$$ 277106 296598 171291 -49587 -129440 -41022 229005 320037 252702 186576 2875 12224
19781A2224J18665Q1887L1986j19603j201j2862J47355J30337J68040q1814k52099
$$ 12224 130889 212776 244762 125159 123958 111096 258451 388788 556828 475014 222915
19770B22915j19024K4362k4114L1038M4284Q2500j45045R5069j58741J5778J17391
$$ 222915 103891 128253 104139 135177 179461 261961 116916 211985 53244 69022 186413
19759A86413M9613j10491K0188J50506j152j14612Q1315J85045J8138o9265l8110
$$ 186413 236026 125535 145723 296229 295077 180465 261780 446825 464963 395698 357588
19748C57588q7545J83072J80189l8761k21690K4983O7133Q4201O4447j07266k36921
$$ 357588 270043 453115 633304 594543 372853 397836 464969 549170 613617 506351 269430
19737B69430j25800n4674j23664P0838R2903o3675J5827j9970n9893O1675R9739
$$ 269430 143630 88956 -34708 36130 129033 65358 81185 61215 1322 62997 162736
19726A62736Q2630j28191j5749J5870K55779L21846O0273j69355J26681P9722
$$ 162736 245366 117175 101426 117296 373075 694921 755194 585839 712520 792242
19716G92242j15684N175l52225j87501j5029K04411J36390k0741j63132j14454
$$ 792242 676558 681733 329508 142007 126978 331389 467779 447038 283906 169452
19706A69452R7229l2571O9958R3993o0413j16497j00840J88120O2627j44659l8908
$$ 169452 266681 234110 304068 398061 337648 221151 120311 308431 371058 226399 187491
19695A87491K03217N170K0271q737Q019q886q8790j8741P5524j0180j14390r7795
$$ 187491 390708 395878 416149 407412 415431 406545 317755 299014 374538 364358 249968 152173
19683A52173O2912p7286m7131J66245J12517k7585l1939J03466j6184j1474J2200
$$ 152173 215085 137799 90668 256913 369430 341845 309906 413372 397188 385714 397914
19672C97914j55845J18421J24738q5053K5894O3481p7339j13252j14360J8198
$$ 397914 242069 360490 485228 400175 426069 489550 412211 298959 184599 202797
19662B02797m4108K51185M6563J199M6922l4690p7205k553J8148O5676J38118
$$ 202797 158689 409874 456437 457636 504558 469868 392663 390110 408258 473934 612052
19651F12052o9864K5265R3522p9947r7657Q2332l6348n1058J13291j0456k650
$$ 612052 542188 567453 660975 581028 483371 565703 529355 478297 591588 581132 578482
19640E78482O838O0105L2885j11618r5654L9551j23873L1958R7580k614Q8327
$$ 578482 585320 645425 678310 566692 471038 510589 386716 418674 516254 513640 601967
19629F01967j02129l8267j11307j85631j68638J04115J2925J47047J08070N0078
$$ 601967 499838 461571 350264 164633 -4005 100110 113035 260082 368152 418230
19619D18230J49158K2705m9748M4348K4n7780j31505l0696J79016j20844P4058
$$ 418230 567388 590093 540345 584693 584717 526937 395432 364736 543752 422908 496966
19608D96966J96045r8282O0387k5695o5763j09905Q331R5260J10202J091j25589
$$ 496966 693011 594729 655116 629421 563658 453753 462084 557344 667546 668637 543048
19597E43048j70299J28949j1206J11567J56279K9222k27844l2313m9898J79661
$$ 543048 372749 501698 490492 602059 758338 787560 559716 527403 477505 657166
19587F57166P3986L5195P7846j96573j61541o7169M2723N1468R7427N2649k4461
$$ 657166 731152 766347 844193 647620 486079 418910 461633 513101 610528 663177 638716
19576F38716j27086k3160m701Q163J12843J64162l0677O5318J13297m5109k2780
$$ 638716 511630 488470 483769 491932 604775 768937 738260 803578 916875 871766 848986
19565H48986p94K1867j12786j9036J44735N7479j17150m7372r787n8973j4589
$$ 848986 848192 870059 757273 738237 882972 940451 823301 775929 766142 707169 692580
19554F92580J49402O6147k23892k24874L230J19929J72006R6067j65032o8430
$$ 692580 841982 908129 684237 459363 462593 582522 754528 850595 685563 617133
19544F17133Q1026Q5358N8261o1243j39744R8250O3127K4844Q9668n3802o4736
$$ 617133 698159 783517 841778 780535 640791 739041 802168 827012 916680 862878 798142
19533G98142J13836K54715J66895l0198m2453q551p4723j44012L024J81576k5238
$$ 798142 911978 1166693 1333588 1303390 1260937 1252386 1177663 1033651 1036675 1218251 1193013
19522A193013r4198j9271n4688j37215l9413J23146J12627M602R7408k579L7098
$$ 1193013 1098815 1079544 1024856 887641 848228 971374 1084001 1088603 1186011 1183432 1220530
19511A220530L9516M7602j7219o9634j8005l5153J58022p1346j02818J44664K8004
$$ 1220530 1260046 1307648 1290429 1220795 1202790 1167637 1325659 1254313 1151495 1296159 1324163
19500A324163j01802M4948J0652J16224K01459P5996q7941j75127j17447J8215
$$ 1324163 1222361 1267309 1277961 1394185 1595644 1671640 1583699 1408572 1291125 1309340
19490A309340J19689J09799Q3776j53493M8215K16147K24359k8945k4658p1861
$$ 1309340 1429029 1538828 1622604 1469111 1517326 1733473 1957832 1928887 1904229 1832368
19480A832368J25361Q1978k38196j39424Q4283n709R3047Q3376l4126L3937M2169
$$ 1832368 1957729 2039707 1801511 1662087 1746370 1740661 1833708 1917084 1882958 1916895 1959064
19469A959064j09405r8917J34430L1652K42895J78837N940n6818q78l4413m838
$$ 1959064 1849659 1750742 1885172 1916824 2159719 2338556 2344496 2287678 2286800 2252387 2247549
19458B247549R9252k0128k0560k7167L4773J84929J92499N4569Q3904J51054j8421
$$ 2247549 2346801 2326673 2306113 2278946 2313719 2498648 2691147 2745716 2829620 2980674 2962253
19447B962253P7977R0204Q7827R4718N2596L5513P331K01301K81691K09377K69943
$$ 2962253 3040230 3130434 3218261 3312979 3365575 3401088 3408419 3609720 3891411 4100788 4370731
19436D370731R0880J14350L92618K73356K47427K50288M01593M27190M00659L68047
$$ 4370731 4461611 4575961 4968579 5241935 5489362 5739650 6141243 6568433 6969092 7337139
19426G337139M55989M10438L37838L50855L44016K99271L90841N07658O14469
$$ 7337139 7793128 8203566 8541404 8892259 9236275 9535546 9926387 10434045 11048514
19417A1048514P95533N96088O14731P29039R00407J131851J159597J245787J389257
$$ 11048514 11844047 12440135 13054866 13783905 14684312 15816163 16975760 18221547 19610804
19408A9610804J635536J942869K335090K376424K712754L431549L965091M881483
$$ 19610804 21246340 23189209 25524299 27900723 30613477 34045026 38010117 42891600
19400D2891600N709889O860998Q167969J0081197J2429956J5209680J8431637
$$ 42891600 48601489 55462487 63630456 73711653 86141609 101351289 119782926
19393A19782926K1021777K2533965K2004387J8912262J2609303M264116m605688
$$ 119782926 140804703 163338668 185343055 204255317 216864620 221128736 216523048
19386B16523048j2080957j6999180j9464440j9715081j8292383j5834643j3374931
$$ 216523048 204442091 187442911 167978471 148263390 129971007 114136364 100761433
19379A00761433j1029680r144920p608767o102165m877540m026811l530915l080063
$$ 100761433 89731753 80586833 72978066 66875901 61998361 57971550 54440635 51360572
19371E1360572k693978k539196k797541k804943k699736k842598k704908k346073
$$ 51360572 48666594 46127398 43329857 40524914 37825178 34982580 32277672 29931599
19363B9931599k236326k207453j688378j496646j612683j477553j100925j152902
$$ 29931599 27695273 25487820 23799442 22302796 20690113 19212560 18111635 16958733
19355A6958733j282949r62891o68838o58622p41621p74733q54532o42681p34890
$$ 16958733 15675784 14712893 14044055 13385433 12643812 11869079 11014547 10371866 9636976
19346I636976o51886o27887m76413l67200l69246l33159k76567k32631k74784
$$ 9636976 8985090 8357203 7880790 7513590 7144344 6811185 6534618 6301987 6027203
19337F027203j64224q3984k51825k15803j75888k68593n9705M6126k30872l30534
$$ 6027203 5862979 5778995 5527170 5311367 5135479 4866886 4807181 4853307 4622435 4291901
19327D291901j64508n2977J54261m5387j43224j59836l21514R29L6299J48917
$$ 4291901 4127393 4074416 4228677 4183290 4040066 3880230 3558716 3559645 3595944 3744861
19317C744861J84820j14607k0619J9406Q872M2944J37591k960n3738k42065P5894
$$ 3744861 3929681 3815074 3794455 3813861 3822733 3865677 4003268 4000308 3946570 3704505 3780399
19306C780399J30391Q0108j72404j61859m9231P909R7665M3946M6837m3735j29753
$$ 3780399 3910790 3990898 3818494 3656635 3607404 3615313 3712978 3756924 3803761 3760026 3630273
19295C630273J05209J28663k99J1137L8368J41361p4156l8372P8880L1431J30737
$$ 3630273 3735482 3864145 3863846 3874983 3913351 4054712 3980556 3942184 4021064 4052495 4183232
19284D183232K93015J66905K24069K78554j2504o6685Q4702K13935P2534J74730
$$ 4183232 4476247 4643152 4867221 5145775 5133271 5066586 5151288 5365223 5437757 5612487
19274E612487K73489J60612J66950M34125L94903K39464K43620L27168M34776
$$ 5612487 5885976 6046588 6213538 6647663 7042566 7282030 7525650 7852818 8287594
19265H287594L17413K94888L07555N19913N24494N67888Q13878J007079P73958
$$ 8287594 8605007 8899895 9207450 9727363 10251857 10819745 11633623 12640702 13414660
19256A3414660P96899R94001J001908J194356J487067J531502J582889J860742
$$ 13414660 14211559 15205560 16207468 17401824 18888891 20420393 22003282 23864024
19248B3864024J996113K221596K554977K896844L563804M269537N066402N819915
$$ 23864024 25860137 28081733 30636710 33533554 37097358 41366895 46433297 52253212
19240E2253212P146464Q474380J0462699J2826800J5548088J8663484K1982278
$$ 52253212 59399676 67874056 78336755 91163555 106711643 125375127 147357405
19233A47357405K3823874K3117202J8172996R181019j662676j1585993j8122496
$$ 147357405 171181279 194298481 212471477 221652496 219989820 208403827 190281331
19226A90281331k0801779k0202153j7950114j5551627j3293551j1151001r277509
$$ 190281331 169479552 149277399 131327285 115775658 102482107 91331106 82053597
19219H2053597p756310o268354n105162m143295l527220k938048k744632k401713
$$ 82053597 74297287 68028933 62923771 58780476 55253256 52315208 49570576 47168863
19211D7168863k543480k817149k663409k626676k641356k717937k736852k559062
$$ 47168863 44625383 41808234 39144825 36518149 33876793 31158856 28422004 25862942
19203B5862942k272192j961566j770413j598554j406639j327211j154837j009109
$$ 25862942 23590750 21629184 19858771 18260217 16853578 15526367 14371530 13362421
19195A3362421p69016j006145q14972n65471o25976m83379l08460n22993o32365
$$ 13362421 12593405 11587260 10772288 10206817 9580841 9097462 8789002 8266009 7633644
19186G633644m05329l67589m40538k50696j95435l16869k82493k73730j78280
$$ 7633644 7228315 6860726 6420188 6169492 5974057 5657188 5374695 5100965 4922685
19177D922685j99732k95575l34486k88177k39058j46825p1375j00814j00733j40385
$$ 4922685 4722953 4427378 4092892 3804715 3565657 3418832 3347457 3246643 3145910 3005525
19167C005525k08471k42657j15862l8460O9087k23762k48064j04393M6873J2585
$$ 3005525 2797054 2554397 2438535 2400075 2469162 2245400 1997336 1892943 1939816 1952401
19157A952401J32076j85435j05440J4795K4169o3559j83276Q674k9618p3932k9151
$$ 1952401 2084477 1899042 1793602 1808397 1832566 1769007 1585731 1594405 1564787 1490855 1461704
19146A461704n4317k3631M7882r1680K2750j55032J8374Q3195j96149n8309L7587
$$ 1461704 1407387 1383756 1431638 1339958 1362708 1207676 1226050 1309245 1113096 1054787 1092374
19135A092374l8919k2531N9288m7485l19184J5088J847l099n6608K5110Q4689
$$ 1092374 1053455 1030924 1090212 1042727 723543 738631 740478 737379 680771 705881 790570
19124G90570J04790K62727J10979K0983r2119k79230m3653J76438l9685m0822
$$ 790570 895360 1158087 1269066 1290049 1197930 918700 875047 1051485 1011800 970978
19114I70978n3940P3284J42366J95135n7022j07631j85159O0225l4023p2193j23296
$$ 970978 917038 990322 1132688 1327823 1270801 1163170 978011 1038236 1004213 932020 808724
19103H08724J6493N5247j70975J82862J05074j41854j14097N5782R7102J70679
$$ 808724 825217 880464 709489 892351 997425 855571 741474 797256 894358 1065037
19093A065037Q3243M950N3084O4608p0290k7606j22681j07811j402J30578K7543
$$ 1065037 1148280 1153230 1206314 1270922 1200632 1173026 1050345 942534 941132 1071710 1099253
19082A099253j42482o9644M3623K1075R696J18103r0681j60706j35721k0855m222
$$ 1099253 956771 887127 930750 951825 961521 1079624 988943 828237 692516 671661 667439
19071F67439K09719Q4589J7257m9761j30488j02574J40259R5835o0183j01075
$$ 667439 877158 961747 979004 929243 798755 696181 836440 932275 872092 771017
19061G71017l238j06215l2750l1321N5782L8565N5985j888j799P7516P8207j83347
$$ 771017 767779 661564 628814 597493 653275 691840 747825 745937 744138 821654 899861 716514
19049G16514k12620o1798r0238M521K6955J99897J22137J6381J39659j9295q9452
$$ 716514 503894 442096 351858 356379 383334 583231 705368 721749 861408 842113 752661
19038G52661J04077N9021j37199r7568J5458J30865j51367r0613m3519M2566J79573
$$ 752661 856738 915759 778560 680992 696450 827315 675948 585335 541816 584382 763955
19027G63955J31663L5132k6585q8335O7034M2325r032j627j17835l2753q5781
$$ 763955 895618 930750 904165 815830 882864 925189 916157 914530 796695 763942 678161
19016F78161n586R1754N3885J36442p963j64983J1103o8662k3208L462J02285
$$ 678161 672575 764329 818214 954656 946693 781710 792813 724151 700943 704405 806690
19005H06690N9954K6630j06113o8136J264J23704R1694j85124j9849J19807R404
$$ 806690 866644 893274 787161 719025 720289 843993 935687 750563 730714 850521 859925
18994H59925j53129j26718R1877J93808j543l0501j0055M0278P1592m4013r1727
$$ 859925 706796 580078 671955 865763 864220 833719 823664 863942 935534 891521 799794
18983G99794r6678L7905P3507K05026M5970j97875K213r354M3024j24879J10792
$$ 799794 703116 741021 814528 1019554 1065524 867649 869862 860508 903532 778653 889445
18972H89445l8692j02995J88289J39689R5933j8150o2470L5741N4391k17819L515
$$ 889445 850753 747758 936047 1075736 1171669 1153519 1091049 1126790 1181181 963362 966877
18961I66877J39649K5687p7107j98813n6778J57395K93904J61500n7046J097n1323
$$ 966877 1106526 1132213 1055106 856293 799515 956910 1250814 1412314 1355268 1356365 1305042
18950A305042k1256j88077k6141K51156J64426L3051m8519j18601J44387J07258
$$ 1305042 1283786 1095709 1069568 1320724 1485150 1518201 1469682 1351081 1495468 1602726
18940A602726M8250M2986p3361l4175p8259l8206j596M05k8791M8486J28208J28958
$$ 1602726 1650976 1693962 1620601 1586426 1508167 1469961 1468365 1468770 1439979 1488465 1616673 1745631
18928A745631N5786J1871j3302q8137o1549J37522M6378p9704J08623R5638K150
$$ 1745631 1801417 1813288 1799986 1711849 1650300 1787822 1834200 1754496 1863119 1958757 1960907
18917A960907l9654O9093K6453j45282j45795M515J08835j11926L2983K36553
$$ 1960907 1921253 1990346 2016799 1871517 1725722 1730237 1839072 1727146 1760129 1996682
18907A996682Q9900O034J61983J49558N3081K9852q8965j53102J13541K255J69273
$$ 1996682 2086582 2092616 2254599 2404157 2457238 2487090 2398125 2245023 2358564 2360819 2530092
18896B530092J27843j3268J41783J03503J43315J56321J59441N0219L0036n4156
$$ 2530092 2657935 2644667 2786450 2889953 3033268 3189589 3349030 3399249 3429285 3375129
18886C375129J66519J55580J33517M7494L10377Q4752O5067K95619L65301J48647
$$ 3375129 3541648 3697228 3830745 3878239 4188616 4273368 4338435 4634054 4999355 5148002
18876E148002J07144K15738J89705J97449L43942K47234M32414O07506O64698
$$ 5148002 5255146 5470884 5660589 5858038 6201980 6449214 6881628 7489134 8153832
18867H153832P33932P97493Q30935J024057J088838J031070R51394J374107J634103
$$ 8153832 8887764 9685257 10516192 11540249 12629087 13660157 14611551 15985658 17619761
18858A7619761J991874K602232L347919M006468M429588M138758K813237Q66079
$$ 17619761 19611635 22213867 25561786 29568254 33997842 38136600 40949837 41815916
18850D1815916M44862R00383J993361L330926M756478O611860R149142J2778383
$$ 41815916 42260778 43161161 45154522 48485448 53241926 59853786 69002928 81781311
18842H1781311J8459532K6130911L3088636L3911847K5836658N975602j0363785
$$ 81781311 100240843 126371754 159460390 193372237 219208895 225184497 214820712
18835B14820712j8932337k0239426j9548095j7868292j4725109j0440472n458687
$$ 214820712 195888375 175648949 156100854 138232562 123507453 113066981 107608294
18828A07608294r51293J496494J415836k059484p190164r673194r682790p864253
$$ 107608294 106657001 108153495 109569331 107509847 100319683 90646489 80963699 73099446
18820G3099446n913650m702625m161464l720099l520271l003880k480304k037445
$$ 73099446 67185796 62483171 58321707 54601608 51081337 48077457 45597153 43559708
18812D3559708j676436j321388o20896m39511N9300L98850Q00806J175504J522546
$$ 43559708 41883272 40561884 39940988 39501477 39560777 39959627 40760433 41935937 43458483
18803D3458483K601203L740761N704129P852198J0302333J1248863R467725M636459
$$ 43458483 46059686 49800447 55504576 63356774 73659107 84907970 94375695 99012154
18795I9012154o042j396017j44526L637503Q749477J4219843J9271018K3836104
$$ 99012154 99006112 97610095 97465569 101103072 109852549 124072392 143343410 167179514
18787A67179514K6762260K8120926K3260044R138690j3405329k9855280l3533991
$$ 167179514 193941774 222062700 245322744 254461434 241056105 211200825 177666834
18780A77666834k9742046k2301107j6583625j2794418r863732p691198n862511
$$ 177666834 147924788 125623681 109040056 96245638 86381906 78690708 72828197
18773G2828197l387862j195269l41542l82824j911997l870662m468084m576919
$$ 72828197 69440335 68245066 67903524 67520700 65608703 61738041 57269957 52693038
18765E2693038m166262l853398l925821m061561l960499l304397k897715k585456
$$ 52693038 48526776 44673378 40747557 36685996 32725497 29421100 26523385 23937929
18757B3937929k232927j965416j705624j566439j212249r45482q54527j130338
$$ 23937929 21705002 19739586 18033962 16467523 15255274 14309792 13455265 12324927
18749A2324927r90245p66469p55907p71946p77241p80910o09970n08627l59944
$$ 12324927 11334682 10568213 9812306 9040360 8263119 7482209 6872239 6363612 6003668
18740F003668l87573l69524m21377j76802r3834l93833j37991k04042j00249R950
$$ 6003668 5616095 5246571 4825194 4648392 4554558 4160725 4022734 3818692 3718443 3728393
18730C728393j4312p5172j80201k1607j70208q5922M4627J43570O435j70637j65683
$$ 3728393 3714081 3638909 3458708 3437101 3266893 3180971 3225598 3369168 3375603 3204966 3039283
18719C039283q1782j89326j21329k74112k43655j63308k0794r5729k29248N075
$$ 3039283 2957501 2768175 2646846 2372734 2129079 1965771 1944977 1849248 1620000 1625075
18709A625075J46552M3167J11147j52926j74238J5272P5892L4062k13433j66570
$$ 1625075 1771627 1814794 1925941 1773015 1598777 1614049 1689941 1724003 1510570 1344000
18699A344000M1619o5513p7933r9914j99773k09064j65624j90572J34192J18725
$$ 1344000 1385619 1320106 1242173 1142259 942486 733422 567798 377226 511418 630143
18689F30143O909o6938p2089J28498j07455k18225N4035K6410J0017O6392p419
$$ 630143 637052 570114 498025 626523 519068 300843 354878 381288 391305 457697 450278
18678D50278K1190j9173n0614q5592Q9171K40308k9438Q3938N4167k62119j20594
$$ 450278 471468 452295 401681 316089 405260 645568 616130 700068 754235 492116 371522
18667C71522j12199J82170L9673J2415n842J64443J10802j03152M6238q5357p9909
$$ 371522 259323 441493 481166 493581 487739 652182 762984 659832 706070 620713 540804
18656E40804r5816j10324j92599J06229J08769Q202O1482O4297r1573k4618R3978
$$ 540804 444988 334664 142065 248294 357063 365265 426747 491044 399471 374853 468831
18645D68831k3865r9989r4026L7573J15753q311Q1497J14213o0451r5985p9417
$$ 468831 444966 344977 250951 288524 404277 395966 477463 591676 531225 435240 355823
18634C55823o7334K5372k132K558k08469J05858K05726m0589k4346r4831l9301
$$ 355823 288489 313861 311729 314287 105818 211676 417402 376813 352467 257636 218335
18623B18335Q5771p7042O732o7897K5645P80j68289j9301N0083q8239j00503J11943
$$ 218335 304106 227064 233796 165899 191544 192324 24035 4734 54817 -33422 -133925 -21982
18611b1982J88781M0444m9550N1123m5414K0762J81273q3488n6182K6999R9815
$$ -21982 166799 207243 157693 208816 163402 184164 365437 281949 225767 252766 352581
18600C52581q8991O9151K0461N3947q3071M8905J58813r4184r3230r09m9456N5850
$$ 352581 263590 332741 353202 407149 324078 372983 531796 437612 344382 343473 294017 349867
18588C49867K2862j80328p9959n0006K8318K2067N7951J74704Q5708j22215j17707
$$ 349867 372729 192401 112442 62436 90754 112821 170772 345476 431184 308969 191262
18577A91262R4369J25906J93531J15823K821O1540J17897K24414J59937P5599
$$ 191262 285631 411537 605068 720891 723712 785252 903149 1127563 1287500 1363099
18567A363099R6830j61411k1788j24848j39713j25216o7635k73092k27798L3273
$$ 1363099 1459929 1298518 1276730 1151882 1012169 886953 819318 546226 318428 351701
18557C51701J63441J07287J74722m26j66773l5532j28041j05030j05033J29981
$$ 351701 515142 622429 797151 796725 629952 594420 466379 361349 256316 386297
18547C86297N0474m645m9819r4004L9991O1751l8601o0799L9967Q187k1693J69759
$$ 386297 436771 432126 382307 288303 328294 390045 351444 290645 330612 338799 317106 486865
18535D86865J0962q1495n065m1321Q0887J42745J5756M8019L7752J36876K94674
$$ 486865 497827 416332 411267 369946 450833 593578 609334 657353 695105 831981 1126655
18524A126655O0177M5471L92522L75437L95851M71321P5860m41991j93388j20017
$$ 1126655 1186832 1232303 1624825 2000262 2396113 2867434 2943294 2501303 2307915 2187898
18514B187898k39937k71283k22064j70576j7887M9842J86877J41025N6404k28249
$$ 2187898 1947961 1676678 1454614 1284038 1266151 1315993 1502870 1643895 1700299 1472050
18504A472050j58719j92594k04807n4244O542j70866k32910J20354J87075o9914
$$ 1472050 1313331 1120737 915930 861686 868228 697362 464452 584806 771881 701967
18494G01967j5721P7863k176o7089q0958j83698J07216J83301O4200O7042L2886
$$ 701967 686246 764109 761933 694844 613886 430188 537404 720705 784905 851947 884833
18483H84833k3597o4420M5325K13594K45953L9994n2696N4108l5804N0854L5506
$$ 884833 861236 796816 842141 1055735 1301688 1341682 1288986 1343094 1307290 1358144 1393650
18472A393650q6292J23572L99156J82514K78311M08925L35708K90149J35604k55824
$$ 1393650 1307358 1430930 1830086 2012600 2290911 2699836 3035544 3325693 3461297 3205473
18462C205473m69570n25763l08014k01407k10099k10645j70851j64145j13890
$$ 3205473 2735903 2210140 1902126 1700719 1490620 1279975 1109124 944979 831089
18453H31089k24782k0669J28619P4631M4478J8061P8468j14304j83254k7115L9484
$$ 831089 606307 585638 714257 788888 833366 851427 929895 815591 632337 605222 644706
18442F44706L5128j58136n2156o9613N3409j6845l7237j07712j60155k8202l7809
$$ 644706 679834 521698 469542 399929 453338 436493 399256 291544 131389 103187 65378
18431F5378L768M8454J48650J02160j2280K4859j36526r7511M5486P8460p163
$$ 65378 69146 117600 266250 368410 356130 380989 244463 146952 192438 270898 263735
18420B63735r0826J35460L8554J3856J689j39413l4719j13207q2324P3992j03364
$$ 263735 172909 308369 346923 360779 362468 223055 188336 75129 -7195 66797 -36567
18409c6567n4565J1160J01758J74847M2345J06530j15976j7986J9744J8645R327
$$ -36567 -91132 -79972 21786 196633 238978 345508 229532 211546 231290 249935 259262
18398B59262j4647j37186K6160L6749p4870J9506P0399j0163m0463N9764L4414
$$ 259262 244615 107429 133589 170338 95468 114974 185373 175210 134747 194511 228925
18387B28925J46123K8959l4239j26804J5725j6722n0347j2354r799L9447j55426
$$ 228925 375048 404007 369768 242964 258689 241967 191620 179266 169467 208914 53488
18376E3488o9871O6754M2739N9905Q0065m633j82553Q8865Q210j52023n3462J66009
$$ 53488 -16383 50371 93110 153015 233080 228447 45894 134759 142969 -9054 -62516 103493
18364A03493J84474J26595L4479O167J9344r255r7538n0671n0931P7201j91775
$$ 103493 287967 414562 449041 455208 474552 465297 367759 317088 266157 343358 151583
18353A51583n4574K1522q0209J32819j59706j94227k9402J36068L9607k1523J82458
$$ 151583 97009 118531 38322 171141 11435 -182792 -212194 -76126 -36519 -58042 124416
18342A24416P5904R1261J19147r1420j7801j66670n5534Q0468R7430p3462O3166
$$ 124416 200320 291581 410728 319308 301507 134837 79303 159771 257201 183739 246905
18331B46905j26811P1675j51241K6489L86281m9442n8129O114J59946J25956J2988
$$ 246905 120094 191769 40528 67017 453298 403856 345727 351841 511787 637743 650731
18320F50731M9858Q4197R8458j18833j32060M8360J27844r5070j62535J03017
$$ 650731 700589 784786 883244 764411 632351 680711 808555 713485 550950 653967
18310F53967J99577N2876R5113K2917R7812K9958n530J34039l9108j00104k41326
$$ 653967 853544 906420 1001533 1024450 1122262 1152220 1146690 1280729 1241621 1141517 900191
18299I00191k03485q5073o1778J25789K7746k43843p5656R6081P2456J31971l597
$$ 900191 696706 611633 549855 675644 703390 459547 383891 479972 552428 684399 680802
18288F80802M2946J16998j03971j71753m5682q629J28440J15020n9574J290j61853
$$ 680802 723748 840746 736775 565022 519340 510711 639151 754171 694597 695887 534034
18277E34034k53033j6683Q7650K30069J61169r3672j10241L3242J83593O2106
$$ 534034 281001 264318 351968 582037 743206 649534 539293 572535 756128 818234
18267H18234l1830o6498N908J65071M7864K21593O7134J23979O4440p3253K3589
$$ 818234 786404 719906 725814 890885 938749 1160342 1227476 1351455 1415895 1342642 1366231
18256A366231J5522k28936q0291K7569j81904j53401J51046J18111J39141r583
$$ 1366231 1381753 1152817 1072526 1100095 918191 764790 915836 1033947 1173088 1163505
18246A163505k2306m1662K34331l9146j35722q290L0684r4656o9943J23178J83579
$$ 1163505 1141199 1099537 1333868 1294722 1159000 1150710 1181394 1086738 1016795 1139973 1323552
18235A323552J12467r7877q8026k5267J14825q7467q9215q8624K322J37276p5204
$$ 1323552 1436019 1338142 1250116 1224849 1339674 1252207 1162992 1074368 1076690 1213966 1138762
18224A138762j55181P2186N4064j1133J13873O3786L3423k13421n2239J08774
$$ 1138762 983581 1055767 1109831 1098698 1212571 1276357 1309780 1096359 1044120 1152894
18214A152894P2498J84815K02852j43293j49800j74696j03499r2381P3942Q2004
$$ 1152894 1225392 1410207 1613059 1469766 1319966 1145270 1041771 949390 1023332 1105336
18204A105336O245P8295L2832k22156j86655p8238p2643O5024P2807p379J7101
$$ 1105336 1111581 1189876 1222708 1000552 813897 735659 663016 728040 800847 793468 810569
18193H10569K1152k9682l7957r016N551L1556K8377m3632J49934O5242O5743k7305
$$ 810569 831721 802039 764082 755066 760617 792173 820550 776918 926852 992094 1057837 1030532
18181A030532J84325O4061l2018J59101l6789O9926R5630K9840k2093Q6259L4778
$$ 1030532 1214857 1278918 1246900 1406001 1369212 1439138 1534768 1564608 1542515 1628774 1663552
18170A663552J841R437k38382j77294N9093K32163j4851r1675J1793m6682R4092
$$ 1663552 1665393 1674830 1436448 1259154 1318247 1550410 1535559 1443884 1455677 1408995 1503087
18159A503087N9886L9136R2400J01818n9873k03464J4837J76817M4280J21500
$$ 1503087 1562973 1602109 1694509 1796327 1736454 1532990 1547827 1724644 1768924 1890424
18149A890424j14182j15020J84083J65252J0097J08529J56541k0347k03532Q5641
$$ 1890424 1776242 1661222 1845305 2010557 2020654 2129183 2285724 2265377 2061845 2147486
18139B147486K06197J92340J91265R8251J43331R6781L83174M29446Q7886L93188
$$ 2147486 2353683 2546023 2737288 2835539 2978870 3075651 3458825 3888271 3976157 4369345
18129D369345N63904O01923L85667P42020P02947M50513N64271P28969Q67700
$$ 4369345 4933249 5535172 5920839 6662859 7365806 7816319 8380590 9109559 9977259
18120I977259J009562J118517J345725J826972K247165K601781L168682L815713
$$ 9977259 10986821 12105338 13451063 15278035 17525200 20126981 23295663 27111376
18112B7111376M918607O322502Q638361J1723352J7271195K6859722M1829103
$$ 27111376 32029983 38352485 46990846 58714198 75985393 102845115 144674218
18105A44674218M9752535Q679000m4864588m0147344k4463661j5856565j1871370
$$ 144674218 194426753 203105753 158241165 118093821 93630160 77773595 65902225
18098F5902225r865872q090404o728531n328112l896586k965783k317357j815412
$$ 65902225 56036353 47945949 41217418 35889306 31992720 29026937 26709580 24894168
18090B4894168j268227r53775n81922j47995j46220r10092j856218k134851j948714
$$ 24894168 23625941 22672166 22090244 21942249 21796029 20885937 19029719 16894868 14946154
18081A4946154j656147j503757j296539j206181r14068p45710n29118n25859o17112
$$ 14946154 13290007 11786250 10489711 9283530 8369462 7623752 7094634 6568775 5951663
18072E951663o43959n31746k93548l65522k91997k63755l92715m19144j71974
$$ 5951663 5307704 4775958 4482410 4116888 3824891 3561136 3168421 2749277 2577303
18063B577303j22885l58293j94285P6085Q2097j6942j32751k28971n5040M0572
$$ 2577303 2454418 2096125 1901840 1977925 2060022 2043080 1910329 1681358 1626318 1666890
18053A666890j64654j01231n1877j3418n5090n3286j96442M5051n0938j85550
$$ 1666890 1502236 1401005 1349128 1335710 1280620 1227334 1030892 1075943 1025005 839455
18043H39455q3497j38444N1506R7170J19552k1236j6214r3756j14175j134m9230
$$ 839455 755958 617514 669020 766190 885742 864506 848292 754536 640361 639227 589997
18032E89997k26414L2083J10768n776q4142L7111R947L7792J14273j65799j71433
$$ 589997 363583 395666 506434 500658 416516 453627 463574 501366 615639 449840 278407
18021B78407j000M337M1252Q0218K48878J21675R0961r5395k47756j78103n1577
$$ 278407 277407 281744 322996 403214 652092 773767 864728 769333 521577 343474 291897
18010B91897K7439j8394J81569P5507j78722r1872R085m0205l1059Q4404J84008
$$ 291897 319336 300942 482511 558018 379296 287424 296509 256304 225245 309649 493657
17999D93657r6468q6139J55332J35921q951N2061J7093j6703O544J03960j4667
$$ 493657 397189 311050 466382 602303 593352 645413 662506 645803 652347 756307 741640
17988G41640l2711Q240k0136j37003m1815j20185J92724m4419o464m7873n0424
$$ 741640 708929 717169 697033 560030 518215 398030 590754 546335 539871 491998 441574
17977D41574N4078L4409Q5159J00133J70139J23828J05322j02388k2132L2861
$$ 441574 495652 530061 615220 715353 885492 1009320 1114642 1012254 990122 1022983
17967A022983k5748j10146m7170J46455M9115m1378j18275m2394P7363J2963P1391
$$ 1022983 997235 887089 839919 986374 1035489 994111 875836 833442 910805 923768 995159
17956I95159j32173k22739O6401L6214M9636m7734O4651J12398O5511L7889J18274
$$ 995159 862986 640247 706648 742862 792498 744764 809415 921813 987324 1025213 1143487
17945A143487P7911J05009J62780Q9001M1295J44235M08721K42431J94979K54391
$$ 1143487 1221398 1326407 1489187 1578188 1619483 1763718 2172439 2414870 2609849 2864240
17935B864240K40893K23032j3155L314j47388l20458j76976k81239j41539j83027
$$ 2864240 3105133 3328165 3315010 3318324 3170936 2850478 2673502 2392263 2250724 2067697
17925B067697j33641M4041R096q7030j37851J0233L5153k14141K4731K4193k31367
$$ 2067697 1934056 1978097 1987193 1900163 1762312 1772545 1807698 1593557 1618288 1642481 1411114
17914A411114j67884l6349M163k24061p5396K44859j4763n0147J05563j02475
$$ 1411114 1243230 1206881 1211044 986983 911587 1156446 1141683 1091536 1197099 1094624
17904A094624J4404L9903R205p3020j43247J44126L39831J80884n8201n6165J30312
$$ 1094624 1109028 1148931 1158136 1085116 941869 1085995 1425826 1606710 1548509 1492344 1622656
17893A622656J8581P5020N7710J29474J31269o8619p2475L08155K51576N6564
$$ 1622656 1641237 1716257 1773967 1903441 2034710 1966091 1893616 2201771 2453347 2509911
17883B509911K61589J56073K2688J09033k0962k75091k448k9563l65786q8600
$$ 2509911 2771500 2927573 2950261 3059294 3038332 2763241 2760793 2731230 2365444 2276844
17873B276844p5844l62237j61911j5074j37823l4375O5941P6994j40678j22046
$$ 2276844 2201000 1838763 1676852 1661778 1523955 1489580 1555521 1632515 1491837 1369791
17863A369791q923k6919j83263j51117J28900J68291P1784M8228j22002j32750
$$ 1369791 1360868 1333949 1150686 999569 1128469 1296760 1368544 1416772 1294770 1162020
17853A162020p8360j1939j0458J4695j00651j71552Q5875K28826Q0413J61397
$$ 1162020 1083660 1071721 1061263 1075958 975307 803755 889630 1118456 1198869 1360266
17843A360266J00310p8980m0790J6964M3104Q3403n0057j71232O1713J55769J51261
$$ 1360266 1460576 1381596 1340806 1357770 1400874 1484277 1434220 1262988 1324701 1480470 1631731
17832A631731L309q3393L1528K3757p5724K958L5953p3661n9165j00673R8263
$$ 1631731 1635040 1551647 1583175 1606932 1531208 1534166 1570119 1496458 1437293 1336620 1434883
17821A434883J14510l9875N5633P540n1997m2995J8694O9j38312J19133K32521
$$ 1434883 1549393 1509518 1565151 1572691 1520694 1477699 1496393 1496462 1358150 1477283 1709804
17810A709804Q0150j7345p5987M8506j00331l0515M1331P8582L3454q793O1153
$$ 1709804 1789954 1772609 1696622 1745128 1644797 1614282 1655613 1734195 1767649 1758856 1820009
17799A820009l680k1787N2310M1077N2838L8746R0201Q3442J47490l4027j1975
$$ 1820009 1816329 1794542 1846852 1887929 1940767 1979513 2069714 2153156 2300646 2266619 2254644
17788B254644J46303k4365l7869J5603K9884k2335J01291K14522K48877K3454
$$ 2254644 2400947 2376582 2338713 2354316 2384200 2361865 2463156 2677678 2926555 2950009
17778B950009R1831M6990N528P5223J24867J73396L2570J35114J48377J20453
$$ 2950009 3041840 3088830 3094358 3169581 3294448 3467844 3500414 3635528 3783905 3904358
17768C904358K61383P929K7920Q2759K16758J35295J59228L17882O18062O01967
$$ 3904358 4165741 4173670 4201590 4284349 4501107 4636402 4795630 5113512 5731574 6333541
17758F333541M90691M14455L76484N12016M52252N15420N61341M61876N60674
$$ 6333541 6824232 7238687 7615171 8127187 8579439 9094859 9656200 10118076 10678750
17749A0678750P79036R13199J189258R78688J199869J438510J864742K478073
$$ 10678750 11457786 12370985 13560243 14538931 15738800 17177310 19042052 21520125
17741B1520125L207889L446558L277806L109626L931060M080715K367482J459628
$$ 21520125 24728014 28174572 31452378 34562004 38493064 42573779 44941261 46400889
17733D6400889K513952L556904M285485N417088P950126J1970008J7060112K1604024
$$ 46400889 48914841 52471745 56757230 62174318 70124444 82094452 99154564 120758588
17725A20758588K0668608J7267230K0614326K4539190J1674074p116563q892153
$$ 120758588 141427196 158694426 179308752 203847942 215522016 208405453 199513300
17718A99513300n245056j1188399j8665239j6639217j1007480q386371p734512
$$ 199513300 194268244 183079845 164414606 147775389 136767909 128381538 120647026
17711A20647026o143836l107594j808580m779127p314140o403833n507583o234683
$$ 120647026 114503190 111395596 109587016 104807889 97493749 91089916 85582333 79347650
17703G9347650o826808o251257n081227m282680l774128l288437k848597k249321
$$ 79347650 72520842 66269585 61188358 56905678 53131550 49843113 46994516 44745195
17695D4745195j762285j103685r02142m58579J01837N70032J132300J913119K816713
$$ 44745195 42982910 41879225 40977083 40518504 40620341 41190373 42322673 44235792 47052505
17686D7052505M150805N492911N976546N384369N591140P139053O398278K631440
$$ 47052505 51203310 56696221 62672767 68057136 73648276 80787329 87185607 89817047
17678H9817047K089811M996346P081784P625041R560414J4834319J8698695J4737703
$$ 89817047 91906858 96903204 103984988 111610029 121170443 136004762 154703457 169441160
17670A69441160Q016629J0260442J1765631q89648j7023111j6993138j3047355
$$ 169441160 177457789 187718231 199483862 198594214 181571103 164577965 151530610
17663A51530610j5738727j8997253j6586486j2424206q939641o439574m611248
$$ 151530610 135791883 116794630 100208144 87783938 78844297 72404723 67793475
17656F7793475l897581k986126j620238j426303l023035l689394k940065k706070
$$ 67793475 63895894 60909768 59289530 57863227 54840192 51150798 48210733 45504663
17648D5504663l761085m348267l770647l207694k761576k484649k297003k100363
$$ 45504663 41743578 37395311 33624664 30416970 27655394 25170745 22873742 20773379
17640B0773379j783609j515085j415937j059194j030575r83286j072528r85299
$$ 20773379 18989770 17474685 16058748 14999554 13968979 12985693 11913165 10927866
17632A0927866q25208p77952r03237o25952n19073o55537o90322m16874k94546
$$ 10927866 10102658 9324706 8421469 7795517 7276444 6620907 5930585 5513711 5219165
17623E219165k59287l01944m01863m51872j80282r1630j91621m70082k42135j55355
$$ 5219165 4959878 4657934 4256071 3804199 3623917 3532287 3340666 2870584 2628449 2473094
17613B473094k45762r1634K4416j05654j8719M4689K8213j1598k24962j83455
$$ 2473094 2227332 2135698 2160114 2054460 2035741 2080430 2108643 2097045 1872083 1688628
17603A688628j36772O0417M1421l8071L6341P6922m4972j30434j19345M9507J3912
$$ 1688628 1551856 1612273 1653694 1615623 1651964 1728886 1683914 1553480 1434135 1483642 1497554
17592A497554k96148l43628k79391J01234K63696k5712Q4831M4258R5980k06202
$$ 1497554 1201406 857778 578387 679621 943317 917605 1002436 1046694 1142674 936472
17582I36472L825M5796Q5650O4181r7198j01260o7156j65660k90396j04571K1024
$$ 936472 940297 986093 1071743 1135924 1038726 937466 870310 704650 414254 309683 330707
17571C30707J5617N3773l3882J36943N6189J16628j4916j66266l890J44997k448
$$ 330707 346324 400097 366215 503158 559347 675975 661059 494793 490903 635900 633452
17560F33452j21495Q7358r8858j42650r2555m9721J4466P7102N1656p0146M0730
$$ 633452 511957 599315 500457 357807 265252 215531 229997 307099 358755 288609 329339
17549C29339O5803N764K6070j02206o8087o1695P484J12608J03078j07546j22410
$$ 329339 395142 400906 426976 324770 256683 194988 202472 315080 418158 310612 188202
17538A88202M5572o0460j08488j1613K37740m2292o0089j65736m6790J72009K15384
$$ 188202 233774 173314 64826 53213 290953 248661 188572 22836 -23954 148055 363439
17527C63439M9113P1491Q96j50281M8752K3076Q5821R1579k28194j0647M3200
$$ 363439 412552 484043 484939 334658 383410 406486 492307 583886 355692 345045 388245
17516C88245k3352k83611j61612n8367M1556m7624k7533J3769J85621L1757j06430
$$ 388245 364893 81282 -80330 -138697 -97141 -144765 -172298 -158529 27092 58849 -47581
17505d7581O7888N7306O5658j06832j2072m6444j68941R3519K02978k6588j19385
$$ -47581 20307 77613 143271 36439 24367 -22077 -191018 -97499 105479 78891 -40494
17494d0494q0922N0249j20687l6230N7063R1279M6326j10791L8305m4257p3113
$$ -40494 -121416 -71167 -191854 -228084 -171021 -79742 -33416 -144207 -105902 -150159 -223272
17483b23272J25115J25366J4330M9047K4255L8064O3207k6106l0547o0644q6078
$$ -223272 -98157 27209 41539 90586 114841 152905 216112 190006 159459 98815 12737
17472A2737k81745k3383K46641J15887L6682J51073j59453j41939O8361L6865
$$ 12737 -269008 -292391 -45750 70137 106819 257892 98439 -43500 24861 61726
17462F1726j39421o7482m6509O4619q211J21497J18167r9402k887N1365m4669
$$ 61726 -77695 -145177 -191686 -127067 -135278 -13781 104386 4984 2097 53462 8793
17451H793N5495p9255Q7831n2995j36193m0905Q7246L4092O118K32348K87504
$$ 8793 64288 -14967 72864 19869 -116324 -157229 -69983 -35891 -29773 202575 490079
17440D90079K52290J67349J57416k52846l01506k71681l8687m3397J3765K4919
$$ 490079 742369 909718 1067134 814288 512782 241101 202414 159017 172782 197701
17430A97701j03618P9997m9918o6275j1832J57429r9277l18818n8492O2236K68748
$$ 197701 94083 174080 124162 57887 46055 203484 104207 -214611 -273103 -210867 57881
17419E7881l4887j05953R7715j16534L129J07326l509l9713n1070J10505R5956
$$ 57881 22994 -82959 14756 -101778 -98649 8677 5168 -34545 -85615 24890 120846
17408A20846j73601K6273L6663j63964k1393J2286n2936k2919N9291R8995m2646
$$ 120846 -52755 -26482 10181 -153783 -175176 -162890 -215826 -238745 -179454 -80459 -123105
17397a23105o0299N17J67188P3172J0695j3193j57460M0346L7634N2372j57846
$$ -123105 -183404 -182887 -15699 57473 68168 54975 -102485 -62139 -24505 27867 -129979
17386a29979L8580J20278j1966l9067o0791r8122r7925K76266N2156r0900k8380
$$ -129979 -91399 28879 16913 -22154 -82945 -181067 -278992 -2726 49430 -41470 -69850
17375f9850J15396Q8332l3668k32020l2160J74461J04072L8513j79724l14854
$$ -69850 45546 133878 100210 -131810 -163970 10491 114563 153076 -26648 -341502
17365c41502j01220O1787L9714J54369J01899o6133M672J56145R0508M5277N1224
$$ -341502 -442722 -380935 -341221 -186852 -84953 -151086 -146414 9731 100239 145516 196740
17354A96740Q35k10994j07292P1794M6558k7116l8793K2233J1840L484J13205
$$ 196740 197575 -13419 -120711 -48917 -2359 -29475 -68268 -46035 -34195 -30711 82494
17343H2494o4619k01855l9485R2722p3496r866o542J82908J2422M1655J1698p5791
$$ 82494 17875 -183980 -223465 -130743 -204239 -214105 -220647 -37739 -25317 16338 28036 -47755
17331d7755q1808J54935J58297j24559o6554J4952J17250m5246m0447O049j46262
$$ -47755 -129563 25372 183669 59110 -7444 7508 124758 79512 39065 45114 -101148
17320a01148o1898k4521m1134p3359l183J64827J69390M8699J9219j97889o1758
$$ -101148 -163046 -187567 -228701 -302060 -305243 -140416 28974 77673 96892 -100997 -162755
17309a62755n2949M414N7660q3872o2192L5452l2431K86051N9878j01578o7042
$$ -162755 -215704 -211290 -153630 -237502 -299694 -264242 -296673 -10622 49256 -52322 -119364
17298a19364N6129m4184p3017J1589K959J31596k0941Q6636O4768q4631m4785
$$ -119364 -63235 -107419 -180436 -168847 -165888 -34292 -55233 31403 96171 11540 -33245
17287c3245j52311n9692O9247o3636L5059Q9613M3733J8510J47119K22021q5319
$$ -33245 -185556 -245248 -176001 -239637 -204578 -114965 -71232 -52722 94397 316418 231099
17276B31099q4476k7357M5174j40308j32242M9273J50221m2724j02873j32268
$$ 231099 146623 119266 164440 24132 -108110 -58837 91384 48660 -54213 -186481
17266a86481l6333M7833O2346l40M3365P3853l9498j27782p0071j2281r8951J46052
$$ -186481 -222814 -174981 -112635 -112975 -69610 4243 -35255 -163037 -233108 -245389 -344340 -198288
17254a98288K0473m2950Q6549J13798j8523m8015J9697K25451J33735j46991j23644
$$ -198288 -177815 -220765 -134216 -20418 -38941 -86956 -67259 158192 291927 144936 21292
17243B1292q9700R6904N8517J45312p600m4514q7434J58542O218n7266P2899k5715
$$ 21292 -68408 28496 87013 232325 224725 180211 92777 251319 257537 200271 273170 247455
17231B47455j79874L6347K16202l4455l6629j26156m019M0365R2166m3260L3179
$$ 247455 67581 103928 320130 285675 249046 122890 118871 159236 251402 208142 241321
17220B41321J67118p325J68611J53474J4194o64J0804k49999l2348J43869O9999
$$ 241321 408439 401114 569725 723199 737393 736729 747533 497534 465186 609055 679054
17209F79054K65280j09903j32669O7064J6041N7634J9071j26359p9528q1186L7234
$$ 679054 944334 834431 701762 768826 784867 842501 861572 735213 655685 574499 611733
17198F11733l5899P4082l7738r4468J0014n0318m703J29928L5708k89289p7616
$$ 611733 575834 649916 612178 517710 527724 477406 472703 602631 638339 349050 271434
17187B71434K04113o6870r5876J951M0064j18623L2846J839j25642K26339J86435
$$ 271434 475547 408677 312801 314752 354816 236193 269039 270878 145236 371575 558010
17176E58010j41061k08177m8800O0960N5759J74634M4098r7681r3936J23524J58474
$$ 558010 416949 208772 159972 220932 276691 451325 495423 397742 303806 427330 585804
17165E85804J19290M1112q3784J32907M4377m14k82382k60251j97783k9160K58479
$$ 585804 705094 746206 662422 795329 839706 839292 556910 296659 98876 69716 328195
17154C28195K28855O0476j04513O7643K67933J22237J2220l65020j12158Q032
$$ 328195 557050 617526 513013 580656 848589 970826 983046 618026 505868 513900
17144E13900M0747j4682l3702p9918k71519j69824k7056P7408L9862j23494j82993
$$ 513900 554647 539965 506263 426345 154826 -14998 -42054 35354 75216 -48278 -231271
17133b31271R7705O5186m9509j92142J68308K41822K5818j11201j21809O3253
$$ -231271 -133566 -68380 -117889 -310031 -141723 100099 125917 14716 -107093 -43840
17123d3840J88929M8968k04204j47549M7167J2957P8823p502o4454J70263J17343
$$ -43840 145089 194057 -10147 -157696 -110529 -97572 -18749 -26251 -90705 79558 196901
17112A96901L3202r790p853j02789j06224n6813r49Q2260P144n7628m2648K082
$$ 196901 230103 220313 212460 109671 3447 -53366 -54315 27945 35089 -22539 -65187 -63105
17100f3105P0956l6841l9487K2229k9329o6345q3766J40271M1194J69263j84834
$$ -63105 7851 -28990 -68477 -46248 -75577 -141922 -225688 -85417 -44223 125040 -59794
17089e9794j07195q0458j28275J11583K00566j18870N413L6904J5092M7106r0484
$$ -59794 -166989 -247447 -375722 -264139 -63573 -182443 -177030 -140126 -125034 -77928 -168412
17078a68412j7643J08808O3557K323K8007K6208j04742M7584p9597Q3548J674
$$ -168412 -186055 -77247 -13690 -11367 16640 42848 -61894 -14310 -93907 -10359 -8685
17067h685p2717r0873r2426o7911o7373j8040O6283j6481J1327K50150K41702
$$ -8685 -81402 -172275 -264701 -332612 -399985 -418025 -351742 -368223 -356896 -106746 134956
17056A34956l5626J6146R0838j78683k20431n7855r1377J5661j009p1242m3404
$$ 134956 99330 115476 206314 27631 -192800 -250655 -342032 -326371 -327380 -398622 -442026
17045d42026Q1754R9294J01911Q1187K75258o5814k03156k16363k1317m0814K4284
$$ -442026 -360272 -260978 -159067 -77880 197378 131564 -71592 -287955 -309272 -350086 -325802
17034c25802M0544L05082p3508k8369J03931J45776J2931k18438K0116m5248j47249
$$ -325802 -285258 19824 -53684 -82053 21878 167654 180585 -37853 -17737 -62985 -210234
17023b10234L0109r6319R440J55442j21859P2781L1813J65008J43362j08373o9640
$$ -210234 -180125 -276444 -267004 -111562 -233421 -160640 -128827 36181 179543 71170 1530
17012A530L5950l2524r1023o7211k9146j21199p786K716r184j07488N8330K63772
$$ 1530 37480 4956 -86067 -153278 -182424 -303623 -311409 -308693 -317877 -425365 -367035 -103263
17000a03263Q496n2833M9784K92750j06665o3617L4009M6970K9083O132m6591
$$ -103263 -94767 -147600 -97816 194934 88269 24652 58661 105631 134714 140846 94255
16989I4255r5542j42030Q6038M6160O3813m1790k12553q4062J16128K23332r4448
$$ 94255 -1287 -143317 -57279 -11119 52694 10904 -201649 -285711 -169583 53749 -40699
16978d0699n5021N5886K6730j01311m5775j04173k27725J42535K89383M8686j14920
$$ -40699 -95720 -39834 -13104 -114415 -160190 -264363 -492088 -349553 -60170 -11484 -126404
16967a26404L2563j02481k2022J36071Q5912J71483L472r2673m6549j50798L4444
$$ -126404 -93841 -196322 -218344 -82273 3639 175122 178594 85921 39372 -111426 -76982
16956g6982M7689l3242r5958q3027J40437l6121N8993J71890J42216j32480r9181
$$ -76982 -29293 -62535 -158493 -241520 -101083 -137204 -78211 93679 235895 103415 4234
16945D234p7783j28744l7763J61697n2737q0812n7558k7827J09778J62469J59249
$$ 4234 -73549 -202293 -240056 -78359 -131096 -211908 -269466 -297293 -187515 -25046 134203
16934A34203K6412j072J7537j13706j93133p9759l4960R9539R1888K8602K8260
$$ 134203 160615 159543 177080 63374 -129759 -209518 -244478 -144939 -53051 -24449 3811
16923C811J25769O2374j10606j50826P4340m6198L5285m7327k5106k25505j03242
$$ 3811 129580 191954 81348 -69478 4862 -41336 -6051 -53378 -78484 -303989 -407231
16912d07231k6939J49232J01841j655K0524P8389J01889J44741l5976L9645k6535
$$ -407231 -434170 -284938 -183097 -184752 -164228 -85839 16050 160791 124815 164460 137925
16901A37925j22848J07591J05245n7710j35659r5677q5024j32240j46325N4832
$$ 137925 15077 122668 227913 170203 34544 -61133 -146157 -278397 -424722 -369890
16891c69890K582p2873J85608J74411n0023J47207M0178o4257m1720N0770L2229
$$ -369890 -367308 -440181 -254573 -80162 -130185 17022 57200 -7057 -48777 1993 34222
16880C4222p5634j03331K3587P8827J13706Q0075l0709k7562J06142j51317k00873
$$ 34222 -41412 -144743 -121156 -42329 71377 151452 120743 93181 199323 48006 -152867
16869a52867o2947K3671j25552j27465K7193R2257P0586R8259Q0446j02831j7073
$$ -152867 -215814 -192143 -317695 -445160 -417967 -325710 -255124 -156865 -76419 -179250 -196323
16858a96323p8313O2380J09883m9299r7163l2149L0580J18519K24487M5854j26773
$$ -196323 -274636 -212256 -102373 -151672 -248835 -280984 -250404 -131885 92602 138456 11683
16847A1683j20342j9400Q8052l5149l7506J41891l0388j06772k54197q8114J19250
$$ 11683 -108659 -128059 -40007 -75156 -112662 29229 -1159 -107931 -362128 -450242 -330992
16836c30992M2801p146M0804R8442O1558M593J9090M8775J87173k3690k49495
$$ -330992 -288191 -295337 -254533 -156091 -94533 -89940 -70850 -22075 165098 141408 -108087
16825a08087j91086K7182J32693J86231j08105Q315K40620P6052j52287r4623
$$ -108087 -299173 -271991 -139298 46933 -61172 -52857 187763 263815 111528 16905
16815A6905j90292M6319L4549J41314R4346j32641r2624J68956k6300k12394J8524
$$ 16905 -173387 -127068 -92519 48795 143141 10500 -82124 86832 60532 -151862 -133338
16804a33338r2438j15075J64775J79272m3802j99447j04896j2590q3997J3175
$$ -133338 -225776 -340851 -176076 3196 -40606 -240053 -344949 -357539 -441536 -428361
16794d28361j00914J11210J23109J12987N9970Q5616j83842j69267J38234J67598
$$ -428361 -529275 -418065 -294956 -181969 -121999 -36383 -220225 -389492 -251258 -83660
16784h3660J78384q3945p6905M850P3423j2438j29446m0697L7259N6040J03782
$$ -83660 94724 10779 -66126 -61276 12147 -291 -129737 -170434 -133175 -77135 26647
16773B6647R5824r3795L6435P6717j76717p101J7778N2765q3474j60094n5546
$$ 26647 122471 28676 65111 141828 -34889 -41990 -24212 28553 -54921 -215015 -270561
16762b70561j6876j3021M12O1564O9067N1804l6306j0554N0041L6477r3488q242
$$ -270561 -287437 -300458 -300046 -238482 -169415 -117611 -153917 -164471 -114430 -77953 -171441 -179683
16750a79683P0980K9065j39846P206J76061n1563m9055L3826l7665r7955K23334
$$ -179683 -108703 -79638 -219484 -212278 -36217 -87780 -136835 -103009 -140674 -238629 -15295
16739a5295L369j03584j52220K7824P8959j52608m0750J43859J35037n8015n372
$$ -15295 -11926 -115510 -267730 -239906 -160947 -313555 -354305 -210446 -75409 -133424 -138796
16728a38796L3048N9077l3482k05189j94802Q0972J43766K8600J96288O8545N8284
$$ -138796 -105748 -46671 -80153 -285342 -480144 -399172 -255406 -226806 -30518 38027 96311
16717I6311L4250p7955j27244o1618P9193O29M2798l4679j78634j03758p0960
$$ 96311 130561 52606 -74638 -136256 -57063 -56434 -13636 -48315 -226949 -330707 -401667
16706d01667M7015J55661K34182J63603p158j12899j22046l5624J53104Q8128
$$ -401667 -354652 -198991 35191 198794 191636 78737 -43309 -78933 74171 162299
16696A62299l9544q1790j45873k7244O2737L2778Q2268j09045q9660p5997l700
$$ 162299 122755 40965 -104908 -132152 -69415 -36637 45631 -63414 -153074 -229071 -232771
16685b32771m2895P5533J75674N07j3254Q0349j03417O9453J0262q972p4154K03145
$$ -232771 -275666 -200133 -24459 -23952 -37206 43143 -60274 9179 19441 10469 -63685 139460
16673A39460n9438j985M3476L2516j70351o9093P5088R3550n6508n8045j03505
$$ 139460 80022 78037 121513 154029 -16322 -85415 -10327 83223 26715 -31330 -134835
16662a34835j16574J8509j4714P476J36038R108j41335l8447P2328K0782M7037
$$ -134835 -251409 -232900 -247614 -240138 -104100 -94992 -236327 -274774 -202446 -181664 -134627
16651a34627k6446j2885L9479n9253j0171r9609R8414K6649p6046Q759n7018K2600
$$ -134627 -161073 -173958 -134479 -193732 -203903 -303512 -205098 -178449 -254495 -245736 -302754 -280154
16639b80154J04774L4777K19990j66963k50206J15302J21712J60698O7604j10811
$$ -280154 -175380 -140603 79387 -87576 -337782 -222480 -100768 59930 127534 16723
16629A6723j44011j4712Q5113J06914j34389j16611n8170J97596M0935j2569p3551
$$ 16723 -127288 -142000 -56887 50027 -84362 -200973 -259143 -61547 -20612 -33181 -106732
16618a06732m8731J05752R0801J71121q4129k98853q879J80230N775K8531K2571
$$ -106732 -155463 -49711 41090 212211 128082 -170771 -179650 580 6355 34886 57457
16607E7457Q9721K7482q7304p9966j9266j34254j97978O6371K28339J17119R3221
$$ 57457 147178 174660 87356 7390 -11876 -146130 -344108 -277737 -49398 67721 160942
16596A60942q2666j43737m7824P3737L565n1367J75741J50371K9810k11752j27211
$$ 160942 78276 -65461 -113285 -39548 -35983 -87350 88391 238762 268572 56820 -70391
16585g0391J6443J46576R6007k5012k7886M3344k70857l0515P9406o3008p9539
$$ -70391 -53948 92628 188635 163623 135737 179081 -91776 -122291 -42885 -105893 -185432
16574a85432k736L3922J71595O5890q7524p1475k28675N2609J5950J58697J66618
$$ -185432 -188168 -154246 17349 83239 -4285 -75760 -304435 -251826 -235876 -77179 89439
16563H9439J15395q441q9658P5167O2072q6095m4607j48047r4220p9394J02957
$$ 89439 204834 196393 106735 181902 243974 157879 113272 -34775 -128995 -208389 -105432
16552a05432k5182l1355J68587L3814n0228J20637r3686j82861p2263n3329J18258
$$ -105432 -130614 -161969 6618 40432 -9796 110841 17155 -165706 -237969 -291298 -173040
16541a73040J23322j53536m4426K48310J42369o0930j30318p4470J2258R6811
$$ -173040 -49718 -203254 -247680 630 142999 82069 -48249 -122719 -110461 -13650
16531a3650R2505j6032J00156P7682n4826q3928p7303j01289j0667L1756m6872
$$ -13650 78855 62823 162979 240661 185835 101907 24604 -76685 -87352 -55596 -102468
16520a02468r7457J67910O9010J4590J06670J30165j4037k30718m2654q7222r7293
$$ -102468 -199925 -32015 36995 51585 158255 288420 274383 43665 1011 -86211 -183504
16509a83504q0622J06127N7879O48N0573M1400J0165J20220P0060R691p8465m9075
$$ -183504 -264126 -157999 -100120 -99472 -48899 -7499 2666 122886 192946 202637 124172 75097
16497G5097l2792j16453j76413k0790P1250J83159k2582N8756j06810j45857J6724
$$ 75097 42305 -74148 -250561 -271351 -200101 -16942 -39524 19232 -87578 -233435 -216711
16486b16711O2528J0507k5735J02908J05904j12903j08292J60847P9543J25412
$$ -216711 -154183 -143676 -169411 -66503 39401 -73502 -181794 -20947 58596 184008
16476A84008j89506j51134Q4990J02859P4157q5658O6107P5960k04201k55637
$$ 184008 -5498 -156632 -71642 31217 105374 19716 85823 161783 -42418 -298055
16466b98055K6955J80803P3354o4716J32993Q4076O9345q7828N0201J15826j44662
$$ -298055 -271100 -90297 -16943 -81659 51334 135410 204755 116927 167128 282954 138292
16455A38292j77294q0483m519N5332j3383j78226K3166K45847J71397k7513P50
$$ 138292 -39002 -119485 -124004 -68672 -82055 -260281 -237115 8732 180129 152616 153366
16444A53366J5306k83251j79678Q636J33863L3376J18373J7403j87306n6764L8481
$$ 153366 168672 -114579 -294257 -285621 -151758 -118382 -9 17394 -169912 -226676 -188195
16433a88195j4049R3172L9148j13391J46105Q8702p7946p2228o8379j5595p2647
$$ -188195 -202244 -109072 -69924 -183315 -37210 51492 -26454 -98682 -167061 -182656 -255303
16422b55303l9114K38842K66510L3297j48494o2619j00844O5829J6428m6682j63091
$$ -255303 -294417 -55575 210935 244232 95738 33119 -67725 -1896 14532 -32150 -195241
16411a95241r3618Q5129K37855O4701N053n3053j86872j33323N6121J60670k3485
$$ -195241 -288859 -203730 34125 98826 103879 50826 -136046 -269369 -213248 -52578 -76063
16400g6063p8928J36488l7164j14021J49775J40138q1294o6197P9386J76309P0854
$$ -76063 -154991 -18503 -55667 -169688 -19913 120225 38931 -27266 52120 228429 299283
16389B99283n0540j00580o9032N8850J13675j08595j00940j20154p2294M1039
$$ 299283 248743 148163 79131 137981 251656 143061 42121 -78033 -150327 -109288
16379a09288j40060k8514J12068K15536j4011l9758j980O1961M224j17882j22971
$$ -109288 -249348 -277862 -165794 49742 35731 -4027 -6007 55954 60178 -57704 -180675
16368a80675m2820J13458J37556J00066l7852M77j8327J38793q4821j46002p5034
$$ -180675 -223495 -110037 27519 127585 89733 90210 71883 210676 125855 -20147 -95181
16357i5181J64034J63957k7752m8636Q833j46804j98743J8959N0991l5836r906
$$ -95181 68853 232810 205058 156422 165255 18451 -180292 -161333 -110342 -146178 -156084
16346a56084p547j1174K51706O9914j82296J78152J2142j22592K8317J22284j13054
$$ -156084 -163631 -174805 76901 146815 -35481 142671 154813 32221 60538 182822 69768
16335F9768Q6060R6644k55414K804l1613L8004k1472n4763J22853M5016j46239
$$ 69768 155828 252472 -2942 -138 -31751 6253 -15219 -69982 52871 97887 -48352
16324d8352L8854J06680R961Q0952J656j73343r606K8596P0925q7394j77153j46257
$$ -48352 -9498 97182 107143 188095 189751 16408 6802 35398 106323 18929 -158224 -304481
16312c04481l6018J34529K34658J82904j33140k87853j84518J50749K1211j57693
$$ -304481 -340499 -205970 28688 211592 78452 -209401 -393919 -243170 -221959 -379652
16302c79652K8975Q1333J83625l4687P9315l1814j14214m9858R9020l3381o9202
$$ -379652 -350677 -269344 -85719 -120406 -41091 -72905 -187119 -236977 -137957 -171338 -240540
16291b40540R0446Q7921N506j07552J77518p5112k02933J39189L11312k63182
$$ -240540 -150094 -62173 -56667 -164219 13299 -61813 -264746 -125557 185755 -77427
16281g7427q0101K29490k0531j22257o201L4430j6579j45310K8899P3092j2101
$$ -77427 -157528 71962 51431 -70826 -77027 -42597 -59176 -204486 -175587 -102495 -114596
16270a14596P9648N4931Q5055k10854j23101J21001k8669k1525J97468K5994k97215
$$ -114596 -34948 19983 105038 -105816 -228917 -107916 -136585 -158110 39358 65352 -231863
16259b31863m8579J8029Q3084J73165J17200N668l6606K0435m5504m9903O8040
$$ -231863 -280442 -262413 -179329 -6164 111036 116704 80098 100533 55029 5126 73166
16248G3166l6788m0115o9897j80258m4670j2159J85747J00328J00355J8956l3776
$$ 73166 36378 -3737 -73634 -253892 -298562 -310721 -124974 -24646 75709 94665 60889
16237F0889K537J5271o3383J7428M5883N3959j10103j73690J38212m6413P5690
$$ 60889 63426 78697 15314 32742 78625 132584 22481 -151209 -12997 -59410 16280
16226A6280M6496J03037J35165l3320j7510j32170J26309J60411j22152R680j04461
$$ 16280 62776 165813 300978 267658 250148 117978 244287 404698 282546 292226 187765
16215A87765j70380M478M7698p4595p5958j34683m389J61935J8564J2609M1851
$$ 187765 17385 21863 69561 -5034 -80992 -215675 -220064 -58129 -39565 -26956 14895
16204A4895q0020J58900K459j06698r1664P9839m9933o1660K33306K19756J23066
$$ 14895 -65125 93775 96234 -10464 -102128 -22289 -72222 -133882 99424 319180 442246
16193D42246j12119j73481k16387L7106P3897J49671j4662m3916p6648j0321j02228
$$ 442246 330127 156646 -59741 -22635 51262 200933 186271 142355 65707 55386 -46842
16182d6842L8915M7821k6549j03510J26784p3535r1339n4577J98432J32804q1744
$$ -46842 -7927 39894 13345 -90165 36619 -36916 -128255 -182832 15600 148404 66660
16171F6660j7607J10852J94097m6901k64565j76306o427R6279k21012o093K00423
$$ 66660 49053 159905 354002 307101 42536 -133770 -140197 -43918 -264930 -271023 -70600
16160g0600J39342M9826j01293p3022L9502q4171j07270K8687N6993k0145j19582
$$ -70600 68742 118568 17275 -55747 -16245 -100416 -207686 -178999 -122006 -142151 -261733
16149b61733r5648P1914J57560J62925L5755J0873J49817m7203j27882M1787J47237
$$ -261733 -357381 -285467 -127907 35018 70773 81646 231463 184260 56378 98165 245402
16138B45402l6687o7048M7688J4289p3893R5584K1151j41896n6431r840j86487
$$ 245402 208715 141667 189355 203644 129751 225335 246486 104590 48159 38319 -148168
16127a48168k0906j1280n8487J4400J29194R32j16551P4510M7185L7239J5933
$$ -148168 -169074 -180354 -238841 -224441 -95247 -94315 -210866 -136356 -89171 -51932 -35999
16116c5999J8942o1166L2320j04111P2453L4202j11964R7048j03070Q1828N2715
$$ -35999 -17057 -78223 -45903 -150014 -77561 -43359 -155323 -58275 -161345 -79517 -26802
16105b6802J9064q9518p7414j9481j13846j12326J42131K11936L8142J00859J67242
$$ -26802 -7738 -97256 -174670 -194151 -307997 -420323 -278192 -66256 -28114 72745 239987
16094B39987R096o7626r7060m0800L4181n2572l3174j0047k44098j93913J09284
$$ 239987 249083 181457 84397 43597 77778 25206 -7968 -18015 -262113 -456026 -346742
16083c46742J3598J57251P9837J30157M853J8442j7700j41155j04692J32101J52940
$$ -346742 -333144 -175893 -96056 34101 38954 57396 39696 -101459 -206151 -74050 78890
16072G8890J44304o9624l2425r2553o7146P5181L0896o7790O8523j2594M4027
$$ 78890 223194 153570 121145 28592 -38554 36627 67523 -267 68256 55662 99689
16061I9689K0312m8759L6768N2608j18549k30940J03873L3247j24372M7538J63907
$$ 99689 120001 71242 108010 160618 42069 -188871 -84998 -51751 -176123 -128585 35322
16050C5322J25389M2383R5293n2270p3026k60684j8705J45639j18034L0477J12650
$$ 35322 160711 203094 298387 246117 173091 -87593 -106298 39341 -78693 -48216 64434
16039F4434K38079j6534q7105l3720N0833j13409o526j5561j64920Q7895K04359
$$ 64434 302513 285979 198874 165154 215987 102578 96052 80491 -84429 3466 207825
16028B07825N4666r5442o8070Q6662K5018r7933j76699J11651k0028j69827P7186
$$ 207825 262491 167049 98979 185641 210659 112726 -63973 47678 27650 -142177 -64991
16017f4991o5985r9539K3561J78662J78308j6355j59081R2313m4537r5505r8729
$$ -64991 -130976 -230515 -206954 -28292 150016 133661 -25420 66893 22356 -73149 -171878
16006a71878j0577J36270J64507j31767l8352m0973Q0191J48434p2417p9803r2036
$$ -171878 -182455 -46185 118322 -13445 -51797 -92770 -12579 135855 63438 -16365 -108401
15995a08401k2036M5106J46627m228J13675j13254O7840J88384k00204k40032
$$ -108401 -130437 -85331 61296 57068 170743 57489 125329 313713 113509 -126523
15985a26523j13575J59638J87266j9750j09991j9291o8464J95215N0077n0031
$$ -126523 -240098 -80460 106806 87056 -22935 -42226 -110690 84525 134602 84571
15975H4571j18196l3332o4733l4377l9127N3539Q8580K30600M9740k5438j47319
$$ 84571 -33625 -66957 -131690 -166067 -205194 -151655 -63075 167525 217265 191827 44508
15964D4508j02568J8314R5474r199k06225k34915L354J69536J26523j10814j55071
$$ 44508 -58060 -39746 55728 46529 -159696 -394611 -391257 -221721 -95198 -206012 -361083
15953c61083N245J39547K40915J35251N4354K0996m5026Q7682N0908n7391o9198
$$ -361083 -355838 -216291 24624 159875 214229 235225 190199 277881 328789 271398 202200
15942B02200k6128K5661k6404j69523K05359J47182o4142j99848q9578J5313J03922
$$ 202200 176072 201733 175329 5806 211165 358347 294205 94357 4779 20092 124014
15931A24014r0763r7976N9572l0314p2857N4260Q9181M6100M4013R1805P6369
$$ 124014 33251 -64725 -5153 -35467 -108324 -54064 35117 81217 125230 217035 293404
15920B93404J3957j71927j1911N1576L8438J0119l644l5647r1663M2084R3490
$$ 293404 307361 135434 123523 175099 213537 223656 220012 184365 92702 134786 228276
15909B28276P1543j9065j32230j58103K8915J09536m6307Q8896O3462q4556q4248
$$ 228276 299819 280754 148524 -9579 19336 128872 82565 171461 234923 150367 66119
15898F6119K1707O3960p494m4543J24732j04982j91684N360P8620J80211R6113
$$ 66119 87826 151786 144292 99749 224481 119499 -72185 -66825 11795 192006 288119
15887B88119J0086l7063j50527j23905r2445j25040J3949Q1068J54086M0479j21748
$$ 288119 298205 261142 110615 -13290 -105735 -230775 -216826 -135758 18328 58807 -62941
15876f2941m2702k3843l7712J77007J20149J74476n1540j55032p875O7953Q7412
$$ -62941 -105643 -129486 -167198 9809 129958 304434 252894 97862 89987 157940 245352
15865B45352J22445L7565J4194k833j47463j28093k3227j2546k13312r5441L5400
$$ 245352 367797 405362 419556 416723 269260 141167 117940 105394 -107918 -203359 -167959
15854a67959M1756M1497j7041n0563j39097l5933q8030N6100M4786J47558J10477
$$ -167959 -126203 -84706 -101747 -152310 -291407 -327340 -415370 -359270 -314484 -166926 -56449
15843e6449J80909O6772j99341K4354R0567P8915p306N2955m83M607j54013r2043
$$ -56449 124460 191232 -8109 16245 106812 185727 178421 231376 230893 235500 81487 -10556
15831a0556j13707j4621K1332r395Q1450p185L0907J11540j00503j8821N1151
$$ -10556 -124263 -138884 -117552 -126947 -45497 -52682 -21775 89765 -10738 -29559 21592
15820B1592m1627o5415O3o1401r7236J17938J04780l731K5016J42261k0291P113
$$ 21592 -20035 -85450 -85387 -146788 -244024 -126086 -21306 -25037 -21 142240 121949 129062
15808A29062K2947p0625O2606r3482j42355O512J73231Q9255j7453M4773o5139
$$ 129062 152009 81384 143990 50508 -91847 -85335 87896 177151 159698 204471 139332
15797A39332J34483L4656o4597L7268j05632j31005O1174M847L1268m0859m3560
$$ 139332 273815 308471 243874 281142 175510 44505 105679 110526 141794 100935 57375
15786E7375m296L6577L6539n3178J00786J5179l2350J1047R071R2594p4672r9575
$$ 57375 53079 89656 126195 73017 173803 188982 156632 167679 176750 269344 194672 95097
15774I5097l1406j9636j16356M1003k41332M6288J90962J35546j0324j01135P8610
$$ 95097 63691 44055 -72301 -31298 -272630 -226342 -35380 100166 89842 -11293 67317
15763F7317M9795L1274j44546o9406J42257j5731j59910J08400Q5889p5478k8271
$$ 67317 117112 148386 3840 -65566 76691 60960 -98950 9450 95339 19861 -8410
15752h410n3038k5298l4454l571Q4208J6366p2805L5773R7059O7921J60681R910
$$ -8410 -61448 -86746 -121200 -124771 -40563 -24197 -97002 -61229 35830 103751 264432 274342
15740B74342n3518R2832j23068j65476O5597J66966R579m899R8322j46834j21494
$$ 274342 220824 313656 190588 25112 90709 257675 267254 262355 360677 213843 92349
15729I2349k887j14270n8330m7129J13785J56874J19573k33641n6798l4991Q2445
$$ 92349 89462 -24808 -83138 -130267 -16482 140392 259965 26324 -30474 -65465 16980
15718A6980R9751j08104M551K4486p1266j00086k2512K07315O9754o340q1090
$$ 16980 116731 8627 13178 37664 -33602 -133688 -156200 51115 120869 114529 33439
15707C3439k0201L2899J660m8942q2718K6730J88256k6186m4618o0673m2145R1404
$$ 33439 13238 46137 47797 -1145 -83863 -57133 131123 104937 60319 -354 -42499 48905
15695D8905J3098M9146O3043J30123l9476q2096j08042m7211L7951q9736k40681
$$ 48905 62003 111149 174192 304315 264839 182743 74701 27490 65441 -24295 -264976
15684b64976N7896K7631P7767J07539O8353r0411J4196J5376p6668q787J17020
$$ -264976 -207080 -179449 -101682 5857 74210 -16201 -2005 13371 -63297 -72084 44936
15673D4936r0823L756O7027Q6600K4916k9532R2643J15561J10768q8292j74578
$$ 44936 -45887 -42131 24896 111496 136412 106880 199523 315084 425852 337560 162982
15662A62982l9403K7305k6256L1173o3182N0253J03774q750j17508j54928n0625
$$ 162982 123579 150884 124628 155801 92619 142872 246646 237896 120388 -34540 -85165
15651h5165N1118k441k1697j07179R7054M9660m5279q1883j4280O7035J18100
$$ -85165 -34047 -36488 -58185 -165364 -68310 -18650 -63929 -145812 -160092 -93057 25043
15640B5043J56094l08j28219j06116N8440J2882m2780j0803J21742o6789j35207
$$ 25043 181137 180829 52610 -53506 4934 17816 -24964 -35767 85975 19186 -116021
15629a16021M5554L14288N0950q9179k652j36993L4053q1231j0519P479J84449
$$ -116021 -70467 243821 294771 205592 202940 65947 100000 18769 8250 15729 200178
15618B00178J93065j34248k24007q694j19225m4385M3983Q2416o309k21527r8730
$$ 200178 393243 258995 34988 26294 -92931 -137316 -93333 -10917 -17226 -238753 -337483
15607c37483K6838r4557J05314Q6687J94514K11505R6774m7901j18663o7138k618
$$ -337483 -310645 -405202 -299888 -213201 -18687 192818 289592 241691 123028 55890 53272
15596E3272k3756j5335J73848p3531j29778k1527p0214J03140M7954n5520k6544
$$ 53272 29516 14181 188029 114498 -15280 -36807 -107021 -3881 44073 -11447 -37991
15585c7991P6367K8597K0411K3698n1882M3178J30572J09204J62309q1375j00954
$$ -37991 38376 66973 87384 111082 59200 102378 232950 342154 504463 423088 322134
15574C22134j02317P9689M1933p4008J07187o6921k08240n4070j08J13056J96690
$$ 322134 219817 299506 341439 267431 374618 307697 99457 45387 45279 158335 355025
15563C55025K5877j31376p5709l8136r5821Q9963M783k4311m3560j17391j5144
$$ 355025 380902 249526 173817 135681 39860 129823 134606 110295 66735 -50656 -65800
15552f5800J13072L5810j65062j02745P4284K64083J68674r0277j38211J31613
$$ -65800 47272 83082 -81980 -184725 -110441 153642 322316 232039 93828 225441
15542B25441O238m0076R9362q2403j45157q3217K4330j2958Q6381O3410N7530
$$ 225441 231679 191603 290965 208562 63405 -19812 4518 -8440 77941 141351 198881
15531A98881J75047R2849k86836j62232L7163K0433L3381k15591n9943r1715J45316
$$ 198881 373928 466777 179941 17709 54872 75305 108686 -106905 -166848 -258563 -113247
15520a13247P0394J33256o4228q5560M4603L0152L5991m1974m7036r3158m8167
$$ -113247 -42853 90403 26175 -59385 -14782 15370 51361 9387 -37649 -130807 -178974
15509a78974j1195O7799M6955r1008J45480R8878n609L9595l7059J6226r4841
$$ -178974 -190169 -122370 -75415 -166423 -20943 77935 72326 111921 74862 91088 -3753
15498c753m5636J54974l44k9914O3783j84643j11528Q3787J27880J40930l7936
$$ -3753 -49389 105585 105241 75327 139110 -45533 -157061 -73274 54606 195536 157600
15487A57600r1578r9293j8568p0725j96104P2648J68405P1087o083Q7446K7907
$$ 157600 66022 -33271 -51839 -122564 -318668 -246020 -77615 -6528 -12611 74835 102742
15476A02742p070J6974K3486q7846j41807o0903n4408P0452J57151J76434J25963
$$ 102742 95672 112646 136132 48286 -93521 -154424 -208832 -138380 18771 195205 321168
15465C21168j640j83323j00003l2590J1329j20549J05929J85547L02926k46818
$$ 321168 319528 136205 36202 3612 14941 -105608 321 185868 488794 241976
15455B41976k09673J9399N1358j3774Q1066J15695J8523p8581Q4669K1409R6139
$$ 241976 32303 51702 103060 89286 170352 286047 304570 225989 310658 332067 428206
15444D28206K888J14629K7398j41548K6162j9810N4402k4626p6801k23276M3438
$$ 428206 431094 545723 573121 431573 457735 437925 492327 467701 390900 167624 211062
15433B11062K70954L04647J21465J3502m4885M8349J62751M39502J58728L02054
$$ 211062 482016 786663 908128 921630 876745 925094 1087845 1527347 1686075 1988129
15423A988129K36175K58342J91217P4125P555j20286j92217j29576j98437j65291
$$ 1988129 2224304 2482646 2673863 2747988 2755543 2635257 2443040 2313464 2115027 1949736
15413A949736k84591k82745j45617k54861p9663R9021R0662p8390p0926J09169
$$ 1949736 1665145 1382400 1236783 981922 902259 1001280 1091942 1013552 942626 1051795
15403A051795r3663j64574r9428q9958j48035n3042j28873j81159M4280J01610
$$ 1051795 958132 793558 694130 604172 456137 403095 274222 93063 137343 238953
15393B38953j5393j05312j18500j76954Q7735K32494j08347j02430m4150J91366
$$ 238953 223560 118248 -252 -177206 -89471 143023 34676 -67754 -111904 79462
15383G9462o8379J72600J01333M9054j68752n9078R6905O083j9036J12448o8552
$$ 79462 11083 183683 285016 334070 165318 106240 203145 209228 190192 302640 234088
15372B34088n9391o3436r0844L3296J87237P2032j7452j2545m1843j32498m3481
$$ 234088 174697 111261 20417 53713 240950 312982 295530 282985 241142 108644 65163
15361F5163J46887J02554O2872q2749m3663p7182p920k4594J79084R7901j02434
$$ 65163 212050 314604 377476 294727 251064 173882 165962 141368 320452 418353 315919
15350C15919M6249O461l9292j31112j38749r7832N0685P2265K531o9190p0790
$$ 315919 362168 368629 329337 198225 59476 -38356 12329 84594 87125 17935 -52855
15339e2855J7490m6691Q3839J988P2656N0908o0221O7133J44439K1500L2694J6573
$$ -52855 -35365 -82056 1783 3771 76427 127335 67114 134247 278686 300186 332880 349453
15327C49453R434Q4948J6984k07350p0687J50915J23062q3327j12262J17753N4870
$$ 349453 358887 443835 460819 253469 182782 333697 456759 373432 261170 378923 433793
15316D33793Q1767k6983j68223m1227M7356k6953Q5895O1209m4229j64393j25204
$$ 433793 515560 488577 320354 279127 326483 299530 385425 446634 402405 238012 112808
15305A12808k3491l8940o1115Q2830Q5002O5064k8924J802O9411L6979j60577
$$ 112808 89317 50377 -10738 72092 157094 222158 193234 195036 264447 301426 140849
15294A40849M9786P0334m5198q9392l7175n102j62430K0551J64864J64166K0462
$$ 140849 190635 260969 215771 126379 89204 84102 -78328 -57777 107087 271253 291715
15283B91715j55067J42301J04506J41528J9121j23044j59130k8663J14181j8945
$$ 291715 136648 278949 383455 524983 544104 421060 261930 233267 347448 328503
15273C28503L057O0622J3516P2335j5941J8705k5108j55649r7125q0563N9366
$$ 328503 331560 392182 405698 478033 462092 480797 455689 300040 202915 122352 181718
15262A81718J21224L6230J48247O7698N0361j363j91998L3895P1270j05631j31237
$$ 181718 302942 339172 487419 555117 605478 604115 412117 446012 517282 411651 280414
15251B80414r5412J3683N952K08804M30877p5890k22067k31268j02055J08485
$$ 280414 185002 198685 204637 413441 844318 768428 546361 315093 213038 321523
15241C21523J8949M3565l7892J06049r6692P870R557M3125R7869J284K5784K08822
$$ 321523 340472 384037 346145 452194 355502 363372 372929 416054 513923 515207 540991 749813
15229G49813J55873j16176j01529J35589J51238m15q3395j83107K662M7473l2589
$$ 749813 905686 789510 687981 823570 974808 974393 890998 707891 710553 758026 725437
15218G25437r0253j49672j90752M2853q7900n3238N8277L9736j37925J19899O6424
$$ 725437 635184 485512 294760 337613 249713 196475 254752 294488 156563 276462 342886
15207C42886R1417R8211p4445m7433k5331m0700N2000J07631m3261q9361R2743
$$ 342886 434303 532514 458069 410636 385305 344605 396605 504236 460975 371614 464357
15196D64357R5379n9926j10175N5741o340j75076L1424J51757J89807J02235j22089
$$ 464357 559736 499810 389635 445376 439036 263960 295384 447141 636948 739183 617094
15185F17094j15419Q8672P4473O4643O9901m3626L9879k18389j02299n621M8025
$$ 617094 501675 590347 664820 729463 799364 755738 795617 577228 474929 469308 517333
15174E17333j04371l7952O931J05298P0921l4687K04470Q5237K0483n7364K3999
$$ 517333 412962 375010 381941 487239 558160 523473 727943 813180 833663 776299 800298
15163H00298J15161J37752P6284N5576m3998m3392J0151J42441p6479o9150j91271
$$ 800298 915459 1053211 1129495 1185071 1141073 1097681 1107832 1250273 1173794 1104644 913373
15152I13373j02360r1169j00922K0378J69363J40712J94645L49607j67648j41292
$$ 913373 811013 719844 618922 639300 808663 949375 1144020 1493627 1325979 1184687
15142A184687j73919j20846L4296L2178K10367O3537l1865j92184J69462R4607
$$ 1184687 1010768 889922 924218 956396 1166763 1230300 1198435 1006251 1175713 1270320
15132A270320j09926j57102n9276K8040Q8120M6626j05625k30380P2961J85927
$$ 1270320 1160394 1003292 944016 972056 1060176 1106802 1001177 770797 843758 1029685
15122A029685R626r8724j26618P6874o5240R2210M1303O1354p6211N4539R4768
$$ 1029685 1039311 940587 813969 890843 825603 917813 959116 1020470 944259 998798 1093566
15111A093566J9633j3180m9037l6218N2783J35361J34315n8140M2162N6272j13643
$$ 1093566 1113199 1100019 1050982 1014764 1067547 1202908 1337223 1279083 1321245 1377517 1263874
15100A263874o964Q2172n535N9488j20913n4362J29571l8014M5376K2330R3960
$$ 1263874 1256910 1339082 1333547 1393035 1272122 1217760 1347331 1309317 1354693 1377023 1470983
15089A470983J55554m6487n9746O417Q3832J04795Q5225O928R7948J42654J7713
$$ 1470983 1626537 1580050 1520304 1526721 1610553 1715348 1800573 1807501 1905449 2048103 2065816
15078B065816o2961K6816J06019J71334k9238j0936J10828j14433o4076k4004
$$ 2065816 2002855 2029671 2135690 2307024 2277786 2266850 2377678 2263245 2199169 2175165
15068B175165L8227p1158R4792J75991j0324o5183N4239Q0966J65873K4597J2456
$$ 2175165 2213392 2142234 2237026 2413017 2402693 2337510 2391749 2472715 2638588 2663185 2675641
15057B675641M1780R3580Q5273R3L0670j24477L4165J84685J37719j04734J86969
$$ 2675641 2717421 2811001 2896274 2896367 2927037 2802560 2836725 3021410 3159129 3054395 3241364
15046C241364M1782O8584J21171k6624Q4295R1727N614r424J05791J0089O4563
$$ 3241364 3283146 3351730 3472901 3446277 3530572 3622299 3627913 3618489 3724280 3734369 3798932
15035C798932J31809L06773L33460K06545J21107O73J28309L52826K26631J44967
$$ 3798932 3930741 4237514 4570974 4777519 4898626 4899299 5027608 5380434 5607065 5752032
15025E752032L75999L33734J76404J78698K66124M86990M09726L51706K55765
$$ 5752032 6128031 6461765 6638169 6816867 7082991 7569981 7979707 8331413 8587178
15016H587178N52327M55600N52391O42981P32512P15457P58486R73735J163985
$$ 8587178 9139505 9595105 10147496 10790477 11522989 12238446 12996932 13970667 15134652
15007A5134652J466840J581161J798494K046957K199637K331253K433541K695792
$$ 15134652 16601492 18182653 19981147 22028104 24227741 26558994 28992535 31688327
14999C1688327L059017L239044L251510L499309M056688M401714M928625N886646
$$ 31688327 34747344 37986388 41237898 44737207 48793895 53195609 58124234 64010880
14991F4010880O953349Q215709R738422J2105348J5579428K0317752K6198907
$$ 64010880 70964229 79179938 88918360 101023708 116603136 136920888 163119795
14984A63119795L2668217L8648030M3484769M6294476M5658733M0995831L1733033
$$ 163119795 195788012 234436042 277920811 324215287 369874020 410869851 442602884
14977D42602884J9499814N718276q728173k1941846l2329846l8688799m1254343
$$ 442602884 462102698 467820974 459092801 437150955 404821109 366132310 324877967
14970C24877967m0431271l7110636l2319538k6844232k1246195j6501757j3246678
$$ 324877967 284446696 247336060 215016522 188172290 166926095 150424338 137177660
14963A37177660j0620073q519586p580825o617515n985923n886357o250053o291449
$$ 137177660 126557587 118038001 110457176 103839661 97853738 91967381 85717328 79425879
14955G9425879o028593n807732n885091n591632n252720m927951m540628m014397
$$ 79425879 73397286 67589554 61704463 56112831 50860111 45932160 41391532 37377135
14947C7377135l319336k944638k672277k684561k207164j989682j754471j611606
$$ 37377135 34057799 31113161 28440884 25756323 23549159 21559477 19805006 18193400
14939A8193400j573315j430732j440078j289185j077286q50000p23389o84393
$$ 18193400 16620085 15189353 13749275 12460090 11382804 10532804 9809415 9125022
14931I125022o14450p30649n31766l89003m04176m09195l37032l64215k78093
$$ 9125022 8510572 7779923 7248157 6859154 6454978 6045783 5708751 5344536 5066443
14922E066443k88024j38911j10663l82298k16845j20514k07593k84137n8902o2629
$$ 5066443 4778419 4639508 4528845 4146547 3929702 3809188 3601595 3317458 3258556 3195927
14912C195927j64807l20902l6260k9325j91385k02640j90677j49132O118J13101
$$ 3195927 3031120 2710218 2673958 2644633 2453248 2250608 2059931 1910799 1916917 2030018
14902B030018j03126M4315j17672j92293k22485N6827K01978o1969J7850Q0164
$$ 2030018 1926892 1971207 1853535 1661242 1438757 1495584 1697562 1635593 1653443 1733607
14892A733607j43733k53555m7833m8585l6224o4970J22962j09125q239N2540r4788
$$ 1733607 1589874 1336319 1288486 1239901 1203677 1138707 1261669 1152544 1144305 1196845 1102057
14881A102057n6464M2946l7523m8372J9332J23729K836J543j53351p1162N3261
$$ 1102057 1045593 1088539 1051016 1002644 1021976 1145705 1148541 1150084 996733 925571 978832
14870I78832q5294Q2202K1373n3484p472J0884n0245j17954j09292Q4061J9577
$$ 978832 893538 975740 997113 943629 936157 947041 896796 778842 669550 753611 773188
14859G73188R7033J14093l339j4557m9953j25874j158j89108p6934M1179K55203
$$ 773188 870221 984314 980975 966418 916465 790591 789433 600325 523391 564570 819773
14848H19773J00449n7698j33034p2146J28702N6835n6473q2206j2885J14549k8285
$$ 819773 920222 862524 729490 657344 786046 842881 786408 704202 691317 805866 777581
14837G77581j2569J66301M155j17231k31005o9244K02M0303Q393j9206p5514n9382
$$ 777581 765012 931313 935468 818237 587232 517988 518190 558493 566886 547680 472166 412784
14825D12784N4481K627j27469r8456q1771m891n6656J37973N7345m6308j8222
$$ 412784 467265 469892 342423 243967 162196 157305 100649 238622 295967 249659 231437
14814B31437j26470j07502l888N6758N5104k9209J58643J4300k21140m7725Q012
$$ 231437 104967 -2535 -6423 50335 105439 76230 234873 249173 28033 -19692 -11680
14803a1680j2809M0826l0544R436n0388n623m6918l821K8467M3708J45923J24761
$$ -11680 -24489 16337 -14207 -4771 -55159 -60782 -107700 -111521 -83054 -39346 106577 231338
14791B31338K9540k01858p1880m3342k08295K00646J02081L6812K7865J0382J60003
$$ 231338 260878 59020 -12860 -56202 -264497 -63851 38230 75042 102907 113289 273292
14780B73292J14012O9526j48499l54771p3612J10316n2114K8419q2144l0143l2494
$$ 273292 387304 456830 308331 -46440 -120052 -9736 -61850 -33431 -115575 -145718 -178212
14769a78212n2806Q5611Q4586k4255J76921J53155r8892k00797J48947N4429k3227
$$ -178212 -231018 -145407 -60821 -85076 91845 245000 146108 -54689 94258 148687 125460
14758A25460m6624j76114m0160M3130j30670q2148J65737J60297K25590M9781
$$ 125460 78836 -97278 -137438 -94308 -224978 -307126 -141389 18908 244498 294279
14748B94279l7484L5157j73929J1571J5963N0728L595j67912n2487p6723q1885
$$ 294279 256795 291952 118023 129594 145557 196285 199880 31968 -20519 -97242 -179127
14737a79127j49213M0139L3476J38576L31050L7933n5641M4354o2481k11653J9805
$$ -179127 -328340 -288201 -254725 -116149 214901 252834 197193 241547 179066 -32587 -12782
14726a2782J41488J74459J35293j00609j82605q1679j24674M9204J5255j12826
$$ -12782 128706 303165 438458 337849 155244 73565 -51109 -1905 13350 -99476
14716i9476r4207l7283M4865K3462K6910M3404m0924N6724J14778j593n578n1247
$$ -99476 -193683 -230966 -186101 -162639 -135729 -92325 -133249 -76525 38253 36660 31082 -20165
14704b0165q2160O4780p1359J0099R4749Q1964l198j77044j84998l5351q0232
$$ -20165 -102325 -37545 -108904 -98805 -4056 77908 74710 -102334 -287332 -322683 -402915
14693d02915L3383R7685J46970O9951J24896P5032m0806j22830r7155O3441N6690
$$ -402915 -369532 -271847 -124877 -54926 69970 145002 104196 -18634 -115789 -52348 4342
14682D342p8942o1467j23965l7480K4519O5444N5033J92356o1971j83091N9882
$$ 4342 -74600 -136067 -260032 -297512 -272993 -207549 -152516 39840 -22131 -205222 -145340
14671a45340J13171K78590K7038j48081J29100l0997j19375M4296l7237j45322
$$ -145340 -32169 246421 273459 125378 254478 223481 104106 148402 111165 -34157
14661c4157k388J04904p6292m4816J0287P6685K421n3839J42874o2690k05869
$$ -34157 -36545 68359 -7933 -52749 -42462 34223 36644 -17195 125679 62989 -142880
14650a42880J27055J00155o7011j94753j90171M5357K23057J31874J92192P8184
$$ -142880 -15825 84330 17319 -177434 -367605 -322248 -99191 32683 224875 303059
14640C03059j2345J5221l848j36416m0632p8388J35810J87924o4297j24587p0928
$$ 303059 290714 305935 302087 165671 125039 46651 182461 370385 306088 181501 110573
14629A10573m8161j68113p2130J70050j11505L9019J92253O0966R0068Q4492J00641
$$ 110573 62412 -105701 -177831 -7781 -119286 -80267 111986 172952 263020 347512 448153
14618D48153j92774p5489j37736Q8538K23957k5299k58108j86594o7834Q6373
$$ 448153 255379 179890 42154 130692 354649 329350 71242 -115352 -183186 -96813
14608i6813K04638j45092j7454J36719J5275j8967p2062Q2798J10572L4805l71655
$$ -96813 107825 -37267 -54721 81998 97273 78306 6244 89042 199614 234419 -137236
14597a37236j46144J7288n2092Q5810k2998j5070M0410M0720Q770P8296P930L3895
$$ -137236 -283380 -266092 -318184 -232374 -255372 -270442 -230032 -189312 -180542 -102246 -94316 -60421
14585f0421L6298J07311m7093k5240J14926l5134j27434J06985K00695K1136O0688
$$ -60421 -24123 83188 36095 10855 125781 90647 -36787 70198 270893 292029 352717
14574C52717j36917r4424q0248N8628P0524m6252l6723L1226M3185l0620P2529
$$ 352717 215800 121376 41128 99756 170280 124028 87305 118531 161716 131096 203625
14563B03625M4153j04703m4783K31951o1060n5427j27195j7735l5966m0055P1581
$$ 203625 247778 143075 98292 330243 269183 213756 86561 68826 32860 -7195 64386
14552F4386J36881Q0581J1296J9870r3401l6714Q8321l1519k9061Q1005K06380
$$ 64386 201267 281848 293144 313014 219613 182899 271220 239701 210640 291645 498025
14541D98025L2967j75292q4668J50227J32009J73181J63965J39251J90337K47777
$$ 498025 530992 355700 271032 421259 553268 726449 890414 1029665 1220002 1467779
14531A467779K91845L77241R835r1575J3272l5048J11507Q7910p5229j81102r2605
$$ 1467779 1759624 2136865 2146700 2055125 2068397 2033349 2144856 2232766 2157537 1976435 1883830
14520A883830l29187k69303k76577k77290m684l7050o1952L4047m023m7482q5056
$$ 1883830 1554643 1285340 1008763 731473 726789 689739 627787 661834 657811 610329 525273
14509E25273j83812n7250M1998K08029K02j39117l6498j4585o8852r6013N6343
$$ 525273 341461 284211 326209 534238 534440 395323 358825 344240 275388 179375 235718
14498B35718J05514J8903r2639j68522J6480J1541o9736L3613p0068J25095O8563
$$ 235718 341232 360135 267496 98974 115454 126995 57259 90872 20804 145899 214462
14487B14462p7972k07322j0324L4628K7248k8316p8578L3959P5292J92499K782
$$ 214462 136490 -70832 -81156 -46528 -19280 -47596 -126174 -92215 -16923 175576 178358
14476A78358L5912l3509N2542J02707j4285m4592j10336l7231j08949j42261J69461
$$ 178358 214270 180761 233303 336010 321725 277133 166797 129566 20617 -121644 47817
14465D7817M6069o3194m007K1413j26228r7245P3401j4589k1204j24162j42647
$$ 47817 93886 30692 26685 48098 -78130 -175375 -101974 -116563 -137767 -261929 -404576
14454d04576n420J21571J64463J43052p0424q6611j04931K7607K49274Q7012j8243
$$ -404576 -409996 -288425 -123962 19090 -51334 -137945 -242876 -215269 34005 121017 102774
14443A02774o3349M0119k2452j70424J93010L0679n8451J57225q626o8945O970
$$ 102774 39425 79544 57092 -113332 79678 110357 51906 209131 200505 131560 138530
14432A38530j61680R1475J09338r1186L6604K253j51490k1900N4620K9226k9544
$$ 138530 -23150 68325 177663 86477 123081 125334 -26156 -48056 6564 35790 6246
14421F246M6614R3219k6649j72798p8858L8139J00595m484P0984O3343j12354
$$ 6246 52860 146079 119430 -53368 -132226 -94087 6508 2024 73008 136351 23997
14410B3997j47761k74872k0628R9691J62336P7831J68034M6698j67140O7940O782
$$ 23997 -123764 -398636 -419264 -319573 -157237 -79406 88628 135326 -31814 36126 42908
14399D2908j08730q43J74004J28138O4583l0195j45898l821O007p1542m9466K4596
$$ 42908 -65822 -66665 107339 235477 300060 269865 123967 120146 126153 54611 5145 29741
14387B9741n6191N9663J86685K1660j45443j27940L5619J04836M3913j6523P8781
$$ 29741 -26450 33213 219898 241558 96115 -31825 3794 108630 152543 136020 214801
14376B14801k3783m2736j05706j30777j59635j2302K1104p0827J19131J57572
$$ 214801 191018 148282 42576 -88201 -247836 -260138 -239034 -309861 -190730 -33158
14366c3158J5363m3575j790O0463K5829l0340j8407j40022q1074J67698J93032
$$ -33158 -17795 -61370 -63160 -2697 23132 -7208 -25615 -165637 -246711 -79013 114019
14355A14019q7144j45547k436M6239M2037J03229j06961j33358N4841K2665n610
$$ 114019 26875 -118672 -121108 -74869 -32832 70397 -36564 -169922 -115081 -92416 -98026
14344i8026k6158j18055O5103J08142K05805J59654j9599j01336k98556k6272
$$ -98026 -124184 -242239 -177136 -68994 136811 296465 276866 175530 -123026 -149298
14334a49298K1485j6518k5204J68976p2610m5753N7408O3080Q324n9484p9082
$$ -149298 -127813 -144331 -169535 -559 -73169 -118922 -61514 1566 9890 -49594 -128676
14323a28676m6475k5107L2470o7239j3583M1420P7958J36606J08446j00414R8421
$$ -128676 -175151 -200258 -167788 -235027 -248610 -207190 -129232 7374 115820 15406 113827
14312A13827O906n8545p088r2738n6709n7786l0376R1522p3939p8314J1278L4655
$$ 113827 120733 62188 55100 -37638 -94347 -152133 -182509 -90987 -164926 -243240 -231962 -197307
14300a97307P6506j05002k9919J08899O9843K7530o4564j08857j96774m051K39264
$$ -197307 -120801 -225803 -255722 -146823 -76980 -49450 -114014 -222871 -419645 -423696 -184432
14289a84432J45759J01358n7665J51416r70j09651p7171j41918j89293Q284k5176
$$ -184432 -38673 62685 5020 156436 155466 45815 -31356 -173274 -362567 -354283 -379459
14278c79459J4861J48211L57589o577j78780k27864r8144m444o4377J36520K79618
$$ -379459 -364598 -216387 141202 134625 -44155 -272019 -370163 -374607 -438984 -302464 -22846
14267b2846N5342l7867j65137j03882m1578J17156K02143O9822j94341n0351J05790
$$ -22846 32496 -5371 -170508 -274390 -315968 -198812 3331 73153 -121188 -171539 -65749
14256f5749J78994P8986j28102j65754R7052n6561j21466Q8791J58092N0781n4071
$$ -65749 113245 192231 64129 -101625 -4573 -61134 -182600 -93809 64283 115064 60993
14245F0993k158J09667J08972q9792k12363O2363Q7902q6946j85687k0426J17185
$$ 60993 58835 168502 277474 187682 -24681 37682 125584 38638 -147049 -167475 -50290
14234e0290m6590j09405K8806J11084M181k3639j21559r2586j25810J43777J96482
$$ -50290 -96880 -206285 -177479 -66395 -62214 -85853 -207412 -299998 -425808 -282031 -85549
14223h5549p4181J17191j0358L4785o8912r1390M7590J15417O5091J03567P637
$$ -85549 -159730 -42539 -52897 -18112 -87024 -178414 -130824 -15407 49684 153251 160888
14212A60888o2860m9492J40503M492l14248l40698l1366J51551O8660m4779P4499
$$ 160888 98028 48536 189039 193531 -120717 -461415 -492781 -341230 -272570 -317349 -242850
14201b42850N5332R0725j42783q7854j3841J18974R8642m9049M1337m4654P6705
$$ -242850 -187518 -96793 -239576 -327430 -341271 -222297 -123655 -172704 -131367 -176021 -99316
14190i9316o928l167J7183k4036J50401k4587j36090o0963q202J8629K46247J76849
$$ -99316 -106244 -109411 -92228 -116264 34137 9550 -126540 -187503 -195705 -177076 69171 246020
14178B46020j16683m8418j50422l0656j07587q3278K1560J0757R9480M2550K14001
$$ 246020 129337 80919 -69503 -100159 -207746 -291024 -269464 -258707 -159227 -116677 97324
14167I7324m0133j95746k496j6818N7162Q3033J53414j10883n4543o7156j3879
$$ 97324 57191 -138555 -141051 -157869 -100707 -17674 135740 24857 -29686 -96842 -110721
14156a10721K03342J02229j39677Q1243J15741N2874M490o5874j12086p597J8749
$$ -110721 92621 194850 55173 136416 252157 305031 309521 243647 131561 123964 142713
14145A42713o3943k7063j00843q6230M587J03102r6127j71897p937J22002K18704
$$ 142713 78770 51707 -49136 -135366 -130779 -27677 -123804 -295701 -303638 -181636 37068
14134C7068L85j24816k1612j56331k16060J12236L91972J14789m9075M8097J2602
$$ 37068 37453 -87363 -108975 -265306 -481366 -369130 22842 137631 88556 136653 149255
14123A49255j9490o5709k2407n2168N669q0582J05356r5629j8949J55627J50448
$$ 149255 129765 64056 41649 -10519 -4850 -85432 19924 -75705 -94654 60973 211421
14112B11421J071j27355l3491o5847l0673M6125j22451m6300P1626J29314m6253
$$ 211421 212492 85137 51646 -14201 -44874 1251 -121200 -167500 -95874 33440 -12813
14101a2813q3673j73202o606J05768J77772K580j56835O2306Q3890J62236q3264
$$ -12813 -96486 -269688 -276294 -170526 7246 9826 -147009 -84703 -813 161423 78159
14090G8159K0423J18584k1803j7433j8346k61193j9316M3516o3342j07957j9030
$$ 78159 98582 217166 195363 177930 159584 -101609 -120925 -77409 -140751 -248708 -267738
14079b67738J49787J07411j48577l1696J09781R6243j7956j40388j69353j06544
$$ -267738 -117951 -10540 -159117 -190813 -81032 15211 -2745 -143133 -312486 -419030
14069d19030J26109J0973M0539J00767N9517r695n171k3537O6570j8841J6941
$$ -419030 -292921 -281948 -241409 -140642 -81125 -90820 -95991 -119528 -52958 -71799 -54858
14058e4858K1529M079k2257o6895k3123n433k215O9830N4797J72888J84293l1782
$$ -54858 -33329 -29250 -51507 -118402 -141525 -146958 -149173 -79343 -24546 148342 332635 300853
14046C00853k46603j46728O8340J30948l2401n4192j43307p6489K5353P6674J40953
$$ 300853 54250 -92478 -24138 106810 74409 20217 -123090 -199579 -174226 -97552 43401
14035D3401R7987N5246j63507q6958q5815m7183k0299R7198k7492L3325J7931
$$ 43401 141388 196634 33127 -53831 -139646 -186829 -207128 -109930 -137422 -104097 -86166
14024h6166n3765N829n5357n6867J37131k3910L3481K2611k3062r9950j6740K3217
$$ -86166 -139931 -134102 -189459 -246326 -109195 -133105 -99624 -77013 -100075 -200025 -216765 -193548
14012a93548J55449N5920L1566p3066n9027j73919j6475J2369j6870k08539j26777
$$ -193548 -38099 17821 49387 -23679 -82706 -256625 -273100 -260731 -277601 -486140 -612917
14001f12917K13747J97214k6511m2536P4559J29801M8792o3872j9963J38567J72662
$$ -612917 -399170 -201956 -228467 -271003 -196444 -66643 -17851 -81723 -101686 36881 209543
13990B09543j03487k57006O1264N8866K0297l9603l0091j5996q2075J10957M2839
$$ 209543 106056 -150950 -89686 -30820 -10523 -50126 -80217 -96213 -178288 -67331 -24492
13979b4492j70115P2613N5532K61899j46504j25444J39562j4236o9383n1920q8512
$$ -24492 -194607 -121994 -66462 195437 48933 -76511 63051 48815 -20568 -72488 -161000
13968a61000l073O6099K69839K08789K0544q5370k09797k00406O5224K13820m6009
$$ -161000 -164073 -97974 171865 380654 401198 315828 106031 -94375 -29151 184669 138660
13957A38660k12710Q0812J62703M8535j84579j58689k894O229J09258M7377J20458
$$ 138660 -74050 6762 169465 218000 33421 -125268 -128162 -121933 -12675 34702 155160
13946A55160j8906j25990j5038L9746n1981L2322J60060k22928k01883r7511J48977
$$ 155160 136254 10264 -4774 34972 -17009 15313 175373 -47555 -249438 -346949 -197972
13935a97972P5349K2618M5958m5645P9753l2531n8523R7172r8404m7812o4274
$$ -197972 -122623 -100005 -54047 -99692 -19939 -52470 -110993 -13821 -112225 -160037 -224311
13924b24311j6653m5471J61595R1898P928j54156K8308K283j5596r6284M4158
$$ -224311 -240964 -286435 -124840 -32942 -25014 -179170 -150862 -148579 -164175 -260459 -216301
13913b16301Q1073l3853m6409k3868J97721p0515p0455O8344R5656P8872J05342
$$ -216301 -135228 -169081 -215490 -239358 -41637 -112152 -182607 -114263 -18607 60265 165607
13902A65607l7452o0945l736L424N5048k00297M9128L8163M2110R0649j52637
$$ 165607 128155 67210 63474 66898 121946 -78351 -29223 8940 51050 141699 -10938
13891a0938n9015J44973K4892j44185J3140P3943p237M1946R8327l4785k4368
$$ -10938 -69953 75020 99912 -44273 -31133 42810 35573 77519 175846 141061 116693
13880A16693k95537j80205k9704L1444J727j2189J25052J78064M9103q8641o8969
$$ 116693 -178844 -359049 -388753 -357309 -355582 -367771 -242719 -64655 -15552 -104193 -173162
13869a73162l8526l1914l2587J9991P4706J651o7797K36221K00480j05444j25964
$$ -173162 -211688 -243602 -276189 -256198 -181492 -179841 -247638 -11417 189063 83619 -42345
13858d2345J6716J87240N4753m3325l998K2085j09040j23321O764j34584k6144
$$ -42345 -25629 161611 216364 173039 169041 191126 82086 -41235 -34471 -169055 -195199
13847a95199Q1105J26070l1330j06266q9370R2616O2844j0150K8317P163p4487
$$ -195199 -114094 11976 -19354 -125620 -214990 -122374 -59530 -69680 -41363 -34200 -108687
13836a08687l1266M7082M9808k14514O1456K04432m6296o0119m1370N1660J69440
$$ -108687 -139953 -92871 -43063 -257577 -196121 8311 -37985 -98104 -139474 -87814 81626
13825H1626P2406l9787j5048R8593J720O73j53529j89485j69775J58084K36462
$$ 81626 154032 114245 99197 197790 199510 200183 46654 -142831 -312606 -154522 81940
13814H1940K857o506j21206p0564N6192r2001m919L1719O0342n0868o0023R5512
$$ 81940 84797 78291 -42915 -113479 -57287 -149288 -154207 -122488 -62146 -113014 -173037 -77525
13802g7525o8778K5110Q1095J31186Q2719Q05o3645j15013R5377L3551l1081o8244
$$ -77525 -146303 -121193 -40098 91088 173807 174612 110967 -4046 91331 124882 93801 25557
13790B5557q3075j32202m0909J08366J40540J0245k9324J11413R6638N7367l2582
$$ 25557 -57518 -189720 -230629 -122263 18277 28522 -802 110611 207249 264616 232034
13779B32034r5138n3431L4680J76718P0750j64604o9252j00265n9622M2888M4217
$$ 232034 136896 83465 118145 294863 365613 201009 131757 31492 -28130 14758 58975
13768E8975O0569k32564r0148K13929M9227k5659j0924L7816j79682P140K63177
$$ 58975 119544 -113020 -203168 10761 59988 34329 23405 61221 -118461 -111321 151856
13757A51856k3293j70351j84181N2525j6219J56425m3063o4906J49861J5011o9127
$$ 151856 128563 -41788 -225969 -173444 -189663 -33238 -76301 -141207 8654 23665 -45462
13746d5462L4580j18041j0486m6654j4120m9945L777n6063j7345J24808m9793
$$ -45462 -10882 -128923 -139409 -186063 -200183 -250128 -246351 -302414 -319759 -194951 -244744
13735b44744J24242J24608P80j64847j15378j67m6631Q0293r65O6516L24763K43901
$$ -244744 -120502 4106 4886 -159961 -275339 -275506 -322137 -241844 -242809 -176293 148470 392371
13723C92371j16623l62784M8999j1420l7816k9529q93M9214J55616J4419M8265
$$ 392371 275748 -87036 -38037 -49457 -87273 -116802 -117695 -68481 87135 101554 149819
13712A49819j47121k34407q7597k4601R5802Q5781J20402K5887j10530m4116r700
$$ 149819 2698 -231709 -319306 -343907 -248105 -162324 -41922 -16035 -126565 -170681 -180381
13701a80381N2772Q2158l1944l2462k6728J2985J03617J21476p448K7973m9522
$$ -180381 -127609 -45451 -77395 -109857 -136585 -123600 -19983 101493 94045 122018 72496
13690G2496j42155l5836m091O1411J39427m8005j60833K9462K37050r2406j15558
$$ 72496 -69659 -105495 -109586 -48175 91252 43247 -117586 -88124 148926 56520 -59038
13679e9038J2843L6712k592j93922j44585J73905K21484n8555K8454l7757n0872
$$ -59038 -46195 -9483 -12075 -205997 -350582 -176677 44807 -13748 14706 -23051 -73923
13668g3923m4263J29741J21888O5283o6750m5220r8338K2651J21761m9140q3110
$$ -73923 -118186 11555 133443 198726 131976 86756 -11582 11069 132830 83690 580
13657E80R0480j50072Q3237K07663q9378l1337J7675N5600N6724j56381j15674
$$ 580 91060 -59012 24225 231888 142510 111173 128848 184448 241172 84791 -30883
13646c0883o3773J45205K28479m0621j19492q5621j7384J62797R5765k76944j87314
$$ -30883 -94656 50549 279028 238407 118915 33294 15910 178707 274472 -2472 -189786
13635a89786L747J43967O1368k3218k0552J29694P7504N1215K006o2296Q6162
$$ -189786 -186039 -42072 19296 -3922 -24474 105220 182724 233939 235945 173649 259811
13624B59811k6381j17913j68015P6460J65n7371O7359N6165Q6202r2833O2419
$$ 259811 233430 115517 -52498 23962 24127 -33244 34115 90280 176482 83649 146068
13613A46068L03910K53176M4064l49020l77833L6707J10053O0531O1804o2437
$$ 146068 449978 703154 747218 398198 20365 57072 167125 227656 289460 227023
13603B27023j2273r880M9841o0716N4504j40024j99522L1753N0350P2688j11045
$$ 227023 214750 204870 254711 193995 248499 108475 -91047 -59294 -8944 63744 -47301
13592d7301o874P4966L8776J38786k35613j12764n2445l478J37556K04867N3048
$$ -47301 -54175 20791 59567 198353 -37260 -150024 -202469 -205947 -68391 136476 189524
13581A89524J16620k3953l52939o8053R4600O6745J28473j6450k01343q6360Q1314
$$ 189524 306144 282191 -70748 -138801 -44201 22544 151017 134567 -66776 -153136 -71822
13570g1822R2059q1765j69629p5065J90680J9504Q2117J17876l0004J97090m6595
$$ -71822 20237 -61528 -231157 -306222 -115542 -96038 -13921 103955 73951 271041 224446
13559B24446k8494k0597m6956k8969p8945P3923O1071k38634q9458P5981j1073
$$ 224446 195952 175355 128399 99430 20485 94408 155479 -83155 -172613 -96632 -107705
13548a07705J45701L1834J0138O9045N2378o2786R5643J11322r3223j26846j39277
$$ -107705 37996 69830 79968 149013 201391 138605 234248 345570 252347 125501 -13776
13537a3776m4945K58442K23108j09651j81057n1309Q9933k229j27044J27069J20695
$$ -13776 -58721 199721 422829 313178 132121 80812 170745 168516 41472 168541 289236
13526B89236p1543j68014J2998K7324Q146N0923N8619k93997j27434J87950P2376
$$ 289236 217693 49679 62677 90001 98147 149070 207689 -86308 -213742 -25792 46584
13515D6584K0010M1138P5439J9895J2614n0293Q1324l3804p9982j19741k82271
$$ 46584 66594 107732 183171 203066 215680 165387 246711 212907 132925 13184 -269087
13504b69087l5786J59125J82730j12341N1070J54118j06451j98640J36591K79155
$$ -269087 -304873 -145748 36982 -75359 -24289 129829 23378 -175262 -38671 240484
13494B40484J21538k23152l2819k3991K7238n9200M2960r3408j8898Q1152J14744
$$ 240484 362022 138870 106051 82060 109298 50098 93058 -350 -19248 61904 176648
13483A76648K2403O8065M0047j59623j75157j5562P2583J28286N0069j17940o4852
$$ 176648 199051 267116 307163 147540 -27617 -43179 29404 157690 207759 89819 24967
13472B4967O1454K5843m7294j5947j5222k27552n5318j9755M3272P582o9765l2114
$$ 24967 86421 112264 64970 49023 33801 -193751 -249069 -268824 -225552 -217970 -287735 -319849
13460c19849J63428J5682j0062l4134N0641J13401k6732J00864K5400J1283j16547
$$ -319849 -156421 -140739 -150801 -184935 -134294 -20893 -47625 53239 78639 89922 -26625
13449b6625k7813J63698J3718j86761M2261J21002J50898r0829k00439J32388
$$ -26625 -54438 109260 122978 -63783 -21522 99480 250378 159549 -40890 91498
13439I1498J37983p3021m0300o2658o7150j74474q700J209N2150n7931j37604
$$ 91498 229481 156460 116160 53502 -13648 -188122 -196822 -195613 -143463 -201394 -338998
13428c38998O8404J64836J99778J50187m0668k55818p0880J21691K9342O1323
$$ -338998 -270594 -105758 94020 244207 203539 -52279 -123159 -1468 27874 89197
13418H9197P0920k9437j57644l8163m0747J7578J9285j15092O3348J63788J08812
$$ 89197 160117 130680 -26964 -65127 -105874 -88296 -69011 -184103 -120755 43033 151845
13407A51845Q496j35095m3243l1993j92869j42112N0318J43272N9803p4717J25408
$$ 151845 160341 25246 -17997 -49990 -242859 -384971 -334653 -191381 -131578 -206295 -80887
13396h0887J97251J68289k58716o4669k5383J09809l834J7733k09395L6177K26664
$$ -80887 116364 284653 25937 -38732 -64115 45694 41860 59593 -149802 -113625 113039
13385A13039K4261j84562j05147q9310j4504J33453L0804n4495M7214k4916R5686
$$ 113039 137300 -47262 -152409 -241719 -256223 -122770 -91966 -146461 -99247 -124163 -28477
13374b8477J25000j25478j00616K14839J72433p7843n2406n8977M803p5236l8232
$$ -28477 96523 -28955 -129571 85268 257701 179858 127452 68475 73278 -1958 -40190
13363d0190M0556m064m1323q7950P0963l7269j05669m2066q4014J03979K53007
$$ -40190 366 -3698 -45021 -132971 -62008 -99277 -204946 -247012 -331026 -227047 25960
13352B5960M2062J2907j55020j77268J3225J16739n4287J46728K14933L0867j26932
$$ 25960 68022 80929 -74091 -251359 -238134 -121395 -175682 -28954 185979 216846 89914
13341H9914p306q6954o8068l5849N1876L2006N6701L0453j18014j8512J29679
$$ 89914 82608 -4346 -72414 -108263 -56387 -24381 32320 62773 -55241 -73753 55926
13330E5926j81790O6587N5724M5857P4105m0596L1345J25190k49301n4616O5004
$$ 55926 -125864 -59277 -3553 42304 116409 75813 107158 232348 -16953 -71569 -6565
13319f565J48921J62825o8334j89265k7026O0348k1105j185O1268J02519n2418
$$ -6565 142356 305181 236847 47582 20556 80904 59799 58614 119882 222401 169983
13308A69983j26297R916Q2845j19q4184q4339J13499O2171m2857J9880J04366
$$ 169983 43686 53602 136447 136328 52144 -32195 81304 143475 100618 120498 224864
13297B24864j05462j29422N55j00167j9733J49984J58626j46936k78884j42560
$$ 224864 119402 -10020 -9465 -109632 -129365 20619 179245 32309 -246575 -389135
13287c89135L6031J40173K5614J02385J12760m6828l4140P6077o3526M5685J02408
$$ -389135 -353104 -212931 -187317 -84932 27828 -19000 -53140 22937 -40589 5096 107504
13276A07504J9321J3434q0242k62450j1592L9887k7025J12662K4324j20231m876
$$ 107504 126825 140259 60017 -202433 -214025 -174138 -201163 -88501 -64177 -184408 -189284
13265a89284m6808J3589J85483n0457o3559M5341J23334l9776j22693j23596J79955
$$ -189284 -236092 -222503 -37020 -87477 -151036 -105695 17639 -22137 -144830 -268426 -88471
13254h8471N1979K30212J04096j43184j04238J6957j19500j38221K6610L2166
$$ -88471 -36492 193720 297816 154632 50394 67351 -52149 -190370 -163760 -131594
13244a31594m4707r9876p233J3465L8971M8827K28549J25424J8260k33059l8775
$$ -131594 -176301 -276177 -283410 -269945 -230974 -182147 46402 171826 190086 -42973 -81748
13233h1748R838L9192K3521n5p4425l2206P2068P1084J23271j2107l9517l7321
$$ -81748 -71910 -32718 -9197 -9252 -83677 -115883 -43815 27269 150540 138433 98916 61595
13221F1595j80042L0735J38786l3607j09807j0705K5574n503j34980J00699R3131
$$ 61595 -118447 -87712 51074 17467 -92340 -103045 -77471 -82974 -217954 -117255 -24124
13210b4124p3753n0535N8428J84876J93625M7909j32939j31761n1751N8909M261
$$ -24124 -97877 -148412 -89984 94892 288517 336426 203487 71726 19975 78884 83145
13199H3145j74836n369K5785J24856k857j38791J6165O72J13137R5234j72348
$$ 83145 -91691 -97060 -71275 53581 50724 -88067 -71902 -71230 41907 137141 -35207
13188c5207j81732m9752L6168K4277J39000O9068P327Q2793m0565n1845K5365
$$ -35207 -216939 -266691 -230523 -206246 -67246 1822 9149 91942 51377 -468 24897
13177B4897m4157k030r4431j28468J8366J02062J75938N0090o4753J0127J06144
$$ 24897 -19260 -21290 -115721 -244189 -225823 -123761 52177 102267 37514 47641 153785
13166A53785R3249j50314p5816J3152L0929k724m7862j6182J04510J00842r1106
$$ 153785 247034 96720 20904 34056 64985 62261 14399 -1783 102727 203569 112463
13155A12463O5513J18426j56644p1453l1470p3341j28040J5904P1272M7471n4327
$$ 112463 177976 296402 139758 68305 36835 -36506 -164546 -148642 -77370 -29899 -84226
13144h4226r2251J04398J9961j84299j80945l87R546J64265L86046J79658O3258
$$ -84226 -176477 -72079 -52118 -236417 -417362 -417749 -408203 -243938 142108 321766 385024
13133C85024l9716o7036r865L2416r4297k63810j9294K08954P8890j62333j44259
$$ 385024 345308 278272 268407 300823 206526 -57284 -76578 132376 211266 48933 -95326
13122i5326O7046j92949j91980J56874J90347M3743j01124Q5966J12677M6326
$$ -95326 -28280 -221229 -413209 -256335 -65988 -22245 -123369 -37403 75274 121600
13112A21600j56252j57617Q1929K99803L8730j80296r5772Q7381Q6990J25125
$$ 121600 -34652 -192269 -110340 189463 228193 47897 -47875 39506 126496 251621
13102B51621J19789Q1786m1856K8436P1521j05892k04164j94697M431l3072p2294
$$ 251621 371410 453196 411340 439776 511297 405405 201241 6544 10975 -22097 -94391
13091i4391o9121q0210J26735j05379q2324r257J64381J36050J21567O3414K8194
$$ -94391 -163512 -243722 -116987 -222366 -304690 -313947 -149566 -13516 108051 171465 199659
13080A99659K4047L0020q7759l05863j29755j2081N8061J37036M5971m0146R8596
$$ 199659 223706 253726 165967 -139896 -269651 -281732 -223671 -86635 -40664 -80810 17786
13069A7786J26497Q9013l4390j00836k47853q1295J12011J48396J89241J51601
$$ 17786 144283 233296 198906 98070 -149783 -231078 -119067 29329 218570 370171
13059C70171R5197k05546j40113p4069m7091o4995j48094p0656m2335J97541K73794
$$ 370171 465368 259822 119709 45640 -1451 -66446 -214540 -285196 -327531 -129990 143804
13048A43804M3559q0763m0840K9665n5069j67522M7114L5965j92096P5295J29870
$$ 143804 187363 106600 65760 95425 40356 -127166 -80052 -44087 -236183 -160888 -31018
13037c1018L0214K4715J0617k0000o7874j1096k9716Q8264J87841j12106q0107
$$ -31018 -804 23911 34528 14528 -53346 -64442 -94158 -5894 181947 69841 -10266
13026a0266Q867J3691j1387k4677j10530M7664k7053p0373N9175J09968M6741
$$ -10266 -1399 12292 905 -23772 -134302 -86638 -113691 -184064 -124889 -14921 31820
13015C1820J4892N6509j9391j03361K6932j6519q0295r2997J11444J40557j47781
$$ 31820 46712 103221 83830 -19531 7401 -9118 -89413 -182410 -70966 69591 -78190
13004g8190o0157l3930k6714J98707j9468K7128J63322l8267k38449j72278J21906
$$ -78190 -138347 -172277 -198991 -284 -19752 7376 170698 132431 -106018 -278296 -156390
12993a56390M29K1670M9105k15408m7740K34678J93727P3199j35140o200q0749
$$ -156390 -155961 -134291 -85186 -300594 -348334 -113656 80071 153270 18130 11930 -68819
12982f8819j25440L9039J19699j44265L4184J26640k9314r8501J68724J86454
$$ -68819 -194259 -155220 -35521 -179786 -145602 -18962 -48276 -146777 21947 208401
12972B08401J1166J5757N885k45318p1038R8256N1761L3998r2846o0192J93102
$$ 208401 219567 235324 241209 -4109 -75147 23109 74870 108868 16022 -44170 148932
12961A48932N2581k05122P8335Q7859R8518K0691j63850k88675j62024J0364J22984
$$ 148932 201513 -3609 74726 162585 261103 281794 117944 -170731 -332755 -322391 -199407
12950a99407r225o5620m4810j0232J42207n1480M8524J03525l8197j81448k7779
$$ -199407 -208632 -274252 -319062 -329294 -187087 -238567 -190043 -86518 -124715 -306163 -333942
12939c33942R0768L7159p0187M084L8321K577J28717q4967k5254J01526m4750
$$ -333942 -243174 -206015 -276202 -272118 -233797 -231220 -102503 -187470 -212724 -111198 -155948
12928a55948k1005p1980J17339k0684l5485O815J33404J02812P3046p9171j27049
$$ -155948 -176953 -248933 -131594 -152278 -187763 -180948 -47544 55268 128314 49143 -77906
12917g7906Q2310M0430K7195J1462l7230n5973K4913P0137l0114m0402J62625
$$ -77906 4404 44834 72029 83491 46261 -9712 15201 85338 55224 14822 177447
12906A77447L6623o9256o2677K7476j06188j45422M8788N5649j45492k7850R9266
$$ 177447 214070 144814 82137 109613 3425 -141997 -93209 -37560 -183052 -210902 -111636
12895a11636m3227M7172j6183J20950O7859j816L1247m3641l3541k583j06944
$$ -111636 -154863 -107691 -123874 -2924 64935 63119 94366 50725 17184 14601 -92343
12884i2343j97769j2814m3516j34038J54229J30487Q5353r798J34369p256M6842
$$ -92343 -290112 -302926 -346442 -480480 -326251 -195764 -110411 -120209 14160 6904 53746
12873E3746J48458k7988j68348j50060J2986O2973Q6392L6161q4225k3286Q5973
$$ 53746 202204 174216 5868 -144192 -131206 -68233 18159 54320 -29905 -53191 32782
12862C2782Q2068K834K0384l2366N4813k3367k22027j13079m7095K3333N5675
$$ 32782 114850 117684 138068 105702 160515 137148 -84879 -197958 -245053 -221720 -166045
12851a66045Q4182j2177j06043N7909L996N7958J10407J11463Q0817q7260k2336
$$ -166045 -81863 -94040 -200083 -142174 -138178 -80220 30187 141650 222467 135207 112871
12840A12871j30035j07980j06254j81692j3384M4756J82004J56104J11850R5945
$$ 112871 -17164 -125144 -231398 -413090 -426474 -381718 -199714 -43610 68240 164185
12830A64185L5461m0676K0145l9226j34796m096o8551N5133O0695L2916l071N0904
$$ 164185 199646 158970 179115 139889 5093 997 -67554 -12421 48274 81190 78119 129023
12818A29023j33024k68162q1318Q8104J03779K16924o525o359P8931N9122n3443
$$ 129023 -4001 -272163 -353481 -265377 -161598 55326 48801 42442 121373 180495 127052
12807A27052Q444j48543K3592P3670L7407J29197L7596j60220j07618j09069P4874
$$ 127052 135496 -13047 10545 84215 121622 250819 288415 128195 20577 -88492 -13618
12796a3618r2080n1870j7838Q4036r9807L20o4587m7472L8773L243L7717P3604
$$ -13618 -105698 -157568 -175406 -91370 -191177 -190857 -255444 -302916 -264143 -260900 -223183 -149579
12784a49579P3085Q6242m9764n8740J18030J4851J4560j67939p0664N2967O6220
$$ -149579 -76494 9748 -40016 -98756 19274 34125 48685 -119254 -189918 -136951 -70731
12773g0731R5955j02288j61815J59892Q1424J06007J266n1117N1886m8316j57719
$$ -70731 25224 -77064 -238879 -78987 2437 108444 109710 58593 110479 62163 -95556
12762i5556Q5003Q5279P2026j3452j40812j66887p6303K7969N0150k9782p4447
$$ -95556 -10553 74726 146752 133300 -7512 -174399 -250702 -222733 -172583 -202365 -276812
12751b76812J72492M7501P9961J03280P7596n8395L9747k44373j63392K1968N8549
$$ -276812 -104320 -56819 23142 126422 204018 145623 185370 -59003 -222395 -200427 -141878
12740a41878J62362Q9207k0487J8800p0985J83611j47589k15455Q5804J60086
$$ -141878 20484 109691 89204 108004 37019 220630 73041 -142414 -56610 103476
12730A03476K1417p0692n0757q4643M4623P2677N9040K743q2107j14120P1149
$$ 103476 124893 54201 3444 -81199 -36576 36101 95141 97884 15777 -98343 -27194
12719b7194j5881L063P0333r8967m9603K2279J3018q2082r8713J51183P5267L1088
$$ -27194 -43075 -40012 30321 -68646 -118249 -95970 -82952 -165034 -263747 -112564 -37297 -6209
12707f209o6130l0801K6734k208j00175k077M840N8525P138p3247j96406J66158
$$ -6209 -72339 -103140 -76406 -78614 -178789 -180866 -176026 -117501 -110363 -183610 -380016 -213858
12695b13858M5676O2024n6690P0581J40832n8008p1206j45033L107P3468p1356
$$ -213858 -168182 -106158 -162848 -92267 48565 -9443 -80649 -225682 -222575 -149107 -220463
12684b20463O916K64783M5884p7411m916k3878k6889n6180j55178M4702J24572
$$ -220463 -213547 51236 97120 19709 14793 -9085 -35974 -92154 -247332 -202630 -78058
12673g8058J02225j84632j63040r0483J05028J91647J5396R7584o6770m0508J23318
$$ -78058 24167 -160465 -323505 -413988 -308960 -117313 -101917 -4333 -71103 -111611 11707
12662A1707L7667O9934k3451j72857j5729J62172P5196j3438Q245j41888q8765
$$ 11707 49374 119308 95857 -77000 -92729 69443 144639 131201 139446 -2442 -91207
12651i1207l4252O4585p2902R1073O612o4980m9694l3751M5003o2194J9622P815
$$ -91207 -125459 -60874 -133776 -42703 -36091 -101071 -150765 -184516 -139513 -201707 -182085 -174270
12639a74270n6917j1483J15162R6595J57172L7011j04299J03015n7486j82745
$$ -174270 -231187 -242670 -127508 -30913 126259 163270 58971 161986 104500 -78245
12629g8245k09060M1760J02999l749K9208j20239j91132J08883J39028J31423
$$ -78245 -287305 -245545 -142546 -146295 -117087 -237326 -428458 -319575 -180547 -49124
12619d9124L2094K0859N9373o0396l936o2783r257J05035o522Q7854j5674k33343
$$ -49124 -17030 3829 63202 2806 -1130 -63913 -73170 31865 25343 113197 97523 -135820
12607a35820p255J7081J73329k9495J4699O4295J15450p1661j26727L8089p8081
$$ -135820 -143075 -125994 47335 17840 32539 96834 212284 140623 13896 51985 -26096
12596b6096J16130J3016R54j17322o1086J0181n1447R6046R3583J30706J11263
$$ -26096 90034 103050 104004 -13318 -74404 -64223 -115670 -19624 73959 204665 315928
12585C15928j06400j42333k56759j68878J32859J46046q5175k9806L6922J45025
$$ 315928 209528 67195 -189564 -358442 -225583 -79537 -164712 -194518 -157596 -12571
12575a2571M0849j92505k4926J40061o2141l26368n3360K08245K51076Q1989m9051
$$ -12571 28278 -164227 -189153 -49092 -111233 -437601 -490961 -282716 -31640 50349 1298
12564A298n309p6629j8715l3314J03577m724j42560p2777J40382m7491j54209
$$ 1298 -4011 -80640 -99355 -132669 -29092 -33816 -176376 -249153 -108771 -156262 -310471
12553c10471P9632J94900N4051j5205l2135K8519Q8744J4517M6913J17566q1177
$$ -310471 -230839 -35939 18112 2907 -29228 -709 88035 102552 149465 267031 185854
12542A85854r8549m5277l7480j26005M040Q4429R8663l1107k15619l0041r7599
$$ 185854 87305 42028 4548 -121457 -117417 -32988 65675 34568 -181051 -211092 -308691
12531c08691J5522R7188K4493r442L8788K20505L3403L9102l5752q8116k11667
$$ -308691 -293169 -195981 -171488 -180930 -142142 78363 111766 150868 115116 27000 -184667
12520a84667o4763O212J47164P5828q6739j492P9513M6136j35697k53232R0485
$$ -184667 -249430 -243218 -96054 -20226 -106965 -108457 -28944 17192 -118505 -371737 -281252
12509b81252P5001K27372O2678J38998J53637Q4725p4667j52325j88756k5J08519
$$ -281252 -206251 21121 83799 222797 376434 461159 386492 234167 45411 45386 153905
12498A53905j36569p4824j27001m2201J33697J64686J49731J0257j78377L8414
$$ 153905 17336 -57488 -184489 -226690 -92993 71693 221424 231681 53304 91718
12488I1718L2992j15997o1305j172r0011j06719L2264R4107L6773j7856l7409
$$ 91718 124710 8713 -52592 -53764 -143775 -250494 -218230 -124123 -87350 -105206 -142615
12477a42615J02246j77490k07828J55209J44368j58320q2516J26776K39412P1325
$$ -142615 -40369 -217859 -425687 -270478 -126110 -284430 -366946 -240170 -758 70567
12467G0567l2422o4648p7501O169L6164j7147P2277j42358o6116j58569J9936
$$ 70567 38145 -26503 -104004 -97835 -61671 -78818 -6541 -148899 -215015 -373584 -353648
12456c53648J34737J16806M2997N8227R3506l1807j64130l6952O5236M0386l4189
$$ -353648 -218911 -102105 -59108 -881 92625 60818 -103312 -140264 -75028 -34642 -68831
12445f8831k9320p3427p9913r2155K0693R6688J47187J70563n4441k02788J9132
$$ -68831 -98151 -171578 -251491 -343646 -322953 -226265 -79078 91485 37044 -165744 -146612
12434a46612j23633l03o6045K06067J43782j03916k3073n5153K9618J27587K093
$$ -146612 -270245 -270548 -336593 -130526 13256 -90660 -113733 -168886 -139268 -11681 -9588
12423i588j6073j15700J7557Q8435k6909j34090k0753o5682M3676J58467M1617
$$ -9588 -25661 -141361 -123804 -35369 -62278 -196368 -217121 -282803 -239127 -80660 -39043
12412c9043J38287R2520j29666j59685N3037J8178n8823L9632R4943j02180j09043
$$ -39043 99244 191764 62098 -97587 -44550 -26372 -85195 -45563 49380 -52800 -161843
12401a61843j85595K47394J37318q0250N2209P0742n811O110q2473K756j29957
$$ -161843 -347438 -100044 37274 -42976 9233 79975 74164 80274 -2199 557 -129400
12390a29400o6506Q9819J50159J3801P7880j77830j11521n134K7204R7400L2157
$$ -129400 -195906 -106087 44072 57873 135753 -42077 -153598 -158732 -131528 -34128 -1971
12379a971R2010n3543m1788R5336q5798L8702L7920P5306N3622k63749j6732j04837
$$ -1971 90039 36496 -5292 90044 4246 42948 80868 156174 209796 -53953 -70685 -175522
12367a75522N7092K4011p0437L0438J10725L76584R6624o4721j49343j58366j19232
$$ -175522 -118430 -94419 -164856 -134418 -23693 352891 449515 384794 235451 77085 -42147
12356d2147k31177l1095K10130J71471j17795o655J09442M1132J426Q975o5262
$$ -42147 -273324 -304419 -94289 77182 -40613 -47268 62174 103306 104732 113707 48445
12345D8445K1838m2160m2085J12191j3385J29877L1224J00738O4975j86595p5375
$$ 48445 70283 28123 -13962 98229 84844 214721 245945 346683 411658 225063 149688
12334A49688r2440j85824Q9072q2288j11505p5973n7222J29441N9593L7235j3924
$$ 149688 57248 -128576 -39504 -121792 -233297 -309270 -366492 -237051 -177458 -140223 -154147
12323a54147L7350J28528j09365J00504J33076j07468r9453o373k3281k5504M0144
$$ -154147 -116797 11731 -97634 2870 135946 28478 -70975 -77348 -100629 -126133 -85989
12312h5989l0712p1279q4893n1649J01007J99017J58554j3934p4252o3138p5683
$$ -85989 -116701 -187980 -272873 -324522 -223515 -24498 134056 120122 45870 -17268 -92951
12301i2951k6631P3531k370J24673Q6775k4622j22843k7984j3168q8507P7928
$$ -92951 -119582 -46051 -48421 76252 163027 138405 15562 -12422 -25590 -114097 -36169
12290c6169J02046M6438j46132j00853k01458o2343J84063M8729O0475Q526n2766
$$ -36169 65877 112315 -33817 -134670 -336128 -398471 -214408 -165679 -105204 -96678 -149444
12279a49444n1521j22422j4293k3033J05830k5356M8862J2807K537K93327J72806
$$ -149444 -200965 -323387 -337680 -360713 -254883 -280239 -231377 -218570 -216033 77294 250100
12268B50100j54901o8094k0261k15052Q0880o1554j28557P1935K4193J76974j4385
$$ 250100 95199 27105 6844 -208208 -127328 -188882 -317439 -245504 -221311 -44337 -58722
12257e8722Q628K3514j1925M203n1140J39299l9318J7317Q8924r6705j2777O1264
$$ -58722 -50094 -26580 -38505 -34302 -85442 53857 14539 31856 120780 24075 11298 72562
12245G2562j62142j21745R0354Q3210j2966P2335r53n4135l8712K02595K64959
$$ 72562 -89580 -211325 -120971 -37761 -50727 21608 20655 -33480 -72192 130403 395362
12234C95362j08417j75419r0131l3598l9385n359K00351J20083k16546p9160j0780
$$ 395362 286945 111526 21395 -12203 -51588 -56947 143404 263487 46941 -32219 -42999
12223d2999P3080k8927j35913L542L8701l9117j46010M6328J25727j7886M0448
$$ -42999 30081 1154 -134759 -131217 -92516 -131633 -277643 -231315 -105588 -123474 -83026
12212h3026q8924J11823J98213N4559o0774k0724j99707n5731N7172j2845K26778
$$ -83026 -171950 -60127 138086 192645 131871 111147 -88560 -144291 -87119 -99964 126814
12201A26814M0408o7554j683n1118j10000p9733K08606J8735j14144j06793L432
$$ 126814 167222 99668 97985 46867 -63133 -142866 65740 84475 -29669 -136462 -133030
12190a33030p9564J10684J52811m4510o8134P994O0717r271K0426J7506J6013
$$ -133030 -212594 -101910 50901 6391 -61743 -53749 6968 -2303 18123 35629 51642
12179E1642k8672K9861R800K1580J11694N6517j08346q6274j9209o8535p4529
$$ 51642 22970 52831 62631 84211 195905 252422 144076 57802 38593 -29942 -104471
12168a04471M6262K367J72351R3914q4960p2974M8498M4630p7022o5957P9223
$$ -104471 -58209 -55842 116509 210423 125463 52489 100987 145617 68595 2638 81861
12157H1861Q6630j1850J8716k0287j9460M9567k03515j82670J3408K21239J62299
$$ 81861 168491 156641 175357 155070 135610 185177 -18338 -201008 -187600 33639 195938
12146A95938P6668j7536k45337j79178j18717Q6682J23659K7923R171L0808J57000
$$ 195938 272606 255070 9733 -169445 -288162 -201480 -77821 -49898 -40727 -9919 147081
12135A47081l7121p6649l3530q2031P5090k4144R4935k6818o2143j63333j42474
$$ 147081 109960 33311 -219 -82250 -7160 -31304 63631 36813 -25330 -188663 -331137
12124c31137J32627P8429L0302N6335J61299M8324k02947o3308J69573k7505p4448
$$ -331137 -198510 -120081 -89779 -33444 127855 176179 -26768 -90076 79497 51992 -22456
12113b2456O1999m9659k531J49449K52058Q7913j55674p9829k59158j82254J3984
$$ -22456 39543 -10116 -12647 136802 388860 476773 321099 241270 -17888 -200142 -186158
12102a86158J18901P1280k0450K733P0246m1319j376j19528q6058p7985k2882
$$ -186158 -67257 4023 -16427 -13694 56552 15233 13857 -105671 -191729 -269714 -292596
12091b92596j16379L8930J75482J25377J33625m8503K659O822P1132P5086M23
$$ -292596 -408975 -370045 -194563 -69186 64439 15936 18595 25417 96549 171635 172058
12080A72058r5179J15976M761j70952j3395j5828M1253j69835j42781k0961J01507
$$ 172058 76879 192855 197616 26664 13269 -2559 38694 -131141 -273922 -294883 -193376
12069a93376O0950J94278J15968n1001j40219k46436j71485L2335K57042K32509
$$ -193376 -132426 61852 177820 126819 -13400 -259836 -431321 -398986 -141944 90565
12059I0565J65696n6109j44433p8831j43012J10782Q5761m1592o5949O1155K3533
$$ 90565 256261 200152 55719 -23112 -166124 -55342 30419 -11173 -77122 -15967 7566
12048G566j51503j06497j51416J78822J76746Q8848j4739o4236J45765k7921j79291
$$ 7566 -143937 -250434 -401850 -223028 -46282 42566 27827 -36409 109356 81435 -97856
12037i7856m5917M2525J48122K19459L3142j00730r9255J29107K13133l34345
$$ -97856 -143773 -101248 46874 266333 299475 198745 99490 228597 441730 107385
12027A07385j30178Q4499j01046L310r9719m7923L3681j01334Q1791J30945L4485
$$ 107385 -22793 61706 -39340 -36030 -135749 -183672 -149991 -251325 -169534 -38589 -4104
12016d104n7521r9964R6720m1698k2534N7480K46840Q1158k42939k40426j10619
$$ -4104 -61625 -161589 -64869 -106567 -129101 -71621 175219 256377 13438 -226988 -337607
12005c37607K23938J16014M4685j3745M7216k1500j42011k2169j08324M7344J40136
$$ -337607 -113669 2345 47030 33285 80501 59001 -83010 -105179 -213503 -166159 -26023
11994b6023j4108J3316j01490j00922J9346R0690p5123l0788L2700j85990k3050
$$ -26023 -40131 -26815 -128305 -229227 -209881 -119191 -194314 -225102 -192402 -378392 -401442
11983d01442J60177N7113J29578Q4152o2842m2754M7577m5647l0149Q6449J49901
$$ -401442 -241265 -184152 -54574 29578 -33264 -76018 -28441 -74088 -104237 -17788 132113
11972A32113M4303k20321q0541n9049J14364O4284r923P212j41394j43362M7220
$$ 132113 176416 -43905 -124446 -183495 -69131 -4847 -14770 -7558 -148952 -292314 -245094
11961b45094K1027m6534O1777J0988K4077q633L9872k8344l1300K6402J10928
$$ -245094 -224067 -270601 -208824 -197836 -173759 -182392 -142520 -170864 -202164 -175762 -64834
11950f4834K04897Q6872j39905r6135k521l0016o0327m0894K27224N2094r3008
$$ -64834 140063 226935 87030 -9105 -11626 -41642 -101969 -142863 84361 136455 43447
11939D3447N3493k6613j56154j1958k3841P9371n1047o8529N5394J35137k1392
$$ 43447 96940 70327 -85827 -97785 -121626 -42255 -93302 -161831 -106437 28700 7308
11928G308j83391j17191J32393j1900l1732j8298P4843J61617P6235J22480l8537
$$ 7308 -176083 -293274 -160881 -172781 -204513 -222811 -147968 13649 89884 212364 173827
11917A73827j52697j6596j02254j8740N4823J23071n7578l6491n5079J19191P3029
$$ 173827 21130 4534 -97720 -116460 -61637 61434 3856 -32635 -87714 31477 104506
11906A04506n7527k17105M840N1420J6849j1971k9211L3837R3223r795r8190j49512
$$ 104506 46979 -170126 -165286 -113866 -97017 -108988 -138199 -104362 -11139 -20934 -119124 -268636
11894b68636j743j11185j27996Q6083Q7190j43111J38429K20588J735j0695J28883
$$ -268636 -270379 -381564 -509560 -423477 -336287 -479398 -340969 -120381 -118646 -129341 -458
11883d58J7132p5530J22390P4959L1062J18522O1936j68791l2376n3444q4174
$$ -458 16674 -58856 63534 138493 169555 288077 350013 181222 148846 95402 11228
11872A1228j04990o9943O4584o2449J18851O1437K5595j3676j4505o8356j38708
$$ 11228 -93762 -163705 -99121 -161570 -42719 18718 44313 30637 16132 -52224 -190932
11861a90932J14407J14270k2431O6516k8019j23570K1331J2019O6374M630l6307
$$ -190932 -76525 37745 15314 81830 53811 -69759 -48428 -36409 29965 34595 -1712
11850a712J27342J38774j9049j80294j18766l2294P3033Q6023R9448q2272q5442
$$ -1712 125630 264404 245355 65061 -53705 -85999 -12966 73057 172505 90233 4791
11839D791j42103N8008M5740L118l445j00904j34175L539k8902O1710J98904O2741
$$ 4791 -137312 -79304 -33564 -30446 -33891 -134795 -268970 -265431 -294333 -232623 -33719 29022
11827B9022M5537N1841L0277r7073j54007R2514Q7756j9154m9290n7088p8948
$$ 29022 74559 126400 156677 59604 -94403 -1889 85867 66713 17423 -39665 -118613
11816a18613j8374M3275Q6568N9738j10887p3091j32317k5562K07041P2382k8136
$$ -118613 -136987 -93712 -7144 52594 -58293 -131384 -263701 -289263 -82222 -9840 -37976
11805c7976q3396J15604J12464j7102m4631R504j05714O8676q920L2047j5914
$$ -37976 -121372 -5768 106696 89594 44963 54467 -51247 17429 8509 40556 24642
11794B4642M6965j06071L1175J24155O2556K5380O3905j35003j75045k5148k6727
$$ 24642 71607 -34464 -3289 120866 183422 208802 272707 137704 -37341 -62489 -89216
11783h9216q5279j25577M2966J56582N1628Q5422P9933j62223r9798N2532R9939
$$ -89216 -174495 -300072 -257106 -100524 -48896 36526 116459 -45764 -145562 -93030 6909
11772F909K8084K9225p1212N5916J19887O1141j5275j71826l4203M6212L146L8695
$$ 6909 34993 64218 -6994 48922 168809 229950 214675 42849 8646 54858 58004 96699
11760I6699j007j4889L7990j09553j15146q2143q0970Q3671J3759K02897J23568
$$ 96699 95692 80803 118793 9240 -105906 -188049 -269019 -185348 -171589 31308 154876
11749A54876j28120p7523K1194l8272l939J4132J07910R5049n482k25620r9077
$$ 154876 26756 -50767 -29573 -67845 -71784 -57652 50258 145307 139825 -85795 -184872
11738a84872o1771K16451P7021K449j26902n8867J53368m1861k3233k845J6148
$$ -184872 -246643 -30192 46829 49278 -77624 -136491 16877 -24984 -48217 -51062 -34914
11727c4914Q3189J6190M8583P7923J6529j51938r0719K07695Q5493j92622j72327
$$ -34914 48275 64465 113048 190971 207500 55562 -35157 172538 258031 65409 -106918
11716a06918r3907J12309m479o7764m8713K2061K314M9822M2928N5384L1478J106
$$ -106918 -200825 -88516 -92995 -160759 -209472 -187411 -185097 -135275 -92347 -36963 -5485 -4379
11704d379K21906n695k47486j5395j18059m3379N0676R8948m0229J18768j31471
$$ -4379 217527 211832 -35654 -51049 -169108 -212487 -161811 -62863 -103092 15676 -115795
11693a15795k09779K7938J33809O2301M7674P5858q1355j22365J91147J30724
$$ -115795 -325574 -297636 -163827 -101526 -53852 22006 -59349 -181714 9433 140157
11683A40157m8538J48570l6513j02694l6891L4803m3834r1568O7756R927N3008
$$ 140157 91619 240189 203676 100982 64091 98894 55060 -36508 31248 41175 94183
11672I4183J87108L7576L5477q0342j39491J41816N3611j5127p1293k12406K536
$$ 94183 281291 318867 354344 274002 134511 276327 329938 314811 243518 31112 33648
11661C3648J02126J2601j29451j6697o8697J52037N0431M8821j47648j35837J4582
$$ 33648 135774 148375 18924 2227 -66470 85567 135998 184819 37171 -98666 -84084
11650h4084P2574O8501j23295j52455M0814P2714j12065J53456J22051J0346p5102
$$ -84084 -11510 56991 -66304 -218759 -177945 -105231 -217296 -63840 58211 68557 -6545
11639f545j4399p0749L7390j2553j40485J44370K4502n0964R3246O9983J45908
$$ -6545 -20944 -91693 -54303 -66856 -207341 -62971 -38469 -89433 3813 73796 219704
11628B19704p6364k3265Q3416K3975j63552j15085r4974O8624J90115K1571j38326
$$ 219704 143340 120075 203491 227466 63914 -51171 -146145 -77521 112594 134165 -4161
11617d161j31630l5703K19029J42785R930j13743j28539J9881J29218r7272l05270
$$ -4161 -135791 -171494 47535 190320 200250 86507 -42032 -22151 107067 9795 -295475
11606b95475J0781J17391o5983L6738J12497J6442k02369j08760Q4110L8984n9354
$$ -295475 -284694 -167303 -233286 -196548 -84051 -67609 -269978 -378738 -294628 -255644 -314998
11595c14998j80362M3362J83202K18945Q8637j95580j14953M2922J20893p990
$$ -314998 -495360 -451998 -268796 -49851 38786 -156794 -271747 -228825 -107932 -115922
11585a15922j28654J87204Q5481R7473J32751r3388r0430P8188J15157j8655J2587
$$ -115922 -244576 -57372 28109 125582 258333 164945 74515 152703 267860 249205 261792
11574B61792q2130j18770p5233j08259K5633l604j2136l0659N5309j17461L5752
$$ 261792 179662 60892 -14341 -122600 -96967 -100571 -112707 -143366 -88057 -205518 -169766
11563a69766K08565M8027j18093j91188L6921J23493j981M2473N5292Q8647J7370
$$ -169766 38799 86826 -31267 -222455 -185534 -62041 -64022 -21549 33743 122390 139760
11552A39760J3424o5117j79720j45571N9265P4978q5916m4325M3050R2018J68018
$$ 139760 153184 88067 -91653 -237224 -177959 -102981 -188897 -233222 -190172 -98154 69864
11541F9864R0597m3244O1298l2349j07129j58922Q1371P5904n938K2285J3575
$$ 69864 160461 117217 178515 146166 39037 -119885 -38514 37390 31452 53737 67312
11530F7312r6135n0106n4828n0649K6251R5426K86685M710k24891j65627n7206
$$ 67312 -28823 -78929 -133757 -184406 -158155 -62729 223956 228666 3775 -161852 -219058
11519b19058J60745O5070j9424K8712J3412j51568J98687J18855L1480l5295n9280
$$ -219058 -58313 6757 -12667 16045 29457 -122111 76576 195431 226911 191616 132336
11508A32336P7911j67376j04975o8727l5581O7300R5006J04601r779M484o6371
$$ 132336 210247 42871 -62104 -130831 -166412 -99112 -4106 100495 90716 95200 28829
11497B8829J12061o9957q7443P3307l2752R7370j6724k9420L1419O6800j0883
$$ 28829 140890 70933 -16510 56797 24045 121415 104691 75271 106690 173490 162607
11486A62607r4986o1645k5097o6938m9951O8290q062K3464J48797J23184N7152
$$ 162607 67621 5976 -19121 -86059 -136010 -67720 -75782 -52318 96479 219663 276815
11475B76815l9912j90678n5644r3411O4227K4355P072j02271j1613N4392J02084
$$ 276815 236903 46225 -9419 -102830 -38603 -14248 -7176 -109447 -121060 -66668 35416
11464C5416R8427K167j67062m4016M9841J01589P6100k17783l3280J9181L2596
$$ 35416 133843 136010 -31052 -75068 -25227 76362 152462 -65321 -98601 -79420 -46824
11453d6824j35752J06906J00245K0646j71993Q5498J89940j15626k26594K9038
$$ -46824 -182576 -75670 24575 45221 -126772 -41274 148666 33040 -193554 -164516
11443a64516L65574J50180o9879k88845k8290o092p9816r3517l3043j92354M2164
$$ -164516 201058 351238 281359 -7486 -35776 -41868 -121684 -215201 -248244 -440598 -398434
11432c98434J54052Q6019R0488J87230m9252k56037k9872K8649l0769p2233P0453
$$ -398434 -244382 -158363 -67875 119355 70103 -185934 -215806 -187157 -217926 -290159 -219706
11421b19706K7344O6195M8614J5904N1657L8657P1682M7296j09108r5340O3345
$$ -219706 -192362 -126167 -77553 -61649 -9992 28665 100347 147643 38535 -56805 6540
11410F540J10592J57811N8279j58808j71531J9889J12664O8761J64693n8857k57143
$$ 6540 117132 274943 333222 174414 2883 22772 135436 204197 368890 310033 52890
11399E2890k99259o6818J02347Q9968J28855J56608R1203k1341j90481m2218R8210
$$ 52890 -246369 -313187 -210840 -120872 7983 164591 255794 234453 43972 1754 99964
11388I9964j97768q4722K1360R1716r7297j47523j718M9267J29186k222M7365
$$ 99964 -97804 -182526 -161166 -69450 -166747 -314270 -315988 -266721 -137535 -139757 -92392
11377i2392J14449n992Q5875L7530p9445q2123o740J37584P3142q0388q5292k6747
$$ -92392 22057 16065 101940 139470 60025 -22098 -28838 108746 181888 101500 16208 -10539
11365a0539j79242R3730N1283j4034p1669l8205J30960L481j00673M2281K1770
$$ -10539 -189781 -96051 -44768 -58802 -130471 -168676 -37716 -34235 -134908 -92627 -70857
11354g0857q4428P1197P3036J33509M9981M9835r3261n7151l4587j73668q4543
$$ -70857 -155285 -84088 -11052 122457 172438 222273 129012 71861 37274 -136394 -220937
11343b20937L5963J87736o8592k1104Q6929j27808P3473j48861q6179K87566Q7050
$$ -220937 -184974 2762 -65830 -86934 -5 -127813 -54340 -203201 -289380 -1814 85236
11332H5236K5406j00542m6267j147K6311j11809k11247J18020J38596m8713N5608
$$ 85236 110642 10100 -36167 -37314 -11003 -122812 -334059 -216039 -77443 -126156 -70548
11321g0548J86230J15526n0654J5516k43989o2972J52931J89463n3267r3172M0937
$$ -70548 115682 231208 180554 196070 -47919 -110891 42040 231503 178236 85064 126001
11310A26001m1952j7392q2750P6548M7243l7097m5813k7514K21705r6736j76753
$$ 126001 84049 66657 -16093 60455 107698 70601 24788 -2726 218979 122243 -54510
11299e4510j30415j36581J64728n7276o8075P0256M1243J37962J6723j53598p2847
$$ -54510 -184925 -321506 -156778 -214054 -282129 -211873 -170630 -32668 -15945 -169543 -242390
11288b42390K62913K4561j20650J19794p4870o1386k3o5070L5796R7226o1142
$$ -242390 20523 45084 -75566 44228 -30642 -92028 -92051 -157121 -121325 -24099 -85241
11277h5241P873l3816r8348Q7499J37787R6490J55356o4942j22051j00626j32721
$$ -85241 -77368 -111184 -209532 -122033 15754 112244 267600 202658 80607 -20019 -152740
11266a52740m040J85091J62148l4685N651j23954k8408l2615J7643q9988J5645
$$ -152740 -156780 28311 190459 155774 161425 37471 9063 -23552 -5909 -95897 -80252
11255h0252m5563q5903K1584R2091M0896J21159L608j23210O4353O0882J8355
$$ -80252 -125815 -211718 -190134 -98043 -57147 64012 67620 -55590 8763 69645 88000
11244H8000J5913q6693k9407j1594m329j0517K8703N7745m503k1162l7780n9059
$$ 88000 103913 17220 -12187 -23781 -28110 -38627 -9924 47821 43318 22156 -15624 -74683
11232g4683j07163L2224q7408n0900J15647l2145J875P9362p9410J26029K28733
$$ -74683 -181846 -149622 -237030 -287930 -172283 -204428 -202553 -123191 -202601 -76572 152161
11221A52161K00046m5444m5625j60427k5752O2627P9334l5607n171n0020j18445
$$ 152161 352207 306763 261138 100711 74959 137586 216920 181313 176142 126122 7677
11210G677j37716J77068N1046J4601p8144n6724j8666j10387R5774o831J9998
$$ 7677 -130039 47029 98075 112676 34532 -22192 -40858 -151245 -55471 -62302 -42304
11199d2304N1523l7604J21858K1848J77140n3741l02267j02604Q3387P7875l785
$$ -42304 9219 -28385 93473 115321 292461 238720 -63547 -166151 -82764 -4889 -8674
11188h674o3022P7157q1452O3703P6450n2961j07365k7820k0985N7679K5955l1198
$$ -8674 -71696 5461 -75991 -12288 64162 11201 -96164 -123984 -144969 -87290 -61335 -92533
11176i2533j50868J15182M9660L7927J10015M1175n2534j99194o2008J94409J75545
$$ -92533 -243401 -128219 -78559 -40632 69383 110558 58024 -141170 -203178 -8769 166776
11165A66776R0029n3500k04161r808L6433j03221l1519J90084j67676j12910j44921
$$ 166776 256805 203305 -856 -10664 25769 -77452 -108971 81113 -86563 -199473 -344394
11154c44394Q2288K88633K7479j98697j03556K9346J40088q06L651J77425q7728
$$ -344394 -262106 26527 54006 -144691 -248247 -218901 -78813 -79619 -75968 101457 13729
11143A3729n108J75736Q3690k00289M3062J28912J3441j62701K3302N8766j28046
$$ 13729 8621 184357 268047 67758 110820 239732 253173 90472 113774 172540 44494
11132D4494M9262J9150o0518J96706K19355J2460l03219k24736j41881j5399Q5978
$$ 44494 93756 112906 52388 249094 468449 480909 177690 -47046 -188927 -204326 -118348
11121a18348J56613L0803R3074j136n6991j23553j79796j35618K6239N0892m806
$$ -118348 38265 69068 162142 161006 104015 -19538 -199334 -334952 -308713 -257821 -262627
11110b62627L0144N8475r3322J2425O1198J0898J5556n148P4526L3811J40084
$$ -262627 -232483 -174008 -267330 -254905 -193707 -182809 -167253 -172401 -97875 -64064 76020
11099G6020j48500k48391j24663J73115J33847p4975M0064J68989K35840k5241
$$ 76020 -72480 -320871 -445534 -272419 -138572 -213547 -173483 -4494 231346 206105
11089B06105l03872n3891Q6627j49032P7137J23976r0145j12429j19400J80384
$$ 206105 -97767 -151658 -65031 -214063 -136926 -12950 -103095 -215524 -334924 -154540
11079a54540O3205Q6829j78766m5159J69186K5728m0080J71711K30343j49134
$$ -154540 -91335 -4506 -183272 -228431 -59245 -33517 -73597 98114 328457 179323
11069A79323m3332q7290j9147j278r9234m5938N47o1278k2302O5275J35572P722
$$ 179323 135991 48701 29554 28276 -70958 -116896 -116349 -177627 -199929 -134654 918 8640
11057H640J85962k1314k8439n4721N7941O5487k70811j01414o209Q7028K09918
$$ 8640 194602 173288 144849 90128 148069 213556 -57255 -158669 -164878 -77850 132068
11046A32068J23506l4360M62J19737p1715J2543j71372j29054K4944J427J44798
$$ 132068 255574 221214 221676 341413 269698 282241 110869 -18185 6759 8186 152984
11035A52984K8303J4674L4892j87185q7213N9479L4571K8070L0585M3840j16745
$$ 152984 181287 195961 230853 43668 -43545 15934 50505 78575 109160 153000 36255
11024C6255j90103J09500J9422k6590j7032N0192m0722j20246j2055O6491J30215
$$ 36255 -153848 -44348 -24926 -51516 -68548 -18356 -59078 -179324 -191379 -124888 5327
11013E327J29042P7k3636j27880R347K17275M3989m7609j64611J35197R1947p7843
$$ 5327 134369 134446 110810 -17070 -7723 209552 253541 205932 41321 176518 268465 190622
11001A90622j30175l2558J72409N2776j72757j22906o6188O8471J01209J35909
$$ 190622 60447 27889 200298 253074 80317 -42589 -108777 -40306 60903 196812
10991A96812O4914L1899n7149r3158p023N6916K3822j58616j27170o0946p8410
$$ 196812 261726 293625 236476 143318 136295 193211 217033 58417 -68753 -129699 -208109
10980b08109R5024J40998J0580l8659m1244J4341n3487m9683L1866J18768j46048
$$ -208109 -113085 27913 38493 -166 -41410 -27069 -80556 -130239 -98373 20395 -125653
10969a25653M083J76962L1847l37941n505Q7851P1502l5449n573K39756R2019
$$ -125653 -121570 55392 87239 -250702 -256207 -168356 -96854 -132303 -137876 101880 193899
10958A93899l9397j64241r9180L1450N3522K5099q8368j23065j1136l426O5027
$$ 193899 154502 -9739 -108919 -77469 -23947 1152 -87216 -210281 -221417 -224843 -159816
10947a59816J19392J46840m1041L7940j86217N2350J01900J88543m224j16267
$$ -159816 -40424 106416 65375 103315 -82902 -30552 71348 259891 255667 139400
10937A39400j06415l2138Q2715j47413j53108P5806j7375Q0269k6681j94483n668
$$ 139400 32985 847 83562 -63851 -216959 -141153 -158528 -78259 -104940 -299423 -305091
10926c05091M1075J08292K09511O827R6327j71890n4864J0741k6670J0761R1789
$$ -305091 -264016 -155724 53787 60614 156941 -14949 -69813 -59072 -85742 -74981 16808
10915A6808n8354q6724j17543O397J21486J21075J12880m9131P0058j18020R334
$$ 16808 -41546 -128270 -245813 -239416 -117930 3145 116025 66894 136952 18932 28266
10904B8266l5382R3286L7656P0403j01996q9305l3707K3903L229j5205l0112m4318
$$ 28266 -7116 86170 123826 194229 92233 2928 -30779 -6876 -3647 -18852 -48964 -93282
10892i3282J71829Q4477P8407n9228j58186k7709p596k8658k3468j58823J4609
$$ -93282 78547 163024 241431 182203 24017 -3692 -11288 -39946 -63414 -222237 -207628
10881b07628P8909o819Q8626J00209L745k45393J8133N8595j64692P8810Q2886
$$ -207628 -128719 -135538 -46912 53297 57042 -188351 -170218 -111623 -276315 -197505 -114619
10870a14619P9156p0934o9435L2419J68021p835J4755Q7754j2884M2616L2120
$$ -114619 -35463 -106397 -175832 -143413 24608 16773 31528 119282 106398 149014 181134
10859A81134p4825p8040n1876n0213r0604j8111R6817L1706J63621j04751j59832
$$ 181134 106309 28269 -23607 -73820 -164424 -182535 -85718 -54012 109609 4858 -154974
10848a54974Q0142Q9528l0855k5893M7965j4578j6413k08465j5391J65716J34879
$$ -154974 -74832 14696 -16159 -42052 5913 -8665 -25078 -233543 -248934 -83218 51661
10837E1661k2241l0042R7906r6545j33350j01013K1741j5840j55503J72692J58409
$$ 51661 29420 -622 97284 739 -132611 -233624 -211883 -227723 -383226 -210534 -52125
10826e2125M7480q778J05123l9243j77039K15771J31513o6289j76902j88654L2211
$$ -52125 -4645 -13423 91700 52457 -124582 91189 222702 156413 -20489 -209143 -176932
10815a76932P5774p3870k873r425J25684P3495o936r2658J15373O4803k9863o6926
$$ -176932 -101158 -175028 -177901 -187326 -61642 11853 4917 -87741 27632 92435 62572 -4354
10803d354P5416p5014O2241j68607j17577P4379L3551J81067Q5065o4548L7079
$$ -4354 71062 -3952 58289 -110318 -227895 -153516 -119965 61102 146167 81619 118698
10792A18698r951k44248l9457j1913O4839K79968m6202q0464p5954l8963j45817
$$ 118698 108747 -135501 -174958 -186871 -122032 157936 111734 31270 -44684 -83647 -229464
10781b29464J42571J76111p9678N6914p4095n2433j31887J28801J42907r613n422
$$ -229464 -86893 89218 9540 66454 -7641 -60074 -191961 -63160 79747 70134 64712
10770F4712l7901l2140R7581J31935J04753J45623N896k19904k91302j82294Q5682
$$ 64712 26811 -5329 92252 224187 328940 474563 480459 260555 -30747 -213041 -127359
10759a27359J29442j0135J22985Q0925j34462o7646O6883Q6763j0127k4086Q3064
$$ -127359 2083 -8052 114933 195858 61396 -6250 60633 147396 137269 113183 196247
10748A96247j0760l2025J77N569J22631o2046j02281n0990p3471k05661r7014
$$ 196247 185487 153462 153639 159208 281839 219793 117512 66522 -6949 -212610 -309624
10737c09624J20138P3360O9231K01916j0918L4069r2083k87146K9923J27614J250
$$ -309624 -189486 -116126 -46895 155021 144103 178172 86089 -201057 -171134 -43520 -42270
10726d2270K21161J5601J74955l2798k03657j58940o58p5732j5804p6130q2628
$$ -42270 178891 194492 369447 336649 132992 -25948 -26606 -102338 -118142 -194272 -276900
10715b76900J29811J16592J6605o636m646K4587m0783N347j18117J1412N1792
$$ -276900 -147089 -30497 -13892 -20528 -25174 -587 -41370 -36023 -154140 -142728 -90936
10704i0936K5416J27461J39919L0540r2297j13540p6508N1313L9949m9844r4053
$$ -90936 -65520 61941 201860 232400 140103 26563 -49945 1368 41317 -8527 -102580
10693a02580l3740J92087K89354M7238j28077j80019l2421m9332m2074O4137m8967
$$ -102580 -136320 55767 345121 392359 264282 84263 51842 2510 -39564 24573 -24394
10682b4394q3159J9732M9852M7534M3567R1261q7361r2366m946j1883p7405Q8289
$$ -24394 -107553 -87821 -37969 9565 53132 144393 57032 -35334 -40280 -52163 -129568 -41279
10670d1279J82425j64006K1049J72153O406j05177p2506j64314j05816J61759
$$ -41279 141146 -22860 -1811 170342 176748 71571 -935 -165249 -271065 -109306
10660a09306K161n0567k9929n640J23691J77635j3450j24877O3464j18396k82636
$$ -109306 -107145 -157712 -187641 -193281 -69590 108045 94595 -30282 33182 -85214 -367850
10649c67850r0259K08841J08103L3988m4568j04008J81487P4633J11830r6598
$$ -367850 -458109 -249268 -141165 -107177 -151745 -255753 -74266 367 112197 15599
10639A5599J43884J5666o5736Q0388j41681k0860J9764r1270j05222l2914N1730
$$ 15599 159483 175149 109413 189801 48120 27260 47024 -44246 -149468 -182382 -130652
10628a30652L66L7322M463p120l4954J6824o7833r1581k5745P7463k212J1694
$$ -130652 -130286 -92964 -88501 -95621 -130575 -113751 -181584 -273165 -298910 -221447 -223659 -211965
10616b11965J26186j9241N3609R3152Q5601K759k3813K0659j130J83283P6146
$$ -211965 -85779 -105020 -51411 41741 127342 130101 106288 126947 125817 309100 385246
10605C85246m1281k732R9646k05404p3725m9808j12002j507O9368Q0271j23592
$$ 385246 343965 341233 440879 235475 161750 111942 -60 -1567 67801 148072 24480
10594B4480m2077j31257L5917p0111J7040J26446j06705m3246J00250K866N6338
$$ 24480 -17597 -148854 -112937 -183048 -166008 -39562 -146267 -189513 -89263 -86397 -30059
10583c0059j8813p013q8347m3037J43156J6325l2585O5813R013Q8585K1504k2774
$$ -30059 -48872 -55885 -144232 -187269 -44113 -27788 -60373 5440 14453 103038 124542 101768
10571A01768q7602j84297k7836P3218J45142l4351J9870J64025P0756k01976j30290
$$ 101768 14166 -170131 -197967 -124749 20393 -13958 5912 169937 240693 38717 -91573
10560i1573R3950l952j7367p7815j2469J10425P2729p0807p862P2165J52025p4497
$$ -91573 2377 -1575 -18942 -96757 -109226 1199 73928 3121 -4741 67424 219449 144952
10548A44952j64033n6254N1033j0506m2612j87553M5432L1075j18035j53498J39730
$$ 144952 -19081 -75335 -24302 -34808 -77420 -264973 -219541 -188466 -306501 -459999 -320269
10537c20269J76099N2577j21646J38857J66354N026N5208r2115j21610m0123M8157
$$ -320269 -144170 -91593 -213239 -74382 91972 96998 152206 60091 -61519 -101642 -53485
10526e3485J21705j24828j52481M9548J45089P7269M3802j8926m4445J2708p2965
$$ -53485 68220 -56608 -209089 -159541 -14452 62817 106619 87693 43248 55956 -17009
10515a7009r1528M434j020K65389R9123o8500p4467r0875j0518j14161L6899m4197
$$ -17009 -108537 -104103 -105123 160266 259389 190889 116422 25547 15029 -99132 -62233 -106430
10503a06430J88772K07181J12695m8915k45492k33576m129P5306Q5018J65011
$$ -106430 82342 289523 402218 353303 107811 -125765 -129894 -54588 30430 195441
10493A95441l996O724k12299j32015R0063J62596o7166j52623J37293j7761K6292
$$ 195441 191445 198169 -14130 -146145 -56082 106514 39348 -113275 24018 6257 32549
10482C2549N7257J14206j23553k35650O6394J38093J60164J8836O9336k08934
$$ 32549 89806 204012 80459 -155191 -88797 49296 209460 228296 297632 88698
10472H8698j79679j27461L1363K12113j2832J14884J4817J652n3862j78726l7300
$$ 88698 -90981 -218442 -187079 25034 12202 127086 141903 143555 89693 -89033 -126333
10461a26333l6206N04Q5058Q9320k7880n6625K98O5324q2960l5121J03791J87679
$$ -126333 -162539 -162035 -76977 12343 -15537 -72162 -71864 -6540 -89500 -124621 -20830 166849
10449A66849J5322M2507K3864J12360j7848Q7031l11664l91704K9046O2873O628
$$ 166849 182171 224678 248542 360902 343054 430085 118421 -273283 -244237 -181364 -174736
10438a74736P5663k8098K6290l8550J09660K21547M4643k68122k53310n366P3559
$$ -174736 -99073 -127171 -100881 -139431 -29771 191776 236419 -31703 -285013 -290379 -216820
10427b16820J01862P0948m0808j37665K0256J24182R20r3250m0321O7591m2695
$$ -216820 -114958 -44010 -84818 -222483 -202227 -78045 -77125 -170375 -210696 -143105 -185800
10416a85800R4894p8986O258J0380p4302J03824O6787K504Q0350o5934m8879j3458
$$ -185800 -90906 -169892 -163634 -153254 -227556 -123732 -56945 -54441 25909 -40025 -88904 -102362
10404a02362P3546n2024q4451k392o9039q1017N5843L7845R2340O2254k2424O1904
$$ -102362 -28816 -80840 -165291 -167683 -236722 -317739 -261896 -224051 -131711 -69457 -91881 -29977
10392b9977p2934j06526j7812n4772q1947J269J78710R2336o5651p0643J16754
$$ -29977 -102911 -209437 -227249 -282021 -363968 -362699 -183989 -91653 -157304 -227947 -111193
10381a11193O2179J02330M0627J2744o2538k03272K8493R2480R5714m4972O6538
$$ -111193 -49014 53316 93943 106687 44149 -159123 -130630 -38150 57564 12592 79130
10370G9130k5234L3405O2107p0836j63587j93603l5449O2099J77368M8219O331
$$ 79130 53896 87301 149408 78572 -85015 -278618 -314067 -251968 -74600 -26381 -20050
10359b0050o5330L0808J27207J11746o0565r7328j45004L6874Q6986J69484k27772
$$ -20050 -85380 -54572 72635 184381 123816 26488 -118516 -81642 5344 174828 -52944
10348e2944k13684J70951J87290M3357j75086J05975J33540J07382j1998j89084
$$ -52944 -266628 -95677 91613 134970 -40116 65859 199399 306781 294783 105699
10338A05699j2323m2746j12703R2839K91530L6602Q382j07339k42038R0678J34228
$$ 105699 93376 50630 -62073 30766 322296 358898 367280 259941 17903 108581 242809
10327B42809p0206j73564p712N4944Q8335j82719o8725J50737P2169M1080r1298
$$ 242809 172603 -961 -8673 46271 134606 -48113 -116838 33899 106068 147148 55850
10316E5850p9205N941k8720R0828L2404k0318n5600j10032Q506r383M5473r7038
$$ 55850 -23355 -17414 -46134 44694 77098 56780 1180 -108852 -100346 -109729 -64256 -161294
10304a61294R617J6367M5340J02314Q7120P1718N594O5144R467K19543n6795j38468
$$ -161294 -151677 -135310 -89970 12344 99464 171182 176776 241920 251387 470930 414135 275667
10292B75667k10228m8992m3415K34029j2739K9987k81148r9735J0848J52427P9012
$$ 275667 65439 16447 -26968 207061 194322 224309 -56839 -156574 -145726 6701 85713
10281H5713K1812R1648j24652o1487K2759J4034m7952L0341n5018l0960Q9450
$$ 85713 107525 199173 74521 13034 35793 49827 1875 32216 -22802 -53762 35688
10270C5688p9894L8397K18420J7845j06701j16083k0714K2512R2819J27177K9915
$$ 35688 -44206 -5809 212611 230456 123755 7672 -13042 9470 102289 229466 259381
10259B59381j70135j6543J21994M4181k3232k66793P687O668R3897n7066j49102
$$ 259381 89246 72703 194697 238878 215646 -51147 -43460 -36792 57105 39 -149063
10248a49063j04666Q7248R1538J11764n0781N746Q0854p5516q5133n811j0669
$$ -149063 -253729 -166481 -74943 36821 -13960 -8214 72640 -2876 -88009 -93820 -104489
10237a04489L2980K14762k8987j23666p5559L8476r6264p0096O8830J54787O8686
$$ -104489 -71509 143253 114266 -9400 -84959 -46483 -142747 -212843 -144013 10774 79460
10226G9460P9023J45280q0096n3008q6074r7567r1104n9350j5829J71813M3885
$$ 79460 158483 303763 223667 170659 84585 -12982 -104086 -163436 -179265 -7452 36433
10215C6433j8396j24420L6387N3640r6418J2702N3510J41454J7191M9928q9887
$$ 36433 18037 -106383 -69996 -16356 -112774 -100072 -46562 94892 112083 162011 72124
10204G2124O5696J86901l4322j63217r6589R906l159p0686J39247l2512o4294
$$ 72124 137820 324721 290399 127182 30593 40499 37340 -33346 105901 73389 9095
10193I095l360L1533j6857m3882L8535J21037m3737k06765l5091Q4925P8117M4319
$$ 9095 5735 37268 20411 -23471 15064 136101 92364 -114401 -149492 -64567 13550 57869
10181E7869J468K14726Q173K7521n4685M0638n7592L599j1084n9815m0180J02834
$$ 57869 59337 274063 282236 309757 255072 295710 238118 241717 230633 170818 130638 233472
10169B33472j02426Q9240J41227j00273j63894K3132R8614q8908j45900N6140
$$ 233472 131046 220286 361513 261240 97346 120478 219092 130184 -15716 40424
10159D0424M2266j38276j42032O5908K01911J66118l8577k25237j50951R2423
$$ 40424 82690 -55586 -197618 -131710 70201 236319 197742 -27495 -178446 -86023
10149h6023p1227l604l527l4638O0294K23037O9530k2501Q8072j77353j635K1744
$$ -86023 -157250 -160854 -164381 -199019 -138725 84312 153842 131341 219413 42060 40425 62169
10137F2169L0760n1240r4594O5589J96800l6j41152j2407J68104L926j6432J9794
$$ 62169 92929 41689 -52905 12684 209484 209448 68296 55889 223993 227919 211487 231281
10125B31281M7506q4054p4605o9009n0593k0329P4245j6935j20453j11560J17580
$$ 231281 278787 194733 120128 51119 526 -19803 54442 37507 -82946 -194506 -76926
10114g6926P2676j7574M854m4374j6191j9506q8523M3971J52387R8390Q4132n8868
$$ -76926 -4250 -21824 -16970 -61344 -77535 -97041 -185564 -141593 10794 109184 193316 134448
10102A34448o2926j80208L3208K39127j08164p6887m52J85819J14678n6974r0364
$$ 134448 71522 -108686 -75478 163649 55485 -21402 -21854 163965 278643 221669 131305
10091A31305r0256O7397m9340r2553j28630P0123K39264o6910j31132L4007q7180
$$ 131305 41049 108446 59106 -33447 -162077 -91954 147310 80400 -50732 -16725 -103905
10080a03905k9029J7541J8865q356q8507r8889k7667J18347L7655J21729K79353
$$ -103905 -132934 -115393 -96528 -104884 -193391 -292280 -319947 -201600 -163945 -42216 237137
10069B37137O5003j02549n1616m0366o6818k13102k75123Q4016K71172P8658M5441
$$ 237137 302140 199591 147975 107609 40791 -172311 -447434 -363418 -92246 -13588 31853
10058C1853L4096R2577L8158L4719k4422J4690l3604j68058q9801L4326L4533
$$ 31853 65949 158526 196684 231403 206981 221671 188067 20009 -69792 -35466 -933
10047i33L0932P0330l926j28952O5218J5688o8902L4150p9620n4821O9699j1465
$$ -933 29999 100329 96403 -32549 32669 48357 -20545 13605 -66015 -120836 -51137 -62602
10035f2602m5779j1863O8365N0935j2621P878P7086J60873R6724j25231p4559
$$ -62602 -108381 -120244 -51879 -944 -13565 -5687 71399 232272 328996 203765 129206
10024A29206j56519j61782K6829J01805J14141k6268m3597M8185R4877J85833
$$ 129206 -27313 -189095 -162266 -60461 53680 27412 -16185 32000 126877 312710
10014C12710J10712o4537n4372o5507N5836o2664j19612j09688K4807j3989N7800
$$ 312710 423422 358885 304513 239006 294842 232178 112566 2878 27685 13696 71496
10003G1496O2068q9527j53126K9566k2886J11757K26292o6923r0426N5410R435
$$ 71496 133564 44037 -109089 -79523 -102409 9348 235640 168717 78291 133701 143136
9992A43136L7566j78635k28675j79436R1029O0422K20370J93837J11175k5932
$$ 143136 180702 2067 -226608 -406044 -315015 -254593 -34223 159614 270789 244857
9982B44857j41434m3666j45252j61140j9332L0668J09611m2279O7924J5065L3416
$$ 244857 103423 59757 -85495 -246635 -265967 -235299 -125688 -167967 -100043 -84978 -51562
9971e1562j07874R4405M4810J50710J27484j46684j00841M6476N7485K2394m6794
$$ -51562 -159436 -65031 -20221 130489 257973 111289 10448 56924 114409 136803 90009
9960I0009N8844l5517q867J29339J6166n2066K0468k80456l3208J88151J09666
$$ 90009 148853 113336 104469 233808 249974 197908 218376 -62080 -95288 92863 202529
9949B02529M0576o5219O4472m3057j95333l9257J6156r0249j47688j0106J38829
$$ 202529 243105 177886 242358 199301 3968 -35289 -19133 -109382 -257070 -267176 -128347
9938a28347L3232Q9873J2443j5850o7103j9493J26510L4678n2325J05616o2285
$$ -128347 -95115 -5242 7201 -8649 -75752 -95245 31265 65943 13618 119234 56949
9927E6949j3998m3578j37144R6503P5359j26228K5844O1023Q5574J8675o1821
$$ 56949 42951 -627 -137771 -41268 34091 -92137 -66293 -5270 80304 98979 37158
9916C7158l0122M8029J6846k653J40850q8908j4981J29244n3093j44986R0458
$$ 37158 7036 55065 71911 69258 210108 121200 106219 235463 182370 37384 127842
9905A27842J18490Q4964K5025r8918k6829o2533l7206j73840j15610m5512o0362
$$ 127842 246332 331296 356321 257403 230574 168041 130835 -43005 -158615 -204127 -264489
9894b64489P0220J97036L9135R9378K2729l6063L824j6874l1150L3383k5574J1629
$$ -264489 -194269 2767 41902 141280 164009 127946 131770 114896 83746 117129 91555 103184
9882A03184N444j13230M9481j7429j03284j10897j25006o4576Q9244J56628J51209
$$ 103184 108628 -4602 44879 27450 -75834 -186731 -311737 -376313 -287069 -130441 20768
9871B0768L4286k1184j439J5208n3532L9950K4303j07344j46335N0550J9320J73088
$$ 20768 55054 33870 32431 47639 -5893 34057 58360 -48984 -195319 -144769 -125449 47639
9859D7639J46028j5714O0549p0330k29152Q5429R7464r29l6566L504K0426Q6019
$$ 47639 193667 177953 238502 168172 -60980 24449 121913 120984 84418 87922 108348 194367
9847A94367J66810m3283j49099J9334N1729J31386J25996M6175n4425k2669J61098
$$ 194367 361177 317894 168795 188129 239858 371244 497240 543415 488990 466321 627419
9836F27419m9191k93655j86035P4275K42388o3151k21663K1808o5720P6245O4245
$$ 627419 578228 284573 98538 172813 415201 352050 130387 152195 86475 162720 226965
9825B26965J0294J8265J07348n7255r0645p4514J57270M1268l0240J5416N911
$$ 226965 237259 255524 362872 305617 214972 140458 297728 338996 308756 324172 330083
9814C30083n2240q0860l6539j8313l5756j1605o1348J06624L7867j049j26231
$$ 330083 277843 196983 160444 142131 106375 94770 33422 140046 177913 176864 50633
9803E0633j77206R1629Q8972k9781J69013K7276O363j48759j04554K0135m6860
$$ 50633 -126573 -34944 54028 24247 193260 220536 226899 78140 -26414 -6279 -53139
9792e3139O6707K7439k573M0695l8156j48818p9992O4103K6873J28253J6011M4425
$$ -53139 13568 41007 38434 79129 40973 -107845 -187837 -123734 -96861 31392 47403 91828
9780I1828R1225M6248N6282o7558o0951K5267J58248p6516k77219o0961M5372
$$ 91828 183053 229301 285583 218025 157074 182341 340589 264073 -13146 -74107 -28735
9769b8735O5155o9962m2403J55729R6127j8931k29779J498m2036L6483Q8510j15302
$$ -28735 36420 -33542 -75945 79784 175911 156980 -72799 -71301 -113337 -76854 11656 -103646
9757a03646Q4127J42687j4257l3076k00983l9103l1701M0612Q8826j31520o7222
$$ -103646 -19519 123168 108911 75835 -125148 -164251 -195952 -155340 -66514 -198034 -265256
9746b65256J54903J69596J14152O6794m0727j18837j97043P2882Q4270P3760J97329
$$ -265256 -110353 59243 173395 240189 199462 80625 -116418 -43536 40734 114494 311823
9735C11823L969j63227l826M3902K0286j11830%L6891K1364k9085K2062j35958
$$ 311823 315792 152565 148739 192641 212927 101097 101097 137988 159352 130267 152329 16371
9723A6371m7176j09441j2951J14667l9268l4526J98063J30848j65111j63585K8376
$$ 16371 -30805 -140246 -153197 -38530 -77798 -112324 85739 216587 51476 -112109 -83733
9712h3733k70P9555l7997j55163J39203Q1182m0271l648j25154j9491m0797J8913
$$ -83733 -84003 -4448 -42445 -197608 -58405 22777 -17494 -21142 -146296 -165787 -206584 -187671
9700a87671J38570J86196Q7314m3088K285n8037j94591o0443P9106J27803q2943
$$ -187671 -49101 137095 224409 181321 183606 125569 -69022 -129465 -50359 77444 -5499
9689e499P6828J1394N0877J53547j54714j35097p7107r6273J16529L4502o1373
$$ -5499 71329 82723 133600 287147 132433 -2664 -79771 -176044 -59515 -25013 -86386
$$ [...]
##END NTUPLES=NMR SPECTRUM
##END=
