##TITLE=Analysis number 319675
Compound Code cc 46213
Book Reference 440/194
Project Code adrs
Chemist Name craigr
##JCAMPDX= 6.0         $$ Bruker NMR JCAMP-DX V2.0
##DATA TYPE= NMR SPECTRUM
##DATA CLASS= NTUPLES
##ORIGIN= Bruker BioSpin GmbH
##OWNER= nmr
$$ XWIN-NMR		Version 3.5
$$ Wed May 24 10:04:31 2006 GMT Daylight Time (UT+1h)  MAYBRIDGE\nmr@NMR_250MHZ
##.OBSERVE FREQUENCY= 250.131544655141
##.OBSERVE NUCLEUS= ^1H
##.ACQUISITION MODE= SIMULTANEOUS (DQD)
##.ACQUISITION SCHEME= undefined
##.AVERAGES= 16
##.DIGITISER RES= 18
##SPECTROMETER/DATA SYSTEM= dpx250
##.PULSE SEQUENCE= zg30
##.SOLVENT NAME= CDCl3
##.SHIFT REFERENCE= (INTERNAL, CDCl3, 0, 16.522)
##AUDIT TRAIL= $$ (NUMBER, WHEN, WHO, WHERE, WHAT)
$$ ##TITLE= Audit trail, XWIN-NMR		Version 3.5
$$ ##JCAMPDX= 5.01
$$ ##ORIGIN= Bruker BioSpin GmbH
$$ ##OWNER= nmr
$$ C:\u/data/dgb/nmr/ADRS/5050/pdata/1/auditp.txt
$$ ##AUDIT TRAIL=  $$ (NUMBER, WHEN, WHO, WHERE, WHAT)
(   1,<2006-05-24 10:04:11.61 +100>,<MAYBRIDGE\nmr>,<NMR_250MHZ>,
      <created by zg, POWCHK disabled, PULCHK disabled
       configuration hash MD5:
       84 BC 41 DB A1 6E 1D 46 DA 25 12 A5 C1 ED C5 3A
       data hash MD5: 64K
       52 EA 0A 4C 11 CA A6 5D E2 22 38 03 F3 1B A3 56>)
(   2,<2006-05-24 10:04:23.66 +100>,<MAYBRIDGE\nmr>,<NMR_250MHZ>,
      <Start of raw data processing
       ef LB = 0.3 FT_mod = 6 PKNL = 1 SI = 32K 
       data hash MD5: 32K
       0A 66 D2 CF B3 76 4D DB 2C 38 C6 69 AE F5 E2 41>)
(   3,<2006-05-24 10:04:25.42 +100>,<MAYBRIDGE\nmr>,<NMR_250MHZ>,
      <apk 
       data hash MD5: 32K
       A8 A2 A7 DF 9B 46 81 E5 0A 63 B6 60 01 7A 34 7B>)
(   4,<2006-05-24 10:04:26.17 +100>,<MAYBRIDGE\nmr>,<NMR_250MHZ>,
      <abs ABSG = 5 
       data hash MD5: 32K
       7E EE E4 EE 01 7A 99 36 B0 C4 5E AE 9D B4 34 61>)
$$ ##END=
$$ 
$$ hash MD5
$$ B3 5E 2D 19 84 AA E2 D9 76 A4 A7 DD CE 83 B6 73
##$RELAX= 
##$RELAX= 
##$RELAX= 
##$RELAX= 
##$RELAX= 
##$RELAX= 
##$RELAX= 
$$ Bruker specific parameters
$$ --------------------------
##$DU= <C:\u>
##$EXPNO= 5050
##$NAME= <ADRS>
##$PROCNO= 1
##$TYPE= <nmr>
##$USER= <dgb>
##$AMP= (0..31)
100 100 100 100 100 100 100 100 100 100 100 100 100 100 100 100 100 100 
100 100 100 100 100 100 100 100 100 100 100 100 100 100 
##$AQSEQ= 0
##$AQ_mod= 3
##$AUNM= <au_zg>
##$AUTOPOS= <7 >
##$BF1= 250.13
##$BF2= 250.13
##$BF3= 250.13
##$BF4= 250.13
##$BF5= 500.13
##$BF6= 500.13
##$BF7= 500.13
##$BF8= 500.13
##$BYTORDA= 1
##$CFDGTYP= 0
##$CFRGTYP= 5
##$CHEMSTR= <none>
##$CNST= (0..31)
1 1 145 1 1 1 1 1 1 1 1 1 1 1 1 1 1 1 1 1 1 1 1 1 1 1 1 1 1 1 1 1 
##$CPDPRG= <>
##$CPDPRG1= <>
##$CPDPRG2= <>
##$CPDPRG3= <>
##$CPDPRG4= <mlev>
##$CPDPRG5= <mlev>
##$CPDPRG6= <mlev>
##$CPDPRG7= <mlev>
##$CPDPRG8= <mlev>
##$CPDPRGB= <>
##$CPDPRGT= <>
##$D= (0..31)
0 1 0 0 0 0 0 0 0 0.06 0 0 0 0 0 0 0.0002 0 0 0 0 0 0 0 0 0 0 0 0 0 0 
0 
##$DATE= 1148461450
##$DBL= (0..7)
120 120 120 120 120 120 120 120 
##$DBP= (0..7)
150 150 150 150 150 150 150 150 
##$DBP07= 0
##$DBPNAM0= <>
##$DBPNAM1= <>
$$ [...]
##$SUBNAM7= <"">
##$SUBNAM8= <"">
##$SUBNAM9= <"">
##$SW= 20.6930455092707
##$SWIBOX= (0..15)
0 0 3 0 0 0 0 0 0 0 0 0 0 0 0 0 
##$SW_h= 5175.983436853
##$TD= 65536
##$TD0= 1
##$TE= 294.16
##$TE2= 300
##$TE3= 300
##$TEG= 300
##$TL= (0..7)
0 120 120 120 120 120 120 120 
##$TP= (0..7)
150 150 150 150 150 150 150 150 
##$TP07= 0
##$TPNAME0= <>
##$TPNAME1= <>
##$TPNAME2= <>
##$TPNAME3= <>
##$TPNAME4= <>
##$TPNAME5= <>
##$TPNAME6= <>
##$TPNAME7= <>
##$TPOAL= (0..7)
0.5 0.5 0.5 0.5 0.5 0.5 0.5 0.5 
##$TPOFFS= (0..7)
0 0 0 0 0 0 0 0 
##$TUNHIN= 0
##$TUNHOUT= 0
##$TUNXOUT= 0
##$USERA1= <user>
##$USERA2= <user>
##$USERA3= <user>
##$USERA4= <user>
##$USERA5= <user>
##$V9= 5
##$VALIST= <valist>
##$VCLIST= <CCCCCCCCCCCCCCC>
##$VD= 0
##$VDLIST= <DDDDDDDDDDDDDDD>
##$VPLIST= <PPPPPPPPPPPPPPP>
##$VTLIST= <TTTTTTTTTTTTTTT>
##$WBST= 1024
##$WBSW= 4
##$XGAIN= (0..3)
0 0 0 0 
##$XL= 0
##$YL= 0
##$YMAX_a= 391851
##$YMIN_a= -428388
##$ZGOPTNS= <>
##$ZL1= 120
##$ZL2= 120
##$ZL3= 120
##$ZL4= 120
##$ABSF1= 16.522
##$ABSF2= -4.171173
##$ABSG= 5
##$ABSL= 3
##$ALPHA= 0
##$AQORDER= 0
##$ASSFAC= 0
##$ASSFACI= 0
##$ASSFACX= 0
##$ASSWID= 0
##$AUNMP= <proc_1d>
##$AZFE= 0.1
##$AZFW= 0.1
##$BCFW= 0
##$BC_mod= 0
##$BYTORDP= 0
##$COROFFS= 0
##$CY= 12.5
##$DATMOD= 1
##$DC= 0
##$DFILT= <>
##$DTYPP= 0
##$F1P= 14.0000005364418
##$F2P= -0.99999901652339
##$FCOR= 0.5
##$FTSIZE= 32768
##$FT_mod= 6
##$GAMMA= 0
##$GB= 0
##$INTBC= 1
##$INTSCL= 1
##$ISEN= 128
##$LB= 0.3
##$LEV0= 0
##$LPBIN= 0
##$MAXI= 10000
##$MC2= 0
##$MEAN= 0
##$ME_mod= 0
##$MI= 0
##$NCOEF= 0
##$NC_proc= -4
##$NLEV= 6
##$NOISF1= 0
##$NOISF2= 0
##$NSP= 0
##$NTH_PI= 0
##$NZP= 0
##$OFFSET= 16.522
##$PC= 1
##$PHC0= 18.39644
##$PHC1= 6.822886
##$PH_mod= 1
##$PKNL= yes
##$PPARMOD= 0
##$PSCAL= 4
##$PSIGN= 0
##$REVERSE= no
##$SF= 250.13
##$SI= 32768
##$SIGF1= 0
##$SIGF2= 0
##$SINO= 400
##$SIOLD= 32768
##$SREGLST= <1H.CDCl3>
##$SSB= 0
##$STSI= 32768
##$STSR= 0
##$SW_p= 5175.98343685301
##$SYMM= 0
##$S_DEV= 0
##$TDeff= 65536
##$TDoff= 0
##$TI= <Analysis number 999999
Compound Code 99
Book Reference 9
Project Code 9>
##$TILT= no
##$TM1= 0
##$TM2= 0
##$TOPLEV= 0
##$USERP1= <user>
##$USERP2= <user>
##$USERP3= <user>
##$USERP4= <user>
##$USERP5= <user>
##$WDW= 1
##$XDIM= 32768
##$YMAX_p= 424377231
##$YMIN_p= -164774
$$ End of Bruker specific parameters
$$ ---------------------------------
##NTUPLES= NMR SPECTRUM
##VAR_NAME=  FREQUENCY,     SPECTRUM/REAL,   SPECTRUM/IMAG
##SYMBOL=    X,             R,               I
##VAR_TYPE=  INDEPENDENT,   DEPENDENT,       DEPENDENT
##VAR_FORM=  AFFN,          ASDF,            ASDF
##VAR_DIM=   32768,         32768,           32768
##UNITS=     HZ,            ARBITRARY UNITS, ARBITRARY UNITS
##FACTOR=    0.157963299565203, 1,           1
##FIRST=     4132.6476996994, 0,             0
##LAST=      -1043.33573715361, 0,           0
##MIN=       -1043.33573715361, -164774,     0
##MAX=       4132.6476996994, 424377231,     0
$$ Real data points
##PAGE= N=1
##DATA TABLE= (X++(R..R)), XYDATA
$$ [...]
18701I581324K926211M225746N485634O322792O563701O291484N267657L183308
$$ 9581324 12507535 16733281 22218915 28541707 35105408 41396892 46664549 49847857
18693D9847857K16133k676998m429431n364768n992934n718562m462114k762226
$$ 49847857 50063990 47386992 42957561 37592793 31599859 25881297 21419183 18656957
18685A8656957j130060K01859J265385K086829K751567L121251L023008K337522
$$ 18656957 17526897 17728756 18994141 21080970 23832537 26953788 29976796 32314318
18677C2314318J144337P4738p66921j884063k232892j283686J67485K153660L912657
$$ 32314318 33458655 33533393 32766472 30882409 28649517 27365831 27533316 29686976 33599633
18668C3599633M019670L132808K448334K707711J932644j083220j214083J021787
$$ 33599633 37619303 40752111 43200445 45908156 47840800 46757580 45543497 46565284
18660D6565284K824413L787376K834278m943k319387k783622l974408p096905
$$ 46565284 49389697 53177073 56011351 56006408 53687021 50903399 46928991 39832086
18652C9832086p855301n594010l356554j986052j197820n88653J3379O99945J630812
$$ 39832086 31976785 26382775 23026221 21040169 19842349 19253696 19267075 19967020 21597832
18643B1597832K930691M577358O229734P322168P620416P265869N998230L459284
$$ 21597832 24528523 29105881 35335615 42657783 50278199 57544068 63542298 67001582
18635F7001582j46762l757958o025381p305702q153353p966941o620657m796915
$$ 67001582 66854820 63096862 57071481 49765779 41612426 33645485 27024828 22227913
18627B2227913l164765k097103j457823j044752p70632n83865m14127k31390l9861
$$ 22227913 19063148 16966045 15508222 14463470 13692838 13108973 12694846 12463456 12423595
18618A2423595J77448L52354M51776M06214K77494R5976j14357k53293m01776
$$ 12423595 12601043 12953397 13405173 13811387 14088881 14184857 14070500 13817207 13415431
18609A3415431m89285o00416p09677o85848n50080p96651j150773r43088o26385
$$ 13415431 12926146 12325730 11616053 10930205 10380125 9583474 8432701 7489613 6863228
18600F863228m45734l47015k82982k41329k24715k06529j68549j58230j76146
$$ 6863228 6417494 6070479 5787497 5546168 5321453 5114924 4946375 4788145 4611999
18591D611999j43232j27579j39245j25006j12802r9557j11422j14020j14415q0216
$$ 4611999 4468767 4341188 4201943 4076937 3964135 3864578 3753156 3639136 3524721 3444505
18581C444505q8641r0704q9790m8558k5150K807L6721M0206K4264J4878K2070
$$ 3444505 3355864 3265160 3175370 3126812 3101662 3104469 3141190 3181396 3205660 3220538 3242608
18570C242608N001n8948p5158k6645j4696J451q774m275M7319O6922R2548J26445
$$ 3242608 3247609 3188661 3113503 3086858 3072162 3073613 3064839 3060564 3107883 3174805 3267353 3393798
18558C393798J10529R9275J33114J67177J99463J99797J81359K30221K02032K32173
$$ 3393798 3504327 3603602 3736716 3903893 4103356 4303153 4484512 4714733 4916765 5148938
18548E148938L07144L17247L46637M05834N83375P84827R94582J381304J946343
$$ 5148938 5456082 5773329 6119966 6525800 7109175 7894002 8888584 10269888 12216231
18539A2216231K779258M304007P265980J1749440J4933852J3452703R918399Q885259
$$ 12216231 14995489 19299496 26565476 38314916 53248768 66701471 76619870 85505129
18531H5505129J2717488J2427142q22737p857405m844559Q63935L538106k436662
$$ 85505129 98222617 110649759 109827022 101969617 97125058 97988993 101527099 99090437
18523I9090437k766821J324343K813290N562378J0587677N493220q300827j1129122
$$ 99090437 96323616 97647959 100461249 106023627 116611304 122104524 113803697 102674575
18515A02674575p876080m498381r230070j8766887j6041181r271062n415606l503310
$$ 102674575 94798495 90300114 81070044 62303157 46261976 36990914 31575308 28071998
18507B8071998k586322k073220j686707j366894j175966j084275r33095q27513
$$ 28071998 25485676 23412456 21725749 20358855 19182889 18098614 17165519 16338006
18499A6338006q13373p38036n74566n01719n46869n95121n29796l96908l63284
$$ 16338006 15524633 14786597 14212031 13710312 13163443 12568322 12038526 11641618 11278334
18490A1278334l91615l94423l36323k83501k94902l03700k97589k58966k31597
$$ 11278334 10886719 10492296 10155973 9872472 9577570 9273870 8976281 8717315 8485718
18481H485718k62551k71826k27691k07487k06942j86338j78227k36344k63237
$$ 8485718 8223167 7951341 7723650 7516163 7309221 7122883 6944656 6708312 6445075
18472F445075k22101k15357k28860k69526k60990k16923j86255j73682j48662
$$ 6445075 6222974 6007617 5778757 5509231 5248241 5031318 4845063 4671381 4522719
18463D522719j50276j38631j33065j05831j08974j06730q7647p4582p5878n7908
$$ 4522719 4372443 4233812 4100747 3994916 3885942 3779212 3691565 3616983 3541105 3483197
18453C483197m5659o2655o9854n9054m3226n2931p2335o5059p8841o9177n9547
$$ 3483197 3437538 3374883 3305029 3245975 3202749 3149818 3077483 3012424 2933583 2864406 2804859
18442B804859n6702p5036p9817q9126o0727o1326o5387o2734o1859o5986m4432
$$ 2804859 2748157 2673121 2593304 2504178 2443451 2382125 2316738 2254004 2192145 2126159 2081727
18431B081727m4909n6459n9759o5832m9658o2898n8914o2805m6770m7374n5511
$$ 2081727 2036818 1980359 1920600 1854768 1805110 1742212 1683298 1620493 1573723 1526349 1470838
18420A470838n3002l2465j6056j6512m726r726j3510q511k0125j5671O34J6870
$$ 1470838 1417836 1385371 1369315 1352803 1348077 1338351 1324841 1316330 1296205 1280534 1281168 1298038
18408A298038K2223K3987K1000K0976K3243K9751N3857Q9488J32004J96314K84942
$$ 1298038 1320261 1344248 1365248 1386224 1409467 1439218 1493075 1582563 1714567 1910881 2195823
18397B195823L71849M01524L73456L72066L91850L14107J01560r4391q1634j4809
$$ 2195823 2567672 2969196 3342652 3714718 4106568 4420675 4522235 4427844 4346210 4331401
18387D331401j24576k31433k03392j10833p9125o8344L389J06006K05522L47694
$$ 4331401 4206825 3975392 3772000 3661167 3582042 3513698 3517087 3623093 3828615 4176309
18377D176309N33049Q00462J208642J748474K304875K868372L569488M118353
$$ 4176309 4709358 5509820 6718462 8466936 10771811 13640183 17209671 21328024
18369B1328024M033950L394579K743348K370548R46692j564318k222704j964743
$$ 21328024 25361974 28756553 31499901 33870449 34817141 33252823 31030119 29065376
18361B9065376l222903l969182k907672k109133j822063j134729k84938M67036
$$ 29065376 25842473 21873291 18965619 16856486 15034423 13899694 13614756 14081792
18353A4081792J242910K113166K965471L684411M025410L826055L077702J913093
$$ 14081792 15324702 17437868 20403339 24087750 28113160 31939215 35016917 36930010
18345C6930010J315131R06081L86070L59075P23748J800384K815789K172457j99211
$$ 36930010 38245141 39151222 39537292 39896367 40620115 42420499 45236288 47408745 47209534
18336D7209534j838072k412337l125115m095356m191118k954541j175201M0207
$$ 47209534 45371462 42959125 39834010 35738654 31547536 28592995 27417794 27458001
18328B7458001R13151J910570K536263J728452L46024O5084O05819J56090j976138
$$ 27458001 28371152 30281722 32817985 34546437 34892461 34957545 35563364 35719454 33743316
18319C3743316k529490r95613O12980J451493K257858L993467O079790P415890
$$ 33743316 31213826 30218213 30831193 32282686 34540544 38534011 44613801 52029691
18311E2029691P183836N756272M624736L774436M21404m390197n239786m989963
$$ 52029691 59213527 64969799 69594535 73368971 73790375 69400178 64160392 59170429
18303E9170429p599227q723848o648137n239441m757604l661484k434818j603692
$$ 59170429 51571202 42847354 36199217 30959776 26202172 22540688 20105870 18502178
18295A8502178j058729o03770j98279J28309L74013N45752N50816L68884M9972
$$ 18502178 17443449 16839679 16641400 16769709 17143722 17689474 18240290 18609174 18659146
18286A8659146k48197m96674j054764j244358j023989r41896p34220n08378m79026
$$ 18659146 18410949 17914275 16859511 15615153 14591164 13649268 12915048 12406670 11927644
18277A1927644m52923l92785l41319m14131o13624o44122n38042m53650m09100
$$ 11927644 11474721 11081936 10740617 10326486 9712862 9068740 8530698 8077048 7667948
18268G667948m02028m50869l87903l09230k47728j92131j39123j41245j56575
$$ 7667948 7265920 6815051 6427148 6117918 5870190 5678059 5538936 5397691 5241116
18259E241116j56520j25431j16074j20444j23788j10415q0823n3554j7236K0261
$$ 5241116 5084596 4959165 4843091 4722647 4598859 4488444 4407621 4354067 4336831 4357092
18249D357092P0649J41000K53496M01819M17920K52901Q7619J8384K2141k02854
$$ 4357092 4427741 4568741 4822237 5224056 5641976 5894877 5982496 6000880 6023021 5820167
18239E820167n08026l62244j40924o30Q7102J58536K49224L93447O27664J029947
$$ 5820167 5312141 4949897 4808973 4808343 4895445 5053981 5303205 5696652 6324316 7354263
18229G354263J667880K477732L018173K826293K013062J137543M90700l55367
$$ 7354263 9022143 11499875 14518048 17344341 19357403 20494946 20985646 20630279
18221B0630279j568144k041847j197771j12536L27251L09002K09065m795n44204
$$ 20630279 19062135 17020288 15822517 15709981 16037232 16346234 16555299 16550504 16006300
18212A6006300j170603j124080n64707L705L98757P56703J193905J758392K591041
$$ 16006300 14835697 13711617 13146910 13150615 13549372 14306075 15499980 17258372 19849413
18203A9849413L904585O115425R905604J5397845J9966187K0438795J8852442
$$ 19849413 23753998 29869423 39775027 55172872 75139059 95577854 114430296
18196A14430296J6700997J3281502M281469j1797614j6553364j4512923j9453421
$$ 114430296 131131293 144412795 148694264 136896650 120343286 105830363 86376942
18189H6376942k0060404j3372952p389871l727411j304162Q78932L433303O425742
$$ 86376942 66316538 52943586 45553715 41826304 40522142 41401074 44834377 51260119
18181E1260119Q794793R068390P131927M401454K094434k34718l480339n321197
$$ 51260119 60054912 69123302 76255229 80656683 82751117 82516399 79036060 73714863
18173G3714863k829846J399836L474678L055357K237948J982338J299913n02031
$$ 73714863 70885017 72284853 75759531 78814888 81052836 83035174 84335087 83833056
18165H3833056j171831o57824o21444p97562m48773k179790n724762m472156K92333
$$ 83833056 82661225 82003401 81381957 80584395 80135622 77955832 72231070 67758914 68051247
18156F8051247L279566L340326J928012k07046k946053o172126q849913q646854
$$ 68051247 71330813 74671139 76599151 76392105 73446052 67273926 58424013 49777159
18148D9777159o726510m138686k059556n22642Q29288K637095N894128J1173405
$$ 49777159 43050649 38911963 36852407 36329765 37159053 39796148 45690276 56863681
18140E6863681J6669746J7119866J1438259M643548J184746k92506j1615365k3338245
$$ 56863681 73533427 90653293 102091552 106735100 107919846 107627340 96011975 72673730
18132G2673730j9270298j1460015o665754m256998k998031k244906j765877j460518
$$ 72673730 53403432 41943417 35277663 31020665 28022634 25777728 24011851 22551333
18124B2551333j297233j102871q78368o47689m16027k40060j79657k02781k60634
$$ 22551333 21254100 20151229 19272861 18625172 18209145 17969085 17789428 17586647 17326013
18115A7326013k26414j21084j2803K88157R00091J512091K070361K769634K859952
$$ 17326013 17099599 16978515 16965712 17253869 18153960 19666051 21736412 24506046 27365998
18106B7365998J558391j71320j562480j355811k073546m939364l944731k148635
$$ 27365998 28924389 28753069 27190589 25834778 23761232 18821868 14877137 12728502
18098A2728502j286653q51310n94212m13536k31556p2895p0481j59559k44279
$$ 12728502 11441849 10590539 9996327 9582791 9351235 9278340 9207859 9048300 8804021
18089H804021k78561l26782n54523o61853n10965l85402l14972k83492k45965
$$ 8804021 8525460 8198678 7644155 6982302 6471337 6085935 5770963 5487471 5241506
18080E241506k19273j89080j72003j50183j31216j20583j23953j32556j27982
$$ 5241506 5022233 4833153 4661150 4510967 4379751 4259168 4135215 4002659 3874677
18071C874677j19047j03998r3338j12472j06495j14081j12429j14900j21153j21428
$$ 3874677 3755630 3651632 3558294 3445822 3339327 3225246 3112817 2997917 2876764 2755336
18061B755336j04580j01332j00160p5514q0203p6397n2460m1751l1849k6558l0039
$$ 2755336 2650756 2549424 2449264 2373750 2293547 2217150 2164690 2122939 2091090 2064532 2034493
18050B034493m0248m6586o2065p0399p1940p1656n6347n9896m7455m0710l5225
$$ 2034493 1994245 1947659 1885594 1815195 1743255 1671599 1615252 1555356 1507901 1467191 1431966
18039A431966k6511k6804k0249r798N487N893j3081k6997l5285j5469l9696n2719
$$ 1431966 1405455 1378651 1358402 1348604 1354091 1359984 1346903 1319906 1284621 1269152 1229456 1176737
18027A176737m4596m0198l8202k5255O260j841k7322j6754j813q979r530k600
$$ 1176737 1132141 1091943 1053741 1028486 1034746 1032905 1005583 988829 987016 978037 968507 965907
18015I65907J2066O924p415R643J4211K2350L6099K6754K5876K1261n865k9013
$$ 965907 977973 984897 977482 987125 1001336 1023686 1059785 1086539 1112415 1133676 1127811 1098798
18003A098798l8548m4676n5515l5256k1019j309K377K7126J1977K1674K1592J4301
$$ 1098798 1060250 1015574 960059 924803 903784 902475 904852 931978 943955 965629 987221 1001522
17991A001522q835m6883j8017l779k1941j2867j887K1485J7465J462j871n226
$$ 1001522 992687 945804 927787 924008 902067 889200 887313 908798 926263 927725 925854 920628
17979I20628Q313O760M3797N5158M1973K2747n20j431l5242o8784q1404p9895
$$ 920628 928941 935701 979498 1034656 1076629 1099376 1098856 1097425 1062183 993399 911995 832100
17967H32100p3103l9247j8311j267j6741k4302j4718k1173j9429n449m649J2134
$$ 832100 758997 719750 701439 700172 683431 659129 644411 623238 603809 598360 593711 605845
17955F05845K1638q424k5692l0056j3559j1176m134j7751l1611j3176p531r382
$$ 605845 627483 619059 593367 563311 549752 538576 534442 516691 485080 471904 464373 454991
17943D54991j1866j4459n544j9193j6323j6197o915l783o596k8589j3377R455
$$ 454991 443125 428666 423122 403929 387606 371409 364494 360711 354115 325526 312149 321604
17931C21604l813M856j2857o96P800R496K3835L573j1299j4591j1635k485k298
$$ 321604 317791 322647 309790 309094 316894 326390 350225 353798 342499 327908 316273 313788 311490
17918C11490j4017k3302p638j2305K439n042o033m858P86K918J8270N931q176
$$ 311490 297473 274171 266533 254228 256667 251625 245592 240734 241520 244438 262708 268639 260463
17905B60463q683O23j78j0997j4922r822N914J4148l310j275l303O580L3372M2168
$$ 260463 251780 252403 252225 241228 226306 216484 222398 236546 233236 231961 228658 235238 268610 310778
17891C10778M2731Q2693R6694P8012N9975N8836P0105M3456k7241m4849k1724
$$ 310778 353509 436202 532896 610908 670883 729719 799824 843280 816039 771190 749466
17880G49466R865O47j8642q245O984K1887L7832K5304m088l1096m4936j8707j5802
$$ 749466 759331 759978 741336 733091 740075 761962 799794 825098 821010 789914 744978 726271 710469
17867G10469n4670q7346m1995j6499M323K9957J0087l213m257r989k3240k5321
$$ 710469 655799 568453 526458 509959 514282 544239 554326 551113 546856 536867 513627 488306
17855D88306k0117l8621k9866l1352j9930J288Q74K161K255K5526J4723j084J806
$$ 488306 468189 429568 399702 368350 348420 349708 350582 352743 354998 380524 395247 394163 395969
17842C95969O376J3654j5090j5817j616p297j9274j1708o350l6791j9070J7305
$$ 395969 402345 415999 400909 385092 383476 376179 356905 345197 338847 302056 282986 300291
17830C00291J1080J2324o902j3520j603q331j261L605j2641q598n093P783m368
$$ 300291 311371 323695 316793 303273 301670 293339 292078 295683 283042 274444 269351 277134 272766
17817B72766l868J7057O314j5064m776k922K58O409P46Q116Q710P8N220P97M174
$$ 272766 268898 285955 292269 277205 272429 269507 269765 276174 276920 285036 293746 293824 299044 299841 304015
17802C04015J2355l795j2362j0123r336k3694l4266k2076k2576l3561j9185J856
$$ 304015 316370 312575 300213 290090 280754 257060 222794 200718 178142 144581 125396 127252
17790A27252o271L249O636k628r369j3531k264r592L742J865j406m65r36O957
$$ 127252 120981 124230 130866 128238 118869 105338 103074 93482 97224 99089 97683 97218 96282 103239
17776A03239P231o830j4936r038j0093N952L039N013J0238j253L893p775l965
$$ 103239 110470 103640 88704 79666 69573 75525 78564 83577 93815 92562 96455 88680 84715
17763H4715j742j2908j0272Q003J0172P47O466n054j3521O087l956j1345l88L487
$$ 84715 82973 70065 59793 67796 77968 78715 85181 80127 66606 72693 68737 57392 57004 60491
17749F0491J625P338l190Q81R414n924l070L604P116K33l989m964L359K0922J081
$$ 60491 62116 69454 66264 67145 76559 70635 67565 71169 78285 78518 74529 69565 72924 93846 94927
17734I4927r331j6523m047L751O476M321j4268r616R70J4763J0868J2820J9270
$$ 94927 85596 69073 65026 68777 75253 79574 65306 55690 56660 71423 82291 95111 114381
17721A14381J9818K4585J8877K3077L0644J4434R123P44J3112j360k422l013J3625
$$ 114381 134199 158784 177661 200738 231382 245816 254939 255683 268795 267435 265013 262000 275625
17708B75625L3292K2416J6550J8570J1363k008o648k5980j5667O544m660k1826
$$ 275625 308917 331333 347883 366453 377816 375808 369160 343180 327513 334057 329397 307571
17696C07571j4805M873J0662J6514J2487K9286J9049K4094J5292J1906M0338M6238
$$ 307571 292766 297639 308301 324815 337302 366588 385637 409731 425023 436929 477267 523505
17684E23505N6356M2882M1813L4346P414k3833k5157k7084l4802m2030l3468o541
$$ 523505 579861 622743 664556 698902 706316 682483 657326 630242 595440 553410 519942 513401
17672E13401j8235J7288P702N657R582Q23k5958k1306l132J4744K1251K3941L4611
$$ 513401 495166 512454 520156 525813 535395 536218 510260 488954 485822 500566 521817 545758 580369
17659E80369K2952K0242J6014j5816j7069m208j4017k9989k8627j2501k0512k6630
$$ 580369 603321 623563 639577 623761 606692 602484 588467 558478 529851 517350 496838 470208
17647D70208j3543O517O606m878j0020j8334k8070m4489n1410m3423j0708k313
$$ 470208 456665 463182 469788 464910 454890 436556 408486 363997 312587 269164 258456 256143
17635B56143r41j9761k0548q999K65r195n355m329J8549L3789J9224L7742N4532
$$ 256143 255202 235441 214893 205894 206159 196964 191609 187280 205829 239618 258842 296584 351116
17622C51116O5650Q5654Q1997O4845N2982L0010N5512K8258j4478l5443j9412
$$ 351116 416766 502420 584417 649262 702244 732254 787766 816024 801546 766103 746691
17611G46691k0167l8235p6188o1974m7987l3627k4131k3985m254Q470L7428M6672
$$ 746691 726524 688289 612101 550127 502140 468513 444382 420397 416143 424613 462041 508713
17599E08713P1022P7323N5297N4251O7436L3886m1680p4593n5294n1839q2269
$$ 508713 579735 657058 712355 766606 834042 867928 826248 751655 696361 644522 562253
17588E62253j16105j01916p2572l9777k0071o599J043Q142n390p474p182m111
$$ 562253 446148 344232 271660 231883 211812 205213 206256 214398 209008 201534 194352 190241
17576A90241l346j1545j1666j492r579j1432o998m403m42q60J6475o027k328m776
$$ 190241 186895 175350 163684 162192 152613 141181 134183 129780 129338 128478 144953 138926 136598 131822
17562A31822l433n303m820N639J6397m01r012j1815M435Q928o395o965k395q480
$$ 131822 128389 123086 118266 123905 140302 139901 130889 119074 123509 132437 126042 119077 116682 108202
17548A08202j1149R89m296J667J9604o76j0866N5q332q104j0091n702p555j0423
$$ 108202 97053 98042 93746 95413 115017 114341 103475 103530 95198 87094 77003 71301 63746 53323
17534E3323J0268K580j1863j3230Q010N878N534l181o928n182n549J1089P550
$$ 53323 63591 66171 54308 41078 49088 54966 60500 57319 50391 45209 39660 50749 58299
17521E8299k21J067m334j2332K620N39R066J5167j7546j4040j4406o37N852J6643
$$ 58299 58078 59145 54811 42479 45099 45638 54704 69871 52325 38285 23879 23242 29094 45737
17507D5737O84L528q392L618j455n222J930p587J271j856j6516K778Q466L068
$$ 45737 46421 49949 41557 45175 43720 38498 40428 32841 34112 32256 15740 18518 26984 30052
17493C0052O629J0156Q71M539R695K262N433p68j686J0474M505J9943l022k311
$$ 30052 36681 46837 47708 52247 61942 64204 69637 68869 67183 77657 82162 102105 99083 96772
17479I6772K278Q273K7867M2826Q2732Q0162N0263M541n581R894l2534p7944o0312
$$ 96772 99050 107323 135190 178016 260748 340910 391173 395714 390133 400027 367493 289549 229237
17466B29237j5614J5621M4668P1387M9992J7784J2014K9776K181m7629m8367r061
$$ 229237 213623 229244 273912 345299 395291 413075 425089 454865 457046 409417 361050 351989
17454C51989L4980P4507N6126J3997O535L632k9135p4352p3502l5349o11L6513
$$ 351989 386969 461476 517602 531599 538134 541766 512631 438279 364777 329428 328817 365330
17442C65330O0336P8259M8247K4699L825k7952o1375r5651r0810m4908k2221m0886
$$ 365330 425666 503925 552172 576871 580696 552744 491369 395718 304908 260000 237779 196893
17430A96893k2622m876o989j3885k675r070j6327m462n886p900O900N860q03o169
$$ 196893 174271 169395 162406 148521 145846 136776 120449 115987 110101 102201 109101 114961 114158 107989
17416A07989N896l053J421R850N49p523j2409j375j1880R118N09J229l326p275
$$ 107989 113885 110832 112253 122103 122652 115129 102720 101345 89465 98583 99092 100321 96995 89720
17402H9720k2617p507L276q015J4036M727n62n082Q361R540m390k1189p282L937
$$ 89720 67103 59596 62872 54857 68893 73620 73058 67976 76337 85877 81487 60298 53016 56953
17388E6953M805P64J1772K590p35r766j6367L946O002l057j0464p141j463j6515
$$ 56953 61758 62522 74294 76884 76149 66383 50016 53962 59964 56907 46443 39302 37839 21324
17374B1324j0130J7828J4811J601Q53j487O928J774P928J969M086j0399N781M284
$$ 21324 11194 29022 43833 45434 46287 44800 51728 53502 61430 63399 67485 57086 62867 67151
17360F7151L104J2730M312N868K807r081r212j477j3228O557K1080P03j1255o004
$$ 67151 70255 82985 87297 93165 95972 86891 77679 76202 62974 69531 90611 91314 80059 74055
17346G4055o709J3497k089q325j1810m276r628O920n992j1731j9117M164K1236
$$ 74055 67346 80843 78754 70429 58619 54343 44715 51635 45643 33912 14795 18959 40195
17333D0195J4637J545N875r697j0823J0638K111m594J0682J0770K6139J5265j0215
$$ 40195 54832 56377 62252 52555 41732 52370 54481 49887 60569 71339 97478 112743 102528
17320A02528j7421j4145P326k802q081J0436J2962m787n474K256L600J3134J0697
$$ 102528 85107 70962 78288 75486 67405 77841 90803 86016 80542 82798 86398 99532 110229
17307A10229o295J2230J6936O684Q09M305J7427J677p938k2042O528Q287j0894
$$ 110229 103934 116164 133100 139784 140593 144898 162325 164002 156064 134022 140550 148837 137943
17294A37943m135Q267n983M473N375l343j1929k469L357Q199O85j823q640j8419
$$ 137943 133808 142075 136092 140565 145940 142597 130668 128199 131556 139755 140440 138617 129977 111558
17280A11558j3576Q161p477j7537j0002p542K0182J4802k805L405l549p702R202
$$ 111558 97982 106143 98666 81129 71127 63585 83767 98569 95764 99169 95620 87918 97120
17267I7120J0398j1246j0571m733q199n51o209q719q074j701l983j0926j5115
$$ 97120 107518 96272 85701 80968 72769 72218 66009 57290 49216 47515 43532 32606 17491
17254A7491j670m79m404Q400L3K441P340J4548O513l759p736j325p792j0537r355
$$ 17491 15821 15342 10938 19338 19371 21812 29152 43700 50213 46454 38718 37393 29601 19064 9709
17239I709m746q230K724j738J893Q346J5055J2722L620K112J699N789J3232Q161
$$ 9709 4963 -3267 -543 -2281 -388 7958 23013 35735 39355 41467 43166 48955 62187 70348
17225G0348l471n502J4037J953j2072l800Q316n745o843m44J0185L353R659J7225
$$ 70348 66877 61375 75412 77365 65293 61493 69809 64064 57221 56777 66962 70315 79974 97199
17211I7199J2363J1257L252j0419J0821N957Q149J4122p204o428l231j235J3320
$$ 97199 109562 120819 124071 113652 124473 130430 138579 152701 145497 139069 135838 134603 147923
17198A47923j0825l563K4399L6852M1178N726j649R099J9046J2240j1278k3502
$$ 147923 137098 133535 157934 194786 235964 241690 240041 249140 268186 280426 269148 245646
17186B45646q841J3216Q5q950j4379K233J8401R959J4014K8325o57J6432K9130
$$ 245646 236805 250021 250106 241156 226777 229010 247411 257370 271384 299709 299052 315484 344614
17173C44614O517K017k330J0155K7585L061j6555l272P473M497J0686l917l515
$$ 344614 351131 353148 350818 360973 388558 391619 375064 371792 379265 383762 394448 390531 387016
17160C87016Q06p101p749P110j712M256o966k1841M934J1090J4181Q153J0408
$$ 387016 387822 380721 372972 380082 378370 382626 375660 353819 358753 369843 384024 392177 402585
17147D02585J9228J2840K0381J5250N924R667K031K463j0993j2598j5341j6797
$$ 402585 421813 434653 455034 470284 476208 485875 487906 490369 479376 466778 451437 434640
17135D34640R695K3233K802M475m036Q123L7o081M57O117N678k044K011K0522
$$ 434640 444335 467568 470370 474845 470809 478932 478969 472888 473345 479462 485140 483096 485107 505629
17121E05629K2304J1149M174O095J0679J8034J4897J7108J9083R090J0412J8460
$$ 505629 527933 539082 543256 549351 560030 578064 592961 610069 629152 638242 648654 667114
17109F67114K7518K5699K7319N4964P0403Q5632J06662J00490J03586J04963J21925
$$ 667114 694632 720331 747650 802614 873017 958649 1065311 1165801 1269387 1374350 1496275
17098A496275J56465J41365J11015J02569J25131J39774J47365R2545O1605P1237
$$ 1496275 1652740 1794105 1905120 2007689 2132820 2272594 2419959 2512504 2574109 2645346
17088B645346J30974J80946J97736K43227L54031M80864O30169P66668R42382
$$ 2645346 2776320 2957266 3155002 3398229 3752260 4233124 4863293 5629961 6572343
17079F572343J218542J632226K345176L587395N780034R260161J2315553J1998065
$$ 6572343 7790885 9423111 11768287 15355682 21135716 30395877 42711430 54709495
17071E4709495R242084P616975R441083J0021324J022439p217691p146353m422515
$$ 54709495 63951579 71568554 81009637 91030961 92053400 84835709 77689356 73266841
17063G3266841l962287j0650481j4437451r883267n051536k216588n03345Q97653
$$ 73266841 69304554 58654073 44216622 34333355 29281819 27065231 26561886 27459539
17055B7459539K708304N569386R991525J4599646J5511105J2337369R500819J0659848
$$ 27459539 30167843 35737229 45728754 60328400 75839505 88176874 97677693 108337541
17047A08337541J3024914M373221q696595j0775067p537672n427043j1948570
$$ 108337541 121362455 125735676 117039081 106264014 98726342 93299299 81350729
17040H1350729j9638469j5919532r433400n558397l614562k566968j932606j611762
$$ 81350729 61712260 45792728 36359328 30800931 27186369 24619401 22686795 21075033
17032B1075033j441044j305652j156921r96369q93658q50431q22396p07954n45667
$$ 21075033 19633989 18328337 17171416 16175047 15281389 14430958 13608562 12900608 12354941
17023A2354941m72644m89513m86781m21172l13853k65080l12878l48775l02428
$$ 12354941 11882297 11392784 10906003 10484831 10170978 9905898 9593020 9244245 8941817
17014H941817k35364j93209k56401l47329l20817k58619k55291l16927l29673
$$ 8941817 8706453 8513244 8256843 7909514 7588697 7330078 7074787 6757860 6428187
17005F428187k83060k48443k20715j99899j82836j64055j68564j60847j44117
$$ 6428187 6145127 5896684 5675969 5476070 5293234 5129179 4960615 4799768 4655651
16996D655651j41270j42045j51425j21112j19740j17421j18965j09398r0558r0177
$$ 4655651 4514381 4372336 4220911 4099799 3980059 3862638 3743673 3634275 3543717 3453540
16986C453540r3338q3476r5296q0457q3514q2232q3291q1556q3623j08325r8213
$$ 3453540 3360202 3276726 3181430 3100973 3017459 2935227 2851936 2770380 2686757 2578432 2480219
16975B480219n7552n9193o8994p4076o5695n3229m7843m6996k4951k5718k0732
$$ 2480219 2422667 2363474 2294480 2220404 2154709 2101480 2053637 2006641 1981690 1955972 1935240
16964A935240k6299k1310j9940q944k3009j7206j9417l0513K698K5616O1028O0645
$$ 1935240 1908941 1887631 1867691 1858747 1835738 1818532 1799115 1768602 1771300 1796916 1857944 1918589
16952A918589M0323L1992M6040O7285Q236j8749O6033J43883J58452J85558K17970
$$ 1918589 1958912 1990904 2036944 2104229 2112465 2093716 2159749 2303632 2462084 2647642 2865612
16941B865612K27389J73123O4320J19699K19957K04849K67953M13683N34975O48365
$$ 2865612 3093001 3266124 3330444 3450143 3670100 3874949 4142902 4556585 5091560 5739925
16931E739925P69596R08791J196632J686014K512431M104478P268915J2492558
$$ 5739925 6509521 7418312 8614944 10300958 12813389 16917867 24186782 36679340
16923C6679340J6416398J3729746P493938K549969K525055O73758j4766603j7699963
$$ 36679340 53095738 66825484 74319422 76869391 79394446 80068204 65301601 47601638
16915D7601638q203815r68905N271643J1690788J4167447R973856M202157R46216
$$ 47601638 39397823 38428918 43700561 55391349 69558796 79532652 83734809 84681025
16907H4681025K162240m053809j7701855j2335690r80862O756093Q086005M581280
$$ 84681025 86843265 82789456 65087601 52751911 51771049 58527142 66613147 71194427
16899G1194427R38955K27986P22285q853298j5426908q908654k751736K001178
$$ 71194427 72133382 72361368 73083653 64230355 48803447 39894793 37143057 39144235
16891C9144235P069288J0277486Q129615L585008J21513L52098j893544j4105302
$$ 39144235 46213523 56491009 64620624 68205632 68327145 68679243 66785699 52680397
16883E2680397j5117605q644889m849619k965156j967197j383831j035140q30277
$$ 52680397 37562792 28917903 24068284 21103128 19135931 17752100 16716960 15886683
16875A5886683p04743p39230p86141p18432p01151p28801o37091m86213l79777
$$ 15886683 15181940 14442710 13656569 12938137 12236986 11508185 10871094 10384881 10005104
16866A0005104k97903k92888l15920k86133l16100l75562m02247l55692k81129
$$ 10005104 9707201 9414313 9098393 8812260 8496160 8120598 7718351 7362659 7081530
16857G081530k41638j96769j73655j61868j72636j95975k08815k20585k54826
$$ 7081530 6839892 6643123 6469468 6307600 6134964 5938989 5730174 5509589 5254763
16848E254763k56823k20805j92524j87474j51662j47101j39838j28717j11929
$$ 5254763 4997940 4777135 4584611 4397137 4245475 4098374 3958536 3829819 3717890
16839C717890j09682j07824r7253j02084q9083j10748j05302j00950j15440r8728
$$ 3717890 3608208 3500384 3403131 3301047 3211964 3101216 2995914 2894964 2779524 2680796
16829B680796j08068j00516q9972p7934n8456o3163o6965o3687p1435p6021p2533
$$ 2680796 2572728 2472212 2382240 2304306 2245850 2182687 2115722 2052035 1980600 1904579 1832046
16818A832046q0550q1050o6684o3209n1045o0660o5485m7244m9803m7344o1468
$$ 1832046 1751496 1670446 1603762 1540553 1489508 1428848 1363363 1316119 1266316 1218972 1157504
16807A157504o0622l8488m2587m7325n1440j5929k8384l7554l3757l2940m0217
$$ 1157504 1096882 1058394 1015807 968482 917042 901113 872729 835175 801418 768478 728261
16796G28261m5128l5044k1868k5063l5262l2687l1260j5395p11q344k0711l1927
$$ 728261 683133 648089 626221 601158 565896 533209 501949 486554 485843 477499 456788 424861
16784D24861m2363j0656J0400K8738J769j6278r248l726j2860k8313j4940P307
$$ 424861 382498 371842 382242 410980 412749 396471 387223 383497 370637 342324 327384 334691
16772C34691p39P68J1910j828j6502j3730r985L022r522j5956p568J0458J8794
$$ 334691 333952 334720 346630 344802 328300 314570 304585 307607 298085 282129 274561 285019 303813
16759C03813K172j0505k0073r075N124m931k186L355j3861K884r567n640J0466
$$ 303813 305985 295480 275407 266332 271456 266525 264339 267694 253833 256717 247150 241510 251976
16746B51976N458n074l586j3222n671J6980N187J5871J5751o762j0499l10O751
$$ 251976 257434 252360 248774 235552 229881 246861 252048 267919 283670 276908 266409 266099 272850
16733B72850J1633j2499N424K523r26j6561L610J5720O702o33J4399J3717J179
$$ 272850 284483 271984 277408 279931 279005 262444 266054 281774 288476 287843 302242 315959 317138
16720C17138j7515r175M701K840n364k9096j0399J014L265K1843k414l2812o432
$$ 317138 299623 290448 295149 297989 292625 263529 253130 254144 257409 279252 276838 244026 237594
16707B37594O626N085m751J300J0641J160l372n932n087j9394n524m325q652j5230
$$ 237594 244220 249305 244554 245854 256495 257655 254283 248351 243264 223870 218346 214021 205369 190139
16693A90139j950k518j931j1853j6030L631J0750j4361L49L10N693J21J955j1154
$$ 190139 188189 185671 183740 171887 155857 159488 170238 155877 156226 156536 162229 162350 164305 153151
16679A53151j174R038K18N36k219j8593j5449M744P568J1773j4144p240l58j3229
$$ 153151 151977 161015 161233 161769 159550 140957 125508 130252 137820 149593 135449 128209 127851 114622
16665A14622j0076n16j526n464R835K443K647r698p495n178p489J2908m675J656
$$ 114622 104546 104030 102504 97040 106875 109318 111965 102267 94772 89594 82105 95013 90338 91994
16651I1994J476j773R184K5j2641J2186l139j1168j1149m495k187J0120Q05R55
$$ 91994 93470 91697 100881 100906 88265 100451 97312 86144 74995 70500 68313 78433 79238 80193
16637H0193p171m690n779p200p349K813K370J319O934R19j2856K848n094l886
$$ 80193 73022 68332 62553 55353 48004 50817 53187 54506 61440 62359 49503 52351 47257 43371
16623D3371Q558k03J89M675M676K553o017r878n603J4727J0593J1354j799j0958
$$ 43371 51929 51726 51915 56590 61266 63819 57802 47924 42321 57048 67641 78995 77196 66238
16609F6238n710q033n498m211p403o533P813L879K604m668k032j0157p041M883
$$ 66238 60528 52495 46997 42786 35383 28850 36663 40542 43146 38478 36446 26289 19248 24131
16595B4131N117N224m065n759J1185J0955j1991M965J5266M414k607J308j889
$$ 24131 29248 34472 30407 24648 35833 46788 34797 39762 55028 59442 56835 58143 56254
16582E6254N387L175J1j5345j549P506j3035j2118m416l208n38R019n603m123
$$ 56254 61641 64816 64827 49482 47933 55439 42404 30286 25870 22662 22124 31143 25540 21417
16568B1417J8390j217p290j3996r227N071j800J2764N791p552K83M029j2151n117
$$ 21417 39807 38590 31300 17304 8077 13148 11348 24112 29903 22351 22634 26663 14512 9395
16554I395M857K330Q488j640q018n518Q349j41K604Q775n026o904Q591P977Q853
$$ 9395 14252 16582 25070 23430 15412 9894 18243 18102 20706 29481 24455 17551 26142 34119 42972
16539D2972q097j3756K219j8318Q328Q383N682n044J155l543m077o166J3194K2066
$$ 42972 34875 21119 23338 5020 13348 21731 27413 22369 23524 19981 15904 9738 22932 44998
16525D4998k649L441o729l168K9753K4683L6804P0235Q9089Q5552O4325N8658
$$ 44998 42349 45790 39061 35893 65646 90329 127133 197368 286457 372009 436334 494992
16513D94992O9048N1879k2845m5637k5505r986l5373r3482r7196n8925l5637j5724
$$ 494992 564040 615919 593074 547437 521932 511946 476573 383091 285895 226970 191333 175609
16501A75609m349p119K3312K1607L8856P2800P2407N8829L6006M0599L9903N535
$$ 175609 171260 164141 187453 209060 247916 320716 393123 451952 487958 528557 568460 573995
16489E73995l9177l2367k9118k9164o1939q0398p4567l5933k7845k6834k0884
$$ 573995 534818 502451 473333 444169 382230 301832 227265 191332 163487 136653 115769
16478A15769j7950k3724n77K274Q505j92p19P94q813k0375j2980O121J1162l782
$$ 115769 97819 74095 73518 75792 84297 84105 83386 84180 75367 54992 42012 48133 59295 55513
16464E5513o92l332l471N092j103R421l829j0269j994j055r735M352R839P993
$$ 55513 54821 51489 48018 53110 52007 61428 57599 47330 45336 44281 34546 38898 48737 56730
16450E6730J2535Q567l339q034m076K019L680j4061p50J3982k0245p706r43J899
$$ 56730 69265 77832 74493 66459 62383 64402 68082 54021 53271 67253 47008 39302 38359 40258
16436D0258k2686R047J1333p226j9319N545L553o112n74R4j2795J0188L0548k027
$$ 40258 17572 26619 37952 30726 11407 16952 20505 14393 13819 13913 1118 11306 41854 39827
16422C9827o639L228n288j1511j072N250q873k505O777L742O273O677j0079k5063
$$ 39827 33188 36416 31128 19617 18545 23795 14922 12417 19194 22936 29209 35886 25807 744
16408G44p405K2407K4628J887m157R39j0288r718j0266j0888j2127J61j299j067
$$ 744 -6661 15746 40374 42261 38104 39043 28755 19037 8771 -2117 -14244 -14083 -15382 -16449
16394a6449J3500K1639o204q926j1651L679L416Q845L177Q123J706j6660j0347
$$ -16449 -2949 18690 12486 3560 -8091 -4412 -996 7849 11026 19149 20855 4195 -6152
16381f152L453J0070N888L962R05J5749P225L764K383N149J5448J5401J0496L3852
$$ -6152 -2699 7371 13259 17221 18126 33875 41100 44864 47247 52396 67844 83245 93741 127593
16367A27593P2149Q1669N9474L0047J4905P595j1511o5067o9301l2416j4873L4358
$$ 127593 199742 281411 340885 370932 385837 393432 381921 316854 247553 215137 200264 234622
16355B34622P2940P3321L1953J2503R059J7348k3051p6771m5558J0639N9615M1586
$$ 234622 307562 380883 412836 425339 434398 451746 428695 351924 306366 317005 376620 418206
16343D18206K7161l910o448p540n5840p7047m0568k1603J4117M8347N2702L4626
$$ 418206 445367 441457 435009 427469 371629 294582 254014 232411 246528 294875 347577 382203
16331C82203J5186j425J1058k7420q8193p9497l9070j9468j7137j6185k6735r802
$$ 382203 397389 395964 407022 379602 291409 211912 172842 153374 136237 120052 93317 83515
16319H3515J02J0084O730l744j1679J4329k0010k1745m648J3540n42k139q490
$$ 83515 83617 93701 100431 96687 85008 99337 79327 57582 52934 66474 65932 63793 55303
16306E5303q105J3812k091o964j1495j1683o802K142R416j825p662p754O114R757
$$ 55303 47198 61010 58919 51955 40460 28777 21975 24117 33533 31708 24046 16292 22406 32163
16292C2163l521j0550o666L455j2526M264J2910j189q677P158N833p457j1364
$$ 32163 28642 18092 11426 14881 2355 6619 19529 18340 9663 16821 22654 15197 3833
16279C833j210Q136o482L889j848N25M602m024K297p896p229L03J1159P650K572
$$ 3833 2623 10759 4277 8166 6318 6843 11445 7421 9718 1822 -5407 -5104 6055 13705 16277
16264A6277j1060j4423j2633k049J4829K6989J4637p913j3732J274m525k876R479
$$ 16277 5217 -9206 -21839 -23888 -9059 17930 32567 24654 10922 12196 7671 4795 14274
16251A4274k391n155m220k784p43L471j687p267m370J3171r783j0980M445R692
$$ 14274 11883 6728 2508 -276 -1019 2452 765 -6502 -10872 2299 -7484 -18464 -14019 -4327
16237d327J2378J2733j1664j4738j2251N356J550O715K360J988j936K432R90O169
$$ -4327 8051 20784 9120 -5618 -17869 -12513 -10963 -4248 -1888 100 -1836 596 1586 7755
16223G755P014k031J81k350j5613L315j4118j669R243K043J126J1810l494n915
$$ 7755 14769 12738 12919 10569 -5044 -1729 -15847 -17516 -8273 -6230 -5104 6706 3212 -2703
16209b703n435j564M247o729L664n610l661J651j5217O93J4900J1556K316J3761
$$ -2703 -8138 -9702 -5455 -12184 -8520 -14130 -17791 -16140 -31357 -30664 -15764 -4208 -1892 11869
16195A1869p786k2456k355K0022P667j4122j3056j0302M139K1474P228r881j116
$$ 11869 4083 -18373 -20728 -706 6961 -7161 -20217 -30519 -26380 -4906 2322 -7559 -8675
16182h675L913J2825L813m808m136M94p620q927J145m839r524N785Q062k78L857
$$ -8675 -4762 8063 11876 7068 2932 3426 -4194 -13121 -11976 -16815 -26339 -20554 -12492 -12770 -8913
16167h913L865n426m468o570J5301K0523k67j7041j0877L749L663O916p64n39
$$ -8913 -5048 -10474 -14942 -21512 -6211 14312 14045 -2996 -13873 -10124 -6461 455 -309 -848
16153h48L882M117P847p597k129m832j4382l345J233K4943J0399o436k2688j4068
$$ -848 3034 7151 14998 7401 5272 440 -13942 -17287 -16054 8889 19288 12852 -9836 -23904
16139b3904k612l377N323L991M738p996J390N560j0099j3481J755p310N791K1345
$$ -23904 -26516 -29893 -24570 -20579 -15841 -23837 -22447 -16887 -26986 -40467 -38712 -46022 -40231 -18886
16125a8886J750j0419J601M712K581j0645m634N095K0930J9944n87R0r662j889
$$ -18886 -17136 -27555 -25954 -21242 -18661 -29306 -33940 -28845 -7915 12029 11442 11532 1870 -19
16111a9o5J2318n237k092J196p894j2319n331N448nj0228k913J2602J6189M867
$$ -19 -84 12234 6997 4905 6101 -1793 -14112 -19443 -13995 -14000 -24228 -27141 -14539 1650 6517
16096F517K91L953r596j9804M202m474l783j614L156L138j070O755J797j0456
$$ 6517 6808 10761 1165 -18639 -14437 -18911 -22694 -24308 -21152 -18014 -19084 -12329 -10532 -20988
16082b0988j3425r892J6737R954P812p910q074k557L604M088J157K689o841O057
$$ -20988 -34413 -44305 -27568 -17614 -9802 -17712 -25786 -28343 -24739 -20651 -19494 -16805 -23646 -17589
16068a7589J0674k953o762K074R453k476K802M827J945J957M275N520o636j1483
$$ -17589 -6915 -9868 -16630 -14556 -5103 -7579 -4777 50 1995 3952 8227 13747 7111 -4372
16054d372o3M91o294j2527j154R707J4380N859N470j6547l497j493Q364n527n042
$$ -4372 -4435 -3944 -10238 -22765 -23919 -14212 168 6027 11497 -5050 -8547 -10040 -1676 -7203 -12245
16039a2245J946p152J8509L659q706j874O802j6115j776J6851J3055n00m334q242
$$ -12245 -10299 -17451 1058 4717 -3989 -5863 939 -15176 -16952 -101 12954 12454 8120 -122
16025a22j2213q598k071j416L412J9136l121j884k418l182q358J739N297p07p765
$$ -122 -12335 -20933 -23004 -24420 -21008 -1872 -4993 -6877 -9295 -12477 -20835 -19096 -13799 -14506 -22271
16010b2271k1878J504J7122J8698Q37p028o684J0127m945J858O225j0102q459
$$ -22271 -44149 -42645 -25523 -6825 -5988 -13016 -19700 -9573 -14518 -12660 -6435 -16537 -24996
15997b4996N543J2895P863R212p318r678j2069K387P962O61j520L64q251j0585
$$ -24996 -19453 -6558 1305 10517 3199 -6479 -18548 -16161 -8199 -7538 -9058 -8694 -16945 -27530
15983b7530N677L170L006m761k073j2241M457R72J2033K533n999j5302o293J9420
$$ -27530 -21853 -18683 -15677 -20438 -22511 -34752 -30295 -29323 -17290 -14757 -20756 -36058 -42351 -22931
15969b2931Q334J3563J4519K892j2308j8353L475K31N33j639K845L933o429P666
$$ -22931 -14597 -1034 13485 16377 4069 -14284 -10809 -10578 -10045 -11684 -8839 -4906 -11335 -3669
15955c669p981o036N261O956K183O295j6700J248l748p794o666N23M007m574J3922
$$ -3669 -11650 -17686 -12425 -5469 -3286 3009 -13691 -12443 -16191 -23985 -30651 -30128 -26121 -30695 -16773
15940a6773M931m970j5595L344J2024J1490L969n833j6305p129J2038K485m453
$$ -16773 -11842 -16812 -32407 -29063 -17039 -5549 -1580 -7413 -23718 -30847 -18809 -16324 -20777
15927b0777K788Q757L859l932k624j144n541J6496J2967q012k0499p572r50J371
$$ -20777 -17989 -9232 -5373 -9305 -11929 -13073 -18614 -2118 10849 2837 -17662 -25234 -26184 -24813
15913b4813P415J0587J9420j23Q128j7152r055l795r887L360J7356J0982k738
$$ -24813 -17398 -6811 12609 12486 20614 3462 -5593 -9388 -19275 -15915 1441 12423 9685
15900I685J39j6420o744m975K157j377L02k421P054m388l9j8197j482J2818p49
$$ 9685 9824 -6596 -13340 -18315 -16158 -17535 -17233 -19654 -12600 -16988 -17027 -35224 -36706 -23888 -24637
15885b4637j2041n033K871J0909J851M088J0871N212j3133m410m954J1629R414
$$ -24637 -36678 -41711 -38840 -27931 -26080 -21992 -11121 -5909 -19042 -23452 -28406 -16777 -7363
15872g363N099k416k031j639O755N77n07n527j1383Q697K1075N7p528q07o447
$$ -7363 -2264 -4680 -6711 -8350 -1595 -1018 -1525 -7052 -18435 -9738 11337 11394 3866 3059 -3388
15857c388m258l30K0325J317k5398o02J1839N504N31j2662j997N128j0143o906
$$ -3388 -7646 -7976 12349 13666 -11732 -12334 -495 5009 5540 -7122 -9119 -3991 -14134 -21040
15843b1040j112J774j0177j0834O71L0662O546j0350j3866K219N687J6406m383
$$ -21040 -22152 -20378 -30555 -41389 -40718 -10056 -3510 -13860 -27726 -25507 -19820 -3414 -7797
15830g797p386P995Q277m013r828R865j128R63o888k14Q94K226o955J823Q951
$$ -7797 -15183 -7188 1089 -2924 -12752 -2887 -4015 -3052 -9940 -10154 -9260 -7034 -13989 -12166 -3215
15815c215J1627N500q677j444K940j8643j791L382r0J7481M822j7717j6924P35
$$ -3215 8412 13912 5235 3791 6731 -11912 -13703 -10321 -10411 7070 11892 -5825 -22749 -22014
15801b2014o632K188J3657K551n245j520K07p624Q253J8772r53n727M05o694L111
$$ -22014 -28646 -26458 -12801 -10250 -15495 -17015 -16808 -24432 -16179 2593 1640 -4087 -3682 -10376 -7265
15786g265J0976k1620J779R718J1033K818q485N864j1687j0248m16O461L495j0781
$$ -7265 3711 -17909 -16130 -6412 4621 7439 -1046 4818 -6869 -17117 -17533 -11072 -7577 -18358
15772a8358j4375K205Q014J0081J0346k611j2457R591J2776l461r665M471J6955
$$ -18358 -32733 -30528 -22514 -12433 -2087 -4698 -17155 -7564 5212 1751 -7914 -3443 13512
15759A3512P26l384j768j0055l81L088N359o701j0937k1600n702J2315l047M298
$$ 13512 14238 10854 9086 -969 -1350 1738 7097 396 -10541 -32141 -37843 -25528 -28575 -24277
15745b4277J8909J2903p531n510L818j475q253Q243o86k491K991K314N69J249
$$ -24277 -5368 7535 4 -5506 -1688 -3163 -11416 -3173 -3859 -6350 -3359 -1045 -476 773
15731G73r255M512q301m690k840N149m183o219l962J5053K1382K045m82m686j5622
$$ 773 -8482 -3970 -12271 -16961 -19801 -14652 -18835 -25054 -29016 -13963 7419 9464 8982 4296 -11326
15716a1326j4222Q559P351k404j1797j1339L914l12l235j4572P381K0702J2342
$$ -11326 -25548 -16989 -9638 -12042 -23839 -35178 -31264 -31576 -34811 -49383 -42002 -21300 -8958
15703h958J5912j464j1299N153J4180J196j0937k743o786M816Q527q683J3510
$$ -8958 6954 5490 -5809 -656 13524 14720 3783 1040 -5746 -930 7597 -1086 12424
15690A2424j9166j8940m483N989M532R88N245N687K96l279o87p894M187J2956
$$ 12424 -6742 -25682 -30165 -24176 -19644 -18656 -13411 -7724 -7428 -10707 -11394 -19288 -15101 -2145
15676b145k98j4386q657J3272j946P118K927P984l453p343n516j821r053j6198
$$ -2145 -2443 -16829 -25486 -12214 -14160 -7042 -4115 3869 416 -6927 -12443 -14264 -23317 -39515
15662c9515O253J3074J5500K328r589j361M485Q1k578o249j887J2743O844j3656
$$ -39515 -33262 -20188 -4688 -2360 -11949 -13310 -8825 -8744 -11322 -17571 -19458 -6715 129 -13527
15648a3527j302k049N796P208o708L643K308k401N90q649q303q440N670k375l678
$$ -13527 -14829 -16878 -11082 -3874 -10582 -6939 -4631 -7032 -6442 -15091 -23394 -31834 -26164 -28539 -32217
15633c2217L552n129R520J8826O627j306r459j4252n289N288O467N206k437O028
$$ -32217 -28665 -33794 -24274 -5448 1179 -127 -9586 -23838 -29127 -23839 -17372 -12166 -14603 -8575
15619h575k460n540O088j812R659o499K889k39Q464L898n03j1208m116j2750o944
$$ -8575 -11035 -16575 -10487 -12299 -2640 -9139 -6250 -6489 1975 5873 5370 -5838 -9954 -22704 -29648
15604b9648L480p072l534J5684J9540j1653j1179K348n375N171j472n253m714
$$ -29648 -26168 -33240 -36774 -21090 -1550 -13203 -24382 -22034 -27409 -22238 -23710 -28963 -33677
15591c3677o686K3583J8931M498k967L775k06j0652Q04P470l602r475l48n659
$$ -33677 -40363 -16780 2151 6649 3682 7457 7251 -3401 -2597 4873 1271 -8204 -8552 -14211
15577a4211j2353K2010q405Q02m785R51r724j3182J4305L684q567j3992q415n621
$$ -14211 -26564 -4554 -12959 -12157 -16942 -15991 -25715 -38897 -24592 -20908 -29475 -43467 -51882 -57503
15563e7503J1561L841M794P436k276j1407L256K1681R587J188M716J598K00r446
$$ -57503 -45942 -42101 -37307 -29871 -32147 -43554 -40298 -18617 -9030 -7842 -3126 -1528 -1328 -10774
15549a0774n42r086J014Q081r566O58K559n219j1303N07m63P520l224o27K201
$$ -10774 -11316 -20402 -19388 -11307 -20873 -20215 -17656 -22875 -34178 -33671 -34134 -26614 -29838 -30465 -28264
15534b8264J0432N252L781k976J2873K32j4715j1743r860p18M318o010k129P628
$$ -28264 -17832 -12580 -8799 -11775 1098 1330 -13385 -25128 -34988 -35706 -31388 -37398 -39527 -31899
15520c1899M607P264L645j5387l09N491J109J1378O114k907o33O592n368r354
$$ -31899 -27292 -20028 -16383 -31770 -32079 -26588 -25479 -14101 -7987 -10894 -11527 -4935 -10303 -19657
15506a9657K135l077j192N741J2332p549r486m966o615l835O69P783L5784J1470
$$ -19657 -17522 -20599 -21791 -16050 -3718 -11267 -20753 -25719 -32334 -36169 -35500 -27717 8067 19537
15492A9537j2680p594R210l801q257j1988k351j0465J119K983p451j953K5153
$$ 19537 6857 -737 8473 4672 -3585 -15573 -17924 -28389 -27270 -24287 -31738 -33691 -8538
15479h538K176M62j104r023M273o109n278L945j720O711J8265k572j3897j477
$$ -8538 -6362 -5900 -7004 -16027 -11754 -17863 -23141 -19196 -20916 -14205 4060 1488 -12409 -13886
15465a3886M720m352k204N074Q43O167M573j584l677M759N048r23p792J0915j0814
$$ -13886 -9166 -13518 -15722 -10648 -9805 -3638 935 -649 -4326 433 5481 4558 -3234 7681 -3133
15450c133q281J3390M023r498K588p598l056l753j611P107O665K057k344J2682
$$ -3133 -11414 1976 5999 -3499 -911 -8509 -11565 -15318 -16929 -9822 -3157 -1100 -3444 9238
15436I238j0571j2284K179J4304p032j2006o997L493O503L52R723L28l195p175
$$ 9238 -1333 -13617 -11438 2866 -4166 -16172 -23169 -19676 -13173 -12821 -3098 -2770 -5965 -13140
15422a3140N001J222J055l333m944J5511Q981j9247j2625K331r349n619J6740
$$ -13140 -8139 -6917 -5862 -9195 -14139 1372 10353 -8894 -21519 -19188 -28537 -34156 -17416
15409a7416L979N423R551k238p945j088j019L734P090n642l274N828o26P006j8
$$ -17416 -13437 -8014 1537 -701 -8646 -9734 -10753 -7019 71 -5571 -8845 -3017 -3643 3363 3345
15394C345k16j1858j6120o342N909L324J0268J1672l232j412q567o938K923J0172
$$ 3345 3129 -8729 -24849 -31191 -25282 -21958 -11690 -18 -3250 -4662 -13229 -20167 -17244 -7072
15380g072M549Q778q044j4721p20p155J1525R911P248o130r714J2954j2250l897
$$ -7072 -2523 6255 -1789 -16510 -17230 -24385 -12860 -2949 4299 -1831 -11545 1409 -10841 -14738
15366a4738j346j744j483M375N243k458M50L382k0857j5797P822J5096N845K668
$$ -14738 -16084 -17828 -19311 -14936 -9693 -12151 -11701 -8319 -29176 -44973 -37151 -22055 -16210 -13542
15352a3542l842O949k490N140j915n192K861j552L45m641m58p026m50j889M934
$$ -13542 -17384 -10435 -12925 -7785 -9700 -14892 -12031 -13583 -13238 -17879 -18337 -25363 -25813 -27702 -22768
15337b2768J1958R700N955k436p664k27R929N07j0408p099J0307p500O19P974
$$ -22768 -10810 -1110 4845 2409 -5255 -5482 4447 4954 -5454 -12553 -2246 -9746 -9127 -1153
15323a153R31K859o627M495m01j1899p550j0599P785J6959O407j2943J9780j405
$$ -1153 -222 2637 -3990 505 104 -11795 -19345 -29944 -22159 -5200 1207 -11736 8044 6639
15309F639K781r449j0750L364j3175j1012J2852l889M446j0463P562J4736R574
$$ 6639 9420 -29 -10779 -7415 -20590 -31602 -18750 -22639 -18193 -28656 -21094 -6358 3216
15296C216N501l57n425m703m28j0984p439M143J5381L214j3445j528O399q320
$$ 3216 8717 8360 2935 -1768 -2196 -13180 -20619 -16476 -1095 2119 -11326 -12854 -6455 -14775
15282a4775m3J730M49J5679L325o326J2142O629j5237k2357M712R30m719J0350
$$ -14775 -14818 -13088 -12639 3040 6365 39 12181 18810 3573 -18784 -14072 -13142 -17861 -7511
15268g511J9709J1662n859Q721J908q38k7201M215j2527p274N442P786K584K624
$$ -7511 12198 23860 18001 26722 28630 27792 591 4806 -7721 -14995 -9553 -1767 817 3441
15254C441q876q936m931o490J1827Q370r82J8998m186l585j537r49K068m350q507
$$ 3441 -5435 -14371 -19302 -25792 -13965 -5595 -6577 12421 8235 4650 3113 2164 4232 -118 -8625
15239h625o898o260Q178N420J1232n505j237j2829K668Q441O002o3J2655O672
$$ -8625 -15523 -21783 -13605 -8185 3047 -2458 -3695 -16524 -13856 -5415 587 524 13179 19851
15225A9851j6172k0315j283R372m77K809K078p669k406N745m53j287l229r750
$$ 19851 3679 -16636 -17919 -8547 -9024 -6215 -4137 -11806 -14212 -8467 -8920 -10207 -13436 -23186
15211b3186J95J219k640M858L809K106o371L046R629j1778P497J5003K0029J685
$$ -23186 -22991 -21772 -24412 -19554 -15745 -13639 -20010 -16964 -7335 -19113 -11616 3387 23416 25101
15197B5101j3291j2607J306m748Q476o093l251P230j9134j1954J2139M482R215
$$ 25101 11810 -797 509 -4239 4237 -1856 -5107 2123 -17011 -28965 -16826 -12344 -3129
15184c129O26j1885j3878o323n790J860p694J1445N724Q961J513k833o403k57
$$ -3129 -2503 -14388 -28266 -34589 -40379 -38519 -46213 -34768 -29044 -20083 -18570 -21403 -27806 -28063
15170b8063l94O505J2098k324K795Q165r136n478r899Q080K0335P246k2430j1808
$$ -28063 -28457 -21952 -9854 -12178 -9383 -1218 -10354 -15832 -25731 -17651 2684 9930 -12500 -24308
15156b4308O079k843L964j741K211R737P41K255O378k082q425R505R975P953m759
$$ -24308 -18229 -21072 -17108 -18849 -16638 -6901 -6160 -3905 2473 391 -8034 1471 11446 19399 14640
15141A4640L46q644j446k873r25N7l288N359J0726j363j4407J0022J3799p03k719
$$ 14640 14986 6342 4896 2023 1098 1155 -2133 3226 13952 12589 -1818 8204 22003 21300 18581
15126A8581p304Q609n558r067o67n662j456j0626o161P45K59J18j2763o021Q387
$$ 18581 11277 19886 14328 5261 4594 -1068 -2524 -13150 -19311 -18566 -18307 -18189 -30952 -36973 -28586
15111b8586n587p826K707K4143J6246j3857r217K362J652R792Q02J858l375N229
$$ -28586 -34173 -41999 -39292 -15149 1097 -12760 -21977 -19615 -17963 -8171 -7369 -5511 -8886 -3657
15097c657j1020j0060J4554N023Q431K450k938R176j862q593M868Q797j033L144
$$ -3657 -14677 -24737 -10183 -5160 3271 5721 2783 11959 10097 1504 6372 15169 14136 17280
15083A7280j2368J651m323k760p65N223O907O516O61j0216M63J2100Q748r537
$$ 17280 4912 6563 2240 -520 -1285 3938 10845 17361 18022 7806 8269 20369 29117 19580
15069A9580j0811p461J2965m781j273N859j42n158j1480r135M586N475o234l429
$$ 19580 8769 1308 14273 9492 8219 14078 13936 8778 -2702 -11837 -7251 -1776 -8010 -11439
15055a1439J3380l601m944r502k190n028j170q537n779J2694K1549Q514j1816
$$ -11439 1941 -1660 -6604 -16106 -18296 -23324 -24494 -33031 -38810 -26116 -4567 3947 -7869
15042g869r934j335J7656O614P435J0054K872L39K816q352r654J0153P525M94
$$ -7869 -17803 -19138 -1482 5132 12567 22621 25493 25832 28648 20296 10642 20795 28320 28814
15028B8814l058o500l880M828m261j8648l748L96R055J4342n674K115m705r787
$$ 28814 25756 19256 15376 20204 15943 -2705 -6453 -6057 2998 17340 11666 13781 9076 -711
15014g11j4703J0914J3829M212m568p455p668l012r194l015J607K992l94o53M044
$$ -711 -15414 -4500 9329 13541 8973 1518 -6150 -9162 -18356 -21371 -19764 -16772 -17166 -17819 -13775
14999a3775n776R077O249M838N440J0013r005j4494J440L636P587q652r257j0606
$$ -13775 -19551 -10474 -4225 613 6053 16066 7061 -7433 -5993 -2357 5230 -3422 -12679 -23285
14985b3285L303L997J479J655L385k0j0707L407J3928n265L579J009k0452k2125
$$ -23285 -19982 -15985 -14506 -12851 -9466 -9486 -20193 -16786 -2858 -8123 -4544 -3535 -23987 -46112
14971d6112K1308R194L318O403L959j742p726J0956J3075m060j7537j4753o689
$$ -46112 -24804 -15610 -12292 -5889 -1930 -3672 -11398 -442 12633 8573 -8964 -23717 -30406
14958c0406J639n93Q096M077M048l398p618m038J0728o638L075K878l828j5066
$$ -30406 -28767 -29360 -21264 -17187 -13139 -16537 -24155 -28193 -17465 -24103 -21028 -18150 -21978 -37044
14944c7044j0376L370K3490K373n626M945J739l062p661o165n14J619K486K341
$$ -37044 -47420 -44050 -20560 -18187 -23813 -18868 -17129 -20191 -27852 -34017 -34531 -32912 -30426 -28085
14930b8085M26J965J5211K42J771P719R017N185r03k735J496j2270q00q661r294
$$ -28085 -27659 -25694 -10483 -10241 -8470 -751 8266 13451 12548 9813 11309 -961 -1761 -10422 -19716
14915a9716j063P495J667R146Q79j0448L816J0704j5805j1180j014M372Q460J503
$$ -19716 -20779 -13284 -11617 -2471 -1592 -12040 -8224 2480 -13325 -24505 -25519 -21147 -12687 -11184
14901a1184K153Q531j141p427L489j462q413m840J1117j097o555L825J973q669
$$ -11184 -9031 -500 -1641 -9068 -5579 -7041 -15454 -20294 -9177 -10274 -16829 -13004 -11031 -19700
14887a9700r310J6174L403J0877K037l328J686N801k930L051k416j529K650j162
$$ -19700 -29010 -12836 -9433 1444 3481 153 1839 7640 4710 7761 5345 3816 6466 5304
14873E304L12J1199q830p647p137P266J3007N961l936m4j8918Q127k971L849J7382
$$ 5304 5616 16815 7985 338 -6799 467 13474 19435 15499 15455 -3463 4664 1693 5542 22924
14858B2924q719j1793L025P779J2805K789k975n338r496l953Q955O261J33p621
$$ 22924 14205 2412 5437 13216 26021 28810 25835 20497 11001 7048 16003 22264 22397 14776
14844A4776J973J4709o505k333N877j9080j2834J228K506K208j0080J2732J2428
$$ 14776 16749 31458 24953 22620 28497 9417 -3417 -2189 317 2525 -7555 5177 17605
14831A7605o007r294r186K778r087j0924O806O557J5799K244J9112R142j1848
$$ 17605 11598 2304 -6882 -4104 -13191 -24115 -17309 -10752 5047 7291 26403 35545 23697
14818B3697j060j1044L403J3814K87n110L129m822Q791M609l983j7263P35J389
$$ 23697 22637 11593 14996 28810 29097 23987 27116 22294 31085 35694 31711 14448 15183 16572
14804A6572j1865l904M630J1846j952J676K274M059p678r883j4886n462J3168
$$ 16572 4707 803 5433 17279 15327 17003 19277 23336 15658 5775 -9111 -14573 -1405
14791a405R994j705k052j674J220j7916k1J0272k795O66L395j3260P253K145o881
$$ -1405 8589 6884 4832 3158 4378 -13538 -13559 -3287 -6082 -5416 -2021 -15281 -8028 -5883 -12764
14776a2764o143o057Q481K671L291R19R05Q325J168p505n565q331n616J0806P206
$$ -12764 -18907 -24964 -16483 -13812 -10521 -9602 -8697 -372 796 -6709 -12274 -20605 -26221 -15415 -8209
14761h209o26j4260R336J9489R580r525k093k323j1535m53L882J2054R831l559
$$ -8209 -8835 -23095 -13759 5730 15310 5785 3692 1369 -10166 -10619 -6737 5317 15148 11589
14747A1589j4616o943K963N184M380l989q543q553J2215R131r41P575j065m373
$$ 11589 -3027 -9970 -7007 -1823 2557 -1432 -9975 -18528 -6313 2818 1877 9452 8387 4014
14733D014n873r406o836j3961J081Q353J8522O703k834L991N228L458j176j0399
$$ 4014 -1859 -11265 -18101 -32062 -30981 -22628 -4106 2597 -237 3754 8982 12440 11264 865
14719H65q027N770K330o819p69l685l520J591o944m563J2191o317N920N727J259
$$ 865 -7162 -1392 938 -5881 -6650 -10335 -13855 -12264 -19208 -23771 -11580 -17897 -11977 -6250 -4991
14704d991r907q302L630Q127k308J345p533m650P680p798J3303K1210l278l747
$$ -4991 -14898 -23200 -19570 -11443 -13751 -12406 -19939 -24589 -16909 -24707 -11404 9806 6528 2781
14690B781j817k353P901j187j3752K083M120p186j2971J4834m517N176J5727R600
$$ 2781 964 -1389 6512 5325 -8427 -6344 -2224 -9410 -22381 -7547 -12064 -6888 8839 18439
14676A8439q923l482j1740j9363R864J1068J241J22J5106M137j3592k537m277
$$ 18439 9516 6034 -5706 -25069 -15205 -4137 -2896 -2774 12332 16469 2877 340 -3937
14663c937O402J1859R37k560J449k0282j8019l429N582P712N408p556M741L702
$$ -3937 2465 14324 15261 12701 14150 -6132 -24151 -27580 -21998 -14286 -8878 -16434 -11693 -7991
14649g991O742j4865j0267O970J2831J670r981O929K191r776j2578K627J4390
$$ -7991 -1249 -16114 -26381 -19411 -6580 -4910 -14891 -7962 -5771 -15547 -28125 -25498 -11108
14636a1108R784j0204k123n426q464K849N389J1785l742J248J0950o082j369q07
$$ -11108 -1324 -11528 -13651 -19077 -27541 -24692 -19303 -7518 -11260 -10012 938 -5144 -6513 -7320
14622g320q371j61P939J1423J5548p211j8137j6098j3051R961K058L019M464r401
$$ -7320 -15691 -15852 -7913 3510 19058 11847 -6290 -22388 -35439 -25478 -23420 -20401 -15937 -25338
14608b5338L776k542K433j2884L634K3514N452n468O219P018J157j1279N761J4113
$$ -25338 -21562 -24104 -21671 -34555 -30921 -7407 -1955 -7423 -1204 5814 6971 -4308 1453 15566
14594A5566Q010m566l672j0923r8J1322r93q091k186N195p235O051K10P569r63
$$ 15566 23576 19010 15338 4415 4317 15639 14646 6555 4369 9564 2329 8380 8590 16159 15196
14579A5196O813P61j4926q193k0890l637M440O306O596R223L246p233P90J2623
$$ 15196 22009 22770 7844 -349 -21239 -24876 -20436 -14130 -7534 1689 4935 -2298 -1508 11115
14565A1115K036n595l879k3722r174J1354J5328J0330J3466P02O721j6353p292
$$ 11115 13151 7556 3677 -20045 -29219 -17865 -2537 7793 21259 21961 28682 12329 5037
14552E037L506j0034k1535j4518L816K846J2904J9451j4385k0797p791J6264K9686
$$ 5037 8543 -1491 -23026 -37544 -33728 -30882 -17978 1473 -12912 -33709 -41500 -25236 4450
14539D450n340k654K232R097o961p531q401J3509j4054J0852L540m179O711J5250
$$ 4450 -890 -3544 -1312 7785 824 -6707 -15108 -1599 -15653 -4801 -1261 -5440 1271 16521
14525A6521J509j965j4825j7162j0173O432K350L469J9076m432j5812M990n974
$$ 16521 18030 16065 1240 -15922 -26095 -19663 -17313 -13844 5232 800 -15012 -10022 -15996
14512a5996j3384l56j0939N613M165M158Q139m6q681O325Q775R652q56l808J709
$$ -15996 -29380 -29736 -40675 -35062 -30897 -26739 -18600 -18646 -27327 -21002 -12227 -2575 -3431 -7239 -5530
14497e530J548n23k93q324o875Q623J2759p386j5955M424Q996J216o344N813j1120
$$ -5530 -3982 -4505 -4798 -13122 -19997 -11374 1385 -6001 -21956 -17532 -8536 -7320 -13664 -7851 -18971
14482a8971P577J4410l54R343j1642j1334j5532k0513k746J6924J9752J1804P613
$$ -18971 -11394 3016 2662 12005 363 -10971 -26503 -47016 -49762 -32838 -13086 -1282 6331
14469F331L507J268O017k0721j1943N117P917R484R609Q410j3504m815L091P838
$$ 6331 9838 11106 17123 -3598 -15541 -10424 -2507 6977 16586 24996 11492 6677 9768 17606
14455A7606J696j0033q04Q38k292J525m841n796P823m739l15m072P137J333o315
$$ 17606 19302 9269 8465 9303 7011 8536 3695 -2101 5722 983 668 -3404 3733 5066 -1249
14440a249j8140Q284k040m864n620p403l98J2759P14j2554J216l163j804N535
$$ -1249 -19389 -11105 -13145 -18009 -23629 -31032 -31430 -18671 -17957 -30511 -29295 -32458 -34262 -28727
14426b8727j4492J887q636l062J7223J200K981J0453J0366O717J416n977p587
$$ -28727 -43219 -41332 -49968 -53030 -35807 -34607 -31626 -21173 -10807 -4090 -2674 -8651 -16238
14413a6238o414M764M844J0898O372l277p858N631J0841o895j555r93j063O620
$$ -16238 -22652 -17888 -13044 -2146 4226 949 -6909 -1278 9563 2668 1113 120 -943 5677
14399E677P058j147R464q648m982J1744J416J617M755j7406j5511Q303o67m781
$$ 5677 12735 11588 21052 12404 7422 19166 20582 22199 26954 9548 -5963 2340 1673 -3108
14385c108J7634j4508l538o219j0786J3633O969m838q321j3325p156j247J0676
$$ -3108 14526 18 -3520 -9739 -20525 -6892 77 -4761 -13082 -26407 -33563 -34810 -24134
14372b4134N847J095j1297j6016J1948J6109J909O324l316j522m480q891n692
$$ -24134 -18287 -17192 -28489 -44505 -32557 -16448 -14539 -8215 -11531 -13053 -17533 -26424 -32116
14359c2116m573L56J0106L696R046R359j014m941K283Q316q949N254N910o269
$$ -32116 -36689 -36333 -26227 -22531 -13485 -4126 -5140 -10081 -7798 518 -8431 -3177 2733 -3536
14345c536j01L91m578j2248j1538K445R756k468k849K819J0192p29n024M574J5528
$$ -3536 -3637 -3246 -7824 -20072 -31610 -29165 -19409 -21877 -24726 -21907 -11715 -12444 -17468 -12894 2634
14330B634Q932l32j5306o851Q60o39k918Q560N839Q472j409m147j5685o012k024
$$ 2634 11566 11234 -4072 -10923 -10063 -10702 -13620 -5060 779 9251 7842 3695 -11990 -18002 -20026
14315b0026j968J615J0858O432q546O084M940r690j3127K675Q496J0283p757j565
$$ -20026 -21994 -20379 -9521 -3089 -11635 -5551 -611 -10301 -23428 -20753 -12257 -1974 -9731 -11296
14301a1296J1911l914k40J3441p361k0485l340O59J1917l569n610p414J0804J655
$$ -11296 615 -3299 -3539 9902 2541 -17944 -21284 -20625 -8708 -12277 -17887 -25301 -14497 -12842
14287a2842q147R500N8j0229J1637J8464q860j3144n077K991P883l188j3137l253
$$ -12842 -20989 -11489 -11431 -21660 -10023 8441 -419 -13563 -18640 -15649 -7766 -10954 -24091 -27344
14273b7344J0497N279J7775J964j327N27L614r418k075J102J3126J850n618j4473
$$ -27344 -16847 -11568 6207 8171 6844 7371 10985 1567 -508 594 13720 15570 9952 -4521
14259d521p985q033N03P683k09L651n403r578j1174j652J1854L829k187J2981
$$ -4521 -12506 -20539 -20036 -12353 -12562 -8911 -14314 -23892 -35066 -36718 -24864 -21035 -23222 -10241
14245a0241O497L689n09l783P85N338J1030K740k842r281q38N814p221j2598J89
$$ -10241 -3744 -55 -564 -4347 -3562 1776 12806 15546 12704 3423 2585 8399 1178 -11420 -11231
14230a1231K861m746J2326K492l438J6388R063j7041m528J1527j0610l090P903
$$ -11231 -8370 -13116 -790 1702 -1736 14652 23715 6674 2146 13673 3063 -27 7876
14217G876j008k283m988n943k267K319J152P178l293M507J5958Q863R603o009
$$ 7876 6868 4585 -403 -6346 -8613 -6294 -5142 2036 -1257 3250 19208 28071 37674 31665
14203C1665k7979j5246o662k030J3146j647M439n228p75j1896l778O961j430N938
$$ 31665 3686 -11560 -18222 -20252 -7106 -8753 -4314 -9542 -10317 -22213 -25991 -19030 -20460 -14522
14189a4522L643q708K894Q271k6o508o169J0720j1776k4356K337K3408P732o720
$$ -14522 -10879 -19587 -16693 -8422 -8448 -14956 -21125 -10405 -22181 -46537 -44200 -20792 -13060 -19780
14175a9780J2302M537K492P959k628m215k585L238J1231p147q930j4942M049O540
$$ -19780 -7478 -2941 -449 7510 4882 667 -1918 1320 12551 5404 -3526 -18468 -14419 -7879
14161g879j1011K249p62R334J0014K970j2811m342n702r94J7419M99P748k238
$$ -7879 -18890 -16641 -17403 -8069 1945 4915 -7896 -12238 -17940 -18934 -1515 -1016 6732 4494
14147D494j4706J858m94Q096J0794k0747j1879L671K361J0638K368K319L850j2331
$$ 4494 -10212 -8354 -8848 -752 10042 -10705 -22584 -18913 -16552 -5914 -3546 -1227 2623 -9708
14133i708k792J3095P094pq413n257k0793j405J0643L051o278r473O188j19L926
$$ -9708 -12500 595 7689 7682 -731 -5988 -26781 -28186 -17543 -14492 -20770 -30243 -24055 -24174 -20248
14118b0248J1610L278n012l798m31P732P44j6685k0248K056R071L247Q674r375
$$ -20248 -8638 -5360 -10372 -14170 -14601 -6869 -6125 -22810 -43058 -41002 -31931 -28684 -20010 -29385
14104b9385J262K916L341p976J285L728j4474k541k94K74Q450P593R307l892L736
$$ -29385 -28123 -25207 -21866 -29842 -28557 -24829 -39303 -41844 -42138 -41864 -33414 -25821 -16514 -20406 -16670
14089a6670J2151j2391j2809O301J0654n932k69M085J5064K2336p765j6432m467
$$ -16670 -4519 -16910 -29719 -23418 -12764 -18696 -18965 -14880 184 22520 14755 -1677 -6144
14076f144o436l692O791n433o839O197j2133n671J7390J1347P064M21K225K545
$$ -6144 -12580 -16272 -9481 -14914 -21753 -15556 -27689 -33360 -15970 -4623 2441 2862 5087 7632
14062G632p42q305j3558Q541J0566Q76J900j702n669O260K616M984J3271k549
$$ 7632 6890 -1415 -14973 -6432 4134 5010 6910 5208 -461 5799 8415 13399 26670 24121
14048B4121n269J7913N003r557n647l673R885L720J160J252R605J1311q012j37
$$ 24121 18852 36765 41768 32211 26564 22891 32776 36496 37656 38908 48513 59824 51812 51675
14034E1675N340J232M426K422N759P713R060P495Q14j500L002J0270M815o147
$$ 51675 57015 58247 62673 65095 70854 78567 87627 95122 95936 94436 97438 107708 112523 106376
14020A06376r53m15J9146o947k5019j256o01N79J285q896L548L617l796l758L166
$$ 106376 105423 105008 124154 117207 92188 90932 90331 90910 92195 83299 86847 90464 86668 82910 86076
14005H6076O480n842M440L224m513J1716J110l369j7384j321Q118j439k533o130
$$ 86076 92556 86714 91154 94378 89865 101581 102691 99322 81938 80617 88735 87296 84763 78633
13991G8633j2018q952o341o649j8349J657J3064O051j8060n339P190J7019K838
$$ 78633 66615 57663 51322 44673 26324 27981 41045 47096 29036 23697 30887 47906 50744
13978E0744j0651j1481o621j180P654P963K819M400J4437M487p855j1516j4490
$$ 50744 40093 28612 21991 20811 28465 36428 39247 43647 58084 62571 54716 43200 28710
13965B8710j1486r912q493j285j2065m39q936q558J8139J5720m754m250Q166J1414
$$ 28710 17224 7312 -1181 -2466 -14531 -14970 -23906 -32464 -14325 1395 -3359 -7609 557 11971
13951A1971Q32m142p222l194K738l312j693n143L668N990j05N943k116J945r419
$$ 11971 12803 8661 1439 -1755 983 -2329 -4022 -9165 -5497 493 388 6331 4215 6160 -3259
13936c259r4K1018r699j3439O320M13j9584Q283J3665Q123k618j0534p286P23
$$ -3259 -3353 17665 7966 -5473 847 1260 -18324 -10041 3624 11747 9129 -1405 -8691 -7968
13922g968K864O110l53p642l795Q108P466j650q630Q556Q041K11m160l575L755
$$ -7968 -5104 1006 653 -6989 -10784 -2676 4790 3140 -5490 3066 11107 11318 7158 3583 7338
13907G338J4057j134r726o989l970P999j0293j4710N697n7m667l006q297q41Q905
$$ 7338 21395 20261 10535 3546 -424 7575 -2718 -17428 -11731 -11788 -16455 -19461 -27758 -28599 -19694
13892a9694P211q837O617O528p970M265K7945K209j4440K717K4378K5223m194
$$ -19694 -12483 -21320 -14703 -8175 -16145 -11880 16065 18274 3834 6551 30929 56152 51958
13879E1958R6J4244O368P059L812J0813K9702L2228J3579J3844J715J9672L1136
$$ 51958 52054 66298 72666 79725 83537 94350 124052 156280 169859 183703 185418 205090 236226
13866B36226L0305J0454R497K2986K0867J7480m79k399K062q841n436M777P243
$$ 236226 266531 276985 286482 309468 330335 347815 347336 344937 346999 338158 332722 337499 344742
13853C44742o97k3435o047N283j1746j9660j7718l2116k5372l2473j6337l636
$$ 344742 344045 320610 314563 319846 308100 288440 270722 238606 213234 180761 164424 160788
13841A60788j0992j582m456j2688j7876j7779m145m143p047j4124k0305j9881
$$ 160788 149796 148214 143758 131070 113194 95415 91270 87127 80080 65956 45651 25770
13829B5770q644J2951N87n485J1513M398N701Q096m980o325K125k5323j0603R261
$$ 25770 17126 30077 30664 25179 36692 41090 46791 54887 49907 43582 45707 20384 9781 19042
13815A9042K0167J1004j1347n683R955q741j4378j0492q734M535J2315J2076K015
$$ 19042 39209 50213 38866 33183 43138 34397 20019 9527 793 5328 17643 29719 31734
13802C1734J349o213l371n12j446M580n952o320N914J1524J3413O776N43q685
$$ 31734 33083 26870 23499 22987 21541 26121 20169 13849 19763 31287 44700 51476 52019 43334
13788D3334j6899n755O811j038P31J998L48j114K913Q865m040r367R872r560J0255
$$ 43334 26435 20680 27491 26453 27184 29182 29530 28416 31329 40194 36154 26787 36659 27099 37354
13773C7354N032J317q848k673m446N442l50m090L131o627L806P754l074q110q60
$$ 37354 42386 43703 34855 32182 27736 33178 32828 28738 31869 25242 29048 36802 33728 25618 24758
13758B4758n44p720k0097n706m772o09R908J3982M761L718R769j0984l600j289
$$ 24758 24214 16494 -3603 -9309 -14081 -14690 -4782 9200 13961 17679 27448 16464 12864 11575
13744A1575K527Q984N272n349R831J2867k970J633k571j2628j6212j7047j0999
$$ 11575 14102 23086 28358 23009 32840 45707 42737 44370 41799 29171 12959 -4088 -15087
13731a5087J6635J8949P869O740J345m425k057p514K746Q75L849J2738j332j4200
$$ -15087 1548 20497 28366 35106 36451 32026 29969 22455 25201 26076 29925 42663 41331 27131
13717B7131j3189r142P031k241j5342M07J4052J5676J9753j0078j4729L575Q506
$$ 27131 13942 4800 11831 9590 -5752 -5345 8707 24383 44136 34058 19329 22904 31410
13704C1410q6p244p749q070m27R342J2282K212j8128J058j650j777l983q02q144
$$ 31410 31324 24080 16331 8261 7834 17176 29458 31670 13542 14600 12950 11173 7190 6388 -1756
13689a756m288O542L449L246O894P893q716j5999r684o820J2910L520J132O554
$$ -1756 -6044 498 3947 7193 14087 21980 13264 -2735 -12419 -19239 -6329 -2809 -1677 4877
13675D877J3129N299j11j854r92l098j1843j0922J4957J9943M51n039J696n16
$$ 4877 18006 23305 23194 21340 20348 17250 5407 -5515 9442 29385 29836 24797 26493 25977
13661B5977M575L839o988n391o074r827m495N634K190k053R450k997N731n766
$$ 25977 30552 34391 27403 22012 15938 6111 1616 7250 9440 7387 16837 13840 19571 13805
13647A3805o195L738O556O088M793q971j440o736k670J5849K871m340j1333j1834
$$ 13805 7610 11348 17904 23992 28785 19814 18374 11638 8968 24817 27688 23348 12015 181
13633A81O396j250k04M988K56R012O412j096J605j931J6071m563q891n924q910
$$ 181 6577 5327 5123 10111 10367 19379 25791 24695 26300 24369 40440 35877 26986 21062 12152
13618A2152r301j573P750k327M214K2802P529p78r413o281J39r59Q821L513o889
$$ 12152 2851 1278 9028 6701 10915 33717 41246 40468 31055 24774 24913 23954 32775 36288 29399
13603B9399k532J643O496r54n733j3472l124q721O67J2335J0358J807P243L213
$$ 29399 26867 28510 35006 34052 28319 14847 11723 3002 3669 16004 26362 28169 35412 38625
13589C8625j9802P278J7443K273j0959j5202J064M378q703J9836K3483J1991J749
$$ 38625 18823 26101 43544 45817 34858 19656 20720 25098 16395 36231 59714 71705 73454
13576G3454p788j4617J111P34k497j2174m862O316O365p206j1670j3646l36N278
$$ 73454 65666 51049 52160 52894 50397 38223 33361 39677 46042 38836 27166 13520 13184 18462
13562A8462L513P843Q383J6231N351n500K7295J7176m840j0692l462J69p510q683
$$ 18462 21975 29818 38201 54432 59783 54283 81578 98754 93914 83222 79760 79929 72419 63736
13548F3736n352q623L481O77j0864j0814o917q340o563J85R556M174O302Q452
$$ 63736 58384 49761 53242 53919 43055 32241 25324 16984 10421 10606 20162 24336 30638 39090
13534C9090n367M512J159j8980l818K052j3950M036K4794N460l970l629R102n944
$$ 39090 33723 38235 39394 20414 16596 18648 4698 8734 33528 38988 35018 31389 40491 34547
13520C4547j1498Q973j045o00m079K923O89j4366N106J8175Q878k109j0988m715
$$ 34547 23049 32022 30977 30377 26298 29221 29910 15544 20650 38825 47703 45594 34606 29891
13506B9891J304l110k695N226J696j3403r789Q679J9462J5739O11l222j6335j4689
$$ 29891 31195 28085 25390 30616 32312 18909 9120 17799 37261 53000 53611 50389 34054 19365
13492A9365J4026R179j0164M354J323j8072O749M067p503O761l756j887K861J2024
$$ 19365 33391 42570 32406 36760 38083 20011 26760 30827 23324 30085 26329 24442 27303 39327
13478C9327J3467J0495n743k0322n201J069j3924r685l093p2J3811R66N557J4202
$$ 39327 52794 63289 57546 37224 32023 33092 19168 9483 6390 6318 20129 21095 26652 40854
13464D0854k909j798N571J3259j3983p806N578l187o968n585J58r111j109j0125
$$ 40854 37945 36147 41718 54977 40994 33188 38766 35579 28611 23026 23184 14073 12964 2839
13450B839M839J3945J689n531l778l618j296J69q078k425J3438J7160J535M173
$$ 2839 7678 21623 23312 17781 14003 10385 9089 9258 1180 -1245 12193 29353 30888 35061
13436C5061J121j5242q883L086J1004L163k932p969j2125l279P104N614J3809
$$ 35061 36182 20940 12057 15143 26147 29310 26378 18409 6284 3005 10109 15723 29532
13423B9532M65J0569P83j2115j1179N13J586O044l910J1195P475L889O295j8451
$$ 29532 29997 40566 41349 29234 18055 18568 20154 26198 22288 33483 40958 44847 51142 32691
13409C2691p092R696J1578r906M514J885o405j0446P481r088k150M613r58p20
$$ 32691 25599 35295 46873 36967 41481 43366 36961 26515 33996 24908 22758 27371 26413 25693
13395B5693q927n856K170J1029P750q579l562J1108J3154K2162M043K164J6183
$$ 25693 16766 10910 13080 24109 31859 23280 19718 30826 43980 66142 70185 72349 88532
13382H8532J2671J1764n209J4787K2625J2638J5168K3193M561J7680K2399M2965
$$ 88532 101203 112967 107758 122545 145170 157808 172976 196169 200730 218410 240809 283774
13370B83774O7742R6405J45971K07445K67551L18836L24200K86637K14109J13034
$$ 283774 351516 447921 593892 801337 1068888 1387724 1711924 1998561 2212670 2325704
13360B325704k4961j62678k42206k95037k93239k54362k07352j49876r5178p5707
$$ 2325704 2300743 2138065 1895859 1600822 1307583 1053221 845869 695993 600815 525108
13350E25108p3808n6438l7461j8804j8713j8406k0891j8072j9301j4631k2220
$$ 525108 451300 394862 357401 338597 319884 301478 280587 262515 243214 228583 206363
13339B06363k6721k6797p350J47j659L938k22p946J1736M091j6508j0879l981
$$ 206363 179642 152845 145495 145642 143983 147921 147699 139753 151489 155580 139072 128193 124212
13326A24212p449L746M948j2972p541m174N930K953K451J055l927m09j329o551
$$ 124212 116763 120509 125457 112485 104944 100770 106700 109653 112104 113159 109232 108823 107494 100943
13312A00943K111J470j6768k12J0215O008j0172l981J9062J2832k198j9093j8420
$$ 100943 103054 104524 87756 87544 97759 103767 93595 89614 108676 121508 119310 100217 81797
13299H1797J130l305J3886J2406j912n205j8732j9816J272R14K090p696K652l825
$$ 81797 82927 79622 93508 105914 104002 98797 80065 60249 61521 62435 64525 56829 59481 55656
13285E5656N447J2362k53r228j0578J177K081n692j5794q773N190p679J7187K4565
$$ 55656 61103 73465 73212 63984 53406 54583 56664 50972 35178 26405 31595 23916 41103 65668
13271F5668r724j6711n178K274j9766j3872o927N265J7586J1946J891l35j2304
$$ 65668 55944 39233 34055 36329 16563 2691 -4236 1029 18615 30561 32452 32117 19813
13258A9813j1761l173J3917J318n802l948J0568J4533P710J218p818q418j5479
$$ 19813 8052 4879 18796 20114 14312 10364 20932 35465 43175 44393 36575 28157 12678
13245A2678m668R073l505l68J406n011r91J0303J6688J290J1804j05r833R792
$$ 12678 8010 17083 13578 13210 14616 9605 8614 18917 35605 36895 48699 48594 38761 48553
13231D8553J19m466J634P634N957K667n542m650N548j0809m435p114O872k088
$$ 48553 48672 44206 45840 53474 59431 62098 56556 51906 57454 46645 42210 35096 41968 39880
13217C9880N503J2988n823k3701j5233m600n98n403q811j9361M675O459J769L8
$$ 39880 45383 58371 52548 28847 13614 9014 8416 3013 -5798 -25159 -20484 -14025 -12256 -12218
13203a2218K2281K6998J9339K0984J8255J0140J0328K0955K3871K3000K2433K3541
$$ -12218 10063 37061 56400 77384 95639 105779 116107 137062 160933 183933 206366 229907
13191B29907L1409K7114K1240P207j5641N903l7563l8559j3934k0643j5399m457
$$ 229907 261316 288430 309670 316877 301236 307139 269576 231017 217083 196440 181041 176584
13179A76584k8064j6512j2327Q717o006j4415M699J879q663q702M502J1706O782
$$ 176584 148520 132008 119681 128398 122392 107977 112676 114555 105892 97190 101692 113398 120180
13166A20180R32J1929J0782j680j7245o091Q880J1072k648l865o678j9268j0267
$$ 120180 121112 133041 143823 142143 124898 118807 127687 138759 136111 132246 125568 106300 96033
13153I6033J2840J8626q312j3544k367r192j7887j8448o124m08R598M804M956
$$ 96033 108873 127499 119187 105643 103276 94084 76197 57749 51625 51217 60815 65619 70575
13140G0575O357m347K329j483J175r135L803J2057j8159l722j7293j9218j6486
$$ 70575 76932 72585 74914 73431 74606 65471 69274 81331 63172 59450 42157 22939 6453
13127F453l1754m4098m0590l5526l844j5415M418P495J8207K5144J6369J5501
$$ 6453 -25301 -69399 -109989 -145515 -149359 -164774 -160356 -152861 -134654 -109510 -93141 -77640
13115g7640L4875J6501K3442J9727J9294J9410R142l940N528J1799J3555Q219
$$ -77640 -42765 -26264 -2822 16905 36199 55609 64751 60811 66339 78138 91693 99912
13103I9912P717R224J6565J4669P217l509M760Q085J4496K3882K619l511J6265
$$ 99912 107629 116853 133418 148087 155304 151795 156555 164640 179136 203018 205637 202126 218391
13090B18391K6867n558M55O550k766r024j662l590n291q63j1428r353J6899P822
$$ 218391 245258 239700 240155 246705 243939 234915 233253 229663 224372 223509 212081 202728 219627 227449
13076B27449L064m0J2321J4280J1159o655j4971k6655j0325Q07J7148K8407L5109
$$ 227449 230513 230473 242794 257074 268233 261578 246607 219952 209627 210434 227582 255989 291098
13063B91098O6600O3287N9114L7706M9027L0580k1942k9377O985P405j6268k983
$$ 291098 357698 420985 480099 517805 566832 597412 575470 546093 553078 560483 544215 541232
13051E41232M982O032O156n3M220M206k006J517o462m084Q601J3880P754O011
$$ 541232 546214 552246 558402 558349 562569 566775 564769 566286 559824 555740 564341 578221 585975 591986
13037E91986J2071J7251K2752K7337K5792K3700K4187J1633P956n350j7431r658
$$ 591986 604057 621308 644060 671397 697189 720889 745076 756709 764665 759315 741884 732226
13025G32226r981j700j4503j1510L57o659J6881K6003J5672J4041J5928J5853
$$ 732226 722245 720545 706042 694532 694889 688230 705111 731114 746786 760827 776755 792608
13013G92608N719k877P957K3908K3376J3444M1821L4650L7408M3582L0106J3127
$$ 792608 798327 795450 803407 827315 850691 864135 905956 940606 978014 1021596 1051702 1064829
13001A064829J3770K3089o579m613j676m278L037K2322M0261M4225L5785K0971
$$ 1064829 1078599 1101688 1095109 1090496 1088820 1084542 1087579 1109901 1150162 1194387 1230172 1251143
12989A251143K4453J8249K7466M4538L1474M0570P1316P7418P7377P6906O5233
$$ 1251143 1275596 1293845 1321311 1365849 1397323 1437893 1509209 1586627 1664004 1740910 1806143
12978A806143O8403Q3863Q5600Q0418R0192R4376J13258J15460J31554J57578
$$ 1806143 1874546 1958409 2044009 2124427 2214619 2308995 2422253 2537713 2669267 2826845
12968B826845K00660K35822K85944L22215L56589L93319M30502M79734N39991
$$ 2826845 3027505 3263327 3549271 3871486 4228075 4621394 5051896 5531630 6071621
12959F071621O09955P02094Q36389R80175J178249J394219J627203J887835K130059
$$ 6071621 6681576 7383670 8220059 9200234 10378483 11772702 13399905 15287740 17417799
12950A7417799K402710K728100L078971L555277M345703N583307P636311J1165674
$$ 17417799 19820509 22548609 25627580 29182857 33528560 39111867 46748178 57913852
12942E7913852J7056144K6042631L7443173M8929090N7127194N9452205N5091359
$$ 57913852 74969996 101012627 138455800 187384890 244512084 303964289 359055648
12935C59055648M2460257K2861326j86636k3546939m1249019n4118889n8235586
$$ 359055648 401515905 424377231 424190595 400643656 359394637 305275748 247040162
12928B47040162n1250906m0903116l0719066k0998890j3785434r453171o952632
$$ 247040162 195789256 154886140 124167074 103168184 89382750 79929579 72976947
12921G2976947n594013m854672m448550m188850m003306l775043l491768l159303
$$ 72976947 67382934 62528262 58079712 53890862 49887556 46112513 42620745 39461442
12913C9461442k777532k402067k072631j771256j541406j357860j209736j097174
$$ 39461442 36683910 34281843 32209212 30437956 28896550 27538690 26328954 25231780
12905B5231780r94606r21849q26995p71097p16111o68450o70513o60974o55256
$$ 25231780 24237174 23315325 22488330 21717233 21001122 20332672 19662159 19001185 18345929
12896A8345929o91709o90785o70471o13129n78702n44141m78135m55649m40988
$$ 18345929 17654220 16963435 16292964 15679835 15101133 14556992 14078857 13623208 13182220
12887A3182220m31466m30328m25520m12247m07869l79856l93367l84882l72487
$$ 13182220 12750754 12320426 11894906 11482659 11074790 10694934 10301567 9916685 9544198
12878I544198l62277l38726l18580k92839k62591k69641k73533k72835k82345
$$ 9544198 9181921 8843195 8524615 8231776 7969185 7699544 7426011 7153176 6870831
12869F870831k50965k31204k32243k18217j99583j83045j65801j52955j44927
$$ 6870831 6619866 6388662 6156419 5938202 5738619 5555574 5389773 5236818 5091891
12860E091891j44085j32666j28202j27516j11869j08929r5342p5327o2478n5597
$$ 5091891 4947806 4815140 4686938 4559422 4447553 4338624 4243282 4167955 4105477 4049880
12850D049880n8536p6985r4137r5909j35478j44950j61832j94507k18202j97218
$$ 4049880 3991344 3914359 3820222 3724313 3588835 3443885 3282053 3087546 2869344 2672126
12840B672126j85757j76259j66943j55340j25051j06275p8845q5361o9467o0756
$$ 2672126 2486369 2310110 2143167 1987827 1862776 1756501 1677656 1592295 1522828 1462072
12830A462072p3307q6827p7649o4813n1167n4262m8921n9566m2775l1684l1011
$$ 1462072 1388765 1301938 1224289 1159476 1108309 1054047 1005126 945560 902785 871101 840090
12819H40090k9622o374L305P223Q284J1884K5794J1835K2894K8432J0847K8194
$$ 840090 810468 804094 807399 814622 822906 834790 860584 872419 895313 923745 934592 962786
12807I62786K5824K22k4519k8491l2703m1804m3199n7002l6583j5244r730j2343
$$ 962786 988610 988832 964313 935822 903119 861315 818116 761114 724531 709287 699557 687214
12795F87214R281K7222J0781J088J9172J5941k81l505j2221k6401k8030j6630
$$ 687214 696495 723717 734498 735586 754758 770699 770418 766913 754692 728291 700261 683631
12783F83631k9847l2067Q465L3288K6360L0741J3102J3503J9874K4410j4985K647
$$ 683631 653784 621717 630182 663470 689830 720571 733673 747176 767050 791460 776475 779122
12771G79122k5821m6140k5776n257M167j0464Q368K0887J3227J8239J6498P766
$$ 779122 753301 707161 681385 676128 680295 669831 678199 699086 712313 730552 747050 754816
12759G54816J2020K5930M9506O3284Q2762J18748J39876J23080J02023Q6023M5318
$$ 754816 766836 792766 842272 905556 988318 1107066 1246942 1370022 1472045 1558068 1603386
12748A603386j9733o0886r3462j27436j41688j13155q3864p9680n2956l7286j3325
$$ 1603386 1583653 1522767 1429305 1301869 1160181 1047026 963162 883482 830526 793240 779915
12737G79915j7613l5388j3076k1079j2317l789J3033K0192O2441Q1776J11087
$$ 779915 762302 726914 713838 692759 680442 676653 689686 709878 772319 854095 965182
12726I65182J30183J10795Q9164N2058j7904n3723o0012r9103j29143j05711p4737
$$ 965182 1095365 1206160 1295324 1347382 1329478 1275755 1215743 1116640 987497 881786 807049
12715H07049q2368p5989m7719m8175m4317j7529q595r135j3948r818k177j0933
$$ 807049 724681 648692 600973 552798 508481 490952 482357 473222 459274 449456 447279 436346
12703D36346j2791j7609j6727j1477k2602k4587j1972j5149j2880j620j736M654
$$ 436346 423555 405946 389219 377742 355140 330553 318581 303432 290552 288932 287196 291850
12691B91850j3549k7241l336L595k405n081K133l564j6505k2568j0261k739K967
$$ 291850 278301 251060 247724 251319 248914 243833 245966 242402 225897 203329 193068 190329 193296
12678A93296j1481n770o944K032O700K400k725j5241p273P67J4626R704J1599
$$ 193296 181815 176045 169101 171133 177833 180233 177508 162267 154994 155761 170387 180091 191690
12665A91690K2337J6794n860J783m156r223L480m421J3038K1163N308M694L0210
$$ 191690 214027 230821 224961 226744 222588 213365 216845 212424 225462 246625 251933 256627 286837
12652B86837L6109N0795M8412N7206L1089J0695j765l8525p3354o3440k9252k8689
$$ 286837 322946 373741 422153 479359 510448 521143 519378 480853 407499 344059 314807 286118
12640B86118k4358j7675k1167k7386j3072p914j6446K828M840l409O756P341r475
$$ 286118 261760 244085 222918 195532 182460 174546 158100 160928 165768 162359 169115 176456 166981
12627A66981R178j0159j7989j2240M564J173K3319N0639L6622M8039N8381P9222
$$ 166981 176159 166000 148011 135771 140335 141508 164827 215466 252088 300127 358508 437730
12615D37730Q8527Q8447P1268M6410K678k1734p6281r7761o3071n4996n6919m5359
$$ 437730 526257 614704 685972 732382 735060 713326 637045 539284 476213 421217 364298 318939
12603C18939l6605l4923r571j2165k3890j0329o5J865j0418O550m193l446k1819
$$ 318939 282334 247411 237840 225675 201785 191456 191391 193256 182838 189388 185195 181749 159930
12590A59930j8677J1920J8586k784J198N918j21J6092K6139J9352M6577O8775
$$ 159930 141253 153173 171759 168975 170173 176091 175970 192062 218201 237553 284130 352905
12578C52905N6849L0119J694O354L325m8517r8854o0080m2992l5374j6143j4302
$$ 352905 409754 439873 441567 447921 451246 402729 303875 243795 200803 165429 149286 134984
12566A34984j5455k9336j4593K510K740q305q48J3876j0675P974L353q989J7823
$$ 134984 119529 90193 75600 78110 80850 72545 71697 85573 74898 82872 86225 77236 95059
12553I5059K970o241J574m591m643M381j3326l045J7931R768J757k404J4350O9
$$ 95059 98029 91788 93362 88771 84128 88509 75183 72138 90069 99837 101594 99190 113540 113609
12539A13609m593j3045o163n871n992l246P675L930m181j1077j3735j0537M475
$$ 113609 109016 95971 89808 83937 77945 74699 82374 86304 82123 71046 57311 46774 51249
12526E1249J8606J1206k783l036Q631J6267R298J5810Q394P852J5943J9027K9678
$$ 51249 69855 81061 78278 75242 83873 100140 109438 125248 133642 141494 157437 176464 206142
12513B06142K0209J8692K8745M5410P6478J15137J70543K35245K88432L27291
$$ 206142 226351 245043 273788 319198 395676 510813 681356 916601 1205033 1532324
12503A532324L40512K97947J87929O2788n5275j94580k75835l12662k95805k51823
$$ 1532324 1872836 2170783 2358712 2421500 2366225 2171645 1895810 1583148 1287343 1035520
12493A035520k18837j46914j02564o6908m9879m9384k8124k4646k0568j7542k0918
$$ 1035520 816683 669769 567205 500297 450418 401034 372910 348264 327696 310154 289236
12482B89236k4388j6088j8159q703m654M78m211n129J0601j0028K557N968n127
$$ 289236 264848 248760 230601 221898 217244 217722 213511 208382 218983 208955 211512 217480 212353
12469B12353k5000k4892K070L708j2165j3994m435m261m736J0085O991j3591L822
$$ 212353 187353 162461 164531 168239 156074 142080 137645 133384 128648 138733 145724 132133 135955
12456A35955Q698p594j4444l374j23M300j9160k4435M574j0419K675J19k421o13
$$ 135955 144653 137059 122615 119241 119118 123418 104258 79823 84397 73978 76653 76772 74351 73738
12442G3738K53q812R217L596M111Q632J0949r441Q100M95j967j467j2878k3793
$$ 73738 73991 65179 74396 77992 82103 90735 101684 92243 100343 100838 98871 97404 84526 60733
12428F0733m461n832k343j0439l701R059J5613K20p09P927J7102J6816n664l220
$$ 60733 56272 50440 48097 37658 33957 43016 58629 58849 58140 66067 83169 99985 94321 91101
12414I1101j845k3j3074l542M108P197M422M409O257k119l156q378N180j498j4135
$$ 91101 89256 89233 76159 72617 76725 83922 88344 92753 99010 96891 93735 85357 90537 89039 74904
12399G4904Q518J5239r836K810P403L661K015j4027J5857J518J4093J6185K7683
$$ 74904 83422 98661 88825 91635 99038 102699 104714 90687 106544 108062 122155 138340 166023
12386A66023M7695P4780R3474J17871J31284J01827N8910L0313m838l2890r3697
$$ 166023 213718 288498 381972 499843 631127 732954 791864 822177 817339 784449 690752
12375F90752r6361o7706l1945k3330j7095O382K0117K6993K5692K3177J5467J6304
$$ 690752 594391 526685 494740 471410 454315 460697 480814 507807 533499 556676 572143 588447
12363E88447K6669K3025K9210K8672K7015J3391o21J0671r234k6646O87J7597
$$ 588447 615116 638141 667351 696023 723038 736429 735808 746479 737245 710599 711286 728883
12351G28883N1671P4549J03458J52837K04306K10431J86710J53185Q9752M892
$$ 728883 780554 855103 958561 1111398 1315704 1526135 1712845 1866030 1955782 1960674
12341A960674q6175j67097k06977j98713j77339j18451o4058m4749j6641J8704
$$ 1960674 1874499 1707402 1500425 1301712 1124373 1005922 941864 897115 880474 899178
12331H99178O639k360n47j9746j7346k6967l1107k1184l8035k7089j7495k4480
$$ 899178 905817 903457 902910 883164 865818 838851 807744 786560 748525 721436 703941 679461
12319F79461j7113j6690m2045l0372m328J0220K6692L0864M9593R0223R5265Q6853
$$ 679461 662348 645658 603613 573241 568913 579133 605825 636689 686282 776505 871770 958623
12307I58623L6230l050l6669r3714j31754j27562j14495p0142n9118m9246k0878
$$ 958623 994853 991803 955134 861420 729666 602104 487609 417467 358349 309103 288225
12296B88225k1410j0546j7575p434n373k689j4029k0625P243J2528l294n906M579
$$ 288225 266815 256269 238694 231260 225887 223198 209169 188544 195787 208315 205021 199115 203694
12283B03694j0173k3444j0249j5603j9162j1825j0112n73j2672l873L189k840
$$ 203694 193521 170077 159828 144225 125063 113238 103126 102553 89881 86008 89197 86357
12271H6357j0704J79P643P373o355k1611j8339l037N580Q770k983q588L589J02
$$ 86357 75653 75832 83475 90848 84493 62882 44543 41506 47086 55856 52873 44285 47874 47976
12257D7976J6818Q298l302J663m919q911j4544j878O77l342N275Q320m951m581
$$ 47976 64794 73092 69790 71453 66534 57623 43079 41201 41878 38536 43811 52131 47180 42599
12243D2599J568R41P121J813j946j1296k1032J0947j709J3240r01j2289J785m785
$$ 42599 44167 45108 52229 54042 52096 40800 19768 30715 29006 42246 41345 29056 30841 26056
12229B6056j798m189J415j388j9200K286j357Q760L780l775n793Q386K040J9423
$$ 26056 24258 20069 21484 20096 896 3182 1825 10585 14365 10590 4797 13183 15223 34646
12215C4646J2268j82k609j6188r599o859k0645n181N935k577m714q944N900Q372
$$ 34646 46914 46732 44123 27935 18336 11477 -9168 -14349 -8414 -10991 -15705 -24649 -18749 -10377
12201a0377Q51K089R005K46K103L295r324j8565q184P607J0887K244J29R44J1243
$$ -10377 -9526 -7437 1568 1814 3917 7212 -2112 -20677 -28861 -21254 -10367 -8123 -7994 -7050 4193
12186D193N106n638j330N981j3593j3444p929K062J7128J5821K902l623j60J861
$$ 4193 9299 3661 2331 8312 -5281 -18725 -26654 -24592 -7464 8357 11259 7636 7476 9337
12172I337L433j6654p776j996J4770O940k469J5272l60j6538j5309n872L839J5968
$$ 9337 12770 -3884 -11660 -13656 1114 8054 5585 20857 20497 3959 -11350 -17222 -13383 2585
12158B585K249k953J649n877K968N674j1942l587P007J4094O274k589L713p553
$$ 2585 4834 1881 3530 -2347 621 6295 -5647 -9234 -2227 11867 18141 15552 19265 11712
12144A1712j1011q819J3439J1673p67N627j688L992p129j0734m207l55n195L542
$$ 11712 701 -8118 5321 16994 16227 21854 20166 24158 17029 6295 2088 1733 -3462 80
12130H0K970N420j213N651K931o85P137q406j1641J71L568J0676J381M876j9778
$$ 80 3050 8470 7257 12908 15839 15154 22291 13885 2244 2415 5983 16659 18040 22916 3138
12115C138k2127O984K992k740LO062L144K176n57J0409J435j0783r728J972Q77
$$ 3138 -18989 -12005 -9013 -11753 -11750 -5688 -2544 -368 -925 9484 10919 136 -9592 -7620 -6743
12100f743J54L675q951J54L668Q301k080q402J768j0129Q00J8500J1541L791o387
$$ -6743 -6589 -2914 -11865 -11711 -8043 258 -1822 -10224 -8456 -18585 -17785 715 12256 16047 9660
12085I660M225J937r919n247k23N58k189J497N116M441m726r554p663J8289j063
$$ 9660 13885 15822 5903 656 433 991 -1198 299 5415 9856 5130 -4424 -12087 6202 5139
12070E139j9696Q92j7974l152J5558J5307P860q965j1742o821J3j2413j3631J1636
$$ 5139 -14557 -13665 -31639 -34791 -19233 -3926 3934 -5031 -16773 -23594 -23581 -35994 -49625 -37989
12056c7989K3327l3J1659N980J1617q666o695R438m740l108L183p893N636J1431
$$ -37989 -14662 -14695 -3036 2944 14561 5895 -800 8638 3898 790 3973 -3920 1716 13147
12042A3147P318m823p626k917N812n812j0612O857n899N968j171K994k372J304
$$ 13147 20465 15642 8016 5099 10911 5099 -5513 1344 -4555 1413 242 3236 864 2168
12028B168K08r806j031J735n622L421j5494j267J6906n59Q962L949p648r44Q34
$$ 2168 2376 -7430 -8461 -6726 -12348 -8927 -24421 -25688 -8782 -9341 -379 3570 -4078 -5022 -4188
12013d188l326P866J0940l086Q255m781j4208p444m707K326L344M20p381M361
$$ -4188 -7514 352 11292 8206 16461 11680 -2528 -9972 -14679 -12353 -9009 -8589 -15970 -11609
11999a1609j560r12j805R665o271o319n479Q159J3859L390j116l300J691j632
$$ -11609 -13169 -14081 -15886 -6221 -12492 -18811 -24290 -16131 -2272 1118 2 -3298 -1607 -3239
11985c239J0300r065j4364J0136K5373P311j0226j0899M94q125j2456O156J6449
$$ -3239 7061 -2004 -16368 -6232 19141 26452 16226 5327 5821 -2304 -14760 -8604 7845
11972G845l366J691q411P386J6142j582n300j6771k636J3151J4202J502o780j779
$$ 7845 4479 6170 -2241 5145 21287 19705 14405 -2366 -5002 8149 22351 23853 17073 15294
11958A5294j668R464J5518j0300k7473j2692J9961J0726p762r507j1864J726k467
$$ 15294 13626 23090 38608 28308 835 -11857 8104 18830 11068 1561 -10303 -8577 -11044
11945a1044o468k203J715P705J9157K818N060j759M548j3879o334n295q349O373
$$ -11044 -17512 -19715 -18000 -10295 8862 11680 16740 14981 19529 5650 -684 -5979 -14328 -7955
11931g955K8309J3575j0992j2206K246R739j1848j1434O115K99n823M456J0225
$$ -7955 20354 33929 22937 10731 12977 22716 10868 -566 5549 5848 25 4481 14706
11918A4706P977k874m674m875K763J1742Q680M662P285l33L340O421o950M002
$$ 14706 22683 19809 15135 10260 13023 24765 33445 38107 45392 45059 48399 54820 47870 51872
11904E1872M38N421m4J656L936J0996r822j1681j5085j5422j535J3182J9266J0713
$$ 51872 52310 57731 57687 59343 63279 74275 64453 52772 37687 22265 20730 33912 53178 63891
11890F3891l349L130P815K876J913J871Q67Q916J3894K5708M050P64r216j1311
$$ 63891 60542 63672 71487 74363 76276 78147 79014 87930 101824 127532 131582 132346 123130 111819
11876A11819r031j2265j0639q66q971j05l356k60P804J2112j7158o41j735O983
$$ 111819 102788 90523 79884 79018 70047 69942 66586 66326 74130 86242 69084 68443 66708 73691
11862G3691N403L264j246k958l671j2486J713o459m580L184J402l810l299j994
$$ 73691 79094 82358 81112 78154 74483 61997 63710 57251 52671 55855 57257 53447 50148 48154
11848D8154j2231o161J440R145k22l589j2990j852O452M394j4632j4105p5M875
$$ 48154 35923 29762 31202 40347 40125 36536 23546 21694 28146 32540 17908 3803 3728 8603
11834H603K171j5702q661L468N139J4898o092p217O163J0212j240j9512o346J3946
$$ 8603 10774 -4928 -13589 -10121 -4982 9916 3824 -3393 2770 12982 11742 -7770 -14116 -170
11820a70K344M963R837j1193j5303l750J2277J3864j573N43N553j6611P510L359
$$ -170 2174 7137 16974 5781 -9522 -13272 -995 12869 11296 11839 17392 781 8291 11650
11806A1650L600L476o846k527N366j9642j0750R246J5588r160j2277J704q704
$$ 11650 15250 18726 11880 9353 14719 -4923 -15673 -6427 9161 1 -12276 -10572 -19276
11793a9276j0752N114N439O644J3194J1216n038o110N046j0604M838k804m801
$$ -19276 -30028 -24914 -19475 -12831 363 11579 6541 431 5477 -5127 -289 -3093 -7894
11780g894O559k617j0374j4734k274J1363m701j0287P471K381N031L677n832o339
$$ -7894 -1335 -3952 -14326 -29060 -31334 -19971 -24672 -34959 -27488 -25107 -20076 -16399 -22231 -28570
11766b8570J8458r6r289l98r582N381J7600K298j126j1915p072L526J1617P988
$$ -28570 -10112 -10208 -19497 -19895 -29477 -24096 -6496 -4198 -5324 -17239 -24311 -20785 -9168 -1180
11752a180n596o60M935j4520l109J718N814n785j308R386P669J7497j131r833
$$ -1180 -6776 -7436 -2501 -17021 -20130 -18412 -12598 -18383 -19691 -10305 -2636 14861 13730 3897
11738C897R468j1609j8655Q094M809n654p908j3188j506L978J3883K740j1679
$$ 3897 13365 1756 -16899 -8805 -3996 -9650 -17558 -30746 -32252 -28274 -14391 -11651 -23330
11725b3330o357J4764L188j183l92j006M685J3506j3244l279N557K195r540j714
$$ -23330 -29687 -14923 -11735 -12918 -13310 -14316 -9631 3875 -9369 -12648 -7091 -4896 -14436 -16150
11711a6150J3270r122R769O57l193J1920n151p632P110R35k311j6172p735K436
$$ -16150 -2880 -12002 -2233 -1576 -4769 7151 2000 -5632 1478 2413 102 -16070 -23805 -21369
11697b1369R539J1117p21K477k273L064O385l220j2411l028K011R259Lj2149L21
$$ -21369 -11830 -713 -1434 1043 -1230 1834 8219 4999 -7412 -10440 -8429 830 833 -11316 -10995
11682a0995O159k85l653P85M341j427l256r998m133P060M044l964j2206n779M150
$$ -10995 -4836 -5121 -8774 -7989 -3648 -5075 -8331 -18329 -22462 -15402 -11358 -15322 -27528 -33307 -29157
11667b9157P578q676J061J2085R049R798Q072O566j8784j2091j111q317j5812
$$ -29157 -21579 -30255 -29194 -17109 -8060 1738 9810 16376 -2408 -14499 -15610 -23927 -39739
11654c9739K983J2373j169R846k947P336J2341N681k771k562j1426M016O491J0113
$$ -39739 -36756 -24383 -25552 -15706 -18653 -11317 1024 6705 3934 1372 -10054 -6038 453 10566
11640A0566J0486L803j303j4715q279j7090j2992q466J2965p895k57J7845O342
$$ 10566 21052 24855 23552 8837 558 -16532 -29524 -37990 -25025 -32920 -33177 -15332 -8990
11627h990J1752l841j1359L080r95j2278k4221j0683L05p23J6012J5369k906P559
$$ -8990 2762 -1079 -12438 -9358 -10353 -22631 -46852 -57535 -57230 -57953 -41941 -26572 -29478 -21919
11613b1919J5449N10n066Q83r137k708J4248j5189j4758J1546R450l405j8201
$$ -21919 -6470 -5960 -11026 -10143 -19280 -21988 -7740 -22929 -37687 -26141 -16691 -20096 -38297
11600c8297j0780M976J0656R025J5132P899k102o493n611J1603l373n823k955
$$ -38297 -49077 -44101 -33445 -24420 -9288 -1389 -3491 -9984 -15595 -3992 -7365 -13188 -16143
11587a6143j125k933l012O55O042J188O560p410j4744J6144J2548j782k6403K320
$$ -16143 -17268 -20201 -23213 -22558 -16516 -15328 -8768 -16178 -30922 -14778 -2230 -4012 -30415 -28095
11573b8095K1329r253O267N927R102j7697o872n62P795M725J362l201q411j0219
$$ -28095 -6766 -16019 -9752 -3825 5277 -12420 -19292 -19854 -12059 -7334 -5972 -9173 -17584 -27803
11559b7803o072J3831P89j531Q288j9977j6092J4424K4668J7429M846n072J0347
$$ -27803 -33875 -20044 -19255 -20786 -12498 -32475 -48567 -34143 -9475 7954 12800 7728 18075
11546A8075J260n561j0293j6096n482J5030l426q146K609k532j353N582m072L38
$$ 18075 19335 13774 3481 -12615 -18097 -3067 -6493 -14639 -12030 -14562 -15915 -10333 -14405 -14067
11532a4067P207J220r843j7592O429N844N732P28j8932p597L02J0674N389m19
$$ -14067 -6860 -5640 -15483 -33075 -26646 -20802 -15070 -14342 -33274 -40871 -40569 -29895 -24506 -24925
11518b4925o017m178J7357Q809p840j791M60J5138O634J022J2023l645j4858q303
$$ -24925 -30942 -35120 -17763 -8954 -16794 -18585 -18125 -2987 3647 4669 16692 13047 -1811 -10114
11504a0114r09j725P687M644O100K725J309j5271k430N269m040M466l981R85j4005
$$ -10114 -11023 -12748 -5061 -417 5683 8408 9717 -5554 -7984 -2715 -6755 -2289 -6270 -5285 -19290
11489a9290J963K752N779K919Q509J0044N43j8840j5695L627J1551r824j5530
$$ -19290 -17327 -14575 -8796 -5877 2632 12676 13219 -5621 -21316 -17689 -6138 -15962 -31492
11476c1492K367M073N657J8174J66j2827q31J6492N848j134j1337j351m885l754
$$ -31492 -29125 -25052 -19395 -1221 -1055 -13882 -14713 1779 7627 6493 -4844 -6195 -11080 -14834
11462a4834r197K570K477L091J524J904L703J2931J4080o430j1003j2137L082
$$ -14834 -24031 -21461 -18984 -15893 -14369 -12465 -8762 4169 18249 11819 816 -11321 -8239
11449h239j2692j0475J0440J7016L997m353j1689o43L813j692N6j1208k800J1458
$$ -8239 -20931 -31406 -20966 -3950 47 -4306 -15995 -16638 -12825 -14517 -14461 -25669 -28469 -17011
11435a7011K867K360q858J548N109o835R973o127l162L099L480J1250q92m253
$$ -17011 -14144 -11784 -20642 -19094 -13985 -20820 -10847 -16974 -20136 -17037 -13557 -2307 -3199 -7452
11421g452l081q124q515M147K636M747q207J762J3584J1615m528k3022L436J020
$$ -7452 -10533 -18657 -27172 -23025 -20389 -15642 -23849 -22087 -8503 3112 -1416 -24438 -21002 -19982
11407a9982n382K498P938p01j862k532J783k4p970L919N483Q274N258M071p382
$$ -19982 -25364 -22866 -14928 -15629 -17491 -20023 -18240 -18264 -26234 -22315 -16832 -8558 -3300 771 -6611
11392f611r376Q563o950p835p882J1821M568P829M224N591j065m060N179q100
$$ -6611 -15987 -7424 -14374 -22209 -30091 -18270 -13702 -5873 -1649 3942 2877 -1183 3996 -4104
11378d104J16J0871j453n457j6149j0890K024J0610J1805P791p075r580P078o034
$$ -4104 -3988 6883 5430 -27 -16176 -27066 -25042 -14432 -2627 5164 -1911 -11491 -4413 -10447
11364a0447o796p861K526O602L681Q893L593j9494q798J3035K054k966J8p008
$$ -10447 -17243 -25104 -22578 -15976 -12295 -3402 191 -19303 -28101 -15066 -13012 -15978 -15960 -22968
11350b2968L910P125o404p087J4530N454j0173j337L586P904N027J1485m429j3601
$$ -22968 -19058 -11933 -18337 -25424 -10894 -5440 -15613 -16950 -13364 -5460 -433 11052 6623 -6978
11336f978j4022j048M50o235J508k108L996R241r43M772M493J4227K5773J0693
$$ -6978 -21000 -22048 -21598 -27833 -26325 -28433 -24437 -15196 -16139 -11367 -6874 7353 33126 43819
11322D3819k1286k2446k0938m648J4371j270M315O552O740R333J474j0168n136
$$ 43819 22533 87 -20851 -25499 -11128 -12398 -8083 -1531 5209 14542 16016 5848 712
11309G12l890M901J5404m454j4856J894l050l988k838l170o888q421j602O708
$$ 712 -3178 1723 17127 12673 -2183 -289 -3339 -7327 -10165 -13335 -20223 -28644 -30246 -23538
11295b3538P494J2036J969l586j737J3183o820n323n7l046j0448j6410N757K1438
$$ -23538 -16044 -4008 -2039 -5625 -7362 5821 -999 -6322 -6379 -9425 -19873 -36283 -30526 -9088
11281i088j119p510l996M776q54p327J612n014j1219M009j316K148J2706j858
$$ -9088 -10207 -17717 -21713 -16937 -17791 -25118 -23506 -28520 -39739 -35730 -37046 -34898 -22192 -24050
11267b4050Q998j409J0911J7900J3203j2926k6728m17K975M803M279k337p081
$$ -24050 -15052 -16461 -5550 12350 25553 12627 -14101 -14518 -11543 -6740 -2461 -4798 -11879
11254a1879n970j0572J496L988O279q221r325L713K522Q175J8312J3586j181k374
$$ -11879 -17849 -28421 -26925 -22937 -16658 -24879 -34204 -30491 -27969 -19794 -1482 12104 10923 8549
11240H549j4877K701M915k687o230j1601M484K329k105R70R196k644j682R525
$$ 8549 -6328 -3627 1288 -1399 -7629 -19230 -14746 -12417 -14522 -13552 -4356 -7000 -8682 843
11226H43k456j2076p415n084NJ5813J1898O249N142m517j1771o009j7328n935
$$ 843 -1613 -13689 -21104 -26188 -26183 -10370 1528 7777 12919 8402 -3369 -9378 -26706 -32641
11212c2641J2478J8838R995j4121j0467k706r261r331P680J1652N87J0946J286
$$ -32641 -20163 -1325 8670 -5451 -15918 -18624 -27885 -37216 -29536 -17884 -17297 -6351 -5065
11199e065M340r339j606n268q613l54J2304J4713p877k301J1833L443M439N663
$$ -5065 -725 -10064 -11670 -16938 -25551 -25905 -13601 1112 -6765 -9066 2767 6210 10649 16312
11185A6312o180O456J0456q953j0113R525j0773j7750o52P168J3586J538r581
$$ 16312 10132 16588 27044 18091 7978 17503 6730 -11020 -11672 -4504 9082 10620 1039
11172A039j0939M79p728O643N793j0293m733m387J610N516M563r57p887J771l86
$$ 1039 -9900 -9421 -17149 -10506 -4713 -15006 -19739 -24126 -22516 -17000 -12437 -13394 -21281 -19510 -19896
11157a9896j027M680O282m749k704L425m604k800L976R879J1041j3454n17J7135
$$ -19896 -20923 -16243 -9961 -14710 -17414 -13989 -18593 -21393 -17417 -7538 3503 -9951 -10468 6667
11143F667m995j4387L802l415J537N533J2173j119K078k7q862m270P198J0288
$$ 6667 1672 -12715 -8913 -12328 -10791 -5258 6915 5796 7874 7847 -1015 -5285 1913 12201
11129A2201o358j6737m676L331O306N983j0939q558N787R354Q717k51q341N894
$$ 12201 5843 -10894 -15570 -12239 -5933 50 -10889 -19447 -13660 -4306 4411 4160 -4181 1713
11115A713j694o508R107p18j562j299K685j0796q244J1159P677q92m568N382O168
$$ 1713 19 -6489 2618 1900 338 -961 1724 -9072 -17316 -6157 1520 628 -3940 1442 7610
11100G610q530j1440j026Q352L161N595L203M898l850j0330o507K249J7303r294
$$ 7610 -920 -12360 -13386 -5034 -1873 3722 6925 11823 7973 -2357 -8864 -6615 10688 1394
11086A394m317J0771L965r92L336j1800j0499Q693m955j067M20Q486p47j707J910
$$ 1394 -2923 7848 11813 10821 14157 2357 -8142 551 -4404 -5471 -5051 3435 2688 981 2891
11071B891J2022j0032k3973j2754m219J2546J7567q149r687k91M177m44n753L773
$$ 2891 14913 4881 -19092 -31846 -36065 -23519 -5952 -14101 -23788 -24079 -19902 -20346 -26099 -22326
11057b2326j99q161J1261R032l908j2075M508Q151K65j261o25j597M698j2592
$$ -22326 -22525 -30686 -19425 -10393 -14301 -26376 -21868 -13717 -13452 -14713 -15338 -16935 -12237 -24829
11043b4829j1032j2219J9347Q437M178q988m554L760Q40P79j142r824L916O470
$$ -24829 -35861 -48080 -28733 -20296 -16118 -25106 -29660 -25900 -25060 -24281 -25423 -35247 -31331 -24861
11029b4861M972j434L462R323n165n229L333R673J399j666o28J704m638q83P959
$$ -24861 -19889 -21323 -17861 -8538 -13703 -18932 -15599 -5926 -4527 -6193 -6821 -5117 -9755 -10638 -2679
11014b679N393j091J695P47J1095N844Q355k030j5692l625n808k116j398M00o987
$$ -2679 2714 1623 3318 4065 15160 21004 29359 27329 11637 8012 2204 88 -1310 -910 -7897
10999g897j3785M286j2113q295M161J5868J0289l668j1085q598O223O617q203
$$ -7897 -21682 -17396 -29509 -37804 -33643 -17775 -7486 -11154 -22239 -30837 -24614 -17997 -26200
10986b6200m892k200P217P330N292K04L48m12r060o146J588Q742K0387J0770J3208
$$ -26200 -31092 -33292 -26075 -18745 -13453 -13249 -12901 -13313 -22373 -28519 -26931 -18189 2198 12968 26176
10971B6176J5576L558j1559r446j6524p560p106n293N348K107M697J0955O706
$$ 26176 41752 45310 33751 24305 7781 221 -6885 -12178 -6830 -4723 -26 10929 17635
10958A7635j5368j5722J2228N849j3311J493J1012k836M038r65k019J0062J3383
$$ 17635 2267 -13455 -1227 4622 -8689 -7196 3816 980 5018 4053 2034 12096 25479
10945B5479R029j0810j1305M124k331M400q681j3305j9554n551J2551J8449J6510
$$ 25479 34508 23698 12393 16517 14186 18586 9905 -3400 -22954 -28505 -15954 2495 19005
10932A9005N638j5799m130j713k317m122m151K514K335J958J9726O891L34k173
$$ 19005 24643 8844 4714 3001 684 -3438 -7589 -5075 -2740 -782 18944 25835 26169 23996
10918B3996k980k391L709O898J0846k285k805l797m462j745q365j3261n12R856
$$ 23996 21016 18625 22334 29232 40078 37793 34988 31191 26729 24984 16619 3358 2846 12702
10904A2702J5229N647l768M645M44K2365J3943K5312N3099L9470M6539M1326K4478
$$ 12702 27931 33578 29810 34455 34899 57264 71207 96519 149618 189088 235627 276953 301431
10891C01431L3573J4095J437j5683l2209l6412k8209k1735k8146l6064k3965l1149
$$ 301431 335004 349099 350536 334853 302644 266232 238023 216288 188142 152078 128113 96964
10879I6964k6359j6383j1093o782N07O031K822j0644p674J635L316R871o251q134
$$ 96964 70605 54222 43129 36347 36854 42885 45707 35063 27389 29024 32340 42211 35960 27826
10865B7826L241L776j962l612J2560J7855L849k4641n443J5277J3343R843J6962
$$ 27826 31067 34843 32881 29269 41829 59684 63533 38892 33449 48726 62069 71912 88874
10852H8874J0679J9354J9138L3085J8110r227O840J62j3505j2531l2614l1872
$$ 88874 99553 118907 138045 171130 189240 180013 186853 187015 173510 160979 128365 96493
10840I6493k6972k721r362k0687l749R156R866O053J0411J8508J5270M295K0252
$$ 96493 69521 66800 57438 36751 33002 42158 52024 58077 68488 86996 102266 106561 126813
10827A26813K6851L7848M6463L3754L1324M1728K0291j1279l0390k4261l8074
$$ 126813 153664 191512 237975 271729 303053 344781 365072 353793 323403 299142 261068
10816B61068n2287l5572j8004j2961k575m717J400J1920R428J832o003K3023L924
$$ 261068 208781 173209 155205 142244 139669 134952 136352 148272 157700 159532 153529 176552 180476
10803A80476R838l58Q131N99j0307j3350j9888q496l646m627l93o673M968Q307
$$ 180476 190314 189956 198087 198686 188379 175029 155141 146645 142999 138372 137979 131306 136274 144581
10789A44581p694r274o946m285j0572j7281j1967R300N98N503j4741j78j3230
$$ 144581 136887 127613 120667 116382 105810 88529 76562 85862 86460 91963 77222 77044 63814
10776F3814l680M918l436j9498j0259k931n194j8765l14P195L401Q312J259j375
$$ 63814 60134 65052 61616 42118 31859 28928 23734 4969 4655 11850 15251 23563 24822 23447
10762B3447Q065M484L875r88j1183J013J981K2395K8791K6897K4430K4753J5611
$$ 23447 31512 35996 39871 38883 27700 28713 30694 53089 81880 108777 133207 157960 173571
10749A73571J2185M563q626q744l3762k9119r260j9485l027j6684j7424j7367
$$ 173571 185756 190319 181693 172949 139187 110068 100808 81323 78296 61612 44188 26821
10737B6821q503j827O807L294N132K711j0719J0372M768L343K256k258L514j3191
$$ 26821 18318 16491 23298 26592 31724 34435 23716 34088 38856 42199 44455 42197 45711 32520
10723C2520j2198p912j3189p687J2585O805q514q065J952j3556n98j70R309R16
$$ 32520 20322 12410 -779 -8466 4119 10924 2410 -5655 -3703 -17259 -17857 -18027 -8718 -7802
10709g802m536k550M876p682l500L700J8361L818j2430j4499N219R432J2219J820
$$ -7802 -12338 -14888 -10012 -17694 -21194 -17494 867 4685 -7745 -22244 -17025 -7593 4626 6446
10695F446q752k534o973j8731j3493K4681M218o608o237l766O208j0737j1960
$$ 6446 -2306 -4840 -11813 -30544 -44037 -19356 -15138 -21746 -27983 -31749 -25541 -36278 -48238
10682d8238k709K646J5982K1855o26O43O40k023M536P53R980m79r608k741n367
$$ -48238 -50947 -48301 -32319 -10464 -11090 -10447 -9807 -11830 -7294 -6541 3439 2960 -6648 -9389 -14756
10667a4756M089K393n251j2544j2215O506J4084K0328M090j1639P603Q22j3681
$$ -14756 -10667 -8274 -13525 -26069 -38284 -31778 -17694 2634 6724 -4915 2688 3510 -10171
10654a0171j4584l414J0420M640J1228J4357M85j4788l590q377m018M538J229
$$ -10171 -24755 -28169 -17749 -13109 -1881 12476 12961 -1827 -5417 -13794 -17812 -13274 -12045
10641a2045J2534L233o794P147P509J0920n43j7380J071o902o598N16J0510O124
$$ -12045 489 3722 -3072 4075 11584 22504 21961 4581 5652 -1250 -7848 -7332 3178 9302
10627I302k236p574j5179L750J978o84J0228Q293r257r700o22J7581k290k923
$$ 9302 7066 -508 -15687 -11937 -9959 -10643 -415 7878 -1379 -11079 -11701 5880 3590 667
10613F67N618j330m474j2303J0910r909o302L602J8748J180r97J2279M356j1499
$$ 667 6285 4955 481 -11822 -912 -10821 -17123 -13521 5227 6407 5410 17689 22045 10546
10599A0546j5878m830J1939J6685j07j1067o108k095r739M701L500L298J1283
$$ 10546 -5332 -10162 1777 18462 18355 7288 1180 -915 -10654 -5953 -2453 845 12128
10586A2128M261q208j1326n185M622J66q24O433J9584J7463R01r318j2908l643
$$ 12128 16389 8181 -3145 -8330 -3708 -3542 -4366 2067 21651 39114 40015 30697 17789 14146
10572A4146k2065j797J0714L965j117P202J3525M023m574J770J0989J3077j20
$$ 14146 -7919 -9716 998 4963 3846 11048 24573 28596 24022 25792 36781 49858 49738
10559D9738o773K991j5322o864q199m312N057J3513O059K672M28p989m128k8773
$$ 49738 42965 45956 30634 23770 15571 11259 16316 29829 35888 38560 38988 30999 26871 -1902
10545a902q197L834L999K194L52J2875J2620J421N865J2468J080m236K474J3589
$$ -1902 -10099 -6265 -2266 -72 280 13155 25775 27196 33061 45529 46609 42373 44847 58436
10531E8436o092j6171O441j617j7648M373J4584K622j5385m047N008K5691K9941
$$ 58436 52344 36173 42614 40997 23349 27722 42306 44928 29543 25496 30504 56195 86136
10518H6136L1493K8374L0234J7471j0519o238J386l7805l9130j7451l1050j4083
$$ 86136 117629 146003 176237 193708 183189 176951 178337 140532 101402 83951 52901 38818
10506C8818k821m057O357J4147M406m825q038j3121j1970j060J18N525m081j3365
$$ 38818 35997 31940 38297 52444 56850 52025 43987 30866 18896 17836 17954 23479 19398 6033
10492F033k75J4030K249N222J1145m504M701p551k097R43N040n618m675L481M292
$$ 6033 5758 19788 22037 27259 38404 33900 38601 31050 28953 29896 34936 29318 24643 28124 32416
10477C2416n713k072N397J0785J637j0355j3104P07L585k00M335n413P540P648
$$ 32416 26703 24631 30028 40813 42450 32095 18991 19698 23283 23083 27418 22005 29545 37193
10463C7193k2107j4651O532p199J734O537M581j0181p343l26m391L354J1853J2991
$$ 37193 15086 435 6967 -232 1502 8039 12620 2439 -4904 -5230 -9621 -6267 5586 18577
10449A8577k458j10p648p030o979p247P078J1512P746j4306j3657J0020J7019
$$ 18577 16119 16009 8361 1331 -5648 -12895 -5817 5695 13441 -865 -14522 -4502 12517
10436A2517j332l146J0905J903r718P46N836N697j0198r900k11J8190J1485j2330
$$ 12517 11185 8039 18944 20847 11129 11875 17711 23408 13210 3310 3099 21289 32774 20444
10422B0444j8625J643k99q169o237n82m351J2428K359J8998J7639J5474k0244
$$ 20444 1819 3462 3163 -5006 -11243 -11825 -16176 -3748 -1389 17609 35248 50722 30478
10409C0478j8161j0951j0539L217k009j620P544J1012M34l786Q764n159J038J004
$$ 30478 12317 1366 -9173 -5956 -7965 -9585 -2041 8971 9405 5619 14383 9224 10262 11266
10395A1266p711j1259l133k457R09N641q602N286O202l748l937j312L233J1262
$$ 11266 3555 -7704 -10837 -13294 -12385 -6744 -15346 -10060 -3858 -7606 -11543 -12855 -9622 1640
10381A640J2124l448j1068m969j796J0713R041j082Q656J433M745J4400N159q074
$$ 1640 13764 10316 -752 -5721 -7517 3196 12237 11155 19811 21244 25989 40389 45548 37474
10367C7474m994j974k878o663J003O609M114k774r835n26K702n114r663N372N976
$$ 37474 32480 30506 27628 20965 21968 28577 32691 29917 20082 19556 22258 17144 7481 12853 18829
10352A8829k556j0548j5579k604m660j122Q090J8306L594j1667J499l217N210
$$ 18829 16273 5725 -9854 -12458 -17118 -18240 -10150 8156 11750 83 1582 -1635 3575
10339C575M573k057N406J0413k733q164k683o695j980k994J727Q980N071N419
$$ 3575 8148 6091 11497 21910 19177 11013 8330 1635 -345 -3339 -1612 7368 12439 17858
10325A7858L171M094L107n073M495J5772L874m056o647l645j6489j1840j410J3843
$$ 17858 21029 25123 28230 23157 27652 43424 47298 43242 36595 32950 16461 4621 3211 17054
10311A7054J6956m761j8240l916k404l014p659o28K123k366R195N132K613J5196
$$ 17054 34010 29249 11009 7093 4689 1675 -5984 -6612 -4489 -6855 2340 7472 10085 25281
10297B5281K190j494m073o401p21J932j1849L574P927J1598J2331j2172k2109
$$ 25281 27471 25977 21904 15503 14782 16714 4865 8439 16366 27964 40295 28123 6014
10284F014J1750J979o72J3068r240n329r03K353n515Q622J933l960j618j3661
$$ 6014 17764 19743 19071 32139 22899 17570 16667 19020 13505 22127 24060 20100 18482 4821
10270D821J772J8143J2154J31L251J265q069m458p958j4631o179J5199J2271J0902
$$ 4821 6593 24736 36890 37021 40272 41537 33468 29010 21052 6421 242 15441 27712 38614
10256C8614p75L509k406K846l988j8972r55J0483K1367J7532O322O455n40Q265
$$ 38614 37839 41348 38942 41788 37800 18828 17873 28356 49723 67255 73577 80032 79492 87757
10242H7757k58k416l955p234Q361L651O910j2581Q205R970J6732J7743K1333L4243
$$ 87757 87499 85083 81128 73894 82255 85906 92816 80235 88440 98410 115142 132885 154218 188461
10228A88461N8165Q2032J02935R1687J12763J39986J15381M9210j660P370n273
$$ 188461 246626 328658 431593 523280 636043 776029 891410 940620 938960 946330 941057
10217I41057p3831j15353j20065r0343r3109q9568p8424m2687j6352q459j7241
$$ 941057 867226 751873 631808 541465 448356 358788 280364 237677 221325 212866 195625
10206A95625r280O231k58r381k1891J049P39p938J962j691j149P078j1075n779
$$ 195625 186345 192576 192318 182937 161046 162095 162834 154896 156858 155167 154018 161096 150021 144242
10192A44242n152j0368q749m957p065n698p695k821r430m566M668j5640r552j980
$$ 144242 139090 128722 119973 115016 107951 102253 94558 91737 82307 77741 82409 66769 57217 55237
10178E5237Q231N951n723m966k320j6323q431J3378J5633K94M552j947k654p993
$$ 55237 63468 69419 63696 58730 56410 40087 31656 45034 60667 60961 65513 63566 60912 52919
10164E2919j0548R24M819J100J0555J4579l362k0115P235M660j109r004p120J7557
$$ 52919 42371 43295 48114 49214 59769 74348 70986 50871 58106 62766 61657 52653 45533 63090
10150F3090L287k964L371N193r928j4680j2264M39Q407P78n490k473o994m031
$$ 63090 66377 63413 66784 71977 62049 47369 35105 35544 43951 44729 39239 36766 29772 25741
10136B5741M980N3j2473m053J672J6662P635J0891j2242M0n864J294o627o80J579
$$ 25741 30721 30774 18301 14248 15920 32582 40217 51108 38866 38906 33042 34336 27709 27029 28608
10121B8608o122l646o193P599L730k83J1639N728L181J0258Q483k6350j4332L879
$$ 28608 22486 18840 12647 20246 23976 23693 35332 41060 44241 54499 62982 36632 22300 26179
10107B6179P737L420j2472N152O849k201p706k155n087P609m838L277q056l917
$$ 26179 33916 37336 24864 30016 36865 34664 26958 24803 19716 27325 22487 25764 17708 13791
10093A3791j27K201M841N875M079l952j2480K883p220k621l104k059M804P513
$$ 13791 13664 15865 20706 26581 30660 26708 14228 17111 9891 7270 4166 2107 6911 14424
10079A4424n865o232P565J5337K924k827O87K28j3542m724p865l002N440J3540
$$ 14424 8559 2327 9892 25229 28153 25326 26013 26241 12699 7975 110 -2892 2548 16088
10065A6088J7625l791q902L874K825r708q292Q10J3869P293l561j3814K729K581
$$ 16088 33713 29922 21020 24894 27719 18011 9719 10529 24398 31691 28130 14316 17045 19626
10051A9626k41m008j547J917l071J0089J4220Q603J1473q083l071q897k1574p087
$$ 19626 19385 15377 13830 15747 12676 22765 36985 45588 57061 48978 45907 37010 15436 8349
10037H349K0656J5330J1780O826k06J5954L2198M2338N4901R1785J44966J19822
$$ 8349 29005 44335 56115 62941 62735 78689 110887 153225 208126 299911 444877 564699
10025E64699O5829J4711J7088L5279p4318j61270q8874j2320L083K5084L1648
$$ 564699 630528 645239 662327 697606 623288 462018 373144 360824 363907 388991 420639
10014D20639J0515j9017l4464k1913k6205k8868l3666j9240m237j896J5204O916
$$ 420639 431154 412137 377673 355760 329555 300687 267021 247781 243544 241648 256852 263768
10002B63768j0505k2526m0119k7824k2265j8938p413j2157o865l784j790p56j143
$$ 263768 253263 230737 190618 162794 140529 121591 114178 102021 95156 91372 89582 88826 87683
9989H7683K70j277k1438j1043L359n454R125P313k185N570J3243Q477j2539q354
$$ 87683 87953 86676 65238 54195 57554 52100 61225 68538 66353 71923 85166 93643 81104 72750
9975G2750o094m601N505P646K786p889n147m979L251J3512J550p222j591N226
$$ 72750 66656 62055 67560 75206 77992 70103 64956 59977 63228 76740 78290 71068 69477 74703
9961G4703J3646J5073R754n282K534J0068M691K8566N0751M0510N2337N7948O5107
$$ 74703 88349 103422 113176 107894 110428 120496 125187 153753 204504 245014 297351 355299 420406
9948D20406M8416J9722J3096N00J6234O3240Q3657P0600N0853K0968l173k7809
$$ 420406 468822 488544 501640 502140 518374 581614 665271 735871 786724 807692 804519 776710
9936G76710q3131r8279n2112j7059L1J0557j5137k6860l6019n9662o5529m5547
$$ 776710 693579 595300 543188 526129 526160 536717 521580 494720 458701 399039 333510 287963
9924B87963m2145k1354j4934n448j3653l3700j7378o226K385o330j4848k2008
$$ 287963 245818 224464 209530 204082 190429 156729 139351 133125 135510 129180 114332 92324
9912I2324j4026J3490N561l971j2989l217Q373k983M80J7176m907j1260p928L59
$$ 92324 78298 91788 97349 93378 80389 77172 85545 82562 83042 100218 95311 84051 76123 76482
9898G6482Q984L458j569j1235j2945J0678O042j2690p286J63J027N402n691Q041
$$ 76482 85466 88924 87355 76120 63175 73853 79895 67205 59919 60082 61109 66511 60820 68861
9884F8861q38P988j1291r17R337o547k0515m571P582N144j921j1013j3484Q675
$$ 68861 68023 76011 64720 63803 73140 66593 46078 41507 49089 54233 52312 41299 27815 36490
9870C6490J3535j945J3078p690K786M858M6O455o949R719M338k2009l289N112
$$ 36490 50025 48080 61158 53468 56254 61112 61158 67613 60664 70383 74721 52712 49423 54535
9856E4535k10q768J1468N483K014m072j3260n140M645N49m358J3079k387n305
$$ 54535 54325 45557 57025 62508 64522 60450 47190 42050 46695 47244 42886 55965 53578 48273
9842D8273Q956J1966J474j6015K069m0K0193K6152K2195J4996m71j3265O048j4899
$$ 48273 57229 69195 70669 54654 56723 56683 76876 103028 125223 140219 139748 126483 132531 117632
9828A17632j4448j6468j2439j459M220j9954p525J2417J158q788j863J0647j1177
$$ 117632 103184 86716 74277 72818 77038 57084 49559 61976 63134 54346 52483 63130 51953
9815E1953l578j532J1208K057j394M19r978l447M488M490L509j1810q049m93j0645
$$ 51953 48375 46843 58051 60108 58714 59133 49155 45708 50196 54686 58195 46385 38336 37843 27198
9800B7198r51J4065P348J207M72o133O226p22M048J1250N489k392p127K236O539
$$ 27198 26247 40312 47660 48867 49339 43206 49432 48710 52758 64008 69497 67105 59978 62214 68753
9785F8753r205p214J0526j173J0797M854k3434j0352j273m58R393k116j3702J2887
$$ 68753 59548 52334 62860 61687 72484 77338 53904 43552 42279 41821 51214 49098 35396 48283
9771D8283J3564j0279j973J1160j388j735k764o707p46L862j719j2235n48J9420
$$ 48283 61847 51568 49595 60755 59367 57632 54868 48161 47415 51277 49558 37323 36775 56195
9757E6195N181j1497L313o863q976L649K1507J1593P661k858j7010o499Q951J0241
$$ 56195 61376 49879 53192 46329 37353 41002 62509 74102 81763 78905 61895 55396 64347 74588
9743G4588L067m467j2015j0026o510J1987J1673K841N611L415K381r18P400N48
$$ 74588 77655 73188 61173 51147 44637 56624 68297 71138 76749 80164 82545 81627 89027 89575
9729H9575j242j1005P644j5647l880P651m625M543L144M681k1502j4386J0819
$$ 89575 88333 77328 84972 69325 65445 73096 68471 73014 76158 80839 59337 44951 55770
9716E5770L0925j865p379k0315o839r76N99J4230K113k065r635J4073Q427P36
$$ 55770 86695 84830 77451 57136 50297 49321 49920 64150 66263 64198 54563 68636 77063 77799
9702G7799j8787l409K1408J4057l962j5144n409N291m518n81J0035J6215J7133
$$ 77799 59012 55603 77011 91068 87106 71962 66553 71844 67326 66745 76780 92995 110128
9689A10128j0640j9795L921L621n096l91Q04P220j871k2199K002l088J136J6905
$$ 110128 99488 79693 83614 87235 82139 81748 82552 89772 87901 65702 67704 64616 65752 82657
9675H2657M562j2737O348J2168R061K032p281r95P725L14m976j0727J0183J5709
$$ 82657 87219 74482 80830 92998 102059 104091 96810 95815 103540 103854 98878 88151 98334 114043
9661A14043M506P572r24k346j2523N898n212j0570R621J1890N035j1156k825j0909
$$ 114043 118549 126121 125197 122851 110328 116226 111014 100444 110065 121955 126990 115834 113009 102100
9647A02100O350P763J0073J346J2768M273K568K1866K4503K454K6073M1638M8973
$$ 102100 108450 116213 126286 127632 140400 144673 147241 169107 193610 196064 222137 263775 312748
9634C12748N9758Q4773Q3526Q7729R8723J09376J11299P2038K5523K9472K1453
$$ 312748 372506 457279 540805 628534 727257 836633 947932 1019970 1045493 1074965 1096418
9623A096418k6492j06270j16346q8556p7422r2642r9829p4818m1858l0850k8795
$$ 1096418 1069926 963656 847310 758754 681332 588690 488861 414043 372185 341335 312540
9612C12540k2723j9905p166j3728k0170j2176j802P546j3872j8501J632J176n400
$$ 312540 289817 269912 262746 249018 228848 216672 214870 222416 208544 190043 191675 192851 187451
9599A87451L888m53L85k246q289j8627K768K20p537J7435J2355K619k1364k5011
$$ 187451 191339 190886 191271 189025 180736 162109 164877 165097 157560 174995 187350 189969 168605 143594
9585A43594J564m202m595M002J5354k29P300j193N519q605k1683P298J592q68
$$ 143594 145158 140956 136361 140363 155717 155488 162788 161595 167114 158509 136826 144124 145716 144848
9571A44848j3012p347j1253P988J4968M452o995N58J7373p8l543l133j161K701
$$ 144848 131836 124489 113236 121224 136192 140644 133649 134207 151580 151502 147959 144826 143665 146366
9557A46366J327m552r698q955J5739J1902M978j452q379P701J1539K2271R207
$$ 146366 147693 143141 133443 124488 140227 152129 157107 155655 147276 154977 166516 188787 197994
9544A97994Q855J8062N032N700N592l312l542q620r376j0115J9153J2793l6714
$$ 197994 206849 224911 229943 235643 241235 237923 234381 225761 216385 206270 225423 238216 201502
9531B01502j6860o337k971O45L879L250q223j2111L192n254l133j552j692j782
$$ 201502 184642 178305 175334 175979 179858 183108 174885 162774 165966 160712 157579 156027 154335 152553
9517A52553l038r266j023R401L900q372Q652K613q709m199j308M099j317k237
$$ 152553 149515 140249 139226 148627 152527 144155 152807 155420 146711 142512 141204 145303 143986 141749
9503A41749n674L603J5361N917j104n307j5374m549J0161J266n965R529J1510
$$ 141749 136075 139678 155039 160956 159852 154545 139171 134622 144783 146049 140084 149613 161123
9490A61123p286L416K765K852J9570K6282J3341k0073j0646m832j4802p34m085
$$ 161123 153837 157253 160018 162870 182440 208722 222063 201990 191344 186512 171710 170976 166891
9477A66891j820m23p762j1774N877J5827J3028j2126j666r799m805P830Q105j6266
$$ 166891 165071 164648 156886 145112 150989 166816 179844 167718 166052 156253 151448 159278 167383 151117
9463A51117r223R821N091l161J0857J0097J552K855J8235J1478J8448K6512L1148
$$ 151117 141894 151715 156806 153645 164502 174599 176151 179006 197241 208719 227167 253679 284827
9450B84827J2739L976J7424R907j8100r192n562k1831l2817k0181r969J0931K489
$$ 284827 297566 301542 318966 328873 310773 301581 296019 274188 241371 221190 211221 222152 224641
9437B24641j933j4992k969n141k811J1496K3724M506p686j3535J3824J6133p176
$$ 224641 222708 207716 204747 199606 196795 208291 232015 236521 228835 215300 229124 245257 238081
9424B38081j3109L019O547j3365N744K4368J6753J3344K4004L4239L1773J7370
$$ 238081 224972 227991 234538 221173 226917 251285 268038 281382 305386 339625 371398 388768
9412C88768J8982O33K84j2832j7314j8535j7020k2813j0519p888l565j4345j57
$$ 388768 407750 408383 408667 395835 378521 359986 342966 320153 309634 301746 298181 283836 283679
9399B83679L133m385j5917L286O442p996L978O968k6392j4492Q731M857O161R065
$$ 283679 286812 282427 266510 269796 276238 268242 272220 279188 252796 238304 247035 251892 258053 267118
9385B67118K834K785L5140J6465J1545L057K8883K2178J5823R312M639R486n402
$$ 267118 269952 272737 307877 324342 335887 338944 367827 390005 405828 415140 419779 429265 423863
9372D23863k1975l0975j2443j0211k2796j6950r599n466J4320J4348M43j4838
$$ 423863 401888 370913 358470 348259 325463 308513 298914 293448 307768 322116 322559 307721
9360C07721n777K3357K2447L349j4790j5027P560J5046k0538l2997q905n133J9960
$$ 307721 301944 325301 347748 351097 336307 321280 328840 343886 323348 290351 281446 276313 296273
9347B96273K9927m496l576J6955k937j0149J76p07Q089O608J03J2611q05j4353
$$ 296273 326200 321704 318128 335083 332146 321997 322173 321466 329555 336163 336266 348877 348072 333719
9333C33719j9839r293J0693J3317m727q870M529N0K1626R156j7248n468O526K387
$$ 333719 313880 304587 315280 328597 323870 315000 319529 319579 341205 350361 333113 327645 334171 336558
9319C36558J5688R879l011J499m768p128N58Q680Q29K186M33K1740K1572R810
$$ 336558 352246 362125 359114 360613 355845 348717 349275 357955 358784 360970 361403 383143 404715 414525
9305D14525m589l388o49P384J4849M329j6901P345M941J1164l331J262J4956J46
$$ 414525 409936 406548 405899 413283 428132 432461 415560 422905 427846 439010 435679 436941 451897 452043
9291D52043q608J1213N045O073J0008J3818J1866K3057M457n238l582O902J3572
$$ 452043 443435 454648 459693 465766 475774 489592 501458 524515 528972 523734 520152 527054 540626
9278E40626J5919j526L949O430J8687J8366K1137L1032N0678N6489O8624Q9957
$$ 540626 556545 555019 558968 565398 584085 602451 623588 654620 705298 761787 830411 920368
9266I20368J07471J17386J01345O2511M6023q77m3438p5064j11954p9819l9143
$$ 920368 1027839 1145225 1246570 1309081 1355104 1354227 1310789 1235725 1123771 1043952 1004809
9255A004809j7936P807P094L8038O2576Q4642R2671Q5076P2601N8451K8267o6
$$ 1004809 986873 994680 1001774 1039812 1102388 1187030 1279701 1364777 1437378 1495829 1524096 1524030
9243A524030r297l0114m2716k5082q879r138k0576j8451R447M3886N5840R2060
$$ 1524030 1514733 1484619 1441903 1416821 1407942 1398804 1378228 1359777 1369224 1413110 1468950 1561010
9231A561010J46294K09796K53458K52794J85270J02486K1929n9768j76731k48113
$$ 1561010 1707304 1917100 2170558 2423352 2608622 2711108 2733037 2673269 2496538 2248425
9221B248425k54641k00733j36803q7301l9900j7695J443R738J1599K1426K9080
$$ 2248425 1993784 1793051 1656248 1568947 1529047 1511352 1512795 1522533 1534132 1555558 1584638
9210A584638K5961M3731N3551K9080M018N738j3471o0617p9345q0848p8164n4540
$$ 1584638 1610599 1654330 1707881 1736961 1740979 1746717 1733246 1672629 1593284 1512436 1434272 1379732
9198A379732l7959l183J1802M5675O6043R7430J06549Q6298N6153K2097p561k7599
$$ 1379732 1341773 1338590 1350392 1396067 1462110 1559540 1666089 1752387 1808540 1830637 1823076 1795477
9186A795477j00962j15565q4721p2986n8574k9538j5010o693K992r642o892K165
$$ 1795477 1694515 1578950 1494229 1421243 1362669 1333131 1318121 1311428 1314420 1304778 1297886 1300051
9174A300051L167O075J3506K6426K0336J7920J2900P871Q296Q649K4018J8512
$$ 1300051 1303218 1309293 1322799 1349225 1369561 1387481 1400381 1408252 1416548 1425197 1449215 1467727
9162A467727L3199K2832J6959J9228K0465K9395J1047K3759K1275K7526L4070
$$ 1467727 1500926 1523758 1540717 1559945 1580410 1609805 1620852 1644611 1665886 1693412 1727482
9151A727482K5333K5330J7891J1026J2567K8771J9793K7388K9738M0285K1547
$$ 1727482 1752815 1778145 1796036 1807062 1819629 1848400 1868193 1895581 1925319 1965604 1987151
9140A987151K1518J6048Q944J5580K1369L1681L5364L2440K5414K6018K4514L1231
$$ 1987151 2008669 2024717 2033661 2049241 2070610 2102291 2137655 2170095 2195509 2221527 2246041 2277272
9128B277272K1818K9377M4899L7510L6127N2912M7449K4682M2395N1464L7455
$$ 2277272 2299090 2328467 2373366 2410876 2447003 2499915 2547364 2572046 2614441 2665905 2703360
9117B703360M6869L2824L6718M3248L7408M6546O9280N5335O3155P4374N4200
$$ 2703360 2750229 2783053 2819771 2863019 2900427 2946973 3016253 3071588 3134743 3209117 3263317
9106C263317O0832O0469P7854Q7722Q9213P5926M9753O8838P9817P5769N6532
$$ 3263317 3324149 3384618 3462472 3550194 3639407 3715333 3765086 3833924 3913741 3989510 4046042
9095D046042O0189O0449P8253P5195Q5676R1183R4328Q6284Q5680R8557R3809
$$ 4046042 4106231 4166680 4244933 4320128 4405804 4496987 4591315 4677599 4763279 4861836 4955645
9084D955645R4993R9696R5500J16416J21243J14841J05187J24545J35690J50473
$$ 4955645 5050638 5150334 5245834 5362250 5483493 5598334 5703521 5828066 5963756 6114229
9074F114229J58973J66139J81137J82269J90455J91730K05091K18921K36964K40316
$$ 6114229 6273202 6439341 6620478 6802747 6993202 7184932 7390023 7608944 7845908 8086224
9064H086224K69003K88075L03854L22382L48251L75141M00439M18203L97171M02195
$$ 8086224 8355227 8643302 8947156 9269538 9617789 9992930 10393369 10811572 11208743 11610938
9054A1610938M30327M51376M61696M69334N21195N44270N86889O19933O44370
$$ 11610938 12041265 12492641 12954337 13423671 13944866 14489136 15076025 15695958 16340328
9045A6340328P07475P55547Q18904Q80762R55398J035338J096355J186129J263051
$$ 16340328 17047803 17803350 18622254 19503016 20458414 21493752 22590107 23776236 25039287
9036B5039287J351295J469456J571896J686844J831808J989317K158960K329788
$$ 25039287 26390582 27860038 29431934 31118778 32950586 34939903 37098863 39428651
9028C9428651K532631K740505K968777L239388L517266L796717M082942M392058
$$ 39428651 41961282 44701787 47670564 50909952 54427218 58223935 62306877 66698935
9020F6698935M705973N005532N311050N542201N744365N846382N845636N716270
$$ 66698935 71404908 76410440 81721490 87263691 93008056 98854438 104700074 110416344
9012A10416344N454892N021150M429363L672618K786149J789263P57242k99145
$$ 110416344 115871236 120892386 125321749 128994367 131780516 133569779 134327021 134027876
9004A34027876j354543k304143l107799l750204m265040m621767m837495m931835
$$ 134027876 132673333 130369190 127261391 123511187 119246147 114624380 109786885 104855050
8996A04855050m952912m861315m711019m543485m349267m137150l895199l648103
$$ 104855050 99902138 95040823 90329804 85786319 81437052 77299902 73404703 69756600
8988F9756600l419021l203974l005875k813297k624552k439869k293556k163330
$$ 69756600 66337579 63133605 60127730 57314433 54689881 52250012 49956456 47793126
8980D7793126k023908j900465j794417j691404j587807j487894j392192j319675
$$ 47793126 45769218 43868753 42074336 40382932 38795125 37307231 35915039 34595364
8972C4595364j251187j187952j132899j070674j008885r61352r14841q85667q48733
$$ 34595364 33344177 32156225 31023326 29952652 28943767 27982415 27067574 26181907 25333174
8963B5333174q03370p60514p16275p06699o72446o14560n81353n49008n34356
$$ 25333174 24529804 23769290 23053015 22346316 21673870 21059310 20477957 19928949 19394593
8954A9394593n07709n03003n02812n04294n18620n19273m94437m87331m84640
$$ 19394593 18886884 18383881 17881069 17376775 16858155 16338882 15844445 15357114 14872474
8945A4872474m70420m40469m19943l81047l70222l36869l04427k86022k76640
$$ 14872474 14402054 13961585 13541642 13160595 12790373 12453504 12149077 11863055 11586415
8936A1586415k67356k66025k60234k77071k88435k87259k65717k66940k61408
$$ 11586415 11319059 11053034 10792800 10515729 10227294 9940035 9674318 9407378 9145970
8927I145970k60149k50371k30946k06478k06497k04899j95674j92739j81519j69368
$$ 9145970 8885821 8635450 8404504 8198026 7991529 7786630 7590956 7398217 7216698 7047330
8917G047330j74104j71244j51574j55802j41151j47676j22641j08413j00774p5885
$$ 7047330 6873226 6701982 6550408 6394606 6253455 6105779 5983138 5874725 5773951 5698066
8907E698066q0135p7675q3882q3073q6284q7898p8484p4625n5899n7385l3781
$$ 5698066 5617931 5540256 5456374 5373301 5287017 5199119 5120635 5046010 4990111 4932726 4898945
8896D898945q013O406N6581J57384K98687N65592R36730J187508J081761O59785
$$ 4898945 4890932 4897338 4953919 5111303 5409990 5975582 6912312 8099820 9181581 9841366
8886I841366K58147L0430k67376j109084j557921j197171p61893m85225l29183
$$ 9841366 10099513 10129943 9862567 8753483 7195562 5998391 5236498 4751273 4422090
8877D422090k19105j69121j30768j14757j22851j14059r7225j13795j00513o3944
$$ 4422090 4202985 4033864 3903096 3788339 3665488 3551429 3454204 3340409 3239896 3175952
8867C175952p6855q0921o6504o1919n9775l9982l8622l7173k6588m0565m1865
$$ 3175952 3099097 3018176 2951672 2889753 2829978 2789996 2751374 2714201 2687613 2647048 2605183
8856B605183m6580n4780m5200l8470n8962m0854l3270k8870l3868l4588l1491
$$ 2605183 2558603 2503823 2458623 2420153 2361191 2320337 2287067 2258197 2224329 2189741 2158250
8845B158250l5599l4677k5681k8596l4241q162k4752l1820j6696j7531j3420p325
$$ 2158250 2122651 2087974 2062293 2033697 1999456 1991294 1966542 1934722 1918026 1900495 1887075 1879750
8833A879750j3086j3382l866K074J1949r688j263J4083j1656o300J0646K0274
$$ 1879750 1866664 1853282 1849416 1851490 1863439 1853751 1852488 1866571 1854915 1848615 1859261 1879535
8821A879535J0445J9370J7652j787m736o312k2512l1590k9884k3438l5065n0673
$$ 1879535 1889980 1909350 1927002 1925215 1920479 1914167 1891655 1860065 1830181 1806743 1771678 1721005
8809A721005m2107k1343k0212k5489k0836j5379j5712j4930l2815l6901j9265
$$ 1721005 1678898 1657555 1637343 1611854 1591018 1575639 1559927 1544997 1512182 1475281 1456016
8798A456016j8392k9611m3769k4666j773r726j5583j8701O883O940N70K137l157
$$ 1456016 1437624 1408013 1364244 1339578 1337805 1328079 1312496 1293795 1300678 1307618 1308188 1310325 1307168
8785A307168o423K160K372m413j5336k553L7855N0812M7258N2454O1587P6679
$$ 1307168 1300745 1302905 1305277 1300864 1285528 1282975 1320830 1371642 1418900 1471354 1532941 1609620
8773A609620O9647N2906M7257K5144k1961m2740n3155n8962p2196p7710p6790
$$ 1609620 1679267 1732173 1779430 1804574 1782613 1739873 1686718 1627756 1555560 1477850 1401060
8762A401060n5255n0010l7255m5853m1799k7836j9486k0128k4652k1821k8653
$$ 1401060 1345805 1295795 1258540 1212687 1170888 1143052 1123566 1103438 1078786 1056965 1028312
8751A028312l3409k2604N942K914Q466k547K0685K2119N747N041J2149Q321J9975
$$ 1028312 994903 972299 978241 981155 989621 987074 1007759 1029878 1035625 1040666 1052815 1061136 1081111
8738A081111L2541L6625L4180L3779N0781O0987P3934Q5689Q6200Q2400P6798
$$ 1081111 1113652 1150277 1184457 1218236 1269017 1330004 1403938 1489627 1575827 1658227 1735025
8727A735025N1196M1714J044p163l4739l0041k7346m2857n5910p8418r5778q2641
$$ 1735025 1786221 1827935 1828979 1821816 1787077 1757036 1729690 1686833 1630923 1552505 1456727 1374086
8715A374086q5286p9053o7906n2222l7255m1991l9515l6656k4891k7755j4197
$$ 1374086 1288800 1209747 1141841 1089619 1052364 1010373 970858 934202 909311 881556 867359
8704H67359l044R99j665Q274N337n688Q247K8190P589k172J4722K0578K3262L2182
$$ 867359 864315 865314 863649 871923 877260 871572 879819 908009 915598 913426 928148 948726 971988 1004170
8690A004170M2071M4668N9309L9828M5196N4148O3976N9808M6137M1625L1881
$$ 1004170 1046241 1090909 1150218 1190046 1235242 1289390 1353366 1413174 1459311 1500936 1532817
8679A532817L1267J2711L814M417L683l0866p4800q1457q0699r4914q6643p3521
$$ 1532817 1564084 1576795 1580609 1585026 1588709 1557843 1483043 1401586 1320887 1225973 1139330 1065809
8667A065809n4266m7968m4320j7507k6374l2294k1150j7843j1785j2570j8978
$$ 1065809 1011543 963575 919255 901748 875374 843080 821930 804087 792302 779732 760754
8656G60754q226o296m313K679l736j2179j5615l829M381L197N285k969Q387J3770
$$ 760754 752528 746232 741919 744598 740862 728683 713068 709239 713620 716817 722102 719133 727520 741290
8642G41290J6728L0449L8272K3088M2744M8276L5522J0951J3508J7432J9624O433
$$ 741290 758018 788467 826739 849827 892571 940847 976369 987320 1000828 1018260 1037884 1044317
8630A044317j5299k2204o5589p2568n2370m7423o5437m3881j5205j9427k3013
$$ 1044317 1029018 1006814 941225 868657 816287 768864 703427 659546 644341 624914 601901
8619F01901j0866J2603J608j1138j4165l271N071N821R740m160n625l724p731
$$ 601901 591035 603638 605246 594108 579943 576672 581743 587564 597304 593144 587519 583795 576064
8606E76064n247k4082k9854j8559O701j3287j6699j993k409k883j546J1596K982
$$ 576064 570817 546735 516881 498322 505023 491736 475037 473044 470635 467752 466206 477802 480784
8593D80784m996k633R571K8052J2303J6638j434j8821k8794l9548j5109j6370
$$ 480784 475788 473155 482726 510778 523081 539719 538285 519464 490670 451122 436013 419643
8581D19643k6532k2821j7858Q265l954p937j9293j2174m885l154N835r506P191
$$ 419643 393111 370290 352432 360697 356743 348806 329513 317339 312454 309300 315135 305629 312820
8568C12820J0369K94J2597J3019j0294j0806K218j939j3042j6358j315k910K519
$$ 312820 323189 323483 336080 349099 338805 327999 330217 328278 315236 298878 297563 294653 297172
8555B97172j16O391l63n882q100k160J1528o49K389K574m25K363n058j8067j1460
$$ 297172 297056 303447 303084 297202 289102 286942 298470 297821 300210 302784 302359 304722 299664 281597 270137
8540B70137j2221L946J2237k219j4069k331o205j3742n473J332j0335j1906o046
$$ 270137 257916 261862 274099 271880 257811 255480 249275 235533 230060 231392 221057 209151 203105
8527B03105K982j35L058P238p254p809m703R812J3175J022R921J470j5096k5173
$$ 203105 206087 205952 209010 216248 208994 201185 196482 206294 219469 220491 230412 231882 216786 191613
8513A91613J98k210M361k347j0116M969R177R34j2878J309m90p384j1699M402
$$ 191613 191811 189601 193962 191615 181499 186468 195645 196579 183701 185010 184520 177136 165437 169839
8499A69839N122j048R675p17r31l227j7477l285J1600l256J511J0863O672Q290
$$ 169839 174961 173913 183588 182871 181940 178713 161236 157951 169551 166295 167806 178669 185341 193631
8485A93631J2680o496j0355p45R429m309K974o136j4642j8533j891J4084J1167
$$ 193631 206311 199815 189460 188715 198144 193835 196809 190673 176031 157498 155607 169691 180858
8472A80858j763k039k534J083j514j1852j2049m598p757J4503J4203r426n419
$$ 180858 179095 177056 174522 175605 174091 162239 150190 145592 137835 152338 166541 157115 151696
8459A51696M139K932Q524m842j0477J970m485j5057o452p908P129l683q70N16
$$ 151696 155835 158767 167291 162449 151972 153942 149457 134400 127948 120040 127169 123486 122616 123132
8445A23132r113O993O710k612q744Q107M195J3740J5790k494n755j3169j4741
$$ 123132 114019 121012 127722 125110 116366 124473 128668 142408 158198 155704 149949 136780 122039
8432A22039R642J965m715Q985L840k776N015Q545M007k373P924O085M874l298
$$ 122039 131681 133646 128931 137916 141756 138980 143995 152540 156547 154174 162098 168183 173057 169759
8418A69759m952l462P387J3038J9099J7005R269j0628L17k237k4251k6658N269
$$ 169759 164807 161345 168732 181770 200869 217874 227143 216515 216832 214595 190344 163686 168955
8405A68955o37j0037k1224p942K378J5587Q061j1114j978k501K26J964K258j0553
$$ 168955 168318 158281 137057 129115 131493 147080 155141 144027 142049 139548 139774 141738 143996 133443
8391A33443L733r31J633m547j2233P960Q227p245j1213m462q046O942M205J3076
$$ 133443 137176 136245 137878 133331 121098 129058 137285 130040 118827 114365 106319 113261 117466 130542
8377A30542J3428q758j5192l306J467P995P5J7180L7025M3249M6886L2012J6292
$$ 130542 143970 135212 120020 116714 118181 126176 126251 143431 180456 223705 270591 302603 318895
8364C18895r697k292j8318m0490m8203m3964n550K882P363j8040j9775j6378n438
$$ 318895 309198 306906 288588 248098 199895 155931 150381 153263 160626 142586 122811 106433 100995
8351A00995J1023J6088j864J7007J2717O448R338O234r85M422r357j0937J2180
$$ 100995 112018 128106 126242 143249 155966 162414 171752 177986 177001 181423 172066 161129 173309
8338A73309K580k786L21J0335J7469K13j7783j0549o905p372J3223O366n892m877
$$ 173309 175889 173103 173424 183759 201228 201441 183658 173109 166204 158832 172055 178421 172529 167652
8324A67652m491p785O2J7081K9565R224k967o18J691j1255o149j2964j4477j1564
$$ 167652 163161 155376 155438 172519 202084 211308 208341 207723 209414 198159 192010 179046 164569 153005
8310A53005R06J3443j2249q46j4075r748j1497J7332J3131J2733o77p986j780
$$ 153005 153911 167354 155105 154259 140184 130436 118939 136271 149402 162135 161458 153472 151692
8297A51692J1229J6R872J5142N090M205K741n472K237Q852j2868k2254k3610J131
$$ 151692 162921 162937 172809 187951 193041 197246 199987 194515 196752 205604 192736 170482 146872 148003
8283A48003j334Q315k896n783j46j168k83n182L701l591L50j1770j2774j308M967
$$ 148003 146669 154984 152088 146305 146159 144991 144708 139526 143227 139636 139986 128216 115442 114134 119101
8268A19101L653q063j0026n472j441M10J2112J6296m147J236k919Q29k772N546
$$ 119101 122754 114691 104665 99193 97752 98162 110274 126570 122423 123659 120740 121569 118797 124343
8254A24343L990P012J9171J5417J2799J4768J6897K7991L2856J9691j4929j8387
$$ 124343 128333 135345 154516 169933 182732 197500 214397 242388 275244 294935 280006 261619
8242B61619j3432j118j857P98j9802k2737j564O547l957q398k4312n021n976P234
$$ 261619 248187 247069 245212 246010 226208 203471 201907 208454 204497 196099 171787 166766 160790 168024
8228A68024K03p628n262R726J7441P876J6011K405L318N020K135K3560L0425M6697
$$ 168024 168227 160599 155337 165063 182504 190380 206391 208796 212114 217134 219269 242829 273254 319951
8214C19951O4398R1138J10448J32847J59454J55031J41078J02698K5063l1648
$$ 319951 384349 475487 585935 718782 878236 1033267 1174345 1277043 1302106 1270458
8204A270458q0265j14480j51223j55075r8085p8614n1913l3179j3830l863m456
$$ 1270458 1190193 1075713 924490 769415 671330 592716 540803 507624 493794 489931 485475
8193D85475l3371k3885j6727j7019k3574j6710j3775N838L028j986K4379J5005
$$ 485475 452104 428219 411492 394473 370899 354189 340414 346252 349280 347294 371673 386678
8181C86678J8593K4350K4210M0061L8523L5396P579M428Q227L7198K6076M256
$$ 386678 405271 429621 453831 493892 532415 567811 575390 579818 588045 625243 651319 655575
8169F55575J1858K2456M7428M5502N5950O1192L9810N1011Q5298Q9645Q7311P0036
$$ 655575 667433 689889 737317 782819 838769 899961 939771 990782 1076080 1165725 1253036 1323072
8157A323072N9615L0114L219j8658m5851o7928p3600n3327n1604l4187j7041j1961
$$ 1323072 1382687 1412801 1416020 1397362 1351511 1283583 1209983 1156656 1105052 1070865 1053824 1041863
8145A041863p513l6770n0431o8199o3077o5509o2429n2516l9499l4098k8288k4748
$$ 1041863 1034350 997580 947149 878950 815873 750364 687935 635419 595920 561822 533534 508786
8133E08786r854k1625l1801k1619q34n23j648P824J770P915R04J3559J8339K1884
$$ 508786 498932 477307 445506 423887 423053 422530 420882 428706 430476 438391 439295 452854 471193 493077
8119D93077N8365P8433Q6446J09195J22342J08265P8888P9655O9082O2131O3213
$$ 493077 551442 629875 716321 825516 947858 1056123 1135011 1214666 1283748 1345879 1409092
8108A409092O9662P3688M7807L0309l022m7453j02407j22941r9395o3615r355
$$ 1409092 1478754 1552442 1600249 1630558 1627536 1580083 1477676 1354735 1255340 1191725 1182370
8097A182370M7018J28552J97750K42881L00689L03799K76539J84422Q1804k7216
$$ 1182370 1229388 1357940 1555690 1798571 2099260 2403059 2679598 2864020 2945824 2918608
8087B918608j48255k50880k87825k85145k69822k21066j78021j15258p8374p9763
$$ 2918608 2770353 2519473 2231648 1946503 1676681 1455615 1277594 1162336 1083962 1004199
8077A004199n9765l1774k3047L622R734O644J8668K0706K3281K3755p29r25k611
$$ 1004199 944434 912660 889613 893235 902969 909613 928281 948987 972268 996023 995294 994369 991758
8064I91758O437K7749K9023J4547M898k500m681k961p162j2108P954M7369J10479
$$ 991758 998195 1025944 1054967 1069514 1074412 1071912 1067231 1064270 1057108 1045000 1052954 1100323 1210802
8051A210802K02359L12857M40189N79510O66391O47560N72185L80901J31261j14303
$$ 1210802 1413161 1726018 2166207 2745717 3412108 4059668 4631853 5012754 5144015 5029712
8041E029712m13262n79262o18250n78675m80256l39943k27304k01052j64468j33925
$$ 5029712 4616450 4037188 3418938 2840263 2360007 2020064 1792760 1591708 1427240 1293315
8031A293315j07060q1776m0919n1378n6007m8645m7148l2607k1517l1542j8978
$$ 1293315 1186255 1104479 1063560 1012182 956175 907530 860382 827775 806258 774716 755738
8020G55738p130J732j201J7901J9918R624J813J7116K128m792j976J1414L4317
$$ 755738 748608 750340 749139 767040 786958 796582 798395 815511 817639 812847 810871 822285 856602
8007H56602N9969P0497J01672J39203J69828J85438J98000J64955J14535M8891
$$ 856602 916571 987068 1088740 1227943 1397771 1583209 1781209 1946164 2060699 2109590
7997B109590L4o0972j56411k09385j85881j77946j65361j55153j27710p8309o1390
$$ 2109590 2109624 2048652 1892241 1682856 1496975 1319029 1153668 998515 870805 792496 731106
7986G31106n0868n0115m2041l6479l3727l6382j9611j3077j0030p25j3051k5058
$$ 731106 680238 630123 588082 551603 517876 481494 461883 448806 438776 438051 425000 399942
7974C99942l2462R586N932n042j939j4164k5558n404k704k0756k8401k6309M64
$$ 399942 367480 377066 382998 377956 376017 361853 336295 330891 328187 307431 279030 252721 253185
7961B53185o956p388J07j0177p172N887r170p789J1404O800Q515L07j6804k8256
$$ 253185 246229 238841 238948 228771 221599 227486 218316 210527 221931 228731 237246 237553 220749 192493
7947A92493j2335l892j1164j0548j8575l770J5045p739Jj873Q41k651k052O014
$$ 192493 180158 176266 165102 154554 135979 132209 147254 139515 139516 137643 138484 135833 133781 139795
7933A39795P138l715j5529j8050J0078L260j3206q824O290M402L264k3333o356
$$ 139795 146933 143218 127689 109639 119717 122977 109771 100947 107237 111639 114903 91570 85214
7920H5214J3300O398J549N134n598j7350K52j1068p828j181J1186N361m449n275
$$ 85214 98514 104912 106461 111595 105997 88647 88899 77831 70003 68822 80008 85369 80920 75645
7906G5645L835R928J3193J0313M637K40p559l474m31J813L053k802o48j0965O89
$$ 75645 79480 89408 102601 112914 117551 117791 110232 106758 106327 108140 111193 108391 107743 96778 97467
7891I7467j6925j5964O833J4170o53j7449j366J9731p824l102j0395k47j1315
$$ 97467 80542 64578 71411 85581 84928 67479 66113 85844 78020 74918 64523 64276 52961
7878E2961j982J9477K35o798j2950J2368r912r063J286n98J2071O161q000j345
$$ 52961 50979 70456 70691 63893 50943 63311 53399 44336 45622 45024 57095 63256 55256 53911
7864E3911P65k78L590m325l767J689o20j4095r624O372J3558M666K896M951J7672
$$ 53911 54676 54398 57988 53663 49896 51585 50965 36870 27246 33618 47176 51842 54738 59689 77361
7849G7361K2307L459J56j0995j3671k8726o354M895m752o678M579K2718N33j4701
$$ 77361 99668 103127 103283 92288 78617 49891 43537 48432 43680 37002 41581 64299 64832 50131
7835E0131j7115L001K453j5801R7n908n866J3611J0268k951n555j5154j6214j221
$$ 50131 33016 36017 38470 22669 22766 16858 10992 24603 34871 31920 26365 11211 -5003 -6224
7821f224P993Q353P123R018P530k389j2319j657J5661O630j484j565P916R86j5321
$$ -6224 1769 10122 17245 26263 33793 31404 19085 17428 33089 39719 38235 36670 44586 45572 30251
7806C0251O529R460o548m58M41J809p368l519P305P100K622l152q146k222j4553
$$ 30251 36780 46240 39692 39234 39675 41484 34116 30597 37902 45002 47624 44472 36326 34104 19551
7791A9551J59K738m584K173P822K757l608M464P670J0519l708L080L848k7097
$$ 19551 19710 22448 17864 20037 27859 30616 27008 31472 39142 49661 45953 49033 52881 25784
7777B5784j0878q726J934R728N406m624K756o08R747K0324m205P039N745p811
$$ 25784 14906 6180 8114 17842 23248 18624 21380 20772 30519 50843 46638 53677 59422 51611
7763E1611p662N805j922p099j0890j0335p990j4640r081p35J5140P431o0J0765
$$ 51611 43949 49754 47832 40733 29843 19508 11518 -3122 -12203 -12938 2202 9633 9573 20338
7749B0338R186o8J264M556J1886o645j3784j0909L810p018J080N217J5091J0328
$$ 20338 29524 29456 30720 35276 47162 40517 26733 15824 19634 12616 13696 18913 34004 44332
7735D4332N275l244J2328J1790q465j1431j6334j0368j6163p839J1764m633j3046
$$ 44332 49607 46363 58691 70481 62016 50585 34251 23883 7720 -119 11645 7012 -6034
7722f034p581J6624J8639K1294m184j0549q301q668J6128J82j2084Q706R401K727
$$ -6034 -13615 3009 21648 42942 38758 28209 19908 11240 27368 27550 15466 24172 33573 36300
7708C6300o82r652n047N392j984O460R370p814m99M6j512j027Q318R270j4872
$$ 36300 35618 25966 20919 26311 24327 30787 40157 32343 31844 31890 30378 29351 37669 46939 32067
7693C2067K405N539j5333j5018P435J2033l155l337K674j0517j5122j661m185
$$ 32067 34472 40011 24678 9660 17095 29128 25973 22636 25310 14793 -329 -1990 -6175
7680f175j1505J074K3974K4539K0855o438l91K4032J3000k1219j8464j4855k1487
$$ -6175 -17680 -16606 7368 31907 52762 46324 45933 69965 82965 61746 43282 28427 6940
7667F940p762R464j5853k337k80J0716R562J0003j1704j6538k126k727J3254J766
$$ 6940 -822 8642 -7211 -9548 -9828 888 10450 20453 8749 -7789 -9915 -12642 612 2378
7653B378J831O794o713J2314J3992J0583o839k880j866P620j3738j9003Q999N556
$$ 2378 4209 11003 4290 16604 30596 41179 34340 31460 29594 37214 23476 4473 13472 19028
7639A9028O139k296M406j3013j4500M432N827J1200J4891K501j1484r850N601
$$ 19028 25167 22871 27277 14264 -236 4196 10023 21223 36114 38615 27131 17281 22882
7626B2882Q419j708M406m963j6487J157J1399P136j2218j0043q409R221k001K094
$$ 22882 31301 29593 33999 29036 12549 13706 25105 32241 20023 9980 1571 10792 8791 10885
7612A0885P052M005o834j853m356J5299K830o438Q480O369p057j5086o511Q232
$$ 10885 17937 21942 15108 13255 8899 24198 27028 20590 29070 35439 28382 13296 6785 15017
7598A5017N151m868j3349j2503J5109K2729K396j2565j0843l318k308r54N568
$$ 15017 20168 15300 1951 -10552 4557 27286 29682 17117 6274 2956 648 -306 5262
7585E262j19j1126m155R984J7818p463l809R253n137m812m725r067m934K472K49
$$ 5262 5143 -5983 -10138 -154 17664 10201 6392 15645 10508 5696 971 -8096 -13030 -10558 -10309
7570a0309M396o68J1986O606n681o459P305J2831L761J1794O931o84K5j0723n905
$$ -10309 -5913 -6581 5405 12011 6330 -129 7176 20007 23768 35562 42493 41809 41834 31111 25206
7555B5206L681L402j912j1507Q03k837q517J32L808q56q71N06J392J1254N805
$$ 25206 28887 32289 30377 18870 19673 16836 8319 8451 12259 11403 10532 11038 12430 23684 29489
7540B9489j9001k0479J5128J6682q273j3885J632q590J811K0934J6009R046r343
$$ 29489 10488 -9991 5137 21819 13546 -339 1293 -7297 -5486 15448 31457 40503 31160
7527C1160j4413o226l42O070K686J353q898k779L558j0418r654O824J0116j2237
$$ 31160 16747 10521 10179 16249 18935 20288 11390 8611 12169 1751 -7903 -1079 9037 -3200
7513c200r918Q083K3865j102j3259o829p852K741L044N411K985n300m557j5566
$$ -3200 -13118 -5035 18830 17728 4469 -2360 -10212 -7471 -4427 984 3969 -1331 -5888 -21454
7499b1454k99J8222k810j8733J536J6480R617J2448n537n229j2389m531J2371
$$ -21454 -21753 -3531 -6341 -25074 -23538 -7058 2559 15007 9470 4241 -8148 -12679 -308
7486c08Q045R92j1868k612k102k386P535P406j0886M692p718o997J0309p264J515
$$ -308 7737 8729 -3139 -5751 -7853 -10239 -2704 4702 -6184 -1492 -9210 -16207 -5898 -13162 -11647
7471a1647l12J1509K710p03M180J007j831L183o826q463P704J3398Q639K268o385
$$ -11647 -11959 -450 2260 1557 5737 6744 4913 8096 1270 -7193 511 13909 22548 24816 18431
7456A8431K659P549L603j5771j3037Q951O832Q635r853l774j2735j5474n181J4461
$$ 18431 21090 28639 32242 16471 3434 12385 19217 27852 17999 14225 1490 -13984 -19165 -4704
7442d704O051M175n822j4504J0143p3L485o334M999J2712j8612j5618O779J0844
$$ -4704 1347 5522 -300 -14804 -4661 -4734 -1249 -7583 -2584 10128 -8484 -24102 -17323 -6479
7428f479j316n930R797J7877P879M073o65o965k382j073K213N786j0662j0505
$$ -6479 -7795 -13725 -3928 13949 21828 25901 25236 18271 15889 14816 17029 22815 12153 1648
7414A648J4496m920j3696j1102Q675P15m65L729m088n810l131J0504n952r74M053
$$ 1648 16144 11224 -2472 -13574 -4899 -4184 -4649 -920 -5008 -10818 -13949 -3445 -9397 -10371 -6318
7399f318r20K742Q81L654o873M000J2707m027j549J1421L340j0831p219N951j52
$$ -6318 -7238 -4496 -3615 39 -6834 -2834 9873 5846 4297 15718 19058 8227 1008 6959 6807
7384F807n279m713l850j4057N08p371J159J3018J1467J0072J383j7735P476K266
$$ 6807 1528 -3185 -7035 -21092 -20584 -27955 -26796 -13778 -2311 7761 9144 -8591 -1115 1151
7370A151j2663l415J1189k427J755R35L690k2003j906l145k646j233O382J4618
$$ 1151 -11512 -14927 -3738 -6165 -4410 -3475 215 -21788 -23694 -26839 -29485 -30718 -24336 -9718
7356i718J5201O375J667P331K954K909P761j3871o746j175N128N560r919j216
$$ -9718 5483 11858 13525 20856 23810 26719 34480 20609 13863 12688 17816 23376 13457 12241
7342A2241k23K1821J004r280j4141j014j010K090l238j0255q538o938P943r81
$$ 12241 12018 33839 34843 25563 11422 10408 9398 11488 8250 -2005 -10543 -17481 -9538 -10519
7328a0519q320p898m337n457p374P648K2758R603N664K882q559j0458m104L903
$$ -10519 -18839 -26737 -31074 -36531 -43905 -36257 -13499 -3896 1768 4650 -3909 -14367 -18471 -14568
7314a4568O566k865p971J3017J6696n018P290p338j7128N0J3752J9668r058r537
$$ -14568 -8002 -10867 -18838 -5821 10875 5857 13147 5809 -11319 -11269 2483 22151 13093 3556
7300C556p348m367p75j89P80J185N739J0976k309j2523j1975j4174N974K064k320
$$ 3556 -3792 -8159 -8934 -9123 -8343 -7158 -1419 9557 7248 -5275 -17250 -31424 -25450 -23386 -25706
7285b5706L150J0365N904l973j551Q741l063j2055O4M538N525J315P929o67j1061
$$ -25706 -22556 -12191 -6287 -10260 -11811 -3070 -6133 -18188 -18124 -13586 -8061 -6746 1183 516 -10545
7270a0545m356K0091K642j6853O463p690k471m682O195J4289q993l417P291J3272
$$ -10545 -14901 5190 7832 -9021 -2558 -10248 -12719 -17401 -11206 3083 -5910 -9327 -2036 11236
7256A1236j530j9950R950Q936o661j3731j2745R967J2413k507N319J0080m846
$$ 11236 9706 -10244 -294 8642 1981 -11750 -24495 -14528 -2115 -4622 697 10777 5931
7243E931P8J6243j0491k4832p546J4841J2915N674J7106R507L732r919L829j3757
$$ 5931 6009 22252 11761 -13071 -20617 -5776 7139 12813 29919 39426 43158 33239 37068 23311
7229B3311j7569m266P925o96j5517l026r095J373O092J0284Q525L830O541L814
$$ 23311 5742 1476 9401 8705 -6812 -9838 -18933 -17560 -11468 -1184 7341 11171 17712 21526
7215B1526M041m091O742N60r667l849r584j2222N108J19l448P105J383j2623J691
$$ 21526 25567 21476 28218 28778 19111 15262 5678 -6544 -1436 -1317 -4765 2340 3723 -8900 -7209
7200g209J4108M328r887P352N736N265q113J1686j648l735j1009o658j7698J1539
$$ -7209 6899 11227 1340 8692 14428 19693 11580 23266 21618 17883 6874 216 -17482 -5943
7186e943L369j2359r840P97J6936Q826J8398P473k1461q889N160P687J2085K82
$$ -5943 -2574 -14933 -24773 -23976 -7040 1786 20184 27657 6196 -2693 2467 10154 22239 22521
7172B2521M29j747j0504o538j7552l369K0007J0883M489l620j1948K616R754P67
$$ 22521 22950 21203 10699 4161 -13391 -16760 3247 14130 18619 14999 3051 5667 15421 16188
7158A6188L166r188j4407k625P968J3350M457M373r658k3201Q027K4605M343j3866
$$ 16188 19354 10166 -4241 -6866 1102 14452 18909 23282 13624 -9577 -1550 23055 27398 13532
7144A3532K410o25r555j382p361P859M013j202J26L03J495J798p860j1737m047
$$ 13532 15942 15317 5762 4380 -2981 4878 8891 7689 7815 8118 9613 11411 3551 -8186 -12233
7129a2233M77P818k386k330q11N258m411P566r51N317O57J9512M815n199j1825
$$ -12233 -11756 -3938 -6324 -8654 -9465 -4207 -8618 -1052 -2003 3314 3971 23483 28298 23099 11274
7114A1274k795q534o512L591j330r276j057J1230J165n81K6671O001j5080n816
$$ 11274 8479 -55 -6567 -2976 -4306 -13582 -14639 -3409 -2244 -2825 23846 29847 14767 8951
7100H951o84m952O860J5979m875J049o273j5321o487J0736J537N334m529o479
$$ 8951 8267 3315 10175 26154 21279 22328 16055 734 -5753 4983 6520 11854 7325 846
7086H46o68N549N306o666N842m682k122p495m045O162J3536l061p790k719p473
$$ 846 178 5727 11033 4367 10209 5527 3405 -4090 -8135 -1973 11563 8502 712 -2007 -9480
7071i480j447N920J0015q946m085J1581P058j971r882m546L5K848N317p832N998
$$ -9480 -10927 -5007 5008 -3938 -8023 3558 10616 8645 -1237 -5783 -5748 -2900 2417 -5415 583
7056E83k672J875N569O339l942n681J0300J4385N445J791r82j3996j9240J196
$$ 583 -2089 -214 5355 11694 7752 2071 12371 26756 32201 33992 33010 19014 -226 970
7042I70P836J4443j1646j7803L30r04J773O855J4809L27j9076j3408j1211l937
$$ 970 8806 23249 11603 -6200 -5870 -6774 -5001 1854 16663 16990 -2086 -15494 -26705 -30642
7028c0642Q8J5122m047r45l976J4581P267n653J1024K497K246K424j70k839P111
$$ -30642 -30554 -15432 -19479 -20424 -24400 -9819 -2552 -8205 2819 5316 7562 9986 9816 6977 14088
7013A4088L326q52j0448k448j9930J911J5076K1449l253j6075r039n410J0320
$$ 14088 17414 16562 6114 3666 -16264 -14353 723 22172 18919 2844 -6195 -11605 -1285
7000a285J0636j834m494j719n467j012M674m219q367l51n330j2901O582L3582
$$ -1285 9351 7517 3023 1304 -4163 -5175 -501 -4720 -13087 -13438 -18768 -31669 -25087 8495
6986H495J6322K319j2768o345j972q742n506q582m688N213k845O907n704J6470
$$ 8495 24817 27136 14368 8023 6051 -2691 -8197 -16779 -21467 -16254 -19099 -12192 -17896 -1426
6972a426M228q751j3272J553J220Q776P007P732r891L696j298j0988j378J5149
$$ -1426 2802 -5949 -19221 -17668 -16448 -7672 -665 7067 -2824 872 -426 -11414 -12792 2357
6958B357J3103j8934M162M800k830p291K157N79L696P292K534j0998N317p351
$$ 2357 15460 -3474 688 5488 2658 -4633 -2476 -1897 1799 9091 11625 627 5944 -1407
6944a407j499M802K969n705k300o402J2002n883J3553M726k553r697j6584q632
$$ -1407 -2906 1896 4865 -840 -3140 -9542 2460 -3423 10130 14856 12303 2606 -13978 -22610
6930b2610L207Q76k268N587k803N17o36P709l288J2130R042j6225j4690J1998
$$ -22610 -19403 -18527 -20795 -15208 -18011 -17494 -18130 -10421 -13709 -1579 7463 -8762 -23452 -11454
$$ [...]
##END NTUPLES=NMR SPECTRUM
##END=
