##TITLE=Analysis number 319691
Compound Code cc 46214
Book Reference 440/192
Project Code adrs
Chemist Name craigr
##JCAMPDX= 6.0         $$ Bruker NMR JCAMP-DX V2.0
##DATA TYPE= NMR SPECTRUM
##DATA CLASS= NTUPLES
##ORIGIN= Bruker BioSpin GmbH
##OWNER= nmr
$$ XWIN-NMR		Version 3.5
$$ Wed May 24 10:19:12 2006 GMT Daylight Time (UT+1h)  MAYBRIDGE\nmr@NMR_250MHZ
##.OBSERVE FREQUENCY= 250.131544655141
##.OBSERVE NUCLEUS= ^1H
##.ACQUISITION MODE= SIMULTANEOUS (DQD)
##.ACQUISITION SCHEME= undefined
##.AVERAGES= 16
##.DIGITISER RES= 18
##SPECTROMETER/DATA SYSTEM= dpx250
##.PULSE SEQUENCE= zg30
##.SOLVENT NAME= CDCl3
##.SHIFT REFERENCE= (INTERNAL, CDCl3, 0, 16.522)
##AUDIT TRAIL= $$ (NUMBER, WHEN, WHO, WHERE, WHAT)
$$ ##TITLE= Audit trail, XWIN-NMR		Version 3.5
$$ ##JCAMPDX= 5.01
$$ ##ORIGIN= Bruker BioSpin GmbH
$$ ##OWNER= nmr
$$ C:\u/data/dgb/nmr/ADRS/5070/pdata/1/auditp.txt
$$ ##AUDIT TRAIL=  $$ (NUMBER, WHEN, WHO, WHERE, WHAT)
(   1,<2006-05-24 10:18:50.84 +100>,<MAYBRIDGE\nmr>,<NMR_250MHZ>,
      <created by zg, POWCHK disabled, PULCHK disabled
       configuration hash MD5:
       84 BC 41 DB A1 6E 1D 46 DA 25 12 A5 C1 ED C5 3A
       data hash MD5: 64K
       A7 E4 A0 D5 F6 6C C2 6E 3B 39 1D 5D 49 3D 20 E6>)
(   2,<2006-05-24 10:19:03.50 +100>,<MAYBRIDGE\nmr>,<NMR_250MHZ>,
      <Start of raw data processing
       ef LB = 0.3 FT_mod = 6 PKNL = 1 SI = 32K 
       data hash MD5: 32K
       2C 7B 3B DD A8 CA 30 36 4D B4 16 1B 30 66 28 C8>)
(   3,<2006-05-24 10:19:05.16 +100>,<MAYBRIDGE\nmr>,<NMR_250MHZ>,
      <apk 
       data hash MD5: 32K
       D0 94 BB 44 BA E2 17 8D 4E 8D 6C BD B9 50 0D 67>)
(   4,<2006-05-24 10:19:06.02 +100>,<MAYBRIDGE\nmr>,<NMR_250MHZ>,
      <abs ABSG = 5 
       data hash MD5: 32K
       EC 50 D3 5B 52 0E D2 98 0D 24 56 D4 E1 1D E2 45>)
$$ ##END=
$$ 
$$ hash MD5
$$ DE B1 08 12 44 FF 42 BA EF B4 34 AF 77 76 56 20
##$RELAX= 
##$RELAX= 
##$RELAX= 
##$RELAX= 
##$RELAX= 
##$RELAX= 
##$RELAX= 
$$ Bruker specific parameters
$$ --------------------------
##$DU= <C:\u>
##$EXPNO= 5070
##$NAME= <ADRS>
##$PROCNO= 1
##$TYPE= <nmr>
##$USER= <dgb>
##$AMP= (0..31)
100 100 100 100 100 100 100 100 100 100 100 100 100 100 100 100 100 100 
100 100 100 100 100 100 100 100 100 100 100 100 100 100 
##$AQSEQ= 0
##$AQ_mod= 3
##$AUNM= <au_zg>
##$AUTOPOS= <9 >
##$BF1= 250.13
##$BF2= 250.13
##$BF3= 250.13
##$BF4= 250.13
##$BF5= 500.13
##$BF6= 500.13
##$BF7= 500.13
##$BF8= 500.13
##$BYTORDA= 1
##$CFDGTYP= 0
##$CFRGTYP= 5
##$CHEMSTR= <none>
##$CNST= (0..31)
1 1 145 1 1 1 1 1 1 1 1 1 1 1 1 1 1 1 1 1 1 1 1 1 1 1 1 1 1 1 1 1 
##$CPDPRG= <>
##$CPDPRG1= <>
##$CPDPRG2= <>
##$CPDPRG3= <>
##$CPDPRG4= <mlev>
##$CPDPRG5= <mlev>
##$CPDPRG6= <mlev>
##$CPDPRG7= <mlev>
##$CPDPRG8= <mlev>
##$CPDPRGB= <>
##$CPDPRGT= <>
##$D= (0..31)
0 1 0 0 0 0 0 0 0 0.06 0 0 0 0 0 0 0.0002 0 0 0 0 0 0 0 0 0 0 0 0 0 0 
0 
##$DATE= 1148462329
##$DBL= (0..7)
120 120 120 120 120 120 120 120 
##$DBP= (0..7)
150 150 150 150 150 150 150 150 
##$DBP07= 0
##$DBPNAM0= <>
##$DBPNAM1= <>
$$ [...]
##$SUBNAM7= <"">
##$SUBNAM8= <"">
##$SUBNAM9= <"">
##$SW= 20.6930455092707
##$SWIBOX= (0..15)
0 0 3 0 0 0 0 0 0 0 0 0 0 0 0 0 
##$SW_h= 5175.983436853
##$TD= 65536
##$TD0= 1
##$TE= 294.16
##$TE2= 300
##$TE3= 300
##$TEG= 300
##$TL= (0..7)
0 120 120 120 120 120 120 120 
##$TP= (0..7)
150 150 150 150 150 150 150 150 
##$TP07= 0
##$TPNAME0= <>
##$TPNAME1= <>
##$TPNAME2= <>
##$TPNAME3= <>
##$TPNAME4= <>
##$TPNAME5= <>
##$TPNAME6= <>
##$TPNAME7= <>
##$TPOAL= (0..7)
0.5 0.5 0.5 0.5 0.5 0.5 0.5 0.5 
##$TPOFFS= (0..7)
0 0 0 0 0 0 0 0 
##$TUNHIN= 0
##$TUNHOUT= 0
##$TUNXOUT= 0
##$USERA1= <user>
##$USERA2= <user>
##$USERA3= <user>
##$USERA4= <user>
##$USERA5= <user>
##$V9= 5
##$VALIST= <valist>
##$VCLIST= <CCCCCCCCCCCCCCC>
##$VD= 0
##$VDLIST= <DDDDDDDDDDDDDDD>
##$VPLIST= <PPPPPPPPPPPPPPP>
##$VTLIST= <TTTTTTTTTTTTTTT>
##$WBST= 1024
##$WBSW= 4
##$XGAIN= (0..3)
0 0 0 0 
##$XL= 0
##$YL= 0
##$YMAX_a= 359567
##$YMIN_a= -699889
##$ZGOPTNS= <>
##$ZL1= 120
##$ZL2= 120
##$ZL3= 120
##$ZL4= 120
##$ABSF1= 16.522
##$ABSF2= -4.171173
##$ABSG= 5
##$ABSL= 3
##$ALPHA= 0
##$AQORDER= 0
##$ASSFAC= 0
##$ASSFACI= 0
##$ASSFACX= 0
##$ASSWID= 0
##$AUNMP= <proc_1d>
##$AZFE= 0.1
##$AZFW= 0.1
##$BCFW= 0
##$BC_mod= 0
##$BYTORDP= 0
##$COROFFS= 0
##$CY= 12.5
##$DATMOD= 1
##$DC= 0
##$DFILT= <>
##$DTYPP= 0
##$F1P= 14.0000005364418
##$F2P= -0.99999901652339
##$FCOR= 0.5
##$FTSIZE= 32768
##$FT_mod= 6
##$GAMMA= 0
##$GB= 0
##$INTBC= 1
##$INTSCL= 1
##$ISEN= 128
##$LB= 0.3
##$LEV0= 0
##$LPBIN= 0
##$MAXI= 10000
##$MC2= 0
##$MEAN= 0
##$ME_mod= 0
##$MI= 0
##$NCOEF= 0
##$NC_proc= -5
##$NLEV= 6
##$NOISF1= 0
##$NOISF2= 0
##$NSP= 0
##$NTH_PI= 0
##$NZP= 0
##$OFFSET= 16.522
##$PC= 1
##$PHC0= 166.9447
##$PHC1= 11.96586
##$PH_mod= 1
##$PKNL= yes
##$PPARMOD= 0
##$PSCAL= 4
##$PSIGN= 0
##$REVERSE= no
##$SF= 250.13
##$SI= 32768
##$SIGF1= 0
##$SIGF2= 0
##$SINO= 400
##$SIOLD= 32768
##$SREGLST= <1H.CDCl3>
##$SSB= 0
##$STSI= 32768
##$STSR= 0
##$SW_p= 5175.98343685301
##$SYMM= 0
##$S_DEV= 0
##$TDeff= 65536
##$TDoff= 0
##$TI= <Analysis number 999999
Compound Code 99
Book Reference 9
Project Code 9>
##$TILT= no
##$TM1= 0
##$TM2= 0
##$TOPLEV= 0
##$USERP1= <user>
##$USERP2= <user>
##$USERP3= <user>
##$USERP4= <user>
##$USERP5= <user>
##$WDW= 1
##$XDIM= 32768
##$YMAX_p= 533622104
##$YMIN_p= -245415
$$ End of Bruker specific parameters
$$ ---------------------------------
##NTUPLES= NMR SPECTRUM
##VAR_NAME=  FREQUENCY,     SPECTRUM/REAL,   SPECTRUM/IMAG
##SYMBOL=    X,             R,               I
##VAR_TYPE=  INDEPENDENT,   DEPENDENT,       DEPENDENT
##VAR_FORM=  AFFN,          ASDF,            ASDF
##VAR_DIM=   32768,         32768,           32768
##UNITS=     HZ,            ARBITRARY UNITS, ARBITRARY UNITS
##FACTOR=    0.157963299565203, 1,           1
##FIRST=     4132.6476996994, 0,             0
##LAST=      -1043.33573715361, 0,           0
##MIN=       -1043.33573715361, -245415,     0
##MAX=       4132.6476996994, 533622104,     0
$$ Real data points
##PAGE= N=1
##DATA TABLE= (X++(R..R)), XYDATA
$$ [...]
24209b4862N6120M4907m8196j6298J5083M2503l4475p8569L218L0043J8952N256
24197A3682N917l3397L1418J2534k5016J8167M936l2521k5100k9052j0626R86
24185f8072M9953K6474N882m7759L5212K9385k0897m6392l0163O265L6048n138
24173b9202L691k823k2991M3186P8685O7103L7972k8986j05108k6632N3998K2212
24161I1105P222J3648k7717q8992j0224K423J9612k7708r450J196L2897L1088
24149C5100M010p4055k705K9511K5685r182K564j06984k4251Q031N755j7456L9352
24136h4625l1264l8148O8425N9505J7892J5715L9117k1082n3865L6442O1892J1696
24124H1700j0794k044j6088j9622m9885m1358P4875L4146k2875n7905m232J6419
$$ y = [-24862, 31258, 76165, 27969, 11671, 26754, 69257, 34782, -43787, -40569, -10526, 8426, 13682, 19599, -13798, 17620, 30154, 5138, 23305, 28241, -4280, -29380, -58432, -69058, -68072, -18119, 8355, 14237, -33522, 1690, 31075, 10178, -36214, -66377, -60112, -24064, -29202, -25511, -28334, -51325, -8139, 70546, 137649, 175621, 146635, 41527, 14895, 68893, 91105, 98327, 111975, 84258, -4734, -14958, -12535, 7077, -20631, -30081, -28885, 4012, 35100, 39110, -34945, -37650, -8139, 17546, 8364, 10928, -96056, -120307, -112276, -106521, -123977, -84625, -115889, -154037, -85612, -26107, -8215, 7500, 46617, 25535, -28330, 8112, 70004, 81700, 70906, 68862, 52774, 33152, -16733, -58091, 16784, 50930, 28055, -29850, -34082, -17663]
24112a7663J1947L0065N0685M4283o0600k6595L1968l7092p2147r818J9098l0079
24100f5948j8941L3996l696L3660J5165P294J5649J5689J1063m2821l3787l5784
24088f8461l1746k0712P2132O1198L5788k3029O491o2444o5197m595L1829O803
24076f1943j7308n902k4964R331M4101N7498J7383J2566L1171L5525n3004m3460
24064I94j2939K0573n6374j8293K9314M4809K5772o210K6623J1567K2190k4934
24052F3092n3887q090K1843R15J6833k3668j8711K7795K7415m429n916M317P034
24039E4543M0317k3425k8903M11P046m6401Q987J2464l1483N9429k7173l3004
24027g192l6743L979L2379K6338O195N103K1111o745j3668m3692m2043K1152k03
$$ y = [-17663, -5716, 24349, 75034, 119317, 58717, 32122, 64090, 26998, -45149, -54967, -35869, -65948, -84889, -50893, -54589, -20929, -5764, 1530, 17179, 32868, 43931, 1110, -32677, -68461, -100207, -120919, -48787, 12411, 48199, 25170, 31661, -30783, -95980, -100575, -68746, -61943, -79251, -85153, -110117, -100786, -56685, 813, 18196, 30762, 61933, 97458, 44454, 994, -11945, 8628, -47746, -66039, -36725, 8084, 33856, 27646, 54269, 65836, 88026, 63092, 9205, 1115, 22958, 23873, 40706, 17038, -1673, 26122, 53537, 49108, 43192, 47509, 54543, 94860, 71435, 42532, 42943, 49989, 3588, 12575, 25039, -6444, 52985, 25812, -7192, -43935, -39956, -7577, 18761, 24956, 30059, 51170, 44425, 30757, -12935, -54978, -33826, -34029]
24014c4029L366J6786o271m5517p0392r563N4248O4457j180J1013k1765K0875
24002a7972K5144k973P191K6685Q956j0389J8376P189m3004m1778l030J1819m9518
23989f3304N178J3215k2294M3276J4974K8085m4248k6579J7921k421M993J1816
23977a9388J9710n573J7193k682j4208M3175M9540k0265k8572l0431j4052J3974
23965H421k2312j5260J9512O0673J4696m3302j5330j6306L1413P313N6739n211
23953H1046o5993m1127J4350j0340N721K7619p309m8074k4340L1173J5440j2941
23941c4775q201j0875L5525J4328R425kJ0944m4435J4861r615n4985l5580J8836
23928i4549Q0006N8259P3946O953l0483J3196k1236k5961p1450j7144l1873q981
$$ y = [-34029, -30663, -13877, -20148, -65665, -136057, -145620, -91372, -26915, -28095, -17082, -38847, -17972, 7172, 4199, 11390, 38075, 47031, 36642, 55018, 62207, 19203, -22575, -25605, -13786, -63304, -58126, -44911, -67205, -23929, -8955, 19130, -25118, -51697, -33776, -36197, -31204, -19388, 322, -5251, 11942, 9260, -4948, 38227, 87767, 67502, 38930, 8499, -5553, 8421, -13891, -29151, -9639, 51034, 65730, 22428, 7098, -9208, 22205, 29518, 86257, 81046, 15053, -26074, -11724, -22064, -16343, 11276, 3967, -44107, -68447, -37274, -21834, -34775, -42976, -53851, -18326, -3998, 5427, 5425, 16369, -28066, -13205, -22820, -77805, -113385, -94549, -14543, 43716, 117662, 124615, 94132, 107328, 86092, 60131, -11319, -28463, -60336, -69317]
23916f9317M6505n3399j8293N9375O7831L5146k4976o1893l1822N5025L0006j9692
23904A4496k8348k5382M1737k0351L099K3765L7737J8617n5062n1479p862M395
23892d4638L9184L220J0411k8628M7195Q2077J1162n4879j5954M1243j8505l8497
23880C3391n1750n5364n3268k3555J1001L5956M8358K1343K6296K694m862k2346
23868c2106l4099j6501N709L1153L3384k4240k7463q581m7363n6136p553J03455
23856h0341Q2445m2268p9156k1890M524L149k237j673J9942M146J11044M3290
23844D0975q479N469K3081K0805k4077p7253l3775o7306L6812N2696R677m893
23832b6268l1290L1531M6502k195J498M4564o875j4983j8518r270k7782o345M0583
$$ y = [-69317, -22812, -76211, -94504, -35129, 32702, 67848, 42872, -19021, -50843, 4182, 34188, 14496, -13852, -39234, 2503, -17848, -14749, 9016, 46753, 65370, 10308, -41171, -49033, -44638, -5454, -2234, 8177, -20451, 26744, 108821, 119983, 65104, 49150, 90393, 71888, 33391, -18359, -73723, -126991, -150546, -139545, -103589, -55231, -33888, -7592, -4898, -9760, -32106, -66205, -82706, -76997, -45844, -12460, -36700, -64163, -72744, -120107, -176243, -183796, -80341, 2104, -40164, -119320, -141210, -136686, -133537, -135774, -137447, -117505, -113359, -2315, 40975, 32496, 37965, 61046, 81851, 57774, -19479, -53254, -120560, -83748, -31052, -21375, -26268, -57558, -26027, 20475, 18280, 19778, 64342, 57467, 42484, 23966, 14696, -13086, -19431, 21152]
23819B1152k2675k0325l5096J0647J8039k5028j8577j1999m8058J9922M4305m241
23807g1934N4823M2205J0208k7148L0175M2424n0097n8151k2853Q0154K1734r722
23795D1818J6273O836j7714J3436O6990p633n4125o3532J6936J1954j3886l6192
23783a8839R956J9482j6797J7773N0625r9792k9652O3738l520k8331j1290j0321
23771e6968K0946K4704K3319L4628k2594K066m8645l210M6113n0576K0110k72
23759a0379p0971J9177L6602J599j7155M3245j698K569K2623O0849L232n4247
23747C5446q622j1690R683m7178l7534N8677L1365J7205K6568k4840p7360m1904
23735g0184L2329L414L8154l5414K3641J1652O837n88k1729n501Q701M4489J4263
$$ y = [21152, -1523, -21848, -56944, -46297, -28258, -53286, -71863, -83862, -131920, -111998, -67693, -71934, -17111, 25094, 35302, 8154, 38329, 80753, 30656, -27495, -50348, 29806, 51540, 41818, 58091, 64927, 47213, 60649, 127639, 120006, 65881, 2349, 19285, 31239, 17353, -18839, -8883, 10599, -6198, 11575, 62200, -37592, -67244, -3506, -7026, -35357, -46647, -56968, -36022, -11318, 12001, 46629, 24035, 26101, -22544, -25754, 20359, -30217, -10107, -10379, -81350, -62173, -25571, -23972, -41127, 2118, 420, 2989, 25612, 86461, 89693, 35446, 26824, 15134, 24817, -22361, -59895, -1218, 30147, 47352, 73920, 49080, -28280, -70184, -37855, -34441, 3713, -31701, -8060, 3592, 10429, 9841, -11888, -17389, -8688, 35801, 50064]
23722E0064K9826j7456m0845J0576N2986l8593l8233k0551M554l5646M0196J988
23710a134r3364K8364J06330M2885j4347j7525L1398L3048K3142o5902o1517r756
23698A622M6375M4742l8467l7682N2193M97k9661L9277l1164q976j092l8236k6744
23685b7316m0048j4309K8055J1970k6472J0003R6379L3714m4785n0458K7143p641
23673c765l6625l261M7868q825q2545J8407K9320L1957L1150r886l5168N988M6950
23660C1565J4617J5464j3139Q854O3982K6531j2206l7178m4437j9322n3311L350
23648a5230K6395M7640L8822J0085o6610o1283l3370N5273O7526j0607J1330p2636
23636b665l8976l921J48N3269L2608m7068k2998l6909N4684J9874J3556k1599
$$ y = [50064, 79890, 62434, 21589, 32165, 85151, 46558, 8325, -12226, -7672, -43318, -3122, -1134, -94498, -66134, 40196, 83081, 68734, 51209, 82607, 115655, 138797, 72895, 11378, 1622, 47997, 92739, 54272, 16590, 68783, 69280, 39619, 78896, 47732, 38756, 37664, -572, -27316, -67364, -81673, -53618, -41648, -68120, -58117, 38262, 71976, 27191, -23267, 3876, -3765, -40390, -43651, 4217, -4608, -87153, -68746, -39426, -7469, 23681, 13795, -21373, -15385, 31565, 46182, 61646, 48507, 57361, 121343, 147874, 135668, 98490, 54053, 34731, -18580, -15230, 11165, 58805, 97627, 107712, 41102, -20181, -53551, 1722, 69248, 58641, 69971, -2665, -41641, -45562, -45414, 7855, 40463, -6605, -29603, -66512, -11828, 8046, 21602, 3]
23624Cn9950K2811M6543K2445k6847k4311o5558k855P3093l6003n5028l271K2266
23611h6662N2167M008P661J8529O7457K2710L180M684j575j2959k1187k3403p608
23598B7002n6082l0169p509L934O435J2586K1839L8652K9854l2353l8112L635
23586b0288j9357l6411N0450k776n5081N0227Q0770L1157r3684Q255k9811m0158
23574g6707m0717K7236k1551n3032O5756p348K7356P951j5150J8600M6917M5377
23562B4688l2439o534M8319J8210k8935l6469p9275m1247K5799L6872K0132l4169
23550h5048J0447K3683K1128O467O2881M0168k0593j5545j8316l4820m3243l7603
23538i0394l1647L9304P7876K1654o930o4948j9476M6976L8278P8348K6612j8029
$$ y = [3, -59947, -37136, 9407, 31852, 5005, -19306, -84864, -87719, -14626, -50629, -105657, -108928, -86662, -34495, -30487, -22826, -4297, 63160, 85870, 89050, 93734, 92159, 79200, 58013, 34610, 27002, -29080, -59249, -66758, -62824, -56389, -43803, -21964, 16688, 46542, 14189, -23923, -20288, -39645, -76056, -25606, -28382, -83463, -33236, 47534, 78691, -14993, -6738, -36549, -76707, -117424, -90188, -111739, -164771, -99015, -106363, -79007, -71056, -86206, -67606, -20689, 24688, -7751, -14285, 34034, 52244, 23309, -13160, -92435, -133682, -107883, -71011, -50879, -85048, -74601, -50918, -29790, -23323, 39558, 79726, 59133, 43588, 25272, -9548, -52791, -90394, -122041, -82737, -4861, 16793, 9863, -55085, -74561, -27585, 10693, 89041, 115653, 97624]
23526I7624k773m2949K0900N9261p9690j5923L6904l8801m3756l3416O2378N762
23514B5521M601p18o932j7364K7617L2734p09L2641N6468L0256p3188o1942n8341
23501i356r8340j6641K7805J243N2949N5390o1881J259N4008l1009k4620O3659
23489A4466N0654m8614o5430l9599j2611O0336L7531l147J2360k5426J6225k6078
23477b9333L2817J9617R474j6644k1371Q6939k29k1815l3342j3386K2155N900
23465D0782q5735k1672Q0221O719n4480M6048p452J1751q470k9649j6678o473
23453d5088K3698j2377J6620J3483o317n0718m8020o156K0506L2086L8516l0210
23441e3977J7397j7896o656N748M0342m3279j1208L8532J1745K09n647j7537N4496
$$ y = [97624, 94851, 51902, 72802, 132063, 52373, 36450, 73354, 34553, -9203, -42619, 19759, 25521, 30122, 29404, 22472, 5108, 32725, 65459, 64750, 97391, 153859, 184115, 110927, 48985, -9356, -107696, -124337, -96532, -95289, -42340, 13050, -48831, -47572, 6436, -24573, -49193, 14466, 65120, 16506, -48924, -88523, -101134, -40798, -3267, -6414, 5946, -19480, -3255, -29333, 3484, 23101, 32575, 15931, -5440, 81499, 81270, 59455, 26113, 12727, 34882, 40782, -44953, -66625, 13596, 20315, -34165, 11883, 4431, 16182, 7712, -21937, -38615, -45088, -21390, -33767, -17147, -3664, -9981, -60699, -108719, -114875, -94369, -62283, -23767, -53977, -36580, -54476, -61132, -55384, -15042, -58321, -69529, -30997, -19252, -19043, -24690, -42227, 12269]
23428A2269J4610k7142J3464N5731l023n1526m3643J4427j6783K9081j2222l2680
23416d7437J1935K7038K4096K7108m0837j2611L8819J3787l4082m1570L8239K9696
23404C4181J630J2560o5997o2105L705k1375N5909M4892o6070M1105K775l2197
23392e0987J3269q554p794j1558J1556K203j5697J4798r249K1243K3429m1264
23380e8605L9904L4885o1300k9459R955L437K7270r309j7325k5280O503L6124
23368d3200P658L8265K397L9749O8490P3540m7272o0186p0074k4980J2781O149
23356C317P026O817n1909J807q509o546j3942N2113O6874Q79l4745K6767N1272
23343A01221k0036j8406o354L3403k8437k9596o0218q278P975R81J1855r033M8088
$$ y = [12269, 26879, -263, 13201, 68932, 65909, 14383, -29260, -14833, -31616, -2535, -14757, -47437, -35502, -8464, 15632, 42740, 1903, -10708, 28111, 41898, 7816, -33754, 4485, 34181, 35811, 48371, -17626, -79731, -76026, -97401, -41492, 3400, -62670, -21565, -18790, -50987, -37718, -46272, -54066, -65624, -54068, -51865, -67562, -52764, -62013, -40770, -17341, -58605, -18701, 16184, -45116, -74575, -64620, -61183, -33913, -43222, -60547, -85827, -79324, -43200, -35542, 2723, 5120, 44869, 113359, 186899, 139627, 79441, 9367, -15613, -2832, 3317, 10343, 17160, -34749, -32942, -41451, -47997, -61939, -9826, 57048, 57927, 23182, 49949, 101221, 81185, 62779, 56425, 89828, 61391, 31795, -28423, -36701, -28726, -27745, -15890, -24923, 23165]
23330B3165k5026n7415K3927L4114J3379K2245O4216l6354n19O157Q236J6322
23318I2447l2220o0474l4320j9001J5260M7996K0854m2725o7399k5206N4413N2812
23306B437j2464o190L072o0980k6608J7952J4662O0676K4417l44p216m0247m2850
23293g3683k3474O6838J9114j4529k1970O82L1392k7334J2931M1904L1129l3869
23281I131m3761p0842K0697R2445P973m1404j3910Q922m0645l4126L4907M6515
23269b4098J9120N0124k8166m4707J1362J0444j9420j3495Q426P187n820k0451
23257d9494L1265K1078l1817j1756L6213K919n526k6052M0655j1312k2003k3115
23245d8945M0265J2050k8576m1103O575M0329K5185Q774m8672J7382P624QL0429
$$ y = [23165, -1861, -59276, -35349, -1235, 12144, 34389, 98605, 62251, 61732, 67889, 76125, 92447, 60227, -247, -34567, -53568, -38308, 9688, 30542, -12183, -79582, -104788, -50375, 2437, -10027, -16217, -13145, -74125, -100733, -82781, -68119, -7443, 16974, 16630, 9414, -30833, -73683, -97157, -30319, -11205, -25734, -47704, -47022, -15630, -42964, -30033, 11871, 43000, 9131, -34630, -105472, -84775, 7670, 15643, -25761, -39671, -30749, -71394, -105520, -70613, -24098, -4978, 45146, 16980, -27727, -16365, -5921, -25341, -38836, -30410, -23223, -29043, -49494, -18229, 2849, -28968, -40724, -4511, -1592, -7118, -33170, 7485, -3827, -25830, -48945, -8680, 3370, -25206, -66309, -59734, -19405, 5780, 14554, -34118, -16736, -9112, -9104, 21325]
23232B1325o8518m8913K2690k4744p0113R838J10073Q3680k4511k9027n7869l1251
23220a07340O0958L5004k7869l3382j6634R1503O630j5959O2884J5190l7046m5603
23208a1664l296k5761P39O9329K9361L0679j5176m8493j821k4881l4503m4663
23196h0150o237P1464J4913j6309p9772J2604N4465L5195L2261k9664j2530N3611
23184D9851L7623m222l1038m7300m8363l9585j3581O087m749K2617j7548K9322
23172f0886N2010L3483Q144L115L4693K8642k3155k7613k8233M7919m3785n2805
23160b8471L0400N9866N3411j4159l401k2080l9637M4794J6000n9010m1288K8054
23148B4479j5940l2268n4445j8457r845k2560P435J755K7263R584K2316L7198
$$ y = [21325, -47193, -96106, -73416, -98160, -168273, -158435, -48362, 35318, 10807, -18220, -76089, -107340, -46382, -11378, -39247, -72629, -89263, 2240, 8870, -7089, 55795, 70985, 33939, -11664, -14960, -40721, -39982, 29347, 58708, 89387, 74211, 25718, 23897, -984, -35487, -80150, -86387, -14923, -10, -16319, -96091, -83487, -29022, 6173, 38434, 8770, -3760, 49851, 87474, 83252, 52214, 4914, -43449, -83034, -96615, -90528, -95277, -72660, -90208, -60886, -8876, 24607, 32751, 35866, 70559, 99201, 76046, 48433, 20200, 68119, 24334, -28471, 1929, 61795, 115206, 101047, 97646, 75566, 35929, 80723, 96723, 37713, -3575, 24479, 8539, -23729, -78174, -96631, -106476, -129036, -121601, -119846, -92583, -82999, -60683, -23485]
23136b3485j4707k6508o5988L3898J5169K7014M3136M0319m2000q5823r191J7352
23124i0814M2288O1431o264J9930J6588j305j9319l2406J6874K7301j4110K649
23112B2843j0925J2286o084n502l6442N3303L0642k1924j8247j5616k1445M0945
23100B3834L1448J7211K3008m1235K6286K4272p2230k202J5961n1186J0984j3837
23088g686k2143j5966k228m4253j5457O8510N9022K4560k9702L6449K1951k9295
23076D3762k8641j3388J4996K8268K0739j1354M195M8113m4109o8111P92o703
23064a1441K7325l9894J6779P485k5792p907J6447k505R76N6807m40l2075K1942
23051B7707K4942l55j1593l9644k0131o3973n2163M9558O2688J7799j707o56l041
$$ y = [-23485, -38192, -64700, -130688, -96790, -81621, -54607, -11471, 28848, -13152, -98975, -108166, -90814, -48526, 12905, 6641, 26571, 43159, 41854, 22535, -9871, 7003, 34304, 20194, 22843, 11918, 24204, 18120, 12618, -23824, 29479, 60121, 38197, 19950, 4334, -17111, 23834, 55282, 72493, 95501, 54266, 80552, 104824, 32594, 30392, 46353, -4833, 6151, -7686, -29829, -45795, -48023, -92276, -107733, -39223, 19799, 44359, 14657, 51106, 73057, 43762, 15121, 1733, 16729, 44997, 65736, 54382, 58577, 106690, 62581, -5530, -4738, -11441, 15884, -24010, -7231, 254, -25538, -33445, -16998, -19503, -18527, 38280, 37840, 5765, 27707, 52649, 52294, 40701, 1057, -19074, -83047, -135210, -85652, -22964, -5165, -6872, -7528, -10569]
23038a0569n2049J1296J6248k621J2319P2998k1651n0470j5026o768L1478P6759
23026F1944R218P790j5991J5223l2552q7978O93K5491r579J2354J12734J4048
23014A13395l4242j6371m9639j480M2362j6556l341l6499m9354N4384J7684K8199
23002D8542n0761l3874J2942M2763K6000m5913m2783K8747L5252l4418N013l2783
22990d1273q09n419O7211j0377j2505O790R064r7715m6816P7026N4249j1508j0720
22977b2802L1844L717n476o755N0706m236n6473N6212K4008k7214k9543J8308
22965C2296l1422p6217j7085J0266j7338J8462M0461K1478N9189m37m0988J819
22953D84k4625n675j0061J4268K4787k4290o7841j3773N8256Q1999L2781j7676
$$ y = [-10569, -62618, -51322, -35074, -37695, -25376, 47622, 25971, -24499, -39525, -46293, -14815, 61944, 71162, 78952, 62961, 78184, 45632, -42346, -41653, -16162, -25741, -13387, 99347, 113395, 79153, 62782, 13143, 11663, 54025, 37469, 34128, -2371, -51725, 2659, 20343, 48542, -2219, -36093, -23151, 19612, 45612, -301, -43084, -14337, 20915, -13503, -8490, -41273, -42082, -47501, 19710, 9333, -3172, 3618, 12682, -85033, -131849, -54823, -574, -12082, -22802, 9042, 12759, 7283, 528, 51234, 46998, -9475, 46737, 70745, 43531, 13988, 32296, 874, -75343, -92428, -82162, -99500, -81038, -40577, -19099, 40090, 39653, -1335, 484, -24141, -29816, -39877, -25609, -822, -25112, -92953, -106726, -48470, 33529, 66310, 48634]
22941D8634o702n1q571m3137j5244k8656l3803P1383K3613Q288j5841L8687J1929
22928E0529O79K7967l286M778k3242j0726j0446j1690k2021j3077m5792M7247
22916i080L8496j5834l0063k2180L9386L3459j9463j6049k704l5883k4293M037
22904f0171J4609m843l6447N782J3497O263n5343J1631K9724K4183L3214N049
22892a2852J8596n883j2147q035j4388O7825O741k051j5755Q98L8587K0695l3808
22879D8423j3703n8219l618M5209L3099m2907m4943m6920J3590j8981j9760J7064
22867i1666j1320O0286L0799L8793J0860j4541K4531j3892K0532P695K9421p6705
22855A4793j9352K0200M6276n371j7571m2897K148J3930K4872o4150j6220M1860
$$ y = [48634, 41932, 41881, 33310, -9827, -25071, -53727, -87530, -16147, 7466, 15754, -87, 38600, 50529, 51208, 79175, 75889, 80667, 57425, 46699, 36253, 24563, 2542, -10535, -56327, -9080, 29416, 13582, -16481, -38661, 725, 34184, 14721, -1328, -4032, -39915, -64208, -60171, -45562, -50405, -86852, -81070, -67573, -61310, -116653, -105022, -75298, -51115, -17901, -12852, 5744, -139, -12286, -20321, -34709, 33116, 39857, 37806, 22051, 22949, 61536, 82231, 48423, 34720, -23499, -27117, 18092, 51191, 8284, -36659, -83579, -69989, -88970, -108730, -91666, -102986, -42700, -11901, 26892, 37752, 23211, 47742, 33850, 54382, 62077, 91498, 14793, -4559, 15641, 61917, 56546, 38975, -3922, -1774, 12156, 37028, -27122, -43342, -1482]
22843a482k0517K5260K8580k3955K3366m5617k3595L4797N1516k6394m9333l3824
22831f1198N7465O7969Q645m7027N37j7113j5370q635j7418q500K7075j6857l100
22818c3527K0913Q655j0884m3579M526O3314k9641J7747q712k828k0123K8570
22806e569K7978P289R23J0078J6682j2234p7352l6240P1295M629L6666j4933n8490
22793b9278M0053J2332J4808l0130m5131q380R173Q2211j7446j6171k2846O0462
22781D9657m4017j00462K7164L3217l0624n4882K9606P2495M3060L4581l5130
22770B4665j4669j6619j7936k0272P94O62K0380k0705Q4025k5600m9165l5692
22758g0132m7535n409Q5412L8154n8162l7124M5173M4536P3145M6731J4967L358
$$ y = [-1482, -21999, 3261, 31841, 7886, 31252, -14365, -37960, -3163, 48353, 21959, -27374, -61198, -3733, 64236, 72881, 25854, 26391, 9278, -6092, -14727, -32145, -40645, -13570, -30427, -33527, -12614, -3959, -14843, -58422, -53896, 9418, -20223, -2476, -11188, -14016, -34139, -5569, 22409, 29698, 30621, 40699, 57381, 45147, -32205, -68445, 2850, 7479, 44145, 29212, -29278, 10775, 23107, 37915, 7785, -37346, -45726, -36553, 45658, 28212, 12041, -10805, 49657, 5640, -94822, -67658, -34441, -65065, -119947, -90341, -17846, 25214, 59795, 24665, 9996, -6623, -24559, -44831, -44037, -43375, -22995, -43700, 40325, 14725, -34440, -70132, -117667, -123076, -37664, 490, -57672, -94796, -49623, -5087, 68058, 114789, 129756, 133114]
22746A33114o3685p8072P594L2726n1930k9121J382j1820j9893L598N0532k520
22734b8095M4836Q3143k2278k6818r771J9718k2309j4527P1287O850p6652j3195
22722A2189N0168K191l2239j1583k403M4603L3211n7174m2457l2059L7667j507
22710F07k5619J1762K8391j5539p609K988L777j9693n9284J6453m1K4520K2432
22697a6855M3678p647l3641O7473J0737k5495m4451k9284K3921m4755j0448j048
22685f7815n6698K7346J1155j1548O984k5284q532K5559N044J6807K2715l0507
22673h4774M0463M0093J881k4091K3028O054k8194M0050N4147j4038p9316l9451
22661f4148j101N0278M2991J1160M139k0148k0299j2712m9125j927l2771J8996
$$ y = [133114, 69429, -8643, -1049, 31677, -20253, -49374, -47992, -59812, -79705, -76107, -25575, -28095, 16741, 99884, 77606, 50788, 41017, 60735, 38426, 23899, 95186, 102036, 25384, 12189, 62357, 64548, 32309, 20726, 18323, 62926, 96137, 38963, -3494, -35553, 2114, 607, -25012, -13250, 15141, -398, -8007, -5019, -1242, -20935, -80219, -63766, -63807, -39287, -16855, 26823, 19176, -14465, 53008, 63745, 38250, -6201, -35485, -11564, -56319, -66767, -67815, -124513, -97167, -86012, -97560, -90576, -115860, -124392, -98833, -93789, -76982, -54267, -84774, -44311, -4218, -2337, -26428, -3400, 2654, -25540, 14510, 68657, 54619, -24697, -64148, -65249, -14971, 28020, 39180, 43319, 23171, 2872, -9840, -58965, -60892, -93663, -74667]
22649g4667P163K9270J4179m1113k0960k4777L810M2170J7115J7905k6865J1818
22637d4952k5084J8323q95J9489m049k6297k7621N316M6318L0711K2315N83K475
22624A6632M1760k7288j33412n8262m753l2068K6648N3672O1529K6573O4992o099
22612B9924l8165k5550K8352N1686m5072m489k2549J2682O8079K1214n4927m4550
22600b3365P098m2739p308L2589k8594K408J2488m0856k9791N9623k0423n2538
22588a31408j1392M1851N5866J4950l7727l7376R461L4158K6306l793K9935K1521
22576A2352k8159l2L8488m5913k9369J6865j2172J8790J1091j9978k5525j0248
22564g3810L8199L3577J0032l3237q2731q8549P8997K8983J8926K4783J1756N6619
$$ y = [-74667, -67504, -38234, -24055, -65168, -86128, -110905, -107095, -64925, -47810, -29905, -56770, -44952, -70036, -51713, -52608, -33119, -37168, -63465, -91086, -85770, -39452, -8741, 13574, 14157, 16632, 58392, 31104, -102308, -160570, -165323, -197391, -170743, -117071, -55542, -28969, 36023, 29924, -8241, -33791, -5439, 46247, 1175, -3314, -25863, -13181, 54898, 76112, 21185, -23365, -16267, -59006, -66314, -33725, -62319, -59911, -47423, -88279, -118070, -58447, -78870, -131408, -142800, -100949, -45083, -30133, -67860, -105236, -95775, -61617, -35311, -39104, -9169, 12352, -15807, -15839, 22649, -23264, -52633, -35768, -47940, -29150, -18059, -38037, -63562, -73810, -35611, -2034, 7998, -25239, -107970, -196519, -117522, -88539, -69613, -44830, -33074, 23545]
22552B3545J9225j6203p3015l1848L8608O272J518m1892k6894M3188L3903J4290
22540i303O346j7646m3133k3996J186M7201N6888L2614k6150r798k5971J4494
22528B732j2106q216L5248K7227k4182k0433l014N6476Q476n6721j842Q428j5464
22515c391j5365K0159J3445k6524o0017l1231j077L8975O4353L7391L9522L5532
22503A11772p4306k5756m0133k244J2797L5413k7874k9714L1504L5087l3036K2194
22491A5704K0137j2320J132k9170m7391o4815q261L2301K4475N6913M8628j1844
22479B5489l9073k3727O485O0755K0099k6886l3849J5765l4620l6595l5359n601
22467a07117j1577L4136P2614K0655j8907J7618K5266L2010m1501p0291L6242
$$ y = [23545, 42770, 26567, -46448, -78296, -39688, -33416, -31898, -73790, -100684, -57496, -23593, -9303, -2957, -20603, -63736, -87732, -86546, -39345, 17543, 50157, 24007, 14209, -11762, 2732, -9374, -17590, 17658, 44885, 20703, 270, -2744, 53732, 62208, 5487, 3645, 12073, -3391, -18756, 1403, 14848, -11676, -71693, -102924, -104001, -65026, -673, 36718, 76240, 111772, 37466, 11710, -28423, -30667, -17870, 17543, -10331, -40045, -8541, 26546, -6490, 15704, 35841, 23521, 24653, -4517, -51908, -116723, -124984, -92683, -68208, -11295, 37333, 25489, -13584, -37311, -30826, 29929, 50028, 23142, -10707, 5058, -29562, -66157, -101516, -107117, -118694, -84558, -11944, 8711, -10196, 7422, 32688, 64698, 23197, -47094, -10852]
22456a0852J1757J4872L1474L9051j763n9289Q263J1230l3622p0791j8477J1832
22444f6315M3366P1763L5874j8402m5964K7870n181m2223m6766l4728L2997j1797
22432e9506J8190k4693k3395l0058k1290L1389K0295K1993m498M6670K4001m0655
22420d1557m7519M824K6649k1027j3539K1089l8331m8676O038O0069M2899K3651
22408b5430N7406M2079n6475n9588J442K8457l9993J9460N0908j2388J5807J5270
22396C6955n8256l1065p984O9281J4462N8711N6981J2861j4375m2456k9533l8195
22384B7387j5812j0599K0606K8296m3128J1443Q554m9599Q277M428M7208M7802
22372H4863o1318k3361J6090j7836k7981j9271O1193j2710k1729j5263J2160L5841
$$ y = [-10852, 905, 15777, 47251, 86302, 84539, 25250, 33513, 44743, 11121, -59670, -78147, -66315, -22949, 48814, 84688, 66286, 20322, 48192, 43011, 788, -45978, -80706, -47709, -59506, -41316, -66009, -89404, -119462, -140752, -109363, -89068, -67075, -71573, -24903, -902, -41557, -89076, -84252, -57603, -78630, -92169, -71080, -109411, -158087, -152049, -91980, -49081, -25430, 31976, 74055, 17580, -42008, -40566, -12109, -52102, -32642, 18266, 5878, 21685, 36955, -21301, -52366, -60350, 8931, 23393, 82104, 139085, 151946, 137571, 95115, 65582, 27387, 11575, 976, 21582, 49878, 6750, 18193, 26747, -22852, -14575, -10147, 37061, 84863, 23545, 184, 16274, -1562, -29543, -48814, 12379, -331, -22060, -37323, -25163, 10678]
22360A0678l9821K1119n81o0604n904N057N5846M8917j6550l3170K6809j98K0145
22347C1743l1284k6767J4450j3716q628J4039j6073j4697N8587M8675K9457k2179
22335F3607n4241m8662l0462L037M284K2094J7822k6365J4751O4356J2299l2223
22323A0297O688K2280k348q8556j1386P3440M4517n731m7744j4858o2336K775
22311g2962P6779p063l5615l4216m8130j9083L0826R4807L8328m8870J6358o389
22299a5230j405k0448O698m0640m9673L8213M2301O6490j7752p1465J5568M0646
22287f697M5410o355m7655j4631n130k781K2415j152k7074k9293j1920J8279L2736
22274c3848R309L9214L2951l3911L6669k6029J0324M0660k0431l1940m933l0433
$$ y = [10678, -29143, -8024, -8605, -69209, -75113, -70056, -14210, 34707, 18157, -15013, 11796, 11598, 31743, 459, -26308, -11858, -25574, -34202, -20163, -36236, -50933, 7654, 56329, 85786, 63607, 9366, -39296, -69758, -66721, -62437, -40343, -22521, -48886, -34135, 30221, 42520, 10297, 16985, 39265, 36917, -51639, -63025, 10415, 54932, 49201, 1457, -13401, -75737, -72962, 3817, -3246, -38861, -73077, -121207, -140290, -109464, -14657, 23671, -25199, -8841, -15230, -16635, -37083, -30385, -71025, -120698, -82485, -40184, 26306, 8554, -62911, -47343, -6697, 38713, 32358, -15297, -29928, -35058, -37839, -15424, -16576, -43650, -72943, -84863, -66584, -33848, -24539, 14675, 47626, 13715, 50384, 24355, 34679, 75339, 54908, 22968, 18035, -12398]
22262a2398r8821m836n691k7584R1707Q3157K9750q022r3910m2109J4444J0927
22250f3386L6098l0481L898N8466N4283m4188l9377o844m861m6465P6155O5461
22238E8759k4352j7258m758J7849K792j3193K6202L6896K2144l696m1754m6664
22226A2967k8358M8727M482k6881j6254M1530J8458k6028J5561j967l2255j5665
22214e683P9814P0189K0158N808j6790k3929j3840l6226k1907K896M5482N3330
22202A59302n843n3660n3502n5398m4940k3484L5242l5910m5220J8845J7504J5085
22190g1979N4957M1809K183n8743l1897N3313J117M6661k0396l2418K562Q578
22178d253L6794J1805n0754l6975l4352m490j4050j1700N590J4980K8327J6097
$$ y = [-12398, -111219, -116055, -121746, -149330, -57623, 25534, 55284, 47262, -46648, -88757, -74313, -63386, -27288, -57769, -53871, 4595, 58878, 14690, -24687, -31531, -36392, -82857, -6702, 58759, 34407, 17149, 12391, 30240, 33032, 19839, 46041, 82937, 105081, 101385, 59631, 12967, -15391, 33336, 37818, 10937, -5317, 36213, 54671, 28643, 44204, 42237, 9982, -5683, 74131, 144320, 164478, 170286, 153496, 129567, 115727, 79501, 57594, 60490, 105972, 159302, 153459, 99799, 46297, -9101, -54041, -77525, -42283, -78193, -123413, -104568, -87064, -71979, -17022, 24787, 26970, -31773, -63670, -10357, -9240, 37421, 17025, -15393, -12831, -4253, 32541, 44346, -6408, -43383, -77735, -82225, -96275, -107975, -102385, -87405, -59078, -42981]
22166d2981K3594q503j8720L7007K1940l1063q9350k0367M1601J3677K0041k3701
22154g6825L0558J8907k4467M0684O3596L6531k3026j6649j1341l6575l8762m2907
22142h0276n3648n8538K8605Q8288J5371j5523K7426M5151P942p339m9311k4241
22130g6093k8990j9422R937O1463j962j9245j6785j1518O7253O3009l1141l1125
22118c4619j1614J1611J4723J2144K8016k368j3258o444j3904l7048j2553K6812
22106c8502L5357j5827o708k4514R346M7047M512l0938k1876j476R540J6871k1972
22093c9140l9268J3595M5187j4327L572Q027K2085j3020k9368L7708R0958K069
22081H8078o9259l9113j7913J8406k2459j8422L3809P1835J3929l8247j5294J6344
$$ y = [-42981, -19387, -27890, -46610, -9603, 12337, -18726, -108076, -128443, -86842, -73165, -53124, -76825, -46267, -27360, -51827, -11143, 52453, 88984, 65958, 49309, 37968, 1393, -37369, -80276, -133924, -192462, -163857, -75569, -60198, -75721, -48295, -3144, 4798, -2541, -51852, -76093, -105083, -124505, -114568, -53105, -55067, -74312, -91097, -102615, -35362, 27647, -3494, -34619, -46233, -34622, -19899, -7755, 20261, 17893, 4635, -1809, -15713, -52761, -65314, -38502, -3145, -18972, -25680, -50194, -40848, 6199, 10711, -20227, -42103, -43579, -34039, -17168, -39140, -78408, -64813, -19626, -33953, -30381, -22354, -269, -13289, -42657, -4949, 86009, 88078, 18819, -20294, -38207, -19801, -42260, -60682, -26873, 44962, 58891, 20644, 5350, 21694]
22069B1694k1137k6155j4634L784P417j455J5240l171m4198j4148M0941J5105
22057b0717Q0469M6773j755j4573l4564O4507K226p3247o7254j2321L4667M4696
22045D8907Q026k6533k6599r915k7112J5877l344J5260P6325M1608k9035r883
22033G3582m2670k0188O033K548l5420J0145j8929K5444m854p2476K9757O5674
22021A8646m1704J2669L219N932J5035l8292O208O0223K1594L1615p085k3678
22009F4382O182J8232k0848r622p20k0179m3520l9486K4100j4923J1115k2185
21997d7472m0490k820P4012O1527R409q7341j324L6144M2093O726o810J2295K6833
21984H2782P885l5738J1474N6437O22o6230o797J4397n0417r9533J9607L3652
$$ y = [21694, 557, -25598, -40232, -36448, -29031, -30486, -15246, -18417, -62615, -76763, -35822, -20717, 59752, 106525, 104770, 90197, 55633, 120140, 122366, 49119, -18135, -30456, 4211, 48907, 56933, 30400, 3801, -6114, -33226, -17349, -20693, -5433, 70892, 112500, 83465, 73582, 30912, 10724, 16757, 19305, -16115, -5970, -24899, 545, -4309, -76785, -47028, 18646, -23058, -10389, -7170, -1238, 13797, -24495, -18287, 41936, 63530, 95145, 88060, 64382, 70564, 88796, 67948, 58326, 57606, 37427, -6093, -45579, -21479, -36402, -25287, -47472, -87962, -90782, -16770, 44757, 54166, -33175, -34499, 1645, 43738, 50464, 43654, 55949, 82782, 90667, 54929, 66403, 122840, 123462, 57232, 50435, 64832, 14415, -85118, -65511, -31859]
21972c1859k851K7254L6351q453k8420L7375Q151j2998J430k263L0023k8163j765
21959B3812K625k0532m2928j6531L1134L3055k7094P960J7858m3836o5387J7263
21947h2601O2844M9393n778j8730k843M5249K5400l382n8103k0395k3448k4385
21935e6779P00M5724N525n4107K762Q616R946K6172J2225l7970k3789N094L142
21922e2739K1622J8717M5916j4293j5160j3345Q13P6609l937j6955j8122N949
21910C5075L3010J556j9988m9882J8222R140K5173r628m5449l1861m7270K1396
21898f0506L9959J0503L2704L2871o50r0511k7366O0679K3462l131J064k1457
21886b379p5385l7310Q5255J9186l6932L1119l3859m6922k652J5850J3786n193
$$ y = [-31859, -34710, -7456, 28895, 20442, -7978, 29397, 37548, 24550, 25980, 23717, 53740, 25577, 23812, 26437, 5905, -37023, -53554, -22420, 10635, -16459, -8499, 9359, -34477, -99864, -82601, -19757, 29636, 23858, 5128, 2285, 47534, 72934, 69552, 11449, -8946, -32394, -56779, -56079, -10355, -4830, -58937, -56175, -47559, -37613, -11441, 784, -37186, -60975, -55881, -52739, -31117, -12400, 33516, 19223, 4063, -9282, -8469, 68140, 64203, 47248, 29126, 35075, 68085, 69641, 49653, -229, 17993, 27133, 52306, 42678, -2771, -34632, -81902, -60506, -20547, -10044, 22660, 55531, 54881, -35630, -62996, -2317, 21145, 18014, 19078, -2379, -77764, -115074, -29819, -10633, -47565, -16446, -50305, -97227, -99879, -84029, -70243, -75436]
21874g5436Q863L585N0836O715J4818P0582l4818k1365j443J6208L805q1371J4138
21861b4883M5338K9908k4765M3307j9726n1561m3666l4138j642K1220M3486j9215
21849c6337j4544k5226K4710J1830J3710l700k8669K480M0933j5989n867k5193
21837f1862k3372o341o351k3095L6077J1681M5652m0861o639j8819N4569L0070
21825i291M2197J0206J4406J455o8601j4850L1574o841m0435L4669k2106R549
21813a8068J8614l0376R07l5378L2992J9914J1116J3516r710l3748k2323L2542
21801b0002K4846l3463J0738p866K4754k6919j1381L8138J7022P84j2819M6585
21789E0417j3675l6366j2279N6016M838m7368j3833L1035l6593p963k0844J7075
$$ y = [-75436, -66573, -62988, -12152, -5437, 9381, 79963, 45145, 23780, 22337, 38545, 42350, -39021, -24883, 20455, 50363, 25598, 68905, 49179, -2382, -46048, -80186, -81828, -60608, -17122, -36337, -50881, -76107, -51397, -39567, -25857, -29557, -58226, -55746, -14813, -30802, -36669, -61862, -85234, -91575, -97926, -121021, -84944, -73263, -27611, -68472, -75111, -93930, -39361, -9291, 32906, 43112, 57518, 58973, -9628, -24478, 7096, 255, -40180, -5511, -27617, -18068, 546, -29830, -28923, -64301, -31309, -11395, -279, 13237, 3527, -30221, -52544, -20002, 4844, -28619, -17881, -25747, -993, -27912, -39293, -1155, 15867, 16651, 3832, 50417, 36742, 376, -11903, 44113, 48951, 1583, -12250, 18785, -17808, -25771, -46615, -29540]
21777b9540R1651n039o341l6323O349K8530l0477k1155l2001k9672J0588K7659
21765b5771L4357N1353J1511Q178K2127k1964j16092n2114K8705M7217M7901K7013
21753F2421J423k1963n187K1067n662M0370l1697k0516N012m4518m0585n820l3672
21740g9327m5845L3933N2998o8107L9199N6683J5917M2924l9237j5575o2218l4666
21728a03321L9389j2249O9849k846k8331j6719M2272q337l4762n2162j2931O0689
21716e9459L1294J1277J1650J8874m1806n8377j1903L8067k9349P421K2515N4321
21704e475l8725k3730m4298M3480O0072p037l8061J6659J535l1295j7626n3665
21692a38166m023N1698N0104M7012M3105K153o8023M9972K0438L3161r0071n0875
$$ y = [-29540, 62111, 57072, 50731, 14408, 20757, 49287, 18810, -2345, -34346, -64018, -53430, -25771, 8586, 59939, 71450, 79628, 101755, 79791, -36301, -88415, -59710, -12493, 35408, 62421, 63844, 41881, 36694, 57761, 52099, 92469, 60772, 40256, 45268, 750, -39835, -45655, -79327, -125172, -91239, -38241, -106348, -67149, -10466, 5451, 48375, 9138, -6437, -68655, -103321, -63932, -76181, -6332, -9178, -37509, -54228, -11956, -20293, -55055, -107217, -120148, -59459, -28165, -16888, -5238, 13636, -28170, -86547, -98450, -60383, -89732, -82311, -59796, -5475, -44200, -67930, -112228, -68748, -8676, -15713, -53774, -37115, -35580, -66875, -84501, -138166, -142189, -90491, -40387, 6625, 49730, 51883, -16140, 33832, 54270, 87431, -2640, -53515]
21680e3515n4220j5966Q4409J01210N5385k527k0712n7965k5394l0089K449l990
21668b0925L311k9065K9884L2136M4953m3685l0056K825J6928o72M2972k6479
21656B2127j5022l0832j9000J5581J9084l9896P6331L0347r360l0284j4440J1089
21644A5725K5462N151l9182o4273p698j5058k9040O593O954m2484k3048P8671
21632h2227Q3823k1170q49O1438n6348o3693K2669J2933k3448M7812L3854k9055
21620a4261m6390k326Q5888O1325n5213p8528k3740N3191L5063Q68k9864M5659
21608C1672L052M8268l1981m333k0180K124k8531J2882j1486R029P479n3511M8076
21595A2560J10277K3943q6873o3721j2897j0137J0896N3569M7610J2493k2753
$$ y = [-53515, -107735, -123701, -39292, 61918, 117303, 114776, 94064, 36099, 10705, -19384, -16935, -20925, -17614, -46679, -16795, 15341, 60294, 16609, -13447, -10622, 6306, 5634, 48606, 22127, 7105, -23727, -42727, -27146, -8062, -47958, 28373, 58720, 49360, 19076, 4636, 15725, 41187, 46338, 7156, -57117, -64815, -79873, -108913, -102320, -95366, -137850, -160898, -82227, 1596, -19574, -20423, 41015, -15333, -79026, -56357, -43424, -66872, -19060, 14794, -14261, -60651, -62977, 22911, 84236, 29023, -49505, -73245, -20054, 15009, 15877, -13987, 31672, 34724, 82992, 51011, 46678, 26498, 28622, 91, 12973, 1487, 10516, 17995, -35516, 12560, 122837, 146780, 59907, -3814, -16711, -26848, -15952, 37617, 85227, 97720, 74967]
21584G4967n1704o3845P928M7063j6851j6149L9648l816n5828K30M5763l381n483
21571a458k4963j3344m3828l9554J4179N4887J3740J5625K0751q4939q2794N7340
21559a14358Q6180L659J0678J8655L8013O320L779p3565j904P4963J1671K629
21547F6720j6808o3852k0908L751J310j2486Q056l1164n9806l027M9352N7565
21535b1297K0408J6878j5544l4546k5939L7288L8156k490L3571M1946k7116n668
21523E5647k425K3934l8454q7957l298M2890N0485m3818j9902k534M0034M2002
21511E6604j4701M3044L3164k6622l1559J954j9409o1572k1247P142l4506j9741
21499h7449M2707N0418j1615m3031k4314j5477O1436R4326r584m5464q1259l411
$$ y = [74967, 23263, -40582, -32654, 14409, -2442, -18591, 21057, 17241, -38587, -38357, 7406, 4025, -1458, -26421, -39765, -83593, -123147, -108968, -54081, -40341, -24716, -3965, -88904, -171698, -114358, -28178, -24519, -13841, 4814, 42827, 49147, 52926, -20639, -22543, 52420, 64091, 66720, 49912, -13940, -34848, -31097, -29787, -42273, -34217, -65381, -125187, -128214, -78862, -21297, -889, 15989, 445, -34101, -60040, -22752, 15404, 12914, 46485, 88431, 61315, 55647, 53222, 77156, 38702, -49255, -52553, -9663, 40822, -2996, -22898, -25432, 14602, 56604, 41903, 84947, 118111, 91489, 59930, 61884, 42475, -19097, -40344, -33202, -67708, -87449, -44742, 5676, -5939, -48970, -73284, -88761, -27325, 67001, 57417, 11953, -69306, -72717]
21487g2717K5688L3060m6130l9851K6576L5580J976K5943m267J0157L0351k7884
21475a518k3796m247j8568L1034L2479R8k5042k0690M2584K1798P844K5646j1959
21462E5663k2584q0546k7074L7633N9901k2169O0597j9871J1835j0419j7358J199
21450B6807O281N988k283N288K7317m7609m2914n9014N7710K2952k414l3464l5095
21437g0450j0016J5727N5249L8146j6675k2573k7420K4541O515J4065L8203l5937
21425I375k3584L0217M3634L2603m7191k2390k9830m4921j0997j3583L8028o441
21413d5080n2156N79L7547l066M1660M8732J2614n4023n6963o262K6857K7644
21401b1917j233N695N643k4716R810l7790o214k0757l9009L603J7508J2090N5926
$$ y = [-72717, -47029, -13969, -60099, -99950, -73374, -37794, -35818, -9875, -14142, -3985, 26366, -1518, -25314, -29561, -48129, -17095, 15384, 15482, -9560, -30250, 12334, 34132, 41976, 67622, 55663, 33079, -47467, -74541, -36908, 22993, 824, 61421, 41550, 53385, 42966, 25608, 26807, 33088, 39076, 36793, 42081, 69398, 21789, -21125, -80139, -22429, 523, -1891, -35355, -70450, -80466, -64739, -9490, 28656, 11981, -10592, -38012, -13471, -6956, 7109, 45312, 9375, -14209, 16008, 59642, 92245, 45054, 22664, -7166, -52087, -63084, -76667, -38639, -45080, -97236, -96657, -59110, -62176, -20516, 28216, 40830, -13193, -70156, -76418, -49561, -21917, -23150, -17455, -11812, -36528, -26718, -64508, -70722, -91479, -130488, -126885, -109377, -97287, -41361]
21388d1361J5824k5731O60L0054R933n9228j7221k1025Q5203J9157j322L3207
21376B8150o4236O852N1553p578J3680l430j8474K1867k3428j3362m9437j3148
21364g0991O8658o774J8636j166k1334m6704k9912R4986J3788m9224K1698L0333
21352B1994R863j1541j4414l2349N0808K9846j5438O01Q799j5382k9146k1033
21340a7392K254K0002K1648R50l1361q933J7653j2757k7865M073k0126J6657M6057
21327A0860K178m474N419J4724j1692l1510n5910j1618M621l3040K722K4903N2299
21314c0518M5042J2679M0885j2731k4465m1873j9174j2510k8875p1815n2518L8961
21302a56912J05812M6768l0347n7728M2870K6539l5830K4576N1846L5752j3445
$$ y = [-41361, -25537, -51268, -50608, -20554, -10621, -69849, -87070, -108095, -22892, -3735, -5057, 28150, -36086, -29234, 22319, 14741, 28421, 24991, 6517, 28384, 4956, -8406, -57843, -70991, -2333, -9107, 9529, 8363, -12971, -59675, -89587, 5399, 19187, -30037, -8339, 21994, 31857, 20316, 5902, -26447, 24361, 54207, 38769, 39370, 48169, 32787, 3641, -17392, -15138, 4864, 26512, 27462, -3899, -12832, 4821, -7936, -35801, -31728, -51854, -35197, 10860, 13038, 8564, 13983, 28707, 17015, -14495, -70405, -82023, -77402, -110442, -107720, -82817, -30518, 14524, 27203, 68088, 55357, 30892, -10981, -30155, -42665, -71540, -143355, -195873, -156912, -51100, -4332, -34679, -92407, -49537, -22998, -58828, -34252, 17594, 53346, 39901]
21291C9901m555l9623m6811Q788N2198P9348N189j2646m8809o0101K4474J654
21279i93l7646O082J7655n784J2035j977j7224k460N0174L3075k0746j8238o9926
21266e5973l2821Q0993m41k0949k03J2610j0854J6916k3009o7314N1711K9067
21254b0267l3511K1628O832m5634k2271R839J0035q61N1639O5821K7432n9521
21242A1161n5382K0769K3072m7191m538J6636L2797j1211o993K6989K8077m4063
21230i877l6997L9362K796K4636J4765J1264K9151o1661o6112j5014J9627k3422
21218g1482k0611J9576j6341j5768O9533J9009n3716j4704L4652N6315j9373L612
21206i298N320k0644K8174k1503j414O7072p536o0932J9132m854j2453J1828k2565
$$ y = [39901, 35346, -4277, -51088, -42300, 9898, 89246, 94435, 81789, 32980, -27121, -2647, -993, -38639, -32557, -14902, -20686, -8651, -10628, -27852, -30312, 19862, 52937, 32191, 13953, -55973, -88794, -7801, -8242, -29191, -29394, -16784, -27638, -10722, -33731, -101045, -49334, -20267, -53778, -32150, -25318, -70952, -93223, -83384, -73349, -74210, -22571, 43250, 70682, 11161, -44221, -23452, -380, -47571, -52109, -35473, -2676, -13887, -20880, 6109, 34186, -9877, -46874, -7512, -4716, 19920, 34685, 45949, 75100, 13439, -52673, -67687, -48060, -71482, -92093, -72517, -88858, -104626, -35093, -16084, -69800, -84504, -49852, 6463, -12910, -9298, -3978, -24622, 3552, -17951, -19365, 47707, 40171, -20761, -1629, -6483, -18936, -7108, -29673]
21193b9673J2138j7280J2868K772j1558K466O726P015n610j3443K2088L1059j976
21180A7592k1251n754L2802L2807l7607k7893P00k210j5900l7583M1127L2544
21168I374L936j7334m9829r079m5574n990N4256l0828J1684N3112L7192K2508
21156C3428K4175J9647k7973n6327k0607K8775O0856j5351m2319P141L522n827
21144I140m4921q999N059O559k7417J8502K2571K0607q969j2893l3218n1114L241
21131a01852N2872K8463L6598l9086n9985J2865K3053K1742j924K9511n142o0433
21119f3318J0429M6510Q2644l6406l6955p320l3748p776M6348N6267j384p1335
21107a6044j8900M0625J8030j0231l7l5985N4556k9350J6538n07o7633P0732J04652
$$ y = [-29673, -17535, -34815, -21947, -19175, -30733, -28267, -21541, -14526, -20136, -33579, -11491, 19568, 17592, -3659, -9413, 23389, 56196, 18589, -9304, -8604, -10814, -26714, -64297, -23170, 9374, 13310, -4024, -53853, -62932, -108506, -114496, -60240, -91068, -79384, -26272, 10920, 33428, 57603, 77250, 49277, -7050, -27657, 1118, 61974, 46623, 4304, 11445, 14967, 9140, -35781, -44780, -39721, -33162, -60579, -42077, -19506, 1101, -7868, -20761, -53979, -105093, -101852, -48980, -20517, 16081, -23005, -82990, -70125, -47072, -25330, -27254, 2257, -2885, -63318, -52889, -6379, 76265, 39859, 2904, -4416, -38164, -45940, 408, 56675, 55291, -16044, -34944, 5681, 23711, 13480, 13443, -22542, 32014, 2664, 19202, 18695, -48938, 21794, 126446]
21094A26446o0538l6578L2247J3611K7375Q70j5484n9544l2061Q5294J4536n0540
21082D5634l9483J1846j4229J5520J8496j376R888J4111o4538j2443l074j064
21070b0712j4054l616N487j8284m8154j1118L564K6752J8311J4518M3555M374
21058F23m9051l5419j8291J9360M4146M5483R610n6345K4291M4061R49n5529L0103
21045C991o9754q0496k0279Q3197O9632n0473j857K1116N1712J2013m1170k8991
21033e1359O17o544P97K6704M2318O3503N6273k3316j1806L413k4121j2561k5006
21020C8912J4485n4397l8435L2296J9798j5601M5769p0301j6614J8144P5709O342
21008E6107l2513j6116j050J5670J7979j5748n7903p2498J4587N0025L1645K1475
$$ y = [126446, 65908, 29330, 61577, 75188, 102563, 103433, 87949, 28405, -3656, 81638, 96174, 45634, 6151, 17997, 3768, 19288, 37784, 36408, 46296, 60407, -4131, -16574, -19648, -20712, -34766, -38382, -32895, -51179, -99333, -110451, -106887, -80135, -61824, -47306, -3751, 623, -48428, -83847, -102138, -82778, -38632, 6851, 16461, -39884, -15593, 28468, 29417, -26112, 3991, -65763, -146259, -166538, -83341, -13709, -64182, -66039, -44923, 6789, 18802, -22368, -51359, -50742, -57286, -56489, -29785, 12533, 76036, 132309, 108993, 97187, 100600, 76479, 63918, 38912, 53397, -1000, -39435, -7139, 12659, -2942, 42827, -27474, -44088, -25944, 49765, 56107, 23594, 7478, 6428, 22098, 40077, 24329, -33574, -106072, -91485, -41460, -9815, 11660]
20996A1660J6093m1581j9569l9981j5619M2585L4002j1086J3753K3833k3139k7071
20984c6120m402M3242n4022k1057J8299K4308J0669Q8108J9161l3344o6747J6530
20972D625k4871l5372J0973O5783P8456l0596l3008k3293l9533n2293L1031J0145
20960c7953N3396J0806R827l0973J0911q58K8926m3277l9255k1793p604K2407
20948d5440P2249N0482p8622j15865l5440M9624K5271k627L0812M4216N848J2381
20936A2889k8347j7174m0420K0060M0147j4683l4915l0840J0806J9067R251N2582
20924a577L418m5393j1965j861j375M3580J5720J1655K2316K1234m0590K1956
20912C7118n3243k6141J0506J7418L5594J1179k6288J7600j2146o5246P990P0981
$$ y = [11660, 27753, -13828, -33397, -73378, -88997, -46412, -12410, -23496, -9743, 14090, -9049, -36120, -40522, 2720, -51302, -72359, -54060, -29752, -19083, 69025, 88186, 54842, -11905, 4625, -20246, -55618, -44645, 21138, 99594, 68998, 35990, 12697, -26836, -79129, -48098, -37953, 15443, 26249, 36076, 5103, 16014, 15156, 44082, 805, -38450, -60243, -67847, -45440, 26809, 77291, -1331, -117196, -152636, -103012, -77741, -80368, -49556, -5340, 508, 12889, -15458, -32632, -73052, -52992, -12845, -27528, -62443, -93283, -82477, -63410, -54159, -1577, 1841, -43552, -55517, -57378, -58753, -15173, 547, 12202, 34518, 55752, 15162, 37118, -16125, -42266, -31760, -14342, 21252, 32431, 6143, 23743, 11597, -53649, -45659, 25322]
20900B5322L2693M2798J4353k0862k0987l5870m6867p4947P036Q1201P647k0807
20888i290k7297j083K3081K1692l0832n7921k5525M0857O2651K3200K5336j2665
20876C2204m7904Q12K3257J7431j1958M7324j7200O07M430l2424r645N6857r852
20863E3939K9110K058o7271n2522R3547K6135j4506o432k4875k8163j1030j0715
20851a0725k0283K4150l3197K5035L7104j2943o1775k5475P3243Q2785o291j8655
20839E2973m3778J5963n341j6047K6678N5763j1152k0312q951j5090J7935k7708
20827B0933l1818N502M6939j7154m1812J1809k6305L1737K9418K3753J2073j1610
20815E3465M4953L6700j1512m0559o3435m8706j5380l8895N133J455M1112K5697
$$ y = [25322, 58015, 100813, 115166, 94304, 73317, 37447, -9420, -84367, -77331, 3870, 11517, -9290, -36587, -37670, -14589, 7103, -23729, -81650, -107175, -66318, -3667, 19533, 44869, 32204, -15700, -14888, 8369, 25800, 13842, 61166, 43966, 44573, 49003, 16579, 6934, 63791, 53939, 83049, 85107, 17836, -34686, 58861, 84996, 70490, 64058, 39183, 11020, -10, -10725, -31008, -6858, -40055, -15020, 22084, 9141, -52634, -78109, -4866, 77919, 71628, 52973, 9195, 25158, 19817, 3770, 30448, 86211, 75059, 54747, 45796, 30706, 48641, 20933, -10885, -5383, 41556, 24402, -17410, -5601, -31906, -169, 29249, 53002, 65075, 53465, 98418, 135118, 123606, 83047, 19612, -29094, -44474, -83369, -78236, -76781, -35669, -9972]
20803i972L188J6657k3175L0105j1802P735j4060k2032J2128P874m8155m8994
20791a00503l5436p454Q79N5698k453K2364k7185k0511L7502J4465r213K6961
20779d4886j0734K6612n129J1284q514L692N5723M1722n3985q8744K8825M7901
20767C767P7477M9811k8075n4991o3887j5899J3264M7512N338J032j8940k6626
20755a0217k1558r078L576K8824K5359L6797N0575J7645o6976n9831m7904L892
20743d8896M2269J2365J3898l3886l5936J005O6154l4900p257k3917m5333K3207
20731g1227M2729M9758J4139L1081j8247j441O69J5369M542m4789K467j723J5824
20718C9151o359m697k4988M3679l7267k3902k6894L2413k3564n2698J9416j6666
$$ y = [-9972, -6784, 9873, -13302, 16803, 5001, 12736, -1324, -23356, -11228, -3354, -51509, -100503, -135939, -143393, -142514, -86816, -89269, -66905, -94090, -114601, -77099, -62634, -71847, -44886, -55620, -29008, -34137, -22853, -31367, -27675, 28048, 69770, 15785, -72959, -44134, 3767, 81244, 131055, 102980, 47989, -15898, -31797, -18533, 28979, 34317, 35349, 16409, -10217, -31775, -40853, -37277, -8453, 16906, 53703, 104278, 121923, 54947, -4884, -52788, -48896, -6627, 5738, 19636, -14250, -50186, -49181, 16973, -17927, -25184, -49101, -94434, -71227, -28498, 21260, 35399, 66480, 48233, 46792, 47461, 62830, 67372, 22583, 25050, 23327, 39151, 32792, 28095, 3107, 46786, 9519, -14383, -41277, -8864, -32428, -85126, -65710, -82376]
20706h2376M1782j6131k4160P149J1068J06J8189M8180L3301j3340j4331J6620
20694B6057Q603R563o028j3716m4593J7539J7809l5308k5524n29M5134N7198k2353
20681C3852n3682j625K9946n04j891J3382J4535j0224l3552K6280J5717L0924
20669F3158J9218j6962J6443p7232k8020k2139L8098k8996o363P204j8937M0621
20657a3907L226j06O5776L3132K0768l4790n6375o2275j7801m6086L7245J0794
20645f0399K80j833N7104M4732N4877j8196j2316o1005k8909m072j9346j6861
20633f5944M206K345k9924M6194M7153q664l3203j2673K1414O274o763o8937J9965
20620g8557k500m0160L2963K841n8430j240j0500Q7997K8528o5995L125R621M6114
$$ y = [-82376, -40594, -56725, -80885, -73736, -62668, -62562, -44373, 3807, 37108, 23768, 9437, 26057, 34660, 44223, 38195, 24479, -20114, -2575, 15234, -20074, -45598, -46127, -993, 56205, 33852, -19830, -21455, 8491, 7987, 6096, 19478, 34013, 23789, -9763, 16517, 32234, 63158, 82376, 65414, 81857, 4625, -23395, -45534, -7436, -36432, -42795, -35591, -54528, -13907, -10681, -10787, 54989, 88121, 108889, 74099, 17724, -44551, -62352, -108438, -71193, -60399, -60119, -61952, -4848, 39884, 94761, 76565, 64249, 3244, -25665, -29737, -49083, -65944, -61738, -59393, -89317, -43123, 4030, -4634, -37837, -50510, -29096, -22822, -29585, -98522, -78557, -81057, -121217, -88254, -85413, -143843, -145083, -155583, -67586, -39058, -105053, -101928, -92307, -46193]
20607d6193J2648j4512p872J4581n850k6824O3116L3106p371j2435J6630K9552
20595D8576k3339m9707P738j765j1641N7726K4858l0394p2756l5002J7201m198
20583g2703o3064N5760M4096J7666j712J7402L7925L5335l3378p8253m2266P7329
20571e863J8989l028k1317j6235M0818O5595J1555j5618r517n1678k9792j6798
20559c2889J5289K2506j0295L4503j8924j7696K4545o483k0559R039k0682j3241
20547c4887K6691k1145J2202J9715K2247M2128P339o707m8384k3824K0465L0739
20535D6579o2661o8490M5496L8016J6045N284l4705j8057o4191n1321O2596Q5409
20523@K5680m589K1208j4991k8978l6307L5133M2772l081L4622l0586l5228J8653
$$ y = [-46193, -33545, -48057, -55929, -41348, -47198, -74022, -10906, 22200, 14829, 2394, 19024, 48576, 25237, -24470, -16732, -18497, -30138, 27588, 52446, 22052, -50704, -85706, -68505, -72703, -135767, -80007, -35911, -18245, -19957, -2555, 35370, 70705, 37327, -40926, -83192, -5863, 13126, 10098, -11219, -27454, 13364, 78959, 90514, 74896, 65379, 13701, -16091, -32889, -17600, 4906, -5389, 29114, 10190, -7506, 17039, 10556, -10003, -964, -21646, -34887, -8196, -29341, -17139, 2576, 24823, 66951, 74290, 67583, 19199, -4625, 15840, 46579, -16082, -84572, -39076, -1060, 14985, 20269, -14436, -32493, -96684, -148005, -85409, 0, 25680, 21091, 42299, 27308, -1670, -37977, -2844, 39928, 36847, 71469, 40883, 5655, 24308]
20510B4308K6752k9325m5516m0444L5144J6166n7503m122l422M2669K2822K9301
20498A6830q141J9128M692l8951k7291j665J9554n887j7429K2813L266L6238K9588
20485E2745m7423m2145l9653M8889M2530o799k1011K223k4558J9058r019p5378
20473a00541l963J3051O9778L6893n3442j8679j38j0534l142L3063m6915Q5671
20461A102N9644k5983n6474n0641K2463J7380m1557J6067P3939N2621m3112j8107
20449G342l4628N9127L7038r793p068R443l4598O766J0635K117m944l5746l4814
20436b9123r003n13J7558m8578j0348J6159p799M615M3547n037n4659N1196O4866
20423C2881M557o5297k657l0661m7323M9687O8433k8169J1563k9877N6971L5106
$$ y = [24308, 51060, 21735, -23781, -64225, -29081, -12915, -70418, -74540, -77962, -35293, -12471, 16830, 8689, 27817, 32509, -6442, -33733, -35398, -15844, -21731, -39160, -16347, -13081, 23157, 52745, 5322, -36823, -76476, -27587, 14943, 8144, -12867, -10644, -35202, -16144, -25163, -100541, -104504, -91453, -21675, 15218, -38224, -56903, -57041, -67575, -70717, -37654, -84569, 1102, 60746, 34763, -21711, -72352, -49889, -32509, -74066, -57999, 15940, 68561, 25449, 7342, -27286, 31841, 68879, 59086, 52018, 61461, 26863, 33629, 44264, 46381, 41437, 5691, -29123, -38126, -38639, -21081, -69659, -80007, -63848, -71647, -67032, -23485, -28522, -83181, -31985, 32881, 37438, -27859, -30516, -61177, -108500, -58813, 9620, -18549, -6986, -36863, 20108, 55214]
20411E5214n229l0003j9881l991k8284o81L7888O818L1409O3569q982j3576O233
20398I0504k2458p0497k1769m516m1143l3962L1968M1132J06229M5234o1535j4021
20386D5166r974j4216j5051k9983J1002J883k5157q509K5773N0566J8206j975
20374D7731j5845j7667J2418o875n034j9807l573J8321l9843j4019K8566j9034
20362c4661l9352O2586M4044l0067K3531J9068j0159m0529l5112j8376K9195J4102
20350a5730K9754N7312M0545L528n3079n7763j1862L0959m025l1588J1557n8899
20338e9291K523L084M896K4862L0589n6336k8200O0774J4760l2441J4471J2860
20326g449l6205k9919K637j7899K0867M7456L7900J4684j3785p1k4805j6627N773
$$ y = [55214, 49985, 19982, 101, -3890, -32174, -32855, 5033, 11851, 43260, 106829, 97847, 84271, 90504, 68046, -2451, -24220, -28736, -69879, -103841, -71873, -30741, 75488, 120722, 59187, 45166, 35192, 20976, 5925, -24058, -13056, -11173, -36330, -44839, -19066, 31500, 49706, 47731, 31886, 14219, 26637, 19762, 14728, -5079, -8652, 9669, -30174, -44193, -15627, -34661, -74013, -11427, 32617, 2550, 26081, 45149, 34990, -5539, -40651, -59027, -29832, -15730, 14024, 71336, 111881, 115409, 62330, 4567, -7295, 23664, 19639, -11949, -392, -59291, -56768, -53684, -48788, -23926, 6663, -49673, -77873, -17099, -2339, -34780, -20309, -7449, -43654, -73573, -70936, -88835, -67968, -20512, 17388, 32072, 18287, 18216, -6589, -23216, -17443]
20313a7443Q2753M2974k3046k8652L1933j648l1514m3590k1840j0404O4746k6956
20301A7313k6321k5695p849n034M176J6645r472K9709M8454N1789k1228o3694
20289H793o0459J64M1058K9380l2973k1235J581J8571K5977j5163j1046M3800
20277B8448l47l9839L8705K5780o2983j1752M6244l8317l5361j0440j706K7037
20265c4531Q0975L8736j7737n6823o4241j1982J8735L4269L8805N211n49Q744
20253C9612k8150J6240n430m4986J563L9535m2580l7259L3188L2575m3381k7271
20241f6344L1652M5414j8103p9588l3938L0910O4238J6434l5819K200j7818K2069
20229c8693J8543O0522J1962p0575j3670m1117k646J5796N8480M0757J4098J578
$$ y = [-17443, 65310, 108284, 85238, 56586, 88519, 86871, 55357, 11767, -10073, -20477, 44269, 17313, -9008, -34703, -42552, -47586, -43410, -26765, -36237, -6528, 41926, 93715, 72487, 8793, -51666, -51502, -10444, 18936, -14037, -35272, -33691, -15120, 10857, -4306, -15352, 28448, 28101, -11738, 26967, 52747, -10236, -21988, 24256, -14061, -49422, -59862, -61568, -34531, 46444, 85180, 67443, 10620, -53621, -65603, -46868, -12599, 26206, 31417, 30868, 39612, 11462, 27702, 22272, -22714, -21151, 18384, -24196, -61455, -28267, 4308, -39073, -66344, -34692, 10722, -7381, -86969, -120907, -89997, -25759, -9325, -45144, -42944, -60762, -38693, -20150, 40372, 52334, -18241, -31911, -73028, -75674, -59878, -1398, 39359, 53457, 55035]
20217E5035O508m0204L1567j536n6720m3464m6467K9034Q6403Q0692j3146n7340
20205C0362m2013l8720O397J1570J3491O402l8680L7543K3323j0882k7735k2111
20193e1053N6619j2883m544J2786J6255k7431k0934k6396o6989n4393P6063Q0280
20181b2620J340L2145j2527k8671J1209l0293j3202J5235N871p46O6910J3837
20169C8488j6726O945L5550M87m7506J7861K3863m223n7202J3185N5551k9098
20157C7175j9030K8570k4067N700l8882R088L9755M9840o890o0998l0308n3361
20145f3408q390K6825L7958K836p996K3738L9609k0135o7141o0750j2024K9132
20133g9746L215p399J832L2064L9894K8069k1293k5347l2792M5832N0409j5578
$$ y = [55035, 61543, 21339, 52906, 51370, -5350, -48814, -95281, -66247, 20156, 100848, 87702, 30362, -11651, -50371, -43974, -32404, -18913, -12511, -51191, -13648, 9675, -1207, -28942, -51053, 5566, -7317, -11861, 925, 17180, -10251, -31185, -57581, -124570, -178963, -102900, -22620, -21280, 10865, -1662, -30333, -19124, -49417, -62619, -47384, -41513, -42259, 24651, 38488, 21762, 28707, 64257, 64744, 17238, 35099, 58962, 54739, -2463, 10722, 66273, 37175, 18145, 46715, 22648, 28348, -10534, -1446, 38309, 88149, 81259, 20261, -10047, -63408, -71798, -44973, -7015, -4179, -12175, 11563, 51172, 31037, -36104, -96854, -108878, -79746, -76531, -83930, -82098, -50034, -10140, 17929, -3364, -28711, -61503, -15671, 34738, 19160]
20121A9160p299J9938K528N3090M6522l6133l5481j3123l4559k3089j9883P6668
20109D8339R20K7731m2457m3977m4007M199L0623J1680J05K2312O8515j7384J5773
20096H2372j1986k6765l1948j9962M5989J1551l94K688q258j807l5462k0575O6640
20083E2083J8638N310p9974m9654O336r39p21J0017j0105N1960M0611j4945j3791
20070A4826l8701o264P366K4877N7115O415m1226k0410K7932l9647k3859J8770
20058a2806k2489N7407P0041J5187k2048M224J3269j7318r047l89J3164L3962
20046A23157l0366n2548k0178j2801j3640K223L9073n592o151o989N345J504k8479
20033e442L190M6228o708n5644L031K3077j8159K6912N8517k6420J2866J8680
$$ y = [19160, 11861, 31799, 34327, 87417, 133939, 97806, 62325, 49202, 14643, -8446, -28329, 48339, 49259, 76990, 34533, -9444, -53451, -49252, -18629, -6949, -6844, 15468, 83983, 66599, 82372, 70386, 43621, 11673, -8289, 37700, 49251, 48857, 51545, 43287, 41480, 6018, -14557, 52083, 70721, 76031, -3943, -53597, -47261, -48200, -48921, -38904, -49009, 2951, 43562, 28617, 14826, -23875, -30139, -22773, 2104, 59219, 65634, 24408, 3998, 31930, -7717, -31576, -12806, -35295, 22112, 92153, 107340, 85292, 89516, 102785, 85467, 76420, 76031, 89195, 123157, 92791, 40243, 20065, 7264, -6376, -4153, 34920, 29328, 23177, 16188, 21533, 23037, -5442, -2252, 43976, 37268, -18376, -15345, 7732, -10427, 16485, 75002, 48582, 61448, 80128]
20021H0128k4975r0308Q237k4384l7068K0037N7034N6653k5028k0987J5267O2480
20009G7086l358n1450K7410N959k787q340J0865k4789p5411q385q405L4461L4028
19996F884n868J2099J2291K3006o085k9494k7771L1041L3829m8186k6890O144
19984a9000O3556K7036M2436j1896m9257j1689k8925l8494j5131P3604M0221J9973
19972I2434o708N5329Q375n2082p183k2464k5848k5801K1215L6511j0457l6189
19960B7132N1996j9640M3111M8679m0666l7344p0408K2227j9627J9131M7577P349
19948G9517n4399m795k1264j3436q454R505m575l29J3377l1975k4298J8902M9940
19935G716J3217J9741R211j1519L0776J9369q6126o2360j9314o0298L4958L7289
$$ y = [80128, 55153, -35155, -26918, -51302, -88370, -68333, -11299, 45354, 20326, -661, 14606, 77086, 73728, 22278, 49688, 55647, 52860, 44520, 55385, 30596, -44815, -53200, -61605, -27144, 6884, 1016, 13115, 25406, 48412, 42327, 12833, -14938, 16103, 49932, 1746, -25144, -19000, 44556, 71592, 114028, 102132, 52875, 41186, 12261, -26233, -41364, 32240, 72461, 92434, 85726, 141055, 149430, 97348, 90165, 67701, 41853, 16052, 37267, 73778, 63321, 27132, 79128, 59488, 102599, 151278, 110612, 73268, 2860, 25087, 5460, 24591, 72168, 79517, 25118, 20323, -941, -14377, -22831, -13326, -17901, -18230, -4853, -36828, -61126, -42224, 7716, 20933, 40674, 49885, 38366, 69142, 88511, 2385, -59975, -79289, -139587, -104629, -67340]
19923f7340J5657J5042M4487K1397K0875N9508N318r70P921k8396Q925j0476n3746
19910C8202m2420M2115P1832k735O579k5897m1159m219k781L8953M627J0914j5318
19897G8693n3563o373j583O887K7234M1164j8190k4858J7243K4643l5879j7150
19885C8268L98n299J842m9029M7136Q0489m5861k0898J4748k2038o0590m169K1288
19872c715J4607J9099k9814K7342J019k9935L747N678L9368K3477K7370M4355
19860A42598K584q3002j04911j1489k0991L3386M6341k4812j3428K3020k7062
19849c7766Q8730L0590J3739n7876n1148M7783q158M1563m8356k4041M499P286
19837F845M042K1534L9596m8281l884r411N086j3442n051j8699L2358r418M5579
$$ y = [-67340, -51683, -36641, 7846, 29243, 50118, 109626, 114944, 113974, 121895, 93499, 102424, 91948, 38202, -4218, 37897, 109729, 106994, 113573, 87676, 46517, 42298, 39517, 78470, 83097, 94011, 78693, 25130, 18757, 17174, 24061, 51295, 92459, 74269, 49411, 66654, 91297, 55418, 38268, 38666, 33367, 35209, -13820, 33316, 113805, 67944, 47046, 61794, 39756, -20834, -25003, -3715, 10892, 29991, 177, 27519, 28538, -1397, 2350, 8028, 47396, 70873, 98243, 142598, 145182, 62180, -42731, -54220, -75211, -41825, 4516, -20296, -33724, -10704, -37766, 50964, 81554, 95293, 37417, -13731, 34052, 25894, 67457, 19101, -4940, -441, 6845, 10887, 32421, 72017, 23736, 19852, 10441, 15527, 2085, -2966, -21665, 10693, 1275, 46854]
19824D6854M6008K3951m2638j072J2171p916M43k5984k6914M1704O8282J6874
19812A51763j20457m4621j6284M0539J5106j0227j5279J8743M0341O649k3604
19801D2669p57j5552k5797n4109j2514J3475L6040J7668n1567k1770J09041K4941
19789F1768j5395J0483l5706J1283K1577j5060m7131j8071N4735M1702K8125K200
19777A00510l1341l423m2238L0818r387m7811j2910P720N0584L772r614l0760
19765E920L2504J8073l0269J9262M911k1715K5845q117n823k6114k0051M4698
19753C9124k6533j6648L0378K604J6945K7819N389j3667l1146j9552K6230K8195
19741F9138L150k8585n2338K4747L4027p0601o1445j5286O3173Q3715L0429k628
$$ y = [46854, 92862, 116813, 74175, 73103, 85274, 77358, 77801, 51817, 24903, 66607, 134889, 151763, 31306, -13315, -29599, 10940, 26046, 15819, 540, 19283, 59624, 66273, 42669, 41912, 26360, 563, -53546, -66060, -52585, -16545, 1123, -50444, -72214, 36827, 61768, 46373, 56856, 21150, 32433, 54010, 38950, -8181, -26252, 28483, 70185, 98310, 100510, 69169, 65746, 23508, 54326, 44939, -2872, -15782, -8062, 42522, 46294, 36680, 5920, 38424, 56497, 26228, 45490, 50401, 28686, 54531, 46414, 40591, 14477, -5574, 39124, 12591, -4057, 26321, 28925, 45870, 73689, 79078, 65411, 34265, 14713, 40943, 69138, 72288, 43703, -8635, 16112, 50139, -20462, -81907, -97193, -34020, 49695, 80124, 77496]
19729G7496l5432J1090L8315p0859j3014J4574O3642L608j7398N0209k3773o5709
19717C2749J5897K2853k3092n1312m2183J9028O5240N7368J9303K2110p2331r0160
19705b4530p044L9754P508k3618K299P057j7644K2203K7940m0292l3250N2260
19693A2643N5312R238M768R499k1318K6455j5310j68N1323m4992j3117j5713l2828
19680B5792K2377N6935J4858m9473n2182L9187J3316P5416K7074o7979l8268q0771
19668a3718l1930M0006J6912j0521l4704j9960k7070P889O3549J9547K0120n6278
19656b6158m0805O024J8499O6458K3640m123m2241m0719N6293M5731r597J1678
19644F4680K7454k2160n6362K5300K7468J5636J3386j2487J5309k9093L3503J9609
$$ y = [77496, 42064, 53154, 91469, 20610, 7596, 22170, 85812, 89420, 72022, 122231, 98458, 32749, 48646, 71499, 48407, -2905, -45088, -26060, 39180, 96548, 115851, 137961, 65630, -24530, -31574, 8180, 15688, -7930, -5631, 1426, -16218, 5985, 33925, -6367, -39617, 12643, 67955, 77193, 81961, 91460, 70142, 96597, 81287, 81119, 132442, 87450, 74333, 58620, 25792, 48169, 105104, 119962, 70489, 18307, 57494, 70810, 146226, 173300, 105321, 67053, -13718, -45648, -5642, 11270, 749, -33955, -53915, -80985, -73096, -9547, 10000, 30120, -26158, -66963, -60939, -42440, 24018, 47658, 43535, 1294, -39425, 16868, 62599, 53002, 64680, 92134, 69974, 13612, 38912, 66380, 82016, 95402, 82915, 98224, 69131, 102634, 122243]
19632A22243O4868j8937o1798m4997j703N46L6128M4687r119m260k5985L4664
19620A36337m4335j9175k2101o000P273L0189q189j6061J0552k3793N2980k1469
19608G6208J9272L9830l4096q125J3176k902l2805K3236j7866l5241M0034O0316
19596A41037N33o751j3530l6876J3537L0071j6847k4033j8394r460k6613j533
19584C1141n1656l5055K673M3601K3796O5135L1092m8170k3051j3377K9623P874
19572F3626k6453K4394L7460p520J1533L1991L484l2325k1189O386M5426l2819
19560A03994l7694j8011k1865M928k85j8757l8786m3022L2562M5395n4347o9533
19548a15421L5334N3068J8564O1p467j2794J8448K0419M0480P6284N594K1224
$$ y = [122243, 187111, 168174, 106376, 61379, 59676, 60222, 96350, 141037, 131918, 127658, 101673, 136337, 92002, 72827, 50726, 44726, 51999, 82188, 73999, 57938, 68490, 44697, 97677, 76208, 95480, 135310, 101214, 93089, 106265, 103363, 70558, 93794, 75928, 40687, 80721, 141037, 141570, 134819, 121289, 84413, 97950, 128021, 111174, 87141, 68747, 59287, 32674, 31141, -20515, -55570, -52897, -9296, 14500, 79635, 110727, 62557, 39506, 26129, 55752, 63626, 37173, 61567, 99027, 91507, 103040, 135031, 138515, 106190, 85001, 91387, 136813, 103994, 66300, 48289, 26424, 31352, 31067, 12310, -26476, -69498, -36936, 8459, -45888, -115421, -80087, -27019, -8455, -8394, -15861, -28655, -10207, 10212, 50692, 126976, 132570, 153794]
19536A53794J3990j5192n4281j01580J5851M8037k3564o0213k6879L1302N295
19525a3440J8710L3126L1468j0703J1640K6411k2908J5512K766L7405k4327j3722
19513I1938L5179k1768k8406K1011j7401m833M4490l0245j1214k0536L5460J4184
19501A07859n4190m2525P375L3744j9729m3308J9968L1978J8492k2779K3440O2355
19489A22680j0555J084l019P714L9053m6456n6259Q599K9490M4407k6529P20N4781
19476A65710j7424n2973p970r388J7235M8948J1440J6738j457n5008p262j8616
19464H9973J158r704j4775p1841K3983L3177L3091J4441j5526n811N7924N414
19452A41504j9231O244n7284j8733l9875J8665K9137j7509m7275k962M3230N219
$$ y = [153794, 167784, 152592, 98311, -3269, 12582, 60619, 37055, -23158, -50037, -18735, -13440, 5270, 38396, 69864, 59161, 70801, 97212, 74304, 89816, 92582, 129987, 105660, 91938, 127117, 105349, 76943, 97954, 80553, 75720, 120210, 89965, 78751, 58215, 93675, 107859, 53669, 11144, 18519, 52263, 32534, -10774, 9194, 41172, 59664, 36885, 60325, 122680, 112125, 113209, 110190, 117904, 156957, 110501, 54242, 62841, 92331, 136738, 110209, 110929, 165710, 148286, 95313, 87343, 77955, 95190, 144138, 155578, 172316, 170859, 115851, 108589, 89973, 91131, 81427, 66652, -5189, 18794, 51971, 85062, 99503, 83977, 78166, 136090, 141504, 122273, 128517, 71233, 52500, 12625, 31290, 60427, 42918, -4357, -7319, 35911, 41130]
19440D1130j1785J3250K5436k1868k6649m1023N151Q805J0521K4209K5491l969
19428D8699m9545M6996Q695J2397j5626m2943L4664J4626k1293k7372N1711m292
19416E6717L447L8760M2324N819n7203m6212J9859L4239p9437L669j0360o6605
19404e4983J3205M6763O6713K0899j0670L6818l0365O044j5668l3556K2780O953
19392G4933k0719k5941m364N1634J3219k3681n0744K461K7861m685o0369K0767
19380C72K2439j651J9279O2267N7742m9989p4722K1336j1645j7378J7631L617
19368D9298N1444m217l2487j4854N4916J6353n2698j1700M6871J1939j1168l1480
19356G2217Q2055J4138m1621m7154L2360r64K9750J3582l948O7569l6703m7068
$$ y = [41130, 29345, 42595, 68031, 46163, 19514, -21509, -16358, -7553, 2968, 27177, 52668, 48699, -846, 46150, 54845, 67242, 51616, 8673, 43337, 57963, 36670, 9298, 61009, 56717, 60164, 98924, 141248, 147067, 89864, 43652, 63511, 97750, 18313, 21982, 11622, -54983, -41778, 4985, 71698, 92597, 81927, 118745, 88380, 94424, 78756, 45200, 67980, 74933, 54214, 28273, 23909, 75543, 88762, 65081, 14337, 16798, 44659, 39974, -20395, 372, 22811, 21160, 40439, 102706, 160448, 110459, 35737, 57073, 45428, 28050, 45681, 49298, 100742, 96525, 64038, 49184, 104100, 120453, 67755, 56055, 102926, 114865, 103697, 72217, 154272, 168410, 126789, 79635, 111995, 111031, 140781, 154363, 150415, 217984, 181281, 134213]
19344A34213m9523K4124J3741j8206m3666k4062L2441j4126L581P6620M5715N8341
19332B39193Q482n7642n3172k2147m3803k3509K1291L1845m5036m0680J0960J1033
19320C6815M2719M5002l8921n894k4852l7978L0975K7994j0889M6290k0206j3380
19308G7675J4960l5661l203k581J6878J9963J1372N1218L9608k3534l5736o1285
19296F9674M5807L0975L753l6097m5176m6075m1768Q942K9995j5993J890N8642
19284F4569K9910j9007N917N8230m8722L6990j7537l7527k280K4427o424k1582
19272F6964j294M8919L8647l7072l1707P555M7672m460q7280k9361Q448L5192
19260F2223M7530J8298J2088l822n5231K6997j3702L3558j8057j4269M9915O1066
$$ y = [134213, 84690, 108814, 122555, 104349, 60683, 36621, 69062, 54936, 58517, 135137, 180852, 239193, 247675, 190033, 136861, 114714, 70911, 47402, 68693, 100538, 55502, 14822, 25782, 36815, 79534, 124536, 85615, 79721, 54869, 16891, 47866, 75860, 64971, 111261, 91055, 77675, 92635, 56974, 53771, 51190, 68068, 88031, 99403, 150621, 190229, 166695, 130959, 69674, 115481, 146456, 150209, 114112, 68936, 22861, -18907, -9965, 20030, 4037, 5927, 64569, 94479, 75472, 81389, 139619, 90897, 127887, 110350, 72823, 70543, 94970, 88546, 66964, 65670, 114589, 153236, 116164, 84457, 92012, 139684, 135224, 47944, 18583, 27031, 62223, 109753, 128051, 140139, 136317, 81086, 108083, 94381, 127939, 109882, 95613, 145528, 206594]
19248B06594k4151K2633N2778l9348k9025j820q482j6822m9158K9249L3249j0153
19236A65544j0326j6004Q896q809J2774n533L1804j8836j6469J9814l255q3313
19224G6287l9980M730K6220M6573Q345j7286j083P870M0348m2521L215R8037O5739
19211B76494k1863j5574k3786l3691n0037L247K6683J9548l0531j5113J9933J6502
19199A71812j1986r275K4686j8574N2795R543k457m897k4048J5378J9652r3347
19187A29282p3742n2401N4298P2231O225M5647K1925K7731l1528M4818K4587m1639
19175B27434L0750K0964k3536m4640l5187M5629P5329P4415P397m6492n1920K3486
19163C03629n298k6495L7227N2111O7562J43125K23072L29390L26632K61164J02459
$$ y = [206594, 182443, 205076, 257854, 218506, 189481, 187661, 179179, 162357, 113199, 142448, 175697, 165544, 155218, 139214, 148110, 139301, 152075, 146542, 178346, 159510, 143041, 162855, 159600, 76287, 36307, 41037, 67257, 113830, 122175, 104889, 103806, 111676, 152024, 109503, 112718, 210755, 276494, 254631, 239057, 215271, 181580, 131543, 134790, 161473, 181021, 150490, 135377, 155310, 171812, 159826, 150551, 175237, 156663, 209458, 219001, 216544, 211647, 187599, 202977, 222629, 129282, 55540, 3139, 57437, 129668, 135893, 181540, 203465, 231196, 199668, 244486, 269073, 227434, 258184, 279148, 255612, 210972, 175785, 221414, 296743, 371158, 378555, 332063, 280143, 303629, 298331, 271836, 309063, 361174, 428736, 571861, 794933, 1124323, 1450955, 1712119, 1814578]
19152A814578K5207J05455J20386j3406q2827j14283j10215r8949M1802J68814
19142A856562J66029L1772K5935J0071J3047o4641j40761k37013l56218l32434
19132I72349j87381r9236K5454Q478o0967j13104O3130J03680O4154O6588N1061
19121H94206K5617j9399l4110j7996n7481p4374l3704l6477O3685P6092N4605
19110H40664j6560q015j7593p5064j18253j01309o3381m0382k6248R842P0476
19099D54177K9733n1863n1580m2232p1762l4436L3439O6610L1654j0752p770J3184
19087C58402K3109p939l1888k3456j3685J7071m033J9391J4469N5429M5696N6434
19075E09000K2522O047M7078M6190Q5158O2859m2078q8079j22733k8025L5397
$$ y = [1814578, 1839785, 1945240, 2065626, 2052220, 1969393, 1855110, 1744895, 1645946, 1687748, 1856562, 2022591, 2054363, 2080298, 2090369, 2103416, 2038775, 1898014, 1661001, 1304783, 972349, 784968, 685732, 711186, 719664, 658697, 545593, 608723, 712403, 776557, 843145, 894206, 919823, 900424, 866314, 848318, 790837, 716463, 682759, 646282, 709967, 786059, 840664, 824104, 816089, 798496, 723432, 605179, 503870, 440489, 400107, 373859, 383701, 454177, 483910, 432047, 380467, 338235, 266473, 232037, 265476, 332086, 363740, 352988, 345218, 358402, 381511, 373572, 341684, 318228, 304543, 321614, 317581, 336972, 351441, 406870, 452566, 509000, 531522, 537569, 584647, 630837, 715995, 778854, 736776, 648697, 525964, 497939, 533336]
19064E33336N0879P5286O5287P4316k861o5130j1449n1404j56590j10707k9479
19053C71484l6173k1063j3519N5461K9443l0904n2067j8586r456j9705o1283K5441
19041B19073K8814M9591p534M4214j121p0794q224j6275k5727K8423j5746l6608
19029A88086N9569J2631K8168q197l1905J3086j695Q164J8563M6792L3529P3238
19017D40029M1537l9634p8479l7388l0196K8237L6565N4447L3789K4631K0479
19006D94017P6970K03723J76275P6032P5035J03142L3799j03568m9455o4039j08231
18995I13700J9831R9641J01819J33666J19402k4018j34816j31400j79067j74418
18985G44340r1201n5685q3462k1489l2937k5355M8730m972K5534J9346n8889k8017
$$ y = [533336, 584215, 659501, 724788, 799104, 796243, 731113, 719664, 668260, 511670, 400963, 371484, 335311, 314248, 300729, 356190, 385633, 354729, 302662, 284076, 274620, 254915, 193632, 219073, 247887, 297478, 289944, 334158, 333037, 262243, 254019, 237744, 212017, 240440, 224694, 188086, 247655, 260286, 288454, 280257, 248352, 261438, 259743, 267907, 286470, 333262, 366791, 440029, 481566, 441932, 363453, 326065, 295869, 324106, 360671, 415118, 448907, 473538, 494017, 570987, 774710, 950985, 1027017, 1102052, 1205194, 1238993, 1135425, 1085970, 1021931, 913700, 933531, 1033172, 1134991, 1268657, 1388059, 1364041, 1229225, 1097825, 918758, 744340, 653139, 597454, 513992, 492503, 459566, 434211, 482941, 477969, 503503, 522849, 463960, 435943]
18973D35943J9770j7790K6913J0770r061l7825O6498M1195k2156j2994k1108N599
18961D85754K9342J0678P8841K0203P4438O7593J61835K58355J43072J10516J7225
18950A457852r4114n7777p9667o6793M68K8230J09809K03720R3408n5047j29865
18939A410224j47015j59898k23962j09085o8138k7960j01415l6257m531K743p3503
18928D61203n3820K2957J4377p917J3034l9534j5698J6573J1328o9449p3839o1818
18916B17397j7619M1598R9269O9670L7248n2488n3767l7795l1958J2619N1389
18905C35563Q321m3144k9640K3513K1729K0151k8257l6854R364K7082N4595L8013
18893D00436J1500L153m8530l5471J7601m2774K3826j5852R895L3436j2540q1052
$$ y = [435943, 455713, 437923, 464836, 475606, 466545, 428720, 495218, 536413, 514257, 501263, 480155, 485754, 515096, 525774, 604615, 624818, 699256, 766849, 928684, 1187039, 1330111, 1440627, 1457852, 1363738, 1305961, 1226294, 1159501, 1159969, 1188199, 1298008, 1501728, 1595136, 1540089, 1410224, 1263209, 1103311, 879349, 770264, 702126, 674166, 572751, 536494, 531963, 534706, 461203, 407383, 430340, 444717, 436800, 449834, 410300, 394602, 411175, 422503, 353054, 279215, 217397, 199778, 241376, 340645, 410315, 447563, 395075, 341308, 303513, 271555, 284174, 335563, 343884, 300740, 271100, 294613, 316342, 336493, 308236, 271382, 280746, 307828, 362423, 400436, 411936, 415089, 366559, 331088, 348689, 305915, 329741, 313889, 323784, 357220, 344680, 263628]
18881B63628M1557N8264M2791l1865l6087j2900q702O410p700M2228K3872J7527
18869C99023l8857m9853l2083L9632O0590m725j9036K2265p9470l2570M1435K6717
18857C33068l9266K82Q993J921j1150M353M2854j3775J192l0213M690j7175K9641
18844C15415L8645R280l7237l1574J1462j0540M7196j5102p8019L8879O7493L5068
18832C90966j9206m7064K8525j0052k5636p212k9399j8885j8312N2046Q686n2807
18820B51650m4491K0668l4961k0604L9934L0887j4155N8144K9736M8484n152m3842
18808C16298j9435J14718o814l3101l06J9722K6154M5339r277n2052k8729J071
18796C73588N2855j1592q137k8089J4878K8777J7299j9336l5199l9495N4901L3176
$$ y = [263628, 305185, 363449, 406240, 374375, 338288, 325388, 316686, 323096, 315396, 357624, 381496, 399023, 360166, 310313, 278230, 317862, 378452, 373727, 354691, 376956, 297486, 264916, 306351, 333068, 293802, 294084, 303077, 304998, 293848, 298201, 341055, 327280, 328472, 298259, 302949, 285774, 315415, 354060, 363340, 326103, 294529, 305991, 295451, 342647, 327545, 249526, 288405, 355898, 390966, 371760, 324696, 353221, 343169, 317533, 310321, 280922, 262037, 243725, 295771, 304457, 251650, 207159, 227827, 192866, 172262, 212196, 243083, 228928, 287072, 316808, 365292, 360140, 316298, 296863, 411581, 404767, 371666, 371360, 391082, 417236, 462575, 453298, 401246, 372517, 373588, 426443, 414851, 406714, 378625, 393503, 422280, 439579, 420243, 385044, 345549, 400450, 433626]
18784D33626j0896j3303O225m7254k8092l8316r659J8279O5451k571L6413J08279
18772E18182O5044O5719J8336M1185O52M5080Q8819P0969J27807M54m6077R654
18760A005824n3167l4630o094n108k5183k9428j3388m151k2239j6975k896J2042
18748H04607n571l4182j5749k0877k0207n1825l4015N3573K7523o0469r1537L1467
18736E82738O7795k3926l4380O7587k8965j13014p1735J4521K7768j7902o552
18725D63935M9563K3745p2441n2431j4249N477l8374p9p478p044l0279k0373N176
18712C05148m6552l5089J8380J4703K0144M4117J36204J39817J34506J37268N0897
18701I19543K2762L0051k611O0356o1660L0261J75512J11977J88898J67516J06330
$$ y = [433626, 422730, 409427, 415652, 368398, 340306, 301990, 292331, 310610, 376061, 373490, 409903, 518182, 583226, 648945, 667281, 708466, 709118, 754198, 843017, 913986, 1041793, 1042247, 996170, 1005824, 952657, 918027, 911933, 906825, 881642, 852214, 838826, 834675, 812436, 795461, 792565, 804607, 799036, 764854, 749105, 728228, 708021, 656196, 622181, 675754, 703277, 642808, 551271, 582738, 650533, 626607, 592227, 659814, 630849, 517835, 446100, 460621, 488389, 470487, 463935, 513498, 537243, 464802, 412371, 398122, 403599, 365225, 365146, 357668, 350624, 320345, 299972, 305148, 258596, 223507, 241887, 256590, 276734, 320851, 457055, 596872, 731378, 868646, 919543, 942305, 972356, 969745, 1030101, 968441, 998702, 1174214, 1286191, 1475089, 1642605, 1748935]
18690A748935M3955K0087m6061o9070l4548R613J3851L7805J3292N9715m7195
18679A750379j19550r2829j10547r0104n7862k4707k1360m4186o8488j21638o5432
18668I33676k9497L6810L6671o236o2316o2908J1499J8254J1539P2125L48m0010
18656I19955n8564m6277M1557j822k4334j6714k1588n754L1755P8448J29583J67860
18644A194105J41685J93172J52983L8574L6020p0732p4598L1314J06071J57136
18634A905730K00133J64404J08460J28618J55432P2724o3834j05966m8128m0085
18624B477488m0054p408j040j7913k6226m8042J0549N1302k9313m6049q1362l6492
18612B205440j8255J8240n7561n2992L514M8091R0760O9777o725l6268n0774K4815
$$ y = [1748935, 1792890, 1812977, 1766916, 1697846, 1663298, 1672911, 1686762, 1724567, 1737859, 1797574, 1750379, 1630829, 1538000, 1427453, 1337349, 1279487, 1254780, 1233420, 1189234, 1120746, 999108, 933676, 904179, 940989, 977660, 971424, 909108, 846200, 857699, 875953, 887492, 959617, 959965, 919955, 861391, 815114, 856671, 854849, 830515, 813801, 792213, 786459, 818214, 896662, 1026245, 1194105, 1335790, 1528962, 1681945, 1720519, 1756539, 1685807, 1611209, 1642523, 1748594, 1905730, 2105863, 2270267, 2378727, 2507345, 2662777, 2735501, 2671667, 2565701, 2517573, 2477488, 2437434, 2430026, 2428986, 2411073, 2384847, 2336805, 2347354, 2398656, 2369343, 2323294, 2241932, 2205440, 2187185, 2205425, 2147864, 2094872, 2098386, 2146477, 2237237, 2307014, 2300289, 2264021, 2213247, 2238062]
18600B238062J01409l341m8178n309Q259M6377P0598j064J0386P2033J09826L2420
18588B631478J5180L0324M1831J08975J34338J55598Q4301O6807N0020j1518K040
18577C309374P8451N6939L4131O0470R7900Q6016O5798O6166K7123L8421K3382
18566C944171M8588Q3733O9694M8829R1064K00419J80538K81854L87072L82292
18556E718254K99565K34976J75787J79306J88913J36129J41770N9081P4972L32594
18546G541347M68043M19737L31389L05383K95733M26750N59957O17551P41344
18537A1707234P24633Q03831R88325J054721J045140J049556J107519J192269
18529A9673228J305969J646223K042620K531371L536692M987335O751634R653664
$$ y = [2238062, 2339471, 2336130, 2287952, 2282643, 2290902, 2337279, 2407877, 2406813, 2417199, 2489232, 2599058, 2631478, 2646658, 2676982, 2718813, 2827788, 2962126, 3117724, 3202025, 3268832, 3318852, 3307334, 3309374, 3387825, 3444764, 3478895, 3539365, 3637265, 3723281, 3789079, 3855245, 3882368, 3920789, 3944171, 3992759, 4076492, 4146186, 4195015, 4286079, 4486498, 4667036, 4948890, 5335962, 5718254, 6017819, 6252795, 6428582, 6607888, 6796801, 6932930, 7074700, 7133781, 7208753, 7541347, 8009390, 8429127, 8760516, 9065899, 9361632, 9788382, 10348339, 10965890, 11707234, 12431867, 13235698, 14224023, 15278744, 16323884, 17373440, 18480959, 19673228, 20979197, 22625420, 24668040, 27199411, 30736103, 35723438, 42475072, 52128736]
18521E2128736J4653589K3900836M0073152N9087243O0187417L5602663J8621652
18514C04255288J3097126Q330567J3634846N734488l506003p942839r881639K3692018
18506C47413852O4584279O4144842L8881598J8597533q799426k0384704j9219572
18499D85218402l1937705l1410358l1111114l5614906k3728078q458899r889036
18492C13068306k7652854l5019712l5669412l7514310l0098469j9516374j2987867
18485A14609308r121303o714304n411729m472904l904791l658763l522806l411544
18477G4391164l228494k832143k401613k194024j855754j516959j292831j182226
18469E7887120j167695j092177r24280o73586J626J117860K569026M372301O888066
$$ y = [52128736, 66782325, 90683161, 130756313, 189843556, 250030973, 285633636, 304255288, 317352414, 325682981, 339317827, 345052315, 341546312, 333603473, 323721834, 347413852, 411998131, 476142973, 515024571, 533622104, 524822678, 504437974, 485218402, 453280697, 421870339, 390759225, 355144319, 331416241, 322957342, 313068306, 285415452, 250395740, 214726328, 177212018, 147113549, 127597175, 114609308, 105488005, 98773701, 93361972, 88889068, 84984277, 81325514, 77802708, 74391164, 71162670, 68330527, 65928914, 63734890, 61879136, 60362177, 59069346, 57887120, 56719425, 55627248, 54702968, 54029382, 54031008, 55148868, 57717894, 62090195, 68978261]
18460F8978261J1453656J9413983K9761820L5576713L1423036K5928257J5902592
18453B38438318p141986k0462147k0879609k1062366r880982J0859008K5571554
18446A95441790K6223797K1371227J2278197j1513761k9050583l1916130l5666770
18439A47167767l2187856k1396328j3348476q945824o343436m841490l927224
18432E6177133l182473k720860k515886k297738k112875k099773j992014j778622
18424C7476892j540447j365460j179449j109639j139307j251361j260020j178733
18416B7452476j187260j118702j041514r35374r01040q88428p25085o35825n28312
18407A9490936m87429l32023l23655l97224m30352m06606m60883m92058m53046
$$ y = [68978261, 80431917, 99845900, 129607720, 165184433, 196607469, 222535726, 238438318, 231296332, 210834185, 189954576, 168892210, 159011228, 169870236, 195441790, 221665587, 243036814, 255315011, 243801250, 214750667, 182834537, 147167767, 114979911, 93583583, 80235107, 71289283, 64945847, 60104357, 56177133, 52994660, 50273800, 47757914, 45460176, 43347301, 41247528, 39255514, 37476892, 35936445, 34570985, 33391536, 32281897, 31142590, 29891229, 28631209, 27452476, 26265216, 25146514, 24105000, 23169626, 22268586, 21380158, 20655073, 20019248, 19490936, 19003507, 18671484, 18347829, 17950605, 17520253, 17113647, 16652764, 16160706, 15707660]
18398A5707660l97934l93045l39262l01802k98710m40042m67077m71550m91278
18389A2106960m37109m02829n01656l94423l35374l52006l13204l55412k47313
18380H767634j69818k35308l63015l40601l21473k96752k06647j89135k41573
18371F403312k16252k09835k55324j91645j55569j53265j32245r4958j13215j60466
18361D720538j51247r7234j26580n5895m5394k5322L4156k6781j03310j56822
18351C966109j95857k02169j96991m5661o331r814m4583k3993q4243j74347j97894
18340B784226j68110j52472m9073j14305j67517j25636j25590r7893r1884j06347
18330A585399j41153j95470j48305m4013N521m7131n2890j1234k497N8860L7056
$$ y = [15707660, 15309726, 14916681, 14577419, 14275617, 13976907, 13536865, 13069788, 12598238, 12106960, 11669851, 11267022, 10765366, 10370943, 10035569, 9683563, 9370359, 9014947, 8767634, 8597816, 8362508, 7999493, 7658892, 7337419, 7040667, 6834020, 6644885, 6403312, 6187060, 5977225, 5721901, 5530256, 5374687, 5221422, 5089177, 4994219, 4881004, 4720538, 4569291, 4472057, 4345477, 4289582, 4244188, 4218866, 4253022, 4226241, 4122931, 3966109, 3770252, 3568083, 3371092, 3325431, 3319100, 3309286, 3264703, 3240710, 3156467, 2982120, 2784226, 2616116, 2463644, 2414571, 2300266, 2132749, 2007113, 1881523, 1783630, 1691746, 1585399, 1444246, 1248776, 1100471, 1056458, 1061979, 1014848, 961958, 950724, 948227, 1007087, 1044143]
18319A044143l0166j91964k41578j06697k454M6631Q4831M0011L9031J30608M7771
18308H60167M5284L8026j1717p052K1307N9830J18765J39550N2936j264k6237
18297A289595m752q162K6097J612r8772q8278j7759rP89l3296m3682k9648N454
18284I99189k8166p9220r2853l3208K2107K0410K20l4233k5923m9928j5057k4618
18272F58720m2281n3262o6984n2666o5237l627J4950K3687Q3692J26129L7053
18261F60174L6369q030j1426q3018n1550n464M6385J10262J30553J21027L7035
18250I82317j214J2501K1740o887j5414K1254m273o6143k616k4567M1656Q318
18238I66672j9369n8676l6463L9135K2604n7957n7115J8962p767l1864o8148p5987
$$ y = [1044143, 1013977, 822013, 580435, 473738, 471284, 517915, 602746, 642757, 681788, 812396, 860167, 905451, 943477, 931760, 924708, 946015, 1005845, 1124610, 1264160, 1317096, 1315832, 1289595, 1284843, 1276681, 1302778, 1304390, 1205618, 1117340, 1099581, 1099572, 1100361, 1067065, 1023383, 993735, 999189, 971023, 891803, 798950, 765742, 787849, 808259, 808479, 774246, 748323, 698395, 683338, 658720, 616439, 563177, 496193, 443527, 378290, 374663, 389613, 413300, 496992, 623121, 660174, 696543, 688513, 677087, 594069, 542519, 537055, 583440, 693702, 824255, 945282, 982317, 981103, 993604, 1015344, 1008457, 993043, 1014297, 1010024, 943881, 941265, 916698, 958354, 966672, 947303, 888627, 852164, 891299, 913903, 855946, 798831, 817793, 810026, 778162, 710014, 634027]
18226F34027q541j06324j6010M7670j5485Q091L3303K2508j0655j7027L9448Q8
18214F11093n1110M7778K2440P188j4007r010l8360K4379K4437k3382l443P0952
18202F68955M0702O9524R8353Q6520K2059K3721M4517O81N8103K9822J5833r1836
18190A066954o3587n5467j7502L3531M0409k1420k903j4969j4145k466K7726r431
18178I66730q3823j38362q8647j6221k6906K4369j8439p749j7710m6357p5669
18167D71216M508L5833j7307M6549J4952L323O9517O586P1724J15838L6264O3391
18155I22394J12259J02448N1054M8885J4048j4698O305k3285L0381O6635N1221
18144A367647K1273k1918m5581p9702k2496k5218m3683p664m0418k859M5608O0805
$$ y = [634027, 625486, 519162, 503152, 550822, 535337, 543428, 576731, 599239, 588584, 571557, 611005, 611093, 559983, 607761, 630201, 637389, 623382, 614372, 576012, 600391, 624828, 601446, 598003, 668955, 709657, 779181, 877534, 964054, 986113, 1009834, 1054351, 1055032, 1113135, 1142957, 1158790, 1066954, 1003367, 947900, 930398, 963929, 1004338, 982918, 980015, 965046, 950901, 948435, 976161, 966730, 882907, 744545, 655898, 639677, 612771, 637140, 618701, 610952, 593242, 546885, 471216, 475724, 511557, 494250, 540799, 555751, 559074, 628591, 635177, 706901, 822739, 859003, 922394, 1034653, 1137101, 1188155, 1237040, 1251088, 1236390, 1242695, 1219410, 1249791, 1316426, 1367647, 1388920, 1367002, 1321421, 1241719, 1219223, 1194005, 1150322, 1142658, 1102240, 1099381, 1144989, 1205794]
18132A205794N6593Q1154P6620Q1619P7994J480R0499N2427R6336Q3215O4284
18121A968015N2968J31947K14654L22455L93443L95718M68466N45524Q35194J190973
18111F519357J720612K439201M062405P394356J3214367J7788504J0588548m94882
18103F3232468m035631j3482596j6748664r372271m747068k525250j444026j016779
18095I860183q39441o65322m86901m23891l92990l68066l05474k33815j80849
18086E963434r6179j28456j48133j89595j93232j56675j98871k57996k64205k41982
18076D088110k44151k33776j46309j46862r0793p5046j16510q4832l1817p4217
18066B843797q6664j7031j28485j12401J624j8002o4232P1994O7260m1036m6070
$$ y = [1205794, 1262387, 1343541, 1420161, 1501780, 1579774, 1581254, 1671753, 1724180, 1820516, 1903731, 1968015, 2020983, 2152930, 2367584, 2690039, 3083482, 3479200, 3947666, 4493190, 5328384, 6519357, 8239969, 10679170, 14741575, 22135931, 35350298, 53138802, 63727350, 63232468, 59196837, 45714241, 28965577, 19593306, 14846238, 12320988, 10876962, 9860183, 9020742, 8355420, 7868519, 7444628, 7051638, 6683572, 6378098, 6144283, 5963434, 5867255, 5738799, 5590666, 5401071, 5207839, 5051164, 4852293, 4594297, 4330092, 4088110, 3843959, 3610183, 3463874, 3317012, 3226219, 3151173, 3034663, 2949831, 2918014, 2843797, 2757133, 2740102, 2611617, 2499216, 2500840, 2482838, 2418606, 2490600, 2557860, 2516824, 2470754]
18055B470754p8607k4122m4579l4441j4536J4088J038J02413J17205P9362K1633
18044B610208m2668o1317j73186j62467p3734l2971k517R1101Q8749P6282J5435
18033B332915J7093p917m9157j00152j13081m165L6619Q1874j9135n2850l3794
18022B088250M1280J7392n4926l7742M633l2874m9686j1300j043K4533J18265
18011B106782N5586M8728P510n1143n6768K052N0928J11562J33187J76410J72334
18000B757168J58632O3178j01703r8312n7445o0250p883J50136J38209R2429L7105
17989C071264p3010j06321q0955m6633k455Q9668J30369K26262K38945K49352
17979C696486J18564L6236N5446L899L4147J00375K15363K79180K84638K51551
$$ y = [2470754, 2392147, 2368025, 2323446, 2289005, 2274469, 2288557, 2289595, 2392008, 2509213, 2588575, 2610208, 2567540, 2506223, 2333037, 2170570, 2096836, 2063865, 2061348, 2152449, 2241198, 2317480, 2332915, 2350008, 2342091, 2292934, 2192782, 2079701, 2075536, 2112155, 2194029, 2174894, 2122044, 2088250, 2129530, 2146922, 2091996, 2054254, 2058887, 2026013, 1976327, 1965027, 1963984, 1988517, 2106782, 2162368, 2211096, 2218606, 2167463, 2110695, 2112747, 2163675, 2275237, 2408424, 2584834, 2757168, 2915800, 2978978, 2877275, 2778963, 2721518, 2661268, 2653385, 2803521, 2941730, 3034159, 3071264, 2998254, 2891933, 2810978, 2764345, 2761890, 2851558, 2981927, 3208189, 3447134, 3696486, 3815050, 3851286, 3906732, 3910631, 3944778, 4045153, 4260516, 4539696, 4824334, 5075885]
17969E075885K23000J38828J26621J52675L28599N08248O83471R96921J247347
17960I481595J824356K521362L598459N445285R104206J5168647K1323672J9987016
17952H8454598R111065p81067r206533j6939188j4249482n664795K221755J0087409
17944F3033762J7217238J7372189P072803l187038j1277352j9875929j8559532
17937E1796141j1419706o438209l813676k426214j502516r13850o66828p76978
17929B3838164q01862q98194r02767p40586m91157l62404k82450k04322j71435
17920A8982987O6849K26550M94764Q71890J126487J589182K252079L308574M824188
17911C3743550P273756J1861159J9598983K8097801K8995008J8483985J0444638
$$ y = [5075885, 5298885, 5437713, 5564334, 5717009, 6045608, 6553856, 7237327, 8234248, 9481595, 11305951, 13827313, 17425772, 22871057, 31975263, 47143910, 68467582, 88454598, 97565663, 96784596, 87578063, 70638875, 56389393, 50724598, 52946353, 63033762, 80251000, 97623189, 104695992, 101508954, 90231602, 70355673, 51796141, 40376435, 33938226, 30124550, 27698336, 26195820, 25281970, 24615142, 23838164, 23036302, 22138108, 21235341, 20494755, 20003598, 19641194, 19358744, 19154422, 18982987, 19049836, 19276386, 19771150, 20643040, 21769527, 23358709, 25610788, 28919362, 33743550, 41017306, 52878465, 72477448, 100575249, 129570257, 148054242, 158498880]
17904A58498880P618531M047595L063853P6270j148180k071798j089108O086052
17896A75082095N632581K314456K500540o93687m868188j0488655j5063894k1749674
17888A32665574k8033213k2811110j4061104q553311n627948m169444l268601
17881D6140843k704954k301159j998315j762539j542109j304099r00228m95871
17873C3131569j16242q5097l14712l99772n78368p33592l84285J66943N75938
17864C1262382R70243J489899K421635M165170P445703J3174451K2016549L0671596
17856A13617628K7911490J1462043k514912j4882492k5760967k0945272q516094
17849H0371424K811416J4040682K3876872K2933317Q092290n604664j7180825
$$ y = [158498880, 166117411, 170165006, 173228859, 173305129, 172156949, 170085151, 168996043, 175082095, 180714676, 183029132, 185529672, 184835985, 179967797, 169479142, 154415248, 132665574, 104632361, 81821251, 67760147, 59206836, 53578888, 49409444, 46140843, 43435889, 41134730, 39136415, 37373876, 35831767, 34527668, 33627440, 33131569, 33015327, 32930230, 32615518, 32215746, 31637378, 30903786, 30519501, 30686444, 31262382, 32232625, 33722524, 36144159, 40309329, 47755032, 60929483, 82946032, 113617628, 141529118, 152991161, 150476249, 135593757, 109832790, 88887518, 80371424, 83182840, 97223522, 121100394, 144033711, 152126001, 146521337, 129340512]
17842A29340512k8413590k5914725j6173989r486574o116925m317486l253355
17835C5663868k639042k139430j793205j459617j191097j074162r89142j008037
17827B3370136j042350r90468p91482p17513o10109m99735n15974n45531m75007
17818A7181967n54453n95430n69115m69474n11736m25613l89831n25484o03922
17809A2536909o00991o20871n43698m09725l24145k67929k88639k91069l16832
17800H873010k37640k32613k40812k16046k06075k38861k02816j77776k22609
17791F897762k40949k70327k21067j99751k49435k18888j18697j51637j65787
17782E061224j52720j88963k25309j24116q3287p0461m904j7916j1753l8043K6333
$$ y = [129340512, 100926922, 75012197, 58838208, 49351634, 43234709, 38917223, 35663868, 33024826, 30885396, 29092191, 27632574, 26441477, 25367315, 24378173, 23370136, 22327786, 21337318, 20545836, 19828323, 19218214, 18718479, 18202505, 17656974, 17181967, 16627514, 16032084, 15462969, 14993495, 14481759, 14056146, 13666315, 13140831, 12536909, 11935918, 11315047, 10771349, 10361624, 10037479, 9769550, 9480911, 9189842, 8873010, 8635370, 8402757, 8161945, 7945899, 7739824, 7500963, 7298147, 7120371, 6897762, 6656813, 6386486, 6165419, 5965668, 5716233, 5497345, 5378648, 5227011, 5061224, 4908504, 4719541, 4494232, 4370116, 4286829, 4216368, 4211464, 4193548, 4181795, 4143752, 4170085]
17771D170085p774j07247j68043j56526j95438k13840j82966r5247k6412m9252
17761B967340K0788q4143j21278j33658k14940j28850q3336j17019p7769o2110
17751A965025p897J7511q6860j24502k2933J3120J6557L4841j2340j03794j32498
17740A556230p4968K876j7363l0323k8335m9262k0522k5161o6909q0948n2101
17729A113214J1374m3673n5991p5277p4403k2646J969l775m7407n8334j09494
17718F35557r2266p7183k8100J1424N8426M6073J7081o7942J6763N2829m2337
17707E30325m3741L0114J9255O459K2519J5142L2276R2855O1537j6565j9662o475
17695G24039n3420k1576m673N1822O4372J5538k3992J9162l3686o1449j7861J5237
$$ y = [4170085, 4162311, 4055064, 3887021, 3730495, 3535057, 3321217, 3138251, 3043004, 3016592, 2967340, 2988128, 2903985, 2782707, 2649049, 2434109, 2305259, 2221923, 2104904, 2027135, 1965025, 1957128, 1974639, 1887779, 1763277, 1740344, 1753464, 1770021, 1804862, 1792522, 1688728, 1556230, 1481262, 1484138, 1466775, 1436452, 1408117, 1358855, 1338333, 1313172, 1246263, 1165315, 1113214, 1124588, 1080915, 1024924, 949647, 875244, 852598, 854567, 850792, 803385, 745051, 635557, 543291, 466108, 438008, 449432, 507858, 553931, 571012, 503070, 519833, 572662, 530325, 486584, 516698, 535953, 542412, 564931, 580073, 612349, 705204, 766741, 750176, 730514, 724039, 670619, 649043, 644370, 696192, 760564, 776102, 752110, 771272, 737586, 676137, 658276, 673513]
17683F73513J1775l0177k2830l7499K8155J3713o8796q5575m5477j6036J5480
17672D36246m2298n4218j3022j5490j36994k7707J03743L5600K9427P9396R8850
17661D93533M2943l8962n6948n6636j4632K553O913O0394Q7480Q9332j2156K5890
17649F29704P236K531n8098O3857N3415k045n432K3048j3610n1333k7000o417
17637F15856k8630M8131L9357Q5129K9632j8049j2001J0899J3717L3892J05706
17626I23639O6342M7462j0388p0765p9731l8310l2811J9593L0844j1889P4609
17615I18595K40638L59467L08364J95297M9363K6117M3896Q0167p9579j70565
17605A971760k21071k68642k85054j35765p4344n3892j060J4541k464k051J15495
$$ y = [673513, 685288, 655111, 632281, 594782, 622937, 636650, 567854, 482279, 436802, 420766, 436246, 393948, 339730, 326708, 311218, 174224, 146517, 250260, 285860, 315287, 394683, 493533, 536476, 497514, 440566, 383930, 369298, 371851, 378764, 439158, 526638, 615970, 603814, 629704, 636940, 639471, 581373, 645230, 698645, 696600, 691168, 714216, 700606, 649273, 622273, 615856, 587226, 635357, 674714, 759843, 789475, 771426, 759425, 770324, 784041, 817933, 923639, 989981, 1037443, 1027055, 956290, 876559, 838249, 805438, 825031, 855875, 843986, 918595, 1159233, 1518700, 1827064, 2022361, 2071724, 2097841, 2141737, 2221904, 2142325, 1971760, 1750689, 1482047, 1196993, 1061228, 986884, 932992, 931932, 946473, 944009, 941958, 1057453]
17594A057453K16295K43172L20714K82613J52773J64330J23891K6677j768O05
17584B586755j60240l29285l15923j60517l7792p543r304M4306J1382o8153p4156
17573A479530q2372q7347k1387j7229o3601m0827p66j0873J8386M1600l4929p768
17561A172417J0638m8652o1669k0808l8882p2796k8820n2943J9667N0749N9689
17550I88590p9243q6179n8911k348N275k5379L0782M2864j5201n801K9214J05536
17538I29199P6595j2549J5024n0499k8406K1358P6762N4462Q2160M4388N466J9394
17526A233354Q2546J77843J64119R8376M8409N3891M9499J5228M5917J27015J28184
17515B224381J9912k3961O098j3522q5435j6696K2271O3318J32397K77348K83765
$$ y = [1057453, 1273748, 1516920, 1837634, 2120247, 2273020, 2437350, 2561241, 2587918, 2586150, 2586755, 2426515, 2097230, 1781307, 1620790, 1582998, 1575455, 1566151, 1610457, 1621839, 1553686, 1479530, 1397158, 1309811, 1288424, 1271195, 1207594, 1166767, 1166001, 1155128, 1173514, 1215114, 1180185, 1172417, 1183055, 1134403, 1072734, 1051926, 1013044, 940248, 911428, 858485, 878152, 928901, 988590, 909347, 823168, 764257, 761909, 767184, 741805, 772587, 815451, 800250, 794449, 823663, 929199, 1005794, 993245, 1008269, 957770, 929364, 950722, 1027484, 1081946, 1164106, 1208494, 1213960, 1233354, 1315900, 1493743, 1657862, 1756238, 1804647, 1858538, 1908037, 1923265, 1969182, 2096197, 2224381, 2244293, 2220332, 2226430, 2212908, 2127473, 2110777, 2133048, 2196366, 2328763, 2606111, 2889876]
17504B889876J40852o1673j91017k30252j84099p6057l7817j5870j05J40471K80334
17493B654643K53491P4223p723j71997k52630j27496j1997J33309K92198L60803
17483C196824K44291O1067n8443j88261k14278o9022J57340K07586L34154M35315
17473D106573O10065O46598N20049K38416L9751j45694j80248n7465R4170L10087
17463F182302L92844L15840L14202K94477K19906L52017M81520P49807R97989
17454A0300904J366527J971181K665103L832667N696002Q776801J4670132K3746725
17446G3026042K9839368K0881708N705481k010305j3292379j4453871K156090
17439A01852134K0017411K6218837J1482755m782624j5316829l1201305l0976742
$$ y = [2889876, 3030728, 2969055, 2778038, 2547786, 2363687, 2287630, 2249813, 2233943, 2233838, 2374309, 2654643, 2908134, 2982357, 2974634, 2802637, 2550007, 2422511, 2410514, 2543823, 2836021, 3196824, 3441115, 3502182, 3443739, 3255478, 3041200, 2972178, 3129518, 3337104, 3671258, 4106573, 4716638, 5363236, 5883285, 6121701, 6161452, 6015758, 5835510, 5778045, 5872215, 6182302, 6575146, 6890986, 7205188, 7499665, 7719571, 8071588, 8553108, 9302915, 10300904, 11667431, 13638612, 16303715, 20136382, 25832384, 34609185, 49279317, 73026042, 102865410, 123747118, 129452599, 127442294, 114149915, 99696044, 101852134, 121869545, 148088382, 159571137, 154788513, 139471684, 108270379, 77293637]
17432G7293637j8920701j0655622o362034m157209k940811k130486j482461j114712
17424B9529601q33468p38587o81484o76028p87765q87103p12302n16230m54929
17415B3241705j82551k0355R705J71727J98147L20988N68284J090740J803076
17406B7201466K766001M155571O113716R279467J5126125K4501676L3218562L0785698
17398A53148282K3214499K2709637Q612548q299083j899281N566135Q007075J0331151
17390B21390963J3982582J5416745q158592k7311660k7589662l6225525l7322058
17383A14182793k4371997j4415721r181721o398318m883050l778654l041454k493149
17375D5618729j996603j810630j716494j579855j391106j220315q28635m98035
$$ y = [77293637, 58372936, 47717314, 41355280, 37198071, 34257260, 32126774, 30644313, 29529601, 28696133, 27957546, 27276062, 26600034, 25812269, 24925166, 24212864, 23696634, 23241705, 23059154, 23038799, 23048504, 23220231, 23418378, 23739366, 24307650, 25398390, 27201466, 29967467, 34123038, 40236754, 49516221, 64642346, 89144022, 122362584, 153148282, 176362781, 199072418, 207684966, 199385883, 197486602, 203052737, 211059812, 221390963, 235373545, 250790290, 242631698, 215320038, 187730376, 151504851, 114182793, 89810796, 75395075, 66213354, 59815036, 54931986, 51153332, 48111878, 45618729, 43622126, 41811496, 40095002, 38515147, 37124041, 35903726, 35075091, 34577056]
17367C4577056l20472q9081l2338l1244k14670m94754n42562l88708k46354L29414
17357C2546287J236998K235036L542480N570835R370299J5679933K2774363K1624460
17349A14580691Q980935J115639n472215j2347767k714655J3358798K5002327
17342A42503753K2272076J1767405J1596603J2609403J7216158K4085630K5458589
17335B67509617K5544504L125949j8286314j3754311j0204928m781384J791682
17328B50944815N647069L486956j9286673l1583154l0035724l4549205l0187712
17321A14436372j9174384j2005892p979652n613196m366525l836332l359131k913747
17313E5187513k634262k361553k078714j813061j649441j540097j261877j037430
$$ y = [34577056, 34256584, 34167503, 34135165, 34103921, 33889251, 33394497, 32851935, 32463227, 32216873, 32546287, 33783285, 36018321, 39560801, 45131636, 54501935, 70181868, 92956231, 114580691, 123561626, 124677265, 119205050, 106857283, 104142628, 117501426, 142503753, 164775829, 176543234, 188139837, 200749240, 217965398, 242051028, 267509617, 293054121, 296180070, 277893756, 264139445, 253934517, 249153133, 250944815, 256591884, 260078840, 240792167, 209209013, 179173289, 144624084, 114436372, 95261988, 83256096, 75276444, 69663248, 65296723, 61460391, 58101260, 55187513, 52553251, 50191698, 48112984, 46299923, 44650482, 43110385, 41848508, 40811078]
17305D0811078q97466r17649q80406r28379r99524q73452o42919m24927L73N15349
17295C4762078J196110J779387K621910M046905O214674J0150852J7318054K7984430
17287A06074400L6770134L3835443K8573230K3792577k14790j4977073q653552
17280B05200369o009684J139016O237132Q637731K513463j9829645k7759735k7303677
17272A42824970l0931386k4225230j4726273r046205o125427m601574l683021
17265D9485854l180651k819746k411196k058900j884577j682654j609688j588845
17257C2249597j612113j409042j237351j162043j102784j038486r98155j108911
17249B2580712r78768q38895q21242p86800p92742p21829o19359n18659m47653
$$ y = [40811078, 39913612, 38995963, 38115557, 37187178, 36187654, 35314202, 34671283, 34246356, 34246729, 34762078, 35958188, 37737575, 40359485, 44406390, 50621064, 60771916, 78089970, 106074400, 142844534, 176679977, 205253207, 229045784, 228830994, 213853921, 205200369, 199190685, 200329701, 206566833, 215204564, 217718027, 197888382, 170128647, 142824970, 111893584, 87668354, 72942081, 63895876, 57770449, 53168875, 49485854, 46305203, 43485457, 41074261, 39015361, 37130784, 35448130, 33838442, 32249597, 30637484, 29228442, 27991091, 26829048, 25726264, 24687778, 23689623, 22580712, 21601944, 20763049, 19941807, 19155007, 18362265, 17640436, 17021077, 16502418, 16054765]
17240A6054765n38803m85011m16789m05314l42122k95914j99362j80135k56632
17231A2934683l33646l46627k21662k61510l19402l01830l90157m26473m06817
17222I926559l90542l27260k77724k71018j99510l07797k83592l12040k88077
17213G268999k01795k50708k75671k11757j84592k37399j37084l7424j70087k07302
17203E355180p3839o5493o8140o0590K7356K4463m2997n5965k584l6816j21821
17192D878754p8106M0648J01051J6852n6008j13715j30783j47435k28131k83522
17182C999605k10053j76170j18226q4228p6788p5906p3020K0982K6823N8659o3621
17171C228057p3300O3799M8556K9087j09480k5318L918k5786r7470k13387q6147
$$ y = [16054765, 15515962, 15030951, 14614162, 14208848, 13866726, 13570812, 13371450, 13191315, 12934683, 12601037, 12254410, 12032748, 11771238, 11451836, 11150006, 10759849, 10333376, 9926559, 9536017, 9208757, 8931033, 8660015, 8460505, 8152708, 7869116, 7557076, 7268999, 7067204, 6816496, 6540825, 6329068, 6144476, 5907077, 5769993, 5732569, 5562482, 5355180, 5281341, 5215848, 5147708, 5087118, 5114474, 5138937, 5095940, 5039975, 5037391, 5000575, 4878754, 4800648, 4841296, 4942347, 4959199, 4903191, 4789476, 4658693, 4511258, 4283127, 3999605, 3789552, 3613382, 3495156, 3410928, 3334140, 3258234, 3185214, 3206196, 3233019, 3291678, 3228057, 3154757, 3218556, 3267112, 3296199, 3186719, 3161401, 3165319, 3139533, 3042063, 2828676, 2742529]
17160B742529j6798m6317j5229K3266k8445m7218j00487j5498N4012K1412n34
17149B570693j31646j07695o8025m6972N9876R1645K52861K42973Q1977M1509
17139B987196R160j25113j07720j23090o7454J4844R9205J08836J06078R3916
17129B995858M3046O4350n7139k01950j07226l4795l8891O2320J48091J44681
17119C018345P3287N5209l8858r1726m7686j2740r9816l4693Q8124N1210P7806
17108C038462O3844J0223p613p1912m0071M5433Q8778J12290O2099J62179K96032
17097C759744L66258L89197L25892K68430K45231K65273K98524L78373K68065
17088F564987R9984P7547O7453J66330L63740N03906O08446N68216O32739R76405
$$ y = [2742529, 2725731, 2679414, 2664185, 2687451, 2659006, 2611788, 2511301, 2495803, 2549815, 2571227, 2570693, 2439047, 2331352, 2263327, 2216355, 2276231, 2367876, 2620737, 2863710, 2945687, 2987196, 2996356, 2871243, 2763523, 2640433, 2572979, 2587823, 2687028, 2795864, 2901942, 2995858, 3038904, 3103254, 3046115, 2844165, 2736939, 2702144, 2663253, 2725573, 2873664, 3018345, 3091632, 3146841, 3107983, 3016257, 2968571, 2955831, 2856015, 2821322, 2909446, 2960656, 3038462, 3102306, 3112529, 3104916, 3033004, 2992933, 3038366, 3127144, 3239434, 3301533, 3463712, 3759744, 4126002, 4515199, 4841091, 5109521, 5354752, 5620025, 5918549, 6296922, 6564987, 6664971, 6742518, 6809971, 6976301, 7340041, 7843947, 8452393, 9020609, 9653348, 10629753]
17078A0629753J487460J869915K120420K423750K996962L867995N391335P948091
17070C8735681J2671727K1496020L5785771M9784746M5344180K3535955J2371194
17063B39725274O393682K432479M184265p759566j9026814l3189951m7145583
17056A45613786l7011224k0164259r939938m231359m30337K684375O523460J2572930
17048I5617434K3350731M1750277O4550431P0105103M3758577J9854937J0061790
17041C69049280j27235K445825p341101k5317770m0670291o5124857o3820643
17034A69093208m0180492k2782115j3725893r155407o836020n580244m645172
17027F6187865l938573l350854l040812k860344k563878k301492k095354j907314
$$ y = [10629753, 12117213, 13987128, 16107548, 18531298, 21528260, 25396255, 30787590, 38735681, 51407408, 72903428, 108689199, 158473945, 203818125, 227354080, 239725274, 246118956, 248551435, 252735700, 244976134, 225949320, 192759369, 145613786, 108602562, 88438303, 78498365, 74267006, 73836669, 76521044, 83044504, 95617434, 118968165, 160718442, 225268873, 295373976, 339132553, 358987490, 369049280, 368922045, 371367870, 364026769, 338708999, 298038708, 232913851, 169093208, 128912716, 106130601, 92404708, 83249301, 76413281, 70833037, 66187865, 62249292, 58898438, 55857626, 52997282, 50433404, 48131912, 46036558, 44129244]
17019D4129244j847208j766767j667661j615925j616367j486253j298009j252326
17011C1578728j218479j105188r99355r08783q73822p53306p17040p22724q16702
17002B3463329q58291p59863o40136o36898n73501n47617n08931n25199m20211
16993A7992682n02862n03348l96297k81703k37512j56117j16622p394J02075O5964
16983A5958866j84955l03068m26447m99645l59544r7237J89028L40396L19742
16974A4937136L25848L89083J14504J2382J44060K68704M58979Q01837J113448
16965A8565981J479432J692894J760995K010542K714911L947836O169737R809640
16957D8151968J6585883K9592165N1646405P2577363N7840540J2563139j0570225
$$ y = [44129244, 42282036, 40515269, 38847608, 37231683, 35615316, 34129063, 32831054, 31578728, 30360249, 29255061, 28255706, 27346923, 26473101, 25719795, 25002755, 24280031, 23463329, 22605038, 21845175, 21205039, 20568141, 19994640, 19447023, 18938092, 18412893, 17992682, 17489820, 16986472, 16590175, 16308472, 16070960, 15914843, 15798221, 15790827, 15892902, 15958866, 15773911, 15470843, 15044396, 14544751, 14185207, 14087970, 14276998, 14617394, 14937136, 15262984, 15652067, 15766571, 15778953, 15923013, 16191717, 16650696, 17452533, 18565981, 20045413, 21738307, 23499302, 25509844, 28224755, 32172591, 38342328, 48151968, 64737851, 94330016, 145976421, 218553784, 276394324, 288957463, 278387238]
16950B78387238m0832564o6096571m3422017j8407676k508826J1112116K8951411
16943A47183111N3157137O7370038L9231941p65662j9258111n3026170o1153132
16936A72739152l1520957n584411J6665300L8058709M1906392J4146387p073298
16929B39337274k1653520m6592229l9854354k0142588p560837J852006J3009058
16922A18394810K8837396M4530682L7028077N192419j1449416l1166318n1355041
16915A40012609l7158628k0466095j1721562p323229n072954l785181l039163
16908E1445797k421052k103098k187479k337449k325899k252481k086154j695496
16900C4036689j368871j089804p97135p88388j000496j047215j247261j331890
$$ y = [278387238, 237554674, 171458103, 128036086, 109628410, 107119584, 118231700, 147183111, 200340248, 267710286, 306942227, 306176565, 286918454, 233892284, 172739152, 141218195, 135633784, 152299084, 190357793, 232264185, 246410572, 239337274, 217683754, 171091525, 131237171, 111094583, 103533746, 105385752, 118394810, 147232206, 191762888, 228790965, 233983384, 222533968, 191367650, 140012609, 102853981, 82387886, 70666324, 63343095, 58270141, 54484960, 51445797, 49024745, 46921647, 44734168, 42396719, 40070820, 37818339, 35732185, 34036689, 32667818, 31578014, 30780879, 29992491, 28991995, 27944780, 26697519, 25365629]
16892B5365629j245849j056562r22337q21294o43248m60775l69012k34996l16265
16883A9295291m07687m33610o65479p69520p02989o23296n74379m72066l22849
16874A4323416l86844m38993m61243m14359m49986m45849l82468l51000m69588
16865A0523086l95189l40938l24102l16993k62171k93789l44986l30152k93529
16856G621237k64128j02895O9961j1174j09958k26371k64400j66777l2690J0906
16846F523711J1283L5345j5107J24756K30500J03132M5648p7260j67638k12190
16836F602180r6191K1911K1958R2959l133j68386k61860k47559l41573l57736
16826E262570k94439k50743l13374k70260l7018p172j2395j33855j54750k25121
$$ y = [25365629, 24119780, 23063218, 22140881, 21319587, 20676339, 20215564, 19846552, 19611556, 19295291, 18887604, 18453994, 17788515, 17018995, 16316006, 15692710, 15118331, 14646265, 14323416, 13936572, 13497579, 13036336, 12621977, 12171991, 11726142, 11343674, 10992674, 10523086, 10127897, 9786959, 9462857, 9145864, 8883693, 8589904, 8244918, 7914766, 7621237, 7357109, 7254214, 7324175, 7313001, 7203043, 6976672, 6712272, 6545495, 6512805, 6523711, 6534994, 6570339, 6555232, 6679988, 6910488, 7013620, 7059268, 6982008, 6814370, 6602180, 6505989, 6527900, 6549858, 6642817, 6639684, 6471298, 6209438, 5961879, 5620306, 5262570, 4968131, 4717388, 4404014, 4133754, 4096736, 4089564, 4077169, 3943314, 3788564, 3563443]
16816C563443k36830j29125j20306j07107j52434j06699p0749o4540m2075j02758
16806B430820o5765l9174o2128n9531p1349l3532O151R500l8565l8726j01687
16795A936014j26555K4724M9131J54090J43549R8755J62799J23790r831q0015
16785B476451m6102q4775p1120K6888L4575n8090j28183k03212k74331k57383
16775A414718k09574j59462j06511q7440l2685o0526q0732j11467j60962j07559
16765B97800j48553o9116O6225J17680J88229J73665M7509P9983N044m2873j11282
16754F04311j50677j44822o608R1549N8095R8027O8685L6163j18627j13430r5600
16743C27066r6165O5857J09900Q1698P4184M7808L7850l1507p9539j5390r5736
$$ y = [3563443, 3326613, 3197488, 3077182, 2970075, 2817641, 2710942, 2640193, 2575653, 2533578, 2430820, 2365055, 2325881, 2263753, 2204222, 2132873, 2099341, 2105492, 2114992, 2076427, 2037701, 1936014, 1809459, 1834183, 1883314, 2037404, 2180953, 2279708, 2442507, 2566297, 2556466, 2476451, 2430349, 2345574, 2274454, 2301342, 2335917, 2277827, 2149644, 1946432, 1672101, 1414718, 1205144, 1045682, 939171, 851731, 819046, 758520, 677788, 566321, 405359, 297800, 149247, 80131, 146356, 264036, 452265, 625930, 673439, 753422, 758466, 715593, 604311, 453634, 308812, 302204, 393753, 451848, 549875, 618560, 654723, 536096, 422666, 327066, 230901, 296758, 406658, 488356, 562540, 610348, 648198, 616691, 537152, 521762, 426026]
16732D26026j59550N177J02580M4487P2991Q9163N3042o691r058n951l5492q2122
16720D94602k0270L1436J7338m5120K0405O7865N5603K439k2442p0324k1053J4930
16708E25409m9463L792M3202m7077K6270n130L6065L4220j3928L6529q9168p1070
16696D29651M1609N7493N467L1986r870l8721m9323J1914N7538M1392J998m465
16684E76669J7534M4632j3807o1923k7417Q53O1415M9671m1085n3588j95M4867
16672E97626O372k6429j2309J237j0379n7647p7894j6103k60k1313j5351j3777
16660C53773m6474n5732o149k4546j0700R257k0845l4892k753P16N36L4904M3907
16647B41002O3260q90l0336n4914m2432K111R4906M019n1505l0996l3227M7918
$$ y = [426026, 266476, 271653, 374233, 418720, 491711, 580874, 633916, 627225, 618167, 612216, 576724, 494602, 474332, 505768, 523106, 477986, 498391, 566256, 621859, 624298, 601856, 531532, 510479, 525409, 475946, 479738, 522940, 475863, 502133, 497003, 533068, 567288, 553360, 589889, 500721, 429651, 471260, 528753, 534220, 566206, 556336, 517615, 468292, 480206, 537744, 579136, 581134, 576669, 594203, 638835, 625028, 563105, 535688, 536541, 597956, 647627, 606542, 552954, 552759, 597626, 603998, 577569, 565260, 566497, 556118, 498471, 420577, 404474, 404214, 382901, 367550, 353773, 307299, 251567, 245418, 220872, 210172, 219429, 198584, 163692, 160939, 161655, 162191, 197095, 241002, 304262, 303372, 273036, 218122, 175690, 177801, 272707, 276726, 225221, 194225, 160998, 208916]
16635B08916J3054o3809o8787j7237m1092J8415K3284J33J1855J5626N274j9828
16623H5804l3975J262J0226m6669J3464J0744l0195p155L3854l5755l7254J785
16611c3864Q4251J04154k9543p2361K923o91J5768j2840K6891K3378L4482J7902
16599A60450l2313M3379N3856O5377j1425k3334K3948j8912j6239j4092m7022
16588A83673n1397L449M5693J6793l3896P197N6455N8864o6665p1624j9287J1101
16576A40356r312L0885O0092N2041J3011J6652l7979J2794L7348K5001m5249o8344
16564B27296n764L5599J0074J9509K9363j4602l7532K0046M3468q4707j10304
16553A32446p7400j8523K5741J9378J1704N8467M7216L8785L7776n7567l9675
$$ y = [208916, 221970, 158161, 89374, 72137, 31045, 49460, 72744, 72877, 84732, 100358, 105632, 85804, 51829, 53091, 63317, 16648, 30112, 40856, 10661, 3506, 37360, 1605, -35649, -33864, 50387, 154541, 124998, 52637, 55560, 54869, 70637, 57797, 84688, 108066, 142548, 160450, 128137, 171516, 225372, 290749, 279324, 255990, 279938, 261026, 244787, 230695, 183673, 132276, 135725, 181418, 198211, 164315, 171512, 227967, 286831, 220166, 148542, 129255, 140356, 131044, 161929, 222021, 274062, 287073, 303725, 265746, 278540, 315888, 340889, 295640, 227296, 221532, 257131, 267205, 286714, 316077, 301475, 263943, 283989, 327457, 242750, 132446, 55046, 36523, 62264, 81642, 93346, 151813, 199029, 237814, 275590, 218023, 178348]
16542A78348o129L2335j0753n0974l6888n0047k0621J5216O3290N5607j6408k5625
16530A27351o1027o2041J4856J4774K0744R814J416L5020L4945n045k9728K638
16518A03717N6933J4934M629Q3727J55835K53720L63538K82331J52466J69434
16508A641264P8160J3879n389o906r6480k18929l24434l51511k21858k6836J8551
16497D99511l2390n3585K4776M3024L9546R1641K22095L00540L16878J71012P8864
16486A701912J5771L8013N179r6705k44072l14493l50213j99950m6169n4858n3911
16475D00504l2403n8293l3846j5724j9874l5500l0276L7721O5198L7953o3588
16464B51872L7501K5190k5897m0101p8624o3325r135j2759k1606K9586J7005Q476
$$ y = [178348, 172219, 204554, 193801, 142827, 105939, 55892, 35271, 50487, 113777, 169384, 152976, 127351, 66324, 4283, 19139, 33913, 54657, 64471, 65887, 100907, 135852, 130807, 101079, 103717, 160650, 175584, 180213, 263940, 419775, 673495, 1037033, 1319364, 1471830, 1641264, 1719424, 1733303, 1727914, 1721008, 1624528, 1405599, 1081165, 729654, 507796, 480960, 499511, 467121, 413536, 438312, 481336, 520882, 612523, 834618, 1135158, 1452036, 1623048, 1701912, 1717683, 1755696, 1760875, 1664170, 1420098, 1105605, 755392, 555442, 509273, 454415, 400504, 368101, 309808, 275962, 260238, 240364, 204864, 174588, 212309, 277507, 315460, 251872, 289373, 314563, 288666, 248565, 169941, 106616, 97481, 84722, 63116, 92702, 109707, 118183]
16452A18183l0453p622Q568N4141M4140K3594k9659j874n4956n2538K0427O93
16440I2644j5424L7332J8127k7565K5320J2576k4850l7014r744l9884o9463J6117
16428b1828N1675K5846N3096K1652K6516m096j4340m1139n0795j7708K6853j3676
16416D2056J5686k6038L3810M0525K4590n7154j10902q6429N089P2922Q3315N8929
16404I6399M7852L285J4673N4286J09711J50172K75405L54179J48243l1003n8094
16393A165108k39903k96968j19360l9613L8035J32041J52584L09280L20903N1019
16383A473126p2497j77778k58498j24502j4349M5092J60736K73549J74519K4222
16373A503620j39743k69201k94788j20759m4837o9131J3181K11099K34969K44751
$$ y = [118183, 87730, 80108, 88676, 142817, 186957, 210551, 180892, 179018, 124062, 71524, 91951, 92644, 77220, 114552, 132679, 105114, 130434, 143010, 118160, 81146, 71402, 31518, -37945, -21828, 29847, 55693, 108789, 130441, 156957, 152861, 138521, 97382, 46587, 28879, 55732, 42056, 57742, 31704, 65514, 106039, 130629, 73475, -37427, -123856, -118767, -45845, 37470, 96399, 144251, 147536, 162209, 216495, 326206, 476378, 751783, 1105962, 1254205, 1223202, 1165108, 925205, 628237, 508877, 469264, 507299, 639340, 791924, 1101204, 1422107, 1473126, 1400629, 1222851, 964353, 839851, 825502, 870594, 1031330, 1304879, 1479398, 1503620, 1363877, 1094676, 799888, 679129, 634292, 565161, 578342, 789441, 1024410, 1269161]
16363A269161J03096r374j33389l20101k97878j77847o8556J8527J6096m8152
16353C51583j1719n3133k4651m8426j5310o983P165p6843j6075M7297J2432l8300
16341A27037r447J124m4363p880j6703k681R98N5352J9781j3896M3049j3140M8280
16328A87511N1618k1847k5854J4374N0650P3783M5484o601P167n043L1204m0182
16316C62264k8861l8313R183M721n8621k9660l3311k5035m3243j1161N5727j3584
16304A50106k6955O8884M304L188K1369J060N7731O9870M2982J1361m5734m4167
16292C13999L2894o6436p5506n6005k0798l0721j2972J1062J1344l3504j4453
16281E8904j9152J4039o2776o5181L3834J2420O4942l295n5137p2576l4456N0946
$$ y = [1269161, 1372257, 1362883, 1229494, 909393, 611515, 433668, 365112, 383639, 399735, 351583, 339864, 286731, 262080, 213654, 198344, 191361, 198526, 121683, 105608, 152905, 165337, 127037, 117590, 118714, 74351, 66471, 49768, 47087, 48085, 103437, 123218, 109322, 152371, 139231, 187511, 239129, 217282, 191428, 205802, 256452, 330235, 375719, 369118, 376285, 371242, 402446, 362264, 333403, 295090, 304273, 308994, 250373, 220713, 187402, 162367, 119124, 107963, 163690, 150106, 123151, 192035, 196339, 199527, 220896, 221956, 279687, 349557, 392539, 403900, 358166, 313999, 346893, 280457, 204951, 148946, 128148, 97427, 84455, 95517, 106861, 73357, 58904, 39752, 53791, -8985, -74166, -40332, -27912, 37030, 33735, -21402, -93978, -128434, -77488]
16269g7488K3626k8213r234K5585J3472m581N7896N7500j2733n5689K9581M6491
16257F6213P8739l4122o9267l1512J6312j777k8381n6504K656J4687j5237K3476
16245c4717j3774o9052n3931L2524N9905K6553k4953j2854m8718O331R9091O2490
16233B8895R26J4924q800q729J5670j5972m7284m5592K4052K9768m3482j8441
16221g4065o242r958K7657L7692J0367N0909l6168l9023j4174o846M8896J6207
16209E252l4540j1622j4102j1364k2101L4394l902K8594O3473k131m4905p6697
16197h9651m4133M6123R1054m0178l8864J7833k5933j9039k7897k5490N9556O2216
16185c4403J0832J2645P4002l0951m3143K6590P300K4647j353k3713k625n94R354
$$ y = [-77488, -53862, -82075, -91309, -65724, -52252, -56833, 1063, 58563, 45830, -9859, 19722, 66213, 144952, 110830, 41563, 10051, 26363, 24586, -3795, -60299, -57643, -42956, -58193, -34717, -48491, -117543, -171474, -138950, -79045, -52492, -77445, -90299, -139017, -132686, -33595, 28895, 29821, 44745, 35945, 27216, 42886, 26914, -20370, -65962, -41910, -12142, -55624, -74065, -80307, -90265, -62608, -24916, -14549, 36360, 192, -38831, -53005, -59851, -10955, 5252, -29288, -40910, -55012, -66376, -88477, -54083, -57985, -29391, 34082, 31951, -12954, -89651, -133784, -87661, 3393, -36785, -75649, -57816, -83749, -102788, -130685, -156175, -96619, -34403, -23571, -10926, 63076, 32125, -11018, 15572, 22872, 47519, 46166, 22453, 19828, 19234, 28588]
16172B8588n1784m6585L837M5067L0194n1280l5461J3761L7964L1825k6982k1923
16160d2779J3132p104j7831J0130j6161j4807K6640J8900N2694k34o1892j3102
16148e2414j9025m6827L325M5903L6385j1901l2196K1932K4439l8044K5293o876
16136e0006o43q397J4427J0739j5434l865J3333O427J1782P796n4503k5919l0656
16123a24919L7591K4653j3166k1383J7694K2587k1013K6582J15484l2814n7897
16112b6601m6205r51J856k369Q404j0071k7083K1651N679n95r725j0865L869o7879
16098a60885m7706N9903N9292o8588j5295J3681N2029O0741M6157l2310K357m7374
16086g7998k8543o0772j9864L2211N9198l8234m6348L6723M4599R414m3120o1369
$$ y = [28588, -23196, -69781, -65944, -20877, 9317, -41963, -77424, -63663, -25699, 6126, -20856, -42779, -29647, -36751, -54582, -44452, -60613, -75420, -48780, -29880, 22814, 22580, -39312, -52414, -71439, -118266, -114941, -69038, -32653, -44554, -76750, -54818, -30379, -68423, -43130, -50006, -50649, -59046, -44619, -33880, -49314, -53179, -39846, -33419, -21637, -13841, -68344, -94263, -124919, -87328, -62675, -75841, -97224, -79530, -56943, -77956, -51374, 64110, 31296, -26601, -72806, -73757, -71901, -74270, -65866, -75937, -103020, -81369, -75690, -76285, -86010, -96875, -93006, -160885, -208591, -148688, -89396, -157984, -173279, -159598, -107569, -46828, -671, -32981, -30624, -77998, -106541, -167313, -187177, -154966, -95768, -134002, -180350, -143627, -99028, -89614, -132734, -194103]
16074a94103p786O1225L6292M5066N1625p441m4018P296m420j8812K0612j3572
16062f8036m3593n939L9068O323j1479m1572j7478J1775n8858L8675L7322R692
16050a04100J5266M1411k006m2558p316p3154o052M1013L2978J5913J8663J5462
16038e4480m733k7521j7540n7050o181L1128L7627M6114p449L351M8725J3683
16026E674K650J7681j603m0853r4351q8681N1674J07344j3044m7553m1427j099
16014a43588K5883m5491K0631L9645j3351J966J0228N9418K6396N1152n5170k7587
16002d9868j913n362M0240K3151m130J6245j1888l3207m9001j9610O798j175M8315
15989d1405j2640m8408l5804j162N4233K2358j3951J3016m8991K860L0654k0492
$$ y = [-194103, -201889, -140664, -104372, -59306, -7681, -15122, -59140, -51844, -56264, -75076, -54464, -68036, -111629, -117568, -78500, -72177, -83656, -125228, -142706, -130931, -189789, -151114, -113792, -104100, -88834, -47423, -49429, -91987, -99303, -172457, -178509, -137496, -104518, -88605, -69942, -54480, -59213, -86734, -104274, -161324, -167505, -136377, -98750, -52636, -60085, -56734, -8009, 5674, 8324, 26005, 24402, -16451, -110802, -199483, -147809, -40465, -53509, -101062, -142489, -143588, -117705, -163196, -142565, -102920, -116271, -114305, -104077, -44659, -18263, 32889, -22281, -49868, -51781, -57143, -16903, 6248, 2118, 18363, 6475, -26732, -75733, -95343, -88545, -89720, -41405, -54045, -102453, -138257, -139419, -85186, -62828, -76779, -63763, -112754, -109894, -79240, -99732]
15977i9732J4104M5620k9584K646J8031J4955L7247J2894Q500l6758m2809k7416
15965h2302l9981k8332P9879P2499J1637m6464o2461N892K0737k2772K6892M0838
15953b3938M547M1778J7747j6001k9796l3356K8540P6678K5495j0350n4544k4993
15941A807j3530j6884q969K6599J5977M849Q113L756N8192k8382n7128o007l0295
15928d1902J4217k1854N121K300n2146k437L1059l5191j1800L7592M203J7807
15916e3031j906l9315j0366m050M5337L6164J0061m7212k0239J8005J1015j1534
15904f7071J4838J8307R852j6343k637r386j3253j959M4705N6213l2099o0873
15892e9706k6389q382k3764L9436r748l2622o8552l5333L1706Q3935P6731L164
$$ y = [-99732, -85628, -40008, -69592, -66946, -48915, -33960, 3287, 16181, 24681, -12077, -54886, -82302, -122283, -150615, -70736, 1763, 13400, -33064, -95525, -89633, -68896, -91668, -64776, -23938, -19391, 22387, 40134, 24133, -5663, -39019, -10479, 66199, 91694, 81344, 26800, 1807, -11723, -28607, -37576, -10977, 5000, 9849, 17962, 21718, 79910, 51528, -5600, -11607, -41902, -27685, -49539, -44418, -42118, -94264, -96701, -65642, -100833, -112633, -75041, -70838, -53031, -54937, -94252, -104618, -108668, -63331, -27167, -17106, -64318, -84557, -66552, -55537, -67071, -52233, -33926, -24074, -40417, -43054, -52440, -65693, -67652, -22947, 33266, 1167, -59706, -86095, -94477, -118241, -78805, -88553, -121175, -189727, -225060, -193354, -109419, -32688, -29524]
15880b9524O7778M289j1928l5151m2299R472K3624n682J5976m161l7719l0526
15868g5851N3991L0613K629J6379K7953K364m4001o9771O561o038K462J3878K9764
15855i067J2172m3616j5585J2495J6496P921O249p235n1637J2340L7642K9874
15843H049M6861m308n8054m5198L0787n688l6145o2272Q917j6496L8953J08752
15831A4158q224n3408J6972n5596M7629K5476k4046j1O270l8396l0345n0485P8646
15818g1360L2557K5499J5452J1695J4809l5426j00319K6535m6642j5453K6721
15807a15932J2296O251p8800L5512K2570j5667L7907O5891J3355K7841n187k8239
15795b2202o8417l3070J6132Q89o6508K886R2589K2291M0373j4138q839M8589
$$ y = [-29524, 38254, 42543, 30615, -4536, -46835, -37363, -13739, -19421, -3445, -7606, -45325, -75851, -21860, 8753, 11382, 27761, 55714, 58078, 14077, -55694, -49133, -55171, -52709, -38831, -9067, 3105, -40511, -56096, -43601, -27105, -19184, -12935, -20170, -71807, -59467, -21825, 8049, 54910, 50602, -7452, -52650, -21863, -27551, -63696, -125968, -117051, -133547, -94594, 14158, 5934, -47474, -30502, -86098, -38469, -12993, -37039, -37050, -30780, -69176, -99521, -150006, -71360, -38803, -13304, 2148, 13843, 28652, -6774, -107093, -80558, -127200, -142653, -115932, -103636, -97385, -176185, -140673, -118103, -133770, -95863, -29972, -16617, 11224, 6037, -22202, -90619, -123689, -107557, -106668, -173176, -170290, -77701, -55410, -15037, -29175, -38014, 10575]
15783A0575j4270L5597r748q2266K732M9920M745n5916l8127M9054P826N986m5590
15770g9482l7906Q5270K1278j4700l7020j1006J0142O415m2741n9521K790L9447
15758a17034O6037J4451o9211J8266O2087k4589M1111J1803m9335L3782K3716
15747A1084P172L5854k2890n5115p331L8354k708k9874j3894J6714J9877l247
15735f004n2728K2931J1599k8530m2848k90L9981l7765J8133O875N3385J14774
15723I9513l8447n8915l4962j1060k3844o8452j5209J6976O550l230O6693R0861
15711B6474j7444m9572n77k87o7193k385J329M8200J8286J4324j62L7163m1032
15698c2876J823j00976k5156Q2913k311r7340P922P8874q189m9124o4657J4064
$$ y = [10575, -3695, 31902, 22154, -60112, -57380, -7460, -2715, -58631, -96758, -47704, -39878, -33892, -79482, -117388, -32118, -10840, -25540, -62560, -73566, -63424, -57009, -99750, -159271, -156481, -117034, -50997, -36546, -105757, -87491, -25404, -49993, -8882, 2921, -46414, -12632, 11084, 18256, 54110, 31220, -23895, -31226, 7128, 4420, -25454, -39348, -22634, -2757, -6004, -58732, -35801, -24202, -52732, -95580, -95870, -55889, -93654, -75521, -68646, -15261, 99513, 61066, 2151, -32811, -43871, -67715, -136167, -151376, -134400, -127850, -131080, -64387, 26474, 9030, -40542, -41119, -41406, -108599, -110984, -109655, -61455, -43169, -28845, -29007, 8156, -32876, -31053, -132029, -157185, -74272, -76583, -173923, -166001, -87127, -95316, -144440, -209097, -195033]
15686a95033J8500M8979J3310j3429O0675L9601J3888J283n8747N1577j2385o6347
15674i8128L29R317L7129O9803M4542j0011n541l3413j4573k3931L9763O6222
15662H1508k2575k2207P7631o1287p3270J1518m5209Q682k5144k2269J7379q117
15650h3360j7970N7196J81N6575k3928Q05M8283n2513l4969M492K4282k5636K390
15637d4172m6402j8341N2695J492m5517O4256O5180m9142r9454l3258K3651P6883
15625e2129j6115J4309J3109j0909P013k3248J4797N4544m1307J9601n0172j6869
15613h7376K7389R645J9906j1949K999P9650M2107L4317j1089l1675j0565n8357
15601E002l9514l8729n074j2671Q214l7571j3487M2821L4471L3363J2430l5402
$$ y = [-195033, -176533, -127554, -114244, -127673, -66998, -27397, -13509, -12226, -70973, -19396, -31781, -98128, -97799, -88482, -51353, 18450, 62992, 52981, 47440, 14027, -546, -24477, 15286, 81508, 58933, 36726, 114357, 53070, -20200, -8682, -53891, -45209, -70353, -92622, -75243, -83360, -101330, -44134, -43953, 12622, -11306, -10501, 37782, -14731, -49700, -45208, -20926, -46562, -44172, -90574, -108915, -56220, -54728, -100245, -35989, 29191, -19951, -119405, -152663, -129012, -52129, -68244, -53935, -40826, -51735, -44722, -67970, -53173, 1371, -39936, -20335, -70507, -87376, -59987, -50342, -30436, -42385, -39386, 40264, 82371, 116688, 105599, 73924, 63359, 5002, -34512, -73241, -78315, -90986, -82772, -120343, -133830, -91009, -56538, -23175, -10745, -46147]
15589d6147j5301Q119N4629N0193l8343o3632q611J5605l796J181n19P7474m0626
15576i774n8856p377Q94Q561M6765K750J3748M096n6393l0964J4287N507L3774
15563c2982L7743n7467J1935N4578r016n6487m386j1965P392r859l005J7362J6320
15550c9837K3153M8814k7999m6030m4281o7862Q6594M0252K3006J1010J4740O8626
15538I0186l8828q2560M4686j0852o3620k2914j7389n396K2545R0739O226m7773
15526c4950L8407n583k9785K0714N1596n2214k7535N2240j9442m7989J1127k868
15514d6282L9384L2067n3700k9090N4558J4944J4252n6704j5582m0469K7912N3803
15502d907n251o7100o8535M9329N1994o783N6578J1169m4378j9589r661j7433
$$ y = [-46147, -61448, -53329, 1300, 51493, 13150, -50482, -59093, -43488, -47284, -46103, -46622, 30852, -9774, -68630, -76007, -75113, -66552, -19787, -17037, -3289, 807, -55586, -86550, -72263, -66756, -32982, 4761, -52706, -40771, 13807, 4791, -51696, -56082, -68047, -60655, -70514, -73519, -56157, -39837, -16684, 32130, 4131, -41899, -86180, -154042, -67448, -27196, -4190, 6820, 21560, 90186, 51358, -31202, 13484, 2632, -60988, -83902, -101291, -106687, -84142, 6597, 12823, -34950, 3457, -2126, -31911, -11197, 40399, -11815, -39350, 12890, -6552, -54541, -43414, -46282, -6898, 25169, -28531, -57621, -3063, 11881, 26133, -30571, -46153, -86622, -58710, -4907, -10158, -77258, -145793, -96464, -44470, -51253, 5325, 16494, -27884, -47473, -57134, -74567]
15490g4567l2379p179J8921M8548Q616P8115L739r14j8003J0086j7920l767k274
15477A1022k3782J5676P750o8654r040M5033L8210p2243j5113J6078m1039k458
15465i8560L7716k1277j2613j337j3867M3818K1036K2435k0214l8866l9846K5547
15453i6028P7100L1017J1487K0311l3452m8082j9852M887K629l2840L1203j5243
15441f6863M1797O8803N8046K9330k6457p5965l8568n3343l8790k7987j6288Q309
15429a37976M2223k6197N0608P1754l7762m1656K9271K8316P65L5525k5273m9625
15417f0027j8878J1620L9349q639n1070j8729l5074J3177L4323M8378n40K4573
15405b1537Q512k0209J3715J261N0594K8181j0543m6579k1063l6502r235N8088
$$ y = [-74567, -106946, -114125, -95204, -46656, -38040, 40075, 43814, 42900, 24897, 34983, 17063, 13296, 11022, -12760, 2916, 10666, -57988, -67028, -21995, 16215, -56028, -71141, -55063, -96102, -98560, -60844, -82121, -94734, -96071, -109938, -66120, -45084, -22649, -42863, -81729, -121575, -96028, -18928, 12089, 23576, 43887, 10435, -37647, -57499, -52612, -49983, -82823, -51620, -66863, -25066, 43737, 101783, 131113, 104656, 28691, -9877, -63220, -102010, -129997, -146285, -137976, -95753, -121950, -71342, 412, -37350, -79006, -49735, -21419, -20654, 14871, -10402, -60027, -78905, -67285, -27936, -36575, -87645, -106374, -141448, -128271, -93948, -45570, -46110, -21537, -13025, -33234, -19519, -18258, 32336, 60517, 49974, 3395, -17668, -54170, -63405, -5317]
15393e317M0072O790k4148l0053j2776q868J4067J0057L5854K0984m4551p1642
15381f9531k077O1945P0837L6509m3772q3153N252j1915k0824l2712J8106J1248
15369f0087m069L5081m985k6651k8935r823K1801L285l906P7267N3313k1248l6079
15356e036l0877n898m688m718m404j1077o8451l317Q5909P6246J568K6157l9563
15343A1851k9830j307M6726Q083j1315K010J6011j9240j1066m8282j5888l3193
15331h5440k4531k3716L5477O7652l129J7967L106l4987O692K1393k8142k2288
15319f9946M0267j3772M7670K1872k627j6945j8138o25r271L6451K9039l9563
15307D412J2776Q999o1372l9997J4877n336L4227J8438K7337J4606o3859o974
$$ y = [-5317, 34755, 41545, 17397, -12656, -25432, -34300, -20233, -10176, 25678, 46662, 2111, -69531, -71608, -9663, 61174, 97683, 53911, -29242, -23990, -35905, -56729, -89441, -71335, -60087, -64156, -29075, -34060, -60711, -89646, -99469, -77668, -74383, -78289, -1022, 52291, 31043, -5036, -35913, -41811, -46499, -51217, -55621, -66698, -135149, -138466, -52557, 23689, 25257, 51414, 11851, -17979, -19286, 27440, 35523, 24208, 26218, 42229, 22989, 11923, -36359, -52247, -85440, -109971, -133687, -98210, -30558, -33687, -15720, -12614, -47601, -40909, -19516, -47658, -69946, -29679, -43451, 4219, 26091, 23464, 6519, -11619, -12244, -21515, 14936, 43975, 4412, 17188, 26187, -35185, -75182, -60305, -65641, -31414, -12976, 14361, 28967, -34892, -41866]
15295d1866j1220R883J8512K2016m7876M4095R828j0377l167l237k7977o9471
15283a10857k586J7405K3877Q582m106k7203j7772J205M3533L7297n0616r771
15271i1012k719o593L0889K1275q545L1198J9144q084k9309p63k3087l6538M8159
15258e5985L6864j9265m8933N7088k9501l8647l7657k0510Q6991K1501m5506k6967
15246a20527N878J6520j8342N7779K9373j0932j6455M763J0555P4340M5978L6168
15234A15098j2219o2370o836j8869m3467k1906K0768M9269l4114J7730O2180l4860
15222C0404p4493n173N2349O010r5461n1905j1055L4876L9173M640K3963N48l1956
15209g8080r676r376N9123K7684l1048m3221j2650L7196L8657p405j5109R054
$$ y = [-41866, -53086, -43203, -24691, -2675, -50551, -6456, 3372, -7005, -10172, -13409, -41386, -110857, -113443, -96038, -72161, -63579, -67685, -94888, -112660, -111455, -67922, -30625, -81241, -91012, -93731, -100324, -69435, -48160, -56705, -25507, -6363, -14447, -43756, -44519, -67606, -104144, -55985, -19121, -38386, -87319, -30231, -59732, -98379, -136036, -156546, -69555, -48054, -93560, -120527, -114649, -98129, -116471, -58692, -29319, -40251, -56706, -51943, -41388, 32952, 78930, 115098, 102879, 40509, 33673, 14804, -28663, -50569, -29801, 19468, -14646, 3084, 65264, 30404, -44089, -49262, 3087, 9097, -86364, -138269, -149324, -114448, -75275, -70635, -46672, -46124, -78080, -87756, -97132, -38009, -10325, -41373, -84594, -97244, -60048, -21391, -28796, -43905, -34851]
15197c4851J2387j2930M107Q5341J0420n5896m6432K0666j695j9329n287k9218
15185g2717m4987N060P3390k0510N0725L2937j8077l3270L7969L0006N1651j2582
15173G9595K0285O1982j1493p6608j2599m2501L980k3168o7926j6796n521M2229
15161d8541P9107l654n2538J084J0612L0711l7661m2445J4107J9034J5711L7443
15149B2970N169K3103N160J3150j3423n5851L8587k1167j1098K8986L3726q922
15137F0390m1881p853M709M7344k1796m533n2681l2306k2655k2375K7054L0172
15125c6411J5003r518K9646K1898j1208L5926m8569q1099l5140P9956K1365o423
15113b4574P85N15j509J138N4735M5921J9690p5443o5695N618O8520o202o0589
$$ y = [-34851, -22464, -35394, -31287, 54054, 64474, 8578, -37854, -17188, -18883, -38212, -43499, -72717, -117704, -112644, -39254, -59764, -9039, 23898, 5821, -27449, 10520, 40526, 92177, 79595, 99880, 161862, 150369, 73761, 61162, 18661, 22641, -527, -68453, -85249, -90770, -48541, 30566, 26912, -25626, -24542, -13930, 16781, -20880, -63325, -49218, -30184, -14473, 22970, 28139, 51242, 56402, 69552, 56129, 278, 38865, 17698, 6600, 35586, 69312, 60390, 18509, 10656, 15365, 62709, 40913, 36380, -16301, -48607, -71262, -93637, -66583, -36411, -21408, -30926, -1280, 20618, 9410, 45336, -3233, -84332, -119472, -39516, -18151, -24574, -23789, -23274, -24783, -23645, 31090, 77011, 96701, 21258, -44437, -38819, 29701, 23499, -37090]
15100c7090j7356J5454N909N533k4931K8938K1905L1349j4921N62m2637j4025
15088d1310L2599K3494P1787k3779r3607j7777j987K8345P20L0340L9093Q3863
15076A31781K1932l7571o3260r7591P322l7970L2340K594J5544J2640O6083o0378
15064f534l562J9517j8651M377K8373j2661p144R365l0629O0454j6862k9669J1107
15051G481M8785j4566j4615k4333N8018L7105J7475j9849p1238k7679m7331L0933
15039a9814j3866o8694m2440j345N1538R258O771M3217n5055j3395L3236R0233
15027A9644P3327n6615m2179M3005J6915K9794k5955o1999L9250J2630k8417K0585
15015C9985m838n8933j7911J3392O0591l3666o5659M7486j5232L1469j1978K229
$$ y = [-37090, -54446, -38992, -33083, -27550, -52481, -23543, -1638, 29711, 14790, 15352, -27285, -41310, -8711, 14783, 86570, 62791, -30816, -48593, -50580, -22235, -21515, 8825, 47918, 131781, 153713, 116142, 52882, -44709, -37387, -75357, -43017, -40423, -24879, -12239, 53844, -6534, -10096, 9421, -9230, -4853, 23520, 10859, 3715, 13080, -17549, 42905, 26043, -3626, 7481, 56266, 41700, 27085, 2752, 60770, 97875, 115350, 95501, 24263, -3416, -50747, -19814, -33680, -102374, -144814, -146159, -94621, -85363, -78592, -35375, -90430, -103825, -70589, 19644, 92971, 36356, -5823, 37182, 54097, 83891, 57936, -4063, 35187, 47817, 19400, 39985, 35147, -23786, -41697, -28305, 32286, -1380, -67039, -19553, -34785, -3316, -15294, -13065]
15003a3065P3191k541L0275N2548J07448M1797K9999j5976K299p7840m6284k4067
14991A57784p493J1427n6067q3630j1327o545N630K8226J5074k6868K7016J0452
14979F3679m5830M7774M9609n175n9052K4749K378j9827J5320k0055m9301o447
14967b178n1009P2147P5354Q854o722k4391M3537L9403m7476r6421Q384M916K4089
14954D8487J0943o2560M29o3170j7623L6199N4905L721L090M7944p881p2571N5791
14941C7704K284O756p1811R439L2249q475J2615j66J1997J2059M3055M9856j3711
14928A23851P958P511j2450j02841k3561M1182L283L7734K2260j0057q684k9988
14916E6198J664p5392J310p587K5102o062k0427o5966R05N6452J7548J9815O8751
$$ y = [-13065, 60126, 57585, 87860, 140408, 247856, 289653, 319652, 303676, 305975, 228135, 181851, 157784, 150291, 161718, 105651, 22021, 10694, 4149, 9779, 38005, 53079, 26211, 53227, 63679, 17849, 65623, 115232, 110057, 51005, 75754, 78132, 58305, 73625, 53570, 4269, -2178, -53187, 18960, 94314, 103168, 96446, 72055, 115592, 154995, 107519, 11098, 19482, 24398, 48487, 59430, -3130, -2701, -65871, -83494, -47295, 7610, 11331, 14421, 62365, 54484, -18087, 37704, 39988, 46744, -25067, -15628, 16621, 8146, 20761, 20595, 32592, 44651, 87706, 137562, 123851, 131809, 139320, 126870, 24029, 468, 41650, 44933, 82667, 104927, 94870, 86186, 56198, 57862, -17530, -16220, -23807, 1295, -4767, -25194, -91160, -90255, -33803, -16255, 3560, 72311]
14903G2311L3957k5216l1706l3089R097l4301q1561M36K8026Q625K0988k1705
14891e4138n388J7537j0885o049k1775O1795n70L3242M5305k7637j1144M2895
14879F3188K1509l3460l1649n873j3126K5029P3296O164L94j6051k2271j4123
14867E3027R49K1220n0852j5525k1234J6440J9476L1514l8119O523N597m2046
14855a3030k641K6617J4115J8565O046M0019P1897j5311q399k3127m6059q7295
14843a8603o4414J0995L1439L2483O2372j6823N3966M6744l2087J2815j594m4881
14831G2412J7158m2868o286L4772r568l0711k1760J1970R118K5050L722r081n095
14818D8833q304k5984M7360K1740M4731l6452j1812Q453k0255k1933J9053J3280
$$ y = [72311, 106268, 81052, 49346, 16257, 25354, -8947, -90508, -90072, -62046, -53421, -32433, -54138, -59526, -41989, -52874, -58923, -80698, -18903, -19473, 13769, 59074, 31437, 20293, 63188, 84697, 51237, 19588, 13715, 589, 25618, 98914, 105078, 105472, 89421, 67150, 53027, 53976, 75196, 24344, 8819, -12415, 4025, 23501, 55015, 16896, 23419, 29016, -13030, -15671, 10946, 25061, 43626, 49672, 89691, 161588, 146277, 137878, 114751, 68692, -18603, -83017, -72022, -40583, -8100, 54272, 37449, 91415, 138159, 106072, 118887, 117293, 72412, 89570, 46702, 40416, 75188, 65620, 34909, 13149, 25119, 34237, 59287, 63009, 53928, 48833, 40529, 14545, 61905, 83645, 128376, 91924, 80112, 88565, 68310, 46377, 65430, 78710]
14806G8710K7137n462j5473L8714m632j224m3570l4207j2430k7361O2311J1160
14794G3673M7057M6844l357m5184l2567j7639m2961L5192K6060K2374R542l2863
14782H6171n9663k3254J2895J6834K6370N03J0377O0294M0796q7035r4289r341
14770a9342K4718o100Q153j763J2166Q899Q760J3279K3181M4289m4848q0619P73
14757h454K1877m6881J2530K5987M5571P1469L4585J084l0385p0204m180O6953
14745A19952l0254n389j4593K8456R947n3567L5369J3335Q280J8952J7590j4256
14733A33822p0965n2366k4512L6235J4456n619l205M1856L3286n2603p4678O8768
14721D4475N7930J4475k6927m2917o194l836J7248L8046N3784p3927l2493J8500
$$ y = [78710, 105847, 100385, 84912, 123626, 118994, 117770, 74200, 39993, 27563, 202, 62513, 73673, 120730, 167574, 164217, 119033, 86466, 68827, 25866, 61058, 87118, 109492, 119034, 86171, 26508, 3254, 16149, 32983, 59353, 59856, 70233, 130527, 171323, 84288, -10001, -19342, 5376, -724, 7429, 5666, 17832, 26731, 35491, 48770, 71951, 116240, 71392, -9227, -8454, 13423, -33458, -20928, 5059, 50630, 122099, 156684, 157768, 127383, 57179, 52999, 119952, 89698, 84309, 69716, 98172, 108119, 54552, 89921, 103256, 111536, 130488, 148078, 133822, 62857, 10491, -14021, 22214, 36670, 31051, 27846, 69702, 102988, 50385, -24293, 44475, 102405, 116880, 89953, 47036, 40842, 37006, 54254, 92300, 146084, 72157, 39664, 58164]
14709E8164j5881L7640J0975m7552k5752r162J4986N723o374L898O5957Q997j3086
14696H8533l518j166L4570K876n364k3724m6750M0982J6470K163L3859O893r202
14683A36622q9003m2855M0199L3160L5014j3293J1606M018j8264k8789J317M7123
14671A16855K0333m4151l1756j1702l0384k3641m2132q886P9997L3581M2988j189
14659I9913J4136J3104J2644o9855m1742L677J2041k2576k3614m8300M6848j8512
14647b2236O0996o047k2720j76N7213L6053J9272L0878K7863O0j06003q9316K4416
14634A0253L9122l281o998J7703M1350N7081l8681k0421N844o259l7719k3659
14622C4335m063k7779q741O3306R7478P6792P273l2117m8476r0171l1988l2825
$$ y = [58164, 42283, 79923, 90898, 43346, 17594, 8432, 23418, 29141, 22767, 26665, 92622, 101619, 88533, 85015, 83849, 118419, 121295, 115931, 92207, 45457, 86439, 102909, 105072, 138931, 145824, 136622, 47619, 4764, 44963, 78123, 113137, 99844, 111450, 115468, 97204, 68415, 69732, 116855, 137188, 93037, 61281, 49579, 19195, -4446, -46578, -55464, 24533, 58114, 101102, 99913, 114049, 127153, 139797, 69942, 28200, 31877, 43918, 21342, -2272, -50572, -3724, -22236, 38760, 32713, 9993, 9817, 67030, 103083, 122355, 153233, 181096, 181156, 75153, -14163, 10253, 49375, 46094, 39096, 56799, 98149, 155230, 116549, 96128, 101972, 95713, 57994, 34335, 30272, 2493, -6248, 57058, 154536, 231328, 238601, 206484, 158008, 67837, 35849, 3024]
14610C024L8092P2816K8739m9305l998J6038n0368p4941q746K966M580N8837M951
14597D2685K0235M4808J7814J1678k2638O302M65J6695l486n6313M7259K6548
14585A52052m7636j9378K2683j3877l8347l966O7503J8376K6601j0366N939J1065
14573A70649n6804k8679j1520k2735L0635K2132j003Q961j0465j0082j906K7028
14561A16211L5174J4617k0252J9842L3521n7280m3878n1413J8241J29449L3888
14550B28120j7679k0474o5080j6537l8417o503o490J021O3242J0750l2097L847
14538A03703J1524L3368j7654m418J7872m727l0545L4395k5602K8473k0731J433
14526A27091J5739k9719k5323k9061K8788M3461J394q1695j7498j8464j8587N5043
$$ y = [3024, 41116, 113932, 142671, 93366, 89368, 105406, 55038, -19903, -28649, -25683, -21103, 37734, 42685, 62920, 107728, 125542, 137220, 114582, 120884, 121349, 138044, 134558, 78245, 125504, 152052, 104416, 85038, 107721, 93844, 55497, 51531, 119034, 137410, 164011, 153645, 159584, 170649, 113845, 85166, 73646, 50911, 81546, 103678, 102675, 111636, 101171, 91089, 89183, 116211, 151385, 166002, 145750, 165592, 199113, 141833, 97955, 46542, 64783, 194232, 228120, 210441, 189967, 124887, 108350, 69933, 63430, 56940, 57961, 121203, 131953, 99856, 103703, 115227, 148595, 130941, 126523, 144395, 139668, 109123, 143518, 117916, 146389, 125658, 127091, 142830, 113111, 87788, 58727, 87515, 130976, 132370, 50675, 33177, 14713, -3874, 51169]
14514E1169N9140n779L9099M2546o5124m6650O287L7739K9816k9541k4390l320
14502I0992K920Q119J817j4729k0741k3380M5038L4589M6777O867j7688l0379
14490A30202r982P5552k1985j6871J909r78L54j3968J8971K8249m9164l8307J4693
14477A18675M1763M4902j8021r272K7795j0226j0043k0308J0342l2840p597L3879
14465A69049L641j5639J8604K7761m1754n064j3054m363K3755J8707k6614r114
14453A45915J749k6135L6474O7298K5013J3553m6497n2902j9772k2888K1005K9565
14441A72378k4592K762j4533q38k305l0666J4975P4511L1691k1082K2534j5174
14429B09661J7188n424l8782m3391k8554L5003l445L625m1574l5398M8547J5745
$$ y = [51169, 110309, 104530, 143629, 186175, 121051, 74401, 80688, 118427, 148243, 118702, 94312, 90992, 93912, 102031, 103848, 89119, 68378, 44998, 90036, 124625, 171402, 178269, 160581, 130202, 120220, 195772, 173787, 156916, 158825, 157847, 158201, 144233, 163204, 191453, 142289, 103982, 118675, 160438, 205340, 187319, 178047, 205842, 195616, 185573, 165265, 175607, 142767, 135170, 169049, 172690, 157051, 175655, 203416, 161662, 156598, 143544, 139181, 162936, 181643, 155029, 145915, 147664, 121529, 158003, 225301, 250314, 263867, 217370, 164468, 144696, 121808, 142813, 172378, 147786, 150548, 136015, 135177, 132872, 102206, 117181, 191692, 223383, 202301, 224835, 209661, 226849, 221425, 182643, 139252, 110698, 145701, 142256, 145881, 104307, 68909, 117456, 133201]
14417A33201K8890J7466j5828j1809m0697P357J6911l0333K8430J5992K7286M2715
14405B19581J4928j5061n3359p5777L9491O7105N6799K863k2113L6151O6896r8290
14393B39214m0869J5298j3281m0225O722k0830M438k4716L8180J08293K4078J5800
14381C12102p18m5328j909k4661l4498j3625l3591p576K3026p505L3552k2190
14369A77079M3143N4709l1828l1236n7234k5261M0855j5948J8477L1104j1164
14358A92696k5719k1985m894P865M6110p261P822k754L24k821j8014N4486K1662
14345B47517k7097m072n2108M4416K7790l0889N074l2317k8695j213J588j5413
14333A34581L2289N0542N2482j8440q8075M4179O6376K3611J4876n4055p9166
$$ y = [133201, 162091, 179557, 163729, 151920, 111223, 118580, 135491, 105158, 133588, 149580, 176866, 219581, 234509, 219448, 166089, 90312, 129803, 196908, 253707, 256570, 234457, 270608, 337504, 239214, 198345, 213643, 200362, 160137, 166859, 146029, 150467, 125751, 163931, 272224, 296302, 312102, 311384, 266056, 264147, 239486, 204988, 191363, 157772, 150196, 173222, 165717, 199269, 177079, 220222, 274931, 243103, 211867, 154633, 129372, 170227, 154279, 172756, 203860, 192696, 166977, 144992, 140098, 147963, 194073, 186812, 194634, 191880, 192204, 189383, 171369, 225855, 247517, 220420, 216348, 164240, 208656, 236446, 205557, 210631, 178314, 149619, 148406, 149994, 134581, 166870, 217412, 269894, 251454, 163379, 207558, 273934, 297545, 312421, 258366, 179200]
14322A79200J8929M7413L3016P650K5997o415m2279l4188m2391l695N9568M2717
14310B85522P988K4036j3473M099N686m58K2957k267m7304J5088J5462l9724m4244
14297B33368J2605o231J6574R432k8879l6642K1700O0814K4867K6825k1069J6506
14285C29870J513J0202N0651j3663m8738k1204J290l7163j6665J638J2712L917
14273B74360k6546K1220L2071q122L0409r739K9499K9924k9471K0179j2065n0288
14261C01431m3818l3712J7788k718K9842N9040n3903q002j4858L9102L6637l448
14249C23381L432k3806l0289L8433j5960j5920J6273K0954M6152l611Q768j2149
14237C55658M9020N8670J4229j2761p0656j6612K5791J217q172k7717N293l0122
$$ y = [179200, 198129, 245542, 278558, 286208, 312205, 305790, 263511, 229323, 186932, 183237, 242805, 285522, 293510, 317546, 304073, 308172, 313858, 313400, 336357, 334090, 286786, 301874, 317336, 277612, 233368, 245973, 239742, 256316, 265748, 236869, 200227, 221927, 282741, 307608, 334433, 313364, 329870, 331383, 341585, 392236, 378573, 329835, 308631, 309921, 272758, 256093, 257731, 270443, 274360, 247814, 269034, 301105, 292983, 323392, 313653, 343152, 373076, 343605, 363784, 351719, 301431, 257613, 223901, 241689, 238971, 268813, 327853, 273950, 265948, 251090, 290192, 326829, 323381, 326813, 303007, 272718, 311151, 295191, 279271, 295544, 316498, 362650, 359039, 367807, 355658, 404678, 463348, 477577, 464816, 394160, 377548, 403339, 404556, 396384, 368667, 373960, 343838]
14225C43838k1017J8273M4193N6876k0732m4446L7098l5031l4030k7249o7905
14214B49868M8628L8811K6125k5252J233j7647L55k7440N3718K7315O8811N8249
14202E02774k0567P814N738j7842P792o8976k8730K0645m692O186L3536O0102
14190E03780M4999l455o9850k5740k5566M9685j1897n1531m9152k1730K7604N0341
14178D17488J1771J945k331k4060P4446n91k441O1263L1394j3316n7151o1368
14166D37049m7224L7312O0925k5421J4492M0416j8799m2676q604l0955K3133q171
14154D31477o7401k617L9178j4749K9658j8532M5257O3853m305K0296K9518K0706
14142E72339o2591m2814K0276M2670j1110R258N588N8804K9667j4809j28756j9707
$$ y = [343838, 322821, 341094, 385287, 442163, 421431, 376985, 414083, 379052, 345022, 317773, 249868, 298496, 337307, 363432, 338180, 339413, 321766, 322121, 294681, 348399, 375714, 444525, 502774, 482207, 490021, 495759, 477917, 485709, 416733, 388003, 408648, 403956, 410142, 443678, 503780, 548779, 545324, 475474, 449734, 424168, 473853, 461956, 410425, 361273, 339543, 367147, 417488, 429259, 431204, 428873, 404813, 479259, 478668, 476227, 537490, 568884, 555568, 498417, 437049, 389825, 427137, 488062, 462641, 477133, 517549, 498750, 456074, 447470, 416515, 439648, 431477, 364076, 361459, 400637, 385888, 415546, 397014, 442271, 506124, 501819, 522115, 551633, 572339, 509748, 466934, 487210, 529880, 518770, 528028, 533616, 592420, 622087, 607278, 478522, 458815]
14130D58815O4040J9083Q005M7134L3973l5939l8054K2451m3261o5257J5920J8844
14118E05754O5034O311o294k3005J2679L5274j9700o3265k1130L9337O7259j806
14106E96448J8457o1915k2464J1931K56P8412J1864k5274K2330n6180k8385J0329
14094E55809K2877N3021L1083n3880p836J4515J911J8301N8982k1560m4726P924
14082F36421j2544L5775M5716j5272j3504J9590K337J98o7084j4398J8176n731
14070F29680M4618j9334P43L5159j4564L9485q292j570K4955M612j100l8116m3102
14057F53174J4822j0054J6360J8240J2907K2073j1881P277k6646m9460M9639N4057
14045G50508P521M3828R785j0700P786j0811o6791L6602J2045j1285K727q813
$$ y = [458815, 522855, 541938, 549943, 597077, 631050, 595111, 557057, 579508, 536247, 470990, 486910, 505754, 570788, 577099, 570805, 547800, 560479, 595753, 576053, 512788, 491658, 530995, 598254, 596448, 614905, 552990, 530526, 542457, 542713, 621125, 632989, 607715, 630045, 573865, 545480, 555809, 578686, 631707, 662790, 608910, 601074, 615589, 617500, 635801, 694783, 673223, 628497, 636421, 623877, 659652, 705368, 690096, 676592, 696182, 698519, 698717, 631633, 617235, 635411, 629680, 674298, 654964, 655707, 690866, 676302, 715787, 707495, 705925, 730880, 735492, 734392, 696276, 653174, 667996, 657942, 674302, 692542, 705449, 727522, 715641, 722918, 696272, 646812, 696451, 750508, 758029, 801857, 811642, 800942, 808728, 797917, 731126, 767728, 779773, 768488, 771215, 762402]
14033G62402k0694K8837K533r727J6301J2663j3378Q040n8222k3742N7300K4167
14021G86480l5098j442N8042L089L392L5899L7937n4102k1296n119j6264p014
14009G84504M1080M3833P4952K6525q6110m1219J0020m2896K8106K5065Q39L9432
13997I04131L8852o19N6040j2119m6551k2541k8497q179M7552K2503j1163m8237
13985H91172J5640j1256l7943j1411N4978M7794K510k9570J4387L0468J6030j5798
13973I67001q832Q523p201L5113O8416k1366n77N712j8570l9186J3845L9854J6152
13960A058884O0973j0511m9318o4890o73J9439O1432J2361J933q288o953K1248
13948A095637J1309J2648J6513l1382K1373N657m777J3106M2150n0682m8470Q132
$$ y = [762402, 741708, 770545, 773078, 763351, 779652, 792315, 778937, 786977, 728755, 705013, 762313, 786480, 751382, 749940, 807982, 811071, 814463, 850362, 888299, 834197, 812901, 807782, 791518, 784504, 825584, 869417, 944369, 970894, 884784, 843565, 853585, 810689, 838795, 863860, 864699, 904131, 942983, 942364, 998404, 986285, 939734, 917193, 888696, 880517, 928069, 950572, 939409, 891172, 906812, 895556, 857613, 846202, 901180, 948974, 951484, 921914, 936301, 966769, 982799, 967001, 958169, 966692, 959491, 994604, 1063020, 1041654, 1041077, 1046789, 1028219, 989033, 1002878, 1042732, 1058884, 1119857, 1109346, 1060028, 995138, 994465, 1013904, 1075336, 1087697, 1089630, 1081342, 1074389, 1095637, 1106946, 1119594, 1136107, 1104725, 1126098, 1131755, 1126978, 1140084, 1182234, 1131552, 1083082, 1091214]
13936A091214K9833N6489L0623O823o8138j0005M1887P6574N7793O7120l4421
13925A345792p9976M6037Q2571K8640l9190o808L5514N998m9516m0517j7448k4784
13913A286313j7416q746J2600K4941j828J0054L4149M9286O6831k3414N2950O145
13901A491865J6937L8640N792R74p9816M8613N6825l9003m3768J3625M9848M5255
13889A605787j9466j2435j7196k7378K6607K9318M716l3363N054L1336L4446j5619
13877A611807l7994k639L6591K0054J4511N6001N3824L750J6010l0104M250P7001
13865A823062O1533K2398n197J1354Q520m3580n5279j6040L8457O1516M1190j8026
13853A929908k8085q202P0744L5758j7675r404j1479K7537K9069K6531l2680J054
$$ y = [1091214, 1121047, 1177536, 1208159, 1214982, 1146844, 1136839, 1178726, 1255300, 1313093, 1380213, 1345792, 1265816, 1311853, 1394424, 1423064, 1383874, 1377066, 1412580, 1418578, 1369062, 1328545, 1311097, 1286313, 1268897, 1260151, 1272751, 1297692, 1295864, 1305918, 1340067, 1389353, 1456184, 1432770, 1485720, 1491865, 1508802, 1547442, 1553234, 1554208, 1474392, 1523005, 1579830, 1540827, 1497059, 1510684, 1560532, 1605787, 1586321, 1573886, 1556690, 1529312, 1555919, 1585237, 1589953, 1556590, 1561644, 1592980, 1627426, 1611807, 1573813, 1571174, 1607765, 1627819, 1642330, 1698331, 1752155, 1755905, 1771915, 1741811, 1746061, 1823062, 1884595, 1906993, 1901796, 1913150, 1921670, 1878090, 1822811, 1806771, 1845228, 1906744, 1947934, 1929908, 1901823, 1893621, 1964365, 2000123, 1982448, 1973044, 1961565, 1989102, 2018171, 2044702, 2012022, 2013076]
13841B013076O0489j7548K7828M538L187J2671K3754J3910L4696N1633l33K955
13829B230856N0678O6774k9146n9561O591j9668Q9132L3690J7074K6694K8481
13818B441595l340l720L3940K6248K14O5036Q6699J1092k6233L6421k2269J8258
13806B663941M8557J8612O0296J15145O6720N32M894j8780M7092P5041O4632o854
13794C139828J197L9677O207o1123Q193K170m551K1256l432M4633N3019K4938
13782C272012K4240J07963R2622Q6996k049l4786J8577J1151J0339J9803O4996
13771C671864Q0733Q2238l255k2076M4169N4578P6994N493N8454L2743L9233n6544
13759D064624m5387M4218M2857P6602L6052K2231P3541K9776Q737P2611O7137
$$ y = [2013076, 2073565, 2056017, 2083845, 2088383, 2091570, 2104241, 2127995, 2141905, 2176601, 2228234, 2227901, 2230856, 2281534, 2348308, 2319162, 2259601, 2266192, 2246524, 2335656, 2369346, 2386420, 2413114, 2441595, 2438255, 2434535, 2468475, 2494723, 2494937, 2559973, 2646672, 2657764, 2631531, 2667952, 2645683, 2663941, 2712498, 2731110, 2791406, 2906551, 2973271, 2973803, 2978697, 2959917, 3007009, 3082050, 3146682, 3139828, 3141025, 3180702, 3186909, 3125786, 3133979, 3136149, 3131598, 3152854, 3149422, 3194055, 3247074, 3272012, 3296252, 3404215, 3496837, 3583833, 3581784, 3546998, 3565575, 3576726, 3587065, 3606868, 3671864, 3752597, 3834835, 3831580, 3809504, 3853673, 3908251, 3985245, 3990738, 4049192, 4081935, 4121168, 4064624, 4019237, 4063455, 4106312, 4182914, 4218966, 4241197, 4314738, 4344514, 4353251, 4425862, 4492999]
13748D492999M0680L7436K1471P3594N1286M5659O358J5416J9464M2294P0098
13737D916755L5978P5936R7470J20425L5877L0075L1926L1864L5231O2282Q4630
13726E558449Q7065Q7060J0087K3541L2496J18833J10128L5719M2624O7500M4519
13715F218021P6650J0887L1306P1666J25803J11605P2984N3608J23802k6201L1162
13704F901293L7954J49431Q8564M8630P2159O3475M0503K4876J36011J20336J11525
13693G794757P9399Q1333Q0143R1701Q9713N8065P6680R0573P9618O4758J25688
13682H712428J08339J35228J10572J20933J14561P9934R0218J36780J36293J25637
13672I870923J06526J17424J64544J27081J45692J56783J09586J52894J23209
$$ y = [4492999, 4533679, 4571115, 4592586, 4666180, 4717466, 4763125, 4769483, 4784899, 4804363, 4846657, 4916755, 4952733, 5028669, 5126139, 5246564, 5282441, 5312516, 5344442, 5376306, 5411537, 5473819, 5558449, 5645514, 5732574, 5742661, 5766202, 5798698, 5917531, 6027659, 6063378, 6106002, 6173502, 6218021, 6294671, 6305558, 6336864, 6408530, 6534333, 6645938, 6718922, 6772530, 6896332, 6870131, 6901293, 6939247, 7088678, 7177242, 7225872, 7298031, 7361506, 7402009, 7426885, 7562896, 7683232, 7794757, 7874156, 7955489, 8035632, 8127333, 8217046, 8275111, 8351791, 8442364, 8521982, 8586740, 8712428, 8820767, 8955995, 9066567, 9187500, 9302061, 9381995, 9472213, 9608993, 9745286, 9870923, 9977449, 10094873, 10259417, 10386498, 10532190, 10688973, 10798559, 10951453, 11074662]
13663A1074662J29908J34698K13350J97349J37167J05161J77557K13701J89535
13654A2573088J98838J56145K51063J89411J35520J74798J38829J99779K50745
13645A4268216K31976K16803K00705K38211K10086K17204K52142K81467L33851
13636A6450661K60690J83811J98763K69596K88282L03677L32722L73481L22651
13627A8984334K89652L00853L60595K76597L22487L78669L80368L71709M42445
13618B2107709M26258M34590M32666L62592M30762M93275M62789M26291M93120
13609B6070052M95463N24988N15643N48457N69914O63286O14150O40213O56178
13600C1298344O50214O61578O78562P11873O99689P84673P88859Q07852Q80977
$$ y = [11074662, 11204570, 11339268, 11552618, 11749967, 11887134, 11992295, 12169852, 12383553, 12573088, 12771926, 12928071, 13179134, 13368545, 13504065, 13678863, 13817692, 14017471, 14268216, 14500192, 14716995, 14917700, 15155911, 15365997, 15583201, 15835343, 16116810, 16450661, 16711351, 16895162, 17093925, 17363521, 17651803, 17955480, 18288202, 18661683, 18984334, 19273986, 19574839, 19935434, 20212031, 20534518, 20913187, 21293555, 21665264, 22107709, 22533967, 22968557, 23401223, 23763815, 24194577, 24687852, 25150641, 25576932, 26070052, 26565515, 27090503, 27606146, 28154603, 28724517, 29387803, 30001953, 30642166, 31298344, 31948558, 32610136, 33288698, 34000571, 34700260, 35484933, 36273792, 37081644, 37962621]
13591C7962621R08830R53942R75274R64247J009091J013924J137871J134391J090470
13582D7150661J154590J223422J236219J360588J363116J415496J425869J473015
13574E7802976J552104J564696J650480J747122J802827J848543J917223J910070
13566G1796041J976931K110734K128635K221748K308190K372624K404897K402566
13558H9722366K549386K593022K703721K740904K716902K767861K926535K998406
13550A11719103K996360L026704L032421L066389L052848L068979L065797L063047
13542A36091648K998620K940958K954199K845895K727290K582438K485673K332027
13534A57958748K194163K062376J849149J640273J442913J185702R70898P80595
$$ y = [37962621, 38871451, 39825393, 40800667, 41764914, 42774005, 43787929, 44925800, 46060191, 47150661, 48305251, 49528673, 50764892, 52125480, 53488596, 54904092, 56329961, 57802976, 59355080, 60919776, 62570256, 64317378, 66120205, 67968748, 69885971, 71796041, 73772972, 75883706, 78012341, 80234089, 82542279, 84914903, 87319800, 89722366, 92271752, 94864774, 97568495, 100309399, 103026301, 105794162, 108720697, 111719103, 114715463, 117742167, 120774588, 123840977, 126893825, 129962804, 133028601, 136091648, 139090268, 142031226, 144985425, 147831320, 150558610, 153141048, 155626721, 157958748, 160152911, 162215287, 164064436, 165704709, 167147622, 168333324, 169304222, 170084817]
13526A70084817M83955K65125Q4747j55347l78756o12710q34044j010310j197282
13517A66730195j383406j599754j782816j834991j984395k116272k227235k332438
13509A51468888k414950k496843k512654k501319k507751k592441k597378k645043
13501A31200509k585281k580712k646987k545435k476337k521869k504080k387109
13493A10952699k380969k316554k332379k276314k286861k157759k072156k085105
13485I3044602k047751k017806j952791j912954j853638j788103j746935j748606
13477G7976018j753367j634640j549815j570828j571945j453554j395238j442306
13469F5604325j428262j332664j268696j248427j233617j205810j250189j192833
$$ y = [170084817, 170568772, 170833897, 170918644, 170763297, 170384541, 169771831, 168937787, 167927477, 166730195, 165346789, 163747035, 161964219, 160129228, 158144833, 156028561, 153801326, 151468888, 149053938, 146557095, 144044441, 141543122, 139035371, 136442930, 133845552, 131200509, 128615228, 126034516, 123387529, 120842094, 118365757, 115843888, 113339808, 110952699, 108571730, 106255176, 103922797, 101646483, 99359622, 97201863, 95129707, 93044602, 90996851, 88979045, 87026254, 85113300, 83259662, 81471559, 79724624, 77976018, 76222651, 74588011, 73038196, 71467368, 69895423, 68441869, 67046631, 65604325, 64176063, 62843399, 61574703, 60326276, 59092659, 57886849, 56636660, 55443827]
13461E5443827j108160j100775j102917j126517r94791r50752r64621r43844j009046
13452D6142404q92725q47645q89614q61604q21929q44477p22425o87700p19218
13443C8855067p38471p15547o61804p00080p48591o48212o53502n98476n53594
13434C2836790o20989n68214n53940n94160n88141n41854n00000m70523m28605
13425B7970364m80075n50746n20055m17397m24541l73873l89590m54398m11452
13416B3948237l10050l92728m22169l86503l25593k95468l53232l59289l88697
13407B0714508l85153l43482l33743l23851k83370l01189k41802l06234l31561
$$ y = [55443827, 54335667, 53234892, 52131975, 51005458, 50010667, 49059915, 48095294, 47151450, 46142404, 45249679, 44402034, 43512420, 42650816, 41828887, 40984410, 40261985, 39574285, 38855067, 38116596, 37401049, 36739245, 36039165, 35290574, 34642362, 33988860, 33390384, 32836790, 32215801, 31647587, 31093647, 30499487, 29911346, 29369492, 28869492, 28398969, 27970364, 27490289, 26939543, 26419488, 26002091, 25577550, 25203677, 24814087, 24359689, 23948237, 23638187, 23245459, 22823290, 22436787, 22111194, 21815726, 21462494, 21103205, 20714508, 20329355, 19985873, 19652130, 19328279, 19044909, 18743720, 18501918, 18195684, 17864123]
$$ [...]
##END NTUPLES=NMR SPECTRUM
##END=
