##TITLE=Analysis number 318646
Compound Code cc 46222
Book Reference 440/168
Project Code adrs
Chemist Name craigr
##JCAMPDX= 6.0         $$ Bruker NMR JCAMP-DX V2.0
##DATA TYPE= NMR SPECTRUM
##DATA CLASS= NTUPLES
##ORIGIN= Bruker BioSpin GmbH
##OWNER= nmr
$$ XWIN-NMR		Version 3.5
$$ Thu Apr  6 13:51:28 2006 GMT Daylight Time (UT+1h)  MAYBRIDGE\nmr@NMR_250MHZ
##.OBSERVE FREQUENCY= 250.131544655141
##.OBSERVE NUCLEUS= ^1H
##.ACQUISITION MODE= SIMULTANEOUS (DQD)
##.ACQUISITION SCHEME= undefined
##.AVERAGES= 16
##.DIGITISER RES= 18
##SPECTROMETER/DATA SYSTEM= dpx250
##.PULSE SEQUENCE= zg30
##.SOLVENT NAME= CDCl3
##.SHIFT REFERENCE= (INTERNAL, CDCl3, 0, 16.522)
##AUDIT TRAIL= $$ (NUMBER, WHEN, WHO, WHERE, WHAT)
$$ ##TITLE= Audit trail, XWIN-NMR		Version 3.5
$$ ##JCAMPDX= 5.01
$$ ##ORIGIN= Bruker BioSpin GmbH
$$ ##OWNER= nmr
$$ C:\u/data/dgb/nmr/ADRS/2300/pdata/1/auditp.txt
$$ ##AUDIT TRAIL=  $$ (NUMBER, WHEN, WHO, WHERE, WHAT)
(   1,<2006-04-06 13:51:00.52 +100>,<MAYBRIDGE\nmr>,<NMR_250MHZ>,
      <created by zg, POWCHK disabled, PULCHK disabled
       configuration hash MD5:
       84 BC 41 DB A1 6E 1D 46 DA 25 12 A5 C1 ED C5 3A
       data hash MD5: 64K
       D5 1C A4 19 23 5E 19 62 CF FC 8E 0F 22 7B B9 B8>)
(   2,<2006-04-06 13:51:15.57 +100>,<MAYBRIDGE\nmr>,<NMR_250MHZ>,
      <Start of raw data processing
       ef LB = 0.3 FT_mod = 6 PKNL = 1 SI = 32K 
       data hash MD5: 32K
       9E 4A 75 B0 DA F6 03 D6 81 91 86 F5 D1 92 14 BB>)
(   3,<2006-04-06 13:51:17.46 +100>,<MAYBRIDGE\nmr>,<NMR_250MHZ>,
      <apk 
       data hash MD5: 32K
       30 E6 A7 AA C8 BC 68 48 72 78 64 6A EE 3B D0 71>)
(   4,<2006-04-06 13:51:18.43 +100>,<MAYBRIDGE\nmr>,<NMR_250MHZ>,
      <abs ABSG = 5 
       data hash MD5: 32K
       CB EA 78 1B 05 E2 95 CF 85 D4 AD 9E AD CB 15 48>)
$$ ##END=
$$ 
$$ hash MD5
$$ E4 16 4F 68 F0 80 16 95 28 39 25 90 B0 1C 43 78
##$RELAX= 
##$RELAX= 
##$RELAX= 
##$RELAX= 
##$RELAX= 
##$RELAX= 
##$RELAX= 
$$ Bruker specific parameters
$$ --------------------------
##$DU= <C:\u>
##$EXPNO= 2300
##$NAME= <ADRS>
##$PROCNO= 1
##$TYPE= <nmr>
##$USER= <dgb>
##$AMP= (0..31)
100 100 100 100 100 100 100 100 100 100 100 100 100 100 100 100 100 100 
100 100 100 100 100 100 100 100 100 100 100 100 100 100 
##$AQSEQ= 0
##$AQ_mod= 3
##$AUNM= <au_zg>
##$AUTOPOS= <32 >
##$BF1= 250.13
##$BF2= 250.13
##$BF3= 250.13
##$BF4= 250.13
##$BF5= 500.13
##$BF6= 500.13
##$BF7= 500.13
##$BF8= 500.13
##$BYTORDA= 1
##$CFDGTYP= 0
##$CFRGTYP= 5
##$CHEMSTR= <none>
##$CNST= (0..31)
1 1 145 1 1 1 1 1 1 1 1 1 1 1 1 1 1 1 1 1 1 1 1 1 1 1 1 1 1 1 1 1 
##$CPDPRG= <>
##$CPDPRG1= <>
##$CPDPRG2= <>
##$CPDPRG3= <>
##$CPDPRG4= <mlev>
##$CPDPRG5= <mlev>
##$CPDPRG6= <mlev>
##$CPDPRG7= <mlev>
##$CPDPRG8= <mlev>
##$CPDPRGB= <>
##$CPDPRGT= <>
##$D= (0..31)
0 1 0 0 0 0 0 0 0 0.06 0 0 0 0 0 0 0.0002 0 0 0 0 0 0 0 0 0 0 0 0 0 0 
0 
##$DATE= 1144327859
##$DBL= (0..7)
120 120 120 120 120 120 120 120 
##$DBP= (0..7)
150 150 150 150 150 150 150 150 
##$DBP07= 0
##$DBPNAM0= <>
##$DBPNAM1= <>
$$ [...]
##$SUBNAM7= <"">
##$SUBNAM8= <"">
##$SUBNAM9= <"">
##$SW= 20.6930455092707
##$SWIBOX= (0..15)
0 0 3 0 0 0 0 0 0 0 0 0 0 0 0 0 
##$SW_h= 5175.983436853
##$TD= 65536
##$TD0= 1
##$TE= 294.16
##$TE2= 300
##$TE3= 300
##$TEG= 300
##$TL= (0..7)
0 120 120 120 120 120 120 120 
##$TP= (0..7)
150 150 150 150 150 150 150 150 
##$TP07= 0
##$TPNAME0= <>
##$TPNAME1= <>
##$TPNAME2= <>
##$TPNAME3= <>
##$TPNAME4= <>
##$TPNAME5= <>
##$TPNAME6= <>
##$TPNAME7= <>
##$TPOAL= (0..7)
0.5 0.5 0.5 0.5 0.5 0.5 0.5 0.5 
##$TPOFFS= (0..7)
0 0 0 0 0 0 0 0 
##$TUNHIN= 0
##$TUNHOUT= 0
##$TUNXOUT= 0
##$USERA1= <user>
##$USERA2= <user>
##$USERA3= <user>
##$USERA4= <user>
##$USERA5= <user>
##$V9= 5
##$VALIST= <valist>
##$VCLIST= <CCCCCCCCCCCCCCC>
##$VD= 0
##$VDLIST= <DDDDDDDDDDDDDDD>
##$VPLIST= <PPPPPPPPPPPPPPP>
##$VTLIST= <TTTTTTTTTTTTTTT>
##$WBST= 1024
##$WBSW= 4
##$XGAIN= (0..3)
0 0 0 0 
##$XL= 0
##$YL= 0
##$YMAX_a= 413748
##$YMIN_a= -410479
##$ZGOPTNS= <>
##$ZL1= 120
##$ZL2= 120
##$ZL3= 120
##$ZL4= 120
##$ABSF1= 16.522
##$ABSF2= -4.171173
##$ABSG= 5
##$ABSL= 3
##$ALPHA= 0
##$AQORDER= 0
##$ASSFAC= 0
##$ASSFACI= 0
##$ASSFACX= 0
##$ASSWID= 0
##$AUNMP= <proc_1d>
##$AZFE= 0.1
##$AZFW= 0.1
##$BCFW= 0
##$BC_mod= 0
##$BYTORDP= 0
##$COROFFS= 0
##$CY= 12.5
##$DATMOD= 1
##$DC= 0
##$DFILT= <>
##$DTYPP= 0
##$F1P= 14.0000005364418
##$F2P= -0.99999901652339
##$FCOR= 0.5
##$FTSIZE= 32768
##$FT_mod= 6
##$GAMMA= 0
##$GB= 0
##$INTBC= 1
##$INTSCL= 1
##$ISEN= 128
##$LB= 0.3
##$LEV0= 0
##$LPBIN= 0
##$MAXI= 10000
##$MC2= 0
##$MEAN= 0
##$ME_mod= 0
##$MI= 0
##$NCOEF= 0
##$NC_proc= -3
##$NLEV= 6
##$NOISF1= 0
##$NOISF2= 0
##$NSP= 0
##$NTH_PI= 0
##$NZP= 0
##$OFFSET= 16.522
##$PC= 1
##$PHC0= 19.76007
##$PHC1= 6.442896
##$PH_mod= 1
##$PKNL= yes
##$PPARMOD= 0
##$PSCAL= 4
##$PSIGN= 0
##$REVERSE= no
##$SF= 250.13
##$SI= 32768
##$SIGF1= 0
##$SIGF2= 0
##$SINO= 400
##$SIOLD= 32768
##$SREGLST= <1H.CDCl3>
##$SSB= 0
##$STSI= 32768
##$STSR= 0
##$SW_p= 5175.98343685301
##$SYMM= 0
##$S_DEV= 0
##$TDeff= 65536
##$TDoff= 0
##$TI= <Analysis number 999999
Compound Code 99
Book Reference 9
Project Code 9>
##$TILT= no
##$TM1= 0
##$TM2= 0
##$TOPLEV= 0
##$USERP1= <user>
##$USERP2= <user>
##$USERP3= <user>
##$USERP4= <user>
##$USERP5= <user>
##$WDW= 1
##$XDIM= 32768
##$YMAX_p= 426819737
##$YMIN_p= -24785
$$ End of Bruker specific parameters
$$ ---------------------------------
##NTUPLES= NMR SPECTRUM
##VAR_NAME=  FREQUENCY,     SPECTRUM/REAL,   SPECTRUM/IMAG
##SYMBOL=    X,             R,               I
##VAR_TYPE=  INDEPENDENT,   DEPENDENT,       DEPENDENT
##VAR_FORM=  AFFN,          ASDF,            ASDF
##VAR_DIM=   32768,         32768,           32768
##UNITS=     HZ,            ARBITRARY UNITS, ARBITRARY UNITS
##FACTOR=    0.157963299565203, 1,           1
##FIRST=     4132.6476996994, 0,             0
##LAST=      -1043.33573715361, 0,           0
##MIN=       -1043.33573715361, -24785,      0
##MAX=       4132.6476996994, 426819737,     0
$$ Real data points
##PAGE= N=1
##DATA TABLE= (X++(R..R)), XYDATA
$$ [...]
23827 -1089 1309 -1887 -361 -5254 -14543 -13092 -2839 2091 2410 -1312 3922 1643 -4357 -709 6481
23812 6481 8542 9524 8508 -2317 -64 -1723 -2053 2048 -1967 -407 2259 2223 -2171 1985 -3464
23797 -3464 -5940 -276 3706 998 -709 627 1500 1510 6244 9518 8091 7857 2718 2127 -3648 -11186
23781 -11186 -12301 -7583 -1047 1057 2073 1353 -7245 -6074 4396 4028 -554 -200 1377 435 -73
23766 -73 -3737 -6252 -6 3380 -2025 -8249 -6186 -3204 -6455 -7690 -4004 1173 4321 3268 -298
23751 -298 3765 1074 -4144 -5100 -2530 -6417 -11519 -11280 -6825 -4043 -3217 -5286 -3767 3775 4297 2150
23735 2150 642 3245 2243 3375 6434 7501 11918 7524 -459 -1199 1165 3522 3521 6538 6062 8146
23719 8146 7740 8171 1702 4606 3562 745 -1994 -1716 -7464 -7173 -5644 -163 2157 -2947 -4017 -781
23703 -781 1204 6817 5054 587 1876 928 -27 -143 -6453 -4751 -8281 -14263 -19216 -15994 -10151 1366
23687 1366 1124 -3272 -4786 -7135 -9506 -1014 608 -1774 -11521 -15442 -9954 -5504 -5644 -15910 -11119
23672 -11119 -5518 16 -4487 -11210 -14792 -10802 -11078 -16238 -8589 -2371 -7999 -7484 -4219 -3316 -1550
23657 -1550 3685 7208 9533 7568 4663 365 -3282 -4594 -3544 -8520 -9156 -12561 -11312 -10281 -7046
23642 -7046 -5214 -5135 -5122 -2505 -2481 -6762 -5305 -7084 -11275 -9848 -10301 -7480 -7096 -6469 -9605 -11510 -7969
23625 -7969 -6304 -5557 -3749 -3092 4235 7658 6093 3575 3467 -1968 -945 -4474 -7238 -3967 -2553
23610 -2553 396 2548 1336 6162 9042 1133 -6570 -4355 -10166 -11493 -1455 3205 -3182 -7969
23596 -7969 -9314 -8860 -5185 -5426 -837 2934 11151 14014 15065 7896 572 992 -23 6767 10428
23581 10428 4980 2762 -615 -7415 -8728 -722 -3402 -4044 610 47 -1217 303 -1224 -2809 -388
23566 -388 -929 22 2785 6569 6578 532 1432 4998 4515 3258 -1901 -5091 -4028 -2669 2529 3538 -1023
23549 -1023 -3025 -6746 -2343 1035 -1981 -1896 -2870 -5567 -5709 -4001 -1246 -2282 166 3854 989 665
23533 665 198 -1764 -4384 -5932 -3437 -3602 -4747 -2413 -1727 -3397 -7525 -7305 -9092 -10708 -13687 -10232
23517 -10232 -9677 -8563 -3841 -4939 -2013 -385 4 2474 1367 -152 -2118 1595 1415 368 5575
23502 5575 4384 1136 4878 7590 12771 12998 13227 11800 10903 4997 288 -3442 -7213 -6660 -412 -814
23486 -814 535 -5316 -9132 -10319 -6626 -8251 -8975 -8069 -5662 -3391 84 -2049 -4401 862 -2855
23471 -2855 2038 -1984 -1444 -1186 -3079 -6710 -7199 -8900 -12796 -12039 -8950 -3227 -5638 -8129 -4368 3599
23455 3599 5305 2976 -1282 -4453 -508 807 3182 5053 -1871 -1012 5217 40 -4745 -3045 -2899
23440 -2899 242 2407 6044 4377 7456 13148 10193 6546 3445 -1407 3099 10915 13599 9252 3223
23425 3223 -880 -5038 167 4477 1546 -2209 -10 4440 4446 -1099 -526 4111 5402 3657 -1270 -3614
23409 -3614 -467 5527 4205 2450 -807 -2337 -3640 -4737 -1132 5406 6283 4484 4895 1824 2472
23394 2472 3585 4131 4989 8550 6464 4502 6402 2632 205 4585 2637 4878 5412 -110 2177
23379 2177 6573 7792 1337 848 -1302 -7172 -7741 -7419 -3934 2661 6625 -1030 -4425 -1197 -3478
23364 -3478 -5145 -5460 -5991 -7219 -8467 -6852 -9502 -16097 -15472 -7274 -6041 -9391 -8649 -5669 -2975 -4965
23348 -4965 -8487 -12370 -11814 -3319 1838 2451 9524 14950 15259 12221 6155 -4366 -10651 -6631 805
23333 805 2757 -7442 -10218 -10294 -7273 -7308 -2855 -3824 -9127 -8995 -1058 1934 -1001 7311 14193 6752
23317 6752 -243 2031 278 -3612 -3209 -5323 -6885 2515 -849 -2242 -4244 -8297 -13327 -15131 -16324
23302 -16324 -11349 -12116 -9653 -3951 -4151 -3539 -3651 -6133 -10880 -5482 -1808 -4186 -2994 2770 9055
23287 9055 5529 7305 6270 569 -3325 -1607 186 3124 4378 5209 6182 5938 3832 -4111 -5233
23272 -5233 1493 2118 -2545 504 -1264 -4089 -4201 -5772 -5067 -7894 -6865 -2021 -10908 -12812 -3248
23257 -3248 -2207 -4763 -7267 -3165 -751 -3218 -6332 -7653 -11583 -7726 -7745 -4779 -641 -903 -2758
23242 -2758 -1728 -1194 -3770 -2629 3139 7262 2040 -870 -5390 -5113 -3997 -5161 -656 -1971 -5353
23227 -5353 -3938 112 4132 2310 -815 -281 -4756 -8843 -11493 -5066 -2327 -1329 1453 -761 -6798
23212 -6798 -10487 -5463 639 1779 2468 805 -2932 -5266 -4414 -7714 -8471 -6490 -521 752 1937
23197 1937 -1274 -1660 -2418 -2858 -2129 -1386 -9462 -15276 -11317 -13539 -11118 -5483 -4560 2504 3011 -1467
23181 -1467 -5522 -7731 -4957 -969 -4596 -616 6098 11296 9180 6521 4879 10155 9580 7447 3647
23166 3647 7796 7392 9325 12890 10108 4361 7839 13746 12894 11624 13028 5793 3713 415 -7122
23151 -7122 -5565 -1181 4054 2650 -1358 -2073 -3202 -5447 -4927 -3500 -3476 -1763 4892 1516 -3831 -3119
23135 -3119 -1205 1026 -1005 -2359 -2206 1073 5329 4214 7434 -1503 -6543 -1741 -3481 -1387 -4409
23120 -4409 -10305 -10155 -9819 -10377 -5843 3295 443 -572 4006 2689 5297 10202 5981 2562 -1455
23105 -1455 -656 -1328 4496 2562 -1651 -3147 -560 962 111 1585 -2852 -1300 2127 494 -2287
23090 -2287 6889 10235 10019 4712 5534 7154 9361 5738 12090 9544 3725 -311 -798 4050 6997
23075 6997 786 -614 580 3808 9496 2217 -2229 -9140 -8290 -7141 -3162 4206 3224 -2595 -7252
23060 -7252 -4347 -1995 1214 4899 170 -3914 -4163 676 1939 2052 3908 2394 5106 7675 4723
23045 4723 4521 -3192 -7866 -3906 1063 -1380 -1456 -3348 -4917 -798 5622 11946 8952 4833 7629
23030 7629 10388 9198 1261 -5268 -8097 -7457 -3296 -3287 -4790 -4395 -902 -5 -3980 -9687 -15611 -11753
23014 -11753 -6204 -3861 -83 1089 -8645 -12182 -10588 -6628 -7702 -13342 -17385 -14442 -11682 -12023 -14624
22999 -14624 -16373 -12970 -8247 -8751 -12527 -13333 -10301 -10389 -2769 2659 -3640 -4065 -3518 -1699 4236 8754
22983 8754 3103 -4280 -4886 -6954 -6158 -2311 -1821 4687 68 -7527 -5074 -6508 -8880 -2730 292
22968 292 -1060 -818 -2883 -2647 -7505 -4985 -5957 -5430 -5385 -1524 632 3214 5043 4891 -4442 -5650 -1813
22951 -1813 3890 3757 4550 4767 4079 8003 7969 4940 4706 1226 1922 13414 13688 7261 8950 8207 6747
22934 6747 7455 5528 10110 8108 -569 -8249 -5602 -2367 -3283 -47 3179 -278 -527 78 1119 3970
22918 3970 6375 9004 4409 363 557 -5667 -7815 -4871 -3408 -2908 -6562 -5986 -4747 -8415 -12065
22903 -12065 -7496 -5710 -5742 -7180 -7966 -6559 -1860 1927 -1256 636 -1304 -4494 -1750 -1053 578
22888 578 251 -904 -36 -3696 -363 -3941 1631 -985 -877 1924 -4453 -6107 -8267 -5705 -4722 -1109
22872 -1109 2674 1075 -734 -7265 -12684 -12891 -12739 -125 2037 -8982 -4722 6466 7181 8732 5743
22857 5743 305 -1425 -2835 -4704 -6491 -6466 -4439 -3689 1423 4516 5260 3378 5585 5193 5803 4086
22841 4086 -2856 -652 3408 -117 3879 2493 -5256 -10884 -6747 2797 4914 513 1460 -77 -4869
22826 -4869 -1451 2055 2502 2485 1255 3616 4454 7258 8801 9208 3631 -1822 -3389 -2145 -86 4794
22810 4794 3171 3927 193 -11034 -18684 -18091 -14990 -9984 -937 2014 481 -478 910 7970 12768
22795 12768 10413 10138 7999 5947 7313 7292 4141 3119 3513 2003 -889 -9148 -14010 -4351 1998
22780 1998 -4176 -7885 -7093 -2304 -3606 -12041 -12049 -12577 -4384 353 -1525 -3689 4394 2656 -6314 -5164
22764 -5164 -12435 -7095 -3594 -9256 -14524 -12664 -14603 -13992 -7483 2366 3415 3326 -2894 -2986 2756 -4201
22748 -4201 -11152 -11571 -7014 -5118 337 1558 1860 -3165 -5949 -5673 -7648 -2100 1581 5275 -1665
22733 -1665 -7804 -11746 -13005 -11662 -8983 -9607 -7099 -2746 9863 10703 3105 -1605 -909 9002 11577
22718 11577 5513 6962 6109 770 1205 2519 587 4996 2862 385 3197 4945 9125 1112 -4753
22703 -4753 -7449 -4903 1289 3832 2441 284 -5211 -7519 -9866 -8467 -3994 -3051 -2191 -2391 1618
22688 1618 4581 3452 -4456 -12086 -12184 -5674 -779 -278 -3352 -4617 -2787 -3905 -7836 -5675 -6155 -1200
22672 -1200 -5760 -5762 -6232 -9490 -9960 -8929 -8343 -2576 -2281 -7057 -2767 3518 3059 3821 2642 4214 5157
22655 5157 5912 4606 1637 4452 7748 9647 5693 344 -3288 -3098 -1725 789 -421 3607 7356
22640 7356 11642 12580 8245 306 4695 7748 -2825 -8415 -8442 -10975 -13417 -7593 -5362 -6142 -1071
22625 -1071 2906 2883 445 52 -869 -5071 -11673 -13553 -8457 -6003 -2974 -1014 -6556 -6786 -1756 -4182
22609 -4182 -5148 -9459 -8185 -7835 -3631 123 2894 2274 -3453 -3581 -3828 -1392 1242 1380 336 -3599
22593 -3599 2749 5480 350 -4655 -11543 -13464 -10806 -9441 -11760 -15708 -11573 140 -546 -5024 -5797
22578 -5797 -3414 2434 2417 -3434 1603 8792 10703 8218 666 -5695 -7298 -12079 -11605 -10907 -7394 2073
22562 2073 542 -4566 -7 -2953 -4391 -8083 -10549 -12860 -9579 -6365 -12496 -11277 -9872 -8853 -7010
22547 -7010 -11890 -9179 -505 2016 -3381 -6593 -6071 -1665 2303 2236 -212 6722 4569 2688 -1803
22532 -1803 -7062 -11046 -6516 6741 15578 11217 4918 3896 -338 -6998 -4032 -260 1362 -475
22518 -475 -2282 -3255 -4491 -9190 -9209 -10784 -11384 -5677 -3428 -7861 -5411 -7927 -7163 -1636 1921 5837
22502 5837 2742 768 1596 721 1103 -2420 -5053 -3616 -3534 -1008 -5158 -11313 -7056 -2296 -2508 -4495
22486 -4495 -451 2678 -697 -4292 -7419 -11627 -19145 -17255 -11835 -9299 -1371 -1339 -6976 -6854 -10850
22471 -10850 -16155 -8633 599 -7233 -6191 -2821 -480 -51 -2078 -1699 -1839 -6019 -5869 -5149 -4036 -2695
22455 -2695 162 2566 499 -6328 -8278 -14241 -17089 -17115 -15800 -11066 -11178 -11868 -7086 -106 5097 5096
22439 5096 5131 5722 3896 -3149 -4003 3122 3174 12 4851 2749 -4743 -2967 -813 1708 -1747 -2230
22423 -2230 -3896 -5276 -3923 -2403 436 1818 -3447 -8220 -6564 -4802 -4941 -4787 608 -1322 -9266
22408 -9266 -9188 -4291 4357 7222 -3578 -6789 -3087 1131 -1189 -2919 -5908 -1651 -968 -2275 -4773
22393 -4773 -994 3118 4880 6798 11490 8814 5215 753 -5412 -2995 -4645 -8137 -7973 -5524 524
22378 524 3998 9774 8279 3448 6946 8877 3081 -6001 -4295 -4513 -3214 4069 411 -2308 -8656
22363 -8656 -13921 -9537 -2203 -5484 -3754 744 709 777 -1172 -781 -4061 -12080 -11686 -7297 -3773 -4529
22347 -4529 -7544 -7941 -8128 -8475 -8105 -1593 -2442 738 5726 7232 4918 335 -3270 -7579 -3365 4800
22331 4800 3026 99 932 325 -3088 -6435 -9434 -8782 -8394 -10554 -6213 2222 3237 4804 7429 4742
22315 4742 1081 1563 1497 -2782 -174 -1763 -5056 -5861 -749 6845 9184 9005 5307 -437 -3158 -8271
22299 -8271 -13480 -11848 -7193 -2353 3579 5480 2800 -3614 -760 3184 3921 565 -1643 -1852 -749
22284 -749 -5392 -6709 -12834 -1928 8307 7190 7750 7144 822 -10370 -16178 -16281 -17679 -8846 -3890
22269 -3890 1356 5317 6303 8073 4230 -2805 -8868 -7415 117 -1768 1892 -624 -1874 -3687 -7262
22254 -7262 -8107 -12029 -4896 -2867 -6638 -7495 -2259 2363 570 -4127 -9717 -3290 -5063 -1406 3026
22239 3026 513 -1865 -3953 1088 -51 4486 1930 -5779 -7280 2769 6906 -1396 -4302 -3788 754
22224 754 3211 1089 -2301 -2243 -8371 -12908 -11675 -2902 -3217 -4790 -3491 -1765 -206 -2200 -5962 -11991
22208 -11991 -16660 -14539 -6650 1320 -1807 -8779 -6288 -2436 -1055 -2915 -1344 2226 -775 -3583
22194 -3583 1385 6735 6362 6346 8943 10355 8763 9806 12087 6877 4835 2094 719 4742 -651
22179 -651 -1958 -2907 -828 1230 -384 -8188 -13921 -15282 -10925 -1867 -1397 -3862 -3594 554 3030 2958
22163 2958 -177 -43 -1297 -4252 -1038 3523 2221 -4162 -698 8010 22591 27550 32400 31755 27098
22148 27098 19746 9923 2480 -1048 -3201 96 810 2944 -377 -2489 -3040 543 629 2685 3152 6510
22132 6510 6612 1733 -3808 -11163 -2968 3859 6565 3527 4074 6923 -1173 4141 11390 4379 2123
22117 2123 -3291 -5224 -9188 -11424 -13074 -9154 -4506 -2330 -288 3246 4850 12424 13114 19524 19964
22102 19964 13598 2344 6348 9267 6623 7130 5991 5593 5003 9382 7645 2072 1478 4276 2819
22087 2819 2366 1835 429 1116 3578 -4906 -6137 -6086 -11528 -9296 -7442 -10876 -17098 -14171 -5031 -5063
22071 -5063 -7420 -6839 -9958 -8475 -4278 -8687 -11083 -12472 -17840 -12002 -3166 665 -2346 -7386 -5988
22056 -5988 -8595 -8499 -13464 -15798 -8260 -3875 -4743 -6684 -7777 -9552 -8227 -3615 -2036 -2145 -4692 -6588
22040 -6588 -7128 525 3114 3665 5933 10493 4702 -891 511 -5265 -5399 -3223 -7150 -11281 -6826
22025 -6826 992 -3530 -5941 760 5243 9717 6972 229 -479 -162 1251 -498 -5473 -6822 -8198
22010 -8198 -1741 7697 5824 1703 -2667 -491 1958 3913 3204 1076 -1140 -1071 -16 -1815 -819 4460
21994 4460 4176 1763 430 766 95 -5268 -10296 -13468 -5900 -6948 -320 4611 836 6285 7495
21979 7495 9113 -1523 -6704 -3603 -4104 -2335 2676 1045 -7256 -6421 2365 8471 5986 4614 7373
21964 7373 10490 10586 6811 2728 -1233 1718 -2629 -4622 -5475 -4662 -278 -1669 -12659 -16929 -11421
21949 -11421 -8242 -3020 4181 8287 5359 7340 3864 1443 -2938 1055 7399 4713 -360 -7393
21935 -7393 -1604 1661 5497 11051 9936 4654 2323 -3390 -8649 -14954 -10851 -3906 -7317 -9139 -2779
21920 -2779 -2153 6328 5109 65 -2251 -3764 -5923 -4941 -5866 -668 -3369 -5454 -5276 -7817 -5951 200
21904 200 -768 -3519 1755 8329 6802 7147 7863 6601 9100 3512 -4358 -4502 -630 3632 2271 -341
21888 -341 -3766 -10944 -13593 -10142 -9870 -6243 -5122 -3537 -354 -5356 -11201 -11363 -10778 -14129 -10240 -13102
21872 -13102 -12185 -11173 -12700 -10099 -10532 -11579 -5225 967 4351 6822 3752 -802 -445 -134 -90 2900
21856 2900 5600 1413 97 -702 -4231 -6527 -3811 6005 1647 -2244 -7459 -12033 -9672 -8659 -10378
21841 -10378 -2996 -5513 -15818 -16481 -12086 -7721 -2089 1387 244 -1534 474 -3460 -5349 -2888
21827 -2888 2712 -1414 -11025 -8517 -382 -7627 -10375 -10745 -6659 -3885 -10297 -9850 -5668 -828 -2000
21812 -2000 -1120 4038 -473 -4351 -3318 789 5445 16763 11205 3118 2926 1720 2563 2887 -201
21797 -201 -1453 -1925 -33 4631 2411 -1098 3336 9766 11239 3919 -1429 -3632 -1132 -2872 3092
21782 3092 3069 2835 4701 8009 3451 2996 1323 -2484 -3449 -4830 3416 9372 3881 -1718 -3001 -1247
21766 -1247 -7895 -11334 -4158 -1173 -7646 -6177 1930 5409 12162 10128 -2660 1357 785 -799 -4170
21751 -4170 822 -1089 -6692 -220 6583 3745 3485 458 -594 -6069 -5052 4685 8979 8176 3294
21736 3294 2979 2479 3326 -1114 -1645 -7058 -3050 3289 6179 5968 491 -2948 -1977 -3422 -8406 -4793
21720 -4793 -4102 -610 1607 -5221 491 10311 3374 -642 -457 -1496 2320 6787 7936 9722 9635 8140
21704 8140 4079 533 5349 5606 2628 -10102 -14130 -10176 -3311 -1124 -6693 -5726 -1932 -4993 -7134
21689 -7134 -3706 -3053 -241 -4165 -10301 -18794 -15789 -5863 -6151 -2349 -3510 -951 -2556 -5745 -7842
21674 -7842 -16894 -18501 -15150 -13814 -14355 -9277 1767 4947 8310 8287 137 -1961 3829 1552 -5763
21659 -5763 -7454 -346 1487 3539 5173 3796 -3238 -5009 -3133 1132 1284 3396 1637 -442 -931
21644 -931 -1063 -3799 -1602 -1706 1331 -1107 -4007 -13235 -13353 -9615 -9275 -2919 -8480 -5528 -4759 -4743 3712
21627 3712 5513 839 -7441 -6475 -4792 -5199 -5428 -3956 -3390 -3248 2973 7629 3857 -129 -1591 -6183
21611 -6183 -4701 -81 -3578 -11395 -10061 -6296 -5827 -9224 -10864 -10079 -8344 -5163 -3502 -2025 -7584
21596 -7584 -16114 -14012 -2877 -97 -1440 3073 8848 2619 5377 4139 3542 -24 -254 -3915 -12754
21581 -12754 -11742 -4770 -5366 -7503 -10199 -10030 -3347 2554 4267 3842 -624 -3736 -822 1169 9822
21566 9822 11022 3232 -8637 -10563 -9179 -9769 -4373 525 1738 -2272 161 4609 4630 -5466 -11789
21551 -11789 -9868 -9421 -10638 -11288 -3254 2357 -1182 -9923 -11682 -2889 10469 11383 4817 -8974 -10763
21536 -10763 -9761 -4692 -10 916 -2959 -6256 -9632 -8068 -5085 -5226 -3344 -4098 -9291 -6305 -1821
21521 -1821 4245 7419 7651 2923 154 8385 9312 3793 1506 -2336 1178 -821 -5418 -4424 -6367
21506 -6367 -8926 -8628 -4440 932 6493 3321 -7767 -6327 -9063 -8390 -1703 -249 2126 -402 -7839
21491 -7839 -11840 -10996 -15896 -14181 -5602 549 -5388 -9115 -5010 -6451 -3888 404 -1913 -1341 -731
21476 -731 1832 5207 -2808 -10204 -7361 -7132 -5560 -9036 -9520 -188 -224 -7061 -9989 -8466 -7340 -5829
21460 -5829 -6124 -7302 -8711 -8646 -10411 -12787 -6038 -6975 -2626 6926 11155 2087 -2256 233 -527 973
21444 973 3145 521 -4447 -1175 -4241 -10469 -11467 -3297 -842 -3654 -12071 -13435 -6182 -7059 -16369
21429 -16369 -10647 -12504 -17867 -15365 -9936 -13165 -6353 -8248 -11713 -8991 -5063 -8649 -14491 -17126
21415 -17126 -9771 -4170 -3422 -2366 -894 -1047 -3288 66 849 1040 -1842 -5462 -5076 -2174 -2981 -2430
21399 -2430 -5221 -8244 -11209 -11163 -11142 -9627 -6586 -6582 -5969 3423 5204 -159 431 1612 1736 -2071 -4284
21382 -4284 4836 787 -59 2919 1841 -2742 545 275 1312 5908 3507 -1029 1948 7516 7827
21367 7827 3985 -2756 -3645 -2459 -1406 -2729 5526 12135 14490 8849 7255 12965 13311 13239 15062 15389
21351 15389 13975 11647 7220 6836 4409 2877 2809 -2166 -5141 -2784 -4959 -8866 -8577 -9996 -10656 -10564
21335 -10564 -13031 -10055 -6527 -6843 -4346 -3229 -5078 -1215 5170 4315 -2819 -6686 -5675 -6639 -4125
21320 -4125 -149 -1896 -4494 5688 7925 2681 2541 1946 -2367 -5386 -6286 -3740 -1689 -2844 -296
21305 -296 4312 3461 2303 -2933 -560 3762 -4668 -6837 -1037 -6025 -9705 -4099 3016 4974 4381
21290 4381 2238 -186 -3426 -11501 -12307 -5829 -6027 -885 -3354 -4823 -1966 -2297 -347 -4979 -5936 -5339
21274 -5339 2316 4737 1960 -5291 -4526 -38 -7492 -13633 -15978 -15440 -8572 -1221 3591 1786 620
21259 620 1043 -1339 -6864 -4212 -3367 -427 -1098 -269 -9637 -7971 -7062 -10567 -12616 -14073 -14065 -8545 -5741
21242 -5741 -4241 416 1537 3310 2422 -3348 -8817 3600 3383 -7437 -11517 -10369 -4974 -2097 -379
21227 -379 -2428 -8900 -4045 1305 870 -10987 -13885 -11410 -1962 3870 5510 -1675 -6748 -1027 -1488
21212 -1488 -7089 -10025 -5632 -1526 -3830 -2092 -613 -6660 -8563 -10227 -6282 -8453 -10897 -13446 -12746
21197 -12746 -6316 -1698 -2188 -1241 498 -3963 -3754 -5654 -11322 -11346 -7473 -201 2239 6927 11613 5582
21181 5582 610 7464 3008 -197 -334 8386 12008 5136 2123 3062 8162 6832 7396 7811 6690 -831
21165 -831 -3435 -3593 1199 2432 2660 1597 -70 -4007 -5118 326 -1165 -6152 -4905 1380 8938
21150 8938 6138 -6146 -8946 -7270 -3885 -3152 -2384 -3165 -1851 602 -3435 -9094 -13633 -11085 -9671
21135 -9671 -5740 -7122 -14342 -9798 -1592 5965 8341 611 -1679 -1226 -6917 -12806 -11233 -7921 -5486
21120 -5486 -5025 -8282 -12339 -13628 -11612 -1289 5468 -657 -7154 -10598 -10415 -14266 -11247 -6561 -2873
21105 -2873 3731 2830 2535 9057 5648 -5713 -11835 -10293 -9206 -6340 -581 2816 615 -8976 -13069
21090 -13069 -10769 -9192 -10609 -10242 -5107 -520 4127 225 4010 -3245 -5998 185 5015 4071 2554
21075 2554 1137 -388 -3140 -1755 -1049 1081 -437 -853 -904 3348 4975 1440 2883 5813 6341 2931
21059 2931 2014 1477 -5705 -10684 -4827 -141 -308 -7106 -8902 -5314 -8550 -12301 -8943 -7712 -12357
21044 -12357 -10788 -4667 1217 -64 -3459 -3294 -1907 -756 -1164 565 1219 -1112 -2363 -4424 -4351 -6939
21028 -6939 -6963 -2785 -5449 -8795 -11288 -7334 -3659 -1485 -6609 -6279 -5499 -6730 -7129 -2322 -5528 -5215
21012 -5215 -2426 1558 3478 3358 -753 -2677 -1519 -1860 -5143 -4997 -2767 -1611 -8169 -6539 -2990
20997 -2990 -5250 -12803 -16992 -12710 -9256 -7082 -8813 -8955 -5558 -8100 -7983 -8571 -6022 96 2639
20982 2639 2631 -347 1264 3624 4915 -682 -4999 -6670 -3725 -4838 -3885 209 -4019 -3667 4272 4349
20966 4349 1297 1624 404 -1891 -2962 -1124 -2228 253 204 -2446 -10372 -10045 -4161 -4362 -6624 64
20950 64 7196 4096 -4730 -7937 -3467 1069 7051 6620 7569 3722 -1848 -3001 -870 4150 9192 16255
20934 16255 23349 15815 12481 10645 9923 7027 1017 -228 -6836 -11382 -12587 -6992 2315 1747 3616
20919 3616 2003 -1989 -3638 -4262 -4939 -5940 -6519 -4048 -3888 -5611 -10685 -4668 -2723 -4788 -4180 842
20903 842 4681 3266 5364 6669 8707 7941 9984 9592 2181 -4472 -7121 -5046 -750 483 4009
20888 4009 2596 1330 -2063 -4645 -6294 -8601 -7024 -6829 -5909 -5756 -6888 -4608 -1859 -2152 -29 816
20872 816 -4577 -8138 -10714 -12711 -13226 -6964 3783 4187 -5273 -9591 -11672 -4434 1121 1769 473
20857 473 -1972 5164 5440 4519 -387 183 -1687 -6111 -9473 -8218 -4127 -3193 -7455 -6601 -1206 -2197
20841 -2197 -466 4883 -4185 -11394 -14118 -9488 -7876 -6828 -6598 -10598 -7352 -5401 -3282 -57 -4945
20826 -4945 -9847 -14298 -9523 -2785 336 4799 -1885 -3374 -4605 -7492 -11646 -13065 -10464 -3407 -1396
20811 -1396 -4353 -8530 -2597 330 4191 3693 -2729 -9645 -11635 -17936 -19409 -11722 -1625 -1327 -4948
20796 -4948 -5486 -2915 -6022 -4337 -4775 -7607 -6189 -1884 -1079 -7340 -9864 -11609 -5064 -229 -5239
20781 -5239 -5620 -2156 -110 1039 4525 4562 8819 5291 2852 5344 547 -4071 3138 3624 237 -10929
20765 -10929 -10888 -7810 -7032 -7823 -7831 -1695 8900 8425 -3037 -10839 -6383 -2895 -1752 6810 10544 2512
20749 2512 -3198 -5617 -5288 -5642 -4703 -1005 3312 2645 3774 -2971 -3747 -4301 -6427 -5022 -10 -1924
20733 -1924 -7698 -9643 -8951 -7932 -6167 -301 -936 -10842 -11491 -9608 -9782 -10106 -15670 -13448 -10667 -8680
20717 -8680 -9634 -2436 2298 -3615 -9529 -4700 -1218 -3509 6101 8598 3221 -4837 -8409 -3340 -608
20702 -608 -1953 -4382 -3987 1558 3768 -4159 -4835 -2020 -8313 -1230 2805 -1234 -3218 -2175 -6916
20687 -6916 -6941 -5642 -5524 -8764 -4704 2008 5838 4671 5117 1237 -5086 -7669 -5003 -1111 669 7340
20671 7340 4592 6922 3576 -6678 -6754 -7629 -11177 -11145 -3969 6282 6892 -6274 -15883 -11574 -5653
20656 -5653 -8919 -10265 -8226 -6890 938 5903 2292 47 -1470 -1057 -4757 -7321 -7514 -6438 -3644
20641 -3644 -2819 -2801 -3010 -960 4308 926 -5246 -1264 1414 -3757 -5105 -3598 -191 -1465 -4361 -2292
20625 -2292 -7300 -5210 580 8058 9342 8265 10439 2114 -1052 -6772 -6709 -4729 -304 -2465 -2862
20610 -2862 901 408 3409 2299 1452 4048 2054 -306 -1146 5214 7991 2171 -8436 -6634 -1088
20595 -1088 -657 -3200 -2833 -7674 -1561 -2618 -5300 -7162 -8203 -7256 -5483 -3563 -6128 -6662 -6037 -1616
20579 -1616 1566 853 903 -3352 -4047 -9286 -11745 -8698 504 -23 -5533 -9226 -2293 6579 3060 1315
20563 1315 -3335 -10316 -5636 -4491 219 4059 5453 6318 6905 4918 1117 -3114 -3673 -4277 -2369 -6194
20547 -6194 -12911 -9694 -1874 2544 3720 3643 -410 -2398 1849 1658 550 -174 -1159 880 5167 -1814
20531 -1814 -8766 -3867 1087 1252 1034 -423 1055 1415 -1358 -12654 -8131 -4608 -6650 -4897 -9884
20516 -9884 -7733 -4339 -3391 284 1056 2854 672 -5618 -4463 4132 9421 9463 1946 -3501 -6185 -4648
20500 -4648 -5454 -8576 2182 5563 5586 10077 8571 2171 -1776 2327 9458 7957 -1339 -3787 -3132
20485 -3132 -4976 -2734 175 1860 2376 540 -4255 -6753 -5473 -11686 -11949 -4431 72 5653 4755
20470 4755 6191 3136 2415 -4161 -5784 -7923 -12149 -7023 -966 -6740 -11332 -13272 -7954 4673 10149
20455 10149 6865 4699 3455 880 841 -3593 -9374 -9274 -1383 3619 3848 -30 -1098 -2435 -6230
20440 -6230 -6911 1371 586 -4025 66 11816 15785 15270 17767 11429 1744 1905 1640 8716 10648 5663
20424 5663 1758 1783 -6203 -4459 4808 10425 5159 -1936 -2285 -3694 -190 961 2405 -4652 -4049 2152
20408 2152 193 -5350 -3606 2151 -967 -1296 3402 2509 2522 -3621 -1260 2487 4469 -3109 -2880 4342
20392 4342 4645 3392 6215 5727 7439 -1509 1723 4037 -1005 -2592 -1786 203 -3056 -1157 1693
20377 1693 -390 -6551 -11979 -18136 -12344 -10379 -6982 855 3310 2920 3093 3719 7151 6614 8246 6629
20361 6629 -1840 -7535 -9191 -11034 -11543 -7793 -3911 -9115 -7615 -8647 -13381 -9171 -7746 -4931 -8361
20346 -8361 -8789 151 5109 5433 5193 -458 -5937 -4488 -4328 594 3200 1924 -6306 -7768 -8078 -5700
20330 -5700 -3821 -5433 -338 1589 -1216 -1209 -1753 -67 -751 -8989 -11474 -9356 3692 13614 8529 3879
20314 3879 -4356 -6360 -1204 -143 -49 -1603 -342 4296 1479 -4112 -4962 910 494 -3386 963 5151
20298 5151 5332 4555 1 -5708 -12529 -12535 -5537 -1082 4720 1565 232 -27 995 -2636 -3728 -5388
20282 -5388 -11488 -11584 -10928 -8346 -8747 -6652 -2323 4761 4528 933 -1615 -2641 -205 -2955 -1846 -2841
20266 -2841 1292 4717 -1482 -1749 -3352 -4286 -6784 -4545 4166 4290 1474 712 -5378 -10845 -10821 -6028
20250 -6028 -7387 -1726 1566 1995 7084 5862 6260 8046 10469 11676 4363 -2285 -413 2774 4000
20235 4000 3479 874 -2413 1314 482 1512 1192 1007 2539 -852 -3989 -7974 -18886 -19862 -13088 -7799
20219 -7799 -10867 -11101 -10107 -154 6368 3316 801 -4995 -9487 -5604 2290 -25 -6981 -7547 -12036
20204 -12036 -7081 -4464 -1486 -2762 1877 4190 6214 11262 11252 9480 6655 4444 3775 3967 5148
20189 5148 -1764 -7061 -946 5198 2780 1140 2198 1940 -2588 -4128 -6042 -5684 1175 8008 15300
20174 15300 14377 9780 6096 3856 1109 2796 -1172 1837 3728 2465 3029 -1582 -3554 -7549 -3619
20159 -3619 2605 5988 3867 -1719 -3340 1508 5478 7086 11161 5352 -355 -715 -537 -1127 1376
20144 1376 -1485 -4633 -6205 -3280 4975 8279 5183 -1188 1045 7121 8760 6605 4519 -2790 -4538
20129 -4538 -7102 -11622 -9904 -3225 1625 4787 9187 8753 5564 712 1341 2645 -982 1315 3493
20114 3493 3823 5103 311 -3288 4925 5708 2901 4031 2487 -257 -529 -1828 -5368 -4943 -412 -3187
20098 -3187 -5105 -3701 -4956 -4303 -4150 -6079 2522 -432 120 314 9644 4222 469 1543 1947 1075
20082 1075 -4175 -7091 -7613 -10274 -7685 -2139 1148 524 876 -866 3952 5254 -1745 -9472 -11997
20067 -11997 -8019 -3299 796 -7672 -12690 -7713 -1392 3279 6848 6394 5444 486 -1200 3388 6400
20052 6400 4974 -3428 -9702 -9018 -5157 -1796 4586 9031 -4363 -7147 -8340 -6306 -154 5157 11121
20037 11121 7499 7644 3530 3459 3455 264 1636 2204 1355 -1083 -2228 -3857 -5083 -2341 -3314 1253 4485
20020 4485 3765 4086 -1328 -846 4229 7697 -1351 700 -1943 -1404 -6998 -9370 -11280 -7535 454 6541
20004 6541 4776 3061 3641 5303 7237 5442 11491 9536 3809 -1950 -3199 5100 12327 6410 202
19989 202 2703 3179 2501 4072 4515 3028 8902 8844 579 2719 8496 13331 7058 3696 -1413 -3627
19973 -3627 -693 -5708 -4601 -1422 1378 5837 7701 11877 10708 13511 14637 8203 442 -189 812
19958 812 -4532 -5230 -1881 -4977 -2378 4940 3642 5689 6516 10024 9607 9923 3801 6545 1060 -2395
19942 -2395 -4855 -3010 776 -148 5477 10438 9210 5189 2329 -2277 -5567 -3198 1190 -2168 -3294
19927 -3294 -411 1427 6691 8792 7963 -25 -247 2682 3797 2791 2804 3777 -1878 -3296 -3494 7607
19911 7607 7203 6615 1049 6394 1916 3169 5010 2733 -459 1889 4042 1984 -1133 -6010 -5875
19896 -5875 -59 -1144 -4048 -3156 672 2531 9333 7412 10205 11584 6475 1896 -733 -15 -3664
19881 -3664 -705 1517 12173 15282 13370 10149 7850 7879 7081 5019 5628 3679 -3731 -8081 -11767
19866 -11767 -8528 -5067 -6572 -3119 3261 4931 5277 7396 -3216 -4217 5487 7850 8335 6478 7592
19851 7592 1239 -3375 -4857 -8752 -9182 -4514 -1081 1989 3402 8392 10413 16295 19403 20705 17152
19836 17152 11062 12329 16749 18718 19812 23435 26079 27505 29107 27541 24984 20402 14344 14573 15386
19821 15386 11494 16691 17071 13877 10461 13689 15077 9640 11755 11939 7639 4373 9429 13381 16687
19806 16687 21348 14175 7556 9290 9358 5683 6386 9133 7011 6977 12285 17585 19507 15677 11124 5593
19790 5593 -202 6694 11288 6927 3830 -3024 2640 7733 9969 14186 7195 3840 6830 11646 13295
19775 13295 12201 9979 1951 2108 6701 -381 -5319 -1897 1928 10609 5592 -3383 -4408 -5343 -4423
19760 -4423 -6445 -11348 -8369 -779 2132 917 3098 -588 164 1926 216 -4125 -5394 -2061 1124
19745 1124 -1875 354 6100 7690 8997 7618 12831 16122 16692 18294 11683 10809 13093 7738 8062
19730 8062 11216 15676 12555 4954 3197 8957 11300 9658 11297 19060 15246 8015 8795 3990 4594
19715 4594 5250 -677 -1514 2049 5426 3208 2237 8449 11836 9370 6912 8133 11033 7986 3618
19700 3618 584 2754 5369 6673 7868 7079 5627 1463 -1502 -376 2795 3959 7341 7123 7317
19685 7317 4826 8694 8779 10320 11448 20334 23135 18747 15498 9698 1875 1686 2896 922 3941
19670 3941 4047 95 -1050 2144 7992 13104 6012 -7386 -6135 8651 9791 5652 3548 2262
19656 2262 2846 -1096 -183 7121 6082 4877 12847 16563 12285 16097 14097 11078 14015 13881 10348
19641 10348 4127 5659 4479 5898 4544 880 5456 8870 10845 5530 4956 -2861 -10611 -7290 -5466
19626 -5466 -4114 2226 5574 12676 14785 20246 17323 11718 7492 5859 9328 9309 7777 12307 9914
19611 9914 7020 6325 6011 10947 13979 10410 13174 13934 10835 14647 15338 9617 6787 10649 14775 16371
19595 16371 17934 12621 12684 10853 7097 10920 17519 12980 6141 10816 5458 -388 -1095 98 6574
19580 6574 9463 3740 -1601 -2198 -182 -2415 -289 2082 -594 2617 7535 4177 2580 7534 960
19565 960 1164 -1769 2467 2980 2130 4232 6191 5074 4255 6787 8265 9760 16101 18838 16457 10211
19549 10211 12567 17404 16641 15945 16282 11086 5445 3086 4557 2468 2131 1071 2046 16167 22139
19534 22139 15261 8805 11023 12318 6056 6063 11574 17758 16019 13368 14057 13876 14296 23937 29052 20177
19518 20177 16802 13724 8357 8118 10897 13478 15795 15205 13929 11131 16510 19489 17764 17016 14470
19503 14470 7694 2516 6364 7416 8451 10260 17511 17946 16211 18361 11052 4947 3426 -6685
19489 -6685 -2131 4644 11495 15960 19315 19877 11233 3691 6957 6880 8330 14373 13397 11923 9194 13860
19473 13860 21276 20646 19427 16173 12729 19099 20259 15450 20198 23574 20955 24539 24897 21780 14341
19458 14341 12876 14742 12976 15711 18762 23412 26323 25962 23854 24563 21697 15827 15397 14422 20818
19443 20818 29691 34444 31563 31019 34746 24910 17270 18947 20227 19260 14268 16394 19362 19696 18908
19428 18908 23095 22638 20580 18423 19257 27810 30133 22490 13257 14334 16855 19476 22994 24759 22037
19413 22037 20649 22578 25614 20926 20316 18486 14646 12989 16559 10655 13659 21625 24188 20299 18028
19398 18028 17871 20750 20550 18544 24611 28901 21058 17195 25720 32638 32608 32589 37984 30917 26880 32755
19382 32755 39571 34216 21874 16704 18632 19825 21099 28428 22490 18697 19327 20735 24489 22610
19368 22610 19446 16549 14953 21577 25783 29186 33092 30417 29059 34134 39325 42535 39981 37483
19354 37483 35308 36130 39935 35718 28248 24280 27193 24109 27234 27735 21872 22433 28696 29057 28991 31412
19338 31412 35939 35571 32426 32819 31860 33330 34775 37170 32445 24841 25177 30018 28999 31686 37323
19323 37323 42207 37091 33620 35129 24469 18040 21809 23297 24808 19564 21258 31980 30878 27088
19309 27088 30140 30885 30994 32209 31384 35716 40173 42407 39595 37346 39832 40645 40643 48124 56870 51568
19293 51568 44448 41040 43477 45546 50670 50818 53907 59173 60580 66163 64022 64556 66269 74195 95461
19278 95461 124236 145144 164063 175821 180146 181658 176941 167583 168153 179197 183332 200416 206957
19265 206957 198021 191283 176121 157136 134011 111442 98429 87758 81108 75717 67541 64040 62859
19252 62859 61400 57826 58790 57474 52405 48767 53801 55151 55490 58046 58059 63326 64125 62239 65968 67036
19236 67036 69531 72841 83280 95406 105985 120710 137240 163526 190757 209408 214109 217397
19224 217397 229003 227752 209124 207184 213705 228399 246751 247489 235803 222149 207308 180257
19212 180257 161439 152378 150198 149280 157764 186514 214349 233586 241145 233599 225144 214857 211772
19199 211772 221420 232320 248210 257041 251813 234513 220391 194820 165139 148255 143098 130106
19187 130106 118398 110410 104949 102880 99703 96690 96001 90781 85228 87903 92484 90912 94643 92647
19173 92647 85596 74476 78557 80794 79588 84106 90525 98694 100012 98610 103511 112708 122943 136337
19159 136337 153130 181750 203783 226610 238496 241865 248868 257846 250304 242789 252301 267349 277105
19146 277105 277784 265508 246736 224450 193388 160854 139248 131424 127311 120890 120329 119371 120918
19133 120918 113715 107616 107014 110982 103036 100878 110310 112207 113816 123614 133744 146428 174210 211580
19119 211580 255821 295634 329173 345927 343026 342085 344834 355850 344358 306890 290390 306641
19107 306641 333857 366950 386357 376071 362133 353624 359449 352475 309444 250408 214831 188423
19095 188423 174114 163806 154489 144856 141163 133621 129857 132214 132998 130909 131356 129282 130022 133593
19081 133593 136813 137467 131522 127657 131768 133207 126996 120395 126323 132914 133232 135084 135859 126675 121757
19066 121757 121152 117341 117896 116640 107641 102905 110482 111495 109973 112542 113522 113296 113551 105926 94004
19051 94004 88717 87489 93498 98349 94033 85308 81667 84732 94053 107682 112119 106214 107134 106120
19037 106120 108879 116875 124316 126835 131813 141755 150032 160458 173851 184805 198077 200099 188376
19024 188376 177229 169187 176986 194321 210545 222828 226006 220389 187211 163698 152842 151384
19012 151384 150195 142865 144473 140829 133368 132505 130178 127231 121280 109970 103604 100574 99894 99551 104270
18997 104270 110963 113280 109655 106190 104409 104363 104431 105723 107716 110762 114036 123472 136703 148917 165229
18982 165229 196815 229158 249131 261677 262752 263294 257317 250203 250711 256609 265557 290056 306839
18969 306839 297419 282643 259422 224216 199412 186741 173479 160399 152736 152914 150308 140887 137768
18956 137768 136321 137460 134962 139682 147333 148854 149041 144156 138825 138244 140901 144496 141119 144949 141703
18941 141703 142888 144851 143134 142502 147609 156280 167384 177701 192954 210116 229017 249785 249564
18928 249564 234484 220941 220444 237355 253374 266583 275583 282417 262798 233363 212699 195690
18916 195690 183620 176088 170905 169231 166934 166455 170968 169648 163161 163078 158476 160862 169037 175008 176245
18901 176245 180727 180967 181273 190794 201530 217282 226480 237668 253633 262927 268188 271138 273833 274556
18887 274556 275822 280775 285848 294238 301737 308074 312095 316372 315537 302936 290091 285274 277747 275376
18873 275376 268330 264654 261702 256520 255633 260366 257652 257441 263268 260547 250563 244284 243192 238319 237365
18858 237365 241718 243319 249399 247115 241032 238875 238598 245973 253700 257315 265563 279989 301208 322296
18844 322296 343739 364341 378257 383141 382502 390838 401204 401604 414162 431384 443372 449522 458804
18831 458804 458652 459667 454418 443666 439848 449152 458159 462995 473105 488158 492524 496759 497312 499201
18817 499201 510242 515730 520741 524918 519565 515612 514333 512540 506162 500557 501413 504129 503452 501899
18803 501899 515422 524790 538950 552821 565004 588284 609647 630018 663789 706705 754573 806724
18791 806724 874728 943796 1005694 1071544 1148752 1202536 1249060 1326345 1424961 1548068 1692600
18780 1692600 1840917 1999620 2150344 2278003 2442636 2678393 2998123 3458003 4148397
18771 4148397 5185013 6829161 9532358 13322766 17426305 21673715 25620768 26712694
18763 26712694 26123802 26283245 25376743 22658936 22142634 23902310 26543078 29612924 30406142
18754 30406142 28672015 27400199 25808937 20918124 15404615 12003773 10041323 8793572
18746 8793572 7976569 7417384 7037313 6766657 6572827 6445427 6315513 6181230 6083385 5991168
18736 5991168 5900266 5854097 5824650 5782808 5756991 5736295 5732355 5742393 5798318 5915635 6121496
18725 6121496 6473590 7061893 8023660 9561713 12113127 16048544 20879956 25934652 31400947
18716 31400947 35005263 35066683 35019296 34658942 31282990 29058097 30393344 33390565 37338957
18707 37338957 40456222 39873215 38372487 37435951 33886962 28883741 26957303 27582351
18699 27582351 29364310 31408386 31849305 30818621 30233507 29620272 28234328 27927505 29221797
18690 29221797 31329310 33067566 32220035 29607620 27257612 24072305 19687228 16115536
18682 16115536 13874383 12413575 11386347 10615570 10006636 9511547 9118644 8814364 8577670
18673 8577670 8367976 8156804 7984984 7855679 7728086 7615806 7532095 7468656 7406038 7353203
18663 7353203 7318564 7318917 7356686 7426942 7546769 7767685 8155111 8809357 9892472 11683704
18653 11683704 14685611 19304740 24951344 30667634 36227632 39598018 39484398 39066799
18645 39066799 39525532 38467395 36900832 37810564 40675310 44035886 44741927 41834924
18637 41834924 38663943 35305404 29409306 22901919 18405176 15659953 13877756 12611848
18629 12611848 11642343 10875354 10257207 9728623 9285741 8906565 8535136 8180456 7878722
18620 7878722 7603601 7331590 7069508 6833113 6621700 6424849 6221024 6012291 5827667
18611 5827667 5665496 5512048 5383997 5272100 5161326 5044188 4925968 4812483 4727399 4651802
18601 4651802 4574109 4488111 4414534 4359454 4321541 4293739 4244153 4182708 4117788 4059106 4015666
18590 4015666 3973192 3921259 3858631 3789803 3712709 3630193 3549202 3479728 3417771 3356121 3296210
18579 3296210 3228858 3165551 3099149 3039115 2978569 2923622 2873314 2835491 2795380 2749123 2698287
18568 2698287 2648330 2606172 2566835 2537264 2519236 2505355 2486246 2457258 2423457 2382326 2337166
18557 2337166 2298730 2261821 2227773 2209335 2199867 2196176 2188406 2184899 2184669 2186432 2180382 2172915 2175189
18544 2175189 2191259 2222200 2266909 2300044 2312396 2302526 2280860 2269415 2264627 2282160 2323504 2389628
18532 2389628 2463621 2524553 2556077 2582372 2650787 2783667 2997517 3307917 3752141 4394845
18522 4394845 5319669 6732053 9073560 12574640 16437740 19550227 21674009 20499005
18514 20499005 16118702 12980284 11958806 12719126 15195154 18582017 21359780 23219863
18506 23219863 22427657 17513717 12955467 10350027 8923273 8120396 7626649 7301932 7101716
18497 7101716 6982547 6940254 6954969 7028234 7152305 7260995 7403736 7674711 8136653 8854270
18487 8854270 9958050 11640406 14340747 18908926 26130177 34914381 42947727 49898278
18479 49898278 52657267 50541145 50899411 54253170 58660949 59980793 56661225 58260338
18471 58260338 67124378 78130776 87911172 90729397 83734120 76121718 72651969 72889869
18463 72889869 75003823 71842928 64419218 59937245 55211005 47325260 40655668 34528277
18455 34528277 28643761 24594278 21949146 20047870 18565161 17358128 16372448 15575778
18447 15575778 14934544 14400699 13919410 13413141 12870144 12357656 11926551 11573305 11267366
18438 11267366 11028959 10851231 10695034 10506939 10271705 10029479 9838095 9698131 9618428
18429 9618428 9653957 9837732 10206167 10832631 11893895 13796645 16947530 20798950 24025214
18420 24025214 26353639 25929791 21399591 17304872 15381100 15175435 16551894 19172247
18412 19172247 21768458 23598917 24007742 20661355 15877483 12713684 10886451 9754249
18404 9754249 8974386 8382461 7892964 7471273 7109699 6819102 6581415 6374408 6197610
18395 6197610 6031099 5842155 5663223 5504026 5374175 5265235 5175914 5093029 5006579 4911298
18385 4911298 4794712 4668282 4568026 4496234 4435989 4369835 4282370 4172355 4063278 3962873
18375 3962873 3880482 3803279 3732065 3676036 3609816 3529804 3446599 3353510 3257979 3175984 3109674
18364 3109674 3050371 2995133 2944736 2894057 2852022 2825424 2799573 2778000 2761930 2743009 2733405
18353 2733405 2725581 2705345 2670342 2645608 2633566 2623466 2611293 2589503 2572586 2574267 2593441 2612900
18341 2612900 2611293 2586184 2558861 2534573 2517213 2516010 2504974 2473881 2444737 2415739 2380774 2360760
18329 2360760 2367317 2400276 2436819 2469983 2482274 2455731 2414627 2396544 2399534 2432743 2496812 2575574
18317 2575574 2664157 2736071 2771241 2804277 2875029 3011281 3236942 3593108 4123196 4904508
18307 4904508 6075232 7921189 10919098 15342855 20304014 24453493 27112960 25893662
18299 25893662 20800947 16664099 15328250 16517718 19792083 23717205 26804792 28262367
18291 28262367 25393776 18940275 13733923 10721431 8973349 7878555 7150995 6624962
18283 6624962 6199893 5858912 5608488 5451939 5359086 5287168 5174873 5005156 4814369 4667278
18273 4667278 4606670 4616701 4680629 4767340 4843792 4876755 4852659 4824870 4889748 5082782 5420328
18262 5420328 5964213 6809653 8102771 10111441 13317606 18128884 24222409 30613811
18254 30613811 35717811 37201564 34602103 29232279 24541760 23382447 25598534 29896182
18246 29896182 34640784 37839671 37319260 32427660 24758841 18292264 14403092 12146915
18238 12146915 10728157 9759442 9026673 8415101 7904720 7509798 7217627 6967236 6721535
18229 6721535 6469000 6195980 5923950 5706436 5556119 5470696 5443039 5450691 5464909 5424935
18219 5424935 5336253 5227392 5102304 5043475 5097940 5262035 5559100 6018534 6718029 7930710
18209 7930710 9974941 12612440 15000727 16745291 16889360 14435558 11698928 10464406
18201 10464406 10710079 12160882 14133258 15754749 16637565 15450380 12082628 9090625
18193 9090625 7303264 6261724 5602941 5162732 4823802 4536802 4294818 4091290 3925972
18184 3925972 3800556 3699940 3611553 3530444 3430852 3337901 3273201 3230399 3189566 3148546 3106607
18173 3106607 3044516 2955131 2854926 2760686 2694989 2644571 2588815 2515217 2444310 2361254 2270091
18162 2270091 2192610 2123696 2062923 2014679 1967569 1917652 1873479 1828933 1791085 1755377 1720040
18151 1720040 1683356 1648742 1620545 1600944 1573074 1538396 1508146 1492693 1465043 1427781 1406870
18140 1406870 1392283 1367123 1349976 1331991 1314432 1298804 1289545 1295293 1311457 1326644 1346176 1373590
18128 1373590 1403038 1414816 1412551 1404345 1383672 1362457 1360215 1373054 1402468 1427825 1444843 1459308
18116 1459308 1478847 1508397 1572021 1716656 1981835 2471972 3423569 4949253 6443304 7538526
18106 7538526 8259870 6852301 4453786 3097317 2434687 2078258 1863345 1716537 1604674
18097 1604674 1507348 1411640 1331096 1271894 1228754 1191645 1155290 1115079 1069479 1031347 1003849
18086 1003849 984941 968288 939372 922119 902844 887307 876011 867278 856054 839066 817444
18075 817444 800775 792596 785829 784597 775668 762656 749406 732037 707360 684350 672747 663880
18063 663880 647328 635254 627222 620641 609341 590515 571027 560327 555789 554500 547863 534729
18051 534729 522390 513337 503000 497419 490166 488931 490989 477652 461265 450715 440542 437140 436324
18038 436324 426310 407321 396139 385638 374482 356809 347465 339864 338609 339011 337182 333938 319019
18025 319019 312716 307305 301983 306257 303454 304216 298999 290772 281598 282549 279904 273347 263525 261251 268358
18010 268358 275696 279604 277181 279395 278660 281521 293771 310247 330788 349357 356031 345788 320591
17997 320591 298257 297684 299345 306661 322941 333022 330043 310600 277973 250938 236343 227652 223284
17984 223284 213404 214821 222597 220511 214353 207269 198921 193991 195808 197346 197682 184717 170933 165717
17970 165717 171464 171418 167743 167336 174133 174583 171360 160442 160557 169000 170583 171727 175726 191880 212375
17955 212375 236129 260382 289891 309441 299776 288719 268649 253038 259445 271654 286988 311731
17943 311731 331300 331976 307426 265668 222914 194486 174193 167130 165078 157063 155292 150073 142406
17930 142406 135743 131270 136709 134127 126327 121993 119100 117301 119223 126472 128830 128403 126825 126759 127707
17915 127707 125374 120601 117359 115447 120060 122064 125256 127468 139655 160545 172015 172632 171410 161934
17901 161934 153902 149467 145993 150992 165113 178503 184746 178045 160050 145353 129881 119802 110806
17888 110806 107416 95475 87417 87818 88853 90583 91135 90594 87696 82450 81108 80000 83215 77261 71584
17873 71584 76238 78478 75448 70328 62357 58298 57255 58522 57289 55469 54186 52837 56445 56758 60038
17858 60038 55359 52066 50866 56846 52784 49743 53439 56885 64207 68126 66740 64080 69941 80269
17844 80269 75473 65029 67332 81009 91245 104419 124948 161413 212391 256782 293462 305766
17832 305766 288956 288159 302032 317437 315067 281426 258987 271701 297429 320496 346463 344948
17820 344948 323821 316427 322594 319438 279627 221360 169237 148112 132167 122537 115550 108166 98274
17807 98274 86319 81364 80438 80210 80607 81364 84227 84476 81211 81380 83737 79191 73537 72876 71535 72136
17791 72136 74848 81841 100219 121610 138998 149365 153272 149042 128116 115188 114028 128895 145937
17778 145937 159132 165613 148114 123090 106321 97999 87289 75052 63616 55911 55113 54840 56922
17765 56922 59864 54649 56258 59918 59953 56609 53905 50130 51268 53610 50726 54546 50378 48266 50544
17750 50544 51003 55661 59670 63002 66030 65526 71337 83249 105156 137590 164873 191036 209405
17737 209405 210308 198664 186890 178984 179561 192899 208681 220204 219497 211173 187209 154217 121126
17724 121126 98841 87702 81712 82135 80252 74513 72405 63825 59282 54245 51392 57445 63854 61898
17710 61898 56031 57576 54637 46834 44217 46719 41843 41911 49782 48544 39864 38747 40047 49354 59400
17695 59400 67154 73189 87512 102356 119729 129212 124344 100808 84588 90894 93886 102433 116266
17682 116266 124546 124922 116722 99150 76420 59583 54771 54921 49719 42855 40774 45256 42411 35754
17668 35754 38106 50402 51121 51788 51413 46260 44210 40962 40000 37966 39257 35152 36244 38232 40644
17653 40644 40742 43992 52163 49957 50480 50994 46046 41383 35772 31283 27787 33203 34520 31194 30942 39018
17637 39018 41592 41354 40889 37608 34313 33257 27873 26353 26806 22426 21168 17276 17882 17152 14963 16804
17621 16804 19781 29993 23625 22235 24975 27163 30480 31316 34230 30297 29917 22347 22581 27543 30887
17606 30887 29803 30377 39292 47251 56410 68920 87391 121976 173030 222040 258633 268485 262031
17593 262031 253904 256084 264361 252272 207829 158634 125755 109485 102188 94910 94489 93451 101038
17580 101038 114373 127173 150255 186248 235384 276222 297321 293905 276941 276795 294821 292387
17568 292387 247331 183889 134136 112841 103587 99049 91352 78314 72618 72096 65907 68734 74330
17555 74330 68986 62043 58326 56812 55259 55269 55738 52138 51918 53025 50423 51686 53572 47466 41035
17540 41035 34049 32816 29813 25248 32956 37306 39554 45044 45829 40743 33694 35399 37398 35333 31601
17525 31601 29732 31102 29537 31975 33026 30608 25813 24351 29418 29707 21049 24534 21537 23339 35521
17510 35521 44281 43740 42341 42588 42974 38919 38741 35791 39822 40293 39355 41458 41927 40845 38053 34954
17494 34954 36170 31996 30560 32637 35922 41826 39473 35503 38375 41315 40169 35315 31422 30692 32262
17479 32262 32660 30781 28227 31995 32046 34480 31944 34398 39094 37684 38745 49723 41872 30507 26179
17464 26179 31571 29107 24745 24475 33192 34792 36423 39437 45301 47279 44524 39163 37226 48279
17450 48279 58502 66348 75656 97405 131635 170332 203136 230801 237433 210028 175570 160697
17438 160697 145803 137998 140085 151189 178997 210595 234147 251731 241144 199595 159936 144799
17426 144799 143365 161816 203600 245871 271759 283371 244203 182311 156218 137751 126042 121242
17414 121242 135133 168484 213237 245495 257737 256047 210900 163936 133954 113749 103619 97001
17402 97001 87211 82303 80771 72571 65200 58796 54038 55967 55646 51568 47815 49116 47464 50937 55896
17387 55896 60045 57171 51850 50768 45286 44814 44790 42753 40330 41791 36940 32093 37499 39425 38640
17372 38640 38321 41519 46130 48725 48395 39473 33441 41738 44847 46754 42870 40720 43876 45298 47247
17357 47247 45079 46396 45359 45128 44547 42180 41228 31502 30449 27497 33595 37564 32991 32917 39550 37033
17341 37033 36062 34214 36102 38769 38804 36257 36294 35588 32755 33364 31929 33813 38915 37673 38293 39447
17325 39447 41346 47498 49223 43770 39218 30017 22429 25571 25941 23157 23585 27822 33701 34163 34177 34440
17309 34440 34214 41231 46512 46337 50695 60542 66313 66925 74557 83701 81354 76141 77484 72685 67247
17294 67247 68903 63028 60585 55708 52354 50726 54157 59538 57493 54151 61291 69890 75999 83668
17280 83668 89199 94420 100496 102500 97699 93004 87573 84956 74930 65398 61388 56831 51748 52823
17266 52823 60654 60294 56335 52617 48824 55578 61258 65374 69515 71143 61752 63209 66703 66360 61459
17251 61459 61014 62323 58924 52312 54786 48726 45976 48412 48080 41329 37996 41156 42037 41242 43098
17236 43098 49657 48917 49368 40835 38023 43982 52803 53326 49600 44711 42491 45981 47003 48876 50244
17221 50244 47038 44084 45350 46766 52742 61344 55264 52507 45112 39192 39916 47613 57160 54726 55726
17206 55726 61418 60827 57656 52513 50469 53684 56033 53550 51311 56750 62044 63485 70237 69818 64374
17191 64374 60074 64985 65353 70689 74988 76268 73786 73465 69686 74473 79916 83112 91812 98157 110449
17176 110449 131833 156494 192485 219667 236490 242848 247084 262627 267837 255001 231806 212797
17164 212797 198705 188931 192956 194271 186971 191558 199683 202670 217643 253999 293083 320877 353520
17151 353520 376876 383846 390282 401036 409344 408737 390526 356670 325212 304373 288991 285006 278903
17138 278903 271777 269860 261319 265570 263027 260834 259133 253088 249534 247448 252185 256125 262832 269692
17124 269692 274903 271234 267355 265678 265343 266235 262315 262613 262165 264826 272191 270520 269169 264403 260939
17109 260939 265725 270049 269735 269753 269877 278577 292790 304643 306161 306159 316308 315291 308750 311081 313756
17094 313756 323638 329815 334511 335899 339291 347786 359820 381506 402472 419094 436711 461844 495138
17081 495138 539585 576918 611093 644899 696835 758818 819949 876710 929968 998439 1076301
17070 1076301 1146227 1193813 1201981 1224395 1285198 1354737 1418257 1482651 1563835 1684761 1853216
17059 1853216 2069602 2320832 2635714 3051861 3570168 4272088 5295694 6867798 9470225
17050 9470225 13888412 20527285 28026206 34688737 39864868 40660139 38328527 38095042
17042 38095042 39511176 40369287 36360753 27278130 19686133 15451955 13233962 12104808
17034 12104808 11626019 11623296 12119575 13286163 15600227 19983592 27325613 36725806 45614848
17025 45614848 53049818 56169542 53235713 51204551 52204137 53664882 51038744 40613269
17017 40613269 29150557 21895592 17769004 15274783 13659201 12497124 11568549 10782062
17009 10782062 10104407 9525074 9022331 8575160 8177991 7811290 7466471 7159851 6905732
17000 6905732 6678209 6463623 6286168 6132124 6002803 5867033 5712872 5550149 5396253
16991 5396253 5239890 5076937 4933495 4818109 4723118 4615395 4467727 4314351 4173746 4042763
16981 4042763 3910786 3795239 3690536 3597309 3504062 3418732 3338253 3260549 3190467 3119653 3054965
16970 3054965 2988816 2934566 2877198 2820501 2754866 2697105 2643868 2592536 2540559 2492015 2450337
16959 2450337 2407383 2363166 2328128 2285093 2233966 2192828 2153670 2113877 2075213 2033394 1991404
16948 1991404 1949340 1915738 1880941 1839262 1794242 1766165 1747028 1721146 1706903 1689802 1675699
16937 1675699 1661750 1647477 1634206 1615248 1598542 1582614 1575943 1555542 1541807 1548994 1556435 1571420
16925 1571420 1608277 1658783 1724104 1795731 1859358 1876248 1849018 1845896 1873767 1940273 2027536
16914 2027536 2111811 2184161 2231337 2235376 2269280 2323497 2358434 2418193 2554765 2752791 2993527
16903 2993527 3256290 3505079 3769408 4112887 4601220 5323020 6451642 8275492 11385433
16894 11385433 16920953 25599813 34888330 41931256 46661934 41987434 29369440 20949715
16886 20949715 17135370 16009980 16816490 19815349 25919730 34504232 41969738 47487241
16878 47487241 48706918 38763157 27552238 21855529 20142608 21455647 25885937 32211447
16870 32211447 37450687 41308848 40568785 31313089 22916727 18608876 16801333 16556079
16862 16556079 17839060 21285649 27200819 33375029 37889524 40551887 35441089 25101015
16854 25101015 18278091 14609575 12521608 11222130 10320996 9631838 9077152 8612402 8230573
16845 8230573 7891672 7567910 7268077 6942687 6614335 6312580 6073701 5883173 5729751
16836 5729751 5618381 5512293 5384989 5213830 5014702 4815129 4646626 4515590 4389812
16827 4389812 4278582 4184232 4101590 4029272 3959963 3884573 3798872 3672471 3541632 3432997
16817 3432997 3341566 3251190 3172494 3099765 3017311 2938248 2872453 2817938 2760787 2703925 2640628
16806 2640628 2585092 2533217 2481895 2420350 2359610 2314203 2272181 2227703 2187362 2144673 2106382
16795 2106382 2061775 2018008 1971123 1929384 1890623 1852362 1819634 1782967 1749992 1722036 1692303
16784 1692303 1660006 1616011 1576547 1547537 1517773 1488146 1459204 1433633 1410574 1382423 1360566
16773 1360566 1343682 1323220 1305816 1280339 1267917 1273666 1282656 1289492 1289293 1288048 1280737 1256615 1210746
16760 1210746 1170749 1131017 1112998 1112920 1111833 1117598 1126134 1131566 1129898 1119409 1090086 1045143 1011539
16747 1011539 996744 987688 992193 998149 998902 993441 975194 936481 907494 888718 874551 870588 861953
16734 861953 862072 867520 878787 887167 878220 858561 819705 782494 759224 745528 731709 707156
16722 707156 688831 673308 655922 643031 632679 626260 617070 603406 583263 567590 559673 554856
16710 554856 540663 528827 527230 525884 519072 513550 509877 497357 481051 468777 465688 457301 447988
16697 447988 448148 440999 432300 424410 420225 414949 407778 405531 405611 403284 382090 369391 360707 357192
16683 357192 354684 350969 347301 343214 336099 338657 335760 327795 318465 312326 305613 302824 294910 281066
16669 281066 275910 284474 284997 274930 270903 268336 255433 248349 242683 232871 234660 234450 233326 231655
16655 231655 226440 219848 217197 217532 215380 211455 211579 209255 202579 202302 199620 186303 185107 191001 191690
16640 191690 183060 179550 176660 175558 172932 171627 173298 166166 156963 150143 153365 160160 148207 144148
16626 144148 145884 143827 134802 129380 133232 130825 132985 133172 127462 119772 118642 121046 123663 122306
16612 122306 120302 120691 113233 107523 107955 100640 96512 96082 97267 100929 103380 97756 94439 93606 85954
16597 85954 86910 87761 89541 89375 93710 93859 90192 90803 82108 77648 75774 70776 66772 62199 65492 71804
16581 71804 71696 71046 70722 69661 69479 71618 67187 61415 63713 71395 69077 61959 52167 43309 41349
16566 41349 48264 55344 60633 57992 59703 60654 56412 51292 53210 42723 38399 42991 45743 45883 48326
16551 48326 50602 51431 57168 59346 60447 58573 56278 54497 48683 38187 33161 35226 36584 37285 41456
16536 41456 42256 34251 30863 31131 24730 30021 34460 36392 39879 35312 31450 26837 28948 36789 37089
16521 37089 35616 33859 37669 41832 35860 32605 26834 29639 36601 40433 43387 42484 41751 46285 50803
16506 50803 51809 59366 53113 46330 47375 43268 41526 45431 49861 53135 51647 56442 72336 99046
16492 99046 133174 177391 223730 269703 297749 293109 285384 285661 291839 281347 241142 187213 146538
16479 146538 121868 113483 99707 91361 96873 103134 103873 116220 143367 174987 218257 261559 295536
16466 295536 307352 292341 281038 285330 280850 248607 198734 153642 123523 108974 102734 101933
16454 101933 95009 83907 81415 72942 68270 67686 66836 66409 60273 59209 62443 62058 52789 42131 35497
16439 35497 30909 34683 36539 36172 34094 25670 23157 24713 29833 31722 29628 32707 36533 39806 39595
16424 39595 38097 36647 36248 28746 28156 24219 22700 22282 23253 29980 36299 37319 34714 30874 30580 24612
16408 24612 26222 26048 25587 24657 20405 17968 21839 21853 18839 18269 25366 26320 20825 21281 17534 19812
16392 19812 11045 377 -2225 -2067 -1012 3740 6418 8485 14715 15894 12994 11125 5949 13752
16378 13752 8690 12053 15603 16595 15622 19023 24086 28301 32189 33547 32669 38828 38506 34213 28908
16363 28908 22195 14619 18918 18341 15249 10266 9323 14110 20585 22351 19064 19937 15119 13092 21925
16348 21925 26591 22556 19430 15969 21467 27886 34913 34723 40110 48521 59405 83814 115628 150159
16334 150159 187813 218837 230692 196124 146900 115035 107527 104838 111448 132401 165525 203811
16322 203811 231612 248217 239413 189832 144500 121010 114961 131563 164113 201561 228663 246988
16310 246988 231532 185037 146829 128914 121117 120080 126145 147046 177191 211367 236756 242704
16298 242704 209529 157332 120815 101888 87580 83337 81010 69851 56187 55960 60229 59576 46248
16285 46248 35450 36882 36239 32624 39167 39813 36392 34362 34353 37809 38325 35379 29071 27640 26596 24878
16269 24878 22485 17287 19532 17821 17581 14651 16925 20109 23502 24189 17695 12526 16273 16638 20304
16254 20304 15881 14701 22346 20177 15788 14245 14028 9380 6028 6781 6653 7379 6542 5425 8972 10731
16238 10731 18866 23479 23510 18916 15380 18884 16983 17978 16385 16672 12636 12253 10210 9772 4687 5001
16222 5001 4328 6190 4704 2112 3027 4982 3646 4292 2846 8155 8380 5497 10202 14044 13055 10337
16206 10337 7091 7106 6358 11320 18802 15663 12648 12198 10160 9768 9786 2461 3298 4771 3987 5139 7934
16189 7934 1493 1447 9466 12958 7087 1673 3627 1849 2028 5999 12081 13646 13073 15545 19195 24143
16173 24143 23745 16751 17098 17246 16560 21542 14632 14360 11346 9766 11378 12843 7477 4529 4423 1408
16157 1408 4959 8021 5954 -1534 -389 8325 12533 -1685 -6135 -4836 2593 11039 12390 6782
16143 6782 6023 -4961 -8943 -5970 -4392 -1955 2046 -335 1467 4630 1639 -3539 -3140 -592 -8787
16128 -8787 -10751 -12108 -6153 -347 2618 8620 11350 9689 13316 6939 3329 6874 8166 9213 6037
16113 6037 1532 -129 -553 -3163 -322 1177 1008 4115 3011 1393 -597 -421 -1961 -4668 -6678
16098 -6678 -4131 -1557 -2347 -1636 1699 6258 5411 1496 2590 6914 2313 -3853 -6169 -6344 -5308 1062
16082 1062 4222 4496 6527 7090 3274 5640 7913 9447 6656 3371 2148 -984 -2100 -7799 -6981
16067 -6981 -1576 1128 959 2986 3922 2203 2192 7971 9192 10157 7351 -348 -1780 -493 -705 2612
16051 2612 6067 851 -3370 -5499 -9890 -12597 -8453 -8811 -5009 5041 2210 -5835 -6133 -1593 -5202
16036 -5202 -3035 -4406 -2850 -1156 2001 2278 5831 11553 15055 12866 5775 3048 577 -2137 -462
16021 -462 4185 10846 5927 -2472 -8293 -9828 -13749 -9234 -2323 928 499 -2432 -729 5225 10448
16006 10448 14491 13666 12546 11805 9966 5730 4365 -5088 -4732 -5473 -8763 -2770 4634 5256 846 1028
15990 1028 -91 -4922 -2013 -3372 2465 2918 17 -1381 -1997 -5561 -7653 -6063 -2664 3581 4903
15975 4903 -167 -1130 3393 7545 10226 9859 2670 -8482 -6149 974 3896 1515 3588 5519 -1228
15960 -1228 -3613 -5024 -2643 -6506 -5853 -4717 -7885 -8847 -3152 -7059 -11716 -10358 -7830 -10066 -8964
15945 -8964 -6757 -4566 2714 -3954 -6317 -3945 -2904 -2199 -2328 -838 -3696 -6409 -6583 -172 1342
15930 1342 975 2442 5568 4815 -4523 -7738 -2321 -208 -2677 -2057 2114 6681 5876 8420 1866 -6885
15914 -6885 -1493 -1751 1766 1850 -2364 -8294 -8246 -3575 1009 5919 3976 3444 3059 1060 3101 1778
15898 1778 2078 2584 -2976 322 732 -3375 -4828 -5227 -3438 -4826 -6007 -11623 -12554 -12026 -9062 -3960
15882 -3960 -1258 -7176 -4545 -4590 -3665 -453 1232 -1157 2281 5720 2372 -4373 -2304 -1195 -240 -356
15866 -356 -5414 -3945 -2505 -4452 -3262 129 -5129 -8196 -9921 -12122 -7132 -2423 2206 10290 13496
15851 13496 4782 -868 -2289 53 4980 4803 3552 2824 5858 2243 -2233 -1409 -713 -4174 -4414 -6029
15835 -6029 -9105 -13591 -16630 -7603 -7018 -8036 -9407 -5408 -12980 -18527 -12584 -5687 -4341 -13124 -11415
15820 -11415 -8278 -5549 -401 6067 6797 5233 1508 -6183 -6535 -5823 -2880 -533 3029 5470 -1592
15805 -1592 -3697 -4264 -4167 -3888 -8142 -3804 -2177 3158 2922 -2038 -2755 -4123 1364 1374 259 -4855 -3947
15788 -3947 -490 -2407 -6498 -13636 -13441 -370 7586 3565 -1356 -2790 -4862 -3637 -5989 -7621 -10496
15773 -10496 -7085 -1635 -944 -3369 -2340 -5118 -6301 -3443 2602 -3273 -8512 -7125 947 1375 4374
15758 4374 2969 6004 7868 1581 -5557 -8507 -3279 3597 6257 3801 -5671 -11163 -5513 2585 2681
15743 2681 -1379 -5175 -5405 -7269 -4700 -1175 -994 -3139 -4711 -3701 -7859 -15242 -9953 -5608 11
15728 11 7726 5561 300 -8565 -11337 -10195 -7547 -7987 -8418 -5671 -423 6003 9498 8387 2342 -1044
15712 -1044 -1918 -2234 2506 2601 -3400 -2139 -5396 -2390 1611 -234 -7441 -9144 -1495 -5812 -8000 -2294
15696 -2294 -2692 -6498 -5602 -1 4263 3203 3684 -1078 -60 -664 5907 4691 1958 2891 1627 1157
15680 1157 1322 2322 5214 4975 2198 1702 2179 -1735 -6641 -4173 3102 6885 852 -6346 -4259 -3744
15664 -3744 -4974 -1527 -3486 -1983 -1532 -12352 -17144 -12670 -8473 -7270 -5928 -5607 -1164 -950 -3789
15649 -3789 -8814 -9093 -5669 -8702 -8284 -1442 1769 -83 -4120 -330 14709 18654 15387 5292 -376
15634 -376 2001 646 -3646 2743 5531 1652 -4046 -13159 -11935 -10985 -5714 -1240 7403 11409 11654
15619 11654 -2306 -12277 -14144 -8824 -9014 -9213 -2112 8511 9904 5159 -2114 -1456 -3388 -8656 -9753
15604 -9753 -6748 -6327 -10017 -8629 -6463 -6362 -11336 -14944 -22332 -24785 -18805 -11234 -9337 -10513 -11366
15589 -11366 -10834 -14867 -19349 -15354 -16612 -19683 -14931 -2530 -4848 -8840 -1403 1049 351 1750 -3524
15574 -3524 -4962 -4342 -3341 -4290 -5634 -7048 -7038 -2419 -1541 -1106 -2911 -4246 -2209 -848 -5932 -9264
15558 -9264 -4978 -385 -892 -575 6370 9348 7963 7178 8565 2237 2121 2815 613 -2592 -2892 -1415
15542 -1415 2518 816 -6134 -7878 -7604 -2413 1286 -710 -5113 -7049 -8657 -9149 363 -3771 -4408
15527 -4408 -7805 -9926 -7362 -6635 -1654 -1894 -564 3101 5867 6730 -224 -2752 -3937 -4649 -3350 -3087
15511 -3087 -2219 583 3002 479 -5026 -5418 -8516 -2593 -2739 -2416 -1150 -4333 2500 234 -3427 -5750
15495 -5750 -5860 800 3480 2910 -205 -1824 -2741 -6534 -9908 -7573 -6763 -3579 386 -3185 -8767 -8896
15479 -8896 -6783 -2449 1093 4580 4791 -2481 -488 2489 997 4871 3008 -3194 -8586 -15977 -12450
15464 -12450 -14813 -15213 -15247 -14587 -11940 -9330 -13662 -9707 -8070 -2297 2046 2334 -133 1248 1421 -753
15448 -753 -2286 -2418 -330 1471 733 -2280 -7610 -15499 -16684 -6131 -7501 -8834 -896 9612 7595
15433 7595 -1360 2890 3224 3810 358 2054 2132 1845 -7163 -13191 -7619 -8571 -3603 1325 -2981 -2676
15417 -2676 -3437 -2521 83 4093 3838 3084 8884 2601 9015 7136 4927 408 -6354 -8293 -2664 3465
15401 3465 -3915 -6490 -2170 -3552 -2066 6 1123 4595 4014 4508 3495 -2066 2378 6633 7371
15386 7371 3393 6474 -763 -4431 -1119 1922 1460 -2543 -3230 -5210 -16 3993 4045 -298 -2560 -3428
15370 -3428 -5186 -6608 -8984 -11087 -6439 -5707 -3696 -316 -2244 -7643 -4012 -3526 -4240 -4367 -10133 -7565
15354 -7565 -1202 1737 2483 -1542 -7433 -4923 -4518 -4150 -8488 -10075 -13443 -15401 -9051 -6427 -5153
15339 -5153 -4925 -3607 -3345 -8777 -4692 -1674 568 3573 1452 172 -126 121 71 -2802 -5517 -3447
15323 -3447 -2222 -53 -176 1278 1782 -2049 1403 8569 4656 1351 960 2130 1796 -1145 -5154 -5013
15307 -5013 -9322 -9610 -13279 -9402 -5877 -4577 -6021 -5681 -4213 -5732 -7088 -3749 -1911 -1822 2364 4034
15291 4034 4506 6059 4766 1588 6393 8204 -4379 -11349 -14584 -6286 -1949 -6734 -8896 -14274 -14207
15276 -14207 -8424 -7625 -10060 -9300 -6537 -10803 -9505 -8904 -15706 -18803 -14850 -15542 -10265 -3921 -4372 -5124
15260 -5124 -6881 -7678 -5908 -1844 -163 414 524 -4785 -9314 -9149 -8653 -9624 -8204 -601 6764 7166
15244 7166 774 966 -3632 -11268 -13135 -13655 -8189 -4033 -3038 -12700 -15052 -8627 236 5338 -768
15229 -768 -12052 -12359 -5773 -3363 -4001 111 117 644 -5249 -4598 3670 7099 5734 10251 19274 18196
15213 18196 13031 5869 79 -1488 -1510 -4941 -10642 -12118 -15062 -19642 -24599 -24191 -20416 -22041 -20857
15198 -20857 -19522 -15392 -7966 -8414 -9414 -9440 -9456 -7033 -6192 -4071 -904 -2751 -5568 -4014 -6854 -12097
15182 -12097 -9781 -6347 -9976 -4029 -3802 -4983 -380 -3046 -3658 -790 -2874 -1219 685 7487 7967
15167 7967 -919 -8460 -9666 -1332 -2238 -10099 -4874 180 -103 -32 2083 -3982 -2044 3330 855 -3015
15151 -3015 -923 -110 -3040 -3029 -3622 -5644 -8857 -11075 -11045 -7306 -3654 -2065 -3244 334 1339 6146
15135 6146 2240 202 605 -204 -6862 -6612 652 139 -5380 -9384 -3720 -400 2921 -5605 -10978 -6613
15119 -6613 -2028 -3813 -5717 -2789 -130 3821 3376 -679 -664 408 1327 -2011 593 -1541 442 -827
15103 -827 -1515 -2998 -10532 -9370 -11022 -12040 -12360 -7917 -1157 -3996 -4002 -392 -3109 -3260 -88 1182
15087 1182 -7956 -9264 -7755 -7738 -9883 -5716 -5082 -5179 -5589 -2162 -2002 -8836 -9712 -14458 -10682 -482
15071 -482 2984 3554 8188 6089 -487 752 -2191 -5889 -5507 -5469 -5280 -2929 271 -309 -5207 -6823
15055 -6823 -3417 -2615 -4168 488 833 687 1190 -1772 -7384 -3603 58 3160 5242 634 2538 1982
15039 1982 -5952 -7403 -4318 -5411 -7014 -6549 -5765 -4198 -9076 -4725 -1062 -3130 -8893 -9243 -11249
15024 -11249 -6286 -11152 -15316 -17263 -15124 -10513 -9740 -13124 -15307 -4642 3268 1167 -1402 158
15010 158 794 4681 1401 -4044 -8104 -2863 -1986 -2628 -1707 -3354 -2642 -1714 -2967 -7366 -3505 -524
14994 -524 -85 -6140 -2857 7406 3638 -3770 -12716 -12271 -8334 -5490 -5334 -4630 -8762 -6770 -7711 -10829
14978 -10829 -11441 -8115 -5962 -4759 -6670 -2019 -1165 -2194 2891 -2108 -2772 -1935 -4062 -9801 -6442
14963 -6442 -5806 -4167 3629 4670 4668 1198 4604 9314 7110 2102 202 -2612 -2649 -1974 -4973 -3454
14947 -3454 -3981 839 3066 2778 4364 -3221 -7724 -11039 -9272 -11218 -9489 -546 4513 6541 1465
14932 1465 -528 -6250 -11550 -11063 -5052 4096 3291 -1221 -2292 -3898 -11656 -6102 -6645 -8832 -6384
14917 -6384 -6031 -7090 -12786 -12814 -13859 -13548 -12343 -15408 -12439 -11763 -9227 -10959 -8150 -6622 -9038 -6396
14901 -6396 -10384 -15558 -9630 -6681 -6881 -5621 -8019 -11728 -19121 -10477 -3354 1101 6889 2886 -5828
14886 -5828 -9371 -9041 -6266 -2202 -3159 795 -1803 -4078 -6113 -10281 -12345 -9724 -2870 -946 -1424
14871 -1424 3599 7565 10678 11267 5356 2752 -3163 -11240 -7557 -4892 -6669 -1948 5275 5648 1846
14856 1846 -2530 -4209 -5071 -5178 -588 -2551 -2715 -3060 1210 -2625 -12380 -6903 -2 194 -895 -3868
14840 -3868 -9447 -8969 -9034 -6748 -8075 -2143 -810 264 -2467 -2318 -2755 761 6330 1887 5103 5324
14824 5324 1019 2047 0 970 959 3908 3625 8038 2912 -584 -850 -71 4054 8766 7119 -2198
14808 -2198 -6606 -5626 -4462 826 3291 1436 1611 4192 1795 12 -4510 -2419 -3021 -10988 -12871
14793 -12871 -11798 -10640 -12248 -11569 -2836 1034 -131 3711 1664 -661 -1517 -3793 -5078 -7434 -4373
14778 -4373 -4803 -10570 -14662 -16250 -10641 -7600 -8107 -7317 -2174 -11687 -19903 -18225 -16615 -10389 -7671
14763 -7671 -14088 -17974 -12024 -11860 -10817 -14974 -10625 -817 2662 -797 -2008 402 6640 13734 10761
14748 10761 1167 -4897 423 -1470 -1898 -3209 -651 -1882 -2804 -3538 -437 -2416 -5105 -700 4861
14733 4861 4943 3383 -164 -1536 3109 4217 301 -1501 1122 2699 4157 1546 -4108 -763 -4022
14718 -4022 -5559 171 1769 3554 7092 5247 3764 -1762 -8969 -16311 -14269 -11184 -8127 -5177 -7036
14703 -7036 -10551 -9001 -12569 -14805 -10655 -4951 -2581 -2197 -6989 -6197 -4224 -5022 -7793 -4759 2219
14688 2219 -2771 -2118 875 -864 -1298 -583 2175 2068 1698 -6076 -5507 617 5404 707 -83 -1399
14672 -1399 325 2276 -861 4181 3657 4327 1555 149 4983 2488 -1424 268 1243 2354 322
14657 322 -1953 -3668 -9666 -13634 -8267 -1108 6769 7003 374 1042 5538 5320 4675 3195 -981 -1467
14641 -1467 2830 6293 10823 12082 6792 3405 3516 2732 -3835 -4611 -2383 2703 2073 -4415 -7223 -2968
14625 -2968 1627 -2192 -129 4826 -2446 -13397 -12636 -9256 -10103 -9741 -5121 -2786 -1084 -5274 -4027
14610 -4027 1378 -686 -7041 -6628 -7367 -11179 -12221 -12663 -7124 -9793 -11637 -9237 -7067 -5371 -5485 -3278
14594 -3278 -5583 -8990 -16178 -17637 -16749 -7195 -1494 -2333 -3534 -1014 478 -1968 -1479 7689 12044
14579 12044 9513 2473 985 -549 -6281 -10780 -9394 -6372 -6958 -2407 -3622 -2468 -1806 -6477 -5241
14564 -5241 -1839 -3304 -14133 -19056 -17142 -8941 180 -1275 -198 2848 5712 5695 3458 -6364 -12288
14549 -12288 -16850 -15721 -4596 2292 -6437 -13424 -11925 -11838 -11548 -10211 -12792 -15191 -14968 -15540 -9540
14534 -9540 -3472 -3220 277 2112 -555 2607 59 557 566 -2618 -1591 812 -307 -1469 -3394 -5312
14518 -5312 -7014 -3725 1148 7628 8285 529 -2668 -231 -5859 -8228 -6015 -1492 -3852 -8918 -16181
14503 -16181 -11882 -6694 -9460 -12461 -14582 -10764 -8222 -5070 -11692 -15852 -11070 -10100 -8961 -9472 -4444
14488 -4444 1378 6091 7101 8468 8637 9098 10735 7952 524 -5685 -6120 -3529 -3418 -5517 -4466 -9719
14472 -9719 -10787 -9148 -9273 -7841 -1608 3063 867 -6510 -6533 -8446 -6709 -8187 -12287 -16861 -14441
14457 -14441 -5621 -5903 -9128 -5943 -3362 -9 1978 1756 -4930 -8461 -1629 1356 -2547 -2972 -3005 -4479
14441 -4479 -5465 -1964 -2789 -3216 -5422 -5743 -5642 -3609 856 904 -2363 -2489 78 -3368 -7280 -8019 -5993
14424 -5993 -4255 -7855 -10776 -10077 -11904 -7147 -9144 -12297 -7923 -1440 1282 844 -2051 -4862 -1481
14409 -1481 332 -7533 -9932 -6954 -2387 -2237 -9079 -5981 -3074 -1639 -155 -2790 -5180 -428 -3930
14394 -3930 -5489 -6272 -11630 -14412 -12606 -5626 -860 6681 10927 -1259 -9740 -10179 -7629 -9959 -9685
14379 -9685 -3882 -6412 -13552 -13309 -10343 -7311 -5399 -1955 -3015 -1036 28 2452 6312 5417 7667
14364 7667 9469 4735 -2063 -6344 -1823 1118 2484 5017 1348 402 4883 4838 3295 6111 6318 6649
14348 6649 -1752 -4854 -3288 -5773 -12964 -20475 -17141 -16137 -17890 -20252 -16961 -10549 -6420 -4191 -6845
14333 -6845 -10496 -6527 -5013 -4836 -1072 4121 -744 -2763 1249 2462 3880 4272 4010 4636 -5169 -7133
14317 -7133 -6234 -3449 -4113 -3944 -4739 -9240 -6617 -4931 -2930 472 48 -2681 -9463 -8493 -1224 10692
14301 10692 9549 2315 -1662 -4627 -7397 -9596 -10420 -5120 553 2156 663 -1638 -4652 -2344 10499
14286 10499 12060 -528 -5739 -2118 -2000 827 -2200 -4384 -4739 1206 9475 10771 4377 637 -4145
14271 -4145 -114 -1822 -1092 4582 6626 -742 -5961 -9336 -9311 -2791 1069 -818 -2514 -4200 -4715 -4797
14255 -4797 -6747 -12829 -16510 -15028 -23941 -19200 -7773 -8612 -11553 -10534 -9655 -8808 -5821 -7215 -2594
14240 -2594 -2334 502 4628 10513 11579 8705 5982 757 -14018 -18390 -13841 -14325 -12551 -5316 -8867
14225 -8867 -7625 -3172 1166 4781 1468 485 -1254 5029 6442 6970 1214 -7563 -6600 -4516 1016
14210 1016 399 -705 4157 7436 4225 -3647 -2127 -3840 -5062 1006 2438 -3960 -4762 -1207 -2399
14195 -2399 -3211 -820 3646 -1840 -6146 -6452 -4583 -5346 -3690 -826 457 -3012 -6226 -3666 -1128
14180 -1128 1891 3891 68 5655 8365 4102 -1501 -2022 1749 -528 1279 -1324 -10465 -11943 -6612
14165 -6612 -1945 -3759 -9390 -16747 -13111 -1560 1478 -711 2741 1013 1435 5454 7461 5026 -5612
14150 -5612 -7444 -7606 -2817 152 1064 -4275 -7466 -6891 -4753 -522 -408 -8112 -3046 334 -622 -2233
14134 -2233 -4980 -612 2412 267 -1740 -1874 -4308 -4907 -2486 -3396 -1543 -5844 -8758 -8980 -3600 -1791
14118 -1791 417 -4581 -2820 -942 -2616 -1640 -9544 -16365 -11124 -6307 -2543 -3147 -4380 -2941 -2423
14103 -2423 -4352 1038 2688 72 -8011 -10925 -4688 -985 -9967 -16693 -16598 -12998 -12828 -17074 -17518 -12656
14087 -12656 -9758 -10354 -11242 -9731 -3827 2811 7681 5547 -83 743 -222 -2062 -7425 -3765 5197
14072 5197 9288 11350 8873 4167 -1989 -3656 670 -2634 -1324 -983 -1968 -5620 -10789 -8744 -7704
14057 -7704 -3270 -520 -1498 -762 -5137 -8240 1776 10212 5856 -2438 2484 8953 1439 -3442 -12510
14042 -12510 -12558 -4894 1075 4519 2448 -7265 -12073 -14335 -12399 -11854 -10739 -7642 -6841 -13080 -19116
14027 -19116 -12100 -5413 -1261 -862 -4007 -6370 -9892 -4453 -8782 -17781 -19257 -15603 -12368 -11659 -17064
14012 -17064 -18337 -6907 -5703 -8947 -6720 -10209 -11157 -14001 -13452 -8430 -4383 -6130 -10135 -7828 -813
13997 -813 -338 -5501 -7450 -6319 1898 11031 5693 2470 5461 3922 2832 -2634 -7607 -16555 -20094
13982 -20094 -10896 -7339 -1710 365 -770 2789 2802 -2185 4298 6455 4304 7930 6384 5641 6960
13967 6960 8962 4339 6380 6667 3081 562 2153 6839 7837 5453 5765 3947 6035 2898 576
13952 576 8494 15460 14717 7149 116 -5626 -4286 -4450 -6392 -7467 -14176 -14587 -10266 -6409 9439
13937 9439 5945 -1825 3463 10776 8717 5387 6854 10247 7459 5582 -457 -1125 4518 5681 1655
13922 1655 -5271 -3228 -4089 -1644 3471 4100 -2625 -8245 -10972 -7396 1673 208 -1997 -1843 -2746 -5908
13906 -5908 -11899 -9910 -5949 -2613 1842 5520 5510 1170 -2256 2062 9044 10251 10381 12064 11740 6669
13890 6669 3583 -1191 137 5213 10307 10320 11209 12750 10001 11407 6952 -680 -6709 -8529 810
13875 810 4932 5972 3624 4318 -640 -3622 -191 -3253 -6097 -5817 -3248 -2819 -2549 -9491 -16076 -8032
13859 -8032 969 4655 3615 -3512 -3758 -831 -2093 -2759 -3735 -5455 -7360 -5813 -2847 -1497 2440
13844 2440 -1005 -2459 -631 -5626 -8827 -8580 -10592 -8364 -4146 760 -3102 256 4196 5032 1874
13829 1874 -3701 -6877 -5829 5824 6113 3190 -1075 1687 -5214 -7965 -6883 -8577 -9728 -11527 -13109
13814 -13109 -11940 -12903 -15805 -17479 -13311 -11257 -11443 -9164 -2463 4901 -1651 -6626 -1420 2672 10502
13799 10502 15194 13015 9318 6411 8728 10301 12075 7775 -139 -1760 -273 -1356 -9751 -13318
13785 -13318 -7650 -2181 1053 5910 10441 12946 11676 5658 1802 2559 87 -11504 -9969 -2890
13771 -2890 4392 5864 4501 2354 -1536 -4726 -5554 -5100 -4955 -2970 708 854 -2483 -3665 1789 164
13755 164 -1110 -4501 -4449 -7623 -9633 -5096 1332 -6946 -6018 -788 -4034 -10019 -8002 -1807 -1722 816
13739 816 5019 5128 2232 -598 -820 -1150 -2915 2472 1764 4608 7429 7808 10890 9829 7943 3825
13723 3825 -266 -4960 -5365 -7279 -3344 -2475 1162 9437 6775 6641 9521 3823 397 3841 1126
13708 1126 -2196 -5400 -6638 -3364 -5986 -12945 -5313 162 6313 517 -5666 -3318 2846 4700 3672
13693 3672 3768 1795 3218 -229 -14576 -22208 -17921 -16348 -11354 -10028 -15501 -11311 -6746 -4814 -6199
13678 -6199 -10681 -13042 -7619 -2423 2865 3211 1695 3880 4384 4912 1607 2396 7692 11016 8289 3715
13662 3715 -3417 -5075 6083 7930 2877 -295 1807 3219 1614 1179 -3509 -2204 -6518 -10690 -12088
13647 -12088 -9453 -7920 -6445 -2470 -150 -3116 -6301 -7219 -4819 -4676 -4786 -1052 8055 7326 -3633
13632 -3633 -7885 976 6143 1771 867 16 1041 3030 5754 8420 1509 -6552 -4375 134 4992
13617 4992 4686 1190 7379 6939 2156 -3597 -4646 -3673 -7014 -1615 1916 -2164 -3489 -2712 -5806 -2306
13601 -2306 -2204 -211 1132 -1206 1276 1581 -1653 -13552 -12945 -9877 -8100 -5722 -1960 -2340 -10023
13586 -10023 -8944 -2143 -1773 -7119 -1167 -1103 -2559 5752 2209 -1561 -5445 -8336 -5557 -518 2323
13571 2323 3666 2108 924 -548 -3809 -1279 942 5655 3832 642 -2692 -9704 -13822 -7886 -4241
13556 -4241 3744 1925 850 -1336 -9174 -4456 1632 3 -1038 1092 4119 2420 6052 9137 3458
13541 3458 4997 5136 4716 2775 6070 -1500 -3266 -1640 -5522 -10384 -9260 -6416 -7356 -11745 -5204
13526 -5204 -2428 395 3703 2811 -1539 -4281 780 -945 -3184 -3231 -4469 -5224 -8908 -3842 6733
13511 6733 10819 6267 2762 7735 7632 8872 1411 167 4699 3430 3193 4970 8830 10205 10913
13496 10913 10058 11697 8978 9642 8610 11404 10696 7296 5702 6573 9665 7983 6882 4570 4827 7321
13480 7321 7362 7649 7963 2464 -3687 -4275 -2136 -2701 331 382 -1835 -6296 -9659 -8299 -6530 -4227 1755
13463 1755 433 303 5594 12850 17277 17725 21150 17273 11673 9938 6331 5924 3995 4408 -306 -1892
13447 -1892 805 5534 8088 10248 11886 9286 1833 3100 -4620 -177 -2013 -3690 -4663 -4464 -7974
13432 -7974 -11129 -9613 -6093 -2955 709 4004 -1803 -6019 3127 9196 14587 16047 13386 15925 15976
13417 15976 17341 17813 17579 20494 27811 26727 23167 27136 27829 22899 15682 16294 21526 26154 26971 19070
13401 19070 8731 6544 2076 4090 6794 6467 3894 8232 11518 7513 8078 15659 18434 19820 19779
13386 19779 18898 21807 16782 12673 12595 15875 17195 25710 30329 23397 20684 23068 23043 28448 26699 23468
13370 23468 15201 7795 3122 15029 24923 26759 30472 35817 28500 19284 13132 7048 663 4505
13356 4505 6011 9874 11860 18906 21659 19529 20021 16414 16686 25451 18238 18716 19688 18290 14660 20014
13340 20014 19877 19423 24571 30698 32177 27695 23387 21421 16233 15935 18769 19830 21958 23967 28635
13325 28635 28856 25010 22547 23049 22058 23112 26600 19183 15334 19134 23100 29880 28716 25688 28265
13310 28265 24328 22536 29207 28621 27588 27358 27047 25732 28907 32513 28032 17261 14853 12671 14871
13295 14871 19843 19801 22639 18321 17287 10738 14569 18629 17194 13653 15160 13618 15180 13224 7828
13280 7828 5258 6103 16338 22465 25978 24357 18206 17654 14575 15301 16181 13562 8916 10853 18456
13265 18456 18432 15377 14057 16177 13422 6060 4934 10924 15454 17801 17353 24380 27564 26856 25821
13250 25821 23419 17017 18803 16710 17930 19125 23574 23870 22027 18462 20735 24415 20810 18298 16929
13235 16929 19164 16495 19148 19027 16630 18560 15760 10650 12508 19638 28160 30106 29558 28724 31548
13220 31548 27635 20755 15440 17390 16756 18362 24242 23382 18173 12712 20332 22686 24223 27059 37911
13205 37911 33516 33810 26022 24629 27829 29733 25681 14254 13083 13675 12181 18571 34340 35904
13191 35904 38773 45339 49823 53528 57250 51382 48902 44295 45857 51921 50561 54535 63541 69406
13177 69406 70868 73997 76984 85819 92056 105670 111718 114392 134173 162763 202583 256326 346868
13164 346868 494374 741790 1142417 1655202 2090349 2395534 2398403 1820442 1200202 836475
13154 836475 636302 517718 445118 400952 369453 339553 313673 290581 274035 253658 229371
13143 229371 210435 200772 188808 184461 174199 165312 150335 143100 145400 145167 135635 131163 129516
13130 129516 129676 132599 130929 123861 116346 103361 99265 97129 97781 98481 99150 101456 99145 98270 97839
13115 97839 95528 91280 94577 94021 90939 86246 86443 82789 70287 72811 79307 80579 78923 82866 84642
13100 84642 85525 85085 80623 76988 73435 73824 69983 64890 61518 59366 60464 65961 72650 72811 73794 74922
13084 74922 71667 59118 55956 58752 56517 52137 43305 39060 37586 38598 44815 41340 36574 43505
13070 43505 52077 54119 52624 50443 48450 55015 59451 60966 66827 67234 70698 64576 59309 54989 51117
13055 51117 45461 37891 37313 31618 20443 18684 17923 20244 20593 26266 29586 36018 40740 46522 56240
13040 56240 55593 51087 48262 54156 62314 62723 68892 73431 70351 70864 68644 58168 48544 40055 37287
13025 37287 37540 36340 40428 39247 33623 35670 40754 48217 64251 69558 69319 64604 62787 63136 59719
13010 59719 57524 50558 39271 27697 21016 21573 29782 37783 47116 68572 76944 75451 64903 54013
12996 54013 44410 45576 45320 35569 23979 12164 10941 16840 28785 40638 44379 50619 54400 60892
12982 60892 69791 70286 79132 80547 70650 63668 63265 65198 61404 58546 53102 56386 56748 62197 65048
12967 65048 62940 57868 55191 56813 72602 86145 93848 109819 130361 142338 160396 199525 242238
12954 242238 272716 306961 314872 316126 282069 230311 208377 173170 143082 128272 118485 106133
12942 106133 95427 97208 88072 83589 85547 93275 104897 114962 126299 136224 144782 154621 147656
12929 147656 131915 125046 117502 111755 102478 100212 101152 101767 113033 115889 112850 117458 131079 142005
12915 142005 137492 125003 113528 117219 126725 126488 131362 135721 141233 136026 127632 131554 137697 127227
12901 127227 105985 83359 71211 61507 62206 70961 80903 78979 72931 56811 41643 18425 -1024
12888 -1024 17754 71482 112251 101732 82921 85534 88344 98173 121904 140739 143410 134841 119262
12875 119262 122266 123807 130923 147629 160172 159693 160520 154388 140318 132576 140230 147553 142508 139296
12861 139296 145743 152752 161887 176621 184345 191861 201237 201286 187840 174897 204369 222815 229735
12848 229735 223677 186174 151670 134121 133793 145235 163481 187696 209632 227694 242561 258520
12836 258520 272701 279068 300790 330562 366228 417052 503100 628624 796741 1058680 1370098
12825 1370098 1728587 2029282 2063697 1879571 1565461 1305416 1123611 1007022 939557 897871
12815 897871 872908 851609 835498 811733 791787 785702 788150 785872 775747 755931 740490 727356
12803 727356 714919 713064 719224 724226 728021 722129 717564 716019 704439 677912 657556 651514 653068
12790 653068 651308 653753 661995 672599 693455 726211 790591 882139 969841 1036769 1033296 959086
12778 959086 904470 890767 897835 922316 949796 975132 1001964 1029063 1039127 1018154 971072 878532
12766 878532 809534 789242 767904 735598 720505 734776 788314 847172 900474 951691 1009974
12755 1009974 1066560 1096464 1118672 1136380 1137752 1137824 1160702 1174378 1192134 1228388 1261298 1302293
12743 1302293 1335365 1383915 1440149 1490629 1539113 1611580 1696282 1776459 1880858 1975111 2063595
12732 2063595 2201161 2355619 2503677 2671450 2855902 3038529 3212123 3441440 3765966
12723 3765966 4159459 4590963 5012463 5412299 5857951 6403797 7059218 7831997 8725737
12714 8725737 9767868 11090828 12773267 14693902 16702607 18835272 21150766 23958909
12706 23958909 28468334 35527327 46423037 63260896 90565924 137611029 214114028
12699 214114028 306061734 376156666 426664223 426819737 319619056 209013945 144793581
12692 144793581 109813918 89465881 76507986 67424788 60422725 54671200 49913330
12685 49913330 46092634 43050345 40289024 37385610 34845014 32625798 30618060 28855454
12677 28855454 27382347 26135858 24972596 23890699 22963898 22217456 21587249 21000040 20375639
12668 20375639 19706237 19019783 18354803 17736372 17171817 16664500 16209071 15755356 15329164
12659 15329164 14920318 14503620 14113729 13721456 13322380 12951561 12602445 12270811 11945294
12650 11945294 11651400 11389091 11129889 10868482 10640091 10451841 10244448 10038188 9834351
12641 9834351 9603212 9360521 9147981 8955799 8774476 8607616 8451707 8296718 8133452
12632 8133452 7965377 7799984 7641867 7503513 7390161 7287590 7158331 6988614 6769284
12623 6769284 6492838 6243356 6055227 5908364 5783515 5676669 5585688 5496128 5396643 5301299
12613 5301299 5215395 5142322 5060560 4969342 4868210 4765002 4666096 4578445 4493226 4405852 4318030
12602 4318030 4232954 4150530 4070091 3984513 3892191 3789225 3689155 3602545 3533806 3469933 3408918
12591 3408918 3349309 3294132 3230831 3173868 3131043 3085615 3030603 2972410 2913466 2865687 2826516
12580 2826516 2800579 2799551 2822598 2876202 2988458 3131595 3335102 3578388 3858928 4109878
12570 4109878 4258313 4216809 3904204 3516563 3208130 3019763 2900591 2813072 2728236 2641014
12560 2641014 2557213 2487805 2439758 2402041 2360017 2307752 2257180 2217914 2201647 2187000 2156871
12549 2156871 2102658 2023989 1963229 1940093 1941796 1952743 1945885 1907506 1835094 1782859 1748897 1706774
12537 1706774 1672362 1642243 1630555 1613040 1578426 1533098 1492580 1460394 1426944 1397830 1366264
12526 1366264 1341225 1316115 1287287 1272868 1267389 1247891 1230030 1216090 1191958 1170789 1150375
12515 1150375 1151685 1154975 1147098 1145069 1138003 1112310 1078072 1070440 1104668 1114394 1093274 1050412 1001528
12502 1001528 963387 936398 923629 917914 919437 923813 920820 898519 862415 824374 799413 777556
12490 777556 756475 743679 736787 720955 710245 701518 693872 687120 680581 667771 648964 629940
12478 629940 618637 614942 612207 600111 589446 586370 582232 576202 568086 553197 537943 527695 512642
12465 512642 491947 473611 462108 458396 461346 468528 472890 470028 473732 482538 483996 480305 485500
12452 485500 488619 482807 466372 455320 447503 447377 431417 414425 398636 391042 384696 377597 367809
12439 367809 355496 338876 325365 321346 318223 313331 303642 305819 308389 308072 305677 302795 305201 300405
12425 300405 296700 299512 287428 278607 269968 256977 250876 253452 247216 237879 232443 229074 220193 221873
12411 221873 228117 234704 236295 235796 234525 235744 237241 244168 244655 234252 218805 208467 198525 191072
12397 191072 179136 165503 151041 151375 159993 173269 188948 198453 210497 219193 205164 179418
12385 179418 160237 154984 150014 136732 131120 131644 135486 134229 133742 134620 139153 135251 132739 140380
12371 140380 146870 152571 156071 152866 145689 131259 118681 111783 108858 106630 107970 116876 119673 115165
12357 115165 110364 111502 121638 133918 137997 125624 122793 124358 129301 130551 130139 132644 138483 144811
12343 144811 140220 128894 115758 99272 90996 91789 90053 92284 92166 91087 95372 99129 100166 98734
12329 98734 91763 91472 86820 81705 83635 79811 77799 77552 70234 64223 72795 78319 80065 78416 78925
12314 78925 75996 70868 73441 67619 59552 56478 54249 48533 51212 52705 51830 53246 57402 60196 59019
12299 59019 51322 51408 44008 40995 36224 35206 35151 33618 42792 51719 50350 43628 38694 36146 34808
12284 34808 37133 40155 42338 47153 48186 48346 45364 48901 55878 58918 57973 50796 50935 50645 48061
12269 48061 50862 57551 58669 54609 53237 48268 50645 50426 52345 54630 49438 43227 43820 41579 43867
12254 43867 49499 51734 51995 58124 60539 54617 45084 47366 52699 63701 72034 81401 89624 87284
12240 87284 91261 96015 103023 113808 144336 188074 244979 341885 499698 780299 1226048 1731279
12228 1731279 2135041 2414191 2287029 1638681 1084760 770103 590878 485492 413447 367202
12218 367202 326566 297946 273812 260601 251892 237792 215436 196700 184121 174633 160981 153160
12206 153160 146138 147253 151139 143094 129069 127073 136016 137240 125469 121778 123592 118881 112931 112193
12192 112193 119610 118733 110404 109318 109234 102005 93719 96929 94639 88015 81920 80755 88253 85668 86964
12177 86964 86570 85368 75433 69201 62380 60271 57017 55964 59246 63392 63666 63935 63932 57727 53658 62482
12161 62482 71792 65562 63867 66138 58440 57711 56368 49400 44255 49153 49583 46909 43477 43437 39879
12146 39879 38347 42061 40293 43484 34781 30672 33648 38427 41514 41639 42591 47580 43515 38919 41807
12131 41807 49246 46791 46980 43495 46353 35372 31305 28918 31349 38819 42465 39122 30005 35444
12117 35444 39089 39253 43348 38933 32010 31459 33260 36226 41123 34646 32208 41387 46770 44927 38800
12102 38800 33602 36481 40583 30524 23858 23882 27483 37217 40848 40649 36509 27628 20776 15290 12117
12087 12117 19039 19664 16906 15824 21024 31542 30761 25470 23836 26269 19985 15237 15743 19210 18719
12072 18719 19014 23113 27908 26591 23124 21765 19224 17333 16462 17962 17916 17389 14083 18832 21850 16923
12056 16923 11492 8792 9395 10008 9826 9548 11745 8398 10863 11219 9796 15171 16005 12670 11714 15356
12040 15356 11413 11629 11172 7747 1064 5059 11508 16252 16802 14829 16903 22202 17873 12157 11655
12025 11655 13638 11732 15046 11400 7562 6704 3735 3566 9658 9670 8766 13591 17560 15131 14515 19239
12009 19239 18481 9424 13837 15700 11580 18047 19059 14979 10792 14153 14940 12087 17419 19627 21213
11994 21213 20847 21079 11888 817 -630 7814 9356 10804 3743 5516 4610 11327 17362 10567 5457
11979 5457 10700 8253 8178 9610 7923 13534 20584 27004 22153 10690 11289 4817 1010 1445 -904
11964 -904 -2436 3116 3600 5297 13629 12922 10973 5743 3413 8465 6185 3626 5641 8059 3793
11949 3793 6071 9472 11007 4686 -1194 -5664 -1758 6767 10610 17784 14319 10490 11323 2835 343
11934 343 7263 8268 5369 1201 8624 8693 3440 9016 11162 6816 9306 10234 11540 12143 8441 3755
11918 3755 5849 2032 5311 6697 2729 4491 6130 3092 8170 11240 12214 7880 128 -5427 -7672
11903 -7672 -4866 -6876 -5144 1768 8601 10368 2061 5246 9259 6700 6307 3758 -1095 -2458 -1428
11888 -1428 5845 13139 14427 13165 10506 4115 2680 2785 765 -4444 -744 3053 2171 1460 -2966
11873 -2966 462 7089 9126 4572 -2452 -4011 -7564 -2102 2739 13660 12655 4050 5900 9638
11859 9638 9158 10163 11741 9925 5910 4105 586 -1055 4848 10946 9508 2763 1029 626 773
11844 773 3824 -380 1437 540 3645 3349 4131 8090 -172 -6365 -4995 -3753 -2028 -960 3594 6069
11828 6069 7135 5239 2971 1474 5562 8411 7591 4344 -246 -5418 -2132 -3511 -5463 -5072 191
11813 191 13288 15063 12348 5985 2177 2647 -1022 -5681 3943 7926 4705 -6201 -4463 3390 1927
11798 1927 756 4824 12697 14849 10612 14582 20699 13219 9130 12869 11416 4678 4539 5368 1697
11783 1697 1565 861 6334 5520 4473 6939 9462 1276 -244 2334 5288 5441 9432 7415 8648 9429
11767 9429 11320 -1343 -1821 7373 10803 4009 -1947 -1441 -861 5172 10551 7609 4602 2619 -975
11752 -975 -1868 -462 3670 5028 725 -430 3188 8205 7743 7847 4636 4635 4850 7908 7898 5800 1641
11735 1641 -2086 -7201 -3385 4143 9021 6368 2201 11079 6911 1351 -515 -4530 -904 4356 2304
11720 2304 2219 6590 5120 -1671 -4045 -1811 -8090 -9001 -9946 -5147 -262 5201 9186 6035 1771 -537
11704 -537 -402 -6830 -10600 -8254 -5148 -3377 -7995 -4940 -3707 -5193 -5211 -8924 -8738 -5312 -5844 -2103
11688 -2103 7669 9626 9090 6658 10447 6306 2839 3176 3372 6847 12258 13386 9050 6969 4313
11673 4313 6093 3788 3628 1279 -4263 -2270 -7723 -11330 -9038 -10832 -12445 -2899 -283 -743 -1604
11658 -1604 4674 897 -8718 -11477 -4168 1984 -1180 -8674 -9748 -4909 557 -2369 -2012 -2436 -5882
11643 -5882 -3253 -1521 -1837 -5982 -6668 -5424 -6434 -7027 -11583 -6208 -2092 -134 2233 5366 1052
11628 1052 3566 10560 12646 4749 -1588 2335 1955 3345 2675 -1933 902 2108 -3028 -1928 -3418
11613 -3418 -3185 -3961 -919 30 2113 8362 7146 11376 13182 11383 9930 5433 8619 5952 -1520
11598 -1520 -3679 -6315 -3034 -2270 -876 3801 1432 2632 1225 -3612 -4401 -1936 -1419 -2675 122
11583 122 2596 5779 8243 11670 7516 4702 -1359 987 4080 4588 8183 9458 9674 8724 687 -7203
11567 -7203 -9060 -9870 -5819 2559 3661 2289 -2889 -454 83 -2902 -5526 -6094 -1800 -2674 -4183 -9822
11551 -9822 -8095 -7493 -7080 -3235 976 4496 1127 -9 2863 3892 7406 10308 18767 19408 15080
11536 15080 11572 14831 12842 314 -1499 -5285 -4772 302 4964 11194 6020 2098 -250 -5280
11522 -5280 1011 6965 3925 -2934 -7741 -3152 -4974 -2085 2310 7373 7993 2271 -1155 -5843 -8801
11507 -8801 -6300 -2667 -2237 -1747 7503 3345 -202 6623 11372 5181 -2080 -5359 -4733 -6779 -2540
11492 -2540 -8040 -13505 -12564 -4041 2854 -894 -3374 -8124 -4420 151 -614 -1423 -1904 -2016 31 2618
11476 2618 2382 1799 -2095 -6368 -7752 -3582 -4294 -1651 5 -5506 -7521 -3539 1446 1598 3567 977
11460 977 2676 1847 -5247 -9291 -8439 368 7043 7905 7294 66 -3362 -1562 -2957 -4001 -1602 3088
11444 3088 8563 7036 2035 -1164 -2037 -2421 742 7120 6167 2835 2407 -356 3356 -85 6612 8961
11428 8961 6593 4021 2837 695 3678 4452 -13 9736 12782 10437 11763 10640 7167 1789 5293
11413 5293 11907 10719 9645 5186 990 3669 5834 -2730 98 6341 7605 5653 9254 8230 1125
11398 1125 -2351 -586 5999 3995 1585 -1726 -8170 -11604 -8930 -6163 -1881 -903 -5566 -6438 -1294
11383 -1294 -2292 4441 3819 4078 2028 -4489 2071 5401 1572 -579 -3920 -3947 830 -5328 -4976 -1627
11367 -1627 -695 5159 2022 -1633 -557 1504 2161 1981 436 -3115 -5580 -6298 -5910 -2646 2773 4713
11351 4713 3685 5254 9843 6285 8972 17488 22074 20114 18428 21771 23518 24408 21052 13447 8721
11336 8721 12981 15434 6265 2713 8480 11041 5375 6485 7434 5902 1914 683 3908 1820 2221
11321 2221 3323 735 5941 10537 13096 9542 8768 12150 15741 17290 16471 20075 21831 13755 9903
11306 9903 11319 7201 11288 14199 16024 16527 18135 16319 22440 25450 21718 23542 22577 17936 18616
11291 18616 26675 26651 22840 17540 16332 21852 27576 24191 18994 15394 14773 17278 26327 28223 20031
11276 20031 18510 22111 22867 18071 15864 15052 18839 24653 22809 20449 12767 6194 7053 12581 17265
11261 17265 18474 11534 8191 6919 1427 436 -1876 -6644 -256 12546 15641 9967 13076 12971 18168
11246 18168 24345 28607 28958 29400 34045 35330 33291 20771 19836 21501 23626 18176 9935 7208 7755
11231 7755 9133 5688 2116 3645 -688 -5582 -7280 -10448 -7017 4069 5420 -2143 -6509 -4253
11217 -4253 -4251 -807 994 -2042 785 1760 -5640 -3124 817 507 3700 2397 3188 -4246 -2276 3459
11201 3459 4785 1707 -816 -735 7939 10906 6067 -2100 -2799 -5387 -10767 -5060 -3288 -3345 3593 6065
11185 6065 -540 -3628 -1082 1061 2496 5229 -2826 -6022 -7518 -10657 -7359 -5499 -7115 -1099 -4962
11170 -4962 -6429 -1381 -1694 -6987 -8599 -4564 -2996 -5601 -7206 -7250 -9407 -8335 -8685 -3763 -2193 -3366
11154 -3366 -1741 2451 3407 796 -5075 -8080 -5668 -3138 -1968 -773 -5606 -5452 -7942 -1022 -498
11139 -498 486 -683 -4858 -379 2913 3438 3740 4661 1909 3225 -194 -2622 -686 -113 -3523 -2512
11123 -2512 -5479 -3076 -193 -1151 5515 10805 5556 1961 2332 917 3884 10136 12967 7825 3835
11108 3835 5303 7504 4472 -717 -3473 -5798 -284 1242 -10569 -11779 -3033 -1864 -4733 -11286
11094 -11286 -9782 -3968 3034 6643 3557 -1425 -1423 -2316 -1521 -1547 2571 -2027 -4376 -2325 3993 4181
11078 4181 1014 -490 693 303 -2328 -1735 -3598 -8808 -2941 -2839 -1528 -3397 -3015 -2810 -2820 86
11062 86 3885 -3725 -6910 13 8250 6534 -3395 -9313 -4786 -3010 -1126 -1389 1315 4712 4154 7460
11046 7460 3110 1484 9177 8408 6028 8211 5567 462 5576 5293 124 1480 -4147 -3897 -1097
11031 -1097 -1689 -2244 -4911 -8621 -7277 -5318 989 2948 -300 -2633 -3459 -5463 -6629 -3058 2736
11016 2736 3445 909 3308 9324 6683 2168 -319 -1846 -3291 -2607 2140 6108 1184 -5077 -6395
11001 -6395 -2864 -244 -6422 -1919 -1499 -656 -2991 -1615 -3253 -37 2025 1385 5260 -732 -4665
10986 -4665 -4095 -4265 -5074 -4778 -8879 -4757 -1524 4802 11069 14059 13794 11365 3744 -1441 1273 -630
10970 -630 -4142 -5198 -8144 -7279 -12916 -13016 -7481 -3140 -5467 -6763 -7033 -4804 -5914 -6574 -6943 -6437
10954 -6437 -2612 1728 1159 -4166 -7074 -11100 -14499 -9613 -8908 -10741 -1079 6436 9211 9867 8930 7188
10938 7188 10531 7138 2484 -73 -4393 -493 819 -5515 -6414 -3769 3328 4252 1709 -942 -6728
10923 -6728 -5891 -8335 -12358 -5596 439 -4902 -3930 -6108 -11862 -11575 -1425 102 38 1485 4736 -1847
10907 -1847 -11239 -11120 -645 4397 1372 3054 1625 220 5858 411 -4609 -4495 -1950 -1822 -7372
10892 -7372 -8721 -6870 -3385 -5180 -1343 -2414 -806 5934 4806 2567 182 -2879 -371 1506 331
10877 331 -423 1208 -5535 -11538 -10563 -7635 2357 1238 94 4388 4398 4415 5901 5676 4967 1827 5088
10860 5088 7442 8799 10206 11082 3127 -2977 955 -2755 -1272 -915 -4174 -4054 -281 5794 984
10845 984 -4347 -4896 -2519 -442 5302 3150 2496 -388 -4164 -7148 -4573 4054 3334 -2524 204 4071
10829 4071 1101 -3563 -4761 -4212 -7621 -4696 -2951 -639 -2208 1202 3021 4609 854 -2293 -4869
10814 -4869 -7479 -10911 -9360 -10638 -10698 -7982 -3262 1175 5056 2777 3847 -546 -6954 -7167 -8495
10799 -8495 -7963 -6886 -3670 1977 -350 1717 11137 9836 3639 -3313 -6008 -4992 563 7667 6452
10784 6452 2113 -5001 -11582 -6054 -1242 -4207 -7973 -1799 380 -2567 -1754 -346 -234 6831 7666
10769 7666 3699 5081 10703 15351 20986 12152 12049 12479 14398 12615 5782 2216 -3562 -2388 -3229
10754 -3229 -1567 -2386 -8179 -4439 6501 -80 -1971 -174 7086 7590 7621 10278 6379 9894 10284 8409
10738 8409 745 -802 429 5954 9954 4275 3261 7667 5488 4822 2250 2245 7098 11462 12465 13095
10722 13095 11838 8128 9283 11619 13275 9684 6858 5260 3714 3309 1063 -6622 -4269 -7274 -10065
10707 -10065 -5575 -5766 -2348 6905 12086 8936 11518 7240 4881 1090 -887 -3196 -3539 -3284 -6134
10692 -6134 -3976 -2602 1535 8844 2191 -4389 1217 -3254 -3333 -5081 -6010 -4669 -2874 -9050 -7219
10677 -7219 -5827 -6271 1101 -462 372 2345 214 -2007 -2155 7260 5309 -3845 -14915 -14067 -13232 -6166
10661 -6166 -3971 -3579 -3354 -3544 -6891 -2823 -2828 -7726 -11892 -4030 1943 3807 1840 -741 -2592 1384
10645 1384 2597 3244 7982 4338 -956 -4082 -5047 -4038 -2477 1804 8863 10529 7750 5368 5134
10630 5134 2927 230 2781 5444 2956 -1128 1355 2121 854 243 1923 4120 -445 -3179 -4116
10615 -4116 -873 1771 4650 8876 113 -4197 -6132 1945 3699 3317 2988 2408 6972 15725 19175
10600 19175 30633 43916 45486 52689 55102 56503 64204 71304 72217 71941 73872 73955 72029 70003 72195
10585 72195 75366 67713 59727 49579 33832 29271 29554 27740 30838 26064 22134 22102 20914 16856 17648
10570 17648 24171 22061 21460 18618 12637 2564 -1053 4375 6086 7957 7192 7503 4398 5442 3103
10555 3103 1364 -2306 -3281 -6332 -9414 -6143 1221 4963 1892 -1926 -2585 -1956 1282 8869 12422
10540 12422 14461 11867 8371 9818 13153 12476 3837 3552 882 3303 10574 6941 -2341 -189 2507
10525 2507 9004 8158 8932 6931 6142 1878 3595 3734 -4837 -3417 -568 3237 1778 983 1271 -751
10509 -751 11612 10781 6099 5858 3846 7504 3936 1809 5593 6333 4648 7432 11301 5334 1145
10494 1145 -2335 -2280 -1215 -2931 -98 2296 -388 -2311 611 3494 4682 -856 -7696 -9552 -8607
10479 -8607 -4105 -2104 -8032 -10308 -8143 -6364 -8045 -1177 3737 10115 13143 10155 6600 8944 7214
10464 7214 -534 -7878 -9941 -7087 108 -4525 -5962 -2413 -425 -2414 -5601 -7596 -8934 -11594 -9159
10449 -9159 -1212 689 -4585 -303 466 450 -4025 -10237 -10166 -9029 -9787 -8350 -16515 -8271 -927 -3289
10433 -3289 -3230 -3112 -214 3189 5002 2178 2677 -3313 -4329 1662 7672 8634 4327 -983 5252 16011
10417 16011 16493 12733 3835 -398 1333 3084 5347 9893 9333 14231 11634 6190 5053 984 279
10402 279 1553 6966 9967 8292 789 -2672 2266 189 5888 2111 3060 2339 7107 10982 12789
10387 12789 11502 5469 5990 3390 -386 -2363 979 3623 8377 12787 10839 4610 2121 5682 6372
10372 6372 3592 122 2914 -1053 -3035 1170 -2816 -3725 -1902 1186 4543 1443 -2024 -1756 -2102
10357 -2102 -4762 -3742 1442 4335 -3944 -8260 -5316 862 6861 697 3063 545 -1017 4487 2176
10342 2176 3763 206 -8269 -12377 -9012 -3563 1836 -2078 -5724 999 -2234 -8142 -4553 -1109 -1335
10327 -1335 -3389 72 1095 -2403 -5575 -3153 4136 5574 9658 11755 9200 10220 7460 10321 3989
10312 3989 5240 5360 2893 -369 1648 3139 3682 5820 4577 324 988 2192 352 -6863 -11864
10297 -11864 -11335 -9206 -5268 -3681 -4526 -7136 -7840 -9558 -13611 -10948 -4552 -932 -302 2148 3935
10282 3935 3899 5396 6623 11979 15440 18951 13622 12931 13894 9612 15907 22308 19434 17102 15265 25196
10266 25196 29308 33578 38880 36391 30285 20399 19635 17944 12750 5122 5630 8230 11160 12051 8664
10251 8664 6462 -208 3148 8332 10225 12757 12999 9542 8181 13095 16142 15416 9836 12194 14920
10236 14920 15814 14233 21186 24948 19373 18285 19391 21285 30994 33180 33797 38218 41220 37941 33112
10221 33112 35228 29647 23547 24952 29099 29073 28070 16335 11616 9956 14395 15884 14639 9515 5983
10206 5983 6619 11154 8449 7067 6715 2546 -181 1019 -3660 -3366 -3803 1598 7873 10433 6416 6496
10190 6496 8018 20010 28826 28779 21804 22350 25520 17475 10590 13857 24048 27177 25675 28083 28144
10175 28144 28412 30317 20371 15933 13953 18151 17167 18601 20854 12010 9292 5788 11030 10820 306
10160 306 -1513 -7528 -803 8317 7936 5238 8728 7658 1761 -3768 -10044 -6638 -867 5329 -514
10145 -514 -9030 -6447 1323 11030 17518 10160 1491 -3804 -1825 -429 -2394 3262 4943 8585 15413
10130 15413 14851 7759 5745 2485 -1915 -1048 -3399 -4460 -3004 -462 -2090 -2318 -1704 -4559 -6127
10115 -6127 -11822 -14939 -15793 -15379 -17401 -16584 -9886 -4839 -1303 -9411 -8230 -6863 -3057 -613 1284
10100 1284 1952 4487 9026 12615 12260 7623 4820 3859 3441 -1100 -1564 -1772 1140 -294 -3999 3586
10084 3586 7701 5539 5036 809 -1157 -7264 -8389 -9197 -6919 -198 338 -949 -6324 -3690 3620
10069 3620 834 -772 4248 3883 2371 -4524 -9600 -14053 -13990 -14509 -10884 -6031 -3926 990 1547 2669
10053 2669 -85 -5918 -2314 -721 4188 5316 2071 -868 -1642 2248 -1356 385 5825 4262 -6341
10038 -6341 -4672 -2921 -3100 -6771 -7368 -7486 -4864 1826 5852 7838 12424 9608 3158 5794 6888
10023 6888 2418 -1129 -4697 -3030 -1123 1061 4009 201 -1793 -983 4782 9968 10126 4210 2932
10008 2932 6868 4543 485 1349 4021 1397 -2831 -1059 -2478 -7730 -10572 -8166 -5128 -7528 -3524
9993 -3524 -964 -433 -2041 399 5064 7969 8421 10593 11503 6198 716 -286 157 8041 12886 9484
9977 9484 4509 7665 7120 3682 6761 3195 -7257 -14582 -14151 -10354 -10158 -7838 -7303 -3009 2376 5524
9961 5524 3447 -3987 -13324 -11456 -951 23 -4613 -3804 -1604 3778 6496 2147 1755 534 894 2273
9945 2273 7205 2702 -3549 -9755 -9304 -527 1389 3998 10556 13138 10770 4810 519 -4806 -5691
9930 -5691 -158 845 2630 3752 5153 -839 -783 -808 5654 5928 -1365 -2040 -2356 5728 7446 10086 3493
9913 3493 -2355 -3727 -4197 -1524 1330 5022 -941 2610 6719 7975 6453 9781 13663 9665 4254
9898 4254 10522 17397 14638 8000 -2473 -2299 10551 12485 7016 3254 2879 5272 7388 7511 3490
9883 3490 11062 13246 17777 19827 18348 14780 16367 11254 6738 8692 3702 2969 2568 4623 1681
9868 1681 4880 6671 3261 2804 4214 542 304 2965 1804 -708 -4669 -6520 -6222 -1436 -1641 -2993
9852 -2993 -2307 -3964 -5253 345 6666 7408 6620 1615 4506 7201 10298 10597 16875 17043 13183 14277
9836 14277 15915 13177 5576 1732 4367 8268 4381 2537 1957 3394 10000 15881 15930 9853 3589
9821 3589 1305 1036 159 732 4870 7993 8962 3089 4930 2873 -423 -29 158 2077 6764 7025 2836
9804 2836 -2375 -2212 -3240 559 5670 3886 -2272 585 -603 650 2927 3923 9498 5597 4289
9789 4289 805 -1269 372 -1055 83 1565 87 3273 1266 -2971 -4497 -1051 -1925 -511 -5308
9774 -5308 -5801 -10144 -8355 -2661 -3853 -1664 -1729 -862 -3950 2668 1112 -636 -5335 -4363 3004 9128
9758 9128 11761 7392 -1803 -6121 -4203 -6264 -7323 -7639 -7218 -1717 4509 5144 1764 2108 3003 5457
9742 5457 1892 -1497 -2516 -3811 2714 4913 4589 4539 4539 4891 -1247 3568 7171 3097 193 -983 280
9725 280 5680 3762 -4237 -7817 -6713 -2629 6159 3014 -2140 493 1681 8146 6990 6680 3772
9710 3772 3824 3412 1393 860 4595 7303 6931 5828 3222 -4245 -15291 -10448 -3179 -1243 371 5001
9694 5001 2985 -2858 -5375 -2950 -3113 1781 7260 10556 16761 15673 13407 9744 10733 5901 8149
9679 8149 3403 2394 7675 8342 5984 5025 3993 6976 6667 5720 7008 11610 9510 10400 7883 5480
9663 5480 7075 12306 9541 7913 5616 94 -802 -2198 -2528 -3562 -7176 -8192 -8082 -7386 -7361 -7560 -9915
9646 -9915 -6270 -2051 -3848 -9542 -16890 -19464 -12618 -12952 -14049 -8870 -9326 -5111 -3215 -2337 -4051 4114
9630 4114 8803 7306 6476 7880 8734 10461 11561 9632 7718 4778 3552 8680 14104 16912 14326
9615 14326 12602 5342 6763 1684 -490 1944 6286 4253 -3651 -7674 -6117 -2746 4787 -880 -8259
9600 -8259 -5047 -626 -3232 -1485 -295 1003 1708 -963 4030 4874 3897 4661 5926 5439 6963 -571
9584 -571 3167 11363 10788 8453 6560 10716 6082 8751 9129 5263 2857 -2944 -7189 -5727 -669 2232
9568 2232 1114 2836 -2844 -3239 -2842 1122 6762 1215 -6146 -4639 -5162 -6784 -7083 -3137 -1134 -1480
9552 -1480 -1296 143 6873 3441 491 1683 8495 11367 11916 15256 21834 16635 13444 14186 9750 8791
9536 8791 13006 11542 11990 11987 12919 15008 13032 12416 10268 5414 2020 8256 11036 6045 8093 11909
9520 11909 9717 7527 6481 3749 5002 11840 11679 4580 454 5500 2162 -1906 -5368 -8942 -6183
9505 -6183 37 6506 7499 10226 10240 12826 10753 13454 16111 24177 19323 13996 14412 15079 13841 20231
9489 20231 26198 23117 20562 18228 20114 17499 12546 11363 9018 11069 4935 3519 7482 11904 11289
9474 11289 10649 16785 16371 13728 15073 13028 14660 13983 14313 9813 8149 6803 9275 12010 15437 17534
9458 17534 20396 18372 19824 20611 17065 21454 25418 28356 26926 29997 32095 33448 41088 41934 43098
9443 43098 45636 46872 51651 52868 55292 56178 59027 59598 57400 47210 46069 43678 47112 44443 36290
9428 36290 33058 31824 31702 32288 35148 32905 27799 26222 25608 24220 24171 23262 20622 30790 37810 38052
9412 38052 31413 20588 24654 28186 33145 36124 37533 41534 42918 39119 35087 38177 46261 48116
9398 48116 46095 50983 47148 47411 48205 46363 40726 43545 47303 43274 39669 41683 47389 44854 48468
9383 48468 43450 44983 48060 42969 37145 35569 35800 38792 36905 37088 39061 40657 39891 34092 34587 36620
9367 36620 24940 19177 22184 30885 37939 40798 42587 40426 41577 43597 41211 36598 43050 45937
9353 45937 47161 45199 38851 32734 30293 36410 40830 44685 49324 48047 49655 46327 46126 51794 57763
9338 57763 60543 65251 68294 76090 89629 88391 79846 74150 77763 76981 78813 83617 93027 95224 92279
9323 92279 88126 84853 78119 69540 72159 69613 63115 61549 59203 62186 64990 64351 64627 65149 63318
9308 63318 60952 56574 51242 59971 69499 79312 83847 92312 99284 106020 117561 131040 144975 162233
9294 162233 183153 206111 236760 269316 302549 322116 340889 364038 394988 441962 514856 609420
9282 609420 737050 890570 1055554 1197780 1264287 1233292 1110493 946988 793903 674716
9272 674716 587575 518165 477468 445364 419735 396268 371656 350510 330864 312735 286608 269879
9260 269879 251615 240803 232756 231898 230395 223358 218134 224770 234380 252084 262128 269257 274085 281869
9246 281869 291391 297006 311412 326989 347683 361923 381028 401741 423099 442985 460855 475267
9234 475267 476194 471971 463336 451409 432140 416820 402139 382093 363652 340964 325730 313302
9222 313302 301595 299813 303847 304856 306983 317435 322866 316126 301633 289228 274315 259068 242187
9209 242187 233010 221226 209862 204173 206470 205805 204254 205968 208364 211069 225223 243895 264459
9196 264459 281816 298630 316905 327906 341353 368890 399048 424883 435747 436689 432835 423249
9184 423249 406052 379881 349734 322512 299121 291122 288964 291489 297101 302968 303572 312151 321955
9171 321955 321746 318181 309693 299041 276575 243985 218325 201272 186131 183612 183468 179113 174894
9158 174894 174478 169975 168156 168020 155881 144122 136683 137348 135038 129309 128407 134049 139570 149151 151081
9143 151081 160360 178981 197163 214749 217184 209787 200388 192622 198463 205586 210833 229087 233979
9130 233979 225577 214299 193688 182232 174703 163962 153957 140621 134626 126238 123534 130499 131174
9117 131174 124144 116968 117424 110362 103664 94653 91290 87860 81852 86002 88924 93503 92689 91584 85793
9102 85793 85535 87953 87380 80254 71026 70313 68244 63228 67356 74584 73787 72786 71933 73213 69730 67212
9086 67212 68621 75929 77182 73379 72065 72330 79927 74982 73989 80292 82419 71122 65821 62775 67622
9071 67622 64073 60073 60637 61018 62554 59982 63672 68305 69507 73750 75755 78047 80295 79436 71359
9056 71359 64095 61861 69325 68042 60674 57895 54293 48166 50367 54558 57353 61461 53708 51981 51929
9041 51929 57447 68259 66196 61064 56517 57371 60351 65134 69223 69023 65709 60637 61396 67626 74942
9026 74942 72163 67524 65689 64950 64476 67307 61809 57997 56317 56181 60394 60149 61262 64499 68444 74696
9010 74696 78329 75999 73551 78764 84109 81050 76163 68096 59942 62231 66463 67025 61229 57305 59306
8995 59306 61364 59898 55315 56589 55114 56063 54234 56274 53061 51070 63171 67007 69957 74128 70468
8980 70468 73210 79243 78930 74610 67772 66102 65265 64029 59303 57030 55894 56770 55333 54343 58328 62526
8964 62526 66019 68598 71658 69331 67855 71053 70595 63996 58040 55308 56953 60526 62783 68783 60752
8949 60752 60441 64803 64635 59749 53739 56935 63631 61696 62044 67839 70731 72355 70904 69143 64355
8934 64355 62398 67008 67977 69037 64918 63279 65082 66218 60747 60745 62096 55682 47188 44486 49827 63631
8918 63631 74154 78770 84366 93677 109774 120320 134098 142682 135200 116108 99519 94001 93928 85698
8904 85698 78305 81302 79381 73727 70203 77424 81109 84062 90955 99523 112921 117711 126631 141995
8890 141995 146983 144020 142481 134132 122791 111418 99922 99243 97112 92787 93254 104057 113771 119552
8876 119552 122922 122788 133831 153806 171160 181975 185831 182178 177219 174647 168444 168939 178340 181834
8862 181834 191927 190837 182930 176769 176741 177933 173236 171606 174910 185211 196790 209600 233143 267696
8848 267696 302304 337054 372290 390394 400053 402875 399681 385406 353838 312798 285604 270053
8836 270053 252491 236069 223727 215130 209151 202982 201491 202030 203324 204674 202794 203062 207486 215917
8822 215917 218559 231118 243290 258708 275884 293328 297607 302144 305563 316369 333512 350078
8810 350078 363365 378217 402694 436717 475417 511690 546103 580345 617541 645503 669201 682521
8798 682521 683722 675550 658642 644555 629226 614223 588812 556722 516939 475047 434653 398747
8786 398747 373449 364712 346319 321301 305454 295055 288057 288657 282023 283824 291615 306683 316664
8773 316664 325756 331411 338359 351156 359642 364923 372701 382404 390587 399585 407900 413952 427410 446997
8759 446997 475249 509096 541829 577593 608562 638247 664103 689155 714369 732416 736041 734382
8747 734382 729382 705220 658679 608202 554843 504435 463686 433718 407631 388542 378447 375256
8735 375256 361880 348014 337293 334175 339420 357889 398238 447857 510646 590890 682879 756927
8723 756927 799159 807040 789024 750770 686644 604998 540092 497923 481708 481111 484078 494135
8711 494135 508693 522350 533789 544638 551807 565598 583856 595886 601815 598997 582672 550014
8699 550014 512435 471516 438329 420788 406353 398966 400377 408592 419105 422363 430803 434919 429532
8686 429532 414414 399966 396895 399503 412340 433163 453095 469150 483621 495770 515031 547700
8674 547700 580119 619279 660656 690452 711006 709641 695377 675539 652539 631726 623726 611906
8662 611906 589379 567439 546077 529466 509428 489408 462339 432833 397291 365602 352459 342164
8650 342164 330789 313693 295624 279325 269004 263563 256933 254825 246081 236398 232257 225431 215332
8637 215332 212230 211602 215208 215332 223667 232413 236663 250542 267192 286624 324288 371870 415505
8624 415505 444962 469138 485185 491233 482424 476502 448948 397974 345673 311140 291867 278604
8612 278604 270412 267470 269477 262719 256221 256253 253483 239127 226427 220163 201655 187819 176920 169070
8598 169070 163524 160459 149327 142125 139540 147670 146110 136359 130054 124776 126910 126964 113953 103824
8584 103824 98203 96257 102434 104444 106535 112704 120029 123187 122917 125846 128656 128066 127686 130887 129506
8569 129506 125981 127436 131837 133153 124469 113764 108554 108564 103464 106337 107135 104853 98768 96249 98904
8554 98904 90888 81012 75911 78610 77843 73452 76153 69161 70058 73644 75850 79302 76046 64702 65659
8539 65659 76825 79771 88561 94499 90950 79562 74769 78495 86463 92829 97021 102141 105535 114861
8525 114861 124065 132120 133564 122482 122983 112371 104366 114641 117601 122868 126982 120715 103888 88990
8511 88990 79245 73458 81115 84444 85575 88957 90598 91915 84282 70919 56917 47246 51308 47847
8497 47847 49640 53152 51630 56082 53759 51550 56926 59586 58614 54972 59106 57694 51924 53488 54023
8482 54023 58276 58128 55711 55457 57381 61220 70299 74146 74841 76668 78534 73130 65102 66498 69844
8467 69844 71327 68930 63938 60137 53668 48191 40023 38603 41642 46829 44623 44385 44907 37285 32187
8452 32187 36261 38049 31636 29836 34930 38819 36154 30650 27892 34853 44913 57742 72027 84394
8438 84394 96948 112673 122671 117655 101836 89025 76970 69429 53074 42479 42513 47939 47023 43387
8424 43387 42643 41519 40160 32940 34683 36073 34140 30402 31963 31630 34637 39203 43333 36817 40152
8409 40152 47213 46980 45254 49569 51445 56735 52626 41627 44951 45688 45694 41502 47809 55363 53530 60676
8393 60676 78903 107866 136676 162079 175922 167605 145410 123243 94087 72736 56501 49400
8381 49400 57020 60401 46560 38633 44013 52225 58656 60147 60750 54120 48825 54256 62407 60950 48614
8366 48614 33891 29298 33873 34761 37534 35860 33214 31343 28922 27332 36707 52411 60947 62773
8352 62773 54693 50124 45824 45988 57599 61116 57897 56439 71278 92026 100544 105022 96417 80248
8338 80248 60806 44317 33092 31404 30625 25729 26516 25004 25436 20560 21616 19171 23177 24958 24357
8323 24357 23714 17636 19234 22265 24439 20816 19224 26110 25570 24567 23483 24095 26205 29149 22400
8308 22400 16258 20104 23048 22099 25135 32858 32881 29836 14509 9230 13188 14853 17718 19415 19303
8293 19303 16065 18841 21318 21213 19062 15457 12728 15659 21287 26638 24963 17701 10292 6328 4965
8278 4965 14232 23707 22320 21196 21017 23521 17478 18258 21903 22252 16075 17179 17602 15372 22830 33139
8262 33139 30678 21671 22410 17435 19326 23470 21340 19746 21116 18847 15720 17646 22036 25204 19369
8247 19369 10600 5542 6712 14484 20499 25319 24886 20783 14226 11132 7011 7982 15643 20647 19515
8232 19515 18657 14157 15166 14104 14488 17173 18817 14637 12593 21129 21716 13408 7469 7965 9654 9048
8216 9048 11716 17002 15169 25829 26983 18934 17688 24334 25936 21723 18703 21606 22467 20700 19313
8201 19313 18550 20724 17106 13510 9573 16198 14902 19795 26064 30713 36659 36843 29302 28219 21100
8186 21100 16038 23417 16275 17622 20868 17688 18669 19877 21084 21112 20835 17843 14485 16905 23911 30903
8170 30903 29309 32327 37725 39015 34596 38546 40400 42514 44707 40515 40016 44667 52497 57437 60123
8155 60123 65701 74411 85779 95686 105508 118560 128996 129895 130128 129121 138619 150687 170026 195165
8141 195165 224422 273698 343287 427248 524529 634322 769074 917011 1065943 1179607 1248934
8130 1248934 1248778 1166197 1026095 863431 699839 562390 462122 393256 346676 311771 286155
8119 286155 265690 250729 242714 233440 220190 217631 217165 212188 216713 219597 237073 260898 280882
8106 280882 298842 308638 319637 334056 340122 334882 330370 333721 346266 375694 419837 487936 576842
8093 576842 694058 840111 1014695 1232634 1503484 1809787 2128267 2380513 2498079 2441848
8083 2441848 2201070 1848315 1495492 1191458 965025 808851 708513 635008 579036 538890
8073 538890 502863 478763 462655 445156 421294 402862 389731 380973 371427 376264 384104 393880 411690
8060 411690 426486 433828 437741 426998 407019 389432 390965 394234 401180 420684 451746 488448 531402
8047 531402 587038 657149 748125 857197 973111 1070032 1143161 1176398 1171237 1132695 1052291
8036 1052291 938223 820412 710845 609987 519813 460207 414208 374454 349218 330822 317549
8025 317549 309819 302588 297222 284490 272372 264004 256729 245113 238650 230374 220362 219433 215736 215883
8011 215883 216385 215387 211021 208094 214457 222330 233694 244352 253956 259211 261843 258634 239775 227062
7997 227062 216587 208756 198192 192069 185244 174362 169691 163805 150360 144663 140328 132455 128308
7984 128308 120429 116083 120558 126866 125415 122985 115641 109629 101844 95891 90385 91284 89360 88034 85670
7969 85670 84450 82962 84393 82261 77295 77361 86221 98092 99511 94897 95803 91162 93924 100482 102411
7954 102411 100793 101493 105627 97372 87273 80194 69758 72058 80666 84936 79553 74420 70233 64325
7940 64325 64692 65794 64829 56244 50052 49121 45256 44464 47488 47231 44284 40736 36648 41640 48663 54083
7924 54083 52078 46482 41927 46739 46705 40990 38837 39227 38159 34375 40136 44692 46217 43837 43621 46846
7908 46846 42514 39730 41416 39743 38397 36237 34419 31417 27738 27503 32014 31740 32739 33014 28614 28462
7892 28462 27230 25082 24779 29550 33226 29940 26064 18647 21432 19608 26355 24301 21399 22124 25456
7877 25456 27263 25962 23775 18676 20306 17878 17744 17061 16373 13172 11758 14051 20942 27857 27770 17283
7861 17283 13625 17471 17352 17509 23552 19738 7497 4580 14909 19826 18012 16677 15483 14637 17583
7846 17583 14629 14123 10368 10179 6983 6285 2743 -3833 1688 5744 8321 8844 8052 12048 18290 25632
7830 25632 22039 11222 5368 4639 6824 12254 17885 10184 3455 1415 -3568 -884 2427 2768 4286
7815 4286 1805 -1023 -1592 -314 7304 9962 11337 14626 18384 15337 17110 13687 4866 242 -4948
7800 -4948 -8617 -5409 1787 5215 855 -1041 1376 -3606 -12576 -11684 -8798 -3647 5506 15670 14159
7785 14159 7665 1965 4754 89 -9785 -15035 -17592 -13923 -13201 -13926 -8235 -1354 3496 7224 8293
7770 8293 8277 -8 -1577 2549 -917 -4680 -7421 783 9189 2025 1437 3312 -1140 -805 -3970 -8762
7754 -8762 -986 7713 10099 6748 8605 8392 4155 -984 -7774 -563 2444 1573 734 7666 8652 14567
7738 14567 16804 12662 11113 11595 6086 8433 10841 3248 1184 2811 -439 980 -3052 -3316 -1245
7723 -1245 -1330 -8181 -9447 -8067 -7274 -2767 2428 2057 -3121 -2997 1167 -1662 -3790 -2490 -215 -1695
7707 -1695 3265 5605 5972 9109 8057 7389 4266 2922 1481 -4724 -1866 -1557 -4096 -4695 4 509
7691 509 2056 9960 14702 15277 14892 12468 7554 5886 7610 13393 11821 5568 -371 -4849 -3089 -1298
7675 -1298 -4817 -1179 -32 1369 1701 5437 14135 18605 13253 11481 6855 5462 5597 2454 2861 5336
7659 5336 3639 4661 3555 5834 -437 -6407 -10219 -4937 95 5665 3510 1675 2593 2948 2020 1996
7643 1996 44 3744 3306 -2754 -10144 -12060 -8721 -10196 -3905 1261 1004 -1215 -4089 -344 -3314
7628 -3314 -8032 -10052 -6473 -5665 -4361 -7652 -4820 -9215 -9312 -467 994 6148 8188 2825 -3427 -3916
7612 -3916 -975 -4224 4706 11130 8640 -5060 -6935 -1527 3177 861 -1582 -3081 -2965 -4797 -7682
7597 -7682 -13219 -14360 -11609 -11597 -8060 -8552 -6052 -2585 3448 3766 2028 4529 10597 7406 -2557 -1816
7581 -1816 1217 -6050 -3117 6710 14768 10271 428 -4397 -2069 2461 2156 6117 6426 -4579 -12466
7566 -12466 -13448 -8705 -7433 -7348 -1321 -1978 2994 12287 9318 6540 4505 2596 3767 2194 2443 -1699
7550 -1699 -4722 -4909 -5007 -11669 -15182 -12470 -5166 -3391 -1645 3027 158 -3533 59 -3223 -5614 -5753
7534 -5753 -7808 -14964 -13998 -10328 -6357 -9329 -13042 -10620 -9095 -7879 -11464 -6312 552 4264 5094
7519 5094 682 -1220 -481 191 2081 -2356 -5813 -887 1310 1380 1629 2138 4972 3470 -3554 -5040
7503 -5040 1499 4825 2051 -1708 -1041 -3632 -1397 1058 -1529 -3041 -5462 -6463 -2210 -3161 71
7488 71 -1687 -2824 -4284 -6820 425 3764 -4877 -9949 -16047 -12303 -7240 -4836 -5209 -2893 -7297 -6307
7472 -6307 -1689 1067 -852 1277 2385 -3078 -5545 -7324 -11672 -1741 7670 1444 -4434 -5718 -4122
7457 -4122 548 2852 -8658 -15143 -11535 -3553 2763 4939 8895 10663 7637 2229 -6826 -10531 -3197
7442 -3197 -1162 127 -518 -1309 1183 1206 -4008 782 4350 3447 -741 571 41 871 -1622 -2244 -6959
7425 -6959 -8990 -5374 -4534 -3406 -1686 6464 5035 -664 -6168 -4677 1697 -1933 -5646 -1783 2860
7410 2860 4148 -3100 -5618 -5255 -560 -5830 -9545 -8423 -6119 -4915 -7251 -5566 -6955 -9189 -8770
7395 -8770 -5807 -13675 -16848 -18053 -15531 -12994 -13759 -11231 -5846 2938 8160 9776 4427 -1237 -1220 -375
7379 -375 -451 -3797 1126 6149 6912 1055 -4399 -5379 -2777 -2634 -6016 -6729 -9082 -10080 -7744 -7304 -15390
7362 -15390 -7716 2894 3744 2025 -3802 -12142 -7408 -4700 -4951 -2938 -2338 -5023 -8040 -8181 -3696
7347 -3696 3133 692 -5181 -2953 1085 1036 -899 -4532 -5429 -11210 -4561 -2177 -3521 -3251 -908 505
7331 505 1589 -576 -2626 -1707 1185 2096 -3264 -9824 -7422 -8916 -9383 -4953 -1037 -573 935 -193
7315 -193 -4365 -4740 -5598 -5981 -10369 -5330 -4615 -1639 -1025 -3816 1949 5530 3860 -2205 -2201 -910 -6656
7298 -6656 -11682 -8578 -6046 -4845 -5578 -6450 -1556 2209 2612 5681 8294 9773 3245 -4015 -6769 -4226
7282 -4226 -1737 4336 5875 4720 5198 -1461 -5767 -9507 -10512 -13447 -15651 -15406 -8675 -7498 -6846 -7631
7266 -7631 -4213 -3418 -2843 -2788 804 3975 7166 5177 4727 8384 5185 -974 -746 815 4207 4417 852
7249 852 -753 -4 -164 -2633 -5600 -8424 -5700 -1985 1108 2811 4545 -1400 -9443 -9982 2119 8882
7233 8882 3346 220 -1476 3163 1652 979 1911 3973 9757 13104 12151 5783 5471 -1889 -5846 1355
7217 1355 350 -2553 -5469 -1496 -756 -3662 -7193 -13375 -12930 -8426 -7824 -12238 -6867 -1116 380 3306
7201 3306 7610 7836 6598 14990 13191 10261 10341 12728 9848 3374 1340 3772 324 299 -446 -3389
7185 -3389 -2356 -730 -2278 3538 4571 1472 7507 3699 -3961 -9687 -5284 -1457 -1293 159 -550
7170 -550 -1270 -1926 -2931 -8430 -6255 -4671 -7643 -12459 -8965 -449 -1509 928 2743 -1310 -12888
7155 -12888 -19492 -13734 -11035 -9583 230 5126 8000 7242 5366 -819 -168 9828 14647 11657 5020
7140 5020 592 -9797 -9919 -8009 -14885 -16211 -13293 -11788 -14490 -12870 -7745 -9996 -12524 -10698 -9079
7125 -9079 -7027 -3854 -248 -6268 -8904 -3444 2360 823 -6422 -4484 2977 -1908 -2626 -2368 -3975
7110 -3975 -2782 721 822 -1109 -5376 -5371 -5063 4690 12645 13594 8431 -831 -9723 -12401 -3650 3367
7094 3367 471 1871 116 -4622 -10617 -5225 -9537 -17247 -18303 -13704 -4620 -4330 -8300 -10481 -12952
7079 -12952 -9649 -2285 -7398 -13862 -7092 -947 -766 -4538 -11164 -8293 -6269 -3091 10243 14026 10719
7064 10719 10253 6404 4590 7795 4640 -5252 -5481 -844 2059 -1252 -8660 -10821 -4954 -4505 -4809 -10015
7048 -10015 -12868 -13962 -1190 1079 -4248 -3507 -4432 -1164 2959 6126 9166 8172 3188 -3110 -9535
7033 -9535 -11738 -3151 7603 11483 10173 10864 10046 6336 1195 -708 -4195 -1504 -4027 -3933 -5379 -6494
7017 -6494 -5269 -8175 -9488 -6144 -161 2221 -2094 -3450 1928 -286 -4226 -4736 -4597 -288 6461
7002 6461 3935 778 -5155 -8914 -8226 -9141 -14440 -19910 -18074 -12614 -11641 -12112 -7769 -4422 -6398 -6119
6986 -6119 -2695 2696 8762 6577 1527 -4215 -7499 -5021 -9211 -4040 -730 4181 9931 5569 -5322
6971 -5322 -14877 -9660 -5484 -7617 -11787 -15385 -13282 -10296 -13017 -10926 -8553 -6928 -7560 -11555 -7648
6956 -7648 183 4442 1662 -3502 -6516 336 4846 4248 -1408 -7314 -6303 -6036 -5744 -7891 -12364 -12459
6940 -12459 -4648 -3225 -8883 -5859 1323 2460 7543 13038 10789 9944 9633 13496 12396 19815 34531
6925 34531 32592 22737 8015 -2834 3947 13432 14372 9330 7737 -86 -972 6717 5610 6970 -3107
6910 -3107 -5881 -4026 -9942 -11148 -12742 -13501 -8723 -2595 -1974 -6546 -9459 -8818 -11351 -7631 1037 3481
6894 3481 5123 590 -2473 -2418 3748 6027 7620 9748 10037 1450 -10948 -15218 -17207 -12750 2168
6879 2168 8157 3114 -1237 -2513 -6215 -8558 -4033 5520 5675 2257 2540 4241 5097 -696 -8585 -6724
6863 -6724 -4288 -9019 -3138 -617 -4986 -4867 -325 -903 -4137 -12209 -12906 -13171 -17095 -10975 -5105 -6099
6847 -6099 -2323 791 1541 -2119 -1031 -4462 -7733 -10483 -8617 -5995 -7435 -4129 -570 6595 5963
6832 5963 1681 3886 2948 -776 -7044 -10767 -7918 -2712 39 5999 10156 2450 2532 3038 2078 2613
6816 2613 1202 3172 2511 -2688 -1778 1194 2515 -660 -4725 -6457 1392 143 5587 7280 1569
6801 1569 3690 3768 692 8109 11607 7608 82 -2655 -6651 -8863 -3244 -3157 -6789 -5638 -6348 -216
6785 -216 2180 6310 2015 7060 16409 10909 5366 4199 -726 468 6350 11592 12678 12503 10430
6770 10430 8717 2879 -1973 -1801 -2141 -5140 -4698 934 -183 2110 9779 10864 9840 9456 8450 9522
6754 9522 14385 12266 6474 8459 11157 15225 13878 4983 -320 2236 7709 13759 3229 -3973 -2687
6739 -2687 -4414 -5406 -5295 -9827 -9515 -2266 6512 2501 -525 -6298 -11153 -14025 -16474 -12677 -4353 -2873
6723 -2873 3014 3493 2407 3524 993 -6388 -8950 -8834 -7177 -7767 -8553 -11304 -6899 -4429 -6035 -4067
6707 -4067 1484 3597 3569 5487 7528 4436 -1037 -9945 -6527 5653 6278 94 -742 -9238 -8300 2305
6691 2305 3563 4121 11594 12018 9820 15031 18267 11099 238 -5874 -2088 7913 17064 10133 3353
6676 3353 5696 4170 -5404 -9502 -7432 2177 9044 4021 -902 -6602 -10055 -13665 -7598 -4410 -9316
6661 -9316 -5471 -4160 -9847 -10602 -11088 -7111 -4669 -4352 -5487 -5244 -4563 -9634 -7203 -6140 -4594 -6131
6645 -6131 -9068 -894 8613 9431 13075 13151 5454 2363 1827 642 -6330 -5995 -3906 -668 7156 3742
6629 3742 1991 5870 -460 -6272 -16144 -15351 -7274 -2308 1794 2213 6721 8677 603 -7108 -1399
6614 -1399 5354 10347 3765 -2265 1264 835 2721 3009 3723 1802 2276 5296 2754 2403 610 -4558
6598 -4558 -6315 -4563 -2509 -4588 -3869 -1955 -3773 -4895 -9547 -5476 -3615 -2951 -4094 -9010 -14477
6583 -14477 -13797 -3279 126 5631 2895 -7019 -3637 -819 -2793 -1329 1913 2313 -2575 -3186 1692
6568 1692 -2237 -6589 -6807 -1903 586 2058 -3850 -4026 -5780 -11291 -9686 -7399 -2221 -1333 -4921 -3565
6552 -3565 3199 -982 -3989 -6943 -8519 -5941 -998 -2440 3609 5058 1668 -2335 -1960 -762 2308
6537 2308 1085 1242 -3544 -8008 -8988 -15249 -14699 -9238 -8027 -4816 -556 -2883 -3938 -7024 -897 945
6521 945 323 192 -522 -7944 -10320 -8726 -9700 -12355 -6004 4036 9814 15017 13860 7919 9559 3223
6505 3223 -3350 -9445 -4004 -2546 -2579 -8679 -8682 -10031 -9755 -10285 -9199 -8930 -10274 -6114 -129 220 1019
6488 1019 1694 8530 8822 7312 -3790 -5919 -2248 -1093 -3508 -7828 -12633 -671 1947 -5126 -3610
6473 -3610 -2387 -3566 -8056 -7542 -8791 -15957 -15433 -9501 -5223 -9970 -13808 -4261 1733 1422 -173 -3520
6457 -3520 682 5593 -329 -979 3874 4837 1839 3195 490 502 2999 4190 4612 3408 -1735 -4863
6441 -4863 1523 3307 1040 2497 6507 4625 1420 -5861 -7297 -7240 -8645 -5550 -2552 -3599 -4191 -13073
6425 -13073 -10953 -8359 -3948 -1770 -7634 -10211 -15196 -10849 -8008 -11458 -13547 -10029 -11583 -9122 -4891
6410 -4891 -763 -1742 -5105 -9001 -2370 1085 -3275 -6409 629 692 -1796 -2238 1926 -30 -10331 -7707
6394 -7707 3685 3454 -1791 -2591 6420 11017 11342 7130 5884 3780 -3806 -15582 -15213 -13567 -11279
6379 -11279 -10842 -8327 -4938 598 2673 1087 -1224 4707 1761 -5953 -4904 2351 10358 10635 5805
6364 5805 1789 4114 1374 -9683 -14526 -12225 -3946 5400 3633 -3783 -8173 -8983 -5851 -1526 97
6349 97 -4459 -3892 -5813 -15757 -11787 -6557 -4061 -6254 -8088 -7960 -5616 -2153 229 -199 -6833 -10220
6333 -10220 -9810 -11658 -8198 -10871 -6942 -3308 -3793 -5881 -116 2527 1600 -1419 -7015 -9560 -5340
6318 -5340 -9575 -9801 -4933 837 7617 6248 -5612 -4521 -1168 -529 -1238 1444 7281 7344 5527 1340
6302 1340 2423 3023 4817 1495 -3153 3885 6683 7554 12846 14669 11078 6718 6367 7644 5141 446
6286 446 -3448 -8576 -8752 -9205 -13532 -15707 -7824 1301 5396 -733 -3356 218 -66 238 2226 -1834
6270 -1834 1339 1293 -2211 -6050 -13166 -17073 -8816 -2949 -3461 -4040 1080 1185 -2364 2274 6178 -154
6254 -154 -2491 146 -1273 -260 -1959 -4463 -5528 -4674 -7120 -9281 -6440 -2677 -1228 -5046 -3263
6239 -3263 -7575 -10571 -1969 1234 3951 6214 6871 5794 1344 -838 -5294 -10647 -10002 -14098 -14576 -5171
6223 -5171 -8143 -4668 1850 7581 7826 13021 9910 4872 3540 -4755 -10000 -6637 -4143 -3657 -2562
6208 -2562 -1970 7140 7485 5957 4107 1607 3440 7022 12156 9154 4890 3764 4849 1030 -1918
6193 -1918 -3095 -1155 1971 3405 -599 -2764 -11100 -14207 -7948 -3184 -5317 -1569 -2703 4460 1172
6178 1172 -2159 3568 3202 1474 -3828 -7599 -6153 365 -736 1474 124 -2729 -4472 -1457 0
6163 0 -3018 -6695 545 6000 5565 4352 -545 -6918 -13082 -11994 -4157 -7581 -7185 -6232 -1636 -3782
6147 -3782 5445 4876 2412 -3900 -7929 -13979 -13138 -9339 -4715 -9340 -6103 24 312 -3867 -7959 -7023
6131 -7023 -11109 -10327 -7305 -4331 -6259 -5293 -3072 -1335 -3083 -3504 -5468 3097 5064 4068 -1970 -1462
6115 -1462 -2899 -2931 -2545 -13586 -18207 -14613 -12367 -10820 -7599 -7195 -1980 112 783 1958 3560 1929
6099 1929 -3463 -3861 -223 -3473 -859 5634 7177 8855 10710 10629 3774 3847 5936 9949 11522 7343
6083 7343 4000 -1892 -6277 -3386 522 2359 -5679 -7977 -4462 -2975 -2222 981 -8891 -12998 -8494
6068 -8494 -9802 -11974 -3437 -288 566 6544 2944 -2670 -5343 -5977 -2471 -4041 -10479 -11687 -15792
6053 -15792 -11846 -4452 2502 9284 12457 6867 3748 -2475 -5445 -2782 -1632 -8126 -10193 -11259 -8095
6038 -8095 -3156 -241 3421 563 -3938 -1382 670 -4579 -3307 31 673 -620 -2980 -3848 -3103 -3612
6022 -3612 1411 5465 1412 -3225 -4523 -8188 -8231 523 4910 4415 4496 2669 -1307 -3820 -6508 -2625
6006 -2625 3059 7597 5857 1078 -6243 -14688 -10145 -2524 -337 1008 2466 -2678 -3084 -1993 -3669
5991 -3669 -11449 -14759 -11562 -7394 -15596 -11331 -6286 -4856 221 -202 562 1933 4125 2562 -726
5976 -726 -3542 -2200 3098 10774 8749 840 -9363 -9420 -1491 2470 1539 -1793 3601 -441 -1110 -2066
5960 -2066 -629 1825 -2655 -8550 -9454 -8986 -8843 -5403 -5422 -3453 -1319 -186 2847 5446 6412 5639 3469
5943 3469 -699 273 5894 8152 5437 -721 -6081 -6416 -9819 -6351 -7327 -4545 -5895 -5078 -6090 -7836
5927 -7836 -5499 -1173 2536 124 -876 -1405 -9465 -6999 -1243 -4186 -7079 -6232 -5197 4155 7710
5912 7710 4160 -8539 -10064 -13125 -9910 -2840 3463 4902 4958 8394 7731 3677 -6571 -5608 -4360
5897 -4360 -7376 -393 4700 4176 7783 12003 8787 3421 -974 -5735 -4937 -529 -1842 -8143 -9544
5882 -9544 -5590 -2255 -7036 -2186 1132 5287 1204 -4588 -1134 2923 909 -4709 -9727 -10115 -7421
5867 -7421 -927 813 -2322 -9447 -8554 -7887 -4756 232 2778 3801 294 -9736 -10368 -3579 -5831
5852 -5831 -6690 -5717 -5410 -4203 -992 184 -4014 -5266 -4003 -724 816 2772 5413 6314 5634 -2120
5836 -2120 2743 -712 -2900 -2567 -6591 -8124 -5801 -4443 -6539 -8066 -11574 -14110 -14504 -4672 -1696
5821 -1696 -813 3091 5231 2652 -1077 4231 10661 8592 896 -2113 -2030 -4863 -6409 -3713 1496 1926
5805 1926 -2310 -7692 -3541 1826 4383 4464 5819 2826 -1198 15 5160 3616 691 3723 9717
5790 9717 16114 6233 -121 -1279 -5598 -11190 -8925 -3759 -63 861 -1442 -3684 -5673 -2396 -15
5775 -15 -910 -6898 -6682 -2661 -2488 42 -884 -5480 -2409 -2405 -3935 -9103 -7659 -3687 2640 5003 6729
5758 6729 7628 3699 -795 9266 7130 610 -1415 -6479 -792 3297 -350 -7605 -1467 1672 -649
5743 -649 -1476 -2910 4567 11465 8098 2932 -2390 -5001 -10768 -10848 -3856 -7453 -2840 -2384 -759 5982
5727 5982 -30 -4470 -1501 -5595 -6399 -599 -83 -5790 -10737 -11785 -10973 -12810 -12878 -9146 -10617 -10543 -8105
5710 -8105 -10637 -13390 -13677 -18167 -16860 -12432 -12291 -4028 4220 2661 -4230 -8381 -9740 -5148 -4492 -6830
5694 -6830 -6119 -6148 -7603 -18627 -20278 -11204 -7018 -6690 -1318 970 -236 -1852 -2424 -5759 -3261 -5638
5678 -5638 -4862 -2344 -915 385 2490 -5311 -9840 -10229 -4483 -3773 -6452 -49 3616 2704 2145 4350
5662 4350 5352 1147 -2412 -6917 -4359 -6273 -5529 -2792 -3364 -5422 -5874 -1755 -4305 -1631 -6667 -8749
5646 -8749 -6091 -3021 -2295 -595 -3673 -2714 -3201 -8816 -8055 -5295 -3933 -7504 -14429 -10172 2154 -489
5630 -489 -6812 -6303 2428 4333 3199 -1841 -8280 -3689 3207 4239 958 2236 80 -3991 -5972
5615 -5972 -5553 -4153 -6927 -8537 -2117 4702 22 1998 1020 -6194 -6473 4314 7789 819 -6896
5600 -6896 -6185 -2058 1987 3328 -2449 -8544 -6176 560 5890 206 -1697 603 -1599 1733 5594
5585 5594 1246 -4627 -343 -5706 -7790 -4931 -3705 -3252 -6078 -912 3272 4883 2245 -6657 -5721
5570 -5721 -4423 -4781 -10714 -10778 -11731 -13112 -8617 -6139 -3934 -2634 -6946 -4659 -5345 18 -1443 -1331
5554 -1331 2104 1450 -5768 -5440 -2482 -7306 -4157 95 -19 -2044 -8143 -9691 -11743 -14118 -16059 -9427
5538 -9427 -8183 -11291 -10827 -3986 -2491 1877 2102 -3672 -7597 -2740 -3210 -10780 -10236 -13702 -18089 -15249
5522 -15249 -11408 -6131 -8071 -9409 -6935 -3210 -3121 -1921 -2284 -5468 -2047 -3482 -3620 -1744 2255 653
5506 653 -3506 -7542 -3315 5967 6185 6348 5483 1067 1136 4112 4889 4896 1073 -4527 -1585 536 7799
5489 7799 6365 896 54 -3144 -4781 -8771 -6181 -6484 -10421 -9567 -1583 -1161 -1415 -371 1864 -1332
5473 -1332 2325 1455 766 2660 -5562 -13447 -6350 -2877 1935 4122 206 1481 7713 7276 879 4414
5457 4414 363 -3156 -5308 -9341 -5779 -1532 225 5765 2501 -6183 -6901 -3969 -338 1974 1913 -3002
5441 -3002 -902 3438 6835 11312 10668 10200 6070 2492 -428 -389 -2737 -2396 -2940 -2396 1245 -2287 -8935
5424 -8935 -8981 -4514 -694 -1359 2881 6853 1044 -5669 -6279 -6169 -5551 -1413 3291 2486 1327 802 4923
5407 4923 3067 2078 -1696 -730 -4216 -2793 -3843 -5666 -5510 -5567 -2871 -3363 -1434 3122 5196 4375 3520
5390 3520 1475 780 520 -5588 -7078 -7847 -12628 -12046 -15575 -8692 -7083 -8801 -3146 -1077 -8950 -5539
5374 -5539 4563 6063 462 -354 1074 6151 3502 1280 5835 4237 -2119 -4597 828 3439 4285
5359 4285 3413 4686 6130 9784 6138 -1844 -6438 -11067 -12604 -14494 -11607 -3442 -25 -1542 -2005
5344 -2005 3488 8536 3732 -108 1085 -1504 -4101 -3248 -3518 -3145 2766 4949 3331 3922 -358 -1131
5328 -1131 2536 1046 -10186 -15929 -10572 -3477 5096 10062 7939 5151 4256 8694 6026 4061 -184
5313 -184 -763 3903 3430 2690 8035 13211 9113 3228 -2709 -2019 -1058 274 -154 -5852 -9780 -5587 -2772
5296 -2772 1327 3773 6389 11339 15693 17267 9655 -1377 -5348 378 2842 3624 6006 2310 3392
5281 3392 1921 -1134 -7253 -2402 -168 -5328 -5329 -1594 -327 -3377 -7116 -8548 -4568 -9955 -16119 -13795
5265 -13795 -7857 -5933 85 -1693 -4465 -8040 -7832 -4975 -3034 -617 1734 -4349 -4263 -4348 -8694 -5590
5249 -5590 -5293 -4157 -746 -170 4560 1868 6863 7587 2868 1422 -446 1370 4169 1788 147 -3784
5233 -3784 -4112 -5250 -6872 -4325 2208 6542 4506 5368 6833 2570 -663 -2864 -316 -1775 -791 -922
5217 -922 416 2523 3169 5628 5754 -767 -4310 471 2471 1258 -907 -4410 -4276 -4106 -3504 -4215 -9577
5200 -9577 -8637 -4630 1406 -1888 -15315 -21204 -15569 -11711 -11999 -16224 -17663 -17891 -11824 -6466 -2440
5185 -2440 -422 -3298 -1891 -1177 -5753 -5605 -6858 -7089 -2357 6273 10705 7027 8344 7147 6873 3411
5169 3411 -3865 -7867 -5632 -4462 -7893 -7232 -4915 -3889 -8722 -6568 -5909 -7507 -5106 -7692 -15325
5154 -15325 -10262 -1196 -2619 6324 7869 780 1874 3399 2039 1435 1077 -6045 -7890 -418 1553
5139 1553 -974 1346 3632 5049 -269 -3610 197 -1181 267 1945 6636 7592 6000 2101 -3778
5124 -3778 -6799 -3473 -1770 -752 -5269 -9111 -9226 -694 3758 2985 4889 746 -8341 -9892 -6965
5109 -6965 -3523 -4940 -5912 -12264 -9951 -5382 -2024 -3204 -3827 -2 4258 2967 -4474 -7779 -9063
5094 -9063 -9070 -10743 -6209 -2662 3493 6568 8179 6082 6848 5381 9124 12419 8295 7884 3668 5121
5078 5121 8775 8195 8727 10595 9294 4527 2704 3872 799 263 1380 1279 4478 6501 6890 11679
5062 11679 10314 11422 10807 6324 5391 6118 5965 2994 1317 2013 1148 4671 8653 7162 5442 7425
5046 7425 3948 3062 6307 3663 -264 -2427 -5500 -2972 -7190 -11339 -14256 -8688 -1500 -515 -5319
5031 -5319 -10248 -5203 -917 -7569 -8830 -9534 -7194 -1412 986 2444 858 -69 523 -1235 -6277 -9858
5015 -9858 -9010 -4779 -7220 -2529 -242 -2174 -1244 -1500 2722 -820 -910 799 -663 -3304 -3140 -5270
4999 -5270 -9092 -9932 -4146 3969 6229 9901 6272 -6423 -7665 -2030 2591 5937 10394 6320 3573
4984 3573 4235 2645 4336 5181 1935 -1401 -794 -435 2385 -3330 -3520 -1758 1767 910 -32 2354 9321
4967 9321 8641 6973 2727 2619 -816 -1758 4396 6887 6873 2584 2467 2304 1343 -3361 -10607 -14854 -13357
4950 -13357 -11884 -3771 -981 545 6155 609 4307 4033 1565 4488 4537 1386 -5353 -7751 -4422
4935 -4422 -717 818 4549 1061 -407 1693 3593 714 -3186 -2284 5530 4289 -1387 -2541 -5378
4920 -5378 -6114 -4790 -512 -2032 2070 -1711 616 759 2158 -523 -1996 -5153 -4533 -6054 -3658 -1840
4904 -1840 -4260 416 -836 -2924 -4194 -5493 -3020 -459 -2171 -3016 -836 1456 3401 2151 27
4889 27 -881 -1237 1555 -4114 -4730 2671 10950 12205 6020 3626 2830 -6182 -11075 -12066 -11341 -14309 -12357
4872 -12357 -11296 -9174 -10270 -10934 -9099 -11676 -13391 -6412 -5170 -8889 -7770 -8510 -2356 837 -2686
4857 -2686 4331 11995 4604 929 7148 8061 1138 759 1559 3152 7982 372 -1395 -527 -3227 -6421
4841 -6421 -5041 -1354 557 -3627 -8922 -4694 1887 4365 -2164 -5542 -4942 -1489 5732 7009 2651
4826 2651 6395 8072 2727 -7817 -10013 -4104 -8725 -9834 -1524 5384 7487 5825 445 -4153 -2712
4811 -2712 -473 104 879 -3787 -4155 -2177 -1567 987 -954 -1360 -3352 -3914 449 -6523 -12446 -14453
4795 -14453 -8138 -3996 -4141 -4852 -3066 -416 6970 9901 11648 7875 2189 -78 -2101 976 1846
4780 1846 -6152 -14250 -11995 -6857 924 3846 1141 -668 4469 10315 5370 4210 1841 172 356
4765 356 1502 986 -3059 -5013 -5483 -2155 -5729 -10584 -13569 -11818 -9042 -2591 5065 9401 10224 6975
4749 6975 1158 3794 1555 -3341 -1187 379 -3396 -1642 3388 6799 8093 9822 4595 -796 831
4734 831 7601 10493 17113 9296 5280 1885 5630 4767 1799 1703 1628 2594 343 -1115 1716 -2513 -6442
4717 -6442 -10986 -9897 -7703 -5157 -1226 2934 5628 -2392 -4980 17 5122 4644 -4578 -4724 -3343
4702 -3343 -1830 4957 -238 -385 5768 3347 2457 5007 1477 -158 -1013 -1818 895 2876 -1684 -3124
4686 -3124 -2190 -1142 2115 -2506 -8212 -3019 -3211 -5000 -5228 -4205 2199 10710 6350 1522 1918 790
4670 790 236 -5403 2199 14518 20772 16503 10507 3345 -4200 -6543 -6324 -3290 -3350 -2402 -6004 -3610
4654 -3610 -1579 5390 8635 2418 2938 3290 -1686 5220 8238 3396 5061 2698 -1356 -2549 -1693 3398
4638 3398 3514 1732 2128 1882 6567 8178 7124 4763 4564 8514 6180 100 646 3751 259 -4501
4622 -4501 -493 -1109 -1810 -253 -2444 -2403 -732 -1542 -61 5244 5670 1067 -2591 -4831 843 2112
4606 2112 -913 -3566 -2617 2347 8390 8650 5400 650 -3075 -3622 -25 4456 4527 166 181 2127 722
4589 722 -6664 -10774 -10198 -4800 -1339 -1207 3677 3430 1006 5044 6316 3370 -176 59 121 1532 -2983
4572 -2983 -5806 345 2929 -2266 440 151 7045 9678 4535 780 -1727 -1489 3262 -1970 -1488 -1165
4556 -1165 -2069 -5283 -7120 -2281 -989 -133 741 4665 8412 7583 -2519 -9205 -8615 -4251 -918 1743
4540 1743 -4836 -8782 -4195 -186 -726 -232 -3984 -5009 -3584 -2179 -1528 -4138 -4690 -1163 -1477 754
4524 754 1855 -446 -1925 -2451 -5364 -2972 -8160 -13135 -16029 -14662 -9708 -6644 -1458 165 -1543
4509 -1543 -2011 933 1571 2528 2047 520 1376 -468 234 900 886 7120 8093 7997 2255 -1724 -1306 7034
4491 7034 231 -8291 -13983 -16481 -9812 -4630 -3 -3595 -6357 -7325 -5073 -5556 -7295 -1864 3029
4476 3029 -493 257 6758 6064 3945 4796 10463 13657 11489 8349 390 -7320 -10139 -12533 -14025 -13340
4460 -13340 -10326 -3785 -1678 -4807 -2106 2194 -141 -650 7778 9706 8169 5214 4610 3542 692
4445 692 -4360 -6630 -3514 3140 760 1097 -1648 3204 3758 -2150 -4046 1042 1288 -4507 440 2086
4429 2086 393 -350 6422 4492 5917 7631 -484 -2529 -2768 -2439 316 6997 5397 737 -139 -1441
4413 -1441 -280 4088 2082 -5630 -3663 6434 11327 7793 4113 3168 1767 -2101 -2706 -7902 -6341
4398 -6341 -6786 -6514 -11228 -12899 -14081 -11248 -3433 -3170 -2043 -941 -343 3297 4017 6530 888 -4114
4382 -4114 1030 125 -1248 2290 2464 -4531 -8038 -11589 -4769 -4148 -8000 -4344 -7117 -10406 -12110 -15384
4366 -15384 -11820 -5513 -4564 -5700 -6434 -6521 -11079 -15484 -18080 -12746 -10925 -9588 -8858 -3460 1115 5057
4350 5057 7424 2197 1840 966 -4714 -8092 -11707 -4681 2657 5281 2221 1377 -4471 -2458 -3002 -3349
4334 -3349 -1988 -2696 -8357 -12909 -15549 -12493 -7936 -1336 1926 -4672 -7325 -2708 5946 7236 -1344
4319 -1344 3714 3396 1664 -245 -4230 -3611 -416 1446 -4358 -4867 3855 4639 -2402 2054 4322 2676
4303 2676 5857 8503 5533 2908 -338 455 -135 -1264 2227 -936 -4550 -3586 -2325 206 1256 1901
4287 1901 2358 -3321 -9767 -1807 -58 6382 10531 10119 13411 12340 10270 2816 -907 -458 1342 -2375
4271 -2375 2302 -1033 -1648 -5240 -5167 -2343 -2612 -6454 -3952 -6403 -12968 -11361 -6210 -5842 -7229 -394
4255 -394 2440 -1515 -2193 -4536 -5360 -2994 -5826 -9406 -11821 -11126 -6511 -3892 -3459 -5149 -1388 4874
4239 4874 7713 9565 4542 5133 5915 1457 2619 5729 -7 1306 4172 3376 8245 3993 1004 -4853
4223 -4853 -2473 -1615 -3123 -4606 -11029 -8494 -816 -9693 -11863 -3314 6497 4407 6181 2424 -2816
4208 -2816 -8380 -6791 920 3467 -495 -4927 -2259 -5880 -10115 -9171 -12191 -10436 -7006 -106 1573
4193 1573 5682 8057 6056 -1070 -2792 -5886 -5066 -4187 -5963 -4746 -2803 -1428 6759 9515 3600
4178 3600 5125 -1099 -5877 -15446 -13765 -9795 -2996 -785 -3995 -10218 -15528 -11621 -17131 -16205 -9480
4163 -9480 -442 4132 651 -8849 -12101 -7216 -6984 -8067 -3807 -4778 -7118 -3186 -2351 -2388 -4270 5374
4147 5374 8625 8955 11091 16367 11831 5289 6134 951 -914 -1847 -3282 3783 4475 2657 5538 8056
4131 8056 1602 -217 -1093 5381 6934 3312 2771 4856 5460 6067 6614 4591 4551 1773 -1365 -2520 -4975
4114 -4975 -4359 -3298 977 -139 474 -5060 -1232 3435 -1370 -6184 -1300 5969 6846 7510 6142 2180
4098 2180 3017 5429 3826 -1232 -2361 -3554 -8807 -10134 -4975 -1204 -1080 -3006 -6775 -3954 -5919
4083 -5919 -9685 -1364 1979 4971 4858 -1653 552 265 3058 7339 5287 -1578 -2762 -2310 -2390 4
4067 4 3608 2269 709 1458 -240 6004 2880 -725 2650 753 1247 5618 8764 6704 3991 1984
4051 1984 -120 -5649 -3694 -487 5369 2290 -2043 -4636 2172 4515 1171 6460 7405 4330 7811
4036 7811 9454 11932 9106 5521 5967 -450 680 1803 -533 -1535 -3956 -3627 -6149 -5400 -2287 886
4020 886 3544 9612 5202 -3813 -2454 -7017 -13336 -10187 -6811 -2661 -2653 3218 4770 3240 2465 -911
4004 -911 -4879 -3485 -3959 -5300 -10327 -5459 -2529 -8989 -11919 -6074 1632 966 -2918 -1607 -1435 -1629
3988 -1629 -7603 -5550 -12848 -15259 -8167 -1833 -458 -553 2377 6863 13116 15223 16162 9123 5966 2743
3972 2743 -627 -1373 6153 6191 8420 383 -2344 -7460 -5072 908 4482 6003 5865 6656 4296 -1162
3956 -1162 -1359 2460 5241 6063 6348 -5902 -8484 -6611 -4092 -5342 -4952 -3996 -10630 -12868 -5545 -3685
3940 -3685 -2956 -3544 -1693 1577 -4536 -4465 3318 11193 7770 7615 8620 6285 1492 1034 1142 -1331 -7496
3923 -7496 -4456 6813 7695 -1991 -7277 -1098 -192 1676 -1839 -5917 -9734 -10760 -8728 -3487 -4365
3908 -4365 -5012 1522 4899 3091 4257 -3737 -11692 -10649 -7928 -8563 -7104 -1422 5849 1796 2999
3893 2999 5037 7968 6788 7591 6982 -229 3302 3750 4022 9104 10440 3948 -3257 -3235 6087 4788
3877 4788 -979 2046 3080 4506 0 -4897 -1319 7704 12201 8976 2019 -5065 -2711 -3983 -7516
3862 -7516 -6549 -5061 -2422 1763 563 -7024 -10855 -9453 -1913 -1382 -1957 -2599 2441 3817 4065 2088
3846 2088 3019 -5503 -8825 -6091 -2539 882 2707 -4520 -4737 -4299 -7865 -10006 -4825 3749 689 -6750
3830 -6750 -8616 -8075 -2220 -2039 1179 -1726 -3977 -653 7659 6711 -293 -2967 -3278 -9196 -8300 -8900
3814 -8900 -4216 -836 1352 2565 -1978 -68 -2220 -875 8680 17746 10297 2288 363 1707 3045
3799 3045 6585 6726 4430 4279 1236 2885 -495 -5541 -7123 -2087 4954 6410 11514 10083 6328
3784 6328 9135 7234 3913 4658 1349 -2916 1943 4574 -2945 -4382 -5156 -5793 1843 558 -924 -8685
3768 -8685 -12674 -8136 -4902 -3160 -5869 -3392 4302 5253 -1805 -1825 -780 -1003 -3246 -2836 1292 2400
3752 2400 2525 3916 1545 -1697 1432 2287 1390 3041 -1054 -9443 -7160 -3345 -4010 -6254 281 1848
3736 1848 -188 -3378 3149 3095 4096 4169 2937 5863 2321 1719 -5410 -3420 -238 8279 13739 15568
3720 15568 8942 4058 5688 7982 7125 4811 3338 3741 2050 -338 457 1171 -6075 -11090 -7845 -2953
3704 -2953 143 3208 1809 -4809 -5422 1156 -2823 -9244 -538 3914 -240 -1743 -2379 -3774 -11553
3689 -11553 -10848 -2404 -2206 -2716 761 -1577 -1737 4149 9345 15927 17337 11535 10229 9703 7184 7789
3673 7789 10773 8724 -2129 -6527 -174 -5816 -8328 -797 2565 -4750 -6257 -10107 -15272 -19030 -16101
3658 -16101 -13266 -7021 -9254 -15121 -7383 -1076 -904 -6097 -9231 -8343 -2659 -5464 -2283 1122 4450
3643 4450 1948 -3648 -2236 -4032 7201 9140 2479 -994 -3866 -3277 2343 4154 5543 3709 701
3628 701 789 3330 6456 5381 2452 -1876 -7565 -6373 -8662 -9430 -6642 -2887 4686 12368 11684 9785
3612 9785 11214 13120 11341 8539 7782 4566 -4780 -5038 -4706 -4182 -9304 -10540 -1190 -517 -866 -72 4114
3595 4114 7446 5840 3662 -4125 -3581 -3450 -10206 -7787 -10166 -10316 -8204 -6797 -5106 -4413 324 9384
3579 9384 9811 5520 4318 1474 -2053 -4733 -6366 -2503 -4599 -7652 -7677 -6162 -5906 -6638 -11972 -7135
3563 -7135 -3113 117 183 2705 -1949 -1301 2971 6105 4141 -924 -1888 -2982 -2157 343 -4808 807
3547 807 -4968 -4663 2940 4862 3442 5962 6288 4810 2520 -415 -6198 -11763 -10821 -9987 -4270 -456
3531 -456 -2809 -1141 2231 4737 953 2840 104 -1506 -3185 389 -1028 -4761 -5639 -7376 -4040
3516 -4040 1431 7574 5206 3703 3000 5013 7324 11055 9857 13385 15575 11678 5254 -1994 -745
3501 -745 1085 -3762 -1546 -1465 614 3668 3735 222 -488 4370 4140 1133 2929 12 535 -299 -1735
3484 -1735 279 -2465 -5246 -5426 -658 4912 6316 1342 2210 5321 6547 12108 14055 12944 6112
3469 6112 3958 2676 3675 2053 860 4198 5182 4532 3836 -1177 -5982 -6569 -2991 -3444 -937 1142
3453 1142 -1198 -2929 225 7159 2610 6768 9268 6434 3938 -2298 1108 3408 4964 -664 -7801
3438 -7801 -6963 -8707 -11976 -5949 -7366 -7469 -207 8178 9486 9291 8746 8401 6536 3785 -612 -5424
3422 -5424 -8044 -3035 1542 3194 -776 -1375 5297 9242 13504 15559 16410 16193 10284 -943 -1081 1472
3406 1472 3574 5485 6479 10240 6514 242 -195 5938 4308 1920 3569 234 2882 1983 -961 -2312
3390 -2312 -2750 -1241 653 1443 4628 4561 1525 367 -2194 855 5586 5309 1543 -4605 -5105 -3793
3374 -3793 1911 4604 -59 -93 5343 10169 3762 2417 3848 9225 11866 8933 5169 7976 5955
3359 5955 570 -3172 -5209 -3653 341 5585 4851 -1964 -2693 2771 1981 973 1040 7341 10770 3323
3343 3323 -4928 -6179 -3236 6657 7648 6242 4741 6960 5029 3088 5579 236 -4896 -3226 1019
3328 1019 1475 -901 -1911 -4413 -2047 5324 3226 -3885 -9274 -1008 4662 7520 12756 18526 19101
3313 19101 16655 9248 3415 1088 -5265 -8795 -3387 4516 6444 862 6283 3929 2920 1155 3008
3298 3008 88 -5109 -8973 -8799 -2079 958 -2882 880 -141 286 3731 7212 8526 7442 4006
3283 4006 4220 3640 -1579 -5788 -6214 -5979 -1904 -2607 -6308 -5119 -2688 5687 4975 3951 1922 -593
3267 -593 679 -3008 -3452 -4350 3899 2705 4134 6745 2251 697 1713 10006 10965 5517 3416 7222
3251 7222 5372 6101 5030 -53 -3037 -6865 -720 -4445 -6541 -8049 -9709 -9428 -5388 -2396 222
3236 222 612 3265 4397 3177 -610 -1512 -3356 -7532 -9380 -10409 -6937 -5571 27 -219 -3850 -6610
3220 -6610 -8496 -10218 -9796 -3599 -341 -5575 -8069 -5354 3253 2002 -5473 1651 8080 9444 7936
3205 7936 5946 5369 -977 -5239 -2434 2645 3757 2089 4269 -1209 -4373 -5822 -6187 -3732 -3231 1363
3189 1363 8087 5157 2090 2898 4773 10442 12651 10662 2917 497 4171 3357 9009 5286 -2636
3174 -2636 -7433 -5929 -5620 -5730 -2049 -433 3100 -165 103 -4439 -4633 -2485 -3517 -2235 334 8961
3158 8961 8184 7780 3721 834 -1429 -4096 444 1497 7556 7087 -3337 -6332 -6160 -3289 7352
3143 7352 14153 11289 4357 -804 -4454 -477 -1261 -5563 -1572 -2582 -977 -2340 2760 3635 3899 -1296
3127 -1296 -4033 -31 4505 361 343 -4096 -2461 321 1916 7305 7415 -743 142 -2442 -885 -2506
3111 -2506 -4204 -5313 -7740 -5976 2278 5372 10464 9956 4527 3334 12330 17406 16877 17673 16149 11372
3095 11372 10764 9975 6619 -458 1704 3944 -1747 -3288 -1930 1161 796 7080 291 -7041 -6373 -6614
3079 -6614 -4762 -1034 285 -2285 246 6383 10043 -690 -3007 -1348 2241 4433 1777 337 4155
3064 4155 6055 997 -241 -2660 2333 3773 -62 6878 13018 9414 7872 9973 9214 9867 16556
3049 16556 13209 8506 12220 7135 -745 -4013 -2364 1871 4806 8790 14620 19513 14958 12116 12670
3034 12670 11191 10528 11986 10387 8106 4772 4000 2804 -1951 -9485 -4227 -2833 -3262 -3179 -927 -3489
3018 -3489 -7904 -10560 -8531 -2680 4321 2354 5086 7148 5790 5529 4919 -5214 -6326 -8622 -8435
3003 -8435 -8480 -6080 -2204 3155 2881 1811 2208 -6885 -9606 -2792 -2450 4460 5645 8213 4154 1735
2987 1735 923 1598 1371 -238 -42 -2825 -4567 -4023 1024 -3562 473 1687 -1890 -1040 -2067 -562
2971 -562 2395 3866 1761 -1143 631 3697 2884 829 -3601 -5346 -2796 -3456 -7661 -7955 -4384 516
2955 516 -682 4652 5986 2774 5058 1190 -3430 -3181 -4983 -12038 -13436 -13728 -8307 2270 8110
2940 8110 2249 -2076 -1226 -2163 -2711 -4927 -3463 -824 -1740 317 3172 9467 5046 614 2577 3937
2924 3937 10488 8306 5015 5646 3152 -1483 1800 3920 -1617 -1957 -2554 -9246 -9750 -4222 -5760 -5561
2908 -5561 -1464 2799 -1745 -2245 4412 7988 12857 8073 8819 9529 8890 9230 8071 7939 11865 6730
2892 6730 6045 7270 4897 10771 12365 7566 1256 5088 7261 1547 -3007 -10033 -9025 -4034 334
2877 334 1773 -3624 753 -723 -2449 5487 -70 2785 5843 4487 4642 5317 11152 12306 7437 848
2861 848 1493 3721 5998 1091 -5528 -3914 692 5090 3926 5597 413 2985 3245 -1608 -1755 -4453
2845 -4453 -1965 308 -2979 -5857 -10823 -12659 -439 3481 1052 -2478 -6386 -2419 -7277 -12661 -12163
2830 -12163 -9716 -3960 3214 3693 -744 -6418 -7610 -2945 339 3137 847 -2657 2520 1399 210
2815 210 3282 3523 4328 4771 -2307 862 5267 6327 3645 1703 -6198 -2832 4203 7254 4856 -506
2799 -506 6340 11484 14739 12429 11096 3941 2943 7552 749 2582 1471 -179 4387 7398 10738
2784 10738 11529 7463 -5095 -6705 -2800 -1683 -3024 -6932 -1285 1333 -5598 -8332 -8275 -9494 -2426
2769 -2426 -4608 -9538 -7501 -5942 -7617 -1562 4062 5912 10868 14317 9221 5943 3984 -5202 -5508
2754 -5508 -7388 -6424 -4762 170 -1924 -3616 -1981 -1157 -3979 52 -2387 -11289 -3908 3102 8348
2739 8348 12988 3190 3499 5896 -382 1870 2812 -5068 -3635 3757 11145 12620 11865 9908 8005 4029
2723 4029 1763 -6552 -9658 -3447 -4555 -1337 6877 6969 10149 3956 -2078 1626 2633 3896 458
2708 458 -3979 -3149 520 3308 7431 13765 18744 14300 10015 14019 18595 22031 17919 11157 854
2693 854 1404 -993 -2850 -4356 -4661 5346 6006 2870 93 5706 7838 3805 -460 -2759 -5049 -5096
2677 -5096 -346 8735 7018 965 -983 2013 3406 -1299 -5154 -3731 517 3651 2863 -5111 -3298
2662 -3298 2629 1920 -6110 -7769 -3963 -3176 -9189 -8185 -5106 3050 -78 754 4437 2421 1081 -2061
2646 -2061 900 -650 -3766 -3272 -5001 -1527 -5502 -3493 -2517 -2488 55 5120 6540 3765 3881 921
2630 921 -1310 -2647 -3545 -1993 -5080 -5512 -4068 -1212 3185 7801 5414 1940 6641 5374 3349 -2728
2614 -2728 -11089 -14182 -11992 -13861 -15928 -14742 -10690 -4827 1513 774 -20 136 1622 7398 13135 11616
2598 11616 3592 355 -2646 -5145 -2270 -1968 -3568 -5221 2126 2348 -6453 -11660 -13605 -14009 -8166
2583 -8166 -3221 -588 7408 13288 13185 8239 3348 861 1785 -7334 -8240 4320 5701 1424 -378
2568 -378 -3711 -1382 2329 7463 8957 7451 5737 3393 -2572 -5332 -6522 -2676 849 -181 -1899
2553 -1899 1623 -203 -4174 179 6270 3278 972 1594 1716 -2534 -2718 4370 8595 6839 1609 2981
2537 2981 2824 3839 4866 7222 1617 5303 6229 262 -287 -346 1602 227 2716 764 2960 1609
2521 1609 1170 -6906 -13429 -13026 -8048 -9371 -9966 -3697 6461 15824 12785 5845 5619 5641 1075 -1300
2505 -1300 -7117 -11016 -6477 -2249 2265 6731 7035 1808 -2068 1268 186 -1114 6340 13298 11893
2490 11893 4648 -835 -3978 -6615 -7220 -7192 -5849 -5909 -4760 -2441 3302 3683 5330 4528 1277 1358 -74
2473 -74 -583 -4088 -5903 -6011 -2671 3281 10016 13959 17227 20143 15567 12999 11125 5112 -7668 -10821
2457 -10821 -5291 -971 6721 7534 2884 3953 1742 -1093 988 3643 -744 -6564 2128 11488 13696
2442 13696 8785 7228 3665 -2208 -5099 219 -249 -2134 -885 -324 -4805 -1612 -365 2491 -167
2427 -167 -7314 -6255 -4722 -5439 -5183 -3552 -3255 4336 7773 37 -2180 3253 2274 -732 4432 6574
2411 6574 2948 1659 5250 991 574 -420 1425 2615 1909 897 -207 -2021 2960 3855 -2199 6978
2395 6978 13440 12279 10531 6778 4221 -305 -1297 742 601 2230 1438 128 -3448 -8344 -1504 2170
2379 2170 1625 4157 6411 4923 -747 -8267 -8699 -7746 -9182 -5125 2952 -1572 -2310 3814 9515 5041
2363 5041 5094 12257 11822 9859 9980 7357 4193 3889 1020 -5030 -7746 -11439 -3394 6951 8095 8319
2347 8319 2541 5865 11378 10338 9793 2430 -3793 859 1701 4838 7805 1243 2913 5892 5207 3826
2331 3826 -130 1909 4179 1975 1373 3637 3016 -3313 -2500 -1290 1358 76 -4516 587 -846 1201
2315 1201 1700 4668 3717 5830 8395 7244 10598 10727 12232 9888 2489 -6064 -3395 3208 5763 5488
2299 5488 -601 -2697 -8050 -9061 -5613 -5531 -5207 177 -1159 -2798 -63 4722 9445 10411 10645 14094
2283 14094 2089 -1916 -1627 -1183 -599 7998 11375 12736 15486 15806 15174 7466 -3143 -5445 4206
2268 4206 5517 3248 3659 1604 720 2769 1191 -3880 -4259 3992 11279 14601 16467 11574 5808 3850
2252 3850 2293 4268 2577 3164 6958 244 -1559 140 -564 3886 1512 3348 3325 775 -2551 498
2236 498 1932 -935 -2571 -653 2723 2293 -1119 6854 7278 4250 3246 -3267 -8355 -5509 -4865 -5883
2220 -5883 -2933 -5227 -2184 -1328 631 -3642 -3119 96 2562 2875 -3166 -3946 -1496 5990 6158 6553
2204 6553 7034 6175 4565 3899 2451 -1417 959 -669 -6432 -7112 -4090 512 -4057 -3865 -6754 -5660
2188 -5660 3202 10703 7413 6593 5857 3169 -874 -193 3905 7605 11508 10311 8516 6102 6297 6676
2172 6676 -329 2659 2916 -3898 -2631 720 -2310 -3870 -5977 -9370 -12256 -12143 -11596 -7466 -2444 1223
2156 1223 -3251 -1081 -3711 -5142 -709 -4263 -2905 608 5282 2386 -2266 -1628 4895 2175 460
2141 460 384 -3297 1988 10524 5366 7157 8764 9045 7168 8504 1363 1112 3813 5389 8464 7730
2125 7730 -731 -29 5116 7327 12672 14688 9186 12171 11850 11550 2202 -2542 -1768 -3056 -901 -68
2109 -68 1218 -922 -153 -2558 -6913 -5370 -1132 4521 4822 797 -1507 -2330 -4099 -3480 -4994 -2865
2093 -2865 1197 6674 8140 4119 4972 4077 2901 -152 -5356 -2558 -2986 -4013 412 -358 -1040 3499
2077 3499 3737 -1314 4663 1764 -791 2 -4038 -4953 -7139 -9832 -2577 -2614 -6040 -372 5990 5187
2061 5187 7265 8816 5441 -371 -1002 1265 4655 1178 -2239 745 -2057 -8910 -7582 2611 10795
2046 10795 3332 1640 557 -8356 -4787 -2626 -3074 -6719 -850 3891 9904 6528 2221 2299 1939 -2535
2030 -2535 -3267 1323 -4084 -11771 -9189 -4952 -7660 -2240 4473 3500 5805 6546 485 -767 -3104 -846
2014 -846 257 3667 5865 4713 6278 4415 7867 9671 9225 5842 4267 4074 8260 5882 3175 -2062
1998 -2062 -3150 -8564 -5582 -3715 -7184 -2231 2575 1089 -5554 -3777 -780 -2979 -1734 -2236 2739
1983 2739 5380 608 768 -158 -1408 -979 3629 5874 523 -6132 -8680 -7509 -12578 -13603 -6787 -2621
1967 -2621 -4250 -5724 -4213 -2393 -4903 -10336 -8297 -10555 -7305 -451 7539 2132 -4486 -702 1199
1952 1199 -526 -1110 -5557 -4776 4166 13309 11719 -2551 -7168 -11672 -14855 -10107 -8504 4203 10187
1937 10187 9483 -285 -7333 -10768 -8620 -11252 -12996 -6261 -361 -802 -6570 -11949 -5198 -5503 -5930 -1826
1921 -1826 -2094 -5962 -4995 -4140 -3676 -3506 1602 -4356 -5647 800 3531 5279 1707 1858 4697 7005
1905 7005 4815 -4169 -10118 -12997 -10937 -4301 1119 -2575 -4481 -4787 -4602 3262 8773 9152 5122 1380
1889 1380 -5127 1026 1545 -5283 -9172 -3681 -2604 -6486 -3901 -2156 6264 6628 6032 5348 3245 -1699
1873 -1699 -7187 -11186 -8717 -6614 -451 10567 6591 4920 6046 3308 1311 -1580 -6172 -9745 -7392
1858 -7392 -3486 -8662 -5628 761 5428 10410 12193 7341 6666 8618 11556 10174 8899 9820 8800
1843 8800 8702 3020 2677 637 3191 -65 780 4293 9909 7567 -1885 -6860 -5337 -3349 3685 7603
1827 7603 3284 1654 3795 3306 4695 1893 331 -4216 2715 7179 7638 6264 605 -6225 -6490 -436
1811 -436 5609 9846 4204 388 1677 5422 -2710 210 6120 7326 1638 -2306 -1866 60 115 -6756
1795 -6756 -11959 -13008 -5920 1763 3410 -611 -377 2263 184 1763 4425 11882 19270 14490 8425
1780 8425 2549 1782 -4190 -1002 -432 -8200 -9600 -9246 -7563 -9946 -12573 -6643 -3730 -3010 -11196 -8262
1764 -8262 -2967 6188 6038 7659 8001 9787 7794 6707 2608 -5304 -4654 1599 2898 -259 4947 8821
1748 8821 5787 4207 2931 6566 7896 3273 -1183 894 -1350 -6859 -8479 -3394 3238 6482 8239
1733 8239 3545 8560 8709 4611 -2846 -8202 -11642 -13795 -8544 442 -5937 -5264 4542 6729 4412
1718 4412 1395 3993 2090 -1072 300 4488 7609 3211 -56 209 4673 4874 -1640 -1209 2855 1479
1702 1479 -5269 -3072 -1007 4723 5843 5115 2227 -1730 -197 959 1490 1884 2477 5317 5387 2513
1686 2513 2270 -3339 -2444 -1095 -4137 132 4390 1500 -3361 -3039 2572 -534 -370 -1993 -1577 -133
1670 -133 -1237 -715 -1024 1943 272 -4185 -9534 -8237 -7857 -5348 -1848 -4795 -9379 -14423 -13955 -10242
1654 -10242 -4108 -1004 -1500 -2041 1775 1107 4162 8952 14016 9981 -2972 -7180 -3179 -1645 732
1639 732 138 4833 7257 -1033 1833 5060 5971 6122 8167 10301 9320 4468 -4297 -4783 -2241 -273
1623 -273 2991 1241 -3436 -1566 -4434 -7199 -3125 -3218 -3074 -549 -1605 -1918 2768 4808 -487 302
1607 302 -763 -2159 -1562 -3703 -7897 -9359 -8806 -2322 2488 4180 6477 6916 3969 4913 -1558 1769
1591 1769 4798 2306 3096 8068 42 -5639 -12330 -12765 -5336 -4618 -12228 -11388 -14942 -10217 -3380 2552
1575 2552 -1431 -9222 -6723 -394 3220 4488 -1327 -6886 -7270 1070 6824 8188 7812 -2561 -3936
1560 -3936 980 6032 5684 -106 2262 -4020 -84 4563 923 -802 -218 2895 3734 -121 910 3437
1544 3437 6622 5322 558 -8698 -11776 -7213 -1675 3462 10156 7039 -1253 -2200 -1461 -5711 -5703 -5683 -7489
1527 -7489 -12803 -5400 -6830 -6180 -4502 -3501 -6234 -1803 4914 3441 -1107 3564 4292 2828 -7077
1512 -7077 -1410 9508 2707 -1513 -968 -21 -970 -3551 -4313 -4749 -8749 -8418 -8845 -3202 6644 13238
1496 13238 19138 17813 7315 -307 238 -7137 -8892 -1672 5780 16799 17503 14263 9109 4369 3624
1481 3624 6886 11793 10143 7824 9849 2381 -2061 -3881 -1067 -6430 -6584 -11348 -11727 -14772 -16150
1466 -16150 -17440 -12627 -1412 -240 -5720 -4142 -8094 -5622 -689 -1053 -3078 -7492 -11574 -3546 737
1451 737 -1743 -3957 -2742 1973 6141 3794 -917 -6630 -5716 -2094 667 -4282 -4399 -4036 5568 6088
1435 6088 3368 -327 -3410 1830 9963 15836 14293 14003 8512 5093 638 -1461 1537 2014 -6010
1420 -6010 -5160 -3901 -4001 631 -1681 -6558 -10302 -7463 -6409 -596 -883 -195 -693 1163 3719 5411
1404 5411 10579 6012 -131 1043 969 1588 4620 4827 2527 3754 10252 14398 7409 1072 -3022 -8358
1388 -8358 -6995 -1624 -4777 -5018 1265 872 2448 -3291 -3663 115 1256 3188 2509 2718 7817 15214
1372 15214 13920 3597 -2266 -552 1009 6724 7370 7846 7102 8744 8919 9267 8517 4195 119 649
1356 649 3011 237 -4152 -4312 -1863 -3501 -2998 914 5361 9240 3787 -3148 -4052 -4187 -5914 -2038
1340 -2038 1095 6685 5171 1494 -626 745 5069 2411 522 -3193 -5684 -5136 2869 6580 4447
1325 4447 7203 7172 6716 1865 -2103 -1673 1444 3976 2326 6777 13487 8223 2937 -1336 2225 834
1309 834 2883 1705 1277 1810 78 4361 1360 -2755 344 3134 9727 6366 -4301 -9236 -9786 -10931
1293 -10931 -12515 -10316 -3602 2488 4438 6343 6588 -1653 -11581 -13157 -17069 -18050 -18024 -16636 -5392
1278 -5392 1335 -9275 -12875 -13824 -9165 -3379 -2700 -1687 -5364 -10499 -16386 -18409 -18528 -14058 -13506 -13366
1262 -13366 -1816 6781 1344 -2110 -820 210 703 -1665 -3066 -640 8182 7430 9081 6101 -149
1247 -149 1045 2932 5211 5799 5623 7152 8782 4456 6078 8458 1502 -5092 -8077 -13764 -15298 -6772
1231 -6772 -2008 -4190 -3355 5275 15508 16742 15123 8761 1118 -3382 -2139 -3587 -6668 -448 2606
1216 2606 3188 5602 3024 371 -1412 296 5932 3575 1013 -1161 -480 1602 3139 3180 1634 -219
1200 -219 5390 7080 6961 10542 7386 4767 1663 3296 -831 -2479 -1867 -287 2601 5985 5457 6196
1184 6196 7702 11411 10612 9146 6351 1117 4256 10620 15083 9943 6235 -97 -5799 -5972 -5944 -3951
1168 -3951 -4043 -5306 -3035 -3153 -430 800 -3708 -4127 1155 1449 5780 -782 -3648 -1137 -6034 -13569
1152 -13569 -13280 -14680 -9800 -5461 -1181 -1920 418 -6315 -9097 -7316 -4938 -3776 -9853 -6167 -4492
1137 -4492 -4055 -9031 -3650 8091 6603 327 638 -719 -6349 -8268 -8528 -8214 -3384 -1922 -124 3745
1121 3745 4255 1254 2248 -560 -982 -6277 -3480 3167 6754 2551 -650 538 -414 2841 -2802 -7459
1105 -7459 -7851 -5162 -2957 169 -917 -4837 -8018 -12482 -8989 -186 3704 5206 11758 16742 13897
1090 13897 11190 11501 2701 -1321 -1647 717 -5409 -5066 881 7342 516 -1757 -2788 -5606 -5282 -2228
1074 -2228 2679 5585 5781 3160 2905 5260 5898 3939 9392 12551 11923 7699 2497 -3141 -5364 -4946
1058 -4946 -5840 -5844 -589 3693 3371 4536 5162 7877 7972 6978 4851 7157 11736 5137 -2291 -5822 -2966
1041 -2966 2529 2492 5686 2070 -4515 -4275 -10094 -8365 -6517 -8507 -4161 -1406 1323 2869 1697 961
1025 961 4315 3121 498 1331 6399 4738 2593 3517 3493 3169 8784 10575 11694 12008 12051 15218 17478
1008 17478 9879 5866 6426 7305 5915 6317 3339 7434 8190 8765 10512 12260 9365 6629 4787 6642
992 6642 9848 6053 6511 4502 2079 -6179 -6958 -3346 -5182 -3614 -2503 299 -252 -5192 -2316 -599
976 -599 1175 2796 3070 2230 -973 3549 6092 4828 2522 6881 8524 3121 -230 3025 -419 1834
960 1834 6308 3305 1081 -264 286 2790 5076 5739 4433 9717 8724 2488 5086 11457 12711 10578
944 10578 5797 -3499 -6304 -2368 -2885 -4338 -5638 -5566 -6082 -5248 -3569 -9168 -4777 4381 4234 -1835
928 -1835 -6619 -6889 -1326 -802 -8739 -5406 2885 5497 2361 -1215 -1406 -4901 -5488 -5156 -1000 4813
912 4813 4498 3323 4135 1576 -2458 -1385 93 -936 5903 -57 -618 322 -3740 -1606 3186 -2679
896 -2679 -6950 -1502 -2623 -2538 1730 8335 12771 6085 -1403 -12928 -15007 -8757 -5538 -5220 -9964 -15272
880 -15272 -13127 -4218 2715 7288 12864 11762 12190 6495 7976 9161 2728 -3895 -3356 -4665 282
865 282 1643 -2530 371 -3587 -11114 -11640 -8769 -9223 -7747 -4164 -5127 -7636 -5784 -5001 -5368 -5245 -8607
848 -8607 -8989 -931 3737 5976 2600 364 224 -353 -4522 -5104 -514 3562 3364 -3707 -4975 -2612
832 -2612 2291 6037 2695 713 6273 3563 344 -3525 451 3901 4058 -799 -3067 -7174 -3429
817 -3429 2777 5440 7449 7791 5470 7134 2696 -4456 -5696 -2513 6415 9446 9292 3185 3286 276
$$ [...]
##END NTUPLES=NMR SPECTRUM
##END=
