##TITLE=Analysis number 314299
Compound Code cc 46523
Book Reference 441/160
Project Code qc-cat
Chemist Name colinb
##JCAMPDX= 6.0         $$ Bruker NMR JCAMP-DX V2.0
##DATA TYPE= NMR SPECTRUM
##DATA CLASS= NTUPLES
##ORIGIN= Bruker BioSpin GmbH
##OWNER= NMR
$$ XWIN-NMR		Version 3.5
$$ Wed Oct 12 16:51:41 2005 GMT Daylight Time (UT+1h)  MAYBRIDGE\NMR@NMR_250MHZ
##.OBSERVE FREQUENCY= 250.131544655141
##.OBSERVE NUCLEUS= ^1H
##.ACQUISITION MODE= SIMULTANEOUS (DQD)
##.ACQUISITION SCHEME= undefined
##.AVERAGES= 16
##.DIGITISER RES= 18
##SPECTROMETER/DATA SYSTEM= dpx250
##.PULSE SEQUENCE= zg30
##.SOLVENT NAME= CDCl3
##.SHIFT REFERENCE= (INTERNAL, CDCl3, 0, 16.4569)
##AUDIT TRAIL= $$ (NUMBER, WHEN, WHO, WHERE, WHAT)
$$ ##TITLE= Audit trail, XWIN-NMR		Version 3.5
$$ ##JCAMPDX= 5.01
$$ ##ORIGIN= Bruker BioSpin GmbH
$$ ##OWNER= NMR
$$ C:\u/data/dgb/nmr/ADRS/10780/pdata/1/auditp.txt
$$ ##AUDIT TRAIL=  $$ (NUMBER, WHEN, WHO, WHERE, WHAT)
(   1,<2005-10-12 16:51:08.53 +100>,<MAYBRIDGE\NMR>,<NMR_250MHZ>,
      <created by zg, POWCHK disabled, PULCHK disabled
       configuration hash MD5:
       62 19 C7 07 E1 42 D1 B7 37 6C 3D D0 77 39 F9 E6
       data hash MD5: 64K
       97 CC 36 38 DE F4 07 BA 74 40 38 E8 4D F6 D4 60>)
(   2,<2005-10-12 16:51:23.75 +100>,<MAYBRIDGE\NMR>,<NMR_250MHZ>,
      <Start of raw data processing
       ef LB = 0.3 FT_mod = 6 PKNL = 1 SI = 32K 
       data hash MD5: 32K
       26 24 E8 0D EF BF 1C 17 A0 04 59 9E 22 32 96 D8>)
(   3,<2005-10-12 16:51:28.55 +100>,<MAYBRIDGE\NMR>,<NMR_250MHZ>,
      <apk 
       data hash MD5: 32K
       5F 2A D6 0E 4A AF 1A F0 A1 A5 8C 38 04 D8 FD 13>)
(   4,<2005-10-12 16:51:29.67 +100>,<MAYBRIDGE\NMR>,<NMR_250MHZ>,
      <abs ABSG = 5 
       data hash MD5: 32K
       7B 25 5B 5F B8 8B AA D8 F1 08 99 95 AD 3E 07 4B>)
$$ ##END=
$$ 
$$ hash MD5
$$ 84 B8 B5 B5 C9 E0 A3 6C 47 CE EB ED 25 3D 18 36
##$RELAX= 
##$RELAX= 
##$RELAX= 
##$RELAX= 
##$RELAX= 
##$RELAX= 
##$RELAX= 
$$ Bruker specific parameters
$$ --------------------------
##$DU= <C:\u>
##$EXPNO= 10780
##$NAME= <ADRS>
##$PROCNO= 1
##$TYPE= <nmr>
##$USER= <dgb>
##$AMP= (0..31)
100 100 100 100 100 100 100 100 100 100 100 100 100 100 100 100 100 100 
100 100 100 100 100 100 100 100 100 100 100 100 100 100 
##$AQSEQ= 0
##$AQ_mod= 3
##$AUNM= <au_zg>
##$AUTOPOS= <45 >
##$BF1= 250.13
##$BF2= 250.13
##$BF3= 250.13
##$BF4= 250.13
##$BF5= 500.13
##$BF6= 500.13
##$BF7= 500.13
##$BF8= 500.13
##$BYTORDA= 1
##$CFDGTYP= 0
##$CFRGTYP= 5
##$CHEMSTR= <none>
##$CNST= (0..31)
1 1 145 1 1 1 1 1 1 1 1 1 1 1 1 1 1 1 1 1 1 1 1 1 1 1 1 1 1 1 1 1 
##$CPDPRG= <>
##$CPDPRG1= <>
##$CPDPRG2= <>
##$CPDPRG3= <>
##$CPDPRG4= <mlev>
##$CPDPRG5= <mlev>
##$CPDPRG6= <mlev>
##$CPDPRG7= <mlev>
##$CPDPRG8= <mlev>
##$CPDPRGB= <>
##$CPDPRGT= <>
##$D= (0..31)
0 1 0 0 0 0 0 0 0 0.06 0 0 0 0 0 0 0.0002 0 0 0 0 0 0 0 0 0 0 0 0 0 0 
0 
##$DATE= 1129132266
##$DBL= (0..7)
120 120 120 120 120 120 120 120 
##$DBP= (0..7)
150 150 150 150 150 150 150 150 
##$DBP07= 0
##$DBPNAM0= <>
##$DBPNAM1= <>
$$ [...]
##$SUBNAM7= <"">
##$SUBNAM8= <"">
##$SUBNAM9= <"">
##$SW= 20.6930455092707
##$SWIBOX= (0..15)
0 0 3 0 0 0 0 0 0 0 0 0 0 0 0 0 
##$SW_h= 5175.983436853
##$TD= 65536
##$TD0= 1
##$TE= 295.16
##$TE2= 300
##$TE3= 300
##$TEG= 300
##$TL= (0..7)
0 120 120 120 120 120 120 120 
##$TP= (0..7)
150 150 150 150 150 150 150 150 
##$TP07= 0
##$TPNAME0= <>
##$TPNAME1= <>
##$TPNAME2= <>
##$TPNAME3= <>
##$TPNAME4= <>
##$TPNAME5= <>
##$TPNAME6= <>
##$TPNAME7= <>
##$TPOAL= (0..7)
0.5 0.5 0.5 0.5 0.5 0.5 0.5 0.5 
##$TPOFFS= (0..7)
0 0 0 0 0 0 0 0 
##$TUNHIN= 0
##$TUNHOUT= 0
##$TUNXOUT= 0
##$USERA1= <user>
##$USERA2= <user>
##$USERA3= <user>
##$USERA4= <user>
##$USERA5= <user>
##$V9= 5
##$VALIST= <valist>
##$VCLIST= <CCCCCCCCCCCCCCC>
##$VD= 0
##$VDLIST= <DDDDDDDDDDDDDDD>
##$VPLIST= <PPPPPPPPPPPPPPP>
##$VTLIST= <TTTTTTTTTTTTTTT>
##$WBST= 1024
##$WBSW= 4
##$XGAIN= (0..3)
0 0 0 0 
##$XL= 0
##$YL= 0
##$YMAX_a= 455188
##$YMIN_a= -392546
##$ZGOPTNS= <>
##$ZL1= 120
##$ZL2= 120
##$ZL3= 120
##$ZL4= 120
##$ABSF1= 16.45687
##$ABSF2= -4.236303
##$ABSG= 5
##$ABSL= 3
##$ALPHA= 0
##$AQORDER= 0
##$ASSFAC= 0
##$ASSFACI= 0
##$ASSFACX= 0
##$ASSWID= 0
##$AUNMP= <proc_1d>
##$AZFE= 0.1
##$AZFW= 0.1
##$BCFW= 0
##$BC_mod= 0
##$BYTORDP= 0
##$COROFFS= 0
##$CY= 12.5
##$DATMOD= 1
##$DC= 0
##$DFILT= <>
##$DTYPP= 0
##$F1P= 14.0000005364418
##$F2P= -0.99999901652339
##$FCOR= 0.5
##$FTSIZE= 32768
##$FT_mod= 6
##$GAMMA= 0
##$GB= 0
##$INTBC= 1
##$INTSCL= 1
##$ISEN= 128
##$LB= 0.3
##$LEV0= 0
##$LPBIN= 0
##$MAXI= 10000
##$MC2= 0
##$MEAN= 0
##$ME_mod= 0
##$MI= 0
##$NCOEF= 0
##$NC_proc= -3
##$NLEV= 6
##$NOISF1= 0
##$NOISF2= 0
##$NSP= 0
##$NTH_PI= 0
##$NZP= 0
##$OFFSET= 16.45687
##$PC= 1
##$PHC0= -70.12944
##$PHC1= 9.520806
##$PH_mod= 1
##$PKNL= yes
##$PPARMOD= 0
##$PSCAL= 4
##$PSIGN= 0
##$REVERSE= no
##$SF= 250.130016288892
##$SI= 32768
##$SIGF1= 0
##$SIGF2= 0
##$SINO= 400
##$SIOLD= 32768
##$SREGLST= <1H.CDCl3>
##$SSB= 0
##$STSI= 32768
##$STSR= 0
##$SW_p= 5175.98343685301
##$SYMM= 0
##$S_DEV= 0
##$TDeff= 65536
##$TDoff= 0
##$TI= <Analysis number 999999
Compound Code 99
Book Reference 9
Project Code 9>
##$TILT= no
##$TM1= 0
##$TM2= 0
##$TOPLEV= 0
##$USERP1= <user>
##$USERP2= <user>
##$USERP3= <user>
##$USERP4= <user>
##$USERP5= <user>
##$WDW= 1
##$XDIM= 32768
##$YMAX_p= 340276652
##$YMIN_p= -255201
$$ End of Bruker specific parameters
$$ ---------------------------------
##NTUPLES= NMR SPECTRUM
##VAR_NAME=  FREQUENCY,     SPECTRUM/REAL,   SPECTRUM/IMAG
##SYMBOL=    X,             R,               I
##VAR_TYPE=  INDEPENDENT,   DEPENDENT,       DEPENDENT
##VAR_FORM=  AFFN,          ASDF,            ASDF
##VAR_DIM=   32768,         32768,           32768
##UNITS=     HZ,            ARBITRARY UNITS, ARBITRARY UNITS
##FACTOR=    0.157963299565203, 1,           1
##FIRST=     4116.35694239201, 0,            0
##LAST=      -1059.626494461, 0,             0
##MIN=       -1059.626494461, -255201,       0
##MAX=       4116.35694239201, 340276652,    0
$$ Real data points
##PAGE= N=1
##DATA TABLE= (X++(R..R)), XYDATA
$$ [...]
##PAGE= N=2
##DATA TABLE= (X++(I..I)), XYDATA
17922c165664k4239l902l065J0162J2345K9285M0170K8568n14L814R196Q482J6065
$$ -3165664 -3189903 -3193805 -3196870 -3186708 -3174363 -3145078 -3104908 -3076340 -3076854 -3073040 -3063844 -3055362 -3039297
17909c039297J4656J6940K1524L0982L1824K7054J0543J7482K6191K8728L5062
$$ -3039297 -3024641 -3007701 -2986177 -2955195 -2923371 -2896317 -2885774 -2868292 -2842101 -2813373 -2778311
17898b778311J8625K1045J9827K9443L9513M8696P0011M8003L6461K7837J4126
$$ -2778311 -2759686 -2738641 -2718814 -2689371 -2649858 -2601162 -2531151 -2483148 -2446687 -2418850 -2404724
17887b404724N0860N8724N0710O3367J8260j4510o0005q4535j72757k51557k30151
$$ -2404724 -2353864 -2295140 -2244430 -2181063 -2162803 -2177313 -2237318 -2321853 -2494610 -2746167 -2976318
17876b976318j02934l0477P007K5627K8429N2806N3365K4338M798M097P961K4714
$$ -2976318 -3079252 -3109729 -3102722 -3077095 -3048666 -2995860 -2942495 -2918157 -2913359 -2909262 -2901301 -2876587
17864b876587K6152n218o436K5379N8982L9015N5751J5158J2430q068l9757j3834
$$ -2876587 -2850435 -2855653 -2862089 -2836710 -2777728 -2738713 -2682962 -2667804 -2655374 -2663442 -2703199 -2717033
17852b717033R579K1240j0381j0862J6580L2835K8148J8787K6361J9323m264P609
$$ -2717033 -2707454 -2686214 -2696595 -2707457 -2690877 -2658042 -2629894 -2611107 -2584746 -2565423 -2569687 -2562078
17840b562078J2069J9229R939J5590K0405J9844R169L285L6934K0833K7666K8648
$$ -2562078 -2550009 -2530780 -2520841 -2505251 -2484846 -2465002 -2455833 -2452548 -2415614 -2394781 -2367115 -2338467
17828b338467J981j8343j3525J9298K4414J4701L679J0894M054m125J1102K5477
$$ -2338467 -2336486 -2354829 -2368354 -2349056 -2324642 -2309941 -2306262 -2295368 -2291314 -2295439 -2284337 -2258860
17816b258860J9923n338p371J5550l881K784K3234l289J3834L6453j2637q808
$$ -2258860 -2238937 -2244275 -2251646 -2236096 -2239977 -2237193 -2213959 -2217248 -2203414 -2166961 -2179598 -2188406
17804b188406m851j855p475J215K7873L5308J2876J0113J2365l803L624J1158
$$ -2188406 -2193257 -2195112 -2202587 -2201372 -2173499 -2138191 -2125315 -2115202 -2102837 -2106640 -2103016 -2091858
17792b091858K1121l7k0205k781K1397L0297q181P742L5102K4199J3358J5660
$$ -2091858 -2070737 -2070774 -2090979 -2093760 -2072363 -2042066 -2050247 -2042505 -2007403 -1983204 -1969846 -1954186
17780a954186P126K543K8887K8232J3540J4320L8995P79j3703p146P075K0782
$$ -1954186 -1947060 -1944517 -1915630 -1887398 -1873858 -1859538 -1820543 -1819764 -1833467 -1840613 -1833538 -1812756
17768a812756L0089Q541K5576L3835L4631l438k3765K3830K5446J8173O068j785
$$ -1812756 -1782667 -1774126 -1748550 -1714715 -1680084 -1683522 -1707287 -1683457 -1658011 -1639838 -1633770 -1635555
17756a635555k025K3976K2860J6324Q283J1984M898J3581L367K739O111J3346
$$ -1635555 -1637580 -1613604 -1590744 -1574420 -1566137 -1554153 -1549255 -1535674 -1532307 -1529568 -1523457 -1510111
17744a510111o981n623J9776L4849K7221J2056J8865K6487m079Q377N576L135
$$ -1510111 -1517092 -1522715 -1502939 -1468090 -1440869 -1428813 -1409948 -1383461 -1387540 -1379163 -1373587 -1370452
17732a370452K8178L94O277M559Q928J3331R77K1690K0658J4591O892r408J2284
$$ -1370452 -1342274 -1341880 -1335603 -1331044 -1322116 -1308785 -1307808 -1286118 -1265460 -1250869 -1243977 -1253385 -1241101
17719a241101K1927J6697N996K0146J0119J1347J2708L09N102K2936P897j6018
$$ -1241101 -1219174 -1202477 -1196481 -1176335 -1166216 -1154869 -1142161 -1141852 -1136750 -1113814 -1105917 -1121935
17707a121935Q635J9902O008J6508j063m505O388K2787J8982J4873K3382l404
$$ -1121935 -1113300 -1093398 -1087390 -1070882 -1071945 -1076450 -1070062 -1047275 -1028293 -1013420 -990038 -993442
17695i93442p205K0793J6157K8106N145m112K208L1737L1136K9719j0003J5788
$$ -993442 -1000647 -979854 -963697 -935591 -930446 -934558 -932350 -900613 -869477 -839758 -849761 -833973
17683h33973j421k757N819J3440l61Q825K6566J6020p819j2336K6616L7924L4320
$$ -833973 -835394 -838151 -832332 -818892 -819253 -810428 -783862 -767842 -775661 -787997 -761381 -723457 -689137
17670f89137J4477J2304m833J1670M7146J4384K3584J1717N067J1671J1251J0145
$$ -689137 -674660 -662356 -667189 -655519 -608373 -593989 -570405 -558688 -553621 -541950 -530699 -520554
17658e20554J3512o021j602M105J1784P508M8655K1442j615M402J0414J1861J2845
$$ -520554 -507042 -513063 -514665 -510560 -498776 -491268 -442613 -421171 -422786 -418384 -407970 -396109 -383264
17645c83264P733K558J5972L2959K391m331J6536K3331K2183R497N606J7911K9719
$$ -383264 -375531 -372973 -357001 -324042 -321651 -325982 -309446 -286115 -263932 -254435 -248829 -230918 -201199
17632b01199K908J1447L8694K6092N736J2758K1623N318R209J3111L2568K2421
$$ -201199 -198291 -186844 -148150 -122058 -116322 -103564 -81941 -76623 -67414 -54303 -21735 686
17620F86R349K2392J6024K9124K1989K5609K7687O561J8189K5111L8101L0831
$$ 686 10035 32427 48451 77575 99564 125173 152860 159421 177610 202721 240822 271653
17608B71653K8810J9913K6595J1906j809k078L3417Q164J5059M1023O564q029
$$ 271653 300463 320376 346971 358877 357068 354990 388407 396571 411630 452653 459217 451188
17596D51188K3094L5488M0295K3504P968K914K5615J6390L9577J56j1990o438
$$ 451188 474282 509770 550065 573569 581537 584451 610066 626456 666033 666189 654199 647761
17584F47761J5549N7319M0514P4254N1524J5605L3981L2096N7781K2282K0548
$$ 647761 663310 720629 761143 835397 886921 902526 936507 968603 1026384 1048666 1069214
17573A069214K8750P714K1446L1733L8516J9738K7102M0129N1267L0716K2630
$$ 1069214 1097964 1105678 1127124 1158857 1197373 1217111 1244213 1284342 1335609 1366325 1388955
17562A388955L3306M5650M2894L8539J6708M819L7592M3391M8220M8019K0516
$$ 1388955 1422261 1467911 1510805 1549344 1566052 1570871 1608463 1651854 1700074 1748093 1768609
17551A768609K7445M5967M9588K9423L8171M4048L4944N1347N9983M3769M3449
$$ 1768609 1796054 1842021 1891609 1921032 1959203 2003251 2038195 2089542 2149525 2193294 2236743
17540B236743M5249M0996O0977O5734L7638K5404N6155O3826O7885P6431N9530
$$ 2236743 2281992 2322988 2383965 2449699 2487337 2512741 2568896 2632722 2700607 2777038 2836568
17529B836568N7821P1663N7567P4801O1213P7491Q1302P1501N8467P1433O5334
$$ 2836568 2894389 2966052 3023619 3098420 3159633 3237124 3318426 3389927 3448394 3519827 3585161
17518C585161Q7807J19059J17984J07605J01034R1347R4033J04838J10772J27164
$$ 3585161 3672968 3792027 3910011 4017616 4118650 4209997 4304030 4408868 4519640 4646804
17508D646804J10197J15771J19800J18197J67315J74901J53483J54437J76118
$$ 4646804 4757001 4872772 4992572 5110769 5278084 5452985 5606468 5760905 5937023
17499E937023J74986J77922J60535J97369K13354K12013K37395K20739K30508
$$ 5937023 6112009 6289931 6450466 6647835 6861189 7073202 7310597 7531336 7761844
17490G761844K61160K95146L12755L34835L64485L74912M28297M71407M81611
$$ 7761844 8023004 8318150 8630905 8965740 9330225 9705137 10133434 10604841 11086452
17481A1086452M25330L89368L74793M05102N17954O31391P14504P87735Q80212
$$ 11086452 11511782 11901150 12275943 12681045 13198999 13830390 14544894 15332629 16212841
17472A6212841R97807J155142J312187J487071J662281J825128K072415K495069
$$ 16212841 17210648 18365790 19677977 21165048 22827329 24652457 26724872 29219941
17464B9219941L013035L707939M571998N640765O818052P422229N558947j845241
$$ 29219941 32232976 35940915 40512913 46153678 52971730 60393959 65952906 64107665
17456F4107665j5858342l0322040l2737959k1275151q795951k310922Q95516K699578
$$ 64107665 48249323 17927283 -14810676 -36085827 -44881778 -47192700 -46297184 -43597606
17448d3597606L391423L395604L123065K730729K322210J859766J349888P95513
$$ -43597606 -40206183 -36810579 -33687514 -30956785 -28634575 -26774809 -25424921 -24629408
17440b4629408L70732K16015L15418N10409O53528P42782P77403P89386Q05871
$$ -24629408 -24258676 -24042661 -23727243 -23216834 -22563306 -21820524 -21043121 -20253735 -19447864
17431a9447864P83654P09164N85134M46074L73282M02365M38135M68259M42203
$$ -19447864 -18664210 -17955046 -17369912 -16923838 -16550556 -16148191 -15710056 -15241797 -14799594
17422a4799594M10514M08490L94411L54259L39397L29793L15183L01018K98249
$$ -14799594 -14389080 -13980590 -13586179 -13231920 -12892523 -12562730 -12247547 -11946529 -11648280
17413a1648280K77795K55354K36587K36364K21871K25172K18909K07911K02916
$$ -11648280 -11370485 -11115131 -10878544 -10642180 -10420309 -10195137 -9976228 -9768317 -9565401
17404i565401J58033J51399J60932J83465J75472J56598J52439J40039J29008
$$ -9565401 -9407368 -9255969 -9095037 -8911572 -8736100 -8579502 -8427063 -8287024 -8158016
17395h158016J31344J19693J01836J02069J16343R6766J08791J08078R6785J00518
$$ -8158016 -8026672 -7906979 -7805143 -7703074 -7586731 -7489965 -7381174 -7273096 -7176311 -7075793
17385g075793J06252R4571R8394R9865Q4092O8180N6454O2377N3617N5078Q7909
$$ -7075793 -6969541 -6874970 -6776576 -6676711 -6592619 -6524439 -6467985 -6405608 -6351991 -6296913 -6209004
17374f209004Q3395P3940N8241O6000P6127P1425N4269M7216O1434M9863M8649
$$ -6209004 -6125609 -6051669 -5993428 -5927428 -5851301 -5779876 -5725607 -5678391 -5616957 -5567094 -5518445
17363e518445O5873M8189K2695M0375N9815M8378M4916L9155M5453M3776L8968
$$ -5518445 -5452572 -5404383 -5381688 -5341313 -5281498 -5233120 -5188204 -5149049 -5103596 -5059820 -5020852
17352e020852J4061L2010M1394O5501M8144L2226K7744L0791K5671M3713M1822
$$ -5020852 -5006791 -4974781 -4933387 -4867886 -4819742 -4787516 -4759772 -4728981 -4703310 -4659597 -4617775
17341d617775M1141M5308K5406N5000N0295M0567M3114K0812K5709M6320m523
$$ -4617775 -4576634 -4531326 -4505920 -4450920 -4400625 -4360058 -4316944 -4296132 -4270423 -4224103 -4228626
17330d228626o676J3141K6487N6092p60l9660l82J7150J6294J1458K8968M8544
$$ -4228626 -4235302 -4222161 -4195674 -4139582 -4140342 -4180002 -4180384 -4163234 -4146940 -4135482 -4106514 -4057970
17318d057970K0638L6513L3150K8609K1354l775K2069K9603K4595J9413M0847
$$ -4057970 -4037332 -4000819 -3967669 -3939060 -3917706 -3921481 -3899412 -3869809 -3845214 -3825801 -3784954
17307c784954M4962K0086R85L0353K1321N3474M0279Q832j2711k1395o301O305
$$ -3784954 -3739992 -3719906 -3718921 -3688568 -3667247 -3613773 -3573494 -3564662 -3577373 -3598768 -3605069 -3598764
17295c598764k360o339O309K5049L2705L2004K4731R195n153J7399L0763l10O157
$$ -3598764 -3601124 -3607463 -3601154 -3576105 -3543400 -3511396 -3486665 -3477470 -3482623 -3465224 -3434461 -3434771 -3428614
17282c428614K8154J1753K1048K5313N855N549J1921q01J1202J9335K0464L496
$$ -3428614 -3400460 -3388707 -3367659 -3342346 -3336491 -3330942 -3319021 -3319822 -3308620 -3289285 -3268821 -3265325
17270c265325K3555K8896J1384J1447K8727J8149J2335o794J4774J4302K0017
$$ -3265325 -3241770 -3212874 -3201490 -3190043 -3161316 -3143167 -3130832 -3137626 -3122852 -3108550 -3088533
17259c088533K6433J7696K7042N367J6956P627K3329K7l168J5542J8205K0912
$$ -3088533 -3062100 -3044404 -3017362 -3011995 -2995039 -2987412 -2964083 -2964056 -2967224 -2951682 -2933477 -2912565
17247b912565Q400J6426k641j610J6163J7296J4866J615m385K0235Q403L027K264
$$ -2912565 -2904165 -2887739 -2890380 -2891990 -2875827 -2858531 -2843665 -2842050 -2846435 -2826200 -2817797 -2814770 -2812506
17234b812506J4298j53n554K3379O107J3561L0989J8642J4324J5934j172j7435
$$ -2812506 -2798208 -2798361 -2803915 -2780536 -2774429 -2760868 -2729879 -2711237 -2696913 -2680979 -2682151 -2699586
17222b699586O407L950J1869L4844L059L083P044K152J2683J0950O833N673O043
$$ -2699586 -2693179 -2689229 -2677360 -2642516 -2639457 -2636374 -2629330 -2627178 -2614495 -2603545 -2596712 -2591039 -2584996
17209b584996J4296K7647K5698J1328o284O466N274J1690J9617j5230o490n925
$$ -2584996 -2570700 -2543053 -2517355 -2506027 -2512311 -2505845 -2500571 -2488881 -2469264 -2484494 -2490984 -2496909
17197b496909K0641K2849J5396K0073j3368m1478n422J8334K976J8507K8096J8297
$$ -2496909 -2476268 -2453419 -2438023 -2417950 -2431318 -2472796 -2478218 -2459884 -2456908 -2438401 -2410305 -2392008
17185b392008o082M078K1924K1258p42M46Q303q750J6586J2997P855j0068N716
$$ -2392008 -2398090 -2394012 -2372088 -2350830 -2351572 -2351126 -2342823 -2351573 -2334987 -2321990 -2314135 -2324203 -2318487
17172b318487J7496Q183m822j6083N557M126P970q74K2969J0468N692j614L309
$$ -2318487 -2300991 -2292808 -2297630 -2313713 -2308156 -2304030 -2296060 -2296934 -2273965 -2263497 -2257805 -2259419 -2256110
17159b256110Q212J1713M731K1007N002j3630P250L1535p469k640K8685o113J660
$$ -2256110 -2247898 -2236185 -2231454 -2210447 -2205445 -2219075 -2211825 -2180290 -2187759 -2190399 -2161714 -2167827 -2166167
17146b166167J5495J6752J0063J2025N383j6909m232Q649K218K4627J2521o935
$$ -2166167 -2150672 -2133920 -2123857 -2111832 -2106449 -2123358 -2127590 -2118941 -2116723 -2092096 -2079575 -2086510
17134b086510O247n295J4260K5345p623M233J2549m42lj2767J8250K0305J2018
$$ -2086510 -2080263 -2085558 -2071298 -2045953 -2053576 -2049343 -2036794 -2037236 -2037239 -2050006 -2031756 -2011451 -1999433
17121a999433j3358M571J3988M45j0814r048Q300N81j0505n402K106J1990J1072
$$ -1999433 -2012791 -2008220 -1994232 -1993787 -2004601 -2013649 -2005349 -2004768 -2015273 -2020675 -2018569 -2006579 -1995507
17108a995507J8711J928R741K1851L030R35M523N325J9935j3096P388M548q339
$$ -1995507 -1976796 -1974868 -1965127 -1943276 -1940246 -1939311 -1934788 -1929463 -1909528 -1922624 -1915236 -1910688 -1919027
17095a919027m3J7144O799j074R755M49J086N451k1085J9289J0956j677J9706
$$ -1919027 -1919070 -1901926 -1895127 -1896201 -1886446 -1885997 -1884911 -1879460 -1900545 -1881256 -1870300 -1871977 -1852271
17082a852271P953k653J1888Q849k740q055l318K785P609Q268P669O610q363L318
$$ -1852271 -1844318 -1846971 -1835083 -1826234 -1828974 -1837029 -1840347 -1837562 -1829953 -1821685 -1814016 -1807406 -1815769 -1812451
17068a812451J837k089M604K1469K2226N666l2613q406J8268K1509j382J5840
$$ -1812451 -1810614 -1812703 -1808099 -1786630 -1764404 -1758738 -1791351 -1799757 -1781489 -1759980 -1761362 -1745522
17056a745522K5375L036N830J4933J1705n639m043j4005M675l979m739O492j017
$$ -1745522 -1720147 -1717111 -1711281 -1696348 -1684643 -1690282 -1694325 -1708330 -1703655 -1707634 -1712373 -1705881 -1706898
17043a706898J4478J0355M633j1955J3622J7493l765j3075q841N589K5733L270
$$ -1706898 -1692420 -1682065 -1677432 -1689387 -1675765 -1658272 -1662037 -1675112 -1683953 -1678364 -1652631 -1649361
17031a649361j3255M778J2847J5621J2328j018M048j5214j5072P379L792k351
$$ -1649361 -1662616 -1657838 -1644991 -1629370 -1617042 -1618060 -1614012 -1629226 -1644298 -1636919 -1633127 -1635478
17019a635478K1294Q249j239O551R03L496l694l682j0295J2368L7350M302P323
$$ -1635478 -1614184 -1605935 -1607174 -1600623 -1599720 -1596224 -1599918 -1603600 -1613895 -1601527 -1564177 -1559875 -1552552
17006a552552n650k7520K2624L1714J5129L420o493l8065j2823J3227n632J3213
$$ -1552552 -1558202 -1585722 -1563098 -1531384 -1516255 -1512835 -1519328 -1557393 -1570216 -1556989 -1562621 -1549408
16994a549408L4547m01k403j7720J2215K0458q690J3187J348J935N966l80K203
$$ -1549408 -1514861 -1515262 -1517665 -1535385 -1523170 -1502712 -1511402 -1498215 -1496867 -1494932 -1488966 -1489346 -1487143
16981a487143n865m176k953l305M753j6919J908K6172R368K334K0024J2151O011
$$ -1487143 -1493008 -1497184 -1500137 -1503442 -1498689 -1515608 -1513700 -1487528 -1478160 -1475826 -1455802 -1443651 -1437640
16968a437640J1308n455P2N006q362J5643J5045m159k0069l913J4458J0447m137
$$ -1437640 -1426332 -1431787 -1431715 -1426709 -1435071 -1419428 -1404383 -1408542 -1428611 -1432524 -1418066 -1407619 -1411756
16955a411756q994j7993J9283R289j218J373j3640m719J7497K0322L498M975J0581
$$ -1411756 -1420750 -1438743 -1419460 -1410171 -1411389 -1410016 -1423656 -1428375 -1410878 -1390556 -1387058 -1382083 -1371502
16942a371502O559N511k2587j2123l809J2760j0555J0150J066j37L554J412P191
$$ -1371502 -1364943 -1359432 -1382019 -1394142 -1397951 -1385191 -1395746 -1385596 -1384530 -1384667 -1381113 -1379701 -1372510
16929a372510k005Q681O714j8484M336K9964P992o971K2925o356r68J0715J2642
$$ -1372510 -1374515 -1365834 -1359120 -1377604 -1373268 -1343304 -1335312 -1342283 -1319358 -1325714 -1326682 -1315967 -1303325
16916a303325N798L218J828K703J3542M259J3470j6274K53J0882j0523J8816K3230
$$ -1303325 -1297527 -1294309 -1292481 -1289778 -1276236 -1271977 -1258507 -1274781 -1274528 -1263646 -1274169 -1255353 -1232123
16903a232123Q571L6219k905J2547K0339r191J9721R815n524j5398J4258K9911
$$ -1232123 -1223552 -1187333 -1190238 -1177691 -1157352 -1166543 -1146822 -1137007 -1142531 -1157929 -1143671 -1113760
16891a113760M4754L7218M1048K4070J3477Q239j5133m4890q6226j32468j28255
$$ -1113760 -1069006 -1031788 -990740 -966670 -953193 -944954 -960087 -1004977 -1091203 -1223671 -1351926
16880a351926q7091j9577o88P808j1656M418j498J8513J3213J2457L4278M4438
$$ -1351926 -1439017 -1458594 -1459282 -1451474 -1463130 -1458712 -1460210 -1441697 -1428484 -1416027 -1381749 -1337311
16868a337311J396k1674m433J3587r103O521Q741J9382Q818J208n730P910R605
$$ -1337311 -1335915 -1357589 -1362022 -1348435 -1357538 -1351017 -1342276 -1322894 -1314076 -1312868 -1318598 -1310688 -1301083
16855a301083M752j4253l505J766K0774K5281J1287j5334N444J0937N996J3N938
$$ -1301083 -1296331 -1310584 -1314089 -1312323 -1291549 -1266268 -1254981 -1270315 -1264871 -1253934 -1247938 -1247925 -1241987
16842a241987L119K676J567o321J3757O585j480L606Q017J6634j6175j9955Q98
$$ -1241987 -1238868 -1236192 -1234625 -1240946 -1227189 -1220604 -1222084 -1218478 -1210461 -1193827 -1210002 -1229957 -1229059
16829a229059M469j34J5395J0140K0359M139k727Q347J1665q962j6296o288J2963
$$ -1229059 -1224590 -1224724 -1209329 -1199189 -1178830 -1174691 -1177418 -1169071 -1157406 -1166368 -1182664 -1188952 -1175989
16816a175989R749l559J7418m102j6836J1233J5219n126J0249P453J1843n809
$$ -1175989 -1166240 -1169799 -1152381 -1156483 -1173319 -1162086 -1146867 -1151993 -1141744 -1134291 -1122448 -1128257
16804a128257N824J606j1430m820N94p853K227K0886j4246n32K3100K207N997
$$ -1128257 -1122433 -1120827 -1132257 -1137077 -1136483 -1144336 -1142109 -1121223 -1135469 -1136001 -1112901 -1110694 -1104697
16791a104697j957Q049J9185J6352k11k0110J647J2669J2837m028j2703p411n764
$$ -1104697 -1106654 -1098605 -1079420 -1063068 -1063279 -1083389 -1081742 -1069073 -1056236 -1060264 -1072967 -1080378 -1086142
16778a086142K1272j3097L495J872L478J5055K920J527l131L36K761m837R980
$$ -1086142 -1064870 -1077967 -1074472 -1072600 -1069122 -1054067 -1051147 -1049620 -1052751 -1052415 -1049654 -1054491 -1044511
16765a044511K2289J0123j2646N597J1886j3958j041j2300j0722O890O570M774
$$ -1044511 -1022222 -1012099 -1024745 -1019148 -1007262 -1021220 -1022261 -1034561 -1045283 -1038393 -1031823 -1027049
16753a027049j3112N180J6409r368N354O339j0198p486Q797J7876n71K607N603
$$ -1027049 -1040161 -1034981 -1018572 -1027940 -1022586 -1016247 -1026445 -1033931 -1025134 -1007258 -1007829 -1005222 -999619
16740i99619k90j1298l382K0815R296L547J3244j0930p110J3926L302m7j3461
$$ -999619 -999909 -1011207 -1014589 -993774 -984478 -980931 -967687 -978617 -985727 -971801 -968499 -968546 -982007
16727i82007R638Q210K873j9128q679J5124J3960M529l823L942k977L255n395
$$ -982007 -972369 -964159 -961286 -980414 -989093 -973969 -960009 -955480 -959303 -955361 -958338 -955083 -960478
16714i60478J8176K267j5462J042O227P118j1498k260J6827J4007j916q874Q143
$$ -960478 -942302 -940035 -955497 -954455 -948228 -941110 -952608 -954868 -938041 -924034 -925950 -934824 -926681
16701i26681L31K069q703k6307Q156J2598J1560j5258K405J5461K8667N461p274
$$ -926681 -926350 -924281 -932984 -959291 -951135 -938537 -926977 -942235 -939830 -924369 -895702 -890241 -897515
16688h97515p508l675m133L718j7261l597q41m434p036O788J4361L1214M197k12
$$ -897515 -905023 -908698 -912831 -909113 -926374 -929971 -930812 -935246 -942282 -935494 -921133 -889919 -885722 -885934
16674h85934J7412J9438P041L697N675j6958p141j0644l343M849n501j4483j9033
$$ -885934 -868522 -849084 -842043 -838346 -832671 -849629 -856770 -867414 -870757 -865908 -871409 -885892 -904925
16661i04925M026J9652K615M347K9631L709j5552P402L00J033J489J0790l990
$$ -904925 -900899 -881247 -878632 -874285 -844654 -840945 -856497 -849095 -848795 -847762 -846273 -835483 -839473
16648h39473J2449P984Q682M474k0791n835j559L15J2126n522l265J2850r360
$$ -839473 -827024 -819040 -810358 -805884 -826675 -832510 -834069 -833754 -821628 -827150 -830415 -817565 -826925
16635h26925k2065K290J3416K603k604Q068K967M092R173j082Q579l680J3904
$$ -826925 -848990 -846700 -833284 -830681 -833285 -825217 -822250 -818158 -808985 -810067 -801488 -805168 -791264
16622g91264J9434n054k0149l969j1510l790K35m227K3968L7959j0855j9027j591
$$ -791264 -771830 -776884 -797033 -801002 -812512 -816302 -816067 -820294 -796326 -758367 -769222 -788249 -789840
16609g89840j4491j5135J8515J4274Q455L16K493n818M794K4333L920j7034m061
$$ -789840 -804331 -819466 -800951 -786677 -778222 -777906 -775413 -781231 -776437 -752104 -748184 -765218 -769279
16596g69279k02o030M980o799L964l196J17o011M730J409m273J1408j197k515
$$ -769279 -769481 -775511 -770531 -777330 -773366 -776562 -776445 -782456 -777726 -776317 -780590 -769182 -770379 -772894
16582g72894J6101Q643j147l2335j8837J2612J7660N505J9758r730J7949J7954
$$ -772894 -756793 -748150 -749297 -781632 -800469 -787857 -770197 -764692 -744934 -754664 -736715 -718761
16570g18761j5410J1420K7k0089q621O275L992R465j397O703J1306Q067M664R357
$$ -718761 -734171 -722751 -722724 -742813 -751434 -745159 -741167 -731702 -733099 -726396 -715090 -707023 -702359 -693002
16556f93002j782j4514j4834J16k119J0282P183q353L132L745L996p265J248k46
$$ -693002 -694784 -709298 -724132 -724016 -726135 -715853 -708670 -717023 -713891 -710146 -706150 -713415 -712167 -712413
16542g12413J3285O165K030j5559p298J3244j2343p223k290N053n318l834l144
$$ -712413 -699128 -692963 -690933 -706492 -713790 -700546 -712889 -720112 -722402 -717349 -722667 -726501 -729645
16529g29645J7016N799l96j2383K8381K5471j5500j4955P999M365J0991o384m064
$$ -729645 -712629 -706830 -707226 -719609 -691228 -665757 -681257 -696212 -688213 -683848 -672857 -679241 -683305
16516f83305J7526P284l779L064J0827r209p524j3152K2272K0708K6684M07k5732
$$ -683305 -665779 -658495 -662274 -659210 -648383 -657592 -665116 -678268 -655996 -635288 -608604 -608197 -633929
16503f33929l507j5779j3681j605L0806K395q632r974J7221j362j3377J534J7253
$$ -633929 -637436 -653215 -666896 -668501 -637695 -635300 -643932 -653906 -636685 -638047 -651424 -649890 -632637
16490f32637K635j3327j5685O728N825p52K58M578J2994L271k316J5544J5868
$$ -632637 -630002 -643329 -659014 -652286 -646461 -647213 -646955 -642377 -629383 -626112 -628428 -612884 -597016
16477e97016q924j3424j4813K1528P082p946j0127K8209r301M141O755O834J4
$$ -597016 -605940 -619364 -634177 -612649 -605567 -613513 -623640 -595431 -604732 -600591 -593836 -587002 -586988
16464e86988Q067M756J4437j1200j7007N706M573k663M61M910J1336j679k1733
$$ -586988 -578921 -574165 -559728 -570928 -587935 -582229 -577656 -580319 -579858 -574948 -563612 -565291 -587024
16451e87024r123r143r253o383J786M814q218j391L122J1814Q137J27L3572J2517
$$ -587024 -596147 -605290 -614543 -620926 -619140 -614326 -622544 -623935 -620813 -608999 -600862 -600735 -567163 -554646
16437e54646O802o688k917q797j4366n297J282J1405o174O858o11r524o83o947
$$ -554646 -547844 -554532 -557449 -566246 -580612 -585909 -584627 -573222 -579396 -572538 -573149 -582673 -583356 -590303
16423e90303q443K937J3930m410J2676P448l782J174Q003J0826K410O859j0904
$$ -590303 -598746 -595809 -581879 -586289 -573613 -566165 -569947 -568773 -560770 -549944 -547534 -540675 -551579
16410e51579j87j795j6504j2329P754O892J1497o405Q710J6898J0560m715k256
$$ -551579 -551766 -553561 -570065 -582394 -574640 -567748 -556251 -562656 -553946 -537048 -526488 -531203 -533459
16397e33459L108J6633j0416j6635m817J8469Q73l703j9695J204K0332J755n827
$$ -533459 -530351 -513718 -524134 -540769 -545586 -527117 -526244 -529947 -549642 -548438 -528106 -526351 -532178
16384e32178J0175M160O405J7100j281p179o360l798J2253q132r816J4775J095
$$ -532178 -522003 -517843 -511438 -494338 -495619 -502798 -509158 -512956 -500703 -508835 -518651 -503876 -502781
16371e02781o907J2290k678j324j2901j3820R09K8265J1050n39p373M892Q428
$$ -502781 -509688 -497398 -500076 -501400 -514301 -528121 -527212 -498947 -487897 -488436 -495809 -490917 -482489
16358d82489n091J1830L425k1049r433L06j5688R612J4533J82N481J6956K0451
$$ -482489 -487580 -475750 -472325 -493374 -502807 -502501 -518189 -508577 -494044 -493862 -488381 -471425 -450974
16345d50974q76j3930K129K309p792M019p256j6266L734N55l642P641N623J1753
$$ -450974 -451850 -465780 -463651 -461342 -469134 -465115 -472371 -488637 -484903 -484348 -487990 -480349 -474726 -462973
16331d62973m755j8144J5859L184r115L824J2822J9615j289J3926J6166j2342
$$ -462973 -467728 -485872 -470013 -466829 -475944 -472120 -459298 -439683 -440972 -427046 -410880 -423222
16319d23222n285j23j2193p952P809K299j2362k1176n987P328M725J7290O936
$$ -423222 -428507 -428630 -440823 -448775 -440966 -438667 -451029 -472205 -478192 -470864 -466139 -448849 -441913
16306d41913j3732N843R494l875j897J321r74K948N525J3922r743l898p617j619
$$ -441913 -455645 -449802 -440308 -444183 -446080 -444759 -445733 -442785 -437260 -423338 -433081 -436979 -444596 -446215
16292d46215J4829J4261k5783J0847J1933J0123P160j0870k3522n617L6633K3843
$$ -446215 -431386 -417125 -442908 -432061 -420128 -410005 -402845 -413715 -437237 -442854 -406221 -382378
16280c82378j9721j6618J57J8630J74k1137P664J539Q515m570l585J0290K5716
$$ -382378 -402099 -418717 -418560 -399930 -399756 -420893 -413229 -411690 -403175 -407745 -411330 -401040 -375324
16267c75324L695j4965r327r485r039K0511J5024p583j6638J0808J2779J7491
$$ -375324 -371629 -386594 -395921 -405406 -414445 -393934 -378910 -386493 -403131 -392323 -379544 -362053
16255c62053l744r531J43K0385Q713q532o446J2988n213k4489O684K8544l962
$$ -362053 -365797 -375328 -375185 -354800 -346087 -354619 -361065 -348077 -353290 -377779 -371095 -342551 -346513
16242c46513k022o390p107k0931R090J7166K195n12n038m170J988K969p856j0584
$$ -346513 -348535 -354925 -362032 -382963 -373873 -356707 -354512 -355024 -360062 -364232 -362244 -359275 -367131 -377715
16228c77715P873J0437J6918P228n514J5434J8805j3691k1935r765J0433J3674
$$ -377715 -369842 -359405 -342487 -335259 -340773 -325339 -306534 -320225 -342160 -351925 -341492 -327818
16216c27818J6170l848j6969m368j1120j9521R352J8167J1916r000j6936J924
$$ -327818 -311648 -315496 -332465 -336833 -347953 -367474 -358122 -339955 -328039 -337039 -353975 -352051
16204c52051K3717M487j1272N064J0065j269k989j0773M01j3040P109L5460K301
$$ -352051 -328334 -323847 -335119 -330055 -319990 -321259 -324248 -335021 -334620 -347660 -340551 -305091 -302790
16191c02790k6811k1477O458L184K46J0696J7383J7667p51K977m509o165K413
$$ -302790 -329601 -351078 -344620 -341436 -341190 -330494 -313111 -295444 -296195 -293218 -297727 -303892 -301479
16178c01479K662K2262O424n614j6287j4201j2553P570J2116j8013K86J0576k0094
$$ -301479 -298817 -276555 -270131 -275745 -292032 -306233 -318786 -311216 -299100 -317113 -316827 -306251 -326345
16165c26345m769J5487J1448J8283J2162M110O917K200j1669j2335l3139N261
$$ -326345 -331114 -315627 -304179 -285896 -273734 -269624 -262707 -260507 -272176 -284511 -317650 -312389
16153c12389J1029J1196J1657j2169k978P562q23k588L278J6515J644Q12p593
$$ -312389 -301360 -290164 -278507 -290676 -293654 -286092 -286915 -289503 -286225 -269710 -268066 -267254 -274847
16140b74847j5424k8130j0017L2897L951k031O237J9678J0078P373k889M484k0468
$$ -274847 -290271 -318401 -328418 -295521 -291570 -293601 -287364 -267686 -257608 -250235 -253124 -248640 -269108
16127b69108j9351M166K1965K839N765N716o560j2369P399j2989P03K351p371
$$ -269108 -288459 -284293 -262328 -259489 -253724 -248008 -254568 -266937 -259538 -272527 -271824 -269473 -276844
16114b76844J3032P967J5881q226O929J035J4280j482l0515l1002K4172J9283
$$ -276844 -263812 -255845 -239964 -248190 -241261 -240226 -225946 -227428 -257943 -288945 -264773 -245490
16102b45490Q291j0443N316r609L133O562o524k3635j5619r94K8561J0136j929
$$ -245490 -237199 -247642 -242326 -251935 -248802 -242240 -248764 -272399 -288018 -289012 -260451 -250315 -252244
16089b52244Q72J0950J7547j288O064R189L131j785m355k6610m100K2253j4771
$$ -252244 -251372 -240422 -222875 -224163 -218099 -208910 -205779 -207564 -211919 -238529 -242629 -220376 -235147
16076b35147j6171O162O899J272K7492K5444n54r640j1872L191J0310J808J3K13
$$ -235147 -251318 -245156 -238257 -236985 -209493 -184049 -184603 -194243 -206115 -202924 -192614 -190806 -190793 -190580
16062a90580J1417k902j6628J469M410J0279K3492M440k1826Q076p116j9918Q922
$$ -190580 -179163 -182065 -198693 -197224 -192814 -182535 -159043 -154603 -176429 -168353 -175469 -195387 -186465
16049a86465J2009K50j0387j1407J698J2189k557M184J5474r598l4879n786J9912
$$ -186465 -174456 -174206 -184593 -196000 -194302 -182113 -184670 -180486 -165012 -174610 -209489 -215275 -195363
16036a95363Q954K049j3136P01J2561K1701p131n275K5103J4573k5369k2379j0713
$$ -195363 -186409 -184360 -197496 -196795 -184234 -162533 -169664 -174939 -149836 -135263 -160632 -183011 -193724
16023a93724Q555J2890J3791k629k326j7232O025M845n052Q656J9395J8105q007
$$ -193724 -185169 -172279 -158488 -161117 -163443 -180675 -174650 -169805 -174857 -166201 -146806 -128701 -136708
16010a36708j7472j529J7005K721j5408q865N622j324O343r728r206L546J1258
$$ -136708 -154180 -155709 -138704 -135983 -151391 -160256 -154634 -155958 -149615 -159343 -168549 -165003 -153745
15997a53745Q13k69M549J4510J7561K396P845r351j0243J0236K2646q428l8000
$$ -153745 -152932 -153201 -148652 -134142 -116581 -114185 -106340 -115691 -125934 -115698 -93052 -101480 -139480
15984a39480j7239Q925J311l1754K3803K6749O402l071j97l665L004Q785J6775
$$ -139480 -156719 -147794 -146483 -178237 -154434 -127685 -121283 -124354 -124551 -128216 -125212 -116427 -99652
15971i9652q711j1834j0167q467J1388K6114K3313P150j5353L89j2937k4912P784
$$ -99652 -108363 -120197 -130364 -138831 -127443 -101329 -78016 -70866 -86219 -85830 -98767 -123679 -115895
15958a15895Q827J883p975L823K7550N088q311q06J2232j5136m513K8571k3696
$$ -115895 -107068 -105185 -113160 -109337 -81787 -76699 -85010 -85816 -73584 -88720 -93233 -64662 -88358
15945h8358j8230m928j4841p630L088N541K390K2213K2908q290J5517K5649N983
$$ -88358 -106588 -111516 -126357 -133987 -130899 -125358 -122968 -100755 -77847 -86137 -70620 -44971 -38988
15932c8988o819j2228k6601j6528J7779j482L191J0544P494j2136k85N137j3583
$$ -38988 -45807 -58035 -84636 -101164 -83385 -84867 -81676 -71132 -63638 -75774 -76059 -70922 -84505
15919h4505k373l231N763L215J3888M006p958l170J0166N195p31j073j0507M788
$$ -84505 -86878 -90109 -84346 -81131 -67243 -63237 -71195 -74365 -64199 -59004 -59735 -60808 -71315 -66527
15905f6527J0043J2137K547k414k4904l9105J8699K0049J0546P125k005J5896
$$ -66527 -56484 -44347 -41800 -44214 -69118 -108223 -89524 -69475 -58929 -51804 -53809 -37913
15893c7913J2515j9399p108n576K631M072R723q982p488J3341L515j1929k185
$$ -37913 -25398 -44797 -51905 -57481 -54850 -50778 -41055 -50037 -57525 -44184 -40669 -52598 -54783
15880e4783J3551o584J6565J7847p382k0978l181M42n691o49J4670j288p947R813
$$ -54783 -41232 -47816 -31251 -13404 -20786 -41764 -44945 -44503 -50194 -50843 -36173 -37461 -45408 -35595
15866c5595O341K1359l870j2096l808j1316m406R950J7515m479q678j309J6408
$$ -35595 -29254 -7895 -11765 -23861 -27669 -38985 -43391 -33441 -15926 -20405 -29083 -30392 -13984
15853a3984k398r15O034p41k414r077j1819N636K9033J7167J16k4738q541J5744
$$ -13984 -16382 -17297 -11263 -12004 -14418 -23495 -35314 -29678 -645 16522 16638 -8100 -16641 -897
15839h97q039r861J5227N553J4598k927k886N442R368j5166J546J679N685j9191
$$ -897 -8936 -18797 -3570 1983 16581 13654 10768 16210 25578 10412 11958 13637 19322 131
15825A31j0750n953J2751Q122N586n225j5023j8266J2869K2415O533p188J5287
$$ 131 -10619 -16572 -3821 4301 9887 4662 -10361 -28627 -15758 6657 13190 6002 21289
15812B1289p737j5112R134K429j4087L118J0400j2719L237k678j9386o514J1465
$$ 21289 13552 -1560 7574 10003 -4084 -966 9434 -3285 -48 -2726 -22112 -28626 -17161
15799a7161J8982O393L351p925M570J2250J0412o597o258j3015J1169J065j2249
$$ -17161 1821 8214 11565 3640 8210 20460 30872 24275 18017 5002 16171 17236 4987
15786D987M484R157O173L2522j3287j8421k527P074J2836q756P53P936Q03J839
$$ 4987 9471 18628 24801 57323 44036 25615 23088 30162 42998 34242 34995 42931 43734 45573
15772D5573j541j9377k2753Q273K2035J1210k0996r971J0759Q310k889p308q851
$$ 45573 44032 24655 1902 10175 32210 43420 22424 12453 23212 31522 28633 21325 12474
15759A2474J6769J1394n477P544J2763J3394N41r759J2539L429j797l819j9655
$$ 12474 29243 40637 35160 42704 55467 68861 69402 59643 72182 75611 73814 69995 50340
15746E0340j3409j1917J5775K4644K566n150k91r978N952K1398K0095q384n611
$$ 50340 36931 25014 40789 65433 67999 62849 62558 52580 58532 79930 100025 91641 86030
15733H6030j2148j3709J0964J7527K386Q432JJ990l535j0611K361L123j4318O020
$$ 86030 73882 60173 71137 88664 91050 99482 99483 101473 97938 87327 89688 92811 78493 84513
15719H4513P607o241O446m606j6413P033k763M13J6772N375J293J7439Q761O682
$$ 84513 92120 85879 92325 87719 71306 78339 75576 75989 92761 98136 99429 116868 125629 132311
15705A32311j6462o367K288O239k932q351P671J2480l011j9414o591j767p925
$$ 132311 115849 109482 111770 118009 115077 106726 114397 126877 123866 104452 97861 96094 88169
15692H8169p007J7158K2299j0644j5630Q667J6038j1216Q169n398j091J6562J3541
$$ 88169 81162 98320 120619 109975 94345 103012 119050 107834 116003 110605 109514 126076 139617
15679A39617r60j6405p04J1339J718r328r338N329J8847p40n102J192J6993K1459
$$ 139617 138657 122252 121548 132887 134605 125277 115939 121268 140115 139375 134273 135465 152458 173917
15665A73917J1166r03j5391k225j3797j4170j1136M793J2830R409P672r364M082
$$ 173917 185083 184180 168789 166564 152767 138597 127461 132254 145084 154493 162165 152801 156883
15652A56883K9015k640j2875q282j1172j0503L678L688K8023j319j3744L419k626
$$ 156883 185898 183258 170383 162101 150929 140426 144104 147792 175815 174496 160752 164171 161545
15639A61545j988j6446M60J2651J3959M101R895j0075J697J0775r354K152J3315
$$ 161545 159557 143111 143571 156222 170181 174282 184177 174102 175799 186574 177220 179372 192687
15626A92687m838j210n148J2249J5118J8860R941o168j005k0974k3221o500m515
$$ 192687 187849 186639 181491 193740 208858 227718 237659 231491 230486 209512 186291 179791 175276
15613A75276K3836L2240n446k0571q185l666n937m275L818R583j7914L621R658
$$ 175276 199112 231352 225906 205335 197150 193484 187547 183272 187090 196673 178759 182380 192038
15600A92038P311p254k436M980N6j727p917j983J9154K4472n7k5815L506J1227
$$ 192038 199349 192095 189659 194639 194695 192968 185051 183068 202222 226694 226637 200822 204328 215555
15586B15555M057N96M708K202j2406O571r846R304K0106p222r070K956J2497p636
$$ 215555 219612 220208 224916 227118 214712 221283 211437 220741 240847 233625 224555 227511 240008 232372
15572B32372n593K651n478j1834j1453J1966J6616m023p782K0068R289m064k0909
$$ 232372 226779 229430 223952 212118 200665 212631 229247 225224 217442 237510 246799 242735 221826
15559B21826K737K3596O074j0106r624q782K9787K2775M84l172K063J6779O941
$$ 221826 224563 248159 254233 244127 234503 225721 255508 278283 278767 275595 277658 294437 301378
15546C01378L505q92n293k266k6272k7569l4222j7588K555P750J0079R470L117
$$ 301378 304883 303991 298698 296432 270160 242591 208369 190781 193336 201086 211165 220635 223752
15533B23752R003N272j606J2449R116j0700j3881O952K131J2590K2325l473r914
$$ 223752 232755 238027 236421 248870 257986 247286 233405 240357 242488 255078 277403 273930 264016
15520B64016j0279o730j8470K2552r034r03J8780k065j2108j113J309K21J626
$$ 264016 253737 247007 228537 251089 242055 241152 259932 257867 245759 244646 245955 246176 247802
15507B47802J6905J8122J2777j0868q281J5367Q402k5370p059J3704l427p2M913
$$ 247802 264707 282829 295606 284738 276457 291824 300226 274856 267797 281501 278074 278002 282915
15494B82915O514l324J5173K4246J3381o650P081k712k0301k1728r354J0736q391
$$ 282915 289429 286105 301278 325524 338905 332255 339336 336624 316323 294595 285241 295977 287586
15481B87586j007J7556j911l365o956N097N519n419l679M538J2022J599n476J7903
$$ 287586 286579 304135 302224 298859 291903 297000 302519 297100 293421 297959 309981 311580 306104 324007
15467C24007J3194J1124m996l0490j3158K1940O087O737n981K031Q729P841o882
$$ 324007 337201 348325 343329 312839 299681 321621 327708 334445 328464 330495 339224 347065 340183
15454C40183j4566n111P739o189Q791R270j10Q90L780k935K657N866j4998k7330
$$ 340183 325617 320506 328245 322056 330847 340117 340007 340897 344677 341742 344399 350265 335267 307937
15440C07937J0165k26m341J0169K5430o213j861J4749J0247Q012j1015K2674J746
$$ 307937 318102 317876 313535 323704 349134 342921 341060 355809 366056 374068 363053 385727 387473
15427C87473r104P405j068k1478j9459N465J9020K3215J2985P501j042J953P81
$$ 387473 378369 385774 384706 363228 343769 349234 368254 391469 404454 411955 410913 412866 413647
15414D13647q747j8976N963Q023j692J001K5402r506j8863q554K0530J072n335
$$ 413647 404900 385924 391887 399910 398218 399219 424621 415115 396252 387698 408228 409300 403965
15401D03965J823l493N405J6176k6772j1477L831J5958N124p944p207p485M460
$$ 403965 405788 402295 407700 423876 397104 385627 389458 405416 410540 402596 395389 387904 392364
15388C92364N194J3742J0251j1550P737K2166J8r606k2605k62j1322O05K4595
$$ 392364 397558 411300 421551 410001 417738 439904 439922 430316 407711 407449 396127 396732 421327
15375D21327L596k69J322m269Q314R011j3119J7819j035j5051J339J2730N162
$$ 421327 424923 424654 425976 421707 430021 439032 425913 443732 442697 427646 428985 441715 446877
15362D46877K8678Q212j6893j0675L154r025k71J4702N841l265k042n835J231
$$ 446877 475555 483767 466874 456199 459353 450328 450057 464759 470600 467335 465293 459458 460689
15349D60689k257k776k6472R502L5976J0302l152r423J7983k472k2240P814Q681
$$ 460689 458432 455656 429184 438686 474662 484964 481812 472389 490372 487900 465660 473474 482155
15336D82155L205j2316K8639O148r181m218j373j5303P15K0486J0818k753j743
$$ 482155 485360 473044 501683 507831 498650 494432 493059 477756 478471 498957 509775 507022 505279
15323E05279L922k557k281j8261m769L1428J6185j2167k8614j8953M707J4849
$$ 505279 509201 506644 504363 486102 481333 512761 528946 516779 488165 469212 473919 488768
15311D88768J2697K9020L1658j4491k4791O293L794j2544j6375j1269J860M721
$$ 488768 501465 530485 562143 547652 522861 529154 532948 520404 504029 492760 494620 499341
15299D99341J8889L5092J5749J1619j2525k4107l920j4992J1922N681J4662n086
$$ 499341 518230 553322 569071 580690 568165 544058 540138 525146 537068 542749 557411 552325
15287E52325k370J1416j3457j5439j0397J4698J9411N177l493l239N419L985m460
$$ 552325 549955 561371 547914 532475 522078 536776 556187 561364 557871 554632 560051 564036 559576
15274E59576J9811o249r917K928Q203L167N747p238P567J0329l370o09J4449O3
$$ 559576 579387 573138 563221 566149 574352 577519 583266 576028 583595 593924 590554 589945 604394 604457
15260F04457n648K40O348j7914j0060K370j0385k203K1207p122p719J3313n053
$$ 604457 598809 599049 605397 587483 577423 579793 569408 567205 588412 581290 573571 586884 581831
15247E81831q439J252R345P311j197K048J5714J3011K1405L670k0930o923K904
$$ 581831 573392 574644 583989 591300 590103 592151 607865 620876 642281 645951 625021 618098 621002
15234F21002J3255m409n061J4849J300k778O450L842n434K5970J2189l474k1445
$$ 621002 634257 629848 624787 639636 640936 638158 644608 648450 643016 668986 681175 677701 656256
15221F56256k6274J7060J6697j4533o435j9398J7735K5843O598J212R625p577
$$ 656256 629982 647042 663739 649206 642771 623373 641108 666951 673549 674761 684386 676809
15209F76809N973k093k6537J446J3925J0356P555J150n637K243o340J4663K309
$$ 676809 682782 680689 654152 655598 669523 679879 687434 688584 682947 685190 678850 693513 695822
15196F95822k162J3531J2774K047J684K3478j731j2209M093j4657K354M166L376
$$ 695822 693660 707191 719965 722012 723696 747174 745443 733234 737327 722670 725024 729190 732566
15183G32566N324j2956K63j0065o976K0151J8400m453o082k5J6414J2799K424
$$ 732566 737890 724934 725197 715132 708156 728307 746707 742254 736172 736147 752561 765360 767784
15170G67784m0174O708J9776N766J1877M969j373M131R70L840p718n219j398R063
$$ 767784 727610 734318 754094 759860 771737 776706 775333 779464 780434 784274 776556 771337 769939 779002
15156G79002J1800k935Q011M256K323J5139q173J4122J3076R456O2l694j9360
$$ 779002 790802 787867 795878 800134 802457 817596 809423 823545 836621 846077 846139 842445 823085
15143H23085N25K3584M292P54p56L084j0635j966Q644J2854L323l971m258Q260
$$ 823085 823610 847194 851486 852240 851484 854568 843933 841967 850611 863465 866788 862817 858559 866819
15129H66819J7602J1722l068Q701J0893j3905j0510L305L790J7411K1659K370
$$ 866819 884421 896143 893075 901776 912669 898764 888254 891559 895349 912760 934419 936789
15117I36789j1045j9750k101Q052J3774Q245l820K2006J7188J3715R760M924q860
$$ 936789 925744 905994 903893 911945 925719 933964 930144 952150 969338 983053 992813 997737 988877
15104I88877L702J9162J4343j1879n773L5331N183l041M3N609q158J1748J6218
$$ 988877 992579 1011741 1026084 1014205 1008432 1043763 1048946 1045905 1045948 1051557 1043399 1055147 1071365
15091A071365J759J0067K7140J9066N560J0693n252j1368j2735j431N367J6987
$$ 1071365 1073124 1083191 1110331 1129397 1134957 1145650 1140398 1129030 1116295 1114864 1120231 1137218
15079A137218K0082J0383m742r058r21J4583O321K0019J3852R935p119K4027L3188
$$ 1137218 1157300 1167683 1162941 1153883 1152962 1167545 1173866 1193885 1207737 1217672 1210553 1234580 1267768
15066A267768P413K141J504O45J099J1252K9132K698k0701K4222K9891J4264K7588
$$ 1267768 1275181 1277322 1278826 1279471 1280570 1291822 1320954 1323652 1302951 1327173 1357064 1371328 1398916
15053A398916J2855O106J0619Q418J4690J7602J1089J8526J9482J8763J7383J0462
$$ 1398916 1411771 1417877 1428496 1436914 1451604 1469206 1480295 1498821 1518303 1537066 1554449 1564911
15041A564911m578j821L0756L3501Q965K3472M7032J9813P057J2386J4610M3503
$$ 1564911 1560333 1558512 1589268 1622769 1631734 1655206 1702238 1722051 1729108 1741494 1756104 1799607
15029A799607M2266L7548M2707K5998L1046L6345J8916M0488M6451M2397N2739
$$ 1799607 1841873 1879421 1922128 1948126 1979172 2015517 2034433 2074921 2121372 2163769 2216508
15018B216508K7492N1620P1882R2993O5534M1771N9278P4348P8621P0397P7556
$$ 2216508 2244000 2295620 2367502 2460495 2526029 2567800 2627078 2701426 2780047 2850444 2928000
15007B928000J06382J35897R9670J38255J63495J54001J57234J80378K23342K57351
$$ 2928000 3034382 3170279 3269949 3408204 3571699 3725700 3882934 4063312 4286654 4544005
14997D544005L18729L84010L96938M67500N51569O50879Q35548J052783J333918
$$ 4544005 4862734 5246744 5643682 6111182 6662751 7313630 8149178 9201961 10535879
14988A0535879J657662J581981J90325l190858p626534p544014k878725n81447
$$ 10535879 12193541 13775522 13965847 10774989 3148455 -4395559 -7274284 -7855731
14980g855731q9266M00230O43784O69696O29748N83324M82882L96806L28116K41228
$$ -7855731 -7944997 -7544767 -6900983 -6231287 -5601539 -5018215 -4535333 -4138527 -3810411 -3569183
14970c569183J46356M2528L7256P9392J08614J21270J34550J32190J21865J17139
$$ -3569183 -3422827 -3380299 -3343043 -3263651 -3155037 -3033767 -2899217 -2767027 -2645162 -2528023
14960b528023J39671J45460J11394J01327R0826Q1263R3900R3618O4188N8470
$$ -2528023 -2388352 -2242892 -2131498 -2030171 -1939345 -1858082 -1764182 -1670564 -1606376 -1547906
14950a547906P2686O0424P1763M8034N6786O5188L9497L5077O6179M7007M0593
$$ -1547906 -1475220 -1414796 -1343033 -1294999 -1238213 -1173025 -1133528 -1098451 -1032272 -985265 -944672
14939i44672M0356N0363N0311L7613J1317K0436L2624K6295L3740K1913L7627
$$ -944672 -904316 -853953 -803642 -766029 -754712 -734276 -701652 -675357 -641617 -619704 -582077
14928e82077K8005K9342K2067R729K1650L0954K2005N6J3222L3349M4132J4721
$$ -582077 -554072 -524730 -502663 -492934 -471284 -440330 -418325 -418269 -405047 -371698 -327566 -312845
14916c12845j48j5083P024J8801L0662M2988M338L429J4144N615J8640K1118J9038
$$ -312845 -312993 -328076 -321052 -302251 -271589 -228601 -224263 -220834 -206690 -201075 -182435 -161317 -142279
14903a42279O672Q512r24J6801J4878J8151L0525J1406P124K726J0160J5511Q278
$$ -142279 -135607 -127095 -128019 -111218 -96340 -78189 -47664 -36258 -29134 -26408 -16248 -737 7541
14890G541J897Q816l722k203n076L802J803J4772N2425J2187R540K2440J3096
$$ 7541 9438 18254 14532 12329 7253 11055 12858 27630 80055 92242 101782 124222 137318
14877A37318J096j7689p782K267j326J4472J3783Q110J2622Q70N944P635J5760
$$ 137318 138414 120725 112943 115210 113884 128356 142139 150249 162871 163741 169685 177320 193080
14864A93080n34k703n991r950m985J2206K1226N900N498Q643k647J5232o530M92
$$ 193080 192546 189843 183852 173902 168917 181123 202349 208249 213747 222390 219743 234975 228445 228937
14850B28937O323j1272L749k628M160Q44L342K3513K9679J957n034J0702Q621
$$ 228937 235260 223988 227737 225109 229269 230113 233455 256968 286647 288604 283570 294272 302893
14837C02893O987J1098P453J5068k443R03J2228K2382J7087n679j8685k4243o353
$$ 302893 309880 320978 328431 343499 341056 341959 354187 376569 393656 387977 369292 345049 338696
14824C38696J3304M176o268r290J9944M2154J0378j5485q333R749J5443p004m067
$$ 338696 352000 356176 349908 340618 360562 402716 413094 397609 389276 399025 414468 407464 403397
14811D03397l951j1710J9497P349j678j0024J1560J2357j64M212j730r7j0459
$$ 403397 399446 387736 407233 414582 412904 402880 414440 426797 426633 430845 429115 429018 418559
14798D18559p985r72R089J0248o011k996J8569p654L555J9874J067j5217J843
$$ 418559 410574 409602 418691 428939 422928 419932 438501 430847 434402 454276 455343 440126 441969
14785D41969J7179L4611J0464j3072j2524m017J0978L862l500l482Q533J1553
$$ 441969 459148 493759 504223 491151 478627 474610 485588 489450 485950 482468 491001 502554
14773E02554o265o587j0188L7987K7214j6598l907J7954p431j0792P657J9210
$$ 502554 496289 489702 479514 517501 544715 528117 524210 542164 534733 523941 531598 550808
14761E50808M02o501L63j551r185R464l81Q59j628K6511J6576m720R287K0616
$$ 550808 551210 544709 545072 543521 534336 543800 543419 544278 542650 569161 585737 581017 590304 610920
14747F10920r601k372K4919J0087p209o767O01q78J947K731Q70M196j419l246
$$ 610920 601319 598947 623866 633953 626744 619977 620578 619700 621647 624378 625248 629444 628025 624779
14733F24779j781J1398J1622Q487R965M672j8672r237r506m440j5492K90J3017
$$ 624779 622998 634396 646018 654505 664470 669142 650470 641233 631727 627287 611795 612085 625102
14720F25102P741K135Q182J2359P123M126j9731K762J6231r599m663j1009o936
$$ 625102 632843 634978 643160 655519 662642 666768 647037 649799 666030 656431 651768 640759 633823
14707F33823R863K0621o482j185J9300J4244l377q91J408l914l831J2587K630
$$ 633823 643686 664307 657825 656640 675940 690184 686807 685916 687324 683410 679579 692166 694796
14694F94796J2666r914j23P895L409K022j0869p628J3424J2141J4931r766p747
$$ 694796 707462 697548 697425 705320 708729 710751 699882 692254 705678 717819 732750 722984 715237
14681G15237M398J5544J1452K476r653j7161o318J8454j0072j0030q494j1147
$$ 715237 719635 735179 746631 749107 739454 722293 715975 734429 724357 714327 705833 694686
14669F94686K1218K9744Q484q16j457N145J0772K436j228k2576Q915J1025p688
$$ 694686 715904 745648 754132 753316 751859 757004 767776 770212 768984 746408 755323 766348 758660
14656G58660n226P786q917k773J5789p796k707K5318q146l550p700J7595Q910
$$ 758660 753434 761220 752303 749530 765319 757523 754816 780134 771988 768438 760738 778333 787243
14643G87243p243P115m403j0550J6476P042n488K0456J0782J0757p267j9213M993
$$ 787243 780000 787115 782712 772162 788638 795680 790192 810648 821430 832187 824920 805707 810700
14630H10700J4618K288O519l442j0355q30k112j538K968q609P583p782j592J2735
$$ 810700 825318 827606 834125 830683 820328 819498 817386 815848 818816 810207 817790 810008 808416 821151
14616H21151j1708J3894J8653j320J985J552j054j810J4234K336K797P823j3242
$$ 821151 809443 823337 841990 840670 842655 844207 843153 841343 855577 857913 860710 868533 855291
14603H55291Q437L051j4732j954J1231J6785l23J0693j876j8234j8396K206P018
$$ 855291 863728 866779 852047 850093 861324 878109 877786 888479 886603 868369 849973 852179 859197
14590H59197J0788J7063K92n206L876J0359m699N314J1502n716l217p689k3086
$$ 859197 869985 887048 887340 882134 886010 896369 891670 896984 908486 902770 899553 891864 868778
14577H68778P262Q568L1079R753j8305J0657R765K8884P710j0990j2612q818k380
$$ 868778 876040 884608 915687 925440 907135 917792 927557 956441 964151 953161 940549 931731 929351
14564I29351j2689m633P723J8543J9645J0310q044j1892o083K0252k0218J3358
$$ 929351 916662 912029 919752 938295 957940 968250 960206 948314 942231 962483 942265 955623
14552I55623J3195j8313j7423J6868J4285N28Lm644q617J8147J4033k580K587
$$ 955623 968818 950505 933082 949950 964235 964763 964766 960122 951505 969652 983685 981105 983692
14539I83692n720L227O398M656o57m274K1596J7903O260L70j6462L046K978m027
$$ 983692 977972 981199 987597 992253 991596 987322 1008918 1026821 1033081 1033451 1016989 1020035 1023013 1018986
14525A018986l077j7523R247J2762M964k274J8658n562k1152p804J0235q948J644
$$ 1018986 1015909 998386 1007633 1020395 1025359 1023085 1041743 1036181 1015029 1007225 1017460 1008512 1010156
14512A010156m980O099K062J5245N637J6851O850r620p105J1624o513J0906K1312
$$ 1010156 1005176 1011275 1013337 1028582 1034219 1051070 1057920 1048300 1041195 1052819 1046306 1057212 1078524
14499A078524R56k2565N19J3969j2889k144J7755J1344n102j2918J6224m071j8079
$$ 1078524 1079480 1056915 1057434 1071403 1058514 1056370 1074125 1085469 1080367 1067449 1083673 1079602 1061523
14486A061523j729J3306j074r227j1073P47K2259R735M771N026j5491Q076M999
$$ 1061523 1059794 1073100 1072026 1062799 1051726 1052473 1074732 1084467 1089238 1094264 1078773 1086849 1091848
14473A091848K1081J4063j2120L928L665k5032o311J6714K5849J5292Q719j9115
$$ 1091848 1112929 1126992 1114872 1118800 1122465 1097433 1091122 1107836 1133685 1148977 1157696 1138581
14461A138581j8673J4152k843J085J1060p61J5526n812j0087q189j1007R903J2279
$$ 1138581 1119908 1134060 1131217 1132302 1143362 1142601 1158127 1152315 1142228 1134039 1123032 1132935 1145214
14448A145214K1845J0050k1569J758M966N677J4734O646o73N060O252m733J5413
$$ 1145214 1167059 1177109 1155540 1157298 1162264 1167941 1182675 1189321 1188648 1193708 1199960 1195227 1210640
14435A210640J8705m212J191O050J398q572J3480K6008m716m761j5163j940M231
$$ 1210640 1229345 1225133 1226324 1232374 1233772 1225200 1238680 1264688 1259972 1255211 1240048 1238108 1242339
14422A242339L2292J7933j1940n091k0351n3454n520L764r960j0473j0991K5354
$$ 1242339 1274631 1292564 1280624 1275533 1255182 1201728 1196208 1199972 1190012 1179539 1168548 1193902
14410A193902J9283J97L559n628N467q652P060K746k221J1847J2117m264o772
$$ 1193902 1213185 1213382 1216941 1211313 1216780 1208128 1215188 1217934 1215713 1227560 1239677 1235413 1228641
14397A228641J4557J7400q925j5487R957J9206r76o77J1768O878m261l943p836
$$ 1228641 1243198 1260598 1251673 1236186 1246143 1265349 1264373 1263696 1275464 1282342 1278081 1274138 1266302
14384A266302O245M31j2169r294l77Q242p912K6545p69o195N215l408j821P645
$$ 1266302 1272547 1272978 1260809 1251515 1251138 1259380 1251468 1278013 1277244 1271049 1276264 1272856 1271035 1278680
14370A278680K7439K1412l91j3997K30K778o064M915J802R254m48q631J4947j180
$$ 1278680 1306119 1327531 1327140 1313143 1313373 1316151 1310087 1315002 1316804 1326058 1325610 1316979 1331926 1330746
14356A330746j4086J1760K1282K0681J3281j0062O785J5260L289k9702j3325R217
$$ 1330746 1316660 1328420 1349702 1370383 1383664 1373602 1380387 1395647 1398936 1369234 1355909 1365126
14344A365126J2026K4577J2130L528p059m388m825p211m187j0545O369q373o973
$$ 1365126 1377152 1401729 1413859 1417387 1410328 1405940 1401115 1393904 1389717 1379172 1385541 1377168 1370195
14331A370195L298L626o56n6L1176P805j8537R90N492j0484L240K3693J7669N116
$$ 1370195 1373493 1377119 1376463 1376407 1407583 1415388 1396851 1397841 1403333 1392849 1396089 1419782 1437451 1442567
14317A442567K729P048N490j0321L614K643M592J821j3465J290R264m058P288
$$ 1442567 1445296 1452344 1457834 1447513 1451127 1453770 1458362 1460183 1446718 1448008 1457272 1453214 1460502
14304A460502O778R86n577K715J6094O480L170J1755J8593M140J9073J7364K204
$$ 1460502 1467280 1468266 1462689 1465404 1481498 1487978 1491148 1502903 1521496 1525636 1544709 1562073 1564277
14291A564277j4923j973o128k23j9638k4153O501K4692J6109P014o049J879J5352
$$ 1564277 1549354 1547381 1541253 1541030 1521392 1497239 1503740 1528432 1544541 1551555 1545506 1547385 1562737
14278A562737M440j3916L244N599J847N20M970j2983j3391P451J2201L440K187
$$ 1562737 1567177 1553261 1556505 1562104 1563951 1564471 1569441 1556458 1543067 1550518 1562719 1566159 1568346
14265A568346q47J5223J1970k204o408J5393J7126K161K490n543m718J1475Q217
$$ 1568346 1567499 1582722 1594692 1592488 1586080 1601473 1618599 1620760 1623250 1617707 1612989 1624464 1632681
14252A632681l344Q174j3233j859P270q725j7934q210J0140J7399K3995K8519
$$ 1632681 1629337 1637511 1624278 1622419 1629689 1620964 1603030 1594820 1604960 1622359 1646354 1674873
14240A674873J155k397m447q870j1661J2833l032L32l640n496J8J8983K3522k5610
$$ 1674873 1676028 1673631 1669184 1660314 1648653 1661486 1658454 1658786 1655146 1649650 1649668 1668651 1692173 1666563
14226A666563k2139K2490L6817K4938j706n738J997K70p580j0320J4340J5452
$$ 1666563 1644424 1666914 1703731 1728669 1726963 1721225 1723222 1723492 1715912 1705592 1719932 1735384
14214A735384n201L222K6829o363k836q377l3j864r765k726j3003n55J6578J6566
$$ 1735384 1730183 1733405 1760234 1753871 1751035 1742658 1742625 1740761 1730996 1728270 1715267 1714712 1731290 1747856
14200A747856K4969K0160J4233K5863J4468q721l2578j4200K8730K6838r191j0595
$$ 1747856 1772825 1792985 1807218 1833081 1847549 1838828 1806250 1792050 1820780 1847618 1838427 1827832
14188A827832k738K589q552m524P043q336p500P45P090K5120P589J9253o391j7014
$$ 1827832 1825094 1827683 1819131 1814607 1821650 1813314 1805814 1806559 1813649 1838769 1846358 1865611 1859220 1842206
14174A842206K574K1445K083N752L000P952J8680J0613K072K343J4387j662J0665
$$ 1842206 1844780 1866225 1868308 1874060 1877060 1885012 1903692 1914305 1916377 1918720 1933107 1931445 1942110
14161A942110r73P599n864j2474J9157J7048K822J6935J1623N140j83M39R814
$$ 1942110 1941137 1948736 1942872 1930398 1949555 1966603 1969425 1986360 1997983 2003123 2002940 2003379 2013193
14148B013193K4173m041o631Q28j692M08J056N106P564l6530j3249j2193j2969
$$ 2013193 2037366 2033325 2026694 2027522 2025830 2026238 2027294 2032400 2039964 2003434 1990185 1977992 1965023
14135A965023r157K0491j520L866J3672o09J494M802L183J0117M477J3952L437
$$ 1965023 1955866 1976357 1974837 1978703 1992375 1991766 1993260 1998062 2001245 2011362 2015839 2029791 2033228
14122B033228P551J5721J0790J3819K8298J6204J3306k736r846M169R915J5505
$$ 2033228 2040779 2056500 2067290 2081109 2109407 2125611 2138917 2136181 2126335 2130504 2140419 2155924
14110B155924J2107j0116J8566J7033J0068J8289R07J0405J3940K8179L8700K8372
$$ 2155924 2168031 2157915 2176481 2193514 2203582 2221871 2222778 2233183 2247123 2275302 2314002 2342374
14098B342374J1786j96o6331j02758q6899p3171k5895N203K2700O680L4492J3240
$$ 2342374 2354160 2353964 2287633 2184875 2097976 2024805 1998910 2004113 2026813 2033493 2067985 2081225
14086B081225K5165J4691m36J2339Q647O199j6400Q229k389J3393K2919N423O00
$$ 2081225 2106390 2121081 2120645 2132984 2141631 2147830 2131430 2139659 2137270 2150663 2173582 2179005 2179605
14073B179605K204K5661K6872N814j0125q43J2221K1450K1166J7348n54O153K0062
$$ 2179605 2181809 2207470 2234342 2240156 2230031 2229188 2241409 2262859 2284025 2301373 2300819 2306972 2327034
14060B327034K5358L0055K1872L2588O391K0739L2888N0804q040o7135j12264
$$ 2327034 2352392 2382447 2404319 2436907 2443298 2464037 2496925 2547729 2539689 2472554 2360290
14049B360290j09899p3965m0978m244P154J8534K1443L3961K1356K1102J7374
$$ 2360290 2250391 2176426 2135448 2131204 2138358 2156892 2178335 2212296 2233652 2254754 2272128
14038B272128K7152J2780O766J0382J0035j1916k9019j3342K3344K9743J0659
$$ 2272128 2299280 2312060 2318826 2329208 2339243 2327327 2298308 2284966 2308310 2338053 2348712
14027B348712K82K9261K9420R128O777K107J8056K5198J1295P367K429O961p153
$$ 2348712 2348994 2378255 2407675 2416803 2423580 2425687 2443743 2468941 2480236 2487603 2490032 2496993 2489840
14014B489840N697K9292M0604K8630K107Q59K984O191j4018m7081k4145j2903
$$ 2489840 2495537 2524829 2565433 2594063 2596170 2597029 2600013 2606204 2592186 2545105 2520960 2508057
14002B508057J242L800j9049Q687L4238J3040q069L29J3812J3137K9112K616J4815
$$ 2508057 2509299 2513099 2494050 2502737 2536975 2550015 2541946 2542275 2556087 2569224 2598336 2600952 2615767
13989B615767J5542J1545N446J7800l566r167Q640J028N180L918J4907J4388L1711
$$ 2615767 2631309 2642854 2648300 2666100 2662534 2653367 2662007 2663035 2668215 2672133 2687040 2701428 2733139
13976B733139J4607R453n589J5739K029M959j4864J8215J8426K0340J8248j794
$$ 2733139 2747746 2757199 2751610 2767349 2769378 2774337 2759473 2777688 2796114 2816454 2834702 2832908
13964B832908j471M18O477q017j1338J3535J8622J8557J3564J4967O910J9101
$$ 2832908 2831437 2831855 2838332 2830315 2818977 2832512 2851134 2869691 2883255 2898222 2905132 2924233
13952B924233J8034n615l1363r934J5358K2111K2419n306O591J8118J2518J5618
$$ 2924233 2942267 2936652 2905289 2895355 2910713 2932824 2955243 2949937 2956528 2974646 2987164 3002782
13940C002782J0689P733J4462K059J0378K6370J495j1223K491J4827N697J3592
$$ 3002782 3013471 3021204 3035666 3037725 3048103 3074473 3075968 3064745 3067236 3082063 3087760 3101352
13928C101352J7632R758K211O074M806J3872L2661K6095Q852q83o311j780K2025
$$ 3101352 3118984 3128742 3130953 3137027 3141833 3155705 3188366 3214461 3223313 3222430 3216119 3214339 3236364
13915C236364k774Q645J0524P33J4463L103J7081R191K4842J7463R861M621K919
$$ 3236364 3233590 3242235 3252759 3253492 3267955 3271058 3288139 3297330 3322172 3339635 3349496 3354117 3357036
13902C357036Q315J2946j231J9602M2473K3146K2593P429j822K4419J0945j2286
$$ 3357036 3365351 3378297 3377066 3396668 3439141 3462287 3484880 3492309 3490487 3514906 3525851 3513565
13890C513565J5309J8556N958R096P477L537l724Q581J8770N639J0474J9512L1387
$$ 3513565 3528874 3547430 3553388 3562484 3569961 3573498 3569774 3578355 3597125 3602764 3613238 3632750 3664137
13877C664137N120P11K3778R657R451K7659K0518J1385n762N449P832M56J0393
$$ 3664137 3669257 3669968 3693746 3703403 3712854 3740513 3761031 3772416 3766654 3772103 3779935 3780391 3790784
13864C790784K7039L387J6013J7396J2986J2439J5101L1981J5461j0246l007K4679
$$ 3790784 3817823 3821210 3837223 3854619 3867605 3880044 3895145 3927126 3942587 3932341 3929334 3954013
13852C954013L2847M7088J4615J4783K6226J0271J3044j549P725K2000L8324K5308
$$ 3954013 3986860 4033948 4048563 4063346 4089572 4099843 4112887 4111338 4119063 4141063 4179387 4204695
13840D204695j714J3463J5284R659K4046K8801L3623J0029K6194R910J353J8955
$$ 4204695 4202981 4216444 4231728 4241387 4265433 4294234 4327857 4337886 4364080 4373990 4375343 4394298
13828D394298L5167J6916m325Q384J1755P866N116K7042L3377J4545J3008K2467
$$ 4394298 4429465 4446381 4442056 4450440 4462195 4470061 4475177 4502219 4535596 4550141 4563149 4585616
13816D585616K0733k649J5518K9505J8480K3868M4002K8376K3643J5610J1722
$$ 4585616 4606349 4603700 4619218 4648723 4667203 4691071 4735073 4763449 4787092 4802702 4814424
13805D814424K6117K9258L0127L1241J7527L2739L1002K6120K2719K5946K6436
$$ 4814424 4840541 4869799 4899926 4931167 4948694 4981433 5012435 5038555 5061274 5087220 5113656
13794E113656K0726K1667K0348K7112L0448L4765M4562L9361M1297M2312J7507
$$ 5113656 5134382 5156049 5176397 5203509 5233957 5268722 5313284 5352645 5393942 5436254 5453761
13783E453761J8666K6618K7261M2957N7659M0833L1743N128k548J9923M2166K2582
$$ 5453761 5472427 5499045 5526306 5569263 5626922 5667755 5699498 5704626 5702078 5722001 5764167 5786749
13771E786749K4834M9625L3019K0532L6986N0488K9420J5857L7805J8207L3509
$$ 5786749 5811583 5861208 5894227 5914759 5951745 6002233 6031653 6047510 6085315 6103522 6137031
13760F137031M9550M3144O6823P2038O7431M0920L9214L8977N0878M9498O4159
$$ 6137031 6186581 6229725 6296548 6368586 6436017 6476937 6516151 6555128 6606006 6655504 6719663
13749F719663N5655L4050L8460N1145N5559P1343P7681Q5167O7015N4955O4380
$$ 6719663 6775318 6809368 6847828 6898973 6954532 7025875 7103556 7188723 7255738 7310693 7375073
13738G375073M2236N5967P8059O6895M4299O9449P5684N7515O0206O6558P8104
$$ 7375073 7417309 7473276 7551335 7618230 7662529 7731978 7807662 7865177 7925383 7991941 8070045
13727H070045P0050Q2447Q0445R3691Q9861Q3754O9898P4539R9221J04984R8730
$$ 8070045 8140095 8222542 8302987 8396678 8486539 8570293 8640191 8714730 8813951 8918935 9017665
13716I017665J25091J15410J19818J37143J08530J30872J48825J54387J68844
$$ 9017665 9142756 9258166 9377984 9515127 9623657 9754529 9903354 10057741 10226585
13707A0226585J80741J57557J65646J73418J98129K08013J95380K16892K51525
$$ 10226585 10407326 10564883 10730529 10903947 11102076 11310089 11505469 11722361 11973886
13698A1973886K88196K82389K77825L04129L35794L93533M36461M89159N12696
$$ 11973886 12262082 12544471 12822296 13126425 13462219 13855752 14292213 14781372 15294068
13689A5294068N65884O23780P19052P81169Q94752J072296J276939J487301J488407
$$ 15294068 15859952 16483732 17202784 17983953 18878705 19951001 21227940 22715241 24203648
13680B4203648J000228n00038l208308o024580o486850m269772j934100o65171
$$ 24203648 25203876 24703838 21495530 15470950 8984100 4714328 2780228 2115057
13672B115057J03962N51146P53911Q11172Q02141P47314O71765O36186N73767
$$ 2115057 2219019 2770165 3524076 4335248 5137389 5884703 6556468 7192654 7766421
13663G766421M65512M06863L99685M32593N12046N29734N90725O20022O66586
$$ 7766421 8231933 8638796 9038481 9471074 9983120 10512854 11103579 11723601 12390187
13654A2390187P15291P82506Q13017Q28050Q87472R78556J065278J159239J304968
$$ 12390187 13105478 13887984 14701001 15529051 16416523 17395079 18460357 19619596 20924564
13645B0924564J463771J583589J726319J945047K190122K588805L086699L682916
$$ 20924564 22388335 23971924 25698243 27643290 29833412 32422217 35508916 39191832
13637C9191832M297507M640599L688311l86580q705227j8917381k2736615j5574974
$$ 39191832 43489339 48129938 51818249 51431669 42726442 23809061 1072446 -14502528
13629a4502528o675799k286238L0162J503563K164215K284337K132323J894133
$$ -14502528 -21178327 -23464565 -23434403 -21930840 -19766625 -17482288 -15349965 -13455832
13621a3455832J642620J409696J188261R24577O14125M37999N45432P49071Q76191
$$ -13455832 -11813212 -10403516 -9215255 -8290678 -7676553 -7238554 -6693122 -5944051 -5067860
13612e067860R15113R66651J029674J077863J124991J128712J161589J199902
$$ -5067860 -4152747 -3186096 -2156422 -1078559 46432 1175144 2336733 3536635
13604C536635J231510J282227J371390J473347J605876J752331J904572K078292
$$ 3536635 4768145 6050372 7421762 8895109 10500985 12253316 14157888 16236180
13596A6236180K307985K677401L177349L733466M332563M738032M019237L48890
$$ 16236180 18544165 21221566 24398915 28132381 32464944 37202976 41222213 41571103
13588D1571103p594240j8120042k3404703j7185472p606797k641855j59522J458081
$$ 41571103 33976863 15856821 -7547882 -24733354 -32340151 -34982006 -35141528 -33683447
13580c3683447K192232K349954K192751J943079J635600J413661J170606Q82492
$$ -33683447 -31491215 -29141261 -26948510 -25005431 -23369831 -21956170 -20785564 -19903072
13572a9903072N41428L31484L55787N38809O71378P58037P81370Q04795Q18780
$$ -19903072 -19361644 -19030160 -18674373 -18135564 -17464186 -16706149 -15924779 -15119984 -14301204
13563a4301204Q33801Q07416P86911P95203P76384P61238P38859Q01444Q20441
$$ -14301204 -13467403 -12659987 -11873076 -11077873 -10301489 -9540251 -8801392 -7999948 -7179507
13554g179507Q42006Q87781R18462R75714J092936J250012J424393J595989J664058
$$ -7179507 -6337501 -5449720 -4531258 -3555544 -2462608 -1212596 211797 1807786 3471844
13545C471844J374740J70450k262507n430823p099564n593102k770015j004995
$$ 3471844 4846584 5017034 2754527 -2676296 -9775860 -15368962 -18138977 -19143972
13537a9143972p0716N00379P76606Q60938Q31936P34512O34136N46341M77933
$$ -19143972 -19214688 -18714309 -17937703 -17076765 -16244829 -15510317 -14876181 -14329840 -13851907
13528a3851907L74192K70039J89181J83920K21703K64046L12153L02621L34688
$$ -13851907 -13477715 -13207676 -13018495 -12834575 -12612872 -12348826 -12036673 -11734052 -11399364
13519a1399364L20136K82699K74232K65882K78050K60575K34911K29873K18419
$$ -11399364 -11079228 -10796529 -10522297 -10256415 -9978365 -9717790 -9482879 -9253006 -9034587
13510i034587K26815J98853J54380J68257J89588J96128J74732J43533J50312
$$ -9034587 -8807772 -8608919 -8454539 -8286282 -8096694 -7900566 -7725834 -7582301 -7431989
13501g431989J39418J15905Q4355P3876N4471P6375J12304J25051J40683J34856
$$ -7431989 -7292571 -7176666 -7092311 -7018435 -6963964 -6887589 -6775285 -6650234 -6509551 -6374695
13491f374695J12798J13452J19169P6049P2522P9492R3319Q3874P2326R7251J06965
$$ -6374695 -6261897 -6148445 -6029276 -5953227 -5880705 -5801213 -5707894 -5624020 -5551694 -5454443 -5347478
13480e347478R2577Q7637R5068P3854L8826M7208M5331O5481P9313N5865P5747
$$ -5347478 -5254901 -5167264 -5072196 -4998342 -4959516 -4912308 -4866977 -4801496 -4722183 -4666318 -4590571
13469d590571P0173P6518O2955O5867N0770N6902P0729L6351M9968M4678M3192
$$ -4590571 -4520398 -4443880 -4380925 -4315058 -4264288 -4207386 -4136657 -4100306 -4050338 -4005660 -3962468
13458c962468N6937K9986M8603K5774M936K1417N1153N1088N6600M9887K9500
$$ -3962468 -3905531 -3875545 -3826942 -3801168 -3796232 -3774815 -3723662 -3672574 -3615974 -3566087 -3536587
13447c536587N5264M8716M1492L9995M1573N9817M6307L6278N3403M8348L4890
$$ -3536587 -3481323 -3432607 -3391115 -3351120 -3309547 -3249730 -3203423 -3167145 -3113742 -3065394 -3030504
13436c030504N3931M7563M5127N5545L2848K5964K0174J4284J6411Q880L3154
$$ -3030504 -2976573 -2929010 -2883883 -2828338 -2795490 -2769526 -2749352 -2735068 -2718657 -2709777 -2676623
13425b676623M2732L2173L4268K5712L1003M0832L2441J6526K8464L7448L4714
$$ -2676623 -2633891 -2601718 -2567450 -2541738 -2510735 -2469903 -2437462 -2420936 -2392472 -2355024 -2320310
13414b320310M3592K7844M042J1208K4649K0570J8361P683L6381N3968N1426L1198
$$ -2320310 -2276718 -2248874 -2244832 -2233624 -2208975 -2188405 -2170044 -2162361 -2125980 -2072012 -2020586 -1989388
13402a989388j5844K0248O0135M2038J7945L009K4257L7353L8521N1805J6058
$$ -1989388 -2005232 -1984984 -1924849 -1882811 -1864866 -1861857 -1837600 -1800247 -1761726 -1709921 -1693863
13391a693863K9261K5611J5557M1381M3080L9830J2301J8568J1551l942L8503
$$ -1693863 -1664602 -1638991 -1623434 -1582053 -1538973 -1499143 -1486842 -1468274 -1456723 -1460665 -1422162
13380a422162J5294K1784K2935L2020Q995J8666M0265K0088L7067K9756R450J6780
$$ -1422162 -1406868 -1385084 -1362149 -1330129 -1321134 -1302468 -1262203 -1242115 -1205048 -1175292 -1165842 -1149062
13368a149062J7977J3296K7408J5749J4471K4142J7160P966O986M0559N1513K5703
$$ -1149062 -1131085 -1117789 -1090381 -1074632 -1060161 -1036019 -1018859 -1010893 -1003907 -963348 -911835 -886132
13356h86132K1627J7413J7229R008K9139J6429K4665L1447M2284N6393K9801K1023
$$ -886132 -864505 -847092 -829863 -820855 -791716 -775287 -750622 -719175 -676891 -620498 -590697 -569674
13344e69674L1733Q026K3076L2138K3738L1429N5692L6958M0165L8502N6352N9994
$$ -569674 -537941 -529915 -506839 -474701 -450963 -419534 -363842 -326884 -286719 -248217 -191865 -131871
13332a31871N2849O3472O4880K1973k3374q2409j38188j24134k6201K6349M1371
$$ -131871 -79022 -15550 49330 71303 47929 -34480 -172668 -296802 -323003 -296654 -255283
13321b55283J4200M652L4355M3219N7292O4305P7529O3115O0006O5638P4979Q6521
$$ -255283 -241083 -236431 -202076 -158857 -101565 -37260 40269 103384 163390 229028 304007 390528
13309C90528J09925J40458J34362J16756l9348k81737m58938m22746k11583n0105
$$ 390528 500453 640911 775273 892029 852681 570944 112006 -310740 -522323 -572428
13299e72428K2997P1241J00802R0906J04813J12216R0209p996k15266l27503k13891
$$ -572428 -549431 -478190 -377388 -286482 -181669 -69453 20756 12760 -202506 -530009 -743900
13288g43900o3404j185K6744O6139P8917N7295L9571M2270M5843M0353M9333L3394
$$ -743900 -807304 -808489 -781745 -715606 -636689 -579394 -539823 -497553 -451710 -411357 -362024 -328630
13276c28630Q400R197K8217K3483J4927J0467K8961K8586M9756K6338K7389K5964
$$ -328630 -320230 -311033 -282816 -259333 -244406 -233939 -204978 -176392 -126636 -100298 -72909 -46945
13264d6945M0130M9981L0468K4001K6509M3631J6695J6548J1880O3k884K9059
$$ -46945 -6815 43166 73634 97635 124144 167775 184470 201018 212898 212961 210077 239136
13252B39136L1519M8060K4492L7529J3930N947P47K4255K1436L254P481j228K4446
$$ 239136 270655 318715 343207 380736 394666 400613 401360 425615 447051 450305 457786 456558 481004
13239D81004M1105K3528J5849L0766K2936L584K733J6018M2991M8339L7984J9324
$$ 481004 522109 545637 561486 592252 615188 618772 621505 637523 680514 728853 766837 786161
13227G86161J1943K6151L4386J6274L2352K8324j7265l5944k4516r694Q381K0812
$$ 786161 798104 824255 858641 874915 907267 935591 918326 882382 857866 848172 856553 877365
13215H77365L4523K4042K9204L4127J6745K1617L6176J7316Q408q332q727j7086
$$ 877365 911888 935930 965134 999261 1016006 1037623 1073799 1091115 1099523 1091191 1082464 1065378
13203A065378N710J5981K2420p815k021L2173M4878M1748K4759K0808K9953M9410
$$ 1065378 1071088 1087069 1109489 1101674 1099653 1131826 1176704 1218452 1243211 1264019 1293972 1343382
13191A343382K3805K8700L5890K8658J6291j3411k0364j0457j964j4408J5129
$$ 1343382 1367187 1395887 1431777 1460435 1476726 1463315 1442951 1432494 1430530 1416122 1431251
13180A431251K2722L9711L6809K7300M1208L134J2844M8399L9125K5182J9262
$$ 1431251 1453973 1493684 1530493 1557793 1599001 1602135 1614979 1663378 1702503 1727685 1746947
13169A746947N073M0179L4135L3637M8260L4990L2917P258j5900n7895q8912n8944
$$ 1746947 1752020 1792199 1826334 1859971 1908231 1943221 1976138 1983396 1967496 1909601 1820689 1761745
13157A761745k839J1934J3141K2999N0816M0574L7456M0389M4463M9947N2309
$$ 1761745 1758906 1770840 1783981 1806980 1857796 1898370 1935826 1976215 2020678 2070625 2122934
13146B122934M9143N3407M0011L4494J9522k2569q6364j01985q9827m7744j8165
$$ 2122934 2172077 2225484 2265495 2299989 2319511 2296942 2210578 2108593 2018766 1971022 1952857
13135A952857K4072N4743N1289M2922L5506M9573K0178K1337L0354O3315N5104
$$ 1952857 1976929 2031672 2082961 2125883 2161389 2210962 2231140 2252477 2282831 2346146 2401250
13124B401250M3751M8589M8349M3074J9244L2187M9923L7121O376o6487j08214
$$ 2401250 2445001 2493590 2541939 2585013 2604257 2636444 2686367 2723488 2729864 2663377 2555163
13113B555163j04422k4444L0142L5484k53K0127M4468L7523N2835M8488K8856
$$ 2555163 2450741 2426297 2456439 2491923 2491670 2511797 2556265 2593788 2646623 2695111 2723967
13102B723967N0576O9727O9529N8414L9051J9535k5640p3427q4471p3718l0367
$$ 2723967 2774543 2844270 2913799 2972213 3011264 3030799 3005159 2931732 2847261 2773543 2743176
13091B743176M537M1372L6456K1062L2054L0180N2858O5289M9051M6816J9494
$$ 2743176 2747713 2789085 2825541 2846603 2878657 2908837 2961695 3026984 3076035 3122851 3142345
13080C142345L5792M4264L9160M2735L4287M1848L1975J2827K0488N1871J2821
$$ 3142345 3178137 3222401 3261561 3304296 3338583 3380431 3412406 3425233 3445721 3497592 3510413
13069C510413j7925R716K3315L748L4888N3852L5062L3056L0811N9307O4277N7238
$$ 3510413 3492488 3502204 3525519 3529267 3564155 3618007 3653069 3686125 3716936 3776243 3840520 3897758
13057C897758L7009K9458J6688L9799N3179L7489M651l634j3349l3834k9570J6290
$$ 3897758 3934767 3964225 3980913 4020712 4073891 4111380 4116031 4112397 4099048 4065214 4035644 4051934
13045D051934K8325M2126M5262K2387L0313L7188N8267P3460N9214M0551L9451
$$ 4051934 4080259 4122385 4167647 4190034 4220347 4257535 4315802 4389262 4448476 4489027 4528478
13034D528478L6250L1595N0899N9705L3858L1943M0895L5172M7914L4312K8567
$$ 4528478 4564728 4596323 4647222 4706927 4740785 4772728 4813623 4848795 4896709 4931021 4959588
13023D959588J7050O2187O1404N6604P5198R1394J32918J34317J08811L3783J3908
$$ 4959588 4976638 5038825 5100229 5156833 5232031 5323425 5456343 5590660 5699471 5733254 5747162
13012E747162K0733M3684M2466K4724O6264N3338L3232M0017K7099L4899N1030
$$ 5747162 5767895 5811579 5854045 5878769 5945033 5998371 6031603 6071620 6098719 6133618 6184648
13001F184648O5487N7940O1385P7026P2242M3387K7347J8603N74j6326J3044N2877
$$ 6184648 6250135 6308075 6369460 6446486 6518728 6562115 6589462 6608065 6608639 6592313 6605357 6658234
12989F658234J12977J59959J26972J16532J22971J11734J26615J19031R6887P5772
$$ 6658234 6771211 6931170 7058142 7174674 7297645 7409379 7535994 7655025 7751912 7827684
12979G827684O9707P4633O2474Q0879O7574Q0414Q1344J04994J10535J01018R4612
$$ 7827684 7897391 7972024 8034498 8115377 8182951 8263365 8344709 8449703 8560238 8661256 8755868
12968H755868R6209Q6072J02169J03786J05319R4835Q0666Q2667J03856J16726
$$ 8755868 8852077 8938149 9040318 9144104 9249423 9344258 9424924 9507591 9611447 9728173
12958I728173J30873J25445J10785R8838J20398J30667J24925J16670J33882J28893
$$ 9728173 9859046 9984491 10095276 10194114 10314512 10445179 10570104 10686774 10820656 10949549
12948A0949549J48415J27952J06277J24125J17043J31690J23435J39401J48938
$$ 10949549 11097964 11225916 11332193 11456318 11573361 11705051 11828486 11967887 12116825
12939A2116825J64460K01507K38344K19625K13978J90038J79567J95710K12078
$$ 12116825 12281285 12482792 12721136 12940761 13154739 13344777 13524344 13720054 13932132
12930A3932132K19454J95361K25664K16306K00993K36629K47923K87853L11243
$$ 13932132 14151586 14346947 14572611 14788917 14989910 15226539 15474462 15762315 16073558
12921A6073558L26886L32145L23348L20617L27669L28058L31017L51161L73696
$$ 16073558 16400444 16732589 17055937 17376554 17704223 18032281 18363298 18714459 19088155
12912A9088155L96020M14655M40008M52907M72296M78912M74158N09348N04740
$$ 19088155 19484175 19898830 20338838 20791745 21264041 21742953 22217111 22726459 23231199
12903B3231199N15374N78279O16585O50534O67729O90334P33824P73693Q32817
$$ 23231199 23746573 24324852 24941437 25591971 26259700 26950034 27683858 28457551 29290368
12894B9290368Q88537R62721J021026J089510J178684J286607J350542J393046
$$ 29290368 30178905 31141626 32162652 33252162 34430846 35717453 37067995 38461041
12886C8461041J438181J532554J702124J903748K137085K347692K543543K762879
$$ 38461041 39899222 41431776 43133900 45037648 47174733 49522425 52065968 54828847
12878E4828847L092387L496480L967978M518364N183983N987265O963144Q111699
$$ 54828847 57921234 61417714 65385692 69904056 75088039 81075304 88038448 96150147
12870I6150147R373110J0907532J2878436J5596799J9098380K1987279J8288681
$$ 96150147 105523257 116430789 129309225 144906024 164004404 185991683 204280364
12863B04280364k269438m5199260r4387855j03750803o3062194k3647935o846508
$$ 204280364 202010926 156811666 62423811 -41326992 -104389186 -128037121 -134883629
12856a34883629J830730O987547Q636027Q668613Q256225P547801O574055N517025
$$ -134883629 -133052899 -126065352 -117429325 -108760712 -100504487 -92956686 -86382631 -80865606
12848h0865606M260092K763826J409010Q87028J278426J824283K144535K272536
$$ -80865606 -76605514 -73841688 -72432678 -71545650 -70267224 -68442941 -66298406 -64025870
12840f4025870K279909K256611K222880K178945K107310J967700J821935J688007
$$ -64025870 -61745961 -59489350 -57266470 -55087525 -52980215 -51012515 -49190580 -47502573
12832d7502573J578806J488787J413431J349261J262879J207487J137257J091827
$$ -47502573 -45923767 -44434980 -43021549 -41672288 -40409409 -39201922 -38064665 -36972838
12824c6972838J009573R71458R26396R04722Q67047Q36933P92754P33863P06440
$$ -36972838 -35963265 -34991807 -34065411 -33160689 -32293642 -31456709 -30663955 -29930092 -29223652
12815b9223652O89958O53523O02253N72287N57167N47272N50428N13071N27339
$$ -29223652 -28533694 -27880171 -27277918 -26705631 -26148464 -25601192 -25050764 -24537693 -24010354
12806b4010354N11852M65872M32590L90240L47569L36129L30720L47472L34601
$$ -24010354 -23498502 -23032630 -22600040 -22209800 -21862231 -21526102 -21195382 -20847910 -20513309
12797b0513309L33548L33076L36711L18413K89937K68206K65066K87288L04466
$$ -20513309 -20179761 -19846685 -19509974 -19191561 -18901624 -18633418 -18368352 -18081064 -17776598
12788a7776598K78453K79020K48910J94739J69944J73160K16836K12770J96557
$$ -17776598 -17498145 -17219125 -16970215 -16775476 -16605532 -16432372 -16215536 -16002766 -15806209
12779a5806209J91276K06943K32686K05934K20435J94766J59238J47632J56220
$$ -15806209 -15614933 -15407990 -15175304 -14969370 -14748935 -14554169 -14394931 -14247299 -14091079
12770a4091079J72733J39639J34348J45381J24051J22287J29258J32146J41793
$$ -14091079 -13918346 -13778707 -13644359 -13498978 -13374927 -13252640 -13123382 -12991236 -12849443
12761a2849443J41274J40000J26112J39990J16029J06626J21707J13155J10716
$$ -12849443 -12708169 -12568169 -12442057 -12302067 -12186038 -12079412 -11957705 -11844550 -11733834
12752a1733834J03176J16333R7278Q2261Q2053J01323Q9214Q4518J05908J30825
$$ -11733834 -11630658 -11514325 -11417047 -11334786 -11252733 -11151410 -11062196 -10977678 -10871770 -10740945
12742a0740945J10211Q4667Q4941J23315R2667K8672L6607R6110J35833M3951
$$ -10740945 -10630734 -10546067 -10461126 -10337811 -10245144 -10216472 -10179865 -10083755 -9947922 -9903971
12732i903971l3836n6163j4331J7672Q0214R1271R1772P3253Q3302Q9539M9196
$$ -9903971 -9937807 -9993970 -10008301 -9990629 -9910415 -9819144 -9727372 -9654119 -9570817 -9481278 -9432082
12721i432082M4602O8495M9061M4221P9135Q0897O0487P0977Q6371Q5027P5875
$$ -9432082 -9387480 -9318985 -9269924 -9225703 -9146568 -9065671 -9005184 -8934207 -8847836 -8762809 -8686934
12710h686934Q3122R2739P7277Q5454O7217j1168n2288j8447m910K2832L0344
$$ -8686934 -8603812 -8511073 -8433796 -8348342 -8281125 -8292293 -8344581 -8363028 -8367938 -8345106 -8314762
12699h314762M6307N3898N5124L6507M7201K5679L5146K1066K7433O0845N1462
$$ -8314762 -8268455 -8214557 -8159433 -8122926 -8075725 -8050046 -8014900 -7993834 -7966401 -7905556 -7854094
12688g854094M3488L9651L1041M727J4809L1834J9881L2796M9583P1491L7948
$$ -7854094 -7810606 -7770955 -7739914 -7735187 -7720378 -7688544 -7668663 -7635867 -7586284 -7514793 -7476845
12677g476845J5237J8702M2877P0614Q7196O9082M7788K4060L8985O2544O5452
$$ -7476845 -7461608 -7442906 -7400029 -7329415 -7242219 -7173137 -7125349 -7101289 -7062304 -6999760 -6934308
12666f934308L9667L4546K7751K6197K4952M2741L3803K8503M2450M8602M0954
$$ -6934308 -6894641 -6860095 -6832344 -6806147 -6781195 -6738454 -6704651 -6676148 -6633698 -6585096 -6544142
12655f544142K4217J9351J4465J9434K2685L2641K8815J4515L0466M3962M8958
$$ -6544142 -6519925 -6500574 -6486109 -6466675 -6443990 -6411349 -6382534 -6368019 -6337553 -6293591 -6244633
12644f244633K2734J6091j6339Q940K2730K8955L0394K3499J4886L3717L4123
$$ -6244633 -6221899 -6205808 -6222147 -6213207 -6190477 -6161522 -6131128 -6107629 -6092743 -6059026 -6024903
12633f024903N0172M1945L3026J0650M339J1583K0137P003K8316M7132K5857K3233
$$ -6024903 -5974731 -5932786 -5899760 -5889110 -5884771 -5873188 -5853051 -5846048 -5817732 -5770600 -5744743 -5721510
12621e721510M3306J0223J2623L9543J9677P634K2628K4535K3377K6952L0106
$$ -5721510 -5678204 -5667981 -5655358 -5615815 -5596138 -5588504 -5565876 -5541341 -5517964 -5491012 -5460906
12610e460906J5631J8993L3633K3702P036J2950P003n493q303J6681K4537J3983
$$ -5460906 -5445275 -5426282 -5392649 -5368947 -5361911 -5348961 -5341958 -5347451 -5355754 -5339073 -5314536 -5300553
12598e300553R469J7677R025L2631J5235L2754L9268J8075J0519J0351K5467J5829
$$ -5300553 -5291084 -5273407 -5264382 -5231751 -5216516 -5183762 -5144494 -5126419 -5115900 -5105549 -5080082 -5064253
12586e064253J2960K5450J2144L949P106K2235K8817K5388J3400J5448L7522K989
$$ -5064253 -5051293 -5025843 -5013699 -5009750 -5002644 -4980409 -4951592 -4926204 -4912804 -4897356 -4859834 -4856845
12574d856845Q012N184r900N320L2045K6971m326n448L4934J3458L614J4399J5053
$$ -4856845 -4848833 -4843649 -4853549 -4848229 -4816184 -4789213 -4793539 -4798987 -4764053 -4750595 -4746981 -4732582 -4717529
12561d717529J3839L1057K6831n582J6339J1440M140J4166J4269J9469J9435L3531
$$ -4717529 -4703690 -4672633 -4645802 -4651384 -4635045 -4623605 -4619465 -4605299 -4591030 -4571561 -4552126 -4518595
12549d518595K4324J1654n271Q005j1427Q683L059L1817J7093K5841J5313l668
$$ -4518595 -4494271 -4482617 -4487888 -4479883 -4491310 -4482627 -4479568 -4447751 -4430658 -4404817 -4389504 -4393172
12537d393172J5537K6014J5622L1510K762L508L0164K239K5667K324J6228J6439
$$ -4393172 -4377635 -4351621 -4335999 -4304489 -4301727 -4298219 -4268055 -4265816 -4240149 -4237825 -4221597 -4205158
12525d205158J2402Q872J5331J1712J1871R956J2692n90n55Q068j4662L309J1020
$$ -4205158 -4192756 -4183884 -4168553 -4156841 -4144970 -4135014 -4122322 -4122912 -4123467 -4115399 -4130061 -4126752 -4115732
12512d115732K4565L9968K5595Q837J2586j06O510Q349J6961k570P854J0009K0886
$$ -4115732 -4091167 -4051199 -4025604 -4016767 -4004181 -4004287 -3997777 -3989428 -3972467 -3975037 -3967183 -3957174 -3936288
12499c936288J3957M2614J7549j6261r639L6041J4669M916J8441J8382k168P47
$$ -3936288 -3922331 -3879717 -3862168 -3878429 -3888068 -3852027 -3837358 -3832442 -3814001 -3795619 -3797787 -3797040
12487c797040j783K015J3390J608J4361n949k039R829J5990L9956L3342Q256k033
$$ -3797040 -3798823 -3796808 -3783418 -3781810 -3767449 -3773398 -3775437 -3765608 -3749618 -3709662 -3676320 -3668064 -3670097
12474c670097J4540n77J8256J5037J3676J6890K0494Q258R998J9872J7829n117
$$ -3670097 -3655557 -3656134 -3637878 -3622841 -3609165 -3592275 -3571781 -3563523 -3553525 -3533653 -3515824 -3520941
12462c520941k649K064j2812J1382O714L2092L7321K0020R246j4965K2342O983
$$ -3520941 -3523590 -3521526 -3534338 -3522956 -3516242 -3484150 -3446829 -3426809 -3417563 -3432528 -3410186 -3403203
12450c403203j11J4762L548j4687j0716L3290K4550K0944K1682J484J183K534
$$ -3403203 -3403314 -3388552 -3385004 -3399691 -3410407 -3377117 -3352567 -3331623 -3309941 -3308457 -3307274 -3304740
12438c304740K9955K7552J0057P09J6599M3001K1743P866K0338L8022K5883K3302
$$ -3304740 -3274785 -3247233 -3237176 -3236467 -3219868 -3176867 -3155124 -3147258 -3126920 -3088898 -3063015 -3039713
12426c039713J6722L1250M4209M5149N0387M9323P0403P6079R6524J06164J12098
$$ -3039713 -3022991 -2991741 -2947532 -2902383 -2851996 -2802673 -2732270 -2656191 -2559667 -2453503 -2341405
12415b341405Q2281M768j94335m45720n14019l29976j52064n7688N491O2507O4547
$$ -2341405 -2259124 -2254356 -2448691 -2894411 -3408430 -3738406 -3890470 -3948158 -3942667 -3880160 -3815613
12404c815613N0453K9758L7128L1456O1422M0845J340r05J8970L075Q364R470
$$ -3815613 -3765160 -3735402 -3698274 -3666818 -3605396 -3564551 -3563211 -3564116 -3545146 -3542071 -3533707 -3524237
12392c524237J7263J8056J1801K1047J1983L140L0492N5969p30J1643K7988K0286
$$ -3524237 -3506974 -3488918 -3477117 -3456070 -3444087 -3440947 -3410455 -3354486 -3355216 -3343573 -3315585 -3295299
12380c295299j467l292L4908J3507M462J6592K356J3072Q457r317P157J5643J7286
$$ -3295299 -3296766 -3300058 -3265150 -3251643 -3247181 -3230589 -3228233 -3215161 -3206704 -3216021 -3208864 -3193221 -3175935
12367c175935l136r863K610J7107K2587K9286Q781K261J6891L886Q263O027M829
$$ -3175935 -3179071 -3188934 -3186324 -3169217 -3146630 -3117344 -3108563 -3106302 -3089411 -3085525 -3077262 -3071235 -3066406
12354c066406J4936Q867O78Q780o223p88m79N788J8684R089J0448l870J089J0368
$$ -3066406 -3051470 -3042603 -3041925 -3033145 -3039368 -3040156 -3040635 -3034847 -3016163 -3007074 -2996626 -3000496 -2999407 -2989039
12340b989039Q817R257j7988J795L862K3931K7926j0369k938J9170J8165q503
$$ -2989039 -2980222 -2970965 -2988953 -2987158 -2983296 -2959365 -2931439 -2941808 -2944746 -2925576 -2907411 -2915914
12328b915914k1323k689J0149K8407k236J8136J9146j5573R81J6810J7655Q517
$$ -2915914 -2937237 -2939926 -2929777 -2901370 -2903606 -2885470 -2866324 -2881897 -2880916 -2864106 -2846451 -2837934
12316b837934p159j1829k456N036J5769M4533R856L125j2415j3734K469q551p458
$$ -2837934 -2845093 -2856922 -2859378 -2854342 -2838573 -2794040 -2784184 -2781059 -2793474 -2807208 -2804739 -2813290 -2820748
12303b820748L0257J0707O582Q983J5534K2941j3328J037n733N501O555J972l476
$$ -2820748 -2790491 -2779784 -2773202 -2764219 -2748685 -2725744 -2739072 -2738035 -2743768 -2738267 -2731712 -2729740 -2733216
12290b733216J0486K3106K5320j4341j9042j323J4237J3491L0749J6054j5947
$$ -2733216 -2722730 -2699624 -2674304 -2688645 -2707687 -2709010 -2694773 -2681282 -2650533 -2634479 -2650426
12279b650426j6238K427J3619L579N889J1056J2770J1788J532r2j3886j14J5895
$$ -2650426 -2666664 -2664237 -2650618 -2647039 -2641150 -2630094 -2617324 -2605536 -2604004 -2604096 -2617982 -2618096 -2602201
12266b602201Q396l950N402j0220J8016J0742K275K394K297j966J4839n268J237
$$ -2602201 -2593805 -2597755 -2592353 -2602573 -2584557 -2573815 -2571540 -2569146 -2566849 -2568815 -2553976 -2559244 -2558007
12253b558007J4987j2765o46K981P892J0976R584k357l605j874Q468J7909J4048
$$ -2558007 -2543020 -2555785 -2556431 -2553450 -2545558 -2534582 -2524998 -2527355 -2530960 -2532834 -2524366 -2506457 -2492409
12240b492409N540j4813Q71J0890K0865m241n963l181j5708P004J0159J8228K1837
$$ -2492409 -2486869 -2501682 -2500811 -2489921 -2469056 -2473297 -2479260 -2482441 -2498149 -2491145 -2480986 -2462758 -2440921
12227b440921m998L074J1185k997O066L393j5419j8852O399K6503p756o486J728
$$ -2440921 -2445919 -2442845 -2431660 -2434657 -2428591 -2425198 -2440617 -2459469 -2453070 -2426567 -2434323 -2440809 -2439081
12214b439081R180K9340o49J705K223J791J2360K0703k86J093J3456j0368j256
$$ -2439081 -2429901 -2400561 -2401210 -2399505 -2397282 -2395491 -2383131 -2362428 -2362714 -2361621 -2348165 -2358533 -2359789
12201b359789L220j834J0283J5906J2959N970J574J6251j791J8634j5979k0036
$$ -2359789 -2356569 -2358403 -2348120 -2332214 -2319255 -2313285 -2311711 -2295460 -2297251 -2278617 -2294596 -2314632
12189b314632j0170J4094j0342K0563J6515K95j6583k596J3164n259J5067Q447
$$ -2314632 -2324802 -2310708 -2321050 -2300487 -2283972 -2283677 -2300260 -2302856 -2289692 -2294951 -2279884 -2271437
12177b271437j868j0915R777J0737j5897J5583J6301P327M288j411j7263K633
$$ -2271437 -2273305 -2284220 -2274443 -2263706 -2279603 -2264020 -2247719 -2240392 -2236104 -2237515 -2254778 -2252145
12165b252145K592j528R831J1089j1587k882p95L428o645J5768J6766R678O523
$$ -2252145 -2249553 -2251081 -2241250 -2230161 -2241748 -2244630 -2245425 -2241997 -2248642 -2232874 -2216108 -2206430 -2199907
12152b199907J0650O654J981j0630j0736J2062K532K2114l839p567k1326N249
$$ -2199907 -2189257 -2182603 -2180622 -2191252 -2201988 -2189926 -2187394 -2165280 -2169119 -2176686 -2198012 -2192763
12140b192763O869J7779J0014J8866J744q254n244j221j2344J1307o26M811j6901
$$ -2192763 -2185894 -2168115 -2158101 -2139235 -2137491 -2145745 -2150989 -2152210 -2164554 -2153247 -2153873 -2149062 -2165963
12127b165963M734L2178K4455j9095M387K948l603j1171q601Q913J3937k854R320
$$ -2165963 -2161229 -2129051 -2104596 -2123691 -2119304 -2116356 -2119959 -2131130 -2139731 -2130818 -2116881 -2119735 -2110415
12114b110415k337l89J4767K712m2J9220J1198M30p074N937N302J2889p422r036
$$ -2110415 -2112752 -2113141 -2098374 -2095662 -2095704 -2076484 -2065286 -2064856 -2071930 -2065993 -2060691 -2047802 -2055224 -2064260
12100b064260j786J0758J4219l231K924O420K783J1965J7150J0403l869q192j0350
$$ -2064260 -2066046 -2055288 -2041069 -2044300 -2041376 -2034956 -2032173 -2020208 -2003058 -1992655 -1996524 -2004716 -2015066
12087b015066P955k074j8684n414M768K8874K2458p005j6567j758R264J8361n783
$$ -2015066 -2007111 -2009185 -2027869 -2033283 -2028515 -1999641 -1977183 -1984188 -2000755 -2002513 -1993249 -1974888 -1980671
12074a980671j2031m452n496l586q715r15J3715M535J6107J4945p514J4236p682
$$ -1980671 -1992702 -1997154 -2002650 -2006236 -2014951 -2015866 -2002151 -1997616 -1981509 -1966564 -1974078 -1959842 -1967524
12061a967524m55N240J1235J2772J7611J883M922P77J9334J3713j0623k6350j8622
$$ -1967524 -1967979 -1962739 -1951504 -1938732 -1921121 -1919238 -1914316 -1913539 -1894205 -1880492 -1891115 -1917465 -1936087
12048a936087K439j775Q041M793k300r0j1486J8812J1627RQ408J3826N158l907
$$ -1936087 -1933648 -1935423 -1927382 -1922589 -1924889 -1924979 -1936465 -1917653 -1906026 -1906017 -1897609 -1883783 -1878625 -1882532
12034a882532n43n516o623j3903q405k288n690k782J8834K9561J7255J0637P18
$$ -1882532 -1883075 -1888591 -1895214 -1909117 -1917522 -1919810 -1925500 -1928282 -1909448 -1879887 -1862632 -1851995 -1851277
12021a851277J11M56O884Q185j3028j2977p70n921Q422R261N354J1814K202m081
$$ -1851277 -1851166 -1850710 -1843826 -1835641 -1848669 -1861646 -1862416 -1868337 -1859915 -1850654 -1845300 -1833486 -1831284 -1835365
12007a835365r437J0815J3478J1153O08K97K694J4727j6874N974J9291j3591j8474
$$ -1835365 -1844802 -1833987 -1820509 -1809356 -1808748 -1808451 -1805757 -1791030 -1807904 -1801930 -1782639 -1796230 -1814704
11994a814704K53N161K4130J2353j139j101o783n235O733K0713J1918j8983j2408
$$ -1814704 -1814451 -1809290 -1785160 -1772807 -1773946 -1775047 -1781830 -1787065 -1780332 -1759619 -1747701 -1766684 -1779092
11981a779092j9572J1384L18R6k110L321K1858M557J0287J8353m312k1931n922
$$ -1779092 -1798664 -1787280 -1786962 -1786866 -1788976 -1785655 -1763797 -1759240 -1748953 -1730600 -1734912 -1756843 -1762765
11968a762765K5692J1887N05L12j7547k391O827l664R750J943J3503R141m956
$$ -1762765 -1737073 -1725186 -1724681 -1724369 -1741916 -1744307 -1737480 -1741144 -1731394 -1729451 -1715948 -1706807 -1711763
11955a711763j2287j0576J2051J9038K3296l857k1759j982R147k029j0493n103
$$ -1711763 -1724050 -1734626 -1722575 -1703537 -1680241 -1684098 -1705857 -1707839 -1698692 -1700721 -1711214 -1716317
11943a716317p093K1461J1035l771k556j861p644k660J5180j3587N911J2058j1213
$$ -1716317 -1723410 -1701949 -1690914 -1694685 -1697241 -1699102 -1706746 -1709406 -1694226 -1707813 -1701902 -1689844 -1701057
11930a701057p752K0061J5590r652J7648N213n857n440J0390Q541M480N8N547
$$ -1701057 -1708809 -1688748 -1673158 -1682810 -1665162 -1659949 -1665806 -1671246 -1660856 -1652315 -1647835 -1647777 -1642230
11917a642230K7198J0970j9863r112n845M003l141o290Q612j7308j5230K1306
$$ -1642230 -1615032 -1604062 -1623925 -1633037 -1638882 -1634879 -1638020 -1644310 -1635698 -1653006 -1668236 -1646930
11905a646930K4124j1656j019K5312K1556p464k0200p649N667O060K040J3790
$$ -1646930 -1622806 -1634462 -1635481 -1610169 -1588613 -1596077 -1616277 -1623926 -1618259 -1612199 -1610159 -1596369
11893a596369j21k835R595R010m449J2386O415L269r680k6279j2062Q636J0156
$$ -1596369 -1596490 -1599325 -1589730 -1580720 -1585169 -1572783 -1566368 -1563099 -1572779 -1599058 -1611120 -1602484 -1592328
11880a592328j050m755J034J7275P153P105M372K714O189J9348P061j9053k4664
$$ -1592328 -1593378 -1598133 -1597099 -1579824 -1572671 -1565566 -1561194 -1558480 -1552291 -1532943 -1525882 -1544935 -1569599
11867a569599j1737J3918J1427J4659J6023n941q033K457o792J6106J193p73Q44
$$ -1569599 -1581336 -1567418 -1555991 -1541332 -1525309 -1531250 -1539283 -1536826 -1543618 -1527512 -1526319 -1527092 -1526248
11854a526248p562Q350J8298J619K268m095l1431j1334r583P512J1736J9325R234
$$ -1526248 -1533810 -1525460 -1507162 -1505543 -1503275 -1507370 -1538801 -1550135 -1559718 -1552206 -1540470 -1521145 -1511911
11841a511911J017K392M25k879p142m852Q755K8290K548l800R130J889r063P623
$$ -1511911 -1510894 -1508502 -1508077 -1510956 -1518098 -1522950 -1514195 -1485905 -1483357 -1487157 -1478027 -1476138 -1485201 -1477578
11827a477578k1639p522K5642J5227j8395k1225o830J1764K1192O400N512M571
$$ -1477578 -1499217 -1506739 -1481097 -1465870 -1484265 -1505490 -1512320 -1500556 -1479364 -1472964 -1467452 -1462881
11815a462881j6420L360K773m332N635j5391j0535J5674o816J674j2689M415l117
$$ -1462881 -1479301 -1475941 -1473168 -1477500 -1471865 -1487256 -1497791 -1482117 -1488933 -1487259 -1499948 -1495533 -1498650
11802a498650J524J8878J4712K390j7474k418J4141J4563j640j5867j0865K0611
$$ -1498650 -1497126 -1478248 -1463536 -1461146 -1478620 -1481038 -1466897 -1452334 -1453974 -1469841 -1480706 -1460095
11790a460095O29K188Q975J3789K5164P215q683n61l617j3734J431J1086m481
$$ -1460095 -1459466 -1457278 -1448303 -1434514 -1409350 -1402135 -1410818 -1411379 -1414996 -1428730 -1427299 -1416213 -1420694
11777a420694j5648R130J102j3804P894J9321J4863J1575J3204K78j4713j9829
$$ -1420694 -1436342 -1427212 -1426110 -1439914 -1432020 -1412699 -1397836 -1386261 -1373057 -1372779 -1387492 -1407321
11765a407321j3402J1990O681j4282j8045J4509Q778J2194m818q895n115J5683
$$ -1407321 -1420723 -1408733 -1402052 -1416334 -1434379 -1419870 -1411092 -1398898 -1403716 -1412611 -1417726 -1402043
11753a402043J660N758J6532K145k427j0515K5602J1040R019J310k64l210Q12
$$ -1402043 -1400383 -1394625 -1378093 -1375948 -1378375 -1388890 -1363288 -1352248 -1343229 -1341919 -1342183 -1345393 -1344581
11740a344581R728k517m811l096p250R019N044O083k6172p280J7376N113l527
$$ -1344581 -1334853 -1337370 -1342181 -1345277 -1352527 -1343508 -1338464 -1332381 -1358553 -1365833 -1348457 -1343344 -1346871
11727a346871O53J0497M252p739l483K4705R088J5043Q518j2746m649j1850J2114
$$ -1346871 -1346218 -1335721 -1331469 -1339208 -1342691 -1317986 -1308898 -1293855 -1285337 -1298083 -1302732 -1314582 -1302468
11714a302468J1717J3879k994J6042L9202o11m0467p530J6943q720L604P669J7218
$$ -1302468 -1290751 -1276872 -1279866 -1263824 -1224622 -1225233 -1265700 -1273230 -1256287 -1265007 -1261403 -1253734 -1236516
11701a236516p657j5180j1402j4744q986J0644J1979L423R672P486p152O416K682
$$ -1236516 -1244173 -1259353 -1270755 -1285499 -1294485 -1283841 -1271862 -1268439 -1258767 -1251281 -1258433 -1252017 -1249335
11688a249335K5949P795n36N491k7803p178m120j1301p236k2828j4516j0746O482
$$ -1249335 -1223386 -1215591 -1216127 -1210636 -1238439 -1245617 -1249737 -1261038 -1268274 -1291102 -1305618 -1316364 -1309882
11675a309882M179j4656P960K0619J4477J675K5155K1241J7072J9159k005l0020
$$ -1309882 -1305703 -1320359 -1312399 -1291780 -1277303 -1275628 -1250473 -1229232 -1212160 -1193001 -1195006 -1225026
11663a225026l6588m9445l5168j9685p700m59K0670J1786M148J5628J2468O670
$$ -1225026 -1261614 -1311059 -1346227 -1365912 -1373612 -1374071 -1353401 -1341615 -1337467 -1321839 -1309371 -1302701
11651a302701j3715p848l084J4378M068q536j2431L837J9121N325j2691k1284
$$ -1302701 -1316416 -1324264 -1327348 -1312970 -1308902 -1317438 -1329869 -1326032 -1306911 -1301586 -1314277 -1335561
11639a335561j790M639j8171l2224J4508L1264R997J2530M409J836R811J0820
$$ -1335561 -1337351 -1332712 -1350883 -1383107 -1368599 -1337335 -1327338 -1314808 -1310399 -1308563 -1298752 -1287932
11627a287932j4345N823l027k282J4564Q234J0987K207p412o761q757l974n57
$$ -1287932 -1302277 -1296454 -1299481 -1301763 -1287199 -1278965 -1267978 -1265771 -1273183 -1279944 -1288701 -1292675 -1293232
11614a293232N499R016k575p826J742N146N457P909K6004m619M066P178l037j4163
$$ -1293232 -1287733 -1278717 -1281292 -1289118 -1287376 -1282230 -1276773 -1268864 -1242860 -1247479 -1243413 -1236235 -1239272 -1253435
11600a253435l105P928Q355M566J6158m286M705N917r168j5520K6618M578j0094
$$ -1253435 -1256540 -1248612 -1240257 -1235691 -1219533 -1223819 -1219114 -1213197 -1222365 -1237885 -1211267 -1206689 -1216783
11587a216783J311R090j9713k4804l595P58R690Q03N484Q574O265P668J1371M619
$$ -1216783 -1215472 -1206382 -1226095 -1250899 -1254494 -1253736 -1244046 -1243243 -1237759 -1229185 -1222920 -1215252 -1203881 -1199262
11573a199262j3656P94j9499k733P766R97O872J3912m481j5971J2467R581M935
$$ -1199262 -1212918 -1212124 -1231623 -1234356 -1226590 -1225593 -1218721 -1204809 -1209290 -1225261 -1212794 -1203213 -1198278
11560a198278K57R364j0160r6L713q877Q008J0243Q935R85M962J7230N380p056
$$ -1198278 -1198021 -1188657 -1198817 -1198913 -1195200 -1204077 -1196069 -1185826 -1176891 -1175906 -1170944 -1153714 -1148334 -1155390
11546a155390n112J117J5758N054O6o207L860k191k080K959J4405J0931m403J070
$$ -1155390 -1160502 -1159385 -1143627 -1138573 -1138507 -1144714 -1140854 -1143045 -1145125 -1142166 -1127761 -1116830 -1121233 -1120163
11532a120163r469j2150j3856q91O762J1798k908N594J366O01J4753q624j306
$$ -1120163 -1129632 -1141782 -1155638 -1156529 -1149767 -1137969 -1140877 -1135283 -1133917 -1133316 -1118563 -1127187 -1128493
11519a128493j4122J4417K0263k104J598r858l622m474M536J3093K2252m262q392
$$ -1128493 -1142615 -1128198 -1107935 -1110039 -1108441 -1118299 -1121921 -1126395 -1121859 -1108766 -1086514 -1090776 -1099168
11506a099168N755r079k4387J20J5762n473j7531Q347K6494k084P830R873j6608
$$ -1099168 -1093413 -1102492 -1126879 -1126759 -1110997 -1116470 -1134001 -1125654 -1099160 -1101244 -1093414 -1083541 -1100149
11493a100149L698L152l737o270l4343j1775l076J2521J6683K452J1902L389n510
$$ -1100149 -1096451 -1093299 -1097036 -1103306 -1137649 -1149424 -1152500 -1139979 -1123296 -1120844 -1108942 -1105553 -1111063
11480a111063j271n134R228j2915J956J3454R334J1491M949r618l687q474J5613
$$ -1111063 -1112334 -1117468 -1108240 -1121155 -1119199 -1105745 -1096411 -1084920 -1079971 -1089589 -1093276 -1101750 -1086137
11467a086137J4306N63J3272J4434o906j6312P495N077L91M859k1071k2411j0355
$$ -1086137 -1071831 -1071268 -1057996 -1043562 -1050468 -1066780 -1059285 -1054208 -1053817 -1048958 -1070029 -1092440 -1102795
11454a102795J8827J8295n338j985o279R740R312p36P544l255J4334J2521m351
$$ -1102795 -1083968 -1065673 -1071011 -1072996 -1079275 -1069535 -1060223 -1060959 -1053415 -1056670 -1042336 -1029815 -1034166
11441a034166P454R161j0348l277K180J0424L61N161M021r238Q567j2060n812
$$ -1034166 -1026712 -1017551 -1027899 -1031176 -1028996 -1018572 -1018211 -1013050 -1009029 -1018267 -1009700 -1021760 -1027572
11428a027572K492M345j524k436k4891k7163J1758R110O715J523m742j7740J8296
$$ -1027572 -1025080 -1020735 -1022259 -1024695 -1049586 -1076749 -1064991 -1055881 -1049166 -1047643 -1052385 -1070125 -1051829
11415a051829L8611J3681r891K369k2279j1940K2519l803k894j1756j1918r860
$$ -1051829 -1013218 -999537 -1009428 -1007059 -1029338 -1041278 -1018759 -1022562 -1025456 -1037212 -1049130 -1058990
11403a058990K1353J5227O937K731M52j7027j384K6069n103r27j9404k128K1038
$$ -1058990 -1037637 -1022410 -1015473 -1012742 -1012290 -1029317 -1030701 -1004632 -1009735 -1010662 -1030066 -1032194 -1011156
11390a011156J5381O302M414r69Q75K301o963K1302K0831K055k17k0207j1988
$$ -1011156 -995775 -989473 -985059 -986028 -985153 -982852 -989815 -968513 -947682 -945627 -945844 -966051 -978039
11377i78039p040q927J1361J9862R395j6299j1024j4881O238j4185o266R731K1407
$$ -978039 -985079 -994006 -982645 -962783 -953388 -969687 -980711 -995592 -989354 -1003539 -1009805 -1000074 -978667
11364i78667J0544p232R33O853m232n689L907m218j4840p31J3303r748k61J6411
$$ -978667 -968123 -975355 -974422 -967569 -971801 -977490 -973583 -977801 -992641 -993372 -980069 -989817 -990078 -973667
11350i73667k983j3014N144O136J1986K069j174k862Q444j1031j2364J9236J5535
$$ -973667 -976650 -989664 -984520 -978384 -966398 -964329 -965503 -968365 -959921 -970952 -983316 -964080 -948545
11337i48545r779j1855l803J8876R721Q397j5374J434r889j7410L197K2924M833
$$ -948545 -958324 -970179 -973982 -955106 -945385 -936988 -952362 -950928 -960817 -978227 -975030 -952106 -947273
11324i47273J078N341k343J7416J5905l052k6940l45l246j7278K5721J6756J574
$$ -947273 -946195 -940854 -943197 -925781 -909876 -912928 -939868 -940213 -943459 -960737 -935016 -918260 -916686
11311i16686p34j6900j035m554j4068l425k397N295J5874J361o258o953J1858
$$ -916686 -917420 -934320 -935355 -939909 -953977 -957402 -959799 -954504 -938630 -937269 -943527 -950480 -938622
11298i38622N937r302n186J3583k088O045J7551O527l556P078m151j1936L890
$$ -938622 -932685 -941987 -947173 -933590 -935678 -929633 -912082 -905555 -909111 -902033 -906184 -918120 -914230
11285i14230L108O683m840J5678O409p277j095P545j401o339J6990k856p209m605
$$ -914230 -911122 -904439 -909279 -893601 -887192 -894469 -895564 -888019 -889420 -895759 -878769 -881625 -888834 -893439
11271h93439j666R47K1750L1777j1477p312j5772O738K6968n43J936o197j4487
$$ -893439 -895105 -894158 -872408 -840631 -852108 -859420 -875192 -868454 -841486 -842029 -840093 -846290 -860777
11258h60777J0752L4893L707o466J1553j3409j7973K3113J8672N060K294r676
$$ -860777 -850025 -815132 -811425 -817891 -806338 -819747 -837720 -814607 -795935 -790875 -788581 -798257
11246g98257K1909L1318L2343j1882o6522q5821p5024l4413n736k983j126M430
$$ -798257 -776348 -745030 -712687 -724569 -791091 -876912 -951936 -986349 -992085 -995068 -996194 -991764
11234i91764J7219K7980K8277P285l037j4603o920M348J9175K5365J1723j3989
$$ -991764 -974545 -946565 -918288 -911003 -914040 -928643 -935563 -931215 -912040 -886675 -874952 -888941
11222h88941J0190J9002j922J0013m371j5678k2226J287J3640O528O570N827j7887
$$ -888941 -878751 -859749 -861671 -851658 -856029 -871707 -893933 -892646 -879006 -872478 -865908 -860081 -877968
11209h77968k7689K015K0840K45M850J5275M640J773L062Q813M320k741r750n245
$$ -877968 -905657 -903642 -882802 -882557 -877707 -862432 -857792 -856019 -852957 -844144 -839824 -842565 -852315 -857560
11195h57560K4844J5632j7302j7731l774J4837m045k130j5435j988k3767J6339
$$ -857560 -832716 -817084 -834386 -852117 -855891 -841054 -845099 -847229 -862664 -864652 -888419 -872080
11183h72080N101m864J7588M767P74J5448N254P18J3383l12J8358j1265q498K277
$$ -872080 -866979 -871843 -854255 -849488 -848714 -833266 -828012 -827294 -813911 -814223 -795865 -807130 -815628 -813351
11169h13351O725k291K038j8380J8588J9369r127q852k4097k8710j0091J2259
$$ -813351 -806626 -808917 -806879 -825259 -806671 -787302 -796429 -805281 -829378 -858088 -868179 -855920
11157h55920J1805J2444O218J2252J5544m741j3403R576K0385p579K683j2502
$$ -855920 -844115 -831671 -825453 -813201 -797657 -802398 -815801 -806225 -785840 -793419 -790736 -803238
11145h03238J2001Q03j0638J2660k128l679m266j484P122N553O54p324j0509Q48
$$ -803238 -791237 -790434 -801072 -788412 -790540 -794219 -798485 -799969 -792847 -787294 -786640 -793964 -804473 -803625
11131h03625O161P597P956p116K035K8099l771q380j0540K4454P472j1335k6897
$$ -803625 -797464 -789867 -781911 -789027 -786992 -758893 -762664 -771044 -781584 -757130 -749658 -760993 -787890
11118g87890j3406J9337o23l4J2268j7951k0381P806L0663J5566r413j4922j488
$$ -787890 -801296 -781959 -782582 -782616 -770348 -788299 -808680 -800874 -770211 -754645 -764058 -778980 -780468
11105g80468q70P570K758J220j258k696j3493N442J894M274K5544J0337j7570
$$ -780468 -781338 -773768 -771010 -769790 -771048 -773744 -787237 -781795 -779901 -775627 -750083 -739746 -757316
11092g57316J1557O115k0111J5505N833j5000N650j6218l075J2026J0889J898
$$ -757316 -745759 -739644 -759755 -744250 -738417 -753417 -747767 -763985 -767060 -755034 -744145 -742247
11080g42247J5778Q627k196M937l495K1038P08r892k0816r162J579L125k276J3718
$$ -742247 -726469 -717842 -720038 -715101 -718596 -697558 -696850 -706742 -727558 -736720 -735141 -732016 -734292 -720574
11066g20574p976j4089J7889K3661j0299j6807r27j141p085O59r190J3898Q578
$$ -720574 -728550 -742639 -724750 -701089 -711388 -728195 -729122 -730263 -737348 -736689 -745879 -731981 -723403
11053g23403L738J3292K76j4056R161J0037q461k814k400P108O255m964P580J4637
$$ -723403 -719665 -706373 -706097 -720153 -710992 -700955 -709416 -712230 -714630 -707522 -701267 -706231 -698651 -684014
11039f84014p527j5565k6880k4788O581K8131P491J0662R487p089m081j1539l273
$$ -684014 -691541 -707106 -733986 -758774 -752193 -724062 -716571 -705909 -696422 -703511 -707592 -719131 -722404
11026g22404j6799M270L0735J5862j191q999M057j632n810J5761J1098l166J954
$$ -722404 -739203 -734933 -704198 -688336 -689527 -698526 -694469 -696101 -701911 -686150 -675052 -678218 -676264
11013f76264M811Q837j5347k9417j775K5829J8685j315m180j9781J0228j6516
$$ -676264 -671453 -662616 -677963 -707380 -709155 -683326 -664641 -665956 -670136 -689917 -679689 -696205
11001f96205k864K6673Q179p098m16j0306j7148j0397j2509R758L8534J3220k085
$$ -696205 -699069 -672396 -664217 -671315 -671731 -682037 -699185 -709582 -722091 -712333 -673799 -660579 -662664
10988f62664k2863J9320j6068q390N503J339J1446J9089J617j1930R783K8344
$$ -662664 -685527 -666207 -682275 -690665 -685162 -683823 -672377 -653288 -651671 -663601 -653818 -625474
10976f25474L246p791o411k5783q608O231l623M398J2201j9K8783L034k1821o546
$$ -625474 -622228 -630019 -636430 -662213 -670821 -664590 -668213 -663815 -651614 -651633 -622850 -619816 -641637 -648183
10962f48183j992q584j8196K6332J3965q225j261J3968J944P100J4001M877j521
$$ -648183 -650175 -658759 -676955 -650623 -636658 -644883 -646144 -632176 -630232 -623132 -609131 -604254 -605775
10949f05775k8861j4655K8142J1000j7362r086j70K4737P609j0602o651j4547
$$ -605775 -634636 -649291 -621149 -610149 -627511 -636597 -636767 -612030 -604421 -615023 -621674 -636221
10937f36221m428J564j2646p656P144O001N776K0518R401L353m518j1414K747
$$ -636221 -640649 -639085 -651731 -659387 -652243 -646242 -640466 -619948 -610547 -607194 -611712 -623126 -620379
10924f20379k22n973L614M691q413Q362R899K856l806P203J3204k8871j5263J9965
$$ -620379 -620601 -626574 -622960 -618269 -626682 -618320 -608421 -605565 -609371 -602168 -588964 -617835 -633098 -613133
10910f13133O496j839o78J1911R882o172j6543O860J5420k102j8376O19K4319
$$ -613133 -606637 -608476 -609154 -597243 -587361 -593533 -610076 -603216 -587796 -589898 -608274 -607655 -583336
10897e83336J5607j913L783J403j7459j1441J7673K1512Q840o690r793J5931q703
$$ -583336 -567729 -569642 -565859 -564456 -581915 -593356 -575683 -554171 -545331 -552021 -561814 -545883 -554586
10884e54586j8336J3742O462j5971J4597p377p539r903P217k120N514N912n218
$$ -554586 -572922 -559180 -552718 -568689 -554092 -561469 -569008 -578911 -571694 -573814 -568300 -562388 -567606
10871e67606J907j5035q668l038R717o268q212j592K3165J9311L880R317q306
$$ -567606 -565699 -580734 -589402 -592440 -582723 -588991 -597203 -598795 -575630 -556319 -552439 -543122 -551428
10858e51428L585j5781L414m854r631K2361J3063j3971k7628J0709J3675R088
$$ -551428 -547843 -563624 -560210 -565064 -574695 -552334 -539271 -553242 -580870 -570161 -556486 -547398
10846e47398j516J364J5698o48J054k665m44M683p341j0679k627R047O006j0799
$$ -547398 -548914 -547550 -531852 -532500 -531446 -534111 -534555 -529872 -537213 -547892 -550519 -541472 -535466 -546265
10832e46265J3932J3525j942k6164R214j1437L593K3959N105N590m262j7451K693
$$ -546265 -532333 -518808 -520750 -546914 -537700 -549137 -545544 -521585 -516480 -510890 -515152 -532603 -529910
10819e29910J1590k687j4501L845J2412L271J0856J5730j609j2866q519J7942
$$ -529910 -518320 -521007 -535508 -531663 -519251 -515980 -505124 -489394 -491003 -503869 -512388 -494446
10807d94446P224o513j5888R003o075r821q848k470q429M547J6434J9674O806
$$ -494446 -487222 -493735 -509623 -500620 -506695 -516516 -525364 -527834 -536263 -531716 -515282 -495608 -488802
10794d88802j9137m849M340m294l971P868J2469l119j1991j654q863J897K1878
$$ -488802 -507939 -512788 -508448 -512742 -516713 -508845 -496376 -499495 -511486 -513140 -522003 -520106 -498228
10781d98228L6264j2494J96J0199J591o023k227j929P829J2739q445p778q395
$$ -498228 -461964 -474458 -474262 -464063 -462472 -468495 -470722 -472651 -464822 -452083 -460528 -468306 -476701
10768d76701Q756J4046O181P481o494q526m649O801J5281J1924k474j5263j2012
$$ -476701 -467945 -453899 -447718 -440237 -446731 -455257 -459906 -453105 -437824 -425900 -428374 -443637 -455649
10755d55649K0518J786n293j4640J1021J7998o744j2579J8097j484J3241M054
$$ -455649 -435131 -433345 -438638 -453278 -442257 -424259 -431003 -443582 -425485 -426969 -413728 -409674
10743d09674O890J3751K9698L9287J0850K0687J6779j1289k3822p0443j16742
$$ -409674 -402784 -389033 -359335 -320048 -309198 -288511 -271732 -283021 -306843 -377286 -494028
10732d94028p1116k1236j1767K0537J432Q036K6320K7936K699O188j4216M846
$$ -494028 -565144 -586380 -598147 -577610 -576178 -568142 -541822 -513886 -511187 -504999 -519215 -514369
10720e14369L109J3085K6489J6546j051k3911q355J5j058L1O343l795j973J5359
$$ -514369 -511260 -498175 -471686 -455140 -456191 -480102 -488457 -488442 -489500 -489469 -483126 -486921 -488894 -473535
10706d73535L2428n655j4539q169l090q947l566o023O490J0785J5785m50n921
$$ -473535 -441107 -446762 -461301 -469470 -472560 -481507 -485073 -491096 -484606 -473821 -458036 -458486 -464407
10693d64407J7740K399m988J8094J541P023Q280k658j0657k940r00n825j3702
$$ -464407 -446667 -444268 -449256 -431162 -429621 -422598 -414318 -416976 -427633 -430573 -431473 -437298 -451000
10680d51000o154M465k7894j0951Q609K2968J9065q154q432n412j919J7930R265
$$ -451000 -457154 -452689 -480583 -491534 -482925 -459957 -440892 -449046 -457478 -462890 -464809 -446879 -437614
10667d37614l146p895l294J4632J7951K988n760m388O701N588n761j4979l829
$$ -437614 -440760 -448655 -451949 -437317 -419366 -416378 -422138 -426526 -419825 -414237 -419998 -434977 -438806
10654d38806l936M694J6767K641j6318p045j2733J3794J6575K3302J0745J1346
$$ -438806 -442742 -438048 -421281 -418640 -434958 -442003 -454736 -440942 -424367 -401065 -390320 -378974
10642c78974J3536k2944j9775N661q026m912k427j4788k0718R386K3836J9744
$$ -378974 -365438 -388382 -408157 -402496 -410522 -415434 -417861 -432649 -453367 -443981 -420145 -400401
10630d00401o694j4677M196J1069q08O857l308J0494K421j1566q454M233O548
$$ -400401 -407095 -421772 -417576 -406507 -407315 -400458 -403766 -393272 -390851 -402417 -410871 -406638 -400090
10617d00090Q862Q98Q830K6346j2289j8028n119j1174o574J4921r257j7047N368
$$ -400090 -391228 -390330 -381500 -355154 -367443 -385471 -390590 -401764 -408338 -393417 -402674 -419721 -414353
10604d14353J7903K2256M758M973L854K627J2284j3416j6195j4448j3154j273
$$ -414353 -396450 -374194 -369436 -364463 -360609 -357982 -345698 -359114 -375309 -389757 -402911 -404184
10592d04184L333K5877J7959k0292l937J3488M383N359j5675K21J1393L878j2699
$$ -404184 -400851 -374974 -357015 -377307 -381244 -367756 -363373 -358014 -373689 -373468 -362075 -358197 -370896
10579c70896o253K7804j960N537o197r856P89k189k509K9254Q174j883n258j7419
$$ -370896 -377149 -349345 -351305 -345768 -351965 -361821 -361032 -363221 -365730 -336476 -328302 -330185 -335443 -352862
10565c52862L946m039L356q615O219J2810j6498O264J5722J0129j950q690J074
$$ -352862 -348916 -352955 -349599 -358214 -351995 -339185 -355683 -349419 -333697 -323568 -325518 -334208 -333134
10552c33134J6979n073j0267j9614j8355K4030L5099r75o701r582j3700k628K7149
$$ -333134 -316155 -321228 -331495 -351109 -369464 -345434 -310335 -311310 -318011 -327593 -341293 -343921 -316772
10539c16772K6534l787j1938q871q663j4R309l11J2687O475L081L96k2556j5875
$$ -316772 -290238 -294025 -305963 -314834 -323497 -323511 -314202 -314513 -301826 -295351 -292270 -291874 -314430 -330305
10525c30305O836J1665J8443J8762O447J2030L899j6058j9663M173L642j2104
$$ -330305 -323469 -311804 -293361 -274599 -268152 -256122 -252223 -268281 -287944 -283771 -280129 -292233
10513b92233J1368J548l874p679j0032N262P796M547K314J5525L388k216k1321
$$ -292233 -280865 -279317 -283191 -290870 -300902 -295640 -287844 -283297 -280983 -265458 -262070 -264286 -285607
10500b85607k805L227J4996J4201q538j4809J094q806J6049J4162j8464r439j736
$$ -285607 -288412 -285185 -270189 -255988 -264526 -279335 -278241 -287047 -270998 -256836 -275300 -284739 -286475
10487b86475m613J9073J1945p464m210K073P105J3243O08o913P226O480k021K381
$$ -286475 -291088 -272015 -260070 -267534 -271744 -269671 -262566 -249323 -248715 -255628 -248402 -241922 -243943 -241562
10473b41562J2062M591J4190J5422q681k2329j6077o981j6089K697J1975R859
$$ -241562 -229500 -224909 -210719 -195297 -203978 -226307 -242384 -249365 -265454 -262757 -250782 -240923
10461b40923Q014j664r929J233n21j1572q383n888k217M085J8818J1904l950L013
$$ -240923 -232909 -234573 -244502 -243269 -243790 -255362 -263745 -269633 -271850 -267765 -248947 -237043 -240993 -237980
10447b37980O218J4829j3287o673J0336R059k0148k2536J2455n133p441J809k503
$$ -237980 -231762 -216933 -230220 -236893 -226557 -217498 -237646 -260182 -247727 -252860 -260301 -258492 -260995
10434b60995J0181n942j1730J0777K5234J3162Q8j4978L210j852M477K062l615
$$ -260995 -250814 -256756 -268486 -257709 -232475 -219313 -219225 -234203 -230993 -232845 -228368 -226306 -229921
10421b29921m788k1800J2973J9028J0197J8602p760j9215L368k999j4089n914
$$ -229921 -234709 -256509 -243536 -224508 -214311 -195709 -203469 -222684 -219316 -222315 -236404 -242318
10409b42318Q113Q18K334Q570R566O428m655o04K464J7118J179j3895n262m515
$$ -242318 -234205 -233387 -231053 -222483 -212917 -206489 -211144 -211748 -209284 -192166 -190987 -204882 -210144 -214659
10395b14659n653J4859P132L695n998j2871O342J3030R675J4493k2642k0058O549
$$ -214659 -220312 -205453 -198321 -194626 -200624 -213495 -207153 -194123 -184448 -169955 -192597 -212655 -206106
10382b06106J5325L734J2656R817K73l794j2309K534K13l636l846J3940J4273
$$ -206106 -190781 -187047 -174391 -164574 -164301 -168095 -180404 -177870 -177657 -181293 -185139 -171199 -156926
10369a56926L035q940k1156P825j31M093M878J5067L168O472j4302k8050N22o792
$$ -156926 -153891 -162831 -183987 -176162 -176293 -172200 -167322 -152255 -149087 -142615 -156917 -184967 -184445 -191237
10355a91237K3536M380l822O694R202k189j5174N164K1299O64k604j1018J8148
$$ -191237 -167701 -163321 -167143 -160449 -151247 -153436 -168610 -163446 -142147 -141483 -144087 -155105 -136957
10342a36957K9623o095n284r878L137q09j083r076N477q885Q150N482k2700p738
$$ -136957 -107334 -113429 -118713 -128591 -125454 -126263 -127346 -136422 -130945 -139830 -131680 -126198 -148898 -156636
10328a56636j4803r72L453j38k045J5480k160o678r678J1715Q253K1197L840j359
$$ -156636 -171439 -172411 -168958 -169096 -171141 -155661 -157821 -164499 -174177 -162462 -154209 -133012 -129172 -130531
10314a30531N775j0935j5100M276J4370J0448p548j1249J9247K230n371k454j397
$$ -130531 -124756 -135691 -150791 -146515 -132145 -121697 -129245 -140494 -121247 -119017 -124388 -126842 -128239
10301a28239j2870J2150K4721M276p915R540J2113k8737q52j2471J3121L0631
$$ -128239 -141109 -128959 -104238 -99962 -107877 -98337 -86224 -114961 -115813 -128284 -115163 -84532
10289h4532J377j5195m393N043p051J807J3363J2387m305q469j8170q184j0097
$$ -84532 -83155 -98350 -102743 -97700 -104751 -102944 -89581 -77194 -81499 -89968 -108138 -116322 -126419
10276a26419j3818J0951K2430N947j7194j4183j4269Q600J5826J7156J4653j1370
$$ -126419 -140237 -129286 -106856 -100909 -118103 -132286 -146555 -137955 -122129 -104973 -90320 -101690
10264a01690R210J8264p18P097q179j5337r563N39K0434M955K512J88o653m170
$$ -101690 -92480 -74216 -74934 -67837 -76016 -91353 -100916 -100377 -79943 -74988 -72476 -72288 -78941 -83111
10250h3111J6375J0599o25N859R712j1026O854O269q922l5325r894m675J922L679
$$ -83111 -66736 -56137 -56762 -50903 -41191 -52217 -45363 -39094 -48016 -83341 -93235 -97910 -95988 -92309
10236i2309J7052J2765j562J612n44J4118P890n492p774k0013j4539r096J2010
$$ -92309 -75257 -62492 -64054 -62442 -62986 -48868 -40978 -46470 -54244 -74257 -88796 -97892 -85882
10223h5882K4380K050K695Q399O041p004M177p175k106K2285K5513J1863j4907
$$ -85882 -61502 -59452 -56757 -48358 -42317 -49321 -45144 -52319 -54425 -32140 -6627 5236 -9671
10210i671j0168k3678l938K9944J8403K142j3922J040J0669l422k8127j9185j6776
$$ -9671 -19839 -43517 -47455 -17511 892 3034 -10888 -9848 821 -2601 -30728 -49913 -66689
10197f6689O179n425j0281Q443L205n91p337J6300L5395m02q535N58j9233M228
$$ -66689 -60510 -65935 -76216 -67773 -64568 -65159 -72496 -56196 -20801 -21203 -29738 -29180 -48413 -44185
10183d4185J9367R243J0879J2931k9834Q697K3755r332j5651k3635j2856Q447
$$ -44185 -24818 -15575 -4696 8235 -21599 -12902 10853 1521 -14130 -37765 -50621 -42174
10171d2174O604N053R336J5928n081R029R197O7l388K1K66j4779P942N165L397
$$ -42174 -35570 -30517 -21181 -5253 -10334 -1305 7892 7959 4571 4592 4858 -9921 -1979 3186 6583
10156F583J5582l355p301j1539j2850Q13K1159R347J725n278J1828J8462J932
$$ 6583 22165 18810 11509 -30 -12880 -12067 9092 18439 20164 14886 26714 45176 47108
10143D7108P464O222J294l727J0019j506p385o300p706r614J1495r507j1156J1909
$$ 47108 54572 60794 62088 58361 68380 66874 59489 53189 45483 35869 47364 37857 26701 38610
10129C8610M704J0412j1755m828p578k2988N47R736J7929q07k891O7k708O857
$$ 38610 43314 53726 41971 37143 29565 6577 7124 16860 34789 33982 31091 31158 28450 35307
10115C5307O629r809L787K3614M194n416L570J3006L676J435P506k410m12n59
$$ 35307 41936 32127 35914 59528 63722 58306 61876 74882 78558 79993 87499 85089 84677 84118
10101H4118P073k664K574J6324j379p690j7813M532J592k9060j0538O582K7861
$$ 84118 91191 88527 91101 107425 106046 98356 80543 85075 86667 57607 47069 53651 81512
10088H1512M673k596L408k237k5897q384j0024N527n561J4813p08q44K1504j56
$$ 81512 86185 83589 86997 84760 58863 50479 40455 45982 40421 55234 54526 53682 75186 75030
10074G5030r588J8228K5332N624r477K344k535j4737j5576J1972K1904J4823m99
$$ 75030 65442 83670 109002 114626 105149 107493 104958 90221 74645 86617 108521 123344 122845
10061A22845j1779N129R351P37n579k3719O044N544j3367J7402J4325j3025J578
$$ 122845 111066 116195 125546 126283 120704 96985 103029 108573 95206 112608 126933 113908 115486
10048A15486j565K3282M653k2549M656J5282J128N737k1492L142L465M717J3093
$$ 115486 113921 137203 141856 119307 123963 139245 140373 146110 124618 127760 131225 135942 149035
10035A49035O805O040N924o374j0887k0798J340R011J1632J2601M580n577J3353
$$ 149035 155840 161880 167804 161430 150543 129745 131085 140096 151728 164329 168909 163332 176685
10022A76685K5379Q949j9263k3108p061j5797P803j224K862j77K82J7501j185
$$ 176685 202064 211013 191750 168642 161581 145784 153587 152363 155225 155048 155330 172831 171646
10009A71646q139m786J7019K0186O774J3387J7021m256j0874k5541j1207O423
$$ 171646 163507 158721 175740 195926 202700 216087 233108 228852 217978 192437 181230 187653
9997A87653K007J6102P702J589j2061J856j2048k221o721O807K1658K873j2831
$$ 187653 189660 205762 213464 215053 202992 204848 192800 190579 183858 190665 212323 215196 202365
9984B02365J8892P751N016Q425j337L937o360j839Q103q63Q229m278j485Q896
$$ 202365 221257 229008 234024 242449 241112 245049 238689 236850 244953 244090 252319 248041 246556 255452
9970B55452j0739J2389L445K861r199Q6J3335r472j7871k314p662r698j107M610
$$ 255452 244713 257102 260547 263408 254209 254295 267630 258158 240287 237973 230311 220613 219506 224116
9956B24116L3168P013L715K846J1679Q097j438K049O562j2180n353L183K707J0690
$$ 224116 257284 264297 268012 270858 282537 290634 289196 291245 297807 285627 280274 283457 286164 296854
9942B96854K9720j2290o654m072K8041J3911o915r920k578r832Q659K4544m764
$$ 296854 326574 314284 307630 303558 331599 345510 338595 328675 326097 316265 324924 349468 344704
9929C44704k6433k1918p526k6259J6491K0840k38j1853J0948N6J2811J0298P325
$$ 344704 318271 296353 288827 262568 279059 299899 299661 287808 298756 298812 311623 321921 329246
9916C29246q417K127J1113l092Q83l707n502J663Q025L611M952q941J2237J2474
$$ 329246 320829 322956 334069 330977 331860 328153 322651 324314 332339 335950 340902 331961 344198 356672
9902C56672q444o45K3906J1332j3871P734O254P229O555J4080P007n305p894k1524
$$ 356672 348228 347583 371489 382821 368950 376684 382938 390167 396722 410802 417809 412504 404610 383086
9888C83086m932R6J4351Q228N529j369J3535J4037N312r375q676J7809Q240J2322
$$ 383086 378154 378250 392601 400829 406358 404989 418524 432561 437873 428498 419822 437631 445871 458193
9874D58193K3158J3974j3025p640n881P934P804R271J0065l067j0712K0046J0146
$$ 458193 481351 495325 482300 474660 468779 476713 484517 493788 503853 500786 490074 510120 520266
9861E20266L454J1731O087L729J116K2371P355P592J7019K2911K5092Q427K5563
$$ 520266 523720 535451 541538 545267 546383 568754 576109 583701 600720 623631 648723 657150 682713
9848F82713J8152K3540K0682L9929K4780K2380M7003N2609M8398N5936R1676J30329
$$ 682713 700865 724405 745087 785016 809796 832176 879179 931788 980186 1036122 1127798 1258127
9836A258127J51989J69025J16851p3235l75097o34290o14247l97251j43694K947
$$ 1258127 1410116 1579141 1695992 1622757 1247660 613370 -877 -398128 -541822 -538875
9826e38875K9275P4346N9698M8164O1072N5051M7308K8521K3118L2998L2814J5869
$$ -538875 -509600 -435254 -375556 -327392 -266320 -211269 -163961 -135440 -112322 -79324 -46510 -30641
9814c0641P470j0022J1747K4761L0679L5303J4830p860J1675K2355K0456K1627
$$ -30641 -23171 -33193 -21446 3315 33994 69297 84127 76267 87942 110297 130753 152380
9802A52380Q428J0391O44O574n276K40J4602J088k657K6459J0277R385R906n112
$$ 152380 160808 171199 171843 178417 173141 173381 187983 189071 186414 212873 223150 232535 242441 237329
9788B37329m553j3492j1009P284j8638j7373kM938K4344K6882J4604R092M977
$$ 237329 232776 219284 208275 215559 196921 179548 179546 184484 208828 235710 250314 259406 264383
9775B64383J986J7514R453M997L494q748M486K4165Q666J1531P787j9761j1849
$$ 264383 266369 283883 293336 298333 301827 293079 297565 321730 330396 341927 349714 329953 318104
9762C18104J011J6677K2398P520J355J85O926j2796m1724k2486J3410J5329K517
$$ 318104 319115 335792 358190 365710 367065 367250 374176 361380 319656 297170 310580 325909 328426
9749C28426k907k504j0485J8637n487j1864k04K1641N568O078M175R286J8903
$$ 328426 325519 323015 312530 331167 325680 313816 313612 335253 340821 346899 351074 360360 379263
9736C79263O003j4957j3009K115l990P520J8020J305m733m084K6982O229J709
$$ 379263 385266 370309 357300 359415 355425 362945 380965 382270 377537 373453 400435 406664 408373
9723D08373m916R731o628j292p953k56J4398M749L734j5923J782j640p772J0977
$$ 408373 403457 413188 406560 405268 397315 397059 411457 416206 419940 404017 405799 404159 396387 407364
9709D07364K5315n489J4995K0242J4811k258j6367R288P909p565P963m565m655
$$ 407364 432679 427190 442185 462427 477238 474980 458613 467901 475810 468245 476208 471643 466988
9696D66988p614Q875L704J0879o118j6639l275l401O460L2437K6708L804j7215
$$ 466988 459374 468249 471953 482832 476714 460075 456800 453399 459859 492296 519004 522808 505593
9683E05593j147N763O949n241o015K3115J1295j3800j5359O038J3708J4057J560
$$ 505593 504446 510209 517158 511917 505902 529017 540312 526512 511153 517191 530899 544956 546516
9670E46516o790l224p640l543L554R967m077M250J9125N76N365J0595Q753r54
$$ 546516 539726 536502 528862 525319 528873 538840 534763 539013 558138 558714 564079 574674 583427 582473
9656E82473j0082j0699J6110K203k4174M332R9L573j0780l937j3617r35L7708
$$ 582473 572391 561692 577802 580005 555831 560163 560262 563835 553055 549118 535501 534566 572274
9643E72274J2409p817p465J593J48L793Q611J1082j065j5833j705n023O211K3955
$$ 572274 584683 576866 569401 570994 571142 574935 583546 594628 593563 577730 576025 571002 577213 601168
9629F01168J3652p345O483q421n209J0507q988K2483l479O569J0897k571N934
$$ 601168 614820 607475 613958 605537 600328 610835 601847 624330 620851 627420 638317 635746 641680
9616F41680J2780K3874o192k0497m967N393J0677m293n824p108j5255j3624O474
$$ 641680 654460 678334 672142 651645 646678 652071 662748 658455 652631 645523 630268 616644 623118
9603F23118J13J2956J0871K722m19J4707O703n094n364j15m409m320L2707J0919
$$ 623118 623231 636187 647058 649780 649361 664068 670771 665677 660313 660198 655789 651469 684176 695095
9589F95095o678r165M585N514J3315M421p026j6418r950J4478K5864K1607o448
$$ 695095 688417 679252 683837 689351 702666 707087 700061 683643 673693 688171 714035 735642 729194
9576G29194k0607J1427J2145J3428j1791n275O187O866Q036l172M795R144k704
$$ 729194 708587 720014 732159 745587 733796 728521 734708 741574 749610 746438 751233 760377 757673
9563G57673j4176j335l195J733m974O436K5991K892L078o151n92K0523K566k1151
$$ 757673 743497 742162 738967 740700 735726 742162 768153 771045 774123 767972 767380 787903 790469 769318
9549G69318k445J904j0451r139O852Q587Q145M762K2730J7375M916l553M894M450
$$ 769318 766873 768777 758326 749187 756039 764626 772771 777533 800263 817638 822554 819001 823895 828345
9535H28345J8644J5591p688j0756p313J3747p876j4059L650N036m266J1348J3863
$$ 828345 846989 862580 854892 844136 836823 850570 842694 828635 832285 837321 833055 844403 858266
9522H58266j3191J0477N355Q248o403k492K171J624n917j0521K172J1677J9659
$$ 858266 845075 855552 860907 869155 862752 860260 862431 864055 858138 847617 849789 861466 881125
9509H81125j6060j6702n999J8099K0713Q400Q801j1440M072o623J758Q227M928
$$ 881125 865065 848363 842364 860463 881176 889576 898377 886937 891009 884386 886144 894371 899299
9496H99299K8377j0190j5649J3826J9690J0377N486j2332N561l808m602p26O028
$$ 899299 927676 917486 901837 915663 935353 945730 951216 938884 944445 940637 936035 935309 941337
9483I41337j5943K709O780K222M46J7844K5331K2785P055k652J552M46k4472j6692
$$ 941337 925394 928103 934883 937105 937551 955395 980726 1003511 1010566 1007914 1009466 1009912 985440 968748
9469I68748Q855J1032J8474K254J553J0888J6171O798j0168q128J2699J0513M680
$$ 968748 977603 988635 1007109 1009363 1010916 1021804 1037975 1044773 1034605 1026477 1039176 1049689 1054369
9456A054369p128q917O097q311J918k762m188J2411K4168J1608L514O436J888
$$ 1054369 1047241 1038324 1044421 1036110 1038028 1035266 1031078 1043489 1067657 1079265 1082779 1089215 1091103
9443A091103k4687M128J2953J3668J7606K5047J0734k071r717N633r293R64J5133
$$ 1091103 1066416 1070544 1083497 1097165 1114771 1139818 1150552 1148481 1138764 1144397 1135104 1136068 1151201
9430A151201N355j0310o557J0055O659q399P82L192J1943L7145M756j2220j3163
$$ 1151201 1156556 1146246 1139689 1149744 1156403 1148004 1148786 1151978 1163921 1201066 1205822 1193602 1180439
9417A180439j7527J59p68R411J1455P33O488j5115o761J9960L882j3676P164K4931
$$ 1180439 1162912 1163071 1162303 1171714 1183169 1183902 1190390 1175275 1168514 1188474 1192356 1178680 1185844 1210775
9403A210775K7874P521J0653j5818j5373j3546L222Q48j1104J4287R108M884k201
$$ 1210775 1238649 1246170 1256823 1241005 1225632 1212086 1215308 1216156 1205052 1219339 1228447 1233331 1231130
9390A231130J5111J7943J017j2160K994J6078J3781J7562K414K1775J4749K0746
$$ 1231130 1246241 1264184 1265201 1253041 1256035 1272113 1285894 1303456 1305870 1327645 1342394 1363140
9378A363140J2923J747k0039j600j3158k4496J796P25J8369J9833J7215K0000
$$ 1363140 1376063 1377810 1357771 1356171 1343013 1318517 1320313 1321038 1339407 1359240 1376455 1396455
9366A396455j1942n131K1813P767j2625m051P342K185J1356K48L799p945J2129
$$ 1396455 1384513 1379382 1401195 1408962 1396337 1392286 1399628 1401813 1413169 1413417 1417216 1409271 1421400
9353A421400P003N30m732K2709L2040k227L562o822J9130J3122n890J6095j857
$$ 1421400 1428403 1428933 1424201 1446910 1478950 1476723 1480285 1473463 1492593 1505715 1499825 1515920 1514063
9340A514063L640l853P730J2988P801P636P585J1998P303O788j8744j0126M525
$$ 1514063 1517703 1513850 1521580 1534568 1542369 1550005 1557590 1569588 1576891 1583679 1564935 1554809 1559334
9327A559334O500O399K7139R950M81K2622J1730J2152p659j1275m151L2062R744
$$ 1559334 1565834 1572233 1599372 1609322 1609803 1632425 1644155 1656307 1648648 1637373 1633222 1665284 1675028
9314A675028J8497J244J554J3268k9O433L416P936K861m737o559P850L780Q812
$$ 1675028 1693525 1694769 1696323 1709591 1709562 1715995 1719411 1727347 1730208 1725471 1718912 1726762 1730542 1739354
9300A739354K2904J9508J424N119K7972L4720J6970J1434p076O978J6863J4161
$$ 1739354 1762258 1781766 1783190 1788309 1816281 1851001 1867971 1879405 1872329 1879307 1896170 1910331
9288A910331J3122K6440K7860M0530K9083J2956k5484n5798r3205q0186n3456
$$ 1910331 1923453 1949893 1977753 2018283 2047366 2060322 2034838 1979040 1885835 1805649 1752193
9277A752193j3415J6430p818l213Q972J2582J3705J2370N671M3469L5648J9365
$$ 1752193 1738778 1755208 1747390 1744177 1753149 1765731 1779436 1791806 1797477 1840946 1876594 1895959
9265A895959j1258N076J1894M902J4367L210J1783L080R215K8840L0846j866K4344
$$ 1895959 1884701 1889777 1901671 1906573 1920940 1924150 1935933 1939013 1948228 1977068 2007914 2006048 2030392
9252B030392J2570J6633K0030K6804K9060J7164K8893L1652N4845L5838K7641
$$ 2030392 2042962 2059595 2079625 2106429 2135489 2152653 2181546 2213198 2268043 2303881 2331522
9241B331522L2454N9113M1837L8096N401r5167k18961k39554j47541m6446r161
$$ 2331522 2363976 2423089 2464926 2503022 2508423 2413256 2194295 1954741 1807200 1760754 1751593
9230A751593L98M5618K9683K4437K4558K2156L2131J2664J7269J6342K5630J4169
$$ 1751593 1751991 1797609 1827292 1851729 1876287 1898443 1930574 1943238 1960507 1976849 2002479 2016648
9218B016648o412p448K2061K2418M0746K8755K7366Q036J2982L0467J4132M346
$$ 2016648 2010236 2002788 2024849 2047267 2088013 2116768 2144134 2152170 2165152 2195619 2209751 2214097
9206B214097j5470R678L0176J6893L151J8628L3434L4124K5027K4089M1644K8004
$$ 2214097 2198627 2208305 2238481 2255374 2258525 2277153 2310587 2344711 2369738 2393827 2435471 2463475
9194B463475N1184K0240k2251m0651o9295r1488p2479j9979l373q406K1010L3289
$$ 2463475 2514659 2534899 2512648 2471997 2402702 2311214 2238735 2218756 2215383 2206977 2227987 2261276
9182B261276J3315l101K2452R254K1839L1573K6889K3576J1602K3198J3153J1786
$$ 2261276 2274591 2271490 2293942 2303196 2325035 2356608 2383497 2407073 2418675 2441873 2455026 2466812
9170B466812K7136J5501R497J6279Q929N733J1667J2582M265J6343M0292O002
$$ 2466812 2493948 2509449 2518946 2535225 2544154 2549887 2561554 2574136 2578401 2594744 2635036 2641038
9158B641038J773J2134J4423O742J8041L2234K9049R979J4974J2692K5784o255
$$ 2641038 2642811 2654945 2669368 2676110 2694151 2726385 2755434 2765413 2780387 2793079 2818863 2812608
9146B812608Q293K5314K2627Q838o400K713K8733K2421K0472M759R604J8930K1851
$$ 2812608 2820901 2846215 2868842 2877680 2871280 2873993 2902726 2925147 2945619 2950378 2959982 2978912 3000763
9133C000763r875K758J7805O243N20K5364K3459K6617K5080K4466J5885P737K2401
$$ 3000763 2990888 2993646 3011451 3017694 3018214 3043578 3067037 3093654 3118734 3143200 3159085 3166822 3189223
9120C189223O175L130K5464J0373J1062K1494M680J1281K0774K4746L4362J9656
$$ 3189223 3195398 3198528 3223992 3234365 3245427 3266921 3271601 3282882 3303656 3328402 3362764 3382420
9108C382420O004J2602K1687K7097K3672O229J3742K3407J3856K4104L9449J9608
$$ 3382420 3388424 3401026 3422713 3449810 3473482 3479711 3493453 3516860 3530716 3554820 3594269 3613877
9096C613877L1079K7388J980K4022J7175o66M394r62n412K4805L0872L0112J6910
$$ 3613877 3644956 3672344 3674324 3698346 3715521 3714855 3719249 3718287 3712875 3737680 3768552 3798664 3815574
9083C815574r80l608K1802L3265M3967K8675J4611O242J4721J9321J9909J3983
$$ 3815574 3814594 3810986 3832788 3866053 3910020 3938695 3953306 3959548 3974269 3993590 4013499 4027482
9071D027482K3643K8080m345J6500L1453K8620M5090L3209K085m274J0599M0097
$$ 4027482 4051125 4079205 4074860 4091360 4122813 4151433 4196523 4229732 4231817 4227543 4238142 4278239
9059D278239L6382K7995J6443L4291L1054K0101J9315K1048J4719M2552M1481
$$ 4278239 4314621 4342616 4359059 4393350 4424404 4444505 4463820 4484868 4499587 4542139 4583620
9048D583620J9131L1556K6541J2547K1614J3449J0723N4092L9252K7868N584K8255
$$ 4583620 4602751 4634307 4660848 4673395 4695009 4708458 4719181 4773273 4812525 4840393 4845977 4874232
9036D874232N6603M4361M4849L9925L5667K9483J9337L7025O3491K4490j1739
$$ 4874232 4930835 4975196 5020045 5059970 5095637 5125120 5144457 5181482 5244973 5269463 5257724
9025E257724K1120K7527N608Q327L3304M1006M4797K7342M1306L0913J4166M3628
$$ 5257724 5278844 5306371 5311979 5320306 5353610 5394616 5439413 5466755 5508061 5538974 5553140 5596768
9013E596768M0131K8850L2269L7371N2345M6122M1011N3123N2266N4204O3775
$$ 5596768 5636899 5665749 5698018 5735389 5787734 5833856 5874867 5927990 5980256 6034460 6098235
9002F098235O8530N4069M5502M4171M6075J8689K8991N0039M6246P5962R5196
$$ 6098235 6166765 6220834 6266336 6310507 6356582 6375271 6404262 6454301 6500547 6576509 6671705
8991F671705J01240R1886O2759M9019L9666N4632L8923O1708O8656L7044L7845
$$ 6671705 6772945 6864831 6927590 6976609 7016275 7070907 7109830 7171538 7240194 7277238 7315083
8980G315083N3367N9557M7047L8382O9016P0106N3028N7983M5516P9230O9630
$$ 7315083 7368450 7428007 7475054 7513436 7582452 7652558 7705586 7763569 7809085 7888315 7957945
8969G957945O2595L9121N0572O1328O2415Q0323R5336J19677J13985J07986J12703
$$ 7957945 8020540 8059661 8110233 8171561 8233976 8314299 8409635 8529312 8643297 8751283 8863986
8958H863986J26754J28264J16945Q3000Q0663J06089J10376R5239R3765J08399
$$ 8863986 8990740 9119004 9235949 9318949 9399612 9505701 9616077 9711316 9805081 9913480
8948I913480J13576J13498J54070J40949J06952J10108J08982J33106J34884J35002
$$ 9913480 10027056 10140554 10294624 10435573 10542525 10652633 10761615 10894721 11029605 11164607
8938A1164607J24760J22733J46993J58877J81679J64848J52340J73598K01236
$$ 11164607 11289367 11412100 11559093 11717970 11899649 12064497 12216837 12390435 12591671
8929A2591671J89195J88625J90833K00212K32702K12319J96079J87544J85727
$$ 12591671 12780866 12969491 13160324 13360536 13593238 13805557 14001636 14189180 14374907
8920A4374907K28608K81092K87612K76294K93147L19478L50778L66294L86080
$$ 14374907 14603515 14884607 15172219 15448513 15741660 16061138 16411916 16778210 17164290
8911A7164290M23798M43222M51140M64744M64425M67230M92129N44361O18595
$$ 17164290 17588088 18031310 18482450 18947194 19411619 19878849 20370978 20915339 21533934
8902B1533934O64761P12875Q09348Q68588R29802J010533J136601J231387J321028
$$ 21533934 22198695 22911570 23720918 24589506 25519308 26529841 27666442 28897829 30218857
8893C0218857J451790J717351K048077K398045K807486L300763L957416M637918
$$ 30218857 31670647 33387998 35436075 37834120 40641606 43942369 47899785 52537703
8885E2537703N133273M627388J230193o679976j7865473k4175089j8540914q788330
$$ 52537703 57670976 62298364 63528557 56848581 38983108 14808019 -3732895 -12521225
8877a2521225l265191m70589J301874K208002K500941K458816K297775K053327
$$ -12521225 -15786416 -16257005 -14955131 -12747129 -10246188 -7787372 -5489597 -3436270
8869c436270J824697J599537J308951R75381P97662Q74098J055918J194237J254338
$$ -3436270 -1611573 -12036 1296915 2272296 3069958 3944056 4999974 6194211 7448549
8860G448549J350230J441198J538602J649409J734526J813433J907840J999504
$$ 7448549 8798779 10239977 11778579 13427988 15162514 16975947 18883787 20883291
8852B0883291K130034K297297K465617K648298K911222L329563L944497M636209
$$ 20883291 23013325 25310622 27776239 30424537 33335759 36665322 40609819 45246028
8844D5246028N389996O401102P696614R195674J0608646J0573635M877574j0682437
$$ 45246028 50636024 57037126 64733740 73929414 84538060 95111695 99989269 89306832
8836H9306832l5834843n2662742m0662676j8214348o750172j227367K513616M298263
$$ 89306832 53471989 809247 -39853429 -58067777 -64817949 -66045316 -63531700 -59233437
8828e9233437M838154M747738M264521L647561L143790K626253J975412J197007
$$ -59233437 -54395283 -49647545 -45383024 -41735463 -38591673 -35965420 -33990008 -32793001
8820c2793001O23039O77054J037737J337961J514255J567592J598468J656042
$$ -32793001 -32169962 -31492908 -30455171 -29117210 -27602955 -26035363 -24436895 -22780853
8812b2780853J695809J679286J667136J664710J660127J680431J717578J746097
$$ -22780853 -21085044 -19405758 -17738622 -16073912 -14413785 -12733354 -11015776 -9269679
8804i269679J807187J922413K074345K288610K580413K911287L363937L894353
$$ -9269679 -7462492 -5540079 -3465734 -1177124 1403289 4314576 7678513 11572866
8796A1572866M509374N012715M878610K457829m016436j4427958k2783870k0150948
$$ 11572866 16082240 21094955 25973565 28431394 24414958 9987000 -12796870 -32947818
8788c2947818j0443147l930001q75264J030360K039256K404257K389983K213174
$$ -32947818 -43390965 -47320966 -48196230 -47165870 -45126614 -42722357 -40332374 -38119200
8780c8119200J927442J642347J399368J085059P15071L88092L42874M86411O39429
$$ -38119200 -36191758 -34549411 -33150043 -32064984 -31349913 -30961821 -30618947 -30132536 -29493107
8771b9493107P11014P43955P49041P48163P30714P06211O58084O51532O05134
$$ -29493107 -28782093 -28038138 -27289097 -26540934 -25810220 -25104009 -24445925 -23794393 -23189259
8762b3189259N69351M90206M81038M97481M55165M25608L86175L74991L57053
$$ -23189259 -22619908 -22129702 -21648664 -21151183 -20696018 -20270410 -19884235 -19509244 -19152191
8753a9152191L36416L22904L32886L27445L19554K99650K88856K75501K83695
$$ -19152191 -18815775 -18492871 -18159985 -17832540 -17512986 -17213336 -16924480 -16648979 -16365284
8744a6365284K77323K41332K26462K24390K20669J98019K01027J98385K03585
$$ -16365284 -16087961 -15846629 -15620167 -15395777 -15175108 -14977089 -14776062 -14577677 -14374092
8735a4374092J97534K05557J98937J79444J65932J47771J74732J72767J58383
$$ -14374092 -14176558 -13971001 -13772064 -13592620 -13426688 -13278917 -13104185 -12931418 -12773035
8726a2773035J71583J50578J29185J17350J31959J19344J24092J34103J40001
$$ -12773035 -12601452 -12450874 -12321689 -12204339 -12072380 -11953036 -11828944 -11694841 -11554840
8717a1554840J36240J12721J19164J17846J23557J05266N0609O5576J19568R7959
$$ -11554840 -11418600 -11305879 -11186715 -11068869 -10945312 -10840046 -10789437 -10723861 -10604293 -10506334
8707a0506334N3995K5893N0303Q7445P9705Q7334R2190Q3345R0819R1677N5789
$$ -10506334 -10452339 -10426446 -10376143 -10288698 -10208993 -10121659 -10029469 -9946124 -9855305 -9763628 -9707839
8696i707839P4985P7355N7968P4931R1700Q2657O8154Q7446R4132P3067N9125
$$ -9707839 -9632854 -9555499 -9497531 -9422600 -9330900 -9248243 -9180089 -9092643 -8998511 -8925444 -8866319
8685h866319P8975Q8420P3437O8076P9843M3695L4346K0782L0090M8036N4458
$$ -8866319 -8787344 -8698924 -8625487 -8557411 -8477568 -8433873 -8399527 -8378745 -8348655 -8300619 -8246161
8674h246161O1578O2809M8520M7308P4763O4028M5956L2774K9790M2356N5736
$$ -8246161 -8184583 -8121774 -8073254 -8025946 -7951183 -7887155 -7841199 -7808425 -7778635 -7736279 -7680543
8663g680543O2321L3163J0102J7414K9317K9665M6165N4504O7866N8927K7542
$$ -7680543 -7618222 -7585059 -7574957 -7557543 -7528226 -7498561 -7452396 -7397892 -7330026 -7271099 -7243557
8652g243557K1091J6340L3351M7431M3656O8159P4062N9390M3225O1709O1402
$$ -7243557 -7222466 -7206126 -7172775 -7125344 -7081688 -7013529 -6939467 -6880077 -6836852 -6775143 -6713741
8641f713741O5145O5275N6086O5054L5595O4436P8458O9874N0779J107q8711j72386
$$ -6713741 -6648596 -6583321 -6527235 -6462181 -6426586 -6362150 -6283692 -6213818 -6163039 -6161932 -6250643 -6423029
8629f423029j31629k8799K2695K9994K3251N3110M6879N6653O2967N2994L7390
$$ -6423029 -6554658 -6583457 -6560762 -6530768 -6507517 -6454407 -6407528 -6350875 -6287908 -6234914 -6197524
8618f197524M0506N9213N6043J9299j804J9934L7911L7098N4365M2470N2031M1984
$$ -6197524 -6157018 -6097805 -6041762 -6022463 -6024267 -6004333 -5966422 -5929324 -5874959 -5832489 -5780458 -5738474
8606e738474M797K1326N1730M9979K4674M0680N6972L9282L8149N4152O5734O1141
$$ -5738474 -5733677 -5712351 -5660621 -5610642 -5585968 -5545288 -5488316 -5449034 -5410885 -5356733 -5290999 -5229858
8594e229858N6271P5020P0757P7928J06611R6238O1343j4345j81398l55830l45673
$$ -5229858 -5173587 -5098567 -5027810 -4949882 -4843271 -4747033 -4685690 -4700035 -4881433 -5237263 -5582936
8583e582936j69100o0081l2782K0624J0723L8493M6197N6872L8526J4253K7415
$$ -5582936 -5752036 -5812117 -5844899 -5824275 -5813552 -5775059 -5728862 -5671990 -5633464 -5619211 -5591796
8572e591796J8217L5822L4137Q527K5901M0957L2448K7938L1578L0264K7986L351
$$ -5591796 -5573579 -5537757 -5503620 -5495093 -5469192 -5428235 -5395787 -5367849 -5336271 -5306007 -5278021 -5274670
8560e274670K7030L3283L2481K8923K9173J9477K5647N7731L7231K4739M8083
$$ -5274670 -5247640 -5214357 -5181876 -5152953 -5123780 -5104303 -5078656 -5020925 -4983694 -4958955 -4910872
8549d910872L7681K3396M5044M1323M9786O3641N6451J0312m6282j27031j50043
$$ -4910872 -4873191 -4849795 -4804751 -4763428 -4713642 -4650001 -4593550 -4583238 -4629520 -4756551 -4906594
8538d906594r2802k0150j0167K3288K6822M0859L4363J0750K3171N7115M2926
$$ -4906594 -4999396 -5019546 -5029713 -5006425 -4979603 -4938744 -4904381 -4893631 -4870460 -4813345 -4770419
8527d770419K4973J3098K1983J0840j690L4394L4105J9679J9061J6288J7434J0447
$$ -4770419 -4745446 -4732348 -4710365 -4699525 -4701215 -4666821 -4632716 -4613037 -4593976 -4577688 -4560254 -4549807
8515d549807K973K4487O049J3752J8599K6886K6989N429K8865K1447K8360J7168
$$ -4549807 -4546834 -4522347 -4516298 -4502546 -4483947 -4457061 -4430072 -4424643 -4395778 -4374331 -4345971 -4328803
8503d328803Q146N895J5411K8567K9320J4585q559K8727L3183l070j6910J477
$$ -4328803 -4320657 -4314762 -4299351 -4270784 -4241464 -4226879 -4235438 -4206711 -4173528 -4176598 -4193508 -4192031
8491d192031J3184J8127M4894J0181P440M3678L6195L3392K4954K9460K0712M2937
$$ -4192031 -4178847 -4160720 -4115826 -4105645 -4098205 -4054527 -4018332 -3984940 -3959986 -3930526 -3909814 -3866877
8479c866877M7734K1243l6836n8802j01874j04847n0050k9676J7992M0757J6649
$$ -3866877 -3819143 -3797900 -3834736 -3893538 -3995412 -4100259 -4150309 -4179985 -4161993 -4121236 -4104587
8468d104587N353K5367K3112J7509R982L2889L5358K6980K354l542J2492K3687
$$ -4104587 -4099234 -4073867 -4050755 -4033246 -4023264 -3990375 -3955017 -3928037 -3925683 -3929225 -3916733 -3893046
8456c893046L0143K5047J5238K4608J7937K8685J3087J3552J7651J1464J5557
$$ -3893046 -3862903 -3837856 -3822618 -3798010 -3780073 -3751388 -3738301 -3724749 -3707098 -3695634 -3680077
8445c680077K2628K9120M940J6766L8533L7748K3640L5846O3156O1304L8448M3939
$$ -3680077 -3657449 -3628329 -3623389 -3606623 -3568090 -3530342 -3506702 -3470856 -3407700 -3346396 -3307948 -3264009
8433c264009L8558k7092j32232k33682k18086j22658m8703M391K4118J6900L7529
$$ -3264009 -3225451 -3252543 -3384775 -3618457 -3836543 -3959201 -4007904 -4003513 -3979395 -3962495 -3924966
8422c924966L4573L1700K3539R141K7720K5955K7540K2188N820Q457L055m698
$$ -3924966 -3890393 -3858693 -3835154 -3826013 -3798293 -3772338 -3744798 -3722610 -3716790 -3708333 -3705278 -3709976
8410c709976J3971L9887L5491J5497K2445J2092K259J7909J3979L0446K3847J1048
$$ -3709976 -3696005 -3656118 -3620627 -3605130 -3582685 -3570593 -3568334 -3550425 -3536446 -3506000 -3482153 -3471105
8398c471105L098R869K1714K7381J1452J5913J7315L2272L5231J8131j631j0920
$$ -3471105 -3468007 -3458138 -3436424 -3409043 -3397591 -3381678 -3364363 -3332091 -3296860 -3278729 -3280360 -3291280
8386c291280o1847j02799q2063o7514k3661j1366K2597L4292K5273J3518L1069
$$ -3291280 -3353127 -3455926 -3537989 -3605503 -3629164 -3640530 -3617933 -3583641 -3558368 -3544850 -3513781
8375c513781L5984L3634L214M419n862o613K348J898J2638J9453J2074J3701J0662
$$ -3513781 -3477797 -3444163 -3440949 -3436530 -3442392 -3449005 -3446657 -3444759 -3432121 -3412668 -3400594 -3386893 -3376231
8362c376231p561N838K1195L2553J6580J3996N232J2409R81j4521l403J1787j073
$$ -3376231 -3383792 -3377954 -3356759 -3324206 -3307626 -3293630 -3288398 -3275989 -3275008 -3289529 -3292932 -3281145 -3282218
8349c282218P476J0916K6823k640J4588M04O361P575R16K0356J2418J0402k116
$$ -3282218 -3274742 -3263826 -3237003 -3239643 -3225055 -3224651 -3218290 -3210715 -3209799 -3189443 -3177025 -3166623 -3168739
8336c168739j5038L35J0677J6518R817J0910O760l467m307J7584J2527q346N392
$$ -3168739 -3183777 -3183442 -3172765 -3156247 -3146430 -3135520 -3128760 -3132227 -3136534 -3118950 -3106423 -3114769 -3109377
8323c109377K074R698Q629O399L1440M13j4507J4012M727j2339k613J8558J387
$$ -3109377 -3107303 -3097605 -3088976 -3082577 -3051137 -3050724 -3065231 -3051219 -3046492 -3058831 -3061444 -3042886 -3041499
8310c041499L0929J0969j347J0270j734P815P086j9307j9246j695K1359J1385
$$ -3041499 -3010570 -2999601 -3000948 -2990678 -2992412 -2984597 -2977511 -2996818 -3016064 -3017759 -2996400 -2985015
8298b985015L1758J7232J4795J3184j2535j222p268J6418K4515q67j8442j032
$$ -2985015 -2953257 -2936025 -2921230 -2908046 -2920581 -2921803 -2929071 -2912653 -2888138 -2889005 -2907447 -2908479
8286b908479N824P745J2628L917J9070K291J091J5664K0423j3632j2539J8399
$$ -2908479 -2902655 -2894910 -2882282 -2878365 -2859295 -2857004 -2855913 -2840249 -2819826 -2833458 -2845997 -2827598
8274b827598R377K623N121P340J1077k5313j0236k2123l0727m216L2896J8388
$$ -2827598 -2818221 -2815598 -2810477 -2803137 -2792060 -2817373 -2827609 -2849732 -2880459 -2884675 -2851779 -2833391
8262b833391K268P842L964m116l846J9656K1323M376m676l21J0937P169j81O648
$$ -2833391 -2831123 -2823281 -2819317 -2823433 -2827279 -2807623 -2786300 -2781924 -2786600 -2786921 -2775984 -2768815 -2768996 -2762348
8248b762348K4413m08j4415J5622Q660j341K5459J2884q476p445J6862J3841J81
$$ -2762348 -2737935 -2738343 -2752758 -2737136 -2728476 -2729817 -2704358 -2691474 -2699950 -2707395 -2690533 -2676692 -2676511
8235b676511Q735p102j829K0479j229k719K1726J0471q676k2853l1491J7238K3731
$$ -2676511 -2667776 -2674878 -2676707 -2656228 -2657457 -2660176 -2638450 -2627979 -2636655 -2659508 -2690999 -2673761 -2650030
8222b650030K0217M106m239J044K3768J407k966o861l900O578k881M389L628J6397
$$ -2650030 -2629813 -2625707 -2629946 -2628902 -2605134 -2603727 -2606693 -2613554 -2617454 -2610876 -2613757 -2609368 -2605740 -2589343
8208b589343P32j8033J2365J2245L408J3723K0187p866k101J546j361K737L84
$$ -2589343 -2588611 -2606644 -2594279 -2582034 -2578626 -2564903 -2544716 -2552582 -2554683 -2553137 -2554498 -2551761 -2551377
8195b551377L208K8466J509k760J1676L714j5195j4024j1083N492P839L7734J9473
$$ -2551377 -2548169 -2519703 -2518194 -2520954 -2509278 -2505564 -2520759 -2534783 -2545866 -2540374 -2532535 -2494801 -2475328
8182b475328n340l611j1001r381J7771J1898j861o947r457N744K3423K7764l251
$$ -2475328 -2480668 -2484279 -2495280 -2504661 -2486890 -2474992 -2476853 -2483800 -2493257 -2487513 -2464090 -2436326 -2439577
8169b439577j6474j5735M528r935k982Q136J9943J9101L266q467o91p013k0883
$$ -2439577 -2456051 -2471786 -2467258 -2477193 -2480175 -2472039 -2452096 -2432995 -2429729 -2438196 -2438887 -2445900 -2466783
8156b466783m238J4596J4149j0750M755J1052k433o520J742J1315J2523R693K2287
$$ -2466783 -2471021 -2456425 -2442276 -2453026 -2448271 -2437219 -2439652 -2446172 -2444430 -2433115 -2420592 -2410899 -2388612
8143b388612J1009J3190J5899Q156n138R996p961k7838o405r968J5743K0896l453
$$ -2388612 -2377603 -2364413 -2348514 -2340358 -2345496 -2335500 -2343461 -2371299 -2377704 -2387672 -2371929 -2351033 -2354486
8130b354486L651N479k200Q959L115j0989o553J054M0058L1020j0056N240J648
$$ -2354486 -2350835 -2345356 -2347556 -2338597 -2335482 -2346471 -2353024 -2351970 -2311912 -2280892 -2290948 -2285708 -2284060
8117b284060L73P769k193J998m482j3863k302q151j696J6446J4812M943k560K1226
$$ -2284060 -2283687 -2275918 -2278111 -2276113 -2280595 -2294458 -2296760 -2304911 -2306607 -2290161 -2275349 -2270406 -2272966 -2251740
8103b251740L227J8333J1725M226j8759k1615k6494q23k156J4385L8046J825q317
$$ -2251740 -2248513 -2230180 -2218455 -2214229 -2232988 -2254603 -2281097 -2281920 -2284076 -2269691 -2231645 -2229820 -2238137
8090b238137L605L404M162r147j241j1242j665J6239l86k1943M998K9070Q465
$$ -2238137 -2234532 -2231128 -2226966 -2236113 -2237354 -2248596 -2250261 -2234022 -2234408 -2256351 -2251353 -2222283 -2213818
8077b213818J3763K7041j4750q656M286j8854J932J4473m742J5944J8408M27r73
$$ -2213818 -2200055 -2173014 -2187764 -2196420 -2192134 -2210988 -2209056 -2194583 -2199325 -2183381 -2164973 -2164546 -2165519
8064b165519J1418j2176p239K9849J4560q011k763j765K165L1166L915j9661k2726
$$ -2165519 -2154101 -2166277 -2173516 -2143667 -2129107 -2137118 -2139881 -2141646 -2139481 -2108315 -2104400 -2124061 -2146787
8051b146787o201j2333k871K61O398L056M527J1950P808j2723j494L0218J2883
$$ -2146787 -2152988 -2165321 -2168192 -2167931 -2161533 -2158477 -2153950 -2142000 -2134192 -2146915 -2148409 -2118191 -2105308
8038b105308j0714J693J5853P45r139J385J342q320q918N719q791J2682j718j8664
$$ -2105308 -2116022 -2114329 -2098476 -2097731 -2106870 -2105485 -2104143 -2112463 -2121381 -2115662 -2124453 -2111771 -2113489 -2132153
8024b132153j0001J6831J3625k099J2598O358Q556o918M934q872N258K5559l836
$$ -2132153 -2142154 -2125323 -2111698 -2113797 -2101199 -2094841 -2086285 -2093203 -2088269 -2097141 -2091883 -2066324 -2070160
8011b070160o837K2688J0234j6371j7435o713J879J519K7191J0898J7857n980
$$ -2070160 -2076997 -2054309 -2044075 -2060446 -2077881 -2084594 -2082715 -2081196 -2054005 -2043107 -2025250 -2031230
7999b031230k9706j3443P117J2851J5635L3175J989q568J1269q297r409J783J1482
$$ -2031230 -2060936 -2074379 -2067262 -2054411 -2038776 -2005601 -2003612 -2012180 -2000911 -2009208 -2018617 -2016834 -2005352
7986b005352R746j5544n5128j3897P844r093j0821q120j0163M958P500K3923j1910
$$ -2005352 -1995606 -2011150 -2066278 -2080175 -2072331 -2081424 -2092245 -2100365 -2110528 -2105570 -2098070 -2074147 -2086057
7973b086057J220J2248O406J4156M959j377j7764j8111J8523K6765j537r900Q25
$$ -2086057 -2084837 -2072589 -2066183 -2052027 -2047068 -2048445 -2066209 -2084320 -2065797 -2039032 -2040569 -2050469 -2049644
7960b049644j1400k145J8837J7334J2985O846l06o877J113J9075j5327L046K5481
$$ -2049644 -2061044 -2063189 -2044352 -2027018 -2014033 -2007187 -2007493 -2014370 -2013257 -1994182 -2009509 -2006463 -1980982
7947a980982R190J6481n030j2725m4352r949K6102l703M091j9475j3804M823j44
$$ -1980982 -1971792 -1955311 -1960341 -1973066 -2017418 -2027367 -2001265 -2004968 -2000877 -2020352 -2034156 -2029333 -2029477
7934b029477l0387j4245p618J5911J8613J3977K275l998k92J4561k616L554j0475
$$ -2029477 -2059864 -2074109 -2081727 -2065816 -2047203 -2033226 -2030951 -2034949 -2035241 -2020680 -2023296 -2019742 -2030217
7921b030217n226l805M443Q553Q862J5921J8080n21j0613r527j4911r317J5119
$$ -2030217 -2035443 -2039248 -2034805 -2026252 -2017390 -2001469 -1983389 -1983910 -1994523 -2004050 -2018961 -2028278 -2013159
7908b013159J5778n983m343J084J253k28Q744O38j048J309J9l769R829J2339J103
$$ -2013159 -1997381 -2003364 -2007707 -2006623 -2005370 -2005598 -1996854 -1996216 -1997264 -1995955 -1995936 -1999705 -1989876 -1977537 -1976434
7893a976434j8023q006J9619n839n101K3084O413Q99K0753J177k96J9618J5452
$$ -1976434 -1994457 -2002463 -1982844 -1988683 -1993784 -1970700 -1964287 -1963388 -1942635 -1941458 -1941754 -1922136 -1906684
7880a906684n646j7281K397j8428p669l065L0540J1099j1915q920L948k569r442
$$ -1906684 -1912330 -1929611 -1927214 -1945642 -1953311 -1956376 -1925836 -1914737 -1926652 -1935572 -1931624 -1934193 -1943635
7867a943635N308P212P362j785J2728K974Q32m757j9128L13j7146J35J0511K1254
$$ -1943635 -1938327 -1931115 -1923753 -1925538 -1912810 -1909836 -1909004 -1913761 -1932889 -1932576 -1949722 -1949587 -1939076 -1917822
7853a917822m694p323J7967P608r830J2245j519R702R155o525J8589O56j922J9307
$$ -1917822 -1922516 -1929839 -1911872 -1904264 -1914094 -1901849 -1903368 -1893666 -1884511 -1891036 -1872447 -1871791 -1873713 -1854406
7839a854406m165l473j7429j9786M002J2122O20J0293l06J3288J595l96q276j9713
$$ -1854406 -1858571 -1862044 -1879473 -1899259 -1895257 -1883135 -1882515 -1872222 -1872528 -1859240 -1857645 -1858041 -1866317 -1886030
7825a886030R132J0463p409j2716K955p854m403K8101P280J4398N92M062p088
$$ -1886030 -1876898 -1866435 -1873844 -1886560 -1883605 -1891459 -1895862 -1867761 -1860481 -1846083 -1845491 -1841429 -1848517
7812a848517j9486L952J2274J936%j6284O331J7219j1786j458R396K542l528O820
$$ -1848517 -1868003 -1864051 -1851777 -1849841 -1849841 -1866125 -1859794 -1842575 -1854361 -1855819 -1846423 -1843881 -1847409 -1840589
7798a840589j3032Q292Q573q652r925k149J0363P630N568p69p886M670K0133L4055
$$ -1840589 -1853621 -1845329 -1836756 -1845408 -1855333 -1857482 -1847119 -1839489 -1833921 -1834690 -1842576 -1837906 -1817773 -1783718
7784a783718j695k8402k4093j591R661J6818P873p225J1252J7898p599N397M650
$$ -1783718 -1785413 -1813815 -1837908 -1839499 -1829838 -1813020 -1805147 -1812372 -1801120 -1783222 -1790821 -1785424 -1780774
7771a780774o142J092J7634j107q841j6026k4780n079P788O767P348J1675J1459
$$ -1780774 -1786916 -1785824 -1768190 -1769297 -1778138 -1794164 -1818944 -1824023 -1816235 -1809468 -1802120 -1790445 -1778986
7758a778986q014j4098k2113p316K4950K6840O21j5173P760R268R357J0479j0643
$$ -1778986 -1787000 -1801098 -1823211 -1830527 -1805577 -1778737 -1778116 -1793289 -1785529 -1776261 -1766904 -1756425 -1767068
7745a767068k207J1408k063P69j5718J0975J8836j5k1257q659L480L94M753N461
$$ -1767068 -1769275 -1757867 -1759930 -1759161 -1774879 -1763904 -1745068 -1745083 -1766340 -1774999 -1771519 -1771125 -1766372 -1760911
7731a760911J7091P027M163K014k256l385M949j5899l258J1055N758Q153J2968
$$ -1760911 -1743820 -1736793 -1732630 -1730616 -1732872 -1736257 -1731308 -1747207 -1750465 -1739410 -1733652 -1725499 -1712531
7718a712531q99K347L095J375j4828M031L064j684m388p74q026r681N2K8117P345
$$ -1712531 -1713430 -1711083 -1707988 -1706613 -1721441 -1717410 -1714346 -1716030 -1720418 -1721192 -1729218 -1738899 -1738847 -1710730 -1703385
7703a703385M219N414l671j2956o364N424k875K102N619P832J3266j2527K648
$$ -1703385 -1699166 -1693752 -1697423 -1710379 -1716743 -1711319 -1714194 -1712092 -1706473 -1698641 -1685375 -1697902 -1695254
7690a695254K389q048J9237m723j1313j6600J7224K2097P661J004j0672O128M032
$$ -1695254 -1692865 -1700913 -1681676 -1686399 -1697712 -1714312 -1697088 -1674991 -1667330 -1666326 -1676998 -1670870 -1666838
7677a666838r817O70J1300P34j2974j887K180M895R526K84j4376M442m060j3807
$$ -1666838 -1676655 -1675985 -1664685 -1663951 -1676925 -1678812 -1676632 -1671737 -1662211 -1661927 -1676303 -1671861 -1675921 -1689728
$$ [...]
##END NTUPLES=NMR SPECTRUM
##END=
