##TITLE=Analysis number 312842
Compound Code cc 09101
Project Code adrs
Chemist Name fudan
##JCAMPDX= 6.0         $$ Bruker NMR JCAMP-DX V2.0
##DATA TYPE= NMR SPECTRUM
##DATA CLASS= NTUPLES
##ORIGIN= Bruker BioSpin GmbH
##OWNER= NMR
$$ XWIN-NMR		Version 3.5
$$ Tue Aug 16 08:45:00 2005 GMT Daylight Time (UT+1h)  MAYBRIDGE\NMR@NMR_250MHZ
##.OBSERVE FREQUENCY= 250.131544655141
##.OBSERVE NUCLEUS= ^1H
##.ACQUISITION MODE= SIMULTANEOUS (DQD)
##.ACQUISITION SCHEME= undefined
##.AVERAGES= 16
##.DIGITISER RES= 18
##SPECTROMETER/DATA SYSTEM= dpx250
##.PULSE SEQUENCE= zg30
##.SOLVENT NAME= DMSO
##.SHIFT REFERENCE= (INTERNAL, DMSO, 0, 16.522)
##AUDIT TRAIL= $$ (NUMBER, WHEN, WHO, WHERE, WHAT)
$$ ##TITLE= Audit trail, XWIN-NMR		Version 3.5
$$ ##JCAMPDX= 5.01
$$ ##ORIGIN= Bruker BioSpin GmbH
$$ ##OWNER= NMR
$$ C:\u/data/dgb/nmr/ADRS/7980/pdata/1/auditp.txt
$$ ##AUDIT TRAIL=  $$ (NUMBER, WHEN, WHO, WHERE, WHAT)
(   1,<2005-08-16 08:44:22.23 +100>,<MAYBRIDGE\NMR>,<NMR_250MHZ>,
      <created by zg, POWCHK disabled, PULCHK disabled
       configuration hash MD5:
       62 19 C7 07 E1 42 D1 B7 37 6C 3D D0 77 39 F9 E6
       data hash MD5: 64K
       FB 7F DE A6 67 F8 01 C8 C2 9E 13 77 49 96 60 18>)
(   2,<2005-08-16 08:44:36.85 +100>,<MAYBRIDGE\NMR>,<NMR_250MHZ>,
      <Start of raw data processing
       ef LB = 0.3 FT_mod = 6 PKNL = 1 SI = 32K 
       data hash MD5: 32K
       62 95 40 10 24 29 A3 AD B2 66 2E 7F 94 1F 41 9E>)
(   3,<2005-08-16 08:44:42.40 +100>,<MAYBRIDGE\NMR>,<NMR_250MHZ>,
      <apk 
       data hash MD5: 32K
       12 FD 9C 79 29 EC FD 6D E8 2B F8 AD F2 49 01 DD>)
(   4,<2005-08-16 08:44:44.31 +100>,<MAYBRIDGE\NMR>,<NMR_250MHZ>,
      <abs ABSG = 5 
       data hash MD5: 32K
       CF 68 5C F6 F3 C8 2C 49 26 32 60 E4 7B C2 F6 D6>)
$$ ##END=
$$ 
$$ hash MD5
$$ 7E 1E 99 A0 84 61 E8 3B 2D D1 90 C0 9B 8D 8A 25
##$RELAX= 
##$RELAX= 
##$RELAX= 
##$RELAX= 
##$RELAX= 
##$RELAX= 
##$RELAX= 
$$ Bruker specific parameters
$$ --------------------------
##$DU= <C:\u>
##$EXPNO= 7980
##$NAME= <ADRS>
##$PROCNO= 1
##$TYPE= <nmr>
##$USER= <dgb>
##$AMP= (0..31)
100 100 100 100 100 100 100 100 100 100 100 100 100 100 100 100 100 100 
100 100 100 100 100 100 100 100 100 100 100 100 100 100 
##$AQSEQ= 0
##$AQ_mod= 3
##$AUNM= <au_zg>
##$AUTOPOS= <2 >
##$BF1= 250.13
##$BF2= 250.13
##$BF3= 250.13
##$BF4= 250.13
##$BF5= 500.13
##$BF6= 500.13
##$BF7= 500.13
##$BF8= 500.13
##$BYTORDA= 1
##$CFDGTYP= 0
##$CFRGTYP= 5
##$CHEMSTR= <none>
##$CNST= (0..31)
1 1 145 1 1 1 1 1 1 1 1 1 1 1 1 1 1 1 1 1 1 1 1 1 1 1 1 1 1 1 1 1 
##$CPDPRG= <>
##$CPDPRG1= <>
##$CPDPRG2= <>
##$CPDPRG3= <>
##$CPDPRG4= <mlev>
##$CPDPRG5= <mlev>
##$CPDPRG6= <mlev>
##$CPDPRG7= <mlev>
##$CPDPRG8= <mlev>
##$CPDPRGB= <>
##$CPDPRGT= <>
##$D= (0..31)
0 1 0 0 0 0 0 0 0 0.06 0 0 0 0 0 0 0.0002 0 0 0 0 0 0 0 0 0 0 0 0 0 0 
0 
##$DATE= 1124178260
##$DBL= (0..7)
120 120 120 120 120 120 120 120 
##$DBP= (0..7)
150 150 150 150 150 150 150 150 
##$DBP07= 0
##$DBPNAM0= <>
##$DBPNAM1= <>
##$DBPNAM2= <>
##$DBPNAM3= <>
$$ [...]
##$SUBNAM7= <"">
##$SUBNAM8= <"">
##$SUBNAM9= <"">
##$SW= 20.6930455092707
##$SWIBOX= (0..15)
0 0 3 0 0 0 0 0 0 0 0 0 0 0 0 0 
##$SW_h= 5175.983436853
##$TD= 65536
##$TD0= 1
##$TE= 295.16
##$TE2= 300
##$TE3= 300
##$TEG= 300
##$TL= (0..7)
0 120 120 120 120 120 120 120 
##$TP= (0..7)
150 150 150 150 150 150 150 150 
##$TP07= 0
##$TPNAME0= <>
##$TPNAME1= <>
##$TPNAME2= <>
##$TPNAME3= <>
##$TPNAME4= <>
##$TPNAME5= <>
##$TPNAME6= <>
##$TPNAME7= <>
##$TPOAL= (0..7)
0.5 0.5 0.5 0.5 0.5 0.5 0.5 0.5 
##$TPOFFS= (0..7)
0 0 0 0 0 0 0 0 
##$TUNHIN= 0
##$TUNHOUT= 0
##$TUNXOUT= 0
##$USERA1= <user>
##$USERA2= <user>
##$USERA3= <user>
##$USERA4= <user>
##$USERA5= <user>
##$V9= 5
##$VALIST= <valist>
##$VCLIST= <CCCCCCCCCCCCCCC>
##$VD= 0
##$VDLIST= <DDDDDDDDDDDDDDD>
##$VPLIST= <PPPPPPPPPPPPPPP>
##$VTLIST= <TTTTTTTTTTTTTTT>
##$WBST= 1024
##$WBSW= 4
##$XGAIN= (0..3)
0 0 0 0 
##$XL= 0
##$YL= 0
##$YMAX_a= 367472
##$YMIN_a= -266783
##$ZGOPTNS= <>
##$ZL1= 120
##$ZL2= 120
##$ZL3= 120
##$ZL4= 120
##$ABSF1= 16.522
##$ABSF2= -4.171173
##$ABSG= 5
##$ABSL= 3
##$ALPHA= 0
##$AQORDER= 0
##$ASSFAC= 0
##$ASSFACI= 0
##$ASSFACX= 0
##$ASSWID= 0
##$AUNMP= <proc_1d>
##$AZFE= 0.1
##$AZFW= 0.1
##$BCFW= 0
##$BC_mod= 0
##$BYTORDP= 0
##$COROFFS= 0
##$CY= 12.5
##$DATMOD= 1
##$DC= 0
##$DFILT= <>
##$DTYPP= 0
##$F1P= 14.0000005364418
##$F2P= -0.99999901652339
##$FCOR= 0.5
##$FTSIZE= 32768
##$FT_mod= 6
##$GAMMA= 0
##$GB= 0
##$INTBC= 1
##$INTSCL= 1
##$ISEN= 128
##$LB= 0.3
##$LEV0= 0
##$LPBIN= 0
##$MAXI= 10000
##$MC2= 0
##$MEAN= 0
##$ME_mod= 0
##$MI= 0
##$NCOEF= 0
##$NC_proc= -5
##$NLEV= 6
##$NOISF1= 0
##$NOISF2= 0
##$NSP= 0
##$NTH_PI= 0
##$NZP= 0
##$OFFSET= 16.522
##$PC= 1
##$PHC0= -86.71569
##$PHC1= 11.63847
##$PH_mod= 1
##$PKNL= yes
##$PPARMOD= 0
##$PSCAL= 4
##$PSIGN= 0
##$REVERSE= no
##$SF= 250.13
##$SI= 32768
##$SIGF1= 0
##$SIGF2= 0
##$SINO= 400
##$SIOLD= 32768
##$SREGLST= <1H.DMSO>
##$SSB= 0
##$STSI= 32768
##$STSR= 0
##$SW_p= 5175.98343685301
##$SYMM= 0
##$S_DEV= 0
##$TDeff= 65536
##$TDoff= 0
##$TI= <Analysis number 999999
Compound Code 99
Book Reference 9
Project Code 9>
##$TILT= no
##$TM1= 0
##$TM2= 0
##$TOPLEV= 0
##$USERP1= <user>
##$USERP2= <user>
##$USERP3= <user>
##$USERP4= <user>
##$USERP5= <user>
##$WDW= 1
##$XDIM= 32768
##$YMAX_p= 356297909
##$YMIN_p= -961787
$$ End of Bruker specific parameters
$$ ---------------------------------
##NTUPLES= NMR SPECTRUM
##VAR_NAME=  FREQUENCY,     SPECTRUM/REAL,   SPECTRUM/IMAG
##SYMBOL=    X,             R,               I
##VAR_TYPE=  INDEPENDENT,   DEPENDENT,       DEPENDENT
##VAR_FORM=  AFFN,          ASDF,            ASDF
##VAR_DIM=   32768,         32768,           32768
##UNITS=     HZ,            ARBITRARY UNITS, ARBITRARY UNITS
##FACTOR=    0.157963299565203, 1,           1
##FIRST=     4132.6476996994, 0,             0
##LAST=      -1043.33573715361, 0,           0
##MIN=       -1043.33573715361, -961787,     0
##MAX=       4132.6476996994, 356297909,     0
$$ Real data points
##PAGE= N=1
##DATA TABLE= (X++(R..R)), XYDATA
$$ [...]
15622A89227J10723J6474k95348k01507K58809l6617l04519J5257l22002J17285
15612d52218J40244J23268J04669R3362r0525m6372k00389K7493Q1968j39593
15602c58093J38957J72018l8426m942J24464J18246k51507j09373m6349j47850
15592d02855J24154K28671j33969L6759J60021q543K61363q684q1856l2356q5395
15581E7310O9947K28545p2377j54988j60424p0270O2541r53L356l6103J29794
15570E6378J956L7995o1516k30519k7477N9263j38064r0182J12955J7497J10272
15559a51442J00928L7901L8839j36748j66115K23777J27009J23919J66637l33169
15549C1536k92869M8656J48602J65450j92217J55087K8168j20561j04125K0261
$$ plain form
15622 189227 299950 316424 21076 -180431 78378 41761 -262758 -247501 -569503 -452218
15612 -452218 -311974 -188706 -84037 9325 -81200 -127572 -327961 -300468 -218500 -358093
15602 -358093 -219136 -47118 -85544 -90486 33978 152224 -99283 -208656 -255005 -402855
15592 -402855 -278701 -50030 -183999 -147240 12781 4238 265601 256917 175061 142705 57310
15581 57310 127257 355802 283425 128437 -31987 -102257 -39716 -40669 -37313 -73416 56378
15570 56378 58334 96329 34813 -195706 -223183 -163920 -301984 -392166 -279211 -261714 -151442
15559 -151442 -50514 -12613 26226 -110522 -276637 -52860 74149 198068 364705 31536
15549 31536 -261333 -212677 -64075 101375 -90842 64245 92413 -28148 -132273 -112012
15539a12012q9786L2948J49590P758m1425p3016n67P7378j82895L3332R4839j67311
15527b71167L3467J36406L944l7433j7878J84913j12641j25468J31235j4045J03334
15516A4667k5133N5836q1601J01098K7709L6000n0432P9175J47549K4299j32523
15505A96644j35757p417Q9250m4555q6249n851J62841r6650J43779r509j22034
15494H4492J01887j19531J09261N5164n1511j56930l57495M8190K72747R4465
15484H0739P1666k2344j74039j00310K1142j22683L9897O8272J0650j14965p8604
15473c20579m5935K2607K55624N4746K6076J13937m8734k60061l7502K40342R0394
15462I0915j3138j70772l0641k2579J3813J37476k03816k65854L0051M03924K40113
$$ plain form
15539 -112012 -201798 -168850 -19260 -11502 -52927 -125943 -126510 -49132 -232027 -198695 -103856 -271167
15527 -271167 -237700 -101294 -97350 -134783 -152661 32252 -80389 -205857 -74622 -88667 14667
15516 14667 -10466 45370 -36231 64867 92576 128576 78144 157319 304868 329167 196644
15505 196644 60887 53470 142720 98165 11916 6065 168906 72256 216035 206526 84492
15494 84492 186379 66848 176109 231273 179762 22832 -334663 -286473 -13726 80739
15484 80739 152405 130061 -43978 -144288 -123146 -245829 -205932 -137660 -127010 -241975 -320579
15473 -320579 -366514 -343907 -88283 -33537 -7461 106476 57742 -202319 -239821 521 90915
15462 90915 77777 -92995 -123636 -146215 -132402 5074 -198742 -464596 -434545 -30621 209492
15451B09492k04977P5381K07462q4320j51415J9511j36131k01608m0366K59474
15441d7497J26163q3053M5926O0902q7555J8555j17506k00088l3772K06883M3252
15430f7790k53525L7402K51589o4578R0799p7207m3183P5970N7995R3829J65332
15419B66633L5385l25149j24917j85552j76728j04395L8812R7085K15288J28804
15409a34734K21946K16517j18387m405J4389n8065j67972k16306j8390M4248M3951
15398a77208K13570Q3598J16813O9247k26208j29826j155N3544j25008J71620
15388D8987L9561q8931k00971j73512K06972J32439L4088k0326o6562J28085M9078
15377H8908k1l34059k96684j87232K09762L17466m0282L8080k7016Q3496L31188
$$ plain form
15451 209492 4515 79896 287358 203038 51623 71134 -64997 -266605 -306971 -47497
15441 -47497 78666 -4387 41539 102441 14886 33441 -84065 -284153 -317925 -111042 -67790
15430 -67790 -321315 -283913 -32324 -96902 -6103 -83310 -126493 -50523 7472 101301 266633
15419 266633 302018 -23131 -148048 -333600 -510328 -614723 -575911 -478826 -263538 -134734
15409 -134734 87212 303729 185342 180937 195326 137261 -30711 -247017 -265407 -221159 -177208
15398 -177208 36362 119960 236773 306020 79812 -50014 -51169 2375 -122633 48987
15388 48987 88548 -383 -201354 -374866 -167894 -35455 -1367 -21693 -88255 39830 88908
15377 88908 88887 -245172 -541856 -729088 -519326 -201860 -242142 -204062 -231078 -147582 183606
15366A83606J03341k45622k24146j58303j46602N0846K06906O8007q6645k7381
15356b75993J48362K87305n558n5482k24338k06437p0222N3343J5795O9447J07961
15345a55817K97324J17856j20919j06380j44374j60412k9081J87604N1806j37883
15335b00276j8320J44138J50122L0663k69968j08421Q2133P3148k90663m1032
15325d48476J12571R4541O2631N7717K0868l2356J37476J34374j65726j07246
15315a33626j09750j65779O1351p0559J06173Q3477N4843R2278J04746J6658k2479
15304A7333o9425j6349k2450O9119M20732J31994P2202k39122k41000j65761k23001
15293b65728J16874j7795j5184J42725j5851q4452L9740K7953p4409j19238m1057
$$ plain form
15366 183606 286947 41325 -182821 -341124 -487726 -436880 -229974 -161967 -248612 -275993
15356 -275993 -127631 159674 154116 98634 -125704 -332141 -402363 -349020 -333225 -263778 -155817
15345 -155817 141507 259363 138444 32064 -112310 -272722 -301803 -114199 -62393 -200276
15335 -200276 -218596 -74458 75664 106327 -163641 -272062 -189929 -116781 -407444 -448476
15325 -448476 -335905 -241364 -178733 -121016 -100148 -132504 4972 139346 -26380 -133626
15315 -133626 -243376 -409155 -347804 -418363 -312190 -228713 -173870 -81592 23154 39812 17333
15304 17333 -52092 -68441 -90891 -21772 398960 530954 603156 364034 123034 -42727 -265728
15293 -265728 -148854 -166649 -181833 -39108 -54959 -139411 -99671 -71718 -146127 -265365 -306422
15282c06422k5718K23986J45174j24019m5781N1582k0024J8057N9972O4807j46606
15271a04992j23643r0913j06855L04655K35470j46475l8276Q7579P8879K4257
15261A19686K7679j14346k31973n1667P192j1546J49292P7554J05190L3779j50557
15250c9717m13l7559R0218J81835k44288o9847j86864j8500o8047J11317L51356
15239F9491J27065p7769j22471J2010J04537q5452k57453K0145k348j43001j68448
15228e23694K5206J34154K65463J88349j40010k2064l6211j8031J43515n3993
15218c7316K39355O6351j5411p5968q2760j61218m6716O2610P8141j24959J6571
15207h1320j22899j46803j0256K3909L9534J83454J73796K0939k18771j77352
$$ plain form
15282 -306422 -332140 -108154 37020 -86999 -132780 -81198 -101222 -83165 -23193 41614 -104992
15271 -104992 -228635 -319548 -426403 -121748 113722 -32753 -71029 16550 95429 119686
15261 119686 147365 33019 -198954 -250621 -243429 -254975 -105683 -28129 77061 110840 -39717
15250 -39717 -40130 -77689 12529 194364 -49924 -119771 -306635 -325135 -393182 -281865 69491
15239 69491 196556 118787 -3684 8326 112863 27411 -230042 -209897 -212245 -355246 -523694
15228 -523694 -498488 -364334 -98871 89478 -50532 -72596 -108807 -126838 16677 -37316
15218 -37316 202039 268390 252979 177011 94251 -66967 -113683 -51073 27068 -97891 -81320
15207 -81320 -204219 -351022 -361278 -337369 -297835 -114381 59415 80354 -138417 -315769
15197c15769J21721L7029J7614j8701q6120j88680J67388K16008R2060j05996
15187f3446O4384K69380j21373m13227k99139j30238L08851L09616J66396Q615
15177I9819j03379k25608k22121j76346P4078o7581L52774K52142j49109K25250
15167E9919j34394k15544q8238K06197K17035j56017J16846N1087l6524j0589
15157I778K87798J00686j23782o5967K9861j28475k9277O0439O3324k9424N9346
15146B34307j9457p3534l45385m41965l15753J29306J31187K56348K1219L59887
15136f3840J58402K9693k4779r6621k47830j003M9359n9761l9364p8803J13207
15125b61340P587j14262R8764J28659J58970J80780J01989k0120J00746L1670
$$ plain form
15197 -315769 -194048 -157019 -139405 -158106 -244226 -432906 -265518 -49510 42550 -63446
15187 -63446 938 270318 148945 -264282 -563421 -693659 -384808 -75192 91204 99819
15177 99819 -3560 -229168 -451289 -627635 -553557 -621138 -268364 -16222 -165331 59919
15167 59919 -74475 -290019 -378257 -172060 44975 -111042 5804 56891 20367 9778
15157 9778 297576 398262 274480 208513 238374 109899 80622 141061 204385 174961 234307
15146 234307 214850 141316 -204069 -646034 -961787 -832481 -701294 -444946 -423727 -63840
15136 -63840 94562 124255 99476 2855 -244975 -245978 -196619 -256380 -295744 -374547 -261340
15125 -261340 -253753 -368015 -269251 -140592 18378 199158 301147 281027 381773 413443
15115D13443J92793k32851j87571Q284j03196j5894R7317j18214j16385j99035
15105b61309j6438J11681J20399J85418j08177p6272j73370j37012J88736Q4145
15095h2199n3762q3938r251n6237P7540k3807j592L40035j29144r6203J13327
15084e231J64326m8603j57446r1461N4316J06454N087J19220R059r8943r0791
15073c4013k3202p2466k23025J06854J76617L150J02201J38013j1676J26417j76774
15062A12096m7164j69274J38721n1735j14681L8626l581K65780K77942o4333k1414
15051C60983j32792l31107j33129K8078k8812J63840J13877K39780n6950l63117
15041a39349q7519K04044O2659o652m3157p6585j51585q8404J0464q7909j75545
$$ plain form
15115 413443 606236 373385 185814 194098 90902 75008 172325 54111 -62274 -261309
15105 -261309 -277747 -166066 -45667 139751 31574 -44698 -218068 -355080 -166344 -82199
15095 -82199 -135961 -219899 -229150 -285387 -207847 -231654 -233246 106789 -22355 -118558 -5231
15084 -5231 159095 110492 -46954 -138415 -84099 22355 27442 146662 155721 56778 -34013
15073 -34013 -57215 -129681 -352706 -245852 -69235 -66085 36116 174129 162453 288870 112096
15062 112096 64932 -104342 34379 -17356 -132037 -93411 -96992 168788 446730 382397 360983
15051 360983 228191 -102916 -236045 -207967 -236779 -72939 40938 280718 223768 -139349
15041 -139349 -226868 -22824 39835 33183 -9974 -86559 -238144 -326548 -316084 -403993 -579538
15030e79538J28096L15262K84538Q8666j76785j26593L3273j1474j980L1296K21937
15019B06698o5397r0778l2886j88934j52483K31664m7366q4311P0861p4879j89128
15008d16939n6930L14195K26716q5244m0258l8060K11117q2252j26909R0128o300
14997a0736O9479q9242k34898R4679K3490Q5474P3988k08957N168J37040j70782
14986b25297J1389O3771J24599j9622O5384n8451k33359N535J76765q6716m4724
14975b20726n3231k3228J6646J05567L35587l9057k60840l38097m443L5044K62046
14964a84732K42113J36972n0883k2671j77263L8408R267m02825J34674K49544
14954b7396j87961k3500L6219J79158p037m7832p5205R3748l3906n7628q5330
$$ plain form
15030 -579538 -451442 -136180 148358 237024 60239 -66354 -33081 -44555 -46535 -15239 206698
15019 206698 141301 50523 17637 -171297 -323780 -92116 -139482 -223793 -152932 -227811 -416939
15008 -416939 -473869 -159674 67042 -18202 -58460 -96520 114597 32345 -94564 -4436 -10736
14997 -10736 58743 -30499 -265397 -170718 -147228 -61754 12234 -196723 -191555 -54515 -225297
14986 -225297 -213908 -150137 -25538 -45160 20224 -38227 -271586 -266051 -89286 -176002 -220726
14975 -220726 -273957 -297185 -280539 -174972 160615 121558 -139282 -477379 -481822 -446778 -184732
14964 -184732 57381 194353 143470 120799 -56464 -18056 -8789 -411614 -276940 -27396
14954 -27396 -215357 -238857 -202638 -23480 -30517 -78349 -153554 -59806 -93712 -151340 -236670
14943b36670P5748J97855p9954m5131l2498q1742P3116J37112N4013J307j24114
14932f0958k13950j59055J58387K26488K0246J22218M9150j15648j51374J18098
14922f398l0551J16341K4487k49398j07920r307N5226K87398R0270k87409L7771
14911g9490K25895N0965j61335J21732k55636l52925m98J64287K70330J74900
14901A58225k4114r0780J59882R7163J44883q4487r9802l79446r9137Q1752O2682
14890g3179K08067R8166j27030j25580l4824J58753n1862m1297J69377J44058
14880C24649m4530n17949k08198r0059R3594K12441M0523J16746L63954j71325
14870A19846j69839J47752J3650q9136J7703k14844k02770K15524J10715j61408
$$ plain form
14943 -236670 -160922 36933 -43021 -88152 -120650 -202392 -129276 7836 61849 63156 -60958
14932 -60958 -274908 -433963 -275576 -49088 -28842 93376 142526 26878 -124496 -6398
14922 -6398 -36949 79392 103879 -145519 -253439 -262746 -207520 79878 170148 -117261 -79490
14911 -79490 146405 197370 36035 157767 -97869 -450794 -451292 -287005 -16675 158225
14901 158225 134111 43331 203213 300376 445259 360772 260970 -118476 -217613 -135861 -73179
14890 -73179 134888 233054 106024 -19556 -54380 104373 52511 11214 180591 324649
14880 324649 280119 -237830 -446028 -536087 -442493 -230052 -189529 -72783 291171 119846
14870 119846 -49993 97759 111409 22273 39976 -174868 -377638 -162114 -51399 -212807
14860b12807j54950N1947J02431J35870q1881j38636k98287J57558P4800m2499
14850d06454K9896J54099K77358J31171o3795k63334K15268n7749r5982J81928
14840A02406K19175K7642j50339k80601J53721J82696k9081k40429j16469M2379
14830h8900j45503k3195P5530J6814P7719l3607j53534j09936k52359j86434J66614
14819f56791L44278L21524J628N3214J69122p2939L5640p9951o5300j10824n8511
14808a18910j86693j96110m7876L8575J35675M3390m7771K85566J45338k58438
14798b07254j85212L933r818J13404L18805N7456r3280o2196p2987j45518j28469
14787d11136J1308J54442K33491m6054r0196j03745r3084K14014L4823j95243
$$ plain form
14860 -212807 -367757 -315810 -213379 -77509 -159390 -298026 -596313 -438755 -363955 -406454
14850 -406454 -376558 -222459 54899 186070 122275 -141059 74209 16460 -79522 102406
14840 102406 321581 349223 198884 -81717 72004 254700 225619 -14810 -131279 -88900
14830 -88900 -234403 -257598 -182068 -165254 -87535 -121142 -274676 -384612 -636971 -823405 -656791
14819 -656791 -312513 9011 10639 63853 232975 160036 195676 115725 50425 -60399 -118910
14808 -118910 -305603 -501713 -549589 -511014 -375339 -331949 -379720 -94154 51184 -207254
14798 -207254 -392466 -388533 -398351 -284947 33858 91314 -1966 -64162 -137149 -282667 -411136
14787 -411136 -399828 -245386 -11895 -57949 -148145 -251890 -344974 -130960 -96137 -291380
14777b91380K07837J29666l2453j3246o7567M0242J1754K0188Q4897J8407J1036
14766A19381j06438J20396l2380l49275o16o9926K25656N7239l3048J62312K44708
14755C38009n1400j42098L2948O186j35060j72037j05593p5007K6390J53266j94817
14744c19213J07746J58003J02378R2944j24325j79564k44196J41082K36058J33689
14734A04602r2408M3154j06982K06671O1814q943j66755k43711O9214P8484j51112
14723b05972p3748L4457p895K57888J96348j00275m0765O4655n105m4879j29626
14712e4917j65148o2694k03765L9062K45158J44778k0967K74503o3459J00227
14702B32778J59808J27804k15380k61687j02996Q5855J5797j63459j17987p6602
$$ plain form
14777 -291380 -83543 46123 13670 424 -67143 -26901 -15147 5041 89938 108345 119381
14766 119381 12943 133339 100959 -248316 -248932 -318858 -93202 -35963 -69011 93301 338009
14755 338009 286609 144511 177459 183645 48585 -123452 -229045 -304052 -277662 -124396 -319213
14744 -319213 -211467 -53464 48914 141858 17533 -162031 -406227 -265145 -29087 104602
14734 104602 12194 55348 -51634 155037 216851 207908 41153 -202558 -133344 -54860 -205972
14723 -205972 -279720 -245263 -253158 4730 201078 100803 60038 124693 119588 74709 -54917
14712 -54917 -220065 -282759 -486524 -447462 -202304 -57526 -78493 196010 132551 232778
14702 232778 392586 520390 305010 43323 -59673 26182 41979 -121480 -239467 -316069
14692c16069J60913J14292K1876k61228j40008M00575j48243M3498P5579j19203
14682a68018Q1522O5791O8859J71359O8809k11009k97414k0141K87196J94976
14672B41930O6937J04365j76520j21056q1386P3811l3005p0127p5379p6103J1264
14661a35269j19889r4406J44276m921j34258j33632P3753j136M8976Q9918N3516
14650b13072L9362J71931J18427j61169j91799j48367R1644J40311O943K54977
14640A09188n6903k53511p2525m8551J42017K39066J45390j00644j60316R2283
14630C5494j62304M839N566J09775J68271k04295L7407k2624O9533J51264O3296
14619B56222o6737k92780l36607l1053O6551n64O5340Q2724N0704j07185m4195
$$ plain form
14692 -316069 -155156 -40864 -18988 -280216 -420224 -19649 -167892 -124394 -48815 -168018
14682 -168018 -86496 -20705 48154 219513 288322 77313 -220101 -240242 46954 241930
14672 241930 308867 413232 236712 115656 34270 108081 75076 4949 -70430 -146533 -135269
14661 -135269 -255158 -349564 -205288 -210209 -344467 -478099 -404346 -405482 -356506 -266588 -213072
14650 -213072 -173710 -1779 116648 -44521 -236320 -384687 -293043 -152732 -145789 109188
14640 109188 52285 -201226 -273751 -322302 -180285 58781 204171 103527 -56789 35494
14630 35494 -126810 -121971 -116405 -6630 161641 -42654 -5247 -27871 41662 192926 256222
14619 256222 189485 -103295 -439902 -470955 -404404 -404968 -339628 -256904 -206200 -313385 -357580
14608c57580l7093l1737j3526L43065K48057k06461l20924K259J87073J92493
14598E626j13800K4422l2943L0992p9749J60821K81683L8556m9134k1774R0106
14587C34806N5063k07357l35289R3692K90582J68409k48732k33637k81961k13511
14577e77935J45242K43882K06216J11658J6659k17594j9432K14098J73632j92892
14567A03534l85922j43305J24034J62467M472J1878N9012j43500j20745J53055
14557a75020J41362j59495K7115J7472l7191j06664m3616j31793Q776L62651j47744
14546b44147k16399n9654Q1363K35591N9101M565R3755J89808R1164m7782l06461
14535a19096k11481j6470j44953k4403O7427J89918Q6247O0120j41917m8511K6945
$$ plain form
14608 -357580 -394673 -426410 -439936 -96871 151186 -55275 -376199 -373940 -186867 5626
14598 5626 -108174 -83752 -116695 -85703 -165452 -4631 277052 315608 266474 244700 334806
14587 334806 389869 182512 -152777 -59085 231497 399906 151174 -82463 -364424 -577935
14577 -577935 -432693 -188811 17405 129063 145722 -71872 -91304 122794 296426 103534
14567 103534 -282388 -425693 -301659 -139192 -134720 -122842 -63830 -207330 -328075 -175020
14557 -175020 -33658 -193153 -166038 -148566 -185757 -292421 -336037 -467830 -459054 -96403 -244147
14546 -244147 -460546 -520200 -438837 -203246 -144145 -139580 -45825 143983 235147 187365 -119096
14535 -119096 -330577 -347047 -492000 -516403 -448976 -259058 -172811 -112691 -254608 -303119 -276174
14524b76174k0800j27523r6134J54848J90292J57482K7860K29402J20421k28833
14514A30841l14738k3624o6361J02601J89384J64634O4092K0874O36J87195j5840
14503D39694j28197q3398r3848j15321P7684r1322l00721O251L16J1510p0363
14492c47715O2393O550r184O8928n6197l3685m1206o9439K00228L32009K74135
14481C86817n2253j65713k69361k50727N7722L20832L6773J16908Q7708J49079
14471D17785j41307k51450p2406K8540j68586O3094M4801j09777m7869J56019
14461h1156n0550k10241J1714K93038J81875J3644q3878J03293J42636r9192l56793
14450a35610l18988K05681M52773Q2890j20546j45617R5028J90705q4396L980
$$ plain form
14524 -276174 -296974 -424497 -520631 -365783 -175491 -18009 9851 239253 359674 130841
14514 130841 -183897 -207521 -273882 -171281 18103 182737 246829 267703 268339 455534 439694
14503 439694 311497 228099 134251 18930 96614 5292 -295429 -289178 -288862 -277352 -347715
14492 -347715 -285322 -278772 -287956 -219028 -275225 -308910 -350116 -419555 -219327 112682 386817
14481 386817 334564 168851 -100510 -351237 -293515 27317 64090 180998 268706 417785
14471 417785 276478 25028 -47378 -18838 -187424 -124330 -79529 -189306 -237175 -81156
14461 -81156 -131706 -341947 -330233 -37195 144680 158324 74446 177739 320375 221183 -135610
14450 -135610 -454598 -248917 203856 286746 166200 20583 115611 306316 221920 225900
14440B25900j62273k27152J13748k7693j150k09308k8310J50180K69225p8003
14430B5164k12842k2046J05694q1960j51426J34624J12597n9087j97114N4321
14420b92075n3375k441R5419k8136j50712j2296K26718J13463Q4817j262q6535
14409a06415L9489J51744q3684p4872l6141m4180R1369R9180O0285j90370Q2182
14398a1413l3860k9361M6694k39717J5598K87693K4806j26196j05267m2494J36634
14387g6883L16829K71679l5982j76362j7269J39192r7020n40479k07880j88005
14377f12180N1445K12238M6424j2700J47046q9559M4985l9874J33946J2129j11820
14366b17920o2467j23921o8861K29064J59398J02854J0244Q221j31978j52794
$$ plain form
14440 225900 63627 -163525 -49777 -77470 -78620 -287928 -316238 -166058 103167 25164
14430 25164 -187678 -209724 -104030 -185990 -337416 -202792 -90195 -149282 -346396 -292075
14420 -292075 -345450 -347891 -252472 -280608 -431320 -443616 -216898 -103435 -18618 -19880 -106415
14409 -106415 -66926 84818 1134 -73738 -109879 -154059 -62690 36490 96775 -93595 -11413
14398 -11413 -45273 -74634 -27940 -267657 -252059 35634 60440 -65756 -171023 -213517 -76883
14387 -76883 239946 511625 475643 299281 282012 421204 324184 -216295 -424175 -612180
14377 -612180 -560735 -348497 -302073 -314773 -167727 -257286 -212301 -252175 -118229 -106100 -217920
14366 -217920 -280387 -404308 -473169 -244105 -84707 18147 28391 36612 -95366 -248160
14356b48160p7768k84045j50632P4679K86474L95016K3996j41008n2493p3857
14346b47798J32336N3271M8940m174N6938l6086R3985j47345k04050j07671K02355
14335a59299L1594j06446M6253J01123o5920j63715j85766j01258K74263L44647
14325A5476m3317j79510O8361J57928p873j09839K85725n122J443L80l32599j40489
14313b89436j03254J97142J78274Q5439j93872j37480K62686J35390P1303j15861
14303I0331j55206j29581k5761J12736j30184R1458k4743n5167j08903J04914
14293b30106o3561j31209J02560L93972Q1182j93641j78267q718J98096l7583
14283f7275k45432K76203L32064R9397n8319m77345l556J85928P5979l7925K6594
$$ plain form
14356 -248160 -325928 -609973 -760605 -685926 -399452 -4436 19560 -121448 -173941 -247798
14346 -247798 -115462 -62191 -13251 -17425 39513 3427 97412 -49933 -253983 -361654 -159299
14335 -159299 -127705 -234151 -187898 -86775 -152695 -316410 -502176 -603434 -329171 15476
14325 15476 -27841 -207351 -138990 18938 11065 -98774 186951 181829 183272 183652 -148947 -289436
14313 -289436 -392690 -195548 -17274 68165 -125707 -263187 -501 134889 206192 90331
14303 90331 -64875 -194456 -220217 -107481 -237665 -146207 -170950 -226117 -335020 -230106
14293 -230106 -293667 -424876 -322316 71656 152838 -40803 -219070 -227788 -29692 -67275
14283 -67275 -312707 -36504 295560 394957 336638 -140707 -144263 41665 117644 79719 106313
14272A06313J03928j26086o0422n2128K9313m0762k4786N5253j28700j77413L1852
14261b83638Q2920M0281o4192q3893K4362K20074L0768L05432k27633j59662K76864
14250A61683M6179k24771k30604K05220J74624o8886p7815O0524j71067j02760
14240b27673M0473p9792K96707R8160k33544j50500J34954J25464K24108L6216
14230B64573j03671m5379j8057Q6667K1420J9874R4842j29530R1371j94737j41150
14219e3777J34351J5439J31856k6608k13500k34264M8408J48432K529m5499j35456
14208b28089R7686R2725n3844j58410M8978J36110o4079L1781J52625m8055K8757
14197C6185j33915o2316M6613L000N8076m9478J05802k3406j24218o8773M0697
$$ plain form
14272 106313 210241 84155 23733 -28395 918 -39844 -64630 -9377 -138077 -315490 -283638
14261 -283638 -200718 -160437 -224629 -308522 -284160 -64086 -33318 272114 44481 -115181 161683
14250 161683 207862 -16909 -247513 -42293 132331 63445 -14370 46154 -124913 -227673
14240 -227673 -187200 -266992 29715 127875 -105669 -256169 -121215 4249 228357 264573
14230 264573 160902 115523 97466 184133 205553 225427 320269 190739 282110 87373 -53777
14219 -53777 80574 96013 227869 201261 -12239 -246503 -198095 -49663 -47134 -92633 -228089
14208 -228089 -130403 -37678 -91522 -249932 -200954 -64844 -128923 -97142 55483 7428 36185
14197 36185 -97730 -160046 -113433 -110433 -52357 -101835 3967 -19439 -143657 -212430 -171733
14186a71733J42870L749Q7877n991p9554j24245O3885J88721J6817j0646j01027
14175A0723L4041P822l559k66195j73277J7533J10271R1373L9805K80756o4700
14164H4593o1748O8446o0033j06567r631r4421J09350J03037O7641j5183Q7918
14153A73402P674p8181m7513j88860K1275n9051J25511j57049L3049l5328q4027
14142b89098k55401k9028K33936K53071K08975r7605k42075j41604Q1867m5864
14132c22826J83894J44044p8901j4618j44951M9810J71964j12949M4819j64560
14122b44274j12276O2863K79480K79026Q392q2653k16278j90327p3991P0062J93901
14111b6075K28846p1783Q200m8138j20450n2332J32808o3508k15346j20114K88081
$$ plain form
14186 -171733 -28863 -25114 62763 56772 -22782 -147027 -83142 105579 122396 111750 10723
14175 10723 44764 52586 49027 -217168 -390445 -372912 -262641 -171268 -131463 149293 84593
14164 84593 22845 91291 31258 -75309 -84940 -179361 -70011 33026 100667 85484 173402
14153 173402 181076 102895 55382 -133478 -112203 -171254 -45743 -202792 -169743 -205071 -289098
14142 -289098 -544499 -573527 -339591 -86520 122455 24850 -217225 -358829 -276962 -322826
14132 -322826 -138932 5112 -73789 -88407 -233358 -183548 -11584 -124533 -79714 -244274
14122 -244274 -356550 -293687 -14207 264819 273211 190558 -25720 -216047 -290038 -219976 -26075
14111 -26075 202771 130988 139188 91050 -29400 -81732 51076 -12432 -227778 -347892 -59811
14100e9811K30483R1841j63711j27991M9453J98625N9307j85041j88091M7157
14090d7779J06832k20575o0803P8248l3638J77665q2350N7310R6995n8660r0014
14079g6769j46646K23097M8443j52216j36267k00958J98400K30202p270k08299
14069b28283k7272j8146M2609P4608k7500J63100N9559r7997L6600k53946k11204
14058d87872K10178J70466k14692k38827J16996q3741n4612j26781N8792M55564
14048a94529J58833q8938l3300j52550o6956L55907L15270j40155j37268L3251
14038D9565J22868j06498l592J65251N9972J95772k6002j48647J55054R6455k09685
14027C50513k03242n16092j6751L37486K86411K05544k63263m4156j43361j75190
$$ plain form
14100 -59811 170672 262513 98802 -29189 20264 218889 278196 93155 -94936 -47779
14090 -47779 59053 -161522 -222325 -144077 -177715 -50 -82400 -25090 71905 13245 -76769
14079 -76769 -223415 -318 48125 -104091 -240358 -441316 -242916 -12714 -19984 -228283
14069 -228283 -255555 -273701 -231092 -156484 -183984 -20884 38675 -59322 -22722 -276668 -487872
14058 -487872 -277694 -107228 -321920 -560747 -443751 -527492 -582104 -708885 -650093 -194529
14048 -194529 -35696 -124634 -157934 -310484 -377440 -21533 293737 153582 16314 49565
14038 49565 172433 65935 62343 227594 287566 483338 457336 308689 463743 560198 350513
14027 350513 147271 -368821 -385572 -48086 238325 443869 180606 136450 -6911 -182101
14017a82101j09018k266J42377K4976k22646J39126R0908P8807r0543k98960J03587
14006c25753R1371l328J17078K50562J10515Q2767J45535j90834q2811m4347J68061
13995C18816n8015k07238n3309n3306J56432j07330o6494J36081N2059q5112M2492
13984G5076k22093k11920Q4594J63090J27177K18493j42115m2100j26943q5887
13974a62628J54643q0801j1056k325M5265J78929M0721J80260J23514j31176l61627
13963b6281k11518j29819L1083P126J75836p6023j88353R4369J29588L3898K1844
13952a38250J11844j04256j30944j62223M3289J04295J5317J95868n0392j82959
13942b98411K4804J0658Q4952Q6638P2899N4611o5186j14555J13967J69935m0509
$$ plain form
14017 -182101 -291119 -293385 -151008 -126032 -348678 -209552 -118644 -39837 -130380 -429340 -325753
14006 -325753 -234382 -237710 -120632 129930 240445 323212 468747 277913 195102 150755 318816
13995 318816 260801 53563 254 -53052 103380 -3950 -70444 65637 117696 32584 75076
13984 75076 -147017 -358937 -274343 -111253 15924 234417 92302 50202 -76741 -162628
13974 -162628 -7985 -88786 -99842 -102167 -56902 122027 162748 343008 466522 335346 -26281
13963 -26281 -237799 -367618 -336535 -329409 -153573 -229596 -417949 -323580 -193992 -160094 -138250
13952 -138250 -26406 -130662 -261606 -423829 -380540 -276245 -260928 -65060 -115452 -298411
13942 -298411 -273607 -262949 -177997 -91359 -18460 36151 -29035 -143590 -29623 140312 99803
13931I9803j70253j95439r4994R4873J88305L39296j00576j8418J71795j03146
13921B11246k2924j15728r143L2084P3545M8236j37580q7772K09407J85512q3865
13910C03018q9674R0707N3271O8351k25904k12227j69463j22830j176K57704R9563
13899E1340j36818k07636J20938J31713m8254Q9651K47567q8609j37520J85146
13889B07518j72960J1268j21390j84359J26076J50748J18158j62440q2925N6937
13879e3369j71487r1139N3948j15583J14237K29866p3157r5576j22079j267K82121
13868d3485L2800m0734L9722P4384j33518R1409Q6043J69672k64190k62953l4011
13857b84861J3286p67R9749j77432M9103K07300P0940J17475j08718j26849n7421
$$ plain form
13931 99803 -70450 -265889 -360883 -266010 -77705 261591 161015 142597 314392 211246
13921 211246 188322 72594 63451 95535 169080 217316 79736 -8036 201371 386883 303018
13910 303018 213344 304051 357322 425673 199769 -12458 -181921 -304751 -305927 -48223 51340
13899 51340 -85478 -293114 -172176 -40463 -88717 934 248501 159892 22372 207518
13889 207518 34558 45826 -75564 -259923 -133847 16901 135059 -27381 -110306 -53369
13879 -53369 -224856 -315995 -262047 -377630 -263393 -33527 -106684 -202260 -324339 -325606 -43485
13868 -43485 -10685 -51419 -11697 62687 -70831 20578 106621 276293 12103 -250850 -284861
13857 -284861 -271575 -272342 -172593 -350025 -300922 -93622 -22682 94793 -13925 -140774 -198195
13846a98195K7801L6479l3474k0436M1635j88198j9686L3383m1674J78878J70368
13835a3119j4546l8551m949L35441j25078O0260q7903j65855J90286J15248k25768
13824B5466j68088p3807p1303J78211L05368r0231p8383n2278P1324J408q2642
13813c4955J39420m257m1279Q1366j20083L3115j73510j34737j49097M0493r9263
13802d62787n6174L21183K43881j4965R159J73203r96k64578j8459J59971k4992
13791F4446k43890j64467N2381J54496j8884o1399j20176Q9633k4227l471J3287
13780b62271j29089o216K2004J85180K42630o7528P6494P6559j27204O2759n0677
13769B2641j11468l3469N7923L32210o6902j87227j13699M5970p6970j6622K78228
$$ plain form
13846 -198195 -170394 -133915 -167389 -187825 -146190 -334388 -354074 -320691 -362365 -183487 -13119
13835 -13119 -27665 -66216 -71165 264276 139198 199458 111555 -54300 135986 251234 25466
13824 25466 -142622 -216429 -287732 -109521 195847 105616 27233 -25045 46279 47687 -34955
13813 -34955 104465 100208 58929 140295 20212 53327 -120183 -254920 -404017 -363524 -462787
13802 -462787 -518961 -197778 46103 31138 40297 213500 212504 -52074 -70533 89438 64446
13791 64446 -179444 -343911 -291530 -137034 -155918 -217317 -337493 -247860 -272087 -275558 -262271
13780 -262271 -391360 -397576 -375572 -190392 52238 -15290 61204 137763 10559 73318 22641
13769 22641 -88827 -122296 -64373 267837 200935 13708 -99991 -54021 -130991 -147613 130615
13758A30615K03282r0208k9125q9083k25808p6988J0744j8461j8933j01781J0451
13747b95295o183K98362R8315j95739j11083J05669N2313r6214j80998N308K80773
13736d4772n459r7780O6561j35041N2226J38014J9709J44501l7954j42786k47351
13725b90132j73035j23488R5415P7953N9355J22345p2855q4j08740K2342J24534
13714b66390Q8228j78952R8725J51676K16955J97627o9966j65927l4563j39002
13704a01589O6075k9538m5967J70423K250J38101N3468l39464k41092J57075J36863
13693c3395o494n6320l8307q9892k5159N0642K55032M1820j18334k4464j24988
13682a69859M7550j06822O2654J81078p1191N2125o6828P2837j732J39K4647p197
$$ plain form
13758 130615 333897 243689 214564 125481 -100327 -177315 -166571 -185032 -203965 -305746 -295295
13747 -295295 -301478 -3116 95199 -100540 -211623 -105954 -53641 -149855 -330853 -325545 -44772
13736 -44772 -50231 -148011 -81450 -216491 -164265 -26251 -6542 137959 100005 -42781 -290132
13725 -290132 -463167 -586655 -491240 -413287 -353932 -231587 -304442 -304526 -413266 -390924 -266390
13714 -266390 -178162 -357114 -258389 -106713 110242 307869 237903 71976 37413 -101589
13704 -101589 -35514 -65052 -111019 59404 61654 199755 253223 -86241 -327333 -170258 -33395
13693 -33395 -39889 -96209 -134516 -224408 -249567 -198925 56107 97927 -20407 -44871 -169859
13682 -169859 -122309 -229131 -166477 14601 -56590 -4465 -71293 1544 -188 -49 24598 17401
13670A7401k2477j32497j73185J99164j2888O0563j495k21833k3166K99775K6427
13659A5789K7803k23703j03356K89786M7678l64705j47332P3469n7154m041L4434
13648d11332J35570L99470J64730J88435j12439N0690j44374q2564j58282k7995
13638A909K56864k26295m58937P7454J07296J89675K06789j15207k61071Q4246
13628a37277L20856q6456r4546p3925l4036P1769K71682R7381l52555J6262K36791
13617B35946J83918p8346j04777Q523j9799k8335j57210j67058l290k4661M8575
13606a06514L1244J48899p0314J88044q321o5560k32449l7631R9746L8065n6983
13595g1774m4016J46441J02110J18494J31640q0168J21159J19351q2904k14409
$$ plain form
13670 17401 -5076 -137573 -310758 -111594 -124482 -63919 -65414 -287247 -310413 -10638 15789
13659 15789 43592 -180111 -283467 6319 53997 -310708 -458040 -384571 -441725 -445766 -411332
13648 -411332 -275762 123708 288438 476873 364434 415124 270750 188186 29904 1909
13638 1909 258773 32478 -426459 -349005 -241709 -52034 154755 39548 -221523 -137277
13628 -137277 183579 97123 2577 -71348 -105384 -33615 238067 335448 -17107 -845 235946
13617 235946 419864 341518 236741 245264 225465 197130 39920 -127138 -130428 -155089 -106514
13606 -106514 -75270 73629 3315 191359 183038 117478 -114971 -152602 -52856 -14791 -71774
13595 -71774 -115790 30651 132761 251255 382895 302727 423886 543237 460333 245924
13585B45924j74839m5366J80286K73439q5051k25204n5648l4519K2008L5600J10928
13574B47558K13773j83028j77934J50354K85399N5977l18642l48613j10702J62986
13564b2872K38162K5489n4995r0297O3994K58212q1328k04710j00130J0364J55004
13553A96893j0916j87513j30511l3558J67646J92607l4246Q881p4167k52530O2704
13542i4710J82313J9686k68712N963J15275m9882j17954K40378l559J29453J84439
13531C42690k17501o5239n1140j1490l5475j15355P9064K38779k210j79664j50663
13520a68204o0233o14K22009L8031j18160j4562J39234P1572n082j6805k05970
13509a18784N2880K9902l7896K48095P0174K4720Q4176r2797J3141q3283k02990
$$ plain form
13585 245924 71085 25719 206005 479444 394393 169189 113541 79022 101030 136630 247558
13574 247558 461331 278303 100369 250723 536122 592099 273457 -75156 -185858 -22872
13564 -22872 215290 240779 185784 95487 159481 417693 336365 131655 31525 41889 196893
13553 196893 185977 -1536 -132047 -165605 2041 194648 160402 169283 95116 -157414 -94710
13542 -94710 87603 107289 -161423 -155460 -40185 -90067 -208021 32357 28798 158251 342690
13531 342690 125189 59950 8810 -2680 -38155 -153510 -74446 164333 162123 -17541 -168204
13520 -168204 -228437 -229051 -7042 30989 -87171 -101733 37501 109073 103991 87186 -118784
13509 -118784 -65904 -36002 -73898 174197 244371 269091 353267 260470 273611 190328 -12662
13498a2662j2825J11279r9859J9573M69385l177m11071k62511J68547M8428M7882
13487F2989J7992P4070l5379j44720N0943P1869J29973q479j3436m3231L53833
13476E16424r7522j84909m1362j92870j60872N6731r2881o9843J38345j6458L8356
13465a06861J9555J7521M0182K17265n4035r7771J04636n875n7697j86530n1623
13454a61233J74559J87547k53257j87075n348K2632j07472J25029M6092j14997
13444b73523j96314J81104J35530m6941k6863J24500q3512L2816q0022J54003
13434g9222J03102Q6905J08432K5931J6185r7909k72394j49837L10152j45331
13424i3986P2413J62765k04911p2868J47283J23180q710N9195L0472o0743k2553
$$ plain form
13498 -12662 -25487 85792 -14067 5506 474891 471714 60643 -201868 -33321 15107 62989
13487 62989 80981 155051 119672 -25048 25895 97764 227737 219258 205822 162591 516424
13476 516424 418902 233993 192631 -239 -161111 -104380 -197261 -267104 -128759 -145217 -106861
13465 -106861 -87306 -69785 -29603 187662 133627 35856 140492 134617 76920 -109610 -161233
13454 -161233 13326 200873 -52384 -239459 -244807 -222175 -329647 -204618 -158526 -273523
13444 -273523 -469837 -288733 -153203 -200144 -227007 -102507 -186019 -153203 -233225 -79222
13434 -79222 23880 110785 219217 245148 261333 163424 -108970 -258807 51345 -93986
13424 -93986 -21573 141192 -63719 -136587 10696 133876 125166 184361 214833 154090 131537
13413A31537J58006o3325p2596P9117L0063L1405j96344r9401J41323R4856P5195
13402C09836M6940Q0844j88386j78152J10118J55481k57212k59342J76215J91956
13392A88298m4120l8411l6062j28753P4075N4113Q9176m9845q8035j5001M9015
13381E4450j6936N6468J99447o2836n4760k00885j7009o8673K61305J06896r9515
13370A57952N0254r6627k27118P3946K17103J07597j33451J03074K6976k25920
13360E3786k2565O2476j01048M8731j02286j73985J66586K65260J02467j23799
13350A75623J1013O103r942J33533j16144k1079p4598J66873o9807j19123j62431
13339g9979j83585O8950J30572j88984J16307j8673k6957R8982J02767j65272
$$ plain form
13413 131537 289543 226218 153622 232739 262802 294207 97863 -1538 139785 234641 309836
13402 309836 356776 437620 249234 71082 181200 336681 79469 -179873 -3658 188298
13392 188298 144178 105767 69705 -59048 15027 69140 158316 108471 20436 5435 54450
13381 54450 37514 93982 293429 230593 175833 -25052 -42061 -110734 150571 257467 157952
13370 157952 208206 111579 -115539 -41593 175510 283107 149656 252730 279706 53786
13360 53786 31221 93697 -7351 41380 -60906 -234891 -68305 196955 299422 175623
13350 175623 186636 192739 182797 316330 200186 179107 104509 271382 201575 82452 -79979
13339 -79979 -263564 -194614 -64042 -253026 -136719 -155392 -182349 -83367 19400 -145872
13329a45872l1323P4079K34057j64555n098m4873O7164n4672j34275M0697N8556
13318a06115J0164l7044J04733l6546r1317R3656J16544j26432l6367O4109K2617
13307b1998J29518P9768o0508k9929J36588j20987p3827j40101K30743N5004j72916
13296A1355j43808j876J59798N3584j17885J4753K30019K27552K2570p1772l03916
13285H0374j30964J36272J6582r7890k17889m1104Q9571J75585R1740J21282l46900
13274a23341k48899N9510L51094j0318M0062l9541J5478K38928j31633k67490
13264a16150r219Q0125J38061O1998M7717k25331p7188j12718M6796l2321L0631
13253a67599J86097n0979P9584q030q2217L6116K83717J4802j06353Q6534O0250
$$ plain form
13329 -145872 -177195 -103116 130941 -33614 -38712 -83585 -16421 -71093 -205368 -164671 -106115
13318 -106115 -95951 -132995 -28262 -64808 -156125 -62469 54075 -72357 -108724 -44615 -21998
13307 -21998 107520 187288 126780 96851 233439 112452 38625 -101476 129267 184271 11355
13296 11355 -132453 -134329 25469 79053 -38832 -24079 205940 433492 456062 384290 80374
13285 80374 -50590 85682 102264 4374 -213515 -254619 -165048 10537 102277 223559 -123341
13274 -123341 -372240 -312730 38364 28046 68108 28567 44045 282973 151340 -116150
13264 -116150 -125369 -45244 92817 154815 202532 -22799 -99987 -212705 -165909 -198230 -167599
13253 -167599 18498 -32481 47103 39073 -43144 -7028 276689 291491 185138 271672 331922
13242C31922J78157j29779j22018m0053Q8018K87534j77568k24812n2234K18041
13232C57208j26433K831j80188O7518l6251j86146N266J92536L2595k4842p847
13221I6247J93831k7888M0400k61715o9137O1155R9925N8432m7961j1999K08760
13210C40050o1896l5490k12160o9507J55713R8597O8923J51415j03429k91601
13200D0615R2288j40391k07587M0071J34555N7701J40946O3133j71034k4713o427
13189A9157N8967J15430J77653k05711P7102M0785Q1577j10517l26387j76227
13179b48171J14827J27277P5631J94783k5895k9909j42160k06469j43007O4989
13169b18104K2571J30599n0084K7139J09795J63494k8999r6113J630K5807P5301
$$ plain form
13242 331922 510079 380300 258282 218229 306247 593781 416213 191401 139167 357208
13232 357208 230775 233606 53418 120936 84685 -101461 -96195 96341 128936 104094 96247
13221 96247 290078 262190 302590 40875 -28262 32893 132818 191250 143289 131290 340050
13210 340050 278154 242664 30504 -39003 116710 215307 284230 435645 332216 40615
13200 40615 132903 -7488 -215075 -175004 -40449 17252 158198 221331 50297 25584 19157
13189 19157 78124 193554 371207 165496 242598 283383 364960 254443 -71944 -248171
13179 -248171 -133344 -6067 69564 264347 238452 208543 66383 -140086 -283093 -218104
13169 -218104 -195533 -64934 -115018 -87879 21916 185410 156411 60298 61928 87735 163036
13158A63036j22294j58746k6497m5202n9043J27135P1837K21445J90231k5714
13148C36188k04804K830J86375J0691j53637j61307j20703J74149J86889j43047
13138A13624j5541J39414j8356k45483r5970M2601R4016N2752R9627K15296r8062
13127B83918Q6015K0704j94960j22203m5157l50778q2477M36073O1881l32536
13117b39520l98833K76465M36554J31693m7643j2502o4217P3987j0673J39333
13107B84644J1589j10559J24888J44312O7883O0623j6422L5708L7241q9096j80450
13096C70361J7693j39866m9856j26705j53911J71593J61846L369K6320P5802j824
13085C54822k0082j73899J79884P8383n7798r711o8771M8115j25682j30739Q3720
$$ plain form
13158 163036 40742 -118004 -144501 -189703 -248746 -121611 -49774 171671 361902 336188
13148 336188 131384 134214 320589 331280 177643 16336 -104367 69782 256671 113624
13138 113624 98083 237497 219141 -26342 -122312 -79711 14305 67057 166684 381980 283918
13127 283918 369933 390637 195677 73474 28317 -322461 -404938 31135 93016 -239520
13117 -239520 -638353 -361888 74666 206359 158716 146214 81997 155984 145311 284644
13107 284644 296233 185674 310562 454874 522757 583380 566958 602666 639907 550811 370361
13096 370361 388054 248188 198332 71627 -82284 89309 251155 254524 280844 356646 354822
13085 354822 334740 160841 340725 419108 361310 351599 282828 330943 205261 74522 158242
13074A58242K04320J35696n0517l8271L8080K36233N1537l97188O6615K05662
13064F10409Q1186M5488j453j95476m0824J60720n3243J8158p3096k67017q4067
13053B00785J146K00l36624N9881K7999l2495P7967K95050K46842q5476j07169
13042C48106j32816j89101j10832K2011J960N0624K79336Q6237P5839n9688P892
13031C79568J85046l2482k8772k69857o8513J43928O5582N6359K17755N12754
13021A161368K20865L50674L33466l4308j42454l03357n12591l46204K8471J96959
13011I52889j94123m20596k78375K11787K54253R3338Q851J5916p775j32812o4524
13000D38829j3281N882n1570j43068N9408J93883k7264l60756J32696J61118K964
$$ plain form
13074 158242 362562 498258 447741 409470 447550 683783 735320 338132 404747 610409
13064 610409 691595 737083 735630 540154 499330 660050 606807 624965 551869 284852 200785
13053 200785 201931 202131 -134493 -74612 -46613 -79108 -1141 293909 540751 455275 348106
13042 348106 215290 26189 -84643 -62632 -60672 -10048 269288 355525 431364 371676 379568
13031 379568 564614 532132 503360 233503 164990 308918 374500 430859 648614 1161368
13021 1161368 1382233 1732907 2066373 2032065 1889611 1586254 1073663 727459 755930 952889
13011 952889 758766 338170 59795 271582 525835 619173 628024 643940 636165 503353 438829
13000 438829 425548 431430 379860 236792 296200 490083 462819 102063 234759 395877 398841
12989C98841q6098k16973M3732L93053R3269l3969j06825j92581j06151J52754
12979C39052K78096J99381L23522L90010J17797L1449k69676l43590j99614k80790
12969E85637k49610r0853p7238K09354J41629k65035j01613j40224k20R0838o896
12958I5769R7152J01581p1156J57377K34331p1097j62513k42439q6360p4442q1243
12947a03040J12996l6649j20320P6110R2020J97587o3572J51737k64908J78145
12937B20106K27627N2018j64456m4784J47563J89929j5376j3712P0618q5707k1710
12926E62116j07631m2311k13455k8987P6717K20034N6049j05647p7120j95307
12916A44458Q9868j0316R8250J13184J84445M7984L6688k76396o0637m1686N3296
$$ plain form
12989 398841 312743 95770 139502 532555 625824 591855 485030 292449 186298 339052
12979 339052 617148 816529 1140051 1530061 1647858 1679307 1409631 1066041 866427 585637
12969 585637 336027 245174 167936 377290 518919 253884 152271 12047 11827 102665 95769
12958 95769 192921 294502 223346 380723 615054 543957 381444 139005 52645 -21797 -103040
12947 -103040 9956 -26693 -147013 -70903 21117 218704 155132 306869 41961 220106
12937 220106 447733 499751 335295 290511 438074 628003 612627 598915 669533 583826 562116
12926 562116 454485 412174 198719 169732 246449 466483 522532 416885 339765 144458
12916 144458 234326 224010 322260 435444 619889 667873 704561 428165 367528 325842 379138
12905C79138J43816J31898M02097L45956M01346M57715J42944n3279n05549o48456
12895A197626l48693l82711n1459J83396j03798l32090N9132J1324n1558j73779
12885G390M3724n164O1133L0176j39293J1917J41560K7995j11817q669N8511J27720
12873B45183j50303l7716J91373l00864j38551L04767K51779L6497j25806Q6545
12863C62904j3659o7190K6959J41095j17778J9369M2322k1347o640k3667l1p705
12851C34632l4630K35176M2924j177m6425Q6011L6500j50892O3183J49426j39095
12840E75633j50275j38244L7101L00734Q2459k36407q2594K07071r5340J0606
12830E10744J85646k16197j36398j14283O6230L46422P7109J1679m26979j90350
$$ plain form
12905 379138 522954 654852 1056949 1402905 1804251 2261966 2404910 2351631 1846082 1197626
12895 1197626 848933 466222 414763 598159 494361 162271 221403 232727 181169 7390
12885 7390 51114 45950 107083 137259 -2034 9883 151443 179438 67621 58952 117463 245183
12873 245183 94880 57164 248537 -52327 -190878 113889 365668 402165 276359 362904
12863 362904 349245 282055 309014 450109 332331 351700 394022 372675 366035 342368 342337 334632
12851 334632 300002 535178 578102 576925 530500 616511 653011 502119 565302 714728 575633
12840 575633 425358 287114 324215 624949 707408 471001 388407 595478 500138 510744
12830 510744 696390 480193 343795 229512 295742 642164 719273 730952 303973 113623
12820A13623Q1813J05330Q3403k61844k9246J13724L13181P6005K15714o7757
12810G43946j15661M7112j16288j90222j68723J13378L188j71395j9169q8004
12800C8162K30240Q9744J3597j79337k2815J67947K77453J20007J07095K9358
12790H71451l12761K4402p3086N7763j96589j44923j64016J3225N0189J04998
12780B30653R874J3409J6660j33791o1790K78021J69121j1627J01435J32368k30410
12769E13923j89730j03691K458N6569r3126l7920j18437j44686J47169R1180L7976
12758A61685O807L4988j90265J5349R8440j25912P6725K60995k9070m6565N0755
12747C13932o8626J24498J47361l4124K5425m3216K9777R1995n8435j55709j17610
$$ plain form
12820 113623 195436 300766 384169 122325 93079 206803 519984 595989 811703 743946
12810 743946 628285 675397 559109 368887 200164 313542 316730 145335 126166 38162
12800 38162 268402 358146 371743 192406 169591 337538 614991 734998 842093 871451
12790 871451 558690 583092 510006 567769 371180 226257 62241 75466 125655 230653
12780 230653 240527 253936 270596 136805 75015 353036 522157 510530 611965 744333 513923
12769 513923 324193 220502 222960 279529 186403 148483 30046 -114640 32529 123709 161685
12758 161685 168492 203480 13215 28564 127004 1092 77817 338812 309742 263177 313932
12747 313932 245306 369804 517165 483041 508466 465250 495027 587022 528587 372878 255268
12736B55268K26344o7859m4632K7177n6208j77308J9908j48677J43513K09646
12726C87172J06470o5589j81215P8354p3742O4205J34183N557J30251r5221k0429
12715D69996O0092O2250k29649k31605k066K67307K44210K8926j13069p2586K305
12704D86111j33245P9849J61896j0744n4464j31512j35847J27356M7866P9774
12694E17040O0382r1638k62450k9663K21910Q659j17541J99601K91154j16761
12684F80693o7681p0949q630J2293j6071j62683j96241j16233J60001J4409k2563
12673B06345J38455J7188Q5414J3787J9490k97646K2048K05640q6942o7200J31135
12662C87714J64203J1952K1958j8962m924r408L11307m6450m21198J76986K49533
$$ plain form
12736 255268 481612 413753 369121 396298 340090 162782 182690 34013 177526 387172
12726 387172 493642 428053 246838 325192 251450 315655 449838 455395 585646 490425 469996
12715 469996 530088 592338 362689 131084 129018 396325 640535 669461 556392 483806 486111
12704 486111 352866 432715 594611 583867 529403 397891 262044 389400 437266 517040
12694 517040 577422 485784 223334 193671 415581 424240 306699 506300 797454 680693
12684 680693 613012 542063 533433 545726 529655 366972 170731 54498 214499 228908 206345
12673 206345 344800 361988 447402 461189 480679 183033 205081 410721 323779 256579 387714
12662 387714 551917 563869 585827 566865 561941 552533 863840 817390 396192 573178 822711
12651H22711Q0394R2613j48377j98181o5242R198J68049P9120l71043q4741K23443
12640F07944K02961Q9411k02915K50583J36105j04493J74407K8429o4214k49818
12630H68400p2456J06396P633k06646Q5630J07120q5174j47615L0754L5875K4461
12619G54378K3603P2263l7474j12800o065k9928J03647M0409k8769o9539j66115
12608E43610N136J8629k22142K495J33916K3345K7686J42846J36136j38255l4059
12597F39343P3237m393p7301J01300o038K00690J75459n2771k41803l1817k0420
12586G55486r2585k0264q1841J11054l6814j82774P287l7908n3161R6802J76483
12575F41765k5658q4611K0130J06500L2885j02291K6941L6839k8963j14795l23650
$$ plain form
12651 822711 903105 995718 847341 649160 583918 593116 761165 840285 469242 384501 607944
12640 607944 810905 900316 697401 947984 1084089 979596 1154003 1182432 1118218 868400
12630 868400 795944 902340 909973 703327 788957 896077 810903 663288 694042 729917 754378
12619 754378 777981 850244 812770 699970 693905 663977 767624 808033 779264 709725 543610
12608 543610 548746 567375 345233 347728 481644 504989 532675 675521 811657 673402 639343
12597 639343 712580 708187 630886 732186 726148 926838 1102297 1049526 807723 775906 755486
12586 755486 662901 642637 560796 671850 635036 452262 459549 421641 368480 465282 641765
12575 641765 616107 531496 551626 658126 691011 588720 615661 652500 623537 508742 185092
12564A85092J88833L72830J84288k9336j12064J0125j56985p2663K662O976R6390
12553F76148K52325Q7526r7546j51621o3263q3583M5563J80625J28396m5287p9802
12542H49481j8890j16101P944p1140L75802J59445j27183j52710j16395k6832
12532G63421k11673k1211j14649K64679K03318p0248P3393j25712k03361j15416
12522D42541P2635J17081J09005l3031L3493K92612M6893j93268j85619m5445
12512F56897K5234L00917J48354M2998P122M1897J58045Q5930n5428l2035k22630
12501A157301k35911J52393o251M7186q0667j50945O3727K43889K64741k06596
12491A248867n94411L2097R2651J29071J90154J30846r1628L5616J66312k01356
$$ plain form
12564 185092 373925 746755 931043 901707 789643 799768 642783 570120 572782 579758 676148
12553 676148 928473 1015999 918453 766832 703569 619986 665549 846174 974570 929283 849481
12542 849481 830591 714490 722434 651294 1027096 1186541 1059358 906648 790253 763421
12532 763421 551748 530537 415888 680567 883885 813637 887030 761318 557957 442541
12522 442541 515176 632257 741262 708231 741724 1034336 1081229 887961 702342 656897
12512 656897 682131 983048 1131402 1174400 1181522 1223419 1381464 1467394 1411966 1379931 1157301
12501 1157301 921390 1073783 1067532 1114718 1034051 883106 946833 1190722 1455463 1248867
12491 1248867 654456 686553 779204 908275 1098429 1229275 1137647 1173263 1339575 1138219
12481A138219q363K37572J68708j45776K0998p1788k786R5525j50350o0473N5319
12470A276805l8987N3464P0191k8434l65992m4307o276K27464O5941k7740J15694
12459A297823j01478j61546m9374j3535J5097K33630M0868r2400J8545j087O3394
12448A249937L4854j5574j29241j79267k724Q3797L22601J9507k3568m1406r0820
12437A228096j70273Q9198P9080J41394L2936J8498k683Q5960j67011k44231J41083
12426A232047M5079j41071k8725K98392K78018l3575j5691o1640P4036p2604J3025
12415A587291J714J15564k61790J02624O6384j71867l016J3350J14966O3198K18011
12404A846429j4928j12302k65902J11180P1260N3513J17117J49745j30972j37324
$$ plain form
12481 1138219 1129856 1367428 1536136 1390360 1411358 1339570 1336784 1432309 1281959 1221486 1276805
12470 1276805 1237818 1291282 1361473 1333039 967047 922740 916464 1143928 1209869 1182129 1297823
12459 1297823 1196345 1034799 985425 971890 986987 1220617 1261485 1169085 1187630 1186543 1249937
12448 1249937 1284791 1269217 1139976 960709 957985 1041782 1364383 1383890 1360322 1318916 1228096
12437 1228096 1057823 1147021 1226101 1367495 1400431 1418929 1416246 1502206 1335195 1090964 1232047
12426 1232047 1277126 1136055 1107330 1405722 1683740 1650165 1634474 1572834 1646870 1574266 1587291
12415 1587291 1589005 1704569 1442779 1545403 1611787 1439920 1436904 1450254 1565220 1628418 1846429
12404 1846429 1831501 1719199 1453297 1564477 1635737 1689250 1806367 1956112 1825140 1687816
12394A687816k6082J84075m5849O1703P4133m2531j77940q2783L2664K33355O7213
12383A965774r4026j506j56833k10946K21115J72188k59431j31534J7178O0159
12373A582138J76240J78396K35261p3321K6376l8590k09153n2011j56970p9829
12363A588537K0247J04994J23248m6465J43943J33648o8525J18601J6814n0192
12353B084850J05733L0760r9862j39613l4744j03568j9285P4837J58482J70049
12343B227639J2558l5153j46316n4954M5036k07832Q3553J20476J1036L8039m2249
12332B051833R7321j22614J54549K73861j48067k52171M4244K80437J30884j02261
12322B408016k45597j65457J14262J43922j15462J00735j25332k79281J14893
$$ plain form
12394 1687816 1661734 1845809 1799960 1861663 1935796 1893265 1715325 1632542 1665206 1898561 1965774
12383 1965774 1871748 1870242 1713409 1502463 1723578 1895766 1636335 1504801 1521979 1582138
12373 1582138 1758378 1936774 2172035 2098714 2125090 2086500 1877347 1825336 1668366 1588537
12363 1588537 1608784 1713778 1837026 1790561 1934504 2068152 1999627 2118228 2135042 2084850
12353 2084850 2190583 2221343 2121481 1981868 1947124 1843556 1824271 1899108 2057590 2227639
12343 2227639 2240197 2205044 2058728 2003774 2048810 1840978 1924531 2045007 2056043 2094082 2051833
12332 2051833 2149154 2026540 2181089 2454950 2306883 2054712 2098956 2379393 2510277 2408016
12322 2408016 2162419 1996962 2111224 2255146 2139684 2240419 2115087 1835806 1950699
12313A950699K85095K07098k4302M0466o4993O6844j29301k08805k928N2917Q5971
12302B258761K0015n0682K04000K82978K38319J0061l25300L6694J38063q5006
12292B727903N141j79831M0292j9052J07214K25185j2106J2024p8197L4500K36986
12281C100059j39628l8981j06148N0682R0258o4621m0737N0482k17277j56881
12271B527208K72054Q8000P0379j39851J53849p9646K3704k3569K2265J04980
12261C019373r4122R2224P1253j59202R8513j04J16485J38292L9536J22873n3906
12250C391215k726o5864K34583J68658j36876K11292p4986k28709k6401K2534
12240C492720J84325R8219k2843j06102L4789K19411K72001q4377p0322p0466
$$ plain form
12313 1950699 2235794 2442892 2418590 2459056 2394063 2460907 2331606 2122801 2119873 2172790 2258761
12302 2258761 2278776 2228094 2432094 2715072 2953391 2963452 2638152 2674846 2812909 2727903
12292 2727903 2733044 2553213 2593505 2574453 2681667 2906852 2894746 2906770 2828573 2863073 3100059
12281 3100059 2960431 2921450 2815302 2865984 2956242 2891621 2850884 2901366 2684089 2527208
12271 2527208 2799262 2887262 2957641 2817790 2971639 2891993 2915697 2892128 2914393 3019373
12261 3019373 2925251 3017475 3088728 2929526 3028039 3027935 3144420 3282712 3322248 3445121 3391215
12250 3391215 3388489 3322625 3557208 3725866 3588990 3800282 3725296 3496587 3470186 3492720
12240 3492720 3677045 3775264 3752421 3646319 3681108 3900519 4172520 4088143 4017821 3947355
12230C947355m8514j15945j55189j6653K09397j29824k1739n0138J87697J86916
12220C993363K36935j06021M612J96748q661l85600p5911L23531J67405J81485
12210D527886n0329o9977r583M3075j14060r7999k69372J05114J06827J32081
12200D303663K29689j7611J38645O0971j32255J31946O8632j17869J91606K53389
12190E110806J2243m3183l0748j48050j3579n8122K84414n2385m6302N6444J44254
12179E215792k0603J39311K34160K6436j17476P73J6098P128M0383P0903j72876
12168E440029k23356o4800P5002J45650K87991j8802j80165j8229J99433R6331
12158E739084J23655J07760K22298r980J14900L6520j9089o8141Q4198K9781J45170
$$ plain form
12230 3947355 3898841 3782896 3627707 3611054 3820451 3690627 3668888 3618750 3806447 3993363
12220 3993363 4230298 4124277 4128889 4325637 4316976 3931376 3855465 4178996 4346401 4527886
12210 4527886 4477557 4407580 4397997 4441072 4327012 4229013 3959641 4064755 4171582 4303663
12200 4303663 4533352 4515741 4654386 4715357 4583102 4715048 4783680 4665811 4857417 5110806
12190 5110806 5123049 5079866 5049118 4901068 4887489 4829367 5113781 5061396 5015094 5071538 5215792
12179 5215792 5195189 5334500 5568660 5595096 5477620 5478393 5494491 5501619 5542002 5612905 5440029
12168 5440029 5216673 5151873 5226875 5372525 5660516 5641714 5461549 5443320 5642753 5739084
12158 5739084 5862739 5970499 6192797 6182817 6297717 6334237 6315148 6247007 6331205 6360986 6506156
12147F506156M5945J7064j24171J6585J36678K42116R823R3357j28521J11505
12137F926537q4390K21280J86107k660l4025J84096J79420J81494j11712J33167
12127G779314j21927q0791R568J74938J22869M8557K57563J3955j10359R2416
12117H186103K1194K0453J96028R6677J22408Q1808J60530j1014j6607p0944K39935
12106I026571K52499J77276o3504n1653n6133Q6597J27585J34578p238l1058J47632
12095I743152K67927K57089J64646l7867n9507J64782K45278J42738J84798J02330
12085A1175366j92349j37341L1351k2784J26809k4535K30121K91814Q0793J35216
12075A1694461R9393L7063K37732L98822K6732j6923j31678P8488J55761K45676
$$ plain form
12147 6506156 6552101 6569165 6444994 6461579 6598257 6840373 6850196 6943553 6815032 6926537
12137 6926537 6842147 7063427 7249534 7246874 7212849 7396945 7576365 7757859 7646147 7779314
12127 7779314 7657387 7576596 7586164 7761102 7883971 7932528 8190091 8204046 8093687 8186103
12117 8186103 8207297 8227750 8423778 8520455 8642863 8724671 8885201 8874187 8857580 8786636 9026571
12106 9026571 9279070 9456346 9392842 9341189 9285056 9371653 9499238 9633816 9626578 9595520 9743152
12095 9743152 10011079 10268168 10432814 10394947 10335440 10500222 10745500 10888238 11073036 11175366
12085 11175366 10983017 10845676 10877027 10854243 10981052 10956517 11186638 11478452 11559245 11694461
12075 11694461 11793854 11830917 12068649 12467471 12494203 12477280 12345602 12424090 12579851 12825527
12065A2825527K73140L15358K03312R2442N2169j57643j75681J14950K68159L43142
12055A4154875Q2577J32522K09595Q1614J66633M97476K37523K70855L2696p4376
12045A5791990J31338J59864o9446n1659Q1146J73926K72816J87170O9648J52227
12035A6899020J58246J67402j145Q5579L0397J02391K52697K43848J08905K25242
12025A8272582J46191K81632J82195j9707J30395J62839L52317O20573M06552
12016B0535569J79389o9596J34933K40852J86808K29520K06577K93589O3019j00973
12006B1899687L36565K09320K02450J65317L28473L42695K0410J31633J88957
11997B3825507K87166K73706K17853R4813J05383K58591K93617L24061K62591
$$ plain form
12065 12825527 13098667 13414025 13617337 13709779 13761948 13604305 13428624 13543574 13811733 14154875
12055 14154875 14237452 14369974 14579569 14661183 14827816 15325292 15562815 15833670 15866366 15791990
12045 15791990 15923328 16083192 16013746 15962087 16043233 16217159 16489975 16677145 16746793 16899020
12035 16899020 17057266 17224668 17223523 17309102 17339499 17441890 17694587 17938435 18047340 18272582
12025 18272582 18418773 18700405 18882600 18862893 18993288 19156127 19508444 20129017 20535569
12016 20535569 20714958 20645362 20780295 21021147 21207955 21437475 21644052 21937641 22000660 21899687
12006 21899687 22236252 22445572 22648022 22813339 23141812 23484507 23504917 23636550 23825507
11997 23825507 24112673 24386379 24604232 24699045 24804428 25063019 25356636 25680697 25943288
11988B5943288j06573N8031K38318M72503J15922J46581K05898M39914L93337
11979B7907219J29647K3165L30388L23426K85955J60441J39571J02040J53964
11970B9555816R2763M01662l538L7709M97974M50447o8820M6673J69849J22944
11960C1303479N2395J71498J93104K79218O5376K42780J28693j82305l9737K00669
11950C2415170J82227J74788L52008K06446R5095K1867j71576L5747J08888j27658
11940C3293002q576L10173K66824K27920k15989k5990J13174j39461J60121J50299
11930C4131497L9889k8381J31191J74198m3703P3626L94686k36184l34401J04726
11920C4407144l5204j05835j96690P9708Q6384j60876p2016q0157l11630j78594
$$ plain form
11988 25943288 25836715 25894746 26133064 26605567 26721489 26868070 27073968 27513882 27907219
11979 27907219 28036866 28060031 28390419 28713845 28999800 29160241 29299812 29401852 29555816
11970 29555816 29648579 30050241 30046703 30084412 30582386 31032833 30964013 31010686 31180535 31303479
11960 31303479 31355874 31527372 31720476 31999694 32065070 32307850 32436543 32254238 32214501 32415170
11950 32415170 32597397 32772185 33124193 33330639 33425734 33447601 33276025 33311772 33420660 33293002
11940 33293002 33284426 33594599 33861423 34089343 33873354 33847364 33960538 33821077 33981198 34131497
11930 34131497 34171386 34143005 34274196 34448394 34404691 34478317 34873003 34636819 34302418 34407144
11920 34407144 34371940 34266105 34069415 34149123 34235507 34074631 34002615 33922458 33610828 33432234
11910C3432234m2461k76343R9742K84335j27984k79388j37668k75558j97073J22214
11900C2602050j99266N8904K0111l03178m58376k46733j64529k01044j2885J43390
11890C1238444r5136l03721k96844j51104j93277l94308j98574j29783k82951
11881B9192746j43299j74943l49418k46548j81636o7266J90866q5383l07505k50177
11871B7577437r9844j37860j718k30093n20412j42467q9152k04032l30417n51851
11861B5269591k99393r6505l10573m7581O0598j14395k38713m48125j43141j21177
11851B3510586l0469k36162j97442l08835k44247k32056n51445l52015j03750
11842B1254165J17152k75477m90898k54629o6318n7710J91343k79282j27081k35237
$$ plain form
11910 33432234 33389773 33113430 33213172 33497507 33369523 33090135 32952467 32676909 32479836 32602050
11900 32602050 32402784 32461688 32481799 32178621 31720245 31473512 31308983 31107939 31095054 31238444
11890 31238444 31143308 30839587 30542743 30391639 30198362 29804054 29605480 29475697 29192746
11881 29192746 29049447 28874504 28525086 28278538 28096902 28029636 28220502 28135119 27827614 27577437
11871 27577437 27477593 27339733 27338015 27107922 26587510 26445043 26355891 26151859 25821442 25269591
11861 25269591 24970198 24873693 24563120 24515539 24576137 24461742 24223029 23774904 23631763 23510586
11851 23510586 23480117 23243955 23046513 22737678 22493431 22261375 21709930 21357915 21254165
11842 21254165 21371317 21095840 20604942 20350313 20283995 20226285 20417628 20138346 20011265 19776028
11832A9776028l24642k90479j5606k5108k22082k48555k29280j48112j62847p3007
11822A8036310J4328n4034m8452l04826l19135k05661j10216l0608j78356l46287
11812A6453063l05453n8405j2840o9940j54403l40419j40603j14992k5499j15710
11802A5114799l07169n4600j25465j60375j82686j59811k3499k57946l45984k74326
11792A3222938j12796J60795K06027m7771k83912O6553j38232j94461k42928j52861
11782A2483352j18821o734L1371j62432j85242j49007j03776k7694p9214j35926
11772A1545877l06095J30712K06187j82831j17262j83077m02620j11832J25220
11763A0704279k11906k23272r9691j65313k72371L7891M9506j88605k29887m0792
$$ plain form
11832 19776028 19451386 19160907 19145301 19120193 18898111 18649556 18420276 18272164 18109317 18036310
11822 18036310 18050638 17996604 17948152 17643326 17324191 17118530 17008314 16977706 16799350 16453063
11812 16453063 16147610 16089205 16076365 16006425 15852022 15511603 15371000 15256008 15230509 15114799
11802 15114799 14807630 14753030 14627565 14467190 14284504 14124693 14101194 13843248 13497264 13222938
11792 13222938 13110142 13270937 13476964 13429193 13145281 13211834 13073602 12879141 12636213 12483352
11782 12483352 12364531 12357797 12389168 12226736 12041494 11892487 11788711 11761017 11681803 11545877
11772 11545877 11239782 11370494 11576681 11393850 11276588 11093511 10690891 10579059 10704279
11763 10704279 10492373 10269101 10169410 10004097 9731726 9769617 9819123 9630518 9400631 9359839
11753I359839K28806J46795p4978j31415k60290L4502j087n358k95358k16904
11743H784552l9690k6836q3947N7755J11222m132k944l42061o6534o1824k65224
11732H060337o3358j00771j9496J0053J09714m2050j76920o5432J15256J9197
11722G846530j73222j14178P7577j93948j70738l43914n0914K35561l8406j60293
11712F914055k0649J30808j39240j87512j11011j46362N0832J24214j42624J0746
11702F483257j43063q0433r428J08839J2402J12125k1444j58106j04452k48772
11692E950925J17544j34961j30533k2282j31921J0438j92332n929K2388r6507
11682E386830N4350j43215Q0553P5869J00667o4843k6318r2206M1412P513k35173
$$ plain form
11753 9359839 9588645 9735440 9660462 9529047 9268757 9303259 9302172 9296814 9001456 8784552
11743 8784552 8744862 8718026 8634079 8691834 8803056 8798924 8795980 8453919 8387385 8325561 8060337
11732 8060337 7996979 7896208 7876712 7886765 7996479 7954429 7777509 7712077 7827333 7846530
11722 7846530 7673308 7559130 7636707 7442759 7272021 6928107 6877193 7112754 7074348 6914055
11712 6914055 6893406 7024214 6884974 6697462 6586451 6440089 6490921 6615135 6472511 6483257
11702 6483257 6340194 6259761 6250333 6359172 6371574 6483699 6462255 6304149 6199697 5950925
11692 5950925 6068469 5933508 5802975 5780693 5648772 5659210 5466878 5460949 5483337 5386830
11682 5386830 5441180 5297965 5378518 5454387 5555054 5490211 5463893 5371687 5413099 5420612 5185439
11671E185439o7292j27438k07870N5326j05682P984R0238J61114k0580r6397l37387
11660D537455j20757L297J7099J21222P8116J16575J27372j55254l66165q8745
11650D270215K91496J36193k01031k08766J19319r3645J72182J43124j38272k48694
11640D242121J23395J8518j03274n4639j6520o1548J21086l6912n9373p9877j38881
11629C954096j81682l1426J28117M1766O9151J49316n4712k31866k8236r5929
11619C718595k04771P7751N6812j44994K99801l2828j95211l2424J50916r6325
11609C597322j2901J15286j30572j07067j70466N4619M5295q2618O7883K62248
11599C639029k37919m24607r2412R4947R835J19014K72358j01219k24559j37165
$$ plain form
11671 5185439 5118147 4990709 4782839 4838165 4732483 4740467 4830705 4991819 4971239 4874842 4537455
11660 4537455 4416698 4419995 4437094 4558316 4636432 4753007 4880379 4725125 4358960 4270215
11650 4270215 4561711 4697904 4496873 4288107 4407426 4313781 4485963 4629087 4490815 4242121
11640 4242121 4365516 4384034 4280760 4226121 4209601 4148053 4269139 4232227 4172854 4092977 3954096
11629 3954096 3772414 3740988 3869105 3910871 3980022 4129338 4074626 3842760 3814524 3718595
11619 3718595 3513824 3591575 3648387 3503393 3803194 3770366 3575155 3542731 3693647 3597322
11609 3597322 3584421 3699707 3569135 3462068 3291602 3346221 3391516 3308898 3376781 3639029
11599 3639029 3401110 2976503 2884091 2979038 2988873 3107887 3380245 3279026 3054467 2917302
11589B917302p4130j539J05300K2534J23843J15037J15335j04062L9047k57477
11579C001190k85149k9538K6185L7187n2637k63095j25824K27952Q7209m4476
11569B579004M672j46415N2351J62061n0842j23505K34859J36690k19944j31495
11559B497436J59583p7396j74949J10087J51883J12859L528j60131j52895O9160
11549B539165J7768m5240K6978Q4232J01645J6851r0625j82016n8088k2267j47416
11538B240987K04224K9398j93190j18594J91891J16322R4697p3544N8126m8291
11528B502026j27545J34745o8837l7799J029j64074k36826j0465L3564j79701
11518A846117o298J38338J76546k96629r2952R7288O452N5150L1046q626m0623
$$ plain form
11589 2917302 2843172 2841633 2946933 2969467 3093310 3208347 3323682 3219620 3258667 3001190
11579 3001190 2716041 2686503 2712688 2749875 2697238 2434143 2308319 2536271 2623480 2579004
11569 2579004 2583676 2437261 2489612 2651673 2600831 2477326 2712185 2848875 2628931 2497436
11559 2497436 2657019 2579623 2404674 2514761 2666644 2779503 2783031 2622900 2470005 2539165
11549 2539165 2556933 2511693 2538671 2622903 2724548 2741399 2650774 2468758 2410670 2388403 2240987
11538 2240987 2445211 2474609 2281419 2162825 2354716 2471038 2565735 2492191 2550317 2502026
11528 2502026 2374481 2509226 2440389 2402590 2403619 2239545 2002719 1992254 2025818 1846117
11518 1846117 1839819 1978157 2154703 1858074 1765122 1862410 1868862 1924012 1955058 1946432 1905809
11507A905809j24505k55465p193K9779J40402K69348j42661L4850L7411k09950
11497A677825P3617M05767O4015j08373j6091r3095j2067k1519r2896o961k38790
11486A631432K63333J89892k83665j28422J21674l3129m7462P798J8233K7137
11476A766821K3596n0639q5223j93171r3650j37646j45872J34659K7446J5852
11466A262173J65940J19419J0215Q868j6680J9899Q9911L7531N6168j90405n163
11455A557876M6368J06566j40045r921L1525J2598p070N2786J5368j98587r9604
11444A367860k6443Q8577j39184j2569J87174m963J777j29543k9929r7708N4497
11433A259546L9756J32312r7623j71037J826K34600Q3944p2298j56942j6259m9482
$$ plain form
11507 1905809 1781304 1525839 1518646 1548425 1688827 1958175 1815514 1850364 1887775 1677825
11497 1677825 1751442 2157209 2221224 2112851 2096760 2003665 1991598 1970079 1877183 1870222 1631432
11486 1631432 1894765 2084657 1800992 1672570 1794244 1761115 1713653 1721451 1739684 1766821
11476 1766821 1790417 1739778 1654555 1461384 1367734 1230088 1084216 1218875 1246321 1262173
11466 1262173 1428113 1547532 1557747 1566615 1549935 1569834 1659745 1697276 1753444 1563039 1557876
11455 1557876 1604244 1710810 1570765 1560844 1592369 1604967 1597897 1650683 1666051 1467464 1367860
11444 1367860 1341417 1429994 1290810 1278241 1465415 1460452 1462229 1332686 1302757 1205049 1259546
11433 1259546 1299302 1431614 1333991 1162954 1164780 1399380 1483324 1411026 1254084 1237825 1188343
11422A188343K3690J31671j30424k47839n6685J48098m0464K04611J41844J0524
11412A373369k32872K28991J75215k34604j93733l73723M2043L60495J04174j22259
11402A127096P9O8492N4317O9073N1744O1388l9723k20318k38489k9789R4931
11391I98801M8810o6046J24486j19660k3352J86552J2718l2383q8988j25643J8899
11380I34194j25536m4149R7981K425p6118K8046J56604p9100Q6197J1144j4980
11369I76708n2439Q4653J78729J69343l2672k28243k21966P3778m3749j42844
11359G61298k10779j34127M6588J5944J97890J58163J19599K20774j4986k45084
11349I15280j19187k8397L748K13081N8530K128J32886j06293l43986j16874J04160
$$ plain form
11422 1188343 1212033 1343704 1213280 965441 908756 1056854 1016390 1221001 1362845 1373369
11412 1373369 1140497 1369488 1544703 1310099 1116366 742643 784686 1145181 1249355 1127096
11402 1127096 1127175 1195667 1249984 1319057 1370801 1432189 1392466 1172148 933659 903870 998801
11391 998801 1047611 981565 1106051 986391 963039 1149591 1162309 1129926 1040938 915295 934194
11380 934194 808658 764509 862490 864915 788797 816843 973447 894347 980544 991688 976708
11369 976708 924269 1008922 1187651 1356994 1324322 1096079 874113 947891 904142 761298
11359 761298 550519 416392 462980 478924 676814 834977 954576 1175350 1160364 915280
11349 915280 796093 767696 771444 984525 1043055 1045183 1178069 1071776 727790 610916 715076
11338G15076j67597J92674K59855k6888j68512K30046p7557j92886o7798N2822
11328G49235l4147J88676K46963J06035j46121k78220l6493q3938J27887J35279
11318I75156J06393J2243J18500j46369q3305j26462O8794K5870k8420l7938j68409
11307G16053k55135j72606P2699o2296J71000K64695L42832j32423J44L09969
11297A254932j6067k27178q1578K32828q6811k49339k49829J34585P9807K40425
11287A031775j95149K5096L3117j11630j30368J74027n1913q8007K35348l1307
11277H90989l9720M6409j13478K6732P2546K6846k1430K9422J97510k15789j20514
11266G79523k0348j88909K24230K5244O489j04926k0548r154l6490n0684j67814
$$ plain form
11338 715076 547479 740153 1000008 973120 804608 1034654 957097 764211 696413 749235
11328 749235 715088 903764 1150727 1256762 1110641 832421 795928 711990 839877 975156
11318 975156 1081549 1093792 1212292 1065923 982618 856156 924950 950820 922400 884462 716053
11307 716053 460918 288312 361011 298715 469715 734410 1077242 944819 944963 1254932
11297 1254932 1238865 1011687 930109 1162937 1076126 826787 576958 711543 791350 1031775
11287 1031775 836626 861722 894839 783209 652841 826868 774955 686948 922296 890989
11277 890989 851269 897678 784200 810932 883478 910324 888894 918316 1115826 900037 779523
11266 779523 759175 570266 794496 819740 826229 721303 700755 691601 655111 604427 436613
11255D36613k46570K2328J10516M0499J22124L41914K30959N1636l95695k87871
11245D26453P180j9463l7294r3086L48648N0666j11661p5341J666m6429l596O6255
11233E13998J73312K0122k19391k05419J82078M6934Q0082j43846M2443J98839
11223F89152J66344j86350j97984j96732M5829K17035O6670M0613m59172j31465
11213E3940O2294K14306K86657o9641k40279M2932J83337J98499K8855k50133
11203E10767j29769K59092J46152L9280J42391J59010j73506j14292j70566j36502
11193E32057r2536Q6375P7713p1941P9994j7508J6243o3698J50630L8754l039
11182G33044k02458l20230j44670R8290Q5907Q7010O5295K12390J26028k09962
$$ plain form
11255 436613 190043 212371 322887 363386 485510 827424 1058383 1110019 714324 426453
11245 426453 433633 414170 376876 283790 632438 683104 571443 496102 497768 451339 447743 513998
11233 513998 687310 707432 488041 282622 464700 511634 591716 447870 490313 689152
11223 689152 855496 669146 471162 274430 320259 537294 603964 644577 185405 53940
11213 53940 116234 330540 617197 547556 307277 350209 533546 732045 760900 510767
11203 510767 380998 640090 786242 825522 967913 1126923 953417 839125 668559 532057
11193 532057 439521 525896 603609 531668 611662 594154 610397 546699 697329 736083 733044
11182 733044 530586 210356 65686 163976 249883 336893 402188 614578 740606 530644
11172E30644n9128k06596j75693K85955K34087j11928L090J06166O4105p8512
11162E92190o9397j9561O8466q0930J5730j20966J90510R9220J877K0236j14417
11151E82958j70521K34100L1015L0461k01423j2420L988k8292J0779l53926k15557
11140h8838J72883O1031K12016J71678j46632j7367J56339j46293j99664L7746
11130B12899M391j79955N3929R0929J81100Q6875J95347P7718j69276k3257j58884
11119C71816O3430j94198Q2494L04500L0061K5603j63976k50780k26373Q392L8114
11108H9083r6559J56766l9791j00656K40137J55762j14792j57997L0515J1741
11098A74209J31391J357j11218k1343N7341M3557l2156k05292j0109J35607K9631
$$ plain form
11172 530644 471516 264920 89227 375182 609269 497341 500431 606597 670702 592190
11162 592190 522793 503232 571698 490768 506498 385532 576042 675262 677139 697375 582958
11151 582958 412437 646537 677552 708013 506590 494170 498158 469866 480645 126719 -88838
11140 -88838 84045 145076 357092 528770 382138 364771 521110 374817 175153 212899
11130 212899 217290 37335 91264 182193 363293 450168 645515 723233 553957 530700 371816
11119 371816 435246 241048 323542 628042 658103 683706 519730 268950 42577 50969 89083
11108 89083 -7476 149290 109499 8843 248980 404742 289950 131953 162468 174209
11098 174209 305600 306957 195739 174396 231737 275294 243138 37846 27737 163344 192975
11087A92975l0063o8776L867R7754O3551J53776K0510r1847j97507J15675O4042
11076C23957j0957K012m1299k8913n0818M4694m8864J13097J10702J73921q7308
11065E00224j36695j53282N0210J96560j39762m4733N1055J7669j00143J9658
11055B60761J05229M598j15820J04392P6519M8898j49350M5191M9584J13748J28522
11044F72272K17964J61199j97669r1870L3530j3389K00150j03837K6418o9347
11034H35421J68113J87317J61966J8765p9907k32235p3075L3645k1029O0662N9226
11023A118869L34847K22651J71660J5134J0088j77374k30127L1724m7775k17484
11013A232213k23656n902R495p236L29741K11910r3618j53175L3334L9248n0106
$$ plain form
11087 192975 162912 94136 98003 195757 259308 413084 433594 341747 144240 259915 323957
11076 323957 313000 315012 273713 244800 193982 238676 189812 302909 413611 587532 500224
11065 500224 363529 210247 260457 457017 317255 272522 323577 341246 241103 260761
11055 260761 365990 370588 254768 359160 435679 484577 335227 380418 430002 543750 672272
11044 672272 890236 1051435 853766 761896 795426 782037 982187 878350 904768 835421
11034 835421 1003534 1190851 1352817 1371582 1291675 1059440 986365 1020010 998981 1059643 1118869
11023 1118869 1453716 1676367 1848027 1863161 1873249 1695875 1465748 1497472 1449697 1232213
11013 1232213 1008557 1002655 1012150 1004914 1334655 1546565 1452947 1299772 1333106 1372354 1322248
11002A322248l89873k98803l80456P6172J36949M7131J52185j2632k70446N2024
10992D34499K8084k12229k17995l8709J52487J36055O4389M4078o0004J21838
10982D52493O2711r8381Q4950r9198k59971m4052J61643j09526q7551N0394M0501
10971A54013J88573k35181k49086r4379J18681K19047J01374M4110k66842l12630
10961c32320p0002K20553J08231P9275K14050j08278r1754J0748l564p767O563
10950B5735j7530k4172J18125J10044J57206J20658P7517j05837R3643p5714N816
10939D85491j34820m5587k15759l70769j41658o2861N6435J86030K61356J55703
10929A73561P1769j93609j20472k46438k06486j12620J3027J75923J76173L24227
$$ plain form
11002 1322248 932375 633572 253116 329288 466237 513368 665553 652921 382475 434499
10992 434499 462583 250354 32359 -6350 146137 282192 346581 390659 330655 452493
10982 452493 515204 416823 501773 402575 142604 98552 260195 150669 63118 113512 154013
10971 154013 342586 107405 -141681 -236060 -117379 101668 203042 247152 -19690 -332320
10961 -332320 -402322 -181769 -73538 5737 219787 111509 19755 30503 26939 19172 25735
10950 25735 8205 -15967 102158 212202 369408 490066 567583 461746 555389 479675 485491
10939 485491 350671 305084 89325 -281444 -423102 -485963 -429528 -243498 17858 173561
10929 173561 245330 51721 -68751 -315189 -521675 -634295 -621268 -445345 -269172 55055
10919E5055K39457O9859n0382j25255r0041j8516p1046j81001n8808K22372J29457
10908A21151N3835n5963l70258j12567p0651K72645M10966p9636j27799k3077
10898A8646k2499J1145m6402J61756J71957m949l07530q4632O8990n429M6039
10887G092N309m885o6371P8914R068j04500P0785j45674r3406J03360L56662k5444
10875A90910l81660J07805J249L5473J15164P3447m7220j05442N4930k39373R145
10864a85572n2621K03378O6315j06711R278J25793j6411J4386o2188J51119J1294
10853A58060n404Q1220J40524k61168Q3041K80547N231j21627j3608L861j72982
10842A77695J1076J03707l5652L4304r9071J1951M4121p4996n3198J31305j04386
$$ plain form
10919 55055 294512 364371 313989 188734 98693 80177 9131 -171870 -230678 -8306 121151
10908 121151 174986 119023 -251235 -363802 -434453 -161808 249158 169522 41723 18646
10898 18646 -3853 7292 -39110 122646 294603 289654 -17876 -102508 -33518 -38947 7092
10887 7092 12401 7516 -58855 20059 29127 -75373 -4588 -150262 -243668 -140308 216354 190910
10875 190910 -190750 -82945 -81696 -46223 68941 142388 95168 -10274 44656 -194717 -185572
10864 -185572 -238193 -34815 31500 -75211 -65933 59860 43449 57835 -4353 146766 158060
10853 158060 152656 233876 374400 113232 196273 476820 482051 360424 346816 350677 177695
10842 177695 188771 292478 256826 291130 192059 204010 248131 173135 119937 251242 146856
10831A46856K4767o0686l6617l6783j36531m5430M2972J60471J45447N6093o7976
10820A92583J12673J00149M2282k9467K15647O6670K9584m47718k96643j57392
10810a71632K13489M5534j00062j92620m6713R9646R8160K3106o028J65039R0720
10799B18639N1377r4741l2066Q3705J21125N7251j33022j72801q9995l7391J25902
10788I7983p6901q3963n8248o793l3397P1947K47122j5644l4264k71778k3381
10777a87317j66603j33167K43316K47929K08711j12714k41591k6908M9645J3794
10767a04905J58133j8780j71609j88044J06721J955j8926K2559q9096l4596o006
10756c42594J93376K31841J6825j12867J21015K45643o0198q0198L7601q7397
$$ plain form
10831 146856 171623 110937 74320 37537 -98994 -144424 -101452 59019 204466 260559 192583
10820 192583 305256 405405 447687 418220 633867 700537 730121 282403 -14240 -171632
10810 -171632 41857 87391 -12671 -205291 -252004 -152358 -54198 -31092 -37120 127919 218639
10799 218639 270016 175275 143209 226914 348039 405290 272268 99467 9472 -27919 97983
10788 97983 21082 -62881 -121129 -127922 -161319 -89372 157750 142106 107842 -163936 -187317
10777 -187317 -353920 -487087 -243771 4158 212869 100155 -141436 -168344 -118699 -104905
10767 -104905 53228 34448 -137161 -325205 -218484 -216529 -235455 -212896 -301992 -336588 -342594
10756 -342594 -149218 82623 99448 -13419 107596 353239 293041 212843 250444 163047
10746A63047j32933l9868k02786o7181j32409K6810M24960K09843k3225M352q6878
10735A43732j85247J2860j49881J2377J06954R7041K18346R543p6916K0517J32204
10724C41530K8147o2146R9336J38767n04j1045m8374l3329J2801M5713K4916n524
10712E30288r5299q4847m26252k52878K19059J85980J39819J7550N9804J08601
10702D01825j22498m63842m04934J61629J43421j11085Q7456L7627L59M9523J34560
10691h5959J27305m1420O9093j13591k74031j59441J82938K70394O503k00646
10681b18855q3813k14163j16818P3443j49007o0321r6938K27487J06965M5677
10671d86343J72828K05279N4228Q4212j2507j78882m2299J47942k7456r5582m877
$$ plain form
10746 163047 30114 -9754 -212540 -279721 -412130 -385320 39640 249483 226258 230610 143732
10735 143732 -41515 -28655 -178536 -166159 -59205 37836 256182 265725 188809 209326 341530
10724 341530 369677 307531 406867 545634 545130 534085 485711 452382 465183 510896 535812 530288
10712 530288 434989 350142 -76110 -328988 -109929 76051 215870 233420 293224 401825
10702 401825 279327 -184515 -589449 -427820 -284399 -395484 -308028 -270401 -270042 -220519 -85959
10691 -85959 41346 -74 69019 -44572 -318603 -478044 -295106 -24712 -18209 -218855
10681 -218855 -302668 -516831 -633649 -560206 -709213 -769534 -866472 -638985 -532020 -486343
10671 -486343 -313515 -108236 -54008 30204 17697 -161185 -203484 -55542 -82998 -178580 -183457
10660a83457L76582J58448j22944m1058L6955M35565L64176q6120L4743K50643
10650A223533K14797J87332N4159K94j18064j78609j77089R5589j20413l1705
10640A149824k1992o026L57071P7039J12696N74526M96986M29781N66608P15191
10630D451704O70720N73648N87432N95863J052644J096522J206286J862984K392470
10621A4490273L134186L998809N462396P469525J0002913J2650638J5568533J6981681
10613H9758954J4857391R078134K206011k990662m060663k063841K551179P884358
10605A17220861J4981257K2894050K9943519L3163747K6965074J1189908o911495
10598B49446921j7984459j8977424j3292141m271206O021954J7241795K8747026
$$ plain form
10660 -183457 193125 351573 228629 187571 224526 660091 1024267 938147 972890 1223533
10650 1223533 1438330 1625662 1679821 1680115 1562051 1383442 1206353 1301942 1181529 1149824
10640 1149824 1127832 1121806 1478877 1555916 1668612 2243138 2740124 3169905 3736513 4451704
10630 4451704 5122424 5696072 6283504 6879367 7932011 9028533 10234819 12097803 14490273
10621 14490273 17624459 21623268 27085664 34555189 44558102 57208740 72777273 89758954
10613 89758954 104616345 113694479 115900490 112909828 108849165 106785324 109336503 117220861
10605 117220861 132202118 155096168 185039687 218203434 245168508 256358416 249446921
10598 249446921 231462462 212485038 199192897 194921691 200943645 218185440 246932466
10591B46932466L8433323M0289827K8096420K545873k3683988l7701747l7921045
10584B56991129k9804046j8897666p965104K227247J1828525J8956389J9348640
10577B52685114R983946p635546k4425062l2029603l0161742k3866111j6230653
10570A28320343r126511l522950J277459M102786L402251q66423q137351j4203879
10562A01245725j6743824j5934981j3437781j0402823p681736n810263m633641
10555B6600676l540158k959997k149740j649417j609346j279589j236284r15557
10547A1260588p95874p21629o87588m98932k52928j63300n73900m58407j16143
10538F991887k79098l00868m69574n48623j78976Q5389j03469j8910K9279j85865
$$ plain form
10591 246932466 285365789 325655616 353752036 356297909 332613921 294912174 256991129
10584 256991129 227187083 208289417 200324313 202551560 214380085 233336474 252685114
10577 252685114 262669060 255033514 230608452 198578849 168417107 144550996 128320343
10570 128320343 119193832 115670882 116948341 121051127 124453378 123586955 115449604 101245725
10562 101245725 84501901 68566920 55129139 44726316 37044580 31234317 26600676
10555 26600676 23060518 20100521 17950781 16301364 14692018 13412429 12176145 11260588
10547 11260588 10464714 9743085 9055497 8556565 8303637 8140337 7566437 7108030 6991887
10538 6991887 6712789 6411921 5942347 5393724 5214748 5300137 5196668 5177758 5207037 5021172
10528E021172l93386j57049J37146k79669j83900P3555k71706k50335j87238j57710
10518C350880N5307k56801j25156j40473j6900M2150J03663k11727O9034J52717
10508C022694j34337k55866j19792J10350j90455m07020j54404K10397o0126j3006
10498B008435J88233M7698O9J38715K325j43464k02713L2077O2809q619j31172
10487A994393L6936n4334O274p0495j9782n4604r2424j44598M4736N5298o0402
10476A640998K67443J44917r1437r0738j00861n3551M3502J70802J383r9101j05480
10465A727877N629M0137J79587j04158r9950j6011k24721r4761k41127j83347
10455I89155L4712J58937o2630j34356Q8062J23551j3782J05271J17752J65527
$$ plain form
10528 5021172 4627786 4470737 4607883 4328214 4144314 4217869 3946163 3695828 3508590 3350880
10518 3350880 3406187 3149386 3024230 2883757 2866857 2909007 3012670 2800943 2869977 3022694
10508 3022694 2888357 2632491 2512699 2623049 2432594 2025574 1871170 2081567 2021441 2008435
10498 2008435 2196668 2244366 2244435 2383150 2385475 2242011 2039298 2071375 2134184 2125565 1994393
10487 1994393 2031329 1976995 1983269 1912774 1892992 1838388 1745964 1601366 1646102 1701400 1640998
10476 1640998 1908441 2053358 1961921 1871183 1770322 1716771 1760273 1931075 1932458 1833357 1727877
10465 1727877 1733506 1773643 1953230 1849072 1749122 1733111 1508390 1413629 1172502 989155
10455 989155 1023867 1182804 1120174 985818 1073880 1197431 1183649 1288920 1406672 1572199
10445A572199L7813M4765k93839m13527O1502J81411L1062k9664N7801r4164o1854
10434A093505n6276j09706M9550J66011j46782n2692P6899j73247j39444P8426
10424G86244P5110j60172o6537p1796J07551O976j55210P7458J12958l5735o4407
10413F12440j21108R8475q9940M4721p6368L6316M4270J05856j452r9349j84717
10402C69144K7916J89737J49544p936J7731Q8451R1109Q9972N157m0148j50425
10391H30252l18857j32027N349K8648J13698J01213o0749j55332k37634K53206
10381D27767J84379o7894J74641Q1838j49673l82767j18441J6007R1128l879L9095
10370B92201K43814q1860j56576p778j32059R9320J19370K85536J30580j90215
$$ plain form
10445 1572199 1610012 1654777 1360938 947411 1008913 1190324 1221386 1191722 1249523 1155359 1093505
10434 1093505 1037229 927523 977073 1143084 996302 943610 1020509 847262 707818 786244
10424 786244 861354 701182 634645 562849 670400 677376 522166 599624 712582 676847 612440
10413 612440 491332 589807 499867 544588 468220 504536 548806 654662 653210 553861 369144
10402 369144 397060 586797 736341 728405 746136 834587 925696 1015668 1020825 980677 830252
10391 830252 511395 379368 384717 413365 527063 628276 567527 412195 174561 427767
10381 427767 612146 544252 718893 800731 651058 268291 149850 165857 256985 253106 292201
10370 292201 536015 454155 297579 289801 157742 257062 376432 661968 792548 602333
10360F02333k36905m2145J16081R3108k8767N3290K67122J84445j9831j35779
10350H52952j21993L1401j9651j71437l157O5850j75947M3944J23398j41065q605
10339D75690K40389J1622J27147J2j62105j26313N8518M5184j6032j78838P9870
10328E55144O2118q6128J62262P5058k6130j68577j38446L5467k4613j11045q5167
10317B49943J28884J28272K93983j53814j55607R869N467J2144O1630n1903k32778
10306B96090k17174J67469J39263K29033k92171l76142L54077Q5222k78778o0322
10296D6567Q3553J32576j00615K6213O3089O4023J13128j02708j63782j07743
10286E4301J7097j63601L41978K35802J58772J5725j31702k83596j83786Q9369
$$ plain form
10360 602333 365428 323283 439364 532472 503705 556995 824117 1008562 988731 852952
10350 852952 730959 762360 742709 571272 568115 633965 458018 501962 625360 484295 475690
10339 475690 716079 727701 854848 854860 692755 566442 624960 670144 654112 475274 555144
10328 555144 617262 531134 693396 768454 742324 573747 435301 470768 446155 335110 249943
10317 249943 378827 507099 801082 647268 491661 501530 506997 519141 580771 528868 296090
10306 296090 78916 246385 385648 614681 322510 -53632 300445 385667 106889 46567
10296 46567 130120 262696 162081 188294 251383 315406 428534 325826 162044 54301
10286 54301 71398 -92203 249775 485577 644349 660074 528372 244776 60990 150359
10276A50359J68693K40835m505K7054l7418O6136j38537j11404m6412j20772R1089
10265B85118Q9008j94762j08969K67533K06421k50786k75055J09583J55028J6200
10255B99319j67466j16809M4855J99237r3958J40484J64161J5135k36204K4588
10245B73342J16925J3904l5770Q232n2369M2065L34266p2573l597J01298L1040
10234G56763j87004n8855K06732L497j6309M312j46890j98795j72291n8079J24384
10223B57465j5749J9122k20032r5617J77637J9809m4437n2227J53267k14546j64190
10212a79498J6277K72098K70039n916K9932L7670Q5558J01616r7038k21842k98429
10201A0467n995K3577n7137N6880M03418L29326L1974l09487j26336m0319l0084
$$ plain form
10276 150359 319052 559887 555382 582436 545018 611154 472617 361213 314801 194029 285118
10265 285118 374126 179364 70395 337928 544349 293563 18508 128091 283119 299319
10255 299319 131853 15044 59899 259136 165178 305662 469823 484958 248754 273342
10245 273342 390267 404171 368401 376633 324264 366329 700595 628022 624425 725723 756763
10234 756763 569759 510904 717636 721133 704824 709136 562246 363451 191160 133081 257465
10223 257465 241716 260838 40806 -54811 122826 142635 98198 45971 199238 -15308 -179498
10212 -179498 -163221 108877 378916 373000 402932 440602 526160 627776 530738 308896 10467
10201 10467 4472 28049 -29088 27792 431210 760536 792510 483023 356687 316368 286284
10190B86284K9120q0606m287l1240l5682K3173L23281K58243n0436l5754j19624
10179E62472M3184k3995K06802M5799J8337k6178o4110P5843N3703l8017O3409
10168I17249K05405J89742K52422m1714L1971P0544k30111k48184l9850N3512
10158A160986j25995N1829K92912o4200K80153M36949K98880j02444j33552k77055
10148A818463m09245k03472O5781k9659J75872K71874K7497o6340L4956R4194
10138A779921j70114j66417k34015j90722o7986R8556K71452j19909j42826L273
10128A061213M2592K6849j47300k02047N7927k9335q5699J3386N5782l36919P0079
10117E26528K4325k46711r2848j13941j2858l0476R2310n4194l11792k13573R0514
$$ plain form
10190 286284 315404 234798 230511 199271 163589 186762 510043 768286 717850 682096 562472
10179 562472 605656 581661 788463 834262 852599 826421 762311 838154 891857 853840 917249
10168 917249 1122654 1312396 1564818 1523104 1555075 1625619 1395508 1147324 1107474 1160986
10158 1160986 1034991 1086820 1379732 1315532 1595685 2032634 2331514 2229070 2095518 1818463
10148 1818463 1409218 1205746 1271527 1241868 1417740 1689614 1717111 1650771 1685727 1779921
10138 1779921 1609807 1443390 1209375 1018653 950667 1049223 1320675 1200766 1057940 1061213
10128 1061213 1103805 1130654 983354 781307 839234 809899 724200 737586 793368 456449 526528
10117 526528 550853 304142 211294 97353 84495 54019 146329 92135 -219657 -433230 -342716
10106c42716K75026K24993K7906K13062R1989j26399j87793P2328p6492M658j14956
10095F1606N2154n3115J41038J10719P1345j07299j96287O5631K87606K4222q9414
10084C68206J2122O687k1163R535j53791J88269J41050l1136k88640J86284r7988
10073C19435r6107M0226N9990O820J04674j0926j25479k237j86158j23928p4082
10062h7772k1199L4141P144J04766K30211m1213n3257J6063r0460l04926L820
10051b02682J55378J8661j9785q1205K72973K20554r4670M0904J05938j18964
10041B97102k31992k32025Q1360K15708J1838J9510K99216j46812j29646l03664
10031a19405j64151Q9296m6974J79581K43112J19843O2711j58676l9782K7383
$$ plain form
10106 -342716 -67690 157303 185209 398271 490260 363861 176068 248396 171904 176562 61606
10095 61606 113760 60645 201683 312402 383747 276448 80161 145792 433398 457620 368206
10084 368206 380328 387015 365852 375387 221596 409865 550915 519779 231139 417423 319435
10073 319435 223328 263554 323544 330364 435038 424112 298633 296396 110238 -13690 -87772
10062 -87772 -108971 -74830 -67686 37080 267291 226078 172821 188884 98424 -206502 -202682
10051 -202682 -47304 -28643 -48428 -129633 143340 363894 269224 310128 416066 297102
10041 297102 65110 -166915 -85555 130153 141991 161501 460717 313905 184259 -119405
10031 -119405 -283556 -194260 -241234 -61653 181459 301302 364013 205337 165555 192938
10021A92938N8382J35656K8496k7108L4278O722j09956k669q0435L2829J57959
10010D27092n0939m8100j30103j51460j19666J72257J88743J1613n2833p0628
10000A75976n4742k387J47826K1035R5535j531k78538k35732K35559J10426m36259
9989b22832j90073J49207J01568J73813J42234M2307j39313m1546L5943n5906
9979d598J8804J43048K56307j47595j78374R4507J14013p9978j91670q981k918
9968A2565J1631J20777j41605l9504R0879J14342j2311K02920o5494j49624j43303
9957A273J20874J68731N4157k87495m384M0682k2135J39872J76105n1806k16913
9946A18961l33173r062J96177J8488N7568k36103J42982M8131R6944j04944r929
$$ plain form
10021 192938 251320 386976 415472 388364 422642 429364 319408 316739 236304 269133 427092
10010 427092 376153 328053 197950 46490 -73176 99081 287824 299437 246604 175976
10000 175976 121234 118847 266673 287708 383243 381712 103174 -132558 103001 213427 -222832
9989 -222832 -412905 -263698 -162130 11683 153917 196224 56911 15365 51308 -4598
9979 -4598 14206 157254 413561 265966 87592 182099 296112 216134 24464 15483 12565
9968 12565 24196 144973 3368 -36136 54743 169085 156774 359694 294200 144576 1273
9957 1273 122147 290878 345035 57540 53156 93838 71703 211575 387680 335874 118961
9946 118961 -214212 -223274 -27097 -8609 48959 -187144 -44162 3969 100913 -4031 -13960
9935a3960j60851m4292l3237K8777J8912J77980J07580L6614m486o3333k32147
9924a82443J6645j88509M8273J96392N9072k3226N319K6556r8315J71130J81322
9913B12216J96394p7618m4688l939j23770j23734k14786O8552L89672Q8129o0009
9902C06419j77798n4625J98183n7915M2084j26185m718J40218k8302k21224J35528
9891A51665K20008J60097j66107q2097K7707k5030J38313N0695J72318O5408p5162
9880F37815Q4713j17496K0208J12015j34531K9713j30300j95093k35633N579J19986
9869A96976J8683j5671q5088r9577j18512N488K05925o9188J4992O5711p0826
9858D8913N1056n3523n7591J20317Q8050N2141k2878r1808R5186j47109j78243
$$ plain form
9935 -13960 -174811 -219103 -252340 -223563 -204651 -26671 80909 117523 113037 49704 -182443
9924 -182443 -165798 -354307 -306034 -109642 -50570 -73796 -68477 -41921 -140236 30894 212216
9913 212216 408610 330992 286304 282365 158595 34861 -179925 -111373 278299 366428 306419
9902 306419 128621 73996 272179 214264 256348 130163 125445 265663 237361 16137 151665
9891 151665 371673 531770 365663 283566 311273 286243 424556 475251 647569 712977 637815
9880 637815 722528 605032 625240 737255 602724 632437 502137 307044 71411 76990 196976
9869 196976 215659 199988 114900 15323 -103189 -97701 108224 39036 54028 119739 48913
9858 48913 99969 46446 -11145 109172 197222 249363 226485 134677 229863 82754 -95489
9847i5489J9371k168J28992J28783J73093l5396l40630j8727j37989q6881J33851
9836a33190L8741k02129L7420K13596J54131n7240r0492o9999p6570k5955J12148
9825i9539L2088K44718R1914j13648n910J56773J77893l0794r0989k35941l55578
9814b29013Q1886K14603m513L0413K13390j337P6623j8820j12982j73480o9561
9803G209R3327p417m3527J23738n0264r8033R3906Q4230L3180L1206Q2766n2679
9791B97642q4076n7221K87744J2473k84005L3642o980j02556j07863J77921K48964
9780D15685J82262K39256J21870J53787L49902P18080J134781J696571J793777
9771F805971J094695l39815j522585j867258j298305q27584n91281k41107j44850
$$ plain form
9847 -95489 -76118 -78286 50706 179489 352582 317186 -23444 -42171 -180160 -267041 -133190
9836 -133190 -94449 -296578 -259158 -45562 108569 51329 -39163 -109162 -185732 -211687 -99539
9825 -99539 -67451 177267 269181 155533 149623 306396 484289 453495 362506 126565 -229013
9814 -229013 -147127 67476 62963 93376 306766 305429 382052 363232 250250 76770 7209
9803 7209 100536 93119 49592 173330 123066 25033 118939 203169 236349 267555 350321 297642
9791 297642 213566 156345 444089 456562 172557 206199 199219 96663 -11200 166721 415685
9780 415685 597947 837203 959073 1112860 1462762 2180842 3315623 5012194 6805971
9771 6805971 7900666 7560851 6038266 4171008 2872703 2045119 1453838 1212731 1067881
9762A067881m34296j12003j17848J29557j6059J12168O8735j51452j05137P192
9752D48738M5091j37111j83957j85879J0255K04792J02942j0811k4461m7919r2001
9741A29679L1284L4948j24862o6783o410J04431j8807K3143o4865o5856Q9336
9730F5238J64077J4489p757m9146r2905r1871q7716l9365N2132J4419l3284n7350
9718a49039N1938K24547K9662j26279o396J93096J58024n4485p6768N1962j8778
9707B77484K9107j12221O0745K73804l8186k79037j24922N0462M6238o0275Q6113
9696B09312j7696j2414k86117k91550K15268O6302R4960O4255r0874l23397j03983
9685d75934L03402K34538j5589L2167N0185l4080M2540k10203m4079K29234j06499
$$ plain form
9762 1067881 633585 521582 403734 533291 517232 629400 698135 546683 441546 448738
9752 448738 493829 356718 172761 -13118 -2863 201929 304871 294060 269599 221680 129679
9741 129679 160963 195911 71049 4266 -2144 102287 83480 106623 41758 -24098 65238
9730 65238 229315 243804 236047 186901 93996 2125 -85591 -124956 -72824 -58405 -91689 -149039
9718 -149039 -97101 127446 157108 30829 24433 217529 375553 321068 244300 296262 277484
9707 277484 306591 194370 255115 528919 490733 211696 86774 137236 183474 123199 209312
9696 209312 191616 179202 -106915 -398465 -183197 -116895 -21935 42320 -48554 -371951 -475934
9685 -475934 -172532 62006 46417 78584 128769 94689 137229 -72974 -117053 112181 5682
9674E682n5953J1698N6274l38856r6065L63739K13373k2741K2893N7017j33748
9663H3313j56643j8206R309M5483J19768L8735K0901R711J28392K9623K16008
9652E26394L72827P13010R91056J277744P88796n04550j096719j100151r59784
9643A008623n19105j58383J38231M6039P3114O2672r6139m10110k78020N7247
9633g5831K15683L020o8790O7507l30506j46102J4479K77238K56160P8723j59566
9622A32015l36616P4334J29336l6216o2690R4583J16425J89565N3413k3415j89907
9611A40827j54999j1155R2224k89606J45206j388l4493J07044l5574P6893j47569
9600a12590p9103k90530M9507J24343J58179p6313j14321J5342K56425k00373
$$ plain form
9674 5682 -50271 -38573 17701 -321155 -417220 -53481 159892 137151 160044 217061 83313
9663 83313 -73330 -91536 -82227 -36744 83024 121759 142660 152371 280763 310386 526394
9652 526394 899221 1612231 2603287 3881031 4669827 4165277 3068558 1968407 1008623
9643 1008623 489518 331135 469366 515405 588519 651191 555052 144942 -133078 -75831
9633 -75831 139852 142872 74082 141589 -188917 -335019 -320540 -43302 212858 291581 132015
9622 132015 -204601 -130267 -931 -37147 -99837 -5254 111171 300736 354149 330734 140827
9611 140827 -14172 -25327 66897 -222709 -77503 -78891 -113384 -6340 -41914 34979 -112590
9600 -112590 -191693 -482223 -432716 -308373 -150194 -226507 -340828 -325486 -69061 -269434
9590b69434j3331J38213J72871O0128J40450k7791O0603j17074n8770o0963J02624
9579A27526k21475k09953q7890J7384J64428N0509J67428K11918n5608j11439
9569E2828J67070P6706o4204j08339K28898J72142j31908k70045j05943K1561
9559C8766l0867q213K30721J40697p2306k02569j39311m8770O8632j13891O5942
9548g1169K49712P284j30134M2376j03640k45961J27442J43480J3123j61989j033
9537a30509J01021o8340k188J59059o8265m4209m4821j19231J63607Q6643j07571
9526g4804m0958K01360J29370k697L7429p810j60823j2430J75451M3780j50347
9515A37521j42307k02832j19566N9815M5499K316J85366K16780j5066k6937j10651
$$ plain form
9590 -269434 -282765 -144552 28319 88447 228897 201106 261709 144635 85865 24902 127526
9579 127526 -93949 -303902 -391792 -374408 -209980 -159471 7957 219875 164267 52828
9569 52828 219898 296604 232400 124061 352959 525101 393193 123148 17205 38766
9559 38766 7899 -314 230407 371104 298798 96229 -43082 -91852 -23220 -137111 -71169
9548 -71169 178543 185827 55693 98069 -5571 -251532 -124090 19390 32513 -129476 -130509
9537 -130509 -29488 -97828 -100016 59043 -9222 -53431 -98252 -217483 -53876 32767 -74804
9526 -74804 -115762 85598 214968 212271 249700 241890 81067 68637 244088 287868 137521
9515 137521 -4786 -207618 -327184 -267369 -221870 -219554 -34188 182592 167526 140589 29938
9504B9938j92257J18046J26690L2153p106O5762j3157K5872l2158n5060J06192
9493B04915R7372l9452l774m132k22033Q7686K77270k29473k79987r5519l8208
9482b45335n3648q6147m8703K99563K42265j18644J84341L4176j64580J5225o9353
9471a0840j69054r5720j07239J62256J49614p3795p8155K21673Q6171J01081J46460
9460C32452j1269j8576K0181n4141j26333J7582m2355l8934J01970j62981p8180
9449f0584p7789j43019m8744K4730J43319K01185k26366q2829M3202j14460j45195
9438d86550J87646K00018L76518K38992l21589m10142O7441P5757k44152j76871
9428d92932J43037j2423j6869P9470j3110Q1011J28991O4756j64092l03426L3346
$$ plain form
9504 29938 -162319 -44273 82417 114570 107464 173226 160069 185941 153783 98723 204915
9493 204915 302287 262835 259061 254929 32896 120582 397852 168379 -111608 -207127 -245335
9482 -245335 -298983 -385130 -433833 -134270 107995 -10649 173692 207868 43288 58513 -10840
9471 -10840 -179894 -275614 -382853 -220597 -70983 -144778 -222933 -1260 84911 185992 332452
9460 332452 321183 302607 322788 268647 142314 159896 117541 78607 180577 17596 -60584
9449 -60584 -138373 -281392 -330136 -305406 -162087 39098 -187268 -270097 -226895 -341355 -486550
9438 -486550 -298904 -98886 277632 516624 195035 -215107 -147666 -71909 -316061 -492932
9428 -492932 -349895 -362318 -379187 -299717 -312827 -231816 -102825 -38069 -202161 -505587 -472241
9417d72241J44598P9473L19116J23648q6771M2430p2024L0916P2471j20677J747
9406F2686j91021K2463j20891K38563K32965O623k31468p7046K45134J22567j50483
9395A60092l00082L3179P1582J16359k36032L5497P8728J86881P2870r9712N4698
9384A74060J7291m1063m5326K49017J4934n08289j189L50350Q6219l5541j50714
9373A09749m5689r6587J64540L05654k0700j21139n2805O8890q1985L6758K84
9362B66970j00283j33733r1594m834P0233r7852J36516J81967M6173M3914J34861
9351D52338j33835n8213j17899k01939j7568l5087J03759J13404Q2756j53944
9341C3772r0044L12796Q2802k84235q1919P4121k84037j26564O339Q3498K2347
$$ plain form
9417 -472241 -327643 -248170 70946 194594 107823 150253 78229 109145 181616 60939 62686
9406 62686 -128335 -105872 -226763 11800 244765 251388 19920 -57126 188008 310575 160092
9395 160092 -139990 -106811 -35229 81130 -154902 -119405 -40677 146204 219074 119362 174060
9384 174060 191351 150288 104962 353979 368913 -139376 -140565 209785 296004 260463 109749
9373 109749 64060 -32527 132013 437667 416967 295828 243023 311913 229928 266686 266970
9362 266970 166687 32954 -58640 -63474 6759 -91093 45423 227390 273563 317477 452338
9351 452338 318503 260290 142391 -59548 -77116 -112203 -8444 104960 187716 33772
9341 33772 -56272 256524 339326 55091 -26828 47293 -236744 -363308 -356969 -273471 -251124
9330b51124L5531M3876k02747J47128p2100J84494J76132k6920r3861k21936o5277
9319c46804P3319r9355K14149n3072M4281L7519k66888M9126J39784J45048O2919
9308B6j3510M4908J27501N7574j92995j91602o4390K59987P3139j1891k9039r5074
9296c5366n7314m2466p7138l5846K34550J57236M4293j08634m7876R6262K51710
9285C79411j27772j15248R258l6653M7948j18783k83751P2880N4323j51193K25019
9274d4561J05720K37367j27543k02940K37067n2534j39122K46564R0572j51021
9264A99569Q4334J39608j71369j39505p5549L2115k16370k1415L7645Q3260J09730
9253F2053r5868p8520m9339K21741J25153k21288k7672j09264j52912N1980J66195
$$ plain form
9330 -251124 -215593 -171717 -374464 -227336 -299436 -114942 61190 34270 -59591 -281527 -346804
9319 -346804 -273485 -372840 -158691 -211763 -167482 -129963 -396851 -347725 -207941 -62893 26
9308 26 -13484 31424 158925 216499 23504 -168098 -232488 27499 100638 88747 59708 -35366
9296 -35366 -92680 -135146 -212284 -248130 -13580 143656 187949 79315 31439 127701 379411
9285 379411 251639 136391 145649 108996 156944 38161 -245590 -172710 -118387 -269580 -44561
9274 -44561 61159 298526 170983 -31957 205110 152576 13454 260018 350590 199569
9264 199569 283903 423511 252142 112637 37088 69203 -147167 -168582 -130937 -47677 62053
9253 62053 -33815 -112335 -161674 60067 185220 -36068 -63740 -173004 -325916 -273936 -107741
9242a07741J73018L8845K9422J06882J51941Q1864j52673k83991P2395q211O9009
9231A70760Q1944Q7574n7576p7268O6261j10326j97057p3186j29983L0099m9140
9220b57898P03J63291o9436K9054r0202J62804O5875q120k2746L8621R9766k9354
9208H2358k2684Q1466K73445J41716k12011m02916k2499R1435j30658q9947M9265
9197a61030P1393J80554K35772j19442k11674J77133L05042o2476O350Q2293k09584
9186B94331j27514o7087k21934K8448J6834j62825P9182J17816j8961K62416J77898
9175C78604k72995k63774q105Q6474O6914J05254K06115p7117N9167j70937j45496
9164c5896p2680K39778J88081k08837j61204j55063P1822L26629J27379O205j64559
$$ plain form
9242 -107741 65277 104122 133544 240426 392367 474231 321558 37567 109962 101751 170760
9231 170760 252704 340278 282702 205434 271695 161369 -35688 -108874 -238857 -208758 -257898
9220 -257898 -257195 -93904 -163340 -134286 -224488 -61684 4191 -3929 -26675 11946 111712 82358
9208 82358 59674 141140 414585 556301 344290 -58626 -81125 10310 -120348 -210295 -161030
9197 -161030 -89637 90917 326689 207247 -4427 172706 477748 415272 421622 503915 294331
9186 294331 166817 99730 -122204 -93756 -76922 -239747 -160565 -42749 -61710 200706 378604
9175 378604 105609 -158165 -166270 -79796 -12882 92372 298487 221370 280537 109600 -35896
9164 -35896 -108576 131202 319283 110446 -50758 -205821 -133999 192630 320009 326214 161655
9153A61655q0355J18507K4649Q8601j12732k16045j37118K7835j3028P7039K12556
9142A51564Q7005j49483m2017l0584Q9660o8747P6775j31344M7444o0842J65705
9131A35136J84429J57035j80629q7987J12675l0523j93158k64932p0689O7758
9121a70885J39241N0479j56778o7608j9760K40799j1696l2197M7009j2169M8556
9110E4991K12404Q7249q733p9111j91188k0891L2137j20453J15052K60776j31104
9099B11129N8250O6137j13741k13310J41203j6630k03442n1686l3714K16432J60359
9088B20987J56395j80915k36124M1943R7573p1861K2905J37276j17674p8004n9856
9077f7355J32364J24246J90769L6289l8567M2347l6136n1638j75989j98612o8486
$$ plain form
9153 161655 81300 199807 224456 313057 200325 -15720 -152838 -125003 -138031 -60992 151564
9142 151564 238569 89086 47069 16485 106145 37398 114173 -17171 30273 -30569 135136
9131 135136 319565 476600 295971 207984 320659 290136 96978 -167954 -238643 -170885
9121 -170885 -31644 18835 -137943 -205551 -225311 15488 3792 -28405 18604 6435 54991
9110 54991 267395 354644 345911 266800 75612 54721 86858 -33595 81457 342233 211129
9099 211129 269379 335516 221775 8465 149668 133038 -70404 -122090 -155804 60628 220987
9088 220987 377382 196467 -39657 2286 99859 27998 50903 188179 70505 -7499 -67355
9077 -67355 65009 189255 380024 416313 377746 420093 383957 332319 156330 -42282 -110768
9066a10768r6782o6460K98786R6206k2002q596j66446m4946M3342O0445K455J14532
9054I9766Q1280L49237q3840r7004k06623j70902J65680J00022K7815p6097q1305
9043A08029n9827M7666m1515K41457J95492j6223j62602j94436m6267L22545M7185
9032D41504J6999o0324k73719J07718m2418l47826J28708R0618K53096O0254p4324
9021C00286K8171j13164k94572R279K4009o8985q2140q4218K60391L01835L43446
9010F24338P5611j23938j28046k29449L570l856L0455N7606j10947k44503j29825
8999a78984J20034O7881j67570j59644Q9705J27319J05090j54208m5516J09791
8989h6102J33439m9796L1367M6836J50902Q1405j77420J596J04802R4346L0041
$$ plain form
9066 -110768 -207550 -274010 24776 120982 98980 90384 -76062 -121008 -77666 -17221 -14766 99766
9054 99766 181046 530283 446443 349439 142816 -28086 137594 237616 265431 189334 108029
9043 108029 48202 95868 54353 295810 491302 475079 312477 118041 71774 394319 441504
9032 441504 458503 398179 124460 232178 189760 -158066 -29358 61260 314356 374610 300286
9021 300286 328457 215293 -79279 -70000 -45991 -114976 -197116 -281334 -20943 280892 624338
9010 624338 699949 576011 447965 218516 222086 218230 248685 306291 195344 -49159 -178984
8999 -178984 -58950 8931 -158639 -318283 -228578 -101259 3831 -150377 -195893 -86102
8989 -86102 47337 -2459 28908 75744 226646 308051 130631 132227 237029 331375 361416
8978C61416J03111q7452K2801J64828O8485o7193j42566O623o0571J00597n5329
8967D14750o9285J71587J52793j58624k1992r5752r1440j28181j77736k9407r6226
8956a29513L05221m7506K14986L31634r4329k98891K05035J22422M6081J082k15991
8945D40231j72204N523K70837m6466j41056J69396J45148k10955j09567J81742
8935E32629o6219k49141l11798j78880k0985K49527l9798j02094K7024L73187
8925B13452K566m04706Q2150L28634r1930K9377K47723J61435j80499j02819O5837
8914C51220j22824J87375N2152O5169o4961k12037J90323k1827q6305M0106k11757
8903A66634r9250N3611M2404J57174Q5763k61700L6874N4420J6551R1004J54710
$$ plain form
8978 361416 464527 377075 399876 564704 633189 565996 423430 430053 369482 470079 414750
8967 414750 345465 517052 669845 511221 489229 393477 302037 173856 -3880 -33287 -129513
8956 -129513 175708 128202 343188 674822 580493 281602 486637 609059 655140 656222 440231
8945 440231 268027 273550 544387 497921 356865 526261 671409 460454 350887 532629
8935 532629 466410 217269 -94529 -273409 -294394 -44867 -84665 -186759 -159735 213452
8925 213452 216018 -188688 -106538 222096 130166 159543 407266 568701 388202 285383 351220
8914 351220 228396 415771 467923 533092 468131 256094 446417 424590 338285 378391 166634
8903 166634 67384 120995 163399 320573 406336 144636 181510 235930 252481 343485 498195
8892D98195m218j94923q7991j18806j44410o8183J26023K7981k6761P3812K96960
8881C77679p8244k32810j56544R3095J78348n9450l4244N3719L7256j91866j2731
8870b5792K6176N1982N842J21500J02937j81861j6746J20406n7819j04469l4861
8859G295j25487o7174R1291J27002p5791j07870J10698K0667J60851M8700j70651
8848A9531j01716J35884K9196k16703j30320j02767J91373J23694J08236o005
8838E0403k70915j50183R9819J54856O0654R0332K16428J11049k97626j78246
8828a13429p1717K1826K25512R9606q8069L8305R1979K1909M0703p2162j64551
8817B9912k15090J49475J42532p5241m291k5573O0312k10691j40633L1547J90248
$$ plain form
8892 498195 493977 299054 211063 92257 -52153 -120336 5687 33668 6907 80719 377679
8881 377679 299435 66625 -89919 3176 181524 122074 87830 141549 178805 -13061 -25792
8870 -25792 384 52366 58208 179708 282645 100784 84038 204444 146625 42156 7295
8859 7295 -118192 -185366 -94075 32927 -42864 -150734 -40036 -19369 141482 190182 19531
8848 19531 -82185 53699 82895 -133808 -264128 -366895 -175522 -51828 56408 50403
8838 50403 -220512 -370695 -270876 -116020 -55366 34966 251394 362443 64817 -113429
8828 -113429 -185146 -163320 62192 161798 73729 112034 204013 225922 266625 194463 29912
8817 29912 -185178 -35703 106829 31588 27297 1724 62036 -148655 -289288 -257741 -67493
8806f7493K57102L3729r6306P647l31839j05890J6152J54313J78540P8467q9383
8795C5039J268J07467K32791j1891j97129j6083J16526m2199j9127R1319l5407
8784B62574k22263k4529Q6851Q5356J68117p9355k26634j90602p2256Q5126K76222
8773A48607K82304J06378M57m3526j69628J4908k01j5334J12567p1453m1014O0196
8761C84261J6694k0964N5545k08076j842J98473O8778j04845j43000l8071k78627
8750g1674K4066L81619J81723j24677j5145K05046K7352k45798n3963O3830K8076
8739D00455q3066j16212j46257O7369J68907J31693J26214K39703r6934k02211
8729D89661m8764j82043J54460j407l1924p7508l922K23626n7689k7120j4696
$$ plain form
8806 -67493 189609 223338 127032 134679 -197160 -303050 -286898 -132585 45955 124422 35039
8795 35039 36307 143774 376565 364674 167545 151462 267988 225789 206662 297981 262574
8784 262574 40311 15782 102633 187989 356106 276751 50117 -140485 -212741 -127615 148607
8773 148607 430911 537289 537746 494220 324592 339500 339299 323965 436532 365079 324065 384261
8761 384261 400955 379991 435536 227460 225618 424091 492869 388024 245024 206953 -71674
8750 -71674 -47608 334011 515734 391057 375912 580958 608310 362512 308549 372379 400455
8739 400455 317389 201177 54920 122289 291196 422889 549103 788806 691872 489661
8729 489661 440897 258854 413314 411907 379983 302475 298553 522179 464490 437370 422674
8718D22674M5811j37187j46676j8925j0042K3103p0775R5313J53286L38535m1752
8707F53365l12506j76724M8724J17931n4447l6149N8844K92721l5250N2753n7503
8696E51759j25448k5584K4281r8961n9745R8867r195J18507K99768M5206q134
8685H11321m2083j35926J9641J35340J18832J38220O9692n5317L94863K59309
8675A713892J8660j03968k01504l34444k05140j69711J39962J05461r5585j83966
8665F83657J93553o1356k47536m2372J52129O3726o5459R214l9536r1311J00405
8654F55114J5810k34620j76341J5329J71647J61400q1457k6344O7135O9543J80094
8643H17310p6081k08822R7461M1546M3749n105l4987m5842K67775j08963J24780
$$ plain form
8718 422674 468485 331298 184622 165697 155655 178758 107983 203296 356582 695117 653365
8707 653365 340859 164135 212859 330790 276343 240194 299038 591759 556509 609262 551759
8696 551759 426311 400727 425008 326047 266302 365169 355974 474481 774249 819455 811321
8685 811321 769238 633312 652953 788293 907125 1045345 1115037 1059720 1454583 1713892
8675 1713892 1732552 1628584 1427080 1092636 887496 717785 857747 963208 867623 683657
8665 683657 877210 815854 568318 525946 678075 741801 676342 685556 646020 554709 655114
8654 655114 670924 436304 259963 275292 446939 608339 526882 500538 567673 637216 817310
8643 817310 741229 532407 629868 671414 715163 710058 675071 629229 897004 788041 912821
8632I12821P4151L9912q6998j92766J78560Q7369j58085N3484L4584P4990m4318
8621I73704K60824j11258J25084Q2902J06146J61123k2423j81624j73742J90485
8611A411221R1622K94569L15232K78816K92997j14922k91097j91244o5887p0694
8601A950613l51024o4435K42983N6610k596K71862R814J2760J63955J08707M9509
8590B448758j21620k24547p8819J42999J85521J69524J46830L06316K36165J37575
8580C348702L66900J65251K10167L20970L75054M72540J87767M74934K63519L28937
8570F514741M28046O87353O78661R54226R76775Q70369J063201J306838J832196
8561A5312406J541305J441155J592244J159659M85812L87859o82937r73796j054587
$$ plain form
8632 912821 986972 1026884 939886 747120 925680 1013049 854964 908448 943032 1018022 973704
8621 973704 1234528 1123270 1248354 1331256 1437402 1598525 1576102 1394478 1220736 1411221
8611 1411221 1502843 1797412 2112644 2391460 2684457 2569535 2278438 2087194 2021307 1950613
8601 1950613 1599589 1535154 1778137 1834747 1832151 2104013 2113827 2126587 2290542 2399249 2448758
8590 2448758 2327138 2102591 2023772 2166771 2352292 2521816 2668646 2974962 3211127 3348702
8580 3348702 3715602 3880853 4091020 4411990 4787044 5259584 5447351 5922285 6185804 6514741
8570 6514741 6942787 7630140 8308801 9263027 10239802 11110171 12173372 13480210 15312406
8561 15312406 16853711 18294866 19887110 21046769 21532581 21920440 21237503 20263707 19209120
8552A9209120j473208j809709j543692j401106r40773r86334j033988r62870j041029
8543H016411p20658n35387m64916n85718m71355l21563j23745k61757k08012k45375
8533D077925l89884k53877N7432k3659j64118j47877o9413m573J87300J88774
8523C458030M62294K99561j91205m11310l44845k58650k92466k41376k23714j30941
8513B125378p4218j70452k10435m36682M5760K91140k0088k9413k683N2884j04593
8502A466598p2427r7850N6959N867m6581Q2558L27147P0252M8292k1800j05578
8491A713437k638j4282K760P8936o3654q9811J13010k69376J20294K98701L16910
8480B204287N38249R51493J107573R41518j88088j106591j258661r22681m66245
$$ plain form
8552 19209120 17735912 15926203 14382511 12981405 12040632 11054298 10020310 9057440 8016411
8543 8016411 7295753 6760366 6295450 5709732 5238377 4916814 4793069 4531312 4323300 4077925
8533 4077925 3688041 3434164 3491596 3467937 3303819 3155942 3086529 3081956 3269256 3458030
8523 3458030 3920324 4219885 4028680 3617370 3272525 3013875 2721409 2480033 2256319 2125378
8513 2125378 2051160 1880708 1670273 1233591 1279351 1570491 1550403 1520990 1518307 1571191 1466598
8502 1466598 1394171 1296321 1353280 1359147 1312566 1395124 1722271 1792523 1840815 1819015 1713437
8491 1713437 1710799 1696517 1699277 1778213 1714559 1624748 1737758 1468382 1588676 1887377 2204287
8480 2204287 2742536 3694029 4801602 5743120 5555032 4448441 3189780 2267099 1800854
8471A800854J9672J20705J52492l9383l28155l53830q9088J34080p4540k38884
8461A103923j06738Q8407p282k3609J28357N1666j55141j1896K20014l0879j34793
8450A122029Q9273N2431p4654j31033N128j69040O0895J28033K31979Q1289J61161
8439A557491L05528Q8402l1001J8286k1192J24402M00232M18784J9157k69121
8429B610968m66417k14765n9809k25073j78587l05682J17204o4403j24569j56306
8419I32561j56781J44345J79995j69212j475n6051r3480l6946K4991J79740j70838
8408G76849o6026J43923J8905k99150j71831J82272K3035j68565r8020J32648
8398D74040M2326J43847J26665L3563k08456j89528P6204J1271k0295o3670q8300
$$ plain form
8471 1800854 1820526 1941231 2093723 2054340 1726185 1372355 1283267 1417347 1342807 1103923
8461 1103923 997185 1085592 1078310 1054701 1183058 1234724 1079583 1067687 1287701 1256822 1122029
8450 1122029 1211302 1263733 1189079 1058046 1063174 894134 955029 1083062 1315041 1396330 1557491
8439 1557491 1863019 1951421 1920420 1938706 1917514 2041916 2442148 2860932 2880089 2610968
8429 2610968 2144551 1929786 1869977 1644904 1466317 1160635 1277839 1213436 1088867 932561
8419 932561 775780 920125 1100120 930908 929433 873382 779902 742956 767947 947687 776849
8408 776849 710823 854746 873651 574501 402670 584942 607977 439412 341392 474040
8398 474040 516366 660213 786878 820441 611985 422457 498661 509932 489637 425967 337667
8387C37667m3563P4928o688K42080J25786o1473J9826R3399p6881o0727m5475
8376E98879r480K7128q7840J28730O5157o9829q8234j8609j4899k7974q0419J35721
8364E58331J38365j02738m1766k27252j62147L7691K8153J22374L23623j7093
8354F57541j11321P0244j43216j37597r8650J07965L42827O3701k49500k34064
8344B67930J8076J98484l8552N000R5591k46781J32120K83533P157j72620j14872
8333D35066j50586K3778j11123R284J79596o1236l6967J7118J01931j64352j51311
8322I1198Q8264l555j00404K4331k3622k13869L4038Q9992Q22K2429M1451R7583
8310A48658n6919k21128K88001K08489J36240P9966j81466j70585K4375l7164
$$ plain form
8387 337667 294104 369032 362344 604424 730210 668737 688563 781962 705081 644354 598879
8376 598879 589399 616527 528687 657417 722574 652745 564511 545902 531003 503029 422610 558331
8364 558331 696696 593958 552192 324940 162793 200484 228637 351011 674634 657541
8354 657541 546220 616464 473248 335651 237001 344966 687793 751494 501994 267930
8344 267930 286006 484490 445938 450938 546529 299748 431868 715401 722558 549938 435066
8333 435066 284480 308258 197135 206419 386015 324779 287812 304930 406861 242509 91198
8322 91198 179462 175907 75503 99834 76212 -137657 -103619 -13627 -12805 9624 51075 148658
8310 148658 91739 -129389 158612 367101 503341 583307 401841 231256 255631 218467
8300B18467j02037O1867o6888q962K22303Q5825O9330j2573R5787R6246j3386
8289F45979p6609n6606n9127R4252N3316J00296j0963M1631j7126j96286k4169
8278D94588M0225o3594j25209n4814m4291q322p2795J31327J43022j7146J02812
8267E25803j2359o1628j86601k25990L4008K00240J3384j10446j41698r7828K33751
8256A70636J46540P9881J05583j65334j35399j46502P6051J0786j4190J59050
8246B87102j5429J54946l4642P8126j631j64432l09169J5014L2024K06504J27444
8235C75857n6445L4887j16835N4792K8351j62156q7619P4520j36651J16139K27507
8224C52347J41105M9437k39399r0433J41157K36584j50762q7335o8518r1651K51360
$$ plain form
8300 218467 116430 178297 111409 102447 324750 410575 479905 467332 563119 659365 645979
8289 645979 569370 512764 453637 547889 601205 701501 690538 732169 715043 518757 494588
8278 494588 534813 471219 346010 291196 246905 238583 165788 297115 440137 422991 525803
8267 525803 513444 451816 265215 39225 73233 273473 286857 176411 34713 -63115 170636
8256 170636 317176 397057 502640 337306 201907 55405 131456 142242 128052 287102
8246 287102 271673 426619 391977 470103 468472 304040 -5129 9885 41909 248413 375857
8235 375857 319412 354299 237464 292256 320607 158451 70832 145352 8701 124840 352347
8224 352347 493452 542889 303490 213057 354214 590798 440036 352701 284183 192532 443892
8213D43892J35995o1319j41459j17459r8647J0721Q4320J59945J46807n5045k56563
8202B51188k1033K59062p6664p0284K760k55810k28015K6115q1773N3116J11902
8191b9436O3773J94779j04043N7625p6030j8237J38264K6185L26116K4993j17021
8180D86968L3308J11605m4990J6776j51301J03890J8036k39354k97173J6597Q0411
8169A34773R9346J59236j31678l24724O6647Q4323K96312J61503J18892j83520
8159D81110k57619k83677q410Q6492J61943J18618K6949n5939j83328l930l7980
8148D4229J45159J47017O8466j14231n3706J88764m6457k08762o6205q0344j74476
8137a50546K03507J54239J696j37250Q7707J18729r9553k7536n5000J3608l9629
$$ plain form
8213 443892 579887 518568 377109 259650 161003 171724 256044 415989 562796 507751 251188
8202 251188 230155 489217 412553 342269 345029 89219 -138796 -112681 -194454 -141338 -29436
8191 -29436 34337 229116 125073 182698 106668 88431 226695 252880 578996 603989 486968
8180 486968 520276 631881 586891 603667 452366 556256 574292 334938 37765 54362 134773
8169 134773 234119 393355 261677 -63047 3600 87923 384235 545738 664630 481110
8159 481110 223491 -60186 -68596 17896 179839 298457 325406 269467 86139 82209 44229
8148 44229 189388 336405 404871 290640 236934 425698 379241 170479 104274 23930 -150546
8137 -150546 52961 207200 208896 71646 159353 278082 178529 150993 95993 109601 69972
8126F9972O6478K18203K03453R5079j69038q2255m8945l7909j99187K5565K61147
8115D02563j12767N8575j39437O7548O9359j502q5662k94387J6866j3571O5489
8104C3074J15165k4998L6275Q5389q7132j65064k8494j0661R0251N4815k07140
8093a08520j54108K46648M6572k23755J82289J63496J67663k79465j4105k0754
8083E961n9686K95917K05551k77805o9140k77455P6178J25941Q6972p3326n6051
8072a6943P0544J58455R8541K2043m931M6306r3482L1361m5923j8592k06344l8846
8060B189M8610p9875j03937O962J25627J91544J58458L18118j37100j17632k0397
8049C92567k01768q4014M7811J05139j14639o9924o4269M3682O0550j7707l42660
$$ plain form
8126 69972 136450 354653 558106 653185 484147 401892 352947 315038 115851 141416 402563
8115 402563 289796 348371 208934 276482 345841 344339 258677 -35710 -18844 -32415 33074
8104 33074 148239 123241 159516 244905 157773 -7291 -35785 -46446 43805 98620 -108520
8093 -108520 -262628 -15980 30592 -193163 -10874 152622 320285 40820 26715 5961
8083 5961 -53725 242192 447743 169938 100798 -176657 -100479 25462 112434 39108 -16943
8072 -16943 53601 212056 310597 332640 327709 374015 280533 311894 265971 247379 41035 2189
8060 2189 50799 -29076 -133013 -126051 -424 191120 349578 667696 530596 412964 392567
8049 392567 190799 106785 154596 259735 145096 75172 10903 54585 115135 97428 -245232
8038b45232K24327L25515K3042j63539j63216R5667J58354q8024k5362q6531p9303
8027b4302L5681K65167k8852q4304J02564Q0675p7046j7617l9621J34786J46877
8016D94008j43705p4801P2435J09756j48257j1192m0859J67564M23204J44803
8006I92956k8477R1626n1400k45728r4157L63946Q6869K3688J03653m7790j67893
7995A027293j37232Q0678j51821m9281J27771P5075Q5312k909j98308L7982K52549
7984A147109M255r188j74802j2232J65551j90455j35500n7816o063K43282k42899
7973G31242m4087L33139K37437O0969m5368j46687m4n1083M37099N86688K37135
7962B336440K15405j44655k45560q9809J21144m18017m34911j70808j61437j86494
$$ plain form
8038 -245232 -20905 304610 327652 164113 897 96564 254918 166894 141532 55001 -24302
8027 -24302 11379 276546 247694 163390 265954 346629 269583 251966 212345 347131 494008
8016 494008 350303 275502 347937 457693 309436 298244 257385 424949 848153 992956
8006 992956 964479 1056105 1004705 758977 664820 1028766 1115635 1139323 1242976 1195186 1027293
7995 1027293 890061 970739 818918 769637 897408 972483 1057795 1054886 856578 894560 1147109
7984 1147109 1151364 1142176 967374 955142 1120693 930238 794738 736922 730859 974141 731242
7973 731242 687155 1020294 1257731 1318700 1273332 1126645 1126601 1075518 1512617 2099305 2336440
7962 2336440 2551845 2407190 2161630 2071821 2192965 1774948 1340037 1169229 1007792 821298
7952H21298j2827J87550L0652n6636j50710r0480l8605J42822l071J3488J7458
7941H60939r323k22264P6475P0953J59575O6239j61055l22544J02049J25055K1569
7930G67668k19566M1274K58729J93329K15834J50173Q3853K3292L7529J13204
7920A665319R2539k00999n8205l5741j65559k65974J88334K51931r4571k73985
7910A103089j9773j22156J2022j68072r3622r0457j30697q9544P3011M2092M233
7899E20126M6074J04000m4303Q6746p8873p3537P6490M7836J13688r7221k58338
7888D42688J13152J77358j45003J53103j99445j07191R1178j0539K22572R7191
7878H35064M0848k02639j19530J1086k01127k19804J02972J84922J02571J39844
$$ plain form
7952 821298 808471 996021 1026673 970037 819327 728847 690242 833064 829993 843481 860939
7941 860939 851616 629352 705827 776780 936355 1002594 841539 518995 621044 746099 767668
7930 767668 548102 589376 848105 1041434 1257268 1407441 1491294 1514586 1552115 1665319
7920 1665319 1757858 1556859 1498654 1462913 1297354 1031380 1219714 1471645 1377074 1103089
7910 1103089 1083316 961160 973182 805110 711488 621031 490334 400790 473801 515893 520126
7899 520126 566200 670200 625897 712643 633770 560233 636723 684559 798247 701026 442688
7888 442688 555840 733198 588195 741298 541853 434662 525840 515301 737873 835064
7878 835064 875912 673273 553743 564829 363702 143898 246870 431792 534363 674207
7868F74207k8772j52771o2980J15339J67832q9766l33803k72419R5085K17104
7858C29056L7982l2402n3853j23541n5098K10241K13454J62087q3700j42678J87862
7847F49410J0270k15075J41129J10101j67892j21615M9604j15390q5700J02225
7837C57067j29716O5700L48960J86152j30191m67399l55211q2437K16064R3838
7827A02827J61479J66834J17646P2441r3403r1833P9472k40555k22377j44110
7817i1579P3551K24265J01319P031J35168q3921o3791j03509J8261j44721K7357
7806I9431O2083j31279j64869J85990L01279K01616j74362K0466j7942j58386
7796B24027l2880m5241M922j39535J22116O1668p1865k88491k02197N1214Q0927
$$ plain form
7868 674207 645435 492664 429684 545023 712855 623089 289286 16867 111952 329056
7858 329056 367038 334636 280783 157242 102144 312385 525839 687926 604226 461548 649410
7847 649410 659680 444605 585734 695835 527943 406328 455932 340542 254842 357067
7837 357067 227351 293051 642011 828163 697972 230573 -124638 -207075 8989 102827
7827 102827 264306 431140 548786 621227 527824 435991 515463 274908 52531 -91579
7817 -91579 -18028 206237 307556 314587 449755 365834 302043 198534 216795 72074 99431
7806 99431 161514 30235 -134634 51356 352635 554251 379889 400355 382413 224027
7796 224027 191147 145906 150828 11293 133409 195077 123212 -165279 -367476 -316262 -235335
7785b35335Q6063J5993K15563o606L8100J23095r5550j0450J17962L4046j79999
7774A02882k89190M6561j11889J57259L8925K8358o5615J30303J36874P9961J813
7763B56242L4423O2557J04963L8047j83513j3605M4539k42175m3395J84124j33109
7752A09098r7416j10319K1218Q0177K35546j4680M3685K55660Q0167n9780j7196
7741E26160j71948l1187J36848M3935k02996j93953p7380q7936j77586K63536
7731B7493J10164j41560J72298J44938J50041M5358k46343k05668n4721m3539
7721d1539r6465m0653N7214J00974O7796o7117j44481n9043J32081J12686M7090
7710F8543Q6553J0284n8618J71442m4198J36789J82217k88030k46658q356k8443
$$ plain form
7785 -235335 -149272 -133279 82284 75678 113778 236873 141323 130873 248835 282881 102882
7774 102882 -186308 -139747 -251636 -94377 -55452 -27094 -92709 37594 174468 254429 256242
7763 256242 290665 353222 458185 496232 312719 299114 343653 101478 58083 242207 109098
7752 109098 11682 -98637 -77419 2758 238304 223624 267309 522969 603136 543356 526160
7741 526160 354212 323025 459873 503808 300812 106859 29479 -58457 -236043 27493
7731 27493 137657 -3903 168395 313333 463374 508732 262389 56721 2000 -41539
7721 -41539 -138004 -178657 -121443 -20469 47327 -19790 -164271 -223314 -91233 21453 68543
7710 68543 155096 165380 106762 278204 234006 370795 553012 264982 18324 9968 -18475
7699a8475k3977j0171o0717j57450K6580L07922J10381k23325L7410J03821J85566
7688B77565O4806j58977j28173j2253q9207j06663Q4809J82495N9528M2716q3258
7677A33388j22747q4837K8643o900p3500o1867p0080M5988K593n7589j56344n5383
7665d78635K02732K32154J49804O6751P3289j81544o6057n9519k1460j75946j94581
7654d53012K14977R4369j74707p3848K62974L27823K9377l4895m9741j138k86350
7643a44171o9306m1361l9485N2706L7807l3529K17953J21068k56195j15199J60135
7632a09577n8902J1857M9808n9419K8295L98497R603j34841J09356J04575j53474
7621A95778J02272l333L6642q3147o983k89375l09241k24800J53577K32034J91284
$$ plain form
7699 -18475 -42452 -52623 -113340 -270790 -244210 63712 174093 -49232 -11822 91999 277565
7688 277565 342371 183394 55221 42968 -46239 -152902 -68093 114402 173930 216646 133388
7677 133388 10641 -74196 -45553 -52453 -125953 -187820 -257900 -211912 -209319 -266908 -423252 -478635
7665 -478635 -275903 -43749 106055 172806 246095 64551 -1506 -61025 -82485 -258431 -453012
7654 -453012 -238035 -143666 -318373 -392221 -129247 198576 227953 193058 143317 142179 -144171
7643 -144171 -213477 -254838 -294323 -241617 -203810 -237339 -19386 101682 -154513 -269712 -109577
7632 -109577 -168479 -156622 -106814 -166233 -137938 260559 270162 135321 244677 349252 195778
7621 195778 298050 294717 331359 248212 241229 -48146 -357387 -582187 -428610 -196576 -5292
7610e292J98601k8669J9405j44726k98949p9115L063j8715K45734L59946J76735
7599D28018k34887J5014k16786j35554K64863J65589j45958j11431J46932J55510
7589C31310O2222k7851J06714r1937j15772p4290k80284J56987J86374J873j13039
7578A42307q7302k76236L191j81910j73130K13834r4680O1880K99198L34859N1486
7567B93497j17149M2382n2465J8091j21559k64432j4816J43792j99678j41037
7557d13374M20336Q8567j73439r8558J65470L2557J72298p2815j59933j5676o0454
7546a15021q640K26534O7808J51690k3521m5293k93348j47869j06742q072l2980
7535c35454J22102J25769J30714J94015K9719r5747J05242k77639j82620J28746
$$ plain form
7610 -5292 193309 164640 184045 39319 -259630 -338745 -335682 -354397 -108663 251283 428018
7599 428018 193131 208145 -8641 -144195 120668 286257 140299 28868 175800 331310
7589 331310 393532 365681 472395 380458 264686 190396 -89888 67099 253473 255346 142307
7578 142307 55005 -221231 -218040 -399950 -573080 -359246 -453926 -392046 -92848 242011 293497
7567 293497 176348 218730 166265 184356 62797 -201635 -216451 -72659 -272337 -413374
7557 -413374 6962 95529 -77910 -176468 -10998 21559 193857 121042 -38891 -54567 -115021
7546 -115021 -123661 102873 170681 322371 298850 253557 -39791 -187660 -294402 -302474 -335454
7535 -335454 -213352 -87583 43131 237146 266865 171118 276360 -1279 -183899 -55153
7525e5153J66688r3364P1814K77330L2397j36451k71155p8415Q034K655J78148
7514A02528J01066p6198M1904O2541N4356l73725j99584j24652q1359p9723J86468
7503c86378p9955l1593K13043J20859J13907J09027P8339p300L6596Q1942k7600
7492B20887j05364j15543j93936L9223K4836J00664O7055J53232k59388q2451
7482a50785m35l8291K03858P7982j24268j72617r8163j1368Q8447M075K6854J1822
7470a82889j64426Q1111J85742K02261o0346q6462r6512K9770K12883P8076j872
7459A97336j18043L9633q3561j78948m2302o6982O363J29210K94305l16708k97528
7448d37225L1477K17578J38981M4815o0804K2352k16578j86306l0190J24254J54320
$$ plain form
7525 -55153 111535 18171 89985 367315 399712 263261 -7894 -86309 -78275 -75620 102528
7514 102528 203594 127396 169300 231841 286197 -87528 -287112 -411764 -493123 -572846 -386378
7503 -386378 -466333 -497926 -284883 -164024 -50117 58910 137249 129949 166545 248487 220887
7492 220887 115523 -20 -193956 -154733 -129897 -29233 37822 191054 -68334 -150785
7482 -150785 -151220 -189511 14347 92329 -31939 -204556 -302719 -314087 -225640 -221565 -194711 -182889
7470 -182889 -347315 -266204 -80462 121799 61453 -25009 -121521 -91751 121132 199208 197336
7459 197336 79293 118926 35365 -143583 -185885 -252867 -246504 -117294 177011 -139697 -437225
7448 -437225 -405748 -188170 -49189 -4374 -65178 -42826 -259404 -445710 -475900 -351646 -197326
7437a97326K83448O1700k53831N4169k21479j36563J6891o2696R463J36539L13884
7426D199K03605K9000j13106j4867l8726k79092j05801l9413K0941J44726K51103
7415F2569J04328l6732j7826J71353K37058j40519j72562j23648l2911j7377J56202
7404A89935l7190k22472k4590j09102P3352n9381l9324K1063K31395O5476J15623
7393B04785Q7176k20058j00187j31910J59525J25397j31657j19409J72317k7514
7383A8465k48449n9297J01832k0106M928j49234k4001M9792P861K37859N932l35777
7371d10195j14044N860J59107L56167j52376k20657k32870l079J59759O5910m8452
7360d34870Q8455q0827J73529Q8954m8637j55796O3651J87260K43414j2822k21286
$$ plain form
7437 -197326 86122 147822 -106009 -51840 -273319 -409882 -392991 -455687 -446224 -309685 4199
7426 4199 207804 236804 123698 108831 70105 -208987 -314788 -354201 -333260 -188534 62569
7415 62569 166897 130165 112339 283692 520750 380231 207669 84021 51110 33733 189935
7404 189935 152745 -69727 -94317 -203419 -130067 -189448 -228772 -207709 23686 89162 204785
7393 204785 291961 71903 -28284 -160194 -669 124728 -6929 -126338 45979 18465
7383 18465 -229984 -289281 -187449 -207555 -202627 -351861 -375862 -326070 -318209 -80350 -74418 -410195
7371 -410195 -524239 -518379 -359272 -3105 -155481 -376138 -609008 -612087 -452328 -386418 -434870
7360 -434870 -346415 -427242 -253713 -164759 -213396 -369192 -305541 -118281 125133 112311 -108975
7349a08975j41753J6782K26392N1344M6242l0576m3134J0717j20168k40703K58480
7338g5352O3760o7326j41448l6694K66585R8354j70647j72690N6129K962N568
7327a70799j78818K891J45399j30039J2491K03100j0698M3953r0691K5484k29233
7316c76960j14968J94818J79222j83461J72651M23852L5855l65890m14130Q8490
7306c60521J31570j72430m0137P1738K42952J54081L39370k0791j49283j42198
7296E4351j74159P0784J19203Q3551k15082k54523k0934J50297J64494N132k30219
7285b47105j95407J30088j2345J59882j0455J77060L0458m7757R5907K04488j12111
7274A72703k7057j13284L684j8425l14705J7069J30824J24126j06913p409J47919
$$ plain form
7349 -108975 -250728 -233946 -7554 43790 90032 59456 16322 27039 -93129 -333832 -75352
7338 -75352 -11592 -78918 -220366 -257060 9525 107879 -62768 -235458 -179329 -176367 -170799
7327 -170799 -349617 -346726 -201327 -331366 -318875 -115775 -126473 -82520 -173211 -147727 -376960
7316 -376960 -491928 -297110 -117888 -301349 -128698 295154 331009 -34881 -449011 -360521
7306 -360521 -228951 -401381 -441518 -369780 -126828 27253 366623 345832 196549 54351
7296 54351 -119808 -49024 70179 153730 -61352 -315875 -336809 -186512 -22018 -16886 -247105
7285 -247105 -442512 -312424 -324769 -164887 -175342 1718 32176 -15581 80326 284814 172703
7274 172703 145646 32362 36046 17621 -297084 -280015 -149191 -25065 -131978 -139387 8532
7263H532n4639k34688O3045K06177l658k30355J35650o1874N6578K21968J74528
7252B81264L5520L2780k13459J60602k30954k16999j78374m7837K0864O6514J49806
7241a40273m332J81326O3520j65045l60028r9158R4529K075J2828J54783Q338
7230b51437R6340J22565K04063J6651j24974j86931J10908m6288J6324O0968J234
7219A9423j7686K47034l9854j20742n6044j53754j16950K00341K03374k83152
7209a18010n378j97715j68310m3284J83513J58630L14938r5012j55119P1768L8932
7198a5047J92929L552Q4454M409p7357l2367j79822j083j61862q4611l1742P8194
7186b20353K0585j31306r3869J19645j86530J26892M86727K35309p4749r5651
$$ plain form
7263 8532 -46107 -280795 -217750 -11573 -15231 -245586 -109936 -171810 -115232 106736 281264
7252 281264 316784 349564 136105 296707 65753 -151246 -329620 -377457 -356593 -290079 -140273
7241 -140273 -144605 36721 100241 -64804 -424832 -523990 -429461 -427386 -414558 -259775 -251437
7230 -251437 -155097 -32532 171531 188182 63208 -123723 -12815 -59103 -42779 18189 19423
7219 19423 1737 248771 208917 88175 32131 -121623 -238573 -38232 165142 -118010
7209 -118010 -123388 -321103 -489413 -532697 -349184 -190554 124384 29372 -125747 -53979 -15047
7198 -15047 177882 181434 265888 270297 192940 160573 -19249 -20332 -182194 -266805 -298547 -220353
7186 -220353 -199768 -331074 -424943 -305298 -491828 -364936 121791 357100 282351 186700
7176A86700m4052O755j70023p9931n9983J87503Q1289P5078n106k59398l41256
7165d22424j93524K08397L9718R8520L0995L2109j53379m4873j57814o7437J00597
7154e29115P275M2221K2262J64627J33580o5411N8443J70678j14288K548O8801
7143c8379j12876k0599R0986l6342m8606j46028J70047K74281l1211k46390P5578
7132f9539J55514J45151Q066j13910o7786j46107P5496j57285j6619J92685M348
7121A0014j83693j17104m6489K08007P8403p6476m9245j90306l712L35540K01756
7110A66695q7040j5900K10236K06192p829q6254k02551K9779K5486j07329K03183
7099C34668L648j19589k9932r7965j32974j10886l1232J43927K05472L9057j54834
$$ plain form
7176 186700 142648 149403 -20620 -100551 -160534 26969 108258 183336 178230 -81168 -422424
7165 -422424 -615948 -407551 -367833 -269313 -238318 -206209 -359588 -404461 -562275 -629712 -529115
7154 -529115 -521840 -479619 -457357 -292730 -159150 -224561 -166118 4560 -109728 -107180 -38379
7143 -38379 -151255 -171854 -80868 -117210 -165816 -311844 -141797 132484 101273 -145117 -69539
7132 -69539 85975 231126 239192 125282 57496 -88611 -13115 -170400 -187019 5666 10014
7121 10014 -173679 -290783 -337272 -129265 -50862 -127338 -176583 -366889 -370601 -35061 166695
7110 166695 79655 63755 273991 480183 472354 386100 183549 213328 238814 131485 334668
7099 334668 338316 218727 188795 90830 -42144 -153030 -184262 -40335 165137 204194 49360
7088D9360j19465j61835K27591J1096j24276K0930L7625N6513q6310m4682p6368
7077b09821J35337j11769j21631j7773l6703M4128O9817k4294N490J27255M9433
7066i0531j9948n035k11119j45664j46306K55531J48274k4480j14751l0570J58190
7055b26409N8716k9526K1090p4320J65090O5778n0845P1163p6152K92J77999r8825
7043D051j82045n1506J38634j31414J9606K12545j60401P0160N2368r5263m4871
7032a68136L0089J49269J65655k76948r8585J70988R3392k34669j78984P6569
7022b71360K46867L47582M4437j38584m7189l43019j81359L5949p1145O9214J54525
7011a54082k38049P128K53552P8478K2022r496j47297p9370k4057p9726k0813
$$ plain form
7088 49360 -70105 -231940 -4349 6747 -117529 -96599 -58974 -2461 -88771 -133453 -209821
7077 -209821 -74484 -186253 -307884 -325657 -362360 -318232 -248415 -272709 -267219 -139964 -90531
7066 -90531 -110479 -115514 -326633 -472297 -618603 -363072 -214798 -239278 -354029 -384599 -226409
7055 -226409 -167693 -197219 -176129 -250449 -85359 -19581 -70426 737 -75415 -75123 102876 4051
7043 4051 -177994 -229500 -90866 -222280 -202674 9871 -150530 -80370 -28002 -123265 -168136
7032 -168136 -138047 11222 176877 -100071 -198656 -27668 65724 -168945 -347929 -271360
7022 -271360 -24493 323089 367526 228942 181753 -161266 -342625 -306676 -377821 -308607 -154082
7011 -154082 -392131 -385003 -131451 -52973 -30951 -40447 -187744 -267114 -291171 -370897 -391710
7000c91710M8774J20731k1004l02021K7626K03366J25815j84537J7806j688J62464
6989a94378J97935j28470J6487j22181l7574r2807K3477K9745p3563R5977L8102
6978b47250j66316J26014L48183P3090k71813p0537R3129j28135m4464J3444P6881
6967a97774K04226o6125k33650K29567n7478M8105N5170j69348j47691n5521K59304
6956a31215J9169q3955P9458J61174j48995k35338J04326N4241r8297j29715k0834
6945d29981Q2209Q3077r5755Q1423P4010J32969J73673m7195N6000J50125M543
6934B65098k27475m38046m6677L68696J09972l7302J6591P0490J10747O2202q2930
6923A71366m8453k80397k7712j97931j46131J5553J69705j59521L0158K310L63282
$$ plain form
7000 -391710 -342936 -222205 -243209 -545230 -517604 -314238 -188423 -372960 -355154 -356842 -194378
6989 -194378 3557 -124913 -108426 -230607 -268181 -360988 -337511 -307766 -381329 -285352 -247250
6978 -247250 -413566 -287552 60631 133721 -138092 -208629 -115500 -243635 -288099 -274655 -197774
6967 -197774 6452 -59673 -293323 -63756 -121234 -73129 -17959 -187307 -334998 -390519 -131215
6956 -131215 -112046 -196001 -116543 44631 -104364 -339702 -235376 -181135 -279432 -409147 -429981
6945 -429981 -347772 -264695 -360450 -279027 -205017 -72048 101625 54430 110430 260555 265098
6934 265098 37623 -400423 -447100 -78404 31568 -5734 10857 81347 192094 254296 171366
6923 171366 122913 -157484 -185196 -383127 -529258 -513705 -344000 -503521 -473363 -471053 -107771
6912a07771K43945o5577l8587j15512j53383k35736k4586N5114l2523L69106j10171
6901b15681k11696J68856K35340K17869j31631j1673j89377J13820K81891M0882
6891B98600l51907l1368K82539J42394q5003k06763Q0327N472k1736j90929J25202
6880D6828J70284J2273j45593k83356j28349M4262J97543J22098l0491k55738
6870b50239J13102J67640l56914M4971M18719j0606j16778J13523r1765j11742
6860h0089J88329L1538j66094L7444j81830l1308N053j22904m2533J253p3522
6849d34663n3228R2065K46141J74826L0029n4014k5035J23858k5430k50791j605
6838a77847J21598L6653R5194L0654r7007k63773j09190Q4196K49709J89764K19623
$$ plain form
6912 -107771 136174 70597 32010 -83502 -236885 -472621 -497207 -442093 -474616 -105510 -215681
6901 -215681 -427377 -258521 -23181 194688 63057 51384 -137993 -24173 257718 298600
6891 298600 -53307 -84675 197864 340258 255255 48492 128819 134291 112555 -78374 46828
6880 46828 217112 229385 83792 -199564 -327913 -283651 -86108 35990 5499 -250239
6870 -250239 -137137 30503 -326411 -281440 137279 126673 9895 123418 31653 -80089
6860 -80089 108240 139778 -26316 11128 -170702 -202010 -196957 -319861 -362394 -361141 -434663
6849 -434663 -487891 -395826 -149685 25141 55170 1156 -23879 99979 74549 -176242 -177847
6838 -177847 -56249 -19596 75598 106252 9245 -254528 -363718 -279522 -29813 159951 379574
6827C79574l14160M297o2829j60124J97549J87920N0017j63598k55920k24160
6817c61434l9037J116o8201K52020J00908Q2448m276k1898m317k29809k23173
6806e15653p3013j18834j14521n1818q7212J36034K61770k1676J51250K58726
6796a74947k00834r6335k34996l4710k2885J26383J46954j04456k9640L36935
6786b88531L30067R7316K039L5846Q4190j77179l8005J6694l2248j05398p8471
6775a53680m3375l05114N1956K65168M3120K29788k30066k36460l2275M0968Q1644
6764b88326J3258J25569j52348j9144k8471o0393L8568L592m2714J46339J41254
6753a22816p9178l7653M4286J67433q0381n4843R0715r1731p9610K70626J97823
$$ plain form
6827 379574 65414 69711 6882 -153242 44307 232227 282244 118646 -137274 -361434
6817 -361434 -400471 -399355 -467556 -215536 -114628 -32180 -36456 -58354 -62671 -292480 -515653
6806 -515653 -588666 -707500 -822021 -873839 -961051 -825017 -563247 -584923 -433673 -174947
6796 -174947 -375781 -472116 -707112 -741822 -764707 -638324 -491370 -595826 -625466 -288531
6786 -288531 41536 138852 140891 176737 260927 83748 45743 62437 30189 -75209 -153680
6775 -153680 -197055 -502169 -450213 -185045 -141925 87863 -142203 -378663 -410938 -369970 -288326
6764 -288326 -275068 -149499 -301847 -320991 -349462 -409855 -371287 -367695 -410409 -264070 -122816
6753 -122816 -201994 -239647 -195361 -27928 -108309 -163152 -72437 -164168 -243778 26848 224671
6742B24671j8935r3119J40089K09967j40683k97215l04896j42855m0560P2200
6732c91336J92995O2702j04460l11400M596M06842J25708r433j67597j23530J07067
6721b07846n1780j36966P5688Q3975J18153J23787J30214j59529j59662K2066
6711a61900J18295K26443L4883j04411R2436r86j29735m8867l9865K54538J08106
6700C48937L8149J42330j44873j53193p5905k87385j80808j67857o8039K02993
6690c45651J85357m053k32250j64590J40607j0256J1722J17708K2886o487l3579
6679c18586J00011K06891J3492p6712j35186l5216n9270l021l1181L7694j0148
6668c11232R8326j34802j65704K39368K90814M9846q5816J33413J30042j28680
$$ plain form
6742 224671 205736 112617 252706 462673 321990 24775 -280121 -422976 -463536 -391336
6732 -391336 -198341 -135639 -240099 -551499 -546903 -140061 -14353 -23786 -191383 -314913 -207846
6721 -207846 -259626 -396592 -320904 -236929 -118776 5011 135225 -24304 -183966 -161900
6711 -161900 -43605 182838 217721 113310 205746 204760 75025 26158 -13707 240831 348937
6700 348937 387086 529416 384543 231350 155445 -131940 -312748 -480605 -548644 -345651
6690 -345651 -160294 -164347 -396597 -561187 -420580 -430836 -419114 -301406 -278520 -285007 -318586
6679 -318586 -218575 -11684 1808 -74904 -210090 -245306 -304576 -307597 -338778 -301084 -311232
6668 -311232 -212906 -347708 -513412 -274044 16770 66616 -19200 114213 244255 115575
6658A15575r6835K0072N7773j15810j73513r8862j18410j34742J75797K18712
6648a50243O9979J7066O465k12270l9966Q6583k0778p038K15587J5735J4475J24465
6636A20060j03702j866j37162p3394q0916O4601J17462l1304n0952J06595K44833
6625A74255n9651m5057j46868O0452L2485J20981L8158q3888j858K99202r2683
6614B95528l09006r3213K41079K50023j72540j16299n9555r4096L0675P7559J22714
6603A72869J38151k97337j93038M0073r1190M9066J05126m736J19511n0793k66605
6592b78903k08050N0324J01155L69794J47206P8753j15818k1429j12735n8268
6582d7971o8481j6377j2281O953N6269J49794o2802j43846j2246j7748J85325
$$ plain form
6658 115575 18740 38812 96585 -19225 -192738 -291600 -410010 -544752 -368955 -150243
6648 -150243 -80264 -63198 -56733 -269003 -308969 -222386 -243164 -250202 -34615 -18880 -4405 120060
6636 120060 16358 14492 -122670 -196064 -276980 -212379 -94917 -126221 -177173 -70578 174255
6625 174255 114604 69547 -77321 -16869 15616 136597 174755 90867 89009 388211 295528
6614 295528 -13478 -106691 134388 384411 211871 95572 36017 -58079 -27404 50155 172869
6603 172869 311020 13683 -179355 -139282 -230472 -181406 -76280 -81016 38495 -12298 -278903
6592 -278903 -486953 -436629 -335474 34320 181526 260279 144461 123032 10297 -47971
6582 -47971 -116452 -132829 -145110 -138157 -81888 67906 5104 -138742 -150988 -168736 16589
6571A6589m8085k8366p5900L4541j09250l0134Q7317J00708K01849J91245j55609
6560A84905j86296Q540K0876q0438j60597j7828L45021M2616P5917R6066k08449
6549A20333j23730K6821J4670o3268K00966L6378j15123l1000j49369j98719K6741
6538b55300J74787r2586K13357l8827J68761j11936J4584M340q1889k8802Q4772
6527E1261J06811j99655r1649K89152j79766j01883J58952L3257m04067J0412
6517c27175J93204K64392r0459l7731p8274L8078M3127M9590L08338R5997n1574
6506D07513o2165k74108k3594N4828r0882j50140N306J31187L6404J03388p6074
6495F1663l0567o7247k78016j04103K23301J6549o3664r3148k3499K14117J82385
$$ plain form
6571 16589 -31496 -59862 -135762 -101221 -210471 -240605 -153288 -52580 149269 340514 184905
6560 184905 -1391 7149 28025 -52413 -213010 -230838 114183 156799 232716 328782 120333
6549 120333 -3397 23424 38094 -25174 175792 212170 97047 66047 -83322 -282041 -255300
6538 -255300 -80513 -173099 40258 1431 170192 58256 72840 77180 -4709 -33511 51261
6527 51261 158072 -41583 -133232 155920 -23846 -125729 33223 66480 -337587 -327175
6517 -327175 -133971 130421 39962 2231 -76043 -37965 5162 54752 363090 459087 407513
6506 407513 345348 71240 47646 102474 11592 -138548 -133242 -2055 34349 137737 61663
6495 61663 31096 -36151 -314167 -418270 -194969 -178420 -242084 -335232 -358731 -144614 37771
6484C7771M8650K01879l506l98256M9467m5329r4811J73085l480m7097L7127j5381
6472e9881O6753j448j56373j90359R1962J23880k9259N5878J36563K14318p4308
6461A77726j74218p0300n5939q6798j96335q9536p4521J6794J48492N7715L44331
6450b589K25866k31228k87220j11766J52268J60643K38918N5832k20318l66440
6440c86034q0772L88670J64156j90195K9418r362m6456k0600K19983q1854j29078
6429a42124M4450J26992O9677j77553o3281j28034O3480J36150K21175O1644j64113
6418D8463o9508N4935O347K74236L9505l19094j96605j6847P7001M5774k17119
6407b72912k8751J89327j33540j52789L9025J52025P3513j17559o8330K51539
$$ plain form
6484 37771 86421 288300 284794 -113462 -63995 -109324 -204135 -31050 -34530 -81627 -44500 -59881
6472 -59881 6872 5424 -150949 -341308 -249346 -125466 -154725 -98847 37716 252034 177726
6461 177726 3508 -66792 -122731 -209529 -405864 -495400 -569921 -553127 -404635 -346920 -2589
6450 -2589 223277 -7951 -295171 -406937 -254669 -94026 144892 200724 -19594 -386034
6440 -386034 -466806 -78136 86020 -104175 -74757 -84119 -130575 -151175 68808 -13046 -142124
6429 -142124 -97674 29318 98995 -78558 -141839 -269873 -206393 -70243 150932 212576 48463
6418 48463 -21045 33890 40237 314473 353978 34884 -161721 -178568 -101567 -55793 -272912
6407 -272912 -301663 -112336 -245876 -398665 -359640 -207615 -134102 -251661 -319991 -68452
6397f8452J38419N048k29522O8460J48531K6520j23478m8268j781N7775l8837
6386f5585j22232o3764j08042N3033n94J02662M6287L5949J32201k6147j08506
6375a24738J80502L26161k9288o3381J26030j6512j12222k2585J27646J17261
6365E08874l26910j28868p0934j53918k5328J08590o2284o7400j91908p9959K84210
6354b05835K84459M8666j09091o337J1047k09220O570J62868K01033m507L9342
6343B18995K7263k17746j58519K74284k01616j73723J32665m2553j31392m7042
6333c19384R119k8228Q4549J31108J31530J08905j89276j35002K16987J23211
6323A33519k13025j09135L1223n1542j13775J00253P1233J06145j17413l0398
$$ plain form
6397 -68452 69967 75015 -154507 -86047 62484 89004 -34474 -82742 -84523 -26748 -65585
6386 -65585 -187817 -251581 -359623 -306590 -307184 -204522 -158235 -122286 9915 -16232 -124738
6375 -124738 55764 381925 352637 289256 415286 398774 286552 263967 391613 508874
6365 508874 181964 53096 -17838 -171756 -197084 -88494 -150778 -218178 -410086 -490045 -205835
6354 -205835 78624 127290 18199 11862 22909 -186311 -179741 -16873 184160 179653 218995
6343 218995 246258 28512 -130007 144277 -57339 -231062 -98397 -140950 -272342 -319384
6333 -319384 -310265 -338493 -253944 -122836 8694 117599 -71677 -206679 10308 133519
6323 133519 -79506 -188641 -157418 -208960 -322735 -222482 -151249 -45104 -162517 -192915
6313a92915j06856m7516M8966O2381K64395J76814k36069k05573n4082l3683k7176
6302c51314P6487J00825n1081K3480P36J62389N1071P3220R7741K3192j87951
6291A8795j57163j04086j87727P5820J96271k5761N9822J5327j52194k3347k6861
6280c11104J10299K4979j6737K25295O3262j70005P3463r9737l13214L4700K03583
6269a75216L6431j79692j3371J80850K03128j33268k09178J35200L0412Q8114
6259c6590J83655k17556J11016k6049j70099r1426j35888o5643k4641L6915J00717
6248c35589O1507J56544J04788J60161Q0401k57662k86230K8606q1988j37734
6238e07196L5718j10804m5549K85418K52363J39697j54348n8146J98716O8374
$$ plain form
6313 -192915 -299771 -347287 -298321 -235940 28455 205269 -30800 -236373 -290455 -324138 -351314
6302 -351314 -274827 -174002 -225083 -201603 -200867 -38478 12593 85813 183554 206746 18795
6291 18795 -138368 -242454 -430181 -354361 -158090 -183851 -124029 -108702 -260896 -284243 -311104
6280 -311104 -200805 -175826 -192563 32732 95994 -74011 -548 -100285 -413499 -378799 -175216
6269 -175216 -138785 -318477 -331848 -150998 52130 -81138 -290316 -155116 -124704 -36590
6259 -36590 147065 -70491 40525 14476 -155623 -247049 -382937 -448580 -473221 -436306 -335589
6248 -335589 -274082 -117538 -12750 147411 227812 -29850 -316080 -287474 -369462 -507196
6238 -507196 -471478 -582282 -627831 -342413 -90050 49647 -104701 -162847 35869 104243
6228A04243o9525j32550j59367j43951K7523J78049O0543m8986q5944K14939p2507
6217a27533j64580K25901Q5059j02623J12034K59597j76334j67630J22243j23717
6207e7583R1670L84042j9742l07086P1536k6M9280j39804j47246P5766r8523r6262
6195a93978k137n8243J08036K32757p6591n0073J09630n9933j81735r8183K22129
6184d8321K30306r529j17560j35281J00248L7039l36036N0512Q1553N3832Q798
6173h4439k47729L7300K19697q4460k53080q3304M19982J78154k2285p203J19023
6162A91656j25611k44825m834K1355J45560K37249P6765R7984J16923j90952j9036
6151C02234l9226j25226j14540m1413m717M1134K41959j1007p940j51915j52775
$$ plain form
6228 104243 34718 -97832 -257199 -401150 -373627 -195578 -135035 -184021 -269965 -55026 -127533
6217 -127533 -292113 -66212 18847 -83776 28258 287855 111521 -56109 66134 -57583
6207 -57583 34087 418129 398387 91301 162837 162811 212091 72287 -74959 807 -97716 -193978
6195 -193978 -196115 -254358 -146322 86435 9844 -40229 69401 9468 -172267 -270450 -48321
6184 -48321 181985 172456 54896 -80385 19863 56902 -279134 -228622 -147069 -93237 -84439
6173 -84439 -332168 -294868 -75171 -159631 -412711 -496015 -76033 102121 79836 72633 191656
6162 191656 66045 -178780 -183614 -162259 -16699 220550 297315 395299 512222 321270 302234
6151 302234 263008 137782 23242 -18171 -22888 18246 260205 249198 241258 89343 -63432
6140f3432n0020o7284m9161J90925J35291j849j98384q7897j6198P2848J27260
6129g901j50449j12274J36899J54695J1754P4252j92446j42160l088J6625K85732
6118G1639L27776j73756q8818l1631J53j8135k42497K46456K19876l2431R3589
6107C72221r8981L2J30131j11774j48423j12913O8727K33911m7927k01993j658
6096H1353o6247k3401K0696L51559k93176k31522J20196J5551l8188J136j34455
6085a96498j41436k25954Q3923K33943O9587J09860J78200M1705l8634K8670J8605
6074A61971o57J4332P7386r087J92475J54083j12169k27742k08162m0271J30776
6063A32935r103j11372O6360j02578j91379k4144K07457j36355k37309k90845
$$ plain form
6140 -63432 -113452 -180736 -229897 -38972 96319 94470 -103914 -191811 -208009 -135161 -7901
6129 -7901 -158350 -270624 -133725 20970 32724 106976 -85470 -227630 -230718 -214093 71639
6118 71639 399415 225659 136841 105210 105363 87228 -155269 91187 311063 278632 372221
6107 372221 273240 273272 403403 291629 143206 30293 99020 332931 285004 83011 81353
6096 81353 15106 -8295 12401 363960 70784 -160738 -40542 -24991 -63179 -62043 -196498
6085 -196498 -337934 -563888 -479965 -246022 -176435 -66575 111625 153330 114696 143366 161971
6074 161971 161314 175646 253032 243945 436420 590503 478334 250592 42430 2159 132935
6063 132935 123832 12460 78820 -23758 -215137 -239281 -31824 -168179 -405488 -696333
6053f96333J70665M20960K20225K743k09682r9697l2052J08070J01637o3006q7958
6042a64428K0263P0979J56N1287j06312M8702q2270O096J55628O9475J95318L5032
6030B99926j16333j4638J37005k21285k27339j21974l4775q6107L9157J10029
6020b36334J04501j30892q057O7916K74786J4253o5195N7207K59743l7189q3853
6009B16886k70726j21527J52560k52537j21092K77381J31404R8912m5043k15478
5999a49260j71519Q152L2531J10214K69972K04425j49453j56064j43302j8662
5989a62966r8615M2761K68691l1116n484j85398j40025j69094j61469J30715o8140
5978e80140J94850J00201n6498J34837P922o6421K60425m5081P5844J87297J63011
$$ plain form
6053 -696333 -525668 -104708 115517 118260 -91422 -191119 -223171 -115101 -13464 -76470 -164428
6042 -164428 -144165 -73186 -73030 -21743 -128055 -79353 -161623 -155527 101 69576 264894 299926
6030 299926 183593 168955 305960 84675 -142664 -264638 -299413 -385520 -346363 -236334
6020 -236334 -131833 -262725 -270782 -202866 71920 86173 20978 78185 337928 300739 216886
6009 216886 -53840 -175367 -22807 -275344 -396436 -119055 12349 111261 66218 -149260
5999 -149260 -320779 -312627 -280096 -169882 100090 304515 155062 -1002 -144304 -162966
5989 -162966 -261581 -218820 49871 18755 13271 -172127 -312152 -481246 -642715 -512000 -580140
5978 -580140 -385290 -285089 -341587 -206750 -198828 -265249 -4824 -49905 25939 213236 376247
5967C76247q7299j22745k71432k39372J16282o4547n0034K25830R7392o5402j64644
5956b49724K5602Q9205p6530q3262n2790m7189J27728o4852j85636J13641J21801
5945b82006R5898n3718m9725O6719O6261J386r4361L401R2957K55579R30j25677
5933b2356k19806j13371K89374J19725p7195O648J947k16015j26116m4828J07220
5922b94773n4194L055j27726k1816K36093K832l7096O4588K34636k53493q5345
5911c33239J20924K3344k5530j82235j62138k4719l9086o3140J50231K75686Q8047
5900a71855M3940O1609J23210m7607M3641j16897j22670O6780o1179q8277l5802
5889c05107k9878o7093k8288K16883m6078k16558n484J12175M6578R4534j6291
$$ plain form
5967 376247 288948 166203 -105229 -344601 -228319 -292866 -342900 -117070 -19678 -85080 -249724
5956 -249724 -224122 -134917 -211447 -294709 -347499 -394688 -266960 -331812 -517448 -403807 -282006
5945 -282006 -186108 -239826 -289551 -222832 -156571 -155185 -249546 -246145 -153188 102391 103321 -22356
5933 -22356 -242162 -355533 -66159 53566 -23629 -16981 -15034 -231049 -357165 -401993 -294773
5922 -294773 -348967 -345912 -473638 -495454 -259361 -256529 -293625 -229037 5599 -247894 -333239
5911 -333239 -212315 -188971 -214501 -396736 -558874 -583593 -622679 -685819 -535588 -259902 -171855
5900 -171855 -127915 -66306 56904 9297 52938 -63959 -186629 -119849 -181028 -269305 -305107
5889 -305107 -334985 -402078 -430366 -213483 -259561 -476119 -481603 -369428 -322850 -228316 -244607
5878b44607P8863L7673K94649j60550k26579J51071M3926M770M4991q5721J44467
5867H2953j58034j24765J37061J93659Q9176O6089R8482j31702N4821q2316k06940
5856A8484k05842Q153N5225l3572j23727j8660K16148J38371N3420K9253k39337
5845a02084j22938J25633K89111N5441j01676j19693p5393j50632K20444J60097
5835A78310l2868j03452J09562M2875j95291J10860J5014K54865L8504k02930
5825B15449j83552M5900L854j54675k9094j19706p0702j21290k5873J14362j3490
5814c38817m2685J95881K22375n5450M2055j43430Q4451O7079l15382r0863J4049
5803c60737R9092J34328j61709k4897N5167P0831k16499M3820J50912M1885k6760
$$ plain form
5878 -244607 -165744 -128071 166578 6028 -220551 -69480 -25554 -20784 24207 -61514 82953
5867 82953 -75081 -199846 -62785 130874 220050 286139 384621 252919 307740 225424 18484
5856 18484 -187358 -179205 -123980 -157552 -281279 -299939 -83791 54580 108000 137253 -102084
5845 -102084 -225022 -99389 189722 245163 143487 23794 -51599 -202231 18213 178310
5835 178310 145442 41990 151552 194427 -864 109996 125010 379875 418379 215449
5825 215449 31897 77797 81651 -73024 -102118 -221824 -292526 -413816 -439689 -325327 -338817
5814 -338817 -381502 -185621 36754 -18696 23359 -120071 -35620 31459 -283923 -374786 -360737
5803 -360737 -261645 -127317 -289026 -313923 -258756 -187925 -404424 -360604 -209692 -167807 -194567
5792a94567J96339j1847j4672J57249L5055k45491J35942L8704l5425J02827K87228
5781D51342l20442l07198q6531J04768J757k9268r0218J17478O9082k92075k15402
5770e96707l2896q6024J29891J88225R4753M9791J04576l4227j330l421Q942k566
5758a80993N4534L1901n3033N2872L2925l4136M198J31264J95548j37268l37877
5747b40065n5595P4713R1530K454J16532M7876J95503J13428j51458j41478j94702
5736a41262R6074K8512j59469K1509M4457j5055k15139n1444j08380k1377p6028
5725e97602J05588J35090j3756K79377Q7080j26553j45437L2852m6188o3311J7685
5714c35175R6340R1636l334j15240J38934n2182k07288J03473O1387J43681j66584
$$ plain form
5792 -194567 1772 -10075 -24747 132502 167557 -77934 58008 96712 61287 164114 451342
5781 451342 130900 -176298 -262829 -158061 -156304 -185572 -275790 -158312 -89230 -381305 -596707
5770 -596707 -629603 -715627 -585736 -397511 -302758 -252967 -148391 -182618 -183948 -187369 -178427 -180993
5758 -180993 -126459 -94558 -147591 -94719 -61794 -95930 -91732 39532 235080 97812 -240065
5747 -240065 -295660 -220947 -129417 -126963 -10431 37445 232948 346376 194918 53440 -141262
5736 -141262 -45188 -16676 -176145 -154636 -110179 -125234 -340373 -391817 -500197 -521574 -597602
5725 -597602 -492014 -356924 -370680 -91303 -4223 -130776 -276213 -243361 -289549 -352860 -335175
5714 -335175 -238835 -147199 -150533 -265773 -126839 -179021 -386309 -282836 -221449 -77768 -244352
5703b44352k23262L0027J51357R5483K12795Q1550K8907M6164p0936K4385m2339
5692H9779j19364j83167L5115R0232j16697J39652K12497K30010j19008k26237
5682C2812J88389J13298k67313j45168l1680J28304j66595L0400r1393n9789P61
5671b67974j43347k76497R1238L349J24789J56090r7895M125J3895K18585J94462
5660B0820r8480m5002j02605j9330j17139Q933K04250p7246M5978l8811p515J42003
5648h4144k8830J23236Q1607j10502r7924j24331K2122L4590r8652K08408J54189
5637G9769k68630m23663K2063J54340K55535J14467L38290M4577l53515j67021
5627b03788R3446R5510j22810n2952K91476O7839m3842m1351j54668r8324q4114
$$ plain form
5703 -244352 -467614 -437587 -286230 -190747 22048 103598 132505 178669 107733 132118 89779
5692 89779 -29585 -212752 -177637 -87405 -204102 -64450 148047 378057 259049 32812
5682 32812 221201 334499 67186 -77982 -109662 18642 -147953 -117553 -208946 -268735 -267974
5671 -267974 -411321 -687818 -596580 -593231 -468442 -312352 -410247 -406122 -392227 -173642 20820
5660 20820 -77660 -122662 -225267 -244597 -361736 -352803 -148553 -225799 -179821 -218632 -226147 -84144
5648 -84144 -112974 10262 91869 -18633 -116557 -240888 -218766 -184176 -282828 -74420 79769
5637 79769 -188861 -612524 -590461 -436121 -180586 -66119 272171 316748 -36767 -203788
5627 -203788 -110342 -14832 -137642 -190594 100882 168721 124879 83528 -71140 -169464 -253578
5616b53578j5725k05533J21525n7040o298J62220P1549j10314j8032n1216k87382
5605f49824J35323L73661M31758m6459k88900J17316J64857l4897j89382M675
5595A8128n003l0603n2815J03091L4931J17424P3459j51874Q743m3646P0121Q8459
5583B30415j93683l04236j12650J8956k42489j44483J87794J60487K48117k3891
5573a75663o8944m8270q148N2587L1315L1975q3352k37423j61857J05395j6615
5562e79000r5172R1324L7330J21099m7806j56036j97057J54104K82828L0179k4305
5551c82512k1771q5873K02437J88187n5999q0866J38275Q093M2061J61714L502
5540A17248M5204N3305J01557l02391l00912j82098P70J3081j75215J75290M1406
$$ plain form
5616 -253578 -269303 -474836 -353311 -410351 -416649 -254429 -182880 -293194 -311226 -362442 -649824
5605 -649824 -514501 -140840 290918 244459 -44441 72875 237732 202835 13453 18128
5595 18128 13125 -17478 -70293 32798 67729 185153 258612 106738 115481 71835 141956 230415
5583 230415 36732 -267504 -380154 -361198 -603687 -748170 -560376 -399889 -151772 -175663
5573 -175663 -244607 -292877 -301025 -248438 -217123 -185148 -268500 -505923 -667780 -562385 -579000
5562 -579000 -674172 -582848 -545518 -424419 -472225 -628261 -825318 -671214 -388386 -358207 -382512
5551 -382512 -404283 -490156 -287719 -99532 -155531 -236397 -98122 -90029 -47968 113746 117248
5540 117248 162452 215757 317314 14923 -285989 -468087 -467317 -454236 -629451 -454161 -412755
5529d12755J11912m0663j70166J11631L31049J51497k30063k08082M1870J96811
5519a16959J22850J68539Q564m00482j65693K15575L06015Q6278O9412m1512j40605
5508A11982j02208j75885M9608O8466K5258j06253L7131n8071J48596J49076j16459
5497C1241k01394m8783L8654k5865j25519J12007J07390j50903k61103N3390L41986
5486a28899p9055j08574O8069J7873J98592j97620k15247J65913P8333Q3697l314
5475a20232M3966o2849l0094M5856L30142J6035k0465l1939o7016M9806q0309
5464G2901l51937J21726k2137j99518N8532l7660M7453J22620N6041k29095P0938
5453b90136K59700J5715r4806J01893L5048n9555o8603r5476J51566R1751J48957
$$ plain form
5529 -412755 -300843 -341506 -511672 -400041 -68992 82505 -147558 -355640 -313770 -116959
5519 -116959 5891 174430 182994 -217488 -383181 -167606 138409 224687 294099 252587 111982
5508 111982 9774 -166111 -116503 -48037 -22779 -129032 -91901 -149972 -1376 147700 31241
5497 31241 -170153 -218936 -180282 -206147 -331666 -219659 -112269 -263172 -524275 -470885 -128899
5486 -128899 -207954 -316528 -248459 -230586 -31994 -229614 -444861 -278948 -200615 -116918 -120232
5475 -120232 -76266 -139115 -169209 -123353 206789 222824 202359 170420 103404 153210 72901
5464 72901 -279036 -157310 -179447 -378965 -320433 -358093 -310640 -188020 -131979 -361074 -290136
5453 -290136 -30436 -14721 -109527 -7634 27414 -32141 -100744 -196220 -44654 47097 196054
5442A96054R8907n8766Q7884j26485J36837j05590o5413J41924j00316j75963
5432B9073J3064J17015J44775p0457k5181m7056j67391k13947k8705k7386j59333
5421d35529J27747K14073K2598K8406j1369n4923m9693k24514L8038K11423m8400
$$ plain form
5442 196054 294961 236195 324079 197594 334431 228841 163428 305352 205036 29073
5432 29073 42137 159152 303927 233470 208289 161233 -6158 -220105 -248810 -276196 -435529
5421 -435529 -307782 -93709 -71111 -42705 -54074 -108997 -158690 -383204 -345166 -133743 -182143
$$ [...]
##END NTUPLES=NMR SPECTRUM
##END=
