##TITLE=Analysis number 313062
Compound Code cc 13101
Book Reference 441/123
Project Code adrs
Chemist Name colinb
##JCAMPDX= 6.0         $$ Bruker NMR JCAMP-DX V2.0
##DATA TYPE= NMR SPECTRUM
##DATA CLASS= NTUPLES
##ORIGIN= Bruker BioSpin GmbH
##OWNER= NMR
$$ XWIN-NMR		Version 3.5
$$ Wed Aug 24 13:14:18 2005 GMT Daylight Time (UT+1h)  MAYBRIDGE\NMR@NMR_250MHZ
##.OBSERVE FREQUENCY= 250.131544655141
##.OBSERVE NUCLEUS= ^1H
##.ACQUISITION MODE= SIMULTANEOUS (DQD)
##.ACQUISITION SCHEME= undefined
##.AVERAGES= 16
##.DIGITISER RES= 18
##SPECTROMETER/DATA SYSTEM= dpx250
##.PULSE SEQUENCE= zg30
##.SOLVENT NAME= DMSO
##.SHIFT REFERENCE= (INTERNAL, DMSO, 0, 16.522)
##AUDIT TRAIL= $$ (NUMBER, WHEN, WHO, WHERE, WHAT)
$$ ##TITLE= Audit trail, XWIN-NMR		Version 3.5
$$ ##JCAMPDX= 5.01
$$ ##ORIGIN= Bruker BioSpin GmbH
$$ ##OWNER= NMR
$$ C:\u/data/dgb/nmr/ADRS/8510/pdata/1/auditp.txt
$$ ##AUDIT TRAIL=  $$ (NUMBER, WHEN, WHO, WHERE, WHAT)
(   1,<2005-08-24 13:13:59.74 +100>,<MAYBRIDGE\NMR>,<NMR_250MHZ>,
      <created by zg, POWCHK disabled, PULCHK disabled
       configuration hash MD5:
       62 19 C7 07 E1 42 D1 B7 37 6C 3D D0 77 39 F9 E6
       data hash MD5: 64K
       59 85 DC AC 5F A5 C3 46 2B DD 8F 2B C0 E1 11 44>)
(   2,<2005-08-24 13:14:11.33 +100>,<MAYBRIDGE\NMR>,<NMR_250MHZ>,
      <Start of raw data processing
       ef LB = 0.3 FT_mod = 6 PKNL = 1 SI = 32K 
       data hash MD5: 32K
       1B 50 60 2E 90 54 2C 83 66 58 53 3E E0 68 E6 A4>)
(   3,<2005-08-24 13:14:13.11 +100>,<MAYBRIDGE\NMR>,<NMR_250MHZ>,
      <apk 
       data hash MD5: 32K
       9F 56 12 82 52 31 D3 15 CF EF 82 35 24 46 E2 E3>)
(   4,<2005-08-24 13:14:13.77 +100>,<MAYBRIDGE\NMR>,<NMR_250MHZ>,
      <abs ABSG = 5 
       data hash MD5: 32K
       45 47 A1 6E 6F 68 82 E2 43 AE 9D AB C2 6C 02 29>)
$$ ##END=
$$ 
$$ hash MD5
$$ 16 EB D5 B1 DC 2A FD AF AD 4B 38 FC 9C 39 5D 43
##$RELAX= 
##$RELAX= 
##$RELAX= 
##$RELAX= 
##$RELAX= 
##$RELAX= 
##$RELAX= 
$$ Bruker specific parameters
$$ --------------------------
##$DU= <C:\u>
##$EXPNO= 8510
##$NAME= <ADRS>
##$PROCNO= 1
##$TYPE= <nmr>
##$USER= <dgb>
##$AMP= (0..31)
100 100 100 100 100 100 100 100 100 100 100 100 100 100 100 100 100 100 
100 100 100 100 100 100 100 100 100 100 100 100 100 100 
##$AQSEQ= 0
##$AQ_mod= 3
##$AUNM= <au_zg>
##$AUTOPOS= <32 >
##$BF1= 250.13
##$BF2= 250.13
##$BF3= 250.13
##$BF4= 250.13
##$BF5= 500.13
##$BF6= 500.13
##$BF7= 500.13
##$BF8= 500.13
##$BYTORDA= 1
##$CFDGTYP= 0
##$CFRGTYP= 5
##$CHEMSTR= <none>
##$CNST= (0..31)
1 1 145 1 1 1 1 1 1 1 1 1 1 1 1 1 1 1 1 1 1 1 1 1 1 1 1 1 1 1 1 1 
##$CPDPRG= <>
##$CPDPRG1= <>
##$CPDPRG2= <>
##$CPDPRG3= <>
##$CPDPRG4= <mlev>
##$CPDPRG5= <mlev>
##$CPDPRG6= <mlev>
##$CPDPRG7= <mlev>
##$CPDPRG8= <mlev>
##$CPDPRGB= <>
##$CPDPRGT= <>
##$D= (0..31)
0 1 0 0 0 0 0 0 0 0.06 0 0 0 0 0 0 0.0002 0 0 0 0 0 0 0 0 0 0 0 0 0 0 
0 
##$DATE= 1124885638
##$DBL= (0..7)
120 120 120 120 120 120 120 120 
##$DBP= (0..7)
150 150 150 150 150 150 150 150 
##$DBP07= 0
##$DBPNAM0= <>
##$DBPNAM1= <>
$$ [...]
##$SUBNAM7= <"">
##$SUBNAM8= <"">
##$SUBNAM9= <"">
##$SW= 20.6930455092707
##$SWIBOX= (0..15)
0 0 3 0 0 0 0 0 0 0 0 0 0 0 0 0 
##$SW_h= 5175.983436853
##$TD= 65536
##$TD0= 1
##$TE= 295.16
##$TE2= 300
##$TE3= 300
##$TEG= 300
##$TL= (0..7)
0 120 120 120 120 120 120 120 
##$TP= (0..7)
150 150 150 150 150 150 150 150 
##$TP07= 0
##$TPNAME0= <>
##$TPNAME1= <>
##$TPNAME2= <>
##$TPNAME3= <>
##$TPNAME4= <>
##$TPNAME5= <>
##$TPNAME6= <>
##$TPNAME7= <>
##$TPOAL= (0..7)
0.5 0.5 0.5 0.5 0.5 0.5 0.5 0.5 
##$TPOFFS= (0..7)
0 0 0 0 0 0 0 0 
##$TUNHIN= 0
##$TUNHOUT= 0
##$TUNXOUT= 0
##$USERA1= <user>
##$USERA2= <user>
##$USERA3= <user>
##$USERA4= <user>
##$USERA5= <user>
##$V9= 5
##$VALIST= <valist>
##$VCLIST= <CCCCCCCCCCCCCCC>
##$VD= 0
##$VDLIST= <DDDDDDDDDDDDDDD>
##$VPLIST= <PPPPPPPPPPPPPPP>
##$VTLIST= <TTTTTTTTTTTTTTT>
##$WBST= 1024
##$WBSW= 4
##$XGAIN= (0..3)
0 0 0 0 
##$XL= 0
##$YL= 0
##$YMAX_a= 341723
##$YMIN_a= -310801
##$ZGOPTNS= <>
##$ZL1= 120
##$ZL2= 120
##$ZL3= 120
##$ZL4= 120
##$ABSF1= 16.522
##$ABSF2= -4.171173
##$ABSG= 5
##$ABSL= 3
##$ALPHA= 0
##$AQORDER= 0
##$ASSFAC= 0
##$ASSFACI= 0
##$ASSFACX= 0
##$ASSWID= 0
##$AUNMP= <proc_1d>
##$AZFE= 0.1
##$AZFW= 0.1
##$BCFW= 0
##$BC_mod= 0
##$BYTORDP= 0
##$COROFFS= 0
##$CY= 12.5
##$DATMOD= 1
##$DC= 0
##$DFILT= <>
##$DTYPP= 0
##$F1P= 14.0000005364418
##$F2P= -0.99999901652339
##$FCOR= 0.5
##$FTSIZE= 32768
##$FT_mod= 6
##$GAMMA= 0
##$GB= 0
##$INTBC= 1
##$INTSCL= 1
##$ISEN= 128
##$LB= 0.3
##$LEV0= 0
##$LPBIN= 0
##$MAXI= 10000
##$MC2= 0
##$MEAN= 0
##$ME_mod= 0
##$MI= 0
##$NCOEF= 0
##$NC_proc= -5
##$NLEV= 6
##$NOISF1= 0
##$NOISF2= 0
##$NSP= 0
##$NTH_PI= 0
##$NZP= 0
##$OFFSET= 16.522
##$PC= 1
##$PHC0= -84.20767
##$PHC1= 7.725942
##$PH_mod= 1
##$PKNL= yes
##$PPARMOD= 0
##$PSCAL= 4
##$PSIGN= 0
##$REVERSE= no
##$SF= 250.13
##$SI= 32768
##$SIGF1= 0
##$SIGF2= 0
##$SINO= 400
##$SIOLD= 32768
##$SREGLST= <1H.DMSO>
##$SSB= 0
##$STSI= 32768
##$STSR= 0
##$SW_p= 5175.98343685301
##$SYMM= 0
##$S_DEV= 0
##$TDeff= 65536
##$TDoff= 0
##$TI= <Analysis number 999999
Compound Code 99
Book Reference 9
Project Code 9>
##$TILT= no
##$TM1= 0
##$TM2= 0
##$TOPLEV= 0
##$USERP1= <user>
##$USERP2= <user>
##$USERP3= <user>
##$USERP4= <user>
##$USERP5= <user>
##$WDW= 1
##$XDIM= 32768
##$YMAX_p= 326007335
##$YMIN_p= -663631
$$ End of Bruker specific parameters
$$ ---------------------------------
##NTUPLES= NMR SPECTRUM
##VAR_NAME=  FREQUENCY,     SPECTRUM/REAL,   SPECTRUM/IMAG
##SYMBOL=    X,             R,               I
##VAR_TYPE=  INDEPENDENT,   DEPENDENT,       DEPENDENT
##VAR_FORM=  AFFN,          ASDF,            ASDF
##VAR_DIM=   32768,         32768,           32768
##UNITS=     HZ,            ARBITRARY UNITS, ARBITRARY UNITS
##FACTOR=    0.157963299565203, 1,           1
##FIRST=     4132.6476996994, 0,             0
##LAST=      -1043.33573715361, 0,           0
##MIN=       -1043.33573715361, -663631,     0
##MAX=       4132.6476996994, 326007335,     0
$$ Real data points
##PAGE= N=1
##DATA TABLE= (X++(R..R)), XYDATA
$$ [...]
23547A60083j97686l878J07354j6407j01120O954k55522n8749K55716K03758l5703
$$ 160083 -37603 -41481 65873 49466 -51654 -44700 -300222 -358971 -103255 100503 64800
23536F4800o3609l0020J13381j52577p8222l1367n0626J33579O6491o0859k10160
$$ 64800 1191 -28829 84552 -68025 -146247 -177614 -228240 -94661 -28170 -89029 -299189
23525b99189r6739O1834K64737P2465L1241j21349J3541J16025J01092k09502
$$ -299189 -395928 -334094 -69357 3108 34349 -87000 -73459 42566 143658 -65844
23515f5844j63677J1132K5819M3927R7795M798j31479r2633J27592J32633R7175
$$ -65844 -229521 -218389 -192570 -148643 -50848 -46050 -177529 -270162 -142570 -9937 87238
23504H7238L3264r353L0124J09800p7353j02116j7120K4304J6512J7861k64700
$$ 87238 120502 111149 141273 251073 173720 71604 54484 78788 95300 113161 -151539
23493a51539k8970K23041J07696j29464j08440J8701O1537L663P083l7900o7279
$$ -151539 -180509 42532 150228 20764 -87676 -68975 -7438 -3775 3308 -34592 -101871
23482a01871K07564l2855k6626n3552P2016J13066j66134j48588j74644P920J83092
$$ -101871 105693 72838 46212 -7340 64676 177742 11608 -136980 -311624 -303704 -120612
23471a20612l8857l4870l7169q5926m2403P1537P8242L4228o5845n6125O5688
$$ -120612 -159469 -194339 -231508 -317434 -359837 -288300 -210058 -175830 -241675 -297800 -232112
23460b32112J18993j9906l5874l0477J47809J09310k3575l2295n9103L2432k0648
$$ -232112 -113119 -133025 -168899 -199376 -51567 57743 34168 1873 -57230 -24798 -45446
23449d5446l2984p172r0089J00543R7257n218j1297L422N9812K7020L6053n7389
$$ -45446 -78430 -85602 -175691 -75148 22109 16891 5594 9016 68828 95848 131901 74512
23437G4512k08619q6721M3932J23037K12761n2416R933J19061j02071q1888j04843
$$ 74512 -134107 -220828 -176896 -53859 158902 106486 116419 235480 133409 51521 -53322
23426e3322q6463O3510O7305K760M865R8313j48137K5400p1760j97686L3830K03129
$$ -53322 -139785 -76275 -8970 -6210 -1345 96968 -51169 -25769 -97529 -295215 -261385 -58256
23414e8256k8182K052J37433J03139J07355l2242L2160j79203m0426l1238j34277
$$ -58256 -86438 -84386 53047 156186 263541 231299 263459 84256 43830 12592 -121685
23403a21685j14890J1788k1502N4206J06597l3335L9432J37673r4529q0274J24183
$$ -121685 -236575 -224787 -246289 -192083 -85486 -118821 -79389 58284 -36245 -116519 7664
23392G664M1007n7717m7893Q8200p604n1599O8246L2630j51223n1236P4021M6391
$$ 7664 48671 -9046 -56939 31261 23657 -27942 40304 72934 -78289 -129525 -55504 -9113
23380i113p6813O3331j51531k34228J32691K75855l3932j33390M240J75832k3655
$$ -9113 -85926 -22595 -174126 -408354 -275663 192 -33740 -167130 -162890 12942 -10713
23369a0713k4225P930l6740o9992J2552m7997p0387J697J380J95826N7472P3470
$$ -10713 -34938 -27008 -63748 -133740 -121188 -169185 -239572 -237875 -236495 -40669 16803 90273
23357I0273n7118O2780j82975j48935N4387J02380J50877J30962P0436j91896
$$ 90273 33155 95935 -87040 -235975 -181588 -79208 71669 202631 273067 81171
23347H1171o9527k9466j2481Q21m0732j28684J68428P3946j74165J08770J07755
$$ 81171 11644 -17822 -30303 -29482 -70214 -198898 -30470 43476 -130689 -21919 85836
23336H5836Q8228O8004j23129j3629O9185j337N54J49821L5801o5714o5821P0257
$$ 85836 174064 242068 118939 105310 174495 173158 173712 323533 359334 293620 227799 298056
23324B98056j14801k95833j15461J8184R7791R6296Q8841q0658j44931o0878J00830
$$ 298056 183255 -112578 -228039 -209855 -112064 -15768 73073 -7585 -152516 -213394 -112564
23313a12564J99536j8439j28176n8802P6633p3465J04342N2667n8832l5457n0178
$$ -112564 86972 68533 -59643 -118445 -41812 -115277 -10935 41732 -17100 -52557 -102735
23302a02735M0661N7644L2702j9230Q2273j568j64110j52007r9953J10213J26182
$$ -102735 -62074 -4430 28272 9042 91315 89747 -74363 -226370 -326323 -216110 -89928
23291h9928L61157J69505j72973j34489p5435q6563j8235q7709P8498q709M363
$$ -89928 271229 440734 267761 133272 57837 -28726 -46961 -134670 -56172 -64881 -60518
23280f0518k2554K9196l6156p4188K12905o4689j3410O6819O4734j48650j46467
$$ -60518 -83072 -53876 -90032 -164220 48685 -16004 -29414 37405 102139 -46511 -192978
23269a92978M0093l5419N2829L06559K18381j09644k69667m6510r6923p1979K02912
$$ -192978 -152885 -188304 -135475 171084 389465 279821 10154 -36356 -133279 -205258 -2346
23258b346K00149L1082m7285Q3650n3220J2761K1623R347j86577j12199M6266
$$ -2346 197803 228885 181600 265250 212030 224791 246414 255761 69184 -43015 3251
23247C251L129o4959p1708Q5282P6278M2389j23776O5533J1200p2059K7073n038
$$ 3251 6380 -58579 -130287 -45005 31273 73662 -50114 15419 26619 -45440 -18367 -23405
23235b3405J01177k8667q3501j64249j6812J09338L3660R918J16551K23064n076
$$ -23405 77772 49105 -34396 -198645 -215457 -106119 -72459 -62541 54010 277074 271998
23224B71998j54357j22792n9938p4715J15059L6072n2016L06612p9416k89389
$$ 271998 117641 -5151 -65089 -139804 -24745 11327 -40689 265923 186507 -102882
23214a02882q3428N7529J81177J98867n1016j89461j1816k3456L1162R1180O7448
$$ -102882 -186310 -128781 52396 251263 200247 10786 -1030 -24486 6676 97856 165304
23203A65304l6450M1955J70774q3891j23849m7399j59364m3034j06867O0117O0298
$$ 165304 128854 170809 341583 257692 133843 86444 -72920 -115954 -222821 -162704 -102406
23192a02406q7072O8115O4120M2483J02542p9055p1523q9815J69510J338m4503
$$ -102406 -189478 -121363 -57243 -14760 87782 8727 -62796 -152611 16899 18237 -26266
23181b6266j04318k06671j34580J74427O4647K4642J09103M1536J42843P0794
$$ -26266 -130584 -337255 -471835 -297408 -232761 -208119 -99016 -57480 85363 156157
23171A56157J40264j23179l04205n1951P4227k6722k593o3477n9109K6555J12560
$$ 156157 296421 173242 -130963 -182914 -108687 -135409 -138002 -201479 -260588 -234033 -121473
23160a21473m8175l4340L7155l3885L3049M4357Q5260Q3506j03121j29197P2642
$$ -121473 -169648 -203988 -166833 -200718 -167669 -123312 -38052 45454 -57667 -186864 -114222
23149a14222N2245J62100j6112j36808M2259j4040p7214L7609L028j2632P2431
$$ -114222 -61977 100123 84011 -52797 -10538 -24578 -101792 -64183 -61155 -73787 -1356
23138a356j29783p0766K34958Q2938j05830o8997o8916L8548K08626m2208j11081
$$ -1356 -131139 -201905 33053 115991 10161 -58836 -127752 -89204 119422 77214 -33867
23127c3867N9120l1658q2549O848K0416o4200Q3367O6833J25457K3788r2720r9191
$$ -33867 25253 -6405 -88954 -82106 -61690 -125890 -42523 24310 149767 173555 80835 -18356
23115a8356l7910r6793n9380P3208m9419q1889J00389J73365L8034n5383J48714
$$ -18356 -56266 -153059 -212439 -139231 -188650 -270539 -170150 3215 41249 -14134 134580
23104A34580n1265M6204j19282N8204N765o2111r4514M5180K4256j04405r4496
$$ 134580 83315 129519 10237 68441 74206 12095 -82419 -37239 -12983 -117388 -211884
23093b11884J07746j3578R5213K40285j8023k00868M0928J27316R7134k6675j76725
$$ -211884 -104138 -117716 -22503 217782 199759 -1109 39819 167135 264269 237594 60869
23082F0869l2351n4346k42691o6761J27943K38229k33451j1724K75871O8751M4980
$$ 60869 28518 -25828 -268519 -335280 -207337 30892 -202559 -214283 61588 130339 175319
23071A75319m4488j8904J16694j2183n1039P061j01030j95612N3072M8934k20396
$$ 175319 130831 111927 228621 216438 165399 172460 71430 -124182 -71110 -22176 -242572
23060b42572j06270O6593Q1139R6385J34118L5108j19265j466N313J8965K06637
$$ -242572 -348842 -282249 -201110 -104725 29393 64501 -54764 -56230 -50917 -31952 174685
23049A74685Q5009O3381j17547l5499q2512N1966r0794r4188l5295J62782R9376
$$ 174685 259694 323075 205528 170029 87517 139483 48689 -45499 -80794 81988 181364
23038A81364J043j63052P368J51211q8168J57341r3388R7862m6903k02375n5853
$$ 181364 182407 19355 26723 177934 89766 247107 153719 251581 204678 2303 -53550
23027e3550K3108p0559j3764N7670q9811n5361N3317R368k1071N3635J30018q4986
$$ -53550 -30442 -101001 -114765 -57095 -146906 -202267 -148950 -139582 -160653 -107018 23000 -61986
23015f1986Q302K08551N7190l7671j66468q2347O7366o4556j56779J6885N3119
$$ -61986 -53684 154867 212057 174386 7918 -74429 -7063 -71619 -228398 -211513 -158394
23004a58394j9013J05365J66320j02054j11872k1878r22M8039P4624J06493Q2672
$$ -158394 -177407 -72042 94278 -7776 -119648 -141526 -142448 -94409 -19785 86708 169380
22993A69380r2644j22924K1579K28139k6672j27463o2255j00649P7157Q078j5427
$$ 169380 76736 -46188 -24609 203530 176858 49395 -12860 -113509 -36352 -28274 -43701
22982d3701p0409r2310J00709M9519r2548L5916P7921Q6530Q8258J05741l697
$$ -43701 -114110 -206420 -105711 -56192 -148740 -112824 -34903 51627 139885 245626 241929
22971B41929j57733p7901J95532j90112k31283m6868J29659J1343J32350q4099
$$ 241929 84196 6295 201827 11715 -219568 -266436 -136777 -125434 6916 -77183
22961g7183j26445M9408R2671m9910j41406k0065M9182J5089R4331M6903n4248
$$ -77183 -203628 -154220 -61549 -111459 -252865 -272930 -223748 -208659 -114328 -67425 -121673
22950a21673J36465K1376K0376m6461m2443l159j92399O2988J00635r0151R2899
$$ -121673 14792 36168 56544 10083 -32360 -35519 -227918 -164930 -64295 -154446 -61547
22939f1547P4228j4362N4538K4774n917j63198o5461r3237n284J38898p705j14292
$$ -61547 12681 -1681 52857 77631 71714 -91484 -156945 -250182 -255466 -116568 -124273 -238565
22927b38565q1148j25118j7488L8531J67198K86964R4846j4415n700k00298j37569
$$ -238565 -319713 -444831 -462319 -423788 -256590 30374 125220 110805 105105 -95193 -232762
22916b32762R8479Q8047q7253J0298R61j30328n670J31193m4501k6811Q1698J1281
$$ -232762 -134283 -46236 -133489 -123191 -122230 -252558 -258228 -127035 -171536 -198347 -116649 -105368
22904a05368l8771o9145N0267k7947m0268k2556R4340J82596o0143m1401K6550
$$ -105368 -144139 -213284 -163017 -190964 -231232 -253788 -159448 23148 -36995 -78396 -51846
22893e1846n4592j2431O1849j89343K183m0470j28869J02797K69274q5519k07430
$$ -51846 -106438 -118869 -57020 -246363 -244180 -284650 -413519 -310722 -41448 -126967 -334397
22882c34397q7353L103J40981m3695j7663K71590J62714J849k5043N0709q5962
$$ -334397 -421750 -418647 -277666 -321361 -339024 -67434 95280 97129 72086 122795 36833
22871C6833j18577R1638q8343K68O6100k3227q2398O5579Q2743q8444J4447J2515
$$ 36833 -81744 9894 -78449 -78181 -12081 -35308 -117706 -52127 30616 -57828 -43381 -30866
22859c0866m7497o947K8437q5939O9598L4436p2940n881J85005N7787j3276j04326
$$ -30866 -78363 -85310 -56873 -142812 -73214 -38778 -111718 -117599 67406 125193 111917 7591
22847G591k5247q1719n7513J15743M4976n6491j54353O9904K42809Q391j58683
$$ 7591 -17656 -99375 -156888 -41145 3831 -52660 -207013 -137109 105700 114091 -44592
22836d4592L6989K8325L7751p7988N2541Q8608P784j49580k7121L4373K9353n9919
$$ -44592 -7603 20722 58473 -19515 33026 121634 129418 -20162 -47283 -12910 16443 -43476
22824d3476J29263j19216k2014r8857j2577R1125P9758R4802o7900l4810q2644
$$ -43476 85787 -33429 -55443 -154300 -166877 -75752 4006 98808 30908 -3902 -86546
22813h6546k4368J17408K7790j30271q6814m2577j19283L3348K56598N2666O5111
$$ -86546 -110914 6494 34284 -95987 -182801 -225378 -344661 -311313 -54715 -2049 63062
22802F3062p1980j89765j5351N1870l2054J53903O1512o8272K5405m1359p212
$$ 63062 -8918 -198683 -214034 -162164 -194218 -40315 21197 -47075 -21670 -63029 -70241
22791g0241M8053l3528j92889l2590O9115J42348J16149Q8561J8448n0200j9096
$$ -70241 -22188 -55716 -248605 -281195 -212080 -69732 46417 134978 153426 103226 84130
22780H4130o5455L4371r9983n8067k320n3633k8459N3938L1144j1765n9991j2525
$$ 84130 18675 53046 -46937 -105004 -107324 -160957 -189416 -135478 -104334 -116099 -176090 -188615
22768a88615l3042K8393J06075K6631j88559j3921P9650m3126p1811O8294p9745
$$ -188615 -221657 -193264 -87189 -60558 -249117 -263038 -183388 -226514 -298325 -230031 -309776
22757c09776m495P1750J10499O1215P2152n2149j06945P1381m829k8086j11736
$$ -309776 -314271 -242521 -132022 -70807 1345 -50804 -157749 -86368 -91197 -119283 -231019
22746b31019K2947M4049M619R3121m3801j14473r0904J42713K52927j35163j1060
$$ -231019 -208072 -164023 -159404 -66283 -110084 -224557 -315461 -172748 80179 -54984 -66044
22735f6044J02930K6443o7002j17304N6852N6497J07608O1958k27028n4601J49812
$$ -66044 36886 63329 -3673 -120977 -64125 -7628 99980 161938 -65090 -119691 30121
22724C0121J52117k05464k42031J4772K10195k6425m2846J26071L3462j54739
$$ 30121 182238 -23226 -265257 -250485 -40290 -66715 -109561 16510 49972 -104767
22714a04767j70271J5562J35585j7388K4171M7857m3890r394p5384M5529O1656
$$ -104767 -275038 -259476 -123891 -141279 -117108 -69251 -113141 -122535 -197919 -152390 -90734
22703i0734Q7790j4001p342j61031o3467J98307N8437J71252q4226M6735L7802
$$ -90734 -2944 -16945 -24287 -185318 -248785 -50478 7959 179211 94985 141720 179522
22692A79522j2996j407j32756K7829L8903l6351J02313Q5266K0016j00349k19774
$$ 179522 166526 165119 32363 60192 99095 62744 165057 250323 270339 169990 -49784
22681d9784j00701N2051N0271k6262j27478l0504n9660O5563N4338q6667l512
$$ -49784 -150485 -98434 -48163 -74425 -201903 -232407 -292067 -226504 -172166 -258833 -262345
22670b62345J07145P9052N9245j814l0293R9379P3067O3400o7760j56533L8047
$$ -262345 -155200 -76148 -16903 -18717 -49010 50369 123436 186836 119076 -37457 590
22659E90o4697J4206J86734R9685p652n4583P1536p1852q8887j6517q2010N9639
$$ 590 -64107 -49901 136833 236518 228866 174283 245819 173967 85080 68563 -13447 46192
22647D6192j09686n7431L849J01380j4562L0192R7247J7031K9063p3696j56403
$$ 46192 -63494 -120925 -117076 -15696 -30258 -66 97181 114212 143275 69579 -86824
22636h6824J18367J51719j3830J16802o3645q5307p8327j01088j6018L8751n6406
$$ -86824 31543 183262 169432 286234 222589 137282 58955 -42133 -58151 -19400 -75806
22625g5806j2756k155r3618j41122O8550J90042R3205p0317j38921K17879K41300
$$ -75806 -88562 -90717 -184335 -325457 -256907 -66865 26340 -43977 -182898 34981 276281
22614B76281j79710q8339p8376m3678m4277J2689k6650J2004l421p5428R3821
$$ 276281 96571 8232 -70144 -113822 -158099 -145410 -172060 -160056 -163477 -238905 -145084
22603a45084r464J39475J42425j23011k6448k6023p6725j59208j00637J1785K5585
$$ -145084 -154548 -15073 127352 4341 -22107 -48130 -124855 -284063 -384700 -372915 -347330
22592c47330J21101M0570O6012J16290Q1066l2636j20792N6675k7776k9901n8504
$$ -347330 -226229 -185659 -119647 -3357 77709 45073 -75719 -19044 -46820 -76721 -135225
22581a35225o6303L0622J58404J40039j9884r8354o1372M8788M2906r6867j55052
$$ -135225 -201528 -170906 -12502 127537 107653 9299 -52073 -3285 39621 -57246 -212298
22570b12298P7316J24251Q0535J01929l2571k20405n9263M8262J11507P9264p7403
$$ -212298 -134982 -10731 69804 171733 139162 -81243 -140506 -92244 19263 98527 21124
22559B1124O1547K8435P9103j4251l6788q256p6995p3128P536n6422N7240J7827
$$ 21124 82671 111106 190209 175958 139170 130914 53919 -19209 -11673 -68095 -10855 6972
22547F972K2993Q0496Q7683j13895n1730Q7374k1978k17242l3860j00876Q9539
$$ 6972 29965 110461 198144 84249 32519 119893 97915 -119327 -153187 -254063 -164524
22536a64524J81570J16447p5205J33951l5085m5886j08527j60914J3627J19660
$$ -164524 17046 133493 58288 192239 157154 111268 2741 -158173 -144546 -24886
22526b4886L1005k1219Q0918l4387k5561r3620L9000r3051n3361O6948Q4702m952
$$ -24886 6119 -15100 65818 31431 5870 -87750 -48750 -141801 -195162 -128214 -43512 -48464
22514d8464N2975o4079p205j44802L5818J52841K07558p1857K0474K0996K3925
$$ -48464 4511 -59568 -66773 -211575 -175757 -22916 184642 112785 133259 154255 178180
22503A78180l6968q0077m3471j27532Q5835K0205j62222l6241J48078J28764J05472
$$ 178180 141212 61135 17664 -109868 -24033 -3828 -166050 -202291 -54213 74551 180023
22492A80023o065p3307R6869k4455r2194j74294Q2477l7391j95171J20224O0994
$$ 180023 173958 100651 197520 173065 80871 -93423 -10946 -48337 -243508 -123284 -62290
22481f2290j30608J8527J52872k2242L1919L4541Q4979k04074o3672J40121J936
$$ -62290 -192898 -174371 -21499 -43741 -11822 22719 107698 -96376 -160048 -19927 -17991
22470a7991p8946p5774k5350K6012L531J9575j06927j35817J05218K59438J10456
$$ -17991 -96937 -172711 -198061 -172049 -168518 -148943 -255870 -391687 -286469 -27031 83425
22459H3425j00774P0476J0617j63546j49432J28792K03347r4130j73993K3022
$$ 83425 -17349 53127 63744 -99802 -249234 -120442 82905 -11225 -185218 -162196
22449a62196m1094J67808P9298l127r3881J19924n2133r8401j0367j06550J12551
$$ -162196 -203290 -35482 43816 40689 -53192 66732 14599 -83802 -94169 -200719 -88168
22438h8168J51575M1464j06957o8673P2969j1006j42328n9736J37090M3820j43387
$$ -88168 63407 104871 -2086 -70759 2210 -8796 -151124 -210860 -73770 -29950 -173337
22427a73337j02180K36822K25075j45377m6214p2562q0204m8202l2954m8551M2168
$$ -173337 -275517 -38695 186380 41003 -5211 -77773 -157977 -206179 -239133 -287684 -245516
22416b45516J54093j21583J1741N8204M605O6563K9646k2361J17182M7762N5246
$$ -245516 -91423 -213006 -201265 -143061 -138456 -71893 -42247 -64608 52574 100336 155582
22405A55582l9808p0360l6133j33o5095m9265L8946L0454R0295n2419p2580j39073
$$ 155582 115774 45414 9281 9148 -55947 -105212 -66266 -35812 54483 2064 -70516 -209589
22393b09589J08580J32967K6454j52402M066J27169p3525J00177k8160j32719
$$ -209589 -101009 31958 58412 -93990 -89924 37245 -36280 63897 35737 -96982
22383i6982q3701k5794M3543J11490n9078O3834l8646j4658L6530J87857P0783
$$ -96982 -180683 -206477 -162934 -51444 -110522 -46688 -85334 -99992 -63462 124395 195178
22372A95178k3211j98693r2518M8753j08941q1830J03136O4037j7669R9625r1523
$$ 195178 171967 -26726 -119244 -70491 -179432 -261262 -158126 -94089 -111758 -12133 -103656
22361a03656p2256R5012J00151l3950L7902N4824j32533o7295o5308N3517L9369
$$ -103656 -175912 -80900 19251 -14699 23203 78027 -54506 -121801 -187109 -133592 -94223
22350i4223L0293L8061o358j37727n7784j3986J04926K20825R0640M7509O8019
$$ -94223 -63930 -25869 -32227 -169954 -227738 -241724 -136798 84027 174667 222176 290195
22339B90195j50180k00299J8229J9982J1015j07961o7389N5950j0312n3065j4725
$$ 290195 140015 -60284 -42055 -22073 -11058 -119019 -186408 -130458 -140770 -193835 -208560
22328b08560J02417J42874m7013J3756J79118Q6930o7186p9474K760o8869R2198
$$ -208560 -106143 36731 -10282 3474 182592 269522 202336 122862 125622 56753 148951
22317A48951J70465l3848l8548m8582R5003M1742k63469j73135j27998O714r5944
$$ 148951 319416 285568 247020 198438 293441 335183 71714 -101421 -229419 -222705 -318649
22306c18649j0176J27119J81231l7231L3427Q0989p1995j39796j19154J4835J41527
$$ -318649 -328825 -201706 -20475 -57706 -24279 56710 -15285 -155081 -274235 -259400 -117873
22295a17873Q3412q4456j6867O7744M9596l7578r8482q3612J34948P2037N6886
$$ -117873 -34461 -118917 -135784 -68040 -18444 -56022 -154504 -238116 -103168 -31131 25755
22284B5755K4805K794o5301j43611j1287j5511j9067J0810P6424L3348p3486J1815
$$ 25755 50560 53354 -11947 -155558 -166845 -182356 -201423 -190613 -114189 -80841 -154327 -142512
22272a42512K841L7416J6742K6017r2758n0849L596o6882R7035K01540k9166n5257
$$ -142512 -139671 -102255 -85513 -59496 -152254 -203103 -199507 -266389 -169354 32186 3020 -52237
22260e2237n7510m5059K56039J26573k57208M7461L0757K6380M5656J0914L4711
$$ -52237 -109747 -154806 101233 227806 -29402 18059 48816 75196 120852 131766 166477
22249A66477j20639k1972Q2346K0258m4058l0436q0202M1513Q8446J23071K3390
$$ 166477 45838 23866 106212 126470 82412 51976 -28226 13287 101733 224804 248194
22238B48194j81956j39922o794n0463P3641J61231j27736j38844J9295K4802N4011
$$ 248194 66238 -73684 -80478 -130941 -57300 103931 -23805 -162649 -143354 -118552 -64541
22227f4541J15902m3419k95683J296K45168M734j7272n4372j01065O5675R624
$$ -64541 51361 7942 -287741 -286445 -41277 -36543 -53815 -108187 -209252 -143577 -133953
22216a33953M9428k2926m7392k3101m5018n1080J3547J36423O4193j5547J01423
$$ -133953 -84525 -107451 -154843 -177944 -222962 -274042 -260495 -124072 -59879 -75426 25997
22205B5997P0982j53461m742J23668r8857k21354n5800J72485J50725P7948n1692
$$ 25997 96979 -56482 -61224 62444 -36413 -257767 -313567 -141082 9643 87591 35899
22194C5899k2809J73592K4399p8962m7263n7314m9914l7838J30672Q7644R2441
$$ 35899 13090 186682 211081 132119 84856 27542 -22372 -60210 70462 158106 250547
22183B50547k00993k41972R6287L6398p0749J8628N2345K6713J33219K9838n6555
$$ 250547 49554 -192418 -96131 -59733 -130482 -111854 -59509 -32796 100423 130261 73706
22172G3706J37617J51730J7504o4503l37760j18334n9191j5534J16999N5751j12053
$$ 73706 211323 363053 380557 316054 -21706 -140040 -199231 -214765 -97766 -42015 -154068
22161a54068l6506P6108p4880L8714m6508l3965J8763O2783P3334m8815K3820
$$ -154068 -190574 -114466 -189346 -150632 -197140 -231105 -212342 -149559 -76225 -125040 -101220
22150a01220J8937l4214P4785j53166K7564P7095J43238j10508l48652j38782
$$ -101220 -82283 -116497 -41712 -194878 -167314 -90219 53019 -57489 -406141 -544923
22140e44923K71347K50841J09343P76j29285Q7108N1229j09085o2550N0950R5914
$$ -544923 -273576 -22735 86608 87384 -41901 45207 96436 -12649 -75199 -24249 71665
22129G1665j07L57J00451J4753k30039K0697J26730R3382j43935k01720L0382
$$ 71665 71558 71915 172366 187119 -42920 -22223 104507 197889 53954 -147766 -117384
22118a17384J50299P5744R6968p4286j41024j433N7072j23102l1915K6324L0453
$$ -117384 32915 108659 205627 131341 -9683 -11116 45956 -77146 -109061 -82737 -52284
22107e2284j64748R3205L9016P7637J19725O3311j32847q2773p1526m0211O8589
$$ -52284 -217032 -123827 -84811 -7174 112551 175862 43015 -39758 -111284 -151495 -82906
22096h2906J2359J34451J40259j17436j84217Q6291Q3694j01772K801j04993N7334
$$ -82906 -70547 63904 204163 86727 -97490 -11199 72495 -29277 -26476 -131469 -74135
22085g4135L642n20j6001j2351l3989j00926r6827M0095l8957K3386J44887j05384
$$ -74135 -70493 -71013 -87014 -99365 -133354 -234280 -331107 -291012 -329969 -306583 -161696 -267080
22073b67080L1717j10768J47770P5091K6714k2451j7422k8177J6174J87462N7998
$$ -267080 -235363 -346131 -198361 -123270 -96556 -119007 -136429 -164606 -148432 39030 97028
22062I7028n9252m7307k81794k3990J43123R9773k00566q8429L6245j5256O609
$$ 97028 37776 -9531 -291325 -315315 -172192 -72419 -272985 -361414 -325169 -340425 -333816
22051c33816O1848R4416J63423L2357P1987j26188M5698n7608J159J14335L3020
$$ -333816 -271968 -177552 -14129 18228 90215 -35973 9725 -47883 -46724 67611 100631
22040A00631M5419j05356J0165l2912p4520K0952r336P1481k8481j11771m5867
$$ 100631 146050 40694 50859 17947 -56573 -35621 -44957 26524 -1957 -113728 -159595
22029a59595k6589N7492M2365J524N7679J10303O303k7255j12251N6569J17356
$$ -159595 -186184 -128692 -86327 -84803 -27124 83179 89482 62227 -50024 6545 123901
22018A23901j6219m5331j01423j05154j26493J40361J49203P7050k7817j18480
$$ 123901 107682 62351 -39072 -144226 -270719 -130358 18845 95895 68078 -50402
22008e0402l3799j27222J2194l1954m5797R7602J62486j68671j96612J17828K43391
$$ -50402 -84201 -211423 -199229 -231183 -276980 -179378 -16892 -185563 -382175 -264347 -20956
21997b0956K0793j98080R3792R8648K1158q1851m0649n3908j05301K382J47037
$$ -20956 -163 -198243 -104451 -5803 15355 -66496 -107145 -161053 -266354 -263972 -116935
21986a16935k0667N1651o5616O5482j02099o1445n785P7341J90074P259J06651
$$ -116935 -137602 -85951 -151567 -86085 -188184 -249629 -255414 -178073 12001 19260 125911
21975A25911N1254n3913o8559l4495M5261q8071n0181K4634K247j8719o2590n0636
$$ 125911 177165 123252 54693 20198 65459 -22612 -72793 -48159 -45912 -64631 -127221 -177857
21963a77857l5224N8554J61252r4331Q079J13339j11466m5703k4955R5849l7833
$$ -177857 -213081 -154527 6725 -87606 -79527 33812 -77654 -123357 -148312 -52463 -90296
21952i0296m0665n2837K11696r6624j0950J14991J55277J36188q2947m2555R6718
$$ -90296 -130961 -183798 27898 -68726 -79676 35315 190592 326780 243833 201278 297996
21941B97996j38803Q1444O5422j50367o3404o3329J04793m4707q3673K967J46547
$$ 297996 159193 240637 306059 155692 92288 28959 133752 89045 5372 8339 154886
21930A54886J2932N3808j02963q2836J1350j07342L1127K0642N5756Q6715q5404
$$ 154886 167818 221626 118663 35827 47177 -60165 -29038 -8396 47360 134075 48671
21919D8671j93348l1854k0265J1310J55036N4197j58531j21737Q0862p0970J7921
$$ 48671 -144677 -176531 -196796 -185486 -30450 23747 -134784 -256521 -175659 -246629 -228708
21908b28708K8553N6897n943j9484L8075R2400J40718k3022L4138L4439p4414
$$ -228708 -200155 -143258 -149201 -168685 -130610 -38210 102508 79486 113624 148063 73649
21897G3649o370o9818J3454M8537q758n6185j72605j62230l1011N5744l3472L3888
$$ 73649 67279 -2539 10915 59452 50694 -5491 -178096 -340326 -371337 -315593 -349065 -315177
21885c15177p5958j34889R6298J49790Q2421J43026p4103j51794m4828j2464J41902
$$ -315177 -391135 -526024 -429726 -279936 -197515 -54489 -128592 -280386 -325214 -337678 -195776
21874a95776L4533p0102L905J70329j04570j72117K14837R6246n13J64318j4940
$$ -195776 -161243 -231345 -227440 -57111 -161681 -333798 -118961 -22715 -23228 141090 126150
21863A26150j11347n735n0497L2052J94495k3175m1669j7778O9162L012R074j12056
$$ 126150 14803 9068 -41429 -9377 185118 161943 120274 102496 171658 174670 183744 71688
21851G1688m4963L8318l5901O6547K2041p4400j61884o9989K1297K34542Q0439
$$ 71688 26725 65043 29142 95689 117730 43330 -118554 -188543 -167246 67296 147735
21840A47735r3856q7600j52757k5026K6861j19188q0848J11335L9962k4166j275
$$ 147735 53879 -33721 -186478 -211504 -184643 -303831 -384679 -273344 -233382 -257548 -258823
21829b58823P5210J27905J66610P4086j03956p1877O2207O828j36229N3275K9618
$$ -258823 -183613 -55708 110902 184988 81032 9155 71362 78190 -58039 -4764 24854
21818B4854j70556O5640P0667o968n6528L0244N3859K39784R0517r9102k32154
$$ 24854 -145702 -80062 -9395 -16363 -72891 -42647 11212 250996 341513 242411 10257
21807A0257n4724j7392O5724L0414n7151k9556J66731K4876k27704r8078J79179
$$ 10257 -44467 -61859 3865 34279 -22872 -52428 114303 139179 -88525 -186603 -7424
21796g424M0756q7326j9319m5292j1794j2030J07987j4427Q162M2418k4357K0663
$$ -7424 33332 -53994 -73313 -118605 -130399 -142429 -34442 -48869 -40707 1711 -22646 -1983
21784a983J0823n8356P6720o5793j43677J4691j4143r6981J70976K26406k8987
$$ -1983 8840 -49516 27204 -38589 -182266 -167575 -181718 -278699 -107723 118683 89696
21773H9696p2781Q2878q8562n206M1384P6451R3411L3266P114L3723j0874j1667
$$ 89696 16915 99793 11231 6025 47409 123860 217271 250537 257651 291374 280500 268833
21761B68833j14827o9818M89K1344o6039K054P2926j41953j71727m3848n1110
$$ 268833 154006 84188 84677 106021 39982 42036 114962 -26991 -198718 -242566 -293676
21750b93676K7203q9708O5008K33961J06223k7833J2327P2940n7810J6629n2848
$$ -293676 -266473 -356181 -291173 -57212 49011 21178 33505 106445 48635 65264 12416
21739A2416j09479M3524R164M3299N4942l7111j0424K9519j77135n1804q0269
$$ 12416 -97063 -53539 -44375 -1076 53866 16755 6331 35850 -141285 -193089 -273358
21728b73358n4276j31769O3948J57668J33188O1688M700r4746r9863l0577q2541
$$ -273358 -327634 -459403 -395455 -237787 -104599 -42911 -38211 -132957 -232820 -263397 -345938
21717c45938Q6552J01828O0396o681m0092P9026P9728l6245P3297l5408j09320
$$ -345938 -259386 -157558 -97162 -103843 -143935 -64909 14819 -21426 51871 16463 -92857
21706i2857m8661K4096R8208j5920R8990p4717J157N1788p03N7098p0294l537
$$ -92857 -141518 -117422 -19214 -35134 63856 -10861 -9704 42084 41381 98479 28185 24648
21694B4648P2844l3507j73977j7165J12601L344m485J02042J02462J5230k1163
$$ 24648 97492 63985 -109992 -127157 -14556 -11212 -15697 86345 188807 204037 182874
21683A82874J9985j49495j9800L5491j38648J2755L5428j22069j01267N2208P5901
$$ 182874 202859 53364 33564 69055 -69593 -56838 -21410 -143479 -244746 -192538 -116637
21672a16637k09585l1553L7615J58619J71447p9758j39929N2829J6432k59635
$$ -116637 -326222 -357775 -320160 -161541 9906 -69852 -209781 -156952 -140520 -400155
21662d00155J91687O8871q6824j01218J0904q3954R6239J31240o420O6072q1101
$$ -400155 -208468 -139597 -226421 -327639 -316735 -400689 -304450 -173210 -179630 -113558 -194659
21651a94659K6221r698J98678K1272j80500r8101k6044O3302q593Q9308l2295
$$ -194659 -168438 -178136 20542 41814 -138686 -236787 -262831 -199529 -208122 -118814 -151109
21640a51109J18820K2190o4582k652M628q235M4442k4197l1800K47050J20115
$$ -151109 -32289 -10099 -74681 -77333 -72705 -80940 -36498 -60695 -92495 154555 274670
21629B74670l2815j05969j65194j7021m6251k4314m1418K8295J00344Q1778L6279
$$ 274670 241855 135886 -29308 -46329 -92580 -116894 -158312 -130017 -29673 52105 88384
21618H8384R9828q0230j09853j0377K26189J73135o3271j31278r3955q2527L3948
$$ 88384 188212 107982 -1871 -12248 213941 387076 323805 192527 98572 16045 49993
21607D9993O8417j61654j33102R218J17714P7395Q4776q0181o4328j00215M5219
$$ 49993 118410 -43244 -176346 -167128 -49414 27981 112757 32576 -31752 -131967 -86748
21596h6748K6665m2484Q1977L6602L9776p1225L7561J39971o188p9889P8641P0015
$$ -86748 -60083 -102567 -20590 16012 55788 -15437 22124 162095 155907 76018 154659 224674
21584B24674k4306J3216N0509N739j40534q4401K027J07613M7743n2656o9612
$$ 224674 200368 213584 264093 269832 129298 44897 46924 154537 202280 149624 80012
21573H0012o1722K363L0797q8704j42688l1926P3413K2102P8369J512J02708n5086
$$ 80012 18290 20653 51450 -37254 -179942 -211868 -138455 -116353 -37984 -36472 66236 11150
21561A1150j5724J03120j51162j18709q1859o2054K3676l6249Q8251J12762R5657
$$ 11150 -4574 98546 -52616 -171325 -253184 -315238 -291562 -327811 -239560 -126798 -31141
21550c1141l501j29739k1888k5503P9254J03967N7063j7576Q196P2682P8585r1543
$$ -31141 -34642 -164381 -186269 -211772 -132518 -28551 28512 10936 19132 91814 170399 78856
21538G8856l9582J05596L3411m1438m8020n0133r5680L9053K46826O5901j30286
$$ 78856 39274 144870 178281 136843 88823 38690 -56990 -17937 228889 294790 164504
21527A64504j43963o4781J2404j6339J20735J15961m9397k25116J34433n884k4887
$$ 164504 20541 -44240 -31836 -48175 72560 188521 139124 -85992 48441 42557 17670
21516A7670r4114j02572K67702k2792p8801O3899m57j84043J16688l4904M036
$$ 17670 -76444 -179016 88686 65894 -12907 50992 50535 -133508 -16820 -51724 -47688
21505d7688k53835j3073J88935p3628J8893r1652K6981R3315P4967R0691M3668
$$ -47688 -301523 -314596 -125661 -199289 -180396 -272048 -245067 -151752 -76785 13906 57574
21494E7574r652K2575j34375r4781J06551Q9200j64437o6070K34491Q0527j88360
$$ 57574 47922 70497 -63878 -158659 -52108 37092 -127345 -193415 41076 121603 -66757
21483f6757p3448J54671j29287r9629Q8989J20543N744r0125j32413j53468J56958
$$ -66757 -140205 14466 -114821 -214450 -125461 -4918 826 -89299 -221712 -375180 -218222
21472b18222K06493J0114J2034N7848l2249n6908n7416P0516O8793j8060k31169
$$ -218222 -11729 -1615 10419 68267 36018 -20890 -78306 -7790 61003 42943 -188226
21461a88226j33193j2447J40795Q6748k19j30304M0005J38639r4200m6550O8213
$$ -188226 -321419 -333866 -193071 -106323 -106542 -236846 -196841 -58202 -152402 -198952 -130739
21450a30739Q5359J04678k6408j02156P9115n604j76535k51399p0898L3146K38347
$$ -130739 -45380 59298 32890 -69266 9849 4245 -172290 -423689 -494587 -461441 -223094
21439b23094J77075m9013j20518M3028o7116l0178r2714J1844P7513N5851k9242
$$ -223094 -46019 -95032 -215550 -172522 -239638 -269816 -362530 -350686 -273173 -217322 -246564
21428b46564j148P2437J10738J57831m9912j19995j3781j21503k5170q7449N6783
$$ -246564 -247712 -175275 -64537 93294 43382 -76613 -90394 -211897 -237067 -324516 -267733
21417b67733J19567N2914J7322J06808J25927K3995p4298q545p8699n103O6298
$$ -267733 -148166 -95252 -77930 28878 154805 178800 104502 95957 17258 12155 78453
21406G8453q7028k39967P9588N7096N5339K20916M9463O2732J34829r0053j75254
$$ 78453 -8575 -248542 -168954 -111858 -56519 164397 213860 276592 411421 321368 146114
21395A46114j67049L7066M5534k6309j69986j3701P1881N5119l4908j78562J89665
$$ 146114 -20935 16131 61665 35356 -134630 -148331 -76450 -21331 -56239 -234801 -45136
21384d5136K58508j74997q3309Q932l8539m8319k5186K73814R4700j30931j14073
$$ -45136 213372 38375 -44934 -36002 -74541 -122860 -148046 125768 220468 89537 -24536
21373b4536k6448M0042r7787j07783N6713O453N9199J05289m7722M841P0582j07035
$$ -24536 -50984 -10942 -108729 -216512 -159799 -153346 -94147 11142 -36580 -31739 38843 -68192
21361f8192j03556n4245J09015P7288j36891j26622Q4225P0647M8716Q0402O4586
$$ -68192 -171748 -225993 -116978 -39690 -176581 -303203 -218978 -148331 -99615 -19213 45373
21350D5373j15039J536J04539p2730r1736o3249N5828N8516p0525O0430J0865
$$ 45373 -69666 -68130 36409 -36321 -128057 -191306 -135478 -76962 -147487 -87057 -76192
21339g6192J9467O6916m091j58808j5253K08670J03072l9788k1175p5760j40010
$$ -76192 -56725 10191 6100 -152708 -167961 40709 143781 103993 82818 7058 -132952
21328a32952J3175J64524M6303J07201j13484M93k22739j06281K14117K08030
$$ -132952 -119777 44747 91050 198251 84767 85260 -137479 -243760 -29643 178387
21318A78387j31677k54519n1055K4561j1153J81244J59134O5195J05208q4580
$$ 178387 46710 -207809 -258864 -234303 -245456 -64212 94922 160117 265325 180745
21308A80745k23620j04267j04312L0117J09039l3518r4215L5086l0938p3336J1325
$$ 180745 -42875 -147142 -251454 -221337 -112298 -145816 -240031 -204945 -235883 -309219 -297894
21297b97894O6882Q9392m2017j97849K0486M4241n310N8711O9680N3422j37717
$$ -297894 -231012 -141620 -183637 -381486 -361000 -316759 -322069 -263358 -193678 -140256 -277973
21286b77973j9076K58772P8785j00339r9848j75693j48092J67573P9678M0248
$$ -277973 -297049 -38277 40508 -59831 -159679 -335372 -483464 -315891 -236213 -195965
21276a95965J76864m1684j68083M8505J33810j08641L200l4574J80737J10144
$$ -195965 -19101 -60785 -228868 -180363 -46553 -155194 -151994 -186568 -5831 104313
21266A04313j8383n3875p2551j04338J06257P5295q5339p4820q4908j6975J21553
$$ 104313 85930 32055 -40496 -144834 -38577 36718 -48621 -123441 -208349 -225324 -103771
21255a03771N5346j68173j76881o1652J44098J49390k7496Q7753J72105K793j1428
$$ -103771 -48425 -216598 -393479 -455131 -311033 -161643 -189139 -101386 70719 73512 62084
21244F2084m3362L9466K442n5106K4580q6080Q1417Q8339N8104k74072p0724O1406
$$ 62084 18722 58188 60630 5524 30104 -55976 25441 113780 171884 -102188 -172912 -111506
21232a11506N2422o7454j27353J40686J12912j26499J07872K87630O5305J06361
$$ -111506 -59084 -126538 -253891 -113205 -293 -126792 -18920 268710 334015 440376
21222D40376k15748j81141J461j16188q6683M9393Q0446q8293l0305M7368Q1405
$$ 440376 224628 43487 44948 -71240 -157923 -108530 -28084 -116377 -146682 -99314 -17909
21211a7909p431R7803j12858j66419P003l4934L3627L9008J3874m0665J4663n8399
$$ -17909 -25340 72463 -40395 -206814 -199811 -234745 -201118 -162110 -148236 -188901 -174238 -232637
21199b32637R5712O574l1822j24954J01778N5674L5406K6440j06364j24010L5886
$$ -232637 -136925 -130351 -162173 -287127 -185349 -129675 -94269 -67829 -174193 -298203 -262317
21188b62317J34598P8867p1819K955j01175l6848Q4300Q587J00206L9708J52229
$$ -262317 -127719 -48852 -120671 -117716 -218891 -255739 -171439 -162852 -62646 -22938 129291
21177A29291R169j18439o0068j48117L9391J47414P4131l7708M0704P4744q5522
$$ 129291 138460 20021 -40047 -188164 -148773 -1359 72772 35064 75768 150512 64990
21166F4990j33419r6033K0362L8236J47411q6301k06270o6988J19836J68091J70719
$$ 64990 -68429 -164462 -144100 -105864 41547 -44754 -251024 -318012 -198176 -30085 140634
21155A40634L4456L8162O179j39681j20957M8724L6673k17137J3733L7354m6373
$$ 140634 175090 213252 219431 79750 -41207 7517 44190 -172947 -159214 -121860 -168233
21144a68233K05745M9421j213j44335j55798o4457k0226J17482J52054n0689j25714
$$ -168233 37512 86933 85720 -58615 -214413 -278870 -299096 -181614 -29560 -80249 -205963
21133b05963r2307R8665K4863o8969L2118P7430n2201p1337q9138J07636M1067
$$ -205963 -298270 -199605 -174742 -243711 -211593 -134163 -186364 -257701 -346839 -239203 -198136
21122a98136m657N3941q2478M0671J10190j3551j5312j18652K5759L0469O4287
$$ -198136 -202793 -148852 -231330 -190659 -80469 -94020 -109332 -227984 -202225 -171756 -107469
21111a07469J13218J01929r0500K5936J5474j19537n4752m6523K8389J00477Q2806
$$ -107469 5749 107678 17178 43114 58588 -60949 -115701 -162224 -133835 -33358 49448
21100D9448n9896m9673j0874K7433r4048J61478P4252n8413K4062J7982l0130
$$ 49448 -10448 -60121 -70995 -43562 -137610 23868 98120 39707 63769 81751 51621
21089E1621p506k7485j22067l9984l5501j8486P5651p2964l0465N4279J04395
$$ 51621 44115 16630 -105437 -145421 -180922 -199408 -123757 -196721 -227186 -172907 -68512
21078f8512J08486O7455j11638k5808k3400m3524J9737m6979J36455N3625j71530
$$ -68512 39974 107429 -4209 -30017 -53417 -96941 -77204 -124183 12272 65897 -105633
21067a05633M7144J9507L4940j09840L6796M5362n1137J15437J0561n5852Q0759
$$ -105633 -58489 -38982 -4042 -113882 -77086 -31724 -82861 32576 43137 -12715 68044
21056F8044L1383j14967j79096J16612Q5769r583j45138j7533J1560K3442N7906
$$ 68044 99427 -15540 -194636 -78024 7745 -1838 -146976 -164509 -152949 -129507 -71601
21045g1601J15753o1128k8113Q6614J72320J30317J2930K1473j78879j47868p5296
$$ -71601 44152 -16976 -45089 41525 213845 344162 357092 378565 199686 51818 -23478
21034b3478j16201M9026l0071k3945K25075K16354k2525j23327j51716K3896k23706
$$ -23478 -139679 -90653 -120724 -144669 80406 296760 274235 150908 -808 23088 -200618
21023b00618j49699K06698Q5378p8867o8291J19821L1846P8473O0858L5038p5700
$$ -200618 -350317 -143619 -58241 -137108 -205399 -85578 -53732 24741 85599 120637 44937
21012D4937j26274n3651o6404M217J3416j4195l8293N2699k6579m0410K9864J45250
$$ 44937 -81337 -134988 -201392 -197175 -183759 -197954 -236247 -183548 -210127 -250537 -220673 -75423
21000g5423L3924Q4488k1479L0018N3462o3577j86372j50858R5920J86272L8360
$$ -75423 -41499 42989 21510 51528 104990 41413 -144959 -295817 -199897 -13625 24735
20989B4735M3943J5971j65047j28111p7008M4014Q5510q9897K80043J34682o9652
$$ 24735 68678 84649 -80398 -208509 -285517 -241503 -155993 -245890 34153 168835 99183
20978I9183q1947M5243K2820o5352q3673K2743p6032j47405j11111K20816Q7477
$$ 99183 17236 62479 85299 19947 -63726 -40983 -117015 -264420 -375531 -154715 -67238
20967f7238j06947O609j7410k5671M7526j8774o9124J97603J64763N9959p6682
$$ -67238 -174185 -167576 -184986 -210657 -163131 -181905 -251029 -53426 111337 171296 94614
20956I4614j21514l6923K3632j33441J08057O3064o0958Q1941q9743o8627j15268
$$ 94614 -26900 -63823 -40191 -173632 -65575 -2511 -63469 18472 -71271 -139898 -255166
20945b55166j21321J4128J55872P5436j8666j4088j06735J1119K01286Q1006q7111
$$ -255166 -376487 -362359 -206487 -131051 -149717 -163805 -270540 -259421 -58135 22871 -64240
20934f4240K5381L2975L0639M2087n4527K7593k423j90673O7087J8333R2387J7804
$$ -64240 -38859 -5884 24755 66842 12315 39908 37485 -153188 -86101 -67768 24619 42423
20922D2423j50695k16794K0967J0640o1585L0775K5073P230J81703l6008j41877
$$ 42423 -108272 -325066 -304099 -293459 -355044 -324269 -299196 -291966 -110263 -146271 -288148
20911b88148N259M4724R2718J32137n3172o3090Q9271o915j38870K0384k8554
$$ -288148 -282889 -238165 -145447 -13310 -66482 -129572 -40301 -47216 -186086 -165702 -194256
20900a94256L0210N6183m1373P6843O3198p529J5595M2051Q9847m8779k1896J2699
$$ -194256 -164046 -107863 -149236 -72393 -9195 -16724 -1129 40922 130769 81990 60094 72793
20888G2793O6732j34203j30636j6980L5036O924N5912M3563j904n8402q0257o4643
$$ 72793 139525 5322 -125314 -142294 -107258 -100334 -44422 -859 -2763 -61165 -141422 -206065
20876b06065Q3062J45909r1268o6673J14554r14M4133r2418r7068j05677R3209
$$ -206065 -123003 22906 -68362 -135035 -20481 -21395 22738 -69680 -166748 -272425 -179216
20865a79216J9040Q0435J54833j02417l8216m2264j00486P5821L4717P3241J38584
$$ -179216 -160176 -79741 75092 -27325 -65541 -107805 -208291 -132470 -97753 -24512 114072
20854A14072N0177J47395j6569k83753j33718l9405M7023R3733J35204J29368
$$ 114072 164249 311644 295075 11322 -122396 -161801 -114778 -21045 114159 243527
20844B43527r4997J1294j65105j20300J45811m9634J2854J15958m8301j22884
$$ 243527 148530 159824 -5281 -125581 20230 -29404 -16550 99408 51107 -71777
20834g1777j08259K13511j05q3265j69338l8377l8594L5125J04465P9421j15292
$$ -71777 -180036 33475 33370 -49895 -219233 -257610 -296204 -261079 -156614 -77193 -192485
20823a92485p0323J65814J18644m3394j46467O740O3024J02745l5896j25327J75423
$$ -192485 -262808 -96994 21650 -21744 -168211 -161471 -98447 4298 -31598 -156925 18498
20812A8498J40399j59678j10458M2588K54300K56107j49751k50133n3600Q6293
$$ 18498 158897 -781 -111239 -68651 185649 441756 292005 41872 -11728 74565
20802G4565N023k16280j44135l7087J88031l0202o4317L2835P8276J19075N0952
$$ 74565 79588 -136692 -280827 -317914 -129883 -160085 -224402 -191567 -113291 5784 56736
20791E6736m2366j27520j91388k8331J19757J22745j08372n8586R7873J39602
$$ 56736 14370 -113150 -304538 -332869 -213112 -90367 -198739 -257325 -159452 -19850
20781a9850j24283j5249J73121J59817L350j46899l3911l2371J19616R8446j55172
$$ -19850 -144133 -159382 13739 173556 176906 30007 -3904 -36275 83341 181787 26615
20770B6615j15992l5642k8343M0930J43414N3862J0181L0834o0740j97101m0016
$$ 26615 -89377 -125019 -153362 -112432 30982 84844 95025 125859 65119 -131982 -171998
20759a71998n9936r3775P7368J10766O1777j06722q1819o5757j0079J02043Q047
$$ -171998 -231934 -325709 -248341 -137575 -75798 -182520 -264339 -330096 -340175 -238132 -230085
20748b30085j29348R163K631K0177O4710L21621M1528J0235m9418p0139K3492
$$ -230085 -359433 -350270 -347639 -327462 -262752 58869 100397 110632 61214 -8925 14567
20737A4567r8230j09667J34165Q9117o7270j19656j0669J6557J66410o5928j43475
$$ 14567 -83663 -193330 -59165 29952 -37318 -156974 -167643 -151086 15324 -50604 -194079
20726a94079J3059J4390Q9216N3842o4757p2112J27128O4788l7576n041j23679
$$ -194079 -181020 -166630 -77414 -23572 -88329 -160441 -33313 31475 -6101 -11142 -134821
20715a34821j84527J2663K20885J06557k6312R2534R6604L251j14381j17141j52574
$$ -134821 -319348 -306685 -85800 20757 -5555 86979 183583 186834 72453 -44688 -197262
20704a97262j61989P9816M6319P2944J57436O767k61934k37428n7739K16594J18042
$$ -197262 -359251 -279435 -233116 -160172 -2736 4031 -257903 -495331 -553070 -336476 -218434
20693b18434R2477j3169j59307K8038J74339N4005j21252q5903Q2094J0805O4690
$$ -218434 -125957 -139126 -298433 -270395 -96056 -42051 -163303 -249206 -167112 -156307 -91617
20682i1617J2547j1221M6868p2773n4615n5031O238R9776J53091J56496j02378
$$ -91617 -79070 -90291 -43423 -116196 -170811 -225842 -219604 -119828 33263 189759 87381
20671H7381j75408m8936J41123l7936o3823M6998P1330K2734R6041j59349j9022
$$ 87381 -88027 -136963 4160 -33776 -97599 -50601 20729 43463 139504 -19845 -38867
20660c8867L1238O6602K7623J6636j06046n3663m0542k6800J3850K9885K8236
$$ -38867 -7629 58973 86596 103232 -2814 -56477 -97019 -123819 -109969 -80084 -51848
20649e1848J5116j7495R0616J25520J6956j95522j94553J22825J58962J08702
$$ -51848 -36732 -54227 36389 161909 178865 -16657 -211210 -88385 70577 179279
20639A79279n8918N5904K4928j02882k03301j39804R986o615J39672N2666r4080
$$ 179279 120361 176265 201193 98311 -104990 -244794 -234808 -241423 -101751 -49085 -143165
20628a43165j7982J30700P4000j16545M6810P9744j3267J2424J8752j92049j18581
$$ -143165 -161147 -30447 43553 -72992 -26182 53562 40295 52719 71471 -120578 -239159
20617b39159k7830l6968M2618p557j31028P0099J90067J77119P0771l9601o0656
$$ -239159 -266989 -303957 -261339 -268896 -399924 -329825 -139758 37361 108132 68531 7875
20606G875n6810j63955O4248J35244q4267j00811j1810J20706J60587J91721K726
$$ 7875 -48935 -212890 -148642 -13398 -97665 -198476 -210286 -89580 71007 262728 265454
20595B65454N6178m6233j35579j92106j8704j8444q2234O7523j50891P2439J15511
$$ 265454 321632 275399 139820 -52286 -70990 -89434 -171668 -104145 -255036 -182597 -67086
20584f7086J41739R0811m1818k40244n4743J06330N2351k9122j13388O1664R4849
$$ -67086 74653 165464 123646 -116598 -171341 -65011 -12660 -41782 -155170 -93506 1343
20573A343O4308Q5972J8144m8650J17703j6890j02838r4754k9207K8347j11512
$$ 1343 65651 151623 169767 121117 238820 221930 119092 24338 -4869 23478 -88034
20562h8034p2448M2014L3676L4494R7246n1627m1422J73379J16743j64534p7761
$$ -88034 -160482 -118468 -84792 -50298 46948 -4679 -46101 127278 244021 79487 1726
20551A726o9056k5330N2396n9158m911N6773l6315j57584j18400N295J37990K04283
$$ 1726 -67330 -92660 -40264 -99422 -104333 -47560 -83875 -241459 -359859 -354564 -216574 -12291
20539a2291J95198R4431o894j47887j30347j02596r1576K16412P5731j77017l2739
$$ -12291 182907 277338 270444 122557 -7790 -110386 -201962 14450 90181 -86836 -119575
20528a19575J06506r2748k9249M6663q0702K278J58513P8860j08047j05422L9271
$$ -119575 -13069 -105817 -135066 -88403 -169105 -166827 -8314 70546 -37501 -142923 -103652
20517a03652J24875m1302j0983Q7579o6926r1097R4038O3107r0720q5551o0839
$$ -103652 21223 -20079 -31062 56517 -10409 -101506 -7468 55639 -35081 -120632 -181471
20506a81471n8597N7085O1783O3461q0464j9722r1429m2382k4919j02941J40815
$$ -181471 -240068 -182983 -121200 -57739 -138203 -157925 -249354 -291736 -316655 -419596 -278781
20495b78781K70644L6290k07212j23610J27810k6770J4068J5349Q2977J33843
$$ -278781 -8137 28153 -179059 -302669 -174859 -201629 -187561 -172212 -89235 44608
20485D4608O8198q9451P9799n0348j8661J13840M1461p3600k302O8779n9485j36717
$$ 44608 112806 23355 103154 52806 34145 147985 189446 115846 113544 182323 122838 -13879
20473a3879j57558J01402J26361o176j29575m9321M5010J939R3127k879j40396
$$ -13879 -171437 -70035 56326 50150 -79425 -128746 -83736 -81797 11330 8451 -131945
20462a31945o1009L9346N680J6352M9664P3946J19232q072O6875J68197j64249
$$ -131945 -192954 -153608 -147928 -131576 -81912 -7966 111266 103194 170069 338266 174017
20451A74017k72885M5480N679L2959Q1382n6954j38619o0022N9384K02484j1559
$$ 174017 -98868 -53388 -47709 -14750 66632 9678 -128941 -188963 -129579 72905 61346
20440F1346o1634M1001R016j56436l172J27296K5408j22120p3646n1844j43341
$$ 61346 -288 40713 49729 -106707 -109879 17417 42825 -79295 -152941 -204785 -348126
20429c48126J08989J75709M4764J01674k7301j22900j38775O4931J00410m8j52581
$$ -348126 -239137 -63428 -18664 83010 55709 -67191 -205966 -141035 -40625 -40673 -193254
20418a93254O9026Q8577J03458N9998k8792K3937j85572j80927N8019R5060J78627
$$ -193254 -124228 -35651 67807 127805 99013 122950 -62622 -243549 -185530 -90470 88157
20407H8157j85277m2210J62299J11602j10660k03930Q9337J0842K30722R8866
$$ 88157 -97120 -139330 22969 134571 23911 -180019 -90682 -79840 150882 249748
20397B49748L1688K5412o4287N1767j6461k46696j10226j5406M7979M2877K9018
$$ 249748 281436 306848 242561 294328 277867 31171 -79055 -94461 -46482 -3605 25413
20386B5413K9388P1296j47905o2428l4702M9172Q0209l0881l3049M662K5159m4558
$$ 25413 54801 126097 -21808 -84236 -118938 -69766 10443 -20438 -53487 -48825 -23666 -68224
20374f8224l637J04413J18638M2819j26512j99065J05231J06714j24937Q9579
$$ -68224 -71861 32552 151190 194009 67497 -131568 -26337 80377 -44560 45019
20364D5019Q2938r1039J0048J07513j6910o4329j5020L2091p3788O2553K0124
$$ 45019 127957 36918 46966 154479 137569 73240 58220 90311 16523 79076 99200
20353I9200j3515k3656q2542n2112j78331p1118K26247K04330l5295k1945P9579
$$ 99200 85685 62029 -20513 -72625 -250956 -322074 -95827 108503 73208 51263 130842
20342A30842P0363J41825J070j85924k2833j43573j32735j05706o9664K1276j1923
$$ 130842 201205 343030 344100 158176 135343 -8230 -140965 -246671 -316335 -295059 -306982
20331c06982j925K2888J12834P2910J62089K05550R280R919J29927N0149j02559
$$ -306982 -308907 -286019 -173185 -100275 61814 267364 276644 286563 416490 466639 364080
20320C64080m1824P8570J52608J53124K93096L43626J31808q827k14920j51161
$$ 364080 322256 400826 553434 706558 999654 1343280 1475088 1466261 1251341 1100180
20310A100180o6862J01018K7750J20180l6978J86798L9389j28515k86783k51969
$$ 1100180 1033318 1134336 1162086 1282266 1245288 1432086 1471475 1342960 1056177 804208
20300H04208j09588j7389N9955J54832J87658J67055J49187J08613q6060p8311
$$ 804208 694620 677231 737186 892018 1079676 1246731 1395918 1504531 1418471 1340160
20290A340160O8382L3357r1343r3605m810N6262j07362l18179k72653j93026l6838
$$ 1340160 1408542 1441899 1350556 1256951 1252141 1308403 1201041 882862 610209 417183 380345
20279C80345k0109p6246l7858L6483O6436O2010J2867r412r4744q6018j17747
$$ 380345 360236 283990 246132 282615 349051 411061 423928 414516 319772 233754 116007
20268A16007p5201P6684j55121k1302J04680J86247J21559j18750Q0153j75496
$$ 116007 40806 117490 -37631 -58933 45747 231994 353553 234803 314956 139460
20258A39460k61305j70462J64703L59572o5437j62580k1091K3144j4468P7790
$$ 139460 -121845 -292307 -127604 231968 166531 3951 -17140 6004 -8464 69326
20248F9326R6492J99592q8029j98846k10253J48292R9781j5491k6743n8550l7717
$$ 69326 165818 365410 277381 78535 -131718 16574 116355 100864 74121 15571 -22146
20237b2146K60515k2821j39549N5777m3055j7522P3639j80019j10441M5898P2434
$$ -22146 238369 215548 75999 131776 88721 71199 144838 -35181 -145622 -99724 -27290
20226b7290O5223R0193O1510n2784p4234n2389j19564k82574k0012R9450J09429
$$ -27290 37933 128126 189636 136852 62618 10229 -109335 -391909 -411921 -312471 -203042
20215b03042O1970J05984J29404j00751j45246m9668P3199n6792R0061l2769j4799
$$ -203042 -141072 -35088 94316 -6435 -151681 -201349 -128150 -184942 -94881 -127650 -142449
20204a42449K0797K9194P9339J04757l1087o006j6923J7032q6714O6265k388j17949
$$ -142449 -121652 -92458 -13119 91638 60551 54545 37622 54654 -32060 34205 31817 -86132
20192h6132N1428R2849J16688k7211k39150j1391p345k621j29342l8049K89043
$$ -86132 -34704 58145 174833 147622 -91528 -102919 -110264 -112885 -242227 -280276 8767
20181H767J33197j74740k30573k5831O7990J37071P3345J9932j05479J26290J24569
$$ 8767 141964 -32776 -263349 -289180 -221190 -84119 -10774 9158 -96321 29969 154538
20170A54538J15773m2572n0814j88525p9289K5479k12J56371q3106n7428N1857
$$ 154538 270311 227739 176925 -11600 -90889 -65410 -65622 90749 7643 -49785 2072
20159B072J3424j83925r4618l8364J26971P3386M0340j07960M489Q2333J9652
$$ 2072 15496 -168429 -263047 -301411 -174440 -101054 -60714 -168674 -164185 -81852 -62200
20148f2200o6050K41585N4432j61808O7624J22197j8262l3663N5311Q3240K9979
$$ -62200 -128250 113335 167767 5959 73583 195780 177518 143855 199166 282406 312385
20137C12385n0368p1685o4076K0048Q9272o0183j11617j18643N9088O6694j26555
$$ 312385 262017 190332 126256 146304 235576 175393 63776 -54867 4221 70915 -55640
20126e5640r0140n5922J06926N6404r5633R259n645p7460n121o7380J17007K9927
$$ -55640 -145780 -201702 -94776 -38372 -134005 -124746 -130391 -207851 -212972 -280352 -163345 -133418
20114a33418r4992J45727Q7547J21211L5078k7766j70595o9277J07369N043k2760
$$ -133418 -228410 -82683 4864 126075 161153 133387 -37208 -106485 884 5927 -16833
20103a6833j06767j24185O3729J85843J09914k09260m7587J60234K1845r0632
$$ -16833 -123600 -247785 -184056 1787 111701 -97559 -145146 15088 36933 -53699
20093e3699p9049n3571K57243L6053j07337j1961j26624q5870Q0674O8747n6084
$$ -53699 -132748 -186319 70924 106977 -360 -12321 -138945 -224815 -144141 -75394 -131478
20082a31478J49134k4265N7616M7887j22601j09292J10351J06956o3067m998r7561
$$ -131478 17656 -6609 51007 98894 -23707 -132999 -22648 84308 21241 16243 -81318
20071h1318O2007J03775q2252m585J0411j54331J04563Q1403P927q5442k19209
$$ -81318 -19311 84464 2212 -2373 8038 -146293 -41730 39673 47600 -37842 -257051
20060b57051M9661K09472J03880j5843o2319j01735L5180J54436P5850P411J2449
$$ -257051 -207390 2082 105962 90119 27800 -73935 -38755 115681 191531 198942 211391
20049B11391n6040l2992p8160l121o8216p7239j849m625k9778j6779J2658k1151
$$ 211391 155351 122359 44199 41078 -27138 -104377 -106226 -110851 -140629 -157408 -144750 -165901
20037a65901q140M0285l6044r969j7806r581j12514n8441J01766R2063k3015J21032
$$ -165901 -174041 -133756 -169800 -179769 -197575 -207156 -319670 -378111 -276345 -184282 -207297 -86265
20025h6265J92890q1207K161L1092m2379q8586p208N2378K2095M6070J9106J13779
$$ -86265 106625 25418 27579 58671 16292 -72294 -79502 -27124 -5029 41041 60147 173926
20013A73926j13494N9047J03835L8593M8636j0740J5446j69889j34846M2916j10793
$$ 173926 60432 119479 223314 261907 310543 299803 315249 145360 10514 53430 -57363
20002e7363m9658J28073K04437J3788p2196o7659M6797J05451m1124O622O3022
$$ -57363 -107021 21052 225489 239277 167081 99422 146219 251670 210546 217168 280190
19991B80190J73490o3272k37822r1024j32642N8967J50166J49466J55590k38286
$$ 280190 453680 390408 152586 61562 -71080 -12113 138053 287519 443109 204823
19981B04823k00611J27107r1791j29708k83J80365J45037J04864n9011j52158
$$ 204823 4212 131319 39528 -90180 -90463 89902 234939 339803 280792 128634
19971A28634l4909P2465P3132N7681k0362j32246r2057o2188J07824J15456K44912
$$ 128634 93725 166190 239322 297003 276641 144395 52338 -9850 97974 213430 458342
19960D58342N5717q4529r9991r9509Q573N7552n3870L7559o1215M2714J29683
$$ 458342 514059 429530 329539 230030 238603 296155 242285 279844 218629 261343 391026
19949C91026J06882r1711J6762j02435j43317r3209j0752K5275r1629J19241j26434
$$ 391026 497908 406197 422959 320524 177207 83998 73246 98521 6892 126133 -301
19938c01j25240p6329k2174J05609K78497R7175j95610o7084J4248J59873j12867
$$ -301 -125541 -201870 -224044 -118435 160062 257237 61627 -5457 8791 168664 55797
19927E5797j15511o3586R9450J21762k0267j23279o2469J30169j09179K19379
$$ 55797 -59714 -123300 -23850 97912 77645 -45634 -108103 22066 -87113 132266
19917A32266P9859j59793L6022o123r5771j24468o1772l1977K5196Q2656N8209
$$ 132266 212125 52332 88354 82231 -13540 -138008 -199780 -231757 -206561 -123905 -65696
19906f5696J41483N145n5734R721J02036J98532q8899j03328m3006l5523J56075
$$ -65696 75787 80932 25198 34919 136955 335487 246588 143260 100254 64731 220806
19895B20806K772q3043q2417R5501l8894r1087j2843m6868K4324l907J28856O0603
$$ 220806 223578 140535 58118 153619 114725 23638 10795 -36073 -11749 -15656 113200 173803
19883A73803o1021k04252J1296j51551J11324J11422k9324K0186o8494k11499
$$ 173803 112782 -91470 -80174 -231725 -120401 -8979 -38303 -18117 -86611 -298110
19873b98110o3594P2694J02291J13691O9074o2183J02795n1657n598j9526j69448
$$ -298110 -361704 -289010 -186719 -73028 -3954 -66137 36658 -14999 -20597 -40123 -209571
19862b09571p583R7106J57715J31543M6592M2531n9233k6640J36852n0549J28678
$$ -209571 -217154 -120048 37667 169210 215802 258333 199100 172460 309312 258763 387441
19851C87441K52713o914k7107k7489j04785O0020R4921Q7010J17167M2090M1359
$$ 387441 640154 633240 606133 578644 473859 533879 628800 715810 832977 875067 916426
19840I16426j2705m5329n2242l8967J23289p9140K5228j02744k31722m4863N0468
$$ 916426 903721 858392 806150 767183 890472 811332 836560 733816 502094 457231 507699
19829E07699q3441K9077L50501K26868m9072l0837q9775M9216k5143J785K2007
$$ 507699 424258 453335 803836 1030704 981632 950795 861020 910236 885093 886878 908885
19818I08885o7764N8101J35536O899j03568r3866O2833J80332O3848j6440k0657
$$ 908885 841121 899222 1034758 1041657 938089 844223 907056 1087388 1151236 1134796 1114139
19807A114139Q2217J7553r4744j0467J71534O3854k7519J45092k15222k16076
$$ 1114139 1196356 1213909 1119165 1108698 1280232 1344086 1316567 1461659 1246437 1030361
19797A030361R398J21560L7430P9238J03391K291J49339J08943o2639K8636n219
$$ 1030361 1039759 1161319 1198749 1277987 1381378 1383669 1533008 1641951 1579312 1607948 1602729
19786A602729L6344L2047L9778J04166J96998J06376k14623j61613j0659l2101
$$ 1602729 1639073 1671120 1710898 1815064 2012062 2118438 1903815 1742202 1731543 1699442
19776A699442k731N9281J12269J00932P9218l3241O0824P5200Q093K57920N9839
$$ 1699442 1696711 1755992 1868261 1969193 2048411 2015170 2075994 2151194 2159287 2417207 2477046
19765B477046O0213J6727O8787Q9435Q2913J20624J09367J24961J36025K1613
$$ 2477046 2537259 2553986 2622773 2712208 2795121 2915745 3025112 3150073 3286098 3307711
19755C307711J40113K17709J58094K32989J07373M1083K93128M22489M43260K44721
$$ 3307711 3447824 3665533 3823627 4056616 4163989 4205072 4498200 4920689 5363949 5608670
19745E608670K47174L37347O64638L92194L25256K79863M53506P67411P51169
$$ 5608670 5855844 6193191 6857829 7250023 7575279 7855142 8308648 9076059 9827228
19736I827228R44260J098994J254049J130092R42655J239031J639053K163052
$$ 9827228 10771488 11870482 13124531 14254623 15197278 16436309 18075362 20238414
19728B0238414L092386M001458N020799O307968P778992R955708J3059790J7610794
$$ 20238414 23330800 27332258 32353057 38661025 46440017 56395725 69455515 87066309
19720H7066309K3405011L0723730L9593063M4325066L8129687J3005492k5639160
$$ 87066309 110471320 141195050 180788113 225113179 263242866 276248358 250609198
19713B50609198l3520607j5442182M763437K2445855L1390263K6199988p43246
$$ 250609198 217088591 201646409 206409846 228855701 260245964 286445952 285702706
19706B85702706m1365946m8213495l0412396j3014172J784832J4224790K5457101
$$ 285702706 244336760 196123265 165710869 152696697 154481529 168706319 194163420
19699A94163420L6779782M2126157L5794407Q248452l4037640l9804952j8647893
$$ 194163420 230943202 273069359 308863766 317112218 283074578 243269626 224621733
19692B24621733K809608K0256661K7701629K0706209q955934n0574949n7835394
$$ 224621733 227431341 247688002 275389631 296095840 287139906 236564957 178729563
19685A78729563m1787758k7405800j7414246j1458414q340973o219593n013957
$$ 178729563 136941805 109536005 92121759 80663345 72322372 66102779 61088822
19678F1088822m021130l693930l240245k469446k009755j510830j303559j643403
$$ 61088822 57067692 53373762 50133517 47664071 45654316 44143486 42839927 41196524
19670D1196524j666304j919015j908342j430963j114583j078174j158979j583665
$$ 41196524 39530220 37611205 35702863 34271900 33157317 32079143 30920164 29336499
19662B9336499j777724j733318j846592j765950j245690j132726j190698j185909
$$ 29336499 27558775 25825457 23978865 22212915 20967225 19834499 18643801 17457892
19654A7457892j001651r35602q53059p96460o82647o44885o22520n36479m42546
$$ 17457892 16456241 15520639 14667580 13871120 13188473 12543588 11921068 11384589 10942043
19645A0942043m58777m36847o11637l54019o31408m26962l34399m11477k93416
$$ 10942043 10483266 10046419 9434782 9080763 8449355 8022393 7687994 7276517 6983101
19636F983101m14435k54650l07914k03826k21071l06548l12370k44954j98841
$$ 6983101 6568666 6314016 6006102 5802276 5581205 5274657 4962287 4717333 4518492
19627D518492k42249k84892j29414j95316k04665P2440J49900k18479k64693j04381
$$ 4518492 4276243 3991351 3861937 3666621 3461956 3534396 3684296 3465817 3201124 3096743
19617C096743j83003k18870j75786j99772r0734p8069j5900m1494j3653M2957
$$ 3096743 2913740 2694870 2519084 2319312 2228578 2150509 2134609 2093115 2079462 2122419
19607B122419q4940j29703J00583J02769k17076p7952q4804j04406M3118K6715
$$ 2122419 2037479 1907776 2008359 2111128 1894052 1816100 1731296 1626890 1670008 1696723
19597A696723p1427n9571n2972J52803j326p1190L5615l9112n9796k59480j23645
$$ 1696723 1625296 1565725 1512753 1665556 1664230 1593040 1628655 1589543 1529747 1270267 1146622
19586A146622J5686M1922k8644n9890k0825J13900m0944L0640L7830j03192j27237
$$ 1146622 1162308 1204230 1175586 1115696 1094871 1208771 1167827 1198467 1236297 1133105 1005868
19575A005868j42878J8644P5528p6920J07298L8821l8831J76737N6448j56197
$$ 1005868 862990 881634 957162 880242 987540 1026361 987530 1164267 1220715 1064518
19565A064518j25358M096J01579j96562j41158Q3497J68742o9368o0967q2051
$$ 1064518 939160 943256 1044835 848273 707115 790612 959354 889986 829019 746968
19555G46968O9430j7663N3166P0388N3431o2919j02171K2736j17717M1734K8385
$$ 746968 816398 798735 851901 922289 975720 912801 810630 833366 715649 757383 785768
19544G85768j6047J23607J90764k4876n403K9168r8148l8246J87820r633m7887
$$ 785768 769721 893328 1084092 1059216 1053813 1082981 984833 946587 1134407 1124774 1076887
19533A076887k4926M1234r1925m9032M9241n7546r9361K7114Q0849j24448K7796
$$ 1076887 1051961 1093195 1001270 952238 1001479 943933 844572 871686 952535 828087 855883
19522H55883J08054N2275J43223k25820j27794N6597O3200J17605P0609o6624
$$ 855883 963937 1016212 1159435 933615 805821 862418 925618 1043223 1113832 1047208
19512A047208q0665j68003r0250J37933N2902m0170Q6685J08302j16696r9534
$$ 1047208 966543 798540 708290 846223 899125 858955 945640 1053942 937246 837712
19502H37712j992j15864k63175j87288P6174K11582m4070L2341L6328J0953j07969
$$ 837712 835720 719856 456681 269393 345567 557149 513079 545420 581748 592701 484732
19491D84732J08687J48487m4580k8112p670m8853p3457k2132J1011k20299j36639
$$ 484732 593419 741906 697326 669214 661544 612691 539234 517102 528113 307814 171175
19480A71175J36779K06678O3255j59471J1667j51010L129p5123R3505J69476l3678
$$ 171175 307954 514632 577887 418416 430083 279073 282202 207079 300584 470060 436382
19469D36382o4459j23063m1589n9255j06016J56451m7141J96402L426j36748K8843
$$ 436382 371923 248860 207271 148016 42000 198451 151310 347712 351138 214390 243233
19458B43233o4593j08106P032J07828o6180L5148R5384Q6741l0710M4600J0342
$$ 243233 178640 70534 77566 185394 119214 154362 249746 336487 305777 350377 360719
19447C60719k9715r5076L3306Q6432J86791l0717o4736m0860k5402j36638p5733
$$ 360719 331004 235928 269234 355666 542457 511740 447004 406144 380742 244104 168371
19436A68371M2421M5433J38289l097k4421j31802m6137l3192N9140K07216N7331
$$ 168371 210792 256225 394514 391417 366996 235194 189057 155865 215005 422221 479552
19425D79552n1480j54672M5796p6953k85586j91644J57552Q0188R8810J14926
$$ 479552 428072 273400 319196 242243 -43343 -234987 -77435 2753 101563 216489
19415B16489r2351j63332m3614N6560r9761m0580N5517K95396J06757L1104p5106
$$ 216489 124138 -39194 -82808 -26248 -126009 -166589 -111072 184324 291081 322185 247079
19404B47079j03765J6134q8446j7071P6014P1908J29481K21550j82221k41838
$$ 247079 143314 159448 71002 53931 129945 201853 331334 552884 370663 128825
19394A28825r4401J319L1441K79109K41905m7093k27491k78904L9847J93501L4416
$$ 128825 34424 35743 67184 346293 588198 541105 313614 34710 74557 268058 302474
19383C02474r2014N0750q2796p7764Q5075J44715O8406L3528O2976K191r461k47268
$$ 302474 210460 261210 178414 100650 185725 330440 398846 432374 495350 497541 488080 240812
19371B40812l24737J20748N0990L9904J2703P571M7961J19330n3916j45714j771
$$ 240812 -83925 36823 87813 127717 140420 147991 195952 315282 261366 115652 113881
19360A13881M7868L7310N2150k6087J40127l6599j12231n2120M5674j08654m9807
$$ 113881 161749 199059 251209 225122 365249 328650 216419 164299 209973 101319 51512
19349E1512M8895J22037N0811k5564n1444J05859L4054L8449j09985L9809k2730
$$ 51512 100407 222444 273255 247691 196247 302106 336160 374609 264624 304433 281703
19338B81703P9349k4809o7912o4519j44775o1580O7655P3456r5292l470N3489
$$ 281703 361052 336243 268331 203812 59037 -2543 65112 138568 43276 39806 93295
19327I3295L88N2673r743j166j44436q0689k7865J35615o6329j9399J10977P4961
$$ 93295 93683 146356 136613 135447 -8989 -89678 -117543 18072 -48257 -67656 43321 118282
19315A18282O9201j7259m0334j5217N0053J81075m0588l4142P0859j17399n4032
$$ 118282 187483 170224 129890 114673 164726 345801 305213 271071 341930 224531 170499
19304A70499N5902P9124K91488K18175M8787J12035J53281Q4832N7680j13501
$$ 170499 226401 305525 597013 815188 863975 976010 1129291 1214123 1271803 1158302
19294A158302j85011k62362j24988j17718J21459L8192L5437K1707J92749L5444
$$ 1158302 973291 710929 585941 468223 589682 627874 663311 685018 877767 913211
19284I13211l2799p6420K3197Q3301K30712K09578n4831j66915m8148n7516k23857
$$ 913211 880412 803992 827189 910490 1141202 1350780 1295949 1129034 1080886 1023370 799513
19273G99513r9734M7589J01075K69421J44101P1898R1181O3014J3968k91471l72122
$$ 799513 699779 747368 848443 1117864 1261965 1333863 1425044 1488058 1502026 1210555 838433
19262H38433j03176k4226m4412j80977r5386J57890Q0459o5107N3374R9114O6903
$$ 838433 735257 711031 666619 485642 390256 548146 628605 563498 616872 715986 782889
19251G82889J58921K3085J26049J36745J71010J30682j21142k26436j81761j04156
$$ 782889 941810 964895 1090944 1227689 1398699 1529381 1408239 1181803 1000042 895886
19241H95886j68295k63376k15094j0728M8999J4356M7267J11981j21318m4709
$$ 895886 727591 464215 249121 238393 287392 301748 349015 460996 339678 294969
19231B94969N504j4692p4467P4044m443L0525N6140L3740j46838k22065k7184
$$ 294969 300473 285781 211314 285358 280915 311440 367580 401320 254482 32417 5233
19220E233J76011J55193N1160m1804K0468o527k7687r4450n3566k6632j07953
$$ 5233 181244 336437 387597 345793 366261 359734 332047 237597 184031 157399 49446
19209D9446k5899R531j10339j40835O6918J18571k00953L3842R7997k8177O6838
$$ 49446 23547 33078 -77261 -218096 -151178 -32607 -233560 -199718 -101721 -129898 -63060
19198f3060P9603j33324j23099L2636N960M039J63509K2508j47061q3756o5501
$$ -63060 16543 -116781 -239880 -207244 -201284 -197245 -33736 -11228 -158289 -242045 -307546
19187c07546J04103J78680P4301P694J45816m5750j20782J20966Q4756k8945o3692
$$ -307546 -203443 -24763 49538 57232 203048 157298 36516 157482 242238 213293 149601
19176A49601o656r1729L5252j40742m4112J72484Q7266J7175j186L0807J5568
$$ 149601 142945 51216 86468 -54274 -98386 74098 161364 178539 177353 208160 223728
19165B23728j46863j27983Q6791J30327K6721k33923o6804J39059j41706k08373
$$ 223728 76865 -51118 35673 166000 192721 -41202 -108006 31053 -110653 -319026
19155c19026P9437K39840J69661j04251j4773p3843Q6317L2569J5172R2714J65685
$$ -319026 -239589 251 169912 65661 50888 -22955 63362 95931 111103 203817 369502
19144C69502j64328j38313k276Q4851K3007l5577k8178K8693R4896P549J52007
$$ 369502 205174 66861 64585 149436 172443 136866 108688 137381 232277 239826 391833
19133C91833M5127j45178j9256O6582J30763L7208j43479o1214j9601J81232j03261
$$ 391833 436960 291782 272526 339108 469871 507079 363600 302386 282785 464017 360756
19122C60756J1509J77365q6456n2778r4461k6825p019K43006L81599K69349K24283
$$ 360756 372265 549630 463174 410396 315935 289110 282091 525097 906696 1176045 1400328
19111A400328K51542K8154O5938k02648j07891J68104J78502J51727J51870q8839
$$ 1400328 1651870 1680024 1745962 1543314 1435423 1603527 1782029 1933756 2085626 1996787
19101A996787l27360j29614j0487Q9222l434R4776R7637O0737J72412J37994n5196
$$ 1996787 1669427 1539813 1529326 1618548 1615114 1709890 1807527 1868264 2040676 2178670 2123474
19090B123474k57827l07905j99571N0698J54328K10116J38102k10011l16363l43468
$$ 2123474 1865647 1557742 1358171 1408869 1563197 1773313 1911415 1701404 1385041 1041573
19080A041573j95078n5125M3383J1378k19398l7228j44146j9162L725L932k1410
$$ 1041573 846495 791370 834753 846131 626733 589505 445359 426197 429922 433854 412444
19069D12444J33738j14939q8618l1155J20875L9535k24787q4196j19973J18494
$$ 412444 546182 431243 342625 311470 432345 471880 247093 162897 42924 161418
19059A61418J9903j16272O1379j19R1898K5421l252P2877Q8875p1539n2566J00521
$$ 161418 181321 65049 126428 126309 218207 243628 240376 313253 402128 330589 278023 378544
19047C78544k0011j70071j04296m3437q044J1512p0825L1842Q5426J273o0254
$$ 378544 358533 188462 84166 40729 32685 44197 -26628 5214 90640 91913 31659
19036C1659j24586O4497J78776P5638O6383J2886n438J228q9505j25794o1840
$$ 31659 -92927 -28430 150346 225984 292367 305253 299815 301043 211538 85744 23904
19025B3904k2283n8940J30341J46922k9825j03823N5080P3214N6469J63735p3355
$$ 23904 1621 -57319 73022 219944 190119 86296 141376 214590 271059 434794 361439
19014C61439k90704N5608J9202j08676R8969O9416K2791n3239J2286J60695N9589
$$ 361439 70735 126343 145545 36869 135838 205254 228045 174806 187092 347787 407376
19003D07376J16834J290k21584M3808K5234l3462o8947p3636l3593j2388k456
$$ 407376 524210 525500 303916 347724 372958 339496 270549 196913 163320 150932 148476
18992A48476j7784j29100j01368J9814M4969L1269O9147K7242o3523J17426J29064
$$ 148476 130692 1592 -99776 -79962 -34993 -3724 65423 92665 29142 146568 275632
18981B75632P7277M3011o6653m85k1385L1343p2132j33692j45493j53486J02189
$$ 275632 352909 395920 329267 328782 307397 338740 266608 132916 -12577 -166063 -63874
18970f3874K17782M642R3271R6181q273L5128J34042m189j2651j3164m3540Q3230
$$ -63874 153908 158550 251821 348002 339729 374857 508899 504710 492059 478895 435355 518585
18958E18585J24269K9423M1001j40499j31818J865O2393o0227K0783O5631k1006
$$ 518585 642854 672277 713278 572779 440961 442826 505219 444992 465775 531406 510400
18947E10400o7439J57542J50422K17615J70349O1466P9133K59450K73802l4940
$$ 510400 442961 600503 750925 968540 1138889 1200355 1279488 1538938 1812740 1777800
18937A777800j79414j71852j73306P1882J80153J05886R5327o8004j79052k25719
$$ 1777800 1598386 1426534 1253228 1325110 1505263 1611149 1706476 1638472 1459420 1233701
18927A233701k64296j91841j82382j44069K8623J34674R6199k3174p6510M9644
$$ 1233701 969405 777564 595182 451113 479736 614410 710609 687435 610925 660569
18917F60569j02193j13813J97250K44263P4987o7077P2746L06768L40026J89098
$$ 660569 558376 444563 641813 886076 961063 893986 966732 1273500 1613526 1802624
18907A802624J8777j83742k9067m4306j67963K12459K15786P1977k4032k05863
$$ 1802624 1821401 1637659 1608592 1564286 1396323 1608782 1824568 1896545 1872513 1666650
18897A666650k81948l02955j63263n620m4737l9262N397q311o2526j17808q4891
$$ 1666650 1384702 1081747 918484 912864 868127 828865 834262 825951 763425 645617 560726
18886E60726n1652o9474k0082J18663p2115J26416J59508N2955j11609k55437
$$ 560726 509074 439600 419518 538181 466066 592482 751990 804945 693336 437899
18876D37899o2919P1041J60155K47682j02136p2817k3548j02341k296k5287j7136
$$ 437899 374980 446021 606176 853858 751722 678905 655357 553016 550720 525433 508297
18865E08297r5236o9382l4234J83454Q3644j46060k372J57173O4568k04775j31934
$$ 508297 413061 343679 309445 492899 576543 430483 428111 585284 649852 445077 313143
18854C13143J08385Q5159O9566P5652j07427k42502q7331o5443J24772J34838
$$ 313143 421528 506687 576253 651905 544478 301976 214645 149202 273974 408812
18844D08812P2572J8465j33833J46891M006k40892n3002R3203P8755j9287N7168
$$ 408812 481384 499849 366016 512907 516913 276021 223019 316222 394977 375690 432858
18833D32858M8827J64875J9236o9324j05351o8756P791M037J67530p911k7734
$$ 432858 481685 646560 665796 596472 491121 422365 430156 434193 601723 593812 566078
18822E66078j59003q9292J44031P8338m8386J20948R4144o4124n2731M3205J73217
$$ 566078 407075 317783 461814 540152 491766 612714 706858 642734 590003 633208 806425
18811H06425J26357j34902k66109m303J62060L5244J43113J28938K17790J46297
$$ 806425 932782 797880 531771 527468 689528 724772 867885 996823 1214613 1360910
18801A360910j6924r5507n0631J38201K7868q8720q7863j13765j45321J9642o392
$$ 1360910 1343986 1248479 1197848 1336049 1363917 1275197 1187334 1073569 928248 947890 941498
18790I41498r6699j44786J83189N6894J48984J92206R3160J29325K13854N900
$$ 941498 844799 700013 883202 940096 1089080 1281286 1374446 1503771 1717625 1723525
18780A723525R4551P5495k20076k08697M8183M820J35266M1496o6318n2650P0874
$$ 1723525 1818076 1893571 1673495 1464798 1512981 1517801 1653067 1694563 1628245 1575595 1646469
18769A646469J28510J45264j8442J3704l1040l2765j19212L9434l4086j50444
$$ 1646469 1774979 1920243 1901801 1915505 1884465 1851700 1732488 1771922 1737836 1587392
18759A587392J29201J86431P7807j813l9613P4514P4973q867J27794O8822J32729
$$ 1587392 1716593 1903024 1980831 1979018 1939405 2013919 2088892 2080025 2207819 2276641 2409370
18748B409370J68750K63851J13218O7934j740J18259J36113K4873P9627J96615
$$ 2409370 2578120 2841971 2955189 3023123 3021383 3139642 3275755 3300628 3380255 3576870
18738C576870N40044M08633J76925K64819K38310O8015j34723j24878r464J4925
$$ 3576870 4116914 4525547 4702472 4967291 5205601 5273616 5138893 5014015 5004551 5019476
18728E019476M00036M76982L47287M35492N09768Q13986R15597Q68214R85902
$$ 5019476 5419512 5896494 6243781 6679273 7189041 8003027 8918624 9786838 10772740
18719A0772740J295435J646591J970786J987967K299691K547946L148514M383779
$$ 10772740 12068175 13714766 15685552 17673519 19973210 22521156 25669670 30053449
18711C0053449N970302Q378530J1648725J5886432K0837607K6857362L4387232
$$ 30053449 36023751 44402281 56051006 71937438 92775045 119632407 154019639
18704A54019639L8629015L2514968J0235586l2614149n1498272m0289034k5657701
$$ 154019639 192648654 225163622 235399208 202785059 151286787 110997753 85340052
18697H5340052j5121631q573298m355170j331753J397278M001964O950006J0391386
$$ 85340052 70218421 61645123 57289953 55958200 57355478 61357442 68307448 78698834
18689G8698834J4878333K0319317K6406599L3582367L7583691L1236960R361259
$$ 78698834 93577167 113896484 140303083 173885450 211469141 242706101 252067360
18682B52067360l1049943m6919274l4108901j8130458n781409L956039J2483608
$$ 252067360 221017417 174098143 139989242 121858784 116077375 120033414 132517022
18675A32517022K0948300K9777994L9615295M4454227L5913141O164851m5417388
$$ 132517022 153465322 183243316 222858611 267312838 303225979 309390830 263973442
18668B63973442o3915220m8705401l1548501j9149317j1390281o292753k444337
$$ 263973442 200058222 151352821 119804320 100655003 89264722 82971969 80527632
18661H0527632J045919M378713P822442J1796734J6901735K3152766L0475124
$$ 80527632 81573551 85952264 93774706 105571440 122473175 145625941 176101065
18654A76101065L9311059M2724748L3485285L270014m6673589o3395401m8040060
$$ 176101065 215412124 258136872 291622157 294892171 248218582 184823181 136783121
18647A36783121l1386798j9905557j3027078r090272o528051n087947m042254
$$ 136783121 105396323 85490766 72463688 63373416 56845365 51757418 47715164
18640D7715164l150123k515748k416381k247937k060094j745238j586634j449778
$$ 47715164 44565041 42049293 39632912 37384975 35324881 33579643 31993009 30543231
18632C0543231j461529j241908p59225n07569m77590n04517j004991j197316j175793
$$ 30543231 29081702 27839794 27080569 26573000 26095410 25590893 24585902 23388586 22212793
18623B2212793j198038p87305o79037j059333j298094j269700j090484j011188
$$ 22212793 21014755 20227450 19548413 18489080 17190986 15921286 14830802 13819614
18615A3819614p76070q03238o31048n79822n46094m76503o28860n70529l91070
$$ 13819614 13043544 12240306 11609258 11029436 10483342 10006839 9377979 8807450 8416380
18606H416380k80020l40028l90836k73577k21690k81874k74954l18632k78900
$$ 8416380 8136360 7796332 7405496 7131919 6910229 6628355 6353401 6034769 5755869
18597E755869j95532l05245k49849j79857l56187j74838j7060j78198r9312k77023
$$ 5755869 5560337 5255092 5005243 4825386 4469199 4294361 4277301 4099103 3999791 3722768
18587C722768k47668j65920k13271j35525j8428J21664P744j66910j04737R9139
$$ 3722768 3475100 3309180 3095909 2960384 2941956 3063620 3071364 2904454 2799717 2898856
18577B898856o2374j31756k79246k51932j00603l5778l7426k34549j55885j2015
$$ 2898856 2836482 2704726 2425480 2173548 2072945 2037167 1999741 1765192 1609307 1597292
18567A597292P876K1049M4295J12661j0327l7481j03352q8718k1768J05996j33270
$$ 1597292 1605168 1626217 1670512 1783173 1772846 1735365 1632013 1543295 1521527 1627523 1494253
18556A494253k55779o016J68434O8865j82657L077K8673K6029Q3417J12903K03430
$$ 1494253 1238474 1232458 1400892 1469757 1287100 1290177 1318850 1344879 1428296 1541199 1744629
18545A744629J1407k19211r9931j00738N1775p359q2109k3165K3268L3612J48243
$$ 1744629 1756036 1536825 1436894 1336156 1387931 1380572 1298463 1275298 1298566 1332178 1480421
18534A480421K09133j6697L5917J08869N0443J39551N4406N3964j0447j06679
$$ 1480421 1689554 1672857 1708774 1817643 1868086 2007637 2062043 2116007 2105560 1998881
18524A998881k55565j0586J39852L4945R6203o7329k65244k68207j1878r2672
$$ 1998881 1743316 1732730 1872582 1907527 2003730 1936401 1671157 1402950 1391072 1298400
18514A298400J4377J44337R0714K7797l4740j3629R0705O6187J09090K418p8001
$$ 1298400 1312777 1457114 1547828 1575625 1540885 1527256 1617961 1684148 1793238 1795656 1717655
18503A717655L9454R7853j39259o0423K19463J51314L31482J18347m6910m8260
$$ 1717655 1757109 1854962 1715703 1655280 1874743 2026057 2357539 2475886 2428976 2380716
18493B380716j07772j25751j46208P388K50627J71839J73954r1125k13786j09199
$$ 2380716 2272944 2147193 2000985 2008373 2259000 2430839 2604793 2513668 2299882 2190683
18483B190683l1059Q0642j10986n3273P5488m7651J55484O5720L4985Q5886k2857
$$ 2190683 2159624 2240266 2129280 2076007 2151495 2103844 2259328 2325048 2360033 2445919 2423062
18472B423062l2970j5333m9134K3909r1028M0754J7433P2685K2111K529l6945
$$ 2423062 2390092 2374759 2325625 2349534 2258506 2299260 2316693 2389378 2411489 2414018 2377073
18461B377073J3055p3200r9556J50999K64499J19697O9961k5906j01888q331n4982
$$ 2377073 2390128 2316928 2217372 2368371 2632870 2752567 2822528 2796622 2694734 2686403 2631421
18450B631421J74946P4198J62840J86617J62619j2355J67601K05687Q1285L2644
$$ 2631421 2806367 2880565 3043405 3230022 3392641 3380286 3547887 3753574 3834859 3867503
18440C867503J29601K03830J52140K20829l9270J9021L57296N04561M32693K30342
$$ 3867503 3997104 4200934 4353074 4573903 4534633 4553654 4910950 5415511 5848204 6078546
18430F078546K64819K76685N92632O95317Q51359O91417N26205N79117O40895
$$ 6078546 6343365 6620050 7212682 7907999 8759358 9450775 9976980 10556097 11196992
18421A1196992M56353N76573P73027J273694J426374J461925J459840J748689
$$ 11196992 11653345 12229918 13002945 14276639 15703013 17164938 18624778 20373467
18413B0373467K209190K804424L403868M369425N964994Q104521J0686644J4665852
$$ 20373467 22582657 25387081 28790949 33160374 39125368 47229889 57916533 72582385
18405G2582385J9912668K6013526L3378167M2681342N1216028M9214285L1008934
$$ 72582385 92495053 118508579 151886746 194568088 245784116 294998401 326007335
18398C26007335j5478424m4381925l0464535n647823J5622538L0249688L0230090
$$ 326007335 310528911 266146986 235682451 230034628 245657166 275906854 306136944
18391C06136944J1094285l6654920o5691623n4997522l6276529k3099170j4115363
$$ 306136944 317231229 280576309 214884686 159887164 123610635 100511465 86396102
18384H6396102r210806o294891l817198k068383o21276O73898K110058L886940
$$ 86396102 77185296 70890405 67073207 65004824 64383548 65057446 67167504 71054444
18376G1054444N725748Q112662J1067961J4810564J9593755K5827149L3920906
$$ 71054444 76780192 84892854 95960815 110771379 130365134 156192283 190113189
18369A90113189M0626479L8277210K1995980j7329093l8459456k5692297n661159
$$ 190113189 230739668 269016878 291012858 273683765 235224309 209532012 203870853
18362B03870853J1760215K3648494K2784994N813673l4855661n5980281m4765274
$$ 203870853 215631068 239279562 262064556 267878229 233022568 177042287 132277013
18355A32277013k9603113j9386872j2502527q631417o287478m570982l249048
$$ 132277013 102673900 83287028 70784501 62153084 55865606 51294624 48045576
18348D8045576k632437j984733j311228j110814r65416j021593j389120j541698
$$ 48045576 45413139 43428406 42117178 41006364 40040948 39019355 37630235 36088537
18340C6088537j541064j366691j197435r28649q00081q21904j223177j626785
$$ 36088537 34547473 33180782 31983347 31054698 30254617 29432713 28209536 26582751
18332B6582751j809383j693118j671778j543748j320533j241758r26126r22939
$$ 26582751 24773368 23080250 21408472 19864724 18544191 17302433 16376307 15453368
18324A5453368q05888p12194o37005o40083n93431q39207o77758n97523m85990
$$ 15453368 14647480 13935286 13298281 12658198 12064767 11225560 10547802 9950279 9464289
18315I464289j59005k46793m09169m14970m54869m17494l06109l81864l43485
$$ 9464289 9305284 9058491 8649322 8234352 7779483 7361989 7055880 6674016 6330531
18306F330531j91766k72505m67026j73664j15136k25846k70471j83231m0947j69289
$$ 6330531 6138765 5866260 5399234 5225570 5110434 4884588 4614117 4430886 4389939 4220650
18296D220650k16803K7961j32976j38631k07998j86103j74395m6318p9439j03099
$$ 4220650 4003847 4031808 3898832 3760201 3552203 3366100 3191705 3145387 3065948 2962849
18286B962849N7924q2936j31340m5136O7427p6051m8434l7228o2682q6718j56046
$$ 2962849 3020773 2937837 2806497 2761361 2828788 2752737 2704303 2667075 2604393 2517675 2361629
18275B361629j09858o1340j05665m0314j28031j19327j97656l8904L6097J05669
$$ 2361629 2251771 2190431 2084766 2044452 1916421 1797094 1599438 1560534 1596631 1702300
18265A702300o7500O1120o0720j94343j86326l7389J07823m4873j15619O512n0759
$$ 1702300 1634800 1695920 1635200 1440857 1254531 1217142 1324965 1280092 1164473 1170985 1120226
18254A120226J04322J73473o7330o1972j1199K8284L0884L0969j6082M8867Q494
$$ 1120226 1224548 1398021 1330691 1268719 1257520 1285804 1316688 1347657 1331575 1380442 1388936
18243A388936l177r1084J40040Q7376J0013M9129j35099p9526l6477j13538J06509
$$ 1388936 1385759 1294675 1434715 1522091 1532104 1581233 1446134 1366608 1330131 1216593 1323102
18232A323102L2161K0625O8038j35610j64650o4914J15969K9816n330L7353m1582
$$ 1323102 1355263 1375888 1443926 1308316 1143666 1078752 1194721 1224537 1219207 1256560 1214978
18221A214978j02727m4649L2157O2454L5489j9666j4681J17819o8296j13233r6789
$$ 1214978 1112251 1067602 1099759 1162213 1197702 1178036 1163355 1281174 1212878 1099645 1002856
18210A002856Q0118J33097m0235j17322j64245o0957J73554K23627m7706j66204
$$ 1002856 1082974 1216071 1175836 1058514 894269 833312 1006866 1230493 1182787 1016583
18200A016583O8562Q6646q1072j14793r5890P9104Q6157R1246J73857l5272k9166
$$ 1016583 1085145 1171791 1090719 975926 880036 959140 1045297 1136543 1310400 1275128 1245962
18189A245962j83289P1871J23097j06327o4833n2631q3601M9719q3986L5673J0326
$$ 1245962 1062673 1134544 1257641 1151314 1086481 1033850 950249 999968 915982 951655 961981
18178I61981j3130J8907J19668r5972n1491p2057l4762p2428q8929P9035q9223
$$ 961981 948851 967758 1087426 991454 939963 867906 833144 760716 671787 750822 661599
18167F61599p438J26616l0896k7444l8499k8989Q3325j2672j58081O139J01506
$$ 661599 654161 780777 749881 722437 683938 654949 738274 725602 567521 573660 675166
18156F75166P6320q8320l9801Q9704J11743q8365j12290j17664J00581m3557r6375
$$ 675166 751486 663166 623365 713069 824812 736447 624157 506493 607074 563517 467142
18145D67142K1538O7922J34164J55613l9748j17613j05702J0422p5006j75466
$$ 467142 488680 556602 690766 846379 806631 689018 583316 593738 518732 343266
18135C43266Q3549o6445j05750J71483N5230j6320r7375k19874J72696K64731
$$ 343266 426815 360370 254620 426103 481333 465013 367638 147764 320460 585191
18125E85191m9372J7323m8110j29127P7668l7704N1578R6950j51111q2570K7529
$$ 585191 535819 553142 505032 375905 453573 415869 467447 564397 413286 330716 358245
18114C58245n0094J62813K22185J51831P5259M67j1057j44458j61968k5076m4690
$$ 358245 308151 470964 693149 844980 920239 920706 909649 765191 603223 578147 533457
18103E33457J582J56901K11455K62530M06289P0626j98889o1035k17175l15498
$$ 533457 535039 691940 903395 1165925 1572214 1642840 1443951 1382916 1165741 850243
18093H50243k70272L0363Q8233R136J3332J56758q3765k139n3122k7849J19770
$$ 850243 579971 610334 698567 707703 721035 877793 794028 791889 738767 710918 830688
18082H30688K85809L33267J99721J29748K3360j73660j72075k25211j19932R1806
$$ 830688 1116497 1449764 1649485 1779233 1802593 1628933 1456858 1231647 1111715 1203521
18072A203521j3920M2496J14268M3344K1848J9853J05082q7812p4988k43766k12980
$$ 1203521 1189601 1232097 1346365 1389709 1411557 1431410 1536492 1448680 1373692 1129926 916946
18061I16946O2927m558k11878m2003l8355J50038J22385J5405j0656J66051p2820
$$ 916946 979873 975315 763437 721434 683079 833117 955502 970907 960251 1126302 1053482
18050A053482J01865N1514Q1910J29360M4931r2182j96461k46269k02300N4265
$$ 1053482 1155347 1206861 1288771 1418131 1463062 1370880 1174419 928150 725850 780115
18040G80115j61504n8701L8195j1317o489J1431K5513Q1453o639k6776o206p8005
$$ 780115 618611 559910 598105 586788 580299 591730 617243 698696 692057 665281 659075 581070
18028E81070j5433r8081j0440P3034Q5420n6273j68207n1296J08121M6195p0895
$$ 581070 565637 467556 457116 530150 615570 559297 391090 339794 447915 494110 423215
18017D23215N144l5276j23867k3975L6585O5650N1337J26690N510n3230l8492
$$ 423215 428359 393083 269216 245241 281826 347476 398813 525503 531013 477783 439291
18006D39291Q8506J31745N0664N5902r894j18372m2816J66638Q8349q0200o3017
$$ 439291 527797 659542 710206 766108 756214 637842 595026 761664 850013 769813 706796
17995G06796j23294l1708J7536P391o4862j34724K639N4914n5116j17239q81n1213
$$ 706796 583502 551794 569330 576721 511859 377135 379774 434688 379572 262333 261452 210239
17983B10239J15241j02790k3992J86015J15399J0758J24215j3966l6286k1661
$$ 210239 325480 222690 198698 384713 500112 510870 635085 621119 584833 563172
17973E63172L5397k2969k2981o3650q3951k03693q61M2937R313j14781m7333K2144
$$ 563172 598569 575600 552619 488969 405018 201325 200464 243401 252714 137933 90600 112744
17961A12744j28114q0679K17326J18921j35877j02828J03068L1295M8301n1991
$$ 112744 -15370 -96049 121277 240198 104321 1493 104561 135856 184157 132166
17951A32166O8641j6928J8334J98498J69347j39508n9560P9938M1769r059j98705
$$ 132166 200807 183879 202213 400711 570058 430550 370990 450928 492697 483638 284933
17940B84933l9938J33258J48086J55299j05762p5462j15443n8958J0242N9504
$$ 284933 244995 378253 526339 681638 575876 500414 384971 326013 336255 395759
17930C95759p2339j8104j45163j96462J47159N2478n483J8457k3710j71222l8849
$$ 395759 323420 305316 160153 -36309 110850 163328 157845 176302 152592 -18630 -57479
17919e7479K02284J205L7425M9535j95702l9400L4849N1969Q8866j14187K8909
$$ -57479 144805 146010 183435 232970 37268 -2132 32717 84686 173552 59365 88274
17908H8274K8045J32293Q4974L9451n5755Q4199J6597j47124j54072J8481J17868
$$ 88274 116319 248612 333586 373037 317282 401481 418078 270954 116882 135363 253231
17897B53231K4470J10530J1902n6713K5126R2293L5598j3862j56762l2212K0796
$$ 253231 277701 388231 400133 343420 368546 460839 496437 482575 325813 293601 314397
17886C14397K4383m8179j3831J01347m8557q1152p5291o4492J45074J62510J0358
$$ 314397 338780 290601 276770 378117 329560 248408 173117 108625 253699 416209 426567
17875D26567n659J6468m0508j22605O2990J71000Q4869j7481j29379p6714o4645
$$ 426567 420908 437376 396868 274263 337253 508253 593122 575641 446262 369548 304903
17864C04903P2471K37103J21284J12197R9049L6153J80423N9379P1318j103l723
$$ 304903 377374 614477 735761 847958 947007 983160 1163583 1222962 1294280 1293177 1289454
17853A289454j21535n0825L5625J30460J31713J84231J19438k95614l64622p3335
$$ 1289454 1167919 1117094 1152719 1283179 1414892 1599123 1718561 1422947 1058325 984990
17843I84990j75885j09294j56194j24155j8797r1688J946J86577J82781J20942
$$ 984990 809105 699811 543617 419462 400665 308977 310923 497500 680281 801223
17833H01223O7162q8145L470J48990J6709L966O3875J09853L01572K25357j14488
$$ 801223 868385 780240 783710 932700 949409 953375 1017250 1127103 1428675 1654032 1539544
17822A539544j79396P001j9625j5780R4944J08716L6110Q5940j82633k96087j24019
$$ 1539544 1360148 1367149 1347524 1331744 1426688 1535404 1571514 1657454 1474821 1178734 1054715
17811A054715j95917j57937R9395j11059j19290n3547k275k6202N245P2660j27073
$$ 1054715 858798 700861 800256 689197 569907 516360 514085 487883 493128 565788 438715
17800D38715j11103N8234j97537o5202J09456j0770L1507j0175P9277N6516l5136
$$ 438715 327612 385846 188309 123107 232563 221793 253300 243125 322402 378918 343782
17789C43782M7840j7664j23726k5363J0534J60637N6845j50131m8956k7823l2988
$$ 343782 391622 373958 250232 224869 235403 396040 452885 302754 253798 225975 192987
17778A92987P3034m011M630n3686m4949K0758J09354N1442l0232M1594l3395l2456
$$ 192987 266021 262010 266640 212954 168005 188763 298117 349559 319327 360921 327526 295070
17766B95070l994k3142j37035j26865q8428J07543J11009L29K2486r1653o8644
$$ 295070 291076 267934 130899 4034 -84394 23149 134158 134487 156973 65320 -3324
17755c324r4754j4561L4525M0043K07348L9126o0428m8779j4699N1445j01382
$$ -3324 -98078 -112639 -78114 -38071 169277 208403 147975 99196 84497 135942 34560
17744C4560j03169J6228N6461J68313N3795k4068k3828j13376o868J32184P8764
$$ 34560 -68609 -52381 4080 172393 226188 202120 178292 64916 58048 190232 268996
17733B68996R3374L2717N318Q9539o9381o0125R7738M8644j13913j80086l4753
$$ 268996 362370 395087 400405 489944 420563 360438 458176 506820 392907 212821 178068
17722A78068j6841j39422k8276q1403j41256o717K37588J19656q9123k0402r1220
$$ 178068 161227 21805 -6471 -87874 -229130 -235847 1741 121397 32274 11872 -79348
17711g9348j08360K1130j0278l7749p7882K68282J81327P634p7581q7404m2211
$$ -79348 -187708 -166578 -176856 -214605 -292487 -24205 157122 164756 87175 -229 -42440
17700d2440l2023J83715J13004r748j13105r0613r2490Q249R5136m76O0183r2028
$$ -42440 -74463 109252 222256 212508 99403 8790 -83700 -75451 19685 19209 79392 -12636
17688a2636r2538j69132K6918J17366J30435J85692n1021P7351K8044j31635K1520
$$ -12636 -105174 -274306 -247388 -130022 413 186105 135084 212435 240479 108844 130364
17677A30364j5358n1248J41352k25065R4679J77319J34746r0429j50557P0307
$$ 130364 115006 63758 205110 -19955 74724 252043 386789 296360 145803 216110
17667B16110R0937q089O0044J43724N7355o5108j80350o2304o8510J4343j58509
$$ 216110 307047 298958 359002 502726 560081 494973 314623 252319 183809 198152 39643
17656C9643O1591J1231p1085J06854J50679J278j15439j76680J76605J17056k16703
$$ 39643 101234 112465 41380 148234 298913 300191 184752 8072 184677 301733 85030
17645H5030n6462J04245k6311m0497j72q1077N9870O6269j21437j71796r7724
$$ 85030 28568 132813 106502 66005 65833 -15244 44626 110895 -10542 -182338 -280062
17634b80062r8274N7599K2537J36657K4910J01325J83917j54832q9644J3661N97
$$ -280062 -378336 -320737 -298200 -161543 -136633 -35308 148609 -6223 -95867 -82206 -81609
17623h1609O8161O0068q9585N0628J2150M8583J7714k9907p7255r3634J41572
$$ -81609 -13448 46620 -42965 7663 19813 68396 86110 56203 -21052 -114686 26886
17612B6886O2669p4159n6043j20363J58291K16000J50491k7283j45683l20541
$$ 26886 89555 15396 -40647 -161010 -2719 213281 363772 336489 190806 -129735
17602a29735p1061K36235Q9997o8071j22686n5768Q6570J36705M3942j1918j34026
$$ -129735 -200796 35439 125436 57365 -65321 -121089 -34519 102186 146128 134210 184
17591A84J51305n3653K9676J2817k5482R4758O0696q8482j54396r1056Q7502p2206
$$ 184 151489 97836 127512 140329 114847 209605 270301 181819 27423 -63633 23869 -48337
17579d8337M7089R9409L8272j72311j55402L1162P2728J95148Q5475j84353m2724
$$ -48337 -1248 98161 136433 -35878 -191280 -160118 -87390 107758 193233 8880 -33844
17568c3844N7038q1042O3953O9992Q876Q7552J1508j7118l3711j72599q993L8689
$$ -33844 23194 -57848 6105 76097 84973 172525 184033 166915 133204 -39395 -48388 -9699
17556i699J22516J9235j60259k4649J21904K23115P9352j81415n3975j01739k5908
$$ -9699 112817 132052 -28207 -52856 69048 292163 371515 190100 136125 34386 8478
17545H478J86170J35330R3784o3343k47758j37304N1778N6571j37612n0476J20186
$$ 8478 194648 329978 423762 360419 112661 -24643 27135 83706 -53906 -104382 15804
17534A5804Q2046p2357K17036J40694j54908p9213p8471L1019N6944j31943J6345
$$ 15804 97850 25493 242529 383223 228315 149102 70631 101650 158594 26651 42996
17523D2996Q6930m010j42465k5017J83475P5385j1873n6160k8994Q6902J34784
$$ 42996 129926 125916 -16549 -41566 141909 217294 205421 149261 120267 207169 341953
17512C41953o8419j15161K2999J02446j03217Q4928r3460J14905M2696n4678P4302
$$ 341953 273534 158373 181372 283818 180601 265529 172069 286974 329670 274992 349294
17501C49294j72899q1063o3228K20586q9332j08957k7654K38754R1215j21033
$$ 349294 176395 95332 32104 252690 163358 54401 26747 265501 356716 235683
17491B35683J4698r6168n0671m9101n9252K4266J28952r7631j2402Q3560k8019
$$ 235683 250381 154213 103542 54441 -4811 19455 148407 50776 38374 121934 93915
17480I3915j36951p2054l2759N8987P8868J93312N6621j67964L4828L7652q2373
$$ 93915 -43036 -115090 -147849 -88862 -9994 183318 239939 71975 106803 144455 62082
17469F2082O6307N075R0596M3834K0403j96554j33962J4517j17410O2267J96640
$$ 62082 128389 133464 224060 267894 288297 91743 -42219 -27702 -145112 -82845 113795
17458A13795M3169N7218j95350j37985J26257R3606k5745n0487Q668j48139o5665
$$ 113795 156964 214182 18832 -119153 7104 100710 74965 24478 33146 -114993 -180658
17447a80658M3359J16727J86596N47k0866o389j99834K5885J28523J9317P1687
$$ -180658 -137299 -20572 166024 166571 145705 139316 -60518 -34633 93890 113207 184894
17436A84894q6170o769R6858j9725l8091J21862j16517j51393n0389J57828Q242
$$ 184894 98724 91955 188813 169088 130997 252859 136342 -15051 -65440 92388 100630
17425A00630j41753Q8700k1261O8087R8234N1120n2936j15003N3382M1106Q2741
$$ 100630 -41123 47577 26316 94403 192637 243757 190821 75818 129200 170306 253047
17414B53047J03739q056p9355p335q5085j64549K22390J12226r2672k7928O1903
$$ 253047 356786 348730 269375 262040 176955 12406 234796 347022 254350 226422 288325
17403B88325p7352j07440p0648K0406q7824Q7604J10069J37010j93590p5587j5211
$$ 288325 210973 103533 32885 53291 -34533 53071 163140 300150 106560 30973 15762
17392A5762j4924N7492J76607J25454J3872L6577q8506o6787r4957J241N8116
$$ 15762 838 58330 234937 360391 374263 410840 322334 255547 160590 161831 219947
17381B19947q3119j98139o2169O3724J59772J17052N780m7515j09686r9870p0242
$$ 219947 136828 -61311 -123480 -59756 100016 217068 222848 175333 65647 -34223 -104465
17370a04465k8402j39270M0390J97751J53554o7724m079K617r5273N4543J35887
$$ -104465 -132867 -272137 -231747 -33996 119558 51834 47755 50372 -44901 9642 145529
17359A45529O5779K7406K7380J4544K9224o4567M711m4175j78468M1364J13920
$$ 145529 211308 238714 266094 280638 309862 245295 250006 205831 27363 68727 182647
17348A82647M286j33218J00823j01634l6070N9978m9164j12872n774M7731j16179
$$ 182647 186933 53715 154538 52904 16834 76812 27648 -85224 -90998 -43267 -159446
17337a59446r4935p2580o662O3564J9975J37274P4956J38328J61365r6052o3104
$$ -159446 -254381 -326961 -333623 -270059 -250084 -112810 -37854 100474 261839 165787 102683
17326A02683k1644k69948j37531J05428j05642r5907J08664P521J44552M3338
$$ 102683 81039 -188909 -326440 -221012 -326654 -422561 -313897 -306376 -161824 -118486
17316a18486K3204N3144J02454k3165J8185O4936L9021N737j24887j57375M3131
$$ -118486 -95282 -42138 60316 37151 55336 120272 159293 165030 40143 -117232 -74101
17305g4101J27814N7760L6248k3515j13977k7692R1562M9858k2000n6563J7621
$$ -74101 53713 111473 147721 124206 10229 -17463 74099 123957 101957 45394 63015
17294F3015p6461j06255k1504J35699J52873j714j90095m7962p387O6023j9431
$$ 63015 -13446 -119701 -141205 -5506 147367 145653 -44442 -92404 -99791 -33768 -53199
17283e3199j32267n2059J2596J23944J14456P7150o4879l2495K7598K8331r7414
$$ -53199 -185466 -237525 -224929 -100985 13471 90621 25742 -6753 20845 49176 -48238
17272d8238J45898p4401j56733L6707n1127N8741j631j0900j2555j10616j08752
$$ -48238 97660 23259 -133474 -96767 -147894 -89153 -90784 -101684 -114239 -224855 -333607
17261c33607k4284K10696J17972P366N7072p259P027K9793J30367L3969k63631
$$ -333607 -357891 -147195 -29223 -21857 35215 27956 34983 64776 195143 229112 -34519
17250c4519j51326J7489R0441Q530l4919r2315O1536J77156J7692l848n9851j44746
$$ -34519 -185845 -168356 -77915 -69385 -104304 -196619 -135083 42073 59765 55917 -3934 -148680
17238a48680J01352O4600M2526J01757j77652o766j07706j39150J15276R3538
$$ -148680 -47328 17272 59798 161555 -16097 -22863 -130569 -269719 -154443 -60905
17228f0905R8822l0619J06537Q5954j48923m5354n8254l5479J8327m4003R5039
$$ -60905 37917 7298 113835 199789 50866 5512 -52742 -88221 -69894 -113897 -18858
17217a8858o517K9124M6766K473L731K5828K9703k8902L4943m8187m7978l6452
$$ -18858 -25375 3749 50515 52988 56719 82547 112250 83348 118291 70104 22126 -14326
17205a4326p1527j848J37423K0753j46077K5843J27750L4256j91305j21813J26548
$$ -14326 -85853 -87701 49722 70475 -75602 -49759 77991 112247 -79058 -200871 -74323
17194g4323j03068p9505l2309J66280K4339P5691J77233Q7832j25846P066M0245
$$ -74323 -177391 -256896 -289205 -122925 -98586 -22895 154338 242170 116324 123390 163635
17183A63635o929L4933j76114j89051k1677J08564J6028m2513J43816m1418P7544
$$ 163635 156706 191639 15525 -173526 -195203 -86639 -70611 -113124 30692 -10726 66818
17172F6818P6383j50409m2451J43342Q8228J37607l9733j09994j94442j40421
$$ 66818 143201 -7208 -49659 93683 181911 319518 279785 169791 -24651 -165072
17162a65072k0650K7794L1032K4996r865M926M3074r1312L0648N479J82992O3207
$$ -165072 -185722 -157928 -126896 -101900 -111765 -106839 -63765 -155077 -124429 -118950 64042 127249
17150A27249J733o395j89050Q0856J32069L8979n6217K5320K8787K1892P646j5620
$$ 127249 128982 122587 -66463 14393 146462 185441 129224 154544 183331 205223 212869 197249
17138A97249r4853o4504P7729k1657m3972J82700j41218K6773J4469L2531J2155
$$ 197249 102396 37892 115621 93964 49992 232692 91474 118247 132716 165247 177402
17127A77402Q7327j13523N8637P4597n5674j27816J03877k8124Q6805o6581j11964
$$ 177402 264729 151206 209843 284440 228766 100950 204827 176703 263508 196927 84963
17116H4963j92139j22819J81553J25167m7833K3672j1312n1438r1068L3525J32764
$$ 84963 -107176 -229995 -48442 76725 28892 52564 41252 -10186 -101254 -67729 65035
17105F5035O1933K9918k6019j60523l1417J41104O9502p6753m1363O060O7415
$$ 65035 126968 156886 130867 -29656 -61073 80031 149533 72780 31417 37477 104892
17094A04892J09314O6278p2367k18487k13096r1254J50970L3076J23163j17670
$$ 104892 214206 280484 208117 -10370 -223466 -314720 -163750 -130674 -7511 -125181
17084a25181N0884m2707q7012m3767R857N1219Q3150N7591k6264J129J94483R101
$$ -125181 -74297 -117004 -204016 -247783 -237926 -186707 -103557 -45966 -72230 -71101 123382 132483
17072A32483j46632j02783M4950J12727J92335L6181j78674l3307P6529J3971
$$ 132483 -14149 -116932 -71982 40745 233080 269261 90587 57280 133809 147780
17062A47780O1562j7672m241Q1508J2634q2606j86340j46875o4668M0599Q7775
$$ 147780 209342 191670 187429 268937 281571 198965 12625 -134250 -198918 -158319 -70544
17051g0544P8476M5789k9051k5282J42679L9532m5462n7534n4155N7544p395j12329
$$ -70544 7932 53721 24670 -612 142067 181599 136137 78603 24448 81992 74597 -37732
17039c7732j75731l9115J72607J23822J38160j45639j14132n028J0006j16748
$$ -37732 -213463 -252578 -79971 43851 182011 36372 -77760 -82788 -72782 -189530
17029a89530l5125K2693Q9715J36704j461K4302K3058k12974j78828J86078M5532
$$ -189530 -224655 -201962 -112247 24457 22996 47298 70356 -142618 -321446 -135368 -89836
17018h9836j00183j22608k8889J40578K3588K6035N874L8691J68696j5013M8832
$$ -89836 -190019 -312627 -341516 -200938 -177350 -151315 -145441 -106750 61946 46933 95765
17007I5765p3590m7314J76241O2919N088k7359o9870J62610P9750k8789n5129
$$ 95765 22175 -25139 151102 214021 219109 191750 121880 284490 364240 335451 280322
16996B80322j4761o8187j8617P2562k7560k10240j56636q5030K16543J78098M0673
$$ 280322 265561 197374 178757 251319 223759 13519 -143117 -228147 -11604 166494 207167
16985B07167r0591k19454K1457J28669j1725P1866J39063j40749j66545M5023
$$ 207167 116576 -102878 -81421 47248 35523 107389 246452 105703 -60842 -15819
16975a5819J02070j18478j16740j3440J59824N4281L5914k7427l0037O0666m2652
$$ -15819 86251 -32227 -148967 -162407 -2583 51698 87612 60185 30148 90814 48162
16964D8162o1920j55531j2774j22726J95250K39127P4081k8074j07318O4354m3277
$$ 48162 -13758 -169289 -182063 -304789 -109539 129588 203669 175595 68277 132631 89354
16953H9354J4450R2220n5538j08334r3373j13790o021R0321N2798o515J37909
$$ 89354 103804 196024 140486 32152 -61221 -175011 -181032 -90711 -37913 -44428 93481
16942I3481O1329j58092k05008m2770k0605n46J81772J58253m8946o2392o1865
$$ 93481 154810 -3282 -208290 -251060 -271665 -272211 -90439 67814 18868 -43524 -105389
16931a05389j6365J16335K17905Q5647J1626j14226o6510J7794l4928j24805k6740
$$ -105389 -121754 -5419 212486 298133 309759 195533 129023 146817 111889 -12916 -39656
16920c9656k40948K7730K07047k0813J06610j8346j59028J06264M8688N6916K6118
$$ -39656 -280604 -252874 -45827 -66640 39970 21624 -137404 -31140 17548 74464 100582
16909A00582k14805j8439P9899m7036p7341R6416J74224O6806p0408j03747N6157
$$ 100582 -114223 -132662 -52763 -99799 -177140 -80724 93500 160306 89898 -13849 42308
16898D2308J26978K4823j11262K6448l1603J3792p1391j68601q2976n2121J20088
$$ 42308 169286 194109 82847 109295 77692 91484 20093 -148508 -231484 -283605 -163517
16887a63517J37023n0397q3075J20914L2710q0582p5043Q8879Q470Q4287K6774
$$ -163517 -26494 -76891 -159966 -39052 -6342 -86924 -161967 -73088 -64618 19669 46443
16876D6443J17079j19k2095r2545O0535n1513k40472N8535J11484l1666l4965
$$ 46443 163522 163403 141308 48763 109298 57785 -182687 -124152 -12668 -44334 -79299
16865g9299J66131N1392p2174l7626J25209O277P464j41844P6017J86177p2379
$$ -79299 86832 138224 66050 28424 153633 159910 167374 25530 101547 287724 215345
16854B15345k03068j89129J4251R1553N7600n5308L335N1501k3044k9804j17017
$$ 215345 12277 -176852 -162601 -71048 -13448 -68756 -65421 -13920 -36964 -66768 -183785
16843a83785r68J72242J68029L8517p7184k97920j62784J30020K35890n564m6865
$$ -183785 -184753 -12511 155518 194035 116851 -181069 -343853 -213833 22057 16493 -30372
16832c0372r7651K0238J5086q1912L2470J27200L6318q1111K18072P1971J9848
$$ -30372 -128023 -107785 -92699 -174611 -142141 -14941 21377 -59734 158338 230309 250157
16821B50157J5712l7099j5499k6873j99777k6450m1211J00553n5803l6618K9418
$$ 250157 265869 228770 213271 186398 -13379 -39829 -81040 19513 -36290 -72908 -43490
16810d3490k2082M0366P5469K4042m617j49469m4451Q4337l3286K51505J15833
$$ -43490 -65572 -25206 50263 74305 69688 -79781 -124232 -39895 -73181 178324 294157
16799B94157k18406j65396o8656J87952J63410L9274n717K123O3335o7014p5550
$$ 294157 75751 -89645 -158301 29651 193061 232335 226618 228741 292076 225062 149512
16788A49512R9134r6946j15079l5800J0417O7862r8770j83297M4099J32240J08918
$$ 149512 248646 151700 36621 821 11238 79100 -19670 -202967 -158868 -26628 82290
16777H2290k03914j02716J62538O4020j79548Q7251J32380r3083J64154Q8435
$$ 82290 -121624 -224340 -61802 2218 -177330 -90079 42301 -50782 113372 201807
16767B01807j32942j21287K2288K2870J6283L9795l9309j21480L2653K1838j5791
$$ 201807 68865 -52422 -30134 -7264 9019 48814 9505 -111975 -79322 -57484 -73275
16756g3275M103P8220K68810m3821j15284j8034j0314j76140j65899O9522o006
$$ -73275 -69172 9048 277858 234037 118753 100719 90405 -85735 -251634 -182112 -188118
16745a88118L9581J43165J03642n678o6606R7701j45818M5965N2166l8716q9112
$$ -188118 -148537 -5372 98270 92592 25986 123687 -22131 23834 76000 37284 -51828
16734e1828m5037l8932p954J94710J1890L9686k683m4055j43400o0321J03272
$$ -51828 -96865 -135797 -143751 50959 62849 102535 99852 55797 -87603 -147924 -44652
16723d4652J50472J2899P8039K2130j16206p5494p191R5297M9414j38057j46M1443
$$ -44652 105820 118719 196758 218888 102682 27188 19997 115294 164708 26651 26505 67948
16711F7948P2878n6258p6639q1774J05289j84969j71682P298J2650o0980q8810
$$ 67948 140826 84568 7929 -73845 31444 -153525 -325207 -317909 -305259 -366239 -455049
16700d55049N7963j7562O6845K09132K33117J14694J3712N1063k41361j40208
$$ -455049 -397086 -414648 -347803 -138671 94446 209140 222852 273915 32554 -107654
16690a07654Q0527K10939R9218l760m3114j08412o6352j39100p7864J36697k1706
$$ -107654 -27127 183812 283030 279270 236156 127744 61392 -77708 -155572 -18875 -40581
16679d0581Q8263M0559N1606l1849n3532L9963j2664j36980j24451O6765J04490
$$ -40581 47682 88241 139847 107998 54466 94429 81765 -55215 -179666 -112901 -8411
16668h411K9646k6647k5646j0146O7202j5010k06958q7637J00639K61373J12327
$$ -8411 21235 -5412 -31058 -41204 25998 10988 -195970 -283607 -182968 78405 190732
16657A90732N8691L0008o5509m5664K074l9901o6859L0642O281J12754K3920q7827
$$ 190732 249423 279431 213922 168258 170332 130431 63572 94214 100495 213249 237169 149342
16645A49342j19047K7174j03630N8675J34503J54520m6064Q560P2692j17882N1948
$$ 149342 30295 57469 -46161 12514 147017 301537 255473 264033 336725 218843 270791
16634B70791j54029r6982L1343N4929P566J74873j33438j55386m0051j19512J34207
$$ 270791 116762 19780 51123 106052 113618 288491 155053 -333 -40384 -159896 -25689
16623b5689O6913j2704j7859j00996N5461j4582p496P259j36601J77762J78696
$$ -25689 41224 28520 10661 -90335 -34874 -49456 -56952 -49693 -186294 -8532 170164
16612A70164l1845R0211k2831r814M7344o3075m3172j09159j4926N399l4245p6555
$$ 170164 138319 228530 205699 195885 243229 180154 136982 27823 12897 18296 -15949 -92504
16600i2504P4862o3103K6448L8515Q3999J7353j27272l5220o9934n9950J30545
$$ -92504 -17642 -80745 -54297 -15782 68217 85570 -41702 -76922 -146856 -206806 -76261
16589g6261J08039J55655J61307Q4194j23892k47515l2854J6013L7335Q5242k98159
$$ -76261 31778 187433 348740 432934 309042 61527 28673 44686 82021 167263 -130896
16578a30896n6970J08126L5625m8058J25137N9985N2240j66286j53388l4080J20557
$$ -130896 -187866 -79740 -44115 -92173 32964 92949 145189 -21097 -174485 -208565 -88008
16567h8008Q1299M7654L870R1429J42229j48172j35784o0574M5067J37352j0541
$$ -88008 -6709 40945 44815 136244 278473 130301 -5483 -66057 -20990 116362 105821
16556A05821O9948J20388l7181k5524q8395j75529o2240P5497m3769p0206Q3773
$$ 105821 175769 296157 258976 233452 145057 -30472 -92712 -17215 -60984 -131190 -47417
16545d7417k1871L7535O4456o659r6298j8114P525L912q0145Q9105P1721m9340
$$ -47417 -69288 -31753 32703 26044 -70254 -88368 -80843 -76931 -157076 -67971 3750 -45590
16533d5590j20254L2939Q6549r087R6962L5349j4665q2129Q9823J20152o9071
$$ -45590 -165844 -132905 -46356 -55443 41519 76868 62203 -19926 69897 190049 120978
16522A20978j38109L6290P3366l3513j22171Q2790k0570j97231r5487j35894O0972
$$ 120978 -17131 19159 92525 59012 -63159 19631 -939 -198170 -293657 -429551 -368579
16511c68579M7650L3071K8169J58552J05380M474r9242P2307j4387j32249r0422
$$ -368579 -320929 -287858 -259689 -101137 4243 8717 -90525 -18218 -32605 -164854 -255276
16500b55276N7528n5455J39712K35607n4977j30922l4704l8256P4540J08643m185
$$ -255276 -197748 -253203 -113491 122116 67139 -63783 -98487 -136743 -62203 46440 42255
16489D2255j02997m2046n0953j14730J67360J13015Q7570m9681J9265P8434p4783
$$ 42255 -60742 -102788 -153741 -268471 -101111 11904 99474 49793 69058 147492 72709
16478G2709j13288N7636n7029k4270j3023k2257l3694M4198N1452Q1360L9040
$$ 72709 -40579 17057 -39972 -64242 -77265 -99522 -133216 -89018 -37566 43794 82834
16467H2834J4301J0187p8844n3096N4194J4490K6748N8531j4892j22340J29041
$$ 82834 97135 107322 28478 -24618 29576 44066 70814 129345 114453 -7887 121154
16456A21154J12492l6448j17713j28813p3091q572N6527O3928l6874j00178k5024
$$ 121154 233646 197198 79485 -49328 -122419 -130991 -74464 -10536 -47410 -147588 -172612
16445a72612J79385K02551p3042j25887J9737N876L8923k3140j41722k11691m3952
$$ -172612 6773 209324 136282 10395 30132 36008 74931 51791 -89931 -301622 -345574
16434c45574J03523K8860m2682N2643Q4750J26979j6449k5646p890l6167m6159
$$ -345574 -242051 -213191 -255873 -203230 -118480 8499 -7950 -33596 -41486 -77653 -123812
16423a23812j6983N998l407o3835L0681L2174J25355L7098m3929J03257n8945
$$ -123812 -140795 -134797 -138204 -202039 -171358 -139184 -13829 23269 -20660 82597 23652
16412B3652n1757k9197J64923J28353O2038j37407O4654p895N2724k40327q3070
$$ 23652 -28105 -57302 107621 235974 298012 160605 225259 217364 270088 29761 -53309
16401e3309R0295r7999J6478p2965N1410K1651N5745r6626J36886J40067N1139
$$ -53309 36986 -61013 -44535 -117500 -66090 -44439 11306 -85320 51566 191633 242772
16390B42772n7856j49507q9072j18417M2083R8035L8874m5790q5364k9313K3372
$$ 242772 184916 35409 -53663 -172080 -129997 -31962 6912 -38878 -124242 -153555 -130183
16379a30183J21846m3399J26355L6813k69423j23196J24105J86411J44703k03912
$$ -130183 -8337 -51736 74619 111432 -157991 -281187 -157082 29329 174032 -29880
16369b9880j67763P0805J4849Q4653Q2862p431k5222k1901R5607p2937L0452P8498
$$ -29880 -197643 -126838 -111989 -27336 55526 48095 22873 972 96579 23642 54094 132592
16357A32592j3113j89009j08294o0432n2685Q4459M7100L3803J6317Q9439J7497
$$ 132592 119479 -69530 -177824 -238256 -290941 -206482 -159382 -125579 -109262 -19823 -2326
16346b326j56663p969N9441K19558o5189j13713l6463Q5213m9358m5468J42445
$$ -2326 -158989 -166958 -107517 112041 46852 -66861 -103324 -18111 -67469 -112937 29508
16335B9508J02496j5864j1992j10558l160J32031m262j10376k4081m8380j1956
$$ 29508 132004 116140 104148 -6410 -9570 122461 118199 7823 -16258 -64638 -76594
16324g6594Q4777N1812j08808J72485Q525j70319l5703l6133l422q0454N2722
$$ -76594 8183 59995 -48813 123672 132197 -38122 -73825 -109958 -113380 -193834 -141112
16313a41112r5166r3966J64828J58998j04598k2342J19230R3864P9031j6005p0114
$$ -141112 -236278 -330244 -165416 -6418 -111016 -133358 -14128 79736 158767 142762 72648
16302G2648J40796R510k4878l1540k0858Q2987O8447r897p0376k1402J8113r7778
$$ 72648 213444 222954 198076 166536 145678 228665 297112 287215 216839 195437 213550 115772
16290A15772p2862J18596P7112J863o6121j6614j5153j40770k8750n8405p1690
$$ 115772 42910 161506 238618 240481 174360 157746 142593 1823 -26927 -85332 -157022
16279a57022N577J30625O3915J17679J26462j50143j07680p5187j2473J9613K1360
$$ -157022 -151445 -20820 43095 160774 287236 137093 29413 -45774 -58247 -38634 -17274
16268a7274m7837K3950J465Q5456P5769j04028O751J81712j0795p5870k9197J9040
$$ -17274 -65111 -41161 -39696 45760 121529 17501 24252 205964 195169 119299 90102 109142
16256A09142O7435l9086L1115j18033j7885n0776N5918M9262l8405j20488p012
$$ 109142 176577 137491 168606 50573 32688 -18088 37830 87092 48687 -71801 -78813
16245g8813j05943J00536P8446j06411l3552K01564O9150k6097m2635j81400n2101
$$ -78813 -184756 -84220 -5774 -112185 -145737 55827 124977 98880 56245 -125155 -177256
16234a77256Q6792J9976K137l8810k1605n693M3665N0046N6764j13761j24299
$$ -177256 -90464 -70488 -68351 -107161 -128766 -134459 -90794 -40748 16016 -97745 -222044
16223b22044k8723N8801R4124O7915j2341m7846J33207n3628J8296O6813k2072
$$ -222044 -250767 -191966 -97842 -29927 -42268 -90114 43093 -10535 7761 74574 52502
16212E2502J8662J61698J56704j22531k44143r7442K2722j6488l1487j20610J35950
$$ 52502 71164 232862 389566 267035 22892 -74550 -51828 -68316 -99803 -220413 -84463
16201h4463P9271J07841N4785o2596M6538m4539o564p5152M461o3118M7773o7548
$$ -84463 -5192 102649 157434 94838 141376 96837 90273 15121 19582 -43536 4237 -63311
16189f3311k51747j0785L3210L9997M1842J73952P6211K17994j16706j56875Q9684
$$ -63311 -315058 -325843 -292633 -252636 -210794 -36842 39369 257363 140657 -16218 73466
16178G3466N9471p7561j42776r2033K6867J53312J22346L1764j72101j58667M7363
$$ 73466 132937 55376 -87400 -179433 -152566 746 123092 154856 -17245 -175912 -128549
16167a28549R7240J90846K1667m5886O958p7451j67468M8343J1907N6237j9547
$$ -128549 -31309 159537 181204 135318 142276 64825 -102643 -54300 -42393 13844 -5703
16156e703P3446n0426j54764K2277O6184O0639r648L1308k5545l8525j29887j13377
$$ -5703 67743 17317 -137447 -115170 -48986 11653 2005 33313 7768 -30757 -160644 -274021
16144b74021K9429L4214P9460n2152J50661J47440j041q3852O274J73188M7807
$$ -274021 -244592 -210378 -130918 -183070 -32409 115031 113990 30138 36412 209600 257407
16133B57407j39271k8144n358k22463J00005l0627O9010J6184J07581J59105r3720
$$ 257407 118136 89992 84634 -137829 -37824 -68451 559 16743 124324 283429 189709
16122A89709p8127p7495k31973j12984m6182Q6918J13507q407k0275k4433R3825
$$ 189709 111582 34087 -197886 -310870 -357052 -270134 -156627 -165034 -185309 -209742 -115917
16111a15917Q1172L9989l7446j57291k324L479R6793M9204J9302Q3302l38669
$$ -115917 -34745 5244 -32202 -189493 -191817 -188338 -91545 -42341 -23039 60263 -278406
16100b78406k09262J00741J64378J20516J03192o3550N5990J3023r7591m6729
$$ -278406 -487668 -386927 -222549 -102033 1159 -62391 -6401 6622 -90969 -137698
16090a37698K00656K7530r724k18284m7221j7231K77248J45675j60959j73820
$$ -137698 62958 90488 80764 -137520 -184741 -201972 75276 220951 59992 -113828
16080a13828k08179o1680J66595J49794J56610J27764L7414n3157j49154j79555
$$ -113828 -322007 -383687 -217092 -67298 89312 217076 254490 201333 52179 -127376
16070a27376n597J61917J77336j53758n5171O3652o6609r7349K6905M1993R9989
$$ -127376 -132973 28944 206280 52522 -2649 61003 -5606 -102955 -76050 -34057 65932
16059F5932J2180o6967k87718L4161Q2898N1123J5040j4744r7054R9636q5288
$$ 65932 78112 11145 -276573 -242412 -159514 -108391 -93351 -108095 -205149 -105513 -190801
16048a90801j22820L8552l935J13563n7126O1742Q7122j30193j35940J08738M4040
$$ -190801 -313621 -275069 -279004 -165441 -222567 -160825 -73703 -203896 -339836 -231098 -187058
16037a87058O2539j3521J35829n4553j50135P5915J22548N4294p9056m2952N8030
$$ -187058 -124519 -138040 -2211 -56764 -206899 -130984 -8436 45858 -33198 -76150 -18120
16026a8120R4077N1451J65729L6548j00601p4033K8094J11244j82146r2855p322
$$ -18120 75957 127408 293137 329685 229084 155051 183145 294389 112243 19388 12066
16015A2066n3415R2619J99293j44238M8262P362m757o5576K5745R2984p5136o7844
$$ 12066 -41349 51270 250563 106325 154587 161949 157192 91616 117361 210345 135209 67365
16003F7365j48859j01854J5715J59585n0035N101P562N2185j13175j26176k0949
$$ 67365 -81494 -183348 -167633 -8048 -58083 -52982 -45420 6765 -106410 -232586 -253535
15992b53535P4053J4123P2409J35466J8517K41540p6924j33735L4395n680k3484
$$ -253535 -179482 -165359 -92950 42516 61033 302573 225649 91914 126309 120629 97145
15981I7145o6503o6804k4412p5269J28162J09136K6051R0067j0337r3742l9546
$$ 97145 30642 -36162 -60574 -135843 -7681 101455 127506 217573 207236 113494 73948
15970G3948r5979j19029P0698o891K0139J7671M4877K116o09j4465j16564n565
$$ 73948 -22031 -141060 -70362 -77253 -57114 -39443 5434 7550 6941 -7524 -124088 -129653
15958a29653L4600J05753K6689m1624j41920O0366o4351j6725o5840J9832p9689
$$ -129653 -95053 10700 37389 -4235 -146155 -85789 -150140 -166865 -232705 -212873 -292562
15947b92562r6133J28661N4l9773Q9434R2725L2972l408K1471p9182J8077J30726
$$ -292562 -388695 -260034 -259980 -299753 -210319 -117594 -84622 -88030 -66559 -145741 -127664 3062
15935C062O9104J8404J0614M1207j833r708q3603m2056j74536k75637r124l7797
$$ 3062 72166 90570 101184 142391 140558 130850 47247 5191 -169345 -444982 -454106 -491903
15923d91903K03585J37098p2803j54035J717P5320P9005L9525P126P7533K10522
$$ -491903 -288318 -151220 -224023 -378058 -376341 -301021 -222016 -182491 -175365 -97832 112690
15912A12690k5309m3320P7811P0191o4889o6925r9026J94286J06677j88498k68997
$$ 112690 87381 44061 121872 192063 127174 60249 -38777 155509 262186 73688 -195309
15901a95309L5344R0215M4758J72260q4979m27207j40713J69612O2243L8876J6935
$$ -195309 -159965 -69750 -24992 147268 62289 -364918 -505631 -336019 -273776 -234900 -217965
15890b17965J16986L6895k04025j19116p2206J84033J47268J00607q7414j1651
$$ -217965 -100979 -64084 -268109 -387225 -459431 -275398 -128130 -27523 -114937 -126588
15880a26588J43647m6738m4992n3197J76792L7338k44503Q04K18350L7441o9485
$$ -126588 17059 -29679 -74671 -127868 48924 86262 -158241 -157437 60913 98354 28869
15869B8869K0419k6662J35622R9808p0612P4099J2365j68575p1463m1968m7128
$$ 28869 49288 22626 158248 258056 187444 261543 273908 105333 33870 -8098 -55226
15858e5226l214o3748j78210j00003O7263p9264o745J22813P0584R6070M9109
$$ -55226 -58440 -122188 -300398 -400401 -333138 -412402 -419147 -296334 -225750 -129680 -80571
15847h0571K778N6630l7898K7315J09777J90726j17314j74152p6675k76893Q6589
$$ -80571 -77793 -21163 -59061 -31746 78031 268757 151443 -22709 -99384 -376277 -289688
15836b89688K64383K07961j08229P0852P4461J17485n5496j04259j0927p9384
$$ -289688 -25305 182656 74427 145279 219740 337225 281729 177470 166543 87159
15826H7159j23201m7103j59405M3847J35783O4177m0740R964L0462k00661O4191
$$ 87159 -36042 -83145 -242550 -198703 -62920 1257 -39483 -29519 943 -199718 -135527
15815a35527J09127L0567L6107m5630k8133N9696n010L0322k3580N6539k534M7798
$$ -135527 -26400 4167 40274 -5356 -33489 26207 21197 51519 27939 84478 81944 129742
15803A29742J7422o2938n4191n6573m5817Q4036K2832k3059K0716N3938m5215
$$ 129742 147164 84226 30035 -26538 -72355 11681 34513 11454 32170 86108 40893
15792D0893l8399L8242Q1054j33048k7151o4435O9537J8518L3466p8166j8487
$$ 40893 2494 40736 121790 -11258 -38409 -102844 -33307 -14789 18677 -59489 -77976
15781g7976Q4281j18293m9868K09599p6623j87560J7717J33098J31898l811k42548
$$ -77976 6305 -111988 -161856 47743 -28880 -216440 -198723 -65625 66273 62462 -180086
15770a80086q5529J5793N5744O3070l9121j74598L0284J53450P875P4232m1173
$$ -180086 -265615 -249822 -194078 -131008 -170129 -344727 -314443 -160993 -153118 -78886 -120059
15759a20059l7958K01406J31942j5911q9989j00165j73461k2556O3500O6721J01315
$$ -120059 -158017 43389 175331 159420 69431 -30734 -204195 -226751 -163251 -96530 4785
15748D785P0609m1977k5969q5862K29584K17346J17510k57759k21592l4031k1257
$$ 4785 75394 33417 7448 -78414 151170 368516 486026 228267 6675 -27356 -48613
15737d8613p9186r3287J8721N2592J3922J68341R9644L3545o5393k59198n2058
$$ -48613 -127799 -221086 -202365 -149773 -135851 32490 132134 165679 100286 -158912 -210970
15726b10970k1869J52740R9083M6354j1801p8024o0153o7131m3602J79051p2417
$$ -210970 -232839 -80099 18984 65338 53537 -24487 -84640 -151771 -195373 -16322 -88739
15715h8739r456j32845l8281O8506N8251K2747N4543k4133n1704J27339n5497
$$ -88739 -98195 -231040 -269321 -200815 -142564 -119817 -65274 -89407 -141111 -13772 -69269
15704f9269k9732J69605J37820K21665J33431Q1901j52874j64389j50269k3953
$$ -69269 -99001 70604 208424 430089 563520 645421 492547 328158 177889 153936
15694A53936R1714k5767k6340N815j26550l0246O4600j70958q2837J4750p1765
$$ 153936 245650 219883 193543 199358 72808 42562 107162 -63796 -146633 -131883 -203648
15683b03648o5544K2954R7933L6526l8442p5845J02089K24795j07573k8956O9317
$$ -203648 -269192 -246238 -148305 -111779 -150221 -226066 -123977 100818 -6755 -35711 33606
15672C3606J28888L6871L0672k30139J124J45996j06591j67818J1170p2220M3730
$$ 33606 162494 199365 230037 -102 1022 147018 40427 -127391 -116221 -188441 -144711
15661a44711P0146l1630J33037j03972j15163M7875J13581L5756j74645m2168
$$ -144711 -74565 -106195 26842 -77130 -192293 -144418 -30837 4919 -169726 -211894
15651b11894J8778J10092O161j19266K28606L3285j89411J8326K66153J49433
$$ -211894 -193116 -83024 -76863 -196129 32477 65762 -123649 -105323 160830 310263
15641C10263J9968j40778K5197J89694J146k56067l0458N096j26086O5081o9203
$$ 310263 330231 189453 214650 404344 405490 149423 118965 124061 -2025 63056 -6147
15630f147n2825J00748n4936k10435j37293J62931O3363o7648J40224J27153l6044
$$ -6147 -58972 41776 -13160 -223595 -360888 -197957 -134594 -202242 -62018 65135 29091
15619B9091q2891R4727k3986p1277k61097l4821J82988J87615M1572J58962J41755
$$ 29091 -53800 40927 16941 -54336 -315433 -350254 -167266 20349 61921 220883 362638
15608C62638J6402j61318j41723r2720k47744n7440J00142J09271L452L129J41622
$$ 362638 379040 217722 75999 -16721 -264465 -321905 -221763 -112492 -109040 -105911 35711
15597C5711J28323L0747j21645r2773k6983o1839J42572R6926J2757K6836j27631
$$ 35711 164034 194781 73136 -19637 -46620 -108459 34113 131039 143796 170632 43001
15586D3001m0615O6928J44771P4127r6212k68207r1364J75862J69106N0263n0953
$$ 43001 2386 69314 214085 288212 192000 -76207 -167571 8291 177397 227660 176707
15575A76707J173P8978J08113K1437j6774j90390k08286L6988j33863r5543l5674
$$ 176707 177880 256858 364971 386408 369634 179244 -29042 7946 -125917 -221460 -257134
15564b57134J04610J61551J13020q0828j44925L0367L5788p51P15j0370j04680
$$ -257134 -152524 9027 122047 41219 -103706 -73339 -37551 -38302 -37587 -47957 -152637
15553a52637M3008J04691J36266q3547m4909o8110J91958r7836j69417j1043J27190
$$ -152637 -109629 -4938 131328 47781 2872 -65238 126720 28884 -140533 -151576 -24386
15542b4386p6501n1345j06043j78787J80168K39535J24717L0678j57790j0401
$$ -24386 -100887 -152232 -258275 -437062 -256894 -17359 107358 138036 -19754 -30155
15532c0155M5548O82l0613J6594O1155J2821p887o3714M372j08368j16015l6642
$$ -30155 15393 16075 -14538 2056 63211 76032 68145 4431 8803 -99565 -215580 -252222
15520b52222Q2299J55872J40136m0146k16407m9870L9946j01715O0973J30292
$$ -252222 -169923 -14051 126085 85939 -130468 -180338 -140392 -242107 -181134 -50842
15510e0842j28193l4808O7226K07686K2401k38291j77358J01763R5799l3109j14781
$$ -50842 -179035 -213843 -146617 61069 83470 -154821 -332179 -230416 -134617 -167726 -282507
15499b82507j08557J48792N6678l2618o5294J66938Q7822M1216J69928Q5482k28103
$$ -282507 -391064 -242272 -185594 -218212 -283506 -116568 -28746 12470 182398 267880 39777
15488C9777j91588K5034J47611r10m2700j09675K6128J17601L4363K8820j24564
$$ 39777 -151811 -126777 20834 19924 -22776 -132451 -106323 11278 45641 74461 -50103
15477e0103j90544j35951K13766J24205J00985q9651o242J04383m6318n9196j0624
$$ -50103 -240647 -376598 -162832 -38627 62358 -27293 -33535 70848 24530 -34666 -45290
15466d5290P8257r5642n6309r5206Q6247o9268m2424O8155j21061j55269m7465
$$ -45290 32967 -62675 -118984 -214190 -127943 -197211 -239635 -171480 -292541 -447810 -495275
15455d95275Q8080J62265J4976q2425Q9432N642J05565J4079k0618J45715L1380
$$ -495275 -407195 -244930 -229954 -312379 -222947 -217305 -111740 -97661 -118279 27436 58816
15444E8816J5456M4925p449K9904L981P8497K33494J6180k20436j27316n6844
$$ 58816 74272 119197 111748 141652 145633 224130 457624 473804 253368 126052 69208
15433F9208O4366M193j70020j307K00617M4304J13648J10494M269K9076j12399
$$ 69208 133574 137767 -32253 -33560 167057 211361 325009 435503 439772 468848 356449
15422C56449l00616l02680O0995o610N0579m4319L0989J12433L0960P362J6214
$$ 356449 55833 -246847 -185852 -192462 -141883 -186202 -155213 -42780 -11820 -4458 11756
15411A1756j36817m028J74982K09201P7720M8528j43986j78562j42888j10709
$$ 11756 -125061 -129089 45893 255094 332814 381342 237356 58794 -84094 -194803
15401a94803p0017n6900k2648O3748r5104J87503K01920k577j28844M0600L9134
$$ -194803 -264820 -321720 -344368 -280620 -375724 -188221 13699 11122 -117722 -77122 -37988
15390c7988j9449M3054r5369j9826p0224J10693K76614J55114K7491p4704j12672
$$ -37988 -57437 -14383 -109752 -129578 -199802 -89109 187505 342619 370110 295406 182734
15379A82734j10560l1006J8919L6993J51128j21143l02874J12421K25210M4220
$$ 182734 72174 41168 60087 97080 248208 127065 -175809 -63388 161822 206042
15369B06042o8260r4303j38266o4332O0713k381p6468P902J28020Q5j52923L6856
$$ 206042 137782 43479 -94787 -159119 -98406 -100787 -177255 -169353 -41333 -41248 -194171 -157315
15357a57315m375M4769J26061k4434K729J54576p5484k33340l6038J01679N9216
$$ -157315 -161690 -116921 9140 -15294 -12565 142011 66527 -166813 -202851 -101172 -41956
15346d1956l1526L8027J29172J10410j8917R7280r5776j09343r294K5434r0262
$$ -41956 -73482 -35455 93717 204127 185210 282490 186714 77371 68077 93511 3249
15335C249J9519K9012M0706p0574M2834N4797o0647r7897m4701o3684R758p7432
$$ 3249 22768 51780 92486 21912 64746 119543 58896 -39001 -83702 -147386 -137628 -215060
15323b15060n9709O9848J35040J7629j9244L1892m1913J59763Q4079L898j07129
$$ -215060 -274769 -204921 -69881 -52252 -71496 -39604 -81517 78246 162325 166223 59094
15312E9094q6994P1124P638M164N749k2815l2528o2981j26929n0472J77576J51404
$$ 59094 -27900 43224 50862 55026 60775 37960 5432 -57549 -184478 -234950 -57374 94030
15300I4030Q637q2318k09352J18238N0526R9451M2442M6453l6890l4995j06340
$$ 94030 102667 20349 -189003 -70765 -20239 79212 121654 168107 131217 96222 -10118
15289a0118q5846r8391N9143K80993j00523r6540k09436k4182J93292J77642J06560
$$ -10118 -95964 -194355 -135212 145781 45258 -51282 -260718 -284900 -91608 86034 192594
15278A92594M7047j25294j12922J2140k9076l4322J07108o4356j7083o6466J33919
$$ 192594 239641 114347 1425 13565 -15511 -49833 57275 -7081 -24164 -90630 43289
15267D3289J67574O0431o2051j16472p7204n7188o4056j34654J35311r6719M7269
$$ 43289 210863 271294 209243 92771 15567 -41621 -105677 -240331 -105020 -201739 -154470
15256a54470R9561P9483Q7265l349j33618j58952J9733O9617k2738j6366K8606
$$ -154470 -54909 24574 111839 108490 -25128 -184080 -164347 -94730 -117468 -133834 -105228
15245a05228n1702N6399M5183m7139j64835M177J86201K53541O272o1805K5103
$$ -105228 -156930 -100531 -55348 -102487 -267322 -263145 -76944 176597 182869 121064 146167
15234A46167N1251j49671k01983N5274Q0436J10184j50969l9011P1561Q4172j44288
$$ 146167 197418 47747 -154236 -98962 -18526 91658 -59311 -98322 -26761 57411 -86877
15223h6877k1045J13961J55174J9083j12634k1090N5112j24644J98574N3647M3914
$$ -86877 -107922 6039 161213 180296 67662 46572 101684 -22960 175614 229261 273175
15212B73175J16561j9992R7546j37687k17291j6784J69008l451j33689j33346
$$ 273175 389736 369744 467290 329603 112312 95528 264536 261085 127396 -5950
15202e950m3621J71041p349K1124k0354p7738m2385j0178O9028K7490J6598j05440
$$ -5950 -49571 121470 114121 135245 114891 37153 -5232 -15410 53618 81108 97706 -7734
15190g734L7284L2724q3184j6594m0331K1789L3046l7738l2732M6903k4172l9359
$$ -7734 29550 62274 -20910 -37504 -77835 -56046 -23000 -60738 -93470 -46567 -70739 -110098
15178a10098j4056j71588j8591K14207O7552k348l2706q0968N4033J12912p3843
$$ -110098 -124154 -295742 -314333 -100126 -32574 -34922 -67628 -148596 -94563 18349 -55494
15167e5494j24260M0125M9249P0481q1928n1281J63498N5803q3771r3170l2266
$$ -55494 -179754 -139629 -90380 -19899 -101827 -153108 10390 66193 -17578 -110748 -143014
15156a43014J26136J13477K45654K33685p1855k24885k72478o6014R638R9196
$$ -143014 -16878 96599 342253 575938 504083 279198 6720 -59294 -49656 49540
15146D9540k3815j27709m0840N6812l8766j23447j1409K68605J98879j68226j27819
$$ 49540 25725 -101984 -142824 -86012 -124778 -248225 -259634 8971 207850 39624 -88195
15135h8195J2254L0498O7462k01303J4695K30689J0593j18143j37977L3734p8535
$$ -88195 -75941 -45443 22019 -179284 -164589 66100 76693 -41450 -179427 -145693 -224228
15124b24228K5398P7749P9768J00375k0910q7639O2850m3731K4218Q7299L5560
$$ -224228 -198830 -121081 -41313 59062 38152 -49487 13363 -30368 -6150 81149 116709
15113A16709J21291k0825j60147q7645M2q582k5800o4442K6689Q3059M0919K9273
$$ 116709 238000 217175 57028 -30617 -30575 -39157 -64957 -129399 -102710 -19651 21268 50541
15101E0541r3724L8448p7844K8728q2496o2225o6669M4023J66165j9554M7066
$$ 50541 -43183 -4735 -82579 -53851 -136347 -198572 -265241 -221218 -55053 -74607 -27541
15090b7541J10121k3798j02878j01182o3412R3282J90670L2167k1987k7697m0640
$$ -27541 82580 58782 -44096 -145278 -208690 -115408 75262 107429 85442 57745 17105
15079A7105J0297J21040m1342k21350J166M4136P0530R4089q602q4683j12594
$$ 17105 27402 148442 107100 -114250 -113084 -68948 1582 95671 87069 2386 -110208
15068a10208j1595k5606N3158j65486L5917K08085J40892Q0839q1585l5538q6065
$$ -110208 -121803 -147409 -94251 -259737 -223820 -15735 125157 205996 124411 88873 2808
15057B808n9048J78400P3377j02420q1132l2667Q7403k1676N1708R678J544J6548
$$ 2808 -56240 122160 195537 93117 11985 -20682 66721 45045 96753 106431 107975 124523
15045A24523K4825o9760j70435K6031l6238J8115O3420P7547m43M9925p4679K3185
$$ 124523 149348 79588 -90847 -64816 -101054 -82939 -19519 58028 57585 107510 32831 56016
15033E6016j48615j10742J38697j37049m4930J28105n407N7223J82259k8772J9843
$$ 56016 -92599 -203341 -64644 -201693 -246623 -118518 -123925 -66702 115557 86785 106628
15022A06628q4875k07632k06511L5055P1829J62370N8190m1161N7198P7264J78541
$$ 106628 21753 -185879 -392390 -357335 -285506 -123136 -64946 -106107 -48909 28355 206896
15011B06896j9255L5268K18501q0758j22240l2931j9145q0454j36115J00790J0378
$$ 206896 187641 222909 441410 360652 238412 205481 186336 105882 -30233 70557 80935
15000H0935j2196k7595j55419o614J75155J72608r3411J00845p14l9407j7210
$$ 80935 68739 41144 -114275 -120889 54266 226874 133463 234308 233594 194187 176977
14989A76977m5680J9121J03841J21387q2684p1009j69493k17516j86332J33420
$$ 176977 131297 150418 254259 375646 292962 221953 52460 -165056 -351388 -217968
14979b17968Q7575M3207J17522j1321k07360N5860L7728j15823J59644M6115n0956
$$ -217968 -130393 -87186 30336 19015 -188345 -132485 -94757 -210580 -50936 -4821 -55777
14968e5777k8838K8129J30078p7422p2196N3401J44109K42447p5914q5920n9246
$$ -55777 -84615 -56486 73592 -3830 -76026 -22625 121484 363931 288017 202097 142851
14957A42851r9803j26452O3436J55516L4423L5173l8821j68723M7359j078n0961
$$ 142851 43048 -83404 -19968 135548 169971 205144 166323 -2400 44959 43881 -7080
14946g080r5897j0880k05391j6211P0504k5925O5446n1445O5461J59186j9893
$$ -7080 -102977 -113857 -319248 -335459 -264955 -290880 -225434 -276879 -211418 -52232 -72125
14935g2125q7606L9181j69662l5775J39976Q9057J24974K8124m1757j22854j31555
$$ -72125 -159731 -120550 -290212 -325987 -186011 -96954 28020 56144 14387 -108467 -240022
14924b40022M6589R5838N2114p0664m1718J53434K63815J00327j23162k87197
$$ -240022 -193433 -97595 -45481 -116145 -157863 -4429 259386 359713 236551 -50646
14914e0646j68349J12126K0268O9527J15300J41100J33327m4462j55232n3031
$$ -50646 -218995 -106869 -86601 -17074 98226 239326 372653 328191 172959 119928
14904A19928O054m818j49588j00695j3247n176j2130k4699J34539N237J14840
$$ 119928 125982 121164 -28424 -129119 -142366 -147542 -159672 -184371 -49832 -44595 70245
14893G0245J51538o6985j33315j12495J2381K5040p9302l1086O4797J69732k1957
$$ 70245 221783 154798 21483 -91012 -78631 -53591 -132893 -163979 -99182 70550 48593
14882D8593o1532n2202k250N6059o920j15434k7575j3096Q6720K06706Q1533j36808
$$ 48593 -12939 -65141 -67391 -11332 -18252 -133686 -161261 -174357 -87637 119069 200602 63794
14870F3794j09854M0419J0281J08969K6860n9022r8711o5073j36406O2524R0481
$$ 63794 -46060 -5641 4640 113609 140469 81447 -17264 -82337 -218743 -156219 -65738
14859f5738n9749k11264L3349R0755J38056n3043O6535j52554j09640R3919P3747
$$ -65738 -125487 -336751 -303402 -212647 -74591 -127634 -61099 -213653 -323293 -229374 -155627
14848a55627m9144l0381j28956Q0535K07542Q4422j26723Q1778L5097l0009p8235
$$ -155627 -204771 -235152 -364108 -283573 -76031 8391 -118332 -36554 -1457 -31466 -109701
14837a09701q0196R5513J1167O9972L4896L3942J45799r5403m3912J33078J63868
$$ -109701 -189897 -94384 -83217 -13245 21651 55593 201392 105989 62077 195155 359023
14826C59023j61240r3439j15962j25005J33562k0353r0417J15271L5990l2990
$$ 359023 197783 104344 -11618 -136623 -3061 -23414 -113831 1440 37430 4440
14816D440j08441J10718J08882q4103m4745p1145r503J76066K0092n0257l3571
$$ 4440 -104001 6717 115599 31496 -13249 -84394 -93897 82169 102261 52004 18433
14805A8433O1334M3781P0125q0287n2427K6037M1895p9424P6974j06644J4222
$$ 18433 79767 123548 193673 113386 60959 86996 128891 49467 126441 19797 34019
14794C4019j6235r0680q5682J39356O8152m7649o5003j9173l0990M1567J50249
$$ 34019 17784 -72896 -158578 -19222 48930 1281 -63722 -82895 -113885 -72318 77931
14783G7931j48045k3034p9207r229R4212J47757O9356j02514j28247P6174L8192
$$ 77931 -70114 -93148 -172355 -181584 -87372 60385 129741 27227 -101020 -24846 13346
14772A3346o8366J63962k5308j40702O8742N9739O2088N1931l9462l1186J0292
$$ 13346 -55020 108942 83634 -57068 11674 71413 133501 185432 145970 114784 125076
14761A25076n9792O1235l3455j38567P1882M8864p4472j944n5310l3099P7056
$$ 125076 65284 126519 93064 -45503 26379 75243 771 -1173 -56483 -89582 -12526
14750a2526P4452l5888j9016R3167L0885j43069k6915k623L7903N8670P8802J29040
$$ -12526 61926 26038 7022 100189 131074 -11995 -38910 -41533 -3630 55040 133842 262882
14738B62882p8869o5688j39559j84893n8191j0286J39987J03314k2592o890L695
$$ 262882 184013 118325 -21234 -206127 -264318 -274604 -134617 -31303 -53895 -60785 -57090
14727e7090K6341l8188L9688j31519O73k9561j16208M453J68296J54139M6042
$$ -57090 -30749 -68937 -29249 -160768 -160095 -189656 -305864 -301411 -133115 21024 67066
14716F7066q8320K6511R6964j265L4251m7815J7830J01645k9701J1351m0759j11535
$$ 67066 -21254 5257 102221 100956 135207 87392 105222 206867 177166 188517 147758 36223
14704C6223o7624K3348P1605Q7469M6398m5114j49877m1193j1295P549j890O8747
$$ 36223 -31401 -8053 63552 151021 197419 152305 2428 -38765 -50060 -42511 -44401 24346
14692B4346k9274m5675o3400p0478q2962o8274m2224N3569R8879N9969M07R0622
$$ 24346 -4928 -50603 -114003 -184481 -267443 -335717 -377941 -324372 -225493 -165524 -165117 -74495
14680g4495R4940o9141p3058R7824J39126P9906N0524j66323r4225l1643n4165
$$ -74495 20445 -48696 -121754 -23930 115196 195102 245626 79303 -14922 -46565 -100730
14669a00730p9394L4343J23195M603K2461J34285M5685p5820n8972m4021j25139
$$ -100730 -180124 -145781 -22586 -17983 4478 138763 184448 108628 49656 5635 -119504
14658a19504o789q881J11266m8423n1169j40085P0559J41114R1046R4373q7683
$$ -119504 -126293 -135174 -23908 -72331 -123500 -263585 -193026 -51912 39134 133507 45824
14647D5824o2413m852J803j12355j07239K4253J53258n1846j1042o5976J20052
$$ 45824 -16589 -21441 -19638 -131993 -239232 -214979 -61721 -113567 -124609 -190585 -70533
14636g0533r4670j94476K2612K62049K03028l6669J160j48524k25423l6773J08367
$$ -70533 -165203 -359679 -337067 -75018 128010 91341 92501 -56023 -281446 -318219 -209852
14625b09852P2757J2202K0317n3304r2452J21651L9431r312j1707n5182q0427
$$ -209852 -137095 -124893 -104576 -157880 -250332 -128681 -89250 -98562 -110269 -165451 -245878
14614b45878Q1231r4752L8370J86707L7199N5739m0662r319J7285k3457j12667
$$ -245878 -164647 -259399 -221029 -34322 2877 58616 17954 8635 25920 2463 -110204
14603a10204j21770j10849R176O4898l5175M8581m0109N4640J27402J65222O8432
$$ -110204 -231974 -342823 -333647 -268749 -303924 -255343 -295452 -240812 -113410 51812 120244
14592A20244j02757o3492Q2996J8674j31732m3238K5088r0004J912J49688R8478
$$ 120244 17487 -46005 36991 55665 -76067 -119305 -94217 -184221 -182309 -32621 65857
14581F5857J8223k9338j48945K9065K9877l7009M873K1212j21287m7275m9267
$$ 65857 84080 54742 -94203 -65138 -35261 -72270 -67397 -46185 -167472 -214747 -264014
14570b64014O750K41771M7852R7765M5457n5371k50921j44937p61J6263J49389
$$ -264014 -257264 -15493 32359 130124 175581 120210 -130711 -275648 -276409 -260146 -110757
14559a10757J28680J50963K0608P1151l5715j42721j34412R6141N3520J0804Q0879
$$ -110757 17923 168886 189494 260645 224930 82209 -52203 43938 97458 108262 189141
14548A89141n3075l384k1908Q2125k85335l8715K38238O324j06276j1751m0356
$$ 189141 136066 132682 110774 192899 -92436 -131151 107087 113411 7135 -4616 -44972
14537d4972n0160J71828m8200k72628N0456j32383m5104q0983L1402K29937K71843
$$ -44972 -95132 76696 28496 -244132 -193676 -326059 -371163 -452146 -420744 -190807 81036
14526H1036J97600K4820k19828j04589J2241J15630j7006j12948j934M0456q234
$$ 81036 278636 303456 83628 -20961 -8720 106910 89904 -23044 -24978 15478 7244
14515G244J9785j28502n2608r1791j03530J91180J40083P2601M627p0216J4813
$$ 7244 27029 -101473 -154081 -245872 -349402 -158222 -18139 54462 59089 -11127 3686
14504C686k9450J7804J4477j72264r7347O8991P9075M8743k4600Q0985O6936j36030
$$ 3686 -25764 -7960 6517 -165747 -263094 -194103 -115028 -66285 -90885 -9900 57036 -78994
14492g8994r0186k7978J22137J58180p4169o7858L3176K39967j24004k21597r845
$$ -78994 -169180 -197158 -75021 83159 8990 -58868 -25692 214275 90271 -131326 -141171
14481a41171J35831l922L9455J03766R0537j1845Q5368j27469k30918j11197R3539
$$ -141171 -5340 -9262 30193 133959 224496 212651 298019 170550 -60368 -171565 -78026
14470g8026J93994P9476M645l1935q6460r9386j09853L5287p0198l0599J12127
$$ -78026 115968 195444 200089 168154 81694 -17692 -127545 -92258 -162456 -193055 -80928
14459h0928K5127q8166j4428r6015P4972R2761k5124n5233Q6345O9989j20421
$$ -80928 -55801 -143967 -158395 -254410 -179438 -86677 -111801 -167034 -80689 -10700 -131121
14448a31121j32253N1069L8546J60075L0425r6039p5476o14o399k19603j14235
$$ -131121 -263374 -212305 -173759 -13684 16741 -79298 -154774 -155388 -161787 -381390 -495625
14437d95625Q5994L24685K7205j29648M3042Q4310M8098j42401j13818J48195
$$ -495625 -409631 -84946 -57741 -187389 -144347 -60037 -11939 -154340 -268158 -119963
14427a19963J05562L7777J96100J5771k13137K7586j1639n1414j66660p0111o751
$$ -119963 -14401 23376 219476 235247 22110 49696 38057 -13357 -180017 -250128 -256879
14416b56879J39794J79920R7003m9800j08973m1976N2747P3167J5087l7352j09117
$$ -256879 -117085 62835 159838 110038 1065 -40911 11836 85003 100090 62738 -46379
14405d6379j72530j47486M4243J17054L50112r610j92116j0173K76781M3215K2021
$$ -46379 -218909 -366395 -322152 -205098 145014 135404 -56712 -66885 209896 253111 275132
14394B75132j02625j32865q30J7753M6724j45467j71218k8949J34140J45803k9559
$$ 275132 172507 39642 38812 56565 103289 -42178 -213396 -242345 -108205 37598 8039
14383H039j93034M8106j0940L0393O0049L5280N5103q3503k631K3940K505O7461
$$ 8039 -184995 -136889 -147829 -117436 -57387 -22107 32996 -50507 -53138 -29198 -26693 40768
14371D0768m4693N4494m2867k5961J51055J1962k5896r952q9600p3398r8622R109
$$ 40768 -3925 50569 7702 -18259 132796 144758 118862 108910 19310 -54088 -152710 -143601
14359a43601n2389L8721L230R9489L7833p4960r329L9106k7726k452J62242J84263
$$ -143601 -195990 -157269 -154039 -54550 -16717 -91677 -101006 -61900 -89626 -92078 70164 254427
14347B54427M3447o4301l0766J9942k22429k44982r4914P5091J39290N3018k7018
$$ 254427 297874 233573 202807 222749 320 -244662 -339576 -264485 -125195 -72177 -99195
14336i9195o5096K895J86883J09331L746j11671j10063j30325M43M3801N5117
$$ -99195 -164291 -161396 25487 134818 138564 26893 -83170 -213495 -213052 -169251 -114134
14325a14134N5448m225r8967K4196J10858n3031N180o2669O821J68225P834Q8201
$$ -114134 -58686 -62911 -161878 -137682 -26824 -79855 -74675 -137344 -130523 37702 45536 133737
14313A33737R2317j11490J133q082m1690j59969j03542J4939L7977K6685o9111
$$ 133737 226054 114564 115697 107615 65925 -94044 -197586 -182647 -144670 -117985 -187096
14302a87096J1384j28089J00880J60993N6580M747J4206L5800j43788p6805j3863
$$ -187096 -175712 -303801 -202921 -41928 14652 19399 33605 69405 -74383 -151188 -165051
14291a65051j27884P5380J64167R8276L7756q9568l9707k9306m7961J03022J16163
$$ -165051 -292935 -217555 -53388 44888 82644 -6924 -46631 -75937 -123898 -20876 95287
14280I5287n9269j44255K2377O5004K9768O8393l8851J5303K1489J02894m0127
$$ 95287 36018 -108237 -85860 -20856 8912 77305 38454 53757 75246 178140 138013
14269A38013p8611P4338L6118n000j5539j03475M7931K702k3829j12699O8479
$$ 138013 59402 133740 169858 164858 149319 45844 93775 96477 72648 -40051 28428
14258B8428R9308J00278k05149j07450N5852N8267J54874j06139p071j63926k1101
$$ 28428 127736 228014 22865 -84585 -28733 29534 184408 78269 71198 -92728 -113829
14247a13829J12865n6149P7882M398P5355j19020l7686O2938m728K5530Q5163
$$ -113829 -964 -57113 20769 25167 100522 -18498 -56184 6754 2026 27556 112719
14236A12719j15764o6517O9878K8765J1921q4809N2392q1638J45022J20204Q4008
$$ 112719 -3045 -69562 316 29081 41002 -43807 8585 -73053 71969 192173 276181
14225B76181j15061k31026j26832N2849L5657r5074l16005M8792K05639N0047
$$ 276181 161120 -69906 -196738 -143889 -108232 -203306 -519311 -470519 -264880 -214833
14215b14833K0905k6337N7800L06631P6513n2453k04636k84364j30968m8631J93545
$$ -214833 -193928 -220265 -162465 144166 220679 168226 -36410 -320774 -451742 -500373 -306828
14204c06828J66730J02808p8969K3886J02079l3023M7598r0251j30060L564j2643
$$ -306828 -140098 -37290 -116259 -92373 9706 -23317 24281 -65970 -196030 -192466 -205109
14193b05109J48568K60878P4995r5762j32399j45100j04691q0279l525q6294O1819
$$ -205109 -56541 204337 279332 183570 51171 -93929 -198620 -278899 -282424 -368718 -306899
14182c06899K11683J27271j47378j56555r289K8474J39923M6940j36799L58n9253
$$ -306899 -95216 32055 -115323 -271878 -281167 -252693 -112770 -65830 -202629 -202271 -261524
14171b61524j2085J57084J71486o892j28203k40921q4255J32361J02293K8851
$$ -261524 -273609 -116525 54961 48069 -80134 -321055 -405310 -272949 -170656 -141805
14161a41805j50493o2644J47442K11219J18976j56879k08221J12527K80328p8027
$$ -141805 -292298 -354942 -207500 3719 122695 -34184 -242405 -129878 150450 72423
14151G2423r35j55916l8272N4073N5444O1681j98657m5264J51903J9973K9004
$$ 72423 71488 -84428 -122700 -68627 -13183 48498 -150159 -195423 -43520 -23547 5457
14140E457o0062j14785P1241K3394R5554m1271o3091o8829j31008J7036J50938
$$ 5457 -54605 -169390 -98149 -74755 20799 -20472 -83563 -152392 -283400 -266364 -115426
14129a15426J07143j08016k43132p1891P2917K03240J03144J61698J10848O0963
$$ -115426 -8283 -116299 -359431 -431322 -358405 -155165 -52021 109677 220525 281488
14119B81488j05712j16032j12877J11780J01816r3810j13192P388p3243k502P9635
$$ 281488 175776 59744 -53133 58647 160463 66653 -46539 -39151 -112394 -114896 -35261
14108c5261Q6695l874K6559j8957o2624n4479J66785J25077M5098q6164j7085
$$ -35261 51434 47560 74119 55162 -7462 -61941 104844 229921 275019 188855 171770
14097A71770j54724j59614k39931R4561R0548k8047l2097Q9518K32630P5779n6995
$$ 171770 17046 -142568 -382499 -287938 -197390 -225437 -257534 -168016 64614 140393 83398
14086H3398n4056r76n0472j27775j04541m1303R8260J12507J00665l8281p8780
$$ 83398 29342 28366 -22106 -149881 -254422 -295725 -197465 -84958 15707 -22574 -101354
14075a01354k7712J25401L2586j27919J5281J98991k4573j23894j57401L2101
$$ -101354 -129066 -3665 28921 -98998 -83717 115274 90701 -33193 -190594 -158493
14065a58493L6362J15261J5215M2964N8274K3912k9945j99347K9982M6269Q2068
$$ -158493 -122131 -6870 8345 51309 109583 133495 103550 -95797 -65815 -19546 62522
14054F2522j25908p1645K5018L1767P7954K39984k2256j07435j41593j05215j07473
$$ 62522 -63386 -135031 -110013 -78246 -292 239692 217436 110001 -31592 -136807 -244280
14043b44280K03709K060m437R7068K597L2100j290N2953J15978J3895n2703p9483
$$ -244280 -40571 -38511 -42948 54120 56717 88817 87527 140480 256458 270353 217650 138167
14031A38167j69226J34883l67j68147p8774o8763K5612j4280k5032L6720K48122
$$ 138167 -31059 103824 103457 -64690 -143464 -212227 -186615 -200895 -225927 -189207 58915
14020E8915r8703p4994R304J53158N0503K56416k0323k3255j58356m9410L5323
$$ 58915 -39788 -114782 -105478 47680 98183 354599 334276 311021 152665 103255 138578
14009A38578j02942O0986j6837K6654j06782p4875k9484j31102l7808O3193N9191
$$ 138578 35636 96622 79785 106439 -343 -75218 -104702 -235804 -273612 -210419 -151228
13998a51228M3553q8640j30608J31557J11730N9177Q4310J9884j18881j06472
$$ -151228 -107675 -196315 -326923 -195366 -83636 -24459 59851 79735 -39146 -145618
13988a45618n3691J30120J80736m8838j04440k03222M1140M2836O5046J031r6913
$$ -145618 -199309 -69189 111547 62709 -41731 -244953 -203813 -160977 -95931 -94900 -191813
13977a91813J95870J30707J28281r2631k7522m737K0860R1459M1470k20836k72933
$$ -191813 4057 134764 263045 170414 142892 138155 159015 250474 291944 71108 -201825
13966b01825m3710J24526J40670K3689J16421k577o612Q3837o000Q648m2000p5513
$$ -201825 -245535 -121009 19661 43350 159771 157194 150582 234419 228419 237067 195067 119554
13954A19554o9340M0179K64557j5383j10403q9514m6037P0961K1330O060O4056
$$ 119554 50214 90393 354950 339567 229164 139650 93613 164574 185904 191964 256020
13943B56020Q0047O3188j13838k10515o2464m68j04678M3074M5792l9722n8338
$$ 256020 336067 399255 285417 74902 12438 11970 -92708 -49634 -3842 -43564 -101902
13932a01902P8366N7129l2230k5040m0330J618j51072k4780N2468L2493L528K39444
$$ -101902 -23536 33593 1363 -23677 -64007 -62389 -213461 -238241 -185773 -153280 -149752 89692
13920H9692K22591J61159p5288n5959m5228l681p0640j11247q5465q7335j3916
$$ 89692 312283 473442 398154 342195 296967 293286 222646 111399 25934 -61401 -75317
13909g5317r4034j48595Q4904K37068O4539n9339j01917J2177n1817k3379J47044
$$ -75317 -169351 -317946 -233042 4026 68565 9226 -92691 -80514 -132331 -155710 -8666
13898h666k9165N188J14354J17714J47224k3469Q5852j69109j04538p8111l6303
$$ -8666 -37831 -32643 81711 199425 346649 323180 409032 239923 135385 57274 20971
13887B0971m8400P2143k1145q0183m4487J35947j6384o1331j42840j58511J39153
$$ 20971 -27429 44714 23569 -56614 -101101 34846 18462 -42869 -185709 -344220 -205067
13876b05067J12794j0958N5224P5663J21923n6604q9277m3397l9683J390K3367
$$ -205067 -92273 -103231 -48007 27656 149579 92975 3698 -39699 -79382 -77992 -54625
13865e4625l1549o4293m621Q0951l0623l1069o130L5721j10369p0555o872Q6499
$$ -54625 -86174 -150467 -155088 -74137 -104760 -135829 -141959 -106238 -216607 -287162 -294034 -207535
13853b07535J80871l1902Q05j43921K2385K12797J39989k3669k7120n6219k67690
$$ -207535 -26664 -58566 -57761 -201682 -179297 33500 173489 149820 122700 66481 -201209
13842b01209j36966O8793J69620M1970L4017m454J05770j54769j88472P5738J6307
$$ -201209 -338175 -269382 -99762 -57792 -23775 -28229 77541 -77228 -265700 -189962 -173655
13831a73655j00677J15976J48151r796R1075P1522M1921O7734J2193l25372j50047
$$ -173655 -274332 -158356 -10205 -20001 71074 142596 184517 252251 264444 -60928 -210975
13820b10975R8629P8266N2020k5812Q3898m2792k36311o019J37189j9304J02243
$$ -210975 -112346 -34080 17940 -7872 76026 33234 -203077 -209096 -71907 -91211 11032
13809A1032K85616J69727j69917r4271Q4131l2242j15199j62256O4926J2429k067
$$ 11032 296648 466375 296458 202187 286318 254076 138877 -23379 41547 53976 51909
13798E1909O3822j14841j25617L312K5783j21498L193J5169j61466n5902J06125
$$ 51909 115731 890 -124727 -121415 -95632 -217130 -213937 -198768 -360234 -416136 -310011
13787c10011J24802Q485J9535J38547L2164R6679J53954J97933j13935k72203
$$ -310011 -185209 -176724 -157189 -18642 13522 110201 264155 462088 348153 75950
13777G5950j08987N8130K02668k8008o8593j47472l2023O2666j57947K4314J69650
$$ 75950 -33037 25093 227761 199753 131160 -16312 -48335 14331 -143616 -119302 50348
13766E0348L1432k62361j39702M2275J65169J84024n2887n5737L5754O7513j07901
$$ 50348 81780 -180581 -320283 -278008 -112839 71185 18298 -37439 -1685 65828 -42073
13755d2073j88397L8967J14752J27677l2991j25024m6649l2904J22360K75665
$$ -42073 -230470 -191503 -76751 50926 17935 -107089 -153738 -186642 -64282 211383
13745B11383Q9971n8120q0830j21809L88J57337J55587J37913J17928n8166j39016
$$ 211383 301354 243234 162404 40595 40983 198320 353907 491820 609748 551582 412566
13734D12566k06268J34202J52210M2859N556j98937l71386j60375J44095J2486
$$ 412566 206298 340500 492710 535569 541125 342188 -29198 -189573 -45478 -32992
13724c2992o3615n9419N0528L8274K3227m265j8177J43589j7290j08185o509j13650
$$ -32992 -96607 -156026 -105498 -67224 -43997 -48262 -66439 77150 59860 -48325 -54834 -168484
13712a68484j4355Q9064j9048p8576p5291N2605J04765k5175j4507J4683n1977
$$ -168484 -182839 -93775 -112823 -191399 -266690 -214085 -109320 -134495 -149002 -134319 -186296
13701a86296j9246J38R7294J52655j23710O1911J23212l0000P1511K15330k11672
$$ -186296 -205542 -205404 -108110 44545 -79165 -17254 105958 75958 147469 362799 151127
13690A51127k04846o1504m3163m6967P8544J86250k9324j5634n5338n8749n0555
$$ 151127 -53719 -115223 -158386 -205353 -126809 59441 30117 14483 -40855 -99604 -150159
13679a50159L8775K4676J42855k9087l4575J19195Q1272M7176O464r4708j15022
$$ -150159 -111384 -86708 56147 27060 -7515 111680 192952 240128 246592 151884 36862
13668C6862K579K4056j03728O1677j07744n3815L09410L2169j28021k6179j5967
$$ 36862 39441 63497 -40231 21446 -86298 -140113 169297 201466 73445 47266 31299
13657C1299j35787l4118K2555J81297o8036j56942q7811J02371k9881j5809N5488
$$ 31299 -104488 -138606 -116051 65246 -2790 -159732 -247543 -145172 -175053 -190862 -135374
13646a35374J42518j6526Q5267O3687j20492q4787j0238l0622j1952J8062j23467
$$ -135374 7144 -9382 75885 139572 19080 -65707 -75945 -106567 -118519 -100457 -223924
13635b23924Q0546J623N5117j8290j9559N3231R0048J92897L5437j19187j81995
$$ -223924 -143378 -141755 -86638 -104928 -124487 -71256 18792 211689 247126 127939 -54056
13624e4056m3602J24688P8372J2964k1003j35222j05890J132J24405Q3411Q6496
$$ -54056 -97658 27030 105402 118366 97363 -37859 -143749 -142617 -18212 65199 151695
13613A51695J07513K0557m3703j979r9753m7033N4034m513R2850K9090r8465k50556
$$ 151695 259208 279765 236062 234083 134330 87297 141331 136818 229668 258758 160293 -90263
13601i0263Q4031J21316J20482j17745j98379p0200j7479J33974N3538J43737
$$ -90263 -6232 115084 235566 117821 -80558 -150758 -168237 -34263 19275 163012
13591A63012p4232j08932p8132j40062j12510J92882q0578J2501K1964J44149
$$ 163012 88780 -20152 -98284 -238346 -350856 -157974 -238552 -226051 -204087 -59938
13581e9938L8826N2664j67697J2815P0116J23819O5511j12172j48627m4898Q2278
$$ -59938 -21112 31552 -136145 -123330 -53214 70605 136116 23944 -124683 -169581 -87303
13570h7303j07196O6091Q8738p2373O9654J88150q001j44363m5783j62991o0194
$$ -87303 -194499 -128408 -39670 -112043 -42389 145761 137760 -6603 -52386 -215377 -275571
13559b75571k7755m1652K5107J64120L82225l633j31148k3223q3159o1249j27186
$$ -275571 -303326 -344978 -319871 -155751 226474 222841 91693 68470 -14689 -75938 -203124
13548b03124N1970q7192M643o4561q968L4126K11457J19408J29716p8406j5743
$$ -203124 -151154 -238346 -233703 -298264 -307232 -273106 -61649 57759 187475 109069 93326
13537I3326K6718J58125M8807m6900o8666L8485K5524r6315p0183p3375l1586
$$ 93326 120044 278169 326976 280076 211410 249895 275419 179104 108921 35546 3960
13526C960O2838l9149q1447J34077L8628j06605j45974Q2774M9227J375r1567
$$ 3960 66798 27649 -53798 80279 118907 12302 -133672 -50898 -1671 -296 -91863
13515i1863P6687K7636j2676q7495j72242l8946O7780J88400J10802n094k1987
$$ -91863 -15176 12460 -216 -87711 -259953 -298899 -231119 -42719 68083 62989 41002
13504D1002R1369J5182R6905r4737j58697M3788q529M6694Q753p2816K1199m9797
$$ 41002 132371 147553 244458 149721 -8976 34812 26283 72977 81730 8914 30113 -19684
13492a9684k3425r882Q5929q2062r7162J65904J50861N6766J9638j3499j19758
$$ -19684 -43109 -52991 32938 -49124 -146286 19618 170479 227245 246883 233384 113626
13481A13626j78578j8273j1727J13962K6726k9231N8260J49375n0358j06364J549
$$ 113626 -64952 -83225 -94952 19010 45736 16505 74765 224140 173782 67418 68967
13470F8967p9634J31421j32777j28073P2543J1764r3339N8446N4650j49451m0219
$$ 68967 -10667 120754 -12023 -140096 -67553 -55789 -149128 -90682 -36032 -185483 -225702
13459b25702M3088k0532j02460L2226k2634O4460J52978O8261O4701j04019L4001
$$ -225702 -182614 -203146 -305606 -273380 -296014 -231554 -78576 -10315 54386 -49633 -15632
13448a5632R1873o118p9082L9795j60179L0084N9093j20099r5754K29258k5755
$$ -15632 76241 70123 -8959 30836 -129343 -99259 -40166 -160265 -256019 -26761 -52516
13437e2516j95017l3137J7560r7068J15687M1675k02597j48678J37236J80369
$$ -52516 -247533 -280670 -263110 -360178 -244491 -202816 -405413 -554091 -416855 -236486
13427b36486M5039O1632R8645R0821J89516p8067j33879r1208J1247L0106J34778
$$ -236486 -191447 -129815 -31170 59651 249167 171100 37221 -53987 -42740 -12634 122144
13416A22144J67147j00008j81104k1037K4929J16090L646k15415l3031M7560J19720
$$ 122144 289291 189283 8179 -12858 12071 128161 131807 -83608 -116639 -69079 50641
13405E0641j50072l8590R0857J60156J00520j06049k13825l1568R6474r3044J02154
$$ 50641 -99431 -138021 -47164 112992 213512 107463 -106362 -137930 -41456 -134500 -32346
13394c2346J6267O7843R6783L0855j00482j94698j8723R0647O4778j32939j13299
$$ -32346 -16079 51764 148547 179402 78920 -115778 -134501 -43854 20924 -112015 -225314
13383b25314J17553L892j19724J06120P4041J81825q4519p0524n0586K9888N2933
$$ -225314 -107761 -103869 -223593 -117473 -43432 138393 53874 -16650 -67236 -37348 15585
13372A5585M4945L7460j33976j16129J24021J33199m6859k16095j34234N6193
$$ 15585 60530 97990 -35986 -152115 -28094 105105 58246 -157849 -292083 -235890
13362b35890J08960J98676J37926p5439j18719k7558j12307K0071j01377j06907
$$ -235890 -126930 71746 209672 134233 15514 -12044 -124351 -104280 -205657 -312564
13352c12564P7322K39767P1257l8403J21849k208p7254l4757K5109j28713j68346
$$ -312564 -235242 4525 75782 37379 159228 157020 79766 45009 70118 -58595 -226941
13341b26941q9047l6743L0572P6681R9003P3109M2698r0820J70686J03804p8827
$$ -226941 -315988 -352731 -322159 -245478 -146475 -73366 -30668 -121488 49198 153002 74175
13330G4175k78826j43278J44953J49164l5232N4795J14054J8283j51430m629K32846
$$ 74175 -204651 -347929 -202976 -53812 -89044 -34249 79805 98088 -53342 -57971 174875
13319A74875J10698j84526k7079k6069j8067q8088n6007L6515q546M8220J78392
$$ 174875 285573 101047 73968 47899 29832 -58256 -114263 -77748 -86294 -38074 140318
13308A40318Q8165l3435r5527j11504L8784J8312j04257j33897n3896k4669o654
$$ 140318 228483 195048 99521 -11983 26801 45113 -59144 -193041 -246937 -271606 -278260
13297b78260J40835o4105K0098J32390j21472l7879J12898K28479N2668K6060
$$ -278260 -137425 -201530 -181432 -49042 -170514 -208393 -95495 132984 185652 211712
13287B11712j32782J5254m5652q4900O375m6110j3445P9365L5228M2633l6551
$$ 211712 78930 94184 48532 -36368 -29993 -76103 -89548 -10183 25045 67678 31127
13276C1127J00550L8496K8898o4154P2221L3593K6695M1560r4785j824j5204q3119
$$ 31127 131677 170173 199071 134917 207138 240731 267426 308986 214201 212377 197173 114054
13264A14054o3647k8748k3645m9778J79786K4423J6119o8477j00395R5491O2338
$$ 114054 50407 21659 -1986 -51764 128022 152445 168564 100087 -308 95183 157521
13253A57521M7781j60221k39354j38847K7922R8734m7862J1288n7108N9777J40256
$$ 157521 205302 45081 -194273 -333120 -305198 -206464 -254326 -243038 -300146 -240369 -100113
13242a00113O7385j12088p8138L6166J8008q9544J3689M9249L2479o6764L4309
$$ -100113 -32728 -144816 -222954 -186788 -168780 -258324 -244635 -195386 -162907 -229671 -195362
13231a95362M8307p476P9890p3637J07974P7234n7068m6095j12637j8741J11289
$$ -195362 -147055 -154531 -74641 -148278 -40304 36930 -20138 -66233 -178870 -197611 -86322
13220h6322j527q3788l1624l1792J27140M3440K1002r5585N2712o4828N8126J39842
$$ -86322 -87849 -171637 -203261 -235053 -107913 -64473 -43471 -139056 -86344 -151172 -93046 46796
13208D6796Q9895r8888L890k9280J6062J4642r945K0418Q3489O6169J16160K290
$$ 46796 136691 37803 41693 12413 28475 43117 33172 53590 137079 203248 319408 321698
13196C21698m4143q2732k10140k14311j00664R6857J32553K7827j28152R7223
$$ 321698 277555 194823 -15317 -229628 -330292 -233435 -100882 -73055 -201207 -103984
13186a03984M1976O6680J40792m5292k0068p069P9977j92855k34942O5680Q2254
$$ -103984 -62008 4672 145464 100172 80104 73035 153012 -39843 -274785 -209105 -126851
13175a26851R7519M9171q1019K799P9873J79200L7718k16975j18780L8485Q0868
$$ -126851 -29332 19839 -61180 -58381 21492 200692 238410 21435 -97345 -58860 22008
13164B2008J16770J01842k0684q0715j24998k9682K20470J35980J73394k89850
$$ 22008 138778 240620 219936 139221 14223 -15459 205011 340991 514385 224535
13154B24535k09393j54576p0011Q4241P9326J6167q6901L2839l2363r2808K4285
$$ 224535 15142 -139434 -209445 -125204 -45878 -29711 -116612 -83773 -116136 -208944 -184659
13143a84659J50188J2867N9160n9163m4674n3754K4231J62032q5642k043Q0279
$$ -184659 -34471 -21604 37556 -21607 -66281 -120035 -95804 66228 -19414 -21457 58822
$$ [...]
##END NTUPLES=NMR SPECTRUM
##END=
