##TITLE=Analysis number 312264
Compound Code cc 17413
Project Code adrs
Chemist Name endeavour
##JCAMPDX= 6.0         $$ Bruker NMR JCAMP-DX V2.0
##DATA TYPE= NMR SPECTRUM
##DATA CLASS= NTUPLES
##ORIGIN= Bruker BioSpin GmbH
##OWNER= NMR
$$ XWIN-NMR		Version 3.5
$$ Mon Aug  1 10:22:25 2005 GMT Daylight Time (UT+1h)  MAYBRIDGE\NMR@NMR_250MHZ
##.OBSERVE FREQUENCY= 250.131544655141
##.OBSERVE NUCLEUS= ^1H
##.ACQUISITION MODE= SIMULTANEOUS (DQD)
##.ACQUISITION SCHEME= undefined
##.AVERAGES= 16
##.DIGITISER RES= 18
##SPECTROMETER/DATA SYSTEM= dpx250
##.PULSE SEQUENCE= zg30
##.SOLVENT NAME= CDCl3
##.SHIFT REFERENCE= (INTERNAL, CDCl3, 0, 16.4503)
##AUDIT TRAIL= $$ (NUMBER, WHEN, WHO, WHERE, WHAT)
$$ ##TITLE= Audit trail, XWIN-NMR		Version 3.5
$$ ##JCAMPDX= 5.01
$$ ##ORIGIN= Bruker BioSpin GmbH
$$ ##OWNER= NMR
$$ C:\u/data/dgb/nmr/ADRS/6900/pdata/1/auditp.txt
$$ ##AUDIT TRAIL=  $$ (NUMBER, WHEN, WHO, WHERE, WHAT)
(   1,<2005-08-01 10:22:06.95 +100>,<MAYBRIDGE\NMR>,<NMR_250MHZ>,
      <created by zg, POWCHK disabled, PULCHK disabled
       configuration hash MD5:
       62 19 C7 07 E1 42 D1 B7 37 6C 3D D0 77 39 F9 E6
       data hash MD5: 64K
       34 84 F5 8C 7F 0F AD 29 8E 53 C4 6C 16 A5 77 03>)
(   2,<2005-08-01 10:22:18.14 +100>,<MAYBRIDGE\NMR>,<NMR_250MHZ>,
      <Start of raw data processing
       ef LB = 0.3 FT_mod = 6 PKNL = 1 SI = 32K 
       data hash MD5: 32K
       1A CE 9B 23 8C D4 C0 82 7A 69 E8 2B 4D F2 9B EE>)
(   3,<2005-08-01 10:22:19.93 +100>,<MAYBRIDGE\NMR>,<NMR_250MHZ>,
      <apk 
       data hash MD5: 32K
       DB 15 DD AB 34 FF D7 2B 09 43 DD 74 F3 A1 B1 4F>)
(   4,<2005-08-01 10:22:20.59 +100>,<MAYBRIDGE\NMR>,<NMR_250MHZ>,
      <abs ABSG = 5 
       data hash MD5: 32K
       26 55 6A EE E8 5C 8A E3 E8 F3 F0 F7 59 87 8A 22>)
$$ ##END=
$$ 
$$ hash MD5
$$ 7B EA DC A2 1B 84 D1 9A E9 3C 3A 92 AF E3 FB 88
##$RELAX= 
##$RELAX= 
##$RELAX= 
##$RELAX= 
##$RELAX= 
##$RELAX= 
##$RELAX= 
$$ Bruker specific parameters
$$ --------------------------
##$DU= <C:\u>
##$EXPNO= 6900
##$NAME= <ADRS>
##$PROCNO= 1
##$TYPE= <nmr>
##$USER= <dgb>
##$AMP= (0..31)
100 100 100 100 100 100 100 100 100 100 100 100 100 100 100 100 100 100 
100 100 100 100 100 100 100 100 100 100 100 100 100 100 
##$AQSEQ= 0
##$AQ_mod= 3
##$AUNM= <au_zg>
##$AUTOPOS= <8 >
##$BF1= 250.13
##$BF2= 250.13
##$BF3= 250.13
##$BF4= 250.13
##$BF5= 500.13
##$BF6= 500.13
##$BF7= 500.13
##$BF8= 500.13
##$BYTORDA= 1
##$CFDGTYP= 0
##$CFRGTYP= 5
##$CHEMSTR= <none>
##$CNST= (0..31)
1 1 145 1 1 1 1 1 1 1 1 1 1 1 1 1 1 1 1 1 1 1 1 1 1 1 1 1 1 1 1 1 
##$CPDPRG= <>
##$CPDPRG1= <>
##$CPDPRG2= <>
##$CPDPRG3= <>
##$CPDPRG4= <mlev>
##$CPDPRG5= <mlev>
##$CPDPRG6= <mlev>
##$CPDPRG7= <mlev>
##$CPDPRG8= <mlev>
##$CPDPRGB= <>
##$CPDPRGT= <>
##$D= (0..31)
0 1 0 0 0 0 0 0 0 0.06 0 0 0 0 0 0 0.0002 0 0 0 0 0 0 0 0 0 0 0 0 0 0 
0 
##$DATE= 1122888126
##$DBL= (0..7)
120 120 120 120 120 120 120 120 
##$DBP= (0..7)
150 150 150 150 150 150 150 150 
##$DBP07= 0
##$DBPNAM0= <>
##$DBPNAM1= <>
##$DBPNAM2= <>
$$ [...]
##$SUBNAM7= <"">
##$SUBNAM8= <"">
##$SUBNAM9= <"">
##$SW= 20.6930455092707
##$SWIBOX= (0..15)
0 0 3 0 0 0 0 0 0 0 0 0 0 0 0 0 
##$SW_h= 5175.983436853
##$TD= 65536
##$TD0= 1
##$TE= 295.16
##$TE2= 300
##$TE3= 300
##$TEG= 300
##$TL= (0..7)
0 120 120 120 120 120 120 120 
##$TP= (0..7)
150 150 150 150 150 150 150 150 
##$TP07= 0
##$TPNAME0= <>
##$TPNAME1= <>
##$TPNAME2= <>
##$TPNAME3= <>
##$TPNAME4= <>
##$TPNAME5= <>
##$TPNAME6= <>
##$TPNAME7= <>
##$TPOAL= (0..7)
0.5 0.5 0.5 0.5 0.5 0.5 0.5 0.5 
##$TPOFFS= (0..7)
0 0 0 0 0 0 0 0 
##$TUNHIN= 0
##$TUNHOUT= 0
##$TUNXOUT= 0
##$USERA1= <user>
##$USERA2= <user>
##$USERA3= <user>
##$USERA4= <user>
##$USERA5= <user>
##$V9= 5
##$VALIST= <valist>
##$VCLIST= <CCCCCCCCCCCCCCC>
##$VD= 0
##$VDLIST= <DDDDDDDDDDDDDDD>
##$VPLIST= <PPPPPPPPPPPPPPP>
##$VTLIST= <TTTTTTTTTTTTTTT>
##$WBST= 1024
##$WBSW= 4
##$XGAIN= (0..3)
0 0 0 0 
##$XL= 0
##$YL= 0
##$YMAX_a= 492369
##$YMIN_a= -537697
##$ZGOPTNS= <>
##$ZL1= 120
##$ZL2= 120
##$ZL3= 120
##$ZL4= 120
##$ABSF1= 16.45027
##$ABSF2= -4.242903
##$ABSG= 5
##$ABSL= 3
##$ALPHA= 0
##$AQORDER= 0
##$ASSFAC= 0
##$ASSFACI= 0
##$ASSFACX= 0
##$ASSWID= 0
##$AUNMP= <proc_1d>
##$AZFE= 0.1
##$AZFW= 0.1
##$BCFW= 0
##$BC_mod= 0
##$BYTORDP= 0
##$COROFFS= 0
##$CY= 12.5
##$DATMOD= 1
##$DC= 0
##$DFILT= <>
##$DTYPP= 0
##$F1P= 14.0000005364418
##$F2P= -0.99999901652339
##$FCOR= 0.5
##$FTSIZE= 32768
##$FT_mod= 6
##$GAMMA= 0
##$GB= 0
##$INTBC= 1
##$INTSCL= 1
##$ISEN= 128
##$LB= 0.3
##$LEV0= 0
##$LPBIN= 0
##$MAXI= 10000
##$MC2= 0
##$MEAN= 0
##$ME_mod= 0
##$MI= 0
##$NCOEF= 0
##$NC_proc= -4
##$NLEV= 6
##$NOISF1= 0
##$NOISF2= 0
##$NSP= 0
##$NTH_PI= 0
##$NZP= 0
##$OFFSET= 16.45027
##$PC= 1
##$PHC0= -76.43688
##$PHC1= 5.294049
##$PH_mod= 1
##$PKNL= yes
##$PPARMOD= 0
##$PSCAL= 4
##$PSIGN= 0
##$REVERSE= no
##$SF= 250.130017940977
##$SI= 32768
##$SIGF1= 0
##$SIGF2= 0
##$SINO= 400
##$SIOLD= 32768
##$SREGLST= <1H.CDCl3>
##$SSB= 0
##$STSI= 32768
##$STSR= 0
##$SW_p= 5175.98343685301
##$SYMM= 0
##$S_DEV= 0
##$TDeff= 65536
##$TDoff= 0
##$TI= <Analysis number 999999
Compound Code 99
Book Reference 9
Project Code 9>
##$TILT= no
##$TM1= 0
##$TM2= 0
##$TOPLEV= 0
##$USERP1= <user>
##$USERP2= <user>
##$USERP3= <user>
##$USERP4= <user>
##$USERP5= <user>
##$WDW= 1
##$XDIM= 32768
##$YMAX_p= 293429428
##$YMIN_p= -105623
$$ End of Bruker specific parameters
$$ ---------------------------------
##NTUPLES= NMR SPECTRUM
##VAR_NAME=  FREQUENCY,     SPECTRUM/REAL,   SPECTRUM/IMAG
##SYMBOL=    X,             R,               I
##VAR_TYPE=  INDEPENDENT,   DEPENDENT,       DEPENDENT
##VAR_FORM=  AFFN,          ASDF,            ASDF
##VAR_DIM=   32768,         32768,           32768
##UNITS=     HZ,            ARBITRARY UNITS, ARBITRARY UNITS
##FACTOR=    0.157963299565203, 1,           1
##FIRST=     4114.70625496896, 0,            0
##LAST=      -1061.27718188405, 0,           0
##MIN=       -1061.27718188405, -105623,     0
##MAX=       4114.70625496896, 293429428,    0
$$ Real data points
##PAGE= N=1
##DATA TABLE= (X++(R..R)), XYDATA
$$ [...]
$$ plain form
18326 220212 223322 217500 196568 194804 202357 161887 116251 107904 111394 107645 96762 106918 107490
18313 107490 111819 114743 95147 104633 108829 94759 93284 103752 98632 90583 114892 114858 107952 82629
18299 82629 66515 63534 95240 114065 106519 120857 123085 111691 126634 157395 147983 135577
18287 135577 118677 88356 70615 144961 188301 186518 198699 206179 200541 173944 180912 206166
18275 206166 216869 199048 159389 137738 122240 90011 66748 82874 75398 63100 57195 74388
18263 74388 111453 143413 148538 143772 117150 137173 152154 144284 144038 132004 133077 132631 100108
18250 100108 114484 156118 191109 173883 150765 144696 147893 148743 169526 159261 151363 158567 166271
18237 166271 183872 204357 198897 198247 212564 247535 267913 272365 254027 239517 232555 253179
$$ packed form
18326B20212L110n822k0932j764P553m0470m5636q347L490l749j0883J0156N72
18313A07490M329K924j9596R486M196j4070j475J0468n120q049K4309l4o906k5323
18299H2629j6114k981L1706J8825p546J4338K228j1394J4943L0761r412j2406
18287A35577j6900l0321j7741P4346M3340j783J2181P480n638k6597O968K5254
18275B06166J0703j7821l9659k1651j5498l2229k3263J6126p476j2298n905J7193
18263G4388L7065L1960N125m766k6622K0023J4981p870k46j2034J073m46l2523
18250A00108J4376M1634L4991j7226k3118o069L197Q50K0783j0265p898P204P704
18237A66271J7601K0485n460o50J4317L4971K0378M452j8338j4510o962K0624
$$ plain form
18225 253179 275100 247179 199568 193509 183963 189588 197661 195773 178575 180715 154697 151782 159014
18212 159014 163432 165490 179831 192575 238278 298006 312609 302309 304400 327796 348506 348297
18200 348297 343699 364543 371215 342261 326393 337945 325312 321980 337788 349167 346385 331165
18188 331165 334175 347149 361006 355519 350707 361669 380339 403154 407754 445645 500799 496229
18176 496229 503698 523537 543264 549645 556936 545974 561277 577265 621075 643680 657060 679805
18164 679805 695974 738116 758834 760975 765866 791376 797405 811395 839818 923723 1050193 1134289
18152 1134289 1225884 1361435 1477288 1558480 1574345 1585946 1620408 1602796 1558626 1516510 1490158
18141 1490158 1459624 1438455 1415457 1411987 1414499 1440994 1471568 1477393 1494341 1544290 1574764 1618436
$$ packed form
18225B53179K1921k7921m7611o059r546N625Q073j888j7198K140k6018k915P232
18212A59014M418K058J4341J2744M5703N9728J4603j0300K091K3396K0710k09
18200C48297m598K0844O672k8954j5868J1552j2633l332J5808J1379k782j5220
18188C31165L010J2974J3857n487m812J0962J8670K2815M600L7891N5154m570
18176D96229P469J9839J9727O381P291j0962J5303J5988M3810K2605J3380K2745
18164F79805J6169M2142K0718K141M891K5510O029J3990K8423Q3905J26470Q4096
18152A134289R1595J35551J15853Q1192J5865J1601L4462j7612m4170m2116k6352
18141A490158l0534k1169k2998l470K512K6495L0574N825J6948M9949L0474M3672
$$ plain form
18129 1618436 1711600 1797999 1932709 2093637 2231189 2402898 2611371 2796029 2990357 3268239
18119 3268239 3619486 4049723 4619561 5337704 6233890 7532407 9430737 12465980 17799958
18110 17799958 27433865 41182810 49080859 46942103 42446536 36543690 30150032 25212589
18102 25212589 21530534 18906316 17184035 16286177 16134439 16425107 16632846 16653273 16648163
18093 16648163 16589138 16469402 16431147 16621609 17205373 18362725 20451788 23943048 29492338
18084 29492338 37578330 47483843 57638942 68598378 81457229 93329034 99716797
18077 99716797 101752592 101673595 98829332 92311766 83557158 74564720 66217699 59117518
18069 59117518 53459524 49135636 46150053 44442595 43118205 41075532 38445278 35586728
$$ packed form
18129A618436R3164Q6399J34710J60928J37552J71709K08473J84658J94328K77882
18119C268239L51247M30237N69838P18143Q96186J298517J898330L035243N333978
18110A7799958R633907J3748945P898049k138756m495567n902846o393658m937443
18102B5212589l682055k624218j722281q97858j51738K90668K07739K0427n110
18093A6648163n9025j19736l8255J90462N83764J157352K089063L491260N549290
18084B9492338Q085992R905513J0155099J0959436J2858851J1871805O387763
18077I9716797K035795p8997k844263o517566q754608q992438q347021p100181
18069E9117518n657994m323888k985583j707458j324390k042673k630254k858550
$$ plain form
18061 35586728 32338159 28752391 25134636 21788822 18887517 16513875 14694942 13404412
18053 13404412 12554080 12048152 11836460 11856599 12027837 12360464 12831462 13565415 14669248
18044 14669248 16311376 18658742 21822654 25509164 29364745 33560896 38053965 41886508
18036 41886508 44209446 45618344 46844189 48128711 49909365 52842901 57452746 64819685
18028 64819685 75626256 87942277 98820079 109231996 120437980 128358606 128238175
18021 128238175 122479434 114416301 103490823 89864510 75531425 62075086 50160099
18014 50160099 40445042 32972532 27431594 23571162 21024925 19335793 18299150 17861226
18006 17861226 17756578 17375561 16525450 15480229 14349548 13001203 11531777 10076336
$$ packed form
18061C5586728l248569l585768l617755l345814k901305k373642j818933j290530
18053A3404412q50332n05928k11692K0139J71238L32627M70998P33953J103833
18044A4669248J642128K347366L163912L686510L855581M196151M493069L832543
18036D1886508K322938J408898J225845J284522J780654K933536M609845P366939
18028F4819685J0806571J2316021J0877802J0411917J1205984P920626j20431
18021A28238175n758741q063133j0925478j3626313j4333085j3456339j1914987
18014E0160099r715057p472510n540938l860432k546237j689132j036643m37924
18006A7861226j04648l81017q50111j045221j130681j348345j469426j455441
$$ plain form
17998 10076336 8724461 7577444 6596162 5734935 4997060 4395753 3915025 3462495 3065456
17989 3065456 2748078 2486978 2253901 2031712 1844234 1733057 1660249 1569999 1471806 1397549
17979 1397549 1294786 1230414 1169680 1115514 1102608 1077133 1052830 1018308 967037 929785 902378
17968 902378 888000 861876 848904 853724 829967 786524 727916 693390 658756 652276 629390 634901
17956 634901 633987 626660 636923 638294 636284 647383 658179 648653 636840 628582 639455 631073 600117
17943 600117 567288 540082 506301 485593 476290 454286 463044 483699 492760 496100 491810 494116 507195
17930 507195 505839 492762 474441 452659 457164 484407 510260 506195 519058 528989 510139 489111
17918 489111 497083 492205 493445 493039 509732 509165 499007 484373 484125 492961 473342 453715 440682
$$ packed form
17998A0076336j351875j147017r81282q61227p37875o01307m80728m52530l97039
17989C065456l17378k61100k33077k22189j87478j11177p2808r0250r8193p4257
17979A397549j02763o4372o0734n4166j2906k5475k4303l4522n1271l7252k7407
17968I02378j4378k6124j2972M820k3757m3443n8608l4526l4634o480k2886N511
17956F34901r14p327J0263J371k010J1099J0796r526j1813q258J0873q382l0956
17943F00117l2829k7206l3781k0708r303k2004Q758K0655R061L340m290K306J3079
17930E07195j356j3077j8321k1782M505K7243K5853m065J2863R931j8850k1028
17918D89111P972m878J240m06J6693n67j0158j4634k48Q836j9619j9627j3033
$$ plain form
17905 440682 435937 479532 501795 516713 517400 521193 525612 511728 515556 541862 559579 564695 526893
17892 526893 498274 507727 512570 515770 509747 475908 454404 450497 463489 457125 432019 432611 435994
17879 435994 433056 452571 447603 427182 456581 468954 461567 423679 402107 394588 352924 303399
17867 303399 290624 285036 291799 308368 298681 303639 324049 331397 331007 321032 325600 321837 294968
17854 294968 286626 312781 346723 331291 335076 342743 327158 307858 307603 289059 273016 256502
17842 256502 261495 270537 281703 283282 267434 277212 266437 245823 266857 259443 248778 267285
17830 267285 305090 292960 277220 245543 230479 217748 220408 237144 243891 243525 235975 243568 245560
17817 245560 263398 248284 246983 252873 252706 272715 261877 246168 273379 282709 300789 306437 303170
$$ packed form
17905D40682m745M3595K2263J4918O87L793M419j3884L828K6306J7717N116l7802
17892E26893k8619R453M843L200o023l3839k1504l907J2992o364k5106N92L383
17879D35994k938J9515m968k0421K9399J2373p387l7888k1572p519m1664m9525
17867C03399j2775n588O763J6569r687M958K0410P348l90r975M568l763k6869
17854B94968q342K6155L3942j5432L785P667j5585j9300k55j8544j6043j6514
17842B56502M993R042J1166J579j5848R778j0775k0614K1034p414j0665J8507
17830B67285L7805j2130j5740l1677j5064j2731K660J6736O747l66p550P593J992
17817B45560J7838j5114j301N890j67K0009j0838j5709K7211R330J8080N648l267
$$ plain form
17804 303170 301633 297289 292809 270766 237568 249889 243152 241401 232199 247469 235230 188169 168022
17791 168022 183737 227868 241797 238031 214835 222398 197465 180093 170494 174484 185985 181356
17779 181356 180397 171445 167286 195027 206871 200375 209472 242728 253868 241110 206451 191485 182083
17766 182083 158098 180773 217608 217885 194772 179775 169170 160818 166962 173562 171416 149747 144135
17753 144135 175365 241651 230630 227365 207762 187683 195653 178153 156107 138081 76427 61515
17741 61515 78900 119260 140836 122993 133769 134670 132326 135312 144132 139695 120303 138512 173436
17728 173436 200073 217736 225782 243051 197640 181616 201354 209715 203659 173350 136547 147822
17716 147822 150133 169861 178318 150879 172147 186512 193100 187211 203135 263498 323500 332271
$$ packed form
17804C03170j537m344m480k2043l3198J2321o737j751r202J5270j2239m7061k0147
17791A68022J5715M4131J3929l766k3196P563k4933j7372r599L990J1501m629
17779A81356r59q952m159K7741J1844o496R097L3256J1140j2758l4659j4966r402
17766A82083k3985K2675L6835K77k3113j4997j0605q352O144O600k146k1669n612
17753A44135L1230O6286j1021l265j9603k0079P970j7500k2046j8026o1654j4912
17741F1515J7385M0360K1576j7843J0776R01k344K986Q820m437j9392J8209L4924
17728A73436K6637J7663Q046J7269m5411j6024J9738Q361o056l0309l6803J1275
17716A47822K311J9728Q457k7439K1268J4365O588n889J5924O0363O0002Q771
$$ plain form
17704 332271 343648 338822 336683 350954 351830 352447 324185 298546 284967 298706 302795 305607 304885
17691 304885 326798 333818 342898 323312 310819 320019 363489 386657 404276 416405 423699 440655
17679 440655 454991 492993 572203 616965 656701 704963 758219 821228 922518 1098592 1278369
17668 1278369 1480991 1662334 1767605 1806442 1766947 1728244 1674824 1632649 1589548 1544497 1482569
17657 1482569 1413708 1377029 1341645 1314802 1267139 1194107 1076239 1004334 967187 937604 908357
17646 908357 860435 818217 772534 734986 720262 682838 698232 712968 767077 824203 873117
17635 873117 894503 923731 949666 985661 999654 970768 976809 975901 962912 971041 982419 1007180
17623 1007180 1018832 1059628 1079872 1102022 1119836 1163691 1251259 1326245 1433493 1550809 1651970
$$ packed form
17704C32271J1377m826k139J4271Q76O17k8262k5639j3579J3739M089K812p22
17691C04885K1913P020R080j9586j2493R200M3470K3168J7619J2129P294J6956
17679D40655J4336L8002P9210M4762L9736M8262N3256O3009J01290J76074J79777
17668A278369K02622J81343J05271L8837l9495l8703n3420m2175m3101m5051o1928
17657A482569o8861l6679l5384k6843m7663p3032j17868p1905l7147k9583k9247
17646I08357m7922m2218m5683l7548j4724l7424J5394J4736N4109N7126M8914
17635H73117K1386K9228K5935L5995J3993k8886O041r08j2989Q129J1378K4761
17623A007180J1652M0796K0244K2150J7814M3855Q7568P4986J07248J17316J01161
$$ plain form
17612 1651970 1720686 1726425 1675317 1599916 1540751 1467569 1404803 1354001 1310509 1270945 1265701 1296960
17600 1296960 1338227 1402460 1476471 1582022 1698608 1833129 2003373 2138705 2166979 2155563
17590 2155563 2168862 2159278 2178583 2241070 2361939 2520267 2685056 2871157 3113632 3410261
17580 3410261 3767000 4204815 4746524 5432269 6300067 7427003 8883593 10746970 12969258
17571 12969258 15264900 17245778 18566496 19070100 18890894 18392619 17873852 17644466 17908109
17562 17908109 18778423 20443247 23150950 27328073 33695491 43243553 57042442 75381131
17554 75381131 96854950 117907326 134185497 142665604 142756662 135832882 124160642 110013555
17546 110013555 95380102 81795980 70351773 61649413 55934254 52972540 52021663 51976976
$$ packed form
17612A651970O8716N739n1108p5401n9165p3182o2766n0802m3492l9564n244L1259
17600A296960M1267O4233P4011J05551J16586J34521J70244J35332K8274j1416
17590B155563J3299r584J9305O2487J20869J58328J64789J86101K42475K96629
17580C410261L56739M37815N41709O85745Q67798J126936J456590J863377K222288
17571A2969258K295642J980878J320718N03604j79206m98275n18767k29386K63643
17562A7908109Q70314J664824K707703M177123O367418R548062J3798889J8338689
17554G5381131K1473819K1052376J6278171Q480107R1058o923780j1672240j4147087
17546A10013555j4633453j3584122j1444207q702360n715159k961714r50877m4687
$$ plain form
17538 51976976 51518520 49716530 46352031 41833827 36809182 31866789 27392066 23555483
17530 23555483 20425970 17963123 16025956 14496463 13269753 12313714 11588205 11115350
17522 11115350 10880344 10911301 11192819 11689487 12432631 13559138 15226698 17651284 21073285
17513 21073285 25473356 30489111 35421615 39310070 41531977 42149156 41800971 41332540
17505 41332540 41661611 43574959 47673080 54287567 63511779 75173995 88592940 102075078
17497 102075078 112779031 117793013 115603696 106980103 94185656 79747516 65709288
17490 65709288 53245001 42821208 34461765 27934029 22958491 19261212 16662762 14981401
17482 14981401 14150455 13926492 14105759 14367462 14353950 13872412 12997746 11831547 10489382
$$ packed form
17538E1976976m58456j801990l364499m518204n024645m942393m474723l836583
17530B3555483l129513k462847j937167j529493j226710r56039p25509m72855
17522A1115350k35006L0957K81518M96668P43144J126507J667560K424586L422001
17513B1073285M400071N015755M932504L888455K221907O17179l48185m68431
17505D1332540L29071J913348M098121O614487R224212J1662216J3418945J3482138
17497A02075078J0703953N013982k189317q623593j2794447j4438140j4038228
17490F5709288j2464287j0423793q359443o527736m975538l697279k598450j681361
17482A4981401q30946k23963J79267K61703j3512m81538q74666j166199j342165
$$ plain form
17473 10489382 9141310 7927286 6854845 5927920 5133792 4458573 3903639 3453252 3058026
17464 3058026 2732699 2492380 2283382 2103165 1944964 1815772 1686072 1578716 1515681 1451741
17454 1451741 1393815 1327201 1249772 1159855 1140235 1117051 1085444 1024510 1003025 997981 1010592
17443 1010592 1023703 1088964 1083689 1060049 993791 931598 851348 792289 742871 728160 717347
17432 717347 703535 691068 675668 670874 674927 713627 714136 712084 706263 702217 675543 625971 609588
17419 609588 594621 573069 535552 510820 519889 497344 490905 497029 481929 451686 446826 447143 419562
17406 419562 377045 346757 321808 307079 307993 284227 269723 277613 255127 266982 275966 276513 302618
17393 302618 340789 369720 357002 344946 343206 337969 354837 363953 347495 349968 344733 349362 360366
$$ packed form
17473A0489382j348072j214024j072441r26925p94128o75219n54934m50387l95226
17464C058026l25327k40319k08998j80217j58201j29192j29700j07356o3035o3940
17454A451741n7926o6614p7429q9917j9620k3184l1607o0934k1485n044J2611
17443A010592J3111O5261n275k3640o6258o2193q0250n9059m9418j4711j0813
17432G17347j3812j2467j5400m794M053L8700N09k052n821m046k6674m9572j6383
17419F09588j4967k1552l7517k4732R069k2545o439O124j5100l0243m860L17k7581
17406D19562m2517l0288k4949j4729R14k3766j4504P890k2486J1855Q984N47K6105
17393C02618L8171K8931j2718j2056j740n237J6868R116j6458K473n235M629J1004
$$ plain form
17380 360366 371458 386850 409585 416300 411457 404678 430342 423642 432525 445724 476180 498767
17368 498767 487645 464959 450658 434024 431743 438177 431165 415419 402240 401500 386729 359568
17356 359568 316228 263779 239127 236873 213365 200541 193177 184889 190334 194251 171377 164682 179489
17343 179489 148935 136798 152178 150656 167387 216627 240635 225327 202925 198431 207111 214072
17331 214072 195212 201432 197511 173785 158221 171618 173612 210148 233534 202729 212071 231805
17319 231805 218673 199241 202018 193466 195403 188149 187251 191231 199420 193807 183717 189119 209062
17306 209062 223916 221903 222121 205381 213022 230237 230052 190710 162152 147872 148381 131468 114278
17293 114278 115061 115858 99347 89905 81180 80676 121373 120224 104866 97382 88651 41719 39609 63965
$$ packed form
17380C60366J1092J5392K2735O715m843o779K5664o700Q883J3199L0456K2587
17368D98767j1122k2686j4301j6634k281O434p012j5746j3179p40j4771k7161
17356C59568m3340n2449k4652k254k3508j2824p364q288N445L917k2874o695J4807
17343A79489l0554j2137J5380j522J6731M9240K4008j5308k2402m494Q680O961
17331B14072j8860O220l921k3726j5564J3397J994L6536K3386l0805R342J9734
17319B31805j3132j9432K777q552J937p254q98L980Q189n613j0090N402J9943
17306B09062J4854k013K18j6740P641J7215j85l9342k8558j4280N09j6913j7190
17293A14278P83P97j6511r442q725n04M0697j149j5358p484q731m6932k110K4356
$$ plain form
17279 63965 76266 75181 79337 87894 87385 86004 43696 4300 18844 29775 39257 66318 38428
17266 38428 29403 37502 42853 47302 43951 48819 30874 39021 23698 47636 52493 35685 50606
17253 50606 39527 43819 47739 36410 43530 57615 69661 62316 45010 47650 49081 37067 23721
17240 23721 32307 51385 61314 29346 14712 9565 38301 66676 68264 79686 69663 62821 57913
17227 57913 48802 52819 58764 43506 64789 49696 41217 39996 47572 26733 14581 37719 44407
17214 44407 57598 44214 27891 25515 51658 64069 70673 73328 67674 59998 53822 37321 23717
17201 23717 36338 52967 48409 26123 3858 20611 43704 33290 28449 48432 37717 11154
17189 11154 -684 22991 8258 13027 10177 32537 34992 27692 24087 24773 20270 32240 31722 48529
$$ packed form
17279F3965J2301j085M156Q557n09j381m2308l9396J4544J0931R482K7061k7890
17266C8428r025Q099N351M449l351M868j7945Q147j5323K3938M857j6808J4921
17253E0606j1079M292L920j1329P120J4085J2046p345j7306K640J431j2014j3346
17240B3721Q586J9078R929l1968j4634n147K8736K8375J588J1422j0023o842m908
17227E7913r111M017N945j5258K1283j5093q479j221P576k0839j2152K3138O688
17214D4407J3191j3384j6323k376K6143J2411O604K655n654p676o176j6501j3604
17201B3717J2621J6629m558k2286k2265J6753K3093j0414m841J9983j0715k6563
17189A1154j1838K3675j4733M769k850K2360K455p300l605O86m503J1970n18J6807
$$ plain form
17175 48529 64385 41631 48516 9467 19639 38400 47912 32758 31037 40718 39858 31398 25872
17162 25872 17378 -1200 -6343 -12138 -5143 -11664 19858 41434 53558 52136 54990 44003 34615
17149 34615 14975 31728 16656 13641 19893 41595 56223 25156 7609 -4937 21734 64166
17137 64166 76949 55523 42927 23061 48389 106413 105277 132506 167632 222054 267153 273493
17125 273493 254392 237155 216517 190714 164373 161632 170432 150408 115798 119152 124114 119765
17113 119765 133901 150214 140770 131581 111312 111146 95959 87963 104541 91842 57246 32482
17101 32482 29750 32227 23452 51020 74706 85439 54585 32807 33165 49733 61399 73870 68051
17088 68051 73974 101623 95834 132722 121630 103763 92825 121699 152992 164877 179211 231176
$$ packed form
17175D8529J5856k2754O885l9049J0172J8761R512j5154j721R681q60q460n526
17162B5872q494j8578n143n795O995o521L1522K1576J2124j422K854j0987r388
17149C4615j9640J6753j5072l015O252K1702J4628l1067j7547j2546K6671M2432
17137F4166J2783k1426j2596j9866K5328N8024j136K7229L5126N4422M5099O340
17125B73493j9101j7237k0638k5803k6341k741Q800k0024l4610L354M962m349
17113A19765J4136J6313r444r189k0269j66j5187p996J6578j2699l4596k4764
17101C2482k732K477q775K7568K3686J0733l0854k1778L58J6568J1666J2471n819
17088F8051N923K7649n789L6888j1092j7867j0938K8874L1293J1885J4334N1965
$$ plain form
17076 231176 274231 299614 327999 346143 359318 369816 355329 340415 361501 367624 378198 418264
17064 418264 461161 469230 450553 469181 515663 546470 533390 545012 514686 444160 394738 408924
17052 408924 439201 432162 443018 480454 531102 528109 481428 454383 405268 362573 324819 276941
17040 276941 212187 165376 154885 153490 124970 114608 112915 113131 128868 156452 130490 111234
17028 111234 113200 118786 126470 137664 130704 130232 155784 165936 196730 239346 254355 255025 274482
17015 274482 342414 377789 386637 404118 431073 434966 464567 499890 522721 523254 479957 429868
17003 429868 397207 336009 303014 254173 209545 153919 138896 166435 200667 237587 302353
16992 302353 316467 323482 356557 383558 373310 363261 321195 272729 212087 180087 138839 95453
$$ packed form
17076B31176M3055K5383K8385J8144J3175J0498j4487j4914K1086O123J0574M0066
17064D18264M2897Q069j8677J8628M6482L0807j3080J1622l0326p0526m9422J4186
17052D08924L0277p039J0856L7436N0648k993m6681k7045m9115m2695l7754m7878
17040B76941o4754m6811j0491j395k8520j0362j693K16J5737K7584k5962j9256
17028A11234J966N586P684J1194o960m72K5552J0152L0794M2616J5009O70J9457
17015B74482O7932L5375Q848J7481K6955L893K9601L5323K2831N33m3297n0089
17003D29868l2661o1198l2995m8841m4628n5626j5023K7539L4232L6920O4766
16992C02353J4114P015L3075K7001j0248j0049m2066m8466o0642l2000m1248m3386
$$ plain form
16980 95453 78754 77537 63342 48947 31284 44318 28782 43518 40673 22303 11050 2493
16968 2493 22576 33943 32164 56342 78498 75037 68858 73928 69055 57384 32066 10731 9483
16955 9483 5830 24881 24526 11742 -4055 -7706 -3316 21418 19733 2298 24417 13433 19469
16942 19469 31747 40181 11515 8051 18311 15527 18914 9206 -678 -4301 14141 28095 15074
16929 15074 4306 -20082 -35927 -19638 -34095 -24606 -11008 -32774 -43277 -57011 -39571 6584
16917 6584 22919 28481 32192 57385 53543 43639 49309 44146 15110 -12528 -10043 5307 -16218
16904 -16218 -6302 -17293 -31069 -33161 -26434 -13940 3287 -25178 -31403 -21222 8378 34184
16892 34184 37105 23465 -7695 -23265 -13601 -9279 11211 20272 27119 41200 41631 27553 20198
$$ packed form
16980I5453j6699j217j4195j4395j7663J3034j5536J4736k845j8370j1253q557
16968B493K0083J1367j779K4178K2156l461o179N070m873j1671k5318k1335j248
16955I483l653J9051l55j2784j5797l651M390K4734j685j7435K2119j0984O036
16942A9469J2278Q434k8666l464J0260k784L387r708r884l623J8442J3954j3021
16929A5074j0768k4388j5845J6289j4457R489J3598k1766j0503j3734J7440M6155
16917F584J6335N562L711K5193l842r904N670n163k9036k7638K485J5350k1525
16904a6218R916j0991j3776k092O727J2494J7227k8465o225J0181K9600K5806
16892C4184K921j3640l1160j5570R664M322K0490R061O847J4081M31j4078p355
$$ plain form
16879 20198 16222 929 -25368 -38547 -45368 -17186 -18858 -39061 -31170 -18762 -9252 -7629 4265
16866 4265 -4797 -25448 -5801 7758 15563 10166 -25572 -20988 -5553 -40042 -62582 -49265 -25373
16853 -25373 -37476 -54161 -44494 -44906 -37108 -51052 -63196 -34584 -41807 -21965 -14141 -11627 6156
16840 6156 1782 -3711 14299 26224 9232 -9533 -4294 5806 -5333 -17994 -32447 -27246 -24948
16827 -24948 -27739 -22390 4112 8238 -15901 -36951 -48503 -46589 -52545 -40572 -40073 -42617 -52326
16814 -52326 -43089 -35346 -36264 -33447 -42165 -54451 -41006 -27605 -36265 -46667 -57849 -71987 -72345
16801 -72345 -43550 -50304 -71810 -52474 -35081 -23872 -17245 -11658 -7835 8723 16089 3808 -22833
16788 -22833 -29809 -28992 10852 13614 -29118 -55472 -57627 -57699 -58850 -40502 -62138 -61381 -12886 -29653
$$ packed form
16879B0198l976j5293k6297j3179o821K8182j672k0203P891J2408R510J623J1894
16866D265r062k0651J9647J3559P805n397l5738M584J5435l4489k2540J3317K3892
16853b5373j2103j6685R667m12P798j3944j2144K8612p223J9842P824K514J7783
16840F156m374n493J8010J1925j6992j8765N239J0100j1139j2661j4453N201K298
16827b4948k791N349K6502M126k4139k1050j1552J914n956J1973M99k544r709
16814e2326R237P743r18K817q718j2286J3445J3401q660j0402j1182j4138l58
16801g2345K8795o754k1506J9336J7393J1209O627N587L823J6558P366j2281k6641
16788b2833o976Q17L9844K762m2732k6354k155p2j151J8348k1636P57M8495j6767
$$ plain form
16774 -29653 -23951 -26933 -42271 -18571 -34895 -29581 -16388 -17332 -17033 -33534 -44560 -19851 16333
16761 16333 33171 19076 2030 -13043 -439 -13752 -44276 -37321 -17184 -11580 -35811 -37481
16749 -37481 -36255 -38527 -34944 -32515 -25556 -17673 -31965 -40855 -63632 -75006 -32470 -14179 -21495
16736 -21495 -6094 13517 5827 -21633 -31250 -22511 -7420 3302 -5009 3665 -8705 -25369 3339
16723 3339 11396 -13210 -5978 -7636 4387 -19917 -16476 -24247 -42752 -54653 -45810 -40903 -1769
16710 -1769 23444 12839 -13758 -38322 -32937 -42676 -67654 -91071 -68877 -60129 -67075 -65522 -47724
16697 -47724 -15739 -572 -1527 -21747 -12839 -2494 -14901 -41318 -33297 -24839 -10233 -31626 -42718
16684 -42718 -32465 -9748 -17113 -11891 -20850 7049 10736 -14241 -16045 -7548 -38480 -50530 -29046
$$ packed form
16774b9653N702k982j5338K3700j6324N314J3193r44K99j6501j1026K4709L6184
16761A6333J6838j4095j7046j5073J2604j3313l0524O955K0137N604k4231j670
16749c7481J226k272L583K429O959P883j4292q890k2777j1374M2536J8291p316
16736b1495J5401J9611p690k7460r617Q739J5091J0722q311Q674j2370j6664K8708
16723C339Q057k4606P232j658J2023k4304L441p771j8505j1901Q843M907L9134
16710a769K5213j0605k6597k4564N385r739k4978k3417K2194Q748o946J553J7798
16697d7724L1985J5167r55k0220Q908J0345j2407k6417Q021Q458J4606k1393j1092
16684d2718J0253K2717p365N222q959K7899L687k4977j804Q497l0932j2050K1484
$$ plain form
16671 -29046 -32485 -38861 -26314 -18834 -35259 -35162 -10403 780 1737 1955 -15213 4380 14079 29129
16657 29129 6425 -10347 -27328 -31258 -20986 -520 37390 33652 32140 35246 17430 -16838
16645 -16838 -31029 -46474 -26084 -19660 -31223 -39244 -13219 -7543 31053 42930 4777 -52774
16633 -52774 -64821 -48146 -24886 -13233 -4930 10725 -5509 -23099 -8452 -4131 -8464 -16683
16621 -16683 -9356 -13036 -33491 -36361 -21109 -23491 -32894 -20589 -20793 -16257 -29587 -45514 -40904
16608 -40904 -15840 24025 31873 27564 19423 -1998 2543 27513 33716 -20166 -39056 -42317 -43015
16595 -43015 -32941 -56802 -52847 -36091 -66323 -78929 -56807 -26281 31159 43038 23921 -4299
16583 -4299 -24124 -40084 -40728 -52492 -56505 -47026 -32652 -29078 -48606 -43736 -27613 -40910 -38086
$$ packed form
16671b9046l439o376J2547P480j6425R7K4759J1183R57K18j7168J9593R699J5050
16657B9129k2704j6772j6981l930J0272K0466L7910l738j512L106j7816l4268
16645a6838j4191j5445K0390O424j1563q021K6025N676L8596J1877l8153n7551
16633e2774j2047J6675K3260J1653Q303J5655j6234j7590J4647M321m333q219
16621a6683P327l680k0455k870J5252k382r403J2305k04M536j3330j5927M610
16608d0904K5064L9865P848m309q141k1421M541K4970O203n3882j8890l261o98
16595d3015J0074k3861L955J6756l0232j2606K2122L0526N7440J1879j9117k8220
16583d299j9825j5960o44j1764m013R479J4374L574j9528M870J6123j3297K824
$$ plain form
16570 -38086 -25169 -23140 1102 22144 16485 -10750 -8979 -758 -15202 -44437 -49315 -53594 -54192
16557 -54192 -39875 -61162 -55727 -27700 -24651 1786 7435 -23205 -47363 -3622 -11668 -51693
16545 -51693 -66595 -88498 -98819 -54386 -60259 -67145 -65017 -36071 -45650 -50325 -29064 -25554 -2610
16532 -2610 2312 3649 -4475 -16549 -7576 -3726 -16023 -16295 -13471 -30931 -22742 -24891 -19146 -14529
16518 -14529 -16805 3985 -576 -15043 -18991 -24413 -41033 -38029 -51544 -64064 -80978 -73001 -53199
16505 -53199 -41703 -35323 -18115 8897 -19549 -58828 -63605 -42848 -32977 -49367 -25573 3750
16493 3750 -5993 -12845 14752 26793 8778 -21712 -35830 -37110 -46019 -16244 -19818 -22891 -34205
16480 -34205 -21311 -638 -1766 -4336 -5605 -8313 -4172 -13718 -566 5827 -13118 -19615 -17766
$$ packed form
16570c8086J2917K029K4242K1042n659k7235J771Q221j4444k9235m878m279n98
16557e4192J4317k1287N435K8027L049K6437N649l0640k4158M3741q046m0025
16545e1693j4902k1903j0321M4433n873o886K128K8946r579m675K1261L510K2944
16532b610M922J337q124j2074Q973L850j2297k72K824j7460Q189k149N745M617
16518a4529k276K0790m561j4467l948n422j6620L004j3515j2520j6914P977J9802
16505e3199J1496O380J7208K7012k8446l9279m777K0757R871j6390K3794K9323
16493C750r743o852K7597J2041j8015l0490j4118j280q909K9775l574l073j1314
16480c4205J2894K0673j128k570j269k708M141r546J3152O393j8945o497J849
$$ plain form
16467 -17766 -5618 -51700 -76954 -82458 -70568 -53322 -51256 -46826 -47011 -37711 -38304 -49958 -48395
16454 -48395 -47545 -57999 -39802 -19581 -15903 -31238 -45225 -36861 -26595 -14124 -35913 -27926 -7421
16441 -7421 15332 17402 22962 3343 -10908 -4817 15291 17058 23909 18764 20742 2861 -19086
16428 -19086 -10916 2821 14097 -1133 -14156 -20214 -4013 -11782 -29592 -38727 -53899 -25174
16416 -25174 -2141 -31074 -22534 -20512 -9894 5094 -7936 -22145 -17683 -34324 -21544 -13974
16404 -13974 -21538 -38835 -51922 -68776 -68260 -63511 -66513 -59085 -57696 -43064 -25438 -21175 -12250
16391 -12250 -15584 -13251 22215 39962 42153 18740 3404 2971 2360 11592 23032 17839 -11016
16378 -11016 4005 6829 9323 1337 -26043 -47952 -18654 -14446 -18000 -21368 -19814 -16750 -4278
$$ packed form
16467a7766J2148m6082k5254n504J1890J7246K066M430j85R300n93j1654J563
16454d8395Q50j0454J8197K0221L678j5335j3987Q364J0266J2471k1789P987K0505
16441g421K2753K070N560j9619j4251O091K0108J767O851n145J978j7881k1947
16428a9086Q170J3737J1276j5230j3023o058J6201p769j7810r135j5172K8725
16416b5174K3033k8933Q540K022J0618J4988j3030j4209M462j6641J2780P570
16404a3974p564j7297j3087j6854N16M749l002P428J389J4632J7626M263Q925
16391a2250l334K333L5466J7747K191k3413j5336m33o11R232J1440n193k8855
16378a1016J5021K824K494p986k7380k1909K9298M208l554l368J554L064J2472
$$ plain form
16365 -4278 -834 -16379 -8505 22665 27760 7444 -20914 -15772 6139 18344 35461 18154 -548
16352 -548 11322 31359 19510 4115 7112 2489 -18187 -25173 -26005 -21898 -43130 -45283 -61078
16339 -61078 -64269 -58903 -35093 -33115 -44733 -43068 -46749 -17649 -22645 -36501 -46197 -49212 -30747
16326 -30747 -13518 -4056 19561 26321 9848 -32137 -48145 -29130 -2512 -40578 -39461 15597
16314 15597 35364 16180 12666 -4581 -24004 -51919 -67784 -63285 -49733 -27607 -27509 -5497 -1346
16301 -1346 13163 15245 16332 235 -19929 -22472 -24559 -30003 -40370 -50501 -48649 -10672 1045
16288 1045 -5491 -29208 -35824 -22099 -7360 -25289 -25613 -20400 -7578 31616 35220 2930 -21583
16275 -21583 -13416 -14342 -22030 -31414 -42057 -56980 -51508 -16450 -18564 -14260 -2288 9945 3571
$$ packed form
16365d278L444j5545P874L1170N095k0316k8358N142K1911J2205J7117j7307j8702
16352e48J1870K0037j1849j5395K997m623k0676o986q32M107k1232k153j5795
16339f1078l191N366K3810J978j1618J665l681K9100m996j3856r696l015J8465
16326c0747J7229R462K3617O760j6473m1985j6008J9015K6618l8066J117N5058
16314A5597J9767j9184l514j7247j9423k7915j5865M499J3552K2126R8K2012M151
16301a346J4509K082J087j6097k0164k543k087n444j0367j0131J852L7977J1717
16288A045o536k3717o616J3725J4739j7929l24N213J2822L9194L604l2290k4513
16275b1583Q167r26p688r384j0643j4923N472L5058k114M304J1972J2233o374
$$ plain form
16262 3571 18498 12274 18362 -5276 -14073 3402 5402 26074 -20610 -52474 -57596 -46026 -52612
16249 -52612 -30931 -10793 -19181 -1473 2935 9981 32249 5259 -34974 -30431 -26247 -16725 -13206
16236 -13206 -20903 -17301 -12551 -35122 -30552 -46902 -30743 6483 4977 -5400 -5027 -279 4941
16223 4941 3471 -13007 194 -1171 -8448 8334 -9017 -4398 5706 -17203 -40879 -42321 -11538
16210 -11538 8610 16511 23780 44498 55426 70683 40793 4286 -5572 -1535 4916 -23356 -32433
16197 -32433 -31369 -45165 -63936 -42774 -32871 -20895 -29044 -28829 -25598 -34836 -27004 -9209 -21881
16184 -21881 -31285 -20816 -17750 -9709 -2828 -12980 -33524 -22142 -23814 -24950 -31462 -29822 -6180
16171 -6180 -13166 -6712 -20236 -26933 -15881 -36790 -41451 -24191 -4289 4334 49 -11525 5353
$$ packed form
16262C571J4927o224O088k3638q797J7475K000K0672m6684l1864n122J1570o586
16249e2612K1681K0138q388J7708M408P046K2268k6990m0233M543M184R522L519
16236a3206p697L602M750k2571M570j6350J6159L7226j506j0377L73M748N220
16223D941j470j6478J3201j365p277J6782j7351M619J0104k2909k3676j442L0783
16210a1538K0148P901P269K0718J0928J5257k9890l6507r858M037O451k8272r077
16197c2433J064j3796j8771K1162R903J1976q149K15L231r238P832J7795j2672
16184b1881r404J0469L066Q041O881j0152k0544J1382j672j136o512J640K3642
16171f180o986O454j3524o697J1052k0909m661J7260J9902Q623m285j1574J6878
$$ plain form
16158 5353 3995 -9635 -9062 -8905 -6541 1112 -40821 -37980 -41390 -53684 -32107 -21588 -5126 -16659
16144 -16659 -3989 -10062 -46590 -61104 -35403 -11185 -1237 16514 3320 -10267 4004 4677
16132 4677 -2723 -18684 -24876 -18687 -13337 699 -16514 -22222 -32059 -59104 -63293 -53680 -49745 -47572
16118 -47572 -38365 -5031 -885 -8002 -8259 -3848 4457 -24398 -49640 -62045 -54763 -30217 -6918
16105 -6918 159 -14499 6118 5095 14683 9191 5544 1212 -5619 -13404 -3424 -1735 7884 10940
16091 10940 11195 13457 20600 10283 -53422 -68947 -34888 3321 37825 43058 -8610 -24871 -3618
16078 -3618 10945 26573 2162 5247 9679 8339 -20247 -23270 -27027 -34889 -30594 -18275 -13203
16065 -13203 1636 27211 28971 38146 32879 31392 45654 59991 22523 -4867 -23958 -48870
$$ packed form
16158E353j358j3630N73J57K364P653m1933K841l410j2294K1577J0519J6462j1533
16144a6659J2670o073l6528j4514K5701K4218R948J7751j3194j3587J4271O73
16132D677p400j5961o192O189N350J4036j7213n708r837k7045m189R613L935K173
16118d7572R207L3334M146p117k57M411Q305k8855k5242j2405P282K4546K3299
16105f918P077j4658K0617j023R588n492l647m332o831p785R980J689R619L056
16091A0940K55K262P143j0317o3705j5525L4059L8209L4504N233n1668j6261K1253
16078c618J4563J5628k4411L085M432j340k8586l023l757p862M295J2319N072
16065a3203J4839K5575J760R175n267j487J4262J4337l7468k7390j9091k4912
$$ plain form
16053 -48870 -16360 -17015 -13594 -21042 -18862 -17626 -7773 -20841 -9834 -30290 -31134 -16379 -14433 -22043
16039 -22043 -35932 -46004 -62657 -46806 -21192 -4494 -8367 -17152 -1080 19032 27935 24269
16027 24269 28258 20763 5929 6137 12463 20353 23713 24178 35165 4684 -14942 -6202 -20096 -20238
16013 -20238 -15089 11280 1721 10713 24787 19402 27274 20122 -9283 -25050 -50551 -56176 -13097
16000 -13097 -15013 -17566 -22711 -42001 -64460 -43336 -23917 -16107 -1627 6557 -11585 -14729 -24518
15987 -24518 -45140 -34767 -14869 -8975 -8607 184 9308 -14117 -55426 -55558 -27531 -31723 -58200
15974 -58200 -32923 -21911 -25467 -23309 -15490 -13489 1000 -8116 6859 36973 44392 6742 -16729
15961 -16729 -18710 -1979 8535 -9580 -26748 -15406 -1560 -7149 -26143 -42536 -50908 -42987
$$ packed form
16053d8870L2510o55L421p448K180J236R853j3068J1007k0456q44J4755J946p610
16039b2043j3889j0072j6653J5851K5614J6698l873q785J6072K0112Q903l666
16027B4269L989p495j4834K08O326P890L360M65J0987l0481j9626Q740j3894j42
16013b0238N149K6369r559Q992J4074n385P872p152k9405j5767k5501n625M3079
16000a3097j916k553n145j9290k2459K1124J9419P810J4480Q184j8142l144r789
15987b4518k0622J0373J9898N894L68Q791R124k3425m1309j32K8027m192k6477
15974e8200K5277J1012l556K158P819K001J4489r116J4975L0114P419l7650k3471
15961a6729j981J6731J0514j8115j7168J1342J3846n589j8994j6393q372P921
$$ plain form
15949 -42987 -73653 -83974 -59334 -60363 -43803 -31303 -35539 -19893 -27406 -18693 -10596 -22966 -14337
15936 -14337 -10302 -23069 -15118 -110 -14654 -47863 -40577 -22203 -1288 11040 2194 -3805 -18012
15923 -18012 -36454 -40450 -14336 9717 6704 2779 26285 30422 45838 20089 17013 -1537 4048
15910 4048 -23411 -51298 -28927 3302 -13241 -20463 -31054 -40288 -37554 -39361 -24706 -19525 -20241
15897 -20241 -29135 -41736 -44333 -55260 -62052 -73266 -64737 -34483 -18239 -10627 -15819 -13928 -52640
15884 -52640 -60905 -29634 -8687 -1005 -19760 -23338 -1236 -16115 -19071 -30914 -49604 -30395
15872 -30395 9332 3769 -11486 -6227 -2960 -7114 -14201 10892 32212 12469 15111 10820 38023
15859 38023 41519 36226 34551 33852 25475 3657 -27237 -13658 -16238 -21753 351 -12444 -46734
$$ packed form
15949d2987l0666j0321K4640j029J6560J2500m236J5646p513Q713Q097j2370Q629
15936a4337M035j2767P951J5008j4544l3209P286J8374K0915J2328q846n999j4207
15923a8012j8442l996K6114K4053l013l925K3506M137J5416k5749l076j8550N585
15910D048k7459k7887K2371L2229j6543p222j0591r234K734j807J4655N181p16
15897b0241q894j2601k597j0927o792j1214Q529L0254J6244P612n192J891l8712
15884e2640q265L1271K0947P682j8755l578K2102j4879k956j1843j8690J9209
15872c0395L9727n563j5255N259L267m154p087K5093K1320j9743K642m291K7203
15859C8023L496n293j675o99q377k1818l0894J3579k580n515K2104j2795l4290
$$ plain form
15846 -46734 -18529 -4045 5244 15968 1462 2031 5344 17808 6611 -12146 640 8940 6016
15833 6016 -22640 -30000 -34670 -29902 -29475 -13012 -15963 -47664 -37761 -8401 -47044 -59702 -38305
15820 -38305 -27762 -2861 22506 17849 20923 24048 12388 -13819 -28147 368 7031 -14406
15808 -14406 -10682 8758 -26511 -51593 -14345 22434 17240 9788 2516 -10908 -16245 -32067 -15782
15795 -15782 -12982 -14867 -2203 13520 4571 -2214 -5374 -16695 -24738 -28712 -13849 -8943 -22358
15782 -22358 -8336 -27280 -16144 -25688 -29645 -8452 3010 9429 -9787 -22932 -36821 -41316
15770 -41316 -30548 -26290 -13698 -15027 -12225 -908 -10455 -1275 -8138 -44564 -39603 -29823 -27541
15757 -27541 -3535 -18391 -10723 -6318 -14460 -6065 17781 -2310 -21496 -10427 10270 3981 -5093
$$ packed form
15846d6734K8205J4484R289J0724j4506N69L313J2464j1197j8757J2786Q300k924
15833F016k8656p360m670M768M27J6463k951l1701R903K9360l8643j2658K1397
15820c8305J0543K4901K5367m657L074L125j1660k6207j4328K8515O663k1437
15808a4406L724J9440l5269k5082L7248L6779n194p452p272j3424n337j5822J6285
15795a5782K800j885J2664J5723q949o785l160j1321q043l974J4863M906j3415
15782b2358J4022j8944J1136r544l957K1193J1462O419j9216j3145j3889m495
15770d1316J0768M258J2592j329K802J1317r547R180o863l6426M961R780K282
15757b7541K4006j4856P668M405q142Q395K3846k0091j9186J1069K0697o289r074
$$ plain form
15744 -5093 14952 26345 10981 -5160 -826 19215 13894 13667 28327 20192 -4739 11299 21046
15731 21046 2878 8549 7832 5074 -7348 20544 21666 1239 -5493 -23667 -17932 867 -21791
15718 -21791 -32268 -10588 -980 -2930 -21633 -1965 8232 21062 15240 6398 -19424 -16331 -3952
15705 -3952 -8617 2316 -44939 -58852 -18734 4973 -9276 -22184 -41716 -33507 1253 -6993
15693 -6993 -33041 -32756 11519 18189 23059 11546 -3566 -12531 -12889 -30495 -25999 2881 874 1862
15679 1862 5654 305 3895 7079 22815 23391 10326 19713 25810 -13234 -37940 -27971 -23173 -29487
15665 -29487 -22688 24864 22266 14136 14448 1339 -2867 6758 -14439 -54719 -51644 -24643 -48172
15652 -48172 -69614 -42088 -20620 -18298 -41016 -41535 -13567 14332 -11092 -31647 -31039 -2667 3164
$$ packed form
15744e093K0045J1393j5364j6141M334K0041n321k27J4660q135k4931J6038R747
15731B1046j8168N671p17k758j2422K7892J122k0427o732j8174N735J8799k2658
15718b1791j0477K1680R608j950j8703J9668J0197J2830n822q842k5822L093J2379
15705c952m665J0933m7255j3913M0118K3707j4249j2908j9532Q209L4760q246
15693f993k6048K85M4275O670M870j1513j5112q965l58j7606M496K8880k007R88
15679A862L792n349L590L184J5736N76j3065R387O097l9044k4706R969M798o314
15665b9487O799M7552k598q130L12j3109m206R625k1197m0280L075K7001k3529
15652d8172k1442K7526K1468K322k2718n19K7968K7899k5424k0555O08K8372N831
$$ plain form
15639 3164 -23487 -32466 -3044 -2528 -2563 13075 1439 1229 -183 23385 21496 11914 7643 14735
15625 14735 798 16416 1600 -3296 -15405 -29815 -19995 -22830 -35237 -38864 -32863 -41633 -61353
15612 -61353 -86744 -70475 -71810 -77841 -67512 -58693 -58769 -34365 -30261 -18216 -18559 -41334 -59016
15599 -59016 -60782 -58931 -46638 -28934 -31553 -64826 -63593 -52476 -55211 -55866 -34809 -45200 -30988
15586 -30988 -22431 -26661 -19571 -9784 -7170 -36871 -31057 -22153 -27894 -28474 -41856 -58121 -87629 -104837
15572 -104837 -102209 -66902 -53588 -55625 -58546 -44454 -37728 -49266 -41750 -38943 -38784 -19291 10170
15559 10170 29314 19908 -8044 -24017 -7413 5168 8922 9722 26764 -3436 -17298 -38252
15547 -38252 -67299 -50627 -40678 -22676 -3516 -24266 -40343 -49784 -46569 -29454 -27915 -24421 -14102
$$ packed form
15639C164k6651q979K9422N16l5J5638j1636k10j412K3568j889r582m271P092
15625A4735j3937J5618j4816m896j2109j4410R820k835j2407l627O001q770j9720
15612f1353k5391J6269j335o031J0329Q819p6K4404M104J2045l43k2775j7682
15599e9016j766J851J2293J7704k619l3273J233J1117k735o55K1057j0391J4212
15586c0988Q557m230P090R787K614k9701N814Q904n741n80j3382j6265k9508j7208
15572a04837K628L5307J3314k037k921J4092O726j1538P516K807J59J9493K9461
15559A0170J9144r406k7952j5973J6604J2581L754Q00J7042l0200j3862k0954
15547c8252k9047J6672R949J8002J9160k0750j6077r441L215J7115J539L494J0319
$$ plain form
15534 -14102 -19845 -18813 -26933 -44363 -44444 -8989 6709 7842 -20871 -48088 -77136 -65522 -50804
15521 -50804 -39728 -16340 5070 13280 -7743 -17592 -11104 -108 -5636 -13121 -36338 -61833 -55350
15508 -55350 -15786 1102 -18091 -23646 -33729 -51117 -42902 -36570 -18756 -6317 12201 31584
15496 31584 29028 -13364 -43536 -49426 -39525 -29278 -22628 -32961 -11105 29872 19167 -1364
15484 -1364 -16744 4202 17481 -11051 -14034 -14965 -23294 -6117 1320 -6985 -32378 -38783 -34148
15471 -34148 -40562 -44555 -18384 17419 11694 -26765 -52145 -47783 -58634 -60372 -67113 -64380 -33398
15458 -33398 1425 4041 3858 479 -12070 -24354 -21917 -24920 -24181 2475 -5034 -44465 -57886
15445 -57886 -43624 -36851 -36880 -27692 -8888 13948 23636 8062 -19227 -17037 6630 23872 28332
$$ packed form
15534a4102n743J032q120j7430q1L5455J5698J133k8713k7217k9048J1614J4718
15521e0804J1076K3388K1410Q210k1023r849O488J0996n528p485k3217k5495O483
15508e5350L9564J6888j9193n555j0083j7388Q215O332J7814J2439J8518J9383
15496C1584k556m2392l0172n890R901J0247O650j0333K1856M0977j0705k0531
15484a364j5380K0946J3279k8532k983r31q329J7177P437q305k5393o405M635
15471c4148o414l993K6171L5803n725l8459k5380M362j0851j738o741K733L0982
15458c3398L4823K616j83l379j2549j2284K437l003P39K6656p509l9431j3421
15445e7886J4262O773k9R188J8804K2836R688j5574k7289K190K3667J7242M460
$$ plain form
15432 28332 -5401 -24764 -29928 -10358 -9127 -1539 7107 -8416 9356 29391 18906 2346
15420 2346 -10449 -7362 -2213 33381 33180 28635 21513 -5655 -13774 -18096 -31797 -8122 15403
15407 15403 40194 63965 57489 54312 52786 54979 34754 -5524 -25646 -20840 -13952 -1605 -22660
15394 -22660 -42466 -27520 -7226 1025 26351 35688 18326 5199 -21247 -8152 20150 -8230
15382 -8230 -26964 -18298 -20917 -32280 -13924 -14954 -30927 -43459 -41189 -58771 -67817 -45700 -513
15369 -513 24533 -6736 -40921 -63772 -61495 -28954 -12847 -23310 -490 1712 3475 -5711 -26753
15356 -26753 -24962 -17452 -19442 -24209 -10812 32500 34720 16664 -7370 -26353 -27369 -16738 -4369
15343 -4369 2576 -19139 -30530 -13141 -5890 10216 398 4535 -10300 -11004 -13570 -17383 -18913 -6812
$$ packed form
15432B8332l3733j9363n164J9570J231P588Q646j5523J7772K0035j0485j6560
15420B346j2795L087N149L5594k01m545p122k7168q119m322j3701K3675K3525
15407A5403K4791K3771o476l177j526K193k0225m0278k0122M806O888J2347k1055
15394b2660j9806J4946K0294Q251K5326R337j7362j3127k6446J3095K8302k8380
15382h230j8734Q666k619j1363J8356j030j5973j2532K270j7582r046K2117M5187
15369e13K5046l1269l4185k2851K277L2541J6107j0463K2820K202J763r186k1042
15356b6753J791P510j990m767J3397M3312K220j8056k4034j8983j016J0631J2369
15343d369O945k1715j1391J7389P251J6106r818M137j4835p04k566l813j530J2101
$$ plain form
15329 -6812 -27838 -11813 -3161 -29061 -65213 -62840 -37678 -13857 -26847 -27438 -20076 -4339 -11014
15316 -11014 -19593 -17391 -17346 -1256 27678 49188 54593 31686 15875 -1517 -21615 -38041 -36158
15303 -36158 -18566 -30215 -41298 -24669 -27242 -24876 12004 41564 22793 2399 -9121 -40416
15291 -40416 -40273 -17843 -28365 -29703 -27819 -30446 -19261 -2194 -1345 -14473 -15008 -23192 -34672 -61618
15277 -61618 -52903 -55470 -46017 -21406 -24632 -43041 -68033 -79710 -66931 -41209 -21710 -11397
15265 -11397 -15762 -28523 -39115 -16034 -17729 -15550 -27479 -35195 -45196 -46735 -43114 -29954 -5484
15252 -5484 3837 -21247 -30506 -18750 -33053 -27942 -15761 -22406 -24805 -29856 -30464 -52359 -60975 -64573
15238 -64573 -66499 -39772 -15727 -36283 -68062 -73633 -60738 -49289 -54379 -43610 -24987 -38593
$$ packed form
15329f812k1026J6025Q652k5900l6152K373K5162K3821j2990n91P362J5737o675
15316a1014q579K202M5J6090K8934K1510N405k2907j5811j7392k0098j6426J883
15303c6158J7592j1649j1083J6629k573K366L6880K9560j8771k0394j1520l1295
15291d0416J43K2430j0522j338J884k627J1185J7067Q49j3128n35q184j1480k6946
15277f1618Q715k567R453K4611l226j8409k4992j1677J2779K5722J9499J0313
15265a1397m365j2761j0592K3081j695K179j1929p716j0001j539L621J3160K4470
15252e484R321k5084r259J1756j4303N111J2181o645k399n051o08k1895q616l598
15238f4573j926K6727K4045k0556l1779n571J2895J1449n090J0769J8623j3606
$$ plain form
15226 -38593 -41355 -63737 -57651 -23394 7464 -8942 -41021 -28708 -18782 -13090 557 -12740
15214 -12740 -127 37799 53404 47324 23126 -15585 -40150 -26544 -23629 -7170 17699 29928
15202 29928 10283 -3083 -35580 -22472 -2916 860 -3650 17344 36844 5826 -13633 -22913
15190 -22913 -1336 53379 64503 38801 38199 25773 -5352 -23480 -31199 -56279 -69821 -48596
15178 -48596 -36815 -10774 14842 -11604 -38315 -33470 -28505 -18270 -4754 3413 1887 -7214 -13077
15165 -13077 -15269 -12958 -29093 -23490 -15956 -44078 -31031 -5302 -2841 -21249 -36004 -12525 -6334
15152 -6334 -15039 -34066 -43821 -39046 -42499 -54311 -32757 -23444 -6393 4650 13771 8854 31286
15139 31286 34392 12897 7699 11714 20914 7518 19327 15683 -6091 25487 46538 11434 -3719
$$ packed form
15226c8593k762k2382O086L4257L0858j6406l2079J2313R926N692J3647j3297
15214a2740J2613L7926J5605o080k4198l8711k4565J3606K915J6459K4869J2229
15202B9928j9645j3366l2497J3108J9556L776m510K0994J9500l1018j9459r280
15190b2913K1577N4715J1124k5702o02j2426l1125j8128p719k5080j3542K1225
15178d8596J1781K6041K5616k6446k6711M845M965J0235J3516Q167j526r101n863
15165a3077k192K311j6135N603P534k8122J3047K5729K461j8408j4755K3479O191
15152f334q705j9027r755M775l453j1812K1554R313J7051J1043R121m917K2432
15139C1286L106k1495n198M015R200j3396J1809l644k1774L1578K1051l5104j5153
$$ plain form
15126 -3719 377 3002 6894 8742 21024 15421 4446 -17968 -2744 -5316 -15267 -8531 14520
15113 14520 32941 30562 9669 -33301 -42150 -48642 -42276 -6458 -15140 -39054 -44496 -39559 -16000
15100 -16000 -18496 -24281 -31695 -2753 8827 17496 8694 5215 -15247 -48621 -27905 -977 -281
15087 -281 -13004 -31439 -10048 -1123 -10860 -4375 6956 4058 12063 16472 8034 -4113 -23510
15074 -23510 -25149 -9559 -11057 -25086 -22182 -28769 -38465 -35627 -25693 -33170 -23831 -38444 -17118
15061 -17118 15323 44648 24886 -10833 -9111 -19599 -14219 755 -20152 -56919 -50049 -2919
15049 -2919 38851 42692 14983 2923 -24602 -30084 -14531 -989 -19652 -22158 -22590 -30435 -30218
15036 -30218 -5414 7624 -6738 -28049 -40370 -39839 -14555 -23881 -26964 -6341 -22013 -25114 9014
$$ packed form
15126c719M096K625L892J848J2282n603j0975k2414J5224k572r951O736K3051
15113A4520J8421k379k0893m2970q849o492O366L5818q682k3914n442M937K3559
15100a6000k496n785p414K8942J1580Q669q802l479k0462l3374K0716K6928O96
15087b81j2723j8435K1391Q925r737O485J1331k898Q005M409q438j2147j9397
15074b3510j639J5590j498j4029K904o587r696K838R934p477R339j4613K1326
15061a7118L2441K9325j9762l5719J722j0488N380J4974k0907l6767O870M7130
15049b919M1770L841k7709j2060k7525n482J5553J3542j8663k506m32p845K17
15036c0218K4804J3038j4362k1311j2321N31K5284r326l083K0623j5672l101L4128
$$ plain form
15023 9014 11892 -3705 2737 19325 8137 -12107 -10814 12303 17886 6179 17886 7661 -3981
15010 -3981 -5115 6960 2110 22336 6404 -16179 -2004 15299 4863 -15709 -17680 11213
14998 11213 43458 46593 48599 56613 75608 111942 185794 329934 560814 828554 943134
14987 943134 864525 739513 578359 443715 360610 302518 210273 147845 104191 83553 59474
14976 59474 46979 49092 36410 33477 34643 45857 48762 37106 4121 -9906 -28320 -26616 -24639
14963 -24639 -29957 -15895 -17479 -22203 -20490 -51105 -56242 -50002 -54527 -55427 -34132 -20664 -18597 -16946
14949 -16946 13762 27161 10495 -12358 -9480 -19951 -31887 -37299 -30286 -10738 9141 -8180
14937 -8180 -29064 -38254 -37436 -14522 28353 11581 -19920 -28671 -45900 -59765 -55872 -74995 -86599
$$ packed form
15023I014K878j5597O442J6588j1188k0244J293K3117N583j1707J1707j0225j1642
15010c981j134J2075m850K0226j5932k2583J4175J7303j0436k0572j971K8893
14998A1213L2245L135K006Q014J8995L6334P3852J44140K30880K67740J14580
14987I43134p8609j25012j61154j34644q3105n8092r2245o2428m3654k0638k4079
14976E9474j2495K113j2682k933J166J1214K905j1656l2985j4027j8414J704J977
14963b4639n318J4062j584m724J713l0615n137O240m525r00K1295J3468K067J651
14949a6946L0708J3399j6666k2853K878j0471j1936n412P013J9548J9879j7321
14937h180k0884r190Q18K2914M2875j6772l1501q751j7229j3865L893j9123j1604
$$ plain form
14924 -86599 -75292 -58278 -55513 -37255 -17544 -17518 -3487 4147 -22086 -27240 -27320 -32043 -40110 -41120
14910 -41120 -38936 -30573 -15963 -19100 -41972 -37485 -54642 -61148 -52776 -41847 -32887 -23307 -26757
14897 -26757 -42007 -29914 -30398 8020 30909 -3852 -16239 -21430 10406 37976 33849 34535 27169
14884 27169 16370 12848 20331 -15217 -40328 -38555 -23605 -6390 -15411 -3100 23316 55931
14872 55931 44292 20730 -30708 -23321 3334 2233 9487 -24529 -26702 -5829 2854 -4831 -22117
14859 -22117 -30507 -37769 -78796 -67330 -57147 -22499 -10800 -250 -22110 -29472 -9114 -25537
14847 -25537 -21601 -25998 -30808 -11454 -1924 15064 6683 -10953 -26613 -34715 -39212 -22308 -16431
14834 -16431 -34437 -51805 -42335 -30300 2114 28788 15999 -12455 -43235 -30671 -3298 -7621
$$ packed form
14924h6599J1307J7014K765J8258J9711K6J4031P634k6233n154q0m723q067j010
14910d1120K184Q363J4610l137k2872M487j7157o506Q372J0929Q960R580l450
14897b6757j5250J2093m84L8418K2889l4761j2387n191L1836K7570m127O86p366
14884B7169j0799l522P483l5548k5111J773J4950J7215r021J2311K6416L2615
14872E5931j1639k3562n1438P387K6655j101P254l4016k173K0873Q683p685j7286
14859b2117q390p262m1027J1466J0183L4648J1699J0550k1860p362K0358j6423
14847b5537L936m397m810J9354R530J6988q381j7636j5660q102m497J6904N877
14834a6431j8006j7368R470J2035L2414K6674j2789k8454l0780J2564K7373m323
$$ plain form
14822 -7621 6919 28581 14834 6336 8606 -16792 -33473 13777 22434 -10341 -12656 -7243 -30798
14809 -30798 -29778 -15707 13378 19594 4464 -519 13253 19706 2737 8202 18519 16985 7502
14796 7502 -7044 -15855 -38482 -41511 -23609 -11426 10810 -6578 -15238 -12454 -723 -62 -6826
14783 -6826 -8445 -22022 3480 8625 3990 18436 28093 14333 -8655 -1820 20 17479 3268
14770 3268 -5015 -15190 -14730 -15257 -17439 -4134 9949 -678 -22558 -27638 -34277 -30565 3081 43982
14756 43982 18130 8983 -1047 -22185 -18998 -18786 -28263 -21101 -29406 -65098 -56998 -59775 -47056
14743 -47056 -9248 4585 42451 68242 48625 35222 22549 -6437 -17699 -2108 19858 8155
14731 8155 2853 -25356 -46064 -39243 -35836 -28350 -13976 -27120 -30709 -34325 -71067 -72125 -70201
$$ packed form
14822g621J4540K1662j3747q498K270k5398j6681M7250Q657l2775k315N413k3555
14809c0798J020J4071K9085O216j5130m983J3772O453j6969N465J0317j534r483
14796G502j4546q811k2627l029J7902J2183K2236j7388q660K784J1731O61o764
14783f826j619j3577K5502N145m635J4446R657j3760k2988O835J840J7459j4211
14770C268q283j0175M60n27k182J3305J4083j0627k1880n080o639L712L3646M0901
14756D3982k5852r147j0030k1138L187K12r477P162q305l5692Q100k777J2719
14743d7056L7808J3833L7866K5791j9617j3403j2673k8986j1262J5591K1966j1703
14731H155n302k8209k0708O821L407P486J4374j3144l589l616l6742j058J924
$$ plain form
14718 -70201 -48308 -44428 -48246 -37227 -9529 9860 17232 17020 19796 10840 26300 23992 1412
14705 1412 -3697 -3724 -19359 -7284 17300 29709 1915 -24300 -42950 -40752 -27756 -15272 -1255
14692 -1255 15431 11109 -344 -16074 -6607 -11575 -27136 -27695 -22916 -47424 -54449 -25445 -33040
14679 -33040 -33132 -10005 -2616 -8289 -13431 -14779 -14955 -22137 -6012 -18464 -15480 -2865 -3458 -10483
14665 -10483 -65 27288 30837 20539 16319 -10137 -39808 -46709 -48541 -60713 -72088 -82659
14653 -82659 -61536 -55822 -48813 -41262 -32039 -56319 -24799 3910 2745 17899 12428 -10968 -7168
14640 -7168 -34813 -57341 -52560 -55652 -34683 -13784 -19892 -50967 -57362 -72873 -49118 -16723 -13183
14627 -13183 -10198 -26159 -1455 223 23586 25495 -4084 -24131 -8079 15115 22211 20609 13925
$$ packed form
14718g0201K1893L880l818J1019K7698J9389P372k12K776q956J5460k308k2580
14705A412n109k7j5635J2075K4584J2409k7794k6215j8650K198J2996J2484J4017
14692a255J6686m322j1453j5730R467m968j5561n59M779k4508p025K9004p595
14679c3040r2K3127P389n673n142j348j76p182J6125j2452K984J2615n93p025
14665a0483J0418K7353L549j0298m220k6456k9671o901j832j2172j1375j0571
14653h2659K1123N714P009P551R223k4280L1520K8709j165J5154n471k3396L800
14640g168k7645k2528M781l092K0969K0899o108l1075o395j5511K3755L2395L540
14627a3183K985j5961K4704J678K3363J909k9579k0047J6052K3194P096j602o684
$$ plain form
14614 13925 5757 3016 -5224 -1590 19292 5534 32002 22545 24897 18274 44 -7530 -20738
14601 -20738 -5596 -3662 -1804 -3391 -17139 -18166 1774 11418 14993 22161 12023 -14117 -42692
14588 -42692 -31765 -7574 24566 14428 -3043 -7465 -1888 -13827 -31228 -41410 -39585 -23187
14576 -23187 -23205 -11436 -8006 -2838 -8272 -34471 -36991 -28842 -19701 -3289 -16639 -4980 13721
14563 13721 3166 2960 -12568 -33122 -26182 -19400 -1120 18805 14434 5316 -17618 -9119 -16031
14550 -16031 -27579 -40761 -23925 -3847 -7164 -7991 -4632 -7162 -2654 -2415 -24354 -34396 -30052
14537 -30052 -37441 -35354 -35343 -29835 -15792 -31446 -13340 3546 16976 6524 -4181 -14050 30066
14524 30066 45772 33272 15839 2093 -1452 -9432 -25388 -6630 1940 3495 -8701 -5439 -23054
$$ packed form
14614A3925q168k741q240L634K0882j3758K6468r457K352o623j8230p574j3208
14601b0738J5142J934J858j587j3748j027J9940R644L575P168j0138k6140k8575
14588d2692J0927K4191L2140j0138j7471m422N577j1939j7401j0182J825J6398
14576b3187j8J1769L430N168n434k6199k520Q149R141J6412j3350J1659J8701
14563A3721j0555k06j5528k0554O940O782J8280J9925m371r118k2934Q499o912
14550a6031j1548j3182J6836K0078l317q27L359k530M508K39k1939j0042M344
14537c0052p389K087J1N508J4043j5654J8106J6886J3430j0452j0705r869M4116
14524C0066J5706j2500j7433j3746l545p980j5956J8758Q570J555j2196L262j7615
$$ plain form
14511 -23054 -16531 -3582 2476 -11497 -9833 -10291 5917 16560 9316 -21400 -6196 17036 24567
14498 24567 50586 60604 72109 40213 17606 19349 6068 -8216 10165 10370 256 21116
14486 21116 34478 48450 28657 41432 42523 10530 8522 16353 33335 27225 21314 6284 6083
14473 6083 19750 37616 20361 8151 21202 29300 41460 43406 44339 36326 53018 33923 26288
14460 26288 12448 14281 17657 2093 -14225 2600 -2292 -34756 -36503 -12994 -6955 8114 9677
14447 9677 -1134 6809 41352 5207 -8701 -8431 5240 -579 -4377 -12102 -1662 2571 -18254
14434 -18254 -30671 -30836 3516 -12868 -32649 -1968 18726 30212 33607 -2072 -21516 -13710
14422 -13710 8475 39829 45472 30331 17256 -377 -23843 -22498 -32303 -22331 -23036 8565 16772
$$ packed form
14511b3054O523J2949O058j3973J664m58J6208J0643p244l0716J5204K3232P531
14498B4567K6019J0018J1505l1896k2607J743j3281j4284J8381K05j0114K0860
14486B1116J3362J3972j9793J2775J091l1993k008P831J6982o110n911j5030k01
14473F083J3667J7866j7255j2210J3051Q098J2160J946R33q013J6692j9095p635
14460B6288j3840J833L376j5564j6318J6825m892l2464j747K3509O039J5069J563
14447I677j0811P943L4543l6145j3908K70J3671n819l798p725J0440M233k0825
14434a8254j2417j65L4352j6384j9781L0681K0694J1486L395l5679j9444P806
14422a3710K2185L1354N643j5141j3075j7633k3466J345r805R972p05L1601Q207
$$ plain form
14409 16772 8228 13043 3300 -1474 -2387 -11855 -16960 -29812 -49162 -29102 14511 -17322 -19281
14396 -19281 -4807 -10996 -27802 -12256 -5710 -9354 -3007 2652 12610 7398 -6358 -9132 1270
14383 1270 -24003 -30855 -24273 -27665 -14060 3388 17626 16261 13363 -12895 -3516 -1792 18284
14370 18284 34857 22390 20273 -3225 5774 33629 44979 33032 24659 23003 17481 11323 9880
14357 9880 10987 9076 16888 20905 4210 6062 9907 -11897 -23888 -6243 420 20706 20988 -2152
14343 -2152 -4685 6413 12355 -19205 -16303 -22095 -7632 -26252 -29152 -5177 2522 18861 35150
14330 35150 11106 -7549 12111 18935 644 10943 24657 19981 12393 8256 20404 4625
14318 4625 -1242 -22612 -11603 -12199 20700 41191 32321 8724 11158 17245 17154 23197 32985 5399
$$ packed form
14409A6772q544M815r743m774r13r468n105j2852j9350K0060M3613l1833j959
14396a9281J4474o189j6806J5546O546l644O347N659R958n212j3756k774J0402
14383A270k5273o852O582l392J3605J7448J4238j365k898k6258R379J724K0076
14370A8284J6573j2467k117k3498Q999K7855J1350j1947q373j656n522o158j443
14357I880J107j911P812M017j6695J852L845k1804j1991J7645O663K0286K82k3140
14343b152k533J1098N942l1560K902n792J4463j8620k900K3975P699J6339J6289
14330C5150k4044j8655J9660O824j8291J0299J3714m676p588m137J2148j5779
14318D625n867k1370J1009n96L2899K0491q870k3597K434O087r1O043R788k7586
$$ plain form
14304 5399 -18424 -26489 -10440 -7739 -26909 -34234 -36992 -34481 -15689 714 26606 61504 57792
14291 57792 33108 6137 30157 58857 56777 38473 39190 51545 49682 17882 9471 -1629 -13393
14278 -13393 -6134 21428 28808 18439 14752 19583 33472 10514 10557 -6295 -11155 -15660 -23393 -47160
14264 -47160 -44233 -46633 -29365 -9299 20689 20006 18768 25200 28219 26056 21923 23081 13616 14380
14250 14380 -16944 -27367 -25870 15742 31022 38756 36322 12980 112 -8892 -19379 1511
14238 1511 -8728 -8836 13027 17905 28741 40245 54373 29460 19245 22398 24977 13564 14968
14225 14968 26921 1358 8498 32425 22611 23290 27424 15140 -5034 25896 32719 31377 18844
14212 18844 -4366 3144 26380 35213 24832 40410 28895 21747 20265 -6162 -17084 2202
$$ packed form
14304E399k3823q065J6049K701j9170p325k758K511J8792J6403K5892L4898l712
14291E7792k4684k6971K4020K8700k080j8304P17J2355j863l1800q411j1100j1764
14278a3393P259K7562P380j0369l687M831J3889k2958M3j6852m860m505p733k3767
14264d7160K927k400J7268K0066K9988o83j238O432L019k163m133J158r465P64
14250A4380l1324j0423J497M1612J5280P734k434k3342j2868r004j0487K0890
14238A511j0239j08K1863M878J0836J1504J4128k4913j0215L153K579j1413J404
14225A4968J1953k5563P140K3927r814O79M134j2284k0174L0930O823j342j2533
14212A8844k3210P510K3236Q833j0381J5578j1515p148j482k6427j0922J9286
$$ plain form
14200 2202 7914 4843 11329 19124 16800 36761 33353 22988 20581 -7158 766 25793 33404 67913
14186 67913 71772 39282 28929 29948 9200 9004 -8673 -5235 9404 1292 7044 29048 39166
14173 39166 42594 32334 18650 -3668 -11225 6122 -70 20372 6561 4551 9389 48499 51287
14160 51287 49273 20984 -5595 15921 44253 57571 42335 37883 34500 12914 844 9911
14148 9911 22078 28700 25707 -3155 -18461 7044 2075 20041 29437 43773 42909 38403 45024
14135 45024 41328 52506 63030 51413 41433 63276 47842 23692 8881 4919 29955 36776
14123 36776 47498 58805 51953 34736 52531 47365 43380 61313 53318 37576 41231 28387 24478
14110 24478 37896 55647 56609 60795 39274 39052 61590 87318 95599 123344 136584 124047 140613
$$ packed form
14200B202N712l071O486P795k324J9961l408j0365k407k7739P924K5027P611L4509
14186F7913L859l2490j0353J019k0748j96j7677L438J4639q112N752K2004J0118
14173C9166L428j0260j3684k2318p557J7347o192K0442j3811k010M838L9110K788
14160E1287k014k8289k6579K1516K8332J3318j5236m452l383k1586j2070R067
14148I911J2167O622k993k8862j5306K5505m969J7966R396J4336q64m506O621
14135D5024l696J1178J0524j1617r980K1843j5434k4150j4811l962K5036O821
14123C6776J0722J1307o852j7217J7795n166l985J7933p995j5742L655j2844l909
14110B4478J3418J7751R62M186k1521k22K2538K5728Q281K7745J3240j2537J6566
$$ plain form
14097 140613 162430 154846 137924 145208 175730 207857 180756 152822 156766 159922 170032 158869
14085 158869 131453 147363 178332 185782 157898 152508 172019 188300 210376 226731 262903 317611
14073 317611 344584 387804 437536 505817 593557 702703 803568 949674 1077804 1230220
14063 1230220 1372176 1474542 1550753 1629387 1663072 1665400 1674413 1690249 1715147 1698567 1630790
14052 1630790 1525991 1426493 1329486 1197013 1038795 916511 817915 715448 594808 488528
14042 488528 415454 345791 326078 268736 234313 230551 234951 241716 229286 209056 187956 177154
14030 177154 178279 188361 172208 160765 171047 177678 124744 118904 150084 160055 135330 107080
14018 107080 107191 89244 89335 88675 105410 86513 85947 84992 78154 80401 59574 46269 66315 78168
$$ packed form
14097A40613K1817p584j6922P284L0522L2127k7101k7934L944L156J0110j1163
14085A58869k7416J5910L0969P450k7884n390J9511J6281K2076J6355L6172N4708
14073C17611K6973M3220M9732O8281Q7740J09146J00865J46106J28130J52416
14063A230220J41956J02366P6211P8634L3685K328R013J5836K4898j6580o7777
14052A630790j04799r9498r7007j32473j58218j22284r8596j02467j20640j06280
14042D88528p3074o9663j9713n7342l4423l762M400O765j2430k0230k1100j0802
14030A77154J125J0082j6153j1443J0282O631n2934n840L1180R971k4725k8250
14018A07080J11j7947R1o60J6735j8897n66r55o838K247k0827j3305K0046J1853
$$ plain form
14004 78168 61244 53357 50614 32755 22682 43901 55328 40342 42329 52821 38348 39453
13992 39453 43569 23377 46121 62947 42695 30223 13466 30359 35159 15432 -9244 -22612
13980 -22612 -15790 -1459 6668 16652 72428 63859 62299 66936 52025 26762 42268 78605 105502
13967 105502 100728 82225 94129 77833 36720 49092 47631 43642 49509 39144 29824 41075
13955 41075 66418 60644 65631 50424 41489 37910 5408 -28493 -55215 -41587 10563 49876
13943 49876 47999 43625 39734 54716 52390 72616 55327 47166 50162 38746 22503 462 20719
13930 20719 51391 50485 55334 38658 44328 30322 2343 -15604 -15925 25096 29516 22871 18646
13917 18646 14433 14748 12688 414 -11047 9360 309 -8633 7901 46449 13608 2030 11347
$$ packed form
14004G8168j6924p887k743j7859j0073K1219J1427j4986J987J0492j4473J105
13992C9453M116k0192K2744J6826k0252j2472j6757J6893M800j9727k4676j3368
13980b2612O822J4331Q127R984N5776q569j560M637j4911k5263J5506L6337K6897
13967A05502m774j8503J1904j6296m1113J2372j461l989N867j0365r320J1251
13955D1075K5343n774M987j5207q935l579l2502l3901k6722J3628N2150L9313
13943D9876j877m374l891J4982k326K0226j7289q161K996j1416j6243k2041K0257
13930B0719L0672r06M849j6676N670j4006k7979j7947l21M1021M420o645m225
13917A8646m213L15k060j2274j1461K0407r051q942J6534L8548l2841j1578R317
$$ plain form
13904 11347 34189 5248 -9548 -869 -14816 -19810 -9792 29865 53028 57486 30082 20164
13892 20164 24597 24833 -8552 -5943 2698 14797 28528 26934 34164 67635 86163 81359 52459
13879 52459 29659 24306 12582 9110 31877 67625 84889 91240 80400 72924 83083 82529 81017
13866 81017 113805 133865 153602 173977 146407 126417 101041 81481 48722 39371 44691 51313
13854 51313 56092 59891 94625 102351 69842 52821 23037 34687 20248 -3919 -25326 -10135
13842 -10135 508 -2494 -9359 27454 45917 57575 48338 40375 35080 54733 55821 49447 42511
13829 42511 37054 51239 68001 88380 90175 83869 63216 63283 55452 39491 30541 32691 46762
13816 46762 74320 71041 61745 54025 29972 28069 9564 -13498 37699 45727 40756 30956 -6530
$$ packed form
13904A1347K2842k8941j4796Q679j3947m994J0018L9657K3163M458k7404r918
13892B0164M433K36l3385K609Q641J2099J3731j594P230L3471J8528m804k8900
13879E2459k2800n353j1724l472K2767L5748J7264O351j0840p476J0159n54j512
13866H1017L2788K0060J9737K0375k7570j9990k5376j9560l2759r351N320O622
13854E1313M779L799L4734P726l2509j7021k9784J1650j4439k4167k1407J5191
13842a0135J0643l002o865L6813J8463J1658r237p963n295J9653J088o374o936
13829D2511n457J4185J6762K0379J795o306k0653O7p831j5961q950K150J4071
13816D6762K7558l279r296p720k4053j903j8505k3062N1197Q028m971r800l7486
$$ plain form
13803 -6530 -27044 -7519 16024 6621 14400 26642 42607 52436 63806 68733 63624 59682 58105
13790 58105 33176 10374 28929 18904 -12359 -30605 -36103 -25103 -19764 -24375 -47021 -44889
13778 -44889 -36202 -43237 -42157 -16997 -8126 9241 7710 9285 -2618 10852 27773 28551 14742
13765 14742 6577 14834 18919 42874 51673 53932 71904 68476 65711 74160 78359 83926 91740 101087
13751 101087 66833 53805 59815 40987 21954 20311 20602 22196 48536 64590 62635 31103 33516
13738 33516 21576 41859 44455 14626 20896 17434 7975 4610 36972 38832 43758 59739 66631
13725 66631 79301 79375 76276 80498 72719 71486 71154 78542 90452 88706 76561 52407 30304 40272
13711 40272 45055 44943 62726 70033 74679 77552 51348 11407 -8402 -29161 -6017 13897 12629
$$ packed form
13803f530k0514J9525K3543r403P779J2242J5965R829J1370M927n109l942j577
13790E8105k4929k2802J8555j0025l1263j8246n498J1000N339m611k2646K132
13778d4889Q687p035J080K5160Q871J7367j531J575j1903J3470J6921P78j3809
13765A4742q165Q257M085K3955Q799K259J7972l428k765Q449M199N567P814R347
13751A01087l4254j3028O010j8828j9033j643K91J594K6340J6054j955l1532K413
13738C3516j1940K0283K596k9829O270l462r459l365L2362J860M926J5981O892
13725F6631J2670P4l099M222p779j233l32P388J1910j746j2145k4154k2103R968
13711D0272M783j12J7783P307M646K873k6204l9941j9809k0759K3144J9914j268
$$ plain form
13698 12629 5313 -905 -12480 24936 59990 67443 73806 67068 38277 27809 63817 77325 70682
13685 70682 77192 74685 37394 19250 6620 41416 66914 73335 42719 46281 60624 62377 85674
13672 85674 90502 51942 50383 40814 32411 52444 67492 69278 38983 39626 32857 48371 47849 14982
13658 14982 31110 60643 80202 95816 105730 80267 50609 44234 36747 32122 43974 40349 39728
13645 39728 61296 75979 88159 57460 18013 18850 44548 46416 49403 57240 55236 27662 45639
13632 45639 69814 60711 77505 79487 75926 78211 71640 60427 75943 85144 85057 61745 59125 87718
13618 87718 61837 59755 75516 59849 49519 11398 461 35317 70302 73536 37337 23105
13606 23105 36412 36121 33838 39722 58253 66596 69989 86176 87650 84354 87588 103578 98975 93763
$$ packed form
13698A2629p316o218j1575L7416L5054P453O363o738k8791j0468L6008J3508o643
13685G0682O510k507l7291j8144j2630L4796K5498O421l0616L562J4343J753K3297
13672H5674M828l8560j559r569q403K0033J5048J786l0295O43o769J5514n22l2867
13658A4982J6128K9533J9559J5614R914k5463k9658o375p487m625J1852l625o21
13645C9728K1568J4683J2180l0699l9447Q37K5698J868K987P837k004k7574J7977
13632D5639K4175r103J6794J982l561K285o571j1213J5516R201q7k3312k620K8593
13618H7718k5881k082J5761j5667j0330l8121j0937L4856L4985L234l6199j4232
13606B3105J3307k91k283N884J8531Q343L393J6187J474l296L234J5990m603n212
$$ plain form
13592 93763 92224 91776 71111 50778 55940 53409 45637 41343 68666 89172 69405 31531 26256
13579 26256 71561 79628 84916 83070 75241 78673 71216 71304 52838 49863 36263 66739 81814 53958
13565 53958 51514 72353 82062 79874 75308 82307 96535 110995 127279 130912 143008 139241 140789
13552 140789 161493 154179 162405 165955 161683 166225 152909 168384 175555 155088 149968 140976 141275
13539 141275 145325 143311 161696 196470 181126 156695 145524 145592 147768 146758 144176 137557 149305
13526 149305 146688 119378 102178 115566 121946 107079 97299 92045 65982 70290 79541 64182 40045
13513 40045 48439 82170 77389 48291 67847 95218 118338 104920 91937 58920 46983 74922
13501 74922 86031 88832 92462 79578 86561 116442 125671 126060 130012 136449 144113 105157 99561 106195
$$ packed form
13592I3763j539m48k0665k0333N162k531p772m294K7323K0506j9767l7874n275
13579B6256M5305Q067N288j846p829L432p457Q8j8466k975j3600L0476J5075k7856
13565E3958k444K0839R709k188m566O999J4228J4460J6284L633J2096l767J548
13552A40789K0704p314Q226L550m272M542j3316J5475P171k0467n120q992K99
13539A41275M050k014J8385L4774j5344k4431j1171O8K176j010k582o619J1748
13526A49305k617k7310j7200J3388O380j4867r780n254k6063M308R251j5359k4137
13513D0045Q394L3731m781k9098J9556K7371K3120j3418j2983l3017j1937K7939
13501G4922J1109K801L630j2884O983K9881R229L89L952O437P664l8956n596O634
$$ plain form
13487 106195 78110 71290 68639 55927 71282 85535 67102 74071 92085 85067 98428 105042
13475 105042 106375 86540 54832 48383 74089 71509 63484 62566 61559 52489 56821 60394 67002 77238
13461 77238 72670 77876 63101 53942 61932 62713 48986 75892 83817 75091 46588 57462 73791
13448 73791 79041 51604 68589 69876 85401 120318 123963 106409 85638 49302 32708 52889
13436 52889 69747 94194 83544 68159 77364 95724 104961 108753 83515 102022 96254 99420 93736
13423 93736 93838 70505 46615 60976 73262 83940 73239 65986 48390 60975 53514 42328
13411 42328 66814 85918 91614 93698 80665 76305 95125 99580 97114 84161 95408 98858 89515
13398 89515 69227 96543 110900 123261 91759 89602 122925 118777 113192 136205 158379 169668
$$ packed form
13487A06195k8085o820k651j2712J5355J4253j8433O969J8014p018J3361O614
13475A05042J333j9835l1708o449K5706k580q025r18j007r070M332L573O608J0236
13461G7238m568N206j4775r159P990P81j3727K6906P925q726k8503J0874J6329
13448G3791N250k7437J6985J287J5525L4917L645j7554k0771l6336j6594K0181
13436E2889J6858K4447j0650j5385R205J8360R237L792k5238J8507n768L166n684
13423I3736J02k3333k3890J4361J2286J0678j0701p253j7596J2585p461j1186
13411D2328K4486J9104N696K084j3033m360J8820M455k466j2953J1247L450r343
13398H9515k0288K7316J4357J2361l1502k157L3323m148n585K3013K2174J1289
$$ plain form
13386 169668 171268 126000 121030 125283 141099 104812 81336 93156 122461 128336 121455 111909 110770
13373 110770 104426 117969 124975 146739 159795 148878 147081 135277 129782 109790 76078 68392
13361 68392 70510 60220 59118 89415 107094 116944 128793 129861 120117 120507 125021 132940 125766 119767
13347 119767 112571 100288 102182 115613 116988 127996 134732 137735 122013 87518 99828 111950
13335 111950 99493 114847 112775 117719 96813 94334 104927 78274 66076 64418 83012 104651
13323 104651 119322 93789 79865 91894 95531 71561 27110 16213 25118 44597 51620 60225
13311 60225 101453 130971 154817 149373 123902 111448 107019 102061 86844 103015 89376 78500
13299 78500 91423 106248 109613 98519 110206 147181 143612 121273 126456 161276 153012 105379
$$ packed form
13386A69668J600m5268m970M253J5816l6287k3476J1820K9305N875o881r546j139
13373A10770o344J3543P006K1764J3056j0917j797j1804n495j9992l3712p686
13361F8392K118j0290j102L0297J7679R850J1849J068r744L90M514P919p174n999
13347A19767p196j2283J894J3431J375J1008O736L003j5722l4495J2310J2122
13335A11950j2457J5354k072M944k0906k479J0593k6653j2198j658J8594K1639
13323A04651J4671k5533j3924J2029L637k3970m4451j0897Q905J9479P023Q605
13311F0225M1228K9518K3846n444k5471j2454m429m958j5217J6171j3639j0876
13299G8500J2923J4825L365j1094J1687L6975l569k2339N183L4820q264m7633
$$ plain form
13287 105379 98927 105386 101718 117039 101095 75078 62233 47397 53976 49034 60814 76791
13275 76791 100370 104402 125849 108665 95535 101705 97791 109460 105040 107135 122006 123833 121212
13262 121212 123809 114850 71323 68895 75170 64775 69270 94747 85911 54707 71595 83661 89366
13249 89366 98083 111287 99940 97813 95187 116083 132530 84085 83118 99969 83020 104539 126242
13236 126242 144891 151016 129470 123148 118809 112968 113273 118002 110329 95286 79818 99156 115185
13223 115185 132852 143410 161520 171468 162498 168137 220429 235308 233945 260250 296370 289063
13211 289063 291353 306539 351720 386601 428547 489189 580709 689924 815202 904720 950131
13200 950131 948280 876171 787058 711979 640339 569583 489534 470812 460318 441874 456646 457369
$$ packed form
13287A05379o452O459l668J5321j5944k6017j2845j4836O579m942J1780J5977
13275G6791K3579M032K1447j7184j3130O170l914J1669m420K095J4871J827k621
13262A21212K597q959m3527k428O275j0395M495K5477q836l1204J6888J2066N705
13249H9366Q717J3204j1347k127k626K0896J6447m8445r67J6851j6949K1519K1703
13236A26242J8649O125k1546o322m339n841L05M729p673j5043j5468J9338J6029
13223A15185J7667J0558J8110R948q970N639N2292J4879j363K6305L6120p307
13211B89063K290J5186M5181L4881M1946O0642R1520J09215J25278Q9518M5411
13200I50131j851p2109q9113p5079p1640p0756q0049j8722j0494j8444J4772P23
$$ plain form
13188 457369 461367 523112 577129 600537 597458 616148 620328 643546 671045 682553 707979 740595
13176 740595 790888 834790 893227 964733 1015416 1056144 1060461 1016393 960073 882497 816412 772058
13164 772058 716125 705305 701882 699948 706799 715613 701634 653227 615391 575012 541118 536049
13152 536049 516957 515158 500213 495634 482145 495242 523626 563804 665375 790815 894843
13141 894843 992017 1040251 1006238 909288 815064 712575 622772 551725 504754 428273 334133
13130 334133 296952 278287 258363 249747 238606 233149 203334 202657 226219 224130 200458 199732 203720
13117 203720 199841 180551 157873 152797 183426 197281 179970 148866 142625 144144 147037 142146 138881
13104 138881 143136 140188 151851 159539 154630 141583 145375 141644 130055 119630 124931 98176 92460
$$ packed form
13188D57369L998O1745N4017K3408l079J8690M180K3218K7499J1508K5426L2616
13176G40595N0293M3902N8437P1506N0683M0728M317m4068n6320p7576o6085m4354
13164G72058n5933j0820l423j934O851Q814j3979m8407l7836m0379l3894n069
13152E36049j9092j799j4945m579j3489J3097K8384M0178J01571J25440J04028
13141H94843R7174M8234l4013r6950r4224j02489q9803p1047m6971p6481r4140
13130C34133l7181j8665j9924q616j1141n457k9815o77K3562k089k3672p26L988
13117B03720l879j9290k2678n076L0629J3855j7311l1104o241J519K893m891l265
13104A38881M255k948J1663P688m909j3047L792l731j1589j0425N301k6755n716
$$ plain form
13091 92460 95363 108434 126881 109405 119272 143480 133179 146910 128239 121970 139394 166137
13079 166137 175294 167768 148614 150740 183367 177351 166830 180470 199971 200540 189804 174043 161357
13066 161357 160903 149526 159083 175524 191825 223882 229350 206943 202013 186759 178860 200674 222077
13053 222077 241079 237830 239805 239873 221769 241826 281420 309011 356081 373829 386196 433251
13041 433251 476350 535920 609775 718134 867879 1022389 1202777 1375876 1538934 1664764
13031 1664764 1757320 1768169 1699420 1556880 1386295 1230929 1068236 902768 784858 685831
13021 685831 601028 523939 443081 376095 349169 362463 355194 298008 271546 277867 275135 263345
13009 263345 274185 288010 330591 319126 300662 278242 249525 269803 300728 316401 325271 314959
$$ packed form
13091I2460K903J3071J8447j7476R867K4208j0301J3731j8671o269J7424K6743
13079A66137R157p526j9154K126L2627o016j0521J3640J9501N69j0736j5761j2686
13066A61357m54j1377R557J6441J6301L2057N468k2407m930j5254p899K1814K1403
13053B22077J9002l249J975O8j8104K0057L9594K7591M7070J7748J2367M7055
13041D33251M3099N9570P3855J08359J49745J54510J80388J73099J63058J25830
13031A664764R2556J0849o8749j42540j70585j55366j62693j65468j17910r9027
13021F85831q4803p7089q0858o6986k6926J3294p269n7186k6462O321k732j1790
13009B63345J0840J3825M2581j1465j8464k2420k8717K0278L0925J5673Q870j0312
$$ plain form
12997 314959 328190 318084 322273 341954 327092 301589 280484 264339 263886 284332 295774 314603
12985 314603 306456 302993 315365 334216 351937 337482 330865 332169 329892 327528 332429 368439 392364
12972 392364 386819 363499 337413 327555 320609 329760 326755 324494 353870 352989 340597 342045 326904
12959 326904 302638 293624 294920 291010 325973 350308 341558 341791 337160 336924 333121 306707 273397
12946 273397 283509 294501 282133 263539 258468 256337 239979 219823 188217 175602 187292 204360
12934 204360 217779 209456 219954 234202 249254 235805 222139 215384 231077 248808 243112 239817
12922 239817 234910 231256 239601 249430 242176 258641 228460 195798 179609 187873 211161 193016 201120
12909 201120 225534 243114 270266 310166 303771 291439 305388 305662 307252 296105 303053 313674
$$ packed form
12997C14959J3231j0106M189J9681j4862k5503k1105j6145m53K0446J1442J8829
12985C14603q147l463J2372J8851J7721j4455o617J304k277k364M901L6010K3925
12972C92364n545k3320k6086r858o946R151l005k261K9376q81j2392J448j5141
12959C26904k4266r014J296l910L4963K4335q750K33m631k36l803k6414l3310
12946B73397J0112J0992j2368j8594n071k131j6358k0156l1606j2615J1690J7068
12934B04360J3419q323J0498J4248J5052j3449j3666o755J5693J7731n696l295
12922B39817m907l654Q345R829p254J6465l0181l2662j6189Q264K3288j8145Q104
12909B01120K4414J7580K7152L9900o395j2332J3949K74J590j1147O948J0621
$$ plain form
12897 313674 317356 300300 327315 315021 314647 362060 397900 393545 423294 454951 460215 459299 451804
12884 451804 455986 454200 428081 425629 442766 480516 524901 620052 702551 766106 823167 872790
12872 872790 925467 947964 1003135 1030715 1022628 1037159 1043432 1009083 964694 956903 945570 946184
12860 946184 943380 921323 904659 904317 913019 883607 838702 813287 823555 809583 814396 850062
12848 850062 870657 919909 973632 1032440 1033825 1029654 1022591 1010356 1017283 1038004 1033129 1016658
12836 1016658 1008253 1014976 1039168 1031074 1044576 1039034 1032883 1024328 1033224 1014660 1018675 1050295 1062991
12823 1062991 1074508 1100537 1105943 1132438 1194030 1243621 1288973 1306217 1326674 1362834 1393974
12812 1393974 1427108 1463769 1454030 1458978 1487713 1496617 1474172 1467318 1472293 1496536 1502632 1512205 1564704
$$ packed form
12897C13674L682j7056K7015j2294l74M7413L5840m355K9749L1657N264r16p495
12884D51804M182j786k6119k452J7137L7750M4385R5151Q2499O3555N7061M9623
12872H72790N2677K2497N5171K7580q087J4531O273l4349m4389p791j1333O14
12860I46184k804k2057j6664l42Q702k9412m4905k5415J0268j3972M813L5666
12848H50062K0595M9252N3723N8808J385m171p063j2235O927K0721m875j6471
12836A016658q405O723K4192q094J3502n542o151q555Q896j8564M015L1620J2696
12823A062991J1517K6029N406K6495O1592M9591M5352J7244K0457L6160L1140
12812A393974L3134L6661r739M948K8735Q904k2445o854M975K4243O096R573N2499
$$ plain form
12799 1564704 1637098 1705391 1789882 1880224 1952015 2052292 2138578 2254574 2359705 2455560 2559291
12788 2559291 2669706 2782732 2908461 3025514 3151811 3335509 3525776 3733290 3954770
12779 3954770 4167829 4451012 4797456 5162917 5555394 6022879 6537620 7161086 7859271
12770 7859271 8673673 9613862 10685668 11863339 13111963 14502191 16151043 18179184
12762 18179184 20706491 23975412 28241036 33949442 41644456 52103075 66254212 84841955
12754 84841955 107739441 132216946 151914976 161247948 159917903 150457520 135932899
12747 135932899 119591004 103729002 89651257 78040860 69209681 63121955 59558480
12740 59558480 58208226 58824639 61369111 65923205 72271859 79960031 88169527 95875946
$$ packed form
12799A564704P2394O8293Q4491R0342P1791J00277Q6286J15996J05131R5855J03731
12788B559291J10415J13026J25729J17053J26297J83698J90267K07514K21480
12779C954770K13059K83183L46444L65461L92477M67485N14741O23466O98185
12770G859271Q14402R40189J071806J177671J248624J390228J648852K028141
12762A8179184K527307L268921M265624N708406P695014J0458619J4151137J8587743
12754H4841955K2897486K4477505J9698030R332972j330045r460383j4524621
12747A35932899j6341895j5862002j4077745j1610397q831179o087726l563475
12740E9558480j350254O16413K544472M554094O348654P688172Q209496P706419
$$ plain form
12732 95875946 102195745 106883497 110290050 113191530 116523591 121324723 128798367 139438827
12724 139438827 152753910 167080750 179054325 184979793 183651756 176462011 165656960
12717 165656960 153530257 141884291 131910170 124156750 118783824 115630559 114209176 113619223
12709 113619223 112640696 110087739 105514173 99203943 91859480 84314509 77325044 71387237
12701 71387237 66872430 64061581 63232324 64763564 69132761 77129050 89611094 107058755
12693 107058755 128791013 152152710 171834404 181502101 178757631 166218050 147848724
12686 147848724 127210273 106979553 88646223 72871393 59812835 49339823 41093321
12679 41093321 34629671 29507229 25352759 21926983 19123308 16807741 14817016 13111616
$$ packed form
12732I5875946O319799M687752L406553K901480L332061M801132P473644J0640460
12724A39438827J3315083J4326840J1973575N925468j328037p189745j0805051
12717A65656960j2126703j1645966r974121p753420n372926l153265j421383n89953
12709A13619223r78527k552957m573566o310230p344463p544971o989465n937807
12701G1387237m514807k810849q29257J531240M369197P996289J2482044J7447661
12693A07058755K1732258K3361697J9681694R667697k744470j2539581j8369326
12686A47848724k0638451k0230720j8333330j5774830j3058558j0473012q246502
12679D1093321o463650n122442m154470l425776k803675k315567j990725j705400
$$ plain form
12671 13111616 11672990 10492534 9497454 8640026 7923246 7323448 6793874 6368244 6024643
12662 6024643 5711242 5422885 5159499 4931233 4794423 4686443 4594683 4511321 4462225 4405435
12652 4405435 4339508 4285797 4262418 4283614 4283797 4275422 4330480 4408905 4501212 4607047 4749013
12641 4749013 4928230 5124002 5319372 5562562 5853269 6193732 6610319 7126612 7738134
12632 7738134 8471560 9332068 10379630 11686736 13226572 14977747 16876999 19005696
12624 19005696 21331938 23864846 26727263 30122089 34342490 39941410 47817603 59359542
12616 59359542 76234331 99446911 128239307 160796107 195161248 229387714 259935029
12609 259935029 282496608 293429428 292150753 279951056 258790395 230595759 198128632
$$ packed form
12671A3111616j438626j180456r95080q57428p16780n99798n29574m25630l43601
12662F024643l13401k88357k63386k28266j36810j07980r1760q3362m9096n6790
12652D405435o5927n3711k3379K1196J83q375N5058P8425R2307J05835J41966
12641D749013J79217J95772J95370K43190K90707L40463M16587N16293O11522
12632G738134P33426Q60508J047562J307106J539836J751175J899252K128697
12624A9005696K326242K532908K862417L394826M220401N598920P876193J1541939
12616E9359542J6874789K3212580K8792396L2556800L4365141L4226466L0547315
12609B59935029K2561579J0932820j278675j2199697k1160661k8194636l2467127
$$ plain form
12602 198128632 164873591 133963266 107258297 85403166 68228645 54955813 44810247
12595 44810247 37123135 31274613 26688099 22922298 19708212 16938198 14625512 12707728
12587 12707728 11100290 9746285 8660335 7795208 7050265 6433137 5920017 5507377 5152658
12578 5152658 4822571 4525931 4274944 4086208 3940360 3799474 3621021 3447170 3235990
12569 3235990 3046426 2891506 2728539 2600538 2521500 2429128 2361722 2281147 2195471 2132280
12559 2132280 2058574 1978873 1912291 1854725 1834937 1802788 1776966 1769555 1782294 1820519 1846133
12548 1846133 1862188 1832418 1814710 1833128 1840719 1808849 1779076 1748048 1690466 1617539 1536498
12537 1536498 1475052 1425337 1382186 1346568 1334939 1307381 1266438 1247679 1208982 1158134 1094258
$$ packed form
12602A98128632l3255041l0910325k6704969k1855131j7174521j3272832j0145566
12595D4810247p687112n848522m586514l765801l214086k770014k312686j917784
12587A2707728j607438j354005j085950q65127p44943o17128n13120m12640l54719
12578E152658l30087k96640k50987j88736j45848j40886j78453j73851k11180
12569C235990j89564j54920j62967j28001p9038r2372o7406q0575q5676o3191
12559B132280p3706p9701o6582n7566j9788l2149k5822p411J2739L8225K5614
12548A846133J6055k9770j7708J8418P591l1870k9773l1028n7582p2927q1041
12537A536498o1446m9715m3151l5618j1629k7558m0943j8759l8697n0848o3876
$$ plain form
12526 1094258 1023366 956059 907002 871823 827155 767195 762382 757743 755092 748157 750970 741233
12514 741233 739093 717933 704057 704943 688074 692377 708657 729193 743776 756337 747479 811694
12502 811694 866636 925113 970134 1036992 1133346 1235982 1345248 1471665 1532939 1582456 1609261
12491 1609261 1623083 1614195 1597968 1556699 1487619 1398491 1352914 1313410 1285154 1222471 1150973
12480 1150973 1098559 1049387 1020487 971946 917720 892929 868210 840270 810036 735485 689078
12469 689078 656139 634925 584051 540415 512469 466806 438442 427656 385995 354276 326451
12458 326451 303166 287786 286453 273506 288613 284920 300415 313911 334653 352275 385239 405516
12446 405516 424047 442889 453123 424972 426962 407136 400213 437366 449492 435925 451360 456081
$$ packed form
12526A094258p0892o7307m9057l5179m4668n9960m813m639k651o935K813r737
12514G41233k140k1160j3876Q86j6869M303J6280K0536J4583J2561q858O4215
12502H11694N4942N8477M5021O6858R6354J02636J09266J26417O1274M9517K6805
12491A609261J3822q888j6227m1269o9080q9128m5577l9504k8256o2683p1498
12480A150973n2414m9172k8900m8541n4226k4791k4719k7940l0234p4551m6407
12469F89078l2939k1214n0874m3636k7946m5663k8364j0786m1661l1719k7825
12458C26451k3285j5380j333j2947J5107l693J5495J3496K0742J7622L2964K0277
12446D05516J8531J8842J0234k8151J990j9826o923L7153J2126j3567J5435M721
$$ plain form
12434 456081 426257 397620 409168 413932 434990 439323 430388 441461 435782 434956 438098 436971 447645
12421 447645 455295 479880 490590 489545 495812 479297 443769 429917 419591 382573 375903 377102
12409 377102 378376 402574 403304 412293 382548 324909 315351 323913 312481 297306 265125 236275 244273
12396 244273 259757 256443 259041 296189 328863 331121 329665 309715 314583 284065 238217 206311
12384 206311 171216 146670 130072 116707 149498 191710 200841 213034 190552 183084 196079 193577
12372 193577 176626 156279 154401 175607 153959 143278 170022 157238 147760 170955 186796 197214
12360 197214 177769 216974 244337 218627 214526 212680 206171 200925 203690 194659 178713 158568 142048
12347 142048 145802 142305 143972 137808 116155 122693 106059 96555 112271 125858 104270 98191 87657
$$ packed form
12434D56081k9824k8637J1548M764K1058M333q935J1073n679q26L142j127J0674
12421D47645P650K4585J0710j045O267j6515l5528j3852j0326l7018o670J199
12409C77102J274K4198P30Q989k9745n7639r558Q562j1432j5175l2181k8850P998
12396B44273J5484l314K598L7148L2674K258j456j9950M868l0518m5848l1906
12384B06311l5095k4546j6598j3365L2791M2212R131J2193k2482p468J2995k502
12372A93577j6951k0347j878K1206k1648j0681K6744j2784r478K3195J5841J0418
12360A97214j9445L9205K7363k5710m101j846o509n246K765r031j5946k0145j6520
12347A42048L754l497J667o164k1653O538j6634r504J5716J3587k1588o079j0534
$$ plain form
12334 87657 83449 97826 93119 103069 96272 69644 96487 93229 129903 167332 147829 141182 145452
12321 145452 132833 130136 129414 133730 131235 123616 128675 123247 123370 152770 166026 166652 159533 148713
12307 148713 161041 196609 208461 221233 226850 235883 270598 322391 392648 480709 574056 695101
12295 695101 796487 845728 833061 791176 738794 681932 608264 542227 501545 478967 462839
12284 462839 459530 466530 468292 498356 541283 571465 601583 622834 633667 673841 723041 730049
12272 730049 732059 725302 759592 796794 852794 908748 962297 1007607 1019691 1008007 969650 914738
12260 914738 845183 779744 720137 657103 604571 595973 619269 637051 636020 642494 638823 609416
12248 609416 564098 530475 496809 486855 473247 440195 408177 421001 497081 563437 600191 649429
$$ packed form
12334H7657m208J4377m707R950o797k6628K6843l258L6674L7429j9503o647M270
12321A45452j2619k697p22M316k495p619N059n428J23K9400J3256O26p119j0820
12307A48713J2328L5568J1852J2772N617R033L4715N1793P0257Q8061R3347J21045
12295F95101J01386M9241j2667m1885n2382n6862p3668o6037m0682k2578j6128
12284D62839l309P000J762L0064M2927L0182L0118K1251J0833M0174M9200P008
12272G30049K010o757L4290L7202N6000N5954N3549M5310J2084j1684l8357n4912
12260I14738o9555o5439n9607o3034n2532q598K3296J7782j031O474l671k9407
12248F09416m5318l3623l3666r954j3608l3052l2018J2824P6080O6356L6754M9238
$$ plain form
12236 649429 762294 927678 1042993 1086910 1055796 975148 863235 753428 642561 559416
12226 559416 482108 437411 412719 391376 341306 282898 234201 221370 211859 170422 143218 156879
12214 156879 178902 175061 171255 175646 182487 153412 116887 90975 72082 96821 96253 86132 126943
12201 126943 156073 155484 130107 131755 145147 145224 165484 193299 234213 277085 315929 341056 384493
12188 384493 421493 449200 535079 672288 815434 1001595 1215543 1428926 1573551 1630128
12178 1630128 1648982 1639461 1540345 1364366 1188984 1016749 850361 692166 586223 507114
12168 507114 427989 348499 273958 263226 250774 226729 236998 229170 166106 141963 125616 117444
12156 117444 109227 89032 84541 83099 81711 68637 71397 65297 47159 47560 42619 22402 31578
$$ packed form
12236F49429J12865J65384J15315M3917l1114q0648j11913j09807j10867q3145
12226E59416p7308m4697k4692k1343n0070n8408m8697j2831r511m1437k7204J3661
12214A56879K2023l841l806M391O841k9075l6525k5912j8893K4739n68j0121M0811
12201A26943K9130n89k5377J648J3392P7K0260K7815M0914M2872L8844K5127M3437
12188C84493L7000K7707Q5879J37209J43146J86161K13948K13383J44625N6577
12178A630128J8854r521r9116j75979j75382j72235j66388j58195j05943p9109
12168E07114p9125p9490p4541j0732j2452k4045J0269p828o3064k4143j6347q172
12156A17444q217k0195m491j442j388j3074K760o100j8138M01m941k0217R176
$$ plain form
12143 31578 45298 72740 78798 83325 70341 58115 68899 102602 115725 124987 129148 138298 142027
12130 142027 127556 121527 84416 90327 86945 90742 116073 126908 114583 126396 124662 104245
12118 104245 95022 82959 89646 73459 52893 45645 45499 72877 92794 60643 58643 79731 75966
12105 75966 56445 70619 74775 84314 107084 100719 70132 45465 43178 48885 66682 67377 65137
12092 65137 69588 70203 61487 52181 68730 82616 95955 118551 129524 122647 109959 130146 130904
12079 130904 118705 129713 132277 159031 177888 173946 151130 140221 147963 128206 133673 157708
12067 157708 125738 121055 124086 85539 76064 97714 130182 119684 120069 117921 102321 102392 117252
12054 117252 124361 110765 136830 124736 124450 138040 164776 166215 183686 195237 211531 217432
$$ packed form
12143C1578J3720K7442O058M527j2984j2226J0784L3703J3123R262M161R150L729
12130A42027j4471o029l7111N911l382L797K5331J0835j2325J1813j734k0417
12118A04245r223j2063O687j6187k0566p248j46K7378J9917l2151k000K1088l765
12105G5966j9521J4174M156R539K2770o365l0587k4667k287N707J7797O95k240
12092F5137M451O15q716r306J6549J3886J3339K2596J0973o877j2688K0187P58
12079A30904j2199J1008K564K6754J8857l942k2816j0909P742j9757N467K4035
12067A57708l1970m683L031l8547r475K1650L2468j0498L85k148j5600P1J4860
12054A17252P109j3596K6065j2094k86J3590K6736J439J7471J1551J6294N901
$$ plain form
12042 217432 249337 293440 353883 384504 414241 472639 562225 671718 781025 901505 967745
12031 967745 1019134 1015435 970361 886030 809155 743921 690630 634919 564087 512487 480914 460922
12019 460922 483670 524603 575065 630064 670754 692422 691374 692999 709386 701869 701697 713183
12007 713183 722355 737577 790137 857124 926624 985198 1019363 1044952 1058523 1060902 1002458 953560
11995 953560 914776 877264 842685 798035 759907 727597 674589 626581 610469 601590 554270 537546
11983 537546 508596 488972 488128 507380 528191 538688 565808 597621 636045 700502 795123 905927
11971 905927 999915 1074622 1085854 1087525 1059164 1007957 931992 853493 772350 666381 545319
11960 545319 474301 438842 417840 393800 388321 351685 310277 283323 255510 227972 217271 191825
$$ packed form
12042B17432L1905M4103O0443L0621K9737N8398Q9586J09493J09307J20480O6240
12031I67745N1389l699m5074q4331p6875o5234n3291n5711p0832n1600l1573j9992
12019D60922K2748M0933N0462N4999M0690K1668j048J625J6387p517j72J1486
12007G13183R172J5222N2560O6987O9500N8574L4165K5589J3571K379n8444m8898
11995I53560l8784l7512l4579m4650l8128l2310n3008m8008j6112q879m7320j6724
11983E37546k8950j9624q44J9252K0811J0497K7120L1813L8424O4457R4621J10804
11971I05927R3988P4707J1232J671k8361n1207p5965p8499q1143j05969j21062
11960E45319p1018l5459k1002k4040n479l6636m1408k6954k7813k7538j0701k5446
$$ plain form
11948 191825 177389 189305 176897 176855 196769 193657 196774 189251 203754 172343 146633 129668 130824
11935 130824 155319 161928 125482 97346 90227 126188 147942 114750 91956 94896 117426 119099
11923 119099 101368 97813 103546 104463 120155 113930 103453 114065 126191 99802 91127 107000 130247
11910 130247 157123 153980 142488 124952 140106 143164 152443 143917 140602 152498 130792 120312
11898 120312 123320 141583 167350 174675 145766 140250 145592 152555 174481 203236 199099 203285 223810
11885 223810 232900 235926 233553 245319 278367 294390 317354 304991 315565 306491 316408 358759
11873 358759 409787 449878 492043 571773 670105 717092 726677 700681 642018 591656 557098 487456
11861 487456 441927 388872 377552 382168 363100 355982 346204 331097 354272 354064 324515 339916
$$ packed form
11948A91825j4436J1916j2408m2J9914l112L117p523J4503l1411k5710j6965J156
11935A30824K4495O609l6446k8136p119L5961K1754l3192k2794K940K2530J673
11923A19099j7731l555N733R17J5692o225j0477J0612J2126k6389q675J5873K3247
11910A30247K6876l143j1492j7536J5154L058R279q526l315J1896k1706j0480
11898A20312L008J8263K5767P325k8909n516N342O963K1926K8755m137M186K0525
11885B23810R090L026k373J1766L3048J6023K2964j2363J0574r074R917M2351
11873C58759N1028M0091M2165P9730R8332M6987R585k5996n8663n0362l4558o9642
11861D87456m5529n3055j1320M616j9068p118r778j5107K3175k08k9549J5401
$$ plain form
11849 339916 335043 313881 292737 306148 319772 314643 322396 321382 311916 308754 312509 302341 277365
11836 277365 280525 260431 279375 304512 306600 312783 323982 335622 322645 340130 340697 329161
11824 329161 337082 335507 318457 301821 305529 304845 315527 327236 294817 283712 294661 291256 279410
11811 279410 262508 244188 240421 230802 234074 250893 279065 260771 247741 230293 220843 200350
11799 200350 159110 143963 182291 223508 249781 235196 216325 225955 203680 204090 208659 199190
11787 199190 225827 245534 244695 206486 193816 209429 229627 220121 223094 241909 257923 258583 248305
11774 248305 222191 209696 219639 249513 268679 284228 293130 291328 344188 384325 432812 503309
11762 503309 590686 700585 814564 968737 1112694 1258519 1427991 1573540 1647534 1643818
$$ packed form
11849C39916m873k1162k1144J3411J3624n129P753j014r466l162L755j0168k4976
11836B77365L160k0094J8944K5137K088O183J1199J1640j2977J7485N67j1536
11824C29161P921j575j7050j6636L708o84J0682J1709l2419j1105J0949l405j1846
11811B79410j6902j8320l767r619L272J6819K8172j8294j3030j7448r450k0493
11799B00350m1240j5147L8328M1217K6273j4585j8871R630k2275M10M569r469
11787A99190K6637J9707q39l8209j2670J5613K0198r506K973J8815J6014O60j0278
11774B48305k6114j2495R943K9874J9166J5549Q902j802N2860M0137M8487P0497
11762E03309Q7377J09899J13979J54173J43957J45825J69472J45549P3994l716
$$ plain form
11752 1643818 1608872 1536441 1423371 1317346 1207629 1093771 1038118 1010495 989445 962612
11742 962612 966705 1013629 1053025 1090905 1127056 1179228 1254593 1358210 1444252 1521164 1591572
11731 1591572 1681135 1784159 1902948 2021762 2187169 2360126 2526973 2614012 2653591 2656403
11721 2656403 2594108 2462117 2319213 2204828 2051183 1910191 1862970 1816470 1787273 1731158
11711 1731158 1675103 1625844 1568973 1507847 1457086 1413944 1356049 1321843 1357853 1424207 1449192
11700 1449192 1484795 1534385 1630086 1710376 1798768 1922217 2059664 2189426 2254669 2234719 2165412
11689 2165412 2063983 1947289 1806845 1673332 1574133 1518054 1475066 1395763 1355073 1308718
11679 1308718 1234637 1221470 1257271 1286924 1327733 1361044 1375124 1412325 1446268 1453578 1428861
$$ packed form
11752A643818l4946p2431j13070j06025j09717j13858n5653k7623k1050k6833
11742I62612M093M6924L9396L7880L6151N2172P5365J03617Q6042P6912P0408
11731A591572Q9563J03024J18789J18814J65407J72957J66847Q7039L9579K812
11721B656403o2295j31991j42904j14385j53645j40992m7221m6500k9197n6115
11711A731158n6055m9259n6871o1126n0761m3142n7895l4206L6010O6354K4985
11700A449192L5603M9590R5701Q0290Q8392J23449J37447J29762O5243j9950o9307
11689B165412j01429j16694j40444j33513r9199n6079m2988p9303m0690m6355
11679A308718p4081j3167L5801K9653M0809L3311J4080L7201L3943P310k4717
$$ plain form
11668 1428861 1442192 1464884 1497149 1539694 1563890 1582529 1617443 1643359 1659026 1699236 1732093
11657 1732093 1787540 1848037 1912536 1991658 2071114 2161873 2247058 2335190 2384235 2436600 2518033
11646 2518033 2608883 2715599 2831732 2961912 3079114 3194255 3360009 3553979 3729501 3929625
11636 3929625 4133991 4400751 4700331 5047121 5449703 5876096 6362639 6935196 7574059
11627 7574059 8333551 9172705 10136075 11277425 12552742 14028808 15770148 17786917 20211327
11618 20211327 23247885 27066937 32014717 38571841 47388369 59275857 75075135 95383452
11610 95383452 119389651 143632360 162763792 172472123 171732002 162424428 147612516 130389742
11602 130389742 113190757 97625207 84660693 74660161 67711750 63678306 62445556
$$ packed form
11668A428861J3331K2692L2265M2545K4196J8639L4914K5916J5667M0210L2857
11657A732093N5447O0497O4499P9122P9456R0759Q5185Q8132M9045N2365Q1433
11646B518033R0850J06716J16133J30180J17202J15141J65754J93970J75522K00124
11636C929625K04366K66760K99580L46790M02582M26393M86543N72557O38863
11627G574059P59492Q39154R63370J141350J275317J476066J741340K016769K424410
11618B0211327L036558L819052M947780O557124Q816528J1887488J5799278K0308317
11610I5383452K4006199K4242709J9131432R708331p40121r307574j4811912j7222774
11602A30389742j7198985j5565550j2964514j0000532o948411m033444j232750
$$ plain form
11595 62445556 63896534 67799977 73652690 80589057 87660867 94141490 99573012 103613096
11587 103613096 106046307 106808349 106417351 106087884 107379477 111748226 120206292 132877046
11579 132877046 148639281 164819351 177780876 184409934 183540183 176267737 165067261
11572 165067261 152731677 141532758 132647796 126140570 121399676 117624096 114144097 110359981
11564 110359981 105683676 99689627 92390418 84298697 76204373 68862034 62809286 58324077
11556 58324077 55596919 54761909 56102611 60006693 66884379 77256322 91464782 109268790
11548 109268790 128785984 145944513 155908698 156055095 147270859 132559215 115106924
11541 115106924 97340283 80819674 66304359 54107465 44225059 36418580 30379180
$$ packed form
11595F2445556J450978L903443N852713O936367P071810O480623N431522M040084
11587A03613096K433211P62042l90998l29467J291593M368749Q458066J2670754
11579A32877046J5762235J6180070J2961525O629058q69751p272446j1200476
11572A65067261j2335584j1198919q884962o507226m740894l775580l479999l784116
11564A10359981m676305n994049p299209q091721q094324p342339o052748m485209
11556E8324077k727158q35010J340702L904082O877686J0371943J4208460J7804008
11548A09268790J9517194J7158529R964185J46397q784236j4711644j7452291
11541A15106924j7766641j6520609j4515315j2196894r882406p806479o039400
$$ plain form
11534 30379180 25675327 21960795 18948172 16459323 14342669 12546386 11050221 9777054
11526 9777054 8688752 7762612 7009297 6370969 5808889 5337668 4930196 4565535 4280978
11517 4280978 3999928 3757250 3527360 3323341 3153565 3020588 2858862 2688470 2528213
11508 2528213 2403831 2298107 2190636 2084743 1944232 1818481 1719897 1648942 1607732 1563219
11498 1563219 1525250 1476564 1466895 1463848 1422400 1380628 1331883 1309862 1294055 1259172 1223865 1174855
11486 1174855 1177978 1164779 1146890 1160426 1209058 1244375 1219639 1143557 1077350 1020327 951191
11475 951191 908843 870553 848823 836487 836105 861452 859042 817955 784022 789738 790742 768883
11463 768883 757062 740878 726385 712673 691050 643010 620875 607497 579436 587651 614768 646078
$$ packed form
11534C0379180m703853l714532l012623k488849k116654j796283j496165j273167
11526I777054j088302r26140p53315o38328n62080m71221m07472l64661k84557
11517D280978k81050k42678k29890k04019j69776j32977j61726j70392j60257
11508B528213j24382j05724j07471j05893j40511j25751r8584p0955m1210m4513
11498A563219l7969m8686r669l047m1448m1772m8745k2021j5807l4883l5307m9010
11486A174855L123j3199j7889J3536M8632L5317k4736p6082o6207n7023o9136
11475I51191m2348l8290k1730j2336l82K5347k410m1087l3933N716J004k1859
11463G68883j1821j6184j4493j3712k1623m8040k2135j3378k8061Q215K7117L1310
$$ plain form
11451 646078 692886 705765 728468 751193 760356 758464 724671 701970 700838 688014 690912 694084
11439 694084 661047 644752 636022 636022 636056 621903 630508 664598 718692 765360 798172 792992 776901
11426 776901 762764 737391 720416 711468 699769 719082 739399 742476 720733 696898 666219 616669
11414 616669 555879 516743 474169 455206 442777 432439 425497 430774 419904 376093 378475 370554
11402 370554 371938 362249 341110 364651 372955 337020 306716 300360 285879 266327 271598 273264 274598
11389 274598 296022 327775 358090 369109 399067 399739 375352 369642 344666 338133 354001 333644
11377 333644 319338 328230 337074 330369 321960 329648 307974 262584 231485 207000 211483 233787 254915
11364 254915 254441 230792 205689 225915 222890 219961 254934 275413 279555 277048 269943 292222 292228 271918
$$ packed form
11451F46078M6808J2879K2703K2725R163j892l3793k2701j132j2824K898L172
11439F94084l3037j6295q730%L4j4153Q605L4090N4094M6668L2812n180j6091
11426G76901j4137k5373j6975q948j1699J9313K0317L077k1743k3835l0679m9550
11414F16669o0790l9136m2574j8963j2429j0338o942N277j0870m3811K382p921
11402C70554J384r689k1139K3541Q304l5935l0304o356j4481j9552N271J666J334
11389B74598K1424L1753L0315J1019K9958O72k4387n710k4976o533J5868k0357
11377C33644j4306Q892Q844o705q409P688k1674m5390l1099k4485M483K2304K1128
11364B54915m74k3649k5103K0226l025k929L4973K0479M142k507p105K2279Ok0310
$$ plain form
11350 271918 242637 203971 167105 113163 107461 107380 100283 89135 111966 119228 92660 81198 88691
11337 88691 95747 91326 112096 148674 147504 147206 107450 89328 72037 53229 60139 64667 84076
11324 84076 115406 119695 96048 96379 101828 90792 78913 92065 111839 119474 118687 105901 80751
11311 80751 89683 76913 68768 86708 71444 43446 53587 64056 69624 89226 109214 91913
11299 91913 61241 55715 53548 42546 32777 7525 16100 25039 31756 48534 47897 56018 62048 61469
11285 61469 69077 70371 67261 53733 60250 45118 24293 22201 36196 54781 47901 34512 30950
11272 30950 37325 45587 30889 26080 25065 16214 10247 15855 29870 46973 73658 75800 60155
11259 60155 46482 52152 40889 31092 19671 25195 34485 71492 91200 99699 88044 76510 59718
$$ packed form
11350B71918k9281l8666l6866n3942n702q1p097j1148K2831P262k6568j1462P493
11337H8691P056m421K0770L6578j170k98l9756j8122j7291j8808O910M528J9409
11324H4076L1330M289k3647L31N449j1036j1879J3152J9774P635p87j2786k5150
11311H0751Q932j2770q145J7940j5264k7998J0141J0469N568J9602J9988j7301
11299I1913l0672n526k167j1002r769k5252Q575Q939O717J6778o37Q121O030n79
11285F1469P608J294l110j3528O517j5132k0825k092J3995J8585o880j3389l562
11272C0950O375Q262j4698m809j015q851n967N608J4015J7103K6685K142j5645
11259F0155j3673N670j1263r797j1421N524R290L7007J9708Q499j1655j1534j6792
$$ plain form
11246 59718 38932 34007 63850 48952 47092 47311 54021 43569 16941 26362 33586 37517 21798
11233 21798 42358 61962 51225 30420 42506 49451 56186 52918 34904 58181 98956 89105
11221 89105 83099 75860 73669 87465 97347 77799 74902 98083 114837 90761 73549 80873 69399
11208 69399 37750 26086 41824 57417 77457 105274 113664 122340 110599 100626 99991 105026 116720
11195 116720 131429 138734 157674 156263 182457 191581 232375 284758 295035 305919 326122 335142
11183 335142 365222 445085 547212 620057 699170 761273 824180 884019 911880 903081 861871
11172 861871 794274 718954 653109 557682 490740 439107 409799 434050 466253 470976 495576 524599
11160 524599 557343 614421 648166 656353 686306 708760 721259 695881 706185 761555 805574 847507
$$ packed form
11246E9718k0786m925K9843j4898j860K19O710j0452k6628R421P224L931j5719
11233B1798K0560J9604j0737k0805J2086O945O735l268j8014K3277M0775r851
11221H9105o006p239k191J3796R882j9548k897K3181J6754k4076j7212P324j1474
11208F9399l1649j1664J5738J5593K0040K7817Q390Q676j1741r973o35N035J1694
11195A16720J4709P305J8940j411K6194R124M0794N2383J0277J0884K0203R020
11183C35142L0080P9863J02127P2845P9113O2103O2907N9839K7861q799m1210
11172H61871o7597p5320o5845r5427o6942n1633k9308K4251L2203M723K4600K9023
11160E24599L2744N7078L3745Q187K9953K2454J2499k5378J0304N5370M4019M1933
$$ plain form
11148 847507 876170 932801 966937 1001951 958027 909036 878995 829589 775068 718039 698487
11137 698487 669812 651411 644937 636380 648177 650775 597208 553628 561678 553875 526377 462304
11125 462304 415103 390110 390081 412474 444184 488914 548762 635778 724598 809489 849618 834768
11113 834768 790603 716512 609175 486710 400513 345235 292023 227361 181074 139942 136393
11102 136393 114501 98811 87278 64923 75139 105795 92340 83867 93487 90363 92839 98386
11090 98386 123093 129083 116102 122144 126316 149447 170322 147423 158245 120854 96011 115041
11078 115041 131151 117053 85048 65865 57991 72304 59696 51585 47831 20379 10918 7542
11066 7542 23826 16903 11958 -3514 -6050 9654 41746 34370 17958 33850 49842 65996 46828
$$ packed form
11148H47507K8663N6631L4136L5014m3924m8991l0041m9406n4521n7029j9552
11137F98487k8675j8401o474q557J1797K598n3567m3580Q050p803k7498o4073
11125D62304m7201k4993k9K2393L1710M4730N9848Q7016Q8820Q4891M0129j4850
11113H34768m4165p4091j07337j22465q6197n5278n3212o4662m6287m1132l549
11102A36393k1892j5690j1533k2355J0216L0656j3455q473R620l124K476N547
11090I8386K4707N990j2981O042M172K3131K0875k2899J0822l7391k4843J9030
11078A15041J6110j4098l2005j9183p874J4313j2608q111l754k7452r461l376
11066G542J6284o923m945j5472k536J5704L2092p376j6412J5892J5992J6154j9168
$$ plain form
11053 46828 51254 76869 64496 44177 24487 15521 19643 14384 17328 25057 30057 6189 -4409
11040 -4409 -2708 13234 28431 52530 64039 46730 46665 25733 39626 53305 23179 -13004 -16971
11027 -16971 -18783 -20653 5493 29925 39407 20286 23464 52571 45297 24038 17109 18526 2495
11014 2495 5493 32946 16980 -4158 3484 -27288 -40478 -23170 1218 -5578 19873 32704
11002 32704 42690 29819 19541 634 16732 12068 10150 49342 49014 21007 29570 33605 38858
10989 38858 34443 26100 28959 20589 23409 19153 -1846 -452 17993 25893 41206 23816 -7039
10976 -7039 -12771 -14153 18831 16048 -2762 -4548 -21229 -35225 -15067 1901 -5008 -22237 -23834
10963 -23834 -13294 1213 1108 4370 12072 -5969 -19473 -26932 -12381 -13494 -22991 -12572 20401
$$ packed form
11053D6828M426K5615j2373k0319j9690q966M122n259K944P729N000k3868j0598
11040d409J701J5942J5197K4099J1509j7309o5k0932J3893J3679l0126l6183l967
11027a6971j812j870K6146K4432R482j9121L178K9107p274k1259o929J417j6031
11014B495K998K7453j5966k1138P642l0772j3190J7308K4388o796K5451J2831
11002C2704R986j2871j0278j8907J6098m664j918L9192l28k8007Q563M035N253
10989C8858m415q343K859q370K820m256k0999J394J8445P900J5313j7390l0855
10976g039n732j382L2984k783j8810j786j6681j3996K0158J6968o909j7229j597
10963b3834J0540J4507j05L262P702j8041j3504p459J4551j113r497J0419L2973
$$ plain form
10950 20401 2686 -10850 -60431 -42612 -24643 -32859 -6296 3773 -12681 -10384 7493 7310
10938 7310 5265 20056 -16011 -21063 -5494 9543 18581 15563 16057 3823 12089 25627 11392
10925 11392 -2005 -14675 -40860 -47426 -39390 -39076 -39286 -33506 -12183 -4176 8208 14505 5454 -15884
10911 -15884 -50128 -23543 -39791 -21941 17021 9767 4441 -34038 -33429 -41179 -43898 -56398 -39670
10898 -39670 -16717 -7072 799 -9232 -17366 -23371 -26178 -13117 15464 -1051 -30376 -47277 -20030
10885 -20030 -18208 -27151 -44214 -52136 -43352 -27930 -19915 -20127 28601 72064 51381 41842 25501
10872 25501 14825 16695 2125 1909 -3249 -43585 -31887 -41365 -61254 -58958 -55248 -24039 6607
10859 6607 31623 40703 20920 18506 21976 7831 -11510 -1178 21932 28990 30335 29811 23070
$$ packed form
10950B0401j7715j3536m9581J7819J7969q216K6563J0069j6454K297J7877j83
10938G310k045J4791l6067n052J5569J5037R038l018M94j2234Q266J3538j4235
10925A1392j3397j2670k6185o566Q036L14k10N780K1323Q007J2384O297r051k1338
10911a5884l4244K6585j6248J7850L8962p254n326l8479O09p750k719j2500J6728
10898c9670K2953R645P871j0031q134o005k807J3061K8581j6515k9325j6901K7247
10885b0030J822q943j7063p922Q784J5422Q015k12M8728M3463k0683r539j6341
10872B5501j0676J870j4570k16n158m0336J1698r478j9889K296L710L1209L0646
10859F607K5016R080j9783k414L470j4145j9341J0332K3110P058J345n24o741
$$ plain form
10846 23070 26712 1904 8719 24543 30781 12323 10968 4702 -26845 -15246 -4793 -27454 -36722
10833 -36722 -12979 7653 26450 41956 26100 1258 -8056 -24241 -6953 11322 14557 5100
10821 5100 12227 44547 33502 13342 27406 27999 -4370 -7966 13085 -11601 -10884 -2911 -263
10808 -263 14073 46619 40229 35041 18742 19807 4622 212 14459 35575 20481 32476 25583
10795 25583 19430 36604 22891 31039 32370 20536 31253 15853 1510 -10558 -35019 -37269
10783 -37269 6199 43879 17590 4785 -11255 -15338 -6675 -8615 -23984 -25779 -10090 -7832 -10795
10770 -10795 -6442 24263 41674 30203 -3505 -14406 -21393 3553 15385 13593 20738 26548 48065
10757 48065 47976 55492 62984 25306 10223 41550 41393 6789 7797 20239 15057 39271 59474
$$ packed form
10846B3070L642k4808O815J5824O238j8458j355o266l1547J1599J0453k2661r268
10833c6722K3743K0632J8797J5506j5856k4842r314j6185J7288J8275L235r457
10821E100P127L2320j1045k0160J4064N93l2369l596K1051k4686P17P973K648
10808b63J4336L2546o390n188j6299J065j5185m410J4247K1116j5094J1995o893
10795B5583o153J7174j3713Q148J331j1834J0717j5400j4343j2068k4461k250
10783c7269M3468L7680k6289j2805j6040m083Q663j940j5369j795J5689K258k963
10770a0795M353L0705J7411j1471l3708j0901o987K4946J1832j792P145N810K1517
10757D8065q9P516P492l7678j5083L1327j57l4604J008J2442n182K4214K0203
$$ plain form
10744 59474 66634 36293 39490 41457 35037 18315 -10319 -27042 -9956 20426 6516 -31722
10732 -31722 -27944 -16197 -23144 -18351 -25647 -10896 -10179 1641 3103 6790 -21694 -25109 -16840 -36053
10718 -36053 -38569 -13183 -6259 -15505 6896 2675 11181 28772 -796 9094 41546 30019 11520
10705 11520 22332 23804 -798 21504 17402 31333 21782 16464 20115 25113 38187 30950 3943
10692 3943 -10532 27717 27789 30561 22950 7793 11009 4944 -16946 -20190 -16638 -17442 20592 28804
10678 28804 25021 -13462 -38324 -37022 13180 16378 -515 -24344 -17757 -8715 -21802 -14522 20208
10665 20208 34305 33791 30097 23058 32173 27819 51901 45910 19061 -22978 -18570 19975 39123
10652 39123 46685 25097 6792 -25588 -31018 -33684 -18639 -18841 -28353 -6479 5852 -10331 -14746
$$ packed form
10744E9474P160l0341L197J967o420j6722k8634j6723J7086L0382j3910l8238
10732c1722L778J1747o947M793p296J4751P17J1820J462L687k8484l415Q269j9213
10718c6053k516K5386O924r246K2401m221Q506J7591k9568R890L2452j1527j8499
10705A1520J0812J472k4602K2302m102J3931r551n318L651M998J3074p237k7007
10692C943j4475L8249P2K772p611j5157L216o065k1890l244L552q04L8034Q212
10678B8804l783l8483k4862J302N0202L198j6893k3829O587R042j3087P280L4730
10665B0208J4097n14l694p039R115m354K4082n991k6849m2039M408L8545J9148
10652C9123P562k1588j8305l2380n430k666J5045k02r512K1874J2331j6183m415
$$ plain form
10639 -14746 -1348 -16867 -7352 -6829 11245 34901 39471 45664 11222 -19824 -26934 -10948 29804
10626 29804 44755 45534 25820 -10533 -31021 -24165 -9543 4150 -723 -20056 -5825 13429
10614 13429 24754 3679 -22527 -9113 691 21755 28796 9685 -5703 6582 20597 26438
10602 26438 -1217 -5410 -16539 27202 46377 33356 27369 23074 2012 -22877 -38810 -12406
10590 -12406 17879 26709 28212 21454 19181 12648 1229 -10278 -5595 895 -15939 -19424 -27103
10577 -27103 -16158 -11078 16793 38725 14958 24424 20532 36134 61096 67460 33199 -4402
10565 -4402 7249 23012 -13481 -15888 -16661 -21394 -27751 -25710 -34778 -49354 -45791 -28694 -12176
10552 -12176 -709 2432 14343 18092 10662 19193 14136 8347 -3864 -17948 -14285 -28001 -38177
$$ packed form
10639a4746J3398j5519R515N23J8074K3656M570O193l4442l1046p110J5986M0752
10626B9804J4951P79j9714l6353k0488O856J4622J3693m873j9333J4231J9254
10614A3429J1325k1075k6206J3414R804K1064P041j9111j5388J2285J4015N841
10602B6438k7655m193j1129M3741J9175j3021n987m295k1062k4889j5933K6404
10590a2406L0285Q830J503o758k273o533j1419j1507M683O490j6834l485p679
10577b7103J0945N080K7871K1932k3767R466l892J5602K4962O364l4261l7601
10565d402J1651J5763l6493k407p73m733o357K041r068j4576L563J7097J6518
10552a2176J1467L141J1911L749p430Q531n057n789j2211j4084L663j3716j0176
$$ plain form
10539 -38177 -28080 -38423 -46629 -46842 -24499 -6675 -455 18346 27689 15984 17745 13492 1791
10526 1791 4698 548 31969 63124 62958 37325 20159 5484 11568 25237 35329 27645 9088
10513 9088 10794 707 -25706 -56739 -39313 -6623 5802 -4659 -27770 -47303 -46795 -9989
10501 -9989 4269 -8214 -30927 -26701 593 30424 29159 17155 -9612 -7504 20088 38262
10489 38262 52105 49633 7999 2428 -8161 4162 34981 29713 17885 21992 30374 33401 10790
10476 10790 25278 15148 10452 -1826 -14618 7690 36505 26512 35749 44678 14144 19869 29026
10463 29026 45510 36041 34035 39565 45853 16820 1639 -21042 -5492 -3699 5194 3288 -16539
10450 -16539 -1002 20546 14312 21682 21264 31648 38305 28301 17801 19931 25443 19622 29230
$$ packed form
10539c8177J0097j0343q206k13K2343J7824O220J8801R343j1705J761m253j1701
10526A791K907m150L1421L1155j66k5633j7166j4675O084J3669J0092p684j8557
10513I088J706j0087k6413l1033J7426L2690J2425j0461k3111j9533N08L6806
10501i989J4258j2483k2713M226K7294K9831j265j2004k6767K108K7592J8174
10489C8262J3843k472m1634n571j0589J2323L0819n268j1828M107Q382L027k2611
10476A0790J4488j0130m696j2278j2792K2308K8815r993R237Q929l0534N725R157
10463B9026J6484r469k006N530O288k9033j5181k2681J5550J793Q893j906j9827
10450a6539J5537K1548o234P370m18J0384O657j0004j0500K130N512n821R608
$$ plain form
10437 29230 40490 61553 65614 44569 36324 65030 49491 38890 69265 57722 49652 38237
10425 38237 48250 51478 37121 42128 22789 5940 21894 24604 57936 80792 66365 57604
10413 57604 67262 40221 -15419 4498 22777 11503 6832 10077 41398 32624 23792 16418 -215
10400 -215 1788 13889 2845 -10310 -24767 -19039 1876 16652 -8217 -15000 8270 3897 1896
10387 1896 4423 4929 7809 9090 8828 -37405 -36575 -18823 -14000 6939 10915 20644 31234 17586
10373 17586 14204 22990 30301 36798 41131 44949 30704 39077 32547 27339 33631 36181 42989 42131
10359 42131 26815 -241 -10701 8578 35421 23194 39968 52631 36891 45407 48911 49977
10347 49977 21928 18623 33052 16049 -1052 14275 28374 27857 21509 22778 4081 26155 8118
$$ packed form
10437B9230J1260K1063M061k1045q245K8706j5539j0601L0375j1543q070j1415
10425C8237J0013L228j4357N007j9339j6849J5954K710L3332K2856j4427q761
10413E7604R658k7041n5640J9917J8279j1274m671L245L1321q774q832p374j6633
10400b15K003J2101j1044j3155j4457N728K0915J4776k4869o783K3270m373k001
10387A896K527N06K880J281k62m6233Q30J7752M823K0939L976R729J0590j3648
10373A7586l382Q786P311O497M333L818j4245Q373o530n208O292K550O808q58
10359D2131j5316k7056j0460J9279K6843j2227J6774J2663j5740Q516L504J066
10347D9977k8049l305J4429j7003j7101J5327J4099n17o348J269j8697K2074j8037
$$ plain form
10334 8118 -4643 -786 19508 41684 51991 47653 47569 32970 3785 -9219 -10142 14989 27755
10321 27755 30243 13449 9695 -1948 17172 11684 16154 15715 20937 34038 26214 4051 13903
10308 13903 25444 45968 58756 64459 33597 12694 -13514 -26995 4578 21347 1418 1760
10296 1760 1273 -12018 9837 16384 21398 23046 35163 26054 11087 22581 36711 35674 38515
10283 38515 22219 30835 45816 31481 60439 45891 36123 24774 27193 7285 -4012 -11313
10271 -11313 -15900 -11969 -31102 -17695 -205 -6219 -21974 -34098 -32421 -26786 -14454 -35688 -55508
10258 -55508 -21375 -30980 -20948 -11987 -10272 15186 18944 32143 49432 41874 29812 34936 28157
10245 28157 4308 27588 51119 62583 35328 35883 18867 20183 39289 46817 46927 41072 5921
$$ packed form
10334H118j2761L857K0294K2176J0307m338q4j4599k9185j3004r23K5131J2766
10321B7755K488j6794l754j1643J9120n488M470m39N222J3101p824k2163R852
10308A3903J1541K0524J2788N703l0862k0903k6208j3481L1573J6769j9929L42
10296A760m87j3291K1855O547N014J648J2117r109j4967J1494J4130j037K841
10283C8515j6296Q616J4981j4335K8958j4548r768j1349K419j9908j1297p301
10271a1313m587L931j9133J3407J7490o014j5755j2124J677N635J2332k1234j9820
10258e5508L4133r605J0032Q961J715K5458L758J3199J7289p558j2062N124o779
10245B8157k3849K3280K3531J1464k7255N55j7016J316J9106P528J10n855l5151
$$ plain form
10232 5921 -8930 -27310 -11371 -13282 -2662 39042 58148 57975 17709 -20165 6788 8512 3899
10219 3899 31964 38983 62927 89669 109831 142931 189985 242442 312414 458834 571039 657929
10207 657929 752320 849605 948353 987621 999355 981013 893892 780783 648688 555573 455978
10196 455978 361214 299842 230854 192119 162975 112281 74114 40287 40848 35169 28192 35220
10184 35220 29216 58352 63417 55161 63454 63003 62795 63115 52949 20081 9839 32743 46829 55893
10170 55893 55382 30774 18988 12745 -11098 -21140 -1669 -2757 -12319 5290 13599 -9487 -2892
10157 -2892 705 -18638 -25406 3387 8319 -17211 -28881 -25300 9123 13480 17617 34849 70185
10144 70185 95914 78939 55908 43544 36847 35999 44307 56130 35047 37926 32350 15552 -2191
$$ packed form
10232E921j4851j8380J5939j911J0620M1704J9106j73m0266l7874K6953J724m613
10219C899K8065P019K3944K6742K0162L3100M7054N2457O9972J46420J12205Q6890
10207F57929R4391R7285R8748L9268J1734j8342q7121j13109j32095r3115r9595
10196D55978r4764o1372o8988l8735k9144n0694l8167l3827N61n679o977P028
10184C5220o004K9136N065q256Q293m51k08L20j0166l2868j0242K2904J4086R064
10170E5893n11k4608j1786o243k3843j0042J9471j088r562J7609Q309k3086O595
10157b892L597j9343o768K8793M932k5530j1670L581L4423M357M137J7232L5336
10144G0185K5729j6975k3031j2364o697q48Q308J1823k1083K879n576j6798j7743
$$ plain form
10131 -2191 -18787 -3166 17133 33907 25796 26935 16896 -19008 -58174 -50120 -18008 -25763 -34873
10118 -34873 -27391 -51668 -56595 -51552 -56571 -28551 -5755 -9045 -5120 6990 7143 -1223 -41 -9335
10104 -9335 -7590 4666 -15354 -44273 -26739 -1594 8091 24943 50243 21092 -19194 -61197
10092 -61197 -65305 -19008 -8136 -31045 -45877 -55314 -28921 -12161 2081 -13434 -19310 -16040
10080 -16040 -8032 4427 41664 58923 35008 13402 18073 28934 42036 40973 31892 33330 59027
10067 59027 42869 6299 -8276 -4362 -2575 8785 17564 -4574 -10080 -5715 -983 15720 48778
10054 48778 40122 16030 19327 54592 56027 39510 20232 6529 26932 72327 117414 151683
10042 151683 158367 145049 150762 142022 117460 90193 36063 26122 43091 43954 34315 31166 9637
$$ packed form
10131b191j6596J5621K0299J6774q111J139j0039l5904l9166Q054L2112p755r110
10118c4873P482k4277m927N043n019K8020K2796l290L925J2110J53q366J182r294
10104i335J745J2256k0020k8919J7534K5145R685J6852K5300k9151m0286m2003
10092f1197m108M6297J0872k2909j4832r437K6393J6760J4242j5515n876L270
10080a6040Q008J2459L7237J7259k3915k1606M671J0861J3102j063r081J438K5697
10067E9027j6158l6570j4575L914J787J1360Q779k2138n506M365M732J6703L3058
10054D8778q656k4092L297L5265J435j6517j9278j3703K0403M5395M5087L4269
10042A51683O684j3318N713q740k4562k7267n4130r941J6969Q63r639l149k1529
$$ plain form
10029 9637 1888 -17084 -11811 13398 22031 27771 37110 49931 47179 27533 28047 21352 -641 -18989
10015 -18989 -10234 32107 58301 63930 84397 69464 75713 93678 93816 93404 113729 124504 118544
10002 118544 124021 107238 97699 127488 111588 72442 34857 22608 49939 50332 42724 45621 36003
9989 36003 49937 34496 12366 14000 25003 33826 38888 46693 30082 35068 35823 24925 21213
9976 21213 12509 7549 24565 12065 7342 39675 25852 16014 12062 18162 3038 543 -5748
9963 -5748 3844 6098 -6297 12647 -1309 21325 29779 31912 26121 19965 37077 37411 10713 -16146
9949 -16146 -23432 -30282 -6107 26620 22017 8084 17296 -7471 -14946 31015 41309 5092 -11800
9936 -11800 -28263 -24784 -5658 20452 -4151 -44133 -50004 -19904 -25001 -16631 -4118 -2373 -11777
$$ packed form
10029I637p749j8972N273K5209Q633N740R339J2821k752j9646N14o695k1993j8348
10015a8989Q755M2341K6194N629K0467j4933O249J7965J38m12K0325J0775n960
10002A18544N477j6783r539K9789j5900l9146l7585j2249K7331L93p608K897r618
9989C6003J3934j5441k2130J634J1003Q823N062P805j6611M986P55j0898l712
9976B1213q704m960J7016j2500m723L2333j3823r838l952O100j5124k495o291
9963e748R592K254j2395J8944j3956K2634Q454K133n791o156J7112L34k6698k6859
9949a6146p286o850K4175L2727m603j3933R212k4767p475M5961J0294l6217j6892
9936a1800j6463L479J9126K6110k4603l9982n871L0100n097Q370J2513J745r404
$$ plain form
9923 -11777 -14404 -9202 -10611 -26333 -23800 -21816 -2127 2956 25505 27382 -9675 -11554 333
9910 333 7347 22635 20446 33829 33031 11194 15245 32524 46761 86889 96530 91691 111991 109885
9896 109885 107369 106416 121209 129545 148498 188175 203407 232519 253126 270717 287843 283542 281003
9883 281003 268100 243705 216778 198476 165889 150956 137257 132443 134038 131709 131440 120222 109491
9870 109491 93103 109099 107429 97781 86683 74411 71176 57991 81352 92913 97371 85291
9858 85291 96172 69654 48838 65342 68836 70605 49439 35513 32200 47560 58272 33307
9846 33307 704 -12566 -4370 7727 10152 -13049 -40986 -47251 -13841 8631 20870 39983
9834 39983 58052 58795 58414 34325 22367 26103 12506 22648 3468 -6631 35716 34215 16836
$$ packed form
9923a1777k627N202j409j5722K533J984J9689N083K2549J877l7057j879J1887
9910C33P014J5288k189J3383p98k1837M051J7279J4237M0128R641m839K0300k106
9896A09885k516r53J4793Q336J8953L9677J5232K9112K0607J7591J7126m301k539
9883B81003j2903k4395k6927j8302l2587j4933j3699m814J595k329k69j1218j0731
9870A09491j6388J5996j670r648j1098j2272l235j3185K3361J1561M458j2080
9858H5291J0881k6518k0816J6504L494J769k1166j3926l313J5360J0712k4965
9846C3307l2603j3270Q196J2097K425k3201k7937o265L3410K2472J2239J9113
9834C9983J8069P43l81k4089j1958L736j3597J0142j9180j0099M2347j501j7379
$$ plain form
9821 16836 9882 6355 17351 54851 69889 74955 59490 42076 30629 23774 34129 26071 20624
9808 20624 24931 35277 33251 33924 26846 33264 32058 18362 31137 58142 70722 68145 27278
9795 27278 16776 47869 47702 24559 15591 44008 49722 31450 14613 9665 6620 35093 38620
9782 38620 31719 39427 63184 72692 71848 84507 72882 67163 48839 38662 37858 28683 29301 43798
9768 43798 34819 32974 16566 40732 62425 55839 20451 8348 19682 36120 40738 37447 44383
9755 44383 69162 54740 10079 -21054 -51809 -49085 -27340 -1920 -2216 14368 -2303 18105
9743 18105 -658 -16014 7503 13628 18259 -16237 -20852 19967 21653 32599 37008 61112 51056
9730 51056 34240 -931 -29808 -27685 15938 20240 -3678 -4458 -3846 -24828 -24102 -3791 -858 21313
$$ packed form
9821A6836o954l527J0996L7500J5038N066j5465j7414j1447o855J0355q058n447
9808B0624M307J0346k026O73p078O418j206j3696J2775K7005J2580k577m0867
9795B7278j0502L1093j67k3143q968K8417N714j8272j6837m948l045K8473L527
9782C8620o901P708K3757R508q44J2659j1625n719j8324j0177q04r175O18J4497
9768D3798q979j845j6408K4166K1693o586l5388j2103J1334J6438M618l291O936
9755D4383K4779j4422m4661l1133l0755K724K1745K5420k96J6584j6671K0408
9743A8105j8763j5356K3517O125M631l4496m615M0819J686J0946M409K4104j0056
9730E1056j6816l5171k8877K123M3623M302k3918p80O12k0982P26K0311K933K2171
$$ plain form
9716 21313 40248 60572 42203 9091 17423 32036 21622 10568 11271 43232 48298 21919 17077
9703 17077 -6456 7336 61149 69685 49942 54369 44014 23776 23735 24036 28527 9292 43017
9690 43017 28075 8939 32305 21749 17603 24979 38949 36015 15096 13590 20413 42412 54780
9677 54780 45307 44281 40191 39116 41017 68767 82754 50797 49823 53836 61046 87736 81111 94780
9663 94780 139637 170153 225089 292493 325607 341583 347819 366727 381241 361485 341196 305095
9651 305095 276593 253032 227773 192338 186507 149647 131027 107996 70016 58067 80389 83735
9639 83735 72096 64282 34206 35882 70638 72854 72015 64210 64891 12986 -7997 18316 29100
9626 29100 16081 -8623 -3919 23365 33931 76886 85377 48029 49131 51561 56756 59349 49256
$$ packed form
9716B1313J8935K0324j8369l3112Q332J4613j0414j1054P03L1961N066k6379m842
9703A7077k3533J3792N3813Q536j9743M427j0355k0238m1L01M491j9235L3725
9690D3017j4942j9136K3366j0556m146P376J3970k934k0919j506O823K1999J2368
9677E4780r473j026m090j075J901K7750J3987l1957r74M013P210K6690o625J3669
9663I4780M4857L0516N4936O7404L3114J5976O236J8908J4514j9756k0289l6101
9651C05095k8502k3561k5259l5435n831l6860j8620k3031l7980j1949K2322L346
9639H3735j1639p814l0076J676L4756K216q39p805O81n1905k0983K6313J0784
9626B9100j3019k4704M704K7284J0566M2955Q491l7348J102K430N195K593j0093
$$ plain form
9613 49256 66855 44251 58470 49432 39168 48136 51921 51735 59515 38847 23441 27859 62669
9600 62669 105801 89156 65967 40771 20381 33695 30086 49049 52739 39489 36541 21307
9588 21307 55750 91674 90235 53137 26706 11174 16634 28162 21998 14697 20019 51315 66251
9575 66251 85213 70595 52792 37411 29297 39610 46984 41443 6992 4812 19560 16516 3396
9562 3396 28047 35056 27756 28975 34228 56403 61007 50256 47661 30482 23335 17856 17984 33244
9548 33244 48788 53684 51598 62220 59852 56015 59754 45540 46753 68741 101795 103773 106940
9535 106940 68058 53916 49245 41085 60510 65079 87638 75882 67434 69715 51069 46916 34007
9522 34007 27524 66145 84326 90389 80991 80270 78874 92531 78557 70579 56363 32937 19933
$$ packed form
9613D9256J7599k2604J4219r038j0264Q968L785j86P780k0668j5406M418L4810
9600F2669M3132j6645k3189k5196k0390J3314l609J8963L690j3250k948j5234
9588B1307L4443L5924j439l7098k6431j5532N460J1528o164p301N322L1296J4936
9575F6251J8962j4618j7803j5381q114J0313P374n541l4451k180J4748l044j3120
9562C396K4651P009p300J219N253K2175M604j0751k595j7179p147n479J28J5260
9548C3244J5544M896k086J0622k368l837L739j4214J213K1988L3054J978L167
9535A06940l8882j4142m671q160J9425M569K2559j1756q448K281j8646m153j2909
9522C4007o483L8621J8181O063r398p21j396J3657j3974p978j4216k3426j3004
$$ plain form
9509 19933 48108 49104 43125 39371 67441 79110 39486 53185 65899 58946 78310 111447 108429
9496 108429 89412 79609 77366 87972 102302 110120 79782 64404 70302 48750 34248 29452 23321
9483 23321 35809 37512 44340 52684 60854 73065 54992 53906 70467 86798 83587 74797 52212
9470 52212 58410 45023 29342 44908 44825 32410 20300 18248 41667 47013 34500 50015 57361
9457 57361 50518 61557 54071 46368 50214 47362 9962 11205 45207 83439 110339 89184 75349
9444 75349 105485 120612 98229 95182 65221 44801 58410 56753 43702 36467 35479 50974 60007
9431 60007 75082 86033 23662 9784 38952 73383 63587 64333 74209 72447 70095 72196 77884
9418 77884 64632 48882 65672 95589 95900 100208 83653 86056 88984 90008 101448 106458 98599
$$ packed form
9509A9933K8175R96n979l754K8070J1669l9624J3699J2714o953J9364L3137l018
9496A08429j9017r803k243J0606J4330P818l0338j5378N898k1552j4502m796o131
9483B3321J2488J703O828Q344Q170J2211j8073j086J6561J6331l211q790k2585
9470E2212O198j3387j5681J5566q3j2415j2110k052K3419N346j2513J5515P346
9457E7361o843J1039p486p703L846k852l7400J243L4002L8232K6900k1155j3835
9444G5349L0136J5127k2383l047k9961k0420J3609j657j3051p235r88J5495R033
9431F0007J5075J0951o2371j3878K9168L4431r796P46R876j762k352K101N688
9418G7884j3252j5750J6790K9917L11M308j6555K403K928J024J1440N010p859
$$ plain form
9405 98599 126070 118331 68242 47524 50207 57053 68294 59615 47139 31460 40914 50329 35207
9392 35207 26029 42642 22670 34753 75894 97948 99672 98455 71878 66813 81295 99323 91143
9379 91143 91504 71173 36035 27657 63458 80570 68735 78196 83759 102013 91979 67432 86434
9366 86434 85470 84928 84327 69332 92667 97767 109406 136084 101856 88299 111649 134622 116715
9353 116715 133390 135302 152783 143597 116591 89203 90155 93352 85356 118121 114267 110379 113251
9340 113251 125161 123309 123680 132210 137987 123132 110740 110204 116405 126768 113654 119245 102542
9327 102542 109875 114321 102549 87869 92755 62564 72222 82243 67731 74747 99538 107504 85080
9314 85080 54132 46609 75505 99851 117705 128808 109683 89003 93918 87512 75932 71078 79425
$$ packed form
9405I8599K7471p739n0089k0718K683O846J1241q679j2476j5679R454R415j5122
9392C5207r178J6613j9972J2083M1141K2054J724j217k6577n065J4482J8028q180
9379I1143L61k0331l5138q378L5801J7112j1835R461N563J8254j0034k4547J9002
9366H6434r64n42o01j4995K3335N100J1639K6678l4228j3557K3350K2973j7907
9353A16715J6675J912J7481r186k7006k7388R52L197p996L2765l854l888K872
9340A13251J1910j852L71Q530N777j4855j2392n36O201J0363j3114N591j6703
9327A02542P333M446j1772j4680M886l0191R658J0021j4512P016K4791P966k2424
9314H5080l0948p523K8896K4346J7854J1103j9125k0680M915o406j1580m854Q347
$$ plain form
9301 79425 109141 113583 101878 88479 81730 81792 102055 92536 110717 131128 119508 105618 105101
9288 105101 114329 106845 109560 116912 117905 128772 130387 148787 136427 127665 123043 132631 151962 159716
9274 159716 149946 139936 164680 193665 175409 172819 195153 192788 189456 204939 232378 230667 190022
9261 190022 168243 150550 170931 182849 199706 214655 209079 197288 191827 196247 172536 194598
9249 194598 206066 212705 233332 245595 256969 268120 264880 255069 221431 179546 164406 154474
9237 154474 131143 119215 96666 91333 128533 157424 189616 189230 151434 150808 182972 196157 200036
9224 200036 182720 161122 191472 204892 180934 175374 174224 158612 137938 147223 172429 185053
9212 185053 198513 210069 228255 239336 231047 206057 183178 210914 211569 200876 196265 175173
$$ packed form
9301G9425K9716M442j1705j3399o749O2K0263r519J8181K0411j1620j3890n17
9288A05101R228p484K715P352R93J0867J615J8400j2360q762m622R588J9331P754
9274A59716r770j0010K4744K8985j8256k590K2334k365l332J5483K7439j711m0645
9261A90022k1779j7693K0381J1918J6857J4949n576j1791n461M420k3711K2062
9249A94598J1468O639K0627J2263J1374J1151l240r811l3638m1885j5140r932
9237A54474k3331j1928k2549n333L7200K8891L2192l86l7796o26L2164J3185L879
9224B00036j7316k1598L0350J3420k3958n560j150j5612k0674R285K5206J2624
9212A85053J3460J1556J8186J1081q289k4990k2879K7736O55j0693m611k1092
$$ plain form
9200 175173 158773 158378 156831 149260 156613 148975 164181 178901 188232 199026 199190 207159 202948 180630
9186 180630 169964 183043 202049 218722 213318 199450 209242 205653 194267 178846 172017 193265
9174 193265 205481 213069 243500 286090 269675 265249 256161 238766 231632 216035 201928 202894 214694
9161 214694 219549 245845 257446 256359 214466 223469 241513 242968 206852 207643 240101 220829 207668
9148 207668 218279 220102 232335 233267 241282 241324 212163 233639 268414 267643 273293 276936 266636 260268
9134 260268 246341 253011 241656 252755 270730 258641 240211 256653 293951 340423 364716 374382
9122 374382 363701 341456 339918 394244 389017 366459 365322 357610 351022 358811 376554 366195 354336
9109 354336 347597 344847 343262 368493 351205 334416 330970 334316 347347 351804 325743 330064 333004
$$ packed form
9200A75173j6400l95j547p571P353p638J5206J4720R331J0794J64P969m211k2318
9186A80630j0666J3079J9006J6673n404j3868R792l589j1386j5421o829K1248
9174A93265J2216P588L0431M2590j6415m426r088j7395p134j5597j4107R66J1800
9161B14694M855K6296J1601j087m1893R003J8044J455l6116P91L2458j9272j3161
9148B07668J0611J823J2233R32Q015M2k9161K1476L4775p71N650L643j0300o368
9134B60268j3927O670j1355J1099J7975j2089j8430J6442L7298M6472K4293R666
9122C74382j0681k2245j538N4326n227k2558j137p712o588P789J7743j0359j1859
9109C54336o739k750j585K5231j7288j6789l446L346J3031M457k6061M321K940
$$ plain form
9096 333004 333034 335873 324763 312858 300579 322807 334855 334751 354738 343175 322016 310271 322702
9083 322702 343174 354316 369998 372149 368429 361838 367477 365795 379327 374863 353349 323197 318659
9070 318659 348781 357395 336468 335445 338429 339369 346960 329826 328558 337300 344097 352533 328533 325320
9056 325320 337891 346146 339784 348895 328494 316187 356916 352881 370171 387345 404583 441637
9044 441637 442457 433851 460813 434899 422855 437450 439502 415198 397012 422440 459231 505425
9032 505425 532300 532031 536060 540605 511942 522962 534766 584282 610137 635294 655752 677010
9020 677010 696265 680567 713923 751186 779232 794876 795020 786854 787068 780094 775267 775685 780055 804295
9006 804295 832854 844598 843485 861249 869572 888409 901779 917603 942254 947927 968163 989270
$$ packed form
9096C33004L0K839j1110j1905j2279K2228J2048j04J9987j1563k1159j1745J2431
9083C22702K0472J1142J5682K151l720o591N639j682J3532m464k1514l0152m538
9070C18659L0122Q614k0927j023K984R40P591j7134j268Q742O797Q436k4000l213
9056C25320J2571Q255o362R111k0401j2307M0729m035J7290J7174J7238L7054
9044D41637Q20q606K6962k5914j2044J4595K052k4304j8186K5428L6791M6194
9032E05425K6875k69M029M545k8663J1020J1804M9516K5855K5157K0458K1258
9020F77010J9255j5698L3356L7263K8046J5644J44q166K14o974m827M18M370K4240
9006H04295K8559J1744j113J7764Q323J8837J3370J5824K4651N673K0236K1107
$$ plain form
8994 989270 984186 1012174 1030698 1066263 1116707 1159574 1173870 1179752 1209593 1247243 1271129 1273532
8982 1273532 1280045 1270095 1282099 1295332 1317380 1328063 1362586 1392782 1390099 1382445 1398492 1391372
8970 1391372 1411984 1443158 1458376 1495432 1518966 1538518 1570952 1600172 1631119 1675640 1689221
8959 1689221 1725248 1771122 1826890 1850702 1892721 1937951 1967148 2005732 2034625 2059060 2097120
8948 2097120 2145859 2214055 2251026 2279141 2339007 2412141 2505853 2567647 2598905 2656214 2714989
8937 2714989 2800425 2918709 3005752 3076969 3131508 3211992 3278287 3357081 3453229 3554358 3658180
8926 3658180 3758743 3884968 4004245 4134837 4293933 4454797 4650212 4813836 4982304 5175328
8916 5175328 5368692 5554038 5750747 5956682 6197626 6474211 6739647 7009321 7288274 7589978
$$ packed form
8994I89270n084K7988J8524L5565N0444M2867J4296N882K9841L7650K3886K403
8982A273532O513r950J2004J3233K2048J0683L4523L0196k683p654J6047p120
8970A391372K0612L1174J5218L7056K3534J9552L2434K9220L0947M4521J3581
8959A689221L6027M5874N5768K3812M2019M5230K9197L8584K8893K4435L8060
8948B097120M8739O8196L6971K8115N9866P3134R3712O1794L1258N7309N8775
8937B714989Q5436J18284Q7043P1217N4539Q0484O6295P8794R6148J01129J03822
8926C658180J00563J26225J19277J30592J59096J60864J95415J63624J68468J93024
8916E175328J93364J85346J96709K05935K40944K76585K65436K69674K78953L01704
$$ plain form
8906 7589978 7917316 8295847 8708530 9125580 9591548 10060649 10571589 11141928 11750110 12396832
8896 12396832 13086899 13837149 14693415 15657092 16683051 17787648 19030207 20428826 21953279
8887 21953279 23630644 25477870 27547077 29813826 32347133 35214561 38447753 42098817
8879 42098817 46210923 50898343 56326383 62614985 69914297 78335787 87473427 96252817
8871 96252817 104371927 112057194 119288365 126042614 132097977 137177455 141078579 143584709
8863 143584709 144579022 144035125 141914188 138323906 133373356 127238958 120157542 112380670
8855 112380670 104249133 95998331 87884351 80092199 72765517 65985817 59852914 54296110
8847 54296110 49281038 44793393 40728005 37118326 33965617 31163171 28642194 26396993
$$ packed form
8906G589978L27338L78531M12683M17050M65968M69101N10940N70339O08182O46722
8896A2396832O90067P50250Q56266R63677J025959J104597J242559J398619J524453
8887B1953279J677365J847226K069207K266749K533307K867428L233192L651064
8879D2098817M112106M687420N428040O288602P299312Q421490R137640Q779390
8871I6252817Q119110P685267P231171O754249O055363N079478L901124K506130
8863A43584709R94313n43897k120937l590282m950550o134398p081416p776872
8855A12380670q131537q250802q113980p792152p326682o779700o132903n556804
8847E4296110n015072m487645m065388l609679l152709k802446k520977k245201
$$ plain form
8839 26396993 24419971 22624093 20985325 19489518 18180776 16987185 15899351 14952570
8831 14952570 14062762 13239396 12477654 11756704 11111786 10503439 9938500 9427008 8988148
8822 8988148 8563568 8153587 7770807 7424492 7082028 6768861 6489771 6225555 5958453 5699252
8812 5699252 5476234 5281837 5112869 4958957 4782870 4593175 4430943 4272639 4133568 4007086
8802 4007086 3900443 3764016 3623717 3443500 3327781 3241314 3155722 3064515 3002472 2952939
8792 2952939 2863904 2776310 2688438 2611113 2546848 2488003 2437145 2374649 2301266 2238856 2205529
8781 2205529 2170459 2121181 2033167 1963789 1930646 1877750 1841599 1799280 1712862 1690758 1675449
8770 1675449 1643975 1612366 1522734 1466531 1452545 1433022 1416312 1411126 1405324 1383484 1356836 1343883
$$ packed form
8839B6396993j977022j795878j638768j495807j308742j193591j087834r46781
8831A4952570q89808q23366p61742p20950o44918o08347n64939n11492m38860
8822H988148m24580m09981l82780l46315l42464l13167k79090k64216k67102k59201
8812E699252k23018j94397j68968j53912j76087j89695j62232j58304j39071j26482
8802D007086j06643j36427j40299j80217j15719q6467q5592r1207o2043m9533
8792B952939q9035q7594q7872p7325o4265n8845n0858o2496p3383o2410l3327
8781B205529l5070m9278q8014o9378l3143n2896l6151m2319q6418k2104j5309
8770A675449l1474l1609q9632n6203j3986j9523j6710n186n802k1840k6648j2953
$$ plain form
8758 1343883 1323678 1303151 1293279 1296511 1254059 1216527 1202953 1189532 1183596 1155996 1114139 1103400
8746 1103400 1124774 1155527 1169215 1155490 1131117 1126266 1141409 1139200 1129242 1121379 1101980 1077809
8734 1077809 1059366 1033278 1000190 983698 965577 942927 954841 959829 926491 883149 828180 804698
8722 804698 799746 792683 764875 723309 718420 709332 683932 647224 629206 626654 637581 628685 648588
8709 648588 653722 629368 631352 605078 585415 590247 594335 611552 611997 600824 594009 579701 580980
8696 580980 564145 560656 558667 575040 593048 616690 600495 576009 572495 569469 563274 562223 550180
8683 550180 561966 560990 561526 539146 532399 561663 556787 529883 523227 534369 549082 536738 511329
8670 511329 533255 552471 538390 503904 480153 467758 434791 423230 436827 444004 424538 410769
$$ packed form
8758A343883k0205k0527r872L232m2452l7532j3574j3421n936k7600m1857j0739
8746A103400K1374L0753J3688j3725k4373m851J5143k209r958p863j9399k4171
8734A077809j8443k6088l3088j6492j8121k2650J1914M988l3338m3342n4969k3482
8722H04698m952p063k7808m1566m889r088k5400l6708j8018k552J0927q896J9903
8709F48588N134k4354J984k6274j9663M832M088J7217M45j1173o815j4308J279
8696E80980j6835l489j989J6373J8008K3642j6195k4486l514l026o195j051j2043
8683E50180J1786r76N36k2380o747K9264m876k6904o656J1142J4713j2344k5409
8670E11329K1926J9216j4081l4486k3751j2395l2967j1561J3597P177j9466j3769
$$ plain form
8658 410769 396087 379884 380470 369912 352002 325707 307557 299128 327617 360888 351869 346445 344573
8645 344573 360522 360193 320610 314218 323719 288353 270411 297134 328133 314289 301345 300575 285772
8632 285772 264606 273684 257760 242255 270913 313704 302194 280401 277938 293800 325252 325090
8620 325090 307389 312578 316840 288738 293006 268910 248172 241737 248200 260057 239723 258903 270411
8607 270411 272042 270335 261453 243443 261117 257131 260695 257550 237072 272245 297662 290641 307376
8594 307376 309423 307665 325616 322146 304289 286001 275239 256374 246840 256918 254465 237320 234834
8581 234834 233330 233713 226066 239020 223753 201977 162359 157219 196804 208258 194371 195822 184291
8568 184291 166464 148877 148884 128213 126533 111608 99840 101128 123264 110516 90301 81013 107842
$$ packed form
8658D10769j4682j6203N86j0558j7910k6295j8150q429K8489L3271r019n424j872
8645C44573J5949l29l9583o392R501l5366j7942K6723L0999j3844j2944p70j4803
8632B85772k1166R078j5924j5505K8658M2791j1510k1793k463J5862L1452j62
8620C25090j7701N189M262k8102M268k4096k0738o435O463J1857k0334J9180J1508
8607B70411J631j707q882j8010J7674l986L564l145k0478L5173K5417p021J6735
8594C07376K047j758J7951l470j7857j8288j0762j8865r534J0078k453j7145k486
8581B34834j504L83p647J2954j5267k1776l9618n140L9585J1454j3887J451j1531
8568A84291j7827j7587Pk0671j680j4925j1768J288K2136j2748k0215r288K6829
$$ plain form
8555 107842 112549 103289 98392 102186 97485 120935 113357 83964 112797 165716 171410 169083 141628
8542 141628 150489 158091 151260 150314 122689 118986 111164 128942 119306 131443 137204 121160 111040
8529 111040 141730 148462 116619 126541 136213 130198 117512 110312 92340 84213 76139 82535 73158
8516 73158 89326 113972 88889 58809 35075 16736 42035 87967 114378 127116 110817 119068
8504 119068 116413 109740 99726 104173 101359 96484 105990 123686 131149 116772 105577 88228 92661
8491 92661 95075 89377 83995 78224 63821 80211 89702 87896 112098 83729 60418 56464 45857
8478 45857 44464 47561 43666 57630 75095 83117 91968 111750 130997 130962 123108 117579 107574 99320
8464 99320 83293 53178 49290 41001 61056 88260 101039 75266 49553 67721 72905 73696 69725
$$ packed form
8555A07842M707r260m897L794m701K3450p578k9393K8833N2919N694k327k7455
8542A41628Q861P602o831r46k7625l703p822J7778r636J2137N761j6044j0120
8529A11040L0690O732l1843R922R672o015j2686p200j7972q127q074O396r377
8516G3158J6168K4646k5083l0080k3734j8339K5299M5932K6411J2738j6299Q251
8504A19068k655o673j0014M447k814m875R506J7696P463j4377j1195j7349M433
8491I2661K414n698n382n771j4403J6390R491j806K4202k8369k3311l954j0607
8478D5857j393L097l895J3964J7465Q022Q851J9782J9247l5p854n529j0005q254
8464I9320j6027l0115l888q289K0055K7204J2779k5773k5713J8168N184P91l971
$$ plain form
8451 69725 46222 71174 78543 99657 88806 65727 80215 74528 48322 26528 36042 60948
8439 60948 69808 65495 72497 88537 105671 77434 61075 85896 122853 116831 139289 143319 127637
8426 127637 115789 86068 78009 95688 117461 102455 64317 45981 48520 44969 53321 40464
8414 40464 49976 45805 50964 56473 63786 43131 47535 53907 55689 44722 59873 72548 81754 101492
8400 101492 80110 49755 76235 58314 68484 94721 105416 110573 120701 102898 89797 100475
8388 100475 79418 66298 76430 65627 65594 55724 44664 52853 58233 46917 23923 26233 42362
8375 42362 49397 30487 12730 34958 25670 29572 56234 57970 39017 35148 39356 48403 64847
8362 64847 66447 68022 59258 65531 64073 65924 55096 36055 38989 39224 23829 18682 55922 55362
$$ packed form
8451F9725k3503K4952P369K1114j0851k3079J4488n687k6206k1794R514K4906
8439F0948Q860m313P002J6040J7134k8237j6359K4821L6957o022K2458M030j5682
8426A27637j1848k9721q059J7679K1773j5006l8138j8336K539l551Q352j2857
8414D0464R512m171N159N509P313k0655M404O372J782j0967J5151J2675R206J9738
8400A01492k1382l0355K6480j7921J0170K6237J0695N157J0128j7803j3101J0678
8388A00475k1057j3120J0132j0803l3r870j1060Q189N380j1316k2994K310J6129
8375D2362P035j8910j7757K2228r288L902K6662J736j8953l869M208R047J6444
8362F4847J600J575q764O273j458J851j0828j9041K934K35j5395n147L7240n60
$$ plain form
8348 55362 22918 12832 27511 -1433 124 11122 23558 57017 49340 32575 6683 5028
8336 5028 -12751 -13926 10466 7635 12269 18652 10116 15528 17983 15978 39169 44173 59315 79073
8322 79073 62977 34122 -5967 -30455 -30488 -29255 -5997 -19200 -21309 -20212 -39740 -19564 13511
8309 13511 21938 28295 43669 24626 25202 57048 57769 43239 60204 80905 62000 6087 -13877
8296 -13877 14836 48329 37182 25552 3381 23778 35346 22449 19675 10941 26701 30486
8284 30486 48874 40557 22059 27062 3908 -6255 -710 -4647 -5550 2878 10849 33546 15695
8271 15695 -7078 -11958 20833 11129 -1910 6844 16827 24916 34678 44823 48796 32268 26215
8258 26215 61580 37179 -3058 -10840 -871 18098 15698 -5684 -11731 -23860 -30982 -20757 -8244
$$ packed form
8348E5362l2444j0086J4679k8944J557J0998J2436L3459p677j6765k5892j655
8336E028j7779j175K4392k831M634O383q536N412K455k005K3191N004J5142J9758
8322G9073j6096k8855m0089k4488l3J233K3258j3203k109J097j9528K0176L3075
8309A3511Q427O357J5374j9043N76L1846P21j4530J6965K0701j8905n5913j9964
8296a3877K8713L3493j1147j1630k2171K0397J1568j2897k774q734J5760L785
8284C0486J8388q317j8498N003k3154j0163N545l937r03Q428P971K2697j7851
8271A5695k2773m880L2791r704j3039Q754R983Q089R762J0145L973j6528o053
8258B6215L5365k4401m0237p782R969J8969k400k1382o047j2129p122J0225J2513
$$ plain form
8245 -8244 -10837 -9153 7929 2576 15215 48370 66886 52298 47199 41141 25261 20840 20031 18762
8231 18762 15024 39157 54892 55399 48371 48875 36667 41653 58378 41068 18303 4233 -10057
8218 -10057 -18547 -20189 -16321 -16045 2010 -7499 -20953 -15671 -2327 -89 -9629 -935 27879 29263
8204 29263 14870 8128 9145 9014 20449 27902 21346 -9300 -8971 -9183 -25053 -3945 3266 8151
8190 8151 37978 33746 44582 52768 -4026 -13226 6846 7455 16085 36788 34155 12921 19619 38145
8176 38145 55057 55257 47962 26030 29812 36091 32338 37673 38897 39422 65616 54954 35084 19700
8162 19700 31531 44599 52516 36859 24311 27701 1883 6381 8892 -7385 4057 -11289 -13118
8149 -13118 -12289 -34155 -28584 -12890 11209 30139 27378 40873 31411 27646 -11636 -33394 -33458 -42072
$$ packed form
8245h244k593J684J7082n353J2639L3155J8516j4588n099o058j5880m421q09j269
8231A8762l738K4133J5735N07p028N04j2208M986J6725j7310k2765j4070j4290
8218a0057q490j642L868K76J8055r509j3454N282J3344K238r540Q694K8814J384
8204B9263j4393o742J017j31J1435P453o556l0646L29k12j5870K1108P211M885
8190H151K9827m232J0836Q186n6794r200K0072O09Q630K0703k633k1234O698J8526
8176C8145J6912K00p295k1932L782O279l753N335J224N25K6194j0662j9870j5384
8162A9700J1831J3068P917j5657j2548L390k5818M498K511j6277J1442j5346j829
8149a3118Q29k1866N571J5694K4099J8930k761J3495r462l765l9282k1758o4q614
$$ plain form
8135 -42072 -53236 -48987 -38289 -6843 6659 20740 2613 9848 25352 45393 51435 29383
8123 29383 35879 45675 53296 49184 37329 50307 17910 6122 39684 41129 24903 25519 30383
8110 30383 32684 22934 32576 29134 25870 19530 -4796 -533 -2894 -13493 -8557 28403 27575 2581
8096 2581 -16795 -4517 4482 6434 -4912 -12039 3461 22890 17432 20581 -1909 -33757 -3120
8083 -3120 17769 10049 20544 37470 30625 29952 19254 13580 18280 25755 40245 42827 24405 25472
8069 25472 23754 30293 37958 38662 17180 18905 26241 33020 25979 33841 11842 -7122 5503 34342
8055 34342 23877 29620 61867 61458 45380 18409 -1056 2614 -4918 3267 31017 3734 -35133
8042 -35133 -36559 -20650 7270 21423 35412 33637 25460 31174 31224 21925 33142 31128 26101 43217
$$ packed form
8135d2072j1164M249J0698L1446J3502J4081j8127P235J5504K0041O042k2052
8123B9383O496R796P621m112j1855J2978l2397j1788L3562J445j6226O16M864
8110C0383K301r750R642l442l264o340k4326M263k361j0599M936L6960q28k4994
8096B581j9376J2278Q999J952j1346p127J5500J9429n458L149k2490l1848L0637
8083c120K0889p720J0495J6926o845o73j0698n674M700P475J4490K582j8422J067
8069B5472j718O539P665P04k1482J725P336O779p041P862k1999j8964J2625K8839
8055C4342j0465N743L2247m09j6078k6971j9465L670p532Q185K7750k7283l8867
8042c5133j426J5909K7920J4153J3989j775q177N714N0r299J1217k014n027J7116
$$ plain form
8028 43217 62448 36317 22993 30489 29332 22500 17650 14798 32164 56202 34684 27138 16159
8015 16159 16157 -13589 -11610 10161 16799 20472 18760 25085 7907 979 15173 25831 51918 50071
8001 50071 17643 4429 13441 24940 5776 -22988 -15313 15645 11739 14085 7617 -20369 -2833
7988 -2833 12256 20166 12397 34495 30932 8675 3576 13644 40711 44326 33566 26224 5212
7975 5212 -2614 -5157 28493 31860 -1829 -18593 -16717 -2924 16435 6240 14454 36743 53981
7962 53981 66457 61123 28086 -12950 -2907 28367 23944 45868 38993 41696 -3680 -16141 -3297
7949 -3297 6603 12513 15437 430 -7823 6687 36313 62430 68249 37576 38465 54029 49763 35764
7935 35764 41209 24786 2467 6245 20695 7099 -3456 12741 14504 23616 12332 12442 29087
$$ packed form
8028D3217J9231k6131j3324P496j157o832m850k852J7366K4038k1518p546j0979
8015A6159kk9746J979K1771O638L673j712O325j7178o928J4194J0658K6087j847
8001E0071l2428j3214R012J1499j9164k8764P675L0958l906K346o468k7986J7536
7988b833J5089P910p769K2098l563k2257n099J0068K7067L615j0760p342k1012
7975E212p826k543L3650L367l3689j6764J876J3793J9359j0195Q214K2289J7238
7962E3981J2476n334l3037m1036J0043L1274m423K1924o875K703m5376j2461J2844
7949c297R900N910K924j5007q253J4510K9626K6117N819l0673Q89J5564m266j3999
7935C5764N445j6423k2319L778J4450j3596j0555J6197J763R112j1284J10J6645
$$ plain form
7922 29087 19016 28267 22143 30722 45439 39083 66527 70694 35367 15969 -7422 -7104 20989
7909 20989 43888 41653 51142 71377 23937 2961 39563 65622 50248 43790 53239 60818 44724
7896 44724 43136 23257 -6640 -3609 37271 31115 -2010 -24131 5772 14621 9336 221 -23931
7883 -23931 -33282 -20657 -6172 -3435 5740 10797 15817 4032 13622 9412 -4090 7054 2415
7870 2415 27497 35487 11974 -21624 -1261 26424 62430 66260 60115 51676 38993 51495 28318
7857 28318 17860 5644 -10060 -7925 -5097 -29235 -45329 -9123 11214 8129 3064 -16483 -30621
7844 -30621 -19922 3327 -15653 -41704 -44750 -40024 -28561 -9913 1477 12529 28443 14785
7832 14785 19916 16989 28348 33250 41206 32557 14987 6718 8134 3665 -14068 -13710 -12682 14500
$$ packed form
7922B9087j0071R251o124Q579J4717o356K7444M167l5327j9398k3391L18K8093
7909B0989K2899k235R489K0235m7440k0976L6602K6059j5374o458R449P579j6094
7896D4724j588j9879k9897L031M0880o156l3125k2121K9903Q849n285r115k4152
7883b3931r351J2625J4485K737R175N057N020j1785R590m210j3502J1144m639
7870B415K5082P990k3513l3598K0363K7685L6006L830o145q439j2683J2502k3177
7857B8318j0458j2216j5704K135K828k4138j6094L6206K0337l085n065j9547j4138
7844c0621J0699K3249j8980k6051l046M726J1463J8648J1390J1052J5914j3658
7832A4785N131k927J1359M902P956q649j7570q269J416m469j7733L58J028K7182
$$ plain form
7818 14500 16595 21757 -3799 1424 -1136 -16200 -35756 -13486 6809 15334 19615 31542 23387
7805 23387 7455 -17889 -30274 -47003 -46171 -50240 -50136 -55230 -24974 -8169 -8214 -19102 -5012 13046
7791 13046 -24362 -40824 9227 19141 -8586 -18975 -3382 -32436 -30780 -16889 -21538 -53248
7779 -53248 -25492 -14072 -7208 -25315 -17402 -6345 5515 -15776 -43322 -33296 -23204 3827
7767 3827 -10436 -39346 -33271 -19829 -22706 -16869 3592 13695 3238 -10995 -28194 -15554 -19566
7754 -19566 -2801 15118 -2458 -24572 -25041 -18152 -30215 -32294 -2748 2559 3124 9677 20165
7741 20165 12527 -7543 -16285 -2264 -15789 -37783 -29926 -19111 -14589 -4705 1063 15624 19997
7728 19997 17250 -2756 1099 -13557 -14453 -8343 7045 3799 5278 7158 2408 -12161 -1556 10348
$$ packed form
7818A4500K095N162k5556N223k560j5064j9556K2270K0295Q525M281J1927q155
7805B3387j5932k5344j2385j6729Q32m069J04n094L0256J6805m5j0888J4090J8058
7791A3046l7408j6462N0051R914k7727j0389J5593k9054J656J3891m649l1710
7779e3248K7756J1420O864j8107P913J1057J1860k1291k7546J0026J0092K7031
7767C827j4263k8910O075J3442k877N837K0461J0103j0457j4233j7199J2640m012
7754a9566J6765J7919j7576k2114m69O889j2063k079K9546N307N65O553J0488
7741B0165p638k0070q742J4021j3525k1994P857J0815M522R884N768J4561M373
7728A9997k747k0006L855j4656q96O110J5388l246J479J880m750j4569J0605J1904
$$ plain form
7714 10348 -9136 -23087 -30006 -46974 -43626 -47885 -15578 24254 28880 -1416 -5639 9113 -5887
7701 -5887 -5920 2222 7991 -10875 -25362 -18111 -25002 -37294 -61035 -47042 -47993 -54277 -30672 -51201
7687 -51201 -99188 -55611 -8979 -12779 1193 -8871 -26937 -40451 -29176 -23135 -20071 -28891 -5135
7674 -5135 10541 -1709 -4638 23439 35077 57279 41136 1579 -2021 -8177 -27059 -39153 -31913
7661 -31913 -34356 -18730 -8956 -26929 -45569 -49961 -61821 -61104 -30047 -20672 -15908 -9539 -3073 6138
7647 6138 4932 24299 41389 24395 17344 955 -15835 -31868 -48389 -49940 -63499 -49515 -49298
7634 -49298 -64101 -53242 -38574 -20724 -13715 -16891 -2389 10605 -13 -5402 -29252 -3845
7622 -3845 9258 -12920 -38687 -35099 -45636 -34479 -24524 -18103 -12920 -10767 -2826 6078 17939
$$ packed form
7714A0348j9484j3951o919j6968L348m259L2307L9832M626l0296m223J4752j5000
7701e887l3Q142N769j8866j4487P251o891j2292k3741J3993r51o284K3605k0529
7687e1201m7987M3577M6632l800J3972j0064j8066j3514J1275O041L064q820K3756
7674e135J5676j2250k929K8077J1638K2202j6143l9557l600o156j8882j2094P240
7661c1913k443J5626R774j7973j8640m392j1860P17L1057R375M764O369O466R211
7647F138j206J9367J7090j6994p051j6389j6790j6033j6521j551j3559J3984K17
7634d9298j4803J0859J4668J7850P009l176J4502J2994j0618n389k3850K5407
7622c845J3103k2178k5767L588j0537J1157R955O421N183K153P941Q904J1861
$$ plain form
7609 17939 19725 42134 54598 40810 9008 -27503 -65858 -88149 -68149 -51437 -18821 2874
7597 2874 8011 14048 3656 5802 381 -26917 -46942 -33072 -36133 -30135 -52031 -57352 -40546
7584 -40546 -51599 -44502 -31333 -22407 -15499 -25026 -51668 -50304 -19767 -16256 -12103 -12287 -34079 -37691
7570 -37691 -40212 -34953 -31570 -30708 -40752 -53006 -21355 -12356 -63319 -57567 -38467 -32931 -24033 -41367
7556 -41367 -61670 -47882 -19949 -1540 14407 -29751 -41745 -40643 -39166 -15291 16246 25370
7544 25370 27900 7579 1327 -22804 -42444 -52214 -67294 -72295 -68752 -41042 -252 20768 1504
7531 1504 -26909 -21130 -23109 -26811 -30349 -29114 -5662 -2810 -15643 -8942 -22247 -21977 -9640 -34861
7517 -34861 -27714 -11463 -8844 -19940 -37034 -15400 25024 47076 38123 22745 3444 -8080
$$ packed form
7609A7939J786K2409J2464j3788l1802l6511l8355k2291K0000J6712L2616K1695
7597B874N137O037j0392K146n421k7298k0025J3870l061N998k1896n321J6806
7584d0546j1053P097J3169Q926O908r527k6642J364L0537L511M153j84k1792l612
7570c7691k521N259L383Q62j0044j2254L1651Q999n0963N752J9100N536Q898j7334
7556d1367k0303J3788K7933J8409J5947m4158j1994J102J477K3875L1537R124
7544B5370K530k0321o252k4131j9640r770j5080n001L543K7710M0790K1020j9264
7531A504k8413N779j979l702l538J235K3452K852j2833O701j3305K70J2337k5221
7517c4861P147J6251K619j1096j7094K1634M0424K2052q953j5378j9301j1524
$$ plain form
7505 -8080 -18332 -33357 -11091 8667 8373 -16442 -23367 -2228 9794 10952 -1693 -1901 3352
7492 3352 -1537 -23790 -42165 -36420 -7162 -6329 -16349 -15252 -8343 -25796 -43471 -43063 -47766 -40611
7478 -40611 -34891 -49028 -52662 -18629 -14816 -5518 14295 -9369 -17997 -19110 -41143 -28298 -5129
7465 -5129 -20647 -29750 -28814 -9839 5848 10393 1392 -2756 -29065 -38391 -19207 -26837 -38617 -24307
7451 -24307 -9365 -18871 -12420 -20465 -14221 315 -10405 -18546 -13394 -6509 -37435 -62443 -52327
7438 -52327 -37832 -28337 -36792 -50928 -51182 -46818 -39213 -46893 -44307 -49541 -35560 -52034 -42271 -15348
7424 -15348 7709 681 -30072 -29542 -18534 -10034 -32213 -24321 -12859 -8406 -14701 24913 41230
7411 41230 24780 16125 -5112 6592 18665 11570 -2773 -40096 -47326 -33506 11617 15701 -31431
$$ packed form
7505h080j0252j5025K2266J9758k94k4815o925K1139J2022J158j2645k08N253
7492C352m889k2253j8375N745K9258Q33j0020J097O909j7453j7675M08m703P155
7478d0611N720j4137l634L4033L813R298J9813k3664q628j113k2033J2845K3169
7465e129j5518r103R36J8975J5687M545r001m148k6309r326J9184p630j1780J4310
7451b4307J4942r506O451q045O244J4536j0720q141N152O885l0926k5008J0116
7438e2327J4495R495q455j4136k54M364P605p680K586n234J3981j6474R763K6923
7424a5348K3057p028l0753N30J1008Q500k2179P892J1462M453o295L9614J6317
7411D1230j6450q655k1237J1704J2073p095j4343l7323p230J3820M5123M084m7132
$$ plain form
7398 -31431 -61888 -53978 -19308 -20568 -13416 -3547 23194 -861 -20983 -36195 -19022 -16776 -1234
7385 -1234 7450 -9064 -18266 -25095 -22798 -19369 -8879 -9529 -15499 -7725 -11378 -27369 -34567 -24102
7371 -24102 -18610 -9066 15835 7401 6155 -868 19713 7590 -9742 -15269 -23880 -9155 20126
7358 20126 39428 3575 -43631 -89812 -105623 -73357 -57540 -62291 -48353 -31951 -12595 -14204
7346 -14204 -30000 -19671 -34681 -35073 -30647 -28604 -27084 -20182 -11514 342 7191 4668 -12532 -16612
7332 -16612 -43574 -47040 -40634 -33189 -24698 -2092 -14578 -2737 -7544 -22200 -13989 -11284 10818
7319 10818 6608 -3518 -18961 -33872 -49689 -26403 -19933 -41151 -48976 -54139 -26811 -19185 -9538
7306 -9538 -38929 -55368 -40938 -17317 -3094 -9739 -32491 -15548 -14738 -10279 -10090 5876 46524
$$ packed form
7398c1431l0457P910L4670j260P152R869K6741k4055k0122j5212J7173K246J5542
7385a234Q684j6514r202o829K297L429J0490o50n970P774l653j5991p198J0465
7371b4102N492R544K4901q434j246p023K0581j2123j7332n527q611J4725K9281
7358B0126J9302l5853m7206m6181j5811L2266J5817m751J3938J6402J9356j609
7346a4204j5796J0329j5010l92M426K043J520O902Q668J1856O849k523j7200m080
7332a6612k6962l466O406P445Q491K2606j2486J1841m807j4656Q211K705K2102
7319A0818m210j0126j5443j4911j5817K3286O470k1218p825n163K7328P626R647
7306i538k9391j6439J4430K3621J4223o645k2752J6943Q10M459J89J5966M0648
$$ plain form
7293 46524 44651 17038 21088 -4711 -11756 -16281 -9331 9230 3717 14950 35041 27870 10113
7280 10113 -13090 -35142 -31277 -20005 -6404 -6101 -2782 -13448 208 -7320 -13829 -18371 -35617
7267 -35617 -31790 -47103 -61339 -57775 -31186 -11774 -20811 -16814 -42457 -59337 -39223 -17644 -11566
7254 -11566 -33288 -37973 -45079 -58201 -37327 -30114 -42533 -34306 -37168 -46864 -64175 -63441 -58809 -60391
7240 -60391 -84642 -74145 -52058 -48820 -40252 -22229 -1913 3692 -6277 -27775 -27822 -19802 14561
7227 14561 27888 9884 -18475 -19307 -4846 -20789 -36552 -18656 1820 -16048 -29496 -38581
7215 -38581 -41754 -22124 -12459 -10151 -9330 3280 -13581 -44401 -64869 -66300 -34984 -41498 -80048
7202 -80048 -87737 -55716 -10093 -20665 -24512 -18928 -21658 -21014 -20795 -17616 -37375 -26240 -26365 -18650
$$ packed form
7293D6524j873k7613M050k5799p045m525O950J8561n513J1233K0091p171j7757
7280A0113k3203k2052L865J1272J3601L03L319j0666J3656p528o509m542j7246
7267c5617L827j5313j4236L564K6589J9412r037L997k5643j6880K0114K1579O078
7254a1566k1722m685p106j3122K0874P213j2419Q227k862r696j7311P34M632j582
7240f0391k4251J0497K2087L238Q568J8023K0316N605r969k1498m7Q020L4363
7227A4561J3327j8004k8359q32J4461j5943j5763J7896K0476j7868j3448r085
7215c8581l173J9630R665K308Q21J2610j6861l0820k0468j431L1316o514l8550
7202h0048p689L2021M5623j0572l847N584k730O44K19L179j9759J1135j25P715
$$ plain form
7188 -18650 -48058 -60675 -36727 -22555 -29442 -36854 -53008 -55482 -46569 -21666 -39222 -37211 -9324
7175 -9324 16311 20079 27637 -629 -16966 -37399 -52076 -45724 -34352 -21099 -26598 -43503 -30653
7162 -30653 -17926 -6232 28369 13002 -8232 8826 28263 -11069 -39824 -26846 -36511 -46720
7150 -46720 -34644 -23699 -32249 -6495 10623 1276 2610 17658 12997 7104 29825 17833 1134
7137 1134 2465 1958 12176 -1771 -14258 1242 10051 16774 14723 6826 -11401 -9416 7038 8909
7123 8909 4383 10801 -2579 -1332 -8023 -7668 -12514 17267 37527 27063 15816 -11249 -14536 -6874
7109 -6874 1266 -10596 12679 34684 32287 55780 58365 36930 23663 10197 10221 28318 4781
7096 4781 -33346 -40922 -24915 -1309 24832 27017 55194 42986 17180 -8297 1483 24168 3272
$$ packed form
7188a8650k9408j2617K3948J4172o887p412j6154k474Q913K4903j7556K011K7887
7175i324K5635L768P558k8266j6337k0433j4677O352J1372J3253n499j6905J2850
7162c0653J2727J1694L4601j5367k1234J7058J9437l9332k8755J2978r665j0209
7150d6720J2076J0945q550K5754J7118r347J334J5048m661n893K2721j1992j6699
7137A134J331n07J0218j3947j2487J5500Q809O723k051p897j8227J985J6454J871
7123H909m526O418j3380J247o691L55m846K9781K0260j0464j1247k7065l287P662
7109f874Q140j1862K3275K2005k397K3493K585k1435j3267j3466K4J8097k3537
7096D781l8127p576J6007K3606K6141K185K8177j2208k5806k5477R780K2685k0896
$$ plain form
7083 3272 -5728 -1851 -18109 3642 -1546 -5939 -2740 -2533 5676 9775 -2235 -5962 3143 8349
7069 8349 -736 -15747 -8118 8796 11761 13493 2648 -24504 -26624 -32621 -9190 25187 10614
7056 10614 3519 28946 19650 11053 8351 4078 -3258 -1281 -14201 -29583 -27796 -50947 -34018
7043 -34018 -12051 -33418 -46612 -56662 -64275 -57132 -22396 -15086 -21213 -4707 15055 7785 -17241
7030 -17241 -1827 22571 -2689 -42677 -51393 -42234 -36426 -20533 -16754 -39732 -31094 -18924 -4460
7017 -4460 -6734 -2881 20510 3545 9420 15173 -8256 -31982 -33041 -15598 -29015 -55308 -66055
7004 -66055 -66115 -49482 -36376 -34626 -25547 -41096 -62536 -52365 -39840 -47653 -44890 -26653 -40019
6991 -40019 -43922 -57779 -49854 -17167 -638 -17511 -26893 -22262 -10926 -36576 -79499 -81642 -48418
$$ packed form
7083C272r000L877j6258K1751n188m393L199K07Q209M099j2010l727R105N206
7069H349r085j5011P629J6914K965J732j0845k7152k120n997K3431L4377j4573
7056A0614p095K5427r296q597k702m273p336J977j2920j5382J787k3151J6929
7043c4018K1967k1367j3194j0050p613P143L4736P310o127J6506J9762p270k5026
7030a7241J5414K4398k5260l9988q716R159N808J5893L779k2978Q638J2170J4464
7017d460k274L853K3391j6965N875N753k3429k3726j059J7443j3417k6293j0747
7004f6055o0J6633J3106J750R079j5549k1440J0171J2525p813K763J8237j3366
6991d0019l903j3857P925L2687J6529j6873r382M631J1336k5650m2923k143L3224
$$ plain form
6978 -48418 -40801 -48476 -57924 -59781 -61557 -49916 -30323 3818 4400 -24489 -5761 -14781 -27663
6965 -27663 -28326 -30997 -10837 18974 3620 17380 20478 10076 5035 14769 25120 -4873 -27982
6952 -27982 -40513 -43140 -42850 -29509 -44137 -45705 -32983 -8164 22267 25141 6947 -9252 -14023
6939 -14023 -17810 -26539 -45705 -50921 -68261 -36027 -21901 -8955 3825 16569 32324 22016
6927 22016 -10040 -26605 -19090 -20002 -27339 -31835 -32689 -46358 -37486 -38207 -45449 -54378 -38899 -38373 -17801
6912 -17801 -14881 -46162 -17112 16170 18568 -21140 8760 10956 -11934 -25096 -14976 -16575 -31570
6899 -31570 -37317 -35737 -29758 -33511 -32523 -40761 -39889 -53004 -19390 -2258 -24110 -21769 2108 3956
6885 3956 21225 43289 26783 -2175 3450 13516 -11722 -50233 -53387 -40065 -34738 -25015 -23463
$$ packed form
6978d8418P617p675r448j857j776J1641J9593L4141N82k8889J8728r020j2882
6965b7663o63k671K0160K9811j5354J3760L098j0402n041R734J0351k9993k3109
6952b7982j2531k627K90J3341j4628j568J2722K4819L0431K874j8194j6199m771
6939a4023l787q729j9166n216j7340L2234J4126J2946J2780J2744J5755j0308
6927B2016l2056j6565P515r12p337m496q54j3669Q872p21p242q929J5479N26K0572
6912a7801K920l1281K9050L3282K398l9708K9900K196k2890j3162J0120j599j4995
6899c1570n747J580N979l753R88q238Q72j3115L3614J7132k1852K341K3877J848
6885C956J7269K2064j6506k8958N625J0066k5238l8511l154J3322N327R723J552
$$ plain form
6872 -23463 -21869 -35040 -58921 -40504 -147 8840 -8541 -7003 -28870 -31119 -8032 -3840 -12074
6859 -12074 7199 20688 24671 19148 7656 -22521 -32368 -30818 -36452 -39485 -23726 -13611 -24487
6846 -24487 -22298 -42453 -47257 -36613 -6903 26863 26964 25752 22652 -3325 -14312 -11415 -11179 518
6832 518 3314 8781 -19473 -23512 -6029 1858 -22874 -30855 -55214 -28840 -13678 -15032 -15680 -35947
6818 -35947 -25148 -9539 8675 23016 8547 7933 -3205 -2029 13781 36912 36097 6776 -23799
6805 -23799 -35833 -29195 -39120 -12437 17630 22637 17521 24822 24969 3910 -23853 -17523 -36200
6792 -36200 -33666 -23032 -41512 -43483 -13965 -9504 -24416 -26886 -12807 -32335 -63035 -52465 -16702
6779 -16702 -26960 -28855 5118 22194 -78 -3022 4504 -26524 -49342 -34657 -18450 -6033
$$ packed form
6872b3463J594j3171k3881J8417M0357Q987j7381J538k1867k249K3087M192q234
6859a2074J9273J3489L983n523j1492l0177r847J550n634l033J5759J0115j0876
6846b4487K189k0155m804J0644K9710L3766J01j212l100k5977j0987K897K36J1697
6832E18K796N467k8254m039J7483P887k4732p981k4359K6374J5162j354o48k0267
6818c5947J0799J5609J8214J4341j4469o14j1138J176J5810K3131q15k9321l0575
6805b3799j2034O638r925K6683L0067N007n116P301J47k1059k7763O330j8677
6792c6200K534J0634j8480j971K9518M461j4912k470J4079j9528l0700J0570L5763
6779a6702j0258j895L3973J7076k2272k944P526l1028k2818J4685J6207J2417
$$ [...]
##END NTUPLES=NMR SPECTRUM
##END=
