##TITLE=Analysis number 312376
Compound Code cc 18402
Book Reference 382/98/1
Project Code adrs
Chemist Name simons
##JCAMPDX= 6.0         $$ Bruker NMR JCAMP-DX V2.0
##DATA TYPE= NMR SPECTRUM
##DATA CLASS= NTUPLES
##ORIGIN= Bruker BioSpin GmbH
##OWNER= NMR
$$ XWIN-NMR		Version 3.5
$$ Tue Aug  2 13:41:54 2005 GMT Daylight Time (UT+1h)  MAYBRIDGE\NMR@NMR_250MHZ
##.OBSERVE FREQUENCY= 250.131544655141
##.OBSERVE NUCLEUS= ^1H
##.ACQUISITION MODE= SIMULTANEOUS (DQD)
##.ACQUISITION SCHEME= undefined
##.AVERAGES= 16
##.DIGITISER RES= 18
##SPECTROMETER/DATA SYSTEM= dpx250
##.PULSE SEQUENCE= zg30
##.SOLVENT NAME= CDCl3
##.SHIFT REFERENCE= (INTERNAL, CDCl3, 0, 16.45)
##AUDIT TRAIL= $$ (NUMBER, WHEN, WHO, WHERE, WHAT)
$$ ##TITLE= Audit trail, XWIN-NMR		Version 3.5
$$ ##JCAMPDX= 5.01
$$ ##ORIGIN= Bruker BioSpin GmbH
$$ ##OWNER= NMR
$$ C:\u/data/dgb/nmr/ADRS/7030/pdata/1/auditp.txt
$$ ##AUDIT TRAIL=  $$ (NUMBER, WHEN, WHO, WHERE, WHAT)
(   1,<2005-08-02 13:41:19.35 +100>,<MAYBRIDGE\NMR>,<NMR_250MHZ>,
      <created by zg, POWCHK disabled, PULCHK disabled
       configuration hash MD5:
       62 19 C7 07 E1 42 D1 B7 37 6C 3D D0 77 39 F9 E6
       data hash MD5: 64K
       65 8C C8 57 D7 A5 5C 2C 70 3F 3B 15 E0 D1 F2 DD>)
(   2,<2005-08-02 13:41:35.45 +100>,<MAYBRIDGE\NMR>,<NMR_250MHZ>,
      <Start of raw data processing
       ef LB = 0.3 FT_mod = 6 PKNL = 1 SI = 32K 
       data hash MD5: 32K
       ED 77 3D 1E 9B 27 00 E7 8E 79 D3 69 39 F7 47 8C>)
(   3,<2005-08-02 13:41:40.43 +100>,<MAYBRIDGE\NMR>,<NMR_250MHZ>,
      <apk 
       data hash MD5: 32K
       25 D0 F7 16 21 F3 F5 F6 E3 1A F6 98 3F 82 B1 93>)
(   4,<2005-08-02 13:41:42.06 +100>,<MAYBRIDGE\NMR>,<NMR_250MHZ>,
      <abs ABSG = 5 
       data hash MD5: 32K
       C8 10 C9 19 9E 34 22 D1 5D 4B A3 DF A9 52 3F 16>)
$$ ##END=
$$ 
$$ hash MD5
$$ 68 E3 4E 25 3A DB 85 36 0C CD 79 95 70 F7 A8 D3
##$RELAX= 
##$RELAX= 
##$RELAX= 
##$RELAX= 
##$RELAX= 
##$RELAX= 
##$RELAX= 
$$ Bruker specific parameters
$$ --------------------------
##$DU= <C:\u>
##$EXPNO= 7030
##$NAME= <ADRS>
##$PROCNO= 1
##$TYPE= <nmr>
##$USER= <dgb>
##$AMP= (0..31)
100 100 100 100 100 100 100 100 100 100 100 100 100 100 100 100 100 100 
100 100 100 100 100 100 100 100 100 100 100 100 100 100 
##$AQSEQ= 0
##$AQ_mod= 3
##$AUNM= <au_zg>
##$AUTOPOS= <28 >
##$BF1= 250.13
##$BF2= 250.13
##$BF3= 250.13
##$BF4= 250.13
##$BF5= 500.13
##$BF6= 500.13
##$BF7= 500.13
##$BF8= 500.13
##$BYTORDA= 1
##$CFDGTYP= 0
##$CFRGTYP= 5
##$CHEMSTR= <none>
##$CNST= (0..31)
1 1 145 1 1 1 1 1 1 1 1 1 1 1 1 1 1 1 1 1 1 1 1 1 1 1 1 1 1 1 1 1 
##$CPDPRG= <>
##$CPDPRG1= <>
##$CPDPRG2= <>
##$CPDPRG3= <>
##$CPDPRG4= <mlev>
##$CPDPRG5= <mlev>
##$CPDPRG6= <mlev>
##$CPDPRG7= <mlev>
##$CPDPRG8= <mlev>
##$CPDPRGB= <>
##$CPDPRGT= <>
##$D= (0..31)
0 1 0 0 0 0 0 0 0 0.06 0 0 0 0 0 0 0.0002 0 0 0 0 0 0 0 0 0 0 0 0 0 0 
0 
##$DATE= 1122986477
##$DBL= (0..7)
120 120 120 120 120 120 120 120 
##$DBP= (0..7)
150 150 150 150 150 150 150 150 
##$DBP07= 0
##$DBPNAM0= <>
##$DBPNAM1= <>
$$ [...]
##$SUBNAM8= <"">
##$SUBNAM9= <"">
##$SW= 20.6930455092707
##$SWIBOX= (0..15)
0 0 3 0 0 0 0 0 0 0 0 0 0 0 0 0 
##$SW_h= 5175.983436853
##$TD= 65536
##$TD0= 1
##$TE= 295.16
##$TE2= 300
##$TE3= 300
##$TEG= 300
##$TL= (0..7)
0 120 120 120 120 120 120 120 
##$TP= (0..7)
150 150 150 150 150 150 150 150 
##$TP07= 0
##$TPNAME0= <>
##$TPNAME1= <>
##$TPNAME2= <>
##$TPNAME3= <>
##$TPNAME4= <>
##$TPNAME5= <>
##$TPNAME6= <>
##$TPNAME7= <>
##$TPOAL= (0..7)
0.5 0.5 0.5 0.5 0.5 0.5 0.5 0.5 
##$TPOFFS= (0..7)
0 0 0 0 0 0 0 0 
##$TUNHIN= 0
##$TUNHOUT= 0
##$TUNXOUT= 0
##$USERA1= <user>
##$USERA2= <user>
##$USERA3= <user>
##$USERA4= <user>
##$USERA5= <user>
##$V9= 5
##$VALIST= <valist>
##$VCLIST= <CCCCCCCCCCCCCCC>
##$VD= 0
##$VDLIST= <DDDDDDDDDDDDDDD>
##$VPLIST= <PPPPPPPPPPPPPPP>
##$VTLIST= <TTTTTTTTTTTTTTT>
##$WBST= 1024
##$WBSW= 4
##$XGAIN= (0..3)
0 0 0 0 
##$XL= 0
##$YL= 0
##$YMAX_a= 378741
##$YMIN_a= -226248
##$ZGOPTNS= <>
##$ZL1= 120
##$ZL2= 120
##$ZL3= 120
##$ZL4= 120
##$ABSF1= 16.45004
##$ABSF2= -4.243132
##$ABSG= 5
##$ABSL= 3
##$ALPHA= 0
##$AQORDER= 0
##$ASSFAC= 0
##$ASSFACI= 0
##$ASSFACX= 0
##$ASSWID= 0
##$AUNMP= <proc_1d>
##$AZFE= 0.1
##$AZFW= 0.1
##$BCFW= 0
##$BC_mod= 0
##$BYTORDP= 0
##$COROFFS= 0
##$CY= 12.5
##$DATMOD= 1
##$DC= 0
##$DFILT= <>
##$DTYPP= 0
##$F1P= 14.0000005364418
##$F2P= -0.99999901652339
##$FCOR= 0.5
##$FTSIZE= 32768
##$FT_mod= 6
##$GAMMA= 0
##$GB= 0
##$INTBC= 1
##$INTSCL= 1
##$ISEN= 128
##$LB= 0.3
##$LEV0= 0
##$LPBIN= 0
##$MAXI= 10000
##$MC2= 0
##$MEAN= 0
##$ME_mod= 0
##$MI= 0
##$NCOEF= 0
##$NC_proc= -5
##$NLEV= 6
##$NOISF1= 0
##$NOISF2= 0
##$NSP= 0
##$NTH_PI= 0
##$NZP= 0
##$OFFSET= 16.45004
##$PC= 1
##$PHC0= -72.30133
##$PHC1= 4.501008
##$PH_mod= 1
##$PKNL= yes
##$PPARMOD= 0
##$PSCAL= 4
##$PSIGN= 0
##$REVERSE= no
##$SF= 250.130017998052
##$SI= 32768
##$SIGF1= 0
##$SIGF2= 0
##$SINO= 400
##$SIOLD= 32768
##$SREGLST= <1H.CDCl3>
##$SSB= 0
##$STSI= 32768
##$STSR= 0
##$SW_p= 5175.98343685301
##$SYMM= 0
##$S_DEV= 0
##$TDeff= 65536
##$TDoff= 0
##$TI= <Analysis number 999999
Compound Code 99
Book Reference 9
Project Code 9>
##$TILT= no
##$TM1= 0
##$TM2= 0
##$TOPLEV= 0
##$USERP1= <user>
##$USERP2= <user>
##$USERP3= <user>
##$USERP4= <user>
##$USERP5= <user>
##$WDW= 1
##$XDIM= 32768
##$YMAX_p= 449913768
##$YMIN_p= -1065298
$$ End of Bruker specific parameters
$$ ---------------------------------
##NTUPLES= NMR SPECTRUM
##VAR_NAME=  FREQUENCY,     SPECTRUM/REAL,   SPECTRUM/IMAG
##SYMBOL=    X,             R,               I
##VAR_TYPE=  INDEPENDENT,   DEPENDENT,       DEPENDENT
##VAR_FORM=  AFFN,          ASDF,            ASDF
##VAR_DIM=   32768,         32768,           32768
##UNITS=     HZ,            ARBITRARY UNITS, ARBITRARY UNITS
##FACTOR=    0.157963299565203, 1,           1
##FIRST=     4114.64900569012, 0,            0
##LAST=      -1061.33443116289, 0,           0
##MIN=       -1061.33443116289, -1065298,    0
##MAX=       4114.64900569012, 449913768,    0
$$ Real data points
##PAGE= N=1
##DATA TABLE= (X++(R..R)), XYDATA
$$ [...]
$$ plain form
24164 45088 -250199 -497437 -585768 -524474 -309764 -598020 -544956 -360062 -248369 -226797
24154 -226797 -7199 171773 161603 155304 80370 -167736 -113945 -264129 -433718 -361590 -429812
24143 -429812 -261823 -163082 -21840 24165 -30707 -69441 -15513 185251 316817 406203 195121
24132 195121 -98600 -148838 -285602 -271322 -414646 -453537 -459516 -295340 -136013 -188498 -230888
24121 -230888 -93008 55534 41691 -32150 286098 463626 534895 293360 -36649 13768
24111 13768 142319 162599 153255 189590 339148 232435 108434 106834 289245 424514 278542
24100 278542 235259 229576 92401 -41622 166184 309122 101490 -73868 -237635 -96939
24090 -96939 13775 -64699 -84530 7732 167380 274035 272331 -32195 18761 -66001 -218049
$$ packed form
24164D5088k95287k47238q8331O1294K14710k88256N3064J84894J11693K1572
24154b26797K19598J78972j0170o299p4934k48106N3791j50184j69589P2128o8222
24143d29812J67989R8741J41242M6005n4872l8734N3928K00764J31566Q9386k11082
24132A95121k93721n0238j36764J4280j43324l8891n979J64176J59327n2485m2390
24121b30888J37880J48542j3843p3841L18248J77528P1269k41535l30009N0417
24111A3768J28551K0280r344L6335J49558j06713j24001j600J82411J35269j45972
24100B78542m3283n683j37175j34023K07806J42938k07632j75358j63767J40696
24090i6939J10714p8474j9831R2262J59648J06655j704l04526N0956q4762j52048
$$ plain form
24079 -218049 -58862 88698 189248 279632 171994 -45537 -101525 -88784 -259846 -215974
24069 -215974 -93284 90198 44338 -12719 69116 269599 529408 508106 378263 164263
24059 164263 41245 -71529 -155573 -136536 -181445 -236995 -124525 241577 225080 167784 6025
24048 6025 14001 99910 2617 -80423 -160307 -107990 -90857 -145847 -109605 -140719 -92221 175875
24036 175875 61644 92021 37780 -98129 19253 135938 259793 179742 186217 197229 334914
24025 334914 534865 470023 337260 348067 429064 265230 -39058 -46340 -93625 90677 316077
24014 316077 425547 521518 274407 -65736 -176449 -276647 -306656 -307904 -91224 205625
24004 205625 340443 192080 -92437 -222732 56462 114500 -117154 63175 276660 209550
$$ packed form
24079b18049J59187J47560J00550R0384j07638k17531n5988J2741j71062M3872
24069b15974J22690J83482m5860n7057Q1835K00483K59809k1302j29843k14000
24059A64263j23018j12774q4044J9037m4909n5550J12470L66102j6497n7296j61759
24048F025P976Q5909r7293q3040p9884N2317J7133n4990L6242l1114M8498K68096
24036A75875j14231L0377n4241j35909J17382J16685J23855q0051O475J1012J37685
24025C34914J99951o4842j32763J0807Q0997j63834l04288p282m7285J84302K25400
24014C16077J09470R5971k47111l40143j10713j00198l0009j248K16680K96849
24004B05625J34818j48363k84517j30295K79194N8038k31654J80329K13485o7110
$$ plain form
23994 209550 108296 134985 -21784 -167404 -129608 -42823 33316 24365 114188 34746 -69606
23983 -69606 -42338 58479 73495 14544 -139827 -276231 -238854 -54440 243171 201292 106809
23972 106809 -112199 -331854 -302751 -165111 -58205 -105175 -298296 -285173 -97040 -41484
23962 -41484 -227933 -142483 54149 -49345 -203750 -219078 -148721 -54845 65617 41838 79248
23951 79248 138608 34130 301797 459726 435405 450462 361804 417343 214072 67437 -173292
23940 -173292 -85850 53393 183972 72768 -173561 -426614 -264477 17835 120656 122874
23930 122874 85529 -87449 -155430 -35463 190556 424833 463257 342239 197489 -103963
23920 -103963 -18144 59389 10906 -72332 -90245 -22587 -80681 -73927 -18262 -14170 35690 119493
$$ packed form
23994B09550j01254K6689j56769j45620L7796Q6785P6139q951Q9823p9442j04352
23983f9606K7268J00817J5016n8951j54371j36404L7377J84414K97611m1879r4483
23972A06809k19008k19655K9103J37640J06906m6970j93121J3123J88133N5556
23962d1484j86449Q5450J96632j03494j54405j5328P0357R3876J20462k3779L7410
23951G9248N9360j04478K67667J57929k4321J5057q8658N5539k03271j46635k40729
23940a73292Q7442J39243J30579j11204k46329k53053J62137K82312J02821K218
23930A22874l7345j72978o7981J19967K26019K34277L8424j21018j44750l01452
23920a03963Q5819P7533m8483q3238j7913O7658n8094O754N5665M092M9860Q3803
$$ plain form
23908 119493 147285 157990 -110133 -46098 360799 562517 471868 261188 -197896 -210210
23898 -210210 -15830 60563 -11946 -99055 -28990 100279 191770 164086 273174 471046 282037
23887 282037 24666 -1758 -137229 -201626 -157701 -126499 104324 246894 188891 101215 141773
23876 141773 400938 378455 285345 404901 227628 187673 120963 271754 183915 39331
23866 39331 69039 74235 19454 -88384 -50691 213470 -57654 -278986 -83951 164506 -54356
23855 -54356 -96894 -247214 -119206 -74425 -358523 -362677 -317208 -422759 -382973 -130321 85500
23844 85500 131205 52151 139952 150729 -37071 -152632 -152398 -40020 -5298 -126827 -298674
23833 -298674 -398678 -205723 9171 -166690 -122224 208282 2721 -183248 -94283 -27540
$$ packed form
23908A19493K7792J0705k68123O4035M06897K01718r0649k10680m59084j2314
23898b10210J94380P6393p2509q7109P0065J29269R1491k7684J09088J97872j89009
23887B82037k57371k6424j35471o4397M3925L1202K30823J42570n8003q7676M0558
23876A41773K59165k2483r3110J19556j77273l9955o6710J50791q7839j44584
23866C9331K9708N196n4781j07838L7693K64161k71124k21332J95035K48457k18862
23855e4356m2538j50320J28008M4781k84098m154M5469j05551L9786K52652K15821
23844H5500M5705p9054Q7801J0777j87800j15561K34J12378L4722j21529j71847
23833b98674j00004J92955K14894j75861M4466L30506k05561j85969Q8965O6743
$$ plain form
23823 -27540 -93066 -186867 -392750 -370135 -17990 170102 274467 141095 180831 257415 79069
23812 79069 -89404 -233769 -341303 -63281 140043 -44107 -280617 -326798 -388219 -427804
23802 -427804 -387673 -450542 -354314 -358476 -320388 -151041 -181541 -137553 -109432 -167744 -232912
23791 -232912 -155833 -43949 166220 64428 74695 -251708 -416442 -257734 92423 169087
23781 169087 37599 -126369 -203434 -46457 65329 -115761 -120055 -124423 51689 189868
23771 189868 -26251 -195317 -52355 55382 171778 350354 326402 176305 56790 -110042
23761 -110042 -19353 -109489 22333 116099 117928 191001 107183 207126 90235 -34397 -69445
23750 -69445 -129850 -179555 -48254 -72136 -35817 -75716 -229431 -232731 48695 48930 -201573
$$ packed form
23823b7540o5526r3801k05883K2615L52145J88092J04365j33372L9736P6584j78346
23812G9069j68473j44365j07534K78022K03324j84150k36510m6181o1421l9585
23802d27804M0131o2869R6228m162L8088J69347l0500M3988K8121n8312o5168
23791b32912P7079J11884K10169j01792J0267l26403j64734J58708L50157P6664
23781A69087j31488j63968p7065J56977J11786j81090m294m368J76112J38179
23771A89868k16119j69066J42962J07737J16396J78576k3952j50097j19515j66832
23761a10042R0689r0136J31822R3766J829P3073q3818R9943j16891j24632l5048
23750f9445o0405m9705J31301k3882L6319l9899j53715l300K81426K35k50503
$$ plain form
23739 -201573 -151615 -21654 169033 124805 5659 235094 55412 123308 167645 226214
23729 226214 44673 99314 30543 210155 282860 218429 343646 186705 45299 -188854
23719 -188854 -253494 -86012 -55856 41033 -14899 -204576 -31405 253899 451123 192566
23709 192566 -57369 -12891 105577 188211 225982 140179 149516 137062 120954 57383 233718
23698 233718 131704 -91547 144493 86873 96248 -220866 -413058 -331333 -304244 -242369 -195754
23687 -195754 8422 26687 -11958 -120178 -153353 -179775 -29767 -9500 -53833 -43934 -400666
23676 -400666 -516568 -463418 -402786 -206506 18177 128513 41202 -104901 -168655 -152499
23666 -152499 -231509 -266422 -227299 -102811 134622 45261 45058 107528 -8527 159734 -5663
$$ packed form
23739b01573M9958J29961J90687m4228j19146K29435j79682O7896M4337N8569
23729B26214j81541N4641o8771J79612P2705o4431J25217j56941j41406k34153
23719a88854o4640J67482L0156R6889n5932j89677J73171K85304J97224k58557
23709A92566k49935M4478J18468Q2634L7771q5803R337j2454j6108o3571J76335
23698B33718j02014k23251K36040n7620R375l17114j92192Q1725K7089O1875M6615
23687a95754K04176J8265l8645j08220l3175k6422J50008K0267m4333R899l56732
23676d00666j15902N3150O0632J96280K24683J10336q7311j46103o3754J6156
23666a52499p9010l4913L9123J24488K37433q9361k03O2470j16055J68261j65397
$$ plain form
23655 -5663 -145847 -298078 -419710 -386759 -235302 -223765 -186039 4545 179905 7974
23645 7974 -18033 -9319 166089 196655 276672 75440 -84185 -25152 30776 -121735 -162967
23634 -162967 -296554 -357296 -311697 -137638 -149419 -222524 -62990 -13148 -81036 -27962 119369
23623 119369 240607 177833 160414 -14317 -207498 -195934 -223385 -265774 -147479 -82393 160203
23612 160203 522003 626565 249923 207443 204480 326247 352792 283159 121568 -33463
23602 -33463 -221247 -199260 -156084 -344908 -137090 88057 -53912 -219250 -436775 -392439
23592 -392439 -367992 -422112 -338759 -270664 -95731 -33035 172033 270908 33602 2720 -61313
23581 -61313 -264123 -363323 -285776 -190186 -225528 -201532 -108391 -306474 -428318 -447264 -246326
$$ packed form
23655e663j40184j52231j21632L2951J51457J1537L7726J90584J75360j71931
23645G974k6007Q714J75408L0566Q0017k01232j59625N9033N5928j52511m1232
23634a62967j33587o0742M5599J74059j1781p3105J59534M9842o7888N3074J47331
23623A19369J21238o2774j7419j74731j93181J1564k7451m2389J18295O5086K42596
23612A60203L61800J04562l76642m2480k963J21767K6545o9633j61591j55031
23602c3463j87784K1987M3176j88824K07818K25147j41969j65338k17525M4336
23592c92439K4447n4120Q3353O8095J74933O2696K05068R8875k37306l0882o4033
23581f1313k02810r9200P7547R5590l5342K3996R3141j98083j21844j8946K00938
$$ plain form
23570 -246326 65537 33046 -270645 -308061 -136208 -192155 -269881 -283888 -108850 78122
23560 78122 -126676 -78165 61583 -36552 151788 165420 174683 371794 196717 104249 67928
23549 67928 64571 167295 212851 174270 86079 11869 199909 232863 31195 -196675 -419917
23538 -419917 -261662 48469 5916 -357717 -371655 -348096 -105052 8441 -11152 -197348
23528 -197348 -149198 -60463 39156 -22583 38901 78830 -30303 -1352 125449 61487 -113376
23517 -113376 -311384 -325288 -122043 166600 505207 500844 99608 -93680 -3344 47249
23507 47249 95397 23651 -28898 -40083 -167462 -205265 -74731 -184626 -103190 -37762 -118308
23496 -118308 -13270 -100221 25391 165068 -45843 5359 42100 -150192 -297111 -285742
$$ packed form
23570b46326L11863l2491l03691l7416J71853n5947p7726j4007J75038J86972
23560G8122k04798M8511J39748r8135J88340J3632R263J97111j75077r2468l6321
23549F7928l357J02724M5556l8581q8191p4210J88040L2954k01668k27870k23242
23538d19917J58255L10131m2553l63633j3938K3559K43044J13493j9593j86196
23528a97348M8150Q8735R9619o1739O1484L9929j09133K8951J26801o3962j74863
23517a13376j98008j3904K03245K88643L38607m363m01236j93288R0336N0593
23507D7249M8148p1746n2549j1185j27379l7803J30534j09895Q1436O5428q0546
23496a18308J05038q6951J25612J39677k10911N1202L6741j92292j46919J1369
$$ plain form
23486 -285742 -126046 -118429 -3577 101979 -96648 -144137 121640 160833 -61815 21364
23476 21364 18701 -43484 66816 192878 -18107 -37733 55250 -16186 -106407 -77809 -259682
23465 -259682 -159639 226481 212574 64270 16832 64340 151483 269581 219131 294181 182123
23454 182123 67831 -147220 -232694 -322195 -286256 -32988 62839 -37458 -280856 -80439
23444 -80439 139872 102859 155972 245656 80589 100553 188791 213346 80022 -83149 -194032
23433 -194032 -135827 101995 154580 161580 455444 584060 356094 276378 411487 357694 159003
23422 159003 -30760 237687 4050 -7434 125724 90990 126932 -11330 -120017 -73857
23412 -73857 -151942 -54003 -89163 52200 193204 300342 145646 -39252 -165303 138130
$$ packed form
23486b85742J59696P617J14852J05556j98627m7489K65777L9193k22648Q3179
23476B1364k663o2185J10300J26062k10985j9626R2983p1436r0221K8598j81873
23465b59682J00043L86120j3907j48304m7438M7508Q7143J18098n0450P5050j12058
23454A82123j14292k15051q5474q9501L5939K53268R5827j00297k43398K00417
23444h0439K20311l7013N3113Q9684j65067J9964Q8238K4555j33324j63171j10883
23433a94032N8205K37822N2585P000K93864J28616k27966p9716J35109n3793j98691
23422A59003j89763K68447k33637j1484J33158l4734L5942j38262j08687M6160
23412g3857p8085R7939l5160J41363J41004J07138j54696j84898j26051L03433
$$ plain form
23402 138130 200148 351697 282299 140597 285546 207860 31235 -128550 -211037 -211971 -76160
23391 -76160 -175844 -314884 -313010 -159052 -231681 -114700 81242 51541 119675 83912 -165621
23380 -165621 -66550 99917 27632 45300 107109 143958 101926 11465 129974 175588 56956
23369 56956 4315 -15320 -177473 20069 265456 353942 309141 118614 271282 209121 46926
23358 46926 24228 -74262 148954 356880 121142 -23779 66522 39440 -110543 -12374 -3292
23347 -3292 114390 123832 -234917 -182187 190197 1744 -210117 -16247 -33021 -39364 -56062
23336 -56062 100690 178045 -23073 -145050 192722 149235 15714 31250 58165 -101642
23326 -101642 -115483 -107340 -159758 -6901 35407 -120581 -3662 -86271 -131192 -40023 290098
$$ packed form
23402A38130O2018J51549o9398j41702J44949p7686j76625j59785q2487r34J35811
23391g6160r9684j39040J874J53958p2629J16981J95942k9701O8134l5763k49533
23380a65621R9071J66467p2285J7668O1809L6849m2032r0461J18509M5614j18632
23369E6956n2641j9635j62153J97542K45387Q8486m4801j90527J52668o2161j62195
23358D6926k2698r8490K23216K07926k35738j44921R0301k7082j49983R8169R082
23347c292J17682R442l58749N2730L72384j88453k11861J93870j6774o343j6698
23336e6062J56752P7355k01118j21977L37772m3487j33521J5536K6915j59807
23326a01642j3841Q143n2418J52857M2308j55988J16919q2609m4921R1169L30121
$$ plain form
23315 290098 278250 -45526 8544 129856 208889 243541 177857 188116 213911 280287 317034
23304 317034 390423 253824 -8864 32753 -163180 -502488 -450393 -163664 -95340 -131737
23294 -131737 -141715 -100906 -237699 -322048 -45672 136278 162570 23979 -81114 -129150 -6940
23283 -6940 108748 87234 44596 20078 -104405 54994 279041 464253 545417 556235 382685
23272 382685 76160 -362696 -403393 -398745 -336535 -192670 2206 80658 129117 170811 -35654
23261 -35654 -368816 -474729 -320385 -258182 -397549 -375549 -77522 69527 13580 285635
23251 285635 291980 400611 274537 74090 188715 347293 289381 141785 100608 199712
23241 199712 42776 -94169 -202983 -57143 278586 354475 277053 268433 316319 234873 69289
$$ packed form
23315B90098j1848l23776N4070J21312P9033L4652o5684J0259K5795O6376L6747
23304C17034P3389j36599k62688M1617j95933l39308N2095K86729O8324l6397
23294a31737r978M0809j36793q4349K76376J81950K6292j38591j05093m8036J22210
23283f940J15688k1514m2638k4518j24483J59399K24047J85212Q1164J0818j73550
23272C82685l06525m38856m0697M648O2210J43865J94876P8452M8459M1694k06465
23261c5654l33162j05913J54344O2203j39367K2000K98027J47049n5947K72055
23251B85635O345J08631j26074k00447J14625J58578n7912j47596m1177R9104
23241A99712j56936j36945j08814J45840L35729P5889p7422q620M7886q1446j65584
$$ plain form
23230 69289 87999 18329 20211 110168 33288 127091 360007 276840 -52464 -358259 -91398
23219 -91398 44026 12914 -15620 -162454 -78081 228417 68204 -52468 -179254 25807
23209 25807 205628 311199 217091 48618 -80525 -72386 59952 185281 85897 -15840
23199 -15840 -264633 -600393 -351596 -117563 106727 268143 70570 48111 -68058 -202543
23189 -202543 -175333 -63495 49146 64904 -215214 -279909 -328084 -315227 -383798 -408056 -320986
23178 -320986 -224999 -176299 -238705 -349693 -154335 -204768 -130443 -123750 -276363 -317993 -185730
23167 -185730 59168 20534 76334 310946 345840 238516 74076 -95150 -137629 -210687
23157 -210687 -21694 102236 -21398 -67097 -156099 -268780 -267891 12494 43761 19705 -63765
$$ packed form
23230F9289J8710o9670J882Q9957p6880R3803K32916q3167l29304l05795K66861
23219i1398J35424l1112k8534j46834Q4373L06498j60213j20672j26786K05061
23209B5807J79821J05571r4108j68473j29143Q139J32338J25329r9384j01737
23199a5840k48793l35760K48797K34033K24290J61416j97573k2459j16169j34485
23189b02543K7210J11838J12641J5758k80118o4695m8175J2857o8571k4258Q7070
23178c20986R5987M8700o2406j10988J95358n0433P4325O693j52613m1630J32263
23167a85730K44898l8634N5800K34612L4894j07324j64440j69226m2479p3058
23157b10687J88993J23930j23634m5699q9002j12681Q89K80385L1267k4056q3470
$$ plain form
23146 -63765 -193413 -170498 -193793 -57567 41446 126688 22442 140355 22196 -76676 -141231
23135 -141231 33052 61343 -200751 -196668 -23 -60597 -125503 -134906 -166848 -394323 -456018
23124 -456018 -309022 -19316 -57763 -33517 -251347 -152372 3679 -37598 -211507 -122190
23114 -122190 -185958 -306215 -100096 -119229 -256744 -154642 -55969 -169993 -7650 132277
23104 132277 99218 42131 3512 124803 371141 386670 234501 176504 134151 77539 -83255
23093 -83255 -156701 63295 244321 186306 90689 67368 174225 37085 -13580 96122 171866
23082 171866 170879 13850 105591 115576 -112189 -183483 -138962 -4380 160046 279615 118814
23071 118814 -22508 -113113 -165424 -109215 -44298 27174 -104591 -166352 -114713 22797 132677
$$ packed form
23146f3765j29648K2915k3295J36226R9013Q5242j04246J17913j18159r8872o4555
23135a41231J74283K8291k62094M083J96645o0574o4906r403l1942k27475o1695
23124d56018J46996K89706l8447K4246k17830R8975J56051m1277j73909Q9317
23114a22190o3768j20257K06119j9133j37515J02102R8673j14024J62343J39927
23104A32277l3059n7087l8619J21291K46338J5529j52169n7997m2353n6612j60794
23093h3255p3446K19996J81026n8015r5617k3321J06857j37140n0665J09702P5744
23082A71866r87j57029R1741R985k27765p1294M4521J34582J64426J19569j60801
23071A18814j41322r0605n2311N6209O4917P1472j31765o1761N1639J37510J09880
$$ plain form
23060 132677 255109 377274 306773 192572 145569 48301 -14034 196445 251661 157362 -41530
23049 -41530 -388878 -415122 -213088 -134703 -76814 1873 -9172 22726 113746 20622 -16294
23038 -16294 41335 -106118 -125970 -1214 100634 25243 -78485 -115632 -38701 7136 14784
23027 14784 127655 240565 302574 341931 220038 -119753 -242702 -265370 -92935 -76788
23017 -76788 -202990 -338536 -143864 -70312 83878 89850 25779 12254 176950 380385 255924
23006 255924 190531 20020 -61185 -87689 -84433 -45063 45780 180073 129003 143380 95544
22995 95544 117538 49301 214283 444031 123599 -139556 -113172 -123623 -76146 -62900 -47010
22984 -47010 42224 99499 353432 494205 526417 287266 3956 131018 173214 -157213
$$ packed form
23060A32677J22432J22165p0501j14201m7003r7268o2335K10479N5216r4299j98892
23049d1530l47348k6244K02034P8385N7889P8687j1045L1898R1020r3124l6916
23038a6294N7629j47453j9852J24756J01848p5391j03728l7147P6931M5837P648
23027A4784J12871J12910O2009L9357j21893l39791j22949k2668J72435J6147
23017g6788j26202j35546J94672P3552J54190N972o4071j3525J64696K03435j24461
23006B55924o5393j70511q1205k6504L256L9370R0843J34293n1070J4377m7836
22995I5544K1994o8237J64982K29748l20432k63155K6384j0451M7477J3246J5890
22984d7010Q9234N7275K53933J40773L2212k39151k83310J27062M2196l30427
$$ plain form
22974 -157213 -184750 3185 227801 219079 269588 290244 192697 153046 170287 92845 -11111
22963 -11111 106891 -3133 -250020 -344561 -289300 -132629 -30172 25390 -45184 -71251 -23338
22952 -23338 166187 81244 6524 98423 -108064 -306913 -447242 -347457 -160240 2873
22942 2873 68079 55650 27466 13250 38438 90832 49622 50995 -117153 -283424 -126606
22931 -126606 -118563 -309785 -144747 -142448 -154289 -161620 -65991 122471 367434 439229 253302
22920 253302 106447 4895 24542 285368 443317 474345 435584 455607 485818 393459 76688
22909 76688 202226 141972 -29821 45269 -124348 -165856 -159538 41877 58046 -82008 -38953
22898 -38953 170810 79763 127566 195517 177033 200820 167356 221510 104642 56202 192133
$$ packed form
22974a57213k7537J87935K24616q722N0509K0656r7547l9651J7241p7442j03956
22963a1111J18002j10024k46887r4541N5261J56671J02457N5562p0574k6067M7913
22952b3338J89525q4943p4720R1899k06487j98849j40329R9785J87217J63113
22942B873O5206j2429k8184j4216K5188N2394m1210J373j68148j66271J56818
22931a26606Q043j91222J65038K299j1841p331R5629J88462K44963P1795j85927
22920B53302j46855j01552J9647K60826J57949L1028l8761K0023L0211r2359l16771
22909G6688J25538o0254j71793P5090j69617m1508O318K01415J6169j40054M3055
22898c8953K09763r1047M7803O7951j8484K3787l3464N4154j16868m8440J35931
$$ plain form
22887 192133 123201 89578 -56190 121401 36398 -116085 -235686 -398741 -437094 -568047
22877 -568047 -430970 -111854 -13235 117274 64054 113349 88412 174977 252389 228317 130300
22866 130300 43542 -23542 -33375 -12500 213567 133749 43631 -51651 -66405 -298584 -291652
22855 -291652 -197296 -163057 2055 154403 107010 -70978 -109314 -298528 -198937 -98585
22845 -98585 -48539 -15888 -72106 -101514 -96658 69828 162092 76168 -90047 -53513 -152128
22834 -152128 -188351 -257388 -254147 25804 309552 343759 309024 254020 434218 495274 213452
22823 213452 -136196 -263616 63364 97289 -51339 -10967 -42099 21470 155753 126980
22813 126980 294077 166622 158444 158974 218440 119560 35623 -206904 -216816 -185041 -174570 -118519
$$ packed form
22887A92133o8932l3623j45768J77591q5003j52483j19601j63055l8353j30953
22877e68047J37077L19116R8619J30509n3220M9295k4937Q6565P7412k4072r8017
22866A30300q6758o7084r833K0875K26067p9818r0118r5282j4754k32179O932
22855b91652R4356L4239J65112J52348m7393j77988l8336j89214R9591J00352
22845i8585N0046L2651n6218k9408M856J66486R2264q5924j66215L6534r8615
22834a52128l6223o9037L241K79951K83748L4207l4735n5004J80198O1056k81822
22823B13452l49648j27420L26980L3925j48628M0372l1132O3569J34283k8773
22813A26980J67097j27455q178N30N9466r8880q3937k42527r912L1775J0471N6051
$$ plain form
22801 -118519 44209 242907 79027 89843 217485 -15893 -165082 -311685 -360185 -214926
22791 -214926 38207 77665 57762 85388 -21481 -111688 -134829 21247 76408 195316 164119
22780 164119 176231 237060 209245 -64804 -264408 -259847 -254382 -371467 -477113 -261555 -184960
22769 -184960 -141696 -17393 88380 122378 -12952 50145 115954 15330 -188205 43387
22759 43387 -118090 -95394 11351 -25422 14937 135485 69431 -10603 -335674 -349770 -262843
22748 -262843 -265604 -291652 -232006 -71041 161953 179312 217950 -30322 -121364 -176854 -93904
22737 -93904 107556 -40397 -107926 -305448 -270899 -232208 -279878 -166872 364 195886
22727 195886 -1413 -207400 -446438 -153593 -37793 166184 28143 -54559 -275786 -371229
$$ packed form
22801a18519J62728J98698j63880J0816J27642k33378j49189j46603m8500J45259
22791b14926K53133L9458j9903K7626j06869r0207k3141J56076N5161J18908l1197
22780A64119J2112O0829k7815k74049j99604M561N465j17085j05646K15558P6595
22769a84960M3264J24303J05773L3998j35330O3097O5809j00624k03535K31592
22759D3387j61477K2696J06745l6773M0359J20548o6054q0034l25071j4096Q6927
22748b62843k761k6048N9646J60965K32994J7359L8638k48272r1042n5490Q2950
22737i3904K01460j47953o7529j97522L4549L8691m7670J13006J67236J95522
22727A95886j97299k05987k39038K92845J15800K03977j38041q2702k21227r5443
$$ plain form
22717 -371229 -253255 -321355 -542426 -347204 -218162 -85613 -283339 -552823 -341417 -122276
22707 -122276 -14744 -75041 -103691 -129820 -279297 -192093 -42763 56293 17745 46223 22019
22696 22019 -231354 -572092 -649257 -400921 -198081 -127793 -102053 -140310 -35628 -81329 37104
22685 37104 -35956 20382 22154 119326 208188 200667 216678 -92304 -384400 -525233 -395914
22674 -395914 -394163 -314022 -352934 -132702 88194 -15130 64308 42572 34657 90878 99455
22663 99455 -8934 -162946 -254324 -278832 -169658 -80544 112598 236053 70790 67636 218111
22652 218111 359725 360928 121911 39909 -132828 -4560 307980 260752 97440 -4649
22642 -4649 -90602 -91458 -150369 -67858 68009 -158437 -202978 -147354 43960 -39418 -36564 -41474
$$ packed form
22717c71229J17974o8100k21071J95222J29042J32549j97726k69484K11406K19141
22707a22276J07532o0297k8650k6129j49477Q7204J49330R9056l8548K8478k4204
22696B2019k53373l40738p7165K48336K02840P0288K5740l8257J04682m5701J18433
22685C7104p3060N6338J772R7172Q8862p521J6011l08982k92096j40833J29319
22674c95914J751Q0141l8912K20232K20896j03324P9438k1736p915N6221Q577
22663I9455j08389j54012r1378k4508J09174Q9114J93142J23455j65263l154J50475
22652B18111J41614J203k39017q2002j72737J28268L12540m7228j63312j02089
22642d649q5953q56n8911Q2511J35867k26446m4541N5624J91314q3378K854m910
$$ plain form
22630 -41474 -65087 -157343 -136246 -169246 -7826 -157569 -188247 -112286 80112 231737 323568
22619 323568 313634 307420 311193 178686 -147590 -97803 2941 -1314 -128456 -237103 -61072
22608 -61072 51605 189113 158095 53468 -72082 -330190 -309519 -307674 -345205 -163729 6664
22597 6664 37411 103628 289113 256027 -170448 -343152 -450360 -428001 -339550 -323525 -421661
22586 -421661 -183145 59064 -164853 -322878 -207688 -49594 39044 145100 267801 62322
22576 62322 -166218 -273873 -338944 -251709 -186186 -170615 -87419 6404 -171439 -71415 58155
22565 58155 98710 184469 227534 250055 254433 151390 56426 273416 196859 -19728 -19923 -334172
22553 -334172 -432874 -312965 -341682 -233246 -118961 -15470 101894 102387 104206 200292 190148
$$ packed form
22630d1474k3613r2256K1097l3000J61420j49743l0678P5961J92398J51625R1831
22619C23568r934o214L773j32507l26276M9787J00744m255j27142j08647J76031
22608f1072J12677J37508l1018j04627j25550k58108K0671J845l7531J81476J70393
22597F664L0747O6217J85485l3086m26475j72704j07208K2359Q8451J6025r8136
22586d21661K38516K42209k23917j58025J15190J58094Q8638J06056J22701k05479
22576F2322k28540j07655o5071Q7235O5523J5571Q3196R3823j77843J00024J29570
22565E8155M0555Q5759M3065K2521M378j03043r4964K16990p6557k16587j95l14249
22553c34172r8702J19909k8717J08436J14285J03491J17364M93J819R6086j0144
$$ plain form
22542 190148 -58696 -311798 -286137 -65822 19632 -123922 -96630 221245 203300 -75623
22532 -75623 -181445 -209123 -340359 -247315 -169185 -44414 -98683 -176818 -168349 -121484 -106336
22521 -106336 -211640 -181333 -90122 -233748 -281383 -114825 2062 -235776 75388 238381
22511 238381 18985 -213191 -233379 -138958 23377 38246 -139866 -38012 -80787 -162051
22501 -162051 -190131 -65324 76762 -78499 -196245 -254673 -4886 100687 -119793 -340464
22491 -340464 -467463 -512290 -292449 24662 151841 400884 286302 -159836 -298678 -167748
22481 -167748 70280 362932 193245 55192 121269 1015 -27351 -167010 -183835 -99526
22471 -99526 -153696 -69591 183597 455988 342329 197655 126373 -21968 -158135 -87990
$$ packed form
22542A90148k48844k53102K5661K20315Q5454j43554K7292L17875j7945k78923
22532g5623j05822k7678j31236R3044P8130J24771n4269p8135Q469M6865J5148
22521a06336j05304L0307R1211j43626m7635J66558J16887k37838L11164J62993
22511B38381k19396k32176k0188R4421J62335J4869j78112J01854m2775q1264
22501a62051k8080J24807J42086j55261j17746n8428K49787J05573k20480k20671
22491c40464j26999m4827K19841L17111J27179K49043j14582m46138j38842J30930
22481a67748K38028K92652j69687j38053O6077j20254k8366j39659j6825Q4309
22471i9526n4170Q4105K53188K72391j13659j44674p1282j48341j36167P0145
$$ plain form
22461 -87990 -44783 -99956 -59862 -77704 -52116 279231 574729 510478 450771 126912 -28770
22450 -28770 -247502 -567359 -741539 -527248 -208670 -102197 -236906 -335473 -231798 67778
22440 67778 33764 -208083 -154148 -64392 -303406 -423946 -513618 -428677 -207119 -189980 -166849
22429 -166849 -70245 -93379 -72104 33495 -96491 -4456 214716 325626 222386 123784
22419 123784 81135 278420 79194 -149554 -291520 -314553 -87210 160894 207644 -36289
22409 -36289 15144 10934 4779 -21201 33129 -26052 -23467 -201310 -173096 45010 59863 1083
22397 1083 107734 198039 312633 320277 158694 -123560 -313644 -76828 62202 -30816 -191861
22386 -191861 -238754 -244834 -42427 -27567 17636 96669 99171 6858 -8759 30750 29695 -155410
$$ packed form
22461h7990M3207n5173M0094j7842K5588L31347K95498o4251n9707l23859j55682
22450b8770k18732l19857j74180K14291L18578J06473j34709r8567J03675K99576
22440F7778l4014k41847N3935Q9756k39014j20540q9672Q4941K21558J7139K3131
22429a66849R6604k3134K1275J05599j29986R2035K19172J10910j03240r8602
22419A23784m2649J97285j99226k28748j41966k3033K27343K48104M6750k43933
22409c6289N1433m210o155k5980N4330n9181K585j77843K8214K18106J4853n8780
22397A083J06651R0305J14594P644j61583k82254j90084K36816J39030r3018j61045
22386a91861m6893o080K02407J4860M5203P9033K502r2313j5617L9509j055j85105
$$ plain form
22374 -155410 -183764 10914 234518 282192 181471 48644 -119774 15305 9319 -6417
22364 -6417 58079 33616 -191455 78777 -67227 -396847 -317169 -141440 -155979 -242875 -136644
22353 -136644 -164052 -47450 140561 68463 32943 -85122 88940 334588 284632 96948
22343 96948 -19729 -101115 -83985 -143129 -189422 68939 256803 26496 -249866 -103601
22333 -103601 12340 77508 122132 176295 129799 18201 32429 114771 64441 -122384 -236706
22322 -236706 -58598 -22694 -123767 74081 521629 746932 522644 409132 568128 647686
22312 647686 451972 222342 57123 212085 271534 212052 24828 -208441 -65894 -50047
22302 -50047 189431 301845 283991 273722 280972 124184 28932 51336 83011 20448 -161683
$$ packed form
22374a55410k8354J94678K23604M7674j00721j32827j68418J35079n986j5736
22364f417O4496k4463k25071K70232j46004l29620P9678J75729j4539q6896J06231
22353a36644k7408J16602J88011p2098l5520j18065J74062K45648m9956j87684
22343I6948j16677q1386J7130n9144m6293K58361J87864k30307k76362J46265
22333a03601J15941O5168M4624N4163m6496j11598J4228Q2342n0330j86825j14322
22322b36706J78108L5904j01073J97848M47548K25303k24288j13512J58996P9558
22312F47686j95714k29630j65219J54962N9449n9482j87224k33269J42547J5847
22302e0047K39478J12414j7854j0269P250j56788r5252K2404L1675o2563j82131
$$ plain form
22291 -161683 -199309 -272691 -276489 -218316 -112986 99366 98533 126888 186621 56902 164562
22280 164562 129619 -75144 66075 28815 -28866 -113019 17549 132543 -116790 -27585
22270 -27585 145342 81412 -116035 -289801 -285901 -161102 -76115 -13716 82115 13502 -191517
22259 -191517 30671 -86385 -274327 -97920 5528 -24118 -266228 -220817 -40582 110601
22249 110601 116743 99334 264115 459732 528584 175518 67831 -89912 -52967 122080
22239 122080 255172 167154 277906 225071 82882 -15184 -30528 -95368 -276183 -265610 -151432
22228 -151432 16165 -164190 -422016 -467929 -330177 -361372 -455791 -279028 -272975 -293614 -311335
22217 -311335 -321181 -311717 -163727 -52367 -135190 -92244 -196901 -384419 -422488 -421213 -136933
$$ packed form
22291a61683l7626p3382l798N8173J05330K12352q33K8355N9733j29719J07660
22280A64562l4943k04763J41219l7260n7681q4153J30568J14994k49333Q9205
22270b7585J72927o3930j97447j73766L900J24799Q4987O2399R5831o8613k05019
22259a91517K22188j17056j87942J76407J03448k9646k42110M5411J80235J51183
22249A10601O142j7409J64781J95617O8852l53066j07687j57743L6945J75047
22239A22080J33092q8018J10752n2835j42189r8066j5344o4840j80815J0573J14178
22228a51432J67597j80355k57826m5913J37752l1195r4419J76763O053k0639j7721
22217c11335r846R464J47990J11360q2823M2946j04657j87518l8069J275K84280
$$ plain form
22206 -136933 127215 194598 269950 215193 361127 356786 233338 -171810 -255149 -242168 -226938
22195 -226938 -170779 -82424 -168301 -153408 -3810 -294542 -461837 -516618 -574392 -276768 -63238
22184 -63238 -146668 -37569 -130291 -234013 -225020 -80141 -98431 -59327 8871 -791 197431
22173 197431 128203 -122206 -260810 -288132 -232627 -257759 -106715 -85405 -188849 -216609 71210
22162 71210 344075 357177 235447 200477 306275 179297 61758 272702 406664 207873
22152 207873 -77591 -129833 206619 412570 260533 69296 100221 201022 -3766 -120121
22142 -120121 53823 83553 57671 190517 126718 76687 84652 194004 316083 104141 -14579
22131 -14579 59717 106390 76008 -93632 -366851 -309213 -126700 -93709 -110682 37305 85445
$$ packed form
22206a36933K64148O7383P5352n4757J45934m341j23448m05148q3339J2981J5230
22195b26938N6159Q8355q5877J4893J49598k90732j67295n4781n7774K97624K13530
22184f3238q3430J09099r2722j03722Q993J44879j8290L9104O8198r662J98222
22173A97431o9228k50409j38604k7322N5505k5132J51044K1310j03444k7760K87819
22162G1210K72865J3102j21730l4970J05798j26978j17539K10944J33962j98791
22152B07873k85464n2242L36452K05951j52037j91237L0925J00801k04788j16355
22142a20121J73944K9730k5882J32846o3799n0031P965J09352J22079k11942j18720
22131a4579P4296M6673l0382j69640k73219N7638J82513L2991j6973J47987M8140
$$ plain form
22120 85445 356988 292853 100030 -19673 -16580 -72393 -151297 -97325 -144355 -349588 -272392
22109 -272392 -282002 -445232 -468073 -555427 -582243 -581562 -357665 -93632 -26288 86598 179680
22098 179680 165569 67898 116959 142759 154286 141573 65922 128765 18064 37114 41755
22087 41755 -48717 -277116 -204160 13434 153385 90209 -32930 17954 98919 -202164 -331133
22076 -331133 -474042 -475025 -808693 -686113 -198093 -224934 -373001 -221134 -60809 -104466
22066 -104466 -363034 -131935 -164431 -277970 -188475 -46314 119415 296745 323158 178011
22056 178011 115997 8124 -49773 10549 227122 147400 31441 21325 205261 535709
22046 535709 446550 92021 -37914 -142073 -272841 -188749 -91188 68515 44661 -83210
$$ packed form
22120H5445K71543o4135j92823j19703L093n5813p8904N3972m7030k05233P7196
22109b72392r610j63230k2841q7354k6816O81K23897K64033O7344J12886R3082
22098A79680j4111r7671M9061K5800J1527j2713p5651O2843j10701J9050M641
22087D1755r0472k28399P2956K17594J39951o3176j23139N0884Q0965l01083j28969
22076c31133j42909r83l33668J22580M88020k6841j48067J51867J60325m3657
22066a04466k58568K31099l2496j13539Q9495J42161J65729J77330K6413j45147
22056A78011o2014j07873n7897O0322K16573p9722j15959j0116J83936L30448
22046E35709q9159l54529j29935j04159j30768Q4092R7561J59703k3854j27871
$$ plain form
22036 -83210 -20884 97029 -96688 -275607 -318008 -196882 20597 -11981 63535 -47779
22026 -47779 66044 183520 -77704 -321969 -344699 -257525 -83077 -133688 -209859 -234448 -360660
22015 -360660 -334808 -195601 67397 -44022 -238619 -404505 -365623 -214924 -277939 -395875
22005 -395875 -102034 58288 32830 161179 312412 115764 115192 82794 215536 94768
21995 94768 -218710 -234081 -46066 -96185 -364792 -407736 -70661 104967 131644 153518 -83855
21984 -83855 -25838 13844 50488 249898 410795 301920 235361 -22575 -83187 -357325 -387918
21973 -387918 -238555 -167197 -226628 -341525 -202204 -275786 -302961 -197576 -170091 -25402
21963 -25402 29826 -20124 -136538 -90713 -114230 -175815 -294277 -210165 1848 48102 191680
$$ packed form
22036h3210O2326J17913j93717j78919m2401J21126K17479l2578P5516j11314
22026d7779J13823J17476k61224k44265k2730Q7174J74448n0611p6171k4589j26212
22015c60660K5852J39207K62998j11419j94597j65886L8882J50699o3015j17936
22005c95875K93841J60322k5458J28349J51233j96648n72l2398J32742j20768
21995I4768l13478j5371J88015n0119k68607m2944L37075J75628K6677K1874k37373
21984h3855N8017L9682L6644J99410J60897j08875o6559k57936o0612k74138l0593
21973c87918J49363P1358n9431j14897J39321p3582k7175J05385K7485J44689
21963b5402N5228m9950j16414M5825k3517o1585j18462Q4112K12013M6254J43578
$$ plain form
21952 191680 -16343 -353162 -464193 -294280 -122620 -110809 -83719 94789 78520 11500
21942 11500 87435 210803 439916 463978 414074 336721 318480 340364 325703 142970 -158974
21931 -158974 22485 203364 96396 -122594 -148847 66550 74710 35353 13323 -46196 -186169
21920 -186169 -196214 67846 173247 -11757 -25429 77401 -62214 -163565 -254985 -158340
21910 -158340 32079 87113 290800 380440 275288 58051 -33844 21848 27171 -141707 -39666
21899 -39666 34483 -18814 -210176 -616425 -526876 -376933 -288516 -366667 -216291 149588 294002
21888 294002 196103 42410 -66357 1456 152815 87362 176848 390615 322354 149359
21878 149359 -38139 71173 183832 250382 10010 -36936 290052 325565 355961 386117
$$ packed form
21952A91680k08023l36819j11031J69913J71660J1811K7090J78508j6269o7020
21942A1500P5935J23368K29113K4062m9904p7353j8241K1884j4661j82733l01944
21931a58974J81459J80879j06968k18990k6253K15397Q160l9357k2030n9519j39973
21920a86169j0045K64060J05401j85004j3672J02830j39615j01351r1420R6645
21910a58340J90419N5034K03687Q9640j05152k17237r1895N5692N323j68878J02041
21899c9666P4149n3297j91362m06249Q9549J49943Q8417p8151J50376L65879J44414
21888B94002r7899j53693j08767O7813J51359o5453Q9486K13767o8261j72995
21878A49359j87498J09312J12659O6550k40372m6946L26988L5513L0396L0156
$$ plain form
21868 386117 484222 294533 150828 -158305 -277759 -309099 -227800 -126993 -6290 302307
21858 302307 449701 165108 -81542 -220797 -219218 -328680 -350660 -351462 -379445 -398311 -98307
21847 -98307 -214137 -398145 -439650 -388142 -358513 -313533 -130329 -160959 -81477 75522 197890
21836 197890 -27317 -293581 -303312 -354694 -552987 -335716 -112702 36662 22100 106781
21826 106781 -10271 -213000 -243218 -229348 -244008 -25215 165994 112654 315129 294811
21816 294811 65358 -73829 129212 46884 -32231 18963 14265 38045 180817 164214 -100078
21805 -100078 -129671 -275072 -164615 -21172 81493 239267 100926 -113565 -114040 -212153
21795 -212153 -273276 -430410 -467760 -462180 -343402 -169201 -115497 2873 -191863 -148193 -195042
$$ packed form
21868C86117R8105j89689j43705l09133j19454l1340Q1299J00807J20703L08597
21858C02307J47394k84593k46650j39255J579j09462k1980q02k7983j8866L00004
21847i8307j15830j84008m1505N1508K9629M4980J83204l0630P9482J56999J22368
21836A97890k25207k66264r731n1382j98293K17271K23014J49364j4562Q4681
21826A06781j17052k02729l0218J3870j4660K18793J91209n3340K02475k0318
21816B94811k29453j39187K03041q2328p9115N1194m698K3780J42772j6603k64292
21805a00078k9593j45401J10457J43443J02665J57774j38341k14491m75r8113
21795b12153o1123j57134l7350N580J18778J74201N3704J18370j94736M3670m6849
$$ plain form
21784 -195042 -107167 43997 46000 -24514 -171295 -162931 -88448 24528 -56554 -236153 -126000
21773 -126000 -292042 -342751 -295031 -297225 -214326 -95141 -191211 -120828 -33314 79348 -203159
21762 -203159 -321248 -178851 -131162 -104234 -103149 130265 247179 187046 255328 16933 -118701
21751 -118701 -185549 -172578 -118255 -68796 -21869 35556 26924 30621 40171 22437 -117134 -172701
21739 -172701 -21075 191184 151272 -189420 -394309 -258261 -103526 10011 61058 -66933
21729 -66933 -296258 -333868 -143337 -53841 83232 132547 294471 47563 -57941 -133580
21719 -133580 -148386 -164907 -69646 -116681 -16766 72082 -36556 -91498 -195567 -120136 -112936
21708 -112936 54159 379664 350296 235875 179856 40096 62124 21301 -63507 -99058 -145827
$$ packed form
21784a95042Q7875J51164K003p0514j46781Q364P4483J12976q1082j79599J10153
21773a26000j66042n0709M7720k194Q2899J19185r6070P0383Q7514J12662k82507
21762b03159j18089J42397M7689K6928J085K33414J16914o0133O8282k38395j35634
21751a18701o6848J2971N4323M9459M6927N7425q632L697R550j7734j39571n5567
21739a72701J51626K12259l9912l40692k04889J36048J54735J13537N1047j27991
21729f6933k29325l7610J90531Q9496J37073M9315J61924k46908j05504p5639
21719a33580j4806j6521R5261m7035R9915Q8848j08638n4942j04069P5431P200
21708a12936J67095L25505k9368j14421n6019j39760K2028m0823q4808l5551m6769
$$ plain form
21697 -145827 -216128 -221506 -211659 -226623 -173230 -264005 -292578 -175723 189834 460223 372716
21686 372716 75807 -235067 -263949 -390055 -392639 -249703 -286392 -128280 33765 231039
21676 231039 33707 -149531 -214945 -207320 20442 -104837 33953 -187135 -310871 -10925
21666 -10925 17982 108691 177039 102954 -23547 -13850 94771 190920 109752 193942 214218
21655 214218 145591 32096 81337 278733 198755 39529 137485 -32831 8343 38436 -45629
21644 -45629 -80825 -90063 22923 131759 319669 349569 514417 479685 329797 118059 94561
21633 94561 137296 353676 490663 290449 371045 469950 412905 145101 115980 104521 428828
21622 428828 549653 256920 121688 19367 66502 108974 -77616 -178059 -144403 -115368
$$ packed form
21697a45827p0301n378R847j4964N3393r0775k8573J16855L65557K70389q7507
21686C72716k96909l10874k8882j26106k584J42936l6689J58112J62045J97274
21676B31039j97332j83238o5414P625K27762j25279J38790k21088j23736K99946
21666a0925K8907R0709O8348p4085j26501R697J08621R6149q1168Q4190K0276
21655B14218o8627j13495M9241J97396p9978j59226R7956j70316M1174L0093q4065
21644d5629l5196r238J12986J08836J87910K9900J64848l4732j49888k11738k3498
21633I4561M2735K16380J36987k00214Q0596R8905n7045k67804k9121j1459L24307
21622D28828J20825k92733j35232j02321M7135M2472j86590j00443L3656K9035
$$ plain form
21612 -115368 -21691 -71867 234087 112215 201826 192636 237590 268544 -99731 -459635 -668274
21601 -668274 -760940 -581649 -286220 -54886 16760 71388 149731 309497 272972 57917
21591 57917 -115494 -174411 -81087 -29924 -39878 44188 100773 121170 127245 58171 -156144 -42520
21579 -42520 142152 -21872 34253 161133 191502 -179743 -208047 -74731 -142312 -111607 149
21568 149 -64493 -187011 -278734 -311808 -131891 139904 246312 228138 -48251 -203281 -303777
21557 -303777 -135314 169014 211386 269882 145504 303512 348047 230688 206839 22768
21547 22768 -5704 111672 -3461 -193087 -236027 -224393 -379072 -462519 -405680 -653223 -433652
21536 -433652 73634 202942 163956 748 -185761 -178864 -72344 194082 257771 182328
$$ packed form
21612a15368R3677n0176L05954j21872Q9611r190M4954L0954l68275l59904k08639
21601f68274r2666J79291K95429K31334P1646N4628P8343J59766l6525k15055
21591E7917j73411n8917R3324N1163r954Q4066N6585K0397O075o9074k14315J13624
21579d2520J84672j64024N6125J26880L0369l71245k8304J33316o7581L0705J11756
21568A49o4642j22518r1723l3074J79917K71795J06408j8174k76389j55030j00496
21557c03777J68463L04328M2372N8496j24378J58008M4535j17359k3849j84071
21547B2768k8472J17376j15133j89626m2940J1634j54679q3447N6839k47543K19571
21536d33652N07286J29308l8986j63208j86509O897J06520K66426O3689p5443
$$ plain form
21526 182328 195990 282023 258825 421864 311023 136202 326286 291176 189497 -718
21516 -718 234650 244631 -20832 -161729 -193911 -197490 -12129 42245 81965 159343 330622
21505 330622 329577 193932 120644 243043 140966 74635 258343 265947 144511 -2823 -142554
21494 -142554 -204564 -489141 -577497 -542175 -496848 -368702 -200315 -5930 218850 303895
21484 303895 211738 172740 251330 87043 852 -50664 -95644 20137 57260 143606 80619
21473 80619 107177 -49092 -238646 -277733 -152804 46140 22855 -71314 -126735 -165303 -278691
21462 -278691 -359615 -426761 -553116 -212144 116820 75310 -47542 -790 2383 212002 70038
21451 70038 -1663 -24923 1175 18875 -85912 39071 -48800 -169230 -109227 160020 312471
$$ packed form
21526A82328J3662Q6033k3198J63039j10841j74821J90084l5110j01679j90215
21516g18K35368R981k65463j40897l2182l579J85361N4374L9720P7378J71279
21505C30622j045j35645p3288J22399j02077o6331J83708P604j21436j47334j39731
21494a42554o2010k84577q8356L5322M5327J28146J68387J94385K24780Q5045
21484C03895r2157l8998P8590j64287q6191n1516m4980J15781L7123Q6346o2987
21473H0619K6558j56269j89554l9087J24929J98944k3285r4169n5421l8568j13388
21462b78691q0924o7146j26355L40972L28964m1510j22852M6752L173K09619j41964
21451G0038p1701k3260K6098J7700j04787J24983q7871j20430O0003K69247J52451
$$ plain form
21440 312471 296980 366135 257209 23003 -115672 -229565 -348989 -167656 -139861 -170593
21430 -170593 -236960 -184766 42895 -198442 -467558 -301928 42480 29042 138433 114307
21420 114307 29129 -229461 -279944 -461245 -329287 -119771 -115465 -179909 -231728 -218811 64027
21409 64027 75223 -254069 44612 81781 79645 106622 84123 54710 168442 246490 220621
21398 220621 223764 90129 -80954 -210780 -251055 -129528 -136021 -303057 -471147 -456944 -387158
21387 -387158 -226558 -85232 -209338 -298879 -178645 -148455 -204220 -159484 -235906 -422552
21377 -422552 -369293 -217767 20433 45427 -65366 -345672 -382019 -467386 -522467 -377194
21367 -377194 -308013 -249635 -233184 -565997 -665566 -635810 -527979 -338582 -131163 -54498 26502
$$ packed form
21440C12471j5491O9155j08926k34206j38675j13893j19424J81333K7795l0732
21430a70593o6367N2194K27661k41337k69116J65630L44408j3438J09391k4126
21420A14307q5178k58590n0483j81301J31958K09516M306o4444n1819J2917K82838
21409F4027J1196l29292K98681L7169k136K6977k2499k9413J13732P8048k5869
21398B20621L143j33635j71083j29826m0275J21527o493j67036j68090J4203O9786
21387c87158J60600J41326j24106q9541J20234L0190n5765M4736p6422j86646
21377d22552N3259J51526K38200K4994j10793k80306l6347q5367n5081J45273
21367c77194O9181N8378J6451l32813r9569K9756J07831J89397K07419P6665Q1000
$$ plain form
21356 26502 -143096 -138852 -230382 -267848 -261205 -298283 -300741 719 179623 126608 101276 58880
21344 58880 49213 77232 20674 144504 63677 -39410 -267826 33308 74585 -219469 -373325
21333 -373325 -453324 -657631 -540495 -260942 125229 54078 -85112 -64694 188383 153319
21323 153319 -77187 -69790 20870 -19031 119648 177788 36015 -20739 -244660 -90465 52458
21312 52458 -70582 -55452 -25171 -23323 195007 68174 -150651 -194975 -345464 -309863 -273717
21301 -273717 -280468 -172885 -301231 -305220 -201680 -186491 -147654 -146924 -21431 -75075 -257296
21290 -257296 -325288 -292364 -253069 12272 189091 154296 -60624 -238644 -148782 11157
21280 11157 -177303 -235481 -119097 -69643 -32202 90505 -63659 -7183 153469 166189 112874
$$ packed form
21356B6502j69598M244r1530l7466O643l7078k458L01460J78904n3015k5332m2396
21344E8880r667K8019n6558J23830q0827j03087k28416L01134M1277k94054j53856
21333c73325p9999k04307J17136K79553L86171p1151j39190K0418K53077l5064
21323A53319k30506P397R0660l9901J38679N8140j41773n6754k23921J54195J42923
21312E2458j23040J5130L0281J848K18330j26833k18825m4324j50489L5601L6146
21301b73717o751J07583j28346l989J03540J5189L8837P30J25493n3644j82221
21290b57296o7992L2924L9295K65341J76819l4795k14920j78020Q9862J59939
21280A1157j88460n8178J16384M9454L7441J22707j54164N6476J60652J2720n3315
$$ plain form
21269 112874 284706 475776 60350 -294479 -161311 16414 -49293 120512 130488 25589
21259 25589 138935 266482 359555 7326 23701 -71563 -37559 -20588 -27345 -88357 -84357
21248 -84357 -33998 -7010 -99873 -230937 -304278 -410501 -251176 -313675 -413490 -351083 -499897
21237 -499897 -418064 -370992 -218338 -417249 -254572 -179092 -358597 -241844 -112647 -35110
21227 -35110 144913 101947 2075 -105428 -156991 -14475 -28545 -115885 -51080 -85517 -199797
21216 -199797 -348827 -168214 -22335 127184 234355 8002 -100163 -250209 -189570 -140285
21206 -140285 -127360 -79199 -124076 -259875 -297786 -96745 -166563 -261228 -304402 -134899 -52994
21195 -52994 68951 286108 176036 162482 170157 171646 50671 -34805 219621 -43691 -176086
$$ packed form
21269A12874J71832J91070m15426l54829J33168J77725o5707J69805R976j04899
21259B5589J13346J27547R3073l52229J6375r5264L4004J6971o757o1012M000
21248h4357N0359K6988r2863j31064p3341j06223J59325o2499r9815O2407j48814
21237d99897Q1833M7072J52654j98911J62677P5480j79505J16753J29197P7537
21227c5110J80023m2966r9872j07503n1563J42516j4070q7340O4805l4437j14280
21216a99797j49030J80613J45879J49519J07171k26353j08165j50046O0639M9285
21206a40285J2925M8161m4877j35799l7911K01041o9818r4665m3174J69503Q1905
21195e2994J21945K17157j10072j3554P675J489j20975q5476K54426k63312j32395
$$ plain form
21184 -176086 -183697 -106189 40715 57629 -96701 -193821 -140972 -106254 84989 -48579 -45332
21173 -45332 189973 178239 267198 488576 557311 507274 440969 449866 306344 85959 215561
21162 215561 -35830 -59010 76078 263538 437084 307708 369007 301820 305400 454911
21152 454911 367298 233269 100528 5183 307417 356903 251992 285448 396752 425670
21142 425670 236576 -58608 -237953 -98517 -193647 -408525 -423908 -524269 -339661 73975
21132 73975 547060 776792 859846 471953 16563 -18281 196285 320434 337914 141016
21122 141016 70148 37561 -32004 -269937 -311464 -90050 -70132 -215919 -465281 -552733 -498726
21111 -498726 -593781 -285290 -224039 -223667 55569 -18331 -50920 -35158 -65827 -57574 131231
$$ packed form
21184a76086p611P7508J46904J6914j54330r7120N2849L4718J91243j33568L247
21173d5332K35305j1734Q8959K21378O8735n0037o6305Q897j43522k20385J29602
21162B15561k51391k3180J35088J87460J73546j29376O1299o7187L580J49511
21152D54911q7613j34029j32741r5345L02234M9486j04911L3456J11304K8918
21142D25670j89094k95184j79345J39436r5130k14878j5383j00361J84608M13636
21132G3975M73085K29732Q3054l87893m55390l4844K14566J24149J7480j96898
21122A41016p0868l2587o9565k37933m1527K21414J9918j45787k49362q7452N4007
21111d98726r5055L08491O1251L72K79236p3900l2589J5762l0669Q253J88805
$$ plain form
21100 131231 238398 158812 123305 198594 259385 342005 463499 207726 -146565 -337112
21090 -337112 -393978 -227436 -151577 -9260 74642 -2572 -122838 -233225 -526691 -495001
21080 -495001 -326835 -363260 -463396 -620617 -566818 -248190 15996 143070 -44319 -126192
21070 -126192 46871 223081 40371 -149305 -64831 -11220 70277 220185 311014 59916
21060 59916 24593 -50720 16731 89667 11052 -118765 -180084 -91316 -127356 9247 15242
21049 15242 -78835 -313159 -253800 -138709 256060 51984 -102021 14143 14298 26416 53400
21038 53400 -39540 256282 152941 -56581 -58064 275939 400806 384362 218580 160782 205696
21027 205696 179255 -58999 -183221 -157377 20194 203993 194746 58676 -32013 -211122
$$ packed form
21100A31231J07167p9586l5507P5289O0791Q2620J21494k55773l54291j90547
21090c37112n6866J66542P5859J42317Q3902p7214j20266j10387k93466L1690
21080d95001J68166l6425j00136j57221N3799L18628K64186J27074j87389q1873
21070a26192J73063J76210j82710j89676Q4474N3611Q1497J49908R0829k51098
21060E9916l5323p5313O7451P2936p8615j29817o1319Q8768l6040J36603N995
21049A5242r4077k34324N9359J15091L94769k04076j54005J16164J55J2118K6984
21038E3400r2940K95822j03341k09522j483L34003J24867j6444j65782n7798M4914
21027B05696k6441k38254j24222K5844J77571J83799r247j36070r0689j79109
$$ plain form
21017 -211122 -89865 -128517 -117135 -46295 101851 -27374 47305 332523 381311 385601 342137
21006 342137 425644 393895 299478 55362 -40705 9186 -122028 -256471 -353338 -125399 -66852
20995 -66852 -99190 30497 214262 183819 -59461 -186823 -253943 -378501 -454924 -335449
20985 -335449 -384792 -252122 -399340 -544776 -462860 -324519 -45457 142362 170026 181526
20975 181526 60284 189926 -44772 -274927 -270908 -166025 80741 146358 -95075 -276180
20965 -276180 -312189 -255589 -285029 -230976 -117649 -207227 -413988 -163426 -82814 10199 65783
20954 65783 -13926 2200 -28631 -50330 -195635 121072 340732 255152 207297 300722 296293
20943 296293 439444 310859 80620 236853 137121 -45118 -41934 79321 212571 33149
$$ packed form
21017b11122J21257l8652J1382P0840J48146j29225P4679K85218M8788M290m3464
21006C42137Q3507l1749r4417k44116r6067M9891j31214j34443r6867K27939N8547
20995f6852l2338J29687J83765l0443k43280j27362o7120j24558p6423J19475
20985c35449m9343J32670j47218j45436Q1916J38341K79062J87819K7664J1500
20975A81526j21242J29642k34698k30155M019J04883K46766O5617k41433j81105
20965b76180l6009N6600k9440N4053J13327q9578k06761K50562Q0612R3013N5584
20954F5783p9709J6126l0831k1699j45305L16707K19660q5580m7855R3425m429
20943B96293J43151j28585k30239J56233r9732j82239L184J21255J33250j79422
$$ plain form
20933 33149 -321504 -316710 -60116 -12998 -260277 -459637 -298209 -235383 -463750 -426154 -190049
20922 -190049 -103994 -81133 -41884 -31860 198378 150958 -56077 -495990 -412286 -348015 -253806
20911 -253806 -14341 16604 -204976 -147915 -189183 -151153 -46879 39320 87167 259419 314627
20900 314627 247551 277130 206826 144516 96099 167054 206782 137214 -126107 -248846 -97810
20889 -97810 -107770 -588 139524 117321 8260 -164782 57934 87624 -156341 -319670
20879 -319670 -362318 -236878 -188188 198588 356681 273595 43885 -233183 -224562 187987
20869 187987 516563 278878 -1078 65261 158819 143978 137222 -140768 -63672 57859 -99930
20858 -99930 -256273 -38621 -183156 -194894 -33166 45551 251789 228489 245711 268295 178766
$$ packed form
20933C3149l54653M794K56594M7118k47279j99360J61428O2826k28367L7596K36105
20922a90049Q6055K2861L9249J0024K30238m7420k07035m39913Q3704O4271R4209
20911b53806K39465L0945k21580N7061m1268L8030J04274Q6199M7847J72252N5208
20900C14627o7076K9579p0304o2310m8417P0955L9728o9568k63321j22739J51036
20889i7810r960J07182J40112k2203j09061j73042K22716K9690k43965j63329
20879c19670m2648J25440M8690L86776J58093q3086k29710k77068Q621M12549
20869A87987L28576k37685k79956O6339R3558j4841o756k77990P7096J21531j57789
20858i9930j56343K17652j44535j1738J61728P8717K06238k3300J7222K2584q9529
$$ plain form
20847 178766 186371 79308 -192052 -54052 -79161 722 172260 222339 163863 116545 82527
20836 82527 73701 172866 232561 301605 183568 44111 -131742 13575 35177 364788 455941
20825 455941 525153 634626 554856 488456 191316 140148 -7211 -199157 -335902 -314077
20815 -314077 -208082 55314 77131 -39716 12098 2149 -95128 -119114 -138457 -155849 -83111
20804 -83111 147469 230126 174024 196043 84783 32821 -6377 -15841 -140021 -89246 90582
20793 90582 -101247 -202635 -38809 176167 154495 153673 227685 197611 -150697 -258491 -43903
20782 -43903 -44388 23081 143115 307328 537461 514057 433477 461160 416849 317311 206768
20771 206768 95073 24511 20970 42544 -55489 82286 25323 94674 171138 110762 181300
$$ packed form
20847A78766P605j07063k71360J38000k5109P9883J71538N0079n8476m7318l4018
20836H2527q826R9165N9695O9044j18037j39457j75853J45317K1602L29611R1153
20825D55941O9212J09473p9770o6400k97140n1168j47359j91946j36745K1825
20815c14077J05995K63396K1817j16847N1814r949r7277k3986j9343j7392P2738
20804h3111K30580Q2657n6102K2019j11260n1962l9198r464j24180N0775J79828
20793I0582j91829j01388J63826K14976k1672q22P4012l0074l48308j07794K14588
20782d3903m85O7469J20034J64213K30133k3404q0580K7683m4311r9538j10543
20771B06768j11695p0562l541K1574r8033J37775n6963O9351P6464o0376P0538
$$ plain form
20760 181300 233976 301878 368309 533443 383291 198970 181472 249558 100805 171609 64000
20749 64000 -232898 -377179 -186269 -206877 -161752 -3188 18470 -253793 -409672 -160284
20739 -160284 67739 120333 70800 -31840 -52536 88178 10873 -258088 -113772 -72742
20729 -72742 -45760 109943 336376 347258 453588 162907 204634 222619 84315 -103978
20719 -103978 -398421 -298670 -256055 -90549 -22752 187577 506971 613181 395483 230112
20709 230112 320931 365049 142211 -204904 -269935 -177547 -86401 -82933 135674 147145 94984
20698 94984 6014 180671 243089 402120 638133 467663 443849 328317 3034 -162483
20688 -162483 -120694 -81040 -40761 30566 141294 270426 407526 389412 245631 -88639
$$ packed form
20760A81300N2676O7902O6431J65134j50152j84321j7498O8086j48753P0804j07609
20749F4000k96898j44281J90910k0608M5125J58564K1658k72263j55879K49388
20739a60284K28023N2594m9533j02640k0696J40714p7305k68961J44316M1030
20729g2742K6982J55703K26433J0882J06330k90681M1727J7985j38304j88293
20719a03978k94443R9751M2615J65506O7797K10329L19394J06210k17698j65371
20709B30112R0819M4118k22838l47115o5031R2388R1146L468K18607J1471n2161
20698I4984q8970J74657O2418J59031K36013j70470k3814j15532l25283j65517
20688a62483M1789L9654M0279P1327J10728J29132J37100j8114j43781l34270
$$ plain form
20678 -88639 -236432 -183518 -201715 -419775 -537624 -494583 -325850 -243941 -284736 -137530 -48674
20667 -48674 -133042 -191826 -88624 -88688 -201520 -252369 -222450 -337883 -326284 -300742 -144165
20656 -144165 -13088 196232 98589 166518 15106 -108758 -94572 168640 120174 32655
20646 32655 -32599 64309 331510 368355 109181 33953 -45213 -191254 -176075 -141346 27611
20635 27611 286524 146890 178232 213995 314715 287507 272749 -1 -24384 -108943 -149543
20624 -149543 -174774 -141542 25115 24638 -37354 -270488 -212867 -117804 -22253 -247365 -182099
20613 -182099 -185223 -232025 -236199 -298136 -626594 -557698 -214301 -35148 174626 297697 501901
20602 501901 749316 653745 360406 131560 80530 -133548 -138551 63471 74216 299588
$$ packed form
20678h8639j47793N2914j8197k18060j17849M3041J68733Q1909m0795J47206Q8856
20667d8674q4368n8784J03202o4j12832n0849K9919j15433J1599K5542J56577
20656a44165J31077K09320r7643O7929j51412j23864J4186K63212m8466q7519
20646C2655o5254R6908K67201L6845k59174p5228p9166j46041J5179L4729J68957
20635B7611K58913j39634L1342L5763J00720k7208j4758k72750k4383q4559m0600
20624a49543k5231L3232J66657m77o1992k33134N7621R5063R5551k25112O5266
20613a82099l124m6802m174o1937l28458O8896L43397J79153K09774J23071K04204
20602E01901K47415r5571k93339k28846n1030k14078n003K02022J0745K25372
$$ plain form
20592 299588 355425 -27858 -149938 -64636 118514 104116 133340 -51015 30055 38224 151699
20581 151699 135736 95060 102169 314398 525031 462577 456824 601504 360386 330602 466867
20570 466867 562324 140953 83605 175178 -2716 48644 88497 -43993 -381867 -361063 -242979
20559 -242979 -206509 -192338 67577 -76121 18512 321897 215603 144304 186012 47315
20549 47315 -120348 -192612 15350 288674 355138 116986 -174919 -142242 -271119 -219281
20539 -219281 -63711 123182 198242 104773 73426 13467 98307 298335 233584 264587 395704
20528 395704 413086 147405 16920 91224 75516 123655 172133 237570 172472 -82585 25340
20517 25340 72089 85676 -15851 10534 56925 131627 136184 -182718 -144565 239235 359712
$$ packed form
20592B99588N5837l83283j22080Q5302J83150j4398K9224j84355Q1070Q169J13475
20581A51699j5963m0676P109K12229K10633o2454n753J44680k41118k9784J36265
20570D66867R5457m21371n7348R1573j77894N1360L9853j32490l37874K0804J18084
20559b42979L6470J4171K59915j43698R4633L03385j06294p1299M1708j38697
20549D7315j67663p2264K07962K73324O6464k38152k91905L2677j28877N1838
20539b19281J55570J86893P5060r3469l1347n9959Q4840K00028o4751L1003J31117
20528C95704J7382k65681j30485P4304j5708M8139M8478O5437o5098k55057J07925
20517B5340M6749J3587j01527K6385M6391P4702M557l18902L8153L83800J20477
$$ plain form
20506 359712 199916 182025 201342 7831 -191357 -252340 -137938 -181672 -131188 47890
20496 47890 106001 198808 152976 387075 360726 362103 289997 280315 225824 137730 183894 173672
20484 173672 159839 203715 243221 226337 318753 448428 424828 527304 326304 257113 243545
20473 243545 53261 165112 51271 -237880 -191621 -116329 -143339 -104438 146938 170091
20463 170091 199387 199629 137876 127801 161560 -4165 -91899 -308886 -511616 -395711 -123705
20452 -123705 13237 113107 278463 378022 194247 68383 35624 64654 97700 136647 -109727
20441 -109727 -81666 167197 326385 420405 375153 107728 -23269 70120 137572 149999 443388
20430 443388 483939 375245 22447 -361079 -373899 -198647 39288 157263 249691 337646
$$ packed form
20506C59712j59796j7891J9317j93511j99188o0983J14402m3734N0484J79078
20496D7890N8111R2807m5832K34099k6349J377p2106r682n4491q8094M6164j0222
20484A73672j3833M3876L9506j6884R2416J29675k3600J02476k01000o9191j3568
20473B43545j90284J11851j13841k89151M6259P5292k7010L8901K51376K3153
20463A70091K9296K42o1753j0075L3759j65725q7734k16987k02730J15905K72006
20452a23705J36942R9870J65356R9559j83775j25864l2759K9030L3046L8947k46374
20441a09727K8061K48863J59188R4020m5252k67425j30997R3389O7452J2427K93389
20430D43388M0551j08694l52798l83526j2820J75252K37935J17975R2428Q7955
$$ plain form
20420 337646 445266 327010 263436 544954 672403 439878 388929 564015 527233 616435
20410 616435 688940 304179 166870 249601 -26952 -16678 -27725 -137800 -281182 -146950
20400 -146950 4502 41738 11889 47192 -121559 -243388 -270119 -106448 -58829 -75561 52732
20389 52732 246404 397879 209329 -81345 90804 151863 136300 193102 35332 -234310
20379 -234310 -121305 -20204 -33203 72426 206049 102368 117778 410920 335283 298185
20369 298185 305521 383442 499884 467437 329396 33801 -205374 -119237 147655 349579
20359 349579 461349 370869 78376 113843 61532 184205 306012 280204 232113 142378 61223
20348 61223 -84411 -76661 -151711 -330493 -122831 79561 104872 -10162 -62119 77807 63687
$$ packed form
20420C37646J07620j18256o3574K81518J27449k32525n0949J75086l6782Q9202
20410F16435P2505l84761j37309Q2731k76553J0274j1047j10075j43382J34232
20400a46950J51452L7236k9849L5303j68751j21829k6731J63671M7619j6732J28293
20389E2732J93672J51475j88550k90674J72149O1059j5563N6802j57770k69642
20379b34310J13005J01101j2999J05629J33623j03681J5410K93142p5637l7098
20369B98185P336P7921J16442l2447j38041k95595k39175Q6137K66892K01924
20359C49579J11770r0480k92493L5467n2311J22673J21807k5808m8091q9735q1155
20348F1223j45634P750p5050j78782K07662K02392K5311j15034n1957J39926j4120
$$ plain form
20337 63687 5818 58240 -322 -88946 -123989 -109262 -41438 -249596 -147701 110087 -111954
20326 -111954 -60785 7179 -94619 -226909 -209641 -235355 -66355 42401 291979 376594
20316 376594 180017 262546 217228 61757 103248 186862 212708 127034 126357 266870 568136
20305 568136 631010 548043 450554 195431 -96395 -149377 192041 286739 147823 27441
20295 27441 -44265 -22334 -107001 -185375 -118944 177967 211174 149446 53015 -185183 -202069
20284 -202069 19188 11809 -788 -117686 -179971 -289791 -62651 143821 20539 -53175
20274 -53175 76978 175136 194666 334261 218687 5470 -185022 -512145 -471827 -236046
20264 -236046 -10074 29506 -12124 191309 207204 -23559 -121263 -318087 -227927 74970
$$ packed form
20337F3687n7869N2422n8562q8624l5043J4727O7824k08158J01895K57788k22041
20326a11954N1169O7964j01798j32290J7268k5714J69000J08756K49578Q4615
20316C76594j96577Q2529m5318j55471M1491Q3614K5846q5674o77J40513L01266
20305E68136O2874q2967r7489k55123k91826n2982L41418R4698j38916j20382
20295B7441p1706K1931q4667p8374O6431K96911L3207o1728r6431k38198j6886
20284b02069K21257p379j2597j16898o2285j09820K27140K06472j23282p3714
20274e3175J30153R8158J9530J39595j15574k13217j90492l27123M0318K35781
20264b36046K25972L9580m1630K03433J5895k30763r7704j96824R0160L02897
$$ plain form
20254 74970 52708 -45037 25765 -61520 -92655 -236538 -78363 235984 312707 199792 193625
20243 193625 130682 195339 336689 312122 297447 188851 -130734 -167955 -47974 -120382 -114198
20232 -114198 -63928 -7771 -56379 -217680 -92607 -20507 -67570 -195328 -88371 -25181 168718
20221 168718 221454 356323 197750 231364 203312 24560 44974 -63275 -14431 167545
20211 167545 272883 277648 203180 18619 74626 73898 119173 226068 373263 358725 308641
20200 308641 274016 331548 352264 474571 695899 827042 920133 829113 743148 882499 1017794
20189 1017794 1119586 1223425 1143271 1090396 1068471 940596 941909 890686 906511 930983 795831
20178 795831 993244 1062843 960209 960944 959010 785783 779150 833918 1013153 1068162 745435
$$ packed form
20254G4970k2262r7745P0802q7285l1135j43883J58175L14347P6723j12915o167
20243A93625o2943O4657J41350k4567j4675j08596l19585l7221J19981p2408O184
20232a14198N0270N6157m8608j61301J25073P2100m7063j27758J06957O3190J93899
20221A68718N2736J34869j58573L3614k8052j78752K0414j08249M8844J81976
20211A67545J05338M765p4468j84561N6007p28M5275J06895J47195j4538n0084
20200C08641l4625N7532K0716J22307K21328J31143R3091r1020q5965J39351J35295
20189A017794J01792J03839q0154n2875k1925j27875J313n1223J5825K4472j35152
20178G95831J97413O9599j02634P35j934j73227o633N4768J79235N5009l22727
$$ plain form
20167 745435 563187 466779 292469 282929 527114 508922 413216 486741 514304 435142 494972
20156 494972 302479 236345 329610 195457 258273 604001 734940 730961 839333 941224
20146 941224 977205 849747 500131 408879 384125 406498 265415 357544 638384 816766
20136 816766 855438 930665 1217510 1310162 1243624 1266975 1168387 1426500 1524632 1718571 1798499
20125 1798499 1580820 1292606 1033174 966687 793731 887157 1020509 1190030 1170708 1063496
20115 1063496 872645 658852 464517 611331 691323 498512 445104 576736 587760 313979
20105 313979 58590 -29384 75134 161692 177807 35740 -98291 -83829 65651 22946
20095 22946 173789 382433 240577 82306 231305 263139 325413 329534 328471 76602 -99204
$$ packed form
20167G45435j82248r6408j74310r540K44185j8192r5706P3525K7563p9162N9830
20156D94972j92493o6134R3265j34153O2816L45728J30939l979J08372J01891
20146I41224L5981j27458l49616r1252k4754K2373j41083R2129K80840J78382
20136H16766L8672P5227K86845R2652o6538K3351r8588K58113R8132J93939P9928
20125A798499k17679k88214k59432o6487j72956R3426J33352J69521j9322j07212
20115A063496j90851k13793j94335J46814P9992j92811n3408J31632J1024k73781
20105C13979k55389q7974J04518Q6558J6115j42067j34031J4462J49480m2705
20095B2946J50843K08644j41856j58271J48999L1834O2274M121j063k51869j75806
$$ plain form
20084 -99204 -36020 177074 331463 411337 151413 22200 82211 -53330 -211081 231684
20074 231684 305651 349786 400902 286741 197802 -102683 -335128 -373466 -69158 66420
20064 66420 -141071 -253946 -343641 -232361 108507 343840 347826 -101341 60205 -2365
20054 -2365 -60939 286752 382671 296552 380811 407538 212834 159079 -56164 -133022 -118365
20043 -118365 -7291 -155335 -103670 100104 63626 135416 137691 165440 104103 40658 66848
20032 66848 -109209 -96197 58794 158075 54454 1104 17348 2792 174253 252944 386769
20021 386769 381877 272650 98817 126706 259307 143334 3957 37256 115774 201277 166068
20010 166068 113097 129611 141978 334306 366577 161577 15017 84312 223617 128955 70874
$$ packed form
20084i9204O3184K13094J54389P9874k59924j29213O0011j35541j57751M42765
20074B31684P3967M4135N1116j14161q8939l00485k32445l8338L04308J35578
20064F6420k07491j12875q9695J11280L40868K35333L986m49167J61546o2570
20054b365n8574L47691R5919q6119Q4259K6727j94704n3755k15243p6858J4657
20043a18365J11074j48044N1665K03774l6478P1790K275K7749o1337o3445K6190
20032F6848j76057J3012J54991R9281j03621n3350J6244j4556J71461P8691J33825
20021C86769m892j09227j73833K7889J32601j15973j39377L3299P8518Q5503l5209
20010A66068n2971J6514J2367J92328L2271k05000j46560O9295J39305r4662n8081
$$ plain form
19999 70874 -160601 -206220 91459 168957 67481 171398 494131 523802 425953 462814 571222
19988 571222 427945 445742 383045 400213 401819 265624 299469 337587 448389 351010 241435
19977 241435 -30174 137552 501326 571305 511752 662772 771956 702397 598733 671817
19967 671817 865984 741929 637284 433683 448589 466553 513278 575792 699662 780921
19957 780921 857746 986935 1130651 1260836 1317714 1174906 1312558 1023489 1040392 908827
19947 908827 990824 897932 855943 955470 889424 926193 1127519 1207752 1276471 1241852 1251290
19936 1251290 1450390 1476723 1548329 1542912 1338192 1135455 937205 832398 819075 793413
19926 793413 613715 663395 348803 156832 402658 608252 513226 435348 257401 277412
$$ packed form
19999G0874k31475m5619K97679P7498j01476J03917L22733K9671r7849L6861J08408
19988E71222j43277J7797o2697J7168J606j36195L3845L8118J10802r7379j09575
19977B41435k71609J67726L63774O9979n9553J51020J09184o9559j03664P3084
19967F71817J94167j24055j04645k03601J4906J7964M6725O2514J23870Q1259
19957G80921P6825J29189J43716J30185N6878j42808J37652k89069J6903j31565
19947I08827Q1997r2892m1989R9527o6046L6769K01326Q0233O8719l4619R438
19936A251290J99100K6333P1606n417k04720k02737j98250j04807j3323k5662
19926G93413j79698M9680l14592j91971K45826K05594r5026p7878j77947K0011
$$ plain form
19916 277412 642842 813232 590388 416509 261606 320045 259308 221711 190924 180721
19906 180721 170744 265352 434238 482219 523097 405081 353670 385880 276557 168432 52375
19895 52375 -7504 152445 277169 313566 211371 213625 343504 377447 670191 827423 626027
19884 626027 549202 730732 650502 661601 736208 790649 695428 518529 485103 495906 502183
19873 502183 631833 594452 748306 1079947 1165371 818381 875577 908529 928487 894072 847433
19862 847433 884284 866713 950189 1265847 1457801 1416201 1596457 1540748 1528915 1228956 988442
19851 988442 875736 782763 801904 787418 686776 579607 549230 479871 501196 329380 71129
19840 71129 -12403 430507 280661 -72337 -582 -124566 -10716 58656 257729 556832
$$ packed form
19916B77412L65430J70390k22844j73879j54903N8439o0737l7597l0787j0203
19906A80721r977R4608J68886M7981M0878j18016n1411L2210j09323j08125j16057
19895E2375n9879J59949J24724L6397j02195K254J29879L3943K92744J57232k01396
19884F26027p6825J81530q0230J1099P4607N4441r5221j76899l3426J0803O277
19873E02183J29650l7381J53854L31641Q5424l46990N7196L2952J9958l4415m6639
19862H47433L6851j7571Q3476L15658J91954m1600J80256n5709j1833k99959k40514
19851I88442j12706r2973J9141j4486j00642j07169l0377o9359K1325j71816k58251
19840G1129q3532M42910j49846l52998P1755j23984J13850O9372J99073K99103
$$ plain form
19830 556832 810761 573966 195372 36115 31550 441547 640443 453536 483158 487238
19820 487238 677041 809216 830098 727757 667127 463113 196095 126632 345562 584787
19810 584787 547878 792173 948381 940661 899493 850478 958282 1134384 1152678 1205232 1335630
19799 1335630 1375555 1322037 1210751 1143830 973391 717250 345837 335619 348588 345221 451630
19788 451630 530486 547946 313709 188442 150544 -87895 -76232 -95902 -189924 -119207 -74610
19777 -74610 138331 125102 180442 407949 342005 245440 300841 416629 508719 562361 606277
19766 606277 593654 764587 635059 298701 354553 487929 589914 599969 535974 400886
19756 400886 483721 681122 922370 964500 935700 1061558 1042537 921368 857548 796472 984761
$$ packed form
19830E56832K53929k36795l78594j59257m565M09997J98896j86907K9622M080
19820D87238J89803J32175K0882j02341o0630k04014k67018o9463K18930K39225
19810E84787l6909K44295J56208p720m1168m9015J07804J76102J8294N2554J30398
19799A335630L9925n3518j11286o6921j70439k56141l71413j0218J2969l367J06409
19788D51630P8856J7460k34237j25267l7898k38439J1663j9670r4022P0717M4597
19777g4610K12941j3229N5340K27507o5944r6565N5401J15788R2090N3642M3916
19766F06277j2623J70933j29528l36358N5852J33376J01985J0055o3995j35088
19756D00886Q2835J97401K41248M2130k8800J25858j9021j21169o3820o1076J88289
$$ plain form
19745 984761 1161606 1099359 922001 941956 867560 960650 1180561 1299732 1287551 1235513 1155497
19734 1155497 993665 961967 1235110 1243333 1333517 1100180 1000977 1028203 1075211 1041170 1149159
19723 1149159 1338675 1335854 1493779 1257067 1235087 1247942 1499368 1417953 1410153 1327706 1484088
19712 1484088 1823864 2003431 2144209 2206671 2347390 2705737 2768435 2879219 3049786 3052308
19702 3052308 3179170 3457363 3826319 4419565 4739559 5175923 5896955 6385132 6992303
19693 6992303 7942222 8983456 9866751 10859423 11948718 12803198 13664950 14891517 16314604
19684 16314604 17973118 19957748 22291009 25673441 31228825 39605479 48707643 54352943
19676 54352943 55851971 54901596 53952620 53580607 53980869 56395140 61105293 67761929 76670869
$$ packed form
19745I84761J76845o2247j77358J9955p4396R3090K19911J19171j2181n2038q0016
19734A155497j61832l1698K73143Q223R0184k33337r9203K7226M7008l4041J07989
19723A149159J89516k821J57925k36712k1980J2855K51426q1415p800q2447J56382
19712A484088L39776J79567J40778O2462J40719L58347O2698J10784J70567K522
19702C052308J26862K78193L68956N93246L19994M36364P21032M88177O07171
19693F992303R49919J041234Q83295R92672J089295Q54480Q61752J226567J423087
19684A6314604J658514J984630K333261L382432N555384Q376654R102164N645300
19676E4352943J499028r50375r48976l72013M00262K414271M710153O656636Q908940
$$ plain form
19667 76670869 89055552 107741701 138963809 191932076 263060488 320440126 344116440
19660 344116440 344381398 328384969 295730603 249091201 203557735 166777617 138013573
19653 138013573 117574071 107058104 106756537 115266782 124517223 124525503 114504857 99639094
19645 99639094 84661227 70069969 56797715 46411321 38695302 33480036 30003090
19638 30003090 27503277 26008047 25613843 26042140 26960938 27938918 29144869 30372346 31613959
19629 31613959 32848216 34247767 36189862 38967558 42779666 47617523 53923817 62433012
19621 62433012 75079735 93945859 118651447 140945507 151164783 149762268 143489879
19614 143489879 137730305 133713975 133361751 139234462 155060716 186236021 235669860 295539002
$$ packed form
19667G6670869J2384683J8686149L1222108N2968267P1128412N7379638K3676314
19660C44116440K64958j5996429l2654366m6639402m5533466l6780118k8764044
19653A38013573k0439502j0515967l01567Q510245R250441Q280j0020646j4865763
19645I9639094j4977867j4591258j3272254j0386394p716019n215266l476946
19638C0003090k499813j495230l94204M28297R18798R77980J205951J227477J241613
19629C1613959J234257J399551J942095K777696L812108M837857O306294Q509195
19621F2433012J2646723J8866124K4705588K2294060J0219276j402515o272389
19614A43489879n759574m016330l52224N872711J5826254L1175305M9433839N9869142
$$ plain form
19606 295539002 358762242 419943377 449913768 427121805 368766198 302905568 244107527
19599 244107527 189638733 144355633 111122703 88138068 72232215 61557586 54942277
19592 54942277 51976460 53216837 58177270 61912934 59921700 53571256 46011607 38854498
19584 38854498 31941230 25752808 20945560 17415819 14957752 13335951 12228819 11405490
19576 11405490 10738005 10171732 9528712 8546073 7352999 6412295 5806539 5343534 4889505
19567 4889505 4636148 4331903 4198602 4195787 4147966 4204430 4493584 4680181 4830016 4685030
19557 4685030 4597488 4533800 4463534 4253436 3997626 3622678 3320464 3273861 3520019 3494499
19547 3494499 3404556 3346022 3133948 3011790 2896262 2998808 2879362 2886018 2731762 2638607
$$ packed form
19606B95539002O3223240O1181135K9970391k2791963n8355607o5860630n8798041
19599B44107527n4468794m5283100l3232930k2984635j5905853j0674629o615309
19592E4942277k965817J240377M960433L735664j991234o350444p559649p157109
19584C8854498o913268o188422m807248l529741k458067j621801j107132q23329
19576A1405490o67485n66273o43020r82639j193074r40704o05756m63005m54029
19567D889505k53357l04245j33301k815m7821N6464K89154J86597J49835j44986
19557D685030q7542o3688p0266k10098k55810l74948l02214m6603K46158k5520
19547C494499q9943n8534k12074j22158j15528J02546j19446O656j54256r3155
$$ plain form
19537 2638607 2395370 2267030 1906559 1533915 1097470 1298330 1520134 1473254 1499272 1585503
19527 1585503 1751658 1544704 1441797 1384508 1295098 1315185 1213372 1267240 1351203 1326657
19517 1326657 1293408 1077193 1041844 1148998 1164276 1047375 1144842 996219 963815 780283
19507 780283 761838 715562 518158 618743 766592 815248 967085 1097480 1247432 1403107
19497 1403107 1593757 1679139 1371661 1133629 1200352 1157042 1112367 1127497 1105739 1199907 1519721
19486 1519721 1644585 1518242 1050219 813016 862743 1023972 1298131 1753842 2035086 1816544
19476 1816544 1876965 1773791 1850389 1694583 1498157 1179347 1040885 893844 460986 165951
19466 165951 -133594 -40808 37028 38 74547 94152 224079 299010 281118 49821 32049
$$ packed form
19537B638607k43237j28340l60471l72644m36445K00860K21804m6880K6018Q6231
19527A585503J66155k06954j02907n7289q9410K0087j01813N3868Q3963k4546
19517A326657l3249k16215l5349J07154J5278j16901R7467j48623l2404j83532
19507G80283j8445m6276j97404J00585J47849M8656J51837J30395J49952J55675
19497A403107J90650Q5382l07478k38032O6723m3310m4675J5130k1758R4168L19814
19486A519721J24864j26343m68023k37203M9727J61229K74159M55711K81244k18542
19476A816544O0421j03174P6598j55806j96426l18810j38462j47041m32858k95035
19466A65951k99545R2786P7836l6990P4509J9605J29927P4931j7892k31297j7772
$$ plain form
19455 32049 103791 315311 373967 321132 405262 291016 309422 367447 314354 266432 405239
19444 405239 517963 761846 982374 971301 967558 788068 655888 908911 1105136 1072092
19434 1072092 1138252 1302569 1251359 1238517 1477604 1381628 1155280 1061859 1295831 1378222
19424 1378222 1142797 1096261 1214390 1080011 1387508 1517475 1116706 1131299 1350712 1314558
19414 1314558 1358116 1119996 788342 777117 921375 996927 999434 889418 1102777 1504726
19404 1504726 1830751 2127799 2367919 2674207 2874989 3122077 3286950 3468638 3908158
19395 3908158 4103219 4132494 4796375 5784946 6617725 7438909 8453008 9264483 9855424
19386 9855424 10579374 11016196 11731322 12627608 13440543 14583301 15840632 17394381 19443809
$$ packed form
19455C2049P1742K11520N8656n2835Q4130j14246J8406N8025n3093m7922J38807
19444D05239J12724K43883K20528j1073l743j79490j32180K53023J96225l3044
19434A072092O6160J64317n1210j2842K39087r5976k26348r3421K33972Q2391
19424A378222k35425m6536J18129j34379L07497J29967m00769J4593K19413l6154
19414A314558M3558k38120l31654j1225J44258P5552K507j10016K13359M01949
19404A504726L26025K97048K40120L06288K00782K47088J64873J81688M39520
19395C908158J95061K9275O63881R88571Q32779Q21184J014099Q11475N90941
19386I855424P23950M36822P15126Q96286Q12935J142758J257331J553749K049428
$$ plain form
19377 19443809 21851219 24701195 28152557 32065120 36873725 42442496 49023687 56720872
19369 56720872 66988946 81877338 104572847 137652950 175498959 204911341 223588186
19362 223588186 239234928 249361668 241356128 215999314 185399033 158314507 135478738
19355 135478738 117046502 104908008 99494810 100925327 110435714 131184746 163022547
19348 163022547 195085188 215935774 228831197 239429793 240141753 220876281 187938230
19341 187938230 153790288 123553241 96754463 74918322 58223045 45744728 36956514
19334 36956514 30449379 25391544 21214733 17865881 15207476 13131794 11322367 9919674
19326 9919674 9166897 8498229 7845307 7492758 7416492 7413301 7022433 6659846 6421424 6187191
$$ packed form
19377A9443809K407410K849976L451362L912563M808605N568771O581191P697185
19369E6720872J0268074J4888392K2695509L3080103L7846009K9412382J8676845
19362B23588186J5646742J0126740q005540k5356814l0600281k7084526k2835769
19355A35478738j8432236j2138494n413198J430517R510387K0749032L1837801
19348A63022547L2062641K0850586J2895423J0598596P11960j9265472l2938051
19341A87938230l4147942l0237047k6798778k1836141j6695277j2478317q788214
19334C6956514o507135n057835m176811l348852k658405k075682j809427j402693
19326I919674p52777o68668o52922l52549p6266l191l90868l62587k38422k34233
$$ plain form
19316 6187191 6242301 5739734 5044231 4493336 4035903 3780236 3507618 3369788 3444902 3412521
19306 3412521 3517974 3441265 3390941 3344555 3210941 3223091 3075006 2732560 2397701 1986827
19296 1986827 1805353 1754829 1486880 1380014 1212582 1104930 1093855 1100403 954641 1164976
19286 1164976 1097200 1093159 1036409 1011332 1053895 721103 700330 664433 484551 368124 465701
19275 465701 737387 846873 824138 1065053 1184100 1102134 1194577 1136761 914698 889784
19265 889784 1120016 1253583 1243236 979326 925331 1094416 997340 1018860 1279202 1415517
19255 1415517 1296593 1220629 1223439 1339050 1537605 1662971 1730194 1888128 1991000 2103378
19245 2103378 2450780 2492814 2304854 2052124 1862683 1612554 1706565 1602686 1408627 1341131
$$ packed form
19316F187191N5110n02567o95503n50895m57433k55667k72618j37830P5114l2381
19306C412521J05453p6709n0324m6386j33614J2150j48085l42446l34859m10874
19296A986827j81474n0524k67949j06866j67432j07652j1075O548j45762K10335
19286A164976o7776m041n6750k5077M2563l32792k0773l5897j79882j16427R7577
19275D65701K71686J09486k2735K40915J19047q1966R2443n7816k22063k4914
19265H89784K30232J33567j0347k63910n3995J69085r7076K1520K60342J36315
19255A415517j18924p5964K810J15611J98555J25366O7223J57934J02872J12378
19245B103378L47402M2034j87960k52730j89441k50129R4011j03879j94059o7496
$$ plain form
19235 1341131 1415710 1288890 956416 967496 856538 1044390 1244589 1230686 976770 1211834
19225 1211834 1502670 1380869 1312032 1297637 1426876 1525091 1452461 1329693 1188108 1147266
19215 1147266 1328546 1192056 1293608 1306969 1234528 1341195 1509831 1448606 1150098 1132511
19205 1132511 1059777 1143237 1039240 1176814 1641932 1569429 1452648 1442624 1525903 1536963
19195 1536963 1457300 1340226 1321785 1366236 1438295 1500055 1759790 1842360 1754591 1526395 1430696
19184 1430696 1500826 1617315 1529020 1489883 1790366 2157750 2323960 1980400 1785034 1676475
19174 1676475 1643827 1677239 1585712 1543286 1634091 1579857 1613710 1756634 1870201 1829402 1760789
19163 1760789 2028496 2451067 2875355 2914998 3013741 3191816 3379016 3548026 3613480 3567045
$$ packed form
19235A341131P4579j26820l32474J1080j10958J87852K00199j3903k53916K35064
19225A211834K90836j21801o8837j4395J29239R8215p2630j22768j41585m0842
19215A147266J81280j36490J01552J3361p2441J06667J68636o1225k98508j7587
19205A132511p2734Q3460j03997J37574M65118p2503j16781j0024Q3279J1060
19195A536963p9663j17074j8441M4451P2059O1760K59735Q2570q7769k28196r5699
19184A430696P0130J16489q8295l9137L00483L67384J66210l43560j95366j08559
19174A676475l2648L3412r1527m2426R0805n4234L3853J42924J13567m0799o8613
19163A760789K67707M22571M24288L9643R8743J78075J87200J69010O5454m6435
$$ plain form
19153 3567045 3467539 3337618 3702843 3817839 3756107 3843364 4300563 4812101 5016315 5077462
19143 5077462 5148995 5528728 6021990 6675199 7405461 8437953 9750436 10839261 12573030
19134 12573030 14672420 16390125 18255559 20588654 23001194 25405646 28105746 31928321
19126 31928321 37638052 46134463 56595971 65685303 70433938 71352668 70502579 70036710
19118 70036710 70671867 73070366 78573941 87069521 98393464 113373595 135030172 170021721
19110 170021721 227063209 304700003 378314703 420762413 428926602 409975821 370024772
19103 370024772 316461872 261759904 215027697 177863929 150342227 132849989 126032189
19096 126032189 129113734 137302465 141451349 135616508 121353839 104679621 88605571
$$ packed form
19153C567045r9506j29921L65225J14996o1732Q7257M57199N11538K04214O1147
19143E077462P1533L79733M93262O53209P30262J032492J312483J088825J733769
19134A2573030K099390J717705J865434K333095K412540K404452K700100L822575
19126C1928321N709731Q496411J0461508R089332M748635R18730q50089m65869
19118G0036710O35157K398499N503575Q495580J1323943J4980131K1656577L4991549
19110A70021721N7041488P7636794P3614700M2447710Q164189j8950781l9951049
19103C70024772n3562900n4701968m6732207l7163768k7521702j7492238o817800
19096A26032189L081545Q188731M148884n834841j4262669j6674218j6074050
$$ plain form
19089 88605571 73637434 60605607 50892842 44037367 39190711 35633676 32827191 30939061
19081 30939061 29769833 28682494 27942676 27747953 27700597 27751050 28545482 29634364 31221733
19072 31221733 33456213 36478858 39924969 44244888 50083019 58444336 71493496 89890783
19064 89890783 110377346 125314974 130696869 128924760 125039487 122025956 121375555 125227295
19056 125227295 136679168 159683853 194655639 236542028 280590121 324372338 353011507
19049 353011507 347350674 309981897 259866991 211678089 167941231 129995879 100909424
19042 100909424 80038706 65030014 54418946 47310754 42965073 41391341 42697949
19035 42697949 45118977 45285694 42129696 37341716 32366396 27579805 23242650 19853254
$$ packed form
19089H8605571j4968137j3031827r712765o855475m846656l557035k806485j888130
19081C0939061j169228j087339p39818j94723m7356N0453P94432J088882J587369
19072C1221733K234480L022645L446111M319919N838131Q361317J3049160J8397287
19064H9890783K0486563J4937628N381895j772109l885273l013531o50401L851740
19056A25227295J1451873K3004685L4971786M1886389M4048093M3782217K8639169
19049C53011507n660833l7368777n0114906m8188902m3736858l7945352k9086455
19042A00909424k0870718j5008692j0611068p108192m345681j573732J306608
19035D2697949K421028J66717l155998m787980m975320m786591m337155l389396
$$ plain form
19027 19853254 17385310 15517362 13961909 12628051 11625168 10544338 9727357 8748264
19019 8748264 7845396 7490936 7162661 6969927 6597626 6514724 6442273 6384263 6454497 6684573
19009 6684573 7015605 7211931 7388677 7565509 7683287 7841397 8036198 8158223 8499530
19000 8499530 8976505 9581556 10241693 10784850 11453388 12088046 12690322 13489068 14398124
18991 14398124 15477469 16696139 17861006 19102281 20608424 22372785 24429490 26725195
18983 26725195 29202077 31906484 35512470 39781152 44737097 50648881 57713429 66601738
18975 66601738 77784215 92440775 111547583 135189481 160931583 185118615 204938581
18968 204938581 219260238 227388716 227811074 220928312 210564343 201873768 198013994 200352088
$$ packed form
19027A9853254k467944j867948j555453j333858j002883j080830q16981r79093
19019H748264r02868l54460l28275j92734l72301q2902p2451n8010P0234K30076
19009F684573L31032J96326J76746J76832J17778J58110J94801J22025L41307
19000H499530M76975O05051O60137N43157O68538O34658O02276P98746R09056
18991A4398124J079345J218670J164867J241275J506143J764361K056705K295705
18983B6725195K476882K704407L605986M268682M955945N911784P064548Q888309
18975F6601738J1182477J4656560J9106808K3641898K5742102K4187032J9819966
18968B04938581J4321657Q128478M22358o882762j0363969q690575l859774K338094
$$ plain form
18960 200352088 207275899 215174890 220467257 222177956 218389958 207027414 187684511 163893539
18952 163893539 139036602 115631302 95006993 77400080 63016860 51706640 43014800
18945 43014800 36203181 30589149 26327044 22985383 20461994 18482776 16595897 14823529
18937 14823529 13605810 12827724 12010227 11113897 10316066 9781117 9218348 8860145 8515470
18928 8515470 8358220 8115004 8020914 7769441 7538228 7159583 6694792 6073262 5576056 5466405
18918 5466405 5030458 4474321 4075000 3803582 3300846 2739528 2409017 2101915 1908608
18909 1908608 1982738 1986617 1962889 1874382 1762010 1657876 1795293 1643964 1564270 1526369 1335606
18898 1335606 1244768 1478478 1539243 1291824 1131863 1338621 1307822 1192553 1339896 1562767
$$ packed form
18960B00352088O923811P898991N292367J710699l787998j1362544j9342903k3790972
18952A63893539k4856937k3405300k0624309j7606913j4383220j1310220q691840
18945D3014800o811619n614032m262105l341661k523389j979218j886879j772368
18937A4823529j217719p78086q17497q96330p97831n34949n62769l58203l44675
18928H515470j57250k43216r4090k51473k31213l78645m64791o21530m97206j09651
18918E466405m35947n56137l99321k71418n02736n61318l30511l07102j93307
18909A908608P4130L879k3728q8507j12372j04134J37417j51329p9694l7901j90763
18898A335606r0838K33710O0765k47419j59961K06758l0799j15269J47343K22871
$$ plain form
18888 1562767 1325753 1328317 1092369 1149568 1294025 1473000 1251980 1223266 1175018 1200391
18878 1200391 1315879 1302983 1185344 1127587 1186536 1111647 927597 851514 1112598 942374
18868 942374 545241 434518 354229 276988 421594 390323 598050 880188 520223 137523
18858 137523 -75354 -109165 -14217 -26890 40452 452968 814856 495687 251109 310086
18848 310086 547739 756573 679709 397726 494402 453541 387259 332755 462152 650097
18838 650097 670422 645902 605881 500162 443484 503433 739321 745834 826119 652061 601858
18827 601858 398605 322015 360974 240043 178005 106056 -30665 134078 164754 240343 282694
18816 282694 129384 218902 374759 359046 51324 155520 447354 531153 584431 585606 542669
$$ packed form
18888A562767k37014K564k35948N7199J44457J78975k21020k8714m8248K5373
18878A200391J15488j2896j17639n7757N8949p4889j84050p6083K61084j70224
18868I42374l97133j10723q0289p7241J44606l1271K07727K82138l59965l82700
18858A37523k12877l3811R4948j2673O7342M12516L61888l19169k44578N8977
18848C10086K37653K08834p6864k81983R6676m0861o6282n4504J29397J87945
18838F50097K0325k4520m0021j05719n6678N9949K35888O513Q0285j74058n0203
18827F01858k03253p6590L8959j20931o2038p1949j36721J64743L0676P5589M2351
18816B82694j53310Q9518J55857j5713l07722J04196K91834Q3799N3278J175m2937
$$ plain form
18805 542669 536505 326393 222274 189936 283008 582548 601238 604957 445292 435706 572820
18794 572820 538221 519625 578763 529719 517149 359720 225741 506726 578685 603636 451781
18783 451781 382729 276134 462109 579837 671095 650776 341128 181541 396922 322748
18773 322748 389311 367259 225376 559844 844470 1363974 1896389 2305170 2663506 2684212
18763 2684212 2447142 2083257 2052633 1935457 1282575 886526 657399 506917 418837 356754
18753 356754 353290 447153 424863 336934 422410 697728 709199 654271 734472 936450 798043
18742 798043 741285 532303 321694 120599 191920 361597 63843 109570 98055 -13623
18732 -13623 2515 -1536 -207904 -190923 -55252 -193917 -100584 17323 67207 -58421 34589
$$ packed form
18805E42669o164k10112j04119l2338R3072K99540J8690L719j59665r586J37114
18794E72820l4599j8596N9138m9044j2570j57429j33979K80985P1959K4951j51855
18783D51781o9052j06595J85975J17728R1258k0319l09648j59587K15381p4174
18773C22748O6563k2052j41883L34468K84626N19504N32415M08781L58336K0706
18763B684212k37070l63885l0624j17176o52882l96049k29127j50482q8080o2083
18753C56754l464R3863k2290q7929Q5476K75318J1471n4928Q0201K01978j38407
18742G98043n6758k08982k10609k01095P1321J69677k97754M5727j1515j11678
18732a3623J6138m051k06368J6981J35671j38665R3333J17907M9884j25628R3010
$$ plain form
18721 34589 100172 -38888 -214732 -318208 -245691 -149757 -209729 -206729 93242 356458 302137
18710 302137 310774 320894 93671 -52858 -54046 -35557 -215982 -52015 108930 100700 36673
18699 36673 62977 211783 402609 257110 190030 253091 32950 160369 81834 -207435
18689 -207435 -152123 131069 228914 288098 221307 233645 126926 74676 144949 193142 334720
18678 334720 -54152 -453922 -356523 -26941 66909 159382 -82895 -28990 38506 87448 -68693
18667 -68693 -530727 -445766 467 69413 215169 163828 39351 210556 171842 141030 265224
18656 265224 223004 214095 229765 81074 -40819 -32816 -206635 -77315 118892 99483 -36295
18645 -36295 -176870 -63568 88310 -144384 -75508 -161884 -133223 -52522 -115798 27102 54741
$$ packed form
18721C4589O5583j39060j75844j03476P2517R5934n9972L000K99971K63216n4321
18710C02137Q637J0120k27223j46529j188J8489j80425J63967J60945q230o4027
18699C6673K6304J48806J90826j45499o7080O3061k20141J27419p8535k89269
18689b07435N5312K83192R7845N9184o6791J2338j06719n2250P0273M8193J41578
18678C34720l88872l99770R7399L29582R3850R2473k42277N3905O7496M8942j56141
18667f8693m62034Q4961M46233O8946J45756n1341j24477J71205l8714l0812J24194
18656B65224m2220q909J5670j48691j21893Q003j73819J29320J96207j9409j35778
18645c6295j40575J13302J51878k32694O8876q6376K8661Q0701o3276J42900K7639
$$ plain form
18634 54741 284485 200068 108296 342123 159319 -177021 -82279 181821 379656 321653
18624 321653 328984 260062 75758 38598 38951 -70384 -158762 -194349 -152809 72944 106256
18613 106256 -17836 83970 305673 172671 16899 -54775 54602 80551 -8369 79980
18603 79980 166251 -23889 -102287 -294609 -271753 -180985 -79886 378538 446163 466652 530581
18592 530581 491071 744097 878120 1057898 1138564 1010926 1053375 1238577 1359326 1253117
18582 1253117 1472587 1361713 1307707 1518886 1772450 1515113 1420190 1381180 1238286 1068352
18572 1068352 1004687 883776 620890 380182 186187 243021 205851 169367 320490 458960
18562 458960 396088 455140 509878 483301 483444 423591 286375 222175 362069 550216 580357
$$ packed form
18634E4741K29744q4417r1772K33827j82804l36340R4742K64100J97835n8003
18624C21653P331o8922j84304l7160L53j09335q8378l5587M1540K25753L3312
18613A06256j24092J01806K21703j33002j55772p1674J09377K5949q8920Q8349
18603G9980Q6271j90140p8398j92322K2856R0768J01099M58424O7625K0489O3929
18592E30581l9510K53026J34023J79778Q0666j27638M2449J85202J20749j06209
18582A253117K19470j10874n4006K11179K53564k57337r4923l9010j42894j69934
18572A068352o3665j20911k62886k40708j93995N6834l7170l6484J51123J38470
18562D58960o2872N9052N4738k6577J43n9853j37216o4200J39894J88147L0141
$$ plain form
18551 580357 535469 419825 303754 220177 185859 158595 253881 158071 110401 331506 754004
18540 754004 934583 800710 876782 867740 760836 914929 885232 933862 1229610 1379160
18530 1379160 1456586 1435938 1230536 909948 611803 486814 433188 191921 259305 457398
18520 457398 303470 414861 510491 658136 960107 1055942 1046949 1047214 860217 765587 505844
18509 505844 465097 301553 202349 8861 129626 190686 57140 -65518 84402 310606
18499 310606 226103 35839 66313 214991 159744 -68255 38216 138651 -24775 -39845
18489 -39845 -67141 -12319 217547 244215 179684 281848 -69790 -256998 -539398 -292196
18479 -292196 27309 -92967 -61569 -92577 -149649 -146566 -28337 -20611 150595 113144 -54586
$$ packed form
18551E80357m4888j15644j16071q3577l4318k7264R5286r5810m7670K21105M22498
18540G54004J80579j33873P6072r042j06904J54093k9697M8630K95748J49550
18530A379160P7426k0648k05402l20588k98145j24989n3626k41267O7384J98093
18520D57398j53928J11391R5630J47645L01971R5835q993K65j86997r4630k59743
18509E05844m0747j63544r9204j93488J20765O1060j33546j22658J49920K26204
18499C10606q4503j90264L0474J48678n5247k27999J06471J00435j63426j5070
18489c9845k7296N4822K29866K6668o4531J02164l51638j87208k82400K47202
18479b92196L19505j20276L1398l1008n7072L083J18229P726J71206l7451j67730
$$ plain form
18468 -54586 -91839 66520 226368 112934 -10395 -152902 -121691 -44163 -170908 -270503
18458 -270503 -88185 -60572 3060 -103834 -190504 -13605 -82257 -158132 -81784 145715 384410
18447 384410 388549 506943 477540 151163 -19320 180852 328996 94871 138711 442379
18437 442379 423195 121758 -3834 193864 -37332 -182132 -270479 -194987 -376996 -313699
18427 -313699 -61393 57907 159773 259151 229355 52306 133356 179634 150195 -87020
18417 -87020 99821 299166 232204 402992 570101 576631 588100 487604 552201 349451 428157
18406 428157 520369 256279 147540 299169 80028 -119706 -128568 -274350 -236292 32587
18396 32587 21452 -237352 -405511 -248506 -80331 165879 431939 301988 168386 -2630
$$ packed form
18468e4586l7253J58359J59848j13434j23329j42507L1211P7528j26745r9595
18458b70503J82318K7613O3632j06894q6670J76899o8652p5875P6348K27499K38695
18447C84410M139J18394k9403l26377j70483K00172J48144k34125M3840L03668
18437D42379j9184l01437j25592J97698k31196j44800q8347P5492j82009O3297
18427c13699K52306J19300J01866R9378k9796j77049Q1050M6278k9439k37215
18417h7020J86841J99345o6962J70788J67109O530J1469j00496O4597k02750P8706
18406D28157R2212k64090j08739J51629k19141j99734q862j45782L8058K68879
18396C2587j1135k58804j68159J57005J68175K46210K66060j29951j33602j71016
$$ plain form
18386 -2630 27300 566 -97909 -283438 -346992 -203390 246716 466080 641120 871084 1117136
18375 1117136 870330 707439 837821 1057226 951980 1061746 1287863 1008935 797772
18366 797772 1083389 931301 890392 946054 1237909 1447303 1424334 1294134 1011685 749770
18356 749770 744573 707329 682659 776187 886743 864856 661270 724825 469620 -77382 -254784
18345 -254784 -84870 65166 282507 356145 115362 235805 141509 134502 82643 86911 -108282
18334 -108282 -134465 -39198 -86239 -235168 -6821 344660 479298 408898 395502 478720 320770
18323 320770 271564 415796 247022 108570 97418 -4155 37044 130530 174860 335265
18313 335265 545498 460348 413338 347929 388140 545430 620193 474364 334643 451645
$$ packed form
18386b630K9930k6734r8475j85529o3554J43602M50106K19364J75040K29964K46052
18375A117136k46806j62891J30382K19405j05246J09766K26117k78928k11163
18366G97772K85617j52088m0909N5662K91855K09394k2969j30200k82449k61915
18356G49770n197l7244k4670R3528J10556k1887k03586O3555k55205n47002j77402
18345b54784J69914J50036K17341P3638k40783J20443r4296p007n1859M268j95193
18334a08282k6183R5267m7041j48929K28347L51481J34638p0400j3396Q3218j57950
18323C20770m9206J44232j68774j38452j1152j01573M1199R3486M4330J60405
18313C35265K10233q5150m7010o5409M0211J57290P4763j45829j39721J17002
$$ plain form
18303 451645 784371 964688 932233 1099250 1170752 1030157 632498 135613 -50511 19018
18293 19018 24556 -132363 -107267 15861 -25945 -188535 -442832 -647528 -467344 -334219
18283 -334219 -594287 -522973 -341724 -206619 27668 -53547 -161610 -91013 -109104 -19205
18273 -19205 6146 -355247 -495598 -528106 -445462 -383743 -302498 -199798 -172857 -77912 -153543
18262 -153543 -355491 -388197 -288093 -240638 -146697 -197375 -188949 -224206 -80491 53004 -3468
18251 -3468 -237166 -236933 -59178 75466 179205 245199 244671 113554 155094 49016 52995 -8040
18239 -8040 -34356 116330 271052 246966 109161 6189 -11382 -286474 -233361 32413 78153
18228 78153 200606 61657 60753 174719 152082 103041 -202918 -61630 68061 164715 139391
$$ packed form
18303D51645L32726J80317l2455J67017P1502j40595l97659m96885j86124O9529
18293A9018N538j56919K5096J23128m1806j62590k54297k04696J80184J33125
18283c34219k60068P1314J81249J35105K34287q1215j08063P0597j8091Q9899
18273a9205K5351l61393j40351l2508Q2644O1719Q1245J02700K6941R4945p5631
18262a53543k01948l2706J00104M7455R3941n0678Q426l5257J43715J33495n6472
18251c468k33698K33J77755J34644J03739O5994n28j31117M1540j06078L979o1035
18239h040k6316J50686J54722k4086j37805j02972j7571k75092N3113K65774M5740
18228G8153J22453j38949r04J13966k2637m9041l05959J41288J29691R6654k5324
$$ plain form
18217 139391 82411 123661 -20849 -18658 202892 286943 253543 84416 -38333 61594 316410
18206 316410 333200 99999 -127540 -232326 -104302 99923 387421 398852 456806 305650
18196 305650 391359 397679 264372 168252 234184 378832 332557 363527 479649 471608 470990 535375
18184 535375 294839 335981 420377 206640 29309 134880 289368 421038 507647 463263
18174 463263 400928 415252 544820 688265 555450 399821 346099 358065 332707 535792
18164 535792 504763 373287 435310 423849 461527 675442 875392 1138929 1365227 1394061
18154 1394061 1506754 1618210 1707563 1782650 1803603 1770649 1905518 2059877 2202893 2350157
18144 2350157 2452849 2333725 2390509 2763070 2820220 3124356 3654176 3953928 4150569 4961115
$$ packed form
18217A39391n6980M1250j44510K191K21550Q4051l3400j69127j22749R9927K54816
18206C16410J6790k33201k27539j04786J28024K04225K87498J1431N7954j51156
18196C05650Q5709O320j33307r6120O5932J44648m6275L0970J16122q041o18O4385
18184E35375k40536M1142Q4396k13737j77331J05571J54488J31670Q6609m4384
18174D63263o2335J4324J29568J43445j32815j55629n3722J1966k5358K03085
18164E35792l1029j31476O2023j1461L7678K13915J99950K63537K26298K8834
18154A394061J12693J11456Q9353P5087K0953l2954J34869J54359J43016J47264
18144B350157J02692j19124N6784L72561N7150L04136N29820K99752J96641Q10546
$$ plain form
18134 4961115 5694523 6230012 6989710 7773514 8559236 9514268 10214761 11080436 12355579
18125 12355579 13707702 15399801 17445293 19690245 22255667 25162922 28490980 32660728
18117 32660728 38342285 45707823 53841148 63117109 74793318 91380463 120276656 176396203
18109 176396203 271442911 361809683 382092736 343360211 283960200 232034538 179954481
18102 179954481 130985397 94802496 69839763 52718815 40963805 32240960 25621305
18095 25621305 20241843 15966806 12633506 10023366 8467209 7199340 6444528 5953285
18087 5953285 5297126 4775823 4364430 3805788 3476230 3286471 3203274 2954007 2825991 2661007
18077 2661007 2723717 2538892 2265028 1843015 1643226 1433645 1442040 1513052 1335746 1260986
$$ packed form
18134D961115P33408N35489P59698P83804P85722R55032P00493Q65675J275143
18125A2355579J352123J692099K045492K244952K565422K907255L328058M169748
18117C2660728N681557P365538Q133325R275961J1676209J6587145K8896193N6119547
18109A76396203R5046708R0366772K0283053l8732525n9400011n1925662n2080057
18102A79954481m8969084l6182901k4962733j7120948j1755010q722845o619655
18095B5621305n379462m275037l333300k610140j556157j267869p54812m91243
18087E953285o56159n21303m11393n58642l29558j89759q3197k49267j28016j64984
18077B661007O2710j84825k73864m22013j99789k09581Q395P1012j77306p4760
$$ plain form
18067 1260986 1322077 1396588 1433733 1455405 1566065 1599668 1670650 1858167 1771977 1595881 1571646
18056 1571646 1793330 1590281 1441780 1314013 958487 649039 791418 947973 1065137
18047 1065137 1003479 466397 388709 568279 626058 679463 568115 267517 152599 178176
18037 178176 185224 495261 761561 546855 427804 546269 444801 542384 352789 237348
18027 237348 259944 432590 566188 551139 417899 472010 266829 156638 57629 111451
18017 111451 123049 219217 254227 195470 398274 453733 283664 -97068 19956 415089
18007 415089 396257 391929 511028 529371 885153 1202987 1228404 1442367 1488331 1494653 1569199
17996 1569199 1481576 1631334 1679480 1785814 1905730 1942039 1932971 1787106 1737172 2007747
$$ packed form
18067A260986O1091P4511L7145K1672J10660L3603P0982J87517q6190j76096k4235
18056A571646K21684k03049j48501j27767l55526l09448J42379J56555J17164
18047A065137o1658n37082p7688J79570N7779N3405j11348l00598j14918K5577
18037A78176P048L10037K66300k14706j19051J18465j01468R7583j89595j15441
18027B37348K2596J72646J33598j5049j33240N4111k05181j10191r9009N3822
18017A11451J1598R6168L5010n8757K02804N5459j70069l80732J17024L95133
18007D15089j8832m328J19099J8343L55782L17834K5417K13963M5964O322P4546
17996A569199q7623J49758M8146J06334J19916L6309r068j45865m9934K70575
$$ plain form
17986 2007747 1714951 1595258 1589335 1552942 1491174 1256559 895150 656993 723751 749780
17976 749780 542342 403559 412857 539451 749072 666804 494260 595271 807057 993088
17966 993088 882760 566347 603955 775436 905515 949745 730829 606990 439060 484494
17956 484494 510634 597969 585702 697669 826844 806735 841662 840636 869666 1070652 900441
17945 900441 803558 899341 768609 750259 780338 785887 812544 935798 1117018 1235959 1168205
17934 1168205 995201 921412 758168 813727 768584 812869 607649 431455 269072 170577
17924 170577 183648 -98908 98533 300049 219845 126764 81143 -56922 -468637 -989573
17914 -989573 -1065298 -902293 -723978 -740232 -632962 -622163 -481889 -429709 -338249 -325081 -279587
$$ packed form
17986B007747k92796j19693n923l6393o1768k34615l61409k38157O6758K6029
17976G49780k07438j38783R298J26594K09621q2268j72544J01011K11786J86031
17966I93088j10328l16413L7608J71481J30079M4230k18916j23839j67930M5434
17956D84494K6140Q7335j2267J11967J29175k0109L4927j026K9030K00986j70211
17945I00441r6883R5783j30732j8350L0079N549K6657J23254J81220J18941o7754
17934A168205j73004p3789j63244N5559m5143M4285k05220j76194j62383r8495
17924A70577J3071k82556J97441K01516q0204r3081m5621j38065m11715n20936
17914i89573p5725J63005J78315j6254J07270J0799J40274N2180R1460J3168M5494
$$ plain form
17903 -279587 -259299 -118335 82586 -54603 -10110 194168 116417 67219 -5244 145962
17893 145962 186999 -72459 -315635 -432178 -462316 -397444 -431470 -339769 -178424 -219198 -331411
17882 -331411 -264281 -167436 -402399 -224052 66296 87961 78902 30658 -166731 -128472 -76463
17871 -76463 -101240 1243 -2112 -69296 -35438 187378 269768 173991 97682 9680 152228
17860 152228 351673 320817 230922 111791 -172331 -333546 -405233 -315589 -372003 -305956 -16300
17849 -16300 1734 41115 112415 -34334 13468 91078 -34733 -189604 -204134 -60032 -205595
17838 -205595 -297837 -83487 -13102 114603 164087 181447 -102092 -299304 -242522 -205063 -161911
17827 -161911 -234767 -175508 -128079 -141910 -142652 -284808 -249102 -198822 -17544 36707 -27412
$$ packed form
17903b79587K0288J40964K00921j37189M4493K04278p7751m9198p2463J51206
17893A45962M1037k59458k43176j16543l0138O4872l4026R1701J61345m0774j12213
17882c31411O7130R6845k34963J78347K90348K1665r059m8244j97389L8259N2009
17871g6463k4777J02483l355o7184L3858K22816Q2390r5777p6309q8002J42548
17860A52228J99445l0856q9895j19131k84122j61215p1687Q9644n6414O6047K89656
17849a6300J8034L9381P1300j46749M7802P7610j25811j54871j4530J44102j45563
17838b05595r2242K14350P0385J27705M9484J7360k83539j97212N6782L7459M3152
17827a61911p2856N9259M7429j3831p42j42156L5706N0280J81278N4251o4119
$$ plain form
17816 -27412 -249319 -384473 -340103 -210398 -244066 -255819 -52640 -25091 -186694 -105534 -104346
17805 -104346 38742 206600 318237 483831 547918 247487 -74966 -235897 -402340 -391429
17795 -391429 -146221 -231618 -226607 -137105 -114191 19896 -85934 -269348 -281253 -96493 -130796
17784 -130796 -157292 -75820 4143 -58833 -182049 -118845 -163837 -170147 -337162 -304784 -154574
17773 -154574 -158207 -163668 -282938 -423906 -398534 -432606 -598343 -678297 -733908 -533295 -451041
17762 -451041 -457552 -246750 -109401 -226905 -144986 -85293 -6013 -42233 94803 -129939 -359844
17751 -359844 -204042 -146933 -256619 -292754 -292873 -240315 -119503 -130715 -199181 -137050 189632
17740 189632 127821 125819 120472 -80366 102698 151673 122642 -93303 -196509 -77419 -44067
$$ packed form
17816b7412k21907j35154M4370J29705l3668j1753K03179K7549j61603Q1160J188
17805a04346J43088J67858J11637J65594O4087l00431l22453j60931j66443J0911
17795c91429K45208q5397N011Q9502K2914J34087j05830j83414j1905J84760l4303
17784a30796k6496Q1472P9963o2976j23216O3204m4992o310j67015L2378J50210
17773a54574l633n461j19270j40968K5372l4072j65737p9954n5611K00613Q2254
17762d51041o511K10802J37349j17504Q1919N9693P9280l6220J37036k24742k29905
17751c59844J55802N7109j09686l6135j19N2558J20812j1212o8466O2131L26682
17740A89632o1811k002n347k00838J83064M8975k9031k15945j03206J19090L3352
$$ plain form
17729 -44067 12649 86510 187098 300509 154045 -52572 -132596 77369 176679 -13399
17719 -13399 13575 44276 -82866 -42413 76599 100529 239789 124230 -60219 28590 28520
17708 28520 49355 210648 166235 251333 -75920 -196630 -282652 -201592 -89115 98529 197461
17697 197461 -72676 -231969 -223202 -198068 -95722 -234333 -509631 -575411 -414442 -391735
17687 -391735 -300745 -233858 -214326 -147049 -185947 -111051 -274746 -258706 -115681 31310 16407
17676 16407 87335 32339 -133459 -348325 -533607 -549431 -559190 -385543 -22636 97288 92618
17665 92618 -58101 -15406 186033 177237 -9657 -94628 -36618 -254291 -295883 -195769 -120183
17654 -120183 -106399 -80194 -165376 -408832 -504871 -269323 -91691 -62946 -178269 -158097 -129402
$$ packed form
17729d4067N6716P3861J00588J13411j46464k06617q0024K09965R9310j90078
17719a3399K6974L0701j27142M0453J19012K3930J39260j15559j84449Q8809p0
17708B8520K0835J61293m4413Q5098l27253j20710q6022Q1060J12477J87644R8932
17697A97461k70137j59293Q767K5134J02346j38611k75298o5780J60969K2707
17687c91735R0990O6887J9532O7277l8898P4896j63695J6040J43025J46991j4903
17676A6407P0928n4996j65798k14866j85282j5824r759J73647L62907J19924m670
17665I2618j50719M2695K01439q796j86894q4971N8010k17673m1592J00114P5586
17654a20183J3784K6205q5182k43456r6039K35548J77632K8745j15323K0172K8695
$$ plain form
17643 -129402 -38527 132992 61433 -154800 -70414 -224412 -430962 -299347 -472426 -639634
17633 -639634 -570038 -451386 -431245 -169505 -61769 -84213 -71206 57027 1672 -257711
17623 -257711 -293131 144405 223579 53985 150931 -13895 4384 288092 386928 216598
17613 216598 32103 -49039 -69839 -359199 -502727 -83064 -65547 -271045 -303077 -178044
17603 -178044 -356677 -98648 134155 385083 330040 244158 12323 -165609 -195949 86717
17593 86717 169691 86664 23349 91802 96 4046 -19661 -262309 -147064 -170620 -39873
17582 -39873 -61356 -53229 -136731 -266485 -180908 -84726 -41567 170317 148418 447889 750660
17571 750660 639275 521217 556413 550531 771001 759241 678836 440620 572223 635154 727728
$$ packed form
17643a29402R0875J71519p1559k16233Q4386j53998k06550J31615j73079j67208
17633f39634O9596J18652K0141K61740J07736k2444J3007J28233n5355k59383
17623b57711l5420M37536P9174j69594R6946j64826J8279K83708R8836j70330
17613B16598j84495q1142k0800k89360j43528M19663J7517k05498l2032J25033
17603a78044j78633K58029K32803K50928n5043q5882k31835j77932l0340K82666
17593H6717Q2974q3027o3315O8453r1706L950k3707k42648J15245k3556J30747
17582c9873k1483Q127q3502j29754Q5577R6182M3159K11884k1899K99471L02771
17571G50660j11385j18058L5196n882K20470j1760q0405k38216J31603O2931R2574
$$ plain form
17560 727728 652663 731065 978706 1167449 943954 716243 580971 591280 960708 1308691
17550 1308691 1587435 1489577 1093058 801563 633527 552474 362942 413174 452670 257030
17540 257030 426026 470631 290027 137297 157396 109399 61737 44227 153451 70125 -56467
17529 -56467 -301414 -432175 -331873 -199792 -191874 -191886 -91313 146410 100180 -103600 -354015
17518 -354015 -492925 -580006 -376555 -64636 144430 281255 252578 59362 -28592 160304
17508 160304 244335 167020 101001 55449 17586 109603 14272 -19795 -175175 -35287 -73773
17497 -73773 113863 106432 85139 135743 166941 49412 -142246 -241262 51176 294426 167897
17486 167897 74275 117922 79077 113801 -47174 -291837 -272899 -182877 -40562 -127278 -172376
$$ packed form
17560G27728p5065P8402K47641J88743k23495k27711j35272J0309L69428L47983
17550A308691K78744r7858l96519k91495j68036q1053j89532N0232L9496j95640
17540B57030J68996M4605j80604j52730K0099m7997m7662j7510J09224q3326j26592
17529e6467k44947j30761J00302J32081P918j2J00573K37723m6230k03780k50415
17518c54015j38910q7081K03451L11919K09066J36825k8677j93216q7954J88896
17508A60304Q4031p7315o6019m5552l7863R2017r5331l4067j55380J39888l8486
17497g3773J87636p431k1293N0604L1198j17529j91658r9016K92438K43250j26529
17486A67897r3622M3647l8845L4724j60975k44663J8938R0022J42315q6716m5098
$$ plain form
17475 -172376 -19080 208335 139821 -110300 -271613 -147920 106745 112667 -99841 -209850
17465 -209850 -117005 -51586 -182824 -29703 -8917 -122545 -187417 -123596 -195314 -189843 46017
17454 46017 444458 438912 322077 228586 23888 44017 342801 575329 671073 682610 717900
17443 717900 1314026 1822783 2143006 1991386 1647065 1497822 1088709 689430 629780 465294
17433 465294 470016 298671 -91391 -145067 -27056 -270484 -77638 97774 120078 129870 341828
17422 341828 330551 110401 62759 -41116 -41393 -44208 203774 200568 -97176 -150933 158708
17411 158708 166385 129060 73339 118146 313901 148021 -141865 -459184 -252836 233682
17401 233682 244498 82012 17511 -137249 -191975 -265645 -315690 -226616 -284088 -166928 -22695
$$ packed form
17475a72376J53296K27415o8514k50121j61313J23693K54665N922k12508j10009
17465b09850R2845O5419j31238J53121K0786j13628o4872O3821p1718N471K35860
17454D6017L98441n546j16835r3491k04698K0129K98784K32528R5744J1537L5290
17443G17900N96126N08757L20223j51620l44321j49243m09113l99279n9650j64486
17433D65294M722j71345l90062n3676J18011k43428J92846J75412K2304R792K11958
17422C41828j1277k20150m7642j03875k77k815K47982l206k97744n3757L09641
17411A58708P677l7325n5721M4807J95755j65880k89886l17319K06348M86518
17401B33682J0816j62486o4501j54760n4726p3670n0045Q9074n7472J17160J44233
$$ plain form
17390 -22695 38529 -85843 -79391 81713 -8631 135645 242786 182901 -59105 -24084 166516
17379 166516 150378 -68127 71685 241496 257445 239714 36105 -175109 -182050 -270872 -326814
17368 -326814 -299019 -165841 -257872 -242823 -192119 -311426 -319580 -283174 -301189 -188070 -392408
17357 -392408 -536164 -456011 -515032 -349109 -25984 22868 10018 -33335 130346 122210 81636
17346 81636 164718 -16794 -190695 -221097 -100300 -137006 150322 429901 577312 336840
17336 336840 121941 68538 105503 -134451 -336364 -549172 -534773 -579180 -600818 -611653 -197703
17325 -197703 86880 195733 211942 -32954 64482 99805 113185 255840 161033 -123482
17315 -123482 30030 -122488 -333375 -213511 -24695 184261 329744 318969 228459 -23875
$$ packed form
17390b2695O1224j24372O452J61104r0344J44276J07141n9885k42006L5021J90600
17379A66516j6138k18505J39812J69811J5949j7731k03609k11214o941q8822n5942
17368c26814K7795J33178r2031J5049N0704j19307q154L6406j8015J13119k04338
17357c92408j43756Q0153n9021J65923L23125M8852j2850m3353J63681q136m0574
17346H1636Q3082j81512j73901l0402J20797l6706K87328K79579J47411k40472
17336C36840k14899n3403L6965k39954k01913k12808J4399m4407k1638j0835M13950
17325a97703K84583J08853J6209k44896R7436L5323J3380J42655r4807k84515
17315a23482J53512j52518k10887J19864J88816K08956J45483j0775r0510k52334
$$ plain form
17305 -23875 -91395 -28088 727 -164753 -229338 -95568 147713 311465 107843 141219 408836
17294 408836 336834 8955 58808 241051 263645 204942 206964 353148 290108 335309 506930
17283 506930 401440 216751 -34884 37987 113892 85095 212564 124762 110823 227327
17273 227327 308004 228086 307922 135326 88718 -111260 -147972 -38692 246559 143573
17263 143573 270030 224500 259735 424014 435569 345521 209905 146343 360315 563514
17253 563514 547579 412599 157071 78994 98561 78385 -12931 13077 44558 196820 241897
17242 241897 100523 257213 178695 11368 -97562 -148500 38722 67506 98816 -82442
17232 -82442 -283572 -343413 -185985 131809 237365 423347 552324 456126 216194 151535
$$ packed form
17305b3875o7520O3307K8815j65480o4585J33770K43281J63752k03622L3376K67617
17294D08836p2002l27879M9853J82243K2594n8703K022J46184o3040M5201J71621
17283E06930j05490j84689k51635P2871P5905k8797J27469q7802j3939J16504
17273B27327Q0677p9918P9836j72596m6608j99978l6712J09280K85251j02986
17263A43573J26457m5530L5235J64279J1555r0048j35616o3562K13972K03199
17253E63514j5935j34980k55528p8077J9567k0176r1316K6008L1481J52262M5077
17242B41897j41374J56690p8518j67327j08930n0938J87222K8784L1310j81258
17232h2442k01130n9841J57428L17794J05556J85982J28977r6198k39932o4659
$$ plain form
17222 151535 181555 285884 274080 115628 161177 327248 303833 441517 339392 383807
17212 383807 248227 408352 299191 97720 106571 67316 142012 367199 561374 744709
17202 744709 820449 625333 608812 839588 855625 764354 543667 372838 607876 415213
17192 415213 433663 593207 652663 482029 522861 561228 596193 536436 407488 454790 187365
17181 187365 249769 521496 643312 435523 141420 -35755 -107018 -168218 -206963 -149378
17171 -149378 -1188 270561 239330 170723 4968 -208674 -268345 -316863 -93764 42169
17161 42169 -458 -210225 -187483 -160266 -269654 -578706 -339751 72749 216380 264061
17151 264061 156176 -21276 78755 35671 181937 303739 216916 213953 201700 207291 270694
$$ packed form
17222A51535L0020J04329j1804j58452M5549J66071k3415J37684j02125M4415
17212C83807j35580J60125j09161k01471Q851l9255P4696K25187J94175J83335
17202G44709P5740j95116j6521K30776J6037r1271k20687j70829K35038j92663
17192D15213J8450J59544N9456j70634M0832L8367L4965n9757j28948M7302k67425
17181A87365O2404K71727J21816k07789k94103j77175p1263o1200l8745N7585
17171a49378J48190K71749l1231o8607j65755k13642n9671m8518K23099J35933
17161D2169m2627k09767K2742K7217j09388l09052K38955M12500J43631M7681
17151B64061j07885j77452J00031m3084J46266J21802q6823k963j2253N591O3403
$$ plain form
17140 270694 159229 168881 209279 187319 140840 155690 249329 240850 460205 531343 393600
17129 393600 241224 255303 263911 311798 345882 606134 651380 545714 562370 617755 523476
17118 523476 687128 373888 211015 307231 302655 329684 418035 510610 572819 626522 568311
17107 568311 480043 621291 602475 634148 432982 82332 -114815 81805 316731 400751
17097 400751 381708 306352 116600 83729 349191 242849 47770 120364 244047 212424
17087 212424 531886 676853 516193 535223 700988 784181 652339 748972 778800 662615
17077 662615 546847 434876 364231 249141 407290 687427 866609 807971 678512 590793
17067 590793 469737 600125 825276 1043419 1193100 1180272 1263324 1258740 1140503 845106
$$ packed form
17140B70694j11465R652M0398k1960m6479J4850R3639q479K19355P1138j37743
17129C93600j52376J4079Q608M7887L4084K60252M5246j05666J6656N5385r4279
17118E23476J63652l13240j62873R6216m576K7029Q8351R2575O2209N3703n8211
17107E68311q8268J41248j8816L1673k01166l50650j97147J96620K34926Q4020
17097D00751j9043p5356j89752l2871K65462j06342j95079P2594J23683l1623
17087B12424L19462J44967j60660J9030J65765Q3193j31842R6633K9828j16185
17077F62615j15768j11971p0645j15090J58149K80137J79182n8638j29459q7719
17067E90793j21056J30388K25151K18143J49681j2828Q3052m584j18237k95397
$$ plain form
17057 845106 680487 775080 1041566 1285968 1405123 1586605 1666237 1692135 1686778 1688207 1640205
17046 1640205 1673142 1867234 2254539 2493705 2589218 2666563 2902947 3122204 3106038 3420633
17036 3420633 3838821 4224452 4813129 5060916 5346905 5822382 6397909 6790457 7131291
17027 7131291 7547736 8390940 9410408 10587755 11823851 12968415 14262610 15749328
17019 15749328 17226132 19151122 21348012 23947869 27177591 30825036 35291966 40439324
17011 40439324 46847652 55925020 69697917 90879984 119207893 146167064 159582078
17004 159582078 157384903 146318528 133550260 121476141 111908238 107988959 112678591
16997 112678591 127617586 151606395 176212141 189890865 191556075 189700192 193419744
$$ packed form
17057H45106j64619R4593K66486K44402J19155J81482P9632K5898n357J429m8002
17046A640205L2937J94092L87305K39166R5513P7345K36384K19257j6166L14595
17036C420633M18188L85631N88677K47787K85989M75477N75527L92548L40834
17027G131291M16445Q43204J019468J177347J236096J144564J294195J486718
17019A5749328J476804J924990K196890K599857L229722L647445M466930N147358
17011D0439324O408328R077368J3772897K1182067K8327909K6959171J3415014
17004A59582078k197175j1066375j2768268j2074119r567903l919279M689632
16997A12678591J4938995K3988809K4605746J3678724J665210j855883L719552
$$ plain form
16990 193419744 201727362 204756250 195268146 176188292 154594566 134837635 117588702
16983 117588702 104728362 98564110 101400478 114592414 134310520 148330379 147367279
16976 147367279 133641933 114620579 95409637 76636173 59610459 46308620 36381782
16969 36381782 29160329 23724742 19406915 16184787 13532970 11331205 9912048 9044839
16961 9044839 8316118 7954482 7690820 7113622 6336901 5811579 5422267 4901537 4510240
16952 4510240 4182982 4012425 3882297 3694200 3610270 3715012 3496818 3094730 2943504 2650975
16942 2650975 2478450 2110243 1994489 1924528 1932744 1719846 1652604 1518365 1418965 1550691
16932 1550691 1631342 1424011 1304394 1213708 1387173 1503239 1194239 844247 418391 395281
$$ packed form
16990A93419744Q307618L028888r488104j9079854k1593726j9756931j7248933
16983A17588702j2860340o164252K836368J3191936J9718106J4019859r63100
16976A47367279j3725346j9021354j9210942j8773464j7025714j3301839r926838
16969C6381782p221453n435587m317827l222128k651817k201765j419157q67209
16961I044839p28721l61636k63662n77198p76721n25322l89312n20730l91297
16952D510240l27258j70557j30128j88097q3930J04742k18194m02088j51226k92529
16942B650975j72525l68207j15754o9961Q216k12898o7242j34239r9400J31726
16932A550691Q0651k07331j19617r0686J73465J16066l09000l49992m25856k3110
$$ plain form
16922 395281 650667 756789 695268 899010 1025200 641531 485601 463832 401464 340946
16912 340946 302779 391350 360020 276079 323842 523197 613657 547774 689031 440800 304640
16901 304640 417919 555794 605670 640592 518883 459044 505599 414636 383443 460344 536205
16890 536205 323498 483634 527928 708038 676509 755077 448885 454007 764855 670978 649672
16879 649672 765514 831331 795901 809133 707422 742577 852464 893599 710679 868737
16869 868737 871068 504024 430638 466898 635022 615151 636799 555033 537618 475818 499544
16858 499544 451251 483542 550185 669550 724288 568362 363023 539735 540932 634146 569333
16847 569333 439444 179164 -83550 -137125 54134 252382 11442 26100 108379 -39181
$$ packed form
16922C95281K55386J06122o1521K03742J26190l83669j55930k1769o2368o0518
16912C40946l8167Q8571l1330q3941M7763J99355R0460o5883J41257k48231j36160
16901C04640J13279J37875M9876L4922j21709n9839M6555r0963l1193P6901P5861
16890E36205k12707J60136M4294J80110l1529P8568l06192N122L10848r3877k1306
16879F49672J15842O5817l5430J3232j01711L5155J09887M1135j82920J58058
16869H68737K331l67044p3386L6260J68124j9871K1648q1766j7415o1800K3726
16858D99544m8293L2291O6643J19365N4738j55926k05339J76712J197R3214o4813
16847E69333j29889k60280k62714n3575J91259J98248k40940J4658Q2279j47560
$$ plain form
16837 -39181 84327 239514 480668 658397 487232 450385 548448 554202 364259 278821 480496
16826 480496 445605 441020 338212 421802 206657 82279 216334 110709 236410 314207
16816 314207 270811 276474 113855 46477 122672 329779 239320 99386 45985 275697 340267
16805 340267 484062 488661 183018 -261988 -494939 -697486 -895653 -856123 -760614 -617892
16795 -617892 -633206 -480896 -417670 -414160 -216830 -169890 -126073 -38568 -129234 -66523 -126512
16784 -126512 -195692 -291945 -372997 -387218 -162193 77551 1263 -162983 -267052 -294721 -352904
16773 -352904 -310048 -437645 -312470 -30607 237910 169182 45188 -30858 -113914 -97794
16763 -97794 -174581 -123768 -234354 -296657 -130528 75662 244725 192928 96219 22730 -63573
$$ packed form
16837c9181J23508J55187K41154J77729j71165l6847R8063N754j89943q5438K01675
16826D80496l4891m585j02808Q3590k15145j24378J34055j05625J25701P7797
16816C14207m3396N663j62619o7378P6195K07107r0459j39934n3401K29712O4570
16805C40267J43795M599l05643m45006k32951k02547j98167L9530R5509J42722
16795f17892j5314J52310O3226L510J97330M6940M3817Q7505r0666O2711n9989
16784a26512o9180r6253q1052j4221K25025K39744p6288j64246j04069k7669n8183
16773c52904M2856j27597J25175K81863K68517o8728j23994p6046q3056J6120
16763i7794p6787N0813j10586o2303J66129K06190J69063n1797r6709p3489q6303
$$ plain form
16752 -63573 -103343 -368062 -385967 -212259 -139720 -273451 -377032 -182576 -173453 -72488 163170
16741 163170 259888 267754 138901 -84455 -117038 34512 136675 145767 20055 -120691 -350009
16730 -350009 -538247 -511340 -327702 -309815 -143002 -76225 -63805 6673 -19665 -183764 -301240
16719 -301240 -58996 -18436 41762 -161810 -147514 -117369 -141573 -96875 -33510 -78673 122662
16708 122662 302122 247057 295107 62173 -64548 -279005 -394228 -326110 -193150 -3244
16698 -3244 266190 140439 129456 74402 46491 -216073 -409381 -291994 -134911 92078
16688 92078 299138 135869 60479 90875 -150415 -256405 33050 155680 296063 228206
16678 228206 -4664 93399 56204 23295 41069 -48193 86297 307284 229843 -149588 -325471
$$ packed form
16752f3573l9770k64719j7905J73708P2539j33731j03581J94456R123J00965K35658
16741A63170R6718P866j28853k23356l2583J51550J02163R092j25712j40746k29318
16730c50009j88238K6907J83638J7887J66813O6777J2420P0478k6338j64099j17476
16719c01240K42244M0560O0198k03572J4296L0145k4204M4698O3365m5163K01335
16708A22662J79460n5065M8050k32934j26721k14457j15223O8118J32960J89906
16698c244K69434j25751j0983n5054k7911k62564j93308J17387J57083K26989
16688I2078K07060j63269p5390L0396k41290j05990K89455J22630J40383o7857
16678B28206k32870R8063l7195l2909J7774q9262J34490K20987p7441l79431j75883
$$ plain form
16667 -325471 -339686 -474431 -392877 -163018 35273 -95932 -352272 -574144 -382315 -46086
16657 -46086 43410 135708 444431 571454 473209 197213 -45569 -67072 36614 116981 160005
16646 160005 128561 66349 63934 20941 -28823 9481 179163 114693 212650 152901 88377
16635 88377 47051 -128684 -245747 -44282 -43963 -58022 -132097 -219597 -241924 -172626 -197788
16624 -197788 -208806 -42696 146737 266082 147628 -138214 -165971 179373 269515 31604
16614 31604 -243294 -460013 -398355 182872 468153 171726 41671 -158971 -163804 15248
16604 15248 214081 171257 179028 450410 294516 262601 44723 -169196 -231020 -146080 -52820
16593 -52820 -424 -261218 -395700 -37001 28142 51402 16766 111733 89692 59167 85337
$$ packed form
16667c25471j4215j34745Q1554K29859J98291j31205k56340k21872J91829L36229
16657d6086Q9496R2298L08723J27023r8245k75996k42782k1503J03686Q0367M3024
16646A60005l1444o2212k415m2993m9764L8304J69682o4470R7957n9749o4524
16635H8377m1326j75735j17063K01465L19j4059p4075q7500k2327O9298k5162
16624a97788j1018J66110J89433J19345j18454k85842k7757L45344R0142k37911
16614C1604k74898k16719O1658N81227K85281k96427j30055k00642m833J79052
16604A5248J98833m2824P771K71382j55894l1915k17878k13919o1824Q4940R3260
16593e2820N2396k60794j34482L58699O5143K3260l4636R4967k2041l0525K6170
$$ plain form
16582 85337 181869 108864 39504 -2658 13936 -137237 -120119 -60372 -55012 69952 111802
16571 111802 222246 43489 -176930 -213165 30835 163015 87831 100624 167918 24181
16561 24181 -60249 17023 400896 570146 479348 380804 58626 -125363 -224802 -94710 145088
16550 145088 342548 302578 260876 130867 42786 -10673 -147836 -33619 68405 -10809
16540 -10809 -101961 -18078 76598 16462 -76900 -289700 -329556 -133939 -54328 -192578 -225666
16529 -225666 -168246 -265066 -20490 -90298 -35461 64253 9212 -29872 139825 155886 -3196
16518 -3196 -55972 -154195 -201941 -140866 67152 91982 -54393 145101 102224 12686 -139854
16507 -139854 -134847 28342 37034 -157249 -158249 23174 122988 102016 47120 -88257 28589
$$ packed form
16582H5337R6532p3005o9360m2162J6594j51173J7118N9747N360J24964M1850
16571A11802J10444j78757k20419l6235K44000J32180p5184J2793O7294j43737
16561B4181q4430P7272L83873J69250r0798r8544l22178j83989r9439J30092K39798
16550A45088J97460l9970m1702j30009q8081n3459j37163J14217J02024p9214
16540a0809r1152Q3883R4676o0136r3362k12800l9856J95617P9611j38250l3088
16529b25666N7420r6820K44576o9808N4837R9714n5041l9084J69697J6061j59082
16518c196n2776r8223m7746O1075K08018K4830j46375J99494m2877q9538j52540
16507a39854N007J63189Q692j94283j000J81423R9814k0972n4896j35377J16846
$$ plain form
16496 28589 184410 448176 385202 366804 398039 300016 534265 677537 627315 463273 141119
16485 141119 80033 85215 200879 242744 54398 -253314 -137435 -63139 -15878 -66688 -93685
16474 -93685 -40201 -7409 -117360 -329578 -184741 92582 114596 89230 -52711 -149235 -50366
16463 -50366 155445 -237381 -542789 -577633 -429028 -162376 158163 248411 227855 85154
16453 85154 -194830 -119579 139600 208449 214354 45150 192137 320939 233759 201507 35365
16442 35365 14185 83101 191357 203998 287843 541711 606716 600188 552359 675712 768532
16431 768532 818043 541532 525025 595295 640403 989315 1066574 899032 802178 883024 1003469
16420 1003469 1126888 837524 666025 646564 512189 433103 275132 329260 275442 343457
$$ packed form
16496B8589J55821K63766o2974j8398L1235r8023K34249J43272n0222j64042l22154
16485A41119o1086N182J15664M1865j88346l07712J15879P4296M7261n0810k6997
16474i3685N3484L2792j09951k12218J44837K77323K2014k5366j41941r6524R8869
16463e0366K05811l92826l05408l4844J48605K66652L20539R0248k0556j42701
16453H5154k79984P5251K59179O8849N905j69204J46987J28802q7180l2252j66142
16442C5365k1180O8916J08256J2641Q3845K53868O5005o528m7829J23353R2820
16431G68532M9511k76511j6507P0270M5108L48912P7259j67542r6854Q0846J20445
16420A003469J23419k89364j71499j9461j34375p9086j57971N4128n3818O8015
$$ plain form
16410 343457 471916 478224 494059 622118 720768 847516 948580 670270 350260 271675
16400 271675 141587 131918 82752 136827 69516 12514 91226 56656 46364 193825 369234
16389 369234 283050 197707 46852 -42788 -116885 -64677 -38607 6695 -76723 75804 -25947
16378 -25947 -110432 -359317 -385100 -166853 -162439 -382058 -485712 -362736 166031 174293 58866
16367 58866 -48498 32484 24313 -109372 117302 273376 114512 -148922 -234966 -2466
16357 -2466 257055 396611 127944 -172253 -67855 98935 6123 -184569 -475055 -413639
16347 -413639 8071 241283 376842 350759 282974 114997 -139993 -150123 -69294 -53618
16337 -53618 -11065 243095 191901 119234 7659 -23099 -32870 -99347 102362 257684 54291
$$ packed form
16410C43457J28459O308J5835J28059R8650J26748J01064k78310l20010p8585
16400B71675j30088r669m9166N4075o7311n7002P8712l4570j0292J47461J75409
16389C69234q6184q5343j50855q9640p4097N2208K6070M5302q3418J52527j01751
16378b5947q4485k48885k5783K18247M414k19619j03654J22976N28767Q262j15427
16367E8866j07364Q0982q171j33685K26674J56074j58864k63434q6044K32500
16357b466K59521J39556k68667l00197J04398J66790r2812j90692k90486O1416
16347d13639M21710K33212J35559k6083o7785j67977k54990j0130Q0829J5676
16337e3618M2553K54160n1194p2667j11575l0758r771o6477K01709J55322k03393
$$ plain form
16326 54291 -48732 78926 55807 285270 225028 81142 -5379 -255672 -399576 -270313
16316 -270313 -210152 -76927 13708 -151580 -386110 -427420 -221928 -221744 -174599 -241626 -290484
16305 -290484 -275276 -492581 -390339 -261710 -237825 -211562 -91686 12097 -208759 -127811
16295 -127811 47823 -49130 -164076 -135166 -17495 65525 140416 198067 231116 143275 80473
16284 80473 -109379 -136924 41064 -84046 -321020 -259281 12903 78067 -15041 -262286
16274 -262286 -344290 -116383 -69181 -215353 -268182 -73983 -68669 94119 176615 89559 5553
16263 5553 27982 -107818 -290756 -297851 -263763 -199787 78614 -89156 -397389 -418550 -386153
16252 -386153 -210715 -221098 -181745 -232481 -168027 45984 91234 -18860 -118369 -170764 -27903
$$ packed form
16326E4291j03023J27658k3119K29463o0242j43886q6521k50293j43904J29263
16316b70313O0161J33225R0635j65288k34530m1310K05492J84M7145o7027m8858
16305b90484J5208k17305J02242J28629K3885K6263J19876J03783k20856Q0948
16295a27811J75634r6953j14946K8910J17671Q3020P4891N7651L3049q7841o2802
16284H0473j89852k7545J77988j25110k36974O1739K72184O5164r3108k47245
16274b62286q2004K27907M7202j46172n2829J94199N314J62788Q2496q7056q4006
16263E553K2429j35800j82938p095L4088O3976K78401j67770l08233k1161L2397
16252c86153J75438j0383L9353n0736O4454K14011M5250j10094r9509n2395J42861
$$ plain form
16241 -27903 352973 425860 110229 27663 162250 -9849 -305877 -86062 -24502 -110693
16231 -110693 -166853 -122204 10304 14266 -58890 -124098 -2633 -119648 -102670 30479 -55959
16220 -55959 -162632 -15258 -83590 -275828 -329239 -448725 -569539 -297463 8879 97458
16210 97458 16871 185198 431098 420536 251076 54967 1970 -192218 -440476 -264698
16200 -264698 -104976 -193985 -300163 -259285 -218602 -261685 -316606 -479543 -527811 -376215 -42281
16189 -42281 143287 149618 22725 -177085 -321959 -473875 -508277 -281008 -224431 -357778
16179 -357778 -251426 -361809 -260665 -191491 -78857 149655 135384 279702 232198 409028
16169 409028 273296 -270046 -420313 -47053 129763 128198 -105669 64738 -1992 -115604
$$ packed form
16241b7903L80876P2887l15631q2566J34587j72099k96028K19815O1560q6191
16231a10693n6160M4649J32508L962p3156o5208J21465j17015J6978J33149q6438
16220e5959j06673J47374o8332j92238n3411j19486j20814K72076L06342Q8579
16210I7458q0587J68327K45900j0562j69460j96109n2997j94188k48258J75778
16200b64698J59722q9009j06178M0878M0683m3083n4921j62937m8268J51596L33934
16189d2281J85568O331j26893j99810j44874j51916l4402K27269N6577j33347
16179c57778J06352j10383J01144O9174J12634K28512j4271J44318m7504J76830
16169D09028j35732n43342j50267L73260J76816j565k33867J70407o6730j13612
$$ plain form
16159 -115604 -47014 -60659 -97597 -21152 94787 46711 88282 36012 -138176 -286493 -301945
16148 -301945 -95536 167348 95244 108077 3731 -96050 -202752 -174075 56626 128343
16138 128343 134692 200582 11882 78400 -1783 -34175 -2277 148166 88382 236576 632531
16127 632531 674612 407693 279733 264444 284015 230223 153529 242270 422801 147079 30022
16116 30022 265298 479654 206907 -125417 -35594 52692 95698 47606 18300 45113 160920
16105 160920 69732 50055 -216584 -434936 -363684 -269676 -198625 177773 239571 38122 -53942
16094 -53942 -35467 -169266 -353757 -325855 15510 205250 185374 54342 -32056 -173444
16084 -173444 -419004 -247781 -257918 -176480 -66676 -62815 -154332 -216102 -390580 -259595 45054
$$ packed form
16159a15604O8590j3645l6938P6445J15939m8076M1571n2270j74188j48317j5452
16148c01945K06409K62884p2104J2833j04346r9781j06702K8677K30701P1717
16138A28343O349O5890j88700O6518q0183l2392L1898J50443n9784J48194L95955
16127F32531M2081k66919j27960j5289J9571n3792p6694Q8741J80531k75722j17057
16116C0022K35276K14356k72747l32324Q9823Q8286M3006m8092k9306K6813J15807
16105A60920r1188j9677k66639k18352P1252R4008P1051L76398O1798k01449r2064
16094e3942J8475j33799j84491K7902L41365J89740j9876j31032q6398j41388
16084a73444k45560J71223j0137Q1438J09804L861r1517o1770j74478J30985L04649
$$ plain form
16073 45054 45515 155246 113996 -66500 -200352 -264344 35469 -103778 -232058 -145319 -54517
16062 -54517 -32522 119282 217382 229866 109176 4996 69023 126355 -76910 -131481 -46429
16051 -46429 -102615 93779 245924 212946 183031 90663 -55891 -161506 -146477 -186615 -239362
16040 -239362 -149730 -11231 -105314 -207054 -216703 -311832 -324569 28474 212447 77474 14826
16029 14826 -101610 -17597 -72607 -169237 -72099 -91912 -177095 -131325 -78101 -108851 -114446 -21061
16017 -21061 43191 -135188 -356441 -208514 75362 16616 -177442 -337094 -362255 -76656
16007 -76656 13547 -100898 -190805 -175583 -164752 -78827 61713 121011 166926 209014 161764
15996 161764 139570 187158 100499 -89956 -107097 -202171 -234700 -25542 -143695 -372616 -509380
$$ packed form
16073D5054M61J09731m1250j80496j33852o3992K99813j39247j28280Q6739R0802
16062e4517K1995J51804R8100J2484j20690j04180O4027N7332k03265n4571Q5052
16051d6429n6186J96394J52145l2978k9915r2368j46554j05615J5029m0138n2747
16040b39362Q9632J38499r4083j01740r649r5129j2737L53043J83973j34973o2648
16029A4826j16436Q4013n5010r6630R7138j9813q5183M5770N3224l0750n595R3385
16017b1061O4252j78379k21253J47927K83876n8746j94058j59652k5161K85599
16007g6656R0203j14445q9907J5222J0831Q5925J40540N9298M5915M2088m7250
15996A61764k2194M7588q6659j90455j7141r5074l2529K09158j18153k28921j36764
$$ plain form
15985 -509380 -256258 21006 7590 -5391 -31594 -264555 -377463 -328832 -245404 13768
15975 13768 47584 147783 -6197 -156039 -217091 -226458 -57755 -156027 -128410 -78395 -100672
15964 -100672 -221539 -143324 -126136 -978 104646 262989 125965 61855 -23764 173747
15954 173747 295113 338084 279159 343080 336493 396381 413010 223762 119320 -221742 -260345
15943 -260345 -83752 -265209 -304775 -43561 33092 130456 105598 23037 -94136 70275
15933 70275 61593 255060 366674 106816 -81976 -47401 173059 214666 130834 -93843 -293339
15922 -293339 -404394 -269306 -288255 -301688 -221228 -193481 -368624 -68437 -10993 -42238 41782
15911 41782 242890 64356 -22416 50033 114893 126239 -92273 -124991 -74328 -143985 -74809
$$ packed form
15985e09380K53122K77264j3416j2981k6203k32961j12908M8631Q3428K59172
15975A3768L3816J00199j53980j49842o1052r367J68703r8272K7617N0015k2277
15964a00672j20867P8215J7188J25158J05624J58343j37024o4110q5619J97511
15954A73747J21366M2971n8925O3921o587N9888J6629j89248j04442l41062l8603
15943b60345J76593j81457l9566K61214P6653R7364k4858q2561j17173J64411
15933G0275q682J93467J11614k59858j88792L4575K20460M1607q3832k24677j99496
15922b93339j11055J35088j8949j3433Q0460K7747j75143L00187N7444l1245Q4020
15911D1782K01108j78534q6772P2449O4860J1346k18512l2718N0663o9657O9176
$$ plain form
15900 -74809 -310 -11018 -125583 -232298 -161669 -471444 -541256 -195069 158678 295188
15890 295188 368444 325415 150716 -39458 -151961 53717 28893 109070 111720 306178 234490
15879 234490 -44275 -183962 -198102 35487 210213 147396 86829 14485 -129200 -81403
15869 -81403 9187 103106 216684 109297 230593 295142 152048 33934 -110337 -54624
15859 -54624 -85627 65942 36758 28113 11779 -74116 -95052 205196 372605 223714 15659
15848 15659 57644 -59758 -168356 -103788 -46047 -56527 -73553 -291083 -243193 -142781 105981
15837 105981 136797 171858 380149 328588 351850 149795 86182 -32644 79120 -200423
15827 -200423 -396511 -274714 -210813 -359898 -515118 -380414 -140727 -74816 -223151 -29995
$$ packed form
15900g4809P4499j0708j14565j06715P0629l09775o9812L46187L53747J36510
15890B95188P3256m3029j74699j90174j12503K05678k4824Q0177K650J94458p1688
15879B34490k78765j39687j4140K33589J74726o2817o0567p2344j43685M7797
15869h1403R0590R3919J13578j07387J21296O4549j43094j18114j44271N5713
15859e4624l1003J51569k9184q645j6334q5895k0936L00248J67409j48891k08055
15848A5659M1985j17402j08598O4568N7741j0480j7026k17530M7890J00412K48762
15837A05981L0816L5061K08291n1561K3262k02055o3613j18826J11764k79543
15827b00423j96088J21797O3901j49085j55220J34704K39687O5911j48335J93156
$$ plain form
15817 -29995 243313 221967 -170523 -422104 -319002 -184407 -197183 -372174 -249039 22182
15807 22182 47124 -53639 -226452 -167421 -53833 110771 252368 314838 62095 149930
15797 149930 161211 48978 -79083 -230562 -333332 -411362 -326009 -128876 -173146 -166016 -335014
15786 -335014 -280989 -131271 -71641 -274573 -254752 -325532 -318003 188094 522957 463269 76972
15775 76972 -76703 19701 -30055 14015 -135636 -236019 10675 158602 104893 21719 -65937
15764 -65937 18402 42530 29643 -4945 84562 156088 207322 346741 299054 201493 216779
15753 216779 163567 62603 31390 32539 13519 -171577 -107038 -46752 -68275 -132159 -132824 79261
15741 79261 -24299 -207072 -164930 -103591 -53200 -5711 -65114 -131131 -341206 -172338 11590
$$ packed form
15817b9995K73308k1346l92490k51581J03102J34595j2776j74991J23135K71221
15807B2182K4942j00763j72813N9031J13588J64604J41597O2470k52743Q7835
15797A49930J1281j12233j28061j51479j02770p8030Q5353J97133m4270P130j68998
15786c35014N4025J49718N9630k02932J9821p0780P529N06097L34863n9688l86297
15775G6972j53675R6404m9756M4070j49651j00383K46694J47927n3709q3174q7656
15764f5937Q4339K4128j2887l4588Q9507P1526N1234J39419m7687r7561J5286
15753B16779n3212j00964l1213J149j9020j85096O4539O0286k1523o3884o65K12085
15741G9261j03560j82773M2142O1339N0391M7489n9403o6017k10075J68868J83928
$$ plain form
15730 11590 -27420 -43305 60144 -3784 -88614 -41895 -58333 -200995 -132258 57860 79032
15719 79032 -310049 -337696 27038 -60417 -303048 -377244 -317891 -414328 -398422 -301074 -386892
15708 -386892 -402139 -76559 -112552 -186048 -251795 -304398 -189222 -183163 -324948 -38240 54149
15697 54149 -60142 -161960 -263688 -202970 -222624 -396423 -271208 -116020 -32107 29912
15687 29912 -128014 -44021 47403 51424 281825 265890 47374 84672 179639 60957 -138347
15676 -138347 -27454 192363 151277 111749 266384 88376 35322 -97871 -158626 41170
15666 41170 127827 2531 -250525 -117098 -83053 -395163 -509395 -259202 -209692 -118727
15656 -118727 -81101 145079 146846 145169 242621 200812 85518 81017 128391 -160075 -286238
$$ packed form
15730A1590l9010j5885J03449o3928q4830M6719j6438j42662O8737J90118K1172
15719G9032l89081k7647L64734q7455k42631p4196N9353r6437J5906R7348q5818
15708c86892j5247L25580l5993p3496o5747n2603J15176O059j41785K86708R2389
15697E4149j14291j01818j01728O0718j9654j73799J25215J55188Q3913O2019
15687B9912j57926Q3993R1424M021K30401j5935k18516L7298R4967j18682j99304
15676a38347J10893K19817m1086l9528J54635j78008n3054j33193o0755J99796
15666D1170Q6657j25296k53056J33427L4045l12110j14232K50193M9510R0965
15656a18727L7626K26180J767j677R7452m1809j15294m501M7374k88466j26163
$$ plain form
15645 -286238 -179617 8493 107109 128280 92921 -141607 -295145 -330650 -224695 -184009
15635 -184009 -162693 -107013 -13195 158577 219073 79398 -156182 -82113 -73441 -27348 -83537
15624 -83537 -89110 -183131 -217841 -27519 -8044 -533290 -652076 -567465 -534810 -303440 -79597
15613 -79597 -99231 -67338 -207979 -346265 -520858 -635972 -544342 -485737 -395273 -285231 -137310
15602 -137310 -67659 -77261 -127964 -137016 -42296 -274554 -544340 -448121 -365536 -335345 -360436
15591 -360436 -342962 -279763 -165633 -155265 -248827 -288915 -185491 -315659 -344927 -283713 -132773
15580 -132773 52594 -96218 -30418 238320 137223 -13226 -27834 -207410 83025 122613
15570 122613 -179125 -200599 -198875 -326081 -346909 -326600 -205484 -184262 -411615 -417159 -5422
$$ packed form
15645b86238J06621J88110R8616K1171l5359k34528j53538l5505J05955M0686
15635a84009K1316N5680R3818J71772O0496j39675k35580P4069Q672M6093n6189
15624h3537n573r4021l4710J90322J9475n25246j18786Q4611L2655K31370K23843
15613g9597j9634L1893j40641j38286j74593j15114R1630N8605R0464J10042J47921
15602a37310O9651r602n0703r052R4720k32258k69786R6219Q2585L0191k5091
15591c60436J7474O3199J14130J0368r3562m0088J03424j30168k9268O1214J50940
15580a32773J85367j48812O5800K68738j01097j50449j4608j79576K90435L9588
15570A22613l01738k1474J724j27206k0828K0309J21116K1222k27353n544M11737
$$ plain form
15559 -5422 35472 232253 320786 -67765 -230281 -381325 -207918 -116631 -119119 44319 43882
15548 43882 -124940 -175564 -176352 -207308 -322377 -15224 76916 -35790 48122 37871 15697
15537 15697 -19584 -149659 -42710 4114 109701 119046 228190 64146 -95415 -221836
15527 -221836 -115819 128576 -131297 -294924 -105808 -56840 -235168 -203185 -81072 -4065
15517 -4065 -93545 -141005 -270313 -351244 -230262 -143645 73795 121150 89702 13378 -142421
15506 -142421 -119520 -166399 -169512 -97241 -9632 -77 -120667 -257729 -320628 -120785 176639
15495 176639 125042 11135 -250344 -318600 -140343 154038 55597 -76356 -361454 -443850
15485 -443850 -406947 -191530 136649 105933 140717 105070 44927 90021 284055 309518 117945
$$ packed form
15559e422M0894J96781Q8533l88551j62516j51044J73407R1287k488J63438m37
15548D3882j68822n0624p88l0956j15069L07153R2140j12706Q3912j0251k2174
15537A5697l5281j30075J06949M6824J05587R345J09144j64044j59561j26421
15527b21836J06017K44395k59873j63627J89116M8968j78328L1983J22113P7007
15517d065q9480m7460j29308q0931J20982Q6617K17440M7355l1448p6324j55799
15506a42421K2901m6879l113P2271Q7609R555j20590j37062o2899J99843K97424
15495A76639n1597j13907k61479o8256J78257K94381r8441j31953k85098q2396
15485d43850L6903K15417L28179l0716L4784l5647o0143M5094J94034K5463j91573
$$ plain form
15474 117945 -104797 -76520 141374 168531 11329 -174848 121574 154885 218287 271639
15464 271639 170377 134402 96846 60534 -115514 -175811 -51371 -81551 -146688 -147609 -121373
15453 -121373 -67806 22033 -114779 -217279 -151501 63994 19980 38767 132762 50673 -75122
15442 -75122 130623 103012 -95521 -304167 -28003 229189 111828 81762 279977 574979
15432 574979 623193 374628 298465 178511 -1241 54517 -25353 -137398 24151 -79951
15422 -79951 -410762 -531975 -438588 -404706 -499239 -660770 -581692 -735746 -790141 -504494 -184225
15411 -184225 -226203 -149841 -189510 -381588 -403583 -475473 -358375 -114420 -65206 92079 -15437
15400 -15437 -158657 -132611 -6340 -24982 128275 194347 35128 -27344 102949 136038 77209
$$ packed form
15474A17945k22742K8277K17894K7157j57202j86177K96422L3311O3402N3352
15464B71639j01262l5975l7556l6312j76048o0297J24440l0180o5137r21K6236
15453a21373N3567Q9839j36812j02500O5778K15495m4014J8787R3995q2089j25795
15442g5122K05745k7611j98533k08646K76164K57192j17361l0066J98215K95002
15432E74979M8214k48565p6163j19954j79752N5758p9870j12045J61549j04102
15422g9951l30811j21213R3387L3882r4533j61531P9078j54054n4395K85647L20269
15411a84225m1978P6362l9669j92078k1995p1890J17098K43955M9214J57285j07516
15400a5437j43220K6046J26271j8642J53257O6072j59219o2472J30293L3089n8829
$$ plain form
15389 77209 30181 -105291 23993 80825 -82222 -40303 239689 90504 -21333 115131
15379 115131 -4944 -202733 -340236 -378428 -284298 -235775 -280367 -351542 -404610 -392064 -452097
15368 -452097 -420304 -109049 18659 274228 196823 28127 -24354 -69352 -45580 -59574 152629
15357 152629 -88425 -335880 -362991 -278846 -10352 114858 34064 -151682 16212 65197
15347 65197 -101120 -65112 120251 143950 -72197 -82555 7772 66397 -71648 39818 303636
15336 303636 298352 300028 213408 38278 -118131 -70468 207439 136281 -51906 -169214 -83890
15325 -83890 70818 92085 51607 -76513 -136454 -213873 -213861 -263040 -322758 -270506 -191042 -243641
15313 -243641 -448106 -339620 -14088 33308 -104042 -401032 -259051 -64905 277713 465138
$$ packed form
15389G7209m7028j35472J29284N6832j63047M1919K79992j49185j11837J36464
15379A15131j20075j97789j37503l8192R4130M8523m4592p1175n3068J2546o0033
15368d52097L1793L11255J27708K55569p7405j68696n2481m4998K3772j3994K12203
15357A52629k41054k47455k7111Q4145K68494J25210q0794j85746J67894M8985
15347F5197j66317L6008J85363K3699k16147j0358R0327N8625j38045J11466K63818
15336C03636n284J676q6620j75130j56409M7663K77907p1158j88187j17308Q5324
15325h3890J54708K1267m0478j28120n9941p7419J2m9179n9718N2252P9464n2599
15313b43641k04465J08486L25532M7396j37350k96990J41981J94146L42618J87425
$$ plain form
15303 465138 509484 262263 207416 -89861 -164165 8428 171507 158436 -62028 -164393
15293 -164393 -160903 -145353 -199278 -71377 -159749 -305952 -66611 78168 236988 195470 21010
15282 21010 88310 187356 62690 -100685 -7864 23692 64105 131973 138268 78844 55559
15271 55559 241288 160984 247021 346910 154755 112636 59595 51198 122026 98792 45751
15260 45751 -64344 -100115 -75909 39501 31962 -717 50932 155807 97143 135754 177581
15249 177581 189743 55353 79300 199488 289308 309440 45714 -147071 -267442 -143865
15239 -143865 -129636 -88115 -104552 -47345 164493 136049 -2189 -36323 -152106 -216707 -291937
15228 -291937 -102795 -51089 -37667 24457 17465 50779 48781 44716 27410 167089 -112737
$$ packed form
15303D65138M4346k47221n4847k97277p4304J72593J63079j3071k20464j02365
15293a64393L490J5550n3925J27901q8372j46203K39341J44779J58820m1518j74460
15282B1010O7300R9046j24666j63375R2821L1556M0413O7868O295n9424k3285
15271E5559J85729q0304Q6037R9889j92155m2119n3041q397P0828k3234n3041
15260D5751j10095l5771K4206J15410p539l2679N1649J04875n8664L8611M1827
15249A77581J2162j34390K3947J20188Q9820K0132k63726j92785j20371J23577
15239a43865J4229M1521j6437N7207K11838k8444j38238l4134j15783o4601p5230
15228b91937J89142N1706J3422O2124o992L3314j998m065j7306J39679k79826
$$ plain form
15217 -112737 -316013 -374438 -266451 -111437 -85635 125433 120345 -123791 -72100 -84368 -209986
15206 -209986 -452009 -584753 -396860 -357588 -309101 -242287 -155968 -71065 -70635 -71521 11620 30537
15194 30537 209977 114692 22014 40093 133733 165527 24315 36865 24156 110775 245438
15183 245438 278455 451828 457221 559157 334794 143909 -23855 -53865 -168637 -141160
15173 -141160 -244496 -199100 842 -149381 -56201 147136 129773 120301 25882 -78960 -147768
15162 -147768 -287811 -236441 -54589 -101417 -71886 -123289 -83854 92355 -450 794 155719
15151 155719 101432 158126 99390 -38218 -194298 -212606 -152180 -147432 -342470 -484632 -632759
15140 -632759 -434331 -231104 -270811 -326722 -80911 59957 30676 58848 175988 80729
$$ packed form
15217a12737k03276n8425J07987J55014K5802K11068n088k44136N1691j2268j25618
15206b09986k42023j32744J87893L9272M8487O6814Q6319Q4903M30q86Q3141J8917
15194C0537J79440r5285r2678J8079R3640L1794j41212J2550j2709Q6619J34663
15183B45438L3017J73373N393J01936k24363j90885j67764l0010j14772K7477
15173a41160j03336M5396J99942j50223R3180K03337j7363r472r4419j04842o8808
15162a47768j40043N1370J81852m6828K9531n1403L9435J76209r2805J244J54925
15151A55719n4287N6694n8736j37608j56080j8308O0426M748j95038j42162j48127
15140f32759J98428K03227l9707n5911K45811J40868k9281K8172J17140r5259
$$ plain form
15130 80729 -483 960 115805 23419 -126791 -66598 243234 149077 136222 47408 -20406
15119 -20406 24381 -11219 120709 104144 225135 146634 -117788 -286966 -91315 65203
15109 65203 213975 275456 225387 130829 65072 -223548 12211 -63646 -63871 174622 -76993
15098 -76993 -331252 -251830 63661 206660 370168 236172 355703 355145 289289 312077 297489
15087 297489 204653 -266713 -181024 10041 83695 42167 -4066 -42816 -363906 -561212 -349944
15076 -349944 -220375 -335556 -302794 -258498 -330471 -244573 -287780 -115572 -28973 -118633 -368214
15065 -368214 -467362 -298393 -787 -10838 37500 91290 305348 287046 301243 244375 55607
15054 55607 165165 140176 -59467 -167887 -126530 -146665 117936 299737 175594 127338
$$ packed form
15130H0729q1212J443J14845r2386j50210O0193L09832r4157j2855q8814o7814
15119b0406M4787l5600J31928j6565J20991p8501k64422j69178J95651J56518
15109F5203J48772O1481n0069r4558o5757k88620K35759p5857k25K38493k51615
15098g6993k54259P9422L15491J42999J63508j33996J19531n58o5856K2788j4588
15087B97489r2836m71366Q5689J91065P3654m1528m6233l8750l21090j97306K11268
15076c49944J29569j15181L2762M4296p1973Q5898m3207J72208Q6599q9660k49581
15065c68214r9148J68969K97606j0051M8338N3790K14058j8302J4197n6868j88768
15054E5607J09558k4989j99643j08420M1357k0135K64601J81801j24143m8256
$$ plain form
15044 127338 118746 203359 6225 -76492 15382 69876 155447 294221 360882 329561 125260
15033 125260 31200 42434 -192805 -270245 -134435 -187306 130262 155783 305462 286332 125539
15022 125539 91643 128346 13151 -147224 -81948 13030 150412 -68885 -134634 -180143 -495644
15011 -495644 -392304 -180248 -172617 -119650 2356 -54092 -238182 -216028 -86305 114241
15001 114241 109819 28749 -36279 190621 398444 278745 119030 -233646 -249115 -85634
14991 -85634 -110820 -195399 -305964 -379920 -277182 -70835 78699 44954 64483 177844 117009
14980 117009 24367 35177 -38793 -89547 19658 94098 -28069 -216354 -358607 -144792
14970 -144792 -42387 -200555 -174157 -68654 -8781 141926 63543 83630 210726 253796
$$ packed form
15044A27338q592Q4613j97134q2717R1874N4494Q5571J38774O6661l1321k04301
15033A25260r4060J1234k35239p7440J35810n2871L17568K5521J49679j9130j60793
15022A25539l3896L6703j15195j60375O5276R4978J37382k19297o5749m5509l15501
15011d95644J03340K12056P631N2967J22006n6448j84090K2154J29723K00546
15001A14241m422q1070o5028K26900K07823j19699j59715l52676j5469J63481
14991h5634k5186q4579j10565p3956J02738K06347J49534l3745J9529J13361o0835
14980A17009r2642J0810p3970n0754J09205P4440j22167j88285j42253K13815
14970a44792J02405j58168K6398J05503N9873J50707p8383K0087J27096M3070
$$ plain form
14960 253796 326562 300015 81934 -117239 -53777 85084 257361 154394 200288 185618
14950 185618 135183 35832 16193 66741 262239 279868 4945 -44373 -93578 -252031 -121338
14939 -121338 -186586 -90524 -203807 -371157 -342169 -235466 -275087 -396157 -246655 -69811
14929 -69811 137712 209520 218 -118890 -118598 -144095 -271265 -285693 -350915 -368649 -336797
14918 -336797 -384374 -522786 -459569 -486326 -444204 -232660 -243010 -450423 -475955 -423559 -366279
14907 -366279 -459610 -665864 -526988 -305140 154919 176008 -13754 -139866 -81834 -150760
14897 -150760 -209969 -292135 -166183 -95306 34291 166428 132547 145165 -156528 -325315
14887 -325315 -524777 -460306 -414621 -403637 -166701 -106173 -255621 -250271 -115901 145958 233512
$$ packed form
14960B53796P2766k6547k18081j99173O3462J38861J72277j02967M5894j4670
14950A85618n0435r9351j9639N0548J95498J7629k74923m9318m9205j58453J30693
14939a21338o5248R6062j13283j67350K8988J06703l9621j21070J49502J76844
14929f9811K07523P1808k09302j19108K92k5497j27170j4428o5222j7734L1852
14918c36797m7577j38412O3217k6757M2122K11544j0350k07413k5532N2396N7280
14907c66279r3331k06254J38876K21848M60059K1089j89762j26112N8032o8926
14897a50760n9209q2166J25952P0877J29597J32137l3881J2618l01693j68787
14887c25315j99462O4471M5685J0984K36936O0528j49448N350J34370K61859Q7554
$$ plain form
14876 233512 118270 143345 447158 460939 352741 -21679 -78510 -54044 -88877 -80451 80116
14865 80116 130488 120682 10062 80131 -47292 -60985 -137197 -231805 -249068 -173878 -77434
14854 -77434 -313276 -571574 -236062 67751 -98756 -154063 -41353 3798 16420 -29716
14844 -29716 -167127 -282709 -109395 -115959 -242697 -91827 -125573 -95375 19937 -85837
14834 -85837 -79414 -143229 -4539 229926 116875 3752 36224 15016 72703 104953 81063
14823 81063 -21450 -77354 -62455 113975 288907 373035 311259 255721 281600 -36402 -193954
14812 -193954 -117064 -114442 -278145 -254500 43913 434559 359604 99513 -28755 -458 -28519
14801 -28519 18920 101511 -105484 -86088 -27244 66155 43940 -17255 -84133 -138440 -99650
$$ packed form
14876B33512j15242K5075L03813J3781j08198l74420n6831K4466l4833Q426J60567
14865H0116N0372r806j10620P0069j27423j3693p6212r4608j7263P5190R6444
14854g7434k35842k58298L35512L03813j66507n5307J12710M5151J2622m6136
14844b9716j37411j15582J73314o564j26738J50870l3746L0198J15312j05774
14834h5837O423o3815J38690K34465j13051j13123L2472k1208N7687L2250k3890
14823H1063j02513n5904J4899J76430J74932Q4128o1776n5538K5879l18002j57552
14812a93954P6890K622j63703K3645K98413L90646p4955k60091j28268K8297k8061
14801b8519M7439Q2591k06995J9396N8844R3399k2215o1195o6878n4307L8790
$$ plain form
14790 -99650 -154457 -200150 -229278 -47973 -92947 -84197 -51174 -48665 8156 -235270 -338849
14779 -338849 -566720 -331303 -278442 -386576 -408123 -350814 -322912 -34031 -122340 -169880 -248298
14768 -248298 -312082 -390354 -341414 -125364 90208 124485 62876 -29836 123911 14560 -129301
14757 -129301 3535 -25802 34066 42535 -11286 8477 -152115 -292988 -81861 -5879 19953
14746 19953 20485 56401 236971 542460 548957 393563 190609 48016 -32283 21669 -13595
14735 -13595 -143631 -343554 -397208 -300271 -85040 -105955 55809 58551 298616 450858 50799
14724 50799 -180298 -278994 -261456 -252627 -126301 -191439 -138790 20320 36218 -94582 47813
14713 47813 130751 -69594 -325598 -273477 -278181 -365325 -348768 -334276 -42620 70540 145944
$$ packed form
14790i9650n4807m5693k9128J81305m4974Q750L3023K509N6821k43426j03579
14779c38849k27871K35417N2861j08134k1547N7309K7902K88881q8309m7540p8418
14768b48298o3784p8272M8940K16050K15572L4277o1609r2712J53747j09351j43861
14757a29301J32836k9337N9868Q469n3821J9763j60592j40873K11127P5982K5832
14746A9953N32L5916J80570L05489O497j55394k02954j42593q0299N3952l5264
14735a3595j30036j99923n3654R6937K15231k0915J61764K742K40065J52242m00059
14724E0799k31097r8696J7538Q829J26326o5138N2649J59110J5898j30800J42395
14713D7813Q2938k00345k56004N2121m704q7144J6557J4492K91656J13160P5404
$$ plain form
14702 145944 275920 167479 289940 179917 50927 48755 -54035 70952 -56640 6468
14692 6468 188783 254452 476134 525684 376096 209231 190161 120627 17822 -94667 -384121
14681 -384121 -417360 -359299 -234335 -301294 -309587 -251528 49328 223963 235348 131703 179855
14670 179855 98793 -110760 140904 460810 716020 443998 -82055 -228388 -11236 186080
14660 186080 354569 330834 211600 108376 110255 232574 452117 439028 374445 217236
14650 217236 23655 232088 209079 156775 -14931 -64343 -115995 -102996 -214769 -250393 -188041
14639 -188041 -211269 -117543 233269 84367 -10286 -150587 -86631 -23375 145255 155353 64624
14628 64624 -28949 -159304 -80300 102002 202903 72440 98677 47796 -91220 -231774
$$ packed form
14702A45944J29976j08441J22461j10023j28990k172j02790J24987j27592O3108
14692F468J82315O5669K21682M9550j49588j66865j9070o9534j02805j12489k89454
14681c84121l3239N8061J24964o6959q293N8059L00856J74635J1385j03645M8152
14670A79855q1062k09553K51664L19906K55210k72022n26053j46333K17152J97316
14660A86080J68489k3735j19234j03224J879J22319K19543j3089o4583j57209
14650B17236j93581K08433k3009n2304j71706m9412n1652J2999j11773l5624O2352
14639a88041k3228R3726L50812j48902r4653j40301O3956O3256J68630J0098r0729
14628F4624r3573j30355P9004J82302J00901j30463K6237n0881j39016j40554
$$ plain form
14618 -231774 -297741 -172204 -15644 199192 197140 -84109 -329645 -433614 -469814 -191438
14608 -191438 -43929 -217672 -180275 -42361 -78331 47169 -105007 -347899 -274274 -16064
14598 -16064 60852 -115652 -275479 -298395 -910 253475 366392 329228 -75070 -434762
14588 -434762 -562279 -485867 -226514 32231 77105 -1947 116127 25694 -32112 -66466 -184105
14577 -184105 -184452 876 -58478 -327328 -234078 -48984 54031 51128 71484 51552 58667
14566 58667 231163 246826 94945 35875 137748 359063 384780 163745 -61240 -34661
14556 -34661 -70843 -202394 -184001 -109549 -109033 -168029 -132876 -273613 -179860 -242165 -285529 -202775
14544 -202775 -31955 190726 -76871 -227667 -397610 -347654 -331646 -143304 -219490 -358582
$$ packed form
14618b31774o5967J25537J56560K14836k052k81249k45536j03969l6200K78376
14608a91438J47509j73743L7397J37914l5970J25500j52176k42892P3625K58210
14598a6064P6916j76504j59827k2916K97485K54385J12917l7164m04298l59692
14588d34762j27517P6412K59353K58745M4874p9052J18074r0433n7806l4354j17639
14577a84105l47J85328n9354k68850R3250J85094J03015k903K0356j9932P115
14566E8667J72496J5663j51881n9070J01873K21315K5717k21035k24985K6579
14556c4661l6182j31551J8393P4452N16n8996L5153j40737R3753o2305m3364Q2754
14544b02775J70820K22681k67597j50796j69943M9956J6008J88342p6186j39092
$$ plain form
14534 -358582 -284302 -491710 -327969 -227136 -235760 -215280 -137128 -84906 -74197 -55858 -98236
14523 -98236 -224435 -180856 -57139 -144761 -72042 90338 -2245 -207360 -274752 -454462 -268018
14512 -268018 -22755 172695 129545 107606 202488 138044 42805 44946 168522 -62961 -22760
14501 -22760 40917 -39650 -132575 -316528 -365789 -669980 -590873 -205252 -49942 94168 97280
14490 97280 85126 -82212 -381753 -452296 -180003 -53570 45950 35834 -123668 -219168 -86611
14479 -86611 -35416 40254 130053 360383 318314 216322 292651 371435 69686 22555 -2155
14468 -2155 -20896 -49505 -39184 -41674 -74120 3155 80849 -144801 -193991 -385043 -289615 -200140
14456 -200140 -193216 -71438 -201169 -455012 -429874 -383141 -541846 -388981 -219479 -238708
$$ packed form
14534c58582P4280k07408J63741J00833q624K0480P8152N2222J0709J8339m2378
14523i8236j26199M3579J23717q7622P2719J62380r2583k05115o7392j79710J86444
14512b68018K45263J95450m3150k1939R4882o4444r5239K141J23576k31483M0201
14501b2760O3677q0567r2925j83953m9261l04191P9107L85621J55310J44110L112
14490I7280j2154j67338k99541p0543K72293J26433R9520j0116j59502r5500J32557
14479h6611N1195P5670Q9799K30330m2069j01992P6329P8784l01749m7131k4710
14468b155j8741k8609J0321k490l2446P7275P7694k25650m9190j91052R5428Q9475
14456b00140O924J21778j29731k53843K5138M6733j58705J52865J69502j9229
$$ plain form
14446 -238708 -214054 -166287 -439978 -657063 -575675 -556808 -500361 -266624 -66404 -222208
14436 -222208 -234424 -303363 -86430 16301 -105606 -55486 -101464 -236875 -145989 -78813 -6538
14425 -6538 104382 382003 126939 -200292 -367448 -353253 -178610 -283202 -130086 65765
14415 65765 -16728 -215622 46486 266082 137005 129663 106227 81164 -19482 -228863 -353551
14404 -353551 -462201 -219076 -113048 -232803 -211558 -79759 -66697 -290522 -287462 -165120
14394 -165120 3977 -149034 -153450 -121418 -246764 -394073 -447636 -249308 9392 550 -176281
14383 -176281 -69566 129205 54273 18330 10680 181589 267188 59816 240392 199843 115789
14372 115789 226136 269603 73890 -55005 -224836 -65319 -5025 -197960 -327203 -285968
$$ packed form
14446b38708K4654M7767k73691k17085Q1388J8867N6447K33737K00220j55804
14436b22208j2216o8939K16933J02731j21907N0120m5978j35411R0886O7176P2275
14425f538J10920K77621k55064l27231j67156J4195J74643j04592J53116J95851
14415F5765q2493j98894K62108K19596j29077p342k3436k5063j00646k09381j24688
14404c53551j08650K43125J06028j19755K1245J31799J3062k23825L060J22342
14394a65120J69097j53011m416L2032j25346j47309n3563J98328K58700q842j76831
14383a76281J06715J98771p4932l5943p650J70909Q5599k07372J80576m0549q4054
14372A15789J10347M3467j95713j28895j69831J59517O0294j92935j29243M1235
$$ plain form
14362 -285968 -390497 -341219 -237435 -137403 -119505 45330 -119799 -215948 -372067 -306477
14352 -306477 -241760 -58247 7453 12579 -79549 -102641 -126970 -214785 -202691 -202429 -310548 -410269
14340 -410269 -163395 -276826 -284380 64630 100124 -49526 -75043 -219529 -238851 -240505 18018
14329 18018 -55593 -33372 -1714 252272 457476 215292 48635 146922 119213 -115632 -336662
14318 -336662 -202288 23919 -61806 -139363 22912 153057 118446 -129549 968 17934
14308 17934 -194452 -155754 -44596 -37562 -231961 -286209 -76372 -25760 207660 278839 122431
14297 122431 162721 121594 10544 1766 292256 288160 65937 -16379 -22783 21087 39792
14286 39792 29858 179810 171117 242504 386380 128457 151472 172275 67080 -173072 -246499
$$ packed form
14362b85968j04529M9278J03784J00032J7898J64835j65129r6149j56119O5590
14352c06477O4717J83513O5700N126r2128k3092k4329q7815J2094K62j08119r9721
14340d10269K46874j13431p554L49010L5494j49650k5517j44486j9322j654K58523
14329A8018p3611K2221L1658K53986K05204k42184j66657R8287k7709k34845k21030
14318c36662J34374K26207q5725p7557J62275J30145l4611k47995J30517J6966
14308A7934k12386L8698J11158P034j94399n4248K09837N0612K33420P1179j56408
14297A22431M0290m1127j11050q778K90490m096k22223q2316o404M3870J8705
14286C9792r934J49952q693P1387J43876k57923K3015K0803j05195k40152p3427
$$ plain form
14275 -246499 -17671 55456 49152 53504 37360 308499 394203 491836 288975 111188 77489
14264 77489 48556 -25986 6102 -8652 -122291 -182480 32431 101218 79537 -65943 -191631
14253 -191631 -164526 -218734 -504465 -281735 185154 329557 231133 53563 19786 57692
14243 57692 211514 403637 94077 -126253 -212416 -149560 -196106 -192088 -86837 -94519 -145858
14232 -145858 -105626 10040 40098 91946 366818 280776 257051 112435 -2936 206565
14222 206565 231874 256820 7471 -150489 -104820 -88399 -107183 -201779 -389507 -302922 -388458
14211 -388458 -348436 -280921 -244222 35968 286954 239122 59500 -72068 12807 128904
14201 128904 338012 308024 145282 -147597 -195204 -26399 -30502 -1738 23283 -204297 -382907
$$ packed form
14275b46499K28828P3127o304M352j6144K71139Q5704R7633k02861j77787l3699
14264G7489k8933p4542L2088j4754j13639o0189K14911O8787k1681j45480j25688
14253a91631K7105n4208k85731K22730M66889J44403r8424j77570l3777L7906
14243E7692J53822J92123l09560k20330q6163O2856m6546M018J05251p682n1339
14232a45858M0232J15666L0058N1848K74872q6042k3725j44616j15371K09501
14222B06565K5309K4946k49349j57960M5669J6421j8784r4596j87728Q6585q5536
14211c88458M0022O7515L6699K80190K50986m7832j79622j31568Q4875J16097
14201A28904K09108k9988j62742k92879m7607J68805m103K8764K5021k27580j78610
$$ plain form
14190 -382907 -366621 -161352 -107740 -241313 -388081 -495987 -398294 -90955 59945 -18196
14180 -18196 18370 -56038 -258464 -173396 64464 127595 225740 -83881 -264753 -104278 2938
14169 2938 6221 -21068 -270667 -479393 -385456 -227161 -319022 -310784 -55722 92690 77633
14158 77633 -136060 -223696 -111525 41271 34019 64926 53462 -311889 -340199 -136014 56796
14147 56796 52709 -57777 -105362 -297758 -410136 -194710 -8927 133083 -36207 -76618
14137 -76618 -178989 -67184 92084 304518 303709 261465 32539 -134395 -98817 -229843 -327290
14126 -327290 -218823 42788 232538 243429 105007 -29232 -150747 -162789 37034 68013
14116 68013 19195 112129 282733 416000 425066 244685 -203636 -280246 -103565 88397 -19464
$$ packed form
14190c82907J6286K05269N3612j33573j46768j07906R7693L07339J50900p8141
14180a8196L6566p4408k02426Q5068K37860O3131R8145l09621j80872J60475J07216
14169B938L283k7289k49599k08726R3937J58295r1861Q238K55062J48412j5057
14158G7633k13693q7636J12171J52796p252L0907j1464l65351k8310K04185J92810
14147E6796m087j10486m7585j92396j12378K15426J85783J42010j69290m0411
14137g6618j02371J11805J59268K12434q09m2244k28926j66934L5578j31026r7447
14126c27290J08467K61611J89750J0891j38422j34239j21515j2042J99823L0979
14116F8013m8818R2934J70604J33267R066j80381m48321p6610J76681J91962j07861
$$ plain form
14105 -19464 -15259 -117317 -108484 -110742 41979 126645 308686 204211 -200799 -295010 -217936
14094 -217936 -159097 -287399 -298690 -45786 136571 83798 111856 181248 298209 394166 290784
14083 290784 -57237 -189722 -205269 -382028 -301687 -308685 -512326 -428441 -87349 -10298 68463
14072 68463 173894 272693 90644 42265 87271 52612 254394 345958 455121 565706 300262
14061 300262 -6450 -76687 46060 48528 -119500 20560 214421 12479 75527 201741
$$ packed form
14105a9464M205j02058Q833k258J52721Q4666J82041j04475m05010r4211P7074
14094b17936N8839j28302j1291K52904J82357n2773K8058O9392J16961R5957j03382
14083B90784l48021j32485j5547j76759Q0341o998k03641Q3885L41092P7051P8761
14072F8463J05431R8799j82049m8379M5006l4659K01782R1564J09163J10585k65444
14061C00262l06712p0237J22747K468j68028J40060J93861k01942O3048J26214
$$ [...]
##END NTUPLES=NMR SPECTRUM
##END=
