##TITLE=Analysis number 307941
Compound Code cc 19446
Book Reference 382/70/1
Project Code adrs
Chemist Name simons
##JCAMPDX= 6.0         $$ Bruker NMR JCAMP-DX V2.0
##DATA TYPE= NMR SPECTRUM
##DATA CLASS= NTUPLES
##ORIGIN= Bruker BioSpin GmbH
##OWNER= NMR
$$ XWIN-NMR		Version 3.5
$$ Tue May 17 13:58:35 2005 GMT Daylight Time (UT+1h)  MAYBRIDGE\NMR@NMR_250MHZ
##.OBSERVE FREQUENCY= 250.131544655141
##.OBSERVE NUCLEUS= ^1H
##.ACQUISITION MODE= SIMULTANEOUS (DQD)
##.ACQUISITION SCHEME= undefined
##.AVERAGES= 16
##.DIGITISER RES= 18
##SPECTROMETER/DATA SYSTEM= dpx250
##.PULSE SEQUENCE= zg30
##.SOLVENT NAME= CDCl3
##.SHIFT REFERENCE= (INTERNAL, CDCl3, 0, 16.522)
##AUDIT TRAIL= $$ (NUMBER, WHEN, WHO, WHERE, WHAT)
$$ ##TITLE= Audit trail, XWIN-NMR		Version 3.5
$$ ##JCAMPDX= 5.01
$$ ##ORIGIN= Bruker BioSpin GmbH
$$ ##OWNER= NMR
$$ C:\u/data/dgb/nmr/ADRS/3060/pdata/1/auditp.txt
$$ ##AUDIT TRAIL=  $$ (NUMBER, WHEN, WHO, WHERE, WHAT)
(   1,<2005-05-17 13:58:17.27 +100>,<MAYBRIDGE\NMR>,<NMR_250MHZ>,
      <created by zg, POWCHK disabled, PULCHK disabled
       configuration hash MD5:
       62 19 C7 07 E1 42 D1 B7 37 6C 3D D0 77 39 F9 E6
       data hash MD5: 64K
       29 4A AC C0 89 E6 74 AA 23 53 11 97 6D A5 56 AD>)
(   2,<2005-05-17 13:58:28.04 +100>,<MAYBRIDGE\NMR>,<NMR_250MHZ>,
      <Start of raw data processing
       ef LB = 0.3 FT_mod = 6 PKNL = 1 SI = 32K 
       data hash MD5: 32K
       93 8C 6A E2 74 9C F8 7B 70 62 8A 75 FF A7 2E 5B>)
(   3,<2005-05-17 13:58:29.79 +100>,<MAYBRIDGE\NMR>,<NMR_250MHZ>,
      <apk 
       data hash MD5: 32K
       E0 51 39 67 42 80 2C 4E 02 81 55 96 55 F0 59 02>)
(   4,<2005-05-17 13:58:30.49 +100>,<MAYBRIDGE\NMR>,<NMR_250MHZ>,
      <abs ABSG = 5 
       data hash MD5: 32K
       59 8A 64 D1 94 05 6B 0B A1 79 B2 66 B2 47 B1 A0>)
$$ ##END=
$$ 
$$ hash MD5
$$ 1A 7F F3 6C 1B ED B4 BC A8 2D 82 BF 3C 28 CC 8D
##$RELAX= 
##$RELAX= 
##$RELAX= 
##$RELAX= 
##$RELAX= 
##$RELAX= 
##$RELAX= 
$$ Bruker specific parameters
$$ --------------------------
##$DU= <C:\u>
##$EXPNO= 3060
##$NAME= <ADRS>
##$PROCNO= 1
##$TYPE= <nmr>
##$USER= <dgb>
##$AMP= (0..31)
100 100 100 100 100 100 100 100 100 100 100 100 100 100 100 100 100 100 
100 100 100 100 100 100 100 100 100 100 100 100 100 100 
##$AQSEQ= 0
##$AQ_mod= 3
##$AUNM= <au_zg>
##$AUTOPOS= <41 >
##$BF1= 250.13
##$BF2= 250.13
##$BF3= 250.13
##$BF4= 250.13
##$BF5= 500.13
##$BF6= 500.13
##$BF7= 500.13
##$BF8= 500.13
##$BYTORDA= 1
##$CFDGTYP= 0
##$CFRGTYP= 5
##$CHEMSTR= <none>
##$CNST= (0..31)
1 1 145 1 1 1 1 1 1 1 1 1 1 1 1 1 1 1 1 1 1 1 1 1 1 1 1 1 1 1 1 1 
##$CPDPRG= <>
##$CPDPRG1= <>
##$CPDPRG2= <>
##$CPDPRG3= <>
##$CPDPRG4= <mlev>
##$CPDPRG5= <mlev>
##$CPDPRG6= <mlev>
##$CPDPRG7= <mlev>
##$CPDPRG8= <mlev>
##$CPDPRGB= <>
##$CPDPRGT= <>
##$D= (0..31)
0 1 0 0 0 0 0 0 0 0.06 0 0 0 0 0 0 0.0002 0 0 0 0 0 0 0 0 0 0 0 0 0 0 
0 
##$DATE= 1116334696
##$DBL= (0..7)
120 120 120 120 120 120 120 120 
##$DBP= (0..7)
150 150 150 150 150 150 150 150 
##$DBP07= 0
##$DBPNAM0= <>
##$DBPNAM1= <>
$$ [...]
##$SUBNAM6= <"">
##$SUBNAM7= <"">
##$SUBNAM8= <"">
##$SUBNAM9= <"">
##$SW= 20.6930455092707
##$SWIBOX= (0..15)
0 0 3 0 0 0 0 0 0 0 0 0 0 0 0 0 
##$SW_h= 5175.983436853
##$TD= 65536
##$TD0= 1
##$TE= 296.16
##$TE2= 300
##$TE3= 300
##$TEG= 300
##$TL= (0..7)
0 120 120 120 120 120 120 120 
##$TP= (0..7)
150 150 150 150 150 150 150 150 
##$TP07= 0
##$TPNAME0= <>
##$TPNAME1= <>
##$TPNAME2= <>
##$TPNAME3= <>
##$TPNAME4= <>
##$TPNAME5= <>
##$TPNAME6= <>
##$TPNAME7= <>
##$TPOAL= (0..7)
0.5 0.5 0.5 0.5 0.5 0.5 0.5 0.5 
##$TPOFFS= (0..7)
0 0 0 0 0 0 0 0 
##$TUNHIN= 0
##$TUNHOUT= 0
##$TUNXOUT= 0
##$USERA1= <user>
##$USERA2= <user>
##$USERA3= <user>
##$USERA4= <user>
##$USERA5= <user>
##$V9= 5
##$VALIST= <valist>
##$VCLIST= <CCCCCCCCCCCCCCC>
##$VD= 0
##$VDLIST= <DDDDDDDDDDDDDDD>
##$VPLIST= <PPPPPPPPPPPPPPP>
##$VTLIST= <TTTTTTTTTTTTTTT>
##$WBST= 1024
##$WBSW= 4
##$XGAIN= (0..3)
0 0 0 0 
##$XL= 0
##$YL= 0
##$YMAX_a= 347371
##$YMIN_a= -375457
##$ZGOPTNS= <>
##$ZL1= 120
##$ZL2= 120
##$ZL3= 120
##$ZL4= 120
##$ABSF1= 16.522
##$ABSF2= -4.171173
##$ABSG= 5
##$ABSL= 3
##$ALPHA= 0
##$AQORDER= 0
##$ASSFAC= 0
##$ASSFACI= 0
##$ASSFACX= 0
##$ASSWID= 0
##$AUNMP= <proc_1d>
##$AZFE= 0.1
##$AZFW= 0.1
##$BCFW= 0
##$BC_mod= 0
##$BYTORDP= 0
##$COROFFS= 0
##$CY= 12.5
##$DATMOD= 1
##$DC= 0
##$DFILT= <>
##$DTYPP= 0
##$F1P= 14.0000005364418
##$F2P= -0.99999901652339
##$FCOR= 0.5
##$FTSIZE= 32768
##$FT_mod= 6
##$GAMMA= 0
##$GB= 0
##$INTBC= 1
##$INTSCL= 1
##$ISEN= 128
##$LB= 0.3
##$LEV0= 0
##$LPBIN= 0
##$MAXI= 10000
##$MC2= 0
##$MEAN= 0
##$ME_mod= 0
##$MI= 0
##$NCOEF= 0
##$NC_proc= -3
##$NLEV= 6
##$NOISF1= 0
##$NOISF2= 0
##$NSP= 0
##$NTH_PI= 0
##$NZP= 0
##$OFFSET= 16.522
##$PC= 1
##$PHC0= -73.397
##$PHC1= 5.749748
##$PH_mod= 1
##$PKNL= yes
##$PPARMOD= 0
##$PSCAL= 4
##$PSIGN= 0
##$REVERSE= no
##$SF= 250.13
##$SI= 32768
##$SIGF1= 0
##$SIGF2= 0
##$SINO= 400
##$SIOLD= 32768
##$SREGLST= <1H.CDCl3>
##$SSB= 0
##$STSI= 32768
##$STSR= 0
##$SW_p= 5175.98343685301
##$SYMM= 0
##$S_DEV= 0
##$TDeff= 65536
##$TDoff= 0
##$TI= <Analysis number 999999
Compound Code 99
Book Reference 9
Project Code 9>
##$TILT= no
##$TM1= 0
##$TM2= 0
##$TOPLEV= 0
##$USERP1= <user>
##$USERP2= <user>
##$USERP3= <user>
##$USERP4= <user>
##$USERP5= <user>
##$WDW= 1
##$XDIM= 32768
##$YMAX_p= 348989476
##$YMIN_p= -48508
$$ End of Bruker specific parameters
$$ ---------------------------------
##NTUPLES= NMR SPECTRUM
##VAR_NAME=  FREQUENCY,     SPECTRUM/REAL,   SPECTRUM/IMAG
##SYMBOL=    X,             R,               I
##VAR_TYPE=  INDEPENDENT,   DEPENDENT,       DEPENDENT
##VAR_FORM=  AFFN,          ASDF,            ASDF
##VAR_DIM=   32768,         32768,           32768
##UNITS=     HZ,            ARBITRARY UNITS, ARBITRARY UNITS
##FACTOR=    0.157963299565203, 1,           1
##FIRST=     4132.6476996994, 0,             0
##LAST=      -1043.33573715361, 0,           0
##MIN=       -1043.33573715361, -48508,      0
##MAX=       4132.6476996994, 348989476,     0
$$ Real data points
##PAGE= N=1
##DATA TABLE= (X++(R..R)), XYDATA
$$ [...]
17318B2316K707j1314r417O244J581n887l271k391n423K168R656k091L104K272
17304A0254o446m284O998R123p543q61j3321O462J2385p42q109j1084k737J798
17290h107j126M530J1744J0464o651l079j6510L966Q499J1322n731l261J1157
17277A7217o299l012N90q680J6937j0193j4484J1255Q675N048P27L779r108j3600
17263a148L665J1491m365K259j3407j0326N392l497R563N321k2489j4549O096
17250b5994J8855J6378M348j2221j3049j920L221Q667K4424N807j1391j5241j5320
17237a3436J056R196J4012J2512j3728o332P861k979p642R271K325n164k821p501
17223c370n421m81J897P312k688j945M938Q098J401L43j3652k25M925j80J4381
$$ y = [22316, 25023, 13709, 4292, 10536, 12117, 6230, 2959, 568, -4855, -2687, 6969, 4878, 7982, 10254, 3808, -476, 6522, 15645, 8102, 7241, -6080, 382, 12767, 12025, 3916, -7168, -9905, -8107, -9233, -4703, 7041, 17505, 10854, 7775, -8735, -4769, 3730, 15052, 9321, 6060, 17217, 10918, 7906, 8496, -184, 16753, 6560, -7924, 3331, 12006, 17054, 17781, 21560, 12452, -1148, 2517, 14008, 9643, 11902, -1505, -11831, -6439, -9936, -373, 4948, -17541, -32090, -25994, -7139, 9239, 13587, 1366, -11683, -13603, -10382, -1715, 22709, 28516, 17125, 1884, -13436, -12380, -3184, 10828, 23340, 9612, 3280, 11141, 8162, 520, 9791, 12116, 6952, 4131, -3370, -8791, -9272, -7375, -63, -2751, -4696, 242, 8340, 9741, 10084, -3568, -3793, 1132, 952, 15333]
17208A5333j910K606j8726j3636P174M443L328P950q243q932J97j93K432n516
17194a3693l990N486K33n274M528L042N525Q031o56O161m405R063J6663N622j2284
17179B4052j6461M005L059P33M602j311L983n67j6866m03N350m113n459L897r905
17164e404q100P277K665K623j2172J63N698Q481P128m811m350P805J695p570n752
17149d624r45J2623k240j7427o550k750N035O413L267K624J9082Q053j6648j8219
17135a2306n19P553o908K614n253P713L247N664P181k201J2337K163j001j7116
17121C168o961N216L918r700j2585M428K235o024o405p886J353K1061J430q140
17107a4892K245Q608J4212J0755J2038j3713k2756n858k457J596R997J612N019
$$ y = [15333, 13423, 16029, -2697, -16333, -9159, -4716, -1388, 6562, -1681, -10613, -10416, -10609, -8177, -13693, -17683, -12197, -11964, -17238, -12710, -9668, -4143, 3888, 3232, 9393, 4988, 14051, 30714, 36336, 24052, 7591, 11596, 14655, 15388, 19990, 18679, 22662, 22095, 5229, 4826, 10176, 6063, 604, 4501, -5404, -13504, -6227, -3562, -939, -13111, -12948, -7250, 1231, 8359, 3548, -802, 7003, 8698, 1128, -4624, -5569, 7054, 4814, -12613, -19163, -21913, -16878, -10465, -7198, -4574, 14508, 22561, 5913, -12306, -12825, -5272, -12180, -9566, -14819, -7106, -3859, 1805, 8986, 6785, 19122, 21285, 20284, 3168, -3793, 1423, 5341, -4359, -16944, -12516, -10281, -16305, -22710, -30596, -29243, -8182, -6752, -14892, -12647, -4039, 10173, 20928, 32966, 19253, -3503, -9361, -11818, -10222, -225, 1387, 6406]
17094F406j260k495J0040p154j4341J8734M819k1332j326N301j503R897M529j2695
17080b380r710j850J1719P168N30Q142l913k0255p602P012o22q418O17N315o17
17065a4864n69P068r115O760J880P408J4415j1188j1584R177K882k856m974j1777
17051a7337J423q25j0962R64O398J0797p52Q3M436j524r382N861J806j3504K49
17036b2269J4839n402k808q034L961Q709j3863N320K698J0603j428m567j0732
17023b2973m71K729J2743Q232K979j4310J5121J4753m673j4872O80J1585j4504
17010b981k546Q012M516k804j562o270J314j863m390M858l409o441N556Q281o268
16995e997q27O623l822r646j0859o055Q404N796p112N714R459N538j414l482P737
$$ y = [6406, 5146, 2651, 12691, 5537, -8804, 9930, 14749, -6583, -7909, -2608, -4111, 5786, 10315, -2380, -12090, -13940, -2221, 4947, 5477, 13619, 9706, -10549, -18151, -11139, -11761, -20179, -19562, -14247, -14864, -15433, -8365, -17480, -10720, -8840, -1432, 12983, 1795, -9789, -612, 2270, -586, -5560, -17337, -15914, -16739, -27701, -26737, -20339, -9542, -10294, -10211, -5775, -7299, -16681, -10820, -9014, -22518, -22269, -7430, -12832, -15640, -23674, -19713, -11004, -24867, -19547, -16849, -6246, -7674, -12241, -22973, -23444, -20715, -7972, 260, 3239, -11071, 4050, 18803, 14130, -742, -62, 11523, -2981, -5527, 2485, 7001, 4197, 2635, -3635, -2321, -4184, -8574, -3716, -7125, -13566, -8010, 271, -5997, -6824, -201, -4023, -13669, -24528, -30583, -22179, -16383, -23495, -17781, -8322, -2784, -4198, -7680, 57]
16980E7J971j2757j8266P720J4316O459p08p029j811j567J5279r760l547N800
16966c843L959K129K179j019m166l670j3852N622J331j634j5287j3603J0977J0969
16952a9908Q525M03N989q539L022L830J375o284l015J043L493j245L088n065Q825
16937d463J0736p737k973L470l986L82o583N0q345q136Q805N102N735R9j3750
16922b1594k932K178J5784N586M8m294n987L748P794P78k1732J723O096P967J0218
16907E381k651k734J535j1337L335O856J2020r659M090J883k323j9583J0953j622
16893c856J483R37q038P787J8203R431o277n5j450k680M268q910j2080j1574o241
16878a9052O979P127J4834j3000p149k68j8449K476J8836R179m45k626K510o21
$$ y = [57, 2028, -10729, -28995, -21275, -6959, -500, -1208, -8237, -10048, -11615, 3664, -6096, -9643, -3843, 116, 2245, 4424, 3405, -761, -4431, -18283, -12661, -11330, -12964, -28251, -41854, -30877, -19908, -11383, -10980, -4991, -13530, -10508, -6678, -5303, -11587, -14602, -13559, -10066, -11311, -8223, -13288, -4463, 6273, -1464, -4437, -967, -4953, -4571, -11154, -11104, -19449, -27585, -18780, -13678, -7943, -7844, -21594, -24526, -22348, -6564, -978, -930, -5224, -11211, -7463, 331, 1109, -20623, -18900, -12804, -4837, 5381, 2730, -4, 1531, -9806, -6471, 385, 12405, 2746, 6836, 8719, 6396, -13187, -2234, -3856, -2373, -1436, -9474, -1687, 16516, 25947, 19670, 19615, 18165, 15485, 19753, 10843, -1237, -12811, -19052, -12073, -4946, 9888, -3112, -10261, -10529, -28978, -26502, -7666, 1513, 1068, -1558, 952, 331]
16864C31n910n896o683N180J5110O888j760n662k339l124p173J5284J0115j0078
16850D283o82o097J588m266j1777r405M408J9169Q02m464m583J97L599M017Q375
16835E164j7985j0601M66J8637j674q351j0107N13J0577J3687j932j1206j995
16822a4807r362J45J0206J501j1365L61J0278J2267J9818L638K273j2975j6591
16809d613L963q810o945p198N847L119Q216L870n77j0482r984L749O43R220J0233
16794B51l631k3458M718J6924p33P987n136J211j8173q010J0224N82K883k195
16780a6556K820M780l745p723R107N592j1928o898J0905M526P478O252o841j4488
16766a6719M214P303j8816J5923P048J531J2178Q604K72j1364l128k629r041o885
$$ y = [331, -5579, -11475, -18158, -12978, 2132, 9020, 7260, 1598, -741, -3865, -11038, 4246, 14361, 4283, 3601, -2496, -908, -5174, -16951, -26356, -21948, -2779, -1977, -6441, -11024, -10827, -7228, -3211, 5164, -12821, -23422, -22956, -4319, -5993, -14344, -24451, -23938, -13361, 326, -1606, -12812, -14807, -24169, -24024, -13818, -12317, -23682, -23321, -13043, -776, 19042, 22680, 24953, 11978, -4613, -650, -9460, -16405, -23603, -17756, -14637, -6421, -2551, -3128, -13610, -23594, -19845, -19202, -9982, 251, -3380, -26838, -22120, -5196, -5929, 2058, -3078, -1867, -20040, -28050, -17826, -17244, -14361, -16556, -13736, -8956, -12701, -20424, -11317, -5725, -17653, -24551, -13646, -9120, -1642, 4610, -2231, -16719, -12505, -5202, -24018, -8095, -1047, 484, 12662, 21266, 21538, 10174, 7046, 4417, -4624, -11509]
16752a1509p63j2038r958P450R342J4797J2143p045o929N489M711k567j2075m294
16738a3246J973q521J4412N459L088m740j532J23o169J2857L282Q506P411j485
16724B1418q423k2546J948J5667P400o535j707q91m936J762o985j6020o965j879
16710b8692J2689Q0l428J0145l20n302J1474l809q600r113J2891k026J310R700
16696c001N365P582j6622k711K90J2785Q92j1249r356o378J4148M600K615j778
16682b818L938M393k289n955R238J566L298J6665J3441p292k5878j3709q903m274
16668a8579L742J3521M66K23M17j001r214K047J3065J1105r938P010k955m495
16654E414j4978p855Q022q194j248J744l095p315R083J6773Q742j4904j170J386
$$ y = [-11509, -12272, -24310, -34268, -26818, -17476, -2679, 9464, 2419, -4510, 979, 5690, 3123, -8952, -13246, -11273, -19794, -5382, 77, 3165, -1575, -3107, -2984, -9153, 3704, 6986, 15492, 22903, 21418, 12995, -9551, -7603, 8064, 15464, 8929, 7222, 6331, 1395, 3157, -3828, -19848, -26813, -28692, -16003, -15923, -19351, -9206, -9526, -14828, -3354, -7163, -15763, -24876, -11985, -14011, -12701, -3001, 2364, 9946, -6676, -9387, -9097, 3688, 4580, -6669, -16025, -22403, -8255, -3655, -1040, -2818, 1120, 5513, 3224, -2731, 6507, 8073, 11371, 28036, 41477, 34185, 8307, -5402, -14305, -18579, -14837, -1316, -850, -627, -210, -1211, -10425, -8378, 4687, 15792, 5854, 12864, 9909, 5414, -9564, -17419, -9397, -17591, -18839, -17095, -20190, -27505, -18422, -1649, 7093, -7811, -8981, -7595]
16640g595M592P296L869N18o252L010K72k416J2837k801k526J3876l245p386j0407
16625C642m754p965K098J1560L67M110j362j2327m754K690P510N252r826j3875
16611a7634n430P309K4675R179Q615l214Q71K606k1204j0191L175K170j0087L019
16597f141Q915j4152k906q66L441O589m007m072J0647P904r212j2145j065J792
16583a5278P079J430J189R297J8587P356M695r422K034j3237j55K328k931p325
16569E647k0011p280J3072J245J634M492L810N383J6125r372j1646L214J837O947
16555A5097j6056p365K314R492l723j4256n27J163Q587M721j046j913q966K246
16541a0232J9484Q993O318M718k1287o822P592l507q509o971k750J409q822R254
$$ y = [-7595, -3003, 4293, 8162, 8680, 2428, 5438, 5710, 3294, 16131, 13330, 10804, 24680, 21435, 14049, 3642, -1112, -9077, -6979, 4581, 4948, 9058, 7696, -4631, -9385, -6695, 815, 6067, -3759, -17634, -23064, -15755, 8920, 18099, 26714, 23500, 24371, 26977, 5773, -4418, -1243, 927, -9160, -6141, 2774, -11378, -14284, -15150, -11709, -5120, -9127, -13199, -2552, 5352, -3860, -16005, -17070, -15278, -8199, -6769, -5580, 3717, 22304, 29660, 34355, 24933, 26967, 13730, 13575, 15903, 12972, 5647, -14364, -21644, -8572, -7327, -5693, -1201, 2609, 7992, 24117, 14745, 3099, 6313, 8150, 15097, -959, -8324, -6010, 3482, -241, -14497, -15024, -13861, -5274, -553, -1599, -3512, -12478, -10232, 9252, 18245, 24563, 29281, 7994, 1172, 8764, 5257, -3252, -10223, -12973, -11564, -20386, -11132]
16527a1132L081q608j113J209r55r10J680J9581N410O867L970L194j3823j5340
16513f889j5232m886Q944O399j233n523P761J2040J220J707J3879J1724k73k443
16499B7195J9298J889j0823j8277n686o85k454j3747J5206O200k458j4673j625
16486f40r216r619P992J5534Q224o135n013N302l644o974J735r392j0567M354
16472a8059Q929k670k262J2661k475l119J3877L996O919k290j042l138r355P923
16458I895R825l786j923n792j3575k789j5593P732O578N358N722J0177k0809k356
16444a1336J6766J098k0110k213K3626L595l138q09J2586R53q941j2750q804M81
16430h996k618J4095J6257R8j5845m314K478J2229J4653k801r238l556J0425J1078
$$ y = [-11132, -8051, -16659, -17772, -16563, -17518, -18428, -16748, 2833, 8243, 15110, 19080, 22274, 8451, -6889, -22121, -27007, -18063, -11664, -12897, -18420, -10659, 1381, 2601, 4308, 18187, 29911, 29638, 27195, 46493, 48382, 37559, 19282, 13596, 12911, 10457, -3290, 11916, 18116, 15658, 985, -640, -9856, -19475, -11483, 4051, 12275, 6140, 1127, 6429, 2785, -4189, -2454, -11846, -22413, -18059, -9130, -11800, -14062, -1401, -3876, -6995, 6882, 10878, 17797, 15507, 14465, 11327, 1972, 9895, 19720, 15934, 14011, 8219, -5356, -8145, -23738, -16006, -9428, -4070, 1652, 11829, -8980, -11336, 5430, 6528, -13582, -15795, 7831, 11426, 8288, 7479, 20065, 21018, 12077, -673, -9477, -8996, -11614, 2481, 18738, 18836, 2991, -1323, 1155, 13384, 28037, 25236, 15998, 12442, 22867, 33945]
16416C3945r42M096J61j0072J58N75M313J3480o447k1126j5664n219N410N883
16402H551j7680q309Q715P298j671p695N637K476q544P488Q022l920j669K17K186
16387A102J616N508n95n063j233k500j5772N918R580M014q711j469J7217K20r346
16372D86j4824M225J2255R030M403r12j1351l759L084k662n619j214N807n62J9445
16357A7832P431j8028j4399J951p514o723R93o867N962J5425J8043l894k025p505
16343F82r871n007K328J2760l234p398J654O400J0868m25o549r416R866J1495
16329A4153o696p256o979j0114l093j008K829M956P384M435J287M485P076k846
16315H613q978j192K715m124o246k7220L016J0571K0318J3620j3605R85J0395
$$ y = [33945, 33003, 37099, 37260, 27188, 27346, 27921, 32234, 45714, 39267, 18141, 2477, -2742, 2668, 8551, -9129, -17438, -8723, -1425, -3096, -10791, -5154, -2678, -11222, -3734, 4288, 368, -1301, -1084, 1102, 2718, 8226, 7631, 2568, 1335, -1165, -16937, -11019, -1439, 2575, -6136, -7605, 9612, 9832, 486, -14338, -10113, 2142, 11172, 15575, 14663, 3312, -447, 2637, -25, -5644, -6858, -1051, -1613, 17832, 25263, 7235, -7164, -5213, -12727, -19450, -18457, -25324, -19362, -3937, 14106, 10212, 8187, 682, -9189, -14196, -11868, 892, -2342, -9740, -8086, -1686, 9182, 8757, 2208, -7208, 2658, 14153, 7457, 201, -6778, -16892, -19985, -20993, -18164, -13208, -5824, -1389, -102, 4383, 11459, 8613, -365, -1557, 1158, -2966, -9212, -36432, -33416, -22845, -2527, 11093, -2512, -1527, 8868]
16302H868j030O721m193m053j6479p324Q713J1376L403q184p098J3653P492j6225
16288d360J62J7353l77j0714J76o38R676j1429L169r52j0705j2836n145J895P472
16273a7253L438n156J1292J8903j231j0459j9666j112N986r022k280P937K7535
16260H912J6142l642j6992n998J5712P780j0219p058P230J675q313L664M785o626
16246G052K773o931p53m420K391m183o965R603J1062j1526l963j7386Q139J1022
16232d085J640m96Q353R367M53n494n939K31j1995m074L758J1411r742M385m401
16217f628m893Q928o54j742o850L409J1155J1647K775l271r980N237M294L000
16203A6427j3261k040l863Q740M898N725K202n972p370k731j802M853l538j7659
$$ y = [8868, 7838, 14559, 10366, 6313, -10166, -17490, -8777, 2599, 6002, -2182, -9280, 4373, 11865, -4360, -4198, 13155, 12778, 2064, 2240, 1602, 11278, -151, 3018, 2066, -8639, -21475, -26620, -24725, -17253, -13815, -18971, -7679, 11224, 9993, -466, -20132, -21244, -15258, -24280, -26560, -18623, 8912, 25054, 21412, 4420, -1578, 14134, 21914, 11695, 4637, 11867, 13542, 5229, 8893, 13678, 7052, 9825, 2894, 2141, -2279, 112, -4071, -11036, -1433, 9629, -1897, -5860, -23246, -15107, -4085, -2445, -2941, 5412, 14779, 15232, 9738, 3799, 4030, -7965, -12039, -8281, 3130, -6612, -2227, -6628, -11521, -2593, -3247, -4989, -11839, -8430, 2725, 14372, 17147, 13876, 3896, 9133, 13427, 16427, 3166, 1126, -2737, 6003, 10901, 16626, 18828, 12856, 5486, 2755, 953, 5806, 2268, -15391]
16189a5391q005J8578P409o428J75k611R27q64j2057N838M221p347r77m79n543
16174b2554N888n580R723J1540R835p55j2644R134p75J413M284K267j7069j9112
16160b4405L432J1805m738j2926j65R649L900j8403L908J8385K600K595q995j0858
16146b4216L006r339P50K4286j017J170k823O753J2273j013K602m035j0170q061
16132i834j1324l367K939J2331J1430Q72k520M85J4563o421q442L353q91M387
16118G561L411j9963K807P029m655j520m961q457m211r054L331M812J270l703
16104b6303L562K575n165k673K568L086J4862P791n69k136M548j440K013M083
16090F802o317j491m336q004m620J9765j169R85L601o791r364J065l242j6121
$$ y = [-15391, -23396, -4818, 2591, -3837, -3662, -6273, -5346, -6210, -18267, -12429, -8208, -15555, -16532, -17011, -22554, -16666, -22246, -12523, -983, 8852, 8097, -4547, 4587, 3812, 5225, 9509, 11776, -5293, -24405, -20973, -9168, -13906, -26832, -26997, -17348, -13448, -31851, -27943, -9558, -6958, -4363, -13358, -24216, -21210, -30549, -29799, -5513, -6530, -5360, -8183, -1430, 10843, 9830, 12432, 8397, -1773, -9834, -21158, -24525, -21586, -9255, 2175, 3047, 527, 1012, 15575, 9154, 712, 4065, 3174, 7561, 10972, -8991, -6184, 845, -3810, -5330, -10291, -18748, -22959, -32013, -28682, -23870, -22600, -26303, -22741, -20166, -25331, -28004, -25436, -22350, -7488, 303, -266, -2402, 2146, 706, 2719, 6802, 485, -1006, -5342, -13346, -17966, 1799, 630, 1615, 5216, -1575, -10939, -9874, -13116, -29237]
16076b9237k917J3350q63p490M935K0990R319j592j058j0314j563P760L448q555
16062c787n549Q426L577n42J1799J1385j0563p351r728K076N5K350K335K0o833
16047b330j4239r186J6547l547l504o631K547J6215J614k989J2652n191m522K851
16033B87M152n451P407m850r689K364n78J433J481J3924k07j9279O163q513K372
16018h984Q857M133o162r97l062p174k867K0201M400q647p275j0241j590n10J7186
16003b732L620P198n385N193j1329j1927J179P829J5203O361o684k0345k464j022
15989a5305J4271k380k754J092n236j3933n25R424J170P19o959k113q82O036P202
15974a0173O106L545J8085R723k2302l543R908R095j4864n965L994J283K185O9
$$ y = [-29237, -32154, -18804, -19667, -27157, -22222, -1232, 8087, 6495, 5437, -4877, -6440, 1320, 4768, -3787, -9336, -910, 2667, 2125, 13924, 25309, 14746, 7395, -2333, -257, -202, 2148, 4483, 4503, -2330, -16569, -25755, -9208, -12755, -16259, -22890, -20343, -4128, -2514, -5503, 7149, 1958, -2564, 287, 4439, -1012, 6395, 1545, -8144, -5780, -6358, -4925, -3444, 10480, 10273, -9006, -2843, -11356, -8984, -127, 4006, -2156, -3153, -6215, -13389, -16256, 3945, 8345, -302, -7577, -17818, -19408, -19918, -2732, 888, 8086, 2701, 7894, -3435, -15362, -14183, -6354, 8849, 15210, 8526, -11819, -14283, -15305, -1034, -3414, -6168, -5076, -10312, -24245, -24770, -15346, -14176, -13457, -20416, -22529, -23411, -17375, -10173, -4067, -522, 17563, 27286, 4984, 1441, 11349, 20444, 5580, -385, 3609, 4892, 7077, 7146]
15960G146M525J7490k690n845j0449j2192j0349O374j822R981K997N56n783K923
15946B862J0203r612n650m027o650q925N036P332j0322N332K3743O003p761Q72
15932H436M36P203j3290l656M412K162j4865m254m91J4881R337j081R5J2254m923
15917A6656k406Q704q931o293N681j1358j4096k569p99L09N607N167Q566n033
15903g95k235J370j135j6512o395k084Q816R624p740j2747L489K079K177R349
15889a2739r43J77J1173J6087K811l201o822p035m202q133N386J5252k780m255
15875G76m654J672p168j0637n044M123P494N065J7278J0883n685p880j378j7957
15861a3112j0434J2737Q53q510N70l022n984j305P686N320k520J49m269m560O342
$$ y = [7146, 11671, 29161, 26471, 20626, 10177, -2015, -12364, -5990, -7812, 2169, 5166, 5722, -61, 2862, 13065, 3453, -2197, -6224, -12874, -21799, -16763, -9431, -19753, -14421, 9322, 15325, 7564, 8436, 8872, 16075, 2785, -871, 3541, 5703, -9162, -13416, -13907, 974, 10311, 9230, 9325, 21579, 16656, 14250, 22954, 14023, 7730, 13411, 2053, -12043, -14612, -15411, -15102, -9495, -4328, 4238, -795, -3030, -1660, -2795, -19307, -25702, -27786, -18970, -9346, -17086, -29833, -26344, -24265, -22088, -12739, -13682, -13505, -2332, 13755, 16566, 13365, 6543, -492, -4694, -12827, -7441, 7811, 5031, 776, -3878, -2206, -9374, -20011, -25055, -20932, -13438, -8373, 8905, 19788, 14103, 6223, 4845, -13112, -23546, -10809, -9956, -18466, -17896, -20918, -26902, -28207, -20521, -15201, -17721, -17572, -21841, -26401, -20059]
15846b0059Q200N614l81n473p767O186R873L062Q609j2742n35L966j906L245Q81
15831G73j824k313j0836o085N612M053l873q658Q650R746j749Q853J2763M973
15817B0085j65j3203j0339j4192j1068P638J2679k292j363l874O944J3539k619
15804A770o661J1151J5619m289k205J0364L731j3068p019j7650j449K223Q974
15791A491j259N64J0664K938j1265j1596l969J0764j170l547M375N694J3759n365
15777A2078j4175J047k280m497k918n247k461J2861R825J489l780J142J3654M821
15763B1559q732j3836M220n985j7148J469R047J3943M521m804j6748m875J1545
15750e824J4657Q513m300j88J0526j6499j3048n811L275J0840k244k932L610m447
$$ y = [-20059, -11859, -6245, -6626, -12099, -19866, -13680, -3807, -745, 7864, -4878, -5413, -1447, -3353, -108, 773, -1051, -3364, -14200, -20285, -14673, -10620, -14493, -23151, -14501, -4755, -6504, 2349, 15112, 20085, 19920, 6717, -3622, -17814, -28882, -21244, -8565, -10857, -12220, -16094, -9150, 4389, 1770, -4891, 6260, 21879, 17590, 15385, 25749, 29480, 16412, 9393, -8257, -9706, -7483, 1491, 232, 796, 11460, 14398, 3133, -8463, -12432, -1668, -2838, -6385, -2010, 3684, 17443, 12078, -2097, -1050, -3330, -7827, -10745, -15992, -18453, -5592, 4233, 5722, 1942, 3084, 16738, 21559, 12827, -1009, 3211, -2774, -19922, -18453, -9406, 4537, 9058, 4254, -12494, -17369, -5824, 8833, 17346, 13046, 12858, 23384, 6885, -6163, -11974, -8699, 2141, -103, -3035, 575, -3872]
15736c872r524M92n391q798m210J9948Q465j0063Q382q33O525J6308J860K255
15722B1544p954j4925K916r29j0763O757J0580O619P229P512O821j2711M783n503
15708B1976k1027j0107R204J4797M890L09j0112r880j0088j178K779p413R7J231
15694a4522m809o822J3046J9996L201P278o330j7004p473o95J5074P094p959j5520
15680a5445q765L000N223J0130J2182M60m724j0514O724p53N950J9368J022N18
15666B4376n75O291p8Q178R936j508K210J0737J2803J3o188O054l182j4345j3765
15651D0957p098k061m987r066p535q366m88R388O945J0415Lj4688n463l129m097
15636G30M676O333K9n992l038K64j732m992N68r60o04Q665m322K027M263J307
$$ y = [-3872, -13396, -12904, -18295, -27093, -31303, -11355, -2890, -12953, -4571, -5404, 1121, 17429, 19289, 21544, 13590, -1335, 1581, 652, -10111, -3354, 7226, 13845, 21074, 28586, 35407, 22696, 27479, 21976, 949, -9158, 46, 14843, 19733, 20042, 9930, 50, -10038, -11216, -8437, -15850, -15753, -14522, -19331, -26153, -13107, 6889, 10090, 17368, 11038, -5966, -13439, -14134, 940, 8034, 75, -15445, -24210, -21210, -15987, -5857, 6325, 6785, 2061, -8453, -1729, -2482, 3468, 22836, 23858, 24376, 23801, 30092, 30014, 38192, 48128, 46620, 48830, 59567, 72370, 72383, 66195, 72249, 69067, 54722, 40957, 33859, 31798, 26811, 17745, 10210, 1844, 1356, 10744, 17689, 28104, 28107, 13419, 7956, 4827, 730, 5406, 11739, 11768, 5776, 2738, 3002, 1270, -3722, -3154, -4114, -4718, 3947, -375, 1652, 5915, 7222]
15620G222m448L243K855n648r493j7380j1163j706L391J0165l246J457Q537O839
15606i375Q507K35L804L970J3168J1390j873N482m77j2920J718m860L332n622
15592A6479M338J575r122M198K23j944r66J234m668o556k7456n446R687O146J5183
15577B905Q568p392j5786l641K817j032j5556K55J4416J0620P790K107k8240j0955
15563c3124K0201K2484J3940L156r08K518j3205j4231j0131K486P292n406O281
15550A353m732o225K419Q461K069j47q765L480j655j1968N292P853M109j4810
15536a3266m914M349L69n836K507r47M205J7833N591m430j6216q23l476m339L542
15521a5851m202n045J4624L920j1731O351Q256m710r88R304O217J2879r587m442
$$ y = [7222, 2774, 6017, 8872, 3224, -6269, -23649, -34812, -36518, -33127, -22962, -26208, -24751, -16214, -9375, -868, -633, 3171, 7141, 20309, 31699, 29826, 35308, 34831, 21911, 23629, 18769, 22101, 16479, 20817, 22392, 13270, 17468, 17691, 15747, 14781, 16015, 11347, 4791, -22665, -28111, -18424, -12278, 2905, 11473, 4081, -11705, -15346, -12529, -13561, -29117, -28862, -14446, -3826, 3964, 6071, -22169, -33124, -12923, 9561, 23501, 26657, 25749, 28267, 15062, 831, -9300, -6814, 478, -4928, 1353, -3379, -9604, -7185, 1276, 3345, 3198, -5567, -2087, -3742, -15710, -10418, -2565, 1544, -13266, -18180, -13831, -13462, -19298, -16791, -17738, -13533, 4300, 9891, 5461, -10755, -11578, -15054, -19393, -15851, -20053, -25098, -10474, -6554, -18285, -11934, -3678, -8388, -9376, -72, 6145, 19024, 9437, 4995]
15507D995m645j162J06l115k298J544N877R218J0023j5064j0568Q167j4573j1417
15493b2912N364O962j748Q976N816j0866L090R908m589J111N251r211K048J0130
15479I330K896j0189K490j2479L355o671L918J4980O19j1656L720O700j0994j042
15465e023M211J6574j0823n770k912O611m941m083K229l070j4999O054R959J2347
15451F364k805L01Q066j5382j5413j488J0028O364R38q676j0207l249L303K694
15437a9162O46J0404m082p266K3171M881r887L120N449q981L284n559n032R916
15423I02j273j713J413K846O449K496j6472K396J1457n015m034N2k275L802K899
15408C930J511j955m93O81j0117q15j035J5969O972J138m129j502L600p383m062
$$ y = [4995, 350, -812, -706, -3821, -6119, -4575, 1302, 10520, 20543, 5479, -5089, 3078, -11495, -22912, -17548, -10586, -12334, -3358, 2458, -8408, -5318, 4590, 1, 1112, 6363, -2848, -800, 9330, 12226, 2037, 4527, -7952, -4597, -11268, -7350, 7630, 8249, -3407, 313, 7013, -3981, -5023, -812, 15762, 4939, -831, -3743, 2868, -2073, -6156, -3927, -6997, -21996, -15942, -5983, 6364, 3559, 3860, 11926, -3456, -18869, -20357, -10329, -3965, -3027, -11703, -21910, -25159, -21856, -19162, -18516, -8112, -12194, -19460, 3711, 8592, -1295, 1825, 7274, -1707, 1577, -3982, -9014, 902, -371, -2084, -671, 2175, 8624, 11120, -5352, -2956, 8501, 3486, -548, -496, -2771, 1031, 3930, 5441, 3486, 2993, 3674, -6443, -7258, -8293, 7676, 14648, 15786, 11657, 10155, 13755, 6372, 2310]
15393B310o737n081R674j281m268o124K182M298o092L496L137N240l870J1640
15379H524J541m666n535l656L100j700j3751r914o577j915J0037N733q127Q02
15365b6104J2087M344J9o65m901M398l517l183M826N63k258J6421J0018q894r247
15350f093l526J8079N231k176m342M563j3550k826M725P01J155j1197N287M13
15336c556P237P786m242j1663O924K387k877P88o440n674J08q579J068N918J7694
15321F879R259q673m512O660l29K798M868o664j0840M772L902K799M599j2169
15307C349j5582P445N628k690o303o85L714J0639J1771L09n770r063K560k630
15293B692j666j637j588J656K671J596J0174l599p321j467M072n795j0833R68
$$ y = [2310, -4427, -9508, 166, -1115, -5383, -11507, -9325, -5027, -11119, -7623, -4486, 754, -3116, 8524, 10065, 5399, -136, -3792, -692, -2392, -16143, -26057, -32634, -34549, -24512, -18779, -26906, -26104, -14017, -9673, -9654, -10319, -15220, -10822, -14339, -17522, -12696, -12133, -14391, 2030, 12048, 3154, -6093, -9619, 8460, 13691, 11515, 7173, 11736, -1814, -4640, 85, 786, 1941, -9256, -3969, -3556, 3681, 11467, 7225, -4438, 2486, 4873, 1996, 2784, -3656, -9330, -9222, -17801, -16733, -10815, 6879, 16138, 7465, 2953, 9613, 9284, 12082, 16950, 10286, -554, 4218, 8120, 10919, 15518, 3349, -12233, -4788, 840, -1850, -8153, -8838, -5124, 5515, 17286, 17595, 11825, 2762, 5322, 2692, 1026, -611, -2199, -543, 2128, 3724, 13898, 10299, 2978, 1511, 5583, -212, -11045, -10077]
15279a0077J3448j517j3130j999l081l95K535j602N799n586r922p796M553J1998
15265a6772K95q762n185J127J0718j862Q04O483J6886n459M868J3625J435j1454
15251F747l948j035p84R834k187n810p3k670p416j4139n679J017O303J2309M533
15236b998K006j754l802L676J1899j632Q67j1859n966J3367o558J4485Q220m755
15222A5196o570K433R020p016q494m100q847R398j648j7821J3306O493K655R74
15208D979L702J086j4789o978P061J6969J1992r602L108n971l149q836k568J588
15194a408Q706j419q276M764N226O103L306m012j4213p637n592M424j1489r364
15180c0881J198K6727L014q566j2597J609L593l635o10J5317N511r119J154j792
$$ y = [-10077, 3371, 1854, -11276, -13275, -16356, -16751, -14216, -15818, -10019, -15605, -25527, -33323, -28770, -16772, -16477, -25239, -30424, -29297, -18579, -20441, -19637, -13154, 3732, -1727, 3141, 16766, 18201, 6747, 2799, 1764, 980, 10814, 8627, 2817, 2744, 74, -7342, -21481, -27160, -26143, -19840, -7531, -2998, -992, -2746, -6548, -2872, 9027, 7395, 8262, -3597, -9563, 3804, -2754, 11731, 19951, 15196, 8626, 11059, 20079, 13063, 4569, 469, -8378, 1020, -628, -18449, -5143, 1350, 4005, 4979, 8681, 9767, -5022, -12000, -4939, 12030, 24022, 14420, 17528, 11557, 8408, -428, -2996, -1408, 7298, 5879, -2397, 2367, 7593, 13696, 17002, 12990, -1223, -8860, -14452, -10028, -21517, -30881, -29683, -2956, 58, -8508, -21105, -19496, -15903, -19538, -20148, -4831, 680, -8439, -7285, -9077]
15166i077M394P927m194J477K149r179r359l928P085m184J161l742R323K70j3048
15151b2925J0666K560j2474L542M986m339Q995%N290J0210J2657r582k078k746
15137D762r026k929j6244J0141K0357O439p128l040M976K827j4575r142J5864
15124C282J6550M440m489O055j681k2892j4481n656k917l377J0795J1892j0345
15111a2824K798J4906P782j4485n051P803r1J2911J3213M308o196J2482M389r141
15097C2804j1840o449q762k604q814R124J1315N398k1270k1972J0810J1303k517
15084c474l404Q766l669R14P512O459j2418j525p28j8208Q460J356J824L148J810
15069c177l944K048J6580Q883j1382k0148j7235J0515J0481o789j51q200o136
$$ y = [-9077, -4683, 3244, -950, 527, 2676, -6503, -15862, -19790, -12705, -16889, -15728, -19470, -10147, -9877, -22925, -12259, -9699, -22173, -18631, -13645, -17984, -8989, -8989, -3699, 6511, 19168, 9586, 7508, 4762, -4264, -7193, -23437, -13296, 7061, 13500, 6372, 3332, 8308, 11135, -3440, -12582, 3282, 19832, 24272, 19783, 25838, 24157, 1265, -13216, -18872, -21789, -25166, -14371, -2479, -12824, -10026, 4880, 12662, -1823, -6874, 929, 838, 13749, 26962, 31270, 25074, 37556, 41945, 32804, 20964, 14515, 5753, 3149, -5665, 3459, 14774, 20172, -1098, -23070, -12260, -957, -3474, -6878, 1888, -1781, -867, 6645, 13104, 686, -839, -1567, -19775, -11315, -9959, -8135, -4987, -3177, -7121, -5073, 11507, 20390, 9008, -11140, -28375, -17860, -7379, -14168, -14319, -22519, -28655]
15056b8655J0917M229m732P985O549p008j990j1990j8255K2187R671J4043L32
15043C283L116r014j567J463k305R74m396j4534M141o253m644P124J106m737K650
15028b3593J2572K1571J261j8503o224J8433L362M757p265k732K288n608p306
15015f987l563m85k623l693O6p330J4647o977O762J0551O558O547q104l535K520
15000D354L023R15j2615o859j490M747k277k791j660j3073n685L778r450J1544
14986b7539R847j124r591N614k425R659P809k478J4273J0953L99j4693j0826J4042
14972C920P11j8284j0094J4441J1027Q403m894J2214K479n123j3631r327k747
14959a0905R151J2267k628o267O589M889k043k0903o270J2624m27R817j0780N158
$$ y = [-28655, -17738, -13509, -18241, -10256, -3707, -10715, -12705, -24695, -42950, -20763, -11092, 2951, 3283, 6399, -2615, -4182, -2719, -5024, -4050, -8446, -22980, -18839, -25092, -29736, -22612, -21506, -26243, -23593, -11021, 10550, 11811, -6692, -12916, 5517, 8879, 13636, 6371, 3639, 5927, 319, -6987, -10550, -11035, -13658, -17351, -17285, -24615, -9968, -16945, -10183, 368, 6926, 13473, 5369, 1834, 4354, 7377, 8292, -4323, -11182, -12672, -7925, -10202, -12993, -14653, -27726, -33411, -29633, -39083, -27539, -17692, -18816, -28407, -22793, -25218, -15559, -7750, -10228, 4045, 14998, 15397, 704, -10122, 3920, 4631, -13653, -23747, -9306, 1721, 10124, 5230, 17444, 19923, 14800, 1169, -8158, -10905, -1754, 10513, 7885, 1618, 8207, 13096, 11053, -9850, -16120, -3496, -3923, 5894, -4886, 272]
14945B72M038P787j0831J517L686k1085p462P497R051M888j4947k035p683l278
14931b8585J0435J5426n381q020q830N280J8538J4505O242q852r875K56j4184
14918a3045r123O692L242N152J1582O644M810J626k174k4591q470N786L816P918
14904a35P513q278M825j3152j959J91J2865J0980m939r450P787P901j440N98J502
14889A4809q343j4769q449N030J2236j3007N261m073l62n276l6M75O755J2537
14875B788K23j4319n996M849j2458J3593J495j3483l996J594O549P723J3665k49
14861A978l137o98K147R93j28l18P35N339Q523p26m541j3952L530l179l645k665
14845i744k607l095o680o900K095Q965J6617Q712m720n452J126k14PJ553N293
$$ y = [272, 4310, 12097, 1266, 2783, 6469, -14616, -22078, -14581, -5530, -642, -15589, -17624, -25307, -28585, -18150, -2724, -8105, -16125, -24955, -19675, -1137, 13368, 19610, 10758, 883, 1139, -13045, -22168, -15476, -12234, -7082, 4500, 11144, 15954, 17580, 15406, -9185, -17655, -11869, -8053, -135, 7378, -900, 3925, -9227, -11186, -10995, 1870, 12850, 7911, -1539, 6248, 14149, 12709, 13307, 14809, 6466, -8303, -16752, -11722, 514, -12493, -7232, -11305, -11667, -16943, -16979, -16504, -9749, 2788, 3011, -11308, -17304, -12455, -24913, -11320, -9825, -23308, -27304, -25710, -19161, -11438, 2227, 1978, -1159, -1857, 290, 1283, 1155, 837, 1572, 6911, 15434, 14708, 10167, -3785, -255, -3434, -7079, -9744, -12351, -15446, -22126, -29026, -26931, -17966, -1349, 7363, 2643, -2809, -1683, -1897, -1890, -337, 4956]
14830D956o59O238m298j926M364j58r567L285n720j2158M346O660r782q688M506
14815a8601O370j405j418Q88J988J207K3552O017j0937R127J753r769r699n67
14801a494J0905J684p220j6228l739M288L075j980P213k136j6757m863K72l069
14787c0049j058M17l947K261J3209J056j1762J566J814j856m221M097P289L822
14773a7362J7796Q571O374L01j818k619L724n041n261j6703j3144P788K450J971
14759a2973n38J6088N0j0216J4282N051K644o57r311p021q090o74M53R514j3868
14744a5266p065K627Q107L642n312K875K242j426O721r17J349J649m587J595R489
14729E723R836q187j5519j5882r891j04J3011J571p12N933l480j425J5096L766
$$ y = [4956, 4297, 10535, 6237, 4311, 8675, 8517, -1050, 2235, -3485, -15643, -11297, -4637, -14419, -23107, -18601, -12231, -13636, -15054, -14166, -12178, -10971, 12581, 18598, 7661, 16788, 18541, 8772, -927, -1494, 9411, 11095, 3875, -12353, -16092, -11804, -8729, -10709, -3496, -5632, -22389, -27252, -26980, -30049, -31107, -30690, -34637, -32376, -19167, -18111, -29873, -28307, -26493, -28349, -32570, -28473, -21184, -17362, 434, 9005, 15379, 15680, 13862, 11243, 14967, 9926, 4665, -12038, -25182, -17394, -14944, -12973, -13511, 2577, 2627, -7589, 6693, 11744, 14388, 13731, 4420, -2601, -10691, -11365, -10912, -1398, -15266, -22331, -19704, -11597, -7955, -13267, -10392, -8150, -9576, -2855, -3772, -2423, -774, -5361, -3766, 5723, 15559, 7372, -8147, -24029, -33920, -34024, -21013, -19442, -20154, -14221, -17701, -19126, -4030, -264]
14715b64l095j104q334l504M327O100n316j1574m158R50j752K762Q886j29J0979
14700e226L280J3398L948o228l241j1567J653o713J329j06q900q350L963N565
14686a7195M059j002M5J9748J5752j5326p881M671P317J0701m093r859o435k290
14672a788J6620J366O931n393j2068m030O58Q615k175j1340n934k465M334J876
14658d793J28q523l646R008O637j4986q46R233r532J333M754m467q168N389J6685
14643a794L25k562O677J390J820J995J3280J041j8148o033N195r06j712j562Q97
14628i7Q066j875j4945K138P465M407j2195K233o81n220M245N122j5864J132J1710
14613d359J4117L409N655p819j1893o404m28k390R304j0264N035Q902L771J493
$$ y = [-264, -3359, -4463, -12797, -16301, -11974, -5874, -11190, -22764, -26922, -25972, -27724, -24962, -16076, -16205, -5226, -1946, 11452, 15400, 9172, 5931, -5636, -3983, -10696, -9367, -9473, -18373, -26723, -22760, -17195, -13136, -14138, -14093, 5655, 21407, 6081, -1800, 2871, 10188, 20889, 16796, 6937, 502, -1788, 14832, 16198, 23129, 17736, 5668, 1638, 2296, 10911, 8736, -2604, -8538, -11003, -6669, -4793, -4665, -13188, -16834, -7826, -1189, -16175, -17021, -7788, -17320, -15987, -11233, -15700, -23868, -18479, -1794, -1469, -4031, 2646, 4036, 5856, 7851, 21131, 22172, 4024, -2009, 3186, 2280, 568, -994, -97, 7969, 6094, -8851, -6713, 752, 5159, -7036, -4803, -5484, -10704, -6459, -1337, -17201, -16069, -4359, 9758, 13167, 18822, 11003, -890, -7294, -7722, -10112, -808, -11072, -6037, 2865, 6636, 8129]
14599H129N609p995j8940j1696R751Q755j0560o89O996l980M495J3167N004j2055
14585d009j636j4679l412j644K741R068r110K97j445R934p63P31Q424R944q058
14570c617m721m120K666p636n386l435N656J3222R945M134p638l971k064l608
14556a0573m451J3879J4469r535p776n891P149N431j634j0213J20R826J596q192
14542e795j761o797m864J8290N82Q995K196r033j0931L703j740O5l543n49L757
14527g425j2380J680J6838o84j8450l30J1169q13j1927J018K99M62K371P768K006
14512h398Q247L830K347K588O889N88q205J2328Q305r810j4277l558l427P009
14498D456J534P677o536j1257k0797r77L569R570R19p047K865Q391m325o699J8388
$$ y = [8129, 13738, 5743, -13197, -24893, -15142, -6387, -16947, -17636, -10640, -14620, -10125, 3042, 8046, -4009, -5645, -20324, -23736, -25380, -22639, -13571, -22681, -22384, -23829, -13895, -14658, -13927, -5503, 4441, -3617, -8338, -12458, -9792, -17428, -22814, -26249, -20593, -7371, 2574, 6708, -930, -4901, -6965, -10573, -15024, -1145, 13324, 3789, -3987, -9878, -2729, 2702, 1068, -9145, -9025, 801, 2397, -5795, -7556, -14353, -19217, -927, -345, 8650, 10846, 1813, -9118, -5415, -7155, -7090, -10633, -11182, -7425, -19805, -18125, -1287, -1971, -20421, -20751, -9582, -10395, -22322, -21304, -21005, -20543, -18172, -10404, -8398, -151, 3679, 6026, 8614, 15503, 16091, 7886, 20214, 28519, 18709, 4432, 874, -2553, 4456, 5990, 13667, 7131, -4126, -24923, -25900, -22331, -12761, -11842, -18889, -16024, -7633, -11958, -18657, -269]
14483b69M72r742m011j568P731J2388L523o491J7120Q835j3226j358J156q949
14469E611j9599k192p724Q129J7334N401j0427n268N051N198R981p034n313L499
14455B647j0493l089O396m970l622K67J6403K618j1529M593J0556N097N812j882
14441A8804O536l678r114o672J443j466n733r837N004J3411O347R576k382J7880
14427D0119k219j9078j9211n0n143j674m939K263l09r59M700k54O862J0136J1562
14412B1806j0477j559K154q645n274N16J2090K930p444J0994N376p244q701j0631
14398d109O951Q691O556O293K530o770M594K377Q283n687m553K456q468P010Q948
14383C5102L450q096j1953m234j0177O264O136k665L01K725l257j2868p67l441
$$ y = [-269, 203, -9539, -13550, -15118, -7387, 5001, 8524, 2033, 19153, 27988, 14762, 13404, 14560, 5611, -13988, -16180, -23904, -15775, 1559, 6960, -3467, -8735, -3684, 1514, 11495, 4461, -852, 2647, -7846, -10935, -4539, -9509, -13131, -12864, 3539, 6157, -5372, -779, 9777, 14874, 20686, 18804, 25340, 21662, 12548, 5876, 7319, 5853, 120, -9717, -4713, 8698, 15045, 24621, 22239, 40119, 37900, 18822, -389, -439, -5582, -7256, -12195, -9932, -10241, -11200, -6500, -6754, 108, 10244, 21806, 11329, 9770, 11924, 3279, -1995, -1479, 10611, 13541, 6097, 17091, 22467, 15223, 6522, -4109, 2842, 11533, 18089, 24382, 26912, 20142, 24736, 27113, 35396, 29709, 25156, 27612, 19144, 26154, 35102, 38552, 30456, 18503, 14269, 4092, 10356, 16492, 13827, 14128, 16853, 13596, 728, -39, -3480]
14369c480N871J0347l545m792L010P445n791r101p731J1029N513j4964q15R805
14355B801K3950K0244O194N470L453m631j0627q537n180l46m274J1761p802J246
14341C3722j2641n467O67j603n734k7363k532J5048R349R443l313j4323M070Q149
14327G472q084m500r60O486K0776l117m535N313l490Q11L766m549L811r456L757
14312A3501R944j235n745J0832L616m387m552P346p805p044m424r843Q479L626
14298A2309q559R01o434m510L091n513N190l945R996k302M594J4460P475j3348
14284A3405k0405J0597J9404M535j0578J872J0878j110j417k636k366k428N844
14271B5595K558j5340r430J6725J8985N567r479N092k415j7389P675n479j9721
$$ y = [-3480, 2391, 12738, 9193, 4401, 7411, 14856, 9065, -36, -7767, 3262, 8775, -6189, -7004, 2801, 26751, 46995, 53189, 58659, 62112, 57481, 46854, 38317, 33137, 32791, 28517, 40278, 32476, 33722, 21081, 15614, 16281, 14678, 8944, -18419, -20951, -5903, 3446, 12889, 9576, -4747, -677, 7472, -612, -5112, -6072, 414, 21190, 18073, 13538, 18851, 15361, 16172, 19938, 15389, 19200, 9744, 13501, 23445, 22210, 16465, 27297, 30913, 26526, 21974, 29320, 21515, 14471, 10047, 204, 8683, 12309, 3750, 4651, -1783, -6293, -3202, -8715, -3525, -7470, 2526, 224, 4818, 19278, 26753, 13405, -7000, 3597, 23001, 27536, 16958, 18830, 29708, 28598, 27181, 24545, 22179, 19751, 25595, 28153, 12813, 3383, 20108, 39093, 44660, 35181, 40273, 37858, 20469, 28144, 22665, 2944]
14258B944Q272J1829j3654r122N03N737N55o638Q323J2188L357j1720j4078j0528
14244a2032R661O135l955m704P500o304m10M791Q91m560j0103K295K667Q265R239
14229I376P336j6175L799q913J6132O864r443p295N604J0969K525l344J97Q541
14215B6173j6518p28m328j4317n957l780J1055R784j991o733n257J3796k375Q929
14201G753R339m083j1930n280k03j250O870O293o882r914j95Q854n51J371J1139
14186A1331K746N729j1545k436l090j3891n057R198J1496j3732k0455J8376K6366
14173A5036R460K678J541j0320l050r560o761n58O223j201q372J043L708q645
14159h778p488R373L620J0010O94L108J0468M618N599P924j9251j4695q802J3953
$$ y = [2944, 11216, 23045, 9391, 269, 772, 6509, 7064, 426, 8749, 20937, 24294, 12574, -1504, -12032, -2371, 3764, -191, -4895, 2605, -3699, -4109, 682, 1573, -2987, -13090, -10795, -8128, 137, 9376, 16712, 537, 4336, -4577, 11555, 18419, 8976, 1681, 7285, 18254, 20779, 17435, 17632, 26173, 9655, 8927, 4599, -9718, -15675, -19455, -8400, 1384, -607, -7340, -12597, 1199, -1176, 7753, 17092, 13009, 1079, -4201, -4404, -5654, 1216, 7509, 627, -9287, -9482, -628, -1179, 192, 11331, 14077, 19806, 8261, 5825, 2735, -11156, -16213, -7015, 4481, -9251, -29706, -11330, 15036, 24496, 27174, 28715, 18395, 15345, 5785, -976, -1534, 4689, 3488, -4884, -3841, -133, -8778, -16266, -6893, -3273, 6737, 7431, 10539, 21007, 25625, 31224, 39148, 19897, 5202, -3600, 10353]
14145A0353l159k004j889J386J2066O197P914l402k0081o156Q002n179j770j5731
14131a3453j14N979J2510R213j4166o480N355J2531P140n259n986r764j6069N685
14117a2878J4440M964K794O02K261j313K508k953R7j1618N496K976r692k069k598
14102f983J485K356K527J5445q43J368O669l609j2400m609m095j422j5835O54
14088a9292P495n831k787q702L49K0257R751p108P86J2269l270p810R13j4251
14074a7231M712Q003J1643J5330j2721j2126r202Q857J6607P848j2303p113O310
14061H614O903J620l508o903j2584j1718m377j371J3613K4406K400J6568L883
14048C7546r099N942k526p331p840M023q594N934m441m839J3782o74j2369q257
$$ y = [10353, 7194, 5190, 3301, 4687, 16753, 22950, 30864, 27462, 7381, 1225, 9227, 4048, 2278, -13453, -13567, -7588, 4922, 14135, -31, -6511, -1156, 11375, 18515, 13256, 7270, -2494, -18563, -12878, 1562, 6526, 9320, 9922, 12183, 10870, 13378, 10425, 10522, -1096, 4400, 7376, -2316, -4385, -6983, -5498, -3142, -615, 14830, 13987, 15355, 22024, 18415, 6015, 1406, -2689, -4111, -19946, -19292, -11797, -17628, -20415, -29117, -28768, -8511, 1240, -5868, -5082, 7187, 3917, -3893, -2980, -17231, -12519, -4516, 7127, 22457, 9736, -2390, -11592, -2735, 13872, 21720, 9417, 2304, 8614, 15517, 17137, 13629, 6726, -5858, -17576, -21953, -23324, -9711, 14695, 17095, 33663, 37546, 28447, 34389, 31863, 24532, 16692, 20715, 12121, 18055, 13614, 8775, 22557, 21883, 9514, 1257]
14034A257p372Q588R990K860L9j3377L360P514M276q912l922M940R046J7909J201
14019C7397O298K364j719m61K092R887Q48q659o14N004n114k088M184O171m055
14004E1535j2989n558K729N463L52j2707l725l613K10K22q843Q35O465l188m257
13989A2931k06p147m878R322J9829N334J2242K980j893n502l777J1259J7002J7311
13975H4807m162j9059P801J0991J841k680J7213K7728J0375L0083L5760L8011
13963B38709M7167P3223Q8043J07058J20012J35466J24122J04016P7942N4232
13953A169990J8514m4454n8647q3763j11188j19772j27495j09875r0429q4167
13943C58714o2912m6423n6938k8553k3427j4664j6059k3135j5612j7623j0216
$$ y = [1257, -6115, 2473, 12463, 15323, 15362, 1985, 5345, 12859, 17135, 8223, 4301, 9241, 18287, 36196, 37397, 43695, 46059, 44340, 43879, 45971, 55858, 56706, 48047, 47433, 52437, 47323, 45235, 49419, 55590, 51535, 38546, 32988, 35717, 41180, 41532, 28825, 25100, 21487, 21697, 21919, 13076, 13911, 20376, 17188, 12931, 12725, 5578, 700, 10022, 29851, 35185, 47427, 50407, 48514, 43012, 39235, 50494, 67496, 84807, 80645, 61586, 69387, 80378, 82219, 79539, 96752, 124480, 134855, 164938, 200698, 238709, 285876, 359099, 447142, 554200, 674212, 809678, 933800, 1037816, 1115758, 1169990, 1188504, 1144050, 1085403, 1001640, 890452, 770680, 643185, 533310, 442881, 358714, 295802, 249379, 192441, 163888, 140461, 125797, 109738, 86603, 70991, 53368, 43152]
13932D3152j495Q536L054j6057j0836l030M07J127p451K067K826L20j0313k045
13918A0262J9621R139M335r709j2275N49j7712j0901L258Q894L463K044n541j268
13904D159J6489J8999P891j0889j2994p066L301O482j359R50m715Q308n430j4847
13890I279j361M558M421n275r302J990R179P363N721j1846n120n353l95p197K7601
13875B4263J5894M661m262l091J0612O91k2394q204o056O300J0353R615Q907J0812
13861E8101m851m286m479R189K411R586l013L337J3136J8035K3876M6345M2999
13848B10386N4810N3433O0495P9153Q2575Q0981P9157O8754M9982K4793M092j2443
13836H36168j9445n5206p4288o3975o3984p0161q1662q0477n9138n5749m5912
$$ y = [43152, 41657, 50193, 53247, 37190, 26354, 23324, 23731, 24858, 17407, 19474, 22300, 22620, 12307, 10262, 29883, 39022, 43357, 33648, 21373, 21922, 4210, -6691, -3433, 5461, 8924, 10968, 5427, 4159, 20648, 39647, 47538, 36649, 23655, 16589, 19890, 26372, 25013, 25963, 21248, 29556, 24126, 9279, 7918, 12476, 16897, 11622, 2320, 4310, 13489, 20852, 26573, 14727, 9607, 4254, 3859, -3338, 24263, 40157, 44818, 40556, 37465, 48077, 48768, 26374, 18170, 12114, 18414, 28767, 38382, 47289, 58101, 53250, 48964, 44485, 53674, 56085, 65671, 62658, 65995, 79131, 97166, 121042, 167387, 210386, 265196, 318629, 379124, 458277, 540852, 621833, 700990, 769744, 819726, 844519, 848611, 836168, 816723, 761517, 687229, 623254, 559270, 489109, 407447, 326970, 267832, 212083, 166171]
13825A66171j4702k6742j1516r406o413q052p397j2975p072q616k237q013J391
13812D4421K63j861j0544J1899J8162j5054k7085o227L082l361J664L40J2342
13799B8041J2661J5960p336j659l431p831m559k774N99o286n89R317N871N199
13785D3183k33J1075n845l3919K174J1274K895n012N98L434l899j3325O94O904
13771A9998l571j1069l406J5414O267l227J24m451j0551P197p995k279O849o055
13757C245nk018k230j339K060Q809J5166k203j293q160j14P928N63K432r942l451
13741I448n918J237l787M325k785l180p19J0694j527J883J1996p5j1536r284j4485
13726a3713J144J498J2227J5073J1423K840j6956K856J9840m439j7197j0611J49
$$ y = [166171, 151469, 124727, 113211, 103805, 97392, 89340, 81943, 68968, 61896, 53280, 51043, 43030, 44421, 44684, 42823, 32279, 44178, 62340, 47286, 20201, 13974, 17056, 13695, 15359, 15699, 28041, 40702, 56662, 49326, 47667, 44236, 36405, 31846, 29072, 29671, 23385, 22796, 32113, 37984, 43183, 42950, 54025, 48180, 14261, 16435, 27709, 30604, 25592, 26190, 29624, 25725, 12400, 13094, 19998, 16427, 5358, 1952, 17366, 23633, 20406, 20530, 16079, 5528, 12725, 4730, 2451, 9300, 3245, 3240, 1222, -1008, -2347, -287, 8522, 23688, 21485, 20192, 12032, 11918, 19846, 20409, 22841, 12899, 9448, 3530, 4767, 980, 5305, 2520, -660, -1379, 9315, 7788, 9671, 21667, 21592, 10056, 772, -13713, -12569, -11071, 1156, 16229, 27652, 30492, 13536, 16392, 36232, 31793, 14596, 3985, 4134]
13713D134J2511J0462r640j670M223m017k877j240j147j101M590Q104n982n539
13699A0811p250R33P269N707j098N828n744j487p789p307J784K625j118J2059
13685A5223q598J237O32r539j2971J0381M156L504K643l582m283j5712K172P128
13671g609N603K754l461N022j750P195m425o113J2664P907n137r916r507j18n282
13656a2173L963J5830J0975r650P851J3928n498m930j1864J473j0636j0708M050
13643g389l11L40J4436L357q299j2965m152J2448J1457n130M956J4893m540q518
13629A0583P000O341M808N124o989j5490j1709j7424O128J0142l774P20J2403
13616G863J7381n723j438n236l606K768J0K564j3151L632j3326K566n238K549
$$ y = [4134, 16645, 27107, 17467, 15797, 20020, 16003, 13126, 11886, 10739, 9638, 14228, 22332, 16350, 10811, 3561, 4494, 11763, 17470, 16372, 22200, 16456, 14969, 7180, -127, 1657, 4282, 3164, 15223, 6625, 7862, 8494, -1045, -14016, -3635, 521, 4025, 6668, 3086, -1197, -16909, -14737, -7609, -2006, 748, -2713, 2309, 559, 7754, 3329, -2784, 9880, 17787, 12650, 2734, -6773, -6891, -12173, -8210, 7620, 18595, 8945, 16796, 30724, 25226, 20296, 8432, 9905, -731, -11439, -7389, -7700, -7360, 7076, 10433, 2134, -10831, -14983, -2535, 8922, 3792, 8748, 23641, 19101, 10583, 17583, 23924, 28732, 33856, 26867, 11377, -332, -17756, -11628, -1486, -5260, -4540, 7863, 25244, 19521, 18083, 12847, 9241, 12009, 12019, 14583, 1432, 5064, -8262, -5696, -10934, -8385]
13602h385J0226R234J8857J2406k2005r763m442j681p270O524R62j7947j5622
13589b8906Q434P773R716J5360O245N44l180j8567j0298k47o16p884K29J777o483
13574b6103j1976R619R836N393J0739R015N983J0426K624o318n591n479M039M96
13560A2703j2749K87J0119j0441m93j1093j0441J3481K2445N308p818J8120J0397
13547C9825J223k0974j2670r235n224J499L332j1079j0402L888o98k762J1613
13534a1664N710J658L227j645k037N866k012J948P139O337M877K43N422q64r155
13519A5050k841n39l460j824j404k141L883k906J3646N166K811L141J5006J164
13505D4752k0341j9825P190J0572K819n408n97l103k540p093J7170N973j0679
$$ y = [-8385, 1841, 11075, 29932, 42338, 20333, 10570, 6128, 4447, -2823, 3701, 4663, -13284, -28906, -20472, -12699, -2983, 12377, 18622, 19166, 15986, -2581, -12879, -13126, -13742, -21626, -21397, -19620, -26103, -38079, -28460, -18624, -13231, -2492, 6523, 12506, 22932, 25556, 19238, 13647, 8168, 12207, 12703, -46, 241, 10360, -81, -574, -11667, -22108, -8627, 13818, 19126, 11308, 29428, 39825, 41048, 20074, 7404, -1831, -7055, -5556, -2224, -13303, -23705, -19817, -20515, -23277, -11664, -5954, -4296, -1069, -2714, -4751, 1115, -897, 1051, 8190, 14527, 19404, 19647, 25069, 24205, 15050, 12209, 11670, 8210, 6386, 4982, 2841, 6724, 3818, 17464, 22630, 25441, 28582, 43588, 44752, 24411, 4586, 11776, 22348, 25167, 19759, 19162, 16059, 13519, 6426, 23596, 29569, 18890]
13492A8890l444L600m227m198N111q52J0322R35o009q161N777J298j786j5427
13478A829J932J3917P435k7589j2220J0579K0748l416M47r442k963J789r87r732
13464g673l024j2622r793J1602R155j89L932J640r199q716o461K8649J4233K817
13450A4351L134j5347j2826P646J7500p237m793r065j0186r189J2195P046Q348
13437A577p6r942N093Q535k917j2682k234J3339J0191Q050J0697L377p307q517
13423A7184j7085n96J5399J740Q80J524p5m101j2726O685R045l843l838l218j0928
13408c953P496J2566L386M900r432m491J4356J623LK331o059q086L798J0611n654
13393B3395J474J1920J041m305j1693k1026r774m411M791k620M286m89J2414m305
$$ y = [18890, 15446, 19046, 14819, 10621, 15732, 14880, 25202, 26137, 20128, 11967, 17744, 19042, 17256, 1829, 3761, 17678, 25113, -2476, -14696, -4117, 16631, 13215, 13662, 4220, 1257, 3046, 2059, -7673, -10697, -23319, -33112, -21510, -12355, -12544, -8612, -6972, -16171, -24887, -31348, -2699, 11534, 14351, 17485, 2138, -10688, -3042, 14458, 7221, 2428, -6637, -16823, -26012, -13817, -6771, 1577, 1501, -8441, -3348, 5187, 2270, -10412, -12646, 693, 10884, 18934, 29631, 33008, 25701, 17184, 99, -497, 14902, 16642, 17522, 19046, 18971, 14870, 2144, 8829, 17874, 14031, 10193, 6975, -3953, 3543, 16109, 19495, 24395, 14963, 10472, 24828, 26451, 26454, 28785, 22726, 14640, 18438, 29049, 23395, 24869, 36789, 37830, 33525, 21832, 806, -8968, -13379, -8588, -11208, -6922, -7411, 5003, 698]
13379F98M414J2734J172j1462p19L115O02j6033j0491Q029L53J809M554n953R598
13364B420J5754m432j3225r048J328Q229P537n877L155R10L158L144L441J755
13350A8249o802r214k540R53m387j0595J0040M714J740J892N180K902p539l509
13336A084J9468N705o649q382n204P937R773Q113q25n990K387j2437J931K892
13322A9803J228q057j158J583q140L083K0103L491l932n867n235p576k254M181
13308A1253Q093O476O907K061j3014j2812r242p876j2925J0790J3264K158O336
13295A1469R036r819j4389M524k59q135K91M47O012J2117m356o816K032J3591
13281A5745j087P657P720Q287J332l964k053l022l117J795R164m872p931R472
$$ y = [698, 5112, 17846, 19018, 7556, 6837, 9952, 10554, -5479, -15970, -7941, -7588, -5779, -1225, -7178, 2420, 18174, 13742, 517, -8531, -7203, 1026, 8563, 2686, 5841, 6751, 9909, 13053, 16494, 18249, 11447, 2233, -307, 646, -3741, -14336, -4296, 418, 2158, 4050, 9230, 12132, 4593, 1084, 20552, 26257, 19608, 11226, 6022, 13959, 23732, 31845, 31020, 25030, 27417, 14980, 16911, 19803, 21031, 12974, 11816, 13399, 5259, 8342, 28445, 31936, 28004, 22137, 16902, 9326, 7072, 11253, 19346, 25822, 32729, 34790, 21776, 8964, -278, -8154, -21079, -10289, 2975, 5133, 11469, 20505, 10686, -3703, 821, 562, -7573, -7282, -6835, -823, 11294, 6938, 122, 2154, 15745, 14658, 22315, 30035, 38322, 39654, 35690, 33637, 30615, 27498, 29293, 38457, 33585, 25654, 35126]
13267C5126J2189j0766p426j1598l535O970m954J796N971k15q151l04l464k782
13253H857P92j5207R427J5806k202j168M179l080l128J8200J2608l66j6475j0783
13239A7460j719R264J50N89m133k1676o045q44L758N21P26m65j950r007J3467
13224I6M778O489p46J7030l981j3249p25Q260M170L132Q73P120P683J2958N810
13209E9698q891m844q213q822J1373m44o08N707n516J309O715k823N558K0262
13195G0461J3100J8800K9948J8529j362j4235k6260j5883j0918j0381l100n26
13183F8173J115J0792J1274J7070J1027J2152K0775J3051N232m799q585j3939
13171A43338K650K025j269p073k2438m0195q475n537n070M775J536j0522o565
$$ y = [35126, 47315, 36549, 29123, 17525, 13990, 20960, 16006, 17802, 23773, 23558, 15407, 15103, 11639, 8857, 9649, -5558, 3869, 19675, 17473, 16305, 20484, 17404, 14276, 32476, 45084, 44718, 28243, 17460, 15741, 25005, 25155, 25744, 21611, -65, -6110, -6954, -3196, -2675, -1949, -2414, -4364, -13371, 96, 4874, 11363, 10617, 27647, 23666, 10417, 9692, 17952, 22122, 25254, 26127, 33247, 40930, 53888, 59698, 50807, 45963, 37750, 28928, 40301, 39857, 39249, 44956, 39440, 40749, 47464, 44641, 50199, 70461, 83561, 102361, 132309, 150838, 149476, 135241, 108981, 93098, 82180, 71799, 68699, 68173, 69288, 80080, 91354, 108424, 119451, 131603, 152378, 165429, 170661, 165862, 157277, 143338, 145988, 148013, 146744, 139671, 117233, 77038, 68563, 63026, 57956, 62731, 64267, 53745, 47180]
13158D7180m078N469J483l148J8588k466J636K5427M2207N9038O4494L5711j1940
13145B79601l6345m5883n7520l6286j5829J847k2472j3484l77o074p206K945o334
13132C6583k323N310K197q258r977j2811O161K527j433J3135k782J671L937l65
13118C3572j010M64N367k078k78K803l865k056K475J573N330J3839L2835N6669
13104A45640M9616N8247L6408o111l5534m3248n0660l6570k1606j0094j2676j0559
13092F2853j3097j9757n128n141r545J1364J5472N950j913q272O91J3902R525
13079E6904L440K60N018j8946j0557J2510l079k168j331r066J7808J2553R46n456
13065E8836P389j557Q1R050K2563L5446K1508J1432K8000K2845L3527M1497K0685
$$ y = [47180, 43102, 48571, 50054, 46906, 65494, 63028, 64664, 90091, 132298, 191336, 255830, 291541, 279601, 243256, 197373, 139853, 103567, 87738, 89585, 67113, 53629, 53252, 47178, 39972, 42917, 36583, 34260, 39570, 41767, 33509, 23532, 10721, 16882, 19409, 17976, 31111, 28329, 30000, 33937, 33572, 32562, 33026, 38393, 36315, 36037, 38840, 34975, 32919, 35394, 36967, 42297, 56136, 88971, 145640, 195256, 253503, 289911, 283800, 248266, 205018, 154358, 117788, 96182, 86088, 73412, 62853, 49756, 29999, 24871, 19730, 10185, 21549, 37021, 42971, 41058, 32786, 33477, 47379, 56904, 60344, 60604, 65622, 46676, 36119, 48629, 45550, 43382, 42051, 32985, 50793, 63346, 64292, 58836, 66225, 64668, 64749, 73799, 96362, 131808, 153316, 164748, 192748, 215593, 249120, 290617, 311302]
13052C11302M3402O7177P0531P9232Q2740O5132L3434M158k8487n5944p7906q6876
13040E07895q6223q2346o2750n7907l6226l4259k5890j0846m840q045j7902q440
13028G2221p222q822j809q630m241O047o162r314J0567R514p704l103r15K200
13014D2627n995o050k719q025j360J7623J2683L351R2K770l688j9186J3318J7425
13000F2866j4526r980k270l14K27j162o841o693K0180N114L699p51n752Q213J5524
12985F7534O6r991j3227M684J451j6980o158R346k726r087j5843K275O188Q963
12971B6495K1925M311K43N241J119k05J71O92k312O05J4338j5018n011P233p550
12956E2277q347l518p321J3364k679o387M817J1435m745j3215N899J779R881J2417
$$ y = [311302, 354704, 421881, 492412, 571644, 654384, 719516, 752950, 757108, 728621, 672677, 594771, 507895, 421672, 339326, 276576, 218669, 182443, 148184, 122294, 111448, 106608, 98563, 80661, 72221, 64999, 56177, 54368, 45738, 41497, 47544, 41382, 32068, 42635, 52149, 44445, 41342, 40427, 42627, 36632, 30582, 27863, 19838, 18478, 36101, 48784, 52135, 52227, 54997, 51309, 32123, 45441, 62866, 48340, 38360, 36090, 35776, 36003, 34841, 28000, 21307, 41487, 46601, 50300, 49549, 43797, 52010, 67534, 67600, 57609, 44382, 49066, 50517, 33537, 27379, 36725, 33999, 24912, 9069, 11344, 17532, 26495, 48420, 52731, 52974, 58215, 59334, 59129, 59300, 59992, 57680, 58285, 72623, 57605, 52594, 59827, 52277, 43930, 40412, 33091, 46455, 43776, 37389, 42206, 53641, 48896, 35681, 41580, 43359, 53240, 65657]
12942F5657r741J1522q407j5706J1748L578N077o744k337M67N309n67p255r982
12928D2619M557o076K534J1773K913p060q580J583R113n96n751k435O82j0739
12914C4537j4783j8911J1514J2094M69O643P395o050m383j336J698J1334r251
12901C0970p812M796R804j3988j0587J4374J4564Q679K576N401J2712j8873k8569
12888B4047L018L257Q273J3850K9352R914J6964K6109J0424n641r227J627J446
12875A33413l19o068j0693j5615j7823k0354O444N960o503n485L632m944O256
12862F7901j581k859j2782r79K0550n206j2583k87M291K636J1015O35j8841J5805
12848F7715J6022N511Q3p308j1404l216l093n379P583j016j2744j159Q09n1L527
$$ y = [65657, 55916, 67438, 59031, 43325, 55073, 58651, 63728, 56984, 54647, 55114, 60423, 59856, 52601, 42619, 47176, 41100, 43634, 55407, 58320, 51260, 42680, 44263, 53376, 52780, 47029, 44594, 45276, 34537, 19754, 843, 12357, 24451, 24920, 31563, 38958, 32908, 28525, 27189, 28887, 40221, 30970, 23158, 27954, 37758, 23770, 13183, 27557, 42121, 50800, 53376, 58777, 71489, 52616, 24047, 27065, 30322, 38595, 52445, 81797, 91711, 108675, 134784, 145208, 139567, 130340, 131967, 133413, 133094, 127026, 116333, 100718, 82895, 62541, 68985, 74945, 68442, 62957, 66589, 61645, 67901, 66320, 63461, 50679, 49700, 70250, 65044, 52461, 52174, 56465, 59101, 70116, 70751, 51910, 67715, 83737, 89248, 89331, 82023, 70619, 67403, 64310, 58931, 66514, 65498, 52754, 51595, 52404, 52353, 55880]
12833E5880o55R079n11J295J118K91J101J0416Q46k178N722j281k145Q66j240
12818G8604O349J2551K3572K777P483J2205p547p451q064K103k284o117K723J3238
12804A30142j899j8141m808J0708l803J792o546k955P773O617N804m222j5209
12791A05253r191r927O379K2043J41n635k290J859j637k064k895j3702J245L136
12777I2715O550M60k720j3513j5450N384K2023J606j6219J240J4580J0174R51
12764A07781M997Q124o186k731P056J2723K5911O123k433K5745K7067L3298M3618
12751B91093M9100K8303O505J3220R994L844j0847l9436m1893l5632k3029k6616
12739B24606k8908j5413l782n063p804M766J42r581j3793r447m605Q665R25J4575
$$ y = [55880, 55225, 64304, 63793, 65088, 66206, 66497, 67598, 78014, 78860, 76682, 82404, 81123, 78978, 79844, 78604, 84953, 97504, 121076, 123853, 131336, 143541, 135994, 128543, 120479, 122582, 120298, 114181, 116904, 130142, 128243, 110102, 105294, 116002, 112199, 113991, 107445, 104490, 112263, 118880, 124684, 120462, 105253, 96062, 86135, 92514, 114557, 114698, 109063, 106773, 108632, 106995, 104931, 102036, 88334, 89579, 92715, 99265, 99725, 97005, 83492, 68042, 73426, 95449, 97055, 80836, 82076, 96656, 106830, 107781, 112778, 120902, 114716, 111985, 119041, 131764, 157675, 163798, 161365, 187110, 214177, 247475, 291093, 340193, 368496, 375001, 388221, 398215, 402059, 391212, 351776, 309883, 274251, 251222, 224606, 195698, 180285, 176503, 171440, 163636, 168402, 168544, 158963, 145170, 135723, 131118, 139783, 140708, 155283]
12725A55283K1317J2368p576J0135J7745J8414K5572J3512M48k2670j4238l235
12713B27075r833r666J2268R684K914n632J4437J7734J2568J64J4744J9728J8851
12700C25036P367P917J6590K5561K9200M3551L9916L6888L6826L9336L0480J177
12688F39845r269j7585j2642j6858j6477m437r469k0858m936O948R664J5133P312
12675E66371J8544M1040K6151L2979L1039L6085L2647N2363N9001N0963N4061
12664A001244O8223N4229L6267L6098N7982P1850O7946Q5352R7402J09730J46799
12653A833122J68930K02945K20993K43109K62349L26754M07822M94539N81766
12644D742329O75592P82860Q60443R48614J065635J180334J376321J736626K340037
$$ y = [155283, 176600, 188968, 181392, 191527, 209272, 227686, 253258, 266770, 267218, 244548, 230310, 227075, 217242, 207576, 219844, 229528, 232442, 226810, 241247, 258981, 271549, 271713, 286457, 306185, 325036, 332403, 340320, 356910, 382471, 411671, 455222, 495138, 532026, 568852, 608188, 638668, 639845, 630576, 612991, 600349, 583491, 567014, 562577, 553108, 532250, 527314, 534262, 543926, 559059, 566371, 584915, 625955, 652106, 685085, 716124, 752209, 784856, 837219, 896220, 947183, 1001244, 1069467, 1123696, 1159963, 1196061, 1254043, 1325893, 1393839, 1479191, 1576593, 1686323, 1833122, 2002052, 2204997, 2425990, 2669099, 2931448, 3258202, 3666024, 4160563, 4742329, 5417921, 6200781, 7061224, 8009838, 9075473, 10255807, 11632128, 13368754, 15708791]
12635A5708791L376835N014140P399948J0281446J3073985J5213997J6298957
12628H6368099J5976012J3779486R710389M385395j383620p018766j1794111j4868726
12620I5154158j5957438j5483569j3916042j1597874q899476o357332m394683
12613A8547744l044869k168377j633314j320686j141911j044701r67685q86176
12605F340025q26799p27778o09421n13968m14755l21947k56529j99324j54029
12596B315475j21105j21741j07739r7228j02888j09353q1054q0204p9941q9841
12586A324381p6631n7627o6710n4051k7713m2531k5043k3615k3132l1293j9148
12575H76887j4225m772j3120k0761J3760Q763J1055L2902l236p311Q252j0797
$$ y = [15708791, 19085626, 24099766, 31499714, 41781160, 54855145, 70069142, 86368099, 102344111, 116123597, 125833986, 130219381, 128835761, 121816995, 110022884, 95154158, 79196720, 63713151, 49797109, 38199235, 29299759, 22942427, 18547744, 15502875, 13334498, 11701184, 10380498, 9238587, 8193886, 7226201, 6340025, 5513226, 4785448, 4176027, 3662059, 3247304, 2925357, 2668828, 2469504, 2315475, 2194370, 2072629, 1964890, 1867662, 1764774, 1655421, 1574367, 1494163, 1414222, 1324381, 1247750, 1190123, 1123413, 1069362, 1041649, 999118, 974075, 950460, 927328, 896035, 876887, 862662, 857890, 844770, 824009, 837769, 846532, 857587, 890489, 887253, 879942, 888194, 877397]
12563H77397k2025n0332m5018m2367k8153j9207j3937k3044j9516q816P723n579
12551F07126k1510j4620n118p527l969j778J23J5840K1681J1330K8815J1709J896
12538F43998R378K6916L974j3473k4885l1616l6500k4358l4539k5273j961N835
12526D97496L332N56k1573k8634k2942j3505K198j2611j0518j1287k534q75j2213
12513C66890q161p182M06j2981j0246L934J3703P659K8085L7578P2204J08557
12501F00446J41626J96348K35425K00776J24790k1655j62832k23402k13041j65426
12491G13055j20180r4453n6504m2740l5013k3399N61K333J9949K1394K6549j1418
12479D00134m7676n6411l7191k1282l0092q988K35J4399Q15p603q137r103L017
$$ y = [877397, 855372, 805040, 760022, 717655, 689502, 670295, 656358, 633314, 613798, 604982, 612705, 607126, 585616, 570996, 565878, 558351, 554382, 552604, 552727, 568567, 590248, 601578, 630393, 642102, 643998, 653376, 680292, 684266, 670793, 645908, 614292, 577792, 553434, 518895, 493622, 491661, 497496, 500828, 501384, 479811, 451177, 428235, 414730, 416928, 404317, 393799, 382512, 379978, 379103, 366890, 358729, 351547, 351953, 338972, 328726, 332660, 346363, 354022, 382107, 419685, 491889, 600446, 742072, 938420, 1173845, 1374621, 1499411, 1477756, 1314924, 1091522, 878481, 713055, 592875, 498422, 441918, 399178, 364165, 340766, 341327, 343660, 363609, 385003, 411552, 400134, 352458, 296047, 258856, 237574, 207482, 198494, 198729, 213128, 213943, 206340, 198203, 189100, 192117]
12466A92117J7070Q419n199j2901n223R534L456J6930n808j795J2171J3009K5713
12453B67493M0234K6046K6943K5848K4038O482j6919j5455k2423k5289l3099j7786
12441B86113j0843r622R432J2195K7615J8118m1069o3744n1218j3722j4377j9844
12429A29034k3205m361K08m085j667R706K851M144r593j1625R348P199n717j67
12415A02070m122q29M926q598k853q178j3950M04j3650k241M528L980k235J6245
12401G5497J1172q997p941L552Q932K1020J0520J2938J8831J9287K622j4525j9092
12388A33816j7099q742j2355j3354o386L758k444J4643J3792n20j1100P96k864
12375I1941O420N781K009K335K215L290k550R121K0192m99j1243r838J581n628
$$ y = [192117, 209187, 217606, 212407, 199506, 194283, 203817, 207273, 224203, 218395, 216600, 228771, 241780, 267493, 307727, 333773, 360716, 386564, 410602, 417084, 400165, 384710, 362287, 336998, 303899, 286113, 275270, 265648, 275080, 287275, 314890, 333008, 291939, 228195, 176977, 163255, 148878, 129034, 105829, 101468, 101676, 97591, 95924, 105630, 108481, 112625, 103032, 91407, 100755, 107954, 102237, 102070, 97948, 97119, 102045, 93447, 90594, 82416, 68466, 68870, 55220, 52979, 57507, 61487, 59252, 75497, 86669, 77672, 69731, 73283, 82215, 103235, 113755, 126693, 145524, 164811, 167433, 152908, 133816, 116717, 107975, 95620, 82266, 75880, 79638, 77194, 91837, 105629, 105109, 94009, 94805, 91941, 98361, 104142, 106151, 108486, 110701, 113991, 111441, 120562, 140754, 140255, 129012, 119174, 120755, 115127]
12361A15127K729m763k460j4193j6470j482J1362k591k260q968j4121Q497R842
12348H0249l249P276o175J327R283J0430k450k5166N892J0171n327j759n786l664
12334G1052q71O195n059j0923m167n368L493j071r48O142J4810j1676j6772n658
12320C9179K388J905o210L293r774m39m156Q71m751n076M777J7378J0744q105
12306D2024m125o462k393k281r39k932O847L441j2274j741J0303j532j3305P261
12292B1892m079O523M086q959j2027r208j2632Q615J4516O481j634O469K940N681
12278B8664J1068J47j602J6698K160J3572J4853L30j0127j4219m987j102r388
12265D6067N55R310l26J003k71n555m844J2924j353M114K52O294O777J0099l069
$$ y = [115127, 117856, 113093, 110633, 96440, 79970, 78488, 89850, 87259, 84999, 76031, 61910, 70407, 80249, 77000, 84276, 78101, 79428, 88711, 99141, 96691, 71525, 77417, 87588, 82261, 80502, 74716, 71052, 70181, 76376, 71317, 60394, 56227, 50859, 54352, 53281, 52333, 58475, 73285, 61609, 44837, 39179, 41567, 43472, 37262, 40555, 30781, 30342, 26186, 27057, 22306, 17230, 22007, 39385, 50129, 42024, 37899, 31437, 29044, 26763, 25824, 22892, 29739, 33180, 20906, 19165, 29468, 27936, 14631, 21892, 17813, 24336, 28422, 19463, 7436, -1772, -14404, -5789, 8727, 15208, 13574, 20043, 22983, 28664, 39732, 39879, 38277, 54975, 57135, 70707, 85560, 85890, 75763, 61544, 56557, 55455, 46067, 46622, 55932, 55606, 56609, 56338, 50783, 45939, 58863, 57510, 61624, 61876, 68170, 74947, 85046, 81977]
12250H1977j8578J926J3142Q766R079J4009Q758n38J7410J5269Q143M788P226
12237A71377q163k1120k8854j7355p394j3M360j5588j2341J17N29L798n435n481
12223E8437o02N341M036L328R537L532o72m585o78M149J2384J2985P62J3580J8879
12208A40413R264L4298N1217N6519N2248Q7211R0226P7398O4867M0822J7989l845
12196G18627l7788n9424p0004q9488r7081o3523n5395m8160l4098k6924j6151
12185A20591j6458j1421j1315j1699N661J814j1819r381n075r908M5N055L963
12172E0053j260J931q422l172L095M946N845j0123L17J2637K527r227j1386M951
12158D2712J4284R457J528L278K4837J7943L85O397j4110m473J955L721k525j076
$$ y = [81977, 63399, 65325, 78467, 87233, 96312, 110321, 119079, 118541, 135951, 151220, 159363, 164151, 171377, 163214, 142094, 113240, 95885, 88491, 88478, 92838, 77250, 64909, 65026, 65555, 69353, 63918, 58437, 57835, 63176, 67212, 70540, 80077, 83609, 82937, 78352, 77674, 81823, 94207, 107192, 107954, 121534, 140413, 149677, 183975, 235192, 291711, 343959, 431170, 521396, 598794, 663661, 704483, 722472, 718627, 680839, 621415, 551411, 461923, 364842, 301319, 245924, 197764, 163666, 136742, 120591, 104133, 92712, 81397, 69698, 75359, 77173, 65354, 55973, 50898, 40990, 41035, 46090, 50053, 48793, 50724, 42302, 39130, 42225, 47171, 53016, 42893, 43210, 55847, 58374, 49147, 37761, 42712, 56996, 66453, 67981, 71259, 96096, 114039, 114424, 120821, 106711, 102238, 104193, 107914, 105389, 104313]
12144A04313o908q048l202p225n646j805J3761q909k2141k007K650J1751J3670
12131H0254Q050j5595r312J5134J4057n526j461J4415J5457J2339K8688K1854
12119A78354J5119K7630K0646L946L8701N4520P2549J05001J29123J59097K02094
12108A006780K47140K67022K67898K43220J85354Q6494n876r6862j71788k24577
12098A804805k63952k59346k36943k14588j72051j31838j03536o5596m8097l5235
12088B73623l2662k9421k3669l1266k2109o916q697j6319K658k244m804K254j2847
12075H7581N366N611n158J623j0530j0223J501P372M673O129q12k170j0876j6181
12061F3906k0178j2883R045M976j2792j0718P793N847J0795O990J1236K993n586
$$ y = [104313, 97405, 89357, 86155, 78930, 73284, 71479, 85240, 76331, 54190, 52183, 54833, 66584, 80254, 88304, 72709, 63397, 78531, 92588, 87062, 85601, 100016, 115473, 127812, 156500, 178354, 193473, 221103, 241749, 245695, 284396, 338916, 411465, 516466, 645589, 804686, 1006780, 1253920, 1520942, 1788840, 2032060, 2217414, 2303908, 2298032, 2201170, 2029382, 1804805, 1540853, 1281507, 1044564, 829976, 657925, 526087, 422551, 356955, 308858, 273623, 240961, 211540, 187871, 156605, 134496, 127580, 118883, 102564, 105222, 102978, 98174, 100428, 87581, 92947, 98558, 93400, 95023, 84493, 74270, 75771, 83143, 87816, 93945, 93133, 90963, 80087, 63906, 43728, 30845, 39890, 44866, 32074, 21356, 29149, 34996, 45791, 52781, 64017, 67010, 61424]
12048F1424r980K1223L12j0469k226j736L10O947J1616J3931L5869L9323K9424
12035A95968Q890j6757k2806l3257j5403j9541k5494q770K666Q09n160j3347o821
12022D0977n938k547P038j5233k011k523q482J2079J0629L395R385j528m563R272
12008D9950Q52L857q094j2632j5196J0426J2527J2615l610p507q142k3177K556
11995A4425R353J0861P730Q337r68M06j4135n953m652o277J1117J3362l4l972
11981C9600j2521l444o583l088K908N093L910N530q067Q766R783n451n283j69
11967C0984j2106k3605J178J4984K2928RJ933K2193J2791O330k794L424j7276
11954F0973k0960n324P725k773k594M874j046K969J6091Q552k3874j7978j0578
$$ y = [61424, 51444, 72667, 72979, 62510, 60284, 58548, 58858, 65805, 77421, 91352, 127221, 166544, 195968, 204858, 188101, 165295, 132038, 116635, 97094, 71600, 62830, 65496, 66305, 61145, 47798, 40977, 35039, 32492, 39530, 24297, 22286, 19763, 11281, 23360, 33989, 37384, 46769, 45241, 40678, 49950, 50802, 54659, 46565, 33933, 18737, 29163, 41690, 54305, 50695, 43188, 35046, 11869, 14425, 23778, 34639, 42369, 50706, 49738, 50144, 36009, 30056, 25404, 19127, 30244, 43606, 43572, 39600, 27079, 23635, 17052, 13964, 16872, 21965, 25875, 31405, 23338, 32104, 41887, 36436, 31153, 30984, 18878, -4727, -3549, 11435, 34363, 34372, 36305, 58498, 71289, 77619, 74825, 78249, 60973, 40013, 34689, 42414, 39641, 37047, 41921, 40875, 43844, 59935, 68487, 44613, 26635, 16057]
11941A6057j4810p101J0011P677N961k91P53L885m756n324L356n363J704K42J5504
11926B7505k456l293J1236l725J92J7523J0041k193p783j1591j487k3702k333
11913G934J4550Q212J4438j2326j057O654J726p314J157q434M623J3811P839J26
11899E1939L381LO257Q756R596J62k52j3067o191j3347l808Q35K180Q654j460
11884E3638j0922J1683K757p01j0040j6426R92N251j4052Mm558Q18K886p023j2145
11869B162J206O458j587j0388j0239Q177J0973j0922k72K5833J640m225J0575
11856B9391l757n066L588p756Q841n559k220K211J692J901k416q348k409K1320
11842C1413m499k0873k83j989K009j0611J941J413q54P571O57r189m034J6158
$$ y = [16057, 1247, -5854, 4157, 11834, 17795, 17504, 18257, 22142, 17386, 12062, 15418, 10055, 11759, 12001, 27505, 25049, 21756, 32992, 29267, 29459, 46982, 57023, 54830, 47047, 35456, 33969, 10267, 7934, 22484, 30696, 45134, 32808, 31751, 38405, 40131, 32817, 33974, 25540, 30163, 43974, 51813, 51939, 55320, 55323, 61580, 70336, 79932, 80094, 79842, 66775, 60584, 47237, 43429, 44264, 46444, 55098, 53638, 42716, 54399, 57156, 56455, 46415, 29989, 30981, 36232, 22180, 22184, 17626, 18444, 21330, 14307, 2162, 3368, 9826, 8239, -2149, -12388, -4211, 6762, -4160, -4432, 21401, 23041, 18816, 29391, 25634, 20568, 24156, 16400, 25241, 19682, 17462, 19673, 21365, 23266, 20850, 12502, 10093, 31413, 26914, 6041, 5758, 3769, 5778, -4833, -2892, -1479, -2333, 5238, 5895, -3294, -7328, 8830]
11828H830J1260K9055J3769o620n062q848m906j455r231j0370J0886J3449l323
11815C7434K069Q86k646m428j3719k75J0634j543N129o546j1807m81J4169J6964
11801D5840r753J0192l559j7392j769J573j671m811L355J939L245j573k953Q265
11787C0928N191M758J76Q330j1842l954m98L283J8141r721P327O055O15j1643
11773D7146j0371j4645r154J0212J3328p64R744L367R07p79Q086L117j6293j0860
11759C3041o291M156M730P852J631o570L989m714j0437p43k525J4570R317k392
11745D5614j3213n478Q430J1175o626r413K858L615l575N927J207k3224r90M74
11731A6781o991Q142k817K118q363q259k792L191Q327Q310R619L528R869L328
$$ y = [8830, 20090, 49145, 62914, 56294, 51232, 42384, 37478, 36023, 26792, 16422, 27308, 40757, 37434, 39503, 40389, 37743, 33315, 19596, 19321, 29955, 28412, 33541, 26995, 15188, 14707, 28876, 45840, 36087, 46279, 42720, 25328, 23559, 25132, 23461, 18650, 22005, 23944, 27189, 25616, 22663, 30928, 36119, 40877, 41053, 49383, 37541, 33587, 33089, 36372, 54513, 44792, 52119, 58174, 58789, 47146, 36775, 22130, 12976, 23188, 36516, 35752, 45496, 48863, 49770, 48991, 57077, 60194, 43901, 33041, 26750, 30906, 35636, 43488, 45119, 38549, 42538, 37824, 27387, 26644, 24119, 38689, 48006, 45614, 32401, 26923, 35353, 46528, 39902, 30489, 33347, 36962, 33387, 39314, 40521, 17297, 16307, 16781, 9790, 17932, 15115, 17233, 8870, 611, -2181, 1010, 9337, 17647, 27266, 30794, 40663, 43991]
11717D3991j2094p685j456j660N374l350r52J0266L66J0421K041K19m43n058M540
11702D4520r599o43P54m558J252Q383Q198Q785K083j3706j5145k961j99J073L905
11687C2142k973p66j0277j0849J6854Q069j4994q799o982P968J708j0195o014
11674e108J3907K6594Q378p483J6718J2697J44m100q862j4713q022j128L854J629
11660C4505r42m477k306o79o073j6259J1040R354j477L268k402p825J0725M731
11646C1183m975M568Q762n2J5713N541j453p919k2298q504m972o348K617P114
11632A8977j1200j4519j096j192K826J4033O121j102m614o49J0270J9163K82k0695
11618A6605n033K159r593K667K973P608l026q297J7607J1664n376k417j1107k222
$$ y = [43991, 31897, 24212, 22756, 21096, 26470, 23120, 22168, 32434, 32800, 43221, 45262, 45481, 45038, 39980, 44520, 34921, 34278, 35032, 30474, 31726, 40109, 48307, 57092, 59175, 45469, 30324, 27363, 27164, 28237, 32142, 29169, 28403, 18126, 7277, 24131, 32200, 17206, 8407, 1425, 9393, 11101, 906, -5108, 8799, 35393, 43771, 36288, 53006, 65703, 65847, 61747, 52885, 38172, 30150, 29022, 32876, 34505, 33563, 29086, 26780, 26101, 20028, 3769, 14809, 24163, 22686, 25954, 23552, 15727, 26452, 31183, 26208, 30776, 39538, 39486, 55199, 60740, 59287, 51368, 29070, 20566, 15594, 9246, 11863, 18977, 7777, -6742, -7838, -9030, -6204, 7829, 13950, 12848, 8234, 7585, 17855, 37018, 37300, 16605, 11572, 13731, 4138, 6805, 9778, 17386, 14360, 6063, 23670, 35334, 29958, 27541, 16434, 14212]
11604A4212K287M814q414K52j0681N540J1257P542n318j0642k56J6768l34O051
11590C3078n551J518O71l263r91j942M870p216j2210P614J2700m43L282P801R629
11575D9547m443j9502n811j0413N726L162k062j30J2544o782j2854L583K302j892
11561A2975J4783M433J810k275J082R476p8n009j6893o702o810R072M899k552
11547A8211J071O526M1K0008L473k453j5269o00J1937J0913O771J4148M043M615
11533H3435M044Q288M754J9294M3305L4394J0051l2935l1938k1514k5956k4876
11521G0346l939L839q006K938m134j1221r757n631N314n28n979k0790M934P007
11507B4393O848N955J2725Q877p753j1443j0898J0742R301m03o822l21P661J1939
$$ y = [14212, 16499, 21313, 12899, 13151, 2470, 8010, 19267, 26809, 21491, 10849, 10593, 27361, 27027, 33078, 27527, 29045, 29716, 26453, 25462, 23520, 28390, 21174, 8964, 16578, 29278, 28835, 32117, 39918, 49547, 45104, 25602, 19791, 9378, 15104, 18266, 16204, 16074, 28618, 21836, 8982, 12565, 14867, 12975, 27758, 32191, 34001, 31726, 32808, 42284, 42206, 37197, 20304, 13602, 6792, 15864, 20763, 18211, 19282, 25808, 25849, 45857, 49330, 46877, 31608, 31008, 42945, 53858, 60629, 74777, 78820, 83435, 87479, 95767, 100521, 119815, 163120, 197514, 207565, 174630, 142692, 121178, 95222, 70346, 66407, 70246, 62240, 65178, 61044, 49823, 40066, 34435, 39749, 39221, 33242, 12452, 17386, 24393, 31241, 37196, 49921, 58798, 51045, 39602, 28704, 39446, 48747, 48344, 41522, 41201, 48862, 60801]
11493F0801J2232q95k1581j2514J5640J0950Q782j0469J749l824o388m876L494
11480E3101M85j7823r16J4083K0890P159J4233J1734J6897Q345P689L902M3214
11467A82993O4555N4863J5768j0365n8546p7366o4416k4494M326M194o344q591
11455G6577l723n895n091m040j1053o922j411N875m222M111n733O003n225k355
11441C6896K41O208M891N845N619L280N090o570p270p551p828j526k300J3956
11427D8981N598J5614J4076q095o03j218q807q999N385J2062L852J0365Q993R369
11413A06573J1737R126J687M541J2486P081Q273K0296L9464L8006O8313J12803
11401D40386J90111L16711M38229M04994J10550k25944l93344l53335k48059j71989
$$ y = [60801, 73033, 72138, 50557, 38043, 53683, 64633, 73415, 62946, 64695, 60871, 54483, 49607, 53101, 53586, 35763, 34847, 48930, 69820, 76979, 91212, 102946, 119843, 128188, 135877, 139779, 182993, 247548, 302411, 318179, 307814, 249268, 171902, 107486, 82992, 87318, 91512, 85168, 76577, 72854, 66959, 61868, 57828, 46775, 39853, 38442, 44317, 40095, 44206, 38473, 44476, 39251, 36896, 37137, 43345, 48236, 54081, 59700, 62980, 68070, 61500, 54230, 46679, 38851, 37325, 35025, 48981, 54579, 70193, 84269, 76174, 75571, 74353, 65546, 56547, 61932, 73994, 77846, 88211, 97204, 106573, 118310, 127436, 129123, 133664, 146150, 153231, 161504, 181800, 221264, 259270, 327583, 440386, 630497, 947208, 1385437, 1790431, 1900981, 1675037, 1281693, 928358, 680299, 508310]
11391E08310j18088q1701n3634l8632k4686k6288k9770k2452O464P856k1812j5456
11379I0111j4252l561O092Q772J4323L048p450j5476m09J5628J4116n480l590
11366A01872K326j0562m046j850l224j553Q41l304j0558O525l620Q56J623J37
11352G5463r466L295J4041J636N065J256j3615m476K014N46r300P074J7448k112
11338H8869p480p227O165J3009R532O275L585J0952J7341L3438K4228J1156j1173
11325A98670k0294j3027l947n246p394K576n18q189L371J1973J1824J4434L4174
11312B18407M0756M6273N5718Q5858J20399J68446K12069K44233K58770K40532
11302A691461J63685O6948j8500j39208k43494k68999k46020k06830j67001j27673
$$ y = [508310, 390222, 308521, 254887, 216255, 191569, 165281, 135511, 113059, 119523, 127379, 105567, 90111, 75859, 72298, 78390, 87162, 101485, 104533, 97083, 81607, 81198, 96826, 110942, 105462, 101872, 104198, 93636, 89590, 87740, 84516, 82963, 83804, 80500, 69942, 76467, 72847, 73703, 75326, 75463, 65997, 69292, 83333, 84969, 90034, 91290, 77675, 73199, 75213, 75759, 66459, 73533, 90981, 88869, 81389, 74162, 80327, 93336, 102868, 109143, 112728, 123680, 141021, 174459, 198687, 209843, 198670, 178376, 165349, 161402, 156156, 148762, 151338, 150820, 142631, 146002, 157975, 169799, 184233, 218407, 259163, 305436, 361154, 447012, 567411, 735857, 947926, 1192159, 1450929, 1691461, 1855146, 1922094, 1903594, 1764386, 1520892, 1251893, 1005873, 799043, 632042, 504369]
11292E04369r0835n6099m3026n1560l4738l1999j3499m814o644j6551j9753j1290
11280A23561p243p843j4517q50K6132J4554P771J835r718p569L67r417m132j399
11266A11532M954J861p610l770J1106R358J3260K0595Q329j295L831J4094J4453
11253B00698Q433J9728L2571L6664M5319O0094P4703J14861J72581K47347L63153
11242A376152M42517M76579M85706L28558r235l37237n26172n35607m32850l08166
11232I60245k15333j48821j11790q2206m7815m1272l2133k7616j1812n981r774
11221B25692k0200o814j5883j5322j2118K836O219N290k703j3408L811J3854O996
11208A78250N425J2143k5135J62p748p622o371m659l568o558k1946j7932o588
$$ y = [504369, 413534, 357435, 314409, 262849, 228111, 196112, 182613, 177799, 171155, 154604, 134851, 123561, 116318, 108475, 93958, 93108, 119240, 133794, 141565, 143400, 133682, 126113, 126480, 117063, 112931, 111532, 116486, 118347, 110737, 106967, 118073, 127431, 140691, 161286, 169615, 168320, 172151, 186245, 200698, 209131, 228859, 261430, 298094, 343413, 403507, 478210, 593071, 765652, 1012999, 1376152, 1818669, 2295248, 2780954, 3109512, 3100277, 2763040, 2236868, 1701261, 1268411, 960245, 744912, 596091, 484301, 402095, 354280, 313008, 280875, 253259, 241447, 235466, 225692, 205492, 198678, 182795, 167473, 155355, 158191, 164410, 169700, 166997, 153589, 157400, 171254, 178250, 183675, 195818, 170683, 170845, 163097, 155475, 149104, 144445, 140877, 134319, 112373, 94441, 87853]
11195H7853M492K3726J0488L675J1985J0581J1159n778k2822l1709j537J6840
11183A18953J6150J6215K8946M9023K6588J6276k1197l2113m1120l8068O368Q575
11171A54596P149O197J8862J1140K563m916K568J4702o585m848j000p108m547
11158A88773j3171n222m536j897J5193J9306J0983k0105J2447j353j3521j8257
11146A68640k3425j6857P764J5194J737r561n166p351M1Q094j2083o975j092J2039
11132A30999l768R104P146j0913R726J635P115K926p879k0382j8315j1103L951
11119A00242N968o488J6530R0932R5144J3125k4977k3759k7144m544r246J084
11107B26867J3945N923r132R348l326o046j3015p783J5719J1818L876m694p955
$$ y = [87853, 92345, 116071, 126559, 130234, 142219, 152800, 163959, 158181, 135359, 103650, 102113, 118953, 135103, 151318, 180264, 229287, 255875, 272151, 250954, 218841, 177721, 139653, 146021, 154596, 161745, 167942, 186804, 197944, 200507, 195591, 198159, 212861, 206276, 201428, 200428, 193320, 188773, 175602, 170380, 165844, 163947, 179140, 198446, 209429, 189324, 201771, 200418, 186897, 168640, 145215, 128358, 136122, 151316, 153053, 143492, 138326, 130975, 131016, 139110, 127027, 120052, 118960, 130999, 127231, 136335, 143481, 132568, 142294, 143929, 151044, 153970, 146091, 125709, 107394, 96291, 100242, 106210, 99722, 116252, 207184, 302328, 315453, 290476, 266717, 239573, 235029, 225783, 226867, 240812, 246735, 237603, 246951, 243625, 237579, 224564, 216781, 232500, 244318, 248194, 243500, 235545]
11094B35545q046m663N739L903O109Q938J0870J3918K286O204K2969K2754P589
11081C34115P787N39j821j187l033R580R196K331q722L083l019J2166J5151J1465
11067C87631k3M686L301o683j2425p189n156L3808M0799L9321L2370K3815L6395
11054E70650M7380K7907R708K6238N4612O8993R2505J17337J47426J63211O7300
11043A393267k7013r0119r0886o1432j6542o565l914j9658r760K0844M2485P0565
11031A201272P2243P8369P0268N4315M1779L6895O3465R8855J55102J51208J47466
11020B171237J57028J85739K21028K90278M06020N53806P42129Q44347P46379
11011F317991L84218O0672k1390Q3916K64682N10950Q44200J282789J729198K178330
$$ y = [235545, 227499, 222836, 228575, 232478, 238587, 247525, 258395, 272313, 274599, 280803, 303772, 326526, 334115, 341902, 342441, 340620, 339433, 336400, 345980, 355176, 357507, 348785, 351868, 348849, 361015, 376166, 387631, 387608, 392294, 395595, 388912, 376487, 369298, 364142, 397950, 438749, 478070, 510440, 534255, 570650, 618030, 645937, 655645, 681883, 736495, 805488, 897993, 1015330, 1162756, 1325967, 1393267, 1366254, 1276135, 1185249, 1123817, 1107275, 1100710, 1096796, 1077138, 1067378, 1088222, 1130707, 1201272, 1273515, 1351884, 1422152, 1476467, 1518246, 1555141, 1618606, 1717461, 1872563, 2023771, 2171237, 2328265, 2514004, 2735032, 3025310, 3431330, 3985136, 4727265, 5571612, 6317991, 6702209, 6762881, 6741491, 6825407, 7090089, 7601039, 8445239, 9728028, 11457226, 13635556]
11001A3635556K538243K725742L039790L766789N311673Q097392J2806894K0662078
10993G2584157L3914207N6178567Q2810339P8801561K4700645m0750780p7757087
10986B30481609o8523638m7614498l2565545k2221393j4902761j0177439p157248
10979B7319087n203377l928877k963108k237172j677954j289192j073124r40294
10971H005989q17448o78147m65868k39057L8619J95212K3714k49874m30736l69784
10961E012620k17083j62969k37632l45370l78558k96408j61126j11750j41405
10952B960319k13251k37120k26201k00419j44860r8238n0585m4604o4485q3613
10942A596943o6095n484K8652L3587M9232J12283K19598L21474L51654K15183
$$ y = [13635556, 16173799, 18899541, 21939331, 25706120, 31017793, 39115185, 51922079, 72584157, 106498364, 162676931, 245487270, 324288831, 348989476, 308238696, 230481609, 161957971, 114343473, 81777928, 59556535, 44653774, 34476335, 27319087, 22115710, 18186833, 15223725, 12986553, 11308599, 10019407, 8946283, 8005989, 7188541, 6510394, 6044526, 5805469, 5844088, 6039300, 6063014, 5813140, 5382404, 5012620, 4795537, 4632568, 4394936, 4049566, 3671008, 3374600, 3213474, 3101724, 2960319, 2747068, 2509948, 2283747, 2083328, 1938468, 1840230, 1789645, 1745041, 1680556, 1596943, 1530848, 1525364, 1554016, 1587603, 1636835, 1749118, 1968716, 2290190, 2641844, 2857027]
10932B857027m3624k29295k98800l11444l00061k46844j80110j24282q5090o5128
10922I72349n5894m3384l3002r140j2130l3897l4376m6464m3294k9405j8629k7705
10910E85029j7921j4595j1346L930l4539l1088m247Q011j6928k7653j5077j9038
10898D04538l6473j5491r789j5559R303O636l716k470l369j409J678N998o864
10885C33013o043q816j2060L976L401J311j923r361m283k815j5477Q48J586m970
10871B78387J090k1386P556J6583m668R38M36Q424K6605M5446L0124l569M321
10858C90287N30J525j043p723r122j2231K920j7605l7364k5767j2581p115k687
10845B62024j0990j5074j0658j3723j3034M939m710n145j400J2432K4324O017
$$ y = [2857027, 2813403, 2584108, 2285308, 1973864, 1673803, 1426959, 1246849, 1122567, 1037477, 972349, 916455, 873071, 840069, 830929, 818799, 784902, 750526, 704062, 660768, 631363, 612734, 585029, 567108, 552513, 541167, 545097, 510558, 479470, 475223, 483234, 466306, 438653, 423576, 404538, 368065, 352574, 342785, 327226, 336529, 343165, 339449, 336979, 333610, 332201, 333879, 339877, 333013, 326970, 318154, 306094, 310070, 313471, 314782, 312859, 303498, 299215, 296400, 280923, 281771, 283357, 278387, 279477, 258091, 265647, 282230, 277562, 278500, 278936, 287360, 313965, 359411, 389535, 385966, 390287, 390817, 392342, 391299, 383576, 374454, 362223, 365143, 347538, 310174, 284407, 271826, 264711, 262024, 251034, 235960, 225302, 211579, 198545, 203484, 198774, 193629, 192229, 204661, 228985, 235002]
10833B35002r774k0289p047j0017l0138n632P410o708l671j36n492j7858j7876
10820A07774j5689L205O906M635j6963j8103q061j0261M633K4251K4777J3050
10808A20154o399m618r133j0087k5492k5059l6357k7618p519J7808L0849L1683
10796D8212J2747J4940K4653K1458N636n831N216j5830j9023J463J4114J2721
10784A20476K794N698J8674J215j6610k7824k271J663P136j483l811J2060K637
10771A20354J5096M8613O4151O0473L8729k9601o1975m8018k0069j5065j2675
10760A60013j9573j9847J533M659J442K46J1958J0731l644n82R971P065j234P810
10746A70548J2885Q92P721J5476J1045P564J7697L8771L4007J3735j5677k6384
$$ y = [235002, 225228, 204939, 197892, 187875, 157737, 152105, 159515, 152807, 149136, 149000, 143508, 125650, 107774, 92085, 95290, 102196, 106831, 89868, 71765, 63704, 53443, 58076, 82327, 107104, 120154, 113755, 109137, 100004, 89917, 64425, 39366, 3009, -24609, -32128, -14320, 16529, 48212, 60959, 75899, 100552, 122010, 127646, 121815, 127031, 111201, 92178, 93641, 107755, 120476, 123270, 128968, 147642, 148857, 132247, 104423, 102152, 103815, 110951, 109468, 105657, 117717, 120354, 135450, 184063, 248214, 308687, 347416, 317815, 255840, 207822, 187753, 172688, 160013, 140440, 120593, 122126, 126785, 128227, 128473, 140431, 151162, 147518, 146936, 156907, 163972, 162738, 170548, 183433, 184325, 192046, 207522, 218567, 226131, 243828, 282599, 316606, 330341, 314664, 288280]
10734B88280j8066k2403j9207r154P901K314j670q104M014k610l487r285R886
10721B18409L8301N0143N5089N6285N0155N260k2507l3325n8791p1664l4200r366
10709B43789K890L202J168J4408L0541K5622J7703Q231j9107l7863m1188l1677
10697B17719j5057N95j2724P455P518J7660Q625m104o741j9075j8690o398J6932
10684A93715J0164j2151j5704j0953p373o856k332L629M036l151j0130k41L006
10671A45659n195k0392k112Q083L789J8285Q404j0245n101L362N30p072j2538
10658A25457k0672q999n600j593k28j4844j8718j4780p133P339J6955p391L814
10645E3607J3323J7295J9649M0544O1350Q4878N7946J1872k5218l5771j4000q182
$$ y = [288280, 270214, 247811, 228604, 219450, 227351, 229665, 227995, 219891, 223905, 221295, 217808, 208523, 218409, 256710, 306853, 361942, 418227, 468382, 473642, 451135, 417810, 359019, 287355, 253155, 243789, 246679, 249881, 251049, 265457, 295998, 321620, 339323, 347554, 328447, 290584, 249396, 217719, 202662, 203257, 190533, 197988, 205506, 223166, 231791, 227687, 220946, 201871, 183181, 176783, 193715, 203879, 191728, 176024, 165071, 157698, 150842, 148510, 152139, 156175, 153024, 142894, 142653, 145659, 140464, 120072, 117960, 126043, 129832, 148117, 156521, 146276, 141175, 144537, 145067, 137995, 125457, 104785, 95786, 90186, 88593, 88365, 73521, 54803, 40023, 32890, 40229, 57184, 49793, 53607, 66930, 84225, 103874, 144418, 205768, 290646, 348592, 360464, 335246, 299475, 285475, 277293]
10633B77293K021j0781j853J3201J954j1029j4372J974j1144k0713J441J2976
10621B40968J636N135J0970j605J6359J1245L737O948J0422J6734o226K740K5591
10608C44654L1286J838n76P807N024M789O812j5184r37O435J80Q73o091P566K466
10593C96942K1589K3033J1663o475J7644J9017J1459L3158M4832M9525O0460O5917
10581G48764J06639J59545K41537L65670M62447L70778M4812k89806m00978l01957
10571A507451k11691j36937p9168k8287K3281P1402J13503J61930J50866O8258
10561A640608l5953j09302p6190k7015L5195P0348P3470N3473L1227J1719P745
10550A675325L3028M0344O2968R7245J25037J36776J30627J43135K01928K51723
$$ y = [277293, 279314, 268533, 266680, 279881, 281835, 270806, 256434, 258408, 247264, 226551, 227992, 240968, 242604, 247739, 258709, 257104, 273463, 284708, 288445, 295393, 305815, 322549, 316323, 319063, 344654, 375940, 377778, 377202, 385009, 390033, 394822, 401634, 386450, 385513, 391948, 392128, 393001, 386910, 394476, 396942, 418531, 441564, 453227, 446752, 464396, 483413, 494872, 528030, 572862, 622387, 682847, 748764, 855403, 1014948, 1256485, 1622155, 2084602, 2455380, 2500192, 2210386, 1809408, 1507451, 1295760, 1158823, 1079655, 1051368, 1074649, 1146051, 1259554, 1421484, 1572350, 1640608, 1604655, 1495353, 1419163, 1392148, 1427343, 1497691, 1571161, 1624634, 1655861, 1667580, 1675325, 1708353, 1748697, 1811665, 1908910, 2033947, 2170723, 2301350, 2444485, 2646413, 2898136]
10540B898136K99488L43279L58854M02541M31159N11223O30616P48628P86107
10531G410031P31025O54768P17894R70691J288695J679111K201430K939318L955100
10522B2548063N419251P795444J1710704J8212022K9250951M7051907O8503623
10515B10491965P2935781L9151811j6869811o0337792o8430589n3027728l6137984
10508H7775653k4038341j6089099j0956572p591068n361366l951212l029991k349829
10500A4408175j735936j223869q70294p02442p71812q98344r13320p86854o65926
10491E839378n83409n12188m11263k85689k21229k03748k14220k23494k00547
10482B983591j69908j34801j17345j18706r4805j06790j27985j39299j09616p3349
$$ y = [2898136, 3197624, 3540903, 3899757, 4302298, 4733457, 5244680, 5875296, 6623924, 7410031, 8141056, 8795824, 9513718, 10484409, 11773104, 13452215, 15653645, 18592963, 22548063, 27967314, 35762758, 47473462, 65685484, 94936435, 141988342, 210491965, 283427746, 322579557, 305709746, 245371954, 176941365, 123913637, 87775653, 63737312, 47648213, 36691641, 29100573, 23739207, 19787995, 16758004, 14408175, 12672239, 11448370, 10578076, 9875634, 9103822, 8205478, 7292158, 6505304, 5839378, 5255969, 4743781, 4332518, 4046829, 3825600, 3621852, 3407632, 3184138, 2983591, 2813683, 2678882, 2561537, 2442831, 2348026, 2241236, 2113251, 1973952, 1864336, 1790987]
10472A790987m4723l6473m3216n4423o5728m5315j096L1539J5477k9041r0615
10461A427373j08975o6691m7750m8300m5653m3187l7340l1555m8947l8814k7208
10450H82953k2166q095p297j6387j3781k3401q203o115l771M180n565Q876J4703
10437G95931J9050K1508j012m6059o1328m9326l5863l3589l6927j3000p54j7946
10425E40685l5475l5376k7566k9773j8561k224k744K0272K322O95J4971k286j5330
10412D09610j0923J470l845k2026j1989q360M64m083L738o079j3737j5994m910
10399C13336j9236j0121J0953O437j723J997M503K037q824J9259K4959J5846J9598
10386C79021l93o743l387o078j195k2902k0412k3691j4088j2339j3929n838J0982
$$ y = [1790987, 1746264, 1709791, 1666575, 1612152, 1546424, 1501109, 1500013, 1531552, 1547029, 1517988, 1427373, 1318398, 1251707, 1203957, 1155657, 1110004, 1066817, 1029477, 997922, 948975, 910161, 882953, 860787, 852692, 845395, 829008, 815227, 791826, 783623, 777508, 773737, 777917, 772352, 781228, 795931, 814981, 836489, 835477, 789418, 728090, 678764, 642901, 609312, 572385, 559385, 558631, 540685, 505210, 469834, 442268, 412495, 393934, 391710, 388966, 409238, 411560, 412255, 427226, 424940, 409610, 398687, 400157, 396312, 374286, 362297, 353937, 354401, 350318, 354056, 347977, 334240, 318246, 313336, 294100, 283979, 294932, 301369, 299646, 301643, 306146, 308183, 299359, 318618, 343577, 359423, 379021, 378628, 371885, 368498, 362420, 361225, 338323, 317911, 294220, 280132, 267793, 253864, 248026, 259008]
10373B59008l600L439M9r739n058j4145J018P868j0561P048j915l503J4732J1789
10359B56430l557L117l776j3837j3686p14J3166K6762J1790J6572L4651O5092
10347C92010R6627J58612K30543K49836J80092L1303j11701k24957k40268j94808
10337E67289j53638j03048m3088k5378j0683k415p684j8493l6579l8015l0786
10326I7482m9070l3077J6367M1200L7211J5907L70J0562K1671J0181o40l248j4961
10313A49955j6159J2509Q877r514P913P770r891q386N126K520r910j0339l013
10300A27458r478j1423j2634j9818r654M414j480R766K0188L691R500J2530J1555
10287A34615J3095K877l706J3981J2610m938j0749O94l55o006J575J1601J80J5509
$$ y = [259008, 255408, 258847, 258896, 249157, 244099, 229954, 230972, 238840, 228279, 235327, 233412, 229909, 244641, 256430, 252873, 255990, 252214, 238377, 224691, 223977, 237143, 263905, 275695, 292267, 326918, 392010, 488637, 647249, 877792, 1127628, 1307720, 1339023, 1227322, 1002365, 762097, 567289, 413651, 310603, 267515, 242137, 231454, 229039, 221355, 202862, 166283, 128268, 97482, 48412, 15335, 31702, 72902, 110113, 126020, 126390, 136952, 158623, 168804, 168164, 164916, 149955, 133796, 146305, 155182, 145668, 153581, 161351, 151460, 143074, 148200, 150720, 140810, 130471, 127458, 117980, 106557, 93923, 74105, 64451, 68865, 67385, 77151, 97339, 101030, 110530, 123060, 134615, 147710, 150587, 146881, 160862, 173472, 168534, 157785, 158479, 158124, 152118, 153693, 165294, 165474, 180983]
10273A80983J9772K2761M5591Q6658J30635J91131K65611K83041J88242J3347
10263A427772j71830k69771k45130j86360j23544q4016n2982k8284k1041j2111
10253B32703K057j460j7295j7155j0660qM321j330o606n225Q719O708P09o820
10239A88658k974J864J670R074j1756j1189R626P80p629O326L536M888j408Q522
10225A99988r073O740P006j558J383o78Q47l53M610J9977On544j2518J4044J6580
10210B41457K5909L2527L0669J0454J6842J9911K4297L2089M7314O1435P7830
10199F20734Q1660R6153J35923J56093J85537K49445K53817K87928L95508O01422
10189C064220R55362J426875J890960J953849J213566j29731j365271j932432
$$ y = [180983, 200755, 223516, 269107, 355765, 486400, 677531, 943142, 1226183, 1414425, 1427772, 1255942, 986171, 741041, 554681, 431137, 347121, 294139, 265855, 244814, 232703, 234760, 233300, 216005, 198850, 188190, 188182, 192503, 191173, 184567, 179342, 188061, 194769, 195478, 188658, 185684, 187548, 189218, 198292, 186536, 175347, 184973, 185753, 178124, 184450, 187986, 192874, 191466, 199988, 190915, 197655, 204661, 203103, 204486, 203808, 204655, 204302, 208912, 228889, 228895, 223351, 210833, 224877, 241457, 267366, 299893, 330562, 341016, 357858, 377769, 402066, 434155, 481469, 542904, 620734, 702394, 798547, 934470, 1090563, 1276100, 1525545, 1779362, 2067290, 2462798, 3064220, 4019582, 5446457, 7337417, 9291266, 10504832, 10375101, 9009830, 7077398]
10181G077398j815501j395083j012633p11508m98632l66142k51900j57360j22475
10172G46164q3352n0077l8330l4953k2728l0964l6221m0350m3580l1217k0293
10161C14099k318j8510j6553q058j3257k0453j1822J768j1525j256J2617J0067
10149B34799P548J6408k026n762k0974j9108q727o206l421n477p202P252j3644
10136A73460j6663r075N351J6936K2181K785r868r838j8198J362l746k892r305
10123A42490j1178q510o481m804P326J3300K4188P512l012q828j400J1144Q404
10110A70151N521J413L88J4547J1876l448r870P10J8121J8269J8700J1175J9191
10097B76744K8263L2866N0994R0144J23071J93898L04420L84886K91478L4575
$$ y = [7077398, 5261897, 3866814, 2854181, 2142673, 1644041, 1277899, 1025999, 868639, 746164, 662812, 612735, 574405, 539452, 516724, 485760, 449539, 409189, 365609, 334392, 314099, 311781, 293271, 276718, 268660, 255403, 234950, 223128, 224896, 213371, 212115, 224732, 234799, 242347, 258755, 256729, 250967, 229993, 210885, 202158, 195952, 192531, 187054, 179852, 187104, 173460, 156797, 147722, 153073, 170009, 192190, 194975, 185107, 175269, 157071, 158433, 154687, 151795, 142490, 131312, 122802, 116321, 111517, 118843, 132143, 156331, 163843, 160831, 152003, 150603, 161747, 170151, 175672, 177085, 177473, 192020, 203896, 200448, 190578, 191288, 209409, 227678, 246378, 257553, 276744, 305007, 337873, 388867, 479011, 602082, 795980, 1100400, 1485286, 1776764, 1811339]
10087A811339k19748l16538k82039k03978j48299j16189n3014l4196j5175Q231
10077D30394K3475K4487K0873K7178J0059k397j8458m3332m0198l3615m5434j8687
10065C34345J216M141K894M036M480K0505M5657P7782J33541J73765K32980K76950
10053A312292L11129K82668J87412R3794j7258j30193k12061k29814k00917j30752
10043A266300n2813N2803J91482L51180N01529N61031M88627K43330j12093m09703
10033C081673n44855n34883m46278l63494k70724j91815j30144q3001p5540m2162
10023C98777l1069l8650l5921k8988j9511n408k1507j9751j3472j6531M286J5416
10011A87671m369R054j1934l952j5598j0160J0597J0548j476r874L144j3181j6233
$$ y = [1811339, 1591591, 1275053, 993014, 789036, 640737, 524548, 471534, 437338, 422163, 430394, 453869, 478356, 499229, 526407, 536466, 534069, 515611, 472279, 432081, 398466, 353032, 334345, 335561, 339702, 342596, 346632, 351112, 371617, 417274, 495056, 628597, 802362, 1035342, 1312292, 1623421, 1906089, 2093501, 2187295, 2170037, 2039844, 1827783, 1597969, 1397052, 1266300, 1213487, 1266290, 1457772, 1808952, 2310481, 2871512, 3360139, 3603469, 3491376, 3081673, 2536818, 2001935, 1555657, 1192163, 921439, 729624, 599480, 516479, 440939, 398777, 367708, 329058, 293137, 264149, 244638, 239230, 217723, 197972, 184500, 167969, 172255, 187671, 183302, 192356, 180422, 176470, 160872, 150712, 161309, 171857, 170381, 160507, 163651, 150470, 134237]
9998A34237q583o501K38j238J89K578k639m022p824j6375j5102P955K428k0001
9984F5340l882J0595J4649K062k80j3505q534n139N132J2663m917J641j3682P716
9970F9859J0120q180l413J0542M165n162j2530o140L641l983P035k286o923o47
9956E6098L848r796l542j0895R166J2847N164p504J042p843j203J0672O856l973
9942F0937n824j1795K264K238M338J8302K4232l951j1824j8936p148J0741j0672
9929E2902j1700O029J8795j932l302J7560O553O829J980j5405j5415k794j0936
9916D9164J505J0695J2166J2102M251j1201j4894l247P099K683n552m198j795
9903E8778p437q467K576N983J2653n365K861M084L648p95J32l724Q83J1925l131
$$ y = [134237, 125654, 119153, 119391, 118153, 118342, 120920, 118281, 114259, 106435, 90060, 74958, 82913, 85341, 65340, 61458, 72053, 86702, 88764, 88484, 74979, 66445, 61306, 66438, 79101, 74184, 75825, 62143, 69859, 79979, 71799, 68386, 78928, 83093, 77931, 65401, 59261, 62902, 58919, 65954, 63668, 56745, 56098, 59946, 50150, 46608, 35713, 44879, 57726, 62890, 55386, 56428, 48585, 47382, 58054, 64910, 60937, 55113, 43318, 45582, 47820, 52158, 70460, 94692, 90741, 78917, 59981, 52833, 63574, 52902, 41202, 47231, 66026, 64094, 60792, 78352, 84905, 91734, 93714, 78309, 62894, 60100, 49164, 50669, 61364, 73530, 85632, 89883, 78682, 63788, 60541, 67640, 70323, 64771, 60573, 58778, 51341, 42874, 45450, 51433, 64086, 58721, 61582, 65666, 69314, 68519, 68651, 64927, 65810, 77735, 74604]
9888G4604j382j2163R508P615J7587K244j1075j8808n530L120J5890J200J2823
9875I5633N517O174r71j0545p2n004o224L363M88m407p401n553O775l259r388
9860F5126M033K28J854N137M127J0512J2614j2663N813k639l649O769N077J0616
9846A12955J5152J3708L207J5701L3478P5066J39733K16803K80468K33405L1854
9835A171530j71876k55691k23896j65406j10913n2568k5061j7415j1910j4271
9825A22523P727R506m784j1231Q457J4660r857o116j6183m912r179M826J5030
9812A20467k912K411L823P808P193J268o013j2159K148Q583k527j6785M39l727
9798A10017N650J264l154J3874Q146M68n350k3084k337K653L775J1200l816J4219
$$ y = [74604, 73222, 61059, 70567, 78182, 95769, 98013, 86938, 68130, 62600, 65720, 81610, 82810, 95633, 101150, 107324, 106353, 95808, 95736, 90732, 84508, 87871, 88359, 83952, 76551, 70998, 77773, 74514, 65126, 69159, 69387, 71241, 76378, 80505, 91017, 103631, 90968, 96781, 94142, 90493, 97262, 102339, 112955, 128107, 141815, 145022, 160723, 194201, 269267, 409000, 625803, 906271, 1139676, 1171530, 999654, 743963, 520067, 354661, 243748, 191180, 166119, 148704, 136794, 122523, 130250, 139756, 134972, 123741, 132198, 146858, 137001, 130885, 114702, 109790, 100611, 105437, 120467, 117555, 119966, 123789, 131597, 138790, 140058, 134045, 121886, 124034, 132617, 130090, 113305, 113744, 110017, 115667, 116931, 113777, 127651, 135797, 136265, 130915, 107831, 105494, 108147, 111922, 123122, 119306, 133525]
9784A33525M510j574J5574J4854q869k710J9322m730j4571m346N477J0203Q085
9771A74750J7503L1964K6601J9774L0436Q666O967K4793L5260M4127K0793M2763
9759D84397O3045P6542R7758J21019J61061K33274L60383N35446Q58862J342746
9749D334533J940551K073578J043802o15284j813183j919537j440824r77152o53708
9740A972776m53571l08610k25827j66649j07837q4129p6083p0846m8001k4664
9730D06559j6880k1069k6569o493j3443l711k0727k7886k1946j5926M201k318
9718B33792j9633n952O410J8458J6603M275k0336p421Q525K1935K752r086M017
9705B54339j2759q705j8670p264K298M858k139m1j2285q069o927o051P18J9366
$$ y = [133525, 138035, 136461, 152035, 166889, 158020, 155310, 174632, 169902, 155331, 150985, 156462, 166665, 174750, 192253, 224217, 250818, 270592, 301028, 309694, 316661, 341454, 376714, 420841, 441634, 484397, 547442, 623984, 721742, 842761, 1003822, 1237096, 1597479, 2132925, 2991787, 4334533, 6275084, 8348662, 9392464, 8777180, 6963997, 5044460, 3603636, 2626484, 1972776, 1519205, 1210595, 984768, 818119, 710282, 626153, 550070, 479224, 431223, 406559, 389679, 368610, 342041, 335548, 322105, 318394, 297667, 269781, 247835, 231909, 236110, 233792, 214159, 208207, 214617, 233075, 249678, 253953, 233617, 226196, 234721, 256656, 259408, 250322, 254339, 241580, 232875, 214205, 206941, 209239, 214097, 211958, 211917, 199632, 191563, 184636, 178585, 179303, 198669]
9691A98669J5440J83J4869M095j2051j8082L56K895j654J7973N205N754J8054
9678B51706j0262K241N390q707L958Q802R197Q440R138k852K623K574j1765k068
9664B68415J7047O708M370N537N249M804l17N215J7315J1633l095J0080Q049J5886
9650C76896J3191J4912N20l748R661J1026R588L692n32P96M580L321J2643J0933
9636D67479J7146K6870J0826R806K8113Q465L64P222K6948J8367P488K09J8004
9623F47307M0343J6220J3201K8562J5124P819K0988K8900K6119L5341J9526L0303
9611I29753L1373L5330L6320M4411M8943N1270M0888M4551N2468N3446M5348N8738
9599A472839P7325R0223Q0585Q3173Q6878R7906J09963J17553J34044J29271J22009
$$ y = [198669, 214109, 214292, 229161, 233256, 221205, 203123, 203479, 206374, 204720, 222693, 227898, 233652, 251706, 241444, 243685, 249075, 240368, 244326, 253128, 262325, 270765, 279903, 277051, 279674, 282248, 270483, 268415, 285462, 292170, 296540, 302077, 307326, 312130, 311813, 317028, 334343, 345976, 342881, 352961, 361010, 376896, 390087, 404999, 405519, 401771, 411432, 422458, 432046, 435738, 435206, 436002, 440582, 443903, 456546, 467479, 484625, 511495, 522321, 532127, 560240, 568705, 569069, 576291, 603239, 621606, 629094, 629303, 647307, 687650, 703870, 717071, 745633, 760757, 768576, 789564, 818464, 844583, 879924, 899450, 929753, 961126, 996456, 1032776, 1077187, 1126130, 1177400, 1218288, 1262839, 1315307, 1368753, 1414101, 1472839, 1550164, 1640387, 1720972, 1804145, 1891023, 1988929, 2098892, 2216445, 2350489, 2479760, 2601769]
9588B601769J54543J67620J72890J95625K28135K43959K53483K79973L22815L58794
9578D979606M15945M49451M93662N72863O49532P47617Q36844R52709J083811
9569A1182040J237109J423767J629343J837568K095285K344594K583904K783245
9561B7116855K880368K816809K526613K020869J275351L80895n57201j412913
9553C7047646k082504k537775k775437k807195k703241k512248k284789k051635
9545A7292822j837128j602699j408946j223299j058963r43671q40556p42342o44617
9536F990601n59863n07269m45938m13455l72471l29753k91913k62084k28450k16118
9526C363287j92595j74624j65907j66807j46128j29212j27155j12044j04037r5658
$$ y = [2601769, 2756312, 2923932, 3096822, 3292447, 3520582, 3764541, 4018024, 4297997, 4620812, 4979606, 5395551, 5845002, 6338664, 6911527, 7561059, 8308676, 9145520, 10098229, 11182040, 12419149, 13842916, 15472259, 17309827, 19405112, 21749706, 24333610, 27116855, 29997223, 32814032, 35340645, 37361514, 38636865, 39017760, 38460559, 37047646, 34965142, 32427367, 29651930, 26844735, 24141494, 21629246, 19344457, 17292822, 15455694, 13852995, 12444049, 11220750, 10161787, 9218116, 8377560, 7635218, 6990601, 6430738, 5923469, 5477531, 5064076, 4691605, 4361852, 4069939, 3807855, 3579405, 3363287, 3170692, 2996068, 2830161, 2663354, 2517226, 2388014, 2260859, 2148815, 2044778, 1949120]
9516A949120r5611q0325p2068p7412o6396n0867o4964o4460o0360n7269m2715
9505A216673m0080l9959l9659m4366j5223j7759l1946m1577l4631k9039l2598
9494H49836l5457k3468k6918j4275k3483k6358j1762o568j9289k2026j8387j2373
9482F09472k5296j6875j2671L142q404k5779j3535j5093k0076j7342j7472j2334
9470D27737j099j6246j4129m574L90j4406m723p54R0q821o127o7j429j1944m500
9455C39398q272j2642j1010j6874K638N367n252q605m813r962j2428j245J337
9442B57637l043O208J1259n766l144k282k1258q809p150L146k83o440J5581L191
9428B38847k1678m028J7846M845q927p978Q02n882k680L084l158q696p527p032
$$ y = [1949120, 1853509, 1773184, 1701116, 1623704, 1557308, 1506441, 1441477, 1377017, 1316657, 1259388, 1216673, 1176593, 1136634, 1096975, 1052609, 1037386, 1019627, 987681, 946104, 911473, 882434, 849836, 814379, 790911, 763993, 749718, 726235, 699877, 688115, 681547, 662258, 640232, 621845, 609472, 584176, 567301, 554630, 557772, 549368, 523589, 510054, 494961, 474885, 457543, 440071, 427737, 426638, 410392, 396263, 391689, 392079, 377673, 372950, 372196, 372286, 363465, 357338, 357271, 355842, 343898, 339398, 331126, 318484, 307474, 290600, 293238, 298605, 293353, 284748, 279935, 269973, 257545, 256300, 257637, 254594, 260802, 272061, 266295, 263151, 260869, 239611, 230802, 223652, 226798, 226515, 220075, 235656, 238847, 217169, 213141, 230987, 235832, 226905, 218927, 219729, 213847, 211167, 214251, 211093, 202397, 194870, 187838]
9414A87838o659j0834n51q198l530K585O194o688j1298n526l69M374j3089N240
9400A39489R681l986l12r5l263k4988r481J4728R103p482q189j892m084M954k973
9385A11210n394r672o687O661P05L35j210K451r720j1707Q320m241n916m943M423
9370G4615J3954J0964j2828j6381n336k030l025J0196J2604M1L132n815j147J5607
9356I4551m312q486m009j459n269Q92J0795K405N911N724P400O940J905J0312
9342A23300r0o880q770l2262j4680p448K4Q397J3256o62o297j0136N550R226N1
9327G2579r726J2657P229o013p975q477j7047P637K4696M965r745k1155j651J0988
9313E8962J461j293r462J3096J7829r587o242o311k341Q856L943p794j960n367
$$ y = [187838, 181179, 170345, 169794, 161596, 158066, 160651, 166845, 160157, 148859, 143333, 142964, 147338, 134249, 139489, 149170, 145184, 144872, 144777, 141514, 116526, 107045, 121773, 130876, 123394, 115205, 113313, 109229, 114183, 111210, 105816, 96144, 89457, 96118, 96823, 97158, 95948, 98399, 88679, 76972, 85292, 81051, 75135, 70192, 74615, 88569, 99533, 86705, 70324, 64988, 62958, 59933, 70129, 82733, 82774, 85906, 80091, 78944, 94551, 90239, 81753, 77744, 76285, 71016, 71908, 82703, 85108, 91019, 96743, 104143, 111083, 112988, 123300, 123210, 116330, 107560, 75298, 60618, 53170, 53194, 61591, 74847, 74185, 67888, 57752, 63302, 72528, 72579, 62853, 75510, 82739, 76726, 68751, 60274, 43227, 50864, 75560, 80525, 70780, 49625, 47974, 58962, 60423, 59130, 49668, 62764, 80593, 71006, 64764, 58453, 56112, 64968, 68911, 61117, 59157, 53790]
9299E3790r897J41J0437P376P641K159j4252p318k196K328n340L186j1382Q14
9285C7487Q027l463J376J2937K241K825l470n50L79q09J3733L256J366R054l888
9270H0501p768j9675k0574N360Q358q184q565J414M239J2580J5973R046k078n627
9256F5000m796j020j814J3780m291k5309j4970J173O416J9469K459q304k467O466
9242E1792k529n676M22r446j5518q422J769J589k948j594l083O627O887m088k737
9227A3045M135J0832k789q328n271R53j392J0313J6934r63j6855l077r457L916
9213A1996J4882p144p774P528J0009J2033l158J2570q95j6520j1529p468n84k2422
9199h476j36L2787J0387j1252r246j8648J309J083J181P410J0273j0553p45J2807
$$ y = [53790, 43893, 44034, 54471, 61847, 69488, 71647, 57395, 50077, 47881, 50209, 44869, 48055, 36673, 37487, 45514, 42051, 43427, 56364, 58605, 61430, 57960, 57410, 57789, 56980, 70713, 73969, 75335, 84389, 80501, 72733, 53058, 32484, 37844, 46202, 38018, 29453, 30867, 35106, 47686, 63659, 72705, 70627, 65000, 60204, 59184, 57370, 71150, 66859, 41550, 26580, 27753, 34169, 53638, 56097, 47793, 45326, 51792, 49263, 43587, 44009, 34563, 19045, 10623, 12392, 13981, 11033, 9439, 6356, 12983, 19870, 15782, 13045, 17180, 28012, 25223, 16895, 11624, 12577, 11185, 21498, 38432, 37469, 20614, 17537, 8080, 11996, 26878, 19734, 11960, 19488, 29497, 41530, 38372, 50942, 50047, 33527, 21998, 14530, 13946, -8476, -8612, 24175, 34562, 23310, 14064, -4584, -3275, -2192, -1011, 6399, 16672, 6119, 5374, 18181]
9185A8181j482J1056Q203k2j3629K713Q928j1706l936J4097M855L995N843k440
9171D4656J209J045R37k292m304L043j778L56j2780j5629J2018l132K298R134
9157C4781R528m943O363M421j2100P51M713M579j006j605J610o620p625J2365
9143D5212L898q113k735n693l010Q601p397k3894O46K042k811J96P400M623O695
9128B5660M844p795L735K0277L640j8302j2345r766p28J04J3047J872J3868j878
9114C6233k2042L191M030m068P005J3600p925n313n3j9001k113J7104k490Q034
9100B6192O023K990k214m845O113n61J949J8806j503j6582N866N247j459M950
9086E0972R054m23j0459j2781o336J2028k607j7103j4596m546R768K4275r26j0726
$$ y = [18181, 16699, 27755, 35958, 35936, 22307, 25020, 33948, 22242, 18306, 32403, 37258, 41253, 47096, 44656, 45865, 46910, 47847, 45555, 41251, 44294, 42516, 42872, 30092, 14463, 26481, 23349, 25647, 34781, 44309, 39366, 45729, 50150, 38050, 38801, 43514, 48093, 47087, 45482, 47092, 40472, 32847, 45212, 49110, 40997, 38262, 32569, 29559, 38160, 30763, 6869, 7515, 9557, 6746, 6942, 14342, 18965, 25660, 30504, 22709, 26444, 46721, 50361, 32059, 19714, 9948, 9220, 9324, 22371, 24243, 38111, 36233, 14191, 17382, 21412, 17344, 24349, 37949, 30024, 24711, 24658, 5657, 3544, 20648, 18158, 26192, 32215, 35205, 32991, 28146, 34259, 33698, 35647, 54453, 52950, 36368, 42234, 47481, 46022, 50972, 60026, 59603, 49144, 36363, 30027, 42055, 39448, 22345, 7749, 3203, 12971, 37246, 36320, 25594]
9072B5594K147J5370J0277j511j0080j0089K244m656j1780m501J415L38j3551
9059A217J0867O300o783M0j2539p473K006Q607Q770O058N628M067J9667o460j9483
9044B0489P093l438K446J3050J6896N555k0690j9142o340J1446j0584j1584P086
9031A2283L566k424R152K554j64k090J391k0226j806P655l711m68n433R193J7738
9016B7210N01q530r605N263O314j2610r092N589Q339K877q727k87J2352Q583J5924
9001D4101M024q214j456j938j3231o452N149L492M195p214L778P695R141k048
8987D1022K86k208P16Q907P318O921J9358K0730N7573O9541L3886p707n0746n4062
8973A51535l3197k0916k2335k7188j2951p413k817m274j4129k630M625N080J4526
$$ y = [25594, 27741, 43111, 53388, 51877, 41797, 31708, 33952, 29296, 17516, 13015, 14430, 14768, 1217, 12084, 18384, 11601, 11641, -898, -8371, -6365, 2242, 11012, 17070, 22698, 26765, 46432, 39972, 20489, 27582, 24144, 26590, 39640, 56536, 62091, 41401, 22259, 15919, 27365, 16781, 5197, 12283, 15849, 13425, 22577, 25131, 24967, 22877, 24268, 4042, 2236, 9891, 6180, 5712, 279, 9472, 27210, 27711, 19181, 9576, 14839, 21153, 8543, -549, 5040, 13379, 16256, 7529, 7242, 19594, 28177, 44101, 48125, 39911, 38455, 36517, 23286, 16834, 21983, 25475, 29670, 22456, 26234, 33929, 43070, 41022, 41308, 39100, 39816, 48723, 56041, 62962, 82320, 103050, 160623, 230164, 264050, 256343, 205597, 151535, 118338, 97422, 75087, 47899, 34948, 27535, 24718, 20444, 6315, 3685, 8310, 13390, 27916]
8960B7916R249K555j0816n406J2544Q980n657j0693m520n537j1493M421O67L505
8946A5715L915J3754Q339K451o988J8810K3511L1640L4011N4182L9894R941l7415
8933B11760n5971l9127k9163k0691n260O135O09q322j1364k12L441j5019m519
8920C2297k678K1561J6674n082j5192r172j3756n249N549j3186J5616J3007n811
8907C4578J2080K58p172j040m310n433M708J1232q096l101n938R097r73M15j1568
8892B4737r190P525J5470K092n339j1996n351n725J0006J0650K851J0622R164
8879E5516j771k52n838o86p324Q45j4325l936O909q100K041P018j960P613R48
8864C6698r737n533N925L1356L4631K4526L054j0176j4062j7849l2449o699K648
$$ y = [27916, 37165, 39720, 28904, 23498, 36042, 45022, 39365, 28672, 24152, 18615, 7122, 11543, 12210, 15715, 19630, 33384, 41723, 44174, 37186, 55996, 79507, 111147, 145158, 199340, 239234, 249175, 211760, 155789, 116662, 87499, 66808, 61548, 67683, 68292, 59970, 48606, 48394, 51835, 36816, 32297, 29619, 51180, 67854, 62772, 47580, 38408, 24652, 19403, 24952, 11766, 27382, 40389, 34578, 46658, 46916, 39744, 38704, 34394, 28961, 33669, 44901, 36805, 33704, 27766, 36863, 35890, 36305, 24737, 15547, 23072, 38542, 40634, 35295, 23299, 17948, 12223, 22229, 32879, 35730, 46352, 55516, 53745, 53493, 47655, 46969, 39645, 40490, 26165, 22229, 29138, 21038, 23079, 30097, 28137, 35750, 36698, 26961, 21428, 27353, 58709, 93340, 117866, 120920, 110744, 96682, 78833, 46384, 39685, 42333]
8851D2333l462L332Q40R11p398j4241P499P685J3071j0768n573r374N025n4M195
8836C4021q94j4905k223L628J0847J3675j4196j4320n737M614M496J4621k197
8823C1430R231q803o316n827Q74J341Q379Q093O890p124k0908N127J1536J7834
8809E1757n094k3967r625N314O152r517M196q396j1664o172J6235K8l314m083
8795A850J599J8205P677j687o040L215k332j0304J0824J3156K524q463n884l21
8781B4019m817O61J1300m346p76k431J4182N070N428L39j1280j5031m143R952
8767B8127o352J1557n052j1781L509Q133M606j4174M753K1656O208L255J248m122
8753E1571k701n246j2072m458Q890K634j4814o130J027N586j954Q998j824L181
$$ y = [42333, 38871, 42203, 43043, 43954, 36556, 22315, 29814, 37499, 50570, 39802, 34229, 24855, 29880, 29826, 34021, 33127, 18222, 15999, 19627, 30474, 44149, 29953, 15633, 9896, 14510, 19006, 33627, 31430, 40661, 31858, 25542, 19715, 20589, 21930, 30309, 38402, 45292, 38168, 17260, 22387, 33923, 51757, 46663, 22696, 13071, 18385, 24537, 15020, 19216, 10820, -844, -7016, 9219, 9247, 5933, 1850, 3449, 21654, 29331, 27644, 21604, 24819, 22487, 12183, 23007, 36163, 38687, 30224, 24340, 24019, 19202, 19863, 31163, 26817, 26041, 23610, 37792, 42862, 48290, 48629, 37349, 22318, 18175, 28127, 21775, 33332, 28280, 16499, 20008, 28141, 32747, 18573, 23326, 44982, 51190, 54445, 55693, 51571, 48870, 43624, 31552, 27094, 35984, 38618, 23804, 17674, 18701, 24287, 22333, 31331, 29507, 32688]
8739C2688J6164q11l174l4Q771n711L57J2535l81m362j9573r505l871R777N583
8724C8453J0615J486j091j802n790p834r02K241O312L936k974l319K828O859m306
8709D4712J748L518J28J1198j7571j2265j062M508O041K27k904M577P585P106
8695E7546J13q700j45J0049J0956O281M82P961j8534j1562l106N484N13L754N3
8680F1145r200q089K27Q068O074O694M665k644K531o587n925K3075K9079K611
8666A11724j6346j7720j3529p750n971M474O837O99j1160k212O726O370l317m023
8652E4802O146O722j857R342K9527J2993J1149L1j029R040J726Q990M0380N0806
8638B38768R5704J01611L6825l4331o5702o0911m9774m4245m8530l6217k7485
$$ y = [32688, 48852, 48041, 44867, 44833, 53604, 47893, 48250, 60785, 60404, 56042, 36469, 26964, 23093, 32870, 38453, 49068, 50554, 49463, 47661, 41871, 34037, 33135, 35376, 41688, 45624, 42650, 39331, 42159, 49018, 44712, 46460, 49978, 50106, 61304, 43733, 31468, 30406, 34914, 40955, 41182, 38278, 42855, 50440, 57546, 57659, 48959, 48814, 58863, 69819, 76100, 76582, 84543, 66009, 54447, 51341, 56825, 57338, 61092, 61145, 51945, 43856, 44083, 52151, 58225, 64919, 69584, 66940, 69471, 62884, 56959, 80034, 109113, 111724, 95378, 77658, 64129, 56379, 50408, 54882, 61719, 62418, 51258, 49046, 55772, 62142, 58825, 54802, 60948, 67670, 65813, 75155, 104682, 117675, 128824, 128855, 127826, 136866, 138592, 147582, 187962, 238768, 334472, 436083, 472908, 438577, 372875, 311964, 262190, 217945, 169415, 133198, 105713]
8627A05713j7849j1199N174n188K323J2978k035j6723Q678K0595j4085p902J4553
8614I5033J7632J2624O67J8255N538j1667L449j2476q748L233Q419J2806J6285
8601A61050J5904k558P867L1656J2971M1681O5989R6812J54887J67864R8198l7556
8589H14765j00093r7954r3924j00342r9637o4574n3679l7265k4937j4902k028
8578A25430j5135j3307j2173j48m277p883n90l667L819m412m355j1955j0248m164
8564C6935n107p659K559K745K887L444l710J5805J4769j0J0060k937L781K1738
8550I5300L0623N5731Q0033J15751J15642P1621L0921j8960p2297j33929j01850
8539B68586p6109n0581j5213j9009k6599n699o212q483l242J251n905p023k321
$$ y = [105713, 87864, 76665, 81839, 76651, 78974, 91952, 89917, 73194, 81872, 102467, 88382, 80480, 95033, 112665, 125289, 125956, 144211, 149749, 138082, 141531, 129055, 120307, 123540, 131959, 144765, 161050, 176954, 174396, 182263, 213919, 226890, 268571, 334560, 431372, 586259, 754123, 852321, 814765, 714672, 616718, 522794, 422452, 322815, 258241, 204562, 167297, 142360, 127458, 125430, 110295, 96988, 84815, 84667, 80390, 72507, 71917, 68250, 72069, 67657, 63302, 51347, 41099, 36935, 31828, 24169, 26728, 29473, 32360, 35804, 32094, 47899, 62668, 62658, 72718, 69781, 73562, 95300, 125923, 181654, 261687, 377438, 493080, 564701, 595622, 576662, 504365, 370436, 268586, 192477, 141896, 126683, 107674, 81075, 75376, 69164, 60681, 57439, 58690, 52785, 45762, 43441]
8526D3441r462o346J9270J4909P138M658o874j4038j3367m40j0253k890K736N835
8512C4317m928q095q517J1960J5399K788K925Q40P888J1518L3491K7987L9185
8499A66758L2785J4304l1750m8659m4478l4115j4246J7548j02o592j1389o954
8487C3110q45J725j11l96j0673j1246Q80Q711M666O164q432r568M533k668J3618
8472B9468J2946K198r98j0040O55N230k885j975lN76L941P732j5990j3842k893
8457A4120r085k103N283J951P554o644j2866j60J1243L737J1709j0240K938p767
8443I670j0390M509R231M144N615J5069l530n129O661q850o562M956J810j375
8429B5829l079o713j412J2809J6602N1j982j0646j5461M901K3864J6502p703j930
$$ y = [43441, 33979, 27633, 46903, 61812, 68950, 73608, 66734, 52696, 39329, 38889, 28636, 25746, 28482, 34317, 29389, 21294, 12777, 24737, 40136, 42924, 45849, 46689, 54577, 66095, 99586, 127573, 166758, 199543, 213847, 182097, 133438, 88960, 54845, 40599, 58147, 58045, 51453, 40064, 33110, 32265, 33990, 33879, 33483, 22810, 11564, 12444, 21155, 25821, 31985, 23553, 13985, 18518, 15850, 29468, 42414, 44612, 43614, 33574, 34229, 39459, 36574, 34599, 34596, 35172, 39113, 46845, 30855, 17013, 14120, 5035, 2932, 8215, 10166, 17720, 11076, -1790, -1950, 9293, 13030, 24739, 14499, 17437, 9670, -720, 3789, 13020, 17164, 22779, 37848, 34318, 29189, 35850, 27000, 20438, 25394, 27204, 25829, 22750, 16037, 14625, 27434, 44036, 44087, 42105, 31459, 15998, 20899, 44763, 61265, 53562, 51632]
8415E1632K161n563p690k077K786P258j214j2186j1082m086K635l3j0405k162
8401I974k788P5k123l790R870L594J2067k101n516J0065q732j398j21J1755P841
8386C8672j2564n917L924P326j2074p079J1058L349M078j4334N893Q324j986J5272
8372D3942k769Q774k076P443K978N151k962p586j3334j9118J4467J7794J2053
8359F4757L635r618M276o598N300N481K23j3752O323P283J403q957P471J4256
8345H1483j3175M750J112O559M937J0416K8405J8752M4889O6616O9029L6203j3615
8332C46361o5346o5637k9084j9405k1217j8690j5742j3391m506m380l475N687
8320I1175M406n631o320q429K993p039K2890J2960r498r873m47Q81J0091O166
$$ y = [51632, 53793, 48230, 40540, 38463, 41249, 48507, 47293, 35107, 24025, 19939, 22574, 22541, 12136, 9974, 7186, 7261, 5138, 1348, 11218, 14812, 26879, 24778, 19262, 29327, 20595, 19197, 19076, 30831, 38672, 26108, 20191, 24115, 31441, 19367, 12288, 23346, 26695, 30773, 16439, 22332, 30656, 28670, 43942, 41173, 49947, 47871, 55314, 58292, 63443, 60481, 52895, 39561, 20443, 34910, 52704, 64757, 68392, 58774, 63050, 56452, 61752, 67233, 67456, 53704, 60027, 67310, 68713, 59756, 67227, 81483, 68308, 73058, 74170, 80729, 85666, 96082, 124487, 143239, 188128, 254744, 323773, 359976, 346361, 281015, 215378, 186294, 166889, 145672, 126982, 111240, 97849, 93343, 88963, 85488, 91175, 95581, 89950, 83630, 75201, 78194, 71155, 94045, 107005, 97507, 87634, 87187, 88068, 98159, 104325]
8306A04325L446L479j5135j4582K987N592R015M193N743K2489K9904M0746O7736
8293B69938P1491J3824l7449m5568m1750m1722l9492k8560n466r796j2721Q912
8281A01641J6447j1157j1726m771j6704p834j101l667j729J720l201M590j5594
8268D6914l447J0004Q750J818m085l02J0851L169o487p284j6337m37J3029m207
8254E1949q051k387n256r387q538K557O862K2814J779r236K584L971l763O091
8240E1989j572L950J0059p650r496j106Q70q536j2102R073o6k158r376o020J3620
8225C1479Q849j2904l40p178j7028o318J9437N402j002N75Q472R712j0197P003
8211C5962M366K733K177j4518n302m357J6239P847l774M593k021r058j2264K170
$$ y = [104325, 107771, 111250, 96115, 81533, 84520, 90112, 99127, 103320, 109063, 131552, 161456, 202202, 269938, 341429, 355253, 317804, 272236, 230486, 188764, 149272, 120712, 115246, 105450, 92729, 101641, 118088, 106931, 95205, 90434, 73730, 65896, 64795, 61128, 59399, 61119, 57918, 62508, 46914, 43467, 53471, 62221, 64039, 59954, 59652, 70503, 73672, 67185, 59901, 43564, 43127, 56156, 51949, 43898, 41511, 36255, 26868, 18330, 20887, 27749, 50563, 52342, 43106, 45690, 49661, 45898, 51989, 50417, 54367, 64426, 56776, 47280, 46174, 47044, 38508, 26406, 35479, 35413, 33255, 23879, 17859, 31479, 40328, 27424, 27084, 19906, 2878, -3440, 15997, 21399, 20397, 20972, 29444, 39156, 28959, 35962, 40328, 43061, 45238, 30720, 25418, 21061, 37300, 45147, 41373, 45966, 43945, 34887, 22623, 24793]
8197B4793l091p323m938J0089K501J0197k931p282n699L225J1264k0722k7439
8184a7356O895J6683Q326L893j2289J211J9237J0672n156j4353m675Q046n026
8171A6108J708j699M294K2271L963k480j802K036p198J454N617J4823o460k4575
8157B8060j845j0574j891R203K233J1207n298j494k147J1114J3166j1865m40p905
8143C1524j5447Q903q040J230q62O088L077k961j648O168m792l881J287o202Q522
8128B2966J2824L677j479j2661j1279P885r226l445N324L985R519L973k260P015
8114C6818r49J35J0234j88j441m462l024P103j8129j3611P235n955k815j831J680
8099A0800R612J2824r530j6974M98J4643r193q065j850N583J0571J2107p964n476
$$ y = [24793, 21702, 14379, 9441, 19530, 22031, 32228, 29297, 22015, 16316, 19541, 30805, 10083, -17356, -10461, 6222, 14548, 18441, 6152, 7363, 26600, 37272, 32116, 17763, 13088, 21134, 16108, 17816, 16117, 20411, 42682, 46645, 44165, 42363, 44399, 37201, 38655, 44272, 59095, 52635, 28060, 26215, 15641, 13750, 22953, 25186, 36393, 31095, 29601, 27454, 38568, 51734, 39869, 39429, 31524, 16077, 24980, 16940, 18170, 17308, 23396, 26473, 23512, 21864, 28032, 23240, 19359, 20646, 14444, 22966, 35790, 39467, 37988, 25327, 14048, 21933, 12707, 9262, 14586, 18571, 28090, 32063, 29803, 36818, 35869, 36004, 46238, 46050, 44609, 40147, 37123, 44226, 26097, 12486, 19721, 13766, 10951, 9120, 10800, 20412, 33236, 23706, 6732, 7230, 21873, 12680, 4615, 2765, 8348, 18919, 31026, 23062, 17586]
8085A7586r896N89r4J990O444l225j4156j109J4613Q938j151O408R884J1178j3149
8070C4850j4939N260R778o907P515N57j1515o544p748j7734P152J4731N711N660
8056B5827j5272l633J0584J030N783j107J535J3753q97r629M465L876j770k841
8042C1704J181J675M205N269k451m776n117Q833J2254Q013j1792j5581j837r699
8028B1881j0585j5341L04K3233J4506P20j443J456J2229Q618P85k128j6832N023
8014D2426O288j4614L816q179j1753l66J0056J2542J257o362J2841K202q959j1952
8000B9243k770O326O37J4205j304J269k336N538j737k1911q573O976Q874N54m95
7985C4496k306q936q798r872P823P979o531q982K242R252R665j2539k342K207
$$ y = [17586, 7690, 8279, 8185, 10175, 16619, 13394, -762, -1871, 12742, 21680, 20529, 26937, 36821, 47999, 34850, 19911, 25171, 34949, 28042, 35557, 36114, 24599, 18055, 10307, -7427, -275, 14456, 20167, 25827, 10555, 6922, 17506, 18536, 24319, 23212, 24747, 38500, 37603, 27974, 32439, 36315, 34545, 31704, 32885, 34560, 38765, 44034, 41583, 36807, 31690, 40523, 52777, 60790, 48998, 33417, 31580, 21881, 11296, -4045, -3741, 19492, 33998, 34718, 33275, 34731, 46960, 55578, 56363, 54235, 37403, 42426, 48714, 34100, 37916, 29737, 17984, 17618, 27674, 40216, 41473, 35111, 47952, 50154, 41195, 29243, 26473, 32799, 33436, 47641, 46337, 47606, 45270, 50808, 49071, 27160, 18587, 25563, 34437, 34991, 34496, 32190, 23254, 14456, 4584, 12407, 20386, 13855, 4873, 7115, 16367, 26032, 13493, 11151, 13358]
7971A3358O236J5846P759J2117p739j2692j528m180r165n28J2642N054q105m203
7957B4872J1091M675M094M333j0200k2814p643P716J2368Q98J036J7400N351j694
7943E1483j7263j1542R57o542p320L203L417l449o057Q571o103o904o035q92O99
7928c777q610j438K0858R842J683N863k788K635J9440J274J654k016j714K528
7914D5434Q95q550k169m285j981l130O935P912n194r254j5454l323J4096N353
7900B7285K3851P040j1492q272k2246k3473n587m853N143J2498J1844r668j7976
7887a5906j2129J1990P230r889p810K2172J8507J1456n340L848j402L666k184
7874B4209r287L272Q989j0002r47j370J110R563J0360o33r021o953o514p657J01
$$ y = [13358, 19594, 35440, 43199, 55316, 47577, 34885, 33357, 29177, 20012, 19484, 32126, 37180, 29075, 24872, 35963, 40638, 44732, 49065, 38865, 16051, 8408, 16124, 28492, 29390, 30426, 47826, 53177, 51483, 34220, 22678, 23635, 17093, 9773, 12976, 16393, 12944, 6887, 15458, 9355, 2451, -3584, -4476, -3777, -12387, -13825, 7033, 16875, 18558, 24421, 21633, 24268, 43708, 44982, 46636, 44620, 42906, 45434, 46329, 37779, 35610, 31325, 29344, 26214, 33149, 41061, 35867, 26613, 11159, 7836, 21932, 27285, 51136, 58176, 46684, 38412, 16166, -7307, -12894, -17747, -12604, -106, 11738, 2070, -15906, -28035, -16045, -8815, -18704, -26514, -4342, 14165, 25621, 20281, 24129, 22727, 26393, 24209, 14922, 18194, 27183, 17181, 16234, 14864, 15974, 25537, 35897, 35264, 26243, 19290, 12776, 5119, 5220]
7859E220L153n241K293N801J550N82P483J2842j5671j7508K55J3188M051r404
7845H594j5337o419Q799J3979m111O523O318j4707l175l434K834j0217L432o574
7831a3495j1425J5130J6071o127M391M018K006J877P724L078K135l872n940p381
7817H190k604k538p423r556M552J683n347N776J4815j390q042K404N885J6136
7803B2541k297o934k078r591j0678R56K20J3933J4361Q793m633j5737J382M000
7789A4238q188Q271J6041p807j0156l298K101j893P161P285n522p954L191o26
7775A2844j0459L983R734k672L891J731j0463J30l965j0480l855K121K148J0966
7761E654P09q346Q98j605j0781m018O904m28m096r545L207J9616j182l223r573
$$ y = [5220, 8373, 3132, 5425, 11226, 12776, 13358, 20841, 33683, 18012, 504, 759, 13947, 17998, 8594, -6743, -13162, -4363, 9616, 5505, 12028, 18346, 3639, 464, -2970, -136, -10353, -6921, -13495, -24920, -9790, 6281, 154, 4545, 8563, 10569, 12446, 20170, 23248, 25383, 21511, 15571, 8190, 5586, 3048, -4375, -13931, -9379, -7696, -13043, -7267, 7548, 6158, -1884, 520, 6405, 22541, 20244, 13310, 11232, 1641, -9037, -8081, -7861, 6072, 20433, 29226, 24593, 8856, 10238, 14238, 6050, 14321, 30362, 22555, 12399, 9101, 11202, 9309, 16470, 23755, 18233, 10279, 13470, 12844, 2385, 6368, 16102, 13430, 17321, 19052, 8589, 8719, 4754, -5726, -9581, -7460, -5312, 5654, 6363, -1983, -1085, -2690, -13471, -17489, -10585, -11013, -15109, -24654, -21447, -1831, -3013, -6236, -15809]
7746a5809j1105J4778J7309L594j1269n865j2494l453j114J0691Q038k328P376
7733a651O145m478o944p690m502o653K066J5137m356l271J0256m254p709O353
7719a1551N746m715k817o61J5925J5676o524k225n944Q237l888p795n14o6m440
7704e556P620O612m203n377p331N939n607j699P036P746J278j3255k945O77L900
7689e165K82l03M724J7097L956j2640k0662p054k953j669j357O914K7471n378
7675C263m883m373L385n899q01m460J7677J1161K767L254q571P370r397j4044
7661c551O272n899n619m178l153k612L369J2842P597j908l599m82R057K210r508
7646H38j237N363J6278P696r038r514j1666m294J7396J1871J1996r207k0854k0613
$$ y = [-15809, -26914, -12136, 5173, 8767, -2502, -8367, -20861, -24314, -25428, -14737, -6699, -9027, -1651, 4494, 16, -6928, -14618, -19120, -25773, -23707, -8570, -12926, -16197, -5941, -10195, -17904, -11551, -5805, -10520, -13337, -13998, 1927, 17603, 11079, 8854, 2910, 11147, 7259, -536, -1050, -1116, -5556, 2064, 8676, 4473, -904, -8235, -2296, -7903, -9602, -2566, 5180, 6458, -6797, -9742, -9065, -5165, -4883, -5186, -462, 16635, 20591, 7951, -12711, -19765, -22718, -24387, -25744, -18830, 8641, 3263, -1620, -5993, -2608, -8507, -9308, -13768, 3909, 15070, 17837, 21091, 12520, 19890, 10493, -3551, 2721, -3178, -8797, -12975, -16128, -18740, -15371, -2529, 5068, 3160, -439, -921, 8136, 10346, 838, -399, 4964, 21242, 28938, 19900, 10386, -1280, -5574, 11822, 23693, 35689, 26482, 5628, -14985]
7632a4985O091K006J612L59Q770M784K680l677n530m722L337M414o149o357l52
7617g719J0312m709p849N386j200p446Q270J9194L591Q027l518j8561K431j285
7603D924j1927r780j4725Q12N623Q688P627N175k303O082j2711j1770j714J5953
7589a0046P138p696j0638o788K3233R459R856j0967j6971p74p413j5786J2181
7576b5212p773k448J0094M389J1903R001j3798k674k58K936O61P83n561j301O024
7561a3234n919j084k79q165o660J1785J8414L921o43j403j912l322j0083L463
7547a5121l724L940K772n413j046q031L193J3357M704j0021o670j573q501m748
7533c6882O077Q46K393J2473Q210M700J2052K4700p151m247p757j4506j7567r416
$$ y = [-14985, -8894, -6888, -5276, -4917, 3853, 8637, 11317, 7640, 2110, -2612, 725, 5139, -1010, -7367, -7719, 2593, -2116, -9965, -4579, -5779, -13225, -4955, 14239, 17830, 25857, 22339, 3778, 6209, 4924, -7003, -16783, -31508, -30696, -25073, -16385, -8758, -3583, -5886, 196, -12515, -24285, -25999, -10046, -2908, -10604, -21242, -28030, -4797, 4662, 14518, 3551, -13420, -14194, -21607, -37393, -25212, -32985, -35433, -25339, -20950, -9047, -46, -13844, -16518, -16776, -13840, -13179, -12396, -17957, -19258, -13234, -19153, -20237, -20516, -28681, -35341, -23556, -5142, -1221, -1864, -3267, -5179, -8501, -18584, -15121, -18845, -14905, -12133, -17546, -18592, -26623, -23430, -10073, -5369, -15390, -22060, -23633, -32134, -36882, -30805, -29959, -27566, -15093, -6883, -2183, 9869, 34569, 27418, 23171, 15414, 908, -16659, -26075]
7519b6075J1383J3783r26k576L648K752q275r176n656j2900q333J3665J6176R842
7505b668m222n428R29O740R024l721L738k274K374L844j887q010l510Q803L877
7490G609k028M98k607j1695j0385J301J3188Q960M961m642J4123r89r630N16j935
7475G245o499j7003l301P816K798l523p809j594j0056M422N724J0108k962L051
7461a1583N287N500J1735K889P700J952J581k196o206l17q645k817n474k730k173
7446e497J4186m483j5744j2606q40R965R242L46Q091K335r425N448J3979j5392
7432c95j3928Q22L707Q068L368O422n228j2635j234m110j4503o325J6871M723
7418a4377r422Q793J888n686J1023K717n253l248L486j368l214J1708j22k627
$$ y = [-26075, -14692, -909, -1835, -4411, -763, 1989, -6286, -15462, -21118, -34018, -42351, -28686, -12510, -2668, -6890, -12318, -11389, -4649, 4375, 654, 4392, 2118, 4492, 8336, 6449, -1561, -5071, 3732, 7609, 5581, 6079, 3472, -8223, -18608, -17307, -4119, 4841, 9802, 5160, 19283, 18294, 8664, 9180, 7245, 746, -16257, -19558, -11742, -8944, -12467, -20276, -21870, -31926, -27504, -21780, -11672, -14634, -11583, -6296, -796, 10939, 13828, 21528, 23480, 25061, 22865, 16659, 16342, 7697, 4880, -594, -3324, -5497, 8689, 4206, -11538, -24144, -24984, -15019, -5777, -5431, 2660, 4995, -4430, 1018, 14997, -395, -14323, -13501, -9794, -1726, 1642, 8064, 2836, -9799, -11033, -15143, -29646, -35971, -19100, -14377, -23799, -15006, -13118, -18804, -7781, -5064, -10317, -13565, -10079, -11447, -14661, -2953, -3075, -5702]
7404e702Q268K701N661k716j2567p319l743K40j930J471K159R22j3906o978M680
7389b8759N047J225J1846L002j2061M561k097j09R52J0O772J360R875p63j0834
7374i973q164J1069O398K648n95l333K020J5586j633p796p283j051j3164j80Q399
7359g052K160L081K645j2862o076R045k523m314J745J8528R62J148K239N375N214
7344A9315k854j3510l621P133L13p05k600n621o235j4148p57m300j2829J270P717
7329c1432Q355J3996J4847m21j1089K005p585M687P272Q198M624p98j1039r081
7315g461p628P575J2977k213n255M95j2194k237l744J1922j027n218J2695o21
7301a934p0j7882n660l40m676j342O469J2297L023q511j5551M611J0350J5305
$$ y = [-5702, 2566, 5267, 10928, 8212, -4355, -11674, -15417, -15177, -17107, -15636, -13477, -12555, -26461, -33439, -28759, -23712, -22487, -10641, -7639, -19700, -15139, -17236, -17345, -16393, -16383, -9611, -8251, 1624, 861, -9973, -18137, -7068, -670, 1978, 1383, -1950, 70, 15656, 14023, 6227, -1056, -2107, -15271, -15451, -7052, -4892, -1811, 834, -12028, -18104, -9059, -11582, -15896, -14151, 4377, 5339, 6487, 8726, 14101, 19315, 16461, 2951, -670, 6463, 6776, 6071, 3471, -2150, -8385, -22533, -23290, -27590, -40419, -39149, -31432, -23077, -9081, 5766, 5345, -5744, -3739, -11324, -6637, 635, 8833, 13457, 12659, 1620, -7461, -15089, -7514, 5463, 3250, -2005, -1510, -13704, -15941, -19685, -7763, -8790, -14008, -1313, -1934, -2004, -19886, -25546, -25886, -30562, -31904, -25435, -13138, -10115, -18626, -34177, -29566, -19216, -3911]
7287c911M029J456j0215P754J8250K430k3397j0666J1873N126r624k1979R74P219
7273b0681J0412J1963L525p093q396j2539N228J4974j111O029R751j3525q550
7260a0013J651J095Q154O003j922q368J415M568j0139q456J402R64J1065Q337
7246E756n443j1230K836M534K690j2076L368L822P692m244j0080r945K410P152
7232a2758K817J3029j203r650p930R592L153J0405P641p690k2530L675P552J927
7218a970k424n412j1123M638K379K89j2210P392k414Q227q103j063N306N364j552
7203a2676M269L556L384j349j0547q816m03J5519O797l251r165o060M887o548
7189b0403M151P033k469k238J741n871q467l606L270Q353J508o49j645k619L290
$$ y = [-3911, 118, 1574, -8641, -887, 17363, 19793, -3604, -14270, -2397, 2729, -6895, -28874, -27900, -20681, -10269, 1694, 5219, -1874, -10270, -22809, -17581, -2607, -3718, 2311, 12062, -1463, -10013, -8362, -7267, 887, 6890, 4968, -3400, -1985, 2583, -7556, -16012, -14610, -13646, -2581, 5756, 313, -10917, -8081, -3547, -857, -12933, -9565, -5743, 1949, -2295, -12375, -22320, -19910, -12758, -9941, 3088, 1885, -7765, -15695, -6103, -2950, 7455, 15096, 7406, -15124, -11449, -3897, -1970, -4394, -9806, -20929, -16291, -13912, -13623, -25833, -18441, -20855, -12628, -20731, -21794, -16488, -11124, -12676, -8407, -4851, -1467, -2816, -13363, -22179, -22582, -7063, -266, -3517, -12682, -18742, -13855, -20403, -16252, -9219, -11688, -13926, -12185, -18056, -26523, -30129, -26859, -18506, -16998, -17647, -19292, -21911, -18621]
7174a8621N324O863n697j2781p183N530m688n730J4510J0164j1300J255P806q414
7160b2962M228J0897P611o923r453m309O789j615k007L598M080L450O476L317
7146C177q594M86M833L82M959l108r581o58R658J0886P068q162j5752j4267K933
7131a5740m61J1018N947K881l375j2194r621n399O963N292O500k84m063J3720
7117A184M798k456j0144k569J419m495k220K346j76K644O586J7360m466q993l312
7102b494P710m327l04n08O057J525r452p321J321J0900O454O462N913k689p409
7087A1838n739j4815o392q018J1282N05J0810L652L186q467j104m079K04n870
7073a3007k881q665J588j273N333P193L744P73l463M511p528L188K01m0k742o453
$$ y = [-18621, -13297, -6434, -12131, -24912, -32095, -26565, -31253, -36983, -22473, -12309, -23609, -22354, -14548, -22962, -18734, -7837, -226, -7149, -16602, -20911, -14122, -15737, -17744, -14146, -10066, -6616, -140, 3177, -5417, -4931, -98, 284, 5243, 2135, -7446, -8104, 1554, 12440, 19508, 11346, -4406, -18673, -15740, -16201, -5183, 764, 3645, 270, -11924, -21545, -26944, -19981, -14689, -8189, -8473, -12536, 1184, 5982, 3526, -6618, -9187, -7768, -12263, -14483, -12137, -12313, -9669, -3083, 14277, 9811, 818, -2494, 5216, 889, 585, 77, 6134, 7659, -1793, -9114, -7793, 3107, 9561, 16023, 21936, 19247, 11838, 6099, -8716, -15108, -23126, -11844, -11339, -529, 3123, 6309, -2158, -3262, -7341, -7137, -13007, -15888, -24553, -22965, -24238, -18905, -11712, -7968, -7195, -10658, -6147, -13675, -10487, -10286, -10326, -13068, -19521]
7057a9521M707L599J9898Q81M749p88j0223j6345K660N926K450k483r452O062
7043g880L521j540k0135o803N511J932J3024J4707J970j6145n958J2475Q744k910
7029E13R009q521l262l405m547n949p081L274J7454J1376K435J2365N00j4263
7015I898r968o454j0366j4070R871L471M018P348J0385R267J0808M262q724J0394
7001C0140l027l244j6490k2081q369O046L049j1535K708L286J0308J119l417J0264
6987a243k060M084R053j0578j4369J210J16K298O880K511Q940N208j0644j5459
6973a4053l170J1063J2169j1752l716l029L042M266K983M173p916j2251m584k475
6959b5250J190j4502Q937O488J0048J6027r406j9765k110L373O260L599j9516
$$ y = [-19521, -14814, -11215, 8683, 9564, 14313, 13525, 3302, -13043, -10383, -4457, -2007, -4490, -13942, -7880, -4359, -5899, -26034, -32837, -27326, -25394, -12370, 2337, 4307, -11838, -17796, -5321, 3423, 513, 9522, 1001, -2261, -5666, -10213, -16162, -23243, -19969, -2515, 8861, 11296, 23661, 24161, 9898, -70, -6524, -16890, -30960, -21089, -17618, -13600, -6252, 4133, 13400, 24208, 28470, 19746, 30140, 27113, 23869, 7379, -14702, -23071, -17025, -13976, -25511, -22803, -19517, -9209, -8090, -11507, -1243, -3303, 781, 9834, -744, -15113, -13903, -13787, -11489, -4609, -2098, 6842, 12050, 1406, -14053, -17223, -6160, 6009, -5743, -9459, -12488, -9446, -5180, -2197, 1976, -5940, -18191, -22775, -25250, -24060, -38562, -29625, -23137, -13089, 2938, -6468, -26233, -28343, -24970, -18710, -15111, -34627]
6946c4627P014J8766j0398Q81O225P120O223p276n51N527j3446o149n901J1115
6932a5477J0975M611k080j359K393n091O586j195n329j851n127l610L721O478
6918f355J0283J8380n836k3134j2992J0833J8836J8354J1752j2770j6492j4564
6906c705r583M973J2545o048q101J2475J1241p206j3118P803Q526j3432j1229
6893a4859O772J2016j3142r823L644P280R029M534o717m33j29m909l919M492o404
6878a2568l918l726J0449J5162m324O681J12J469j237K108K125j2611k588K886
6864B0q715J6638N280m556O786j758J563n111p043l317m668J1754L136r525n550
6849e066n628M430P763J213l320j0319p498P234N020N496Q941o769j3259j1691
$$ y = [-34627, -27613, -8847, -19245, -18364, -12139, -5019, 1204, -6072, -6623, -1096, -14542, -20691, -26592, -15477, -4502, 109, -1971, -3330, -937, -6028, 558, -637, -5966, -7817, -12944, -16554, -12833, -6355, 3928, 22308, 16472, -6662, -19654, -8821, 10015, 28369, 40121, 27351, 10859, -3705, -13288, -8315, 4230, -1818, -9919, 2556, 13797, 6591, -6527, 1276, 9802, -3630, -14859, -8087, 3929, -9213, -19036, -15392, -8112, 917, 5451, -1266, -1699, -1828, -6737, -10656, -6164, -12568, -16486, -20212, -9763, 5399, 1075, 7756, 7868, 9337, 8100, 10208, 12333, -278, -2866, 20, -8695, 7943, 13223, 8667, 15453, 13695, 15258, 10147, 3104, -213, -4881, 6873, 10009, 484, -5066, -10694, -6264, 1499, 2712, -608, -10927, -18425, -11191, -6171, -675, 8266, 1497, -11762, -23453]
6835b3453j2814P113O080L210j348j543J2790M813Q451J9385r76l871J255k318
6821A6774j878j2140j449p19L109Q487J1991M136j3242j2810m296r956r849j3984
6807c5826K0747K5793O36j947Q4r335J56j24m034m142n083j071J3055N275l724
6792D60Q106P272j2093j1252R481J2262j808n771M056J599p306j5314J867k88
6778h729m561J041R515r66o692N718o935l425R451k48J507k388j6798j1653J5324
6763a9839R339m536K052l350O480j309j41N847Q850o484r760J1741O444j721J2266
6748A5879K307p038p211q689n963L547K2666P326k130j983N324M084p546J414
6734B1987j3502n656N492P117K296j4704J3k636O720J4705N313J4386J8650J6966
$$ y = [-23453, -36267, -29154, -23074, -19864, -21212, -22755, -9965, -5152, 3299, 22684, 21708, 17837, 19092, 16774, 14896, 2756, 1307, 588, 3697, 12184, 24175, 28311, 15069, 2259, -2037, -11993, -21842, -35826, -15079, 10714, 11350, 9403, 9487, 152, 308, 184, -3850, -7992, -13075, -14146, -1091, 4184, 460, 8566, 15838, 3745, -7507, 1974, 14236, 12428, 6657, 10713, 12312, 5006, -10308, -8441, -8729, -13290, -12249, -2734, -3700, -10392, -4674, -11609, -15034, -5583, -5831, -4324, -6712, -23510, -35163, -19839, -10500, -15036, -12984, -16334, -9854, -11163, -11304, -5457, 3393, -3091, -12851, -1110, 5334, 3613, 15879, 18186, 11148, 3937, -4752, -10715, -7168, 15498, 22824, 20694, 18711, 24035, 28119, 20573, 21987, 8485, 2829, 8321, 15438, 17734, 3030, 3043, 407, 7127, 21832, 27145, 41531, 60181, 77147]
6720G7147K3571J6102j4662k5275l1894j0528R67j258k3213j1061j1224K59m332
6707a5401Q11O373O429J103P431q292L425o093j1091r94J56L253P831N130K283
6692B354l62O31N443O031m301J15m474p939j2975p113m903J203J1866M814M793
6677d817Q510k925j8461j2867n959J6834Q243J5435Q407O881p941j3872l797O215
6663a14J049K045Q108K485j490k670j7017J636J056j4321J3670R158J878j9532
6649a4059k496P135L506o96j8894N719M815J098J6463k249k151j222m753j128
6635h912J0624L744j59O883N589r929o033r486j8649N922J0050o208o458N908
6621a7114L816L149Q122k156j2311l347R603M464m656P91q8Q66n865J081P04L777
$$ y = [77147, 100718, 116820, 102158, 76883, 44989, 34461, 35428, 34170, 10957, -104, -11328, -11069, -15401, -14590, -8217, -1788, -685, 6746, -1546, 1879, -4214, -15305, -16299, -16143, -12890, -5059, 71, 2354, 1992, 2623, 8066, 14097, 9796, 9911, 5437, -2502, -15477, -22590, -27493, -26290, -14424, -9610, -4817, 3693, 768, -17693, -30560, -36519, -19685, -11442, 3993, 12400, 19281, 11340, -2532, -6329, -114, 935, 2980, 11088, 13573, 12083, 9413, -7604, -5968, -4912, -19233, -5563, 3595, 5473, -14059, -16555, -9420, -5914, -6610, -25504, -19785, -14970, -13872, 2591, 342, -1809, -3031, -7784, -8912, 1712, 5456, 5297, 12180, 17769, 7840, 1807, -7679, -26328, -20406, -10356, -16564, -23022, -17114, -13298, -10149, -2027, -4183, -16494, -19841, -10238, -5774, -10430, -9639, -9727, -8861, -14726, -13645, -12941, -9164]
6605i164M936N684j221q482j7048P189J9294o095m000J1311O647p946j199l172
6591c266p469P072r31k1699r330J4000M752J231k249P422J2982k581K862K962
6577E758o0r265P462O610r493j0368K619M911L666l032K068m616P526n718J77
6562a755J3935k644k778K944J329L150l806J3338r765k1854O932J324k837K99
6548b188J217k547K739J3819j447K983k187m484J0376J206k1737r522O331L122
6534b319j0507j945J4665N19n578m29J1539O399K885M078K04m905m068r916p110
6519f488K857n977J96K96p829j87O908M617R199R256N128q835K614J118q533m242
6503I8r19j271j92k797m138p295k943J0338L079q896j1911L422J6855J1384l396
$$ y = [-9164, -4228, 1456, 235, -8247, -25295, -18106, 1188, -4907, -8907, 2404, 9051, 1105, -94, -3266, -10735, -3663, -4594, -26293, -35623, -21623, -16871, -15640, -17889, -10467, 2515, -66, 2796, 5758, 5698, -3567, 3895, 10505, 1012, -9356, -6737, -1826, 1840, -1192, 876, -3740, 3786, -1932, -1755, 12180, 9536, 6758, 9702, 11031, 14181, 10375, 23713, 13948, -7906, -974, 350, -2487, -2188, -971, -3518, -779, 13040, 11593, 14576, 12389, 7905, 18281, 19487, -2250, -11772, -5441, -2319, -12826, -14771, -106, 413, -5165, -5594, 5945, 12344, 15229, 19307, 19511, 14606, 10538, 622, -6488, -3631, -9608, -9412, -9116, -16945, -17132, -10224, -5607, 3592, 12848, 17976, 9141, 11755, 12873, 4340, 98, -821, -2092, -2284, -5081, -9219, -16514, -19457, -9119, -6040, -14936, -26847, -23425, -6570, 4814, 1418]
6488A418j5510j448k414J1529J5952k381j7550j7102k155m040R475Q433k212l971
6474b1976j0049P609M047L582O543r405M179J2432P837M33l307p095K795n36n916
6459h827k1380l658J1831J3977Q821l665J556j7J2188n659P882l58j3199n097
6445e605o547j0363j653J1300J8485k754J378j0999J2282M156q136J4746j6185
6432A05j2578M254j2051k756K364N160k681M611J107L330P411N732j4024q380
6418a8396m285K732J4394J0061k366j419O826O702j586o370j9563L886J0447P115
6404H178o465j3255Q488O741M884R609P628r04j4141n594m906J2512m221l194
6390E360J129m000o265o620J513P157j684q025k600L543l917j6086Q439J1953
$$ y = [1418, -14092, -15540, -17954, -6425, 9527, 7146, -10404, -27506, -29661, -33701, -24226, -15793, -18005, -21976, -32025, -24416, -20369, -16787, -10244, -19649, -15470, -3038, 4799, 5232, 1925, -5170, -2375, -2911, -8827, -30207, -33865, -22034, -8057, 764, -2901, -1345, -1362, 10826, 5167, 13049, 12691, -508, -5605, -12152, -22515, -24168, -12868, 5617, 2863, 4241, -6758, 5524, 9680, 1544, 16290, 105, -12473, -8219, -20270, -23026, -20662, -15502, -18183, -13572, -12465, -9135, -1724, 4008, -10016, -18396, -22681, -19949, -5555, 4506, 2140, 721, 7547, 14249, 12663, 6293, -13270, -9384, 1063, 8178, 1713, -11542, -3054, 3687, 8571, 18180, 25808, 24904, 10763, 5169, 263, 12775, 8554, 5360, 6489, 2489, -3776, -10396, -8883, -1726, -3410, -11435, -14035, -10492, -14409, -30495, -22056, -10103]
6376a0103r04n38m376k622K2734j62k0118n145O398q39N942P116n882j6459n487
6361c0445K774N664N081P254M031J3562l666n26k0973n654J5149M764l950j0377
6347a7312j185J2767Q846j0680j3138k21J328L77J3433Q2O528K714L810N087M92
6332A2928j1186j5529q861J4355J3348R608j2361m816m946Q006Q347P816j2243
6319D466r072L631o451j3113Q996Q625J5167k338j1572L214L170r140k1377M869
6305b0925O891o304q40j74K745K884o378J4043J9332l448N648J3453L725p590
6291B3062r220n937J0459J1866n25k78k0469j8969L143j6087k479K0703M032K259
6277A560l192K841j1375K173l908j2875M542P016N657l889J6277K4931k459k0537
$$ y = [-10103, -11007, -11545, -15921, -18543, 4191, 4029, -16089, -21234, -14836, -15675, -9733, -2617, -8499, -24958, -30445, -27671, -22007, -16926, -9672, -5641, 7921, 4255, 3729, -17244, -22898, -7749, -2985, -6935, -17312, -18497, -5730, 3116, -7564, -20702, -20923, -19595, -19218, -5785, -5703, 825, 3539, 7349, 12436, 12928, 1742, -13787, -22648, -8293, 5055, 14663, 2302, -2514, -7460, 546, 8893, 16709, 4466, -4606, -975, -7426, -20539, -11543, -2918, 12249, 9911, -1661, 1553, 4723, -4417, -25794, -20925, -14034, -20338, -21178, -21352, -18607, -15723, -22101, -8058, 11274, 7826, 13474, 26927, 30652, 23062, 13842, 7905, 18364, 30230, 29705, 29427, 8958, -10011, -6868, -22955, -25434, -4731, -699, 1560, -1632, 1209, -10166, -7993, -11901, -24776, -20234, -13218, -7561, -11450, 4827, 29758, 27299, 6762]
6263F762q023o510p897m584N394J1169m418l328M917l153Q00M940K247K259L227
6248C802m895P74K96L593m032l000L388m151L914l138N174J0706m310J474K982
6233A2577o12N008o866K79J41P77l819N403P354o023j1214k140k172L715O67M655
6217G730N21p296j9361M811J1666j516j0078K905q906k853J0723J097n611L411
6203a2757o185N362RJ263O405q711K109j510M989m846j497J960Q990j100j2708
6188a8227J570K890N9n926p723R170O838j1518J832O355J109O698l676J1253O596
6173G300O836j8704p013J0871J3674n831q399R048N754q683j5481o640Q516Q5
6159h667L676P914M640N960n773m602J452r311k125r6j191k965R120J0586M108
$$ y = [6762, -1261, -7771, -15668, -20252, -14858, -3689, -8107, -11435, -6518, -9671, -8871, -3931, -1684, 575, 3802, -1093, -319, -23, 3570, -462, -3462, -74, -4225, -311, -3449, 1725, 12431, 8121, 9595, 12577, 11965, 16973, 10107, 10386, 10527, 11304, 7485, 12888, 20242, 14219, 3005, 865, -1307, 2408, 3075, 7730, 8251, 955, -18406, -13595, -1929, -3445, -13523, -10618, -19524, -22377, -11654, -10557, -16168, -12757, -18942, -13580, -13571, -12308, -5903, -14614, -12505, -14015, -9026, -13872, -15369, -13409, -4419, -5519, -18227, -16657, -13767, -13708, -19634, -27357, -18187, -11349, -22867, -21035, -14680, -13571, -6873, -10549, 704, 7300, 14136, -4568, -11581, -710, 12964, 7133, -1266, 7782, 13536, 4853, -10628, -17268, -8752, -8667, -4991, 2923, 7563, 13523, 7750, 3148, 4600, -4711, -6836, -6932, -8123, -11088, -1968, 8618, 12726]
6144A2726r081j4251m439j196o644J513j0175k694J2117J990Q046M537n933P893
6130e591P702j809j3091l664J0113M174j163l412O531M073l118M86M836q53n334
6115a20k603J157J0295K399k920R67o103o075j9892k908J1407J097M388M33j0415
6100a8893l1R412L466j3318p377k819P491M529L990M015R744M191k731k075o622
6085g028J0181J330M334Q324N753r648l480o774N32r83q502K377J6154J5692l428
6070B4834j1827q424j18K412l058M110J37P94Q65L362O87p641l804K106j0651
6055f216o85J2565l15n130M008N08n931O780q540r878J205j025l476k757m474
6040b3361m360n914k606K218J1619P981R140q448r040R163J0203P900j376J40
$$ y = [12726, 3645, -10606, -15045, -16241, -22885, -21372, -31547, -34241, -22124, -20134, -12088, -7551, -13484, -5591, 2111, 302, -12789, -16453, -6340, -2166, -3329, -6741, -210, 3863, 745, 1231, 6067, 5214, -120, -2723, -1566, 8729, 11128, 8208, 9175, 3072, -3003, -22895, -25803, -14396, -13299, -8911, -8478, -18893, -18924, -9512, -6046, -19364, -26741, -29560, -22069, -17540, -13550, -9535, 209, 4400, 1669, -406, -7028, 3153, 4483, 8817, 17141, 22894, 13246, 9766, 2992, 3524, 2541, -5961, -3584, 12570, 28262, 24834, 13007, 4583, 4465, 6877, 3819, 7929, 8066, 8860, 9725, 13087, 13774, 6133, 2329, 4435, -6216, -6901, 5664, 5349, 219, 4227, 4735, -1196, 5584, -2956, -12834, -11629, -12654, -16130, -18887, -23361, -27721, -33635, -36241, -34023, -22404, -14423, -5283, -13731, -22771, -13608, -3405, 4495, 3119, 3259]
6026C259r472j1882o098p11L128l9Q920K4432m126j2209O545L916L540n284q995
6011e076k237P295o921j1428M513Q936l284l232L318j346J411m747J880P306K496
5996a116O813N925o449k9892L388J0965J1204J550o670l291O867n803K41K152
5982d116r054j4687r48J4236P679J0887J6269N161N890k0418j4697J1007J1827
5969A9036n039n996l960J99J0988P298k387p321Q749P470j0181L633j0128j0482
5955A879N656J0546l13J3199M946n849r689p783j3825L01P37j467p445j2212L209
5940a8110L225L23m09O921J2639N889m802n938R146j932l952o617Q373M94K3n025
5924B48j4842K111J8362L462k0578l328J087K574M360J247L079j1584j0942j02
$$ y = [3259, -6213, -18095, -24193, -24904, -21776, -21815, -12895, 11537, 7411, -4798, 1747, 5663, 9203, 3919, -5076, -7313, -18, -6939, -18367, -13854, -4918, -8202, -11434, -8116, -9462, -8051, -12798, -10918, -3612, -1116, 5697, 11622, 5173, -24719, -21331, -10366, 838, 2388, -4282, -7573, -706, -6509, -6268, -4116, -13170, -27857, -28805, -14569, -6890, 3997, 20266, 25427, 31317, 10899, -3798, 7209, 19036, 13997, 8001, 4041, 4240, 15228, 22526, 20139, 12818, 21567, 29037, 18856, 22489, 12361, 1879, 7535, 18081, 17768, 30967, 35913, 30064, 20375, 12592, -1233, -932, -195, -1662, -9107, -21319, -18110, -14885, -14562, -14971, -8050, 4589, 10478, 5676, -262, 8884, 6952, 3000, -3617, 4756, 5250, 5273, 248, -14594, -12483, 5879, 9341, -11237, -14565, -13478, -10904, -6544, -5297, -2218, -13802, -24744, -24846]
5910b4846L401K50M019n537O384k271O417K915M853M945l875j2553r123p682J2065
5895b0638o456p623L741K530J6158J7652J1766O885p59k4999k5751R069R164P617
5881a644K528p448k168j124n848j069M154O388R852j398o291p626j6066M817M428
5866a8515J4569J7781r26k520q673n518k829J424k451K663j087o380o798q423
5852b7683m489M01J9636J5709K645k425O915n174L486J3507P042k880j2404n550
5838H736K830r287M302J3531Q377P637n791q769j5673M13K967L358n264q088p111
5823g832j3891J3196K3639p37j4726m046m848j3191M446Q274q668r45L655J2489
5809c185n402m355j3325m891J1676R024K427J160m880K998l296K535M411p115
$$ y = [-24846, -21445, -21195, -17176, -22713, -16329, -18600, -12183, -9268, -4415, 530, -3345, -15898, -25021, -32703, -20638, -27094, -34717, -30976, -28446, -12288, 5364, 17130, 24015, 23256, -1743, -27494, -18425, -9261, -1644, 884, -6564, -8732, -9856, -15704, -16773, -12619, -6231, 3621, 2223, -4068, -11694, -27760, -22943, -18515, -3946, 13835, 12909, 10389, 1716, -3802, -6631, -5207, -7658, -4995, -6082, -12462, -19260, -27683, -32172, -31771, -12135, 3574, 6219, 3794, 10709, 5535, 9021, 22528, 29570, 26690, 14286, 8736, 11566, 2279, 6581, 20112, 28489, 36126, 30335, 21566, 5893, 6306, 9273, 12631, 7367, -721, -7832, -21723, -8527, 15112, 14375, -351, -4397, -9245, -22436, -17990, -9716, -18384, -19329, -15674, -3185, -8587, -12942, -26267, -31158, -19482, -10458, -8031, -6871, -11751, -8753, -12049, -9514, -5103, -12218]
5795a2218J0740N839O301r445p70Q67q66J150p287Q772L131L894n581m570j3727
5780a3770N865Q284j819p496J4964O261m309J804J839k510j6532P92k598k321
5766a1546Q061O711r277J0010L714k1944r54M471J1474J431R727o786J219J4863
5752B1174Q498j9210j5928l175K420L419n520m222J0474N24M308l613r471k379
5738a2701J040n359j961k944M780K863M945q220J2005j248n024K238N459J0278
5724F151O168j4417o766O910M53J602r411k0185o321J3839Q755N831j306R208
5710E11L197j594L422R75j1425j116n68J6970J4674k52p396m181L56J566j5142
5695cm842N311k599k865N247k322L96K378j0516O695M512q13M002M142j3499K33
$$ y = [-12218, -1478, 4361, 10662, 1217, 447, 1314, 448, 1598, -5689, 3083, 6214, 10108, 4527, -43, -13770, -7905, 379, -1440, -8936, 6028, 12289, 7980, 9784, 11623, 9113, -7419, -6627, -9225, -11546, -3485, 3226, -6051, 3959, 7673, -14271, -15225, -10754, 720, 2151, 11878, 5092, 6311, 21174, 29672, 10462, -5466, -8641, -6221, -2802, -8322, -12544, -2070, -1546, 2762, -851, -10322, -12701, -11661, -17020, -18981, -21925, -17145, -14282, -9337, -17557, -5552, -6800, -11824, -9586, -4127, 6151, 12319, -2098, -8864, -1954, -1501, 101, -9310, -29495, -35816, -21977, -13222, -7391, -8697, 511, 3708, 2114, 5536, 6511, -4914, -6030, -6598, 10372, 25046, 24794, 17398, 13217, 13573, 15139, -3, -4845, 466, -2133, -4998, 249, -2073, -1677, 701, -9815, -3120, 1392, 579, 4581, 8723, -4776, -4543]
5679d543L858J570M283Q125P779r862j5425n933L236j130O724j1124J291O6p811
5664a8896J648P674J1353K843m409n957j887j5184R509J0620R630N931l20l757
5650H798j4012j0387M535m515P52O831K386Q708q280q287N758L195n519j347J0993
5635c91l587o265k557o449J259Q278M404p863J3246j3630m356L102j1335o740
5621c2884J0760J8384M728p799R86o447L156J11P97m780P125O451j0283j2102
5607b1797o153K6R988m351k408R896k721j7590J0899J0230M289O626r335q07Q827
5592d381q191j2757K230J2422M781L881M983m742K200m408q047L930K594M66P62
5577d277q173o95M025J5650Q687J366l111M318j3570j3541P844R984M013j1061
$$ y = [-4543, -685, 885, 5168, 13293, 21072, 11210, -4215, -10148, -6912, -8042, -1318, -12442, -11151, -11085, -18896, -17248, -9574, 1779, 4622, 213, -5744, -7631, -22815, -13306, -2686, 6944, 12875, 12555, 8798, -5214, -15601, -11066, -15581, -14829, -7998, -5612, 3096, -5184, -13471, -7713, -4518, -10037, -11384, -391, -3978, -10243, -12800, -19249, -17990, -9712, -5308, -13171, 75, -13555, -17911, -14809, -26144, -32884, -22124, -3740, 988, -6811, -5825, -12272, -9116, -9005, -8208, -12988, -5863, 588, -9695, -21797, -27950, -27924, -17936, -22287, -24695, -14799, -17520, -35110, -24211, -13981, -9692, -3066, -12401, -13208, -4381, -12572, -25329, -23099, -10677, -5896, -2015, 2968, -1774, 426, -3982, -12029, -8099, -5505, -5039, -4277, -12450, -13145, -9120, 6530, 15217, 16583, 13472, 17790, 4220, -9321, -1477, 8507, 12520, 1459]
5563A459l866P567M840k883q972q00N232O284J480m144j578m243n899j7195L228
5548a9490P469J24J6130j229l041J3425M855P195q089q474L797Q37q316p424N53
5533a678O361J94p351M670J1045p83j1053n425q760J204r337l371Q661O227p723
5518a7119k126Q564o419j0644J446K3987J7108n914p317p136P251J0841l842p034
5504A646m204j351k701L935q265o710P652N533K36m490L170M793J211m711r491
5489a3747j2294J3777J7578o14q76N244j831p402m660N850K766O869p311o983
5475c634N566M193n742k477J2604p697j5602m571R392M396k275r404n264J0409
5461a0106N56p691K199r4J7152l248m544J1356k944n42j4557m494J834N615L752
$$ y = [1459, -2407, 5160, 10000, 7117, -1855, -2655, 2577, 8861, 10341, 6197, 4619, 376, -5523, -22718, -19490, -12021, -11897, 4233, 3004, -37, 13388, 18243, 25438, 17349, 8875, 12672, 13509, 5193, -2231, -1678, 4683, 4877, -2474, 2196, 13241, 12458, 1405, -4020, -12780, -11576, -20913, -24284, -15623, -9396, -17119, -19245, -10681, -17100, -27744, -26298, -2311, 14797, 8883, 1566, -5570, 1681, 12522, 8680, 1646, -2558, -3909, -6610, -2675, -10940, -17650, -9998, -4465, -4229, -8719, -5549, -756, 455, -4256, -13747, -26041, -12264, 5314, 4700, 3824, 9068, 7237, -165, -4825, 1025, 3791, 10660, 3349, -3634, 1932, 6125, 383, -2094, 10510, 2813, -12789, -17360, -7968, -3572, -5847, -15251, -20515, -10106, -9550, -17241, -15042, -15136, 2016, -1232, -5776, 5580, 2636, 2094, -12463, -16957, -15123, -9508, -5756]
5446e756R258j204j0462J0763k616M772O514J2768J3238p019r109k87j0635L072
5432A3297J530j2697l112J1223M224p986N407o770K867J9696r266j3092l543J393
5418C171P132N612p368O107j2196j3736n038N194J4886n710m061r390o843Q899
5404a3341P810R844K354l44L406j8506p718j790Q468J1835n481k068Q389q372
5390e514j149J731o358J58o641n268k930O05P479J6626J2010r292m602M518Q363
5375I736R946q290j6654j1491M945j795N318P16m456N196N173J2261P25j1181
5361A49M66j2423k192N023O771J619n038j5638J0400J3207r20j5103o20j84j111
5346a5594o697J4J7765J0718p031K346J008M325L702O514n762n245k4020R948
$$ y = [-5756, 3502, 2298, -8164, 2599, -17, 4755, 11269, 24037, 37275, 30256, 21147, 20860, 10225, 13297, 14827, 2130, -982, 10241, 14465, 6479, 11886, 5116, 7983, 27679, 18413, 5321, 1778, 3171, 10303, 15915, 8547, 14654, 2458, -11278, -16316, -11122, 3764, -1946, -6007, -15397, -22240, -13341, -5531, 4313, 6667, 6323, 9729, -8777, -16495, -18285, -9817, 2018, -3463, -5531, 2858, -5514, -6663, -4932, -11290, -11132, -17773, -23041, -25971, -25366, -17887, -1261, 10749, 1457, -3145, 1373, 9736, 19682, 11392, -5262, -16753, -11808, -13603, -8285, -7569, -12025, -6829, -1656, 10605, 11330, 149, 615, -11808, -14000, -8977, -2206, -587, -5625, -21263, -10863, 2344, 1424, -13679, -14299, -14483, -15594, -22291, -22277, -4512, 6206, -825, 1521, 2529, 6854, 10556, 17070, 11308, 6063, -17957, -8009]
5332h009n174q638M440J573M787Q003n58Q867j2140O534M681n015P046o778o398
5317f779M150J430L18N881j1674P293P662O779l81j1673r324r530J3156P635J1579
5302A6522M545k0102o20n654p979J1808n907r25N203P58o145N498j754j050K1983
5287A6181L900j0884m763k50j4294k325O450J3071O941j5223l913k439r107R209
5273g446M206m537j0425J402l240Q164j0402j1347L130O60Q157J3754K378L235
5259b311J447M500m311K615l572Q881o212j2333K992L264q684k406O880P615m505
5244f140m935K452O18K192R601M390l910j5298L139K0544k616j513j1928k95l664
5229g363k516J6036J1982q626r10J5582l42j7417r894n391J068m990J1834J2779
$$ y = [-8009, -13183, -21821, -17381, -15808, -11021, -3018, -3576, 5291, -6849, -315, 4366, -649, 6397, -381, -6779, -2629, -1199, -881, 5000, -6674, 619, 8281, 15060, 14679, 3006, -6318, -15848, -2692, 4943, 16522, 21067, 965, 345, -5309, -13288, -1480, -7387, -8312, -3109, -2351, -8496, -2998, -4752, -5802, 16181, 20081, 9197, 4434, 4184, -10110, -12435, -5985, 7086, 14027, -1196, -5109, -7548, -16655, -7446, -3240, -7777, -18202, -16800, -20040, -11876, -22278, -33625, -30495, -29835, -21678, -7924, -5546, -2311, -864, 3636, -675, 1940, -1632, 7249, 1037, -11296, -8304, -5040, -13724, -16130, -9250, -1635, -6140, -11075, -8623, -8005, -5813, 3788, 8178, 4268, -11030, -7891, 12653, 10037, 8524, -3404, -3699, -7363, -9879, 6157, 18139, 9513, 8603, 24185, 23843, 6426, -3468, -8859, -7791, -12781, -947, 11832]
5215A1832K89m471p496k813J2999R743r870l059j8298N388Q280P776J2531J4994
5201C7825n623n748N51j0830k3791p62N173l671J3377J6221j0511o460r059n323
5187h631R517j738q507R029o8j4283m584K0774n026l381k93L793j841j9372Q778
5172a5833J2564n51M881M29k580l989L91J8004r74j3379Q53K771r979q087K114
5157a3365J3328J087R369o071j9162m244j048J9782J5114o209k0744L722J5480
5144G039J0528j2029p820j0576l592R384J2414k3030j0308K580K0793O636j173
5131H46J240j682j9290m294o986K058J1027k282q502L442R994N992L427J3449
5117H439O427r081j470J23k957P407N192m819j0204q712Q021O52j055j4840K3367
$$ y = [11832, 12121, 7650, 154, -2659, 10340, 20083, 10213, 7154, -11144, -5756, 2524, 10300, 22831, 37825, 32202, 26454, 27005, 16175, -7616, -8378, -3205, -6876, 6501, 22722, 12211, 5751, -3308, -8631, 886, -852, -9359, -330, -398, -14681, -19265, 1509, -3517, -6898, -7191, -3398, -5239, -24611, -15833, -3269, -3820, 1061, 1490, -1090, -5079, -4688, 13316, 12342, -1037, -184, 2587, -7392, -15479, -13365, -37, 1050, 10419, 4348, -14814, -19058, -20106, -324, 14790, 8581, -12163, -8441, 7039, 17567, 5538, -2282, -12858, -16450, -7066, 5348, -17682, -27990, -25410, -4617, 2019, 846, 2086, 404, -18886, -23180, -30166, -28108, -17081, -19363, -27865, -24423, -14429, -8437, -5010, 8439, 14866, 5785, 4315, 4438, 1481, 8888, 14080, 9261, -943, -9655, -1634, -982, -2037, -16877, 6490]
5102F490J4551n189j5332k2649Q97R591M558J9685o033J70P758p077l054j357
5088C009P436J295j0924K759k854j2058m286k165Q447J4546O89n183J1115j1727
5074I9r525m378J389L992Q066j2783O55k199l396R748r781q864j30Q169J564K379
5058a4995n550n72m649r724q93K1105J7529O448m125k316j9007K589m985K264
5044a6881Q161p950R515J3969m334k244J811J5244J6080r708r452K494r916j1743
5030d954j725R748R239P42M588j6110j5475J1267j76M650j1777R313J7492r109
5016G713j0960k07J0690N195o894j0030m109l173q641P755J2165P73o762q739
5002a5224R015M385K845l377o501n563j705n54M051J502k707J61m097N410J2050
$$ y = [6490, 21041, 15852, 520, -22129, -21232, -11641, -7083, 12602, 6569, 6739, 14497, 7420, 4366, 3009, 10445, 11740, 816, 3575, 721, -11337, -15623, -17788, -9341, 5205, 5894, 711, 11826, 99, -9426, -13804, -12415, -8423, -357, -13140, -12485, -14684, -18080, -8332, -18113, -26977, -27107, -18938, -17374, -14995, -20545, -21117, -25766, -35490, -36383, -15278, 2251, 8699, 4574, 2258, -16749, -14160, -19145, -16881, -8720, -16670, -7155, 6814, 2480, 236, 2047, 17291, 33371, 23663, 14211, 16705, 6789, -4954, -6679, 3069, 12308, 13050, 17638, 1528, -13947, -2680, -2856, 1794, -9983, -670, 16822, 7713, -3247, -3454, 7236, 12431, 5537, -4493, -8602, -11775, -20416, -12661, -496, 277, -6485, -15224, -6209, -1824, 1021, -2356, -8857, -14420, -16125, -16679, -12628, -11126, -13833, -13672, -17769, -12359, -309]
4987c09J3899k049j899l592o829M918M676O823n998j5146j8188M852K2704L293
4973G155j3481p478J0542j55o988J861O083n874j660K148J8186R08j0341Q579
4959I485J4744k627l274j909p495j0968L43M752m97N622K489N349J2444M200m343
4944B8315n550l61k535j9134m060j977j527M828j3277L414J5041J3525J3361M237
4930C4300r754j0311j6093r255j3878k235j68P912Q312J887m212o466K1205J1733
4916A2977j798q409l235O761O168r2m627l038l256R719K4232J2542p18m406k2085
4901B0735l1119j3125P082J5909q746o377p988j60J2795J0307m708J0603R988
4888A5196K603J878j0594K910R648j060k369j8277j5765j0696J5089Q692M372
$$ y = [-309, 13590, 11541, 9642, 6050, -779, 4139, 8815, 15638, 9640, -5506, -23694, -18842, 3862, 7155, -6326, -13804, -3262, -3417, -10405, -8544, -2461, -8335, -9995, -7847, 10339, 11247, 906, 9485, 24229, 21602, 18328, 16419, 8924, -2044, -1701, 3051, 2554, 8176, 10665, 16014, 28458, 32658, 28315, 22765, 22404, 19869, 735, -3325, -5302, -6829, -2001, -15278, -11864, 3177, 16702, 30063, 34300, 24546, 14235, -1858, -11113, -24991, -27226, -27394, -19482, -11170, -9283, -13495, -19961, 1244, 12977, 11179, 2770, -465, 6296, 12464, 12372, 7745, 4707, 1451, 11170, 35402, 47944, 47226, 42820, 20735, -10384, -23509, -16427, -518, -9264, -15641, -23629, -23789, -10994, -687, -5395, 5208, 15196, 17799, 19677, 9083, 11993, 21641, 20581, 18212, -65, -15830, -26526, -11437, -2745, 1627]
4875A627O114O190j4176k187Q372P846J14o728m845o688j0580j2417P726M949
4861a4683K719P072o419k299J1755J2359n978p757q568j0550J8455L097n91m732
4847f120q277j248Q72Q993K540J5840j766j3876j169l54J622J3543J980n298m721
4832B561Q85l498J296j2106K604J1058J622N672L646l384M447j7388l800O204
4818a81J795m15j5609j182J0276N631j729L950j11j2867n631P011Q166o495j1980
4803a9371M461Q165m011p76k752L380O935n844m216q25K514j895M405P830Q728
4788F728j3790p290J1812K458J5457N329J3017j1564K226Q10m640l965j2140r513
4774e065m978R814k155n474Q706Q586q059l865j300j0870L561N450J238l173j672
$$ y = [1627, 7741, 13931, -245, -2432, 5940, 13786, 13900, 7172, 2327, -4361, -14941, -27358, -19632, -14683, -11964, -4892, -11311, -13610, -1855, 10504, 4526, -3231, -11799, -22349, -3894, -797, -1388, -6120, -14397, -15645, -14773, -5780, -3240, 12600, 10834, -3042, -4211, -4565, -2943, 10600, 12580, 7282, 2561, 3446, -52, 1244, -10862, -8258, 2800, 4422, 10094, 13740, 10356, 14803, -2585, -6385, -181, 1614, 1199, -14410, -15592, -5316, 315, -1414, 2536, 2425, -10442, -16073, -9062, -896, -7391, -19371, -14910, -6745, -10756, -11532, -14284, -10904, -3969, -9813, -14029, -14854, -12340, -14235, -9830, -2000, 6728, -7062, -14352, -2540, -82, 15375, 20704, 33721, 22157, 24383, 25193, 20553, 16588, 4448, -5065, -10043, -229, -2384, -7858, 848, 9434, 1375, -2490, -3790, -14660, -11099, -5649, -4411, -7584, -9256]
4759i256l306k752j505R400R348K630K543O820n910j4397r842o69J3259R350l444
4744B269k064k299J096r741m825K322J2823M681l720m986J0006J3086J05n055
4730A3698K081k313L544p455O125k429o160l328k008J807l251J124J3320J1130
4716B5885N258j9748j4467M759r681j5447j0987l230n486J1324J9607J6434Q410
4703A2631j2217j0349Q525k085k747O876p650N995k156k097n869p108K103J5081
4689a067j820l095r8j3767o784J8349P589q304M934J5926J3372q268o844L384
$$ y = [-9256, -12562, -15314, -16819, -7419, 1929, 4559, 7102, 13922, 8012, -6385, -16227, -16896, -3637, 5713, 2269, 205, -2094, -998, -10739, -15564, -13242, -419, 4262, 542, -4444, 5562, 18648, 18753, 13698, 15779, 13466, 17010, 9555, 15680, 13251, 7091, 3763, 1755, 3562, 311, 1435, 14755, 25885, 31143, 11395, -3072, 1687, -7994, -23441, -34428, -37658, -43144, -31820, -12213, 4221, 12631, 414, -9935, -1410, -3495, -6242, 634, -7016, -1021, -3177, -5274, -11143, -18251, -16148, -1067, -2887, -5982, -6080, -19847, -26631, -8282, -693, -8997, -4063, 11863, 25235, 16967, 10123, 13507]
$$ [...]
##END NTUPLES=NMR SPECTRUM
##END=
