##TITLE=Analysis number 325781
Compound Code sb 00903
Book Reference b
Project Code adrs
Chemist Name stores
##JCAMPDX= 6.0         $$ Bruker NMR JCAMP-DX V2.0
##DATA TYPE= NMR SPECTRUM
##DATA CLASS= NTUPLES
##ORIGIN= Bruker BioSpin GmbH
##OWNER= nmr
$$ XWIN-NMR		Version 3.5
$$ Mon Jan 15 08:32:44 2007 GMT Standard Time (UT+0h)  MAYBRIDGE\nmr@NMR_250MHZ
##.OBSERVE FREQUENCY= 250.131544655141
##.OBSERVE NUCLEUS= ^1H
##.ACQUISITION MODE= SIMULTANEOUS (DQD)
##.ACQUISITION SCHEME= undefined
##.AVERAGES= 16
##.DIGITISER RES= 18
##SPECTROMETER/DATA SYSTEM= dpx250
##.PULSE SEQUENCE= zg30
##.SOLVENT NAME= CDCl3
##.SHIFT REFERENCE= (INTERNAL, CDCl3, 0, 16.522)
##AUDIT TRAIL= $$ (NUMBER, WHEN, WHO, WHERE, WHAT)
$$ ##TITLE= Audit trail, XWIN-NMR		Version 3.5
$$ ##JCAMPDX= 5.01
$$ ##ORIGIN= Bruker BioSpin GmbH
$$ ##OWNER= nmr
$$ C:\u/data/dgb/nmr/ADRS/990/pdata/1/auditp.txt
$$ ##AUDIT TRAIL=  $$ (NUMBER, WHEN, WHO, WHERE, WHAT)
(   1,<2007-01-15 08:32:25.11 +000>,<MAYBRIDGE\nmr>,<NMR_250MHZ>,
      <created by zg, POWCHK disabled, PULCHK disabled
       configuration hash MD5:
       49 4B E0 1D 92 C2 6B 37 9F E6 65 BC 52 41 86 1D
       data hash MD5: 64K
       D7 98 69 4B 54 B7 44 15 93 E2 41 0D D2 2A AB 4E>)
(   2,<2007-01-15 08:32:37.62 +000>,<MAYBRIDGE\nmr>,<NMR_250MHZ>,
      <Start of raw data processing
       ef LB = 0.3 FT_mod = 6 PKNL = 1 SI = 32K 
       data hash MD5: 32K
       D1 70 9E 92 1A 54 B9 F0 C3 18 65 B1 86 8F EF DA>)
(   3,<2007-01-15 08:32:39.28 +000>,<MAYBRIDGE\nmr>,<NMR_250MHZ>,
      <apk 
       data hash MD5: 32K
       15 AA FB DD FA C8 AD 28 8F 4F 35 10 5E 56 02 33>)
(   4,<2007-01-15 08:32:39.98 +000>,<MAYBRIDGE\nmr>,<NMR_250MHZ>,
      <abs ABSG = 5 
       data hash MD5: 32K
       E4 C5 3D A5 AB F5 56 B9 5A 39 53 C5 54 C0 38 3E>)
$$ ##END=
$$ 
$$ hash MD5
$$ 85 E6 6A BA 2B 45 8C B2 41 DB 40 A0 6A 36 7E FC
##$RELAX= 
##$RELAX= 
##$RELAX= 
##$RELAX= 
##$RELAX= 
##$RELAX= 
##$RELAX= 
$$ Bruker specific parameters
$$ --------------------------
##$DU= <C:\u>
##$EXPNO= 990
##$NAME= <ADRS>
##$PROCNO= 1
##$TYPE= <nmr>
##$USER= <dgb>
##$AMP= (0..31)
100 100 100 100 100 100 100 100 100 100 100 100 100 100 100 100 100 100 
100 100 100 100 100 100 100 100 100 100 100 100 100 100 
##$AQSEQ= 0
##$AQ_mod= 3
##$AUNM= <au_zg>
##$AUTOPOS= <2 >
##$BF1= 250.13
##$BF2= 250.13
##$BF3= 250.13
##$BF4= 250.13
##$BF5= 500.13
##$BF6= 500.13
##$BF7= 500.13
##$BF8= 500.13
##$BYTORDA= 1
##$CFDGTYP= 0
##$CFRGTYP= 5
##$CHEMSTR= <none>
##$CNST= (0..31)
1 1 145 1 1 1 1 1 1 1 1 1 1 1 1 1 1 1 1 1 1 1 1 1 1 1 1 1 1 1 1 1 
##$CPDPRG= <>
##$CPDPRG1= <>
##$CPDPRG2= <>
##$CPDPRG3= <>
##$CPDPRG4= <mlev>
##$CPDPRG5= <mlev>
##$CPDPRG6= <mlev>
##$CPDPRG7= <mlev>
##$CPDPRG8= <mlev>
##$CPDPRGB= <>
##$CPDPRGT= <>
##$D= (0..31)
0 1 0 0 0 0 0 0 0 0.06 0 0 0 0 0 0 0.0002 0 0 0 0 0 0 0 0 0 0 0 0 0 0 
0 
##$DATE= 1168849944
##$DBL= (0..7)
120 120 120 120 120 120 120 120 
##$DBP= (0..7)
150 150 150 150 150 150 150 150 
##$DBP07= 0
##$DBPNAM0= <>
##$DBPNAM1= <>
$$ [...]
##$SUBNAM7= <"">
##$SUBNAM8= <"">
##$SUBNAM9= <"">
##$SW= 20.6930455092707
##$SWIBOX= (0..15)
0 0 3 0 0 0 0 0 0 0 0 0 0 0 0 0 
##$SW_h= 5175.983436853
##$TD= 65536
##$TD0= 1
##$TE= 294.16
##$TE2= 300
##$TE3= 300
##$TEG= 300
##$TL= (0..7)
0 120 120 120 120 120 120 120 
##$TP= (0..7)
150 150 150 150 150 150 150 150 
##$TP07= 0
##$TPNAME0= <>
##$TPNAME1= <>
##$TPNAME2= <>
##$TPNAME3= <>
##$TPNAME4= <>
##$TPNAME5= <>
##$TPNAME6= <>
##$TPNAME7= <>
##$TPOAL= (0..7)
0.5 0.5 0.5 0.5 0.5 0.5 0.5 0.5 
##$TPOFFS= (0..7)
0 0 0 0 0 0 0 0 
##$TUNHIN= 0
##$TUNHOUT= 0
##$TUNXOUT= 0
##$USERA1= <user>
##$USERA2= <user>
##$USERA3= <user>
##$USERA4= <user>
##$USERA5= <user>
##$V9= 5
##$VALIST= <valist>
##$VCLIST= <CCCCCCCCCCCCCCC>
##$VD= 0
##$VDLIST= <DDDDDDDDDDDDDDD>
##$VPLIST= <PPPPPPPPPPPPPPP>
##$VTLIST= <TTTTTTTTTTTTTTT>
##$WBST= 1024
##$WBSW= 4
##$XGAIN= (0..3)
0 0 0 0 
##$XL= 0
##$YL= 0
##$YMAX_a= 452505
##$YMIN_a= -585796
##$ZGOPTNS= <>
##$ZL1= 120
##$ZL2= 120
##$ZL3= 120
##$ZL4= 120
##$ABSF1= 16.522
##$ABSF2= -4.171173
##$ABSG= 5
##$ABSL= 3
##$ALPHA= 0
##$AQORDER= 0
##$ASSFAC= 0
##$ASSFACI= 0
##$ASSFACX= 0
##$ASSWID= 0
##$AUNMP= <proc_1d>
##$AZFE= 0.1
##$AZFW= 0.1
##$BCFW= 0
##$BC_mod= 0
##$BYTORDP= 0
##$COROFFS= 0
##$CY= 12.5
##$DATMOD= 1
##$DC= 0
##$DFILT= <>
##$DTYPP= 0
##$F1P= 14.0000005364418
##$F2P= -0.99999901652339
##$FCOR= 0.5
##$FTSIZE= 32768
##$FT_mod= 6
##$GAMMA= 0
##$GB= 0
##$INTBC= 1
##$INTSCL= 1
##$ISEN= 128
##$LB= 0.3
##$LEV0= 0
##$LPBIN= 0
##$MAXI= 10000
##$MC2= 0
##$MEAN= 0
##$ME_mod= 0
##$MI= 0
##$NCOEF= 0
##$NC_proc= -3
##$NLEV= 6
##$NOISF1= 0
##$NOISF2= 0
##$NSP= 0
##$NTH_PI= 0
##$NZP= 0
##$OFFSET= 16.522
##$PC= 1
##$PHC0= 229.1279
##$PHC1= 5.649585
##$PH_mod= 1
##$PKNL= yes
##$PPARMOD= 0
##$PSCAL= 4
##$PSIGN= 0
##$REVERSE= no
##$SF= 250.13
##$SI= 32768
##$SIGF1= 0
##$SIGF2= 0
##$SINO= 400
##$SIOLD= 32768
##$SREGLST= <1H.CDCl3>
##$SSB= 0
##$STSI= 32768
##$STSR= 0
##$SW_p= 5175.98343685301
##$SYMM= 0
##$S_DEV= 0
##$TDeff= 65536
##$TDoff= 0
##$TI= <Analysis number 999999
Compound Code 99
Book Reference 9
Project Code 9>
##$TILT= no
##$TM1= 0
##$TM2= 0
##$TOPLEV= 0
##$USERP1= <user>
##$USERP2= <user>
##$USERP3= <user>
##$USERP4= <user>
##$USERP5= <user>
##$WDW= 1
##$XDIM= 32768
##$YMAX_p= 510241504
##$YMIN_p= -104055
$$ End of Bruker specific parameters
$$ ---------------------------------
##NTUPLES= NMR SPECTRUM
##VAR_NAME=  FREQUENCY,     SPECTRUM/REAL,   SPECTRUM/IMAG
##SYMBOL=    X,             R,               I
##VAR_TYPE=  INDEPENDENT,   DEPENDENT,       DEPENDENT
##VAR_FORM=  AFFN,          ASDF,            ASDF
##VAR_DIM=   32768,         32768,           32768
##UNITS=     HZ,            ARBITRARY UNITS, ARBITRARY UNITS
##FACTOR=    0.157963299565203, 1,           1
##FIRST=     4132.6476996994, 0,             0
##LAST=      -1043.33573715361, 0,           0
##MIN=       -1043.33573715361, -104055,     0
##MAX=       4132.6476996994, 510241504,     0
$$ Real data points
##PAGE= N=1
##DATA TABLE= (X++(R..R)), XYDATA
$$ [...]
$$ plain form
18800 18628392 18731457 21715396 28633910 39591762 50928260 57490610 53821262 43151256
18792 43151256 30793959 21140312 15131949 11430625 9035181 7422321 6356913 5574987
18784 5574987 4935443 4356960 3810325 3323585 2909449 2605586 2398461 2223640 2092017
18775 2092017 2061882 2072847 2093249 2071931 1969713 1824497 1687108 1629167 1655265 1569813 1416457
18764 1416457 1297379 1194238 1082207 977086 883547 837037 839792 857620 859187 881599 919947
18753 919947 915194 882708 833586 786103 721393 674944 618754 567370 518334 470673 449555 464211
18741 464211 496250 519183 529195 542028 527742 500107 471017 460191 467785 456201 431218 397649
18729 397649 380924 378334 378677 352107 327681 337015 313549 311407 360768 417265 437823 460142
$$ packed form
18800A8628392J03065K983939O918514J0957852J1336498O562350l669348j0670006
18792D3151256j2357297r653647o008363l701324k395444j612860j065408p81926
18784E574987o39544n78483n46635m86740m14136l03863k07125j74821j31623
18775B092017l0135J0965K0402k1318j02218j45216j37389n7941K6098q5452j53356
18764A416457j19078j03141j12031j05121r3539m6510K755J7828J567K2412L8348
18753I19947m753l2486m9122m7483o4710m6449n6190n1384m9036m7661k1118J4656
18741D64211L2039K2933J0012J2833j4286k7635k9090j0826P594j1584k4983l3569
18729C97649j6725k590L43k6570k4426R334k3466k142M9361N6497K0558K2319
$$ plain form
18717 460142 487707 484237 428714 362508 314631 282868 270274 273460 284742 331111 375162 435570
18705 435570 454118 413781 363665 317033 291774 277677 262368 230694 215142 220020 242113 247357
18693 247357 251770 255043 248599 228890 233430 241570 243747 243237 251597 236059 221798 222098 212158 214907
18679 214907 193432 192529 187675 183664 186297 252955 314153 362237 399396 407424 410884 423751 419039
18666 419039 430464 460360 440494 421372 441674 461195 407504 356885 362131 355135 304932 258279
18654 258279 236192 214295 230311 227330 227278 217258 207488 208932 238665 209893 227487 278806 330701
18641 330701 395375 400380 408946 426705 395711 357602 364208 392919 400232 407233 420652 445276
18629 445276 413160 375713 343737 327314 316326 308990 287493 285079 326987 336783 351698 373700
$$ packed form
18717D60142K7565l470n5523o6206m7877l1763j2594L186J1282M6369M4051O0408
18705D35570J8548m0337n0116m6632k5259j4097j5309l1674j5552M878K2093N244
18693B47357M413L273o444j9709M540Q140K177n10Q360j5538j4261L00r940K749
18679B14907k1475r03m854m011K633O6658O1198M8084L7159Q028L460J2867m712
18666D19039J1425K9896j9866j9122K0302J9521n3691n0619N246o996n0203m6653
18654B58279k2087k1897J6016k981n2j0020r770J444K9733k8772J7594N1319N1895
18641C30701O4674N005Q566J7759l0994l8109O606K8711P313P001J3419K4624
18629D45276l2116l7447l1976j6423j0988p336k1497k414M1908R796J4915K2002
$$ plain form
18617 373700 360841 364171 356064 359985 380717 323812 267292 256273 240252 203487 183873 155358
18605 155358 144766 146901 149540 141149 146685 146509 148077 182136 201037 177650 188669 223898 265162
18592 265162 275207 290413 316256 291460 286601 324208 340132 331458 341303 368990 365270 329976
18580 329976 290247 258511 215800 183050 162602 139500 103799 94477 96141 108784 116143 112422
18568 112422 106788 121526 131869 122938 141378 155962 115852 101537 91976 91566 129107 127542 118239
18555 118239 139028 128339 102763 103898 112717 129206 165541 164558 161198 144879 114294 102737
18543 102737 119205 109155 112629 122054 125605 135957 151307 135891 128344 144740 147677 158159
18531 158159 174363 183269 190052 161504 149533 171243 179270 156787 164812 162748 173986 200068
$$ packed form
18617C73700j2859L330q107L921K0732n6905n6520j1019j6021l6765j9614k8515
18605A55358j0592K135K639q391N536j76J568L4059J8901k3387J1019L5229M1264
18592B65162J0045J5206K5843k4796m859L7607J5924q674R845K7687l720l5294
18580C29976l9729l1736m2711l2750k0448k3102l5701r322J664J2643P359l721
18568A12422n634J4738J0343q931J8440J4584m0110j4315r561m10L7541j565r303
18555A18239K0789j0689k5576J135Q819J6489L6335r83l360j6319l0585j1557
18543A02737J6468j0050L474R425L551J0352J5350j5416p547J6396K937J0482
18531A58159J6204Q906O783k8548j1971K1710Q027k2483Q025k064J1238K6082
$$ plain form
18519 200068 236195 243131 240348 216650 189500 199423 219351 257242 254275 219135 202152 187519
18507 187519 176485 175180 149313 122978 96678 101986 155675 171134 137440 117881 122345 109507
18495 109507 121027 127235 113810 129334 129912 122568 132064 111349 89397 107439 111352 114456 131961
18482 131961 114959 111178 135323 124680 121207 131753 147015 150983 181787 188198 178667 182965 196883
18469 196883 181840 194431 217412 213968 205299 210679 209578 222846 184327 137390 158680 177123
18457 177123 180738 183201 204267 215001 183679 198521 194275 174693 170460 175338 155015 146733 170028
18444 170028 176086 173135 159027 157589 189318 218493 243150 245548 239311 247304 273182 289935 284530
18431 284530 301597 342641 384955 399190 389509 414456 459301 497818 521924 538370 573295 634024
$$ packed form
18519B00068L6127O936k783k3698k7150R923J9928L7891k967l5140j6983j4633
18507A87519j1034j305k5867k6335k6300N308N3689J5459l3694j9559M464j2838
18495A09507J1520O208j3425J5524N78p344R496k0715k1952J8042L913L104J7505
18482A31961j7002l781K4145j0643l473J0546J5262L968L0804O411r531M298J3918
18469A96883j5043J2591K2981l444q669N380j101J3268l8519m6937K1290J8443
18457A77123L615K463K1066J0734l1322J4842m246j9582m233M878k0323q282K3295
18444A70028O058k951j4108j438L1729K9175K4657K398o237P993K5878J6753n405
18431B84530J7067M1044M2314J4235r681K4947M4845L8517K4106J6446L4925O0729
$$ plain form
18419 634024 704414 807436 889184 984338 1092898 1223559 1397232 1534360 1688815 1875608
18409 1875608 2112144 2354167 2655164 3019254 3435425 3947787 4641236 5602982 7006498
18400 7006498 9149915 12648865 18303182 25505581 30897781 35755911 44898279 54936458
18392 54936458 59738952 65999531 75145479 80229671 83827694 91415158 94310372 88949118
18384 88949118 85057520 82798391 75660178 68757384 65298566 57113058 46351837 40022251
18376 40022251 35070953 27550068 20459442 15701918 12667277 10612119 9127902 8105280
18368 8105280 7378294 6800504 6385232 6214663 6201569 6064382 5688295 5310210 5037290 4913722
18358 4913722 4919778 5067878 5326417 5689610 6128918 6544530 7087177 8187188 10146673
$$ packed form
18419F34024P0390J03022Q1748R5154J08560J30661J73673J37128J54455J86793
18409A875608K36536K42023L00997L64090M16171N12362O93449R61746J403516
18400G006498K143417L498950N654317P202399N392200M858130R142368J0038179
18392E4936458M802494O260579R145948N084192L598023P587464K895214n361254
18384H8949118l891598k259129p138213o902794l458818q185508j0761221o329586
18376D0022251m951298p520885p090626m757524l034641k055158j484217j022622
18368H105280p26986n77790m15272j70569j3094j37187l76087l78085k72920j23568
18358D913722O056J48100K58539L63193M39308M15612N42647J100011J959485
$$ plain form
18349 10146673 13529136 18881882 24702974 28461490 33317967 42071037 48935455 52124446
18341 52124446 58354428 65003409 67648789 71670184 77308334 76324829 71059321 68981127
18333 68981127 65687314 58840631 54322359 50902478 42684636 35074193 31121422 26636451
18325 26636451 20429088 15317010 11871705 9604942 8023317 6884422 6046739 5408496
18317 5408496 4896915 4492724 4227432 4009203 3703875 3299102 2934010 2641202 2408036
18308 2408036 2228260 2053466 1882125 1741390 1640436 1510474 1403815 1319274 1227586 1153165
18298 1153165 1069749 1022846 973510 949122 898689 850093 827914 802614 750487 725005 726121
18287 726121 715233 689977 695439 685060 644357 618135 589074 594261 620396 628152 641781 663853
$$ packed form
18349A0146673L382463N352746N821092L758516M856477Q753070O864418L188991
18341E2124446O229982O648981K645380M021395N638150r83505n265508k078194
18333F8981127l293813o846683m518272l419881q217842p610443l952771m484971
18325B6636451o207363n112078l445305k266763j581625j138895q37683o38243
18317E408496n11581m04191k65292k18229l05328m04773l65092k92808k33166
18308B408036j79776j74794j71341j40735j00954j29962j06659q4541r1688p4421
18298A153165q3416m6903m9336k4388n0433m8596k2179k5300n2127k5482J116
18287G26121j0888k5256N462j0379m0703k6222k9061N187K6135P756J3629K2072
$$ plain form
18275 663853 633469 583854 570936 572693 562229 528621 502757 509115 515835 529936 558891 564021
18263 564021 513665 447267 395388 386110 380829 352717 343843 356442 379701 390766 400752 408260
18251 408260 376497 360270 382813 408590 403038 395465 386405 382953 394762 393159 365643 347993
18239 347993 336690 358228 374784 374100 360362 341188 340329 334466 314743 311991 310329 305418 307730
18226 307730 328285 342764 339853 319700 302800 293133 297354 311471 316556 298416 275900 282475
18214 282475 321733 313064 279465 273767 292698 291148 295747 309755 314070 323777 334016 340963 320079
18201 320079 292135 299597 324795 329506 342282 362591 383460 377686 355658 370755 397981 396259
18189 396259 369095 382779 425248 452937 481070 514062 553318 612498 645778 675711 720792
$$ packed form
18275F63853l0384m9615j2918J757j0464l3608k5864O358O720J4101K8955N130
18263E64021n0356o6398n1879r278n281k8112q874J2599K3259J1065R986P508
18251D08260l1763j6227K2543K5777n552p573r060l452J1809j603k7516j7650
18239C47993j1303K1538J6556o84j3738j9174q59n863j9723k752j662m911K312
18226C07730K0555J4479k911k0153j6900r667M221J4117N085j8140k2516O575
18214B82475L9258q669l3599n698J8931j550M599J4008M315R707J0239O947k0884
18201C20079k7944P462K5198M711J2776K0309K0869n774k2028J5097K7226j722
18189C96259k7164J3684M2469K7689K8133L2992L9256N9180L3280K9933M5081
$$ plain form
18178 720792 785176 853172 925964 976189 1040911 1073096 1105269 1193785 1267166 1346674 1463568
18167 1463568 1625228 1853811 2166974 2492577 2947781 3602451 4557700 5907410 7948371
18158 7948371 11344579 16863760 23754307 28384815 31924902 39146234 46265071 45800548
18150 45800548 44503470 47973232 49293855 45645943 45070618 47238856 43256600 35853196
18142 35853196 31817378 28635204 22797460 16943721 13022543 10596659 9080087 8097071
18134 8097071 7549120 7302174 7352170 7678775 8350859 9472693 11337977 14613740 19998624
18125 19998624 26487005 30640824 34184601 41377040 47883341 47176798 46423579 50190938
18117 50190938 51377997 48359851 49023468 52262069 50048833 46619698 49452498 58605476
$$ packed form
18178G20792O4384O7996P2792N0225O4722L2185L2173Q8516P3381P9508J16894
18167A463568J61660K28583L13163L25603M55204O54670R55249J349710K040961
18158G948371L396208N519181O890547M630508L540087P221332P118837m64523
18150D5800548j297078L469762J320623l647912n75325K168238l982256p403404
18142C5853196m035818l182174n837744n853739l921178k425884j516572r83016
18134H097071n47951k46946M9996L26605O72084J121834J865284L275763N384884
18125A9998624O488381M153819L543777P192439O506301p06543p53219L767359
18117E0190938J187059l018146O63617L238601k213236l429135K832800R152978
$$ plain form
18109 58605476 74576714 87158276 75933049 60105059 55286658 55891988 52185098 48279629
18101 48279629 49514601 49925764 45817487 44161838 45622376 42180542 35166315 31028080
18093 31028080 28116172 22894268 17409349 13620133 11223768 9672712 8625665 7929732
18085 7929732 7481853 7264743 7315272 7701850 8496154 9928452 12599669 17108810 22767830
18076 22767830 26400348 29046662 34961200 41030513 40403858 38980102 41858178 42881961
18068 42881961 39462412 38789278 40724754 37311723 30783052 27226405 24448893 19327264
18060 19327264 14156979 10656156 8392510 6901124 5854343 5082248 4511402 4055357
18052 4055357 3676351 3330836 3043398 2797510 2624320 2454704 2244923 2097216 2000974 1900789
$$ packed form
18109E8605476J5971238J2581562j1225227j5827990m818401O05330l706890l905469
18101D8279629J234972M11163m108277j655649J460538l441834p014227m138235
18093C1028080k911908n221904n484919l789216k396365j551056j047047o95933
18085G929732m47879k17110N0529L86578P94304J432298K671217M509141N659020
18076B2767830L632518K646314N914538O069313o26655j423756K878076J023783
18068D2881961l419549o73134J935476l413031o528671l556647k777512n121629
18060A9327264n170285l500823k263646j491386j046781p72095n70846m56045
18052D055357l79006l45515k87438k45888j73190j69616k09781j47707r6242j00185
$$ plain form
18042 1900789 1785200 1686419 1603233 1503439 1409218 1317300 1252914 1176711 1096584 1034073 990883
18031 990883 950222 903187 894303 844662 774177 746161 747740 741544 730237 702720 682045 671704
18019 671704 675315 676526 661567 658023 642868 634494 664545 709503 726517 708882 697713 687061
18007 687061 669016 649039 640010 637143 616333 605183 601159 615865 596814 587688 609712 622000
17995 622000 622925 580202 534836 532411 515380 490189 487267 492484 480776 453753 451057 485470 467181
17982 467181 446125 432718 397919 382286 362944 361421 366800 400588 388789 348104 339958 374490
17970 374490 405576 403412 428596 435643 429825 431623 470282 494425 471338 431854 417351 415946
17958 415946 410917 429053 417041 378430 357487 333127 329657 322989 322627 309162 297927 302745 301518
$$ packed form
18042A900789j15589r8781q3186r9794r4221r1918o4386p6203q0127o2511m3190
18031I90883m0661m7035q884m9641p0485k8016J579o196j1307k7517k0675j0341
18019F71704L611J211j4959l544j5155q374L0051M4958J7014j7635j1169j0652
18007F87061j8045j9977r029k867k0810j1150m024J4706j9051r126K2024J2288
17995F22000R25m2723m5366k425j7031k5191k922N217j1708k7023k696L4413j8289
17982D67181k1056j3407l4799j5633j9342j523N379L3788j1799m0685q146L4532
17970C74490L1086k164K5184P047n818J798L8659K4143k3087l9484j4503j405
17958D15946n029J8136j2012l8611k0943k4360l470o668l62j3465j1235M818j227
$$ plain form
17945 301518 276766 277531 278154 273660 263814 242701 234871 220890 223879 246949 240102 238264 232389 246651
17931 246651 261886 254483 232469 214009 197968 171360 177862 180011 179817 184892 168696 166563 169063
17918 169063 190123 196252 197376 168228 150679 160762 161180 169927 188396 205054 212527 210081 188586
17905 188586 167414 166446 173745 188273 174080 170055 173939 170734 206927 227226 213521 208946 211361
17892 211361 210006 217862 210560 185125 202888 220492 205709 204581 204710 201281 206644 220000 251334
17879 251334 294911 308801 310043 313870 329039 395793 453746 465952 510479 552870 561735 594113
17867 594113 623043 620303 595473 568499 535261 495191 486764 439268 367019 321025 286995 260978
17855 260978 226006 189053 151159 150314 173098 174744 162512 161315 158762 148420 148047 167144 197897
$$ packed form
17945C01518k4752P65O23m494r846k1113p830j3981K989K3070o847j838n875J4262
17931B46651J5235p403k2014j8460j6041k6608O502K149j94N075j6196k133K500
17918A69063K1060O129J124k9148j7549J0083M18Q747J8469J6658P473k446k1495
17905A88586k1172r68P299J4528j4193m025L884l205L6193K0299j3705m575K415
17892B11361j355P856p302k5435J7763J7604j4783j128J29l429N363J3356L1334
17879B51334M3577J3890J242L827J5169O6754N7953J2206M4527M2391Q865L2378
17867E94113K8930k740k4830k6974l3238m0070q427m7496p2249m5994l4030k6017
17855B60978l4972l6953l7894q45K2784J646j2232j197k553j0342l73J9097L0753
$$ plain form
17842 197897 187995 150951 139842 160548 154824 145348 154969 158793 177843 175589 166140 174710 194865
17829 194865 204771 230125 290648 299119 315453 369091 401043 407785 461194 473245 482722 508869
17817 508869 540621 537626 541591 532223 489762 430726 420323 400190 331944 286640 259462 208263
17805 208263 179002 156150 154991 158213 143036 142760 127460 123238 103575 75588 76750 92359 93888
17792 93888 98238 89124 78703 92328 99242 98911 108784 99169 84717 100092 103610 85590 54806
17779 54806 30485 36828 40865 50762 58540 73193 101000 118496 93507 71824 62490 70310 65111
17766 65111 63753 79560 89296 108639 112780 123947 128283 93614 73106 70431 87894 94310 116860
17753 116860 110096 80489 69664 29502 41088 65923 54200 48007 59468 53979 37905 36522
$$ packed form
17842A97897r902l7044j1109K0706n724r476R621L824J9050k254r449Q570K0155
17829A94865R906K5354O0523Q471J6334N3638L1952O742N3409J2051R477K6147
17817E08869L1752k995L965r368m2461n9036j0403k0133o8246m5304k7178n1199
17805B08263k9261k2852j159L222j5177k76j5300m222j9663k7987J162J5609J529
17792I3888M350r114j0421J3625O914l31R873r615j4452J5375L518j8020l0784
17779E4806k4321O343M037R897P778J4653K7807J7496k4989k1683r334P820n199
17766F5111j358J5807R736J9343M141J1167M336l4669k0508k675J7463O416K2550
17753A16860o764k9607j0825m0162J1586K4835j1723o193J1461n489j6074j383
$$ plain form
17741 36522 26357 34340 56480 67157 69699 72723 72939 71351 83029 87800 82826 81726 85312 81348
17727 81348 78987 85929 80516 68848 69307 68853 72477 63489 54962 38769 61899 58837 58466 53198
17713 53198 62547 49167 45514 53167 73792 99665 119075 104247 82556 75081 75900 87768 86090
17700 86090 85747 89842 83268 81650 63476 49474 72759 68856 90090 84030 71895 83858 96914
17687 96914 89696 51171 25810 41684 60821 64882 53495 33690 50082 68499 81767 60674
17675 60674 58537 71255 66784 59735 58937 47888 60017 85035 78775 50629 56135 67422 83657
17662 83657 95631 86262 66178 60212 84258 74194 55488 34047 28753 45361 54580 69516
17650 69516 71538 66449 45972 44436 47966 50822 52385 52304 76771 94900 94724 63792 41151 37758
$$ packed form
17741C6522j0165P983K2140J0677K542L024K16j588J1678M771m974j100L586l964
17727H1348k361O942n413j1668M59m54L624q988q527j6193K3130l062l71n268
17713E3198R349j3380l653P653K0625K5873J9410j4828k1691p475Q19J1868j678
17700H6090l43M095o574j618j8174j4002K3285l903K1234o060j2135J1963J3056
17687I6914p218l8525k5361J5874J9137M061j1387j9805J6392J8417J3268k1093
17675F0674k137J2718m471p049p98j1049J2129K5018o260k8146N506J1287J6235
17662H3657J1974r369k0084n966K4046j0064j8706k1441n294J6608R219J4936
17650F9516K022n089k0477j536L530K856J563q1K4467J8129j76l0932k2641l393
$$ plain form
17636 37758 46177 79099 96068 90990 126317 150214 162061 171310 206736 244508 251188 249257 258070
17623 258070 286609 266974 281485 316332 296097 264341 252803 208231 159702 133102 129697 113240
17611 113240 117545 126594 129329 94884 92057 93635 99338 122699 140697 158880 165560 193662 236667
17598 236667 274876 295506 306662 291351 299346 342313 341553 338732 369698 370447 301700 250288 223115
17585 223115 197003 195688 213229 231007 246617 275548 285670 267912 256730 252321 264054 271165
17573 271165 268383 268184 250548 217555 188007 169966 156880 147930 126888 116261 104290 91685
17561 91685 88539 84397 92702 73786 60547 63839 97665 125952 165326 177203 179583 194589 217777
17548 217777 263323 276445 277665 290886 309451 284327 252274 242003 209032 174984 163339 159762
$$ packed form
17636C7758Q419L2922J6969n078L5327K3897J1847R249L5426L7772O680j931Q813
17623B58070K8539j9635J4511L4847k0235l1756j1538m4572m8529k6600l405j6457
17611A13240M305R049K735l4445k827J578N703K3361J7998J8183O680K8102M3005
17598B36667L8209K0630J1156j5311P995M2967p60k821L0966P49o8747n1412k7173
17585B23115k6112j315J7541J7778J5610K8931J0122j7758j1182m409J1733P111
17573B71165k782j99j7636l2993k9548j8041j3086q950k1042j0627j1971j2605
17561I1685l146m142Q305j8916j3239L292L3826K8287L9374J1877K380J5006K3188
17548B17777M5546J3122J220J3221J8565k5124l2053j0271l2971l4048j1645l577
$$ plain form
17536 159762 153739 130730 91735 76067 51705 25301 22231 39233 58054 66557 71605 52876
17524 52876 19829 32208 36273 43628 48606 59099 67774 52817 43430 62700 68839 67821 52531
17511 52531 61836 67502 68420 63123 47412 34109 35700 34373 19248 12865 27589 33013 20629
17498 20629 20412 19129 19489 57849 64335 66362 54453 64076 72670 76588 69336 43059 22414 49722
17484 49722 73137 72234 63333 62023 70248 67106 54058 64355 61055 83867 71365 61192 73323
17471 73323 80920 67945 31991 27230 31765 46438 37677 41669 20629 5854 1283 10199 25836
17458 25836 23854 18970 20174 2368 -1342 -2275 18346 40497 58931 73214 58189 77793 83321
17445 83321 109418 151168 198151 259939 263902 187399 120225 94380 84426 75355 52656 35791
$$ packed form
17536A59762o023k3009l8995j5668k4362k6404l070J7002J8821Q503N048j8729
17524E2876l3047J2379M065P355M978J0493Q675j4957r387J9270O139j018j5290
17511E2531R305N666R18n297j5711j3303J591j327j5125o383J4724N424j2384
17498B0629k17j283L60L8360O486K027j1909R623Q594L918p252k6277k0645K7308
17484D9722K3415r03q901j310Q225l142j3048J0297l300K2812j2502j0173J2131
17471G3323P597j2975l5954m761M535J4673q761L992k1040j4775m571Q916J5637
17458B5836j982m884J204j7806l710r33K0621K2151J8434J4283j5025J9604N528
17445H3321K6097M1750M6983O1788L963p6503o7174k5845r954r071k2699j6865
$$ plain form
17433 35791 24342 37150 43303 35707 10310 10032 28206 9394 15839 30689 38568 49635 46304
17420 46304 35302 34323 22006 21583 18917 60809 88836 70341 89589 80918 68189 70788 40337
17407 40337 30516 32875 50477 46287 27204 22607 18185 29321 22917 21802 31937 46907 31665
17394 31665 31345 36917 11727 29694 31955 5320 9357 41304 43845 30599 39333 48322 50645
17381 50645 61155 62582 54293 47295 48366 47228 33108 44601 45970 31575 30954 37363 39631 55087
17367 55087 55356 44219 33766 18978 14636 20767 34724 20309 14205 17848 30175 17864 3728
17354 3728 11686 15062 22581 16502 7431 2405 5640 -1085 9834 21049 34221 52304 18377
17341 18377 16243 12443 2265 -15696 -3954 12296 28551 41714 25216 25455 30241 27356 39332
$$ packed form
17433C5791j1449J2808O153p596k5397k78J8174j8812O445J4850P879J1067l331
17420D6304j1002r79j2317m23k666M1892K8027j8495J9248q671j2729K599l0451
17407D0337r821K359J7602m190j9083m597m422J1136o404j115J0135J4970j5242
17394C1665l20N572k5190J7967K261k6635M037L1947K541j3246Q734Q989K323
17381E0645J0510J427q289o998J071j138j4120J1493J369j4395o21O409K268J5456
17367E5087K69j1137j0453j4788m342O131J3957j4415o104L643J2327j2311j4136
17354C728P958L376P519o079r071n026L235o725J0919J1215J3172J8083l3927
17341A8377k134l800j0178j7961J1742J6250J6255J3163j6498K39M786k885J1976
$$ plain form
17328 39332 45179 36192 4007 10195 19506 5677 16087 42676 33096 26068 25417 16232 -11958
17315 -11958 -20254 -10356 9584 23987 24607 46097 44389 61063 86065 88953 59628 29797 40444
17302 40444 52063 57131 28771 2509 -24159 -5792 4615 -16482 8224 37900 35879 40651
17290 40651 30674 36704 40330 35112 41164 44039 37790 11318 6157 9926 20491 49397 32175
17277 32175 22343 20602 26436 24092 15400 -8413 17482 30662 12679 18841 20753 30779 46974
17264 46974 66375 64570 55865 42070 4107 13432 24103 35700 40176 51311 75926 80364 71727
17251 71727 75178 67645 49716 39553 9583 17024 24015 24121 31557 19396 -5404 -3889 -12518
17238 -12518 -17278 5199 4177 16580 19359 14406 11794 18365 5195 5183 4282 2975 9144 25840
$$ packed form
17328C9332N847q987l2185O188R311j3829J0410K6589r580p028o51r185k8190
17315a1958q296R898J9940J4403O20K1490j708J6674K5002K888k9325k9831J0647
17302D0444J1619N068k8360k6262k6668J8367J0407k1097K4706K9676k021M772
17290D0651r977O030L626n218O052K875o249k6472n161L769J0565K8906j7222
17277C2175r832j741N834k344q692k3813K5895J3180j7983O162J912J0026J6195
17264D6974J9401j805q705j3795l7963R325J0671J1597M476J1135K4615M438q637
17251G1727L451p533j7929j0163k9970P441O991J06P436j2161k4800J515q629
17238a2518m760K2477j022J2403K779m953k612O571j3170j2r01j307O169J6696
$$ plain form
17224 25840 32381 38390 16156 1126 4826 -5023 -6724 1600 7588 14135 29202 20100 111
17211 111 22244 45407 24880 19444 58250 67846 68288 89438 66373 35966 38986 46832 41694
17198 41694 42331 28317 37429 34482 29700 42913 53871 26842 32697 41935 38578 40683 40984 37144
17184 37144 19655 7959 19969 46329 9564 -2192 12853 23146 25258 30034 29701 3427
17172 3427 -19526 -22936 -11150 -8263 8897 8898 19535 31844 38658 71706 62467 48031 33453
17159 33453 22269 49627 33147 8064 2741 2747 31360 58670 49719 34998 38081 12253 6457
17146 6457 27079 42409 57839 55447 42130 41657 13062 -14846 -40732 -51288 -15116 11011
17134 11011 17559 32313 32996 17338 24289 29878 28462 10074 18138 26565 33564 35145 35711 37773
$$ packed form
17224B5840O541O009k2234j5030L700r849j701Q324N988O547J5067r102j9989
17211A11K2133K3163k0527n436L8806R596M42K1150k3065l0407L020P846n138
17198D1694O37j4014R112k947m782J3213J0958k7029N855R238l357K105L01l840
17184C7144j7489j1696J2010K6360l6765j1756J5045J0293K112M776l33k6274
17172C427k2953l410J1786K887J7160JJ0637J2309O814L3048r239j4436j4578
17159C3453j1184K7358j6480k5083n323OK8613K7310q951j4721L083k5828n796
17146F457K0622J5330J5430k392j3317m73k8595k7908k5886j0556L6172K6127
17134A1011O548J4754O83j5658O951N589j416j8388Q064Q427O999J581N66K062
$$ plain form
17120 37773 14530 -9461 -8484 8753 10258 -12814 -18361 -22355 -21436 -8418 -20106 -11218 20345
17107 20345 18563 7427 -14754 -25247 -8214 10484 8437 -5610 12717 41828 41281 11499
17095 11499 -1497 -397 -8543 4851 7292 15651 6799 14559 25263 24853 36330 52524 32428
17082 32428 -5267 -10312 174 -775 -18030 -27263 -17584 801 19123 -5496 -24876 -36219 -43771
17069 -43771 -23928 -6385 6001 12690 -18403 -24837 -10826 6068 19963 28036 21173 12126 5359
17056 5359 -4458 -2568 988 6935 3034 10708 24358 15255 140 -5609 -5256 13597 13365 -1105
17042 -1105 11743 26016 23198 6628 1613 1095 -18471 -39767 4379 37766 38024 34284 21525
17029 21525 3344 15563 30673 30776 23919 30543 20554 34767 46683 40914 51741 72007 61564
$$ packed form
17120C7773k3243k3991R77J7237J505k3072n547l994R19J3018j1688Q888L1563
17107B0345j782j1136k2181j0493J7033J8698k047j4047J8327K9111n47k9782
17095A1499j2996J100q146J3394K441Q359q852P760J0704m10J1477J6194k0096
17082C2428l7695n045J0486r49j7255r233R679J8385J8322k4619j9380j1343p552
17069d3771J9843J7543J2386O689l1093o434J4011J6894J3895Q073o863r047o767
17056E359r817J890L556N947l901P674J3650r103j5115n749L53J8853k32j4470
17042a105J2848J4273k818j6570n015n18j9566k1296M4146L3387K58l740j2759
17029B1525j8181J2219J5110J03o857O624r989J4213J1916n769J0827K0266j0443
$$ plain form
17016 61564 60308 55702 53249 36476 29603 30118 31742 15304 6883 22750 54869 40645 26276
17003 26276 13844 6860 40105 46141 27595 18694 21558 24153 24072 22581 20754 13854 5538 18251
16989 18251 18303 12132 40625 43572 21879 14964 4569 -4426 2102 11522 4180 -3815 -12185 -36281
16975 -36281 -14898 -10334 -10401 8032 -10426 -10104 11866 27865 19498 33714 49738 26017 13619
16962 13619 20611 11103 6123 -16556 -25774 -28622 -48293 -17367 6874 -6542 14947 7311 1072
16949 1072 22765 24839 32518 34560 27304 15687 3757 -10305 -15239 -20259 -9872 4902 17792
16936 17792 17375 -5948 -31016 -21072 -31155 -37305 -34877 -24801 -12940 -23113 -16611 -22119 -28358
16923 -28358 -28949 6114 20335 21044 25668 13331 3076 -3441 -27498 -22090 -29343 -44598 -19256
$$ packed form
17016F1564j256m606k453j6773o873N15J624j6438q421J5867L2119j4224j4369
17003B6276j2432o984L3245O036j8546q901K864K595q1j491j827o900q316J2713
16989A8251N2o171K8493K947k1693o915j0395q995O528R420p342p995q370k4096
16975c6281K1383M564o7J8433j8458L22K1970J5999q367J4216J6024k3721j2398
16962A3619O992r508m980k2679r218k848j9671L0926K4241j3416K1489p636o239
16949A072K1693K074P679K042p256j1617j1930j4062m934n020J0387J4774J2890
16936A7792m17k3323k5068R944j0083o150K428J0076J1861j0173O502n508o239
16923b8358n91L5063J4221P09M624j2337j0255o517k4057N408p253j5255K5342
$$ plain form
16910 -19256 -6079 -3593 -18965 -12029 1434 92 -22497 -15422 9959 4946 -5919 -8896 -19337
16897 -19337 -32956 -32993 -16772 11243 9318 6397 18629 18882 20120 8948 -383 -15066 -19576 -35793
16883 -35793 -42723 -35503 -23906 -1711 9020 17987 4413 -26957 -33613 -38328 -30884 -32242 -21874
16870 -21874 -17031 -20197 -18952 4227 6370 30575 16571 12159 19221 9285 7826 1562 10749 -2017
16856 -2017 2863 7482 4583 20403 -3015 -11655 -12754 -15792 -9161 -10944 -21169 -35354 -32161 -21719
16842 -21719 -22890 -28415 -26222 -37870 -53144 -41575 -45355 -18102 8174 18261 -129 1443 14885
16829 14885 23760 5885 13291 14510 26091 14682 -16394 -13294 9867 16544 -8288 -31684 -21385
16816 -21385 10239 39269 39643 29591 18338 -5190 -10155 10030 18714 8579 -16845 -26036 -38613
$$ packed form
16910a9256J3177K486j5372O936J3463j342k2589P075K5381n013j0865k977j0441
16897a9337j3619l7J6221K8015j925k921J2232K53J238j1172r331j4683m510j6217
16883c5793o930P220J1597K2195J0731Q967j3574l1370o656m715P444j358J0368
16870b1874M843l166J245K3179K143K4205j4004m412P062r936j459o264R187j2766
16856b017M880M619k899J5820k3418q640j099l038O631j783j0225j4185L193J0442
16842b1719j171n525K193j1648j5274J1569l780K7253K6276J0087j8390J572J3442
16829A4885Q875j7875P406J219J1581j1409l1076L100K3161O677k4832k3396J0299
16816b1385L1624K9030L74j0052j1253k3528m965K0185Q684j0135k5424r191j2577
$$ plain form
16803 -38613 -59408 -67740 -52783 -31869 -26249 7701 17376 -2324 -828 -26760 -36829 -32578 -42392
16790 -42392 -50167 -26579 -3542 -36747 -69539 -60953 -38041 -36543 -28846 -10894 -3662 5548 17146
16777 17146 16749 -12658 -28096 -20763 -9340 -1926 591 -2696 -1286 -17246 -15638 -1802 2359
16764 2359 3599 -115 7236 -6909 -9619 -11543 -18924 -22769 -22452 -16903 -26353 -12758 19320 45471
16750 45471 28898 19071 3169 -945 17020 33805 22093 2177 -26070 -26033 838 20177 17233
16737 17233 11815 6713 30468 50351 35970 24223 16551 1204 -11433 6134 19706 15823
16725 15823 6694 9745 26849 22469 4075 -9949 1772 12955 4943 4313 -13533 -8623 -7156
16712 -7156 -19154 -27567 -32467 -22948 -7543 -10110 -8627 8530 19686 9796 16533 26105 24364 16963
$$ packed form
16803c8613k0795q332J4957K0914N620L3950R675j9700J496k5932j0069M251r814
16790d2392p775K3588K3037l3205l2792Q586K2912J498P697J7952P232R210J1598
16777A7146l97k9407j5438P333J1423P414K517l287J410j5960J608J3836M161
16764B359J240l714P351j4145k710j924p381l845L17N549r450J3595L2078K6151
16750D5471j6573r827j5902m114J7965J6785j1712j9916k8247L7K6871J9339k944
16737A7233n418n102K3755J9883j4381j1747p672j5347j2637J7567J3572l883
16725A5823r129L051J7104m380j8394j4024J1721J1183q012o30j7846M910J467
16712g156j1998q413m900R519J5405k567J483J7157J1156r890O737R572j741p401
$$ plain form
16698 16963 -5078 -20445 -30860 -8970 34 11818 18627 16620 1132 -2489 -14847 -7955 4536
16685 4536 6311 -7159 8993 16099 4147 19623 4727 30795 42490 40851 25612 31393 25617
16672 25617 12034 -500 -14316 -14628 -12183 1050 -742 3462 11092 14768 -15387 -35293 -11460
16659 -11460 -254 -7891 -14047 -9408 4190 32657 54551 43126 18998 -15589 -37745 -35465
16647 -35465 5760 38751 31340 23137 40117 32257 317 -12995 -24544 -36529 -44809 -43983 4810
16634 4810 33712 32099 23069 25155 8865 -51 13081 29374 35343 34365 47291 34460 13606
16621 13606 -1706 2286 -12722 -13931 -37862 -43234 -34548 -44401 -56111 -32186 -19370 -13669 -15391
16608 -15391 -46866 -61936 -54823 -48948 -48024 -46164 -6771 19150 30955 19955 7001 -4056 -6985
$$ packed form
16698A6963k2041j5367j0415K1890R004J1784O809k007j5488l621j2358O892J2491
16685D536J775j3470J6152P106j1952J5476j4896K6068J1695j639j5239N781n776
16672B5617j3583j2534j3816l12K445J3233j792M204P630L676l0155j9906K3833
16659a1460J1206p637o156M639J3598K8467K1894j1425k4128l4587k2156K280
16647c5465M1225L2991p411q203J6980p860l1940j3312j1549j1985q280Q26M8793
16634D810K8902j613r030K086j6290q916J3132J6293N969r78J2926j2831k0854
16621A3606j5312L992j5008j209k3931n372Q686r853j1710K3925J2816N701j722
16608a5391l1475j5070P113N875R24J860L9393K5921J1805j1000j2954j1057k929
$$ plain form
16595 -6985 -7000 10736 5938 -24562 -39447 -36987 -34052 -37470 -37627 -44041 -25850 -22787 -46573 -29599
16581 -29599 -5062 -3420 -1825 -17408 -36711 -27507 -15071 14321 25285 29271 28124 31358 15035
16568 15035 -12522 -5393 3134 7982 15013 16787 18476 18675 16165 -4294 -2165 9455 5759 18705
16554 18705 22199 5319 -26840 -20963 -19341 -15441 -19199 -30056 524 26841 4766 -25717 -23125
16541 -23125 -29660 -12359 1535 12137 6643 14253 17135 7488 734 -16093 -18986 -5832 3978
16528 3978 -8231 -12720 10052 22414 28085 17105 15057 14438 26050 20619 21751 9214 -758
16515 -758 -13450 -11329 -19821 -27167 2135 12436 3887 -18502 4183 19607 1199 -14277 -13543
16502 -13543 -8111 6873 7852 21612 22442 -5022 -17324 -34767 -39478 -22699 -5404 -641 -1986
$$ packed form
16595f985j5J7736m798l0500j4885K460K935l418j57o414J8191L063k3786J6974
16581b9599K4537J642J595j5583j9303R204J2436K9392J0964L986j147L234j6323
16568A5035k7557P129Q527M848P031J774J689J99k510k0459K129J1620l696J2946
16554A8705L494j6880l2159N877J622L900l758j0857L0580K6317k2075l0483K592
16541b3125o535J7301J3894J0602n494P610K882r647o754j6827k893J3154R810
16528C978j2209m489K2772J2362N671j0980k048o19J1612n431J132j2537r972
16515g58j2692K121q492p346K9302J0301q549k2389K2685J5424j8408j5476P34
16502a3543N432J4984R79J3760Q30k7464j2302j7443m711J6779J7295M763j345
$$ plain form
16489 -1986 -21469 580 40653 53312 34678 -14563 -32265 -13316 -16636 -9838 -6870 -14988 -20767
16476 -20767 -24607 -34150 -22182 -7121 -29978 -31857 -29970 -25544 -4285 6476 14657 17323 -15572
16463 -15572 -30874 -27957 -31369 -6952 -5737 -3148 -18153 -23157 -17460 -15322 -10054 -7722 -6959 11576
16449 11576 22258 -122 -1308 -10259 -13644 -8561 -18705 -30459 -35919 -31205 -24733 -14607 2095
16436 2095 8952 -12068 -21252 -12333 9390 -8554 -11942 -20399 -49130 -62007 -37022 -7718 -21007
16423 -21007 -27505 -4034 4547 31058 31073 34552 17594 1107 13564 8454 -6751 14498 32899
16410 32899 32157 28165 25502 7807 17938 22016 32705 7922 -22024 -36697 -46929 -21724 -12552
16397 -12552 -19407 -12653 -8188 9963 -5369 -15243 -13723 -5109 -46264 -62972 -52240 -42328 -23394
$$ packed form
16489a986j9483K2049M0073J2659j8634m9241j7702J8949l320O798K968q118n779
16476b0767l840r543J1968J5061k2857j879J887M426K1259J0761Q181K666l2895
16463a5572j5302K917l412K4417J215K589j5005n004N697K138N268K332P63J8535
16449A1576J0682k2380j186q951l385N083j0144j1754n460M714O472J0126J6702
16436B095O857k1020r184Q919K1723j7944l388q457k8731j2877K4985K9304j3289
16423b1007o498K3471Q581K6511J5L479j6958j6487J2457n110j5205K1249J8401
16410C2899p42l992k663j7695J0131M078J0689k4783k9946j4673j0232K5205R172
16397a2552o855O754M465J8151j5332r874J520Q614m1155j6708J0732R912J8934
$$ plain form
16384 -23394 -18498 -6806 -11815 2572 21540 -3280 12732 44747 12532 -15314 -14028 -22981
16372 -22981 -31185 -36114 -28604 -14115 13883 2964 -330 -650 -20522 -27035 -12855 17395 26233
16359 26233 28570 17381 -8663 -1060 11627 14377 10812 9730 16915 17412 31863 28148 581
16346 581 4288 4489 4989 6141 12190 -9463 2965 -8951 -5588 18847 28806 21600 16125 19754
16332 19754 11859 8611 29011 31761 33515 11269 11800 23799 16211 6090 7919 276 5802 -4293
16318 -4293 -11590 -20860 -30555 -13118 -218 12545 13578 5009 10099 25199 9672 20371 17676
16305 17676 23896 36378 32850 9806 -1649 280 -4534 1853 23210 32773 7178 -22024 -8541
16292 -8541 11638 34092 30071 -8933 -17242 -16151 -25166 -32213 -4508 -20327 -8357 1628 18064
$$ packed form
16384b3394M896J1692n009J4387J8968k4820J6012L2015l2215k7846J286q953
16372b2981q204m929P510J4489K7998j0919l294l20j9872o513J4180L0250Q838
16359B6233K337j1189k6044P603J2687K750l565j082P185M97J4451l715k7567
16346E81L707K01N00J152O049k1653J2428j1916L363K4435R959p206n475L629
16332A9754p895l248K0400K750J754k2246N31J1999p588j0121J829p643N526j0095
16318d293p297r270r695J7437J2900J2763J033q569N090J5100j5527J0699k695
16305A7676O220J2482l528k3044j1455J929m814O387K1357R563k5595k9202J3483
16292h541K0179K2454m021l9004q309J091r015p047K7705j5819J1970R985J6436
$$ plain form
16279 18064 12004 14245 23690 11369 -4842 4222 15403 -13652 -18430 -16363 -17498 -7745 -5656
16266 -5656 -29224 -41055 -35488 -27035 -26831 -2815 25664 42204 21181 727 19735 12332 4193
16253 4193 16315 30718 47731 40567 2436 -10480 -12637 -13106 9450 18917 -10241 -4338 22235
16240 22235 20082 16056 2901 -26877 -20500 22332 14852 1131 -5650 -14803 -10778 20800 30274
16227 30274 10892 8258 7454 10237 30706 26484 6917 17207 16737 -327 8104 21486 34042
16214 34042 28918 8788 -10192 -42268 -31809 -1753 18839 36453 38705 32684 30583 23127 9192
16201 9192 -3860 -22602 -40075 -48481 -38792 -29236 -18040 -17166 -4363 -13972 -15219 -22192 -37310
16188 -37310 -22167 -4217 -1301 -4654 -5492 10978 26877 22660 24272 22068 -5748 -29117 -33421
$$ packed form
16279A8064o060K241R445j2321j6211R064J1181k9055m778K067j135R753K089
16266e656k3568j1831N567Q453K04K4016K8479J6540k1023k0454J9008p403q139
16253D193J2122J4403J7013p164l8131j2916k157m69K2556R467k9158N903K6573
16240B2235k153m026j3155k9778O377M2832p480j3721o781r153M025L1578R474
16227C0274j9382k634q04K783K0469m222j9567J0290m70j7064Q431J3382J2556
16214C4042n124k0130j8980l2076J0459L0056K0592J7614K252o021k101p456j3935
16201I192j3052j8742j7473q406R689R556J1196Q74J2803r609j247o973j5118
16188c7310J5143J7950K916l353q38J6470J5899m217J612k204k7816k3369m304
$$ plain form
16175 -33421 -5346 4420 2253 -6188 -18919 -26158 -12534 -652 11267 803 -20789 -32042
16163 -32042 -29108 -36260 -57401 -61374 -24145 -13020 -13535 -16830 -19370 -16746 16794 21959 -12934
16150 -12934 -38807 -18461 -15116 -23164 -15397 -1204 413 10343 -4186 -15946 -29077 -2207 -1581
16137 -1581 11141 29822 36707 -2472 -30079 -43307 -31992 -11443 -24201 -26364 -40901 -30613
16125 -30613 -16525 -9274 -3169 20364 11075 9671 4128 -17075 -2099 -913 -3450 -19046 -22616
16112 -22616 -12925 -20587 -41739 -24623 1114 40564 45607 42954 41345 41113 21290 18485 31111
16099 31111 33430 15722 2481 -35983 -36957 -34434 -31227 -27357 -28971 -31423 -5648 9002 8721 -759
16085 -759 11295 13069 7705 3078 5620 -3431 8459 23151 -8609 -40187 -30422 -8191 -15622
$$ packed form
16175c3421K8075R766k167q441j2731p239J3624J1882J1919j0464k1592j1253
16163c2042K934p152k1141l973L7229J1125n15l295k540K624L3540N165l4893
16150a2934k5873K0346L345q048P767J4193J617R930j4529j1760j3131K6870O26
16137a581J2722J8681O885l9179k7607j3228J1315K0549j2758k163j4537J0288
16125c0613J4088P251O105K3533r289j404n543k1203J4976J186k537j5596l570
16112b2616R691p662k1152J7116K5737L9450N043k653j609k32j9823k805J2626
16099C1111K319j7708j3241l8464r74K523L207L870j614k452K5775J4650k81r480
16085g59J2054J774n364m627K542r051J1890J4692l1760l1578R765K2231p431
$$ plain form
16072 -15622 -27667 -25246 -23619 -38662 -19941 912 -31674 -38018 -4977 -13337 -10695 12187 23543
16059 23543 10731 25898 40927 20946 18344 11531 -9770 -16874 8558 34681 30460 -1131
16047 -1131 -19364 -14544 -21312 -12814 -3593 -807 14293 12987 28671 48214 71017 53336 32263
16034 32263 15140 7577 -5617 14073 6499 -12191 -11643 -9998 -16062 -37538 -43125 -40934 -36271
16021 -36271 -19959 -3687 -15429 -9886 -19141 -21098 -3805 10962 11799 2222 -10617 -27566 -53182
16008 -53182 -50152 -17226 -8202 6239 9496 -4857 -17472 -17965 -17363 9657 26032 -4559 -18883
15995 -18883 -8121 18499 29770 26804 24520 22670 15796 -5145 -613 3423 -4770 3533 12230
15982 12230 4570 -17399 -16950 357 -10123 -27340 -29991 -19609 -16585 -19177 -36091 -36479 -18057
$$ packed form
16072a5622j2045K421J627j5043J8721K0853l2586o344L3041q360K642K2882J1356
16059B3543j2812J5167J5029j9981k602o813k1301p104K5432K6123m221l1591
16047a131j8233M820o768Q498R221K786J5100j306J5684J9543K2803j7681k1073
16034C2263j7123p563j3194J9690p574j8690N48J645o064k1476n587K191M663
16021c6271J6312J6272j1742N543r255j957J7293J4767Q37r577j2839j6949k5616
16008e3182L030L2926R024J4441L257j4353j2615m93O02K7020J6375l0591j4324
15995a8883J0762K6620J1271k966k284j850o874k0941M532M036q193Q303Q697
15982A2230p660k1969M49J7307j0480j7217k651J0382L024k592j6914l88J8422
$$ plain form
15969 -18057 -36033 -30311 -33667 -35096 -14858 -5461 5267 18295 25362 9225 -5428 -14409 -7648
15956 -7648 1230 21211 19494 16294 -3007 -20717 3373 40183 52462 51144 43585 31644 14082
15943 14082 -16883 -60879 -53619 -29924 -28400 -22584 -20979 -19902 -13412 -14117 -7016 -12494 -21838 -15181
15929 -15181 24091 34778 34406 27214 6547 2478 -3751 -11683 -19739 -17605 -12913 -21075 -7170 -7491
15915 -7491 -10666 1819 781 13151 -4493 -16936 -15230 -32219 -10384 19098 3472 -11985
15903 -11985 -3750 12654 15271 12037 5601 -9608 -13460 -18364 -9455 9274 -10494 -23748 -8617
15890 -8617 -1613 8827 15819 24723 32815 34069 22189 25611 17677 -2981 -11458 2527 15092
15877 15092 29206 21490 7697 -10525 -20740 -11221 -15453 -2561 -282 -1632 -12331 -24733 -31703
$$ packed form
15969a8057j7976N722l356j429K0238R397J0728J3028P067j6137j4653q981O761
15956g648Q878J9981j717l200j9301j7710K4090L6810J2279j318p559j1941j7562
15943A4082l0965m3996P260K3695J524N816J605J077O490p05P101n478r344O657
15929a5181L9272J0687l72p192k0667m069o229p932q056K134M692q162J3905l21
15915g491l175J2485j038J2370j7644j2443J706j6989K1835K9482j5626j5457
15903a1985Q235J6404K617l234o436j5209l852m904Q909J8729j9768j3254J5131
15890h617P004J0440O992Q904Q092J254j1880L422p934k0658q477J3985J2565
15877A5092J4114p716j3793j8222j0215R519m232J2892K279j350j0699j2402o970
$$ plain form
15864 -31703 -18239 5312 29389 36843 54198 61475 34727 28733 29576 23263 18949 24501 12769
15851 12769 22668 22319 7747 5861 878 11058 6739 16090 12640 29771 24668 35602 57589
15838 57589 34547 21345 1269 -15035 -20899 -18733 -30990 -17362 12318 8895 2627 -34913
15826 -34913 -47305 -20411 -11806 1133 -11546 -7950 -15709 -37289 -42227 -34339 -27296 -20739 -24490
15813 -24490 -16558 -19654 -43372 -41045 -19683 -7195 10436 2868 8398 981 -19481 -38637 -19604
15800 -19604 -16712 -5486 -7549 -2204 11756 11208 -8339 -24469 -25457 -37146 -46696 -38561 -29662 -15168
15786 -15168 -9346 -24191 -28680 -7647 7588 -2704 -392 27450 8983 -8384 -9843 16150
15774 16150 29885 14033 -25723 -26249 -22712 11074 31653 18070 3260 19606 19106 19167 10420
$$ packed form
15864c1703J3464K3551K4077P454J7355P277k6748n994Q43o313m314N552j1732
15851A2769R899l49j4572j886m983J0180m319R351l450J7131n103J0934K1987
15838E7589k3042j3202k0076j6304n864K166j2257J3628K9680l423o268l7540
15826c4913j2392K6894Q605J2939j2679L596p759k1580m938P888P043O557l751
15813b4490P932l096k3718K327K1362J2488J7631p568N530p417k0462j9156J9033
15800a9604K892J1226k063N345J3960n48j9547j6130r88j1689r550Q135Q899J4494
15786a5168N822j4845m489K1033J5235j0292K312K7842j8467j7367j459K5993
15774A6150J3735j5852l9756n26L537L3786K0579j3583j4810J6346n00O1q747
$$ plain form
15761 10420 -23952 -24399 -12803 -8861 5885 11878 9271 -4710 -4923 -15062 -13116 -8991 -12520 -23067
15747 -23067 -38206 -50547 -49314 -40425 -30479 -36866 -34085 -38041 -22660 -2458 5016 2091 23498
15734 23498 18776 10155 -11104 -27248 -27495 -20780 -28965 -32808 -17539 -3490 28189 20477 26658
15721 26658 15591 -22211 -22558 -9065 24222 28474 29586 7625 -5246 -26278 -27232 -32862 -24532
15708 -24532 -7765 -6742 -19332 -4182 -20612 -17045 -35752 -9714 -12262 -22704 8633 -436
15696 -436 23855 33336 17714 -16381 -42912 -38905 -30998 -34169 -28212 -33885 -46838 -11802 10366
15683 10366 30720 47669 21275 -27144 -20117 -4389 3200 9520 8485 9767 433 -7423 10773
15670 10773 16530 22415 12208 240 6667 17276 20847 22184 25256 44751 41416 24784 24141
$$ packed form
15761A0420l4372m47J1596L942J4746N993k607j3981k13j0139J946M125l529j0547
15747b3067j5139j2341J233Q889R946o387K781l956J5381K0202P474k925K1407
15734B3498m722q621k1259j6144k47O715q185l843J5269J4049L1679p712O181
15721B6658j1067l7802l47J3493L3287M252J112k1961j2871k1032r54n630Q330
15708b4532J6767J023j2590J5150j6430L567j8707K6038k548j0442L1337r069
15696d36K4291R481j5622l4095k6531M007P907l171N957n673j2953L5036K2168
15683A0366K0354J6949k6394m8419P027J5728P589O320j035J282r334p856J8196
15670A0773N757N885j0207j1968O427J0609L571J337L072J9495l335j6632o43
$$ plain form
15657 24141 19068 -16316 -10174 -15602 -26119 -25123 -8150 -10205 -24201 -57568 -61624 -30812 -4329
15644 -4329 16695 4994 -17845 2692 17371 27254 30983 38404 17853 14560 34969 5144 -33320
15631 -33320 -33543 -40315 -22891 -10305 2276 -975 -5118 -16057 -1133 5281 -17309 -15494 5470
15618 5470 33625 10089 -4995 -3238 -18042 -4099 -5353 -23946 1079 -9858 -17918 -6757
15606 -6757 2495 2239 -11178 -12459 -14364 -17531 -25805 -15185 -19864 -476 42041 46479 20632 12070
15592 12070 21600 23542 27991 36533 18654 -3123 15636 -6664 -17750 -1629 -15406 -16685 -18209
15579 -18209 -8135 -3929 -10581 -26200 -16712 -917 2926 8856 17510 1166 -16101 -25973 -11404
15566 -11404 10643 3295 -11537 -22190 -9790 -2791 5804 13006 27970 25734 32447 32673 30208
$$ packed form
15657B4141n073l5384O142n428j0517R96J6973k055j3996l3367m056L0812K6483
15644d329K1024j1701k2839K0537J4679R883L729P421k0551l293K0409k9825l8464
15631c3320k23o772J7424J2586J2581l251m143j0939J4924O414k2590J815K0964
15618E470K8155k3536j5084J757j4804J3943j254j8593K5025j0937q060J1161
15606f757R252k56j3417j281j905l167q274J0620m679J9388M2517M438k5847q562
15592A2070R530J942M449Q542j7879k1777J8759k2300j1086J6121j3777j279j524
15579a8209J0074M206o652j5619R488J5795L843N930Q654j6344j7267r872J4569
15566a1404K2047p348j4832j0653J2400O999Q595P202J4964k236O713K26k465
$$ plain form
15553 30208 31800 37606 41507 13058 -2412 12395 15619 -3999 11189 45174 50276 21763 16142
15540 16142 8310 -2518 -5859 -3962 -17608 3542 39209 42579 27179 4147 2188 12605 -3382
15527 -3382 -12452 -29611 -38462 -23041 -14003 -4608 6456 -11644 -14082 -21221 -16064 26541 34965
15514 34965 38518 31416 39962 13764 511 15479 7823 -16014 -30109 -3072 -3371 -9557 -25232
15501 -25232 -25856 -23658 -9700 11669 8877 24293 22853 5061 -6125 -23953 -16305 9981 25269
15488 25269 15113 9796 18593 32034 52069 16268 -272 17338 27880 29442 13095 72
15476 72 -8180 -4395 -13964 -2996 896 15284 20061 8667 -1596 14996 30429 28122 17316
15463 17316 16555 16482 7659 16459 39198 47030 9539 981 -4136 18634 5297 4349 17610 38503
$$ packed form
15553C0208J592N806L901k8449j5470J4807L224j9618J5188L3985N102k8513n621
15540A6142p832j0828l341J897j3646K1150L5667L370j5400k3032j959J0417j5987
15527c382r070j7159q851J5421R038R395J1064j8100k438p139N157M2605Q424
15514C4965L553p102Q546k6198j3253J4968p656k3837j4095K7037k99o186j5675
15501b5232o24K198J3958K1369k792J5416j440j7792j1186j7828P648K6286J5288
15488B5269j0156n317Q797J3441K0035l5801j6540J7610J0542J562j6347j3023
15476G2q252L785r569J0968L892J4388M777j1394j0263J6592J5433k307j0806
15463A7316p61p3q823Q800K2739P832l7491q558n117K2770j3337r48J3261K0893
$$ plain form
15449 38503 36114 36257 26829 15653 13605 4390 -7434 -10578 13836 37208 27323 11880 15749
15436 15749 40213 34406 36784 42637 38784 47917 53558 57372 46688 41109 29992 2677 2335 17156
15422 17156 33404 41909 36080 31503 30939 46285 44323 28558 30138 21244 18474 31258 45435
15409 45435 26222 23174 33390 22999 30227 35469 19739 5242 15785 34094 45757 32703
15397 32703 10539 5040 -3615 5933 5573 19194 11276 -15295 -15711 7302 9120 21348 30385 18173
15383 18173 3060 -17827 -46399 -12726 13223 2296 -7048 23894 47651 38862 -2418 -28048
15371 -28048 -9618 10270 4728 -6656 6371 36605 59662 51311 46302 36650 32479 40274 54110
15358 54110 49949 27979 33684 29082 26405 7105 -24369 -18461 -10608 16320 28391 20744 7096
$$ packed form
15449C8503k389J43r428j1176k048r215j1824l144K4414K3372r885j5443L869
15436A5749K4464n807K378N853l853R133N641L814j0684n579j1117k7315l42J4821
15422A7156J6248Q505n829m577n64J5346j962j5765J580q894k770J2784J4177
15409D5435j9213l048J0216j0391P228N242j5730j4497J0543J8309J1663j3054
15397C2703k2164n499q655R548l60J3621p918k6571m16K3013J818J2228R037j2212
15383A8173j5113k0887k8572L3673K5949j0927r344L0942K3757q789m1280k5630
15371b8048J8430J9888n542j1384J3027L0234K3057q351n009r652m171P795J3836
15358E4110m161k1970N705m602k677j9300l1474N908P853K6928J2071p647j3648
$$ plain form
15345 7096 10562 18272 19060 7379 -4962 -14309 -3417 -1349 16527 18847 14072 17592 21737 24159
15331 24159 31626 19861 19862 14848 20729 -917 -15313 1897 15592 -6964 -9821 -21221 -35317
15318 -35317 -52440 -34144 -6140 20469 29288 21265 821 -23648 -23619 -8817 -25413 -5780 -5915
15305 -5915 -3645 5694 -3848 -11813 -22510 -13387 -19622 -19369 -12959 -10342 -16709 -6569 -3709 -1689
15291 -1689 -15179 -6412 20843 10707 11859 -5068 -5995 2152 11645 23533 9824 -15411 -14958
15278 -14958 6988 1140 -1743 -6738 -12450 -20478 -14253 14622 37930 45530 46494 21268 -1301
15265 -1301 -16330 1600 12906 5637 -7774 -21933 -26155 -16415 -3491 3276 -22983 -10676 2534
15252 2534 -13267 -40051 -40750 -35368 -28231 -15015 3715 8124 8727 -14715 -1714 687 12681
$$ packed form
15345G096L466P710P88j1681j2341r347J0892K068J7876K320m775L520M145K422
15331B4159P467j1765Jn014N881k1646j4396J7210J3695k2556k857j1400j4096
15318c5317j7123J8296K8004K6609Q819q023k0444k4469K9J4802j6596J9633j35
15305e915K270R339r542p965j0697R123o235K53O410K617o367J0140K860K020
15291a689j3490Q767K7255j0136J152j6927r27Q147R493J1888j3709k5235M53
15278a4958K1946n848k883m995n712q028O225K8875K3308P600R64k5226k2569
15265a301j5029J7930J1306p269j3411j4159m222R740J2924O767k6259J2307J3210
15252B534j5801k6784o99N382P137J3216J8730M409O03k3442J3001K401J1994
$$ plain form
15239 12681 27191 20238 13570 7535 -2237 9827 17437 7577 -1660 15803 17186 8535 4369 8157
15225 8157 10114 -13396 -17831 20454 16784 -7753 -4892 -19221 -7312 -3752 -35930 -47850 -26125
15212 -26125 -31744 -46447 -49960 -51296 -22405 -7085 -8164 -18753 353 -525 7472 20697 25769
15199 25769 5686 -13263 -19417 -331 22412 5025 6958 -2006 -15279 -14480 -7697 -25106 -26999
15186 -26999 -17839 -20766 -30383 -67341 -61494 -36214 -35433 -25707 -18273 4401 34689 32597 23089 39566
15172 39566 22504 899 6828 1755 -19392 -10132 -9654 -13602 -18067 -9987 -5388 6340 17233
15159 17233 15792 17232 41791 39567 22072 3123 4207 5563 -7234 8878 28876 28810 10053
15146 10053 4751 17961 31666 23179 -4015 -24677 -32125 -12834 -4536 14529 4112 7737 6872
$$ packed form
15239A2681J4510o953o668o035r772J2064P610r860r237J7463J383q651m166L788
15225H157J957k3510m435L8285l670k4537K861j4329J1909L560l2178j1920K1725
15212b6125n619j4703l513j336K8891J5320j079j0589J9106q78P997J3225N072
15199B5769k0083j8949o154J9086K2743j7387J933q964j3273P99O783j7409j893
15186b6999R160k927r617l6958N847K5280P81R726P434K2674L0288k092r508J6477
15172C9566j7062k1605N929n073k1147R260M78l948m465Q080M599J1728J0893
15159A7233j441J440K4559k224j7495j8949J084J356j2797J6112J9998o6j8757
15146A0053n302J3210J3705q487k7194k0662p448J9291Q298J9065j0417L625q65
$$ plain form
15133 6872 20044 33847 12753 -23653 -19837 2219 7437 9535 -10439 -7270 -8104 -25890 -18501
15120 -18501 -15964 -13405 -13209 -4465 6340 9334 11788 1889 1492 422 -7766 -20189 -20077 233
15106 233 -20169 -47444 -35144 -16389 -13431 -13804 -11889 -5418 2560 -24843 -19442 -17341 -9617 1852
15092 1852 21993 -9198 -20924 -20119 300 3624 -9583 29143 37625 34456 10651 -14567 -22894
15079 -22894 -14068 -27798 -9755 -4050 -11516 -4499 13189 8850 15699 14988 12003 5789 -17570 -27751
15065 -27751 -26680 -17960 -13755 2972 13034 12330 2457 -6418 -12801 -4827 -10567 -18209 -8030 21710
15051 21710 28538 21640 27776 4625 -12207 -9410 1722 -6509 -8515 1903 13723 15288 35087
15038 35087 46197 38630 20044 27150 22677 13942 10692 12721 17690 6735 695 7405 2121 10877
$$ packed form
15133F872J3172J3803k1094l6406L816K2056N218K098j9974L169q34j7786P389
15120a8501K537K559J96Q744J0805K994K454r899l97j070q188j2423J12K0310
15106B33k0402k7275J2300J8755K958l73J915O471P978k7403N401K101P724J1469
15092A852K0141l1191j1726Q05K0419L324j3207L8726Q482l169k3805k5218q327
15079b2894Q826j3730J8043N705p466P017J7688m339O849p11k985o214k3359j0181
15065b7751J071Q720M205J6727J0062p04r873q875o383P974n740p642J0179K9740
15051B1710O828o898O136k3151j6832K797J1132q231k006J0418J1820J565J9799
15038C5087J1110p567j8586P106m473q735l250K029M969j0955o040O710n284Q756
$$ plain form
15024 10877 24544 31909 32669 20075 6564 12344 16769 8205 15015 30754 35170 22409 7382
15011 7382 -18401 -36475 -20221 11919 32225 29036 -6163 -16595 -27325 -18168 -7185 -9885
14999 -9885 60 4002 -20608 -24151 -2801 -9463 -18891 -14731 -2566 1420 14209 20766 1641
14986 1641 -9401 -16950 -14762 -9334 -6697 -15916 -5955 -23556 -28706 -19502 4327 17758 16498 33661
14972 33661 29822 26268 11194 4925 22539 3196 -5481 -4057 -14496 -16994 -18940 -16425 -17151 -6731
14958 -6731 1721 3403 -5751 -15823 -532 7438 -6877 -13781 -4388 -23266 -43700 -42150 -32185
14945 -32185 -28328 396 -7636 -10067 -4203 4009 15538 -1542 -467 5700 -6686 -19732 -11376
14932 -11376 -6000 -3076 -3506 -36953 -35112 -22856 30347 53434 31574 6369 -2632 -10673 1531
$$ packed form
15024A0877J3667P365P60j2594j3511N780M425q564O810J5739M416j2761j5027
15011G382k5783j8074J6254L2140K0306l189l5199j0432j0730R157J0983k700
14999i885R945L942k4610l543K1350o662r428M160J2165L986J2789O557j9125
14986A641j1042p549K188N428K637r219R961j7601n150R204K3829J3431j260J7163
14972C3661l839l554j5074o269J7614j9343q677J424j0439k498j946K515p26J0420
14958f731Q452J682r154j0072J5291P970j4315o904R393j8878k0434J550R965
14945c2185L857K8724q032k431N864Q212J1529j7080J075O167j2386j3046Q356
14932a1376N376K924m30l3447J841J2256N3203K3087k1860k5205r001q041J2204
$$ plain form
14919 1531 -13791 7593 41432 48877 26358 -579 -10802 -2066 -14204 -12036 -9495 8066 3815
14906 3815 11696 887 12311 -3174 -940 5 -3170 -3134 -33602 -38957 -38069 -28325 -9608 -1839
14892 -1839 13621 38377 27607 30042 16619 10183 -285 7095 -23835 -25541 -28610 -45648 -26648
14879 -26648 -14951 -22708 -46495 -59378 -42007 -24495 -8954 -17008 -7243 -14208 1424 13383
14867 13383 9607 25298 40009 38350 22912 22768 29863 39094 27473 11121 18199 31393 10804
14854 10804 12821 20982 37066 43486 25580 8664 -6097 -19579 -15548 -13389 -7590 -558 -2354
14841 -2354 -38662 -39871 -17552 -16058 -28426 -45372 -32373 -31451 -24414 -30080 -37811 -43171 -45110 -29171
14827 -29171 -23423 -33104 -45976 -43708 -32559 -27205 -20430 -9632 -2902 -6043 932 5315 26653
$$ packed form
14919A531j5322K1384L3839P445k2519k6937j0223Q736j2138K168K541J7561m251
14906C815P881j0809J1424j5485K234R45l175L6l0468n355Q88R744J8717P769
14892a839J5460K4756j0770K435j3423o436j0468P380l0930j706l069j7038J9000
14879b6648J1697p757k3787j2883J7371J7512J5541q054R765o965J5632J1959
14867A3383l776J5691J4711j659j5438j44P095R231j1621j6352P078J3194k0589
14854A0804K017Q161J6084O420j7906j6916j4761j3482M031K159N799P032j796
14841b354l6308j209K2319J494j2368j6946J2999R22P037n666p731n360j939J5939
14827b9171N748r681j2872K268J1149N354O775J0798O730l141O975M383K1338
$$ plain form
14814 26653 47693 23711 5918 -6272 -8500 -9585 -12377 -34183 -17606 5090 12362 21772 12511
14801 12511 15678 12523 -12788 -41289 -36547 -18785 -6672 -1992 -14090 -17998 -30137 -27184 -20704
14788 -20704 -31680 -28852 -15800 -18950 -26180 -29133 -24902 15596 28338 4449 4499 -27901 -32225
14775 -32225 -34296 -33602 -19550 -21183 -16180 -17185 5227 27141 16050 722 -3646 -7040 -25572
14762 -25572 -41710 -28733 -6681 16404 -1220 -24947 -19601 -290 6607 -9666 -26098 -11501
14750 -11501 12929 43394 31875 5915 -13892 -28096 -29520 1910 16456 22039 8229 415
14738 415 13061 9616 -9699 -23453 -31077 -38059 -11980 23119 13185 -22664 -24815 -39580 -23383
14725 -23383 264 13185 6316 -238 -17352 1598 -2066 -11756 -4789 -47118 -55011 -41688 -33635
$$ packed form
14814B6653K1040k3982j7793j2190k228j085k792k1806J6577K2696P272R410r261
14801A2511L167l155k5311k8501M742J7762J2113M680j2098l908j2139K953O480
14788b0704j0976K828J3052l150p230k953M231M0498J2742k3889N0l2400m324
14775c2225k071O94J4052j633N003j005K2412K1914j1091j5328m368l394j8532
14762b5572j6138J2977K2052K3085j7624k3727N346J9311O897j6273j6432J4597
14750a1501K4430L0465j1519k5960j9807j4204j424L1430J4546N583j3810p814
14738D15J2646l445j9315j3754p624o982K6079L5099r934l5849k151j4765J6197
14725b3383K3647J2921o869o554j7114J8950l664r690O967m2329p893J3323Q053
$$ plain form
14712 -33635 -44059 -35211 -40491 -25463 -10707 3671 -9424 -31680 -12492 4466 -1501 -25724
14700 -25724 -34061 -13056 -2165 -2253 -15386 -23915 -2620 7547 17030 2762 -1672 -3786 -4774 1789
14686 1789 17964 14986 5029 -7108 -3985 -7716 -14253 -8907 -16217 -18026 -3588 -19413 -7459
14673 -7459 -9154 -29743 -30646 13657 15866 -2429 9187 23954 15260 -1046 2575 26107 24240
14660 24240 29752 8973 9 -8405 -3131 -9886 -19608 -18112 1593 -2493 -19682 -41406 -35811
14647 -35811 -13712 5796 5797 11990 24597 -2156 -14650 6394 8340 15895 -998 8290 6469
14634 6469 5763 -2449 -2172 -3336 -23934 -3183 12893 20485 29072 23880 8373 -23149 -48487 -43491
14620 -43491 -30326 -32591 -43388 -50305 -24913 -7359 4420 16615 12578 27657 69811 70692 27062
$$ packed form
14712c3635j0424Q848n280J5028J4756J4378j3095k2256J9188J6958n967k4223
14700b5724q337K1005J0891q8j3133q529K1295J0167R483j4268m434k114r88O563
14686A789J6175k978r957j2137L123l731o537N346p310j809J4438j5825J1954
14673g459j695k0589r03M4303K209j8295J1616J4767q694j6306L621K3532j867
14660B4240N512k0779q964q414N274o755r722J496J9705m086j7189k1724N595
14647c5811K2099J9508JO193J2607k6753j2494K1044J946P555j6893R288j821
14634F469p06q212K77j164k0598K0751J6076P592Q587n192j5507l1522k5338M996
14620d3491J3165k265j0797o917K5392J7554J1779J2195m037J5079M2154Q81m3630
$$ plain form
14607 27062 -1929 -4660 15440 8562 -3942 -1122 -1359 -4240 7374 19083 14247 -1481 -20547
14594 -20547 -17598 -7615 522 23935 23832 20078 15109 -20457 -55245 -38523 -31282 -37700 -30888 -41382
14580 -41382 -30353 -14941 -11980 -11282 -23607 -15545 -30523 -26560 -18964 -18593 3713 -8107 1560
14567 1560 105 -9961 2148 8525 2505 1969 12555 17636 4518 1031 -14937 -9306 -19777
14554 -19777 -11544 -2575 -4889 3901 -7815 -18493 -14627 -4295 7767 1281 -7894 -7025 -1335 371
14540 371 -1638 6627 -5858 -14471 -2545 -15663 -37018 -9945 -81 -11467 -25548 -27665 -17200
14527 -17200 12586 22339 21431 -7004 -13241 -15198 -2488 -1101 -168 5457 -2990 -16310 -20256 -25455
14513 -25455 -46259 -22934 16026 4523 -3303 -8723 -18740 -24849 -37094 -27135 -18350 -8669 18103
$$ packed form
14607B7062k8991k731K0100o878j2504K820k37k881J1614J1709m836j5728j9066
14594b0547K949R983Q137K3413j03l754m969l5566l4788J6722P241o418O812j0494
14580d1382J1029J5412K961O98j2325Q062j4978L963P596L71K2306j1820R667
14567A560j455j0066J2109O377o020n36J0586N081j3118l487j5968N631j0471
14554a9777Q233Q969k314Q790j1716j0678L866J0332J2062o486r175Q69N690J706
14540C71k009Q265j2485q613J1926j3118k1355K7073R864j1386j4081k117J0465
14527a7200K9786R753r08k8435o237j957J2710J387R33N625q447j3320l946n199
14513b5455k0804K3325L8960j1503p826n420j0017o109j2245R959Q785R681K6772
$$ plain form
14500 18103 -7913 -17567 -9308 4642 2825 -16795 -1286 423 3957 -3952 3363 16013 18815
14487 18815 -3804 -7547 7246 -24222 -33781 -19910 -3178 5762 17510 -2656 -15134 -11037
14475 -11037 -1771 -23401 -32553 -3640 6379 10946 35673 43783 28863 60918 66932 44091 16663
14462 16663 13283 27562 15931 -594 1982 16051 20211 28513 11176 28049 36889 7502 -6644
14449 -6644 -12024 2130 10042 -14891 -28577 -19291 15687 40292 34979 10080 -13783 -29445 -43729
14436 -43729 -34482 -16937 -38102 -41486 -35561 -42992 -41194 -23209 -7307 4183 -4946 -11006 3952
14423 3952 -716 -8741 9060 4680 -7775 -10509 -15209 -15692 -23582 -30069 -37239 -26339 -18685 -35548
14409 -35548 -22133 -24020 -21160 -5166 8563 508 1593 -7852 -28052 -60691 -57346 -15887 -16532
$$ packed form
14500A8103k6016r654Q259J3950j817j9620J5509J709L534p909P315J2650K802
14487A8815k2619l743J4793l1468r559J3871J6732Q940J1748k0166j2478M097
14475a1037R266k1630r152K8913J0019M567K4727Q110j4920L2055O014k2841k7428
14462A6663l380J4279j1631j6525K576J4069M160Q302j7337J6873Q840k9387j4146
14449f644n380J4154P912k4933j3686R286L4978K4605n313k4899k3863j5662j4284
14436d3729R247J7545k1165l384N925p431J798J7985J5902J1490r129o060J4958
14423C952m668q025J7801m380j2455k734m700m83p890o487p170J0900P654j6863
14409c5548J3415j887K860J5994J3729q055J085r445k0200l2639L345M1459o45
$$ plain form
14396 -16532 -18423 -19661 -23810 -25093 -27337 -54031 -41206 -14756 -1517 22761 47247 53536 35120
14383 35120 19372 7145 13649 -7595 -18468 -16755 -6998 -23526 -38306 -29706 -20163 -20530 -12252
14370 -12252 -15994 -19090 -12012 29755 57079 30775 16670 1152 3389 19272 47894 59389
14358 59389 42841 6878 1418 -13160 -25097 -25055 -31270 -42929 -25998 -16656 -25846 -13937 -2279
14345 -2279 14128 -483 -19673 -3694 7395 -16070 -7075 -17046 -34831 -20275 -8449 -28318
14333 -28318 -36359 -25405 -16307 -18275 -23906 -29566 -4185 -12150 -23456 -29900 -25967 -38326 -26131
14320 -26131 -37783 -31083 -24009 -2920 4034 -23007 -14469 -6929 -28915 -41785 -33535 -15525 -16933
14307 -16933 -18304 1005 22775 39449 44817 28664 7261 -5041 504 -13326 -19301 -11155 -9225
$$ packed form
14396a6532j891j238m149j283k244k6694J2825K6450J3239K4278K4486O289j8416
14383C5120j5748j2227O504k1244j0873J713R757j6528j4780Q600R543l67Q278
14370a2252l742l096P078M1767K7324k6304j4105j5518K237J5883K8622J1495
14358E9389j6548l5963n460j4578j1937M2o215j1659J6931R342r190J1909J1658
14345b279J6407j4611j9190J5979J1089k3465Q995r971j7785J4556J1826j9869
14333b8318q041J0954R098j968n631n660K5381p965j1306o444L933j2359J2195
14320b6131j1652O700P074K1089O954k7041Q538P540k1986j2870Q250J8010j408
14307a6933j371J9309K1770J6674N368j6153k1403j2302N545j3830n975Q146J930
$$ plain form
14294 -9225 10147 22612 37641 28343 17362 24350 10683 -14322 -8510 -1209 -22572 -30539 -10432
14281 -10432 9107 5172 -4057 10643 19735 7812 2844 -5656 12748 -3763 -9804 -36132 -5807
14268 -5807 8673 1152 6272 13607 40560 61037 49337 37053 33828 8677 -5751 2986 -12462
14255 -12462 -26065 -9374 -13635 -23664 -20653 -20941 -15492 -10894 -2534 -10599 -35763 -44364 -24093
14242 -24093 -12142 -12333 -3785 -11278 -23140 -15676 -20564 -21098 -23621 13 6253 -17446 -37411 -37501
14228 -37501 -17530 -9681 16032 26212 12371 -14652 -8851 -11396 -3591 -5885 -5755 -3062 -19012
14215 -19012 -44823 -54438 -54063 -35356 -22667 -18184 -12968 -758 15092 15497 4915 16824 14354
14202 14354 -6037 -34077 -45616 -34672 -9977 -22804 -41040 -43060 -14025 -12866 -25527 -47290
$$ packed form
14294i225J9372J2465J5029r298j0981O988j3667k5005N812P301k1363p967K0107
14281a0432J9539l935r229J4700R092j1923m968q500J8404j6511o041k6328L0325
14268e807J4480p521N120P335K6953K0477j1700j2284l225k5151j4428Q737j5448
14255a2462j3603J6691m261j0029L011k88N449M598Q360q065k5164q601K0271
14242b4093J1951j91Q548p493j1862P464m888n34k523K3634O240k3699j9965r0
14228c7501J9971P849K5713J0180j3841k7023N801k545P805k294J30K693j5950
14215a9012k5811r615L75J8707J2689M483N216J2210J5850M05j0582J1909k470
14202A4354k0391k8040j1539J0944K4695j2827j8236k020K9035J159j2661k1763
$$ plain form
14190 -47290 -35665 -33016 -24642 -26265 -21915 -19422 -9399 3480 9426 12529 -5649 -29206 -16507
14177 -16507 10855 14387 4877 -1481 8695 18642 31734 16633 1535 9388 22534 17136 -2464
14164 -2464 13944 39208 26146 45770 47251 16428 26262 52092 68180 72555 82263 106964 138722
14151 138722 172109 202486 232067 288295 349715 441591 594006 752610 893155 1035071 1192360
14140 1192360 1319814 1411255 1447986 1413996 1328770 1217532 1091940 971758 816210 675279
14130 675279 559109 466649 377048 296064 248343 206982 189257 170658 182378 185730 158123
14119 158123 132404 106319 74144 55083 36970 54089 37290 15971 1939 15402 19770 5902
14107 5902 13897 14778 17564 26811 30425 4987 -13183 -1627 21382 19550 37154 47048 41593 28133
$$ packed form
14190d7290J1625K649Q374j623M350K493J0023J2879N946L103j8178k3557J2699
14177a6507K7362L532r510o358J0176R947J3092j5101j5098P853J3146n398j9600
14164b464J6408K5264j3062J9624J481l0823R834K5830J6088M375R708K4701L1758
14151A38722L3387L0377K9581N6228O1420R1876J52415J58604J40545J41916J57289
14140A192360J27454R1441L6731l3990q5226j11238j25592j20182j55548j40931
14130F75279j16170r2460q9601q0984m7721m1361j7725j8599J1720L352k7607
14119A58123k5719k6085l2175j9061j8113J7119j6799k1319j4032J3463M368j3868
14107E902P995Q81K786R247L614k5438j8170J1556K3009j832J7604R894n455j3460
$$ plain form
14093 28133 7330 11793 -1485 -6013 -3929 -11019 -12806 -15298 -11113 11242 9820 19443 9453 -17573
14079 -17573 -26897 -7997 -18962 -10288 -6765 -27422 -25539 -32254 -10846 -3486 -2450 -32312 -41579
14066 -41579 -43279 -35833 -20633 -11573 -13972 -12386 8717 -2318 -12696 -2057 1138 26518 35162
14053 35162 26502 34667 41516 29069 42616 8856 -483 13246 13450 -2171 -10067 -9197 12327
14040 12327 14676 9277 -23659 -48938 -43554 -21447 -14043 -37374 -38878 -48916 -33990 -4671 -12554
14027 -12554 -7990 21085 22651 5819 13305 17204 3018 -23114 -23406 -12856 -21287 -24921 -46047
14014 -46047 -53444 -65160 -67646 -56112 -17542 -21272 -34451 -43354 -23458 6447 16295 17725 18265
14001 18265 29029 35437 29110 29629 31801 23799 6541 -7314 -14206 -28545 -23947 604 4304
$$ packed form
14093B8133k0803M463j3278m528K084p090j787k492M185K2355j422R623r990k7026
14079a7573r324J8900j0965Q674L523k0657J883o715K1408P360J036k9862r267
14066d1579j700P446J5200R060k399J586K1103j1035j0378J0639L195K5380Q644
14053C5162q660Q165O849j2447J3547l3760r339J3729K04j5621p896Q70K1524
14040A2327K349n399l2936k5279N384K2107P404k3331j504j0038J4926K9319p883
14027a2554M564K9075J566j6832P486L899j4186k6132k92J0550q431l634k1126
14014d6047p397j1716k486J1534L8570l730j3179q903J9896K9905R848J430N40
14001A8265J0764O408o327N19K172q002j7258j3855o892j4339M598K4551L700
$$ plain form
13988 4304 -3083 17759 22376 4499 -19268 -15696 -15017 -17986 -11462 -4813 3593 -1586 -3747 37682
13974 37682 37749 4915 15307 26646 25746 8248 -16650 -10335 -4203 17397 21205 5809 3700
13961 3700 17692 14254 -2750 -14855 -30283 -25266 -35261 -15591 -21870 -26457 -22345 -27298 -16715
13948 -16715 9613 8893 -16782 -14188 -8096 991 5304 -16564 -32131 -19611 -14036 2801 -2524
13935 -2524 16574 20084 -12536 -36725 -59623 -45548 -17340 23597 34051 23371 23664 19973 -69
13922 -69 -15469 -19908 -23096 -11400 -2001 -8294 10720 9631 23781 17120 23701 27262 12898 1466
13908 1466 9259 13584 -667 -3845 -16784 -13569 -53269 -50658 -14037 6026 16545 32189 20294
13895 20294 -3967 -8013 -4015 -1029 -4766 8154 18149 -1421 6816 13469 -1015 -3041 -15208
$$ packed form
13988D304p387K0842M617j7877k3767L572O79k969O524O649Q406n179k161M1429
13974C7682O7l2834J0392J1339r00j7498k4898O315O132K1600L808j5396k109
13961C700J3992l438j7004j2105j5428N017r995J9670o279m587M112m953J0583
13948a6715K6328p20k5675K594O092R087M313k1868j5567J2520N575J6837n325
13935b524J9098L510l2620k4189k2898J4075K8208M0937J0454j0680K93l691k0042
13922f9j5400m439l188J1696R399o293J9014j089J4150o661O581L561j4364j1432
13908A466P793M325j4251l178j2939L215l9700K611L6621K0063J0519J5644j1895
13895B0294k4261m046L998K986l737J2920R995j9570Q237O653j4484k026j2167
$$ plain form
13882 -15208 -17740 -26930 -9013 8912 23135 8736 8052 1545 -12910 -38632 -64381 -32241 -9773
13869 -9773 21517 28987 16471 -5497 10480 13622 25234 38942 50953 76855 87437 156136
13857 156136 199883 247849 283299 326419 369548 377511 369189 332632 296223 223302 158216 119393
13845 119393 84753 64443 41506 39141 41256 43033 3994 -23481 -11482 6898 11600 13119
13833 13119 21975 19668 9234 -1042 -7934 -15724 -17897 -26395 -33796 -19298 -22122 -1885 -16115
13820 -16115 -33154 -29419 -13418 -5675 15204 9239 -13584 -16037 -7746 -14467 -33660 -26174 -24156
13807 -24156 -24611 -25310 -19544 -13440 -32567 -32172 -23025 -23267 -20302 -10192 2119 -3849 -17464 -10639
13793 -10639 -13730 -33176 -22117 -22421 -36048 -16314 13242 50656 63696 40549 33583 31589 11950
$$ packed form
13882a5208k532r190J7917J7925J4223j4399o84o507j4455k5722k5749L2140K2468
13869i773L1290P470j2516k1968J5977L142J1612J3708J2011K5902J0582O8699
13857A56136M3747M7966L5450M3120M3129P963q322l6557l6409p2921o5086l8823
13845A19393l4640k0310k2937k365K115J777l9039k7475J1999J8380M702J519
13833A3119Q856k307j0434j0276o892p790k173q498p401J4498k824K0237j4230
13820a6115j7039L735J6001P743K0879n965k2823k453Q291o721j9193P486K018
13807b4156m55o99N766O104j9127L95R147k42K965J0110J2311n968j3615O825
13793a0639l091j9446J1059l04j3627J9734K9556L7414J3040k3147o966j994j9639
$$ plain form
13780 11950 12493 20685 20014 24481 29127 39684 37106 26310 18975 8681 2858 -13977 -14973 -20853
13766 -20853 -7101 12412 6823 22419 19823 16979 22335 19176 13517 6471 7401 32432 42205 22987
13752 22987 18155 12861 13456 19556 14509 -25927 -54424 -46259 -50548 -28700 10665 24957 11244
13739 11244 6499 9092 12320 -10456 -41164 -29813 -26160 -33219 -6130 20861 17754 24104 9517
13726 9517 23867 12579 -10165 -33908 -29295 -19605 -5989 9241 7189 -9774 -2767 -6570 12498
13713 12498 13079 2 914 5188 17629 26552 24094 -4510 -29750 -59166 -73107 -57852 -37059
13700 -37059 -22928 3815 43664 43719 40979 7355 -15449 -27854 -34240 -20369 10458 11172 -4524
13687 -4524 -14830 -2569 15498 -14079 -47312 -63142 -60312 -22482 -1487 32752 25920 25890 3998
$$ packed form
13780A1950N43Q192o71M467M646J0557k578j0796p335j0294n823j6835r96n880
13766b0853J3752J9513n589J5596k596k844N356l159n659p046R30K5031R773j9218
13752B2987m832n294N95O100n047m0436k8497Q165m289K1848L9365J4292j3713
13739A1244m745K593L228k2776l0708J1351L653p059K7089K6991l107O350j4587
13726I517J4350j1288k2744k3743M613R690J3616J5230k052j6963P007l803J9068
13713A2498N81j3077R12M274J2441Q923k458k8604k5240k9416j3941J5255K0793
13700c7059J4131K6743L9849N5k740l3624k2804j2405o386J3871L0827P14j5696
13687d524j0306J2261J8067k9577l3233j5830K830L7830K0995L4239o832l0k1892
$$ plain form
13674 3998 -1405 -4221 13707 4949 -8539 -13120 7829 9039 12725 29557 42974 36161 19430
13661 19430 22555 32197 8877 2920 14693 -7550 -22936 -29446 -25244 -34249 -35000 -14152 -25717
13648 -25717 -54288 -67331 -60025 -59655 -68914 -39047 -25670 -19554 -7977 19248 27316 -16944 -33475
13635 -33475 -28292 -29962 -30797 -17195 -7679 -15020 -10453 -7655 -32734 -36918 -2586 2231 7733 2698
13621 2698 -24172 -25101 -19908 -34299 -50321 -51287 -57996 -46735 -8008 18169 9089 -31591 -25123
13608 -25123 -19999 -24493 -29389 -24189 -2966 11009 92 -34287 -33077 -14119 -6833 -7229 -390
13595 -390 -19747 -31601 -13749 16986 33766 24202 -6689 -39987 -49455 -57934 -31950 -17049 -21979
13582 -21979 -2125 7799 5246 7156 -22379 -29463 -25115 -10177 961 8907 11147 15177 9251
$$ packed form
13674C998n403k816J7928q758j3488m581K0949J210L686J6832J3417o813j6731
13661A9430L125R642k3320n957J1773k2243j5386o510M202r005p51K0848j1565
13648b5717k8571j3043P306L70r259K9867J3377O116J1577K7225Q068m4260j6531
13635c3475N183j670q35J3602R516p341M567K798k5079m184L4332M817N502n035
13621B698k6870r29N193j4391j6022r66o709J1261L8727K6177r080m0680O468
13608b5123N124m494m896N200K1223J3975j0917l4379J210J8958P286l96O839
13595c90j9357j1854J7852L0735J6780r564l0891l3298r468q479K5984J4901m930
13582b1979J9854R924k553J910k9535p084M348J4938J1138P946K240M030n926
$$ plain form
13569 9251 -11693 -20509 15757 30573 26980 9061 3963 2880 -629 -7044 -32151 -47560 -31927
13556 -31927 -4811 1053 -7339 -1268 -8382 -3366 2638 1430 -35871 -26481 -21690 -40758 -45773 -45029
13542 -45029 -27932 -12394 -25883 -60709 -59696 -33668 -25246 -39999 -61550 -37353 -35616 -26163
13530 -26163 -44514 -61787 -51878 -35750 -33741 2822 24331 36737 29439 20486 9248 2107 -23907
13517 -23907 -36494 -20632 4072 -23205 -40010 -35453 -19797 -19311 -23155 -11987 -24892 -38676
13505 -38676 -53139 -71269 -68642 -57389 -21599 -7108 -9082 -4603 11792 15041 12389 36082 40844
13492 40844 14729 -9372 -25387 -13693 -4813 -32400 -34457 -33579 -51921 -68681 -71185 -68553 -67253
13479 -67253 -41065 -22196 -25689 -24335 -16234 -16615 -820 662 23811 14417 -17930 -26627 -3233
$$ packed form
13569I251k0944q816L6266J4816l593j7919n098j083l509o415k5107j5409J5633
13556c1927K7116N864q392O071p114N016O004j208l7301R390M791j9068n015P44
13542d5029J7097J5538j3489l4826J013K6028Q422j4753k1551K4197J737R453
13530b6163j8351j7273R909J6128K009L6563K1509J2406p298q953j1238p141k6014
13517b3907j2587J5862K4704k7277j6805M557J5656M86l844J1168j2905j3784
13505c8676j4463j8130K627J1253L5790J4491j974M479J6395L249k652K3693M762
13492D0844k6115k4101j6015J1694Q880k7587k057Q78j8342j6760k504K632J300
13479f7253K6188J8869l493J354Q101l81J5795J482K3149r394l2347q697K3394
$$ plain form
13466 -3233 -3214 -7742 -11164 -8994 6530 10268 8500 1818 -4781 -16328 -24812 -2839 -1632 -19724
13452 -19724 -35541 -15665 -3123 584 -2742 -359 8197 -9742 -41954 -39762 -27727 -11662 2152
13439 2152 8610 13232 30220 27042 24017 3187 1473 -6537 -19331 -27393 -32334 -15434 -12135 -22801
13425 -22801 -43020 -38796 -13061 6808 6944 -2399 -11338 -9149 -18186 -24189 20030 42089 40948
13412 40948 17069 19572 4562 -19807 -21593 650 -12787 -20784 -10486 8982 11048 23403
13400 23403 10297 19003 15714 14340 11295 20876 21199 37820 44927 35307 44594 19192 2611 8148
13386 8148 24991 14274 16777 16713 -16503 -17769 4379 17171 12860 -5079 -9087 -15085 -12815 -9280
13372 -9280 -3585 27316 53643 30930 6244 -19073 -1611 11983 24287 55648 48416 945
$$ packed form
13466c233J9m528l422K170J5524L738j768o682o599j1547q484K1973J207j8092
13452a9724j5817J9876J2542L707l326K383Q556j7939l2212K192J2035J6065J3814
13439B152O458M622J6988l178l025k0830j714q010j2794q062m941J6900L299j0666
13425b2801k0219M224K5735J9869J36r343q939K189r037o003M4219K2059j141
13412D0948k3879K503j5010k4369j786K2243j3437p997J0298J9468K066J2355
13400B3403j3106Q706l289j374l045R581L23J6621P107r620R287k5402j6581N537
13386H148J6843j0717K503o4l3216j266K2148J2792m311j7939m008n998K270L535
13372i280N695L0901K6327k2713k4686k5317J7462J3594J2304L1361p232m7471
$$ plain form
13360 945 3176 -18525 -28182 7362 45696 53030 23667 13830 22810 51310 61076 51624 38866
13347 38866 14076 1585 4862 8636 3467 -4919 -3175 25260 29011 13483 14235 12970 41145
13334 41145 56434 38842 29879 40172 27629 9795 1229 -5351 -4697 30232 48724 42110 27321
13321 27321 450 9730 26735 10144 -5562 8468 18 -28048 -31358 -18586 4974 10827
13309 10827 -403 -8943 5429 5901 -10171 -1433 -9329 5767 37651 23075 27795 4698 -16059
13296 -16059 4995 22602 21266 20496 36858 47239 55110 79181 77933 72318 73451 96361 118822
13283 118822 149070 173831 211545 264513 363511 548948 850713 1213564 1609922 1976903
13273 1976903 2347097 2609936 2764388 2726072 2488503 2169136 1824517 1434374 1053268 756620
$$ packed form
13360I45K231k1701r657L5544L8334P334k9363r837Q980K8500R766r452j2758
13347C8866k4790j2491L277L774n169q386J744K8435L751j5528P52j265K8175
13334D1145J5289j7592q963J0293j2543j7834q566o580O54L4929J8492o614j4789
13321B7321k6871R280J7005j6591j5706J4030q450k8066l310J2772K3560N853
13309A0827j1230q540J4372M72j6072Q738p896J5096L1884j4576M720k3097k0757
13296a6059K1054J7607j336p70J6362J0381P871K4071j248n615J133K2910K2461
13283A18822L0248K4761L7714N2968R8998J85437L01765L62851L96358L66981
13273A976903L70194K62839J54452l8316k37569l19367l44619l90143l81106k96648
$$ plain form
13263 756620 555564 450215 363240 304660 261086 202441 137075 119969 119213 112567 92855 56784
13251 56784 53529 51083 44256 44961 56548 53204 42708 48610 47300 46596 49902 86488 110172 81160
13237 81160 46591 30988 31503 33758 20127 21182 17524 -4506 2818 -4017 -21105 -21006 -18608 -13143
13223 -13143 -24985 -29740 -20875 2464 499 8893 -588 -11825 1447 3341 7183 20559 32160
13210 32160 28452 21947 9556 -6943 -12703 5684 17276 6559 8392 33584 52327 48509 17883
13197 17883 -9328 16335 35386 27751 35608 42027 41730 56321 47334 39229 40665 26371 28227
13184 28227 27271 15189 16973 32558 26780 8640 8671 19707 38854 47520 23897 10832 17059
13171 17059 15006 22466 35883 46162 42072 41082 8822 -11977 -7573 3430 7067 4891 -3347
$$ packed form
13263G56620k01056j05349q6975n8580m3574n8645o5366j7106p56o646j9712l6071
13251E6784l255k446o827P05J1587l344j0496N902j310p04L306L6586K3684k9012
13237H1160l4569j5603N15K255j3631J055l658k2030P324o835j7088R9K398N465
13223a3143j1842m755Q865K3339j965Q394r481j1237J3272J894L842J3376J1601
13210C2160l708o505j2391j6499n760J8387J1592j0717J833K5192J8743l818l0626
13197A7883k7211K5663J9051p635P857O419k97J4591q987q105J436j4294J856
13184B8227r56j2082J784J5585n778j8140L1J1036J9147Q666k3623j3065O227
13171A7059k053P460J3417J0279m090r90l2260k0799M404J1003L637k176q238
$$ plain form
13158 -3347 -5452 -2015 7756 5871 -2134 3064 3004 7078 6756 15386 18607 14311 4891 16251 13022
13143 13022 18990 23201 23157 23293 18541 9099 5321 16406 -924 7656 26521 29208 29727 22370 32385
13128 32385 34923 37509 28988 12153 31725 46862 49295 48668 35616 46615 43168 5619 10937
13115 10937 31656 31969 36686 59020 85932 79771 37293 32696 58623 79611 87777 124140 188102
13102 188102 220147 257794 299212 307072 296946 313334 306065 262179 245123 219957 173429 130955
13090 130955 106585 92560 74195 43257 38880 37302 18810 -2993 -483 28624 28871 40886
13078 40886 20643 24332 34181 34217 25177 33531 41777 37505 53130 82340 70893 47412 62007
13065 62007 84966 85601 70599 53116 38933 27418 13953 32990 9866 17546 20385 10364
$$ packed form
13158c347k105L437R771j885q005N198o0M074l22Q630L221m296r420J1360l229
13143A3022N968M211m4J36m752r442l778J1085j7330Q580J8865K687N19p357J0015
13128C2385K538K586q521j6835J9572J5137K433o27j3052J0999l447l7549N318
13115A0937K0719L13M717K2334K6912o161m2478m597K5927K0988Q166L6363O3962
13102A88102L2045L7647M1418P860j0126J6388p269m3886j7056k5166m6528m2474
13090A30955k4370j4025j8365l0938m377j578j8492k1803K510K9107K47J2015
13078D0886k0243L689R849L6r040Q354Q246m272J5625K9210j1447k3481J4595
13065F2007K2959O35j5002j7483j4183j1515j3465J9037k3124P680K839j0021
$$ plain form
13053 10364 2723 -26 29252 23162 1476 8771 1452 -15222 -275 8408 -5399 -11118 32382
13040 32382 57989 92908 84913 65671 32010 9624 10024 23773 17521 30431 28287 -12502 -30703
13027 -30703 -33568 -29841 -30689 -36777 -51503 -20733 20488 47542 45133 16254 34240 44562 24484
13014 24484 18683 3131 4240 23134 71924 74525 45616 49639 68612 82964 97723 91945 104263
13001 104263 125401 128804 155849 166880 150258 157389 148838 136852 116911 122438 123546 117616 97303
12988 97303 82471 92259 94915 99576 115994 148638 173643 208241 238660 264406 305324 349944
12976 349944 409095 457908 510558 527130 512327 476762 439177 369602 311715 264362 229648
12965 229648 183495 152887 127595 119168 110453 97247 93933 76888 54929 56047 69649 75868
$$ packed form
13053A0364p641k749K9278o090k1686P295p319j6674J4947Q683j3807n719M3500
13040C2382K5607L4919p995j9242l3661k2386M00J3749o252J2910k144m0789j8201
13027c0703k865L727q48o088j4726L0770M1221K7054k409k8879J7986J0322k0078
13014B4484n801j5552J109J8894M8790K601k8909M023J8973J4352J4759n778J2318
13001A04263K1138L403K7045J1031j6622P131q551j1986j9941N527J108n930k0313
12988I7303j4832R788K656M661J6418L2644K5005L4598L0419K5746M0918M4620
12976C49944N9151M8813N2650J6572j4803l5565l7585o9575n7887m7353l4714
12965B29648m6153l0608k5292q427q715j3206l314j7045k1959J118J3602O219
$$ plain form
12953 75868 52409 56920 65045 62036 92002 116013 80741 83171 87654 47540 44714 47821 55996
12940 55996 67744 63434 51810 69184 105332 129785 159403 187168 222798 211627 228655 229576
12928 229576 252013 285080 278800 284074 269585 260650 276550 274399 269222 279447 307379 305578 300144
12915 300144 292953 301171 344236 374795 388207 383832 404169 451097 490107 477695 465410 471346
12903 471346 478651 467369 453522 495529 559883 581926 646641 709606 746891 790172 842392 889151
12891 889151 956619 1028048 1093882 1180174 1313274 1454046 1649396 1953765 2404632 2938901
12881 2938901 3493043 4075592 4652910 5159388 5554283 5803214 6009530 6299706 6573556
12872 6573556 6834599 7113709 7456320 7830460 8132704 8350900 8613106 9010126 9550083
$$ packed form
12953G5868k3459M511Q125l009K9966K4011l5272K430M483m0114k826L107Q175
12940E5996J1748m310j1624J7374L6148K4453K9618K7765L5630j1171J7028R21
12928B29576K2437L3067o280N274j4489q935J5900k151n177J0225K7932j801n434
12915C00144p191Q218M3065L0559J3412m375K0337M6928L9010j2412j2285N936
12903D71346P305j1282j3847M2007O4354K2043O4715O2965L7285M3281N2220M6759
12891H89151O7468P1429O5834Q6292J33100J40772J95350L04369M50867N34269
12881B938901N54142N82549N77318N06478L94895K48931K06316K90176K73850
12872F573556K61043K79110L42611L74140L02244K18196K62206L97020N39957
$$ plain form
12863 9550083 10312873 11391521 12899972 14970876 17717039 21252485 25777517 31873691
12855 31873691 40529392 53417824 73531846 106355058 158209220 225358475 297250720
12848 297250720 365197627 429246416 481874244 510241504 498398396 456764293 398970946
12841 398970946 336843031 268922072 201460242 144209257 105132936 80218274 63666784
12834 63666784 51948306 43200057 36487596 31245640 27079874 23712440 21048865 19029783
12826 19029783 17544887 16394429 15507370 14748871 14065951 13391254 12584631 11707285 10859184
12817 10859184 10135873 9542356 9015748 8565476 8259269 8039984 7797250 7374872 6822362
12808 6822362 6210440 5610388 4999681 4424704 3922843 3530977 3231729 2994229 2823448
$$ packed form
12863I550083P62790J078648J508451K070904K746163L535446M525032O096174
12855C1873691Q655701J2888432K0114022L2823212N1854162O7149255P1892245
12848B97250720O7946907O4048789N2627828K8367260j1843108m1634103n7793347
12841C98970946o2127915o7920959o7461830n7250985l9076321k4914662j6551490
12834F3666784j1718478q748249o712461n241956m165766l367434k663575k019082
12826A9029783j484896j150458q87059p58499o82920o74697q06623q77346q48101
12817A0859184p23311n93517n26608m50272l06207k19285k42734m22378n52510
12808F822362o11922o00052o10707n74977n01861l91866k99248k37500j70781
$$ plain form
12799 2823448 2654835 2526575 2403772 2265666 2138120 2055781 2008788 1959306 1889714 1827937
12789 1827937 1766030 1707183 1681248 1635103 1561444 1471864 1376158 1301099 1247056 1226519 1189558
12778 1189558 1145164 1113051 1115025 1108342 1094032 1053042 1019413 988666 951796 910189 884553 861057
12766 861057 845313 826816 803652 778983 757137 750366 739013 734558 738000 752318 768784 744779
12754 744779 737378 737205 730491 725730 721434 696938 700969 677634 663053 657383 634823 628654 626377
12741 626377 641560 635869 628846 605063 587559 570186 559841 541803 536359 516143 482901 467025
12729 467025 473399 448382 458429 478673 501587 530180 543219 553010 564896 538023 486395 447964
12717 447964 412177 364893 323089 298263 294951 286581 293369 309056 341708 362653 358223 375742
$$ packed form
12799B823448j68613j28260j22803j38106j27546q2339m6993m9482o9592o1777
12789A827937o1907n8847k5935m6145p3659q9580r5706p5059n4043k0537l6961
12778A189558m4394l2113J974o683j4310m0990l3629l0747l6870m1607k5636k3496
12766H61057j5744j8497k3164k4669k1846o771j1353m455L442J4318J6466k4005
12754G44779p401j73o714m761m296k4496M031k3335j4581n670k2560o169k277
12741F26377J5183n691p023k3783j7504j7373j0345j8038n444k0216l3242j5876
12729D67025O374k5017J0047K0244K2914K8593J3039R791J1886k6873n1628l8431
12717D47964l5787m7284m1804k4826l312q370O788J5687L2652K0945m430J7519
$$ plain form
12705 375742 397423 393024 388600 386514 394289 376592 353314 320674 295571 263399 238329 230185
12693 230185 237432 245941 261964 258439 257753 270062 271999 278070 297205 309196 328099 348431 360589
12680 360589 366189 349493 316628 289932 281565 283909 291960 278015 273047 279109 273870 255120 267115
12667 267115 294350 276883 291214 305840 309769 323777 354098 356497 337370 315416 311714 303892
12655 303892 299719 264762 246483 242756 240291 263561 268167 277184 275223 298642 281864 290066 295906
12642 295906 280080 272395 247672 223877 194391 193772 195125 218303 230661 224769 211218 188521
12630 188521 158098 159844 160942 157419 164137 171262 145828 121395 118789 126638 140629 145488 136464
12617 136464 137842 152131 162227 161421 139046 128813 139373 173288 181506 180474 199892 207509 198829
$$ packed form
12705C75742K1681m399m424k086P775j7697k3278l2640k5103l2172k5070q144
12693B30185P247Q509J6023l525o86J2309J937O071J9135J1991J8903K0332J2158
12680C60589N600j6696l2865k6696q367K344Q051j3945m968O062n239j8750J1995
12667B67115K7235j7467J4331J4626L929J4008L0321K399j9127k1954l702p822
12655C03892m173l4957j8279l727k465K3270M606R017j961K3419j6778Q202N840
12642B95906j5826p685k4723k3795k9486o19J353K3178J2358n892j3551k2697
12630A88521l0423J746J098l523O718P125k5434k4433k606P849J3991M859r024
12617A36464J378J4289J0096q06k2375j0233J0560L3915Q218j032J9418P617q680
$$ plain form
12604 198829 188411 181341 191121 175334 176937 206827 212391 188169 176162 188825 210359 225975
12592 225975 230821 218614 193290 187819 191067 192466 186310 174915 174807 169637 149491 128691 114146
12579 114146 118798 125604 161284 174488 163983 152020 162899 157543 140581 123594 114152 121715
12567 121715 130889 98504 67087 55176 67991 81731 103005 106704 117253 123645 113734 101333
12555 101333 81930 95220 111470 104041 99473 93262 101709 135269 154114 176932 174485 165134 150166
12542 150166 160791 156656 143766 141126 142980 135205 139860 164029 152645 137757 119444 115804 114607
12529 114607 148389 195856 233222 303453 386971 449187 471536 483043 471792 459766 420456
12518 420456 348313 254313 174033 134918 97671 86878 84227 68611 64275 65987 69019 74549
$$ packed form
12604A98829j0418p070R780j5787J603K9890N564k4222j2007J2663K1534J5616
12592B25975M846j2207k5324n471L248J399o156j1395j08n170k0146k0800j4545
12579A14146M652O806L5680J3204j0505j1963J0879n356j6962j6987r442P563
12567A21715R174l2385l1417j1911J2815J3740K1274L699J0549O392r911j2401
12555A01333j9403J3290J6250p429m568o211Q447L3560J8845K2818k447r351j4968
12542A50166J0625m135j2890k640J854p775M655K4169j1384j4888j8313l640j197
12529A14607L3782M7467L7366P0231Q3518O2216K2349J1507j1251j2026l9310
12518D20456p2143r4000q0280l9115l7247j0793k651j5616m336J712L032N530
$$ plain form
12506 74549 79252 89334 99079 96602 82957 55647 53455 64643 78449 83601 94686 88349 76170
12493 76170 84307 90468 99599 117850 146390 154509 139634 110226 89110 49528 31033 40261 55876
12480 55876 81541 89300 93630 99976 80914 92212 117277 128460 108930 88869 50028 14935
12468 14935 27335 50462 87432 90586 73693 66485 56561 64755 62753 72563 64095 50979 52018
12455 52018 75430 80205 69842 73524 68157 83354 97439 73314 77416 60408 49988 38256
12443 38256 22044 24922 47557 47420 43018 63462 86913 91730 79221 85288 102042 128258 132185
12430 132185 129911 147886 188407 204550 208675 215407 234498 279128 358112 481619 673785 1011749
12418 1011749 1392277 1776663 2124463 2446763 2711982 2832300 2716902 2475101 2183900
$$ packed form
12506G4549M703J0082R745k477j3645k7310k192J1188J3806N152J1085o337j2179
12493G6170Q137O161R131J8251K8540Q119j4875k9408k1116l9582j8495R228J5615
12480E5876K5665P759M330O346j9062J1298K5065J1183j9530k0061l8841l5093
12468A4935J2400K3127L6970L154j6893p208r924Q194k002R810q468j3116J039
12455E2018K3412M775j0363L682n367J5197J4085k4125M102j7008j0420j1732
12443C8256j6212K878K2635j37m402K0444K3451M817j2509O067J6754K6216L927
12430A32185k274J7975M0521J6143M125O732J9091M4630P8984J23507J92166L37964
12418A011749L80528L84386L47800L22300K65219J20318j15398k41801k91201
$$ plain form
12409 2183900 1849860 1482971 1095862 796486 605378 476586 395780 332237 284810 246757
12399 246757 198065 187477 193111 187188 167617 163627 162336 167341 166323 155817 146693 130037 104466
12386 104466 105679 91670 93576 103488 106558 138078 150687 138249 130155 114130 115789 117971 108291
12373 108291 99816 92970 82722 81891 87665 105265 91651 73344 61718 60977 48835 34511 27630
12360 27630 40852 68158 63508 73126 70916 75208 66873 67683 47981 26531 20583 43066 77744
12347 77744 69626 56005 48217 46376 37632 21066 28769 15914 23131 12533 1390 -2457 1434
12334 1434 29531 60970 66125 67287 67458 66711 69534 81938 80938 43385 27976 52513 55820 40629
12320 40629 13731 25279 26533 38873 38638 18037 6483 811 -8533 8328 26303 33782 41046
$$ packed form
12409B183900l34040l66889l87109k99376j91108j28792q0806o3543m7427l8053
12399B46757m8692j0588N634n923j9571l990j291N005j018j0506r124j6656k5571
12386A04466J213j4009J906R912L070L1520J2609j2438q094j6025J659K182r680
12373A08291q475o846j0248q31N774J7600j3614j8307j1626p41j2142j4324o881
12360B7630J3222K7306m650R618k210M292q335Q10j9702k1450n948K2483L4678
12347G7744q118j3621p788j841q744j6566P703j2855P217j0598j1143l847L891
12334A434K8097L1439N155J162J71p47K823J2404j000l7553j5409K4537L307j5191
12320D0629k6898J1548J254J2340k35k0601j1554n672r344J6861J7975P479P264
$$ plain form
12307 41046 59441 68904 66248 87136 83739 69485 71177 51418 35560 25347 33508 57039 57376
12294 57376 52204 48043 40300 20740 7805 16033 4821 -861 2472 8205 33118 18495 14246
12281 14246 8159 23891 28255 42739 57505 20476 12800 30617 18808 29477 40338 36391
12269 36391 35230 29991 25335 34680 56348 44997 15912 31812 22217 373 -18075 7818 9318
12256 9318 7587 12277 10805 33470 31913 26131 39553 31789 35191 23362 7130 -5497 6548
12243 6548 6171 -13613 -6729 -1077 -7754 11747 22924 42461 76447 97500 82763 47231 49992
12230 49992 79046 63287 39279 10256 6903 11751 13419 43357 30944 11863 22674 10936
12218 10936 17358 30485 44698 5778 11986 23833 26947 37229 17847 13605 23826 23681 26496
$$ packed form
12307D1046J8395R463k656K0888l397j4254J692j9759j5858j0213Q161K3531L37
12294E7376n172m161p743j9560j2935Q228j1212n682L333N733K4913j4623m249
12281A4246o087J5732M364J4484J4766l7029p676J7817j1809J0669J0861l947
12269C6391j161n239m656R345K1668j1351k9085J5900r595k1844j8448K5893J500
12256I318j731M690j472K2665j557n782J3422p764L402j1829j6232j2627J2045
12243F548l77j9784O884N652o677J9501J1177J9537L3986K1053j4737l5532K761
12230D9992K9054j5759k4008k9023l353M848J668K9938j2413j9081J0811j1738
12218A0936O422J3127J4213l8920O208J1847L114J0282j9382m242J0221j45K815
$$ plain form
12205 26496 37565 36614 40297 32136 28062 24930 19998 10062 16466 15605 -22342 -14550 -4699 4293
12191 4293 -3803 -622 -1682 -13254 -4709 19964 26202 28848 32411 27852 45269 51455 54891 58873
12177 58873 69842 52501 36124 34340 29927 40330 51443 47284 55643 46398 51231 59057 47007
12164 47007 23316 11397 22100 15661 5462 15853 10096 28577 59494 40551 40924 66346
12152 66346 58864 29943 9259 25429 35661 13292 3723 20359 27779 14233 16538 41521
12140 41521 41070 44091 37912 36528 25406 22213 16403 24863 35002 29858 36014 27354 22213 19349
12126 19349 17609 18593 40604 56183 53455 34574 35113 37811 68378 84274 92365 85563 82784 89971
12112 89971 96247 99616 118791 169939 244063 314298 426089 668969 1076141 1621360 1947471
$$ packed form
12205B6496J1069r51L683q161m074l132m932r936O404q61l7947P792R851Q992
12191D293q096L181j060j1572Q545K4673O238K646L563m559J7417O186L436L982
12177E8873J0969j7341j6377j784m413J0403J1113m159Q359r245M833P826j2050
12164D7007k3691j1919J0703o439j0199J0391n757J8481L0917j8943L73K5422
12152F6346p482k8921k0684J6170J0232k2369r569J6636P420j3546K305K4983
12140D1521m51L021o179j384j1122l193n810Q460J0139n144O156q660n141k864
12126A9349j740R84K2011J5579k728j8881N39K698L0567J5896Q091o802k779P187
12112H9971O276L369J9175N1148P4124P0235J11791K42880M07172N45219L26111
$$ plain form
12101 1947471 1848263 1482792 1059772 713465 494112 360471 296256 232780 181248 127320
12091 127320 119903 92703 72776 97108 101909 90691 76905 57702 31543 40669 41677 59276
12079 59276 57369 29691 14903 9125 24870 41659 21066 8871 18145 29958 30517 21009 34287
12066 34287 28054 24575 24839 39912 44886 23131 7681 19063 48256 63784 46610 27276 9539
12053 9539 4575 32953 44593 10796 4211 -13108 -19488 -1935 2654 24490 13177 888 5800
12040 5800 -21019 -9778 -19177 -23604 -2595 21251 35037 16965 24674 51189 46638 34895 45244
12027 45244 40828 46851 37419 28357 31770 56434 33401 17329 14602 23501 40107 55599 16774
12014 16774 -10820 -34916 -24904 -8252 -1308 -15420 -6250 -3126 1120 18982 40383 52590
$$ packed form
12101A947471r9208l65471m23020l46307k19353j33641o4215o3476n1532n3928
12091A27320p417k7200j9927K4332M801j1218j3786j9203k6159R126J008J7599
12079E9276j907k7678j4788n778J5745J6789k0593j2195R274J1813N59r508J3278
12066C4287o233l479K64J5073M974k1755j5450J1382K9193J5528j7174j9334j7737
12053I539m964K8378J1640l3797o585j7319o380J7553M589K1836j1313j2289M912
12040E800k6819J1241r399m427K1009K3846J3786j8072P709K6515m551j1743J0349
12027D5244m416O023r432r062L413K4664k3033j6072k727Q899J6606J5492l8825
12014A6774k7594k4096J0012J6652O944j4112R170L124M246J7862K1401J2207
$$ plain form
12002 52590 40940 13525 -1260 17201 38833 42817 35675 54495 59497 60397 30068 -18243 -6134
11989 -6134 4912 2514 4849 -3317 -6682 5539 10927 14499 32495 35632 24402 19035 18620 9957
11975 9957 3114 5405 6958 10683 -20361 -30373 -2600 -6407 -16426 693 -5701 -19435 -5582
11962 -5582 19351 36447 20144 14138 43526 55743 31572 13703 30101 14501 18519 8963
11950 8963 9086 -11232 -6339 24803 46382 33087 31311 29549 26063 24369 17713 37097 40708 48544
11936 48544 48369 23698 -14639 -22087 8302 37607 9005 -5451 14883 33527 39770 31221 19494
11923 19494 17351 26133 25742 6808 -8366 590 -819 1019 17049 15899 32500 27015 18106 30837
11909 30837 49456 39593 6443 -7163 -10435 -3922 17056 24680 20878 26687 18650 1103 -16737
$$ packed form
12002E2590j1650k7415j4785J8461K1632L984p142J8820N002R00l0329m8311J2109
11989f134J1046k398K335q166l365J2221N388L572J7996L137j1230n367m15q663
11975I957o843K291J553L725l1044j0012K7773l807j0019J7119o394j3734J3853
11962e582K4933J7096j6303o006K9388J2217k4171j7869J6398j5600M018r556
11950H963J23k0318M893L1142K1579j3295j776j762l486j694o656J9384L611P836
11936D8544j75k4671l8337p448L0389K9305k8602j4456K0334J8644O243q549j1727
11923A9494k143Q782l91j8934j5174Q956j409J838J6030j150J6601n485q909J2731
11909C0837J8619r863l3150j3606l272O513K0978P624l802N809q037j7547j7840
$$ plain form
11896 -16737 -26872 -2203 4301 11977 2673 -3366 -17281 -24960 -7900 10268 17225 14545 15801
11883 15801 33213 10186 -9243 -32829 -38211 -42994 -33874 -18238 9904 -5710 -19128 -11873
11871 -11873 -3599 948 7849 11383 15542 29135 42959 38954 20833 24640 28373 31576 18552
11858 18552 -14486 -7760 2665 -15943 -16201 6325 -349 10191 -6001 -12619 7764 1320 7887
11845 7887 19653 22020 4818 4954 7758 8371 -15363 -1783 -2054 -21989 -8588 -9390 3593 -383
11831 -383 25805 40807 33154 20660 397 12797 23321 39766 38344 29183 27546 26233 22729
11818 22729 13022 -5603 -23533 -24592 -30984 -22228 154 37270 24978 16852 7120 6805 10439
11805 10439 19401 35722 53851 46243 32135 16137 -5554 -26782 -8126 10929 181 -6955
$$ packed form
11896a6737j0135K4669O504P676r304o039j3915p679J7060J8168O957k680J256
11883A5801J7412k3027j9429k3586n382m783R120J5636K8142j5614j3418P255
11871a1873Q274M547O901L534M159J3593J3824m005j8121L807L733L203j3024
11858A8552l3038O726J0425j8608k58K2526o674J0540j6192o618K0383o444O567
11845G887J1766K367j7202J36K804O13k3734J3580k71j9935J3401q02J2983l976
11831c83K6188J5002p653j2494k0263J2400J0524J6445j422r161j637j313l504
11818B2729r707j8625j7930j059o392Q756K2382L7116j2292q126r732l15L634
11805A0439Q962J6321J8129p608j4108j5998k1691k1228J8656J9055j0748p136
$$ plain form
11793 -6955 -9597 -8098 -15201 -32697 -43122 -16563 5971 -12707 -29696 -11854 13950 51638
11781 51638 41374 16358 330 903 -16390 -18431 5767 20528 4148 1365 2675 -313 -3091
11768 -3091 -19106 -27789 -45821 -47243 -13832 -5964 -9189 -24624 -8073 -1682 3256 -16879 -33064
11755 -33064 -29281 -24408 -36875 -24277 -11363 -13009 -25638 -26469 -11687 -7476 -6239 2397 -238
11742 -238 16795 11727 15192 6621 -4126 -18463 -34353 -21223 -5719 2356 -3304 -13762 -22750
11729 -22750 -12354 28682 31548 7209 -15175 -32643 -49064 -30750 -34909 -36738 -19884 -5335
11717 -5335 14518 23277 18160 15151 32563 28154 1476 8439 29828 16950 13107 28303 22978
11704 22978 15577 30941 9138 2009 15952 20378 10520 34131 21816 16282 16438 20820 22614
$$ packed form
11793f955k642J499p103j7496j0425K6559K2534j8678j6989J7842K5804L7688
11781E1638j0264k5016j6028N73j7293k041K4198J4761j6380k783J310k988k778
11768c091j6015q683j8032j422L3411P868l225j5435J6551O391M938k0135j6185
11755c3064L783M873j2467J2598J2914j646j2629q31J4782M211J237Q636k635
11742b38J7033n068L465q571j0747j4337j5890J3130J5504Q075n660j0458q988
11729b2750J0396M1036K866k4339k2384j7468j6421J8314m159j829J6854J4549
11717e335J9853Q759n117l009J7412m409k6678O963K1389j2878l843J5196n325
11704B2978p401J5364k1803p129J3943M426r858K3611j2315n534J56M382J794
$$ plain form
11691 22614 27684 -483 -6442 -12149 -19689 -10045 -17810 -4656 -5793 -32428 -17848 -8592 -12411
11678 -12411 45 27705 26311 -2483 -27226 -36741 -36319 -30739 -10282 24271 13474 -22681 -48580
11665 -48580 -48840 -35132 -25863 -11331 -37514 -49217 -42342 -51862 -42296 -10103 14112 35077 36586
11652 36586 29550 14892 13740 6432 -1022 -12366 -10377 9813 16230 12115 34200 40076 24660
11639 24660 32793 7772 1597 21987 4575 9242 20445 37851 38905 25479 14180 -1746
11627 -1746 -5638 -815 -3184 -2451 14955 22031 6461 13140 37422 41785 23693 -7292 -37579
11614 -37579 -34456 -36832 -13955 44754 54808 24088 18235 9380 -1162 -8695 -8874 -14892 13034
11601 13034 29560 9199 14911 -18960 -23511 -5396 -2347 -19581 -26239 -3465 9428 -10801
$$ packed form
11691B2614N070k8167n959n707p540R644p765J3154j137k6635J4580R256l819
11678a2411J2456K7660j394k8794k4743r515M22N580K0457L4553j0797l6155k5899
11665d8580k60J3708R269J4532k6183j1703O875r520R566L2193K4215K0965J509
11652C6586p036j4658j152p308p454j1344J989K0190O417m115K2085N876j5416
11639B4660Q133k5021o175K0390j7412M667J1203J7406J054j3426j1299j5926
11627a746l892M823k369P33J7406P076j5570O679K4282M363j8092l0985l0287
11614c7579L123k376K2877N8709J0054l0720n853q855j0542p533j79o018K7926
11601A3034J6526k0361N712l3871m551J8115L049j7234o658K2774J2893k0229
$$ plain form
11589 -10801 -14278 2032 7846 1494 -4734 6378 21719 34744 33282 3642 -5011 -12856 -24045
11576 -24045 1127 15300 -1189 -4291 3687 -17447 -23843 -25571 -10077 -20484 -49641 -44802 -26849
11563 -26849 -5966 -11892 -599 14042 35162 26208 1597 -8028 -10007 15469 25778 13792
11551 13792 1899 -7304 10509 33997 25641 -12902 -34890 -37582 -30162 -9782 -7722 -9476 -3577
11538 -3577 -2654 11565 -1550 10860 8763 -17663 -4624 -48 1003 7671 35153 45514 25448
11525 25448 -2848 4341 -9212 7698 25739 29336 43177 28657 10100 44651 36073 24475
11513 24475 7163 -6268 4446 23308 12570 2415 10298 24403 20160 20675 27718 365 10744
11500 10744 17390 12121 6054 260 -10805 21385 21214 4437 20848 11060 12070 8365 32903
$$ packed form
11589a0801l477J6310N814o352o228J1112J5341J3025j462k9640q653p845j1189
11576b4045K5172J4173j6489l102P978k1134o396j728J5494j0407k9157M839J7953
11563b6849K0883n926J1293J4641K1120q954k4611r625j979K5476J0309j1986
11551A3792j1893r203J7813K3488q356l8543k1988k692P420K0380K060j754N899
11538c577R23J4219j3115J2410k097k6426J3039M576J051O668K7482J0361k0066
11525B5448k8296P189j3553J6910J8041L597J3841j4520j8557L4551q578j1598
11513B4475j7312j3431J0714J8862j0738j0155P883J4105m243N15P043k7353J0379
11500A0744O646n269o067n794j1065L2190j71j6777J6411r788J010l705K4538
$$ plain form
11487 32903 30110 11168 5999 -14527 -1492 11177 23412 47386 47658 36725 16950 -18484
11475 -18484 -17828 -478 -6902 5837 19384 41919 47382 32611 26876 18970 19278 15319 14331 14011
11461 14011 -15290 -34219 -35836 -25076 -14512 -741 -10641 -14488 -20530 9839 15575 10004 578
11448 578 5456 8939 12226 1955 -11787 -17613 -30579 -25484 2710 -11286 -56222 -71678 -66252
11435 -66252 -56983 -32967 -421 -3812 -13281 255 24861 -1773 -12411 -1046 17654 26717
11423 26717 34621 9760 -7323 -4908 -8481 -8323 2690 1819 -4094 2965 3136 2092 15939 3818
11409 3818 15957 9779 -19755 -24936 -11820 1864 6588 9590 28396 46039 10344 -565 7147
11396 7147 22610 12636 -9050 -17392 -12586 -4783 -2799 5645 606 8479 3255 14347 35064 5772
$$ packed form
11487C2903k793j8942n169k0526J3035J2669J2235K3974K72j0933j9775l5434
11475a8484O56J7350o424J2739J3547K2535N463j4771n735p906L08l959r88l20
11461A4011k9301j8929j617J0760J0564J3771r900l847o042L0369N736n571r426
11448E78M878L483L287j0271j3742n826j2966N095K8194j3996m4936j5456N426
11435f6252R269K4016L2546l391r469J3536K4606k6634j0638J1365J8700R063
11423B6717P904k4861j7083K415l573J58J1013q71n913P059J71j044J3847j2121
11409C818J2139o178k9534n181J3116J3684M724L002J8806J7643l5695j0909P712
11396G147J5463r974k1686q342M806P803J984Q444n039P873n224J1092K0717k9292
$$ plain form
11382 5772 -11630 -19586 -29806 -28339 -28068 -13393 7087 8032 26238 43249 26613 10548 12656
11369 12656 21417 19102 817 -21671 -49113 -63466 -55870 -18722 -14521 -9631 29928 47953 38712
11356 38712 5779 -16783 -16106 -11627 9261 13890 -7949 -16816 -15177 -16156 -22214 -45196 -43142 -30469
11342 -30469 -16936 -8655 8923 -18554 -29227 -41507 -33837 -16200 -4946 -7340 -8643 12823
11330 12823 7926 -3879 322 -11148 -19301 -3445 7207 6983 16840 28093 1371 -14655 -17652
11317 -17652 -10407 -2898 3738 11748 10258 4797 -12946 -3008 15005 11793 17039 15570 3681 8201
11303 8201 26992 22084 25377 1058 10353 15313 -5314 -29212 -44886 -59382 -38331 -25127 -17088
11290 -17088 7026 22683 26053 -5860 -26812 -4580 8134 12381 6374 18303 19585 6208
$$ packed form
11382E772j7402p956j0220J467K71J4675K0480R45J8206J7011j6636j6065K108
11369A2656Q761k315j8285k2488k7442j4353P596L7148M201M890L9559J8025r241
11356C8712l2933k2562O77M479K0888M629k1839q867J639r79o058k2982K054J2673
11342c0469J3533Q281J7578k7477j0673j2280P670J7637J1254k394j303K1466
11330A2823m897j1805M201j1470q153J5856J0652k24R857J1253k6722j6026k997
11317a7652P245P509O636Q010j490n461j7743R938J8013l212N246j469j1889M520
11303H201J8791m908L293k4319R295M960k0627k3898j5674j4496K1051J3204Q039
11290a7088K4114J5657L370l1913k0952K2232J2714M247o007J1929J282j3377
$$ plain form
11278 6208 -1025 2789 -24075 -27273 524 7817 -10973 -9065 -2961 2425 5487 6522 5242 1198
11264 1198 -19402 -10922 -7784 -8877 7143 8009 7321 635 5464 2349 -15841 -14943 4991 1874
11250 1874 -18525 -6864 3112 14936 5529 -9183 -8210 3558 18061 14732 8692 6607 -3131
11237 -3131 -6774 13750 32065 25688 -14330 -39877 -16645 17230 -4270 -32683 -22566 -22735 -18257
11224 -18257 12664 25105 19617 3732 -9098 -14336 701 15129 21262 22398 16114 18118 29404
11211 29404 26460 26670 53644 39386 22288 27798 21058 14990 45059 47489 17244 -7618 -20417
11198 -20417 -34103 -21285 -27302 -45497 -11242 23403 32444 23481 -841 4689 11229 22038 11355
11185 11355 -13990 -18683 -22435 -19948 -3308 15141 24959 -5276 -34993 -25826 -23665 14238 17639
$$ packed form
11278F208p233L814k6864l198K7797P293j8790J908O104N386L062J035j280m044
11264A198k0600Q480L138j093J6020Q66o88o686M829l115j8190Q98J9934l117
11250A874k0399J1661R976J1824r407j4712R73J1768J4503l329o040k085r738
11237c131l643K0524J8315o377m0018k5547K3232L3875k1500k8413J0117j69M478
11224a8257L0921J2441n488j5885j2830n238J5037J4428O133J136o284K004J1286
11211B9404k944K10K6974j4258j7098N510o740o068L0069K430l0245k4862j2799
11198b0417j3686J2818o017j8195L4255L4645R041q963k4322N530O540J0809j0683
11185A1355k5345m693l752K487J6640J8449R818l0235k9717R167K161L7903L401
$$ plain form
11172 17639 42571 34711 12010 11707 17269 11719 1653 11212 8883 7536 4642 -10389 -16734 -34063
11158 -34063 -10578 -16271 -18124 -511 -3549 -31918 -25552 -7749 -14160 -1901 -5632 484 -13728
11145 -13728 -4272 -920 730 -1734 598 -2894 -6119 7222 1205 -8410 -16826 -3348 -2776 -18033
11131 -18033 -5561 2104 -4963 -12894 -11485 7475 30467 31056 17918 5789 16103 5218 -14695
11118 -14695 -31649 -16183 -21 -5402 3640 7211 493 7593 1408 11076 9112 -4668 -8426
11105 -8426 22219 26620 21410 -5416 -7634 -16845 -21139 1201 6419 13373 8930 21787 42439
11092 42439 28226 18643 12800 -6805 -24586 -24563 -17051 -17815 -36426 -27254 -10333 -15553 -11736 -8450
11078 -8450 -31951 -24021 -9030 -16200 -17825 -14492 -20410 -37034 -43226 -16766 16781 13216 -865
$$ packed form
11172A7639K4932p860k2701l03N562n550j0066R559k329j347k894j5031o345j7329
11158c4063K3485n693j853J7613l038k8369O366J7803o411J2259l731O116j4212
11145a3728R456L352J650k464K332l492l225J3341o017r615q416J3478N72j5257
11131a8033J2472P665p067p931J409J8960K2992N89j3138j2129J0314j0885j9913
11118a4695j6954J5466J6162n381R042L571o718P100o185R668j964j3780l758
11105h426L0645M401n210k6826k218r211m294K2340N218O954m443J2857K0652
11092D2439j4213r583n843j9605j7781K3P512p64j8611R172J6921n220L817L286
11078h450k3501P930J4991p170j625L333n918j6624o192K6460L3547l565j4081
$$ plain form
11065 -865 -21869 -40801 -19135 -7797 -9333 -17884 -23099 -16117 -17810 -24270 -19376 -22572 -9958 -24348
11051 -24348 -16440 -23517 -19185 -3560 12151 -4131 -21070 -30162 -36415 -21108 4078 5243 12457
11038 12457 24257 14475 12741 40631 31359 41562 22550 11130 -8218 -11563 -4092 13622 23935
11025 23935 19048 11655 957 10189 9648 -20869 -1416 10268 9541 9732 1043 -10251 -15417 -12605
11011 -12605 -573 -15163 -8167 -11368 -22851 -19331 -4740 11221 3165 -7816 5425 12564 28685
10998 28685 28380 22051 20775 -1695 -7036 -15410 -10575 -13604 -21087 -25547 8726 15515 3333 -5086
10984 -5086 2629 35952 7748 14235 5305 -14327 -2577 -7239 4428 13976 31642 31880 26396
10971 26396 23922 15143 -6414 -16749 3972 7503 -15791 -29617 -20976 -3970 7505 2829 4309
$$ packed form
11065h65k1004j8932K1666J1338j536q551n215O982j693o460M894l196J2614j4390
11051b4348P908p077M332J5625J5711j6282j6939r092o253J5307K5186J165P214
11038A2457J1800r782j734K7890r272J0203j9012j1420j9348l345P471J7714J0313
11025B3935m887p393j0698R232n41l0517J9453J1684p27J91q689j1294n166K812
11011a2605J2032j4590O996l201j1483L520J4591J5961q056j0981J3241P139J6121
10998B8685l05o329j276k2470n341q374M835l029p483m460L4273O789j2182q419
10984e086P715L3323k8204O487q930j9632J1750m662J1667R548J7666K38n484
10971B6396k474q779k1557j0335K0721L531k3294j3826Q641J7006J1475m676J480
$$ plain form
10958 4309 1058 27004 33550 30163 25331 -17226 -6695 -13568 -102 15249 15616 -7852 -9375
10945 -9375 -2904 10496 7479 6271 17949 -7612 -7652 22643 14900 8892 -8764 -4549 5931 13596
10931 13596 13893 17910 16894 -10529 696 -5267 -36995 -52693 -16211 11098 12631 11528 11132
10918 11132 13594 12843 12294 22747 12831 14718 868 7442 -4132 -14120 -17925 4172 10131 12686
10904 12686 20464 34960 38036 22828 14127 -2260 -2829 12620 12634 -3159 -775 10293 3733 -2601
10890 -2601 1449 5605 5840 22685 16784 -693 29312 36178 24367 15587 24193 18389 -14290 -8378
10876 -8378 -13624 -10885 -3994 32957 11114 -11853 -16336 -23728 1146 15925 19232 35589 18189
10863 18189 1095 15377 33127 40199 36664 21094 -2240 9611 5978 26109 31443 12523
$$ packed form
10958D309l251K5946O546l387m832m2557J0531o873J3466J5351L67k3468j523
10945i375O471J3400l017j208J1678k5561m0L0295p743o008j7656M215J0480P665
10931A3596K97M017j016k7423J1225n963l1728j5698L6482K7309J533j103l96
10918A1132K462p51n49J0453r916J887j3850O574j1574r988l805K2097N959K555
10904A2686P778J4496L076j5208q701j6387n69J5449J4j5793K384J1068o560o334
10890b601M050M156K35J6845n901j7477L0005O866j1811q780Q606n804l2679N912
10876h378n246K739O891L6951k1843k2967m483p392K4874J4779L307J6357j7400
10863A8189j7094J4282J7750P072l535j5570k3334J1851l633K0131N334j8920
$$ plain form
10851 12523 8846 1810 -10917 -12467 -2253 -4788 -1865 11140 23396 28165 31648 26089 10857
10838 10857 -506 2410 8612 16045 22979 24586 27453 28706 49489 41642 17733 13093 24895
10825 24895 12250 20419 36007 21451 -2600 3567 33080 31905 29719 18174 17733 5124 -908
10812 -908 -1523 -20540 -20225 -19494 -9892 -14790 -23906 -366 1874 6519 4255 25971 36462 24823
10798 24823 30983 6604 -13415 4110 -19826 -5694 44 -12331 -12953 1099 322 -10871 -11430
10785 -11430 -10091 -19308 -12021 5689 27554 34912 11594 732 4425 -2101 17849 24123 16213
10772 16213 25027 15428 -7513 -10364 -5761 -12544 23559 28127 23123 32189 57525 40619 2704
10759 2704 -23981 -29646 -10861 3860 36482 42405 43633 35879 19753 25417 27564 48103 41858
$$ packed form
10851A2523l677p036j2727j550J0214k535K923J3005J2256M769L483n559j5232
10838A0857j1363K916O202P433O934J607K867J253K0783p847k3909m640J1802
10825B4895j2645Q169J5588j4556k4051O167K9513j175k186j1545m41j2609o032
10812i08o15j9017L15P31R602m898r116K3540K240M645k264K1716J0491j1639
10798B4823O160k4379k0019J7525k3936J4132N738j2375o22J4052p77j1193n59
10785a1430J339r217P287J7710K1865P358k3318j0862L693o526J9950O274p910
10772A6213Q814r599k2941k851M603o783L6103M568n004R066K5336j6906l7915
10759B704k6685n665J8785J4721L2622N923J228p754j6126N664K147K0539o245
$$ plain form
10746 41858 32873 22826 23854 25389 30537 58788 79131 72517 53040 5883 1234 5812 -26381
10733 -26381 -37457 -37554 -32122 -14700 -5959 6551 70 -12724 -23793 -36314 -28923 -31560 -39668
10720 -39668 -47388 -27899 -2178 8704 34353 51368 47515 21948 10605 -6581 -16291 -12573
10708 -12573 -32959 -38089 -50327 -48596 -36652 -19112 2412 2352 7032 -3558 -42193 -51915 -17381
10695 -17381 14820 17236 -25947 -43040 -29163 -34695 -37859 -19486 -10594 -17916 -24055 -12403 -6065
10682 -6065 7739 31133 59737 42761 37235 38898 49357 42870 43490 61204 49912 33260 22537
10669 22537 5993 25912 45460 47978 34712 35748 29639 40349 74236 71819 36398 14669
10657 14669 8160 21656 25574 21722 27881 14341 37531 35820 18337 9843 -7745 3550 43197
$$ packed form
10746D1858q985j0047J028J535N148K8251K0343o614j9477m7157m649M578l2193
10733b6381j1076r7N432J7422Q741J2510o481j2794j1069j2521P391k637q108
10720c9668p720J9489K5721J0882K5649J7015l853k5567j1343j7186r710L718
10708a2573k0386n130j2238J731J1944J7540K1524o0M680j0590l8635r722L4534
10695a7381L2201K416m3183j7093J3877n532l164J8373Q892p322o139J1652O338
10682f065J3804K3394K8604j6976n526J663J0459o487O20J7714j1292j6652j0723
10669B2537j6544J9919J9548K518j3266J036o109J0710L3887k417l5421k1729
10657A4669o509J3496L918l852O159j3540K3190j711j7483q494j7588J1295L9647
$$ plain form
10644 43197 43557 53923 77602 89959 79670 74964 101846 149386 143481 154914 154387 150662 140590
10631 140590 106941 109941 98301 56462 59676 65196 63246 59434 31997 6027 16828 32458
10619 32458 25815 -2209 -5086 -3872 -17258 5783 13322 -3214 3721 15282 -8444 9956 43388
10606 43388 30560 30830 24292 16467 32505 42484 34585 44019 38821 40077 31405 42363 44994 25867
10592 25867 20812 12167 -2035 -5949 -20022 -27204 -13381 -15717 -20409 -25324 -41045 -25134 -6221
10579 -6221 -4748 -3824 -33814 -28155 8263 32570 19007 -3801 788 -13891 -5128 -4313 -27716
10566 -27716 -17495 299 14257 2762 -14904 -33174 -31245 -711 6210 -7152 14367 50936
10554 50936 38321 22266 44833 29233 22292 16712 16687 -23417 -31907 -28207 -26131 -35647 -27343 -12585
$$ packed form
10644D3197L60J0366K3679J2357j0289m706K6882M7540n905J1433n27l725j0072
10631A40590l3649L000j1640m1839L214N520j950l812k7437k5970J0801J5630
10619C2458o643k8024k877J214j3386K3041P539j6536O935J1561k3726J8400L3432
10606D3388j2828K70o538p825J6038R979p899R434n198J256q672J0958K631j9127
10592B5867n055q645j4202l914j4073p182J3823k336m692m915j5721J5911J8913
10579f221J473R24k9990N659L6418K4307j3563k2808M589j4679Q763Q15k3403
10566b7716J0221J7794J3958j1495j7666j8270J929L0534O921j3362K1519L6569
10554E0936j2615j6055K2567j5600o941n580k5m0104q490L700K076r516Q304J4758
$$ plain form
10540 -12585 -4979 -21672 -16844 -2482 19684 41512 48107 60906 70244 70607 50442 22899 1304
10527 1304 -9607 -6240 -11652 -24649 -23859 -12376 -19170 -37409 -27622 -21455 -30876 -28021 -5034 5264
10513 5264 19822 22586 9619 -5505 7683 2876 -6887 -38643 -36169 -24212 -28743 -27918 -19844
10500 -19844 1336 16212 44136 36708 17385 23863 34538 46113 51295 71448 55900 31660
10488 31660 48051 25867 24333 3884 -13513 -20399 -16964 -21066 -22744 -8336 -8419 -14221 -20703 -10465
10474 -10465 -4235 -19094 -32678 -13521 -658 10507 28384 11145 15304 22451 16631 19708 20444
10461 20444 5712 -8003 -10670 -18637 -31293 -17232 -79 18005 42253 25196 -6402 -13728
10449 -13728 188 -1396 6056 -23 -13682 -5987 32642 37503 12326 -8868 -12614 -17418 -15701
$$ packed form
10540a2585P606j6693M828J4362K2166K1828O595J2799R338L63k0165k7543k1595
10527A304j0911L367n412j2997P90J1483o794j8239R787O167r421K855K2987J0298
10513E264J4558K764j2967j5124J3188m807r763l1756K474J1957m531Q25Q074
10500a9844K1180J4876K7924p428j9323O478J0675J1575N182K0153j5548k4240
10488C1660J6391k2184j534k0449j7397o886L435m102j678J4408q3n802o482J0238
10474a0465O230j4859j3584J9157J2863J1165J7877j7239M159P147n820L077P36
10461B0444j4732j3715k667p967j2656J4061J7153J8084K4248j7057l1598p326
10449a3728J3916j584P452o079j3659P695L8629M861k5177k1194l746m804J717
$$ plain form
10436 -15701 -7883 6183 1797 -10148 -1059 -6419 2824 7435 -14282 -25125 -41447 -43210 -19741
10423 -19741 5553 16072 19431 14423 33986 40813 32812 18381 13545 -4556 -2606 12293 19544
10410 19544 3952 -11883 -3996 9697 19124 38210 34172 32150 19123 11181 6020 5766 36403
10397 36403 30624 1782 -12517 -9049 510 3869 -2791 22937 29078 25065 30537 13583 14331 24526
10383 24526 36365 31103 28638 -10385 -19871 -17492 -1185 2923 23187 24840 13246 27746 23784
10370 23784 -2543 -12302 -9847 -25728 -28059 -9179 -12738 -21976 8 2570 -15386 -28514 -18758
10357 -18758 -29178 -12140 -20310 -12941 3327 8868 20782 16082 8569 -5971 -10386 -6555 -21212
10344 -21212 -10883 8253 -7548 -29571 -40146 -20981 -26413 -29771 -10946 1399 5992 -11997
$$ packed form
10436a5701P818J4066m386j1945R089n360R243M611k1717j0843j6322j763K3469
10423a9741K5294J0519L359n008J9563O827q001j4431m836j8101J950J4899P251
10410A9544j5592j5835P887J3693R427J9086m038k022j3027p942n161k54L0637
10397C6403n779k8842j4299L468R559L359o660K5728O141m013N472j6954P48J0195
10383B4526J1839n262k465l9023r486K379J6307M108K0264J653j1594J4500l962
10370B3784k6327r759K455j5881k331J8880l559r238K1984K562j7956j3128R756
10357a8758j0420J7038q170P369J6268N541J1914m700p513j4540m415L831j4657
10344b1212J0329J9136j5801k2023j0575J9165n432l358J8825J2345M593j7989
$$ plain form
10332 -11997 1920 28818 20852 5292 7258 -9293 6559 13652 20426 24698 33115 22091 4007
10319 4007 834 24569 39480 31465 -5261 -25576 -36163 -39164 -34031 -35799 -26203 -28905 -31951
10306 -31951 -3241 -10306 -27394 -44419 -31153 -18346 -4930 5277 13259 -2248 -7373 -18149
10294 -18149 -15541 -15166 -14383 -17511 -26743 1798 31250 34450 17662 5184 4199 15426 -4563 -15663
10280 -15663 845 15217 9399 16224 28227 17046 -5340 -760 -6618 -4229 5262 13765 15352
10267 15352 1381 -21894 -21728 -32736 -20255 -4347 2958 2973 -4121 -14764 9943 1067 -11768
10254 -11768 -25595 -18353 -6998 -314 23096 37075 33217 19844 -8656 -31997 -28527 -22645 3855
10241 3855 -7764 -30079 -31558 -31073 -20943 -1163 22166 35238 28293 2673 21174 26926 14756
$$ packed form
10332a1997J3917K6898p966j5560J966j6551J5852P093O774M272Q417j1024j8084
10319D007l173K3735J4911q015l6726k0315j0587l001N133j768R596k702l046
10306c1951K8710p065j7088j7025J3266J2807J3416J0207P982j5507n125j0776
10294a8149K608L75P83l128r232K8541K9452L200j6788j2478r85J1227j9989j1100
10280a5663J6508J4372n818O825J2003j1181k2386M580n858K389R491Q503J587
10267A5352j3971k3275J66j1008J2481J5908P305J5p094j0643K4707q876j2835
10254a1768j3827P242J1355O684K3410J3979l858j3373k8500k3341L470N882K6500
10241C855j1619k2315j479M85J0130J9780K3329J3072o945k5620J8501N752j2170
$$ plain form
10228 14756 17957 31222 61266 61531 44402 37750 57229 64950 36715 12572 -9014 -7482 6657
10215 6657 22941 23623 29901 10459 3 23415 28167 7968 -23978 -41727 -39973 -15483 -4106
10202 -4106 -3985 -2966 -4000 -9760 4829 12862 -2527 7834 22618 9545 -1417 30673 54384
10189 54384 59718 53190 27593 16067 30338 51561 63728 42392 22134 10517 17090 23372
10177 23372 -15329 -35447 -41658 -26151 -3639 15521 20213 15987 11983 1156 2005 16357 22581
10164 22581 23119 14338 20202 26278 17187 11765 13583 41436 30544 13554 -936 14864 36127
10151 36127 29667 19929 7503 -2737 7658 38288 43698 39311 22103 20358 25360 15625 -17575
10138 -17575 2548 21656 21769 49599 49001 10378 -3322 16250 12899 -8835 6819 24344 17452
$$ packed form
10228A4756L201J3265L0044K65j7129o652J9479P721k8235k4143k1586J532J4139
10215F657J6284O82O278j9442j0456K3412M752k0199l1946j7749J754K4490J1377
10202d106J21J019j034n760J4589Q033j5389J0361J4784j3073j0962L2090K3711
10189E4384N334o528k5597j1526J4271K1223J2167k1336k0258j1617O573O282
10177B3372l8701k0118o211J5507K2512J9160M692m226m004j0827Q49J4352O224
10164B2581N38q781N864O076r091n422J818K7853j0892j6990j4490J5800K1263
10151C6127o460r738j2426j0240J0395L0630N410m387j7208j745N002r735l3200
10138a7575K0123J9108J13K7830n98l8623j3700J9572l351k1734J5654J7525o892
$$ plain form
10125 17452 18360 13275 29266 37410 28461 19054 41525 50901 21853 8440 -1619 19816 53415
10112 53415 71585 66107 58730 49709 31291 30541 30972 30960 34315 29423 22914 858 -4769 13616
10098 13616 26832 6496 13246 32823 32608 12656 -2886 18642 49767 23548 8588 14231
10086 14231 36065 45397 70964 73860 43987 15070 19556 26855 20072 24612 29443 29284 26285 16660
10072 16660 -3702 -1589 11864 24500 16959 31602 16649 13734 18710 4246 1681 -9112 -22583
10059 -22583 -15830 19345 24642 30942 31883 34000 47256 61407 71143 49329 51512 46837 23376
10046 23376 18800 33580 6593 12942 23402 52450 86466 94011 81127 70468 60343 37873
10034 37873 25513 28024 24370 20022 36476 40301 37618 56064 64937 75323 88143 71575 61512
$$ packed form
10125A7452R08n085J5991Q144q949r407K2471R376k9048j3413j0059K1435L3599
10112E3415J8170n478p377r021j8418p50M31j2L355m892o509k2056n627J8385
10098A3616J3216k0336O750J9577k15j9952j5542K1528L1125k6219j4960N643
10086A4231K1834R332K5567K896k9873k8917M486P299o783M540M831j59k999r625
10072A6660k0362K113J3453J2636p541J4643j4953k915M976j4464k565j0793j3471
10059b2583O753L5175N297O300R41K117J3256J4151R736k1814K183m675k3461
10046B3376m576J4780k6987O349J0460K9048L4016P545j2884j0659j0125k2470
10034C7873j2360K511l654m348J6454L825k683J8446Q873J0386J2820j6568j0063
$$ plain form
10021 61512 47788 33105 31483 29045 31128 37076 23230 20382 32003 29305 9551 -16226 -22893
10008 -22893 1608 37770 62381 64362 58160 22533 14380 32741 41928 28689 10037 2990 -6787
9995 -6787 11824 23287 17176 8466 12056 21569 47689 26921 42133 43154 71848 87039 71005
9982 71005 75516 81791 82897 78554 78387 81517 65424 21360 13655 41353 44312 43045 57190 83547
9968 83547 70066 23450 12872 50008 65482 56429 57259 45432 24773 18803 24606 20502 29221
9955 29221 44108 44801 27628 41016 44930 648 -24241 -23132 -24036 17917 38652 51140 81347
9942 81347 81285 85744 71863 44990 8793 22875 27983 20777 11350 21290 32214 55149 54321 69597
9928 69597 74084 70454 85846 80820 62533 50197 53591 71580 75293 51867 20856 8748 2181
$$ packed form
10021F1512j3724j4683j622k438K083N948j3846k848J1621k698j9754k5777o667
10008b2893K4501L6162K4611J981o202l5627q153J8361R187j3239j8652p047r777
9995f787J8611J1463o111q710L590R513K6120k0768J5212J021K8694J5191j6034
9982G1005M511O275J106m343j67L130j6093m4064p705K7698K959j267J4145K6357
9968H3547j3481m6616j0578L7136J5474r053Q30j1827k0659n970N803m104Q719
9955B9221J4887O93j7173J3388L914m4282k4889J109r04M1953K0735J2488L0207
9942H1347o2M459j3881k6873l6197J4082N108p206r427R940J0924K2935q28J5276
9928F9597M487l630J5392n026j8287j2336L394J7989L713k3426l1011j2108o567
$$ plain form
9915 2181 11295 25005 39787 55874 77747 76932 60863 49509 62855 83009 107438 127266 119060
9902 119060 113511 97179 104338 107189 83262 93065 116382 103996 101402 113309 91291 68513 68143
9889 68143 77987 94973 117863 106526 83322 72621 61314 47251 50799 75540 109750 112345
9877 112345 113589 111264 127799 124218 105209 92336 83309 94859 89846 106989 116428 125980 102638
9864 102638 98713 75189 95388 111189 102716 99076 119564 123015 100255 90375 82156 84149 92469
9851 92469 101832 118608 100916 120876 95663 80317 58157 67430 91364 116566 93784 84040
9839 84040 95923 115530 144446 149960 134842 133804 127039 141866 145726 143949 147453 125650 117616
9826 117616 113316 107765 98494 109157 91386 93671 120266 146489 166343 168527 126532 113233 108971
$$ packed form
9915B181R114J3710J4782J6087K1873q15j6069j1354J3346K0154K4429J9828q206
9902A19060n549j6332P159K851k3927R803K3317j2386k594J1907k2018k2778l70
9889F8143R844J6986K2890j1337k3204j0701j1307j4063L548K4741L4210K595
9877A12345J244k325J6535l581j9009j2873r027J1550n013J7143R439R552k3342
9864A02638l925k3524K0199J5801q473l640K0488L451k2760r880q219J993Q320
9851I2469R363J6776j7692J9960k5213j5346k2160R273K3934K5202k2782r744
9839H4040J1883J9607K8916N514j5118j038o765J4827L860j777L504k1803q034
9826A17616m300n551r271J0663j7771K285K6595K6223J9854K184m1995j3299m262
$$ plain form
9813 108971 118885 161609 188441 178554 161935 153505 158000 151283 132244 162481 184612 189202 164913
9800 164913 143410 164151 159492 174549 191651 187640 191916 182416 189414 180984 185578 210566 199563
9787 199563 181563 184486 185545 172584 151419 162953 178169 181599 176512 164596 161998 159224 175734
9774 175734 183459 202332 219363 220488 228614 244452 272223 284777 260949 238671 217917 226045
9762 226045 256407 278524 278231 274006 265548 262530 251775 215315 185486 216861 241092 236740 228890
9749 228890 266809 301671 323014 331177 331930 308247 285217 267667 260953 280654 283048 277999 297106
9736 297106 331497 331510 341003 323493 304707 295580 300810 284169 288307 305258 324334 357982 389532
9723 389532 381979 360471 336197 351113 351804 340192 325947 326803 332804 357062 396466 394085 397739
$$ packed form
9813A08971R914M2724K6832r887j6619q430M495o717j9039L0237K2131M590k4289
9800A64913k1503K0741m659J5057J7102m011M276r500O998q430M594K4988j1003
9787A99563j8000K923J059j2961k1165J1534J5216L430n087j1916k598k774J6510
9774A75734P725J8873J7031J125Q126J5838K7771J2554k3828k2278k0754Q128
9762B26045L0362K2117k93m225q458l018j0755l6460k9829L1375K4231m352p850
9749B28890L7919L4862K1343Q163P53k3683k3030j7550o714J9701K394n049J9107
9736B97106L4391J3R493j7510j8786r127N230j6641M138J6951J9076L3648L1550
9723C89532p553k1508k4274J4916O91j1612j4245Q56O001K4258L9404k381L654
$$ plain form
9710 397739 391155 375001 364531 419294 452963 469999 458519 450951 471229 473710 448192 454601
9698 454601 464292 486644 488145 491538 491025 488830 490770 489239 484349 469740 486230 519403 540195
9685 540195 560562 543445 522746 529412 544915 534956 543400 555772 566637 569699 596454 604162 612052
9672 612052 608276 598081 591713 609184 626821 646277 651910 654175 676082 671226 652936 654449 663745
9659 663745 657338 659497 686647 702952 690789 687108 684021 674558 650904 647266 651242 671409 667764
9646 667764 674694 710780 720667 694643 717373 744893 756968 753749 755490 762952 755512 743219 751121
9633 751121 768674 770031 789505 791654 789297 758609 740589 729367 717372 727542 753469 781985
9621 781985 760567 760053 761055 759410 764658 765937 768441 761503 762436 756114 733648 742134 782378 781616
$$ packed form
9710C97739o584j6154j0470N4763L3669J7036j1480p568K0278K481k5518O409
9698D54601R691K2352J501L393n13k195J940j531m890j4609J6490L3173K0792
9685E40195K0367j7117k0699O666J5503r959Q444J2372J0865L062K6755P708P890
9672F12052l776j0195o368J7471J7637J9456N633K265K1907m856j8290J513R296
9659F63745o407K159K7150J6305j2163l681l087r463k3654l638L976K0167l645
9646F67764O930L6086R887k6024K2730K7520J2075l219J741P462p440j2293P902
9633G51121J7553J357J9474K149k357l0688j8020j1222j1995J0170K5927K8516
9621G81985k1418n14J002j645N248J279K504o938R33o322k2466Q486M0244p62
$$ plain form
9607 781616 752519 740852 754347 747733 740796 733586 711153 722228 726478 739566 752204 750013 748803
9594 748803 737631 735998 718598 715313 717114 738297 745679 709523 692334 687753 685921 680301 660555
9581 660555 627055 604505 597344 596799 586954 614215 631275 624559 632393 621081 606203 606802 627926
9568 627926 618010 608092 594129 568926 563242 554025 568517 571074 569798 554866 530254 503789 533303
9555 533303 533622 529157 531009 520547 500810 500359 522742 524338 523374 517336 508860 489538 485748 482844
9541 482844 475423 469281 463009 434546 439339 438072 439057 440726 420413 403684 413781 422121 410686
9528 410686 399766 396176 375731 377450 388489 401276 384669 380361 376497 384247 366624 351317 347053
9515 347053 347235 338281 331263 338904 362174 355894 320831 326396 334841 316074 318331 317231 302099 272115
$$ packed form
9607G81616k9097j1667J3495o614o937p210k2433J1075M250J3088J2638k191j210
9594G48803j1172j633j7400l285J801K1183P382l6156j7189m581j832n620j9746
9581F60555l3500k2550p161n45r845K7261J7060o716P834j1312j4878N99K1124
9568F27926r916r918j3963k5203n684r217J4492K557j276j4932k4612k6465K9514
9555E33303L19m465J852j0462j9737m51K2383J596r64o038q476j9322l790k904
9541D82844p421o142o272k8463M793j267R85J669k0313j6729J0097Q340j1435
9528D10686j0920l590k0445J719J1039J2787j6607m308l864P750j7623j5307m264
9515C47053J82q954p018P641K3270o280l5063N565Q445j8767K257j100j5132k9984
$$ plain form
9501 272115 256526 276892 311475 311783 298988 305652 305294 301299 284185 270763 278390 274749 261493
9488 261493 266922 257463 245258 242634 264150 250164 243297 224614 219590 207562 229172 263172 239025
9475 239025 219152 237269 251244 258631 254647 260374 253128 238850 201392 183960 173913 189101
9463 189101 203134 221547 221789 218233 210575 191889 179912 175539 173568 182735 183206 171896 172421 163832
9449 163832 149079 153702 159997 158196 162120 162098 127245 139656 156608 132699 117002 112071 115160
9436 115160 120824 128145 133239 160358 165935 132524 139793 144744 146199 145405 158551 165630 160147 152131
9422 152131 164233 166939 147278 151550 159084 160821 163550 139508 118547 93932 121162 130502 140067
9409 140067 165304 157749 137275 131704 130045 139684 134933 149847 142933 140764 133867 119319 104307
$$ packed form
9501B72115j5589K0366L4583L08j2795O664l58l995j7114j3422P627l641j3256
9488B61493N429r459j2205k624K1516j3986o867j8683n024j2028K1610L4000k4147
9475B39025j9873J8117J3975P387l984N727p246j4278l7458j7432j0047J5188
9463A89101J4033J8413K42l556p658j8686j1977m373j971R167M71j1310N25q589
9449A63832j4753M623O295j801L924k2l4853J2411J6952k3909j5697m931L089
9436A15160N664P321N094K7119N577l3411P269M951J455p94J3146P079n483q016
9422A52131J2102K706j9661M272P534J737K729k4042k0961k4615K7230R340R565
9409A40067K5237p555k0474n571j659R639m751J4914o914k169o897j4548j5012
$$ plain form
9396 104307 112785 98192 77548 80282 80860 74715 56567 81531 75672 88671 78020 85481 73068
9383 73068 69784 57409 69319 83437 104777 102328 103645 106145 112512 121744 109483 98547 70962
9370 70962 74658 55138 64234 89284 78684 79684 86478 89752 66578 59351 76028 101404 92367
9357 92367 93833 89128 79428 88230 115786 96761 75121 73608 120224 107627 74577 83241 90110
9344 90110 82998 85205 68861 60966 54153 62438 66427 77180 57168 61143 56294 74391 71804 48001
9330 48001 48414 46896 40793 35876 53547 55670 58781 55757 70497 61630 49532 75690 97335 82961
9316 82961 72741 76964 87486 58005 62245 43618 51753 82424 66725 64309 51263 62567 87932
9303 87932 91690 99913 94798 81743 67701 63321 59517 57031 57313 47220 42459 35374 9113 25284
$$ packed form
9396A04307Q478j4593k0644K734N78o145j8148K4964n859J2999j0651P461j2413
9383G3068l284j2375J1910J4118K1340k449J317K500O367R232j2261j0936k7585
9370G0962L696j9520R096K5050j0600J000O794L274k3174p227J6677K5376r037
9357I2367J466m705r700Q802K7556j9025k1640j513M6616j2597l3050Q664O869
9344I0110p112K207j6344p895o813Q285L989J0753k0012L975m849J8097k587k3803
9330D8001M13j518o103m917J7671K123L111l024J4740q867j2098K6158K1645j4374
9316H2961j0220M223J0522k9481M240j8627Q135L0671j5699k416j3046J1304K5365
9303H7932L758Q223n115j3055j4042m380l804k486K82j0093m761p085k6261J6171
$$ plain form
9289 25284 53543 47325 77745 88045 61579 61718 31028 29215 54871 58696 53871 43992 35904
9276 35904 28181 31410 37544 40775 46262 61260 58250 52460 46323 36605 42421 52549 57583 45260
9262 45260 50275 42197 58407 56644 14410 16598 31439 51460 41944 16149 -15883 -14996 14080
9249 14080 37694 52878 52658 63712 29933 5165 25697 32748 37399 17649 -2411 -11844 -4990
9236 -4990 3972 11244 23381 55772 70415 38245 34933 52162 35354 25590 8631 2521 -6590
9223 -6590 -14266 -8759 14807 37416 39994 24807 23913 29233 39796 59974 26235 31323 41192 26607
9209 26607 18394 11328 12849 -6171 -22296 842 20350 37143 50115 53243 87695 84896 54296
9196 54296 54141 50275 43798 59695 43758 25117 7383 20024 28029 33532 22181 3720 13655
$$ packed form
9289B5284K8259o218L0420J0300k6466J39l0690j813K5656L825m825r879q088
9276C5904p723L229O134L231N487J4998l010n790o137r718N816J0128N034j2323
9262D5260N015q078J6210j763m2234K188J4841K0021r516k5795l2032Q87K9076
9249A4080K3614J5184k20J1054l3779k4768K0532P051M651j9750k0060r433O854
9236d990Q962P272J2137L2391J4643l2170l312J7229j6808r764j6959o110r111
9223f590p676N507K3566K2609K578j5187q94N320J0563K0178l3739N088R869j4585
9209B6607q213p066J521j9020j6125K3138J9508J6793J2972L128L4452k799l0600
9196E4296j55l866o477J5897j5937j8641j7734J2641Q005N503j1351j8461R935
$$ plain form
9183 13655 14583 10850 277 16304 49540 67250 41747 32334 30421 22486 9373 -8536 -20296
9170 -20296 -24480 -1667 18681 33115 18929 25484 66750 67753 39367 37733 26914 3947 12051
9157 12051 11009 22534 34203 59232 62186 42459 26159 33960 35180 26690 -13178 -14233 -8740
9144 -8740 -3101 4426 14064 7023 2382 2289 11392 -1136 8279 37707 58057 45440 38179 38738 52783
9129 52783 59524 57508 81356 104050 91195 106406 105709 105074 59738 19061 31057 42077 14074
9116 14074 -15471 -13222 -12112 -16266 -8607 -784 14915 31423 13253 -2032 -27446 -21717 -5443
9103 -5443 -11251 -31408 -40968 -30612 -5885 -886 -11740 -14493 1241 3453 23816 23732 3767 14267
9089 14267 19705 21101 45667 19415 -15474 12381 32925 26047 25985 28406 20463 10190 25980
$$ packed form
9183A3655R28l733j0573J6027L3236J7710k5503r413j913p935j3113j7909j1760
9170b0296m184K2813K0348J4434j4186O555M1266J003k8386j634j0819k2967Q104
9157A2051j042J1525J1669K5029K954j9727j6300P801J220q490l9868j055N493
9144h740N639P527R638p041m641r3R103j2528R415K9428K0350j2617p261N59J4045
9129E2783O741k016K3848K2694j2855J5211o97o35m5336m0677J1996J1020k8003
9116A4074k9545K249J110m154P659P823J5699J6508j8170j5285k5414N729J6274
9103e443n808k0157r560J0356K4727M999j0854k753J5734K212K0363q4j9965J0500
9089A4267N438J396K4566k6252l4889K7855K0544o878o2K421p943j0273J5790
$$ plain form
9076 25980 43388 48272 38082 30561 40590 45938 46159 45591 24351 21575 17628 -15785 -37251 -8603
9062 -8603 7454 110 3083 2975 -1177 -30214 -40458 -48601 -45275 5503 28279 19628 7212 -5240
9048 -5240 -4485 -1002 20313 2415 -9253 137 -5609 -14346 -20556 -6883 4679 -18082 -20709 -9331
9034 -9331 -12738 -24665 -23544 -16016 -10088 -11645 7346 41220 40576 33044 47360 43978 36443 24743
9020 24743 27828 38648 33862 27000 1002 -15924 -10203 11261 25003 19388 3370 11552 31135
9007 31135 44440 45254 22225 7270 -4103 -6209 -10218 -30713 -18213 -2885 16159 24842 26337
8994 26337 29441 20958 -627 3194 19493 25188 -5176 -15833 -3710 7272 15853 -3360 -13159
8981 -13159 1864 22131 33875 26959 4782 7862 29096 37044 23807 21409 27410 37156 31436
$$ packed form
9076B5980J7408M884j0190p521J0029N348K21n68k1240k776l947l3413k1466K8648
9062h603J6057p344K973j08m152k9037j0244q143L326N0778K2776q651j2416j2452
9048e240P55L483K1315j7898j1668R390n746q737o210J3673J1562k2761k627J1378
9034i331l407j1927J121P528N928j557J8991L3874o44p532J4316l382p535j1700
9020B4743L085J0820m786o862k5998j6926N721K1464J3742n615j6018Q182J9583
9007C1135J3305Q14k3029j4955j1373k106m009k0495J2500J5328J9044Q683J495
8994B6337L104q483k1585L821J6299N695l0364j0657J2123J0982Q581j9213r799
8981a3159J5023K0267J1744o916k2177L080K1234P948j3237k398O001R746n720
$$ plain form
8968 31436 26090 -7015 -10007 -15746 -55589 -62694 -49646 -37711 -12780 11857 20504 11356 5532
8955 5532 23675 36599 30314 33289 32516 26623 987 29438 27311 9342 3550 -21532 -12001 -183
8941 -183 -33316 -45336 -26079 -20715 -16600 19877 37595 45289 16078 -40104 -41631 -31466 -42017
8928 -42017 -32596 -9331 6449 12530 27668 23436 34918 37503 36864 36024 -2315 -22446 -18873 -22345
8914 -22345 -8164 6681 4168 -5172 -9965 5647 503 -32123 -12351 4681 35354 49204 48975
8901 48975 50093 44396 41793 41245 18642 28125 20334 8449 6620 -10245 -2895 25834 27393 22245
8887 22245 25371 38209 13104 -2267 -6766 -4520 10818 -5150 -10099 -3034 26807 29164 35003
8874 35003 17769 28983 48818 46774 23637 25261 44872 44607 33956 26224 9875 7571 11206
$$ packed form
8968C1436n346l3105k992n739l9843p105J3048J1935K4931K4637Q647r148n824
8955E532J8143J2924o285K975p73n893k5636K8451k127j7969n792k5082R531J1818
8941a83l3133j2020J9257N364M115L6477J7718P694k9211n6182j527J0165j0551
8928d2017R421K3265J5780O081J5138m232J1482K585o39q40l8339k0131L573l472
8914b2345J4181J4845k513r340m793J5612n144l2626J9772J7032L0673J3850k29
8901D8975J118n697k603n48k2603R483p791j1885j829j6865P350K8729J559n148
8887B2245L126J2838k5105j5371m499K246J5338j5968m949P065K9841K357N839
8874C5003j7234J1214J9835k044k3137J624J9611k65j0651p732j6349k304L635
$$ plain form
8861 11206 -303 -744 9266 14850 1919 3293 -295 4391 12709 -12695 1155 36024 23756
8848 23756 24617 16521 5829 -2910 -9568 16113 33722 25355 26518 56036 43393 16500 2378
8835 2378 3005 -1347 -15306 -4952 -9323 -19428 -34569 -17242 -5758 -18877 -30202 -22874 -7838
8822 -7838 -5657 -6010 -15274 -20112 -9110 3599 10411 -1655 3907 -5668 -6040 -21181 -22380 -7620
8808 -7620 7765 7826 -9544 -20967 -883 10631 10651 22213 33700 24285 5372 2700 11676 -1260
8794 -1260 -9842 -9679 -10782 -12440 16532 22538 13115 -12117 -20641 -1018 7834 4110 4146 -397 18689
8779 18689 13791 13091 32505 34021 4084 -22268 -17354 -9929 -7204 -3925 -10608 -813 2899 17500
8765 17500 5842 -22019 -13886 3767 4928 4284 14254 8011 20938 22616 7046 3289 9552 20123
$$ packed form
8861A1206j1509m41J0010N584j2931J374l588M686Q318k5404J3850L4869j2268
8848B3756Q61q096j0692q739o658K5681J7609q367J163K9518j2643k6893j4122
8835B378O27m352j3959J0354m371j0105j5141J7327J1484j3119j1325P328J5036
8822g838K181l53r264m838J1002J2709O812j2066N562r575l72j5141j199J4760
8808g620J5385O1j7370j1423K0084J1514K0J1562J1487r415j8913k672Q976j2936
8794a260q582J63j103j658K8972O006r423k5232q524J9623Q852l724L6m543J9086
8779A8689m898p00J9414J516k9937k6352M914P425K725L279o683R795L712J4601
8765A7500j1658k7861Q133J7653J161o44R970o243J2927J678j5570l757O263J0571
$$ plain form
8751 20123 37949 22125 -18878 -36042 -17408 -15832 6938 5169 -4522 13392 36619 19079
8739 19079 8915 10309 530 -23806 -36161 -23206 -21088 -11101 3548 3970 11721 16570 -9943
8726 -9943 -1837 297 -16801 -7212 2113 8877 -18098 -23103 2294 11778 18014 27975 23924 25167
8712 25167 10449 8825 2641 -3562 -19831 -35804 -46195 -22820 -38487 -55597 -52394 -51299 -37453
8699 -37453 -18166 -21979 -11894 -5693 -970 -21265 -39075 -53717 -58418 -54806 -55094 -29548 1416
8686 1416 37266 34498 8745 -13304 -275 2964 1015 19847 20995 36964 33891 22422 24120
8673 24120 16477 34026 23207 -8188 -1280 13106 17674 -778 1410 11625 -7280 -33992 -42595
8660 -42595 -13907 12464 22489 8548 15115 38254 43641 49950 18153 21323 15203 3180 14016
$$ packed form
8751B0123J7826j5824m1003j7164J8634J576K2770j769r691J7914K3227j7540
8739A9079j0164J394r779k4336j2355J2955K118R987J4649M22P751M849k6513
8726i943Q106K134j7098R589R325O764k6975n005K5397R484O236R961m051J243
8712B5167j4718j624o184o203j6269j5973j0391K3375j5667j7110L203J095J3846
8699c7453J9287l813J0085O201M723k0295j7810j4642m701L612k88K5546L0964
8686A416L5850k768k5753k2049J3029L239j949J8832J148J5969l073j1469J698
8673B4120p643J7549j0819l1395O908J4386M568j8452K188J0215j8905k6712q603
8660d2595K8688K6371J0025j3941O567K3139N387O309l1797L170o120j2023J0836
$$ plain form
8647 14016 24529 35633 28556 34022 21289 38709 51778 35023 24008 50636 34275 -7108
8635 -7108 -22914 10078 22177 4604 -12323 -22297 -1441 157 9589 7680 9151 17410 -6411
8622 -6411 -12325 4295 1462 9864 26096 36448 29786 8655 -2443 7695 -5013 -37051 -57580
8609 -57580 -45229 -25357 -15885 -36375 -20636 1258 21352 27508 5490 28539 24600 16040 9896
8596 9896 -31418 -48350 -16690 -5036 8549 10620 14788 32295 41670 35933 24427 40124 25486
8583 25486 25560 36615 21762 22263 32940 45142 62766 57720 37628 48009 45805 27245 19081
8570 19081 25544 26040 34156 57896 73355 58858 48210 12521 4454 -1911 2810 41755 53003
8557 53003 38318 18407 2570 -10206 -11861 -4171 -2231 1624 6473 -6611 -30681 -27403 -13271
$$ packed form
8647A4016J0513J1104p077N466j2733J7420J3069j6755j1015K6628j6361m1383
8635g108j5806L2992J2099j7573j6927r974K0856J598R432j909J471Q259k3821
8622f411n914J6620k833Q402J6232J0352o662k1131j1098J0138j2708l2038k0529
8609e7580J2351J9872R472k0490J5739K1894K0094O156k2018K3049l939q560o144
8596I896m1314j6932L1660J1654J3585K071M168J7507R375n737j1506J5697j4638
8583B5486P4J1055j4853N01J0677J2202J7624n046k0092J0381k204j8560q164
8570A9081O463M96Q116K3740J5459j4497j0648l5689q067o365M721L8945J1248
8557E3003j4685j9911j5837j2776j655P690J940L855M849j3084k4070L278J4132
$$ plain form
8544 -13271 -23993 -27649 -7727 25052 35191 35418 18045 -10503 -4253 2039 -19209 -8856 7442
8531 7442 -7603 -10116 3569 14325 15706 4583 -5129 -8458 11179 7297 11204 153 205 1401
8517 1401 -24477 -29744 -7421 5627 1196 -24303 339 5430 10416 10122 -6630 -31837 -29992
8504 -29992 -13579 -39060 -33976 -22493 -19110 -20923 -36657 -36612 -38256 -48226 -29422 -31755 -32286 -313
8490 -313 -2432 -5197 165 9967 28461 30956 15555 16967 3206 8005 -6629 -1916 1745 -3590
8476 -3590 -9095 -6803 -20967 -10642 -7731 5074 2594 3559 4276 -7104 -23433 -15162 -143 17312
8462 17312 20822 17923 8953 36239 60072 67298 38597 11109 109 129 7965 10165 16686 25376
8448 25376 22048 1044 -10835 -3840 6884 -2629 -10061 1473 -7831 -22186 -23702 -1563 12201
$$ packed form
8544a3271j0722l656J9922L2779J0139K27j7373k8548O250O292k1248J0353J6298
8531G442j5045k513J3685J0756J381j1123r712l329J9637l882L907j1051N2J196
8517A401k5878n267K2323J3048m431k5499K4642N091M986k94j6752k5207J845
8504b9992J6413k5481N084J1483L383j813j5734M5j644r970J8804k333n31L1973
8490c13k119k765N362R802J8494K495j5401J412j3761M799j4634M713L661n335
8476c590n505K292j4164J0325K911J2805k480R65P17j1380j6329Q271J5019J7455
8462A7312L510k899q970K7286K3833P226k8701k7488j1000K0P836K200O521Q690
8448B5376l328k1004j1879O995J0724r513p432J1534r304j4355j516K2139J3764
$$ plain form
8435 12201 12588 9484 2584 -19659 -18878 -16659 -8388 -6302 -8692 -14015 -19960 -27026 -12739 18961
8421 18961 35769 24593 22752 -5026 -23526 -22250 -30533 -24540 7189 8340 15715 5082 -10928
8408 -10928 2582 -6016 1963 40051 45264 49734 32854 32300 13325 1016 22720 33286 9963
8395 9963 6848 -11513 -5145 -15600 -22873 -15137 -21741 -24435 -39712 -34955 -31281 -26435 -24079 4195
8381 4195 2465 7996 -1492 -28593 -23064 -11598 11718 4648 17311 15191 15022 16842 -1035 -11251
8367 -11251 -10239 -11256 -16959 -27703 -47158 -66978 -48888 -16226 -24697 -42911 -32470 2934 6095
8354 6095 14506 35443 56153 28492 -5598 -7593 -7639 6765 19200 5655 -20416 -40821 -52607
8341 -52607 -36933 -4849 21452 11480 -12568 -1812 10467 1298 -3425 -12296 -22687 -8409 -1568
$$ packed form
8435A2201L87l104o900k2243P81K219Q271K086k390n323n945p066J4287L1700
8421A8961J6808j1176j841k7778j8500J276q283N993L1729J151P375j0633j6010
8408a0928J3510q598P979L8088N213M470j6880n54j8975j2309K1704J0566k3323
8395I963l115j8361O368j0455p273P736o604k694j5277M757L674M846K356K8274
8381D195j730N531r488k7101N529J1466K3316p070J2663k120j69J820j7877j0216
8367a1251J012j017n703j0744j9455j9820J8090L2662q471j8214J0441L5404L161
8354F095Q411K0937K0710k7661l4090j995m6J4404J2435j3545k6071k0405j1786
8341e2607J5674L2084K6301r972k4048J0756J2279r169m723q871j0391J4278O841
$$ plain form
8328 -1568 -12990 -10386 -13026 -13701 -17671 -50575 -52119 -20340 -23339 -26267 -27580 -13858 1512 6698
8314 6698 3890 8395 18474 15776 18672 14887 21038 12674 10552 -7041 -29451 -21709 15116 54819
8300 54819 60649 48725 24621 -20075 -33570 -33704 -28493 -23840 -12925 -14203 -19157 -4780 -27130
8287 -27130 -27294 -20530 -19754 -26614 -42535 -20808 -8244 -5277 9075 13314 -659 -2717 -3843 -11939
8273 -11939 11345 7832 -3707 -1627 -619 -23760 -35310 -37712 -33512 -51355 -40673 -44201 -63266
8260 -63266 -39284 -862 9137 5355 -1208 6114 3493 -4434 867 5343 35525 59327 38023
8247 38023 36877 18163 -2654 -16666 -97 -8772 -15774 -17049 -19944 -15600 -12330 -14524 -4343
8234 -4343 18643 24076 17459 -3909 -19136 -40348 -42471 -2875 16164 16244 21861 42507 47467 42699
$$ packed form
8328a568j1422K604k640o75l970l2904j544L1779k999k928j313J3722J5370N186
8314F698k808M505J0079k698K896l785O151q364k122j7593k2410P742L6825L9703
8300E4819N830j1924k4104m4696j3495j34N211M653J0915j278m954J4377k2350
8287b7130j64O764P76o860j5921K1727J2564K967J4352M239j3973k058j126q096
8273a1939K3284l513j1539K080J008k3141j1550k402M200j7843J0682l528j9065
8260f3266K3982L8422R999l782o563P322k621p927N301M476L0182K3802k1304
8247C8023j146j8714k0817j4012J6569q675p002j275k895M344L270k194J0181
8234d343K2986N433o617k1368j5227k1212k123L9596J9039Q0N617K0646M960m768
$$ plain form
8220 42699 33868 11400 3554 17392 36905 19476 -15071 -5922 4613 -12788 -24904 -20649 -28871
8207 -28871 -15454 -29633 -34895 -26722 -32756 -21043 -8441 -15920 -27793 -7539 8792 4891 2973
8194 2973 32381 543 -7798 5537 24971 31232 11719 -13352 -11382 7400 11095 29332 9715
8181 9715 691 -440 -7000 1277 10625 30584 27205 9976 -1151 -9098 -30322 -43336 -43207 -51917
8167 -51917 -37383 -27708 -8231 7844 16455 11525 -7303 -30033 -19982 -26455 -6664 -853 5689
8154 5689 30269 27212 3156 -12361 -14181 -10309 7053 -8658 -45679 -58398 -30861 -24340 -15481
8141 -15481 -17221 4001 7785 1237 3336 -5811 -13856 -3335 -23596 -50837 -49484 -33887 -2725
8128 -2725 -17054 -17382 5492 10457 13061 15596 21286 -3790 -22786 -29070 -31682 -12958 -6856 -31862
$$ packed form
8220D2699q831k2468p846J3838J9513j7429l4547R149J0535j7401j2116M255q222
8207b8871J3417j4179n262Q173o034J1713J2602p479j1873K0254J6331l901j918
8194B973K9408l1838q341J3335J9434O261j9513k5071J970J8782L695J8237j9617
8181I715r024j131o560Q277R348J9959l379j7229j1127p947k1224j3014J29q710
8167e1917J4534R675J9477J6075Q611m930j8828k2730J0051o473J9791N811O542
8154E689K4580l057k4056j5517j820L872J7362j5711l7021j2719K7537O521Q859
8141a5481j740K1222L784o548K099r147q045J0521k0261k7241J353J5597L1162
8128b725j4329l28K2874M965K604K535N690k5076j8996o284k612J8724O102k5006
$$ plain form
8114 -31862 -27338 -33736 -10486 -19534 -52370 -59511 -59059 -25942 -4695 -3562 -31361 -39598 -38790 -25720
8100 -25720 -3546 -971 -11497 -43823 -48127 -28928 -1129 -3860 -12072 -14276 -26012 -43842 -46524
8087 -46524 -24604 -15603 -8901 -2239 -3157 3274 -755 6365 -12036 -7689 -5312 -8756 -36515 -29980
8073 -29980 -16074 1812 21352 15086 25830 20799 25381 14557 -10098 -9572 -26221 -43443 -21214
8060 -21214 -2094 9674 -7978 -25758 -22541 -21230 -12479 -4850 20603 20499 27058 14881 -5128
8047 -5128 -12993 -18933 -10589 -4141 3007 6584 13167 7413 -522 -7663 -15583 -28462 -28015 -18407 -22799
8032 -22799 -31577 -23483 -7409 -2178 13685 31086 24536 3098 -11236 -6504 -4823 -24988 -28843
8019 -28843 -23447 9838 38667 23920 -167 -14672 -32712 -39856 -46588 -53756 -57898 -55070 -58731
$$ packed form
8114c1862M524o398K3250r048l2836p141M52L3117K1247J133k7799q237Q08J3070
8100b5720K2174K575j0526l2326m304J9199K7799k731q212k204j1736j7830k682
8087d6524K1920R001O702O662r18O431m029P120j8401M347K377l444k7759O535
8073b9980J3906J7886J9540o266J0744n031M582j0824k4655N26j6649j7222K2229
8060b1214J9120J1768j7652j7780L217J311Q751P629K5453j04O559j2177k0009
8047e128p865n940Q344O448P148L577O583n754p935p141p920j2879M47R608m392
8032b2799q778Q094J6074N231J5863J7401o550k1438j4334M732J681k0165l855
8019b8843N396L3285K8829j4747k4087j4505j8040p144o732p168m142K828l661
$$ plain form
8006 -58731 -39303 -3479 -727 -17907 -6491 12546 5708 7824 -13214 -10673 15577 41404 40982
7993 40982 14608 9580 -1586 4836 4965 2548 -3302 7118 22401 -8592 -35627 -16819 -3440
7980 -3440 18588 34501 18197 11218 38188 43754 18264 11847 18013 35143 22118 4617 -7443
7967 -7443 -17202 -20577 975 27527 27723 26969 21999 28939 28995 28359 39222 47902 29662 -746 -14894
7952 -14894 -9062 -7952 -6398 -28808 -34655 -10928 -14763 -23504 -15881 -722 -86 10041 37420 30100
7938 30100 33182 37348 29828 39345 15851 -18598 -47937 -42779 -22998 5805 -13366 -12452 879
7925 879 5026 15713 -11270 7383 19956 3464 618 -1964 8037 -2054 -10471 -5140 -13844
7912 -13844 -33539 -37786 -15939 -21007 -40917 -41517 -37378 -4469 19555 43787 50816 50987 16285
$$ packed form
8006e8731J9428L5824K752j7180J1416J9037o838K116k1038K541K6250K5827m22
7993D0982k6374n028j1166O422J29k417n850J0420J5283l0993k7035J8808J3379
7980c440K2028J5913j6304o979K6970N566k5490o417O166J7130j3025j7501j2060
7967g443r759l375K1552K6552J96p54m970O940N6o36J0863Q680j8240l0408j4148
7952a4894N832J110J554k2410n847K3727l835q741P623J5159O36J0127K7379p320
7938C0100L082M166p520R517k3494l4449k9339N158J9781K8803j9171R14J3331
7925H79M147J0687k6983J8653J2573j6492k846k582J0001j0091q417N331q704
7912a3844j9695m247K1847n068j9910o00M139L2909K4024K4232P029J71l4702
$$ plain form
7899 16285 2694 -7517 -14659 -22129 15247 36029 6373 -25211 -17517 12633 25872 22150 16522
7886 16522 6233 10556 -13454 -40588 -33797 -6810 -558 -2147 8080 -1376 -12166 -14277 -24252
7873 -24252 -31603 -25701 -32959 -29094 -25511 -29175 -53094 -60680 -60653 -58971 -58724 -33254 -20784 -23280 -20163
7858 -20163 -24147 -15415 -21354 -35229 -14756 -8900 -24844 -26900 -11446 8997 -11601 -38192 -37595
7845 -37595 -20108 785 -1024 -22253 -18971 -10213 -15513 -868 8296 2506 420 -8735 -11052 -32949
7831 -32949 -6275 12848 -15975 -30908 -20549 -21268 -17122 -28598 -31325 -56656 -41502 -2598 -15511
7818 -15511 -23184 -24576 -13221 2102 25063 36452 34589 26260 11164 -9462 -3493 15122 16552
7805 16552 971 -20984 -25021 -21049 -11150 -10745 -12566 -5011 12068 3386 -8218 -4333 13286 41198
$$ packed form
7899A6285j3591j0211p142p470L7376K0782k9656l1584P694L0150J3239l722n628
7886A6522j0289M323k4010k7134O791K6987O252j589J0227r456j0790k111r975
7873b4252p351N902p258L865L583l664k3919p586K7J682K47K5470J2470k496L117
7858b0163l984Q732n939j3875K0473N856j5944k056J5454K0443k0598k6591N97
7845c7595J7487K0893j809k1229L282Q758n300J4645R164n790k086r155k317k1897
7831c2949K6674J9123k8823j4933J0359p19M146j1476k727k5331J5154L8904j2913
7818a5511p673j392J1355J5323K2961J1389j863q329j5096k0626N969J8615J430
7805A6552j5581k1955m037L972R899M05j821P555J7079q682j1604L885J7619K7912
$$ plain form
7791 41198 53817 44620 29632 21218 12236 3684 3998 -19710 -36647 -20154 -18880 -14240 -11085 3388
7777 3388 3159 5803 -18239 -14114 -23266 -61162 -82836 -62311 -65566 -85017 -63210 -57949 -63776 -54460
7763 -54460 -45109 -11281 6521 -3734 13409 9527 -1174 14388 37766 35215 26776 14220 7554
7750 7554 -2660 -5384 4279 15258 20452 16735 5660 2369 -7458 -5891 7026 43178 55411
7737 55411 43579 25105 7754 -7940 -13511 -8146 10361 8415 -8462 -17797 -7906 5678 12984
7724 12984 461 9178 31046 23356 15751 17544 11215 -3746 -672 16564 2000 -8362 -25507
7711 -25507 -32954 -16990 -14638 -7043 14572 24862 24557 22633 19872 9202 7254 -3493 -33508
7698 -33508 -18752 -2820 -9460 -29680 -19333 -9801 -5214 652 -11116 -19496 -15326 -20757 -30316
$$ packed form
7791D1198J2619r197j4988q414q982q552L14k3708j6937J6493J274M640L155J4473
7777C388k29K644k4042M125r152l7896k1674K0525l255j9451K1807N261n827R316
7763e4460R351L3828J7802j0255J7143l882j0701J5562K3378k551q439j2556o666
7750G554j0214k724R663J0979N194l717j1075l291r827J567J2917L6152J2233
7737E5411j1832j8474j7351j5694n571N365J8507j946j6877r335R891J3584P306
7724A2984j2523Q717K1868p690p605J793o329j4961L074J7236j4564j0362j7145
7711b5507p447J5964K352P595K1615J0290l05j924k761j0670j948j0747l0015
7698c3508J4756J5932o640k0220J0347R532M587N866j1768q380M170n431r559
$$ plain form
7685 -30316 -37778 -30636 -13541 -21899 -28721 -41750 -36288 -34400 -37432 -37772 -14629 -1361 -24620 -39955
7671 -39955 -27427 6659 3902 -992 -19287 -16730 -132 -3170 -22990 -23091 -22016 -36822 -38188
7658 -38188 -46049 -44414 -42110 -19006 -2849 3053 -1135 109 11017 33552 54056 47154 54512
7645 54512 47359 14126 20637 3312 -2694 -4180 -21377 -2172 -13115 -26353 -33177 -30201 -30769
7632 -30769 -16307 -10752 -177 5824 7309 2516 -4764 6839 17772 18363 -940 7498 27441
7619 27441 15139 14477 -9247 -30299 -1510 10993 -9495 -32672 -25144 -31830 -33239 -17601 -19820
7606 -19820 -8074 -7052 -33815 -31876 -22933 292 15204 24125 -12729 -21074 3974 -10436 -23226
7593 -23226 -1663 5084 -2813 3166 21401 11098 966 -15006 -20617 4742 14880 2197 -828
$$ packed form
7685c0316p462P142J7095q358o822j3029N462J888l032l40K3143J3268k3259j5335
7671c9955J2528L4086k757m894j8295K557J6598l038j9820j01J075j4806j366
7658c8188p861J635K304K3104J6157N902m188J244J0908K2535K0504o902P358
7645E4512p153l3233O511j7325o006j486j7197J9205j0943j3238o824K976n68
7632c0769J4462N555J0575O001J485m793p280J1603J0933N91j9303Q438J9943
7619B7441j2302o62k3724k1052K8789J2503k0488k3177P528o686j409J5638k219
7606a9820J1746J022k6763J939Q943K3225J4912Q921l6854q345K5048j4410j2790
7593b3226K1563O747p897N979J8235j0303j0132j5972n611K5359J0138j2683l025
$$ plain form
7580 -828 -7460 14675 2352 -1777 9917 -290 13220 3915 -14746 -7730 -13666 -23002 -8378
7567 -8378 -17228 -24620 -24477 -4733 -1086 -13128 -11649 -6748 19124 6382 2273 13048 31925 22374
7553 22374 -14196 -17851 -28090 -15984 -485 -13598 -21578 12796 31038 25367 23217 2581 2350
7540 2350 293 12105 13443 21253 17311 -3644 -13601 -6974 -20522 -36059 -11413 22185 36858
7527 36858 37740 28610 22945 15613 19297 12242 4322 6419 7506 14432 14385 -4377 -5947 13636 -10631
7512 -10631 -25771 -22580 -16752 13744 13759 10525 19681 -5370 -21926 -8341 -9157 -8725 -23313 -38701
7498 -38701 -49623 -48781 -27557 -18177 -17783 -43475 -47280 -24081 -1828 -23160 -38874 -19824 -2091
7485 -2091 -12553 7857 26395 -2251 -22222 -17226 -21733 -24997 -23814 -20279 -9007 2531 -16424
$$ packed form
7580h28o632K2135j2323m129J1694j0207J3510r305j8661P016n936r336J4624
7567h378q850p392J43J9744L647j2042J479M901K5872j2742m109J0775J8877r551
7553B2374l6570l655j0239J2106J5499j3113p980L4374J8242n671k150k0636k31
7540B350k057J1812J338P810l942k0955r957O627j3548j5537K4646L3598J4673
7527C6858Q82r130n665p332L684p055p920K097J087O926m7j8762j570J9583k4267
7512a0631j5140L191N828L0496J5l234R156k5051j6556J3585q16M32j4588j5388
7498c8701j0922Q42K1224R380L94k5692l805K3199K2253k1332j5714J9050J7733
7485b091j0462K0410J8538k8646j9971M996m507l264J183L535J1272J1538j8955
$$ plain form
7472 -16424 -30440 -40125 -53562 -59982 -40633 -19780 2680 22 -13279 -20029 -31730 -34892 -27629
7459 -27629 -37011 -41831 -30354 -19857 -4240 18306 14936 -4759 -24599 -9565 15883 21543 -567
7446 -567 -28912 -15318 10710 7832 -29706 -34655 -19920 -3676 -15015 -28074 -24654 -31904 -39618
7433 -39618 -39397 -33753 -23624 1216 -5250 -6391 -3648 6325 -16625 -33897 -28931 -12979 -4015 23699
7419 23699 5502 1820 -1582 8689 12348 -2515 -8643 -2980 -9088 -16541 -25077 -6611 -11557 5038
7405 5038 1498 -9015 -15846 -29604 -47300 -33773 -31076 -22662 2351 -7733 -31370 -14278 -1300
7392 -1300 -2735 6115 49173 43475 49784 44449 15970 628 -11516 -14841 246 7859 13303 17009
7378 17009 16563 23034 30177 5739 -29106 -25690 -28785 -16919 -4875 -15553 -12576 -7294 3636
$$ packed form
7472a6424j4016r685j3437o420J9349K0853K2460k658j3301o750j1701l162P263
7459b7629r382m820J1477J0497J5617K2546l370j9695j9840J5034K5448N660k2110
7446e67k8345J3594K6028k878l7538m949J4735J6244j1339j3059L420p250p714
7433c9618K21N644J0129K4840o466j141K743R973k2950j7272M966J5952Q964K7714
7419B3699j8197l682l402J0271L659j4863o128N663o108p453q536J8466m946J6595
7405E038l540j0513o831j3758j7696J3527K697Q414K5013j0084k3637J7092J2978
7392a300j435Q850M3058n698O309n335k8479j5342j2144l325J5087P613N444L706
7378A7009m46O471P143k4438l4845L416l095J1866J2044j0678K977N282J0930
$$ plain form
7365 3636 -2163 -22000 -10218 -7200 644 -3763 21267 10822 -8214 -19398 -35706 -43083 -42030
7352 -42030 -56606 -35939 -200 21435 17234 -5410 -11126 -22697 -30914 -28662 -20388 -5676 -15987
7339 -15987 -32279 -32274 -22090 5503 -9081 -5525 31164 -1477 -14126 -2156 -8779 -9593 5198
7326 5198 11021 6240 -11704 -3153 -11326 -2432 9082 10720 -1015 -19907 -18782 2270 3901 5434
7312 5434 8220 18331 24471 18638 22987 19169 5065 -4292 9520 -2046 -3524 -11057 4619 18184
7298 18184 6372 661 -7975 -25010 -35804 -50280 -49344 -45551 -46722 -24803 -35464 -41178 -32923
7285 -32923 -61654 -50229 -21047 -24322 -32414 -28483 -23742 -10529 -16507 -26134 -25605 -33607 -21129 3354
7271 3354 818 -13158 -3363 11558 -24564 -25589 -16874 -15861 -38461 -50349 -44817 -53880 -65540
$$ packed form
7365C636n799j9837J1782L018P844m407K5030j0445j9036j1184j6308p377J053
7352d2030j4576K0667L5739K1635m201k2644n716j1571q217K252Q274J4712j0311
7339a5987j6292NJ0184K7593j4584L556L6689l2641j2649J1970o623q14J4791
7326E198N823m781j7944Q551q173Q894J1514J638j1735j8892J125K1052J631J533
7312E434K786J0111O140n833M349l818j4104r357J3812j1566j478p533J5676J3565
7298A8184j1812n711q636j7035j0794j4476R36L793j171K1919j0661n714Q255
7285c2923k8731J1425K9182l275q092L931M741J3213n978r627N29q002J2478K4483
7271C354k536j3976R795J4921l6122j025Q715J013k2600j1888N532r063j1660
$$ plain form
7258 -65540 -60696 -60357 -54548 -59021 -37378 -15701 -28551 -29693 -25505 -22502 -7075 -7876 -24652 -12434
7244 -12434 1565 4329 9023 28208 26248 21331 -1823 8913 15525 -8264 -26797 -41565 -47963
7231 -47963 -38940 -19415 -9261 -10606 8582 2426 -8011 -3021 -15685 -26402 -35473 -13920 -5904
7218 -5904 -5727 -14793 -9642 -5668 -4941 -9254 4050 20692 17805 27578 31477 15316 -15417 -15237 -3140
7203 -3140 -8974 -17408 -2058 -25263 -57262 -45829 -9645 4325 -4759 -4403 -7666 -15991 -19131 583
7189 583 5841 -13806 373 -689 -19204 -40549 -31333 -24279 -9406 -7304 -14253 -8124 129 -21600
7175 -21600 -33101 -12942 14088 26222 17585 -2506 -22997 -32345 -39526 -43572 -62933 -59938 -57807
7162 -57807 -50077 -52464 -53223 -41366 -33779 -6375 19936 11242 14081 12959 15251 2952 -22361 -34822
$$ packed form
7258f5540M844L39N809m473K1643K1677j2850j142M188L003J5427q01j6776J2218
7244a2434J3999K764M694J9185j960m917k3154J0736O612k3789j8533j4768o398
7231d7963R023J9525J0154j345J9188o156j0437M990j2664j0717r071K1553Q016
7218e904J77r066N151L974P27m313J3304J6642k887R773L899j6161l0733J80J2097
7203c140n834q434J5350k3205l1999J1433L6184J3970r084L56l263q325l140J9714
7189E83N258j9647J4179j062j8515k1345R216P054J4873K102o949O129Q253k1729
7175b1600j1501K0159K7030J2134q637k0091k0491r348p181m046j9361K995K131
7162e7807P730k387p59J1857P587K7404K6311q694K839j122K292j2299k5313j2461
$$ plain form
7148 -34822 12249 39736 51591 33084 32441 52839 42795 6501 -29876 -26985 -5239 -12407 -14958
7135 -14958 -8610 -21794 -29475 -24889 -6130 18925 25319 3222 -26514 -45641 -21518 13948 18920
7122 18920 -5274 11673 27916 20950 23593 19575 -1627 -13336 -16393 -23198 -20095 3015 4846
7109 4846 -2313 -28878 -35700 -32804 -46211 -32877 -19608 -28441 -7856 4756 -88 -22092 -44774
7096 -44774 -43144 -37115 -46122 -28886 -9017 9749 9502 -31201 -45919 -43461 -37262 -20929 -7243
7083 -7243 -10176 -21447 -41626 -45486 -40637 -33760 -31624 -36972 -35476 -58096 -36015 -13633 16711
7070 16711 5465 -16786 -8013 -12794 -36995 -32215 -19498 -7720 17735 46229 35066 10943
7058 10943 7773 -9683 -35690 -32832 -20696 -26228 -24404 -43708 -52821 -37287 -20387 -14141 -16095
$$ packed form
7148c4822M7071K7487J1855j8507o43K0398j0044l6294l6377K891K1746p168k551
7135a4958O348j3184p681M586J8759K5055O394k2097k9736j9127K4123L5466M972
7122A8920k4194J6947J6243o966K643m018k1202j1709l057o805L103K3110J831
7109D846p159k6565o822K896j3407J3334J3269q833K0585J2612m844k2004k2682
7096d4774J630O029r007J7236J9869J8766k47m0703j4718K458O199J6333J3686
7083g243k933j1271k0179l860M849O877K136n348J496k2620K2081K2382L0344
7070A6711j1246k2251Q773m781k4201M780J2717J1778K5455K8494j1163k4123
7058A0943l170j7456k6007K858J2136n532J824j9304r113J5534J6900O246j954
$$ plain form
7045 -16095 -11418 -17944 -32402 -7202 2934 5614 -20166 -27525 -24527 -3755 1650 15178 11097
7032 11097 -1420 -1114 5015 4396 4969 -8543 -8821 -2299 12765 -10909 -26337 -7074 11064 15095
7018 15095 952 -11050 -6571 5045 16201 -1264 -29278 -44146 -13660 -4409 -18060 -35853
7006 -35853 -29637 -24519 -41617 -39869 -36924 -48532 -43297 -23971 -19806 -6194 -11491 -1588 3473 12154
6992 12154 16806 11279 -12258 -23476 -2303 4788 -553 1951 -1603 -12854 -6310 1772 7855 15107
6978 15107 14223 10881 -13058 -24160 -42194 -31275 -20314 -18177 -23198 -22302 -24263 -17306 2133 20610
6964 20610 -1359 -34977 -36412 -5457 6343 6780 -3718 3464 -1888 -12656 -10024 -28053 -32028
6951 -32028 -8691 -33535 -37056 -25504 -19549 -4704 -20071 -640 7802 -2776 -3421 -3461 660 -14952
$$ packed form
7045a6095M677o526j4458K5200J0136K680k5780p359K998K0772N405J3528m081
7032A1097j2517L06O129o19N73j3512k78O522J5064k3674j5428J9263J8138M031
7018A5095j4143j2002M479J1616J1156j7465k8014j4868L0486R251j3651j7793
7006c5853O216N118j7098J748K945j1608N235J9326M165J3612n297R903N061Q681
6992A2154M652n527k3537j1218K1173P091n341K504l554j1251O544Q082O083P252
6978A5107q84l342k3939j1102j8034J0919J0961K137n021Q96j961O957J9439J8477
6964B0610k1969l3618j435L0955J1800M37j0498P182n352j0768K632j8029l975
6951c2028K3337k4844l521J1552N955J4845j5367J9431Q442j0578o45m0M121j5612
$$ plain form
6937 -14952 -19348 23359 38638 36257 42048 33542 1925 -2450 9363 31058 11874 -15668 -26922
6924 -26922 -16866 -10898 -36756 -33230 -4190 22480 7382 2198 276 1686 17889 23224 33228
6911 33228 31479 4458 -12683 -11192 -4540 -25327 -43933 -27168 -15979 -19969 -67763 -66111 -45818
6898 -45818 -25400 -26296 -12184 -1129 5013 -3435 -5864 -16661 -13798 -4795 13839 15361 3494
6885 3494 19614 31368 -7084 -28052 -24396 -30427 -39738 -41938 -54185 -42037 -4880 9172 24482
6872 24482 32440 13545 -2856 -15103 -21448 -25197 -10598 6650 18900 9171 194 -16229 -17597
6859 -17597 -8300 -24657 2486 12285 -1648 -12841 -34716 -28326 2240 36336 38182 21598 17584
6846 17584 7507 525 -11000 2528 -6600 -3675 5771 3939 3695 -13467 -1704 -1319 -6822 -11260
$$ packed form
6937a4952m396M2707J5279k381N791q506l1617m375J1813K1695j9184k7542j1254
6924b6922J0056N968k5858L526K9040K6670j5098n184j922J410J6203N335J0004
6911C3228j749k7021j7141J491O652k0787j8606J6765J1189l990m7794J652K0293
6898d5818K0418q96J4112J1055O142q448k429j0797K863R003J8634J522j1867
6885C494J6120J1754l8452k0968L656o031r311k200j2247J2148L7157J4052J5310
6872B4482P958j8895j6401j2247o345l749J4599J7248J2250r729q977j6423j368
6859a7597R297j6357K7143R799j3933j1193k1875O390L0566L4096J846j6584m014
6846A7584j0077o982j1525J3528r128K925R446j832k44j7162J1763L85n503m438
$$ plain form
6832 -11260 -8536 2065 -2788 -16404 -16728 -15410 -9485 2298 -19129 -53963 -37757 -10865 -663
6819 -663 -598 -4705 -22519 -53107 -43637 -11717 -17763 -7926 -5115 1164 15358 1863 -23279 -31075
6805 -31075 -35238 -18201 -4174 3298 13311 -142 -8923 5061 1268 8536 18954 11241 1530
6792 1530 -9423 -10337 -6812 -7622 -3136 3664 242 18301 15483 -8412 -18990 -35281 -22871 -21943
6778 -21943 -33187 -36548 -17822 -26407 -41028 -28232 -38393 -16911 -16311 7286 27089 19948 8770
6765 8770 460 -1727 -14711 -24847 -18834 -2116 32643 30552 13762 -1916 -34808 -33196 -27537
6752 -27537 -17374 -34092 -29521 -25784 -13878 -8856 20164 22240 -1118 -8244 -4366 -20460 -21291
6739 -21291 -15830 -24141 -31738 -14000 -14203 -4941 -3928 -6142 8339 -12320 -24055 -20525 -39264 -40523
$$ packed form
6832a1260K724J0601m853j3616l24J318N925J1783k1427l4834J6206K6892J0202
6819f63O5m107j7814l0588R470L1920o046R837K811O279J4194j3495k5142p796
6805c1075m163J7037J4027P472J0013j3453q781J3984l793P268J0418p713r711
6792A530j0953r14L525q10M486O800l422J8059k818k3895j0578j6291J2410R28
6778b1943j1244l361J8726q585j4621J2796j0161K1482O00K3597J9803p141j1178
6765H770q310k187j2984j0136O013J6718L4759k091j6790j5678l2892J612N659
6752b7537J0163j6718M571L737J1906N022K9020K076k3358p126L878j6094q31
6739b1291N461q311p597J7738k03R262J013k214J4481k0659j1735L530j8739j259
$$ plain form
6725 -40523 -16423 -28206 -32112 400 5170 -17814 -20909 212 6634 -817 -30004 -32827 -23632
6712 -23632 -16629 8096 -6847 -18550 -11254 16142 12798 19278 15965 5383 1544 6884 23398
6699 23398 17861 -12070 -31259 -29579 -15164 12155 25377 19189 21648 25587 34685 39942 30890
6686 30890 19111 -7975 -22498 -12390 -5019 146 22206 26818 16899 24605 16365 10376 10387 4051
6672 4051 -349 -11543 -23512 -24943 -8654 14183 16811 10308 12878 14294 -14968 -44995 -60147
6659 -60147 -58710 -65169 -55145 -39312 -30918 -36217 -14279 -7384 -9880 404 2 -1089 -21850 -21285
6645 -21285 -10098 9 -1057 10624 19308 14345 31688 36738 20285 12937 19600 -3430 9058
$$ packed form
6725d0523K4100j1783l906L2512M770k2984l095K1121O422p451k9187k823R195
6712b3632P003K4725j4943j1703P296K7396l344O480l313j0582l839N340J6514
6699B3398n537k9931j9189J680J4415K7319J3222o188K459L939R098N257r052
6686C0890j1779k7086j4523J0108P371N165K2060M612r919P706q240n989J1o336
6672D051m400j1194j1969j431J6289K2837K628o503K570J416k9262l0027j5152
6659f0147J437o459J0024J5833Q394n299K1938O895k496J0284m02j091k0761N65
6645b1285J1187J0107j066J1681Q684m963J7343N050j6453p348O663k3030J2488
$$ [...]
##END NTUPLES=NMR SPECTRUM
##END=
