##TITLE=Analysis number 325646
Compound Code sb 01761
Book Reference 194461
Project Code adrs fraglib
Chemist Name jom
##JCAMPDX= 6.0         $$ Bruker NMR JCAMP-DX V2.0
##DATA TYPE= NMR SPECTRUM
##DATA CLASS= NTUPLES
##ORIGIN= Bruker BioSpin GmbH
##OWNER= nmr
$$ XWIN-NMR		Version 3.5
$$ Fri Jan  5 15:25:32 2007 GMT Standard Time (UT+0h)  MAYBRIDGE\nmr@NMR_250MHZ
##.OBSERVE FREQUENCY= 250.131544655141
##.OBSERVE NUCLEUS= ^1H
##.ACQUISITION MODE= SIMULTANEOUS (DQD)
##.ACQUISITION SCHEME= undefined
##.AVERAGES= 16
##.DIGITISER RES= 18
##SPECTROMETER/DATA SYSTEM= dpx250
##.PULSE SEQUENCE= zg30
##.SOLVENT NAME= CDCl3
##.SHIFT REFERENCE= (INTERNAL, CDCl3, 0, 16.5142)
##AUDIT TRAIL= $$ (NUMBER, WHEN, WHO, WHERE, WHAT)
$$ ##TITLE= Audit trail, XWIN-NMR		Version 3.5
$$ ##JCAMPDX= 5.01
$$ ##ORIGIN= Bruker BioSpin GmbH
$$ ##OWNER= nmr
$$ C:\u/data/dgb/nmr/ADRS/620/pdata/1/auditp.txt
$$ ##AUDIT TRAIL=  $$ (NUMBER, WHEN, WHO, WHERE, WHAT)
(   1,<2007-01-05 15:25:11.52 +000>,<MAYBRIDGE\nmr>,<NMR_250MHZ>,
      <created by zg, POWCHK disabled, PULCHK disabled
       configuration hash MD5:
       49 4B E0 1D 92 C2 6B 37 9F E6 65 BC 52 41 86 1D
       data hash MD5: 64K
       20 F9 31 EB 6A 46 49 7F 4B 2F 1F 6E C8 97 54 56>)
(   2,<2007-01-05 15:25:23.95 +000>,<MAYBRIDGE\nmr>,<NMR_250MHZ>,
      <Start of raw data processing
       ef LB = 0.3 FT_mod = 6 PKNL = 1 SI = 32K 
       data hash MD5: 32K
       3C 2F EC 1A 26 1E E9 05 EA C0 86 93 B9 19 12 9D>)
(   3,<2007-01-05 15:25:25.59 +000>,<MAYBRIDGE\nmr>,<NMR_250MHZ>,
      <apk 
       data hash MD5: 32K
       EC 59 11 EC DB 58 F6 7A 38 B5 30 86 70 09 5C 1F>)
(   4,<2007-01-05 15:25:26.30 +000>,<MAYBRIDGE\nmr>,<NMR_250MHZ>,
      <abs ABSG = 5 
       data hash MD5: 32K
       9F 0E 71 BC A7 AD 1C B9 A2 D0 EF D1 32 E8 0E 7B>)
$$ ##END=
$$ 
$$ hash MD5
$$ 98 4A 10 AE 31 F3 24 D5 3A C7 F6 BE 45 EC C0 AF
##$RELAX= 
##$RELAX= 
##$RELAX= 
##$RELAX= 
##$RELAX= 
##$RELAX= 
##$RELAX= 
$$ Bruker specific parameters
$$ --------------------------
##$DU= <C:\u>
##$EXPNO= 620
##$NAME= <ADRS>
##$PROCNO= 1
##$TYPE= <nmr>
##$USER= <dgb>
##$AMP= (0..31)
100 100 100 100 100 100 100 100 100 100 100 100 100 100 100 100 100 100 
100 100 100 100 100 100 100 100 100 100 100 100 100 100 
##$AQSEQ= 0
##$AQ_mod= 3
##$AUNM= <au_zg>
##$AUTOPOS= <3 >
##$BF1= 250.13
##$BF2= 250.13
##$BF3= 250.13
##$BF4= 250.13
##$BF5= 500.13
##$BF6= 500.13
##$BF7= 500.13
##$BF8= 500.13
##$BYTORDA= 1
##$CFDGTYP= 0
##$CFRGTYP= 5
##$CHEMSTR= <none>
##$CNST= (0..31)
1 1 145 1 1 1 1 1 1 1 1 1 1 1 1 1 1 1 1 1 1 1 1 1 1 1 1 1 1 1 1 1 
##$CPDPRG= <>
##$CPDPRG1= <>
##$CPDPRG2= <>
##$CPDPRG3= <>
##$CPDPRG4= <mlev>
##$CPDPRG5= <mlev>
##$CPDPRG6= <mlev>
##$CPDPRG7= <mlev>
##$CPDPRG8= <mlev>
##$CPDPRGB= <>
##$CPDPRGT= <>
##$D= (0..31)
0 1 0 0 0 0 0 0 0 0.06 0 0 0 0 0 0 0.0002 0 0 0 0 0 0 0 0 0 0 0 0 0 0 
0 
##$DATE= 1168010710
##$DBL= (0..7)
120 120 120 120 120 120 120 120 
##$DBP= (0..7)
150 150 150 150 150 150 150 150 
##$DBP07= 0
##$DBPNAM0= <>
##$DBPNAM1= <>
$$ [...]
##$SUBNAM7= <"">
##$SUBNAM8= <"">
##$SUBNAM9= <"">
##$SW= 20.6930455092707
##$SWIBOX= (0..15)
0 0 3 0 0 0 0 0 0 0 0 0 0 0 0 0 
##$SW_h= 5175.983436853
##$TD= 65536
##$TD0= 1
##$TE= 294.16
##$TE2= 300
##$TE3= 300
##$TEG= 300
##$TL= (0..7)
0 120 120 120 120 120 120 120 
##$TP= (0..7)
150 150 150 150 150 150 150 150 
##$TP07= 0
##$TPNAME0= <>
##$TPNAME1= <>
##$TPNAME2= <>
##$TPNAME3= <>
##$TPNAME4= <>
##$TPNAME5= <>
##$TPNAME6= <>
##$TPNAME7= <>
##$TPOAL= (0..7)
0.5 0.5 0.5 0.5 0.5 0.5 0.5 0.5 
##$TPOFFS= (0..7)
0 0 0 0 0 0 0 0 
##$TUNHIN= 0
##$TUNHOUT= 0
##$TUNXOUT= 0
##$USERA1= <user>
##$USERA2= <user>
##$USERA3= <user>
##$USERA4= <user>
##$USERA5= <user>
##$V9= 5
##$VALIST= <valist>
##$VCLIST= <CCCCCCCCCCCCCCC>
##$VD= 0
##$VDLIST= <DDDDDDDDDDDDDDD>
##$VPLIST= <PPPPPPPPPPPPPPP>
##$VTLIST= <TTTTTTTTTTTTTTT>
##$WBST= 1024
##$WBSW= 4
##$XGAIN= (0..3)
0 0 0 0 
##$XL= 0
##$YL= 0
##$YMAX_a= 284975
##$YMIN_a= -350321
##$ZGOPTNS= <>
##$ZL1= 120
##$ZL2= 120
##$ZL3= 120
##$ZL4= 120
##$ABSF1= 16.51421
##$ABSF2= -4.178963
##$ABSG= 5
##$ABSL= 3
##$ALPHA= 0
##$AQORDER= 0
##$ASSFAC= 0
##$ASSFACI= 0
##$ASSFACX= 0
##$ASSWID= 0
##$AUNMP= <proc_1d>
##$AZFE= 0.1
##$AZFW= 0.1
##$BCFW= 0
##$BC_mod= 0
##$BYTORDP= 0
##$COROFFS= 0
##$CY= 12.5
##$DATMOD= 1
##$DC= 0
##$DFILT= <>
##$DTYPP= 0
##$F1P= 14.0000005364418
##$F2P= -0.99999901652339
##$FCOR= 0.5
##$FTSIZE= 32768
##$FT_mod= 6
##$GAMMA= 0
##$GB= 0
##$INTBC= 1
##$INTSCL= 1
##$ISEN= 128
##$LB= 0.3
##$LEV0= 0
##$LPBIN= 0
##$MAXI= 10000
##$MC2= 0
##$MEAN= 0
##$ME_mod= 0
##$MI= 0
##$NCOEF= 0
##$NC_proc= -5
##$NLEV= 6
##$NOISF1= 0
##$NOISF2= 0
##$NSP= 0
##$NTH_PI= 0
##$NZP= 0
##$OFFSET= 16.51421
##$PC= 1
##$PHC0= 223.676
##$PHC1= 8.73396
##$PH_mod= 1
##$PKNL= yes
##$PPARMOD= 0
##$PSCAL= 4
##$PSIGN= 0
##$REVERSE= no
##$SF= 250.130001947373
##$SI= 32768
##$SIGF1= 0
##$SIGF2= 0
##$SINO= 400
##$SIOLD= 32768
##$SREGLST= <1H.CDCl3>
##$SSB= 0
##$STSI= 32768
##$STSR= 0
##$SW_p= 5175.98343685301
##$SYMM= 0
##$S_DEV= 0
##$TDeff= 65536
##$TDoff= 0
##$TI= <Analysis number 999999
Compound Code 99
Book Reference 9
Project Code 9>
##$TILT= no
##$TM1= 0
##$TM2= 0
##$TOPLEV= 0
##$USERP1= <user>
##$USERP2= <user>
##$USERP3= <user>
##$USERP4= <user>
##$USERP5= <user>
##$WDW= 1
##$XDIM= 32768
##$YMAX_p= 305538028
##$YMIN_p= -230392
$$ End of Bruker specific parameters
$$ ---------------------------------
##NTUPLES= NMR SPECTRUM
##VAR_NAME=  FREQUENCY,     SPECTRUM/REAL,   SPECTRUM/IMAG
##SYMBOL=    X,             R,               I
##VAR_TYPE=  INDEPENDENT,   DEPENDENT,       DEPENDENT
##VAR_FORM=  AFFN,          ASDF,            ASDF
##VAR_DIM=   32768,         32768,           32768
##UNITS=     HZ,            ARBITRARY UNITS, ARBITRARY UNITS
##FACTOR=    0.157963299565203, 1,           1
##FIRST=     4130.69931625509, 0,            0
##LAST=      -1045.28412059792, 0,           0
##MIN=       -1045.28412059792, -230392,     0
##MAX=       4130.69931625509, 305538028,    0
$$ Real data points
##PAGE= N=1
##DATA TABLE= (X++(R..R)), XYDATA
$$ [...]
23636g4935j7166J7962k1347L7546j0318q282k2901J4011L0858M738K22P207N5475
23623A3070K1477P381K3549K6961K47l3719R54m898j0986L225J4330k2048l7271
23610B272o864j7465j7878o744J5398K2788j3042M2772o698M816j8410K390N3574
23597E6909O5374k4948n8606k3678m0237j9183J2622J9886P239R309K0111J8244
23585D3042j2880J2437N339j6985j4531J792M2863M015l9764m124l358k7915m3043
23572e3112k7316k2460k9142L5074J4808L4132o263j2372l655L230j6705P513
23560g6268j0645l1329K6051L1938j8169L6854N2481L1305p887k407O693L4795
23548G3412k7042M388r861J3774K9759j3041l2358j9608o092k7070n6984m882
$$ y = [-74935, -92101, -74139, -95486, -57940, -68258, -76540, -99441, -85430, -54572, -49834, -49612, -42405, 13070, 34547, 41928, 65477, 92438, 92685, 58966, 59920, 55022, 44036, 47261, 61591, 39543, 2272, -4592, -22057, -39935, -46679, -31281, -8493, -21535, 21237, 14539, 19355, 945, 3335, 56909, 122283, 97335, 38729, 15051, -25186, -44369, -31747, -11861, -4622, 4687, 24798, 43042, 30162, 42599, 47938, 30953, 16422, 18214, 61077, 65092, 25328, 21204, 17846, -10069, -53112, -80428, -102888, -132030, -96956, -82148, -48016, -54279, -66651, -70306, -67076, -83781, -76268, -86913, -118242, -92191, -60253, -78422, -41568, 10913, 42218, 34331, 31924, 38617, 73412, 46370, 50758, 40897, 54671, 84430, 71389, 39031, 19423, 13331, -13739, -70723, -75605]
23536g5605O1846K2002Q724o740K0650J9350m1511m4630K8611N5274M9242l0647
23524F6566k5023n3050j6891J4279N7181O697m4641j7930l2136K7115K8118K629
23512A2914j3552k1365K7982m920J7477l7661j1367L6463m8092L7614M3771o5658
23500b6394l017q324r863l6435j8189K2746P2779Q015k4742l4064J3248M0865
23488c375J154K8781O951n026m6946L2359o215p5641l3865K2638O8314Q478K1382
23475A8989r39l2957l1630K0402k1672k2568J4509L316K3264o564Q555J9827k0840
23462b8308L7357K2135k3092j0065j7726K1099J0354Q735k1462J5584L7175J4460
23450F6246m005K6499m0611o6097n865J9017q2453J0928J0156L7363j9864K9235
$$ y = [-75605, -13759, 8243, 16967, 10227, 30877, 50227, 8716, -35914, -7303, 47971, 97213, 66566, 41543, -11507, -28398, -14119, 43062, 49759, 5118, -12812, -44948, -17833, 10285, 12914, -638, -22003, 5979, 1059, 18536, -19125, -30492, 5971, -42121, -4507, 39264, -26394, -29411, -37735, -47598, -84033, -102222, -79476, -6697, 1318, -23424, -57488, -44240, -3375, -2221, 26560, 33511, 28485, -18461, 13898, 7683, -67958, -101823, -79185, -10871, -2393, 18989, 18050, -14907, -46537, -26135, -47807, -70375, -55866, -52550, -29286, -35850, -27295, -7468, -28308, 9049, 31184, 8092, -1973, -19699, 1400, 11754, 20489, -973, 14611, 51786, 66246, 62241, 88740, 48129, -17968, -23833, -4816, -87269, -76341, -66185, -28822, -48686, -19451]
23438a9451O6605J0853o7841M406l771m2151M787K8499j9194l0543J5053l5639
23426h8387p784J6707K1548L0582L9766M5772Q920m0211n4196m793K539N513K281
23413b1743k3930J4564K9750K5125L3656J1748k6879m2590j946L7760q946K2553
23401D9122l5759o8665m7848J8928L5029L5405N6632K4464P892m2778l3276l743
23389d597j2471j4312o9422q310M3818J1968j6768p746J9120J320J5812m5003
23377h6591J4438N087O8371M4349K9385O919l9932j4815M361J5914p792m6015
23365f321l6463N6557K5958p131M8134P958M5323m5559m5625j5691M8698R687
23353H5525k5911n9010p107j2977j6170J2246j0783K884N1535M4734n7427k5895
$$ y = [-19451, 47154, 58007, -9834, -5428, -9199, -51350, -46563, -18064, -37258, -67801, -52748, -88387, -96171, -79464, -57916, -27334, 12432, 58204, 67124, 26913, -27283, -32076, -29537, -24024, -21743, -45673, -31109, -1359, 23766, 57422, 69170, 42291, -299, -2245, 35515, 26569, 49122, 13363, -55302, -103150, -84222, -49193, -13788, 42844, 67308, 75200, 32422, -854, -4597, -17068, -31380, -100802, -109112, -65294, -53326, -70094, -77840, -58720, -57400, -41588, -86591, -72153, -67066, 1305, 45654, 75039, 81958, 42026, 27211, 31572, 47486, 39694, -6321, -42784, 13773, 39731, 32600, 80734, 88692, 134015, 88456, 42831, 27140, 75838, 85525, 59614, 604, -6503, -19480, -35650, -23404, -34187, -31303, 20232, 64966, 7539, -18356]
23341a8356K5398p4068K3675j7664J2759n324k6458k9287k6361K9025K4297O5756
23329a6608P5565m2760o6189J7640k833j2306J0272P500J7172K1877N557N1401
23317F6288j06l4115N40L3825J311N782m6448m3273M3616K878m5626k8191M9226
23304E707K152k9346j4233J1938M179j989J00608L7389j3334P255o127l9358j6328
23291D8513l3192M1482M8623R788r2188j231j9311o906M7973J8861k1841l7511
23279C060j4100O129j404J662R847L7436q677n3462N698J7935m600L7051J7949
23266E4524l6882m3236j9271N7838K5225k8515m7384k43M3168m043j4012Q084
23254d747K8195J3532l8229J0703L7054l4771l0335n0272J0047O1964L908j603
$$ y = [-18356, 7042, -67026, -43351, -61015, -48256, -53580, -80038, -109325, -135686, -106661, -82364, -16608, 58957, 16197, -49992, -32352, -35185, -47491, -37219, -29719, -12547, 9330, 14887, 66288, 66182, 32067, 32607, 66432, 67743, 73525, 27077, -16196, 27420, 30298, -15328, -43519, 5707, 7859, -21487, -35720, -23782, -19603, -21592, 79016, 116405, 103071, 110326, 104199, 64841, 48513, 15321, 56803, 105426, 115214, 23026, 21795, 2484, -4422, 43551, 62412, 40571, 3060, -11040, -4911, -6315, -4653, 5194, 42630, 33953, -19509, -13811, 4124, -476, 36575, 54524, 17642, -25594, -44865, 12973, 38198, 9683, -37701, -37944, 5224, 1181, -12831, -4747, 23448, 36980, -1249, 9454, 46508, 11737, -18598, -68870, -58823, 3141, 7049, 5446]
23242E446k4021K2269K7361K0026k5799j2176J1979r161J3006j1891k5610J6886
23230H315M9206R779n6374J4943J4167k3130j8844J6507J6752j4284l990K5925
23218C8972M3395o747l8626k9234L8370k7951K1473m685j1055k8817k6212l8321
23206f9438J5805N0979M9486K5841J3630Q220k2334K1790O452r6709l3782r740
23194c9800N277k1550L5690O034L7037l4998p4526K9668O3414n3957k8541J5432
23182f0820j1557L5212K2027j3528k3551K2596J8813j6075k226N8412l253o5807
23170c9757k2822J6895k464l5730J067L604l4385L7004O9687J3415J5372J081
23158B2967j637J5069J6034j0440o9078l8505K0561O38O6409L5447m1687J7378
$$ y = [5446, -18575, 3694, 31055, 51081, 25282, 13106, 25085, 15924, 28930, 17039, -8571, 8315, 57521, 67300, 10926, 25869, 40036, 16906, -1938, 14569, 31321, 17037, 13047, 38972, 82367, 75620, 36994, 7760, 46130, 18179, 39652, 34967, 23912, -4905, -31117, -69438, -53633, -2654, 46832, 72673, 86303, 94523, 72189, 93979, 100431, 3722, -30060, -39800, -34523, -56073, -20383, -14349, 22688, -12310, -86836, -57168, 6246, -47711, -76252, -60820, -72377, -37165, -15138, -28666, -52217, -29621, -10808, -26883, -29109, 29303, 26050, -39757, -62579, -45684, -48148, -83878, -82811, -79207, -113592, -76588, -6901, 6514, 21886, 22967, 21330, 36399, 52433, 41993, -27085, -65590, -45029, -44391, 22018, 57465, 15778, 33156]
23146C3156k0427n5870P606o389k3930O123L3117J3635J9671J9296K1278m7877
23134f11p1182Q350J3121n8846J4789L3101k4245j9174K9865K7052K8935N1673
23122C2828L5270L2437l3235p2782j8762k35k2347J436L5993J9743J0278m0667
23110b0043p0456j719K9673j2137k8005J7708M2464O1004j1535j8601J3067K7752
23098B9172J8694k3981j0656M121J2838l7915J1236m602J089m5592l4321J7956
23086f1961K8557j6399K5812P184j5976l4970R961K5721K5251l6745J9827o07
23074b4345K6502j1500M9600J3104J8978l7584n515r992k9344M2820M5687k8207
23062E0204J2914j4844N139r152m1762k7975j6722j9861j1185K0629K3566K6341
$$ y = [33156, 12729, -43141, -35535, -41924, -65854, -59731, -26614, -12979, 6692, 25988, 47266, -611, -71793, -63443, -50322, -109168, -94379, -61278, -85523, -104697, -74832, -47780, -18845, 32828, 68098, 100535, 67300, -5482, -24244, -24479, -46826, -45390, -9397, 10346, 20624, -20043, -90499, -92218, -62545, -74682, -102687, -84979, -42515, 18489, 6954, -11647, 1420, 29172, 47866, 23885, 13229, 17350, 30188, -7727, 3509, -1093, -4, -45596, -79917, -61961, -33404, -49803, -23991, -16807, -32783, -67753, -57792, -32071, -6820, -43565, -23738, -24345, 2157, -9343, 40257, 53361, 72339, 34755, 29240, 19248, -10096, 32724, 78411, 50204, 63118, 48274, 53413, 44261, 2499, -25476, -42198, -62059, -73244, -52615, -29049, -2708]
23050b708M9984J9665k5380l0951K4395R951l0580n793j1695m2961k1887j6634
23038h4594j240m172l0373L1721q103j5801o635L5347k8910o746P2820j5663l2577
23025i4926K6069M1265L1123q368K214j7731m5359R178m049L0966j2076n696j0273
23012e7663P155M271l122J6848j8593j6269J1379K19K9274l9771L1634J5537j2194
22999c1295k6240j806j0796J0495N831n228Q976K7447q053L1914n360n760J9686
22986I811J4247j9702M4538J9119k1239r683J8307J6415r507j6215j8694J8416
22974D5813J6589k0848q401o0359J6176k3411j0090N4000M1979k2840l1119m412
22962f923n0261j9707O620P5649N2929m6414k5291k3713J5488L6409M691Q550
$$ y = [-2708, 47276, 66941, 41561, 10610, 35005, 44956, 14376, 8583, -3112, -46073, -67960, -84594, -85834, -90006, -120379, -88658, -96761, -112562, -119197, -83850, -112760, -119506, -46686, -62349, -94926, -68857, -27592, 3531, -4837, -2623, -20354, -65713, -56535, -60584, -29618, -41694, -47390, -57663, -50508, -46237, -49359, -32511, -51104, -67373, -55994, -55775, -26501, -66272, -34638, -19101, -31295, -57535, -59341, -70137, -59642, -53811, -59039, -50063, -22616, -30669, 1245, -4115, -9875, 9811, 24058, 4356, 48894, 68013, 46774, 37091, 55398, 71813, 62306, 46091, 27397, 45813, 62402, 41554, 33153, -27206, -11030, -34441, -44531, 9469, 51448, 28608, -2511, -6923, -57184, -76891, -70271, 5378, 58307, 11893, -13398, -37111, -21623, 14786, 19477, 28027]
22950B8027J0404n7900J2616K2049j6113L1305J169o8793N792J6299l7868k2408
22938g5421k2060p5850M5482N2568j3074K170P7804L8212r702k8813k6194L5943
22926A065J4754k7231j4289K9221J6040K414m3748j4458O7414L7615k3284m0849
22914D664n1278J3271r389l4682J2057Q541J5370q747j0780L5632j0542M3900
22902H017M6775L1102M805j5463k3943k7619L381l619m3623n8447J8948J8600
22890d1086L8235L6931q248p9795j964K4433k6182J8908J5892K1609m831k0332
22878b6430J6885j7114J4338N0782L3895R233n6144k7091n9131p859L7057r894
22866d1473l5268o071j9899N2831P135M8657M9599r93n3521j04791j6987O6665
$$ y = [28027, 38431, -19469, -6853, 15196, -917, 30388, 31557, -37236, -31444, -15145, -53013, -75421, -97481, -173331, -127849, -75281, -88355, -86185, -8381, 29831, 20129, -8684, -34878, 1065, 15819, -11412, -25701, 3520, 19560, 21974, -21774, -36232, 31182, 68797, 45513, 4664, -46614, -33343, -42732, -77414, -65357, -56816, -41446, -50193, -60973, -25341, -35883, 8017, 54792, 85894, 90699, 75236, 51293, 23674, 27055, 23436, -20187, -78634, -59686, -41086, -2851, 34080, 25832, -53963, -55927, -31494, -57676, -38768, -22876, -1267, -6098, -26430, -9545, -26659, -12321, 38461, 72356, 81589, 25445, -1646, -60777, -68636, -31579, -41473, -76741, -82812, -102711, -49880, -42745, 5912, 55511, 54518, 997, -103794, -120781, -54116]
22854e4116J2614k838o266P922m7481K3519K7166K0792K107j2684L3406j8034
22842a3893j4721k3722Q0641O2539K2918r838k7045r031k4510J8599j8067j7454
22830B6416j7070K457j2081M457j3990P57l5563J715O822M4107J5564k1092k0021
22817a7522M6828L0710k9735R290j8629j4699l1397q355P3100J5611J1290j9273
22805D7219n6577j9563M4417L3902m910o2659J8596L1564K521l7374R651L249
22793A0036k1351M4910K5594j6595j2081K78l374L2357K0323O4645O431m4214
22781A06959j8036l6725J4970l4990Q055m3406k7872m3701K7240J3774j4534J0628
22769c7638p6957k8040N8469K7185O5047P8054J4311m0444j9072m346M0257l4827
$$ y = [-54116, -41502, -44340, -50606, -42684, -90165, -66646, -39480, -18688, -16581, -29265, 4141, -13893, -28614, -52336, 28305, 90844, 113762, 103924, 76879, 67848, 43338, 61937, 43870, 26416, 9346, 11803, -278, 4179, -9811, -9054, -44617, -42902, -36080, 8027, 23591, 2499, -17522, 29306, 60016, 30281, 39571, 20942, 6243, -25154, -33509, 39591, 55202, 66492, 47219, -9358, -28921, 15496, 49398, 44488, -18171, 425, 31989, 34510, -2864, 6787, 10036, -11315, 33595, 59189, 42594, 30513, 30791, 27417, 59774, 80097, 144742, 151173, 106959, 88923, 52198, 67168, 32178, 40233, -3173, -31045, -74746, -47506, -33732, -48266, -37638, -114595, -142635, -84166, -56981, 8066, 86120, 100431, 59987, 40915, 36569, 76826, 41999]
22757D1999o7656k3035r648O3675J6414m5225J3380L5237K1431P289J1089Q094
22745G3044Q234j8698k9438J4993j9552o5110l4061N7251M6923p819J2752K0841
22733E9360k7026j586m3266m2400k8557L238j996O6916M8659n2744O30j0942M9575
22720A9861K8329p3411n8297k842k0297O3144J5997j8401K1796l021J189K6256
22708C03k9576j7962m9576J5705M6554N7947j2334r560K461O98k2377j9856l6361
22695g3934l2918K3853J7643k4752Q2699N500M825J2206l1081K8343N9929m0599
22683C1714l0890K2186j3231p0581o4175L7896J8382o5629o094M299L9537J7726
22671g8860k3413K7271M1714J713q914N7161k6438k8915k3212J236m145K1404
$$ y = [41999, -25657, -48692, -58340, 5335, 21749, -23476, -10096, 25141, 46572, 53861, 64950, 73044, 81278, 62580, 33142, 48135, 28583, -36527, -70588, -13337, 33586, 25767, 38519, 59360, 32334, 30748, -12518, -54918, -83475, -80237, -82233, -15317, 33342, -19402, -18772, -29714, 19861, 48190, -25221, -83518, -86360, -106657, -43513, -27516, -45917, -24121, -27142, -25953, 303, -29273, -47235, -96811, -81106, -34552, 23395, 11061, 1501, 3962, 4660, -17717, -37573, -73934, -106852, -82999, -65356, -90108, -7409, -1909, 2916, 15122, -15959, 12384, 72313, 31714, 824, 23010, 9779, -60802, -124977, -87081, -68699, -134328, -140422, -136123, -96586, -78860, -102273, -75002, -33288, -31575, -40489, 16672, -9766, -38681, -61893, -60657, -64802, -43398]
22659d3398K6806j4390Q93N447q582J4645P805k6089j1998K8732M8851L77n0467
22646b1368n3857k1396K4529K4480M8848j4975k6569O5081K3532m8022m7996p207
22634e4920K5179L8765K9496K0153N472m7374k9024k6083M1886l0257q8035r867
22622a24609R6768j4382K4853Q848M2002q338n0683l4177l995K2146K8489o428
22610a9506M7746k0090j8211m3503l1551L831j6667N8110J0187l043M9682M375
22598B1360l6396k3883l0365j7211L4868N1497J5435j3448j344l262j5565L226
22586a5088J9772j0508k5146r714l708l1530L7052L8323K2397p829k5088k7119
22574c8186j0485k2755J3922K6064J6417J8927J2514m0195R141K4980j953m3932
$$ y = [-43398, -16592, -30982, -30089, -24642, -33224, -18579, -10774, -36863, -48861, -20129, 28722, 29099, -21368, -75225, -96621, -72092, -47612, 1236, -13739, -40308, 24773, 48305, 283, -47713, -54920, -29741, 9024, 38520, 58673, 64145, 16771, -12253, -38336, 3550, -26707, -114742, -124609, -27841, -42223, -17370, -8522, 33480, 25142, -25541, -59718, -63713, -41567, -13078, -19506, 28240, 8150, -10061, -53564, -85115, -81284, -97951, -39841, -29654, -32697, 16985, 21360, -15036, -38919, -69284, -86495, -51627, -130, 15305, 1857, 513, -2749, -18314, -15088, 4684, -5824, -30970, -40684, -44392, -75922, -38870, -547, 21850, 14021, -11067, -38186, -48671, -71426, -57504, -31440, -15023, 3904, 16418, -23777, -14636, 10344, 8391, -35541]
22562c5541L1272M5204k370p0893J5050J7938j8561J5047l2943j3247p4609j6032
22550a39685r157M3498J2412O3403K3932k0243r080l694J9200l7392j9212k841
22538g8859m4676J4825J1194L7138M1576K4541l4756O451j3945j9796j3446j4904
22526h4657P809l0484l9625N1045k3506o3924k6075N9511J2425L6056M7478L5166
22514a8781O210j8900M3386M5728m5901o0948l5904K4948k9468k0958L1853R3171
22502A4436J0123l7254K2341N8591J5983m7907k2231j2345J9390L3704L0640p056
22490G8415k0187J5511M21j6336m7766j2680m1199L0850J7080j3013M031J7593
22478A2720j5284j8642K6180L4999j5192j3510n5739M1134o318L9623j511n138
$$ y = [-35541, -4269, 40935, 38565, -32328, -17278, 660, -17901, -2854, -35797, -49044, -123653, -139685, -148842, -105344, -92932, -29529, -5597, -25840, -34920, -38614, -19414, -56806, -76018, -78859, -123535, -108710, -97516, -60378, -18802, 5739, -29017, -22566, -36511, -56307, -69753, -84657, -76848, -107332, -146957, -95912, -119418, -183342, -209417, -149906, -137481, -101425, -53947, -18781, -12571, -31471, 11915, 57643, 11742, -49206, -85110, -60162, -89630, -110588, -78735, 14436, 24559, -12695, 9646, 68237, 84220, 36313, 14082, 1737, 21127, 54831, 85471, 78415, 58228, 73739, 74160, 57824, 10058, -2622, -43821, -12971, 4109, -8904, -4873, 12720, -2564, -21206, 4974, 39973, 24781, 11271, -44468, -3334, -9652, 29971, 28460, 23322]
22466B3322K1966J2226O0072Q091l4299p3405n8622n412M4526M1752j1196n6950
22454b7929N6087N1666j1982j5178o367p3038M7992L2906o0782j99j078j5058
22442b2960j5590L8218n672n8843q041j179J9515k6934k2356P5824L2898m1526
22430c6646k8141L7949l4182p4160m72N6343K4213m2631K9437M0169N0761r483
22418A3157J3205k5808m9687j0230J8570J0984J3688J155J6594k7278L8925J5223
22406B8498p5r861o3288m2910P4345o764j692N8351l7166K5425P791q088L0675
22393E5241q811j4680K7034n7520r2268K5378M5858O301j40m6231l7496O8124
22381b9210K0743m6237n0679o0248Q69M727M1169N2659K1084P9788l0573l4434
$$ y = [23322, 45288, 57514, 117586, 125677, 91378, 17973, -40649, -46061, -1535, 40217, 29021, -27929, 28158, 79824, 67842, 52664, 46297, -26741, 21251, 54157, -6625, -6824, -7902, -22960, -38550, -332, -6004, -64847, -72888, -74067, -54552, -81486, -103842, -28018, 4880, -36646, -64787, -26838, -61020, -135180, -135652, -79309, -55096, -97727, -68290, -28121, 22640, 13157, 26362, 554, -49133, -59363, -40793, -29809, -16121, -14966, 1628, -25650, 13275, 28498, 28423, 18562, -44726, -87636, -13291, -20055, -21747, 36604, -562, 24863, 32654, 24566, 55241, 46430, 31750, 58784, 1264, -91004, -65626, -19768, -13467, -13607, -59838, -97334, -29210, -8467, -54704, -105383, -165631, -164762, -160035, -118866, -66207, -45123, 34665, 4092, -30342]
22369c0342j1693l2643n264J7476O5426M8682p2681o214N1661O355n6002M3766
22357A8527M2045j6765m8558J5176J442J943p0610m1108L9840N4992N7223k7014
22345B7133p4303k9452o605N6897L7225k7630L962k3665l7945J3451K4398R934
22333b6600k9273O6160M1814L099o0612m5356P857N219K1704K8406k7797M955
22321a0424L892j4645J2472J5585J8721J7471J1880l2116p119K0446K4370q325
22309E2208l7784o7840o2917l717M4676P3462M127l0166j8359j1920J1859J7539
22297b8832O8689K9053O752o4838K2318P709o14M6577N6482j5250l6031o0006
22285C2009l8259L1184p657j9585j2695k9376J2640M6975l6222j2584Q1299m767
$$ y = [-30342, -42035, -74678, -79942, -62466, 2960, 51642, -21039, -27253, 24408, 30763, -25239, 18527, 60572, 43807, -4751, 10425, 11867, 13810, -56800, -97908, -58068, -3076, 54147, 27133, -47170, -76622, -83227, -26330, 10895, -16735, -12773, -36438, -74383, -60932, -36534, -26600, -55873, 10287, 52101, 55200, -5412, -50768, -42911, -37692, -15988, 12418, -15379, -10424, -6532, -21177, -8705, 6880, 25601, 43072, 54952, 22836, 15717, 36163, 60533, 52208, 14424, -53416, -116333, -120050, -75374, -1912, 2215, -27951, -46310, -58230, -46371, -28832, 39857, 68910, 75662, 10824, 33142, 40851, 40237, 86814, 143296, 128046, 92015, 32009, -6250, 24934, 17277, -2308, -15003, -44379, -31739, 15236, -20986, -33570, 47729, 42962]
22273D2962q3822q073M5653L2915N2480l155m1544K048M4545p4338l5557M5357
22261A9471r771M0856K2854m6987L772K9872m6968p178k2064k3025m0838J4658
22249f5348L5431L5266j8107O0285N7975n4029n404k2697o6341L7762j7414l6779
22237e9400k0466j314n127N2753Q8884o8270k8010J8299m1412L8830M1450J9862
22225C6079p6728j7134l561L613n368r024J6628l289Q918L4309L8144j9403r71
22212B213m4093j0494J2854J4695M880k6060k2297R413N7700J1769j6642k9085
22200c5147l0189J5390M3477L8414l6771p391o965O921O9009Q200j2304Q269J0228
22187G1141m3099n8283K8443P753k7887j1078Q536L530J9651l2789N1518j7015
$$ y = [42962, -40860, -48933, -3280, 29635, 82115, 78960, 37416, 39464, 84009, 9671, -25886, 19471, 9700, 50556, 73410, 26423, 30195, 60067, 13099, 5921, -16143, -39168, -80006, -65348, -29917, 5349, -12758, 47527, 105502, 51473, 46069, 23372, -42969, -5207, -22621, -59400, -79866, -81180, -86307, -33554, 55330, -12940, -40950, -22651, -64063, -25233, 16217, 36079, -40649, -57783, -61344, -57731, -63099, -72123, -55495, -58784, -49866, -15557, 22587, 3184, 2213, -41880, -52374, -39520, -24825, -19945, -46005, -68302, -58889, -1189, 10580, -6062, -35147, -65336, -49946, -6469, 31945, -4826, -12217, -19182, -12261, 56748, 64948, 52644, 60913, 71141, 28042, -30241, -1798, 5955, -21932, -33010, -24474, -20944, -1293, -34082, 17436, 421]
22175D21l1132M2349K6096k9467k1717Q060j9544J9567Q4012j9232l8039l3520
22163a2146l7540K9081L7787M8019q739m3609j4370L336l1805J321O868l2351
22151e4148J9179J6341r501l5710J5664K7053k9054j3725O4104O353k0089q138
22139b1671J5265o844M4682J3159J3390l076J4806M2921N081j926p1400l1314
22127A3073j2533P78j9216k2371L6066J5359l3409p062R231J3859J3881m6735
22115c9079O009o501K6339p023p902K4043J3732R32L6367j0037r660M1883L3572
22102A02675r408q6943k7291K0614o517O0122P07m6198j7697m6665M840P6357
22090B4596L4430J5049m7705Q834k8682n5112J6882J6369J6051L6879N243k0991
$$ y = [421, -30711, 11638, 37734, 8267, -13450, -5390, -24934, -5367, 78645, 59413, 21374, -12146, -49686, -20605, 17182, 65201, 56462, 12853, -1517, 1819, -29986, -28665, -21797, -54148, -34969, -18628, -28129, -63839, -48175, -21122, -50176, -63901, 203, 6556, -13533, -21671, -6406, -13250, 31432, 44591, 57981, 54905, 69711, 112632, 117713, 115787, 44387, 13073, 540, 1318, -17898, -40269, -4203, 11156, -22253, -29315, -20084, -6225, 7656, -39079, -33070, -39571, -13232, -20255, -28157, -4114, 9618, 10550, 46917, 36880, 27220, 69103, 102675, 93267, 6324, -20967, -353, -6870, 53252, 53959, 7761, -9936, -56601, -51761, 24596, 59026, 74075, 26370, 35204, 6522, -48590, -31708, -15339, 712, 37591, 42834, 21843]
22078B1843K1510P0570m1879n0014K4062L9243k9200o6186q501M6986M0222m87
22066F8169m2079n692J1857K9063l8811l7631k7186k1843J9660j9700k4722P796
22054h1119k4541K4885N6138K8224L6050J6331k6562k0383k9814k6615j1378l4151
22042i2935K4983J6385M1617M3282L827K070p3216m1399M8819L2901m9447J0157
22030c2956j0940r87L0127N2250l7530J236p025K7056m2313p2294m5157O0727
22018g7806N244L6264K8002j3740r9534j5285o741j923O239K9392M9621M8458
22006a1809K464k1271m8117q544N565l521O2799K9641l8198j361K9916J1947k9365
21993a9854l3996L7968P947K083J3372k650n107M9879O302J624R766j525j9615
$$ y = [21843, 43353, 113923, 72044, 22030, 46092, 85335, 56135, -10051, -18552, 28434, 68656, 68169, 26090, 20398, 32255, 61318, 22507, -15124, -42310, -64153, -44493, -64193, -88915, -81119, -105660, -80775, -24637, 3587, 39637, 55968, 29406, 9023, -20791, -47406, -58784, -92935, -67952, -51567, -9950, 33332, 37159, 39229, -33987, -75386, -26567, 6334, -43113, -32956, -43896, -44883, -14756, 37494, -36, 1200, -5825, 21231, -21082, -93376, -138533, -77806, -72562, -36298, -8296, -22036, -121570, -136855, -143596, -145519, -139280, -109888, -60267, -11809, -9345, -30616, -78733, -87277, -81712, -85233, -22434, 7207, -30991, -32352, -2436, 9511, -19854, -53850, -15882, -7935, -5852, 7520, 4870, -237, 49642, 55944, 57568, 67334, 65809, 46194]
21980D6194q5177k1995J1716K0339O3178P992n1346j0219l1188l3797k338l6503
21968a23144J1682J4211J3496k648r3k8250K6673O6005M6565M0211J42m5139o2258
21955d2547o0656J6870K2044M1059M0549k3063n8383M61j5809L0862K6005n791
21943b8399l4945L941J6855m1874k4023J4714N5865j1392j5277J04562M2519k409
21931H0137l5344k7460k1226K0770k9224k0743j5853R231O0891J3670M163j2838
21919B6174l1371n574K8425m3664j3182O62M3303j5147k2977j8212O0703K8159
21907C7299m4867m2623r583J3755K1191M8527K1845j7800k587R627j8189n0449
21895c3854L5512P3851j1491j5136M3374m4786j2192j5040m5493m012j6467j619
$$ y = [46194, -38983, -60978, -49262, -28923, 34255, 42247, -9099, -19318, -50506, -84303, -86641, -123144, -111462, -97251, -83755, -86403, -86496, -114746, -88073, -22068, 24497, 64708, 64850, 19711, -42547, -103203, -86333, -64289, -23230, 17319, -5744, -64127, -63666, -79475, -48613, -22608, -28399, -63344, -59403, -42548, -84422, -108445, -93731, -37866, -49258, -64535, 40027, 82546, 80137, 44793, 17333, -3893, 16877, -12347, -33090, -48943, -39712, 21179, 34849, 39012, 26174, -5197, -10771, 17654, -26010, -39192, -38530, 4773, -10374, -33351, -51563, 9140, 37299, -7568, -50191, -59774, -46019, -24828, 23699, 45544, 27744, 25157, 34784, 16595, -33854, 1658, 75509, 64018, 48882, 92256, 47470, 35278, 20238, -25255, -29267, -45734, -47353]
21883d7353K3192p022L4887n924K1544O5375k7248n0205j5016K7921N2866q088
21871F4929q547j667K547n1895J1365k9448j8868L9483m14K6439k8923J433l4833
21858b8399l5816L2397k555o7550K1443Q593N790K0285O8549Q543l2164n5667
21846e6551J166L7693Q4157L0221j3681k7377L5324k6254o1816j0041j8893J2008
21834a4044K0004m5681K8762J9170J431k1458K2035J0299P987k7377R064L1337
21822D1529p028K310o4297K2637l3616j7826L6042L2194l0584q6852j2843J2742
21810a05592R566M7630L7276k3575r404j7432K9277j6888n9008R671P0093n9497
21798h7883J1639O0683p806m3347q384J4970M3738m030K1345l4458R104P5p0485
$$ y = [-47353, -24161, -31183, 3704, -2220, 19324, 84699, 57451, 7246, -7770, 20151, 73017, 64929, 56382, 54715, 57262, 5367, 16732, -12716, -31584, 7899, 7485, 33924, 5001, 6434, -28399, -64215, -31818, -34373, -101923, -80480, -71887, -66097, -45812, 22737, 31280, -884, -56551, -55385, -17692, 66465, 96686, 83005, 55628, 90952, 64698, 2882, -7159, -26052, -14044, 5960, -39721, -10959, 8211, 9642, -11816, 10219, 20518, 28505, 1128, 10192, 41529, 34501, 36811, -27486, -4849, -38465, -56291, -20249, 11945, -18639, -105491, -118334, -105592, -96026, -48396, -11120, -34695, -44099, -61531, -32254, -49142, -108150, -98479, -28386, -87883, -76244, -15561, -23367, -66714, -75098, -60128, -16390, -20420, 925, -33533, -24429, -24354, -94839]
21785i4839n8036l1532R8467J0543K6831N1730L9665n578j9857k6861J344J11269
21773A03146k5065o6451m6316j5916j2604K5464M8940l3460l8767K7701n174O3760
21761B5258N5826l7157m9560l3592n5640K5648N2833l2362p064K6846K276j1768
21749c8456j9448N4087L8673L7292r6499J76l745N4590j6232k7789N2144j5406
21737A9387L203l5467k3018R097L4139R3711M874q2807n2584m5117M251L0438
21725c9893L4067k1597L7326P0049j9528m4449o7429n877O2697K0475q4419j8194
21713g6772J1263L799K0857j1611L926l0942o296r646J2749M962m1772J8138j938
21700a03283L5462O885l9333K5308P33l2701K0337k3490r549J5776P1248J553
$$ y = [-94839, -152875, -184407, -85940, -75397, -48566, 3164, 42829, 37251, 17394, -9467, -8123, 103146, 78081, 11630, -34686, -50602, -63206, -37742, 11198, -22262, -61029, -33328, -38502, 25258, 81084, 43927, -5633, -39225, -94865, -69217, -16384, -48746, -55810, -28964, -26688, -38456, -57904, -3817, 34856, 72148, -24351, -24175, -27920, 26670, 10438, -17351, 34793, 19387, 22590, -12877, -35895, -26798, 7341, 101052, 105926, 23119, -29465, -74582, -70331, -39893, -5826, -27423, 9903, 79952, 60424, 15975, -51454, -57331, 5366, 25841, -58578, -76772, -65509, -61710, -40853, -52464, -48538, -79480, -85776, -95422, -82673, -77711, -119483, -101345, -103283, -67821, -60936, -100269, -74961, -74228, -106929, -86592, -110082, -119631, -103855, -32607, -31054]
21688c1054J5194Q5258P687k097k0417l4519j8530J1211m618K6713N361J0979
21676E1168M03k8102j6290j01100j1547K6203L5437K8024m14K169J5809k1170
21664a9410J8939l6818k97P755k6608j1643K653J7406J2925j323j6324L409K0524
21651b8812J1357K8388J5426k2245O7458K4496q9255q2964J101j7496J2416L5574
21639d4556M2997N623r5973O790Q467O6883j863k0834k2006J5823k7757L4923
21627c1483N6257o958k4308L383k9271j2564j6174P688N0492j511J2797j3115
21615d767L76J8952M418l3451j4538k5720k6912j1465N321l701J7508L1304O961
21602c5714Q605K4148J0575k8913m4689k9995M726J5581m417J2878N9596M9496
$$ y = [-31054, -15860, 69398, 77085, 74988, 54571, 20052, 1522, 12733, 8115, 34828, 40189, 51168, 51571, 23469, 7179, -93921, -105468, -79265, -43828, -15804, -16218, -14049, 1760, -19410, -471, -37289, -37586, -29831, -56439, -68082, -65429, -48023, -35098, -36421, -52745, -49336, -28812, -17455, 10933, 26359, 4114, 71572, 96068, 6813, -76151, -75050, -92546, -80130, -44556, -1559, 4064, -91909, -85119, -76652, -9769, -11632, -32466, -54472, -38649, -66406, -31483, 24774, 17816, -6492, -3109, -32380, -44944, -61118, -53430, -2938, -4449, 8348, -4767, -4391, 14561, 18979, -14472, -29010, -54730, -81642, -93107, -87786, -91487, -73979, -42675, -35714, -27109, -2961, 7614, -21299, -65988, -95983, -91257, -75676, -80093, -67215, -7619, 41877]
21590D1877n4289k0725r289K4155N9233k6781j7502J7966J0482q575r904p748
21578a100K4127j581j7292k4434m5703n1811M0117N5386N7283J8080l9852l6440
21566b3220j9385M8005n173J1719n6980K1453M2130p251p4956m8943N0547J8522
21554d3532k2619O7332L2803j2025l0985k563K7437K1248j8540m245M226L0868
21542D9405j6698p3577N918K0628J491k7774m6128J710P6644O2591k2066j7733
21530A4411m9400m0947J0785L4805N1944k2724j1101M851j0578P969K1263K3360
21518C4638j9332l8944l2728k0775m3572K3801K2767K3686J9058J3143K4186m481
21506A447m6697l2708Q251L3947J6878J1107M6820j3026q861r2863k4873o110
$$ y = [41877, -12412, -33137, -42426, -18271, 40962, 14181, -3321, 14645, 25127, 16552, 6648, -1100, 23027, 21446, 4154, -20280, -65983, -117794, -77677, -22291, 34992, 53072, 13220, -23220, -42605, 5400, 227, 11946, -45034, -23581, 18549, 11298, -63658, -112601, -62054, -43532, -66151, 1181, 33984, 21959, -9026, -11589, 15848, 37096, 18556, 14311, 18537, 49405, 32707, -40870, -34952, -14324, -12833, -40607, -86735, -85025, -8381, 54210, 32144, 14411, -34989, -75936, -65151, -30346, 21598, -1126, -12227, -7376, -17954, -9985, 11278, 34638, 15306, -23638, -56366, -77141, -120713, -96912, -74145, -50459, -31401, -18258, 5928, 1447, -45250, -77958, -69707, -35760, -18882, -7775, 39045, 26019, 17158, -75705, -100578, -106688]
21494a06688M7027P0363j9725l7533Q352k177J6496J0859k7306K255j0565J7562
21482c1080J5291m0387j3652L086L3415K7079M7985j7190r4187m315L4519K7260
21470a2176K5980l7048M1029K1574J5077m6034o9622l9509m0732Q693N3052P0712
21458i004N6943K6247m2188n4882m3096k0624k3960J9594M8285J1080j424M2000
21446H971L2721n6703n4003J1335O4822K5256k935m5731n9837L764L8505n73K0023
21433a4385Q247J8456k0099J8211Q941J8208L263q303k8033J6113l3682j9712
21421c2775K2923l7031P002k2443l2617L0169n857k5904M5756N3511K4900J0800
21409C8434j7204l1805r520k192J2594j0352j6472m4931j2810o418L2159J4830
$$ y = [-106688, -59661, 10702, -9023, -46556, -38204, -40381, -23885, -13026, -40332, -38077, -48642, -31080, -15789, -56176, -69828, -66742, -33327, -6248, 41737, 24547, -69640, -73955, -39436, -12176, 13804, -23244, 17785, 39359, 54436, 8402, -61220, -100729, -141461, -132768, -79716, -9004, 47939, 74186, 31998, -22884, -65980, -86604, -110564, -90970, -42685, -31605, -33029, 8971, 41692, -15011, -69014, -57679, 7143, 32399, 29464, -16267, -76104, -72340, -33835, -34408, -14385, -6138, 12318, -7781, 10430, 19371, 37579, 40842, 32539, 4506, 20619, -13063, -32775, -9852, -46883, -39881, -62324, -94941, -64772, -70629, -96533, -50777, 2734, 27634, 38434, 21230, -10575, -20095, -22287, -9693, -20045, -36517, -81448, -94258, -100676, -68517, -53687]
21397e3687J6562j7956M213p362J5896j082m103L8040O313j1404j8310l1180k5207
21384h9267J5865N2302K1758J2591k7358m2928n534O5582R0033j3041l3784k6091
21372B0128k4287m3018K204J8308k0802L1514K2652m8582o4688l1010L1980k0157
21360a25758K664L8202Q5961k0440j1168N7276k6711l2349m217N499N7683j8444
21348H198m3619o0784k0097L9086M6976j5283j5636O3054N8657l0880n3600l0625
21336e4553l2807L0055J6756J2328j6379j5967L322m5831j2504M4540R426q8343
21324a49957K3113M2819J3803P251r611M0298K4147K4308k0996J9791N1152J0791
21312G6909m1875k5381k6312j8578K0415J6533K213k2165J5360K9958L5728N6120
$$ y = [-53687, -37125, -55081, -50868, -58230, -42334, -43416, -47519, -9479, -3166, -14570, -32880, -64060, -89267, -73402, -21100, 658, 13249, -14109, -57037, -62571, 3011, 93044, 80003, 46219, 20128, -4159, -47177, -44973, -26665, -47467, -15953, 6699, -41883, -106571, -137581, -105601, -125758, -123094, -84892, 1069, -19371, -30539, 26737, 26, -32323, -36540, -31041, 26642, 8198, -35421, -96205, -116302, -77216, -30240, -45523, -61159, 1895, 60552, 29672, -23928, -54553, -87360, -57305, -40549, -28221, -44600, -60567, -57245, -103076, -115580, -71040, -61614, -149957, -126844, -84025, -70222, -62971, -72582, -32284, -8137, 16171, -4825, 14966, 66118, 76909, 35034, 9653, -16659, -35237, -14822, 1711, 3924, -18241, -2881, 27077, 62805, 118925]
21300A18925m4945j6422l9162k7938N619l1960o042L708O9300K0975L6885K3232
21288A12175k99k6170J145L9490J7891r659n5317o8012k8748M8306K0288m3514
21276G576k548M4499q772K6985m2397n7856k9768J3488N2493l0317j2410M310
21264c4717M260p3436q755J9611O2630K1738l0730j9703K9546L529j8477k6786
21252g1290L5088l2112K755j4432K3556o462M4207j3222j4729M7910R587l2413
21240b1557k3005k490p729L4486k1465P275l2102k2941L499k2825L7010M1278
21228c0566M8363m1217n0742m295M0059l508j903M6681N5560m0946k0296l8877
21216d1687k3513k6430O0775R08k9195Q861K7131j1121k9949L8517L0266k0451
$$ y = [118925, 73980, 57558, 18396, -9542, -3923, -35883, -41925, -38217, 31083, 52058, 88943, 112175, 111876, 85706, 86851, 126341, 144232, 134573, 79256, 11244, -17504, 30802, 51090, 7576, 5028, 49527, 40755, 67740, 25343, -32513, -62281, -48793, 3700, -26617, -39027, -34717, -30457, -103893, -112648, -93037, -30407, -8669, -39399, -59102, -29556, -26027, -44504, -71290, -36202, -68314, -65559, -79991, -56435, -62897, -18690, -31912, -46641, 1269, 10856, -21557, -44562, -47052, -54781, -20295, -41760, -34485, -66587, -89528, -86029, -108854, -71844, -30566, 17797, -23420, -74162, -78457, -38398, -41906, -43809, 2872, 58432, 17486, -2810, -41687, -65200, -91630, -30855, -29947, -59142, -50281, -23150, -34271, -64220, -25703, 4563, -15888]
21204a5888M7937L8059q9029m3106J0414k381L3948M1914o6523j13131J155K8793
21192a27838N7954J4323M0440j8292k4644K7396j5210j3279j5718o722K0579K5671
21180c5340l3150l4297O7801M6807Q705q854r902K2700J1842k5989m5582j3062
21168d8321P8825L1510j7918J123l1718P2157l5912r1289k6144J3048j9313J4952
21156e9000o345P927J2214l151k706j8093J0605q36p967j4758L0766R0910k1507
21143A8059k8168M8246p846n4739l7159Q771l5452N736K595L222j0362M1121O18
21130d5358j3010n1666l118L4724N6096K8775k5219L423k4519L9501J8217l9527
21118b1681q8768n3493Q5610P4167k574l1035k4672k2676Q0411m5491m8500l754
$$ y = [-15888, 32049, 70108, -18921, -62027, -51613, -53994, -20046, 21868, -44655, -157786, -156631, -127838, -69884, -55561, -15121, -33413, -58057, -30661, -45871, -59150, -74868, -81590, -61011, -35340, -68490, -102787, -34986, 11821, 20526, 11672, 1770, 24470, 36312, 10323, -35259, -48321, 30504, 62014, 44096, 45219, 13501, 85658, 49746, -41543, -67687, -54639, -73952, -59000, -65345, -57418, -45204, -48355, -51061, -69154, -58549, -59385, -67352, -82110, -51344, 39566, 18059, -10109, 38137, 30291, -24448, -61607, -52836, -88288, -82552, -79957, -76735, -87097, -45976, -45358, -58368, -110034, -113152, -78428, -22332, 6443, -18776, -15353, -39872, -371, 17846, -21681, -110449, -163942, -78332, -4165, -6739, -37774, -62446, -85122, -4711, -50202, -98702, -102456]
21106a02456j3327l7602K3416O921L162L4588O0848r923l2507N391k0045m9735
21094a31269p021L6542O4077L6845m6086k8962J5376M0092M1271j2351j02094
21083i3580o0627J087Q6067K4882k4983k3394M8273L7604J4338J3040j1657l1842
21071b0792k0135j3403L1996P3156l0464j281k828O148J783l9583m709N701j3732
21058b8143n8112O2685O1941J2641o4451n7572K5091l71k142k7696L5543K0412
21046b0174k8904l8985J7435K1269K2026o0255l9006J0927N6718M7192J4524m451
21034a684j9593K3232K7000m7462m8582M832J3949L6838N7875m618P08r018j8616
21021A4861K4910l6061o2491J6288K6927P298N081K4930Q422j2173m4881l6753
$$ y = [-102456, -115783, -153385, -129969, -123048, -119886, -85298, -24450, -34373, -66880, -61489, -81534, -131269, -138290, -101748, -37671, -826, -46912, -75874, -60498, -20406, 20865, 8514, -93580, -154207, -153120, -67053, -42171, -67154, -90548, -42275, -4671, 9667, 22707, 11050, -20792, -40927, -54330, -22334, 50822, 20358, 19077, 16249, 22397, 24180, -15403, -20112, -14411, -28143, -86255, -23570, 38371, 51012, -13439, -71011, -45920, -46291, -48433, -76129, -40586, -20174, -49078, -88063, -70628, -49359, -27333, -87588, -126594, -115667, -58949, -11757, 2767, -1684, -21277, 1955, 28955, -18507, -67089, -62257, -48308, -11470, 46405, 41787, 42495, 33477, 14861, 39771, 3710, -58781, -42493, -15566, -8268, -3187, 21743, 30165, 17992, -26889, -63642]
21009f3642K9584j350L6094M3109J0192l3857q3731p6970K7785P8402j518k1671
20997e7573M5306L8246P579l4232K5645k0085j8189m2447q390J4868M4593j4887
20985a9566J0122k9140m1285K091L5099O5270O3432r81n7882m3092j703L5108
20973A7473J2522L1798o4867n2070j620n696K4930J8201N0890p619o0968n8123
20961i5149m513p364J1543K1132P04M5602L7285L0886J8729J6109m7949k4386
20949B629Q184l2652J5735M0395p762j7306j9999n338l7411P09m428K1987J9386
20936a5871K3013k1886l9604o582L1809n719m0109N9193J4141k3413j6617k5376
20924f7021k9899j7786o4931K3678L4340K9450J5049j9105L7571L4515J6594m2934
$$ y = [-63642, -34058, -35408, 686, 43795, 53987, 20130, -63601, -140571, -112786, -34384, -35902, -57573, -12267, 25979, 33558, -674, 24971, 4886, -13303, -55750, -64140, -49272, -4679, -19566, -9444, -38584, -79869, -77778, -42679, 22591, 86023, 85042, 27160, -15932, -17635, 17473, 29995, 61793, -3074, -55144, -56764, -62460, -37530, -19329, 31561, 23942, -37026, -95149, -99662, -107026, -95483, -74351, -73647, -28045, 9240, 40126, 58855, 74964, 27015, 2629, 10813, -21839, -6104, 34291, 26529, 9223, -10776, -16114, -53525, -52816, -57244, -35257, -15871, 7142, -14744, -54348, -60930, -29121, -34840, -74949, -15756, -1615, -25028, -41645, -67021, -96920, -114706, -179637, -155959, -121619, -92169, -77120, -96225, -58654, -24139, -7545, -50479]
20912e0479l6865R0944J636p819M9919M902J3438L3391k4926k4011l5850m7763
20900c3483Q640J7766p968j4708n9396j4048K0075m437O0535j2467j3326M1579
20888a1238J3827m3828o9269o183Q250n3843j6087N0518J4358K8927J9300n1912
20876a17180L4028o225m690N1390J5231j7984K6662K249J8097m7117M4414M4081
20864D2956J3612m0852l2392l2331L0004Q3697J4540m0279m9705L324j568l7491
20852d6485j9827R108l6161K6492M6852J2834m4441l4040j4773m030M0635O3949
20840A13N4396K5632m5697n3634Q618q046j4760k1951j1825J1518N1556K6832
20828B2752J9896j2668K627m1297J174N0183k0525q858p2766J8593K3065K63J8127
$$ y = [-50479, -87344, 3600, 5236, -2583, 47336, 52238, 65676, 99067, 74141, 50130, 14280, -33483, -24843, -7077, -15045, -29753, -89149, -103197, -83122, -87559, -27024, -39491, -52817, -11238, 2589, -41239, -110508, -116691, -108441, -162284, -178371, -127853, -113495, -84568, -65268, -117180, -83152, -89377, -94067, -42677, -27446, -45430, -18768, -16519, 1578, -45539, -1125, 42956, 56568, 15716, -16676, -49007, -19003, 64694, 79234, 38955, -10750, -7426, -8994, -46485, -66312, -57204, -93365, -66873, -20021, -7187, -51628, -85668, -100441, -104471, -63836, 113, 54509, 80141, 34444, -19190, -10572, -18618, -33378, -55329, -67154, -55636, -4080, 22752, 42648, 29980, 32607, -8690, -7516, 42667, 22142, 13284, -59482, -40889, -17824, -17561, 566]
20815E66K4983Q749l5488j8227m019J1229j8273l2639J3826L2591K5114K7667
20803C6079k2762k4536L2298k0064J0749m958m6027l0342L851k0250K8878N5732
20791a352M3565k6998m4684p67l1410J0998j3396N58N3438L235k7673j537P334
20778b8689K0951o8299l6814K588K1726Q1153N6014l222o5295n3786L1585J8499
20766b3589M2837j3545P623j6259m0714J4800K194J7161P1490j2725l8005N060
20754A6328j629m7550n05N8682Q868L8102j4484j8036M6246l9308l6872q0263
20742g0421j1499N4346N2857k7997n6686k7880M8042j809L6476L4019k2642l9226
20730c2420o1343J124N0116L0617M494Q074M7139K582m8137k6777n1102J9079
$$ y = [566, 25549, 34298, -1190, -19417, -23436, -12207, -30480, -63119, -49293, -16702, 8412, 36079, 13317, -11219, 21079, 1015, 11764, 6806, -39221, -69563, -65712, -85962, -57084, -1352, 42213, 15215, -29469, -30236, -61646, -50648, -64044, -63486, -10048, -6813, -34486, -36023, -28689, -7738, -76037, -112851, -110263, -88537, -7384, 48630, 45408, -19887, -73673, -42088, -23589, 19248, 5703, 13326, -2933, -43647, -28847, -26653, -9492, 61998, 49273, 11268, 16328, 14699, -32851, -33356, 25326, 34194, 72296, 57812, 39776, 86022, 46714, 9842, -70421, -81920, -27574, 25283, -2714, -59400, -87280, -39238, -41047, -4571, 29448, 6806, -32420, -93763, -92639, -42523, -11906, -7412, 662, 47801, 50383, 2246, -24531, -75633, -56554]
20718e6554O0705L5699j679l3054p2278j4083L1654M2786m105K38m7221o0740
20706a18632l4799o867R037K2386K2368j1707m3091k0169P2968O1371k1290Q23
20694f7602M166j708K0466Q1678k1790j16723l7366J4858M025k402K4006L423
20682i4969M3809N130l6481m6825l721M5069Q4250N3199M2327R700l0967k4990
20670D5531J954N603l9092l2341P831M530j1514j9386j2621l784L8804M0499L8385
20657F4399k4785K7909J4277n6088l831L1874r112j3070l3963j4885n0797l2714
20645a00786K7126K0074J8454K1651J3658k5630l2250j4869m6523j4622M4430
20634h9287L8477j9162M770L4643N1372K4287L8926J9434k5226J8417l4435k3105
$$ y = [-56554, 4151, 39850, 38171, 5117, -67161, -81244, -49590, -6804, -10909, -10671, -57892, -118632, -153431, -160298, -151261, -128875, -106507, -118214, -161305, -181474, -108506, -47135, -68425, -67602, -63436, -65144, -44678, 37000, 15210, -101513, -138879, -124021, -119996, -122398, -98392, -94969, -51160, -46030, -82511, -129336, -133057, -87988, -3738, 49461, 91788, 101488, 70521, 45531, 47485, 53088, 13996, -18345, -10514, -5984, -17498, -36884, -49505, -53289, -14485, 26014, 64399, 39614, 67523, 81800, 25712, 21881, 53755, 44643, 31573, -2390, -17275, -68072, -100786, -73660, -53586, -35132, -13481, 177, -25453, -57703, -72572, -119095, -133717, -89287, -50810, -69972, -65202, -30559, 20813, 45100, 84026, 103460, 78234, 96651, 62216, 39111]
20622C9111n8125l2746m1846J339j1293K2863M1604N0317j844m4809l758M7231
20610H044K5273J3730o601j6005o2430l7973P945J1346R407N0592m3212k973L8617
20597d240k4503J8077K2359K446J4396m2461l2109j338L6456K1282j8276n3866
20585f1777n4033J9268J8450k2121J3899k134n040L4430N1535k4029o6776K4233
20573g4095J1144l0387k5118m4598P2814O5571K6234m5829J9836M6001K8707p375
20561D2905l2394j3346m5420k475q258L2008J9749k156J3134l6978q2882K5056
20549i1057N4015Q8612j4410o1174l5600o0985L3805L5456J8002K749K6717K5297
20537B1427k7644L669N69l8369l9425K1852r177J3021p396L5569M4220k8289l8690
$$ y = [39111, -19014, -51760, -93606, -92267, -103560, -80697, -39093, 11224, 9380, -35429, -39187, 8044, 33317, 47047, 40446, 24441, -37989, -75962, -68017, -56671, -47264, 3328, -39884, -42857, -4240, -28743, -10666, 11693, 14139, 28535, -13926, -46035, -47373, -10917, 10365, -7911, -61777, -115810, -96542, -78092, -100213, -86314, -88448, -93488, -59058, -7523, -31552, -98328, -74095, -62951, -93338, -118456, -163054, -90240, -24669, 1565, -44264, -24428, 21573, 50280, 42905, 10511, -2835, -48255, -50730, -58988, -26980, -7231, -9387, 3747, -33231, -116113, -91057, -37042, 51570, 37160, -24014, -59614, -120599, -86794, -51338, -33336, -30587, -3870, 21427, -6217, -2548, -1979, -40348, -79773, -57921, -67098, -54077, -61473, -25904, 18316, -9973, -48663]
20524d8663K247M740k049K0529N8080k6690o5153k3038J0127J5431J4939k2423
20512f1923j0274M32l4323O7215O8901L2093j02227o0375k3089K8633L4847o2436
20500a22526l06K8946J7625J5193L5720J7638n9873l2560K5173n248L6249J7404
20488b6565k0450k203j5754M2516K5317k3994J024k5127O637P4521K0515k851
20476E3586j3799j8778j2383j7999l4791N849j9950n9215k3534K4383N1075L6502
20464b9054k9817J622K4692q729p993j1524L7746N1554p5807j4704K5195n287
20452d2106j8511J3971j5293J7678K3605q1592L3047M9562k7848k1375l2631O3394
20440c8099M2557l2411J8538O76n7654R682J4267k925M7506K119j4209j0363k2452
$$ y = [-48663, -46416, -41676, -43725, -23196, 34884, 8194, -56959, -79997, -69870, -54439, -39500, -61923, -72197, -71765, -106088, -38873, 30028, 62121, -40106, -100481, -123570, -94937, -60090, -122526, -122832, -93886, -76261, -61068, -25348, -7710, -67583, -100143, -74970, -80218, -43969, -26565, -47015, -49218, -64972, -22456, 2861, -21133, -20109, -45236, -38599, 35922, 56437, 53586, 39787, 21009, 8626, -9373, -44164, -38315, -58265, -117480, -141014, -116631, -65556, -29054, -58871, -57249, -32557, -41286, -49279, -60803, -23057, 28497, -47310, -62014, -36819, -42106, -60617, -46646, -61939, -44261, -20656, -102248, -69201, -19639, -47487, -68862, -101493, -38099, 4458, -27953, -9415, -8739, -66393, -56711, -42444, -45369, 2137, 4256, -9953, -20316, -42768]
20427d2768k1098l9133j4126o336N5979N5085J2097m2876J7888K7291J163j6721
20415a3555m5174J1364l3937K794J847l7076M4892K8595k4913k6607K3717J1539
20403e6514k3609J5719n521l4866K1567L4342L5475m1986k0382N5206M8518o7377
20391c9428j9772P290L5321K651o6539l6647l2769J4009K5114L9493M4744K9526
20379B993N425k0503m9982j690o911j6395R624k069K2144M2817J3278l2951m7870
20366h2090l0638K809L8488M135j2858L571N77j019r151j6845P1430J8202n072
20353a8461P890J1372q943j4461j666m9027j5812J2597M414P3301K6883n7044
20341b8957m8045K896j753J2346l9830K5901L8570j0022j548M3162j7210M0968
$$ y = [-42768, -63866, -102999, -117125, -123461, -67482, -12397, -300, -43176, -25288, 2003, 3166, -13555, -58729, -47365, -81302, -78508, -76661, -113737, -68845, -40250, -65163, -91770, -68053, -56514, -80123, -64404, -69925, -104791, -83224, -48882, -13407, -55393, -75775, -20569, 27949, -39428, -59200, -51910, -16589, -13938, -80477, -117124, -149893, -135884, -110770, -71277, -26533, 2993, 8418, -12085, -62067, -63757, -70668, -87063, -77439, -79508, -57364, -14547, -1269, -34220, -82090, -112728, -109919, -71431, -67296, -80154, -76583, -76006, -77025, -86176, -103021, -31591, -13389, -18461, -10571, 801, -8142, -22603, -24269, -73296, -89108, -76511, -72097, 1204, 28087, -28957, -77002, -74106, -75859, -63513, -103343, -77442, -38872, -48894, -50442, -7280, -24490, 16478]
20329A6478N9512l1833m8988J5365j6804k4101K0875L7212K6870K6839m0915l4514
20317E996m0197L5076N4643J5309o0368k35k0993L8725L4791q941l3151M967n1806
20304b6184R523K8170J4766p2719l0838O8891J4636j2680l7436l9686L0691N0675
20292b191O4691j9202M35M95k544R61l8430R803K5932l2259m5718M0508J0962
20279A3443k6396l2726k0607N9071L3862Q430Q21l5920l3293k9889k9121K7859
20267f4466N4079k9669N3707K5469o0923j031o2663l3893L3820M8289Q2653n6645
20255a1273n2906J3020M4681K0288n170K3241K4645k2480n2743j4347J8339j591
20243a6296l6010O4227J6873k11j6858k78m9346m078J9943k6132N312N7447K355
$$ y = [16478, 75990, 44157, -4831, 10534, -6270, -30371, -9496, 27716, 54586, 81425, 40510, 5996, -34201, 875, 55518, 70827, 10459, 10224, -10769, 27956, 62747, 53806, 20655, 25622, -26184, -16661, 11509, 26275, -46444, -77282, -8391, 6245, -6435, -43871, -83557, -52866, -2191, 62500, 43298, 43733, 44228, 41684, 42645, 4215, 14018, 39950, 7691, -38027, 2481, 13443, -12953, -45679, -66286, -7215, 26647, 35077, 35898, -22, -33315, -63204, -92325, -64466, -10387, -40056, 13651, 39120, -21803, -22834, -85497, -119390, -85570, -37281, 45372, -11273, -64179, -51159, -6478, 13810, 8640, 31881, 56526, 34046, -18697, -33044, -14705, -16296, -52306, 11921, 28794, 28583, 11725, 11447, -37899, -41977, -22034, -48166, -42854, 14593, 16948]
20230A6948l3217j3615Q514K0498k4743k735n1211j8490J9593K5732K9027J6969
20218f730j8035p2576rM2155P2264n685p1902o8906J4435L2554N6624k1363p45
20205d7919J2504O330L6811J1167j7412M0832J7427m5299l7455K0178k2117k5435
20193e0388k8307R297K7102P424K2381N497p047k5447q6316R6431L4113n2040
20181d7300J8563J8223l6370l2133K0410R073K1447J5465l3792r494k4959K4551
20169e6316o052k3715p908L7480r55N747l346m7369m2826P21J7548Q506m5148
20156a63633m3444J0289j1495k2109L1783N2617L591K8314k5337k998K6802N8032
20144e7588L6068l6885n7149L1730N4639N428m2886k4758J7901J2946j9866L5036
$$ y = [16948, -16269, -29884, -21370, -872, -25615, -28350, -79561, -98051, -78458, -52726, -23699, -6730, -24765, -97341, -97350, -55195, 17069, 11384, -60518, -129424, -114989, -82435, -25811, -47174, -47919, -35415, -29085, 7726, 18893, 1481, 42313, 59740, 14441, -23014, -2836, -24953, -50388, -78695, -69398, -42296, -34872, -12491, -6994, -14041, -39488, -125804, -29373, 4740, -47300, -28737, -10514, -46884, -79017, -58607, -49534, -28087, -12622, -46414, -55908, -80867, -56316, -62368, -86083, -93991, -56511, -57466, -51719, -55065, -102434, -145260, -144539, -126991, -118485, -163633, -207077, -196788, -208283, -230392, -198609, -145992, -142401, -114087, -139424, -142422, -115620, -57588, -21520, -58405, -115554, -83824, -29185, -23757, -66643, -91401, -73500, -60554, -80420, -45384]
20132d5384M7193L0780j0852l3303j8483n3331k9385K2587K0240j7760l3372L7298
20120h3772O3007N8772M1017J2179k4130q5292n1770n4321R435R3497M6603l3570
20108h345M168k0843l5308M6930K4918m026N234K8460m0603m8570o3957o514j8451
20095a36907K7799L5913M9178k0650n2277L3828k6072r050L6491L1759J5411n122
20083a9699k6226k6482K6205m2568P796p383K4649K8850k8679l1742K7833m5474
20071a12920n4490N0847L9806J3408J6932O3247O5193M255j2300j7175k0628o9485
20059c3310k059Q612Q256R324n5927l0699M2464j0088L9868R556o0193l4450M0014
20046f8632N1160J3551M818j5171n5735M0346M6805J7052j5044K8535J6070j4180
$$ y = [-45384, 1809, 32589, 21737, -11566, -30049, -83380, -112765, -90178, -69938, -87698, -121070, -83772, -20765, 38007, 79024, 91203, 67073, -18219, -69989, -124310, -114875, -21378, 25225, -8345, -4177, -25020, -60328, -13398, 11520, 7494, 12728, 41188, 585, -47985, -111942, -118456, -136907, -109108, -73195, -24017, -44667, -96944, -63116, -89188, -98238, -61747, -29988, -14577, -19699, -45925, -72407, -46202, -88770, -80974, -88357, -63708, -34858, -63537, -95279, -67446, -112920, -167410, -116563, -76757, -63349, -46417, 16830, 82023, 86278, 73978, 56803, 36175, -33310, -35369, -26757, -18501, -9177, -65104, -95803, -53339, -63427, -23559, -14003, -74196, -108646, -68632, -17472, -3921, 897, -14274, -70009, -29663, 17142, 34194, 19150, 47685, 63755, 49575]
20034D9575N393o886m4457k1530o695K4147O781K8041r051R581K6077j2037q7475
20021c8536j0926o955j0568l8853q0M4591L5438l410J1194J4017O9126L5726j8876
20008H1888j0874k0326K915p0636j4719J7886J0471L7753Q5402L5686o8665p5635
19996A1146n521L9333m6220k2862M254K6532r547R779J9303N870J0525l9531q7905
19983h4844l263N603K371o4401k3039K5347N5641J4640o484L9926M017n908K790
19970c7604M5081K0810m6484j7207J4637j427J824L235J8955m3083j0029N0730
19958e62J0774M5505k6072m5555J1954L5605K2903L8045l8240l3338k8738m5283
19946e3002L6688R243j9954J3045O227j4386K922j9866l840p064J4883L0625m539
$$ y = [49575, 54968, 48082, 3625, -17905, -24600, -453, 6328, 34369, 25318, 34899, 60976, 48939, -38536, -49462, -56417, -66985, -105838, -105918, -61327, -25889, -29299, -18105, -4088, 65038, 100764, 81888, 71014, 50688, 53603, -17033, -31752, -13866, -3395, 34358, 119760, 155446, 86781, 11146, 5625, 44958, -1262, -24124, -19870, 6662, -2885, 6894, 26197, 32067, 42592, 3061, -84844, -88107, -82504, -80133, -144534, -167573, -142226, -86585, -71945, -78429, -38503, -34486, -40394, -37604, 7477, 28287, -18197, -35404, -20767, -22194, -20370, -17135, 1820, -41263, -51292, -562, 10212, 55717, 29645, -15910, -3956, 31649, 54552, 92597, 54357, 21019, -7719, -53002, -16314, -7071, -27025, -13980, -7753, -22139, -19217, -39083, -42923, -49987, -35104, -4479, -9018]
19933i018r909o2011o3946M0632L3163K5806l608J223L2524j3314J3837m6047
19921f0668n389K1336P6959K2910l4918K2381n5686k9082l1895j5817j5998k0700
19909a26567M7380M0979J6336k4102j4699J6032L2952K1400k3254M6060m7650
19898a5133o9951L8400M476Q920j7381j563j9727l9232m9240K9780R877j7544
19886a38318L0224J3939J0629j0674L891j5458N5424P1236M9192k6980o5675r991
19874c2561L561k3261L0344M005r704k5226j7643N1833K9214J2156k783n4550
19862c4615J7390J7971J5298j8068M1679J006n1442N0346M782l0856j0657J5088
19850A7922m7607j7688L8744l4897n7374O6435K3887k3242K1758j1654o7962K109
$$ y = [-9018, -18927, -80938, -144884, -104252, -71089, -45283, -48891, -47668, -15144, -28458, -14621, -60668, -66057, -44721, 32238, 55148, 20230, 42611, -13075, -42157, -74052, -89869, -105867, -126567, -79187, -38208, -21872, -45974, -60673, -44641, -11689, 9711, -13543, 32517, -15133, -85084, -46684, -42208, -33288, -50669, -52232, -71959, -111191, -160431, -130651, -120774, -138318, -108094, -94155, -83526, -94200, -90309, -105767, -50343, 20893, 70085, 43105, -22570, -32561, -29000, -52261, -21917, -17912, -27616, -52842, -70485, -18652, 10562, 22718, 19935, -34615, -17225, 746, 16044, -2024, 39655, 40661, -10781, 39565, 44347, 13491, 2834, 17922, -29685, -47373, -8629, -43526, -100900, -34465, -10578, -33820, -12062, -23716, -91678, -89569]
19838h9569Q9878Q3037M8596n720o4702n4468m4162m1067j3383l9521k862P3130
19826f0813M8613K2496j0302K0994K1013n9090m3652k3018K8280Q044o3717k0909
19814a32061K2407J1452L4565O5292K459l8903j6705j2549J6170L504j6011m376
19802f4756J5543R352J4627K8441l2354o4728N0396L5642q322J8923j5229n4011
19790f6476k8503k5652j083J8971M3250L9096r684l7108j4102n1941o248L0573
19778a08907J9458N3642k889j315J2455L1271L6290L0880l5986m9190k583J8981
19766B107p493L2066n7011N157K1323l5834o2124L967P817K3699L2630L0657l2104
19753c5143j7380L8984j969L3135J987m8338l7726L4066j5614L6474l3634k8521
$$ y = [-89569, 309, 83346, 131942, 126222, 61520, 7052, -37110, -78177, -91560, -131081, -133943, -60813, -12200, 10296, -6, 20988, 42001, -17089, -60741, -83759, -55479, -47435, -111152, -132061, -109654, -98202, -63637, 1655, 4114, -34789, -51494, -64043, -47873, -44369, -60380, -64756, -49213, -39861, -25234, 3207, -29147, -93875, -43479, -7837, -16159, 2764, -12465, -66476, -94979, -120631, -121714, -102743, -59493, -20397, -30081, -67189, -81291, -133232, -139480, -108907, -89449, -35807, -38696, -40011, -27556, 3715, 40005, 70885, 34899, -14291, -16874, 2107, -5386, 26680, -30331, -25174, -3851, -39685, -101809, -97842, -90025, -66326, -33696, -3039, -35143, -52523, -13539, -15508, 17627, 19614, -28724, -66450, -32384, -47998, -11524, -45158, -73679]
19741g3679m844P309J6140l6386j4238l1527j5949Q1805R1362j28l1247k6767
19729c8149m735L7370J5556q250j5739P737j5041m181K7559l9949k232J643J4115
19716b4296J0732J344k6358j1410p774j1855k011P672N8650K1365r3630l2373
19704a09944L2664L8166K2423l8964K49J230m0348k6979L2283M0349k5202J4881
19692e9192j8570K601N0086J3032l5352K5299m409m3836p1490n9612M6124O668
19680a48651k0934K1575M0094M1622L4503o1692K2860L7343L5305k6587j4715
19669c9277k1905K474m1580K0837M965K1350j9499L9224K3263K8450N5937k4183
19657E0056o0747j3877q173J2651L9213r222j0676J0852m8416J541O2894j6517
$$ y = [-73679, -78523, -71214, -55074, -91460, -105698, -137225, -153174, -71369, 19993, 19865, -11382, -38149, -42884, -5514, 10042, 1792, -13947, -6210, -21251, -25432, 2127, -37822, -40054, -38411, -24296, -13564, -12220, -38578, -49988, -57762, -69617, -71628, -63956, -5306, 16059, -77571, -109944, -77280, -39114, -16691, -55655, -55406, -54176, -94524, -121503, -89220, -48871, -74073, -59192, -77762, -75161, -25075, -12043, -47395, -22096, -26505, -70341, -141831, -201443, -155319, -148651, -169585, -148010, -107916, -66294, -31791, -93483, -70623, -33280, 2025, -24562, -39277, -61182, -58708, -100288, -79451, -74486, -53136, -72635, -33411, -10148, 18302, 74239, 50056, -10691, -24568, -32741, -20090, 19123, 9901, -775, 10077, -38339, -36798, 26096, 9579]
19645I579l4287l1799J0041j7742K2259L0708K5074j4146p395J7717k0937J9494
19633H566L1153m1999K2029j3938L2193k278l7728l3607j5067j4041L0650J0411
19621b3656P281j7036l5565m1409J7225J6282k669R268J0133K3295k0729J3542
19609d4038O4946M9416j6017l247j8778n9004o5008J1076K5714j7153k8706L3268
19597f7531M3652o622J9316l41Q63J2352k1946M3619r729j5541n7461j2031J7336
19584e4064O9288N0436o6019k1214J034k8948J3300L2567l1861p512l5626R500
19572f9119P752l5070n184K7462m0325K114o332R899J2770K0782O4572o622q024
19559b5325M0594p032j64K0581L8491J7258l8771r447j8489M422m1143J9578P7195
$$ y = [9579, -24708, -56507, -46466, -64208, -41949, -11241, 13833, -313, -7708, 10009, -10928, 8566, 39719, -2280, 19749, 5811, 38004, 35726, -2002, -35609, -50676, -64717, -34067, -23656, -16375, -33411, -68976, -110385, -93160, -76878, -79547, -70279, -60146, -36851, -57580, -44038, 20908, 70324, 54307, 51060, 32282, -26722, -91730, -80654, -54940, -72093, -100799, -67531, -23879, -30501, -11185, -11526, -10663, 1689, -20257, 23362, 13633, -1908, -59369, -71400, -54064, 15224, 65660, -359, -21573, -20539, -49487, -36187, -3620, -35481, -42993, -78619, -69119, -61367, -96437, -101621, -74159, -114484, -112370, -118702, -108803, -96033, -75251, -10679, -17301, -25325, 15269, 8237, 8073, 28654, 67145, 84403, 45632, 36185, 17696, 22118, -19025, 553, 77748]
19546G7748r331l101m8046m9433K4961K7875m414n0615L9324K7837l3362J1152
19534A0595O479k3685l2290j3285K73O5379n0251k4803K8233M5453J7342J7474
19522D6914l3069l1900l1405J8014j3303j3546L2354J4544j3592j7597L1997K7523
19510A6934m4665L1709O670J1127K1528K0250N1032L4349j4133l2626q9938m6841
19498c4604K866o768O239L589M3628M1297o981m0007k4598j185J7097k2405k2889
19485d4721l7909J7141N3401K6472R889o879L7114l032l4207j4803j3885k4085
19473c5504k776r457P171j9628K9327O4099L2669J3735k7120o4736J7852l1486
19461b5854l9883Q866O8000O4949q616n1140m3757k079N1360n650j7122j0239
$$ y = [77748, 68417, 65316, 17270, -32163, -7202, 20673, 16259, -34356, 4968, 32805, -557, 10595, 17074, -6611, -38901, -52186, -51913, 13466, -36785, -61588, -33355, 12098, 29440, 46914, 13845, -18055, -49460, -31446, -44749, -58295, -25941, -11397, -24989, -42586, -10589, 16934, -27731, 3978, 10648, 21775, 43303, 63553, 114585, 148934, 134801, 102175, 12237, -34604, -31738, -38506, -32267, -28678, 14950, 56247, 49266, 9259, -15339, -16524, 573, -21832, -44721, -82630, -65489, -12088, 14384, 24273, 17394, 54508, 51476, 17269, 2466, -11419, -35504, -38280, -47737, -40566, -60194, -30867, 33232, 65901, 79636, 52516, -12220, 5632, -25854, -65737, -56871, 11129, 76078, 67462, 16322, -27435, -29514, 21846, 16196, -926, -11165]
19449a1165k6585k171K2598j0378j5021J3525K4366j0068j0536j8107n795P3251
19437B3914n9792K2224M9536M3298J365R841P279K0485j9155k0795P428O3757
19425A49385J0927k5945p7391j1818k173O2249J6592J410m109K213m6525r652
19413F5163M1590O376k5666o7479o1067k0990p116K5413K5399O6455m3133l6686
19401c1741K1669J3842q998O744K1706Q510M817r216j837k6761k975J5159j1235
19388c16J165N7205M0921L0404k6286Q185P538j7255j2059j1407K5607K6122q379
19375A21445k8567j5751M0990k182o886j2162m1779R990m7876k5501j4247Q902
19363a3624M9078N257j7426j3179j6705L8947j373n0459K3602O1741j105k7961
$$ y = [-11165, -37750, -39921, -17323, -27701, -42722, -29197, -4831, -14899, -25435, -43542, -49337, 23914, -35878, -13654, 35882, 79180, 80545, 90386, 97665, 118150, 98995, 78200, 85628, 149385, 160312, 134367, 56976, 45158, 42985, 105234, 121826, 123236, 119127, 121340, 74815, 65163, 106753, 113129, 87463, 19984, -41083, -62073, -69189, -43776, -18377, 48078, 4945, -31741, -10072, 3770, -5228, 1516, 23222, 31732, 36549, 27333, 25496, -1265, -4240, 10919, -316, 849, 58054, 98975, 129379, 103093, 111278, 118816, 101561, 89502, 78095, 103702, 129824, 121445, 92878, 77127, 118117, 115935, 109049, 96887, 55108, 65098, 17222, -8279, -22526, -13624, 35454, 40711, 23285, 10106, -6599, 32348, 30975, -19484, 4118, 65859, 64754, 36793]
19351C6793L9377m3053L7660k1700n4161J0284J2135L0256J5838l8189L3501k7547
19339C1194p2284K6R059M2226K3127K4141q6690k5196N6801K203L0753K6687k8671
19326C3376j6583K6301M8427K0245l2682m8269j0176k6446l9245k390m924j8925
19314g1291n149O0482L6057r394J328J8275m3722k5524N7937K7574l7018K1819
19302C1374o540k0598l6569L1181j3527n3921j3093l2698M1960M4652L9114k1794
19290a0459K7298J239o228m6573o531K7868K1541J0001L582O0347K9314j0511
19278A00888r238j9911J078l141m5988J4232L2909j8635J439k2867k786O606l3230
19265A356j5581n668n4474K3732L7640M1896L3534L8126J04841J49341J15101
$$ y = [36793, 76170, 33117, 70777, 49077, -5084, 5200, 17335, 47591, 63429, 25240, 58741, 31194, -41090, -41064, -32005, 10221, 33348, 57489, -29201, -54397, 2404, 4607, 35360, 62047, 33376, 16793, 43094, 91521, 111766, 79084, 30815, 20639, -5807, -45052, -47442, -52366, -71291, -76440, -15958, 20099, 10705, 12033, 30308, -13414, -38938, 18999, 46573, 9555, 31374, 24834, 4236, -32333, -1152, -14679, -68600, -81693, -114391, -72431, -27779, 11335, -10459, 16839, 18078, 11850, -34723, -41254, -13386, 8155, 18156, 21738, 82085, 111399, 100888, 91650, 71739, 72817, 69676, 23688, 37920, 70829, 52194, 53633, 30766, 27980, 34586, 1356, -14225, -19893, -74367, -50635, -12995, 28901, 62435, 100561, 205402, 354743, 469844]
19254D69844M7052L77L416r742M4596N5722K4665r050p3120o1471k1069L0368
19242E01588k1095j06181j06597m7709o6165o317L6972o1033k9006M4780J4167
19231A53404m1851m3254k3886L8541l873K0874Q44K2173K4903l2776o7470n2924
19219e295M7885N2673M0365K1047j8689m6372o796M5586M46j5388O7440M7664
19207B30566J4502J24783Q6014k6281M7968N0504M5230k5889J9582K2629l4613
19196E54995n0956O3582J9302o6203m6696p6256m9159p0437o0696q0689l2518
19185A04269j2905k4303K2553K0330l5409j3555j7167j3192k8781M7065j179j3834
19173C3892K8692k1132K58k7323k8706K9343N0399K8688n6464j03281l0493N2443
$$ y = [469844, 516896, 517273, 520689, 510947, 555543, 611265, 635930, 626880, 553760, 492289, 471220, 501588, 480493, 374312, 267715, 220006, 153841, 147524, 184496, 123463, 94457, 139237, 153404, 111553, 68299, 44413, 82954, 79081, 99955, 100799, 122972, 147875, 115099, 47629, -5295, 42590, 95263, 135628, 156675, 137986, 91614, 84818, 130404, 130850, 115462, 182902, 230566, 245068, 369851, 455865, 429584, 477552, 528056, 573286, 547397, 566979, 589608, 554995, 504039, 567621, 586923, 520720, 474024, 397768, 348609, 278172, 217476, 136787, 104269, 91364, 67061, 89614, 109944, 74535, 60980, 43813, 30621, 1840, 48905, 47726, 33892, 62584, 41452, 41710, 14387, -14319, 15024, 65423, 94111, 37647, -65634, -96127, -43684]
19161d3684N4089N1533l652j5014j1795K308M4346m6512J2461k6080K6326N4370
19149I8696M724J3493M634n6519k7571k4666j0049K9396L4865j1130o6666K468
19137h325K2833L3211j9598K1849j2538m3735l417M2793J7357o6099p777l8657
19125f2103J4713P3051K2791m9305n178O968O3456K9775J2809q914o0918k4968
19113A2177j617L4744J1555o9887l17J7308R508n8944n6901l6261O3199R512R7303
19100C1379M1613l1117l8520J6274L6866J0114M5339K933l0148n119j9998p2473
19088a2857K1902L4147o6626l1029L3419P8725M5675m8463k3108o794M6743N5093
19076A26827n9697p9770n11M8358J3390M0249L731J2292r715j035p8861l6375
$$ y = [-43684, 10405, 61938, 58286, 43272, 31477, 33785, 78131, 31619, 44080, 18000, 44326, 98696, 103420, 116913, 121547, 65028, 37457, 12791, 2742, 32138, 67003, 55873, -10793, -8325, 14508, 47719, 28121, 49970, 37432, -6303, -9720, 33073, 50430, -15669, -23446, -62103, -47390, 25661, 48452, -853, -6031, 937, 64393, 94168, 106977, 98063, 37145, 12177, 10560, 45304, 56859, -13028, -13345, 3963, 13471, -45473, -102374, -138635, -75436, -65924, 31379, 72992, 41875, 3355, 19629, 56495, 66609, 111948, 114881, 84733, 79614, 59616, -12857, 9045, 43192, -23434, -54463, -21044, 57681, 103356, 54893, 31785, 24991, 71734, 126827, 67130, -12640, -13151, 35207, 48597, 88846, 92577, 104869, 95154, 94119, 15258, -21117]
19064b1117k592N6836L3695K2707K0854m738L2822K3965k0648o6954j2151P466
19052G0145O55l3928J655l0252n4358L3320Q5959L4582L6042o5357K1762J5199
19040A15424l3450K2894p258j9306L3556o563N60k4903n7970K3810M6653K5609
19028A19056K9825j2756n3499k0252n984J3994J711M3883j1430j8432M5706R29
19016A32751o0241J3289N8977q72j9852m9374K2890j4699k2988R2993P4584J3531
19004B40989m0794j6651k1129k0527J5181K8105k2205l8965j1825l9263L5916
18993A08832n828K6020M3992n2590j2428o1580l5341K8648L6607N8130J132m9625
18981H5969k9611N9451N0365P434R155O720l2130l8337J6533J3943j1936r7O578
$$ y = [-21117, -23709, 33127, 66822, 89529, 110383, 105645, 138467, 162432, 141784, 74830, 62679, 70145, 70800, 36872, 38527, 8275, -46083, -12763, 73196, 107778, 143820, 78463, 100225, 115424, 81974, 104868, 97610, 78304, 111860, 105297, 105857, 80954, 22984, 46794, 93447, 119056, 148881, 136125, 82626, 62374, 56390, 70384, 72095, 115978, 104548, 86116, 131822, 132751, 72510, 85799, 144776, 143904, 124052, 74678, 97568, 82869, 59881, 152874, 227458, 240989, 200195, 183544, 162415, 141888, 157069, 185174, 162969, 124004, 112179, 72916, 108832, 103004, 129024, 173016, 120426, 107998, 46418, 11077, 39725, 76332, 134462, 135594, 85969, 56358, 115809, 166174, 173608, 182763, 189483, 157353, 119016, 135549, 149492, 137556, 137459, 144037]
18968A44037m31k5017k1897k8625K1649O1460M8805O316k318r1007l42j3890J3869
18955A12609K2854l5584M3471l4798l1573K9612k3753l3802q870K7674L959m530
18943F7269L5882k4575Q26L1971L0109l4041J3236M7645K0252j9619p1009n6310
18931D1636J049K5125K3998o980k9765o5982N5766J0646n0246M331M4333M111
18919E8022K3771O398l1906k72r269J2359l4703J5928M1248L0663n090n0240L483
18906F0392K8233j5176o32k6647M9055N9646J1172j9038L5665M2509l6249p7345
18894A11585l3656r240J7953K2548n011O668N6128K5296p2944o5852N721L969
18882F3165j0972J0959N11k4223P392K8724k4705L707k581M1186P3909L191m919
$$ y = [144037, 143606, 118589, 96692, 68067, 89716, 151176, 199981, 206297, 203979, 112972, 112630, 98740, 112609, 135463, 99879, 143350, 108552, 76979, 106591, 82838, 49036, 40166, 67840, 71799, 67269, 103151, 78576, 79402, 111373, 141482, 107441, 120677, 168322, 188574, 168955, 97946, 41636, 42685, 67810, 91808, 84828, 55063, -10919, 44847, 55493, 5247, 9578, 53911, 58022, 81793, 88191, 56285, 56013, 46744, 59103, 24400, 40328, 81576, 112239, 107149, 56909, 60392, 88625, 73449, 72817, 46170, 95225, 154871, 166043, 147005, 182670, 225179, 188930, 111585, 77929, 68689, 86642, 109190, 104179, 110847, 166975, 192271, 119327, 53475, 59196, 63165, 52193, 63152, 63663, 39440, 46832, 75556, 50851, 54558, 51977, 93163, 167072, 170263, 165344]
18869A65344L8456R961o5838O437j0497m5879J239j4987J6598L2723L1341N995
18857A70893J2135J139m2199m628K2393j2547j8172M5424O572n842J8838P9125
18845B73131J04364K0084m2712j1970l6698M1445M6162J14090P2681o3014j09875
18834D07688j26448o6298J31m242j9443J9128j4735r047L4356M2579K0065Q01
18822B84535n3830k2648q050m2274l2907Q3261k0923p6057k2011p816K7397N7309
18810A65986K731j9243M448Q625J16233L6584Q339J7385k2818P2377J43821J41375
18798F75843N7790k4538j5055J1977k7232k5356Q5976L0784j7309J8052K9017
18787G99949q079j20890j42439o6660n4765q5733p4678k6793J0749j1367L1888
$$ y = [165344, 203800, 213761, 147923, 154360, 143863, 97984, 99223, 84236, 100834, 133557, 164898, 170893, 183028, 184167, 141968, 137340, 159733, 147186, 129014, 174438, 181010, 175168, 194006, 273131, 377495, 397579, 354867, 342897, 306199, 347644, 393806, 507896, 580577, 517563, 407688, 281240, 214942, 215073, 210831, 191388, 210516, 195781, 186734, 221090, 263669, 283734, 284535, 230705, 208057, 200007, 157733, 124826, 208087, 187164, 111107, 89096, 81280, 108677, 165986, 168717, 149474, 153922, 162547, 278780, 315364, 323703, 341088, 318270, 390647, 534468, 675843, 733633, 709095, 694040, 706017, 678785, 653429, 739405, 770189, 752880, 770932, 799949, 791870, 670980, 528541, 461881, 407116, 321383, 246705, 219912, 230661, 219294, 251182]
18776B51182N378N2909k7517o7626L4358N3056M7572J20011K50113K27107q5596
18765H60947k99894j78360k6620m5225j18106K1681n998l1789n807L4504J2301
18754B17634O4271J84052J10122J30230J3143j04339j08307m8306j2972L2661
18744D78189J14614Q5321L3432p0662j25017j43778j29380q7201r3686k6830K3243
18733E8245K1422j6976m310K0941J3464M4622N6435N6451k4874k3360j1787n744
18721A84529l864m1711O572p94n882L1571M120r378l0489n0294k6583N7203m3062
18708G1938m66O2000j3535M7743M9834j1995k7769J5713M3944m9992M799Q500
18696B00714j5362R639J3587l7353n9273r247P9192L1143j3608J9251j7373m6260
$$ y = [251182, 256560, 309469, 281952, 214326, 248684, 301740, 349312, 469323, 719436, 946543, 860947, 561053, 382693, 356073, 310848, 192742, 214423, 208425, 176636, 170829, 205333, 217634, 281905, 465957, 576079, 706309, 719452, 615113, 506806, 458500, 445528, 478189, 592803, 678124, 711556, 640894, 515877, 372099, 242719, 155518, 61832, 35002, 58245, 79667, 62691, 58381, 79322, 92786, 137408, 193843, 250294, 225420, 202060, 190273, 184529, 180665, 138954, 145526, 144732, 138850, 170421, 174541, 165163, 134674, 84380, 57797, 115000, 71938, 71472, 133472, 119937, 167680, 217514, 205519, 177750, 193463, 237407, 187415, 192214, 200714, 185352, 194991, 208578, 171225, 111952, 102705, 181897, 213040, 199432, 218683, 201310, 155050]
18684A55050l4084P1834J3053p0089k0702L2316l4299n3721L3174N0287k4960
18673A17859K3528j961j1502M1826K3446m9636O111Q2904N9004K5837k4537m9858
18661B43021l6978O117k561o6427k4357M6137K1622P319l9633K2403q2380n7798
18649C6485K0720O9136J8001J4557J3053m4293J4912K6040L4809L2834k3481L2969
18637B45742j7430p0776J685K6369Q7812J0923l1005r44p6122o8456K0146M5310
18625A73254l6417p736J4589M7628K8204K375m861n0755n9339M7339j2042j6930
18613A25309k4052K5863K964P226J9755J4218J1880K8105J7725j4486m3752J6191
18601A86946J2352j2837m582J5671L5209K9454J14319O5738K6868j18J5919P3326
$$ y = [155050, 120966, 192800, 205853, 135764, 115062, 147378, 113079, 59358, 92532, 142819, 117859, 141387, 139426, 127924, 169750, 193196, 143560, 149671, 232575, 291579, 317416, 292879, 243021, 206043, 212160, 209599, 143172, 118815, 164952, 186574, 193893, 154260, 176663, 94283, 36485, 57205, 126341, 144342, 158899, 171952, 127659, 142571, 168611, 203420, 236254, 212773, 245742, 228312, 157536, 159221, 185590, 273402, 284325, 253320, 252376, 176254, 107798, 127944, 173254, 136837, 129101, 143690, 191318, 219522, 221897, 217036, 166281, 106942, 154281, 142239, 125309, 101257, 127120, 130084, 137310, 157065, 171283, 183163, 211268, 228993, 214507, 170755, 186946, 199298, 186461, 181879, 197550, 232759, 262213, 376532, 442270, 469138, 469020, 484939, 558265]
18589E58265Q6510P0674N172O923L8502R1156J32142R9939N81M543n4164p4028
18577I66215K5866J1517l4129j12005q2433l1400J299K3495j024p5945p1405O116
18565F26167K9199K5251J1595P9293M5963L5094J3443l9129N8055K8558J5405
18554I28894L8227j6172j7194j0329k8827J5764l0023l2210L5574P8576O2564
18543A024844l0353o6495O2032J11334N1584L7797o7411j6733P1596J37533K26268
18532A541996Q6071J9297L0970R8024J71808J17841q8357j38679o2098r5847j29083
18521A551943q9172j52528j01423m2433n8979m7610p8462r2840K5218l3625M367
18510H84456N2467J3406j2704P0833M8221O0145l9467M3565J17359K0387M5821
$$ y = [558265, 644775, 715449, 720621, 727544, 766046, 857202, 989344, 1089283, 1089864, 1094407, 1040243, 966215, 992081, 1003598, 969469, 857464, 775031, 743631, 744930, 768425, 767401, 691456, 620051, 626167, 655366, 680617, 692212, 771505, 817468, 852562, 866005, 826876, 884931, 913489, 928894, 967121, 950949, 933755, 923426, 894599, 910363, 880340, 848130, 883704, 962280, 1024844, 994491, 927996, 990028, 1101362, 1152946, 1190743, 1123332, 1106599, 1178195, 1315728, 1541996, 1628067, 1647364, 1678334, 1776358, 1948166, 2066007, 1977650, 1838971, 1776873, 1681026, 1551943, 1462771, 1310243, 1208820, 1166387, 1107408, 1059798, 981336, 888496, 913714, 880089, 884456, 936923, 950329, 937625, 1008458, 1056679, 1116824, 1077357, 1120922, 1238281, 1258668, 1304489]
18499A304489M2634J541M5113M3176o380j6839L3515J23677J49395K0671J0559
18488A751551j2806R569k397K0960L1800l8149r6089j02621j01761k9377q4541
18477A346139j87191q4171j7285J69n6303j12547m2638n2348o9965j15649q737
18466E99474N7886L0896l7040r5838K7707J4364j7548J2638K2320K1525L4744
18455F71128l6824j0294L6971J31758J53994J80065J88540N6502J32071L07625
18445A811536K72389J77099N4718K1453l0611o6687l9865K9693L7186k6822p6409
18434B163680j23463j90746k03637j71986j47776j17831r3294r2755j08004r0826
18424H23362q0197N4108j4437n3169j04851m0350K0274J0920L13L711J1013p613
$$ y = [1304489, 1347123, 1348664, 1393777, 1436953, 1430573, 1413734, 1447249, 1570926, 1720321, 1740992, 1751551, 1738745, 1748314, 1745917, 1766877, 1798677, 1760528, 1664439, 1561818, 1460057, 1430680, 1346139, 1158948, 1074777, 1057492, 1057661, 1001358, 888811, 846173, 793825, 723860, 608211, 599474, 657360, 688256, 651216, 555378, 583085, 597449, 579901, 592539, 614859, 636384, 671128, 634304, 624010, 660981, 792739, 946733, 1126798, 1315338, 1371840, 1503911, 1811536, 2083925, 2261024, 2315742, 2337195, 2306584, 2239897, 2200032, 2229725, 2266911, 2240089, 2163680, 2040217, 1849471, 1645834, 1473848, 1326072, 1208241, 1114947, 1022192, 914188, 823362, 743165, 797273, 782836, 729667, 624816, 584466, 604740, 615660, 615973, 619684, 630697, 623084]
18412F23084j6788L0723L3017q8578m0464M9648L7245K0178O6806K6337M5032
18401G86240Q6235P6219R9844J42278K03735J89965M4950k7163l3441R943M7034
18390A625839R4403M9396n0269j33163n1410p3301K158j1000J6277l7139k9134
18379A402657p9459k5625l6330q7319j34966j52195o4196o7746m4456L0301j9065
18368G21601o6581m6055l667L429Q706J9902k9451k7024k0125k8539K8007j1375
18356E48828J3307J3170j8279k6226K1312L4981j5095M1291J927k0253M4798K7920
18344F67681O8606J2371M1931M1232P1336M083M3202O8442K5124k5828l6272K0792
18332A002700L1810r189J365n8712n5752j1724n8074r0125j33291p6814M155M1365
$$ y = [623084, 606296, 637019, 670036, 581458, 540994, 590642, 627887, 648065, 714871, 741208, 786240, 872475, 948694, 1048538, 1190816, 1394551, 1584516, 1629466, 1602303, 1568862, 1578805, 1625839, 1720242, 1769638, 1719369, 1586206, 1534796, 1461495, 1463653, 1452653, 1468930, 1431791, 1402657, 1323198, 1297573, 1261243, 1173924, 1038958, 886763, 822567, 754821, 710365, 740666, 721601, 655020, 608965, 605298, 608727, 617433, 637335, 607884, 580860, 560735, 532196, 560203, 548828, 562135, 575305, 557026, 530800, 552112, 587093, 571998, 613289, 615216, 594963, 639761, 667681, 736287, 748658, 790589, 831821, 903157, 907240, 950442, 1018884, 1044008, 1018180, 981908, 1002700, 1034510, 1025321, 1026686, 967974, 912222, 900498, 842424, 752299, 619008, 542194, 546349, 587714]
18320E87714n9505j6933M7136K1087j510j07389k3724M461N43M3242N5721M4495
18308E95338M1489J2482p4513l2783j455L4380l530N6518J6995K790m9702k936
18296E95073O4301L681j0150J1858l708k2473L486k9820l8336l118J874L1674
18284F04342K4555j2039m4856K270L042L4804J5469J8460J1372N4036O7230n0676
18272G28009j0065L2949o626L441k1497K69K5609m8249k132M2926J0854K8894
18260G84382J9173L7385J6450o405R823N513o9245o1873k2238j8117M8051N9766
18248H02665J8355k069n1106l7011n9017o7446j78M3875K1727N7547K1708o290
18236G42760k5039k8850j08257n4728P712k2405m8367L9262N2510j6833K2765
$$ y = [587714, 528209, 511276, 558412, 579499, 577989, 470600, 446876, 451337, 451880, 495122, 550843, 595338, 636827, 649309, 574796, 542013, 540558, 574938, 571408, 627926, 644921, 647711, 598009, 595073, 659374, 663055, 652905, 664763, 661055, 638582, 642068, 612248, 573912, 570794, 572668, 604342, 628897, 616858, 572002, 574272, 577314, 612118, 627587, 646047, 657419, 711455, 778685, 728009, 717944, 750893, 744267, 747708, 726211, 726480, 752089, 703840, 701708, 744634, 755488, 784382, 803555, 840940, 857390, 850985, 860808, 866321, 797076, 735203, 712965, 694848, 742899, 802665, 821020, 818951, 767845, 730834, 671817, 604371, 604193, 648068, 669795, 727342, 749050, 742760, 717721, 688871, 580614, 525886, 533598, 511193, 462826, 502088, 554598, 537765, 560530]
18225E60530Q3185N9177J9509q6653J8282M3488J6111L7251k654j0100J949j6048
18213G24027K7545R967R198M6678L8382K340k1821k7064o5851p1762o6497J0853
18201F15995l7273k2278M7356N0849R821r102K4753O8916k5423Q439n666k4055
18189G02332j147j9998L0737L8796N58M8966N7663J6763R3371L0780O361K4454
18177A029636M7647K5096j9684N419p0988l9469Q0332K4020o9155r482J6292J8916
18165A038580L5163L083R629K1991O2737m531L146M0072O0772Q6242K5075k2364
18153A359595L958K1071J0839N533j4386L6388R8481K6235J1274Q6292M1869L3309
18141A720458K0651m67J1374Q7713M6774P706K3293L3552L0987R0885J24820N1276
$$ y = [560530, 643715, 702892, 722401, 635748, 654030, 697518, 713629, 750880, 748226, 738126, 740075, 724027, 751572, 761539, 770737, 817415, 855797, 858137, 836316, 809252, 743401, 671639, 605142, 615995, 578722, 556444, 603800, 654649, 664470, 655368, 680121, 749037, 723614, 732053, 726387, 702332, 701185, 681187, 711924, 750720, 751278, 800244, 857907, 874670, 968041, 998821, 1005182, 1029636, 1077283, 1102379, 1082695, 1088114, 1017126, 977657, 1057989, 1082009, 1012854, 1003372, 1019664, 1038580, 1073743, 1076826, 1086455, 1108446, 1171183, 1166652, 1169798, 1209870, 1270642, 1356884, 1381959, 1359595, 1363553, 1384624, 1395463, 1400996, 1386610, 1422998, 1521479, 1547714, 1558988, 1645280, 1687149, 1720458, 1741109, 1740642, 1752016, 1839729, 1886503, 1894209, 1917502, 1951054, 1982041, 2072926, 2197746, 2249022]
18129B249022O5017J06381J01361J67447K34575K05290K84351L71903L70525M36673
18119D592545N19452O33898P67139J053685J553545K310484L757535O935669J3728657
18110C5852609K5683082L6852783J7557392k6921689l5277664k0528943j0055930
18103B3161640n289147l059583j968921j289911p46567l19393j09786K71596N04306
18094A1154234L99053K13369K90989L73599N89196O60020O47008M40625j86378
18085A4581715n43177m52659k38922K25661R67656J629533J818337J148693J213436
18076B0350273K833002N316989P091778O983424P115215R086942J0136919R891482
18068G8806024P863558N25597p481394r650600q737246o731291m943415m264913
$$ y = [2249022, 2314039, 2420420, 2521781, 2689228, 2923803, 3129093, 3413444, 3785347, 4155872, 4592545, 5111997, 5745895, 6513034, 7566719, 9120264, 11430748, 15188283, 22123952, 35852609, 61535691, 98388474, 115945866, 89024177, 53746513, 33217570, 23161640, 17872493, 14812910, 12843989, 11554078, 10807511, 10488118, 10378332, 10649928, 11154234, 11553287, 11766656, 12057645, 12431244, 13020440, 13680460, 14327468, 14768093, 14581715, 14038538, 13585879, 13346957, 13572618, 14540274, 16169807, 17988144, 19136837, 20350273, 23183275, 28500264, 35592042, 42575466, 49690681, 58777623, 68914542, 78806024, 86669582, 87195179, 79713785, 70063185, 61325939, 54594648, 49651233, 45386320]
18060D5386320l399567k475536j428987q6189Q68586K013767L256489L590183
18052D7725066M248415O793062R845854J2747218J2476942P279463O655829Q313122
18044A16084971J534899l883244k987181k976904j370846J928704N519053O512807
18036A20362259p06105p778642r284480q691909o484242m085982m09875N140968
18028H8061992L921678k744112l634047k197828k390006j943958K9040N216030
18020H4318789J3507895K0699718K1694619J7494017J2541350J2534236J7548625
18013B00339249J1120278k416237M548671R199402r497457j9910962j6322930
18006A77060014j6345887k1852899k6977881k4670534j6713372r101349l943667
$$ y = [45386320, 41986753, 39511217, 38082230, 37996041, 38864627, 40878394, 44134883, 47725066, 51973481, 58766543, 68612397, 81359615, 93836557, 101116020, 107771849, 116084971, 117619870, 113736626, 110749445, 107772541, 106401695, 108330399, 113849452, 120362259, 119656154, 111877512, 102593032, 93901123, 87416881, 83330899, 82921024, 88061992, 91983670, 89239558, 85605511, 83407683, 81017677, 79073719, 79102759, 84318789, 97826684, 118526402, 140221021, 157715038, 170256388, 182790624, 200339249, 211459527, 209043290, 213591961, 222791363, 213293906, 193382944, 177060014, 160714127, 138861228, 111883347, 87212813, 70499441, 61398092, 57454425]
17999E7454425j124640j091020k262799j674094P19743L923545O872585Q107013
17991G0924758R071077J1621310J0984189P563007M571719Q39484j058444k060533
17983A12456567m327474r505756j2274649j0618375j0544739j0675118p734222
17976D6776234m324054k412599j304504n98644k72250N02847K135125M877317
17968D5379472R016310J6352262K8159813M2476536N3306573N1785386L8566627
17961B85042979J9175065J319984j5450702l0169439m1709122m8437676m4673552
17954A25097537l2680567k0070742j0782684m326404O03436M711707R361463J5147070
17946H7060816J8162183J5421683Q740528k316496j1520849j1048881o298756
$$ y = [57454425, 56329785, 55238765, 52975966, 51301872, 52021615, 55945160, 62817745, 70924758, 79995835, 91617145, 102601334, 110164341, 114736060, 115575544, 114517100, 112456567, 108129093, 98623337, 86348688, 75730313, 65185574, 54510456, 46776234, 42452180, 40039581, 38735077, 38136433, 37864183, 38367030, 40502155, 45379472, 54395782, 70748044, 98907857, 141384393, 194690966, 246476352, 285042979, 304218044, 305538028, 290087326, 259917887, 218208765, 169771089, 125097537, 92416970, 72346228, 61563544, 57237140, 57840576, 62552283, 71913746, 87060816, 105222999, 120644682, 129385210, 127068714, 115547865, 104498984, 98200228]
17939I8200228l679858o21071M842140Q093811L324160n641455r657423p661068
17931H7199464j044926P195653J2263561J2553321Q486064J379139j972257n366814
17923A20693205j1818398j3532951j4102199j6537585j4693665j0043383o483911
17916C3481113m436635l001513j684072m94836Q54601K600114N013103R115279
17908D1447154J4979998K1602973K4374380J7656133M488398r705666k1799505
17901I3043865k4841352j9504300j2750962p749835m836057l310386k176007j324916
17893A6550050r69848o46203k59351j29322p8476j07650k0249K65874K07347l75455
17883A4436717m29426J5019J47555k07258k39780m84674j297615j704131j206345
$$ y = [98200228, 94520370, 93899299, 98741439, 106835250, 110159410, 104517955, 94860532, 87199464, 86154538, 93350191, 105613752, 118167073, 126653137, 128032276, 126060019, 120693205, 108874807, 95341856, 81239657, 64702072, 50008407, 39965024, 33481113, 29044478, 26042965, 24358893, 23864057, 24718658, 27318772, 32331875, 41447154, 56427152, 78030125, 102404505, 120060638, 124549036, 114843370, 93043865, 68202513, 48698213, 35947251, 28197416, 23361359, 20050973, 17874966, 16550050, 15580202, 14933999, 14674648, 14545326, 14466850, 14359200, 14338951, 14604825, 14812172, 14436717, 14007291, 14022310, 14169865, 13962607, 13722827, 13238153, 11940538, 10236407, 9030062]
17874I030062p43715p18782o32080m55872m14502k22412j88708j15032j83149
17865E355810k70708j43896n2381j44019o8176q1781j45728k05599j77670r4968
17855C970884M229Q205j5629L5127P1070j07054j48018j3130j0073r334j23655
17844C662622j18452n3971p0923j07700j03527m0329j1645j926O1787R2825J63467
17833C472228J55324L9063P0861R0224J10916N2189k8053q0822j50448j57408
17823C574074j06327n2982j08586k08066k53622k17060j81796j18072n259q205
17813B314099l0515M3886P3479M6143L5569l8929p4063j5098p3487p8939o6606
17802B135539o9277q6602l0979J7320J3835L4173K3926K2182L0273J0944M8682
$$ y = [9030062, 8286347, 7567565, 6935485, 6479613, 6065111, 5842699, 5653991, 5538959, 5355810, 5085102, 4941206, 4888825, 4744806, 4676630, 4594849, 4449121, 4243522, 4065852, 3970884, 3975113, 3983318, 3967689, 4002816, 4073886, 3966832, 3818814, 3805684, 3795611, 3786277, 3662622, 3544170, 3490199, 3419276, 3311576, 3208049, 3167720, 3156075, 3154149, 3215936, 3308761, 3472228, 3627552, 3666615, 3737476, 3827700, 3938616, 3990805, 3962752, 3881930, 3731482, 3574074, 3467747, 3414765, 3306179, 3098113, 2844491, 2627431, 2445635, 2327563, 2322304, 2314099, 2283584, 2327470, 2400949, 2447092, 2482661, 2443732, 2369669, 2354571, 2281084, 2202145, 2135539, 2066262, 1979660, 1948681, 1966001, 1979836, 2014009, 2037935, 2060117, 2090390, 2101334, 2150016]
17791B150016O2559Q5762K0328k4478j6961K9485j8951r4390q5200l3850N9748
17780B134068Q1274Q9629O925j30382j92132j33679n0361K438m6454j6090O4541
17769A809777O8607J00057J58729R8306J4568O67M337J9176j2563m6590n1209
17758B163862l2588j3160m9831j3383k4342j03546q2403j44838j74989j43938
17748A380844j00639m6298j9269J114J7148o3119n9739J7896J8103L9232M3881
17737A229154o4085j2064m1535J0132L7799k0991m914L0037J4172k8226l6229
17726A113250l6103o373J4915L4326M1580O2566P0085L8131M2944M0708L2360
17715A448389L1163M1509J778l4823k8676m7210r9418N4018P912o1477p3939j08356
$$ y = [2150016, 2212575, 2298337, 2318665, 2294187, 2277226, 2306711, 2287760, 2193370, 2108170, 2074320, 2134068, 2215342, 2304971, 2311896, 2181514, 1989382, 1855703, 1805342, 1807780, 1761326, 1745236, 1809777, 1878384, 1978441, 2137170, 2235476, 2250044, 2250711, 2255048, 2274224, 2261661, 2215071, 2163862, 2131274, 2118114, 2068283, 2054900, 2030558, 1927012, 1844609, 1699771, 1524782, 1380844, 1280205, 1233907, 1214638, 1215752, 1232900, 1169781, 1110042, 1127938, 1146041, 1185273, 1229154, 1165069, 1153005, 1111470, 1121602, 1159401, 1138410, 1133496, 1163533, 1177705, 1149479, 1113250, 1077147, 1070774, 1085689, 1120015, 1161595, 1224161, 1294246, 1332377, 1375321, 1416029, 1448389, 1479552, 1521061, 1522839, 1488016, 1459340, 1412130, 1312712, 1366730, 1374642, 1313165, 1239226, 1130870]
17703A130870p2271l4510r9325l3468L8712m4230p1100k9581k5803M4581L4886
17692H38761m0543N5153J03054M4990k1870q9363k1356m070j0453j6440l5121
17681H02742k8943n4289p4421j9030M9048P4841J3878j3760n487o661k1011J3221
17669G30128m0135n832J9823L954K5692K565m5819m9578R157J1613m4240J4033
17657F31361K1942l6106L5690K8482l1288k8035O2614k09k5078l0252n2573n784
17645E70764J1540n6756r397l853L2062O1787J1911K5204j2471j4483J3970n6488
17633E73790l9422j7903l4600N6802L7388R924p043K0237m362N8822l569q4864
17621E65200j3168p287M9210Q315J2714n4702n3306P609K3025k6646k0014J182
$$ y = [1130870, 1058599, 1024089, 924764, 891296, 930008, 885778, 814678, 785097, 759294, 803875, 838761, 798218, 853371, 956425, 1001415, 979545, 890182, 868826, 864756, 854303, 837863, 802742, 773799, 719510, 645089, 626059, 675107, 749948, 763826, 750066, 744579, 737918, 716907, 730128, 689993, 684161, 703984, 707938, 733630, 736195, 690376, 640798, 649955, 661568, 617328, 631361, 653303, 617197, 652887, 681369, 650081, 622046, 684660, 684451, 659373, 629121, 576548, 570764, 582304, 525548, 516151, 512298, 544360, 606147, 618058, 643262, 630791, 616308, 630278, 573790, 534368, 516465, 481865, 538667, 576055, 585979, 578936, 599173, 594811, 653633, 650064, 565200, 552032, 544745, 593955, 602270, 614984, 560282, 506976, 514585, 537610, 510964, 490950, 492132]
17609D92132q430k9221P803q269L2656K6941M192l2086O531k1400k4026j5865
17597D30958P1043q710k7756M024M0360J4833L3156l070L0064P4349l7915m117
17585F17219J7887P504k9128L893j1905l9524K6691O2087j3136p7943k0568K3937
17573E67014L4537J1151l1409J6809R0093O8760j4235O2460M4163K7072P5430
17562I51845J05813J18817L8403J6441K4339N0966J6717q7999j08563q7857l1369
17551A007553p9661l8279j5485J9228l6531P110L8374P8495p696L1019M2834P9354
17539A126315J22096K8453K6647J3591O7920M0895p7467m5103J4597R4040J04142
17528A516126N5352o8789j13459j25103p4688o5550L9333J20070J24223M9711
$$ y = [492132, 483702, 454481, 462284, 454015, 486671, 513612, 517804, 485718, 492249, 470849, 446823, 430958, 502001, 493291, 465535, 469559, 509919, 524752, 557908, 554838, 584902, 659251, 621336, 617219, 635106, 642610, 613482, 617375, 605470, 565946, 592637, 654724, 641588, 563645, 543077, 567014, 601551, 612702, 581293, 598102, 688195, 756955, 742720, 805180, 849343, 876415, 951845, 1057658, 1176475, 1214878, 1231319, 1255658, 1306624, 1323341, 1235342, 1126779, 1038922, 1007553, 927892, 889613, 874128, 893356, 856825, 863935, 902309, 980804, 973108, 1004127, 1046961, 1126315, 1248411, 1276864, 1303511, 1317102, 1385022, 1425917, 1348450, 1303347, 1317944, 1411984, 1516126, 1571478, 1502689, 1389230, 1264127, 1189439, 1123889, 1163222, 1283292, 1407515, 1457226]
17518A457226o4919j26258n0489m0758p9706p4034k2731k0027k0789M8933K3832
17507A030280L1801P1820J8538k1170k7310p8539k5798l1163k0888n5951k3252
17496H68368L463k2126M0457m2109r665P7383L8708P2865R8956J42537J05970
17485A374807J56422K78737L32850J32026l9844j91099k65931j85937m5034O6673
17475A613670J73221K51372M2737j46652l52527l42049j72394o2255p2998l6912
17465H95213n4061r8147m8547j6260r1180n0422l4027L9560J4411k5081J051J0422
17453E42932L5162J8793J1871j7780k1925L4920R2253J42466J78774K01172K71455
17442A490093L50401J51035o2073r8491O011Q2178Q6385K3132j76676k10255r4192
$$ y = [1457226, 1392307, 1266049, 1215560, 1174802, 1095096, 1021062, 998331, 978304, 957515, 1006448, 1030280, 1062081, 1133901, 1152439, 1131269, 1103959, 1025420, 999622, 968459, 947571, 891620, 868368, 871831, 849705, 890162, 848053, 838388, 915771, 954479, 1027344, 1126300, 1268837, 1374807, 1531229, 1809966, 2142816, 2274842, 2234998, 2043899, 1777968, 1592031, 1546997, 1613670, 1786891, 2038263, 2081000, 1934348, 1581821, 1239772, 1067378, 1005123, 932125, 895213, 841152, 743005, 694458, 678198, 587018, 536596, 502569, 542129, 556540, 531459, 532510, 542932, 578094, 596887, 608758, 590978, 569053, 603973, 696226, 838692, 1017466, 1218638, 1490093, 1840494, 1991529, 1929456, 1830965, 1836976, 1919154, 2005539, 2028671, 1851995, 1641740, 1547548]
17431A547548j4024K5370J43137J16410N9140j35424j58059k22642j83509j58208
17421A019739p9476j21268j20942n8607j7076p5853n2188m376n2886k4338N112
17410D17841o949k3806l2947k0349m553L1740L837Q2147M7737j0479L748j4612
17398D73355K4294J06508O4029K5907N9163k197J1236k1083j1717j0270j0779
17387G08446j3179L3202N4718K204l7185K0625N0804l7842o4000l3047k7792p5662
17375E81292o7770k6189l7755L5131k3182j76J2041j6391M7562R0833Q8236K4705
17363G08337J7263P9808J08300J05000K35782K51375M9780p2556j28536j59025
17353A195528l6120L93N4941P0890p311o837K5567j77426j61882N3668J73443
$$ y = [1547548, 1533524, 1558894, 1702031, 1818441, 1877581, 1742157, 1584098, 1361456, 1177947, 1019739, 940263, 818995, 698053, 639446, 622370, 546517, 494329, 489953, 437067, 412729, 417841, 410892, 387086, 354139, 333790, 329237, 360977, 364814, 446961, 494698, 484219, 487967, 473355, 497649, 604157, 668186, 694093, 753256, 751059, 762295, 741212, 729495, 719225, 708446, 695267, 728469, 783187, 785391, 748206, 768831, 819635, 781793, 717793, 684746, 656954, 581292, 513522, 487333, 449578, 484709, 461527, 461351, 473392, 457001, 504563, 595396, 683632, 708337, 725600, 805408, 913708, 1018708, 1254490, 1505865, 1555645, 1483089, 1354553, 1195528, 1159408, 1159801, 1214742, 1285632, 1278321, 1271484, 1297051, 1119625, 957743, 1011411, 1184854]
17342A184854P6113n4361n4913r8044K2252P9464j3371j95275k53835j09709r1838
17331D91337r8476m2808L1731N4288j725p879K6301p1768R548J6205L1730N5020
17319D93504R8873R4967J23570J32523L0822L5897P6879R4831N2852N9739j2330
17308A282127o3503K9561K8476Q3546L7477M8903J20282P0300L4490m4817l8098
17297A588744k6924L351O4977J10453J85807N4580k50822l22660k33052r3747
17287A080707o5458j51781j88273j52441q6136k2474j7947l0960m5963J1032J9624
17276C49930J6296n3279k9515M2099n423O3763k0719k3264k5058k066M3432j0724
17264C45472j3642n6280m7400M6702J9659J3517K7533K0502J21744J17680J15129
$$ y = [1184854, 1260967, 1206606, 1151693, 1053649, 1075901, 1155365, 1141994, 946719, 692884, 583175, 491337, 392861, 350053, 381784, 436072, 434347, 426468, 452769, 381001, 390549, 406754, 438484, 493504, 592377, 687344, 810914, 943437, 974259, 1010156, 1087035, 1181866, 1234718, 1294457, 1282127, 1218624, 1248185, 1276661, 1360207, 1397684, 1446587, 1566869, 1637169, 1671659, 1626842, 1588744, 1561820, 1565171, 1630148, 1740601, 1926408, 1980988, 1730166, 1407506, 1174454, 1080707, 1015249, 863468, 675195, 522754, 436618, 414144, 396197, 365237, 319274, 330306, 349930, 366226, 312947, 283432, 325531, 320108, 383871, 363152, 339888, 314830, 312764, 356196, 345472, 331830, 275550, 228150, 274852, 294511, 308028, 335561, 356063, 477807, 595487, 710616]
17253G10616M8033n2425l5298O3977R8876Q6171L2851o4292q2804r6022L5350
17242G45033K8385j25448j52398j15382l5942j9989o2196p1600O198N9727k3063
17231B33325k7962n5938K8156M6161n085p6058l2354K9119L0689K2135k1629j0254
17219A60305N498l1720m8610l2305m006L1833M3715K5904k6123J0131Q546j7329
17207A25839j2621J4227m708J89M7170j6934j0986k244J9240j671k9290l9649
17195H8562q6030J5776J3517N238M1625K5857J367k0096N4985Q13k9593J8093
17183A30114K3668L132L389o4588j7948O9397J7322o0976m1298K1695L6487O32
17171A21026l099M1011M3578K5302K7697p6076m2380N753j6026j427j3756J7415
$$ y = [710616, 758649, 706224, 670926, 734903, 833779, 919950, 952801, 888509, 805705, 709683, 745033, 773418, 647970, 495572, 380190, 344248, 324259, 262063, 190463, 196661, 256388, 233325, 205363, 149425, 177581, 223742, 218657, 142599, 110245, 139364, 170053, 192188, 170559, 160305, 165803, 134083, 85473, 53168, 49162, 80995, 124710, 150614, 124491, 134622, 143168, 125839, 113218, 127445, 122737, 122926, 170096, 153162, 142176, 139932, 159172, 157501, 128211, 88562, 2532, 18308, 31825, 37063, 78688, 104545, 105912, 85816, 140801, 141614, 112021, 130114, 153782, 156914, 160303, 95715, 77767, 147164, 164486, 103510, 62212, 83907, 120394, 121026, 117927, 158938, 202516, 227818, 255515, 179439, 137059, 142812, 126786, 125359, 111603, 129018]
17159A29018K4040K7235q547O819Q803M5824K8038k7483o2991k5565J7408M3085
17147B05684L3317N5388L1713R0332J96036J47186R3548K9041J02867J48159J19268
17136A252539l8565j21384j46838o4899N5578l2479j92469k04934r1796q3809
17126C30944l9406K5305J7064o0811l988o333J490j418j7464m1292l6684O689
17114A74096K7520p023O021r450j875j2113M0201J4026j4501l5695l0168j5997
17102A35042o487J0545N7289R0440J70803J75076J06288P4097L9402R4744J11925
17091A059164L8443n0282j33837j22203k8393k8717m5329j20517j06154q5590
17081C76585l5820o9449n9369m1490p748L6791J1475J8222k5381l6499o2520P621
$$ y = [129018, 153058, 180293, 171746, 178565, 187368, 233192, 261230, 233747, 170756, 145191, 162599, 205684, 239001, 294389, 326102, 416434, 612470, 759656, 853204, 882245, 985112, 1133271, 1252539, 1213974, 1092590, 945752, 880853, 936431, 903952, 711483, 506549, 414753, 330944, 291538, 316843, 333907, 273096, 269108, 262775, 264265, 262847, 245383, 204091, 167407, 174096, 201616, 194593, 200614, 191164, 189289, 177176, 217377, 231403, 216902, 181207, 151039, 135042, 128555, 139100, 196389, 286829, 457632, 632708, 738996, 813093, 852495, 947239, 1059164, 1097607, 1047325, 913488, 791285, 762892, 734175, 688846, 568329, 462175, 376585, 340765, 271316, 211947, 170457, 162709, 199500, 210975, 229197, 203816, 167317, 104797, 112418]
17069A12418M1322O2638j1207j6237J2481N833j3555n8127L6278L1419M571N86
17057B08420K251o3291j5994P6374n8998n3678o435j5622n3857J971M3822M8473
17045A13436j7305m1052M387K311M6970N6829L1176M1586k1431o9033l7061j7863
17033I2950J0703m394j5452L9369J1918k9669J7426j558N930J3608J2746m2790
17021A10787K8967K6660j8564M364l6960r0792k7642M7185N2832L3703N072k1023
17009A14589K6925K0300k0758r980l7645k7432L6487J5851R305K5198l1952m6854
16997G4034J1411M6281J4K8366Q517L4997l8870k8945M350j0409M579N1984m9451
16984A36858J5837m1551l1502L0235M6889m3803k7605N306l5875N4640M5519n6779
$$ y = [112418, 153740, 216378, 205171, 188934, 201415, 207248, 193693, 135566, 171844, 203263, 207834, 208420, 210671, 147380, 131386, 207760, 148762, 95084, 88649, 73027, 19170, 21141, 64963, 113436, 96131, 55079, 59466, 61777, 108747, 165576, 196752, 238338, 216907, 147874, 110813, 92950, 103653, 99259, 83807, 123176, 135094, 105425, 122851, 121293, 127223, 140831, 153577, 110787, 139754, 166414, 147850, 152214, 115254, 24462, -3180, 44005, 96837, 130540, 135612, 114589, 141514, 161814, 141056, 131076, 93431, 65999, 102486, 118337, 127642, 152840, 120888, 74034, 85445, 131726, 131740, 160106, 168623, 203620, 164750, 135805, 140155, 129746, 134325, 186309, 136858, 152695, 111144, 79642, 109877, 156766, 112963, 85358, 90664, 54789, 109429, 154948, 98169]
16972I8169o9282j9123o377O0079j3305k9157K5536J6729k5475K5255J9556k414
16960H0191L0168R664O047K7875n1340n0071j6176j4060K4555J0574l837K2054
16948G5644K1262L1995k1250J0270l859l1386j5222r886l2866k0464l806K1350
16936B1782J4388M838J4615k3023k8010J4024K4420k6430r228K7169O4642n3414
16924D5773l6399L9775N2792L8719k1919j1235P889P67K0257k2112k355m4497
16912F7455J1545K0190Q002k6546m3521k2942N317J7479q54M1868l6932m8265
16900g204K9353k2583M190J0514K699l1216k9518M51K2278M9705K4454r757l0808
16887A2558K1213l154k6435K5987O4502N4814k6754n3268K1774l408M1074j203
$$ y = [98169, 28887, 9764, 3387, 63466, 50161, 21004, 46540, 63269, 37794, 63049, 82605, 80191, 110359, 120023, 126070, 153945, 102605, 52534, 36358, 22298, 46853, 57427, 53590, 75644, 96906, 128901, 107651, 117921, 114062, 82676, 67454, 57568, 24702, 4238, 432, 21782, 36170, 41008, 55623, 32600, 4590, 18614, 43034, 16604, 7376, 34545, 99187, 45773, 9374, 49149, 101941, 140660, 118741, 107506, 115395, 116162, 136419, 114307, 111952, 67455, 79000, 99190, 107192, 80646, 37125, 14183, 19500, 36979, 36125, 77993, 41061, -7204, 22149, -434, 3756, 14270, 16969, -14247, -43765, -43314, -21036, 28669, 53123, 43366, 12558, 33771, 30617, 4182, 30169, 94671, 149485, 122731, 69463, 91237, 87829, 128903, 127700]
16875A27700k8211J6272m029J4676j1662M770k2402K3369j9270M7727P8630o5076
16863A62494q0233j00897J0227K7005K7794l0456J1535K5958K5008M8503l2455
16852I4483l1541k1570j9107l6532Q729O2324K1372o7857L704j7589l5644K330
16840c6898L198L6879M5780K3494k2041Q034J2449j401K7732l31j0870m2834J5534
16827E8725Q48m722n792l2936J9608o038Q763K8757K7685J7560K9566o8418k7412
16814D6194J0311K5423J0948k2331L9782m7573j3623k1222K3519j505P179L6455
16802I3557l2550l3016o6961o6027M4618L5345L7773M9497K734r122j7237J7047
16790E5658p5J472L7317l885j2037m6743m1326j7797j0253r665n0481K5307k4548
$$ y = [127700, 99489, 115761, 111732, 126408, 114746, 119516, 97114, 120483, 101213, 148940, 227570, 162494, 82261, -18636, -8409, 18596, 46390, 15934, 27469, 53427, 78435, 126938, 94483, 62942, 41372, 22265, -14267, -5538, 56786, 78158, 10301, 14005, -3584, -39228, -36898, -33700, 3179, 48959, 72453, 50412, 58446, 70895, 69494, 97226, 96895, 86025, 43191, 58725, 59573, 54851, 49059, 16123, 35731, 29693, 38456, 67213, 94898, 112458, 142024, 73606, 46194, 56505, 81928, 92876, 70545, 110327, 62754, 49131, 27909, 51428, 49923, 57102, 93557, 61007, 27991, -38970, -104997, -60379, -25034, 12739, 62236, 64970, 55848, 38611, 55658, 55583, 57055, 94372, 90487, 78450, 31707, -9619, -27416, -37669, -47334, -97815, -72508, -97056]
16777i7056L1511M1519l7544j6285J1740K5956q416n897N6889L6018P8401j0871
16765A05965m2120j3140K180R013m304l2843J6391m0014o3304J5946M1463L256
16753a511K8848J8673j499n538L202j3200j7891q795L5149J2960J0532n0859j538
16740H533j1962k956K5977k0111P696J8195q024L3968K6279K2632O236o421J6226
16727A16268k2123o6439p2170J5649K4697M7666M930K1836J425o306M0274L74
16715A06081k6990p2935m632K5529J3479l321j3648k6449L9158M1914J5163k6320
16703F7029J7699k4661k0098m1900k6537J3233K5379N4451K1105j4788M24m9507
16691B1829n6866K2884M0484k574R935M1781J1618q487l3661k0748M1801j3697
$$ y = [-97056, -65545, -24026, -61570, -77855, -66115, -40159, -48575, -54472, 2417, 38435, 116836, 105965, 63845, 50705, 52885, 61898, 57594, 24751, 41142, 1128, -62176, -46230, -4767, -1511, 27337, 46010, 44511, 38973, 42175, 28975, 11084, 2289, 37438, 50398, 60930, 10071, 8533, -3429, -6385, 19592, -519, 7177, 25372, 17348, 51316, 77595, 100227, 106463, 100042, 116268, 94145, 27706, -44464, -28815, -4118, 43548, 48478, 70314, 71739, 65433, 105707, 106081, 79091, 6156, 1524, 27053, 40532, 37211, 23563, -2886, 36272, 78186, 93349, 67029, 84728, 60067, 39969, -1931, -28468, -15235, 10144, 64595, 85700, 70912, 71336, 21829, -35037, -12153, 28331, 25757, 35692, 77473, 89091, 80604, 46943, 26195, 67996, 54299]
16679E4299P217N8p0689l7755l546J3395J463p314M4764K2307k938M2898J5207
16666G9366p57O805K555k9984l3253K3747M4469J3546K4147k9471l0522j5493
16654E5155L614N128m8970j1949j3472L26l1082O1641L6900L8846j49j6662j2293
16641F7033j3262J9726p2555m185P844j0316J2478k841o51J833j1639p64j4220
16628b1519M431m2176J0343O2370k9051J6829j3041J7473l5586O524L5766J4656
16616B7019o8577m9383O696r179K5935l796k805k2758k9546p338M0127m515K9688
16603f8432K0888L4193k1082q2912m849L7824R1777K8465p3313j8149L4001P2221
16591E0632L8973o1730m7307l0747N797r149j0105M6819O7767l762k985K5351
$$ y = [54299, 61516, 61574, -9115, -46870, -50416, -37021, -35558, -42872, 1892, 24199, 21261, 64159, 79366, 78609, 85414, 87969, 57985, 24732, 48479, 92948, 106494, 130641, 101170, 70648, 55155, 58769, 63897, 14927, 2978, -10494, -10168, -41250, 20391, 57291, 96137, 95988, 79326, 67033, 53771, 73497, 942, -3243, 4601, -5715, 6763, 3922, 3271, 5104, -6535, -7299, -21519, -17088, -59264, -48921, 13449, -15602, 1227, -11814, 5659, -29927, -23403, 12363, 27019, -41558, -90941, -84245, -93424, -67489, -71285, -74090, -96848, -126394, -133732, -93605, -98120, -68432, -47544, -13351, -34433, -117345, -122194, -84370, 7407, 35872, -37441, -55590, -21589, 50632, 89605, 27875, -19432, -50179, -44382, -53531, -63636, -16817, 50950, 47188, 44203, 69554]
16579F9554L0716o762q444P232O1025j3674l4610m0437k3412l7040p5887k2515
16567i4254j2474L2850J5264j0925K5356N6059O33k5342j173j1861J1862L5892
16555B1887J8093J3145j4592m1736j9815K1186K3994k5253j5402k9572l7819J38
16543h5746J5036J2925J5474m0831q951O7628N9689j4304K9315j5624k9099j0980
16531e468M6963p495l8580j6978l803N1310J9312q475P504k7623M2987N3336m7203
16518F5787r0096k5476M3854P700N658R984j7001m7347N6111N5224j2039k0562
16506C1797q149j3179j9985K9555n4174n0842K3068R2276L7102n1122o4552m2244
16494i0449K6528J9691J9913j4255K8896m2199l1675Q1362J0788J8370o7908K336
$$ y = [69554, 100270, 93508, 85064, 92296, 153321, 139647, 105037, 64600, 41188, 4148, -71739, -94254, -106728, -73878, -58614, -69539, -44183, 11876, 12509, -12833, -14006, -25867, -14005, 21887, 39980, 53125, 38533, -3203, -23018, -1832, 22162, -3091, -18493, -48065, -85884, -85746, -70710, -57785, -42311, -83142, -92093, -24465, 35224, 20920, 50235, 34611, 5512, -5468, 41495, 34000, -4580, -21558, -25361, 25949, 45261, 36786, 44290, 16667, 59654, 112990, 65787, -24309, -49785, -5931, 1769, 7427, 17411, 410, -46937, 9174, 64398, 52359, 31797, 23648, 10469, -9516, 20039, -34135, -84977, -61909, 30367, 67469, 16347, -48205, -90449, -63921, -44230, -24317, -38572, -9676, -51875, -83550, -2188, 8600, 26970, -40938, -38602]
16482c8602L714n617M1502P803k4655k6819J545m655N8413M5247m938j9785m8767
16469a5614j6204L7137J0269n4289l2811O0056L2439o9856o7703J220N9901M2705
16457a2750p679K9525R425k9930j3666K3269P1693L2725l4508k7277K086N6183
16445I9096L4266k7026k8156j3412J99j3065m8129Q977J2446m670j100n8098K2865
16432a5807J7473M7548M7359L203o3823m1332N981P0071L2432j154J3544l2727
16420H2768k2381n48m698p188J0771K4054n0701m4888m2591J8316K7882r059k3090
16407d1353m383k3642k6546p150O5310Q3839K6854K6304o8983o4447m752J5415
16395b3534M1564J9898l0597l8313K912R903k5747J5258Q7296K6887n6273k0927
$$ y = [-38602, -34888, -40505, 997, 8800, -15855, -42674, -41129, -45784, 12629, 57876, 52938, 33153, -15614, -31818, 5319, 15588, -38701, -71512, -11456, 20983, -48873, -116576, -115356, -55455, -12750, -20429, 9096, 18521, -11409, -25075, -1806, 69887, 102612, 68104, 40827, 42913, 99096, 133362, 106336, 78180, 64768, 64967, 51902, 3773, 12750, 25196, 20526, 19426, -38672, -15807, 1666, 49214, 96573, 99776, 35953, -5379, 602, 70673, 103105, 101951, 115495, 82768, 60387, 59839, 55141, 47953, 58724, 82778, 32077, -12811, -55402, -37086, -9204, -18263, -41353, -45736, -69378, -95924, -103074, -37764, 46075, 72929, 99233, 30250, -34197, -38949, -23534, 18030, 37928, 7331, -30982, -28070, -18167, -43914, -28656, 58640, 85527, 29254, 8327]
16383H327m8010j7625o702o3899j9007J9699K2831N2184P284J1448j7546j7275
16371f8291J8821l006o908J9631m489K8059r716l1989O0848O3324k1472q5310
16359d0498O292R220n653l6693J4219Q6576K1283L446P7036m4737J0771L2994
16347A34256j5724N2864j4219l8133l1256k4093m1323M3418K2623q7441o2953
16336f1981k4276L732N3261J1968L084m7223o6067K7465M3517Q0236K5220l2262
16324A6674O862m0029k6789K2463L3309r95j234j5662J1512q853K1637J2060K0249
16311E1204n155k2920j4445K2107P650k0451l8120o4k7111j7581N6140O0126j0288
16298D1092L7886K8333O719L730l959n3613K5424N2825K051p5434r6959j2327
$$ y = [8327, -39683, -57308, -64010, -127909, -146916, -127217, -104386, -52202, -44918, -33470, -51016, -68291, -49470, -52476, -59384, -39753, -44242, -16183, -25899, -57888, 2960, 66284, 44812, -40498, -34206, -24986, -30639, -67332, -53113, 33463, 54746, 58192, 135228, 90491, 101262, 134256, 118532, 171396, 157177, 119044, 87788, 63695, 22372, 65790, 88413, 972, -61981, -86257, -82525, -29264, -17296, -14212, -61435, -127502, -100037, -56520, 23716, 48936, 16674, 23536, -16493, -43282, -20819, 12490, 11495, 10261, -5401, 6111, -2742, 18895, 30955, 51204, 46049, 23129, 8684, 30791, 38441, 17990, -20130, -20194, -47305, -64886, -8746, 51380, 41092, 78978, 107311, 114030, 117760, 113801, 60188, 85612, 138437, 140488, 65054, -31905, -44232]
16286d4232J0531j0458J2836J1792N2418l608L7278J7731L0999K7357o5814p0415
16274F415l2164l1498N6841M4546J2638K9580L2159p2373m8586M0105r0J0136
16262D7709L3725N4500P3099o6788o6552k6485j5331k7619J869M4706N4786k7600
16250H0019k2979k9958m7611n895J9585N4946N9061n0471l8311r452l9709L2510
16238A735O6404L5919n5814r899P014m4448K8545J1745j6032k8396O6753M9301
16226A12827O487J9046k7429n1739j3847M1284q117K114j4878j2038j1198k3347
16214A9165k4900m0014r094N2700O1623J9297k0949k2840L4283K5318K2280J6705
16202A33574l9637l2067J4968k1596m2831o634p080J6436K6281k3404J1627o561
$$ y = [-44232, -33701, -44159, -31323, -19531, 32887, 29279, 66557, 84288, 115287, 142644, 76830, 6415, -25749, -57247, -406, 44140, 56778, 86358, 118517, 46144, -2442, 37663, 37573, 47709, 81434, 135934, 209033, 142245, 75693, 49208, 33877, 6258, 8127, 52833, 107619, 80019, 57040, 27082, -20529, -26424, -6839, 48107, 107168, 56697, 18386, 8934, -30775, 1735, 68139, 104058, 48244, 38345, 45359, 911, 29456, 41201, 25169, -3227, 63526, 112827, 119314, 138360, 110931, 59192, 45345, 86629, 78512, 80626, 65748, 53710, 42512, 19165, -5735, -45749, -54843, -2143, 59480, 78777, 57828, 34988, 69271, 94589, 116869, 133574, 93937, 61870, 76838, 55242, 12411, 5777, -1303, 15133, 41414, 18010, 29637, 23076]
16190B3076j4994M0674l6306p947K93J7599M4004L8684o1014L1891K2229n1536
16178D6653l9362m817L0902Q81J062L0114k9955j6743l9047J3128K4113M3495
16166F0424l8533K047K2676K3338j6717l6082j6725J2711R15k5784j7359j9329
16154d8418J3045L6448q855N176q274m3374J2499M0895J5625j9057L9113K5262
16142F0085j0095j3357m0237p9794l2839R0637k240l2456L0601K0679l4787l5307
16130g9110M2258M4824O422j8043o3626l6645L5993j0179j1259M1913M5403J2563
16118A0514R151l2898J3392O142l6690K6835M0857J2127l5429m2559J3454j3152
16106b8256L0390O9893j784o6493m3947k3939j846J4064m293J6560K8504K1742
$$ y = [23076, 8082, 48756, 12450, 4503, 4796, 22395, 66399, 105083, 44069, 75960, 98189, 46653, 7291, 2474, 33376, 34257, 35319, 65433, 35478, 18735, -20312, -7184, 16929, 60424, 21891, 23938, 46614, 69952, 53235, 17153, 428, 13139, 14054, -11730, -29089, -48418, -35373, 1075, -7780, -2604, -10878, -54252, -41753, -858, 14767, -4290, 34823, 60085, 49990, 36633, -3604, -83398, -116237, -25600, -27840, -60296, -29695, -9016, -43803, -79110, -36852, 7972, 14394, -3649, -67275, -103920, -67927, -78106, -89365, -47452, -2049, 10514, 19665, -13233, 159, 6301, -30389, -3554, 37303, 49430, 14001, -28558, -15104, -28256, 2134, 72027, 70243, 3750, -40197, -64136, -65982, -51918, -56211, -39651, -11147, 10595]
16094A0595j5720M60m3993j8473l5319M4127K4119l511k2704M900N4389L1653
16082C0523P1800j4915p4143K1144N8072j8470K5673m7070m3156k2955m8020M1117
16070b0400O4944P742k524r5926J3162M3664k6065j2914J0076J9280K2795k1061
16058B773J7324o4441m1684L3495p788K5005L5870L35L9090J7558M0100j0241
16046H7396o0239o5554l2544P85M1102j7946p0508M6694L2397J8452Q187L5855
16034B4077m0504j4644L4048K0096K3506Q624l1778j14534K2477J6155J9091O1758
16022B8372k360n1703L9555j320J190k6724L171j0962k7397k4883J4608L1940
16010b6513k9008k6996M8179k5287M491K1996N0282L4072k185o4138k4119L4205
$$ y = [10595, -5125, -4665, -48658, -67131, -102450, -58323, -34204, -37715, -60419, -55519, -1130, 30523, 102323, 87408, 13265, 34409, 92481, 74011, 99684, 52614, 9458, -13497, -61517, -20400, 44544, 52286, 49762, -46164, -33002, 10662, -15403, -28317, -18241, 1039, 23834, 2773, 20097, -44344, -86028, -52533, -60321, -35316, 554, 889, 39979, 57537, 97637, 87396, 27157, -38397, -70941, -70156, -29054, -47000, -117508, -70814, -38417, -19965, -11778, 24077, -16427, -31071, 2977, 23073, 46579, 55203, 23425, -91109, -68632, -52477, -33386, 28372, 26012, -25691, 13864, 12544, 13734, -12990, -9819, -20781, -48178, -73061, -58453, -26513, -55521, -82517, -34338, -59625, -55134, -33138, 17144, 51216, 49031, -15107, -39226, -5021]
15998e021o813j1579j7788J6290j7864j961k7309k1152K1987J2054K0601P2371
15986C3816j0775l6142p479l8595j6892J621N0031j1370K659L618K3173j4091
15974b0426o3169p2650N9390L5923j0529K1611j8455K1646M4283J2972j7296K2158
15962A5458J5570J716J2327o679l9673K8170J6823q6034m9170R433J3561N3782
15950a4716N3296R462K5356l1964k8388P2959N2767M1348j1294j0891m4003J468
15938A15400L082J4283n047k4227J2499k7627k8222J0556L79l5166L2367j5873
15926E2404l5994k8693k5599L8666K9945k4217j5106q499j8749k7144J6169K854
15914d3963j7221l2173J150M5574M4835J9968r168Q088L3194o702j0321k5500
$$ y = [-5021, -11834, -23413, -41201, -24911, -42775, -44736, -72045, -93197, -71210, -59156, -38555, 33816, 23041, -13101, -20580, -59175, -76067, -74446, -24415, -35785, -33126, -29508, -6335, -20426, -83595, -156245, -96855, -60932, -71461, -49850, -68305, -46659, -2376, 10596, -6700, 15458, 31028, 32744, 45071, 38392, -1281, 26889, 43712, -42322, -91492, -82059, -68498, -14716, 38580, 48042, 73398, 41434, 13046, 86005, 138772, 180120, 168826, 157935, 113932, 115400, 118482, 132765, 127718, 103491, 115990, 88363, 60141, 70697, 71076, 35910, 68277, 52404, 16410, -12283, -37882, 784, 30729, 6512, -8594, -17093, -35842, -62986, -46817, -43963, -61184, -93357, -92207, -46633, -1798, 18170, 9002, 17090, 50284, 43582, 33261, 7761]
15902G761n9474j5899M0788j2203o881O523m7545q1N5495J0833k185j2516j0459
15889d5843Q010l0432j1472L9192K7546L6325L7093L6950J5295J0320p2145j7049
15877C3790J4006j5898l525k5939N163j6079m7837j6754N5800L8443J0439J9140
15865E0749N4873r187q4757o9076K4154M6890L3631R462k1693l6464j0310j0650
15853b2378k849m5090j882O5031r07N6207p28m3450m4166p1614R44N4554P4901
15840A8573K0225O938j2350j8260J5665M3413j6734n5764Q566J9651L8672J586
15828G0181n6332l8958P628p203l9932L0927J7248m1993K8729M0253L7392j9162
15816B8778k5569Q700j166q325j9658Q050k8831j9570O4964K9235q362o834l8546
$$ y = [7761, -51713, -67612, -26824, -39027, -45908, -39385, -86930, -87011, -31516, -20683, -22868, -35384, -45843, -37833, -68265, -79737, -40545, -12999, 23326, 60419, 97369, 112664, 122984, 50839, 33790, 47796, 31898, 28373, 2434, 7597, -8482, -56319, -73073, -17273, 21170, 31609, 50749, 105622, 96435, 11678, -57398, -33244, 13646, 47277, 56739, 35046, -1418, -11728, -22378, -25227, -70317, -72199, -7168, -8075, 48132, 47404, 3954, -40212, -111826, -110882, -56328, 18573, 38798, 45736, 33386, 15126, 30791, 74204, 57470, 1706, 10272, 29923, 68595, 70181, 13849, -25109, -17481, -24684, -64616, -33689, -16441, -58434, -29705, 10548, 47940, 28778, 3209, 11909, 10743, 2418, -17240, -9190, -38021, -57591, 7373, 36608, 28246, 21412, -17134]
15803a7134k9188L1606J8549m6579n1709L7993L3732k2525n0978M2338n205l9414
15791i8514K7138O7493J1745q381P7176Q4344m3116p6983o9366K1542L6807K0333
15779E0218k296l4757k908K1113M1567N3256j3755O296j7065l5589l5044K8893
15767E9929K0845Q460l3863j7237j5196j2743j9699o848m3042L479J7818o744
15755d4841P537j7433k4381K2168m4019n046J7861j1783M1560j8693j498L282
15743g5286q745L3975J2919q197k9689j5396J8408J1148O6416j3053j0160O217
15731a1443l1277J3651N0291k3805p1940o095j9130K07K7898M5029J4368j7951
15719c0197K591L9809J6269j2965n2727k9651M7744R235J6917N082l0626J4181
$$ y = [-17134, -46322, -14716, 3833, -42746, -94455, -56462, -22730, -45255, -96233, -53895, -59100, -98514, -71376, -3883, 7862, -519, 76657, 161001, 117885, 40902, -28464, -6922, 29885, 50218, 47922, 13165, 10257, 31370, 72937, 126193, 112438, 118734, 101669, 66080, 31036, 59929, 80774, 89234, 55371, 38134, 22938, 10195, -9504, -16352, -59394, -55915, -38097, -44841, -37304, -54737, -79118, -56950, -100969, -106015, -88154, -99937, -58377, -77070, -78568, -75286, -84031, -50056, -37137, -45334, -75023, -90419, -72011, -60863, 5553, -7500, -17660, -11443, -42720, -29069, 21222, -2583, -74523, -80618, -99748, -99541, -71643, -26614, -12246, -30197, -27606, 12203, 28472, 15507, -37220, -66871, -19127, -9892, 7025, 12107, -18519, -4338]
15707d338j4419N1153j6108m2563o9591m365j6784p668R7936M043j2839J4891
15695b0652j2835k4736N5327j1161p7680j774M8925k3214n98M9508N8071N702
15683D4883o0438m0762m0251k5153K8976R4716K5737k3532n4104L1230k1367j369
15671d1434L4662m0022n2855j0203j0175M3946O8868j1203q3442R926K3322k0204
15659h8814r977l1150l7456L689K6522M727M9402R0774p699P508J8945j2213O7961
15646H2219M9487m1092j1969k0683k2632k753n7996j7306M8982n3037r2652K1763
15634a17669M4244J5421L9084L1427O833m0675K9890K025j9053L9169j6727M4790
15622E8759K7048m9378n7921k100N2589m4098l8505m588O9040O0702K8103p649
$$ y = [-4338, -18757, 32396, 16288, -26275, -95866, -100231, -117015, -124683, -26747, -22704, -35543, -20652, -33487, -58223, -2896, -14057, -91737, -93511, -44586, -67800, -68398, -18890, 39181, 44883, -15555, -56317, -96568, -121721, -92745, 1971, 27708, 4176, -49928, -18698, -40065, -41434, -6772, -46794, -99649, -109852, -120027, -76081, -7213, -18416, -101858, -91932, -68610, -88814, -98791, -129941, -167397, -163708, -137186, -132459, -83057, 7717, 18, 7526, 26471, 14258, 82219, 131706, 90614, 78645, 57962, 35330, 32577, -25419, -42725, 6257, -46780, -139432, -117669, -73425, -58004, -18920, 12507, 19340, -21335, 8555, 10580, -8473, 30696, 13969, 58759, 85807, 36429, -21492, -23592, 28997, -15101, -53606, -58194, 10846, 71548, 99651, 92002]
15610I2002J0231k187j1804n4313m3731n411k7397j3914M1101K0008J1235k1414
15598e594n9206j6208m8699L6002K8637l2137j730L9146M1131K6732L4097n2780
15586a0609l4713J5439N096K323l7195m8728p1273J7608P5764K5147J2908K5442
15574b2791j1588N859l7530m165L6965k621p162k0384L3550L4465M636j7622j5793
15561b4181O6740j7303j2329o455n8142M726N722K7604m6838J836O7856M039l5747
15548b2472J333j0021K2158L0857K5725L552l6536l9008L5473L4748M8213k1584
15536G2438k2435J829o3977l0824L7172K2764p7752l3194n5941k6247P9362O5981
15524c0824j4361k2965J071N5718L6093q07n3922k1287k9875M817K9248j7689
$$ y = [92002, 102233, 100046, 88242, 33929, -9802, -15213, -42610, -56524, -15423, 4585, 15820, -5594, -64800, -81008, -129707, -93705, -65068, -97205, -98935, -59789, -18658, 8074, 42171, -10609, -45322, -29883, -24787, -22464, -59659, -108387, -179660, -162052, -86288, -61141, -48233, -22791, -34379, -28520, -66050, -70215, -33250, -35871, -43033, -63417, -29867, 4598, 9234, -8388, -24181, 42559, 25256, 12927, 6472, -51670, -46944, -41222, -13618, -60456, -58620, 9236, 13275, -22472, -21139, -31160, -9002, 21855, 47580, 51132, 14596, -24412, 11061, 45809, 94022, 72438, 50003, 51832, -12145, -42969, -5797, 16967, -60785, -93979, -149920, -176167, -96805, -30824, -45185, -68150, -67079, -11361, 24732, 23925, -29997, -51284, -81159, -76342, -47094, -64783]
15512f4783m71L5740M9579n815j4450k4348o893m001M3167l8531k3198J4820l9134
15499g8318N0713P2169l1065q1932j6484M2045L5399l1050j0815K4561M0469L8325
15487E4017m0999K0799M8548j9284p6069k8309j9620k8398k8059K1146K7655Q9024
15475B0451l7299k1082P868J6162k4758j2648k1537J7578L4254K1960K4540J7872
15463D3361j9842q477j9645q6243o6320J0153J2793J1418j9378O0098P0638L2919
15451B1475Q171o482k1795n6387L36L7146n2407L4787N4092L1541j051J4596k0447
15438D3575l8100K299q11J0072R010k258K3348k3849p106j1705J3717M6316l7751
15425B6757j1392M5350J2342j7193k5883P945R580n5546J0977j1037j2044m1632
$$ y = [-64783, -65254, -29514, 20065, 14250, -200, -24548, -31441, -35442, 7725, -30806, -54004, -39184, -78318, -27605, 44564, 13499, -68433, -84917, -42872, -7473, -38523, -49338, -24777, 15692, 54017, 13018, 33817, 82365, 63081, -12988, -41297, -60917, -89315, -117374, -96228, -68573, 20451, -16848, -37930, -30062, -13900, -38658, -51306, -72843, -55265, -21011, 949, 25489, 43361, 23519, 15042, -4603, -90846, -157166, -147013, -134220, -122802, -142180, -82082, -11444, 21475, 29646, 23164, 1369, -55018, -54682, -17536, -69943, -35156, 18936, 50477, 49426, 64022, 43575, 5475, 7774, 6963, 17035, 26045, 23787, 47135, 23286, 16180, 4475, 18192, 64508, 26757, 15365, 60715, 73057, 55864, 29981, 37926, 47506, -8040, 2937, -8100, -20144, -61776]
15413f1776l3834N2065J7795J7841l700k9776m1125J7209L895l8649M9688O6917
15401A6550o9734l2388N2157K2538N291J7261K239M6022J9908O075n048n1986
15389B8885K83J9590m0720L4649Q148N0241L8093P7355O7019M1254P8044J22951
15377E25792J94389K78077K55859K14318J51972J41114J06830Q110q1159p3596
15367A721706o1647p7210j92535k79740j84951j82619j47133j29666j10652q9526
15357B66027m4003m7810l2281m3228j7803k6428K6715O173n119k7919l5368m3
15345A8913O031J257P437j7027k1458L5761O3587j2993n9190J9777n6773m1203
15333e5881k413m0807M2221L7969j9279k6133L2541m1875k498J2623J9847j222
$$ y = [-61776, -95610, -43545, -25750, -7909, -11609, -41385, -82510, -65301, -61406, -100055, -50367, 16550, -53184, -85572, -33415, -10877, -5586, 11675, 13914, 59936, 79844, 85919, 80871, 28885, 29168, 48758, 8038, 42687, 50835, 101076, 139169, 216524, 283543, 324797, 402841, 525792, 720181, 998258, 1254117, 1468435, 1620407, 1761521, 1868351, 1876461, 1795302, 1721706, 1660059, 1582849, 1390314, 1110574, 925623, 743004, 595871, 466205, 355553, 266027, 222024, 174214, 141933, 98705, 80902, 54474, 81189, 87362, 82243, 54324, 18956, 18913, 24944, 26201, 33638, 16611, -4847, 30914, 94501, 81508, 22318, 42095, -14678, -55881, -58294, -99101, -56880, -18911, -38190, -64323, -31782, -73657, -76155, -63532, -43685, -44907]
15321d4907L4952k6435J3409n418j7012J544J1116Q192j1502J0753l8221n7030
15309a20559J9605P4906L889n22j2826q05M3449O0284l6770L8070k3197l4325
15297A1199l208N6421J0482J1418J4262M2793L3713J0680N8609Q4085P1363N8965
15285D60782Q5609O2255J17204K05787J55975J59482K21284J62235P7405l1323
15275A676695k2788l055j01903j62837k34098j66188q6052j00216j49581r6960
15265E53017j00409j38708j53365r6236l6826K5187M6966J3178l058n6909m8068
15254D769L5304M518K7244j5673l0241o6316J808q953J5737K0474Q241l2288J662
15241c3714Q5078J5820l6311k9359p027m58k4918k0951M2929L5963J945k381J7255
$$ y = [-44907, -9955, -36390, -22981, -28399, -45411, -43867, -32751, -24559, -36061, -25308, -63529, -120559, -100954, -26048, -22159, -22681, -35507, -36312, 7137, 67421, 30651, 68721, 45524, 11199, 7991, 64412, 74894, 86312, 100574, 143367, 177080, 187760, 246369, 330454, 401817, 460782, 546391, 608646, 725850, 931637, 1087612, 1247094, 1468378, 1630613, 1708018, 1676695, 1653907, 1650852, 1548949, 1386112, 1152014, 985826, 899774, 799558, 649977, 553017, 452608, 313900, 160535, 64299, 27473, 52660, 99626, 112804, 109746, 52837, 4769, 40073, 44591, 71835, 56162, 25921, -40395, -38587, -47540, -31803, -11329, -3088, -35376, -33714, 51364, 67184, 30873, 1514, -5513, -5971, -30889, -51840, -8911, 27052, 28997, 26616, 43871]
15228D3871l137m9696N511Q344l138P0923K3411q0288n1099p789J4253N2689j248
15215B2607M4277l0588o7427N472J5687o8096n8544M2458N9453K3828L109P870
15203A06K4709j0026m5529j1251O8383J6704l2488n9350k4928N1846K2105N6604
15191E6885K538q8360j2863q346j1236K7596K1735P373k5013n410m247J9259j9957
15178d0046m1372k3948j5514O670P7132M8861k5117k1566k815Q3098N4375o0382
15166C9376n2287J955p2271k2904Q8432K9867m3968n4228L5977O8940L1903l5941
15154A4851m1365l4257J5493m2276l6582l3315l312L2009J09195L7870j8145K0889
15142B1055O105j0620K0340m7494j513L7679j5283k8786Q986J271L7367L5166
$$ y = [43871, 40734, -8962, -3451, 4893, 1755, 72678, 96089, 15801, -35298, -43087, -28834, 23855, 22607, 66884, 36296, -31131, -25659, -9972, -78068, -136612, -94154, -34701, -10873, -7764, 106, 24815, 14789, -30740, -41991, 26392, 43096, 10608, -48742, -73670, -21824, 281, 56885, 59423, -28937, -41800, -50146, -61382, -33786, -12051, -4678, -29691, -35101, -39348, -20089, -40046, -81418, -105366, -120880, -114210, -37078, 11783, -13334, -34900, -37715, 45383, 99758, 39376, -12911, -10956, -83227, -106131, -17699, 12168, -31800, -86028, -50051, 18889, 50792, 14851, -26514, -60771, -45278, -87554, -124136, -157451, -160763, -128754, -19559, 18311, 166, 21055, 27160, 16540, 36880, -10614, -12127, 25552, 10269, -18517, -9531, -8260, 29107, 64273]
15130F4273J1824n0176o944k2648k8997j8848K8411j0360p800l6347n259Q8359
15118E488O7978O019Q2856K6078n4654n6547l8388K3847K3942m07l9911K6432
15106G2733O9655K7064l5639j8421k4513m6990L2432J4473M5782Q4662P4623J07486
15094D03347J59838J76897K46268K59335K71626J96088J33916M4151l5761m2387
15084A813318o3201j51379k35955k90294k89783k56494j73675p6022m0079l5236
15074B01200j4848J0062l3073q2945m8584J8772P654l4942k214M8017n3053m4872
15062b8826J7177R487K460K5261J0086J3148J8333l0039m5457O394N3327L7848
15050H9199l1040p0397K5690N7953R031m4912m3463O5444K7616K466k3611L6541
$$ y = [64273, 76097, 25921, 18977, -3671, -32668, -51516, -23105, -33465, -41265, -77612, -82871, 5488, 73466, 79485, 162341, 188419, 133765, 77218, 38830, 62677, 86619, 86212, 46301, 72733, 142388, 169452, 133813, 115392, 90879, 43889, 76321, 90794, 136576, 221238, 295861, 403347, 563185, 740082, 986350, 1245685, 1517311, 1713399, 1847315, 1891466, 1855705, 1813318, 1750117, 1598738, 1362783, 1072489, 782706, 526212, 352537, 276515, 236436, 201200, 186352, 196414, 163341, 80396, 31812, 50584, 58238, 23296, 21082, 69099, 16046, -28826, -11649, -2162, 298, 25559, 35645, 48793, 67126, 37087, -8370, -1976, 51351, 89199, 58159, -12238, 13452, 71405, 80436, 35524, -7939, 57505, 85121, 87587, 63976, 100517]
15038A00517K2973k4439Q945K4058m205N0498k0316k7494J5848N806M779k9763
15026A27207P486L0920K2064o5795m9395P0132L5528j3012P2893R5566O2255Q8318
15014D84167K3182o7514n5774K5849K3338p4594k7224k7543n3715j4939K7097
15003B62330o636j4551P6268k2564l5486l30J6932K6458o36n635j0485m5493l8807
14990B01365k1981k127J2567q81M3826l9879o6019m6086j9574o508M5591j7467
14978H2827l7912j5326K9217J4775l3053j4815O024R86K1835J1046R791M5003
14966A20398J6316j303J850L4265m90k5526J5064N6598m4731j5730n9005j3277
14954H4429j7838r122J13756Q1769j466k5044k8238m315N822l0963j4535o4273
$$ y = [100517, 123490, 99051, 107996, 132054, 127849, 178347, 158031, 130537, 146385, 152191, 156970, 127207, 134693, 165613, 187677, 121882, 72487, 142619, 178147, 165135, 238028, 333594, 395849, 484167, 507349, 439835, 384061, 409910, 433248, 358654, 331430, 303887, 250172, 235233, 262330, 255694, 241143, 317411, 294847, 259361, 259031, 275963, 302421, 301785, 296150, 285665, 240172, 201365, 179384, 177257, 189824, 188943, 232769, 192890, 126871, 80785, 61211, 54703, 100294, 82827, 44915, 29589, 58806, 73581, 40528, 25713, 31737, 32723, 54558, 65604, 75395, 120398, 136714, 135411, 137261, 171526, 171036, 145510, 160574, 217172, 172441, 156711, 97706, 84429, 66591, 57469, 171225, 252994, 251528, 226484, 198246, 193931, 199753, 168790, 154255, 89982]
14942H9982J118K3533J0411O3273K9753l0713o0841o3210L2661J5476N475l9869
14930G7049j1112K4776k5616l9037k0049K6275M119J2028J9866J961P3003L4077
14918A77340R771j0569p322j8186K2631K0418L7465j8795l0690j4642K1701Q2878
14906B72000K1013L0105k7608o153l431K9345k8602l8642l6672o6634m7847p233
14894H9641J24573M1724o18J8047k6444k0801N213p7997q2280K2072j5855n080
14882G2195o381M8944K8815N8692K502l5939j6787n836l276N3213J3699L3031
14870B42872m9542J2414J9412k4776K6807l0126j7425M6069L5227Q6242Q7464
14859D34638N7726K1940M1426o699l5527J9762n8558r9468n4121n4382o6798j7706
$$ y = [89982, 91100, 114633, 125044, 188317, 218070, 187357, 126516, 63306, 95967, 111443, 116918, 77049, 65937, 90713, 65097, 26060, 6011, 32286, 36405, 48433, 68299, 70260, 143263, 177340, 187111, 176542, 169220, 151034, 173665, 194083, 231548, 212753, 182063, 167421, 189122, 272000, 293013, 323118, 295510, 289357, 285926, 315271, 286669, 248027, 211355, 144721, 96874, 89641, 214214, 255938, 255320, 273367, 246923, 226122, 231335, 153338, 71058, 93130, 77275, 72195, 65814, 114758, 143573, 202265, 204767, 168828, 152041, 146205, 142929, 196142, 209841, 242872, 193330, 205744, 225156, 200380, 227187, 197061, 179636, 225705, 260932, 347174, 434638, 492364, 514304, 555730, 549031, 513504, 533266, 474708, 375240, 321119, 266737, 199939, 182233]
14847A82233N2910M3688O4431J112r430n0069m8969L2853k1607r4007n38O5103
14835B17710L7042k2225j7326L3037J2810m3180l1285k4769M6433K6503J806N8639
14823B95195k9381j2662J2800m8005k2544J367J958j5318o6211M668Q2629M3310
14811B47806J730K2534K3768r052m4541J0165q9224o4643n9923m1078k5403M8424
14799B0563J6033K0465K667j2242o0438N3782K1179m4873n4548k8337J7325Q135
14787d0289m630L414o201j1055J00921L8724J7017K1971R465k7508L6196J2584
14775A50609n129p7636k66L0969J0290m9053m2054O0868k657n7852J4534K2253
14763E4876n9416l7425M7046L6797k6196J0452m275m3513j3052O6524M8881p217
$$ y = [182233, 235143, 278831, 343262, 344374, 334944, 284875, 235906, 268759, 247152, 153145, 152607, 217710, 254752, 232527, 215201, 248238, 261048, 217868, 186583, 161814, 208247, 234750, 236556, 295195, 265814, 253152, 265952, 217947, 195403, 196770, 198728, 183410, 117199, 121867, 204496, 247806, 249536, 272070, 295838, 286786, 242245, 252410, 163186, 98543, 38620, -2458, -27861, 20563, 36596, 57061, 59728, 47486, -12952, 40830, 62009, 17136, -37412, -65749, -48424, -40289, -44919, -41505, -47706, -58761, 42160, 80884, 97901, 119872, 129337, 101829, 138025, 150609, 145480, 67844, 67578, 98547, 108837, 59784, 17730, 78598, 75941, 18089, 32623, 54876, -4540, -41965, 5081, 41878, 15682, 26134, 21859, -21654, -34706, 31818, 80699, 73482]
14751G3482j6902j6519l7483P7812J8917J0396L856k1974j4867j8662j5036O630
14739D9650M8485o002j3418j6275n7895j4899K7630K2941M2484k1109j5449L0732
14727G6875L6981J3898l0501j6060j5050n6863M7494L5579j1961m3206j9865n693
14715A1628k4728k7989M2296K0168L799k3953N5204j3134n0683J3403K0185q6014
14703e9818j7760J4803L4982M6903J9492J7620n0809j8870J1654N305k4704j2173
14691c3375l5089K587Q934L8442J8146p446k8738m728M1451L1153P186l0622p273
14678F28K8394P2694n1222j9308l9510K8210N362R052O469o6j0343J072K240P21
14664C4393r6204n9594K1616P2575J4871J6436k8799P171M3654J10589o224k2730
$$ y = [73482, 56580, 40061, 2578, 80390, 99307, 109703, 113559, 91585, 76718, 58056, 43020, 49650, 98135, 92133, 78715, 62440, 4545, -10354, 17276, 40217, 82701, 61592, 46143, 76875, 113856, 127754, 97253, 81193, 66143, 9280, 56774, 92353, 80392, 37186, 17321, 11628, -13100, -41089, 1207, 21375, 25174, 1221, 56425, 43291, -7392, 6011, 26196, -59818, -77578, -62775, -27793, 19110, 38602, 56222, 5413, -13457, -1803, 3502, -21202, -33375, -68464, -65877, -56943, -18501, -355, -7801, -36539, -41267, 184, 31337, 38523, 7901, 628, 29022, 101716, 50494, 31186, -8324, 19886, 25248, 34300, 40769, 40703, 30360, 31432, 33672, 34393, -61811, -121405, -99789, -27214, -12343, 4093, -24706, -17535, 26119, 136708, 130484, 107754]
14652A07754j5161j8498m0480j7211k6620j9191k4256L0164L3117J2981K0523
14641D3122k365J9109l7387j6600j4861l9791k9416K8989M2623l6575o5220M468
14629a03904k0409L853J6988K7454J0415k0348J4657j7398j5286R547L6496k0088
14617g8023K3718N6984Q726K1928J03k0628k8841k3016l2823L2202N0471n8772
14605d7971k5894J8195L8947L9359m3843m7032J5105N1979k1954j3124N01m3929
14593g9661J2270o376n2674K1063J9735L0086J6354J7146L4925j5766P586Q030
14581A2718o9998j6216K7373j9574J0217M167j683j4999M7948L1777K0161p509
14569B4382o6043P8026O5595k7201l7026j5252j0688j3024r127k8963O2350M9105
$$ y = [107754, 92593, 74095, 33615, 16404, -10216, -29407, -53663, -23499, 9618, 22599, 43122, 40757, 59866, 22479, 5879, -8982, -48773, -78189, -49200, -6577, -43152, -108372, -103904, -124313, -120460, -103472, -76018, -65603, -85951, -71294, -88692, -103978, -94431, -57935, -78023, -54305, 2679, 11405, 33333, 33436, 12808, -16033, -39049, -71872, -39670, 10801, -47971, -73865, -55670, -16723, 22636, -21207, -68239, -53134, -1155, -23109, -36233, -35732, -79661, -67391, -73767, -126441, -105378, -85643, -55557, -39203, -22057, 12868, -2898, 4688, 12718, -57280, -73496, -46123, -65697, -55480, -51313, -52996, -67995, -20047, 11730, 31891, 24382, -41661, 36365, 101960, 74759, 37733, 22481, 11793, -1231, -10358, -39321, 23029, 72134]
14557G2134l1528l451R827p026m6783O811M3291j4320k0951J2288l111k8729N1096
14544C9548M2789R934m9407r5882j4701K8794M144J780M9076J4018p413L3414
14532E6094j5081J3268Q579j5969m000m104k0611l7739O941k3463r737J6966l379
14519c2235K8507l7186l9733K708j10L0846N1499m244k0070J9193R687J6175k1334
14506C703k5364m9775j0090M9158K2959l915k6204M7384l7948J7746j2824L138
14494b2032p471k1219P205J5136O8300L0448o5500l8222O2231j2964j8033L5474
14482C3353P7852Q94k4430J2200r53j0729l9558k4781j5421J0348N5734p42M7988
14469A21755N5728O8732P601n387q173j990l267K4903K6682R2048L9736o4908
$$ y = [72134, 40606, 37155, 46982, 39956, -6827, -16, 43275, 28955, 8004, 20292, 17181, -11548, 39548, 82337, 92271, 42864, -53018, -67719, -38925, -34781, -33001, 16075, 30093, 22680, 56094, 41013, 54281, 62860, 46891, 42891, 38787, 18176, -19563, -12622, -36085, -45822, -28856, -32235, -3728, -40914, -80647, -77939, -78049, -47203, 4296, 52, -20018, -825, 8862, 25037, 3703, -21661, -71436, -81526, -32368, -9409, -13324, -39528, 7856, -30092, -12346, -25170, -22032, -29503, -50722, -43517, -28381, 39919, 70367, 4867, -33355, 28876, 15912, -2121, 33353, 111205, 112099, 87669, 99869, 98916, 88187, 48629, 23848, 8427, 18775, 74509, 73767, 121755, 177483, 246215, 253816, 248429, 240256, 238266, 234999, 259902, 286584, 378632, 418368, 353460]
14457C53460J453k6435K731K3085m5932p832J7761m0837P96N177j1977l1095o933
14444B33422K4681K5357j3922m4307o1487k8660J9014M7718M4221n9450n2348
14433A34239J1977N5560M2514r460m5665p149J3959N723K0396j217L5245J6361
14421B72483n0104J2658l905P9577K4884n716J4454j9553N451K2573l2629J6631
14409C36804k8916p7730j0034K5073M907J6531M2968K868q4018o6961n7133L2077
14397A36436M513l0044p768j143k6911k5222j6576L240q455P0464j3938q0767
14385C829m3149j707N477L1198r897j9015J2317M6580J6025l1150r491K7667j0054
14372A8630l8618m4933K1819N891j2929M6470L0520n532M768P674O3638K1659
$$ y = [353460, 354913, 328478, 331209, 354294, 308362, 300530, 318291, 277454, 278250, 283427, 271450, 240355, 233422, 258103, 283460, 269538, 225231, 163744, 135084, 154098, 201816, 246037, 186587, 134239, 146216, 201776, 244290, 234830, 189165, 182016, 195975, 201698, 222094, 220877, 256122, 272483, 222379, 235037, 231132, 310709, 335593, 329877, 344331, 324778, 330229, 352802, 320173, 336804, 307888, 230158, 220124, 245197, 250104, 266635, 309603, 312471, 228453, 161492, 104359, 136436, 140949, 110905, 103137, 101994, 75083, 49861, 33285, 36525, 28070, 98534, 84596, 3829, -39320, -41027, -35550, -4352, -14249, -33264, -20947, 25633, 41658, 10508, 1017, 28684, 18630, -19988, -64921, -43102, -37211, -50140, -3670, 26850, 21318, 26086, 33760, 97398, 119057]
14360A19057j192K1673l2156o026p3606n1245L3166O0250K5144L0168M811p9855
14348E0189r6181L5338J9541o6703L598j299P0453K7235N088l8326p6528k7461
14336i5056J3088j3897l3685O3850j5910L5653j6426j8699J4975J6517j689L8838
14324a2441M3817J4553m3039k478j5349n9587j6231N0202N3981K85J2847J7073
14312D3633N9136K252k3082j3511q779j218N447J1093k342r001m0173k598p516
14299A3341P552J7721k2409m8523l6669o234N521k876J3277N8183K3970m1341
14287a8487m9255r377J1832L0923J6569n6876L227M6956L950R208m837k0381J9752
14274a6796K7667l4512j4389M0344j2749k4560J8116J9444r866L6643K5729j3649
$$ y = [119057, 117865, 139538, 107382, 101356, 27750, -23495, 9671, 69921, 95065, 125233, 130044, 50189, -45992, -10654, 8887, -57816, -54218, -55517, 14936, 42171, 47259, 8933, -67595, -95056, -81968, -95865, -129550, -65700, -81610, -45957, -62383, -81082, -66107, -49590, -51279, -12441, 31376, 45929, 2890, 412, -14937, -74524, -90755, -40553, 13428, 13713, 26560, 43633, 102769, 105021, 81939, 68428, 59649, 58431, 63878, 74971, 72629, 63628, 23455, 20857, 13341, 20893, 38614, 16205, -32318, -68987, -75221, -69700, -72576, -59299, -1116, 22854, -18487, -67742, -77119, -65287, -34364, -17795, -74671, -71444, -24488, -20538, -11330, -16167, -36548, -16796, 10871, -23641, -38030, 2314, -10435, -34995, -16879, 2565, -7301, 29342, 55071, 41422]
14262D1422l0362J0234k7641K1215J1802L801J8616m1168j6165k03o761m7427
14250f2637q868l0343K2162M294j0872K3547N0859L5500J6573o6030L115O821
14238a5879j7900p0188m2384K3817M4635k6059J2746K3911j326j4693p812Q4232
14226f900L6813Q042L0158j6099l8091j1504J5072q888J5015J3413o631j0296
14214B0104n0015j8744J5608K5506K7884K5693J0080J9715l807m0229m303p1739
14202d4247j7452N3351O0194r659L187l3033j2290p482n9055j7562j1470K2987
14190g2531L6074J6526L015j1809j4235K4635p707k2025L1016K2131q120L9287
14178C6257L961J7266j1369m314m6524J2183M6468N2467r980k7514l8289n6997
$$ y = [41422, 11060, 21294, -6347, 14868, 26670, 30471, 49087, 7919, -8246, -8449, -15210, -62637, -71505, -101848, -79686, -75392, -86264, -62717, -11858, 23642, 40215, -25815, -22700, -15879, -33779, -103967, -146351, -122534, -77899, -103958, -91212, -67301, -68627, -83320, -91132, -6900, 29913, 37955, 68113, 52014, 13923, 2419, 17491, 8603, 23618, 37031, 30400, 20104, -29911, -48655, -33047, -7541, 20343, 46036, 56116, 75831, 72024, 31795, 27492, -44247, -61699, -8348, 51846, 42187, 45374, 12341, 51, -7431, -66486, -84048, -95518, -72531, -36457, -19931, -16916, -28725, -42960, -18325, -26032, -48057, -17041, 5090, -3030, 36257, 40218, 57484, 46115, 41801, -4723, 7460, 53928, 106395, 96415, 68901, 30612, -26385]
14166b6385k7170K1672K8683J1072r512K9396l3231k2764k3068L543j7184J1328
14154e3620J9364K3912M1804J5095r738l7594o7611L2185j769P0429M2046l3318
14142D1185L5980K3457n0651l6574j1110J495j2642L1588L0351J5589k4616m107
14130C9945n4101K0788J8875J397l7410Q9510n535j036j2872K2556j331j6835
14118F3951Q322k6319k7279K0912N296j1539K3523j6770k0274p903l1930o0361
14106h0371q3676K8603Q481K6370Q9530J1028l5084Q6434j6713K8322J8213j7882
14094F3255k7362K954M2194P2340P53n6425o9265R377P136p098j5698Q140J2307
14081D2608n2231n3940j6224M4674O9156o19K8385J512j3742r66J3811j7041n8153
$$ y = [-26385, -53555, -31883, -3200, 7872, -1640, 27756, -5475, -28239, -51307, -47764, -64948, -53620, -34256, -10344, 31460, 46555, 36817, -777, -68388, -36203, -37972, 32457, 74503, 41185, 77165, 100622, 49971, 13397, 2287, 3782, -8860, 22728, 53079, 68668, 44052, 39945, -14156, 6632, 25507, 26904, -10506, 79004, 73469, 72433, 59561, 82117, 80786, 63951, 72273, 45954, 18675, 39587, 44883, 33344, 56867, 40097, 19823, 11920, -20010, -80371, -164047, -135444, -126963, -100593, -11063, -35, -35119, 51315, 34602, 62924, 81137, 63255, 35893, 38847, 81041, 153381, 154134, 97709, 28444, 37821, 44957, 37859, 22161, 30301, 42608, -9623, -63563, -79787, -35113, 34043, 33424, 61809, 63321, 49579, 48613, 62424, 45383, -12770]
14068a2770j3732K1505K2353J2457n9712k8182q891N715L822j4103Q963K9658
14056c2917J4356k4323K7665J5029o9270J7188N8713M1314K5428K2386k3518q417
14044F3634M2675k5586l2155k4337k7271p775J3285J3307L5435l0043r759j6744
14032e334M6427P3252K3194J6020k6597k588r1716k1438J4171M273k4308N2872
14020E8228j825K5490o7661m7311M3654M0549k9556o8604r0238N8999M6621J5186
14008a6468N076L9653q457P688m120L0916L139j0906l76M0214k7929m2500r830
13995F100K1403l7859n6506P486P0659M0818J9873o909k7786m1L163k983J6498
13982E3916m160M0739K7251K2450K2386k8898m9055J4322K9727P5541K5865l7157
$$ y = [-12770, -26502, -4997, 17356, 29813, -29899, -58081, -66972, -61257, -57435, -71538, -62575, -32917, -18561, -42884, -15219, -190, -69460, -52272, 6441, 47755, 73183, 95569, 72051, 63634, 106309, 80723, 48568, 24231, -3040, -10815, 2470, 15777, 51212, 21169, 11410, -5334, 41093, 114345, 137539, 153559, 126962, 124374, 32658, 11220, 25391, 29664, 5356, 58228, 56403, 81893, 14232, -33079, 10575, 51124, 21568, -47036, -137274, -78275, -31654, -16468, -11392, 28261, 19804, 27492, 23372, 54288, 57427, 46521, 46145, 86359, 58430, 15930, 6100, 27503, -10356, -66862, -59376, 11283, 52101, 71974, 65065, 37279, 37238, 40401, 37418, 53916, 49756, 90495, 117746, 140196, 162582, 133684, 84629, 98951, 128678, 204219, 230084, 192927]
13970A92927o3980N2471M6374K4127j6130j6113l8707j03123m6444m2826k9117
13959d0541M0024P3737O5812K308J8833l0358k9053j1993M1476L7396l5251n7023
13947G5367r918l565M5165Q929k8112n9523l8375K2368J5770M1234K2482M6555
13935A38377O4977P0508l4675m5274k2112m9800n271J718o5748j1881p470L0987
13923F4336L4273L8099k8442n0235K2412N5805l2971k0320p590m9360M0476J0317
13911G6800N5993R0201J8974m6779K0512M0672j1001L4975k052o623o1040o6134
13899A44498k2145J4681p1440m1184N5157M1304J2221k7415l1232k4120k687N5378
13887A03016m3038k3743K3262K2546N4659M3786l4797l2170j1190m9452l8923
$$ y = [192927, 128947, 181418, 227792, 251919, 235789, 219676, 180969, 77846, 31402, -11424, -40541, -517, 73220, 139032, 141340, 160173, 129815, 100762, 88769, 130245, 167641, 132390, 75367, 65449, 61884, 107049, 115978, 87866, 28343, -10032, 12336, 28106, 69340, 91822, 138377, 203354, 273862, 239187, 193913, 171801, 122001, 116730, 118448, 52700, 40819, 33349, 64336, 98609, 136708, 108266, 58031, 80443, 136248, 103277, 82957, 75367, 26007, 66483, 76800, 132793, 222994, 241968, 195189, 215701, 256373, 245372, 280347, 278295, 271672, 210632, 144498, 122353, 137034, 65594, 24410, 79567, 120871, 133092, 105677, 74445, 50325, 47638, 103016, 59978, 36235, 59497, 82043, 136702, 180488, 145691, 113521, 102331, 52879, 13956]
13876A3956J3840R1999O6788P072m0111l2144O3739k1539N7318M1008Q0305M4293
13864C86524L3365P9361O6054N4424M3017j6192j13971p8859r6686j08257m4332
13853B04448l5874l4127j953P904L1974L291j1793p8311j494N059L2987M1566
13841A63677M686m4080j5999j8521O3045J4487m7863K1792r055j6797l125P5546
13829A87793k6474r268p085P464M604j8538k6884O2257P2298M9990J7335O3268
13817C76760J15180J27638R4902J49019O6844l335j27134k11640j63410j14426
13807C10398j29756o5443L2555j0789J718J0445l5318M4615J8441j1036j6502
13796A49328m6042K1016N763L89j2880K239k4868m8173K3449M7428J1097l7418
$$ y = [13956, 27796, 119795, 186583, 193655, 153544, 121400, 185139, 163600, 220918, 261926, 342231, 386524, 419889, 499250, 565304, 619728, 662745, 646553, 532582, 453723, 357037, 248780, 204448, 168574, 134447, 132494, 140398, 172372, 175663, 163870, 85559, 84065, 89124, 122111, 163677, 168363, 124283, 108284, 89763, 152808, 167295, 119432, 141224, 132169, 115372, 112247, 187793, 161319, 152051, 144966, 152430, 157034, 138496, 111612, 173869, 246167, 296157, 313492, 376760, 491940, 619578, 714480, 863499, 930343, 927008, 799874, 588234, 424824, 310398, 180642, 115199, 147754, 136965, 138683, 149128, 113810, 158425, 176866, 165830, 149328, 103286, 124302, 130065, 130454, 117574, 119813, 94945, 46772, 70221, 117649, 128746, 91328]
13784I1328J538k2452K0601k8858k7998J3849J2119O8337l955K9631L0619k5259
13772A59500j5051R110M8128Q4026J26126J27549O7279M0723l647m6046j03265
13761D94432o1308q2728k6247p2556m2424n8447M5466J4680O741N1368k6457n6043
13749A86477l0931K9687r124M2012m641l581M0500k1091n803p2573K5434M2558
13737B18924M7556k2245l2192J4483o814K600K3273M3333O7145k9191L288n8607
13725B71553o0699O5329J8229J2208J2385n221L2744J3710j4987n1255p536k3096
13713B63364m4827m7782j9860k7346N3624M6854l3066r0167j8161P0680L7541
13702A90854j4431J0765N6232M6010K6021Q055j6806l8534m0368M895K3261n511
$$ y = [91328, 92866, 70414, 91015, 62157, 34159, 48008, 60127, 128464, 124509, 154140, 184759, 159500, 144449, 153559, 201687, 285713, 411839, 539388, 606667, 647390, 643743, 597697, 494432, 433124, 350396, 324149, 251593, 209169, 150722, 196188, 210868, 217609, 268977, 242520, 186477, 155546, 185233, 176109, 218121, 213480, 209899, 250399, 229308, 223505, 150932, 176366, 218924, 266480, 244235, 212043, 226526, 219712, 222312, 245585, 288918, 356063, 326872, 330160, 271553, 210854, 276183, 294412, 306620, 319005, 313784, 346528, 360238, 345251, 293996, 286460, 263364, 218537, 170755, 150895, 123549, 177173, 224027, 190961, 100794, 82633, 153313, 190854, 176423, 187188, 243420, 289430, 315451, 323506, 306700, 268166, 227798, 232693, 255954, 250443]
13690B50443j5618k1875L9907K485J8157j3985n00k9576K7313L3309j7151l7723
13678B35186K421K5306k3255j3058J5225q0242J3935M6879o995k4517k3217k4206
13666A43462m0693K1690K5818m4853m8578k1906j9775j070J8397n4045l6963J6839
13654d1677M7175N3350j2174l1908l8076L2812M3120Q241k3156k0010m4077J0227
13642a6153K744O332L4650k524K4949K3904k5650m4841L1157M125l5353K4543
13630B7883o8762m8504J4752N4775K2569K2283j429q033O6k0228R64J4283L852
13617A4471r976J9336R181J6197n3597p17K4418M4455j8202m1237j5028K1139
13605A0440P558J915o5933m8755l375J1177L5648Q413m5365m128O5325R9204M521
$$ y = [250443, 234825, 212950, 252857, 255342, 273499, 259514, 259014, 229438, 256751, 290060, 272909, 235186, 237607, 262913, 239658, 226600, 241825, 161583, 175518, 222397, 215402, 190885, 167668, 143462, 102769, 124459, 150277, 105424, 56846, 34940, 15165, 14095, 32492, -21553, -58516, -41677, 5498, 58848, 46674, 14766, -23310, 9502, 52622, 60863, 37707, 17697, -26380, -16153, -13409, -7077, 27573, 25049, 49998, 73902, 48252, 3411, 34568, 38693, 3340, 27883, -40879, -89383, -74631, -19856, 2713, 24996, 23567, 15534, 15600, -4628, -3664, 10619, 14471, 4495, 23831, 33012, 49209, -4388, -5105, 19313, 63768, 45566, 4329, -10699, 10440, 17998, 19913, -46020, -94775, -98150, -86973, -51325, -42912, -88277, -92405, -27080, 72124, 76645]
13592G6645q251m895J8672n6163L1556Q618K6036j4298l0651n917O0271p536m3262
13579E0825K0329O2429l1518n875n1333j4465M2064J8047l2149N489n4101j3873
13567d131j203j0628K8947L4179k8560o8753J0013J2777K7605L77k0725J4713
13555e389M635j7314m0611J3885L3821P64J9570j4424K3803N4117o415K426J9354
13542H8222j2087M3302J8478l0116o2449K2167L5499P1771J2789l2600L9682P0849
13530B65507O4639R864k5608L9955k5732n5130n6497M0212J3352m3777n8965J8992
13518A86812j5431p776P0121m0668r2563m6020j572m2159K2984M2325K3700l907
13506I5846k1198M832q725j0972R509r6265p600K2359L6944L01n2572o577N0316
$$ y = [76645, 68394, 63499, 82171, 26008, 57564, 66182, 92218, 77920, 47269, 41352, 101623, 94087, 50825, 71154, 133583, 102065, 96190, 44857, 30392, 72456, 90503, 58354, 63843, 9742, -4131, -5334, -15962, 12985, 47164, 18604, -50149, -40136, -27359, 246, 623, -20102, -5389, -754, -18068, -58679, -44794, -10973, -10209, 9361, -5063, 18740, 72857, 66442, 68868, 88222, 76135, 119437, 137915, 107799, 45350, 67517, 103016, 174787, 187576, 154976, 194658, 265507, 330146, 340010, 314402, 354357, 328625, 273495, 216998, 257210, 270562, 226785, 167820, 186812, 171381, 163605, 233726, 193058, 100495, 54475, 52903, 10744, 33728, 76053, 99753, 95846, 74648, 79480, 70755, 59783, 69292, -26973, -34573, -12214, 24730, 25031, -27541, -34118, 16198]
13493A6198k6036o2868O007J32270N9174L8370N8189M615J4464K8591J12855N4117
13481D35946l5532j1484k4580o6940k9725o0403o6247j9596Q878o101m3710k6003
13469E4503j3599o333o7733k7682K4580l5814o0312K0178K8056L3471N053J4020
13457c1612N7120L9389j620m0228k1747L1666k167m7098r558j5093K5632K6059
13445A0743J7900P1516r865k3893K1613L2011K7453O0173J8864k8240j9200K980
13433A82055L5922L710n0279m4254L1553R385j5193l4902m0305p547K1523J3406
13421A05074J4423m3076K2470L2200m3564n5507n6738K6756O7412L3329J6778
13410A19557l6610l7540o990m648P54M0218Q501l9089l5988q534j9653k3205K2327
$$ y = [16198, -9838, -72706, -66699, 65571, 124745, 163115, 221304, 225919, 240383, 268974, 381829, 435946, 400414, 388930, 364350, 297410, 267685, 207282, 141035, 121439, 130317, 124216, 80506, 54503, 40904, 34571, -33162, -60844, -36264, -72078, -132390, -112212, -84156, -50685, -45632, -31612, 25508, 64897, 63277, 23049, 1302, 32968, 30801, -16297, -25855, -40948, -15316, 10743, 28643, 100159, 90294, 66401, 88014, 120025, 147478, 207651, 226515, 198275, 179075, 182055, 217977, 221687, 171408, 127154, 158707, 168092, 152899, 117997, 77692, 70145, 91668, 105074, 119497, 76421, 98891, 131091, 87527, 32020, -24718, 2038, 69450, 102779, 119557, 82947, 45407, 38417, 33769, 34523, 74741, 83242, 44153, 8165, -369, -20022, -43227, -20900]
13397b0900L2366N972J7068J223o307M3869Q0698Q598j4335J2097K1159j1504
13385A70004k6610K9157K3751m684K1888m5315n0907o5026k9616M623j5380q88
13373A0997M9442l6907N9460K291k698k4689K6490M3225J6068m6001n9077m1382
13361b781j6177J3910O7367P5818K9125N4560j02435K703M0009J98K4360L9898
13349B26555J4512k587K475K1204J4288K9946m7368l8403J1090J094K0991k3427
13337B30370K4923l252o9760n6880m059N2854J03854K8175q739n219j01365L3028
13325B23930N3738M6229m9317n7890J2797O1991L6847l1145k4664r658L1480L558
13313B97896k5188M9798J0647j784q455P121M1003l4420q0267o4356j0144J3675
$$ y = [-20900, 11466, 17438, 34506, 35729, 29422, 73291, 153989, 162587, 148252, 160349, 181508, 170004, 143394, 172551, 196302, 191618, 213506, 168191, 117284, 52258, 22642, 27265, 11885, 10997, 60439, 23532, 82992, 85283, 82585, 57896, 84386, 127611, 143679, 97678, 38601, -2781, -18958, -5048, 62319, 138137, 167262, 221822, 119387, 122090, 162099, 162297, 186657, 226555, 241067, 238480, 240955, 262159, 276447, 306393, 259025, 220622, 231712, 232806, 253797, 230370, 255293, 252041, 182281, 125401, 121342, 174196, 278050, 306225, 297486, 292267, 190902, 223930, 277668, 323897, 274580, 216690, 229487, 291478, 328325, 297180, 272516, 262858, 294338, 297896, 272708, 322506, 333153, 331369, 322914, 330035, 371038, 336618, 256351, 191995, 181851, 195526]
13301A95526Q9379J03101O0745L6394j5662o375m4255j9809q647J070m669j7158
13289C69640k680M5556k6007n1730m4503Q386R456j5119R338L170k4908j5178
13277B65421j4499N36O444n2416o1383J3679K7967j472J3958L9154R462L5273
13265B82124N7999j809m1292q404J6070L03M328L3852L1967N2003N2256J1148
13253D90545k7914l7438N130N4388m9599j05411o1290K6684j1244J9103J2603
13242C15557K9404O206R321l3118k8683m5603j2956Q423J5702p951q723k3301
13230B24278M2577j2193l0363O3261O521J2874N5223O0163l003k4737K5159J7474
13218D37234j5581p0767m7426K3143m2925k5251J05989J02023N1964P281K7427
$$ y = [195526, 284905, 388006, 448751, 485145, 469483, 463108, 418853, 399044, 390397, 391467, 386798, 369640, 366960, 412516, 386509, 334779, 290276, 298662, 308118, 292999, 302337, 305507, 280599, 265421, 250922, 251458, 257902, 205486, 144103, 157782, 185749, 184277, 198235, 237389, 246851, 282124, 340123, 338314, 297022, 288618, 304688, 304991, 309319, 343171, 375138, 427141, 479397, 490545, 462631, 425193, 430323, 484711, 435112, 329701, 268411, 295095, 283851, 302954, 315557, 344961, 351167, 360488, 327370, 298687, 253084, 240128, 248551, 264253, 256302, 247579, 224278, 266855, 254662, 224299, 287560, 294081, 306955, 362178, 422341, 419338, 394601, 419760, 437234, 421653, 350886, 303460, 326603, 283678, 258427, 364416, 466439, 518403, 525684, 553111]
13207E53111M378J690k1458j2262m2211N9175K9697o2342j5988M6664Q611Q083
13195E57148l8424J3517M9885r679o7497j19253q2667o138k288J2602L6701l5232
13183C08675k3122J0204K0041O4478L0556J18215P5001q6859q2462n1411k4751
13172C58565N0112M9396J05205Q8210N8792J352o1124j1085O9247k2350r833j7591
13160F58896j8292O7613o692n0813p4433p2508m6607K932O1676R3716O178j3643
13148F08023J2446m8583p6322j25628m4472n2434l7335L5692K582m7323O6562
13137B93208R2857J05018K118j17166L2020j6507L931K0189P6098J35023K63250
13126H90039K23641j2492j19524j75861j34944o4193l6981P4m3417q052P3430
$$ y = [553111, 557489, 559179, 537721, 525459, 483248, 542423, 572120, 509778, 493790, 540454, 549065, 557148, 518724, 532241, 582126, 572447, 504950, 385697, 303030, 296892, 294604, 307206, 343907, 308675, 285553, 295757, 315798, 380276, 410832, 529047, 604048, 517189, 434727, 383316, 358565, 408677, 458073, 563278, 651488, 710280, 711632, 650508, 639423, 708670, 686320, 676487, 658896, 640604, 708217, 701525, 650712, 576279, 503771, 457164, 460096, 521772, 615488, 621666, 608023, 620469, 571886, 495564, 369936, 325464, 273030, 235695, 271387, 273969, 226646, 293208, 386065, 491083, 493201, 376035, 408055, 391548, 395479, 415668, 491766, 626789, 890039, 1113680, 1101188, 981664, 805803, 670859, 606666, 569685, 569759, 526342, 518290, 591720]
13115E91720M975q7573q2848q5934j8512j3672J0001O376K0384M4633J9374j7450
13103C91474n9576l5219q0390N5849K0138J8840K2942K6568R3115R1934M1251
13092E86926k5062j12244j13713p3199j9725r46P9560J31930Q2468O0003n9055
13081E36943m4337r3406j07820k9128Q757M259l0434L0280N8318r627l3189m3558
13069B47058q4787l9592L7154q077m2697M4962P3955k3412o2302m2736J92M8655
13057A48373l5531O972M8648J15312L2825K5665K3999j192r8354p8114n2403p319
13045A28881l5104j5641O1889m576J455k5914o4505M771M4809K0133k5616k4945
13033F5637K7639R52n179n0183l2066r682r042K7875K9860q408Q661k3302R615
$$ y = [591720, 596695, 509122, 426274, 340340, 321828, 308156, 318157, 324533, 344917, 389550, 408924, 391474, 331898, 296679, 216289, 272138, 292276, 311116, 334058, 360626, 453741, 545675, 586926, 561864, 449620, 335907, 262708, 242983, 242037, 321597, 453527, 535995, 595998, 536943, 492606, 399200, 291380, 262252, 271009, 275268, 244834, 275114, 333432, 323805, 290616, 247058, 162271, 122679, 159833, 151756, 109059, 154021, 227976, 204564, 142262, 99526, 99718, 148373, 112842, 119814, 168462, 283774, 316599, 342264, 366263, 365071, 266717, 188603, 136200, 128881, 93777, 78136, 140025, 135449, 136904, 110990, 46485, 51256, 96065, 116198, 90582, 65637, 93276, 94228, 89049, 38866, 6800, -2882, -11924, 15951, 45811, 37403, 46064, 22762, 32377]
13020C2377l2659j9333o599L9168P161l2790l9681l3964L6776M1872k5824K4770
13008h726M1295L9058p9931l6404L0879L8219J5445o978j1785j628r348m8300
12996c8204n7394L2288O3311K4110n5296m6102M481R6M390Q2588P0649j4465J2341
12983H2793k1829j0296n5743j4632N27l3782m4187J39P3782M0419m5478o2842
12971i1129J0802M0174J4093k9464k8142J6431L3332K8686J9770j050m7815k5017
12959e9329j7838L0121n1338j1333L297N0577K9559O230n1590o1389J8607K8426
12947h6000J1524k1359o518K7037M4891Q4806K5849k8056k1997q283L9780L8518
12935A00192k2379l2468o5673k2733O212K7185R740r523K075K9248M397j2115
$$ y = [32377, -282, -19615, -26214, 12954, 20115, -12675, -52356, -86320, -49544, -7672, -33496, -8726, 32569, 71627, -8304, -44708, -13829, 24390, 39835, 32857, 21072, 19444, 10096, -38204, -95598, -63310, 1, 24111, -31185, -77287, -72806, -72710, -68320, 14268, 84917, 70452, 82793, 60964, 50668, -5075, -19707, -19180, -52962, -97149, -97010, -23228, 17191, -28287, -91129, -80327, -40153, -26060, -55524, -83666, -67235, -33903, -5217, 14553, 13503, -34312, -59329, -77167, -47046, -98384, -109717, -106420, -55843, -26284, -20054, -71644, -133033, -114426, -86000, -74476, -95835, -102353, -75316, -30425, 54381, 80230, 52174, 30177, 21894, 61674, 100192, 77813, 45345, -20328, -43061, -36849, -9664, 76, -9447, -7372, 21876, 26273, 14158]
12923A4158k3008l8646J620P83L1670M5351J104k4204N3891R797j8741Q71k1853
12910C2793o6604n20j0182J2399j0593j7815M3914J2960o2439m3411J624L1326
12898g6548Q2613K2844n7201m2022Q87K3940J2816j9242M011J807J1479j6309
12886e0925k7262N5027j6655O015N5924M4249N2785k055k4258j3884m933K5247
12874I9275J0064J9989K4493L5668K2831k2831l5457n7182j23647k2135J6375
12863c2557k0893m346L3336K3585k120j8582j9677m8111J8441K6196p426m0901
12851i3055k1878J7194J9034M4392K6426m8375L0254K7197j7203m738k7196J1937
12839c6011J6858M5029J9318R654l8015k8556L6148N2334q632n3803K8457J9726
$$ y = [14158, -8850, -47496, -45876, -45093, -13423, 31928, 33032, 8828, 62719, 72516, 53775, 54646, 32793, -33811, -34331, -44513, -32114, -42707, -60522, -16608, -3648, -66087, -109498, -107874, -76548, 6065, 28909, -28292, -70314, -69427, -45487, -32671, -51913, -47902, -46095, -34616, -50925, -78187, -23160, -39815, -33800, 22124, 66373, 119158, 117103, 92845, 78961, 74028, 99275, 109339, 129328, 153821, 189489, 212320, 189489, 154032, 96850, -26797, -48932, -32557, -53450, -57796, -24460, -875, -2995, -21577, -41254, -89365, -70924, -44728, -52154, -93055, -114933, -97739, -78705, -34313, -7887, -56262, -26008, 1189, -16014, -20752, -47948, -36011, -19153, 25876, 45194, 54848, 16833, -11723, 24425, 76759, 68127, 14324, 42781, 62507]
12827F2507J3606m3067l9946j9333K376l0998j7709Q9647L6193p5538j2129Q4775
12815E0384M3082j5251q8245n0108m5715k9352O5669Q529n1806N4164N4089j8919
12803b3479L9374K5068j095j839R340L6677j8133l1006j7627Q3178J4478k037
12791A12899P4452P8602K1518J5137J29065O3893m1210n3158o625J2199Q262L3126
12779D48160M5824N1329M3197J16710J98535J93951J92792K51015K29122K92913
12769B063548N40968Q54160J388245K416105M164234O794962Q581014N143956
12761C1947192l357644q071853o746892m152582k560855j587596j029966o53748
12753C786056m91233l64862l38458k66670j36067r8151M365Q4789J23285J39163
$$ y = [62507, 76113, 33046, -6900, -26233, -23857, -54855, -72564, 17083, 53276, -22262, -34391, 50384, 93466, 78215, -10030, -60138, -105853, -135205, -69536, -61007, -112813, -58649, -4560, -23479, 15895, 40963, 39868, 38029, 47369, 84046, 65913, 34907, 17280, 100458, 114936, 112899, 187351, 265953, 287471, 302608, 431673, 495566, 454356, 401198, 394573, 406772, 415034, 448160, 493984, 545313, 588510, 705220, 903755, 1097706, 1290498, 1541513, 1770635, 2063548, 2604516, 3458676, 4846921, 7263026, 11427260, 18222222, 26803236, 31947192, 28589548, 20517695, 13770803, 9618221, 7057366, 5469770, 4439804, 3786056, 3294823, 2929961, 2591503, 2324833, 2188766, 2090615, 2094980, 2179769, 2303054, 2442217]
12743B442217J73432K84005L90005O04092O55923N75309P19555J302116K160446
12734I307100L626741O334276J0867716J6792659J8513111N978101j2296518j7005357
12726D2117829j1272571n178532o51261L791268R090671J4102640J4038420M350217
12718G0388681r657629j6318459j3763282q760298n305175l338010k169087j428870
12710I647871r10946o19553m83184l07959k04403n2423L08119P83237J333193
12701I493952K329414M187204P329538J0812291R939613O8921q290850p171902
12693B8698181k252473K253992P054735J4453319K5876867L7984885L3641798
12686A47711304k620519l5402961l5808602k2427836j2275045o212651j482757
$$ y = [2442217, 2615649, 2899654, 3289659, 3893751, 4549674, 5124983, 5844538, 7146654, 9307100, 12933841, 19268117, 30135833, 46928492, 65441603, 71419704, 59123186, 42117829, 30845258, 25666726, 25015465, 28806733, 37897404, 52000044, 66038464, 70388681, 60731052, 44412593, 30649311, 21889013, 16583838, 13245828, 11076741, 9647871, 8736925, 8117372, 7634188, 7326229, 7121826, 7069403, 7377522, 8160759, 9493952, 11823366, 16010570, 23340108, 34152399, 44092012, 44160933, 35870083, 28698181, 26445708, 28699700, 35754435, 50207754, 76084621, 114069506, 147711304, 145090785, 109687824, 73879222, 51451386, 39176341, 32963690, 31480933]
12679C1480933L230251P725365P772140j553449j0893023j1147559p195132m318184
12671A5101342k694330j728543j082803o41445l07776j58407M8453K90439L00112
12662I127042N30208J075122J996268L482608O077576J0436875J5886284J8159543
12654F6771526J0255750n764742j6079288j4804759q473328k932914J901675P574617
12646C8448537J4603303J9636032J2286875q595771k1145319j8174953j1272322
12639B5786382o757238m236856k820045j913049j297426j018270r35661q50341
12631E957496o60548m49821k91705k43094j62369j48909j00106k1209J30800J81271
12621D191806J87382K25738L71296P24134J263217J985639L597756O217487R396003
$$ y = [31480933, 34711184, 42436549, 50208689, 48655240, 37762217, 26614658, 19419526, 15101342, 12407012, 10678469, 9595666, 8954221, 8646445, 8488038, 8536491, 8826930, 9127042, 9657250, 10732372, 12728640, 16211248, 22288824, 32725699, 48611983, 66771526, 77027276, 71262534, 55183246, 40378487, 31905159, 28972245, 30873920, 38448537, 53051840, 72687872, 84974747, 76378976, 55233657, 37058704, 25786382, 19029144, 14792288, 11972243, 10059194, 8761768, 7743498, 6807837, 5957496, 5296948, 4847127, 4555422, 4312328, 4149959, 4001050, 3900944, 3879735, 4010535, 4191806, 4379188, 4604926, 4976222, 5700356, 6963573, 8949212, 12546968, 18764455, 28160458]
12612B8160458J0242450L136979p476136j0595482p713655m583471k749283j752543
12604F669317j148118q33614n50508m35001l90423l60047l51668k92769j83676
12595B123493j21724p5934l2593j27280j53548j09015m2984O7432N6275R2577
12585A676699J59571J59631K25357J81470J55692J90180J80219J64435R2133O7737
12575C253124L0828q5019q8543j41575j56713k15195k20409k74744k21743k26178
12565A653833k34643j62201q0357j08026q9681j14471j04811n5568L775m3890
12555F63960m3475j63J5279j2102m8345l8718k5555l2301J9989M3382M0357N8527
12543F40835k4572n7114Q188L2532j5851n7788l0784j5933j0754J23J7370J461
$$ y = [28160458, 38402908, 41539887, 34063751, 23468269, 15754614, 11171143, 8421860, 6669317, 5521199, 4687585, 4137077, 3702076, 3311653, 2951606, 2599938, 2307169, 2123493, 2001769, 1925835, 1893242, 1765962, 1612414, 1503399, 1460415, 1527847, 1584122, 1676699, 1836270, 1995901, 2221258, 2402728, 2558420, 2748600, 2928819, 3093254, 3185387, 3253124, 3283952, 3198933, 3110390, 2968815, 2812102, 2596907, 2376498, 2101754, 1880011, 1653833, 1419190, 1256989, 1176632, 1068606, 978925, 864454, 759643, 704075, 707850, 663960, 620485, 620322, 635601, 623499, 575154, 536436, 510881, 478580, 498569, 541951, 582308, 640835, 616263, 559149, 567337, 599869, 584018, 526230, 495446, 479513, 468759, 468882, 486252, 487713]
12531D87713Q356q541K7374M4043k3177j8834J5210K6519M0074k6285j1737L5214
12519E95929N5689J5030o150o3628m9037j463L1403M4481j8463m2733q5447o4069
12507D11542j15206N757J14663Q889q5080n9273k4131L2180L5877n3047o964J3823
12495B79030r469N9447J4381n8896j6926K4705l4685l928O656m9744k0874n0079
12483A39618j615N2757P3202Q0052J4506k3633m8091j7708R851P061j2703J4240
12471B87537L9478O4141J02835J0906J11556J43103L0904P423J9342q8668K3023
12460G51580k2549p1364j11798o4011k4598k5810k7412j6749o4590l7306K1911
12449C07304j8461K6414P5423R126k0737n3908n8123m8140J7980n93k6296l0345
$$ y = [487713, 496069, 487528, 514902, 558945, 535768, 516934, 532144, 558663, 598737, 572452, 560715, 595929, 651618, 666648, 660498, 596870, 547833, 546370, 577773, 622254, 603791, 561058, 475611, 411542, 296336, 302093, 416756, 425645, 340565, 281292, 257161, 289341, 325218, 272171, 265207, 279030, 269561, 329008, 343389, 284493, 267567, 292272, 257587, 253659, 260315, 210571, 189697, 139618, 138003, 190760, 263962, 344014, 358520, 334887, 286796, 269088, 278939, 286000, 273297, 287537, 327015, 391156, 493991, 504897, 616453, 759556, 790460, 797883, 817225, 728557, 751580, 729031, 657667, 545869, 481858, 457260, 431450, 404038, 387289, 322699, 285393, 307304, 288843, 315257, 390680, 399806, 379069, 325161, 267038, 218898, 236878, 236285, 209989, 179644]
12437A79644j6882L526J6726L0114Q2237M5222j2873n5583L1021J331M8331N1632
12425D04446k709N0180J9033N5939M8012P4980M1626J31380K36179L60779N71473
12414A991318R22594J805292L314033N462600N538332r29689n912175m888097
12406G304208k610458j361891p95195n90504m58649k79101j15868j02019j13621
$$ y = [179644, 162762, 166288, 183014, 213128, 295365, 340587, 327714, 272131, 303152, 304483, 352814, 404446, 401737, 451917, 470950, 526889, 574901, 649881, 691507, 822887, 1059066, 1419845, 1991318, 2913912, 4719204, 8033237, 13495837, 19034169, 18104480, 12192305, 7304208, 4693750, 3331859, 2536664, 1946160, 1487511, 1208410, 1092542, 990523, 876902]
$$ [...]
##END NTUPLES=NMR SPECTRUM
##END=
