##TITLE=Analysis number 325627
Compound Code sb 01949
Book Reference 136866
Project Code adrs fraglib
Chemist Name jom
##JCAMPDX= 6.0         $$ Bruker NMR JCAMP-DX V2.0
##DATA TYPE= NMR SPECTRUM
##DATA CLASS= NTUPLES
##ORIGIN= Bruker BioSpin GmbH
##OWNER= nmr
$$ XWIN-NMR		Version 3.5
$$ Fri Jan  5 11:04:15 2007 GMT Standard Time (UT+0h)  MAYBRIDGE\nmr@NMR_250MHZ
##.OBSERVE FREQUENCY= 250.131544655141
##.OBSERVE NUCLEUS= ^1H
##.ACQUISITION MODE= SIMULTANEOUS (DQD)
##.ACQUISITION SCHEME= undefined
##.AVERAGES= 16
##.DIGITISER RES= 18
##SPECTROMETER/DATA SYSTEM= dpx250
##.PULSE SEQUENCE= zg30
##.SOLVENT NAME= DMSO
##.SHIFT REFERENCE= (INTERNAL, DMSO, 0, 16.522)
##AUDIT TRAIL= $$ (NUMBER, WHEN, WHO, WHERE, WHAT)
$$ ##TITLE= Audit trail, XWIN-NMR		Version 3.5
$$ ##JCAMPDX= 5.01
$$ ##ORIGIN= Bruker BioSpin GmbH
$$ ##OWNER= nmr
$$ C:\u/data/dgb/nmr/ADRS/430/pdata/1/auditp.txt
$$ ##AUDIT TRAIL=  $$ (NUMBER, WHEN, WHO, WHERE, WHAT)
(   1,<2007-01-05 11:03:52.73 +000>,<MAYBRIDGE\nmr>,<NMR_250MHZ>,
      <created by zg, POWCHK disabled, PULCHK disabled
       configuration hash MD5:
       49 4B E0 1D 92 C2 6B 37 9F E6 65 BC 52 41 86 1D
       data hash MD5: 64K
       CD 73 57 0E A8 3B E3 27 EF 4C CE 52 6B 41 2C 68>)
(   2,<2007-01-05 11:04:05.13 +000>,<MAYBRIDGE\nmr>,<NMR_250MHZ>,
      <Start of raw data processing
       ef LB = 0.3 FT_mod = 6 PKNL = 1 SI = 32K 
       data hash MD5: 32K
       49 FF 91 6C EF FC 46 D8 0D 21 01 2A DC E5 3A DF>)
(   3,<2007-01-05 11:04:06.93 +000>,<MAYBRIDGE\nmr>,<NMR_250MHZ>,
      <apk 
       data hash MD5: 32K
       E3 D0 10 09 76 A2 8A 42 47 62 88 9B 13 5F 1F CC>)
(   4,<2007-01-05 11:04:07.68 +000>,<MAYBRIDGE\nmr>,<NMR_250MHZ>,
      <abs ABSG = 5 
       data hash MD5: 32K
       4F 8B F3 8D C4 42 EE A0 11 FE 75 6D 72 45 07 AF>)
$$ ##END=
$$ 
$$ hash MD5
$$ EC 44 ED DA 57 D9 05 ED C2 D0 70 80 08 B2 10 7D
##$RELAX= 
##$RELAX= 
##$RELAX= 
##$RELAX= 
##$RELAX= 
##$RELAX= 
##$RELAX= 
$$ Bruker specific parameters
$$ --------------------------
##$DU= <C:\u>
##$EXPNO= 430
##$NAME= <ADRS>
##$PROCNO= 1
##$TYPE= <nmr>
##$USER= <dgb>
##$AMP= (0..31)
100 100 100 100 100 100 100 100 100 100 100 100 100 100 100 100 100 100 
100 100 100 100 100 100 100 100 100 100 100 100 100 100 
##$AQSEQ= 0
##$AQ_mod= 3
##$AUNM= <au_zg>
##$AUTOPOS= <32 >
##$BF1= 250.13
##$BF2= 250.13
##$BF3= 250.13
##$BF4= 250.13
##$BF5= 500.13
##$BF6= 500.13
##$BF7= 500.13
##$BF8= 500.13
##$BYTORDA= 1
##$CFDGTYP= 0
##$CFRGTYP= 5
##$CHEMSTR= <none>
##$CNST= (0..31)
1 1 145 1 1 1 1 1 1 1 1 1 1 1 1 1 1 1 1 1 1 1 1 1 1 1 1 1 1 1 1 1 
##$CPDPRG= <>
##$CPDPRG1= <>
##$CPDPRG2= <>
##$CPDPRG3= <>
##$CPDPRG4= <mlev>
##$CPDPRG5= <mlev>
##$CPDPRG6= <mlev>
##$CPDPRG7= <mlev>
##$CPDPRG8= <mlev>
##$CPDPRGB= <>
##$CPDPRGT= <>
##$D= (0..31)
0 1 0 0 0 0 0 0 0 0.06 0 0 0 0 0 0 0.0002 0 0 0 0 0 0 0 0 0 0 0 0 0 0 
0 
##$DATE= 1167995031
##$DBL= (0..7)
120 120 120 120 120 120 120 120 
##$DBP= (0..7)
150 150 150 150 150 150 150 150 
##$DBP07= 0
##$DBPNAM0= <>
##$DBPNAM1= <>
$$ [...]
##$SUBNAM7= <"">
##$SUBNAM8= <"">
##$SUBNAM9= <"">
##$SW= 20.6930455092707
##$SWIBOX= (0..15)
0 0 3 0 0 0 0 0 0 0 0 0 0 0 0 0 
##$SW_h= 5175.983436853
##$TD= 65536
##$TD0= 1
##$TE= 294.16
##$TE2= 300
##$TE3= 300
##$TEG= 300
##$TL= (0..7)
0 120 120 120 120 120 120 120 
##$TP= (0..7)
150 150 150 150 150 150 150 150 
##$TP07= 0
##$TPNAME0= <>
##$TPNAME1= <>
##$TPNAME2= <>
##$TPNAME3= <>
##$TPNAME4= <>
##$TPNAME5= <>
##$TPNAME6= <>
##$TPNAME7= <>
##$TPOAL= (0..7)
0.5 0.5 0.5 0.5 0.5 0.5 0.5 0.5 
##$TPOFFS= (0..7)
0 0 0 0 0 0 0 0 
##$TUNHIN= 0
##$TUNHOUT= 0
##$TUNXOUT= 0
##$USERA1= <user>
##$USERA2= <user>
##$USERA3= <user>
##$USERA4= <user>
##$USERA5= <user>
##$V9= 5
##$VALIST= <valist>
##$VCLIST= <CCCCCCCCCCCCCCC>
##$VD= 0
##$VDLIST= <DDDDDDDDDDDDDDD>
##$VPLIST= <PPPPPPPPPPPPPPP>
##$VTLIST= <TTTTTTTTTTTTTTT>
##$WBST= 1024
##$WBSW= 4
##$XGAIN= (0..3)
0 0 0 0 
##$XL= 0
##$YL= 0
##$YMAX_a= 363478
##$YMIN_a= -489999
##$ZGOPTNS= <>
##$ZL1= 120
##$ZL2= 120
##$ZL3= 120
##$ZL4= 120
##$ABSF1= 16.522
##$ABSF2= -4.171173
##$ABSG= 5
##$ABSL= 3
##$ALPHA= 0
##$AQORDER= 0
##$ASSFAC= 0
##$ASSFACI= 0
##$ASSFACX= 0
##$ASSWID= 0
##$AUNMP= <proc_1d>
##$AZFE= 0.1
##$AZFW= 0.1
##$BCFW= 0
##$BC_mod= 0
##$BYTORDP= 0
##$COROFFS= 0
##$CY= 12.5
##$DATMOD= 1
##$DC= 0
##$DFILT= <>
##$DTYPP= 0
##$F1P= 14.0000005364418
##$F2P= -0.99999901652339
##$FCOR= 0.5
##$FTSIZE= 32768
##$FT_mod= 6
##$GAMMA= 0
##$GB= 0
##$INTBC= 1
##$INTSCL= 1
##$ISEN= 128
##$LB= 0.3
##$LEV0= 0
##$LPBIN= 0
##$MAXI= 10000
##$MC2= 0
##$MEAN= 0
##$ME_mod= 0
##$MI= 0
##$NCOEF= 0
##$NC_proc= -5
##$NLEV= 6
##$NOISF1= 0
##$NOISF2= 0
##$NSP= 0
##$NTH_PI= 0
##$NZP= 0
##$OFFSET= 16.522
##$PC= 1
##$PHC0= 204.5673
##$PHC1= 19.91582
##$PH_mod= 1
##$PKNL= yes
##$PPARMOD= 0
##$PSCAL= 4
##$PSIGN= 0
##$REVERSE= no
##$SF= 250.13
##$SI= 32768
##$SIGF1= 0
##$SIGF2= 0
##$SINO= 400
##$SIOLD= 32768
##$SREGLST= <1H.DMSO>
##$SSB= 0
##$STSI= 32768
##$STSR= 0
##$SW_p= 5175.98343685301
##$SYMM= 0
##$S_DEV= 0
##$TDeff= 65536
##$TDoff= 0
##$TI= <Analysis number 999999
Compound Code 99
Book Reference 9
Project Code 9>
##$TILT= no
##$TM1= 0
##$TM2= 0
##$TOPLEV= 0
##$USERP1= <user>
##$USERP2= <user>
##$USERP3= <user>
##$USERP4= <user>
##$USERP5= <user>
##$WDW= 1
##$XDIM= 32768
##$YMAX_p= 308939493
##$YMIN_p= -375556
$$ End of Bruker specific parameters
$$ ---------------------------------
##NTUPLES= NMR SPECTRUM
##VAR_NAME=  FREQUENCY,     SPECTRUM/REAL,   SPECTRUM/IMAG
##SYMBOL=    X,             R,               I
##VAR_TYPE=  INDEPENDENT,   DEPENDENT,       DEPENDENT
##VAR_FORM=  AFFN,          ASDF,            ASDF
##VAR_DIM=   32768,         32768,           32768
##UNITS=     HZ,            ARBITRARY UNITS, ARBITRARY UNITS
##FACTOR=    0.157963299565203, 1,           1
##FIRST=     4132.6476996994, 0,             0
##LAST=      -1043.33573715361, 0,           0
##MIN=       -1043.33573715361, -375556,     0
##MAX=       4132.6476996994, 308939493,     0
$$ Real data points
##PAGE= N=1
##DATA TABLE= (X++(R..R)), XYDATA
$$ [...]
23402H8966m5754n4778P0955k1617j7465k6657j8190n362L1033o423n219j5279
23390b5790m9402n7807J35631J24187p6187r5310k9347j7896O737K3493N6223
23379e468o5574n5532J9453R5617M7805J3537j06478p0357N1652K3161Q7867Q3990
23367A19673Q3891l9833j2323q8850N6664j627j7879k5979r8434K6734J6570K4131
23355D2738J9958r8627l9089J01875J03749r3023r1331P3871J1845n3010K9887
23344H843R73J14902J37786j6661o1030K0160q9557L548L6275j09790p5243R7262
23332F7468M5921r5973L2164K3033l662n8070n0866q7974m078L9023K2882L6252
23320c3880J9262K7025K344j8315j13258k0905P5844K1555j8060N9034K1168K4537
$$ y = [88966, 43212, -11566, 59389, 37772, 20307, -6350, -24540, -29902, 1131, -5292, -10511, -25790, -75192, -132999, 2632, 126819, 50632, -44678, -74025, -91921, -85184, -61691, -5468, -71042, -126574, -107121, -11504, 36301, 49838, -56640, -126997, -75345, -52184, 35683, 119673, 203564, 163731, 151408, 62558, 119222, 117595, 99716, 73737, -24697, 2037, 18607, 42738, 62696, -35931, -75020, 26855, 130604, 37581, -53750, 20121, 31966, -21044, 8843, 9816, 124718, 262504, 245843, 184813, 204973, 115416, 118964, 155239, 45449, -29794, 67468, 113389, 17416, 49580, 72613, 68951, 10881, -39985, -127959, -132037, -93014, -70132, -33880, -14618, 12407, 14751, -3564, -116822, -137727, -61883, -40328, -58388, 646, 21814, 46351]
23308D6351L5151j3545n2778K5241j1750K07K0700O6632l0402l9308m0934k3069
23296a7504N2163p6547o5228J01702K1198K9703J2411O310O8133n0953j25074
23285d3686n5119M431M2227R4191J5662J2033J2681k9395p1474m7828Q759j7628
23273g5146K9399J45144k6899j2867o3234l5689k1338J5337K2022L3703m5473
23262c5041k8616N6526j6772J8222N9608J4800R181J2313P16n3992m1368p1953
23250g6376m2351O6596J23858l7760o1688P6713P3620O4008j9280o2269n9125
23239D5946k6168m3273N208L8599M4953n4340J5591L0839l6739j1146J21026J75726
23227C06222l5615r1222p9176M4491N043r9741K808O6513J2664n0006j1217l560
$$ y = [46351, 81502, 67957, 15179, 40420, 28670, 28877, 49577, 116209, 85807, 46499, 5565, -17504, 34659, -41888, -107116, -5414, 15784, 45487, 57898, 64208, 132341, 81388, -43686, -98805, -94374, -52147, 42044, 57706, 69739, 82420, 53025, -18449, -66277, -57518, -75146, -45747, 99397, 72498, 59631, -3603, -39292, -60630, -45293, -23271, 10432, -35041, -63657, -7131, -23903, -5681, 53927, 68727, 77908, 90221, 90937, 36945, -4423, -76376, -118727, -52131, 71727, 33967, -27721, 48992, 122612, 186620, 167340, 105071, 45946, 19778, -23495, -18287, 20312, 65265, 10925, 26516, 57355, 20616, 9470, 130496, 306222, 270607, 179385, 100209, 144700, 149743, 50002, 52810, 119323, 131987, 81981, 70764, 67204]
23215F7204Q0689q596p3564j8842q4957j8771K4235J1390L0701o6344J6489J17287
23203G6921K8909j6424q840K1047j19505Q879N4038K6837k8745j8428o4490L4343
23191e458j9411M3808P2523k7973o7663o9596m3895O5519J22312R0375o0318j59612
23179e9389o6353R4388N389l7532K87R5282j2618N159k0191N4772P166j226J18957
23166A84091L3599p5356m4432n7734J3413j7849l3368j28591l8700K8255k3569
23155a60241N2845M418j2603R0419L0644q6110j1607l4879j09341Q455J02714
23144a25286J36710O6341P1309j22966j397R3151q8184j35766j08802K0811K8368
23133a65711R6615K7217N3289O2968J1358Q8428k8254l3556j4328j44234n2650
$$ y = [67204, 147893, 139297, 65733, 46891, -38066, -56837, -32602, -21212, 9489, -56855, -40366, 76921, 105830, 89406, 80566, 101613, -17892, -9013, 45025, 71862, 43117, 24689, -39801, -5458, -24869, 18939, 91462, 63489, -4174, -73770, -117665, -52146, 70166, 160541, 100223, -59389, -125742, -31354, -25965, -63497, -63210, 32072, 19454, 24613, 4422, 59194, 66360, 65134, 184091, 217690, 142334, 97902, 40168, 53581, 35732, 2364, -126227, -164927, -136672, -160241, -107396, -102978, -115581, -25162, 5482, -80628, -92235, -127114, -236455, -228000, -125286, 11424, 77765, 149074, 26108, 24711, 117862, 29678, -106088, -214890, -194079, -165711, -69096, -41879, 11410, 74378, 85736, 174164, 145910, 112354, 98026, -46208, -98858]
23122i8858l3217O548P7578M2691j8156k5325K1378L4712P4865r41O4710M2123
23110A88108m4301o7387j6240j48446o7395O5091O1599K7695J33086j1492l7423
23099H2895K363J03548n307o3880j40474l6722O3096M4796L386l8491j10870J5872
23087g9788p779O1430j396r5254L7730M5190N6799J7018r4283m1370O0980K7271
23075a3452R7531p3636j9213L3900Q4905M9176m3483r6367j00092m1371j066j6579
23063a39747K1714m399j399j0368J7480m0306L5383P8383L1518N3667n7354R839
23051e589N1935k4962q0588J5140M8976k3602l3758M1912M4138j0698M9265L727
23039G5896k5697n7631p767N3427P6197q073p8962m5396Q7182J1294q76m1346
$$ y = [-98858, -132075, -125527, -47949, -5258, -23414, -48739, -27361, 7351, 82216, 81275, 145985, 188108, 143807, 76420, 60180, -88266, -155661, -90570, -28971, -1276, 131810, 120318, 82895, 85258, 188806, 183499, 119619, -20855, -57577, 5519, 50315, 53701, 15210, -95660, -79788, -87567, -26137, -27533, -122787, -85057, -39867, 16932, 33950, -60333, -101703, -40723, -13452, 84079, 10443, -8770, 25130, 110035, 159211, 115728, 19361, -80731, -122102, -123168, -139747, -118033, -122432, -123831, -134199, -116719, -157025, -121642, -43259, -11741, 41926, -15428, -5589, 46346, 21384, -59204, -44064, 4912, -18690, -52448, -10536, 33602, 22904, 72169, 75896, 50199, -7432, -15199, 38228, 114425, 106352, 27390, -18006, 69176, 80470, 79594, 38248]
23027C8248m4220K1141m1830L4309L7742q4293r9324k5912J06867Q8332K7118
23016E8178n1809r337O9554M826k681r181J9919m2330o929k203J3750J4793n3785
23003B765r8528j7451J6979j5299Q0989J17377J00326k6644p1122J6198l0898
22992G4692k8098j1706l3057p8369k5385J05843L9951L7461K510N977n6099P289
22980D1009k5718l8776J7574j0254m4824k1648L1565l1237o3158k2660L5562P2580
22968e9985l8845k5717M9191J5521j7372R7881r5468L72J01303N3319l5431m558
22956D0211n1041K2446R0005r2740n4393Q4262L0262j25273o8990j7899l7287
22945a80437K2901k7131Q9947R2351L4118m0569p3721L863Q004N1784M4384j4028
$$ y = [38248, -5972, 15169, -26661, 7648, 45390, -38903, -138227, -164139, -57272, 31060, 58178, 6369, -2968, 66586, 71412, 68731, 59550, 79469, 37139, 30210, 28007, 41757, 56550, 2765, -95763, -113214, -96235, -111534, -30545, 86832, 187158, 160514, 89392, 105590, 74692, 46594, 34888, 1831, -76538, -101923, 3920, 43871, 81332, 83842, 89819, 33720, 41009, 15291, -23485, -5911, -16165, -60989, -82637, -51072, -82309, -145467, -168127, -132565, -59985, -98830, -124547, -75356, -59835, -77207, 20674, -74794, -74422, 26881, 80200, 44769, 40211, -10830, 11616, 101621, 8881, -45512, 38750, 69012, -56261, -125251, -143150, -180437, -157536, -184667, -94720, -2369, 31749, -8820, -82541, -78678, -70674, -18890, 25494, 11466]
22933A1466P784o1855P056l3773j6152O9917J2696l8287J438O6285q259o5124
22921d6808k8766J4341M8483R3159m0720K7077l4782Q940K8336j4019n7361p1476
22909g3596N6011j3016J4310N4489M9024L2951o5483m0111J9899k5847M106O3124
22897G5861j11630j34119l0197K0717J2015K8436P8687Q8282l9725K1303j4846
22886e216M3495Q104M2643N4525l5468L0550k13938r4944l9624o9936L3876j8648
22874b64581Q4840M5247k9520j0215M9845P3730Q6233J1212p9487j57608L3992
22863a56312J04386k4633O2085K395n6267k341M6487o8606m9921n8780l276Q1455
22851a23328P3407N9008p3051o9979k1623O3432K1995j5247Q562K2449N2458K7725
$$ y = [11466, 19250, -42605, -35549, -69322, -85474, -15557, -2861, -41148, -39710, 26575, 18316, -46808, -75574, -61233, -12750, 80409, 39689, 66766, 31984, 40924, 69260, 55241, -2120, -73596, -17585, -30601, -16291, 38198, 87222, 120173, 54690, 14579, 34478, 8631, 12737, 75861, -35769, -169888, -200085, -179368, -167353, -138917, -60230, 28052, -11673, 9630, -5216, 38279, 46383, 89026, 143551, 108083, 138633, -75305, -170249, -209873, -279809, -245933, -264581, -179741, -134494, -164014, -174229, -124384, -50654, 35579, 46791, -32696, -190304, -156312, -51926, -76559, -14474, -12079, -68346, -70687, -24200, -92806, -142727, -201507, -204783, -123328, -49921, 9087, -63964, -133943, -155566, -92134, -70139, -85386, -76824, -54375, -1917, 25808]
22839B5808Q475P9418n221r5006j1326O688k7624p9035j5558N0767K2675j45968
22827a85907o4451N1196N2011k2350J1626Q0303Q1789l8681K2489j136l3511k397
22815d9019M0526r6521j31039J4172P8822L8324j9108l6636j5275Q3136Q6853
22804e765j8354P3593K5222k2384p3232o2951O2106K7776L9978r012l0025J05742
22792A12694k7494j34329n4296m026J08961p4354j04569o5723J0470J11595J34606
22781A3535R9236q1121q3345O431J8819n4486M5521P0852n347j31589Q7808J35227
22769A21541O053r9638o6592M5293P4873j1428j7974j2690q8649o6471K2611N2871
22757d0200O9166L6467o3646m9757r1800N6236Q9416M850j13124m8930J0044J33368
$$ y = [25808, 34283, 113701, 108480, 13474, 2148, 8836, -18788, -97823, -113381, -62614, -39939, -185907, -250358, -199162, -147151, -169501, -157875, -77572, 4217, -34464, -11975, -13111, -46622, -49019, -8493, -105014, -236053, -221881, -143059, -104735, -123843, -160479, -175754, -92618, -5765, -24119, 49474, 74696, 52312, -20920, -83871, -21765, 6011, 45989, 36977, 6952, 112694, 85200, -49129, -103425, -107451, 1510, -72844, -177413, -243136, -232666, -121071, 13535, 112771, 31650, -51695, -45264, -26445, -80931, -35410, 35442, 30095, -101494, -13686, 121541, 127594, 27956, -38636, 6657, 81530, 70102, 52128, 39438, -49211, -115682, -93071, -40200, 28966, 65433, 1787, -47970, -139770, -83534, 5882, 10732, -102392, -151322, -141278, -7910]
22745g910o71o0735l2514K3530n0130l5893R1301M7350M897K6101j413m0583j0929
22732d7599j02750N050R4434L3117k831J2883k7401k8865p8831l773M5951m8566
22720a49181r3917M2838M280P0784R2626n5600j0294M2511M6281p0636k0398L0990
22708f9716R5098M8056k3795o316k5001M346l7593K2410M8757j8347j3741l2841
22696h683r2318j02325K4507J7665N835O6820k538q980K7764M4020k8106n8511
22684a14850L3625j20216J06192J50642J8237j21719r7414m9796K2618k903L1948
22673a43636J59167M1079q5323l493M4730l7739p8050m344N6385L1160o9498N1538
22661c8024l1104L712J12006n9095q7613N0841K1744l4744p8823N6358J5690J1288
$$ y = [-7910, -8581, -69316, -101830, -78300, -128430, -164323, -73022, -25672, -20775, 5326, 3913, -36670, -47599, -150349, -145299, -50865, -17748, -20579, -7696, -35097, -63962, -142793, -146566, -100615, -149181, -243098, -200260, -195980, -125196, -32570, -88170, -98464, -55953, -9672, -80308, -100706, -69716, 25382, 73438, 49643, 43327, 18326, 22672, -14921, 7489, 56246, 37899, 24158, -8683, -101001, -203326, -178819, -161154, -155319, -88499, -91037, -100017, -72253, -28233, -56339, -114850, -81225, -201441, -95249, 55393, 73630, -48089, -145503, -195299, -172681, -175584, -143636, 15531, 56610, -28713, -32206, 12524, -25215, -103265, -107609, -51224, -20064, -89562, -38024, -69128, -65416, 46590, -12505, -100118, -49277, -27533, -62277, -141100, -84742, -69052, -57764]
22649e7764K1178Q2305M3929O28k3621L5870o970K7243j0241k8104o0940p0610
22637d7097J9650N7450J08210n7416m4033J9109o9181j7958k6594j14965K9163
22626a43662K9657o026r0529l5683O3379J31042M0387M0816J9241m788j5263M7042
22614G5613l7390q1956J5710o8433N9135Q107M3727M6308J8251N024P3632M8171
22602B05899n6893k8589n7994j10358k054k4612O96L970P9325Q0567m480j0060
22590G5417K2220l2162p9656N760N7573j8282m6946j02057l5304R941k5230p8880
22578b47606P9515R6521L172N6376K7070L8047n4934M2025O7733K656j35813p3550
22566i8788o1003K1693J14222O3457P973r7908o4965K6760Q9541m3184p872J47711
$$ y = [-57764, -36586, 45719, 89648, 90276, 66655, 102525, 95555, 122798, 112557, 84453, 23513, -47097, -27447, 30003, 138213, 80797, 36764, 55873, -13308, -31266, -57860, -172825, -143662, -114005, -120031, -210560, -246243, -182864, -51822, -11435, 29381, 48622, 43834, 28571, 75613, 38223, -43733, -28023, -96456, -37321, -29214, 14513, 60821, 79072, 84096, 157728, 205899, 149006, 120417, 62423, -47935, -49989, -74601, -73905, -69935, 9390, 89957, 85477, 75417, 97637, 65475, -14181, -8421, 49152, 30870, -16076, -118133, -153437, -143496, -168726, -247606, -168091, -71570, -68398, -12022, 15048, 53095, -1839, 40186, 107919, 110575, -25238, -98788, -159791, -138098, -23876, 39581, 47554, -50354, -115319, -88559, 982, -42202, -50074, 97637]
22554I7637J1113j54457k4066J2555j7737J8995N6511j9258R3128L4505p2939
22543C5987m3845o2132o1596q9659N1922K5926k962r217J50191J29755k8168L7387
22531A33589K7o0152p4268l0587j7691K5308Q8026m9296k6038N3707p4500L2748
22519H73P7906m7835K4321j2706Q0135q6629o427Q3102j5587k2065M4165k0748
22507I8505o1634o6894j6007L7535K6357o5136j0020O5056P856l2905l683m2748
22495f3718L7832j2940n3758k2204k0071l7503P9928M9143O2740k8416j06982
22484a15949K2097L4177J21195R587o2085J1813R54p0015P8200J45020L8105q1406
22472A31693j45745l1838L4655j888J9035M6852k4699k0256q0394m9078L0435
$$ y = [97637, 108750, -45707, -69773, -57218, -74955, -55960, 551, -18707, 74421, 108926, 35987, -7858, -69990, -131586, -221245, -169323, -143397, -146359, -155576, -5385, 124370, 96202, 133589, 133616, 73464, -804, -31391, -49082, -23774, 64252, 14956, -11082, 42625, -31875, 873, 78779, 30944, 55265, 42559, 122694, 36065, 29638, 112740, 97153, 75088, 119253, 98505, 36871, -30023, -46030, -8495, 17862, -47274, -57294, 7762, 15618, -17287, -20970, -63718, -25886, -38826, -92584, -114788, -134859, -172362, -92434, -43291, 19449, -8967, -115949, -93852, -59675, 61520, 71107, 9022, 20835, 21789, -48226, 29974, 174994, 213099, 131693, -14052, -45890, -11235, -13123, 5912, 52764, 28065, 7809, -72585, -121663, -91228]
22461i1228k4563L7329J25696N9280o4606o4192q8869P216N3363k6674L6307P8105
22449C7164M2691j17754J8826L0812L2612k1753j43167j08360J06156P6347M9168
22438B742m0226M0749M7760j22717j07588j9769Q9755J39032N0129n0506l6347
22427f986j1347K7695M3281o050j9243n9649r3768o0321R2292J15597K3039K3857
22415F8397P302o5297o4849j21299J6142N9421n304M4883K3579J8184k8730l7298
22403h4869l9100m4436q2563K2112J0591k025O1444J74558p7637o2045k7627M4217
22391a07380Q632r320K9359m5903O240O3505J9045j8850m2480J04454N6172n235
22379E8239K9897l6878j4695j65521k07468l9130K07570Q4896M8474L5854O9801
$$ y = [-91228, -115791, -78462, 47234, 106514, 41908, -22284, -111153, -103937, -50574, -77248, -40941, 37164, 79855, -37899, -19073, 11739, 44351, 22598, -120569, -228929, -122773, -46426, 2742, -37484, 3265, 51025, -71692, -179280, -199049, -109294, 29738, 79867, 29361, -6986, -18333, 9362, 52643, 46593, 27350, -32299, -126067, -186388, -94096, 21501, 44540, 68397, 75699, 10402, -54447, -175746, -159604, -100183, -105487, -60604, -37025, -18841, -47571, -84869, -123969, -168405, -250968, -228856, -218265, -220290, -158846, 15712, -61925, -123970, -151597, -107380, -98748, -108068, -78709, -124612, -118372, -54867, -35822, -54672, -97152, 7302, 63474, 58239, 88136, 51258, 36563, -128958, -336426, -375556, -167986, -83090, -34616, 1238, 71039]
22368G1039J06833M6567l7610P2267K2855m5856n9787M0167r0690j06856P315
22357B6244r7473p8843M8577M6001M8685J03025j8378l6463m4902l3574m5479
22346h2580j7824k2323j4744j6756J231P6513M1351K4543j949o3907l2898P130
22334a02213N9739M2261R467m8008n4790j2594J8983J7210q2161P970N1679N1053
22322d1404j0590K7487k401O1037j2773K6767O4167J4812m4581l5987j7235M2663
22310G1962j5847l7998n1144N7782k239l6623j4629m0253Q155K4724m464M834
22298c5740Q5734L7119k8555m6029j06491J09619M2255n2410n6101n0376m1967
22287a42942R1514O7016o8152O565J759m494K6594M5311j3188p0841l6037k1858
$$ y = [71039, 177872, 224439, 186829, 259096, 281951, 236095, 176308, 216475, 125785, 18929, 26244, -71229, -150072, -101495, -55494, -6809, 96216, 77838, 41375, -3527, -37101, -82580, -100404, -122727, -137471, -154227, -152996, -76483, -35132, -10589, -12538, -76445, -109343, -102213, -42474, -213, 9254, -38754, -93544, -106138, -87155, -69945, -152106, -144136, -92457, -41404, -51994, -24507, -26908, 34129, 21356, 48123, 112290, 127102, 82521, 46534, 29299, 71962, 56115, 18117, -33027, 24755, 22516, -14107, -28736, -68989, -60834, -36110, -40574, -35740, 49994, 87113, 58558, 12529, -93962, 15657, 57912, 5502, -50599, -100975, -142942, -51428, 15588, -52564, -45999, -44240, -48734, -22140, 23171, 9983, -60858, -96895, -118753]
22275a18753M155q1331P3140P0560k2233P369m5964o4817k9040k8407j8370N8101
22263a95590P9683J9536j245O771p0599m0103L8220J03445J5573q028l0634N7071
22251b5900L6524j3912l4758L3056Q1787l061j05903j1539J3202K6349O8650m5748
22239A8747l2837k3570l3639j4395R4973J83l4800N1809k4663l2535m1951k236
22227g4914k0408l5325M2643K2117M3938J14094m916p1255L600m6498p882j0394
22215d5200J25519p3997p7942M8217N0076L0993k1210k6569o4740p8806O5000
22204f8659J01416o1535m2127k7081j2242K0034O1847J3560P595m2868n109J4757
22192d0412K7041L1674l5748n5733l6275j6764P143p4k3434O116P6429L6534q6191
$$ y = [-118753, -114598, -195929, -122789, -52229, -74462, -67093, -113057, -177874, -206914, -235321, -253691, -195590, -115907, -96371, -97616, -90845, -161444, -201547, -163327, -59882, -44309, -52337, -82971, -25900, 10624, -3288, -38046, -4990, 76797, 73736, -32167, -43706, -30504, -4155, 64495, 18747, -14090, -37660, -71299, -85694, 9279, 9462, -25338, 26471, 1808, -30727, -72678, -74914, -95322, -130647, -88004, -65887, -21949, 92145, 87229, 15974, 19574, -26924, -34806, -45200, 80319, 6322, -71620, -23403, 26673, 57666, 36456, 9887, -54853, -133659, -68659, 32757, -28778, -70905, -97986, -110228, -90194, -28347, -14787, -7192, -50060, -55169, -40412, -13371, 18303, -17445, -73178, -109453, -126217, -119074, -119148, -142582, -136466, -60037, -23503, -109694]
22179a09694K0765Q3800o6811p5193O6705K3845K8433k8395o6699J8901K1917
22168h2426m6888k9990J8449L7713N8514J24747J9464L7293p270l6338O7369m4136
22156A16501j02621j00907n0697j6764P0521J7758o5058p6886J3833Q2640j281
22145a12961L1134Q733O9137P1503n7884l3147o1405l6196k1093Q1017L6945P9986
22133E5769L2271p0293J4721R245k3568j38919K3687J08111K6295l3121J20856
22122A25054K2072j01278o259n9278K2020k5493l6720O9678Q5227P3520O46q8689
22110H0500m8675j8191o9972J2979M5152J6233M9631m2403q9267p2212m7284R384
22098a74125K0651m9258K5769J08212R3523l6474j3331M7519k1849N0534J41114
$$ y = [-109694, -88929, -5129, -71940, -147133, -80428, -56583, -28150, -56545, -123244, -104343, -82426, -129314, -159304, -140855, -103142, -44628, 80119, 99583, 136876, 129606, 93268, 160637, 116501, 13880, -87027, -137724, -154488, -83967, -66209, -131267, -208153, -194320, -111680, -112961, -81827, -73094, -3957, 67546, 9662, -23485, -84890, -121086, -142179, -61162, -24217, 55769, 88040, 17747, 32468, 41713, 18145, -120774, -97087, 11024, 37319, 4198, 125054, 147126, 45848, 39589, -19689, 2331, -23162, -59882, 9796, 95023, 168543, 169189, 80500, 31825, 13634, -56338, -43359, 1793, 18026, 67657, 25254, -64013, -136225, -183509, -174125, -153474, -202732, -176963, -68751, 24772, -11702, -25033, 22486, 637, 51171, 192285]
22087A92285p3991o7145n1772m6723j7492P2823J3373j13171m4139J6224N7075
22076f2653L3649M0603j3979m4833n3491l1509M959n3062Q4501J24752l5649j0403
22064a7115J23247Q8861p4201m3586n8820Q4282m7894j10809k9364M7659O6351
22053B8611J9915r8581M3024M8698r9784j02494M5695J4280N6563k6416M8041
22042b2448j399o6048n5350m6338N7101J27931K9106N5532l1191K122n6911o398
22030a4291M5856q7680p7838K0182L1834l7038Q9187O2915q794L0151o2939K3261
22018A4806K97K2186Q5347M0317p8527k1202O4305N0527q4683l8566n9227l3487
22006c7907M7280l1975k807j0971M056r1516l3194J0347J30871N2496l7694l0684
$$ y = [192285, 118294, 51149, -623, -47346, -64838, 7985, 21358, -91813, -135952, -119728, -62653, -29004, 11599, -2380, -47213, -100704, -132213, -127254, -180316, -95815, 28937, -6712, -17115, 106132, 194993, 120792, 77206, 18386, 102668, 54774, -56035, -85399, -37740, 28611, 48526, -50055, -7031, 41667, -58117, -160611, -114916, -100636, -44073, -70489, -22448, -23847, -89895, -145245, -191583, -134482, -6551, 22555, 78087, 46896, 49018, -7893, -14291, 31565, -56115, -133953, -113771, -81937, -118975, -29788, 33127, 24333, 54484, -8455, 14806, 15103, 37289, 122636, 162953, 84426, 63224, 127529, 178056, 93373, 54807, -4420, -37907, 9373, -22602, -25409, -36380, -32324, -123840, -157034, -146687, -15816, 36680, -1014, -31698]
21994c1698m5414L4218l3367k9082j7820k0775N0906O3945J9920M0905J07869
21983A39607M8215k0501q2015l5349l0469L2145n6829j17955m8654j5936P5993
21972a11748J85192O2702J0006o2891j7442p1664R656M855l6817K5800M2398k081
21960C7966k2619l4279n739Q8430L2360J4117j15962O7742m2418m9308j5867N9897
21948A4320L9870j7553L7998J47306O925q3467l0809j41387l6940J10087L6398
21937H2748o3271p8968M565J19332M5493j08712J0569N5386k2703M5323k8780
21926F0982o0827q3866q0407M6514L2744n475L8990K297l9750M7936R8353Q735
21914F6226l2773M825m5287L891M8247j4701j5704n684o9237n3325L6363k7969
$$ y = [-31698, -77112, -42894, -76261, -105343, -123163, -143938, -93032, -29087, -9167, 31738, 139607, 187822, 167321, 85306, 49957, 19488, 51633, -5196, -123151, -171805, -187741, -111748, 73444, 136146, 146152, 83261, 65819, -5845, 3811, 8666, -28151, -2351, 40047, 37966, 15347, -18932, -24671, 63759, 96119, 110236, -5726, 62016, 19598, -29710, -45577, 14320, 54190, 36637, 74635, 221941, 228866, 145399, 114590, -26797, -63737, 46350, 82748, 19477, -59491, -54926, 64406, 109899, 1187, 11756, 67142, 44439, 89762, 60982, 155, -83711, -164118, -117604, -84860, -90335, -51345, -49048, -88798, -40862, 57491, 66226, 33453, 38278, -7009, -3118, 45129, 30428, 14724, 9040, -60197, -113522, -77159, -105128]
21902a05128k219R3621N9666Q8001j7313j10244o6458L3975m2813m1470k6970
21891a37352O2414L1769L9296N0484l3785Q389K4370r962n0895O740m689j4993
21879b8214M1651O1773n0473o4298l3896N6452J00671j6810j15423J3960J43216
21868A08609l5696j39964r908J00743n892l0662r065O2501k3465J3200m9196j70698
21856a89493L5472J45045k6219q8936m5449J6482P8857l5086l4731J08784K8487
21845f787J0935j9698k0620K0635L1829K8352L031k4426r1443l2292M1524j8081
21833g7041l9077m1394L3838J37867J00664p9058o0192O4087M0448m966N9624
21822A34800n3150J3496K1642j16676l9314l682O2550N3317k3254j3073q1674
$$ y = [-105128, -107347, -13726, 45940, 133941, 116628, 6384, -60074, -26099, -68912, -110382, -137352, -74938, -43169, -3873, 46611, 12826, 21215, 45585, 35623, -15272, -8532, -13221, -28214, 13437, 75210, 24737, -39561, -73457, -17005, 83666, 66856, -48567, -34607, 108609, 72913, -67051, -76959, 23784, 17892, -12770, -21835, 40666, 17201, 30401, -18795, -189493, -154021, -8976, -35195, -124131, -169580, -153098, -74241, -109327, -144058, -35274, -6787, 4148, -15550, -36170, -15535, 16294, 44646, 47677, 23251, -68192, -100484, -58960, -77041, -116118, -157512, -123674, 14193, 114857, 35799, -24393, 39694, 80142, 75176, 134800, 81650, 95146, 116788, 112, -39202, -42884, 19666, 72983, 49729, 36656, -45018]
21811d5018o5427m0873j10717N9673L3899Q6864P4268k614m3706M0872J9253p099
21799f25M746Q239M3346K6760M3420p2268m6392M25m5163p0056N6348M8397p768
21786a0591o0460K3288M8690M2300k0035r1826l3938L0945J03818M997n8528O1341
21774D0001O4441l8872n9879m4356j4388M2855O4196k5437J0297N4885J0290k7089
21762G6944J7124o048k987k2501o265k1301o1026L6090O8681o702J9182n1313
21750C9878o2384L4411l9767K1124P3794o2864j5000L462n8719l7146N4855n1006
21738i9362j6839L0899j3056l7407m6176P5645J25404O8291l0925o9102j20715
21727a33343L4270r7660o6688R9997O6508O853O1296K1893j09859m7846N1765
$$ y = [-45018, -110445, -151318, -262035, -202362, -168463, -81599, -7331, -9945, -53651, -12779, 6474, -625, 4121, 12360, 55706, 82466, 125886, 53618, 7226, 7651, -37512, -107568, -51220, -2823, -10591, -71051, -47763, 927, 43227, 23192, -68634, -102572, -71627, 32191, 37188, -21340, 40001, 104442, 65570, 5691, -38665, -53053, -10198, 53998, 28561, 38858, 93743, 104033, 76944, 94068, 88020, 85033, 62532, 56267, 34966, -26060, 10030, 78711, 72009, 91191, 39878, -22506, 11905, -27862, -6738, 67056, 4192, -10808, -7346, -66065, -103211, -48356, -99362, -116201, -85302, -98358, -135765, -181941, -106296, 19108, 87399, 56474, -12628, -133343, -99073, -196733, -263421, -163424, -96916, -90063, -28767, -6874, -116733, -164579, -112814]
21716a12814O1777l4855r375N3353N3980n6480L2418K029j1922j1848j0855l2273
21704g6865p905R4398Q0553j910o5608K2705L6856j0609Q321r5156n3135o60N476
21691f3539p933O3706K7569m5121n3209k6818p1309n1241P8881J50072L6567n2056
21679a4431J08385M2357j8253l7487n7409m8510k6722l0661O5765J609m2293r8465
21667a56115O8464O6004k3987q3838m0914O4273l4368k362K0986J05464P8648
21656F2255O0753l1838j45226r3088L2166P17j2270K5720J14248n9529r5471q8730
21644b30293L6264K4347j9722n6205J14006J27824O2220j8631J9072L1994l8513
21633E2363j63870k3245m2236l194M8032N1623L6475l9977J5722N1778O7923j06289
$$ y = [-112814, -51037, -85892, -95267, -41914, 12066, -44414, -11996, -9967, -21889, -33737, -44592, -76865, -84770, 9628, 90181, 88271, 22663, 45368, 82224, 71615, 79936, -15220, -68355, -69015, -63539, -71472, -7766, 19803, -25318, -78527, -105345, -176654, -227895, -149014, 1058, 37625, -14431, 93954, 136311, 118058, 80571, 23162, -25348, -52070, -82731, -16966, -15357, -57650, -156115, -87651, -21647, -45634, -129472, -170386, -106113, -140481, -142843, -121857, -16393, 62255, 123008, 91170, -54056, -147144, -114978, -114261, -126531, -100811, 13437, -46092, -141563, -230293, -194029, -169682, -189404, -245609, -131603, -3779, 58441, 39810, 58882, 90876, 52363, -111507, -134752, -176988, -180182, -132150, -80527, -44052, -84029, -68307, -16529, 51394, -54895]
21621e4895l2033R2564o6513J7525j8650Q8722N1067m462N3403j5770o1712m4245
21609E001k3428m3469L4882K180O8025J16245l4985q1168N2274N701j7877l8336
21597D5045k6087o9354K427n7578n4330r43M7435M7930M1766O0017n5678K8138
21585H788P6508M5451n8871k0529l7782o9902j22358n7988Q8620R4914M4779J2480
21573D110P6232L781O908n7115l4972O1316M0318l1873o7188K2528J53247L1524
21561B08816m4199j3159p6120o2949n7112n3623J4889N3779R1084o4787r4286
21550i7667P1993q635j5772P8180M6231l2183N3448j5548j23233j54975M1691
21539a56470J78570R2301r753N3827j35594p3888R812Q5406n7913l8335o4351
$$ y = [-54895, -86928, 5636, -60877, -43352, -62002, 26720, 77787, 73325, 126728, 110958, 49246, 5001, -18427, -61896, -27014, -24834, 43191, 159436, 124451, 43283, 95557, 101258, 83381, 45045, 18958, -50396, -47969, -105547, -159877, -160820, -113385, -65455, -23689, 36328, -19350, 8788, 85296, 130747, 71876, 51347, 13565, -56337, -178695, -236683, -148063, -53149, -8370, 4110, 80342, 84123, 91031, 33916, -1056, 60260, 100578, 68705, 1517, 24045, 177292, 208816, 164617, 151458, 75338, 12389, -44723, -98346, -83457, -29678, 61406, -3381, -97667, -25674, -34309, -50081, 28099, 74330, 42147, 95595, 80047, -43186, -198161, -156470, 22100, 114401, 104648, 158475, 22881, -51007, -41195, 44211, -13702, -52037, -116388]
21528a16388J3563J56183R6949k6109l0752o1445k942O48N187p3714m2950P4207
21516g563l5180J6904R33Q648K0098q030L6519Q2191p3030j46440n4652L5059
21504a24543O0818o2848J9895N3470j4141n0331J9061R3756o5326K9900J27847
21493H7558m7791m4980j22300J1819L5017P911l5672J16262N3163p7500N2734
21482C6221J15057K2820k4739N000l7513q2215m1937n7250p2919j24436J6561
21471b45350l8434N9393Q2475N0973p905K1598k2830J9066j479K1760p2994r2712
21459b26439L0086P5614Q4894J7827j5374L7485K5947p7116q5393L341R9221K6881
21447c026K6338m4080m082J6761o989K9341n4754l6220K5884R443l0454O2958
$$ y = [-116388, -102825, 53358, 150307, 124198, 93446, 32001, 29059, 29707, 34894, -38820, -81770, -7563, -42743, -25839, -24906, -16258, 3840, -4190, 32329, 114520, 41490, -104950, -159602, -124543, -63725, -126573, -106678, -53208, -67349, -117680, -98619, -4863, -70189, -40289, 87558, 39767, -5213, -127513, -115694, -80677, -72766, -108438, 7824, 60987, -16513, 36221, 151278, 174098, 149359, 154359, 116846, 34631, -7306, -64556, -137475, -261911, -245350, -283784, -224391, -141916, -90943, -98848, -77250, -100080, -81014, -82493, -60733, -133727, -226439, -196353, -120739, -35845, -18018, -33392, 4093, 30040, -47076, -132469, -129128, -29907, -3026, 23312, -20768, -24850, -8089, -15078, 14263, -40491, -76711, -50827, -41384, -71838, -8880]
21435h880K7381j6457K8107k1281j5114j6249P3278O782l4451l6953k479l4673
21423e0989K4536M8408n7607r3461N7703N8538l168Q954Q1309N3503k3060l6820
21411F7846o1040O8696l7675q4584k7046J7962J72371j3122k2895r5101j09670
21400a24258J2196M3968Q1090J841n8337J6846J5256Q2998Q5246N3561p755n9554
21388A43098m0807N3917O6206o5580r4322k8009l3765m728m1847Q5227R0336j06964
21376B2762n897p5115m6171J72291K4264k1462k0322l991J3533M803J4485J7581
21364I6761k9654j5730m7073j7499L7902m1745M4695l8171Q951l3460j0706N0087
21352D358J1735J3224R238M9264j08894j9105K0522N5814J8288p3331j05941J5681
$$ y = [-8880, 18501, 2044, 30151, 8870, -6244, -22493, 50785, 57567, 23116, -13837, -16316, -50989, -26453, 21955, -35652, -129113, -71410, -12872, -16040, -7086, 74223, 127726, 104666, 67846, 6806, 75502, 37827, -46757, -73803, -55841, 116530, 103408, 80513, -14588, -124258, -112062, -68094, 12996, 14837, -43500, -26654, -11398, 71600, 156846, 210407, 202652, 143098, 102291, 156208, 222414, 156834, 62512, 34503, 738, -3990, -45837, 39390, 129726, 22762, 16865, -58250, -104421, 67870, 92134, 70672, 50350, 46359, 59892, 64695, 79180, 96761, 67107, 51377, 4304, -13195, 24707, -17038, 27657, -10514, -1563, -35023, -45729, 4358, 16093, 29317, 38555, 87819, -21075, -40180, -19658, 36156, 54444, -18887, -124828, -109147]
21340a09147l3214n0267N2226Q3635Q8374M2093o2375q925J33451P2976K4526
21329B33353q1448j6850K732M7394l491k773k9672N6725p2676j01593r3487l0677
21317i2463q474K1394K3270J9554l5128N3999k8330j01656o2650m250J1667N5938
21305a47129J45248J43122k9530q5990k4668q080j5829l4713N7449N2146K394
21294E4420k3183j1619N4652P3549j5842j10426p9093J7983J0927r0957P4571
21283d5018k4674k7279O2106P7350n4631j8423r507J1270K3163Q166Q01j13943
21271a10619r6515O3153N6615j5129M7150K3107k2418N5304j1743j8189Q0033
21260E0749K9319q3929K9149j4472j25385P5222J15037O3150n009n0886k7248
$$ y = [-109147, -142361, -192628, -140402, -56767, 31607, 73700, 11325, 2400, 135851, 208827, 233353, 151905, 135055, 137787, 185181, 181690, 178917, 149245, 205970, 133294, 31701, -61786, -92463, -100937, -79543, -56273, -36719, -71847, -17848, -46178, -147834, -210484, -214734, -203067, -147129, -1881, 141241, 111711, 25721, 1053, -7027, -22856, -57569, -120, 52026, 54420, 31237, 19618, 74270, 147819, 131977, 21551, -57542, -39559, -28632, -119589, -45018, -69692, -96971, -34865, 42485, -12146, -30569, -40076, -28806, -5643, 2523, 3324, -110619, -207134, -143981, -87366, -102495, -55345, -32238, -54656, 648, -11095, -29284, 50749, 80068, -3861, 25288, 10816, -114569, -39347, 75690, 138840, 133831, 82945, 55697]
21249E5697M7424R2778m5224m9426l3099j9075o7416k9751N3943k6700q85R653
21237a2081J8720K6622j4236N083j8405r4250r8628M7790O0509j14599L2853N8493
21225a02129K4318K0633R4948R9930o0427j49551j39812J3142J76874J23237k693
21214I8470p8161p8781N090P1783m7084l6674L6837O449P4555k3625p223P2691
21202I4327j8764L8086M8573j3075l9475q8663l6122k7575J3183R004O9842n5161
21190e820l0441n6269O190J20306O9040q9072L1155k0229p3604N9114l3724L6986
21178A3632M1284L1J8686j26323q2127l3753M2907L3836J40569J11981j0512p5444
21166G4767r4127p2846j4570r2387k181R9445J10826N3551l2088j8039K0973n3337
$$ y = [55697, 103121, 195899, 150675, 101249, 68150, 49075, -18341, -48092, 5851, -20849, -21734, -12081, 6639, 33261, 19025, 24108, 5703, -88547, -187175, -139385, -78876, -193475, -160622, -102129, -77811, -57178, 37770, 137700, 77273, -72278, -212090, -198948, -22074, 101163, 98470, 20309, -58472, -53382, 18401, -28683, -65357, -28520, -22071, 52484, 28859, 21636, 94327, 75563, 113649, 162222, 149147, 109672, 21009, -15113, -42688, -29505, -20501, 49341, -5820, -36261, -92530, -86340, 33966, 103006, 13934, 45089, 24860, -48744, 10370, -23354, 13632, 54916, 54947, 73633, -52690, -134817, -168570, -125663, -91827, 48742, 160723, 150211, 74767, -19360, -92206, -106776, -199163, -201344, -101899, 8927, 62478, 30390, 12351, 33324, -20013]
21154b0013m486R5567L1369q2514L5343Q0368m4661l8001j00492j2501O2155r818
21142g684M9117k3004l1395l0360q9591l434Q4944K0284m0507J345k1057K5838
21130f5504P8125R2165m6221q3487K6455j8568l1037K9459M7885j3895m8369n472
21118c8464j3978j8044n1540J7803J21860k7819j30188K554L5818O4867N2950
21107A5819k0607m1139k4502J0805j232K2474n4468R701k6143O2650N7641O139
21095A7138j55507j8360o925J1121Q564Q7771M3659m4783m618O962r4857P8397
21083g1438L5931O706o6897N0501O2323j0279j5268M1671L9116K1497k7717n3443
21071A2703o986k5898L392O2790N0936o7904j043R3235j28512K7844k199n6218
$$ y = [-20013, -24499, 71068, 102437, 19923, 55266, 135634, 90973, 52972, -47520, -60021, 2134, -7684, 41433, 18429, -12966, -43326, -132917, -136351, -51407, -31123, -71630, -70285, -91342, -65504, 12621, 104786, 58565, -24922, 1533, -17035, -48072, -18613, 29272, 15377, -32992, -38464, -52442, -70486, -122026, -104223, 17637, -10182, -140370, -137816, -101998, -37131, 15819, -4788, -45927, -70429, -59624, -60856, -38382, -92850, -83149, -109292, -46642, 10999, 17138, -138369, -156729, -163654, -152533, -143969, -56198, -12539, -57322, -61940, -54978, -149835, -71438, -35507, -28801, -95698, -45197, 17126, 6847, -8421, 33250, 72366, 93863, 66146, 12703, 5717, -20181, -16789, 46001, 96937, 29033, 27990, 121225, -7287, 20557, 18358, -37860]
21059c7860N1257M9738Q759n904j5057J4549K5144L4087k9714n4478l0850j5433
21047e762L5347R2680R209l3152K2749N073j16220p1250o595j5668r181j1955
21035a04725J7769K5379j7704L5288L897J6108K5303m7832j6442r287O4388J06971
21023I9113P2821N954o5505j28059Q622j5407K4422J2405R4987q4635m4170j9857
21011c9309N8182j7475R521K0414p8394j24372j00268l4476J20968P0653m3731
21000a58287R8480P0831p495o513j00734m4393J6799J9455K2063R7808M1757l1049
20988A8722m6661n4015m7774M8262p8561k471M0907l4736m446j7627J7239P3607
20976h7554Q9576N5173M4133n1491n4848J2984m4522m9011l163l1290n7955l8250
$$ y = [-37860, 13397, 63135, 71894, 65990, 50933, 65482, 90626, 124713, 94999, 40521, 9671, -5762, 29585, 122265, 131474, 98322, 121071, 126144, 9924, -61326, -67921, -83589, -92770, -104725, -86956, -61577, -79281, -43993, -40096, -23988, 1315, -46517, -62959, -72246, -7858, 99113, 171934, 177888, 112383, -15676, -7054, -22461, 1961, 14366, 109353, 24718, -19452, -39309, 18873, 1398, 10919, 31333, -47061, -171433, -271701, -306177, -185209, -114556, -158287, -59807, 11024, 3529, -2984, -103718, -148111, -131312, -111857, -89794, 8014, 49771, 18722, -27939, -81954, -129728, -81466, -160027, -162498, -121591, -156327, -160773, -178400, -161161, -87554, 2022, 57195, 101328, 49837, -5011, 7973, -36549, -85560, -88723, -120013, -177968, -216218]
20964b16218O7412J27094l2068n1979L7004J01141O5710M345l0384j23153P6794
20953B5698J22940k2308p7567o6564M2289o2966n9972O4243O4711j7992j09723
20942i7211o4447L8954N8517l0836n5092j01061K5381O8521M6982R9771M9046
20931C8525o8618l4286l5436L2960o9218n3135l7237N9347O0048O5716J8340K1345
20919a649k5769p622k3112j9255J10812L2459o8709k9064L9664M4987m3277M9610
20907E9075j6279m1110p50K218J8347K3448o2486Q052R0781L9184q2086q9922
20895e1528o0760p9372J0676J41045j8095J3646J50904p8110l8272O7324N6814
20884A14272L7267k7525r0075k3487m2080L559L5833m8565m4997J9926J1126j25287
$$ y = [-216218, -148806, -21712, -53780, -105759, -68755, 32386, 98096, 102441, 72057, -51096, 25698, 148638, 126330, 48763, -17801, 24488, -38478, -98450, -34207, 30504, 12512, -97211, -161658, -122704, -64187, -95023, -150115, -251176, -225795, -157274, -110292, -10521, 38525, -30093, -64379, -99815, -66855, -136073, -189208, -226445, -167098, -107050, -41334, -22994, -1649, -27418, -35040, -58152, -77407, 33405, 65864, -2845, -31909, 7755, 52742, 9465, 59075, 42796, 1686, 936, 3154, 21501, 44949, -17537, -9485, 81296, 120480, 38394, -51528, -112288, -191660, -180984, -39939, -58034, -44388, 106516, 28406, -9866, 57458, 114272, 151539, 124014, 33939, 10452, -31628, -28069, 7764, -40801, -85798, -65872, -54746, -180033]
20872a80033K2277R8057O9284N9688o490r3929L9947Q2445m3307r3410P9551o9071
20860c4991j11618L2623J13907N6157l921n6863o441N3142k1120o601l0518m389
20848b0633O6781O3191L6129K2370J9136p0428j09098l3570j23509q215P234K3399
20836a27213L2124m4733K8669R6889O8148J11491o0336j07972l5365k4833j8730
20825h1861N0431L7496N1793M286j04085m8669J26679K5932m8831o885j8312R8567
20813H6541k5165Q539n2036N3278J4827j0866K1771m6142p509L6463k4748n8164
20801c211M6435L5924p6575J4379P9239J4626k5013m2960l6474J5022J0822R3347
20789A25561L5380N10m9954J973n546k5908q8884L5698K4181r723q857n991m4825
$$ y = [-180033, -157756, -59699, 9585, 69273, 62783, -31146, 8801, 91246, 47939, -45471, 34080, -34991, -146609, -113986, -79, 56078, 52157, -4706, -11147, 41995, 20875, 14274, -16244, -20633, 46148, 109339, 145468, 167838, 186974, 116546, 7448, -26122, -149631, -157846, -150612, -127213, -95089, -139822, -111153, -14264, 53884, 165375, 105039, -2933, -38298, -63131, -81861, -31430, 6066, 57859, 62145, -41940, -90609, 36070, 62002, 13171, 6286, -12026, 86541, 61376, 69915, 17879, 71157, 85984, 75118, 96889, 50747, 43238, 79701, 54953, -3211, 43224, 79148, 2573, 16952, 96191, 110817, 85804, 42844, 6370, 21392, 32214, 125561, 160941, 161451, 111497, 113470, 107924, 82016, -6868, 28830, 53011, 43288, 34431, 28440, -16385]
20776a6385k2255r4143J072l0240P7105O3515O6272j4158l9667M5003L8610k4194
20764E0535p3555r362O3830O5721P111K9673l2913j2175L9064p1336j00892K189
20752d2110L2188k2597o4166j7871N8798k9639m7706M3574P4867J28565J68657
20741B82560r294o8076j07702k4222L3685r866r1901L1467o275L2628J10794o8543
20729A05255p5108R227n1162n6546M3784M7347N7086L747q9105j136P6311L4839
20717A04539n8518l0534P220J9993p4868r6202M5029P3426N3938m1503k6015K5486
20705A991j6620n872J8591J321L3784J8930J03K9545L4967o0671l5693N2733m8460
20692B4649j29922k5237Q4919L7212L7672M9216m7835o9493N0771k3315J3870
$$ y = [-16385, -38640, -132783, -131711, -161951, -84846, -21331, 44941, 30783, -8884, 36119, 74729, 50535, -23020, -32382, 31448, 97169, 104280, 133953, 101040, 88865, 127929, 56593, -44299, -42110, -9922, -32519, -96685, -114556, -55758, -85397, -133103, -89529, -14662, 113903, 282560, 273266, 205190, 97488, 73266, 106951, 97085, 5184, 36651, 30376, 63004, 173798, 105255, 30147, 39374, -11788, -68334, -24550, 22797, 79883, 83630, -5475, -6611, 69700, 104539, 46021, 15487, 22707, 42700, -32168, -128370, -83341, -9915, 44023, 2520, -23495, 1991, -14629, -20501, -1910, -589, 33195, 52125, 52228, 81773, 116740, 56069, 20376, 73109, 24649, -105273, -130510, -45591, -8379, 29293, 78509, 30674, -38819, 11952, -11363, 2507]
20681B507K7538n352N5988k0454m2342k8570j3683K157O4963l1265l3073O0966
20669C9380k5611K2607O3735j0488l4283L9144r4536j14612j9552L2863O1352
20658d0001O8988k6267j3219m4211N0108L5664j1506r971O5184m8174l4551l0554
20646c8510k6254L1619M1377P7588J8534j19013o626J40498P5201m3478r5913
20635E5023k3989N946R919j18422q129L4432j2012l0370L8474j26641O186L1211
20623a38372K946Q8213N1745M7053o675K4353N7996l1683P3080J04125j4036p2219
20611A86526o9741n9606j11022l5903M8090N1472M2980L7622J7624m2833L1798
20600I7007m3447l2219r0060j36177M5965P2197P0702m792p835R3686m8423m9975
$$ y = [2507, 30045, 24693, 80681, 60227, 17885, -10685, -24368, -22211, 42752, 11487, -21586, 39380, 13769, 36376, 100111, 89623, 55340, 94484, -52, -114664, -134216, -101353, -40001, 28987, 2720, -10499, -54710, -4602, 31062, 19556, 9585, 74769, 26595, -7956, -38510, -64764, -33145, 8232, 85820, 104354, -14659, -21285, 119213, 194414, 150936, 55023, 31034, 36980, 46899, -71523, -79652, -45220, -57232, -87602, -49128, -175769, -169583, -138372, -135426, -47213, 4532, 51585, 44910, 69263, 127259, 95576, 168656, 272781, 258745, 186526, 116785, 57179, -53843, -89746, -41656, 9816, 52796, 90418, 108042, 65209, 97007, 53560, 21341, -68719, -204896, -158931, -86734, -16032, -20824, -28659, 65027, 16604, -33371]
20588c3371l3708l1840J23038J43767o9039q1126J713n180P243J907L2876j0938
20576D5342r4253L986K6404j069L0793L9254q3011Q212R5374m9551o8583j5537
20564f2639O6476K2035J01919m1901m5105l676K7995J8168p8985l4918R3593k3866
20552C9096n0874M5378O2660l2060l4947k8650J9623K6502l6049J9090L7331L7040
20540A04140n5918J3783q5755j9620R5327J5049Q646R512M0805Q2108n4382l4982
20528A18713k7828j06767K4093m9157J9866J14439L6191r4593l7676k1580l1928
20517e6227P7053K3606o2995l5651J70060j547k3519N2509q227j03790j32241
20506a00969J6814O9483q0633P6223J62333R469q418l0895K5692k8500j6120q2037
$$ y = [-33371, -67079, -98919, 24119, 167886, 98847, 17721, 19434, 14254, 21497, 23404, 56280, 45342, -48911, -44925, -18521, -19590, 11203, 50457, -32554, -24342, 71032, 21481, -47102, -62639, 3837, 25872, 127791, 85890, 40785, 37109, 65104, 83272, 4287, -30631, 62962, 39096, -11778, 33600, 96260, 64200, 29253, 603, 20226, 46728, 10679, 29769, 67100, 104140, 48222, 62005, -23750, -43370, 51957, 67006, 75652, 85164, 125969, 208077, 153695, 118713, 90885, -15882, 8211, -40946, -21080, 93359, 129550, 34957, -2719, -24299, -56227, 20826, 44432, -18563, -54214, 115846, 114299, 90780, 143289, 135062, 31272, -100969, -84155, -14672, -95305, -19082, 143251, 152720, 144302, 113407, 139099, 110599, 94479, 12442]
20494A2442j07273J9682N9846J9931J45480Q0358q2649p725n1891K9485N4933
20483A72619l8190o1226l198K2416R179n6592q4381q4038p538n80O7411M0483
20471b3635N1932K8080K7662k5246p8599j00348P3292M9080p8940j21495n2645
20460b50862n3203J13141Q4297M2240K0139N1930o828r3068r6545K250J20356
20449f6153P4778o00l7592J00824M213q733M6428L404j68163k4180l738R3071
20437A3559n6988M3457O7396j3942M9902p0484k5727L3351L3956k2357r0933k0183
20425e8993L3251M0654m3911l3346j9105m6572k0192J18753o1734Q060M4906L5292
20413b937Q1118O7896o8969m6573O9647n3164m0897K2540P0223m2422n0505K3414
$$ y = [12442, -94831, -75149, -15303, 4628, 150108, 230466, 147817, 140092, 88201, 117686, 172619, 134429, 73203, 70005, 92421, 101600, 45008, -39373, -123411, -130949, -131529, -64118, -23635, 28297, 56377, 84039, 58793, -19806, -120154, -46862, 2218, -76722, -198217, -250862, -304065, -190924, -106627, -64387, -44248, 7682, 854, -92214, -188759, -186509, -66153, 8625, 8025, -29567, 71257, 75470, 66737, 113165, 116569, -51594, -75774, -79512, 13559, -43429, 28, 67424, 53482, 103384, 32900, 7173, 40524, 74480, 52123, -38810, -58993, -25742, 14912, -28999, -62345, -81450, -128022, -148214, -29461, -91195, -83135, -38229, -2937, 78181, 146077, 77108, 30535, 100182, 47018, 6121, 28661, 98884, 56462, 5957, 29371]
20401B9371O93J3272j4160N048J920M2356j56104j56941O3333J25756j959r0415
20389a37830R72N3309j4764O9303N0487J2523J18988P3710j23016j9899l1901
20378E1882p1013J8881O6629L1996L4385l6883n2183M0068o402n1444J0897m3999
20366g186N863O7980o8094N837r9083L1558M9167j5570K0184j2724l7387K3022
20354c6433P0952J5369m9100l800K3530N338m0626o980J0562K2757Q0361L1598
20342A23528o1206M488J6546n825K5635j8771J4837k5223r2835p9560l165Q3271
20330a8280N0295j00972l3974M403j7466l5518P7486O1552L2916r6722Q3809J29224
20318A36753m0146o3049L2068l1424p904L5582L5326L4385m4176M8328m2865j11455
$$ y = [29371, 30064, 43336, 29176, 34224, 36144, 78500, -77604, -234545, -171212, -45456, -47415, -137830, -136858, -83549, -98313, -29010, 21477, 34000, 152988, 226698, 103682, 83783, 51882, -19131, -250, 66379, 98375, 132760, 95877, 43694, 83762, 77360, 25916, 36813, -7186, -1323, 66657, -1437, 4400, -94683, -63125, -13958, -29528, -9344, -22068, -59455, -36433, 34519, 49888, 788, -3012, 20518, 25856, -14770, -21750, -11188, 11569, 91930, 123528, 62322, 66810, 83356, 77531, 103166, 84395, 99232, 74009, -18826, -98386, -101551, -18280, 32015, -68957, -102931, -98528, -115994, -151512, -74026, -12474, 20442, -76280, 7529, 136753, 96607, 33558, 65626, 34202, 26298, 61880, 97206, 131591, 87415, 135743, 92878, -18577]
20306a8577R9225L2651J7100r2l6860q5363n4421R8797O1696n8025J0776k0240
20294D6667k9298k0073N1473k9457r6830M6425K0521n9875k1458m833P6418J9323
20282i97k2253p6002K4268L7119K9280M2760J04682P8690K9323o038j16372l7001
20270H7459m9149o4155M262M1622n6404m456K969P5382P8044j2587M8321k3094
20258A28214o8133p6187j7512l5024J1164n2432O0508P5483J12646K7524q0074
20247H6177j5924o264j24747k3205M9742N7794J6237l2906j14511K4334M6632
20236c6641K610n0030M8436J8120n613K4536l7125m7648L6082J39871K3892k0540
20224I5950k6411J01520N3574r6711p8888K9082l7267L6142n6972K2864Q1205
$$ y = [-18577, 80648, 113299, 130399, 130307, 93447, 8084, -46337, 52460, 114156, 56131, 66907, 46667, 17369, -2704, 48769, 19312, -77518, -31093, -10572, -70447, -91905, -96738, -20320, -997, -23250, -99252, -74984, -37865, -8585, 34175, 138857, 217547, 246870, 240832, 124460, 87459, 38310, -25845, -21583, 20039, -36365, -40821, -37852, 37530, 115574, 102987, 151308, 128214, 60081, -16106, -33618, -68642, -57478, -109910, -49402, 26081, 138727, 166251, 86177, 70253, 63989, -60758, -83963, -34221, 23573, 39810, 6904, -107607, -83273, -36641, -34031, -84061, -35625, -17505, -23118, 1418, -35707, -83355, -47273, 92598, 116490, 95950, 69539, 171059, 224633, 127922, 49034, 78116, 40849, 76991, 20019, 42883, 124088]
20213A24088k7215Q023J047K7816N3766l7991q0770J3232L8729l3166l6233q6749
20201c5423r527J40370k4319m2613m1824m3139J9091k5660P9107L2285J2675P120
20189F8143N2483J0304k5820q430K5796Q6279j3124L1151r3624j18370J535r3214
20177g6891o8546M0165Q7524J097J16731J8147R768n917p1917p5875m5967m8968
20165a20649l6724J29544L382J5638J3324J2108J7660o535L9054m6409J4355R9728
20153A34476l9922n3551N5953L5769o1091l6978N0631J3144k1829n0803M2850
20142F8649P1772j3108j91l0866r819l4380l7547j4201k071l6644L1310J6152
20130I056K4184K8377K0247p137j2764j0207Q6364o3709K2635J00594R601M743
$$ y = [124088, 96873, 104896, 105943, 133759, 187525, 149534, 68764, 81996, 120725, 87559, 51326, -35423, -44950, 95420, 71101, 28488, -13336, -56475, -37384, -63044, 16063, 48348, 61023, 68143, 120626, 130930, 105110, 96680, 122476, 208755, 195631, 226782, 133158, 14788, 16323, -76891, -145437, -105272, -17748, -16651, 100080, 118227, 127995, 122078, 50161, -25714, -71681, -120649, -157373, -27829, -24447, -8809, 4515, 16623, 34283, 27748, 66802, 20393, 34748, 134476, 94554, 41003, 96956, 132725, 71634, 34656, 85287, 98431, 76602, 25799, 68649, 140421, 127313, 127122, 96256, 86437, 52057, 14510, 309, -1762, -38406, -7096, 9056, 33240, 61617, 81864, 74727, 61963, 51756, 138120, 74411, 97046, 197640, 207241, 211984]
20118B11984k5545j01844j12806o4083N2913J16887k7375j0917K2038j1765m3251
20107F236O0135J23946K4188j22152l4310o0186p2068N3184R3365J17838j3391
20096A76785k2165r054k0981j7387j07394J063m7386N2000Q2386L5012k9302q7415
20084F162j468O4192L52p9115n3340P2172L835j7696l8017m9985K6263L7796L7761
20071H912m0381l9605M0647J44069l621L5586q509k5234l8890O4003K3576l0604
20059A29949n6968j1011l5979N7631L8766k2232n4188p0938r2464O4978J09349
20048E6893Q6233J6309l2836n2216m526J8392k4615n2712R977k4912p8833m4077
20036a26923L9372J30057k432J9399P7432k3384k83P111L3851n4273j21759M7543
$$ y = [211984, 186439, 84595, -28211, -92294, -39381, 77506, 50131, 39214, 61252, 49487, 6236, 66371, 190317, 214505, 92353, 58043, -2143, -74211, -21027, 72338, 190176, 176785, 154620, 145566, 124585, 107198, -196, 867, -46519, 5481, 87867, 122879, 93577, 6162, 4694, 68886, 69238, -9877, -63217, 8955, 12790, -4906, -42923, -92908, -66645, -28849, 8912, -31469, -71074, -30427, 113642, 110021, 145607, 137098, 111864, 72974, 136977, 160553, 129949, 72981, 61970, 25991, 83622, 122388, 100156, 45968, -24970, -117434, -52456, 56893, 143126, 159435, 126599, 74383, 69857, 88249, 63634, 10922, 20899, -4013, -82846, -126923, -87551, 42506, 40074, 59473, 136905, 113521, 113238, 120349, 154200, 99927, -21832, 25711]
20024B5711j6448R838Q165o165J1045J2254k82K2514n7180p093L3529m4475K5898
20011A7311o1960P8193k2439o497L5056J0644l51O5523m53q060P0761n927m8059
19998A23742j3984j2P3692J6196j15034l2606j15102k2603O3766N0694m5127N137
19986a1241M9922P7856K5976L2191O8221K9345j9161m9899m8933j142L9621J1285
19974B04041p8002r9683j8144l1312K7059K9452n8593J1644L6365k4542J02139
19963A00424O4831M5865o2774j21987R763k255L1984L325j20663k3025M3552K877
19951b8083l217k5775n9032R9319K2308l8150m4492J5731M742J06659O2484O303
19939A18797m7272l4596M0849J5674K674m327K9151k4233j07967J5117m7857l1042
$$ y = [25711, 9263, 19101, 27266, 21101, 32146, 44400, 44118, 66632, 9452, 2359, 35888, -8587, 17311, -44649, 33544, 11105, 4608, 39664, 50308, 49957, 115480, 115027, 106967, 177728, 171801, 123742, 109758, 109746, 183438, 199634, 84600, 51994, -63108, -85711, -21945, 28749, -16378, -11241, 38681, 116537, 142513, 174704, 242925, 272270, 253109, 203210, 154277, 153135, 192756, 204041, 126039, 26356, 8212, -23100, 3959, 33411, -25182, -13538, 22827, -1715, 100424, 165255, 211120, 148346, 26359, 36122, 33867, 65851, 69176, -51487, -74512, -30960, -28083, -31300, -57075, -116107, -16788, 5520, -32630, -77122, -61391, -56649, 50010, 112494, 118797, 71525, 36929, 77778, 93452, 96126, 91799, 120950, 96717, -11250, 3867, -43990, -75032]
19927g5032Q1887J8035M1210J2323K611j01615K7291N7477R657k1888o2174m7365
19915e7583Q157J06818K2467p7835K3578L1122j3046n1285L834L5842N8627k3205
19903F7491R8247o4092J8524p6030j6292K0997P1656O8585j06087q4867K8683
19892B6815R1570j2050J5016k3306r9450l9317J25713N7691R0237r6865k4887
19881A11167M7577K9883j8244j18107K7178K4880K6752m3671Q2672K0620J3830
19870B04537m3063L0898J03373q6476j922j07377r9932K6509Q163k7897N6651
19859F3464J02173k3460k7039k1681M7655P1298n8348o4377N4398N75K0045r4426
19847G0277n9426k4051P5817N583k8517K2071K9683p6973K7718Q8911R0152Q080
$$ y = [-75032, 6855, 24890, 66100, 78423, 81034, -20581, 6710, 64187, 73844, 51956, -10218, -57583, -49426, 57392, 79859, 2024, 25602, 56724, 43678, -7607, -3773, 32069, 90696, 67491, 165738, 101646, 120170, 44140, 27848, 48845, 120501, 189086, 82999, -1868, 26815, 118385, 106335, 121351, 98045, -1405, -40722, 84991, 142682, 232919, 136054, 111167, 158744, 188627, 170383, 52276, 79454, 104334, 131086, 87415, 170087, 190707, 204537, 161474, 192372, 295745, 209269, 207347, 99970, 38, 26547, 34710, 6813, 63464, 165637, 142177, 115138, 93457, 141112, 212410, 154062, 89685, 144083, 144658, 164703, 70277, 10851, -13200, 62617, 68200, 39683, 61754, 91437, 14464, 42182, 131093, 221245, 229325]
19835B29325q1687m4401l5654M9654j9841n6736K728K2926m6867j8347O5186l163
19823F3123N7137j5355J2766k0965o0253l1223m0611P7767M8933r89l8454n7114
19811e238N3468M8488K9856l2954p2859R1678M7179j3678M182p8385M9862M2998
19799A64597J5335j03769m1717K4145r215J4567J0315m7543L6217O8343R6613
19788B27888N5712m775p8284r4728l4245j7604m9479J5743l5242P6260P5243k3868
19776A12621j05015n8005J6265N6729L999O9104l2355o4628k8005R9727Q4103
19765A54540q5811K2149o0508m7627O4064k7773P688M2392q112k540L4397M5003
19753A37862L0405o593j2177J2072J0931j2968L9053M2107n0379m523M0209K3892
$$ y = [229325, 147638, 103237, 67583, 117237, 97396, 40660, 43388, 66314, 19447, 1100, 66286, 63123, 120260, 104905, 117671, 96706, 36453, 5230, -35381, 42386, 91319, 90330, 51876, -5238, 48230, 96718, 126574, 93620, 20761, 112439, 159618, 145940, 150122, 71737, 121599, 164597, 179932, 76163, 34446, 58591, 49376, 63943, 74258, 26715, 62932, 131275, 227888, 283600, 278825, 200541, 105813, 71568, 53964, 4485, 20228, -15014, 61246, 136489, 112621, 7606, -50399, -34134, 22595, 26594, 95698, 63343, -1285, -29290, 70437, 154540, 68729, 90878, 30370, -17257, 46807, 19034, 26722, 69114, 61002, 58462, 92859, 137862, 168267, 161674, 149497, 161569, 172500, 159532, 198585, 240692, 190313, 185790, 225999, 249891]
19741B49891m8631k8206j45856J6931Q4449j7705p0738l1219M6952M9700J5177
19730A20745m1948j1798m0272p0296N6151R1358l97J241o5125j3086J12911M9050
19718A88534k6607n2788l4819O8191P412l5698R678j3448j74N630J28305K398
19706B46614j65509q2285L1326q829m0330L0368j5662l0851J18045O8085N8621
19695B09593M7237J3580j19738n4523J2081L8755j7446q4641L3306J16513j7886
19684A76831n1493p2681p3281k8125M9116Q8729k2103k4758R617L6201L5628k9791
19672I3890m2061j8694L6876K9961j7850J859l4110M9324K2320k1931J26779K8998
19660B55361j26134J549L0240O2417N172n6279o0343P1778J222p1685k6410L2556
$$ y = [249891, 201260, 173054, 27198, 44129, 128578, 110873, 40135, 8916, 55868, 105568, 120745, 78797, 66999, 26727, -43569, 12582, 103940, 103543, 104784, 39659, 26573, 139484, 188534, 161927, 109139, 74320, 142511, 149923, 114225, 123903, 110455, 110281, 115911, 244216, 246614, 81105, -1180, 30146, 21317, -19013, 11355, -4307, -35158, 82887, 150972, 209593, 256830, 270410, 150672, 96149, 108230, 146985, 129539, 44898, 78204, 194717, 176831, 125338, 52657, -20624, -48749, 367, 89096, 66993, 42235, 51852, 88053, 123681, 93890, 51829, 33135, 70011, 99972, 82122, 83981, 49871, 99195, 121515, 99584, 226363, 255361, 129227, 130776, 161016, 223433, 228605, 172326, 111983, 183761, 184983, 113298, 86888, 119444]
19648A19444j08076k6084J27339J33542l8116n9172Q918N5805l939M425P959j10483
19636A11562n1796Q6271J7465j4844O8404o2605j23666j259Q6685L8288p920p5328
19624G1257n318M269l3680N9541P3565O9903n9806l396J9968p3858k263K5320
19612A45502M9104k3938l8777k1063R0164M2006q4433j73721j7499J4898M713
19601a3044K0561l6210r05R0269Q1230J13383K7496j6788o02r5475j21092M4063
19589I2886O689N9798O1341j176k4284L8681O8957j8679K495J489m9767l0750
19577B07680k7306q7720m5834M0142n966l7875L6568L3678R2813K5586j0714n2162
19565A68890p1160j15543M0471n7892m9266k6121J30619J30306O380k7077L5189
$$ y = [119444, 11368, -14716, 112623, 246165, 208049, 148877, 157795, 213600, 209661, 214086, 222045, 111562, 59766, 146037, 163502, 148658, 217062, 154457, 30791, 29532, 116217, 154505, 146585, 71257, 65939, 70208, 36528, 96069, 169634, 239537, 179731, 176335, 196303, 122445, 120182, 145502, 194606, 170668, 131891, 110828, 200992, 242998, 158565, -15156, -32655, -17757, -13044, 7517, -28693, -29598, 60671, 141901, 255284, 282780, 265992, 265390, 169915, 48823, 92886, 99575, 159373, 220714, 219538, 195254, 233935, 302892, 284213, 286708, 288197, 238430, 207680, 180374, 92654, 46820, 86962, 80996, 43121, 79689, 113367, 206180, 231766, 221052, 168890, 97730, -17813, 22658, -35234, -84500, -110621, 19998, 150304, 156684, 129607, 164796]
19554A64796l7464O8227Q4486p4121j22959O0148R2880j03592k6881r227P8248
19543A74541m538p186J4239n578P345N6196L9796m0386j0934l18K4942l0738m1234
19530A76147p2794N951K2919M4607q1351P7639K7026p2226j2996j12728n5444
19519e3250R0837J26541J13446K8904j2721j26275P1064L5607L7587M8617n4033
19508C06324j62498J6261P3835L7025Q704L2559j7391o5523k1725M2165l2568
19497B17168o5979J19907N2772k7367q9962n4637l2885R4339k7128o1888L2910
19486A57250l22k6551j3053J2870j4870P0221Q053m1532k3173N2378n5631L1556
19474A57196J26377m9325q5412p5743J6222O6060K1447N4360K4880Q6406p5863
$$ y = [164796, 127332, 195559, 280045, 205924, 82965, 143113, 235993, 132401, 105520, 96293, 174541, 170003, 162817, 177056, 171478, 178823, 235019, 274815, 234429, 223495, 223177, 248119, 217381, 176147, 103353, 109304, 132223, 176830, 95479, 173118, 200144, 127918, 114922, 2194, -53250, 37587, 164128, 277574, 306478, 293757, 167482, 238546, 274153, 311740, 360357, 306324, 143826, 160087, 233922, 270947, 279651, 312210, 294819, 229296, 207571, 249736, 217168, 151189, 271096, 323868, 296501, 206539, 151902, 119017, 213356, 186228, 124340, 157250, 156928, 130377, 117324, 130194, 115324, 185545, 193598, 152066, 128893, 181271, 125640, 157196, 283573, 234248, 148836, 73093, 89315, 155375, 176822, 231182, 256062, 342468, 266605]
19463B66605j05253j2380K6789M4m1285J7871o1870J1039L3877J0447K9911L7
19451A75832j8593j5523L0669N5246j1752Q671Q510J8739j1078k2308Q548O2126
19439B89087l3204q2396P1701M9964P9567P587q11l2374p0428j01100m5241k9008
19427A03344M5630Q9801O7895J8710m9485n1824R0079M0590k5695k24101j7025
19416H7919M8848j9001p7354O483J04118N1368n1466J5088K8942M9908j9095l3605
19404A92153J8755j7870n1820Q8851m46k2344j05129j34476R5865P3970O1249
19393A98758J5445o0314l544J9541k4302N6662O6609n4600n2635m4104O7572M7114
19381B32202k9285q8369m7865p6178J00604J69689k3499l6063M437n1390q9867
$$ y = [266605, 161352, 148972, 175761, 175805, 134520, 152391, 90521, 101560, 135437, 145884, 175795, 175832, 157239, 141716, 172385, 227631, 215879, 224550, 233060, 251799, 240721, 218413, 226961, 289087, 255883, 173487, 245188, 295152, 374719, 382306, 381495, 349121, 278693, 177593, 132352, 103344, 148974, 238775, 306670, 325380, 275895, 224071, 314150, 354740, 329045, 104944, 87919, 136767, 117766, 40412, 46895, 151013, 202381, 150915, 166003, 194945, 244853, 225758, 192153, 210908, 193038, 141218, 230069, 229623, 207279, 102150, -32326, 63539, 137509, 198758, 214203, 153889, 150345, 169886, 145584, 202246, 268855, 214255, 161620, 117516, 185088, 232202, 202917, 114548, 66683, -9495, 91109, 260798, 237299, 201236, 205673, 154283, 64416]
19370F4416l6249R2738K6822l0082L6389m617n8504m262l8210K4796N6995N6899
19358A87131L7426n4955K8820Q56K1041J4028j25856n8821M5264N637L9380L9720
19346A79671k0952j17615L3958J32186K6011j06522M8934K5843n1654Q6395m3217
19335A93038q3275n5873m1839O4584J49145K04660O5220k3150r8544k9114l689
19324C41163q7817M9015M638J8161k8189K004k3767k3586K3474J5694j33536k9110
19312A28144J07184n122l6019O4017p879m6919m3507l5490O9096M3774L3402R177
19300B79858O556J4108m5817j7649J1138L2181l766P7560n9640p5858L4708J7017
19288B70396j0212o0426o3368k6798N0099p087n0456O1003O4529J6425J3144k713
$$ y = [64416, 28167, 120905, 147727, 117645, 154034, 149417, 90913, 86651, 48441, 73237, 130232, 187131, 224557, 169602, 198422, 199278, 220319, 234347, 108491, 49670, 94934, 100571, 139951, 179671, 158719, 41104, 75062, 207248, 233259, 126737, 175671, 201514, 149860, 236255, 193038, 109763, 53890, 12051, 76635, 225780, 430440, 495660, 472510, 373966, 344852, 341163, 253346, 302361, 306999, 325160, 296971, 298975, 275208, 251622, 275096, 290790, 157254, 128144, 235328, 230206, 194187, 258204, 250325, 203406, 159899, 124409, 193505, 237279, 270681, 279858, 286414, 300522, 254705, 237056, 248194, 280375, 276609, 354169, 294529, 218671, 253379, 270396, 260184, 199758, 136390, 109592, 159691, 152604, 102148, 163151, 227680, 244105, 257249, 254536]
19276B54536P041J8904p290j12225J6758O8032J375l9459j8753J3651o8685k9331
19264A04554R0305O2496n7168l6178q188o6606M7210M338J11715o305j5274j7675
19252B13224j3669M4094L9519n6098l7958j8498N0124k337K864O2923J6157r1478
19240B08867j1766K6615L6637l882p540o8451l3570J10191L0658K4488O256l1603
19228B86900M4159j4880q334k9864p8237o7084q2524O0399k6786l843N1071p4563
19216E6414n105N0196k5887k9846O7779J07081N1861K2129j3044r9639K2829Q9609
19204B94377j7351Q842m2121m8058L4982N8233Q6716P4649J5974r1555r3598R991
19192B91081j1331o647J6397p652j9737K41o1812n03k87q1258K2035R8848J50309
$$ y = [254536, 261577, 280481, 273191, 160966, 177724, 245756, 247131, 207672, 188919, 202570, 133885, 104554, 194859, 257355, 200187, 164009, 155821, 89215, 136425, 140763, 252478, 246173, 230899, 213224, 199555, 243649, 283168, 227070, 189112, 170614, 220738, 218401, 221265, 284188, 300345, 208867, 197101, 223716, 260353, 256471, 248931, 180480, 146910, 257101, 287759, 312247, 318503, 286900, 331059, 316179, 307845, 277981, 199744, 132660, 50136, 110535, 83749, 79906, 130977, 56414, 51309, 101505, 75618, 45772, 113551, 220632, 272493, 294622, 281578, 181939, 204768, 294377, 277026, 285868, 243747, 195689, 230671, 288904, 375620, 450269, 466243, 374688, 281090, 291081, 279750, 273103, 289500, 281848, 262111, 262352, 200540, 200037, 199750, 118492, 140527, 239375, 389684]
19179C89684O2370p6089j42382l1552J57348p9438p686Q333J0375n6647j45514
19168H8802o965L9920J9551m6459M8142l4938O5938J19938M93j7827M8253n7552
19156B67296p5374p6749O9532K4656J7591j67j7509j6133k1819M5532K1385k5178
19144B13063k6994O6979j1524m4705m2728O9354Q2259K3234l0595J7111j02493
19133B12961K7714n9084p9266R0881J19402Q0752j9885M977j7053q9998Q295P8160
19121C57856K1006q6456j9813K4466k0473l801M1909M506K0522M353j2134K3612
19109C55553m2826l6675Q1245R3720N9561j50677l2761M1489j04836r8852n515
19098A59426P2692o8043p431M1855M6386l9233l3193J07817K6541l5170J7312
$$ y = [389684, 452054, 375965, 233583, 202031, 359379, 279941, 272255, 280588, 290963, 234316, 88802, 81837, 121757, 141308, 94849, 142991, 108053, 173991, 293929, 294422, 276595, 324848, 267296, 191922, 115173, 184705, 209361, 226952, 226785, 209276, 193143, 171324, 216856, 238241, 213063, 186069, 253048, 241524, 196819, 154091, 223445, 305704, 328938, 298343, 315454, 212961, 240675, 181591, 102325, 193206, 312608, 393360, 373475, 378452, 361399, 271401, 279696, 357856, 378862, 292406, 272593, 297059, 276586, 272785, 314694, 319200, 339722, 344075, 331941, 355553, 312727, 276052, 357297, 451017, 510578, 359901, 327140, 368629, 263793, 164941, 159426, 232118, 164075, 156644, 198499, 244885, 205652, 172459, 280276, 306817, 271647, 288959]
19087B88959N698M8583L8752O2041R6156l4946j16949j03237k2287K025M0884
19076C05679J1542K7345J7752n98n1822J865q2612O1278N0379K8396p1750k357
19064B95097J4943j1327m823R4664l715j9073n0168J5950K9467m3350o2260J07057
19052C62462K9260p258p956K0500J1336j5203j1466O8073o7187K1156o9271n4599
19040B79847q875M6940R1090R1029n6410o4422O3040j5656q9175q3210l6015L1728
19028B49911J7025M6946K170J9193K787N6542N7540K9711m2123k6843p0863j42227
19016A99769L7715J30488K6727m0019k4225q7884m450k835k0661n764O7108n601
19004B70368J16625L7967m0302K7323n3382J4142j4617k1968M3466J838M4717
$$ y = [288959, 294657, 343240, 381992, 444033, 540189, 505243, 388294, 285057, 262770, 264795, 305679, 317221, 344566, 362318, 361720, 309898, 311763, 229151, 290429, 340808, 369204, 297454, 295097, 310040, 298713, 293890, 388554, 384839, 365766, 315598, 331548, 361015, 317665, 255405, 362462, 391722, 384464, 376508, 397008, 408344, 393141, 381675, 449748, 382561, 403717, 334446, 279847, 270972, 317912, 409002, 500031, 443621, 379199, 442239, 426583, 337408, 254198, 218183, 249911, 266936, 313882, 316052, 335245, 338032, 394574, 452114, 481825, 439702, 412859, 341996, 199769, 237484, 367972, 394699, 354680, 330455, 242571, 238121, 235286, 214625, 208861, 275969, 270368, 386993, 424960, 384658, 411981, 358599, 372741, 358124, 336156, 379622, 381460, 426177]
18993D26177M8758K1515J940j39330m6917m645o3107Q3133O7116J20207M2708
18982E57555k0409l4357j6207o3058l855n1862L940L8101O3853m932R711L04j6925
18969D61859J0907p8774o0901q9134O1581J2836N6791J04414J9298n8239R6809
18958E37447N6876j5786j03284j02523o9622O3128J8975l8061L2726K9708J30950
18947E40534P7688n214l4132N7343J6984q3736o4617p4440n6302l9584L9487L2359
18935D06370l6325J9410O7219n9025J6857L8378O94j5596Q025n6403n8005j43133
18923A88466J4602J25166R8033J26501J3034n4301q7420o8638J23386K2498l1865
18912D69462k5135j15604O2939J55115M1474l5083J3276J2866l3700m2689q9908
$$ y = [426177, 474935, 496450, 498390, 359060, 312143, 307498, 244391, 327524, 394640, 514847, 557555, 537146, 502789, 486582, 423524, 419669, 367807, 371747, 409848, 473701, 468769, 478480, 478784, 461859, 472766, 393992, 333091, 243957, 305538, 318374, 375165, 479579, 498877, 440638, 537447, 594323, 578537, 475253, 372730, 303108, 366236, 385211, 347150, 379876, 409584, 540534, 618222, 613008, 578876, 636219, 653203, 569467, 504850, 430410, 374108, 334524, 374011, 406370, 370045, 389455, 456674, 397649, 414506, 452884, 453578, 437982, 446007, 389604, 331599, 188466, 203068, 328234, 426267, 552768, 565802, 511501, 424081, 355443, 478829, 501327, 469462, 444327, 328723, 391662, 546777, 588251, 553168, 566444, 579310, 545610, 502921, 413013]
18901D13013N0926Q3876r13k1316N926j35851j4929O583n916J05827N8183N906
18889E51315j04690J8748O5581j18283j19884K1931J58977j5832m8011p8486K7258
18878C58624K9342K9772P8205l1144N2015l9027o9490n1398L9467K8694J2913
18867D37973R9575r9434l9472k593Q815P579O2976k1185m8797n221M3690N3156
18855D97062L6523k93n6413m3161l1291P6738O2505n1488O7121J16768p0690o8068
18843E35313l1212k949o6383m800J17797J71758l3825j35157n9576r3627R3822
18832D91161M0637k4780l7450k450J2130P660L3792k5591l875R6103K2110p6896
18820E32551k0591N411k264m5419J6684l8794l3288Q0527P9035J7038k5911k3088
$$ y = [413013, 463939, 547815, 546902, 525586, 531512, 395661, 380732, 387315, 381399, 487226, 545409, 551315, 446625, 465373, 530954, 412671, 292787, 314718, 473695, 457863, 409852, 331366, 358624, 387966, 417738, 495943, 464799, 516814, 477787, 408297, 356899, 396366, 425060, 437973, 537548, 438114, 398642, 396049, 404864, 412443, 475419, 454234, 405437, 400216, 443906, 497062, 533585, 533292, 476879, 433718, 402427, 479165, 541670, 490182, 557303, 674071, 603381, 535313, 504101, 501152, 434769, 429969, 547766, 719524, 685699, 550542, 490966, 397339, 491161, 531798, 507018, 469568, 467118, 479248, 486908, 520700, 495109, 491234, 587337, 609447, 532551, 511960, 517371, 515107, 469688, 486372, 447578, 414290, 494817, 573852, 590890, 564979, 541891]
18808E41891p4846l5650p486J241J2727J33532J0578k0764O8606M353l1874r8630
18796E03678k5722r556L8878J2555J15773j2748j00579j095j1133M795j5370j00850
18784C98626m8726J67650J66206k7677j01904O0522J4447K2798n342Q6564r6574
18773F36590j13448l9442k3026L2735O5388Q5380P3581j8369q1272j1420O1447
18762F68144L0710l589l3097j6020J5593J3541j761N9113M189L6165L0721m7449
18750G56260l3089q6011L0374K3105J0183n5687m7379k1325j2724O0358M6751
18739F70816K8990o7586j7639J9955k0874l0499n4428L6731J10948L7806j28457
18728E85763r0081N6783J59876N6216p6520p9751R5130k5333m1701K1350p7786
$$ y = [541891, 467045, 431395, 423909, 425150, 437877, 571409, 581987, 561223, 629829, 634182, 602308, 503678, 477956, 468400, 507278, 519833, 635606, 622858, 522279, 521184, 510051, 514846, 499476, 398626, 349900, 517550, 683756, 656079, 554175, 614697, 629144, 651942, 646600, 733164, 636590, 523142, 483700, 460674, 493409, 558797, 644177, 717758, 699389, 618117, 606697, 668144, 698854, 695265, 662168, 646148, 661741, 675282, 673521, 732634, 736823, 772988, 803709, 756260, 723171, 637160, 667534, 690639, 700822, 645135, 597756, 576431, 563707, 624065, 670816, 699806, 632220, 614581, 634536, 613662, 583163, 528735, 565466, 676414, 714220, 585763, 495682, 552465, 712341, 768557, 692037, 612286, 707416, 682083, 640382, 661732, 583946]
18717E83946L4765O8057J05225N485q5141Q237L0149L4459Q196j10380K5337k5574
18705F82761Q311J10672K8230m4331l1227l5321J14258J59822K2181l4697J7642
18694I98301o4290m2794q8973r8051j0811k5793k4828j8962k7269j1807J6154
18683F00877k2297M7924N0784N7643q0278k2620N2150k3065K1045j2015L2643
18672G02791N2305Q7131K3327o2753r6890Q996p390J0465J04152O275r7549j0314
18660G20546K1120l4571Q1315L8534O815L8018n561M2770M5444m4112k2465O9482
18648I57335j30275M4310J45493L802p5594K8554l9589k9695k3867M857O3314
18637I48645n4490l7803M513P6888n0458J9404J45786M5956R449l0491K5336q8747
$$ y = [583946, 618711, 686768, 791993, 797478, 712337, 720574, 750723, 785182, 793378, 682998, 708335, 682761, 691072, 801744, 829974, 785643, 754416, 719095, 833353, 993175, 1015356, 980659, 998301, 934011, 891217, 802244, 704193, 693382, 667589, 642761, 623799, 596530, 584723, 600877, 578580, 626504, 677288, 734931, 654653, 632033, 684183, 661118, 682163, 670148, 702791, 755096, 842227, 865554, 802801, 705911, 714907, 707517, 717982, 822134, 828409, 730860, 720546, 741666, 707095, 788410, 826944, 833759, 871777, 866216, 908986, 954430, 910318, 887853, 957335, 827060, 871370, 1016863, 1020665, 945071, 973625, 934036, 904341, 880474, 885331, 948645, 894155, 856352, 860865, 937753, 887295, 906699, 1052485, 1098441, 1107890, 1077399, 1102735, 1013988]
18625A013988l0472r5742j7814N9913Q0009k6916m219P185M8834J10867J521o381
18613A140773p7481M987O1690R4107M7281q7210k7037R0866k4178n6486P359J0041
18601A184712k163p0090n2173j2867K8908O1810K3109R8088L2937r7022l162N1813
18589A243900o5355j4129P6214J332k1729k5519m1787M0212k8327k7526j9439
18578A117847J3029p9542o375K5777M2786k419K5438l239K4018M0611R859m9326
18566A158464j9530K4693m3300j10347R5996J78694J01512j5622j04113n690L0740
18555A291497K5805o7248k0164m9909p850K2916l6939K9274o519q697l4401j2419
18543A125346M9579K4826L6699o4689l479k2345k5823O5900p2944k0083P5815
$$ y = [1013988, 983516, 887774, 869960, 929873, 1009882, 982966, 978747, 985932, 1034766, 1145633, 1147154, 1140773, 1063292, 1068279, 1129969, 1224076, 1271357, 1184147, 1157110, 1247976, 1223798, 1167312, 1174671, 1184712, 1182549, 1112459, 1060286, 1047419, 1076327, 1138137, 1161246, 1259334, 1292271, 1195249, 1192087, 1243900, 1178545, 1164416, 1240630, 1241962, 1220233, 1194714, 1152927, 1193139, 1164812, 1137286, 1117847, 1130876, 1051334, 1044959, 1070736, 1113522, 1111103, 1136541, 1133302, 1157320, 1197931, 1207790, 1158464, 1138934, 1163627, 1120327, 1009980, 1105976, 1284670, 1386182, 1370560, 1266447, 1260757, 1291497, 1317302, 1250054, 1229890, 1179981, 1172131, 1195047, 1158108, 1187382, 1180863, 1172166, 1137765, 1125346, 1174925, 1199751, 1236450, 1171761, 1168282, 1145937, 1120114, 1186014, 1113070, 1092987, 1168802]
18532A168802Q9446N4689P3544o0451j18825J4235N9471m2855j2526N6612M6949
18521A329091j2342K2576O4490Q2135L9850j7767n162O9867l071L3749k0300M1407
18509A624523j41j20529J971P418M1108p3266j20103m0675l8775N0186K0957K0778
18497A373452j1038J2412M9646M0394n1366k7492Q0354n7995K9759K3527o3881
18486A397772K2889N2360J32848N2463M8652m3830m9393N7932M5714L9553M5828
18475A802788r704n2453N72J55549N961k9639K6259j2462O3121M5363k0630k2237
18463A952488N5564L5949n5546q1146j5910L1087O3103j2396l3150n1281O6094
18452A954856K3957n464o4761O6312J1971M5353J0500o2490m6976l0122k7050
$$ y = [1168802, 1258248, 1312937, 1386481, 1326030, 1207205, 1221440, 1280911, 1238056, 1225530, 1282142, 1329091, 1316749, 1339325, 1403815, 1485950, 1525800, 1508033, 1502871, 1572738, 1569667, 1603416, 1583116, 1624523, 1624382, 1503853, 1505824, 1513242, 1554350, 1481084, 1360981, 1320306, 1281531, 1331717, 1352674, 1373452, 1362414, 1374826, 1424472, 1464866, 1413500, 1386008, 1466362, 1408367, 1438126, 1461653, 1397772, 1420661, 1473021, 1605869, 1658332, 1706984, 1663154, 1613761, 1671693, 1717407, 1756960, 1802788, 1793084, 1740631, 1741203, 1896752, 1902713, 1873074, 1899333, 1886871, 1949992, 1995355, 1974725, 1952488, 2008052, 2044001, 1988455, 1907309, 1891399, 1922486, 1985589, 1973193, 1940043, 1888762, 1954856, 1978813, 1973349, 1908588, 1974900, 1986871, 2032224, 2042724, 1980234, 1933258, 1903136, 1876086]
18441A876086j00445p9749N6829J00513k079L2443p7607k940M4367m7075P3414
18430A873757L0691j1368k4762J1233R498L3313L3260J7019R3358R45N424k4368
18418B048000m427j8237J9037Q1626L8771K8904m012m8525o748K8451K4669M0045
18406B227554m2036p7520p4874k5254M6631L2523P9165M8114M8858k0139k2080
18395B220942J3379p5074L6412m1330l2347J6134j7938r0632k0101j8346J2185
18384B003284o31K0101K425J8814R0390l1509j09850L5646O2073j02982p9837
18373A907924R3697O3462o6603k6419K6731N3270P5178j5882J281L9167m9609
18362B102197p9941J5776P9014M9948k50M0691J7870j39293l6196O8091L2347
$$ y = [1876086, 1775641, 1695892, 1752721, 1853234, 1851155, 1883598, 1805991, 1803051, 1847418, 1800343, 1873757, 1904448, 1893080, 1868318, 1879551, 1889049, 1922362, 1955622, 1972641, 2065999, 2066944, 2072368, 2048000, 2043573, 2025336, 2044373, 2125999, 2164770, 2193674, 2189662, 2141137, 2134389, 2162840, 2187509, 2227554, 2185518, 2107998, 2033124, 2007870, 2054501, 2087024, 2166189, 2214303, 2263161, 2243022, 2220942, 2234321, 2159247, 2195659, 2154329, 2121982, 2138116, 2120178, 2029546, 2009445, 1991099, 2003284, 2002653, 2022754, 2025179, 2043993, 2134383, 2102874, 1993024, 2028670, 2090743, 1987761, 1907924, 2001621, 2065083, 1998480, 1972061, 1998792, 2052062, 2127240, 2111358, 2112639, 2151806, 2102197, 2022256, 2038032, 2117046, 2166994, 2166744, 2207435, 2225305, 2086012, 2049816, 2117907, 2150254]
18351B150254J01053N939l4583M1673l4668k5713R603L5900L9424Q8112K4399
18340B401393P8387p6502j149n945p378M3858j0195q6106L8416R0402M9468n0066
18328B464583J4085K1984l5438J20397J99703O7868J7878r8881q2431p007O2285
18317B745026J06297M7084p1914j81098k1072P567M0177J14594K2703j3364N9233
18306B855233j05010j9764R5692M9632Q730N5903J1269N9114Q8817j6612J3165
18295C096169l9780k2452l6644m322l12K114N0629R6255K6592R664J04772L610
18283C286295j0153j15962q8636J4896J07372K9419K3330J4858L008L4325J15968
18272C414720M9571J2464N2658l0020O1779Q9954J0433O2686R8530O1701o166
$$ y = [2150254, 2251307, 2257246, 2222663, 2264336, 2229668, 2203955, 2213558, 2249458, 2288882, 2376994, 2401393, 2479780, 2403278, 2402129, 2396184, 2388806, 2432664, 2422469, 2336363, 2374779, 2465181, 2514649, 2464583, 2478668, 2500652, 2465214, 2585611, 2785314, 2853182, 2871060, 2772179, 2689748, 2682741, 2745026, 2851323, 2898407, 2826493, 2645395, 2624323, 2631890, 2672067, 2786661, 2809364, 2796000, 2855233, 2750223, 2730459, 2826151, 2875783, 2884513, 2940416, 2951685, 3010799, 3099616, 3083004, 3096169, 3056389, 3033937, 2997293, 2992971, 2992659, 2994773, 3045402, 3141657, 3168249, 3177913, 3282685, 3286295, 3276142, 3160180, 3071544, 3086440, 3193812, 3223231, 3246561, 3261419, 3264427, 3298752, 3414720, 3464291, 3476755, 3529413, 3499393, 3561172, 3651126, 3661559, 3724245, 3822775, 3884476, 3878310]
18261C878310k5488o2458R4353L4932p0501Q8031O5780P1087O8484J24048K5257
18250D291835l4577Q2581L6122j4368J8508K3099K2744R242M9039o1306m0079
18239D382840O6544L3038Q278O2534l1136l5357O7766P1951M4657J24396l7506
18228D758005j48500R125J04892K1273K4742N9301k301n1050j03169N0367j3952
18217D708733P405Q7631O5197O805j9987m1356l6394o494q885K1186P754K3900
18205D815495N9144p026M3975P1599N6697p637N1582L1452j8007R547J366k1113
18193E087074k8040o5351m813P7544N6939O8657n9549j7986o049k8193P504N2733
18181E140470L2910Q3242J36637L9433M684O8728P213J01654k419j413K3580l0107
$$ y = [3878310, 3852822, 3790364, 3884717, 3919649, 3849148, 3937179, 4002959, 4074046, 4142530, 4266578, 4291835, 4257258, 4339839, 4375961, 4361593, 4380101, 4403200, 4425944, 4435186, 4484225, 4422919, 4382840, 4449384, 4482422, 4490700, 4553234, 4522098, 4486741, 4554507, 4626458, 4671115, 4795511, 4758005, 4609505, 4618630, 4723522, 4744795, 4769537, 4828838, 4826537, 4775487, 4672318, 4722685, 4708733, 4716138, 4803769, 4868966, 4875771, 4855784, 4814428, 4778034, 4771540, 4762655, 4783841, 4791595, 4815495, 4874639, 4867613, 4911588, 4983187, 5039884, 5032247, 5083829, 5115281, 5097274, 5106821, 5108187, 5087074, 5059034, 4993683, 4988870, 5066414, 5123353, 5192010, 5132461, 5114475, 5108426, 5080233, 5087737, 5140470, 5173380, 5256622, 5393259, 5432692, 5437376, 5506104, 5513317, 5614971, 5612552, 5611139, 5634719, 5604612]
18169E604612j18100l9256N5531J12396R5006O6082Q0773O5291n6123P134J00729
18158E974075P7184J26343J354J9039K4660N0986P5016j3106M9827L4680M0553
18147F460611Q7024P9719P0988Q5843k4586L8249m886l0471N2306P571J27068
18136F949436L3575K468k7921n3802L8913N3628O9647K0446J09192J44706J10190
18125G450478K6820k4998R3154Q6454O9900M8968J31376J43465O6664P7109P6688
18114H246078m1611J04489J58071L0085J07322K03901R0551J3597R9436K20247
18104I232166J27987J88154J77532J44460O5368P8835K10718J29247Q4735Q7290
18094A0526492J97332J70856K57119J53541N8912K03437J75124R3164P5425N8542
$$ y = [5604612, 5486512, 5447256, 5502787, 5615183, 5710189, 5776271, 5857044, 5922335, 5866212, 5873346, 5974075, 6051259, 6177602, 6178956, 6197995, 6222655, 6273641, 6348657, 6335551, 6385378, 6420058, 6460611, 6547635, 6627354, 6698342, 6784185, 6759599, 6797848, 6792962, 6762491, 6814797, 6822368, 6949436, 6983011, 6985479, 6957558, 6903756, 6942669, 6996297, 7065944, 7086390, 7195582, 7340288, 7450478, 7477298, 7452300, 7545454, 7631908, 7701808, 7750776, 7882152, 8025617, 8092281, 8169390, 8246078, 8204467, 8308956, 8467027, 8497112, 8604434, 8808335, 8898886, 8912483, 9011919, 9232166, 9360153, 9548307, 9725839, 9870299, 9935667, 10014502, 10225220, 10354467, 10439202, 10526492, 10723824, 10894680, 11151799, 11305340, 11364252, 11567689, 11742813, 11835977, 11911402, 11969944]
18084A1969944R3644L2606J31081J09129J32257J08332K28243J76598J36517J66714
18074A3285065J87819J69716K37771J95361K8720J41341J62979K14364K47071
18065A4870207K70699J59374J32414K37703K68582K99857K49092J69042K35795
18056A6892765K89468M13112L25284L92307N32421L74618L31212L64663L35232
18047B0251082L62537M94595O04295O03826N06160N09366N67799O45290O57862
18038B5202812P39284P13865Q40532R35127R63555R88561J123181J283723J444390
18029C4235030J509108J733167J926844K240751K520403K824540L008654L228018
18021E3226515L682805L914218L676258L354590K715553J840691Q72634j37504
$$ y = [11969944, 12063588, 12096194, 12227275, 12336404, 12468661, 12576993, 12805236, 12981834, 13118351, 13285065, 13472884, 13642600, 13880371, 14075732, 14104452, 14245793, 14408772, 14623136, 14870207, 15140906, 15300280, 15432694, 15670397, 15938979, 16238836, 16487928, 16656970, 16892765, 17182233, 17595345, 17920629, 18312936, 18845357, 19219975, 19551187, 19915850, 20251082, 20613619, 21108214, 21712509, 22316335, 22822495, 23331861, 23899660, 24544950, 25202812, 25942096, 26655961, 27496493, 28431620, 29395175, 30383736, 31506917, 32790640, 34235030, 35744138, 37477305, 39404149, 41644900, 44165303, 46989843, 49998497, 53226515, 56909320, 60823538, 64499796, 67854386, 70569939, 72410630, 73283264, 73145760]
18013G3145760r31282j647655k003617k242654k286053k204594j897796j546181
18005E8385928j349577j005562o95053l94250k8061J45804L33691M96176O82558
17996E6571654Q81983J056187J215809J348315J402321J657457J785278J927329
17988F7846333K210813K404583K741624K931907L199847L560963L925422M229395
17980I3050887M744397N500688O044056O717100P556046Q463275R243991J0329145
17972A51649585J1236140J1813816J2182169J2028732J1352081R869414Q167273
17965B28299210O561193M957448L626551K894865K637588K847938L363057M165389
17957B59353239N099648N914507O560365O825110O891279O434396N414489M061318
$$ y = [73145760, 72214478, 70566823, 68563206, 66320552, 64034499, 61829905, 59932109, 58385928, 57036351, 56030789, 55335736, 54941486, 54913425, 55059229, 55392920, 55889096, 56571654, 57453637, 58509824, 59725633, 61073948, 62476269, 64133726, 65919004, 67846333, 70057146, 72461729, 75203353, 78135260, 81335107, 84896070, 88821492, 93050887, 97795284, 103295972, 109340028, 116057128, 123613174, 132076449, 141320440, 151649585, 162885725, 174699541, 186881710, 198910442, 210262523, 220131937, 228299210, 234860403, 239817851, 243444402, 246339267, 248976855, 251824793, 255187850, 259353239, 264452887, 270367394, 276927759, 283752869, 290644148, 297078544, 302493033, 306554351]
17949C06554351K244708J40434k051552m270583o286323q169977r650972j0836971
17941B67673115j1689744j1992839j2031132j1846081j1501740j0911901j0289759
17934A87409919r684095q935064q113384p348930o387992n587875m791177l975095
17926A32586307l090456k178654j259303m89753K43281P28285R12839P58083J31022
17917A28341651r05704k138244l416454m663438n509804o195775o406263o480924
17909I2625045o370931n841375n498391m990579m532315m182358l744539l318475
17901E4146082k983780k669296k405139k187490j955440j798994j678922j586825
17893C6880196j407371j244001j227619j166331j121988j155269r12438q89206
$$ y = [306554351, 308799059, 308939493, 306887941, 302617358, 296331035, 288161058, 278510086, 267673115, 255983371, 243990532, 231959400, 220113319, 208611579, 197699678, 187409919, 177725824, 168790760, 160677376, 153328446, 146940454, 141352579, 136561402, 132586307, 129495851, 127317197, 126057894, 125568141, 125811422, 126539707, 127452546, 128210629, 128341651, 127435947, 125297703, 121881249, 117217811, 111708007, 105512232, 99105969, 92625045, 86254114, 80412739, 74914348, 69923769, 65391454, 61209096, 57464557, 54146082, 51162302, 48493006, 46087867, 43900377, 41944937, 40145943, 38467021, 36880196, 35472825, 34228824, 33001205, 31834874, 30712886, 29557617, 28645179, 27755973]
17885B7755973r64978q79471p73834p06585o14052n58134p71992o69490n00622
17876B1316815n41462n43931m63613m54481l74905l60258m37400l49819l22756
17867A7468190k90565k87232k80931k37928k80932k95064k44569k15851j94228
17858A5140890k56394k60473j24037j19790j23643j49805j59243j81223j82019
17849A3584263j01528j17294j26899j01764j77566k23733k07938j17689p8208
17840A2331644j69899j10790m4642p1084m8890n9974j12983o6020l3296q3771
17830A1530295k5021J5226J8652L279j23048Q937P9100r6864p2400p4778r954
17819A1253424R3675j434m8376Q4479R3880O3255J0884N2667J02530n3923P257
$$ y = [27755973, 26790995, 25911524, 25137690, 24431105, 23817053, 23258919, 22486927, 21817437, 21316815, 20775353, 20231422, 19767809, 19313328, 18938423, 18578165, 18140765, 17790946, 17468190, 17177625, 16890393, 16609462, 16371534, 16090602, 15795538, 15550969, 15335118, 15140890, 14884496, 14624023, 14499986, 14380196, 14256553, 14106748, 13947505, 13766282, 13584263, 13482735, 13365441, 13238542, 13136778, 12959212, 12735479, 12527541, 12409852, 12331644, 12161745, 12050955, 12006313, 11935229, 11886339, 11826365, 11713382, 11647362, 11614066, 11530295, 11505274, 11520500, 11539152, 11542431, 11419383, 11428320, 11507420, 11410556, 11338156, 11263378, 11253424, 11347099, 11345665, 11297289, 11381768, 11475648, 11538903, 11549787, 11602454, 11704984, 11651061, 11658318]
17808A1658318O1605J02552J85719P1268j3864O8347N7074J2494Q2029J51741
17798A2437283J07381J39272J66948J47728P0679J35522J84813J59241K35718
17789A3784585K41084J27102M6916J78010K79862L27148K66499L08562L08834
17780A5868602K78690L25022L10641L50227L80250M52927N12239N38528N55143
17771A9572269N08945N77487M79644O65668O35973O65487P85841Q74311J001629
17762B5767254J129292J076853J220638J300795J442433J569032J711040J909537
17754C7126874K090141K443252K771466L001735L460114L925794M364205M909600
17746F4093181N372229N843341O016604N936375N628116N135588M424581L873816
$$ y = [11658318, 11719923, 11822475, 12008194, 12079462, 12065598, 12133945, 12191019, 12203513, 12285542, 12437283, 12544664, 12683936, 12850884, 12998612, 13069291, 13204813, 13389626, 13548867, 13784585, 14025669, 14152771, 14199687, 14377697, 14657559, 14984707, 15251206, 15559768, 15868602, 16147292, 16472314, 16782955, 17133182, 17513432, 17966359, 18478598, 19017126, 19572269, 20081214, 20658701, 21138345, 21804013, 22439986, 23105473, 23891314, 24765625, 25767254, 26896546, 27973399, 29194037, 30494832, 31937265, 33506297, 35217337, 37126874, 39217015, 41660267, 44431733, 47433468, 50893582, 54819376, 59183581, 64093181, 69465410, 75308751, 81325355, 87261730, 92889846, 98025434, 102450015, 106323831]
17738A06323831L365082L339919L678238M067549M541605M989067N294542N180262
17730A40780095M608007L590386K313421P12017r03919k293419l454275m019769
17722A41332544m032547l809740l374667k808248k686064k543214k797930l416338
17714A15863796m340289n177086n915731o310634o563949o622842o424436o041649
17706F8467180n447966m963412m432969l928188l551791l193987k828217k504350
17698C7616300k163371j923458j664854j497660j373322j205501j116825j026502
17690B5644807q95750q82086q38920q32611o48250n64935o61511o09130n23420
17681A9188194m82130m06470k55839k98559l06102k66200k12635j57410k84764
$$ y = [106323831, 109688913, 113028832, 116707070, 120774619, 125316224, 130305291, 135599833, 140780095, 145388102, 148978488, 151291909, 152003926, 151100007, 148806588, 145352313, 141332544, 137299997, 133490257, 130115590, 127307342, 124621278, 122078064, 119280134, 115863796, 111523507, 106346421, 100430690, 94120056, 87556107, 80933265, 74508829, 68467180, 63019214, 58055802, 53622833, 49694645, 46142854, 42948867, 40120650, 37616300, 35452929, 33529471, 31864617, 30366957, 28993635, 27788134, 26671309, 25644807, 24749057, 23866971, 23028051, 22195440, 21547190, 20982255, 20320744, 19711614, 19188194, 18706064, 18299594, 18043755, 17745196, 17439094, 17172894, 16960259, 16802849, 16518085]
17672A6518085k16683j61585j39620o0563j25961q2842J15934K49487M4915L327
17662A6144494P2228J54546P9936J65988J78517K65388K77933K75760L07701L75935
17652A8298426M04369M61394M66539M25747N56867P10211P85085R07834Q27581
17643B3844053R44978J025630J108060J207162J391015J450205J748026J978447
17635C4697576K192102K522786K917307L338975L687716M194310M593406M946759
17627F3090937N067119N042576M864315M506736M070042L609527L260307K662902
17619I6174461K087270J510274R26455K07705m32614r39419j438474j798964k031504
17610I4265190k303262k551576k940837l458279l798677m119835m347345m373207
$$ y = [16518085, 16301402, 16139817, 16000197, 15939634, 15813673, 15730831, 15846765, 16096252, 16141167, 16144494, 16216722, 16371268, 16451204, 16617192, 16795709, 17061097, 17339030, 17614790, 17922491, 18298426, 18702795, 19164189, 19630728, 20056475, 20613342, 21323553, 22108638, 23016472, 23844053, 24789031, 25814661, 26922721, 28129883, 29520898, 30971103, 32719129, 34697576, 36889678, 39412464, 42329771, 45668746, 49356462, 53550772, 58144178, 63090937, 68158056, 73200632, 78064947, 82571683, 86641725, 90251252, 93511559, 96174461, 98261731, 99772005, 100698460, 100906165, 100473551, 99534132, 98095658, 96296694, 94265190, 91961928, 89410352, 86469515, 83011236, 79212559, 75092724, 70745379, 66372172]
17602F6372172m290213m152839l701634l205547k802696k443004k133485j801121
17594D1841633j310892j043092q53062n15390j44127J05621K73767N11952R50235
17585C9816645J354047J677869J927863K434333K782160L152179L463840L493229
17577F0102165L382691L104279K878874K449622K115237J739691J423362J005547
17569G8201468N68794J31245j07283m76425r87255j437552j817156k098775k340910
17560F9636151k587802k903580l177028l449525l747646l702025l773975l640798
17552D2653772l511497l185082k717314k553038k382033k070428j803900j718695
17544B2711785j524546j208387j082561j045339j050088j074754q70420o44752
$$ y = [66372172, 62081959, 57929120, 54227486, 51021939, 48219243, 45776239, 43642754, 41841633, 40530741, 39487649, 38634587, 38119197, 37975070, 38080691, 38354458, 38866410, 39816645, 41170692, 42848561, 44776424, 47210757, 49992917, 53145096, 56608936, 60102165, 63484856, 66589135, 69468009, 71917631, 74032868, 75772559, 77195921, 78201468, 78770262, 78901507, 78794224, 78317799, 77330544, 75892992, 74075836, 71977061, 69636151, 67048349, 64144769, 60967741, 57518216, 53770570, 50068545, 46294570, 42653772, 39142275, 35957193, 33239879, 30686841, 28304808, 26234380, 24430480, 22711785, 21187239, 19978852, 18896291, 17850952, 16800864, 15726110, 14855690, 14210938]
17536A4210938o47432o45424m71335o06055n11749m22699m41467l82272l90615
17527I691890l80639l05423k88370l46213k42565j79369k03029k33023j73008
17518G340251k58377j58893n0288j56180j44636j41050j35162q7452j03833j29144
17508E975236p9094j00352q945k1185j03210j41531p5427j08851j30674j44993
17498E060974m7746Q6486m1973k14908j45940p2333K11j08171n1238J4152j51690
17487D327824r1003J1186l3662l9856n7308q8166p357n2773P013L1852p3626q5379
17475C848745j4344n2019o2381j2459l2352n9372M4596O2812L1395j2812o1491
17464C680318o6713J6927J6655r593M7942J9240K2081k3304N4358m0138q5146
$$ y = [14210938, 13563506, 12918082, 12446747, 11840692, 11328943, 10906244, 10464777, 10082505, 9691890, 9311251, 9005828, 8717458, 8371245, 8128680, 7949311, 7746282, 7513259, 7340251, 7081874, 6922981, 6872693, 6716513, 6571877, 6430827, 6295665, 6208213, 6104380, 5975236, 5896142, 5795790, 5786845, 5765660, 5662450, 5520919, 5445492, 5336641, 5205967, 5060974, 5013228, 5099714, 5057741, 4842833, 4696893, 4624560, 4624771, 4516600, 4465362, 4479514, 4327824, 4236821, 4248007, 4214345, 4174489, 4117181, 4029015, 4021658, 3968885, 3975898, 4007750, 3934124, 3848745, 3834401, 3782382, 3720001, 3707542, 3675190, 3615818, 3660414, 3723226, 3754621, 3741809, 3680318, 3613605, 3630532, 3647187, 3637594, 3685536, 3704776, 3726857, 3703553, 3757911, 3717773, 3632627]
17453C632627m9449K8238J1925j54781o8646k1850l5986J5340O5111j1769k9505
17442C381255q7176m2458r8217q0962l9505O6021n6218p661L7844L0551j1145
17431C092329q2865j5531L6760J17727L3869m2620K1124j18724n1148Q7215K4356
17420C102492O3207M7161j7737n049l4789o47m9856L668O1180P2720K8375k9376
17408C241349R9713r251L2427O0821K3795m8588N7976K4107j7408M6095K8517
17397C539553n5517k7599L8565n5242j10526N5942J50048k4910m6262n3255L516
17386C414313K4617R7032N3687N6338P159M6610M9653n2283R0047J00282M9243
17375C936698j4547J7767l9140J37819J20546k9627o5597O5916O2288M4980K4167
$$ y = [3632627, 3583178, 3611416, 3623341, 3468560, 3399914, 3378064, 3342078, 3357418, 3422529, 3410760, 3381255, 3294079, 3251621, 3153404, 3072442, 3032937, 3098958, 3042740, 3035079, 3072923, 3103474, 3092329, 3009464, 2993933, 3030693, 3148420, 3182289, 3139669, 3160793, 3042069, 2990921, 3078136, 3102492, 3165699, 3212860, 3195123, 3190074, 3155285, 3154638, 3104782, 3108450, 3169630, 3242350, 3270725, 3241349, 3341062, 3331811, 3364238, 3425059, 3448854, 3400266, 3458242, 3482349, 3464941, 3511036, 3539553, 3484036, 3456437, 3495002, 3439760, 3329234, 3385176, 3535224, 3510314, 3464052, 3410797, 3414313, 3438930, 3535962, 3589649, 3645987, 3653146, 3699756, 3749409, 3697126, 3787173, 3887455, 3936698, 3922151, 3939918, 3900778, 4038597, 4159143, 4129516, 4063919, 4129835, 4192123, 4237103, 4261270]
17364D261270l1002j6803l1303P5392J63201J73262J05919K4441k4070M1832M6227
17353D788366K13993J03682J6360J33781J20788O5392K9391q6005J5233R5430
17343E496411M8481J75630O097K2436R5660J92590J41836K1279J61493J53795
17333F515708O9241J25240J26144K2443O7824J25432J60924K21667J37492J74980
17323G747095K24510J67060K65133J97954K33330K76245L15678K15459J65800
17314I808264K21761L93456L94285L72648L93274L35176L51776M68026N06413
17305A3245079N52373N38972O25039O62820O06730O29080P55089Q75940Q90035
17296A9381157J021828J078056J314764J461337J452663J652056J815110K226778
$$ y = [4261270, 4230268, 4213465, 4182162, 4257554, 4420755, 4594017, 4699936, 4724377, 4700307, 4742139, 4788366, 5002359, 5106041, 5122401, 5256182, 5376970, 5442362, 5471753, 5385748, 5400981, 5496411, 5544892, 5720522, 5726619, 5749055, 5844715, 6037305, 6179141, 6200420, 6361913, 6515708, 6584949, 6710189, 6836333, 6858776, 6926600, 7052032, 7212956, 7434623, 7572115, 7747095, 7971605, 8138665, 8403798, 8601752, 8835082, 9111327, 9427005, 9642464, 9808264, 10030025, 10423481, 10817766, 11190414, 11583688, 11918864, 12270640, 12738666, 13245079, 13797452, 14336424, 14961463, 15624283, 16231013, 16860093, 17615182, 18491122, 19381157, 20402985, 21481041, 22795805, 24257142, 25709805, 27361861, 29176971, 31403749]
17288C1403749K550824K914855L269444L617269L880101M220673M428098M290263
17280F0575276M136222L796238L254009K719564K349079J907027J511656R28029
17272H1177100M98902J64240j6375J6203J1616J4089p4614k26095l77937o20056
17262H0567073q73169j249709j709618k114251k646145k993917l413810l707702
17254F1858752l739141l601591l335878l018497k668023k305595k002906j633614
17246C9553507j214573r70519o64374m56507j23565J72965M20803P47195J009608
17237C8474540J372835J781015K176261K588475K923256L159688L415422L189994
17229E9081486K939146K786752K315851J766776J419074J040505N90872K41828
$$ y = [31403749, 33954573, 36869428, 40138872, 43756141, 47636242, 51856915, 56285013, 60575276, 64711498, 68507736, 71761745, 74481309, 76830388, 78737415, 80249071, 81177100, 81676002, 81840242, 81823867, 81840070, 81851686, 81865775, 81791161, 81565066, 81187129, 80567073, 79693904, 78444195, 76734577, 74620326, 71974181, 68980264, 65566454, 61858752, 58119611, 54518020, 51182142, 48163645, 45495622, 43190027, 41187121, 39553507, 38338934, 37368415, 36704041, 36247534, 36123969, 36296934, 36717737, 37464932, 38474540, 39847375, 41628390, 43804651, 46393126, 49316382, 52476070, 55891492, 59081486, 62020632, 64807384, 67123235, 68890011, 70309085, 71349590, 71940462, 72182290]
17221G2182290M7594j48282l44638k98246k25435k49975j42203k89232o71426
17212F9860447j044639j391586j573573k014050k389968k844451l259738l643702
17204E1698740l730937l660999l529952l393092l102145k941076k682703k316473
17196B6341363k017905j887099j628533j341489j249086j206303j134969j006579
17188A4869400r25586q31948p19066o06916o19329n79357n25698m54872m42336
17179I164292m55643l18688l91225l54455k69637k17714l47608l31808l31898
17170F145616k51344k27574k55773j42136j10788j50696p9382k17725j09710p4274
17160D526214o0384j42855j04329k43838k35198l2336m6125n2005j01719p0343
$$ y = [72182290, 72229884, 72081602, 71736964, 71438718, 71213283, 70963308, 70821105, 70531873, 69860447, 68815808, 67424222, 65850649, 63836599, 61446631, 58602180, 55342442, 51698740, 47967803, 44306804, 40776852, 37383760, 34281615, 31340539, 28657836, 26341363, 24323458, 22436359, 20807826, 19466337, 18217251, 17010948, 15875979, 14869400, 13943814, 13111866, 12392800, 11785884, 11166555, 10587198, 10061500, 9606628, 9164292, 8708649, 8389961, 7998736, 7644281, 7374644, 7156930, 6809322, 6477514, 6145616, 5894272, 5666698, 5410925, 5268789, 5158001, 5007305, 4927923, 4710198, 4600488, 4526214, 4465830, 4322975, 4218646, 3974808, 3739610, 3707274, 3661149, 3609144, 3507425, 3437082]
17150C437082j12967q3823q9360P6794m3265j61161j01569j19876o0265l5341
17140B706249j6217k4598j55556r1499j2601j1072q1494m544p4087m4671l9750
17129B150160J0147n9951l3089q4231J40366N4878q5227n2679n769n8793j07395
17118A868417j16424o607K1934Q0127k6167j10155m6322j62K9232K4770O770o6651
17106A658762K051M1195r76O9985q9847n2978Q5022K5038q4012j1807J8014N6793
17094A717240P4516O4080k4928r2116N6477m2167k8073J3367p1885L5268J55362
17083A857141Q3889r2740p4846m0541K4j53101o0899M5864N0833O648K9419l0639
17071A621052k4144J044r1256n3943N2110O0956K615q8799j28108o7058n9416
$$ y = [3437082, 3324115, 3240292, 3150932, 3227726, 3184461, 3023300, 2921731, 2801855, 2741590, 2706249, 2690032, 2665434, 2509878, 2418379, 2405778, 2394706, 2313212, 2308668, 2234581, 2189910, 2150160, 2160307, 2100356, 2067267, 1983036, 2123402, 2178280, 2093053, 2040374, 2034605, 1975812, 1868417, 1751993, 1745386, 1767320, 1847447, 1821280, 1711125, 1664803, 1664641, 1693873, 1718643, 1725413, 1658762, 1660813, 1702008, 1701032, 1771017, 1681170, 1628192, 1713214, 1738252, 1654240, 1642433, 1660447, 1717240, 1791756, 1855836, 1830908, 1738792, 1795269, 1753102, 1725029, 1738396, 1666511, 1701779, 1857141, 1941030, 1848290, 1773444, 1732903, 1732927, 1579826, 1518927, 1564791, 1615624, 1622272, 1651691, 1621052, 1596908, 1597952, 1506696, 1452753, 1504863, 1565819, 1568434, 1479635, 1351527, 1284469, 1225053]
17060A225053n0462M2817K1735j7831j35404K7537J23455k4984n4773o691K2008
17049A172460l6674L6588o0302k4506O3214K3147N2650N9729k9875P3278M359
17038A334068m8572o2560N2170P9862J41014q6140j2167m4154j02368l4922N615
17027A221846n4889o5575l7844k9555O7360R6390q280m9816r7934j06457K4321
17016I59567K8134k7819n4240q7960k9016L615M9494m3625m0906m1101n4863N196
17004F66476o207L7397J78j5355L5953O6032n5943n447q829J732N3586j697j03994
16991F63882K588M43p1666j60394l5150J21502M4102p660m126O3044k5004j7691
16979E73870j3995n7998J6958J2772N4610l503j2610o4710R8154j6482p7284m430
$$ y = [1225053, 1174591, 1217408, 1239143, 1221312, 1085908, 1113445, 1236900, 1211916, 1157143, 1150452, 1172460, 1135786, 1172374, 1112072, 1087566, 1150780, 1173927, 1226577, 1286306, 1256431, 1329709, 1334068, 1285496, 1222936, 1275106, 1354968, 1495982, 1409842, 1397675, 1353521, 1251153, 1216231, 1221846, 1166957, 1101382, 1063538, 1033983, 1101343, 1197733, 1189453, 1139637, 1041703, 935246, 959567, 987701, 959882, 905642, 817682, 788666, 792281, 841775, 798150, 757244, 716143, 661280, 666476, 660269, 697666, 697844, 682489, 718442, 784474, 728531, 723084, 714255, 715987, 769573, 767876, 663882, 666470, 666913, 595247, 434853, 399703, 521205, 565307, 557647, 553521, 616565, 591561, 573870, 559875, 501877, 518835, 531607, 586217, 582714, 570104, 505394, 603548, 587066, 509782, 505352]
16967E05352K7852O947J4638O671k780P5831L4492k05157q7439k7814l564P3826
16955D18855p5255l2677N0823l6114m5581l8784Q9855P3794j34141O9311J5182
16944C55268j09593m4191L7790j0939M9218L32n9298n779L3639n1346J5062K6469
16932B36632j1827n749J4827R8067P1268r0332q8011j55475l4318J40676k1784
16921A53974N2446Q5331Q6580m345n5179L4881J0943k2814m5504q490o663O704
16909B87864K7195P4071j1293p3991m5542k5315k1217N9486j2979r221j03658
16898A45400n9750L3929L6646R67N0136r15K545N3551J9344j15715R3519J0190
16886B69847K7241j7880M5265j6871n6414j611L2623N4728n5673n6763O7411j2831
$$ y = [505352, 533204, 540151, 554789, 561460, 558680, 634511, 669003, 463846, 376407, 348593, 345029, 418855, 343600, 310923, 361746, 325632, 280051, 241267, 331122, 404916, 270775, 340086, 355268, 245675, 201484, 239274, 228335, 277553, 277885, 218587, 212808, 246447, 195101, 210163, 236632, 224805, 219056, 233883, 331950, 403218, 312886, 224875, 69400, 35082, 175758, 153974, 206420, 291751, 378331, 373986, 318807, 353688, 364631, 341817, 296313, 287823, 281160, 287864, 315059, 389130, 377837, 303846, 258304, 232989, 211772, 271258, 258279, 249058, 145400, 85650, 119579, 156225, 157192, 207328, 206413, 208958, 262509, 281853, 166138, 259657, 269847, 297088, 279208, 324473, 307602, 251188, 249577, 282200, 336928, 281255, 224492, 291903, 279072]
16874B79072l3623N4744J6165m7367j0911j170m3054L1736R003j15718L6643Q2358
16862B57878p849j01185l0948P6138j7929Q7339L3068n5150k5136j21749q6245
16851H232j9266K4164Q104O858n09N3517N0694O8813n5349n339m6Q419o322K4028
16837A65998j4888n6336m4322j4895R9028Q1277M7136N504J6554J710o9764k9874
16825A87128L9215K3901n6734n1074j950r074M1280o1641k1632K0949K1683K4202
16813A56253k2869l0404K7948j8500L1298R5484k0511J4209O1596R470K6765P0483
16801D01222q312P213j1909j4225L0863j22787r2327q0509m0380j0633P1333n544
16789A24005Q3258J8367O580j186M9164k2189l2405R6284O4408k4824O438J12327
$$ y = [279072, 245449, 300193, 316358, 268991, 258080, 256910, 213856, 245592, 254595, 138877, 175520, 257878, 250029, 148844, 117896, 194034, 176105, 263444, 296512, 241362, 216226, 94477, 8232, -11034, 13130, 21234, 28092, 27583, 81100, 131794, 200607, 145258, 139919, 139873, 148292, 141970, 165998, 151110, 94774, 50452, 35557, 134585, 215862, 262998, 268502, 285056, 286766, 217002, 187128, 226343, 250244, 193510, 142436, 140486, 131412, 172692, 111051, 89419, 110368, 132051, 156253, 133384, 102980, 130928, 112428, 143726, 239210, 218699, 232908, 294504, 303974, 330739, 401222, 392910, 400123, 388214, 373989, 404852, 282065, 189738, 109229, 68849, 58216, 129549, 124005, 207263, 225630, 232210, 231024, 280188, 257999, 225594, 321878, 386286, 361462, 367900, 480227]
16777D80227j1646k482o1200j2127O9607R960O8955r0754j04423l5961L773K2144
16765C36073k363M5511m1393L298M4756M1009p6530o624k299m3352l2174l9856
16753B26056n9353m6971j2741N4403r100l683N5809J7872P380j48361O149p194
16741H0266J43634R4700j3487p4757m264P2577j7330q0587N7811O1803k3722o8085
16729B28559p911k932J46228O0156O6734m5947K6204L7814M2323k0172j44431
16718C86625p9266R0009q050R772N0668k1990l326M4230n9495r58q097j11725
16706B88397n5264k7338P444n1873J1340J20003Q7508o0455Q3080J16038j68492
16695C50388q4714M4290p7984j5791N7688j4383p2933l7562N595L1783k7060q1973
$$ y = [480227, 468581, 466099, 404899, 392772, 462379, 472339, 541294, 450540, 346117, 310156, 313929, 336073, 333710, 379221, 337828, 341126, 385882, 426891, 350361, 343737, 341438, 298086, 265912, 226056, 166703, 119732, 106991, 161394, 152294, 148611, 204420, 222292, 229672, 81311, 87460, 80266, 223900, 318600, 305113, 230356, 226092, 298669, 281339, 200752, 258563, 320366, 296644, 228559, 220648, 217716, 363944, 424100, 490834, 444887, 471091, 508905, 551228, 531056, 386625, 307359, 397368, 389318, 399090, 449758, 427768, 424442, 468672, 409177, 408219, 400122, 288397, 233133, 205795, 213239, 161366, 172706, 292709, 380217, 319762, 402842, 518880, 350388, 265674, 309964, 231980, 216189, 273877, 259494, 186561, 148999, 154594, 186377, 159317, 77344]
16683G7344r6433o9402O2419N283J9973P0064J8403P417o1225o4802P4922J5341
16671E9304K2721j10444j16467p710J2922O5985P0860N4759P5814J2198k9592
16660A10350p8371r6442j36291K2319Q7814O3335J04539p4649m3833L6474j5484
16649b0239m3050O4746J17127r774J1225N858p3466k6457j7166K2926N421K4532
16637F1683r2136q3511P8949J11886k8986q601J6992n5756l6839l2326m2387J37684
16625B6652J7748n1443o3752p5389K0192O467N7706J1153P3496J11023M9535J3684
16613A97072q7029m2054n5242k8223q739o601L824k5978O554L0856N9532J106
16601D5078m1647O6528L2828m213m4443M571j2895k2186m9883m310J3157Q0284
$$ y = [77344, -19089, -88491, -26072, -20789, -816, 69248, 87651, 95068, 33843, -30959, 43963, 59304, 82025, -28419, -144886, -152596, -139674, -73689, -2829, 51930, 127744, 139942, 110350, 31979, -64463, -200754, -178435, -90621, -27286, 77253, 2604, -41229, -4755, -20239, -63289, 1457, 118584, 108810, 120035, 125893, 52427, 25970, 8804, 31730, 37151, 61683, -30453, -113964, -35015, 76871, 47885, 39284, 56276, 520, -36319, -68645, -111032, 26652, 44400, -7043, -70795, -146184, -125992, -119525, -61819, -50666, 22830, 133853, 183388, 197072, 110043, 67989, 12747, -15476, -24215, -30816, -26992, -52970, -46416, -15560, 43972, 45078, 3431, 69959, 102787, 98574, 54131, 58702, 45807, 23621, -26262, -30572, -17415, 62869]
16589F2869J9297k2623J0510N4981m9298j783m3878j05195j7260K6115M0131k80
16577b6414j1705K7662K8962Q0161k9081q1056n3060j3939K4847m1965J7786R2399
16565A4597K0294j5849J3107J05118M1341q118n1006j6522q7003J9663k5566l875
16553F181J9002M2039j2121R906R74q2711p474R9749j8831j9884L0212j37768
16541g0726j46485P9553O7850L5981J8274j1776J1949o7423k9923P4493q5161
16530a23394l1133Q6958Q0820k272m9045q7397N515L0689l3388r742L4084j2695
16518a11000j850k4842j8186J9486N2440J4489m259J10540P857M2031O8001m2153
16506A12554l6090J5970p0157j03029k0082N7766K4436L7334L8725L1431n2196
$$ y = [62869, 82166, 59543, 70053, 125034, 75736, 73953, 30075, -75120, -92380, -66265, -26134, -26414, -38119, -10457, 18505, 98666, 69585, -11471, -64531, -78470, -53623, -95588, -77802, 14597, 34891, 19042, 32149, 137267, 178608, 170490, 119484, 102962, 15959, 35622, 10056, 6181, 25183, 67222, 55101, 65007, 65981, -16730, -24204, 75545, 56714, 36830, 67042, -70726, -217211, -137658, -69808, -33827, -15553, -27329, -15380, -82803, -112726, -38233, -123394, -154527, -67569, 13251, 10979, -38066, -125463, -119948, -89259, -122647, -132389, -98305, -111000, -112850, -137692, -155878, -136392, -83952, -69463, -73722, 36818, 44675, 86706, 154707, 112554, 76464, 92434, 22277, -80752, -100834, -43068, -18632, 18702, 57427, 88858, 36662]
16495C6662j02863R876k9052q0171K5661N8258m345J1243M6041K9377L6864l7732
16483a81k5811N6956O0967j8919j15206j901n6546K4841N4880L3526R7214P2096
16471A81916j5533j15567j4561n8365o6732j6374J5007n5836J8457Q0964K3505
16460b3119M6241M7268j0424j17460M9975j9961M7974O9111k3155j64864j9735
16449a18149O6502J2574k1739L334L221k6055O853P1251o8353p90P9906R3121
16437A01676Q8348N994k9589P676q8144n4811K1190J6393k2994l9415m5323m9106
16425h8105K8671K8484p7003l569l515P6039R1173M4400j4467q5755n6204k1043
16413h0894M2820J00o8212J8219R2920J9349n7416l6051P6616N755l0245l2062
$$ y = [36662, -66201, -56325, -85377, -165548, -139887, -81629, -85974, -74731, -28690, 687, 37551, -181, -25992, 30964, 91931, 73012, -42194, -44095, -100641, -75800, -20920, 12606, 109820, 181916, 166383, 50816, 36255, -22110, -88842, -105216, -90209, -146045, -127588, -46624, -23119, 23122, 70390, 59966, -57494, -7519, -27480, 20494, 89605, 66450, -98414, -118149, -51647, -39073, -60812, -57478, -54257, -80312, -73459, -2208, -70561, -71351, 8555, 101676, 190024, 196018, 166429, 174105, 85961, 31150, 52340, 68733, 45739, 6324, -38999, -88105, -59434, -30950, -107953, -111522, -115037, -38998, 52175, 96575, 82108, -3647, -59851, -80894, -38074, -37974, -106186, -87967, 4953, 24302, -33114, -69165, 7451, 13206, -17039, -49101]
16401d9101P3262K5301k0843L2010L6630l6463n8652M9114L2074l2846M4702J1640
16389A06828j17495j05874N973K3851m385L343J00394K5938J10233q9863q9026
16378c0083j2992n0727o1720J19968J50191j5282p8462k2247j7599l1033j5834
16367f5820n8985M3054J7633M3832J20830J08453n5913m6872k7587n5913J04558
16356A27270N6599q8101j0755M2836K1706j01482n4284N0150l1802o9717q2515
16345a40095k2356n5568j1698J68312M0791n8212n6304j9706N7907K0532m4883
16334a21280m8557Q2473J5842J5746k8288J3564J45965K0757n2614l7172n4251
16323d7815r3303O8378R5133L3106K8851O7353p4544j07677p5578M555J7538n4892
$$ y = [-49101, 24161, 49462, 28619, 60629, 97259, 60796, 2144, 51258, 83332, 50486, 95188, 106828, -10667, -116541, -110568, -86717, -91102, -87759, 12635, 38573, 148806, 58943, -30083, -43075, -93802, -155522, -35554, 114637, 99355, 20893, -1354, -18953, -49986, -65820, -124805, -81751, -64118, -20286, 100544, 208997, 153084, 106212, 78625, 22712, 127270, 183869, 95768, 85013, 127849, 149555, 48073, -6211, 43939, 12137, -57580, -140095, -162451, -218019, -229717, -61405, -20614, -78826, -135130, -154836, -96929, -76397, -121280, -169837, -87364, -71522, -55776, -84064, -70500, 75465, 96222, 43608, 6436, -47815, -141118, -72740, 22393, 55499, 84350, 151703, 77159, -30518, -106096, -101541, -84003, -138895]
16311a38895N9370J18014J99406l1919q5059l2631j15066p9617Q6037R9308k7822
16300E1126l8356J10160J22176R336r3899q3141n1958k7992J1954n198J1525l3931
16288a8198O00L8281j38422p7518n6080Q1629Q5842l672M5031Q6948n4605k0016
16276c0180O285J07509L5447q1165o4504N4680K2426o1353n5461m6472j8674M4706
16264h6756J16442J01061J6158J1913r1134L1130K9517q2018j5157J3022q5437
16253d1259J2564M8616m9590j5859p437r085L1018l687J10888L0286m2203j4956
16241D9296m5030J1511R638j3994o7294K726J04626m1135m6359R6019P1734l1137
16229A00601r1107k31k8277N8622J9311p0422M5098L2130j6356k0899j2401n9612
$$ y = [-138895, -79525, 38489, 237895, 205976, 120917, 88286, -26780, -106397, -20360, 78948, 51126, 12770, 122930, 245106, 254442, 160543, 77402, 25444, -2548, 9406, 4208, 15733, -18198, -17598, 20683, -117739, -195257, -251337, -169708, -83866, -87538, -42507, 44441, -10164, -30180, -23895, 83614, 119061, 37896, -26608, 28072, 50498, -10855, -66316, -112788, -131462, -86756, 29686, 130747, 146905, 158818, 67684, 98814, 128331, 46313, 31156, 44178, -41259, -28695, 19921, -29669, -45528, -52965, -62050, -31032, -34719, 76169, 106455, 64252, 49296, 4266, 15777, 25415, 11421, -55873, -53147, 51479, 10344, -36015, 60004, 131738, 100601, 9494, 9263, -19014, 39608, 58919, -11503, 33595, 65725, 49369, 28470, 16069, -43543]
16217d3543k0120l1834K1445R5154R7844m3387m2361j1935k671o5150l1001j4739
16205i2298O5591Q3441n2600J6033l1336m0963J0307l7189K05661J58899N7138
16194C42684k4315j11498p8977M2117J7651q6782K4352Q5892n2501j1899P3863
16183B20587K7522j22371r6739k1616L1885M2904Q984N1108R6573k8111l9095
16172A71631q5180M449q039l5915K0696q5499n4611N8482j8767l3818j071M1511
16160b6131J48965Q3147Q863K9232M9746K346k2031l2671J6057M3601K5531j9411
16148C07244n2625o1896J2943J8091p032J5998m9371m2177j2007j05264r209N1078
16136F5773N6011J03869l2818l8219l0080k9134P5283l3886M386Q626l8536l3925
$$ y = [-43543, -63663, -95497, -74052, 21102, 118946, 75559, 33198, 21263, 18592, -46558, -77559, -92298, -26707, 56734, 4134, 20167, -11169, -52132, -41825, -79014, 126647, 285546, 342684, 318369, 206871, 127894, 170011, 187662, 100880, 125232, 211124, 158623, 146724, 220587, 248109, 125738, 28999, 7383, 39268, 82172, 91156, 142264, 238837, 210726, 171631, 86451, 90900, 82861, 46946, 67642, -17857, -72468, -13986, -32753, -66571, -67642, -26131, 122834, 205981, 214844, 244076, 293822, 296168, 274137, 241466, 257523, 301124, 326655, 307244, 254619, 192723, 205666, 223757, 216725, 232723, 183352, 141175, 129168, 23904, 14695, 65773, 121784, 225653, 192835, 154616, 124536, 95402, 170685, 136799, 141185, 149811, 111275, 77350]
16124G7350R040J9315k7542n8975M873L6268k7760Q5317M7416N6528L9818J1883
16112B73531p0147l0387J257Q5581J52105O496j29189n4046m4934J3958K8888
16101B33113k5491n6772L7502P7992l5188j07255j12858P3022J32437O8366l3688
16090B51180l8681J8363K881p070o9679o0674M5196O5555j0400j343j11247r309
16078G4772Q9902L316P363M1338N5529q8543j01122N9552K5212N1444j4735n2746
16066A51282N6366N9556M2615q9179j01954j4727Q6868m716m9762q837n9106k4406
16054D4000o4016K8302J85742J30011J7869j56578j37872K4665l1l141N7035P1287
16042A97273r5307l2940M8145K3254K8862R7998L5298N932K1102n2796r1660k9654
$$ y = [77350, 86390, 105705, 78163, 19188, 24061, 60329, 32569, 117886, 165302, 221830, 261648, 273531, 203384, 172997, 174254, 259835, 411940, 418436, 289247, 235201, 190267, 204225, 233113, 207622, 150850, 188352, 266344, 231156, 123901, 11043, 84065, 216502, 284868, 251180, 212499, 230862, 233743, 226673, 156994, 96320, 141516, 207071, 196671, 195328, 84081, 74772, 164674, 167990, 175353, 216691, 272220, 183677, 82555, 142107, 167319, 218763, 204028, 151282, 207648, 267204, 309819, 220640, 118686, 103959, 190827, 186111, 136349, 127512, 68406, 44000, -20016, 8286, 194028, 324039, 341908, 185330, 47458, 72123, 72092, 68951, 125986, 197273, 101966, 69026, 117171, 140425, 169287, 267285, 302583, 308515, 329617, 276821, 185161, 155507]
16030A55507k902J3144j444j5142m1467L3668N0056j5472k1732L9524N5299n645
16018B43394p6110M752O8561q77l2850n8025L2526n6115p9314R5156Q7230J19724
16006C48052k4407k4299p9976L7983K9612j316q3661m6186L9032L1437N5687Q0894
15994C62852m1736o778k8912k5727J771M1945m3089n5526j3317m4354R2247P3576
15982C12952r5268l6148l5631O0217J3087M6998M9423J8696P8400Q3896m0610
15971D56012p5493q7689j0203N6143k592j36K6645J6912J7810O9586O8103k0732
15959E14366k8713n1694j11965O168N9706k6331q5987r9780j8171M8782q090J38048
15947C36339J03098j00245p2082k632P1164l305n9696o4578K7131R5983Q779l1
$$ y = [155507, 152605, 165749, 164305, 149163, 107696, 141364, 191420, 175948, 154216, 193740, 249039, 243394, 167284, 172036, 240597, 239720, 206870, 148845, 181371, 125256, 45942, 141098, 228328, 348052, 323645, 299346, 219370, 257353, 286965, 285649, 201988, 155802, 194834, 226271, 281958, 362852, 321116, 314338, 285426, 259699, 261470, 303415, 260326, 204800, 191483, 147129, 239376, 312952, 217684, 181536, 145905, 206122, 219209, 266207, 315630, 334326, 412726, 496622, 456012, 380519, 292830, 282627, 338770, 336178, 336042, 362687, 379599, 397409, 466995, 535098, 514366, 485653, 433959, 321994, 328162, 387868, 361537, 275550, 175770, 157599, 206381, 198291, 336339, 439437, 339192, 267110, 264478, 335642, 332337, 272641, 208063, 235194, 331177, 339956, 339925]
15935C39925J91538K2331n4875j19195j03733K3417k5655l113k4233L8350J08523
15924C93280P5689j6601q7195J9438J09302j4574r589l3828p9125k4478q6563
15913B45756L7078O7328J64684J29858M7318n9816k480m8900P7774l6679n4951
15902E66970l2469R745P0002J03243l7331j37407N8144L8846j2243n8180K5794
15891E95114L9017m0325R4087m686j22512K0535L3879k5782l1565k2335O4620
15880F00047M8818O8195o2211j12736J14806J27041K3225j25791j08393K6779
15870E99780K5944L5490j2443n630L1287M1423J00340k8727L2038k8884m4531
15859G46087Q660M3745R5907O2052K1121R9773L7724r9165j4393L9676J13867
$$ y = [339925, 531463, 553794, 498919, 379724, 275991, 299408, 273753, 270640, 246407, 284757, 393280, 468969, 452368, 365173, 384611, 493913, 479339, 469750, 435922, 356797, 332319, 245756, 282834, 350162, 514846, 644704, 692022, 632206, 629726, 580826, 658600, 621921, 566970, 534501, 544246, 614248, 717491, 680160, 542753, 600897, 639743, 627500, 569320, 595114, 634131, 593806, 687893, 683207, 560695, 581230, 615109, 589327, 557762, 535427, 600047, 648865, 717060, 654849, 542113, 656919, 783960, 807185, 681394, 573001, 599780, 625724, 661214, 648771, 643141, 674428, 715851, 816191, 787464, 819502, 790618, 746087, 754747, 798492, 894399, 956451, 977572, 1077345, 1115069, 1015904, 1001511, 1041187, 1155054]
15848A155054R4739j02963n1247O8396j2668j5216N3872K4490k8277k8527O5273
15837A222926k9135m4971l1448q791M5007K7086n19l0145n3169j10849q2279J3718
15825I17431L9227K5364p6648l0324J5833M842o1895J0216r7077m856K5976j02934
15813F65155l8344o328Q6159K3106Q831K3149K2716k1890L3397J22584J8628j16815
15801H20348n9171K504n332m0222L9776P6056j00967n2814l884o0385n3466J45655
15789G08098R0996L0563J14850j2060n2609n6161j2535J9768j2184j2566M8372
15778H54532q2487j9229Q1827K6336P066O071k3596r0370J3100N1976J07488l6804
15766H95910j07734L7253R5398p4707o6732n0339P4516L7358O1940K0923p7709
$$ y = [1155054, 1249793, 1146830, 1095583, 1163979, 1151311, 1136095, 1189967, 1214457, 1186180, 1157653, 1222926, 1193791, 1148820, 1117372, 1108581, 1153588, 1180674, 1180155, 1150010, 1096841, 985992, 903713, 917431, 956658, 982022, 905374, 875050, 890883, 895725, 833830, 844046, 746969, 742113, 768089, 665155, 626811, 620483, 706642, 729748, 738579, 761728, 784444, 762554, 795951, 918535, 937163, 820348, 761177, 763681, 758349, 718127, 757903, 833959, 732992, 680178, 676294, 615909, 562443, 708098, 799094, 829657, 944507, 932447, 879838, 823677, 811142, 830910, 818726, 806160, 854532, 772045, 752816, 834643, 860979, 868045, 874116, 850520, 760150, 773250, 825226, 932714, 895910, 788176, 825429, 920827, 846120, 779388, 729049, 803565, 840923, 902863, 923786, 846077]
15755H46077n7487M073o6443k4245R8797K22832j3649m1159k9343p8790k5500
15744H35163P5259L3744n3342J24751N9934j04355o3555j09337m1245j8133R9551
15733H38435J5932M3896M2779L0912l6837M5117O6504J008p1634k1775N6814k7712
15721I83439N3023N1966k000o6814O2521M6346k4151m1365l7585L1476P5872k8322
15709A104406j60632P7494J55748k4460N2158R3246K1034n1884l4398L3955j04779
15698A161888O3609O2312m4575L7936J8800n3074J5478K9619k7264R1461R0997
15687A447187J5217m5061n3003m2906P117P9523l445J3871J416J54803R8561O124
15675A679404p466L294m4937p7655o891Q4099N7193l1208O96K1042N029P9363
$$ y = [846077, 788590, 792663, 726220, 701975, 800772, 1023604, 1009955, 968796, 939453, 860663, 835163, 910422, 944166, 890824, 1015575, 1075509, 971154, 907599, 798262, 757017, 738884, 838435, 854367, 898263, 941042, 971954, 935117, 980234, 1046738, 1047746, 976112, 954337, 1011151, 983439, 1036462, 1088428, 1086428, 1019614, 1082135, 1128481, 1104330, 1062965, 1025380, 1056856, 1132728, 1104406, 943774, 1021268, 1177016, 1152556, 1204714, 1297960, 1318994, 1267110, 1232712, 1266667, 1161888, 1225497, 1287809, 1243234, 1281170, 1299970, 1246896, 1262374, 1291993, 1264729, 1356190, 1447187, 1462404, 1417343, 1364340, 1321434, 1328551, 1408074, 1404629, 1418500, 1419916, 1574719, 1673280, 1679404, 1671938, 1675232, 1630295, 1552640, 1545749, 1629848, 1687041, 1655833, 1656529, 1677571, 1682600, 1761963]
15663A761963R9030J19430K4262M6852j5821J8004O8345L6059k5956M2108P3272
15652B247548N694M9748P2563L1534N1900J7004J37250J12125j4797m9186J5815
15641B677198n0756n431O865m1368Q328M8158M4245L4185j07681r4607J1538L8136
15629B568810J4816P0686L9216Q3414r070o0722j01776K3779R2987J12406P2372
15618B906918O4609l2912l235L6625K7808O4761Q8556P0639p542L0728k7124J3979
15606C233810J07479Q5813J2048J2354Q3326K0277k4805l942N4712N6191N4774
15595C692037P9950K046l4431P0268R0701K6546M1851L184j04517j02902p227
15584C757506p7372m511J4225m3866m4105k464m5522J26967J17594M0022l5040
$$ y = [1761963, 1860993, 1980423, 2004685, 2051537, 2035716, 2053720, 2122065, 2158124, 2132168, 2174276, 2247548, 2253242, 2302990, 2375553, 2407087, 2458987, 2475991, 2613241, 2725366, 2710569, 2661383, 2677198, 2626442, 2621011, 2627876, 2586508, 2594836, 2642994, 2687239, 2721424, 2613743, 2519136, 2530674, 2568810, 2583626, 2654312, 2693528, 2776942, 2767872, 2707150, 2605374, 2629153, 2722140, 2834546, 2906918, 2971527, 2938615, 2935380, 2972005, 2999813, 3064574, 3153130, 3223769, 3216227, 3246955, 3219831, 3233810, 3341289, 3427102, 3439150, 3451504, 3534830, 3555107, 3530302, 3526360, 3581072, 3637263, 3692037, 3771987, 3774033, 3739602, 3809870, 3900571, 3927117, 3968968, 3972152, 3867635, 3764733, 3757506, 3680134, 3675623, 3689848, 3645982, 3601877, 3599413, 3553891, 3680858, 3798452, 3838474, 3803434]
15573C803434l5655P0928R5362m2177q5886o2611j1513Q020p157J2716R0273N5305
15561C891039N5675J0305L6012K0414J5344Q5995m0018k9583J27248M6165N9637
15550D278233K011l9266l5026J08557K17453J35824j00890j7707M9424O0124o9673
15539D589064K6134J63902P643J23860J27142j5175J4546K0382l0928J43119P4538
15528E244227Q6289M3420p2997R9182Q7017J29332Q0316Q8814J43198J36078R7538
15517F162414P4973R1745K3203M1348J09920K4704J06134P5625M6604J37438J46067
15506G040175J95635O7436J00734J95045Q2213K03035J67965J26083R3569J9362
15496H291252M4038J86276J57973J43356J16431R3810L8324J07973K11338J88253
$$ y = [3803434, 3767779, 3838707, 3934069, 3891892, 3806006, 3743395, 3731882, 3739902, 3732745, 3745461, 3835734, 3891039, 3946714, 3957019, 3993031, 4013445, 4028789, 4114784, 4074766, 4045183, 4172431, 4218596, 4278233, 4280244, 4240978, 4205952, 4314509, 4531962, 4667786, 4566896, 4549189, 4598613, 4658737, 4589064, 4615198, 4779100, 4786743, 4910603, 5037745, 5022570, 5037116, 5057498, 5026570, 5169689, 5244227, 5330516, 5373936, 5300939, 5400121, 5487138, 5616470, 5696786, 5785600, 5928798, 6064876, 6162414, 6237387, 6329132, 6352335, 6393683, 6503603, 6528307, 6634441, 6710066, 6756670, 6894108, 7040175, 7235810, 7303246, 7403980, 7599025, 7681238, 7884273, 8052238, 8178321, 8271890, 8291252, 8335290, 8521566, 8679539, 8822895, 8939326, 9033136, 9071460, 9179433, 9390771, 9579024]
15486I579024J92179J42492J41735R6349J71171J43605J24889J92534J66526J00182
15476A1050686J80812K38069K49563K06587J38981K06618K92457K34551K42198
15467A3040522K77278K66987K39462J96675K36403K74921K57582L10485L44067
15458A5444382L86499L24379K66782L35584L51323L98118L65297M00917M40202
15449A8713483M66030M91211M81968M08353M11265L79616O13394N81378N78576
15440B3125274N63820N50034O83439O83628O80891P85343P49632Q08611Q18094
15431B9448766Q56265R36545Q94791R48578J105952J087976J094148J170491J250416
15422C8793928J229659J324015J422317J534911J546234J641990J770346K017395
$$ y = [9579024, 9771203, 9913695, 10055430, 10151779, 10322950, 10466555, 10591444, 10783978, 10950504, 11050686, 11231498, 11469567, 11719130, 11925717, 12064698, 12271316, 12563773, 12798324, 13040522, 13317800, 13584787, 13824249, 14020924, 14257327, 14532248, 14789830, 15100315, 15444382, 15830881, 16155260, 16422042, 16757626, 17108949, 17507067, 17872364, 18273281, 18713483, 19179513, 19670724, 20152692, 20561045, 20972310, 21351926, 21965320, 22546698, 23125274, 23689094, 24239128, 24922567, 25606195, 26287086, 27072429, 27822061, 28630672, 29448766, 30305031, 31241576, 32136367, 33084945, 34190897, 35278873, 36373021, 37543512, 38793928, 40023587, 41347602, 42769919, 44304830, 45851064, 47493054, 49263400, 51280795]
15414E1280795K135373K178369K233098K336881K449350K711054K827090L007877
15406G1159887L282082L426521L665506L898750M095135M428252M752397N011393
15398A03719923N331686N629152N999933O290693O590309P038318P306883P466127
15390A55373024P812936Q049420Q104286Q049356P852521P433158O982522O194941
15382B15852164N342153M252134K882686J455857m3531j456471k664055l891788
15374B21729149n150369o145926o763877p375208p762220q010849q061401p968162
15366A64491137p860952p618474p389940p088607o868459o485800o159014n818067
15358A09201824n336114n106005m924574m610796m308225m034354l876093l611967
$$ y = [51280795, 53416168, 55594537, 57827635, 60164516, 62613866, 65324920, 68152010, 71159887, 74441969, 77868490, 81533996, 85432746, 89527881, 93956133, 98708530, 103719923, 109051609, 114680761, 120680694, 126971387, 133561696, 140600014, 147906897, 155373024, 163185960, 171235380, 179339666, 187389022, 195241543, 202674701, 209657223, 215852164, 221194317, 225446451, 228329137, 229784994, 229741463, 228284992, 225620937, 221729149, 216578780, 210432854, 203668977, 196293769, 188531549, 180520700, 172459299, 164491137, 156630185, 149011711, 141621771, 134533164, 127664705, 121178905, 115019891, 109201824, 103865710, 98759705, 93835131, 89224335, 84916110, 80881756, 77005663, 73393696]
15350G3393696l261827l140025l065916k862984k691254k544684k395218k369192
15342E1062596k224479j981386j949797j793027j658448j606862j509482j463059
15334C6876056j305695j253937j267749j203988j054559r41067r86116j010421
15326B7852524j013088r36878q50899p92510o83886o64294o96565o32974o34501
15317B0946929o32400o18785o04807m76202m76841n08549m33547m04253l95844
15308A6395701m67991m05991m15291l22951l63437l60562l38293k87131k86863
15299A3147191l18639k48937l01064k18039k36546l21649l73364k31783j85832
15290A0711338k32943k07192k03817l06614l10478j92559q2281j65173j41376
$$ y = [73393696, 70131869, 66991844, 63925928, 61062944, 58371690, 55827006, 53431788, 51062596, 48838117, 46856731, 44906934, 43113907, 41455459, 39848597, 38339115, 36876056, 35570361, 34316424, 33048675, 31844687, 30790128, 29849061, 28862945, 27852524, 26839436, 25902558, 25051659, 24259149, 23575263, 22910969, 22214404, 21581430, 20946929, 20314529, 19695744, 19090937, 18614735, 18137894, 17629345, 17195798, 16791545, 16395701, 15927710, 15521719, 15106428, 14783477, 14420040, 14059478, 13721185, 13434054, 13147191, 12828552, 12579615, 12278551, 12060512, 11823966, 11502317, 11128953, 10897170, 10711338, 10478395, 10271203, 10067386, 9760772, 9450294, 9257735, 9175454, 9010281, 8868905]
15281H868905m1806j28362j18532k39701q1628j51862k85879k88079j46846n9504
15271G326706m1926j55175j83313r7711j31653j78629j04015j13208n5098j30752
15261F135226n8910q3715p136L031j35623m0716j122j72025j98970l5714p4613
15250E329713k8375L0749j52859j39110j13173O737M7253m4472j86844j56932
15240D592687j19437n1819M2027M8677m9765n5439j12117m1788k1821L3145N9477
15229D323827r3110j76757J0397p1719m6879R9665L60o0716j21192j77116k8520
15218C658240J2701O5687k8089p6597j16656l4930J9653M2434p4672j34534J8496
15207C351733k4244r9989k5012m8639m7924k7450q6099p7533o365p3846n7784
$$ y = [8868905, 8827099, 8698737, 8580205, 8340504, 8258876, 8107014, 7821135, 7533056, 7386210, 7326706, 7284780, 7129605, 6946292, 6848581, 6716928, 6538299, 6434284, 6321076, 6265978, 6135226, 6076316, 5992601, 5985465, 5988496, 5852873, 5812157, 5811035, 5639010, 5440040, 5404326, 5329713, 5301338, 5332087, 5179228, 5040118, 4926945, 4933682, 4980935, 4936463, 4749619, 4592687, 4473250, 4421431, 4463458, 4512135, 4462370, 4406931, 4294814, 4253026, 4231205, 4264350, 4323827, 4230717, 4053960, 4064357, 3992638, 3945759, 4045424, 4045784, 3985068, 3863876, 3686760, 3658240, 3670941, 3736628, 3708539, 3631942, 3515286, 3480356, 3500009, 3542443, 3467771, 3333237, 3351733, 3327489, 3227500, 3202488, 3153849, 3105925, 3078475, 2992376, 2914843, 2908478, 2834632, 2776848]
15196B776848r816J4524l3915o1175N2412m3058J544M5143k6713o4599q1912n0948
15184B518335R849p5667r2772j8643L5644O1267J5575L5319m7738l3319q3895
15173B323955L0852J28991o848l799j15925j1437j36199q1546o834k1910k8358
15162B070942L2093o5764r3927R0131L1838N7904j9640m6334n4619k7164k4872
15151A950588K306r6290N6860R1747l8085r5036l9809j7036K3566O2346m0354
15140A860803j0087j9671R387J1831J768r2782r1382m1489K4144J0444M231K9631
15128A696828N4507J48984j5855N8774j9172J2474j6176r9834M7734M64j10187
15117A758541p7906J20330O2979O5420K9694J7754k8502j20641k5529l0540k359
$$ y = [2776848, 2767032, 2781556, 2747641, 2686466, 2738878, 2695820, 2697364, 2742507, 2715794, 2651195, 2569283, 2518335, 2528184, 2452517, 2359745, 2341102, 2376746, 2438013, 2453588, 2488907, 2441169, 2407850, 2323955, 2354807, 2483798, 2476950, 2473151, 2357226, 2345789, 2209590, 2128044, 2121210, 2099300, 2070942, 2103035, 2037271, 1943344, 2033475, 2065313, 2123217, 2103577, 2057243, 2002624, 1975460, 1950588, 1952894, 1856604, 1913464, 2005211, 1967126, 1872090, 1832281, 1815245, 1838811, 1901157, 1860803, 1850716, 1831045, 1840432, 1852263, 1854031, 1761249, 1669867, 1628378, 1652522, 1662966, 1667197, 1696828, 1751335, 1900319, 1884464, 1943238, 1924066, 1936540, 1920364, 1820530, 1868264, 1868728, 1758541, 1680635, 1800965, 1863944, 1929364, 1959058, 1976812, 1948310, 1827669, 1802140, 1771600, 1769241]
15106A769241R3464M359O4680q7951j57368p9668n3165m531k3370j09329K1732
15095A438094M6929p2148q1597K4443O7L1125m0980k081k6280m7465p3777j14908
15083A081422p1186k7582M9557l3443O8488J50061r35Q7548k5425M044o9424k0244
15071A192881o2941l8556k5674N297J06572J0949M6557M3294o3583j01769p2894
15060A040133r3049J3452N0514j7809M6577o2276m6063L3290L5089n5079k0923
15049I23856M1454O6246k2260m9589L7288K5704l2668m4482N9198n6853r9803
15038H48091m472M1341k1841j42157n8623Q216M9328Q7374Q7189M5578K7091j7627
15026I49488n4453J0274n3667q2010o0440j07929m1602L0457O7577r6209k9872
$$ y = [1769241, 1862705, 1867064, 1931744, 1843793, 1686425, 1606757, 1553592, 1549061, 1525691, 1416362, 1438094, 1485023, 1412875, 1331278, 1355721, 1355788, 1386913, 1345933, 1343852, 1317572, 1270107, 1196330, 1081422, 1010236, 982654, 1032211, 998768, 1067256, 1217317, 1216382, 1303930, 1278505, 1282549, 1213125, 1192881, 1129940, 1091384, 1065710, 1071007, 1177579, 1188528, 1235085, 1278379, 1214796, 1113027, 1040133, 947084, 960536, 1011050, 993241, 1039818, 977542, 931479, 964769, 999858, 944779, 923856, 965310, 1031556, 1009296, 959707, 996995, 1022699, 990031, 945549, 1004747, 947894, 848091, 843619, 884960, 863119, 720962, 662339, 670555, 719883, 807257, 894446, 940024, 967115, 949488, 895035, 905309, 851642, 769632, 709192, 601263, 559661, 590118, 657695, 561486, 531614]
15015E31614J6786K4800n6279O944L0408J8346k922L080Q819K8824O3014K8028
15003G01462K2151M7284r3992j30404m3563J13412P3729O0596J43239m9633p0042
14992G74239j09565n7200j3353n9976l2120j9090J74911Q9713m2810j14434r3555
14981D96760N5424O5151L4062r499J9688m8243k2093N3634o0762k3914P7423l4015
14969F03616q9921K6708Q4375L943q5366o3494m2963n2890K3613O7206J727O4492
14957E41046k907j1390L5722O9050j19279j21235N7181K7585j9143q1503l5777
14946C39350J18407J39979j4791m4891j0422L6378j9061q8619j06333m2827L8667
14935C45837J01445N0963l1449p2626o0892j0149m2107P925L3133J08842L0510
$$ y = [531614, 548400, 573200, 516921, 523865, 554273, 572619, 569697, 572777, 581596, 610420, 673434, 701462, 723613, 770897, 676905, 546501, 502938, 616350, 690079, 750675, 893914, 844281, 774239, 664674, 607474, 594121, 534145, 502025, 482935, 657846, 747559, 704749, 590315, 496760, 552184, 617335, 651397, 641898, 661586, 613343, 591250, 644884, 584122, 560208, 637631, 603616, 513695, 540403, 624778, 628721, 543355, 479861, 436898, 384008, 407621, 474827, 476554, 541046, 538139, 526749, 562471, 631521, 512242, 391007, 448188, 475773, 456630, 375127, 339350, 457757, 597736, 582945, 538054, 527632, 564010, 544949, 456330, 349997, 307170, 345837, 447282, 498245, 466796, 394170, 333278, 323129, 281022, 288947, 322080, 430922, 461432]
14924D61432j9825n2716k8512M863m8116k0654k5861p927K5789J20853J18087
14913E27413l2088n8973K0103k3113o0246L594o829j53339L2620J08449M0835
14902C98426K088q7406m4404J2009l2098M2598J22288Q3166j07808o3286k3242
14891C02331K1052k8187L8394J2585J800j7355k3065l8756M8013L8667k3447N2539
14879C84571M2141K3979l6138j2030q6748k800K4009j959j2417q5072k125P2451
14867C07862O2371n1685p0830o570J65572L7685r9720j62722K433K585N6088J27689
14855C70758J8413N410r7242j7456N7764L3825j9906p5573n5230q324J09052Q8357
14843D09848k4248q8988n2650K1613j1221l9822Q2386J01285o877M280M3681j13904
$$ y = [461432, 441607, 388891, 360379, 365242, 317126, 296472, 270611, 262684, 288473, 409326, 527413, 495325, 436352, 456455, 433342, 373096, 376690, 369861, 216522, 249142, 357591, 398426, 400514, 313108, 268704, 280713, 248615, 291213, 413501, 496667, 388859, 325573, 302331, 323383, 295196, 333590, 346175, 347975, 330620, 307555, 268799, 316812, 355479, 332032, 384571, 426712, 450691, 414553, 402523, 315775, 312975, 336984, 335025, 322608, 237536, 235411, 307862, 370233, 318548, 247718, 241148, 406720, 444405, 344685, 181963, 184396, 186981, 243069, 370758, 389171, 394581, 297339, 279883, 337647, 371472, 351566, 275993, 220763, 212439, 321491, 409848, 385600, 296612, 243962, 265575, 254354, 214532, 296918, 398203, 391326, 395606, 439287, 325383]
14831C25383K0169q5555J5761l9902P406N1133M9156O4577r1703j45331j10961
14820F0133n0408R7278J17614J6252N2946k8069n0555o8204p7352P861N5215P0572
14808B03283o4839p8952q1187O5127M5093N0187Q4316l5882O935n3633J9076J33769
14796B93293N7349N5737j6864k9920L0578L8935p4901j37542o7565l0214N3675
14785A72561J27581L961j00910j51304m100K7915l5563N3944O2327j8855k2796
14774A14761P2493N8234K4699N4614o4075n0349k7453n3477n0720l7366M1038
14763H2399L8070M681j1184N1265n6803n8354l8527j5640N8517M1217L4089L0278
14751A60008M7027q1488l1053p556k529O7669j0159K4187N1641m894J3293m2913
$$ y = [325383, 345552, 259997, 275758, 235856, 243262, 294395, 343551, 408128, 316425, 171094, 60133, 9725, 107003, 224617, 240869, 293815, 265746, 215191, 146987, 69635, 77496, 132711, 203283, 138444, 59492, -21695, 43432, 88525, 138712, 223028, 187146, 194081, 140448, 159524, 293293, 350642, 406379, 389515, 359595, 390173, 429108, 354207, 216665, 149100, 118886, 172561, 300142, 304103, 203193, 51889, 47789, 75704, 40141, 94085, 156412, 137557, 114761, 187254, 245488, 270187, 324801, 260726, 210377, 182924, 129447, 78727, 41361, 82399, 120469, 125150, 113966, 165231, 108428, 50074, 11547, -4093, 54424, 95641, 129730, 160008, 207035, 125547, 94494, 86938, 84409, 152078, 141919, 166106, 217747, 212853, 226146, 183233]
14739A83233j5669k61k8345K6017p4051l1259R3162L7090r7669r2895k5973l0367
14727e6987M3827O6133J0406p2878R112k5075N9981K6480K6520j1868n5271O0761
14715H1141P7934K1937K1867J363l0447J6967j9435p0749j2863l7715J216O7260
14703A18476M9198J4018K681k8118L5131N3690N9475l0624j26963o3832K0242
14692A03374J4336Q42R307R8578m5415j27774M6993J1743L9480l4683l5634q0983
14680A64k2728Q274o3058J18711K8213n7684o1446O2098N6480N4254l51k4996
14668I7931J7781l8589m0685K4437L452J4970P4243K0954K7926l2658n9285q4538
14656B5939n9932N6401M8522p885m777p2997l7146M113M5372K4952N7397M3262
$$ y = [183233, 167564, 167303, 138958, 164975, 90924, 59665, 152827, 189917, 92248, -647, -26620, -56987, -13160, 52973, 63379, -9499, -387, -25462, 34519, 60999, 87519, 75651, 20380, 81141, 159075, 181012, 202879, 204242, 173795, 190762, 171327, 100578, 87715, 50000, 51216, 118476, 167674, 181692, 184373, 156255, 191386, 245076, 304551, 273927, 146964, 83132, 103374, 117710, 118552, 127859, 226437, 181022, 53248, 100241, 111984, 151464, 116781, 81147, 164, -22564, -14290, -77348, 41363, 69576, 11892, -49554, 12544, 69024, 123278, 122927, 97931, 115712, 77123, 36438, 60875, 64327, 79297, 153540, 174494, 202420, 169762, 110477, 25939, -33993, 22408, 70930, 63045, 58268, -14729, -51875, -47762, -2390, 22562, 79959, 123221]
14644A23221L7572N1021l2856j01320p3769m3781J02701J2068k405R470Q4723
14633A66645J7959o8836J1546J4149p5417L1465N5494l9735n2409k3347k4099
14622A3415M9532j3275j5827N750K6734j2612N8146L236q5054m7966Q3457L154
14610F8690j15248m6875M7580L5215O2515R7603j9965p0875p8484K9437O9173
14599G8766L1706N6563n9490K985K3961K7754j2538q6163l2432L8061j504l1244
14587C6425k9630K0222N1087l6356m8756K8399Q9876J9221K2842l2174l9287j709
14575H0160o041r8983k7328k0185j8232P3853L3808o2582j7567O5687K8774k4464
14563F900M9837m9889p4367n8939J05251N6830j6457M8107J7905o6375p7019o3271
$$ y = [123221, 160793, 211814, 178958, 77638, 3869, -39912, 62789, 74857, 72452, 81922, 166645, 184604, 115768, 127314, 141463, 66046, 97511, 153005, 113270, 60861, 37514, 13415, 62947, 49672, 33845, 39595, 66329, 53717, 111863, 115099, 30045, -17921, 65536, 68690, -46558, -93433, -45853, -10638, 51877, 149480, 129515, 58640, -19844, 9593, 78766, 110472, 167035, 107545, 110530, 134491, 162245, 149707, 63544, 31112, 69173, 67669, 36425, 6795, 27017, 78104, 41748, -7008, 21391, 111267, 130488, 153330, 121156, 81869, 80160, 74119, -24864, -52192, -72377, -90609, -16756, 17052, -45530, -63097, 2590, 31364, 6900, 56737, 6848, -67519, -126458, -21207, 35623, 19166, 67273, 85178, 18803, -58216, -121487]
14551a21487m7227R9820J21538N6946J1754n5766K3704L1247k1346m090K9179
14540A24272m140r2369l2605l2092L4455P6385K1646j09111o5820L5443O8407
14529B4471o33L8513l9364l2638K5506o805P4740Q569K1652L7783p4548r9480
14517b2234m9884m737m1763Q346P0159R6298Q6390L8464J6949O637K8073L3520
14505B66218j54189r5192M788J353O9756P8317r6390m1796P821N2575J5390r056
14493I9595j30722k078Q418M168k251j7231J2966m1048Q4902n1649M4252J2026
14481B1348n2789P8960k1697o2921q3896j514J6152l174J978K9311J7176M9704
14469a1362J04677K169l7167p7487m7542l4028M6028M2009j6322j12852k5994
$$ y = [-121487, -168714, -68894, 52644, 109590, 121344, 65578, 89282, 120529, 99183, 95093, 124272, 120132, 27763, -4842, -36934, -2479, 73906, 95552, -13559, -79379, -43936, 24471, 23838, 62351, 22987, -9651, 15855, 9050, 83790, 92359, 114011, 151794, 77246, -22234, -72118, -76855, -118618, -110272, -40113, 56185, 142575, 181039, 197988, 204625, 232698, 266218, 112029, 16837, 21625, 22978, 92734, 171051, 74661, 32865, 40686, 93261, 108651, 99595, -31127, -33205, -24787, -20619, -22870, -40101, -27135, -68183, 16719, -34930, 9322, 21348, -31441, 47519, 25822, -37099, -120995, -122509, -106357, -109531, -107553, -78242, -61066, -11362, 93315, 95484, 58317, -19170, -66712, -100740, -54712, -12703, -29025, -141877, -167871]
14458a67871J32518N8679o9005l7019L2098q7118M3181R5103J01315j19654k5183
14447d2956l8763q5192L7040P4372N4225M7984N0755l3624n7036K2572L0374J05646
14435A65397N7106j4974n3321q6414r908k0657l2090q9626K9234k4922j6191P322
14423h9044K9554K49M2261N333k0742L7025l0979L1909R4042L6108O396k9726
14411A12386J3436p2487m5441l7079P2838L4913q3889o7000K8346m9687n5848
14400a49512K760Q5298n640m498j2843k8378K4805O7756O0309k9975N1658n2554
14388I186r1711m4854J740N1828O7059K6142J6207Q478J2893m3363O5513J2091
14376I1209q7423p1777P261K7294L5334l8099m7619n9922j7197J0503l6098N6514
$$ y = [-167871, -35353, 23326, -45679, -82698, -50600, -137718, -94537, 566, 101881, -17773, -42956, -81719, -166911, -129871, -55499, -1274, 46710, 97465, 63841, 6805, 29377, 59751, 165397, 222503, 207529, 154208, 67794, 57886, 37229, 5139, -84487, -55253, -80175, -96366, -89044, -59490, -59241, -16980, -11647, -32389, 4636, -26343, 5566, 99608, 135716, 142112, 112386, 125822, 53335, 7894, -29185, 43653, 78566, -5323, -72323, -43977, -93664, -149512, -146752, -61454, -67094, -71592, -84435, -112813, -88008, -20252, 40057, 10082, 61740, 9186, -82525, -127379, -125639, -73811, -6752, 19390, 35597, 44075, 56968, 13605, 79118, 91209, 3786, -67991, -60730, -33436, 1898, -36201, -83820, -143742, -160939, -150436, -186534, -130020]
14364a30020K1842N7065Q9191N1974J2621K2176J5305j9718q2367m378Q2553n575
14352A10669m4969l5435j583J728L99k480l9026M9115p0397m7787k1239J3651
14340h7354m395L885k9448L1568J05872R1845l5761m2433O70l6468J4104Q1135
14328I3220M9568R52j08799m8951j0799N8544k0011r3588k5736n4656N7534J17603
14316A4881M7231J631o3634l6347M6361M863L7303N2782j2629k0654o7321j27647
14304a23180J4800O2544N6297k0186L7803M1810K9026l3229j39237o40P6354N6869
14292E9031m554p1012q137r5863n2446j2442n6808M5429O5496K4519Q9596K0614
14280C423j77265K1800R1138p8236m7925j2520J95158J09822m1418o6535M2743
$$ y = [-130020, -108178, -51113, 38078, 90052, 102673, 124849, 140154, 120436, 38069, 33691, 116244, 110669, 65700, 30265, 28682, 30410, 30809, 28329, -10697, 38418, -31979, -79766, -101005, -87354, -91749, -87864, -117312, -85744, 20128, 111973, 76212, 33779, 34449, -2019, 12085, 93220, 142788, 143740, 34941, -14010, -24809, 33735, 13724, -79864, -105600, -160256, -102722, 14881, 62112, 63743, 109, -36238, 10123, 14986, 52289, 105071, 92442, 71788, 4467, -123180, -108380, -45836, 10461, -9725, 28078, 69888, 98914, 65685, -73552, -74192, 2162, 59031, 54477, -16535, -24672, -120535, -172981, -185423, -242231, -196802, -131306, -106787, -17191, 3423, -173842, -152042, -60904, -139140, -187065, -199585, -4427, 105395, 63977, -2558, 40185]
14269D0185M6827k9907j25372J0657O3447j9873N3914L8111j4828n6352j05527
14258i8718p6310J8020J5313R2880k9347J8185M9877P379K795o5948J3924J41735
14246H9785N0288j7518r4542M0939N7118q4521n6166J7008j26467R820j1903K096
14234a24063J7064k3164K1619o8352l0079p528P105P6090J9107n2290o520N28
14222a70483L0362P5799M4493q5229M9237P1112m9946o6891j8973n3761J0260
14211a64020K1231n4598J8539P0317P649M3019J3064O4059J4150n3771l8783q754
14199f7898j0647Q915M1069J82m1747r2016k802o640L3491M0274P428R6818R0445
14186I6872M3661N347q9522K3875p1562j9309J8289Q61j27116q9394j29423M6812
$$ y = [40185, 87012, 57105, -68267, -57610, 5837, -14036, 39878, 77989, 63161, 6809, -98718, -175028, -157008, -141695, -48815, -78162, -59977, -10100, -2721, 74, -65874, -51950, 89785, 140073, 122555, 28013, 68952, 126070, 41549, -14617, 2391, -124076, -114256, -126159, -124063, -106999, -130163, -108544, -176896, -206975, -214503, -207398, -131308, -112201, -164491, -171011, -170483, -140121, -64322, -19829, -105058, -55821, 15291, -34655, -101546, -120519, -174280, -164020, -142789, -197387, -178848, -108531, -100882, -57863, -44799, 19260, 33410, -20361, -59144, -67898, -78545, -69630, -28561, -28379, -70126, -162142, -164944, -171584, -138093, -97819, -90391, 6427, 96872, 140533, 145880, 56358, 80233, 8671, -10638, 7651, 8512, -118604, -207998, -337421, -290609]
14174b90609J40388O3492m4015p4359J2675Q6529P293l1367P458O4359K9389J3348
14162a5419R0393K4633o2233J4484q3990n6775J19699O5020k6638M7538o4476
14151E2236N811K4632j02200j10071j13305K6127J42247O6471n2440k7416m5978
14140a33886O5574m1482m9907o4810K0302J83491J8337r0081P6074R1995m1564
14129C4043n8766K7546q4047o4231q1175L4309L6451P4178Q2696n4689N4721l8346
14117c7310j7131R0869P0711j3321j1615j05829q6727m7069P4015R4127k4636
14106a3916l0180O0566P1658R6546m1272j15770Q2547P0372j18822K5209o013
14095H0925j19804o9009Q601k7630n1603J08005N5606l8409k1963M7877J75192
$$ y = [-290609, -150221, -86729, -130744, -205103, -192428, -105899, -98606, -129973, -122515, -58156, -28767, -15419, 74974, 99607, 37374, 51858, -32132, -88907, 30792, 95812, 69174, 116712, 52236, 58047, 82679, -19521, -129592, -242897, -216770, -74523, -8052, -60492, -87908, -133886, -68312, -109794, -159701, -224511, -204209, -20718, -2381, -92462, -16388, 75607, 34043, -24723, 2823, -81224, -145455, -226630, -192321, -155870, -81692, 1004, -53685, 1036, -37310, -54441, 36428, 107139, 93818, 82203, -23626, -110353, -157422, -83407, 10720, -13916, -44096, 16470, 88128, 184674, 143402, 27632, 110179, 180551, 61729, 86938, 80925, -38879, -107888, -99287, -126917, -178520, -70515, -14909, -53318, -75281, -27404, 147788]
14084A47788L3330j4679j42480j3240j6572m0732n1895J39787P0185k2649o0313
14073B8530l1518l4103P1973l8749K2158m2942L8053K6923l8469J158M9586n1306
14061A294j4140o431q5032M6104K2558M4361j05128p1534N467j4335K0287Q3079
14049g3450J854n6707p4056L6218L1387p4903K5455J55179R378l7087N420q8437
14037a39749O5505N5019L5438J8591J3133o8454m1679N2646Q5413p277n9823l4734
14025b5971j9047K1417o3979J8079l7712N9492m6730m4520n3620j3753J9903m7931
14013b34372Q2941J14700l43M4082J7428N5905o6377p9244K5901N1769j2799o6681
14001f7090k1603j2105P2656n7427J2060j2810j30474q2773Q4108O3643j639M8732
$$ y = [147788, 181118, 166439, 23959, 10719, -5853, -46585, -98480, 41307, 111492, 88843, 28530, -2988, -37091, 34882, -3867, 18291, -24651, 13402, 40325, 1856, 3014, 52600, 1294, -12846, -19277, -104309, -58205, -35647, 8714, -96414, -167948, -162481, -176816, -156529, -73450, -71596, -128303, -202359, -166141, -134754, -209657, -184202, -29023, -19645, -56732, -51312, -139749, -74244, -19225, 16213, 34804, 47937, -20517, -62196, -9550, 75863, 68586, 8763, -25971, -45018, -23601, -87580, -69501, -107213, -47721, -94451, -138971, -192591, -206344, -186441, -234372, -151431, -36731, -37074, 7008, 24436, 80341, 13964, -65280, -39379, 12390, -409, -67090, -88693, -100798, -28142, -85569, -73509, -86319, -216793, -299566, -215458, -151815, -153454, -104722]
13989a04722J19418K01o8638q9935k6529J81Q0785L4065j0211k3575j1578P9449
13977b1089N2517j580M7146k9442j226Q544j48705m1960M7613k4742L700M1451
13965f7773M0137N6577J5325K3149K0356q0124j1355L2949n64n4701p3262m5504
13953a44790M5626r5450o009M5701J45102K7721n5373l0755M1999J979P642o0775
13941g7382M7448k9262m9746K4633J8365J7269l983M9035Q8216n2212j03763k3598
13929i4980L8589n6703r530M176r308K2515L4942Q195L2299M9303l8011M0964
13917B2451k5495k4498O7864m4242K2370l6934N2940J03394n9599l0362j5256
13906C2633k730j1576m0389p9023j70688L0750O8586J03350L405p0572q765O2015
$$ y = [-104722, 14696, 14897, -53741, -143676, -170205, -170024, -89239, -55174, -65385, -88960, -100538, -21089, 31428, 29848, 76994, 47552, 46326, 54870, -93835, -135795, -88182, -112924, -109224, -67773, -27636, 28941, 44266, 67415, 87771, 7647, -3708, 29241, 28677, -26024, -99286, -144790, -99164, -194614, -200623, -154922, -9820, 17901, -37472, -68227, -26228, -24249, -16607, -77382, -29934, -59196, -108942, -84309, -65944, -48675, -52658, -3623, 84593, 32381, -71382, -94980, -56391, -113094, -122624, -118448, -127756, -105241, -70299, -62104, -29805, 19498, -18513, 22451, -3044, -27542, 40322, -3920, 18450, -18484, 34456, 137850, 78251, 47889, 32633, 29903, 18327, -22062, -101085, -271773, -241023, -172437, -69087, -65682, -136254, -145019, -83004]
13894h3004m8036k451K6207K4818J11762k4517p7851l4473p851J17520M5044K6126
13882G3294N2076P3336o4355r8377j25528j3534Q5266j7352J3281L4222J0902
13871B3231k2833j9953l6156m7688p344m2296L0693P0153j3077l6692j6831M8127
13859g0666K9481K3399p432L7190J7532j11337l4095r7300m6347L8384O5381K5592
13847a30218k5854O0070p9744L5761K8653N9563n3060m0746J6351J3070J6591
13836i9563L2159O0659n893j9416l2318q8354r6028k8136J01122j7j0723O7563
13824a18945L1140p565R1885j9908p8131m7861L124R087P5072m0804J2888M0700
13812d9318P3571K4549l718l7715k1130K8555m9276K0413N0312L5503n4208J6415
$$ y = [-83004, -131040, -133491, -107284, -82466, 29296, 4779, -73072, -107545, -115396, 2124, 47168, 73294, 125370, 198706, 134351, 35974, -89554, -103088, -17822, -35174, -21893, 12329, 23231, 398, -19555, -55711, -103399, -110743, -153039, -122346, -52193, -65270, -101962, -118793, -70666, -41185, -17786, -25218, 11972, 29504, -81833, -115928, -213228, -259575, -221191, -155810, -130218, -156072, -96002, -175746, -139985, -111332, -51769, -104829, -145575, -129224, -116154, -99563, -67404, -6745, -12638, -32054, -64372, -152726, -248754, -276890, -175768, -175785, -186508, -118945, -87805, -95370, -3485, -23393, -101524, -149385, -146261, -137174, -62102, -102906, -90018, -49318, 24253, 48802, 45084, 7369, -13761, 14794, -34482, -14069, 36243, 71746, 17538, 33953]
13800C3953J7528n3710L410K0387p2148j2796o7883N2281O263J2203O2p810j750
13787g0010N0717K6185j19719l6034Q3114K3498P20L4927J20216m9061l2442q0920
13775d8809q8962k8885J3261J06973J8859l5034M9583J6365M3538l6860K55K3416
13763C3700N705n7329n8074N8429m7104K7428p3108o3408K0092J4882N5054L4626
13751d9107P6623j7218n509J5245N8828m9861q8181n9032L4911J0511m3812k8506
13739a45108L7371P0647K5378o4227p9648J9961M4917n3242M666M2170P388K91
13727h9436N1849k9208o7990Q0252P3755j4710L7974Q0917L8901q9418r4652l2691
13715e4457j8526k5864k3779l991L1680k3991n6349L9962R8763J26061r5751L9996
$$ y = [33953, 51481, -2229, 1181, 21568, -50580, -63376, -131259, -78978, -72715, -60512, -60450, -68260, -70010, -19293, 6892, -112827, -148861, -65747, -42249, -41529, -6602, 113614, 64553, 32111, -48809, -137771, -166656, -153395, -46422, -27563, -62597, -13014, 3351, 46889, 10029, 10284, 33700, 39405, -17924, -75998, -17569, -64673, -37245, -110353, -173761, -153669, -138787, -83733, -49107, 27516, 10298, 4789, 20034, 78862, 29001, -59180, -118212, -83301, -72790, -116602, -145108, -107737, -37090, -11712, -75939, -155587, -135626, -90709, -143951, -139285, -97115, -89727, -89436, -37587, -66795, -134785, -54533, 19222, 4512, 42486, 123403, 162304, 72886, -21766, -54457, -72983, -98847, -122626, -126617, -94937, -118928, -175277, -135315, -36552, 89509, -6242, 33754]
13703C3754J20889J6005L2947j54083j62930k884J9137l1707m1808R1848M8659
13692c0173k7079o9428q4415K2699M9952k878J3292N3497P153k7203J0945M5138
13680c8500j3632J2695J7183j7948R573l4320K9959m7537Q929m8951K8997O4482
13668b9070K979j6906q097j8862p6006P4697K0421O3241j9651k2747M5588L0825
13656D6412p7429o6535K5024j00996N8368L6910m246Q1224q5623k1470k0658j04446
13644b33465o7910R6916N7815p6239n655o843J20716J40887j06135j8129l8643
13633a36685m4914k7704L9648O7157q1300J2418J6531M777J3927N8767L74P7283
13621B79o3743j785M7776k6066m6063L6811j9716L3944J1053j03369k0253N5840
$$ y = [33754, 154643, 170648, 203595, 49512, -113418, -116302, -97165, -128872, -170680, -78832, -30173, -57252, -126680, -211095, -188396, -138444, -141322, -128030, -74533, -67380, -94583, -83638, -38500, -52132, -39437, -22254, -40202, -30629, -64949, -34990, -82527, -73598, -122549, -93552, -29070, -26091, -42997, -51094, -69956, -145962, -71265, -50844, 12397, -7254, -30001, 15587, 46412, -31017, -97552, -72528, -173524, -115156, -78246, -82492, -1268, -86891, -108361, -129019, -233465, -301375, -204459, -146644, -222883, -228538, -235381, -114665, 26222, -79913, -98042, -136685, -181599, -209303, -169655, -102498, -183798, -171380, -154849, -150072, -136145, -77378, -77004, 279, -63464, -65249, -17473, -43539, -89602, -52791, -72507, -38563, -27510, -130879, -151132, -95292]
13609i5292N7744J3069J9678K5760o449q7574K5786m7468r7811r7667M280O1622
13597b24322Q9531K3274K6047P7422N4837p9879K8574N9254K3954J4239n9360
13586C3571L4720N0898l1448j27096l5101R3950M7583L2092o8419J9959m6638
13575D071m9404M3051m1874k5879l8588J1960J9127M0828K9286j62592l9080m799
13563b13893j0223K4922Q0326k2835L6835P6529L6915l1283l3588j0503k3463
13552i0261n620q1009q1978K5640O5177J32278L0231k7526P7502J1819o2907k1638
13540b8292o4904J19394O7780j40537o9292M8222K6082q5608k6326N7133J18758
13529B2410K2431j3063n8611j16950M3612P9520n4959l9916j6709k2337J9614
$$ y = [-95292, -37548, -24479, -4801, 20959, 14510, -73064, -47278, -94746, -192557, -290224, -285944, -224322, -134791, -111517, -85470, -8048, 46789, -33090, -4516, 54738, 78692, 92931, 33571, 68291, 119189, 87741, -39355, -74456, 19494, 67077, 99169, 30750, 50709, 4071, -45333, -2282, -44156, -70035, -108623, -96663, -77536, -36708, -7422, -170014, -209094, -213893, -224116, -199194, -118868, -141703, -104868, -28339, 8576, -22707, -56295, -66798, -90261, -95881, -176890, -258868, -233228, -168051, -35773, -5542, -33068, 44434, 56253, -6654, -28292, -93196, 26198, 93978, -46559, -115851, -67629, -41547, -127155, -153481, -96348, 22410, 44841, 31778, -26833, -143783, -100171, -20651, -75610, -115526, -132235, -154572, -134958]
13518a34958m2515n2166J1809J45896P0503L9973m6608J2902O8051O956k3134
13507E6709p0164m9891o4104p9419p8759q489P6294N6691J32638n4382n729N1220
13495c7385o6324L9875J6607k2849J3275p1639P1048k3123j1250J4927l593M0367
13483d0064p478p0350n0711N6861O4285K7780m210o901m3804l1209P1617M9508
13471A5324M7849Q737l6924n5408n871P6476P1024J0455j5063q0943L620k8218
13459A1058j4869j8829J7938O2846l4949o0646q1707n8096l2082J28110R7661
13448A6435R997m5994l504J0136J8153n8295k1113j0536l3619L2706N7444j27388
13436a55578r0190K0902M8547P8620n2773m4926p5530j4669N5076j4611L7620
$$ y = [-134958, -177473, -229639, -217830, -71934, -1431, 38542, -8066, 4836, 72887, 79843, 56709, -13455, -63346, -127450, -206869, -285628, -294117, -217823, -161132, -28494, -82876, -88605, -37385, -103709, -63834, -47227, -70076, -56801, -128440, -57392, -80515, -91765, -76838, -80431, -40064, -47542, -117892, -168603, -111742, -47457, -19677, -23887, -30788, -74592, -105801, -34184, 15324, 63173, 71910, 34986, -20422, -26293, 50183, 121207, 131662, 116599, 35656, 39276, 11058, -3811, -22640, -4702, 58144, 23195, -37451, -119158, -177254, -209336, -81226, 16435, 26432, -19562, -23066, -12930, 5223, -53072, -74185, -84721, -118340, -85634, -28190, -155578, -245768, -224866, -176319, -97699, -150472, -195398, -270928, -285597, -230521, -245132, -207512]
13425b07512K6620K3718M2987p6368j06630K9270J79685N3283k0647K7225J158
13414b7211j46518r6319j5804J7976Q1683M1544J566L2102J0145Q41j5750J17261
13402A516M1936p2458J074L0197p525O4836j6271q296Q985K3742k8100j0293J9607
13389D8950l2004j5453o8696j44548j1514R892M2270Q8258J31042m859j22807
13378g9469m2131o111L1762l4957Q912J09814K1989N931o353k9860j41320l7838
13366a99631o9369m641J16021P0013m6671M0534n0996m3640j7637N2871k7261
13355a80407N368l8871j2455j4232K234P5100O1909K5198P9058j5589L5682J36068
13343A59063k8923l6350q2651J9240n6499l5567m8755q9782r3444k6965R8366
$$ y = [-207512, -180892, -157174, -114187, -190555, -297185, -267915, -88230, -34947, -55594, -28369, -27211, -173729, -270048, -285852, -267876, -186193, -144649, -143083, -110981, -100836, -99995, -115745, 1516, 43452, -29006, -27932, 2265, -5260, 59576, 43305, 35009, 43994, 67736, 39636, 29343, 48950, 16946, 1493, -67203, -211751, -223265, -213373, -171103, -82845, 48197, 43338, -79469, -121600, -127711, -95949, -130906, -121994, -12180, 9809, 15740, 9387, -20473, -161793, -199631, -269000, -273641, -157620, -87607, -134278, -93744, -144740, -188380, -206017, -153146, -180407, -175039, -213910, -226365, -240597, -238363, -163263, -101354, -76156, 2902, -12687, 22995, 159063, 130140, 93790, 11139, 30379, -26120, -61687, -110442, -200224, -293668, -320633, -222267]
13332b22267N6588J13355K4418q3880J4788j911j09052l0163M1475M7985R0483
13321e8181j9876k9846J7919R0694P0453p0807n6562R305K5981J828q106p3367
13309a00565p6509p0854P4631J0417n249k9956J1417M1050n2971N5049l8199m9887
13297b31626O3433Q9718K268k9692n7328l5500m6562R6721M1167L3198J13157
13286C8954P442j2837l0053j2669J3984r0547r0409J8355J267L3878J21440O3271
13274F2076M6486N9138j66628j19225N402l7055M1149J282l2034O1478P342J139
13262f9450L2672j5308O4913p9123j27648R314J36089q091m8527K062m822l8495
13250a46414r165l7959K522J15010J30166J9734k0451J6094l7186l4595k1141
$$ y = [-222267, -165679, -52324, -27906, -111786, -96998, -98909, -207961, -238124, -196649, -148664, -58181, -78057, -107903, -89984, 710, 71163, 356, -56206, -46901, -20920, -19092, -27198, -100565, -177074, -247928, -173297, -162880, -168129, -198085, -186668, -145618, -198589, -143540, -181739, -231626, -168193, -78475, -76207, -105899, -163227, -198727, -245289, -148568, -107401, -74203, 38954, 46396, 33559, 3506, -9163, 4821, -85726, -176135, -157780, -156513, -122635, -1195, 62076, 108562, 167700, 1072, -118153, -112751, -149806, -108657, -107375, -139409, -77931, -70589, -69450, -36778, -52086, 12827, -66296, -193944, -184630, -48541, -56632, -105159, -103097, -107919, -146414, -155579, -193538, -191016, -76006, 54160, 73894, 53443, 69537, 32351, -2244, -23385]
13239b3385M2779J11668P563r2169J4471o1065N1457k4373p9819k3862m856J24670
13227D3079p6983r7471J07764K5888j01892m7212K478L9872q4396P899N4819L2010
13215i4145n346k7520J7115J9942O160r885j686Q0360J120j33420J7468Q0408
13203d9429R2998l2451o8500M3249n0768p2731K8175M8014O3177j01163j6679
13192a16108o2044K9333j0958K8082O8576J10657q6249K5119l7059m1555O4628
13181b7578J20695l5204l0234p6718k105J9409N3813n6748r9670n0386Q0215N2213
13169e2298N1083J9052q1028o2460J0457J6132L7966J477O0944r341q2396j8274
13157a08686p7473k268N0798l8462J4621j9014o5661k5454J3793O6018l818l8481
$$ y = [-23385, 19394, 131062, 138625, 46456, 60927, -138, 51319, 26946, -52873, -76735, -81591, 43079, -33904, -131375, -23611, 2277, -99615, -146827, -144349, -104477, -188873, -180974, -126155, -94145, -99491, -127011, -109896, -89954, -83794, -93679, -95365, -15005, -13885, -147305, -129837, -49429, 43569, 11118, -57382, -14133, -64901, -137632, -109457, -61443, 1734, -99429, -116108, -178152, -148819, -159777, -131695, -63119, 47538, -38711, -13592, -50651, -92206, -27578, 93117, 57913, 27679, -49039, -51144, -31735, 22078, -34670, -134340, -184726, -104511, -52298, -1215, 17837, -63191, -125651, -115194, -99062, -61096, -59619, 1325, -8016, -90412, -108686, -186159, -188427, -137629, -176091, -161470, -180484, -246145, -271599, -257806, -191788, -195606, -234087]
13145b34087J0783n911Q1242J60047L8757o1301r5165J3425k2766q152l3976r750
13133a66854r334O1552J06771r5140k7895J9933l7529L5042k9291k6136n2959
13122b21840N6187P4079J8213j00408n9028J10861j0223j9397J4410N64N715k1316
13110a52183K9871N5409L2189M0343m8641j4638j1710j2645l2493L727N5938O9561
13098A4728K8381K962M013l4444j24953j12974M8203M8226K7021J4965r1259N5568
13086a19563l766k7480N3188l6783j2144Q1996q4043R285Q0435P4003K5858o4352
13074b3366j7569n1921J5965J06665J879q9192q3642l321M9832M6404L8019j1942
13062b2189n5672p8729N8466L2838n7019O5984O0724l752n4109J0064Q981J7602
$$ y = [-234087, -223304, -229215, -147973, 12074, 50831, -10470, -105635, -92210, -114976, -123128, -157104, -166854, -176188, -114636, -7865, -103005, -130900, -110967, -148496, -113454, -142745, -168881, -221840, -165653, -91574, -73361, -173769, -232797, -121936, -132159, -151556, -137146, -136582, -130867, -152183, -122312, -66903, -34714, 5629, -43012, -57650, -69360, -82005, -114498, -110771, -54833, 14728, 43109, 46071, 50084, 15640, -109313, -222287, -174084, -125858, -98837, -83872, -175131, -119563, -123329, -150809, -97621, -134404, -146548, -64552, -148595, -139310, -58875, 15128, 40986, -23366, -40935, -92856, -76891, 29774, 31653, -57539, -141181, -144502, -94670, -48266, -10247, -22189, -77861, -156590, -98124, -65286, -122305, -56321, 4403, 651, -53458, -43394, -34413, -16811]
13050a6811j3732q3992J5560M7166N7690R0538m6947o8851o357j42736J7471Q7231
13038f3770Q6456l1909j29616j02058j1509P0526J02783Q3250K0510o2530m1665
13027g9532l9122J776L6725N1616k6618o4104n7923m0289l4430j1536J2207p61
13015b51991o527o77J8569M1031R1122J03560J6810o4239J11460P5387q7365M6379
13003I3519r998o9281k8324m1168j00550J11931K5207j77319J5922J15965n762
12992f9858J6092o0577l3211K943j6487P199P645j8457j7469N5149M2508Q660
12980g5863J6282r5476o0334R9571P8313L7073j557K3974k6002q6797K9292P5435
12968A3911o5442o7879l1569L6823L1733N472M4729m5756m6949J2367N0922P8676
$$ y = [-16811, -30543, -114535, -98975, -51809, 5881, 96419, 49472, -19379, -25736, -168472, -151001, -63770, 22686, -9223, -138839, -240897, -252406, -181880, -79097, 4153, 24663, -37867, -79532, -118654, -116878, -80153, -28537, -55155, -119259, -177182, -217471, -251901, -263437, -251230, -251991, -258518, -259195, -240626, -199595, -108473, -4913, 11897, -52342, 59118, 134505, 47140, 93519, 83521, 14240, -14084, -55252, -155802, -43871, -18664, -195983, -180061, -64096, -69858, -53766, -114343, -147554, -144611, -161098, -153899, -146254, -164711, -182180, -127031, -84523, -75863, -59581, -155057, -215391, -115820, -37507, -434, -1991, 21983, -4019, -90816, -61524, 13911, -51531, -119410, -150979, -114156, -82423, -76951, -32222, -77978, -124927, -112560, -61638, 17038]
12956A7038k6799l981n6874k8191O0265r2275o6637K4854k899j9287J4079J18975
12944f1732R3707r7389j8817R86n1819o3503M3624M7856j4285l4504q9392k9303
12932b74571M8364j5590L8158J9398r97l9660M1941R9686Q4280k2142p9077J0081
12920i0129p9545k1330J58383L3400k6927Q6498p9654j14365q5607Q1413J48964
12909A1101N7371n8691r941Q6573o6123j09041o990j3218q7278K7607O3488p136
12897a12278L0107K9493l6123N5188r3093l5450J06469p3384n9774J33601N3850
12886a394q4090p0580J8277M7831r028J2102J653j8156N6053J5225K7974K8539
12874B4406l5262p6309M5557k7242l2012q4028J6076M1385k0344m4839M8132N9401
$$ y = [17038, -9761, -13742, -70616, -98807, -38542, -130817, -197454, -172600, -175499, -194786, -180707, -61732, 31975, -65414, -84231, -83245, -135064, -198567, -154943, -107087, -121372, -155876, -245268, -274571, -226207, -241797, -203639, -184241, -185238, -224898, -182957, -83271, 1009, -21133, -100210, -90129, -169674, -191004, -32621, 779, -26148, 60350, -19304, -133669, -219276, -137863, 11101, 68472, 9781, -160, 86413, 20290, -88751, -95741, -108959, -196237, -168630, -105142, -112278, -82171, -52678, -88801, -33613, -126706, -162156, -55687, -129071, -188845, -55244, -1394, -85484, -156064, -137787, -89956, -98984, -86882, -85229, -103385, -47332, -32107, -4133, 24406, -10856, -87165, -41608, -68850, -100862, -184890, -168814, -127429, -147773, -192612, -144480, -85079]
12862h5079L2890J24659J725m098o1204K9339k9920R8790M1214r36n2111o0862
12850C4407j71579q7782L2599P2221R9057l830l8635k9516O2276m6129m0180L9657
12838g7434L7825l9900l4727J1937o5157R1862P4376O093o9156L6667l441R3180
12826F2125m8239p6356p4898P4839N1301j496p2147n106J5415R316N0033K6625
12814A1412m7824N4664N188m1345L259q5088O0576J8735N9588L6289l1136j00828
12802e6510J7509K5051r557q6413j7785L1049j1758K3246k1290J5783m8201j11059
12790b49935L3612J38038K3846J2855k4278l3319l4349k5030Q4868J40965n4460
12779A2813o9234M7752m6553k5109N4965p4049r2830J0560M4629j2384K1847Q0532
$$ y = [-85079, -52189, 72470, 74195, 70097, 8893, 38232, 8312, 107102, 148316, 147380, 95269, 34407, -137172, -224954, -192355, -120134, -21077, -24907, -63542, -93058, -30782, -76911, -117091, -77434, -39609, -79509, -114236, -102299, -167456, -75594, -1218, 4875, -64281, -27614, -31055, 62125, 13886, -62470, -137368, -62529, -11228, -12724, -84871, -89977, -74562, -65246, -15213, 11412, -36412, 18252, 23440, -17905, -14646, -99734, -39158, -20423, 39165, 75454, 44318, -56510, -39001, -13950, -23507, -109920, -127705, -96656, -108414, -85168, -106458, -90675, -138876, -249935, -216323, -78285, -54439, -41584, -65862, -99181, -133530, -158560, -73692, 67273, 12813, -56421, -8669, -55222, -80331, -25366, -99415, -192245, -181685, -137056, -149440, -127593, -47061]
12767d7061J01629M6277L2932r8354o903j15295K3548m0936J0596K9035p2205
$$ y = [-47061, 54568, 100845, 133777, 35423, 28520, -86775, -63227, -104163, -93567, -64532, -136737]
$$ [...]
##END NTUPLES=NMR SPECTRUM
##END=
