##TITLE=Analysis number 326625
Compound Code cc 04126
Book Reference 449/194
Project Code adrs
Chemist Name davee
##JCAMPDX= 6.0         $$ Bruker NMR JCAMP-DX V2.0
##DATA TYPE= NMR SPECTRUM
##DATA CLASS= NTUPLES
##ORIGIN= Bruker BioSpin GmbH
##OWNER= nmr
$$ XWIN-NMR		Version 3.5
$$ Thu Feb 15 13:31:53 2007 GMT Standard Time (UT+0h)  MAYBRIDGE\nmr@NMR_250MHZ
##.OBSERVE FREQUENCY= 250.131544655141
##.OBSERVE NUCLEUS= ^1H
##.ACQUISITION MODE= SIMULTANEOUS (DQD)
##.ACQUISITION SCHEME= undefined
##.AVERAGES= 16
##.DIGITISER RES= 18
##SPECTROMETER/DATA SYSTEM= dpx250
##.PULSE SEQUENCE= zg30
##.SOLVENT NAME= CDCl3
##.SHIFT REFERENCE= (INTERNAL, CDCl3, 0, 16.522)
##AUDIT TRAIL= $$ (NUMBER, WHEN, WHO, WHERE, WHAT)
$$ ##TITLE= Audit trail, XWIN-NMR		Version 3.5
$$ ##JCAMPDX= 5.01
$$ ##ORIGIN= Bruker BioSpin GmbH
$$ ##OWNER= nmr
$$ C:\u/data/dgb/nmr/ADRS/1030/pdata/1/auditp.txt
$$ ##AUDIT TRAIL=  $$ (NUMBER, WHEN, WHO, WHERE, WHAT)
(   1,<2007-02-15 13:31:34.72 +000>,<MAYBRIDGE\nmr>,<NMR_250MHZ>,
      <created by zg, POWCHK disabled, PULCHK disabled
       configuration hash MD5:
       49 4B E0 1D 92 C2 6B 37 9F E6 65 BC 52 41 86 1D
       data hash MD5: 64K
       A2 21 C6 25 8A DD FD DE F5 45 66 CC B0 8E 48 F7>)
(   2,<2007-02-15 13:31:45.71 +000>,<MAYBRIDGE\nmr>,<NMR_250MHZ>,
      <Start of raw data processing
       ef LB = 0.3 FT_mod = 6 PKNL = 1 SI = 32K 
       data hash MD5: 32K
       BB 80 01 03 43 5E E7 F1 23 A6 74 93 64 7A 09 EA>)
(   3,<2007-02-15 13:31:47.44 +000>,<MAYBRIDGE\nmr>,<NMR_250MHZ>,
      <apk 
       data hash MD5: 32K
       00 80 2E E6 0F 55 7B 71 AF 3E E7 0C D1 EB 20 B4>)
(   4,<2007-02-15 13:31:48.19 +000>,<MAYBRIDGE\nmr>,<NMR_250MHZ>,
      <abs ABSG = 5 
       data hash MD5: 32K
       95 71 BA 4E B3 13 BF 1A 2A F7 DD 3D E5 BD 47 43>)
$$ ##END=
$$ 
$$ hash MD5
$$ 4C 42 B5 D1 26 52 19 E1 F5 64 7F 40 83 F8 C0 44
##$RELAX= 
##$RELAX= 
##$RELAX= 
##$RELAX= 
##$RELAX= 
##$RELAX= 
##$RELAX= 
$$ Bruker specific parameters
$$ --------------------------
##$DU= <C:\u>
##$EXPNO= 1030
##$NAME= <ADRS>
##$PROCNO= 1
##$TYPE= <nmr>
##$USER= <dgb>
##$AMP= (0..31)
100 100 100 100 100 100 100 100 100 100 100 100 100 100 100 100 100 100 
100 100 100 100 100 100 100 100 100 100 100 100 100 100 
##$AQSEQ= 0
##$AQ_mod= 3
##$AUNM= <au_zg>
##$AUTOPOS= <44 >
##$BF1= 250.13
##$BF2= 250.13
##$BF3= 250.13
##$BF4= 250.13
##$BF5= 500.13
##$BF6= 500.13
##$BF7= 500.13
##$BF8= 500.13
##$BYTORDA= 1
##$CFDGTYP= 0
##$CFRGTYP= 5
##$CHEMSTR= <none>
##$CNST= (0..31)
1 1 145 1 1 1 1 1 1 1 1 1 1 1 1 1 1 1 1 1 1 1 1 1 1 1 1 1 1 1 1 1 
##$CPDPRG= <>
##$CPDPRG1= <>
##$CPDPRG2= <>
##$CPDPRG3= <>
##$CPDPRG4= <mlev>
##$CPDPRG5= <mlev>
##$CPDPRG6= <mlev>
##$CPDPRG7= <mlev>
##$CPDPRG8= <mlev>
##$CPDPRGB= <>
##$CPDPRGT= <>
##$D= (0..31)
0 1 0 0 0 0 0 0 0 0.06 0 0 0 0 0 0 0.0002 0 0 0 0 0 0 0 0 0 0 0 0 0 0 
0 
##$DATE= 1171546293
##$DBL= (0..7)
120 120 120 120 120 120 120 120 
##$DBP= (0..7)
150 150 150 150 150 150 150 150 
##$DBP07= 0
##$DBPNAM0= <>
##$DBPNAM1= <>
$$ [...]
##$SUBNAM7= <"">
##$SUBNAM8= <"">
##$SUBNAM9= <"">
##$SW= 20.6930455092707
##$SWIBOX= (0..15)
0 0 3 0 0 0 0 0 0 0 0 0 0 0 0 0 
##$SW_h= 5175.983436853
##$TD= 65536
##$TD0= 1
##$TE= 295.16
##$TE2= 300
##$TE3= 300
##$TEG= 300
##$TL= (0..7)
0 120 120 120 120 120 120 120 
##$TP= (0..7)
150 150 150 150 150 150 150 150 
##$TP07= 0
##$TPNAME0= <>
##$TPNAME1= <>
##$TPNAME2= <>
##$TPNAME3= <>
##$TPNAME4= <>
##$TPNAME5= <>
##$TPNAME6= <>
##$TPNAME7= <>
##$TPOAL= (0..7)
0.5 0.5 0.5 0.5 0.5 0.5 0.5 0.5 
##$TPOFFS= (0..7)
0 0 0 0 0 0 0 0 
##$TUNHIN= 0
##$TUNHOUT= 0
##$TUNXOUT= 0
##$USERA1= <user>
##$USERA2= <user>
##$USERA3= <user>
##$USERA4= <user>
##$USERA5= <user>
##$V9= 5
##$VALIST= <valist>
##$VCLIST= <CCCCCCCCCCCCCCC>
##$VD= 0
##$VDLIST= <DDDDDDDDDDDDDDD>
##$VPLIST= <PPPPPPPPPPPPPPP>
##$VTLIST= <TTTTTTTTTTTTTTT>
##$WBST= 1024
##$WBSW= 4
##$XGAIN= (0..3)
0 0 0 0 
##$XL= 0
##$YL= 0
##$YMAX_a= 336311
##$YMIN_a= -404461
##$ZGOPTNS= <>
##$ZL1= 120
##$ZL2= 120
##$ZL3= 120
##$ZL4= 120
##$ABSF1= 16.522
##$ABSF2= -4.171173
##$ABSG= 5
##$ABSL= 3
##$ALPHA= 0
##$AQORDER= 0
##$ASSFAC= 0
##$ASSFACI= 0
##$ASSFACX= 0
##$ASSWID= 0
##$AUNMP= <proc_1d>
##$AZFE= 0.1
##$AZFW= 0.1
##$BCFW= 0
##$BC_mod= 0
##$BYTORDP= 0
##$COROFFS= 0
##$CY= 12.5
##$DATMOD= 1
##$DC= 0
##$DFILT= <>
##$DTYPP= 0
##$F1P= 14.0000005364418
##$F2P= -0.99999901652339
##$FCOR= 0.5
##$FTSIZE= 32768
##$FT_mod= 6
##$GAMMA= 0
##$GB= 0
##$INTBC= 1
##$INTSCL= 1
##$ISEN= 128
##$LB= 0.3
##$LEV0= 0
##$LPBIN= 0
##$MAXI= 10000
##$MC2= 0
##$MEAN= 0
##$ME_mod= 0
##$MI= 0
##$NCOEF= 0
##$NC_proc= -5
##$NLEV= 6
##$NOISF1= 0
##$NOISF2= 0
##$NSP= 0
##$NTH_PI= 0
##$NZP= 0
##$OFFSET= 16.522
##$PC= 1
##$PHC0= 224.3398
##$PHC1= 15.05841
##$PH_mod= 1
##$PKNL= yes
##$PPARMOD= 0
##$PSCAL= 4
##$PSIGN= 0
##$REVERSE= no
##$SF= 250.13
##$SI= 32768
##$SIGF1= 0
##$SIGF2= 0
##$SINO= 400
##$SIOLD= 32768
##$SREGLST= <1H.CDCl3>
##$SSB= 0
##$STSI= 32768
##$STSR= 0
##$SW_p= 5175.98343685301
##$SYMM= 0
##$S_DEV= 0
##$TDeff= 65536
##$TDoff= 0
##$TI= <Analysis number 999999
Compound Code 99
Book Reference 9
Project Code 9>
##$TILT= no
##$TM1= 0
##$TM2= 0
##$TOPLEV= 0
##$USERP1= <user>
##$USERP2= <user>
##$USERP3= <user>
##$USERP4= <user>
##$USERP5= <user>
##$WDW= 1
##$XDIM= 32768
##$YMAX_p= 392521170
##$YMIN_p= -929271
$$ End of Bruker specific parameters
$$ ---------------------------------
##NTUPLES= NMR SPECTRUM
##VAR_NAME=  FREQUENCY,     SPECTRUM/REAL,   SPECTRUM/IMAG
##SYMBOL=    X,             R,               I
##VAR_TYPE=  INDEPENDENT,   DEPENDENT,       DEPENDENT
##VAR_FORM=  AFFN,          ASDF,            ASDF
##VAR_DIM=   32768,         32768,           32768
##UNITS=     HZ,            ARBITRARY UNITS, ARBITRARY UNITS
##FACTOR=    0.157963299565203, 1,           1
##FIRST=     4132.6476996994, 0,             0
##LAST=      -1043.33573715361, 0,           0
##MIN=       -1043.33573715361, -929271,     0
##MAX=       4132.6476996994, 392521170,     0
$$ Real data points
##PAGE= N=1
##DATA TABLE= (X++(R..R)), XYDATA
$$ [...]
26880A15549j7161r8222j8599L6177O4687l3434j50094k0008m1185m3923K3988
26869a82225r7099q3155J06496J11221P4029P0504M1457l8385P3178L1859j39912
26858c2032k214k5593m0122Q5073O2058P2554M7228l1751q6776q796Q8808k13246
26846h4809m3111K06005P0113J6306N4401m2866R276l3954m8625j41683m4858
26835h3805m119O8047Q5863P2066M5879n0507K1188p4937j84802p9453L6330N4312
26823i3938l6278j41052k3884Q8765J13245j07033k3095k5171N6956J15732q0408
26812a56161j88452n4861N1530M2439r8258P5241R9042L4382l2114K6709K7694
26801a72809J15772J07688l3839l8694l4926r6590l959j7065O8647L0830J30275
$$ plain form
26880 115549 98388 166 -18433 17744 82431 48997 -101097 -121105 -162290 -206213 -182225
26869 -182225 -279324 -362479 -255983 -144762 -70733 -229 41228 2843 76021 107880 -32032
26858 -32032 -34246 -59839 -99961 -14888 47170 119724 166952 135201 48425 39629 128437 -84809
26846 -84809 -127920 78085 148198 164504 218905 176039 185315 151361 102736 -38947 -83805
26835 -83805 -87924 -19877 65986 138052 183931 133424 154612 79675 -105127 -184580 -148250 -93938
26823 -93938 -130216 -271268 -295152 -206387 -93142 -200175 -223270 -248441 -191485 -75753 -156161
26812 -156161 -344613 -399474 -347944 -305505 -403763 -328522 -229480 -195098 -227212 -200503 -172809
26801 -172809 -57037 50651 16812 -21882 -56808 -153398 -157357 -174422 -105775 -74945 55330
26790E5330m7009N4160N7329k4758j63498L0545k2657Q4443o2656j37127n4018
26779b29916J07380J09436m0372n8701j2468L3042J0332l8139n7210k1676J5684
26768a82608P4613P9382P6983m3321k3882J11424r473o4346j01539j28538J7044
26757a94261J30655l2651J3217n3244L9208R8584R1116r5869q9429P1538M195
26746a6941L1980Q9306j55283J2869K71281k983j45926j6050O9748n5756k06614
26735a24369r5412L4924J22373J28941R6152n1833n6905J20800q1914q0793n5198
26724d3234J4746N2052j28843n7715K1034o3190K8753J29505K6799k6062k1572
26713f7727K5106K1521r9180l2791J20735L0142M6917J42306m8083p5489J2696
$$ plain form
26790 55330 8321 62481 119810 95052 -68446 -37901 -60558 23885 -38771 -175898 -229916
26779 -229916 -122536 -13100 -53472 -112173 -124641 -91599 -81267 -119406 -176616 -198292 -182608
26768 -182608 -107995 -28613 48370 5049 -18833 92591 83118 18772 -82767 -211305 -194261
26757 -194261 -63606 -96257 -83040 -136284 -97076 1508 92624 -3245 -92674 -21136 -16941
26746 -16941 15039 104345 -50938 -38069 233212 230229 84303 68253 138001 82245 -124369
26735 -124369 -219781 -184857 -62484 66457 162609 110776 53871 174671 92757 11964 -43234
26724 -43234 -28488 23564 -105279 -162994 -141960 -205150 -176397 -46892 -20093 -46155 -67727
26713 -67727 -42621 -21100 -120280 -153071 -32336 -2194 44723 187029 138946 63457 76153
26702G6153l1760o1738j21273L8157N8813p906L4253O0347J31889o6469j31486
26691b1020L1671L2311q3957Q0788R2832j34664j83752n4677K19555J52528n7402
26680G4213J3643k2004r5688m2234K89276K1816m5634o5837p5139k094P2647J77539
26668C00504Q0462k53187j22480K3733k9736M70J17594k6786q3176J17032P3156
26657A97586L4039q6019j04675n5953j50930o3640M4290K25542Q2781l5263j25265
26646c7507n0165J04087J2460Q3921J7549j06318l4217m3172m6441J40894J44358
26635A85449q2613l8519k9942q3050r5883N946J3167m3470J29J8386J09724M1795
26623A119j18763j05965J0364J36376K7172K8475L4829o3752J9728o2334k9778
$$ plain form
26702 76153 44393 -17345 -138618 -100461 -41648 -49554 -15301 45046 176935 110466 -21020
26691 -21020 10651 42962 -40995 39793 132625 -2039 -185791 -240468 -20913 131615 74213
26680 74213 87856 65852 -29836 -72070 217206 239022 193388 127551 52412 50318 122965 300504
26668 300504 380966 127779 5299 29032 -704 -234 117360 90574 7398 124430 197586
26657 197586 231625 145606 40931 -15022 -165952 -229592 -185302 40240 123021 87758 -37507
26646 -37507 -87672 16415 28875 112796 130345 24027 -10190 -53362 -99803 41091 185449
26635 185449 102836 64317 34375 -48675 -144558 -138612 -125445 -168915 -168786 -150400 -40676 1119
26623 1119 -117644 -223609 -213245 -76869 -49697 -21222 13607 -50145 -30417 -92751 -122529
26612a22529K7291J47125Q182p5369l2805J08249J30346l6543M0340O9980m5748
26601B18519o5180o1477j0147L241l6493n8869j3338n0028p8046J33799J38229
26590A20210p2484j8836N3141k084o5468L1321J26970O0637n810j44722k27518
26579a44643l4338j1031p5894J4651N7873O1431q1559J18387J83349j9283l4987
26568C3956J6839M1985j85243j85828L8365Q3420J03831k0567j0513J04693P2485
26557I3423J15105m0551j02579p8943r190o7110p7480K1676l7184N1296J03187
26546b8350J50933m0004j10516P8316Q3591o5338l0205J0337J42162m6242K0465
26535A65149J5435j54694k7631K9302j6560P795J00570M8801p6450j27133q0712
$$ plain form
26612 -122529 -95238 51887 60069 -15300 -48105 60144 190490 153947 194287 264267 218519
26601 218519 153339 91862 81715 84956 48463 -10406 -23744 -73772 -151818 -18019 120210
26590 120210 47726 28890 82031 79947 14479 45800 172770 233407 227597 82875 -144643
26579 -144643 -178981 -190012 -265906 -251255 -193382 -131951 -213510 -95123 88226 68943 33956
26568 33956 50795 92780 -92463 -278291 -239926 -156506 -52675 -73242 -83755 20938 93423
26557 93423 208528 167977 65398 -13545 -22735 -89845 -167325 -145649 -182833 -131537 -28350
26546 -28350 122583 82579 -27937 50379 133970 68632 38427 48764 190926 144684 165149
26535 165149 180584 25890 -1741 27561 11001 18796 119366 168167 91717 -35416 -116128
26524a16128o1282L9114O3192M6211J10328R486j38160j012J19556Q5605j88317
26513c1407q2501L8037M0044O2909l9458m6409J8482P2579N0386l4532k1129m5401
26501a8400K5664r5028r7297J69382J97866L1065n5818p4123m330o5534k2527
26490i080k6917m2847N4836O3891N4419n7633j51188j00008N0793J07487J1366
26479d4881j20039O4682J61771J43393m5064k05296J2467K7634j71895L4171o2720
26468b05777K0975J28523q3132r6968O6397L7343l9141j35225N5839K43537K24770
26457B17141L0708j16588p2503K5694j07307k7980m263l3522l7967J16685J43379
26446A33477j66016j10884k1085k1755O5798L7109R7862j08071m7188J08049P0014
$$ plain form
26524 -116128 -177410 -138296 -75104 -28893 81435 90921 -47239 -48251 71305 156910 -31407
26513 -31407 -113908 -75871 -35827 27082 -12376 -58785 -40303 32276 82662 48130 27001 -18400
26501 -18400 7264 -87764 -185061 -15679 182187 213252 157434 83311 78981 13447 -9080
26490 -9080 -35997 -78844 -24008 39883 94302 36669 -114519 -214527 -163734 -56247 -44881
26479 -44881 -164920 -100238 61533 204926 159862 -45434 -32967 -5333 -177228 -143057 -205777
26468 -205777 -184802 -56279 -139411 -236379 -169982 -132639 -171780 -307005 -251166 -7629 217141
26457 217141 247849 131261 58758 84452 -22855 -50835 -55098 -88620 -126587 -9902 133477
26446 133477 -32539 -143423 -164508 -186263 -120465 -83356 14506 -93565 -140753 -32704 37310
26435C7310k5503Q5096o2238j07688J1006l767n416P9907L4263K047J5830n329
26423E5518M8223q5004o7198p0886P1163k6756K6638J75645p6339j76763l3732
26412a59491R2275J5199N225L0090M5923k0114j12150Q9721J40121q1114j96598
26401a50913M4248J21454k495p2542K3785O2173R9589M6798o8517m0681j09203
26390d6304m1013j34592O2782J62651P846k6567o3715R747m3659j7491O9673o5263
26378a25905K2385J46774N9655O9773j40524j06635j8782K1907J30811q2891J8227
26367e205k248n1594l7741m7307K3475n2472q8903L0566R2821O4329P3706M496
26355C923j01762L774J2916P1028l5165P6527J6121M5931l7229j41406j63710
$$ plain form
26435 37310 11807 96903 34665 -73023 -62017 -65784 -71200 8707 42970 45017 60847 55518
26423 55518 103741 18737 -48461 -119347 -48184 -74940 -48302 127343 51004 -125759 -159491
26412 -159491 -67216 -52017 -46792 -16702 29221 9107 -103043 -13322 126799 45685 -150913
26401 -150913 -106665 14789 12294 -60248 -36463 25710 125299 172097 103580 62899 -46304
26390 -46304 -87317 -221909 -159127 3524 11370 -15197 -78912 -69165 -112824 -130315 -60642 -125905
26378 -125905 -103520 43254 102909 172682 32158 -74477 -93259 -71352 59459 -23432 -5205
26367 -5205 -7453 -59047 -96788 -144095 -120620 -173092 -261995 -231429 -138608 -74279 -573 3923
26355 3923 -97839 -94065 -81149 -10121 -45286 31241 47362 93293 56064 -85342 -249052
26344b49052P8917J92317q8679r766n3329o9258N9968k518p4356P8549J20194
26333a7013l254J00275O9527O4676k2468j81446k14860j73672J666R1891Q060
26322b76618J52196K75878K2359j73579j0435j7757q5880p8823j01641Q2026J16659
26311i5615o6361J9315M4729J9651q0054M6835O153P4480r5160k48621q4851Q4352
26299c75147L1822J14455J20171K6563Q7594J6586J44871J729j15392j16372l6575
26288i9695J27054Q4053m7312m8630o9739j66422k1766J07414J74631K4458p6822
26277a2776L1938k9972k797K6424q7380j50313J42206P5897l7698j21030Q7898
26266g7603R8861M1296j5067j06351O0379j2949j0572r985q3264q4419L855Q9090
$$ plain form
26344 -249052 -170135 22182 -66497 -76263 -129592 -198850 -138882 -141400 -215756 -137207 -17013
26333 -17013 -20267 80008 149535 214211 191743 10297 -204563 -378235 -376569 -284678 -276618
26322 -276618 -124422 151456 173815 236 -10199 -27956 -113836 -192659 -294300 -212274 -95615
26311 -95615 -161976 -142661 -97932 -78281 -158335 -111500 -105347 -30867 -126027 -374648 -459499 -375147
26299 -375147 -343325 -228870 -108699 -82136 5458 22044 166915 168644 53252 -63120 -99695
26288 -99695 27359 111412 64100 15470 -54269 -220691 -242457 -135043 39588 64046 -12776
26277 -12776 19162 -10810 -13607 12817 -74563 -224876 -82670 -6773 -44471 -165501 -77603
26266 -77603 21258 62554 47487 -58864 1515 -11434 -22006 -31991 -115255 -199674 -195819 -106729
26254a06729J3266P2857J9497p7423k9603L2904J20043J4532j00509N2500l7560
26243b6225j01751L351N6462q0465p3198k1678n2330K3206P5084m1029P4742P8266
26231h5565J36514p4780j39058k5647L4367j5469J10701J10576n8711q6816O0627
26220c3261J27496o585P227l6515j35943p137k5906k8537K02337R4429m5323j682
26208A10600r5500l7370L3015j114n7281p1578j04341M8494N8333P8353M888O0766
26196B7265J08604J71604K7617n6739j40032r5458l5664p2704k5701N2028k4746
26185f3926K432R7768R5090N0524l2968N0068r225j34800q0379n2339J0779J49736
26173H2760l5291J2374J8884N2466j2649L5837J4467r3249j17097P1386J41221
$$ plain form
26254 -106729 -93463 -20606 -1109 -78532 -108135 -75231 44812 59344 -41165 11335 -26225
26243 -26225 -127976 -124625 -68163 -148628 -221826 -243504 -295834 -272628 -197544 -238573 -163831 -85565
26231 -85565 50949 -23831 -162889 -188536 -154169 -169638 -58937 51639 -7072 -93888 -33261
26220 -33261 94235 87650 94877 58362 -77581 -84718 -110624 -139161 63176 157605 112282 110600
26208 110600 15100 -22270 10745 9631 -47650 -119228 -223569 -175075 -116742 -38389 -33501 27265
26196 27265 135869 307473 335090 278351 138319 42861 7197 -65507 -91208 -39180 -63926
26185 -63926 -61494 36274 131364 181888 148920 198988 189763 54963 -25416 -77755 -66976 82760
26173 82760 47469 59843 78727 131193 118544 154381 168848 75599 -41498 29888 171109
26162A71109L7030q8184J7831Q0585j14189k1897J41112r2118j10088j52637j34255
26151b65701K4387L8531m3607m6255Q2810J89157L0516j78301j4006Q4706K8384
26140f9379Q7463M755q6487O5903j07454j81443o1562J57336J52909m1974k14546
26129b94479j33476O5186J04396N4501J02270J77872J1765j50383O3567J46656
26119A47875P2222j19543M4637M2389o202p2219L2r2922K2488J8621Q2266J8822
26107A58466o7368n5154q017o0622K9117L0923j5009M7051n353N0106o3444r7815
26095e7119J0506R5097O0606l2188j87920p1377K7689K02459N4608m9031p3323
26084a9993P4807n8563m3135P428m1820P710O7827L4456j6626k17040q5273P5520
$$ plain form
26162 171109 208139 119955 137786 218371 104182 82285 223397 131279 21191 -131446 -265701
26151 -265701 -241314 -202783 -246390 -292645 -209835 -20678 9838 -168463 -182469 -97763 -69379
26140 -69379 18084 22839 -63648 2255 -105199 -286642 -348204 -190868 -37959 -79933 -294479
26129 -294479 -427955 -362769 -258373 -203872 -101602 76270 88035 -62348 1219 147875
26119 147875 220097 100554 145191 187580 181378 109159 109191 16269 38757 57378 139644 158466
26107 158466 91098 35944 27927 -32695 -3578 27345 12336 59387 54034 104140 40696 -57119
26095 -57119 -46613 48484 109090 76902 -111018 -182395 -154706 47753 102361 53330 -19993
26084 -19993 54814 -3749 -46884 -39456 -81276 -73566 -5739 28717 12091 -204949 -290222 -214702
26072b14702K7130k4615R1184K2183K4348J30730K1616J14969p0650j66612R8076
26061E3657Q3116p8N9391j50098m8789R9757j01088O0946q6415L9780J0457L811
26049B4447J03056n2083k095K6931j2750k48177R7570K25314N7878q9343j27718
26038C030j78692r961R5691J705K26573K7804j45164o72P3427P4457J1485j39581
26026D0102q2272J8872R8520l1731K7307m3615j70476J79674J6171n3624q2542
26015h3614j03175J38381J67026o7266j73257j47506l5644J17018R396R0920K8497
26004e9224R4486Q5197P4500Q6006m9949p0445Q1349N3787O4317q7978j54237
25993A17809j66480m4317p6484J68945l301j51836L0022J49163O1993j13757k1294
$$ plain form
26072 -214702 -187572 -212187 -121003 -98820 -74472 56258 77874 192843 122193 -44419 53657
26061 53657 136773 136695 196086 45988 -2801 96956 -4132 56814 -29601 10179 20636 24447
26049 24447 127503 75420 73325 100256 87506 -160671 -63101 162213 220091 130748 3030
26038 3030 -175662 -185623 -89932 -88227 138346 166150 20986 20314 93741 168198 179683 40102
26026 40102 -42170 -23298 75222 43491 70798 27183 -143293 36381 52552 -1072 -83614
26015 -83614 -186789 -48408 118618 51352 -121905 -269411 -305055 -188037 -178641 -87721 -59224
26004 -59224 35262 120459 194959 280965 231016 160571 241920 295707 360024 272046 117809
25993 117809 -48671 -92988 -169472 -527 -3828 -155664 -125642 23521 85514 -28243 -49537
25982d9537k30582l0856R4641J39577J04445N0434j82443j48512r9136J73167
25972a78802K23882N0147k8719Q6621q8317m3757j12284J5385n7540L8232J87040
25961I1888J65270j4752j69812k4039J73843J09655j5682l3286j55366q7726r5092
25950e5099L6234m1909k8796o9712J2200K0736O6961N1182J21091L9934j06666
25939D6156M9146N7714k4873q759j69422j84778R7040J97184r8413j49754p0222
25928b58981R9420K19675j4321q7727o1122L0738o2941m4970P0488J00998o5416
25917g4159o2613O2167p9906p4326k625O8364j1737o3944M0857J56502J43604
25906A02184q9310k6459k3395n5519Q7562J29020j3447o9154k998p9305M721N1078
$$ plain form
25982 -49537 -280119 -310975 -216334 -76757 27688 78122 -104321 -252833 -351969 -178802
25972 -178802 45080 95227 66508 153129 64812 21055 -91229 -75844 -133384 -95152 91888
25961 91888 257158 242406 72594 48555 222398 332053 316371 283085 127719 39993 -55099
25950 -55099 -18865 -60774 -89570 -159282 -147082 -126346 -59385 -8203 112888 152822 46156
25939 46156 95302 153016 128143 119384 -50038 -234816 -137776 59408 -39005 -188759 -258981
25928 -258981 -159561 60114 45793 -41934 -103056 -72318 -135259 -180229 -109741 -8743 -74159
25917 -74159 -136772 -74605 -154511 -228837 -231462 -163098 -174835 -238779 -197922 -41420 102184
25906 102184 12874 -13585 -36980 -92499 -4937 124083 110636 41482 38484 -40821 -36100 14978
25894A4978N2678k4945j47580m3014N8850J22699Q5067Q6690Q3604o052j97698
25883H5277k07348m2086J25055J390L7578o0887L0117p898L7985Q9950O0646j09299
25871D0480Q3147j16756M1434M6120L6193J0564l5883j92386r0139Q1701O150
25860h9375Q3349R4879j49118m4623l2719R610J07143M4761j62410m9526P8301
25849a09728k2511M255J7044N8679N3141j02942o0559m7218J37096N7215P8472
25838F2944n4006j14508p522Q0861P9011j16J09298l6255k55511N4041K2954j565
25826f0374L4354r0893L9456j08301O1877O3880m8268m568n1537o8029P6607K09087
25814E3291r9635r9979P744o4492r3077j5471j4172J02859J32878J38023j6684
$$ plain form
25894 14978 67656 42711 -104869 -147883 -89033 33666 118733 205423 289027 282975 85277
25883 85277 -122071 -164157 -39102 -37712 -134 -61021 -30904 -38802 -817 89133 149779 40480
25871 40480 123627 6871 48305 94425 130618 141182 105299 -87087 -177226 -95525 -89375
25860 -89375 -6026 88853 -60265 -104888 -137607 -127997 -20854 23907 -138503 -188029 -109728
25849 -109728 -132239 -127984 -110940 -52261 880 -102062 -162621 -209839 -72743 -15528 62944
25838 62944 8938 -105570 -113092 -32231 46780 46664 155962 119707 -135804 -81763 -58809 -60374
25826 -60374 -26020 -116913 -77457 -185758 -123881 -60001 -108269 -112837 -164374 -232403 -155796 53291
25814 53291 -46344 -146323 -138579 -203071 -296148 -311619 -325791 -222932 -90054 47969 31285
25803C1285J34487M4551j58115N0430M7081j67522m2755q5609k1475M0696K201
25792a24745P7719J36393L1235k5710J8622J07720J456j09807k9028M9747j1788
25781A21814P031n230j6024K7194J1058L7196l3789o0942L124J6583O186j43204
25769b9003J2748J40490R062n002Q9859R7740l3468j46168j11062J1248j695j6139
25757A8610j45869j08709J48485K6271L6795K07999R6922l9129l6049n537j45907
25746E3882l4795N8462P153p2747K4331q097N3015K9961K7053J52691O0340j00908
25734B50341m5315p1230k9872k9637r7380L4914L5600Q5610k00115l5035Q8940
25723a3179M1953j00514k9554J67714K0274m9831j38680j11257K2899Q0957J25893
$$ plain form
25803 31285 165772 210323 52208 102638 149719 -17803 -60558 -146167 -167642 -126946 -124745
25792 -124745 -47026 89367 120602 94892 113514 221234 222690 112883 83855 133602 121814
25781 121814 128845 123615 107591 134785 145843 183039 149250 88308 91432 108015 114201 -29003
25769 -29003 -16255 124235 133297 128295 218154 315894 282426 136258 25196 36444 34749 18610
25757 18610 -127259 -235968 -87483 -61212 -24417 183582 280504 241375 205326 199789 53882
25746 53882 19087 77549 84702 11955 36286 28189 81204 111165 138218 290909 351249 250341
25734 250341 205026 133796 103924 74287 -23093 11821 47421 133031 -67084 -102119 -13179
25723 -13179 28774 -71740 -101294 66420 86694 36863 -101817 -213074 -190175 -109218 16675
25712A6675j8245k38524n2339o055J19486Q2735j05760M7623J19726N4301p7726
25701e8103r7128J568q7733l5478K7011O8016J54630J23871N7406M4474j31705
25690F6829k9388J38481J08535l4896p6949O3547k45852p7878N4738J13164j25818
25679d5487O6387l9708j09637m3051N9005k2666p469q8442Q489m2365M1515J07975
25667a15454O8263l1791r4857O4636K2966m6299R8826O6884P133j6090K2409j8283
25655B8343j24767m2119l3320J8448P8677j15324J45707M433j12173p500J22078
25644c7517k0068j44774J0408K46775K6630o2736l0288q8199j69858j28361Q0706
25633c17282N4372l0537K25729J15873R077Q51L6404l4708N3980M1944n3582o7991
$$ plain form
25712 16675 -1570 -240094 -292433 -298488 -179002 -96267 -202027 -154404 -34678 19623 -58103
25701 -58103 -155231 -153663 -241396 -276874 -249863 -181847 -27217 96654 154060 198534 66829
25690 66829 37441 175922 284457 249561 172612 236159 -9693 -87571 -32833 80331 -45487
25679 -45487 20900 -18808 -128445 -171496 -112491 -135157 -142626 -231068 -222579 -264944 -223429 -115454
25667 -115454 -47191 -78982 -173839 -109203 -86237 -132536 -33710 33174 40307 24217 46626 28343
25655 28343 -96424 -138543 -171863 -153415 -74738 -190062 -44355 -39922 -152095 -159595 -37517
25644 -37517 -57585 -202359 -191951 54824 81454 18718 -11570 -99769 -269627 -397988 -317282
25633 -317282 -262910 -293447 -67718 48155 57232 58083 94487 59779 113759 155703 102121 34130
25621C4130K3586J47924O7920m3563q9464k6888K6689p6728L2889j8122o9898
25610H475K2978P2360P7763j71102q5249l2371m8349n371J13520M0297O6380J5998
25598G5329L5084j56110j48380q3588J22207J15044n609K3519J59736q6584o6556
25587a5908J6664j0483r5154J0325L7309R6724L9263J5993l2193n977p9825Q119
25575a5143J1516O1209J8401o9556l666m8573o1655r1902j7128k2011J33060K43884
25563A38436q1622p6711j16792k56142K43665K22062o7246N5721k3669l3964J89070
25552A92808O6175o6963p5482q0957l1587M6389R0267j02199p6541J39993R1643
25541A93546r99j29049J0154P2792m2l4759K0492k9383j33851j319P4126R6581
$$ plain form
25621 34130 57716 205640 273560 229997 140533 113645 140334 63606 96495 78373 8475
25610 8475 31453 103813 181576 10474 -74775 -107146 -155495 -160866 -47346 -7049 59331 75329
25598 75329 110413 -45697 -194077 -277665 -155458 -40414 -46023 -22504 137232 50648 -15908
25587 -15908 756 -9727 -104881 -94556 -57247 39477 78740 94733 62540 56563 -23262 -15143
25575 -15143 -3627 57582 75983 6427 2761 -45812 -107467 -199369 -216497 -238508 -105448 138436
25563 138436 56814 -19897 -136689 -392831 -149166 72896 5650 61371 37702 3738 192808
25552 192808 258983 192020 116538 35581 3994 50383 140650 38451 -38090 101903 193546
25541 193546 192547 63498 73652 146444 146402 111643 132135 102752 -31099 -32418 41708 138289
25529A38289o759J2677k9813k1525j0185O9308M4018j01588k0949J71342K7265
25518B72080o4088r640n3490j43776n5133M0016L6347q7907M2957n5933k1704
25507a00271j3231n1006P1761J14494N9731j14881j12571J38826M8812M0765o8373
25496A4056j33715P0251J20656K5905j9987m5073N0386j5043j98165O1311J19937
25485E0519K3007O1884j9213j68959q6358Q6928p3644N0505m8891N3305O9793
25474a124j15388L3478m8633J0916J5240J8039N2004J5576K986m2344j10775k5126
25462a95151N447N1825P3507m1343o9046o8895k4569K0485L9691M2462R1277l6133
25450a10443l4308J40101J48017L4075o0262j91262k7079l1996Q0670J24434Q6021
$$ plain form
25529 138289 131530 144207 114394 92869 82684 151992 196010 94422 73473 244815 272080
25518 272080 207992 198352 144862 1086 -54047 -14031 22316 -65591 -22634 -78567 -100271
25507 -100271 -113502 -164508 -92747 21747 81478 -33403 -145974 -7148 41664 82429 14056
25496 14056 -119659 -49408 71248 97153 77166 32093 82479 67436 -130729 -69418 50519
25485 50519 73526 135410 116197 -52762 -139120 -52192 -125836 -75331 -124222 -70917 -1124
25474 -1124 -116512 -83034 -131667 -120751 -105511 -87472 -35468 -19892 -16906 -59250 -170025 -195151
25462 -195151 -189704 -137879 -64372 -105715 -174761 -243656 -268225 -247740 -208049 -165587 -74310 -110443
25450 -110443 -144751 -4650 143367 177442 117180 -74082 -101161 -133157 -52487 71947 157968
25439A57968k84830k65918n2213J07791L47325L06948k9050p0479m2594o5401
25429A09547j00650P97q9776L9926O3116q8678J07609P735n9954m7128n8971J9166
25417i7261J23384j33661j00027j6838k0807Q7357K03323j1932N5460o5890j02654
25406g9546L6919o607K4376j83459k7012J08875M8661O6327M6840R3627L2499
25395A61500j15760j14003q717O7857K5585m1167K9352R5968j8093J3462O5315
25384A61299o533l9782j61214o1183L7059k7360p9119L0065P570j8450J19767
25373c7881J23776J20343j07386j39920l6146m5584R2083o3867j21291j3513M4202
25362a85184M1097R8161Q219N9947J28641N7891j65153n7514J19983L673j52061
$$ plain form
25439 157968 -126862 -392780 -444993 -337202 10123 317071 288021 217542 174948 109547
25429 109547 8897 9694 -80082 -40156 22960 -65718 41891 49626 -10328 -57456 -116427 -97261
25417 -97261 26123 -107538 -207565 -224403 -245210 -157853 45470 33538 88998 23108 -79546
25406 -79546 -42627 -49234 -24858 -208317 -235329 -126454 -77793 -11466 35374 129001 161500
25395 161500 45740 -68263 -76980 -9123 16462 -24705 4647 100615 82522 95984 161299
25384 161299 154766 114984 -46230 -107413 -70354 -97714 -176833 -146768 -139198 -157648 -37881
25373 -37881 85895 206238 98852 -41068 -77214 -122798 -30715 -94582 -215873 -229386 -185184
25362 -185184 -144087 -45926 -37707 22240 150881 208772 43619 -13895 106088 109761 -42300
25351d2300n103K6504Q7036o5916j00961j07511O243N5427j7782J5389J20214
25340b8760J36698k539l1172q1126L1026o4394j5596m921j9569J9043k1652N4523
25328b8439P3510J1505N7991n5361q3248O8134M7362O737m3179N1545k05216m3981
25316a42640J27963m8677J24805J53912j39537p5148K277L3265o6193j63405K6649
25305a66729P3795M8670m9293j8065l1796O4747O5909j00999K605P9187M085J4755
25293a3129j01488J29984R179K2183M5089k2519K1923N4946j47404L8879N3037
25282I0680m8447q396M7936l331P5151K5222k6688r7839K6436j438J7236j88091
25270i1569j7014P2991J25527l3687q1961j0278j8747j05994k5992m4902L9477
$$ plain form
25351 -42300 -47403 -20899 66137 221 -100740 -208251 -202008 -146581 -164363 -148974 -28760
25340 -28760 107938 105399 74227 -6899 24127 -40267 -55863 -60784 -80353 -61310 -82962 -28439
25328 -28439 45071 56576 114567 59206 -24042 44092 91454 98191 55012 106557 -98659 -142640
25316 -142640 -14677 -63354 61451 215363 75826 678 2955 36220 -29973 -193378 -166729
25305 -166729 -92934 -44264 -93557 -111622 -143418 -78671 -12762 -113761 -111156 -31969 -27884 -13129
25293 -13129 -114617 15367 24546 46729 91818 69299 91222 146168 -1236 37643 90680
25282 90680 42233 33837 81773 78442 153593 178815 152127 54288 80724 79286 96522 -91569
25270 -91569 -108583 -35592 89935 56248 -25713 -35991 -54738 -160732 -186724 -231626 -192149
25259a92149j729Q89M9570J16801n308P1251k6857o2178K7069j4459j46772L879
25247a79993M3106M9110l4899j6182L3018O4196j5636M5512j16859j9712M99P1192
25235g6648m2120k6560o4653M6890j4614J80633N7973J1824L7973Q0295L7876
25224B28869n6990q2873j5457L2851q1403r8547p1391J07191N8748K1163J9607
25213F1768n0253k1202r8457m016R8511P7205r4965N5973j120j95575j32520M9802
25201b54849r638J12080K38969P5579r4808j00869l1336M2869O5279O1650j12009
25190g083K5328n0317p5261o4781n3466Q5005J35075P1406O9365L406j74846m81
25178c6650J42875P4637j5597j63932j00775j1595m8538j36731L7400K39580J22931
$$ plain form
25259 -192149 -193878 -192989 -143419 -26618 -31926 39325 12468 -49710 -22641 -37100 -183872 -179993
25247 -179993 -136887 -87777 -122676 -138858 -105840 -41644 -57280 -11768 -128627 -148339 -147840 -76648
25235 -76648 -118768 -145328 -209981 -163091 -177705 2928 60901 72725 110698 190993 228869
25224 228869 171879 89006 73549 106400 24997 -73550 -144941 -37750 20998 42161 61768
25213 61768 11515 -9687 -108144 -112160 -13649 63556 -31409 24564 23444 -172131 -304651 -254849
25201 -254849 -264487 -152407 86562 162141 67333 -33536 -64872 -22003 43276 104926 -7083
25190 -7083 18245 -32072 -107333 -172114 -225580 -140575 -5500 65906 135271 138677 -36169 -36650
25178 -36650 106225 180862 165265 1333 -99442 -111037 -159575 -296306 -258906 -19326 103605
25167A03605J33530j8484o8245q2754j80863k3201p9798J78500M318l4939N0886
25156a7445O7864j52967m6689R9942P2724R4871q4490o3700L4833m6018m5662
25145h6737M3782K2811P7386K7218l4241j43316j36470J26298P9446L3883p8349
25134f8289l5870Q234p7910r6488Q4661Q9566J56307j1872q1948n036n4777J370
25122i2052K1397M3677p6405j17761J47517J77495j03128j38069q2640n0453L9672
25111b30750R4236K9095P9872j5453M3150o2483j63626l8442Q9785J03022J00898
25100B9304k9877r841r9754L3144n2681K0513j10J21649j29630M413M7211L0713
25088c4946J1871K0318r2510p4389q4924K0353M1072J2561r9914J08007O6788
$$ plain form
25167 103605 237135 218651 150406 67652 -113211 -136412 -216210 -37710 -33392 -68331 -17445
25156 -17445 50419 -102548 -149237 -49295 23429 118300 33810 -29890 4943 -41075 -86737
25145 -86737 -42955 -20144 57242 84460 50219 -93097 -229567 -103269 -23823 10060 -68289
25134 -68289 -104159 -95925 -173835 -270323 -185662 -96096 60211 48339 -33609 -38645 -93422 -92052
25122 -92052 -70655 -26978 -103383 -221144 -73627 103868 740 -137329 -219969 -270422 -230750
25111 -230750 -136514 -107419 -27547 -43000 150 -62333 -225959 -264401 -174616 -71594 29304
25100 29304 -573 -10414 -110168 -77024 -129705 -109192 -109302 12347 -117283 -112870 -65659 -34946
25088 -34946 -23075 -2757 -95267 -169656 -254580 -234227 -193155 -180594 -280508 -172501 -105713
25077a05713n9826o0766P7705Q0110J01619j12559p1296J43822l662K1097J7424
25066B7955K1430L1883Q4595r118k01773m2493J3306Q6081Q4324j25774n3155
25055h2739l1146l0623R0320L4081J7753R5142j9684n0695j04208n7973J5679
25044a24093Q1020L9240j75936m0558J34217Q1584J3075R3551J14649K7774q7950
25033A56573j22870j2422J12346o2332l2588M8054q8047n1065N617L3524q4786
25022i7996m9764q7768m5961R8260P8314M3543q5090n2417o1486l9314O8576J46693
25010h4410p5210M3924O9939p17q4889o3173j9606l8721m1050Q6788L7333Q134
24998a61658N4681P9996k0083L8563P5214p975m3047q529j4073j5770l6210J38496
$$ plain form
25077 -105713 -165539 -226305 -148600 -68490 33129 -79430 -150726 -6904 -10566 10531 27955
25066 27955 49385 81268 165863 156745 -45028 -87521 -74215 11866 96190 -29584 -82739
25055 -82739 -113885 -144508 -54188 -20107 -2354 92788 73104 22409 -81799 -139772 -124093
25044 -124093 -43073 -3833 -179769 -220327 -86110 -4526 8549 102100 216749 244523 156573
25033 156573 33703 21281 133627 71295 38707 86761 -1286 -52351 -46734 -13210 -97996
25022 -97996 -147760 -235528 -281489 -183229 -104915 -61372 -146462 -198879 -260365 -299679 -231103 -84410
25010 -84410 -159620 -115696 -45757 -46474 -131363 -194536 -214142 -252863 -293913 -207125 -169792 -161658
24998 -161658 -106977 -26981 -47064 -8501 66713 58738 15691 7162 -6911 -22681 -58891 79605
24986G9605R8849j56726r1544N1091R9592O4780m6472N7096r4051M4502m090k88622
24974a85990l0467O5236J60466l8108j23003J1539p2896J54369j2330J05175m0185
24963f194q5927j44016j47454M3340J36553R7070N1654k3093Q3499j8548M568
24952h548q9577q5002O2662k6001l4282N7530K7433j62843Q2670J02779K5055
24941d8124n3940M5455J45508r3219n4127L4934N7915J0602P840l3125n6541j8535
24929e5357n8325O0052R8328j06330j07472R6984J17491q157p7883L4297R3668
24918H7296M2748j19016N3219l3695N2034J4670j21595k7002m2034q2075M5299
24907a30151L6941j02005l7638j3066M4365J30134J36870k142Q1161K7066n0361
$$ plain form
24986 79605 178454 21728 -69816 -18725 80867 145647 99175 156271 62220 106722 102632 -185990
24974 -185990 -216457 -151221 9245 -28863 -151866 -140327 -213223 -58854 -71184 33991 -6194
24963 -6194 -92121 -236137 -383591 -340251 -203698 -106628 -54974 -78067 5432 -13116 -8548
24952 -8548 -98125 -183127 -120465 -146466 -180748 -123218 -95785 -258628 -175958 -73179 -48124
24941 -48124 -102064 -56609 88899 -4320 -58447 -23513 34402 45004 52844 19719 -36822 -55357
24929 -55357 -113682 -53630 44698 -61632 -169104 -72120 45371 37214 -40669 -6372 87296
24918 87296 130044 11028 64247 30552 82586 97256 -24339 -51341 -93375 -175450 -130151
24907 -130151 -93210 -195215 -232853 -245919 -201554 -71420 65450 63308 144469 171535 121174
24896A21174j39561K8811J43859J0885p0572j09065j18237R093O5522q9146M5832
24885a01405p3206J2116J29264J10198k4372j00352o9572j3998J23255k1144K4159
24874e057k9090q021K3617J35555p2990p0840j58655l9532P7099r284K12387R9305
24862A54494j05353J4816P138q0887M098j894o3621j31229O2761J35409P6253
24851G1985Q1962Q1669r5685o0890P8264J6380l9100m3020o1220o5664j22321
24840a57640N9480P4567J03959N319j03100j92985k4137P052n2813J51043J29612
24829C57O6900O1246r413j39455r0889m651J12110J21142M4482r126q825m8599
24817I5279n0763j63418O9644J19726L6622q4264L3798p2708L6252L205P9698
$$ plain form
24896 121174 -18387 10424 154283 165168 94596 -14469 -132706 -123613 -58091 -147237 -101405
24885 -101405 -174611 -162495 -33231 76967 52595 -47757 -117329 -131327 -8072 -29216 -5057
24874 -5057 -34147 -42168 -18551 117004 44014 -26826 -185481 -225013 -147914 -157198 55189 154494
24862 154494 49141 63957 71095 -9792 -5694 -7588 -71209 -202438 -139677 -4268 71985
24851 71985 153947 235616 139931 79041 157305 173685 134585 91565 30345 -35319 -157640
24840 -157640 -98160 -23593 80366 85685 -17415 -210400 -234537 -227485 -280298 -129255 357
24829 357 67257 128503 119090 -20365 -111254 -115905 -3795 117347 161829 152703 143878 95279
24817 95279 44516 -118902 -49258 70468 107090 22826 56624 -16084 20168 23373 103071
24806A03071p475N756n9093r9251j21233j9902K2969m0579M8066Q9451m7002J79398
24794E4176J83484o3034r5149j11111j16593L554M2872P3213N8679l1270j21731
24783a22910Q4913P7756O5989k7374J511l3405K6242R6541m0366q656p5406j22761
24771g7926l3714m9066J16534O9381m3125j2095r8968N0745L1554N543J4878l5562
24759f1821j01559R904J38436J32187O6376m3110o6505J08623O1672j12701j56706
24748b5204r5503J5896j54914m9809J74918Q5688R792M238K3093J5182r4670j2294
24736a03587M6595m3729Q1905J21895J9757j31448Q364Q6684j37425j52077j49142
24725c52208J55573J78827J90157M9801j42912j02908p5522o2320o9119k2441
$$ plain form
24806 103071 95596 101352 42259 -56992 -178225 -198127 -175158 -215737 -167671 -78220 -125222 54176
24794 54176 237660 174626 79477 -31634 -148227 -144673 -101801 -28588 30091 -1179 -122910
24783 -122910 -37997 39759 105748 78374 79885 46480 72722 169263 128897 120241 44835 -77926
24771 -77926 -111640 -160706 -44172 25209 -17916 -30011 -128979 -78234 -46680 -41137 -26259 -61821
24759 -61821 -163380 -153476 -15040 117147 183523 140413 73908 182531 244203 131502 -25204
24748 -25204 -120707 -104811 -259725 -309534 -134616 -48928 -39136 -34898 -11805 3377 -91293 -103587
24736 -103587 -56992 -100721 -18816 103079 122836 -8612 -248 86436 -50989 -203066 -352208
24725 -352208 -196635 -17808 172349 222150 79238 -23670 -99192 -161512 -230631 -253072
24715b53072P8934q919j3980k9665J09297J64220K2939j38162j01557j6074L6061
24704a49978J37301N7299M9720L2253P9151k5882j18974o88j17625j18603J8839
24693a57187P5337O1320J1216J24615L7723J29749J9551k84357j74056K970j47869
24682c00988m3111K13083J69261N1780k4153q1002j13292p5429j20663N1340N9365
24671b13809P1529O0988M3001l6882j02468k0968M4743P3357O191J00810J29383
24660A55875J268n9046q9930j27167K8904O9650m7282k4702N5268P0318n4122
24649b0966q4109n6141P0498K2292O3081P4897J0783q2944j0687L9613R0235j07576
24637H976M1669Q5271o1566p687j87246k06783O2108R4006J00315n3495N7225
$$ plain form
24715 -253072 -174138 -183057 -197037 -226702 -117405 46815 69754 -68408 -169965 -186039 -149978
24704 -149978 -12677 44622 94342 126595 205746 179864 60890 60202 -57423 -176026 -157187
24693 -157187 -81850 -20530 -9314 115301 153024 282773 302324 17967 -156089 -153119 -300988
24682 -300988 -344099 -131016 38245 90025 65872 -15130 -128422 -203851 -324514 -273174 -213809
24671 -213809 -142280 -81292 -38291 -75173 -177641 -198609 -153866 -80509 -74318 26492 155875
24660 155875 157143 98097 8167 -119000 -90096 -20446 -67728 -92430 -37162 33156 -20966
24649 -20966 -105075 -161216 -90718 -68426 -5345 69552 80335 -2609 -13296 26317 116552 8976
24637 8976 50645 135916 74350 66663 -120583 -327366 -265258 -171252 -70937 -124432 -67207
24626f7207L5778P8576k0765j31256l1045J07577O1543n2825L6306l4530o8761
24615h6609n3192K7916k3266r2256L0245o820k9362P2319Q6382L2842J79421J26356
24603B63976r9902K4241K2112L0141j22919p6355n0662m3090j88992j41726J52363
24592b30813M300K4311n526R3082k1139J24729J55942M2682J40773m1065j90343
24581I6933j92538o6893j6249O1567O3120M3282r1814M945l8275J9194j21630
24570b38358n5000J24122P0491m0365K6984N5268m9525j8582l8917l1808j5535
24559b11225k469M1318J06047O8330K8272r3652o3191J8058r0855p1832O3857
24548b07342J43845L8485J21463J10680k3294j07412j12973N0174k9439k8798
$$ plain form
24626 -67207 -31429 47147 26382 -104874 -135919 -28342 33201 -19624 16682 -17848 -86609
24615 -86609 -139801 -111885 -135151 -227407 -197162 -203982 -233344 -161025 -74643 -41801 137620 263976
24603 263976 164074 188315 210427 240568 117649 41294 -9368 -52458 -241450 -383176 -230813
24592 -230813 -226513 -202202 -207728 -114646 -135785 -11056 144886 187568 328341 287276 96933
24581 96933 -95605 -162498 -178747 -117180 -54060 -10778 -102592 -97647 -135922 -116728 -238358
24570 -238358 -293358 -169236 -98745 -139110 -112126 -56858 -106383 -124965 -163882 -195690 -211225
24559 -211225 -213694 -172376 -66329 2001 30273 -63379 -126570 -108512 -199367 -271199 -207342
24548 -207342 -63497 -25012 96451 207131 183837 76425 -36548 13626 -15813 -44611
24538d4611Q234k4087o6453J56160N6361m9107M0953k470o4518m8792O2313r472
24526A4511o8327O5134J28850q0726m8743J6124j29597k8023J03797l0563m9999
24515a07562n2604O0434M6426k4764j7124j22378M0747K6900m9578Q0053K32728
24504A13278O7275k2650j13741N566j5049j11233J51155Q6840j39147J04660Q4488
24493B11442J54k28269k34435o7791R7553K37203J73079O5237L3744K3788q3761
24482B27944N144l1109J8703n2846k32812j38666J15662L4323q0463J5793Q7151
24471c1176Q0145K3395k8273j16498m0256M4218Q0826R9826p087J09892N874k10477
24459A0409M5720k8798m6982L5293k9788p3056P4783P6636J1928j4257L4301M7257
$$ plain form
24538 -44611 -36377 -60464 -126917 29243 85604 36497 77450 74980 10462 -38330 23983 14511
24526 14511 -53816 11318 140168 59442 10699 26823 -102774 -130797 -27000 -57563 -107562
24515 -107562 -160166 -99732 -53306 -78070 -95194 -217572 -176825 -149925 -199503 -119450 113278
24504 113278 180553 157903 44162 49728 34679 -76554 74601 161441 22294 126954 211442
24493 211442 211596 -16673 -251108 -318899 -221346 15857 188936 254173 287917 311705 227944
24482 227944 233088 201979 220682 167836 -64976 -203642 -87980 -53657 -134120 -118327 -31176
24471 -31176 48969 72364 44091 -72407 -112663 -68445 12381 112207 105120 215012 220886 10409
24459 10409 56129 27331 -19651 15642 -14146 -87202 -12419 64217 76145 61888 96189 143446
24447A43446r7816r7579p1465Q1692M5124L2939L084J06073N088j7780p095P8359
24435B04070m635j25687p5296N5828k2755r5781n0607Q4591L2502Q0335M9880
24424A32445n0136j6806p3671l3503o9889j5442Q4340P791m7860j03568J20231
24413f6068K15916j00304j34417j67600J28115J43158r647k3522M7747k3038j7491
24402g151O5247m8208N2561N8340j06928q010N5881J20685r5086k69423j01343
24391b83435P4910l730Q3474J20556o2162j5398o394m1484j9014J6466j01900
24380b38111m578J22607J82149R8332j8678j12864m5987J82921l9890r7705r426
24369A8770Q787K4558r1280M6568k3716k4441P3012K523N7932j480J2216j97692
$$ plain form
24447 143446 45630 -51949 -123414 -41722 3402 36341 39425 145498 150586 132806 125711 204070
24435 204070 199435 73748 -1548 54280 31525 -64256 -114863 -30272 2230 82565 132445
24424 132445 82309 65503 -8168 -41671 -111560 -127002 -42662 -34871 -82731 -186299 -66068
24413 -66068 149848 49544 -84873 -252473 -124358 18800 9153 -14369 33378 10340 -7151
24402 -7151 58096 9888 62449 120789 13861 5851 61732 182417 87331 -182092 -283435
24391 -283435 -208525 -212255 -128781 -8225 -70387 -85785 -92179 -133663 -152677 -136211 -238111
24380 -238111 -242689 -120082 62067 160399 141721 28857 -17130 165791 125901 28196 18770
24369 18770 27557 52115 -39165 7403 -16313 -40754 32258 34781 92713 91233 103449 -94243
24357i4243r401L6284j11406N0953L3517N9808M5955l240j0346o9755J47046J51213
24345B26385J34154j63406j49729j6744N635j05684Q914r5672m2921Q7420L7098
24334g4550O7164L3052r675p4068n5033o2457J442J1530R0081J0728J9928m192
24322d6050N2687M1515Q0121p8315r1364N1653k3034j33011J01425J8390r986
24311c5969p5633M5913j4107J37028N5565j7788j27887k1503p846J3513L7234
24300a1480L3224j08974r378Q8496j7366o3566q0144J43236J7619j00791P1267
24289c7857K4988k3453j06755Q4540l2413m0550j2601j2417L4595L6060r4612
24278a80475J17540P5874J7255O6970L7838l06635l1818K5026K0607L8080j0013
$$ plain form
24357 -94243 -103644 -67360 -178766 -127813 -94296 -34488 11467 8227 -2119 -71874 75172 226385
24345 226385 360539 197133 47404 30660 36295 -69389 -60475 -156147 -199068 -111648 -74550
24334 -74550 -7386 25666 15991 -58077 -113110 -175567 -174125 -162595 -72514 -61786 -41858 -46050
24322 -46050 6637 48152 128273 49958 -41406 10247 -12787 -145798 -44373 -25983 -35969
24311 -35969 -111602 -65689 -79796 57232 112797 95009 -32878 -54381 -62227 -48714 -11480
24300 -11480 21744 -87230 -96608 -8112 -25478 -89044 -169188 -25952 -8333 -109124 -37857
24289 -37857 -12869 -36322 -143077 -58537 -90950 -131500 -144101 -156518 -121923 -85863 -180475
24278 -180475 -62935 12939 30194 97164 135002 -171633 -203451 -178425 -157818 -119738 -129751
24267a29751Q8491k5682N3473L7619O8418L7301q1707m3120l8793p1537r6149
24256b01437Q012P0632j76969k8983J18227M1726J17159L1455j55802J4332J37673
24245b3975o630k3863J9499K6759P8491k2322l2021r1896L2137O4073l4216m002
24233a7966M0016j2732K3754J11490k02371j70152N8187P1184J924m5257K18244
24222G6321J01426l8993r8855P2457M8435l4359q3976K5528J056J6169K3621j24721
24210a5891p812J17258O1078q7862J8680j3140r2989j15366k0741J01271n9818
24199a15332p7403L966J72150J02349m0842j4104k6590j63862p6864P1611q3241
24188b48162K5384K01389R4485O7932j50072j46477l1733P90M2687k3169R3981
$$ plain form
24267 -129751 -41260 -66942 -13469 24150 92568 129869 48162 5042 -33751 -105288 -201437
24256 -201437 -193425 -122793 -299762 -328745 -210518 -168792 -51633 -20178 -175980 -161648 -23975
24245 -23975 -30605 -54468 -34969 -8210 70281 47959 15938 -75958 -43821 20252 -13964 -17966
24233 -17966 22050 9318 33072 144562 -57809 -227961 -169774 -98590 -96666 -141923 76321
24222 76321 177747 138754 39899 112356 160791 126432 42456 67984 69040 85209 108830 -15891
24210 -15891 -23703 93555 154633 66771 85451 72311 -20678 -136044 -156785 -55514 -115332
24199 -115332 -192735 -188769 -16619 85730 44888 30784 4194 -159668 -236532 -164921 -248162
24188 -248162 -222778 -21389 73096 141028 -9044 -155521 -187254 -186464 -143777 -166946 -72965
24177g2965N2545K329k2048J408q7226j72457n2644J59288J30825n1278j0397
24166a22620R5357j0332K5902K215j64701L0879j01368N0011L4313L6587p375
24155a31132j23957J0497R7233J00837Q322k66155n5621J9862K11384J13267o8646
24144h4109p6119J27662J73208J5484O0499j18851j31909o7809n3327j15662L7497
24133b33436k0490o6214M4643O4793q4178j15975l5795N9812N9578J43871L0331
24122a53060N0304L3543N0367M3100M530P6857J2979j36123l2364m1764n6070
24111a47701O3062j04344M9313K70780J11086J1971l3734o9044j35913n5889j05343
24100a45756j40471k0776P7468j11290Q6842J82149J29832r795M9045L038N452
$$ plain form
24177 -72965 -20420 -18091 -40139 -38731 -125957 -298414 -351058 -191770 -60945 -112223 -122620
24166 -122620 -27263 -37595 -11693 -9478 -174179 -143300 -244668 -194657 -160344 -123757 -131132
24155 -131132 -255089 -244592 -147359 -46522 -38200 -304355 -359976 -340114 -128730 -15463 -84109
24144 -84109 -160228 -32566 140642 156126 216625 97774 -34135 -101944 -155271 -270933 -233436
24133 -233436 -253926 -320140 -275497 -210704 -294882 -410857 -446652 -386840 -327262 -183391 -153060
24122 -153060 -102756 -69213 -18846 24254 28784 105641 118620 -17503 -49867 -91631 -147701
24111 -147701 -84639 -188983 -139670 131110 242196 254167 220433 151389 15476 -40413 -145756
24100 -145756 -286227 -307003 -229535 -340825 -253983 -71834 57998 48203 97248 100286 105738
24089A05738j12558j86318k0765J22999p2425o7607j2424J25758J58496m9756
24079h862j11042l1149N3215J08743p2814o0101J4543l1883J10971J30137K3703
24068A25461P974j7851p798N7511k20920o003J92052J3462r2437n624q075j22410
24056h4658q3608j3983Q8605J24564m1619p5466n7263q576N1395m6794O0488J06662
24044A9747P2836j12616j98510J8325M6666j0890k0450J15258J54875L528p8275
24033A0494J03806k5314l2690L8395j45207K7156R1207O1642K9903J6532k22591
24022d6667j83869N6232L8092M4843J55541L4616j19275j13092L0365J21987m1107
24011b2334o6353L8546L0908J20649K969L1040P9732m296n7478k18229o2589P0603
$$ plain form
24089 105738 -6820 -193138 -213903 -90904 -163329 -230936 -243360 -117602 40894 -8862
24079 -8862 -119904 -151053 -97838 10905 -61909 -122010 -107467 -139350 -28379 101758 125461
24068 125461 133435 115584 107786 165297 -55623 -61626 130426 143888 51451 45827 37752 -84658
24056 -84658 -168266 -182249 -93644 30920 -10699 -86165 -143428 -152004 -100609 -147403 -86915 19747
24044 19747 92583 -20033 -218543 -200218 -153552 -164442 -184892 -69634 85241 88769 10494
24033 10494 114300 88986 56296 94691 -50516 -23360 67847 129489 159392 175924 -46667
24022 -46667 -230536 -174304 -136212 -91369 64172 98788 -20487 -133579 -103214 18773 -22334
24011 -22334 -88687 -50141 -19233 101416 104385 135425 215157 210861 153383 -64846 -127435 -56832
23999e6832Q4836k21394O1651J45025n4614k36844l2048Q6141k0412R4093J07815
23988d2583J26589j00706j03255J09180O1203M8765K7500P097p0876J0853J1829
23977H5596r8053M7063K8136q3701O9745M1041q7665m2367P3145n1106p4042K8837
23965f3371N6378j4954J96657R5672k9068L3885j48761k17193j53202r408N8183
23954a95182M4388k3038Q8193L2238K8030r0641m5434O1617j8498j26822Q5308
23943a59841Q6053k5463P3415K5643j23267J08425K00774k7141j98244l7376K8345
23932d8677J01073r4699r3569P6724J0628O2136j9664P603M5416j11031J9912
23921d4148k9102o6009j0604k40961m1844O2830J78313J79824q1651p7445o0342
$$ plain form
23999 -56832 28004 -193390 -131739 13286 -41328 -278172 -310220 -224079 -244491 -150398 -42583
23988 -42583 84006 -16700 -119955 -10775 50428 99193 126693 133790 62914 73767 85596
23977 85596 -12457 34606 62742 -20959 48786 89827 2162 -40205 32940 -18166 -92208 -63371
23965 -63371 -6993 -21947 174710 270382 241314 275199 126438 -90755 -243957 -253365 -195182
23954 -195182 -150794 -173832 -85639 -53401 -25371 -116012 -161446 -99829 -118327 -245149 -159841
23943 -159841 -73788 -99251 -25836 -193 -123460 -15035 185739 158598 -39646 -77022 -48677
23932 -48677 52396 -42303 -135872 -59148 -48520 13616 -6048 1555 46971 -64060 -44148
23921 -44148 -73250 -139259 -149863 -390824 -432668 -369838 -191525 -11701 -93352 -170797 -231139
23910b31139J31469K00006K5151o2428L0963j22193P9173K9096j22876q4545k3942
23899a51265j4432O728q5960r0298J26652J06025J6570m214m1750j5815P2688
23888g5071L2813J4243Q8360J2448j28394p8482j4978P0500Q8819N0046Q0417
23877A40721o709j13788M06j0456j3732N454r486n0638j4886N51j6021m9737j4343
23864a52664o6233j3947Q9521J35830R5548m3174j05896j16778O7780J03791R2307
23853H6085p1399l0720P60l9403K3058L1724k765K574j7979k0654R4565r9034
23841d3188j40509o2759R089N8782k331m5089J01762k4360J05085J56700O1147
23830A74329o6133p1502m2220j0374k8949n6985n8759M0468O681R0065J8721O0647
$$ plain form
23910 -231139 -99670 100336 125487 63059 94022 -28171 51002 80098 -42778 -127323 -151265
23899 -151265 -165697 -158969 -244929 -335227 -208575 -102550 -85980 -90194 -131944 -147759 -75071
23888 -75071 -42258 -28015 60345 72793 -55601 -134083 -149061 -78561 10258 60304 140721
23877 140721 134012 20224 20630 10174 -3558 1896 -7590 -58228 -73114 -72563 -88584 -138321 -152664
23864 -152664 -218897 -232844 -143323 -7493 88055 44881 -61015 -177793 -110013 -6222 86085
23853 86085 14686 -16034 -15274 -54677 -31619 105 -2660 -86 -18065 -38719 55846 -43188
23841 -43188 -183697 -246456 -237367 -178585 -180916 -226005 -124243 -148603 -43518 113182 174329
23830 174329 108196 36694 -5526 -15900 -44849 -101834 -160593 -120125 -113444 -23379 -4658 55989
23818E5989j20834K8028M7375J7235q9368r883Q3858J031j9212m3584M4807n3083
23806e7641P377J4444R4545J02636L556K6227q2082q7683m8039r910r4791j8578
23794a49939l6959m1994N9361N4686K8403j32483P8589k5971N3449m6458o5798
23783b25114Q7760N9453k9049J8780j82388q4309J96054P1305j05602L5240J56408
23772a462J22369J1595L6447J19943j0955q3547m822l507j09671j75340O9171
23761b9779J26889p3141j63320j05737J26205K28251J31569m163p0089k16167
23751d9482n0539l5962L2462Q7332R4202J29533m7561j51455j87539J37442J18478
23740G6911m4218j43722n94R2419N2040N9509L4710L1707K8146k9021j01819L2840
$$ plain form
23818 55989 -64845 -36817 10558 27793 -61575 -71458 12400 13431 -5781 -49365 -4558 -57641
23806 -57641 -50264 -35820 58725 161361 164917 191144 109062 21379 -26660 -36570 -131361 -149939
23794 -149939 -186898 -228892 -169531 -114845 -86442 -218925 -140336 -166307 -112858 -159316 -225114
23783 -225114 -137354 -77901 -106950 -88170 -270558 -354867 -158813 -87508 -193110 -157870 -1462
23772 -1462 120907 132502 168949 288892 277937 194390 189568 186061 76390 -98950 -29779
23761 -29779 97110 23969 -139351 -245088 -118883 109368 240937 236774 166685 -49482
23751 -49482 -100021 -135983 -103521 -16189 78013 207546 159985 8530 -179009 -41567 76911
23740 76911 32693 -111029 -111623 -19204 32836 92345 127055 158762 186908 157887 56068 88908
23728H8908O4661j1533o868l6416l0600m4997N3038m229L98r5763J1160m7010
23716e9251j21814o7548n743J40888J10671K8727Q2132P062J16452P6402k63307
23705D4671K3137r6023j81619M7060Q0012L9028j85809m5235P1829m232N9079
23694a48102O4133j7690J14056J09328l8534k4293q0821o742M6528R6057M1124
23683A55044n2548M8417J34454p9537l8668l8457l6017o174K5787j59406o4306
23672a11411J48807N0431j16985n1634M94Q2274m7038Q9856J09521j80394k25802
23661b51881P296o2539j38423N9181J61820N0851J17311N6002n4377J2690m3779
23650h5848J1189J2449p8876j24176j45122M4262K12891J93380j3424j22863n7477
$$ plain form
23728 88908 153569 142036 135168 98752 68152 23155 76193 71964 72362 -23401 -12241 -59251
23716 -59251 -181065 -248613 -254356 -113468 -2797 25930 108062 115124 231576 307978 44671
23705 44671 67808 -28215 -209834 -162774 -82762 -43734 -229543 -274778 -202949 -207181 -148102
23694 -148102 -83969 -101659 12397 121725 83191 58898 -21923 -28665 17863 113920 155044
23683 155044 102496 150913 285367 205830 167162 128705 92688 86514 112301 -47105 -111411
23672 -111411 37396 87827 -29158 -80792 -80298 1976 -45062 44794 154315 -26079 -251881
23661 -251881 -244585 -307124 -445547 -386366 -224546 -173695 -56384 -382 -54759 -42069 -85848
23650 -85848 -74659 -62210 -141086 -265262 -410384 -366122 -153231 40149 26725 -96138 -153615
23639a53615p9226R0044M6703n9651j29638M2881l6684O5623K0689l3679j8833
23628b45386J09141O8885k043O5725q9827N0397L6957l1762L6615N3910L6663
23617H9275J6838j07069j92973L1298J53665p080l0229K7545j8076M1110J2548
23606A6852l7614j2239L4842J42010R3845k02643j27779J1247N0542O5266J723
23595C6052j4415l0639N1138J8436p4805m2594q9321k3480R3470O1146k1030L6230
23583A88m112r439j08888r1236J03162k9296q3520J04519J12182L3283p7718q854
23571e9729P1693r720p7686m9736J157l8084n3263m640R2301R9132P7554R7617
23559A46596m6002j34229m2361O4899J18113n2247p121P2016j22728P3764J49230
$$ plain form
23639 -153615 -232841 -142797 -96094 -155745 -285383 -242502 -279186 -213563 -192874 -226553 -245386
23628 -245386 -136245 -67360 -69403 -3678 -93505 -43108 -6151 -37913 -1298 52612 89275
23617 89275 106113 -956 -193929 -162631 -8966 -16046 -46275 -18730 -36806 4304 16852
23606 16852 -20762 -33001 1841 143851 237696 35053 -92726 -81479 -30937 34329 36052
23595 36052 21637 -9002 42136 60572 -14233 -56827 -146148 -169628 -76158 -15012 -36042 188
23583 188 -3924 -13363 -122251 -213487 -110325 -139621 -223141 -118622 -6440 26843 -50875 -59729
23571 -59729 11964 2244 -75442 -125178 -124021 -162105 -215368 -220008 -127707 -28575 48979 146596
23559 146596 100594 -33635 -75996 -11097 107016 54769 47648 119664 -3064 70700 219930
23548B19930j18134q7251L6508J7497L2587j50312j09251J15310J2299n7859J01567
23537A2891j19280l077J18693J47126M6239l1979k4311j25156j37857R3659J09474
23526H6422L1500j10341p8311J11829R0939l9305q1567R269k9234m357L6675J0469
23514C3988Q9026j13107k2942L410M975p7413M4033L7755N9965n8708l68Q188
23502H802j44050J44624J01304j42430N875j3796L8206M0274j09788R0029m730
23491A4320j10199P512N0406L038J28725j81L8033j37645m9027M6531N0864R4813
23479A37190o6142O976L4648K5046J05546L1507J7941j83590n8515O4252O0004
23468A74863M9443j8853j18330j25222m4057l2561j7838J13370j1843K4586O0183
$$ plain form
23548 219930 101796 14545 51053 68550 101137 -49175 -158426 -43116 -30817 -88676 12891
23537 12891 -106389 -109466 9227 156353 202592 170613 146302 21146 -116711 -23052 86422
23526 86422 117922 7581 -70730 41099 132038 92733 11166 20435 -8799 -13156 23519 33988
23514 33988 123014 9907 -13035 -9625 -4650 -82063 -38030 -275 59690 982 614 8802
23502 8802 -135248 9376 110680 -31750 -25875 -39671 -1465 38809 -70979 19050 14320
23491 14320 -95879 -88367 -37961 -34923 93802 93621 131654 -5991 -55018 -8487 42377 137190
23479 137190 71048 78024 112672 137718 243264 274771 292712 109122 50607 114859 174863
23468 174863 224306 205453 87123 -38099 -82156 -114717 -132555 -19185 -31028 -6442 53741
23457E3741m2175R843K0295j2150j02402p0256k239J14389k4722J06478J40563
23446A91365j02947j21145P2846j0471Q8216r5868R774N578N8318J0302K287L1016
23434A39271Q3844j8765j32069j3947k3013n808l3080k2912k8166J51818J15698
23423B12871m2471j6672j3459o2453M862l5243J63928q339j40503k4499l7903
23412A19P1070J02512J21194j01000j03638p822m3848M8090N6563n4132J495J31228
23400B21831j87533o56O8027j34740j1976n9721M2748K0288j03400N7622L4738
23389e2772K343J3902m008l5290J8960R1878K9641M2350J6340n494P824P227r8101
23376C4800m0527j30822r7112l0906N2509K13301N8125j05923p9432j154L849
$$ plain form
23457 53741 11566 21409 41704 29554 -72848 -143104 -145343 -30954 -55676 50802 191365
23446 191365 88418 -32727 40119 29648 117864 21996 31770 37348 95666 105968 108255 139271
23434 139271 223115 204350 72281 58334 35321 29513 -3567 -26479 -54645 97173 212871
23423 212871 170400 153728 140269 77816 82678 47435 211363 203024 62521 38022 119
23412 119 71189 173701 294895 193895 90257 82435 38587 86677 143240 89108 90603 221831
23400 221831 34298 33642 101669 -33071 -45047 -104768 -62020 -41732 -145132 -87510 -52772
23389 -52772 -50429 -36527 -40535 -75825 -56865 35013 64654 107004 123344 117850 125674 132901 34800
23376 34800 -5727 -136549 -233661 -264567 -212058 1243 59368 -46555 -125987 -127141 -123292
23365a23292P2436J13846l2530L7540m8257M0478K263m3457n9279M8446M1862
23354E0056J8162P2031K9883l2913o1135m9158l8232o6631o4339q2833M7580J37346
23342d0183P0280K1719p5097j38054J63222M095n1638L0685N7959l8686l373K6988
23330B7917j00178k7267O0398Q873J8547n2855j13631j60393n0285J41333J53117
23319i4424J89691P2763n3055l0984q0703p0698K8927J38109R0737o6783n9053
23308F4527Q7488K8100p5148r1241l2548j00745O3535N1729K9729J12322O7509
23297B05257M0119m4982n0377k5995O3109k16132q4740k5364O9529Q9240J46373
23286A66037r2887J06441N929j33617j38986q9917M9824P9681k5726r6423J8508
$$ plain form
23365 -123292 -50856 62990 30460 68000 19743 60221 62484 19027 -40252 8194 50056
23354 50056 68218 140249 170132 137219 76084 26926 -11306 -77937 -142276 -225109 -177529 -40183
23342 -40183 30097 51816 -23281 -161335 1887 5982 -45656 -14971 42988 4302 929 27917
23330 27917 -72261 -99528 -39130 -30257 -11710 -64565 -178196 -338589 -388874 -247541 -94424
23319 -94424 95267 168030 114975 83991 3288 -67410 -38483 99626 190363 123580 64527
23308 64527 152015 180115 104967 13726 -18822 -119567 -56032 -4303 25426 137748 205257
23297 205257 245376 200394 150017 124022 187131 -29001 -113741 -139105 -69576 19664 166037
23286 166037 73150 179591 185520 51903 -87083 -177000 -127176 -47495 -73221 -169644 -151136
23275a51136Q2355R1367P8045l8913j49758r4917n6557O8178J32967J00076K8101
23264H9808j13289r3503l6333k9350N1257Q1510J16585J06736R8911J4023p4795
23253B11560n5584q1844R5998k1385k28945m7111k25O7519j410o104J9256J77692
23241A29417k9748o6413K9032J8340j70134M5619J74138J13252l1595j33423J4530
23230I3015p9153N0077K4197j45302j83904p8480J61560R7585j25841m7465M3040
23219a90671J63446O5617N442k4071O7902O5790J23366p7995j99962j23914j00585
23208b25635K4108Q4062r9717J3312R5261q5793q9032J39321Q5667O23j6664l1071
23196a05558k242m1891M9518M8744M1700j2633R3628j0292j58369j28326M8513
$$ plain form
23275 -151136 -68781 22586 100631 61718 -88040 -182957 -239514 -171336 -38369 61707 89808
23264 89808 -23481 -116984 -153317 -182667 -131410 -49900 66685 173421 272332 286355 211560
23253 211560 155976 74132 170130 148745 -80200 -127311 -127536 -60017 -61427 -67531 -48275 129417
23241 129417 99669 33256 62288 80628 -89506 -43887 130251 243503 211908 78485 93015
23230 93015 13862 63939 88136 -57166 -241070 -319550 -157990 -60405 -186246 -233711 -190671
23219 -190671 -27225 38392 43834 19763 87665 153455 276821 198826 -1136 -125050 -225635
23208 -225635 -201527 -117465 -217182 -203870 -108609 -194402 -283434 -144113 -58446 -57823 -74487 -105558
23196 -105558 -107800 -149691 -100173 -51429 -9729 -22362 71266 60974 -97395 -225721 -177208
23185a77208M3564Q0755M4437M5993j7429j670j10284k6160J60687N8687n9908
23174D1464r9535J2943o6526K8359O2953n0412j02819M3403O6924O2170k8941
23163c0017r3883l701J75119J63384J3516j49488p4689P9860n3611L1692O4233
23152A22415j55385j57245N8705J8517L1226L7344j01981k5932M1296J0298j5501
23141a36243l9711k9767p5729K578O0522J58182P9030L6833m2438r1084j38410
23130b16237N3159J31528J6795j24020p0871R4107j00580M5960j9839R724J06058
23119g4216L8059N170J15290P1308Q3747L851j4197o704m5206m8614Q7218j63138
23107E2568j68195J1660k5697J12311N2630J2728L6440J0819q2423n9185j5560
$$ plain form
23185 -177208 -133644 -52889 -8452 37541 20112 18442 -91842 -118002 42685 101372 41464
23174 41464 -58071 -45128 -111654 -83295 -20342 -70754 -173573 -130170 -63246 -1076 -30017
23163 -30017 -123900 -127601 47518 210902 224418 74930 241 80101 26490 58182 122415
23152 122415 -32970 -190215 -131510 -112993 -81767 -44423 -146404 -172336 -131040 -120742 -136243
23141 -136243 -175954 -205721 -281450 -278872 -218350 -60168 18862 55695 13257 -77827 -216237
23130 -216237 -163078 -31550 -14755 -138775 -209646 -115539 -216119 -170159 -189998 -180274 -74216
23119 -74216 -36157 -30987 84303 155611 239358 243209 229012 222308 177102 128488 215706 52568
23107 52568 -115627 -103967 -129664 -17353 35277 48005 84445 95264 12841 -46344 -61904
23096f1904q3130n6893j176J39789n7269n7888l7384K833q2328O5996J95949N9710
23084B6305q3992N1737R0470P9969k0925j6814j42514J12028J29305p9486j33996
23073A2087j25539r3995k6520N7514o2737P1162J01787J94726N4565k2314l639
23062A57097m0742m5608P1028k0226l8443Q6055n3667j05366r5089m9391m1513
23051a75865j39260K6135L108o513K6748L1145J06562J49053N6177n7187j09661
23040h9558k14402M6475l5510J91511J00539K2436n4176M1767R9914M1118P0615
23029B20729j01790k14537j37374J0875J56713J06586P0374q5029n6084J0628
23019a8909P326J04190O42q7L690j96036k31977p0778R8728K47374J53193J4551
$$ plain form
23096 -61904 -145034 -201927 -203103 -63314 -120583 -178471 -215855 -213022 -295350 -229354 -33405 26305
23084 26305 -57687 -5950 84520 164489 143564 126750 -15764 96264 225569 146083 12087
23073 12087 -113452 -207447 -233967 -176453 -239190 -168028 -66241 128485 183050 160736 157097
23062 157097 116355 70747 141775 121549 83106 169161 115494 10128 -84961 -134352 -175865
23051 -175865 -315125 -288990 -285882 -292395 -265647 -234502 -127940 21113 77290 20103 -89558
23040 -89558 -303960 -257485 -292995 -101484 -945 21491 -32685 9082 108996 150114 220729
23029 220729 118939 -95598 -232972 -222097 -65384 41202 111576 26547 -29537 -18909
23019 -18909 -11583 92607 93249 93162 96852 -99184 -331161 -401939 -303211 -55837 97356 111907
23007A11907o3143k8234K9731k4063M4830R4809o1126p4459j518J4136R9109K3829
22995A65808n280n1871j60200J5066k2273p3308O9621M1476p4215m2508Q2768
22984e4916k0016L4375l7344n3207N3848R2291n6049p3797q0071J67309J00528
22973G2951j1662R901J01411P5038K4047j58277m6968J84127L4811O7437j63526
22962A89290K3901J640K0248j61312r223L8242j15723j36786M5039R0514L704
22951a0466p6177l211M6649j6773J3757L9286M9O2971M9524k8415m1542p7331
22939d1679P1915J79508m8059l6860L7195O9713n0994k0265j11394j2498O3188
22928I9770r0031L5981O15l3187J00512N1214p1641j52392m8973p7J14231M5599
$$ plain form
23007 111907 48764 20530 50261 26198 71028 165837 104711 30252 28734 42870 141979 165808
22995 165808 160528 108657 -51543 -36477 -58750 -132058 -62437 -20961 -95176 -137684 -54916
22984 -54916 -74932 -40557 -77901 -131108 -77260 15031 -41018 -114815 -194886 -27577 72951
22973 72951 61289 71190 172601 247639 271686 113409 66441 250568 285379 352816 189290
22962 189290 213191 214831 235079 73767 64544 102786 -12937 -149723 -104684 -14170 -10466
22951 -10466 -86643 -89854 -43205 -59978 -46221 -6935 -6886 56085 105609 77194 35652 -41679
22939 -41679 30236 209744 161685 124825 162020 231733 180739 160474 49080 36582 99770
22928 99770 9739 45720 46335 13148 113660 164874 93233 -59159 -108132 -108209 6022 51621
22916E1621O0526j72336j30678J33125O8297R8970O2978R7742l2884n9431j16173
22905F1757j74170j03731r6955M2068J08097N5925J67343N4091n2117N7658q6456
22894C3510n4032Q6779k740J40615m0106M1704J40893k61257o6504M6634k993
22883F2503l2379N6004J25901l9918n4008L4992j18386j58025J1119j9646p7170
22872b09013l4193P1666K9326J4889P9889J1318l2680M4179P0886j917R604m7046
22860F908M0496j6023N4306q4710j28985j4306N9890J36177J16766j7387n9771
22849I3361r528p125q3244O7565M6039j6858J0756q7765j9834K3514j10189q5555
22837a78863O5828J2694N7418k9624j4799l8245l0047n5514J5369N9848M3201
$$ plain form
22916 51621 112147 -60189 -190867 -57742 10555 109525 172503 270245 237361 177930 61757
22905 61757 -112413 -216144 -313099 -271031 -162934 -107009 60334 114425 62308 119966 33510
22894 33510 -20522 66257 63517 204132 164026 205730 346623 85366 18862 65496 62503
22883 62503 30124 86128 212029 172111 118103 153095 34709 -123316 -112197 -131843 -209013
22872 -209013 -243206 -171540 -142214 -127325 -47436 -36118 -68798 -24619 46267 44350 53954 6908
22860 6908 47404 31381 85687 977 -128008 -142314 -82424 53753 170519 153132 93361
22849 93361 83833 76708 -6536 61029 107068 90210 100966 13201 -6633 16881 -93308 -178863
22837 -178863 -113035 -100341 -42923 -72547 -87346 -125591 -155638 -211152 -195783 -135935 -92734
22826i2734R2518M667j0744R491o6540o8640k145J46357J7012R4870L3577n3401
22814A04288o3507j37468m1663J11419J30778O7713l9578o608K5266R1380J9470
22803B61490j61493q6395N101M2147m2314J44660N383j06940N4012N9727J7511
22792A92889o4104K832K4894j4290J0323o2367j62597k6949q0423k3663J16629
22781h6826k937J7265K9895k2550n4578p503N1485K30911p602j46437p382O5708
22769E9449M8937j1059j85824o0933k4662k7319L1558m081M7633Q9339j06907
22758a43869J03776J23045l5681K2276J41083j07268J3472m0227l0133l5760o5636
22747e4922n161j20790O6922J65912J17801l8365r0525j09396o1110k0692R3635
$$ plain form
22826 -92734 -216 4451 -6293 3198 -63342 -131982 -134127 12230 29242 124112 157689 104288
22814 104288 40781 -96687 -138350 -26931 103847 171560 131982 125374 150640 242020 261490
22803 261490 99997 13602 18703 60850 18536 163196 168579 61639 115651 175378 192889
22792 192889 128785 131617 156511 142221 152544 90177 -72420 -99369 -179792 -203455 -86826
22781 -86826 -89763 -72498 -42603 -65153 -119731 -127234 -75749 155162 147560 1123 -6259 59449
22769 59449 108386 97327 -88497 -149430 -174092 -201411 -169853 -173934 -126301 -36962 -143869
22758 -143869 -40093 82952 47271 69547 210630 103362 116834 76607 46474 10714 -54922
22747 -54922 -60083 -180873 -113951 51961 169762 131397 40872 -68524 -129634 -150326 -56691
22736e6691J06700m4652j72668K2789m5459n8458M7600N3470K3279k1224O9984
22725g5330J19645q5493j38184m1958L334K1631J92985J49471L5874K9571j27141
22714H4405p0251j857O0115M4612K6229j08978j47001J14029j9718J9081J01511
22703A02177j8229j7766m3520l4989p2356P043o1748M7279r412K8797K73468K15271
22691D16015J9829j27823j17036j7610N2224o7547j8151q5o5556q3565j11172
22680a20477j18089J63629J65949r600L4516P872l3577n7473k1270l463N8759
22669F6776N4200k2432n2907j13944O9159J94886m5830K672n0529n8579K8773
22658G2245J11308o1240o9232J00480J12596r4332j05761l4711M8817J01999k9054
$$ plain form
22736 -56691 50009 5357 -167311 -144522 -189981 -248439 -200839 -147369 -124090 -145314 -75330
22725 -75330 44315 -41178 -179362 -221320 -217986 -196355 -3370 146101 181975 211546 84405
22714 84405 14154 12297 72412 117024 143253 34275 -112726 1303 -18415 666 102177
22703 102177 83948 66182 22662 -12327 -84683 -77640 -139388 -92109 -101521 -72724 200744 416015
22691 416015 435844 308021 190985 173375 225599 158052 139901 139816 74260 -9305 -120477
22680 -120477 -238566 -74937 91012 81412 115928 123800 90223 32750 11480 8017 66776
22669 66776 120976 98544 45637 -68307 852 195738 149908 152580 102051 43472 72245
22658 72245 183553 122313 53081 153561 266157 171825 66064 31353 80170 182169 153115
22647A53115k31195J3334J51872o3940j08738m6333O9294J12086N2207J01356
22637B03058K1531M8707J5284k22414k43128p3622Q546J27009O8633Q3834Q1183
22626A18621J29233J22150O474r3066j2383l2387k3903m4530q6164j29075L4045
22615a0985J2973n6446K5181j6793p3531O7036K8136N074P9816M7540j9019p2884
22603A6098m6670k5144p0788j8788j9284J37094J04528J5123J28160r6968q1429
22592D1932j57720p8228J11730m7597P2582O5953n1235M7143P7092J55187J92642
22581D29481j1232k14872j17219m6547q896k8777o1762N3267J34914J25183m5432
22570B08108j57207N5167M9333J8305N568j1836j65797M2093R2897p6339j44519
$$ plain form
22647 153115 -78080 -64746 87126 23186 -85552 -131885 -62591 49495 101702 203058
22637 203058 224589 273296 288580 66166 -176962 -250584 -242038 -115029 -46396 37438 118621
22626 118621 247854 370004 376478 283412 271029 238642 214739 170209 84045 -45030 -10985
22615 -10985 1988 -54458 -29277 -46070 -119601 -52565 -24429 -19355 60461 108001 88982 16098
22603 16098 -30572 -55716 -126504 -145292 -164576 -27482 77046 92169 220329 123361 41932
22592 41932 -115788 -194016 -82286 -129883 -57301 8652 -42583 4560 81652 236839 429481
22581 429481 418249 203377 86158 39611 30715 1938 -59824 -6557 128357 253540 208108
22570 208108 50901 106068 155401 173706 179274 167438 1641 43734 136631 60292 -84227
22559h4227k9366N3349R8753l8513p18j40414j4224J17851J7864M2893L5401J28679
22547A87328M1952k5970q6302j57325k2586o253k8241q5254l5638L2170J94724
22536H605J79940R8190l9656j32745N1428K1338j22503j18187J0230O6248J6175
22525C9063Q46m9675Q6820j4054j56348j40585R6289K08789N7556m8925M9148
22514A28924O2981j8487l3675j2419j49297m5793n2964j12545L9952J40903j1026
22503f3446p4600J24916J71410l6666M3436L7756K194K4349n1632L9433o626k18249
22491g725l9301M1378k8262J50580j21499m690R9281P3814j2252J8414j13851
22480E5887l9110Q4011K6165k0907j57867k7830N5758J50077O7416o1563K4065
$$ plain form
22559 -84227 -113593 -60244 38509 -4 -722 -141136 -155360 -37509 -19645 23248 58649 187328
22547 187328 229280 203310 117008 -40317 -62903 -69156 -97397 -182651 -218289 -186119 8605
22536 8605 188545 286735 247079 114334 165762 187100 64597 -53590 -43360 22888 39063
22525 39063 39909 -9766 77054 63000 -93348 -233933 -137644 71145 128701 79776 128924
22514 128924 191905 173418 139743 127324 -21973 -67766 -120730 -233275 -193323 -52420 -63446
22503 -63446 -138046 -13130 158280 121614 165050 202806 205000 229349 177717 217150 210524 -7725
22491 -7725 -47026 -5648 -33910 116670 -4829 -9519 89762 163576 151324 169738 55887
22480 55887 16777 100788 126953 106046 -51821 -79651 -23893 126184 193600 132037 156102
22469A56102N766j4739p3167l8603q8906P9986Q8493N410J2695Q7416M4030j8884
22457B45599k19002j09538J52072J03370r0957p7008m7438Q3049P7954m4582m2653
22446C0866P515j01178l2918L9221k1040M3769l9939j1036l5228k5628k1037K22875
22434E6242O7941M9358r3232M1798M6111n7645r9729l1828N3479j67834l4979
22423a70318K7033K03303P6020n9480j3524K01926M3250j95708j07120k3043K2806
22412E145m4806j9429N6945N3755r6894J7815l4672q4638K1072m5616O9687J4299
22400h7337Q053K4197N4091r7228j6634j3193J06086j046l3732J27290J03616
22389A74163J41917m2499l5673j38912k2017j4454n3431l959P6799n0528M4729
$$ plain form
22469 156102 161868 147129 73962 35359 -53547 26439 114932 120342 133037 220453 264483 245599
22457 245599 26597 -82941 69131 172501 81544 4536 -42902 40147 118101 73519 30866
22446 30866 38381 -62797 -95715 -56494 -77534 -33765 -73704 -84740 -119968 -145596 -166633 56242
22434 56242 124183 173541 80309 122107 168218 110573 10844 -20984 32495 -135339 -170318
22423 -170318 -143285 60018 136038 76558 63034 264960 308210 112502 5382 -17661 5145
22412 5145 -39661 -59090 -2145 51610 -45284 -27469 -62141 -146779 -125707 -171323 -101636 -87337
22400 -87337 -79284 -55087 -996 -98224 -114858 -128051 -21965 -23011 -56743 70547 174163
22389 174163 316080 273581 237908 98996 76979 62525 9094 5135 81934 31406 76135
22378G6135O6406L0521L8354J1644j56419o7827R1259J2869J19623O3107j15751
22367A69921M7522p7817n4128j1063l3567K0922M7702r8304N0106R234J0621R7850
22355A78999j12147J8561l7123j71946l5592J9555P7781J3511L4411J25042O5684
22344A76736Q1609K6080q672n9530q0784q9225J4490r560M0816J38596j1005N1039
22332B70590r8071j38162m2147j16988J87980J79758j0246k3393l2558j62825
22322A3938L5977k7311k2882N6345p8143M6107k1601l0926K7723J64325J67555
22311C31107o4950j46436r7117o8808R7985m5595p0650k1796j0070R312J10123
22300B3105M6081o339l8097N5385N352K0923K207m4421j11535q145K3034q7324
$$ plain form
22378 76135 142541 173062 211416 223060 66641 -1186 90073 102942 222565 285672 169921
22367 169921 217443 139626 85498 74435 40868 61790 109492 11188 61294 70528 81149 178999
22355 178999 66852 85413 48290 -123656 -159248 -139693 -61912 -48401 -13990 111052 176736
22344 176736 258345 284425 275753 216223 135439 46214 60704 51144 91960 230556 219551 270590
22332 270590 172519 34357 -7790 -124778 63202 242960 232714 209321 176763 13938
22322 13938 49915 22604 -278 56067 -22076 24031 2430 -28496 -773 163552 331107
22311 331107 266157 119721 22604 -46204 51781 6186 -64464 -86260 -96330 -87018 23105
22300 23105 69186 62847 24750 80135 85487 106410 108617 64196 -47339 -55484 -32450 -119774
22288a19774M3397R2880J2400m0300p0170Q5090J11813l7168j02495J19548k9839
22277F5382J38496j1033j04156j11430p8525R8247J21811L9740o2584j22811j36401
22266a63264R3991L0381j2056K4238q5794j21043R3584K57739O5511K9519M745
22255B17551n2791o714K2173J9025M5601o3153L991Q1612j11224j5858P9155M8012
22243B67380J7785O9532j26891o8459O4091Q645p2411L9387k1394Q292m0623O7154
22231B12488M0226M906j25774o8367J56088n0233M9893J16910K9072j56117p8438
22220A30654n4796l8162J06503K0145p137j0281r0211q9906M6031M9685J287q696
22208E5116N1456j17288j70663N4311J43665M3041J24382n2006j33466j01933
$$ plain form
22288 -119774 -76377 16503 28903 -11397 -81567 3523 115336 78168 -24327 95221 65382
22277 65382 203878 192845 88689 -22741 -101266 -3019 118792 158532 95948 -26863 -163264
22266 -163264 -69273 -38892 -50948 -26710 -112504 -233547 -139963 117776 183287 212806 217551
22255 217551 164760 158046 180219 199244 244845 181692 185683 267295 156071 140213 219368 267380
22243 267380 285165 354697 227806 159347 223438 232083 159672 199059 177665 185957 145334 212488
22231 212488 252714 257620 131846 63479 219567 169334 219227 336137 365209 209092 130654
22220 130654 75858 37696 144199 164344 157207 146926 56715 -33191 12840 62525 63812 55116
22208 55116 106572 -10716 -181379 -127068 16597 59638 184020 132014 -1452 -103385
22198a03385J79345p9920j30067r570J87772Q5865j13911J43433L5255L4440m9864
22187A79393j076o6236o2562n7483J51408J44893k43704j83907J1706P3827J6333
22176c7408M0940m3200Q5537J8726M1059J20961N9267n4864q1475J08528q892
22165B49179k4408j0242K6465k8358P823o9771j5810k1384q3854J71845J31868
22154C33353K547r8163j23634j1719J6308q112k00430L323R9873k5047o7483J39911
22142F0727K79716l2684n2300q720j36112r9804J2228m2529J2520J66714O2125
22131B21881j45374p3604L0752O5394J14488r9013j60286n5301l5113P0947J93435
22120A28206J01700J34876O2404j04800n2622o1583j55724Q1577J37429q7896
$$ plain form
22198 -103385 75960 -3960 -134027 -143597 44175 130040 16129 159562 194817 229257 179393
22187 179393 178317 112081 49519 -7964 143444 288337 44633 -139274 -127568 -53741 -37408
22176 -37408 3532 -39668 45869 64595 105654 226615 285882 231018 149543 258071 249179
22165 249179 224771 214529 240994 212636 220459 150688 134878 113494 29640 201485 333353
22154 333353 335900 237737 114103 102384 118692 110580 -89850 -86527 13346 -11701 -79184 60727
22142 60727 340443 307759 255459 246739 110627 10823 23051 -19478 -6958 159756 221881
22131 221881 76507 2903 33655 99049 213537 114524 -45762 -101063 -136176 -65229 128206
22120 128206 229906 364782 427186 322386 269764 208181 52457 134034 271463 183567
22110A83567o2374J68858L3266k9858r7026Q7980L8577O1179J10182l3412q857
22099D52082K8220M526k7337M6690J34066Q6899J8738J31116K23836K2110J3293
22088A134239K48168M16577K33610R7551K24l6664m5300j45454l9968j08977j47593
22077A606413m0438R1807r1305J31296J63825P3224J57036p139j35565J0446K7425
22066A987025M718j89981j93641k79073k40602k86045m0220n9006j03921j10149
22056D89105L1430J47485r4277p5063j96528p1907o6844l0054k4080N2093j8560
22045A42800o304J01491L2741K5055M888O127O208M4813J1238O4802q9461j14992
22033B29406k6573k4490l2879p3581k8961K0468O2812J69995k13552l3226O4250
$$ plain form
22110 183567 121193 290051 323317 293459 196433 284413 322990 384169 494351 460939 452082
22099 452082 480302 484828 457491 504181 638247 725146 743884 875000 1098836 1120946 1134239
22088 1134239 1382407 1798984 2032594 2130145 2130369 2093705 2048405 1902951 1862983 1754006 1606413
22077 1606413 1565975 1657782 1566477 1697773 1861598 1934822 2091858 2084719 1949154 1959600 1987025
22066 1987025 1991743 1801762 1608121 1329048 1088446 802401 762181 703175 599254 489105
22056 489105 520535 668020 573743 498680 302152 230245 163401 133347 109267 161360 142800
22045 142800 136496 237987 270728 295783 300671 306798 313006 357819 369057 433859 344398 229406
22033 229406 202833 178343 145464 71883 42922 63390 126202 296197 82645 49419 113669
22022A13669L1174n3176r7505J20429J1432r6231Q9390o0894j48809M2991J67279
22011A19749J77273J0193M3623n0870k14781q3451N5764K6060M3582P6240J62951
22000C66333L1376m5275j46637j39460Q4003J07070j06730o9804o7049K2485k5217
21989A1095q6006M9056R6363k6065r1417J01093J2112r0446m9921K2117J01568
21978D9549M2465Q251Q5495J53799k6824j17804O6145L4091M089L8389J1150q1813
21966B66982P794q9282j06665N1303J0948O971k673K0166p7698q816J33266J50647
21954C62943N791j6599L0814j17047m1686Q8134j699j1n2393p6490j1885l5169
21942A34703j46093j0834L8848m2054N470L9540K2297L720q0482m5573J60437
$$ plain form
22022 113669 144843 91667 -5838 114591 126023 29792 119182 58288 -90521 -47530 119749
22011 119749 297022 307215 350838 299968 85187 1736 57500 83560 127142 203382 366333
22000 366333 397709 352434 205797 66337 150340 257410 150680 80876 13827 36312 11095
21989 11095 -74911 -25855 70508 44443 -46974 54119 66231 -24215 -74136 -52019 49549
21978 49549 92014 100265 185760 339559 312735 194931 261076 295167 299256 337645 348795 266982
21966 266982 274776 185494 78829 130132 141080 148051 145378 165544 87846 79030 212296 362943
21954 362943 368734 352135 382949 265902 224216 312350 310651 310640 258247 181757 169872 134703
21942 134703 -11390 -22224 16624 -25430 -19960 19580 41877 45597 -34885 -80458 79979
21931G9979o862l9142n120J19478M7204j29421M9219O3515N551j6451p5003J80498
21919B73445J45950j00678n1734o0047k7002M7104J18313M3185r592J5602l2632
21908C61914j29832l7856J09177p8560J4710K2827M837J5493n4069L9500K5900
21897B94041j17874q2636P9846J30825K1346K0859j1086j27513L5321j8612n8370
21886A66147P1250J08534j9592o5630O2834m00l2574r7474o2044j0940j47489
21875b7378p72L8764q1541J42226L9343N1572M4629j86165r0619L445Q34P2142
21863F480P8234j3238J17523K82675L304o9468j01485l2660N659n6645J9546K1702
21851B61627O9704j54134n6580r0140l6941P2173N689n1441J6867Q6911K24033
$$ plain form
21931 79979 73117 33975 28855 148333 195537 66116 115335 178850 184401 167950 92947 273445
21919 273445 419395 318717 266983 206936 179934 227038 345351 388536 378944 394546 361914
21908 361914 232082 194226 303403 224843 239553 262380 267217 282710 228641 268141 294041
21897 294041 176167 93531 173377 304202 325548 346407 335321 207808 243129 224517 166147
21886 166147 237397 345931 326339 260709 323543 323143 290569 193095 131051 120111 -27378
21875 -27378 -28150 10614 -70927 71299 110642 162214 206843 20678 -69941 -66496 -65662 6480
21863 6480 84714 71476 188999 471674 474978 405510 304025 271365 277024 220379 239925 261627
21851 261627 331331 177197 120617 30477 -6464 65709 71398 19957 36824 123735 347768
21840C47768p169n8259o5635Q2102n7211J2385J21843p781j24684l1674N0682
21829B62367j27093J0559J2777l2622O0642J69988l0129k4196n1437J24840N0828
21818D26524L5857J11746q0300r1205j18187k5769j06451p2534J00981J90553
21808C71215n9662q7138p3883K6206o3412J02335K5244P5340o9519j3280r3778
21797A39668N9631o147l4660n093M981k3238L9461Q1692j5910o5188M0422R620
21785B25239L0737m2654j3773m8447N4223K741m0610J23429L2306P650j772J4535
21773C43604M8948j07004j86548J24223J01846O5634L2936k7473J61J41703N364
21762E43394l3911m480r816j04063J74294R4631p8223M6622j49241J03147J11219
$$ plain form
21840 347768 340599 282340 216705 298807 241596 253981 375824 368043 243359 211685 262367
21829 262367 135274 145833 158610 125988 186630 356618 326489 302293 250856 375696 426524
21818 426524 462381 574127 493827 402622 284435 258666 152215 79681 180662 371215
21808 371215 311553 224415 150532 176738 113326 215661 240905 316245 246726 233446 139668
21797 139668 199299 193152 158492 153399 158380 135142 174603 256295 240385 175197 215619 225239
21785 225239 255976 213322 199549 151102 205325 208066 167456 290885 323191 330841 329069 343604
21773 343604 392552 285548 99000 223223 325069 390703 423639 396166 396327 538030 543394
21762 543394 509483 505003 495187 391124 565418 660049 581826 628448 479207 582354 693573
21751F93573K2201O9669r7346O3798J18386o4101r4957L3426j13195m1853n6357
21740E33244k9826m5822n544O2983l3654K01764J4545k06610n7128j37798K2984
21729C19138O2744M4046J9538m2943R0839P210l6821j45946M5865J11753R7840
21718E73263M8497N3594L5894o413j69775m8082k7054J00556J14840n821p1466
21707E98033j01376j60475j84595R0581J94498K17017J06269q1781j80750q9557
21697D07864k7776J69850L1174k6640R5056j46063Q746r9657o5572n6419M4182
21686C34745Q9763P2165K04960N8750p8613L4025k2451O706J41966J06791j2206
21675I36601j82007m5347R7758o1482J18505Q4006Q1013o0508j44731j2964K2746
$$ plain form
21751 693573 715774 785443 688097 751895 870281 806180 711223 744649 631454 589601 533244
21740 533244 503418 457596 452052 515035 481381 683145 697690 491080 433952 296154 319138
21729 319138 381882 425928 445466 402523 493362 500572 463751 317805 363670 475423 573263
21718 573263 621760 675354 711248 704835 535060 486978 459924 560480 675320 669499 598033
21707 598033 496657 336182 151587 242168 436666 653683 759952 678171 497421 407864
21697 407864 380088 549938 581112 554472 649528 503465 512211 412554 346982 290563 334745
21686 334745 424508 496673 701633 760383 681770 715795 693344 700050 842016 948807 936601
21675 936601 754594 709247 807005 745523 864028 948034 1029047 968539 823808 810844 833590
21664H33590J0095L8094P5212p0342k3970J13584l8923o158K0718M8910L4352
21653A035162M7661R3931k2772m4322K4751k0266r6721M2603M9772q3854j64390
21642H61555L0189J37711J63346N9187K05770J42035L1860l657J6041n9853j03382
21631A480802O6652L7298l6054q0147n6368j63456n1509K05962J79955O5067L6866
21620A685068K346j93850o8477N4135n9814Q1249j00000j46809n8633Q3707l1270
21609A247652k0976m0584J37858K9241R783m5445N6546J58743O9324j45058l755
21598A453329M4403k7691L2001O4390o7070l1762l6297m8101p0549J44595J68675
21587A625923R3764Q2817P0140R7548j1891p1370J40868J11012J2295N6490Q3580
$$ plain form
21664 833590 843685 881779 956991 886649 862679 976263 937340 931182 951900 1000810 1035162
21653 1035162 1082823 1176754 1153982 1109660 1134411 1114145 1017424 1060027 1109799 1025945 861555
21642 861555 891744 1029455 1192801 1251988 1457758 1599793 1631653 1627996 1644037 1584184 1480802
21631 1480802 1547454 1584752 1548698 1468551 1412183 1248727 1197218 1403180 1583135 1648202 1685068
21620 1685068 1687414 1493564 1425087 1479222 1419408 1500657 1400657 1253848 1195215 1278922 1247652
21609 1247652 1226676 1186092 1323950 1353191 1362974 1317529 1374075 1532818 1602142 1457084 1453329
21598 1453329 1497732 1470041 1502042 1566432 1499362 1467600 1431303 1383202 1312653 1457248 1625923
21587 1625923 1719687 1802504 1872644 1970192 1958301 1886931 2027799 2138811 2151106 2207596 2291176
21576B291176q2953O0571J06304J62094P2883m0029J4716J71215P7797Q3843N5162
21565B972779J83267K35802J31803J77139j38773j6790L67643K26286J09281J28564
21555D377001J74617J47475K00771K02910J54018J81297K32676M08466K49433
21546F328664K82570K54814N42820M78824N43412N08481O82016O38807N60417
21537A0820825O91563N47498M33304M42274N83115O64332N77156O00457P94122
21528A6154646J181889J293189J617706J741592J951427J993471K059793K191099
21520C0184812K348290K675458L028365L420688M129833N058235O362191Q124732
21512F5332604J0688893J4108835J8933603K5742569L4750479M5186613N3071101
$$ plain form
21576 2291176 2208223 2268794 2375098 2537192 2610075 2570046 2584762 2755977 2833774 2917617 2972779
21565 2972779 3156046 3391848 3523651 3700790 3562017 3545227 3912870 4139156 4248437 4377001
21555 4377001 4551618 4699093 4899864 5102774 5256792 5438089 5670765 6079231 6328664
21546 6328664 6611234 6866048 7408868 7887692 8431104 8939585 9621601 10260408 10820825
21537 10820825 11512388 12059886 12493190 12935464 13518579 14182911 14760067 15360524 16154646
21528 16154646 17336535 18629724 20247430 21989022 23940449 25933920 27993713 30184812
21520 30184812 32533102 35208560 38236925 41657613 45787446 50845681 57207872 65332604
21512 65332604 76021497 90130332 109063935 134806504 169556983 214743596 267814697
21505B67814697M9804196L2975015J2592649J780917N185245J2192498Q313556
21498C90658773q515286k6985037l3530079k4946780p112400J3001255K9703752
21491C32274198L4553038K2910794K783140j0189882q927995p25962j646022j7469188
21483C53562121l9250048n2554299n2165996m3401248l3041638k4556686j8515086
21476I0077120j4146603j0814955q459622o701910n175081m109503l351632k869738
21468C4448076k770426k622239k319161j818867j733183j872573j723871j545785
21460A8041971j562308j198782j031519r76905o14893m36424n27299n15655m58767
21451A0719419n53295m61003m26505m72995m99155o66674o95533o60902n12719
$$ plain form
21505 267814697 317618893 350593908 363186557 364967474 370152719 382345217 390658773
21498 390658773 382143487 355158450 321628371 296681591 289569191 302570446 332274198
21491 332274198 366827236 389738030 392521170 382331288 373403293 372677331 371031309 353562121
21483 353562121 314312073 261757774 209591778 166190530 133148892 108592206 90077120
21476 90077120 75930517 65115562 56655940 49954030 44778949 40669446 37317814 34448076
21468 34448076 31677650 29055411 26736250 24917383 23184200 21311627 19587756 18041971
21460 18041971 16479663 15280881 14249362 13272457 12657564 12221140 11693841 11178186 10719419
21451 10719419 10166124 9705121 9278616 8805621 8306466 7639792 6944259 6283357 5770638
21442E770638l84283l02463j24742k64284j22626k24987j77792j59890k36916
21433C772655k24365j20774k34518q2679P9857j9703r9019j18064j55998j33371
21423B664021r8510r2966o5431L3919M5113l4477Q90L8189k03646j21937L1349
21412B196514j80437j39317p5555k7481q9576j05179J20619Q4906R273q2618k1626
21401A689523R4091n4173p4416q322j18909L00m7617O1427m7371j09089K076J21820
21389A509340J59901n7202j88868j38538l7621J25582M4514r4667L0131P2946
21379A425518J06950n5676J6573J0183j91872j57257j23449l9333J39252m6345
21369A084544q6086J30914J5393Q594n1009p3765j8069j41139j00145J396Q656
$$ plain form
21442 5770638 5386355 5083892 4959150 4694866 4572240 4347253 4169461 4009571 3772655
21433 3772655 3548290 3427516 3192998 3110319 3190176 3170473 3071454 2953390 2797392 2664021
21423 2664021 2565511 2472545 2407114 2441033 2486146 2451669 2452559 2490748 2287102 2165165 2196514
21412 2196514 2016077 1876760 1801205 1773724 1684148 1578969 1699588 1784494 1793767 1711149 1689523
21401 1689523 1783614 1729441 1655025 1646703 1527794 1528094 1480477 1541904 1494533 1385444 1387520 1509340
21389 1509340 1669241 1612039 1423171 1284633 1247012 1372594 1417108 1322441 1352572 1425518
21379 1425518 1532468 1476792 1493365 1503548 1311676 1154419 1030970 991637 1130889 1084544
21369 1084544 998458 1129372 1144765 1153359 1102350 1028585 1010516 869377 769232 770628 779284
21358G79284j15502j8117q3230j36589j38881J17545l5424o3912M8722j4460k4119
21347C15317N9669M6200K5493J6300J24756N8164m2321R9056p3206M0779k9142
21336F41065k5129n4020O2714J17868M3207O2077J44110J76642K01944M5691O5224
21325A481393M6163k35459j14251j9027O3943J03682J4419n5167k6386J03337
21315A362647J29288J1171n2414j42936m7786p3856m5826j2123p3805J1802k4390
21304A041772l4798J29261Q6401L5699q283L5667Q7558J00240J48347J74032L38
21293A796234l6048q4778j23619j78553m8764m5059j0003O1909K19521K51339
21283A802179O975k7945j70757l09513j98048j70723r1828j37119j4505j52447
$$ plain form
21358 779284 663782 645665 562435 425846 286965 404510 369086 305174 353896 339436 315317
21347 315317 374986 421186 446679 462979 587735 645899 603578 702634 629428 670207 641065
21336 641065 615936 561916 624630 742498 785705 847782 991892 1168534 1370478 1416169 1481393
21325 1481393 1527556 1292097 1177846 1158819 1222762 1326444 1340863 1285696 1259310 1362647
21315 1362647 1491935 1503106 1450692 1307756 1259970 1186114 1140288 1128165 1054360 1066162 1041772
21304 1041772 1006974 1136235 1222636 1258335 1250052 1285719 1373277 1473517 1621864 1795896 1796234
21293 1796234 1760186 1675408 1551789 1373236 1324472 1279413 1269410 1331319 1550840 1802179
21283 1802179 1809154 1781209 1610452 1300939 1102891 932168 840340 703221 688716 536269
21273E36269l6301J492Q7065k2257K303j18975j52477n3202O1972L8419n9412
21262B84896l2019o6528k8197j03942P0824j3618j6816o0427M2436M3423M1997
21251A62029j7357O0488O4531j6935j5142N2390Q1473j20439j91656R0862n8838
21240I1406l1464J76699J33707k16973r2136j6925L0594J28553M7948j24932l0873
21229I5604M227k9307j0015N4000o3986J0776k3253N7953J44830J18998j03868
21218B55959l921j10813p1524M0612m7922j0038O1908Q4880J06991J2954j96005
21207A23081M1826J8524r5199m1242R7114j6591j2406L2336j44971Q0959M4617
21196A28048P2602K0976j15066j7238J3506M4051j1487K7470q0511J12596J856
$$ plain form
21273 536269 499968 501460 588525 566268 568571 449596 297119 243917 305889 344308 284896
21262 284896 252877 186349 158152 54210 125034 111416 94600 34173 76609 120032 162029
21251 162029 144672 205160 269691 252756 237614 290004 371477 251038 59382 150244 91406
21240 91406 59942 236641 370348 153375 61239 44314 74908 203461 251409 126477 95604
21229 95604 99831 70524 60509 114509 50523 61299 38046 95999 240829 359827 255959
21218 255959 252038 141225 69701 110313 62391 52353 114261 199141 306132 319086 123081
21207 123081 164907 183431 88232 46990 144104 127513 115107 147443 2472 83431 128048
21196 128048 200650 221626 106560 89322 102828 146879 135392 162862 82351 194947 196803
21185A96803O4060J4881l4692k4628p7488j41874k4763J70473N8591j10360q5889
21174E114J03210J49402j76532r8774r6253k1345o0827J5211K12921R4337j03907
21163B2557q5291j4855Q0923J40K6797J10484M3124j9736q5490j21767p6548Q4929
21151c4733J45123K2443J41754P0580j46007j62203O803P9838Q7335M4522q0714
21140A74741o5333l9792L8619J19558J50994J0807k7003l1721J9084P6024j1172
21129D14806o5071l5850j10692j7855K6639Q670Q8435k3807K6890J08584M5576
21118D66325j50579k7020J6479j7747p5140p7392P483O4889O2151J9297J8503
21107C07249j9968K2397M9258J562j21332n3877K2615r0508L0874r0971j86778
$$ plain form
21185 196803 260863 275744 241052 216424 138936 -2938 -27701 142772 201363 91003 5114
21174 5114 108324 257726 81194 -17580 -113833 -135178 -196005 -180794 32127 126464 22557
21163 22557 -62734 -77589 3334 3474 30271 140755 183879 164143 78653 -43114 -119662 -34733
21151 -34733 110390 132833 274587 345167 199160 36957 43760 123598 210933 255455 174741
21140 174741 109408 69616 108235 227793 378787 389594 362591 330870 349954 425978 414806
21129 414806 349735 313885 203193 185338 211977 220647 309082 285275 312165 420749 466325
21118 466325 315746 288726 305205 287458 212318 134926 142409 207298 269449 288746 307249
21107 307249 287281 309678 358936 360498 239166 185289 207904 117396 148270 57299 -129479
21096a29479n6975R0805J79213k1371O4520J79582j36110j34239J39459J0751
21086A86156p8814J05712N8397K4146p1818r102O1674O846j1569j54602n7686
21075E9340j5033m4175J24397J65581q164r0463l6376M0859N4342K4376m393m5579
21063B24712k0673o0391k6531p847O6871M3702j0693k2225l9398K7951J47898
21052C23376j4006o6205j9229Q1142N5415q4510m7209R615Q4330n0574j3708K470
21040B60907R6384o8075l2735J00082k5097j93154j85077M1466N0078Q6376q4506
21029D6649k47158j11346J43413J14121J87418P921M1660L3980k35998N7526L2756
21018G0942K3719J17679L690J0496L9577J35611J35855n5058n2601L5268P0401
$$ plain form
21096 -129479 -186454 -95649 83564 62193 126713 306295 170185 35946 175405 186156
21086 186156 107342 213054 271451 295597 223779 214677 276351 283197 271628 117026 59340
21075 59340 44307 132 124529 290110 281946 191483 155107 195966 250308 274684 270291 224712
21063 224712 204039 143648 117117 109270 176141 219843 209150 186925 147527 175478 323376
21052 323376 309370 243165 223936 305078 360493 275983 228774 238389 322719 272145 258437 260907
21040 260907 357291 289216 256481 356563 331466 138312 -46765 -5299 44779 131155 46649
21029 46649 -200509 -311855 -168442 -54321 133097 141018 182678 216658 -19340 38186 70942
21018 70942 94661 212340 216030 226526 266103 401714 537569 482511 429910 465178 535579
21007E35579k9178q0425q7554L3936j4783J6864M3132j03947P6268k35Q0875L8801
20995E09333j9602j28686r015J2348O1363j5170j23915O4147Q7046M3540K0088
20984E01477J804O3670O0342N795p5505J45541Q4000j8254k36242k51775O8477
20973C49330R8357L5703M5729N2152R5544O9152K401j62581L829K4537J5237J2417
20961F41807k8749j30241Q0125l5833J31851M6868j40756j21580l1048j16046
20951B96398N4819J7296K7196n7158J51765K34811j65593l3688L0379o6453q7155
20940D02617J0059J29359Q8565L8002J08126n6509Q511r553o2283J16746J35368
20929I09008J1516p0085m2360q6887p4970J61820J46695J51188J19093R8399J31846
$$ plain form
21007 535579 506401 425976 338422 372358 357575 374439 417571 313624 389892 389657 470532 509333
20995 509333 489731 361045 352030 364378 425741 410571 286656 350803 437849 481389 501477
20984 501477 503281 566951 627293 633088 557583 703124 787124 768870 532628 280853 349330
20973 349330 447687 483390 529119 581271 676815 745967 748368 585787 589616 614153 629390 641807
20961 641807 613058 482817 562942 527109 658960 705828 565072 443492 412444 296398
20951 296398 351217 368513 395709 338551 490316 725127 559534 525846 556225 489772 402617
20940 402617 412676 542035 630600 668602 776728 720219 728730 719177 656894 773640 909008
20929 909008 920524 850439 808079 721192 646222 808042 954737 1105925 1225018 1323417 1455263
20918A455263J92975L49457J26915J20425J14600L6742Q5601J87803P2241j88867
20908B553155j60450n6097j5729P1229R2821K67962J32501n819P1630M7757j180
20897B997780r791n3539j14854r6031k24262l04412l14817j09237p5446j83493
20887A511898o9655K0864j02430k39097o1958L1576l3638M2121p7211m9499M8983
20876A021954R3558J84455J5111j9445l428j31206l2082r925K1319j05706K938
20865A037543J74740l3729p2662J0263J14584N9787j24760m5916J74669K01474
20855A495993N8370r3445p2907j89400j82041J683o9405q9405j9915Q8359J08363
20844A036250Q5727J38894K4522r829M699q3537r3808O5753P1489J2870J44759
$$ plain form
20918 1455263 1648238 1997695 2124610 2245035 2359635 2396377 2481978 2669781 2742022 2553155
20908 2553155 2392705 2336608 2320879 2392108 2484929 2752891 2885392 2879573 2951203 2998960 2997780
20897 2997780 2987989 2934450 2819596 2723565 2499303 2194891 1880074 1770837 1695391 1511898
20887 1511898 1442243 1463107 1360677 1121580 1059622 1091198 1057560 1099681 1022470 972971 1021954
20876 1021954 1115512 1299967 1315078 1295633 1292205 1160999 1128917 1118992 1140311 1034605 1037543
20865 1037543 1212283 1178554 1105892 1116155 1230739 1290526 1165766 1119850 1294519 1495993
20855 1495993 1554363 1460918 1388011 1198611 1016570 1018253 948848 859443 839528 927887 1036250
20844 1036250 1121977 1260871 1285393 1275564 1280263 1196726 1102918 1168671 1240160 1253030 1397789
20833A397789O2435r0511q194Q2816J93580L8089L4191Q8918N3049l779O0965
20822A909348J20600J25638J3293j6917J4197R0168J53299N4689L3227M6702J08024
20811B652268K1330J3033J52557K55666K24374N3839J98048L02161K34495J69871
20801D277642R9275J74846K33028K34366K95382L44905K79039M20052M34078M14985
20791G207598K89266L17604L88476K36472M30964N70878Q78880Q49786P00344
20782A1870268P47798P79112O04831O18525O06912P58632Q13245Q10047J055091
20773A8664461J436538J777848K190992K366008K791924L523534M474231N658527
20765D2884063P210743R148266J2227607J6700324K2875560L1266292M0416130
$$ plain form
20833 1397789 1460224 1369713 1361519 1444335 1637915 1676004 1710195 1799113 1852162 1848383 1909348
20822 1909348 2029948 2155586 2168879 2151962 2166159 2256327 2409626 2464315 2497542 2544244 2652268
20811 2652268 2673598 2686631 2839188 3094854 3319228 3373067 3571115 3873276 4107771 4277642
20801 4277642 4376917 4551763 4784791 5019157 5314539 5659444 5938483 6358535 6792613 7207598
20791 7207598 7496864 7814468 8202944 8439416 8870380 9441258 10320138 11169924 11870268
20782 11870268 12618066 13397178 14002009 14620534 15227446 15986078 16799323 17609370 18664461
20773 18664461 20100999 21878847 24069839 26435847 29227771 32751305 37225536 42884063
20765 42884063 50094806 59243072 71470679 88171003 111046563 142312855 182728985
20758A82728985M5220917L6707863J3144163j3930190k9805408l0291212k1230250
20751A82544868r374930L119399J6372308K9354891L6999680L0447782O736299
20744B96200297k2628861m1281081m3237497l6107227k6888844j8858812j2760794
20737I4437181p979839m265585j090671J683872N056947R174438J4565457K1751320
20729A33333120L1081380M1018540M5654310L5418610R655884j8554713l4059989
20722B43547142l3072334k2855666j0268715K986380J6413799K9190048L5772443
20715B61713097K7405357K441150k6252400m3690675m5339444l7920160k8820855
20708A09536070k1323329j6068000j2108740r078897p193773n744591m525515
$$ plain form
20758 182728985 227949902 264657765 277801928 263871738 234066330 203775118 182544868
20751 182544868 173169938 176289337 192661645 222016536 259016216 289463998 296200297
20744 296200297 273571436 232290355 189052858 152945631 126056787 107197975 94437181
20737 94437181 86457342 82191757 81101086 82784958 87841905 97016343 111581800 133333120
20729 133333120 164414500 205433040 251087350 286505960 296161844 277607131 243547142
20722 243547142 210474808 187619142 177350427 180336807 196750606 225940654 261713097
20715 261713097 289118454 291559604 265307204 221616529 176277085 138356925 109536070
20708 109536070 88212741 72144741 60036001 50957104 43763331 38018740 33493225
20701C3493225l644459k827141k358008j913839j622344j413684j202429j089391
20693A7421930r87607j022204p00261o89276p24006o49539q12388q88228p50257
20684A0198164o25802o73015n87454k58535j72088j80041l36463l19420m09374
20675F635972o02186m95299l44327k63719k74559k41037l17869l06491j66802
20666C623683j97782r3177J6510j25571j10370l7858k40091n8383o5217n3150
20656B658594m0147l665p6123r659M6796j08905j91803j62894O3126R1411j08780
20645B157951q3169j41215q0962l3018R7490J74571j78393J5398k8351l7968N8843
20634A921177j62298j8839J1573L2771j4862r8508k12543J2997j88429r4822J5553
$$ plain form
20701 33493225 29848766 27021625 24663617 22749778 21127434 19713750 18511321 17421930
20693 17421930 16434323 15412119 14711858 14022582 13298576 12649037 11836649 10948421 10198164
20684 10198164 9572362 8899347 8311893 8053358 7881270 7701229 7364766 7045346 6635972
20675 6635972 6033786 5538487 5194160 4930441 4655882 4414845 4096976 3790485 3623683
20666 3623683 3425901 3332724 3349234 3223663 3113293 3075435 2835344 2776961 2711744 2658594
20656 2658594 2618447 2614782 2538659 2529000 2575796 2466891 2275088 2112194 2175320 2266731 2157951
20645 2157951 2074782 1933567 1852605 1819587 1917077 2091648 1913255 1928653 1900302 1862334 1921177
20634 1921177 1758879 1740040 1751613 1784384 1769522 1671014 1458471 1471468 1283039 1188217 1203770
20623A203770K0003J4963k8981r8752N8518n7939j02416m2904n6630L1614J52442
20612A093688M8597P7375p9196j67023n547N6375l9211j10184N5336R9518N085
20601A034813N8151Q3603l8090j05668j09810o0476M2216P4009j54111m1960q6707
20590F95970j34974j8525K9562R5281r6386k46348j83557q559L7020J01280q7168
20579A83596L0647J89569O2014n1837k19347J8631J20885L3469K3347L4124J57560
20568E82658J07058Q8986Q7775L39492J15207j36964k25551j73325j82996j59455
20558D42885l9243K07352K62762K77278J65691J80600J43827j4419L8631j97652
20548A467712l35637r5964J6171p4890Q704j03598J6553N0834J01368J06791j38594
$$ plain form
20623 1203770 1223773 1238736 1209755 1111003 1169521 1111582 1009166 966262 909632 941246 1093688
20612 1093688 1142285 1219660 1140464 973441 967894 1024269 985058 874874 930210 1029728 1034813
20601 1034813 1092964 1176567 1138477 1032809 922999 862523 904739 978748 824637 782677 695970
20590 695970 560996 542471 572033 667314 570928 324580 141023 132464 169484 270764 183596
20579 183596 214243 403812 465826 413989 194642 213273 334158 367627 390974 425098 582658
20568 582658 689716 778702 866477 1205969 1321176 1184212 958661 785336 602340 442885
20558 442885 403642 610994 873756 1151034 1316725 1497325 1641152 1626733 1665364 1467712
20548 1467712 1132075 1036111 1052282 977392 986096 882498 899051 949885 1051253 1158044 1019450
20537A019450k02450j79521k1397j03970p924L6712Q888k79O5199J7932k10415
20526D22225q678J22022M6942n707j67621j56195P2196J72320K30382J65128J58785
20515A051799R0626J32355O3746q349m3801j22131k13644j18477o3210R3402L54443
20504A216759L38091J68203J13257p1430m0628m383l18550k90846k19076p4136
20494H17261j81457M4726K20897K15808R8316O1991R9872j68214l59134k04741
20484F45325q8907j20586j86990o3867J9619n1050q0113o257P6174q3403J1626
20473G1571j45776J02003J31448l2553R0621R2566M7234P3321K7347K5032O0142
20462E42956Q2992m2271q2539o905j49406q7475p1312j57959J7116L3034n3076
$$ plain form
20537 1019450 817000 637479 616082 512112 504188 540900 549788 549509 614708 632640 422225
20526 422225 413547 535569 582511 576804 409183 252988 325184 497504 727886 893014 1051799
20515 1051799 1142425 1274780 1338526 1330177 1286376 1164245 950601 832124 768914 862316 1216759
20504 1216759 1554850 1723053 1836310 1764880 1724252 1719869 1401319 1110473 891397 817261
20494 817261 635804 680530 901427 1117235 1215551 1277542 1377414 1209200 850066 645325
20484 645325 556418 435832 248842 184975 204594 153544 73431 67174 143348 59945 71571
20473 71571 -74205 27798 159246 126693 217314 309880 357114 430435 457782 482814 542956
20462 542956 625948 583677 501138 494233 344827 257352 186040 28081 45197 78231 25155
20451B5155k9990K945L1116L3081N2170J84613M9783j16982l3046k227j50455
20440D6163M2337Q9121M2293O0968J7442r0500n9864O1138J71893k8935j83347
20429A68709j19966k03J72344J25711l6278k14274J3380J39963J38453j20044
20419B67795j18426k5303o3741K4443p9271J11473P5255J6476q364M697J1520
20408B16554K4581k0490Q3465j29403k5718K6681l1896j0158N9041m0658O5627
20397B17626m4343j40107k3542N0060J19983L8410o6377N579N180o1102j41789
20386d0422o4742K16127K23912o0017j35211O8295o683j21961L1671k917Q6570
20375A94622j35865j03447R8950N4207O2543O1930p4175q0446p671p3762n9268
$$ plain form
20451 25155 -4835 -1890 29226 62307 114477 299090 348873 231891 198845 196618 46163
20440 46163 88500 177621 219914 280882 298324 207824 147960 209098 380991 352056 168709
20429 168709 48743 48540 220884 346595 310317 96043 109423 249386 387839 267795
20419 267795 149369 124066 60325 84768 5497 116970 192225 208701 200337 205034 216554
20408 216554 241135 220645 304110 174707 148989 175670 143774 133616 192657 151999 217626
20397 217626 173283 33176 9634 59694 179677 218087 151710 157289 162469 101367 -40422
20386 -40422 -105164 110963 334875 274858 139647 207942 201259 79298 110969 108052 194622
20375 194622 58757 -44690 54260 108467 171010 232940 158765 78319 70648 -3114 -62382
20364f2382M9739M7280N3167o0628M45J0598L0259J51444J40944J9876q9411k06908
20352H4423j04196K3647J36290K10720R1188j04393j78344J7472K6047m4537j81940
20341b3623j49088q9679O5948Q8071J04259P1629P6869O0804k8904m0213J8999
20330A55072p9391r6199R0476m1137m7920M1618J03293N9368P0285j53320j03282
20319a137L124J16176n9648p592Q134p3493O9161O0333k122N4822r7051n3550
20307A7157J5932L8872L5001m8210k8869L7922K24126k8313L3076j4013O051O264
20295B94996L2656P2987J00692j6017j7135j53820r4727P4800J53501L7237n0412
20284D34758n9767l2067k0256n5830P0276J80451K4218J9895j16742j45841j496
$$ plain form
20364 -62382 -12643 34637 87804 27176 27621 38219 68478 219922 360866 380742 291331 84423
20352 84423 -19773 3874 140164 350884 442072 337679 159335 176807 202854 158317 -23623
20341 -23623 -172711 -262390 -196442 -108371 -4112 67517 144386 205190 176286 136073 155072
20330 155072 75681 -20518 69958 28821 -19099 22519 125812 185180 255465 102145 -1137
20319 -1137 1987 118163 58515 50923 59057 -14436 54725 115058 112936 167758 70707 17157
20307 17157 33089 71961 106962 58752 29883 67805 291931 263618 296694 282681 288732 294996
20295 294996 327652 400639 501331 485314 468179 314359 219632 294432 447933 485170 434758
20284 434758 374991 342924 322668 266838 337114 517565 541783 561678 444936 299095 297599
20273B97599o5662J5537J2116N7552p5127n0991J3640j3896p3694J23653K38037
20262D78764L4300r8367j15199j00791j96384L8602P8444R1114q4440j48585k2699
20251d5241J92068R6460j50629r1016J76156L3655j18626p2192N1792Q901J10362
20240A91690J69148R0757r2177L847R2030j0789P3181J36395j42775j18468k4892
20229C67947M873j38477K4579R0157j01702o2102N6894K1099o9084k3850p3395
20218I6939q0235Q0976J07271Q2888J25283n1219j11875j15057q7722J18291J51421
20207C16961j5304p0892m28L9968q180N5719J16834k5060j23066N2497J05324
20196D44373P6269P123j42678m1422k3309L6637J19819Q5192J78669P0912O6547
$$ plain form
20273 297599 231937 247474 259590 317142 242015 191024 204664 190768 117074 240727 478764
20262 478764 513064 414697 299498 198707 2323 40925 119369 210483 126043 -22542 -45241
20251 -45241 146827 243287 92658 1642 177798 211453 92827 20635 72427 81328 191690
20240 191690 360838 451595 359418 363265 455295 444506 517687 654082 511307 392839 367947
20229 367947 372820 234343 258922 349079 247377 185275 242169 263268 194184 170334 96939
20218 96939 16704 97680 204951 287839 413122 361903 250028 134971 47249 165540 316961
20207 316961 301657 230765 230337 270305 262125 317844 434678 409618 286552 339049 444373
20196 444373 520642 527765 385087 343665 320356 356993 476812 562004 740673 811585 878132
20185H78132J91140K03355L4934K49800O8154J2289J31594j70709l49263j55685
20175A093741L3149K08599K22186J95250J69748J58590J2108O30j88471k45330
20165A660200k20330k34584j98421j74591p6346J21151L0155J2516j5463K120
20155I06407J95697J14681l2694R1877K52646J49905M2181m3833j13654j93907
20145A369306j16218J29207M0279J00404J32782J42156J18769j1989j77521r3258
20135A633917j09845j30635k17600l1534n1860q3479m3920n6498n7774M7240m4538
20124H53474M3621Q0881r3851M8401J5823r9635m3649J80629Q2469n1722j63658
20113H52783j362p7008N0011m0772P216m5783P3891Q6127N8379K9923J01630r5822
$$ plain form
20185 878132 1069272 1272627 1307561 1557361 1625515 1637804 1769398 1598689 1249426 1093741
20175 1093741 1126890 1335489 1557675 1752925 1922673 2081263 2093371 2094001 1905530 1660200
20165 1660200 1439870 1205286 1006865 832274 755928 877079 907234 919750 904287 906407
20155 906407 1102104 1216785 1184091 1275968 1528614 1678519 1720700 1676867 1563213 1369306
20145 1369306 1253088 1382295 1422574 1522978 1655760 1797916 1916685 1904696 1727175 1633917
20135 1633917 1524072 1393437 1175837 1144303 1092443 1008964 965044 908546 850772 898012 853474
20124 853474 897095 977976 884125 932526 948349 848714 805065 985694 1068163 1016441 852783
20113 852783 851421 774413 824424 783652 790868 745085 818976 905103 963482 993405 1095035 999213
20101I99213j38278m3179M99k1788N4922L5045J19774J58785P2983N6486N5021
20090A349483K0144k8384j8314q6930N8518M7138M642k9586J33029J48839L04910
20079A903489Q3411R3224l3672j23908J09794J89213O4034J80534K59344R3434
20069B818897K66927K59894K50974K45115Q8465K47043L55131L27573L95452M46917
20059E702388M91448M24277N12509O98716P22205Q33613R00134R01759Q40654
20050A2027703J009424J435540J876686K317470L048857M305331O171949Q985465
20042D1178425J3765556K2121298L5837535N0810178M0788556j0464858m0295505
20035A53741185l4945527k2388022j0985264j506485P927378J9982867L6991541
$$ plain form
20101 999213 860935 817756 818255 796467 851389 886434 1006208 1164993 1237976 1294462 1349483
20090 1349483 1369627 1341243 1322929 1235999 1294517 1341655 1346297 1316711 1449740 1598579 1903489
20079 1903489 1986900 2080124 2046452 1922544 2032338 2221551 2285585 2466119 2725463 2818897
20069 2818897 3085824 3345718 3596692 3841807 3930272 4177315 4532446 4860019 5255471 5702388
20059 5702388 6193836 6618113 7130622 7829338 8551543 9385156 10285290 11187049 12027703
20050 12027703 13037127 14472667 16349353 18666823 21715680 26021011 32192960 41178425
20042 41178425 54943981 77065279 112902814 163712992 204501548 194036690 153741185
20035 153741185 118795658 96407636 85422372 83915887 91843265 111826132 148817673
20028A48817673N6709045N7039842J8699295P64684L549839k8683453n6893258
20021B00003667m9953822l4164975k0230292r452015J70087J0206620K3434344
20014A20013614L9538852M0633856j552870m2475570m2538475l0696041k0384202
20007F2539164j3193476q309870n245694l673479k489102j522060q54629m55760
19999B6795094J01220N89537R46979J685309K785902M194661O555291J0003558
19991E3657551J6075221K6476094M2506410N6275117L2218673k5480787m5097745
19984A56630534l4848728k0973007r062218J074500J1529911K4984140M3952551
19977A73287683O2236761N1430012J1857402N699158J304896m3375607o4291385
$$ plain form
20028 148817673 205526718 262566560 281265855 282030539 285580378 256896925 200003667
20021 200003667 150049845 115884870 95654578 86202563 86372650 96579270 120013614
20014 120013614 159552466 200186322 198633452 156157882 113619407 82923366 62539164
20007 62539164 49345688 41035818 35790124 32116645 29627543 28105483 27250854 26795094
19999 26795094 26896314 27485851 28432830 30118139 32904041 37098702 43653993 53657551
19991 53657551 69732772 96208866 138715276 194990393 227209066 201728279 156630534
19984 156630534 121781806 100808799 91746581 92821081 104350992 129335132 173287683
19977 173287683 235524444 286954456 298811858 304511016 305815912 262440305 198148920
19970A98148920n0626337l2866865j8516813p430431K587733J4077297K9121005
19963A34494509M4367167L5117902j6820756m8669817m2725130l0077111j9788513
19956E5898251j3000367q691171o119850m368292l181213k358762j938222j581275
19948A4659099j143339j106302j137285j163943q94014o44448n92831n25053m77158
19939F974726n45307o30465m46424k92499m49311n19897l14178j91814j51914
19930C432917k33115k65911j05607k21663p9470J2645o5747q1142r2072j24327
19920B176508l5724m4541L0436O2375K0810o593J6034o1954q0356k44262j92018
19909A640715j11619l0511O2461p3351m4368o6916J79206P8079q6813o4682n3047
$$ plain form
19970 198148920 147522583 114655718 96138905 88708474 91296207 105373504 134494509
19963 134494509 178861676 213979578 197158822 148489005 105763875 75686764 55898251
19956 55898251 42897884 34206713 28086863 23718571 20537358 18178596 16240374 14659099
19948 14659099 13515760 12409458 11272173 10108230 9214216 8569768 7976937 7451884 6974726
19939 6974726 6429419 5798954 5352530 5060031 4610720 4090823 3776645 3584831 3432917
19930 3432917 3199802 2933891 2828284 2606621 2527151 2539796 2474049 2392907 2300835 2176508
19920 2176508 2140784 2096243 2126679 2189054 2209864 2203271 2219305 2157351 2076995 1832733 1640715
19909 1640715 1529096 1498585 1561046 1487695 1443327 1376411 1555617 1633696 1546883 1482201 1429154
19898A429154p3673j09785k32089m3618R929o7964K4074N6297j29810o005L7567
19887H94077L2585j00971j86532p1863P0694K0489k0998r265M8795m5203q1791
19876E50017m9681N6261J66588k24j53438q227J52635R8317j7216j0706o3482
19865G20844l0842M6316J20978O392j1771O8797r3133j21109j23249o6453P0077
19854E86847m288J20637M5950L1155J89628j11536k24757J6717k0476j84170n3046
19843C92661J16918j19546k05036O8617J35462K9187J4202n206r0127j05586j52074
19832G9472j62973J81812J05053J67439l744K8249q4564q1130q3055O6616k6345
19821A86830j65545j8480R4469J09981O0753m3329N0391N3530n3970p6993q2823
$$ plain form
19898 1429154 1355481 1245696 1013607 969989 979918 911954 936028 992325 862515 856510 894077
19887 894077 926662 825691 639159 567296 637990 658479 637481 628216 677011 631808 550017
19876 550017 500336 556597 723185 722961 569523 561296 713931 812248 795032 784326 720844
19865 720844 690002 736318 857296 863688 851917 920714 827581 706472 583223 516770 586847
19854 586847 582559 703196 749146 780301 969929 858393 633636 650353 629877 445707 392661
19843 392661 509579 390033 184997 253614 389076 418263 432465 427259 337132 231546 79472
19832 79472 -83501 98311 203364 370803 367059 395308 310744 229614 146559 213175 186830
19821 186830 21285 2805 97274 207255 268008 224679 275070 328600 274630 197637 114814
19810A14814j5289m9573o7257o0601R2993M4322j04785q31R4551j03398j52037
19799b07091P2876R5395J03650Q2719M0796M5561M6613j1375j11784o268Q560
19788A59652r3711O8022R0882m4107j09317j11669j51547J14033J34457K02430
19778B59125O9567n5962n4235K4410J1708K0566N923p6597n7576j42419M3462
19767D7972R3384j5503K2862M6355O6907j8800q0853j1237N012n8665m9176j05977
19755e7719N4007m0493l1856r7907M6482N4558m3135O1231N55j2872n4127l7613
19743a58889K8168P1983P5589M4709J47775k9279j49408m8421L6215J59765J45775
19732C23982j8467l4346o7719q5900o0499N8977O4555O8883J10997k2899j71157
$$ plain form
19810 114814 99525 49952 -17305 -77906 15087 59409 -45376 -46207 48344 -55054 -207091
19799 -207091 -134215 -38820 64830 147549 188345 233906 280519 269144 157360 151092 159652
19788 159652 65941 133963 224845 180738 71421 -40248 -191795 -77762 56695 259125
19778 259125 328692 272730 218495 242905 254613 275179 281102 204505 146929 4510 47972
19767 47972 141356 125853 148715 195070 261977 243177 162324 151087 156099 97434 48258 -57719
19755 -57719 -3712 -44205 -76061 -173968 -127486 -72928 -116063 -54832 -54277 -67149 -121276 -158889
19743 -158889 -130721 -58738 16851 61560 209335 180056 30648 -17773 18442 178207 323982
19732 323982 305515 271169 203450 117550 57051 116028 180583 249466 360463 337564 166407
19721A66407j44937n4713L6170Q2746J1864m6620l8377j58377Q7446J9470M56
19710c8465l706o4181J88135q7749k12728n9526J74603N5917j8354l6907N4251
19699d8710O0723j13675M130P9241K7906m3904m1109O6762J29396J0048l005n9320
19687F8483N3803j1183j4947k0765l1439m2076j5270P4320p1295j59087L7276
19676a32180J60133M9767o6589r7599R2330l7808p3402K7149L9229n264J6477
19665b7757M9564O8016m0666k2901N1335Q8846q035k4999p6588l9680L7479L7935
19653I2549j1728j13281q1908l0833j4602Q6717P3587m4455N471Q7805J08396
19642A57718q1863k20340P576K3328k1994L5131M1245J35828L2407j00072K6286
$$ plain form
19721 166407 21470 -33243 2927 85673 97537 50917 12540 -145837 -58391 -38921 -38465
19710 -38465 -42171 -106352 81783 -5966 -218694 -278220 -103617 -47700 -66054 -102961 -48710
19699 -48710 12013 -101662 -97532 -18291 9615 -34289 -75398 -8636 120760 130808 127803 68483
19687 68483 122286 111103 96156 75391 43952 1876 -13394 60926 -10369 -169456 -132180
19676 -132180 27953 77720 11131 -86468 5862 -31946 -105348 -78199 -38970 -44234 -27757
19665 -27757 21807 89823 49157 26256 77591 166437 158402 133403 56815 17135 54614 92549
19653 92549 80821 -32460 -114368 -145201 -159803 -73086 501 -43954 -38483 49322 157718
19642 157718 75855 -144485 -136909 -113581 -135575 -100444 -59199 76629 109036 8964 35250
19631C5250J24893m1498j6821K7035o8012l4026m5428j41089m4104M8317P4347
19620h1136L7162O2974l4747l6317J5166N7046N1179j37517p6703l5268O119O0290
19608a11752J53626R245K4748j19757K0574j0583j05839p7675P287k9602N9690
19597a80038K49923Q3706j07180j50770R6978K587K4565L1326n2605j02090n8509
19586a62107J2195J10412k6145k3510o4688l7004J14788J49556J11445n2454K5433
19575A57921k5243j38280j29266p5715J06450J09640j34244p1552L4635J61451
19565d203J3533J5779k1036k9291m0940R509P2914m666l978M1531N8767M9798
19553A57717m1527k7686j24260J487P9777o6715j19984q5151J0441K6753Q9726
$$ plain form
19631 35250 160143 118645 101824 128859 60847 26821 -18607 -159696 -203800 -155483 -81136
19620 -81136 -43974 19000 -15747 -52064 -36898 20148 71327 -66190 -142893 -178161 -172042 -111752
19608 -111752 41874 51119 75867 -43890 -23316 -33899 -139738 -217413 -210126 -239728 -180038
19597 -180038 69885 153591 46411 -104359 -7381 -4794 19771 51097 -1508 -103598 -162107
19586 -162107 -149912 -39500 -65645 -89155 -153843 -190847 -76059 73497 184942 132488 157921
19575 157921 132678 -5602 -134868 -210583 -104133 5507 -128737 -200289 -165654 -4203
19565 -4203 9330 25109 4073 -25218 -66158 -56649 16265 11599 7621 49152 107919 157717
19553 157717 116190 88504 -35756 -34269 45508 -21207 -141191 -226342 -215901 -189148 -99422
19542i9422O1292M0265K6163j08254L2729O6979m5536o7198L5539J69223r2211
19531A9569j0775R3014J27542p2675o7263q6977L4983p0079Q4106R3351M4932
19520A89728j64661j71197M7490J66087N3139K1274p5621m6258N5555K2143J01302
19509A98981P4527L9214M9906J81828J2031p0090o7739q5301L5875Q463n9384
19498C18311J9918J03214N2718J74625J75892K38969J39181j6987L4319j91429
19488A048731l61402k74810j32453O8934J97762Q5855Q3390J53821O4800K868
19478I37496j82790k43616k59928p4337M2316o7261N9271K2675l4995o4595j20963
19467A3273j6609O9431k742j9896o355J25849Q3402Q8469J6675M5364J07782L17304
$$ plain form
19542 -99422 -38130 2135 28298 -79956 -47227 19752 -25784 -92982 -57443 111780 19569
19531 19569 8794 101808 229350 156675 89412 2435 37418 -32661 51445 144796 189728
19520 189728 25067 -146130 -98640 67447 120586 141860 66239 19981 75536 97679 198981
19509 198981 273508 312722 362628 544456 556487 486397 418658 333357 369232 377695 318311
19498 318311 338229 441443 494161 668786 844678 1083647 1222828 1205841 1240160 1048731
19488 1048731 687329 412519 280066 349000 546762 632617 716007 869828 934628 937496
19478 937496 754706 511090 251162 176825 219141 151880 211151 233826 198831 134236 13273
19467 13273 -3336 66095 63353 43457 37102 162951 246353 334822 351497 396861 504643 821947
19455H21947J93004K7051j62328k79392k18354K608q9148p4567J50997J99466
19445E71284K79530L23425L09168J18306J0635Q441j66014k94771j84907k23855
19435G51242j33791l4280j03546l7641K02911L03008l1868j14053k16422k00594
19425C84966j10030n8812J13697n3902q3029p0679J7552n9822l7342j17419j06218
19414a81038J03276J9706Q82n0306K614J3750J4961Q1331J28469K9879j99431
19403c5907p4944J00758N1326K9327j95135j9888j47994P9010J69749k1178Q515
19392e6361k0421j49522p1885J39555Q9697K3297J21172J53643j42210r1853N5065
19381E0177K2990m0140o1152l1429l4586j18229p837L5584J23565j9192J08567
$$ plain form
19455 821947 1014951 1042002 879674 600282 381928 384536 295388 220821 371818 571284
19445 571284 850814 1174239 1483407 1601713 1612348 1620789 1454775 1160004 975097 751242
19435 751242 617451 583171 479625 441984 644895 947903 916035 801982 585560 384966
19425 384966 274936 216124 329821 275919 192890 122211 139763 79941 42599 -74820 -181038
19414 -181038 -77762 -58056 -57174 -107480 -104866 -91116 -76155 5176 133645 163524 -35907
19403 -35907 -110851 -10093 41233 70560 -124575 -144463 -292457 -213447 -43698 -64876 -56361
19392 -56361 -76782 -226304 -298189 -158634 -68937 -45640 75532 229175 86965 -4888 50177
19381 50177 73167 33027 -28125 -59554 -94140 -212369 -220206 -184622 -61057 -80249 28318
19370B8318q0119k4177N3775o533n2742P1800J2584r5867k8395O2533P5545N7279
19358G4001p4319m0695J8250j68805r9435J17301O10q3310m9042q378J72133Q0132
19346f1557j87967O7567J24449p5002L5960N865O1410o9766J20816j8506K5794
19335B9063m6822J02309r193J6578Q805r5846j5660L0295m3050R9058J29188n0141
19323A54584j84462q2586o3840L6453N5245j07899l0903l2251n0006k7924L7848
19312b95741J86496K04380L7053p4552q2754j03070k0045k1909N2880m5474j35516
19301b98252O0268J77928J87141n4118j20272l1627J75313m6227O3425l0983m3176
19290C9420L9336p3931j5265k3035n2498q3819J32195Q0648J134m7960r366o9380
$$ plain form
19370 28318 -51801 -75978 -22203 -28736 -81478 -9678 2906 -92961 -121356 -58823 16722 74001
19358 74001 -318 -41013 -22763 -191568 -291003 -173702 -173092 -256402 -305444 -313822 -141689 -61557
19346 -61557 -249524 -181957 -57508 -132510 -96550 -90685 -29275 -99041 21775 3269 29063
19335 29063 -17759 84550 75357 91935 100740 4894 -10766 19529 -23521 75537 204725 154584
19323 154584 -29878 -112464 -176304 -139851 -84606 -192505 -223408 -255659 -305665 -333589 -295741
19312 -295741 -109245 95135 132188 57636 -25118 -128188 -148233 -170142 -117262 -162736 -298252
19301 -298252 -237984 -60056 127085 72967 -47305 -78932 96381 50154 113579 82596 39420
19290 39420 78756 4825 -10440 -33475 -85973 -169792 -37597 43051 44185 -3775 -13141 -82521
19278h2521J02354j4715j71418K9026J2888r4090J17263M8783J14275J9431J2885
19267I4161J0700j43529m0580l0123J35900j6469K6972J03081n1970o5296q7284
19256f4437K8114M6207r0796L7482J60062J4305k1343O4796j15291j44370M5403
19245c9868R553k6507q6193j3660L6407l6293j4772P4968k0227j47658K0175R3630
19233a50445o4357J909M4120R2070l4172O2519m4389j84886k0528J52304L4002
19222a11853M3456p738k0606L0572n0964N8946K728N230k9210r0579J34995L3435
19210a588j78419l5688R7215Q0240o1420Q8535R0879R3338j37730j0982N0641
19199G5021j4410J4850q7197o2299J49050Q046k8960j31586j80360q7871Q9673
$$ plain form
19278 -82521 19833 5118 -166300 -137274 -124386 -218476 -101213 -52430 61845 81276 94161
19267 94161 104861 -38668 -79248 -109371 26529 10060 37032 140113 88143 22847 -64437
19256 -64437 -36323 9884 -80912 -43430 116632 130937 109594 174390 59099 -85271 -39868
19245 -39868 -30315 -56822 -143015 -156675 -120268 -156561 -171333 -96365 -116592 -264250 -244075 -150445
19233 -150445 -214802 -212893 -168773 -76703 -110875 -48356 -92745 -277631 -298159 -145855 -111853
19222 -111853 -68397 -76135 -96741 -66169 -117133 -58187 -55459 -50229 -79439 -170018 -35023 -1588
19210 -1588 -180007 -215695 -118480 -38240 -99660 -11125 79754 173092 35362 24380 75021
19199 75021 60611 75461 -11736 -74035 75015 83061 54101 -77485 -257845 -345716 -256043
19188b56043J30331l915m05R5906M4352P971k0790n3879J69058J7623k939m6709
19176H0561j30225N4829J7715j6572m9626j04531M9472J24848O0361j66341Q5060
19165E551L0919j9991j09384j725k0177j17224L8777J51821J6633j37892o3272
19154b25964M2816J48527R1930M3182r3099j05508l8912n024L2149J13774K4004
19143B7875R500m9907L2336p5126M112j07247o1675O5718J19159j5967o8063P257
19131a12028Q6952m8589q1893Q5145j7378N3059p358P9446j41033O2788k8023
19120f8912o2085R9954Q1990m3495j12439j49194k3992J02086P9244j52306k9521
19109b78670J37355J01342L2321O7542k6122r0025J76J1630P4719K1486p3679
$$ plain form
19188 -256043 -125712 -129627 -130032 -34126 10226 18197 -2593 -56472 112586 130209 127270 80561
19176 80561 -49664 5165 22880 6308 -43318 -147849 -98377 26471 86832 -79509 5551
19165 5551 36470 16479 -92905 -94630 -114807 -232031 -193254 -41433 -24800 -162692 -225964
19154 -225964 -183148 -34621 57309 100491 7392 -98116 -137028 -142052 -109903 3871 27875
19143 27875 37375 -12532 19804 -55322 -51210 -158457 -220132 -154414 -35255 -51222 -119285 -112028
19131 -112028 -25076 -73665 -155558 -70413 -87791 -34732 -42090 37356 -103677 -40889 -68912
19120 -68912 -130997 -31043 50947 7452 -104987 -254181 -278173 -176087 -96843 -249149 -278670
19109 -278670 -141315 -39973 -7652 59890 33768 -56257 -56081 -44451 30268 51754 -21925
19098b1925J4237r2942K6809J75726L3909Q57j2909K205j31209J3630J07685J64779
19086B80852K52573K56836J42643L6210n8739p9882N6014J28809Q835j13475q2071
19075H28605l4561j17538j95165j48007j915k585p6927r3943J3698O7262q0039
19064A58885j13874q2179Q284J90864J11763J5736j72466O5893K13160K83852
19054F79918K09713J46491M9264l1663r7808K065J42409J07557k23250k63850
19044G20846j49542l2000k25039j57879L6077J15594k9912J48777J06592J80690
19034G14204K33752J34376o6537j20596R2557l040J19611l6537j68481k06778
19024F92531j27838n7329q2207J4333o167n7897k56222m0457J41143o2101r160
$$ plain form
19098 -21925 -7688 -100630 -73821 101905 135814 136671 123762 125967 -5242 8388 116073 280852
19086 280852 533425 790261 932904 969114 910375 830493 886507 1015316 1024151 910676 828605
19075 828605 794044 676506 481341 333334 331419 328834 251907 157964 171662 238924 158885
19064 158885 45011 -37168 -28884 161980 273743 289479 117013 182906 396066 679918
19054 679918 889631 1036122 1085386 1053723 955915 957980 1100389 1207946 984696 720846
19044 720846 571304 539304 314265 156386 192463 308057 278145 426922 533514 714204
19034 714204 947956 1082332 1015795 895199 987756 984716 1104327 1067790 899309 692531
19024 692531 564693 507364 425157 439490 433323 375426 119204 78747 219890 157789 148629
19013A48629j64407N4619J00886q6480L0882J16629L3715R2892J45148K10942
19003F83455K70753J22908j01564r3441O961n3341P9597J3483q3316k40519j27768
18992D77208j54396j76644q9356O096j577q3665j38668K5726J47956J25610N1411
18981A89701L5928j3010k2400l6679p4594n0232p8273k2509l6010n2285M323J08885
18969d7155r659K7750l4716n4449O500N2130J0445r1531J16386P2036J39742P7836
18957B65315j61860p3224j4122q8227o2702j07043J28916p878k0760N1650l6014
18946a25949l9397l5129J14372J64451n5619l5328J19625K1201j88396j75968
18936b36137L6008J13570J07165p1477j3234K0745m6185L87J05556P221J6631
$$ plain form
19013 148629 -15778 38841 139727 53247 84129 200758 234473 327365 472513 683455
19003 683455 954208 1077116 975552 882111 889072 835731 915328 928811 845495 604976 477208
18992 477208 322812 146168 56812 62908 61331 -22334 -161002 -135276 12680 138290 189701
18981 189701 225629 212619 190219 153540 78946 28714 -49559 -72068 -108078 -160363 -156040 -47155
18969 -47155 -56814 -29064 -63780 -118229 -111729 -59599 -49154 -140685 -24299 47737 187479 265315
18957 265315 103455 30231 16109 -72118 -134820 -241863 -112947 -120825 -141585 -89935 -125949
18946 -125949 -165346 -200475 -86103 78348 22729 -12599 107026 128227 -60169 -236137
18936 -236137 -200129 -86559 20606 -50871 -64105 -43360 -89545 -89158 16398 23619 40250
18925D0250j16753Q047K8330O1982j30424r8677k1975P5548r2258k1680J52052
18914a15558M9922Q9908j53433j86063L4164J82958J15045o4909L5652J54236
18904A41922O4493l1337N7059o701l4043o2989l0451j24726j16650k0982k6871
18893a91276O0213J8023P9177m5685n7051r7267M4247J08241J75199P1579K9994
18882A95394j56365O2247N4931j06561k7468M8460J26238r3921o8444M2163j49285
18871g2611P7672Q954n8086R8231P3640N2480j23688j96397O1997L6943J0702
18860c0163k7977J5141l5179N8093J0765k7022l2744k08640j9815Q6760J71259
18849c9522J0290Q6152P8357K01523j41416q4330R4055j09389j05449j43014o2541
$$ plain form
18925 40250 -76503 -68456 -40126 21856 -108568 -207245 -229220 -153672 -245930 -267610 -115558
18914 -115558 -65636 24272 -129161 -315224 -281060 -98102 16943 -47966 -12314 141922
18904 141922 206415 175078 232137 225436 191393 128404 97953 -26773 -143423 -164405 -191276
18893 -191276 -131063 -113040 -33863 -79548 -136599 -233866 -189619 -81378 93821 165400 195394
18882 195394 39029 101276 156207 49646 22178 70638 196876 102955 34511 76674 -72611
18871 -72611 5061 14015 -44071 54160 127800 180280 56592 -139805 -77808 -40865 -30163
18860 -30163 -58140 -42999 -78178 -20085 -9320 -36342 -69086 -277726 -297541 -210781 -39522
18849 -39522 -29232 56920 135277 336800 195384 111054 205109 95720 -9729 -152743 -215284
18838b15284J33381K6679M635l546k16516j05484O3663J86432J44156n3828M6220
18827A0508J42039n8373j56866l9001R7804j3964q1958R9147j7641j17440J49600
18816A3855j6861K6895J27328l1815l4445O3627J32842m951k0331o5745m39P1718
18804B61678l9021j27423k35579p0038J95060K42173N3287n7323j06919M339J48535
18793B68769o461j15314j83434p2803j6137n3163K2589K07487N9497j0300K8953
18782A29683p3911q3334R7105J48606P6220J25215k1921P3595m3974j36850k1016
18771B69418P5381J87483K34042K51606O19326M23243l94320l84977l46372k06822
18761G28008j61668n5034j11704q939J7350p1132N8412j4941N0941K7489j86205
$$ plain form
18838 -215284 -81903 -55224 -50589 -54135 -270651 -376135 -312472 -126040 18116 -35712 10508
18827 10508 152547 94174 -62692 -101693 -3889 -17853 -99811 -664 -18305 -135745 13855
18816 13855 -3006 23889 151217 119402 84957 148584 281426 276475 256144 190399 189960 261678
18804 261678 222657 95234 -140345 -210383 -15323 226850 280137 222814 115895 120234 268769
18793 268769 262308 146994 -36440 -109243 -125380 -178543 -155954 51533 111030 100730 129683
18782 129683 55772 -27562 69543 218149 294369 419584 397663 471258 427284 290434 269418
18771 269418 344799 532282 766324 1017930 1637256 2060499 1666179 1281202 934830 728008
18761 728008 566340 511306 399602 390663 408013 336881 395293 380352 431293 458782 272577
18750B72577m4184r599j67837r6640K9257K0748R156P5825M9797l8458r3455n323
18738A864J27511j5506p9377q8228q7527J5167J41363J18545J70020J18440K3398
18727D45670O1651n4705j6209K5018q8075r3186k2101j19737P3862K14546N8507
18716D85241j05145m6400M2593l692j19015j37938l018n0105O1936O4476J60852
18705C49785J29793n4943n7827q3920j23212o97Q7109J05501o5636m7869P3428
18694C11512j4210K0165P4776J40023L0571O9188J3200l07799j35633J49667N2625
18683D04085L2964l3758n2054N4331r1931n2225k7884j8353j28836r3089k4723
18672c1473R1560J43384l5196L9262m2064r697J65684L1291J0626M130Q1959n062
$$ plain form
18750 272577 228393 218794 50957 -45683 -16426 4322 13478 89303 139100 100642 7187 1864
18738 1864 129375 113869 34492 -53736 -141263 -126096 15267 133812 303832 422272 445670
18727 445670 507321 452616 436407 461425 373350 280164 258063 138326 212188 426734 485241
18716 485241 380096 333696 376289 372597 253582 115644 112626 62521 124457 188933 349785
18705 349785 479578 424635 366808 282888 159676 158979 246088 351589 285953 238084 311512
18694 311512 297302 317467 392243 532266 562837 632025 645225 337426 201793 351460 404085
18683 404085 437049 403291 351237 405568 313637 261412 233528 215175 86339 -6750 -31473
18672 -31473 60087 203471 168275 207537 165473 155776 321460 352751 363377 367507 449466 444404
18660D44404K4860J64078O3103K7002j24482j07895j64914o1483J06309k4337
18650C46645j28986p6482J52093O3360p136n1703J24645K8842k5893Q6126R9222
18639F10733L2839R9451J5172o6198o9407p7391j11331J67670L7589j11162o2735
18628D65230k9177j42968J52451M8357O906J55512J16539j73066O0568P3623Q6500
18617H20475J30910r912J1915J6670k4810P1810J45393O9133o1522P2089K26748
18606A468899K18951j2903j54525j4997J3322Q1411Q6594p9627L5680J93675J70877
18595B007357j1546p8578J8974K95833R3593J83882K39073L50954J47284J75349
18585C422175K94934M34584O02157P61036M78157Q2154K63365M99610P50579O15965
$$ plain form
18660 444404 469264 633342 696445 723447 598965 491070 326156 264673 370982 346645
18650 346645 217659 141177 293270 356630 349494 297791 422436 451278 425385 511511 610733
18639 610733 643572 743023 758195 691997 622590 545199 433868 601538 639127 527965 465230
18628 465230 436053 293085 445536 493893 500799 656311 772850 599784 660352 733975 820475
18617 820475 951385 941473 953388 970058 945248 1017058 1162451 1231584 1170062 1242151 1468899
18606 1468899 1687850 1674947 1520422 1505425 1518747 1600158 1686752 1607125 1642805 1836480 2007357
18595 2007357 1995811 1917233 1936207 2232040 2325633 2509515 2748588 3099542 3246826 3422175
18585 3422175 3717109 4151693 4753850 5514886 5993043 6075197 6338562 6838172 7588751 8204716
18575H204716N61106O65201Q19496J201166J583811K091395K579309L218490M115623
18566B5040313N631239Q072386J2014805J8152620K8084227M2959803N5003708
18559A94959101L4786532j0996393k3109428o320507J7511508K6884720n087878
18552B28627655m4527444m7882346l6236986k4526946j6187612j0713227p325130
18545D1227964m999180l540666k458153j448407n95756K1218Q79551J771686K515555
18536C3373812L206552M801746P668329J1943661J8319799K8080164M1991895
18529A49385958N1769942K9836364j2626116k1759374m673374J7732818K4527236
18522B34193454q202131m3955764m4862292l2504097k0902416j2617314o854913
$$ plain form
18575 8204716 8765822 9431023 10250519 11451685 13035496 15126891 17706200 20924690 25040313
18566 25040313 30671552 38743938 50758743 68911363 96995590 139955393 194959101
18559 194959101 229745633 218749240 195639812 189319305 206830813 233715533 228627655
18552 228627655 184100211 136217865 99980879 75453933 59266321 48553094 41227964
18545 41227964 36228784 32688118 30229965 28781558 28185802 28207020 29086571 30858257 33373812
18536 33373812 36580364 41382110 49050439 60994100 79313899 107394063 149385958
18529 149385958 201155900 230992264 218366148 196606774 191933400 209666218 234193454
18522 234193454 225991323 182035559 137173267 104669170 83766754 71149440 64294527
18515F4294527k060471K844974Q507471J5985773K6829176M1880565M8516222
18508B06798237K0143423j7735376j9998975j377580J9731274K0204397j6905307
18501B10860093m5671600m2710611l1173050k1124486j4117902r548828o688499
18494C9825117m760174l367939k357070j361876p03141N829Q47309J480537K103231
18485C1711823K912175M740575P808194J2016788J8401367K8716720M3163281
18478A49470923M7760106J6723628j9455987j9113401L11509K1061466J8883163
18471B15641407k0207431m6475316m1643383k9693310j9791247j3109227r253165
18464C5468328o454489m694945l497630k485153j914190j559646j236977j071729
$$ plain form
18515 64294527 62234056 65079030 73586501 89572274 116401450 158282015 206798237
18508 206798237 226941660 209206284 189207309 187829729 207561003 227765400 210860093
18501 210860093 165188493 122477882 91304832 70180346 56062444 46513616 39825117
18494 39825117 35064943 31697004 29339934 27978058 27274917 27280746 28128055 29608592 31711823
18485 31711823 34623998 39364573 47172767 59189555 77590922 106307642 149470923
18478 149470923 197231029 213954657 194498670 175385269 175696778 196758244 215641407
18471 215641407 195433976 148958660 107315277 77621967 57830720 44721493 35468328
18464 35468328 29013839 24318894 20821264 18336111 16421921 14862275 13625298 12553569
18456A2553569q53159r02917r10909q83515o51174m87420m97454o06170n49417
18447F211434m07216m40151l66460l58539k07505j22703k17959n8920j74234k70909
18437C586838k29398j67823j07186j14542n6843j10309j97685j15154J0867p9620
18427B419145k5562K7035j25960k2138k0471q3488p3178p3545j61898l2877r454
18416A817609K1963q2122J799k8990q3492j48479o8852l9575J7129J32618P3248
18405A612856P2985O071o6161j07589k28975k6368m5272N0307M394r9756j40833
18394A031659r5107Q646P5082j5011m543M4063P4954J12591k522j34507Q0793
18383A176098J65203m4485j97889k43766M693M9923j63409p0429j0869L5246M4669
$$ plain form
18456 12553569 11700410 10797493 9886584 9003069 8351895 7864475 7367021 6760851 6211434
18447 6211434 5804218 5364067 4997607 4639068 4431563 4308860 4090901 4031981 3857747 3586838
18437 3586838 3357440 3189617 3082431 2967889 2911046 2800737 2603052 2487898 2498765 2419145
18427 2419145 2393583 2420618 2294658 2272520 2252049 2168561 2095383 2021838 1859940 1827063 1817609
18416 1817609 1839572 1757450 1759249 1730259 1646767 1498288 1429436 1389861 1406990 1539608 1612856
18405 1612856 1685841 1691912 1625751 1518162 1289187 1262819 1217547 1267854 1272248 1172492 1031659
18394 1031659 936552 945198 1020280 1005269 1000726 1044789 1119743 1232334 1229812 1095305 1176098
18383 1176098 1341301 1296816 1098927 855161 859854 909777 746368 675939 665070 700316 744985
18372G44985m3175N3527O0253o0876k2184Q436j25110j2242J20358J52592Q7311
18361I63875J21213K9004m0715R5644R3181Q255j71772l7622j29517r3194q7442
18350G50910K3267k2484J9817l2692r0963j70736j33222K948J35787n4880m0706
18339C87046N8898L1259j79956r642J39616N439j23183o7846m5813O6682J4284
18328B76784m7471p7862j9618r807o2504j9602m0134Q6478J77986l3197o3316
18317A67737J12033Q8022q656J16122m3629j4780q0436m2837M3170M3828k0498
18306C60076r415l1547j18601j48586R3865J68318O2853m3561j48471o7089J40830
18295B58672O0092J4275r445N70N8681j21173n2996J19751q924j0295j1187M0671
$$ plain form
18372 744985 701810 755337 815590 754714 732530 740966 615856 603614 723972 876564 963875
18361 963875 1085088 1114092 1073377 1169021 1262202 1270457 1098685 1061063 931546 838352 750910
18350 750910 774177 751693 771510 738818 647855 477119 343897 346845 482632 427752 387046
18339 387046 445944 477203 297247 287605 427221 432660 309477 241631 195818 262500 276784
18328 276784 229313 151451 131833 122026 59522 39920 -214 86264 264250 231053 167737
18317 167737 279770 367792 359136 475258 431629 416849 336413 293576 336746 380574 360076
18306 360076 350661 319114 200513 51927 145792 314110 376963 333402 184931 117842 258672
18295 258672 318764 333039 323594 324164 382845 261672 208676 328427 319503 309208 298021 338692
18283C38692J03031M3653m0427m2038o1594m1349m0722p4550M845k1115N5102
18272B23528J00938Q4303o0494n9672q963k3657j01929M7622J43799J0940R741
18261C66156j1960l7982K838o81N5023P4381J8100p5022R6274Q673j96856k21923
18249G7021J7786J57569R5174Q224k4151n5400n9382j2032R2432N6565L5250J40767
18237E29823J71115r1094k82161k76494j39026P8768J3598Q2179R6189n0781Q9023
18226B21139Q309q2778k6226l1603J0040K2229J7892J25894J24461l4745J3726
18215C68338K7582r6839p3748L1260j1992j762k1397n9644j0740J6283O8262L9074
18203B74677l8087K771J9476o1546l3795p9503j00028L5044P3048R4867n6076
$$ plain form
18283 338692 441723 485376 444949 402911 341317 299968 259246 184696 189541 168426 223528
18272 223528 324466 408769 348275 288603 279640 255983 154054 201676 345475 356415 366156
18261 366156 354196 316214 319052 318371 373394 447775 465875 390853 487127 495800 298944 77021
18249 77021 94807 252376 347550 355774 331623 276223 216841 204809 297241 353806 389056 529823
18237 529823 700938 609844 327683 51189 -87837 -9069 4529 86708 182897 132116 221139
18226 221139 229448 146670 120444 88841 98881 121110 139002 264896 389357 354612 368338
18215 368338 395920 299081 225333 256593 244601 242839 221442 161798 151058 167341 235603 274677
18203 274677 236590 239361 258837 197291 163496 83993 -16035 19009 92057 186924 130848
18192A30848n526n6681N8790J19553R2246q5172l8948L3536q2340q0569L8713
18181A24450J83130j58246L1075Q9493o6112n8862R7858m0652j95003K21618J3181
18170B41930Q788J56229l9011m0056K1977J28383N555J0237J4213J30016P5205
18159G13466m983r5468m708J0440n2319j30349j226J98957J04446p5119M3147
18148G06284P9103N4178J09560k0328M1415J00039J0787K2638J00564n5513J30091
18137A278818J67473Q5181J91295J34165K47048J48113L4576R0612J72825K92439
18127B842545L29317L35689L40981N50899O61197N55736P50420J335383J708150
18118I410317J957015K319501L042779M486269O806734J0489166J6922743L0014157
$$ plain form
18192 130848 125322 68641 127431 246984 339230 254058 215110 248646 166306 85737 124450
18181 124450 307580 149334 180409 269902 203790 144928 242786 202134 7131 228749 241930
18170 241930 250718 406947 367936 327880 349857 478240 483795 494032 508245 638261 713466
18159 713466 708483 613015 608307 618747 566428 436079 434853 633810 738256 663137 706284
18148 706284 785387 839565 949125 928797 970212 1070251 1081038 1103676 1204240 1148727 1278818
18137 1278818 1446291 1531472 1722767 1856932 2103980 2252093 2286669 2377281 2550106 2842545
18127 2842545 3171862 3507551 3848532 4399431 5060628 5616364 6366784 7702167 9410317
18118 9410317 11367332 13686833 16729612 21215881 28022615 38511781 55434524 85448681
18110H5448681N5917714R5171782Q8945386l6539937r4427231o9868008m3717194
18103H0931193k5781973j5694033j0036362o877626m639779l090960k157141j503427
18095A1149892j387489j137762r50965p81716p52750p65774n40249m13859k23689
18086D195639l30357m29525l22675j70514j98709l41211k31202p7172n9055j26303
18076A908916j48628j35470j32277j37598j14473j75417K5694K1538o5077l3908
18066A013300P8848l5217j1091N2655k0772J1628m9048j3666M0907j53240p7275
18055H37029j07924j34323j40055J473M7945J25839j694j1419m9180J15746Q9559
18044G72996l7682r5360M1398q0285q1862j8099Q8942P5596M4033p816l9150J40799
$$ plain form
18110 85448681 141366395 236538177 325483563 288943626 194516395 124648387 80931193
18103 80931193 55149220 39455187 29418825 22541199 17901420 14810460 12653319 11149892
18095 11149892 9762403 8624641 7673676 6891960 6139210 5373436 4833187 4419328 4195639
18086 4195639 3865282 3435757 3113082 2942568 2743859 2402648 2171446 2094274 2035219 1908916
18076 1908916 1760288 1624818 1492541 1354943 1240470 1065053 1090747 1112285 1047208 1013300
18066 1013300 1092148 1056931 1045840 1098495 1077723 1089351 1040303 1026637 1067544 914304 837029
18055 837029 729105 594782 454727 456200 504145 629984 628290 616871 567691 683437 772996
18044 772996 735314 639954 681352 601067 519205 501106 590048 665644 709677 701861 662711 803510
18032H03510J11750R3357J52979M7730N280J92862J28723p0472n7481J00589J80935
18021A689762k5286k26016k45468j81478j04979k16186r7089k9956L5520J0181
18011F09005o8996j32251J42244O7338K1075J17306J58R697K9587M399n3160N722
17999G52124J03667L67474K24220j8713m4167j11560Q4310J38749J5281k80831
17989A230554l94745p0604M0594m1806o06P3051J38805j53999j61109j61084M9331
17978E48382K16733J49478J8057R6144j4798k4078P0265K9615o2556k11690j84956
17967F30596j47301l92869j36166M5639J89986J26388O0794j04570r2956p7135
17957A02406M0550j4945k0778m5080J56201J13505p295R1540J35757K40158J86963
$$ plain form
18032 803510 915260 1008617 1161596 1209326 1214606 1407468 1536191 1465719 1408238 1508827 1689762
18021 1689762 1664476 1438460 1192992 1011514 906535 690349 593260 563304 598824 609005
18011 609005 540009 407758 550002 617340 638415 755721 755879 765576 795163 799562 746402 752124
17999 752124 855791 1223265 1447485 1428772 1384605 1273045 1357355 1496104 1511385 1230554
17989 1230554 835809 765205 805799 763993 763387 836438 975243 821244 660135 499051 548382
17978 548382 765115 914593 932650 1028794 1013996 989918 1060183 1089798 1027242 815552 630596
17967 630596 483295 90426 -45740 -101 189885 316273 377067 272497 179541 102406
17957 102406 142956 128011 107233 62153 218354 331859 324564 416104 551861 792019 978982
17946I78982Q9305O2409o3148j80341l3636J88150pm6805k0623j37101k36060
17935F01125j62116j22144P1031N286j21184q9133k6259J9749R1911J08196p5282
17924C01180o2745j91462j02685R6480p523J04235n5222p250K0451K4208L351
17913A23018q8422O4764P8863r2540J9736R9468l9540j72096k939l9478j08177
17902a57343k7597N2470L3030K12J16345J21776m133o6818K1603j2907o247N3533
17890A23924M8097L4563o4098r282K7735J04866j07250l9490J59885M886l0540
17879B53296q2682q7082M0426J38381j24761o8541P6971K0082j6252O2560J6799
17868B29197o3584Q9530M098L2673J97933n9841p7952l5274o7424K8510m728l2226
$$ plain form
17946 978982 1068287 1130696 1067548 887207 853571 1041721 1041714 994909 974286 837185 601125
17935 601125 439009 316865 387896 393182 271998 182865 156606 176355 268266 376462 301180
17924 301180 238435 46973 -55712 40768 33245 137480 82258 75008 95459 119667 123018
17913 123018 34596 99360 178223 85683 105419 204887 165347 -6749 -9688 -49166 -157343
17902 -157343 -184940 -132470 -99440 -99228 17117 138893 134760 67942 89545 76638 70391 123924
17890 123924 172021 206584 142486 133204 160939 265805 158555 119065 278950 283836 253296
17879 253296 170614 83532 123958 262339 137578 69037 146008 166090 149838 212398 229197
17868 229197 165613 255143 259241 291914 489847 430006 352054 316780 249356 277866 273138 240912
17856B40912l4029M9127j6964j64117J6974J13316N9925J2758o1735p2303j89363
17845d5499J3216M1935P2602J06379J32633p3737j49277J8933P2832M3013J9577
17834B52607l5978j38617j22778r2866J8084K5138J29338N3931J17879Q5098j8576
17823B73260j01411J02642K56166J89163Q025n2484l7129Q4r5848j57537r971
17812C74960k6182j25422j26606q3921q4851J6220N7312r33J0460N7430L7349
17801A05816L5720J25968o8757j75665k448J0438l9552j8348j19651m9336J92059
17790c756j33o333N5836p1306p1008n7572n4902o8282N3062R7257J2046J3326
17778a01765J71080J39265J52193J68592Q211j85308q5844l7695J8775M1884j9506
$$ plain form
17856 240912 206883 256010 239046 74929 91903 205219 265144 277902 216167 143864 -45499
17845 -45499 -32283 9652 82254 188633 321266 247529 98252 117185 190017 233030 252607
17834 252607 216629 78012 -44766 -137632 -119548 -94410 34928 88859 206738 291836 273260
17823 273260 171849 274491 530657 719820 727845 675361 638232 638316 542468 384931 374960
17812 374960 348778 223356 96750 12829 -72022 -55802 1510 577 11037 68467 105816
17801 105816 141536 267504 198747 23082 20634 31072 -8480 -26828 -146479 -195815 -3756
17790 -3756 -3889 -10222 45614 -25692 -96700 -154272 -209174 -277456 -224394 -127137 -115091 -101765
17778 -101765 69315 208580 360773 529365 537576 352268 266424 228729 247504 289388 269882
17767B69882j61135L6866k0414M965J16620Q102O911k3903O4100o8967j29641
17756A03386Q3566N8248l3871j13991M624L7584j20321l5573J13319j2291l2881
17745E1799j3084K9676N8264k24100n5441L6811J15347J3761m8278K02758j0626
17734A56887j7089j0555J0364m3523j11905Q063L3568J3287m8030m4514p9283
17723a32730Q6886o0381q2021O5999Q7254J1432J17463J02952L7350n941J51785
17712C80048j03415k32941q2875m6188N166j5333K1761Q2925o3786j64960M0871
17701a78727J24871L9716p6171J6041j7664O2547k6217K226K2973J2338J08396
17690I0329p3810j35787k0728Q4167l8705K0923P7346J24070j8828p0965M986
$$ plain form
17767 269882 108747 145613 125199 130164 246784 254886 261797 237894 301994 233027 103386
17756 103386 186952 245200 211329 97338 101962 139546 19225 -16348 96971 84680 51799
17745 51799 38715 68391 126655 -97445 -152886 -116075 -728 13033 -35245 167513 156887
17734 156887 139798 129243 139607 96084 -15821 -7758 25810 39097 -8933 -53447 -132730
17723 -132730 -45844 -106225 -188246 -122247 -34993 -23561 93902 196854 234204 228263 380048
17712 380048 276633 43692 -39183 -85371 -80205 -95538 -73777 9148 -54638 -219598 -178727
17701 -178727 -53856 -14140 -90311 -74270 -91934 -29387 -55604 -53378 -30405 -18067 90329
17690 90329 16519 -119268 -139996 -55829 -94534 -73611 3735 127805 108977 38012 42998
17679D2998n4918K9969J5790L8977m8764l7919L3347P1823k0055r7744l6039M4935
17667a7600J54738k1585j53179o5148J77134J18127P0043L5135p227j18903q1261
17656I0274q5155p6230n211K8442M0486K4778J35593m7279q079k6349j38542p1737
17644a39009Q5650K7621J54374R9201J5736L65k30918j01422k7776j61581m311
17633b82070J46450M3642R443L5515J01372O711j8888n5394m0844L6979P2763
17622E5679M2234M1585J07244K4670j30966l1646m5749m6339J47517P2366Q1190
17611C17785m0726l2371k9189j83572o6375n4927j4023J15095j7331O3002L7786
17600I5154Q8012q4297o4789N0944K001M8138j9173r2308J2317j47779j06794
$$ plain form
17679 42998 -11920 18049 33839 72816 24052 -13867 19480 91303 71248 -26496 -62535 -17600
17667 -17600 137138 115553 -37626 -102774 74360 192487 262530 297665 290438 171535 90274
17656 90274 5119 -71111 -76322 -47880 -7394 17384 152977 105698 97619 71270 -67272 -139009
17644 -139009 -53359 -25738 128636 227837 243573 243938 13020 -88402 -116178 -277759 -282070
17633 -282070 -135620 -91978 -82535 -47020 54352 61063 42175 -13219 -54063 -17084 55679
17622 55679 97913 139498 246742 271412 140446 108800 63051 16712 164229 236595 317785
17611 317785 277059 244688 215499 31927 -34448 -89375 -103398 11697 -5634 57368 95154
17600 95154 183166 98869 34080 85024 87025 135163 115990 23682 35999 -111780 -218574
17589b18574Q7884J61387J15499p1704j45786n494o81J2686J66369J95887r4138
17578B03335j17853N945m0632j85936j5165K05732m5981l601P5930j049Q9636
17567A70361J33478P7259j11321j53638k13388K3993K2768j12094j87180J17661
17557b32101J80810K9541k9154O5735J02695M1752m6024k5646j45809J3412K5590
17546a9199k5154K2562J6292J1057l0914m6927p0627o4350R5475J9211n6874j50836
17534c00284N2279R2253R0312O0749M4942R92k069o1933m1261l5725L0920M1447
17522b7378k8252J00775J90221n7414j32986j4763p5380q6800p8538O7460R5171
17511d7884N3431m3187Q5540K52239K7434j86542n2823j87797j81163O4899l0591
$$ plain form
17589 -218574 -130690 30697 146196 74492 -71294 -76788 -77469 -64783 101586 297473 203335
17578 203335 85482 91427 50795 -135141 -150306 55426 9445 5844 81774 80725 170361
17567 170361 303839 381098 269777 116139 -97249 -73256 -50488 -162582 -349762 -232101
17557 -232101 -51291 -21750 -50904 14831 117526 159278 113254 87608 -58201 -44789 -19199
17546 -19199 -44353 -21791 -5499 5558 -25356 -72283 -142910 -207260 -111785 -92574 -149448 -300284
17534 -300284 -248005 -155752 -65440 -4691 40251 41243 39174 -22759 -64020 -99745 -68825 -27378
17522 -27378 -55630 45145 235366 177952 44966 30203 -45177 -131977 -210515 -143055 -47884
17511 -47884 5547 -37640 47900 300139 327573 141031 88208 -99589 -280752 -215853 -246444
17500b46444M4218N6932O8358L5579p3079K5442L1260j86334O886K05330J33862
17489A02010L0966J6166o3602j02046o2344o0553L5965P1485O2167j02622O7333
17478e075J15967L8692k10826o1571K9778k4502k721J26925L9199L2572j2906
17467F5532l5313p5745N5977K12623K1853p6903p9431n9751n2242M6492N9110
17456H2202k8986j12937p5589k4542m1729J09180J23861O2970O2035J35155O6903
17445C58523J45183K17145L70149N65493J97800n01767m53819l82049j66057j21597
17435B29004k11564q3313Q5042J04555m8367J09426M1247m3212R4271k09608j81328
17424a13847n6794k4745j0867O4243J43332K21205J07127j28065j59631m7308
$$ plain form
17500 -246444 -202226 -145294 -76936 -41357 -114436 -88994 -57734 -244068 -237182 -31852 102010
17489 102010 132976 149142 85540 -16506 -78850 -139403 -103438 -31953 30214 -72408 -5075
17478 -5075 110892 149584 -61242 -122813 -93035 -117537 -120258 6667 45866 78438 65532
17467 65532 30219 -45526 10451 223074 244927 168024 88593 28842 -23400 23092 82202
17456 82202 53216 -59721 -135310 -159852 -201581 -92401 31460 94430 156465 291620 358523
17445 358523 503706 720851 1091000 1656493 1854293 1352526 898707 516658 350601 229004
17435 229004 17440 -65873 19169 123724 75357 184783 226030 182818 277089 67481 -113847
17424 -113847 -170641 -195386 -206253 -142010 1322 222527 329654 201589 41958 -5350
17414e350M6109K9943j52555k4599r301o2838J66745L5334M6054K7504j21883
17403b4837l3061M0367n0567L6364J16281N3520j9819j25921r2693k3288R3756
17392b9898K2354J7041j01917l4785O1928n1120J4006J8096j52967L5470J57853
17381d3939L6173j50520p2014j335N7733J36476Q977J3829K6039M2245o5607j56553
17369a68496L4790l6597P8222J02642L0388k8538j9703k11234r0689J4456M4874
17358b49885J26662J65935M111n0973j2479o3380O8979j54395j16495O0563J85511
17347c5846J9440j0541p5811j29659j09060P5094J93691Q144K2596l4862r2941
17336a69755J01112j09840m7564L7246K70367J47025j54737j23445o9225L0067
$$ plain form
17414 -5350 40759 70702 -81853 -106452 -115753 -178591 -11846 23488 69542 97046 -24837
17403 -24837 -57898 -17531 -68098 -31734 84547 138067 118248 -7673 -100366 -123654 -29898
17392 -29898 -7544 9497 -92420 -127205 -65277 -116397 -102391 -84295 -237262 -201792 -43939
17381 -43939 -7766 -158286 -230300 -231635 -173902 -37426 -28449 -14620 11419 53664 -11943 -168496
17369 -168496 -133706 -170303 -92081 10561 40949 12411 -7292 -218526 -309215 -294759 -249885
17358 -249885 -123223 42712 46823 -4150 -16629 -80009 -11030 -165425 -281920 -221357 -35846
17347 -35846 -16406 -26947 -102758 -232417 -341477 -266383 -72692 -64548 -41952 -76814 -169755
17336 -169755 -68643 -178483 -226047 -188801 81566 228591 73854 -49591 -118816 -88749
17326h8749J49419R7979l1834l1780o8723n8162j66482k374q394J61495r005j68694
17314b25304m972J0175P0796L321N9685J56972J41129M7628j9540O2983j05884
17303A96989r9785m7868N9669m5326m9954J20484p369m0365L0884P2985m9505
17292A40839j32527o9342j74318j10813J10373p4353J00773J30752Q4699l0515
17282b4432m5584N1489m8054n5870K3390K0387j01741j6435J30992L3771l6173
17271f8260l3997j39193k5962p1253J26276P1772K3294r987J8895m8077J69728
17260A3236R4498p2360k7714K7206r268q8073j7659j78666o9343J8344O5171O6589
17248a78039K8288J07895j7627j37366j1996J35850O075j22803p463O9458K8726
$$ plain form
17326 -88749 60670 158649 126815 95035 26312 -31850 -198332 -200706 -209100 -47605 -56610 -225304
17314 -225304 -230276 -220101 -149305 -145984 -86299 70673 211802 259430 239890 302873 196989
17303 196989 97204 49336 109005 63679 13725 134209 126840 86475 117359 190344 140839
17292 140839 8312 -61030 -235348 -346161 -235788 -310141 -209368 -78616 6083 -24432
17282 -24432 -70016 -18527 -66581 -122451 -99061 -78674 -180415 -196850 -65858 -32087 -68260
17271 -68260 -102257 -241450 -267412 -338665 -212389 -140617 -117323 -127310 -108415 -156492 13236
17260 13236 107734 35374 7660 34866 25598 -62475 -80134 -258800 -328143 -309799 -244628 -178039
17248 -178039 -149751 -41856 -59483 -196849 -208845 -72995 -66920 -189723 -197186 -127728 -99002
17237i9002L7821R8208m85k24960Q8529J96263m2281j13280o819J54646J8367
17226A07007r7843m0975j38766o4101Q0593J33674n101M0688J41898J0746j36877
17215C0943j08760j02263J5597k8313L2204P9166l6209j3112O9909P1203P116
17204A7481L2796j30556P8633K54044j51493q7989o9932m9609R4059K4223j4214
17193b557p6051R708O8735J35067j3939J4975n9178l0245Q7997k12569j24971
17182b03028j7897O3117J2193J36311l4321j62252l6046P4561J44287K08777J9235
17171B04937j42664j0210L8352j7638r0654K9652M5426M5659O2877j24041m8373
17160f677j2949N860J6116q7884N12j8041Q7453J16191J17159j6142j23641Q2857
$$ plain form
17237 -99002 -61181 37027 36542 -188418 -99889 96374 54093 -59187 -66006 88640 107007
17226 107007 9164 -31811 -170577 -234678 -154085 -20411 -25512 15176 157074 167820 30943
17215 30943 -77817 -180080 -164483 -192796 -160592 -81426 -117635 -130747 -60838 10365 17481
17204 17481 50277 -80279 -1646 252398 100905 12916 -57016 -106625 -12566 11657 -2557
17193 -2557 -78608 -68900 -165 134902 120963 135938 76760 46515 134512 -78057 -203028
17182 -203028 -220925 -157808 -145615 -9304 -43625 -205877 -241923 -167362 -23075 185702 204937
17171 204937 62273 52063 90415 72777 -17877 11775 57201 102860 165737 41696 -6677
17160 -6677 -19626 -13766 2350 -85534 -85022 -103063 -15610 100581 217740 201598 77957 160814
17148A60814K5851n4062j56620j21317K9667O6574j5445m0902j9606M4768L0995
17137d9283r2076q8394L4962P2407J26344J45603j2115M533j0681J7918L500n9580
17125I3138J2699n9335o5233k0708p0127j81043K1259Q3273Q5868L2939K8331
17114c8939n225n9849J58063J89726q3750n5780m9535k1898n4150K2852k4263
17103b2748j8725M1261J4018Q191q1755o2788o7618J11977M1876p8863o0262R8992
17091g6444r509p7299r8117M5566J11106R2768M4227K6472o4121M7286K8378J53316
17079B23629L7941p04K9215r7553q8273k3285R7295r2315j89484K975m4346j9699
17067a64604R695l8636J14184Q5024L9644p108K1597M8670p9499j26054j7434
$$ plain form
17148 160814 186665 132603 -24017 -145334 -115667 -49093 -64538 -105440 -125046 -80278 -49283
17137 -49283 -141359 -229753 -194791 -122384 3960 149563 137448 141981 131300 149218 152718 93138
17125 93138 105837 46502 -18731 -39439 -109566 -290609 -269350 -186077 -100209 -67270 -38939
17114 -38939 -44164 -104013 54050 243776 160026 104246 54711 32813 -21337 1515 -22748
17103 -22748 -41473 -212 13806 21997 -59758 -122546 -190164 -78187 -36311 -115174 -175436 -76444
17091 -76444 -85953 -163252 -261369 -215803 -104697 -11929 32298 58770 -5351 41935 70313 223629
17079 223629 261570 260866 290081 192528 104255 80970 178265 85950 -103534 -100559 -144905 -164604
17067 -164604 -154909 -193545 -79361 5663 45307 38199 59796 108466 28967 -97087 -114521
17056a14521K0212n778J26875M3582r9208j5789P934k654j16701o7394k3030L2058
17044b14414R5409J9157J16230j4722m4370k1402j25324J75268Q5154J1345m5051
17033C7280r8346j02251o9597J92522K16437L843m1084l3356k5961k3561o0287
17022d361r9191R7275M245k0327J3453J00417m9066k33K6483j71389j24034J14369
17010a12359k0720K7526J26154O5422j67902L1572J31745M3361l4955l7353n2134
16999C57K7688q2268j01333Q060j7026J79578n7630r3005O0042J54997J0634r2959
16987b865O7196N7593o652M0061j17659j71350m3599J05358J42680O4047r4694
16976D0116j29014k9561k5323o3311m1840P7597P2573J443M87l6651J00228K8127
$$ plain form
17056 -114521 -94309 -100087 26788 70370 -28838 -44627 -36693 -39347 -156048 -223442 -246472 -214414
17044 -214414 -119005 -99848 16382 1660 -42710 -64112 -189436 -14168 70986 82331 37280
17033 37280 -61066 -163317 -232914 -40392 176045 179888 138804 105448 79487 55926 -4361
17022 -4361 -103552 -6277 -2032 -22359 -8906 91511 42445 42212 68695 -102694 -226728 -112359
17010 -112359 -133079 -105553 20601 86023 -81879 -50307 81438 124799 89844 52491 357
16999 357 28045 -54223 -155556 -147496 -164522 15056 -42574 -135579 -75537 79460 90094 -2865
16987 -2865 64331 121924 115272 155333 37674 -133676 -177275 -71917 70763 134810 40116
16976 40116 -88898 -118459 -143782 -207093 -248933 -171336 -98763 -97320 -96833 -133484 -33256 -5129
16964e129R0483P6033q0629j48975O0882O742L1467k164j0510m3257K9348j00623
16952i6332O1345J20611m177o16l9421j54610r548K7501L611J4477r8099k7060
16940b02318j59877Q666L3952J06227K65891l5036q7429k485k4587m0282p9957
16929b17235Q1164M3479L7626m3074p952K304Q7678k2028j06012K3283N649P8923
16917c6195Q1168j1420M9438N5382J7404L6655p0309l6128o3064j36994j22817
16906b36880m7759O3570K2988L1741K22858Q5619L0771j55790j75328l5944Q9072
16895a05082O9756l1115n5434M282K0730J8861k2458j08295l1488L1402N1915
16884a56926J28116J16102J01548J6940O9764M8728k30684K464J12547p7761r4488
$$ plain form
16964 -5129 85354 161387 80758 -68217 -7335 -593 30874 28710 18200 -25057 4291 -96332
16952 -96332 -34987 85624 81447 80831 41410 -113200 -122748 -95247 -91636 -77159 -175258 -202318
16940 -202318 -362195 -353529 -319577 -213350 52541 17505 -69924 -72409 -96996 -137278 -217235
16929 -217235 -136071 -92592 -54966 -98040 -105992 -103688 -16010 -38038 -144050 -120767 -115118 -36195
16917 -36195 44973 33553 82991 138373 155777 192432 122123 85995 22931 -114063 -236880
16906 -236880 -284639 -221069 -198081 -166340 56518 142137 172908 17118 -158210 -194154 -105082
16895 -105082 -35326 -66441 -121875 -117593 -96863 -78002 -100460 -208755 -240243 -208841 -156926
16884 -156926 -28810 87292 188840 205780 275544 324272 93588 96052 208599 130838 36350
16873C6350p2063N6603Q2307K4983p5834q3497p8326k6336j08579l0072N1559
16862b22905R876m8852O4786K9138M2638J8699Q4847q2779K9221J65089j41682
16851e1924Q2484o6009M0337P1350j1118j17123j08302O1360P1757P2237R277
16840E4326N4330L3391o5031j9417J0165L8421j50141l2705j1724q5874j09235
16829b83494J13653O1269r3722k0179J35234R1055k849R7668Q707j16841k0648
16818c0147P5794n5739p0353l1064O1701l76Q9234R2710m7186r688n184k4656
16806D5046j5589k5502M1739J02350j35503k20544K7305J56238L2959n8960K7936
16795b2525l4865r2101O487o4153m1959O2218J66912J42337q9858j34726J11128
$$ plain form
16873 36350 -35713 20890 103197 128180 52346 -31151 -109477 -135813 -244392 -274464 -222905
16862 -222905 -213029 -261881 -197095 -167957 -125319 -106620 -21773 -104552 -75331 89758 -51924
16851 -51924 30560 -35449 4888 76238 65120 -52003 -160305 -98945 -27188 45049 54326
16840 54326 108656 142047 77016 57599 67764 106185 -43956 -76661 -88385 -174259 -283494
16829 -283494 -169841 -108572 -202294 -222473 -87239 3816 967 98635 107342 -9499 -30147
16818 -30147 45647 -10092 -80445 -111509 -49808 -50184 39050 131760 84574 74886 69702 45046
16806 45046 29457 3955 45694 148044 12541 -208003 -180698 -24460 8499 -50461 -22525
16795 -22525 -57390 -149491 -143004 -207157 -249116 -186898 -19986 122351 32493 -102233 8895
16784H895J34100O4738j06298j41452j49326J54357M3431n1854k31j02594R8575
16773d7659j1082q5854m3991k8927K16K00121j3993r5256j73097P4412l6365k9272
16761b90747J51737J96312J61974K2071j56409j91839p0835J19069Q0440p0555
16751d8782j11748M0976Q1416R8460J0478J40451m6888o7815O854n9792n8005
16740a4395j03591p4188Q3111Q5651o9786j9854J74623n8493o5691K4559J21999
16729H3945N3527j09227J8022J17673r309q7143j44159j5837L1432j03639k7105
16718a91820L9r1434k0496L4614j20051l4933J34775J06149J0755J88153P7613
16707I3364n3741p3265K6047J19210M362n5826j41268K104J30931K4452j39989
$$ plain form
16784 8895 142995 207733 101435 -40017 -189343 -34986 8445 -43409 -43640 -146234 -47659
16773 -47659 -58741 -144595 -188586 -217513 -217297 -17176 -31169 -126425 -299522 -225110 -261475 -290747
16761 -290747 -139010 57302 219276 241347 84938 -106901 -177736 -58667 21773 -48782
16751 -48782 -160530 -119554 -38138 60322 70800 211251 164363 96548 103402 43610 -14395
16740 -14395 -117986 -192174 -109063 -23412 -93198 -113052 61571 3078 -62613 -38054 83945
16729 83945 137472 28245 46267 163940 154631 67488 -76671 -92508 -61076 -164715 -191820
16718 -191820 -191781 -283215 -303711 -269097 -389148 -424081 -289306 -183157 -172402 15751 93364
16707 93364 39623 -33642 -7595 111615 115977 60151 -81117 -79013 51918 76370 -63619
16696f3619O4930J26473p7073n9115l161J9765K896k7172j02015K4017M9785r8590
16684a42879q7441J2429M7748P1064j9359j46922k930J04375R2445Q5108p9640
16673f6002k41554L5410J13728J7262n695j497l9867l5331J22198M2272j6613
16662g5689J9533J34732K517j2055j0676J6841r6003l3123j49788l5019J84643
16651e4087J14880q1811J00636M9549k35836j46217J5963O1242J03187l3780j22582
16640b28856j26308Q7042N7164K9215J00952J5817p3270o9890Q5463J35553Q6012
16629I8894j6229L844m1260J3096N9643j6873r5084O5399l2312l8766m0589j01682
16617a41919P0979O0043k3776n6161o1414l3653j0959l402O2723J1307J4333j4323
$$ plain form
16696 -63619 1311 127784 50711 -8404 -11565 8200 11096 -16076 -118091 -94074 -44289 -142879
16684 -142879 -230320 -217891 -170143 -99079 -118438 -265360 -268290 -163915 -71470 13638 -66002
16673 -66002 -307556 -272146 -158418 -141156 -146851 -148348 -188215 -223546 -101348 -59076 -75689
16662 -75689 -56156 78576 81093 69038 58362 75203 -20800 -53923 -203711 -238730 -54087
16651 -54087 60793 -21018 79618 129167 -106669 -252886 -236923 -175681 -72494 -106274 -228856
16640 -228856 -355164 -268122 -210958 -181743 -80791 -64974 -138244 -208134 -122671 12882 98894
16629 98894 82665 86509 45249 58345 117988 101115 6031 71430 39118 352 -40237 -141919
16617 -141919 -70940 -10897 -34673 -90834 -152248 -185901 -196860 -200262 -137539 -126232 -111899 -126222
16605a26222J43511L2788r9913o3419N2743Q832P1982k5447k1681k0627J05552
16594E8099k2968r9203p1326j2601P4744M6424O340O3266J6180L590l9467O714
16582B9792N2509k8284j31052k5470J474l685J5760Q0215p0376q676N724r9365
16570a81434J8310k7256l5494N9037k5193M2438L5128L4692J2885q4653P370n6861
16558b01031j45090J43810J61207n6471j02933J18278O2817n4379j37130L4245
16548a76677J32056Q0969q8609m124j3969o9772j06073Q6164q106r5377J4710
16537b48808M9404K9172L5424P0079J09724j01262n1492l642L369M4595L6111
16526b7326N9092L133j71249j0117J9565J16578Q2199P0287J9539m0976j18791
$$ plain form
16605 -126222 17289 50077 -49836 -113255 -60512 -51680 20302 -5145 -26826 -47453 58099
16594 58099 35131 -64072 -135398 -147999 -73255 -26831 -20491 42775 58955 62545 23078 29792
16582 29792 82301 54017 -77035 -102505 -101031 -104716 -88956 -8741 -79117 -87793 -82069 -181434
16570 -181434 -163124 -190380 -225874 -166837 -192030 -149592 -114464 -79772 -66887 -151540 -144170 -201031
16558 -201031 -346121 -202311 -41104 -97575 -200508 -82230 -19413 -73792 -210922 -176677
16548 -176677 -44621 36348 -52261 -56385 -70354 -140126 -246199 -160035 -168141 -263518 -248808
16537 -248808 -199404 -170232 -134808 -64729 44995 -56267 -107759 -111401 -108032 -63437 -27326
16526 -27326 31766 34899 -136350 -146467 -126902 -10324 71875 142162 161701 120725 1934
16515A934p9602J33694K72725o5695j35235N2444J4972o4113N783k13158l1685
16504a07936M3483N9775m420r0933o3729J23495M3570q0610K0175P1063j5034
16493a101Q6473L3546j3703j07347l6056j58526j37340Q496O1299Q3611J0042
16482a70606J9133Q3302q7143p3567L7332J8996J47384J14025J46265J0043j50898
16471I4266j04846L192j23729L756J8500K7126K7721j18380J3165m8715J02450
16460a05494j90205k4853L6396J8916O8366R9646J50394J0275L3778l2954l3199
16449C1066n8084j34559N852J04361Q4797J2263k8350q0188L9315J78794P9804
16438B35071k0197N0775K7501m6024j38611J7574J3036j07788J02453k7008P8894
$$ plain form
16515 1934 -77668 56026 328751 263056 127821 180265 195237 131124 136907 -76251 -107936
16504 -107936 -64453 -4678 -9098 -100031 -163760 -40265 3305 -77305 -57130 13933 -1101
16493 -1101 85372 118918 105215 -2132 -38188 -196714 -334054 -325558 -264259 -180648 -170606
16482 -170606 -151473 -68171 -155314 -228881 -191549 -172553 -25169 88856 235121 245164 94266
16471 94266 -10580 -7388 -131117 -127361 -108861 -81735 -54014 -172394 -159229 -207944 -105494
16460 -105494 -295699 -320552 -284156 -265240 -196874 -97228 53166 63441 97219 64265 31066
16449 31066 -27018 -161577 -155725 -51364 33433 45696 17346 -62842 -23527 155267 235071
16438 235071 214874 265649 293150 247126 108515 126089 139125 31337 133790 106782 185676
16427A85676k6830l6270k0622Q9714r5578o9455P533j39962j4782N1249p1434
16416a40761J01369n9923j09830R2934l2522O6740N9171R7919m6307l7003n1023
16405e9236q8020j5810N7598P2845n2145k7862P0313J38717j18836j00411L2583
$$ plain form
16427 185676 158846 122576 101954 191668 96090 26635 34168 -105794 -120576 -69327 -140761
16416 -140761 -39392 -99315 -209145 -116211 -148733 -81993 -22822 75097 28790 -8213 -59236
16405 -59236 -147256 -163066 -105468 -32623 -84768 -112630 -42317 96400 -22436 -122847 -90264
$$ [...]
##END NTUPLES=NMR SPECTRUM
##END=
