##TITLE=Analysis number 326881
Compound Code cc 11701
Project Code adrs
Chemist Name endeavour
##JCAMPDX= 6.0         $$ Bruker NMR JCAMP-DX V2.0
##DATA TYPE= NMR SPECTRUM
##DATA CLASS= NTUPLES
##ORIGIN= Bruker BioSpin GmbH
##OWNER= nmr
$$ XWIN-NMR		Version 3.5
$$ Tue Feb 27 11:35:39 2007 GMT Standard Time (UT+0h)  MAYBRIDGE\nmr@NMR_250MHZ
##.OBSERVE FREQUENCY= 250.131544655141
##.OBSERVE NUCLEUS= ^1H
##.ACQUISITION MODE= SIMULTANEOUS (DQD)
##.ACQUISITION SCHEME= undefined
##.AVERAGES= 16
##.DIGITISER RES= 18
##SPECTROMETER/DATA SYSTEM= dpx250
##.PULSE SEQUENCE= zg30
##.SOLVENT NAME= DMSO
##.SHIFT REFERENCE= (INTERNAL, DMSO, 0, 16.522)
##AUDIT TRAIL= $$ (NUMBER, WHEN, WHO, WHERE, WHAT)
$$ ##TITLE= Audit trail, XWIN-NMR		Version 3.5
$$ ##JCAMPDX= 5.01
$$ ##ORIGIN= Bruker BioSpin GmbH
$$ ##OWNER= nmr
$$ C:\u/data/dgb/nmr/ADRS/2430/pdata/1/auditp.txt
$$ ##AUDIT TRAIL=  $$ (NUMBER, WHEN, WHO, WHERE, WHAT)
(   1,<2007-02-27 11:35:03.70 +000>,<MAYBRIDGE\nmr>,<NMR_250MHZ>,
      <created by zg, POWCHK disabled, PULCHK disabled
       configuration hash MD5:
       49 4B E0 1D 92 C2 6B 37 9F E6 65 BC 52 41 86 1D
       data hash MD5: 64K
       4E 41 E3 A6 A9 34 53 EF 24 62 59 4A 57 EB 0D CD>)
(   2,<2007-02-27 11:35:25.59 +000>,<MAYBRIDGE\nmr>,<NMR_250MHZ>,
      <Start of raw data processing
       ef LB = 0.3 FT_mod = 6 PKNL = 1 SI = 32K 
       data hash MD5: 32K
       F9 48 28 2B 5F F4 29 81 85 64 37 50 09 7F BF 41>)
(   3,<2007-02-27 11:35:28.39 +000>,<MAYBRIDGE\nmr>,<NMR_250MHZ>,
      <apk 
       data hash MD5: 32K
       3A D5 C0 62 D2 2D E4 68 57 25 A4 15 1A 4E E7 11>)
(   4,<2007-02-27 11:35:30.73 +000>,<MAYBRIDGE\nmr>,<NMR_250MHZ>,
      <abs ABSG = 5 
       data hash MD5: 32K
       25 7A CB D7 D4 89 52 69 2F 8F 5C FA 0B 15 10 50>)
$$ ##END=
$$ 
$$ hash MD5
$$ 2E D6 E1 4A B0 84 E9 49 21 38 24 99 B5 54 68 33
##$RELAX= 
##$RELAX= 
##$RELAX= 
##$RELAX= 
##$RELAX= 
##$RELAX= 
##$RELAX= 
$$ Bruker specific parameters
$$ --------------------------
##$DU= <C:\u>
##$EXPNO= 2430
##$NAME= <ADRS>
##$PROCNO= 1
##$TYPE= <nmr>
##$USER= <dgb>
##$AMP= (0..31)
100 100 100 100 100 100 100 100 100 100 100 100 100 100 100 100 100 100 
100 100 100 100 100 100 100 100 100 100 100 100 100 100 
##$AQSEQ= 0
##$AQ_mod= 3
##$AUNM= <au_zg>
##$AUTOPOS= <41 >
##$BF1= 250.13
##$BF2= 250.13
##$BF3= 250.13
##$BF4= 250.13
##$BF5= 500.13
##$BF6= 500.13
##$BF7= 500.13
##$BF8= 500.13
##$BYTORDA= 1
##$CFDGTYP= 0
##$CFRGTYP= 5
##$CHEMSTR= <none>
##$CNST= (0..31)
1 1 145 1 1 1 1 1 1 1 1 1 1 1 1 1 1 1 1 1 1 1 1 1 1 1 1 1 1 1 1 1 
##$CPDPRG= <>
##$CPDPRG1= <>
##$CPDPRG2= <>
##$CPDPRG3= <>
##$CPDPRG4= <mlev>
##$CPDPRG5= <mlev>
##$CPDPRG6= <mlev>
##$CPDPRG7= <mlev>
##$CPDPRG8= <mlev>
##$CPDPRGB= <>
##$CPDPRGT= <>
##$D= (0..31)
0 1 0 0 0 0 0 0 0 0.06 0 0 0 0 0 0 0.0002 0 0 0 0 0 0 0 0 0 0 0 0 0 0 
0 
##$DATE= 1172576101
##$DBL= (0..7)
120 120 120 120 120 120 120 120 
##$DBP= (0..7)
150 150 150 150 150 150 150 150 
##$DBP07= 0
##$DBPNAM0= <>
##$DBPNAM1= <>
##$DBPNAM2= <>
$$ [...]
##$SUBNAM7= <"">
##$SUBNAM8= <"">
##$SUBNAM9= <"">
##$SW= 20.6930455092707
##$SWIBOX= (0..15)
0 0 3 0 0 0 0 0 0 0 0 0 0 0 0 0 
##$SW_h= 5175.983436853
##$TD= 65536
##$TD0= 1
##$TE= 295.16
##$TE2= 300
##$TE3= 300
##$TEG= 300
##$TL= (0..7)
0 120 120 120 120 120 120 120 
##$TP= (0..7)
150 150 150 150 150 150 150 150 
##$TP07= 0
##$TPNAME0= <>
##$TPNAME1= <>
##$TPNAME2= <>
##$TPNAME3= <>
##$TPNAME4= <>
##$TPNAME5= <>
##$TPNAME6= <>
##$TPNAME7= <>
##$TPOAL= (0..7)
0.5 0.5 0.5 0.5 0.5 0.5 0.5 0.5 
##$TPOFFS= (0..7)
0 0 0 0 0 0 0 0 
##$TUNHIN= 0
##$TUNHOUT= 0
##$TUNXOUT= 0
##$USERA1= <user>
##$USERA2= <user>
##$USERA3= <user>
##$USERA4= <user>
##$USERA5= <user>
##$V9= 5
##$VALIST= <valist>
##$VCLIST= <CCCCCCCCCCCCCCC>
##$VD= 0
##$VDLIST= <DDDDDDDDDDDDDDD>
##$VPLIST= <PPPPPPPPPPPPPPP>
##$VTLIST= <TTTTTTTTTTTTTTT>
##$WBST= 1024
##$WBSW= 4
##$XGAIN= (0..3)
0 0 0 0 
##$XL= 0
##$YL= 0
##$YMAX_a= 190841
##$YMIN_a= -326993
##$ZGOPTNS= <>
##$ZL1= 120
##$ZL2= 120
##$ZL3= 120
##$ZL4= 120
##$ABSF1= 16.522
##$ABSF2= -4.171173
##$ABSG= 5
##$ABSL= 3
##$ALPHA= 0
##$AQORDER= 0
##$ASSFAC= 0
##$ASSFACI= 0
##$ASSFACX= 0
##$ASSWID= 0
##$AUNMP= <proc_1d>
##$AZFE= 0.1
##$AZFW= 0.1
##$BCFW= 0
##$BC_mod= 0
##$BYTORDP= 0
##$COROFFS= 0
##$CY= 12.5
##$DATMOD= 1
##$DC= 0
##$DFILT= <>
##$DTYPP= 0
##$F1P= 14.0000005364418
##$F2P= -0.99999901652339
##$FCOR= 0.5
##$FTSIZE= 32768
##$FT_mod= 6
##$GAMMA= 0
##$GB= 0
##$INTBC= 1
##$INTSCL= 1
##$ISEN= 128
##$LB= 0.3
##$LEV0= 0
##$LPBIN= 0
##$MAXI= 10000
##$MC2= 0
##$MEAN= 0
##$ME_mod= 0
##$MI= 0
##$NCOEF= 0
##$NC_proc= -3
##$NLEV= 6
##$NOISF1= 0
##$NOISF2= 0
##$NSP= 0
##$NTH_PI= 0
##$NZP= 0
##$OFFSET= 16.522
##$PC= 1
##$PHC0= 184.8442
##$PHC1= 85.10037
##$PH_mod= 1
##$PKNL= yes
##$PPARMOD= 0
##$PSCAL= 4
##$PSIGN= 0
##$REVERSE= no
##$SF= 250.13
##$SI= 32768
##$SIGF1= 0
##$SIGF2= 0
##$SINO= 400
##$SIOLD= 32768
##$SREGLST= <1H.DMSO>
##$SSB= 0
##$STSI= 32768
##$STSR= 0
##$SW_p= 5175.98343685301
##$SYMM= 0
##$S_DEV= 0
##$TDeff= 65536
##$TDoff= 0
##$TI= <Analysis number 999999
Compound Code 99
Book Reference 9
Project Code 9>
##$TILT= no
##$TM1= 0
##$TM2= 0
##$TOPLEV= 0
##$USERP1= <user>
##$USERP2= <user>
##$USERP3= <user>
##$USERP4= <user>
##$USERP5= <user>
##$WDW= 1
##$XDIM= 32768
##$YMAX_p= 340687083
##$YMIN_p= -6868336
$$ End of Bruker specific parameters
$$ ---------------------------------
##NTUPLES= NMR SPECTRUM
##VAR_NAME=  FREQUENCY,     SPECTRUM/REAL,   SPECTRUM/IMAG
##SYMBOL=    X,             R,               I
##VAR_TYPE=  INDEPENDENT,   DEPENDENT,       DEPENDENT
##VAR_FORM=  AFFN,          ASDF,            ASDF
##VAR_DIM=   32768,         32768,           32768
##UNITS=     HZ,            ARBITRARY UNITS, ARBITRARY UNITS
##FACTOR=    0.157963299565203, 1,           1
##FIRST=     4132.6476996994, 0,             0
##LAST=      -1043.33573715361, 0,           0
##MIN=       -1043.33573715361, -6868336,    0
##MAX=       4132.6476996994, 340687083,     0
$$ Real data points
##PAGE= N=1
##DATA TABLE= (X++(R..R)), XYDATA
$$ [...]
$$ plain form
26991 15383 -12716 -12509 11961 46368 68428 60221 35140 34803 61808 65998 43685 21062 9027
26978 9027 10629 29833 54177 46479 37948 57019 73753 79697 67973 78369 75737 88103 80071
26965 80071 56304 86907 83409 46874 28761 30447 33390 40950 52686 27209 12326 17515 10128
26952 10128 31515 22708 14437 28654 52441 68285 67794 44946 41494 38744 15060 8242 30840
26939 30840 56234 59915 74506 88996 98842 89093 65717 33860 -872 33132 35757 27573 8433
26926 8433 28132 45811 29870 35164 31024 39203 20568 -6827 9773 9903 -9408 12153 40457
26913 40457 44328 32130 8527 1505 21809 47508 68735 80042 77604 73618 65635 15096 -2844
26900 -2844 -17725 14490 44937 66207 68028 50152 7411 -2467 3121 55893 69109 85795
$$ packed form
26991A5383k8099K07K4470L4407K2060q207k5081l37K7005M190k2313k2623j2035
26978I027J602J9204K4344p698q531J9071J6734N944j1724J0396k632J2366q032
26965H0071k3767L0603l498l6535j8113J686K943P560J1736k5477j4883N189p387
26952A0128K1387q807q271J4217K3787J5844m91k2848l452k750k3684o818K2598
26939C0840K5394L681J4591J4490R846r749k3376l1857l4732L4004K625q184j9140
26926H433J9699J7679j5941N294m140Q179j8635k7395J6600J30j9311K1561K8304
26913D0457L871j2198k3603p022K0304K5699K1227J1307k438l986p983n0539j7940
26900b844j4881L2215L0447K1270J821j7876m2741r878N588N2772J3216J6686
$$ plain form
26888 85795 90613 69715 52927 58820 60440 42390 30344 41223 64015 71617 69402 96693 76223
26875 76223 60177 67308 70938 64803 43506 59677 67623 58876 31135 25573 43709 57437 43782
26862 43782 57445 53875 55683 57664 49930 54047 35465 38465 45294 51303 58730 44234 65778
26849 65778 57892 50062 36362 47530 56891 61051 62013 49958 41278 64949 44461 20077 34682
26836 34682 29379 41481 36266 30940 20716 8155 6713 3713 3467 15814 29856 39341 45634
26823 45634 59449 74355 104384 128134 137332 144025 121964 112066 71538 35630 56231 41342
26811 41342 48016 48174 63805 61163 59164 66971 47803 29346 9852 -6660 -22833 8325 27719
26798 27719 14353 33373 42327 33119 34407 44736 60622 51716 29433 24398 9970 45712 70989
$$ packed form
26888H5795M818k0898j6788N893J620j8050j2046J0879K2792P602k215K7291k0470
26875G6223j6046P131L630o135k1297J6171P946q747k7741n562J8136J3728j3655
26862D3782J3663l570J808J981p734M117j8582L000O829O009P427j4496K1544
26849F5778p886p830j3700J1168R361M160R62j2055q680K3671k0488k4384J4605
26836C4682n303J2102n215n326j0224j2561j442l000k46J2347J4042R485O293
26823D5634J3815J4906L0029K3750R198O693k2061r898m0528l5908K0601j4889
26811D1342O674J58J5631k642j999P807j9168j8457j9494j6512j6173L1158J9394
26798B7719j3366J9020Q954r208J288J0329J5886q906k2283n035j4428L5742K5277
$$ plain form
26785 70989 70388 24530 18720 46388 79868 91776 69877 50065 53679 78896 97323 66888
26773 66888 48667 22989 13430 -4787 -38969 -59042 -36312 -1946 30420 28483 29174 51429
26761 51429 67711 43738 23208 32257 11173 1147 21805 19342 14319 55473 78240 94290
26749 94290 119854 96145 66676 23723 30887 54611 68659 77644 41932 14026 30973 49999
26737 49999 48251 51862 40846 41578 63448 93986 89852 89666 94583 92450 88761 86313 71635 18673
26723 18673 3362 -10349 -3832 21866 33976 47227 32760 27963 42447 35216 34737 42069 46586
26710 46586 54361 57796 42597 31780 8405 8523 32556 25096 8793 27469 42610 26352 6930
26697 6930 26388 66497 48533 57557 43778 34530 40617 49552 22787 41718 71311 55441 -4610
$$ packed form
26785G0989o01m5858n810K7668L3480J1908k1899j9812L614K5217J8427l0435
26773F6888j8221k5678r559j8217l4182k0073K2730L4366L2366j937O91K2255
26761E1429J6282k3973k0530R049k1084j0026K0658k463n023M1154K2767J6050
26749I4290K5564k3709k9469m2953P164K3724J4048Q985l5712k7906J6947J9026
26737D9999j748L611j1016P32K1870L0538m134j86M917k133l689k448j4678n2962
26723A8673j5311j3711O517K5698J2110J3251j4467m797J4484p231m79P332M517
26710D6586P775L435j5199j0817k3375J18K4033p460j6303J8676J5141j6258j9422
26697F930J9458M0109j7964R024j3779r248O087Q935k6765J8931K9593j5870o0051
$$ plain form
26684 -4610 -12149 -16821 -17551 3024 27139 9841 -6433 7960 38043 61521 61559 31331 20860
26671 20860 15176 27010 15651 37696 42354 18849 18642 38041 49990 54797 52882 42841 36833
26658 36833 18789 4964 -4767 -1508 10176 13836 36390 24405 8322 5955 31870 26137 -3311
26645 -3311 22623 52874 67858 53280 37485 29911 21335 43565 81198 73904 78111 83529 76911
26632 76911 60792 39876 35579 53955 58108 48746 53181 54553 5288 -13345 13816 20490 52560
26619 52560 71455 63093 69311 84722 106592 84657 63147 43712 49718 52922 45639 45869 53703
26606 53703 46465 38031 38775 55340 58658 28198 29813 15015 6679 27552 40984 21957 -1432
26593 -1432 -28501 -8326 -1701 8107 36928 55785 59489 53862 17524 32391 43086 34520 36340
$$ packed form
26684d610p539m672p30K0575K4115j7298j6274J4393L0083K3478L8l0228j0471
26671B0860n684J1834j1359K2045M658k3505k07J9399J1949M807j915j0041o008
26658C6833j8044j3825r731L259J1684L660K2554j1985j6083k367K5915n733k9448
26645c311K5934L0251J4984j4578j5795p574q576K2230L7633p294M207N418o618
26632G6911j6119k0916m297J8376M153r362M435J372m9265j8633K7161O674L2070
26619E2560J8895q362O218J5411K1870k1935k1510j9435O006L204p283K30P834
26606E3703p238q434P44J6565L318l0460J615j4798q336K0873J3432j9027k3389
26593a432k7069K0175O625R808K8821J8857L704n627l6338J4867J0695q566J820
$$ plain form
26580 36340 35264 25465 32712 52114 43279 46192 40174 38091 42910 44129 42231 24263 8427 22079
26566 22079 40101 70834 82842 57286 18900 45 15673 -7404 -6327 47005 50825 49249
26554 49249 60700 72518 44085 38386 30675 42437 22639 28854 42686 30289 25996 29062 29076
26541 29076 17898 16600 16969 -28219 -32931 45 4823 19655 28973 31146 11440 10354 8341
26528 8341 13502 26667 15341 21052 51080 28106 2399 19502 30197 61212 26800 6263
26516 6263 2949 20212 1771 -17001 10233 32866 49083 53438 41207 25710 20846 26232 21417
26503 21417 22055 13219 37051 67878 42295 40014 42002 14874 -2767 -11232 32594 45450 59930
26490 59930 53481 20202 -9825 -1860 11846 4368 -36771 -9388 29480 57513 67231 48762
$$ packed form
26580C6340j076r799P247J9402q835K913o018k083M819J219j898j7968j5836J3652
26566B2079J8022L0733J2008k5556l8386j8855J5628k3077J077N3332L820j576
26554D9249J1451J1818k8433n699p711J1762j9798O215J3832j2397m293L066J4
26541B9076j1178j298L69m5188m712L2976M778J4832R318K173j9706j086k013
26528H341N161J3165j1326N711L0028k2974k5707J7103J0695L1015l4412k0537
26516F263l314J7263j8441j8772K7234K2633J6217M355j2231j5497m864N386m815
26503B1417O38q836K3832L0827k5583k281J988k7128j7641q465M3826J2856J4480
26490E9930o449l3279l0027P965J3706p478m1139K7383L8868K8033R718j8469
$$ plain form
26478 48762 57766 65692 82854 53460 9120 17459 29939 1452 -5444 34740 39986 30622 49433
26465 49433 35724 19066 25625 -760 6601 19927 40549 55875 59435 45104 36279 38271 22333
26452 22333 18501 26342 35430 19963 8997 36730 51172 46576 31100 41116 14394 2614
26440 2614 -24492 -27456 -2134 30158 56153 44532 22030 27461 30658 15097 1095 -6502 537
26427 537 20373 7375 -12576 14191 62104 81547 91520 34643 1062 21144 29557 34679 24567
26414 24567 42543 60727 85730 78133 65467 61251 52008 56006 65577 49451 65566 34316 -3514
26401 -3514 -8987 -9792 9219 7729 9720 23162 33421 30309 42685 45218 24360 18104 5507
26388 5507 25211 37346 30805 22871 31902 46019 52144 35131 48818 54272 28875 -297 -62724
$$ packed form
26478D8762R004P926J7162k9394m4340Q339J2480k8487o896M0184N246r364J8811
26465D9433j3709j6658O559k6385P361J3326K0622J5326L560j4331q825J992j5938
26452B2333l832P841R088j5467j0966K7733J4442m596j5476J0016k6722j1780
26440B614k7106k964K5322L2292K5995j1621k2502N431L197j5561j4002p597P039
26427E37J9836j2998j9951K6767M7913J9443R973n6877l3581K0082Q413N122j0112
26414B4567J7976J8184K5003p597j2666m216r243L998R571j6126J6115l1250l7830
26401c514n473q05J9011j490J991J3442J0259l112J2376K533k0858o256j2597
26388E507J9704J2135o541p934R031J4117O125j7013J3687N454k5397k9172o2427
$$ plain form
26375 -62724 -53952 -22876 -24478 -33350 -39639 -27903 -14456 -52934 -51108 -11756 19069 10494 6377
26362 6377 13405 29547 32161 24196 29354 26893 -8883 -34781 -27654 -67089 -78711 -49047 5027
26349 5027 -7123 -18097 -239 13059 20614 20287 53623 60380 22965 22742 10208 26512 19617
26336 19617 -13268 -12569 13023 3327 -5231 13586 41755 28367 2297 -25271 -17959 -6895 -119
26323 -119 8803 1660 3417 2181 21161 22375 25808 13630 15598 -8159 -18741 20356 49012
26310 49012 70886 46161 25009 73773 87586 68228 38611 61221 59452 18583 1471 -20638
26298 -20638 -16258 8177 -7451 -27621 -14482 9736 28830 3489 -33787 -28107 -21912 -884
26286 -884 -8281 -3155 14400 13726 6389 17692 60881 59841 24225 5128 -54 10093 13253 19034
$$ packed form
26375f2724Q772L1076j602q872o289J1736J3447l8478J826L9352L0825q575m117
26362F377P028J6142K614p965N158k461l5776k5898P127l9435j1622K9664N4074
26349E027j2150j0974J7858J3298P555l27L3336O757l7415k23j2534J6304o895
26336A9617l2885O99K5592r696q558J8817K8169j3388k6070k7568P312J1064O776
26323a19Q922p143J757j236J8980J214L433j2178J968k3757j0582L9097K8656
26310D9012K1874k4725k1152M8764J3813j9358k9617K2610j769m0869j7112k2109
26298b0638M380K4435j5628k0170J3139K4218J9094k5341l7276N680O195K1028
26286h84p397N126J7555o74p337J1303M3189j040l5616j9097n182J0147L160N781
$$ plain form
26272 19034 -5717 4975 19557 18220 17489 26788 39805 12328 37536 65408 22740 19204 903
26259 903 -20493 -25242 -5993 5717 -2247 8309 29340 23807 15602 -7363 -7986 8364 15963
26246 15963 16602 -5124 -23145 22571 12850 7799 15453 31245 63022 46625 20800 20816 -3007
26233 -3007 -16175 9344 56505 78476 80537 71342 43486 10000 9240 5979 8577 -2361 15512
26220 15512 39446 32946 33978 34524 22369 5409 11484 43389 49232 56142 61023 43672 14076
26207 14076 6991 6735 8798 -4449 8910 29678 22600 -1241 5291 29493 13526 -14713 -21994
26194 -21994 -20521 -8804 3705 -3742 13215 28352 -2502 3205 -790 7785 16214 8224 -895
26181 -895 -21315 3049 -12417 -5369 16788 -9616 -19685 -24512 -20307 -11086 -5224 16859 17490
$$ packed form
26272A9034k4751J0692J4582j337p31R299J3017k7477K5208K7872m2668l536j8301
26259I03k1396m749J9249J1710p964J0556K1031n533q205k2965o23J6350P599
26246A5963O39k1726j8021M5716r721n051P654J5792L1777j6397k5825J6k3823
26233c007j3168K5519M7161K1971K061r195k7856l3486p60l261K598j0938J7873
26220A5512K3934o500J032N46j2155j6960O075L1905N843O910M881j7351k9596
26207A4076p085k56K063j3247J3359K0768p078k3841O532K4202j5967k8239p281
26194b1994J473J1717J2509p447J6957J5137l0854N707l995Q575Q429p990r119
26181h95k0420K4364j5466P048K2157k6404j0069m827M205R221N862K2083O31
$$ plain form
26168 17490 -11213 -465 10507 -5924 -25722 -19168 -5549 -10962 -12636 -2608 -16780 2155
26156 2155 5372 17598 29686 16389 10049 610 -7565 -15465 -237 19794 22430 9327 -3293
26143 -3293 -12270 -28656 -50555 -66089 -61304 -52398 -45647 -21943 -13959 21000 34968 42060 26292
26130 26292 11155 39887 33530 17059 29551 13536 29396 54334 62479 56398 16331 2086
26118 2086 28836 29008 34004 10474 6802 25154 38012 27730 8106 -3896 15888 -21244 -25628
26105 -25628 15547 57463 69294 46065 43600 7794 11929 14662 -6733 -10565 3349 9796 -1274
26092 -1274 -22379 -42771 -21401 23608 34894 25572 24337 -18601 -34965 -36910 -38907 865 34977
26079 34977 66496 76072 52949 24641 13164 10639 8332 37103 39242 36432 40382 16091 4252
$$ packed form
26168A7490k8703J0748J0972j6431j9798O554J3619n413j674J0028j4172J8935
26156B155L217J2226J2088j3297o340r439q175p900J5228K0031K636j3103j2620
26143c293q977j6386k1899j5534M785Q906O751K3704P984L4959J3968P092j5768
26130B6292j5137K8732o357j6471J2492j6015J5860K4938Q145o081m0067j4245
26118B086K6750J72M996k3530l672J8352J2858j0282j9624j2002J9784l7132m384
26105b5628M1175M1916J1831k3229k465l5806M135K733k1395l832J3914O447j1070
26092a274k1105k0392K1370M5009J1286r322j235m2938j6364j945j997L9772L4112
26079C4977L1519R576k3123k8308j1477k525k307K8771K139k810L950k4291j1839
$$ plain form
26066 4252 23583 31393 34713 -11658 -36548 -15440 1416 8579 15207 40758 45817 17211 -6130
26053 -6130 -15274 2018 39948 29903 8652 21901 36970 41914 29940 40287 58124 40496
26041 40496 16303 15168 8530 5813 8863 32016 24177 28534 40757 26550 -30547 -44401 -10892
26028 -10892 -25956 -25858 -20824 -15303 10439 9801 -3873 -11678 -9876 -20244 -11771 -25127 -15450 -27871
26014 -27871 -33760 -55784 -43641 -4817 16396 44624 39200 7704 11105 26221 4998 6270
26002 6270 7889 11277 8093 35327 19745 10372 28776 20623 -12133 -9259 -4176 -8991 5437
25989 5437 2653 -5533 -96 -5087 3986 -17741 -17785 3788 21903 12959 -27 29002 35363 40310
25975 40310 40034 16027 6188 49816 29132 29380 3860 18953 18322 4118 18774 32272 36342
$$ packed form
26066D252J9331P810L320m6371k4890K1108J6856P163O628K5551N059k8606k3341
26053f130r144J7292L7930j0045k1251J3249J5069M944j1974J0347J7837j7628
26041D0496k4193j135o638k717L050K3153p839M357J2223j4207n7097j3854L3509
26028a0892j5064R8N034N521K5742o38j3674p805J802j0368Q473j3356R677j2421
26014b7871n889k2024J2143L8824K1213K8228n424l1496L401J5116k1223J272
26002F270J619L388l184K7234j5582r373J8404q153l2756K874N083m815J4428
25989E437k784q186N437m991R073k1727m4K1573J8115q944j2986K9029O361M947
25975D0310k76k4007r839M3628k0684K48k5520J5093o31j4204J4656J3498M070
$$ plain form
25962 36342 17666 20810 15945 20216 13907 -12751 -25563 -3981 -365 3721 28590 39013 -6391
25949 -6391 -27522 -23627 -13387 -6311 13798 -20661 -31331 -20801 -1589 -13031 -27577 -35654
25937 -35654 -29273 -9553 2884 6236 -3277 8103 -8908 709 11018 17536 24554 31856 -1874
25924 -1874 5343 1603 -5546 -33572 -11690 9625 2992 -7992 4873 -917 -23010 -356 22024
25911 22024 6698 13133 9019 -14203 -16984 -23958 -24625 -15190 -3475 1456 10341 38356 15765
25898 15765 15781 20131 5023 -12356 -22782 2960 20198 2133 17417 39448 52683 43900 21202
25885 21202 29199 30203 14610 1169 29937 5912 22744 21525 -10974 -17763 7751 17890
25873 17890 25131 -21837 -26793 33413 57335 43281 20145 3954 7977 32794 39372 32036 16502
$$ packed form
25962C6342j8676L144m865M271o309k6658j2812K1582L616M086K4869J0423m5404
25949f391k1131L895J0240P076K0109l4459j0670J0530J9212j1442j4546q077
25937c5654O381J9720J2437L352r513J1380j7011R617J0309O518P018P302l3730
25924a874P217l740p149k8026K1882K1315o633j0984J2865n790k2093K2654K2380
25911B2024j5326O435m114k3222k781o974o67R435J1715M931Q885K8015k2591
25898A5765J6M350j5108j7379j0426K5742J7238j8065J5284K2031J3235q783k2698
25885B1202P997J004j5593j3441K8768k4025J6832j219l2499o789K5514J0139
25873A7890P241m6968m956O0206K3922j4054k3136j6191M023K4817O578p336j5534
$$ plain form
25860 16502 -2675 -25476 -7434 -1076 -4439 14296 16601 -10138 -29702 -58392 -29004 22960
25848 22960 50573 49540 61739 52693 32503 32466 11540 8404 12165 -19576 -18275 41307 37279
25835 37279 18144 -1985 -14333 -45102 -42144 -41653 -42719 -33830 -10543 -11393 263 -31512 -42313
25822 -42313 -21296 -36931 -7096 12210 30267 26208 43153 65979 21491 -11872 2584 19077
25810 19077 12518 8934 -25439 -19624 -33616 -58461 -70240 -52871 -37080 -24868 20362 56867
25798 56867 25265 5010 -5495 -18337 5077 25389 33167 25703 10081 4195 26569 37578
25786 37578 15256 -8685 1701 49039 35029 -3707 1061 -10174 -5371 -4938 13384 36463
25774 36463 3363 3681 15293 1923 14024 10810 10479 15987 -8708 -55401 -69064 -51585 -38310
$$ packed form
25860A6502j9177k2801J8042O358l363J8735K305k6739j9564k8690K9388N1964
25848B2960K7613j033J2199r046k0190l7k0926l136L761l1741J301N9582m028
25835C7279j9135k0129j2348l0769K958M91j066Q889K3287q50J1656l1775j0801
25822d2313K1017j5635K9835J9306J8057m059J6945K2826m4488l3363J4456J6493
25810A9077o559l584l4373N815j3992k4845j1779J7369J5791J2212M5230L6505
25798E6867l1602k0255j0505j2842K3414K0312P778p464j5622n886K2374J1009
25786C7578k2322k3941J0386M7338j4010l8736M768j1235M803M33J8322K3079
25774C6463l3100L18J1612j3370J2101l214l31N508k4695m6693j3663J7479J3275
$$ plain form
25761 -38310 -17056 -15982 -9362 -9270 -8066 3494 9456 5169 24695 39123 15158 18808 36718
25748 36718 27864 14268 -1664 4245 11713 8104 24540 11614 10114 21626 30089 -21195 -38960
25735 -38960 -19506 -26241 -36614 -31184 -23433 -8605 20784 19399 15227 3686 10028 13430 16106
25722 16106 -8909 8007 30464 2114 -2324 12286 2414 -18167 -11529 2586 40408 42621
25710 42621 20494 25689 10578 37421 48074 47685 33430 14303 -15723 -18347 -23579 -5341 -298
25697 -298 -32586 -23873 -45455 -42924 -31881 -11170 13668 24249 23154 -1662 -7361 -4937 12628
25684 12628 -26147 -44826 -6891 -10031 -17430 -12678 20683 31815 24316 12937 14662 -10751 -29997
25671 -29997 -26242 -35943 -28303 15112 46649 39332 26761 -34137 -53048 -14174 -17698 -33320 -18530
$$ packed form
25761c8310K1254J074O620R2J204J1560N962m287J9526J4428k3965L650J7910
25748C6718q854j3596j5932N909P468l609J6436j2926j500J1512Q463n1284j7765
25735c8960J9454o735j0373N430P751J4828K9389j385m172j1541O342L402K676
25722A6106k5015J6916K2457k8350m438J4610r872k0581O638J4115L7822K213
25710D2621k2127N195j5111K6843J0653l89j4255j9127l0026k624n232J8238N043
25697b98l2288Q713k1582K531J1043K0711K4838J0581j095k4816n699K424J7565
25684A2628l8775j8679L7935l140p399M752L3361J1132p499j1379J725k5413j9246
25671b9997L755r701P640M3415L1537p317j2571o0898j8911L8874l524j5622J4790
$$ plain form
25658 -18530 -8806 22641 53920 71586 41421 32489 16676 26713 -8258 -32517 -29562 -41721
25646 -41721 -35070 -42977 -70047 -48374 -40871 -64649 -72629 -43341 -28051 -134 15908 11534 -1747
25633 -1747 -7339 -1738 -6309 -17414 11353 14011 28217 13760 -30999 -25217 -14722 -25721 -16212
25620 -16212 -191 -11690 -27391 -44366 -43577 -58132 -60107 -25266 476 11190 8722 -1815
25608 -1815 22929 38460 31791 18137 12546 30109 38927 17689 -2923 -3246 -5353 -2336 -24530
25595 -24530 -32845 -25363 -22653 -43639 -33716 -34523 -36285 -23782 -23694 -6050 38009 42272 30708 16894
25581 16894 22262 16486 6381 -6026 -44821 -43291 -28645 -45735 -48203 -39851 -47793 -40766 -41334
25568 -41334 -52867 -50685 -33011 -20311 -19938 -766 1387 -5252 66 6997 -6645 -23937 -27539
$$ packed form
25658a8530R724L1447L1279J7666l0165q932j5813J0037l4971k4259K955j2159
25646d1721O651p907k7070K1673P503k3778p980K9288J5290K7917J6042m374j3281
25633a747n592N601m571j1105K8767K658J4206j4457m4759N782J0495j0999R509
25620a6212J6021j1499j5701j6975P89j4555j975L4841K5742J0714k468j0537
25608a815K4744J5531o669j3654n591J7563Q818k1238k0612l23k107L017k2194
25595b4530q315P482K710k0986R923q07j762J2503Q8J7644M4059M263j1564j3814
25581A6894N368n776j0105j2407l8795J530J4646j7090k468Q352p942P027n68
25568d1334j1533K182J7674J2700L73J9172K153o639N318O931j3642j7292l602
$$ plain form
25555 -27539 -13054 -33446 -23297 -2768 -12946 -624 11438 -14839 -18721 -1481 -2078 13845
25543 13845 -4959 -6992 -18325 -38870 -49484 -54531 -42711 -46317 -33648 -27034 3150 32586
25531 32586 37455 29985 17799 17609 33994 13817 -6629 -1374 -22056 -21891 9322 -8497 -15513
25518 -15513 -19144 -30228 -28435 -25106 -2433 20306 19739 -15743 -14868 8128 32303 30564 -3917
25505 -3917 -25663 -19944 -38178 -44867 -27330 -16839 -7178 3972 -17819 -23849 -23367 -49924 -62974
25492 -62974 -55293 -20627 -10420 -13969 -4616 8670 -11265 8070 28727 17601 22900 32863 43156
25479 43156 55220 21715 -15054 -11980 15620 15915 20962 7771 -11883 -28441 -20151 -25122 -45858
25466 -45858 -34218 -23399 -47742 -39805 -31007 -47327 -42510 -32032 -38368 -27875 -1399 -3771 -42338
$$ packed form
25555b7539J4485k0392J0149K0529j0178J2322J2062k6277l882J7240n97J5923
25543A3845j8804k033j1333k0545j0614n047J1820l606J2669O614L0184K9436
25531C2586M869p470j2186j90J6385k0177k0446N255k0682J65L1213j7819p016
25518a5513l631j1084J793L329K2673K2739n67l5482Q75K2996K4175j739l4481
25505c917k1746N719j8234o689J7537J0491R661J1150k1791o030M82k6557j3050
25492f2974P681L4666J0207l549R353J3286j9935J9335K0657j1126N299R963J0293
25479D3156J2064l3505l6769L074K7600K95N047j3191j9654j6558Q290m971k0736
25466d5858J1640J0819k4343P937Q798j6320M817J0478o336J0493K6476k372l8567
$$ plain form
25453 -42338 -26547 -12408 -22996 -44277 -63151 -45131 -51713 -38562 -17771 -792 -26078 -39152
25441 -39152 -36468 -38191 -38151 -12195 -11756 -7309 5024 4106 11253 9978 -9720 -4005 40547 28266
25427 28266 23802 23520 20835 12224 -19331 -32020 -49055 -88648 -89051 -71072 -48656 -18751 -28927
25414 -28927 -24333 1530 -3486 -6757 -4442 15198 215 -13587 -30566 -18740 -6554 -30833
25402 -30833 -38845 -61567 -51434 -22636 8166 12778 2857 18300 34580 15512 29925 45414
25390 45414 13752 196 6609 4373 8434 41916 60761 56486 51479 24525 27391 35914 29275
25377 29275 1799 2114 -17386 -36896 -31150 -48234 -45551 -26877 -25707 -8505 12765 23078 17937
25364 17937 13229 9667 9253 -2642 -13669 -14038 -44910 -28170 -9364 7453 13882 -41325 -54641
$$ packed form
25453d2338J5791J4139j0588k1281j8874J8020o582J3151K0791J6979k5286j3074
25441c9152K684j723M0K5956M39M447J2333r18P147j275j9698N715M4552j2281
25427B8266m464k82k685q611l1555j2689j7035l9593m03J7979K2416K9905j0176
25414b8927M594K5863n016l271K315J9640j4983j3802j6979J1826J2186k4279
25402c0833q012k2722J0133K8798L0802M612r921J5443J6280j9068J4413J5489
25390D5414l1662j3556O413k236M061L3482J8845m275n007k6954K866Q523o639
25377B9275k7476L15j9500j9510N746j7084K683J8674J170J7202K1270J0313n141
25364A7937m708l562m14j1895j1027l69l0872J6740J8806J6817O429n5207j3316
$$ plain form
25351 -54641 -34959 -38210 -63306 -47666 -33815 -67463 -105601 -88778 -42780 -15079 -7177 -29996
25339 -29996 -27752 -27781 -9166 -8490 -20905 -19048 -11889 -7733 35307 37989 50100 38999 37537 34400
25325 34400 31738 14339 25600 55529 62445 5486 -1362 19041 -1293 -4498 -1368 -4503 13343
25312 13343 3119 -37200 -31556 -16026 9628 8250 11459 43636 47108 35171 28297 30072 29530
25299 29530 17036 4658 -11644 -7281 14515 8192 16939 -6045 -16830 -11801 -39417 -51679
25287 -51679 -12396 12322 13180 19920 12774 -10755 187 -31054 -52178 -23503 -2304 -803 15791
25274 15791 7129 3298 9156 18668 -1140 -27972 -24190 -7515 -22473 -43289 -71267 -77726 -48511
25261 -48511 -34913 -64303 -69783 -74124 -70740 -38164 17087 18535 -7032 -19152 -3991 5162 40667
$$ packed form
25351e4641J9682l251k5096J5640J3851l3648l8138J6823M5998K7701P902k2819
25339b9996K244k9J8615O76j2415J857P159M156M3040K682J2111j1101j462l137
25325C4400k662j7399J1261K9929O916n6959o848K0403k0334l205L130l135J7846
25312A3343j0224m0319N644J5530K5654j378L209L2177L472j1937o874J775n42
25299B9530j2494j2378j6302M363K1796o323Q747k2984j0785N029k7616j2262
25287e1679L9283K4718Q58O740p146k3529J0942l1241k1124K8675K1199J501J6594
25274A5791q662l831N858R512j9808k6832L782J6675j4958k0816k7978o459K9215
25261d8511J3598k9390n480m341L384L2576N5251J448k5567j2120J5161R153L5505
$$ plain form
25248 40667 2404 -29697 -50974 -37212 -9737 -25699 -24648 -23031 -45719 -32479 -16125 -25672
25236 -25672 -16559 -20660 -29506 -3406 -937 -15054 -13621 -29480 -36649 -47683 -20601 -12171 -17531
25223 -17531 -18820 -12851 -41854 -33712 -33701 -43346 -73176 -59097 -40031 -19458 -29830 -37264 -11848
25210 -11848 -13819 -20200 -19702 -5854 11665 9775 3387 16267 1745 -9070 -14245 -25692 -40319
25197 -40319 -32834 15490 24641 10297 -31629 -65650 -74166 -27819 -20273 -30599 -15380 5630
25185 5630 -832 -23918 -60372 -56603 -40624 -35230 -17580 -8759 -5590 -627 13486 8964 6100
25172 6100 -5543 -25070 -10742 -17005 -9030 -6720 -29099 -56379 -37122 -32349 -25350 -8935 -25736
25159 -25736 -28511 -23831 28768 54535 38769 13416 -21401 -22073 -2731 25668 41371 33824 52235
$$ packed form
25248D0667l8263l2101k1277J3762K7475j5962J051J617k2688J3240J6354r547
25236b5672R113m101q846K6100K469j4117J433j5859p169j1034K7082Q430n360
25223a7531j289N969k9003Q142J1r645k9830J4079J9066K0573j0372p434K5416
25210a1848j971o381M98J3848J7519j890o388J2880j4522j0815n175j1447j4627
25197d0319P485M8324R151j4344m1926l4021q516M6347P546j0326J5219K1010
25185E630o462k3086l6454L769J5979N394J7650Q821L169M963J4113m522k864
25172F100j1643j9527J4328o263P975K310k2379k7280J9257M773O999J6415j6801
25159b5736k775M680N2599K5767j5766k5353l4817o72J9342K8399J5703p547J8411
$$ plain form
25146 52235 71940 61227 22725 -10031 1017 -13548 -44500 -65097 -64324 -34592 843 -9866
25134 -9866 -25564 -48678 -43529 -31307 -18457 -36547 -39828 -18659 -22320 1767 4745 -5968 -18035
25121 -18035 -7655 -20698 -1979 10720 -7023 20167 23166 18148 -7660 -14554 -35414 -24308
25109 -24308 1540 7225 -13470 -43213 -27554 10241 8260 -7224 -10284 -16187 14634 -6350
25097 -6350 -40650 -40986 -47106 -23915 12149 18847 55431 39486 17608 5662 -18192 -41213 -44625
25084 -44625 -21653 -17768 25373 32996 16421 19475 -9663 -9790 -159 17286 9032 9209 -11135
25071 -11135 -32882 -25364 -15415 -19262 -30927 -37777 -28607 9330 6033 26568 -3298 -15960 -22141
25058 -22141 -28257 -25997 -27673 1631 16200 4471 -33430 -41598 -24760 -34360 -39267 -39230 -35563 11027
$$ packed form
25146E2235J9705j0713l8502l2756J1048j4565l0952k0597P73K9732L5435j0709
25134i866j5698k3114N149J2222J2850j8090l281K1169l661K4087K978j0713j2067
25121a8035J0380j3043J8719J2699j7743K7190K999n018k5808o894k0860J1106
25109b4308K5848N685k0695k9743J5659L7795j981j5484l060n903L0821k0984
25097f350l4300l36o120K3191L6064O698L6584j5945k1878j1946k3854k3021l412
25084d4625K2972L885M3141P623j6575L054k9138j27R631J7445q254J77k0344
25071a1135k1747P518R949l847j1665o850R170L7937l297K0535k9866j2662o181
25058b2141o116K260j676K9304J4569j1729l7901q168J6838r600m907L7L667M6590
$$ plain form
25044 11027 22655 1948 -10596 -1053 -21409 -33764 -40279 -25408 10189 8104 -5152 -11570
25032 -11570 -18071 -14972 907 -4935 -19089 -28164 -67211 -53200 -24532 -1504 6726 -3231 -16362
25019 -16362 -11110 -43503 -62393 -37586 -14294 -21102 -39030 -47510 -41309 -39126 -47209 -24232 -9640
25006 -9640 -40663 -26822 -12829 -25298 -30585 -15358 -23779 -54539 -57231 -51533 -60774 -64226 -47757
24993 -47757 -42855 -35208 -21607 -5027 5178 -20180 -56677 -36331 -18538 -32646 -63066 -74393
24981 -74393 -33800 -22240 -25377 -46440 -47517 2138 14226 7610 -7820 -5122 -8348 -8188 -5839
24968 -5839 -8279 -4330 647 -11122 -14415 -2612 -12096 -36194 -58526 -41542 -50157 -15229 8626
24955 8626 7037 -3683 -17386 -49008 -35151 -4914 -16915 -10405 -55865 -79919 -63374 -24082
$$ packed form
25044A1027J1628k0707j2544R543k0356j2355o515J4871L5597k085j3256o418
25032a1570o501L099J5879n842j4154r075l9047J4011K8668K3028Q230r957j3131
25019a6362N252l2393j8890K4807K3292o808j7928q480O201K183q083K2977J4592
25006i640l1023J3841J3993j2469n287J5227q421l0760k692N698r241l452J6469
24993d7757M902P647J3601J6580J0205k5358l6497K0346J7793j4108l0420j1327
24981g4393M0593J1560l137k1063j077M9655J2088o616j5430K698l226J60K349
24968e839k440L949M977j1769l293J1803r484k4098k2332J6984q615L4928K3855
24955H626j589j0720j3703l1622J3857L0237j2001O510m5460k4054J6545L9292
$$ plain form
24943 -24082 4838 5661 11284 13479 16128 747 -6663 -32043 -9561 -6920 6589 -1255 -18545
24930 -18545 -20912 -47523 -75302 -71680 -46983 -4865 14869 -8168 -23574 -20991 -30474 -58694
24918 -58694 -48898 -12589 11617 -5490 -28830 -10137 -17305 -33582 -23869 -29975 -39212 -11590 -193
24905 -193 -8628 -19039 -5519 13421 -6770 -13507 -8746 13251 17792 -5214 -1437 2910 7637
24892 7637 26881 41973 15156 -33164 -39172 -28566 -19265 -34505 -54343 -38478 -28195 -33081
24880 -33081 -15788 -10622 -7259 -32844 -53356 -60251 -64224 -46806 -34696 -23442 -27864 -49926 -53175
24867 -53175 -32715 -23674 -8634 -23301 -33076 -31027 -29074 -40210 -70308 -60143 -48777 -56326 -27898
24854 -27898 -19571 -14117 -34917 -45246 -45364 -49071 -44228 -22630 4762 -1537 -13039 -17976 -31523
$$ packed form
24943b4082K8920Q23N623K195K649j5381p410k5380K2482K641J3509p844j7290
24930a8545k367k6611k7779L622K4697M2118J9734k3037j5406K583r483k8220
24918e8694R796L6309K4206j7107k3340J8693p168j6277R713o106r237K7622J1397
24905a93q435j0411J3520J8940k0191o737M761K1997M541k3006L777M347M727
24892G637J9244J5092k6817m8320o008J0606R301j5240j9838J5865J0283m886
24880c3081J7293N166L363k5585k0512o895l973J7418J2110J1254m422k2062l249
24867e3175K0460R041J5040j4667r775K049J953j1136l0098J0165J1366p549K8428
24854b7898Q327N454k0800j0329j18l707M843K1598K7392o299j1502m937j3547
$$ plain form
24841 -31523 -22874 -11648 7926 -2749 -31056 -32093 -2399 907 -38799 -54193 -37831 -11355
24829 -11355 -18824 -36428 -59736 -67235 -56712 -27409 -26758 -7767 -15611 -22775 -38837 -31162 -20469
24816 -20469 60 -12118 -32705 -41451 -21335 -27666 -22408 -5476 -2761 216 -19151 -29119 -31168
24803 -31168 8145 29415 16796 -26268 -38480 -13783 -9911 -18635 10054 16864 29408 4782
24791 4782 -3882 -9398 -40000 -41868 -30913 10034 27272 45359 37767 11595 32889 28066 7786
24778 7786 -29640 -43120 -11091 -1566 -25422 13186 26066 20754 -9316 -10989 4714 9913 18936
24765 18936 31210 35543 34822 19931 -12532 -5737 -17615 -22430 -18513 -9214 -2130 22446 23749
24752 23749 -563 -19814 -15662 5692 1243 -3100 -18903 -38178 -34658 -31373 -53903 -64046 -51718
$$ packed form
24841c1523Q649J1226J9574j0675k8307j037K9694L306l9706j5394J6362K6476
24829a1355p469j7604k3308p499J0523K9303O51J8991p844p164j6062P675J0693
24816b0469K0529j2178k0587q746K0116o331N258J6932K715K977j9367r968k049
24803c1168L9313K1270j2619m3064j2212K4697L872q724K8689O810J2544k4626
24791D782q664n516l0602j868J0955M0947J7238J8087p592k6172K1294m823k0280
24778G786l7426j3480L2029R525k3856L8608J2880n312l0070j673J5703N199R023
24765A8936J2274M333p21j4891l2463O795j1878m815L917R299P084K4576J303
24752B3749k4312j9251M152K1354m449m343j5803j9275L520L285k2530j0143J2328
$$ plain form
24739 -51718 -24668 -4510 16264 12337 9707 -6057 13055 23310 23644 24540 9541 -1436 -16451
24726 -16451 -16568 -12268 -9368 -14654 -11223 -27955 -37267 -72671 -60531 -46244 -61893 -58651 -57779 -24799
24712 -24799 -4832 -35869 -43500 -13395 -16499 -12466 -3628 -14898 -35736 -27686 -12117 13776 19485
24699 19485 25286 557 6090 -9757 -37251 -23875 -12342 -24566 -34225 -57655 -41552 -8622
24687 -8622 -8070 -14133 -17945 -20714 -27312 -29862 -28495 -24943 7263 47789 27823 8930 -14507 -68602
24673 -68602 -73470 -16673 16187 -13777 -16242 -21612 -32084 -24059 -18043 -29533 -24750 11726 27585
24660 27585 32824 26482 24712 -14767 -60920 -49976 -35234 -10873 -38955 -41693 -29846 -687
24648 -687 -1686 -33232 -36697 -25878 -35125 -736 30554 16159 13812 4578 -18654 -48858 -28023
$$ packed form
24739e1718K7050K0158K0774l927k630j5764J9112J0255L34Q96j4999j0977j5015
24726a6451j17M300K900n286L431j6732r312l5404J2140J4287j5649L242Q72L2980
24712b4799J9967l1037p631L0105l104M033Q838j1270k0838Q050J5569K5893N709
24699A9485N801k4729N533j5847k7494J3376J1533j2224r659k3430J6103L2930
24687h622N52o063l812k769o598k550J367L552L2206M0526j9966j8893k3437n4095
24673f8602m868N6797L2860k9964k465n370j0472Q025O016j1490M783L6476J5859
24660B7585N239o342j770l9479m6153J0944J4742K4361k8082k738J1847K9159
24648f87r99l1546l465J0819r247L4389L1290j4395k347r234k3232l0204K0835
$$ plain form
24635 -28023 -23262 -16110 -6237 -8575 -27680 -40137 -46615 -50625 -47753 -28757 -14441 -2728 -14732
24622 -14732 -33286 -26869 -15779 -2766 32153 36285 7578 -17364 -23757 -16827 -29137 -30260 -27814
24609 -27814 -23025 -31888 -4696 27993 44770 19012 -32274 -40452 -34824 -29596 -29524 -33257 -37796 -49539
24595 -49539 -71072 -83242 -79104 -54694 -75629 -80924 -60193 -41716 -6032 2320 -4810 -14464 -33992
24582 -33992 -27211 -39374 -60729 -33278 -39469 -15595 -5335 -13301 -17795 6320 14143 20909 792
24569 792 -8790 14544 22100 30160 18337 5576 -6409 -18094 -7194 -35495 -41144 -30942 -25245
24556 -25245 -31995 -44105 -23193 27500 42578 1615 -50055 -62105 -61542 -30913 -4915 1319
24544 1319 2215 11010 30765 23103 -9544 -18901 -2370 8409 35719 15019 -6202 9927 18033
$$ packed form
24635b8023M761P152R873k338j9105j2457o478m010K872J8996J4316J1713j2004
24622a4732j8554O417J1090J3013L4919M132k8707k4942o393O930j2310j123K446
24609b7814M789q863K7192L2689J6777k5758n1286q178N628N228P2l733m539j1743
24595d9539k1533j2170M138K4410k0935n295K0731J8477L5684Q352p130r654j9528
24582c3992O781j2163k1355K7451o191K3874J0260p966m494K4115P823O766k0117
24569G92r582K3334P556Q060j1823j2761j1985j1685J0900k8301n649J0202N697
24556b5245o750j2110K0912N0693J5078m0963n1670j2050N63L0629K5998O234
24544A319Q96Q795J9755p662l2647r357J6531J0779K7310k0700k1221J6129Q106
$$ plain form
24531 18033 -11098 -15946 -22275 -32881 -47678 -32043 -32981 -24859 -25275 -27050 -26966 -22430 -5261 -25018
24517 -25018 -48501 -24994 -42795 -11166 1452 -3544 -11384 7115 -16002 -32369 -28591 -39606
24505 -39606 -27110 -46335 -62969 -49624 -48093 -46354 -4741 -14532 -32982 -27322 -10747 -9571 -15884
24492 -15884 -23992 -16704 -25205 -43609 -62264 -64563 -56798 -47139 -19628 -35302 -64789 -67480 -49400
24479 -49400 439 1948 -22902 -30910 -7157 6838 -6497 -33910 -34486 -38688 -35565 -3854 8240
24466 8240 5470 6814 954 -7118 1682 -2105 7927 29106 8538 2926 -76 -30591 -52026
24453 -52026 -70268 -67580 -43846 -37288 -26534 -15538 -41224 -86812 -71021 -51866 -42755 -45047
24441 -45047 -41982 -55983 -53541 -43158 -30131 -34064 -66767 -62407 -54671 -57885 -40273 -27242 -1787
$$ packed form
24531A8033k9131m848o329j0606j4797J5635r38Q122m16j775Q4M536J7169j9757
24517b5018k3483K3507j7801L1629J2618m996p840J8499k3117j6367L778j1015
24505c9606J2496j9225j6634J3345J531J739M1613r791j8450N660J6575J176o313
24492a5884q108P288q501j8404j8655k299P765R659K7511j5674k9487k691J8080
24479d9400M9839J509k4850q008K3753J3995j3335k7413n76m202L123L1711J2094
24466H240k770J344n860q072Q800l787J0032K1179k0568n612l002l0515k1435
24453e2026j8242K688K3734O558J0754J0996k5686m5588J5791J9155R111k292
24441d5047L065j4001K442J0383J3027l933l2703M360P736l214J7612J3031K5455
$$ plain form
24428 -1787 43746 52454 26805 14118 -5104 -10668 -27007 -21679 -12117 -12590 -19931 -14662 -53380
24415 -53380 -61268 -47123 -36007 -39657 -40762 -39609 -32261 -37986 -31186 -26270 -50731 -67746 -54162
24402 -54162 -28350 -21824 -69744 -106579 -89283 -29320 -11315 -6188 -3056 10182 9462 -19197 -28481
24389 -28481 -37295 -21019 -7197 13199 11289 4076 -26350 -39646 -18787 13808 -3534 -41070
24377 -41070 -50058 -29953 -29149 -39832 -63503 -60850 -53447 -46315 -49074 -65924 -70843 -34870 -3395
24364 -3395 25999 -2208 -548 9694 1314 -8664 -9066 -19903 -29008 -42548 -68998 -97341 -120729
24351 -120729 -81484 -39759 -23268 -29725 -25815 -2978 19595 13928 -28916 -46541 -46390 -59880
24339 -59880 -66079 -52068 -35232 -17289 -7175 -18413 -28358 -29994 -29071 -42338 -58060 -40791 -38705
$$ packed form
24428a787M5533Q708k5649j2687j9222n564j6339N328R562m73p341N269l8718
24415e3380p888J4145J1116l650j105J153P348n725O800M916k4461j7015J3584
24402e4162K5812O526m7920l6835J7296N9963J8005N127L132J3238p20k8659r284
24389b8481q814J6276J3822K0396j910p213l0426j3296K0859L2595j7342l7536
24377d1070q988K0105Q04j0683k3671K653P403P132k759j6850m919L5973L1475
24364c395K9394k8207J660J0242q380r978m02j0837r105j3540k6450k8343k3388
24351a20729L9245M1725J6491o457L910K2837K2573n667m2844j7625J51j3490
24339e9880o199J4011J6836J7943J0114j1238r945j636R23j3267j5722J7269K086
$$ plain form
24326 -38705 -44061 -30106 -15703 -27326 -42709 -55872 -33836 6143 -13321 -26735 -21255 -34934
24314 -34934 -61868 -70732 -89378 -84766 -43595 -22853 1696 11980 -26090 -15106 -2093 7255
24302 7255 -18699 -50681 -40470 -40184 -19296 -21137 -28511 -11793 -9869 -28718 -22978 -10750 -23189
24289 -23189 -40491 -29364 4343 17114 -32082 -43761 -31128 -21610 -35173 -50579 -47468 -34494
24277 -34494 -27262 -35916 -18408 -7111 -21593 -3999 1707 -28765 -43932 -56417 -88019 -65412
24265 -65412 -46597 -62734 -52078 724 18485 7040 7566 24983 18059 -13511 -21032 12932
24253 12932 31322 17047 8355 -32108 -59302 -68450 -27910 -10824 -25141 -33922 -50861 -61593
24241 -61593 -62093 -57156 -38561 -32664 -42560 -35060 -26155 -30666 -14043 -47700 -49024 -29421 -38184 -18007
$$ packed form
24326c8705n356J3955J4403j1623j5383j3163K2036L9979j9464j3414N480j3679
24314c4934k6934q864j8646M612M1171K0742K4549J0284l8070J0984J3013R348
24302G255k5954l1982J0211K86K0888j841p374J6718J924j8849N740J2228j2439
24289b3189j7302J1127L3707J2771m9196j1679J2633R518j3563j5406L111J2974
24277c4494P232q654J7508J1297j4482J7594N706l0472j5167j2485l1602K2607
24265f5412J8815j6137J0656N2802J7761j1445N26J7417o924l1570p521L3964
24253A2932J8390j4275q692m0463k7194r148M0540J7086j4317q781j6939j0732
24241f1593n00M937J8595N897r896P500Q905m511J6623l3657j324J9603q763K0177
$$ plain form
24227 -18007 2395 -265 19292 -4455 -8370 -8244 -2464 1717 11536 -4762 -29271 -42266 -14924
24214 -14924 -25624 -19566 11168 13520 -4174 -9149 -16638 -56949 -77314 -59228 -37783 -18136
24202 -18136 8387 -6721 -10516 -25063 -21658 -30137 -13075 1497 5094 -7832 13935 -5858
24190 -5858 -42889 -35031 -36598 -40930 -28489 -6337 6377 20257 35501 30019 -21291 -54711 -45111
24177 -45111 -19242 -6915 11106 9080 15576 23222 -2220 -41804 -56489 -75062 -87579 -55697
24165 -55697 -18870 -9071 -29576 -34064 -230 31556 29446 -1452 -11493 -25390 -40885 -65606
24153 -65606 -74890 -60723 -26052 -27959 -68907 -62536 -32490 -13636 -12346 -1031 -13707 -11321 -24384
24140 -24384 -34366 -28607 -11157 -3951 8740 18769 17922 -8370 -42332 -44990 -52793 -41174 -32625
$$ packed form
24227a8007K0402k660J9557k3747l915J26N780M181R819j6298k4509j2995K7342
24214a4924j0700O058L0734K352j7694m975p489m0311k0365J8086K1445J9647
24202a8136K6523j5108l795j4547L405q479J7062J4572L597j2926K1767j9793
24190e858l7031P858j567m332J2441K2152J2714J3880J5244n482n1310l3420R600
24177d5111K5869J2327J8021k026O496P646k5442l9584j4685j8573j2517L1882
24165e5697L6827R799k0505m488L3834L1786k110l0898j0041j3897j5495k4721
24153f5606r284J4167L4671j907m0948O371L0046J8854J290J1315j2676K386j3063
24140b4384r982N759J7450P206J2691J0029q47k6292l3962k658p803J1619Q549
$$ plain form
24127 -32625 -17230 -34834 -46567 -28576 -10662 -23719 -48815 -36432 -26000 -34553 -67077 -66351
24115 -66351 -31056 -39413 -14024 -17245 -1369 3954 -1009 -15951 -36807 -40044 -42462 -26554 -37738
24102 -37738 2081 18916 39833 24495 -237 -14931 -36170 -13239 -5753 -18333 -6667 -15652
24090 -15652 -15153 19570 7398 -9802 -40579 -50453 -71946 -84174 -48640 -16985 -12408 -19823 -15685
24077 -15685 -6297 18241 28341 -2165 -29017 -80224 -50874 -22473 -6675 -2621 -7225 20249
24065 20249 -12248 -42331 -24920 -2821 -29079 -45330 -51172 -31722 -10540 -10762 -39506 -53298
24053 -53298 -28377 -57736 -39078 -24839 -41604 -41345 -25997 -26184 -34872 -47043 -49943 -48197 -38986
24040 -38986 -21877 -42168 -54389 -62203 -41498 -39729 -62344 -58147 -59418 -30713 -28828 -67184 -90004
$$ packed form
24127c2625J5395j7604j1733J7991J7914j3057k5096J2383J0432q553l2524P26
24115f6351L5295q357K5389l221J5876N323m963j4942k0856l237k418J5908j1184
24102c7738L9819J6835K0917j5338k4732j4694k1239K2931P486j2580J1666q985
24090a5652M99L4723j2172j7200l0777r874k1493j2228L5534L1655M577p415M138
24077a5685R388K4538J0100l0506k6852n1207K9350K8401J5798M054m604K7474
24065B0249l2497l0083J7411K2099k6258j6251n842J9450K1182k22k8744j3792
24053e3298K4921k9359J8658J4239j6765K59J5348j87q688j2171k900J746R211
24040c8986J7109k0291j2221p814K0705J769k2615M197j271K8705J885l8356k2820
$$ plain form
24027 -90004 -87589 -67893 -61438 -27307 505 -185 -21719 -39196 -37835 -33921 -41142 -51516 -37909
24014 -37909 -25614 -6103 -9121 697 -33940 -36315 -22655 -11564 1509 -1029 -1402 6461 -10887
24001 -10887 -26277 -12394 20122 33459 24037 1071 -32896 -57911 -35309 -12175 -8116 -2934
23989 -2934 -25478 -30178 -19765 -33675 -50018 -38687 -14251 -6852 -2911 -29114 -43651 -36401 -46049
23976 -46049 -55979 -60757 -60788 -45083 -31259 -27024 -9657 -21198 -28128 -17100 -20535 -9215 -5591
23963 -5591 11979 4837 -29993 -24004 -38574 -32017 -43168 -65476 -52526 -34741 -52021 -55722 -45197
23950 -45197 -46476 -45772 -27040 -40343 -24631 -9996 4377 2087 -5629 -15048 -12816 17203 7383
23937 7383 -19035 -52020 -30672 5432 -2430 1936 -20583 2495 -3366 -16300 -41089 -40521 -52205
$$ packed form
24027i0004K415J9696O455L4131K7812o90k1534j7477J361L914p221j0374J3607
24014c7909J2295J9511l018R818l4637k375J3660J1091J3073k538l73P863j7348
24001a0887j5390J3883L2516J3337r422k2966l3967k5015K2602K3134M059N182
23989b934k2544m700J0413j3910j6343J1331K4436P399L941k6203j4537P250r648
23976d6049r930m778l1J5705J3824M235J7367j1541o930J1028l435J1320L624
23963e591J7570p142l4830N989j4570O557j1151k2308J2950J7785j7280l701J0525
23950d5197j279P04J8732j3303J5712J4635J4373k290p716r419K232L0019r820
23937G383k6418l2985K1348L6104p862M366k2519K3078n861j2934k4789N68j1684
$$ plain form
23924 -52205 -53984 -59361 -79591 -103587 -87647 -83259 -95664 -86407 -57248 -15665 -852 -14570
23912 -14570 -8621 -43539 -46663 -17556 -2344 -16288 -35500 -31474 -29805 -42017 -47597 -40396 -29539
23899 -29539 -20775 -14512 -24398 -22524 -10671 -24061 -43631 -65380 -52673 -22450 -30788 -57199 -63176
23886 -63176 -40165 -24328 -35936 -46910 -54418 -38677 -22645 -15532 -12565 -25140 -39783 -59866
23874 -59866 -58537 -48256 -62859 -86173 -100568 -81377 -51663 -53087 -32003 5559 -5216 -23919
23862 -23919 -19666 -2714 -11734 -11953 -31485 -26051 -34111 -42808 -35737 -45420 -47909 -54551 -78916 -74677
23848 -74677 -56295 -17273 -27454 -36959 -31464 -22195 -38091 -48017 -17821 -15688 -35613 -46170 -34967
23835 -34967 -30847 -53708 -46673 -12398 -3674 -13434 -858 -2255 -10283 -21286 -35463 -5659 12579
$$ packed form
23924e2205j779n377k0230k3996J5940M388j2405R257K9159M1583J4813j3718
23912a4570N949l4918l124K9107J5212j3944j9212M026J669j2212n580P201J0857
23899b9539Q764O263r886J874J1853j3390j9570k1749J2707L0223q338k6411n977
23886f3176K3011J5837j1608j0974p508J5741J6032P113K967j2575j4643k0083
23874e9866J329J0281j4603k3314j4395J9191K9714j424K1084L7562j0775j8703
23862b3919M253J6952r020k19j9532N434q060q697P071r683k489o642k4365M239
23848g4677J8382L9022j0181r505N495R269j5896r926L0196K133j9925j0557J1203
23835c4967M120k2861P035L4275Q724r760J2576j397q028j1003j4177K9804J8238
$$ plain form
23822 12579 11266 -27222 -70480 -66675 -53104 -27193 -10166 -12104 -15039 -8976 6340 -9861 -41974
23809 -41974 -18374 -26892 -18438 1228 -26073 -6488 8931 -3475 -2406 -15209 -21881 -35393
23797 -35393 -20570 11396 41843 43200 28368 13766 -6702 -25510 -8258 913 -13233 -33066
23785 -33066 -39055 -51552 -63847 -32836 -24034 -44528 -32526 -28038 -29146 -28832 -26047 -10079 -11370
23772 -11370 -40692 -23304 -23558 -28881 -32513 -57394 -59679 -25504 8852 1973 -17685 -10176 2170
23759 2170 485 -922 5435 11962 -10211 -24570 -36257 -52226 -75407 -76650 -43699 -39915 -46428
23746 -46428 -53520 -33381 -28528 -33964 -40098 -47562 -21931 -3097 -12870 -7245 -30194 -30499 -44482
23733 -44482 -65337 -51973 -46183 -25972 -19846 -2514 25977 5565 -13065 -22100 -14283 -10677 -55722
$$ packed form
23822A2579j313l8488m3258L805J3571K5911J7027j938k935O063J5316j6201l2113
23809d1974K3600q518Q454J9666k7301J9585J5419j2406J069j2803o672j3512
23797c5393J4823L1966L0447J357j4832j4602k0468j8808J7252R171j4146j9833
23785c3066n989j2497j2295L1011Q802k0494J2002M488j108L14K785J5968j291
23772a1370k9322J7388k54n323l632k4881k285L4175L4356o879j9658P509J2346
23759B170j685j407O357O527k2173j4359j1687j5969k3181j243L2951L784o513
23746d6428p092K0139M853n436o134p464K5631J8834r773N625k2949l05j3983
23733d4482k0855J3364N790K0211O126J7332K8491k0412j8630r035P817L606m5045
$$ plain form
23720 -55722 -79375 -91838 -76590 -56781 -45416 -67585 -99405 -85288 -54236 -57067 -52037 -49348
23708 -49348 -29529 -34566 -35256 -40902 -15029 -11545 -23112 -35859 -22961 -22847 -37897 -31819 -63071
23695 -63071 -66436 -55763 -37381 -25357 -865 9861 15357 -13132 -28024 -20958 -3158 -4190
23683 -4190 -26336 -42592 -53236 -38150 -28011 -34974 -15592 -5682 24467 21992 24309 -2964 -16175
23670 -16175 -33648 -26623 -39895 -50169 -53679 -46451 -32515 -34528 -47239 -58754 -50088 -35231 -31787
23657 -31787 -33066 -6294 5413 -1227 -15059 -25649 -33527 -34469 -30097 -4620 21224 4576 -6963
23644 -6963 -17859 2839 21093 -1044 -17349 -40185 -50111 -66152 -74813 -56552 -62461 -74159
23632 -74159 -39835 -17082 -18133 -44005 -54047 -59960 -63316 -52001 -39425 -38804 -59512 -83958 -68271
$$ packed form
23720e5722k3653j2463J5248J9809J1365k2169l1820J4117L1052k831N030K689
23708d9348J9819n037o90n646K5873L484j1567j2747J2898J14j5050O078l1252
23695f3071l365J0673J8382J2024K4492J0726N496k8489j4892P066J7800j032
23683d190k2146j6256j0644J5086J0139o963J9382R910L0149k475K317k7273j3211
23670a6175j7473P025j3272j0274l510P228J3936k013j2711j1515Q666J4857L444
23657c1787j279K6772J1707o640j3832j0590p878r42M372K5477K5844j6648j1539
23644f963j0896K0698J8254k2137j6305k2836r926j6041q661J8261n909j1698
23632g4159L4324K2753j051k5872j0042n913l356J1315J2576O21k0708k4446J5687
$$ plain form
23619 -68271 -66914 -67883 -26760 -2845 -10453 -9979 -21969 -20319 -31538 -37075 -7277 -8458 -34658
23606 -34658 -33990 -6181 -8027 -20611 -57471 -62326 -46451 -8214 -6884 -1727 -30506 -69084 -76362
23593 -76362 -56751 -37100 -26566 -41189 -61380 -35173 -31544 -21874 -20236 -56394 -74166 -61273
23581 -61273 -39064 -56015 -59106 -60817 -79588 -78194 -75339 -66969 -60018 -41085 -37949 -40670 -41753
23568 -41753 -33781 -29765 -54015 -78080 -99275 -93862 -63736 -64478 -35216 -47618 -50895 -27453 -20521
23555 -20521 -45026 -46612 -26399 -10699 -19417 -1469 3143 -2019 -17897 -2668 29941 19292
23543 19292 12351 -22732 -12777 -14808 10084 9425 -22809 -33836 -29538 -38081 -46570 -43079 -25953
23530 -25953 -16802 -24183 -17340 1761 274 -31614 -52137 -55602 -38396 -2131 -6921 -14977 -19752
$$ packed form
23619f8271J357r69M1123K3915p608M74j1990J650j1219n537K9798j181k6200
23606c4658O68K7809j846j2584l6860m855J5875L8237J330N157k8779l8578p278
23593g6362J9611J9651J0534j4623k0191K6207L629R670J638l6158j7772J2893
23581f1273K2209j6951l091j711j8771J394K855Q370O951J8933L136k721j083
23568d1753P972M016k4250k4065k1195N413L0126p42K9262j2402l277K3442O932
23555b0521k4505j586K0213J5700q718J7948M612n162j5878J5229L2609j0649
23543A9292o941l5083R955k031K4892o59l2234j1027M298q543q489L491J7126
23530b5953R151p381O843J9101j487l1888k0523l465J7206L6265m790q056m775
$$ plain form
23517 -19752 -30908 -14720 -23397 -44662 -59666 -51325 -29441 -29535 -22240 -12115 -1259 -1733 -35211
23504 -35211 -4579 -1536 3494 -27423 -51270 -32556 -25319 -24209 -39359 -36754 -40639 -51672 -30028
23491 -30028 -36132 -63336 -76880 -68004 -52033 -25779 -13776 -18105 -25641 -28036 -35550 -11719 -18813
23478 -18813 -35119 -3038 26414 28103 16857 -6564 -41647 -70218 -44949 -21430 -735 7684
23466 7684 -19339 -37250 -32458 -29745 -21855 -16206 -43658 -60061 -66906 -66214 -74051 -77228 -54786 -36533
23452 -36533 -11003 532 -19148 -37227 -56075 -87715 -83912 -61235 -58060 -61603 -72646 -83344
23440 -83344 -82564 -78584 -60892 -28270 -6853 -14104 -40532 -46287 -58497 -45692 -59182 -56807 -45092
23427 -45092 -80943 -74053 -54427 -55306 -72328 -88518 -79338 -76417 -63205 -43253 -27082 -60748 -39288
$$ packed form
23517a9752j1156J6188q677k1265j5004Q341K1884r4P295J0125J0856m74l3478
23504c5211L0632L043N030l0917k3847J8714P237J110j5150K605l885j1033K1644
23491c0028o104k7204j3544Q876J5971K6254J2003m329p536k395p514K3831p094
23478a8813j6306L2081K9452J689j1246k3421l5083k8571K5269K3519K0695Q419
23466G684k7023j7911M792K713P890N649k7452j6403o845O92p837l177K2442J8253
23452c6533K5530J1535j9680j8079j8848l1640L803K2677L175l543j1043j0698
23440h3344P80L980J7692L2622K1417p251k6428n755j2210J2805j3490K375J1715
23427d5092l5851O890J9626q79j7022j6190R180K921J3212J9952J6171l3666K1460
$$ plain form
23414 -39288 -1838 -12237 -29198 -27360 -20323 -38772 734 24919 1758 -9810 -15791 -37867
23402 -37867 -50083 -74648 -71606 -56350 -71009 -32018 -35032 -19224 -12933 -14626 -9545 -26825 -43804
23389 -43804 -13849 -15745 -40302 -60944 -55041 -55020 -39894 -38761 -45953 -10395 -3120 -11093 -4683 4382
23375 4382 -18238 -47056 -52691 -71056 -66732 -50525 -33394 -13273 -422 -8854 -1529 3240 -2191
23362 -2191 -21332 -46075 -56014 -37971 -31017 -17711 -2402 -16513 -22764 -34075 -26849 -20972 -6906
23349 -6906 -20347 -28947 -34484 -34068 -39512 -45721 -36950 2687 20612 23822 -3795 -14435 -33557
23336 -33557 -17063 2610 -5512 -25363 -15473 -8852 -10685 -2617 -8349 -22392 -9312 -16327 -22025
23323 -22025 -20764 -792 1472 -13425 -8053 -13689 -38982 -38720 -25693 -27963 -22004 12549 21920
$$ packed form
23414c9288L7450j0399j6961J838P037j8449L9506K4185k3161j1568n981k2076
23402c7867j2216k4565L042J5256j4659L8991l014J5808O291j693N081j7280j6979
23389d3804K9955j896k4557k0642N903K1J5126J133p192L5558P275p973O410R065
23375D382k2620k8818n635j8365M324J6207J7131K0121J2851q432P325M769n431
23362b191j9141k4743r939J8043O954J3306J5309j4111o251j1311P226N877J4066
23349f906j3441q600n537M16n444o209Q771L9637J7925L210k7617j0640j9122
23336c3557J6494J9673q122j9851R890O621j833Q068n732j4043J3080p015n698
23323b2025J261J9972K264j4897N372n636k5293K62J3027k270N959L4553R371
$$ plain form
23310 21920 36105 4208 -20658 -19100 -23526 -53192 -21928 916 -6186 -1611 28565 16084
23298 16084 -6655 -21097 -8271 -21177 -8556 4368 -20901 -15520 -1614 -42245 -69396 -91469
23286 -91469 -88677 -73435 -70801 -74754 -83903 -77742 -60890 -59495 -47664 -58476 -47366 -29509 -21937
23273 -21937 -30528 -34701 -61142 -59044 -9983 11240 -5057 12992 28878 45831 25826 -19171
23261 -19171 -27969 -29096 -25213 -44142 -52749 -46208 -18907 -1494 -18971 -38677 -52832 -46839 -51093
23248 -51093 -62230 -66071 -63711 -70027 -83954 -60223 -71578 -63630 -23029 -41611 -66725 -57035 -35185
23235 -35185 -8245 -2250 -14587 -23785 2700 3891 -7539 -39347 -74127 -57149 -43002 -60453
23223 -60453 -63762 -48768 -21005 -36024 -51457 -46462 -53046 -31702 -37333 -42006 -8538 -11062 -33845
$$ packed form
23310B1920J4185l1897k4866J558m426k9666L1264K2844p102M575L0176j2481
23298A6084k2739j4442J2826j2906J2621J2924k5269N381J3906m0631k7151k2073
23286i1469K792J5242K634l953r149O161J6852J395J1831j0812J1110J7857P572
23273b1937q591m173k6441K098M9061K1223j6297J8049J5886J6953k0005m4997
23261a9171q798j127L883j8929q607O541K7301J7413j7477j9706j4155N993m254
23248e1093j1137l841K360o316j3927K3731j1355P948M0601j8582k5114R690K1850
23235c5185K6940N995j2337r198K6485J191j1430l1808l4780J6978J4147j7451
23223f0453l309J4994K7763j5019j5433M995o584K1344n631m673L3468k524k2783
$$ plain form
23210 -33845 -48861 -52003 -37343 -41874 -35114 -51307 -68600 -45475 -30750 -23524 -22541 -750 -3633
23197 -3633 -14262 -8068 -28881 -42833 -38176 -49639 -76666 -91724 -87411 -93679 -96181 -90185 -79383
23184 -79383 -51400 -41809 -26622 -28733 -48178 -59535 -50381 -11519 5236 -12109 -12745 -19095 -25365
23171 -25365 -31364 -22198 -24545 -24755 -41452 -38106 -15497 -33585 -64730 -86245 -59862 -35208 -32010
23158 -32010 -24832 -47123 -55201 -77309 -84221 -83578 -70937 -62872 -69422 -64871 -57263 -36640 -28753 -6339
23144 -6339 -31024 -40650 -15922 -12359 -17034 -32217 -35260 -18004 -29960 -47611 -52994 -46976 -34581
23131 -34581 -35448 -37913 -23935 -29580 -28060 -3818 14392 26146 41724 10240 12603 -17680 -22849
23118 -22849 -32191 -8064 -18160 -13781 -2324 -27567 -31876 -38805 -30568 -41431 -64099 -83454 -47848
$$ packed form
23210c3845j5016l142J4660m531O760j6193j7293K3125J4725P226R83K1791k883
23197c633j0629O194k0813j3952M657j1463k7027j5058M313o268k502N996J0802
23184g9383K7983R591J5187k111j9445j1357R154L8862J6755j7345o36o350o270
23171b5365n999R166k347k10j6697L346K2609j8088l1145k1515K6383K4654L198
23158c2010P178k2291q078k2108o912O43J2641Q065o550M551P608K0623P887K2414
23144f339k4685r626K4728L563m675j5183l043J7256j1956j7651n383O018J2395
23131c4581q67k465J3978n645J520K4242J8210J1754J5578l1484K363l0283n169
23118b2849r342K4127j0096M379J1457k5243m309o929Q237j0863k2668j9355L5606
$$ plain form
23105 -47848 -58256 -40621 -5161 11259 11651 25284 18313 3712 -10766 -35200 -20464 14038
23093 14038 19716 31611 22172 2573 -10135 -3245 31533 -3167 -28753 -15430 -3601 -16874
23081 -16874 -37315 -39314 -25918 -44147 -51839 -40529 -37052 -39377 -47198 -51543 -43575 -25104 -5267
23068 -5267 -24557 -77170 -77333 -50521 -26265 821 13512 2947 16724 21354 -16848 -41463
23056 -41463 -29162 -22911 -12465 -8646 -17809 -39496 -42499 -52272 -63488 -54691 -39452 -8751 16997
23043 16997 7858 19121 18493 -37837 -55120 -65942 -60811 -26416 -17217 10500 -18744 -62689 -53133
23030 -53133 -38189 -41819 -40983 -23434 -15692 -19146 -18877 -6587 -2620 -40505 -50084 -22930 -33761
23017 -33761 -61054 -57419 -56749 -50823 -66317 -55963 -26563 7746 16768 15430 1165 5769 -4740
$$ packed form
23105d7848j0408J7635L5460J6420L92J3633o971j4601j4478k4434J4736L4502
23093A4038N678J1895r439j9599j2708O890L4778l4700k5586J3323J1829j3273
23081a6874k0441j999J3396j8229p692J1310L477k325p821m345P968J8471J9837
23068e267j9290n2613j63K6812K4256K7086J2691j0565J3777M630l8202k4615
23056d1463J2301O251J0446L819r163k1687l003r773j1216Q797J5239L0701K5748
23043A6997r139J1263o28n6330j7283j0822N131L4395R199K7717k9244m3945R556
23030e3133J4944l630Q36J7549P742l454K69J2290L967l7885r579K7154j0831
23017c3761k7293L635O70N926j5494J0354K9400L4309R022j338j4265M604j0509
$$ plain form
23004 -4740 -4350 -16257 -2262 -18818 -54165 -63030 -41319 -39596 -9971 -42629 -71644 -57233 -63928
22991 -63928 -62185 -58163 -54189 -36223 -26187 -10690 -11886 -31864 -74801 -57880 -32490 -23581 -24358
22978 -24358 -28295 -11937 -22848 -14541 -29248 -29949 -3338 -9013 -1021 -17212 -37087 -49193 -65686
22965 -65686 -29995 -14191 -24437 -25720 -31237 -49165 -48514 -13408 10012 -9601 -29247 -20083 -4842
22952 -4842 -5736 -12046 -9252 -10191 -7051 5323 19491 20354 -2462 6920 4556 8121 10519 -4787
22938 -4787 -12360 -32227 -43041 -46090 -32598 -35629 -30300 -8178 -37870 -58741 -74065 -59112 -40000
22925 -40000 -6023 -4066 -42029 -49538 -56192 -42488 -22807 -19103 -35658 -52308 -56247 -51542 -14889
22912 -14889 -11603 -8827 10214 3405 -12257 -753 23678 12079 -1405 -1393 -16790 -18803 2783
$$ packed form
23004d740L90j1907J3995j6556l5347q865K1711J723K9625l2658k9015J4411o695
22991f3928J743M022L974J7966J0036J5497j196j9978m2937J6921K5390Q909p77
22978b4358l937J6358j0911Q307j4707p01K6611n675P992j6191j9875j2106j6493
22965f5686L5691J5804j0246j283n517j7928O51L5106K3420j9613j9646R164J5241
22952d842q94o310K794r39L140J2374J4168Q63k2816R382k364L565K398j5306
22938d787p573j9867j0814l049J3492l031N329K2122k9692k0871j5324J4953J9112
22925d0000L3977J957l7963p509o654J3704J9681L704j6555j6650l939M705L6653
22912a4889L286K776J9041o809j5662J1504K4431j1599j3484J2j5397k013K1586
$$ plain form
22899 2783 -12439 -16084 -24708 -22164 -27188 -32066 -51036 -36473 -18174 12821 33464 6138 -17644
22886 -17644 -7608 -8345 -35638 -56727 -59587 -32170 -27063 -27429 -52127 -52802 -58240 -45765 -34477
22873 -34477 -37307 -21418 -31957 -80063 -99532 -95140 -58698 -37637 -23800 -28891 -19593 -31000
22861 -31000 -50515 -37288 -19240 -23826 -49422 -76297 -26676 -7756 -6010 -6381 -20523 -30482 -32700
22848 -32700 -28452 -34139 -17816 -10150 -17324 -31000 -28222 -30255 -40106 -46724 -71247 -66909 -58887 -45597
22834 -45597 -55962 -36678 2395 10285 -3899 -8082 -35045 -16955 -20196 -47733 -26968 -721
22822 -721 -2444 -27337 -50667 -54031 -20126 -6843 -14783 -6477 -21141 -6192 -2560 -22756 -23325
22809 -23325 -19834 -20988 -21329 -38660 -54336 -59303 -47331 -60450 -33110 -4703 21001 29362 40653
$$ packed form
22899B783j5222l645q624K544n024m878j8970J4563J8299L0995K0643k7326k3782
22886a7644J0036p37k7293k1089k860K7417N107l66k4698o75n438J2475J1288
22873c4477k830J5889j0539m8106j9469M392L6442K1061J3837n091R298j1407
22861c1000j9515J3227J8048m586k5596k6875M9621J8920J746l71j4142r959k218
22848c2700M248n687J6323P666p174j3676K778k033r851o618k4523M338Q022J3290
22834d5597j0365J9284L9073P890j4184m183k6963J8090l241k7537K0765K6247
22822g21j723k4893k3330l364L3905J3283p940Q306j4664J4949L632k0196n69
22809b3325L491j154l41j7331j5676m967J1972j3119K7340K8407K5704Q361J1291
$$ plain form
22796 40653 38067 19712 -666 -24564 -49848 -48038 -39542 -42873 -18251 -9612 -27385 2793 -21734
22783 -21734 -32009 -26110 -41125 -43122 -21108 -10600 -37928 -66821 -51148 -32469 -12398 -1780
22771 -1780 -28637 -43247 -41250 -30931 -25989 -51770 -67946 -59091 -50178 -52991 -59938 -7757 21761
22758 21761 29737 21655 -3500 -15219 -29317 -19060 -8436 -1382 8405 4033 -23069 -49549 -54966
22745 -54966 -75530 -68853 -52055 -39073 -14530 -5348 -1082 5716 9703 14529 -10547 -40383 -42110
22732 -42110 -32438 -36907 -39874 -34332 -27053 -23512 -8519 3855 -4423 -29318 -26392 -24914 -26938 -17524
22718 -17524 -30272 -37865 -15424 7736 1282 -8526 7148 -8442 -24586 -47110 1634 18289
22706 18289 -10663 -39433 -48288 -61689 -37547 -18080 -18739 -25922 -38327 -55031 -59626 -42032 -60645
$$ packed form
22796D0653k586j8355k0378k3898k5284J810Q496l331K4622Q639j7773L0178k4527
22783b1734j0275N899j5015j997K2014J0508k7328k8893J5673J8679K0071J0618
22771a780k6857j4610J997J0319M942k5781j6176Q855Q913k813o947N2181K9518
22758B1761P976q082k5155j1719j4098J0257J0624P054R787m372k7102k6480n417
22745e4966k0564O677J6798J2982K4543R182M266O798L987M826k5076k9836j727
22732d2110R672m469k967N542P279L541J4993J2374q278k4895K926J478k024R414
22718a7524j2748p593K2441K3160o454r808J5674j5590j6144k2524M8744J6655
22706A8289k8952k8770q855j3401K4142J9467o59p183j2405j6704m595J7594j8613
$$ plain form
22693 -60645 -74467 -41350 -11314 -41536 -79226 -71336 -55807 -45075 -59958 -61090 -47328 -28460
22681 -28460 -23687 -24280 -39899 -23732 -10663 -3496 -20793 -42023 -18736 -35803 -23337 -16601 -6576
22668 -6576 -8817 5754 -36493 -33569 -41062 -62722 -58344 -48898 -39928 -16446 -7980 -37637 -27027
22655 -27027 -6880 -36126 -71614 -37149 -27233 -38234 -28889 -42926 -44224 -34695 -26999 -25373 -18287
22642 -18287 -23419 -13914 -43857 -74979 -69176 -36755 -9218 23025 5256 -26374 -59844 -62373
22630 -62373 -41822 -20255 -13777 -6118 4757 22634 10167 34530 38839 54469 61382 73329
22618 73329 71566 48965 17805 -1694 -28586 -50892 -55343 -12678 17980 11926 -7235 -42710
22606 -42710 -64716 -55471 -59356 -69798 -63959 -75380 -86499 -61053 -45731 -49146 -47566 -32207 -23096
$$ packed form
22693f0645j3822L3117L0036l0222l7690P890J5529J0732j4883j132J3762J8868
22681b8460M773n93j5619J6167J3069P167j7297k1230K3287j7067J2466O736J0025
22668f576k241J4571m2247K924p493k1660M378R446Q970K3482Q466k9657J0610
22655b7027K0147k9246l5488L4465R916j1001R345j4037j298R529P696J626P086
22642a8287n132R505k9943l1122N803L2421K7537L2243j7769l1630l3470k529
22630f2373K0551K1567O478P659J0875J7877j2467K4363M309J5630O913J1947
22618G3329j763k2601l1160j9499k6892k2306m451M2665L0658o054j9161l5475
22606d2710k2006R245l885j0442N839j1421j1119K5446J5322l415J580J5359R111
$$ plain form
22593 -23096 -13052 -41101 -26841 17134 32675 66550 118846 129656 120429 123346 94442 52421
22581 52421 14386 -18392 739 332 41585 41038 13614 14249 -16016 -39431 -67055 -62097 -42986
22568 -42986 -14980 10880 10224 -1373 -8578 12449 7421 -21282 -17379 -21131 -42451 -66086 -33512
22555 -33512 -18833 -27199 -60257 -63334 -22719 -14868 -28069 -39891 -27709 1169 1894 -10458 -15766
22542 -15766 -21849 -42859 -46432 -30323 3269 -11022 -33944 -43535 -28469 -6805 -57971 -73628
22530 -73628 -88601 -77564 -45152 -62818 -43515 -20537 -4717 -14892 -15840 -24057 -16838 -43241
22518 -43241 -67548 -77332 -44782 -40244 -48565 -26549 4310 -14872 -8100 14815 -10612 -29721
22506 -29721 -21680 -43663 -57067 -35003 -22146 -27436 -23195 -11294 9899 26948 38760 -3153
$$ packed form
22593b3096J0044k8049J4260M3975J5541L3875N2296J0810r227K917k8904m2021
22581E2421l8035l2778J9131m07M1253n47k7424O35l0265k3415k7624M958J9111
22568d2986K8006K5860o56j1597p205K1027n028k8703L903l752k1320k3635L2574
22555c3512J4679q366l3058l077M0615P851j3201j1822J2182K8878P25j2352n308
22542a5766o083k1010l573J6109L3592j4291k2922r591J5066K1664n1166j5657
22530g3628j4973J1037L2412j7666J9303K2978J5820j0175r48q217P219k6403
22518d3241k4307r784L2550M538q321K2016L0859j9182O772K2915k5427j9109
22506b9721Q041k1983j3404K2064J2857n290M241J1901K1193J7049J1812m1913
$$ plain form
22494 -3153 -14171 -13103 -20032 -24647 -32895 -42522 -27047 -25257 -595 28189 23303 22648 15088 16640
22480 16640 -5383 -20133 -15237 -10589 -7460 -27043 -30867 -18123 -46427 -66851 -52883 -31885
22468 -31885 -45149 -66271 -59741 -78224 -54297 -42610 -35494 -42923 -45340 -40234 -36059 -44257 -17315
22455 -17315 -30952 -46982 -29130 -28483 -4877 6510 -17278 -22937 -15698 -16803 -40516 -14637 9939
22442 9939 17590 34987 69913 71166 20941 3611 2716 -16868 -30621 -42874 -45609 -49082 -46835
22429 -46835 -48559 -36200 952 10181 9183 4290 8059 17411 9096 -14969 -26146 -49427 -48203
22416 -48203 -49325 -46397 -40316 -70085 -102099 -103028 -123671 -92474 -69713 -70410 -61919 -26174 -32155
22403 -32155 -35229 -18960 6947 -19127 -60455 -74057 -77467 -90695 -107522 -80913 -53559 -63095
$$ packed form
22494c153j1018J068o929m615q248r627J5475J790K4662K8784m886o55p560J552
22480A6640k2023j4750M896M648L129j9583l824J2744k8304k0424J3968K0998
22468c1885j3264k1122O530j8483K3927J1687P116p429k417N106M175q198K6942
22455a7315j3637j6030J7852O47K3606J1387k3788n659P239j105k3713K5879K4576
22442I939P651J7397L4926J253n0225j7330q95j9584j3753j2253k735l473K247
22429d6835j724J2359L7152R229r98m893L769R352q315k4065j1177k3281J224
22416d8203j122K928O081k9769l2014r29k0643L1197K2761o97Q491L5745n981
22403c2155l074J6269K5907k6074m1328j3602l410j3228j6827K6609K7354r536
$$ plain form
22391 -63095 -63336 -82197 -76342 -72695 -61558 -37392 -34508 -13369 1927 24272 19477 -7952 -42806
22378 -42806 -42239 -10089 -5758 11088 7179 -11524 -17190 7706 -3522 -12234 -5186 3657 -342
22365 -342 -23749 -51338 -59049 -60208 -37350 -20239 -46379 -29932 -2037 -15971 -40193 -2748
22353 -2748 -2907 -48726 -71701 -33788 -11641 -25019 -47375 -49525 -52586 -58012 -71479 -61702 -62551
22340 -62551 -69356 -39660 -30349 -18152 3552 -20943 -33624 -36848 -18793 2427 2540 -42792 -58100
22327 -58100 -28431 -12227 -48201 -35708 -22503 -4123 27037 44437 44385 27734 23206 27105 8830
22314 8830 -30955 -29247 -6800 -19727 -30669 8054 43452 43961 18939 1840 968 2089 -16098
22301 -16098 -28980 -52358 -73529 -59159 -60016 -53050 -62303 -65301 -65970 -43047 -18398 -4128 -6456
$$ packed form
22391f3095k41j8861N855L647J1137K4166K884K1139J5296K2345m795k7429l4854
22378d2806N67L2150M331J6846l909j8703n666K4896j1228q712P048Q843l999
22365c42k3407k7589p711j159K2858J7111k6140J6447K7895j3934k4222L7445
22353b748j59m5819k2975L7913K2147j3378k2356k150l061n426j3467R777q49
22340f2551o805K9696R311J2197K1704k4495j2681l224J8055K1220J13m5332j5308
22327e8100K9669J6204l5974J2493J3205J8380L1160J7400n2j6651m528L899j8275
22314H830l9785J708K2447j2927j0942L8723L5398N09k5022j7099q72J121j8187
22301a6098j2882k3378k1171J4370q57O966r253k998o69K2923K4649J4270k328
$$ plain form
22288 -6456 -5406 -3401 -31197 -14840 8612 8913 -29193 -67337 -71983 -56372 -40402 -33589 -37069
22275 -37069 -70714 -65928 -35941 -21558 1323 -22723 -50014 -48149 -34356 -40487 -61688 -70738
22263 -70738 -32626 -10317 11858 3147 -46240 -54466 -43979 -63677 -64615 -70653 -63754 -57425 -50207
22250 -50207 -56597 -45778 -1788 1227 -12485 -865 40626 51049 53496 51354 7865 -16640
22238 -16640 -23166 -24732 -21310 -22918 -27270 -20675 -14640 -41554 -69348 -52432 -45027 -47075 -52435 -64312
22224 -64312 -61943 -54967 -54343 -48181 -25123 -19884 -17880 -17276 -32426 -50607 -57509 -54161 -53516 -41790
22210 -41790 -68009 -98282 -100211 -85613 -57365 -38768 -33128 -26215 -23740 -17238 -14951 -13215 -26838
22197 -26838 -45022 -81312 -88658 -64692 -49605 -48177 -16540 -35877 -25318 -13833 -17563 11577
$$ packed form
22288f456J050K005k7796J6357K3452L01l8106l8144m646J5611J5970O813l480
22275c7069l3645M786K9987J4383K2881k4046k7291J865J3793o131k1201r050
22263g0738L8112K2309K2175q711m9387q226J0487j9698r38o038O899O329P218
22250e0207o390J0819M3990L015j3712J1620M1491J0423K447k142m3489k4505
22238a6640o526j566L422j608m352O595O035k6914k7794J6916P405k048n360j1877
22224f4312K369O976O24O162K3058N239K004O04j5150j8181o902L348O45J1726
22210d1790k6219l0273j929J4598K8248J8597N640O913K475O502K287J736j3623
22197b6838j8184l6290p346K3966J5087J428L1637j9337J0559J1485l730K9140
$$ plain form
22185 11577 25886 7737 -36028 -69366 -38823 -16459 -15395 -15055 -36390 -61833 -42765 -16937
22173 -16937 -5685 -8060 -15980 -23720 -6063 -12407 -30759 -28437 -17125 -27284 -27653 -18800 -47280
22160 -47280 -47605 -32347 -15571 -1628 -10065 -18848 -22812 -32955 -36877 -20803 -23024 -34335 -43814
22147 -43814 -60666 -46673 -15861 -12301 -30748 -56259 -58893 -32425 -40897 -27936 -24290 -50248
22135 -50248 -41922 -35623 -30012 -35432 -34440 -26111 -39941 -52034 -34494 -7391 -6680 5929 1342 -4823
22121 -4823 -47726 -60825 -69469 -60533 -26023 -34790 -47057 -48254 -63911 -74047 -75012 -74256 -53783
22108 -53783 -37490 -28226 -29797 12547 43570 10742 -6464 -12410 -7904 -22777 -22997 -54927 -88874
22095 -88874 -82773 -63960 -69869 -68150 -69189 -98639 -95622 -53987 -17539 -4109 376 19748 -413
$$ packed form
22185A1577J4309j8149m3765l3338L0543K2364J064L40k1335k5443J9068K5828
22173a6937J1252k375p920p740J7657o344j8352K322J1312j0159l69Q853k8480
22160d7280l25J5258J6776J3943q437q783l964j0143l922J6074k221j1311r479
22147d3814j6852J3993L0812L560j8447k5511k634K6468q472J2961L646k5958
22135e0248Q326O299N611n420R92Q329j3830j2093J7540K7103P11J2609m587o165
22121d823m2903j3099q644Q936L4510q767j2267j197j5657j0136r65P56K0473
22108e3783J6293R264j571M2344L1023l2828j7206n946M506j4873k20l1930l3947
22095h8874O101J8813n909J719j039k9450L017M1635L6448J3430M485J9372k0161
$$ plain form
22082 -413 -38249 -28686 -27216 -39060 -43535 -56752 -28031 -6114 9032 16989 28542 31751 7393
22069 7393 3923 7102 -310 -37464 -64353 -55117 -36382 -11158 -43944 -55957 -49138 -39470 -43201
22056 -43201 -51761 -40507 -31036 -36932 -21212 -13420 -37961 -31828 -14681 -11598 -6562 20905 14455
22043 14455 -6088 -6275 4444 -2843 5873 -11876 -39326 -40620 -58575 -45920 -30066 -25067 -31004
22030 -31004 -37359 -28561 -17302 -32772 -41802 -13974 -12917 -24756 -72078 -63165 -59633 -54921 -72181
22017 -72181 -64045 -60275 -64896 -64549 -61581 -51355 -29750 -48970 -74122 -56778 -41238 -18973 11110
22004 11110 -10712 -18220 -40669 -50705 -50657 -39769 -15319 -19764 -18745 -21486 -9782 -25316 -78447
21991 -78447 -96681 -87214 -56037 -40302 -42761 -46759 -61215 -66504 -81787 -94952 -59700 -39160
$$ packed form
22082d13l7836R563J470j1844m475j3217K8721K1917J5146P957J1553L209k4358
22069G393l470L179p412l7154k6889R236J8735K5224l2786j2013O819R668l731
22056d3201q560J1254R471n896J5720P792k4541O133J7147L083N036K7467o450
22043A4455k0543j87J0719p287Q716j7749k7450j294j7955J2655J5854M999n937
22030c1004o355Q798J1259j5470r030K7828J057j1839m7322Q913L532M712j7260
22017g2181Q136L770m621L47K968J0226K1605j9220k5152J7344J5540K2265L0083
22004A1110k1822p508k2449j0036M8J0888K4450m445J019k741J1704j5534n3131
21991g8447j8234R467L1177J5735k459l998j4456n289j5283j3165L5252K0540
$$ plain form
21979 -39160 -31515 -60718 -58010 -34595 -1495 34028 27998 6252 -2522 35156 50339 40491 7833
21966 7833 18779 21248 -14343 -13170 -21209 -24747 -45391 -44966 -74227 -96267 -86242 -82300 -79138
21953 -79138 -40915 2353 10226 7169 3139 -25839 6716 2003 -28191 -19630 3265 -23168 -44885
21940 -44885 -47963 -69065 -57625 -68155 -60206 -52354 -41889 -21628 -4017 -3579 -925 9078 26168
21927 26168 16609 19926 -2050 -31354 -19611 -27141 -24908 -14060 -17225 -52099 -36588 -24852 2715
21914 2715 2146 -20236 -53927 -48173 -18690 -42571 -57498 -31762 -16695 -29700 -45406 -57277
21902 -57277 -53153 -20915 -18351 1708 26963 -7957 -47006 -44495 -33437 -17632 13642 7733
21890 7733 7919 14985 381 19345 21238 7281 -31744 -62894 -64876 -35387 -31925 -19265 -28078
$$ packed form
21979c9160P645k9203K708K3415L3100L5523o030k1746q774L7678J5183r848l2658
21966G833J0946K469l5591J173q039l538k0644M25k9261k2040J0025L942L162
21953g9138L8223M3268P873l057m030k8978L2555m713l0194Q561K2895k6433k1717
21940d4885l078k1102J1440j0530P949P852J0465K0261J7611M38K654J0003J7090
21927B6168r559L317k1976k9304J1743p530K233J0848l165l4874J5511J1736K7567
21914B715n69k2382l3691N754K9483k3881j4927K5736J5067j3005j5706j1871
21902e7277M124L2238K564K0059K5255l4920l9049K511J1058J5805L1274n909
21890G733J86P066j4604J8964J893j3957l9025l1150j982K9489L462J2660q813
$$ plain form
21877 -28078 -55438 -60217 -28840 -29796 -37970 -20415 -16804 -20843 -25622 -41367 -37260 -42548 -75819
21864 -75819 -98800 -76626 -37721 -27218 -57136 -65211 -30745 5477 14223 9194 6663 11432 -1428
21851 -1428 12037 5316 -7686 -29622 -50847 -43111 -56675 -44262 -47280 -59142 -58277 -49444 -57967
21838 -57967 -81671 -61229 -55806 -60136 -53793 -58731 -58995 -81128 -73027 -69903 -65792 -68120 -72616 -47648
21824 -47648 -30515 -36459 -51123 -38132 -43322 -35833 -24984 -45402 -37826 -24418 -2124 -2996 -26692
21811 -26692 -43324 -46612 -53061 -51639 -57663 -46483 -16249 -25279 -29889 -43835 -69345 -68002 -66629
21798 -66629 -43665 -36322 -68413 -84232 -81287 -73278 -27155 8425 4047 -13957 -15396 -17874 -49968
21785 -49968 -57127 -60638 -62472 -30849 -7372 -4132 -21234 -15847 -29207 -36905 -46480 -61445 -41999
$$ packed form
21877b8078k7360m779L1377r56q174J7555L611m039m779j5745M107n288l3271
21864g5819k2981K2174L8905J0503k9918q075L4466L6222Q746n029k531M769j2860
21851a428J3465o721j3002k1936k1225P736j3564J2413l018j1862Q65Q833q523
21838e7967k3704K0442N423m330O343m938k64k2133Q101L124M111k328m496K4968
21824d7648J7133n944j4664J2991n190P489J0849k0418P576J3408K2294q72k3696
21811b6692j6632l288o449J422o024J1180L0234r030m610j3946k5510J343J373
21798f6629K2964P343l2091j5819K945Q009M6123L5580m378j8004j439k478l2094
21785d9968p159l511j834L1623K3477L240j7102N387j3360p698r575j4965J9446
$$ plain form
21772 -41999 -28697 -25756 1685 -5013 -28909 -36487 -1991 10096 -20610 -52300 -55963 -46206 -25772
21759 -25772 -25477 -63931 -47316 -51610 -59553 -50935 -51944 -64465 -62608 -38349 -19775 -20328 -22265 -35095
21745 -35095 -42792 -32934 -3670 23777 3884 -1777 20185 -5719 -25635 -14574 -17626 -7039
21733 -7039 32359 12949 -699 4371 -15207 -17431 -26266 -22616 -43980 -58365 -50334 -52398 -42500
21720 -42500 -24356 -36145 -43805 -5346 12943 18307 -6634 956 10568 476 -14944 564
21708 564 18766 -11881 -18901 -20959 -35054 -54141 -54372 -17921 6741 -7616 -26511 -43041 -51550
21695 -51550 -47738 -68390 -49083 -42764 -44017 -22206 4604 8827 26628 29203 8405 -1093 -9598
21682 -9598 -25877 9268 41866 32060 41540 22245 -15237 9496 1795 -31343 -6722 -2910 22348
$$ packed form
21772d1999J3302K941K7441o698k3896p578L4496J2087l0706l1690l663R757K0434
21759b5772K95l8454J6615m294p943Q618j009j2521J857K4259J8574n53j937j2830
21745c5095p697R858K9264K7447j9893n661K1962k5904j9916J1061l052J0587
21733g039L9398j9410j3648N070j9578k224q835L650k1364j4385Q031k064R898
21720d2500J8144j1789p660L8459J8289N364k4941P590R612j0092j5420J5508
21708E64J8202l0647p020k058j4095j9087k31L6451K4662j4357j8895j6530q509
21695e1550L812k0652J9307O319j253K1811K6810M223J7801K575k0798r498q505
21682i598j6279L5145L2598r806R480j9295l7482K4733p701l3138K4621L812K5258
$$ plain form
21669 22348 40766 27118 20966 22598 -19391 -12382 -12795 -19191 -7481 -22159 -24997 -33001 -30816
21656 -30816 -20461 -25767 6475 -17571 -51210 -41278 -30312 -5301 -7797 -34720 -60720 -35112
21644 -35112 -5311 -15254 -45620 -43848 -45009 -51325 -45302 -53311 -54842 -56197 -66194 -41997 5674
21631 5674 22134 8507 23490 47933 34438 -11259 -37551 -612 -7168 -46822 -43418 -8037
21619 -8037 -27745 -13988 5663 -6248 12304 35652 51382 30857 18848 27506 12400 6621
21607 6621 17304 15649 1874 -31927 -44340 -19160 -14188 -5003 -19115 -23722 -29671 -26711 -21347
21594 -21347 -26805 -34373 -36735 -7614 45578 58874 33929 47925 34297 33234 34657 19065 -12903
21581 -12903 -10173 -345 4982 15576 58270 53375 55808 87736 110524 121243 101892 81793 80748
$$ packed form
21669B2348J8418j3648o152J632m1989P009m13o396J1710j4678k838q004K185
21656c0816J0355n306L2242k4046l3639R932J0966K5011k496k6923k6000K5608
21644c5112K9801r943l0366J772j161o316O023q009j531j355r997K4197M7671
21631E674J6460j3627J4983K4443j3495m5697k6292L6939o556l9654L404L5381
21619h037j9708J3757J9651j1911J8552K3348J5730k0525j2009Q658j5106n779
21607F621J0683j655j3775l3801j2413K5180M972R185j4112m607n949K960N364
21594b1347n458p568k362K9121N3192J3296k4945J3996j3628j063J423j5592l1968
21581a2903K730R828N327J0594M2694m895K433L1928K2788J0719j9351k0099j045
$$ plain form
21568 80748 118442 176026 233403 283668 369484 451858 527830 602201 622974 597234 565558 500690
21556 500690 461045 438343 462103 493308 543072 607947 614140 576615 521318 458488 370947 266490
21544 266490 203729 153600 117326 125044 99241 56887 35371 37099 20237 6284 11669 5791
21532 5791 102 15596 30149 45796 51066 45118 46071 30480 147 -39642 -62212 -54063 -52093
21519 -52093 -58200 -36419 -26132 -4964 -442 -5958 -16658 -35302 -41355 -39104 -40031 -19281 -18966
21506 -18966 -11484 -13796 -33756 2153 13586 -6850 -42408 -31217 -19196 -36308 -59913 -70437
21494 -70437 -51385 -22770 -17859 -13859 10509 13572 213 -23460 -12903 4679 25121 15493
21482 15493 -6975 13464 19423 4306 -23346 -25868 -9400 -2682 3067 4564 14553 18496 10842
$$ packed form
21568H0748L7694N7584N7377N0265Q5816Q2374P5972P4371K0773k5740l1676o4868
21556E00690l9645k2702K3760L1205M9764O4875O193l7525n5297o2830q7541j04457
21544B66490o2761n0129l6274P718k5803m2354k1516J728j6862j3953N385n878
21532E791n689J5494J4553J5647N270n948R53j5591l0333l9789k2570Q149J970
21519e2093o107K1781J0287K1168M522n516j0700j8644o053K251r27K0750L15
21506a8966P482k312j9960L5909J1433k0436l5558J1191J2021j7112k3605j0524
21494g0437J9052K8615M911M000K4368L063j3359k3673J0557J7582K0442r628
21482A5493k2468K0439N959j5117k7652k522J6468O718N749J497R989L943p654
$$ plain form
21469 10842 -8062 -7029 -1654 -15123 -2513 -25258 -53093 -66550 -60524 -45052 -45768 -39720 -19561
21456 -19561 -503 14476 -12682 -38112 -38795 -28615 -16852 -7503 1318 -22344 -21617 -34766 -16443
21443 -16443 -9917 -29614 -50375 -32767 -3107 -22521 -33541 -42591 -22533 -13184 -22508 -39779
21431 -39779 -43424 -33692 -31204 -43329 -66642 -74407 -12319 -23495 -46067 -33330 -31073 -47649 -33576
21418 -33576 -22581 20518 25636 33099 12925 -12256 -7064 7771 35559 50969 43631 3294
21406 3294 -7022 -30745 -50118 -14808 37612 794 -18945 -4268 -19036 -24120 -23544 -45728
21394 -45728 -61623 -38611 -19110 -38987 -30508 -24756 -30777 5917 15325 14012 -8210 -25478 -18138
21381 -18138 18293 12216 -584 349 -13912 -46689 -39298 -23801 -2696 5936 -14765 -28713 -17036
$$ packed form
21469A0842j8904J033N375j3469J2610k2745k7835j3457O026J5472p16O048K0159
21456a9561J9058J4979k7158k5430o83J0180J1763R349Q821k3662P27j3149J8323
21443a6443O526j9697k0761J7608K9660j9414j1020r050K0058R349r324j7271
21431c9779l645R732K488j2125k3313p765O2088j1176k2572J2737K257j6576J4073
21418c3576J0995M3099N118P463k0174k5181N192J4835K7788J5410p338m0337
21406C294j0316k3723j9373L5310N2420l6818j9739J4677j4768n084N76k2184
21394d5728j5895K3012J9501j9877Q479N752o021L6694R408j313k2222j7268P340
21381a8138L6431o077j2800R33j4261l2777P391J5497K1105Q632k0701j3948J1677
$$ plain form
21368 -17036 13710 23448 13165 11003 4020 -1814 16237 -3559 -31968 -50942 -59765 -65990 -42674
21355 -42674 -17952 -35811 -30242 -9905 -6581 -33130 -44296 -38244 -50274 -54984 -11318 -677
21343 -677 -2053 -13250 -33937 -53463 -50467 -11962 -9535 15 -5401 -4242 722 5990 -5577 4161
21329 4161 16739 27518 16486 13870 14680 -17215 -26376 -4575 9173 30699 26841 2493 10396
21316 10396 42361 66997 40331 5506 -30156 -29437 -21879 -7456 -7553 -19520 -38884 -27875 1609
21303 1609 23387 18440 15300 8749 14963 26549 55958 41536 14375 30543 42479 23672 4431
21290 4431 1598 28574 25900 8887 22015 46438 31233 34510 23047 20005 11067 9408 -2803
21277 -2803 11517 -17862 -72129 -79490 -73561 -87171 -74703 -37321 -17127 -15984 -37440 -64316
$$ packed form
21368a7036L0746R738j0283k162o983n834J8051j9796k8409j8974q823o225K3316
21355d2674K4722j7859N569K0337L324k6549j1166O052j2030m710M3666J0641
21343f77j376j1197k0687j9526K996L8505K427R550n416J159M964N268j1567R738
21329D161J2578J0779j1032k616Q10l1895r161K1801J3748K1526l858k4348P903
21316A0396L1965K4636k6666l4825l5662P19P558J4423r7j1967j9364J1009K9484
21303A609K1778m947l140o551O214J1586K9409j4422k7161J6168J1936j8807j9241
21290D431k833K6976k674j7013J3128K4423j5205L277j1463l042q938j659j2211
21277b803J4320k9379n4267p361N929j3610J2468L7382K0194J143k1456k6876
$$ plain form
21265 -64316 -43689 -19198 -27357 -41518 -289 -18929 -59088 -64916 -61872 -42907 -45261 -16132
21253 -16132 33389 74335 78784 56639 46203 3633 -24967 25012 58797 73160 74478 70044
21241 70044 53660 30541 8229 24750 47206 68183 68737 65847 64806 62091 53716 74076 135420
21228 135420 181438 186420 212259 203835 164399 123779 109302 104903 91530 104023 74797 63058
21216 63058 77764 76442 46993 34302 44882 37145 30576 57142 80860 68822 50514 50915 67691
21203 67691 56928 35498 58022 77058 84781 95542 85378 68636 93245 91070 55919 58108
21191 58108 74640 65605 40935 21252 8539 -12898 -19013 28992 56367 60940 62255 76384
21179 76384 82181 85542 84972 63823 26634 14852 40616 76176 83790 79149 54886 24892 31447
$$ packed form
21265f4316K0627K4491q159j4161M1229j8640m0159n828L044J8965k354K9129
21253a6132M9521M0946M449k2145j0436m2570k8600M9979L3785J4363J318m434
21241G0044j6384k3119k2312J6521K2456K0977N54k890j041k715q375K0360O1344
21228A35420M6018M982K5839q424l9436m0620j4477m399j3373J2493k9226j1739
21216F3058J4706j322k9449j2691J0580p737o569K6566K3718j2038j8308M01J6776
21203F7691j0763k1430K2524J9036P723J0761j0164j6742K4609k175l5151K189
21191E8108J6532r035k4670j9683j2713k1437o115M8005K7375M573J315J4129
21179G6384N797L361n70k1149l7189j1782K5764L5560P614m641k4263k9994O555
$$ plain form
21166 31447 9502 -16449 -35894 -83967 -88632 -38245 -24921 -36373 -29164 -27004 -33529 -4967
21154 -4967 28635 52232 35435 37103 50906 51080 48915 75293 54240 55716 56204 32023 12629
21141 12629 11201 8652 8339 -252 1453 -1026 1772 27159 29683 56639 64760 50262 36602 50128
21127 50128 79901 79244 78571 74054 68049 42478 33995 32941 48916 68067 56658 48230 58962
21114 58962 81319 107264 123466 133375 103014 98688 82623 81131 117042 103515 79391 84425
21102 84425 84096 77683 69711 119139 162870 194641 221587 221529 198707 212728 250109 248260 219402
21089 219402 194637 195338 192556 218304 221978 221932 211585 206238 195038 215663 244216 277531 270257
21076 270257 244592 214779 201837 188481 182914 195063 221784 245548 264324 270847 270700 275496
$$ packed form
21166C1447k1945k5951j9445m8073m665N0387J3324j1452P209K160o525K8562
21154d967L3602K3597j6797J668J3803J74k165K6378k1053J476M88k4181j9394
21141A2629j428k549l13q591J705k479K798K5387K524K6956Q121j4498j3660J3526
21127E0128K9773o57o73m517o005k5571q483j054J5975J9151j1409q428J0732
21114E8962K2357K5945J6202R909l0361m326j6065j492L5911j3527k4124N034
21102H4425l29o413p972M9428M3731L1771K6946n8k2822J4021L7381j849k8858
21089B19402k4765P01k782K5748L674m6j0347n347j1200K0625K8553L3315p274
21076B70257k5665k9813j2942j3356n567J2149K6721K3764J8776O523j47M796
$$ plain form
21064 275496 247290 228948 233464 260924 284280 288217 284599 288700 313457 335748 350329 367647
21052 367647 408907 391440 393814 414477 421351 416505 428045 457643 452978 449502 456125 496402 544306
21039 544306 571811 559371 537011 565686 562087 562942 593135 594825 614177 667845 710933 735671
21027 735671 779779 819141 874434 891263 908290 962019 1044572 1141110 1290275 1471604 1734140
21016 1734140 2012866 2238555 2396215 2481027 2474097 2425956 2399090 2397658 2455820 2638049 2919946
21005 2919946 3237480 3592603 3887835 4032909 4101981 4075363 4011414 3957494 3998120 4151681
20995 4151681 4361119 4626166 4938623 5331214 5836516 6501702 7340362 8454522 9970512
20986 9970512 12063976 14704361 17326149 19198193 20832893 23529408 28018627 34993265
$$ packed form
21064B75496k8206j8342M516K7460K3356L937l618M101K4757K2291J4581J7318
21052C67647M1260j7467K374K0663O874m846J1540K9598m665l476O623M0277M7904
21039E44306K7505j2440k2360K8675l599Q55L0193J690J9352N3668M3088K4738
21027G35671M4108L9362N5293J6829J7027N3729Q2553R6538J49165J81329K62536
21016A734140K78726K25689J57660Q4812o930m8141k6866j432N8162J82229K81897
21005B919946L17534L55123K95232J45074O9072k6618o3949n3920M0626J53561
20995D151681K09438K65047L12457L92591N05302O65186Q38660J114160J515990
20986I970512K093464K640385K621788J872044J634700K696515M489219O974638
$$ plain form
20978 34993265 45902593 63297028 91625063 137849437 208355687 292562598 340687083
20971 340687083 307568366 223708421 145755072 94804056 65236023 47804683 36940371
20964 36940371 29835155 25050525 21813824 19699783 18078390 16081673 13472195 10973305
20956 10973305 9060043 7678813 6665401 5906255 5255123 4714470 4284028 3936756 3683867
20947 3683867 3544760 3509764 3589995 3730240 3859243 3866486 3729117 3483563 3219549 2938639
20937 2938639 2642105 2373353 2226431 2156127 2168314 2253774 2317346 2282237 2169685 1973018
20927 1973018 1769855 1566990 1372770 1200272 1071620 973835 889198 787977 728405 679992
20917 679992 633803 612357 594181 545971 488953 469828 447414 443503 428283 414988 399207 393359
$$ packed form
20978C4993265J0909328J7394435K8328035M6224374P0506250Q4206911M8124485
20971C40687083l3118717q3859945p7953349n0951016k9568033j7431340j0864312
20964C6940371p105216m784630l236701k114041j621393j996717k609478k498890
20956A0973305j913262j381230j013412p59146o51132n40653m30442l47272k52889
20947C683867j39107l4996Q0231J40245J29003P243j37369k45554k64014k80910
20937B938639k96534k68752j46922p0304J2187Q5460O3572l5109j12552j96667
20927A973018k03163k02865j94220j72498j28652r7785q4637j01221n9572m8413
20917F79992m6189k1446j8176m8210n7018j9125k2414l911j5220j3295j5781n848
$$ plain form
20905 393359 364127 344422 307951 303940 305410 296804 251609 252857 253218 242995 241193 264840 267446
20892 267446 243064 232356 198913 224718 236148 215224 185591 161095 158615 184832 211929 196681
20880 196681 168225 175077 176651 173105 187628 150021 111980 96432 101273 100615 83800 78077 89457
20867 89457 97931 86724 99894 105715 89106 63226 48302 37792 37269 34594 50652 44341 21577
20854 21577 25994 32538 46605 53322 48273 34925 72325 169011 294839 369386 362293 332432
20842 332432 272923 209988 173315 153513 128515 104250 91608 118420 127968 119616 89970 74474
20830 74474 69470 62396 59274 65774 58248 65892 46382 56963 45018 52881 55678 34681 -2341
20817 -2341 -2915 -1733 50985 74641 62115 85262 116843 114718 93509 97913 139358 185691 226320
$$ packed form
20905C93359k9232j9705l6471m011J470q606m5195J248L61j0223j802K3647K606
20892B67446k4382j0708l3443K5805J1430k0924k9633k4496k480K6217K7097j5248
20880A96681k8456O852J574l546J4523l7607l8041j5548M841o58j6815n723J1380
20867H9457Q474j1207J3170N821j6609k5880j4924j0510n23k675J6058o311k2764
20854B1577M417O544J4067O717n049j3348L7400R6686J25828P4547p093k9861
20842C32432n9509o2935l6673j9802k4998k4265j2642K6812R548q352k9646j5496
20830G4474n004p074l122O500p526P644j9510J0581j1945P863K797k0997l7022
20817b341n74J182N2718K3656j2526K3147L1581k125k1209M404M1445M6333M0629
$$ plain form
20804 226320 291418 335314 326023 347472 339016 327624 289900 225997 193231 167835 165296 190233
20792 190233 232316 266131 267173 267193 276234 271426 249090 219589 187500 138424 113906 70808 57416
20779 57416 39731 -8394 -11098 -11719 -22708 -21892 -47860 -77648 -69408 -17497 -6230 -12840 9238
20766 9238 3807 -2391 -42265 -59458 -53638 -18812 2557 -14552 -24462 -3258 36050 14192 -43880
20753 -43880 -79733 -118954 -131797 -103802 -66546 -45894 -33474 -56050 -75709 -72753 -61726 -78667
20741 -78667 -69043 -86437 -98548 -123528 -123749 -112365 -69035 -38816 -34025 -38135 -62314 -69828 -81062
20728 -81062 -72415 -91990 -85777 -75250 -68553 -55856 -39416 -18111 -7318 -18519 -21737 -41607
20716 -41607 -70562 -74607 -71786 -59122 -39882 -35686 -14388 -14128 -30064 -28406 -41669 -57166 -70863
$$ packed form
20804B26320O5098M3896r291K1449q456j1392l7724o3903l2766k5396k539K4937
20792A90233M2083L3815J042K0R041m808k2336k9501l2089m9076k4518m3098j3392
20779E7416j7685m8125k704o21j0989Q16k5968k9788Q240N1911J1267o610K2078
20766I238n431o198l9874j7193N820L4826K1369j7109r910K1204L9308k1858n8072
20753d3880l5853l9221j2843K7995L7256K0652J2420k2576j9659K956J1027j6941
20741g8667R624j7394j2111k4980k21J1384M3330L0219M791m110k4179p514j1234
20728h1062Q647j9575O213J0527O697J2697J6440K1305J0793j1201l218j9870
20716d1607k8955m045K821J2664J9240M196K1298K60j5936J658j3263j5497j3697
$$ plain form
20703 -70863 -56198 -40704 -28663 -33697 -59079 -46284 -31855 -38822 -76302 -79964 -105877 -91767
20691 -91767 -78566 -90215 -97119 -89143 -79254 -73143 -52281 -34516 -10985 -51976 -63376 -71808 -82149
20678 -82149 -67068 -82299 -80681 -71319 -80444 -72529 -45191 -9494 -10688 2255 -27997 -46007 -37416
20665 -37416 -60045 -103335 -94313 -59882 -53959 -60081 -71263 -63499 -83399 -75586 -77996 -102721 -123923
20652 -123923 -99832 -86679 -86709 -102980 -96506 -102499 -140181 -151522 -149960 -120324 -135726 -87184 -46624
20639 -46624 -29636 -42364 -65345 -89462 -75370 -69010 -69407 -71672 -64734 -80166 -85216 -73001 -64597
20626 -64597 -76498 -74851 -68927 -52275 -70914 -63436 -74717 -93765 -77088 -57061 -63191 -82741
20614 -82741 -53488 -73882 -85747 -88268 -80678 -83374 -73402 -68405 -78775 -79567 -48921 -47339 -52754
$$ packed form
20703g0863J4665J5494J2041n034k5382J2795J4429o967l7480l662k5913J4110
20691i1767J3201j1649o904P976R889O111K0862J7765K3531m0991j1400q432j0341
20678h2149J5081j5231J618R362r125P915K7338L5697j194J2943l0252j8010Q591
20665c7416k2629m3290R022L4431N923o122j1182P764j9900P813k410k4725k1202
20652a23923K4091J3153l0j6271O474n993l7682j1341J562K9636j5402M8542M0560
20639d6624J6988j2728k2981k4117J4092O360l97k265O938j5432n050J2215Q404
20626f4597j1901J647N924J6652j8639P478j1281j9048J6677K0027o130j9550
20614h2741K9253k0394j1865k521P590k696R972M997j0370p92L0646J582n415
$$ plain form
20601 -52754 -69062 -78308 -81141 -51044 -46479 -33459 -58725 -77040 -76779 -81279 -82406 -108025 -122094
20588 -122094 -98869 -66799 -50253 -78247 -76943 -59313 -66659 -86649 -103091 -102312 -86186 -98052
20576 -98052 -101405 -90445 -87388 -68376 -65711 -60052 -39540 -62410 -82666 -63322 -40345 -59186
20564 -59186 -38047 -25401 -51395 -66866 -54605 -39214 -31427 -52870 -52407 -32007 -18808 -35785
20552 -35785 -62602 -67011 -60974 -38060 -30185 -58481 -64115 -62281 -38000 -9707 -18446 -52560 -59559
20539 -59559 -53215 -51333 -67902 -69815 -92277 -69768 -27633 -24865 -20012 -8080 -16377 -22150 -37803
20526 -37803 -34596 -19900 -11131 -8213 -14361 19821 7684 -4826 -34795 -66284 -54296 -59639 -75352
20513 -75352 -99354 -51710 -25785 -53426 -77990 -81972 -79087 -102889 -93775 -96663 -98658 -94404 -56373
$$ packed form
20601e2754j6308r246k833L0097M565J3020k5266j8315K61m500j127k5619j4069
20588a22094K3225L2070J6546k7994J304J7630p346j9990j6442P79J6126j1866
20576i8052l353J0960L057J9012K665N659K0512k2870k0256J9344K2977j8841
20564e9186K1139J2646k5994j5471J2261J5391P787k1443M63K0400J3199j6977
20552c5785k6817m409O037K2914P875k8296n634J834K4281K8293q739l4114o999
20539e9559O344J882j6569j913k2462K2509M2135K768M853J1932q297n773j5653
20526c7803L207J4696Q769K918o148L4182j2137j2510k9969l1489J1988n343j5713
20513g5352k4002M7644K5925k7641k4564l982K885k3802R114k888j995M254L8031
$$ plain form
20500 -56373 -53968 -63397 -51296 -44379 -54875 -66583 -79628 -53825 -73007 -91981 -99094 -100825 -101038
20487 -101038 -125187 -127135 -133539 -92619 -69112 -80496 -90586 -85068 -73030 -84589 -74278 -85825
20475 -85825 -92922 -118716 -120641 -93506 -73261 -89724 -110856 -130184 -121706 -112686 -98243 -97953 -107760
20462 -107760 -116246 -127486 -110125 -92865 -83318 -108753 -118744 -115090 -107599 -121417 -112001 -92074 -98978
20449 -98978 -77975 -67798 -94309 -81708 -69938 -55186 -76597 -90598 -71485 -76132 -85629 -91813
20437 -91813 -91135 -91001 -77661 -70415 -60143 -61121 -61994 -38939 -67833 -59754 -38639 -32388 -23229 -8681
20423 -8681 -15236 -32949 -46203 -39208 -22474 -29967 -6628 36342 47597 24550 9219 946 -11504
20410 -11504 -28843 -64477 -76249 -72084 -69867 -101610 -74725 -34599 -18571 2188 25631 58945
$$ packed form
20500e6373K405r429J2101O917j0496j1708j3045K5803j9182j8974p113j731k13
20487a01038k4149j948o404M0920K3507j1384j0090N518J2038j1559J0311j1547
20475h5825p097k5794j925K7135K0245j6463k1132j9328Q478R020J4443K90r807
20462a07760q486j1240J7361J7260R547k5435r991L654P491j3818R416J9927o904
20449i8978K1003J0177k6511J2601J1770J4752k1411j4001J9113m647r497o184
20437i1813O78J34J3340P246J0272r78q73K3055k8894Q079K1115O251R159J4548
20423h681o555j7713j3254O995J6734p493K3339M2970J1255k3047j5331q273j2450
20410a1504j7339l5634j1772M165K217l1743K6885M0126J6028K0759K3443L3314
$$ plain form
20398 58945 46294 15589 21301 17254 65449 130409 165444 202295 286095 385725 416277 440696
20386 440696 454016 427747 420151 426987 388106 360920 379221 375108 378116 417686 431234 419448
20374 419448 436985 446822 401734 291405 194006 157959 117784 37322 16806 6789 -24418
20363 -24418 -51238 -76529 -62229 -39902 -40638 -31270 -27778 -38411 -31075 -19014 -39600 -48042 -18242
20350 -18242 10611 21091 45612 40498 35150 32022 35095 35196 58588 83576 87928 94118 99025
20337 99025 75002 70569 109490 132978 133703 128882 131195 125087 93138 68334 69612 89519 113967
20324 113967 143522 151139 173054 245648 321730 339809 340481 299703 282908 275883 263406 268042
20312 268042 274101 280389 332408 403678 446948 548939 645584 728241 855759 970331 1078827
$$ packed form
20398E8945j2651l0705N712m047M8195O4960L5035L6851Q3800R9630L0552K4419
20386D40696J3320k6269p596O836l8881k7186J8301m113L008L9570J3548j1786
20374D19448J7537R837m5088j10329r7399l6047m0175q0462k0516j0017l1207
20363b4418k6820k5291J4300K2327p36R368L492j0633P336J2061k0586q442K9800
20350a8242K8853J0480K4521n114n348l128L073J01K3392K4988M352O190M907
20337I9025k4023m433L8921K3488P25m821K313o108l1949k4804J278J9907K4448
20324A13967K9555P617K1915P2594P6082J8079O72m0778j6795p025j2477M636
20312B68042O059O288N2019P1270M3270J01991R6645Q2657J27518J14572J08496
$$ plain form
20301 1078827 1183640 1276242 1362495 1513512 1717923 1947189 2226887 2503323 2816603 3150461
20291 3150461 3558549 4028097 4619914 5442420 6565016 8207510 10784567 14803883 21062643
20282 21062643 30573365 43394724 54726087 58288973 57718986 60261353 61867942 53668124
20274 53668124 41253561 33497923 31528919 34553909 42618758 54984401 64840761 65059093
20266 65059093 60697514 60448311 59650057 49517950 34968246 24112943 17545716 13500496
20258 13500496 10816959 8948147 7611853 6640160 5931715 5366802 4840801 4325311 3880565
20249 3880565 3495956 3157953 2877727 2618251 2395556 2187284 2003341 1824536 1698087
20240 1698087 1559940 1409488 1316809 1239003 1151431 1039167 948228 902156 838232 778914 734020
$$ packed form
20301A078827J04813R2602Q6253J51017K04411K29266K79698K76436L13280L33858
20291C150461M08088M69548N91817Q22506J122596J642494K577057M019316O258760
20282B1062643R510722J2821359J1331363L562886n69987K542367J606589q199818
20274E3668124j2414563p755638j969004L024990Q064849J2365643R856360K18332
20266F5059093m361579k49203p98254j0132107j4549704j0855303o567227m045220
20258A3500496k683537j868812j336294r71693p08445n64913n26001n15490m44746
20249C880565l84609l38003k80226k59476k22695k08272j83943j78805j26449
20240A698087j38147j50452r2679p7806q7572j12264r0939m6072o3924n9318m4894
$$ plain form
20229 734020 685934 676792 681201 651063 601813 553599 540386 500312 490497 487268 451383 418156
20217 418156 415058 372067 321812 322186 346566 379047 370877 350200 317498 291314 290196 284184 275951
20204 275951 272861 261241 239855 195854 197533 202060 195509 220300 231887 223540 219050 183049 162208
20191 162208 197424 236137 245695 225769 186618 178668 190818 169764 161276 181903 174455 159866
20179 159866 152227 158268 155271 152766 148398 126905 104309 123784 138448 111500 111546 152644 149368
20166 149368 141184 127970 135929 151940 180683 163651 174841 212539 311439 365343 351362 318586
20154 318586 307468 269555 224530 196387 185833 179346 151682 127839 107951 93972 94111 94671
20142 94671 114681 122510 127592 128454 136845 152971 161296 134650 140997 123507 103138 78689 96383
$$ packed form
20229G34020m8086r142M409l0138m9250m8214j3213m0074r815l229l5885l3227
20217D18156l098m2991n0255L74K4380L2481q170k0677l2702k6184j118o012q233
20204B75951l090j1620k1386m4001J679M527o551K4791J1587q347m490l6001k0841
20191A62208L5216L8713R558j9926l9151p950J2150k1054q488K0627p448j4589
20179A59866p639O041k997k505m368k1493k2596J9475J4664k6948M6M1098l276
20166A49368q184j3214P959J6011K8743j7032J1190L7698R8900N3904j3981l2776
20154C18586j1118l7913m5025k8143j0554o487k7664k3843j9888j3979J39N60
20142I4671K0010P829N082Q62Q391J6126Q325k6646O347j7490k0369k4449J7694
$$ plain form
20129 96383 104077 54725 39718 63125 52577 35640 20837 24170 42475 69499 92521 75888
20117 75888 46018 34690 29209 24998 27918 55494 86236 111288 115738 101403 128880 141280
20105 141280 179075 225989 271068 324570 342641 323072 290754 257215 198307 181496 153991
20094 153991 136664 103593 73433 49925 433 7826 10624 -11685 -7362 16232 55784 45305
20082 45305 -8150 -35413 -44621 -33775 -25993 -26064 -40101 -19502 17370 -1221 -12856 -25261 -28254
20069 -28254 -20015 -10529 -16541 -41 14575 -1382 -36212 -65791 -92461 -102938 -92740 -74070
20057 -74070 -46660 -41568 -40286 -28201 -47904 -67894 -77567 -51774 -44316 -33733 -47030 -66902
20045 -66902 -92533 -72066 -49689 -69759 -69944 -42934 -46012 -32454 -22302 196 -37237 -78435
$$ packed form
20129I6383P694m9352j5007K3407j0548j6937j4803L333J8305K7024K3022j6633
20117G5888k9870j1328n481m211K920K7576L0742K5052M450j4335K7477J2400
20105A41280L7795M6914M5079N3502J8071j9569l2318l3539n8908j6811k7505
20094A53991j7327l3071l0160k3508m9492P393K798k2309M323K3594L9552j0479
20082D5305n3455k7263r208J0846P782p1j4037K0599L6872j8591j1635j2405k993
20069b8254Q239R486o012J6500J4616j5957l4830k9579k6670j0477J0198J8670
20057g4070K7410N092J282J2085j9703j9990r673K5793P458J0583j3297j9872
20045f6902k5631K0467K2377k0070j85K7010l078J3558J0152K2498l7433m1198
$$ plain form
20033 -78435 -85039 -67462 -76367 -62157 -47963 -27749 -34420 -32501 -33115 -39691 -30996 -53414 -84221
20020 -84221 -76938 -37148 -12372 -34311 -45469 -48533 -56081 -45219 -38477 -40074 -3131 11102 -7731
20007 -7731 -23710 -47117 -47745 -27266 -36765 -18757 7054 -3090 -24785 -27714 -44551 -42745 -45226
19994 -45226 -60154 -74128 -78787 -78302 -46602 -46603 -63282 -67424 -71706 -80454 -69667 -66956 -88086 -115588
19980 -115588 -108979 -80921 -77429 -58216 -71878 -64501 -56855 -77375 -94647 -110022 -93238 -97353
19968 -97353 -86606 -86711 -102577 -63906 -65429 -70133 -64739 -69181 -89041 -73637 -29159 -3973 -20596
19955 -20596 -27437 -53890 -88601 -105693 -100593 -104692 -92297 -86889 -74617 -66795 -68074 -72331 -76248
19942 -76248 -109217 -121944 -119243 -113103 -98795 -84643 -72911 -57679 -16506 5289 -3116 -18314
$$ packed form
20033g8435o604J7577q905J4210J4194K0214o671J919o14o576Q695k2418l0807
20020h4221P283L9790K4776k1939j1158l064p548J0862O742j597L6943J4233j8833
20007g731j5979k3407o28K0479r499J8008K5811j0144k1695k929j6837J806k481
19994d5226j4928j3974m659M85L1700jj6679m142m282q748J0787K711k1130k7502
19980a15588O609K8058L492J9213j3662P377P646k0520j7272j5375J6784m115
19968i7353J0747j05j5866L8671j523m704N394m442j9860J5404M4478K5186j6623
19955b0596o841k6453l4711j7092N100m099J2395N408J2272P822j279m257l917
19942g6248l2969j2727K701O140J4308J4152J1732J5232M1173K1795q405j5198
$$ plain form
19930 -18314 -25111 -12221 -32388 -49367 -28320 -27232 -10487 -6990 -9795 -27407 -16972 488
19918 488 -13981 -28128 -39336 -37152 -7677 -9928 -64898 -58328 -55311 -67575 -65887 -59969 -55080
19905 -55080 -58421 -89620 -90114 -88555 -72625 -93896 -92744 -85418 -94751 -91487 -79361 -86932 -93013 -93008
19891 -93008 -97937 -95082 -112958 -115918 -110777 -97348 -64420 -46134 -15652 -11841 -10843 -4107 -38493
19878 -38493 -59703 -72854 -93667 -114913 -141149 -140378 -134533 -120470 -83861 -76872 -63773 -39648
19866 -39648 -105153 -134467 -127621 -135312 -154280 -155987 -115070 -79564 -92906 -112830 -92531 -85067
19854 -85067 -37165 -4286 -29844 -87328 -105353 -88839 -61473 -23832 19022 65773 115608 171838
19842 171838 184502 162665 171321 152427 145520 144730 210191 283302 365891 452115 560751 615194
$$ packed form
19930a8314o797J2890k0167j6979K1047J088J6745L497k805j7612J0435J7460
19918D88j4469j4147j1208K184K9475k251n4970O570L017j2264J688N918M889
19905e5080l341l1199m94J559J5930k1271J152P326r333L264J2126p571o081N
19891i3008m929K855j7876k960N141J3429L2928J8286L0482L811R98O736l4386
19878c8493k1210j3151k0813k1246k6236P71N845J4063L6609O989J3099K4125
19866c9648o5505k9314O846p691j8968j707M0917L5506j3342j9924K0299P464
19854h5067M7902L2879k5558n7484j8025J6514K7366L7641M2854M6751M9835N6230
19842A71838J2664k1837Q656j8894o907p90O5461P3111Q2589Q6224J08636N4443
$$ plain form
19830 615194 636734 624968 688236 778776 916395 1124987 1377670 1622640 1936947 2392192
19820 2392192 3050629 4002223 5508513 7910190 11788167 17707072 25182950 30822416
19812 30822416 30166342 23942053 17069395 12486884 10106370 9244231 9546621 10997173
19804 10997173 13982873 18909521 25078016 29239424 27815173 21733608 15071908 10444965
19796 10444965 7692431 6012963 4917339 4134737 3568600 3157674 2883122 2634908 2400494
19787 2400494 2191514 2023204 1899326 1819748 1763068 1701692 1650187 1623421 1637381 1708224 1810869
19776 1810869 1885955 1938357 1967081 2040221 2194848 2429899 2718887 3052085 3488240 4025366
19766 4025366 4740162 5805009 7401898 9908529 13886492 20218364 29905023 42683450
$$ packed form
19830F15194K1540j1766O3268R0540J37619K08592K52683K44970L14307M55245
19820B392192O58437R51594J506290K401677L877977N918905P475878N639466
19812C0822416o56074o224289o872658m582511k380514q62139L02390J450552
19804A0997173K985700M926648O168495M161408j424251o081565o661700m626943
19796A0444965k752534j679468j095624p82602n66137m10926k74552k48214k34414
19787B400494k08980j68310j23878p9578n6680o1376n1505k6766J3960P0843J02645
19776A810869P5086N2402K8724P3140J54627K35051K88988L33198M36155N37126
19766D025366P14796J064847J596889K506631L977963O331872R686659J2778427
$$ plain form
19758 42683450 53900324 55721276 46699007 34484604 25355573 20244387 18072017 18132507
19750 18132507 20336783 25232480 33672822 45302223 55180433 55392935 45156778 32049559
19742 32049559 22188496 16173554 12568010 10252062 8616013 7370394 6406141 5637285
19734 5637285 4922166 4258100 3676590 3245201 2956600 2758839 2607640 2410281 2197165
19725 2197165 2005325 1847733 1693984 1572186 1469973 1404770 1356320 1312649 1300141 1301617
19715 1301617 1277669 1186323 1066596 977757 890743 837243 796064 775486 761724 710127 682731
19704 682731 685009 671661 628623 574579 566791 554723 545991 548276 534145 530933 512638 469256
19692 469256 444336 424033 401711 394800 404330 407534 436351 442609 395450 345157 302842 272061
$$ packed form
19758D2683450J1216874J820952r022269j2214403r129031n111186k172370O0490
19750A8132507K204276M895697Q440342J1629401R878210K12502j0236157j3107219
19742C2049559r861063o014942l605544k315948j636049j245619r64253p68856
19734E637285p15119o64066n81510m31389k88601j97761j51199j97359k13116
19725B197165j91840j57592j53749j21798j02213o5203m8450m3671j2508J476
19715A301617k3948r1346j19727q8839q7014n3500m1179k0578j3762n1597k7396
19704F82731K278j3348m3038n4044p788j2068q732K285j4131l212j8295m3382
19692D69256k4920k0303k2322o911R530L204K8817O258m7159n0293m2315l0781
$$ plain form
19680 272061 275054 308339 331519 334467 322334 299776 286789 308423 318136 332752 344298 373146
19668 373146 356884 349626 366964 416393 460000 523800 578093 640191 694034 769606 865855 956054
19656 956054 999495 990737 1029636 1101385 1100075 1082597 1121925 1180578 1356156 1537072 1705922
19645 1705922 1902623 2107390 2343690 2639926 3006181 3409008 3971565 4772195 5850990
19636 5850990 7361546 9601029 12994311 18150815 26064124 38179583 55138941 71401088
19628 71401088 75815273 72283695 72811333 73816864 64391809 47256076 32761352 23516503
19620 23516503 17753234 13996583 11406181 9558644 8162337 7034079 6188761 5595891
19612 5595891 5104274 4614130 4184275 3863154 3613425 3352016 3116145 2929989 2778265
$$ packed form
19680B72061K993L3285K3180K948j2133k2558j2987K1634R713J4616J1546K8848
19668C73146j6262p258J7338M9429M3607O3800N4293O2098N3843P5572R6249R0199
19656I56054M3441q758L8899P1749j310j7478L9328N8653J75578J80916J68850
19645A705922J96701K04767K36300K96236L66255M02827N62557Q00630J078795
19636E850990J510556K239483L393282N156504P913309J2115459J6959358J6262147
19628G1401088M414185l531578N27638J005531r425055j7135733j4494724r244849
19620B3516503n763269l756651k590402j847537j396307j128258q45318n92870
19612E595891m91617m90144m29855l21121k49729k61409k35871j86156j51724
$$ plain form
19603 2778265 2691206 2689337 2633093 2528684 2418531 2360259 2298104 2178568 2024292 1896665
19593 1896665 1870642 1897951 1901159 1918518 1973713 2073589 2182308 2324026 2522633 2725555 3010032
19582 3010032 3430476 4104470 5106003 6629630 9061979 12971969 19136685 28301213
19574 28301213 38537192 42832082 40520073 39820728 41157735 37592334 28283142 19339699
19566 19339699 13600525 10161407 7988829 6530859 5487075 4705157 4094900 3672717
19558 3672717 3334037 3056489 2812770 2578881 2386359 2203361 1997490 1829337 1726885
19549 1726885 1657251 1572534 1538143 1500865 1449849 1400599 1368423 1331892 1263947 1154301 1037683
19538 1037683 945062 925813 918005 900744 886449 863337 816428 782310 753363 739386 740238 714809
$$ packed form
19603B778265q7059j869n6244j04409j10153n8272o2155j19536j54276j27627
19593A896665k6023K7309L208J7359N5195R9876J08719J41718J98607K02922K84477
19582C010032M20444O73994J001533J523627K432349L909990O164716R164528
19574B8301213J0235979M294890k312009o99345J337007l565401r309192q943443
19566A9339699n739174l439118k172578j457970j043784p81918o10257m22183
19558C672717l38680k77548k43719k33889j92522j82998k05871j68153j02452
19549A726885o9634q4717l4391l7278n1016m9250l2176l6531o7945j09646j16618
19538A037683r2621j9249p808j7261j4295k3112m6909l4118k8947j3977Q52k5429
$$ plain form
19526 714809 649888 645780 644221 635960 622612 616009 619915 621946 614620 609667 579760 586133 576328
19513 576328 553836 524377 504188 484544 516647 506185 515053 506787 495530 493852 498268 533811
19501 533811 549641 571029 588798 580575 560680 535527 491695 456242 458005 450532 428463 401513
19489 401513 397552 396035 393041 387184 388525 381708 362812 366100 344182 335699 331960 360800 379877
19476 379877 404472 401598 361228 359076 357943 345312 326097 307204 285820 299863 307511 313684
19464 313684 324016 357386 329649 311827 310982 339233 325734 338323 353663 337341 286790 254346
19452 254346 236578 254147 269179 289426 307457 309762 306111 320525 325468 341525 312691 300265
19440 300265 287667 308982 306293 313422 287592 303622 305890 302263 295290 301518 285202 257109 236478
$$ packed form
19526G14809o4921m108j559q261j3348o603L906K031p326m953k9907O373r805
19513E76328k2492k9459k0189j9644L2103j0462Q868q266j1257j678M416L5543
19501E33811J5830K1388J7769q223j9895k5153m3832l5453J763p473k2069k6950
19489D01513l961j517k994n857J341o817j8896L288k1918q483l739K8840J9077
19476C79877K4595k874m0370k152j133j2631j9215j8893k1384J4043P648O173
19464C13684J0332L3370k7737j7822q45K8251j3499J2589J5340j6322n0551l2444
19452B54346j7768J7569J5032K0247J8031K305l651J4414M943J6057k8834j2426
19440C00265j2598K1315k689P129k5830J6030K268l627o973O228j6316k8093k0631
$$ plain form
19427 236478 247861 245980 228637 224726 212562 203487 202859 197129 207338 238250 223723 194676 183690
19414 183690 159065 154739 175235 201114 213829 201274 209309 221849 211690 198741 175679 189331
19402 189331 194165 210501 224307 233975 234497 211805 196843 204230 212283 198298 192419 201177 205299
19389 205299 214362 204594 180055 163501 149046 163198 174313 206650 191354 185736 190703 187375
19377 187375 204431 188911 188925 198515 201231 224798 239935 205748 174374 182709 201032 205311 204810
19364 204810 172929 195908 206479 208395 192716 166098 174314 193257 195730 166599 134089 120393
19352 120393 127599 126511 129862 138085 140678 184865 186935 191585 194361 191655 187780 172958 182826 168230
19338 168230 143735 151473 170296 164545 181635 188036 208875 239754 238986 230352 191506 177341 149589
$$ packed form
19427B36478J1383j881j7343l911j2164r075o28n730J0209L0912j4527k9047j0986
19414A83690k4625m326K0496K5879J2715j2555Q035J2540j0159j2949k3062J3652
19402A89331M834J6336J3806R668N22k2692j4962P387Q053j3985n879Q758M122
19389B05299R063r768k4539j6554j4455J4152J1115L2337j5296n618M967l328
19377A87375J7056j5520J4R590K716K3567J5137l4187l1374Q335J8323M279n01
19364B04810l1881K2979J0571J916j5679k6618Q216J8943K473k9131l2510j3696
19352A20393P206j088L351Q223K593M4187K070M650K776k706l875j4822R868j4596
19338A68230k4495P738J8823n751J7090O401K0839L0879p68q634l8846j4165k7752
$$ plain form
19325 149589 160635 172343 157094 169035 167972 182977 169435 156686 168177 161764 130355 122150
19313 122150 155852 162818 146535 171021 174749 134519 99794 110774 124776 121939 144117 150598
19301 150598 130311 112396 106303 101709 109225 116539 126004 124836 125790 131429 117364 126056 159726
19288 159726 183199 179957 178119 182547 198771 254640 303323 314141 332449 315681 284355 239765
19276 239765 223357 197330 214168 252039 230733 214963 260796 300984 302615 293446 267484 255501
19264 255501 215976 180118 155436 137699 113889 67668 80457 115225 97035 100131 112723 126893
19252 126893 129500 113137 86628 77969 69996 88176 116961 115137 117692 88099 57990 49259 64653
19239 64653 91109 106597 119912 103968 106128 141793 153375 128829 157928 170239 175670 193934
$$ packed form
19325A49589J1046J1708j5249J1941j063J5005j3542j2749J1491o413l1409q205
19313A22150L3702O966j6283K4486L728m0230l4725J0980J4002k837K2178O481
19301A50598k0287j7915o093m594P516P314R465j168R54N639j4065Q692L3670
19288A59726K3473l242j838M428J6224N5869M8683J0818J8308j6768l1326m4590
19276B39765j6408k6027J6838L7871k1306j5770M5833M0188J631r169k5962j1983
19264B55501l9525l5858k4682j7737k3810m6221J2789L4768j8190L096J2592J4170
19252A26893K607j6363k6509q659p973J8180K8785j824K555k9593l0109q731J5394
19239F4653K6456J5488J3315j5944K160L5665J1582k4546K9099J2311N431J8264
$$ plain form
19227 193934 230302 244149 233094 225790 234104 236581 216520 191162 195670 186670 173990 169233 183630
19214 183630 224804 240963 262986 256656 210806 189370 193044 212759 204613 178344 155470 143647
19202 143647 155171 159549 155163 154110 132760 131604 125717 145246 119377 69468 30231 39178 30355
19189 30355 13448 28406 68601 59403 71128 77006 72011 81990 59028 65737 83122 112035 95938
19176 95938 72956 87621 89748 91172 97169 78292 40481 80196 98179 119929 130635 113310
19164 113310 76357 77841 98414 111850 94398 70034 73685 66376 63928 62521 69215 102494 82869
19151 82869 71611 79844 70596 88341 99607 82207 87593 104855 85231 76560 104867 122566
19139 122566 117118 104779 90599 64554 55851 78250 63036 57220 60064 58771 74130 70143 79218
$$ packed form
19227A93934L6368J3847j1055p304Q314K477k0061k5358M508r000j2680m757J4397
19214A83630M1174J6159K2023o330m5850k1436L674J9715q146k6269k2874j1823
19202A43647J1524M378m386j053k1350j156n887J9529k5869m9909l9237Q947q823
19189C0355j6907J4958M0195r198J1725N878m995R979k2962O709J7385K8913j6097
19176I5938k2982J4665K127J424N997j8877l7811L9715J7983K1750J0706j7325
19164A13310l6953J484K0573J3436j7452k4364L651p309k448j407O694L3279j9625
19151H2869j1258Q233r248J7745J1266j7400N386J7262j9624q671K8307J7699
19139A22566n448j2339j4180k6045q703K2399j5214n816K844j293J5359l987R075
$$ plain form
19126 79218 72458 53887 51429 76816 108533 99202 107173 127302 92110 79990 89003 117250 109513
19113 109513 108842 110128 111314 125715 131194 150891 183617 247426 321607 363012 384386 388922 387572
19100 387572 385340 346095 266935 215086 192805 163967 145090 140357 129366 96865 100462 119204
19088 119204 122502 104949 95199 74244 72582 83018 125371 141142 121957 105896 80821 86621
19076 86621 101167 82958 62821 36608 32563 86057 113626 113615 114324 109311 96940 128738 125557
19063 125557 115314 89555 68973 66517 71834 61320 47941 48777 16478 53880 101891 133505
19051 133505 167003 242599 297975 323188 349758 340580 303988 262281 215067 183210 178635 159047
19039 159047 126225 95880 75402 50435 52448 44606 45704 29019 17015 31068 39634 45918
$$ packed form
19126G9218o760j8571k458K5387L1717r331P971K0129l5192j2120R013K8247p737
19113A09513o71J286J186J4401N479J9697L2726O3809P4181M1405K1374M536j350
19100C87572k232l9245p9160n1849k2281k8838j8877m733j0991l2501L597J8742
19088A19204L298j7553r750k0955j662J0436M2353J5771j9185j6061k5075N800
19076H6621J4546j8209k0137k6213m045N3494K7569j1P09n013j2371L1798l181
19063A25557j0243k5759k0582k456N317j0514j3379Q36l2299L7402M8011L1614
19051A33505L3498P5596N5376K5213K6570r178l6592m1707m7214l1857m575j9588
19039A59047l2822l0345k0478k4967K013p842J098j6685j2004J4053Q566O284
$$ plain form
19027 45918 59271 45202 67414 79534 92072 114835 125541 115128 84353 40212 42925 100206
19015 100206 94998 57860 59317 50475 54205 54090 54314 49197 25823 30801 44230 34667 43231 75116
19001 75116 71208 74456 39017 28192 31733 53407 58947 74010 62211 59564 50947 42166 55972
18988 55972 73395 93041 79372 77378 60042 36061 26175 46794 68072 70601 75031 54834
18976 54834 57309 76675 74526 77198 78926 63730 68823 108176 132511 117107 80543 73300 89294
18963 89294 82903 92870 78342 87449 91361 66200 34153 47185 65612 86306 78662 87159 73064
18950 73064 31822 15316 29458 31191 45705 87737 93732 113295 85934 25176 13201 23431
18938 23431 19265 34732 57282 51416 24437 8909 39437 55802 69737 28684 -16882 -14781
$$ packed form
19027D5918J3353j4069K2212J2120J2538K2763J0706j0413l0775m4141K713N7281
19015A00206n208l7138J457q842L730j15K24n117k3374M978J3429r563Q564L1885
19001G5116l908L248l5439j0825L541K1674N540J5063j1799k647q617q781J3806
18988E5972J7423J9646j3669j994j7336k3981r886K0619K1278K529M430k0197
18976E4834K475J9366k149K672J728j5196N093L9353K4335j5404l6564p243J5994
18963H9294o391R967j4528R107L912k5161l2047J3032J8427K0694p644Q497j4095
18950G3064m1242j6506J4142J733J4514M2032N995J9563k7361o0758j1975J0230
18938B3431m166J5467K2550n866k6979j5528L0528J6365J3935m1053m5566K101
$$ plain form
18926 -14781 3046 35948 30695 35268 31507 39571 67613 64544 80014 59310 62645 94245 78509
18913 78509 73886 78478 59775 59423 49527 26269 8660 -6779 -16353 -6009 14057 1529 2357
18900 2357 6644 16518 3447 20198 26735 23850 38551 27436 39844 36049 13080 22173 6742
18887 6742 38772 60569 69896 78507 82694 78574 42283 -15064 -41504 12855 38322 21860 24482
18874 24482 16698 6 27661 65535 79395 60296 56250 73324 80174 58403 60157 55893 61297
18861 61297 67037 51451 28422 25205 49104 39161 52994 51177 43347 40615 46394 37997 34890
18848 34890 30854 40133 59499 89214 85708 63360 47789 45862 55396 42041 45036 74992 67200
18835 67200 64626 58908 36839 24565 2470 16166 27237 48580 51285 59283 47671 54948 33716
$$ packed form
18926a4781J7827L2902n253M573l761Q064K8042l069J5470k0704L335L1600j5736
18913G8509m623M592j8703l52r896k3258j7609j5439r574J0344K0066j2528Q28
18900B357M287R874j3071J6751O537k885J4701j1115J2408l795k2969R093j5431
18887F742L2030K1797R327Q611M187m120l6291n7347k6440N4359K5467j6462K622
18874B4482p784j6692K7655L7874J3860j9099m046J7074O850k1771J754m264N404
18861F1297N740j5586k3029l217K3899r943J3833j817p830k732N779q397l107
18848C4890m036R279J9366K9715l506k2348j5571j927R534j3355K995K9956p792
18835F7200k574n718k2069j2274k2095J3696J1071K1343K705P998j1612P277k1232
$$ plain form
18822 33716 20826 35767 18646 34377 33970 22875 -1243 -17540 -21800 5126 27420 50799
18810 50799 50618 50927 64957 63380 57666 56560 56078 44808 56520 62394 74348 66545 51708 48496
18796 48496 64617 91568 83930 78876 67477 44250 41121 20302 -6021 5569 27790 29175
18784 29175 28853 36541 71233 77512 57184 13597 -5008 -3078 41607 27771 21102 3246 1356
18771 1356 -9105 -12813 6895 39406 40065 849 -12998 -7175 19158 5384 12514 20019 26059
18758 26059 22644 8746 4580 -8856 -3540 2207 -8035 22288 57666 49589 6630 2435 -9953
18745 -9953 142 7301 44407 52050 56689 45302 31084 49862 67823 65050 54998 20888 -35112
18732 -35112 -23886 10558 33914 31367 45410 34044 16827 17059 22767 29390 -2201 -30810 -41402
$$ packed form
18822C3716j2890J4941j7121J5731m07j1095k4118j6297m260K6926K2294K3379
18810E0799j81L09J4030j577n714j106m82j1270J1712N874J1954p803j4837l212
18796D8496J6121K6951p638n054j1399k3227l129k0819k6323J1590K2221J385
18784B9175l22P688L4692O279k0328m3587j8605J930M4685j3836o669j7856j890
18771A356j0461l708J9708L2511O59l9216j3847N823K6333j3774P130P505O040
18758B6059l415j3898m166j3436N316N747j0242L0323L5378q077m2959m195j2388
18745i953J0095P159L7106P643M639j1387j4218J8778J7961k773j0052l4110n6000
18732c5112J1226L4444K3356k547J4043j1366j7217K32N708O623l1591k8609j0592
$$ plain form
18719 -41402 -11786 1915 -9714 -5717 24902 38420 18857 -20387 -23080 572 24392 26187
18707 26187 35161 52879 40824 46969 60193 53973 44875 30602 40471 35107 19621 33930 21010
18694 21010 14723 17304 37601 59262 57415 46432 74442 70340 36524 42608 44456 68479 68301
18681 68301 51721 27470 27363 48411 42055 49946 37134 -4843 -14541 69 2106 7956 3462
18668 3462 -3442 -16016 9986 10173 12709 3991 3676 -7211 3100 29242 7158 20640 32773
18655 32773 16326 -5702 -20590 -16816 16043 35745 43622 13536 -16549 -18307 -6558 -18058
18643 -18058 -14702 1492 21254 33387 35568 52733 65669 47208 54258 68764 44189 28711
18631 28711 25740 21119 37853 22109 22753 15797 33085 25855 31959 54358 67965 55238 23332
$$ packed form
18719d1402K9616J3701j1629L997L0619J3518j9563l9244k693K3652K3820J795
18707B6187Q974J7718j2055O145J3224o220r098j4273R869n364j5486J4309j2920
18694B1010o287K581K0297K1661j847j0983K8010m102l3816O084J848K4023j78
18681F8301j6580k4251j07K1048o356P891j2812m1977r698J4610K037N850m494
18668C462o904j2574K6002J87K536q718l15j0887J0311K6142k2084J3482J2133
18655C2773j6447k2028j4888L774L2859J9702P877l0086l0085j758J1749j1500
18643a8058L356J6194J9762J2133K181J7165J2936j8461P050J4506k4575j5478
18631B8711k971m621J6734j5744O44o956J7288p230O104K2399J3607j2727l1906
$$ plain form
18618 23332 34237 35853 299 10968 9516 -175 35096 84468 91486 60038 27161 36491 36787
18605 36787 28011 30555 -1755 -3954 -4964 -26087 -35729 -28534 -2183 25730 29135 42958 22964
18592 22964 22098 35032 21678 -17448 -21683 3442 9488 19324 46151 33690 13357 6730 12168
18579 12168 16790 -7439 -8527 -34206 -19652 -4864 18008 12998 9086 8213 16530 -21251 -19646
18566 -19646 -21005 -20080 14455 13436 6026 7669 7407 10646 14058 19338 -5779 12573 13684 4881
18552 4881 -20430 -27678 -31775 3798 8923 6761 29975 22084 15477 6777 34636 42725 48289 38582
18538 38582 14844 20989 -15342 -17737 8848 37215 91162 68562 37933 32222 45161 45283 18163
18525 18163 11189 -2972 -2241 -15753 8185 40282 32301 24848 -7382 -17238 -51092 -45254 -29820
$$ packed form
18618B3332J0905J616l5554J0669j452r691L5271M9372P018l1448l2877R330K96
18605C6787q776K544l2310k199j010k1123r642P195K6351K7913L405J3823j9994
18592B2964q66J2934j3354l9126m235K5125O046R836K6827j2461k0333o627N438
18579A2168M622k4229j088k5679J4554J4788K2872n010l912q73Q317l7781J605
18566a9646j359R25L4535j019p410J643k62L239L412N280k5117J8352J111q803
18552D881k5311p248m097L5573N125k162K3214p891o607q700K7859Q089N564r707
18538C8582k3738O145l6331k395K6585K8367N3947k2600l0629n711J2939J22k7120
18525A8163o974j4161P31j3512K3938L2097p981p453l2230r856l3854N838J5434
$$ plain form
18512 -29820 -33595 -18336 11642 36056 43585 22964 27051 44225 27398 -17359 -34160 9374
18500 9374 25757 52635 75878 78322 52473 36722 11542 -9140 -17147 18156 896 -9001
18488 -9001 6797 28228 54278 52192 43527 52040 45326 31249 -2544 -2574 11556 3351 -772 2426
18474 2426 723 -2884 -6950 -12753 13427 19793 8917 13363 9597 16753 39368 43200 19763 25198
18460 25198 41174 41547 67469 56104 54756 54573 47030 36958 7671 -2055 -6990 13715 8517
18447 8517 -21419 -9629 7607 29283 34830 17330 22467 37086 29853 17622 22167 27737 21859
18434 21859 27565 37021 22516 52329 58032 41068 41286 54822 22891 18421 33375 23873 20970
18421 20970 -3988 -12436 -13402 -24912 -30727 -49311 -33998 -16066 -1684 27878 18896 5940 15833
$$ packed form
18512b9820l775J5259K9978K4414P529k0621M087J7174j6827m4757j6801M3534
18500I374J6383K6878K3243K444k5849j5751k5180k0682q007L5303j7260r897
18488i001J5798K1431K6050k086q665Q513o714j4077l3793l0J4130q205m123L198
18474B426j703l607m066n803K6180O366j0876M446l766P156K2615L832k3437N435
18460B5198J5976L73K5922j1365j348j83p543j0072k9287r726m935K0705n198
18447H517k9936J1790J7236K1676N547j7500N137J4619p233j2231M545N570n878
18434B1859N706R456j4505K9813N703j6964K18J3536l1931m470J4954r502k903
18421B0970k4958q448r66j1510n815j8584J5313J7932J4382K9562q982j2956R893
$$ plain form
18408 15833 855 29967 47231 24689 29656 18880 -201 218 2596 29548 54007 73927
18396 73927 71133 64131 48915 3413 13003 41552 38491 35714 26887 8510 4805 -8537 -8062
18383 -8062 -10641 13686 52694 29642 -24272 -28896 -12752 -468 -7171 11458 3299 5854 25179
18370 25179 6459 29947 29259 22217 16780 9277 12893 17110 25180 -8145 -17013 5946 12631 -16622
18356 -16622 -49858 -47226 -42573 -34664 -16396 -15262 -31338 -28058 -9576 -18771 -23150 -10455 1889
18343 1889 17670 39697 44731 49535 28522 41187 48246 12669 -17506 1766 -2990 -1863 -18761
18330 -18761 -11661 -14532 -12520 -16460 2319 11098 29867 40185 57370 44180 -2528 -61299 -71216
18317 -71216 -44742 -1271 -2799 -28102 -12790 15468 38574 30387 32929 37232 36006 38515 35963
$$ packed form
18408A5833j4978K9112J7264k2542M967j0776j9081M19K378K6952K4459J9920
18396G3927k794p002j5216m5502R590K8549l061k777q827j8377l705j3342M75
18383h062k579K4327L9008k3052n3914m624J6144J2284o703J8629q159K555J9325
18370B5179j8720K3488o88p042n437p503L616M217Q070l3325q868K2959O685k9253
18356a6622l3236K632M653P909J8268J134j6076L280J8482r195m379J2695J2344
18343A889J5781K2027N034M804k1013J2665P059l5577l0175J9272m756J127j6898
18330a8761P100k871K012l940J8779Q779J8769J0318J7185j3190m6708n8771r917
18317g1216K6474M3471j528k5303J5312K8258K3106q187K542M303j226K509k552
$$ plain form
18304 35963 10981 13775 13336 1265 -34585 -46214 -43152 -23618 -3374 24480 43240 49430 39508
18291 39508 32474 30842 47485 65225 48175 12650 -6936 11629 36484 31015 13798 17152
18279 17152 12590 -12163 -34578 -30675 -14231 -16703 -25796 -46111 -59710 -42051 -30699 -17359
18267 -17359 -26738 -24568 -45585 -57071 -49703 -27482 -22681 -8968 16656 31228 33453 18676 28103
18254 28103 27732 4545 -21274 -42132 -28110 17320 23805 -5481 5315 -2748 17397 -6979
18242 -6979 -19568 -15233 14213 27675 18651 17745 -1717 -18938 -27666 -24759 -16512 18776 31447
18229 31447 -12459 -32807 -29440 -14245 -15991 -13909 2588 12228 25079 -18002 -35510 -30629 -14897
18216 -14897 -17763 -25843 -18102 -15625 -25897 -33399 7666 10324 -743 -25809 -34117 -11942 9255
$$ packed form
18304C5963k4982K794m39j2071l5850j1629L062J9534K0244K7854J8760O190r922
18291C9508p034j632J6643J7740j7050l5525j9586J8565K4855n469j7217L354
18279A7152m562k4753k2415L903J6444k472r093k0315j3599J7659J1352J3340
18267a7359r379K170k1017j1486P368K2221M801J3713K5624J4572K225j4777R427
18254B8103l71k3187k5819k0858J4022M5430O485k9286J0796q063K0145k4376
18242f979j2589M335K9446J3462r024r06j9462j7221q728K907Q247L5288J2671
18229C1447m3906k0348L367J5195j746K082J6497R640J2851m3081j7508M881J5732
18216a4897k866q080P741K477j0272p502M1065K658j1067k5066q308K2175K1197
$$ plain form
18203 9255 21336 833 2994 -31513 -20664 -28644 -29989 -15541 5352 -9869 -21909 -24576 -47337
18190 -47337 -53114 -33715 17904 38343 28285 33309 10370 5695 -12496 -8647 -9224 -14042 -15380
18177 -15380 5473 38502 37128 25055 30296 49353 52394 18576 6154 -6389 9587 -8779
18165 -8779 -5733 24643 47564 21759 11254 26251 29690 14790 17194 24116 20077 24545 7835
18152 7835 -2970 -7096 26122 44216 43560 56001 34984 4516 208 31081 47779 45919 28405
18139 28405 13379 5456 -12713 -5286 -22122 -33087 -47656 -54532 -38663 -4918 5167 -12041
18127 -12041 -13727 -24672 -43772 -53749 -42193 -26791 -37104 -53742 -46736 -8092 16276 16995 2525
18114 2525 -3239 -21080 13574 -239 3418 27824 46849 34290 25117 18216 -23054 -20989 10496
$$ packed form
18203I255J2081k0503K161l4507J0849p980j345J4448K0893j5221j2040k667k2761
18190d7337n777J9399N1619K0439j0058N024k2939m675j8191L849n77m818j338
18177a5380K0853L3029j374j2073N241J9057L041l3818j2422j2543J5976j8366
18165h779L046L0376K2921k5805j0505J4997L439j4900K404O922m039M468j6710
18152G835j0805m126L3218J8094o56J2441k1017l0468m308L0873J6698j860j7514
18139B8405j5026p923j8169P427j6836j0965j4569o876J5869L3745J0085j7208
18127a2041j686j0945j9100r977J1556J5402j0313j6638P006L8644K4368P19j4470
18114B525n764j7841L4654j3813L657K4406J9025j2559r173o901m1270K065L1485
$$ plain form
18101 10496 9221 -3343 -10388 -40841 -17823 -1937 13264 3952 11993 7731 3770 -1356 -24477
18088 -24477 -33482 1316 23656 14301 30420 47400 54840 62208 37290 3195 -12278 -20992 -25946
18075 -25946 -4516 22309 42333 35296 -11721 2648 2160 -28258 -13842 -487 -14058 -21142
18063 -21142 -4196 -26023 -35408 7366 47648 48422 28069 20704 3089 14407 -5053 -12549 15004
18050 15004 26125 29932 12565 -18128 5983 -6605 4528 33389 -7620 -21590 -23211 -28129
18038 -28129 -24209 4674 20383 7059 39291 70445 48439 16672 9096 13520 -5985 3148
18026 3148 32746 35679 -19402 -24906 8400 5556 7696 14065 20049 26115 33014 29545 -1643 -11011
18012 -11011 -15473 -17967 -29297 5651 21080 13425 33457 42868 29304 4352 -12033 -20318 2069
$$ packed form
18101A0496j275j2564p045l0453K3018J5886J5201r312Q041m262l961n126k3121
18088b4477r005L4798K2340r355J6119J6980P440P368k4918l4095j5473q714m954
18075b5946K1430K6825K0024p037m7017J4369m88l0418J4416J3355j3571p084
18063b1142J6946k1827r385M2774M0282P74k0353p365j7615J1318j9460p496K7553
18050A5004J1121L807j7367l0693K4111j2588J1133K8861m1009j3970j621m918
18038b8129L920K8883J5709j3324L2232L1154k2006l1767p576M424j9505R133
18026C148K9598K933n5081n504L3306k844K140O369N984O066O899l469l1188r368
18012a1011m462k494j1330L4948J5429p655K0032R411j3564k4952j6385q285K2387
$$ plain form
17999 2069 44381 43500 53936 41667 6943 12094 25752 -20325 -62695 -30736 -17290 1641
17987 1641 -17717 -29007 -9427 6224 9992 2141 2308 16237 36531 12513 -17341 -30450 -12963
17974 -12963 3823 -14745 -28624 -31668 11988 30979 19282 2043 13491 -3786 -5426 -32590
17962 -32590 -39518 -12735 -1778 -8658 -32843 -13200 26614 31798 34441 42899 29948 21912 23329
17949 23329 -9568 -21626 -8010 -7604 -8287 -39077 -56344 -37812 -8781 28479 28874 27805 8474
17936 8474 -22637 18246 17509 22572 21947 3011 -10565 -24837 -17646 -16573 -33979 -38760 6027
17923 6027 22148 19460 26889 20939 18591 30254 17767 -1918 -23499 -16320 12690 37124 16602
17910 16602 19040 11154 14330 33206 34622 16936 6410 22862 24082 7252 5098 10889 -30814
$$ packed form
17999B069M2312q81J0436j2269l4724N151J3658m6077m2370L1959J3446J8931
17987A641j9358j1290J9580J5651L768p851J67J3929K0294k4018k9854j3109J7487
17974a2963J6786j8568j3879l044M3656J8991j1697j7239J1448j7277j640k7164
17962c2590o928K6783J0957o880k4185J9643L9814N184K643Q458j2951q036J417
17949B3329l2897j2058J3616M06o83l0790j7267J8532K9031L7260L95j069j9331
17936H474l1111M0883p37N063o25j8936j3576j4272P191J073j7406m781M4787
17923F027J6121k688P429n950k348J1663j2487j9685k1581P179K9010K4434k0522
17910A6602K438p886L176J8876J416j7686j0526J6452J220j6830k154N791m1703
$$ plain form
17897 -30814 -54679 -59165 -39817 -29256 -31320 -15342 -6336 -34765 -36205 -39965 -34282 -34569 -34258 -52320
17883 -52320 -24090 -7906 -3791 -2202 33382 58996 42871 8602 13553 33116 14673 -29849
17871 -29849 6108 56745 64097 56272 53673 41219 23900 7369 230 11771 16542 45759 16679
17858 16679 -20026 -16493 -1701 -11070 -22357 -22799 -1972 -3730 -22398 -28276 -20858 -21695 2120
17845 2120 -9779 -33007 -37966 -7800 -9013 -4041 18451 10678 -12974 -27415 -16902 -14204 -28940
17832 -28940 -37979 -79753 -67393 -32963 -11359 -24856 -18707 -23885 -25695 -27861 -22196 -4761 -11681
17819 -11681 -37803 -11632 -2566 -8756 11049 37973 3267 -27302 -32535 -46724 -48047 -43147 -28028
17806 -28028 -11933 -10605 -7916 11140 6674 -10476 -14414 4446 1304 -9695 -26407 -34995 -14422
$$ packed form
17897c0814k3865m486J9348J0561k064J5978R006k8429j440l760N683k87L11j8062
17883e2320K8230J6184M115J589L5584K5614j6125l4269M951J9563j8443m4522
17871b9849L5957N0637P352p825k599j2454j7319j6531p139J1541M771K9217k9080
17858A6679l6705L533J4792r369j1287m42K0827j758j8668n878P418q37K3815
17845B120j1899k3228m959L0166j213M972K2492p773k3652j4441J0513K698j4736
17832b8940r039m1774J2360L4430K1604j3497O149n178j810k166N665J7435o920
17819a1681k6122K6171R066o190J9805K6924l4706l0569n233j4189j323M900J5119
17806b8028J6095J328K689J9056m466j7150l938J8860l142j0999j6712q588K0573
$$ plain form
17793 -14422 34926 58813 42705 32852 32433 41380 21088 -25024 -9498 9905 -3476 -11181 -4670
17780 -4670 20385 29907 4580 17675 7058 -25508 -19092 -14835 -47179 -65669 -13892 30791
17768 30791 11742 9554 -12324 -5863 4323 -13096 -18371 -186 -12245 -23385 -32107 -25626 -5444
17755 -5444 40555 50406 34785 23267 12875 22563 -14767 -27427 -13877 9089 14183 -16694
17743 -16694 -36888 -22991 -9330 -22217 -25908 23261 37503 5280 -30048 -54379 -25376 23617
17731 23617 21834 -425 3006 19229 7209 14205 49863 33547 1177 -6476 -12491 3673 31827
17718 31827 17333 -13149 -20498 -12939 -19343 -18428 7987 20344 15761 1641 -29153 -30431 -70
17705 -70 3055 -6388 -23947 6721 7416 4069 11296 -2825 -19318 -9493 5521 -7506 3540 -6624
$$ packed form
17793a4422M9348K3887j6108r853m19Q947k0292m6112J5526J9403j3381p705O511
17780d670K5055R522k5327J3095j0617l2566O416M257l2344j8490N1777M4683
17768C0791j9049k188k1878O461J0186j7419n275J8185j2059j1140q722O481K0182
17755e444M5999R851j5621j1518j0392R688l7330j2660J3550K2966N094l0877
17743a6694k0194J3897J3661j2887l691M9169J4242l2223l5328k4331K9003M8993
17731B3617j783k2259L431J6223j2020O996L5658j6316l2370p653o015J6164K8154
17718C1827j4494l0482p349P559o404R15K6415J2357m583j4120l0794j278L0361
17705g0L125r443j7559L0668O95l347P227j4121j6493R825J5014j3027J1046j0164
$$ plain form
17691 -6624 6364 39064 21651 29212 38663 32691 12273 15576 22581 -5330 -23525 -13545 -36600
17678 -36600 -28013 -4254 -22542 -61706 -36964 -16421 -15108 -19417 6181 39085 33018 20167
17666 20167 11165 5027 -23263 -26786 -27803 -31308 -33444 -31050 -5989 -6950 -20031 -24747 -22198 -34867
17652 -34867 -29237 -12519 15595 11960 231 10701 21346 -7375 -13700 -6180 -3463 -1560 -28330
17639 -28330 -51431 -50892 -38964 -16504 2952 17407 46924 49573 6120 -25947 -25366 -22384 -20126
17626 -20126 -19592 -39201 -31212 -44378 -10741 31854 22627 -14974 -16996 -2214 -378 9654 -11255
17613 -11255 -20484 -43597 -36904 -20894 -31529 -18379 -4538 22920 19474 26833 48878 31532
17601 31532 10763 3314 18513 10169 -10012 -10624 -20602 -4380 -1014 -13007 -898 7962 4459
$$ packed form
17691f624J2988L2700j7413P561R451n972k0418L303P005k7911j8195R980k3055
17678c6600Q587K3759j8288l9164K4742K0543J313m309K5598L2904o067j2851
17666B0167r002o138k8290l523j017l505k136K394K5061r61j3081m716K549j2669
17652c4867N630J6718K8114l635j1729J0470J0645k8721o325P520K717J903k6770
17639b8330k3101N39J1928K2460J9456J4455K9517K649m3453l2067N81K982K258
17626b0126N34j9609P989j3166L3637M2595r227l7601k022J4782J836J0032k0909
17613a1255r229k3113O693J6010j0635J3150J3841K7458l446P359K2045j7346
17601C1532k0769p449J5199q344k0181o12r978J6222L366j1993J2109Q860l503
$$ plain form
17588 4459 -2591 -6522 -23049 -46245 -59680 -26433 -9101 -14942 -17216 -18421 -13245 -25465 -11676
17575 -11676 -9060 -9811 -25334 -32628 -28845 -6007 -3063 -35845 -33720 -50613 -38960 -24718 17534
17562 17534 32344 16926 6291 600 11933 7266 -10748 -46322 -52066 -34257 -8000 -17577
17550 -17577 -34360 -29805 -48667 -60776 -41806 -24798 -27761 -12262 9313 -1314 -10892 1151
17538 1151 18306 37975 31258 14155 -13101 -34992 -50525 -53768 -11544 -5362 -38081 -37665 -41398
17525 -41398 -41799 -30794 -11610 -14881 -10310 -16989 -36468 -48032 -25149 -27594 -10221 -793 9098
17512 9098 -8403 -27953 -21740 13917 30187 15706 16802 -13594 -40482 -32809 -35352 -32413 -9155
17499 -9155 -10891 -33374 -37997 -18131 -16486 -9299 25437 26416 6909 2504 5106 11019 23132 37633
$$ packed form
17588D459p050l931j6527k3196j3435L3247J7332n841k274j205N176j2220J3789
17575a1676K616p51j5523p294L783K2838K944l2782K125j6893J1653J4242M2252
17562A7534J4810j5418j0635n691J1333m667j8014l5574n744J7809K6257r577
17550a7577j6783M555j8862j2109J8970J7008k963J5499K1575j0627r578J2043
17538A151J7155J9669o717j7103k7256k1891j5533l243M2224O182l2719M16l733
17525d1398m01J1005J9184l271M571o679j9479j1564K2883k445J7373R428R891
17512I098j7501j9550O213L5657J6270j4481J096l0396k6888P673k543K939K3258
17499i155j736k2483m623J9866J645P187L4736R79j9507m405K602N913J2113J4501
$$ plain form
17485 37633 45733 38167 24366 7089 5536 -16587 -45682 -49766 -41828 -13767 8477 23876 46579
17472 46579 52459 34857 6781 -9149 -27006 -34341 -61310 -62761 -37889 -25615 -20946 -6216
17460 -6216 19164 19021 -9800 9592 4572 -14144 -41096 -23595 -18651 3480 9266 -11969 -25329
17447 -25329 -6118 3161 23494 57984 60325 41593 43218 40251 15922 -29650 -57417 -33273
17435 -33273 8454 14421 -8662 -18195 -22785 -40176 -9000 6998 18692 12167 27291 59296
17423 59296 70652 52505 46556 56168 20293 3719 4334 15049 18621 17480 10434 13452 23733
17410 23733 26052 12955 -12069 -13580 -18003 -28442 -14528 23569 42289 86881 84982 47127
17398 47127 37921 49570 64859 74192 51861 -4864 -18345 -14746 17058 22440 2228 -3769 -2638
$$ packed form
17485C7633Q100p566j3801j7277j553k2123k9095m084P938K8061K2244J5399K2703
17472D6579N880j7602k8076j5930j7857p335k6969j451K4872J2274M669J4730
17460f216K5380j43k8821J9392n020j8716k6952J7501M944K2131N786k1235j3360
17447b5329J9211R279K0333L4490K341j8732J625k967k4329m5572k7767K4144
17435c3273M1727N967k3083r533m590j7391L1176J5998J1694o525J5124L2005
17423E9296J1356j8147n949R612l5875j6574O15J0715L572j141p046L018J0281
17410B3733K319j3097k5024j511m423j0439J3914L8097J8720M4592j899l7855
17398D7127r206J1649J5289R333k2331n6725j3481L599L1804N382k0212n997J131
$$ plain form
17385 -2638 -20478 -12732 3305 -9772 -23065 -36673 -9032 20176 18260 21881 -16877 -35145
17373 -35145 -32618 5023 -2038 -20681 -19502 -10369 9539 35763 41135 41285 26527 30100 35515
17360 35515 26085 22641 14610 -1807 -9390 1840 -9335 -19032 -32902 -38857 -44556 -52836 -45342
17347 -45342 13458 41873 45467 15597 -14613 -21234 -12635 -16994 -12384 14894 26812 30693 47230
17334 47230 39925 15568 -15025 -9542 -12128 10519 42813 29404 22316 19754 8238 -34192 -49970
17321 -49970 -37106 -1885 4248 -19150 -24484 -32788 -50994 -30687 1616 10759 -28039 -27361 -16806
17308 -16806 -4806 -548 5838 36082 15183 -8283 -25024 6008 18805 20402 35825 43073
17296 43073 42009 28007 26320 25484 28293 43177 27592 -7263 -30546 -9465 2492 13375 18166
$$ packed form
17385b638j7840P746J6037j3077j3293j3608K7641K9208j916L621l8758j8268
17373c5145K527L7641p061j8643J179R133J9908K6224N372J50j4758L573N415
17360C5515r430l444q031j6417p583J1230j1175r697j3870n955n699q280P494
17347d5342N8800K8415L594k9870l0210o621Q599m359M610K7278J1918L881J6537
17334D7230p305k4357l0593N483k586K2647L2294j3409p088k562j1516m2430j5778
17321d9970J2864L5221O133k3398n334q304j8206K0307L2303R143l8798O78J0555
17308a6806J2000M258O386L0244k0899k3466j6741L1032J2797J597J5423P248
17296D3073j064j4002j687q36K809J4884j5585l4855k3283K1081J1957J0883M791
$$ plain form
17283 18166 5617 12383 13603 37375 6501 -10745 -12611 -22913 -15435 10408 7414 -11312 -19378
17270 -19378 -28649 -19154 -32354 -36629 -23299 -19369 -29633 -31063 -10089 -4303 286 -15394 -42214
17257 -42214 -53156 -30582 -17802 -12713 -27289 -20477 2573 15038 -13819 1793 8533 -10685
17245 -10685 -4470 -9473 -22736 -37676 -35840 1324 19155 2199 -8182 5714 1548 -19214
17233 -19214 -13966 8632 2906 -15764 -25817 -26670 -32947 -16309 -5409 -11026 916 -16502 -31803
17220 -31803 -51287 -33454 28300 76276 71151 46278 4164 -23676 -15537 15833 2530 -39123
17208 -39123 -34710 -22033 -9691 -20187 -45254 -25045 -26043 -24274 -19209 16616 35608 16967 -6152
17195 -6152 -16921 -8846 -36804 -37434 -19410 3618 24218 5532 -8264 -22420 -1773 27026
$$ packed form
17283A8166j2549O766J220K3772l0874j7246j866j0302P478K5843k994j8726q066
17270a9378r271R495j3200m275J3330L930j0264j430K0974N786M589j5680k6820
17257d2214j0942K2574J2780N089j4576O812K3050J2465k8857J5612O740j9218
17245a0685O215n003j3263j4940J836L7164J7831j6956j0381J3896m166k0762
17233a9214N248K2598n726j8670j0053q53o277J6638J0900n617J1942j7418j5301
17220c1803j9484J7833O1754M7976n125k4873m2114k7840Q139L1370j3303m1653
17208c9123M413J2677J2342j0496k5067K0209r98J769N065L5825J8992j8641k3119
17195f152j0769Q075k7958o30J8024K3028K0600j8686j3796j4156K0647K8799
$$ plain form
17183 27026 40391 23034 -244 -14373 -4498 -20988 -29318 -30582 -21142 -34299 -39676 -47812 -41592
17170 -41592 -46940 -41171 -31912 -6327 -23564 -24171 -2125 2575 -7654 -6456 -20571 -30760 -20588
17157 -20588 -4676 -14725 3082 -1911 -18215 -4433 450 -3535 12346 6515 -22407 -23910 1359
17144 1359 20115 30845 37243 39706 65119 43679 28873 33841 25818 42164 31813 13912 -2634
17131 -2634 -31077 -35064 -44457 -36821 -34395 -27677 -22460 -44307 -20806 16770 37050 49146 46647
17118 46647 34933 9548 -2393 -31411 -29039 -18479 1850 -5392 -10510 -21152 360 1984
17106 1984 -11092 17043 188 22783 5309 15696 56084 59592 57849 99245 72072 60491
17094 60491 24854 -1029 -12529 -10276 -7525 -768 25896 20369 -582 -11193 -22061 -19647 -30622
$$ packed form
17183B7026J3365j7357k3278j4129R875j6490q330j264R440j3157n377q136O220
17170d1592n348N769R259K5585j7237o07K2046M700j0229J198j4115j0189J0172
17157b0588J5912j0049J7807m993j6304J3782M883l985J5881n831k8922j503K5269
17144A359J8756J0730O398K463K5413k1440j4806M968q023J6346j0351j7901j6546
17131b634k8443l987r393P636K426O718N217k1847K3501L7576K0280J2096k499
17118D6647j1714k5385j1941k9018K372J0560K0329p242n118j0642K1512J624
17106A984j3076K8135j6855K2595j7474J0387M0388L508j743M1396k7173j1581
17094F0491l5637k5883j1500K253K751O757K6664n527k0951j0611j0868K414j0975
$$ plain form
17081 -30622 -33115 2497 27431 19128 27259 9005 -34649 -66479 -55046 -45171 -49003 -26022 -324
17068 -324 16177 11756 3043 4766 -10873 -15546 3243 -1519 -28363 -19257 8080 23194 5357
17055 5357 -20440 -18790 -18348 -5834 -14157 -48231 -44625 -13821 -12519 4224 5279 8169 21428
17042 21428 21574 9475 14118 18122 10289 -306 -8538 -25062 -37812 -46006 -8556 -4129 26124
17029 26124 49448 72872 40164 19564 10068 -4962 2927 -14281 -34257 -40267 -31236 -29489 -48349
17016 -48349 -35193 -29010 -4264 -6511 -3720 8523 31826 26970 30328 6963 9297 59580 69056
17003 69056 79766 69080 43489 39294 25279 33573 37312 12217 -37484 -25003 6258 14378
16991 14378 29676 23269 6382 1602 -18854 -53235 -49617 -31254 -35570 -19572 -31693 -19921
$$ packed form
17081c0622k493L5612K4934q303Q131j8254m3654l1830J1433R875l832K2981K5698
17068c24J6501m421q713J723j5639m673J8789m762k6844R106K7337J5114j7837
17055E357k5797J650M42J2514q323l4074L606L0804J302J6743J055K890J3259
17042B1428J46j2099M643M004p833j0595q232j6524j2750q194L7450M427L0253
17029B6124K3324K3424l2708k0600r496j5030P889j7208j9976o010R031J747j8860
17016d8349J3156O183K4746k247K791J2243K3303m856L358k3365K334N0283R476
17003F9056J0710j0686k5591m195j4015Q294L739k5095m9701J2481L1261Q120
16991A4378J5298o407j6887m780k0456l4381L618J8363m316J5998j2121J1772
$$ plain form
16979 -19921 -9370 8660 -26204 -71256 -71243 -50359 -46206 -12538 18323 8989 11767 9860 315
16966 315 -25272 -46041 -47157 -36280 -47851 -52332 -38193 -27789 -6646 17026 23107 33846 39506
16953 39506 29810 2761 -22701 -37751 -48814 -41251 -30925 -28517 -61319 -26348 -1442 -15112
16941 -15112 30713 42008 -3245 9119 18731 -12551 -10604 16940 -12314 -12050 -3578 -22706 -33779
16928 -33779 -34489 -38865 -29177 -50067 -73256 -71097 -41420 -30358 -25187 -43122 -25643 -34323 -43881
16915 -43881 -53807 -55355 -52487 -44039 5864 45140 17726 3256 -39299 -47371 -26369 -3121 40735
16902 40735 34186 -2741 -40815 -36302 -25791 -44358 -53050 -57395 -15851 5052 8789 -2188 795
16889 795 9634 9703 -2640 -30257 -46694 -33644 -5700 -18926 -32287 -14632 9115 24302 6357
$$ packed form
16979a9921J0551J8030l4864m5052J3K0884M153L3668L0861r334K778j907r545
16966C15k5587k0769j116J0877j1571m481J4139J0404K1143K3672O081J0739N660
16953C9506r696k7049k5462j5050j1063P563J0326K408l2802L4971K4906j3670
16941a5112M5825J1295m5253J2364R612l1282J947K7544k9254K64Q472j9128j1073
16928c3779p10m376R688k0890k3189K159K9677J1062N171j7935J7479q680r558
16915d3881r926j548K868Q448M9903L9276k7414j4470m2555q072K1002K3248M3856
16902D0735o549l6927l8074M513J0511j8567q692m345M1544K0903L737j0977K983
16889G95Q839O9j2343k7617j6437J3050K7944j3226j3361J7655K3747J5187j7945
$$ plain form
16876 6357 -33146 -38119 -10786 -24340 -34925 -26095 -16375 -28849 -20797 -6341 -1772 -7167 -13752
16863 -13752 -16252 -18268 -14622 11878 -10752 -19809 -28932 -15080 13770 20993 -16383 -41721 -18384
16850 -18384 19366 8272 -27597 -27552 -10706 26484 31900 4017 3860 3742 1734 7856 38607 39999
16836 39999 20768 11828 30200 48477 35853 21147 12143 -4590 -7044 -6227 -20036 -22279 -35516
16823 -35516 -50704 -49514 -12329 843 7325 3867 18153 42238 28680 -1237 -17998 -52552
16811 -52552 -51358 -33144 -10976 5990 22532 27260 553 -35572 -46097 -26381 -10755 27122
16799 27122 20281 -3979 -4318 -4953 -21677 -6486 7847 9510 -1097 -970 -8223 -2551 3229 -7319
16785 -7319 -8860 -18751 -41896 -40870 -49073 -64412 -54161 -25818 -21042 2224 17595 6682 -22094
$$ packed form
16876F357l9503m973K7333j3554j0585Q830R720j2474Q052J4456M569n395o585
16863a3752k500k016L646K6500k2630r057r123J3852K8850P223l7376k5338K3337
16850a8384L7750j1094l5869M5J6846L7190N416k7883j57j18k008O122L0751J392
16836C9999j9231q940J8372J8277j2624j4706r004j6733k454Q17j3809k243j3237
16823c5516j5188J190L7185J3172O482l458J4286K4085j3558k9917j6761l4554
16811e2552J194J8214K2168J6966J6542M728k6707l6125j0525J9716J5626L7877
16799B7122o841k4260l39o35j6724J5191J4333J663j0607J27p253N672N780j0548
16785g319j541r891k3145J026q203j5339J0251K8343M776K3266J5371j0913k8776
$$ plain form
16772 -22094 -29026 -3403 29452 16571 -11763 -2043 -2452 -1341 -11273 -2786 -17245 -13936 1298
16759 1298 2895 14848 4078 11651 -1674 -37004 -48802 -29119 -29860 -33750 -24950 7865 26123
16746 26123 41998 42812 28403 15554 25137 3120 -1827 3886 1197 -11732 -15881 -858 -22940
16733 -22940 -32608 -41961 -25803 14657 24095 47945 29509 10389 5853 1597 659 3276 -47377
16720 -47377 -49882 -51245 -30631 -9166 -4144 -1595 -918 -19566 -14685 -30769 -62056 -34099 -2428
16707 -2428 -19572 -51913 -55255 -27331 -45336 -69567 -65928 -32155 -26356 -11712 -23710 -37158
16695 -37158 -41482 -48908 -26674 -8202 -1349 -1721 20717 -1823 -24852 -13999 1025 -13236 -28552
16682 -28552 -29801 -13699 -2193 611 5282 374 6147 -10744 -30688 -22480 939 -7974 -4610
$$ packed form
16772b2094o932K5623L2855j2881k8334R720m09J111r932Q487j4459L309J5234
16759A298J597J1953j0770P573j3325l5330j1798J9683p41l890Q800L2815J8258
16746B6123J5875Q14j4409j2849R583k2017m947N713k689j2929m149J5023k2082
16733b2940r668r353J6158M0460R438K3850j8436j9120m536m256r38K617n0653
16720d7377k505j363K0614K1465N022K549O77j8648M881j6084l1287K7957L1671
16707b428j7144l2341l342K7924j8005k4231L639L3773N799J4644j1998j3448
16695c7158m324p426K2234J8472O853l72K2438k2540k3029J0853J5024j4261j5316
16682b8552j249J6102J1506K804M671m908N773j6891j9944Q208K3419q913L364
$$ plain form
16669 -4610 -383 5092 -965 16374 -5245 -22324 6446 23153 15823 11975 15110 14808 -22782
16656 -22782 -23938 -8212 15525 24762 31459 17068 7673 -25729 -75849 -72928 -68769 -75622 -59553
16643 -59553 -35946 -42785 -52580 -47577 -43077 -37634 -45190 -6853 30475 29664 -680 -20043 -39374
16630 -39374 -47778 -8362 17727 43127 27349 -13717 -8166 24110 37121 31840 5613 15061
16618 15061 252 -2065 10076 3490 14844 8055 1315 -18867 -11425 -6161 -28069 -34624 -15048
16605 -15048 -23798 -15820 1874 -16837 -20672 -12511 4219 15657 -12189 3319 25800 9773
16593 9773 25339 25004 -38331 -35697 -35728 -18889 -19138 -18269 509 -15598 -12694 12643 48917 42186
16579 42186 37147 33850 19150 23970 51145 47761 32882 27049 -2059 -27696 -13585 -10997 -24863
$$ packed form
16669d610M227N475o057J7339k1619j7079K8770J6707p330l848L135l02l7590
16656b2782j156J5726K3737R237O697j4391r395l3402n0120K921M159o853J6069
16643e9553K3607o839r795N003M500N443p556L8337L7328q11l0344j9363j9331
16630c9374q404L9416K6089K5400j5778m1066N551L2276J3011n281k6227R448
16618A5061j4809k317J2141o586J1354o789o740k0182P442N264k1908o555J9576
16605a5048q750P978J7694j8711l835Q161J6730J1438k7846J5508K2481j6027
16593I773J5566l35o3335K634l1J6839k49Q69J8778j6107K904K5337L6274o731
16579D2186n039l297j4700M820K7175l384j4879n833k9108k5637J4111K588j3866
$$ plain form
16566 -24863 -13999 13310 25477 33318 7287 9487 26845 41576 25822 -9499 5999 15277
16554 15277 31910 35897 30022 49314 37318 2119 -26146 -50350 -31480 -3174 -22122 -43078
16542 -43078 -54228 -71333 -63723 -70298 -59653 -23281 -666 4483 -26384 -25200 -3786 -16550
16530 -16550 -34339 -23337 -20926 -32659 -20367 -41338 -62059 -66223 -45887 -29794 909 12642
16518 12642 15522 44993 62573 37657 13519 25084 5166 -28423 -42484 -4822 34557 20658
16506 20658 -21545 -25539 -3919 5922 2556 -18391 -23455 -6847 -19711 -24168 -16122 -6510 21864
16493 21864 55278 54824 31965 31460 66633 79151 62269 34563 36669 34305 13962 6759 16715
16480 16715 5380 4043 -3619 -1295 -10571 -15779 -5839 -1589 -29299 -44589 -46057 -35931 -61862
$$ packed form
16566b4863J0864K7309J2167P841k6031K200J7358J4731j5754l5321J5498R278
16554A5277J6633L987n875J9292j1996l5199k8265k4204J8870K8306j8948k0956
16542d3078j1150j7105P610o575J0645L6372K2615N149l0867J184K1414j2764
16530a6550j7789J1002K411j1733J2292k0971k0721m164K0336J6093L0703J1733
16518A2642K880K9471J7580k4916k4138J1565j9918l3589j4061L7662L9379j3899
16506B0658m2203l994K1620R841l366k0947n064J6608j2864m457Q046R612K8374
16493B1864L3414m54k2859n05L5173J2518j6882k7706K106k364k0343p203R956
16480A6715j1335j337p662K324r276n208R940M250k7710j5290j468J0126k5931
$$ plain form
16467 -61862 -58009 -29058 -18057 4393 -12371 -15153 18545 9016 -18210 -13020 14655 30458
16455 30458 43477 3089 8939 37605 35391 -17916 -50477 -11518 8696 18351 13921 2858
16443 2858 32154 15892 -25897 -42145 -49818 -22176 20345 7029 -7088 -12868 -21557 -53287
16431 -53287 -51758 -33290 -36224 -6990 16180 19304 -68 -20101 -23482 -17040 21949 15530 -10425
16418 -10425 -23002 -29823 -2626 32912 18750 -21460 -6057 28807 27346 -7042 -45072 -39994
16406 -39994 -39544 -24674 -11652 -16978 -17079 -35697 -44343 -47323 -16181 -10563 -22354 -21538 5818 18938
16392 18938 -899 -18102 -13496 8096 5188 -8199 11778 30758 11787 14813 6988 -19099
16380 -19099 -21228 -42813 -38310 -22960 -13231 -19306 -14839 -16628 -9225 -30388 -12808 9201 27584
$$ packed form
16467f1862L853K8951J1001K2450j6764k782L3698r529k7226N190K7675J5803
16455C0458J3019m0388N850K8666k214n3307l2561L8959K0214R655m430j1063
16443B858K9296j6262m1789j6248p673K7642M2521j3316j4117n780q689l1730
16431e3287J529J8468k934K9234K3170L124j9372k0033l381O442L8989o419k5955
16418a0425j2577o821K7197L5538j4162m0210J5403L4864j461l4388l8030N078
16406c9994M50J4870J3022n326j01j8618q646k980L1142N618j1791Q16K7356J3120
16392A8938j9837j7203M606K1592k908j3387J9977J8980j8971L026p825k6087
16380a9099k129k1585M503J5350R729o075M467j789P403k1163J7580K2009J8383
$$ plain form
16367 27584 29170 15873 -13059 -27535 5087 -17635 -18995 -15019 -2115 -3906 20534 -671
16355 -671 -50410 -65297 -53955 -29755 1012 -9429 -3211 -8733 -22928 -39807 -66308 -40577
16343 -40577 -7394 10125 318 -13634 -10896 -28475 -26702 29 -1356 -23296 10799 32115
16331 32115 18689 8445 21202 25321 43350 42228 53475 54472 10498 -1158 -2904 -20681 -9953
16318 -9953 13433 37016 40589 43093 16509 4988 -4264 5922 25371 35002 25018 33868 34760
16305 34760 11115 8004 17500 9156 18804 12643 1699 26170 12559 -19621 -217 7562 -27286
16292 -27286 -11864 23206 32191 27318 34072 38353 1810 -4734 8801 27722 31763 7104 6857
16279 6857 36834 36420 23397 7284 -21175 198 -21874 -41505 -14877 8527 -3344 -11922
$$ packed form
16367B7584J586j3297k8932j4476L2622k2722j360L976J2904j791K4440k1205
16355f71m9739j4887J1342K4200L0767j0441O218n522j4195j6879k6501K5731
16343d0577L3183J7519r807j3952K738j7579J773K6731j385k1940L4095K1316
16331C2115j3426j0244J2757M119J8029j122J1247R97m3974j1656j746j7777J0728
16318i953K3386K3583L573K504k6584j1521r252J0186J9449R631r984Q850Q92
16305C4760k3645l111R496q344R648o161j0944K4471j3611l2180J9404P779l4848
16292b7286J5422L5070Q985m873O754M281l6543o544J3535J8921M041k4659k47
16279F857K9977m14j3023j6113k8459K1373k2072j9631K6628K3404j1871q578
$$ plain form
16267 -11922 2000 12644 -18654 -25966 -30941 -47812 -72982 -46946 -12035 28182 62592 75837
16255 75837 60057 40030 10380 29196 49032 25555 7888 9034 45971 25492 -2075 -12642
16243 -12642 -12207 11468 19135 15746 14262 18132 16593 5533 -9464 -9455 8271 15619 17448 6850
16229 6850 -15830 -31176 -69116 -16757 21514 38458 45409 65986 80412 62132 42990 13989
16217 13989 -9304 -16298 -27853 -31282 1524 19045 22147 204 -3521 9578 16320 24610 19863
16204 19863 31908 24277 27432 45067 19161 920 25885 55301 60141 41899 13637 -1854
16192 -1854 -22358 -40319 -33803 -2220 6774 12683 17702 -21766 -40785 -8006 24666 35829 24851
16179 24851 9879 23176 20653 4367 20355 -2353 1903 -20022 -28484 -35228 -17016 9603
$$ packed form
16267a1922J3922J0644l1298p312m975j6871k5170K6036L4911M0217L4410J3245
16255G5837j5780k0027k9650J8816J9836k3477j7667J146L6937k0479k7567j0567
16243a2642M35K3675P667l389j484L870j539j1060j4997RJ7726P348J829j0598
16229F850k2680j5346l7940N2359L8271J6944O951K0577J4426j8280j9142k9001
16217A3989k3293o994j1555l429L2806J7521L102k1943l725J3099O742Q290m747
16204A9863J2045p631L155J7635k5906j8241K4965K9416M840j8242k8262j5491
16192a854k0504j7961O516L1583Q994N909N019l9468j9019L2779L2672J1163j0978
16179B4851j4972J3297k523j6286J5988k2708M256k1925q462o744J8212K6619
$$ plain form
16167 9603 -793 -18902 -8401 10656 8094 -14348 -4291 -14138 -17430 -24690 -17444 -13539 -11590
16154 -11590 -27773 -36253 -46311 -33275 -28665 -13472 -22004 -30809 -2435 -19915 -37457 -41505 -44149
16141 -44149 -20742 -2045 1274 -19984 -22838 -24948 -25762 -31970 -26257 5489 27228 25040 -1347
16128 -1347 12573 39526 36629 22691 -3572 -43550 -31713 -11182 6691 22815 17926 -953
16116 -953 2735 -13478 -1468 30508 38894 27978 1804 -8366 -6711 8160 -4218 -1838 -12436
16103 -12436 -23147 -5673 593 -23243 -21978 -15685 2858 -8195 -17758 12065 46256 45602 51971
16090 51971 69184 81241 94197 50369 -4660 -43502 -40827 -50818 -21206 -14821 -35062 -7709
16078 -7709 8361 12908 17353 -27593 -29382 -44454 -27793 -16270 2275 -17434 -16453 -17522 -15650
$$ packed form
16167I603j0396j8109J0501J9057k562k2442J0057r847l292p260P246L905J949
16154a1590j6183q480j0058J3036M610J5193q532q805K8374j7480j7542m048k644
16141d4149K3407J8697L319k1258k854k110q14o208N713L1746K1739k188k6387
16128a347J3920K6953k897j3938k6263l9978J1837K0531J7873J6124m889j8879
16116i53L688j6213J2010L1976Q386j0916k6174j0170J655J4871j2378K380j0598
16103a2436j0711J7474O266k3836J265O293J8543j1053r563K9823L4191o54O369
16090E1971J7213J2057J2956m3828n5029l8842K675r991K9612O385k0241K7353
16078g709J6070M547M445m4946j789j5072J6661J1523J8545j9709R81j069J872
$$ plain form
16065 -15650 -34928 -52099 -52647 -12552 27445 45454 15583 -17048 20930 15447 23608 18262 41016
16052 41016 73638 57272 38485 25040 31143 66357 50320 23689 678 -4654 -32310 -41102
16040 -41102 -59423 -21718 -6110 -5182 -6056 -10314 -7849 -3130 -5337 35463 42117 42617 11961 15288
16026 15288 24388 23534 555 10047 32921 28330 22054 8898 10901 28919 62681 69580 34148
16013 34148 7467 7071 11595 15577 12937 -1159 10600 33424 41141 64388 61897 34303 19665
16000 19665 30887 45969 34077 37101 41731 56904 32023 23371 19122 -10780 -25678 -11723
15988 -11723 37359 30764 8388 -16117 -31243 -12354 -20432 -37754 -21497 -7972 9598 24640
15976 24640 43774 54888 37487 14918 -1317 2364 21846 14220 22086 24562 34040 39157 37689
$$ packed form
16065a5650j9278j7171n48M0095L9997J8009k9871l2631L7978n483Q161n346K2754
16052D1016L2622j6366j8787j3445O103L5214j6037k6631k3011n332k7656q792
16040d1102j8321L7705J5608R28q74m258K465M719k207M0800O654N00l0656L327
16026A5288R100q54k2979R492K2874m591o276j3156K003J8018L3762O899l5432
16013C4148k6681l96M524L982k640j4096J1759K2824P717K3247k491k7594j4638
16000A9665J1222J5082j1892L024M630J5173k4881q652m249k9902j4898J3955
15988a1723M9082o595k2376k4505j5126J8889q078j7322J6257J3525J7570J5042
15976B4640J9134J1114j7401k2569j6235L681J9482p626P866K476R478N117j468
$$ plain form
15963 37689 24121 17419 9295 19703 42509 58907 62018 39405 30262 42059 52435 69584
15951 69584 58255 43975 29811 23029 3435 1803 13442 35343 32004 19730 4470 -31671
15939 -31671 -34399 3710 6239 12772 21870 22318 61532 74774 52368 16329 20467 6171 -5637
15926 -5637 3083 579 3493 46285 56152 42980 51641 50948 55106 45991 8592 3742 31252 34287
15912 34287 47623 61422 56418 22611 8522 -8267 -10782 19225 30955 59288 80526 46372
15900 46372 -9620 -13271 1545 6454 21489 30797 43889 24735 26134 32740 45213 46675 53801
15887 53801 61331 73342 70763 45885 29295 6026 -37 14937 15764 -3947 -17199 -46544 -17615
15874 -17615 4128 13231 10049 -8705 12491 18577 4692 -17880 25341 41034 34360 -20289
$$ packed form
15963C7689j3568o702q124J0408K2806J6398L111k2613r143J1797J0376J7149
15951F9584j1329j4280j4164o782j9594j632J1639K1901l339j2274j5260l6141
15939c1671k728L8109K529O533R098M48L9214J3242k2406l6039M138j4296j1808
15926e637Q720k504K914M2792R867j3172Q661o93M158r115l7399m850K7510L035
15912C4287J3336J3799n004l3807j4089j6789k515L0007J1730K8333K1238l4154
15900D6372n5992l651J4816M909J5035R308J3092j9154J399O606J2473J462P126
15887E3801P530J2011k579k4878j6590k3269o063J4974Q27j9711j3252k9345K8929
15874a7615K1743R103l182j8754K1196O086j3885k2572M3221J5693o674n4649
$$ plain form
15862 -20289 -53683 -48215 -59209 -25303 15272 -62 -22286 -9402 16964 46880 39334 39326 6704
15849 6704 1679 29461 51961 53759 39984 3799 -13517 -16489 3722 37494 28912 22133 30479
15836 30479 61787 61839 33294 18138 22901 41651 46753 58075 47038 47132 59650 31310 55243
15823 55243 77724 49901 10749 20003 44883 21052 -16785 -25594 4304 33919 49471 33941
15811 33941 16646 14974 23119 9205 -22948 -23996 -10083 21049 41566 59464 45374 52821
15799 52821 80418 113361 94180 19354 -21491 -42768 -27180 3888 11640 33684 65938 57019
15787 57019 20124 -9193 -34537 -31653 -12875 -15615 -3822 14886 30988 10101 -8520 -3531
15775 -3531 -16629 1995 18731 50632 29645 24518 36181 37489 13960 46028 50864 29756
$$ packed form
15862b0289l3394N468j0994L3906M0575j5334k2224J2884K6366K9916p546ql2622
15849F704n025K7782K2500J798j3775l6185j7316k972K0211L3772q582o779Q346
15836C0479L1308N2k8545j5156M763J8750N102J1322j1037R4J2518k8340K3933
15823E5243K2481k7823l9152R254K4880k3831l7837q809K9898K9615J5552j5530
15811C3941j7295j672Q145j3914l2153j048J3913L1132K0517J7898j4090P447
15799E2821K7597L2943j9181p4826m0845k1277J5588L1068P752K2044L2254q919
15787E7019l6895k9317k5344K884J8778k740J1793J8708J6102k0887j8621M989
15775c531j3098J8624J6736L1901k0987n127J1663J308k3529L2068M836k1108
$$ plain form
15763 29756 7987 213 -9729 -15325 -2177 33038 35299 28485 12162 10708 18450 9695 -7478
15750 -7478 -45911 -33612 -16569 5785 38369 57284 46298 12104 6325 284 -24049 12005
15738 12005 59619 61518 34234 45725 40889 20224 17945 54115 83517 66338 55948 40325
15726 40325 25136 21123 15269 30351 61574 59905 58952 64125 46958 31796 7304 -702 6230
15713 6230 32909 35131 51608 60247 70043 66563 23740 25737 24677 26724 3161 -7280 -88
15700 -88 -10650 -12625 -19202 -3215 8400 27987 26145 38417 58643 56059 58636 59072 80638 95532
15686 95532 86060 69343 51538 62991 44682 41665 57407 75842 68337 28150 25086 62419
15674 62419 47589 38272 36389 21211 10531 28739 82176 103618 96558 75935 48185 46975
$$ packed form
15763B9756k1769p774r942n596J3148L5215K261o814j6323j454P742q755j7173
15750g478l8433J2299J7043K2354L2584J8915j0986l4194n779o041k4333L6054
15738A2005M7614J899k7284J1491m836k0665k279L6170K9402j7179j0390j5623
15726D0325j5189m013n854J5082L1223j669r53N173j7167j5162k4492q006O932
15713F230K6679K222J6477Q639R796l480m2823J997j060K047k3563j0441P192
15700h8j0562j975o577J5987J1615J9587j842J2272K0226k584K577M36K1566J4894
15686I5532r472j6717j7805J1453j8309l017J5742J8435p505m0187l064L7333
15674F2419j4830r317j883j5178j0680J8208N3437K1442p060k0623k7750j210
$$ plain form
15662 46975 58458 48199 18968 867 -11376 9476 55487 56129 31346 26580 30768 37549 37327
15649 37327 14657 17228 57794 39296 27150 46027 84612 89636 59503 34373 51828 95689
15637 95689 78375 76782 87606 82871 61105 82757 67593 57059 42023 28812 34857 43772
15625 43772 60169 51031 29142 39426 17492 5148 -8957 18539 28750 35694 53983 58792
15613 58792 71240 52552 43178 45664 30732 17023 -769 -12874 34790 41827 53065 46198
15601 46198 37063 56186 52209 77015 70046 38411 37587 23437 12167 11345 32979 -2297 -14150
15588 -14150 -5282 1655 -9333 -8264 -7447 7251 49387 78024 74420 31762 31603 58635 54334
15575 54334 37877 26367 38568 64671 89214 70908 61120 63211 59699 42236 48458 71393
$$ packed form
15662D6975J1483j0259k9231j8101j2243K0852M6011O42k4783m766M188O781k22
15649C7327k2670K571M0566j8498j2146J8877L8585N024l0133k5130J7455M3861
15637I5689j7314j593J0824m735k1766K1652j5164j0534j5036j3211O045Q915
15625D3772J6397r138k1889J0284k1934j2344j4105K7496J0211O944J8289M809
15613E8792J2448j8688r374K486j4932j3709j7792j2105M7664P037J1238o867
15601D6198r135J9123l977K4806o969l1635q24j4150j1270q22K1634l5276j1853
15588a4150Q868O937j0988J069Q17J4698M2136K8637l604m2658j59K7032m301
15575E4334j6457j1510J2201K6103K4543j8306r788K091l512j7463O222K2935
$$ plain form
15563 71393 88740 73688 60340 46565 32412 51422 61892 50931 32932 40058 46793 93770
15551 93770 89828 57653 64946 62735 59664 90544 89550 68542 29501 5199 11594 13528 32556
15538 32556 46539 28323 5126 -4224 30381 51130 47447 40765 60995 43014 43105 31483 31344
15525 31344 55249 85499 85215 67163 50159 47666 52043 65356 31336 27235 43720 48118 49699
15512 49699 51218 47373 34230 23791 38205 54640 74083 80573 95789 71241 88192 100950
15500 100950 113328 107191 96657 76724 63414 55103 28895 51515 61883 65840 33106 7054
15488 7054 43662 53952 35034 47380 65411 68131 108082 110604 98909 93476 112132 119039 124474
15475 124474 62896 20553 7220 20150 55362 59748 32942 49052 77632 56614 48440 77595
$$ packed form
15563G1393J7347j5052j3348j3775j4153J9010J0470j0961j7999P126O735M6977
15551I3770l942l2175P293k211l071L0880r94k1008l9041k4302O395J934J9028
15538C2556J3983j8216k3197r350L4605K0749l683o682K0230j7981R1j1622j39
15525C1344K3905L0250k84j8052j7004k493M377J3313l4020m101J6485M398J581
15512D9699J519l845j3143j0439J4414J6435J9443O490J5216k4548J6951J2758
15500A00950J2378o137j0534j9933j3310q311k6208K2620J0368L957l2734k6052
15488G054L6608J0290j8918J2346J8031K720L9951K522j1695n433J8656O907N435
15475A24474o1578m2343j3333J2930L5212M386k6806J6110K8580k1018q174K9155
$$ plain form
15463 77595 74855 100451 89752 82494 105722 91473 62320 58691 58030 60704 79965 102214 101146
15450 101146 86679 76316 72499 79514 91779 107248 90258 52312 60211 60569 50957 57843 51745
15437 51745 27477 25096 26291 29636 28282 33834 31850 20086 38872 55216 75486 67227 42096
15424 42096 52629 54830 37938 30334 47741 44891 51807 60487 46675 35721 27784 39003 63841
15411 63841 87827 77981 65991 56873 27507 20733 44577 72659 95619 79792 69383 80409
15399 80409 106482 107237 119544 105436 60298 23172 61667 96752 98383 74706 27301 7528
15387 7528 18100 33547 16977 28636 58927 63802 75644 84277 76143 68598 73320 83417 85529
15374 85529 86303 102271 118075 130500 116231 76258 53776 42723 75423 76675 93438 82258
$$ packed form
15463G7595k740K5596j0699p258K3228j4249k9153l629o61K674J9261K2249j068
15450A01146j4467j0363l817P015J2265J5469j6990l7946P899L58r612O886o098
15437E1745k4268k381J195L345j354N552j984j1764J8786J6344K0270q259k5131
15424D2096J0533K201j6892p604J7407k850O916Q680j3812j0954p937J1219K4838
15411F3841K3986r846j1990r118k9366o774K3844K8082K2960j5827j0409J1026
15399H0409K6073P55J2307j4108m5138l7126L8495L5085J631k3677m7405j9773
15387G528J0572J5447j6570J1659L0291M875J1842Q633q134p545M722J0097K112
15374H5529P74J5968J5804J2425j4269l9973k2482j1053L2700J252J6763j1180
$$ plain form
15362 82258 50939 36129 58668 78836 104253 120814 103926 53171 71984 84020 43701 3955
15350 3955 -8989 8153 39808 53653 69649 74737 74695 83203 97357 96201 88308 77777 89537
15337 89537 79009 118422 147342 134764 128546 126405 97834 63284 57135 78588 85927 67943
15325 67943 44082 6812 13344 32282 42594 37802 62720 76461 80936 79741 67651 64901 99593
15312 99593 117627 107804 90921 79507 87229 90250 59909 52597 52935 57552 73934 103573 119943
15299 119943 103867 100401 114260 142197 120352 96070 113250 125359 84432 74518 66577 57737
15287 57737 44707 45447 55113 53615 46639 48018 60724 69023 63522 68175 72463 50351 64674 92243
15273 92243 103855 94188 92299 76123 63789 49292 51404 43627 22849 21278 52593 73929 74289
$$ packed form
15362H2258l1319j4810K2539K0168K5417J6561j6888n0755J8813J2036m0319l9746
15350C955j2944J7142L1655J3845J5996N088m2Q508J4154j156p893j0531J1760
15337H9537j0528L9413K8920j2578o218k141k8571l4550o149K1453P339j7984
15325F7943k3861l7270O532J8938J0312m792K4918J3741M475j195j2090k750L4692
15312I9593J8034r823j6883j1414P722L021l0341p312L38M617J6382K9639J6370
15299A19943j6076l466J3859K7937k1845k4282J7180J2109m0927r914p941q840
15287E7737j3030P40R666j498o976J379J2706Q299n501M653M288k2112J4323K7569
15273I2243J1612r667j889j6176j2334j4497K112p777k0778j571L1315K1336L60
$$ plain form
15260 74289 67551 82759 98030 101324 90329 78346 44265 74028 77662 37931 40631 67735
15248 67735 67952 48822 49373 41551 52219 55690 75258 85090 80992 85617 95770 59619 70713
15235 70713 61697 67761 74062 71133 63021 84353 72355 81942 86175 56205 43927 60351 77993
15222 77993 61126 46416 64216 95419 109946 73651 31179 38305 53810 54958 66621 89881
15210 89881 107675 104566 75605 63081 100499 120196 120406 107827 120566 119648 113219 102400 69614
15197 69614 62733 66796 87836 95393 116139 121718 119055 124736 127594 89018 89828 67878 35122
15184 35122 56944 79528 77212 91642 102943 82093 89168 123907 126983 123020 107792 99351 103777
15171 103777 120246 113690 94910 78783 81477 94957 97766 63552 54872 77861 95878 108061
$$ packed form
15260G4289o738J5208J5271L294j0995j1983l4081K9763L634l9731K700K7104
15248F7735K17j9130N51p822J0668L471J9568R832m098M625J0153l6151J1094
15235G0713r016O064O301k929q112K1332j1998R587M233k9970j2278J6424J7642
15222G7993j6867j4710J7800L1203J4527l6295m2472P126J5505J148J1663K3260
15210H9881J7794l109k8961j2524L7418J9697K10j2579J2739r18o429j0819l2786
15197F9614o881M063K1040P557K0746N579k663N681K858l8576Q10k1950l2756
15184C5122K1822K2584k316J4430J1301k0850P075L4739L076l963j5228q441M426
15171A03777J6469o556j8780j6127K694J3480K809l4214q680K2989J8017J2183
$$ plain form
15159 108061 121174 117808 130554 105024 116856 106455 80950 62071 50868 58274 78730 91006
15147 91006 87375 59591 79461 111045 99595 98006 95129 97975 66921 81309 100936 83698
15135 83698 108532 87998 77296 78750 98268 94510 114857 109316 89938 101145 85534 90367
15123 90367 117154 130811 148204 135382 138829 141217 126030 118919 139778 169899 122726 117343
$$ packed form
15159A08061J3113l366J2746k5530J1832j0401k5505j8879j1203P406K0456J2276
15147I1006l631k7784J9870L1584j1450j589k877K846l1054J4388J9627j7238
15135H3698K4834k0534j0702J454J9518l758K0347n541j9378J1207j5611M833
15123I0367K6787J3657J7393j2822L447K388j5187p111K0859L0121m7173n383
$$ [...]
##END NTUPLES=NMR SPECTRUM
##END=
