##TITLE=Analysis number 326302
Compound Code cc 13005
Project Code adrs
Chemist Name stores
##JCAMPDX= 6.0         $$ Bruker NMR JCAMP-DX V2.0
##DATA TYPE= NMR SPECTRUM
##DATA CLASS= NTUPLES
##ORIGIN= Bruker BioSpin GmbH
##OWNER= nmr
$$ XWIN-NMR		Version 3.5
$$ Thu Feb  1 09:29:58 2007 GMT Standard Time (UT+0h)  MAYBRIDGE\nmr@NMR_250MHZ
##.OBSERVE FREQUENCY= 250.131544655141
##.OBSERVE NUCLEUS= ^1H
##.ACQUISITION MODE= SIMULTANEOUS (DQD)
##.ACQUISITION SCHEME= undefined
##.AVERAGES= 16
##.DIGITISER RES= 18
##SPECTROMETER/DATA SYSTEM= dpx250
##.PULSE SEQUENCE= zg30
##.SOLVENT NAME= CDCl3
##.SHIFT REFERENCE= (INTERNAL, CDCl3, 0, 16.522)
##AUDIT TRAIL= $$ (NUMBER, WHEN, WHO, WHERE, WHAT)
$$ ##TITLE= Audit trail, XWIN-NMR		Version 3.5
$$ ##JCAMPDX= 5.01
$$ ##ORIGIN= Bruker BioSpin GmbH
$$ ##OWNER= nmr
$$ C:\u/data/dgb/nmr/ADRS/40/pdata/1/auditp.txt
$$ ##AUDIT TRAIL=  $$ (NUMBER, WHEN, WHO, WHERE, WHAT)
(   1,<2007-02-01 09:29:28.99 +000>,<MAYBRIDGE\nmr>,<NMR_250MHZ>,
      <created by zg, POWCHK disabled, PULCHK disabled
       configuration hash MD5:
       49 4B E0 1D 92 C2 6B 37 9F E6 65 BC 52 41 86 1D
       data hash MD5: 64K
       E4 5C 20 70 B8 5F EA 50 BA 72 85 48 F2 E9 9C EB>)
(   2,<2007-02-01 09:29:45.74 +000>,<MAYBRIDGE\nmr>,<NMR_250MHZ>,
      <Start of raw data processing
       ef LB = 0.3 FT_mod = 6 PKNL = 1 SI = 32K 
       data hash MD5: 32K
       AC DF 15 7E BF 3B 8B 99 60 CC 55 56 88 9B C1 46>)
(   3,<2007-02-01 09:29:47.53 +000>,<MAYBRIDGE\nmr>,<NMR_250MHZ>,
      <apk 
       data hash MD5: 32K
       CA 0C 78 31 17 7A E5 E2 FF 3B 35 EF 1D A3 CC 5C>)
(   4,<2007-02-01 09:29:48.27 +000>,<MAYBRIDGE\nmr>,<NMR_250MHZ>,
      <abs ABSG = 5 
       data hash MD5: 32K
       05 9C C6 57 A5 48 57 B9 23 83 61 E7 92 26 D2 1E>)
$$ ##END=
$$ 
$$ hash MD5
$$ C0 7B D6 5C 83 48 8A DF CF DC DB BA E5 DD EC 54
##$RELAX= 
##$RELAX= 
##$RELAX= 
##$RELAX= 
##$RELAX= 
##$RELAX= 
##$RELAX= 
$$ Bruker specific parameters
$$ --------------------------
##$DU= <C:\u>
##$EXPNO= 40
##$NAME= <ADRS>
##$PROCNO= 1
##$TYPE= <nmr>
##$USER= <dgb>
##$AMP= (0..31)
100 100 100 100 100 100 100 100 100 100 100 100 100 100 100 100 100 100 
100 100 100 100 100 100 100 100 100 100 100 100 100 100 
##$AQSEQ= 0
##$AQ_mod= 3
##$AUNM= <au_zg>
##$AUTOPOS= <35 >
##$BF1= 250.13
##$BF2= 250.13
##$BF3= 250.13
##$BF4= 250.13
##$BF5= 500.13
##$BF6= 500.13
##$BF7= 500.13
##$BF8= 500.13
##$BYTORDA= 1
##$CFDGTYP= 0
##$CFRGTYP= 5
##$CHEMSTR= <none>
##$CNST= (0..31)
1 1 145 1 1 1 1 1 1 1 1 1 1 1 1 1 1 1 1 1 1 1 1 1 1 1 1 1 1 1 1 1 
##$CPDPRG= <>
##$CPDPRG1= <>
##$CPDPRG2= <>
##$CPDPRG3= <>
##$CPDPRG4= <mlev>
##$CPDPRG5= <mlev>
##$CPDPRG6= <mlev>
##$CPDPRG7= <mlev>
##$CPDPRG8= <mlev>
##$CPDPRGB= <>
##$CPDPRGT= <>
##$D= (0..31)
0 1 0 0 0 0 0 0 0 0.06 0 0 0 0 0 0 0.0002 0 0 0 0 0 0 0 0 0 0 0 0 0 0 
0 
##$DATE= 1170322167
##$DBL= (0..7)
120 120 120 120 120 120 120 120 
##$DBP= (0..7)
150 150 150 150 150 150 150 150 
##$DBP07= 0
##$DBPNAM0= <>
##$DBPNAM1= <>
##$DBPNAM2= <>
##$DBPNAM3= <>
$$ [...]
##$SUBNAM6= <"">
##$SUBNAM7= <"">
##$SUBNAM8= <"">
##$SUBNAM9= <"">
##$SW= 20.6930455092707
##$SWIBOX= (0..15)
0 0 3 0 0 0 0 0 0 0 0 0 0 0 0 0 
##$SW_h= 5175.983436853
##$TD= 65536
##$TD0= 1
##$TE= 294.16
##$TE2= 300
##$TE3= 300
##$TEG= 300
##$TL= (0..7)
0 120 120 120 120 120 120 120 
##$TP= (0..7)
150 150 150 150 150 150 150 150 
##$TP07= 0
##$TPNAME0= <>
##$TPNAME1= <>
##$TPNAME2= <>
##$TPNAME3= <>
##$TPNAME4= <>
##$TPNAME5= <>
##$TPNAME6= <>
##$TPNAME7= <>
##$TPOAL= (0..7)
0.5 0.5 0.5 0.5 0.5 0.5 0.5 0.5 
##$TPOFFS= (0..7)
0 0 0 0 0 0 0 0 
##$TUNHIN= 0
##$TUNHOUT= 0
##$TUNXOUT= 0
##$USERA1= <user>
##$USERA2= <user>
##$USERA3= <user>
##$USERA4= <user>
##$USERA5= <user>
##$V9= 5
##$VALIST= <valist>
##$VCLIST= <CCCCCCCCCCCCCCC>
##$VD= 0
##$VDLIST= <DDDDDDDDDDDDDDD>
##$VPLIST= <PPPPPPPPPPPPPPP>
##$VTLIST= <TTTTTTTTTTTTTTT>
##$WBST= 1024
##$WBSW= 4
##$XGAIN= (0..3)
0 0 0 0 
##$XL= 0
##$YL= 0
##$YMAX_a= 374669
##$YMIN_a= -514517
##$ZGOPTNS= <>
##$ZL1= 120
##$ZL2= 120
##$ZL3= 120
##$ZL4= 120
##$ABSF1= 16.522
##$ABSF2= -4.171173
##$ABSG= 5
##$ABSL= 3
##$ALPHA= 0
##$AQORDER= 0
##$ASSFAC= 0
##$ASSFACI= 0
##$ASSFACX= 0
##$ASSWID= 0
##$AUNMP= <proc_1d>
##$AZFE= 0.1
##$AZFW= 0.1
##$BCFW= 0
##$BC_mod= 0
##$BYTORDP= 0
##$COROFFS= 0
##$CY= 12.5
##$DATMOD= 1
##$DC= 0
##$DFILT= <>
##$DTYPP= 0
##$F1P= 14.0000005364418
##$F2P= -0.99999901652339
##$FCOR= 0.5
##$FTSIZE= 32768
##$FT_mod= 6
##$GAMMA= 0
##$GB= 0
##$INTBC= 1
##$INTSCL= 1
##$ISEN= 128
##$LB= 0.3
##$LEV0= 0
##$LPBIN= 0
##$MAXI= 10000
##$MC2= 0
##$MEAN= 0
##$ME_mod= 0
##$MI= 0
##$NCOEF= 0
##$NC_proc= -2
##$NLEV= 6
##$NOISF1= 0
##$NOISF2= 0
##$NSP= 0
##$NTH_PI= 0
##$NZP= 0
##$OFFSET= 16.522
##$PC= 1
##$PHC0= 226.7081
##$PHC1= 6.91905
##$PH_mod= 1
##$PKNL= yes
##$PPARMOD= 0
##$PSCAL= 4
##$PSIGN= 0
##$REVERSE= no
##$SF= 250.13
##$SI= 32768
##$SIGF1= 0
##$SIGF2= 0
##$SINO= 400
##$SIOLD= 32768
##$SREGLST= <1H.CDCl3>
##$SSB= 0
##$STSI= 32768
##$STSR= 0
##$SW_p= 5175.98343685301
##$SYMM= 0
##$S_DEV= 0
##$TDeff= 65536
##$TDoff= 0
##$TI= <Analysis number 999999
Compound Code 99
Book Reference 9
Project Code 9>
##$TILT= no
##$TM1= 0
##$TM2= 0
##$TOPLEV= 0
##$USERP1= <user>
##$USERP2= <user>
##$USERP3= <user>
##$USERP4= <user>
##$USERP5= <user>
##$WDW= 1
##$XDIM= 32768
##$YMAX_p= 412794987
##$YMIN_p= -69377
$$ End of Bruker specific parameters
$$ ---------------------------------
##NTUPLES= NMR SPECTRUM
##VAR_NAME=  FREQUENCY,     SPECTRUM/REAL,   SPECTRUM/IMAG
##SYMBOL=    X,             R,               I
##VAR_TYPE=  INDEPENDENT,   DEPENDENT,       DEPENDENT
##VAR_FORM=  AFFN,          ASDF,            ASDF
##VAR_DIM=   32768,         32768,           32768
##UNITS=     HZ,            ARBITRARY UNITS, ARBITRARY UNITS
##FACTOR=    0.157963299565203, 1,           1
##FIRST=     4132.6476996994, 0,             0
##LAST=      -1043.33573715361, 0,           0
##MIN=       -1043.33573715361, -69377,      0
##MAX=       4132.6476996994, 412794987,     0
$$ Real data points
##PAGE= N=1
##DATA TABLE= (X++(R..R)), XYDATA
$$ [...]
19711d442K825K73M34J2452j522q282Q39K498n57n870J455k224m021p81j088N144
19695b867J5220L123m054K552j20k503m004k507L821M765o25J1273q142q049Q13
19680H696O299N842j031k83k575r95n062P397L186k735n406j232N176n835j107
19665A0335o929j36k233J2454J6594k781k779J872L788j451n027j050r962O506
19651A9201M125j4823m646R119L729J805K555l843l343n893O939N361k612J752
19637A9426K913L0o413k117Q272R28M349k976J517k472n982j1954o103J3395O580
19622A9393L9m636k999J694J0199N3p055K977k188l295K95r777r223j349J1089
19607E217J418m068r69q18N014L574J089K08J818M352P431M655K558j533J188
$$ y = [-4442, -1617, -1344, -910, 11542, 10020, 1738, 2577, 5075, 4518, -1352, 103, -2121, -6142, -6923, -8011, -2867, 12353, 15476, 11422, 13974, 13854, 11351, 7347, 4840, 8661, 13426, 12801, 24074, 15932, 7883, 8696, 14995, 20837, 19806, 19523, 16948, 15953, 10891, 18288, 21474, 18739, 13333, 12101, 17277, 11442, 10335, 3406, 3270, 1037, 13491, 30085, 27304, 24525, 26397, 30185, 28734, 23707, 22657, 12695, 19201, 23326, 8503, 3857, 12976, 16705, 18510, 21065, 17222, 13879, 7986, 14925, 20286, 17674, 19426, 22339, 22369, 15956, 13839, 22111, 23039, 27388, 24412, 25929, 23457, 17475, 5521, -582, 12813, 19393, 19432, 14796, 11797, 13491, 23690, 23743, 16688, 19665, 17477, 14182, 14477, 4700, -4523, -5872, 5217, 6635, 2567, 1598, 780, 5794, 9368, 10457, 10665, 12483, 16835, 24266, 28921, 31479, 29946, 31134]
19592C1134r862m022k140m615J1754J1785l898n219N93K551Q710P787p175q023
19578B9360N660J3909J6340O314Q17Q933J3715K0167L4200N5934J29386J87881
19566E22616O8616q2101j33120r8970l6209M1877J07794J67694Q1469q7561j52233
19555C99872j09865n7681j8430J6239M7594J04597J66485R8185p5265j42109j03651
19544C25971m0145M959P2178J51036J18578m9415j49264j24619p2975m8270l6390
19533A51644k5466j4563j6102o291Q770J3482r573j5774j0682j0602O549N969
19521G7361L161J5876L3197M0710N2116O4281L5036l0815n2648l6606Q702N9755
19509B70126P5817L2697n1739q8333p2114l4639j7946j9908p393J47mL158m439
$$ y = [31134, 21272, 17250, 15110, 10495, 22249, 34034, 30136, 24917, 25510, 28061, 36771, 44558, 37383, 29360, 35020, 48929, 65269, 71583, 72400, 81333, 95048, 115215, 149415, 205349, 334735, 522616, 591232, 509131, 376011, 277041, 240832, 282709, 390503, 558197, 639666, 552105, 399872, 290007, 232326, 213896, 230135, 277729, 382326, 548811, 646996, 571731, 429622, 325971, 285826, 290785, 362963, 513999, 632577, 583162, 433898, 309279, 236304, 188034, 151644, 126178, 111615, 95513, 89222, 97992, 111474, 101901, 86127, 75445, 64843, 71392, 77361, 80522, 96398, 129595, 170305, 222421, 286702, 321738, 290923, 238275, 201669, 210371, 270126, 345943, 378640, 326901, 238568, 166454, 131815, 113869, 93961, 86568, 86715, 86711, 89869, 85430]
19496H5430N255M634K4069N1325P2148P3759J8814l6977n6381k6144J1403N4186
19484B81521O4320p674o1866o9583n7657l1776j6481j4668k6573j0192J182K41
19472E0794O539J3519o040j3672q503Q26J2486J3893M005m078L956O266q636n336
19458F6019N516o74K821l453M386P3k96j474k39j961J6963J7342J0230J0051J9149
19443A44453L5142O6493N6304q090n6456n2041r708L6596O7265M7965k5320p5346
19431B27257o4931l7024j9680j9662j4781p596l072L211J8654J2511j0688q759
19419G5440p380l446Q589J8625J5989R456J1582K7502P0480P1512J5085l8164
19407B75270m9638j8168K410L8755O8639J4736o4047q4163n2309k7321j6586j2204
$$ y = [85430, 90685, 95319, 119388, 170713, 242861, 316620, 335434, 298457, 242076, 215932, 227335, 281521, 345841, 338167, 276301, 206718, 149061, 117285, 100804, 86136, 59563, 49371, 50553, 50794, 57333, 70852, 64812, 51140, 42637, 43463, 55949, 69842, 73847, 69769, 73725, 79991, 71355, 66019, 71535, 70861, 73682, 70229, 74615, 74688, 74392, 72918, 72679, 70718, 87681, 105023, 115253, 125304, 144453, 179595, 246088, 302392, 294302, 237846, 185805, 176097, 212693, 279958, 327923, 302603, 227257, 162326, 125302, 105622, 85960, 71179, 63583, 60511, 63722, 82376, 94887, 84199, 75440, 68060, 64614, 73203, 91828, 107817, 117273, 128855, 156357, 226837, 298349, 313434, 275270, 225632, 207464, 209874, 248629, 317268, 332004, 267957, 183794, 131485, 104164, 87578, 75374]
19395G5374j7862j2125o331O269Q767m144n846n556l637q159M710P415j929r535
19381B7411j16N645p8L885j816j8Q640Q221K006j537P506R037N219j485k581j6499
19365E3440j375r82j405L817J1771J4012J8804P771j6404k2093j7565J108p964
19352D2935r272P9L88q026o733k215M815J0890Q677J4794J0976M666n495O648
19338G3127L145o240j3626n843J431K076j545j0190j1353O784N220J626l182K428
19324D3858M159o092j542P83o907J554P263n719m932J489Q161j0250m826J7363
19310D4362R688j042n512m0N643L707k522J499J6445R171L602K752N761p795N80
19295H6299p755O342J3768K804J229n031j7800J559R074J5772J2738P221K942
$$ y = [75374, 57512, 45387, 39056, 45325, 54092, 49948, 44102, 38546, 34909, 26750, 31460, 38875, 36946, 27411, 27295, 32940, 32862, 36747, 34931, 34913, 43553, 51774, 53780, 52243, 59749, 68786, 74005, 72520, 69939, 53440, 52065, 51083, 49678, 53495, 65266, 79278, 98082, 105853, 89449, 67356, 49791, 50899, 42935, 33663, 33742, 34130, 26104, 19371, 17156, 21971, 32861, 41538, 56332, 67308, 71974, 66479, 73127, 76272, 70032, 56406, 50563, 51994, 54070, 52525, 42335, 30982, 37766, 42986, 44612, 41430, 43858, 48017, 41925, 40383, 41166, 34259, 35813, 43076, 37357, 32425, 33914, 42075, 31825, 26999, 44362, 54050, 53008, 47496, 47456, 53099, 56806, 54284, 55783, 72228, 81399, 85001, 87753, 93514, 85719, 86299, 78544, 84886, 98654, 101458, 102687, 97656, 79856, 81415, 90489, 106261, 118999, 126220, 129162]
19282A29162J1542M0823O9440J15633K04411K05987M8817j09037j33562o7606
19272E15610L8491J50858J73332N472j60242k02060j50083r5759n3624j7320j9857
19261A84818m784l613j0955R564J8782M7317Q0283J29508K16496J83870k128j43118
19249G06040j44041o3714N9347J78267J48999k6455j79041k04533j50248q0273
19239B44348m4064k8703k1218r888j1471j5898p322M20L152j84j6219j5174j0493
19226F7286J51N267M913J0689o155j0152K178O00j0667K511J1544P192P801l35
19212I2823J1430M206n861M835N70M080p24j931r88j1923n198n914j0962k885
19198G1558n53m582j4436j1139P541J1732K588O632M648Q131r41O60R851j428
$$ y = [129162, 140704, 181527, 250967, 366600, 571011, 776998, 825815, 716778, 583216, 515610, 554101, 704959, 878291, 883763, 723521, 521461, 371378, 275619, 221995, 204675, 184818, 180034, 176421, 165466, 175030, 193812, 241129, 321412, 450920, 667416, 851286, 849158, 706040, 561999, 498285, 557632, 735899, 884898, 858443, 679402, 474869, 324621, 244348, 200284, 171581, 150363, 140475, 129004, 113106, 105784, 106204, 109356, 109172, 92953, 77779, 67286, 67437, 72704, 77617, 88306, 82151, 71999, 74177, 74777, 64110, 66621, 78165, 85357, 93158, 92823, 104253, 108459, 102598, 107433, 108003, 112083, 111359, 109428, 108440, 96517, 91319, 85405, 74443, 71558, 71005, 66423, 51987, 40848, 48389, 60121, 62709, 69341, 73989, 82120, 81179, 81839, 91690, 90262]
19184I0262r989j1602m763N753R146N593M9m533j5950q463m24K002L640P496J594
19169F9811l048p947o85J4013k688r543J1083J7200K486p900o836q486o688K232
19155F3004L115J1243j189N46m413m785M015N629K453K376n08O925M241o427k51
19140H5974L871J795M483O043m072m735l287j667M313K4005L921r178J722M184
19126A17372k737K169O736N259m687j3095n813J434K590N950l751j223N451J0098
19112A25753Q523R348j0908l104J6008J2976J3310J293j2259k0515m940q639l370
19099A23476J2565p235n740K164l802k382O111K56L877J0421M744N190Q017p274
19085A50388q919J0789K5919K0979N713M176m65j2518j1335n854l23N662M238
$$ y = [90262, 80273, 68671, 63908, 69661, 78807, 84400, 84449, 79916, 63966, 55503, 55079, 57081, 60721, 68217, 69811, 66763, 58816, 58131, 72144, 69456, 59913, 70996, 88196, 90682, 82782, 75946, 67460, 60772, 63004, 66119, 77362, 76173, 76719, 72306, 67521, 71536, 77165, 79618, 81994, 81486, 88411, 92652, 86225, 85974, 89845, 91640, 96123, 102166, 98094, 93359, 90072, 88405, 92718, 116723, 120644, 111466, 113188, 117372, 114635, 116804, 123540, 128799, 124112, 111017, 105204, 106638, 109228, 115178, 111427, 110204, 115655, 125753, 134276, 143624, 132716, 129612, 145620, 158596, 171906, 173199, 160940, 140425, 135485, 126846, 123476, 136041, 128806, 123066, 125230, 121428, 119046, 125157, 125413, 129290, 139711, 144455, 149645, 157662, 150388, 141469, 152258, 178177, 199156, 204869, 209045, 208580, 196062, 184727, 178873, 178550, 184212, 188450]
19072A88450m678k113J070K37k933K970l689P80K673J5045N552p784K823k24J2555
19057B10734K1684L39j934k144o199Q43J2436J0845J587r579R83N766Q228J9613
19043B73202K0837K0465R163J2875J0148P945L726M90N857O635J495J5425J6633
19030D04896K3L338P227J3028K3147L8061M4330P2634R1739R0734L8513k1643
19018H06027k0803L784M3325Q1490R9804N1906j3283l3745J727O5879J23110J25861
19006A335082O7550L2826N4464J01842J90878K86214L19713K45038J99891K56415
18996C089913L48026M77506O50157Q49889J180783J812375L066193N554370J0232383
18987B7261595J4726749Q440913m440892r991347p348028p94551O659467J3352762
$$ y = [188450, 183772, 181659, 182729, 182966, 180033, 183003, 179314, 180094, 182767, 197812, 203364, 195580, 198403, 198179, 210734, 232418, 232757, 230823, 228679, 222480, 223323, 235759, 246604, 248191, 238612, 239595, 245361, 253589, 273202, 294039, 314504, 323667, 336542, 346690, 354635, 358361, 358851, 364708, 371343, 372838, 388263, 404896, 404919, 408257, 415484, 428512, 451659, 489720, 534050, 606684, 698423, 789157, 827670, 806027, 785224, 789008, 832333, 913823, 1013627, 1065533, 1052250, 1018505, 1020232, 1086111, 1209221, 1335082, 1402632, 1435458, 1489922, 1591764, 1782642, 2068856, 2388569, 2633607, 2833498, 3089913, 3437939, 3915445, 4565602, 5415491, 6596274, 8408649, 11474842, 17029212, 27261595, 41988344, 50429257, 45988365, 35997018, 28648990, 27854439, 34513906, 47866668]
18979D7866668Q715499n956961j3659881j2505420p615296m136785k289085j218886
18971I199853n77027j50210K10875O26301J255648K382230M571808Q716648J4486684
18962D0722810J3632988Q62260q718982r833186m441228L149723J1426935J3074733
18954E9876053J89111j1777595j4923897j1342288o940741m029313k305372j347451
18946G398507q66672p54116p48517o33276m07173j13090J90206L89617M18030
18937D873516O04792P38092O7856p47933q55805m17424J40400P28612J038173
18928F170279K49698r12497j396699j158614o93636l70560j64214l5903k7350
18919A660504j17304j53453j02873K846J22938Q0966j00881j83564j35074n2656
$$ y = [47866668, 56582167, 50625206, 36965325, 24459905, 16844609, 12707824, 10418739, 9199853, 8622826, 8472616, 8683491, 9309792, 10565440, 12947670, 17519478, 26236126, 40722810, 54355798, 55218058, 46499076, 36665890, 32224662, 35374385, 46801320, 59876053, 60065164, 48287569, 33363672, 22021384, 15080643, 11051330, 8745958, 7398507, 6531835, 5777719, 5029202, 4395926, 3988753, 3875663, 4065869, 4455486, 4873516, 5478308, 6216400, 6284256, 5536323, 4680518, 4263094, 4403494, 5132106, 6170279, 6419977, 5507480, 4110781, 2952167, 2258531, 1887971, 1723757, 1687854, 1660504, 1543200, 1389747, 1286874, 1289720, 1412658, 1493624, 1392743, 1209179, 1074105, 1021449]
18909A021449M3766J44326R7340p6902j58415j45745j08725o5710k4841p349J7951
18898G37145L9397L2111J6183n479k1949k1789q197K0813L2761N2515P2280J10833
18886A056624Q1949r707l6580m36L1133P7592J27136J27008O4470O7563J17796
18875A704548K13599K31547K63054M09652P24286J285187J654706O48576m38854
18866F696301o92049j34403O72975J593982K531137K509066K981364N839477J1872245
18857C3870095J5728974M928392q005217j1487787p040696j52413P071813J2101783
18849D7014944L955621q705585j3036835j0195515n728828l066806j712758j050169
18841G474069n99249q0980O25893J383830J006881l54126r51622o60481J76475
$$ y = [1021449, 1065215, 1209541, 1306881, 1229979, 1071564, 925819, 817094, 751384, 726543, 719194, 737145, 776542, 808653, 824836, 819357, 797408, 775619, 767422, 788235, 820996, 873511, 945791, 1056624, 1138573, 1128866, 1092286, 1091850, 1122983, 1200575, 1327711, 1454719, 1519189, 1586752, 1704548, 1918147, 2149694, 2412748, 2822400, 3546686, 4831873, 6486579, 7135155, 6696301, 6004252, 5869849, 6542824, 8136806, 10667943, 13177009, 16158373, 21997850, 33870095, 49599069, 54527461, 46522244, 35034457, 27993761, 27841348, 34913161, 47014944, 50970565, 42264980, 29228145, 19032630, 13303802, 10236996, 8524238, 7474069, 6874820, 6793840, 7419733, 8803563, 9810444, 9456318, 8504696, 7844215, 8020690]
18832H020690J176480K280288K697402K675457M613176R781741J6435828J1427315
18824E9108377m561882j2298166j0246426l134255M329748J1440275R147321n026456
18816D8758536j3201752j2735290p897617m309655k458700j570514j160076q82614
18808D542318o24855m14591k99819j90571j55260k66211l11713k58055j57221
18799A864022j40625j26802p0723k5984q4588j36860j38773q2986J84R5719J66680
18788A319264J80021J10148l2152j64892j95177j43159l0581J14633J72578M1287
18778A371970j54750k38465k05404j36121q9787n4935k3007j603j33o52Q893L4422
18766E10428R745m3887l3448k9037k6044j2244R395L3175M1985P1998J37317J50469
$$ y = [8020690, 9197170, 11477458, 14174860, 16850317, 21463493, 31245234, 47681062, 59108377, 54546495, 42248329, 32001903, 28867648, 33197396, 44637671, 53784992, 48758536, 35556784, 22821494, 14923877, 10614222, 8155522, 6585008, 5424932, 4542318, 3917463, 3502872, 3203053, 3012482, 2857222, 2591011, 2279298, 2021243, 1864022, 1723397, 1596595, 1525872, 1499888, 1415300, 1278440, 1139667, 1056681, 1056865, 1152584, 1319264, 1499285, 1609433, 1577281, 1412389, 1217212, 1074053, 1043472, 1158105, 1330683, 1371970, 1217220, 978755, 773351, 637230, 547443, 492508, 469501, 467898, 467765, 467113, 476006, 510428, 520173, 476286, 442838, 413801, 387757, 375513, 384908, 418083, 460068, 532066, 669383, 819852]
18754H19852K1454q8666j19583q4975j151Q5266J22782J9495j12204j46694j16098
18743C99478p8503m1518j9780j1341p060j505l519n775o326N460M28j0911q592
18730B10536r129Q781J8300J0303P31j2111j8996r101K1810N3251R7424J20044
18718D91843O0581m7144j07122p6108k5192K6802P8153O9447l0542q5602q3170
18707B71946n7997l7374k4749j4918J587J0829N21j492j4829n683J5026K0269
18695A63136k336m459n488K084K2466N0546Q0289J21939J01668j9416j02350r9549
18683C08530l4757J6298P1263J08619J2585q8187j00977p9248n0412k6653j4472
18672A22589j3104p160N523n676K107j5889q696l37J1026K259N260N492Q89P286
$$ y = [819852, 841306, 752640, 633057, 548082, 546931, 632197, 754979, 774474, 662270, 515576, 399478, 320975, 279457, 259677, 248336, 241276, 239771, 236252, 230477, 224151, 229611, 230039, 219128, 210536, 201407, 210188, 228488, 238791, 239522, 227411, 208415, 199314, 221124, 274375, 371799, 491843, 552424, 505280, 398158, 322050, 296858, 323660, 401813, 471260, 440718, 355116, 271946, 213949, 176575, 151826, 136908, 138495, 149324, 149845, 148353, 133524, 127841, 142867, 163136, 160800, 156341, 150853, 152937, 175403, 225949, 306238, 428177, 529845, 510429, 408079, 308530, 273773, 290071, 361334, 469953, 482538, 394351, 293374, 214126, 163714, 137061, 122589, 109485, 102325, 107848, 102172, 104279, 88390, 79694, 79357, 90383, 92642, 97902, 103394, 104283, 111569]
18658A11569J3665J0956O158j2343j2257l380j369o813r891J793K0726L86k0631
18645I8569k2543r469m977j0217o590k986N283R100J0424J831p400J0694N846
18632G7565K3112L0154J0914p28M08M982M140Q704J0641J5768L5720Q5234J56187
18619D62801J38232k9189j16837j02104l6994R703N4693J11144J33987k6818j30233
18608D68385j28867o9967l4830k7925k2725k8508k4994o596j2536K647J0259J3066
18596A37409J1210N002N581J8405J8513M0244N5938P8696J57674K28110Q0799
18585H37581o2456p2772K1708J17200J24371J11456J21900K7288j14620p9841
18575A031815N5186J88523K30164j323k77959l48177k69538j59558q0291m8652
$$ y = [111569, 125234, 136190, 142348, 130005, 117748, 114368, 112999, 106186, 96295, 98088, 118814, 119200, 98569, 76026, 66557, 61580, 51363, 44773, 41787, 47070, 56170, 66594, 68425, 61025, 71719, 77565, 100677, 130831, 141745, 141017, 141425, 146407, 150547, 159251, 169892, 185660, 221380, 306614, 462801, 601033, 571844, 455007, 352903, 315909, 325612, 380305, 491449, 625436, 598618, 468385, 339518, 269551, 234721, 206796, 184071, 155563, 130569, 123973, 111437, 114084, 124343, 137409, 148619, 153621, 159202, 177607, 196120, 236364, 292302, 370998, 528672, 756782, 837581, 775125, 702353, 724061, 841261, 965632, 1077088, 1198988, 1226276, 1111656, 1031815, 1087001, 1275524, 1505688, 1504365, 1226406, 878229, 608691, 449133, 368842, 320190]
18565C20190j0387p057j937J7070L7982O4517J10200J13428P6982J9380n1500
18554F88868n1133j74Q0183J07820R8216Q2933R9744J19386m2477k49329k91752
18543F42285k07534j14814n8756l6931k8385k5105j9215r523j3918J053J9656
18532A48813K9397M4046M2009L6190N2505Q1769N4360l9788r4840r4793n7734
18521B01934l5910k3349k3067n146l163l190K844O794J0465J5068k242j4342o460
18508A20236P06K4019K8703M0834M7691Q1793J03374J1082o2451q0254n4476j3370
18496B47887K6442N2295R882n4552p8916n7251k8721j3200r632j4179r020l88
18484G0647l827l874j540l119R09N678P535J7321K4431J8599J2060J6088K7705
$$ y = [320190, 309803, 302746, 300809, 317879, 355861, 420378, 530578, 644006, 720988, 740368, 688868, 637735, 637561, 717744, 825564, 923780, 1006713, 1106457, 1225843, 1183366, 934037, 642285, 434751, 319937, 261181, 224250, 195865, 170760, 151545, 142022, 128104, 129157, 148813, 178210, 222256, 264265, 300455, 352960, 434729, 489089, 449301, 354461, 259668, 201934, 166024, 142675, 119608, 114462, 111299, 108109, 110953, 117747, 128212, 143280, 141038, 126696, 120236, 120942, 144961, 173664, 214498, 262189, 343982, 447356, 458438, 395987, 315733, 261257, 247887, 274329, 326624, 336506, 281954, 203038, 145787, 117066, 103866, 94234, 80055, 71035, 70647, 66820, 62946, 61406, 58287, 59196, 64874, 72409, 89730, 114161, 132760, 144820, 160908, 188613]
18471A88613O5783L8183l8694o0721m8615l7742k3623p716K15k386q742K47l276
18458F1526j0179j053K3260K5947K6738L9326P6272P1453O153m1247m6377k1531
18446B10288R429L5882N9657L03m9823n9126m9673l2559j2125j2904n647j233
18434I2469K997K1151J3840R428J0900K8980O6712R0147N4863j8172o0741n2487
18422B60087r555K8345O2985L2533m0223q2182o6583m7352j9151j084p019k486
18410A08315n255R344k040o414Q72K156m518J4714L0232J8909L302K098Q404j300
18396A78819R237J1165J6905K2456J9276N0256P8911Q8561O6291P687l2820m3297
18384D73447k4169J8636M6022L6074N721l7988p4671q8365p3204n1686k9931k6094
$$ y = [188613, 254396, 292579, 253885, 193164, 144549, 106807, 83184, 75468, 75683, 73297, 64555, 64802, 61526, 51347, 50294, 73554, 99501, 126239, 165565, 241837, 313290, 319443, 278196, 231819, 210288, 219717, 255599, 315256, 315559, 265736, 206610, 156937, 124378, 112253, 99349, 93702, 92469, 95466, 116617, 130457, 139885, 150785, 179765, 246477, 336624, 391487, 373315, 312574, 260087, 250532, 278877, 341862, 374395, 334172, 251990, 185407, 138055, 118904, 117820, 110801, 108315, 103060, 112404, 110364, 103950, 104822, 106978, 102460, 117174, 147406, 166315, 169617, 171715, 180119, 178819, 188056, 199221, 216126, 238582, 257858, 308114, 387025, 475586, 541877, 549564, 516744, 473447, 449278, 467914, 513936, 550010, 555731, 517743, 443072, 354707, 281503, 229817, 199886, 173792]
18372A73792q830J1663P788L416J586r090K448J4274M525J0878J8503K7036L0222
18359B88211N5028R8166J24021R9085N0649j0327n7815o1763k8554J3371K8255
18348E98327j3764o4405j03142j04002p8016n8326l1226j6718j4939o259k45K041
18336A09326j757n534p666r258p484l430K112K536P082N414r245q293q400R193
18322G4596Q321Q423q63j1441K496M606Q977J280N651r87p206r200K528J5710
18308A02891K0697J2958K1745O98j5156j4699n956P091J6977J6915O535J346k572
18295A69470O202K156p833J7255L1661M3825Q7588J35101J75905R4545r1820j62269
18283E01786j38778p8149m2810k6740j7208p898j762J9411J0240J3881J6623K8520
$$ y = [173792, 164962, 176625, 184413, 187829, 189415, 180325, 182773, 197047, 201572, 212450, 230953, 257989, 288211, 343239, 441405, 565426, 664511, 715160, 704833, 647018, 585255, 556701, 570072, 598327, 584563, 520158, 417016, 313014, 234998, 176672, 145446, 128728, 113789, 107530, 107285, 109326, 107569, 102035, 94369, 85111, 77627, 74197, 76309, 78845, 85927, 91341, 82096, 73803, 65403, 74596, 82917, 91340, 90477, 79036, 81532, 86138, 95115, 96395, 102046, 101059, 93853, 84653, 87181, 102891, 123588, 136546, 158291, 158989, 143833, 129134, 123178, 130269, 147246, 164161, 170696, 172042, 169470, 175672, 177828, 169995, 187250, 218911, 262736, 350324, 485425, 661330, 755875, 664055, 501786, 363008, 284859, 242049, 215309, 198101, 190203, 188441, 207852, 218092, 231973, 248596, 277116]
18271B77116N5609J11226J83279J46805l0420r0975p1093o1184o3303p0701m9261
18260C37098m513L5283O4784N1799M7482Q3649R5815n3270j49715j46396q6180
18249B75836n4223k1354m294K452j808n668l111N791J1227L4136N7358Q6378J23172
18236E05892J73892Q0005k5003p7181j33321j21002p4590l7411Q057M8502M4189
18225C92029k9389o5591o7437m6106k8311j7109p279j132p893q097j698p705j3703
18212I0579n663N722Q815J3730Q037O5j4563j1611o30o541r129n527m19J2102
18198H4967L207r414j143P279L931R02J776j1082n559Q395R577J0365K2L703j0291
18183I6635o394j918K407R349J8j931K545J1987K0958L4263J7212L000q75j3574
$$ y = [277116, 332725, 443951, 627230, 774035, 743615, 652640, 581547, 520363, 457060, 386359, 337098, 332585, 367868, 432652, 484451, 531933, 615582, 711397, 658127, 508412, 362016, 275836, 221613, 200259, 195965, 198417, 196609, 190941, 187830, 193621, 204848, 238984, 296342, 382720, 505892, 679784, 759789, 734786, 657605, 524284, 403282, 328692, 291281, 299338, 347840, 392029, 362640, 297049, 229612, 183506, 155195, 138086, 130807, 129675, 121782, 113685, 111987, 104282, 90579, 84916, 90638, 99453, 113183, 121220, 121285, 106722, 95111, 94481, 87940, 78811, 73284, 72865, 84967, 88174, 78760, 77617, 84896, 88827, 89729, 91505, 80423, 74864, 83259, 92836, 103201, 103223, 106926, 96635, 90241, 88323, 90730, 100079, 100097, 98166, 100711, 112698, 133656, 167919, 185131, 188131, 187256, 173682]
18169A73682k0008l2156j6072M719l923J016m70p718o510N090J3135L575Q984
18156A23344N138J8881J2797K086P39M431J5215K4981K6641J5507R484j4583k6175
18143B18486j3763j5732j0302n944P926o649q865J2896J2486J5005K3590J5544
18131B44678Q940O133J4483K4651K8386K5599K7232L3257M5157N4218N2943O1408
18119F27085Q9493J14188J49449K06402K73956M00274O29557J054228J932923
18110E477555L928340P667545P612723j720337o749407o752442l850776j918939
18102C694262j059130o48211m13498k90373k01675j63073j28955j05578q6764
18093E97005n9630l8061k7452k7341k8331l1299j3649j1078m601k990j1455p816
$$ y = [173682, 153674, 121518, 105446, 110165, 106242, 107258, 106788, 99070, 92560, 97650, 110785, 114360, 123344, 128482, 147363, 160160, 162246, 162985, 167416, 182631, 207612, 234253, 249760, 259244, 244661, 218486, 204723, 188991, 178689, 172745, 180671, 174022, 165157, 178053, 190539, 205544, 229134, 244678, 253618, 259751, 274234, 298885, 327271, 352870, 380102, 413359, 458516, 512734, 565677, 627085, 716578, 830766, 980215, 1186617, 1460573, 1860847, 2490404, 3544632, 5477555, 9405895, 17073440, 24686163, 22965826, 16216419, 9463977, 5613201, 3694262, 2635132, 1986921, 1573423, 1283050, 1081375, 918302, 789347, 683769, 597005, 537375, 499314, 471862, 444521, 416190, 384891, 371242, 360164, 355563, 352573, 341118, 333302]
18081C33302n654L113N058J655K292J757J4160L1297M5394R6859J84127K72504
18069I85864L48963L50309K09135l101k21311l33337l41494k61810j64118r1626
18059D77474n6242j8636k9983k2058k3999j3233N012J0425J3593J7337J9156K621
18047C81467j728n091o066L828N032j298Q163J0684K9191N8451M8199r104l4658
18034D87070k7386O432L8162N6898J12104K02467J68034k3742j39004j42346p1092
18023F67597j9120J0259K0506M8456P9478J12621P2258K311q683M8824J01119
18012A135626J23545J16930Q9547M8554O1080J45786K42495K41772K34822J46861
18002B587018K4207M3090J78171L78645O55255R95981J332187K048642L019674
$$ y = [333302, 327648, 330761, 335819, 337474, 339766, 341523, 355683, 386980, 432374, 529233, 713360, 985864, 1334827, 1685136, 1894271, 1891170, 1669859, 1336522, 995028, 733218, 569100, 477474, 421232, 402596, 372613, 350555, 326556, 313323, 318335, 328760, 342353, 359690, 378846, 381467, 379739, 374648, 368582, 372410, 377442, 376144, 384307, 394991, 424182, 482633, 530832, 521728, 487070, 459684, 466116, 504278, 561176, 673280, 875747, 1043781, 1020039, 881035, 738689, 667597, 648477, 658736, 679242, 727698, 807176, 919797, 992055, 994366, 985683, 1034507, 1135626, 1259171, 1376101, 1465648, 1514202, 1575282, 1721068, 1963563, 2205335, 2440157, 2587018, 2611225, 2654315, 2832486, 3211131, 3866386, 4862367, 6194554, 8243196, 11262870]
17993A1262870L124096M087393Q185420J5279136J3354818l744494j3435536j3433460
17985B4680243q246492m469726k610618j623146j009764o79781m74020l49592
17977E217104k10634K518K36964M83907P97739J225195J765883K629526K998025
17968A5146227L410721O277234J2566304J6560034M030384q329386j1076052o666826
17960C1918640K70690Q297399J3207405J604113j1123818j4272549j0223478n702097
17952A3976305l288602k103167j394437r47166o61473m37190k62577j44491N661
17943D742863K48680N64503Q98565J249740J890111K531574K578840M029800Q374991
17934B7109667J4386767Q719898o633709j3138821j1337474o470125l574315k228317
$$ y = [11262870, 14386966, 18474359, 26659779, 41938915, 55293733, 51549239, 38113703, 24680243, 16433751, 11964025, 9353407, 7730261, 6720497, 6040716, 5566696, 5217104, 5006470, 5008988, 5245952, 5729859, 6527598, 7752793, 9518676, 12148202, 15146227, 18556948, 24834182, 37400486, 53960520, 57990904, 49661518, 38585466, 31918640, 32189330, 40486729, 53694134, 55298247, 44174429, 29901880, 19678402, 13976305, 10687703, 8584536, 7190099, 6242933, 5581460, 5144270, 4881693, 4737202, 4742863, 4991543, 5556046, 6454611, 7704351, 9594462, 12126036, 14704876, 18734676, 27109667, 41496434, 50216332, 43582623, 30443802, 19106328, 12636203, 9061888, 6833571]
17926F833571j464039r42620n70182k36752M3300j40810m25263m24588k29592
17917B443025j35618j75906j88000j73076j50027j12175l5397P6267R7964n4327
17907A592730j77990j68647r0175j00247j25390q9509k4207N3250J31461J97772
17897A199048J87406J73008n3576k45953k47883j24643J9723L1707m4755n2562
17887H41520j147N6517N1765p5174j64680j60314j01304o3215l6226j9936j3716
17876C14090j1249l068K4610L5492K8155K6009J3932K0048M0899R5318N4562m8165
17864E90633q3424m9804k0140n1947o2134n0680k6868O711J7173j3213k4306k8097
17852B03904j5242j5319j014k576j1074o909o91j023M463J0692L7685O0223N6012
$$ y = [6833571, 5369532, 4426912, 3856730, 3619978, 3663278, 3522468, 3097205, 2672617, 2443025, 2307407, 2131501, 1943501, 1770425, 1620398, 1508223, 1472826, 1549093, 1647057, 1592730, 1414740, 1246093, 1155918, 1055671, 930281, 840772, 816565, 869815, 1001276, 1199048, 1386454, 1559462, 1505886, 1259933, 1012050, 887407, 907130, 938837, 894082, 841520, 840373, 896890, 948655, 873481, 708801, 548487, 447183, 383968, 347742, 327806, 314090, 302841, 299773, 324383, 359875, 388030, 414039, 427971, 448019, 488918, 584236, 638798, 590633, 507209, 457405, 437265, 385318, 323184, 272504, 245636, 252347, 269520, 256307, 232001, 203904, 188662, 173343, 172329, 169753, 158679, 151770, 151079, 150056, 154519, 165211, 202896, 263119, 319131]
17839C19131N6896L4921O293l5725o4734m9464l7176p898J4327j809k8378l0212
17827A76172k7858j4422j0585j4852l881K757m06j1729o765L413N57j870q819
17814H1712q812q32L003K248P321P211o889j3611k387J1587j667J165P141P163
17800I4353q724j6761q81P2j196q262q239M741J781P810M314l810q140O93m048
17785E3703N015n946O74l992J986L221L563q885j956M888m217o503N354j696K89
17770D5498K062L593J496l917j57l351j1160q01J2999J1734j328j720L871j800
17756E7019L538N983J260m634p905p490l717j633J836N740l261P143K962J643
17742E8484O779J2629N537N948J0539n168j1987r152n835M82j643j490o49k86
$$ y = [319131, 376027, 410948, 417241, 381516, 316782, 267318, 230142, 222244, 236571, 234762, 206384, 176172, 148314, 133892, 123307, 108455, 104574, 107331, 106925, 95196, 88431, 91844, 92401, 90531, 81712, 72900, 72068, 75071, 77319, 84640, 91851, 84962, 71351, 68964, 80551, 78884, 80049, 87190, 94353, 85629, 68868, 67987, 68059, 66863, 58601, 50362, 55103, 56884, 64694, 69008, 65198, 57058, 57751, 53703, 58718, 52772, 53446, 49454, 51440, 54661, 58224, 49339, 47383, 52271, 48054, 41551, 46905, 45209, 45498, 47560, 51153, 52649, 48732, 48575, 45224, 34064, 33263, 46262, 57996, 56668, 54948, 58819, 57019, 60557, 66540, 67800, 63166, 55261, 47771, 44054, 42421, 44257, 49997, 46736, 53879, 56841, 58484, 65263, 77892, 83429, 89377, 99916, 94748, 82761, 73609, 67774, 68256, 66613, 65123, 64474, 64188]
17728F4188j65k88k266o766m124P577J703J295l911o227k398m142J4017M448n366
17713E7575k281M676r54n285L17L360R71L181J668j480m287n290o948J997P481
17698E4701J5996J5113R576J2718m434j9257j9027j3412r450n716Q478Q036j64
17685E3158k477K966M390J4666j973p186n005q204m260J5415J8804Q727o94j1212
17671G7115M464J3183P482j2660j9930j6298q998q890j0016L668L237P490Q274
17658D8121n020l513O557L264p003j858R81O662m761K056K62n924n960P637N929
17643D7430k215j2222p272P096P215L823L317k534j051K038n421m514j178q330
17629B6182o919j127J0853J1611J2327J907j650q766J079N559J6282J1343J7116
$$ y = [64188, 64023, 63735, 61469, 54703, 50579, 58156, 59859, 61154, 57243, 51016, 48618, 44476, 58493, 62941, 57575, 55294, 59970, 59016, 53731, 54048, 57408, 58379, 61560, 63228, 61748, 57461, 52171, 45223, 47220, 54701, 70697, 85810, 95386, 108104, 103670, 84413, 65386, 51974, 42524, 36808, 45286, 53322, 53158, 50681, 53647, 58037, 72703, 70730, 63544, 58539, 50335, 46075, 61490, 80294, 89021, 88327, 77115, 81579, 94762, 102244, 89584, 69654, 53356, 44358, 35468, 25452, 29120, 32357, 39847, 48121, 43101, 39588, 46145, 49409, 42406, 40548, 41529, 48191, 43430, 45486, 45748, 39824, 33864, 41501, 47430, 45215, 32993, 25721, 32817, 40032, 43855, 47172, 44638, 43587, 45625, 40204, 35690, 34512, 26182, 19263, 18136, 28989, 40600, 52927, 54834, 53184, 44418, 45497, 51056, 67338, 78681, 95797]
17616I5797J4545o899p741n595j3752j4064j7258o830L634n648m951m917N458
17603C1779O070M152j74p85m320k847L357O789J604m518R953J882p322k586q038
17588C4996n703R561L091M48L59o096j0663k333P948J1031M895r119k760j2567
17574B3088O664J2710r044r188q814J1677R961N889n293p230r412J406j145o570
17560A4699O928Q164L354m424p749l962M478o447k980O024O326J3436p9k960r722
17545B5086j4353J579J9565R734l620k179l707p719k313O697n56M310l248r824
17531A9452L106J786M261M017j276j473j346M444n329n323m844l650P268M767
17517B5860m83j369L217o833j3239r728k028J681n458K68Q999J0923L303o980
$$ y = [95797, 110342, 103443, 95702, 90107, 76355, 62291, 45033, 38203, 41837, 36189, 31238, 26321, 31779, 37849, 42001, 41827, 41042, 36722, 33875, 37232, 44021, 45625, 41107, 51060, 52942, 45620, 43034, 34996, 29293, 38854, 41945, 42393, 42752, 36656, 25993, 23660, 31608, 42639, 47534, 38415, 35655, 23088, 29752, 42462, 33418, 24230, 15416, 27093, 37054, 42943, 37650, 30420, 21008, 22414, 21269, 14699, 21627, 29791, 33145, 28721, 20972, 17010, 21488, 15041, 12061, 18085, 24411, 37847, 37768, 34808, 25086, 10733, 12312, 31877, 41611, 37991, 35812, 32105, 24386, 22073, 28770, 28214, 32524, 29276, 19452, 22558, 24344, 28605, 32622, 31346, 29873, 28527, 32971, 27642, 22319, 17475, 13825, 21093, 25860, 25377, 24008, 27225, 20392, 7153, -2575, -4603, -2922, -8380, -8112, 887, 11810, 15113, 8133]
17503H133j2740N011j099J105L305Q113J1207J320p544M371P655j0595q84j301
17489A6057n032L586N900P174P195J7919J1653R10r30q152O14q012j1857k789
17475C4236j2697N556M277J718j2109q393l58J102J788J1341R249M183j0314O041
17461C5620O341l414n009K190K116R924L7p527O457K730J1344J5549K0290K3692
17447A20340M2513P7552Q2021R210l8741k3285j9763m3685n2362m3908k2253m387
17435H3252K427L300j1393j0432j151q547o803Q257J6319J2803K2816J2783K9009
17422A52640N5010P3014L4165k8851n4439l9953N777L7264O8914K6085n0099q0378
17410A99149n7049l0611k7112j0593q004n342n308K930k895r527k460J195l150
$$ y = [8133, -4607, 404, -695, 410, 3715, 11828, 23035, 24355, 16811, 21182, 28837, 18242, 17358, 16057, 11025, 14611, 20511, 27685, 34880, 52799, 64452, 65362, 64432, 56280, 56894, 48882, 37025, 34236, 21539, 27095, 31372, 33090, 20981, 12588, 12230, 13332, 15120, 26461, 35710, 39893, 29579, 35620, 41961, 38547, 33538, 35728, 37844, 47768, 47805, 40278, 46735, 49465, 60809, 76358, 96648, 120340, 162853, 240405, 322426, 331636, 292895, 269610, 249847, 206162, 153800, 109892, 87639, 83252, 85679, 88979, 77586, 67154, 66003, 57456, 50653, 58910, 75229, 88032, 110848, 123631, 152640, 207650, 280664, 314829, 285978, 231539, 191586, 197363, 234627, 303541, 329626, 279527, 199149, 142100, 111489, 84377, 73784, 65780, 60438, 55130, 58060, 55165, 45638, 43178, 44373, 41223]
17397D1223Q800K048J2760J1843J6953K3207L3197O5702O5550j0255o9758o3192
17385A38078m8220k6688j5738j0633j1314p431l606j229J427j588K349k200L46
17372A3553m622j2032L235K576J591N271Q693J434K382j306L522K138n516m170
17358A6749o576m544K490l76J4053Q969k482o115K836L02n079q448N361Q353r055
17343A6438p295K806P980k697J346j536R87o352o812k826m601K830O69q5P594
17328H446K813m291K51j521j7097k512J7658L766j447L123O241j932o939K310
17314H869J052k67n840L405Q97q052L917J611O97K559j854q67m364J313n946M392
17298A522J4279m828j274j16K172P248m050p336p497j526R591J990m84l126J741
$$ y = [41223, 50023, 52071, 64831, 76674, 93627, 116834, 150031, 215733, 281283, 271028, 201270, 138078, 89858, 63170, 47432, 36799, 25485, 18054, 14448, 13219, 14646, 13058, 15407, 13207, 13553, 8931, -3101, 134, 2710, 4301, 9572, 18265, 19699, 22081, 20775, 24297, 26435, 20919, 16749, 10173, 5629, 8119, 7743, 21796, 30765, 28283, 22168, 25004, 25306, 20227, 11779, 17140, 25493, 16438, 9143, 11949, 19929, 17232, 18578, 17042, 18029, 11677, 4865, 2039, -2562, 268, 937, 852, 8446, 11259, 6968, 7219, 5698, -11399, -13911, 3747, 7513, 6066, 9189, 15430, 13498, 6559, 8869, 9921, 9654, 3814, 7219, 8116, 64, 3981, 5592, 6289, 8848, 6994, 6127, 1763, 3076, -2870, 1522, 15801, 10973, 9699, 9583, 11755, 19003, 14953, 7617, 120, -1406, 8185, 10175, 9691, 6565, 8306]
17283H306J3925P098l985j1989J448j250j0130L024L87M460M158n531j2263k113
17269d455J336O717N271N855M068q8n916q035P946l937k003N758L408m227k411
17254I287l363k81J839k383q840O69J786Q085o193L063k836n153O73N97k345O339
17238I44m687k014K767P03k058L21J878K930N564J0713Q191K1l04K311m468m623
17222A8189J2698j909j801j1831j0924m627K224o104M799k626j967J916K443p040
17208f560j405L0L637L063R254M263N071J54j229j382r04J1O14N838k359p009
17192A1087m987L063J1100N976o37r80n61M295P869m414m105j3230p018k748N922
17177A0632j500q577Q19L35l442Q957j088l852j796L52N53l907L032K757j365
$$ y = [8306, 22231, 29329, 25344, 13355, 14803, 13553, 3423, 6447, 6834, 11294, 15452, 9921, -2342, -4455, -3119, 3598, 8869, 14724, 18792, 18704, 12788, 4753, 12699, 8762, 6759, 12517, 15925, 11698, 9287, 5924, 5643, 7482, 5099, -3741, -3072, -1286, 6799, 606, 3669, 833, -4320, -3647, -3050, -5395, 944, -3743, -5757, -2990, -2287, -4345, -4024, -2146, 784, 6348, 17061, 25252, 25273, 24969, 27280, 22812, 18189, 30887, 28978, 27177, 15346, 4422, -205, 2019, -4085, 714, -1912, -3879, -1963, 480, -6560, -7965, -7935, -4298, -1235, 8019, 12282, 17353, 17507, 16278, 14896, 13992, 14003, 14617, 20455, 18096, 11087, 6100, 9163, 20263, 26239, 25602, 24622, 24061, 28356, 36225, 31811, 27706, 14476, 7458, 4710, 10632, 9132, 555, 1374, 1709, -1733, 7224, 6136, 2284, 488, 840, 1393, -2514, 518, 3275, 1910]
17162A910l99j594Q458M017q8j220n211k407j800J709q645o48L835J283J097O856
17146G153R41P763n132p147O767o594J462J80l487j0699K279J499o514R349O036
17131C856p348p754J747M175J909o98j898k143P80m92J132j0629n067O809L221
17116a2400j4738J311L496J1213R328J0162j245j964r784M139Q634J153p261N441
17102G485M379m892k06k397j255l361l176l921j908M660L231O047L137j654k79
17087E890k934m901N274Q171o804M00Q51P82k715J424L308M165m64m454p545L563
17071D011K950p59L019j200l462r84l207K502L013M627J94J1322m016r819M412
17056A2603Q656m238n296r434j3789M272K984N687K878N53Q64R851O614L45r882
$$ y = [1910, 1511, -83, 8375, 12392, 12304, 11084, 5873, 3466, 1666, 3375, -5270, -5918, -2083, -800, 297, 7153, 8094, 15857, 10725, 3578, 10345, 3751, 5213, 5393, 1906, -8793, -6514, -5015, -11529, -2180, 3856, -3492, -11246, -9499, -5324, -3415, -4113, -6011, -8154, -7374, -7866, -6734, -17363, -22430, -15621, -12400, -27138, -25827, -22331, -11118, -1790, 8372, 7127, 5163, -4621, -482, 8152, 9305, 2044, 7485, 11864, 6972, 6766, 4369, 3114, -247, -3423, -7344, -9252, -4592, -1361, 4686, 7823, 6169, 5890, 2956, -1945, 3329, 11500, 4696, 5096, 5947, 6729, 4014, 5438, 8746, 12911, 12447, 7993, 448, 4011, 6961, 6202, 9221, 8021, 4559, 3575, 368, 2870, 5883, 10510, 10704, 22026, 18010, 8191, 12603, 21259, 17021, 11725, 2291, -11498, -7226, -4242, 1445, 4323, 4876, 5740, 15591, 22205, 22550, 12668]
17041A2668r392O632J2967N198j188o012j608k36r085k232J251n118l906L464
17027C403N239J347k820l243O743j502m634K270K137l848k187r755j4902m066
17013b5818J2312L484O598J1342O356Q06p115n130P212p22n28M668j003M741l506
16998A3697p202J4104J3030j441K655K4132J7279K0390N6199J22536K16056K49039
16986G40474O6034j63421k32782j68416q2051m5330l9519k8707j7985j1110j0443
16975F744p72N277O738O841j2438j6336K477J760m237M61O210M815p32Q14O279
16960A3901p777l746R679L610j1900j1493n76m692o041R120M162J1359J1808q15
16946A6599l149K196m183k537L33L27j6011J898J993N63l345j979j343J0059R389
$$ y = [12668, 3276, 9908, 22875, 28073, 26885, 20873, 19265, 19029, 9944, 7712, 8963, 3845, -61, 3403, 8642, 9989, 7169, 3926, 10669, 9167, 4533, 6803, 8940, 5092, 2905, -6850, -21752, -25818, -13506, -10022, -3424, 7918, 14274, 15080, 7965, 2835, 10047, 9325, 8797, 13465, 12462, 17203, 13697, 6495, 20599, 33629, 32188, 34843, 58975, 76254, 96644, 152843, 275379, 491435, 740474, 806508, 643087, 410305, 241889, 159838, 114508, 74989, 46282, 28297, 17187, 6744, 5972, 11249, 17987, 24828, 12390, -3946, -1469, 291, -3946, -3485, 2725, 7540, 6808, 7622, 13901, 6124, 2378, 12057, 15667, 3767, -7726, -8302, -12994, -19035, -9915, -5753, 5606, 17414, 16599, 13450, 15646, 11463, 8926, 9259, 9586, -6425, -4527, -2534, -1971, -5316, -7295, -8638, 1421, 10810]
16931A0810l047j002K955M472J626k186J0362J1293K338j0961j3801r340P066
16918A0585J1843J72M422O33j541O987K282K625J4717J5325J7211O547J7079M0528
16904A49415N8215Q1023J43300K48061M68795P79094N75872j91844o78382o50285
16894I83264l90635k09865j18105o4436k3417m242o053k2797l2003k9052j6708
16883F5951j8494j4007q803q341m671R29Q3O368J3321m076q316p679j1683k955
16869b373k292j357P59m566k20j098O854J945j315o209J030J2019j438q626J1315
16854D428M701l328j154P674n801q743j456N164L799o476j859K559N879M291l012
16839F666k128J328N20m059j454N967n919o020n864L68o364J0160P440M396l436
$$ y = [10810, 7763, 6761, 9716, 14188, 15814, 13628, 23990, 35283, 37621, 26660, 12859, 3519, 10585, 22428, 22600, 27022, 27655, 26114, 33101, 35383, 38008, 52725, 68050, 85261, 91808, 108887, 149415, 207630, 288653, 431953, 680014, 1148809, 1927903, 2503775, 2311931, 1633549, 983264, 592629, 382764, 264659, 200223, 176806, 172564, 166511, 143714, 111711, 82659, 65951, 47457, 33450, 24647, 16306, 11635, 12564, 12647, 19015, 32336, 28260, 19944, 12265, 582, -2373, -4665, -6022, -5263, -9829, -10049, -11147, -4293, -2348, -3663, -9872, -8842, 3177, 1739, -6887, 4428, 9129, 5801, 4647, 12321, 6520, -2223, -3679, 1485, 5284, -1192, -3051, -492, 5387, 9678, 6666, 4538, 5866, 6386, 2327, 873, 6840, 921, -5099, -10963, -10595, -16959, -6799, 641, 5037, 1601]
16824A601m71J814k517O721J5945J8581M559r825j4015j0842l772k651M695j975
16810G848J4202K4864L0625J1803k1867k8534j7545j1605J305l125j318m840p231
16797e418L245n807M431L248p465m636K928M681N335l458J433j2209j1409J1838
16783a3263J5770M156k19K982n509k804o240N896J2717k09r884k747l622o17J696
16768a897j0330l700M389R198j0673K072O887p967R941J2047r456p915N933j541
16754c012K546k825L262P662M634P287P204o838j4323j3339N974N28j791J677
16740a354m402j651l128l491J419J324K013O392J923q915J337k435L227J2470
16726D729L791N745j165J5739J3781L1354N0640L9327j4256m6368l9817l3040
$$ y = [1601, 1130, 2944, 427, 7148, 23093, 41674, 46233, 36408, 22393, 11551, 7779, 5128, 9823, 7848, 22050, 46914, 77539, 89342, 67475, 38941, 21396, 9791, 11096, 7971, 6653, 1813, -5418, -2173, -7980, -3549, -301, -7766, -12402, -9474, -4793, 542, -2916, -1483, -13692, -25101, -13263, 2507, 6663, 6444, 9426, 3917, 1113, -5127, 769, 13486, 13277, 3393, 646, -2976, -3593, -1897, -12227, -15927, -11538, -2340, -13013, -10941, -4054, -12021, -2080, 9967, 511, -7404, -1471, -3012, -466, -3291, -29, 7633, 12267, 19554, 26758, 19920, 5597, -7742, -1768, -1240, -3031, -1354, -5756, -7407, -10535, -14026, -12607, -11283, -9270, -2878, -955, -9870, -8533, -10968, -7741, 4729, 8520, 14265, 13100, 28839, 42620, 73974, 124614, 163941, 149685, 103317, 63500, 30460]
16714C0460j6838k622L362R37j8142k866J37Q19N259J0471L058q070j9053L493
16700i595P475j837n040j373M754L545K066l761r44Q608O140j4927k077R924K587
16685E545o314j346J047J349M689n901m727N091k362j4325o044k849K570J2779
16671a0798P996K617p241O01J0474J1335j342k860j147l059m694k817M648k9n159
16656a475K447M487M805J677m745O87r128N077m031p476p565K56Q265K663L381
16641f75K320l527j970q306J1344K149l801j508p767j0460M311L973L222q750
16627a9445o252N159K391k489K210J0117N004p846n508M98j709J0579K515r76
16613e752j231J505k583q372K611N965J490l444J611M296P75m663Q935j447j5252
$$ y = [30460, 13622, 11000, 14362, 15299, -2843, -5709, -5572, -4753, 506, 10977, 14035, 5965, -13088, -9595, -2120, -3957, -8997, -10370, -5616, -2071, -5, -3766, -4710, 3898, 10038, -4889, -6966, 2958, 5545, -769, -2115, -1068, 281, 4970, -931, -5658, -567, -2929, -17254, -23298, -26147, -23577, -10798, -2802, -185, -7426, -6825, 3649, 14984, 13642, 10782, 9635, 6576, 1882, -935, 3713, 3684, -1475, 972, 5459, 10264, 11941, 7196, 7883, -1245, 3832, -199, -7675, -15240, -14984, -6719, -4056, -675, 1645, -1882, -3852, -12158, -814, 1335, -2466, -3974, -11741, -22201, -17890, -13917, -10695, -19445, -25697, -20538, -18147, -20636, -18426, -8309, -3305, -11151, -16659, -16161, -17870, -7291, -4776, -5752, -6983, -5478, -8061, -16433, -13822, -7857, -6367, -9811, -8200, -3904, -3129, -7792, 1143, -304, -15556]
16598a5556m787J2397L150J828R148q570K45k372L705Q312p56j3270r343o20m40
16583a6929M693m58O260L247l048J0304J031j867J189j0644q283K141N446L559
16569c359l150j410m556J1016O589o830j1551q99O415K882J722O1q695O06L657
16554g502l985P38J4629O812m115j98O556m349r182j108M029J520L72j343O518
16539I392Q616m266M736m511p877p247n207j343m723N191L014r07K706O980r577
16524e023j0963m94L253O890P433P243m945j6590p07K11p017l328K688m87n344
16509b7180R582J1550P70n569J740M385J753l069j149k033L545M797K620J0875
16495A2617L394p846p574o988K588r097O664L637l864J254K223k668j098k699
$$ y = [-15556, -20343, -7946, -4796, -2968, 6180, -2390, -2145, -4517, -812, 7500, 6744, -6526, -15869, -16489, -16929, -12236, -12694, -6434, -3187, -6235, 4069, 5100, 3233, 4422, -6222, -14505, -12364, -6918, -3359, -6509, -7919, -12475, -1459, 5130, -1700, -13251, -14150, -7735, -4853, -3131, -3070, -11765, -11159, -7502, -11487, -10749, 3880, 10692, 6577, 6379, 12935, 8586, -596, -1704, 2325, 3845, 4217, 2874, 9392, 18008, 13742, 18478, 13967, 6090, -1157, -6364, -7707, -12430, -7239, -4225, -5132, -2426, 4554, -5023, -15986, -16480, -13227, -6337, 1096, 8339, 3394, -13196, -13903, -13692, -20709, -24037, -21349, -21836, -27180, -17598, -6048, -5278, -10847, -9107, -4722, -2969, -6038, -7187, -9220, -5675, -878, 1742, 12617, 16011, 8165, 591, -6397, -3809, -12906, -6242, -2605, -6469, -5215, -2992, -5660, -6758, -9457]
16481i457o064l447R13M748J0365o621k553J910p69l866m645N890l811m43l727
16466b1577n35J211N5n930Q283J0446J0415N798n750j0177m355l565L142J0363
16452b176J522J191k482m6N934p382o650P802m41j196J0336M072k902R515M854
16437B1951K349m32j4747j1939k499k880P124j690n31l545j944q382j0955J3764
16423a4356M533m384Q448P116P93k248j775p008J013K498m729j472K17J1687j46
16408A87r177l9Q69P866O828j952o780L00J005n508k0313m57J6671Q267j113n983
16392i329k920K211n884j449n556l376K086K678K079O8O438L915n136m072M166
16377a4081R599k344p78n378o044K925J493M889k092P871L024j937j1645k871
$$ y = [-9457, -15521, -18968, -18055, -13307, -2942, -9563, -12116, -10206, -10975, -14841, -19486, -13596, -17407, -17850, -21577, -22112, -20901, -20846, -26776, -18493, -8047, 2368, 8166, 2416, -7761, -12116, -15681, -12539, -2176, -654, 537, -1945, -1991, 3943, -3439, -10089, -2287, -2728, -3924, 6412, 10484, 7582, 17097, 21951, 24300, 23868, 9121, -2818, -5317, -8197, -1073, -2763, -3294, -6839, -8783, -17165, -28120, -14356, -9823, -14207, -5759, 1357, 2150, -98, -1873, -8881, -7868, -5370, -10099, -11571, -11354, 333, 187, -8990, -9029, -8160, -294, 6534, 4582, -2198, -1898, -893, -6401, -26714, -27171, -10500, -2233, -3346, -9329, -12249, -10038, -15922, -17371, -22927, -26303, -24217, -21539, -19460, -19392, -12954, -9039, -14175, -18247, -14081, -4482, -6826, -7604, -12982, -19026, -16101, -14608, -9719, -11811, -3940, -916, -2853, -14498, -17369]
16363a7369L891N489Q591k233o188L453j371k565K700M029k072N255N754j3492
16349f128J299O225l653n338m633l999L673l766L253N242O220J728q69k082K477
16334c51L836M220R236q055k044K85P36O729q909p501k407L016J380M357M389
16319H917q964j517m246q282Q081O482o21j378K650j653r64k074n4K035J630j195
16303a153M67m170L094o295J8N670k166Q10p137q612P131Q373j63q500j0770o392
16287b9795J3750M11K762O23l267l56R555K681L859Q1N46j852q85o080L569N636
16271A238r920j975N125Q719M307j2521l921J2934M239p775m828r348p388P183
16257a3931K883j224o27L863m31N3J835j89N36J248J224O614o43q69R2J718q098
$$ y = [-17369, -13478, -7989, 602, -1631, -7819, -4366, -5737, -8302, -5602, -1573, -3645, 1610, 7364, -6128, -4829, 1396, -2257, -7595, -12228, -16227, -12554, -16320, -13067, -7825, -1605, 123, -746, -2828, -351, 3485, 7705, 16941, 8886, 6842, 7127, 7863, 14592, 5683, -1818, -4225, -1209, 171, 4528, 8917, -47, -1564, -5810, -14092, -6011, 471, -150, -1528, 1122, -531, -1495, -3569, -3623, -1588, 42, -1153, -686, -4856, -1762, -8057, -8039, -2369, -4535, -3725, -10862, -19474, -12343, -3970, -4133, -12633, -23403, -29795, -16045, -15634, -12872, -12249, -15516, -15872, -6317, -3636, 223, 304, 850, -1002, -1887, -7967, -4398, 1238, -8682, -10657, -5532, 3187, 7494, -5027, -8948, 3986, 8225, 450, -4378, -13726, -21114, -13931, -11048, -12272, -12899, -9036, -9467, -9414, -7579, -7768, -7232, -5984, -4760, 1854, 1211, 342, 434, 2152, -5946]
16240e946m806K646J645Q343M60M38l148M86P920k003l803l001J170K644L956
16225G001j088p971p459q16k92m674O446K840l402j87M685j529k318O343k728
16210e149N062l389o784k644Q332k045K535l006K05J0578J756k923l350m745l015
16195h582M808M179M938l190K058o016j632Q268L272p890p231O49R823j984o619
16180e149l019K502K013k889m73J048J662k657r72J105J1625J676j3110j703m53
16165h794o310k86J0645j406J082J641O10O689j827m266O462l781j0612N024N969
16150H40M138m268q909k545K209K54J04L202N486J505J143P77n329j67M452J678
16134D570K312p453j015p19M139L987q316o751j0359k546R004J1687k846j1491
$$ y = [-5946, -10752, -8106, -6461, 1882, 2342, 2780, -368, 118, 8038, 6035, 2232, -769, 401, 3045, 7001, 5913, -2058, -9517, -10333, -10625, -15299, -8853, -6013, -9415, -9602, -4917, -6446, -8764, -2421, -5149, -87, -3476, -10260, -12904, -4572, -6617, -4082, -7088, -6883, 3695, 5451, 2528, -822, -5567, -8582, -3774, 405, 5343, 2153, 4211, -1805, -3437, 4831, 8103, 213, -7018, -6369, 3454, 1470, -5149, -8168, -5666, -3653, -6542, -7015, -5967, -4305, -6962, -7934, -6829, 4796, 6472, -6638, -8341, -8794, -15104, -15390, -4745, -6151, -5069, -3428, -2818, 3871, 2044, -2222, 4240, 459, -10153, -5129, 840, 4978, 710, -8199, -10744, -8535, -8281, -8177, -4975, 511, 2016, 3159, 3936, -1393, -1560, 2892, 4570, 6882, -571, -1586, -2305, 1834, 5821, -2495, -9246, -19605, -22151, -13147, -1460, -4306, -15797]
16120a5797q704K322M40L751J2785Q629l241J981O401K972o420o657j482j14n869
16105i003K458K79o915j0921M598J1035J355J187L106Q081K688J210k733m517
16091A908o532N229L84j1613O68M237m92m40l369K266J207j128R87P945K541j07
16075C691m829k625L663M013l506j865K20n148N056K615p461k328l056k608K983
16060a1185J861n164o907j378l287N198R007j465M411o12L271J0660o776k017
16046d383N463K497l520m261N507K00k69L982J142p056N763m190r017r2j939N222
16030d951N935o083L44j210n071m41n704l45o321N592J4798r50O634l850l75L731
16014A733k71j5074q18O373J2779l755o897o58J450P24J880n728r42N425k23O249
$$ y = [-15797, -24501, -22179, -21739, -17988, -5203, 3426, 185, 2166, 8567, 11539, 5119, -1538, -3020, -3134, -9003, -6545, -6266, -13181, -24102, -19504, -8469, -7114, -5927, -2821, 5260, 7948, 9158, 6425, 1908, -4624, 605, 989, -10624, -9956, -5719, -6211, -6651, -10020, -7754, -6547, -7675, -6688, 1257, 3798, 3691, -1138, -3763, -100, 3913, 407, -1458, -1238, -6386, -1330, 1285, -6176, -8504, -11560, -14168, -11185, -9324, -14488, -21395, -22773, -26060, -20862, -11855, -13320, -8909, -9521, -6250, 4410, -2366, -4383, 1080, 3577, 57, -4204, 1303, 1503, 1234, 5216, 6358, -698, 5065, 875, -8142, -8234, -10173, -4951, 984, -5099, -4755, -5965, -11036, -11477, -17181, -17526, -23847, -18255, -3457, -4407, 2227, -1623, -1998, 1733, 1462, -13612, -14430, -8057, 4722, 967, -5930, -6588, -5138, -4414, -2534, -8262, -9204, -3779, -4002, 2247]
15998B247J0598J1124p72j0783k183j816q156k725j038J0170l548j0530L777Q841
15984E206j780n877j429r125J161P310L799k959J504L177l505p913J1390O370
15970G329L592m201j28o471q774N542O003k063k769L789J977o249L684r374j30
15955h243K443J608o360j1561q24Q093L895p142N237N115J869P50J440L764m814
15940d730J295k739q47l525l09n159j217k56L825N592K849n355l632M935J679
15925g594N428j244p429L54q82l368J0474l037m323N26m999k512O655k864J0746
15910d069J815Q490R783m017m233J700l112m946n361N52l641J112J3415L051L811
15895A4350M43j0002k882J928R451k046l195l897n155K24K105J0638o495J126
$$ y = [2247, 12845, 23969, 23197, 12414, 10231, 8415, 259, -2466, -3504, 6666, 3118, -7412, -3635, 5206, 3426, -2451, -3880, -13005, -11844, -4534, -735, -3694, -2190, 987, -2518, -10431, 959, 7329, 10921, 6720, 6592, 121, -8653, -3111, 2892, 829, -1940, 1849, 3826, -2423, 1261, -8113, -8243, -5800, -4192, -10552, -22113, -22937, -14844, -10949, -18091, -12854, -7739, -5870, -5120, -3680, 84, -4730, -3435, -6174, -7021, -10546, -10855, -16014, -17231, -17487, -13662, -8070, -5221, -10576, -14208, -9273, -7594, -2166, -3410, -10839, -10485, -11367, -14735, -4261, -7298, -11621, -11095, -16094, -18606, -11951, -14815, -4069, -2254, 6236, 16019, 12002, 7769, 9469, 6357, 1411, -3950, -3398, -7039, -5927, 7488, 10539, 14350, 14793, 4791, 1909, 3837, 13288, 11242, 8047, 4150, -1005, -781, 1324, 11962, 5467, 6593]
15881F593R607Q014o085r986k364r463l027L260p718j2637o86J3288Q758J487
15867i59L54K195j215N923n943J95n410L889K627K176j8o048r64Q747L278o752
15851B075q57j587m074q910k054k430K24P952J0136l292J126m531j5065R326J1950
15836a1j190q969m467M480P440M524J1787m065j267j307l278J681r314o429N83
15821i802Q651K041p877O85K645N546k892n89k670m169L790K410K483K501o595
15806c842O051J58n464P878J0130N73J04j3567n866j979m458J679M978J368o40
15791b897K627k10L394J1767m598k041j257j4381k507J1991N083j995q394o681
15777a0099K273o737n492k49N640o28p392J8J126n72J702J2405J0747j97L7J1434
$$ y = [6593, 16200, 24214, 18129, 8143, 5779, -3684, -6711, -3451, -11169, -23806, -24492, -11204, -2446, -959, -605, 1590, 375, 6298, 355, 550, -4860, -971, 1656, 3832, 3814, -2234, -3198, 5549, 8827, 2075, 1218, -369, -4443, -13353, -15407, -17837, -17613, -9661, 475, -2817, -1691, -6222, -21287, -11961, -11, -1201, -10170, -14637, -10157, -2717, 1807, 13594, 9529, 8262, 6955, 3677, 5358, -3956, -10385, -9802, -1151, 890, -6987, -6302, -3657, 1889, -1003, -1592, -4262, -8431, -4641, -2231, 252, 2753, -3842, 2209, 2367, -3097, 4781, 14911, 15484, 15588, 2021, -3845, -5824, -10282, -8603, -3625, -2257, -2897, -270, -480, 2914, 14681, 10083, 8042, 6785, -7596, -10103, 1888, 6971, 4976, -3418, -10099, -7826, -14563, -20055, -20304, -14664, -15292, -22684, -22666, -21540, -22112, -20410, -8005, 2742, 2545, 2582, 14016]
15761A4016j177p291j6735n156O699J646O692R204j265j218O744q070k770K160
15747C479m104k108q87r883N441J932M237L180L271M721j0805j2880N940N020
15733c446P907Q54r158q201p252K172R109J603M53l339q48O217j180o454L630
15718g933O4p549q979O742O606N806L857m446o449j965R20J2795J4741O639m997
15703A5852n73r452p598Q447j191l266r77K99j13J1897Q348o157j1635K16j998
15688B099o033K606J0926N533q335j3388q007P077O460K94n166o283q033j801
15674b2051K57R298J1975P243K562k92o618j466q691o847m018j241O287R955L294
15659c53M638l91M720k790r996M255Q805n111j6219p459m981M764M225M366q27
$$ y = [14016, 12839, 5548, -11187, -16343, -9644, -7998, -1306, 7898, 6633, 5415, 12159, 4089, 1319, 3479, -625, -2733, -3620, -13503, -8062, -6130, -1893, 1287, 4558, 9279, -1526, -14406, -8466, -3446, 4461, 5315, -3843, -12044, -19296, -17124, -8015, -6412, -5959, -9298, -10146, -3929, -5109, -11563, -7933, -7869, -15418, -24397, -17655, -11049, -5243, -1386, -5832, -12281, -14246, -13326, -531, 14210, 20849, 15852, 15279, 5827, -1771, 6676, 5485, 2219, 1242, 1541, 1428, 13325, 21673, 15516, 3881, 4097, 2099, -3934, -1328, 9598, 15131, 6796, -6592, -14599, -7522, -1062, -768, -5934, -12217, -20250, -22051, -21794, -12496, -521, 6722, 9284, 8992, 2374, 908, -7783, -14630, -18648, -19889, -13602, -3647, -353, 4285, 3894, 8614, 5824, -4172, 83, 8888, 3777, -12442, -19901, -24882, -20118, -15893, -11527, -12354]
15644a2354m466m4N37j41P393Q344J2420n73l816q340n178O58K511m574r593o026
15628b3242J10L759J0226N097J852L821J690k497o006j388L735k533R429l58k406
15613A289J331j185P622J589l918o572l919l370n539Q93M282R822O32q69l712
15598a624K938l782m172M596o248l775P281l720J274L323N2N869L317j1667K296
15583d042M435j1011P43R122P041p592m713J0766J238m448p76o601q666j646K756
15568a3394O17n882j39k00J1927K3437M746n754n386o933M477M414M84q015o722
15553b323J83j355R91O529m69J718Q076n085j4538o304L35N912j447J949j194
15538g022K56m897n373K961R523N783O51k454m808j1817n452k4l540K832K507
$$ y = [-12354, -16820, -16864, -16327, -16468, -9075, -731, 11689, 11116, 7300, -1040, -6218, -5560, -3049, -7623, -17216, -23242, -23132, -19373, -9147, -4050, -2198, 1623, 3313, 816, -5190, -6578, -2843, -5376, 4053, 3695, 1289, 2620, 1435, 9057, 10646, 6728, 156, -3763, -7133, -12672, -11779, -7497, 2325, 2957, 2088, -1624, 1314, -2468, -6640, -2044, -8292, -12067, -4786, -8506, -7232, -3909, -3857, 2012, 5329, -6338, -4042, 393, -10618, -9875, -753, 6288, -1304, -6017, 4749, 5987, 1539, 763, -5838, -14504, -16150, -13394, -12777, -18659, -18798, -18998, -7071, 16366, 21112, 15358, 9972, 3039, 7516, 11930, 12414, 4399, -2323, -2140, -3495, -2504, 4025, 3556, 5274, 13350, 8265, -6273, -12577, -12242, -6330, -7777, -5828, -7022, -6766, -11663, -17036, -14075, -4552, 1231, 1882, -572, -5380, -17197, -22649, -22673, -26213, -23381, -20874]
15523b0874R133P970j0092O42K55l903J1832L800m259j283m795o504J3769P609
15509C300p132l73K722o769j917M240K222n97m269j2533k136L071l638N662Q491
15494i656R302k835K755K627O333P137m117j5054N51K249n442K073R45K619O709
15479F196L041L278l26o19L188q615q322O774N585r833j4507K421R546l584n120
15464a0897j81m696Q034M405k495m903l613L532P8J303L446k887l41l33j996J438
15448a0106P68L480J699M628p854l103M144N30M670P414j08P855O021r711j017
15433I310o116n824r724Q072R820o431m155o577pO740N509l857J21j371P53J628
15417b109k961l401m335P126N22P638J0309J414q898m415l079l771n454p191L40
$$ y = [-20874, -11741, -3771, -13863, -13221, -12966, -16869, -5037, -1237, -5496, -6779, -11574, -18078, -4309, 3300, -3832, -4205, -1483, -8252, -10169, -5929, -3707, -4304, -8573, -21106, -23242, -20171, -23809, -18147, -9656, -354, -3189, -434, 2193, 8526, 15663, 11546, -3508, -2957, -708, -6150, -4077, -3132, -513, 6196, 9237, 12515, 12189, 11570, 14758, 6143, -2179, 4595, 10180, 347, -14160, -11739, -2193, -5777, -10897, -11078, -15774, -7740, -3335, -5830, -10733, -14346, -10814, -10736, -9433, -5987, -8874, -9215, -9548, -11544, -10106, -9338, -5858, -4159, 469, -7385, -10488, -6344, -5814, -1144, 6270, 6162, 14017, 20038, 10327, 9310, 3194, -2630, -12354, -4282, 5538, -893, -5048, -11625, -11632, -4892, 617, -3240, -3119, -4490, -3737, -2109, -5070, -8471, -12806, -5680, -5158, 2480, 12789, 14203, 5305, 890, -2189, -5960, -11414, -18605, -18265]
15402a8265L705Q8J0758p339o573L523l572J571R514L021m794M510K615L445K41
15387B448m534q615L27O100k572N700J224k224o11j03m631N419P421n988o46L513
15371B228j390l250k648k07J0846J026j120j82l72o209k488m159J816J3009O697
15356A3597J1008j171j2157j2618n15K696P027O693m178j2363p719M990k438M224
15342b924l002L582M165K156N084K504j0087m165p627j872J1443O468q54j1699
15328f828p973m97O349N048O783n69l725Q36J902L969j063m115n954nL655R56
15312a231P051j185o045P300j939m230k94o56M498N772Q15O90n155o831n921o814
15296a4175P948R284l516m134N72o52M79j945N795K050K570J241J059r596R7K426
$$ y = [-18265, -14560, -14472, -3714, -11053, -17626, -14103, -17675, -16104, -6590, -3569, -8363, -3853, -1238, 2207, 2448, -2086, -10701, -10374, -4274, -6846, -1146, 78, -2146, -2757, -2860, -7491, -2072, 5349, -639, -1285, 2228, 838, -2412, -5060, -5267, 5579, 6605, 5485, 5303, 4931, -1278, -3766, -7925, -6109, 6900, 13597, 24605, 23434, 11277, -1341, -1856, 840, 7867, 14560, 10382, -1981, -9700, -4710, -7148, -2924, -5926, -2344, 1821, 3977, 9061, 11565, 1478, -2687, -10314, -12186, -743, 5725, 4871, -6828, -14801, -15298, -8949, -3901, 2882, 2313, -1412, -576, 1326, 5295, 4232, 117, -5837, -5842, -2187, -1231, 5820, 4635, -1410, 5890, 3951, -279, -573, -1229, 3269, 9041, 9856, 10546, 5391, -1440, -7361, -14175, -6227, 3057, -459, -4593, -4021, -4673, -4194, -6139, -344, 1706, 4276, 5517, 6576, -3020, -2923, -497]
15280d97n026n314O136L369M859L378k734p924q307p655l137R933M84J477L934
15265g024l185O112N054j170k051p181n349l459m208R877L130r508O58J4005Q874
15250D575l902k305n313K635J969L356J7239O401j5146j3027K949k860M90J377
15236a562J1190O6j0345q806J553J0708P331P311M437p801o638j695n534n884
15222e669m297P65M035M758Q788j428k507j71J92j021K150N70j202r0J448p09
15206E612m80m46n929M939J478n637J480M416o061o816j0924N308P705M339j1015
15191a2031p998k225L900L901J169R31l223j939K569J852o13R787Q380m322j443
15176a305P054O823R945J925o091J247j877k06j375m749q651M929n879j1404j2176
$$ y = [-497, -5523, -10837, -4701, -1332, 3527, 6905, 4171, -3753, -12060, -19715, -22852, -12919, -12435, -10958, -7024, -10209, -4097, 957, -213, -2264, -9445, -14794, -18253, -22461, -12584, -9454, -18962, -18304, -4299, 4575, 673, -1632, -6945, -4310, -2341, 1015, 18254, 24655, 9509, -3518, -569, -3429, -2939, -1562, 9628, 9694, -651, -9457, -7904, 2804, 10135, 17446, 21883, 14082, 7444, 5749, 215, -5669, -9966, -9201, -5166, -408, 8380, 6952, 4445, 4274, 4466, 3445, 5595, 6165, 4963, 4873, 6321, 5612, 5132, 4686, -1243, 3696, 5174, -463, 1017, 5433, -628, -7444, -18368, -13060, -5355, -1016, -12031, -20029, -22254, -18354, -14453, -13284, -12353, -15576, -17515, -14946, -13094, -13707, -3920, 4460, 138, -1305, 5749, 12572, 22517, 24442, 18351, 19598, 17721, 17515, 16140, 11391, 2740, 7669, 1790, -9614, -21790]
15161b1790k93R697K667P499J0406l74K644j0715q031o787Q712O930p161m546
15147a1142k729J994J5792M118o616j480k715p221O558k087J327j48L607l365
15133d107k858k292j623N299J000j401L370R452k940J913P0M265P658M793j2359
15118A0240k881J1790j0419o143k606k344J527K813p456o722j948R97L338k698
15104a2512M938k762m912j603P688R244M783J448q798M17N374M076K729N375P06
15089A6191p447q142o902l967J1267k82j2716m918Q494k82k499O568R755n811
15075f91j894m51l096QJ5757N623r611j996l283j743l421J949k907j159j157J3636
15059E564n592j3859m95Q113J2734j816j546M579m700m721N997O871K534k145
$$ y = [-21790, -22083, -12386, -9719, -2220, 8186, 7812, 10456, -259, -8290, -15077, -6365, 565, -6596, -11142, -13871, -11877, 3915, 8033, 1417, -63, -2778, -9999, -3441, -5528, -4201, -4349, -742, -4107, -6965, -9257, -10880, -5581, -4581, -5982, -2612, 6840, 3900, 5813, 5883, 10148, 17806, 22599, 10240, 7359, 19149, 8730, 2587, -19, -2363, -836, 1977, -5479, -12201, -14149, -13152, -9814, -12512, -7574, -10336, -15248, -16851, -9163, 81, 4864, 6312, -2486, -2069, 3305, 7381, 10110, 15485, 16191, 8744, 602, -6300, -10267, 1000, 718, -11998, -16916, -8422, -8704, -11203, -4635, 5120, -691, -2585, -3036, -6132, -6124, 9633, 15256, 5645, 3649, 366, -1377, -4798, -2849, -5756, -6915, -8072, 5564, -28, -13887, -14382, -6269, 6465, 4649, 3103, 7682, 2982, -1739, 4258, 11129, 13663, 11518]
15045A1518m933J102J671L737O167j024l083J0190J461n966n208m790k745q414
15031c17J460Q231O797j290p712j5203J658P48j007L739N021q415Q27m853K567
15016g749J8893J3499q257p827o264L542J1308j031q068m003p462j0643O090J5171
15002G199P65N724M072j294k500K589n531L30J275r949q097J194l003k304J2023
14987B493P959j797J029j783m638n115j094M111K04K079n056j714O960J0108Q783
14972B2529r802j2091m783R841O09o324p112J638R985j0584l769J1930J683j1730
14958g980n337Q061Q439K668P356M710J434p91o6j3878L942L784J381K803M863
14943B1389q31m924r589k728j375N701J168m223j2451l556J0016L537l876M266
$$ y = [11518, 6585, 7687, 9358, 13095, 19262, 18238, 15155, 25345, 26806, 20840, 15632, 10842, 8097, -317, 1143, 9374, 16171, 14881, 7169, -8034, -6376, -5628, -6635, -2896, 2125, -6290, -5463, -10316, -7749, 11144, 24643, 16386, 8559, 2295, 5837, 17145, 16114, 8046, 4043, -3419, -14062, -7972, 7199, 7964, 13688, 17760, 16466, 13966, 16555, 11024, 11354, 12629, 2680, -5417, -4223, -7226, -9530, 2493, 10452, 8655, 9684, 7901, 3263, -1852, -2946, 1165, 1369, 3448, -1608, -3322, 3638, 13746, 22529, 12727, 636, -4147, 5694, 6303, -21, -7133, -5495, 4490, -6094, -9863, 2067, 3750, -7980, -13317, -5256, 3183, 5851, 13207, 17917, 19351, 18560, 18494, 4616, 8558, 12342, 13723, 16526, 21389, 20558, 15634, 6045, 3317, 1942, 7643, 8811, 4588, -7863, -11419, -1403, 2134, -1742, 2524]
14929B524J697j209j478N803p479p524K947P323q44k854O10J741L246m925j0068
14914a0490N582O762J501j040j285J0381L495n843M778Q864k334j5852m477N182
14900E224l350l007P575M586p33k86k676j264Q58R611j415j5196p108O599Q575
14885G993K203N34L626q986m502O186o96l943l142J404l088J084K321O29L238
14870D861O055j900m404M642K37J076j0276k960K048L994k892k616K564n707k353
14855g631N918l388q156K436R633k749l210m55k742K668k002n485N737L891J4384
14840H849J2392r264r090q15k321j130p62O15m650L532P5O980p019m553M626P116
14824D581q00R307J0782k073J916j143j1288j2524J0441J0519j403j2498j0558
$$ y = [2524, 4221, 3012, 1534, 7337, -142, -7666, -4719, 2604, 1760, -1094, -484, 1257, 4503, -422, -10490, -4908, 1854, 3355, 2315, 1030, 11411, 14906, 9063, 13841, 22705, 20371, 4519, 42, 5224, 1874, -1133, 6442, 11028, 10295, 10009, 7333, 6069, 6927, 16538, 15123, -73, -7181, -582, 7993, 10196, 10730, 14356, 5370, 868, 7054, 6358, 2415, -727, 677, -2411, -1327, 994, 1623, 4861, 10916, 9016, 4612, 9254, 9491, 10567, 291, -2669, -621, 3373, 481, -2135, 429, -5278, -7631, -1713, -5101, -13257, -10821, -1188, -3937, -7147, -7602, -10344, -7676, -9678, -15163, -9426, -5535, 8849, 21241, 11977, 2887, 2072, -249, -1379, -2141, -1526, -6176, -2644, -2569, 4411, -2608, -7161, -2535, 4581, 3781, 13088, 23870, 21797, 23713, 22570, 11282, -1242, 9199, 19718, 18315, 5817, -4741]
14811d741m627L515Q92j013K272J5244J2133n703q129j9635M822J2136M468o542
14797E092j773l064Q85j971l363k438J1376J247j808r14K585J3813o204l586J002
14782A0879p788Q348J2691J4867P116j3992l984j5137r894N505O29j1367k449
14769d576j57L304J722Q75j0342m445J547O376N395j394m460Q281K342r241%K958
14753a815N661m183l761M095l289J587o95N501L761R062O456k867J831K773M921
14738B9038M760J524K652M477j58r255m876o410j3923j1724m58R101O069k145
14724H672M736M535L709k057k021p753n233n590m73k495n474P47J5835L385K675
14709A3198k617L369L901N389l110J604r91l349m375o348L094L924O91P294P462
$$ y = [-4741, -9368, -5853, -4961, -5974, -3702, 11542, 23675, 17972, 9843, -9792, -4970, 7166, 11634, 5092, 3319, 255, 1140, -831, -4194, -6632, 4744, 5991, 4183, 3269, 5854, 19667, 13463, 9877, 10879, 3091, 11439, 24130, 38997, 46113, 32121, 28137, 13000, 3106, 8611, 9240, -2127, -4576, -4733, -1429, 293, 1168, -9174, -13619, -12072, -5696, -301, -1695, -6155, 2126, 4468, -4773, -4773, -1815, 3846, -337, -4098, -3, -3292, -1705, -2400, 3101, 6862, 15924, 22380, 19513, 21344, 24117, 29038, 33798, 35322, 37974, 42451, 42293, 33038, 28162, 21752, 7829, -3895, -4353, 4748, 10817, 8672, 13408, 17943, 21652, 19595, 17574, 9821, 4588, -1002, -1475, -3970, -9444, -8697, 7138, 10523, 13198, 10581, 13950, 17851, 23240, 20130, 21734, 20743, 17394, 13019, 6671, 9765, 13689, 14380, 21674, 29136]
14694B9136K569r011m293M7L690R150J1005O478J0627O673J3499Q177K895j352
14680H9290q455j9261j1179l872o733j6306o006k224l594O457J731r04l000r550
14666F394N74P474L444L119N845m806r508J251n809l458O644J939L223J903j1384
14651F845o555J068P933J1444N718l404j9112j2632N920l797M771P246j282l117
14637A046K60O746L257Q771k794q076K302l330p484L801M329O379P959k087k596
14622A8483L045p419n362K24Q597J144k918K113K648l885l319m956q907M013J1463
14607A4964N355m125p555j664j265K783L040O190k670k834M406J031p57k813O646
14592B0732K694M980J0704J0304n091l034J679M357M6K464N110J555J583L03k64
$$ y = [29136, 31705, 22694, 18401, 18448, 22138, 31288, 42293, 48771, 59398, 66071, 79570, 87747, 90642, 89290, 80835, 61574, 50395, 46523, 39790, 23484, 17478, 15254, 11660, 18117, 19848, 18944, 15944, 6394, 6968, 14442, 17886, 21005, 26850, 22044, 12536, 13787, 7978, 4520, 11164, 13103, 16326, 18229, 6845, 290, 1358, 9291, 20735, 26453, 23049, 3937, -8695, -2775, -6572, -1801, 5445, 4163, 1046, 1306, 8052, 11309, 20080, 17286, 9210, 11512, 8182, 698, 4499, 8828, 15207, 23166, 21079, 18483, 21528, 14109, 8747, 8971, 17568, 18712, 15794, 17907, 20555, 16670, 13351, 8395, -512, 3501, 14964, 20319, 16194, 8639, 6975, 5710, 8493, 11533, 17723, 15053, 12219, 16625, 17656, 16899, 14086, 20732, 23426, 28406, 39110, 49414, 44323, 41289, 42968, 47325, 47371, 49835, 54945, 56500, 58083, 58386, 58122]
14577E8122n344p021J204O416K536o20J1436J1401K3987J1920J0859Q552K991
14564A36439Q895J9262L4540J9255J3773L7910M0168P0111J01631J53668K42045
14553H77697L61043N75384P75793O82431J82976m25627p27064o79845m85201l08031
14543H29556k00849j39280q5599n6273m4326m1598l0969k2833j6951k5884j7764
14532A47230p668j2528r546m422j387j8631j0857m710j0015n321j658L34l076
14519E7745p631N115J736O573O026J149n07P05N95R90m757m024P769J4656Q333
14504I4473K7973K7621M1031N9119N5545K2597j5755m0075m8332l3652j6891J863
14492A75517J8488J930j3143l1710l3733k1960k3483j2063k516q932o330j2680
$$ y = [58122, 52778, 45757, 46961, 53377, 55913, 55293, 66729, 78130, 102117, 114037, 124896, 133448, 136439, 145334, 164596, 199136, 218391, 232164, 270074, 310242, 380353, 481984, 635652, 877697, 1238740, 1814124, 2589917, 3272348, 3455324, 3029697, 2302633, 1622788, 1137587, 829556, 628707, 489427, 403828, 347555, 303229, 261631, 230662, 207829, 190878, 164994, 147230, 139562, 127034, 117488, 113066, 111679, 93048, 82191, 77481, 67466, 62145, 60487, 60821, 57745, 50114, 55229, 56965, 63538, 69564, 70713, 70206, 70911, 71506, 72496, 67739, 63715, 71484, 86140, 94473, 122446, 150067, 191098, 250217, 305762, 328359, 312604, 272529, 224197, 190545, 173654, 175517, 194005, 195935, 182792, 151082, 117349, 95389, 71906, 59843, 57327, 48395, 42065, 29385]
14480B9385j1954l99j442J755k814N893M741o479j950N19J183L588M202L060j54
14465B9134L475m84j464P07n405M725k97N641J0019L880M806k573N848L887Q037
14450F9936J6007J9953L3106L7963O7616R7445O1397j2177p3378p5955o1349m4645
14438A35919k4922j4578r198o969j2274q693j5798k601P696P114p063m321j0597
14425C3715J184o011j032L512O812n380j1286o268k924l341j49J952J2738M026
14411B7548L27o731q273k406L018J267m322L436Q255J046n460L486J0222m048
14397B7365Q236O748j094M272m027K053J473m938j2187L753l812q001M759n393
14383A9207N490J2990M516n697J453L94M835J14N721J6566K5333L5880N0538R004
$$ y = [29385, 17431, 17032, 15590, 17345, 14531, 20424, 25165, 18686, 16736, 17255, 18438, 22026, 26228, 29288, 29134, 32609, 32125, 30661, 31368, 25963, 30688, 30391, 36032, 46051, 49931, 54737, 52164, 58012, 61899, 69936, 85943, 105896, 139002, 176965, 244581, 342026, 403423, 391246, 317868, 241913, 180564, 135919, 110997, 96419, 87221, 80252, 67978, 59285, 43487, 40886, 48582, 55696, 48633, 44312, 33715, 34899, 28888, 27856, 31368, 38180, 32800, 21514, 15246, 12322, 8981, 8832, 10784, 23522, 27548, 27875, 21144, 12871, 10465, 13483, 14750, 10428, 13864, 22119, 23165, 17705, 21191, 31413, 27365, 35601, 42349, 41255, 45527, 41500, 43553, 45026, 40088, 27901, 31654, 27842, 19841, 24600, 19207, 24697, 37687, 42203, 36506, 37959, 38353, 43188, 43302, 49023, 65589, 90922, 126802, 177340, 186344]
14369A86344l5398m4057l3590j8939j9758p242n708p419M294m49M58j0468J288
14356I356P640j956N442m354j663K100p89j169J914q8l793M336J689L807k276
14341B0196n719q768n028K546R018n513j154P735J3453j393m227l149K130M822
14327B4949j0766j1362n663j941J1860R544j0403q441k747K351n483K023N334
14314g45J0003j0047q52J4160o20m887K292l838o527K213P58M017m411j816q03
14299a103N175P610k859j57M118O437m609K735O81n769n085M15J0106P760N568
14284C1023p763m178K661N1l543j452o078r076n837N764R729J557M801l701l008
14269A0950n85k328k022N358J0450O183k61k322o536q189n90q85p73p29M213O897
$$ y = [186344, 150946, 106889, 73299, 54360, 34602, 27360, 21652, 14233, 18527, 18078, 18536, 8068, 9356, 16996, 15040, 20482, 16128, 14465, 16565, 15776, 14607, 16521, 16433, 12640, 16976, 18665, 22472, 20196, 14477, 5709, 681, 3227, 12245, 6732, 5578, 13313, 26766, 25373, 21146, 17997, 20127, 24949, 14183, 2821, -2842, -4783, 7077, 16621, 6218, -2223, -4970, -2619, -8102, -6079, -745, 9258, -789, -1641, 12519, 11899, 7012, 9304, 5466, -1061, 1152, 1910, 5927, 1516, -300, -1103, 4072, 11682, 8823, 8666, 12784, 19221, 14612, 17347, 18028, 12259, 7174, 7589, 17695, 25455, 31023, 23260, 19082, 21743, 21794, 18251, 16799, 10721, 1645, -4192, 1572, 11301, 12858, 17659, 13958, 10950, 10365, 8037, 6015, 11373, 21823, 28006, 27745, 25423, 18887, 10698, 10108, 9223, 8450, 7721, 11934, 18831]
14253A8831p921J117J596n8n928n657J4114L717j788n958p179O255O467r54l795
14238A2859n124l359j958M947k456L707N31J683j0257O42R937k565o322Q77k13
14223B929j655L015R605Q836M039l963n501q309K467O127N045p5m230L203n488
14208A6045N198J0323p289j2525p578L38l381N481Q114O245J74o503K473K816
14194A9931M123L8M55m086n879j2055o58N089J0419q455k954r28l832O085K54
14179G547J619j496q522o051O232R227P725j894r731j402N018M694j69n929m957
14164A911k932O970K905K174N266M201n348j1708L246L259L439J029m241M062
14150A4233q803q537Q651Q042m114m403N638O620k237k365K96o59r250n457j318
$$ y = [18831, 10910, 12027, 13623, 13565, 7637, 1980, 16094, 19811, 18023, 12065, 4886, 11141, 17608, 16654, 12859, 7735, 4376, 2418, 7365, 4909, 8616, 9147, 10830, 573, 1215, 11152, 8587, 2265, 3142, 2929, 1274, 4289, 13894, 22730, 26769, 22806, 17305, 8996, 11463, 17590, 22635, 22560, 18330, 21533, 16045, 21243, 31566, 24277, 11752, 4174, 4512, 1131, 6612, 14726, 20971, 21145, 14642, 17115, 19931, 24054, 24092, 24547, 20461, 14582, 2527, 1869, 6958, 17377, 8922, 5968, 5040, 1208, 7293, 7547, 9166, 7670, -852, -6903, -671, 8556, 16281, 14387, 4656, 3254, 8272, 12966, 12797, 6868, 1911, -1021, 5949, 8854, 11028, 16294, 20495, 15147, 3439, 6685, 9944, 13383, 14412, 10171, 14233, 5430, -3107, 5544, 13586, 9472, 5069, 10707, 17327, 15090, 12725, 13021, 12362, 3112, -2345, -3663]
14135c663Q789L552K925O707J981p20j592j186M909L916m76m588q79k714o524
14120A0437o517k954j761R263M660P734r63J940M899O774p181j2818j1089k76
14106B148K379p866k045M379R027M585M061n943m756M365P060k965M613K741N941
14091B7724l415r575L814P103L312m295O168k158J810j641K834L084p064p231
14077B0470k95J0204J36l519M647o478l290m352K946l111j1770q598N015Q840
14063A0845P438L437M478k111j502J0380P867j224K781J508O543P852R42l359
14049E5875j7816j0098M86o090N517J723k917K213q28N403J951q623O186J102
14035C4084k516P455n75R26Q90K312J5820J1759M087l929n907l613j3349j2732
$$ y = [-3663, 5126, 8678, 11603, 18310, 20291, 19571, 17979, 16793, 21702, 25618, 25142, 20554, 19675, 16961, 10437, 3920, 966, -795, 8468, 13128, 20862, 19899, 21839, 26738, 33512, 26331, 13513, 2424, 2148, 4527, -3339, -5384, -1005, 8022, 12607, 16668, 10725, 5969, 10334, 17394, 14429, 19042, 21783, 27724, 24309, 14734, 18548, 25651, 28963, 24668, 30836, 28678, 30488, 28847, 31681, 34765, 27701, 20470, 20175, 30379, 30515, 26996, 31643, 25165, 21875, 17523, 20469, 17358, 5588, -3010, 2005, 10845, 18283, 21720, 26198, 24087, 22585, 32965, 40832, 39608, 42389, 43897, 50440, 58292, 59234, 55875, 38059, 27961, 28447, 22357, 27874, 29597, 26680, 28893, 28065, 33468, 35419, 26796, 32982, 34084, 31568, 39023, 38448, 39374, 40264, 42576, 58396, 70155, 74242, 70313, 64406, 60793, 47444, 34712]
14021C4712P56J0354j876N207N908L925M536j941j57M79R500K0625J0005J0453
14007A12486J3075O044K7408M7544P2558J22066J87184L55166O07538N92717j2103
13996B131683n05176n73066l86521k14684j30567p2613m9803m0485k4150k2114
13986A12504j2494m906L701M641l0814k3690K949M363J442N744K032o470j4369
13973D4633p672q86j834n299n239O808K0120J4194O402q254m769j426k11O90K462
13958E9719J6609J3733O026n589j4763j1001O594J077r735J1045J6486O361J912
13945I8474M025J1077M705k352O592J1432J612l533j3181L715J0231Q721P329
13932A48847J1708J2016J021J5789K3812J1532J564R869L857J4020K3116L2191
$$ y = [34712, 35468, 45822, 43946, 49153, 55061, 58986, 63522, 61581, 61424, 61903, 71403, 92028, 102033, 112486, 125561, 131605, 159013, 206557, 279115, 401181, 588365, 943531, 1551069, 2143786, 2131683, 1626507, 1053441, 666920, 452236, 321669, 249056, 199253, 158768, 134618, 112504, 100010, 95104, 98805, 103446, 72632, 48942, 51891, 56254, 57696, 63440, 65472, 59002, 44633, 36961, 36075, 34241, 28942, 23703, 30511, 50631, 64825, 71227, 62973, 58204, 56778, 56567, 57257, 59719, 76328, 90061, 96087, 90498, 75735, 64734, 71328, 72405, 62670, 73715, 90201, 96562, 98474, 102499, 113576, 118281, 115929, 122521, 133953, 135565, 132032, 118851, 122566, 132797, 141518, 148847, 160555, 172571, 173592, 189381, 213193, 224725, 226289, 236158, 240015, 254035, 277151, 309342]
13920C09342L1792M6389M7699O7401Q0940R9036J15675J48448J49655J17727J36753
13909A350857K33724L83825N92323R37097J565544K858350N642893J0271185R847137
13900C3682935j383175q841405r288259n716631k964776j624173r69302o18141
13892B277073m21271l19897k21932j37143j15220j65284j53838j16611q1014n3258
13882D91605k7982l5497l2748j1904m307K2665O0400Q6858L4126o6807j11874
13871D04535r3669n3014l9737k8770k0275j6262o940j2907q761q274r972o612
13859I9342O66o135r292j495M911j903J434Q434o448n030p378l742Q245L051J659
13844H6319J04n693K554J000P61l862M384L838J0527J2373R198J223k0681r311
$$ y = [309342, 341134, 387523, 435222, 502623, 583563, 682599, 798274, 946722, 1096377, 1214104, 1350857, 1584581, 1968406, 2560729, 3497826, 5063370, 7921720, 13564613, 23835798, 33682935, 32299760, 23458355, 14170096, 8453465, 5488689, 3864516, 2895214, 2277073, 1855802, 1535905, 1313973, 1176830, 1061610, 896326, 742488, 625877, 544863, 491605, 463623, 428126, 395378, 383474, 379167, 401832, 462232, 549090, 583216, 516409, 404535, 310866, 257852, 218115, 189345, 169070, 152808, 145868, 132961, 124200, 115926, 105954, 99342, 100008, 93873, 84581, 83086, 87997, 86094, 87528, 95962, 89514, 84484, 77106, 73364, 81609, 84660, 86319, 86423, 80730, 83284, 84284, 85045, 81183, 85567, 89405, 99932, 112305, 121503, 122726, 102045, 92734]
13830I2734N205J0196K4508K7894O625j1449l1918l2041j9169j2284P13K378O610
13817G0002N564j084m135k996k441r210j1706m045n665k827j871P08P62J0923
13803D1979K422r943K462j136J3065O494n891k642r68M821M039M623J10L558J0693
13788G3686j485j5170q41N678q977r741J2599J6411K2846L7533K0866R091J7583
13775A80079J9378L6605J8688q677k0689k6969j4232L2752O9783O9851j1634o0210
13763B84725o8009o0312m4476l7988k3344j953J0033K348m290L213m617l446r837
13750D2047j1265m839l589J0323r5N60q258P328N012J086K870l982n366K825R520
13735D4177J1482R539j1349k0604k167j240m136r175M768P592K620R929J7581
$$ y = [92734, 97939, 108135, 132643, 160537, 167162, 155713, 123795, 91754, 72585, 60301, 61014, 63392, 70002, 75566, 74482, 70347, 67351, 64910, 55700, 43994, 39949, 34284, 31457, 29586, 30294, 31056, 41979, 44401, 34458, 36920, 35784, 48849, 55343, 49452, 46810, 45842, 50663, 54702, 59325, 59435, 62993, 73686, 72201, 57031, 56190, 61868, 52891, 43150, 55749, 72160, 95006, 132539, 153405, 162496, 180079, 199457, 236062, 254750, 246073, 225384, 198415, 184183, 216935, 286718, 356569, 344935, 284725, 216716, 156404, 111928, 73940, 50596, 48643, 58676, 61024, 56734, 59947, 55330, 51884, 42047, 30782, 25943, 22354, 32677, 32582, 33142, 24884, 32212, 37224, 38310, 41180, 37198, 31832, 34657, 44177, 55659, 65198, 53849, 33245, 31078, 29838, 25702, 16527, 21295, 28887, 31507, 41436, 59017]
13722E9017J2090R320j8081k5860q159k938K51J68J1336Q182j6986j3442Q967
13709B3865K1595J5805J6018J5039J8948n856j0412j7042j3914k915L326J506
13697F5963J5872J2477n5J79L570m162q594J0888Q338p29K732N525K225K959K3867
13682A41055J7315j816j5425j1933o872j2528j185M167K4213K3580j3575j3704
13670A33292j4767l094P327J2029K1590J0236O159J4462J9793o59o364j7747k3787
13657A58470j6420j0807j4147q120L071K4380L6228P4955P7336K0415q394k4688
13645C12279o1823l8190j0194r119M153o026p374n0j020m160k635J0519O825q413
13631A84772m960m542k14L089J1196N810M833M365j1372n814R639O304M228P29
$$ y = [59017, 71107, 80427, 62346, 36486, 28327, 25389, 25640, 25808, 37144, 45326, 28340, 14898, 23865, 45460, 61265, 77283, 92322, 111270, 105414, 95002, 77960, 64046, 61131, 64457, 65963, 81835, 94312, 94257, 94436, 98006, 93844, 85250, 96138, 104476, 103747, 106479, 112004, 114229, 117188, 141055, 158370, 156554, 141129, 129196, 122324, 109796, 108611, 112778, 136991, 160571, 146996, 133292, 118525, 115431, 122758, 134787, 156377, 166613, 172772, 187234, 207027, 206368, 200004, 182257, 158470, 142050, 131243, 117096, 108976, 112047, 136427, 172655, 247610, 324946, 345361, 336967, 312279, 250456, 212266, 202072, 192953, 197106, 191080, 183706, 183656, 182636, 178476, 175841, 186360, 193185, 184772, 179812, 175270, 175056, 178145, 189341, 195151, 199984, 204349, 192977, 187163, 196802, 203106, 207334, 208063]
13617B08063J3438J3500J150l542O08J579o675n774m582j4358Q191J0478K6141
13604B48217K9405J4900R495Q663J6162J7515K306p862k1110p908Q223R477N447
13591C32930K0513J6144K0175J1989N525L1005L2860L0616R888J0007K1574K7809
13579E71035K5205M0285L9471J2237j940j41J339J8920J4945J9808L7457M7533
13567H26154M1233N8269P0415P3943L3874K314M584L3294P5886R1117P7155P5003
13555A463241Q9255P3767N3662Q8147J22527J42062J57597J68981J66740J60607
13545B686586J64877J97777K76890L66356M72440N51245N96261P21767R12627
13536F946826J082386J244973J576910K103496K413586K253572K729858M211665
$$ y = [208063, 221501, 235001, 236151, 232609, 233217, 234796, 228121, 222347, 217765, 203407, 211598, 222076, 248217, 277622, 292522, 302017, 310680, 326842, 344357, 346663, 338801, 317691, 309783, 318006, 327483, 332930, 353443, 369587, 389762, 401751, 407276, 438281, 471141, 501757, 511645, 521652, 543226, 571035, 596240, 636525, 675996, 688233, 686293, 686152, 687491, 706411, 721356, 741164, 778621, 826154, 867387, 925656, 996071, 1070014, 1103888, 1106202, 1110786, 1144080, 1219966, 1311083, 1388238, 1463241, 1552496, 1626263, 1679925, 1768072, 1890599, 2032661, 2190258, 2359239, 2525979, 2686586, 2851463, 3049240, 3326130, 3692486, 4164926, 4716171, 5312432, 6034199, 6946826, 8029212, 9274185, 10851095, 12954591, 15368177, 17621749, 20351607, 24563272]
13528B4563272O678657J0613932J7233038K9244580N4225356J01440881J30433778
13521C74433494L8361493p5231721j13449043q8109250m9209815k7083753j6178955
13514D3532450j0169266o743482m672227l104636k203620k281751k411433k126515
13506I819520j557322j075265q07518o51609n26004m27851l66651l48342l48060
13497C710898l60539l31181k71296k06605j60142j25146r9781r4281j12907r8500
13487A850520k6975K6443J05900K76152N93486J170485J447053J16052j113724
13478D445392j366078r20174m99197k95187j82721j03467q5821q9831q0564o1202
13468G61150p1924p3002n6184l8026k0219p951j40l845k0556l1732j0713L1019
$$ y = [24563272, 31241929, 41855861, 59088899, 88333479, 142558835, 243999716, 374433494, 412794987, 337563266, 224114223, 136004973, 86795158, 59711405, 43532450, 33363184, 26619702, 21947475, 18842839, 16639219, 14357468, 11946035, 9819520, 8262198, 7186933, 6379415, 5727806, 5201802, 4773951, 4407300, 4058958, 3710898, 3350359, 3019178, 2747882, 2541277, 2381135, 2255989, 2156208, 2061927, 1949020, 1850520, 1823545, 1849988, 1955888, 2232040, 2825526, 3996011, 5443064, 5559116, 4445392, 3079314, 2159140, 1659943, 1364756, 1182035, 1078568, 992747, 902916, 822352, 761150, 689226, 616224, 560040, 522014, 501795, 493844, 493704, 489859, 469303, 437571, 426858, 457877]
13456D57877L4445J5406n31j1506m289r948j5931O803N3710O2415k755q3676r2826
13443D09194n2094j1550k1317j9187n702J3565J2090j351j4163J938j3949j5303
13431B82171p849n154J1771J4392q84L4211N2193P435m1503m7859m0708k1153
13419B37063j8596j2292l563m76j188P068J2455R776J2241N378J024J2974J9433
13406B81297R142J2946J8304L1375O4280R4617J60052K69376M98015R14661J144558
13395C498623L20067o26178q96902o92285m56761l16817k07428j29677q9472n6671
13385C46499l8481k4120m1595l3767k7096j1235k081q741j0888j3491J3096L0230
13373A78330L1377M7997J0292m0462m3315l726j99M388P90j6729p78L923J317
$$ y = [457877, 492322, 507728, 507197, 495691, 491402, 481454, 465523, 472326, 526036, 588451, 585696, 502020, 409194, 357100, 345550, 324233, 305046, 299344, 312909, 324999, 323648, 309485, 311423, 297474, 282171, 274322, 269168, 280939, 295331, 294447, 328658, 380851, 388286, 346783, 298924, 258216, 237063, 218467, 206175, 202612, 202136, 200948, 208016, 220471, 230247, 242488, 247866, 248890, 261864, 281297, 290439, 303385, 321689, 353064, 417344, 511961, 672013, 941389, 1439404, 2354065, 3498623, 3818690, 3192512, 2295610, 1603325, 1146564, 829747, 622319, 492642, 403170, 346499, 308018, 283898, 242303, 208536, 181440, 170205, 168124, 159383, 148495, 135004, 148100, 178330, 209707, 257704, 267996, 227534, 184219, 180493, 180294, 184682, 185472, 168743, 167965, 171888, 173205]
13360A73205q178j5396k8428k5633j7612o701r60r379l149P061J0888J839j481
13347G6076J388L783k53N062o434j0177j0734l112M27j7098j8119M422J8245L2542
13333G6018J9672J0119J2973j5392j5592q451k869N012k828q648j5708j2305R95
13320D2996J8722K4471J1811k688l365j850o097M273j1195k1554j6680J72M065
13307D3081P821L831J2510N335q962O11p384o75K851J071q043o043J3910J8236
13293G8150j339p110n867j347K911J474m425n224p629M305r95m235j0077j5573
13279B3019O842Q386J5989N243L067j712m226o281J7488J3440J2102R832P261
13266A10450k3158k2474q212Q786O603O813n887j738m829j2487j6174o745o207
$$ y = [173205, 165027, 149631, 121203, 95570, 77958, 71257, 70297, 60918, 57769, 64830, 75718, 77557, 76076, 77464, 81247, 80994, 86056, 79622, 69445, 58711, 55599, 56026, 38928, 20809, 25231, 43476, 76018, 95690, 105809, 118782, 103390, 87798, 79347, 76478, 81490, 78662, 70014, 54306, 42001, 42996, 61718, 86189, 98000, 95312, 91947, 90097, 84000, 88273, 77078, 55524, 38844, 39016, 43081, 50902, 54733, 67243, 72578, 63616, 64227, 56843, 56168, 59019, 60090, 52047, 46004, 59914, 78150, 76811, 69701, 63834, 62487, 65398, 66872, 62447, 57223, 49594, 53899, 52904, 48669, 38592, 23019, 29861, 38247, 54236, 59479, 62546, 60834, 56608, 50327, 67815, 81255, 93357, 103189, 110450, 87292, 64818, 56606, 65392, 71995, 78808, 72921, 71183, 66354, 53867, 37693, 30948, 24741]
13253B4741L492J7379R656J381p631q147K010K737J02K88N724q521p939j1737
13239B3535K054J2692R775J0217j6643p473Q19p065m231n4P493k133j355n726
13225B1905L001R810M205k60q723j5492k2974k5934k3420j1495J4706K2086J3966
13212a8619K240l226j3806j4328O329J1636L203N543K1308J3620q990p316j488
13199c894q123J31J1468L564K536N333M575m91R278O335m00P15Q88m849j345N481
13183C1202q24L255K704N290L649o539n714Q14k749J648L780l20p704m845p590
13168A6057p063J429M649O113J287L175k43p954p959n021K899P0j794o188N895
13153E352J0507K143q91j15o681J1748N38r344j758Q176Q533m394k481k226r68
$$ y = [24741, 28233, 45612, 55268, 56649, 49018, 40871, 42881, 45618, 45720, 46008, 51732, 43211, 35272, 23535, 25589, 38281, 48056, 58273, 41630, 34157, 34976, 27911, 23680, 23626, 31119, 28986, 27631, 21905, 24906, 34716, 38921, 38661, 29938, 14446, -8528, -34462, -57882, -69377, -54671, -32585, -18619, -16379, -19605, -33411, -47739, -41410, -29774, -26571, -21028, 280, 13900, 4910, -2406, -3894, -12017, -11886, -418, 3146, 5682, 11015, 15590, 15099, 24377, 30712, 30312, 31027, 31915, 27066, 25721, 31202, 30378, 33633, 36337, 41627, 45276, 38737, 33023, 33837, 31088, 32736, 36516, 36196, 28492, 23647, 16057, 8994, 10423, 15072, 21185, 22472, 25647, 25404, 17450, 9491, 4470, 7369, 7439, 5645, -543, 5352, 15859, 18002, 17111, 16996, 10315, 22063, 22601, 13257, 11499, 19675, 28208, 23814, 21333, 19107, 18139]
13138A8139j160L036L816j0512q569L030P848L45J536M724p511l158L569J180
13124A6313M822O430k592m840Q581k296k712q522p091q058O329P323n14o564j389
13109E220L539R116M932r14j0003o640K016L395j923N818m830j560j751J25P828
13094A4368K730N957Q372k069l248k497M82J6096R089j4255n081n10P846l073
13080C4207j0098k451J288j854n66P451Q679R878l99k873o99m185k865m550m814
13065B6149Q359J8448N492j610j2981R2o940m162J3489N783m800n289J2694K790
13051E7514J4493J3592Q894P855J9821K3819K9847N2210R6447J50321K85369N24928
13039A285110O74343K34801l84491n88751m65125k61027j46678r5827n0849m4249
$$ y = [18139, 16979, 20015, 23831, 13319, 4750, 7780, 15628, 15973, 17509, 22233, 14722, 11564, 15133, 16313, 21135, 27565, 24973, 20133, 28714, 26418, 23706, 15184, 8093, 35, 6364, 13687, 13173, 6609, 5220, 8759, 17875, 22807, 21893, 11890, 5250, 7266, 10661, 8738, 14556, 9726, 8166, 6415, 6540, 14368, 17098, 23055, 31427, 29358, 26110, 23613, 24095, 40191, 49280, 35025, 29944, 29434, 37280, 34207, 24109, 21658, 22946, 21092, 20526, 27977, 36656, 46534, 46135, 43262, 42563, 38378, 35513, 30963, 26149, 34508, 52956, 58448, 56838, 43857, 43949, 37009, 32847, 46336, 52119, 47319, 42030, 54724, 57514, 72007, 85599, 94493, 102348, 122169, 145988, 175835, 228045, 324492, 474813, 760182, 1285110, 1959453, 2194254, 1809763, 1221012, 755887, 494860, 348182, 252355, 201506, 157257]
13029A57257l1916k1818j8058j7032j1338j4429j1162m553j404o344l051j224
13017A4928P345q128p069J3431L363O146l691m785j361M078R702L584J987l717
13003C5813o6n158M284P489N019J292j1748j5197r785m123j492N805N446j0414
12989G165q027q722M186J1724k076l375L559M700L382j5j352m736q248N319j864
12974A620j326P284J1728l213p445r119J192J536k79L764k12l174m922j608m16
12959d590K845J611J122J826L717M685N977r95M59N348m587k164J1426O419K305
12944C5404p71j287K882l879j1608r297L986N977K494j0927p128r509m682J002
12930g343R172O985L55k007p889j375O47M974M353O868k898l543O485L16r96k016
$$ y = [157257, 125341, 103523, 85465, 68433, 57095, 42666, 31504, 26951, 25547, 19203, 16152, 14928, 22273, 14145, 7076, 20507, 23870, 30016, 26325, 21540, 20179, 24257, 33959, 37543, 39530, 35813, 35747, 30589, 34873, 42362, 47381, 48673, 36925, 21728, 11943, 7820, 6328, 12133, 17579, 7165, -862, -9584, -5398, 6326, 4250, 875, 4434, 9134, 12516, 12501, 11149, 6413, -1835, 3484, 1620, 294, 7578, 19306, 16093, 8648, -471, 721, 2257, 1978, 5742, 5530, 2356, -2566, -4174, -4590, -1745, -134, 988, 2814, 6531, 11216, 17193, 16198, 16657, 22005, 17418, 15254, 26680, 33099, 35404, 34633, 33346, 36228, 32349, 20741, 11444, 15430, 21407, 23901, 12974, 5846, -3663, -8345, -7343, 1829, 8814, 9169, 7162, -727, -2102, -1455, 3519, 7872, 14740, 11842, 8299, 14784, 15100, 14104, 12088]
12914A2088o653L919K0469P989M651m219L023j2640k5504j3783N63L594j858R126
12900G65J0210l227j620L847L868j178Q1J875P26j782K416L087k356L936j790
12885A8858m033M697O040L824K316j834l888J547L666P592K0728L5690N8807P8354
12871B32364K3492l6886n6764l7479k3367k3190j6388j8231j8624q219k588M42
12859A4562L350n844m192M82q99k006O232p328p006M832R296p959K11K134l431
12844B434o619l127N502K908K854M499O952P426j0786o390j6861p941J2976J2867
12830F694M630o637O501L377m368j1428J0028J1394J602n884q70N423Q59r228
12816A2093r391J056m471L052J2177L572n314N584Q424J1855K8278L0272M1268
$$ y = [12088, 5435, 9354, 29823, 37812, 42463, 38244, 41267, 28627, 3123, -10660, -10097, -6503, -8361, 765, 10975, 7748, 6128, 9975, 13843, 12665, 12746, 14621, 15347, 13565, 15981, 19068, 16712, 20648, 18858, 14825, 19522, 25562, 29386, 31702, 29868, 25980, 27527, 31193, 38785, 59513, 95203, 154010, 232364, 255856, 218970, 162206, 124727, 101360, 78170, 61782, 43551, 24927, 16708, 14120, 14562, 17912, 12068, 7876, 8358, 7459, 5453, 11685, 4357, -2649, 2183, 11479, 3520, 3731, 5865, 2434, -4185, -7312, -1810, 1098, 3952, 8451, 15403, 22829, 12043, 5653, -11208, -19149, -6173, 6694, 11324, 4687, 11188, 14565, 10197, -1231, 8797, 20191, 21793, 15909, 15039, 20462, 21321, 12093, 2702, 3758, -713, 2339, 14516, 18088, 12774, 18358, 26782, 38637, 66915, 97187, 138455]
12803A38455K7727K6607O727o877j3972k3191k7373l0450l5204j6094r627m585
12791C2143n615k016n391k169P506O739j0394j5318j75M55j271q75k433L655k451
12776B390J767n018n007N36K516N004M632O935p15q587j062j836n168J743J544
12761c26K47J764j12l517O81K225P801M660m585j673k924m153L500K587l309j0990
12745h124N240P067m029O340R441p796p405R30K916J0871N408L69J609Q667J2265
12730D3769K0769J7114K4009L6929M2646M4767J5291m2943o0208m0443k9366k6658
12718D5676N08n487q879n306l415K248L122J3195J6500J1776L044j285j5207k6036
12704C0454p128j214j1342l672n513J411R603N08k808m759O880M292J000r772
$$ y = [138455, 166182, 192789, 199516, 192639, 178667, 155476, 128103, 97653, 62449, 46355, 36728, 32143, 26528, 24512, 19121, 16952, 24458, 31197, 20803, 5485, 5310, 5765, 4494, 3619, 1186, 4841, 2390, 4157, -861, -5868, -5332, -2816, 2188, 6820, 13755, 13040, 4453, 3391, 1555, -3613, -1870, -326, -79, 1685, 1573, -1944, -1263, 962, 8763, 13423, 8838, 7165, 4241, 88, 3588, 6175, 2866, -8124, -2884, 4183, 154, 6494, 15935, 8139, 734, 1664, 4580, 15451, 20859, 21228, 22837, 31504, 43769, 64538, 81652, 105661, 142590, 185236, 230003, 245294, 202351, 142143, 101700, 72334, 45676, 46184, 40697, 31818, 26512, 23097, 25345, 28467, 41662, 58162, 69938, 72982, 71697, 56490, 30454, 23326, 22112, 10770, 7098, 1585, 2996, 12599, 13107, 10299, 5540, 12420, 16712, 17712, 7940]
12690G940p581l471P23M863M338p362J14l396l963m341R558Q419p061m876o5J360
12674d801M961N509R27L853R96L064n933l339p274O519P083J882K655Q127J1940
12659C6169P166K0203P960L341j982N9q088j0184j2946j8586j1005k892m357K743
12645G601n733k141j884k303Q646M346Q56J081k69m649L550L036j5889l957J1977
12630D268J4547M020j6356n427N095L317P250k237l285r045l572M21q722l111
12616a2837N097j968L224N527R17M203q314o824j402l650L130J0072M829q498
12602f494R01O772Q390J2039m599q446r433k508J76k700M342j808L594J1418l175
12587H469r572l968j387j1186J554P037j502K509j872P38o43Q298J6995M151p487
$$ y = [7940, 359, -3112, -2389, 2474, 6812, -550, -436, -3832, -7795, -12136, -2578, 5841, -1220, -6096, -6161, -4801, 160, 5669, 6596, 10449, 11445, 14509, 8576, 5237, -2037, 4482, 11565, 13447, 16102, 24229, 36169, 43335, 63538, 71498, 74839, 72857, 72916, 64828, 54644, 41698, 23112, 12107, 9215, 4858, 7601, 1868, -273, -2157, -4460, 4186, 8532, 9388, 10469, 10200, 5551, 9101, 12137, -3752, -7709, 4268, 18815, 22835, 6479, 1052, 6147, 9464, 16714, 14477, 11192, 2147, -1425, -1004, -9726, -12837, -7740, -9708, -6484, -957, -40, 4163, -4151, -10975, -12377, -16027, -12897, -2825, 2004, -6494, -5593, 1179, 9569, 21608, 17009, 8563, -870, -3378, -3202, -5902, -1560, -3368, 226, 11644, 8469, -1103, -5071, -6458, -17644, -16090, -9053, -10555, -8046, -9918, -9180, -9823, -1525, 15470, 19621, 12134]
12572A2134j1741o05N824M093n199m508m438q612N038n395K683P890R1m701j1427
12557a8873m132N793p825j878Q244J3328J3322N044l507R37k332q772o446N695
12543a402J519J0563l740n095k502o381q14M917K35R44N256p701N69L023L521
12528B912l979j0710J652Q135j779J418L352j559k665k779M740M909M381m22p542
12513F4M559N257k572K643m105M466K290J250K30q506j0346Q969M602j03J69j1726
12497b859l039L88L42K606L498M809m504m221j2513m225R747Q303j946l990Q349
12482G45l846M051O525N76p432O23k403L946O789p518n777R333j233J032O270
12467A1681J902K819j1502l019J1463K579m967p274J559j430p08N729k957k888
$$ y = [12134, 393, -212, 5612, 9705, 4506, -2, -4440, -13052, -8014, -13409, -10726, -2836, -2745, -7446, -18873, -23005, -17212, -25037, -26915, -18671, -5343, 7979, 13023, 9516, 10453, 8121, -651, -7097, -1402, 117, 10680, 6940, 1845, -657, -7038, -7852, -2935, -2700, -1756, 3500, -4201, -3632, -609, 2912, -1067, -11777, -10125, -1990, -3769, -2351, 1001, -558, -3223, -6002, -1262, 3647, 8028, 7606, 64, 4623, 9880, 7308, 9951, 5846, 10312, 12602, 13852, 14082, 5576, -4770, 4199, 8801, 8698, 8867, -2859, -5898, -5510, -5168, -2562, 936, 5745, 1241, -2980, -15493, -19718, -9971, -1668, -3614, -7604, 745, -3101, 950, 7475, 8051, 619, 1242, -1161, 2785, 9574, 2056, -3721, 5612, 4379, 5411, 11681, 13583, 16402, 4900, 1881, 13344, 15923, 10956, 3682, 5241, 3811, 3103, 8832, 5875, 2987]
12453B987j336p286p772n88J1807O637P130k606j0856o592k309L916N101P209
12439E442m783j2332K98K035L629J6492j493r274l867N453j508M170j375n478
12425b591o437j009P394J436L705j1100r963j224R16J0281P695k832K50N752m639
12410b366J1908Q812m635L075L488r382m004M713m709j939K186J580m228l44m451
12395b96L152q529n356p59J0157J5889o268n33K339k634j343j169n624o545j897
12380i416k264k185N281N651Q704N974o798N078l289l074k366J235N610n70k566
12365E005l181n770j0197q035N024L041R74L267N175M310J0854J366J529K055
12351A5417j2602L891N164M801m368j486O187J947r275l719J507o252l597M866
$$ y = [2987, 1651, -5635, -13407, -13995, -2188, 4449, 11579, 8973, -1883, -8475, -10784, -6868, -1767, 5442, 659, -11673, -11375, -9340, -5711, 10781, 9288, 14, -3853, 1600, 92, 4262, 2887, -2591, -9028, -10037, -2643, -1207, 2498, -8602, -18565, -19789, -18873, -8592, -897, -3729, -3479, 2273, -2366, 9542, 18354, 13719, 16794, 20282, 10900, 6896, 11609, 6900, 4961, 7147, 8727, 4499, 4155, -296, 2856, -5673, -11029, -11788, -1631, 14258, 7990, 7457, 9796, 7162, 5819, 4650, -974, -7519, -9416, -11680, -13865, -8584, -2933, 5771, 11745, 4947, 10025, 6736, 3662, 1296, 2531, 8141, 7571, 5005, 1824, -3946, -14143, -22178, -17154, -14113, -13139, -9872, -4697, -387, 10467, 11833, 13362, 15417, 2815, 6706, 11870, 16671, 12303, 10817, 17004, 18951, 9676, 5957, 7464, 1212, -2385, 2481]
12337B481K596j17L012p011o748K174J710j805L670L344M149j749l630n942k827
12322f693r56n967J087P882J0764l662j1443j314R77j2374N393k308J640k278
12308a9252M291P354r78j824M862J41J536k724j57J440L240L028Q478L809n461
12293G783q25o461k271P209Q541r91j575K922P924R709K668M193j177m569j5996
12278A7084n830n79n497O181j087m457j0389M318P317J884p014p720l267k896
12264a1952N338R979m62K55J475O85k260n871o579o99N324M173o868n114K134
12249a0442K275k240l499k598L234K734N102R819m055j1533O307Q588L492O623
12235A3807K848j521j400K833N54N528L759M652o374K974k534j0021q815q41l571
$$ y = [2481, 5077, 4960, 7972, 961, -5787, -3613, -1903, -3708, -38, 3306, 7455, 5706, 2076, -3866, -6693, -7649, -13616, -12529, -4647, 6117, 2455, -8988, -10302, -9325, -21699, -16306, -18614, -16974, -19252, -14961, -7607, -8585, -10409, -5547, -5406, -3870, -6594, -6751, -5311, -2071, 957, 9435, 13244, 7783, 6958, 497, -1774, 5435, 13976, 12985, 11410, 14332, 22256, 31965, 34633, 38826, 37649, 33080, 17084, 11254, 10675, 5178, 11359, 10272, 5815, -4574, -256, 7061, 8945, 1931, -5789, -9056, -11952, -6614, 3365, 2903, 3158, 4633, 5318, 3058, -2813, -9392, -10091, -4767, -594, -7462, -12576, -10442, -8167, -10407, -13906, -16504, -13270, -10536, -5434, 4385, 330, -11203, -4896, 3692, 7184, 13807, 16655, 15134, 13734, 16567, 17121, 22649, 26408, 31060, 24686, 27660, 25126, 15105, 6290, 5449, 1878]
12220A878k007P83j911k45M350j472j028K76K577J1585j90n7K421m296o285J17
12204F496k543n69j1829o967K499J1063N941J635N415l486j0005j0746k556L123
12190a2529k413Q169J7395j44j2040K878n344m425K956p535m295N436J2786M220
12176E115O684k91j3856q41L647N358j1079K450P237m760J09L759M175J257q020
12161I44j136m792m137j358K677N443J25l67j914k274O801l6p175o192M313J895
12145g183j302N31P009n299p274j467J0099p44p192M796K918p8J450K439R18p387
12129g766Q418P917o835l193K233o251m997o949r355O170J007J0991M807p255
12115a1058j0471K132K261J360p83M392J4410K335L620k993M249l328Q213O743
$$ y = [1878, -129, 654, -1257, -1502, 2848, 1376, 348, 624, 3201, 14786, 14596, 14539, 16960, 12664, 6379, 6496, 3953, 3384, -8445, -15412, -12913, -1850, 4091, 5726, 11141, 7655, -2350, -13096, -15652, -12529, -14942, -6773, 10622, 10478, -1562, 1316, -4028, -8453, -5497, -13032, -17327, -11891, 895, 5115, 11799, 11508, -2348, -3189, 458, 5816, -5263, -2813, 4424, -336, -227, 3532, 7707, 8964, 944, -192, -4984, -9121, -10479, -7802, -2359, -2234, -2601, -4515, -6789, 12, -24, -7199, -13391, -9078, -7183, -8485, -7954, -945, -6244, -13518, -14985, -4886, -5630, -12822, -8026, -5108, -5186, -3736, -1297, -379, -7766, 652, 8569, 1734, -1459, 774, -5477, -10474, -17423, -26778, -20608, -19601, -8610, -3803, -11058, -21529, -19397, -17136, -15776, -16559, -12167, 2243, 4578, 8198, 5205, 9454, 6126, 14339, 21082]
12101B1082l390j5008j397N346k187K09n667J697j065K005R55R058M433k145m302
12086I624j8239j883R855O642J990o115L687n46p56j0170K44J836M30q61l553
12071g815j1588n061O670n14Q950L158n704k88L50l848L261P891N052n106q074
12056a2666q82O276j127O360m475p794j224R996L443J822k204j1915p568P32J4964
12041f262p02k303n581m108m04J2292O037ql53M131J952j4672J134N732o561K190
12025g486R084K190p263l557J623J334j5964q294J0390J2025Q081j165K295L806
12011G099n733j213K148J86L479k302r787n617k197J0916P363N209J0009j39J450
11996B0871n689m228n630r338k588j0887m088L376Q023K594k019j260m664N357
$$ y = [21082, 17692, 2684, 1287, 6633, 4446, 4655, -1012, 685, -380, 1625, 2580, 11638, 16071, 13926, 9624, -8615, -10498, -643, 5999, 7989, 1874, 5561, 5015, 4259, -5911, -5667, -3831, -3401, -4262, -7815, -19403, -24464, -17794, -18308, -9358, -6200, -11904, -12192, -11842, -15690, -12429, -4538, 514, -4592, -12666, -13548, -7272, -8399, -2039, -6514, -14308, -15532, -5536, -2093, -271, -2475, -14390, -21958, -21226, -6262, -6964, -9267, -14848, -18956, -19360, -7068, -1031, -1039, -1392, 2739, 4691, -9981, -8847, -3115, -9676, -7486, 1598, 3788, -3475, -7032, -5409, -4075, -20039, -28333, -17943, -5918, 2163, 998, 3293, 7099, 1366, 153, 2301, 2487, 5966, 3664, -6123, -11740, -13937, -3021, 4342, 9551, 19560, 19421, 20871, 15182, 10954, 5324, -4014, -6602, -17489, -21577, -18201, -10178, -7584, -9603, -10863, -15527, -10170]
11982a0170R044J927M488J106K530N872j164n973n776k634j920n997L682J201
11968c784M35J283m548R159O849k428q600p548N376N81N90k882l112j056J30J064
11952h491K704q48L458K524l679m595P430K526j286l266K623L68m336K744L580
11937A456l683J057M789n272j3822j648M532L100n026k043M866J2764J0499k895
11923H674q496m212n36m84l881n625M798k146k611J035k192N434P191L40p279
11908i990M098K203n870r48L328j217J351J1354j047q240l529m858n360O772J4383
11893B430Q492l731q075Q88j154J69j297m50K061l625p150o866J0340K9M622j86
11877c503k388J200k322J472p95K822N096Q20K162m415R78P429N51n523k439k594
$$ y = [-10170, -1126, 801, 5289, 6395, 8925, 14797, 13633, 7660, 1884, -750, -2670, -8667, -4985, -3784, -3349, -2066, -6614, 2545, 9394, 6966, -1634, -9182, -3806, -3225, -2635, -5517, -8629, -9685, -9555, -8491, -5787, -6635, -3177, -653, -4332, -8927, -1497, 1029, -257, -3523, -900, -532, -4868, -2124, 1456, -2227, -1170, 3619, -1653, -15475, -17123, -12591, -9491, -14517, -16560, -11694, 1070, 11569, 8674, 178, -4034, -4570, -5054, -8935, -14560, -9762, -11908, -14519, -13484, -15676, -10242, -3051, -2711, -9990, -5892, -3689, -9559, -10507, -7179, -8396, -7045, 4309, 3262, -4978, -8507, -13365, -18725, -11953, 2430, 10922, 7191, -884, 4, -1150, -981, -2278, -2728, -667, -4292, -11442, -18308, -7968, -7939, -3317, -3503, -5891, -4691, -7013, -5541, -6336, -3514, 1582, 2402, 4564, 149, 1127, 8556, 9107, 3584, 1145, -1449]
11861a449L924J382k348M740l078O614J694n666m065J449k493p866n512m256J1895
11846e035Q164M62p498p383o73P542O77o869L176M846K363L318N656Q04M40m433
11830E557m485k005M690p553n182J3364P086N11l190j0360Q17N056m920j21O933
11815F198J42n164K040j73r690o373J505K306P470j33q665L319J834L952O564
11800E132o746j1409m096j00K921k772R82N411J3821N072o79m345m296l243m001
11785h348O734J04N80L54J686j741r754o977J0760Q497Q205J686p166r79r750
11770f109k334Q419k035j163N681j520k350P894M755j995j1269o872Q40L903N043
11755H88j270p475l422J0781P109p674j649L73j341j179p107J268l048K033P48
$$ y = [-1449, 2475, 3857, 1509, 6249, 3171, 9785, 11479, 5813, 1748, 3197, 704, -7162, -12674, -16930, -5035, 3129, 3591, -3907, -11290, -11963, -4421, -3744, -10613, -7437, -2591, -228, 3090, 8746, 9550, 9990, 5557, 1072, -933, 3757, -3796, -8978, 4386, 11472, 11983, 8793, -1567, -750, 4306, -614, -735, 6198, 6340, 1176, 3216, 3043, -6647, -13020, -11515, -9209, -1739, -1872, -10537, -7218, -5384, -1432, 5132, -1614, -13023, -17119, -17219, -14298, -17070, -16088, -10677, 3144, 8216, 7537, 3192, -1104, -4347, -8348, -1614, -1510, -930, -576, 1110, -631, -10385, -17362, -6602, 1895, 10100, 11786, 4620, 3641, -6109, -8443, -24, -2059, -3222, 2459, 939, -1411, 6483, 11238, 9243, -2026, -8898, -8058, -4155, 888, -382, -7857, -11279, -498, 6611, -1063, -2712, -2339, -3680, -4859, -11966, -10698, -13746, -11713, -10965]
11740a0965K126P822l5P817k889J651o298k669R185p221m190K413J0074p55r571
11725c505P430p625r841j772j606n552K674L102m046Q380J0211K779m865J918
11711b318l416O725J926N24k217m190J0869p8n209k72o790p124J0470M398K108
11696E406o865o76j2833P895J1688N567j326o356L292N447j0220j1636N430Q537
11682C350J067N513K470n898q084q309K870N768j1146p814L236o231l461J2565
11668a4104J1766l321l135L349Q34n145L097j041l137m279P824N009J1487L329
11654A2533k216j1567o509O185M459R681n472o773m210j201m120J804K032o228
11640a1602k188J024M176J285l386k717Q657L666q717l716J782M307k184J298
$$ y = [-10965, -8839, -1017, -1052, 6765, 3876, 5527, -771, -3440, 5745, -1476, -5666, -3253, 6821, 6066, -3505, 3925, -3700, -13541, -15313, -16919, -22471, -19797, -16695, -20741, -12361, -2150, 629, -4236, -2318, -5734, 991, 2917, 3441, 1224, -2966, 7903, 7825, 2616, 2344, -4446, -11570, -1100, 3298, 5406, -1459, -2135, -14968, -7073, 4615, 10182, 8856, 2500, 5792, 11239, 1019, -10617, -5187, 3350, 4417, 9930, 12400, 6502, -1582, -9891, -7021, -1253, -12399, -20213, -16977, -23208, -26669, -14104, -2338, -5659, -8794, -5445, -4611, -9756, -6659, -7700, -10837, -15116, -7292, -2283, 9204, 12533, 10317, -1250, -7759, -1574, 2885, 12566, 7094, 321, -3889, -5090, -9210, -7406, -5374, -11602, -13790, -12766, -8590, -7305, -10691, -13408, -4751, -1085, -9802, -13518, -11736, -7429, -9613, -8315]
11626h315P247R044R648K893p073r115J817m121m501O037K253L419M663k374J374
11611A2896r559m602o26L778K718j131J642p599N04n928j3111k505k91K035K282
11596a9497K533P86m694L435K447l485J4811Q719o949L0K154k807P8K661P40k054
11580a092L491J69N493j0169l890P747O433j580j3139K349N235k633n580o396
11566a3562k047m825N596R665p201k574n058p56J475O392p578m939J0505Q23k105
11551a6189K685J264Q300N622m244N430N855k680m666M114r664j5280l711J4230
11537h934K749P394n018o31N77q99L198o43j6016l141K645J1743P992j3647l517
11522a6148o024o04k665K191L640P393L435l884N217k118K579O052p70p878k397
$$ y = [-8315, -1068, 7976, 17624, 20517, 13444, 4329, 6146, 2025, -2476, 3561, 5814, 9233, 13896, 11522, 12896, 3337, -1265, -1891, 1887, 4605, 3474, 5116, -2483, -1979, -7907, -21018, -23523, -23814, -21779, -19497, -16964, -16178, -20872, -17437, -14990, -18475, -3664, 5055, -1894, -1864, 290, -2517, -2439, 222, 962, -1092, 2399, 2568, 8061, -2108, -5998, 1749, 8182, 6602, -6537, -4188, 1047, -1586, -7166, -13562, -15609, -20434, -14838, -5173, -12374, -14948, -20006, -20762, -19287, -12895, -20473, -25412, -14907, -14084, -16189, -13504, -12240, -3940, 1682, -2562, 2868, 8723, 6043, 1377, 5491, -4173, -19453, -23164, -8934, -6185, 1209, -3809, -4440, -3863, -4762, -1564, -2207, -18223, -21364, -18719, -6976, 1016, -12631, -16148, -22172, -22776, -25441, -23250, -19610, -12217, -8782, -12666, -7449, -9567, -6988, -936, -1706, -9584, -11981]
11507a1981o801L163K706M593O752L69J418o307o562N712m252o080l181L591l515
11492b0375N514J520J385m202M52O399J385P67L758J032j2809o663J5174J2981
11478F318q394j1153n128J949k357l891M427J6452R53q636L652J801N37n057j0956
11463a9483o78J4744O44j873r618q339j043N366P840K276J229J193j746J179K60
11448h049N018J267P92J0031l78j998p691m798p327n445J333j613J2711M670j544
11433c021r70k385o261j281L470M84j0007M6R336j866O662R932j846j701L95L328
11417D315l325q646p237L867P111k929q572Q408N620L483j4783j2488K745K957
11403a9474M976L248l383j273L414n607L894Q612J699M642j476L287l74O959l191
$$ y = [-11981, -18782, -15619, -12913, -8320, -1568, -1199, 219, -6088, -12650, -6938, -11190, -17270, -20451, -16860, -20375, -14861, -13341, -11956, -16158, -15706, -9307, -7922, -7155, -3397, -2365, -15174, -21837, -6663, 6318, -2076, -13229, -18357, -16408, -18765, -22656, -18229, -1777, -824, -9460, -5808, -4007, -3470, -8527, -19483, -20161, -5417, -4773, -6646, -16264, -24603, -25646, -20280, -12440, -10164, -8935, -7742, -9488, -8309, -8049, -3031, -1764, -972, 9059, 8681, 6683, -1008, -5806, -13133, -18578, -17245, -18858, -6147, -1477, -3021, -3991, -6376, -12637, -13918, -10448, -9964, -19971, -19925, -10589, -12455, -5793, 4139, 2293, 592, 987, 4315, 990, -7656, -14893, -11026, -3915, -6844, -15416, -7008, -1388, 2095, -12688, -25176, -22431, -19474, -14498, -11250, -14633, -15906, -12492, -18099, -14205, -5593, -3894, 748, -728, 2559, 2185, 9144, 5953]
11388E953m502J085j2399o941j1635q862P647J6624J4147Q026J136P1n665l062
11374A623m260n398J3181O393j527m578j696l978l901l33Q602J0392j449j0871
11360B200q285l098L340J183k175l021J672J1153m519k920j1102l60O117N338
11346d477J22j1012J088P158P99m054R59l0j4861q880K312J211M380Q034M627
11331a2624j520m505L434o599J683M974Q68k016O884K720l20P037M690p644k581
11316e519j0426J4M673n185N260q04R20m795j859N242J074L594l33j1721o64J3111
11300g418J3041P95n48l510j0201m53L940L629M837j0411j930q89q985o777R22
11285b3958R832P177j754L025K748J89n999N272K485n63k187o41l234J149j337
$$ y = [5953, 1451, 2536, -9863, -16804, -28439, -37301, -29654, -13030, 1117, 9143, 10279, 10350, 4685, 1623, -2637, -8035, 5146, 11539, 10012, 5434, 3738, -240, -4141, -4474, 4128, 14520, 13071, 2200, -6085, -9183, -5843, -4660, -6835, -9856, -8184, 2969, -1550, -4470, -15572, -15932, -9815, -4477, -4355, -15367, -14279, -7121, -6322, -10376, -9417, -9447, -24308, -33188, -30876, -29665, -25285, -17251, -12624, -14144, -18649, -15215, -21814, -20131, -15157, -14289, -16305, -9421, -6701, -7021, 16, 4706, -2938, -5519, -15945, -15931, -11258, -16443, -11183, -11987, -11067, -15862, -17721, -12479, -11405, -7811, -8144, -19865, -20529, -7418, 5623, 6418, 5870, 2360, -7841, -8294, -4354, -725, 4112, -6299, -8229, -9118, -18103, -24880, -23958, -14126, -6949, -8703, -5678, -2930, -2741, -8740, -3468, -983, -1546, -3733, -4374, -7608, -6459, -7796]
11270g796m90J0645k68J297p892R171O508q483J79k321L127p441R79J469l803
11255e119M037o526k723N586K056k212p0k114j477o596j4717J0757M487m762O279
11240a3114O777K717j1037p9J672L452N409J05o037J230r66p573q186P132n184
11225b3682J761J419Q889O879n30j533M369j32k206Q84M286P78J738k546r294
11210h920L229Q353Q458m385n342k199k927K967J645k147M352J0732o96j4013
11196h93P24n984O495l82l537q103J030R720j881m318m869K525J515n317K168
11181a1107L759m017N446m979q723n468K018Q207P21K452o236j299J2571K622
11167d033j0747M41P085j614j678Q188K87k143M306K498k984o838N10Q81J681
$$ y = [-7796, -8286, 2359, 2091, 3388, -4504, 4667, 11175, 2692, 2871, 550, 3677, -3764, -2785, -1316, -5119, -1082, -7608, -10331, -4745, -2689, -4901, -4971, -7085, -8562, -15158, -29875, -19118, -14631, -19393, -13114, -6337, -3620, -14657, -14736, -13064, -9612, -4203, -4098, -10135, -8905, -9871, -17444, -25630, -18498, -23682, -21921, -20502, -11613, -4734, -5264, -6797, -2428, -2560, -4766, -3882, 404, 1182, 2920, 374, -8920, -5691, 2662, 11120, 6735, 1393, -806, -3733, -766, 879, -1268, 3084, 13816, 13120, -893, -169, -6153, 342, -40, -3577, -11680, -10650, -930, -2811, -7129, -11998, -9473, -7958, -13275, -11107, -7348, -11365, -5919, -10898, -19621, -25089, -23071, -14864, -14143, -11691, -17927, -19226, -6655, -4033, -14780, -14339, -7254, -8868, -10546, -2358, -2071, -4214, 92, 2590, -394, -7232, -6722, -5841, -4160]
11152d160J931M12o67n720M955j318M588L851k784j5806n976O342M322k168j0484
11137b2682l400Q190R259R19j986J711m564q57n496j620j317K980m15M624K651
11122a2003M122l64N465L277q241m186J840k198j922Q806K041J229M593J1204
11108A3663O340m438k052j2152L330p387q635M518N434J0621r967j5947l277R760
11094a0189O788L173M560k864j1594m743q71N88N324O166n360m177O463m683M465
11079f954K83N469J3731N143P869P462j336l332j1516j097L303r008j1479K173
11065G11Q627j750O193m166r67j896R28J1173m035p940J83K430J26j054Q745N23
11049A7831k603p01J401Q7r131r192J55J898N397M282L687K630r503n739q159
$$ y = [-4160, -2229, -1817, -2484, -8204, -3249, -4567, 21, 3872, 1088, -14718, -20694, -14352, -10030, -12198, -22682, -26082, -17892, -8633, -7714, -9700, -7989, -12553, -13410, -18906, -20526, -21843, -18863, -19278, -14654, -12003, -7881, -8245, -2780, 497, -7744, -11930, -10090, -12288, -14210, -5404, -3363, -2134, 2459, 13663, 20003, 15565, 13513, 1361, 4691, -2696, -11331, -6813, -1379, 9242, -725, -16672, -19949, -10189, -3401, -228, 4332, 1468, -10126, -14869, -15740, -15152, -9828, -3662, -9022, -13199, -6736, -11419, -6954, -6671, -1202, 12529, 17672, 25541, 33003, 31667, 28335, 16819, 15722, 19025, 10017, -1462, 711, 9338, 7588, 13781, 9615, 8648, 6752, 7680, 18853, 14818, 6878, 7061, 9491, 9617, 8563, 17308, 17831, 15228, 14527, 15928, 16015, 6884, -2308, -2153, -255, 5142, 9424, 13111, 15741, 6238, 499, -7660]
11034g660l312Q874L35N96L854J227N622m61M310k838N414r69N261J906q805k811
11018A0543p433n713m496K398O333P956m140J356J3954N499k377o040k131n466
11004A0243j824R894n70r328N124M85k543K298n982R871j683j3459l166l376k321
10989f337J2605J8025J901J427l52j2721p666O033P26q90j345r466n140M005L587
10974D392j892L21j581K087k364K570L328K826k509o468j1253l060m035p913J5532
10959a0019J0537l83L137J102l942l646N714O68J304p551j583J1301K801p12j2795
10944d067o889K004n80M081J3308O895o221n450l45r39N689K577k008r972k469
10929d386K78M432l253l731n997j683O658K596K24J99p167P376N604k715P877
$$ y = [-7660, -10972, -2098, -1763, -1167, 2687, 3914, 9536, 9075, 13385, 10547, 15961, 14992, 20253, 22159, 13354, 10543, 3110, -2603, -7099, -4701, 1632, 9588, 5448, 6804, 20758, 26257, 23880, 17840, 15709, 10243, 8419, 18313, 17743, 8415, 13539, 14024, 11481, 13779, 7797, 17668, 15985, 2526, -640, -4016, -6337, 6268, 24293, 26194, 27621, 27269, 14548, 6882, 12915, 13641, 12751, 11406, 1940, -3200, 805, 4392, 2500, 2821, 1240, 3327, 963, 3533, 6861, 9687, 7178, 710, -10543, -13603, -17638, -25551, -10019, 518, 135, 3272, 4374, 432, -3214, 2500, 3168, 4472, -3079, -4662, 6639, 9440, 8728, -4067, -10956, -8952, -9532, -5451, 7857, 14752, 8531, 3081, 2736, 1797, 7486, 10063, 8055, -1917, -4386, -4108, 324, -2929, -6660, -12657, -14340, -7682, -5086, -4862, -4663, -11830, -4454, 1150, -1565, 6312]
10914F312M423K441l038n49J760k35j2621K389O037Q099j6998j7149l477K997
10900a9609k011N344Q402R682k404j566K411k89j0451o476O09J2769R089o07J91
10885E084j372l840k324j1769J343K537j1733L12K148O707K579k045O86J2068
10871C81Q154j517Q964j018J722J2513J3119N499p636m921r034p113j010O208
10857B4311K1784J3217J500p968j7704j1446r664j1770M314k656j182K740P542
10844A3018N641o086M84J1875M62j2054N677J398o38m428j0424l590P247N195
10830A3777j096j0553m15J019n927l514M52N394N691n232l206L924P176R930m942
10815A2478q572n992k549o56R0n058L178M731o376q079N982O609J157r204l378
$$ y = [6312, 10735, 13176, 10138, 9589, 11349, 11114, -1507, 882, 6919, 15018, -1980, -19129, -22606, -19609, -21620, -16276, -7874, 1808, -596, -2162, 249, -40, -10491, -16967, -16358, -3589, 5500, 4893, 5084, 3712, -128, -2452, -14221, -12878, -10341, -22074, -21762, -19614, -12907, -10328, -12373, -11687, 381, 8535, 7018, 15982, 14964, 16686, 29199, 42318, 47817, 40181, 35260, 26226, 19113, 18103, 24311, 46095, 59312, 60812, 52844, 35140, 23694, 14030, 2260, 6574, 3918, 2736, 5476, 13018, 18659, 12573, 13057, 24932, 25394, 13340, 19017, 20415, 19777, 15349, 4925, 1335, 8582, 13777, 12681, 2128, 1713, 2732, -3195, -6709, -6257, -863, 4828, -404, -3610, 314, 7490, 17420, 12478, 3906, -2086, -4635, -5291, -5201, -10259, -7081, -2350, -8726, -16805, -10823, -4214, -3057, -12261, -15639]
10800a5639O085J443L930L002J1108k502j0178n185q078N134K857kL997P1P436
10785C479Q07n209r429n214J015M459m360o972m201J0371M806k124N142o626J343
10770a2713O817m39r139P3Q549O404q40n449o730K196o977M964L721N099O51J918
10754a895L268K493R66J407o562j07J695L468L915J499K948o969m449p546q763
10739a4632q28R050K620k413l949L375j711Q367k346j446o232r386j989J2468
10725i052L599L947l718n597P028K0L26p77P205R793m545m599K309O114J3250
10710B5303Q0n637j708k778M209K150j581j036p36L23K999r716j679K850k30O726
10694A9539l283M147J4651J1873J5001J4707Q519J108k465M136Q023Q968J2707
$$ y = [-15639, -9554, -8111, -4181, -1179, 9929, 7427, -2751, -7936, -16014, -10880, -8023, -8025, -4028, -3957, 3479, 4286, -923, -10352, -15566, -14551, -10092, -14452, -21424, -25625, -15254, -10448, -12572, -7430, -14056, -12713, -5896, -6335, -15474, -15401, -6852, -448, -1288, -6737, -13467, -11271, -18248, -13284, -9563, -4464, -3813, -1895, 1373, 3866, 4832, 6239, -323, -430, 1265, 4733, 8648, 10147, 13095, 6126, 1677, -5869, -14632, -15460, -6410, -3790, -6203, -10152, -6777, -8488, -121, -2467, -3913, -10145, -19531, -21520, -9052, -5453, -1506, -5224, -10821, -3793, -3773, -3447, -4224, 2981, 12774, 8229, 3630, 5939, 12053, 25303, 25383, 19746, 18038, 15260, 19469, 21619, 20038, 19002, 18266, 18589, 21588, 11872, 10193, 13043, 12813, 19539, 16256, 20403, 35054, 46927, 61928, 76635, 85154, 86262, 83797, 87933, 95956, 104924, 117631]
10681A17631K1342L4494M7815N9923P6225J16654K07708L55347P04332J371835
10671C113306J626331J06766j184376j410876r18146m70700k49333j58415j07494
10662C47063p1826m6826l4210k9629k8286k1950j7919q110Q45j482j0665m288
10650G2717j4702o082j1139p864L138k556j0376o435j332J036J8835K2720L407
10637F1367j2759k1326q287k985j8542m180M297O215Q089L559j2116j3282JO975
10623b974J0263k931J2938J7566J4864r138j6641q699r837r638l501R71J912M502
10609c43l643R140L576j1018l700O111N63l917l55M456M520m01J450o92j819n835
10593a907j5562n865J0066L258K252N008L357o876N79Q953l19Q646R126R462R973
$$ y = [117631, 138973, 173467, 221282, 281205, 357430, 474084, 681792, 1037139, 1741471, 3113306, 4739637, 4846403, 3662027, 2251151, 1333005, 862305, 612972, 454557, 347063, 275237, 228411, 194201, 164572, 136286, 114336, 96417, 88307, 89152, 87670, 77005, 72717, 58015, 51933, 40794, 32930, 36068, 33512, 23136, 16701, 15369, 16405, 35240, 57960, 61367, 48608, 27282, 18995, 16010, -2532, -6712, -2415, 3800, 11889, 15448, 3332, -9950, -9949, -2974, 7289, 4358, 17296, 34862, 49726, 40588, 23947, 15248, 5411, -4227, -7728, -6757, -4845, -343, -3986, 5154, 8730, -2288, -5988, 123, 686, -3231, -3586, 870, 5390, 4989, 6439, 5747, 3928, -1907, -17469, -23334, -13268, -10010, -7758, -2750, 607, -6269, -5690, 3263, 2944, 11590, 20716, 30178, 40151]
10578D0151J1460R87K1887L8767N2889J14511J76382Q3528q0875j50423j19623
10567A89641o0787k1639k3621k3810j4537k0632j1151n875N437P199K946m274
10555A8897q891l909J503K883J457O638j3722k312O693p266r918J891N279J0606
10541I829L117j592r484o414m742L597K289K401J990L857M298r07m859m293n327
10526f240J3006M144j371Q02J152q116l47L09O052N619m294o161o152M254O53
10511C310k810l732n79n037N39O972L439n885p337k021N591O674Q331O8k669k659
10495B195n061n589l962J162Q679K542L401N631o177q535q042N866L585N265Q653
10480I613K943l372K105q285p415N705L493L715l623o680q536J507m525N475L036
$$ y = [40151, 51611, 52598, 74485, 113252, 166141, 280652, 457034, 540562, 459687, 309264, 189641, 128854, 107215, 83594, 59784, 45247, 24615, 13464, 7589, 13026, 20225, 23171, 18897, 10006, 6097, 7600, 10483, 11940, 18578, 4856, 2544, 9237, 1971, -7947, -6056, -777, 9829, 12946, 11354, 1870, -4544, -9286, -5689, -3400, -999, 991, 4848, 9146, 8239, 3380, -913, -6240, 6766, 10910, 9539, 10341, 11493, 3377, 3030, 3339, 9391, 15010, 10716, 4555, -1597, 2657, 3310, 500, -3232, -3811, -8848, -8309, -1337, 2102, -3783, -11120, -13141, -7550, -876, 7455, 7523, 4854, 2195, -2866, -8455, -12417, -11255, -2576, -34, 3367, 8998, 2821, -5714, -13756, -7890, -4305, 960, 9613, 12556, 9184, 11289, 3004, -4411, 1294, 4787, 8502, 4879, -1801, -10337, -8830, -13355, -7880, -4844]
10465d844l492J087r6o00N570o961L577P239M649P77o910o14P578R422J105p539
10449I948q663p840j046L620M864M283K794m586n966O545J259K91L698r609J375
10434I67j387j760K673L265l662p071m170l361P80J1833O368O741l557o293m44
10419I22m486K271o031p338P922N704K775J592k782J404j0978m093L477o870p519
10404b4030J894M992O247Q103P10J895J294O872J333J195M903o185l905m00J3033
10389A7951j866n240P478q58j2616j0905M546L402k900p519L495J0665k384J893
10375E142k472L85J885J440j76n331n631L244O143M76n260M53j733P246O053N56
10359A2420n251k895O777o38L064l945r231l772j425R767L948j0858l826O936
$$ y = [-4844, -8336, -7249, -7345, -7945, -2375, -9336, -5759, 1480, 6129, 6906, -4, -618, 6960, 16382, 17487, 9948, 1285, -6555, -7601, -3981, 883, 5166, 7960, 3374, -2592, 3953, 5212, 5503, 9201, -408, 967, -420, -2180, 493, 3758, 96, -6975, -11145, -14506, -13726, -1893, 4475, 11216, 7659, 1366, 922, -3564, -1293, -7324, -14662, -6740, -1036, 1739, 3331, 549, 1953, -9025, -13118, -9641, -16511, -24030, -22136, -17144, -10897, -2794, -2084, -189, 1105, 7977, 9310, 10505, 15408, 9223, 5318, 4918, 17951, 16085, 10845, 18323, 17465, 4849, -6056, -1510, 1892, -1008, -8527, -5032, 5633, 3249, 5142, 2670, 3055, 4940, 6380, 6204, 873, -4758, -1514, 4629, 5105, -155, 298, -1435, 5811, 11864, 12420, 7169, 4274, 11051, 10413, 13477, 9532, 301, -3471, -4896, 4871, 8819, -2039, -5865, 1071]
10345A071K191p967l584M284j2123r62J6345O783k992j261q317P789J427l104
10331d20J402j954k775n216J607Q483n582j106p62m225Q34Q317K833m613m587
10316g764o75n114p02N095J0684L709Q544L513j943Q248j1050p40M820J948o420
10301A2153p193k010q838q445N407J0128k413k39l501n393l468N517j799K624
10287g470P483J806K348p012j129M383O83n410n612J631M568K265Q093n987o814
10272f174m398r5Q330N592R08J0474L427n678N676q49p191j570n423q518j399
10257f888l913p225N405J3079O962l046k609J599J513n02j1470j0731l251J6060
10243e017J0144p404k579j0718o305J1139J1832K158q671j731R245J0704l694
$$ y = [1071, 3262, -4705, -8289, -4005, -16128, -17090, -745, 6038, 3046, 1785, -6532, 1257, 2684, -420, 982, -972, -3747, -8963, -7356, 1127, -4455, -5561, -6323, -10548, -9714, -1397, 1436, -3177, -7764, -8439, -13553, -14255, -9160, 1524, 5233, 13777, 17290, 15347, 23595, 12545, 11805, 16625, 18573, 12153, 4960, 2950, -5888, -14333, -8926, 1202, -1211, -1450, -4951, -10344, -13812, -8295, -10094, -7470, 13, 1819, 4167, -2845, -3974, 409, 1092, -4318, -9930, -8299, -3731, -1466, 6627, 640, -6174, -10572, -10667, -2337, 3255, 4163, 14637, 18064, 12386, 18062, 17213, 10022, 8452, 3029, -5489, -6888, -10801, -18026, -12621, 458, 7420, 4374, 1765, 3364, 4877, 4375, -7095, -17826, -21077, -5017, 5127, -2277, -4856, -15574, -21879, -10740, 1092, 3250, -5421, -7152, 2093, 12797, 9103]
10230I103m217L456j555k480o039k238J648J034P392p007o745m123j243J251J808
10215i955k599k422P0J0757M080p254o240L575q23j439K416r11m507j454Q459
10200h247K679R11Q929L082k093N00j166N889P703q26r894L174M838j667q328
10185E484j0130m928o93q4N781K540r02K636j042j989j981m334N668O604o410
10170c780RP89J2748N981N655L633o592j5392m567k402N881j566O094L161K239
10155A1891R166M183m484r208r23L529j0095J3827R69K014J32j2275q336j5309
10141a4919L70J2692j051m29J1746P314J599J169k089l899l940j097l660m258
10127d52K141P200Q518j1948r393K0792J2968n244o309K604p287r691p330K912
$$ y = [9103, 4886, 8342, 6787, 4307, -1732, -3970, -2322, -1288, 6104, -903, -7648, -11771, -13014, -11763, -9955, -12554, -14976, -14906, -4149, -69, -7323, -13563, -9988, -10811, -12250, -9834, -10745, -15252, -16706, -8247, -5568, -4657, 4272, 7354, 5261, 5761, 4595, 10484, 18187, 17361, 7467, 10641, 15479, 13812, 5484, -4646, -9574, -10267, -10351, -4570, -2030, -2932, -296, -1338, -3327, -5308, -9642, -3974, 2630, -3780, -3771, -2982, 9766, 15747, 21402, 25035, 18443, 3051, -1516, -3918, 1963, 397, 6491, 9652, 11891, 21057, 25240, 20756, 11548, 10625, 14154, 4059, 17886, 18855, 20869, 21001, 8726, 390, -14919, -14549, -1857, -2908, -3337, 8409, 15723, 17322, 18491, 16402, 12503, 8563, 7466, 3806, -452, 1689, 8889, 17407, 5459, -3934, 16858, 29826, 24582, 18273, 20877, 13590, 3899, -3431, -519]
10113e19R743L005j71Q011j0074m001k079o99J934j4237n790N421P007Q665Q70
10098G086m920m391J53J2359Q62o785O923J789L143L01l156k631J276n69K431
10083A3871M902k575k192qj0535j241P739l031R9n384O158k118r582n31L826p51
10067a353l494O085J3237p923j0269J297O250k551Q046J7650j757j0335L122Q640
10053B6645q269l344M743L261L215M876K664K2609J2241N744J4481K6647M1040
10040A56553O0071J23381K51389M88576M82449j50483m37641m06827k26417j24078
10030B16973n6481l1297k8353j4325j7915k0978r189k105l566q795k217O044l065
10017B4731J004j879q967n150P471J115K142n999o783k246M137K415o474l388
$$ y = [-519, 9224, 12229, 12058, 20069, 9995, 5994, 3915, 3216, 5150, -9087, -14877, -9456, -2449, 6216, 7086, 2166, -2225, -2072, 10287, 11149, 4364, 11287, 13076, 16219, 16520, 13364, 10733, 12009, 11440, 13871, 18773, 16198, 14006, 13998, 3463, 2222, 9961, 6930, 7029, 1645, 7803, 5685, -3897, -4428, -602, -1353, -4847, 1238, 14475, 6552, -3717, -2420, 3830, 1279, 9325, 26975, 25218, 14883, 18005, 26645, 18376, 15032, 19775, 23036, 26251, 31127, 33791, 56400, 68641, 74385, 88866, 115513, 156553, 216624, 340005, 591394, 1079970, 1562419, 1411936, 974295, 567468, 341051, 216973, 160492, 129195, 100842, 86517, 68602, 47624, 38435, 36330, 32764, 23969, 21752, 27796, 24731, 25735, 23856, 14889, 9739, 17210, 18325, 20467, 14468, 7685, 5439, 9576, 11991, 5517, 2129]
10003B129O569J025N00O280p803j3535o2K150N613J1542n860m477J504N220j59
9988A0636j651K629Q57M843R70n444L36N210j2155j1108j147K313K446R074l434
9973D375L519k525n426j1861L46J2357K194j986n510n703m355q74K022J3565K344
9958B482q781Q840k699j481k168L491J534r306o70J2418M910l944p138q327Q187
9943b652J504k105L990Q461l017k221J866m19L335q013j710j599J569M875l118
9928G46K861k048L288Q768J3345L168k934j586p751n336L747n937l575M105N928
9913A6789j237p584j0061q058J04R189J0209J3096N310P264J1465J8849O500p638
9899F4197k7422j5896n165M115Q48m740l257n985P54l389l467N80k845j0064O18
$$ y = [2129, 8698, 9723, 10223, 16503, 8700, -4835, -4897, -2747, 2866, 14408, 8548, 4071, 5575, 10795, 10636, 8985, 11614, 12471, 17314, 18284, 12840, 13176, 18386, 6231, -4877, -6024, -3711, -1265, 7809, 4375, 7894, 5369, -57, -11918, -11572, 785, 2979, 993, -4517, -10220, -14575, -15449, -13427, 138, 2482, -6299, 2541, -158, -1639, -3807, -316, 1218, -8088, -8758, 3660, 8570, 4626, -2512, -10839, -2652, -1148, -3253, 737, 9198, 6181, 3960, 5826, 5407, 8742, 729, -981, -2580, -1011, 3864, 746, 3607, 1559, 4847, 13615, 26960, 30128, 27194, 25608, 17857, 12521, 16268, 10331, 6756, 10861, 16789, 15552, 7968, -2093, -10151, -10047, -858, 9351, 22447, 27757, 35021, 46486, 65335, 71835, 64197, 36775, 20879, 15714, 19829, 20677, 15937, 12680, 6695, 7449, 4060, 593, 1173, -1672, -11736, -11118]
9884a1118M804n967J590K354m473J908J0653Q804m255l533m733J0121M568q038
9870B685m737Q607m087j4415O781O706p713n65M212K193N257L200o215n090M677
9855A496J481m675l399J309P770K081K570r616r625L201J339J1479O699K572J66
9840A4848j873l178q534n190m812L670R131O608K296L241n256j8464l703J723
9826i493l219J0182L444L441l606j477m307K163N480P29J318J618K147k249P45
9811F916O615L761n025p917j0668N245R339k404k19M113P464o260j0693q10j699
9796b242m922L939M23K894n930j2507j429R707O927P097J1180r739o338N829R32
9781E821m235J703J1719M692J5807J0159L418K423R460J6334j453j3266o778k796
$$ y = [-11118, -6314, -12281, -10691, -8337, -12810, -10902, -249, 8555, 4300, 767, -3966, 6155, 10723, 2685, -2052, 6555, 2468, -11947, -5166, 1540, -6173, -6738, -2526, -333, 4924, 8124, 1909, -3181, 1496, 2977, -1698, -5097, -3788, 3982, 6063, 8633, -983, -10608, -7407, -6068, 5411, 12110, 14682, 14848, 12975, 9797, 1263, -3927, -8739, -5069, 4062, 10670, 12966, 16207, 10951, -7513, -11216, -9493, -12712, -2530, 914, 4355, 749, -728, -5035, -2872, 2608, 3337, 4655, 6273, 8420, 6171, 6916, 13531, 17292, 12267, 4350, -6318, -1073, 8266, 5862, 5643, 9756, 17220, 10960, 267, -543, -2242, -7164, -3225, -2802, 92, -5838, -18345, -19774, -10067, -3140, 3957, 15137, 5398, -940, 4889, 5821, 1586, 3289, 15008, 19700, 35507, 45666, 49084, 51507, 60967, 77301, 75848, 62582, 55804, 53008]
9767E3008M222O342K6086O1008R6551J06089J00972N3616k0898p9646j04263r4936
9755B08151o2296m0581l3329j9425j6030q548j0929j1801J393j328M382P052O460
9742B3171M583N29m45N22R18p203j3449m480P97L343P08M539j0042o751J986m209
9726e483j595N832P575J3640J3466q244j5922j0472K646n81J644J263L627N831
9712A3227K190o437r974j643M389l16O762K486o781o512k839L398J882L228P101
9697A0161m20J959q482p33L686k845M297p393l839J1879N842j158j1321N179Q930
9682A5742J2560j1097o119N458O843J850r135r087J564N672o308o069O084R416
9668A7374n04n330Q824N266k010n453k869J0989r906j1090J1964O760k7j1816
$$ y = [53008, 57230, 63572, 89658, 150666, 247217, 353306, 454278, 507894, 486996, 407350, 303087, 208151, 145855, 105274, 71945, 52520, 36490, 27942, 17013, 5212, 6605, 5277, 9659, 16711, 23171, 27754, 28283, 27838, 28360, 29278, 22075, 8626, 4146, 4943, 8286, 8994, 13533, 3491, -3260, -1274, -5483, -7078, -1246, 6329, 19969, 33435, 25191, 9269, -1203, 1443, 862, 2506, 3769, 7396, 13227, 15417, 8980, -994, -2637, 1752, 1436, 8198, 10684, 3903, -2609, -5448, -2050, -168, 3060, 10161, 9741, 11700, 3218, 2485, 6171, 3326, 7623, 230, -3609, 8270, 14112, 12954, 1633, 6812, 15742, 28302, 17205, 11086, 16544, 23387, 25237, 16102, 7015, 8579, 14251, 7943, 1874, 7958, 17374, 16870, 11540, 20364, 25630, 23620, 18167, 15298, 26287, 16381, 5291, 17255, 24015, 23988, 12172]
9654A2172K093q22L39k468N75J076n892j195o923N064L483l429L382j673J252
9639G034M337M609j129J528J0209k48n28O9P412L460K927o936j200J9182J8970
9624F9696K0765L5501K3966o141k6926m4050k1324q795q969N96j5105q627L281
9611A3868K666J079K489n09n86J016l625L327M2j069m182O41L981J66P546Q995
9595C5845n00k389n148j2070J2219O486r158q751O074J2764J08L751M737K4360
9581F8328L9494M3701P367l2242l2633k1880j6108j0108q244j572J0181L503q41
9568D8946K774P404K8578N8349N2029M2525K1709j2835n5734p0722l3595j6420
9556G3008j2592j8773q067q008o572K077K606j820k983r04l447K030K705Q801
$$ y = [12172, 14265, 13443, 13782, 11314, 11889, 12965, 7073, 5878, -1045, 4019, 7502, 4073, 7455, 5782, 7034, 11371, 15980, 14851, 16379, 26588, 26340, 25812, 25881, 33293, 36753, 39680, 32744, 31544, 50726, 69696, 90461, 125962, 149928, 143787, 116861, 72811, 51487, 42692, 33723, 34319, 19214, 10587, 13868, 16534, 17613, 20102, 19593, 19007, 20023, 16398, 19725, 19767, 18698, 14516, 15157, 19138, 19304, 26850, 35845, 35345, 32956, 27808, 15738, 27957, 34443, 25285, 16534, 22608, 35372, 35480, 39231, 43968, 68328, 107822, 151523, 158890, 126648, 94015, 72135, 56027, 45919, 37675, 36103, 46284, 49787, 48946, 51720, 59124, 87702, 146051, 198080, 240605, 262314, 249479, 193745, 123023, 89428, 73008, 60416, 41643, 33576, 25568, 18996, 21073, 23679, 21859, 18876, 17972, 14525, 16555, 19260, 28061]
9542B8061K777p961j7522m731O637N6n685P75O861J4335p520j1671R99N765M142
9527A5318M280O899r942n124o468Q404N358L900J384r84o365M663q25K642m825
9512A8315k997J71L532J1535r661o607m46q623n91J655N481P817l137q540J548
9497I452R95l984L693J3571M523r54n928o733K185J587j5304k576R857Q639j581
9482A7442J2958j7693j4474J746J1842J114p635j668j458L712J4762O524M813
9469C1985k130o441J056m047p702K385J08L306N60M65p114q353P71J262N168N130
9453A6409k844L743L998m355m23j845J871M604l209o552J064l330Q708P630n22
9438B4947N607j767o146o003m886j384m943j606k354l393n194M449K592q49m20
$$ y = [28061, 30838, 22877, 5355, 624, 7261, 7317, 1632, 2407, 9268, 23603, 16083, 4412, 5411, 11176, 15318, 19598, 26497, 16555, 11431, 4963, 13367, 18725, 22625, 24009, 23025, 16660, 21323, 20498, 23140, 18315, 15318, 15489, 19021, 30556, 20895, 14288, 13842, 5219, 4628, 6283, 11764, 19581, 16444, 7904, 9452, 10447, 6463, 10156, 23727, 28250, 27296, 21368, 14635, 16820, 18407, 3103, 527, 10384, 19023, 17442, 30400, 12707, -1767, -21, 11821, 12935, 5300, 3632, 2174, 5886, 20648, 27172, 31985, 29855, 23414, 24470, 20423, 12721, 15106, 15214, 18520, 19080, 19545, 12431, 4078, 4849, 6111, 11279, 16409, 13565, 17308, 21306, 16951, 16528, 14683, 16554, 21158, 17949, 11397, 12461, 9131, 17839, 25469, 24947, 30554, 28787, 22641, 16638, 11752, 10368, 5425, 3819, 1465, -1928, -7122, -2673, -81, -930, -1350]
9423a350Q536J2677M488m488J947j271M212R68k685j650p004l316m864Q968R16
9408A6084m291J0467J0596K307J02n151P85P006J0381n378j7297o445J884P173
9394B8223q75L955k788p085j720m392Q072J1856o941J949P033J015p56l537J47
9379C4156o96k272N760O770M754p535k224R928J775k832n781j7495q695L500J3073
9364C2186R321N210p99l656k863J873n922n080R39O501P379l888p325l931J386
9349C1331J5521L763p940K97L170J148P575r844j2677P432J3861L986m423L775
9335E6975R296M340q34j5844j592m752q349N054j28P230J1612k890m339P130O24
9320F3533L585Q790R227o074j0139k948m829m265M786J0419J1126L046K84P458
$$ y = [-1350, 7186, 19863, 24351, 19863, 21810, 20539, 24751, 25719, 23034, 21384, 14380, 11064, 6200, 15168, 16084, 11793, 22260, 32856, 35163, 35265, 30114, 30899, 37905, 48286, 42908, 25611, 19166, 21050, 28223, 27348, 31303, 28515, 21430, 19710, 15318, 23390, 35246, 28305, 30254, 37287, 38302, 37546, 34009, 34156, 33460, 31188, 36948, 43718, 48472, 40937, 38713, 48641, 50416, 47584, 41803, 24308, 15613, 19113, 32186, 41507, 46717, 45918, 42262, 39399, 41272, 35350, 30270, 31209, 37710, 45089, 41201, 33876, 29945, 31331, 46852, 50615, 42675, 42972, 46142, 47290, 54865, 45021, 32344, 39776, 53637, 57623, 53200, 56975, 66271, 70611, 69777, 53933, 52341, 47589, 39240, 44294, 44166, 51396, 63008, 60118, 55779, 62909, 63533, 67118, 75908, 85135, 79061, 68922, 65974, 61145, 56880, 61666, 72085, 83211, 86257, 86541, 93999]
9306I3999O216R394j0539j4023o867l276r93l421m463J3661R973Q040N903L223
9292A06827P622n109l906L925m752j3082k27K078R880Q892J169J28O492Q509J07
9277A28553O102O539P417R244L204o61P656O53L243n674M38L898Q554M759N418
9262A89343Q155P817J1665J359M666J0436M958m09J1090K0718P732J1693J3352
9249C02575O478R029P822J2249J2707J5877J0810L269L554J7478J7234J3375J7470
9236D49927K0941K1709J2935K1744J7804K1868K4140K7987L5421L0529K9508K9175
9224G43688K5619L0899L3949L7846M3038L7538M2479M4673M8912M2812M0337L2880
9212A204670N1505M8596M5749N1843M1663L8844M0479L1054K5389K0767K5156
$$ y = [93999, 100215, 109609, 99070, 85047, 78180, 74904, 73911, 70490, 66027, 79688, 89661, 97701, 103604, 106827, 114449, 109340, 105434, 109359, 104607, 91525, 91298, 93376, 103256, 112148, 113317, 113445, 119937, 128446, 128553, 134655, 141194, 148611, 157855, 161059, 160398, 168054, 168707, 171950, 166276, 166714, 170612, 179166, 183925, 189343, 197498, 205315, 216980, 218339, 223005, 233441, 238399, 237990, 249080, 269798, 277530, 289223, 302575, 309053, 318082, 325904, 338153, 350860, 366737, 377547, 380816, 384370, 401848, 419082, 432457, 449927, 470868, 492577, 505512, 527256, 545060, 566928, 591068, 619055, 654476, 685005, 714513, 743688, 769307, 800206, 834155, 872001, 915039, 952577, 995056, 1039729, 1088641, 1131453, 1171790, 1204670, 1256175, 1304771, 1350520, 1402363, 1444026, 1482870, 1523349, 1554403, 1579792, 1600559, 1625715]
9201A625715K8606J1321J125L785K029r879j1006k3410k2860l1661l1404m0784
9189A501577l6306m5647m8044m0542m8469l7526m2720m9428n2078m1735m0365
9178A018717n1802l7819l8873l2445k8654k7848k1341l3335l2913k9156l3037
9167F51494l3737j8983k3333k3409j8613k6315j7890j7125k0540j7010j8469j6107
9155C99963k2444j0131j2780j2356r702j4083r692r251o995m058r251o850N334
9142B77704j2497j2633K341q792p350j6364j2867m87M736j0345r632o914m400
9129A82500q236p189p776J4811j023m157O102o963j1487r303j7551O780j889j1618
9115A23001L521J32j1023O976J3908l25j039o318j6783p377j848j973m12o635
$$ y = [1625715, 1654321, 1665642, 1666767, 1670552, 1672581, 1662702, 1651696, 1628286, 1605426, 1573765, 1542361, 1501577, 1465271, 1419624, 1371580, 1331038, 1282569, 1245043, 1202323, 1152895, 1100817, 1059082, 1018717, 966915, 929096, 890223, 857778, 829124, 801276, 779935, 746600, 713687, 684531, 651494, 617757, 598774, 575441, 552032, 533419, 507104, 489214, 472089, 451549, 434539, 416070, 399963, 377519, 367388, 354608, 342252, 332550, 318467, 308775, 299524, 292529, 288471, 279220, 272370, 277704, 265207, 252574, 254915, 246123, 238773, 222409, 209542, 209055, 213791, 203446, 193814, 186900, 182500, 174264, 167075, 159299, 174110, 173087, 168930, 175032, 168069, 156582, 147279, 129728, 136508, 134619, 123001, 126522, 126654, 115631, 122607, 136515, 136190, 135151, 128833, 112050, 104673, 102825, 100852, 100440, 93805]
9101I3805O540l7o459L000p333L076j536p055L183N318L935k274j279r91J361
9086I3254J3574lj2223l468k16j0649p363J0539M726j4257j4658M509R020O10
9072G3395n474k79p82j2865q513L577K205K451J607n142l714P416p097l059L785
9057D7511J167L676q143j935M83j1782j1387N730l498l718J0908R643l398p48
9043C4509K17M692L225K241R331j2083j4713j640M283M036K219Q252n528k132
9029C6909N957r893n5M386P797K948m082q291j0211R77R825Q041o160o250j19
9014C1779k497m791R078P339n588k922L947j864O455N01q825k823k966r936p592
8999I295K315L882L718O568J518m12O990M851l020M146M489Q382j321O876p339
$$ y = [93805, 100345, 100308, 93849, 96849, 89516, 92592, 91056, 84001, 87184, 92502, 96437, 94163, 92884, 91893, 93254, 106828, 106825, 94602, 91134, 90918, 80269, 72906, 83445, 88171, 73914, 59256, 63765, 72785, 73395, 67921, 67642, 66860, 53995, 45482, 49059, 51264, 53715, 55322, 50180, 46466, 53882, 46785, 43726, 47511, 48678, 52354, 44211, 42276, 42759, 30977, 19590, 25320, 21822, 18104, 29012, 38655, 35257, 34509, 34726, 39418, 42643, 44884, 54215, 42132, 27419, 25779, 30062, 34098, 36317, 44569, 39041, 36909, 42866, 32973, 32918, 37304, 45101, 48049, 43967, 35676, 25465, 26442, 36267, 44308, 38148, 31898, 31779, 29282, 24491, 33569, 40908, 35320, 32398, 36345, 34481, 40936, 41437, 32612, 29789, 26823, 16887, 9295, 11610, 15492, 19210, 25778, 27296, 26884, 33874, 38725, 35705, 39851, 44340, 52722, 51401, 58277, 50938]
8984E0938j5588o976o159r732l125J7404J5026K5812J7269j77r202p583j0341
8971E7566q727j3186q292J348j827p35R563j2466j408K813P522j6129o485Q45
8957A0402M024N296K293K725m878j937n451P00M827J956k819r727ML004K180O918
8941A9517J16p56K152j944L068J0443P674n613j2438k762n073j0447Q403n4P949
8926B0235P712n478o878o538J0315k049n06n370L24j77N693K02O584N608N936
8911C5613O865p3p353n651n594L008k362M510j143q438j071J3907j524p141p274
8896A6279J1428J2545L053j2318l012L954m257l270l484M91q001p851M826O938
8882A7321J5945N00q825j0118J146L308N202O922n59j585p534j448N479K852k314
$$ y = [50938, 35350, 28374, 22215, 12483, 9358, 26762, 41788, 67600, 84869, 84692, 75490, 67907, 57566, 48839, 35653, 27361, 28709, 26882, 26147, 35710, 23244, 21836, 24649, 32171, 16042, 9557, 10402, 14426, 19722, 22015, 24740, 19862, 17925, 12474, 13174, 18001, 19957, 17138, 7411, 7415, 10419, 12599, 19517, 19633, 18877, 21029, 19085, 22153, 32596, 40270, 34657, 22219, 19457, 14384, 3937, 12340, 12286, 20235, 27947, 22469, 15591, 9053, 19368, 17319, 16813, 11443, 11767, 11590, 17283, 17485, 24069, 29677, 35613, 42478, 42405, 35052, 29401, 23807, 26815, 24453, 28963, 27820, 19382, 18311, 32218, 30694, 23553, 16279, 27707, 40252, 43305, 30987, 27975, 31929, 27672, 24402, 20918, 21409, 13408, 5557, 10383, 17321, 33266, 33766, 24941, 14823, 15969, 19277, 24479, 31401, 30842, 29257, 21723, 20275, 25754, 28606, 26292]
8867B6292r80j3120j681R100Q184L509m17q890k322K97J0479P164n868q88o57
8852C0202n645j745K523O199j122K209M742n124K086K16J2069J674j699l605q073
8837C4907N952n689j2834j703l300k08J0864Q939n028L793J3037K0584J4935j7087
8823F7162j7565j6500l391J4491n04n128q355M735L169N550m625j5134o811K682
8809A9776J215q485j699L765J2499Q641J8458J8611J5204j0799j4852j9548l989
8796C8797n940m98o919n234O414p029P705N533p531r247l762o41q466L098Q438
8781A4718P690k814J883P479K687p773p719m654m129n04J0086N777M123J3351
8767D0201J2129P14j2523j5057K224R88l94L360q156n270n459k399J593P471J5551
$$ y = [26292, 25312, 12192, 10511, 19611, 27795, 31304, 30887, 21997, 19675, 19972, 30451, 37615, 31747, 30859, 30202, 24557, 22812, 25335, 31534, 30412, 32621, 37363, 32239, 34325, 34541, 46610, 48284, 46585, 42980, 34907, 40859, 35170, 22336, 20633, 17333, 17125, 27989, 36928, 31900, 35693, 48730, 69314, 84249, 67162, 49597, 33097, 29706, 44197, 43693, 38565, 30210, 34945, 38114, 43664, 39039, 23905, 17094, 19776, 20991, 12506, 10807, 14572, 27071, 35712, 54170, 72781, 87985, 77186, 62334, 42786, 38797, 32857, 32359, 25440, 20206, 26620, 19591, 27296, 32829, 25298, 16051, 12289, 11648, 3182, 6280, 14718, 22408, 19594, 21477, 28956, 31643, 23870, 16151, 11497, 7368, 6864, 16950, 22727, 26850, 40201, 52330, 53044, 40521, 25464, 27688, 28676, 28282, 31642, 23486, 18216, 12757, 10358, 11951, 19422, 34973]
8752C4973N470M711J5430Q515l163q554j3277j4375j032r047J308K476j446J237
8738B3226L274r676n071P585O858n722M324P550q30o000M302R693N568r649j0201
8723B5231k145L817L599O581o370j516N210M128J4574L992J0579J8299K6411M4082
8709A56472M2768L0198Q247J445L788L022j4200l2794k3891l9052k4373k426l223
8696A05981K2997L4016N7998J09280J91306J78190j9082j46549j54660r9492p6413
8685B03572n1029l3244j9274j2192M194O165m404q060j2285p268p685j7286K090
8672D3294Q332O1o362k1685N31K660j1866j556J0955L227m845P376P517M240r4
8657D1785m536j897M4p494n056M936P04J865N534M292j460j983k977j1517m489
$$ y = [34973, 40443, 45154, 60584, 69099, 65936, 57382, 44105, 29730, 28698, 19651, 20959, 23435, 21989, 23226, 26500, 16824, 11753, 19338, 26196, 20474, 24798, 32348, 31518, 25518, 29820, 39513, 45081, 35432, 25231, 23086, 26903, 30502, 37083, 30713, 29197, 34407, 38535, 53109, 57101, 67680, 85979, 112390, 156472, 199240, 229438, 237685, 239130, 242918, 245940, 231740, 198946, 175055, 136003, 111630, 109204, 105981, 128978, 162994, 220992, 330272, 521578, 699768, 680686, 534137, 379477, 279985, 203572, 152543, 119299, 100025, 87833, 92027, 98192, 93788, 85728, 73443, 66175, 58490, 41204, 43294, 51626, 51687, 45325, 23640, 24171, 26831, 14965, 13409, 24364, 27591, 22746, 30122, 37639, 41879, 41785, 37249, 35352, 35396, 27902, 22846, 27782, 28486, 30351, 35885, 40177, 38717, 36734, 33757, 22240, 17751]
8642A7751L044J2518K202l400k880r750J264K592J404j109l336k303N162J2497
8628C5656M229j781Q693J251O813j450m837j1308j1213J208J788p840n962k949
8614A2298o974L396J8760N356n989n923j985m313O697K315O201K09n318l161j282
8599B0287l671k568J0347J2776O05j453j869j072K450j897J527j473j0669k169
8585B1151R733L658r210P183Q567P33l025o899j4475K479L561k84k538n360k768
8570A2506j869J4707J0236k764q223m902R676Q333n272q630j2427j43O414K123
8556A9765N306J3061N343j0808j5822m884J1806J8010j611m685j105l313P714
8543C8777P453j1087k642m234j2990l265R560J0673n2m513q02m65o063J936j088
$$ y = [17751, 20795, 33313, 35515, 32115, 29235, 19485, 20749, 23341, 24745, 23636, 20300, 17997, 23159, 35656, 39885, 38104, 46797, 48048, 54861, 53411, 48574, 37266, 26053, 27261, 29049, 21209, 15247, 12298, 5324, 8720, 27480, 32836, 26847, 20924, 18939, 14626, 21323, 23638, 29839, 30048, 24730, 21569, 20287, 16616, 14048, 24395, 37171, 37776, 36323, 34454, 33382, 35832, 33935, 35462, 33989, 23320, 21151, 30884, 34542, 25332, 32515, 41082, 41815, 38790, 31891, 17416, 19895, 23456, 23172, 20634, 15274, 12506, 10637, 25344, 35580, 32816, 24593, 19691, 29367, 37700, 32428, 23798, 11371, 11228, 17642, 19765, 25071, 38132, 43475, 32667, 16845, 11961, 23767, 41777, 40166, 35481, 34376, 31063, 38777, 46230, 35143, 32501, 28267, 15277, 12012, 21572, 32245, 32193, 27680, 26878, 26413, 20350, 22286, 21198]
8528B1198j598K400O067K771M690j501k805P786k028m24N804L771k082p855j6885
8513A9309m433L165j983J618k172o221P431N736n36L535l197o911o079l582K884
8498H564M656P902J0575k471m657m6P199l150j206N974M304j5747j71j908o525
8483A3293N680O291J897O081j1980l109k107l86P124n311q208P008q089N201P682
8468B1067J302k489o772J507R101P479m515k898n258n386m315j284R439K351K730
8453B2059J2j185M035j734M1l62j483l658L356J0797Q490l628p386j590l485r601
8437A4678j4119k779P387k446N026R276J0192q641K637l552l672O364K040k347
8423B0044n560l622j348N910K971l296M525j566N968K8m59r318l040j257K572
$$ y = [21198, 19600, 22000, 28067, 30838, 35528, 34027, 31222, 39008, 36980, 36556, 42360, 46131, 44049, 36194, 19309, 14876, 18041, 16058, 17676, 15504, 9283, 16714, 22450, 21914, 25449, 22252, 15341, 9262, 5680, 8564, 13220, 21122, 31697, 29226, 24569, 24523, 31722, 28572, 27366, 33340, 37644, 21897, 21726, 19818, 13293, 18973, 25264, 27161, 33242, 21262, 18153, 16046, 15660, 22784, 17473, 9265, 16273, 8184, 13385, 21067, 22369, 19880, 13108, 14615, 23716, 31195, 26680, 23782, 18524, 13138, 8823, 7539, 16978, 19329, 22059, 22071, 20886, 24921, 23187, 23228, 22866, 21383, 17725, 21081, 31878, 40368, 36740, 29354, 27764, 24279, 14678, 559, -2220, 5167, 2721, 7747, 17023, 27215, 18574, 21211, 17659, 13987, 20351, 22391, 20044, 14484, 10862, 9514, 15424, 18395, 15099, 19624, 18058, 24026, 24054, 23595, 14277, 11237, 9980, 12552]
8408A2552M353k173J90J4923M636k955O278o97N60q190l886L618R274K791J078
8393D2352q920j1556j2374R652J5167R395R392J2457J0609o287j0279j7191n072
8380C7345o588m28N185k917r199M66k440L374L671p914n445J8063K3218O259j0771
8365E1879r484J592q203n667L106P399p943j4576l162O027J260L535J3297N56
8351C9616q97k513n021q363k60M488l174o650j0630k443K887M00R921q324n788
8336C249M402J556M344P505l211m040N992P312O505P847n200j602l441L18N264
8321C6800K454j5122m653K85J916O034q288j788M674O469l270J067O980l337j2620
8306A7601n58M622K639K499j572m736L630k083J300L849p792L359N63l94j45j0942
$$ y = [12552, 16905, 14732, 14922, 29845, 34481, 31526, 37804, 37107, 37667, 29477, 25591, 29209, 38483, 41274, 42352, 33432, 21876, 9502, 19154, 34321, 43716, 53108, 65565, 76174, 69887, 59608, 42417, 37345, 30757, 30329, 35514, 32597, 23398, 23864, 21424, 24798, 28469, 20555, 15110, 33173, 56391, 62650, 51879, 42395, 43987, 35784, 30117, 33223, 40622, 32679, 18103, 14941, 20968, 22228, 25763, 39060, 39616, 38719, 36206, 31185, 22822, 22562, 27050, 23876, 17226, 6596, 4153, 7040, 7440, 17361, 9037, 3249, 7651, 9207, 13551, 21056, 17845, 13805, 19797, 27109, 33614, 41461, 36261, 34659, 31218, 31536, 36800, 39254, 24132, 19479, 19764, 21680, 27714, 19426, 17638, 22312, 28781, 25511, 26578, 33558, 30221, 17601, 17043, 21665, 24304, 26803, 25231, 20495, 24125, 22042, 23342, 27191, 19399, 22758, 23321, 22927, 22782, 11840]
8290A1840r029J1432K983j41L782N532r69M414N736O297n842q034n468J56J1749
8275C4438k937m678j364k730m311q001K52J248N152l406q46K683N608N698n417
8260B1389o343O341Q246K829n618N34r047k925r51J098P502q485M34O748n13L75
8244B1614l914L848j887j0016Q4p2n32q25J485J54p478K919J1136N72k03K490
8228A9375n512q5N847R448n286J180r89R0j6P460R521j312j5606j460K818l887
8212B1586n94p814j034M930p086J324J365M16K428N01j485m058l103Q048K596
8197A8020o333j336P609J5784P768r692j1668m651k281O007P413K484o132m567
8183A8425Q6K109J96j1785P050J159L910K574m81n228j805k343n512J241K672
$$ y = [11840, 2811, 14243, 17226, 17085, 20867, 26399, 25430, 29844, 35580, 41877, 36035, 28001, 22533, 22689, 34438, 31501, 26823, 25459, 22729, 18418, 10417, 10669, 11917, 17069, 13663, 12817, 15500, 21108, 26806, 21389, 15046, 21387, 29633, 32462, 26844, 27378, 18331, 15406, 14455, 15553, 23055, 14570, 15004, 21752, 21239, 21614, 17700, 21548, 19661, 9645, 9729, 9657, 9125, 8300, 9785, 9939, 2461, 5380, 16516, 17088, 16885, 19375, 13863, 13778, 19625, 29073, 23787, 24967, 23978, 24068, 24052, 31512, 41033, 39721, 24115, 22655, 25473, 21586, 20992, 13178, 12144, 17074, 9988, 11312, 12677, 13093, 15521, 16022, 14537, 10479, 7376, 15424, 18020, 11687, 10351, 17960, 33744, 41512, 31820, 20152, 15501, 13220, 19227, 26640, 29124, 22992, 18425, 18511, 20620, 20816, 9031, 16081, 17240, 21150, 23724, 23243, 18015, 16210, 13867, 8355, 9596, 12268]
8168A2268O84L142N044J505j3835N454K668K899P494m159o582O850J584m084J996
8153B2928R78r52L834P162J664q327K225R078P861p832j786N00k537o670Q950
8138C7076L207n371M737m366j1371O011N012k772n754j452L434r590n11R667N565
8123C3522O799q0r041n766k111j053j879J0389Q776L652j0815j0329K600k973
8109B1691n692K052M287L369O870K125q486k21o440J747M395O929J0275K00m722
8094C8379m424J0154K789p337O903R145o7o375n047o04J510R468N465k04l678
8079E6077l130Q78l593n748n19K827O43j2725n197L265k626k520L031J2390J3281
8064E6334L58l672o573p42L366l564J764O229k423r533j0447m334N774J2098J217
$$ y = [12268, 12952, 16094, 21138, 22643, 8808, 14262, 16930, 19829, 27323, 23164, 16582, 23432, 25016, 20932, 22928, 23906, 22954, 26788, 33950, 35614, 27287, 29512, 38590, 46451, 38619, 36833, 37333, 34796, 28126, 37076, 40283, 34912, 39649, 35283, 23912, 29923, 34935, 32163, 26409, 24957, 28391, 18801, 18290, 27957, 33522, 40321, 40241, 31200, 25434, 23323, 22270, 20391, 30780, 39556, 43208, 32393, 22064, 24664, 21691, 15999, 18051, 22338, 25707, 32577, 34702, 26216, 25995, 19555, 21302, 25697, 32626, 42901, 43101, 38379, 33955, 44109, 46898, 39561, 46464, 55609, 55542, 49167, 44120, 43516, 45026, 54494, 59959, 59755, 56077, 52947, 53825, 50232, 44484, 43965, 46792, 47435, 34710, 29513, 32778, 30152, 27632, 30663, 43053, 56334, 56692, 53020, 46447, 45705, 49071, 45507, 47271, 53500, 51077, 41544, 31097, 26763, 32537, 44635, 45852]
8049D5852M448J251QN677o731r321m313K737K447J83R051Q23K888j991j584K777
8033E4202n8n56M679r278l382M525j436m886l014k802l421l891L024Q962R363
8018E2031n036J62m618K071J084J880J647L430M011O812m441M718N0n361P40J430
8002F0610j0850L69M764K375k576l344q15M632K42N602J0481j882P107R641l81
7987H5975m327r362j2856n392M73Q226L416l550N188M69J181k624L46k914M215
7972F8464k224M922j197m712J4273l409n547N329N521p31J378j699l003K113K913
7957H2391j393p959l650J370l591n700O25J0051l280p247O34J949l599k199N503
7942F3905o862J0765P741k371O59q721L842Q681l898m66m884j5894m262j0684
$$ y = [45852, 50300, 51551, 51559, 57236, 50505, 41184, 36871, 39608, 42055, 42238, 51289, 52112, 55000, 53009, 51425, 54202, 54144, 53588, 58267, 48989, 45607, 50132, 48696, 43810, 40796, 37994, 34573, 30682, 33706, 42668, 52031, 46995, 47157, 42539, 44610, 45694, 47574, 49221, 52651, 56662, 63474, 59033, 63751, 63801, 58440, 59180, 60610, 49760, 50129, 54893, 57268, 54692, 51348, 50533, 55165, 55407, 61009, 71490, 69608, 76715, 86356, 85975, 81648, 72286, 59430, 54038, 54511, 62737, 66153, 62603, 67791, 68260, 69441, 66817, 67163, 64249, 68464, 66240, 71162, 69965, 65253, 79526, 76117, 70570, 75899, 81420, 80689, 82067, 80368, 77365, 79478, 82391, 80998, 73039, 69389, 70759, 67168, 61468, 62093, 72144, 68864, 61617, 62251, 64200, 60601, 58402, 63905, 57043, 67808, 75549, 73178, 73837, 65116, 68958, 77639, 73741, 73275, 68391, 52497, 48235, 37551]
7928C7551P255R851K022l284k934m197r688n497O123n3M518k56M559O306j567
7913E0709j361l559L943M525M201n690o564N24N279R24m036K728j12l782j323
7898D6406n353j0497q897K434J1361M191L423m659Q37J0837L818l161q238q765
7884C3737l683J0L99j256K307j0662M041J0720n579J357j156q13P480N018P13
7869D2633r897j5976L587M043P339o54Q60O82p502j1041m907O281j621j324J164
7854A3667o70o165L291K864L129k435p022l767M05k481N411m999L647r472L199
7839a398O492l42m247j838N668R777K052q50k503k738m25M64J455P284J309j101
7823A9059j2871q382L299k592K53J1524J3818O568r875m722K9m230O628L495q580
$$ y = [37551, 44806, 54657, 56679, 53395, 50461, 46264, 36576, 31079, 37202, 37149, 41667, 41411, 45970, 52276, 50709, 49348, 45789, 49732, 54257, 58458, 52768, 46204, 46728, 52007, 52931, 48895, 51623, 51511, 47729, 46406, 41053, 30556, 21659, 24093, 35454, 39645, 43068, 38409, 39246, 50083, 53901, 50740, 42502, 33737, 30054, 30064, 30463, 29207, 31514, 20852, 24893, 35613, 30034, 31391, 30235, 29422, 36902, 41920, 42633, 32736, 16760, 20347, 24390, 31729, 31075, 31935, 32617, 25115, 14074, 9167, 15448, 13827, 12503, 13667, 12997, 6832, 10123, 12987, 16116, 13681, 6659, 2892, 3297, 816, 6227, 1228, 4875, -4597, -1398, 5094, 4752, 505, -1333, 4335, 14112, 16164, 15314, 12811, 10073, 9648, 10112, 11567, 18851, 20160, 19059, 6188, -2194, 1105, -1487, -1234, 10290, 24108, 30676, 20801, 16079, 16108, 11878, 18506, 22001, 13421]
7808A3421j932K85J383K536N610k015n536o516N21M51l231K017m501l632K746
7793A607K722R047l279p784j916m847N372L025M420R550j997q555j486O518Q057
7778B0454m301j0704L302J2094K815q089q962k497l526L650m925K690l207n448
7764f654J1892J0631P39m440q903k009J12j0558L094J2387Q215p395l230j441
7750B440n411M049R268K389q898j0962l417O073l512j13J2254K735J155L101m778
7735F373M89k620L319r9n539m694k726M469l110l367J917P883N157l005j048j03
7719C296M232L94L100M430q697p553k336K514p640j898k254P633J0908j642K845
7704G332L017q372l418Q060Q999J296p515R98R301l230j0047o534J064Q244j076
$$ y = [13421, 11489, 11774, 13157, 15693, 21303, 19288, 13752, 7236, 7757, 8208, 4977, 6994, 2493, -1139, 1607, 4329, 13376, 10097, 2313, 397, -4450, 922, 3947, 8367, 17917, 15920, 7365, 5879, 12397, 20454, 16153, 5449, 8751, 20845, 23660, 15571, 6609, 4112, 586, 4236, -689, 2001, -1206, -6654, 5238, 15869, 16608, 12168, 3265, 1256, 1368, -9190, -6096, 6291, 14506, 7111, 3881, 2440, -2971, 1078, 10346, 12735, 3837, -7125, -10542, -4469, -7981, -8094, 4160, 6895, 8050, 11151, 6373, 6862, 4242, 7561, 7462, 1923, -2771, -5497, -1028, -4138, -7505, -5588, 2295, 7452, 4447, 3399, 3296, 7528, 7922, 11022, 15452, 6755, -798, -3134, -620, -8260, -10158, -12412, -4779, 6129, 4487, 7332, 10349, 1977, -1441, 6619, 15618, 16914, 9399, 10397, 19698, 16468, 6421, -113, 951, 9195, 8119]
7689H119P24j1142K334k848K730L824Q859K156j3562o994q26J928J0102O714j2773
7674f55m72p08N320O38Q885P596n89p764j2482m612o776j092K137O067P374R737
7658A2604r558J10M445L886J389q372j755o429J942m221j0467N78N875N338M532
7643a03n06P136m560j617p353k690K81j834Q914J2049r551j694J232k889L974
7628G89m849l323M154J1218L527M575J172p451M27p174l175p263N291m938p757
7613a4777J29k310k633o85M372R432P898N736J423j235j0761o54L431K33l530
7598c931J0299M326K542O526K500p153j5041n024n3J1440Q308o523j1207L759
7584G68L006m651j687L063J5382m2m827r201q498M51O073o554o171K256J573J5702
$$ y = [8119, 8843, -2299, 35, -2813, -83, 3741, 12600, 14756, 1194, -5800, -6626, -4698, 5404, 12118, -655, -1127, -1835, 3485, 4123, 13008, 20604, 20015, 12251, -231, -4843, -11619, -12711, -10574, -4507, 2867, 12604, 3046, 3156, 7601, 11487, 12876, 4504, 2749, -3680, -1738, -5959, -16426, -15848, -9973, -4635, -103, -609, 6527, 1967, 350, -7003, -9693, -9412, -11246, -2332, 9717, 166, -1528, -296, -3185, 789, -4060, -7383, -3229, 7989, 11516, 16091, 17263, 9812, 10239, 3065, -110, -7373, -2082, -7020, -14777, -14648, -16958, -19591, -20276, -15904, -6472, 1426, 7162, 8585, 7350, -3411, -4065, -634, -401, -3931, 6368, 10694, 13236, 19762, 22262, 15109, 68, -4956, -5009, 6431, 14739, 8216, -2991, 768, 3774, -877, -2564, 499, 15881, 15839, 11012, 1811, -6687, -6236, -163, -6717, -12888, -10632, -9059, 6643]
7568F643Q604p570k640p883n267j430K723J1821J1142k40k640J754k750n108j189
7553E970N400k548j866l78K104n158J732N483n062m989J0502M451j1546l375K014
7538B734k193k427L16J905o853K498P312o513q244P566K741k026M790j3166l221
7523a4781J024o232l237l150R229J2194R648m997m794j0152j0864L696P438O413
7509h565N329m746r243k221J3332O929M587m326q862m44N747p441n013O676J794
7494f467q935o467J1070O455q36J1544l942j128n188j2024L460J366j424P303
7480e213Q291P125J97j5142n741o301J086K148K345L05L234L407J004M219M061
7465E025j0195m253l16q464O565O736l642l462L331l777P57j721k13k371L317
$$ y = [6643, 15247, 7677, 5037, -2846, -8113, -9543, -6820, 5001, 16143, 15903, 13263, 15017, 12267, 7159, 5970, 11370, 8822, 6956, 6578, 8682, 3524, 5256, 10739, 5677, 688, 11190, 15641, 4095, 720, 2734, 541, -1886, -1570, 335, -6518, -4020, 3292, -3221, -11465, -3899, -1158, -3184, 1606, -11560, -14781, -13757, -19989, -23226, -26376, -17147, -4953, 4695, -302, -5096, -15248, -26112, -22416, -14978, -8565, -3236, -7982, -17225, -19446, -6114, 815, 5402, 1076, -7786, -8230, -2483, -9924, -14937, -8261, -6467, -15402, -21869, -10799, -4344, -5180, 6364, 2422, 1294, -3894, -15918, -12458, -11092, -12516, -5213, 3078, 10203, 10400, -4742, -10483, -16784, -15698, -13550, -11205, -10900, -7666, -4259, -3255, 964, 5025, -5170, -9423, -9739, -18203, -11638, -4902, -8544, -12006, -8675, -12452, -11695, -13416, -13629, -16000, -12683]
7450a2683n111q106M898J465J1135R019K784n60n35r136m721J0178L516n173j4477
7435a7507l09P412M98r679l962J1589J5988L267m724L584J955l10k487k877k326
7420A12l246n860q85R15N965L003M902l60K381M448n350m290j53k089j232J159
7404e80p775m197P022O891J696N06l702J7J491O688r997r337q560j718J823l10
7388b0042j913J089R60q6o395M321R062L208o95j908j1780j939m584M385M812
7373b1505K369L199J1181q080J776O987q054j2468O597K874j57N411M138K30q864
7358a4366j07K400l981p868J7896J8457K83j6371j908m383P1M180j613K593M118
7343e99M56k851K693l770L694j827K482R25l519l678k459n77m04K00O970O640
$$ y = [-12683, -17794, -25900, -21002, -19537, -8402, 617, 3401, 2841, 2306, -6830, -11551, -1373, 2143, -3030, -17507, -17816, -10404, -9906, -19585, -23547, -11958, 4030, 7297, 2573, 6157, 8112, 7802, 5315, 2438, 112, -3134, -8994, -9879, -8964, -2999, 4, 4906, 4546, 6927, 11375, 6025, 1735, 1582, -507, -1739, -580, -8355, -12552, -5530, 1361, 3057, 3563, -139, -122, 1369, 8057, -1940, -11277, -19837, -21555, -19732, -20042, -21955, -20866, -19906, -19992, -26387, -22066, -13004, -9796, -10491, -12399, -24179, -26118, -30702, -26317, -21505, -19136, -15937, -4756, -12836, -11060, -4073, -12127, -24595, -17998, -15124, -15281, -9870, -5732, -5502, -14366, -14473, -12073, -16054, -23922, -6026, 12431, 12714, -3657, -5565, -9948, -9877, -5697, -7310, -4717, -599, -143, -2994, -301, -4071, -377, -2204, 278, 1203, -2316, -5994, -8453, -9030, -9434, -9234, -2264, 4376]
7327D376o574n520O665N168k905o359m262n647n41Q750j890r397J862j9n587M242
7311a7638j68k190K218l085O427J7436M246l001o013k272O794N093R61M645M69
7296A3922k734o152o063n742k376R217k159J837q41J080J373n199P40k638N815
7281H0k140m712o489Q396J564R522J305m229o324r528j0764j160N762J0334o863
7266a5246N673j0408j623N532P812L013L039J394n666L506k901j0451O156n658
7252a5828O014Q090r870j5323J2470J6833J715K482M715K99k185J0385k076j495
7238A6226o966j4221k356N139o66l018L988k871m161j368n861m813m690J1101
7224a4537L064p182L85O626J114N752r724k994J5252K610l506M422m217j977k31
$$ y = [4376, -2198, -7718, -1053, 4115, 1210, -5149, -9411, -15058, -15599, -6849, -8739, -18136, -16274, -16293, -21880, -17638, -17806, -19996, -17778, -20863, -14436, 3000, 7246, 4245, -1768, -4040, 2754, 7847, 8808, 13453, 13922, 11188, 5036, -1027, -6769, -9145, 72, -2087, -250, -1091, -11, 1362, -3837, -3097, -5735, 80, -2060, -6772, -13261, -4865, -3301, 6221, 7526, 3297, -3027, -12555, -23319, -24479, -18717, -8383, -15246, -9573, -19981, -21604, -16072, -8260, -5247, -2208, -814, -6480, -2974, -5875, -16326, -10170, -15828, -9814, -1724, -11594, -26917, -14447, 2386, 4101, 6583, 11298, 11597, 9412, 19797, 17721, 16226, 9260, -4961, -7317, -2178, -2844, -5862, -1874, -4745, -8906, -10274, -16135, -20948, -25638, -14537, -11473, -18655, -18270, -11644, -10530, -4778, -14502, -17496, -2244, 366, -3140, 1282, -2935, -4912, -5143]
7209e143R867L636l419n414P88N671J656K434R312r710j3880n863Q034Q669k015
7194D623j4830L640l296j0950M684J404n354l873J748K531J628P990k321m804
7180a7180J0205Q068n997r774n690K982O588J2504n364l695m07N466P099j5766
7166a0961r956M827K142k015j900L050Q136j1075l458M931K007L727M269m197
7152a0473M858J3263l196O746K833n787j0146q759J52M476Q44q163m898L620R851
7137d779p0m073K051P517m490m559j807L467J061K382k92M763j982r17m801J314
7121e215R356p127m046N527N917q107q060k465O718O972M561J330Q067l013k348
7106H067K889J70K017l272j1255n880j649J42k527J954J0248O251j6254m301O957
$$ y = [-5143, 4724, 8360, 4941, -473, 315, 5986, 7642, 10076, 19388, 9678, -4202, -10065, -2031, 6638, 4623, -10207, -6567, -9863, -20813, -16129, -14725, -20079, -23952, -22204, -19673, -18045, -10055, -12376, -17180, -6975, 1093, -4904, -14678, -20368, -17386, -10798, 1706, -3658, -7353, -7760, -2294, 4805, -10961, -20917, -16090, -13948, -15963, -17863, -14813, -6677, -17752, -21210, -16279, -14272, -10545, -6276, -10473, -5615, 7648, 4452, 11198, 14031, 8244, -1902, -10661, -10509, -6033, -5189, -13352, -18250, -14630, -4779, -4849, -8922, -6871, 646, -3844, -8403, -10210, -6743, -5682, -3300, -3592, 1171, -811, -1728, -6529, -5215, 4141, -2986, -7032, -1505, 4412, -3695, -11755, -14220, -7502, -530, 4031, 5361, 13428, 10415, 8067, 10956, 11126, 13143, 9871, -1384, -7264, -8913, -8771, -11298, -9344, 904, 7155, -9099, -13400, -6443]
7091f443M847K692l923j4596l383J495k453r509M791P343J2856l337o211J549
7077a4282N47j401K638J3338n89k143J849m224M652n013l706O244m926j649L799
7062d866P70O807J988l335l340l090j890q223N8j254P50R481l115n631R04m041
7046a8027P311k077k636L904M291O004K600M260M063k616j0663j706j331l779
7032a0402k997L031l783R212Q170l140L848L62J718K357l237m671R56k314j972
7017b862J281K699j986R76p732o420m070L058J174K519O393m236O12r430K748
7002a5276M581P878J733M418J796k650J061m694r078j587l502M31Q24N400j1328
6987a9993m352O616J333N43l297J0318K548p860J234R162M255p158n281j5067
$$ y = [-6443, -1596, 1096, -2827, -17423, -20806, -19311, -21764, -31273, -26482, -19139, -6283, -9620, -15831, -14282, -13735, -15136, -12498, 840, 251, -1892, -43, -4267, 385, -4628, -8334, -2090, -7016, -8665, -4866, -4096, 2711, 4699, 1364, -1976, -5066, -6956, -15179, -15121, -16375, -15625, -6144, -9259, -14890, -13986, -18027, -10716, -12793, -15429, -11525, -7234, -1230, 1370, 5630, 9693, 7077, -3586, -5292, -6623, -10402, -13399, -10368, -14151, -4939, 3231, 91, 3939, 4301, 6019, 8376, 5139, 468, 1424, -890, -2862, -1581, 1118, -868, 108, -7624, -14044, -18114, -15056, -13882, -11363, -4970, -9206, -8594, -18024, -15276, -10695, -2817, -1084, 3334, 5130, 2480, 3541, -1153, -10231, -11818, -15320, -14889, -14065, -8665, -19993, -24345, -17729, -16396, -15853, -19150, -8832, -6284, -14144, -12910, -3748, 507, -6651, -11932, -26999]
6973b6999l408O319J5966J0794M595m852k972J535o731o119O50L935q240j734
6959a7261P992o84j0349j00P406N413L405P7L827n450k890p458J627L219J7096
6944E870K826J7n188q773j071M587j887O900l64k141L479L578k844m75J866j454
6928D926m327l540l984k277R356J0846K404L277r246q854K97P233o68j6279j778
6913a2614J0674j757j0615q820L383L732J0128M125M192L100K720J691m797j1692
6899f550j546j530l078O375k970n151n452K232J1632P298n041P836J797n179n591
6884d918n306R95J0968k34j194K169j740p631L545k160O03n694j650L13L625R459
6868A150k561m170q137l353N645J802N759K311L516k85k449q902k398N337K471
$$ y = [-26999, -30407, -24088, -8122, 2672, 7267, 2415, -557, 978, -5753, -11872, -11222, -7287, -15527, -17261, -9269, -9953, -20302, -20402, -12996, -7583, -4178, -4101, -274, -5724, -8614, -16072, -14445, -11226, 5870, 8696, 8713, 3525, -5248, -6319, -1732, -3619, 3281, 2917, 776, 4255, 7833, 4989, 4514, 6380, 4926, 599, -2941, -6925, -9202, 154, 11000, 13404, 16681, 7435, -1419, -1122, 6111, 5443, -10836, -12614, -1940, -3697, -14312, -23132, -19749, -16017, -5889, -1764, 2428, 5528, 8248, 9939, 5142, -6550, -8096, -9626, -12704, -6329, -9299, -14450, -19902, -17670, -6038, 1260, -3781, 4055, 5852, 673, -4918, -10224, -9229, 1739, 1505, 311, 2480, 740, -6891, -3346, -5506, -4903, -10597, -12247, -11934, -8309, 1150, -1411, -5581, -13718, -17071, -11426, -9624, -3865, -1554, 1962, 1677, -772, -9674, -12072, -6735, -4264]
6853d264K288J871P872M416o013o592k070O321n94r730l526j814K837M888n133
6838i243P99p77K564l760o990L043J2915M535n352J867Q530n728k753R431m355
6823D726j2525j654J877L038L928k983k871O867M40m619k003M617O25k242P57
$$ y = [-4264, -1976, -105, 7767, 12183, 6170, -422, -2492, 3829, 3235, -6495, -10021, -11835, -8998, -4110, -9243, -8444, -9221, -6657, -10417, -17407, -14364, -1449, 3086, -2266, -399, 8131, 2403, -350, 9081, 4726, -7799, -9453, -7576, -4538, -610, -3593, -6464, 403, 843, -3776, -5779, -1162, -537, -2779, -2022]
$$ [...]
##END NTUPLES=NMR SPECTRUM
##END=
