##TITLE=Analysis number 326481
Compound Code cc 13205
Project Code adrs
Chemist Name vilnius
##JCAMPDX= 6.0         $$ Bruker NMR JCAMP-DX V2.0
##DATA TYPE= NMR SPECTRUM
##DATA CLASS= NTUPLES
##ORIGIN= Bruker BioSpin GmbH
##OWNER= nmr
$$ XWIN-NMR		Version 3.5
$$ Thu Feb  8 08:43:03 2007 GMT Standard Time (UT+0h)  MAYBRIDGE\nmr@NMR_250MHZ
##.OBSERVE FREQUENCY= 250.131544655141
##.OBSERVE NUCLEUS= ^1H
##.ACQUISITION MODE= SIMULTANEOUS (DQD)
##.ACQUISITION SCHEME= undefined
##.AVERAGES= 16
##.DIGITISER RES= 18
##SPECTROMETER/DATA SYSTEM= dpx250
##.PULSE SEQUENCE= zg30
##.SOLVENT NAME= CDCl3
##.SHIFT REFERENCE= (INTERNAL, CDCl3, 0, 16.522)
##AUDIT TRAIL= $$ (NUMBER, WHEN, WHO, WHERE, WHAT)
$$ ##TITLE= Audit trail, XWIN-NMR		Version 3.5
$$ ##JCAMPDX= 5.01
$$ ##ORIGIN= Bruker BioSpin GmbH
$$ ##OWNER= nmr
$$ C:\u/data/dgb/nmr/ADRS/450/pdata/1/auditp.txt
$$ ##AUDIT TRAIL=  $$ (NUMBER, WHEN, WHO, WHERE, WHAT)
(   1,<2007-02-08 08:42:18.64 +000>,<MAYBRIDGE\nmr>,<NMR_250MHZ>,
      <created by zg, POWCHK disabled, PULCHK disabled
       configuration hash MD5:
       49 4B E0 1D 92 C2 6B 37 9F E6 65 BC 52 41 86 1D
       data hash MD5: 64K
       88 8E AE 70 F4 99 BD E2 77 61 9B 24 1B 19 32 84>)
(   2,<2007-02-08 08:42:37.33 +000>,<MAYBRIDGE\nmr>,<NMR_250MHZ>,
      <Start of raw data processing
       ef LB = 0.3 FT_mod = 6 PKNL = 1 SI = 32K 
       data hash MD5: 32K
       2F 04 EB FF 67 45 8A DE 8B 85 40 A1 97 BD 6A 6A>)
(   3,<2007-02-08 08:42:40.92 +000>,<MAYBRIDGE\nmr>,<NMR_250MHZ>,
      <apk 
       data hash MD5: 32K
       13 62 0D F1 B7 C5 59 87 7D 9C EB 32 BA CC C1 5F>)
(   4,<2007-02-08 08:42:42.25 +000>,<MAYBRIDGE\nmr>,<NMR_250MHZ>,
      <abs ABSG = 5 
       data hash MD5: 32K
       50 89 A9 C3 16 97 65 73 F4 78 4F 5C D0 11 AC 2F>)
$$ ##END=
$$ 
$$ hash MD5
$$ 8D 50 A9 BE 36 91 9E DE BB 77 B9 56 DE 1A 66 42
##$RELAX= 
##$RELAX= 
##$RELAX= 
##$RELAX= 
##$RELAX= 
##$RELAX= 
##$RELAX= 
$$ Bruker specific parameters
$$ --------------------------
##$DU= <C:\u>
##$EXPNO= 450
##$NAME= <ADRS>
##$PROCNO= 1
##$TYPE= <nmr>
##$USER= <dgb>
##$AMP= (0..31)
100 100 100 100 100 100 100 100 100 100 100 100 100 100 100 100 100 100 
100 100 100 100 100 100 100 100 100 100 100 100 100 100 
##$AQSEQ= 0
##$AQ_mod= 3
##$AUNM= <au_zg>
##$AUTOPOS= <31 >
##$BF1= 250.13
##$BF2= 250.13
##$BF3= 250.13
##$BF4= 250.13
##$BF5= 500.13
##$BF6= 500.13
##$BF7= 500.13
##$BF8= 500.13
##$BYTORDA= 1
##$CFDGTYP= 0
##$CFRGTYP= 5
##$CHEMSTR= <none>
##$CNST= (0..31)
1 1 145 1 1 1 1 1 1 1 1 1 1 1 1 1 1 1 1 1 1 1 1 1 1 1 1 1 1 1 1 1 
##$CPDPRG= <>
##$CPDPRG1= <>
##$CPDPRG2= <>
##$CPDPRG3= <>
##$CPDPRG4= <mlev>
##$CPDPRG5= <mlev>
##$CPDPRG6= <mlev>
##$CPDPRG7= <mlev>
##$CPDPRG8= <mlev>
##$CPDPRGB= <>
##$CPDPRGT= <>
##$D= (0..31)
0 1 0 0 0 0 0 0 0 0.06 0 0 0 0 0 0 0.0002 0 0 0 0 0 0 0 0 0 0 0 0 0 0 
0 
##$DATE= 1170924136
##$DBL= (0..7)
120 120 120 120 120 120 120 120 
##$DBP= (0..7)
150 150 150 150 150 150 150 150 
##$DBP07= 0
##$DBPNAM0= <>
##$DBPNAM1= <>
##$DBPNAM2= <>
$$ [...]
##$SUBNAM7= <"">
##$SUBNAM8= <"">
##$SUBNAM9= <"">
##$SW= 20.6930455092707
##$SWIBOX= (0..15)
0 0 3 0 0 0 0 0 0 0 0 0 0 0 0 0 
##$SW_h= 5175.983436853
##$TD= 65536
##$TD0= 1
##$TE= 294.16
##$TE2= 300
##$TE3= 300
##$TEG= 300
##$TL= (0..7)
0 120 120 120 120 120 120 120 
##$TP= (0..7)
150 150 150 150 150 150 150 150 
##$TP07= 0
##$TPNAME0= <>
##$TPNAME1= <>
##$TPNAME2= <>
##$TPNAME3= <>
##$TPNAME4= <>
##$TPNAME5= <>
##$TPNAME6= <>
##$TPNAME7= <>
##$TPOAL= (0..7)
0.5 0.5 0.5 0.5 0.5 0.5 0.5 0.5 
##$TPOFFS= (0..7)
0 0 0 0 0 0 0 0 
##$TUNHIN= 0
##$TUNHOUT= 0
##$TUNXOUT= 0
##$USERA1= <user>
##$USERA2= <user>
##$USERA3= <user>
##$USERA4= <user>
##$USERA5= <user>
##$V9= 5
##$VALIST= <valist>
##$VCLIST= <CCCCCCCCCCCCCCC>
##$VD= 0
##$VDLIST= <DDDDDDDDDDDDDDD>
##$VPLIST= <PPPPPPPPPPPPPPP>
##$VTLIST= <TTTTTTTTTTTTTTT>
##$WBST= 1024
##$WBSW= 4
##$XGAIN= (0..3)
0 0 0 0 
##$XL= 0
##$YL= 0
##$YMAX_a= 459743
##$YMIN_a= -551684
##$ZGOPTNS= <>
##$ZL1= 120
##$ZL2= 120
##$ZL3= 120
##$ZL4= 120
##$ABSF1= 16.522
##$ABSF2= -4.171173
##$ABSG= 5
##$ABSL= 3
##$ALPHA= 0
##$AQORDER= 0
##$ASSFAC= 0
##$ASSFACI= 0
##$ASSFACX= 0
##$ASSWID= 0
##$AUNMP= <proc_1d>
##$AZFE= 0.1
##$AZFW= 0.1
##$BCFW= 0
##$BC_mod= 0
##$BYTORDP= 0
##$COROFFS= 0
##$CY= 12.5
##$DATMOD= 1
##$DC= 0
##$DFILT= <>
##$DTYPP= 0
##$F1P= 14.0000005364418
##$F2P= -0.99999901652339
##$FCOR= 0.5
##$FTSIZE= 32768
##$FT_mod= 6
##$GAMMA= 0
##$GB= 0
##$INTBC= 1
##$INTSCL= 1
##$ISEN= 128
##$LB= 0.3
##$LEV0= 0
##$LPBIN= 0
##$MAXI= 10000
##$MC2= 0
##$MEAN= 0
##$ME_mod= 0
##$MI= 0
##$NCOEF= 0
##$NC_proc= -3
##$NLEV= 6
##$NOISF1= 0
##$NOISF2= 0
##$NSP= 0
##$NTH_PI= 0
##$NZP= 0
##$OFFSET= 16.522
##$PC= 1
##$PHC0= 231.5275
##$PHC1= 8.400287
##$PH_mod= 1
##$PKNL= yes
##$PPARMOD= 0
##$PSCAL= 4
##$PSIGN= 0
##$REVERSE= no
##$SF= 250.13
##$SI= 32768
##$SIGF1= 0
##$SIGF2= 0
##$SINO= 400
##$SIOLD= 32768
##$SREGLST= <1H.CDCl3>
##$SSB= 0
##$STSI= 32768
##$STSR= 0
##$SW_p= 5175.98343685301
##$SYMM= 0
##$S_DEV= 0
##$TDeff= 65536
##$TDoff= 0
##$TI= <Analysis number 999999
Compound Code 99
Book Reference 9
Project Code 9>
##$TILT= no
##$TM1= 0
##$TM2= 0
##$TOPLEV= 0
##$USERP1= <user>
##$USERP2= <user>
##$USERP3= <user>
##$USERP4= <user>
##$USERP5= <user>
##$WDW= 1
##$XDIM= 32768
##$YMAX_p= 474386459
##$YMIN_p= -111531
$$ End of Bruker specific parameters
$$ ---------------------------------
##NTUPLES= NMR SPECTRUM
##VAR_NAME=  FREQUENCY,     SPECTRUM/REAL,   SPECTRUM/IMAG
##SYMBOL=    X,             R,               I
##VAR_TYPE=  INDEPENDENT,   DEPENDENT,       DEPENDENT
##VAR_FORM=  AFFN,          ASDF,            ASDF
##VAR_DIM=   32768,         32768,           32768
##UNITS=     HZ,            ARBITRARY UNITS, ARBITRARY UNITS
##FACTOR=    0.157963299565203, 1,           1
##FIRST=     4132.6476996994, 0,             0
##LAST=      -1043.33573715361, 0,           0
##MIN=       -1043.33573715361, -111531,     0
##MAX=       4132.6476996994, 474386459,     0
$$ Real data points
##PAGE= N=1
##DATA TABLE= (X++(R..R)), XYDATA
$$ [...]
$$ plain form
19443 -3467 -762 -17394 -27272 -50281 -68246 -36316 -34628 -16438 7753 14136 4456 -4097 12266
19430 12266 20264 23802 11427 14777 19500 5615 -34623 -34570 -11435 -6099 16409 2138 19506
19417 19506 9032 2474 -3853 -27899 -40129 -25503 -16334 -14470 -21094 -17826 13023 53357 31645
19404 31645 -27697 -43088 -18396 -18618 -10840 -4794 -5910 -14468 4975 24609 14557 33497 46190
19391 46190 43997 57293 28927 28881 43636 52932 25352 23789 -131 18556 38619 51391 32100
19378 32100 33515 38935 17162 10004 9643 4229 15605 27200 4244 5225 37268 46736 27551
19365 27551 23040 7741 -3140 10918 23525 30907 54760 69622 48820 21808 33235 3835
19353 3835 -31919 -18833 17280 25232 12210 -12808 -27726 -21312 24401 31508 5973 4433 9697
$$ packed form
19443c467K705j6632r878k3009j7965L1930J688J8190K4191O383r680q553J6363
19430A2266P998L538j2375L350M723j3885m0238N3K3135N336K2508j4271J7368
19417A9506j0474o558o327k4046j2230J4626R169J864o624L268L0849M0334k1712
19404C1645n9342j5391K4692k22P778O046j116q558J9443J9634j0052J8940J2693
19391D6190k193J3296k8366m6J4755R296k7580j563k3920J8687K0063J2772j9291
19378C2100J415N420k1773p158l61n414J1376J1595k2956R81L2043R468j9185
19365B7551m511j5299j0881J4058J2607P382K3853J4862k0802k7012J1427k9400
19353C835l5754J3086L6113P952j3022k5018j4918O414M5713P107k5535j540N264
$$ plain form
19340 9697 41760 54985 40437 24697 15515 -6139 3216 14551 27360 24574 25132 25991 -390
19327 -390 15076 32060 33898 2669 17953 4259 -11746 -18353 -28659 -60971 -54596 -54625 -57767
19314 -57767 -35896 -31710 -71209 -65515 -30447 -17134 -24062 -34885 -32092 -40355 -30307 -25451 -20566
19301 -20566 -31906 -35278 -27427 -28270 -15609 -3906 3165 -2263 -1938 -302 7570 21623 43657 51822
19287 51822 31049 4311 2186 -21300 -52731 -37854 -26793 -596 22676 3227 8009 8291
19275 8291 -9411 -3234 -1403 -7159 -4832 8162 34233 71080 60646 25871 3014 35947 71130
19262 71130 45152 -2501 11817 33239 46907 58637 46295 48658 64927 63060 41046 1226
19250 1226 -7193 8364 25665 32629 43001 47128 27453 3987 6660 7916 1945 22606 46222
$$ packed form
19340I697L2063J3225j4548j5740r182k1654R355J1335J2809k786N58Q59k6381
19327c90J5466J6984J838l1229J5284j3694j6005o607j0306l2312O375k9l142
19314e7767K1871M186l9499N694L5068J3313o928j0823K793q263J0048M856M885
19301b0566j1340l372P851q43J2661J1703P071n428L25J636P872J4053K2034Q165
19287E1822k0773k6738k125k3486l1431J4877J1061K6197K3272j9449M782K82
19275H291j7702O177J831n756K327J2994K6071L6847j0434l4775k2857L2933L5183
19262G1130k5978m7653J4318K1422J3668J1730j2342K363J6269j867k2014l9820
19250A226q419J5557J7301O964J0372M127j9675k3466K673J256n971K0661K3616
$$ plain form
19237 46222 44278 16384 9122 18519 29542 12471 407 -19041 -18855 -14680 -9751 -18695 -19720
19224 -19720 -18092 11516 18703 31177 -3654 -6585 7029 2533 -7736 -14922 -35123 -20243 14391
19211 14391 15023 14311 19954 1295 7344 16738 15650 23918 -6252 -21419 -29178 -23035 -6786 9513
19197 9513 9466 12749 -5939 -30177 -45494 5573 46045 58843 28548 28298 6666 7557 16658 28822
19183 28822 15083 -8768 -4945 16883 15656 411 17251 27014 30704 37575 15732 1565 4515
19170 4515 11283 54847 55042 56607 84455 106324 87771 74636 67570 74454 97849 147853 208378
19157 208378 336072 452537 535849 544450 444652 352388 283760 240998 222719 251428 319582
19146 319582 406592 439381 475893 518354 591946 602614 609434 550662 398302 299300 249441
$$ packed form
19237D6222j944k7894p262R397J1023j7071j2064j9448J86M175M929q944j025
19224a9720J628K9608P187J2474l4831k931J3614m496j0269p186k0201J4880L4634
19211A4391O32p12N643j8659O049R394j088Q268l0170j5167p759O143J6249J6299
19197I513m7L283j8688k4238j5317N1067M0472J2798l0295k50k1632Q91R101J2164
19183B8822j3739k3851L823K1828j227j5245J6840R763L690O871k1843j4167K950
19170D515O768M3564J95J565K7848K1869j8553j3135p066O884K3395N0004O0525
19157B08378J27694J16465Q3312Q601r9798r2264o8628m2762j8279K8709O8154
19146C19582Q7010L2789L6512M2461P3592J0668O820n8772j52360r9002m9859
$$ plain form
19135 249441 225203 229928 255335 322771 342878 263718 211101 168711 121096 83538 75309 85486
19123 85486 74434 37170 20715 7780 3176 -15557 -9409 -3769 13473 15399 28421 28950 30666
19110 30666 30931 32933 29463 31052 36529 14946 8832 -14117 -12321 -18417 -29846 3024 36572
19097 36572 59754 98159 169178 222666 285682 320589 310463 240771 186039 133592 75602 86913
19085 86913 106788 118980 98872 96879 177131 233655 318102 364346 342470 252294 186734 135192
19073 135192 67962 66216 106172 97547 71956 49874 82995 107365 71971 57558 54360 57293
19061 57293 53295 67253 43944 33428 28036 12703 -6472 -10281 -11320 -11056 4573 -672 385
19048 385 -20648 -39284 -21515 10022 56184 91693 85550 65225 54079 25899 5339 9984
$$ packed form
19135B49441k4238M725K5407O7436K0107p9160n2617m2390m7615l7558q229J0177
19123H5486j1052l7264j6455j2935m604j8733O148N640J7242J926J3022N29J716
19110C0666K65K002l470J589N477k1583o114k2949J796o096j1429L2870L3548
19097C6572K3182L8405P1019N3488O3016L4907j0126o9692n4732n2447n7990J1311
19085H6913J9875J2192k0108j993Q0252N6524Q4447M6244k1876r0176o5560n1542
19073A35192o7230j746L9956q625k5591k2082L3121K4370l5394j4413l198K933
19061E7293l998J3958k3309j0516n392j5333j9175l809j039K64J5629n245J057
19048C85k1033j8636J7769L1537M6162L5509o143k0325j1146k8180k0560M645
$$ plain form
19036 9984 16268 34343 46634 17817 -398 11957 27798 68483 93704 118717 123379 94502
19024 94502 46186 16637 -13751 -17864 14216 20236 26765 -2312 -13722 -17905 -14404 15361 574
19011 574 -3486 -12352 -3302 31383 38349 -11696 -60524 -44739 -14350 19898 46689 53585 40898
18998 40898 20813 -2890 -23475 17674 46772 33358 31585 6069 20693 10829 2265 -8318
18986 -8318 1807 62955 60040 24292 22290 -6580 -10977 -13761 -15262 -2338 1870 9339 8205
18973 8205 28091 28419 27958 16501 8970 14086 10790 4999 6922 13530 24035 44475 42103 35511
18959 35511 32161 26091 20105 12751 13945 5971 13335 16515 11870 3535 5985 7516 -16567 -29375
18945 -29375 -20604 -9018 -14065 -17318 -24642 -6652 8280 -20556 -37046 -25901 -14363 -28127
$$ packed form
19036I984O284J8075J2291k8817j8215J2355J5841M0685K5221K5013M662k8877
19024I4502m8316k9549l0388m113L2080O020O529k9077j1410m183L501K9765j4787
19011E74m060q866R050L4685O966n0045m8828J5785L0389L4248K6791O896j2687
18998D0898k0085k3703k0585M1149K9098j3414j773k5516J4624r864q564j0583
18986h318J0125O1148k915l5748k002k8870m397k784j501J2924M208P469j134
18973H205J9886L28m61j1457p531N116l296n791J923O608J0505K0440k372o592
18959C5511l350o070n986p354J194p974P364L180m645q335K450J531k4083j2808
18945b9375Q771J1586n047l253p324J7990J4932k8836j6490J1145J1538j3764
$$ plain form
18933 -28127 -9281 10634 40356 51466 47205 43144 9332 -32050 -44298 -31741 -18780 11497
18921 11497 8202 16029 19509 21903 50057 71262 59531 47574 54233 47673 38308 54799 61717
18908 61717 44798 34914 34399 56121 87265 60162 32173 56873 67088 43614 55127 65801
18896 65801 79271 65958 88046 99132 115592 115169 121005 109951 143212 161826 174352 168486
18884 168486 146142 146763 119267 108392 103117 80546 57831 60177 56549 55580 37987 62110 69072
18871 69072 62820 75564 85741 76544 60077 26343 15297 19559 28397 65181 54782 24295
18859 24295 38906 47850 47152 37194 28410 31350 45509 58402 49079 44974 50343 39181 34195 26262
18845 26262 53464 29786 36129 22977 12619 35811 50601 59999 85483 84350 71416 81071
$$ packed form
18933b8127J8846J9915K9722J1110m261m061l3812m1382j2248J2557J2961L0277
18921A1497l295P827L480K394K8154K1205j1731j1957O659o560r365J6491O918
18908F1717j6919r884n15K1722L1144k7103k7989K4700J0215k3474J1513J0674
18896F5801J3470j3313K2088J1086J6460m23N836j1054L3261J8614J2526n866
18884A68486k2344O21k7496j0875n275k2571k2715K346l628r69j7593K4123O962
18871F9072o252J2744J0177r197j6467l3734j1046M262Q838L6784j0399l0487
18859B4295J4611Q944o98r958q784K940J4159J2893r323m105N369j1162m986p933
18845B6262K7202k3678O343j3152j0358K3192J4790R398K5484j133j2934R655
$$ plain form
18833 81071 89588 73314 87391 116172 100997 128679 135736 132723 103741 102588 77745 43515
18821 43515 48734 59133 74206 87035 74964 71956 41473 33233 52036 70954 75450 84234 85436
18808 85436 68568 83592 85829 104912 121199 116766 109254 107657 136977 178384 134293 111134
18796 111134 127599 134842 117809 94604 112707 145644 170134 211243 208008 233074 268723 296333
18784 296333 306797 312204 296752 256865 214277 168108 129525 97111 118208 122760 113600 93256
18772 93256 96605 109081 133280 179349 253895 406322 486693 377105 267696 161668 85859
18761 85859 64510 62116 56852 23621 14566 10332 21045 4065 4769 5563 11964 4932 3017 22304
18747 22304 19197 50113 27040 29087 59748 61391 72143 97617 95931 73881 77814 85298 98117
$$ packed form
18833H1071Q517j6274J4077K8781j5175K7682P057l013k8982j153k4843l4230
18821D3515N219J0399J5073J2829j2071l008l0483q240J8803J8918M496Q784J202
18808H5436j6868J5024K237J9083J6287m433p512j597K9320M1407m4091k3159
18796A11134J6465P243j7033k3205J8103L2937K4490M1109l235K5066L5649K7610
18784B96333J0464N407j5452l9887m2588m6169l8583l2414K1097M552r160k0344
18772I3256L349J2476K4199M6069P4546J52427Q0371j09588j09409j06028p5809
18761H5859k1349k394n264l3231r055m234J0713j6980P04P94O401p032j915J9287
18747B2304l107L0916k3073K047L0661J643J0752K5474j686k2050L933P484J2819
$$ plain form
18734 98117 130637 166621 195525 202480 189802 177074 166752 146697 135077 143451 140145 133280
18722 133280 151091 159561 191615 210978 210344 249597 254600 240877 220008 205264 173528 165543
18710 165543 167640 178717 181377 173029 164156 180821 212569 225045 204608 223420 236651 237142 284347
18697 284347 295858 312874 324895 324231 343938 366910 372612 382196 397186 446259 473391 490183
18685 490183 512057 511528 569397 624741 650942 687704 740514 820414 893771 1006714 1161344
18674 1161344 1360544 1543767 1691963 1844935 1957820 2027854 2092990 2161113 2270536 2486122
18664 2486122 2826900 3210364 3768202 4564957 5226678 5609706 6088192 6857098 8122416
18655 8122416 10287648 14024298 20203777 28231811 34142875 38808209 46858419 56235611
$$ packed form
18734I8117L2520L5984K8904O955j2678j2728j0322k0055j1620Q374l306o865
18722A33280J7811Q470L2054J9363o34L9253N003j3723k0869j4744l1736p985
18710A65543K097J1077K660q348q873J6665L1748J2476k0437J8812J3231M91M7205
18697B84347J1511J7016J2021o64J9707K2972N702R584J4990M9073K7132J6792
18685D90183K1874n29N7869N5344K6201L6762N2810P9900P3357J12943J54630
18674A161344J99200J83223J48196J52972J12885P0034O5136O8123J09423K15586
18664B486122L40778L83464N57838P96755O61721L83028M78486P68906J265318
18655H122416K165232L736650O179479Q028034N911064M665334Q050210R377192
$$ plain form
18647 56235611 55623623 46446893 37226425 30814534 28035884 29436170 35647120 48853689
18639 48853689 72625842 105186744 125238438 125777712 127409240 138690751 148063228 152346371
18631 152346371 146439307 120417074 88483538 62518650 43715627 31695790 24697440
18624 24697440 20327935 17273582 15263504 14260295 14404246 16047933 19447024 22314948
18616 22314948 20958821 17000910 13218181 10215587 8173519 6889028 5950049 5193072
18608 5193072 4607369 4114728 3768310 3555252 3483303 3435468 3379691 3288477 3179308 3116720
18598 3116720 3133302 3176280 3187631 3247160 3411132 3628953 3900761 4265855 4740139 5250985
18588 5250985 5872844 6829599 8356846 10807208 14799081 21599274 33392100 52015934
$$ packed form
18647E6235611o11988r176730r220468o411891k778650J400286O210950J3206569
18639D8853689K3772153L2560902K0051694N39274J631528J1281511R372477M283143
18631A52346371n907064k6022233l1933536k5964888j8803023j2019837o998350
18624B4697440m369505l054353k010078j003209J43951J643687L399091K867924
18616B2314948j356127l957911l782729l002594k042068j284491r38979p56977
18608E193072n85703m92641l46418k13058p1949m7835n5777r1214j09169o2588
18598C116720J6582M2978J1351N9529J63972K17821K71808L65094M74284N10846
18588E250985O21859R56755J527247K450362L991873O800193J1792826J8623834
$$ plain form
18580 52015934 70148580 70750101 57160015 41986323 29569133 20896145 15754391 12980525
18572 12980525 11824803 11979586 13472670 16874293 23360919 34269296 46846241 49467777
18564 49467777 40807484 29883424 20714421 14090696 9936464 7466407 5951925 4882097
18556 4882097 4111027 3546966 3074907 2696113 2376244 2114762 1949659 1883454 1784034 1661236
18546 1661236 1537386 1464957 1412284 1347413 1259494 1190591 1175152 1163256 1133251 1084635 1041788
18535 1041788 1009314 984930 890209 783434 738806 699998 684215 701330 712985 718574 734512
18524 734512 734360 696995 650205 614213 581494 532352 508223 497123 495023 495753 493157 491300 486653
18511 486653 503732 522434 506283 513190 485468 449509 416417 371149 347563 324203 306493 287736
$$ packed form
18580E2015934J8132646O01521j3590086j5173692j2417190q672988n141754k773866
18572A2980525j155722J54783J493084L401623O486626J0908377J2576945K621536
18564D9467777q660293j0924060r169003o623725m154232k470057j514482j069828
18556D882097p71070n64061m72059l78794l19869k61482j65103o6205r9420j22798
18546A661236j23850p2429n2673o4871q7919o8903j5439j1896l0005m8616m2847
18535A041788l2474k4384r4721j06775m4628l8808j5783J7115J1655N589J5938
18524G34512j52l7365m6790l5992l2719m9142k4129j1100k100P30k596j857m647
18511D86653J7079J8702j6151O907k7722l5959l3092m5268k3586k3360j7710j8757
$$ plain form
18499 287736 261024 230568 213458 198799 226646 242474 253932 218940 185688 170576 137521
18488 137521 121215 80776 41175 70106 70045 47704 82706 107324 87959 96285 135125 157465
18476 157465 164676 161146 117585 121300 110912 84095 75400 105922 110989 114530 136731 135940 112436
18463 112436 114535 102365 118366 110063 116087 160519 184699 176317 152671 134350 130564 122355 92476
18450 92476 89495 121808 146973 142464 98687 83888 80137 76882 88506 69912 59656 66914 81733
18437 81733 76425 91298 98730 112623 106989 106860 92785 55704 25847 -2579 -17439 -23233 5467
18424 5467 37044 70842 75249 63599 47221 61277 53994 52818 36513 3105 -12641 -11493 -19707
18411 -19707 6537 54516 86882 42241 4078 -11206 648 15419 16427 48267 59180 65487
$$ packed form
18499B87736k6712l0456j7110j4659K7847J5828J1458l4992l3252j5112l3055
18488A37521j6306m0439l9601K8931o1k2341L5002K4618j9365Q326L8840K2340
18476A57465P211l530m3561L715j0388k6817q695L0522N067L541K2201p91k3504
18463A12436K099j2170J6001q303O024M4432K4180q382k3646j8321l786q209k9879
18450I2476k981L2313K5165m509m3777j4799l751l255J1624j8594j0256P258J4819
18437H1733n308J4873P432J3893n634j29j4075l7081k9857k8426j4860n794K8700
18424E467L1577L3798M407j1650j6378J4056p283j176j6305l3408j5746J148q214
18411a9707K6244M7979L2366m4641l8163j5284J1854J4771J008L1840J0913O307
$$ plain form
18399 65487 83520 52669 61495 61896 64262 73637 98902 78347 56044 59652 58659 40067 37825
18386 37825 27345 48677 58041 68936 69784 41414 19134 45226 60719 67977 57710 -13928
18374 -13928 -23541 -13459 -5834 12912 2321 -5467 41612 61050 50844 41325 24243 25720 13688
18361 13688 14766 27560 52565 69347 68234 57663 26618 -7603 -19776 5547 15576 -6320
18349 -6320 -10617 50 197 5084 24932 51096 17762 5959 31023 43544 51881 38083 29021
18336 29021 12631 2474 -8097 -6572 3437 32299 57033 74504 81621 34643 1289 9152
18324 9152 -3578 9195 19645 24957 38066 32258 39917 31096 3456 4488 2429 -727 19885
18311 19885 5335 -1834 -26941 -45660 -22462 -50081 -52744 -31726 -15510 -9913 -5301 13762
$$ packed form
18399F5487J8033l0851Q826M01K366R375K5265k0555k2303L608r93j8592k242
18386C7825j0480K1332R364J0895Q48k8370k2280K6092J5493P258j0267p1638
18374a3928r613J0082P625J8746j0591p788M7079J9438j0206r519j7082J477j2032
18361A3688J078J2794K5005J6782j113j0571l1045l4221j2173K5323J0029k1896
18349f320m297J0667J47M887J9848K6164l3334j1803K5064J2521Q337j3798r062
18336B9021j6390j0157j0571J525J0009K8862K4734J7471P117m6978l3354P863
18324I152j2730J2773J0450N312J3109n808P659q821k7640J032k059l156K0612
18311A9885j4550p169k5107j8719K3198k7619k663K1018J6216N597M612J9063
$$ plain form
18299 13762 33674 52740 59615 68566 32872 7412 -195 18826 21817 8343 -6100 -25838
18287 -25838 -15315 11705 -7638 119 5717 30187 28831 22455 42936 56571 49930 34292 41856
18274 41856 71154 75107 29895 24616 41283 61735 74878 55487 49461 34691 5740 4234
18262 4234 21469 59723 88508 104086 103571 98013 69035 58034 68707 59754 26229 903 20847
18249 20847 37866 76995 64749 52569 55117 67813 100243 101795 142338 135725 110469 81417
18237 81417 89187 126790 132619 138435 145500 225628 316959 397089 400952 376176 378242 417230 368202
18224 368202 254294 182842 118105 92583 63451 69307 89774 98928 57155 44294 62116 59477
18212 59477 54491 44415 44084 52356 61828 60751 56864 34696 13407 5951 43568 56079 33823
$$ packed form
18299A3762J9912J9066O875Q951l5694k5460p607J9021K991j3474j4443j9738
18287b5838J0523K7020j9343P757N598K4470j356o376K0481J3635o641j5638P564
18274D1856K9298L953m5212n279J6667K0452J3143j9391o026j4770k8951j506
18262D234J7235L8254K8785J5578n15n558k8978j1001J0673q953l3525k5326J9944
18249B0847J7019L9129j2246j2180K548J2696L2430J552M0543o613k5256k9052
18237H1417P770L7603N829N816P065Q0128R1331Q0130L863k4776K066L8988m9028
18224C68202j13908p1452o4737k5522k9132N856K0467R154m1773j2861J7822k639
18212E9477m986j0076l31Q272R472j077l887k2168k1289p456L7617J2511k2256
$$ plain form
18199 33823 33945 41985 59650 69181 83162 60961 57455 56830 56081 47573 39396 44275 44724 32456
18185 32456 51356 84265 117646 168624 244653 305189 331718 324546 314869 348324 350476 302222
18173 302222 235401 207667 180473 155136 139805 106300 68937 77704 85791 106861 102210 83824
18161 83824 82337 115081 116419 117333 118909 100155 101388 112589 118671 113930 109757 142270 173046
18148 173046 173319 176882 192987 221568 263365 264373 254074 292125 344895 393143 466629 622950
18136 622950 759029 843226 838553 743927 648214 619944 607433 611086 625024 686085 758440 874429
18124 874429 1010054 1205978 1437124 1649441 1839909 2029653 2337018 2762554 3342479 4238879
18114 4238879 5696991 8075408 12057548 18962575 31645435 54046908 71478189 59319430
$$ packed form
18199C3823J22Q040J7665R531J3981k2201l506o25p49q508q177M879M49j2268
18185C2456J8900L2909L3381N0978P6029O0536K6529p172r677L3455K152m8254
18173C02222o6821k7734k7194k5337j5331l3505l7363Q767Q087K1070m651j8386
18161H3824j487L2744J338R14J576j8754J233J1201O082m741m173L2513L0776
18148A73046K73L563J6105K8581M1797J008j0299L8051N2770M8248P3486J56321
18136F22950J36079Q4197m673r4626r5713k8270j2511L653J3938O1061P2355J15989
18124H74429J35625J95924K31146K12317J90468J89744L07365M25536N79925Q96400
18114D238879J458112K378417L982140O905027J2682860K2401473J7431281j2158759
$$ plain form
18106 59319430 40321688 25915259 16125134 10613179 7545141 5640898 4360458 3457790
18098 3457790 2841708 2403065 2052658 1778793 1522695 1282238 1109875 968548 856645
18089 856645 760025 691055 645875 607464 533443 497379 455559 399260 356832 341994 312603
18078 312603 301718 291044 270444 270496 263553 254801 266150 252348 210762 178851 201661 233801
18066 233801 302899 400702 450212 449624 386517 336088 279534 224304 197667 191103 188214 175669
18054 175669 189342 213070 222097 320325 399582 397327 355076 260986 205034 157804 133502 124255
18042 124255 140959 142468 142088 131407 116671 85276 74310 64737 50166 38017 45634 54877 84681
18029 84681 82909 59970 43072 50200 78206 88916 67266 54333 67699 53381 58006 89154
$$ packed form
18106E9319430j8997742j4406429r790125n511955l068038j904243j280440r02668
18098C457790o16082m38643l50407k73865k56098k40457j72363j41327j11903
18089H56645r6620o8970m5180l8411p4021l6064m1820n6299m2428j4838k9391
18078C12603j0885j0674k0600N2o943q752J1349j3802m1586l1911K2810L2140
18066B33801O9098R7803M9510n88o3107n0429n6554n5230k6637o564k889j2545
18054A75669J3673K3728R027R8228P9257k255m2251r4090n5952m7230k4302r247
18042A24255J6704J509l80j0681j4736l1395j0966r573j4571j2149P617R243K9804
18029H4681j772k2939j6898P128K8006J0710k1650j2933J3366j4318M625L1148
$$ plain form
18017 89154 108050 83023 53594 44352 36119 61538 68142 70698 64626 54754 54178 53187 48673 50276
18003 50276 51936 46881 60663 82244 86024 78355 75716 84305 95020 78959 83089 75269 77594
17990 77594 79033 76722 70988 55087 48920 68648 112535 119122 123368 127653 102727 94706 70052
17977 70052 74355 99218 106967 81540 71837 70636 87329 77418 50907 74743 94274 75992 82788
17964 82788 58534 46638 68518 71221 38369 35994 9949 -23614 -40928 -19671 11353 30288
17952 30288 52955 44480 8181 -833 -4722 26436 44251 57415 66182 54569 34913 49449
17940 49449 54882 54546 45630 62599 57057 20001 16932 33458 22883 16132 27222 12068 13115
17927 13115 38019 55746 43120 58159 76454 93088 96942 97543 85107 52295 44443 16622
$$ packed form
18017H9154J8896k5027k9429r242q233K5419O604K556o072r872n76r91m514J603
18003E0276J660n055J3782K1581L780p669k639Q589J0715j6061M130p820K325
17990G7594J439k311n734j5901o167J9728M3887O587M246M285k4926q021k4654
17977G0052M303K4863P749k5427r703j201J6693r911k6511K3836J9531j8282O796
17964H2788k4254j1896K1880K703l2852k375k6045l3563j7314K1257L1024J8935
17952C0288K2667q475l6299r014l889L1158J7815J3164Q767j1613j9656J4536
17940D9449N433l36q916J6969n542l7056l069J6526j0575o751J1090j5154J047
17927A3115K4904J7727j2626J5039J8295J6634L854O01j2436l2812p852k7821
$$ plain form
17915 16622 20672 9009 -5180 33366 44622 32475 34778 63291 43862 22473 48299 56984
17903 56984 49717 51571 49611 56569 79300 94904 55634 44658 62074 61457 51993 38226 13988
17890 13988 8404 27936 50285 49924 28845 35847 28414 21343 15893 53418 82006 62600 58805
17877 58805 75876 47731 14078 34938 65491 101048 135931 116090 88628 108740 114260 80291
17865 80291 77734 57516 41035 39164 63523 61084 77791 66942 47216 58997 63327 48073
17853 48073 33934 53968 31161 1722 2250 35815 47404 47139 47092 7913 -34807 -26788 -40114
17840 -40114 -53112 -39571 -7646 -5819 -10323 -6684 -11036 -12861 16339 27931 20850 23277 39148
17827 39148 8387 -46 1652 -11134 10633 36173 38250 65201 95424 98219 113663 115798 110594
$$ packed form
17915A6622M050j1663j4189L8546J1256j2147K303K8513j9429k1389K5826Q685
17903E6984p267J854j960O958K2731J5604l9270j0976J7416o17r464j3767k4238
17890A3988n584J9532K2349l61k1079P002p433p071n450L7525K8588j9406l795
17877E8805J7071k8145l3653K0860L0553L5557L4883j9841k7462K0112N520l3969
17865H0291k557k0218j6481j871K4359k439J6707j0849j9726J1781M330j5254
17853D8073j4139K0034k2807k9439N28L3565J1589k65m7l9179m2720Q019j3326
17840d0114j2998J3541L1925J827m504L639m352j825K9200J1592p081K427J5871
17827C9148l0761q433J698j2786K1767K5540K077K6951L0223K795J5444K135n204
$$ plain form
17814 110594 102335 91880 102746 89188 61608 50960 84146 52399 36634 31767 50934 51936
17802 51936 58416 69162 74576 57603 71769 65942 58681 70696 72646 65418 71675 66488 65704 79286
17788 79286 64244 50035 44333 46013 53647 15411 26790 81678 108406 114296 84969 89835 127131
17775 127131 152156 187728 184308 179503 195264 212943 193386 186158 172331 152944 124553 144982
17763 144982 185869 234995 293870 313196 338571 365601 402619 429994 476321 521952 539094
17752 539094 595204 705566 836998 974626 1089250 1121199 1145000 1244779 1414095 1582270
17742 1582270 1771193 2056718 2422015 3002619 4051659 5402632 6012071 5538587 4768525
17733 4768525 4085093 3722120 3732437 4000357 4448976 5204193 6327602 7968063 10527172
$$ packed form
17814A10594q259j0455J0866j3558k7580j0648L3186l1747j5765m867J9167J002
17802E1936O480J0746N414j6973J4166n827p261J2015J950p228O257n187p84J3582
17788G9286j5042j4209n702J680P634l8236J1379N4888K6728N890k9327M866L7296
17775A27131K5025L5572l420m805J5761J7679j9557p228j3827j9387k8391K0429
17763A44982M0887M9126N8875J9326K5375K7030L7018K7375M6327M5631J7142
17752E39094N6110J10362J31432J37628J14624L1949K3801R9779J69316J68175
17742A582270J88923K85525L65297N80604J049040J350973O09439m73484p70062
17733D768525o83432l62973J0317K67920M48619P55217J123409J640461K559109
$$ plain form
17724 10527172 14699222 21620207 33387973 52322796 71472857 75543459 72983582 75896297
17716 75896297 78183330 66841341 49591220 34882855 23738258 16337123 11892450
17709 11892450 9185650 7441764 6209189 5253421 4514408 3970448 3567514 3290868 3146884
17700 3146884 3052412 2940464 2840208 2780364 2686181 2578519 2586962 2680570 2734261 2661050 2524535
17689 2524535 2461123 2393832 2326067 2292491 2252850 2187914 2208462 2281543 2429295 2675116 3050647
17678 3050647 3590718 4276356 5143190 6375540 8221735 11140016 15946272 24093970 37636743
17669 37636743 55094323 64350279 64426605 67026877 72948536 67939256 52596408 37690182
17661 37690182 25971518 17689204 12593638 9476343 7470322 6094370 5155160 4559983
$$ packed form
17724A0527172M172050O920985J1767766J8934823J9150061M070602k559877K912715
17716G5896297K287033j1341989j7250121j4708365j1144597p401135m444673
17709A1892450k706800j743886j232575r55768p39013n43960m02934k76646j43984
17700C146884r4472j11948j00256n9844r4183j07662Q443R3608N3691p3211j36515
17689B524535o3412o7291o7765l3576l9641o4936K0548P3081J47752K45821L75531
17678C050647N40071O85638Q66834J232350J846195K918281M806256Q147698J3542773
17669C7636743J7457580R255956P6326K600272N921659n009280j5342848j4906226
17661C7690182j1718664q282314n095566l117295k006021j375952r39210n95177
$$ plain form
17653 4559983 4240805 4099984 4142539 4492677 5210244 5746234 5345028 4470457 3687297 3012483
17643 3012483 2471102 2091651 1878870 1759820 1662562 1549259 1424983 1276189 1090537 945115
17633 945115 813526 699708 606045 515305 463406 417893 391043 383968 369439 347002 357091
17622 357091 369385 369421 349021 358203 371055 361518 346975 334473 323581 320408 320580 311908 265900
17609 265900 250408 252940 225791 209176 216296 225926 209766 192838 202862 238351 244061 237652
17597 237652 247804 249596 266350 284771 249580 225717 202584 228221 255555 238518 197481 142875
17585 142875 109012 117157 136911 132883 122824 85575 71455 91331 122462 132800 128980 126691
17573 126691 121088 95175 69348 64868 41260 31453 60295 71717 60180 61574 82541 100512
$$ packed form
17653D559983l19178j40821M2555L50138P17567N35990m01206q74571p83160o74814
17643C012483n41381l79451k12781j19050r7258j13303j24276j48794j85652j45422
17633I45115j31589j13818r3663r0740n1899m5513k6850p075j4529k2437J0089
17622C57091J2294L6k0400R182J2852r537j4543j2502j0892l173J72q672m6008
17609B65900j5492K532k7149j6615P120R630j6160j6928J0024L5489N710o409
17597B37652J0152J792J6754J8421l5191k3863k3133K5637K7334j7037m1037n4606
17585A42875l3863Q145J9754m028j0059l7249j4120J9876L1131J0338l820k289
17573A26691n603k5913k5827m480k3608r807K8842J1422j1537J394K0967J7971
$$ plain form
17561 100512 107606 90952 82102 83691 92674 102696 104288 79764 95904 98482 85014 74555 88553
17548 88553 89392 91903 119847 125181 133391 151287 158566 169948 168582 167183 126967 103454 81648
17535 81648 56720 47994 53353 52205 38256 34341 5528 -1661 17588 23065 26335 37802 58031
17522 58031 53208 21168 2532 -11183 -25646 -21277 -30677 -36674 -34834 -5349 26699 31977 11703
17509 11703 12435 35007 37575 26352 39571 57019 71910 76605 41639 7656 15483 25137 48887
17496 48887 25695 23709 33570 36678 35145 38416 20441 19938 9512 17935 34219 41597 14295
17483 14295 24295 23784 29208 28569 21283 8599 658 5380 -31213 -35232 -14017 17803 40294
17470 40294 54719 60566 49679 50905 49439 60017 89042 76193 47947 1460 -623 22031
$$ packed form
17561A00512P094j6654q850J589Q983J0022J592k4524J6140K578j3468j0459J3998
17548H8553Q39K511K7944N334Q210J7896P279J1382j366j399m0216k3513k1806
17535H1648k4928q726N359j148j3949l915k8813p189J9249N477L270J1467K0229
17522E8031m823l2040j8636j3715j4463M369r400n997J840K9485L2048N278k0274
17509A1703P32K2572K568j1223J3219J7448J4891M695l4966l3983P827R654K3750
17496D8887k3192j986R861L108j533L271j7975n03j0426Q423J6284P378k7302
17483A4295J0000n11N424o39p286j2684p941M722l6593m019K1215L1820K2491
17470D0294J4425N847j0887J226j466J0578K9025j2849k8246m6487k083K2654
$$ plain form
17458 22031 12336 13833 23976 19735 26427 8312 18889 37788 44622 43173 35296 48305 62104
17445 62104 80701 146312 239173 359788 372315 293652 195634 104136 74902 49466 19158
17434 19158 12972 42376 62972 47784 54600 59267 41345 14785 16690 19005 6971 -10826 -20295
17421 -20295 -35464 -28823 -3583 17809 10147 -6000 -3469 14438 24260 30579 37956 39981 17740
17408 17740 8607 7381 -13450 18724 33297 29727 22128 -12089 -29122 -10226 12129 36406
17396 36406 10586 -1891 6154 17715 24510 43843 16971 -22058 -26252 -12392 -1557 27371
17384 27371 5787 -12531 -49392 -73381 -21504 36776 48852 49086 15016 29027 38197 22267
17372 22267 -9566 -18415 -20134 -7614 -315 16520 23425 49993 75328 61378 25109 -3891
$$ packed form
17458B2031r695J497J0143m241O692j8115J0577J8899O834j449p877J3009J3799
17445F2104J8597O5611R2861J20615J2527p8663r8018r1498k9234k5436l0308
17434A9158o186K9404K0596j5188O816M667j7922k6560J905K315j2034j7797r469
17421b0295j5169O641K5240K1392p662j6147K531J7907R822O319P377K025k2241
17408A7740r133j226k0831L2174J4573l570p599l4217j7033J8896K2355K4277
17396C6406k5820j2477Q045J1561O795J9333k6872l9029m194J3860J0835K8928
17384B7371k1584j8318l6861k3989N1877N8280J2076K34l4070J4011R170j5930
17372B2267l1833q849j719J2520P299J6835O905K6568K5335j3950l6269k9000
$$ plain form
17360 -3891 -19271 -4360 2891 255 5484 -5566 1518 9342 -14794 -19039 -33692 -41724 -24203
17347 -24203 -26462 -16416 -24875 -27321 -21975 -17311 -3119 4117 1418 -29095 -52186 -51995 -66129
17334 -66129 -55081 -24133 -11844 -29941 -36369 -24244 1020 36553 50918 29521 11230 14747
17322 14747 33487 30380 32771 17948 6126 656 -6457 -7582 -12586 -11031 11787 4334 -12236
17309 -12236 -41806 -38384 3027 -7836 11325 45326 58449 47635 46237 47924 13195 -31444
17297 -31444 -28257 -28899 -31593 -2561 20756 30631 18987 7024 -10329 -35261 -39313 -29673 -9488
17284 -9488 10759 -7894 -12007 -4387 6279 30063 46119 32741 33328 41167 10497 -17694 -30059
17271 -30059 -33350 -15627 -9029 -5980 -13006 -51860 -42724 -16761 -268 30985 29033 -4383 -7329
$$ packed form
17360c891j5380J4911P251k636N229j1050P084P824k4136m245j4653q032J7521
17347b4203k259J0046q459k446N346M664J4192P236k699l0513k3091J91j4134
17334f6129J1048L0948J2289j8097o428J2125K5264L5533J4365k1397j8291L517
17322A4747J8740l107K391j4823j1822n470p113j125n004J555K2818p453j6570
17309a2236k9570L422M1411j0863J9161L4001J3123j0814j398J687l4729m4639
17297c1444L187o42k694K9032K3317R875j1644j1963j7353k4932m052R640K0185
17284i488K0247j8653m113P620J0666K3784J6056j3378N87P839l0670k8191j2365
17271c0059l291J7723O598L049p026l8854R136K5963J6493L1253j952l3416k946
$$ plain form
17258 -7329 -1691 5277 19918 26359 -1988 16481 28773 -41 -29126 -8902 -852 -11103 -12482
17245 -12482 -14443 -30212 -35016 -16825 26188 14887 -5235 -20054 -36038 -25117 -40716 -48399
17233 -48399 -24321 -2734 586 2189 24232 36657 18484 11182 52612 62009 49534 47525 27940
17220 27940 1900 -42297 -17713 24254 30338 25352 63800 80078 108350 100158 58614 51285
17208 51285 77689 118785 173085 268081 357462 400197 422711 427971 463438 416822 267797 163357
17196 163357 119208 70968 47122 56371 63457 68269 55108 42994 10298 -1853 10998 17161
17184 17161 10552 -13814 -6697 -12955 -15104 2335 -17330 -26894 -34377 -31836 -6196 -2491 -1245
17171 -1245 -32943 -41108 -8782 5557 14378 25493 32989 18581 -2626 -1896 -2001 18240 1807
$$ packed form
17258g329N638O968J4641O441k8347J8469J2292k8814k9085K0224Q050j0251j379
17245a2482j961j5769m804J8191M3013j1301k0122j4819j5984J0921j5599p683
17233d8399K4078K1587L320J603K2043J2425j8173p302M1430R397j2475k009j9585
17220B7940k6040m4197K4584M1967O084m986L8448J6278K8272q192m1544p329
17208E1285K6404M1096N4300R4996Q9381M2735K2514N260L5467m6616j49025j04440
17196A63357m4149m8240k3846R249P086M812j3161j2114l2696j2151J2851O163
17184A7161o609k4366P117o258k149J7439j9665r564p483K541K5640L705J246
17171a245l1698q165L2326J4339Q821J1115P496j4408k1207P30j05K0241j6433
$$ plain form
17158 1807 15689 39657 43948 69615 121396 172583 287844 394881 398882 399911 401953 351221
17146 351221 269133 191275 102548 63744 47469 51214 55236 61739 50383 45755 18025 -22943
17134 -22943 -20130 -10660 -9754 -19114 -19684 28638 57050 70428 57873 42986 66603 112340 152374
17121 152374 174356 168430 142086 96115 51795 31419 29809 39859 27765 15960 29172 37348
17109 37348 43082 56302 50531 53396 33161 46134 48851 12834 1797 39387 15918 -3721
17097 -3721 -942 3735 14061 8165 17459 20336 15048 17788 7085 -6758 -56824 -78045 -86631
17084 -86631 -67417 -59309 -46200 -44727 -37911 -44021 -41335 -31708 -39330 -46181 -47901 -60901 -56275 -36596
17070 -36596 -19584 -1278 -1500 -7792 -14627 -26710 -32177 -48503 -67768 -46797 -25694 6464 14319
$$ packed form
17158A807J3882K3968M291K5667N1781N1187J15261J07037M001J029K042n0732
17146C51221q2088p7858q8727l8804j6275L745M022O503j1356m628k7730m0968
17134b2943K813R470R06r360n70M8322K8412J3378j2555j4887K3617M5737M0034
17121A52374K1982n926k6344m5971m4320k0376j610J0050j2094j1805J3212Q176
17109C7348N734J3220n771K865k0235J2973K717l6017j1037L7590k3469j9639
17097c721K779M677J0326n896R294K877n288K740j0703j3843n0066k1221q586
17084h6631J9214Q108J3109J473O816o110K686R627p622o851j720j3000M626J9679
17070c6596J7012J8306k22o292o835j2083n467j6326j9265K0971K1103L2158P855
$$ plain form
17057 14319 15400 9652 -7904 -7083 -6513 -14956 12031 -947 -35759 -49719 -49590 -61361 -42830
17044 -42830 -2973 7191 11405 8490 -11333 -47415 -49958 -26114 -12885 -13182 18234 9555 -14664
17031 -14664 -33393 -28669 -9889 -423 9417 4229 -7170 3757 11409 450 -14544 -13926 1222
17018 1222 -11436 -17017 10932 23377 30998 29563 17059 22568 37891 49736 37257 23365 13561
17005 13561 -8237 -8269 1431 10422 30869 43867 24154 5725 3483 -15759 -28250 -43741 -58203
16992 -58203 -25506 -7812 -41175 -28189 -6767 -4869 -40730 -43673 -53613 -34697 -16409 -14976
16980 -14976 -20845 -13710 -18524 -5456 5943 -12775 -19536 -13669 -19789 -24755 -7614 9979 10524
16967 10524 1891 9659 -24397 -31904 -29434 -20864 -32152 -45087 -57700 -33776 -5710 23790 31851
$$ packed form
17057A4319J081n748j7556Q21N70q443K6987j2978l4812j3960J29j1771J8531
17044d2830L9857J0164M214k915j9823l6082k543K3844J3229k97L1416q679k4219
17031a4664j8729M724J8780R466R840n188j1399J0927P652j0959j4994O18J5148
17018A222j2658n581K7949J2445P621j435j2504N509J5323J1845j2479j3892r804
17005A3561k1798l2R700Q991K0447J2998j9713j8429k242j9242j2491j5491j4462
16992e8203L2697J7694l3363J2986K1422J898l5861k943r940J8916J8288J433
16980a4976n869P135m814J3068J1399j8718o761N867o120m966J7141J7593N45
16967A0524q633P768l4056p507K470Q570j1288j2935j2613K3924K8066K9500Q061
$$ plain form
16954 31851 37277 -5154 -10478 13120 29607 37023 36306 -20651 -10066 24654 22932 -27675 -25691
16941 -25691 892 24667 32900 10945 -33669 -22065 10036 26718 33949 -2132 -3815 10609
16929 10609 19903 5879 19969 23099 10680 -1474 -8081 -22977 -40463 -41874 -21750 -6050
16917 -6050 6553 -1885 -31566 -76537 -74555 -54273 -42675 -38347 -28692 -22267 -27227 -2100 26619
16904 26619 54924 84122 84787 97826 98159 74015 59604 43152 25476 34508 12911 -7900 -11889
16891 -11889 -1617 2594 -9114 -11478 -6379 -13539 -17941 592 4932 -15639 -12472 19250 8806
16878 8806 645 17295 15444 -12352 -56966 -44393 11225 27698 3276 -25157 -20230 -14826 -19293
16865 -19293 -14659 -13512 -29537 -47936 -31282 1447 1629 4607 6515 19166 14602 -7863 -9340
$$ packed form
16954C1851N426m2431n324K3598J6487P416p17n6957J0585L4720j722n0607J984
16941b5691K6583K3775Q233k1955m4614J1604L2101J6682P231l6081j683J4424
16929A0609R294j4024J4090L130j2419j2154o607j4896j7486j411K0124J5700
16917f050J2603q438k9681m4971J982K0282J1598M328R655O425m960K5127K8719
16904B6619K8305K9198O65J3039L33k4144j4411j6452j7676R032k1597k0811l989
16891a1889J0272M211j1708k364N099p160m402J8533M340k0571L167L1722j0444
16878H806q161J6650j851k7796m4614J2573N5618J6473k4422k8433M927N404m467
16865a9293M634J147j6025j8399J6654L2729J82K978J908J2651m564k2465j477
$$ plain form
16852 -9340 16764 4087 -5887 -19762 12259 26360 10702 -29246 -67946 -66375 -47446 -34232
16840 -34232 -13218 11101 10261 23845 -479 960 15874 2301 10263 19877 30885 11677 21728
16827 21728 35031 -13109 -35769 -5106 28714 36923 25619 34228 27396 -2499 -18484 -20351
16815 -20351 -34636 -37516 -8466 5595 -8001 -29264 -32029 -47418 -54764 -31472 -19547 -8911
16803 -8911 10351 -3953 -38836 -57235 -20697 -147 -9649 13358 25219 -16245 -2007 19512
16791 19512 27047 11938 -18704 -16001 -52 -12083 -3073 10434 7951 -8433 -7868 -8524 -26457
16778 -26457 -40430 -23468 -12908 -18140 -43780 -62736 -63116 -42400 -16989 -6137 -16091 -22644 -17540
16765 -17540 12655 14652 7708 24277 26637 31171 38111 22218 -15356 -13374 2381 12181 27842
$$ packed form
16852i340K6104j2677r974j3875L2021J4101j5658l9948l8700J571J8929J3214
16840c4232K1014K4319q40J3584k4324J439J4914j3573P962R614J1008j9208J0051
16827B1728J3303m8140k2660L0663L3820Q209j1304Q609o832k9895j5985j867
16815b0351j4285k880K9050J4061j3596k1263k765j5389p346K3292J1925J0636
16803h911J9262j4304l4883j8399L6538K0550r502K3007J1861m1464J4238K1519
16791A9512P535j5109l0642K703J5949j2031R010J3507k483j6384N65o56j7933
16778b6457j3973J6962J0560n232k5640j8956l80K0716K5411J0852r954o553N104
16765a7540L0195J997o944J6569K360M534O940j5893l7574J982J5755R800J5661
$$ plain form
16752 27842 -8799 -14468 -24428 -31910 -21394 -23675 -38946 -68248 -48752 -32413 -14661 798
16740 798 -28844 -45937 -40990 -35842 -13950 -4539 2020 13751 -8080 509 15138 22605 22421 25747
16726 25747 -6520 -7714 -4377 13537 -9737 -20653 -10468 -10744 -23004 -5911 -16724 -20631 -17942
16713 -17942 -25869 -6366 13562 -8411 -37072 -11865 4821 7458 18260 1104 -33435 -64259
16701 -64259 -55245 -30186 -32093 -50970 -36449 -25634 -2821 23841 34845 18913 17991 15441 -8011
16688 -8011 -11212 -7216 -7411 -18481 -10595 -23619 -26815 -23066 -32489 -15995 -6722 -25609 -26409 -15278
16674 -15278 -4130 2342 1530 2001 5621 22054 -2191 -12393 7606 22876 12529 -5129 -9507
16661 -9507 -13384 -19487 1140 7762 2270 17519 24732 25127 26336 22881 34406 36345 1610 3676
$$ packed form
16752B7842l6641n669r960p482J0516k281j5271k9302J9496J6339J7752J5459
16740G98k9642j7093M947N148K1892R411O559J1731k1831Q589J4629P467j84L326
16726B5747l2267j194L337J7914k3274j0916J0185k76j2260J7093j0813l907K689
16713a7942p927J9503J9928k1973k8661K5207J6686K637J0802j7156l4539l0824
16701f4259R014K5059j907j8877J4521J0815K2813K6662J1004j5932r22k550k3452
16688h011l201L996j95j1070P886j3024l196L749r423J6494R273j8887q00J1131
16674a5278J1148O472q12M71L620J6433k4245j0202J9999J5270j0347j7658m378
16661i507l877o103K0627O622n492J5249P213L95J209l455J1525J939l4735K066
$$ plain form
16647 3676 -6324 -12009 -10007 -4012 2181 -9762 -19067 -22746 -56451 -64553 -40825 -28333 -30932
16634 -30932 -40378 -30242 -32294 -16611 2269 -17749 -42761 -21520 -10084 -6047 -16180 10720
16622 10720 4596 -13319 -13084 4330 -14114 -18510 -9433 -24788 -20861 18097 9734 -16494 -24535
16609 -24535 -16049 -19353 -17641 -960 -3621 -8046 -46455 -61976 -35182 -58355 -65391 -53023 -33142
16596 -33142 -20945 -35099 -38545 -31092 -42762 -1081 11242 6427 -14781 -21267 -20240 -24092 -48927
16583 -48927 -24474 -27839 -27730 -30794 -22226 -1424 18033 29065 32210 10544 23582 18024 -7495
16570 -7495 -2150 -15249 -30913 -27041 -21594 -24428 -21758 -33091 -48744 -68685 -29996 -8388 7127
16557 7127 27145 60584 56722 14448 -14104 -7657 1295 -512 -30078 -38462 -24835 -36730 -32677
$$ packed form
16647C676j0000n685K002N995O193j1943r305l679l3705q102K3728J2492k599
16634c0932r446J0136k052J5683J8880k0018k5012K1241J1436M037j0133K6900
16622A0720o124j7915K35J7414j8444m396R077j5355L927L8958q363k6228q041
16609b4535Q486l304J712J6681k661m425l8409j5521K6794k3173p036J2368J9881
16596c3142J2197j4154l446P453j1670M1681J2323m815k1208o486J027l852k4835
16583d8927K4453l365J09l064Q568K0802J9457J1032L145k1666J3038n558k5519
16570g495N345j3099j5664L872N447k834K670j1333j5653j9941L8689K1608J5515
16557G127K0018L3439l862m2274k8552O447Q952j807k9566q384J3627j1895M053
$$ plain form
16544 -32677 -18258 -9843 -44168 -58647 -23755 -29346 -35133 -6724 1509 -11592 -7805 15300 8833
16531 8833 -5919 6676 13857 -8273 -27962 -25307 -20462 -39132 -33826 -26235 -24563 4223 26767
16518 26767 37207 31766 12285 23508 2165 -14631 -15292 -5591 -6911 -15342 1656 -6877 -10634
16505 -10634 -12466 -11828 17824 26396 31637 14058 -12454 5671 -4630 -629 4777 -16791 -47980
16492 -47980 -51964 -40798 -31539 -17447 -7453 29997 46859 41354 5219 3535 1349 -11060 -1732
16479 -1732 -5557 12709 28469 36365 -11925 -36501 3187 31967 50723 39349 29141 10083
16467 10083 -5993 1689 -1246 -15694 -25929 -34827 -54551 -65194 -63211 -40886 -21534 3045
16455 3045 2971 6555 10481 17731 34499 36076 41776 29062 15885 1945 -16406 -37234 -36346 -33041
$$ packed form
16544c2677J4419Q415l4325j4479L4892n591n787K8409Q233j3101L787K3105o467
16531H833j4752J2595P181k2130j9689K655M845j8670N306P591J672K8786K2544
16518B6767J0440n441j9481J1223k1343j6796o61R701j320q431J6998q533l757
16505a0634j832O38K9652Q572N241j7579k6512J8125j0301M001N406k1568l1189
16492d7980l984J1166R259J4092R994L7450J6862n505l6135j684k186j2409R328
16479a732l825J8266J5760P896m8290k4576L9688K8780J8756j1374j0208j9058
16467A0083j6076P682k935j4448j0235q898j9724j0643J983K2325J9352K4579
16455C045p4L584L926P250J6768J577N700j2714j3177j3940j8351k0828Q88L305
$$ plain form
16441 -33041 -10285 6256 -16360 -52226 -28452 -19336 -17335 -32256 -37567 -39602 -42780 -37590 -17091
16428 -17091 -5399 -22578 -28507 -19671 -21213 -38974 -27405 -34463 -9577 -2361 -5871 16913 8820
16415 8820 19296 32220 69291 74845 35120 7349 24166 21410 11288 4676 -5772 -8101 -14046
16402 -14046 -21747 -21288 -22002 -11128 -27092 -7333 4959 8365 -11185 -1595 1053 -11017 -39820
16389 -39820 -36534 -50863 -35942 -17771 -6360 -6123 -34588 -55046 -82364 -52066 -4886 16924
16377 16924 7656 7121 -14413 -15486 -26422 -32502 -21788 8084 3159 -21976 -46516 -20191 -21402
16364 -21402 -10641 -4559 13745 38284 34086 -5942 -27177 -23817 -24281 -33550 -48974 -18373 13142
16351 13142 3880 -6356 -8070 -34933 -33740 -26953 -30389 -10163 40075 35548 18391 32957 51563
$$ packed form
16441c3041K2756J6541k2616l5866K3774R116K001j4921n311k035l178N190K0499
16428a7091J1692j7179n929Q836j542j7761J1569p058K4886P216l510K2784q093
16415H820J0476J2924L7071N554l9725k7771J6817k756j0122o612j0448k329n945
16402a4046p701M59p14J0874j5964J9759J2292L406j9550R590K648j2070k8803
16389c9820L286j4329J4921J8171J1411K37k8465k0458k7318L0298M7180K1810
16377A6924r268n35k1534j073j0936o080J0714K9872m925k5135k4540K6325j211
16364b1402J0761O082J8304K4539m198m0028k1235L360m64r269j5424L0601L1515
16351A3142r262j0236j714k6863J193O787l436K0226N0238m527j7157J4566J8606
$$ plain form
16338 51563 39581 -3434 -23090 -20852 -27765 -8839 22533 11661 -242 5165 13534 2214
16326 2214 -6037 -18556 -4567 4524 -24096 -38815 -40888 -27668 522 5715 -3223 -8856 -3903
16313 -3903 3134 34288 38494 26594 8789 -7994 -874 5105 14966 22536 14485 33770 24575
16300 24575 13093 10638 -11812 -53487 -46867 -21093 -21532 -10917 -11104 -19713 -25388 -5593 13787
16287 13787 -4869 9702 18337 27730 31652 18709 17591 19582 -14058 -11750 -12902 -8328 -19804
16274 -19804 -2354 19531 8148 -431 -5060 -38877 -72068 -60356 -9251 7278 -37661 -44962
16262 -44962 -37584 -26912 -47837 -29823 9542 1346 3899 -14504 -19123 -3038 13328 14453 -2193
16249 -2193 -11784 -24157 -18364 -14600 -12504 -10278 -16529 -17234 11629 20930 5354 11381 -11639 -26358
$$ packed form
16338E1563j1982m3015j9656K238o913J8926L1372j0872j1903N407Q369j1320
16326B214q251j2519J3989R091k8620j4719k073J3220K8190N193q938n633M953
16313c903P037L1154M206j1900j7805j6783P120N979R861P570q051J9285r195
16300B4575j1482k455k2450m1675O620K5774m39J0615j87q609n675J9795J9380
16287A3787j8656J4571Q635R393L922j2943j118J991l3640K308j152M574j1476
16274a9804J7450K1885j1383q579m629l3817l3191J1712N1105J6529m4939p301
16262d4962P378J0672k0925J8014L9365q196K553j8403m619J6085J6366J125j6646
16249b193r591j2373N793L764K096K226o251p05K8863R301j5576O027k3020j4719
$$ plain form
16235 -26358 -27587 -29351 -43903 -56920 -74407 -28463 -6110 -8678 -21285 -28359 -38904 -39388 -10181
16222 -10181 26038 47095 23267 44336 46873 5369 -6776 -4820 12350 32586 30456 25499
16210 25499 12585 -12082 -26540 -43144 -37156 -19901 -25599 -23916 -9148 11279 23706 9857
16198 9857 6645 -5477 -27861 -16365 -3245 -16118 -29385 -25860 -24223 -6050 -13855 -41761 -31016
16185 -31016 -10692 -16852 -13031 6867 2371 -26582 -31865 -43565 -33557 -32579 -34396 3110 -2846
16172 -2846 7620 -429 -26440 -12565 20394 43109 -8870 -47829 -58709 -72990 -86942 -85941
16160 -85941 -66008 -41254 -20475 -10380 -14144 -33119 -42511 -58594 -41022 -14615 32059 28032
16148 28032 13177 721 -12243 -15133 -25474 -50046 -25636 -19635 -9572 -92 -5686 -9619 -35860
$$ packed form
16235b6358j229j764j4552j3017j7487M5944K2353k568j2607p074j0545m84K9207
16222a0181L6219K1057k3828K1069K537m1504j2145J956J7170K0236k130m957
16210B5499j2914k4667j4458j6604N988J7255n698J683J4768K0427J2427j3849
16198I857l212j2122k2384J1496J3120j2873j3267L525J637J8173p805k7906J0745
16185c1016K0324o160L821J9898m496k8953n283j1700J0008R78j817L7506n956
16172b846J0466q049k6011J3875L2959K2715n1979l8959j0880j4281j3952J001
16160h5941J9933K4754K0779J0095l764j8975r392j6083J7572K6407M6674m027
16148B8032j4855j2456j2964k890j0341k4572K4410O001J0063R480n594l933k6241
$$ plain form
16135 -35860 -49463 -27001 -14073 -16794 7761 21035 50612 44052 10729 27397 19922 -691
16123 -691 -5180 26776 -9450 -9352 -15602 -40650 -49597 -47281 -33016 -19230 -23969 -33315 -25291 3934
16109 3934 1330 -14137 -8305 -6717 -11459 -24702 -8210 -9537 -18760 -34708 -57457 -56125 -42273
16096 -42273 7242 -361 -2401 8772 17011 22897 15968 28168 20820 10009 -16554 -28275 -17044
16083 -17044 -14976 -21469 -6320 -24537 -27215 -9832 9979 12507 11530 -5832 -31336 -42386 -50647
16070 -50647 -48749 -48004 -34902 -3942 27707 16742 32800 32580 36712 22362 32714 9698 8822
16057 8822 4765 2804 1680 5042 -16136 -18294 -1880 4769 2009 28326 18989 -10318 -7643 -13671
16043 -13671 -26257 -29431 -35069 -41852 -34280 -12921 9084 32697 46514 20925 3171 -4495 7617
$$ packed form
16135c5860j3603K2462J2928k721K4555J3274K9577o560l3323J6668p475k0613
16123f91m489L1956l6226R8o250k5048q947K316J4265J3786m739r346Q024K9225
16109C934k604j5467N832J588m742j3243J6492j327r223j5948k2749J332J3852
16096d2273M9515p603k040J1173Q239N886o929J2200p348j0811k6563j1721J1231
16083a7044K068o493J5149j8217k678J7383J9811K528r77j7362k5504j1050q261
16070e0647J898P45J3102L0960L1649j0965J6058k20M132j4350J0352k3016q76
16057H822m057j961j124L362k1178k158J6414O649k760K6317r337k9307K675o028
16043a3671j2586l174n638o783P572K1359K2005K3613J3817k5589j7754p666J2112
$$ plain form
16030 7617 -14363 -15580 -28166 -12999 -16800 -40699 -55881 -32401 -31315 -34606 -33974 -22988 -36747
16017 -36747 -39214 -36337 -45084 -48137 -37059 -41661 -25778 3748 -17785 -46446 -42192 -18984 -13536
16004 -13536 -18516 -26777 8322 7347 -10326 -27316 -14025 2950 8556 14595 22016 13293 22321
15991 22321 15788 2196 -26510 -44006 -24125 -18366 -33281 -24234 -12581 -17794 -17819 -18816 -24272 -26825
15977 -26825 -40745 -38143 -40201 -22723 -34776 -45913 -29657 -33254 -29190 378 28191 36958 33520
15964 33520 11497 4684 -10258 -22426 -31116 -25770 -12732 -17643 -14104 -18327 -35381 -33029 -53768
15951 -53768 -34726 -13087 -5820 3960 3179 40894 60327 44408 38485 34388 16703 -13821 -15423
15938 -15423 -21791 -18939 -2005 -20272 -17608 -2613 16535 10114 333 -1195 3906 6822 -10641
$$ packed form
16030G617k1980j217j2586J5167l801k3899j5182K3480J086l291O32J0986j3759
16017c6747k467K877q747l053J1078m602J5883K9526k1533k8661M254K3208N448
16004a3536m980q261L5099r75j7673j6990J3291J6975N606O039P421q723R028
15991B2321o533j3592k8706j7496J9881N759j4915R047J1653n213k5r97n456k553
15977b6825j3920K602k058J7478j2053j1137J6256l597M064K9568K7813Q767l438
15964C3520k2023o813j4942j2168q690N346J3038m911L539m223j7054K352k0739
15951e3768J9042K1639P267R780p81L7715J9433j5919n923m097j7685l0524j602
15938a5423o368K852J6934j8267K664J4995J9148o421r781j528N101K916j7463
$$ plain form
15925 -10641 -12006 -9181 -7622 -12751 -4860 13928 17736 -7116 -9888 -2051 -10935 -37373 -34254 -11907
15911 -11907 -31946 -62194 -47020 84 2431 -5370 -23159 -15799 4256 -5114 -29135 -24036 -8878
15898 -8878 -5650 14984 32519 22422 -13321 -11188 5480 -8579 27341 35641 27444 -2650 -16703
15885 -16703 -20918 4286 32916 28951 7969 -4448 -8280 -22138 -55015 -62723 -43270 -30479
15873 -30479 -25901 -20270 -9215 8733 15142 16422 7085 1166 -25046 -49802 -17072 -22999 -16483
15860 -16483 -6331 2000 -1316 2427 13173 -25177 -37401 10751 17102 -17774 -29729 -13859
15848 -13859 -15011 -18444 -10189 -7484 -9022 -19001 -9416 -3866 -8276 -28955 -8354 -1966 -30297 -27946
15834 -27946 -22687 -21786 -21704 -25627 -29340 -17231 -13626 -51175 -44913 -24488 10191 31423 1007 -18269
$$ packed form
15925a0641j365K825J559n129P891J8788L808k4852k772P837q884k6438L119K2347
15911a1907k0039l0248J5174M7104K347p801j7789P360K0055r370k4021N099J5158
15898h878L228K0634J7535j0097l5743K133J6668j4059L5920Q300q197l0094j4053
15885a6703m215K5204K8630l965k0982j2417l832j3858l2877p708J9453J2791
15873c0479M578N631J1055J7948O409J280r337n919k6212k4756L2730n927O516
15860a6483J0152Q331l316L743J0746l8350j2224M8152O351l4876j1955J5870
15848a3859j152l433Q255K705j538r979R585N550m410k0679K0601O388k8331K351
15834b7946N259R01Q2l923l713J2109L605l7549O262K0425L4679K1232l0416j9276
$$ plain form
15820 -18269 -8353 -1371 15441 13687 13802 48404 29160 -20584 -31952 -42035 -48528 -29166 -34287
15807 -34287 -14555 8546 -1100 -7329 -28024 -23208 -19881 -36237 -12723 -11334 -19716 -13189 -12992
15794 -12992 -11483 537 -10332 -33066 -28010 -37408 -33250 -15565 25356 19671 10680 30832 12138
15781 12138 3416 -13089 -7158 1848 13624 -15226 -46597 -35692 -37826 -56911 -50814 -57498 -42118
15768 -42118 -12138 -11021 -31154 -32209 -12842 -8318 -27905 -18130 10498 3915 5459 16553 5374
15755 5374 -18531 -3956 -16476 -23952 -35010 -30934 -17398 -19379 -42661 -33852 -455 8767 6264
15742 6264 24231 46931 14890 1258 16177 8531 1229 16093 30842 22924 1900 -34088
15730 -34088 -37994 -29608 -22609 1637 20014 26176 5269 -28128 -23831 -21202 -13634 -35009 -47392
$$ packed form
15820a8269R916O982J6812j754J15L4602j9244m9744j1368j0083o493J9362n121
15807c4287J9732K3101r646o229k0695M816L327j6356K3514J389q382O527J97
15794a2992J509J2020j0869k2734N056r398M158J7685M0921n685q991K0152j8694
15781A2138q722j6505N931R006J1776k8850l1371J0905k134j9085O097o684J5380
15768d2118K9980J117k0133j055J9367M524j9587R775K8628o583J544J1094j1179
15755E374k3905J4575j2520p476j1058M076J3536j981k3282Q809L3397R222k503
15742F264J7967K2700l2041j3632J4919p646p302J4864J4749p918k1024l5988
15730c4088l906Q386O999K4246J8377O162k0907l3397M297K629P568k1375j2383
$$ plain form
15717 -47392 -55763 -83906 -70162 -55474 -60041 -47876 -66453 -64026 -38056 -22024 -19473 -25721 -30499
15704 -30499 -59541 -75101 -71664 -64537 -19066 -16581 -46294 -46479 -42893 -24469 -32828 -12735 3890
15691 3890 18126 46139 18711 -5377 -15279 -8593 -20367 -41680 -56801 -54465 -49598 -27744 1873
15678 1873 12475 32498 43701 52500 42694 36989 11260 6323 7755 -4163 -8252 -920 -15005
15665 -15005 8713 33234 21914 8771 17207 1972 16648 22654 -4784 -20676 -22432 -4706
15653 -4706 2433 34028 19326 -10345 -24584 -19183 -18463 -191 -959 9819 14199 8845 10518 -8264
15639 -8264 -27631 -27954 -3497 8127 13612 26013 31775 17692 -186 -17923 -10544 11426 14878
15626 14878 -11560 -9888 6541 -269 -25153 -17890 10316 37784 28550 4218 -18996 4818
$$ packed form
15717d7392q371k8143J3744J4688m567J2165j8577K427K5970J6032K551o248m778
15704c0499k9042j5560L437P127M5471K485k9713j85L586J8424q359K0093J6625
15691C890J4236K8013k7428k4088r902O686j1774k1313j5121K336M867K1854K9617
15678A873J0602K0023J1203Q799r806n705k5729m937J432j1918m089P332j4085
15665a5005K3718K4521j1320j3143Q436j5235J4676O006k7438j5892j756J7726
15653d706P139L1595j4702k9671j4239N401P20J8272p68J0778M380n354J673j8782
15639h264j9367l23K4457J1624N485J2401N762j4083j7878j7737P379K1970L452
15626A4878k6438J672J6429o810k4884P263K8206K7468r234k4332k3214K3814
$$ plain form
15614 4818 -5125 -44999 -58563 -50282 -37416 -39511 -31205 -14975 -19214 -9761 1848 14906 -4460
15601 -4460 2315 30052 36009 35206 21277 -3531 -8105 -691 13804 24535 31367 17573 12357
15588 12357 18975 29496 11172 -19114 -23817 -26506 -27926 -31575 -31777 -8083 33051 53071 61905
15575 61905 56314 28656 39827 33508 -8259 -17428 8117 16194 14445 -26070 -46963 -42344 -31304
15562 -31304 6690 28768 28069 31138 8234 -6869 -42969 -33139 -39417 -40938 -24413 -7992 8463
15549 8463 11119 2498 -5903 1385 -8375 900 21114 29019 -7572 -27841 -34175 -41524 -41119 -37778
15535 -37778 -13077 -14026 -12330 1989 309 19994 20072 14528 7508 17425 2436 -8034 -431 14532
15521 14532 21161 17596 -8320 -6019 -17450 -10424 -7097 -32218 -34995 -41118 -26399 -23939 -16216
$$ packed form
15614D818r943l9874j3564Q281J2866k095Q306J6230m239R453J1609J3058j9366
15601d460O775K7737N957q03j3929k4808m574P414J4495J0731O832j3794n216
15588A2357O618J0521j8324l0286m703k689j420l649k02K3694M1134K0020Q834
15575F1905n591k7658J1171o319m1767r169K5545Q077j749m0515k0893M619J1040
15562c1304L7994K2078o99L069k2904j5103l6100R830o278j521J6525J6421J6455
15549H463K656q621q401P288r760R275K0214P905l6591k0269o334p349M05L341
15535c7778K4701r49J696J4319j680J9685P8n544p020R917j4989j0470P603J4963
15521A4532O629l565k5916K301j1431P026L327k5121k777o123J4719K460P723
$$ plain form
15508 -16216 553 5770 -15395 -58826 -57212 -42776 -37026 -23908 -19041 -9226 21769 45067 40151
15495 40151 55773 38166 -4656 -7875 244 -27151 -26592 7985 30972 29375 21757 32069 18065
15482 18065 17207 14264 11829 21159 -8543 -14489 4049 3399 26343 38640 27852 13629 14678
15469 14678 1754 -17150 -11704 13032 9037 -492 8695 7884 24658 47758 46740 5637 -1309
15456 -1309 4246 9732 -5729 -2406 -22490 -45657 -44217 -5000 23314 42515 40461 3056 -44629
15443 -44629 -53915 -25612 -12526 -18114 -17066 -9778 -3292 -23284 -29425 -43380 -43126 -19675 -11995
15430 -11995 -1475 -848 -20517 -4214 -1419 -946 10235 32102 41220 20721 16312 37704 42588
15417 42588 16198 35304 40126 33774 3591 -25315 -12464 -4874 17507 3393 4385 12614 9897
$$ packed form
15508a6216J6769N217k1165m3431J614J4436N750J3118M867R815L0995K3298m916
15495D0151J5622j7607m2822l219Q119k7395N59L4577K2987j597p618J0312j4004
15482A8065q58k943k435R330k9702n946J8538o50K2944J2297j0788j4223J049
15469A4678j2924j8904N446K4736l995r529R187q11J6774K3100j018m1103o946
15456a309N555N486j5461L323k0084k3167J440L9217K8314J9201k054l7405m7685
15443d4629r286K8303J3086n588J048P288O486j9992o141j3955K54K3451P680
15430a1995J0520O27j9669J6303K795M73J1181K1867R118k0499m409K1392M884
15417D2588k6390J9106M822o352l0183k8906J2851P590K2381j4114R92Q229k717
$$ plain form
15404 9897 2156 -39644 -61031 -64403 -78324 -61639 -41461 -40141 -31103 -28180 -44475 -58621 -45418
15391 -45418 -44649 -57852 -45196 -28845 33 -5082 -3694 14785 -17790 -36442 -4007 8726
15379 8726 -5340 -3270 -20537 -1910 14114 31673 14591 1544 -16724 -29202 -5437 9321
15367 9321 -11749 -15451 -28856 -25139 -19447 -15106 8195 13301 -5483 -24446 -16521 14064 55303
15354 55303 63489 49265 7885 -16180 -11426 11296 28044 24348 4066 -8774 10104 37806
15342 37806 14561 15010 -7437 -18541 -11697 -4270 31150 33629 33378 8186 -3495 23180 31011
15329 31011 -2578 -7508 26116 14039 -2204 -33034 -11156 28313 17481 2724 -5507 -13848
15317 -13848 -15334 -6133 9633 54328 71207 38245 -7493 -38926 -27171 -25674 -19326 -5426
$$ packed form
15404I897p741m1800k1387l372j3921J6685K0178J320R038K923j6295j4146J3203
15391d5418P69j3203J2656J6351K8878n115J388J8479l2575j8652L2435J2733
15379H726j4066K070j7267J8627J6024J7559j7082j3047j8268j2478K3765J4758
15367I321k1070l702j3405L717N692M341K3301N106j8784j8963P925L0585M1239
15354E5303Q186j4224m1380k4065M754K2722J6748l696k0282j2840J8878K7702
15342C7806k3245M49k2447j1104O844P427L5420K479k51k5192j1681K6675P831
15329C1011l3589m930L3624j2077j6243l0830K1878L9469j0832j4757q231q341
15317a3848j486R201J5766M4695J6879l2962m5738l1433J1755J497O348J3900
$$ plain form
15305 -5426 12802 22851 29964 8260 12378 14985 -16098 -21134 -10509 3332 -16763 -8960 -5580
15292 -5580 -1916 9622 36002 30193 38925 28365 13854 12296 13949 6838 -12376 -39204 -47573
15279 -47573 -40592 -21210 3138 31083 39775 22246 10270 -15603 -23732 -20952 -16548 10045 -7365
15266 -7365 -22594 -37247 -26001 -12729 -14124 -15540 -15974 -20460 4666 28052 23516 16765 30910
15253 30910 34098 14678 7788 -1124 -16289 -4490 -712 -3742 1894 -5001 -777 2414 29458
15240 29458 5584 -17728 17162 7999 -23964 -32115 -41035 -37616 2142 18753 -10265 -32139
15228 -32139 -16032 4052 14814 5886 12042 19049 15007 5053 2228 -4713 5259 -6428 -25025
15215 -25025 -32419 -6259 5138 -1504 8494 -9155 -21346 -55115 -66084 -39538 -21491 -23890
$$ packed form
15305e426J8228J0049P113k1704M118K607l1083n036J0625J3841k0095P803L380
15292e580L664J1538K6380n809Q732j0560j4511j558J653p111j9214k6828q369
15279d7573O981J9382K4348K7945Q692j7529j1976k5873q129K780M404K6593j7410
15266g365j5229j4653J1246J3272j395j416m34m486K5126K3386m536o751J4145
15253C0910L188j9420o890q912j5165J1799L778l030N636o895M224L191K7044
15240B9458k3874k3312L4890r163l1963q151q920L419L9758J6611k9018k1874
15228c2139J6107K0084J0762q928O156P007m042r954k825o941R972j1687j8597
15215b5025p394K6160J1397o642R998j7649j2191l3769j0969K6546J8047k399
$$ plain form
15203 -23890 -32903 -16286 -10610 16596 22780 -25281 -39765 -22715 -7056 8333 11190 13125 -9498
15190 -9498 -24362 -27483 -32388 -35385 -18067 -246 10127 -7259 -37028 -41745 -42765 -31134 -36787
15177 -36787 -47906 -43077 -18800 -35453 -39940 16165 13367 -21506 -10317 -10108 -30578 -35685 -25014
15164 -25014 -21697 17899 -7556 -32897 -11380 16460 13813 -26360 -64661 -54632 -29085 -17325
15152 -17325 -17199 -4598 2652 -12679 -40699 -56504 -54067 -61932 -45904 -42279 -52483 -50081 -50581
15139 -50581 -40263 -43006 -42330 -34126 -10657 -16784 -22463 -10894 -3703 -18466 -22718 -39244 -52483
15126 -52483 -36148 -16013 5328 -24320 -48543 -42243 -22833 -13076 -5281 2096 -28976 -32971 2620
15113 2620 21233 -10558 -17243 -11162 -8897 -3303 13038 33005 25530 10000 13439 -30041 -42916
$$ packed form
15203b3890r013J6617N676K7206O184m8061j4484J7050J5659J5389K857J935k2623
15190i498j4864l121m905k997J7318J7821J0373j7386k9769m717j020J1631n653
15177c6787j1119M829K4277j6653m487N6105k798l4873J1189K09k0470n107J0671
15164b5014L317L9596k5455k5341K1517K7840k647m0173l8301J0029K5547J1760
15152a7325J26J2601P250j5331k8020j5805K437p865J6028L625j0204K402n00
15139e0581J0318k743O76Q204K3469o127n679J1569P191j4763m252j6526j3239
15126e2483J6335K0135K1341k9648k4223O300J9410R757P795P377l1072l995L5591
15113B620J8613l1791o685O081K265N594J6341J9967p475j5530L439m3480j2875
$$ plain form
15100 -42916 -39145 -24408 -3985 8111 15091 -17619 -47272 -40157 -40138 -22277 -5740 12533 38011
15087 38011 45192 42119 28921 30280 19657 2168 4460 1611 -17071 -5514 -9612 -37460 -40483
15074 -40483 -15621 11942 27297 29261 13931 25446 10702 -9479 2924 30026 67369 60857
15062 60857 48682 27321 9945 -6054 -18004 -27532 -8257 -4066 -19025 13707 24314 -8785
15050 -8785 -12110 -4430 1662 -139 16025 22219 31801 51281 43243 23985 28412 38226 35625 5337
15036 5337 11835 23612 14047 21729 36570 30588 -10290 -37315 -44738 -25451 -28344 -15124 2073
15023 2073 22322 21321 11814 -169 -6405 -11174 -14803 -6477 -13861 12492 7882 22088 27123 45525
15009 45525 29241 5481 -5722 -35890 -30232 -19773 -32648 -42923 -49978 -43818 -17353 -22126
$$ packed form
15100d2916L771J4737K0423J2096O980l2710k9653P115J9J7861J6537J8273K5478
15087C8011P181l073j3198J359j0623j7489K292k849j8682J1557m098k7848l023
15074d0483K4862K7563J5355J964j5330J1515j4744k0181J2403K7102L7343o512
15062F0857j2175k1361j7376j5999j1950r528J9275M191j4959L2732J0607l3099
15050h785l325P680O092j801J6164O194R582J9480q038j9258M427R814k601l0288
15036E337O498J1777r565P682J4841n982m0878k7025p423J9287k893J3220J7197
15023B073K0249j001r507j1983o236m769l629Q326p384K6353m610J4206N035J8402
15009D5525j6284k3760j1203l0168N658J0459j2875j0275p055O160K6465m773
$$ plain form
14997 -22126 -2189 17757 5668 -7991 1805 -2099 -8983 1078 -409 -8016 -22025 -25720 -731
14984 -731 -8251 -40671 -51276 -63082 -50602 -50328 -48776 -32648 -24110 -49888 -56719 -42058 -61858
14971 -61858 -32851 -21492 -36685 -34901 -42987 -33650 -16907 -21309 -8962 -9336 -22834 3219 3354
14958 3354 -11550 11755 36748 33248 26993 19080 12085 26153 34677 42279 11898 26640 39042
14945 39042 1151 -23826 -15812 -22350 -38891 -38379 -34051 -26730 -9597 -22236 -48254 -27256 -28502
14932 -28502 -34918 11200 7427 -8552 124 22913 10948 -16705 -36207 -30703 -21549 -11073 -27905
14919 -27905 -23191 9002 29437 10597 -29884 -61173 -58344 -44685 -17945 6973 17878 -22371
14907 -22371 -43220 -18029 12684 22772 41181 36967 2227 -18882 -20009 -7002 21069 16622
$$ packed form
14997b2126J9937J9946j2089j3659R796l904o884J0061j487p607j4009l695K4989
14984g31p520l2420j0605j1806J2480K74J552J6128Q538k5778o831J4661j9800
14971f1858K9007J1359j5193J784q086R337J6743m402J2347l74j3498K6053J35
14958C354j4904K3305K4993l500o255p913o995J4068Q524P602l0381J4742J2402
14945C9042l7891k4977Q014o538j6541N12M328P321J7133j2639k6018K0998j246
14932b8502o416M6118l773j5979Q676K2789j1965k7653j9502N504R154J0476j6832
14919b7905M714L2193K0435j8840m0481l1289K829J3659K6740K4918J0905m0249
14907b2371k0849K5191L0713J0088J8409m214l4740k1109j127J3007K8071m447
$$ plain form
14895 16622 -9100 -11606 -25682 -13088 8865 22785 389 -9098 -12474 -21690 8741 16812 10342
14882 10342 -2561 -2327 19616 11725 -18682 66 10644 5969 -12908 1640 17328 15962 22453
14869 22453 9955 -10030 -29537 -34314 -20521 -19594 -13377 -4964 -10291 3157 2831 14804 8210
14856 8210 10260 2723 5654 8230 6764 -6775 -39850 -18936 -471 -18117 18361 26635 27706
14843 27706 38916 29277 13169 13079 31844 32424 12806 -7352 -19160 6163 11079 17546 23165
14830 23165 59699 75524 58005 32755 26028 12010 2645 -9123 -11443 31043 30330 25175 14034
14817 14034 8728 -1089 8094 27093 5808 -2992 -24221 -35463 -24082 -10626 977 -6042 -23832
14804 -23832 -43829 -44120 -43174 -22721 -28112 -42968 -46969 -28390 -8528 -1649 -19935 -6491 -14153
$$ packed form
14895A6622k5722k506j4076J2594K1953J3920k2396r487l376r216L0431Q071o470
14882A0342j2903K34K1943p891l0407J8748J0578m675j8877J4548J5688j366O491
14869B2453j2498j9985j9507m777J3793R27O217Q413n327J3448l26J1973o594
14856H210K050p537K931K576j466j3539l3075K0914J8465j7646L6478Q274J071
14843B7706J1210r639j6108r0J8765N80j9618k0158j1808K5323M916O467N619
14830B3165L6534J5825j7519k5250o727j4018r365j1768k320M2486p13n155j1141
14817A4034n306r817R183J8999k1285q800k1229j1242J1381J3456J1603p019j7790
14804b3832j9997k91R46K0453n391j4856m001J8579J9862O879j8286J3444p662
$$ plain form
14791 -14153 -30125 -19304 -16958 -13043 -31290 -49058 -43660 -46941 -62146 -58823 -36815 -22163 -42513
14778 -42513 -42138 -6963 32889 40805 40839 31500 42323 26444 3682 -4839 163 -12778 -12606 12698
14764 12698 14106 2032 22297 21734 5719 -5511 12469 18929 -2792 -10557 -13734 -21013 -19234
14751 -19234 -24338 10024 25896 7341 -11281 -11018 -36898 -51681 -49127 -48597 -34873 -7395 12204
14738 12204 22886 34364 29744 12573 -269 -18993 -13049 -14557 -22590 581 5099 -2250 13558
14725 13558 9244 -11528 -11376 -5561 -3834 -5539 12128 46028 52969 35431 21990 21123 21416 -7358
14711 -7358 -25199 -18358 10290 2568 -37012 -48415 -14486 20169 6003 -19896 -26286 -10111
14699 -10111 -19363 -20267 -24123 -51948 -61519 -45945 -31484 -12589 -17147 -25010 2368 6338 -25000
$$ packed form
14791a4153j5972J0821K346L915j8247j7768N398l281j5205L323K2008J4652k0350
14778d2513L75L5175L9852P916L4r339J0823j5879k2762q521N002j2941J72K5304
14764A2698J408j2074K0265n63j6015j1230J7980O460k1721p765l177p279J779
14751a9234n104L4362J5872j8555j8622K63k5880j4783K554N30J3724K7478J9599
14738A2204J0682J1478m620j7171j2842j8724N944j508q033K3171M518p349J5808
14725A3558m314k0772J52N815J727j705J7667L3900O941j7538j3441q67K93k8774
14711g358j7841O841K8648p722l9580j1403L3929L4655j4166k5899o390J6175
14699a0111r252r04l856k7825r571J5574J4461J8895m558p863K7378L970l1338
$$ plain form
14686 -25000 -30119 -43817 -42741 -16156 -22888 -19443 -17978 -2913 449 -3669 -11912 -2003 -14107
14673 -14107 -24785 -37992 -24274 2056 16247 -12386 2818 5597 4982 24336 28656 22449 -3745
14660 -3745 -1862 4564 -6599 -25241 -21887 -15327 -21293 -1848 -19858 -45764 -69756 -47169 -26294
14647 -26294 7374 11524 2360 -5509 -14158 -1655 27432 30992 30049 32640 38822 43957 40868 15870
14633 15870 13856 -8344 -30103 -49873 -44061 -12332 12181 6441 13829 -1677 -14348 -237
14621 -237 -4456 8518 1951 1321 -10920 6226 -10042 -31151 -56491 -86042 -82262 -78413 -77937 -69598
14607 -69598 -27243 -1516 38366 33302 -10090 -8886 -7601 -28450 -32067 6641 18901 10810 14332
14594 14332 12345 13003 3859 -18837 -11738 -31963 -35942 -8527 -889 -18508 -31035 -33107 -9016
$$ packed form
14686b5000n119j3698J076K6585o732L445J465J5065L362m118q243R909j2104
14673a4107j0678j3207J3718K6330J4191k8633J5204K779o15J9354M320o207k6194
14660c745J883O426j1163j8642L354O560n966J9445j8010k5906k3992K2587K0875
14647b6294L3668M150r164p869q649J2503K9087L560r43K591O182N135l089k4998
14633A5870k014k2200k1759j9770N812L1729K4513n740P388j5506j2671J4111
14621b37m219J2974o567o30j2241J7146j6268k1109k5340k9551L780L849M76Q339
14607f9598M2355K5727L9882n064m3392J204J285k0849l617L8708J2260q091L522
14594A4332j987O58r144k2696P099k0225l979K7415P638j7619j2527k072K4091
$$ plain form
14581 -9016 -20846 -36061 -41825 -6247 -6963 -14490 -14531 23141 22716 1620 -18731 -40262 -38804 -30304
14567 -30304 1583 21630 24350 6845 -5101 -2318 -4216 -9480 18133 5398 9968 -20455 -44435
14554 -44435 -2841 40120 32385 27302 -7561 -21414 -34679 -37302 -30812 -23951 7914 38805 60805
14541 60805 43976 27100 2599 -10984 31322 44157 29995 -2092 -22488 -27948 -36937 -32643
14529 -32643 -38418 -47663 -42917 -11248 15871 25658 8320 3346 18448 23698 26227 38508 43225
14516 43225 28409 -1506 -26054 -56928 -48448 -24839 -11529 -44189 -34814 4520 -5728 -22271
14504 -22271 10048 48130 49058 38400 16899 19291 -6609 -5061 7106 46840 63292 47664
14492 47664 29679 6856 10667 21400 49293 69947 52937 4208 -18261 -35203 -43029 -43459
$$ packed form
14581i016j1830j5215n764L5578p16p527m1L7672m25k1096k0351k1531J458Q500
14567c0304L1887K0047K720j7505j1946K783j898n264K7613j2735M570l0423k3980
14554d4435M1594M2961p735n083l4863j3853j3265k623O490O861L1865L0891K2000
14541F0805j6829j6876k4501j3583M2306J2835j4162l2087k0396n460q989M294
14529c2643n775r245M746L1669K7119R787j7338m974J5102N250K529J2281M717
14516D3225j4816k9915k4548l0874Q480K3609J3310l2660R375L9334j0248j6543
14504b2271L2319L8082R28j0658k1501K392k5900J548J2167L9734J6452j5628
14492D7664j7985k2823L811J0733K7893K0654j7010m8729k2469j6942p826m30
$$ plain form
14480 -43459 -40881 9686 26488 23684 11188 10263 8099 -12608 -23867 -29325 -20325 -18432 -261
14467 -261 32142 41190 51920 13549 15982 28002 34250 4026 -17862 3306 26662 13007 30440
14454 30440 63961 45312 2073 -7165 4706 35744 13932 8307 17090 24154 1105 -32799
14442 -32799 -12527 25331 58449 44540 21638 5280 -13362 -23386 -63739 -47619 -20744 -5932
14430 -5932 18032 26762 17349 9942 -7429 -5789 -14257 -30568 -20548 -32315 -7705 7557 17748
14417 17748 28070 16395 -14377 -43719 -28384 -3560 -3101 3340 -11806 -17971 -20938 5506 6596
14404 6596 12440 15196 19285 16712 -9877 -14754 16282 4555 3811 31370 47038 33443 30278
14391 30278 18565 6528 -22589 -18714 -11842 -4804 24915 42416 47557 27870 40217 56461
$$ packed form
14480d3459K578N0567J6802k804j2496r25k164k0707j1259n458R000J893J8171
14467b61L2403R048J0730l8371K433J2020O248l0224k1888K1168K3356j3655J7433
14454C0440L3521j8649m3239r238J1871L1038k1812n625Q783P064k3049l3904
14442c2799K0272L7858L3118j3909k2902j6358j8642j0024m0353J6120K6875J4812
14430e932K3964Q730r413p407j7371J640q468j6311J0020j1767K4610J5262J0191
14417A7748J0322j1675l0772k9342J5335K4824M59O441j5146o165k967K6444J090
14404F596N844K756M089k573k6589m877L1036j1727p44K7559J5668j3595l165
14391C0278j1713j2037k9117L875O872P038K9719J7501N141j9687J2347J6244
$$ plain form
14379 56461 -4028 -34198 -31538 5247 5745 9635 12433 16147 3544 -17863 -15735 -26870 -33129
14366 -33129 -43695 -57126 -66771 -36718 -16293 -37842 -60968 -47794 -23173 -20618 -33486 -28061
14354 -28061 -21127 -8584 -18809 -36531 -35072 -16375 -15472 -46143 -47466 -43535 -31131 -20622 -26836
14341 -26836 -44373 -18840 -10437 20675 37555 26663 -4604 -5891 12629 2882 5737 16333
14329 16333 28726 48801 43916 39659 33707 25148 14806 25512 19436 -10530 -1479 22067 26184
14316 26184 31667 46241 42903 32605 49983 37697 9984 1743 983 -19523 -43430 -43244 -31128
14303 -31128 -15526 19250 34317 52688 77959 89244 50644 39036 34263 -2952 -11320 -6583
14291 -6583 -9330 -32293 -21512 4562 15342 33287 36064 16636 -22629 -24454 12041 30789
$$ packed form
14379E6461o0489l0170K660L6785M98L890K798L714j2603k1407K128j1135o259
14366c3129j0566j3431r645L0053K0425k1549k3126J3174K4621K555j2868N425
14354b8061O934J2543j0225j7722J459J8697R03l0671j323L931J2404J0509o214
14341b6836j7537K5533Q403L1112J6880j0892l1267j287J8520r747K855J0596
14329A6333J2393K0075m885m257n952q559j0342J0706o076k9966R051K3546M117
14316B6184N483J4574l338j0298J7378j2286k7713q241p60k0506k3907J86J2116
14303c1128J5602L4776J5067J8371K5271J1285l8600j1608m773l7215q368M737
14291f583k747k2963J0781K6074J0780J7945K777j9428l9265j825L6495J8748
$$ plain form
14279 30789 18846 8668 27945 14722 11041 13438 -5259 -13781 -21365 -35006 -39284 -22735 -46628
14266 -46628 -49631 -17826 18564 24085 -1639 -24768 -27964 -30844 -5616 4601 -7563 -18521
14254 -18521 -24588 -11981 -6425 1340 8626 10493 -44662 -63805 -41943 -26292 -3238 6621 9622
14241 9622 -5385 -17902 -40065 -34266 -21739 -30104 -39689 -15961 11936 17508 7558 5399 7728
14228 7728 24311 -8086 -28147 -26939 -18483 -14279 -10675 6421 42158 37800 11789 12619 -18382
14215 -18382 -13721 4778 36193 39464 22451 7196 -575 1363 9954 14945 20109 16526 -10870
14202 -10870 -8157 -7297 -2679 -4764 -1559 25297 36346 36468 59664 67169 53443 44272 14738 17013
14188 17013 32660 17157 5680 10242 6274 7890 19480 2411 -22039 -23622 -14629 7751 22700
$$ packed form
14279C0789j1943j0178J9277j3223l681K397j8697q522p584j3641m278J6549k3893
14266d6628l003L1805L6390N521k5724k3129l196k880K5228J0217j2164j0958
14254a8521o067J2607N556P765P286J867n5155j9143K1862J5651K3054R859L001
14241I622j5007j2517k2163N799J2527q365r585K3728K7897N572r950k159K329
14228G728J6583l2397k0061J208Q456M204L604J7096L5737m358k6011Q30l1001
14215a8382M661J8499L1415L271j7013j5255p771J938Q591M991N164l583k7396
14202a0870K713Q60M618k085L205K6856J1049J22K3196P505j3726r171k9534K275
14188A7013J5647j5503j1477M562l968J616J1590j7069k4450j583Q993K2380J4949
$$ plain form
14175 22700 12162 -13467 -11700 13527 9103 -21782 -40428 -42980 -25535 -16254 -9036 -30576 -20592
14162 -20592 -46542 -58718 -40001 -43724 -46085 -18342 8560 -934 -5903 10889 41883 56116
14150 56116 22327 -3815 22297 32257 37305 17530 -11305 1756 13485 1923 12854 26880
14138 26880 27135 5756 -26174 -33753 -32864 -1591 -12055 -16480 -33685 -32992 -24490 -2043 1889 75
14124 75 -33900 -50217 -55898 -36369 -34683 -9368 45361 44281 44547 29172 5248 24253 23426 -30107
14110 -30107 -15727 7708 16612 12765 24535 26644 22882 31992 50886 54633 45458 67025 54405
14097 54405 11119 -5618 2261 -4655 -21663 -8705 -4955 -17220 -17192 -22479 -22091 -27777 -13408 17184
14083 17184 15995 8474 8380 -30077 -32001 -6965 15106 -102 -13899 -17786 12882 42193 9303
$$ packed form
14175B2700j0538k5629J767K5227m424l0885j8646k552J7445R281P218k1540R984
14162b0592k5950j2176J8717l723k361K7743K6902r494m969J6792L0994J4233
14150E6116l3789k6142K6112R960N048j9775k8835J3061J1729j1562J0931J4026
14138B6880K55k1379l1930p579Q89L1273j0464m425j7205O93Q502K2447L932j814
14124G5l3975j6317n681J9529J686K5315N4729j080K66j5375k3924J9005q27n3533
14110c0107J4380K3435Q904l847J1770K109l762R110J8894L747r175K1567j2620
14097E4405m3286j6737P879o916j7008J2958L750j2265K8n287L88n686J4369L0592
14083A7184j189p521r4l8457j924K5036K2071j5208j3797l887L0668K9311l2890
$$ plain form
14070 9303 -12382 -622 6567 3851 4894 17745 36065 66552 86512 63358 33572 938
14058 938 5511 4400 -14962 -3161 -12889 -14368 689 -15309 -5421 -4155 5774 10544 14257 24912
14044 24912 13544 23872 11715 3859 8313 -9865 -17781 -2721 23369 17488 29143 46744
14032 46744 40449 29901 18476 10904 22220 39356 69109 101331 108323 137593 171246 194420
14020 194420 202374 280192 392231 562635 863388 1339817 1942842 2321844 2110505 1609855
14010 1609855 1113026 754266 512478 347285 240171 210121 223410 201427 164903 140500
14000 140500 117562 111337 108673 126368 117896 117262 109997 103051 115134 116765 166545 263028 319963
13987 319963 374000 405914 446046 427835 358434 280178 185889 130571 111682 111619 78680 83391
$$ packed form
14070I303k1685J1760P189k716J043J2851J8320L0487J9960k3154k9786l2634
14058I38M573j111j9362J1801r728j479J5057j5998R888J266R929M770L713J0655
14044B4912j1368J0328j2157p856M454j8178p916J5060K6090n881J1655J7601
14032D6744o295j0548j1425p572J1316J7136K9753L2222O992K9270L3653K3174
14020A94420P954P7818J12039J70404L00753M76429O03025L79002k11339n00650
14010A609855m96829l58760k41788j65193j07114l0050J3289k1983l6524k4403
14000A40500k2938o225k664J7695q472o34p265o946J2083J631M9780R6483N6935
13987C19963N4037L1914M0132j8211o9401p8256r4289n5318j8889o3l2939M711
$$ plain form
13975 83391 108328 123491 112370 107141 111601 91493 64482 59320 61779 62785 61070 48247 52857
13962 52857 70355 86186 110819 122674 115980 144450 158880 223904 298375 380171 486724 584109
13950 584109 619886 635275 656638 646605 596407 525565 414845 331224 288257 244846 210101
13939 210101 188215 189826 184115 149781 104067 91203 97817 109639 107529 118395 115761 93629
13927 93629 70653 62594 57549 69707 72869 67983 70242 90374 126082 147000 181608 202417 248087
13914 248087 335391 442600 499251 436927 370019 300235 207420 156499 127374 110990 102157
13903 102157 127315 151455 156231 109551 87318 106442 95015 62689 39138 58830 103067 153303
13891 153303 179765 252561 339582 423537 464201 416385 345275 262179 200190 139225 96765
$$ packed form
13975H3391K4937J5163j1121n229M460k0108k7011n162K459J006j715j2823M610
13962E2857J7498J5831K4633J1855o694K8470J4430O5024P4471Q1796J06553R7385
13950E84109L5777J5389K1363j0033n0198p0842j10720q3621m2967m3411l4745
13939B10101k1886J611n711l4334m5714j2864O614J1822k110J0866k634k2132
13927I3629k2976q059n045J2158L162m886K259K0132L5708K0918L4608K0809M5670
13914B48087Q7304J07209N6651o2324o6908o9784r2815n0921k9125j6384q833
13903A02157K5158K4140M776m6680k2233J9124j1427l2326k3551J9692M4237N0236
13891A53303K6462P2796Q7021Q3955M0664m7816p1110q3096o1989o0965m2460
$$ plain form
13880 96765 83474 75644 94578 92747 76184 53147 29859 13590 18251 20002 39626 40782 31341
13867 31341 30517 47100 42218 47920 48162 50927 54776 41660 63591 74727 100768 159338 247503
13854 247503 326212 430996 547925 671528 732493 742992 702154 593735 471423 364479
13844 364479 276318 230532 168392 165257 174878 175917 168168 144602 105437 106684 110244 83700 63069
13831 63069 93500 87734 86584 114043 84254 96464 117036 87080 75473 103977 116283 119264
13819 119264 131722 136886 180173 231583 303537 397824 494728 534278 474887 431616 348814 291591
13807 291591 239854 182612 166682 140276 114587 113517 109104 92697 97549 102060 138157 196506
13795 196506 234706 236756 269922 332982 356958 313515 222574 141599 113355 112001 107021 118715
$$ packed form
13880I6765j3291p830J8934j831j6563k3037k3288j6269M661J751J9624J156r441
13867C1341q24J6583m882N702K42K765L849j3116K1931J1136K6041N8570Q8165
13854B47503P8709J04784J16929J23603O0965J0499m0838j08419j22312j06944
13844C64479q8161m5786o2140l135R621J039p749k3566l9165J247L560k6544k0631
13831F3069L0431n766j150K7459k9789J2210K0572k9956j1607K8504J2306K981
13819A19264J2458N164M3287N1410P1954R4287R6904L9550n9391m3271q2802n7223
13807B91591n1737n7242j5930k6406k5689j070m413j6407M852M511L6097N8349
13795A96506L8200K050L3166O3060K3976m3443r0941q0975k8244j354m980J1694
$$ plain form
13783 118715 138537 155613 124739 113784 126875 91596 76581 72260 54246 40589 21798 6100
13771 6100 15368 25524 5472 -11305 -23597 -4366 28007 47513 70690 76430 73266 64008 60128
13758 60128 72031 48316 51507 29132 12556 12038 35164 36575 47362 23620 39181 77677
13746 77677 114444 144474 166452 169832 150113 141300 90599 55037 30664 17752 5498 28737
13734 28737 61171 104273 127321 127957 142991 172567 191518 184608 162732 124120 88648 79144
13722 79144 94850 75295 55706 59321 67764 61523 89860 93714 105187 123731 106922 84141
13710 84141 102440 144151 159140 170484 171318 193493 219956 207457 204839 178883 154561 154808 147590
13697 147590 145892 127876 85951 100913 157466 264512 458521 621583 630184 543376 449013
$$ packed form
13783A18715J9822J7076l0874j0955J3091l5279j5015m321j8014j3657j8791j5698
13771F100R268J0156k0052j6777j2292J9231L2373J9506K3177N740l164r258l880
13758F0128J1903k3715L191k2375j6576n18K3126J411J0787k3742J5561L8496
13746G7677L6767L0030K1978L380j9719q813n0701l5562k4373j2912j2254K3239
13734B8737L2434M3102K3048O36J5034K9576J8951o910k1876l8612l5472r504
13722G9144J5706j9555j9589L615Q443o241K8337L854J1473J8544j6809k2781
13710H4141J8299M1711J4989J1344Q34K2175K6463j2499k618k5956k4322K47p218
13697A47590j698j8016m1925J4962N6553J07046J94009J63062Q601q6808r4363
$$ plain form
13686 449013 329326 238124 202058 184468 165450 153561 160866 197110 226997 241603 252477
13675 252477 212877 193267 187812 168012 125138 89345 89883 140715 199766 178668 52308 -39516
13663 -39516 -78536 -108476 -111531 -41088 35144 89630 117634 163249 191261 199950 196680 162742
13651 162742 152428 148068 136602 154620 173375 150462 152902 179458 212182 210695 215456 241918
13639 241918 262976 242792 227132 197989 175818 166423 138044 141646 152024 163394 189713 224677
13627 224677 241681 235901 272976 298476 273938 271519 278801 288533 323628 350480 377857 391611
13615 391611 362247 312133 282279 258249 268924 280680 297993 317127 347559 374249 418936
13604 418936 456587 449011 463476 487123 466585 418002 405062 421883 476100 503697 525875 508751
$$ packed form
13686D49013j19687r1202l6066j7590j9018j1889P305L6244K9887J4606J0874
13675B52477l9600j9610n455j9800m2874l5793N38N0832N9051k1098j26360r1824
13663c9516l9020k9940l055P0443P6232N4486K8004M5615K8012Q689l270l3938
13651A62742j0314m360j1466J8018J8755k2913K440K6556L2724j487M761K6462
13639B41918K1058k0184j5660k9143k2171r395k8379L602J0378J1370K6319L4964
13627B24677J7004n780L7075K5500k4538k419P282R732L5095K6852K7377J3754
13615C91611k9364n0114k9854k4030J0675J1756J7313J9134L0432K6690M4687
13604D18936L7651p576J4465K3647k0538m8583j2940J6821N4217K7597K2178j7124
$$ plain form
13592 508751 527218 531920 547787 599418 644716 682665 738451 798246 848495 882474 975218 1107352
13580 1107352 1220530 1310683 1387679 1466834 1529779 1620019 1683546 1740880 1810991 1951431 2086403
13569 2086403 2224197 2355121 2487624 2714022 2962555 3216589 3445724 3676644 3988546
13560 3988546 4306521 4690838 5157034 5724409 6374149 7040517 7820755 8851621 10235649
13551 10235649 12073143 14633151 17937507 21531386 25952192 32358035 42096653 57384437
13543 57384437 81870455 122088026 189582989 300527528 435598767 474386459 389485170
13536 389485170 281529696 192254686 129463297 91990920 71056003 59921534 55557175
13529 55557175 56976665 64487932 78473111 95595792 105469223 99594411 83270232 65177634
$$ packed form
13592E08751J8467M702J5867N1631M5298L7949N5786N9795N0249L3979R2744J32134
13580A107352J13178R0153P6996P9155O2945R0240O3527N7334P0111J40440J34972
13569B086403J37794J30924J32503K26398K48533K54034K29135K30920L11902
13560C988546L17975L84317M66196N67375O49740O66368P80238J030866J384028
13551A0235649J837494K560008L304356L593879M420806O405843R738618J5287784
13543E7384437K4486018M0217571O7494963J10944539J35071239L8787692q4901289
13536C89485170j07955474q9275010o2791389l7472377k0934917j1134469m364359
13529E5557175J419490P511267J3985179J7122681R873431n874812j6324179j8092598
$$ plain form
13521 65177634 49556524 37890133 29856232 24396872 20590893 17840895 15865458 14419737
13513 14419737 13478239 13108153 13274399 13943646 15002643 16116642 16741154 16496917 15492471
13504 15492471 14282512 13354449 12971880 13108234 13800232 15181067 17508543 21156945 26752173
13495 26752173 35377970 48204529 65262223 84410808 101434547 114645845 123127902
13488 123127902 123339945 116776888 108142968 96635642 81052981 64395934 49489366
13481 49489366 37733063 29356615 23659762 19803224 17197698 15440056 14301169 13756660
13473 13756660 13801721 14372244 15283303 16001293 16005963 15220712 13941770 12670025 11621880
13464 11621880 11020017 10876383 11233161 12123265 13613811 15940900 19479682 24810148 32902521
$$ packed form
13521F5177634j5621110j1666391q033901n459360l805979k749998j975437j445721
13513A4419737r41498l70086J66246O69247J058997J113999O24512k44237j004446
13504A5492471j209959r28063l82569J36354O91998J380835K327476L648402N595228
13495B6752173Q625797J2826559J7057694J9148585J7023739J3211298Q482057
13488A23127902K12043o563057q633920j1507326j5582661j6657047j4906568
13481D9489366j1756303q376448n696853l856538k605526j757642j138887n44509
13473A3756660M5061N70523R11059P17990M670p85251j278942j271745j048145
13464A1621880o01863j43634L56778Q90104J490546K327089L538782N330466Q092373
$$ plain form
13455 32902521 45213924 62942873 83446701 95709052 91108529 75576625 58247156
13448 58247156 43446850 32563419 25266270 20482755 17238007 14995060 13490514 12578501
13440 12578501 12151292 12135062 12609564 13746880 15691320 18802313 23616027 31060658 42710812
13431 42710812 60106546 80922960 93797454 89506486 74227321 57115720 42446317
13424 42446317 31605312 24266430 19390164 16069552 13780230 12148106 10998004 10241780
13416 10241780 9782511 9608169 9719074 10084027 10687143 11350756 12047449 12714759 13003623
13407 13003623 12723669 12242226 11939719 11990325 12535165 13650884 15525075 18455104 22943116
13398 22943116 29718549 39621919 53493872 73135078 99907848 128967531 149881726
$$ packed form
13455C2902521J2311403J7728949K0503828J2262351m600523j5531904j7329469
13448E8247156j4800306j0883431p297149m783515l244748k242947j504546r12013
13440A2578501m27209j6230M74502J137316J944440L110993M813714P444631J1650154
13431D2710812J7395734K0816414J2874494m290968j5279165j7111601j4669403
13424D2446317j0841005p338882m876266l320612k289322j632124j150102p56224
13416A0241780m59269j74342J10905L64953O03116O63613O96693O67310K88864
13407A3003623k79954m81443l02507N0606N44840J115719J874191K930029M488012
13398B2943116O775433R903370J3871953J9641206K6772770K9059683K0914195
$$ plain form
13391 149881726 155108125 144926332 123450894 97322948 73904949 55806605 42318002
13384 42318002 32697577 25993071 21263486 17897458 15565641 13993779 13063473 12674563
13376 12674563 12771469 13054875 13131015 12809324 12171172 11311231 10469608 9723912 9133314 8798568
13366 8798568 8757952 9028350 9642872 10708822 12293601 14576223 17932131 22964171 30619913
13357 30619913 42400984 59884291 81282832 95836826 92799408 77098305 58761316
13350 58761316 42793401 30943550 22956305 17665714 14029182 11462321 9600282 8205325
13342 8205325 7143740 6316349 5655426 5156703 4796790 4471554 4156358 3859245 3559833
13333 3559833 3283918 2993618 2750791 2561939 2408409 2277395 2183529 2130045 2091205 2078235
$$ packed form
13391A49881726N226399j0181793k1475438k6127946k3417999j8098344j3488603
13384D2318002r620425o704506m729585l366028k331817j571862r30306l88910
13376A2674563R6906K83406P6140l21691o38152q59941q41623p45696n90598l34746
13366H798568m0616K70398O14522J065950J584779K282622L355908N032040P655742
13357C0619913J1781071J7483307K1398541J4553994l037418j5701103j8336989
13350E8761316j5967915j1849851p987245n290591l636532k566861j862039j394957
13342H205325j061585q27391o60923m98723l59913l25236l15196k97113k99412
13333C559833k75915k90300k42827j88852j53530j31014r3866n3484l8840j2970
$$ plain form
13323 2078235 2083487 2001659 1864962 1724800 1590960 1479426 1375369 1313079 1250133 1232009
13313 1232009 1219814 1162418 1121939 1105500 1088683 1086259 1080396 1048919 1014661 962659 904587 849161
13301 849161 811474 780680 773745 778300 781832 756392 764834 770917 757203 718731 705492 736792
13289 736792 752007 748331 745830 751854 719774 684055 661410 672296 641140 607080 566127 555090
13277 555090 553223 542994 541692 557029 562275 597673 621120 617465 619884 607425 574364 576061 556728
13264 556728 500872 481154 459786 446579 461168 471958 460755 455393 424015 383149 368232 390316
13252 390316 405001 378394 385950 413588 430167 441664 412468 396873 386534 355941 308341 273728
13240 273728 260947 252956 269207 286549 321035 367873 378681 353012 355906 361646 361504 388136
$$ packed form
13323B078235N252q1828j36697j40162j33840j11534j04057o2290o2946j8124
13313A232009j2195n7396m0479j6439j6817k424n863l1477l4258n2002n8072n5426
13301H49161l7687l0794o935M555L532k5440Q442O083j3714l8472j3239L1300
13289G36792J5215l676k501O024l2080l5719k2645J0886l1156l4060m0953j1037
13277E55090j867j0229j302J5337N246L5398K3447l655K419j2459l3061J697j9333
13264E56728n5856j9718k1368j3207J4589J0790j1203n362l1378m0866j4917K2084
13252C90316J4685k6607P556K7638J6579J1497k9196j5595j0339l0593m7600l4613
13240B73728j2781p991J6251J7342L4486M6838J0808k5669K894N740j42K6632
$$ plain form
13228 388136 378499 354345 369294 383453 394880 376690 361906 361391 363447 374951 358115 323991
13216 323991 279902 249172 248187 250648 270389 289633 290060 253580 219662 210370 187440 162324 136948
13203 136948 94718 90419 117180 170485 213728 246844 238589 221477 221819 226502 226565 234949 211957
13190 211957 191207 204678 230793 232435 217295 231585 240246 245555 244693 247114 221591 212246 206080
13177 206080 179724 178026 197608 195646 170361 176668 192929 189142 190700 193313 178890 186431 194676
13164 194676 180801 175586 181453 183322 182464 179101 189234 176970 174127 188289 183003 170517 155987
13151 155987 130723 123689 144595 156135 144499 169943 193206 200308 175975 182069 178319 205403
13139 205403 205756 207399 231077 253260 212835 200682 187686 173717 201800 202546 171536 167916 182200
$$ packed form
13228C88136r637k4154J4949J4159J1427j8190j4784n15K056J1504j6836l4124
13216C23991m4089l0730r85K461J9741J9244M27l6480l3918r292k2930k5116k5376
13203A36948m2230m299K6761N3305M3243L3116q255j7112L42M683O3Q384k2992
13190B11957k0750J3471K6115J642j5140J4290Q661N309q62K421k5523r345o166
13177B06080k6356j698J9582j962k5285O307J6261l787J558K613j4423P541Q245
13164A94676j3875n215N867J869q58l363J0133j2264k843J4162n286j2486j4530
13151A55987k5264p034K0906J1540j1636K5444K3263P102k4333O094l750K7084
13139B05403L53J643K3678K2183m0425j2153j2996j3969K8083P46l1010l620J4284
$$ plain form
13126 182200 196051 191538 191200 182984 168127 160464 149843 151455 138295 112996 118470 127596 132161
13113 132161 133275 92630 90112 123487 159398 183365 171235 144119 135356 141190 160771 146579
13101 146579 143837 132807 128233 128296 152606 161691 149915 115171 100840 87677 100934 125636 129197
13088 129197 129407 141994 174173 181617 201121 202155 184496 161514 168603 183290 223477 250669
13076 250669 251475 252183 265772 261818 288591 298357 269120 242228 251887 243913 290315 338184 389073
13063 389073 492653 627952 822099 1140848 1665598 2361666 2808224 2622906 2093714 1574231
13053 1574231 1141708 836564 674437 579458 526398 476621 429382 380028 349662 342335 330190
13042 330190 287881 260436 289144 336586 358437 372614 370129 370612 338481 313688 277871 266054
$$ packed form
13126A82200J3851m513l38q216j4857p663j0621J612j3160k5299N474R126M565
13113A32161J114m0645k518L3375L5911K3967j2130k7116q763N834J9581j4192
13101A46579k742j1030m574O3K4310R085j1776l4744j4331j3163J3257K4702L561
13088A29197K10J2587L2179P444J9504J034j7659k2982P089J4687M0187K7192
13076B50669Q06P08J3589l954K6773R766k9237k6892R659p974M6402M7869N0889
13063C89073J03580J35299J94147L18749N24750O96068M46558j85318n29192n19483
13053A574231m32523l05144j62127r4979n3060m9777m7239m9354l0366p327j2145
13042C30190m2309k7445K8708M7442K1851J4177k485M83l2131k4793l5817j1817
$$ plain form
13030 266054 276783 311646 301708 300548 356907 437556 514408 614336 680630 709294 700859 683117
13018 683117 675433 627002 574426 495707 410264 323981 296398 323962 375850 396135 374746 305605
13006 305605 254260 201305 183661 218253 248727 285998 351403 414727 467453 434487 372454
12995 372454 297617 246275 209377 198616 222383 236495 241445 271064 324564 378354 477543 543942
12983 543942 550149 498769 425100 352302 292653 249708 225452 227671 224737 229342 243722 313036
12971 313036 395510 456709 464720 432608 410631 429323 479478 540737 597190 624537 590928 588045
12959 588045 559534 475209 390064 316556 261391 227101 189598 161720 158073 146202 110073 102719
12947 102719 115501 138149 145133 151003 125101 132500 146686 122360 119255 154996 174159 201901
$$ packed form
13030B66054J0729L4863r938j160N6359Q0649P6852R9928O6294K8664q435j7742
13018F83117p684m8431n2576p8719q5443q6283k7583K7564N1888K0285k1389o9141
13006C05605n1345n2955j7644L4592L0474L7271O5405O3324N2726l2966o2033
12995C72454p4837n1342l6898j0761K3767J4112M950K9619N3500N3790R9189O6399
12983E43942O207n1380p3669p2798n9649m2945k4256K219k934M605J4380O9314
12971C13036Q2474O1199Q011l2112k1977J8692N0155O1259N6453K7347l3609k883
12959E88045k8511q4325q5145p3508n5165l4290l7503k7878l647j1871l6129p354
12947A02719J2782K2648O984N870k5902P399J4186k4326l105L5741J9163K7742
$$ plain form
12935 201901 238578 280284 338771 415994 501330 531656 566600 693039 795665 869128 896159
12924 896159 873264 786056 674504 579042 501537 426120 324442 255777 250308 207661 190236
12913 190236 176291 149903 151417 163314 168954 171987 172733 153933 129041 136075 126252 134443 146547
12900 146547 147615 139079 134898 113987 129051 198622 270410 309822 323026 348852 409693 471923
12888 471923 514345 505186 459114 362073 297986 255764 224144 186017 155446 151639 128925 108188
12876 108188 73276 33101 56347 73336 79839 62538 91806 109596 115582 115940 95385 71934
12864 71934 55096 34107 46420 60575 73312 97093 74722 69026 62888 75393 79571 61373
12852 61373 51546 62825 85083 92402 70862 42217 69967 75785 68379 86110 85680 57602 54735
$$ packed form
12935B01901L6677M1706N8487P7223Q5336L0326L4944J26439J02626P3463K7031
12924H96159k2895q7208j11552r5462p7505p5417j01678o8665n469m2647j7425
12913A90236j3945k6388J514J1897N640L033P46j8800k4892P034r823Q191J2104
12900A46547J068q536m181k0911J5064O9571P1788L9412J3204K5826O0841O2230
12888D71923M2422r159m6072r7041o4087m2222l1620l8127l0571l807k2714k0737
12876A08188l4912m0175K3246J6989O503j7301K9268J7790N986L58k0555k3451
12864G1934j6838k0989J2313J4155J2737K3781k2371n696o138J2505M178j8198
12852F1373r827J1279K2258P319k1540k8645K7750N818p406J7731m30k8078k867
$$ plain form
12839 54735 27357 -6442 -3359 52367 77165 67560 56973 84315 94383 87680 99073 92609
12827 92609 100161 82153 58650 56364 66491 72867 77164 75241 83260 36970 39594 37457 75819
12814 75819 98930 102433 75314 52218 51586 58868 57986 49207 29947 22217 26092 40481 28179
12801 28179 15684 7868 15097 36511 22578 9223 14727 49431 57012 36400 53161 68319
12789 68319 67086 74010 79943 71428 51767 51346 32208 40684 43111 6876 -3570 13207 15742
12776 15742 29370 40813 42217 71554 86871 62267 60400 57498 49243 83871 87035 60923 44711
12763 44711 45186 49896 36530 20527 32165 37576 25867 33420 32310 33188 57680 79003 81886
12750 81886 75782 89860 91505 110554 96590 78093 46248 37756 47618 59420 65290 69859 42114
$$ packed form
12839E4735k7378l3799L083N5726K4798r605j0587K7342J0068o703J1393o464
12827I2609P552j8008k3503k286J0127O376M297j923Q019m6290K624k137L8362
12814G5819K3111L503k7119k3096o32P282q82q779j9260p730L875J4389j2302
12801B8179j2495p816P229K1414j3933j3355N504L4704P581k0612J6761J5158
12789F8319j233O924N933q515j9661m21j9138Q476K427l6235j0446J6777K535
12776A5742J3628J1443J404K9337J5317k4604j867k902q255L4628L164k6112j6212
12763D4711M75M710j3366j6003J1638N411j1709P553j110Q78K4492K1323K883
12750H1886o104J4078J645J9049j3964j8497l1845q492R862J1802N870M569k7745
$$ plain form
12737 42114 35576 44000 66248 86999 78554 69659 67893 65361 69742 39540 24222 28021 38323
12724 38323 63409 94201 64385 65089 68465 68790 64340 42051 12243 -11278 6561 4137 44041
12711 44041 61391 50362 52389 40283 13127 -1608 13013 2071 25519 47705 40315 37695
12699 37695 20916 8246 1393 17096 7881 32074 34217 33735 8637 16611 20578 14362 52084
12686 52084 59236 65102 48008 46772 33310 6251 26817 33415 42481 45701 58814 67526 48853
12673 48853 29562 43674 28803 16240 10523 14440 32783 16848 8534 11889 11351 31323 36888
12660 36888 19562 650 -7848 10973 47377 42979 24065 14881 40544 46155 54892 58214 43790
12647 43790 25067 28659 34651 56701 79371 73640 59153 34723 6942 29998 53162 41022
$$ packed form
12737D2114o538Q424K2248K0751q445q895j766k532M381l0202j5318L799J0302
12724C8323K5086L0792k9816P04L376L25m450k2289k9808k3521J7839k424L9904
12711D4041J7350j1029K027j2106k7156j4735J4621j0942K3448K2186p390k620
12699C7695j6779j2670o853J5703r215K4193K143m82k5098P974L967o216L7722
12686E2084P152N866j7094j236j3462k7059K0566O598R066L220J3113Q712j8673
12673D8853j9291J4112j4871j2563n717L917J8343j5935q314L355n38J9972N565
12660C6888j7326j8912q498J8821L6404m398j8914r184K5663N611Q737L322j4424
12647D3790j8723L592N992K2050K2670n731j4487k4430k7781K3056K3164j2140
$$ plain form
12635 41022 37381 61834 67811 55350 35499 35723 33910 18926 -2897 10949 20422 39491 51101
12622 51101 55150 47803 59093 54909 19318 36955 33529 12090 17328 16191 33473 41577 27401
12609 27401 8298 7700 13392 7773 -7939 -13433 1571 15449 16424 23892 21650 11791 -11918 -3333
12595 -3333 7181 30827 -2206 12557 24565 10257 -5512 -9086 -22569 -34302 -3587 19448
12583 19448 34815 30051 14172 7911 14114 38417 39946 28537 36112 37740 56055 50731 36220
12570 36220 30323 -292 9371 33228 55892 61937 50602 39079 37849 4607 13008 11959 16721
12557 16721 32237 42614 39970 23994 14784 32947 42349 37591 29887 49973 48257 23973 -20190
12544 -20190 -7724 -14299 -48218 -20161 4143 13872 16001 30526 16799 -9641 -29732 -33721
$$ packed form
12635D1022l641K4453N977j2461j9851K24j813j4984k1823J3846R473J9069J1610
12622E1101M049p347J1290m184l5591J7637l426k1439N238j137J7282Q104j4176
12609B7401j9103n98N692n619j5712n494J5004J3878R75P468k242r859k3709Q585
12595c333J0514K3646l3033J4763J2008j4308j5769l574j3483j1733L0715K3035
12583A9448J5367m764j5879o261O203K4303J529j1409P575J628J8315n324j4511
12570C6220n897l0615R663K3857K2664O045j1335j1523j230l3242Q401j049M762
12557A6721J5516J0377k644j5976r210J8163R402m758p704K0086j716k4284m4163
12544b0190J2466o575l3919K8057K4304R729K129J4525j3727k6440k0091l989
$$ plain form
12532 -33721 -13080 -6511 25786 44407 55439 30482 51755 83578 77782 74771 97004 56615
12520 56615 27475 45978 29889 33144 47069 53790 37763 43301 85763 63380 18259 -3328
12508 -3328 10181 39132 44013 45364 33984 41478 38447 17732 189 22869 38234 37913 22294
12495 22294 7121 -13796 5297 37293 67251 95554 71291 46389 24785 27675 27387 12734
12483 12734 3784 -8950 -4020 -8831 14822 33603 46900 33974 23957 7079 13296 15768 25002
12470 25002 41181 21548 1843 7359 33719 44439 21778 30871 51912 51502 57719 64507 36429
12457 36429 35748 45484 52084 40374 18206 20502 44729 53065 25786 11068 -16338 -42951 -27996
12444 -27996 -9540 8925 -609 -19749 -1477 16484 35196 41798 47732 39781 23160 24957 20303
$$ packed form
12532c3721K0641O569L2297J8621J1032k4957K1273L1823n796l011K2233m0389
12520E6615k9140J8503j6089L255J3925O721j6027N538M2462k2383m5121k1587
12508c328J3509K8951M881J351j1380P494l031k0715j7543K2680J5365l21j5619
12495B2294j5173k0917J9093L1996K9958K8303k4263k4902k1604K890k88j4653
12483A2734q950j2734M930m811K3653J8781J3297j2926j0017j6878O217K472R234
12470B5002J6179j9633j9705N516K6360J0720k2661R093K1041m10O217O788k8078
12457C6429o81R736O600j1710k2168K296K4227Q336k7279j4718k7406k6613J4955
12444b7996J8456J8465r534j9140J8272J7961J8712O602N934p951j6621J797m654
$$ plain form
12431 20303 14374 24228 24415 19906 33827 47390 26419 41214 71157 65657 49474 51308 62717
12418 62717 44064 31843 38772 52825 37299 53659 67078 77309 85399 86622 50335 22182
12406 22182 12214 23129 27936 14280 -5942 5817 23343 25292 30749 26451 29229 1738 -423
12393 -423 25144 48750 32512 33129 28931 5349 -22405 -26780 -32938 -33968 -44066 -20621 8478
12380 8478 1272 16268 8044 1506 -11674 -35857 -48410 -42318 -3896 -6063 -2120 -16487 -38895
12367 -38895 -15655 22369 47543 39474 39142 63924 68134 52496 51979 31478 10228 21344 30947
12354 30947 40040 8807 3913 7052 10735 24585 62688 64964 44909 38620 22697 12422 25579
12341 25579 27676 20616 31494 29230 21488 -9226 -28285 21705 46344 29194 30806 41869 31689
$$ packed form
12431B0303n929R854J87m509J3921J3563k0971J4795K9943n500j6183J834J1409
12418F2717j8653j2221O929J4053j5526J6360J3419J0231Q090J223l6287k8153
12406B2182r968J0915M807j3656k0222J1759J7526J949N457m298K778k7491k161
12393d23K5567K3606j6238O17m198k3582k7754m375o158j030j0098K3445K9099
12380H478p206J4996q224o538j3180k4183j2553O092L8422k167L943j4367k2408
12367c8895K3240L8024K5174q069l32K4782M210j5638n17k0501k1250J1116R603
12354C0947R093l1233m894L139L683J3850L8103K276k0055o289j5923j0275J3157
12341B5579K097p060J0878k264p742l0714j9059M9990K4639j7150J612J1063j0180
$$ plain form
12328 31689 25354 18749 24593 24844 27751 28692 5840 -7110 -742 7343 28486 28145 27088 36261
12314 36261 23048 1225 -15351 -34965 -24003 8672 18456 9641 2356 2765 840 24311 28988
12301 28988 37578 38228 25095 916 3824 33088 24907 26599 15435 1831 308 -2618 4482
12288 4482 1405 -3110 26820 23281 -5445 -6865 -18838 -13745 -18184 -12527 12624 20196 -5310
12275 -5310 -18082 -21423 1027 29297 33419 -7376 23815 36562 -13951 -20647 489 6390 -6878
12262 -6878 -10241 11521 30774 33887 16310 569 14597 12183 14622 17778 18853 18753 25960 59621
12248 59621 55583 29748 47867 61784 67500 56913 33727 12683 19629 26903 28822 3376 -29049
12235 -29049 -19666 265 -1277 3402 -1387 -14325 -3434 3902 470 -10090 -9980 -271 -3362 -5082
$$ packed form
12328C1689o335o605N844K51K907R41k2852j2950O368Q085K1143l41j057R173
12314C6261j3213k1823j6576j9614J0962L2675R784q815p285M09j925K3471M677
12301B8988Q590O50j3133k4179K908K9264q181J692j1164j3604j523k926P100
12288D482l077m515K9930l539k8726j420j1973N093m439N657K5151P572k5506
12275e310j2772l341K2450K8270M122m0795L1191J2747n0513o696K1136N901j3268
12262f878l363K1762J9253L113j7577j5741J4028k414K439L156J075j00P207L3661
12248E9621m038k5835J8119J3917N716j0587k3186k1044O946P274J919k5446l2425
12235b9049R383J9931j542M679m789j2938J0891P336l432j0560J10R709l091j720
$$ plain form
12221 -5082 -3156 5172 4681 5412 34953 64556 48446 21404 28399 19771 10882 -3915 -23008 1028
12207 1028 12514 7001 23474 33026 18579 31547 30737 14343 -8581 -15945 -1118 -9334 -20629
12194 -20629 12119 38426 29102 30293 7932 -16914 -24214 2095 7607 22830 6837 -6602
12182 -6602 -16234 -9382 -7958 -30693 -33241 -9064 -13711 3855 -41433 -53278 -21595 -16169 -774
12169 -774 -16529 -35428 -21417 -17103 -3861 13429 43159 37761 -1682 649 19906 24866 20378
12156 20378 47694 54304 71587 92225 82692 83839 137294 198941 196462 172568 135494 104154
12144 104154 78913 49338 30862 33741 51880 75006 93102 80467 60116 44991 66940 74356
12132 74356 91536 96772 75684 60133 48955 41574 50119 15766 -11495 -15824 -24312 -2806 17551
$$ packed form
12221e082J926Q328m91P31K9541K9603j6110k7042O995q628q889j4797j9093K4036
12207A028J1486n513J6473R552j4447J2968q10j6394k2924p364J4827q216j1295
12194b0629L2748K6307r324J191k2361k4846p300K6309N512J5223j5993j3439
12182f602r632O852J424k2735k548K4177m647J7566m5288j1845L1683N426J5395
12169g74j5755j8899J4011M314J3242J7290K9730n398l9443K331J9257M960m488
12156B0378K7316O610J7283K0638r533J147N3455O1647k479k3894l7074l1340
12144A04154k5241k9575j8476K879J8139K3126J8096j2635k0351j5125K1949P416
12132G4356J7180N236k1088j5551j1178p381Q545l4353k7261m329q488K1506K0357
$$ plain form
12119 17551 40233 51684 47225 74331 146911 205557 199610 167593 119279 68411 73700 67601
12107 67601 32808 4957 19614 44556 39209 23079 34499 15185 -6867 -22042 -24218 -8102
12095 -8102 -2655 -2645 11577 29894 39147 29119 23702 21667 -1967 20013 1373 -18889 -31618
12082 -31618 -32234 -30719 -12138 33730 32148 23993 -421 -31915 -39014 -20150 1140 10068 10109 18256
12068 18256 5727 -19581 -10589 13764 7458 6754 10964 14917 7081 19052 31638 14925 -9096
12055 -9096 -11006 -16199 -18100 -17708 -15752 -18069 -3819 23347 12148 14679 23197 19866 39248 34449
12041 34449 27417 51138 58993 56815 38691 37701 23699 33876 55132 43728 25374 1915 6267
12028 6267 16911 6991 3679 13647 29006 30727 20420 6374 9333 -4074 242 -718 -11288
$$ packed form
12119A7551K2682J1451m459K7106P2580N8646n947l2017m8314n0868N289o099
12107F7601l4793k7851J4657K4942n347j6130J1420j9314k2052j5175k176J6116
12095h102N447J0J4222J8317R253j0028n417k035k3634K1980j8640k0262j2729
12082c1618o16J515J8581M5868j582q155k4414l1494p099J8864K1290Q928M1Q147
12068A8256j2529k5308Q992K4353o306p04M210L953p836J1971J2586j6713k4021
12055i096j910n193j901L92J956k317J4250K7166j1199K531Q518l331J9382m799
12041C4449p032K3721P855k178j8124r90j4002J0177K1256j1404j8354k3459M352
12028F267J0644r920l312R968J5359J721j0307j4046K959j3407M316r60j0570
$$ plain form
12015 -11288 2591 24487 43091 48752 26504 34217 24045 21567 26040 59770 50667 23354 11809
12002 11809 6448 6557 14950 49319 54152 55686 45186 44477 30989 27200 33003 21642 20433 30057
11988 30057 23739 33893 8850 -220 -2179 11132 5094 -16128 -21233 -30324 -20503 1110 20020
11975 20020 -4581 -14880 1425 -2291 23172 35331 33903 16889 -6318 -8863 -16851 1050
11963 1050 -19922 -23063 -37137 -23672 -12326 19909 42406 66344 43718 7255 -26413 -1403
11951 -1403 10243 -29333 -19417 3171 -11041 -3955 14280 21140 24815 17892 -6360 -39993 -306
11938 -306 -2686 -3132 6219 8912 24841 13327 4293 3272 -11646 -15887 -27931 -22678 -20210 -66621
11924 -66621 -79854 -74404 -72701 -44931 7252 20587 25141 24042 4630 -40074 -36538 -15375 -6774
$$ packed form
12015a1288J3879K1896J8604N661k2248P713j0172k478M473L3730r103k7313j1545
12002A1809n361J09Q393L4369M833J534j0500p09j3488l789N803j1361j209R624
11988C0057o318J0154k5043r070j959J3311o038k1222n105r091R821K1613J8910
11975B0020k4601j0299J6305l716K5463J2159j428j7014k3207k545p988J7901
11963A050k0972l141j4074J3465J1346L2235K2497K3938k2626l6463l3668K5010
11951a403J1646l9576R916K2588j4212P086J8235O860L675o923k4252l3633L9687
11938c06k380m46R351K693J5929j1514r034j021j4918m241j2044N253K468m6411
11924f6621j3233N450J703K7770N2183J3335M554j099j9412m4704L536K1163Q601
$$ plain form
11911 -6774 2824 8502 17938 -7866 -32946 -30813 1948 21182 7294 -14755 -2778 -24016 -55144
11898 -55144 -51495 -25588 -15048 -28731 -5297 -12496 -31484 -23243 -40708 -53727 -27654 -3133
11886 -3133 2801 15494 29670 20630 8538 18439 27565 17048 20011 20545 32246 18038 9835
11873 9835 -9424 -13319 -16645 -1994 8830 19712 34661 31861 25139 24789 14620 861 21745
11860 21745 17880 1096 -14579 -4490 8289 17109 2732 -9334 -14075 915 34316 34012 508
11847 508 -22127 -11148 -5536 -9718 12423 41265 46091 45752 36279 24937 4977 398 21008
11834 21008 10037 2786 -2951 -23671 -35585 -13031 -2260 1689 23562 29511 47751 36915
11822 36915 17900 1817 4735 -13147 -34470 -30179 -6920 9027 -9838 -24243 -6261 21738
$$ packed form
11911f774R598N678R436k5804k5080K133L2761J9234j3888k2049J1977k1238l1128
11898e5144L649K5907J0540j3683K3434p199j8988Q241j7465j3019K6073K4521
11886c133N934J2693J4176r040j2092R901R126j0517K963N34J1701j4208q203
11873I835j9259l895l326J4651J0824J0882J4949k800o722l50j0169j3759K0884
11860B1745l865j6784j5675J0089J2779Q820j4377j2066m741J4990L3401l04l3504
11847E08k2635J0979N612m182K2141K8842M826l39r473j1342j9960m579K0610
11834B1008j0971p251n737k0720j1914K2554J0771L949K1873N949J8240j0836
11822C6915j9015j6083K918j7882k1323M291K3259J5947j8865j4405J7982K7999
$$ plain form
11810 21738 30406 27382 11682 6254 -1454 -2923 5883 31137 48530 50409 37714 15119 6285
11797 6285 7608 3942 -1886 5760 23401 14826 8013 4943 21814 20913 6629 -10971 -21362 -4905
11783 -4905 -8910 -3929 24019 29409 39509 21165 -15158 -24188 -23989 -8509 2900 33126 54605
11770 54605 40794 7128 3872 10207 -8696 -21916 -29201 -1930 15206 6928 8925 -5055 -23591
11757 -23591 -17699 -7468 -5837 14365 29329 -6196 -11795 -13600 18129 36137 7146 -27443
11745 -27443 -37667 -50754 -29743 -8430 -15718 2429 32131 40637 13490 -2042 -52706 -56565
11733 -56565 -49328 -32852 -21657 -16150 -26314 -11257 -16996 -26576 -35355 -37928 -10230 -9003 276
11720 276 3506 12497 8920 14270 -4180 -5622 16101 38341 28781 13515 -1217 -37132 -10436
$$ packed form
11810B1738Q668l024j5700n428p708j469Q806K5254J7393J879j2695k2595q834
11797F285J323l666n828P646J7641q575o813l070J6871r01j4284j7600j0391J6457
11783d905m005M981K7948N390J0100j8344l6323r030J99J5480J1409L0226K1479
11770E4605j3811l3666l256O335j8903j3220p285K7271J7136q278J997j3980j8536
11757b3591N892J0231J631K0202J4964l5525n599j805L1729J8008k8991l4589
11745b7443j0224j3087K1011K1313p288J8147K9702Q506k7147j5532n0664l859
11733e6565P237J6476J1195N507j0164J5057n739r580q779k573K7698J227R279
11720B76L230Q991l577N350j8450j442K1723K2240r560j5266j4732l5915K6696
$$ plain form
11707 -10436 17278 4238 1905 33016 38408 9525 -2897 -7572 25383 14336 -20909 -2216
11695 -2216 -13835 -13815 22819 31821 6574 3356 -12636 -19819 -11073 -25539 -26716 208 77 2161
11681 2161 36374 30323 14783 19964 2108 -417 19186 30599 23329 -12054 -15328 -18867 -15859
11668 -15859 -1893 -1697 -37755 -43466 -32479 -17553 -3614 10891 16199 39792 48015 47841 38413
11655 38413 17138 4119 26056 37529 14912 -16480 -9673 -15051 -14274 -6230 -31311 -30025 -14344
11642 -14344 -19497 -418 10139 36312 48733 22999 -9817 -3089 14803 23141 -3320 203
11630 203 19390 19419 10485 -2489 1864 10789 10839 589 -27735 -32713 -25771 -7099 -438 -2985 11835
11615 11835 4740 10065 24860 42443 12601 -4546 -4024 -6431 -12416 -19901 -9841 -1313 -474 -205
$$ packed form
11707a0436K7714j3040k333L1111N392k8883j2422m675L2955j1047l5245J8693
11695b216j1619K0L6634R002k5247l218j5992p183Q746j4466j177K6924j31K084
11681B161L4213o051j5540N181j7856k525J9603J1413p270l5383l274l539L008
11668a5859J3966J96l6058n711J0987J4926J3939J4505N308K3593Q223j74r428
11655C8413k1275j3019K1937J1473k2617l1392O807n378P77Q044k5081J286J5681
11642a4344n153J9079J0557K6173J2421k5734l2816O728J7892Q338k6461L523
11630B03J9187K9q934j2974M353Q925N0j0250k8324m978O942J8672O661k547J4820
11615A1835p095N325J4795J7583k9842j7147N22k407n985p485J0060Q528Q39K69
$$ plain form
11601 -205 -22505 -36666 -51447 -40021 -31899 -18646 -23347 -10391 11469 18780 41238 56559 24061
11588 24061 -21463 -56501 -39730 6783 32560 60446 32119 19928 29285 25009 28938 36060
11576 36060 14175 -19599 -13210 -19458 -10075 7554 -18377 -49005 -12851 -14096 -21620 -22223 -20231
11563 -20231 -22737 -23691 -2465 -9032 -34596 -43960 -38353 -36437 -44132 -52125 -56841 -51257 -46726 -28894
11549 -28894 -29622 -14910 9138 21936 15873 4738 -4750 -11819 -24987 -20737 -28859 -21162 -15607
11536 -15607 -1056 26469 18688 -10365 885 21782 55409 55170 46860 40045 39424 -1809 -39602
11523 -39602 -56799 -52725 -42511 -20935 -19726 -31717 -32936 -45592 -47568 -31285 -14682 4647
11511 4647 12983 3351 10560 41711 53873 26141 -3259 -5618 -17177 -20215 -11306 -9496 -8287
$$ packed form
11601b05k2300j4161j4781J1426Q122J3253m701J2956K1860P311K2458J5321l2498
11588B4061m5524l5038J6771M6513K5777K7886k8327j2191R357m276L929P122
11576C6060k1885l3774O389o248R383J7629k5931l0628L6154j245p524o03J992
11563b0231k506r54K1226o567k5564r364N607J916p695p993m716N584M531J7832
11549b8894p28J4712K4048J2798o063j1135r488p069j3168M250q122P697N555
11536a5607J4551K7525p781k9053J1250K0897L3627k39q310o815o21m1233l7793
11523c9602j7197M074J0214K1576J209j1991j219j2656j976J6283J6603J9329
11511D647Q336r632P209L1151J2162k7732k9400k359j1559l038Q909J810J209
$$ plain form
11498 -8287 -34943 -39671 -43486 -47332 -20594 -1662 -13776 -20205 -7635 -8252 -33873 -56248 -58783
11485 -58783 -44414 -17153 10959 9167 16740 49046 56850 33308 15474 2513 -3125 -36336
11473 -36336 -36912 -11076 551 -31849 -12534 27646 26837 19081 23506 39242 45998 22088 2416
11460 2416 -6779 -12735 -3739 7926 14405 -5101 17364 25415 -6186 -36325 -23206 3180 8270
11447 8270 7494 30127 27820 18938 -4296 -9981 -19600 -2342 11888 21990 21642 15460 16958 33772
11433 33772 41079 55698 16033 -17859 -36338 -38983 -32389 -15584 -15213 -12742 5009 16014 31979
11420 31979 12522 -27828 -24807 -42745 -38799 -17877 -53 -10103 -23838 16558 30591 33389
11408 33389 14445 14433 12322 -2552 -18487 2368 9973 -9218 -13386 2356 37599 55896 33596
$$ packed form
11498h287k6656m728l815l846K6738J8932j2114o429J2570o17k5621k2375k535
11485e8783J4369K7261K8112j792P573L2306P804k3542j7834j2961n638l3211
11473c6336n76K5836J1627l2400J9315M0180q09p756M425J5736O756k3910j9672
11460B416r195n956Q996J1665O479j9506K2465Q051l1601l0139J3119K6386N090
11447H270p76K2633k307q882k3234n685r619J7258J4230J0102l48o182J498J6814
11433C3772P307J4619l9665l3892j8479k645O594J6805L71K471J7751J1005J5965
11420C1979j9457m0350L021j7938L946K0922J7824j0050j3735M0396J4033K798
11408C3389j8944j2k111j4874j5935K0855P605j9191m168J5742L5243J8297k2300
$$ plain form
11395 33596 26083 22926 11269 -17224 -18174 -16513 -34098 -20062 760 -25601 -26746 -3857 -1226
11382 -1226 -6167 -12971 -28148 -23186 -18579 -22079 -15471 17082 31900 28474 -2707 -13454 -8148
11369 -8148 -7875 -2500 -18117 -19606 3973 8677 -1683 -11541 -32382 -35456 -22227 -9838 -35948
11356 -35948 -48615 -53948 -62716 -53729 -33837 -11352 -23354 -28956 -31786 -29157 -20551 4511 14995
11343 14995 -9137 -16874 7496 38343 12452 4534 -34133 -67602 -59148 -34502 -1547 7981
11331 7981 13987 26466 25058 21030 -639 9597 -24946 -53277 -52199 -24109 9918 26052 47792
11318 47792 66024 77271 68324 39690 23341 15467 12061 15429 18312 26798 23437 3929 4453
11305 4453 14758 4602 16096 26595 32243 4564 -8886 -25464 -33395 19247 11394 -9443
$$ packed form
11395C3596p513l157j1657k8493r50J661j7585J4036K0822k6361j145K2889K631
11382a226m941o804j5177M962M607l500O608L2553J4818l426l1181j0747N306
11369h148K73N375j5617j489K3579M704j0360r858k0841l074J3229J2389k6110
11356c5948j2667n333q768Q987J9892K2485j2002n602k830K629Q606K5062J0484
11343A4995k4132p737K4370L0847k5891p918l8667l3469Q454K4646L2955R528
11331G981O006J2479j408m028k1669J0236l4543k8331J078K8090L4027J6134K1740
11318D7792J8232J1247q947k8634j6349p874l406L368K883Q486l361j9508N24
11305D453J0305j0156J1494J0499N648k7679j3450j6578p931N2642p853k0837
$$ plain form
11293 -9443 5178 -4455 9353 21392 9708 -20871 1615 18931 14137 2122 1000 11622
11281 11622 2444 -1115 11762 -7530 1193 12792 18568 18384 24325 32319 57608 38261 17606
11268 17606 -6166 -43370 -42635 -36195 -38021 -32592 -31411 -37076 -20990 -29325 -40794 -42738 -40486 -23326
11254 -23326 12360 51145 43349 32894 25284 22959 40170 36500 10773 -17741 -24273 -14620 -17836
11241 -17836 -30644 -32826 -47887 -48430 -43114 -20460 -8928 7659 20229 24188 2898 -20032 -17651
11228 -17651 -29439 -25692 11573 20897 22593 17825 16401 6950 38638 31856 10345 4549 -12344
11215 -12344 -23814 -19965 -32802 -15310 -5797 1304 13046 6437 13673 9935 14866 28643 2447
11202 2447 -7769 -10217 -1188 -14043 -18692 -24016 -43392 -56035 -42660 -5555 -770 -12400 -38244
$$ packed form
11293i443J4621r633J3808J2039j1684l0579K2486J7316m794j2015j122J0622
11281A1622r178l559J2877j9292Q723J1599N776j84N941P994K5289j9347k0655
11268A7606k3772l7204P35O440j826N429J181n665J6086q335j1469j944K252J7160
11254b3326L5686L8785p796j0455p610k325J7211l670k5727k8514o532R653l216
11241a7836j2808k182j5061n43N316K2654J1532J6587J2570L959k1290k2930K381
11228a7651j1788L747L7265R324J696m768j424r451L1688o782k1511n796j6893
11215a2344j1470L849j2837J7492R513P101J1742o609P236l738M931J3777k6196
11202B447j0216k448R029j2855m649n324j9376j2643J3375L7105M785j1630k5844
$$ plain form
11189 -38244 -24736 -20499 -33014 -25925 -34048 -26875 -20604 -22586 -14331 9894 -2133 -1718 5426 -13769
11175 -13769 -22781 -30866 -45369 -25757 -23141 -16732 -25831 -40843 -38924 -26635 5921 14048 16651
11162 16651 29172 24567 5651 -2749 -807 -14717 -20477 -14938 -1112 3713 19567 23255 10720
11149 10720 2079 17720 22859 16458 31922 10544 -28861 -7113 1250 -1561 -9489 -3997 -25498
11136 -25498 -15718 -10680 -3957 11453 17800 32448 16546 4058 -5807 -10837 -2270 -19207 -22770
11123 -22770 -4962 -9748 -22251 -45009 -32563 -22176 -17424 4297 -8231 -14953 -36349 -13577
11111 -13577 13085 -10746 -20352 -25168 -31118 -26660 -12963 -1998 4578 -5201 3146 -6962 -20187
11098 -20187 -4362 -13066 -15477 -19852 2623 -5347 -21679 -1235 14916 14648 19770 34400 15102
$$ packed form
11189c8244J3508M237j2515P089q123P173O271j982Q255K4225j2027M15P144j9195
11175a3769r012q085j4503J9612K616O409r099j5012J919J2289L2556Q127K603
11162A6651J2521m605j8916q400J942j3910n760N539J3826M825J5854L688j2535
11149A0720q641J5641N139o401J5464k1378l9405K1748Q363k811p928N492k1501
11136b5498R780N038O723J5410O347J4648j5902j2488r865n030Q567j6937l563
11123b2770J7808m786j2503k2758J2446J0387M752K1721j2528o722k1396K2772
11111a3577K6662k3831r606m816n950M458J3697J0965O576r779Q347j0108j3225
11098b0187J5825q704k411m375K2475p970j6332K0444J6151k68N122J4630j9298
$$ plain form
11085 15102 7222 -6784 -11623 -28611 -28432 -29343 -10918 -9228 -15231 -32460 -22287 -4169 -2967
11072 -2967 -6495 -13626 -36489 -55654 -43879 -48955 -42776 -48935 -29922 -20711 -16048 -1781 23818
11059 23818 39846 21653 -8919 -34260 -43516 -30981 -5936 -696 -10753 -24349 -13981 1091
11047 1091 5765 14173 4852 13281 14926 14172 15523 15308 -382 6457 -10440 -24790 -19212 -35235
11033 -35235 -32340 -32453 -31864 -35310 -42215 -55434 -55259 -83807 -100089 -79634 -60591 -33805 -5204
11020 -5204 -12825 -23956 -5811 1239 -2938 -24473 -23032 -14369 -16730 -4583 -10154 -13191 24359
11007 24359 12616 13715 10410 -2433 -33361 -33233 -26820 -12907 -16394 -27606 -5360 8125 13466
10994 13466 5066 -6148 7301 16450 -8218 -36232 -26970 10420 11754 -6300 -15105 -31033 710
$$ packed form
11085A5102p880j4006m839j6988J79r11J8425J690o003j7229J0173J8118J202
11072b967l528p131k2863j9165J1775n076O179o159J9013R211M663J4267K5599
11059B3818J6028j8193l0572k5341r256J2535K5045N240j0057j3596J0368J5072
11047A091M674Q408r321Q429J645p54J351k15j5690O839j6897j4350N578j6023
11033c5235K895j13N89l446o905j3219J75k8548j6282K0455J9043K6786K8601
11020e204p621j1131J8145P050m177k1535J441Q663k361J2147n571l037L7550
11007B4359j1743J099l305j2843l0928J28O413J3913l487j1212K2246J3485N341
10994A3466q400j1214J3449R149k4668k8014R262L7390J334j8054q805j5928L1743
$$ plain form
10981 710 29726 39020 26203 5729 8176 1029 -27064 -23052 -9718 -19696 -29838 -35836 -27187
10968 -27187 -3916 -9312 -42290 -43903 -45959 -30676 -40995 -42009 -35118 -32250 -30433 -27763 -7118
10955 -7118 4886 29069 10976 13313 4472 14598 33850 18140 17548 13551 14028 -14353 -30610
10942 -30610 -15226 -31905 -15948 9106 -480 -15371 -6649 2747 -16155 -38745 -41553 -11175
10930 -11175 145 1024 274 17193 29529 -10672 -32717 -14695 11911 -7804 -9925 -6694 -19633
10917 -19633 -9852 -5911 -16573 -8972 4453 28713 -5990 -2498 -19308 -24137 -23244 -24470 -54739
10904 -54739 -21068 -5535 -16829 -15042 13606 16480 17485 32091 32883 4549 2191 37265 45646
10891 45646 44516 46428 37520 46932 35856 5209 -11586 -16324 -11278 -23314 -9153 22468 19777
$$ packed form
10981G10K9016R294j2817k0474K447p147k8093M012J3334r978j0142n998Q649
10968b7187K3271n396l2978j613k056J5283j0319j014O891K868J817K670K0645
10955g118J2004K4183j8093K337q841J0126J9252j5710n92l997M77k8381j6257
10942c0610J5384j6679J5957K5054r586j4891Q722R396j8902k2590k808L0378
10930a1175J1320Q79p50J6919J2336m0201k2045J8022K6606j9715k121L231j2939
10917a9633R781L941j0662P601J3425K4260l4703L492j6810m829Q93j226l0269
10904e4739L3671J5533j1294J787K8648K874J005J4606P92k8334k358L5074Q381
10891D5646j130J912q908R412j1076l0647j6795m738N046j2036J4161L1621k691
$$ plain form
10878 19777 22434 3595 -20876 -33120 -18262 -31117 -28930 -5627 9188 19337 -5351 -15888
10866 -15888 -20301 -22331 -38235 -60243 -72924 -66707 -66349 -39557 -9667 -8564 -28358 -35172 -51691
10853 -51691 -38163 -10325 7401 6809 -17527 -49412 -55089 -48163 -9082 12992 18372 12818 516
10840 516 1556 34422 21251 -25625 -55098 -29827 -16200 -18489 -5577 -258 2949 -20041 -16784
10827 -16784 5641 22815 28639 -23432 -51861 -33268 -12599 -20643 -51704 -74890 -42438 -31240
10815 -31240 -24717 -16695 30333 25296 19404 -309 -18159 -19997 -4005 -2256 4324 -899 -7470
10802 -7470 -28869 -26414 -20997 -26775 -27127 -13743 -14243 -3810 -5238 541 -7340 -31996 -30624 -34700
10788 -34700 -28104 123 -4675 -5022 -22742 -21125 -38418 -18493 -13922 -760 10531 -5656 -3046
$$ packed form
10878A9777K657j8839k4471j2244J4858j2855K187K3303J4815J0149k4688j0537
10866a5888m413k030j5904k2008j2681O217L58K6792K9890J103j9794o814j6519
10853e1691J3528K7838J7726n92k4336l1885n677O926L9081K2074N380n554j2302
10840E16J040L2866j3171m6876k9473K5271J3627k289J2912N319L207k2990L257
10827a6784K2425J7174N824n2071k8429J8593K0669q044l1061k3186L2452J1198
10815c1240O523Q022M7028n037n892j9713j7850j838J5992J749O580n223o571
10802g470k1399K455N417n778l52J3384n00J0433j428N779p881k4656J372m076
10788c4700O596K8227m798l47j7720J617j7293J9925M571J3162J1291j6187K610
$$ plain form
10775 -3046 -1582 -24092 -8572 17838 29658 12599 7309 -1592 -34607 -41015 -41040 -38386 -23696
10762 -23696 -9534 -12071 -25887 -37249 -20845 -30977 -38957 -46284 -1996 52761 72902 33340
10750 33340 15940 31523 28213 23062 22405 20198 -8158 -29095 -4099 5439 7375 -22798 -32012
10737 -32012 -40863 -29242 15263 2875 -2633 39328 50509 32080 18626 14349 -8176 -39480
10725 -39480 -45221 -52805 -39107 -29549 -38928 -35975 -26151 -29410 -19654 11448 9439 -14445 -29477
10712 -29477 -27954 -26678 -20027 -26567 -37347 -16654 -17451 -11887 -5750 -22317 -15926 -18309 -22019 -27204
10698 -27204 -17860 -8254 -1121 -17651 -29517 -34264 -54566 -34850 -13745 -10310 -4603 -18936 -13190
10685 -13190 -29494 -33254 -12840 -13217 -33817 -46145 -22602 -14218 -38770 -60475 -64316 -22631 6708
$$ packed form
10775c046J464k2510J5520K6410J1820j7059n290q901l3015o408k5K654J4690
10762b3696J4162k537j3816j1362J6404j0132p980p327M4288N4757K0141l9562
10750C3340j7400J5583l310n151o57k207k8356k0937K4996R538J936l0173r214
10737c2012q851J1621M4505j2388n508M1961J1181j8429j3454m277k2525l1304
10725c9480n741p584J3698R558r379K953R824l259R756L1102k009k3884j5032
10712b9477J523J276O651o540j0780K0693p97N564O137j6567O391k383l710n185
10698b7204R344R606P133j6530j1866m747k0302J9716K1105L435N707j4333N746
10685a3190j6304l760K0414l77k0600j2328K3543Q384k4552k1705l841M1685K9339
$$ plain form
10672 6708 -4584 -27636 -13531 -15204 -8468 3526 32742 16242 7528 7359 -1829 -17155 -24233
10659 -24233 4088 20051 17479 24646 21750 10390 9768 5770 3824 -2951 -18841 -7954 1008
10646 1008 13223 64158 116848 113041 98568 94690 88466 61586 52428 54533 39406 53732 45880
10633 45880 7922 -13059 -2181 1131 -14702 -4453 58744 124001 188241 217811 264099 362501
10621 362501 518579 806042 1324096 2026803 2370621 2035302 1535465 1114086 757036 523888
10611 523888 407181 402102 431754 453322 436174 418427 406327 375227 318194 243464 167013
10600 167013 147359 127090 118371 121438 133354 86249 81233 114431 134937 113351 98493 83023
10588 83023 89204 73227 54189 41093 45260 62593 55575 69369 102792 132843 151191 156538
$$ packed form
10672F708j1292k3052J4105j673O736J1994K9216j6500q714j69r188j5326p078
10659b4233K8321J5963k572P167k896j1360o22l998j946o775j5890J0887Q962
10646A008J2215N0935N2690l807j4473l878o224k6880r158K105j5127J4326p852
10633D5880l7958k0981J0878L312j5833J0249O3197O5257O4240K9570M6288R8402
10621C62501J56078K87463N18054P02707L43818l35319m99837m21379l57050k33148
10611E23888j16707n079K9652K1568j7148j7747j2100l1100n7033p4730p6451
10600A67013j9654k0269q719L067J1916m7105n016L3198K0506k1586j4858j5470
10588H3023O181j5977j9038j3096M167J7333p018J3794L3423L0051J8348N347
$$ plain form
10576 156538 173506 205396 252493 292035 331482 393965 426589 434467 403187 354658 288765 246763
10564 246763 224077 201226 168805 136595 138690 117672 113990 103719 71487 47040 27060 37912
10552 37912 73694 67388 74605 62113 92887 83701 59893 64768 49276 36312 40757 61853 78292
10539 78292 109128 128805 153331 181949 212977 260833 288491 294083 268152 252218 202818 177711
10527 177711 160453 141130 125268 110991 92200 89535 57734 26747 49949 78783 77209 52372
10515 52372 26282 34721 34635 37911 53660 56912 40697 42354 50865 54718 58501 50981 40240 46267
10501 46267 57429 55669 27352 -3154 30263 64751 89197 66664 58721 39125 32295 55176
10489 55176 48724 24227 -4431 -27786 -14155 -16091 -8261 -12418 -17758 -18654 -6207 3865 29683
$$ packed form
10576A56538J6968L1890M7097L9542L9447O2483L2624P878l1280m8529o5893m2002
10564B46763k2686k2851l2421l2210K095k1018l682j0271l2232k4447j9980J0852
10552C7912L5782o306P217j2492L0774r186k3808M875j5492j2964M445K1096J6439
10539G8292L0836J9677K4526K8618L1028M7856K7658N592k5931j5934m9400k5107
10527A77711j7258j9323j5862j4277j8791k665l1801l0987K3202K8834j574k4837
10515E2372k6090Q439q6L276J5749L252j6215J657Q511L853L783p520j0741O027
10501D6267J1162j760k8317l0506L3417L4488K4446k2533p943j9596o830K2881
10489E5176o452k4497k8658k3355J3631j936P830m157n340q96J2447J0072K5818
$$ plain form
10476 29683 35884 37235 50963 62321 77286 41535 12667 -10769 -27287 -30522 -35186 -5649
10464 -5649 -2280 -283 15880 25389 44861 56261 36790 27119 -8479 -32616 -47122 -41105 -34580
10451 -34580 -13170 6435 -15354 -7785 16006 23624 15225 26453 16411 9433 40468 71743
10439 71743 62340 50092 42913 30645 18529 13819 2121 872 32973 71918 59763 45930
10427 45930 43461 72940 113847 152329 128518 113774 95717 101018 97867 79660 60918 34351
10415 34351 19630 -12138 -3689 2487 6494 11894 13395 14031 29253 11425 6692 35795 38016
10402 38016 30719 24185 37939 45927 42191 35466 66423 59354 61012 91704 86010 52583 15946
10389 15946 4750 32438 54216 76628 76563 52973 61077 46300 14214 22738 21825 12871 23833
$$ packed form
10476B9683O201J351J3728J1358J4965l5751k8868k3436j6518l235m664K9537
10464e649L369J997J6163R509J9472J1400j9471r671l5598k4137j4506O017O525
10451c4580K1410J9605k1789P569K3791P618q399J1228j0042o978L1035L1275
10439G1743r403j2248p179j2268j2116m710j1698j249L2101L8945j2155j3833
10427D5930k469K9479M0907L8482k3811j4744j8057N301l151j8207j8742k6567
10415C4351j4721l1768Q449O176M007N400J501O36J5222j7828m733K9103K221
10402C8016p297o534J3754P988l736o725L0957p069J658L0692n694l3427l6637
10389A5946j1196K7688K1778K2412o5k3590Q104j4777l2086Q524r13q954J0962
$$ plain form
10376 23833 36668 39403 25377 9404 21830 25027 30408 10947 -14586 -48492 -25788 -24528
10364 -24528 -26087 -27837 4098 27817 50213 89741 57546 48889 43017 67020 64801 51308 51498
10351 51498 41510 26026 27574 38727 61256 58227 48651 24406 28496 4646 7982 18780 28715
10338 28715 54404 64625 72718 56656 58924 26607 5049 3963 12839 -7224 -63763 -55187 -27612
10325 -27612 -4914 21819 62051 131662 150582 131952 105038 86136 64249 61257 70199 57811
10313 57811 23089 29091 35417 30029 34509 41730 39424 61963 64573 76467 114040 127506 101380
10300 101380 102258 113740 70040 56318 88013 74672 66600 87054 71860 70549 97488 89284
10288 89284 64165 102061 129723 160141 188519 175218 167190 161070 172203 161555 169599 171501
$$ packed form
10376B3833J2835K735j4026j5973J2426L197N381j9461k5533l3906K2704J260
10364b4528j559j750L1935K3719K2396L9528l2195q657n872K4003k219j3493J90
10351E1498r988j5484J548J1153K2529l029r576k4245M090k3850L336J0798R935
10338B8715K5689J0221Q093j6062K268l2317k1558j086Q876k0063n6539Q576K7575
10325b7612K2698K6733M0232O9611J8920j8630k6914j8902k1887k992Q942j2388
10313E7811l4722O002O326n388M480P221k306K2539K610J1894L7573J3466k6126
10300A01380Q78J1482m3700j3722L1695j3341q072K0454j5194j311K6939q204
10288H9284k5119L7896K7662L0418K8378j3301q028o120J1133j0648Q044J902
$$ plain form
10276 171501 149613 171459 172663 160168 167873 223327 293555 320412 327835 342650 371895 409059
10264 409059 449882 493075 557975 630783 702130 790284 929276 1045207 1202547 1437950 1793935
10253 1793935 2219104 2726739 3364612 4306316 5692251 7725369 10698839 14699039 19052555
10244 19052555 21806785 21395168 18522823 14862480 11480000 8825668 6957507 5677499
10236 5677499 4814600 4259661 3887697 3613175 3483552 3438251 3487866 3711797 4097939 4632823
10226 4632823 5159203 5487677 5695375 5787531 5728863 5674927 5781074 6102785 6760950 7812357
10216 7812357 9357420 11539279 14719256 19305169 25624682 33288086 41653677 50843187
10208 50843187 59688103 65791114 67423274 63861882 55599374 45081436 35131758 27123726
$$ packed form
10276A71501k1888K1846J204j2495P705N5454P0228K6857P423J4815K9245L7164
10264D09059M0823M3193O4900P2808P1347Q8154J38992J15931J57340K35403L55985
10253A793935M25169N07635O37873R41704J385935K033118K973470M000200M353516
10244A9052555K754230m11617k872345l660343l382480k654332j868161j280008
10236E677499q62899n54939l71964k74522j29623m5301M9615K23931L86142N34884
10226D632823N26380L28474K07698R2156n8668n3936J06147L21711O58165J051407
10216G812357J545063K181859L179977M585913O319513P663404Q365591R189510
10208E0843187Q844916O103011J632160l561392q262508j0517938r949678q008032
$$ plain form
10200 27123726 21269514 17227128 14533889 12695699 11488498 10801654 10551163 10857308
10192 10857308 11798886 13210096 14087338 13722464 12559748 11252813 10244803 9694720 9583125
10183 9583125 9905405 10686477 11973476 13964004 16908054 21286696 27591334 35825337
10175 35825337 44098131 50994678 58749598 69422601 81243000 89287640 89441176 82561853
10167 82561853 73131207 63989503 54446226 44474767 35395517 28002730 22458459 18503676
10159 18503676 15762478 13802965 12377840 11435487 10991736 10994030 11553225 12716364 13951230
10150 13951230 14170710 13161640 11762776 10580336 9859192 9662566 9902329 10602611 11841381
10141 11841381 13762622 16665069 20997215 27264481 35478779 44126697 51456723 57402332
$$ packed form
10200B7123726n854212m042386k693239j838190j207201o86844k50491L06145
10192A0857308R41578J411210Q77242l64874j162716j306935j008010n50083j11595
10183I583125L22280P81072J286999J990528K944050M378642O304638Q234003
10175C5825337Q272794O896547P754920J0673003J1820399Q044640J53536o879323
10167H2561853r430646r141704r543277r971459r079250p392787n544271l954783
10159A8503676k741198j959513j425125r42353m43751K294N59195J163139J234866
10150A3951230K19480j009070j398864j182440p21144j96626K39763P00282J238770
10141A1841381J921241K902447M332146O267266Q214298Q647918P330026N945609
$$ plain form
10133 57402332 61410049 61720592 57619065 50611568 42496676 34097877 26537368 20600550
10125 20600550 16261119 13169451 11033591 9532380 8451671 7692530 7211998 6941933
10117 6941933 6779790 6626264 6463353 6169497 5663622 5093223 4567454 4167271 3902160
10108 3902160 3788177 3779005 3860645 4055700 4398992 4925869 5679234 6803923 8497921 11010181
10098 11010181 14345187 17997622 20378578 20020283 17330766 13811299 10523126 7919336
10090 7919336 6093748 4870681 4016886 3426449 3008813 2685656 2395766 2132513 1903674
10081 1903674 1695817 1549640 1426209 1311585 1236486 1155306 1120008 1077992 1008665 919245
10071 919245 872222 822918 783416 750964 725231 706600 700488 667694 651477 646946 600707 569500
$$ packed form
10133E7402332M007717L10543m101527p007497q114892q398799p560509n936818
10125B0600550m339431l091668k135860j501211j080709p59141m80532k70065
10117F941933j62143j53526j62911k93856n05875n70399n25769m00183k65111
10108C902160j13983r172Q1640J95055L43292N26877P53365J124689J693998K512260
10098A1010181L335006L652435K380956l58295k689517l519467l288173k603790
10090G919336j825588j223067q53795n90437m17636l23157k89890k63253k28839
10081A903674k07857j46177j23431j14624p5099q1180l5298m2016o9327q9420
10071I19245m7023m9304l9502l2452k5733j8631o112l2794j6217m531m6239l1207
$$ plain form
10059 569500 554429 533767 505800 462209 448469 455025 464951 471334 479887 490844 501660 525318
10047 525318 575948 651020 685784 615810 549388 506118 488271 452791 454212 473038 447659 406624
10035 406624 376907 385415 390871 372724 378505 360852 332205 290471 257527 269830 280998 267989
10023 267989 268747 266766 258748 238021 225678 214041 202389 202054 228406 290386 283329 295313 311231
10010 311231 305047 296374 306816 311354 292168 276824 286363 290850 294627 294750 269842 254908 233098
9997 233098 228160 237025 248642 228073 225539 218153 197789 184759 181225 175811 174175 170815 167218
9984 167218 164035 138930 122059 121828 121238 137761 157991 178353 173803 161452 108303 75814 67269
9971 67269 82030 111560 102501 148398 172848 150155 129912 125573 125349 143252 110215 86818 87453
$$ packed form
10059E69500j5071k0662k7967m3591j3740O556R926O383Q553J0957J0816K3658
10047E25318N0630P5072L4764o9974o6422m3270j7847l5480J421J8826k5379m1035
10035D06624k9717Q508N456j8147N781j7653k8647m1734l2944J2303J1168j3009
10023B67989P58j981q018k0727j2343j1637j1652l35K6352O1980p057J1984J5918
10010C11231o184q673J0442M538j9186j5344R539M487L777J23k4908j4934k1810
9997B33098m938Q865J1617k0569k534p386k0364j3030l534n414j636l360l597
9984A67218l183k5105j6871k31n90J6523K0230K0362m550j2351n3149l2489q545
9971F7269J4761K9530r059M5897K4450k2693k0243m339k24J7903l3037k3397O35
$$ plain form
9958 87453 101933 87821 91713 100181 120670 112647 92834 96398 106868 99961 99164 77712 68701
9945 68701 80003 109131 133987 130012 104868 95714 107597 95877 83176 82678 96879 97472 99838
9932 99838 73391 67766 83266 117039 110384 103982 105367 106609 109799 113996 136637 129485 80383
9919 80383 40343 54125 46810 39824 62954 103837 130829 132402 111260 109018 77201 56161 72958
9906 72958 77792 57973 63398 100819 117228 142157 110943 101666 100554 89372 86749 91735 99901
9893 99901 97348 92921 93350 112620 103154 74276 45915 35120 52082 56100 46259 49047 55121 32688
9879 32688 17845 26670 42446 68055 51059 56828 60371 50176 68530 62055 56306 52089 82849
9866 82849 120084 112953 116310 106608 77082 47998 61504 63299 37353 14656 13667 31884 55644
$$ packed form
9958H7453J4480j4112L892Q468K0489q023j9813L564J0470o907p97k1452r011
9945F8701J1302K9128K4856l975k5144r154J1883j1720j2701m98J4201N93K366
9932I9838k6447n625J5500L3773o655o402J385J242L190M197K2641p152m9102
9919H0383m0040J3782p315o986K3130M0883K6992J573k1142k242l1817k1040J6797
9906G2958M834j9819N425L7421J6409K4929l1214r277j112j1182k623M986Q166
9893I9901k553m427M29J9270r466k8878k8361j0795J6962M018r841K788O074k2433
9879C2688j4843Q825J5776K5609j6996N769L543j0195J8354o475n749m217L0760
9866H2849L7235p131L357r702k9526k9084J3506J795k5946k2697r89J8217K3760
$$ plain form
9853 55644 60976 59077 85534 80126 54003 63566 79710 111197 144537 134631 135837 145696 157520
9840 157520 169818 174518 185294 182947 142707 115119 110062 103833 109832 111624 81703 70871 43058
9827 43058 23322 62799 87621 78346 85108 94518 79437 50110 50871 74312 62596 60162 74023
9814 74023 74240 74247 82691 106051 126152 145567 173946 200601 237909 293845 333678 387753 412115
9801 412115 392362 362428 347440 290863 224962 192224 168182 161990 163031 151574 149398 105931
9789 105931 117075 123710 133237 131762 134825 129060 159691 165756 103604 90697 105631 74265 65425
9776 65425 94378 102755 116215 151856 159785 187679 258875 332344 391137 451797 501482 531744
9764 531744 516233 508349 485576 440826 413550 367659 301042 241625 176038 125924 95167 80459
$$ packed form
9853E5644N332j899K6457n408k6123R563J6144L1487L3340r906J206R859J1824
9840A57520J2298M700J0776k347m0240k7588n057o229N999J792k9921j0832k7813
9827D3058j9736L9477K4822r275O762R410j5081k9327P61K3441j1716k434J3861
9814G4023K17PQ444K3360K0101J9415K8379K6655L7308N5936L9833N4075K4362
9801D12115j9753k9934j4988n6577o5901l2738k4042o192J041j1457k176m3467
9789A05931J1144O635R527j475L063n765L0631O065o2152j2907J4934l1366q840
9776F5425K8953Q377J3460L5641P929K7894P1196P3469N8793O0660M9685L0262
9764E31744j5511p884k2773m4750k7276m5891o6617n9417o5587n0114l0757j4708
$$ plain form
9752 80459 95555 104709 109608 101257 107112 145762 160416 158039 129847 104519 68265 72351 56854
9739 56854 50997 82693 119056 111677 104250 150780 186304 209050 248846 265305 293051 342231
9727 342231 357130 365461 351698 286380 224898 198509 169972 126458 100041 114673 126719 110494
9715 110494 98598 85160 65398 31013 27284 28983 70515 99065 108898 111467 74743 58987
9703 58987 62293 62779 62662 75467 93054 91015 95002 88789 88359 94729 105098 125861 126420 118837 91025
9688 91025 60753 54288 37679 34380 27913 28907 38323 29728 9282 45595 56714 30325 9032
9675 9032 12033 2595 -7098 7970 31264 11487 3109 27047 18548 17468 26669 32288 43067 32966
9661 32966 14498 5555 -21190 -22002 2378 46000 38315 61225 60664 24835 -19679 -42564 -36826
$$ packed form
9752H0459J5096R154M899q351N855L8650J4654k377k8192k5328l6254M086j5497
9739E6854n857L1696L6363p379p427M6530L5524K2746L9796J6459K7746M9180
9727C42231J4899Q331j3763o5318o1482k6389k8537m3514k6417J4632J2046j6225
9715A10494j1896j3438j9762l4385l729J699M1532K8550R833K569l6724j5756
9703E8987L306M86j17J2805J7587k039L987o213m30O370J0369K0763N59p583k7812
9688I1025l0272o465j6609l299o467R94R416q595k0446L6313J1119k6389k1293
9675I032L001r438r693J5068K3294j9777q378K3938q499j080R201N619J0779j0101
9661C2966j8468q943k6745q12K4380M3622p685K2910n61l5829m4514k2885N738
$$ plain form
9648 -36826 -21988 -33713 -18432 -5496 8009 30049 42022 47027 38538 39962 36685 38896 16127
9635 16127 18750 32149 50863 60677 70138 59139 59493 41788 1710 -3856 5172 7821 26061
9622 26061 21426 34813 35422 40301 24518 32676 36459 20923 48139 59667 47956 22380 5074
9609 5074 21281 47874 55019 68114 60277 46422 65150 42964 43636 56537 75999 74023 62208
9596 62208 43833 40112 37384 35398 48552 38810 23243 43272 33708 28582 15126 -17778 -28396
9583 -28396 -15541 2632 25121 45448 37713 19415 11550 32554 42050 50544 58872 71431 48721
9570 48721 56995 57459 46771 54311 63762 73612 34691 17693 50409 43005 10631 -20049 -20721 -27421
9556 -27421 -23288 -11080 -19331 436 512 595 7172 31509 25033 25351 19974 18323 16307 15533 34556
$$ packed form
9648c6826J4838j1725J5281J2936J3505K2040J1973N005q489J424l277K211k2769
9635A6127K623J3399J8714R814R461j0999L54j7705m0078n566R028K649J8240
9622B6061m635J3387O09M879j5783Q158L783j5536K7216J1528j1711k5576j7306
9609E074J6207K6593P145J3095p837j3855J8728k2186O72J2901J9462j976j1815
9596F2208j8375l721k728j986J3154r742j5567K0029r564n126j3456l2904j0618
9583b8396J2855J8173K2489K0327p735j8298p865K1004R496Q494Q328J2559k2710
9570D8721Q274M64j0688P540R451R850l8921j6998L2716p404l2374l0680o72o700
9556b7421M133J2208q251J9767P6Q3O577K4337o476L18n377j651k016p74J9023
$$ plain form
9541 34556 39331 26279 30224 39366 30398 32920 30082 46971 38050 11168 18724 59385 52642 16084
9527 16084 -7807 1502 9449 9865 -6343 7838 1204 9044 36853 23620 10659 11449 20697 40741
9513 40741 53648 46829 39174 14823 -12937 -23117 -14000 -19724 -46962 -41956 -13061 26296 45249
9500 45249 41607 -11513 -8737 -14749 -30794 -36643 -28246 -39781 -5191 9715 -3428 25216 56747
9487 56747 39312 22727 15990 -2521 19725 38007 43700 51410 1303 -10804 -2173 4003 19871
9474 19871 14549 12930 -2721 -8791 -6324 -1363 -12143 -899 -8398 -19758 17507 19902 15279
9461 15279 10177 20681 21048 26248 39091 58879 60545 38749 15578 -2473 -17102 -33411 -24986
9448 -24986 -8502 -7801 8298 12290 -13968 -16470 -3297 10881 13944 8831 6889 -5069 16752
$$ packed form
9541C4556M775j3052L945R142q968K522k838J6889q921k6882P556M0661o743l6558
9527A6084k3891R309P947M16j6208J4181o634P840K7809j3233j2961P90R248K0044
9513D0741J2907o819p655k4351k7760j0180R117n724k7238N006K8895L9357J8953
9500D5249l642n3120K776o012j6045n849Q397j1535L4590J4906j3143K8644L1531
9487E6747j7435j6585o737j8511K2246J8282N693P710n0107j2107Q631O176J5868
9474A9871n322j619j5651o070K467M961j0780J1244p499j1360L7265K395m623
9461A5279n102J0504L67N200J2843J9788J666k1796k3171j8051j4629j6309Q425
9448b4986J6484P01J6099L992k6258k502J3173J4178L063n113j942j1958K1821
$$ plain form
9435 16752 51257 61202 58127 47073 42182 36620 32618 50847 64650 43068 23754 6308 2444
9422 2444 11024 -35419 -39249 -23389 -28791 -27363 26174 46251 22249 31150 44051 37645 24684
9409 24684 16987 -1188 24139 22652 23541 33247 19482 32886 43174 15129 -4639 -11611 21264
9396 21264 33561 51956 57049 43560 22585 38226 43577 18610 15278 36715 26942 -17416 -8082
9383 -8082 -27294 -33965 -29469 -88 -37219 -44908 -10483 -1716 -21373 -13652 -16185 -28853 975
9370 975 10518 25778 22389 14811 28034 33625 29931 48612 36205 25375 31147 2397 -9421
9357 -9421 8877 1276 2182 -30694 -32640 4772 25770 41720 55876 46492 56700 58546 68090
9344 68090 69641 56662 39764 28101 7937 1260 -18448 -43349 -36822 -3429 -4093 -38287 -28474
$$ packed form
9435A6752L4505R945l075j1054m891n562m002J8229J3803k1582j9314j7446l864
9422B444Q580m6443l830J5860n402J428N3537K0077k4002Q901J2901o406j2961
9409B4684p697j8175K5327j487Q89R706j3765J3404J0288k8045j9768o972L2875
9396B1264J2297J8395N093j3489k0975J5641N351k4967l332K1437r773m4358R334
9383h082j9212o671M496K9381l7131p689L4425Q767j9657P721k533j2668K9828
9370I75R543J5260l389p578J3223N591l694J8681j2407j0830N772k8750j1818
9357i421J8298p601R06l2876j946L7412K0998J5950J4156r384J0208J846R544
9344F8090J551j2979j6898j1663k0164o677j9708k4901O527L3393o64l4194R813
$$ plain form
9331 -28474 7405 11689 -7520 -9303 -10534 -25407 -14543 -6960 29289 51596 14023 -3056 -22001
9318 -22001 -10625 47486 52171 42213 30253 -2518 -23824 7907 18957 9459 3984 27351 42258
9305 42258 36436 20344 -2042 -1497 -4795 -17806 -19191 -32459 -24220 -15988 -24364 -40931 -23998
9292 -23998 15536 35403 36432 35147 7998 -4802 10823 17462 6253 357 -6671 20863 22097
9279 22097 12693 -3259 8367 20941 25789 -6341 3462 11092 27878 41074 27666 3580 -13482
9266 -13482 -15830 -9633 14921 9894 -3232 9566 15219 7502 27008 22198 -794 -20060 -34809
9253 -34809 -21124 -1068 -12211 -17255 -8675 2033 25215 42791 42566 25806 16572 18866 25864
9240 25864 53819 56640 30979 21439 22475 974 -13105 2939 41806 45877 8824 -16251 3027
$$ packed form
9331b8474L5879M284j9209j783j231j4873J0864P583L6249K2307l7573j7079j8945
9318b2001J1376N8111M685r958j1960l2771k1306L1731J1050r498n475K3367J4907
9305D2258n822j6092k2386N45l298j3011j385j3268Q239Q232q376j6567J6933
9292b3998L9534J9867J029j285k7149j2800J5625O639j1209n896p028K7534J234
9279B2097r404j5952J1626J2574M848l2130R803P630J6786J3196j3408k4086j7062
9266a3482k348O197K4554n027j3126J2798N653p717J9506m810k2992j9266j4749
9253c4809J3685K0056j1143n044Q580J0708K3182J7576k25j6760r234K294O998
9240B5864K7955K821k5661r540J036k1501j4079J6044L8867M071l7053k5075J9278
$$ plain form
9227 3027 25693 35944 11480 -150 -11957 7777 52785 46326 31031 970 14991 14367 11066
9214 11066 13949 -12046 -8977 1109 -2888 4565 11024 10230 17601 47876 49064 34630 32581 7047
9200 7047 11071 23871 3651 18836 37074 36489 39735 48317 42242 13940 30760 53270 47974
9187 47974 50217 46219 31430 5988 -19482 -13037 -30474 -26235 -6184 -4644 19663 29952 28725
9174 28725 34416 46143 44493 39737 63309 47264 39362 60860 68513 44777 48039 46053 53764
9161 53764 47856 35810 48955 66147 89596 100624 97770 102640 140494 196155 229786 305023
9149 305023 375581 474141 667059 933341 1332471 1876240 2630566 3798507 5705249 7681109
9139 7681109 8196118 7027573 5030272 3325204 2229666 1585122 1169092 912985 705472
$$ packed form
9227C027K2666J0251k4464j1630j1807J9734M5008o459j5295l0061J4021o24l301
9214A1066K883k5995L069J0086l997P453O459p94P371L0275J188j4434k049k5534
9200G047M024J2800k0220J5185J8238n85L246Q582o075k8302J6820K2510n296
9187D7974K243l998j4789k5442k5470O445j7437M239K0051J540K4307J0289j227
9174B8725N691J1727j650m756K3572j6045p902K1498P653k3736L262j986P711
9161E3764n908j2046J3145J7192K3449J1028k854M870L7854N5661L3631P5237
9149C05023P0558R8560J92918K66282L99130N43769P54326J167941J906742J975860
9139G681109N15009j168545j997301j705068j095538o44544m16030k56107k07513
$$ plain form
9130 705472 574120 495798 417506 346638 303506 251443 237127 239806 213534 192531 192498 159475
9118 159475 122665 107092 88572 80986 71154 68259 67788 49712 35941 78441 83532 69082 73010
9105 73010 74538 50936 42089 68876 84608 61283 41192 24457 32762 74099 105712 121948
9093 121948 103536 61262 54897 52651 49578 50656 29473 37401 38612 43119 65756 44236 50610
9080 50610 35046 9240 -4800 24234 58435 52029 52022 53642 62291 77325 72217 84158 89311 80695
9066 80695 78735 80028 51347 51614 60818 40255 40720 54551 59537 71918 61575 44395 33572
9053 33572 33174 19939 4516 -2539 6945 4942 5338 11410 33811 37869 847 -15996 1963 31249
9039 31249 14553 1081 11162 26489 17337 30676 26476 28318 25445 14741 4102 11090 22254
$$ packed form
9130G05472j31352p8322p8292p0868m3132n2063j4316K679k6272k1003l3l3023
9118A59475l6810j5573j8520p586r832k895m71j8076j3771M2500N091j4450L928
9105G3010J528k3602q847K6787J5732k3325k0091j6735Q305M1337L1613J6236
9093A21948j8412m2274o365k246l073J078k1183P928J211M507K2637k1520O374
9080E0610j5564k5806j4040K9034L4201o406pJ620Q649J5034n108J1941N153q616
9066H0695j960J293k8681K67R204k0563M65J3831M986J2381j0343j7180j0823
9053C3572l98j3235j5423p055R484k003L96O072K2401M058l7022j6843J7959K9286
9039C1249j6696j3472J0081J5327r152J3339m200J842k873j0704j0639O988J1164
$$ plain form
9026 22254 24218 12187 38192 67713 62286 46419 39924 36101 22290 38994 63387 42938 21109
9013 21109 30595 8457 27906 36327 28386 22272 2061 -6607 -10080 -1785 21587 34944 26664
9000 26664 2502 -20099 -1494 -13702 -15020 -25596 96 2381 -15979 4734 -22386 -9546
8988 -9546 12447 9901 -6616 -13839 2007 28633 20343 14197 20486 29875 -19 -44197 -64171
8975 -64171 -57827 -33536 -9580 -7028 -3939 -9541 -5355 16978 23341 26663 3407 256 18229
8962 18229 16217 -19500 -38794 -21238 -7357 -22059 13991 47295 51554 28509 27202 54983
8950 54983 89972 74064 43714 35725 22363 -4807 -8500 -6661 -12398 -3895 -808 14426 23062
8937 23062 -9597 -35593 -19052 -11483 11511 2876 7920 19820 20378 45398 57923 72029 80462
$$ packed form
9026B2254J964j2031K6005K9521n427j5867o495l823j3811J6704K4393k0449k1829
9013B1109R486k2138J9449Q421p941o114k0211q668l473Q295K3372J3357q280
9000B6664k4162k2601J8605j2208j318j0576K5692K285j8360K0713k7120J2840
8988i546K1993k546j6517p223J5846K6626q290o146O289R389k9894m4178j9974
8975f4171O344K4291K3956K552L089n602M186K2333O363L322k3256l151J7973
8962A8229k012l5717j9294J7556J3881j4702L6050L3304M259k3045j307K7781
8950E4983L4989j5908l0350p989j3362k7170l693J839n737Q503L087J5234Q636
8937B3062l2659k5996J6541P569K2994q635N044J1900N58K5020J2525J4106Q433
$$ plain form
8924 80462 47185 57845 74021 49773 63001 52119 17414 -2330 -1536 -8611 -16042 28730 36164
8911 36164 11407 -10734 -18646 -22449 -22363 -20256 -34856 -43776 -29628 -27931 7646 32325 15278
8898 15278 10939 19650 6793 9785 17426 9315 15781 3120 4820 20386 8669 34067 31091
8885 31091 13957 21231 16819 -965 -20118 -29317 -30061 -33553 -18129 -3363 2927 211 -6397 2843
8871 2843 -19379 -28268 -19519 -11454 -17075 -8539 11088 35313 -108 -7703 -7760 10469 -3134 -30653
8857 -30653 -31501 -10125 -12833 6136 -6627 -14723 -14842 3626 31064 25624 24327 37944 42759 29062
8843 29062 16965 11443 34198 54677 25553 1735 12461 33795 53019 53225 60533 68287 61166
8830 61166 66922 51548 21061 -27912 -37747 -17722 -3574 -17907 -38080 -54570 -40370 -41948
$$ packed form
8924H0462l3277J0660J6176k4248J3228j0882l4705j9744P94p075p431M4772P434
8911C6164k4757k2141p912l803Q6K107j4600q920J4148J697L5577K4679j7047
8898A5278m339Q711j2857K992P641q111O466j2661J700J5566j1717K5398k976
8885C1091j7134P274m412j7784j9153r199p44l492J5424J4766O290k716o608R240
8871B843k2222q889Q749Q065n621Q536J9627K4225l5421p595n7J8229j3603k7519
8857c0653q48K1376k708J8969j2763q096j19J8468K7438n440j297J3617M815j3697
8843B9062j2097n522K2755K0479k9124k3818J0726K1334J9224K06P308P754p121
8830F1166N756j5374l0487m8973r835K0025J4148j4333k0173j6490J4200j578
$$ plain form
8818 -41948 -46050 -56746 -28256 603 -3779 5587 3226 -29075 -50460 -51207 -8972 662 -21244
8805 -21244 -18961 -23536 -15571 -17124 6633 14901 -4990 -4333 -31317 -50375 -20326 -21484 -9344
8792 -9344 32008 46063 27502 8689 26009 36655 40332 20550 -13898 19561 39746 49184
8780 49184 24392 -15910 -24055 -13600 -3286 -5057 -32002 -30545 -32677 -54473 -64958 -48634 -19232
8767 -19232 364 25903 21066 27541 37292 11636 7454 -7557 -12538 -13248 -6402 13304 8940 -2363
8753 -2363 -1785 -16280 -23251 -18831 -25745 -31152 5722 36448 21640 -8612 -6166 14168 7125 -27823
8739 -27823 -40000 -31505 -11471 267 15190 17070 -1362 -3576 -1237 14583 63590 66903 60333
8726 60333 73522 70136 83186 47266 56352 61283 32650 22953 18713 35436 38227 71711 89953
$$ packed form
8818d1948m102j0696K8490K8859m382R366k361l2301k1385p47M2235R634k1906
8805b1244K283m575P965j553K3757Q268j9891O57k6984j9058L0049j158J2140
8792i344M1352J4055j8561j8813J7320J0646L677j9782l4448L3459K0185R438
8780D9184k4792m0302q145J0455J0314j771k6945J457k132k1796j0485J6324K9402
8767a9232J9596K5539m837O475R751k5656m182j5011m981p10O846J9706m364j1303
8753b363N78j4495o971M420o914n407L6874L0726j4808l0252K446K0334p043l4948
8739b7823j2177Q495K0034J1738J4923J880j8432k214K339J5820M9007L313o570
8726F0333J3189l386J3050l5920R086M931k8633r697m240J6723K791L3484J8242
$$ plain form
8713 89953 65261 13689 -19889 -3885 -3113 -2124 14616 20656 12529 -7394 -13425 -8915 -30184
8700 -30184 -28097 -26156 -43333 -20159 4802 9073 4386 32534 71893 79253 104826 135252 169391
8687 169391 210914 291681 423569 583143 779833 851242 789998 607963 399759 257249
8677 257249 193021 174233 178009 158613 116827 80183 42023 31853 14485 -11287 -5988 29158
8665 29158 97715 143005 144720 123126 115269 136524 182655 287935 427424 577394 750726
8654 750726 844367 787975 609115 415576 265167 185881 130203 117059 89462 90659 91460 73646
8642 73646 62253 72775 74366 77023 51814 21136 5701 27889 65619 50355 58880 55831 30736
8629 30736 -6709 302 -5200 -29427 -31485 -8315 8254 13842 -17922 -30281 -5074 23113 5886
$$ packed form
8713H9953k4692n1572l3578J6004P72R89J6740O040q127j9923o031M510k1269
8700c0184K087J941j7177K3174K4961M271m687K8148L9359P360K5573L0426L4139
8687A69391M1523Q0767J31888J59574J96690P1409o1244j82035k08204j42510
8677B57249o4228j8788L776j9396m1786l6644l8160j0170j7368k5772N299L5146
8665B9158O8557M5290J715k1594p857K1255M6131J05280J39489J49970J73332
8654G50726R3641n6392j78860j93539j50409p9286n5678j3144k7597J197Q01j7814
8642G3646j1393J0522J591K657k5209l0678j5435K2188L7730j5264Q525l049k5095
8629C0736l7445P011n502k4227k058K3170J6569N588l1764j2359K5207K8187j7227
$$ plain form
8616 5886 -2851 -2171 -8505 21471 42017 33303 18408 5413 14068 -4891 5562 21950 16547
8603 16547 13362 17189 2119 8379 15095 12746 15497 -16202 -29348 -30856 -36962 -6859 3348
8590 3348 9711 26062 41687 45884 7912 -11522 9281 45217 53153 81266 98837 77600 41802
8577 41802 41861 48481 27731 21877 -935 -5464 1832 3655 -893 8943 24079 31502 49545 39447
8563 39447 64890 63071 65946 65978 52078 56476 74710 87031 110960 108612 147394 180394 171108
8550 171108 159444 163855 207944 288726 410725 600098 902992 1401198 2268539 3816217
8540 3816217 5917469 6605329 5331833 3768831 2502945 1588035 1056241 768640 588862
8531 588862 462184 364300 289991 237804 243463 253664 263874 235818 191365 151853 144405 156296
$$ packed form
8616E886q737O80o334K9976K0546q714j4895j2995Q655j8959J0453J6388n403
8603A6547l185L827j5070O260O716k349K751l1699j3146j508o106L0103J0207
8590C348O363J6351J5625M197l7972j9434K0803L5936P936K8113J7571k1237l5798
8577D1802N9O620k0750n854k2812m529P296J823m548R836J5136P423J8043j0098
8563C9447K5443j819K875L2j3900M398J8234J2321K3929k348L8782L3000r286
8550A71108j1664M411M4089Q0782J21999J89373L02894M98206Q67341J547678
8540C816217K101252O87860j273496j563002j265886r14910n31794k87601j79778
8531E88862j26678r7884p4309n2187N659J0201J0210k8056m4453l9512p448J1891
$$ plain form
8519 156296 155565 185942 173963 158452 185773 213547 252145 269092 259361 263280 274324 347988
8507 347988 463721 672835 997187 1539166 2482481 4184153 6151408 6310970 4923358
8498 4923358 3448484 2268388 1475837 993288 706704 558340 456945 347477 285278
8489 285278 261710 240764 232580 197977 200496 178693 126605 88339 64649 70657 76450 81458 78628
8476 78628 90149 88569 54964 46659 70173 83833 96152 98404 65111 43310 46542 19896 -2140
8463 -2140 5052 3627 33524 36340 23986 6038 -12638 -15400 -9090 12946 9791 24568 36923
8450 36923 32696 43915 28745 4430 15634 66760 72333 69918 63325 66169 50331 35914 50438
8437 50438 59140 67925 68976 68696 39985 35319 38703 17822 16830 25394 7956 -29361 -8097 -1357
$$ packed form
8519A56296p31L0377j1979j5511K7321K7774L8598J6947r731L919J1044P3664
8507C47988J15733K09114L24352N41979R43315J701672J967255J59562j387612
8498D923358j474874j180096p92551m82549k86584j48364j01395j09468o2199
8489B85278k3568k0946q184l4603K519k1803n2088l8266k3690O008N793N008k830
8476G8628J1521j580l3605q305K3514J3660J2319K252l3293k1801L232k6646k2036
8463b140P192j425K9897K816j2354j7948j8676k762O310K2036l155J4777J2355
8450C6923m227J1219j5170k4315J1204N1126N573k415o593K844j5838j4417J4524
8437E0438Q702Q785J051k80k8711m666L384k0881r92Q564j7438l7317K1264O740
$$ plain form
8423 -1357 -11270 -4751 -7719 23350 36300 25322 23277 -16631 -31023 -34903 -29004 -32362 -48154
8410 -48154 -48265 -66531 -98860 -88170 -71628 -67303 -64284 -60918 -27137 -474 30422 27767 13953
8397 13953 15345 -785 -15966 -18906 -2614 7427 -4460 -5130 -1241 7230 -8746 14833 6351
8384 6351 12814 32512 39699 34127 20202 27915 33841 24884 632 -8983 -595 -1838 -20229 -1444
8370 -1444 16243 14237 -2055 3249 -401 19893 7835 -56 -12131 -10471 11837 34409 24748
8357 24748 16025 37052 14351 -9844 -6076 -13240 2028 25109 17309 -9813 -23790 -40025 -16729
8344 -16729 -3422 18840 20264 9363 13959 16342 27006 30542 9137 1387 -12807 -13347 7967
8331 7967 26119 27386 21467 2568 -27126 -14570 19354 27537 29758 19159 17151 8164 -11250
$$ packed form
8423a357r913O519k968L1069J2950j0978k045l9908j4392l880N899l358j5792
8410d8154j11j8266l2329J0690J6542M325L019L366L3781K6663L0896k655j3814
8397A3953J392j6130j5181k940J6292J0041j1887o70L889Q471j5976K3579q482
8384F351O463J9698P187n572j3925P713N926q957k4252r615Q388j243j8391J8785
8370a444J7687k006j6292N304l650K0294j2058p891j2075J660K2308K2572r661
8357B4748q723K1027k2701k4195L768p164J5268K3081p800k7122j3977j6235K3296
8344a6729J3307K2262J424j0901M596K383J0664L536k1405p750j4194n40K1314
8331G967J8152J267n919j8899k9694J2556L3924Q183K221j0599k008q987j9414
$$ plain form
8318 -11250 -12145 -26759 -32681 -11845 -12963 -4858 -295 -1627 -11723 -19450 -24697 -13402 38316 58377
8304 58377 36899 19913 23726 15348 125 -2692 347 22892 41921 48715 40773 43011 35695
8291 35695 20181 14629 21220 19601 13888 26802 -3468 -14595 20538 42576 34388 31141 29768
8278 29768 -21250 -6527 18560 -4467 -14217 10102 3909 22879 27600 35077 6264 7650 15361
8265 15361 -1915 -5388 38 -31433 -19093 -26567 -39763 -52759 -51895 -21406 8399 42638 48139
8252 48139 27873 7395 -5142 15775 15264 -2670 -8879 -14988 -8075 3433 2325 -5720 -17557
8239 -17557 -33194 -5693 29985 -680 -8866 -22309 11129 48654 20904 41776 51548 32040
8227 32040 -12714 -32608 -16412 9242 48708 73181 56467 47515 45336 20563 -2326 2024
$$ packed form
8318a1250q95j4614n922K0836j118Q105M563j332j0096p727n247J1295N1718K0061
8304E8377k1478j6986L813q378j5223k817L039K2545J9029O794p942K238p316
8291C5695j5514n552O591j619n713J2914l0270j1127L5133K2038q188l247j373
8278B9768n1018J4723K5087k3027r750K4319o193J8970M721P477k8813J386P711
8265A5361j7276l473N426l1471J2340p474j3196j2996Q64L0489K9805L4239N501
8252D8139k0266k0478j2537K0917n11j7934o209o109O913J1508j108q045j1837
8239a7557j5637K7501L5678l0665q186j3443L3438L7525k7750K0872R772j9508
8227C2040m4754j9894J6196K5654L9466K4473j6714q952k179k4773k2889M350
$$ plain form
8215 2024 24186 19158 39593 34470 34819 42590 46072 40908 8854 9214 2628 -3364 -5881 8758
8201 8758 27160 44687 48000 32096 9219 12382 20783 39090 28233 10595 6861 5327 10781
8188 10781 10756 1121 19491 25679 13071 17301 36211 36129 52705 40186 25801 35868 57585 59498
8174 59498 45981 50497 52573 32308 -12953 -49849 -62419 -45512 -32686 -7430 16857 28682
8162 28682 35696 15205 16192 9379 15511 14438 36479 31000 13311 6640 -964 -16761 -37274 -20589
8148 -20589 -2674 17887 28252 12072 24593 30316 54462 63514 57037 64433 73594 65111 49922
8135 49922 75070 64838 43163 42415 59364 34771 31505 52934 49821 53137 74696 52546 13362
8122 13362 -22833 -7446 -196 29865 31946 21597 33386 31434 37511 24352 -5844 -10024 13017
$$ packed form
8215B024K2162n028K0435n123L49P771L482n164l2054L60o586n992k517J4639
8201H758J8402J7527L313j5904k2877L163Q401J8307j0857j7638l734j534N454
8188A0781k5r635J8370O188j2608M230J8910q2J6576j2519j4385J0067K1717J913
8174E9498j3517M516K076k0265m5261l6896j2570J6907J2826K5256K4287J1825
8162B8682P014k0491R87o813O132j073K2041n479j7689o671p604j5797k0513J6685
8148b0589J7915K0561J0365j6180J2521N723K4146R052o477P396R161q483j5189
8135D9922K5148j0232k1675p48J6949k4593l266K1429l113L316K1559k2150l9184
8122A3362l6195J5387P250L0061K081j0349J1789j952O077j3159l0196m180K3041
$$ plain form
8109 13017 8788 54 10202 6370 6311 36431 63764 66660 51091 38196 73691 68775 32991
8096 32991 27921 20969 530 -2025 5672 33681 43061 8592 -4182 2173 -4671 -25339 -38306
8083 -38306 -28095 -11339 86 12341 38435 40877 42280 37482 20295 20174 23810 48564 35568
8070 35568 14129 10859 34282 26363 6584 7364 23884 20544 -9075 -39363 -46400 -14928 13495
8057 13495 32034 35035 5182 -19930 9417 13069 10601 18141 13213 25025 21559 12762 26963
8044 26963 24876 16602 2314 7025 7296 11795 34789 43748 37188 29617 16671 29983 7651 -25103
8030 -25103 -24344 5919 17640 16061 1847 -16988 -3454 -4028 -321 -7575 1495 12510 40097
8017 40097 49720 38148 9154 16539 23439 35689 18072 -13301 7187 1162 19795 35737 35438
$$ packed form
8109A3017m229q734J0148l832n9L0120K7333K896j5569j2895L5495m916l5784
8096C2991n070o952k0439k555P697K8009R380l4469j2774O355o844k0668j2967
8083c8306J0211J6756J1425J2255K6094K442J403m798j7187j21L636K4754j2996
8070C5568k1439l270K3423p919j9779P80J6520l340k9619l0288p037L1472K8423
8057A3495J8539L001k9853k5112K9347L652k468P540m928J1812l466q797J4201
8044B6963k087q274j4288M711K71M499K2994Q959o560p571j2946J3312k2332l2754
8030b5103P59L0263J1721j579j4214j8835J3534n74L707p254R070J1015K7587
8017D0097R623j1572k8994P385O900J2250j7617l1373K0488o025J8633J5942k99
$$ plain form
8004 35438 48809 83848 72318 52914 48480 24711 -6573 -18132 22465 34649 29092 4599
7992 4599 22875 20485 -11884 -25586 28129 74327 94857 75351 54435 41792 36794 12467
7980 12467 18085 26684 39243 31799 17557 13606 15456 14767 7079 -21083 -33834 -38597 -34376 -14316
7966 -14316 -16869 -22522 -40049 -67169 -58658 -19360 21308 7887 1959 3232 -6397 -8321 -8166 10178
7952 10178 -12662 -17445 102 16754 9461 4487 -21262 -25644 -25027 978 -2693 -31564 -25254
7939 -25254 -4547 15838 11909 6182 10471 18979 39242 12450 -10193 -12881 -25471 -9225 -18798
7926 -18798 -44510 -54302 -37313 2409 30063 46009 40645 20429 12747 5685 -7108 6422 20823
7913 20823 21568 25004 40491 62189 55583 18192 18307 17686 -1061 -1823 14452 27692 8239 -13734
$$ packed form
8004C5438J3371L5039j1530j9404m434k3769l1284j1559M0597J2184n557k4493
7992D599J8276k390l2369j3702N3715M6198K0530j9506k0916j2643m998k4327
7980A2467N618Q599J2559p444j4242l951J850o89p688k8162j2751m763M221K0060
7966a4316k553n653j7527k7120Q511L9298M0668j3421n928J273r629j924J55J8344
7952A0178k2840m783J7547J6652p293m974k5749m382O17K6005l671k8871O310
7939b5254K0707K0385l929n727M289Q508K0263k6792k2643k688j2590J6246r573
7926a8798k5712r792J6989L9722K7654J5946n364k0216p682p062j2793J3530J4401
7913B0823P45L436J5487K1698o606l7391J15o21j8747p62J6275J3240j9453k1973
$$ plain form
7899 -13734 -14495 -13530 -4229 10067 29650 43978 36032 23832 28438 26340 43554 34614 -24366 -43650
7885 -43650 -26135 -10758 -11945 1819 4082 14885 23095 24190 30189 30603 29286 23480 19840 27484
7871 27484 18671 -17322 -12590 -1828 -12746 -33923 -28472 -9394 4813 16428 1441 -33114
7859 -33114 -58628 -39762 -13247 -6425 -1083 -8149 -7149 18863 31863 -6254 4825 7280 -9198
7846 -9198 -15969 -22524 -13957 1993 4573 -4630 -12614 -27374 -6202 -6913 -11193 -18112 -32439 -18619
7832 -18619 -31446 -44416 -33226 -38015 -38214 -31627 -66735 -67645 -41744 -25454 -18668 -11091 -31356
7819 -31356 -30451 -44324 -37866 -15498 -11801 -17192 -1411 14548 18502 6358 10225 14891 4719
7806 4719 -15588 -8954 -9529 -9830 -1156 6232 -10407 -30243 -20331 -27709 -3214 18454 32674 31008
$$ packed form
7899a3734p61R65R301J4296J9583J4328p946j2200M606k098J7214q940n8980j9284
7885d3650J7515J5377j187J3764K263J0803Q210J095N999M14j317n806l640P644
7871B7484q813l5993M732J0762j0918k1177N451J9078J4207J1615j4987l4555
7859c3114k5514J8866K6515O822N342p066J000K6012J3000l8117J1079K455j6478
7846i198o771o555Q567J5950K580r203p984j4760K1172p11m280o919j4327J3820
7832a8619j2827j2970J1190m789j99O587l5108r10K5901J6290O786P577k0265
7819c1356R05j3873O458K2368L697n391J5781J5959L954j2144L867M666j0172
7806D719k0307O634n75l01Q674P388j6639j9836R912p378K4495K1668J4220j666
$$ plain form
7792 31008 15484 40044 60942 52865 17115 5899 -713 -11746 -13634 10199 23579 -7952
7780 -7952 -15606 -8444 4478 -4008 -24026 -8367 20035 32979 14922 -17504 -43359 -62516 -40831
7767 -40831 -3555 7947 17464 6441 8174 -8287 -16589 -5383 3903 8128 1368 -10333 -455
7754 -455 13228 7711 10931 4255 21428 19096 4658 -6723 -9351 -7920 -754 8911 3680 -9069
7740 -9069 -13576 -23514 -21313 -12701 -20892 -19992 -21869 8145 48988 41681 21094 4245 25093 -2654
7726 -2654 -46428 -48929 -30000 -25889 -8958 1303 -10163 -20873 -29434 -32043 -30617 -20436 -3829
7713 -3829 -7556 13550 39400 33186 27423 27067 19663 7211 -17334 -20744 -2042 2637 -10704 -20229
7699 -20229 -14623 -13572 -18835 -17196 -7469 -6882 5437 17280 -6217 8604 15437 17945 9765 -5067
$$ packed form
7792C1008j5524K4560K0898q077l5750j1216o612j1033j888K3833J3380l1531
7780g952p654P162J2922q486k0018J5659K8402J2944j8057l2426k5855j9157K1685
7767d0831L7276J1502R517j1023J733j6461q302J1206R286M225o760j1701R878
7754d55J3683n517L220o676J7173k332j4438j1381k628J431P166R665n231j2749
7740i069m507r938K201Q612q191R00j877L0014M0843p307k0587j6849K0848k7747
7726b654m3774k501J8929M111J6931J0261j1466j0710q561k609J426J0181J6607
7713c829l727K1106K5850o214n763l56p404j2452k4545l410J8702M679j3341r525
7699b0229N606J051n263J639R727N87J2319J1843k3497J4821O833K508q180j4832
$$ plain form
7685 -5067 -18556 -9950 16982 8598 40336 44581 41783 46890 47085 22394 11953 -19240 -5894
7672 -5894 -2544 2609 3420 20896 28225 14691 1379 -1177 -25394 -36056 -14140 11658 27053
7659 27053 12678 28446 50250 48428 40549 25635 2427 -17249 -26591 -36538 -62058 -64788 -8262
7646 -8262 35283 57446 57395 67176 58969 45758 44076 -3267 -22710 12196 23193 20608 11721 5943
7632 5943 3002 734 13455 -8170 -13380 14365 5084 4522 18586 6328 -4886 -6424 2600 1444
7618 1444 19162 28857 40429 53306 38454 29946 33422 32359 49359 38674 35111 36964 -105
$$ packed form
7685e067j3489Q606K6932q384L1738M245k798N107J95k4691j0441l1193J3346
7672e894L350N153Q11J7476P329j3534j3312k556k4217j0662K1916K5798J5395
7659B7053j4375J5768K1804j822p879j4914k3208j9676r342r947k5520k730N6526
7646h262M3545K2163n1R781q207j3211j682m7343j9443L4906J0997k585q887n778
7632E943k941k268J2721k1625n210K7745r281n62J4064j2258j1214j538R024j156
7618A444J7718R695J1572J2877j4852q508L476j063J7000j0685l563J853l7069
$$ [...]
##END NTUPLES=NMR SPECTRUM
##END=
