##TITLE=Analysis number 326165
Compound Code cc 38001
Book Reference 423/130/1
Project Code adrs
Chemist Name bruced
##JCAMPDX= 6.0         $$ Bruker NMR JCAMP-DX V2.0
##DATA TYPE= NMR SPECTRUM
##DATA CLASS= NTUPLES
##ORIGIN= Bruker BioSpin GmbH
##OWNER= nmr
$$ XWIN-NMR		Version 3.5
$$ Fri Jan 26 08:34:55 2007 GMT Standard Time (UT+0h)  MAYBRIDGE\nmr@NMR_250MHZ
##.OBSERVE FREQUENCY= 250.131544655141
##.OBSERVE NUCLEUS= ^1H
##.ACQUISITION MODE= SIMULTANEOUS (DQD)
##.ACQUISITION SCHEME= undefined
##.AVERAGES= 16
##.DIGITISER RES= 18
##SPECTROMETER/DATA SYSTEM= dpx250
##.PULSE SEQUENCE= zg30
##.SOLVENT NAME= DMSO
##.SHIFT REFERENCE= (INTERNAL, DMSO, 0, 16.522)
##AUDIT TRAIL= $$ (NUMBER, WHEN, WHO, WHERE, WHAT)
$$ ##TITLE= Audit trail, XWIN-NMR		Version 3.5
$$ ##JCAMPDX= 5.01
$$ ##ORIGIN= Bruker BioSpin GmbH
$$ ##OWNER= nmr
$$ C:\u/data/dgb/nmr/ADRS/2120/pdata/1/auditp.txt
$$ ##AUDIT TRAIL=  $$ (NUMBER, WHEN, WHO, WHERE, WHAT)
(   1,<2007-01-26 08:34:29.99 +000>,<MAYBRIDGE\nmr>,<NMR_250MHZ>,
      <created by zg, POWCHK disabled, PULCHK disabled
       configuration hash MD5:
       49 4B E0 1D 92 C2 6B 37 9F E6 65 BC 52 41 86 1D
       data hash MD5: 64K
       8E E4 13 54 37 EF 16 D8 70 17 B0 87 59 60 00 30>)
(   2,<2007-01-26 08:34:44.18 +000>,<MAYBRIDGE\nmr>,<NMR_250MHZ>,
      <Start of raw data processing
       ef LB = 0.3 FT_mod = 6 PKNL = 1 SI = 32K 
       data hash MD5: 32K
       90 F2 F9 7D 81 A7 90 24 94 59 5F 0E E7 01 8E 59>)
(   3,<2007-01-26 08:34:45.82 +000>,<MAYBRIDGE\nmr>,<NMR_250MHZ>,
      <apk 
       data hash MD5: 32K
       4C 4D EC 0C B3 41 AC F8 9F 3B 7E ED 18 1B 11 5E>)
(   4,<2007-01-26 08:34:46.52 +000>,<MAYBRIDGE\nmr>,<NMR_250MHZ>,
      <abs ABSG = 5 
       data hash MD5: 32K
       DD 43 F0 AD FD B0 E0 D6 79 7D AA 21 7E 78 90 DB>)
$$ ##END=
$$ 
$$ hash MD5
$$ C2 D4 34 42 DF B5 D5 2C 54 BA 99 3A 7C 29 DC 74
##$RELAX= 
##$RELAX= 
##$RELAX= 
##$RELAX= 
##$RELAX= 
##$RELAX= 
##$RELAX= 
$$ Bruker specific parameters
$$ --------------------------
##$DU= <C:\u>
##$EXPNO= 2120
##$NAME= <ADRS>
##$PROCNO= 1
##$TYPE= <nmr>
##$USER= <dgb>
##$AMP= (0..31)
100 100 100 100 100 100 100 100 100 100 100 100 100 100 100 100 100 100 
100 100 100 100 100 100 100 100 100 100 100 100 100 100 
##$AQSEQ= 0
##$AQ_mod= 3
##$AUNM= <au_zg>
##$AUTOPOS= <1 >
##$BF1= 250.13
##$BF2= 250.13
##$BF3= 250.13
##$BF4= 250.13
##$BF5= 500.13
##$BF6= 500.13
##$BF7= 500.13
##$BF8= 500.13
##$BYTORDA= 1
##$CFDGTYP= 0
##$CFRGTYP= 5
##$CHEMSTR= <none>
##$CNST= (0..31)
1 1 145 1 1 1 1 1 1 1 1 1 1 1 1 1 1 1 1 1 1 1 1 1 1 1 1 1 1 1 1 1 
##$CPDPRG= <>
##$CPDPRG1= <>
##$CPDPRG2= <>
##$CPDPRG3= <>
##$CPDPRG4= <mlev>
##$CPDPRG5= <mlev>
##$CPDPRG6= <mlev>
##$CPDPRG7= <mlev>
##$CPDPRG8= <mlev>
##$CPDPRGB= <>
##$CPDPRGT= <>
##$D= (0..31)
0 1 0 0 0 0 0 0 0 0.06 0 0 0 0 0 0 0.0002 0 0 0 0 0 0 0 0 0 0 0 0 0 0 
0 
##$DATE= 1169800468
##$DBL= (0..7)
120 120 120 120 120 120 120 120 
##$DBP= (0..7)
150 150 150 150 150 150 150 150 
##$DBP07= 0
##$DBPNAM0= <>
##$DBPNAM1= <>
$$ [...]
##$SUBNAM7= <"">
##$SUBNAM8= <"">
##$SUBNAM9= <"">
##$SW= 20.6930455092707
##$SWIBOX= (0..15)
0 0 3 0 0 0 0 0 0 0 0 0 0 0 0 0 
##$SW_h= 5175.983436853
##$TD= 65536
##$TD0= 1
##$TE= 294.16
##$TE2= 300
##$TE3= 300
##$TEG= 300
##$TL= (0..7)
0 120 120 120 120 120 120 120 
##$TP= (0..7)
150 150 150 150 150 150 150 150 
##$TP07= 0
##$TPNAME0= <>
##$TPNAME1= <>
##$TPNAME2= <>
##$TPNAME3= <>
##$TPNAME4= <>
##$TPNAME5= <>
##$TPNAME6= <>
##$TPNAME7= <>
##$TPOAL= (0..7)
0.5 0.5 0.5 0.5 0.5 0.5 0.5 0.5 
##$TPOFFS= (0..7)
0 0 0 0 0 0 0 0 
##$TUNHIN= 0
##$TUNHOUT= 0
##$TUNXOUT= 0
##$USERA1= <user>
##$USERA2= <user>
##$USERA3= <user>
##$USERA4= <user>
##$USERA5= <user>
##$V9= 5
##$VALIST= <valist>
##$VCLIST= <CCCCCCCCCCCCCCC>
##$VD= 0
##$VDLIST= <DDDDDDDDDDDDDDD>
##$VPLIST= <PPPPPPPPPPPPPPP>
##$VTLIST= <TTTTTTTTTTTTTTT>
##$WBST= 1024
##$WBSW= 4
##$XGAIN= (0..3)
0 0 0 0 
##$XL= 0
##$YL= 0
##$YMAX_a= 314523
##$YMIN_a= -337477
##$ZGOPTNS= <>
##$ZL1= 120
##$ZL2= 120
##$ZL3= 120
##$ZL4= 120
##$ABSF1= 16.522
##$ABSF2= -4.171173
##$ABSG= 5
##$ABSL= 3
##$ALPHA= 0
##$AQORDER= 0
##$ASSFAC= 0
##$ASSFACI= 0
##$ASSFACX= 0
##$ASSWID= 0
##$AUNMP= <proc_1d>
##$AZFE= 0.1
##$AZFW= 0.1
##$BCFW= 0
##$BC_mod= 0
##$BYTORDP= 0
##$COROFFS= 0
##$CY= 12.5
##$DATMOD= 1
##$DC= 0
##$DFILT= <>
##$DTYPP= 0
##$F1P= 14.0000005364418
##$F2P= -0.99999901652339
##$FCOR= 0.5
##$FTSIZE= 32768
##$FT_mod= 6
##$GAMMA= 0
##$GB= 0
##$INTBC= 1
##$INTSCL= 1
##$ISEN= 128
##$LB= 0.3
##$LEV0= 0
##$LPBIN= 0
##$MAXI= 10000
##$MC2= 0
##$MEAN= 0
##$ME_mod= 0
##$MI= 0
##$NCOEF= 0
##$NC_proc= -5
##$NLEV= 6
##$NOISF1= 0
##$NOISF2= 0
##$NSP= 0
##$NTH_PI= 0
##$NZP= 0
##$OFFSET= 16.522
##$PC= 1
##$PHC0= 212.2076
##$PHC1= 17.21671
##$PH_mod= 1
##$PKNL= yes
##$PPARMOD= 0
##$PSCAL= 4
##$PSIGN= 0
##$REVERSE= no
##$SF= 250.13
##$SI= 32768
##$SIGF1= 0
##$SIGF2= 0
##$SINO= 400
##$SIOLD= 32768
##$SREGLST= <1H.DMSO>
##$SSB= 0
##$STSI= 32768
##$STSR= 0
##$SW_p= 5175.98343685301
##$SYMM= 0
##$S_DEV= 0
##$TDeff= 65536
##$TDoff= 0
##$TI= <Analysis number 999999
Compound Code 99
Book Reference 9
Project Code 9>
##$TILT= no
##$TM1= 0
##$TM2= 0
##$TOPLEV= 0
##$USERP1= <user>
##$USERP2= <user>
##$USERP3= <user>
##$USERP4= <user>
##$USERP5= <user>
##$WDW= 1
##$XDIM= 32768
##$YMAX_p= 464020954
##$YMIN_p= -623285
$$ End of Bruker specific parameters
$$ ---------------------------------
##NTUPLES= NMR SPECTRUM
##VAR_NAME=  FREQUENCY,     SPECTRUM/REAL,   SPECTRUM/IMAG
##SYMBOL=    X,             R,               I
##VAR_TYPE=  INDEPENDENT,   DEPENDENT,       DEPENDENT
##VAR_FORM=  AFFN,          ASDF,            ASDF
##VAR_DIM=   32768,         32768,           32768
##UNITS=     HZ,            ARBITRARY UNITS, ARBITRARY UNITS
##FACTOR=    0.157963299565203, 1,           1
##FIRST=     4132.6476996994, 0,             0
##LAST=      -1043.33573715361, 0,           0
##MIN=       -1043.33573715361, -623285,     0
##MAX=       4132.6476996994, 464020954,     0
$$ Real data points
##PAGE= N=1
##DATA TABLE= (X++(R..R)), XYDATA
$$ [...]
14931b7526R902Q6368J9830n6107m1028J2708p043L8127j9096m015J1324N4282
14919G7726j7430k1910k0856j745N2938J4052m7428N826o5456p9372K8153K8902
14907d6600N468j4086l8391L211N9906K8688L291m1732l1164L303j9250N0666
14895c6690M1448L7714n9181K5143R522p708N3772k1232M1974l5439k1478m6645
14883a8800j2182K2796K725J7795j5284M5520l6842J151N0460n846p2742m1027
14871f2276N6724J4483k9487k5101K008l3762J13526J150j3130J9336K8099k0390
14859E1180n166N2141N1622M462n2214J5441K0955o8876l9920k0824P7268k0292
14847F5777O902j5875p1258R307r300m5037K8140L1914J2151p1207n299P4496
$$ plain form
14931 -27526 -17624 68744 88574 32467 -8561 4147 -2896 35231 16135 12120 23444 77726
14919 77726 60296 38386 17530 15785 68723 82775 35347 41173 -24283 -103655 -75502 -46600
14907 -46600 -41132 -55218 -93609 -90398 -30492 -1804 1487 -40245 -71409 -68106 -87356 -36690
14895 -36690 4758 42472 -16709 8434 17956 10248 64020 42788 84762 49323 27845 -18800
14883 -18800 -30982 -8186 -5461 12334 -2950 42570 5728 6879 57339 51493 -21249 -62276
14871 -62276 -5552 8931 -20556 -45657 -43649 -77411 36115 37265 24135 43471 71570 51180
14859 51180 46014 98155 149777 154239 102025 117466 138421 69545 29625 8801 86069 65777
14847 65777 72679 56804 -14454 -5147 -14447 -59484 -31344 570 12721 -58486 -63785 10711
14835A0711k9271j6085j8139J10694P8672k2593n2670m0596r894P5593R634q4713
14823A1343k4091j5549K7176K1405l7249J1870L4462P2281P2656M5173k1937p5811
14811A21729m7967K5819Q3913j7316m2993O075j8509j8619N882J3802n3365l2119
14799B6332Q3164O100p1334k7964r743N9215M1482j6090L7163J430m8435k0848
14787F0472j14353q4988J00497N1211k2176Q9196J9353p0641J9275L2536o162
14776G4220M3364n8160n0923L4691n8893J3694L6136K6670m8796K1222R4597j8353
14764A09469k1723M8702l6903j6855J2690L6133l2244l7406j9896K5037K0056
14753H7060L7093q604l883J3569J5318o3332p6708M4546M775j8179r263O6954
$$ plain form
14835 10711 -18560 -34645 -52784 57910 136582 113989 61319 20723 10829 86422 96056 11343
14823 11343 -12748 -28297 -1121 20284 -16965 -5095 29367 101648 174304 219477 197540 121729
14811 121729 73762 99581 183494 166178 123185 129260 110751 92132 98014 111816 58451 26332
14799 26332 109496 115596 44262 16298 6555 65770 107252 91162 128325 129755 81320 60472
14787 60472 -53881 -138869 -38372 12839 -9337 79859 99212 28571 47846 80382 74220
14776 74220 117584 59424 8501 43192 -15701 -2007 34129 60799 12003 33225 127822 109469
14764 109469 87746 136448 99545 82690 95380 131513 99269 61863 41967 67004 87060
14753 87060 124153 115549 111666 125235 140553 77221 513 45059 49834 31655 22392 89346
14741H9346R201M8348K5646j00259l0859k2026M9187K3365m6713M095j6100p484
14729B5747n0173L6489L7439O6313j9357M827l992k2414j7965M5191r938J5774
14717A07941l308l4233k7132m4227j9439j2511L9057J9755J203j3883j1744l7307
14705c5828J6210O1390L1810n869q3160q0714K9412Q1737J2641M1961N0799l0206
14693I0183o766l5619N0910M7011n0321o807N2152M185K272k5276N3063o9398
14681A05589L031n5062m2674L6726K8260K8270k9287l2927k0633o2543j2288M0234
14669a3304K6321L9345Q8107q2392l7948J9087L08N7961p9875o4301J2897O552
14657b7242m5392J5315N8369R2300k0106j5502Q288O6893P8092j970m0054m8592
$$ plain form
14741 89346 98547 146895 172541 72282 41423 19397 68584 91949 45236 49331 33231 25747
14729 25747 -24426 12063 49502 115815 96458 101285 97293 74879 56914 102105 92167 107941
14717 107941 104633 70400 43268 -959 -20398 -32909 6148 25903 27106 13223 1479 -35828
14705 -35828 -19618 41772 73582 67713 -15447 -96161 -66749 14988 27629 69590 120389 90183
14693 90183 83417 47798 98708 145719 95398 88591 140743 144928 147200 121924 174987 105589
14681 105589 108620 53558 10884 47610 75870 104140 74853 41926 21293 -41250 -53538 -13304
14669 -13304 13017 52362 140469 58077 20129 39216 39524 97485 17610 -46691 -33794 -27242
14657 -27242 -72634 -57319 1050 93350 73244 57742 66030 132923 211015 209045 168991 120399
14645A20399p5741p3883j21516N2146J09618Q3441J3643j1590P259K0236J841
14634A25853L3561q7410j1262J9032k54k4457n3792L0766O4615J4919p7958j8169
14622A5444p0699P4319J06604L4973p7503j2207o5723j8876L720n363L3577J7332
14610C5598l6453L311J07668m5598k1830m0766J3317O0883L1269r8884j13236
14599a04721J9611P3039J31110k4260q2219K3601P749p797l1136m7760N169l839
14587d1453j186J7711K9651P4778K8495J3541l0644l9308j7123J7450l2286n5938
14575c6312L7896N6635Q9208M5980k1472r4780m1735M0559j7571o19O6841k5427
14563I9203l9458o7701k1987J02108l1359O25o5445Q7619P7505j4405l7479j5565
$$ plain form
14645 120399 44658 -29225 -150741 -98595 11023 94464 108107 96517 103776 124012 125853
14634 125853 159414 72004 60742 79774 79520 55063 1271 32037 96652 111571 33613 15444
14622 15444 -55255 19064 125668 160641 83138 70931 5208 -13668 -9948 -15311 18266 35598
14610 35598 -855 2456 110124 64526 42696 1930 15247 76130 107399 8515 -104721
14599 -104721 -85110 -12071 119039 94779 12560 36161 43910 36113 4977 -42783 -37614 -41453
14587 -41453 -42639 -24928 4723 79501 107996 121537 90893 51585 34462 51912 19626 -36312
14575 -36312 1584 58219 147427 193407 171935 77155 35420 75979 58408 57789 124630 99203
14563 99203 59745 -7956 -29943 72165 40806 41431 -24014 63605 141110 126705 89226 73661
14551G3661m956J0216M247k5768J3578J04900j2466j33912o8899J5718M2350M1560
14539F0229k8033L6089Q763L7059J8697l3807k7158J3754J067o4548K976L4505
14527E9593J1365L6933k8089j3605p778O0512j2370l209L9727l9900j9954O0325
14515A43550J6614k1171L4992K2722m680j04094j3432L4728l7395L0712J5387
14504A17933k9443P981J1145M3931M2677m4790m4564j01771p1105J7438J07749
14493E7181L3625o43M3281J3732o0455M0576k2205j400n0815N873k1323N121Q2313
14480A24861O505l0303p191O3786k7000j0952R5927M5242p4830o7249k5467m7126
14468D6203M4753k3604k867J3741L3582N4224p7575j7104P8215J0077l3572l3370
$$ plain form
14551 73661 68705 78921 83168 57400 70978 175878 163412 29500 -39399 -23681 18669 60229
14539 60229 32196 68285 77048 114107 132804 98997 71839 85593 86660 22112 25088 59593
14527 59593 70958 107891 79802 66197 58419 118931 106561 103352 143079 103179 83225 143550
14515 143550 160164 138993 173985 196707 192027 87933 74501 109229 71834 102546 117933
14504 117933 88490 96471 107616 151547 194224 149434 104870 3099 -68006 -50568 57181
14493 57181 90806 90163 133444 147176 86721 127297 105092 103692 52877 58750 37427 42548 124861
14480 124861 131366 101063 93872 157658 130658 119706 215633 260875 186045 118796 93329 46203
14468 46203 90956 67352 64485 78226 111808 166032 88457 71353 149568 159645 126073 92703
14456I2703l037L6889r2345k2778P1547J7250q844p23K4393K8585j1876J5976
14444A47740k2588j02419l1676Q11o513j8676m2062l0812J01400J43984j640m4091
14432I3458p9227j820M7634K9277P7748N4273j9840n8294n0874J0396P2063j8963
14420A55831p6799p0899l3565N3499J25379L9012m9169n2416m9371j8834M1337
14409F4005M3036L3072l9195J4009K008l9193J3208q4023m2802q950M8150Q2776
14397H6101m1415o2138N627j6411J7499Q9842o0088m944N4482k7590l5723n1300
14385d6058K4208N8524M7308N5933R679k3270n2108k436L3735K178J8054o705
14373A19042R339J31747k074q133k778m2364J3984o730j40692K925N8015O9913
$$ plain form
14456 92703 89666 126555 34210 11432 82979 100229 91385 90662 115055 143640 131764 147740
14444 147740 125152 22733 -8943 -8132 -14645 -33321 -75383 -106195 -4795 139189 137549 93458
14432 93458 14231 12411 60045 89322 167070 221343 201503 143209 92335 102731 174794 155831
14420 155831 79032 8133 -25432 28067 153446 192458 143289 90873 41502 22668 64005
14409 64005 107041 140113 100918 114927 116935 77742 90950 6927 -35875 -44825 3325 86101
14397 86101 44686 -17452 -11825 -28236 -10737 79105 19017 14073 68555 40965 5242 -46058
14385 -46058 -21850 36674 83982 139915 149594 126324 74216 71780 105515 107693 125747 119042
14373 119042 128381 260128 258054 249921 247143 204779 218763 212033 71341 74266 132281 202194
14361B02194J4757K7771L2964m9779j24m7554o5402j1208J08103O2535j0549j3903
14349B49805m635p1081k7474J5573l0282M6833O8355L2548n4225O4719Q222n3221
14337B45137m2144m5238n2416K0274p677M585o426K3471N6323O9194J4141l1368
14325B47856o2264n8627j12465M4272R8013P7989j470K918J6083O926j8760r2782
14313A47689m4753k6677R645J8949J00783L7032J3573q0345l7165k7605L9625
14302A50751N8402K0409Q845p8795m0999L566r662L8072P6728K3568q3700K8947
14290A96132j01234l639O1584k3122m2958k3432q980L884n307J944P4058O5193
14278A94123p380j9237P4386j7859n1995M0152j5053J0702l0m1596n0856o125
$$ plain form
14361 202194 216951 244722 277686 227907 227783 180229 114827 103619 211722 274257 263708 249805
14349 249805 245170 174089 146615 162188 131906 178739 247094 279642 225417 290136 298358 245137
14337 245137 202993 157755 105339 125613 117936 122521 116095 139566 195889 265083 279224 247856
14325 247856 185592 126965 14500 58772 156785 234774 233304 236222 252305 259231 240471 147689
14313 147689 102936 76259 85904 104853 205636 242668 256241 175896 138731 111126 150751
14302 150751 209153 229562 238407 159612 118613 122179 112517 150589 227317 250885 167185 196132
14290 196132 94898 91259 152843 129721 86763 63331 54351 58235 52928 54872 128930 194123
14278 194123 186743 167506 241892 224033 172038 212190 197137 207839 207809 166213 115357 109232
14266A09232O3900J13790J8646j04477j06458o3012m3253M6678N7374K620N0603
14255A45643M5765l6329r3731p835R769J2428N9524J7230o914O8285n9378m051
14243A50406P999k8588J9601k8104K3994J2297o8483k0595L3655k5160R2714O2185
14231B31921q403j01726p3043M2801N2195j10743j9110N3214Q543O4468j3568
14220A26549K5075J2923j2492m755j3976L236K3866J6138N5878Q193m7947p2640
14208A20048j16238m0446Q7265L8828M3917L574n8483P5005j2794j2967M9190
14197A76899j23179P062J23517m2752o7762r64N0903L6633K3947m985L3588K0734
14185B33641o1191n671J0923k461j0552K769m9052n5621L0075J04677j234Q903
$$ plain form
14266 109232 173132 286922 305568 201091 94633 31621 -11632 35046 92420 95040 145643
14255 145643 191408 155079 61348 53513 63282 75710 135234 152464 145550 213835 154457 150406
14243 150406 158405 129817 149418 121314 145308 157605 89122 68527 102182 77022 169736 231921
14231 231921 223518 121792 48749 91550 143745 33002 13892 67106 75649 140117 126549
14220 126549 151624 164547 152055 147300 133324 136560 160426 176564 232442 240635 192688 120048
14208 120048 3810 -36636 50629 89457 133374 136948 78465 153470 140676 127709 176899
14197 176899 53720 60782 184299 141547 73785 72821 123724 160357 184304 179319 212907 233641
14185 233641 172450 166779 177702 175241 164689 167458 118406 62785 92860 197537 196303 205206
14173B05206K9017J2024O0023o9242q332Q0390K9792r5160m8385m2075J841J18294
14161B73393p977K743K2281n8006j45375K6910O0630J0746K8863K0135J8541l9632
14149B13252p1935j8092K7110J5768K8813k5926q1717k8693n5956J08385R4386
14138B05395L5510L3078j9972k3156K0474O842o2707m0654n7054K9501R3918O0971
14126B82146j5860o5940k7116j4888l9716L5740j204K1344K4615L3006m0050o1796
14114A30281R421L8005J1485n6424l2784K3041o609l9310O0263J5934m9120k3713
14102H0470N9263K9692K9452O0807J2893l2060r5203p2110K2174O0143M6816j00408
14090A01929K041N5375N3897R278O7535P7165K6141p2865k6467l7193l4241k3090
$$ plain form
14173 205206 234223 246247 306270 237028 228696 309086 338878 243718 195333 153258 155099 273393
14161 273393 265416 268159 290440 232434 87059 113969 174599 185345 214208 234343 252884 213252
14149 213252 141317 123225 150335 166103 194916 168990 87273 58580 2624 111009 205395
14138 205395 240905 273983 254011 230855 251329 258171 195464 154810 97756 127257 221175 282146
14126 282146 266286 200346 173230 158342 118626 154366 153162 174506 199121 232127 192077 130281
14114 130281 139702 177707 189192 132768 99984 123025 116416 77106 137369 153303 104183 80470
14102 80470 139733 169425 198877 259684 272577 240517 145314 73204 95378 155521 202337 101929
14090 101929 103970 159345 213242 222520 290055 367220 393361 320496 294029 256836 222595 199505
14078A99505r029K6529N0578l6230J6260J3497k0091l4216k5869K5688L5988K6731
14066B69341j9348N003L5701j9441m7792M5296P923m6823k4148K6514P236k5922
14054B13540n2658j29O2223J9246N8699M1897L9682j3908k8664k9261m6359o7217
14042A97091K959K0054k8095j2625O6091n9877n6490J6590L0478J1785p603P800
14030A88158o0444L7958k8561j7643N0258J7354k6304K0259k2927n3738k8859
14019G5511N6334Q6644M7064k7473m0810L0608k585P664M8837o8471n1693p16
14007A60914J2741L009L5389k6654N2980J4783L1198k1708n6236p9000j1903m5729
13995F9784P6747N6731K4426J02594N7216j1341q2744k9418P0195j9770J069p9561
$$ plain form
14078 199505 190476 217005 267583 231353 247613 261110 241019 206803 180934 206622 242610 269341
14066 269341 249993 254996 290697 271256 223464 268760 276683 229860 205712 232226 239462 213540
14054 213540 160882 160753 222976 242222 300921 342818 382500 368592 339928 310667 264308 197091
14042 197091 200050 220104 192009 179384 245475 185598 129108 145698 176176 187961 180358 188158
14030 188158 127714 165672 137111 119468 169726 187080 160776 181035 158108 104370 75511
14019 75511 131845 218489 265553 238080 197270 227878 225293 232957 281794 213323 161630 160914
14007 160914 173655 176664 212053 185399 238379 253162 284360 262652 206416 127416 115513 69784
13995 69784 146531 203262 227688 330282 387498 376157 293413 263995 334190 314420 315489 235928
13983B35928o3585N3204P3633Q715o0948n5842K8598l0930l6855m3390J9787p5810
13971E2505K378N3475N4645N110J8698K691l6252p2364M6278R5941M1081q140
13959B56046M2926N4115M5371p5649j8786K0778m3125J4658j1202N372n7527L3156
13947B66133j2697P051K1139n7885K2290J5647J2820o1658k6534j4627K5059K0679
13935B17417L3836j643J519J0329l5764m4859J1693n5883J5406Q3438N6233j7032
13923B74690m4812P872J0825L6497j6215j01566j7981M4760k527J1348K8281M7967
13911B79139l4311P8666P6091m6854r1895J2275j7098j7378M2843J6128j2749
13900B84857K1310N7991J9035p5525m2271K1367l0217n1177N195J4261o470R929
$$ plain form
13983 235928 172343 225547 299180 307895 246947 191105 219703 188773 151918 108528 128315 52505
13971 52505 54883 108358 163003 168113 186811 189502 153250 80886 127164 223105 264186 256046
13959 256046 298972 353087 398458 322809 304023 324801 281676 296334 285132 290504 232977 266133
13947 266133 253436 260487 281626 223741 246031 261678 274498 212840 186306 171679 196738 217417
13935 217417 251253 249610 251129 261458 225694 180835 192528 136645 152051 235489 291722 274690
13923 274690 229878 237750 248575 285072 268857 167291 149310 194070 191543 202891 231172 279139
13911 279139 244828 323494 399585 352731 260836 273111 256013 238635 281478 297606 284857
13900 284857 306167 364158 383193 307668 265397 286764 256547 205370 210565 224826 218356 228285
13888B28285J0537J0322J6660k1984j5816J5271M6895m2227j14671k623Q2147
13877B12796R3474j3143L3221J8912l6246o5742j0184K4134M6810q0319n7956
13866A65757L6077P8398L5856k3681l8516j4366L4967m9287n9137M7016O4365
13855B77449L461l2695m4101q607o381j5740J583l3727N2000R6910K8223k0421
13843B97954N5664M7660o2385J1076j841n5046p075n1083O5477R1105k9255k9763
13831C32488M078n2054l5151K2879q434j7892J31936j6609M9452q485J1929J6800
13819D30937l2928l9416k3932M9633n369k1602k4146l4268j04142k6911N9277
13808B27133P1073M2540J02103J13792o8134j03813l8832m089o672r3530m5696
$$ plain form
13888 228285 238822 249144 265804 243820 228004 243275 290170 247943 133272 130649 212796
13877 212796 306270 293127 326348 345260 309014 243272 233088 257222 304032 223713 165757
13866 165757 201834 280232 316088 292407 253891 239525 274492 225205 166068 213084 277449
13855 277449 280910 248215 204114 195507 189126 173386 174969 141242 193242 290152 318375 297954
13843 297954 353618 401278 338893 349969 348128 293082 286007 234924 300401 391506 362251 332488
13831 332488 336566 284512 249361 272240 263806 245914 377850 361241 410693 402208 414137 430937
13819 430937 398009 358593 334661 384294 378925 357323 333177 298909 194767 167856 227133
13808 227133 298206 340746 442849 556641 488507 384694 345862 341773 335101 241571 195875
13797A95875q910O8560Q8456L7235k0696j8247j7265j2373K9766J1669m69q1408
13785B72193k5430O0183n3077m2367K0225O8953O6703L0129J1073l9185k8250
13774C41150o3762m5052N8275l9174n3385P0772J01104k7887l2003j5887J4273
13763C08424n0741k6470j1305L4756P989j4249N0337l7104P910J5259j86j4527
13751B70093K6247M1699o1556j6845R430j112j3858R8226P8810l2752o5310j7223
13739C15849j1933M3345J3878N1464n0620k2940j8996k4168J6006J3688L2362
13728C57935q1960o2530K8673L6871N030m9409L7219L8690q083M2062Q6223j4959
13716D15762n4964k5209O0863K2070m1874j4448l0763k8477k2468P8965N7878
$$ plain form
13797 195875 186965 255525 343981 381216 360520 342273 325008 312635 342401 354070 353601 272193
13785 272193 246763 306946 253869 211502 231727 300680 367383 397512 408585 369400 341150
13774 341150 277388 232336 290611 251437 198052 268824 369928 342041 310038 294151 308424
13763 308424 257683 231213 219908 254664 262653 248404 298741 261637 269547 284806 284620 270093
13751 270093 296340 338039 276483 259638 269068 267956 254098 352324 431134 398382 333072 315849
13739 315849 303916 347261 361139 412603 361983 339043 320047 295879 311885 325573 357935
13728 357935 275975 213445 242118 278989 284019 234610 271829 310519 302436 344498 430721 415762
13716 415762 360798 335589 396452 418522 376648 362200 331437 302960 280492 359457 417335
13705D17335j13533p1622O7061Q7174m6851M9092N926O474J68j2463l3013l3755
13693C21993K8575l6525N281M0285Q474k3967j19m8720P354Q421J9394O6363K9926
13680D26735k1230k059k0511k8463K3784L2926l2274m7840l7737p259O2184J8360
13668C66616k7670Q139o296j0515L944M7613P2150k1016m0435n6922l3416P1426
13656C73618N7196k153j3138J11028M3885o9910j22437m0400P178K2351J571j6811
13644C51978J0114r436L8594j2141k8008l9514N682p34k1426o7781Q0838R9120
13632D07286m1353M9391k2670p5771n8265J328K5921Q0096P8277n9698P326l0526
13620C61342J5288J2903J331n6649j4179O4086n099J1799j1042k7217N5365L0771
$$ plain form
13705 417335 303802 232180 299241 386415 339564 388656 394582 401056 401224 388761 355748 321993
13693 321993 350568 314043 319324 359609 368083 344116 343997 295277 302631 311052 330446 396809 426735
13680 426735 405505 403446 382935 354472 378256 411182 378908 331068 293331 286072 348256 366616
13668 366616 338946 347085 340789 330274 334218 381831 453981 432965 392530 335608 302192 373618
13656 373618 430814 428661 415523 526551 570436 500526 378089 337689 344867 367218 368789 351978
13644 351978 362092 352656 391250 379109 351101 311587 317269 316535 295109 227328 308166 407286
13632 407286 365933 415324 392654 316883 258618 259946 285867 365963 444240 384542 391868 361342
13620 361342 376630 389533 390864 334215 320036 384122 379023 390822 379780 352563 407928 438699
13608D38699j9436o0369O5119M1667M8559n2203n2015N38k5187o2505k6081j5394
13596B81392k9062J02232J11504O2502r245Q517r0404j37947J5596J14970O1004
13585D91059K0235l3449o8891j168M3446l8642m0422j0407Q5693k1321K5657O7014
13573E18804n934l3590m4545m6691m1254j6692j5938M4230L0142j275J4157Q5465
13561D86879L1142N070l4995n6025k080K7485j2051k5374o2493p5357l5131O4868
13549C11938R3564j631m5212P234P440o4188p3731j1821J4847L2778N6842L4693
13537C62753O2008m765j5478J5831l9837j6420Q487o6291j2262O3184P7187O8718
13525E03115J1345j06889j5348P957M2352m5478p2637Q70Q7845Q7851n2192j14569
$$ plain form
13608 438699 419263 358894 424013 465680 514239 462036 410021 410559 385372 322867 296786 281392
13596 281392 252330 354562 466066 528568 519323 527840 437436 299489 315085 430055 491059
13585 491059 511294 477845 408954 407786 451232 412590 372168 361761 447454 426133 451790 518804
13573 518804 512870 479280 434735 388044 346790 330098 314160 358390 388532 387257 401414 486879
13561 486879 518021 523091 488096 432071 429991 457476 445425 420051 357558 282201 247070 311938
13549 311938 405502 403871 358659 365893 373333 309145 235414 223593 238440 271218 328060 362753
13537 362753 424761 419996 404518 420349 380512 364092 372579 306288 294026 357210 434397 503115
13525 503115 514460 407571 392223 400180 442532 397054 324417 325287 413132 500983 448791 334222
13513C34222l3891L8614M1841O2334n7613p5146q376J1218O2253O6287J3049k1095
13501D33697n8909L3450L3984L6813j2986n2730k704k4151J02602K8058m4742
13490D72382m8373O5815N7963j6106j7062m7429k0108l725l327p5267O1084J8351
13478D44198O6359r120k715J8275l9224k545k6265q5272J115M6996P5056O4054
13466E50912j2861l3713k8276p2585L9924J8314P203M446L7001J1897l9615M570
13454D87217Q2810P4958J3750k4760J7487q4677j39775O0804k8417o3893O2841
13443D58345Q462j8669o0599o6963M0393J04826K3484l4821J9829L6729N5906
13432E66922l0272m3276K0611j1852N057r765n3474q0545j861L7084J7237l325
$$ plain form
13513 334222 300331 338945 380786 443120 385507 310361 301985 313203 375456 441743 454792 433697
13501 433697 374788 408238 442222 479035 466049 413319 410615 386464 489066 517124 472382
13490 472382 424009 489824 547787 531681 514619 467190 447082 443357 440030 364763 425847 444198
13478 444198 510557 501437 498722 516997 477773 475228 448963 363691 364806 411802 486858 550912
13466 550912 538051 504338 476062 403477 443401 461715 468918 473364 510365 522262 482647 487217
13454 487217 570027 644985 658735 633975 651462 566785 427010 487814 459397 395504 458345
13443 458345 466807 448138 387539 320576 360969 465795 489279 454458 474287 511016 566922
13432 566922 536650 493374 513985 502133 507190 497425 443951 363406 361545 398629 415866 412541
13420D12541L6695q531L9750M7994k7400K7303j0096j280o035n4263m2501n7192
13408C56985j4956Q8265M7218J3820L6368J2386N5526j1262j1404j5975m8484
13397E08487j6488M0328j7825L9103P3404n1009p6356K0401K4801k2532k0878
13386E01436N3597N1024j2972o7389j3192P6160K34n2958O489k7305j0777O3573
13374E67920L2839k3278P8569r2134m2741l9803J3060k9913J5860O0271J4658
13363E55308M3712L2424J5417m7226k8702m5168n7546l9369J5958j3203k5748
13352D05857Q9232J6618j6207L8890N0871p8167q7120J3369N1949N6005N8229
13341E99526o1881n5802o2213k3697j324p057K0685N9203N3668j5104o2516J488
$$ plain form
13420 412541 449236 440705 480455 528449 501049 528352 518256 516976 510941 456678 414177 356985
13408 356985 342029 430294 477512 491332 527700 540086 595612 584350 572946 556971 508487
13397 508487 491999 532327 514502 553605 627009 576000 499644 520045 544846 522314 501436
13386 501436 555033 606057 593085 525696 512504 588664 588898 535940 542429 515124 504347 567920
13374 567920 600759 577481 656050 563916 521175 481372 494432 464519 480379 540650 555308
13363 555308 599020 631444 646861 599635 570933 525765 468219 428850 444808 431605 405857
13352 405857 495089 511707 495500 534390 585261 507094 419974 433343 485292 541297 599526
13341 599526 537645 481843 419630 395933 394609 387552 408237 467440 521108 506004 443488 444976
13329D44976J6517K3404N6059J2859K5060M2405M0222K1123l2901K8996K4663
13318G03383j1853m7280m7573n7102n4671L070l1465N3179L4323k1813O445n392
13306E23251j0408m2765K0420j2642K9657K8517N8381N559p7127r383N0278j4403
13294E49335k2216J12456K9290l8116j3311l3405J3594j1847R6256k5333l9324
13283F17379M1219Q0692J8469p3575p8474j125R876M3825m6746j08802J6790J04746
13271F24274N7654m8737N7774j08250o2873P353M450l824L0960O1213q328r8639
13259E13027m2251J2739N4078l7865L9855O4231J8433k9254n3385k1444J8651
13248E36815j3489m3385Q4504K8486M6398l7458p7419j0911j162O6757M3301o8813
$$ plain form
13329 444976 461493 484897 540956 553815 578875 621280 661502 682625 649724 678720 703383
13318 703383 691530 644250 596677 539575 484904 487974 456509 509688 544011 522198 528643 523251
13306 523251 512843 470078 490498 477856 507513 536030 594411 599970 522843 513460 563738 549335
13294 549335 527119 639575 668865 630749 617438 584033 597627 585780 682036 656703 617379
13283 617379 658598 739290 757759 684184 605710 604585 614461 658286 611540 502738 519528 624274
13271 624274 681928 633191 690965 582715 519842 527195 531645 527821 558781 619994 611666 513027
13259 513027 470776 483515 537593 499728 539583 603814 622247 592993 539608 518164 536815
13248 536815 523326 479941 564445 592931 639329 601871 524452 513541 512379 579136 622437 553624
13236E53624l3813O0799P8346M2304L7613j6208l5666o9118J0732j3418M2872
13225F58067K0440o2284N141N1477l5624j6140p941r476k6514l0245p1443N4938
13213E30396K21k1639j9166L4236K7646n245R8745j9164p1734L5143O6968l5847
13201F20560p547K3323Q04M513K8953j2588J00525j9020l9769O6097M325m0498
13189G29678j2882k888J128L513M5451k1001j10494m6353O257Q895n3772l7207
13177E10325L4077L0650Q6362K6637J5498J3454j639n4623r60N0767L8393N963
13165G54904q1626k2517K738j6426P198n6661j076K5591N8571M1681n5386n4296
13153F02695N4141L5622L2936N7507r9894p6597m186O5561p725K0052M0529o038
$$ plain form
13236 553624 519811 580610 658956 701260 738873 722665 686999 617881 628613 615195 658067
13225 658067 678507 616223 621364 672841 637217 621077 613136 603660 577146 546901 475458 530396
13213 530396 530617 508978 489812 524048 551694 546449 645194 626030 554296 589439 656407 620560
13201 620560 613013 636336 637140 641653 670606 658018 758543 739523 699754 765851 770176 729678
13189 729678 716796 713908 715036 718549 764000 742999 632505 586152 592409 601304 547532 510325
13177 510325 544402 575052 661414 688051 703549 717003 715364 660741 659781 710548 748941 754904
13165 754904 673278 650761 653499 637073 644271 587610 586534 612125 670696 712377 656991 602695
13153 602695 656836 692458 725394 782901 683007 606410 602224 667785 660060 680112 720641 714603
13141G14603j31135P689N5392K7375J151Q207J3335j2525L1086J8090j6163p937
13129G09168L1637L7826m0803l9313j2689m2316l7952m7259P1435m962r830P2040
13117F86982L3921k2300p553M8528K3256j2545K3034J9267n1249K697l6169n6898
13105F50971J6306N6338O275L0538k2649k5931n4728K1770J7988k328L5131p853
13093G21828R148o1524P191N1758J6983q797l7773K3590R952K0997J8099R700
13081G81152J433k910k5999m4634j9256N7546K8096K0452l0650k5756Q598J4468
13069G62540J21274J0095l0022Q070O310q560j0538l9414N93J9137q138K6688
13057H58035J8423m7551j2185J8962p694m8264l4468N7319k7456K0783m6956r6849
$$ plain form
13141 714603 583468 591157 646549 673924 675075 683282 696617 684092 715178 733268 717105 709168
13129 709168 740805 778631 737828 698515 685826 643510 605558 558299 629734 624772 614942 686982
13117 686982 720903 698603 691050 739578 762834 750289 773323 792590 741341 744038 707869 650971
13105 650971 667277 723615 729890 760428 737779 711848 657120 678890 696878 694550 729681 721828
13093 721828 730976 669452 676643 728401 745384 736587 698814 722404 732356 753353 771452 781152
13081 781152 782585 779675 753676 709042 689786 747332 775428 795880 765230 739474 748072 762540
13069 762540 883814 893909 863887 871957 878267 869707 859169 819755 820348 839485 831347 858035
13057 858035 876458 828907 816722 835684 827990 779726 745258 802577 775121 795904 748948 652099
13045F52099M1026J4924P2209o3582m4672J2091J7407J9458P5954J8281m1172
13034G74023q936L5317O9625N6403p2314K2863M5162L6579O4323Q5010R9985L1767
13022A239807l5793j22023k3102o680o6164q5906m7956N7493j5985q9036k7493
13011G77162j2508k76J1168K8144L342N2553J4924n2652J7597K0411o1606P00
12999G98959L7539k7987n0163J2406O784M2003R779K1930J4386r974M549J439
12987H61650J07868P2493N9933K6319N4398P9114k2543l3130o7573q8539l4543
12976A015447n6760j5444k6543j6808N214K4047R076k623l4522j6935M2691k4202
12964I02638m9517p681m9370j5965j4709o4560J65845O3681m6085m0105J9609
$$ plain form
13045 652099 693125 708049 780258 716676 672004 684095 701502 720960 796914 815195 774023
13034 774023 765087 800404 870029 926432 854118 876981 922143 958722 1023045 1108055 1208040 1239807
13022 1239807 1204014 1081991 1058889 1052209 986045 900139 852183 909676 893691 804655 777162
13011 777162 764654 764378 775546 803690 807032 859585 874509 821857 839454 859865 798259 798959
12999 798959 836498 808511 758348 770754 777538 819541 829320 851250 865636 855662 860211 861650
12987 861650 969518 1042011 1101944 1128263 1182661 1261775 1239232 1206102 1138529 1049990 1015447
12976 1015447 958687 943243 916700 899892 905106 929153 938229 935606 901084 884149 926840 902638
12964 902638 853121 845440 796070 780105 765396 700836 866681 930362 884277 844172 863781
12953H63781l0127n150k7537l1115N5696K1144n7089N8733M3538m5184N6712K5066
12941I28468l166L9161m3726p4894j0973J9351m220K7661L9117j1062M0979Q25
12929I47521o6422p7549k7822L1458M6343k0046L9903L6914j8911o0254m4198
12918G86937L5310K4422k3013m5463l3334o0850Q4953P7202r605P3151L2393L1115
12906I73218j7380l1428O9493k256O4254j3329q9611n1351k393p9972M6746Q4830
12894I50821l7965o7128K6748M7326K2290p9888M2862N767p0630l0389J6695P1963
12882H98472j2782r538k6459K0562m0330o107M3840N0201J4046K1353m5053n5774
12870H52431N8626m3727n5076Q148O5593R317K8007m976K8352O8495j0884m7999
$$ plain form
12953 863781 833654 828504 800967 769852 825548 846692 789603 848336 891874 846690 903402 928468
12941 928468 925302 964463 920737 845843 834870 854221 850001 877662 916779 905717 946696 947521
12929 947521 881099 803550 775728 807186 853529 833483 873386 910300 891389 831135 786937
12918 786937 822247 846669 823656 778193 744859 684009 768962 846164 836559 909710 942103 973218
12906 973218 955838 924410 993903 991647 1055901 1042572 952961 901610 899217 819245 865991 950821
12894 950821 912856 845728 872476 919802 942092 862204 905066 910833 840203 809814 826509 898472
12882 898472 885690 876152 849693 870255 829925 823818 867658 917859 931905 953258 908205 852431
12870 852431 911057 867330 812254 820402 885995 895312 923319 918343 946695 1015190 1004306 956307
12858I56307k351m2589K386l2140N0681J7999p069L2881k7293k7505L1271K2797
12846I75375o6067J7700L1119k8419q1151p918P3190P2499j3014p225K9478j2592
12834I82975m9816j8894L4128l5377Q645J6009J0819n1211N0499n819K2450L6540
12822A000948l7003n4790m2285M3502O6000J3724K5222l2067m8204p0201R025
12811H73871R8583R2351J8130J9991J5789J2467p55m6821l9700o1292k4541o917
12799I51156J3596N9279n8987j4321m2530m797J4223M666O0295J8070k2206n7277
12787I21167J0694N5775P4466m77j8072N4452j5903m3217q0570M9858l3505k9868
12775I44800j4124l7280P0079J6054J3770j3007j4820K4652M6250L3550j8007
$$ plain form
12858 956307 953956 911367 913753 881613 932294 950293 943224 976105 948812 921307 952578 975375
12846 975375 909308 927008 958127 929708 848557 840639 913829 986328 973314 966089 995567 982975
12834 982975 933159 914265 948393 913016 921661 937670 948489 897278 947777 941958 964408 1000948
12822 1000948 963945 909155 866870 910372 976372 990096 1015318 983251 935047 864846 873871
12811 873871 972454 1064805 1082935 1102926 1118715 1131182 1130427 1083606 1043906 982614 958073 951156
12799 951156 964752 1024031 965044 950723 908193 903396 917619 922285 982580 1000650 978444 921167
12787 921167 931861 987636 1062102 1061625 1043553 1098005 1082102 1038885 958315 1008173 974668 944800
12775 944800 930676 893396 963475 979529 993299 980292 965472 990124 1036374 1069924 1051917
12764A051917n8371P7496q742k4219m4741K0213k6960l596M9345P3665K4579P232
12752A137818n8911l1940n388j3739N415O088m0343k7506j4805M9899L4361Q3874
12740A124823P0653k0815j04692l8182L8712M116L8959P631M7477l68n3841p091
12728A107382K5028j5796l4505k9691Q571Q6836k0856k7012M8710M6074k5269
12717A169472j9194q941L4219M8064p2348o1517p168J0202j6700o3324m4788K4826
12705I92803J28119Q0338m6097M6840p4375j7269O5822l2248l1761o1474q1296
12694I69402O082K3057L2350k7917J410L4550N9313L304J4640Q4012J073m8629
12682A152647Q5252J645n0489q6142k2603M6714N7956M7329k7768j10278k7476
$$ plain form
12764 1051917 993546 1071042 1062300 1038081 993340 1013553 986593 982997 1032342 1106007 1130586 1137818
12752 1137818 1078907 1046967 1041579 1027840 1033255 1039343 999000 971494 956689 1006588 1040949 1124823
12740 1124823 1195476 1174661 1069969 1031787 1070499 1074615 1113574 1121205 1168682 1168314 1114473 1107382
12728 1107382 1132410 1116614 1082109 1052418 1060989 1147825 1126969 1099957 1148667 1194741 1169472
12717 1169472 1150278 1141337 1175556 1223620 1151272 1089755 1082587 1092789 1076089 1012765 967977 992803
12705 992803 1120922 1201260 1155163 1202003 1127628 1110359 1176181 1143933 1112172 1050698 969402
12694 969402 975484 998541 1030891 1002974 1004384 1038934 1098247 1101551 1116191 1200203 1201276 1152647
12682 1152647 1237899 1239544 1189055 1102913 1080310 1127024 1184980 1232309 1204541 1094263 1066787
12671A066787M5420K3560o3126r1508p388j6359N0561J24257M5182j3809K3185
12660A186762j11436k18O4792J9494L0947J0352k6478L5381J1224j5757o1579
12649A143484m139J4015k8133L6389k138n1415r6414k737J3558P8831P9017M2394
12637A222712j4871K7260N2260N3695o812p7083p3071L1161k1239m1490m6904
12626A105618J8620K7915L3709m5241M1756R839m740O4272J0669J9972l0036o3483
12614A188870l1579p616J7514P96k5166j3613N1502M0473j5220j12747r229Q2526
12602A166511O0354J0618N505n8779m9304O5066Q8573P0656j3202o3359p1342
12591A211297L5245M2926o311j4530K8867l9224m4959N4148O6312k1898M5535
$$ plain form
12671 1066787 1112207 1135767 1072641 981133 973745 957386 1007947 1132204 1177386 1163577 1186762
12660 1186762 1075326 1075108 1139900 1159394 1190341 1200693 1174215 1209596 1220820 1205063 1143484
12649 1143484 1139345 1153360 1125227 1161616 1159478 1108063 1011649 1008912 1022470 1101301 1180318 1222712
12637 1222712 1207841 1235101 1287361 1341056 1334244 1257161 1184090 1215251 1194012 1152522 1105618
12626 1105618 1124238 1152153 1185862 1140621 1182377 1192216 1187476 1251748 1262417 1282389 1252353 1188870
12614 1188870 1157291 1149675 1167189 1167985 1142819 1129206 1180708 1221181 1205961 1093214 1083985 1166511
12602 1166511 1226865 1237483 1242988 1184209 1134905 1199971 1288544 1359200 1345998 1282639 1211297
12591 1211297 1246542 1289468 1283157 1268627 1297494 1258270 1213311 1267459 1333771 1311873 1357408
12580A357408N4239p6781m7242J3308J3122m3766j8757O2581N7240J8869m5613
12569A344608R223Q4871K3453p3329m430O6019n2385j27123n9069P4137J20589
12558A406564N0414l6005o7260l5234K2744N0488j3850k4397n1445p005M9083
12547A344097j117p87L7773l988l205n101o7455J22640N9759m7330q188k1792
12535A405306q486K394n637N0180K6108j9575N1029K3411K6931N1615O721M7463
12523A657460J13652R4382Q1765P413O4536J25035K2714m5012k8767j3415l0337
12512B049426J5231r2008n0439M4452L1108k5847n4753K2925O4594l7482m0377
12501A926830o0890O8971L4121k5032k7470j0736O1415l0864l5412l749K7989
$$ plain form
12580 1357408 1411647 1334866 1287624 1300932 1314054 1270288 1251531 1314112 1371352 1390221 1344608
12569 1344608 1353831 1438702 1462155 1388826 1384396 1450415 1398030 1270907 1211838 1285975 1406564
12558 1406564 1456978 1420973 1353713 1318479 1341223 1391711 1377861 1353464 1302019 1295014 1344097
12547 1344097 1342980 1342193 1379966 1375978 1372773 1367672 1300217 1422857 1482616 1435286 1427098 1405306
12535 1405306 1396820 1399214 1393577 1443757 1469865 1450290 1501319 1524730 1551661 1603276 1609997 1657460
12523 1657460 1771112 1865494 1947259 1954672 2019208 2144243 2166957 2121945 2093178 2079763 2049426
12512 2049426 2064657 1972649 1922210 1966662 1997770 1971923 1917170 1940095 2004689 1967207 1926830
12501 1926830 1865940 1934911 1969032 1944000 1916530 1905794 1967209 1936345 1900933 1897184 1925173
12490A925173M5749J7794R2616N4838q341M4429O904N0021J77232J55362J86226
12479B748003J89635J39729J28871K3319k5702q7231j27103n5701j03902j31512
12469B698406j01734p8210j04986j2675O435J3480k9222m2071p8623m6157p282
12458B217361m9949o0979o6643j8349M986m4379M8447o466K759m3447j5360P892
12446A975873K3963K9610Q754l8545l060m4395l0616J4646J20297M9257k8992
12435B076792q929N9559P4576j7903J1127l9418o0013j81836j20928j500Q8765
12424A880292O508l8880P691o9571j24089m5067p8649l4216J9649j0740j1710
12413A501218o47l2829J1577j7519n5170L8758O7588j3022l3594n6542M3894J6963
$$ plain form
12490 1925173 1970922 1988716 2081332 2136170 2127829 2172258 2179162 2229183 2406415 2561777 2748003
12479 2748003 2937638 3077367 3206238 3229557 3203855 3116624 2989521 2933820 2829918 2698406
12469 2698406 2596672 2518462 2413476 2400801 2407236 2420716 2391494 2349423 2270800 2224643 2217361
12458 2217361 2167412 2106433 2039790 2021441 2026427 1982048 2030495 2024029 2026788 1983341 1967981 1975873
12446 1975873 1999836 2029446 2038200 1999655 1996595 1952200 1921584 1936230 2056527 2105784 2076792
12435 2076792 2067863 2127422 2201998 2184095 2195222 2155804 2095791 1913955 1793027 1791527 1880292
12424 1880292 1886800 1847920 1855611 1786040 1661951 1616884 1538235 1504019 1523668 1512928 1501218
12413 1501218 1500571 1467742 1479319 1461800 1406630 1445388 1512976 1499954 1466360 1409818 1453712 1470675
12401A470675L1644O3410j4414P131O079Q9242l2912r1668o4025o3202l6151N6593
12389A422402P7860O8559K5651r689l7327k4722J8062m9820J7860k7406j3768
12378A467662k775o403M7006O0938o9264n5451q92K8752P0429J5215m3856r190
12366A502171L0940K3870q792L6838o2778r4576j0978O4230J30571J05007l3344
12355A683159r2179k7373p091j4074q1131j1285L7026N4299k4447n4968M15O0698
12343A523049N3806K45L1658L7251R4590Q49m5928o7811l4978J9860k2390m8270
12331A541931Q1946P4394K4232J8729R4754l8398O170o3733m3898j6253j8900
12320A660974k9293O021O2301k6079n6629L231L6070n5944j9393M6311L5025O5175
$$ plain form
12401 1470675 1502319 1565729 1551315 1558446 1564525 1653767 1620855 1529187 1465162 1401960 1365809 1422402
12389 1422402 1500262 1568821 1594472 1584783 1547456 1522734 1540796 1490976 1508836 1481430 1467662
12378 1467662 1464887 1458484 1505490 1566428 1497164 1441713 1440821 1469573 1540002 1555217 1511361 1502171
12366 1502171 1533111 1556981 1548189 1585027 1522249 1427673 1416695 1480925 1611496 1716503 1683159
12355 1683159 1590980 1563607 1556516 1542442 1461311 1450026 1487052 1541351 1516904 1461936 1462351 1523049
12343 1523049 1576855 1577100 1608758 1646009 1740599 1741448 1695520 1627709 1592731 1612591 1590201 1541931
12331 1541931 1623877 1698271 1722503 1741232 1835986 1797588 1803758 1740025 1696127 1679874 1660974
12320 1660974 1631681 1637702 1700003 1673924 1617295 1620526 1656596 1600652 1581259 1627570 1662595 1727770
12308A727770N735J3537j9404L9350L7673k2561J7558Q494p8703m6229m9691j0624
12296A622905N2338m3700Q431K8032n3701L0998L3250k9381p719L1383L4999j8933
12284A688902K3504Q3075O8693l4183k7348Q483n6937m6549o5136l6404n8387
12273A547713o9811K8267O9263N801J3227L885N5737n8908k2565j1107n5600j3696
12261A492206r203K1029J16158k3108o7589K4270N6814L9657J1159k5888J01003
12250A736508L2288k3504j20403M925Q2250P8479o4928j62356l5282Q389l8123
12239A498243N25m3245K5162N8235K9396l2326k8011j0314P0379J14813N2137
12228A734994L0613J154K2975O618M0947k8648l1270L7761K5991j3886l0140p170
$$ plain form
12308 1727770 1733505 1747042 1727638 1766988 1804661 1782100 1799658 1808152 1729449 1683220 1633529 1622905
12296 1622905 1675243 1631543 1639974 1668006 1614305 1645303 1678553 1649172 1641453 1672836 1707835 1688902
12284 1688902 1712406 1795481 1864174 1829991 1802643 1811126 1754189 1707640 1642504 1606100 1547713
12273 1547713 1477902 1506169 1575432 1581233 1594460 1598345 1654082 1595174 1572609 1561502 1505902 1492206
12261 1492206 1483003 1504032 1620190 1597082 1529493 1553763 1610577 1650234 1661393 1635505 1736508
12250 1736508 1768796 1745292 1624889 1629814 1712064 1790543 1725615 1563259 1527977 1536366 1498243
12239 1498243 1498768 1455523 1480685 1538920 1568316 1535990 1507979 1497665 1568044 1682857 1734994
12228 1734994 1765607 1766761 1789736 1796354 1837301 1808653 1777383 1815144 1841135 1827249 1797109 1789939
12216A789939J0235K9509n1293L8734m653O7031M791p8986j1197P8282J8329l2271
12204A858450M9992K8664Q3792L9216Q4091M1977q1201o7716j5468J4302m7848
12193A988251K9757k343p043Q5000O7387J8931L1955K1832N1880P0584p782M8415
12181B396824J0330K572r209J7275O5010N2718l8359L0162O3991J35684M0674
12170B767672M8039P8717K2035K3766O1277L6035J357K4501M3241J20698J85453
12159C412791J05894P9726P9579Q9110P2734J13435J40305J69826J58013O8977
12149D490390J33181J78816J15524J83467J07566M1545L8636n6944M8284K2005
12139E302470J6428k7861K7912Q0090P1273J30718Q8786J42099J28949Q4713J30174
$$ plain form
12216 1789939 1800174 1829683 1778390 1817124 1812471 1879502 1884293 1805307 1794110 1872392 1890721 1858450
12204 1858450 1908442 1937106 2020898 2060114 2144205 2186182 2104981 2037265 2021797 2036099 1988251
12193 1988251 2018008 2015665 2008622 2093622 2161009 2179940 2211895 2233727 2285607 2356191 2348409 2396824
12181 2396824 2407154 2409726 2400517 2417792 2482802 2535520 2497161 2527323 2591314 2726998 2767672
12170 2767672 2815711 2894428 2916463 2940229 3001506 3037541 3038898 3063399 3106640 3227338 3412791
12159 3412791 3518685 3598411 3677990 3767100 3839834 3953269 4093574 4263400 4421413 4490390
12149 4490390 4623571 4802387 4917911 5101378 5208944 5250489 5289125 5232181 5280465 5302470
12139 5302470 5318898 5291037 5318949 5399039 5470312 5601030 5689816 5831915 5960864 6045577 6175751
12128F175751P1173o9850j28083k3795N3028L2464M7925L1239P1658P2138J32337
12117F465985J44620K89979K68581K24681L04809M18715M01719M58923N96787
12108I574799O58921P08100O93952P03249P83239P65488P79756P65792Q82300
12099A6315596R01048R65782J111981J086571J140757J292878J288353J236884
12091B5339850J440370J499529J678207J765189K267022K726849L318911M157098
12083D4193025N258852O638559Q281817J0287834J2196323J3719113J4375106
12076A14950629J3387503J0553171O297637J224321l468740o756069q153126q017660
12068A20017666o740947m990877l305372j753921l77581O91014J587277K268923
$$ plain form
12128 6175751 6246924 6177074 6048991 6025196 6078224 6110688 6158613 6189852 6261510 6333648 6465985
12117 6465985 6610605 6900584 7169165 7393846 7698655 8117370 8519089 8978012 9574799
12108 9574799 10233720 10941820 11635772 12339021 13122260 13887748 14667504 15433296 16315596
12099 16315596 17216644 18182426 19294407 20380978 21521735 22814613 24102966 25339850
12091 25339850 26780220 28279749 29957956 31723145 33990167 36717016 40035927 44193025
12083 44193025 49451877 56090436 64372253 74660087 86856410 100575523 114950629
12076 114950629 128338132 138891303 145188940 146413261 142944521 136188452 128035326 120017666
12068 120017666 113276719 108285842 104980470 103226549 102848968 103539982 105127259 107396182
12060A07396182K581150K487833K294492K050936J815634J705717J933097K340977
12052A24606018K959657L481118L952335L987663L782580L278182K728904K236482
12044A51012939K145966K605449L863639O001202Q989120J3085967J8343487K4667169
12036B30714938L1449525L7338598M0075962L7029495K6426053R300430r755788
12029D02579213k5664156l4990171l7273745l4331635k8986596k2820995j7034871
12022B01477044j2184244q443763n736379l936228l028541k886916l448290m230355
12014A57582328m784219m948887m807858m350947l774625k957350k396182k035559
12006A27526701k012146k200406k474543k620922k489987k179309j474834o42920
$$ plain form
12060 107396182 109977332 112465165 114759657 116810593 118626227 120331944 122265041 124606018
12052 124606018 127565675 131046793 134999128 138986791 142769371 146047553 148776457 151012939
12044 151012939 153158905 155764354 159627993 165629195 174618315 187704282 206047769 230714938
12036 230714938 262164463 299503061 339579023 376608518 403034571 412335001 402579213
12029 402579213 376915057 341924886 304651141 270319506 241332910 218511915 201477044
12022 201477044 189292800 180849037 175112658 171176430 168147889 165260973 161812683 157582328
12014 157582328 152798109 147849222 143041364 138690417 134915792 131958442 129562260 127526701
12006 127526701 125514555 123314149 120839606 118218684 115728697 113549388 112074554 111431634
11998A11431634N10155J848362L557093N420308P311282Q940200R780885Q891302
11990A57691221N946314J203488m434894r569327j3126216j4779277j4777821
11983A08153488j3558414j1603837r587284p715123o248819n047498m013837l346195
11975D7032481k809961k309205k119696j977767j788131j637384j652949j626076
11967C1111312j530402j483012j358163j232073j160628j171593j105738j119538
11959B0950165j043713r62177r81224r01750p95638q00059p52748o56691o94931
11950A3361234o37796m84248l35115k65302k62226k53512l09813j77067j28795
11941A0507360o6375m5983q7913p0750j4799n7100j14987j43293p8202m4413j45691
$$ plain form
11998 111431634 111941789 113790151 117347244 122767552 130078834 139019034 148799919 157691221
11990 157691221 163637535 164841023 160406129 150836802 137710586 122931309 108153488
11983 108153488 94595074 82991237 73403953 65688830 59440011 54392513 50378676 47032481
11975 47032481 44222520 41913315 39793619 37815852 36027721 34390337 32737388 31111312
11967 31111312 29580910 28097898 26739735 25507662 24347034 23175441 22069703 20950165
11959 20950165 19906452 18944275 17963051 17061301 16265663 15465604 14712856 14056165 13361234
11950 13361234 12723438 12239190 11904075 11638773 11376547 11123035 10813222 10636155 10507360
11941 10507360 10440985 10395002 10307089 10236339 10221540 10164440 10049453 9906160 9827958 9783545 9637854
11930I637854k25848k41627j63733p2794o4624j34931m075o215o4409j24979r3289
11919H441330l0540j43712j58978j27352j86002k56665k29264j68993k82732k04267
11909F652825j54337j79944j40268j87167k24491j42715j64962o5132J115K1692
11899E416616r4755j57820j15753j51336o0304K6263o3185j63122p7812J5465
11889D574257p4363j32269k4166j2207r7907p7624l181L950n7834R352n6376r8308
11877C953324l6042N7282j1873j15777m2471K8781m6672n9895n0221L6359r0216
11866C622579l2540r0430q73O9078k2729m0085J9480j07649p1435l9865J13740
11855C419271K7501r3789m4677Q244N2112L6290o2881j14204l0853l5508n7045
$$ plain form
11930 9637854 9412006 9170379 9006646 8933852 8869228 8734297 8730222 8724007 8659598 8534619 8441330
11919 8441330 8410790 8267078 8108100 7980748 7794746 7538081 7308817 7139824 6857092 6652825
11909 6652825 6498488 6318544 6178276 5991109 5766618 5623903 5458941 5393809 5394924 5416616
11899 5416616 5321861 5164041 5048288 4896952 4836648 4862911 4799726 4636604 4558792 4574257
11889 4574257 4499894 4367625 4343459 4331252 4233345 4155721 4152540 4156490 4098656 4108008 4051632 3953324
11877 3953324 3917282 3974564 3962691 3846914 3804443 3833224 3786552 3726657 3676436 3712795 3622579
11866 3622579 3590039 3499609 3498736 3567814 3545085 3505000 3524480 3416831 3345396 3305531 3419271
11855 3419271 3446772 3352983 3308306 3316550 3368662 3404952 3342071 3227867 3197014 3161506 3104461
11844C104461O3718Q5213n6957l6488k8594J312O9926L3941q0004p1711M126l2578
11832C056365j0023K1929L3354k7030n3023j2228k5110q2130j9400l2595p0186
11821B779923o5971L7034J17690K6970K4137J7961J891m2787o4507O0063L0221
11810B922625j2004r0379r1058J1134j433K9771o7617l3926o7499J7082O4380
11799B681076k4575L176M6145J0820J5281q6315m9643K5288N7658N8478l645l6137
11787B697607O60m764r570o8948m4325M3152k2178n1550R092m4875O5733J951
11775B571985k4377Q5291K4678Q580k6527j1207j30397l8514M1558m2228j11277
11764B347565r429M1804K8242p5523n2487J9576K5730n1964m4378M5564N4381
$$ plain form
11844 3104461 3168179 3253392 3196435 3159947 3131353 3132665 3202591 3236532 3156528 3084817 3088943 3056365
11832 3056365 3046342 3068271 3101625 3074595 3021572 3009344 2984234 2902104 2882704 2850109 2779923
11821 2779923 2713952 2750986 2868676 2895646 2919783 2937744 2939635 2896848 2832341 2892404 2922625
11810 2922625 2910621 2820242 2729184 2740318 2738885 2768656 2701039 2667113 2599614 2616696 2681076
11799 2681076 2656501 2659677 2705822 2716642 2731923 2645608 2595965 2621253 2678911 2737389 2733744 2697607
11787 2697607 2698267 2693503 2683933 2614985 2570660 2613812 2591634 2540084 2549176 2504301 2570034 2571985
11775 2571985 2547608 2632899 2657577 2666157 2639630 2628423 2498026 2459512 2501070 2458842 2347565
11764 2347565 2338136 2379940 2408182 2332659 2280172 2299748 2325478 2273514 2229136 2274700 2329081
11753B329081j2949P989N158q2858k6876L3536J09349K5539J9492j3616j349P719
11741B400215n9437n2661l5398m2351l1639k030k0100o6465k568L5708o872K7446
11729B143848j2416m1817m5346m3376K6976K7063m611N0796j075k0480n9561k3282
11717A996719m7628N6039J13541l143Q719n8736J0789n2796p832J4416k2383J3563
11705B021268j4250j2806O486O969m7178j6305l0362j4925N1766K3343m844K0848
11693A990010L1776m2733P384m0684O001j9974m3575j5040n505K4209l2993m9094
11681A809782L1701M8872M2191K8156n4887k7167r625j7335Q0443P0676k3423
11670A979384p1107k2896j3956m0007O1387K7702L866K6640P9540K2245J4066
$$ plain form
11753 2329081 2316132 2324121 2329279 2246421 2219545 2253081 2362430 2387969 2407461 2393845 2392496 2400215
11741 2400215 2340778 2288117 2252719 2210368 2178729 2176699 2156599 2090134 2087566 2123274 2116402 2143848
11729 2143848 2131432 2089615 2044269 2000893 2027869 2054932 2050321 2101117 2100042 2079562 2020001 1996719
11717 1996719 1949091 2005130 2118671 2115528 2124247 2065511 2076300 2023504 2015672 2030088 2007705 2021268
11705 2021268 2007018 1994212 2000698 2007667 1960489 1944184 1913822 1898897 1950663 1974006 1969162 1990010
11693 1990010 2021786 1979053 1986437 1945753 1951754 1931780 1888205 1873165 1867660 1891869 1858876 1809782
11681 1809782 1841483 1890355 1932546 1960702 1905815 1878648 1869023 1851688 1932131 2002807 1979384
11670 1979384 1908277 1885381 1871425 1831418 1892805 1920507 1924373 1951013 2030553 2052798 2066864
11659B066864J7320L0548k5392j1704j8419K6932L5958N026M3005m6553n8887
11648B064698l4090o840N3379J01825K5314P2542R1437R5820O2535J36570J80136
11637B843326L89008N75251P72522R79135O64721j11826p05971p87972o61695
11628C956499l96457k25318r6677m8736j40188q1266j6792j34128j44851K5418
11618B697504O1625q0013j19943q5244m0936q541K5267p4275l7174R6630j6356
11607B418544k338o126J4738J34582J12770P4113L0117L1292J23672J82623L14942
11596C428929M37436O42984Q88018R13777N96063k15743p10577q64707o47657
11587D468523l09229j38375r1186o2622R7100M0518L127m2687q3698r9870k61847
$$ plain form
11659 2066864 2084184 2114732 2089340 2077636 2059217 2086149 2122107 2127133 2170138 2123585 2064698
11648 2064698 2030608 2023768 2077147 2178972 2204286 2276828 2368265 2464085 2526620 2663190 2843326
11637 2843326 3232334 3807585 4580107 5559242 6223963 6112137 5406166 4618194 3956499
11628 3956499 3560042 3334724 3238047 3189311 3049123 2967857 2951065 2816937 2672086 2697504
11618 2697504 2759129 2679116 2559173 2473929 2432993 2424452 2449719 2375444 2338270 2434900 2418544
11607 2418544 2416206 2410080 2424818 2559400 2672170 2746283 2776400 2807692 2931364 3113987 3428929
11596 3428929 3866365 4509349 5397367 6311144 6907207 6691464 5980887 5116180 4468523
11587 4468523 4159294 4020919 3929733 3867111 3964211 4004729 4007856 3965169 3881471 3781601 3519754
11576C519754j58293j32792k08340n1130l2132o3068j52074j15289j00095p3580
11566B432961m6902m9422n1631K7619k8389j3054m5685o0300J04137J4751m0089
11555B243996n371M2084Q7957K0751n0190k0794p7662j9834o0595j8879M3203
11544B184666L7975M3083N5820L4595L2423L8152P6507R69j14994j67313j7381
11533B204502l2707m1342m2202l6418q4972o5909l2270K430q010k7024q826j6824
11521A810428o2466j5207j4936N062Q350j1617O0167O4842m4343p3787r6664k7882
11509A601947k5628m5954M0463M2168k4526j3696Q153n3352l4394m5898k4580
11498A424703O1997L1580J4640L340P0580K1822q6961l8263P9358L6120j06629
$$ plain form
11576 3519754 3361461 3228669 3020329 2969199 2937067 2873999 2721925 2606636 2506541 2432961
11566 2432961 2386059 2336637 2285006 2312625 2284236 2271182 2225497 2165197 2269334 2284085 2243996
11555 2243996 2238625 2280709 2368666 2389417 2339227 2318433 2240771 2220937 2160342 2141463 2184666
11544 2184666 2222641 2265724 2321544 2356139 2388562 2426714 2503221 2504190 2389196 2221883 2204502
11533 2204502 2171795 2130453 2088251 2051833 1966861 1900952 1868682 1871112 1863102 1836078 1827252 1810428
11521 1810428 1747962 1732755 1717819 1722881 1731231 1719614 1779781 1844623 1800280 1726493 1629829 1601947
11509 1601947 1576319 1530365 1570828 1612996 1588470 1574774 1582927 1529575 1495181 1449283 1424703
11498 1424703 1486700 1518280 1532920 1536260 1606840 1628662 1541701 1503438 1582796 1618916 1512287
11487A512287j19254m9266Q587K531J9135P5231J321J7899K5515l3479j16328
11476A344179M0280R2570M412L0956m9140l831j193o3739J7240m7727J556L7327
11464A402890J7460m767J8647k4720m5875J9010m6571o13L6318K6253K6367k2674
11452A401725r3496j3961mj5687j9950M5767K621l6057K8001j6237j0599l2737
11440A239386j8413O6628O036l973k3341m856K1080n7242k1045J03836j9314l4394
11428A254388M5022L8626l2155o47m8302k1255j7626o53r359o7127l4680N5170
11416A161402R0185J8530j6393j7375k1778k6770K7535K63j05538P018N5728N4995
11404A227802J2766n5346K9591p131m1044J2558l728j8185K6177o6324j4110O4564
$$ plain form
11487 1512287 1393033 1343767 1352354 1354885 1374020 1449251 1450572 1468471 1493986 1460507 1344179
11476 1344179 1384459 1477029 1481441 1512397 1463257 1459426 1458233 1394494 1411734 1364007 1365563 1402890
11464 1402890 1420350 1415583 1434230 1409510 1363635 1382645 1336074 1335461 1371779 1398032 1424399 1401725
11452 1401725 1308229 1294268 1294264 1278577 1258627 1304394 1307015 1270958 1298959 1282722 1272123 1239386
11440 1239386 1220973 1287601 1293637 1289664 1266323 1261467 1282547 1225305 1204260 1308096 1288782 1254388
11428 1254388 1299410 1338036 1305881 1305234 1256932 1235677 1218051 1217398 1208039 1140912 1106232 1161402
11416 1161402 1251587 1270117 1253724 1236349 1214571 1187801 1215336 1215599 1110061 1117079 1172807 1227802
11404 1227802 1240568 1185222 1214813 1207682 1166638 1179196 1175468 1157283 1183460 1117136 1103026 1167590
11392A167590J5928n199o0553k9656P8738m9649q3041K6323J10119N1698M0794
11381A263092O520p0966n5601n2754j7321j1355L3764J4854J0532j5602l2484
11370A072679p889l1709L0371L3926P5385M8057m0353l9251N66l9068p118N740
11358A101336P671J4669J2785J5731M0933n4161k6605l9998Q9510j339p9044p3855
11346A007633J4946P2432m869r9674N6930o651m8507R2303K6957R934P555J7322
11334A146311Q221K1927k4889n8870l4927o1986K7555n4832J3718K3586Q5368
11323A091182k8814N6954j2991l3405m3265p3312j304M5153Q8642j0388j0730
11312A067722o8956l7398J6481j7112K0855N631j6115n2299j5498K6931O8112
$$ plain form
11392 1167590 1183518 1178319 1117766 1088110 1166848 1117199 1034158 1060481 1170600 1222298 1263092
11381 1263092 1269612 1198646 1143045 1090291 1072970 1061615 1095379 1110233 1120765 1105163 1072679
11370 1072679 1064790 1033081 1063452 1097378 1172763 1220820 1180467 1141216 1141782 1102714 1095596 1101336
11358 1101336 1109007 1123676 1136461 1152192 1193125 1138964 1112359 1072361 1161871 1160532 1081488 1007633
11346 1007633 1022579 1095011 1090142 990468 1047398 1040747 992240 1084543 1111500 1121434 1128989 1146311
11334 1146311 1154532 1176459 1151570 1092700 1057773 995787 1023342 968510 982228 1005814 1091182
11323 1091182 1062368 1119322 1106331 1072926 1029661 956349 955045 1000198 1088840 1078452 1067722
11312 1067722 998766 961368 977849 960737 981592 987223 971108 918809 903311 930242 998354
11301I98354l3568k3341R4840P448p924j1696o3879J5618L3063K5072m9718N596
11289I89865l8436q514O287L2564j0475L2078J9526L2315r4244m8254N3552O4736
11277A031000j8792j3772J0134J6405M606j17742K3239J572J642M9693n8321N3842
11265I83506K6946k4492m5303k2607P313O4184m5261r6577j08450K0510J13284
11254H73053M0289J2510K1844k6937p0255J8909L5413L6815J40410j3423o076
11243A062552m6600j6444k0303l9904j8207r4794l7779O8637n2226Q385o737n8442
11231G48138l47L1192N5819m1700l0419L5397P5122K055Q571K1934N5367N0510
11219A011639r1919L550m5768q1179q709N2047K2384M2811r668r599p661J2851
$$ plain form
11301 998354 964786 941445 1036285 1043733 1035809 1024113 960234 975852 1008915 1033987 984269 989865
11289 989865 951429 942915 949202 981766 971291 1003369 1022895 1055210 960966 912712 966264 1031000
11277 1031000 1012208 998436 1008570 1024975 1029581 911839 935078 936650 938292 987985 929664 983506
11265 983506 1010452 985960 940657 918050 925363 989547 944286 847709 739259 759769 873053
11254 873053 913342 925852 947696 920759 850504 869413 904826 941641 1082051 1068628 1062552
11243 1062552 1015952 999508 979205 939301 921094 826300 788521 857158 804932 813317 806580 748138
11231 748138 747791 778983 834802 793102 762683 798080 873202 875257 883828 905762 961129 1011639
11219 1011639 919720 923270 877502 796323 787614 839661 862045 904856 895188 885589 877928 890779
11207H90779J5354p5038q179Q8804o424n5717J7729r266n1478K1930L6586m7935
11195H17145n8880Q4072l8750j8430L1969j1965m7557O5105j3070K0982K4477
11184H55098l8433j6164M78l5081J309l3914m036K9260P6867j1792j23980n0085
11172F49527J8413k788P0505k1643j6649J0106p029O0216p366l7047l1431j7559
11160F67255R4001M0084K42M3942K9533o5807m0649P2012L5229q6707n4261M9874
11148G84748L6700l7506l7715R586O2745N5882k4198l7743N3015k6172j04201
11137G35141k8430O697O5393L7072k9124m1567j6035M0306L8155l8758N26j9851
11125G49525P748L4238k4099m2163J89q5064Q5057P9763k9332l9377M7552j9946
$$ plain form
11207 890779 906133 831095 822916 911720 905296 849579 867308 858042 806564 828494 865080 817145
11195 817145 758265 842337 803587 785157 817126 805161 757604 822709 809639 830621 855098
11184 855098 816665 800501 800979 765898 767207 733293 729257 758517 835384 823592 699612 649527
11172 649527 667940 665152 735657 714014 697365 707471 700442 760658 753292 716245 684814 667255
11160 667255 761256 801340 801582 845524 875057 809250 768601 840613 875842 789135 734874 784748
11148 784748 821448 783942 746227 755813 818558 874440 850242 812499 865514 839342 735141
11137 735141 706711 713408 778801 815873 786749 745182 729147 769453 807608 768850 769376 749525
11125 749525 757273 791511 767412 725249 725438 640374 725431 805194 775862 736485 784037 764091
11113G64091q3864j5441J14651M680o110j2975l6581j17062m0701M8273L5412
11102F54373K3884R846J4318n4840p419O4120M2612L4995P378j11836j683k2290
11090F53458K4586L8797J8183k5383J4275l7116j6663K8311J3238K7704R4046
11079H33436J5951q3400j16050k3605j8322j11119K9742N4035Q1388M862j2584
11068F54334L2801k9132N994L3032k3136m4377q831p049P3074k2785l7132K7259
11056F54052L4738K2312l4283J2530J7943m5753l5297N7366O4725m5223M1279
11045G44389J30640P969k7113o8740L1594P3748j7677m9602O4306Q7045P7135
11034A053694J02531J22759N5500l072q7077j28646j30931l7101L0353J20019
$$ plain form
11113 764091 680227 664786 779437 784117 778007 765032 728451 611389 570688 618961 654373
11102 654373 678257 688103 702421 647581 640162 704282 746894 781889 789267 677431 675748 653458
11090 653458 678044 716841 735024 709641 723916 686800 670137 698448 711686 739390 833436
11079 833436 849387 765987 649937 626332 608010 496891 526633 580668 662056 666918 654334
11068 654334 687135 658003 663997 697029 673893 629516 620685 613636 686710 663925 626793 654052
11056 654052 688790 711102 676819 689349 707292 661539 626242 683608 748333 703110 744389
11045 744389 875029 882998 855885 787145 818739 892487 874810 825208 889514 976559 1053694
11034 1053694 1156225 1278984 1334484 1331412 1244335 1115689 984758 947657 978010 1098029
11024A098029J89093J49970J12535J10303o6471m4183j07739j47234n8332l0637
11014A205334m8921j7438J7762P1677J11955J03210K6331j18161p9335j49119
11004A123295k10274k1788j7020k4626L0829m5206m752l9803L3557l5892m3597
10993G44723p8729l0900j5509l0682J0049m6324l6780j07014l8209K644P5415
10982D48684K6070j5442k9918M6674k0129n1740R304N9793L4597j1743M2026P1942
10970F10118r789o6150l7289j8102N268J4455k7170k7940M2241L9946l2841r6540
10958C96207p8523N3380L214Q8616M5956M640n2757M873l3177J3217m7076n3060
10946C45510J5599l2918l5170J3309O9520O6128L3807k9660m7795O8720O9232
$$ plain form
11024 1098029 1287122 1437092 1549627 1659930 1593459 1549276 1441537 1294303 1235971 1205334
11014 1205334 1156413 1138975 1156737 1228414 1340369 1443579 1469910 1351749 1272414 1123295
11004 1123295 913021 891233 874213 849587 880416 835210 830458 790655 824212 788320 744723
10993 744723 665994 635094 619585 588903 598952 552628 515848 408834 370625 373269 448684
10982 448684 474754 459312 429394 476068 455939 404199 413503 473296 507893 496150 538176 610118
10970 610118 600329 534179 496890 478788 484056 498511 471341 443401 485642 525588 492747 396207
10958 396207 317684 371064 374278 462894 508850 513490 460733 465606 432429 445646 398570 345510
10946 345510 361109 328191 293021 306330 375850 441978 475785 446125 398330 467050 536282
10935E36282Q829j287o0157r4946M998N9726l2995l5579P624K2954R266k8935
10923C95780q394J1786M4962j1474K6L2944k5425J2800k8740l0135m1747k4062
10911C28321J3671J08423n1285j07729m7583M8824M8011O5620M2209J01897P4923
10900F25302q499j24213j00660k6164k8511J3565m4059j1454O0018Q1430n173
10889D31582L9053j9296J8812J357n4302p1923J9180n4331l4699l4923m8442M2286
10877B34354J06076O0777n7239j6473j2543l6392J2989P2677L5958m9550l0126
10866C20508l0145Q8087k2895l0159j9362L0121p495m0184R889K9768M7536K4001
10854C99670m6058o4696N931O6769J6048k801j2625q263j7980L2059J2259N7297
$$ plain form
10935 536282 545111 543824 483667 388721 393719 453445 420450 384871 392495 415449 424715 395780
10923 395780 387386 399172 444134 432660 432686 465630 440205 453005 424265 394130 352383 328321
10911 328321 341992 450415 399130 291401 243818 292642 340653 406273 448482 550379 625302
10900 625302 616803 492590 391930 365766 337255 350820 306761 295307 355325 436755 431582
10889 431582 470635 451339 470151 471508 417206 345283 364463 310132 275433 240510 192068 234354
10877 234354 340430 401207 343968 327495 314952 278560 291549 364226 400184 350634 320508
10866 320508 290363 378450 355555 325396 306034 336155 328660 288476 298365 328133 375669 399670
10854 399670 353612 288916 294847 361616 377664 374863 362238 353975 335995 368054 380313 437610
10842D37610j4573m6608l9876j7904o2008K7117K743M1514K4913k7328q4195N1301
10830B92706L6418j0510l1726N3393j8531j4009L9743K3704n1979p7659Q68J5760
10818B58178j9364R042N783l3266n9308n3220J6693R7796L4653K9044k1957m7170
10806B16904l1004o414l8136R533J8262k8709L5387j4428j9388n4551l2620J2506
10794F7342L4856N0143r615N3878n5207J3576K2686j3848K5845k7731M873N836
10782A72634l7117m7645m45N2605J06195l8571O68k6104k6103J032K1236n1321
10770A27064k8462j0629l5137L0061o735n3768O0009Q027n0455O0431j5712k5259
10758E9435o9792M9438k071l884M765q732O3103M5362p7606K2328K6057K7915
$$ plain form
10842 437610 423037 376429 336553 318649 256641 283758 286501 328015 352928 325600 241405 292706
10830 292706 329124 318614 286888 340281 321750 307741 347484 371188 319209 241550 242418 258178
10818 258178 238814 247856 253639 220373 161065 107845 124538 222334 256987 286031 264074 216904
10806 216904 185900 179486 141350 150883 169145 140436 175823 161395 142007 87456 54836 67342
10794 67342 102198 152341 142726 196604 141397 154973 177659 163811 189656 161925 166798 172634
10782 172634 135517 87872 87427 140032 246227 207656 208324 182220 156117 157149 178385 127064
10770 127064 98602 87973 52836 82897 76162 22394 82403 90430 39975 100406 84694 59435
10758 59435 -10357 39081 37010 33126 37891 29159 92262 137624 60018 82346 108403 136318
10746A36318n9298N719M4370Q9077L9195l0363n5830m7700J8377n16k7765K2193
10734A33777K3791M2005j8201L993O3973P6992L0057q5914l2488L87k6162p8885
10722A33325O1152N6478L8385m9337N5041j0917n0847K2779k7023p9881l5266
10711A13889j8811j4926J9063l2807M4797M4594k9609k2350r6202n3625M7362
10700A375L3351L1442M4957L224j06844o0623K6754O2666Q2686k053m2981r2549
10688a8595q8733r962M7939j082m9937L7519k5380J6419Q0733R4563m6268p4111
10676c6895n9027Q981p522L3645R881j7885J1901P118n130k5928o0757J2268J7160
10663a12190j2130l5409k2225R4744J39496j8988L551M6176N2441K2982m820r119
$$ plain form
10746 136318 77020 82739 127109 216186 255381 225018 169188 121488 139865 139349 111584 133777
10734 133777 157568 199573 181372 185365 249338 326330 356387 270473 237985 238372 212210 133325
10722 133325 194477 250955 289340 240003 295044 284127 233280 256059 229036 149155 113889
10711 113889 95078 80152 99215 66408 111205 155799 126190 103840 7638 -45987 1375
10700 1375 34726 66168 111125 114349 7505 -53118 -26364 36302 118988 116935 73954 -18595
10688 -18595 -107328 -117290 -69351 -70433 -120370 -82851 -108231 -91812 -11079 83484 37216 -36895
10676 -36895 -95922 -86941 -94463 -60818 -50937 -68822 -56921 -49803 -54933 -80861 -141618 -129350 -112190
10663 -112190 -124320 -159729 -181954 -87210 52286 33298 36849 83025 135466 158448 153628 144509
10651A44509n140n416L1479R2601K5541N6467L7565M7161p30K7121K3925K1042
10639D96125O5181M2648J38855J89140J81225K28158L62997M21489L85986L53742
10629B865546J37550K22168L10524N33317P55018J044287J332617J873393K703732
10620A1778152L803934N108632O666680Q510410R707906R172835O104672J644245
10612F2497466j886878l295057k387195M063L221998P293249J2063812J6995971
10604I4507429K0225315J8172129R170905k580536j0844616j3007097j0065440
10597A05578089m524633J806916Q567462J5616817K2295479K5641166K0647330
10590A95628626N766825j1488295k2374118k4136473j9456382j2575926n728402
$$ plain form
10651 144509 139369 133953 165432 258033 283574 340041 377606 424767 424037 451158 475083 496125
10639 496125 561306 603954 742809 931949 1113174 1341332 1704329 2125818 2511804 2865546
10629 2865546 3003096 3225264 3535788 4069105 4824123 5868410 7201027 9074420 11778152
10620 11778152 15582086 20690718 27357398 35867808 45575714 54748549 60853221 62497466
10612 62497466 60610588 57315531 54928336 54932399 58154397 65447646 77511458 94507429
10604 94507429 114732744 132904873 142075778 139495242 128650626 115643529 105578089
10597 105578089 101053456 102860372 111427834 127044651 149340130 174981296 195628626
10590 195628626 201395451 189907156 167533038 143396565 123940183 111364257 105635855
10583A05635855Q00486O920273J1666441J3346545Q902868j615403j2817535j9198223
10575A13641307j9017868j5088420j0178885n600422j913795R52734K858180L061579
10567F8714410P97035l435778p569495r811053r525131q008462o208912m559287
10559B0393327l399633k525369j915595j482977j199664j020584p28232o70320
10551G450953o44603n43404n18489l71907l49890k43171k30499l03296k54926
10542C990768k72765k26003k49781j65090p6747j04054n6835q2862j67067j05215
10532B484349j35691q0323P8691k5790r7642o4224j01571q1911M3654K2598o8486
10521A973654q3970p3654j0316p4586q8837k8479L0596O9259k950r1149j16483
$$ plain form
10583 105635855 106436341 113356614 125023055 138369600 147272468 145657065 132839530 113641307
10575 113641307 94623439 79535019 69356134 63755712 61841917 62794651 65652831 68714410
10567 68714410 69511445 66075667 58506172 48695119 39169988 31161526 24952614 20393327
10559 20393327 16993694 14468325 12552730 11069753 9870089 8849505 8121273 7450953
10551 7450953 6806350 6262946 5744457 5372550 5022660 4779489 4548990 4245694 3990768
10542 3990768 3718003 3492000 3242219 3077129 3000382 2896328 2839493 2756631 2589564 2484349
10532 2484349 2348658 2268335 2347026 2321236 2223594 2159370 2057799 1975888 2019542 2042140 1973654
10521 1973654 1889684 1816030 1805714 1731128 1642291 1613812 1644408 1713667 1710717 1619568 1503085
10510A503085Q198J5093j06313o3212m6589K3060k957o3194l1551j4062J1927
10499A233485J5476J9750O4811l8866p3895j5499k5423q2167q3979N4794M4275
10488A112762j0208k5661l5487l8233K2469L8697O8670k4823j4720n4673k5119
10477A013674m0354j6658p033l9479J0369m6515j0366N049J2804m264j1089M958
10465H71096l6672o3184j03594p5797K5987K7815N3352P53k0565j6888O1867m538
10453G19632j12147r875M3454L1822j8419k0826k3609O3458M2381o3498L0562
10442F82935j2933l9669l2863k9853p0661l5617l58M5270J3479N2118R8954J7211
10430F88013k6333k8361N1070m6216J2619j9059m402K8869k7552k7406m0858j0211
$$ plain form
10510 1503085 1511283 1526376 1420063 1356851 1310262 1333322 1330365 1267171 1235620 1221558 1233485
10499 1233485 1248961 1268711 1333522 1294656 1220761 1205262 1179839 1097672 1013693 1068487 1112762
10488 1112762 1102554 1076893 1041406 1003173 1025642 1064339 1133009 1108186 1093466 1038793 1013674
10477 1013674 973320 956662 949629 910150 920519 874004 863638 868687 881491 877227 866138 871096
10465 871096 834424 771240 667646 591849 617836 645651 699003 699756 679191 662303 724170 719632
10453 719632 607485 597610 641064 672886 654467 633641 610032 673490 715871 652373 682935
10442 682935 670002 630333 597470 567617 496956 461339 460981 506251 519730 571848 670802 688013
10430 688013 661680 633319 684389 638173 650792 631733 627331 656200 628648 601242 560384 550173
10418E50173P657M3499Q28j18721L0332J36573L0602J619m4472n8494K5212R639
10406F14447o7834m6525p6021J0135M9263j2032K7449J4822l0395J743j26989
10395C58063j2112L0454K4536M5823L6615Q560k8729m6594N4398J2272o4423m8201
10383C70662p8001K2842K8044l2600J6291L5707N7918N6129J7522j4227k1508
10372D58779m8209o2730L793N9608L004k9922o6841O2440N2364l5969Q4204k6685
10360D53836k1016j7221j9639p880K8297M4926k7521q4346j392M1263m9100m2646
10348B97561L9821J4312m3906p5562K2317K7872M6979L9830L5595o120l1802m4022
10336C22875j9028j5028N7461L0625m1523r984j7872k4277K3717l2438j4375k7404
$$ plain form
10418 550173 557830 601329 602157 483436 513768 650341 680943 682562 638090 579596 604808 614447
10406 614447 546613 500088 424067 434202 483465 471433 498882 513704 483309 485052 358063
10395 358063 345951 376405 400941 446764 483379 491939 463210 416616 471014 483286 418863 370662
10383 370662 292661 315503 343547 310947 327238 362945 420863 476992 494514 480287 458779
10372 458779 410570 347840 351633 411241 414245 384323 317482 379922 432286 396317 480521 453836
10360 453836 432820 415599 395960 388080 416377 461303 433782 349436 348044 389307 340207 297561
10348 297561 337382 351694 307788 232226 254543 282415 329394 369224 404819 398699 366897 322875
10336 322875 303847 288819 346280 376905 335382 325398 307526 283249 306966 274528 260153 232749
10324B32749k9917L1383R8218K6469L1936k8685j6500O9048m5551j56220r169
10313B03761q98N4454k6231L3170M887o5166l3914L2239j552K3097O2497j5072
10301B71272K259J6600K9501m496m3068m5741k7902n3930o8637l7953Q2958J19264
10289B40127L2496L6820j8492p4730J9531J8127J440J7087o8713m035N0403J6276
10277B66337r7239j28919N7780J13020M0798p7565o4996j7736L16O1030M1559
10266A94385l391M1768K784j7650n4402r5039j0545j350O7693J11021N629Q336
10254B49239M2424K2570o4152j80529j14841J6380M4267J28534J5371n4660o8308
10243C6295K8071M731P9385K2301K8000l317l2409l4342m0864q4661p0400O5376
$$ plain form
10324 232749 202832 234215 332433 358902 390838 362153 345653 414701 369150 212930 203761
10313 203761 202863 257317 231086 264256 269143 203977 170063 202302 200750 223847 286344 271272
10301 271272 273531 290131 319632 315136 272068 226327 198425 144495 75858 37905 120863 240127
10289 240127 272623 309443 290951 216221 235752 253879 255319 272406 203693 199658 250061 266337
10277 266337 169098 40179 97959 210979 251777 174212 109216 91480 91796 152826 194385
10266 194385 190994 232762 235546 217896 163494 68455 57910 56560 124253 235274 240903 249239
10254 249239 291663 314233 250081 69552 -45289 -28909 15358 143892 159263 104603 36295
10243 36295 64366 69097 148482 170783 198783 195466 163057 128715 87851 3190 -67210 -1834
10231a834Q5250N9215j3807l2191l3973J7471Q9412P5797L2732l9247j10928o9580
10219E8317K4396o761J2545L1917m7974J1932J4277K997K4769K0718K384m7786
10207A01731l6380J2527L3433l7188L4486M0603l1442j2391N1501J26760J2279
10196B95919l4486K9838P9515K2632k0157j4419o6895l9963l628k97N2320j0974
10184B89405q8263l5290L6505O9219J8062O2567Q8239J9757N08m2349K0310M6422
10172D85092J5438L2248O565J3165J08130J45044K7552R596K4481J1463n0701
10161H28073J6608N4205J03639K04022K09744K37908J99038O4319k2804o5995
10151A828757J1371o4245j73292q4564l8481j8523q3586m4553N9834k3987j72873
$$ plain form
10231 -1834 83416 142631 128824 96633 62660 80131 169543 245340 278072 238825 127897 58317
10219 58317 82713 75952 88497 120414 72440 84372 98649 101646 126415 147133 149517 101731
10207 101731 65351 77878 111311 74123 108609 149212 117770 105379 156880 283640 295919
10196 295919 261433 291271 370786 393418 373261 358842 291947 251984 248356 248059 300379 289405
10184 289405 201142 165852 202357 271576 289638 352205 440444 460201 460709 418360 438670 485092
10172 485092 500530 532778 539343 552508 660638 805682 833234 842830 867311 878774 828073
10161 828073 844681 898886 1002525 1206547 1416291 1654199 1853237 1917556 1894752 1828757
10151 1828757 1840128 1775883 1602591 1518027 1479546 1461023 1377437 1332884 1392718 1368731 1195858
10140A195858j32155j40624j25559K2977j1506o6722r8029o4590L6233J2759J919
10129F30561M752r1385j24732l490l0580j9297o4231L5190Q224M9300R4052Q511
10117D96875n7388M3975R7547J47593J32926J48517J14101J17011J45358J29087
10107A515602P1166R6587l3543j35273j35348k20515j45437r7198p6799q7101
10097G52141j29535k3913o2304j35033j5651q7728J1592K0986o3220m1505M1528
10086B67358j9018q1177j136J8949j6511J4811k6445m165k588Q1750J0545j462
10074B40911K0105M8125R6407J47007J12692M7270J14425J22595O7108J23778
10064A140423Q0449J6365j36785j35210q3254p3227j17274j46415o721r5622j05989
$$ plain form
10140 1195858 1063703 923079 797520 820497 808991 742269 644240 579650 615883 628642 630561
10129 630561 635313 543928 419196 415706 385126 365829 301598 336788 345012 394312 488364 496875
10117 496875 439487 483462 581009 728602 861528 1010045 1124146 1241157 1386515 1515602
10107 1515602 1586768 1683355 1649812 1514539 1379191 1158676 1013239 916041 839242 752141
10097 752141 622606 598693 536389 401356 385705 297977 309569 330555 267335 225830 267358
10086 267358 248340 167163 166027 184976 168465 183276 156831 152666 150078 231828 242373 240911
10074 240911 261016 309141 405548 552555 665247 712517 826942 949537 1016645 1140423
10064 1140423 1220872 1237237 1100452 965242 881988 808761 691487 545072 538351 442729 336740
10053C36740k3587r9228q1765L4364l1937l5476l2469k149j88k8398m6697O077
10041d713l0380l998j3927j08822K4814R7808M0422j6503k7234M3603M5827m8606
10029a709j251M0384O7920R2823J05003N2016k0289k0563R373k8831L7041k6753
10017C05164r3671m2985j09552n2361J0721M4005K425m1921p4141L8841L0807
10006A7332M4056k0567O4832M2560n3634m0321j7529j00757r4192m3047k5623
9995b26890n523M9318Q0094J5860J0864J9173k2882J1469j0238K6630N1937l1265
9983c1453j9706l0466o4705K2600J0114j9942L8277k6742L1765n2278p4688r1717
9971c08941J04702J10704l9692j7952n4864l4646m6456J8706P487L344L7696J21286
$$ plain form
10053 336740 313153 213925 132160 166524 134587 99111 66642 64493 64305 35907 -10790 -4713
10041 -4713 -35093 -39091 -53018 -161840 -137026 -39218 1204 -15299 -42533 1070 46897 -1709
10029 -1709 -2960 37424 105344 198167 303170 355186 334897 314334 323707 294876 331917 305164
10017 305164 211493 168508 58956 6595 17316 61321 63746 21825 -52316 -13475 17332
10006 17332 61388 40821 105653 148213 94579 54258 36729 -64028 -158220 -201267 -226890
9995 -226890 -232413 -183095 -103001 -87141 -76277 -57104 -79986 -68517 -78755 -52125 -188 -31453
9983 -31453 -51159 -81625 -146330 -123730 -113616 -133558 -95281 -122023 -90258 -142536 -217224 -308941
9971 -308941 -204239 -93535 -133227 -151179 -206043 -240689 -287145 -268439 -260952 -257608 -219912 -98626
9959i8626o578l4854N239p5364q337j4848p1672n9989O7998O5027R901L702M7146
9946a71255P7958J3136m3556m1453l0978Q285k6218k5035m0896m8030P007L3212
9934b87823K7456J05946M7775L0177L525q843n7728n4309L4900j7495k6957m4892
9922b48268k3168Q546N7307q1913o6526n5797K0897j2335K4568k594k0889l2488
9910d32660L9842R2341L3439m5100l3002m5492J7069J6373j9672K7342K7757m0192
9898c61955p4522o2589l7670N4626L1727r5901p7001K2433L2753R0910J22543
9887c54646Q4375l60j9722j8887K0686j06433m7592l487k6443j2413l0010l5286
9875e50218j8748M9019J7995L2334P896J4377l053M164O1573N1122l1950k8705
$$ plain form
9959 -98626 -105204 -140058 -134819 -210183 -218520 -233368 -305040 -365029 -297031 -232004 -222103 -218401 -171255
9946 -171255 -93297 -80161 -123717 -165170 -196148 -187863 -214081 -239116 -280012 -328042 -321035 -287823
9934 -287823 -260367 -154421 -106646 -76469 -72944 -81787 -139515 -193824 -158924 -176419 -203376 -248268
9922 -248268 -271436 -262890 -205583 -287496 -354022 -409819 -388922 -401257 -376689 -379283 -400172 -432660
9910 -432660 -392818 -300477 -267038 -312138 -345140 -390632 -373563 -357190 -376862 -349520 -321763 -361955
9898 -361955 -436477 -499066 -536736 -482110 -450383 -546284 -623285 -600852 -568099 -477189 -354646
9887 -354646 -270271 -270631 -290353 -309240 -288554 -394987 -442579 -446066 -472509 -484922 -514932 -550218
9875 -550218 -568966 -519947 -501952 -469618 -461722 -447345 -450398 -446234 -384661 -333539 -365489 -394194
9863c94194N180N7433L3983l5001L731P4511J9223q3810j4012k0084l8769m7648
9851d39457o4610M172O7521K5226J2704N4951l0641J0532K7553M2229l5913J6935
9839c08798J18433L6101J6005j8184P7515L9171P6693j8859L6984L9969L2813
9828A27843k583L7580O206m7676L2360J01246J15179J63158K05960J32567P5401
9817I47241N4802J3946P6036O2023J16332K24571J86081K70473K07972K11011
9807B370488K05018K23943K10371J49509J78670K09664K24840K36171J73453J71579
9797D353706J05651O4057N9307m2035r7079j99682j17750m9862m9298q077L7705
9786D056643L5377J08242K60065M28114L93058O03329Q26013J021778J118517
$$ plain form
9863 -394194 -389014 -331581 -297598 -332599 -328868 -254357 -235134 -318944 -332956 -353040 -391809 -439457
9851 -439457 -504067 -499895 -432374 -407148 -394444 -339493 -370134 -359602 -332049 -289820 -325733 -308798
9839 -308798 -190365 -154264 -138259 -156443 -78928 -39757 36936 18077 55061 95030 127843
9828 127843 125260 162840 169046 121370 153730 254976 370155 533313 739273 871840 947241
9817 947241 1002043 1015989 1092025 1154048 1270380 1494951 1681032 1951505 2159477 2370488
9807 2370488 2575506 2799449 3009820 3159329 3337999 3547663 3772503 4008674 4182127 4353706
9797 4353706 4459357 4523414 4582721 4540686 4443607 4243925 4126175 4076313 4027015 4018938 4056643
9786 4056643 4092020 4200262 4460327 4888441 5281499 5884828 6710841 7732619 8851136
9777H851136J130576J125783R48411N77349L09218o7212m02624m83797m72205
9768A1516635m57133m52854l69427l72568l42854k54597k01949j83183l2973O5431
9758H914528J83863L68977M34251N85651Q02598R94803J211143J379217J599815
9749A6474846J818663K163123K562109L131921L830673M873944O187482P930351
9741D8973112J0155860J2968355J5968558J8713233K0264621J9025077J3643611
9734A59712427M914124m150638j0963729j4082884j4027278j2153713r715141
9727I9533168p035385m364806j857748M34613K750457M997557P065686Q772599
9719A10296141R808026J0089006R561409Q439017P066730N596198M269828L008018
$$ plain form
9777 8851136 9981712 11107495 12055906 12633255 12942473 12875261 12472637 11988840 11516635
9768 11516635 11059502 10606648 10237221 9864653 9521799 9267202 9065253 8882070 8849097 8914528
9758 8914528 9098391 9467368 9901619 10487270 11289868 12284671 13495814 14875031 16474846
9749 16474846 18293509 20456632 23018741 26150662 29981335 34855279 41042761 48973112
9741 48973112 59128972 72097327 88065885 106779118 127043739 146068816 159712427
9734 159712427 164626551 160475913 149512184 135429300 121402022 109248309 99533168
9727 99533168 92497783 88132977 86275229 86709842 89460299 94457856 101523542 110296141
9719 110296141 120104167 130193173 139754582 148193599 155260329 160856527 165126355 168134373
9711A68134373J493520m5553j331177k479340l685849m427661m521793l718317
9703A49418203j750165J088543M950774J0063294J6760574K5216911L5209329
9696B40957463M5437668N3996517N6513718M6384218K0731370j2030350l8220450
9689D13770154n1062188n2099756m5948192l6962334k7658059j9400800j2692159
9682A67946666p369067l143122R8738K367591L598798L896843L574996K933612
9674A73905055K083159J020659l19771j768436l176158m666568o427748q299192
9666A52351000j0056182j0958425j0927553r857129q109265n957800l832883j868227
9658I0783536K33778K562232N035444P778707J0520036J2752910J3851060J2518739
$$ plain form
9711 168134373 169627893 169582340 168251163 165771823 162085974 157658313 153136520 149418203
9703 149418203 147668038 148756581 153707355 163770649 180531223 205748134 240957463
9696 240957463 286395131 340391648 396905366 443289584 464020954 451990604 413770154
9689 413770154 362707966 310608210 264660018 227697684 200039625 180638825 167946666
9682 167946666 160577599 157434477 157533215 159900806 163499604 167396447 170971443 173905055
9674 173905055 175988214 177008873 176689102 174920666 171744508 167077940 160650192 152351000
9666 152351000 142294818 131336393 120408840 110551711 102442446 96484646 92651763 90783536
9658 90783536 91017314 93579546 98614990 106393697 116913733 129666643 143517703 156036442
9650A56036442P885306K67902q274249j4934029j8059128j7992539j6246371j3592375
9642G5090959j0877301q652144o884770n447276m364225l539989l054278k492546
9634B9778430k128482j936898j787822j530687j325883j170203r89028q05931
9626A8103496o30575o39135m38874j72982j55562r7241j04066J5146Q1683K73527
9616A6235417K90430L15013M27529L98629J51213q8805l37208o02555q53777j085823
9606A4850063j178689j048321r07203q16472o22288n69291l67010l01071k79810
9597H759908k23981r9549k9861k8078j7859L5369J3511o1032j6717R719J8070
9586H359500q5928j58127k14917j43797j01377j86714j97143j67866j96345k60467
$$ plain form
9650 156036442 163921748 164189650 155915401 140981372 122922244 104929705 88683334 75090959
9642 75090959 64213658 55561514 48676744 43229468 38865243 35325254 32270976 29778430
9634 29778430 27649948 25713050 23925228 22394541 21068658 19898455 18909427 18103496
9626 18103496 17472921 16833786 16394912 16221930 16066368 15969127 15865061 15880207 15961890 16235417
9616 16235417 16525847 16840860 17268389 17667018 17818231 17729426 17392218 16789663 15935886 14850063
9606 14850063 13671374 12623053 11715850 10899378 10277090 9707799 9340789 9039718 8759908
9597 8759908 8535927 8436378 8406517 8378439 8360580 8395949 8409460 8348428 8331711 8341430 8359500
9586 8359500 8273572 8115445 7900528 7756731 7655354 7468640 7271497 7103631 6907286 6646819
9576F646819k46006l20953l00106k62861k09556k64600k95432k29408k34324j57957
9566D125616k11348q4117j08904j26635j28998m7889o7028q4567n597j1585o1581
9555C187367l1386n0663l7379p6387j04877l4454o8895p4651Q590O6666l9841
9544B744090k6131q4797n8984k8383o2366O0193R2043l1596m6431l9069k3467
9533B495102L3232K8666n4457p5831j8628J4418m6213m7124n7188o1501o1620
9522B148856P20J0718R763J9440j0185M9171o4833n3881l2744m0455O3831J9867
9510B120268n0257J6288o6027q9750L1751n2388j2309p1470n2440k2352l3761
9499A717553j0015O6742k1065p6584Q0032M4173p0149q2162M656M4710r850K2571
$$ plain form
9576 6646819 6400813 6079860 5779754 5516893 5307337 5042737 4747305 4517897 4283573 4125616
9566 4125616 3914268 3830151 3721247 3594612 3465614 3417725 3350697 3266130 3260533 3248948 3187367
9555 3187367 3155981 3105318 3067939 2991552 2886675 2852221 2783326 2708675 2717265 2783931 2744090
9544 2744090 2717959 2633162 2574178 2545795 2483429 2543622 2635665 2604069 2557638 2518569 2495102
9533 2495102 2528334 2557000 2502543 2426712 2408084 2422502 2376289 2329165 2271977 2210476 2148856
9522 2148856 2149576 2160294 2170057 2189497 2179312 2228483 2163650 2109769 2077025 2036570 2100401 2120268
9510 2120268 2070011 2086299 2020272 1930522 1962273 1909885 1897576 1826106 1773666 1751314 1717553
9499 1717553 1707538 1774280 1753215 1676631 1756663 1800836 1730687 1648525 1653181 1697891 1688041 1710612
9487A710612N5510J02253k2351K0575p8268q9881L0754L861k3021k5144j2029
9476A672871m3288m3129p4217j7714K2852J5912K1055M0602J0799j3361j15627
9465A476755R0920p913P974P7629m8048j09557P330k1049P305N558L6804k9293
9453A494415J1924j5247p2936r0887J3338M2556k5172p0106m0883J19870P8846
9442A445718k2591J5463k8811K1452M3231l6570n0809J2509j4724p7296p9397
9431A228175j3394L3222q4215J8443K5224M242j945L1700j1601l4426m9948Q093
9419A153570Q2275o8720m3015J4879j9440J9925M426k8622j1209J0737m1789r3968
9407I79049K9329P6626o604m8147L011j1059M958k2022L8873J1469k9412M1252
$$ plain form
9487 1710612 1766122 1868375 1846024 1866599 1788331 1698450 1729204 1733065 1710044 1684900 1672871
9476 1672871 1629583 1586454 1512237 1494523 1517375 1533287 1554342 1594944 1605743 1592382 1476755
9465 1476755 1567675 1559762 1567736 1645365 1597317 1487760 1495090 1474041 1481346 1486904 1523708 1494415
9453 1494415 1506339 1491092 1418156 1327269 1340607 1383163 1357991 1287885 1247002 1366872 1445718
9442 1445718 1423127 1438590 1409779 1431231 1474462 1437892 1387083 1399592 1384868 1307572 1228175
9431 1228175 1214781 1248003 1163788 1182231 1207455 1211697 1209752 1241452 1229851 1195425 1145477 1153570
9419 1153570 1235845 1167125 1124110 1138989 1119549 1139474 1143900 1115278 1104069 1114806 1073017 979049
9407 979049 1008378 1085004 1078400 1030253 1033264 1022205 1027163 1005141 1044014 1055483 1026071 1067323
9395A067323j2945K3525l0586K7119k8652j6819l1004r040j5761o1306k1440l309
9383H87105n4289J3875r782L4392K17k5752L3195J9782k0622k9432M3161K6124
9371I17974n1459m9528K6149J33210P367l6160K1882J0396K2538r216q797J7407
9359A001763K9833J6841O0148Q8238j3915n7067j1372r7462p2887m0091l6453
9348H67576N524Q7227K717m0910P9806m2231p7740l208j05037o4992J4625Q6982
9336H10339L4415p562N4163R8590O2414j7539P488J6433j0311m9784P4772J04980
9324A178398J4041L4010K4640O6450N7354J31312J26022J54284J69705J09412
9314B065628N8037l547m0112j09706j05563j01809j62374j44130q756o8531j12397
$$ plain form
9395 1067323 1054378 1077903 1047317 1074436 1045784 1028965 997961 988921 973160 911854 890414 887105
9383 887105 832816 846691 836909 871301 871518 845766 878961 898743 878121 848689 891850 917974
9371 917974 866515 816987 843136 976346 983713 947553 969435 979831 1002369 993153 984356 1001763
9359 1001763 1031596 1048437 1108585 1196823 1182908 1125841 1114469 1017007 944120 904029 867576
9348 867576 873100 960327 963044 922134 1001940 959709 881969 878761 773724 708732 723357 810339
9336 810339 844754 837192 891355 989945 1052359 1034820 1042308 1058741 1048430 998646 1073418 1178398
9324 1178398 1192439 1226449 1251089 1317539 1374893 1506205 1632227 1786511 1956216 2065628
9314 2065628 2123665 2120118 2080006 1970300 1864737 1762928 1600554 1456424 1447668 1379137 1266740
9303A266740r5947k9677j1916k1945M448q7603q7711O1135L3120K8128R3890m7219
9291A105443M2812L2757k9590J723l6317M3677O4516j7401J40896P5330n560O7036
9279A485322Q7255N8261Q7528J30666J86622J49940J15081K7544O7482L3210m3237
9268B385674m0811k05462j32067j54595j27877j10975j34408j03844k1944p7823
9258A275868r4354k2923l4813J1930p8183j03050l4971o349O7949K8147O45l988
9246A005908J3138l863Q6614J34836j9926J00001M4461k1945O7369l094r0752
9235A312747j2938Q1508J43187J11632K2578O5242L5169M2921J3406k6221j51288
9224A637943j45797o6412o8033m0199j9313j67046j44180N730l2884M9478q704
$$ plain form
9303 1266740 1170793 1141116 1129200 1107255 1111703 1024100 936389 997524 1030644 1058772 1152662 1105443
9291 1105443 1148255 1181012 1151422 1153145 1116828 1160505 1225021 1207620 1348516 1423846 1418286 1485322
9279 1485322 1572577 1630838 1718366 1849032 2035654 2185594 2300675 2328219 2395701 2428911 2385674
9268 2385674 2344863 2139401 2007334 1852739 1724862 1613887 1479479 1375635 1353691 1275868
9258 1275868 1181514 1158591 1123778 1135708 1057525 954475 919504 913155 981104 1009251 1009896 1005908
9246 1005908 1019046 1015183 1101797 1236633 1216707 1316708 1361169 1339224 1406593 1403499 1312747
9235 1312747 1299809 1381317 1524504 1636136 1658714 1723956 1759125 1802046 1815452 1789231 1637943
9224 1637943 1492146 1425734 1357701 1317502 1298189 1131143 986963 992693 959809 1009287 1000583
9213A000583l4069j3396p4461m5723M3124K726L7112O6016k515p9392l33R7059
9201I96731J08330P7390O2553P137p22K972p0294j20932j59963o9176O2523o7739
9189H28810N3310k9094M262J5476j18024o3529N0170N1946o584n0989j18516p0818
9177E46420K5153L7171J426L7112L3680M8765L33r406n1780m0231J8234m6047
9165F00830k5678J4318J7231R8757J10009J68271N6351j2800J69784N9725L562
9154A260360o065n8915k05734j98834l8732M5815L9440r0838r8090n8662k6337
9143E63408N8169L2498l8901R669j7855j14038l5759M6983j9273j03699J01310
9132D82512P0576j5173o7032k2877R602K3377O1261R0493L6544O5044n0508m3218
$$ plain form
9213 1000583 966514 953118 878657 832934 876058 878784 915896 981912 979397 900005 899672 996731
9201 996731 1105061 1182451 1245004 1252141 1251419 1254391 1184097 1063165 903202 834026 896549 828810
9189 828810 882120 853026 857288 872764 754740 691211 741381 793327 786743 735754 617238 546420
9177 546420 571573 608744 610170 647282 680962 729727 730060 720654 668874 628643 646877 600830
9165 600830 575152 589470 606701 705458 815467 983738 1040089 1027289 1197073 1256798 1260360
9154 1260360 1254295 1195380 989646 790812 752080 797895 837335 746497 648407 589745 563408
9143 563408 621577 654075 615174 624843 606988 492950 457191 504174 484901 381202 482512
9132 482512 553088 537915 470883 448006 457608 480985 542246 632739 669283 734327 683819 640601
9120F40601J8332Q6188R7055J22738J37252N6634Q0378R223j34890k25115j22951
9109G65445k4431j20235r5144R143L9042p7897O9466k585M1740l3100l3642M813
9097E42615p4483q715o1804n4870R181P4119L5373K0943j4013r935M5922M5432
9085E49765m126l7720k7313L6233J8063k4565l0470j2348q7671J00925L9113J40279
9073F60165R0147M6981k8101k4465j07592o7626J1863J3611J5584p6541o7379
9062D66647m1966r0337J5775R7707L2506M8187l4054j1256n6795k4157L441j059
9050D04639l4112m1382Q5170P7710P8605Q598k8261m4644n7822P9341J2107j11144
9038D28805k863l802N5469N2063m7398K9158N5760k670n2188k0212q0317n2918
$$ plain form
9120 640601 658933 745121 842176 964914 1102166 1158800 1239178 1248401 1113511 888396 765445
9109 765445 741014 620779 525635 534778 573820 495923 565389 562804 604544 571444 537802 542615
9097 542615 468132 459417 397613 342743 351924 426043 461416 482359 468346 458411 504333 549765
9085 549765 545639 507919 480606 516839 534902 510337 479867 467519 379848 480773 519886 660165
9073 660165 750312 797293 769192 744727 637135 569509 581372 594983 610567 534026 466647
9062 466647 424681 334344 350119 447826 480332 528519 494465 483209 426414 402257 405698 404639
9050 404639 370527 329145 414315 492025 570630 579228 550967 506323 448501 527842 539949 428805
9038 428805 425942 422140 477609 529672 482274 511432 567192 564522 512334 492122 411805 358887
9026C58887m6652O0211J9257M0663L919k8547m8877N6249L5189j03509j9997p7350
9014B49443p6962k3264l9316P3199J01418Q549j633p312J09309O9501m5038J8763
9002D36657l8300r3401N0164N9925P303p7590k5798o6875j26136L1084J19874
8991B76907M1315N056k3806r732R72N1022J12080L9283k5579l8776j2206l7682
8979C78854K2593Q595l2916m8921q6536M723K1646k213R681j0738L2401N2781
8967C49950o4507k5125J9744k572L1555M9320K347p27m8084n2824n371K5531n2639
8954B26598k8972J4237P2587O4622l2577m0080l4538m53l4807J5256L5085J1384
8942B68342n559p587n905m8530M0217m5187o048K3839J41316Q9239o4643m5773
$$ plain form
9026 358887 312235 372446 391703 432366 436285 407738 358861 415110 450299 346790 326793 249443
9014 249443 172481 149217 109901 183100 284518 293067 291434 284122 393431 462932 417894 436657
9002 436657 398357 304956 355120 415045 422348 344758 318960 252085 125949 157033 276907
8991 276907 318222 323278 299472 289740 290712 341734 453814 493097 467518 428742 416536 378854
8979 378854 401447 410042 377126 328205 241669 246392 268038 265825 275506 264768 297169 349950
8967 349950 285443 260318 280062 277490 309045 358365 360712 359985 311901 259077 253706 279237 226598
8954 226598 197626 211863 284450 349072 316495 276415 241877 241424 206617 221873 256958 268342
8942 268342 262783 255196 249291 200761 240978 195791 189743 213582 354898 444137 379494 333721
8930C33721L3443j8198J1346l8199n3468m7331M5289J1377O7036J9112p5418M6678
8918C35388m5592J5414J3234L2718j0116k3829l6199Q721K4434j9651j8280J7267
8906B93509M1535K6607j05262k3145K7611Q7578M9143q9033l2168j3034j6302
8895B47039l739p329P6683Q3783k3772p7718Q3091K8219q2736o8963K1707R126
8883B85391N7055k1994K521n547K2108l8420l4244J5240L0500N6728L5249K2651
8871D27238j10571j02967l3983P6148J03971K0324q2367L5342J9509q2356l0962
8860B39326J4564K5748K3567n0435M9654N1307N9180q4777o3754q224l6491k6135
8848A93530K971J8661O4125j8774n4681M475m7352J06387L6439p0669r03M1893
$$ plain form
8930 333721 367164 348966 360312 322113 268645 221314 266603 277980 345016 364128 288710 335388
8918 335388 289796 305210 318444 351162 341046 317217 281018 289739 314173 294522 276242 293509
8906 293509 335044 361651 256389 233244 260855 348433 397576 308543 276375 263341 247039
8895 247039 243300 235971 312654 396437 372665 294947 378038 406257 323521 254558 276265 285391
8883 285391 342446 320452 322973 317426 339534 301114 266870 282110 312610 369338 404587 427238
8871 427238 316667 213700 179717 255865 359836 380160 297793 333135 352644 270288 239326
8860 239326 253890 279638 303205 252770 302424 353731 412911 328134 264380 256156 219665 193530
8848 193530 196501 215162 279287 260513 205832 210307 162955 269342 305781 235112 234209 276102
8836B76102M9346J1217O3741K8758Q3208K1142M213L3924o3948j07216j16165
8825B84322r7408J7433J03438L1317L755L9717K5272p3996q7136l5589l5395Q1946
8813B57676j2209K6847j7828O403K5466o6805k6122L3163n3512l4846Q8999K1904
8801B49136j10480j19622J5097Q8009l4925p2326J3474J15794J21050M8716j06596
8790B07327o3046J4468L4588l123K0514N7706n5335j9487P6858M6174o1248k8193
8778B27203L8773k4203J6237l2775L7786J6165Q264O3248m3587P1002L6070p6435
8766C37748k5331o3695Q678j006J1128j3682j4348L2846q357j0726n2664p226
8754A93365M2383k3388l5469k990j3538P049j41J9767l6291m927J2789L1010M5373
$$ plain form
8836 276102 325448 336665 400406 429164 512372 533514 537727 571651 507703 400487 284322
8825 284322 186914 204347 307785 339102 342857 382574 407846 333850 246714 211125 175730 257676
8813 257676 245467 272314 254486 260889 286355 219550 193428 226591 173079 138233 227232 249136
8801 249136 138656 19034 34131 122140 87215 14889 28363 144157 265207 313923 207327
8790 207327 144281 158749 193337 190214 210728 268434 213099 193612 270470 316644 255396 227203
8778 227203 265976 241773 258010 225235 263021 279186 287450 350698 307111 378113 414183 337748
8766 337748 312417 248722 257400 256394 267522 253840 239492 272338 263981 253255 200591 193365
8754 193365 235748 212360 176891 173901 160363 167412 167271 187038 150747 145820 158609 189619 234992
8741B34992l4943m7116l4157P2732L9272L7579o0183j38791P0872R3203K9187
8730B62647r3139K0155j2810j30101n6905P6892M7147m3345m0956J04543L3945
8719A68073J4107L9267M2768O1172K6868m2930o4566n9733J3359K0347M1990l8815
8707B21907j1071k7493J8700l6957L8780l3508M1801O8708n6242l2798m0405j2262
8695A39160K372K0938M734n1594M2228K5074l7713j14780q950J2773Q6856L1760
8683A52858J8008M7533k8093O3305K9355K4011p991j04121K855Q5287O9276p1516
8671B80767p0704m0800P4674N1381k6483Q965m0967r573L1001J08907j4761j38107
8659B14300j4175L0969j7703m253K0280l0480j3556J93J7013Q037N9485J4267
$$ plain form
8741 234992 200049 152933 118776 191508 230780 268359 208176 69385 140257 233460 262647
8730 262647 169508 189663 176853 46752 -10153 66739 113886 70541 29585 134128 168073
8719 168073 182180 221447 264215 325387 352255 309325 244759 185026 198385 218732 260722 221907
8707 221907 210836 183343 202043 165086 203866 170358 212159 280867 224625 191827 151422 139160
8695 139160 141532 162470 167204 115610 157838 182912 145199 30419 21469 34242 121098 152858
8683 152858 170866 218399 190306 253611 282966 306977 298986 194865 197720 283007 352283 280767
8671 280767 210063 169263 243937 295318 268835 277800 236833 227260 258261 367168 352407 214300
8659 214300 200125 231094 213391 209138 229418 198938 185382 185575 202588 210625 270110 284377
8647B84377n998k0408l426P6419M5169k8322j13216j2739L0314k473J579M59R8970
8634C50705n6406m1266M099j4307J5452J1008L3555j5135k4911K55L3914L6459
8622C33422P6731m1980m9123J7637L1583J094L1381M2134j7388k2302o1551R659
8610C51297m8101n1985L5434J08093p966k4961q1286m4151L2135P9415M4208N1678
8598D43810R5782L0462J02681m4779j20939r729P2702k36L3123K9096J2789N4293
8586F99055M0693q1267q1256n970L3290N6373r1793p5369k9953k9251O1296K0551
8574E16399l1316J0844J8110k4709J7417p3703o3947p967Q9205j9471l5337N094
8562D00619J3719m6355o0134j4521N5404K9191l7677l2950K8271l2582j8450O1518
$$ plain form
8647 284377 278379 257971 254545 330964 376133 347811 234595 221856 252170 249697 251276 251735 350705
8634 350705 294299 253033 257132 242825 258277 269285 302840 287705 262794 263049 296963 333422
8622 333422 410153 368173 319050 336687 368270 369364 400745 442879 425491 403189 341638 351297
8610 351297 303196 251211 286645 394738 386772 361811 280525 236374 268509 347924 392132 443810
8598 443810 539592 570054 672735 627956 507017 497288 569990 569754 602877 631973 644762 699055
8586 699055 739748 658481 577225 571255 604545 660918 569125 493756 463803 434552 495848 516399
8574 516399 485083 495927 514037 489328 506745 433042 369095 361128 450333 430862 395525 400619
8562 400619 414338 367983 307849 293328 348732 377923 340246 307296 335567 302985 284535 346053
8550C46053l685l9789n0396m3590n2292j3958J06393M8848j5343p7489q3231O1123
8538A82644P7200k5471r8644K1345j316K4685Q516q0437l1984m2907n177J05852
8526A34306J30473j8770j02445k4183O6032N0563Q030N444q990n0741L7260P8924
8514C05903M0675l6099j15883q7611N3509K2564N3318O3993n9335m2121q2583
8503A16330J3563r562j7763J8212P523Q2795l2047j24429j01739L1869J17023
8492A01775k2452l1175L4723N8974K1349L8131j7592j4068k387j7915q860r768
8480A30735l6332K501l4002L3045P5369M7474l4358p0213n8126O9095L894n0538
8468G8544N6906l9154J5885L8709M1988l6170P415M0203l3903k8021M4993M4235
$$ plain form
8550 346053 342368 302579 252183 208593 156301 142343 248736 297584 282241 204752 121521 182644
8538 182644 259844 234373 135729 157074 155758 180443 188959 108522 76538 33631 28454 134306
8526 134306 264779 246009 143564 119381 185413 235976 244006 249450 240460 189719 226979 305903
8514 305903 346578 310479 194596 106985 160494 183058 236376 300369 241034 198913 116330
8503 116330 129893 120331 102568 120780 128303 211098 179051 54622 -47117 -15248 101775
8492 101775 79323 48148 82871 141845 163194 201325 183733 169665 167278 149363 140503 130735
8480 130735 94403 96904 62902 95947 171316 218790 184432 114219 56093 125188 129082 78544
8468 78544 135450 96296 112181 150890 192878 156708 164123 204326 170423 142402 187395 231630
8456B31630k7140o8052J6075O619p3788j52087K6678J11774J31690K8325L8714
8445B70438M0141K3303r272K8804k5952K4352K1505q8552n9045O1808K233l7999
8433B51764n6272K5593k5622l4128p1345K2430K7659j9815M9209l575m9764K060
8421A18194K6834J4023k5738J7738P516N1957Q502p4469k2585n1866j17005L1287
8409a5612R0610j6456k4744J37149j5723o0589O201m6412J4999L0044j5738J3664
8397I7393J04997M9073p812M7319P3932o3934j02385o6026J4113p8489j0069M4544
8385A02656L7850p138l3110Q9094N1049j20772l5133Q5720j269l9338L4585k1783
8373A42411r2860J6995O7309Q0557L0529k3158l5834m7062k7821M8862l0567m326
$$ plain form
8456 231630 204490 136438 152513 159132 85344 -66743 -40065 71709 203399 231724 270438
8445 270438 310579 333882 324610 353414 327462 351814 373319 284767 225722 287530 289763 251764
8433 251764 195492 221085 195463 161335 89990 112420 140079 120264 169473 165898 116134 118194
8421 118194 145028 159051 133313 151051 158567 210524 219026 144557 121972 70106 -46899 -15612
8409 -15612 74998 58542 33798 170947 155224 94635 100836 54424 69423 99467 83729 97393
8397 97393 202390 251463 243651 290970 364902 300968 198583 132557 146670 68181 58112 102656
8385 102656 140506 133368 100258 189352 240401 119629 84496 170216 168947 129609 164194 142411
8373 142411 49551 66546 133855 214412 244941 221783 185949 138887 111066 159928 129361 125035
8361A25035K1811J22920M1295r2191j09497O67K164l8273j5586O4891L3671j0201
8349A46706J01026l5931o7999n211q998J7544J8199k9739P507j3779j3017O3816
8337A80124j039n5785L934J8489K990m4234J1487O871M2184k3943R332M55M6652
8324A97517n396m3947P591p4587M2077J10555K5480p9199o4560o4497K2574N5564
8312A29172M789N7671M6059j04844l8947p3097O8219K0031J0865M59m4705k451
8300G3221j6713l7269P2598j8325n9792j1582R869M2107M7097J7175k8689n5430
8288C4267J6328N6163K7398L6555L2044l2842o5837m2896l4411Q4923R1287p4762
8276A28217k4412l2248n494l047L4927M2075k4018K9135K635L7671m5470o4805
$$ plain form
8361 125035 146846 269766 311061 218870 109373 110040 112204 73931 58345 123236 156907 146706
8349 146706 247732 211801 143802 138591 129593 147137 165336 135597 143104 129325 116308 180124
8337 180124 179085 123300 127234 145723 148713 104479 115966 122837 165021 141078 150410 150865 197517
8324 197517 192121 148174 155765 81178 123255 233810 259290 180091 115531 51034 73608 129172
8312 129172 133961 191632 237691 132847 93900 20803 89022 109053 119918 120377 75672 73221
8300 73221 56508 19239 91837 73512 13720 2138 12007 54114 101211 118386 89697 34267
8288 34267 50595 106758 134156 170711 202755 169913 104076 61180 26769 111692 202979 128217
8276 128217 103805 71557 66063 63016 97943 140018 116000 145135 147770 185441 139971 75166
8264G5166o9103n2459l6005P1643J03388O3042Q131q536j9176j6318o6808J2187
8252F5152J37819O1092j8960j5859J1067m8924k6143n037p1075q5274K1130m6219
8240b1231r247O017N0975P7923M1205k6164R0501J06356R005o1017j56716q2117
8228B5490J02203L389J3299k0893J441J7717L4597o6308n4365m0428R0713J6018
8216A22873L676J4106J0154L1455k5624J2437J6525o361O3972k0482j14125j31252
8204b2646O40J5735j6756p394L2586K9960j8306K3255l2811J0812K0684L4731
8192G0490K182q0874j9471N9044M0570N6606M5485K8180M4393n1894q7732K4378
8180A31357J01244N5396K1312J8005P0924J09511J78143K54919K96723K27408
$$ plain form
8264 75166 6063 -46396 -82401 -10758 92630 155672 163803 155267 136091 119773 52965 65152
8252 65152 202971 264063 245103 229244 240311 191387 165244 160207 89132 3858 24988 -21231
8240 -21231 -30478 -24461 26514 104437 145642 119478 209979 316335 325340 264323 107607 25490
8228 25490 127693 131082 144381 123488 124929 142646 177243 110935 56570 16142 106855 122873
8216 122873 126549 140655 150809 182264 156640 169077 185602 179241 243213 222731 108606 -22646
8204 -22646 -22006 -6271 -23027 -30421 2165 32125 13819 37074 4263 15075 35759 70490
8192 70490 72672 -8202 -27673 31371 71941 128547 174032 202212 246605 194711 106979 131357
8180 131357 232601 287997 309309 327314 398238 507749 685892 940811 1237534 1464942
8170A464942j10536k25618k45233k85585j40395p7722l3828n0339Q350l0265q5208
8159A88563j49758K6705O8405l5464l273O4982M0140J0664k2972k1400m4870n166
8147A16556k9775L8093J986O7367J7891p1130L0662L2690K3215j5096M6835J3693
8135B72987J6796L1934J09827J98318J88761K33704J96843M2783j56553k35416
8125H99984k46074j68529j18355j20045m9270k132j8365o6212l4293K1868r663
8114H8914L534N3406J5315k2036k7555N4772M7688p8003p7338r3614k935M5982
8102H130l3802L3286O0831k4282J23730O4072l0196m1407l0439k200J6701J6882
8090A61306m0540J4210M2161n1793q1220m6835K9725L5495j760o4104j4770J00030
$$ plain form
8170 1464942 1354406 1128788 883555 597970 457575 379853 346025 295686 304036 273771 188563
8159 188563 38805 65510 133915 98451 95178 160160 200300 210964 187992 166592 121722 116556
8147 116556 86781 124874 126860 194227 212118 140988 171650 204340 227555 212459 259294 272987
8135 272987 289783 321717 431544 629862 818623 1052327 1249170 1291953 1135400 899984
8125 899984 653910 485381 367026 246981 197711 195579 177214 111002 76709 98577 88914
8114 88914 92448 145854 161169 139133 111578 166350 214038 136035 58697 -34917 -37852 8130
8102 8130 -25672 7614 68445 44163 167893 231965 201769 160362 129923 127723 144424 161306
8090 161306 120766 134976 177137 125344 44124 -2711 27014 62509 60749 -3355 -18125 81905
8078H1905O3430o5039l2151K543o185j2833p5947q685Q3367K9905j610P0601p3755
8065E5546k9965m4887k7382M0290K894m4257o1709P2808L8715L4080M4569J7691
8053I8393O934j4551M9252K2277L0471l8835k0565k2175j5018l4453o1789P0041
8041F9982Q5458K4423k6682n1286J2004N1927p694K3809L9607N6094k3909m6961
8029B06772m7259m5719J6059n2230m3375n107J31248M8560J15986j0268k3626
8018B91041M5750m5677m4725L962k7080M5903L4336N3462O5673l3031n0551j5559
8006C23504M348m7114o3103K7273P3023K8388l3970j15112n0097m1323J2797P7579
7994A96193M5136O4745Q5104K087N25m4219n6211Q5497Q5571P3238J05187M0963
$$ plain form
8078 81905 145335 80296 48145 50688 44503 31670 -44277 -52962 30405 60310 58700 129301 55546
8065 55546 25581 -19306 -46688 -6398 -3504 -47761 -109470 -36662 2053 36133 80702 98393
8053 98393 105327 90776 140028 162305 192776 153941 133376 111201 96183 61730 -59 69982
8041 69982 155440 179863 153181 101895 113899 165826 158132 181941 221548 277642 253733 206772
8029 206772 159513 113794 129853 77623 34248 29141 160389 208949 324935 314667 291041
8018 291041 336791 291114 246389 250351 223271 269174 303510 356972 422645 389614 339063 323504
8006 323504 327852 280738 217635 244908 317931 346319 312349 197237 147140 105817 118614 196193
7994 196193 241329 306074 391178 393265 393790 349571 293360 378857 464428 537666 642853 683816
7982F83816J12591K47819J47651o3719j15238j85102k30904j24494j09109j00861
7972B62450N8623O8906J642l0643J4093L0335k830j9722J4862O0577K1199O2187
7960E41679K9728l5831m4219n7732R4746Q0892R1321K00538J88717L76717O46579
7949B113135J086101J793451K793773M090459L550348M01877k682507l738800
7941I407837l024410j901599j050048o20574m86858k95222k98780k27404j77867
7932A325075j12676j15159q2103j07663r8189p2522p8710q475j3108j8489K2353
7921F40334l6174m1158k5145k4197K7841K3088L1378M9867L9141J11091R0250
7910H86316J45359K36691M99768Q38549J496701K430764L568916L537920J077819
$$ plain form
7982 683816 796407 1044226 1191877 1128158 1012920 827818 596914 472420 363311 262450
7972 262450 321073 389979 391621 360978 375071 405406 402576 382854 397716 458293 479492 541679
7960 541679 571407 535576 491357 433625 528371 609263 700584 901122 1089839 1466556 2113135
7949 2113135 3199236 4992687 7786460 11876919 15427267 15829144 13146637 9407837
7941 9407837 6383427 4481828 3431780 2811206 2324348 2029126 1730346 1502942 1325075
7932 1325075 1212399 1097240 1015137 907474 809285 736763 658053 649578 636470 617981 640334
7921 640334 604160 563002 537857 513660 541501 564589 595967 645834 684975 796066 886316
7910 886316 1031675 1268366 1768134 2606683 4103384 6534148 10103064 13640984 14718803
7901A4718803j866323l369852l194601k067745j214349q20139n80005l18579j91836
7892A095374j63363j51074j933Q8278l7313n3645j7521q5003j69327j37066n3195
7881C14212n3971K7471Q1843j8225n3151o0116k4093O346k0437L288j6425n0561
7869A36181p2900J614J6438Q859j0907M0912r441J1843l9631O2468O6078L2999
7857B44513o0737n9145J7749n4676p0627L1136N9206J0035r840k7708o952J0459
7845H3413M15o363N9649k7197p6396n198L6240L5547L7390o2213n5019o1101J9331
7832b1502K1539j1398K4815Q0912M3228j15046J8881R6126K5413j9541l8999r639
7820I4789M6556J7721k3557M9121o468o3041o9693j9479p0262J9638J5393l391
$$ plain form
7901 14718803 12852480 9482628 6288027 4220282 3005933 2185794 1605789 1287210 1095374
7892 1095374 932011 780937 779004 867282 829969 776324 758803 673800 504473 367407 314212
7881 314212 260241 287712 369555 351330 298179 238063 213970 220316 199879 203167 186742 136181
7869 136181 63281 64895 81333 90192 79285 120197 110756 122599 82968 145436 211514 244513
7857 244513 183776 124631 142380 87704 17077 48213 107419 117454 107614 79906 72954 83413
7845 83413 83828 77465 137114 109917 33521 28323 64563 100110 137500 75287 20268 -40833 -21502
7832 -21502 37 -11361 13454 94366 137594 22548 41429 137555 162968 143427 104428 94789
7820 94789 141345 159066 135509 184630 178162 115121 45428 25949 -44313 -24675 -9282 -12673
7808a2673L5940J4752L0011P8372N8110n632p2341j18511j3866J8897J9113k2502
7796I670j4133L9345J5132r713j13347J9620N1354K931N9654K3207L0679M7126
7784A61525J0308l8885o8834p505l371P3506L9730p7375j4322L9222nR382L8102
7771A61478j0553n2967j28271k3709Q2194Q7745j1718n5405l5126o397J8927J0284
7759C6482J03432P6271j5040j3187n251n9543j10675L947l9087M2987N2532l4546
7747C8322L1147o073n6589M6563K9691p6821O2826O8336J651l689q1373o673L4283
7734H1601l4728p905J6277m5712j2900J5343k2823N8363m9392k4295L3110K4500
7722C1439j505k9546k5572L1047n2531O2533M4505j6721k4327N2213j1215l9701
$$ plain form
7808 -12673 23267 38019 68030 146402 204512 198880 126539 8028 -5838 13059 32172 9670
7796 9670 -4463 34882 50014 40301 -73046 -53426 -2072 859 60513 83720 114399 161525
7784 161525 171833 132948 64114 56609 53238 126744 166474 89099 74777 113999 113994 123376 161478
7771 161478 150925 97958 -30313 -54022 28172 115917 104199 48794 13668 7271 26198 36482
7759 36482 139914 216185 201145 187958 182707 123164 12489 16436 -22651 20336 72868 38322
7747 38322 69469 63396 6807 53370 83061 6240 69066 137402 139053 135364 53991 47318 81601
7734 81601 46873 38968 55245 9533 -3367 11976 -10847 47516 -1876 -26171 6939 31439
7722 31439 29934 388 -25184 5863 -46668 15865 60370 43649 19322 71535 60320 20619
7710B0619K9731R217m7668J1080N520r458L4910l5916M8255j1470O893L067l5649
7697B9131o7591O6509J3627J9478K7214J6819m2108K3669O6219O570l5908k3701
7685I9928m0007n6400n0383N9076R4070j7109n9377m748M3473P3772J3102p0068
7673H5329m5550j6718m027J356n2421k1230M8354J6037j4237L6138p3391N153
7661c5207k9607m2878j7377j1605L6307J12603J7487O5214M1598O3035K9519k7755
7649B01334j05288L0752k9315n6275q263j733q749k1736k8866Q7921N5915J9359
7637A35056r2733j01404J2572M7670n451N3393m6318J2072L1104m2286k5698M8156
7625B6133O7117p6489L7605J375n5521q170l2883J5838q706J2381j4802k0140
$$ plain form
7710 20619 50350 59567 11899 22979 28499 19041 53951 18035 66290 54820 61713 64780 29131
7697 29131 -38460 28049 41676 61154 88368 105187 63079 86748 152967 159537 123629 99928
7685 99928 59921 3521 -46862 12214 106284 89175 29798 25050 68523 142295 155397 85329
7673 85329 39779 23061 19034 20390 -32031 -53261 -4907 11130 -3107 33031 -40360 -35207
7661 -35207 -64814 -107692 -125069 -136674 -100367 12236 29723 94937 136535 199570 229089 201334
7649 201334 96046 126798 97483 41208 32945 31212 22463 727 -28139 59782 115697 135056
7637 135056 42323 -59081 -46509 1161 -4290 49103 2785 14857 45961 3675 -22023 26133
7625 26133 93250 16761 54366 55741 220 -7950 -40833 -24995 -33701 -21320 -36122 -56262
7613e6262L9898J5164M0041N2860K7952L0413o2148q1039k5530J1899q5059K5225
7601f6586J01921m0183p2667P296O2019K6124K045k9140M798L3270k9574l0619
7589c1296P5888Q2563O5556p8732n9943L908m4015J8446q424r5135n0124M9819
7577g1489o052n879J6796J9962K1144J27278K9520n4121k7260k9432r3702j7256
7565i0491Q1933L2875N5167j1777q87L4728o0994o948K9276M2727k5471O435o0721
7552B5852l8189j0071k4194J8164k1277J2864M9886k4453J4674L2659j4203m5352
7540b3640k0027r5831k4962P1292J05951M3806K8499l5455l9579n1557n8730m0804
7528a41037O1225J01684j5493n0329o981K3453N6261J4486o255O4178N7255K9743
$$ plain form
7613 -56262 -16364 -1200 38841 91701 119653 150066 87918 6879 -18651 -6752 -91811 -66586
7601 -66586 35335 -4848 -77515 -70219 -8200 17924 19969 -9171 -4373 28897 -677 -31296
7589 -31296 44592 127155 192711 113979 54036 57944 13929 32375 23951 -71184 -121308 -71489
7577 -71489 -77541 -83420 -66624 -46662 -25518 101760 131280 77159 49899 20467 -73235 -90491
7565 -90491 -8558 24317 79484 67707 66820 101548 40554 33606 62882 105609 80138 86573 25852
7552 25852 -12337 -22408 -46602 -28438 -49715 -36851 13035 -11418 3256 35915 21712 -23640
7540 -23640 -43667 -139498 -164460 -93168 12783 56589 85088 49633 10054 -41503 -100233 -141037
7528 -141037 -79812 21872 6379 -43950 -50931 -27478 28783 43269 37014 101192 158447 188190
7516A88190j7575r0421l0826J510o1931p441K0252M9994L7422j4952J2717M1769
7504A28708l5525M330j6896J1352K997O009O660j15523k8995k3013O1205J2908
7492A4217k7314M9186m0417r256L7446l9037r246k1118P0292J7515m0402k8338
7480b6472M8643k0658l918m3511l8319n2633L3053J19953M8131r2018L6959l3331
7468b4121r3954M124L7591M2132K5824K9032L59k2917N1195L8709K2300m9015
7456F1259R008L9373m38n8819m8199M1087K8486l0442n2830m3634K3696M9250
7444A7797q3640k6699L4249r2907K5450R8923P9065M3371l1992J4456p5881k5423
7432b3231Q5544n1563p2564O0127m714N5791J2194K306M5123O696j16349j13715
$$ plain form
7516 188190 170615 80194 49368 50878 -11053 -18494 1758 51752 89174 74222 86939 128708
7504 128708 93183 97513 80617 91969 94966 100975 107635 -7888 -36883 -59896 1309 14217
7492 14217 -13097 36089 -4328 -13584 23862 -15175 -24421 -45539 24753 42268 1866 -26472
7480 -26472 22171 1513 -2405 -45916 -84235 -136868 -103815 16138 64269 -27749 9210 -24121
7468 -24121 -118075 -113951 -76360 -34228 -8404 20628 20987 -1930 49265 87974 110274 61259
7456 61259 70267 109640 109202 50383 2184 43271 71757 41315 -11515 -55149 -31453 17797
7444 17797 -65843 -92542 -58293 -151200 -125750 -26827 52238 95609 63617 78073 2192 -23231
7432 -23231 62313 10750 -61814 -1687 -6401 49390 61584 63890 109013 115709 -640 -114355
7420a14355N9524J20635K1161K516j2893J3821j04334P320L2631P902m6092M6242
7408C4078K1798k3702K0219J7259p6216j173N7173N7021q8272M929L8619j03472
7396d1739j2371P9828K3490m4912K6182L725M8556N0204m7098l5246n6572l3544
7384c9497k9861K4223m9883l9779J4821M7097J3151o948m6377L4807q330J4382
7372g2194R6434P4302R0938O049m3346n6237n126p2335m5432m008j6317R3818
7360D6546O963k2291j4545k3819p7565r020O3610M6925P0001N7435k1722j3527
7348A08991j7228q2686m8733M5295M8245p848L8454K756j1929l1082K1532j1345
7336E4422l3954j0825L6506k0092k272N090R5317Q047p2748l4501J0098L5753
$$ plain form
7420 -114355 -54831 65804 86965 89481 76588 90409 -13925 -6605 26026 33928 -12164 34078
7408 34078 55876 32174 52393 69652 -6564 -7737 49436 106457 18185 23114 61733 -41739
7396 -41739 -54110 25718 49208 4296 30478 34203 82759 132963 85865 50619 -5953 -39497
7384 -39497 -69358 -45135 -95018 -134797 -119976 -72879 -59728 -66676 -113053 -78246 -86576 -72194
7372 -72194 24240 98542 189480 195529 152183 95946 90820 18485 -26947 -30955 -47272 46546
7360 46546 53509 31218 16673 -7146 -84711 -93731 -30121 16804 86805 144240 122518 108991
7348 108991 91763 9077 -39656 5639 53884 46036 84490 87246 75317 44235 65767 54422
7336 54422 20468 9643 46149 26057 23785 28875 124192 132239 59491 24990 35088 70841
7324G0841q5056m8781R913M3150K9747K3775R414j721j8924m916k8155l909O6724
7311F2102M4073q072q5396l963N8737o495j1975p7209o7429K9481K0855j20365
7299a65656K2512l6787M38J10435R0099N0365j5852j4674l0200o938m3812j8869
7287e8939N0922n7536p7423j9142K3529N0889k3039m7192l0219Q3495N0952K0344
7275c3359r555l7405N2276J08807l7719m0603K4113J1350r2590q4143J5312j926
7263a25442M7687M4494J00263L9199o6067J7955k4491m7895J5427k9669m3452
7252g1991Q798k996k1132j9221p0865L5011J2982L2731M220J8424K2058L2329
7240a9652O5595L3173q2803l3497N2202L0246r6008L263K5277L0453L1180j0159
$$ plain form
7324 70841 -14215 -62996 -53083 -9933 19814 43589 53003 51282 32358 27442 -713 -4622 62102
7311 62102 106175 98103 12707 8744 67481 60986 49011 -28198 -95627 -66146 -45291 -165656
7299 -165656 -143144 -179931 -179493 -69058 21041 71406 55554 40880 10680 3742 -40070 -58939
7287 -58939 -8017 -65553 -142976 -162118 -138589 -87700 -110739 -157931 -188150 -104655 -53703 -33359
7275 -33359 -42914 -80319 -28043 80764 43045 2442 26555 37905 -54685 -138828 -123516 -125442
7263 -125442 -77755 -33261 67002 106201 40134 58089 33598 -14297 1130 -28539 -71991
7252 -71991 -63193 -66189 -87321 -106542 -177407 -142396 -129414 -96683 -92463 -74039 -51981 -19652
7240 -19652 45943 79116 -3687 -37184 15018 45264 -50744 -47481 -22204 8249 39429 29270
7228B9270r0169l2423l9547R107P2329l7045L910N8224j8543J0094J32665K2203
7216A20075n9027m6044o9100M4860P4183k9402p0274q0049k1455M7312K5392o425
7204f9954o1516l3609K7392N2355J2672j5391qK4675L3753M5635o396L4553n513
7191C8648K0124j8814r1630J1693R2572l1499m4906K1504J1820j0035P347M7639
7179E4463J9745m0432q118p285q5291k0208K4965j8430l2221j9665L6613O1832
7167c4032Q667K0488l7078J84L0356l7972m1571J1960M2223l5234l4721k4649
7155a31379n510P689L8378J8523p893J0338l7359o318K7406M5910M0862l3102
7143c2455jJ409L9351m2727L2103q003l5040J35226L4498q0586m0308n385l499
$$ plain form
7228 29270 -60899 -93322 -132869 -123762 -51433 -88478 -84568 -26344 -44887 -34793 97872 120075
7216 120075 61048 15004 -54096 -9236 64947 35545 -34729 -114778 -136233 -88921 -63529 -69954
7204 -69954 -131470 -165079 -137687 -85332 -72660 -88051 -88059 -63384 -29631 16004 9608 44161 38648
7191 38648 58772 39958 -51672 -39979 52593 21094 -23812 -2308 9512 -523 6824 54463
7179 54463 74208 33776 25658 18373 -66918 -87126 -62161 -80591 -112812 -132477 -95864 -34032
7167 -34032 -25365 -4877 -41955 -41771 -11415 -49387 -90958 -78998 -36775 -72009 -106730 -131379
7155 -131379 -136889 -129200 -90822 -72299 -80192 -69854 -107213 -113531 -86125 -40215 647 -32455
7143 -32455 -32456 -31047 8304 -34423 -2320 -10323 -45363 89863 124361 43775 3467 -1918 -5417
7130e417m4199k6610L336j7477K3474L8429K3697j3473j4509O1846n1149n1861
7118g3913L4849K0166m3749j3374R951m6659m4331N8037P0437j8115R107j3283
7106e0877o3876K4126L8270m504P474j8047l9483l4777j3323L0175N5234j7887
7094h7495J4937K0744O1578l8693m6969l4797O9581N0246j24367r0697M6647L2263
7082a27022N6089k5551k1997k114J1206J5081K9143q634j258n9234j2186k3292
7070a69769n4755m1096R148L0646J20688R4585O2393O682r7735j0151L3517L0744
7058A4897l8004O1505N8659k290p7216j4699M5571j3648k1206L7094m9034k1457
7046a9828J8073R2574R854q2011m4786K3478K6085Q1000j8738n1399j8792n5728
$$ plain form
7130 -5417 -49616 -76226 -72890 -90367 -66893 -28464 -4767 -18240 -32749 29097 -22052 -73913
7118 -73913 -39064 -18898 -62647 -76021 -66070 -112729 -157060 -99023 -28586 -46701 -37594 -50877
7106 -50877 -114753 -90627 -52357 -56861 -49387 -67434 -106917 -141694 -155017 -124842 -69608 -87495
7094 -87495 -72558 -51814 9764 -28929 -75898 -110695 -41114 9132 -115235 -205932 -159285 -127022
7082 -127022 -70933 -96484 -118481 -120595 -109389 -94308 -65165 -73799 -75057 -134291 -146477 -169769
7070 -169769 -224524 -265620 -256472 -225826 -105138 -10553 51840 58522 -39213 -49364 -15847 14897
7058 14897 -23107 38398 97057 94767 17551 2852 48423 34775 13569 50663 1629 -19828
7046 -19828 -1755 90819 100673 18662 -26124 -2646 23439 104439 85701 34302 15510 -40218
7034d0218p5853n1253O8350M6738m508J1713j6584P1747O7338m7253m0356K5291
7022A5152J1898m3374M4647J3141o7731m3545j2708L3457k3404O464j592j884
7010f9479N7507O7758M8978M115k5548p3793l5383k4143N496m2459p0048j9831
6998a76830n231K4667J4473k3832l0458k0845L7797J03686O1903J3285k6799j9395
6986d7579J5993o068O0608J2648L1386l3198n0641k1469k2521L331K7570P76k7258
6973e6422j09325J970R1395L9783N8028O7301l1632j8550K8305m7491j14426k789
6961i3853M2216K6418j0079r062M9318N1772r765l0159K760J7042j800O1257K2677
6948A18742j13398o6671R8956r268j03644l3111l4348l7931L1964N1264K7280
$$ plain form
7034 -40218 -116071 -167324 -98974 -52236 -56744 -45031 -61615 10132 77470 30217 -10139 15152
7022 15152 27050 -16324 28323 41464 -26267 -69812 -82520 -49063 -72467 -66003 -67595 -69479
7010 -69479 -11972 55786 104764 108879 83331 9538 -25845 -49988 -44492 -86951 -156999 -176830
6998 -176830 -182061 -157394 -142921 -166753 -197211 -218056 -180259 -76573 -14670 -1385 -28184 -47579
6986 -47579 -31586 -37654 22954 35602 66988 33790 -16851 -38320 -60841 -57510 -29940 -29164 -56422
6973 -56422 -165747 -163777 -72382 -32599 25429 92730 61098 42548 70853 23362 -91064 -93853
6961 -93853 -51637 -25219 -35298 -44360 4958 56730 46965 16806 19566 36608 34808 96065 118742
6948 118742 5344 -61327 37629 28361 -75283 -108394 -142742 -180673 -148709 -97445 -70165
6937g0165L591L0737j3431n3942O699O8108J2826O4592N22j9960o7939O1305N8904
6924H1847j8486K0025o1212k1205l1898o6827J7199J5048P382K1987K4133m1090
6912e3097k607M6207K8J0492J03523q937j2546j016k4360l1013K4412m134q2052
6899c5100j0539K2021p0875L0027L5475n783N661j0220M9714L3859k9308q0160
6887f5228k5495J5697Q036j7285K6546K8661K9678O688k5694M725k2076n4839
6875i0586O2919M8318q014l4171p2254L7370N7506O5084q9268k8707M1011r1323
6863a02115j8835K8775J07871j2915p651O1641M7127m3643p3193k3666J660Q215
6851b6729k8607l9000l5205M0996O022p2006k7111P7769O1870j2216l9843k1994
$$ plain form
6937 -70165 -66574 -35837 -49268 -103210 -96511 -28403 -15577 49015 49537 29577 -38362 22943 81847
6924 81847 63361 83386 22174 969 -30929 -97756 -80557 -65509 -58127 -36140 -12007 -53097
6912 -53097 -55704 -9497 -9469 1023 104546 95609 83063 82047 57687 26674 51086 46952 -35100
6899 -35100 -45639 -23618 -94493 -64466 -28991 -34774 -29113 -39333 10381 44240 14932 -65228
6887 -65228 -90723 -75026 -66990 -84275 -57729 -29068 610 7298 -18396 -13671 -35747 -90586
6875 -90586 -27667 20651 12637 -21534 -93788 -56418 1088 66172 -23096 -51803 -10792 -102115
6863 -102115 -120950 -92175 15696 2781 -4870 56771 103898 60255 -12938 -36604 -34944 -26729
6851 -26729 -55336 -94336 -129541 -88545 -82523 -154529 -181640 -103871 -42001 -54217 -94060 -116054
6839a16054N9323O4631p3674k0647p416m8633j1436K2023K1535l74m2028n4688
6827b07438K2630m4021R4650L6972J8522P3739n2061l1534n8460J2989L6447k542
6815a00107J4072O7528N949J9779l4250k3588J7507n5766o7175J6667J11868L9109
6803A1593K8121N4533l0504j01890j08578J8774J10848j2097L9898n624j7452
6792a2378J0656L0542L8552m3013k3715R396k9335n3572q0208n485k4584L7566
6780a45578n1407m2703N1785L8972L0100k0005Q416k3598K0270M9398N1025r517
6768d2842N0739l558m1345j09670L8652O9768o855j2190l0758j1791L6345l0756
6756i4261j7211o2096K601K2541R914k9974J8237N2884J00247K7571k6714l605
$$ plain form
6839 -116054 -56731 7900 -65774 -86421 -93837 -142470 -153906 -131883 -110348 -110722 -152750 -207438
6827 -207438 -184808 -228829 -134179 -97207 -78685 -4946 -57007 -88541 -147001 -134012 -97565 -100107
6815 -100107 -86035 -18507 -12558 7221 -27029 -50617 -33110 -88876 -156051 -139384 -27516 11593
6803 11593 39714 94247 63743 -38147 -146725 -127951 -17103 -29200 10698 5074 -12378
6792 -12378 -1722 28820 67372 24359 644 10040 -19295 -72867 -153075 -158560 -183144 -145578
6780 -145578 -196985 -239688 -187903 -148931 -118831 -138836 -130420 -154018 -133748 -84350 -33325 -42842
6768 -42842 7897 4339 -37006 -146676 -108024 -38256 -45111 -57301 -88059 -99850 -63505 -94261
6756 -94261 -111472 -173568 -170967 -148426 -138512 -168486 -150249 -97365 2882 30453 3739 134
6744A34k6826p5959l4674K4545N0699Q3504m2558j3997M5098o285j4440p2907
6732h3666m9753O0834O6289l3542r2018L8467J26458O1161q2429o4752n1334K2283
6720h2002R526L8303J7785N1853J0261n2626o7357j6677m2876Q339O4630P1745
6708A0904L1182M0404N3251K4110j15398j3267m9628K8307m4352n538j4405j2263
6696f6693k7164j1932j4519L1795R0415N8788k5362j0475J8904k9957M036j6963
6684H73N328n1446j4458K8396l2495o7989n6334r997l2807N1898R0887J28467
6672D0323N8519M9726j0888o6106l1873O783o9672j35873k9396M5600R0265O6374
6660A3782j7849p1339N5571K1206l5697O988J730o1190l8998l4029n325Q6170
$$ plain form
6744 134 -26692 -102651 -137325 -112780 -62081 21423 -21135 -35132 9966 3681 -10759 -83666
6732 -83666 -133419 -72585 -6296 -39838 -131856 -93389 33069 94230 11801 -52951 -104285 -82002
6720 -82002 -72476 -34173 -16388 35465 45726 -6900 -74257 -90934 -133810 -125471 -60841 10904
6708 10904 42086 82490 135741 159851 44453 31186 -18442 9865 -34487 -40025 -54430 -66693
6696 -66693 -93857 -105789 -120308 -88513 1902 60690 35328 24853 43757 13800 17836 873
6684 873 6201 -45245 -59703 -31307 -63802 -131791 -188125 -198122 -230929 -179031 -88144 40323
6672 40323 98842 148568 137680 71574 39701 46484 -23188 -159061 -188457 -142857 -52592 13782
6660 13782 -4067 -75406 -19835 1371 -34326 -27338 -25608 -86798 -125796 -159825 -165150 -78980
6648g8980J79176N3430q3610p3621K9507m6512m8431J5644j416m9712p1996M6368
6636a30153O6245j3284J597K6927K7973l7573l4750J0972m5972J6842L8468O7449
6624e259q1725j1279Q4635M5064K0697l3089K4081o3633m9335N4839J08479o4681
6612B8794p7582q156K119J05138M7592l6110q9091l7824O85m897J4105k5240k8972
6599a09439q176O0063K5370m4626j1141R6548N5191m1960m2315j9863N8032Q5831
6587A03515n6689q8058o8650j5616O254N8963l0626J8960p702j2048j6919J549
6575a07067K7531J5998M1124p022j4453l927P7989j9239m5548l4786p6338p0992
6563b16730L9387P6398P9215L0609k2586n2796M5204N3639K7910r9784p7264k6869
$$ plain form
6648 -78980 100196 153626 70016 -3605 25902 -20610 -69041 -53397 -54813 -104525 -176521 -130153
6636 -130153 -63908 -77192 -75595 -48668 -20695 -58268 -93018 -82046 -128018 -111176 -72708 -5259
6624 -5259 -86984 -98263 -13628 31436 52133 19044 43125 -20508 -69843 -15004 93475 28794
6612 28794 -48788 -56944 -54825 50313 97905 61795 -27296 -65120 -64435 -69332 -55227 -80467 -109439
6599 -109439 -117615 -57552 -32182 -76808 -87949 8599 63790 21830 -20485 -40348 17684 103515
6587 103515 46826 -41232 -109882 -125498 -119244 -60281 -90907 -71947 -79649 -91697 -108616 -107067
6575 -107067 -79536 -63538 -22414 -29436 -43889 -47816 30173 10934 -34614 -69400 -145738 -216730
6563 -216730 -177343 -100945 -21730 8879 -13707 -66503 -21299 32340 60250 -39534 -116798 -143667
6551a43667N6757L9061P334N0164j8102m2576l9925q928O5355l183K4715M1645
6539B8650L1903m3600j8039k080Q34N1227m9459K4919j1545l2636j6658k4286
6527f0770L9023O6535O328l0530q1434Q161L830M7321J3769M2394J3762l4680
6515C3709m1070L460n2730J7117j3158o5331M2048K1937L1585N62N908n1338O266
6502f1035l69M0218p256l1111r060M9638K7544j9707m5744J0167j889o8715m0638
6489a57957J15024J9583K0177J07686L5382j11768j31791j4436M1049J4004O8897
6478E850n3277k6323N855J30947k4839o5103l1939K9472R778q5728o7448J8930
6466a53825R4794M3756O4891r940m7456Q767N578o8771N6702r415j06341M227
$$ plain form
6551 -143667 -86910 -47849 -40515 9649 -8453 -51029 -90954 -99882 -34527 -37710 -12995 28650
6539 28650 60553 16953 -1086 -3166 -2332 48895 -564 24355 12810 -19826 -36484 -60770
6527 -60770 -21747 44788 51116 20586 -60848 -52687 -48857 -1536 12233 54627 68389 33709
6515 33709 -7361 -3901 -56631 -39514 -52672 -118003 -75955 -54018 -22433 -21871 -15963 -67301 -61035
6502 -61035 -61404 -21186 -28442 -59553 -68613 -18975 8569 -11138 -56882 -46715 -48604 -117319 -157957
6489 -157957 -42933 -23350 -3173 104513 139895 28127 -103664 -118100 -77051 -63047 5850
6478 5850 -47427 -73750 -67895 63052 38213 -26890 -58829 -29357 -19579 -105307 -172755 -153825
6466 -153825 -59031 -15275 49616 39676 -7780 987 6565 -62206 -5504 -14919 -121260 -117033
6454a17033J36413l3022n0245K1194k4641l1432J2926P8081O3054N1860l9052
6443F8103n5776J496q3038l5165J3290o04L6134L7327k4411l6297k0320r596N4548
6430e4309j3233N9477N265L8047j8807l6814m1288M084O9023L4259k8158j2884
6418D662M5086j2539o5935K491J2486l8032k4561n2239n6997J9752J19486R5749
6406D9409p1505p0673n4410L173J0167r95M3586L2207J8530R077N7914P417k9363
6393D534n4878n1190N2575K6965L2052m803m5494j9806l753o4083r469j581L021
6380a35910O4743O2618M2048K4609q3849r6696l2192l571N4501L2541K5980K830
6368d2348j3829k1112k8415m4776Q272O9138K4631O9187l0651k4143J0427J4140
$$ plain form
6454 -117033 19380 -13642 -63887 -42693 -67334 -98766 -85840 -7759 55295 107155 68103
6443 68103 12327 13823 -69215 -104380 -91090 -91694 -55560 -18233 -42644 -78941 -99261 -108857 -54309
6430 -54309 -67542 -8065 -2800 35247 16440 -20374 -61662 -57578 11445 45704 17546 4662
6418 4662 49748 37209 -28726 -26235 -13749 -51781 -76342 -128581 -185578 -165826 -46340 49409
6406 49409 -22096 -92769 -147179 -144006 -133839 -134834 -91248 -59041 -40511 -31434 26480 33897 4534
6393 4534 -50344 -101534 -48959 -21994 10058 5255 -40239 -60045 -63798 -127881 -137350 -138931 -135910
6380 -135910 -71167 -8549 33499 58108 -25741 -122437 -154629 -158200 -103699 -71158 -45178 -42348
6368 -42348 -56177 -77289 -105704 -150480 -142208 -73070 -48439 20748 -9903 -34046 -23619 -9479
6356i479n1122l3023M3615m5597J5255K0574K9098M5987k8089p702l3077J5518
6344c8042l3844m7823K750P99j2166j0341j974J7422K5461L3600k699m1749k9038
6331a37644N1507n762O880M7536Q0216J3238n7004J4881Q0136J1855k8356M8493
6319A25976L3842l4851K7266k5750m2884n9617J6852K3732n753k2209j7287l8912
6307a9595j5234j6804p196L1325n3769n891Q2008J1245n7823r5709k0767l681
6295a71891M4886M6341o7202k6364N5148J4383O0344r0195q2587j9246J7737O5405
6283a53241O2861J1363J5172o6317k5497L227l6618l2637L797K0423R4227R9967
6271c273J0540l2944L9539J4185o0021j2818n0385J05420N4739N7120r7545N519
$$ plain form
6356 -9479 -60601 -93624 -50009 -95606 -80351 -59777 -30679 15308 -12781 -20483 -53560 -38042
6344 -38042 -71886 -119709 -116959 -116160 -128326 -138667 -140641 -123219 -97758 -64158 -66857 -108606 -137644
6331 -137644 -86137 -91899 -85019 -37483 42733 55971 -1033 13848 93984 105839 77483 125976
6319 125976 159818 124967 152233 126483 83599 23982 40834 64566 58813 36604 19317 -19595
6307 -19595 -34829 -51633 -58829 -27504 -81273 -87164 -5156 6089 -51734 -147443 -168210 -171891
6295 -171891 -127005 -80664 -147866 -174230 -119082 -104699 -44355 -134550 -217137 -236383 -218646 -153241
6283 -153241 -90380 -79017 -63845 -130162 -155659 -152432 -189050 -221687 -217890 -197467 -103240 -3273
6271 -3273 7267 -25677 13862 28047 -31974 -44792 -95177 10243 64982 122102 24557 30076
6259C0076j5195j9034l0925N5384R754l5593K8606N287k9545L0166O036l0452
6247D565O91l3066q484M9808k9586j1843J7853K8394k5142j13286j1235Q6323
6235d5008K1997P6207r739k4618n1695N314O053k0852j078L9644l1897m6304L7224
6222d4752k0381j751m7447k5365J07826N8516l473r7915l5339l3552k7280L9874
6210a31039O191j6922L7657M1219n762J4028p1981o230k531K4291O2137J8056
6198c0886J7122j9311O290P1116K9760l6535l8915r215m1231L1158Q7918K9299
6186I6570k8588p3750r939l6947m6249P4299K1247N058N3984m9386n9504k9622
6174h2827k3490Q2036N6897J7471j3701j04553O6862P1042p8787j7927L9895n1973
$$ plain form
6259 30076 14881 -4153 -35078 20306 30060 -5533 23073 28360 -1185 28981 35017 4565
6247 4565 5256 -27810 -36294 13514 -16072 -27915 -10062 18332 -6810 -120096 -131331 -45008
6235 -45008 -23011 53196 43457 18839 -32856 -27542 -21489 -42341 -43419 -3775 -35672 -81976 -44752
6222 -44752 -65133 -66884 -114331 -139696 -31870 26646 23173 -74742 -110081 -143633 -170913 -131039
6210 -131039 -124848 -141770 -104113 -62894 -68656 -54628 -126609 -132839 -135370 -111079 -48942 -30886
6198 -30886 -13764 -33075 -26785 44331 74091 37556 -1359 -10574 -51805 -20647 67271 96570
6186 96570 67982 -5768 -15707 -52654 -98903 -24604 -3357 1701 55685 6299 -53205 -82827
6174 -82827 -106317 -24281 32616 50087 36386 -68167 -1305 69737 -9050 -26977 12918 -39055
6162c9055l0921o5484P383m8338K5632Q1203J8640J0170K9919j4368r7092j15251
6150b37562J05268J34858k026m7669m5004L6447k398n5905J1510N945j3973n700
6138a16209N4934M8597n9035n1536j4403M9420O2480l2011p3927m0261L0826j7128
6126a58253J2404L0788p0634j4156L1349K3186N0950J1563L0952l8416k2890L3016
6114h0141l2560l4357M3589r734N8482Q1010P8821J0560l4681P3902m3769p9334
6102C1788j0161m2059o2515q7032J3944O4632M2497r840K1750K7211k4150p0258
6090a04193J5598L8974r7323k8158M3225K4219j7715J3304P2935r925o0834M9612
6078f0281j3586L4096L621m9190j5247N3247N9297p0428n6923m9586j2337m030
$$ plain form
6162 -39055 -69976 -135460 -128077 -176415 -150783 -69580 -50940 -40770 -10851 -25219 -122311 -237562
6150 -237562 -132294 2564 538 -47131 -92135 -55688 -58086 -113991 -102481 -96536 -110509 -116209
6138 -116209 -61275 -12678 -71713 -123249 -137652 -88232 -25752 -57763 -131690 -171951 -141125 -158253
6126 -158253 -145849 -115061 -185695 -199851 -168502 -145316 -94366 -82803 -51851 -90267 -113157 -80141
6114 -80141 -112701 -147058 -103469 -113203 -54721 26289 105110 115670 80989 154891 111122 31788
6102 31788 21627 -20432 -82947 -169979 -156035 -91403 -48906 -58746 -36996 -9785 -33935 -104193
6090 -104193 -88595 -49621 -146944 -175102 -131877 -107658 -125373 -112069 -39134 -49059 -109893 -60281
6078 -60281 -73867 -39771 -36150 -85340 -100587 -47340 11957 -58471 -115394 -164980 -177317 -181347
6066a81347K0441N6079P2802K7002j946o502L4885k0254m6144l0659P194j8018
6054h6467j3501L2445O8802l8752J8419K6454n1957n2443p931k9840k6985j8391
6042a80147l3859Q2031Q4483J0723o6258L21l3887k0337P956J5981k7236l109
6030a63338Q8163K1920K0770N281k4592l1087l0107N738K4132k9742M4210n1530
6018a20182J9046L7860q769N7544L2014n2752j7270r468Q640J2393O4115j6177
6006F994n5573m2367m0100L3481j505P635J7417k8297l1730Q0762l1638j47578
5994b32499M007K7321O2207P5493K4106K0069M7077J6109K307j7993K8668n9484
5982b612j08957j337L9439k4156j3078K1549n8433k2507R4147M1827j5026m6734
$$ plain form
6066 -181347 -160906 -104827 -32025 -5023 -6969 -13471 21414 1160 -44984 -75643 -68449 -86467
6054 -86467 -99968 -67523 1279 -37473 -19054 7400 -44557 -97000 -104931 -134771 -161756 -180147
6042 -180147 -214006 -131975 -47492 -36769 -103027 -102706 -136593 -156930 -148974 -132993 -160229 -163338
6030 -163338 -75175 -53255 -32485 -27204 -51796 -82883 -112990 -107252 -83120 -112862 -68652 -120182
6018 -120182 -101136 -63276 -72045 -14501 17513 -35239 -52509 -61977 -53337 -40944 23171 6994
6006 6994 -48579 -90946 -131046 -97565 -99070 -91435 -74018 -102315 -134045 -53283 -84921 -232499
5994 -232499 -228492 -201171 -138964 -63471 -39365 -19296 27781 43890 46197 28204 56872 -2612
5982 -2612 -111569 -112906 -73467 -97623 -110701 -89152 -147585 -170092 -75945 -34118 -49144 -95878
5970i5878k2827J5079J3427L0409k4903O3757N0297M6458r194M4952o584k6472
5958G8521K1758m997q4258q3713k9080l1865K6331K0256k8883n4379k9625K691
5946a97243M7296N1564j9180l1866Q0821P2882K5335m3983r7655k403k4153K1953
5934a16632O6788k1919P0324N7013j4576k6504Q996M5493l3382l2481m1641k9950
5922f8471l0929O4813l2998J1431j0820N400j2978J0991Q7297P3107o2138n1406
5910a6701j6147q642l9872L5523N8335N6726N9110j12313r9833q3064k0672L51
5898a87199m3522N392O4190R0458n553o4943K8634O2194P8883L2242J8344O9953
5886A49073R2806p7767j79608q4751M9875J920R4654J2460l0700P4639j373j16136
$$ plain form
5970 -95878 -118705 -103626 -90199 -59790 -84693 -20936 29361 75819 66625 111577 104993 78521
5958 78521 100279 95282 11024 -72689 -101769 -133634 -107303 -87047 -115930 -170309 -199934 -197243
5946 -197243 -149947 -98383 -117563 -149429 -68608 4274 29609 -14374 -112029 -114432 -138585 -116632
5934 -116632 -49844 -71763 -1439 55574 40998 14494 23490 68983 35601 3120 -38521 -68471
5922 -68471 -99400 -34587 -67585 -56154 -66974 -61574 -74552 -63561 23736 96843 34705 -16701
5910 -16701 -32848 -41490 -81362 -45839 12496 69222 128332 16019 -83814 -166878 -187550 -187199
5898 -187199 -230721 -225329 -161139 -70681 -76234 -141177 -112543 -50349 28534 60776 79120 149073
5886 149073 241879 164112 -15496 -100247 -50372 -48452 46202 58662 27962 102601 101228 -14908
5874a4908m9187j9325l5907j0089P2647M4239j3162j9416K9116j720k7596J03584
5862E8276p64L8754r690m9650q6391j8419L9569M4299l4762k1418N6129m4226
5850b8293o6283L1546j006O1632j9051q3853o880J0809j8796R373K32n6489q850
5837a75909Q0422K6584J6584M8047j3616R279l3500m5170J1855P622N8836J8193
5825I227Q28p1416N0493P6696P832j30386r9773l5796K6736L3275J16288K4813
5813H817l8820m6579j2055m0640N2863M7367n6967o5954K427j2981J6545K4411
5801a21566P727j6502J02435K4440n0704L2822j3277j4550n860K7523J3561k8071
5789d2022m9186N5836J9205j21330m0351N0811M110k2847p3252J1261R4423J7912
$$ plain form
5874 -14908 -64095 -83420 -119327 -129416 -56769 -12530 -25692 -45108 -15992 -17712 -45308 58276
5862 58276 57512 96266 86576 36926 -49465 -67884 -28315 15984 -18778 -40196 15933 -28293
5850 -28293 -94576 -63030 -64036 -2404 -21455 -105308 -112188 -101379 -120175 -110802 -110570 -167059 -175909
5837 -175909 -95487 -68903 -52319 -4272 -17888 -8609 -42109 -87279 -75424 -67802 -8966 9227
5825 9227 10055 -61361 -10868 65828 73660 -56726 -156499 -192295 -165559 -132284 -15996 8817
5813 8817 -30003 -76582 -88637 -129277 -76414 -29047 -86014 -151968 -149541 -162522 -145977 -121566
5801 -121566 -113839 -130341 -27906 -3466 -54170 -21348 -34625 -49175 -55035 -27512 -13951 -42022
5789 -42022 -91208 -35372 -16167 -137497 -177848 -127037 -122927 -145774 -219026 -207765 -113342 -95430
5777i5430m3617K5541M5342K5894O7730j0949m1642K9486r2644n310k2921M8095
5765g0425N3748Q422l009k2468p5968Q5183m864K8773J467j00541m7358R515R8362
5752c9163Q926j0183k9448j3629M9778j1348p0454M996J9242k0928K857l9588
5740a48942Q6298N5418N5135L8197N8233p8887j23007o0210r240l3159m2101N1924
5728a50341P2340N3318L5553J0854K2034K3671n9161m576n073k808j2802j6432
5716c3423J2992q1729o2871M1746J61575j2295n9270m3241L2083n032m7182J4223
5704h2424O001o7649m839J1447N7928l1287J52n218J17006R9810n3695q4874m379
5691d2021k0213l3715L2791k0579j033k3741j1881N297n9705m7427j172O1347
$$ plain form
5777 -95430 -139047 -113506 -68164 -42270 25460 14511 -27131 2355 -90289 -95599 -118520 -70425
5765 -70425 -16677 -8255 -11264 -33732 -109700 -24517 -29381 -608 859 -99682 -147040 -137525 -39163
5752 -39163 -30237 -40420 -69868 -83497 -33719 -45067 -115521 -110525 -91283 -112211 -109354 -148942
5740 -148942 -62644 -7226 47909 86106 144339 65452 -57555 -117765 -127005 -160164 -202265 -150341
5728 -150341 -78001 -24683 10870 21724 43758 67429 8268 3692 -1381 -4189 -16991 -33423
5716 -33423 -20431 -102160 -165031 -123285 38290 25995 -33275 -76516 -44433 -49465 -96647 -82424
5704 -82424 -76423 -144072 -148911 -137464 -79536 -110823 -110671 -115889 1117 100927 47232 -37642 -42021
5691 -42021 -62234 -95949 -63158 -83737 -84770 -108511 -120392 -115095 -174800 -222227 -223399 -162052
5679a62052N9177j9072L6960O2035Q989J9886m3387o3618n4212J5376q0419R264
5667b11073R134P8778K8321l4953J43329L4533n1516K2458N0851n1160r4954n5111
5655a31363k0685K8928j4127p2775k103M9456J4424J1008K0112L0668L8694j2860
5643f0623q814j6214O149k1389K6339N0415L0671k140N3615j5774k2241J5786
5631C5780p6837o1657r5501N7715L3706K9394J5023M0847K8859j00412M662M6346
5619d2075J7418J3276q6271j02756j23106l7772L4166R5602R8958O4817N465J2973
5607d9305m001k6218M1499N0777K6250j45194L9808P6788j05909k1538r201L4791
5595i1453O8741l4079p1958M4091L3497k8473k2574j5197K3927M7836Q400m527
$$ plain form
5679 -162052 -102875 -121947 -84987 -22952 -13963 5923 -37464 -101082 -155294 -139918 -220337 -211073
5667 -211073 -201939 -123161 -94840 -129793 13536 48069 -3447 19011 69862 18702 -76252 -131363
5655 -131363 -152048 -123120 -137247 -210022 -212125 -162669 -148245 -137237 -117125 -86457 -47763 -60623
5643 -60623 -69437 -85651 -79502 -100891 -74552 -24137 6534 4394 58009 42235 19994 35780
5631 35780 -41057 -102714 -198215 -140500 -106794 -77400 -62377 -21530 7329 -93083 -88421 -42075
5619 -42075 -24657 -11381 -97652 -200408 -323514 -361286 -327120 -231518 -132560 -67743 -62278 -49305
5607 -49305 -53306 -79524 -38025 12752 39002 -106192 -66384 10404 -95505 -117043 -126244 -91453
5595 -91453 -22712 -56791 -128749 -84658 -51161 -79634 -102208 -117405 -93478 -45642 -37242 -41769
5583d1769o2807m5792o7350Q1824N3215K5540O7584j3468J3513L1710r47p905
5571C3348k9294O919O577J3391n5585m5742L6451m7964R1914N804R414j3545p6499
5558f4811k9486l1791l2319Q5623Q6215M7679k4396p3049m9807j2430K935N306
5546i0331J0887K6091J9674j5349p330K7828l1920M2273q7o4625r690M6007J5702
5533c0870k4726l7714L480k4422R8383O4885M9422M7675k3922n9202l6825o5303
5521c9139J484r524j4773J8233L2583p939l988l1877p9252k7586M0146P1418m1183
5508i1397r909N8682l0713o1787m870O7776j147K3581M6854L2284m2975n1159
5496f4780J5715k7148l4034K2563M5077p157l7381M0626L72k4220Q757j7454m5501
$$ plain form
5583 -41769 -104576 -150368 -217718 -135894 -82679 -57139 10445 -3023 10490 42200 41253 33348
5571 33348 4054 10973 17550 30941 -24644 -70386 -33935 -81899 10015 15819 25233 11688 -64811
5558 -64811 -94297 -126088 -158407 -72784 13431 61110 36714 -36335 -86142 -98572 -95637 -90331
5546 -90331 -79444 -53353 -33679 -49028 -56358 -28530 -60450 -18177 -18264 -82889 -92579 -46572 -30870
5533 -30870 -55596 -93310 -89830 -114252 -15869 49016 98438 146113 122191 62989 26164 -39139
5521 -39139 -37655 -47179 -61952 -43719 -11136 -19075 -23063 -54940 -134192 -161778 -121632 -50214 -91397
5508 -91397 -101306 -42624 -73337 -135124 -139994 -72218 -73365 -49784 -2930 29354 -13621 -64780
5496 -64780 -49065 -76213 -110247 -87684 -42607 -49764 -87145 -46519 -46147 -70367 -61610 -79064 -124565
5483a24565l825O3371k327j4363l1078O9402K8743q0694m4940k348L8837L4837
5471f8950p661Q5272k7985l4527m4327L3936k317J06388Q192j00097n1934m4193
5459a48203K121O1400K5424O3761q862j414Q459q0201m7336L8047L9529J1224
5447c6051l7978r4875l483N6034m3822K261m3819m971J906L3708N5326j4401K7401
5434a02764L8123J0322M6536L5150k4873k229l51K4272M9295m7056p9722N3848
5422E51O0440l9251k5328j5870M278l1491r792l5444n8713L2718J7607R426O3296
5409b7573j9314l5347M8708N4290k0990k8625j6794n6125J0950m4701J2731L5142
5397h7648R1567J7121N105k1010L1266l5706m0750p3631l8117M2915J0679j9184
$$ plain form
5483 -124565 -128390 -65019 -67346 -81709 -112787 -43385 -14642 -95336 -140276 -142624 -103787 -68950
5471 -68950 -76611 8661 -19324 -53851 -98178 -64242 -66559 39829 48021 -52076 -104010 -148203
5459 -148203 -146082 -84682 -59258 4503 -4359 -5773 2686 -77515 -124851 -86804 -47275 -36051
5447 -36051 -74029 -168904 -172387 -116353 -160175 -157914 -201733 -206704 -204798 -171090 -115764 -130165 -102764
5434 -102764 -64641 -54319 -7783 27367 2494 265 -86 24186 73481 26425 -53297 551
5422 551 60991 21740 -3588 -19458 -15180 -46671 -56463 -91907 -150620 -117902 -100295 -90869 -27573
5409 -27573 -46887 -82234 -33526 20764 -226 -28851 -45645 -101770 -90820 -135521 -122790 -87648
5397 -87648 3919 21040 26145 5135 36401 695 -40055 -113686 -151803 -108888 -98209 -117393
5385a17393L0859L1276p9568N9739J27041K7754n2196r7975q09J0814r382o3717
5373a33557O3110M4354j5799n8612M0123P3367N1063n1190j06633J7824m6572
5362a22522J7996M6376j3348p0782q2586k5012K1294L5810J7354m8333L2142J8675
5350a72936k659O7623Q5684l684m9009j2569L2550J05197j6033p9122J2745K2806
5338i407M6534K0232k977L5816r4385q5664o4877K0421k3506J4341m6580l9184
5326b29236j907J15998J48248R7535L7940n2654j00494n7901m027j02949l225
5315a52672P6987O4266l902q2942M2620L1988L5388L1086L6158l4255n919J0466
5303D9269r0217K9519k063O445r3152n7182N541K1574j7245k310M0642N4139K1684
$$ plain form
5385 -117393 -86534 -55258 -134826 -75087 51954 79708 27512 -70463 -71272 -60458 -69840 -133557
5373 -133557 -70447 -26093 -41892 -100504 -60381 12986 64049 12859 -93774 -75950 -122522
5362 -122522 -104526 -58150 -71498 -142280 -224866 -249878 -228584 -192774 -175420 -223753 -191611 -172936
5350 -172936 -175595 -107972 -22288 -25972 -74981 -87550 -55000 50197 34164 -44958 -32213 -9407
5338 -9407 37127 57359 54382 90198 -4187 -89851 -154728 -134307 -157813 -143472 -190052 -229236
5326 -229236 -231143 -115145 33103 130638 168578 115924 15430 -42471 -46498 -149447 -152672
5315 -152672 -75685 -11419 -15321 -98263 -55643 -23655 11733 42819 78977 44722 38803 49269
5303 49269 -40948 -11429 -13492 -7047 -100199 -157381 -151840 -130266 -147511 -149821 -109179 -55040 -33356
5290c3356k5267L29n2458K2734L0766J7104L71j6487l7458K7921K6670l602j17131
5277a59864n8219L5118P8884J9661j5781p39Q438O7562J6892L5802M8880n4393
5265B2241j87193o2128K1843o7623N1510P0470R313M8415q003O2344L5628k9106
5253c2289q0674L7335R8970m2837n3446m8807P4328k5967j9910j6855k0708K5912
5241a04948q589l1744O7355J45301N430j8172q6219J9611j5509q6957l7913J2417
5229a39937j379j2876n6112L4463Q6211l0643k3568N690l5469L7920M7580M3125
5217d4995K6510M491q5857p9830k579L8270r696L9569K0211j08p142p4n3673q2718
5203b37621J9973Q6216L2156J4581l3166n4390P1859P6933K9264k8829n678Q35
$$ plain form
5290 -33356 -58623 -58294 -110752 -88018 -57252 -40148 -39777 -56264 -93722 -65801 -39131 -42733 -159864
5277 -159864 -218083 -182965 -104081 -84420 -100201 -100940 -92502 -24940 -8048 27754 76634 22241
5265 22241 -164952 -227080 -205237 -272860 -221350 -150880 -141567 -93152 -101155 -38811 -3183 -32289
5253 -32289 -112963 -75628 23342 -19495 -72941 -121748 -47420 -73387 -93297 -110152 -130860 -104948
5241 -104948 -113537 -145281 -77926 67375 72805 54633 -31586 -11975 -27484 -114441 -152354 -139937
5229 -139937 -141316 -154192 -210304 -175841 -89630 -120273 -143841 -138151 -173620 -135700 -88120 -44995
5217 -44995 -18485 -13994 -99851 -179681 -182260 -143990 -153686 -114117 -93906 -94014 -101156 -101230 -154903 -237621
5203 -237621 -217648 -131432 -99276 -84695 -117861 -172251 -100392 -23459 5805 -23024 -28702 -27867
5191b7867p011o4302k6495M3555M4714L280L5423M4610P6617j30635q1651k7717
5179a17479J0465O2363P7705n9397k9540L1933o3j8148q7935l5834r983M5960
5167a29953Q89l9626M2443n351R251r803n994l8346j8546l139K8618J0969K278
5154a56310R221K0807n070N208O0269j2869q094L2824j8209N0946M4274N2239
5142G5236M8051o3074n2137q8940k1451Q0639j1826o3407m8253N9360R2799O4538
5130G1535J0511n8708m5809Q421k662J8983N1853L2877r776j44021k8000k4793
5118a19589K9107J7916M7348K388N5746p332n8251l3231R5814m4641j5838o8491
5106i9054j733k3301N4736K5562L3965J6098j00103o9702J7252Q7156N6735N8136
$$ plain form
5191 -27867 -34878 -99180 -125675 -82120 -37406 -34126 1297 45907 122524 -8111 -89762 -117479
5179 -117479 -107014 -44651 33054 -26343 -55883 -23950 -24013 -42161 -130096 -165930 -175913 -129953
5167 -129953 -129064 -168690 -126247 -131598 -122347 -132150 -138144 -176490 -195036 -198175 -169557 -158588 -156310
5154 -156310 -147089 -126282 -131352 -126144 -65875 -78744 -86838 -54014 -72223 -21277 22997 75236
5142 75236 123287 60213 8076 -80864 -102315 -21676 -33502 -96909 -145162 -85802 6997 71535
5130 71535 82046 23338 -22471 -14050 -16712 2271 54124 87001 77225 -66796 -94796 -119589
5118 -119589 -90482 -72566 -25218 -22830 32916 25584 -32667 -65898 29916 -14725 -30563 -99054
5106 -99054 -100787 -124088 -69352 -43790 -9825 6273 -93830 -163532 -146280 -59124 -2389 55747
5094E5747k4806k4508k0582L2804l9787L956J2465L1438J1146O081J3266q1732
5082b4512l1143N1555j5385M7852M4166m0061k2508k5626j9975J14425j4132M7453
5070A12109L9699q020j12651j8490O2929m4904n7950j5138K5774J4788j4141k0477
5058c6472m3141N62J7426m0171Q121J15419K2758l1481j17780K4023K4593K4586
5046c1557M3310j6869m3621j9211L7078O7940j5959m0097l9114o1928l2320O2322
5034i0026L3849K9355L8555l8068j2056j8725k5431K9419M7671m6741O033N1312
5022E147k239r1409j0038M7809Q0603Q030l8575J2604p857k5897j8496l7872L2499
5009d5691j02561l7983o952L5481Q4642k1001l9196k3180O3570j10m0024N3122
$$ plain form
5094 55747 30941 6433 -14149 18655 -21132 -17176 -4711 26727 37873 43954 57220 -24512
5082 -24512 -55655 -4100 -19485 28367 72533 32472 9964 -15662 -35637 78788 64656 112109
5070 112109 151808 143788 31137 12647 75576 30672 -27278 -42416 -16642 -1854 -15995 -36472
5058 -36472 -79613 -79051 -61625 -101796 -93675 21744 44502 13021 -104759 -80736 -56143 -31557
5046 -31557 11753 -5116 -48737 -67948 -30870 37070 21111 -18986 -58100 -120028 -152348 -90026
5034 -90026 -56177 -26822 11733 -26335 -38391 -57116 -82547 -53128 -5457 -52198 -46165 5147
5022 5147 2908 -88501 -98539 -50730 29873 37903 -672 11932 4075 -21822 -40318 -78190 -45691
5009 -45691 -148252 -186235 -193187 -157706 -73064 -94065 -133261 -156441 -92871 -92981 -133005 -79883
4997g9883P8372O1314l8317p0249k4501N4680O7815j1422k4578p0070K6182M1650
4985A0993j0473l9329m476K47j1599K7534o0791J9181q387J2209k1199R810j2200
4972h8480j6131M0759L8574l2828L6441L3539o4812r5978k2121O3525j3467r5901
4960b16880J738J5946R0128N0222k5167o203J5478o6882J3482l7342j4257M6463
4948a33274m3257J247N3722L4377l5256n0564k9891Q3620P4152n9069n5716o9577
4936b29486M7196K9011O9777K4904J7753J1448P9926J0784j8806r4683J9536K0598
4924a2042o3443n1506M9399P6883L8953K1209j2367q2531j8470L589K7043l0469
4912e3752M623J5650L9044m133l591L1404p4646j3524Q6365O9896j1608p6336
$$ plain form
4997 -79883 -1511 59803 21486 -48763 -73264 -18584 49231 37809 13231 -56839 -30657 10993
4985 10993 520 -38809 -43285 -43038 -54637 -27103 -87894 -68713 -77100 -64891 -86090 -76280 -88480
4972 -88480 -104611 -63852 -25278 -58106 -21665 11874 -52938 -148916 -171037 -107512 -120979 -216880
4960 -216880 -215142 -199196 -109068 -58846 -84013 -90216 -74738 -141620 -128138 -165480 -179737 -133274
4948 -133274 -176531 -175284 -121562 -87185 -122441 -173005 -202896 -119276 -45124 -104193 -159909 -229486
4936 -229486 -182290 -153279 -83502 -58598 -40845 -29397 50529 61313 42507 -52176 -32640 -12042
4924 -12042 -75485 -126991 -77592 -709 38244 59453 47086 -35445 -53915 -50326 -23283 -53752
4912 -53752 -49129 -33479 5565 1432 -2159 29245 -45401 -58925 27440 97336 85728 9392
4900I392m6375M1261j2739L9111J4938m9848j34971k0620O3723K7667J2899L08
4888e5254P5818n9875j08613K8549P2157O3773J455j1273M0256j14365o4943P06
4876a31609O7564Q24p202o720k4262r89O4024o2969L0915P0070J6397o6211n2078
4863a02246j7594k1775j4278M7204P459P3310q179J7767k2655R739R833L3008
4851A1593M8779k9128m1832o812J2855J1924k3767K9189p380j4095l3422m7535
4839h9631l4054j1775J581K8371J0167K1551Q188M1821l2476n2448j9178O6372
4827f1511N0774k5520q779Q6832j657N076q8924o3067L2062J3454P2451J9916
4815C1107m4370l8854k2596M5829K3014N3509l2672n9634o3113J0426L2308j7538
$$ plain form
4900 9392 -36983 4278 -8461 30650 45588 -4260 -139231 -159851 -96128 -68461 -55562 -55254
4888 -55254 20564 -39311 -147924 -119375 -47218 16555 18010 6737 46993 -67372 -132315 -131609
4876 -131609 -64045 -63221 -70423 -77143 -101405 -102394 -38370 -101339 -70424 -354 16043 -50168 -102246
4863 -102246 -119840 -141615 -155893 -108689 -101230 -27920 -36099 -18332 -40987 -31248 -21415 11593
4851 11593 60372 31244 -10588 -17400 -4545 7379 -16388 12801 5421 -8674 -42096 -89631
4839 -89631 -123685 -135460 -133879 -105508 -95341 -73790 -65602 -23781 -56257 -108705 -127883 -61511
4827 -61511 -10737 -36257 -45036 41796 40139 45215 -43709 -106776 -74714 -61260 11191 31107
4815 31107 -13263 -52117 -74713 -28884 -5870 47639 14967 -44667 -107780 -97354 -65046 -82584
4803h2584q624k9927L8466Q4644m598j890j6627p2911j6816J6083M9465N6768
4791A1449M9195N2451o954q242r0714m6351p2309M5512O1868n4611k6515N0579
4779c4642L7524J208K3215O7868k5390n1196j3396q6766L351m5405j0899R4938
4767c9590J7756m225m6176o1087J7558P326K2168K0109J1289J5522K9778N2601
4755D3029o8449q0278L019J1317l4107j19393J21227O6774K2231m9645M701J3632
4743f5942M7676m9k1178M0755J7651o1162J6813K4608M4223K8939j7191l3057
4731B2086j8926j4778j7446j3503j3883K3208N0363l1194J368M8733L4888J7407
4719H8323j20650o7383k9567K083m0602J6724O1356M6084L5649k4096r6991L2538
$$ plain form
4803 -82584 -91208 -121135 -82669 1975 -2623 -4513 -21140 -94051 -110867 -94784 -45319 11449
4791 11449 60644 113095 106141 97899 7185 -39166 -111475 -65963 -4095 -58706 -85221 -34642
4779 -34642 2882 4090 27305 95173 69783 18587 5191 -81575 -78224 -123629 -134528 -39590
4767 -39590 -21834 -26059 -72235 -133322 -115764 -108438 -86270 -66161 -54872 -39350 -9572 43029
4755 43029 -25420 -105698 -102679 -91362 -125469 -244862 -123635 -56861 -34630 -84275 -79574 -65942
4743 -65942 -18266 -18315 -39493 1262 18913 -42249 -25436 -828 43395 72334 55143 22086
4731 22086 3160 -11618 -29064 -42567 -56450 -33242 17121 -14073 -12705 36028 70916 88323
4719 88323 -32327 -99710 -129277 -127194 -167796 -151072 -89716 -43632 -7983 -32079 -129070 -96532
4707i6532J9115K8804K6189k2154n2369N1979J3520Q925M3113L2271j1531j35038
4695i3708p7961N6959M7128j2920q2902Q100M2105Q8425o85l2049j5814R021p0716
4682a35017j507L9054O7516N427m8070R809K4461n2260j798k5580M538o665o5040
4669a85132J1977O1187M1606K7595k1609L7684K4842o3420p3321M5617N9785m5833
4657g9022j6810l5185J9614K2671k4500M1481m1265M4241R193q985L9393K1598
4645g576k0201q6611L0628M1884m012q8040J5838P8878j5039k9248O7963l4848
4633e0384k874N6113r157o6275J8206N0290O373K8872n8053k184Q173k4813J9130
4620b6583J03409k6409J5757l3492Q8407p7788n5943K7789r819P1349k6200k2807
$$ plain form
4707 -96532 -77417 -48613 -22424 -44578 -96947 -44968 -31448 -22523 20590 52861 41330 -93708
4695 -93708 -171669 -114710 -67582 -80502 -163404 -155304 -113199 -24774 -25459 -57508 -73322 -64301 -135017
4682 -135017 -136524 -97470 -29954 -24527 -72597 -62788 -38327 -90587 -92385 -117965 -113427 -120092 -185132
4669 -185132 -173155 -111968 -70362 -42767 -64376 -26692 -1850 -65270 -138591 -92974 -33189 -79022
4657 -79022 -95832 -131017 -111403 -88732 -113232 -71751 -113016 -68775 -59582 -68567 -29174 -7576
4645 -7576 -27777 -114388 -83760 -41876 -45888 -133928 -118090 -39212 -54251 -83499 -15536 -50384
4633 -50384 -53258 2855 -6302 -72577 -54371 -4081 2292 31164 -26889 -29073 -20900 -45713 -26583
4620 -26583 76826 50417 66174 32682 121089 43301 -12642 15147 5328 76677 50477 27670
4608B7670j0459k8888j7598m0781m1363k7990m3991P040N520M6302m5311K1684
4596a48165J00360K6831l0314k8440J0755j9701J0722L9074m9946L0170K5729
4585c2925k9460n2230j1730N4398J2701P506L0895k7576m5661L6624P9202n313
4573A6431j8027m4433n9928j3562j2860L2982O0301L3572p516k0285Q441P9792
4561E4908N5891J4577o9832j03324l9797K1361M0896P627j8446m4100m2027j8138
4549a40404J7299K4826j3605J0942l6284O4031K4951p961q6034K6531K5613m6904
4537a36999m5513M167K7263N2225L3658j19704O1069J5281O551N6006K3184k0144
4525d2956m2232N1709j0510n0786J6007M1540J9639m0914j15752J0440j6424M7051
$$ plain form
4608 27670 17211 -11677 -29275 -70056 -111419 -139409 -183400 -176360 -170840 -124538 -169849 -148165
4596 -148165 -47805 -20974 -51288 -79728 -68973 -88674 -77952 -38878 -88824 -58654 -32925
4585 -32925 -62385 -114615 -126345 -71947 -59246 -51740 -20845 -48421 -94082 -57458 21744 16431
4573 16431 -1596 -46029 -105957 -119519 -132379 -99397 -39096 -5524 -13040 -33325 -24884 54908
4561 54908 110799 125376 55544 -47780 -87577 -66216 -25320 -17693 -36139 -80239 -122266 -140404
4549 -140404 -123105 -98279 -111884 -100942 -137226 -73195 -48244 -56205 -142239 -115708 -90095 -136999
4537 -136999 -182512 -178345 -151082 -98857 -65199 -184903 -123834 -108553 -102002 -45996 -22812 -42956
4525 -42956 -85188 -33479 -43989 -94775 -78768 -37228 -17589 -58503 -174255 -163815 -180239 -133188
4513a33188L4038M7689M3854L7351O456Q431j4646m7132N0394L7448q5155l8154
4501e2614M4870q3r1827n5338R638Q9025N3694K1161J5747l5485o8102M8438K9653
4488H777n1833R490n879q0701M5694P5931l8179j2109M6269K2589l9118k370l0315
4475e1754k3057o9930J2387J1811N9467M7361O18n4881n7077m4327k3985L2220
4463a61147K3324P9004r09m7451n3580N1176J30819L8616j9432q6561l7106p589
4451i0836L2519K9856p7345k742K1970j3316J4110L0860L3203j8864m6591m20
4439h7596j1954k0224k6218n0168l3085M0921J4571k3534M4168N5074k162O2803
4427c7404J2754j6266l2173K2705M5585l6255l4021l0260l8044M493l0948Q2377
$$ plain form
4513 -133188 -99150 -51461 -7607 29744 36200 44631 29985 -17147 33247 70695 -14460 -52614
4501 -52614 -7744 -7827 -99654 -154992 -145354 -56329 -2635 18526 34273 -1212 -69314 -20876 8777
4488 8777 -43056 -33566 -39445 -120146 -74452 1479 -36700 -48809 -2540 20049 -19069 -21439 -51754
4475 -51754 -74811 -144741 -132354 -120543 -61076 -13715 -13097 -67978 -125055 -169382 -193367 -161147
4463 -161147 -137823 -58819 -59728 -107179 -160759 -109583 21236 59852 40420 -46141 -83247 -90836
4451 -90836 -58317 -28461 -105806 -108548 -86578 -99894 -85784 -54924 -21721 -40585 -87176 -87596
4439 -87596 -99550 -119774 -145992 -196160 -229245 -188324 -173753 -197287 -153119 -98045 -100207 -37404
4427 -37404 -24650 -40916 -73089 -50384 -4799 -41054 -75075 -105335 -143379 -138886 -169834 -87457
4415h7457Q1658l2386j2321n2855k6582k0679Q847J1988P283L1588O1740m7712
4403g6888k2128L7977J4848j3461q5720l8583m2764P424J02889N4558j6507m4140
4391a22495j4539K2315K0233n5022l1683N1956L6958n933M5771R2791J1312o8161
4379a6497o4925L1117N4617k7176k1100L96k8889k8495P7688m207K3528L1459
4367B7516q676K8619J4650l1121k8031n9906n1484J6668k6337m6602N2779M2941
4355f8984J18803Q46K0120J1388r4767j1799K0719n6738m6274k3102R845l8900
4343a58843L3507M0893L3332K0040j5959J8496J9039M0138n6460m9961q0024K7596
4331a28206L9412N4033J3508j06304p405J21896L4365n7909k0194m7293j0983
$$ plain form
4415 -87457 -5799 -38185 -50506 -103361 -129943 -150622 -141775 -129787 -122504 -90916 -29176 -76888
4403 -76888 -99016 -61039 -46191 -59652 -145372 -183955 -226719 -219295 -116406 -61848 -78355 -122495
4391 -122495 -137034 -114719 -94486 -149508 -181191 -129235 -92277 -98210 -52439 40352 51664 -16497
4379 -16497 -81422 -50305 4312 -22864 -43964 -43568 -72457 -100952 -23264 -27471 -3943 27516
4367 27516 18840 47459 62109 30988 2957 -56949 -108433 -91765 -118102 -164704 -111925 -68984
4355 -68984 49819 50665 70785 82173 -12594 -24393 -3674 -60412 -106686 -129788 -119943 -158843
4343 -158843 -125336 -84443 -51111 -31071 -47030 -28534 -9495 30643 -25817 -75778 -155802 -128206
4331 -128206 -88794 -34761 -21253 -127557 -134962 -13066 21299 -36610 -56804 -104097 -115080
4320a15080l4815L926N6138K8741O6061l7432r6910m8527q870R088M8950N4008
4308g4722m4400K7583n234p80l482J1573M5819K7498o5949p7437O340J5767J0586
4295a26838k2186K2915J4164l0570N79R8181K747o7041R35R0031K8926r7094P9490
4282e761Q3585K330m942n4550p1604J6630N12K3204k5068m1898n6059j7798K72
4269a51147O8204L7670K4403j510Q1696O3655j53808p0416R118N3086L5637L6025
4257C2613l8358m2596K5813J3117k8011j9274l3738n8151n60k9728L2376O4617
4245h1880Q6589k4805r104k5204m6470M2577K0253n0122J7539k191j01948K9270
4233a45496N7199k1930J9513M7341k6827j4920r589Q0915n831l2068j7527m7276
$$ plain form
4320 -115080 -149895 -145969 -89831 -61090 4971 -32461 -129371 -177898 -186768 -177680 -128730 -74722
4308 -74722 -119122 -91539 -96773 -97553 -101035 -89462 -43643 -16145 -82094 -159531 -153191 -137424 -126838
4295 -126838 -149024 -126109 -111945 -142515 -141936 -43755 -41008 -108049 -107114 -17083 11843 -85251 -5761
4282 -5761 77824 80154 75212 20662 -50942 -34312 -33800 -10596 -35664 -77562 -133621 -151419 -151147
4269 -151147 -82943 -45273 -20870 -22380 59316 122971 -30837 -101253 -92135 -39049 -3412 32613
4257 32613 -5745 -48341 -22528 -9411 -37422 -56696 -90434 -148585 -149145 -178873 -146497 -81880
4245 -81880 4709 -20096 -29200 -54404 -100874 -58297 -38044 -88166 -70627 -72818 -174766 -145496
4233 -145496 -88297 -110227 -90714 -43373 -70200 -85120 -94709 -13794 -19625 -51693 -69220 -116496
4221a16496k0547M7257J6958N3255O996n2171j6122L0968n7426o1937O6375J7740
4209h5150k0740L3927M4187n4336j0866k2305Q5302Q5246O195K4935J2024r819
4197H8600K8891k1833o0920o5931q2065N3606K7070n4224k2423l4934Q2800j8118
4185g9481m4712K7492k8356J9313M1033l6737p4754q4384N232K9175J9843Q7577
4173a18759N0367k7320m9118R9460P8372o6319r0320k6865P1546N9797j9956o911
4161d6026j9376Q74M7978L5487M6322J0858j44954m2250L0390o136j7496j1166
4149a15495N8116M6836j22340m1667l3791K5765M9388N1568l31l737o523m277
$$ plain form
4221 -116496 -137043 -89786 -72828 -19573 -12577 -64748 -80870 -49902 -107328 -169265 -102890 -85150
4209 -85150 -105890 -71963 -27776 -82112 -92978 -115283 -29981 55265 61460 86395 98419 88600
4197 88600 117491 95658 34738 -31193 -113258 -59652 -32582 -86806 -109229 -144163 -61363 -79481
4185 -79481 -124193 -96701 -125057 -105744 -64711 -101448 -176202 -260586 -255354 -226179 -206336 -118759
4173 -118759 -68392 -95712 -144830 -45370 33002 -33317 -123637 -150502 -78956 -19159 -39115 -46026
4161 -46026 -65402 -64528 -16550 18937 65259 76117 -68837 -111087 -80697 -86833 -104329 -115495
4149 -115495 -57379 -10543 -132883 -174550 -208341 -182576 -133188 -81620 -81951 -85688 -92211 -96488
$$ [...]
##END NTUPLES=NMR SPECTRUM
##END=
