##TITLE=Analysis number 326346
Compound Code cc 40001
Project Code adrs
Chemist Name endeavour
##JCAMPDX= 6.0         $$ Bruker NMR JCAMP-DX V2.0
##DATA TYPE= NMR SPECTRUM
##DATA CLASS= NTUPLES
##ORIGIN= Bruker BioSpin GmbH
##OWNER= nmr
$$ XWIN-NMR		Version 3.5
$$ Fri Feb  2 12:30:00 2007 GMT Standard Time (UT+0h)  MAYBRIDGE\nmr@NMR_250MHZ
##.OBSERVE FREQUENCY= 250.131544655141
##.OBSERVE NUCLEUS= ^1H
##.ACQUISITION MODE= SIMULTANEOUS (DQD)
##.ACQUISITION SCHEME= undefined
##.AVERAGES= 16
##.DIGITISER RES= 18
##SPECTROMETER/DATA SYSTEM= dpx250
##.PULSE SEQUENCE= zg30
##.SOLVENT NAME= DMSO
##.SHIFT REFERENCE= (INTERNAL, DMSO, 0, 16.522)
##AUDIT TRAIL= $$ (NUMBER, WHEN, WHO, WHERE, WHAT)
$$ ##TITLE= Audit trail, XWIN-NMR		Version 3.5
$$ ##JCAMPDX= 5.01
$$ ##ORIGIN= Bruker BioSpin GmbH
$$ ##OWNER= nmr
$$ C:\u/data/dgb/nmr/ADRS/230/pdata/1/auditp.txt
$$ ##AUDIT TRAIL=  $$ (NUMBER, WHEN, WHO, WHERE, WHAT)
(   1,<2007-02-02 12:29:38.12 +000>,<MAYBRIDGE\nmr>,<NMR_250MHZ>,
      <created by zg, POWCHK disabled, PULCHK disabled
       configuration hash MD5:
       49 4B E0 1D 92 C2 6B 37 9F E6 65 BC 52 41 86 1D
       data hash MD5: 64K
       01 C7 5F 69 1D 6C 19 3E 57 0C 1F D2 54 C0 26 1B>)
(   2,<2007-02-02 12:29:49.92 +000>,<MAYBRIDGE\nmr>,<NMR_250MHZ>,
      <Start of raw data processing
       ef LB = 0.3 FT_mod = 6 PKNL = 1 SI = 32K 
       data hash MD5: 32K
       3B 2A E7 5F B4 D4 D1 B5 47 FF D3 2F CA BE F6 6C>)
(   3,<2007-02-02 12:29:52.06 +000>,<MAYBRIDGE\nmr>,<NMR_250MHZ>,
      <apk 
       data hash MD5: 32K
       B2 CF 8E CB B9 D5 DC A7 FC C8 01 1B 51 76 8F FB>)
(   4,<2007-02-02 12:29:53.01 +000>,<MAYBRIDGE\nmr>,<NMR_250MHZ>,
      <abs ABSG = 5 
       data hash MD5: 32K
       CA B1 0A 92 75 CA 7F 5A EF 71 D7 42 19 16 09 15>)
$$ ##END=
$$ 
$$ hash MD5
$$ 7C FF 87 46 A1 B4 5B 8A D2 35 C9 D2 AD 1D 6E F0
##$RELAX= 
##$RELAX= 
##$RELAX= 
##$RELAX= 
##$RELAX= 
##$RELAX= 
##$RELAX= 
$$ Bruker specific parameters
$$ --------------------------
##$DU= <C:\u>
##$EXPNO= 230
##$NAME= <ADRS>
##$PROCNO= 1
##$TYPE= <nmr>
##$USER= <dgb>
##$AMP= (0..31)
100 100 100 100 100 100 100 100 100 100 100 100 100 100 100 100 100 100 
100 100 100 100 100 100 100 100 100 100 100 100 100 100 
##$AQSEQ= 0
##$AQ_mod= 3
##$AUNM= <au_zg>
##$AUTOPOS= <57 >
##$BF1= 250.13
##$BF2= 250.13
##$BF3= 250.13
##$BF4= 250.13
##$BF5= 500.13
##$BF6= 500.13
##$BF7= 500.13
##$BF8= 500.13
##$BYTORDA= 1
##$CFDGTYP= 0
##$CFRGTYP= 5
##$CHEMSTR= <none>
##$CNST= (0..31)
1 1 145 1 1 1 1 1 1 1 1 1 1 1 1 1 1 1 1 1 1 1 1 1 1 1 1 1 1 1 1 1 
##$CPDPRG= <>
##$CPDPRG1= <>
##$CPDPRG2= <>
##$CPDPRG3= <>
##$CPDPRG4= <mlev>
##$CPDPRG5= <mlev>
##$CPDPRG6= <mlev>
##$CPDPRG7= <mlev>
##$CPDPRG8= <mlev>
##$CPDPRGB= <>
##$CPDPRGT= <>
##$D= (0..31)
0 1 0 0 0 0 0 0 0 0.06 0 0 0 0 0 0 0.0002 0 0 0 0 0 0 0 0 0 0 0 0 0 0 
0 
##$DATE= 1170419376
##$DBL= (0..7)
120 120 120 120 120 120 120 120 
##$DBP= (0..7)
150 150 150 150 150 150 150 150 
##$DBP07= 0
##$DBPNAM0= <>
##$DBPNAM1= <>
##$DBPNAM2= <>
$$ [...]
##$SUBNAM7= <"">
##$SUBNAM8= <"">
##$SUBNAM9= <"">
##$SW= 20.6930455092707
##$SWIBOX= (0..15)
0 0 3 0 0 0 0 0 0 0 0 0 0 0 0 0 
##$SW_h= 5175.983436853
##$TD= 65536
##$TD0= 1
##$TE= 294.16
##$TE2= 300
##$TE3= 300
##$TEG= 300
##$TL= (0..7)
0 120 120 120 120 120 120 120 
##$TP= (0..7)
150 150 150 150 150 150 150 150 
##$TP07= 0
##$TPNAME0= <>
##$TPNAME1= <>
##$TPNAME2= <>
##$TPNAME3= <>
##$TPNAME4= <>
##$TPNAME5= <>
##$TPNAME6= <>
##$TPNAME7= <>
##$TPOAL= (0..7)
0.5 0.5 0.5 0.5 0.5 0.5 0.5 0.5 
##$TPOFFS= (0..7)
0 0 0 0 0 0 0 0 
##$TUNHIN= 0
##$TUNHOUT= 0
##$TUNXOUT= 0
##$USERA1= <user>
##$USERA2= <user>
##$USERA3= <user>
##$USERA4= <user>
##$USERA5= <user>
##$V9= 5
##$VALIST= <valist>
##$VCLIST= <CCCCCCCCCCCCCCC>
##$VD= 0
##$VDLIST= <DDDDDDDDDDDDDDD>
##$VPLIST= <PPPPPPPPPPPPPPP>
##$VTLIST= <TTTTTTTTTTTTTTT>
##$WBST= 1024
##$WBSW= 4
##$XGAIN= (0..3)
0 0 0 0 
##$XL= 0
##$YL= 0
##$YMAX_a= 231135
##$YMIN_a= -446519
##$ZGOPTNS= <>
##$ZL1= 120
##$ZL2= 120
##$ZL3= 120
##$ZL4= 120
##$ABSF1= 16.522
##$ABSF2= -4.171173
##$ABSG= 5
##$ABSL= 3
##$ALPHA= 0
##$AQORDER= 0
##$ASSFAC= 0
##$ASSFACI= 0
##$ASSFACX= 0
##$ASSWID= 0
##$AUNMP= <proc_1d>
##$AZFE= 0.1
##$AZFW= 0.1
##$BCFW= 0
##$BC_mod= 0
##$BYTORDP= 0
##$COROFFS= 0
##$CY= 12.5
##$DATMOD= 1
##$DC= 0
##$DFILT= <>
##$DTYPP= 0
##$F1P= 14.0000005364418
##$F2P= -0.99999901652339
##$FCOR= 0.5
##$FTSIZE= 32768
##$FT_mod= 6
##$GAMMA= 0
##$GB= 0
##$INTBC= 1
##$INTSCL= 1
##$ISEN= 128
##$LB= 0.3
##$LEV0= 0
##$LPBIN= 0
##$MAXI= 10000
##$MC2= 0
##$MEAN= 0
##$ME_mod= 0
##$MI= 0
##$NCOEF= 0
##$NC_proc= -6
##$NLEV= 6
##$NOISF1= 0
##$NOISF2= 0
##$NSP= 0
##$NTH_PI= 0
##$NZP= 0
##$OFFSET= 16.522
##$PC= 1
##$PHC0= 208.9628
##$PHC1= 19.24495
##$PH_mod= 1
##$PKNL= yes
##$PPARMOD= 0
##$PSCAL= 4
##$PSIGN= 0
##$REVERSE= no
##$SF= 250.13
##$SI= 32768
##$SIGF1= 0
##$SIGF2= 0
##$SINO= 400
##$SIOLD= 32768
##$SREGLST= <1H.DMSO>
##$SSB= 0
##$STSI= 32768
##$STSR= 0
##$SW_p= 5175.98343685301
##$SYMM= 0
##$S_DEV= 0
##$TDeff= 65536
##$TDoff= 0
##$TI= <Analysis number 999999
Compound Code 99
Book Reference 9
Project Code 9>
##$TILT= no
##$TM1= 0
##$TM2= 0
##$TOPLEV= 0
##$USERP1= <user>
##$USERP2= <user>
##$USERP3= <user>
##$USERP4= <user>
##$USERP5= <user>
##$WDW= 1
##$XDIM= 32768
##$YMAX_p= 534116153
##$YMIN_p= -719916
$$ End of Bruker specific parameters
$$ ---------------------------------
##NTUPLES= NMR SPECTRUM
##VAR_NAME=  FREQUENCY,     SPECTRUM/REAL,   SPECTRUM/IMAG
##SYMBOL=    X,             R,               I
##VAR_TYPE=  INDEPENDENT,   DEPENDENT,       DEPENDENT
##VAR_FORM=  AFFN,          ASDF,            ASDF
##VAR_DIM=   32768,         32768,           32768
##UNITS=     HZ,            ARBITRARY UNITS, ARBITRARY UNITS
##FACTOR=    0.157963299565203, 1,           1
##FIRST=     4132.6476996994, 0,             0
##LAST=      -1043.33573715361, 0,           0
##MIN=       -1043.33573715361, -719916,     0
##MAX=       4132.6476996994, 534116153,     0
$$ Real data points
##PAGE= N=1
##DATA TABLE= (X++(R..R)), XYDATA
$$ [...]
$$ plain form
24010 -240378 -339887 -271335 -123542 -267222 -315249 -371112 -286532 -109947 -10265 -53496 -34739
23999 -34739 -60560 -87542 -271765 -428414 -363159 -107331 36549 -69324 -122575 -64145 -10619
23988 -10619 71336 -5001 -170589 -225371 -137798 -217799 -130395 -158754 -255253 -298663 -178578
23977 -178578 -181221 -168408 -129941 -214741 -224496 -184645 -52125 -52474 92779 13571 44617 196259
23965 196259 43156 -167 -33317 -30571 -63858 -183968 -248375 -202469 -44276 119768 232874
23954 232874 310958 300504 186640 -40089 -167767 -332197 -213375 -104609 -61678 -70545
23944 -70545 -210507 -232496 -47639 163541 193231 100095 -47190 -118811 -262390 -153424
23934 -153424 -6362 -76580 -205025 -166005 -151453 -250985 -187553 -111653 -82845 -60885 -21566
$$ packed form
24010b40378r9509O8552J47793j43680m8027n5863Q4580J76585R9682m3231J8757
23999c4739k5821k6982j84223j56649O5255K55828J43880j05873n3251N8430N3526
23988a0619Q1955p6337j65588n4782Q7573q0001Q7404k8359r6499m3410J20085
23977a78578k643J2813L8467q4800r755L9851J32520l49J45253p9208L1046J51642
23965A96259j53103m3323l3150K746l3287j20110o4407M5906J58193J64044J13106
23954B32874P8084j0454j13864k26729j27678j64430J18822J08766M2931q867
23944g0545j39962k1989J84857K11180K9690r3136j47285p1621j43579J08966
23934a53424J47062p0218j28445L9020J4552r9532O3432P5900K8808K1960L9319
$$ plain form
23923 -21566 -269258 -153154 108445 37336 -33909 21460 -89181 -182773 -238760 -246563 -126126
23912 -126126 -21763 47724 37543 1655 -109234 -149870 -29136 -137634 -181806 -243600 -298544
23901 -298544 -377831 -398060 -232509 -345124 -397709 -227250 -147561 -40104 181306 142301
23891 142301 3676 -106585 -153742 -68333 -70431 -72274 -71319 197593 381688 473711 342079
23880 342079 131519 7014 -201204 -246474 -266702 -192590 50915 79166 9853 16898 151455
23869 151455 286705 152802 -65321 -220210 -98224 -48161 -110148 -259361 -342712 -238367
23859 -238367 -250246 -315035 -287567 -243674 -168475 -19563 -125494 -259655 -62602 147904
23849 147904 313306 354686 263476 116283 98194 60175 17394 61228 933 -69770 -380664
$$ packed form
23923b1566k47692J16104K61599p1109p1245N5369j10641r3592n5987p803J20437
23912a26126J04363O9487j0181l5888j10889m0636J20734j08498m4172o1794n4944
23901b98544p9287k0229J65551j12615n2585J70459P9689J07457K21410l9005
23891A42301j38625j10261m7157Q5409k098j843R55K68912J84095R2023j31632
23880C42079k10560j24505k08218m5270k0228P4112K43505K8251o9313P045J34557
23869A51455J35250j33903k18123j54889J21986N0063o1987j49213q3351J04345
23859b38367j1879o4789K7468M3893P5199J48912j05931j34161J97053K10506
23849A47904J65402M1380r1210j47193j8089l8019m2781M3834o0295p0703l10894
$$ plain form
23838 -380664 -396415 -560251 -719916 -568788 -471515 -250733 -8475 48499 75307 74599 88078
23827 88078 243524 271803 111375 103475 36099 -32276 -183776 -322442 -320423 -186480 -170903
23816 -170903 -189873 -258723 -344434 -272068 -102466 -55759 -164575 -199366 -253647 -164036 -26867
23805 -26867 133582 32983 -57114 17234 -45700 148738 119222 19375 -95883 -98528 -169210
23794 -169210 -227849 -163253 68055 182006 85311 157061 131196 28023 33003 182843 34158
23783 34158 -59728 -16055 130123 217193 -388 69752 40413 -50795 -141476 -10539 10368
23772 10368 -131547 -331624 -367226 -355905 -390676 -458079 -489536 -280920 -66450 -28430 -165825
23761 -165825 -313125 -319625 -392927 -370328 -284126 -304174 -273865 -158054 -157362 -229726 -231209 -249296
$$ packed form
23838c80664j5751j63836j59665J51128R7273K20782K42258N6974K6808p08J3479
23827H8078J55446K8279j60428p900o7376o8375j51500j38666K019J33943J5577
23816a70903j8970o8850q5711P2366J69602M6707j08816l4791n4281Q9611J37169
23805b6867J60449j00599r0097P4348o2934J94438k9516r9847j15258k645p0682
23794a69210n8639O4596K31308J13951r6695P1750k5865j03173M980J49840j48685
23783C4158r3886M3673J46178Q7070k17581P0140k9339r1208r0681J30937K0907
23772A0368j41915k00077l5602J1321l4771o7403l1457K08616K14470L8020j37395
23761a65825j47300o500p3302K2599Q6202k0048L0309J15811O92p2364j483j8087
$$ plain form
23749 -249296 -154130 13016 34162 -62812 -228703 -385364 -414782 -255948 60103 166037
23739 166037 78412 134028 122087 116043 -45225 -122294 -97354 -162190 -124816 -27937 -6875
23728 -6875 52801 85997 -121487 -158665 -160861 -123948 -234045 -95153 -46096 9594 -153331
23717 -153331 -259140 -119434 -256443 -330002 -356191 -485012 -424804 -408763 -450691 -406872 -372793
23706 -372793 -318028 -303603 -334236 -323191 -438960 -428361 -470296 -509338 -372473 -423458 -432206
23695 -432206 -460277 -189934 -40642 107934 -631 -22401 18951 84530 38561 28988 156326
23684 156326 79525 16805 -12925 18575 -33069 -40021 -126433 -152751 -201118 -214753 -225138 -246932
23672 -246932 -208646 18508 58885 76725 91435 -21050 -25142 -247148 -404234 -488891 -365915
$$ packed form
23749b49296R5166J67146K1146r6974j65891j56661k9418J58834L16051J05934
23739A66037q7625N5616j1941o044j61268p7069K4940o4836L7374R6879K1062
23728f875N9676L3196k07484l7178k196L6913j10097J38892M9057N5690j62925
23717a53331j05809J39706j37009p3559k6189j28821O0208J6041m1928M3819L4079
23706c72793N4765J4425l0633J1045j15769J0599m1935l9042J36865n0985q748
23695d32206k8071K70343J49292J48576j08565k1770M1352O5579m5969r573J27338
23684A56326p6801o2720k9730L1500n1644o952q6412k6318m8367j3635j0385k1794
23672b46932L8286K27154M0377J7840J4710j12485m092k22006j57086q4657J22976
$$ plain form
23661 -365915 -193311 30221 -83071 -121254 -12256 20139 -529 62039 154180 9533
23651 9533 -4745 15361 91122 211623 134091 -116174 -164871 -20641 24403 13314 -179165
23640 -179165 -251656 -137218 42597 271385 171220 41712 -23009 -93747 -260916 -338321
23630 -338321 -309267 -152050 -184609 -278291 -251752 -182804 -255478 -260912 -173685 -237281 -308522
23619 -308522 -198048 -141022 -77493 -50863 -196320 -29801 7747 66672 93033 139281 -74304
23608 -74304 -251616 -381601 -439597 -346787 -200909 2270 -106963 -301839 -259114 -181326
23598 -181326 -90166 11997 -162808 -326869 -295555 -152825 -212513 -166245 -200734 -152702 -14952
23587 -14952 -91107 -76930 -49657 -66068 -41090 -171812 -187376 -171666 -94953 59441 15015
$$ packed form
23661c65915J72604K23532j13292l8183J08998L2395k0668O2568R2141j44647
23651I533j4278K0106P5761J20501p7532k50265m8697J44230M5044j1089j92479
23640a79165p2491J14438J79815K28788j00165j29508o4721p0738j67169p7405
23630c38321K9054J57217l2559r3682K6539O8948p2674n434Q7227o3596p1241
23619c08522J10474N7026O3529K6630j45457J66519L7548N8925K6361M6248k13585
23608g4304j77312j29985n7996R2810J45878K03179j09233j94876M2725P7788
23598a81326R1160J02163j74805j64061L1314J42730n9688M6268l4489M8032J37750
23587a4952p6155J4177K7273j6411K4978j30722j5564J5710P6713J54394m4426
$$ plain form
23576 15015 -137995 -133477 -134925 -84325 95916 85188 -9406 -156446 -195950 -263904 -244105
23565 -244105 -309268 -249495 -138081 -223229 -264208 -245123 -306929 -217106 -141073 -373252 -492792
23554 -492792 -368202 -96143 -42880 65664 137148 157999 42029 93731 342943 400081
23544 400081 309307 197754 202496 104972 115732 -16919 -52615 -28735 -156592 -202573 -116885
23533 -116885 -66894 159989 222909 100885 50680 -5372 -126452 -229450 -200359 -233476 -341180
23522 -341180 -418475 -345694 -192790 -48152 -86925 -63920 -166518 -116387 -54629 124007 279430
23511 279430 62785 -89347 -135678 -167713 -114525 -82028 -48984 -37162 114902 113582 -48391
23500 -48391 -114964 -114024 32613 78164 96094 119942 59004 -13061 24630 143026 192542 164465
$$ packed form
23576A5015j53010M518j448N0600J80241j0728r4594j47040l9504o7954J9799
23565b44105o5163N9773J11414q5148m0979J9085o1806Q9823P6033k32179j19540
23554d92792J24590K72059N3263J08544P1484K0851j15970N1702K49212N7138
23544D00081r0774j11553M742r7524J0760j32651l5696K3880j27857m5981Q5688
23533a16885M9991K26883O2920j22024n0205n6052j21080j02998K9091l3117j07704
23522c41180p7295P2781J52904J44638l8773K3005j02598N0131O1758J78636J55423
23511B79430k16645j52132m6331l2035N3188L2497L3044J1822J52064j320j61973
23500d8391o6573R40J46637M5551J7930K3848o0938p2065L7691J18396M9516k8077
$$ plain form
23488 164465 -121606 -308406 -196591 -262241 -192044 -16497 -101051 -39002 123905 275588
23478 275588 188591 82269 38051 16875 -33773 -128047 -219292 -138087 -189220 -344269 -119295
23467 -119295 15561 -129040 -262549 -62683 19114 -111694 -137346 -56818 155929 222154
23457 222154 19105 -163349 -435077 -481727 -284132 -210741 -131988 -199570 -93250 -81685
23447 -81685 -32624 -85292 -148150 -188161 -570323 -624318 -475049 -426866 -405269 -431764 -407436
23436 -407436 -266019 -169247 -42802 19293 2521 46111 -76977 -107049 -16508 -65669 18516
23425 18516 -41520 119555 248162 186684 183884 52693 -158883 -277504 -212565 -140432 98907
23414 98907 193717 -73731 -235967 -284384 -149226 -195268 -322966 -88621 166024 58469
$$ packed form
23488A64465k86071j86800J11815o5650P0197J75547q4554O2049J62907J51683
23478B75588q6997j06322m4218k1176n0648r4274r1245Q1205n1133j55049K24974
23467a19295J34856j44601j33509J99866Q1797j30808k5652Q0528K12747O6225
23457B22154k03049j82454k71728m6650J97595P3391P8753o7582J06320J1565
23447h1685M9061n2668o2858m0011l82162n3995J49269M8183K1597k6495K4328
23436d07436J41417R6772J26445O2095j6772M3590j23088l0072R0541m9161Q4185
23425A8516o0036J61075J28607o1478k800j31191k11576j18621O4939P2133K39339
23414I8907R4810k67448j62236m8417J35158m6042j27698K34345K54645j07555
$$ plain form
23404 58469 11436 -5232 -84106 -245771 -371139 -210661 -19279 161619 133933 67161 -132274
23393 -132274 -221691 -227024 -87045 -71025 -262549 -411270 -437705 -234540 -101521 -42669 -36972
23382 -36972 -130256 -216708 -174576 -18130 16800 36537 115843 93570 38177 -23904 -38057
23371 -38057 -13976 24559 108031 -19245 -123681 -109731 -7732 -197500 -210488 69005 204096
23360 204096 112088 -29742 -321956 -293434 -263532 -279830 -311072 -375848 -222789 -113938 -63534
23349 -63534 -62953 45553 -41881 32679 114226 30834 -105237 -220141 -286743 -117901 -138361
23338 -138361 -223796 -167400 -93837 -191600 -417195 -496889 -383407 -105263 -48367 -84177 -213898
23327 -213898 -161292 77414 210573 262504 367630 86751 19719 -253497 -381313 -260516
$$ packed form
23404E8469m7033j6668p8874j61665j25368J60478J91382J80898k7686o6772j99435
23393a32274q9417n333J39979J6020j91524j48721k6435K03165J33019N8852N697
23382c6972r3284q6452M2132J56446L4930J9737P9306k2273n5393o2081j4153
23371c8057K4081L8535Q3472j27276j04436J3950J01999j89768j2988K79493J35091
23360B04096r2008j41830k92214K8522K9902j6298l1242o4776J53059J08851N0404
23349f3534N81J08506q7434P4560Q1547q3392j36071j14904o6602J68842k0460
23338a38361q5435N6396P3563r7763k25595p9694J13482K78144N6896l5810j29721
23327b13898N2606K38706J33159N1931J05126k80879o7032k73216j27816J20797
$$ plain form
23317 -260516 -256123 -158894 -162591 -54705 44567 51976 1464 2747 -64588 4083 70393 200826
23305 200826 161970 57926 51446 81933 34574 -105363 -102248 -127417 -14059 -38618 203585
23294 203585 337176 79937 -266161 -68846 104156 217376 192486 277851 181089 38784
23284 38784 225003 404591 436539 320799 107852 14355 -62856 -162001 -193274 -72345 -144768
23273 -144768 -332448 -377692 -296334 -380310 -378247 -356475 -172678 -122756 -113490 -20217 -337805
23262 -337805 -507550 -309187 -235507 -362061 -371881 -134684 67764 -12349 -269686 -302495
23252 -302495 -247650 -270632 -261982 -224553 -47604 -137310 -199882 -16122 -38061 -52627 -42559
23241 -42559 -123104 -166438 -81300 -130976 -233590 -83301 -274020 -350640 -255339 -123980 -52675
$$ packed form
23317b60516M393R7229l697J07886R9272P409n0512J283o7335O8671O6310J30433
23305B00826l8856j04044o480L0487m7359j39937L115k5169J13358k4559K42203
23294B03585J33591k57239l46098J97315J73002J13220k4890Q5365r6762j42305
23284C8784J86219J79588L1948j15740k12947r3497p7211r9145l1273J20929p2423
23273a44768j87680m5244Q1358q3976K063K1772J83797M9922R266R3273l17588
23262c37805j69745J98363P3680j26554r820K37197K02448q0113k57337l2809
23252c02495N4845k2982Q650L7429J76949q9706o2572J83760k1939j4566J0068
23241d2559q0545m3334Q5138m9676j02614J50289j90719p6620R5301J31359P1305
$$ plain form
23230 -52675 -70767 -61548 -133447 -393113 -449460 -270802 -133605 -150161 -238342 -151459 -19337
23219 -19337 -128333 -98638 -156040 -93154 -254588 -176440 -212005 -16737 -6619 -15750 90375
23208 90375 53196 -207212 -324976 -317011 -413685 -227311 -103199 -86802 -224772 -336631 -142374
23197 -142374 -60814 -146320 -298624 -245358 -283380 -469664 -522546 -317100 -194476 -135678 -199356
23186 -199356 -319081 -202742 -104976 -142106 -214250 -55541 3358 -26672 -238111 -312181 -8313
23175 -8313 -14320 29217 173262 124194 66098 -35399 7361 118213 117694 180025 6315 -90076
23163 -90076 -100813 -28083 -11856 -121926 -202460 -339435 -425812 -444237 -519095 -341719 -172717
23152 -172717 -168192 -296287 -365945 -275005 -235444 -305115 -262116 -361964 -348334 -249086 -291251
$$ packed form
23230e2675j8092R219p1899k59666n6347J78658J37197j6556q8181Q6883J32122
23219a9337j08996K9695n7402O2886j61434P8148l5565J95268J0118r131J06125
23208I0375l7179k60408j17764P965r6674J86374J24112J6397j37970j11859J94257
23197a42374Q1560q5506j52304N3266l8022j86284n2882K05446J22624N8798o3678
23186a99356j19725J16339R7766l7130p2144J58709N8899l0030k11439p4070L03868
23175h313o007M3537J44045m9068n8096j01497M2760J10852n19O2331j73710r6391
23163i0076j0737P2730J6227j10070q0534j36975q6377j8425p4858J77376J69002
23152a72717M525j28095o9658R0940L9561o9671M2999r9848J3630R9248m2165
$$ plain form
23141 -291251 -327443 -413073 -537537 -642219 -585268 -317261 -247370 -281235 -408304 -379938 -338650
23130 -338650 -307084 -238338 78648 88348 54099 56620 -147268 -234434 -180322 19876 67876
23119 67876 84436 272325 296598 109462 38072 34229 -6147 -227922 -327518 -255529 -188156
23108 -188156 -279294 -440616 -189144 -42658 -11350 -64458 -138375 -128682 -180879 -123236 -232719
23097 -232719 -371046 -614917 -536586 -231896 -97012 -145281 -62794 -63073 -132173 -97084 -44657
23086 -44657 -145836 -179155 -250295 -71203 59477 -3353 -9711 99966 94427 71840 -113116
23075 -113116 -132155 -60999 -129259 -278322 -230800 -315853 -167580 -179151 -180441 -155002 -304860
23064 -304860 -257982 -251351 -224691 -358793 -167102 -22309 -31095 -42123 -77180 -83143 26178
$$ packed form
23141b91251l6192q5630j24464j04682N6951K68007O9891l3865j27069K8366M1288
23130c38650L1566O8746L16986R700l4249K521k03888q7166N4112K00198M8000
23119F7876J6560J87889K4273j87136p1390l843m0376k21775r9596P1989O7373
23108a88156r1138j61322K51472J46486L1308n3108p3917R693n2197N7643j09483
23097b32719j38327k43871P8331L04690J34884m8269Q2487k79o9100L5089N2427
23086d4657j01179l3319p1140J79092J30680o2830o358J09677n539k2587j84956
23075a13116j9039P1156o8260j49063M7522q5053J48273j1571j290K5439j49858
23064c04860M6878O631K6660j34102J91691J44793q786j1028l5057n963J09321
$$ plain form
23053 26178 -45640 -43168 -61334 -64221 72777 168826 16640 -200109 -81281 54573 217123
23042 217123 147370 23120 -125474 -138071 -60723 -49294 -153934 -100021 12989 -5932 -23263
23031 -23263 20021 -132529 -280030 -137301 4950 6020 -141306 -257820 -124152 -173370
23021 -173370 -411644 -387871 -399739 -302894 -308538 -89383 139851 112313 -128717 -153501 -313706
23010 -313706 -443707 -245033 -33736 60807 122578 25957 25454 -47478 -189005 -201831 -263565
22999 -263565 -185547 -94684 -116314 -53506 -106129 -47923 96175 -131544 -226692 -235922 -222010
22988 -222010 -457213 -384618 -149016 497 80978 39423 51126 126158 119527 76861 61534
22977 61534 -628 97951 186185 117014 18083 -74252 45702 140250 290217 106345 28322
$$ packed form
23053B6178p1818K472j8166k887J36998R6049j52186k16749J18828J35854J62550
23042B17123o9753j24250j48594j2597P7348J1429j04640N3913J13010j8921j7331
23031b3263M3284j52550j47501J42729J42251J070j47326j16514J33668m9218
23021a73370k38274K3773j1868R6845n644K19155K29234k7538k41030k4784j60205
23010c13706j30001J98674K11297R4543O1771r6621n03p2932j41527j2826o1734
22999b63565P8018R0863k1630O2808n2623N8206J44098k27719r5148r230J3912
22988b22010k35203P2595K35602J49513Q0481m1555J1703P5032o631m2666j5327
22977F1534o2162R8579Q8234o9171r8931r2335J19954R4548J49967j83872p8023
$$ plain form
22966 28322 -93816 4998 167038 242457 110155 -3367 98847 -36315 -182669 -262107
22956 -262107 -273252 -425436 -539795 -453615 -373152 -109810 156829 56679 -72071 -86611
22946 -86611 -92240 68759 16315 -11882 -55593 -244478 -243471 -112946 -32499 -108746 -184863
22935 -184863 -191380 -290360 -362307 -336709 -290757 -78536 40592 -183323 -255706 -212399 -233673
22924 -233673 -209877 -237648 -316821 -301627 -275729 -357655 -413261 -409528 -408746 -391680 -205310 -146528
22912 -146528 -192010 -180940 -174413 -154599 -82551 -64948 -57798 -30060 -239087 -296909 -202538 -144119
22900 -144119 -92827 -163243 -28865 25369 -149518 -183712 -168938 -263903 -222516 -247123 -290687
22889 -290687 -203110 -173706 -145802 -71142 9464 125062 79303 -31447 -19448 -49473 -94569
$$ packed form
22966B8322j22138R8814J62040P5419j32302j13522J02214j35162j46354p9438
22956b62107j1145j52184j14359Q6180Q0463K63342K66639j00150j28750j4540
22946h6611n629J60999n2444k8197m3711j88885J007J30525Q0447p6247p6117
22935a84863o517r8980p1947K5598M5952K12221J19128k23915p2383M3307k1274
22924b33673K3796k7771p9173J5194K5898q1926n5606L733P82J7066J86370N8782
22912a46528m5482J1070O527J9814P2048J7603P150K7738k09027n7822R4371N8419
22900a44119N1292p0416J34378N4234j74887l4194J4774r4965M1387k4607m3564
22889b90687Q7577K9404K7904P4660Q0606J15598m5759j10750J1999l0025m5096
$$ plain form
22878 -94569 77421 252721 166393 24580 74725 108632 -35217 -200234 -146190 -176788 -245055
22867 -245055 -250651 -113316 -191295 -285440 -211932 -67161 66347 134565 96561 63061 163844
22856 163844 137277 187833 250532 -9668 -214486 -248912 -193378 -255085 -272346 -121032 -150339
22845 -150339 -188286 -114212 -160644 -299978 -236062 -139863 -192696 -199872 88763 20968 -147084
22834 -147084 -155383 -133205 -25483 19366 54521 146782 194558 -75050 -136270 -9574 -88366
22823 -88366 -77235 -299088 -504867 -244073 -88027 -39603 -65155 59704 187540 121509
22813 121509 -10232 89745 -22502 -35617 78920 -28322 -30012 -156940 -310417 -401766
22803 -401766 -510545 -595541 -450833 -308233 -299228 39440 279497 314434 133900 -12731
$$ packed form
22878i4569J71990J75300q6328j41813N0145L3907j43849j65017N4044l0598o8267
22867b45055n596J37335p7979r4145P3508J44771J33508O8218l8004l3500J00783
22856A63844k6567N0556O2699k60200k04818l4426N5534o1707j7261J51314k9307
22845a50339l7947P4074m6432j39334O3916R6199n2833p176K88635o7795j68052
22834a47084q299K2178J07722M4849L5155R2261M7776k69608o1220J26696p8792
22823h8366J1131k21853k05779K60794J56046M8424k5552J24859J27836o6031
22813A21509j31741R9977j12247j3115J14537j07242j690j26928j53477r1349
22803d01766j08779q4996J44708J42600R005L38668K40057L4937j80534j46631
$$ plain form
22793 -12731 -102610 -31530 -38062 27130 209931 178021 38685 27721 -107615 -164034 -218761
22782 -218761 -310157 -75458 162214 93398 15899 40644 193866 97510 92427 16993 67371
22771 67371 27636 106841 151485 46262 -65880 -186275 -129133 -21784 219976 303059 211496
22760 211496 212975 100580 62826 5384 -29315 8969 522 8034 -44935 -178807 -261271 -279673
22748 -279673 -252256 -92341 -206302 -246510 26963 171343 160883 33211 -83328 -55076
22738 -55076 -65715 -120219 -19025 108817 -38502 -243456 -353586 -175892 -1464 -137851
22728 -137851 -225442 -4388 -154055 -142423 149874 254677 294609 314616 222116 119034
22718 119034 98019 71578 125890 245135 199943 168266 144942 29806 -41111 -20192 -222464
$$ packed form
22793a2731q9879P1080o532O5192J82801l1910j39336j0964j35336n6419n4727
22782b18761r1396K34699K37672o8816p7499K4745J53222r6356n083p5434N0378
22771F7371l9735P9205M4644j05223j12142j20395N7142J07349K41760Q3083r1563
22760B11496J479j12395l7754n7442l4699L8284q447P512n2969j33872q2464j8402
22748b79673K7417J59915j13961m0208K73473J44380j0460j27672j16539K8252
22738e5076j0639n4504J01194J27842j47319k04954j10130J77694J74428j36387
22728a37851q7591K21054j49667J1632K92297J04803L9932K0007r2500j03082
22718A19034k1015k6441N4312J19245m5192l1677k3324j15136p0917K0919k02272
$$ plain form
22707 -222464 -268573 -65087 24532 -125570 -148754 -86811 -236837 -337004 -285164 -304955 -243835
22696 -243835 -156792 -38717 105457 145637 59962 37733 -114585 -251339 -329772 -489309
22686 -489309 -486763 -429106 -597086 -612042 -541038 -468633 -422744 -349533 -324548 -251475 -266066
22675 -266066 -97879 -15708 -125910 -281064 -406372 -458330 -330090 -425675 -397211 -381622
22665 -381622 -498020 -412672 -328288 -359980 -395954 -136287 96268 131294 -32047 -295812
22655 -295812 -245570 -302951 -326998 -412258 -458064 -250042 -76294 -117347 57064 -59424 -124311
22644 -124311 -60441 -4665 -44820 -203508 -281508 -158505 -69691 13619 -98438 -342358 -399332
22633 -399332 -327346 -450618 -255576 -261708 -335703 -475239 -203526 70862 181766 -75756
$$ packed form
22707b22464m6109K03486Q9619j50102k3184O1943j50026j00167N1840j9791O1120
22696b43835Q7043J18075J44174M0180q5675k2229j52318j36754p8433j59537
22686d89309K546N7657j67980j4956P1004P2405M5889P3211K4985P3073j4591
22675b66066J68187Q2171j10202j55154j25308n1958J28240r5585K8464J5589
22665c81622j16398Q5348Q4384l1692l5974K59667K32555L5026j63341k63765
22655b95812N0242n7381k4047q5260m5806K08022J73748m1053J74411j16488o4887
22644a24311O3870N5776m0155j58688p8000J23003Q8814Q3310j12057k43920n6974
22633c99332P1986j23272J95042o132p3995j39536K71713K74388J10904k57522
$$ plain form
22623 -75756 -95459 -121946 -87607 63961 186734 -92318 -354517 -399398 -413865 -409888 -465545
22612 -465545 -242661 29394 -29986 -284299 -475723 -451168 -358318 -302570 -448211 -492561
22602 -492561 -469781 -444227 -291187 -284459 -142315 -230775 -272528 -191486 -109020 -4964 -9571
22591 -9571 -77475 -168952 -156102 -150463 -271348 -206326 -120821 -329742 -334176 -91193 -58942 -101684
22579 -101684 -52764 -44293 -235140 -181889 -55531 82795 78605 -63690 25900 75162 29252
22568 29252 7191 178422 196000 -28440 -87874 -80267 -34161 -180007 -293634 -141357 -60853
22557 -60853 -52861 -280234 -266153 -89746 10984 -216536 -431158 -442958 -480168 -416457 -326103
22546 -326103 -178229 -110970 -162371 -174548 -159710 -344084 -380756 -186864 -146602 -167255 -86458
$$ packed form
22623g5756j9703k6487L4339J51568J22773k79052k62199m4881j4467L977n5657
22612d65545K22884K72055n9380k54313j91424K4555R2850N5748j45641m4350
22602d92561K2780K5554J53040O728J42144q8460m1753Q1042Q2466J04056m607
22591i571o7904r1477J2850N639j20885O5022Q5505k08921m434K42983L2251m2742
22579a01684M8920Q471j90847N3251J26358J38326m190j42295Q9590M9262m5910
22568B9252k2061J71231J7578k24440n9434P607M6106j45846j13627J52277Q0504
22557f0853P992k27373J4081J76407J00730k27520k14622j1800l7210O3711R0354
22546c26103J47874O7259n1401j2177J4838j84374l6672J93892M0262k0653Q0797
$$ plain form
22535 -86458 -73732 -9687 -72470 -226381 -194901 -293205 -220598 -300128 -397377 -327560 -209220
22524 -209220 -183225 -114197 -237461 -330565 -348131 -572166 -522512 -438966 -420675 -246321 -155090
22513 -155090 -168508 -235190 -270103 -216970 -54546 34323 7948 139286 137759 -67495 -33777
22502 -33777 -134689 -117041 -60430 102176 -178299 -319007 -403839 -325925 -150925 -239218 -235142
22491 -235142 -121499 -49934 -26418 -13768 -130966 -177518 -25999 -57043 -310044 -491372
22481 -491372 -449352 -406345 -256343 -218318 -246167 -212890 -310785 -504174 -450070 -407820 -272246
22470 -272246 -320885 -322043 -301085 -440482 -381371 -405989 -177592 -112760 -126262 -110458 -100990
22459 -100990 -11204 40937 23900 -91737 -218894 -133589 29928 37834 -124196 -295520 -272837
$$ packed form
22535h6458J2726O4045o2783j53911L1480r8304P2607p9530r7249O9817J18340
22524b09220K5995O9028j23264r3104j7566k24035M9654Q3546J8291J74354R1231
22513a55090j3418o6682l4913N3133J62424Q8869k6375J31338j527k05254L3718
22502c3777j00912J7648N6611J62606k80475j40708q4832P7914J75000q8293M076
22491b35142J13643P1565K3516J2650j17198m6552J51519l1044k53001j81328
22481d91372M2020M3007J50002L8025k7849L3277r7895j93389N4104M2250J35574
22470b72246m8639j158K0958j39397N9111k4618K28397O4832j3502J5804R468
22459a00990Q9786N2141j7037j15637j27157Q5305J63517P906j62030j71324K2683
$$ plain form
22448 -272837 -376287 -272521 -111099 -299948 -311764 -151617 -109229 -151865 -268780 -162148
22438 -162148 -208988 -117076 26497 180327 29737 33952 -112984 -210362 -79335 -1777 -119012
22427 -119012 -105369 -208095 -68952 -53334 -333208 -281534 -297862 -414393 -407269 -171885 2065
22416 2065 -180164 -242712 -239762 -183258 -87787 -180990 -74890 -3748 26189 -183733 -266996
22405 -266996 -269500 -337079 -409044 -359103 -306168 -309783 -462930 -456574 -345330 -144498 -140739 -223060
22393 -223060 -187550 -278595 -272305 -193091 -72711 -159686 -357310 -24412 220569 123247 175057
22382 175057 202706 174901 -94868 67841 97489 -115706 -321876 -353953 -470778 -503236
22372 -503236 -235643 -47275 -109927 -87287 139695 9563 -315327 -318723 -298783 -280167 -160702
$$ packed form
22448b72837j03450J03766J61422j88849j1816J60147M2388m2636j16915J06632
22438a62148m6840R1912J43573J53830j50590M215j46936r7378J31027P7558j17235
22427a19012J3643j02726J39143J5618k79874N1674j6328j16531P124K35384J73950
22416B065j82229o2548K950N6504R5471r3203J06100P1142K9937k09922q3263
22405b66996k504o7579p1965M9941N2935l615j53147O356J11244K00832L759q2321
22393b23060L5510r1045O290P9214J20380q6975j97624L32898K44981r7322N1810
22382A75057K7649k7805k69769J62709K9648k13195k06170l2077j16825l2458
22372e03236K67593J88368o2652K2640K26982j30132l24890l396J9940J8616J19465
$$ plain form
22361 -160702 -43362 -57536 -189402 -200943 -156060 -264249 46485 243582 237853 257850 157211
22350 157211 -42399 -3982 120702 31167 -31999 -32940 -30759 -246350 -351142 -341328 -549394
22339 -549394 -534729 -512434 -266342 -16262 48546 -52915 -87436 -287716 -148262 -116078
22329 -116078 -94814 -46967 -28811 132397 153821 176531 193118 157519 110725 185203 78391
22318 78391 -173121 -324846 -371199 -427009 -547310 -665203 -486637 -182547 -229405 -156847
22308 -156847 -201528 -118009 -154019 40834 119437 163832 167843 235066 230004 233505 195004 -43368
22296 -43368 -57245 -165858 -254019 -281856 -205223 397 47776 90964 -3843 -244714 -302117
22285 -302117 -226931 -184671 -127029 -68770 88320 -53073 -182926 -243845 -263124 -348804 -262434
$$ packed form
22361a60702J17340j4174j31866j1541M4883j08189L10734J97097n729J9997j00639
22350A57211j99610L8417J24684q9535o3166r41K181k15591j04792R814k08066
22339e49394J4665K2295K46092K50080O4808j01461l4521k00280J39454L2184
22329a16078K1264M7847J8156J61208K1424K2710J6587l5599m6794P4478j06812
22318G8391k51512j51725m6353n5810j20301j17893J78566L04090m6858P2558
22308a56847m4681Q3519l6010J94853P8603M4395M011O7223n062L501l8501k38372
22296d3368j3877j08613q8161k7837P6633K05620M7379M3188r4807k40871n7403
22285c02117P5186M2260N7642N8259J57090j41393j29853o0919j9279q5680Q6370
$$ plain form
22274 -262434 -294022 -148368 85084 17308 -130867 -187211 -308776 -431581 -394743 -361952
22264 -361952 -434039 -545532 -392094 -208524 -147104 -178604 -364469 -285714 -99699 -117154
22254 -117154 39259 281721 425511 292700 125485 78232 -127040 -107600 -202555 -194640
22244 -194640 -43672 18768 -76756 -128937 58004 134101 -94224 -119518 -193126 -97220 54265
22233 54265 11222 -16170 31795 160259 187596 54065 -60854 141708 137586 123733 106665
22222 106665 -130186 -247369 -106348 -39484 -102068 -163928 -189530 -266777 -249205 -245508 -320790
22211 -320790 -365938 -365382 -416744 -404331 -199130 -162361 -134040 5916 -142463 -275779 -200566
22200 -200566 -56698 158377 333406 283524 274601 64105 -86760 123970 269131 135715
$$ packed form
22274b62434l1588J45654K33452o7776j48175n6344j21565j22805L6838L2791
22264c61952p2087j11493J53438J83570O1420l1500j85865P8755J86015j7455
22254a17154J56413K42462J43790j32811j67215m7253k05272J9440r4955P915
22244a94640J50968O2440r5524n2181J86941P6097k28325k5294p3608R5906J51485
22233E4265m3043k7392M7965J28464K7337j33531j14919K02562m122j3853j7068
22222A06665k36851j17183J41021O6864o2584o1860k5602p7247J7572L697p5282
22211c20790m5148N56n1362J2413K05201L6769K8321J39956j48379j33316P5213
22200b00566J43868K15075J75029m9882q923k10496j50865K10730J45161j33416
$$ plain form
22190 135715 -61185 -307957 -268710 -204816 -159623 -234073 -297794 -291899 -437695 -454700 -405966
22179 -405966 -354597 -190412 -7305 147342 -121772 -228756 -208076 -229432 -419203 -330784
22169 -330784 -333628 -375176 -269154 -231760 -237797 -239762 -227554 -126852 -23667 -76236 -246624
22158 -246624 -190516 -230526 -516797 -547204 -142681 -35445 19480 -59451 -165462 -181865 -184713
22147 -184713 -83736 -188608 -294853 -345812 -317100 -244711 -221605 -21164 55146 31333 126086
22136 126086 223821 123114 9928 81123 192734 287648 123805 -124383 10091 7775
22126 7775 -44507 -98714 -90018 -82492 -36039 -59040 -75957 -215230 -216267 -105337 -10292 197116
22114 197116 198280 -85108 -135282 -123579 -71876 -85850 -275523 -253300 -198927 -37680 103091
$$ packed form
22190A35715j96900k46772L9247O3894M5193p4450o3721N895j45796j7005M8734
22179d05966N1369J64185J83107J54647k69114j06984K0680k1356j89771Q8419
22169c30784k844m1548J06022L7394o037j965J2208J00702J03185n2569j70388
22158b46624N6108m0010k86271l0407M04523J07236N4925p8931j06011j6403k848
22147a84713J00977j04872j06245n0959K8712P2389K3106K00441P6310k3813R4753
22136A26086R7735j00707j13186P1195J11611R4914j63843k48188J34474k316
22126G775n2282n4207Q696P526M6453k3001j6917j39273j037J10930R5045K07408
22114A97116J164k83388n0174J1703N1703j3974j89673K2223N4373J61247J40771
$$ plain form
22103 103091 123288 4256 -30707 -134478 -193650 -67879 -126036 -121175 107789 249793 165461
22092 165461 346155 352842 137083 113791 119096 132112 79076 60135 -27134 -159933 -160214 -68904
22080 -68904 112971 179316 -38405 -71611 -152179 -35785 -29013 -112124 -74225 46543 43198
22069 43198 52466 -70682 -242763 -48271 166643 -55516 -113915 130435 126726 99592 106740
22058 106740 49826 25914 105213 -99784 -20855 140444 51515 6826 -20447 17725 115291
22047 115291 172660 -25199 6510 62704 47210 -82273 64469 -70930 -145838 -89367 58056
22036 58056 158492 -60600 -92747 -174526 -307975 -194035 -235545 -477299 -411270 -292011
22026 -292011 -33705 35185 -101677 -471830 -463225 -383575 -62364 9971 20621 6257 26810
$$ packed form
22103A03091K0197j19032l4963j03771n9172J25771n8157M861K28964J42004q4332
22092A65461J80694O687k15759k3292N305J3016n3036j8941q7269j32799k81R1310
22080f8904J81875O6345k17721l3206q0568J16394O772q3111L7899J20768l345
22069D3198R268j23148j72081J94492K14914k22159n8399K44350l709k7134P148
22058A06740n6914k3912P9299k04997P8929J61299q8929m4689k7273L8172R7566
22047A15291N7369j97859L1709N6194j5494j29483J46742j35399p4908N6471J47423
22036E8056J00436k19092l2147q1779j33449J13940m1510k41754O6029J19259
22026b92011K58306O8890j36862l70153Q605P9650L21211P2335J0650j4364K0553
$$ plain form
22015 26810 -103965 -220467 -67482 -177135 -252903 -134829 -212500 -251047 -226119 -129177 -41960
22004 -41960 -83132 -252617 -241549 -399000 -504830 -368506 -336322 -267724 -40354 -136464 -447498
21993 -447498 -292914 -226593 -118387 57426 315328 303553 102120 -76422 -57060 -147396
21983 -147396 -39182 -86887 -171870 -110123 -138334 -260662 -183554 -298925 -132759 -97913 -334969
21972 -334969 -399015 -481569 -329774 -206582 -115761 -162352 -266798 -388450 -202159 -79603
21962 -79603 -245158 -237772 -226277 -147032 -86012 -172134 -196089 -239443 -305313 -376756 -358062 -299658
21950 -299658 -331442 -231379 155773 148065 74983 3552 -63418 -89196 -7907 17993 24716
21939 24716 57540 -15101 -112641 -289758 -234351 -76454 -19801 -178225 -250031 -214991 -155876
$$ packed form
22015B6810j30775j16502J52985j09653p5768J18074p7671l8547K4928R6942Q7217
22004d1960m1172j69485J1068j57451j05830J36324L2184O8598K27370r6110l11034
21993d47498J54584O6321J08206J75813K57902j1775k01433j78542J9362r0336
21983a47396J08214m7705q4983O1747k8211j22328P7108j15371J66166L4846k37056
21972c34969o4046q2554J51795J23192R0821m6591j04446j21652J86291J22556
21962g9603j65555P386J1495P9245O1020q6122k3955m3354o5870p1443J8694N8404
21950b99658l1784J00063L87152p708p3082p1431o6970k5778Q1289K5900O723
21939B4716L2824p2641r7540j77117N5407J57897N6653j58424p1806L5040N9115
$$ plain form
21928 -155876 -78841 -76293 -99555 -290059 -405220 -483259 -280966 33095 311810 262504 120465
21917 120465 30131 -204955 -339601 -353192 -75553 -79808 99261 230337 95108 -46527
21907 -46527 -303470 -258877 -152346 -70989 -276892 -395588 -331771 -139512 49691 223546
21897 223546 110247 -99459 -297869 -260441 10247 -35320 -48239 57804 -99396 -206813
21887 -206813 -195003 -329996 -357646 -424052 -271371 -206274 -201292 -329300 -215916 -136408 -184431
21876 -184431 -311466 -290605 -276541 -481501 -493179 -283367 -146270 -167428 -2440 100660
21866 100660 74971 45920 13999 -24524 -59298 -78398 -66903 -56209 -52487 -49582 27466 -21802
21854 -21802 -77213 -136759 -47571 -85814 -194099 -92157 46627 -141226 -354272 -408579 -260458
$$ packed form
21928a55876P7035K548k3262j90504j15161p8039K02293L14061K78715m9306j42039
21917A20465r0334k35086j34646j3591K77639m255J79069J31076j35229j41635
21907d6527k56943M4593J06531Q1357k05903j18696O3817J92259J89203J73855
21897B23546j13299k09706j98410L7428K70688m5567j2919J06043j57200j07417
21887b06813J1810j34993k7650o6406J52681O5097M982j28008J13384P9508m8023
21876a84431j27035K0861J4064k04960j1678K09812J37097k1158J64988J03100
21866A00660k5689k9051l1921l8523l4774j9100J1495J0694L722K905P7048m9268
21854b1802n5411n9546Q9188l8243j08285J01942J38784j87853k13046n4307J48121
$$ plain form
21843 -260458 -135266 -30628 -10505 -182982 -194229 -146645 32831 -183625 -146603 -36718
21833 -36718 -152678 -154019 -11733 177293 182995 -12597 -65466 -26262 -32201 -107002 -43289
21822 -43289 -128815 -420045 -479724 -533096 -455130 -82646 64254 1526 -250458 -242005 -58445
21811 -58445 -77082 -60567 -44303 68185 -36022 -311680 -196913 -239160 -305242 -272971 -252332
21800 -252332 -161777 2708 48139 -195372 -412452 -247701 -355873 -536517 -571909 -387750
21790 -387750 -331751 -196781 -250553 -158100 -87433 -153760 -244395 -92366 12617 -231712 -211211
21779 -211211 -207202 -354640 -237994 -95543 -2157 -118074 -314010 -263241 -183758 -9889
21769 -9889 202153 308944 301901 150079 30033 132698 167283 -9278 -153380 -279266
$$ packed form
21843b60458J25192J04638K0123j72477j1247M7584J79476k16456L7022J09885
21833c6718j15960j341J42286J89026N702j95592n2869L9204n939p4801O3713
21822d3289q5526k91230n9679n3372P7966L72484J46900o2728k51984Q453J83560
21811e8445j8637J6515J6264J12488j04207k75658J14767m2247o6082L2271K0639
21800b52332R0555J64485M5431k43511k17080J64751j08172j80644l5392J84159
21790c87750N5999J34970n3772R2453P0667o6327r0635J52029J04983k44329K0501
21779b11211M009j47438J16646J42451R3386j15917j95936N0769P9483J73869
21769i889K12042J06791p043j51822j20046J02665L4585j76561j44102j25886
$$ plain form
21759 -279266 -267914 -336800 -443277 -568737 -324767 -111348 -30377 -83264 -105495 128733
21749 128733 215984 58426 -70504 -349173 -194242 89828 37401 -226339 -256893 -157405
21739 -157405 -240536 -375409 -350217 -199092 -279161 -274017 -277076 -369141 -300408 -304894 -269227 -201299
21727 -201299 -249882 -93350 101082 190957 184995 237934 174635 -52478 -246134 -381189 -433536
21716 -433536 -337984 -335085 -353989 -416530 -438696 -191989 17033 113198 248012 219700 102687
21705 102687 -59302 -353345 -489748 -499407 -266206 58845 103242 147797 141208 244904 189963
21694 189963 -111639 -296083 -165518 -257597 -147421 -55885 -87651 -37362 -9747 -106755 -76259
21683 -76259 -93406 -275441 -382046 -339462 -263746 -110793 -16446 -148078 -213670 -151285 -210094
$$ packed form
21759b79266J1352o8886j06477j25460K43970K13419Q0971n2887k2231K34228
21749A28733Q7251j57558j28930k78669J54931K84070n2427k63740l0554R9488
21739a57405q3131j34873K5192J51125q0069N144l059r2065O8733m486L5667O7928
21727b01299m8583J56532J94432Q9875n962N2939o3299k27113j93656j35055n2347
21716d33536R5552K899j8904o2541k2166K46707K09022R6165J34814k8312j17013
21705A02687j61989k94043j36403r659K33201L25051M4397M4555o589J03696n4941
21694A89963l01602j84444J30565r2079J10176R1536l1766N0289K7615r7008L0496
21683g6259j7147j82035j06605M2584P5716J52953R4347j31632o5592O2385n8809
$$ plain form
21672 -210094 -180018 -133475 39510 58432 -37409 34369 -68445 -84540 145212 119942 115008
21661 115008 220360 203173 305299 202817 57884 -129738 -97264 13042 -1832 -125559
21651 -125559 -98934 -91377 -57587 333 139200 204191 180799 82939 52924 -135686 -35832
21640 -35832 -114039 -115559 -14667 -17819 -14530 26954 -169148 -73201 128686 253098 72328
21629 72328 78820 112247 127031 -51177 -93564 21240 134978 219726 100878 -7061 82753
21618 82753 107653 178444 132887 180575 171798 135269 53105 139660 105540 35280 -68960 129680
21606 129680 140916 -12177 -181340 -163711 -130533 -82935 -28030 39647 -62023 -202283 -188101
21595 -188101 -171739 25998 62466 114966 138603 -430 -7024 172796 202940 177016 -4483
$$ packed form
21672b10094L0076M6543J72985J8922r5841P1778j02814j6095K29752k5270m934
21661A15008J05352j7187J02126j02482j44933j87622L2474J10306j4874j23727
21651a25559K6625P557L3790N7920J38867O4991k3392r7860l0015j88610R9854
21640c5832p8207j520J00892l152L289M1484j96102R5947K01887J24412j80770
21629G2328O492L3427J4784j78208m2387J14804J13738Q4748j18848j07939Q9814
21618H2753K4900P0791m5557M7688q777l6529q2164Q6555l4120p0260j04240J98640
21606A29680J1236j53093j69163J7629L3178M7598N4905O7677j01670j40260J4182
21595a88101J6362J97737L6468N2500K3637j39033o594J79820L0144k5924j81499
$$ plain form
21584 -4483 -138145 -97006 21959 230036 177087 120423 55581 -234915 -271873 -300265 -138985
21573 -138985 129834 35235 49842 -73001 -83094 -126784 -112034 1818 84968 -66737 -218137
21562 -218137 -192543 -71015 -124364 -247632 -142489 -63807 -148921 -227096 -87877 8242 120009
21551 120009 146585 -148842 -180081 63847 64906 100093 93980 46873 -125757 -224773 -263322
21540 -263322 -321528 -262869 80873 203915 51653 -78015 -166316 -144609 -45381 -119662 32979
21529 32979 -65386 -175097 -329258 -230025 -308943 -350256 -205842 -121900 -99823 40944 93566
21518 93566 -121088 -162971 -257409 -178032 -216691 -218771 -205340 -349851 -457244 -511510 -302610
21507 -302610 -266568 -348378 -458469 -357102 -311263 -372400 -352901 -231018 -224380 -241140 -162266
$$ packed form
21584d483j33662M1139J18965K08077n2949n6664o4842k90496l6958k8392J61280
21573a38985K68819r4599J4607j22843j0093m3690J4750J13852Q3150j51705j51400
21562b18137K5594J21528n3349j23268J05143P8682q5114p8175J39219R6119J11767
21551A20009K6576k95427l1239K43928J059L5187o113m7107j72630r9016l8549
21540b63322n8206N8659L43742J23042j52262j29668q8301K1707R9228p4281J52641
21529C2979r8365j09711j54161R9233p8918m1313J44414Q3942K2077J40767N2622
21518I3566k14654m1883r4438P9377l8659k080J3431j44511j07393n4266K08900
21507c02610L6042q1810j10091J01367M5839o1137J9499J21883O638j6760P8874
$$ plain form
21496 -162266 -184912 -234164 -107846 33854 109328 -38308 -46 73090 127513 114964 130924
21485 130924 222855 261001 50846 -173776 -163537 21760 -129837 -110101 -23290 201373
21475 201373 184939 85316 75690 236969 269503 56646 -144095 -128149 -36670 63726 133196
21464 133196 -59887 -135327 28492 -161276 -423705 -566124 -538857 -534381 -267973 76115
21454 76115 5631 -184433 -111251 12963 -33904 -135443 5698 35508 -44924 -47579 25165
21443 25165 6879 -51769 189540 251130 154108 110081 169023 137422 -11483 -60921 -83710
21432 -83710 101555 158159 61402 173521 247704 72018 -30707 -106723 91579 217213
21422 217213 177291 60218 -116034 -18616 21878 -15577 137299 73549 62674 49701 85771
$$ packed form
21496a62266k2646m9252J26318J41700P5474j47636L8262P3136N4423j2549J5960
21485A30924R1931L8146k10155k24622J0239J85297j51597J9736Q6811K24663
21475B01373j6434r9623r626J61279L2534k12857k00741J5946R1479J00396O9470
21464A33196j93083p5440J63819j89768k62429j42419K7267M476K66408L44088
21454G6115p0484j90064P3182J24214m6867j01539J41141K9810q0432k655P2744
21443B5165j8286n8648K41309O1590r7022m4027N8942l1601j48905m9438k2789
21432h3710J85265N6604r6757J12119P4183j75686j02725p6016J98302J25634
21422B17213l9922j17073j76252R7418M0494l7455J52876o3750j0875j2973L6070
$$ plain form
21411 85771 275192 263216 216511 178227 211605 269580 281300 242608 82988 228578 216075
21400 216075 -82706 -93376 -36995 -60702 -2158 62005 74256 129580 263044 234043 234734
21389 234734 273168 -26746 -184756 -157089 26396 97618 157962 244009 521267 571226 461611
21378 461611 596567 846817 1112185 1412737 1429034 1417267 1517130 1343048 1259390 1461160
21368 1461160 1300383 1083762 850548 643551 554717 573433 580786 702051 954742 1019967
21358 1019967 1079528 1007108 857367 813739 677546 652291 977839 800553 386088 94396
21348 94396 64266 148497 198534 275138 125530 -31649 -109709 -38608 75825 98783 224999
21337 224999 287194 108715 -147403 -256582 -243751 -332391 -93809 109821 99732 39793
$$ packed form
21411H5771J89421j1976m6705l8284L3378N7975J1720l8692j59620J45590j2503
21400B16075k98781j0670N6381k3707N8544O4163J2251N5324J33464k9001O91
21389B34734L8434k99914j58010K7667J83485P1222O0344Q6047K77258M9959j09615
21378D61611J34956K50250K65368L00552J6297j1767R9863j74082q3658K01770
21368A461160j60777k16621k33214k06997q8834J8716P353J21265K52691O5225
21358A019967N9561p2420j49741m3628j36193k5255L25548j77286m14465k91692
21348I4396l0130Q4231N0037P6604j49608j57179p8060P1101J14433K2958J26216
21337B24999O2195j78479k56118j09179J2831q8640K38582K03630j0089n9939
$$ plain form
21327 39793 69468 206224 338862 325860 248271 151928 115749 130365 168544 285819 317972
21316 317972 262240 77623 230296 230826 219065 21425 -96975 -42371 -32029 -176326 -269611
21305 -269611 -23146 53738 37544 29286 -143163 -151807 210175 429357 388733 269295 261810
21294 261810 123886 12369 37221 78099 22855 -110758 -14970 68457 513 146555 229117
21283 229117 -74866 -10486 601 87328 247138 326681 238152 93216 -13549 -203790
21273 -203790 -62686 146463 165883 156277 50057 42244 58400 118876 153387 -161963 -192241
21262 -192241 -88984 -7978 -37394 -116085 -185922 -192906 -232421 -162450 -157616 -226371 -376836
21251 -376836 -341111 -222058 -282672 -42907 216009 173646 8961 -215249 -129880 -82621
$$ packed form
21327C9793K9675J36756J32638j3002p7589r6343l6179J4616L8179J17275L2153
21316C17972n5732j84617J52673N30j1761j97640j18400N4604J0342j44297r3285
21305b69611K46465P6884j6194q258j72449q644L61982K19182m0624j19438p485
21294B61810j37924j11517K4852M0878n5244j33613R5788Q3427o7944J46042Q2562
21283B29117l03983O4380J1087Q6727J59810P9543q8529j44936j06765j90241
21273b03790J41104K09149J9420r606j06220p813J6156O0476L4511l15350l0278
21262a92241J03257Q1006k9416p8691o9837o984l9515O9971M834o8755j50465
21251c76836L5725J19053o0614K39765K58916m2363j64685k24210Q5369M7259
$$ plain form
21241 -82621 -226099 -13023 50250 137180 210848 231929 222982 269832 193786 83259 -168576
21230 -168576 -251546 -163678 -98816 11069 262288 380168 266977 257771 84635 -105585
21220 -105585 -306396 -302020 -192901 -8139 45304 -6845 43347 56813 -100109 -146305 -3537
21209 -3537 35523 -95853 -144664 -86029 134585 133351 29042 74065 172682 97418 -8916
21198 -8916 -9420 95041 134868 20293 8171 29987 249488 447226 501257 378257 298810
21187 298810 162650 82718 147128 228035 92242 193496 271610 381491 342731 34592
21177 34592 57496 92075 160678 185621 6086 24550 110717 193649 35802 -72754 -90997
21166 -90997 -217053 -146624 -191102 -123442 104368 191415 105255 -40734 9102 107486 283719
$$ packed form
21241h2621j43478K13076O3273Q6930P3668K1081q947M6850p6046j10527k51835
21230a68576q2970Q7868O4862J09885K51219J17880j13191r206j73136j90220
21220a05585k00811M376J09119J84762N3443n2149N0192J3466j56922m6196J42768
21209c537L9060j31376m8811N8635K20614j234j04309M5023R8617p5264j06334
21198h916n04J04461L9827j14575j2122K1816K19501J97738N4031j23000p9447
21187B98810j36160p9932O4410Q0907j35793J01254P8114J09881l8760l08139
21177C4592K2904L4579O8603K4943j79535J8464Q6167Q2932j57847j08556j8243
21166i0997j26056P0429m4478O7660K27810Q7047q6160j45989M9836R8384J76233
$$ plain form
21155 283719 286457 84357 -72055 -37982 6642 94397 119843 -93326 -93716 14972 -120649
21144 -120649 12762 108862 -78100 -117597 -103992 11228 35279 -8242 83520 97374 91428
21133 91428 264892 308310 408669 285502 26766 -158437 -256836 -170710 -169460 -316023 -349992
21122 -349992 -322484 -263407 -250587 -29566 70205 198578 241050 133531 45919 -38695 33066
21111 33066 242337 355323 379523 133077 -74732 -156864 -179559 -202661 -38186 134698
21101 134698 266836 112229 19938 72874 49860 5818 -23682 128014 -9584 -155828
21091 -155828 -20868 88483 152629 256981 246641 230084 244584 194370 -97020 -317528
21081 -317528 -320559 -13507 98716 96250 209502 226351 56126 36522 4252 242952 334383
$$ packed form
21155B83719K738k02100j56412L4073M4624Q7755K5446k13169l90J08688j35621
21144a20649J33411R6100j86962l9497J3605J15220K4051m3521R1762J3854n946
21133I1428J73464M3418J00359j23167k58736j85203r8399Q6126J250j46563l3969
21122c49992K7508N9077J2820K21021R9771J28373M2472j07519q7612q4614P1761
21111C3066K09271J12986K4200k46446k07809q2132k2695k3102J64475J72884
21101A34698J32138j54607r2291N2936k3014m4042k9500J51696j37598j46244
21091a55828J34960J09351O4146J04352j0340j6557J4500n0214k91390k20508
21081c17528l031L07052J12223k466J13252J6849j70225j9604l2270K38700R1431
$$ plain form
21070 334383 283728 261482 254442 80661 139332 183598 361224 468349 478776 405485 474840
21059 474840 518738 543295 403123 211544 226762 390139 392739 336964 298731 270332 264564
21048 264564 345098 469118 374029 404365 477775 505099 296912 184758 307741 276512 230942
21037 230942 377144 403161 385236 427259 416802 441659 503918 502116 239579 113011 331758
21026 331758 545204 419553 377800 460577 378261 135913 -49125 70446 203899 171557
21016 171557 249983 350482 307403 321816 405267 371595 442004 455943 450168 371575 305307
21005 305307 433594 451070 533418 568416 367747 395219 475048 647931 712516 566486 346987
20994 346987 498015 534881 570811 750942 796285 789934 678537 410658 487594 532760 503459
$$ packed form
21070C34383n0655k2246p040j73781N8671M4266J77626J07125J0427p3291O9355
21059D74840M3898K4557j40172j91579J5218J63377K600n5775l8233k8399n768
21048B64564Q0534J24020r5089L0336P3410K7324k08187j12154J22983l1229m5570
21037B30942J46202K6017j7925M2023j0457K4857O2259j802k62537j26568K18747
21026C31758K13446j25651m1753Q2777q2316k42348j85038J19571J33453l2342
21016A71557P8426J00499m3079J4413Q3451l3672P0409J3939n775p8593o6268
21005C05307J28287J7476Q2348L4998k00669K7472P9829J72883O4585j46030k19499
20994C46987J51028L6866L5930J80131M5343o351j11397k67879P6936M5166k9301
$$ plain form
20983 503459 500693 472235 534897 705895 688573 549880 534757 577593 626004 662460 510277
20972 510277 425254 552869 716427 611746 678483 654762 481390 487724 524645 638597 677264
20961 677264 725764 704403 811737 756251 613566 523066 304823 301071 531557 703078 673115
20950 673115 504742 137170 234472 473234 524008 658220 700888 674853 679316 819686 823980
20939 823980 996928 1170020 1064490 979665 966964 874668 740110 712914 567893 572434 771438
20928 771438 934441 941704 980973 821294 564523 507973 710032 775269 855648 955142 1080273
20917 1080273 1012156 777559 954694 1065645 1044753 1015257 987769 1086676 1239054 1271373
20907 1271373 1204444 1111713 927088 848720 900825 1057534 967873 1080907 980795 1062853
$$ packed form
20983E03459k766k8458O2662J70998j7322j38693j5123M2836M8411L6456j52183
20972E10277q5023J27615J63558j04681O6737k3721j73372O334L6921J13952L8667
20961F77264M8500k1361J07334n5486j42685r0500k18243l752K30486J71521k9963
20950F73115j68373l67572R7302K38762N0774J34212M2668k6035M463J40370M294
20939H23980J72948J73092j05530q4825j2701r2296j34558k7196j45021M541J99004
20928G71438J63003P263L9269j59679k56771n6550K02059O5237Q0379R9494J25131
20917A080273o8117k34597J77135J10951k0892k9496k7488R8907J52378L2319
20907A271373o6929r2731j84625p8368N2105J56709q9661J13034j00112Q2058
$$ plain form
20897 1062853 1134622 1301773 1323614 1386942 1291228 1152555 1313253 1399369 1544093 1558228
20887 1558228 1487187 1723321 1661474 1684374 1843594 1935810 1988248 2013040 1816921 1629820
20877 1629820 1625042 1573536 1645509 1823884 2015598 2102778 2121546 2377860 2578174 2552715 2705771
20866 2705771 2832634 3080459 3115667 2951130 2951324 3104095 3433128 3582233 3771808 3862899
20856 3862899 4045352 4375952 4458345 4500001 5004541 5449467 5763524 6164792 6559279 6755459
20846 6755459 6789960 7252092 7669500 7913272 8237165 8752738 9194952 9576570 10139558 10642401
20836 10642401 11281942 12075959 13057490 14031703 15120119 16451874 17839015 19050645 20761499
20827 20761499 22856705 25261620 28377645 32288586 37797312 44439250 53084660 64824053
$$ packed form
20897A062853P1769J67151K1841O3328r5714j38673J60698Q6116J44724J4135
20887A558228p1041K36134o1847K2900J59220R2216N2438K4792j96119j87101
20877A629820m778n1506P1973J78375J91714Q7180J8768K56314K00314k5459J53056
20866B705771J26863K47825L5208j64537J94J52771L29033J49105J89575R1091
20856C862899J82453L30600Q2393M1656N04540M44926L14057M01268L94487J96180
20846F755459L4501M62132M17408K43772L23893N15573M42214L81618N62988N02843
20836A0642401O39541P94017R81531R74213J088416J331755J387141J211630J710854
20827B0761499K095206K404915L116025L910941N508726O641938Q645410J1739393
$$ plain form
20819 64824053 80764682 101934881 128080966 157002292 182943502 199974484 206978932
20812 206978932 209422049 213055224 218093721 218351728 208124560 188236766 166624664 151147290
20804 151147290 145671361 150218309 164088385 184879460 206541364 220427972 222455204
20797 222455204 216747255 210711954 207309439 202834844 190338184 166754495 136783797
20790 136783797 107777664 84236913 66735827 54034599 44786274 37564420 32194578
20783 32194578 27875709 24551316 21894273 19586333 17686283 16158482 14822474 13789759
20775 13789759 12820117 11603719 10678525 9982570 9261339 8457553 7813463 7197882 6729103
20766 6729103 6302977 5830219 5694103 5659647 5467956 5080071 4711238 4299535 3891634 3664048
$$ packed form
20819F4824053J5940629K1170199K6146085K8921326K5941210J7030982P004448
20812B06978932K443117L633175N038497K58007j0227168j9887794k1612102j5477374
20804A51147290n475929M546948J3870076K0791075K1661904J3886608K027232
20797B22455204n707949o035301l402515m474595j2496660k3583689k9970698
20790A36783797k9006133k3540751j7501086j2701228r248325p221854n369842
20783C2194578m318869l324393k657043k307940j900050j527801j336008j032715
20775A3789759r69642j216398r25194o95955p21231q03786o44090o15581m68779
20766F729103m26126m72758j36116l4456j91691l87885l68833m11703m07901k27586
$$ plain form
20756 3664048 3342751 2946910 2844581 2642476 2639009 2463723 2408224 2216107 2104349 2005524
20746 2005524 2253914 2332052 2105250 1988294 1713802 1621213 1670827 1620220 1474125 1123522
20736 1123522 999733 980998 1096996 1009004 1097240 1259979 1073569 978827 893920 945789
20726 945789 885866 745948 704264 853222 1021985 1053342 877264 851815 969849 893517
20716 893517 807735 998601 1014393 862903 582142 662358 793357 703656 483257 348470
20706 348470 312258 371177 463653 485190 468027 344356 345387 578106 528192 437063 182704
20695 182704 -13974 35845 225104 386395 322912 294014 335098 486120 466973 371780 329850
20684 329850 265938 189109 522190 936651 1126881 1211173 1219758 1315055 1245346 1173969 990994
$$ packed form
20756C664048l21297l95841j02329k02105l467j75286n5499j92117j11758r8825
20746B005524K48390P8138k26802j16956k74492r2589M9614n0607j46095l50603
20736A123522j23789j8735J15998q7992Q8236J62739j86410r4742q4907N1869
20726I45789n9923j39918m1684J48958J68763L1357j76078k5449J18034p6332
20716H93517q5782J90866J5792j51490k80761Q0216J30999q9701k20399j34787
20706C48470l6212N8919R2476K1537j7163j23671J031K32719m9914r1129k54359
20695A82704j96678M9819J89259J61291o3483k8898M1084J51022j9147r5193m1930
20684C29850o3912p6829L33081M14461J90230Q4292Q585R5297o9709p1377j82975
$$ plain form
20673 990994 948437 938018 857524 740981 746906 600526 565145 591914 748130 956499 960585
20662 960585 937137 934246 1092731 1160431 956588 1021959 1001629 1018543 756960 468302 398928
20651 398928 401753 299498 146013 99397 158372 170171 130214 63195 22455 136422 245953
20640 245953 278929 199489 72430 149325 168351 190557 323600 329584 240530 98623 -2735
20629 -2735 18036 116014 54869 87457 296295 165965 42209 -88844 -142485 -180958 -39869
20618 -39869 -118124 -184110 -37585 33393 -88914 -12145 130377 105745 184719 159037 3281
20607 3281 -57672 41723 130230 79836 36975 94521 128346 -619 56328 160775 32371
20596 32371 -11146 -24903 -6424 70949 120586 99482 -4556 68431 120094 135272 -15482
$$ packed form
20673I90994m2557j0419q0494j16543N925j46380l5381K6769J56216K08369M086
20662I60585k3448k891J58485O7700k03843O5371k0330J6914k61583k88658o9374
20651C98928K825j02255j53485m6616N8975J1799l9957o7019m0740J13967J09531
20640B45953L2976p9440j27059P6895J9026K2206J33043N984q9054j41907j01358
20629b735K0771R7978o1145L2588K08838j30330j23756j31053n3641l8473J41089
20618c9869p8255o5986J46525P0978j22307P6769J42522k4632P8974k5682j55756
20607C281o0953R9395Q8507n0394m2861N7546L3825j28965N6947J04447j28404
20596C2371m3517j3757J8479P7373M9637k1104j04038P2987N1663J5178j50754
$$ plain form
20585 -15482 1100 5555 -131180 -171000 -97555 79702 206645 87571 148335 -9487 -67923
20574 -67923 29917 22173 -118384 -362999 -517764 -563425 -437212 -169945 -20246 -13602 90881
20563 90881 163816 29632 -47089 8050 -48330 -178765 -215666 -17645 -18870 -12777 -53281
20552 -53281 -47083 51940 262086 420482 593638 542702 408407 213417 150798 138784 122433
20541 122433 178544 294041 368478 222546 155484 154232 312161 193799 65728 126716 213452
20530 213452 195159 134700 194299 131327 173669 355558 359040 227928 6408 -184293 -43634
20519 -43634 146387 242386 212135 102298 36868 -4878 73266 -36525 -5529 -95144 -244431
20508 -244431 -311673 -300186 -220273 -96407 30495 240343 256927 158658 136140 372292 232488
$$ packed form
20585a5482J6582M455j36735l9820P3445J77257J26943j19074O0764j57822n8436
20574f7923R7840p744j40557k44615j54765m5661J26213K67267J49699O644J04483
20563I0881P2935j34184p6721N5139n6380j30435l6901J98021j225O093m0504
20552e3281O198R9023K10146J58396J73156n0936j34295j94990o2619j2014j6351
20541A22433N6111J15497P4437j45932o7062j252J57929j18362j28071O0988Q6736
20530B13452j8293o0459N9599o2972M2342J81889L482j31112k21520j90701J40659
20519d3634J90021R5999l0251j09837o5430m1746P8144j09791L0996q9615j49287
20508b44431o7242J1487P9913J23866J26902K09848J6584r8269k2518K36152j39804
$$ plain form
20497 232488 62640 149149 251978 175798 227392 310758 474704 366045 169840 -14776
20487 -14776 -49312 -142405 -89002 102916 181580 110505 37681 142348 31720 23218 216712
20476 216712 125354 -4319 217504 296271 191171 165998 176126 252105 198153 71816 220757
20465 220757 512955 337507 213444 302166 340513 257991 275234 335543 362712 229990 355362
20454 355362 314013 330164 292399 410431 251774 81783 222541 462903 610450 693476
20444 693476 858566 1117641 1107940 1040969 1170417 1303923 1284562 1051277 805877 815636 730230
20433 730230 660902 538054 439766 407665 486152 561283 833899 1019958 891562 900588 961172
20422 961172 1138024 1028377 741556 519344 577155 722420 649476 604435 617905 533594
$$ packed form
20497B32488j69848Q6509J02829p6180N1594Q3366J63946j08659j96205j84616
20487a4776l4536r3093N3403J91918P8664p1075p2824J04667j10628q502J93494
20476B16712r1358j29673K21823P8767j05100k5173J0128P5979n3952j26337J48941
20465B20757K92198j75448j24063Q8722L8347q2522J7243O0309K7169j32722J25372
20454C55362m1349J6151l7765J18032j58657j69991J40758K40362J47547Q3026
20444F93476J65090K59075r701o6971J29448J33506j9361k33285k45400R759q5406
20433G30230o9328j22848r8288l2101P8487P5131K72616J86059j28396R026O0584
20422I61172J76852j09647k86821k22212N7811J45265p2944m5041J3470q4311
$$ plain form
20412 533594 495086 324011 323427 388156 575354 628689 502204 436150 530805 707864 761306
20401 761306 653931 646195 626906 500475 514316 562335 546506 514411 415718 500459 653614
20390 653614 746187 668686 612610 575043 675831 735668 785026 775215 795144 856864 746789
20379 746789 665209 799554 996334 1201844 1050217 984755 920449 813740 734274 787080
20369 787080 802372 981891 908445 799249 868128 828211 1005447 1081131 954272 948129 950133
20358 950133 962562 1213733 1221206 1233862 1317593 1152299 1010180 1211809 1449748 1374458 1200683
20347 1200683 1180719 1318977 1475741 1592664 1665856 1572726 1557429 1740794 1844723 2020898
20337 2020898 2089057 2059253 2055639 2258742 2298740 2355772 2380566 2597581 2860821 2953060 3127574
$$ packed form
20412E33594l8508j71075n84O4729J87198N3335j26485o6054R4655J77059N3442
20401G61306j07375p736j9289j26431J3841M8019j5829l2095r8693Q4741J53155
20390F53614R2573p7501n6076l7567J00788N9837M9358r811J9929O1720j10075
20379G46789q1580J34345J96780K05510j51627o5462o4306j06709p9466N2806
20369G87080J5292J79519p3446j09196O8879l9917J77236P5684j26859o143K004
20358I50133J2429K51171P473J2656Q3731j65294j42119K01629K37939p5290j73775
20347A200683j9964J38258J56764J16923P3192r3130j5297J83365J03929J76175
20337B020898O8159k9804l614K03103L9998N7032K4794K17015K63240R2239J74514
$$ plain form
20326 3127574 3258672 3482962 3784476 4145725 4460746 4518060 4678993 4813610 4859508 4947736
20316 4947736 5349277 5894095 6310809 6619935 6815086 7058610 7448298 7994935 8687729
20307 8687729 9215312 9801415 10449676 11068416 11863488 13095805 14507570 16318972 18561872
20298 18561872 21311020 24667148 29242488 35602371 44161733 55782021 71763930 92890892
20290 92890892 118361975 143326205 159518134 159922973 146140476 127937814 114343158
20283 114343158 108687880 111739718 123389391 142214383 162841832 175437714 170667773
20276 170667773 148607019 119128893 92788875 73583778 60663873 51837866 46324305
20269 46324305 43225719 41874691 42011530 43985420 47864708 54289570 64178339 78984082
$$ packed form
20326C127574J31098K24290L01514L61249L15021N7314J60933J34617M5898Q8228
20316D947736M01541N44818M16714L09126J95151K43524L89688N46637O92794
20307H687729N27583N86103O48261O18740P95072J232317J411765J811402K242900
20298A8561872K749148L356128M575340O359883Q559362J1620288J5981909K1126962
20290I2890892K5471083K4964230J6191929M04839j3782497j8202662j3594656
20283A14343158n655278L051838J1649673J8824992K0627449J2595882m769941
20276A70667773k2060754k9478126k6340018j9205097j2919905q826007n513561
20269D6324305l098586j351028J36839J973890L879288O424862R888769J4805743
$$ plain form
20261 78984082 99660815 125855765 153393577 172818754 174936332 160114165 138412492
20254 138412492 120616878 111391822 111552436 120760739 137377439 157366055 171631374
20247 171631374 170106062 150603045 121368817 93076777 71105495 55225485 43913998
20240 43913998 35876290 29814266 25171740 21780898 18972647 16644548 15111360 13739786
20232 13739786 12599827 11823001 11203308 10586313 9880157 9361606 9067543 8378537 7781764
20223 7781764 7234014 6948148 6584758 6207655 5696934 5219713 4961438 4662886 4404911
20214 4404911 4270481 4311141 4185033 3815845 3521851 3156437 2735716 2440472 2350079 2171580
20204 2171580 1957545 1796298 1550048 1391419 1374548 1452218 1538925 1443346 1353823 1438408
$$ packed form
20261G8984082K0676733K6194950K7537812J9425177K117578j4822167k1701673
20254A38412492j7795614r225056J60614R208303J6616700J9988616J4265319
20247A71631374j525312j9503017k9234228k8292040k1971282j5880010j1311487
20240D3913998q037708o062024m642526l390842k808251k328099j533188j371574
20232A3739786j139959p76826o19693o16995p06156n18551k94063o89006n96773
20223G781764n47750k85866l63390l77103n10721m77221k58275k98552k57975
20214D404911j34430M0660j26108l69188k93994l65414m20721k95244r0393j78499
20204B171580k14035j61247k46250j58629j6871P7670Q6707r5579q9523Q4585
$$ plain form
20194 1438408 1772182 1877487 1743648 1508072 1507520 1279217 1021758 1158643 1372971 1375243
20184 1375243 1276467 1105291 1004834 965841 773432 671766 865275 775039 770518 1053353
20174 1053353 1278941 1408144 1322744 1158953 1113064 1182915 1112906 1136084 1370567 1474144
20164 1474144 1378296 1091386 851783 721139 538478 501773 706013 866146 938932 860788
20154 860788 847975 772336 500110 234524 268455 405237 646236 780668 835743 649234
20144 649234 544959 683495 723136 725897 557037 467216 478934 310811 347397 529691 738899
20133 738899 590724 499041 405296 420814 268258 168964 210173 285348 324011 250595 157961
20122 157961 99514 46674 50019 -227440 -181957 -71954 75067 -82778 -29937 11117 52038
$$ packed form
20194A438408L33774J05305j33839k35576n52k28303k57459J36885K14328K272
20184A375243r8776j71176j00457l8993j92409j01666J93509r0236m521K82835
20174A053353K25588J29203q5400j63791m5889O9851p0009K3178K34483J03577
20164A474144r5848k86910k39603j30644j82661l6705K04240J60133P2786p8144
20154H60788j2813p5639k72226k65586L3931J36782K40999J34432N5075j86509
20144F49234j04275J38536L9641K761j68860q9821J1718j68123L6586J82294K09208
20133G38899j48175r1683r3745J5518j52556r9294M1209P5175L8663p3416r2634
20122A57961n8447n2840L345k77459M5483J10003J47021j57845N2841M1054M0921
$$ plain form
20111 52038 94064 124086 36480 -57687 -329347 -521895 -339121 -124731 -100681 -285959 -263431
20100 -263431 -26754 -42905 -124008 -280847 -222222 -129350 -190241 -99551 -262881 -373799 -396518
20089 -396518 -241625 -13252 -100934 -252486 -230688 -104229 95610 218870 117393 176825
20079 176825 405218 411803 350010 303113 281383 432973 552067 484939 537746 616849 429326
20068 429326 405696 581247 602419 518929 391031 406128 493761 404299 437075 431924 400534
20057 400534 398683 223413 128561 10495 -47002 238823 280979 301795 303237 199982 159978
20046 159978 186886 51756 -8474 -30299 -120961 -240382 -341507 -354047 -183960 -109493 94741
20035 94741 254519 159935 154299 -32864 -102190 170131 301668 422870 422798 445925 560967
$$ packed form
20111E2038M2026L0022q7606r4167k71660j92548J82774K14390K4050j85278K2528
20100b63431K36677j6151q1103j56839N8625R2872o0891R0690j63330j10918k2719
20089c96518J54893K28373q7682j51552K1798J26459J99839J23260j01477N9432
20079A76825K28393O585o1793m6897k1730J51590J19094o7128N2807P9103j87523
20068D29326k3630J75551K1172q3490j27898J5097Q7633q9462L2776n151l1390
20057D00534j851j75270r4852j18066n7497K85825M2156K0816J442j03255m0004
20046A59978K6908j35130o0230k1825r0662j19421j01125j2540J70087P4467K04234
20035I4741J59778r4584n636j87163o9326K72321J31537J21202p2K3127J15042
$$ plain form
20024 560967 529812 535517 393601 345593 405797 616237 766814 620978 653587 685019 609960
20013 609960 753611 780913 812676 771876 703832 542962 386579 393955 498385 504922 482582
20002 482582 410183 298762 409485 472275 421600 322348 295573 360507 422164 335671 259794
19991 259794 409985 340225 77358 -115804 -226824 -173241 -114248 -109338 -110450 -101694 -23183
19980 -23183 -39571 -171316 -181957 -247022 -263187 -279458 -237997 125507 -15765 -153402 -127527
19969 -127527 -209286 -278227 -161188 -105086 -65382 -84237 -99641 -63889 146020 170359 162382
19958 162382 228222 128314 63360 -124799 -54098 -51327 72138 37759 -142970 -313351 -190018
19947 -190018 18410 161264 134264 149487 352284 361857 118521 -51971 -90947 -33305 87037
$$ packed form
20024E60967l1155N705j41916m8008O0204K10440J50577j45836L2609L1432p5059
20013F09960J43651K7302L1763m0800o8044j60870j56383P376J04430O537k2340
20002D82582p2399j11421J10723O2790n0675r9252k6775O4934O1657q6493p5877
19991B59794J50191o9760k62867j93162j11020N3583N8993M910j112Q756P8511
19980b3183j6388j31745j0641o5065j6165j6271M1461L63504j41272j37637K5875
19969a27527q1759o8941J17039N6102L9704j8855j5404L5752K09909K4339p977
19958A62382O5840r9908o4954j88159P0701K771J23465l4379j80729j70381J23333
19947a90018K08428J42854k7000J5223K02797R573k43336j70492l8976N7642J20342
$$ plain form
19936 87037 168308 221712 296983 357163 440329 342041 369352 450504 469139 381493 309138 265769
19924 265769 233677 240962 258811 278397 426839 722158 956140 979319 1116424 1342049 1247399
19913 1247399 1205446 1118222 1033025 1104628 988409 963846 803978 863105 1184470 1382386
19903 1382386 1300018 1392557 1367833 1173010 1003212 1040339 928213 671903 604590 546477
19893 546477 484599 284420 221566 336346 560747 740412 812625 613976 572761 421870
19883 421870 296481 279725 263190 166325 397712 454365 351956 404761 455561 364943 515193
19872 515193 669082 574923 563229 796602 905692 987918 714994 633765 845664 828106
19862 828106 1032218 1206454 1362818 1808197 2022124 1859702 1724114 1762597 1706808 1580104
$$ packed form
19936H7037Q1271N3404P5271O0180Q3166r8288K7311Q1152J8635q7646p2355m3369
19924B65769l2092P285J7849J9586J48442K95319K33982K3179J37105K25625r4650
19913A247399m1953q7224q5197P1603j16219k4563j59868N9127L21365J97916
19903A382386q2368R2539k4724j94823j69798L7127j12126k56310o7313n8113
19893E46477o1878k00179o2854J14780K24401J79665P2213j98649m1215j50891
19883D21870j25389j6756j6535r6865K31387N6653j02409N2805N0800r0618J50250
19872E15193J53889r4159j1694K33373J09090Q2226k72924q1229K11899j7558
19862H28106K04112J74236J56364M45379K13927j62422j35588L8483n5789j26704
$$ plain form
19852 1580104 1323151 1024670 931514 1015917 1172463 1129141 1007109 787600 762377 649974
19842 649974 738640 758584 600770 466878 339600 386425 503575 644085 603349 444662
19832 444662 383696 425882 373167 333161 360414 399231 413021 451148 348202 281494 252887
19821 252887 220516 229692 214386 209258 162242 82307 269397 430778 536947 421662 508499
19810 508499 405969 277439 240865 316206 339943 549794 708941 698234 923195 1589514
19800 1589514 2500114 3233878 2601926 1567566 1013542 754688 775529 647234 457040
19791 457040 534271 610668 572168 393947 262763 294600 307928 460641 375635 325070 286103
19780 286103 289969 369890 276975 225817 58944 -57340 225694 362443 268202 326655 365145
$$ packed form
19852A580104k56953k98481r3156Q4403J56546m3322j22032k19509k5223j12403
19842F49974Q8666J9944j57814j33892j27278M6825J17150J40510m0736j58687
19832D44662o0966M2186n2715m0006K7253L8817J3790L8127j02946o6708k8607
19821B52887l2371R176j5306n128m7016p9935J87090J61381J06169j15285Q6837
19810E08499j02530j28530l6574P5341K3737K09851J59147j0707K24961O66319
19800A589514R10600P33764o31952j034360n54024k58854K0841j28295j90194
19791D57040P7231P6397l8500j78221j31184L1837J3328J52713q5006n0565l8967
19780B86103L866P9921r2915n1158j66873j16284K83034J36749r4241N8453L8490
$$ plain form
19769 365145 251873 172761 360192 498183 406802 375031 357949 454468 437299 277674 203553
19758 203553 192349 252885 357912 369719 440414 476382 369562 441822 632306 760697 870481
19747 870481 708661 607518 540381 461885 507142 766484 853034 781615 639642 731946 792577
19736 792577 805183 756116 552796 480025 510838 404402 460810 560211 629125 704219 856711
19725 856711 757555 534697 729780 919941 1049744 908277 894659 999353 988546 1046355
19715 1046355 1060024 1038709 992235 1137702 1103336 1092780 1093748 1155779 1204082 1166341 1090635
19704 1090635 1103793 1023129 932412 781230 795675 780679 859391 808056 822113 756961 861045
19693 861045 1000680 1059597 1203124 1226186 1097539 993943 1225705 1494294 1566020 1660175
$$ packed form
19769C65145j13272p9112J87431J37991r1381l1771j7082R6519j7169j59625p4121
19758B03553j1204O0536J05027J1807P0695L5968j06820P2260J90484J28391J09784
19747H70481j61820j01143o7137p8496M5257K59342Q6550p1419j41973R2304O0631
19736G92577J2606m9067k03320p2771L0813j06436N6408R9401O8914P5094J52492
19725H56711r9156k22858J95083J90161J29803j41467j3618J04694j0807N7809
19715A046355J3669k1315m6474J45467l4366j0556R68O2031M8303l7741p5706
19704A090635J3158q0664r0717j51182J4445j4996P8712n1335J4057o5152J04084
19693H61045J39635N8917J43527K3062j28647j03596K31762K68589P1726R4155
$$ plain form
19683 1660175 1631347 1383309 1178350 1256616 1501152 1554723 1712047 1695925 1675503 1759339
19673 1759339 1536196 1448288 1446843 1347030 1121915 1103871 1059834 954388 1034611 1024023 1058824
19662 1058824 912385 843142 938166 1032675 1073416 1115598 1271482 1270626 1151836 1211202 1241453
19651 1241453 1303156 1355250 1337856 1375904 1390442 1422439 1343784 1282382 1384362 1501646 1555622
19640 1555622 1605842 1659849 1696228 1734874 1678542 1859887 2009759 2182418 2083626 1958376
19630 1958376 2005892 1933196 1804038 1658956 1635701 1817520 1828671 1864058 1866882 1805583 1883609
19619 1883609 1855974 1770606 1793679 1816118 1820399 1675300 1580056 1568219 1791075 2000650 2212318
19608 2212318 2242779 2102403 1959111 1894599 1987065 2030414 2206698 2359663 2329336 2457701
$$ packed form
19683A660175k8828k48038k04959P8266K44536N3571J57324j6122k0422Q3836
19673A759339k23143q7908j445r9813k25115j8044m4037j05446Q0223j0588L4801
19662A058824j46439o9243R5024R4509M0741M2182J55884q56j18790N9366L0251
19651A241453O1703N2094j7394L8048J4538L1997p8655o1402J01980J17284N3976
19640A555622N0220N4007L6379L8646n6332J81345J49872J72659r8792j25250
19630A958376M7516p2696j29158j45082k3255J81819J1151L5387K824o1299P8026
19619A883609k7635q5368K3073K2439M281j45099r5244j1837K22856K09575K11668
19608B212318L0461j40376j43292o4512R2466M3349J76284J52965l0327J28365
$$ plain form
19598 2457701 2830124 3002229 3186256 3275282 3486199 3518408 3724408 3962693 4336475 4872711
19588 4872711 5061535 5304497 5519495 5788797 6238074 6693817 7099545 7372026 7752868
19579 7752868 8403304 9178879 9900338 11061212 12541621 14401388 16630754 19546166 23600564
19570 23600564 29328009 37714172 50139967 67056948 86261037 99789151 97866785
19563 97866785 83276148 68398654 59013965 55707047 57985724 66255445 81061958 100785004
19555 100785004 119161902 125089051 118124887 111579993 112569486 116946479 114616986 100456633
19547 100456633 82164165 67894325 59678211 57258736 60173259 68155569 80745534
19540 80745534 94622342 100151271 89556768 70045670 52674384 40257940 32160333
$$ packed form
19598B457701L72423J72105J84027Q9026K10917L2209K06000K38285L73782N36236
19588D872711J88824K42962K14998K69302M49277M55743M05728K72481L80842
19579G752868O50436P75575P21459J160874J480409J859767K229366K915412M054398
19570B3600564N727445Q386163J2425795J6916981J9204089J3528114j922366
19563I7866785j4590637j4877494r384689l306918K278677Q269721J4806513J9723046
19555A00785004J8376898N927149o964164o544894R89493M376993k329493j4160353
19547A00456633j8292468j4269840q216114k419475K914523P982310J2589965
19540H0745534J3876808N528929j0594503j9511098j7371286j2416444q097607
$$ plain form
19533 32160333 27078722 24096453 22143309 20796845 20122229 19707140 19693016 19947708 20432189
19524 20432189 21312811 22651328 24749088 27876194 32961289 40714474 52005380 68109483
19516 68109483 88671108 108453388 116083372 105283419 86380106 71793120 64390991
19509 64390991 63546534 68787203 80244642 97352931 116863364 130589828 131179940 124807747
19501 124807747 123979697 131233960 136663559 126878298 103424734 81044462 67161217 60702843
19493 60702843 60592926 66256076 77661520 92675552 104976806 103929218 86562641 64277295
19485 64277295 46836620 35160875 27616692 22574343 18734243 15938487 13986059 12663737
19477 12663737 11550096 10568255 9724078 9001195 8509847 8056235 7649165 7345740 6899223
$$ packed form
19533C2160333n081611k982269j953144j346464o74616m15089j4124K54692M84481
19524B0432189Q80622J338517K097760L127106N085095P753185J1290906J6104103
19516F8109483K0561625J9782280P629984j0799953j8903313j4586986p402129
19509F4390991q44457N240669J1457439J7108289J9510433J3726464N90112o372193
19501A24807747q28050P254263N429599r785261k3453564k2380272j3883245o458374
19493F0702843j09917N663150J1405444J5014032J2301254j047588j7366577k2285346
19485F4277295j7440675j1675745p544183n042349l840100k795756j952428j322322
19477A2663737j113641r81841q44177p22883m91348m53612m07070l03425m46517
$$ plain form
19468 6899223 6407485 5791930 5311373 5116842 5107253 4819785 4633718 4599547 4507905 4358533
19458 4358533 4500703 4487200 4347319 4346409 4159437 4237775 4183778 4121914 3928480 4153334 4497979
19447 4497979 4561344 4589078 4431598 4353650 4529610 4639777 4779105 5038378 5278816 5186697
19437 5186697 5204859 5471001 5756713 5981969 6121186 6620714 6932067 7003520 7005315 7400064
19427 7400064 8071403 8932630 9942791 10815168 11758752 12637333 13396266 14121094 15055902
19418 15055902 16396104 18164667 20370114 23491771 27491758 32674247 39473523 47710233
19410 47710233 56234754 62357954 64076905 63764126 64927685 69538467 79046834 95176362
19402 95176362 120479172 158323601 212307422 280518576 347433786 381207318 369264317
$$ packed form
19468F899223m91738o15555m80557j94531r589k87468j86067l4171r1642j49372
19458D358533J42170j3503j39881r10j86972P8338n3997o1864j93434K24854L44645
19447D497979O3365K7734j57480p7948J75960J10167J39328K59273K40438r2119
19437E186697J8162K66142K85712K25256J39217M99528L11353P1453J795L94749
19427G400064O71339Q61227J010161Q72377R43584Q78581P58933P24828R34808
19418A5055902J340202J768563K205447L121657L999987N182489O799276Q236710
19410D7710233Q524521O123200J718951l12779J163559M610782R508367J6129528
19402I5176362K5302810L7844429N3983821O8211154O6915210L3773532j1943001
$$ plain form
19395 369264317 339316353 311587802 277445102 231461504 186632191 155198018 138936736
19388 138936736 134318703 137792378 144118526 145827422 136917376 118325005 97167639 79043569
19380 79043569 65339146 54847610 47177051 41855615 38627938 36468560 35387635 34937758
19372 34937758 34449953 34027300 33946630 34097198 34394389 34824827 35590082 37197349 39981953
19363 39981953 44367102 50586225 59677765 72386120 89690824 111060932 133671532
19356 133671532 151983741 159378029 155709650 149082355 147284802 155031106 175086124 210877452
19348 210877452 265535605 336764129 411207375 470614923 512440444 534116153 506819752
19341 506819752 420793384 317861889 235367670 179596981 144113302 122660533 111259123
$$ packed form
19395C69264317k9947964k7728551l4142700m5983598m4829313l1434173j6261282
19388A38936736m618033L473675O326148J708896q910046j8592371k1157366j8124070
19380G9043569j3704423j0491536p670559n321436l227677k159378j080925m49877
19372C4937758m87805m22653q0670J50568K97191M30438P65255J607267K784604
19363C9981953M385149O219123R091540J2708355J7304704K1370108K2610600
19356A33671532J8312209P394288l668379o627295j797553P746304K0055018L5791328
19348B10877452N4658153P1228524P4443246N9407548M1825521K1675709k7296401
19341E06819752q6026368j02931495q2494219n5770689l5483679k1452769j1401410
$$ plain form
19334 111259123 106940165 107137419 107910638 103884281 92692268 77366326 62734847 50893471
19326 50893471 41792924 35053548 29997553 26291818 23623486 21860065 20246341 18898547
19318 18898547 17639593 16300166 14769129 13083430 11772811 10549794 9685623 9064082
19310 9064082 8333788 7638192 7061326 6359338 5931326 5585439 5331858 4996008 4797947
19301 4797947 4604542 4402633 4267300 4285474 4075048 3988654 3939017 3811293 3640844 3411110
19291 3411110 3244654 3210604 3073630 2772519 2446828 2350711 2403167 2207551 2054809 2196006
19281 2196006 2392089 2197793 2065484 1953201 1777579 1674438 1640157 1697065 1594947 1507161
19271 1507161 1409957 1246272 1082441 1165111 1439506 1518748 1583230 1915955 2110392 2105766
$$ packed form
19334A11259123m318958J97254P73219m026357j1192013j5325942j4631479j1841376
19326E0893471r100547o739376n055995l705735k668332j763421j613724j347794
19318A8898547j258954j339427j531037j685699j310619j223017q64171o21541
19310I064082p30294o95596n76866p01988m28012l45887k53581l35850j98061
19301D797947j93405k01909j35333J8174k10426q6394m9637j27724j70449k29734
19291C411110j66456l4050j36974l01111l25691r6117N2456j95616j52742J41197
19281B196006J96083j94296j32309j12283j75622j03141l4281N6908j02118q7786
19271A507161r7204j63685j63831Q2670K74395P9242O4482L32725J94437m626
$$ plain form
19261 2105766 2029598 1930265 1942581 1619396 1490114 1509559 1553984 1581007 1793458 1797437 1922353
19250 1922353 1915164 1786697 1719764 1595094 1470058 1401568 1518380 1563619 1489986 1503242 1333090
19239 1333090 1175533 1217370 1346011 1439096 1464511 1708035 1798446 1672148 1569420 1641519
19229 1641519 1673401 1678709 1666241 1755349 1734035 1664331 1668601 1615874 1557027 1533656 1332649
19218 1332649 1051497 1002503 1002389 826028 903941 952470 959848 1065236 1239452 1210933 1319924
19207 1319924 1420785 1458700 1396349 1588315 1430268 1219095 1132634 1257806 1274317 1445347
19197 1445347 1468037 1656330 1854637 1738803 1726872 1886436 1963756 1893742 1853602 1838744
19187 1838744 1853720 1704546 1783588 1977059 2003534 2154993 2283161 2290618 2056319 1671150
$$ packed form
19261B105766p6168r9333J2316l23185j29282J9445M4425K7023K12451L979J24916
19250A922353p189j28467o6933j24670j25036o8490J16812M5239p3633J3256j70152
19239A333090j57557M1837J28641R3085K5415K43524R0411j26298j02728P2099
19229A641519L1882N308j2468Q9108k1314o9704M270n2727n8847k3371k01007
19218A332649k81152m8994j14j76361P7913M8529P378J05388J74216k8519J08991
19207A319924J00861L7915o2351J91966j58047k11173q6461J25172J6511J71030
19197A445347K2690J88293J98307j15834j1931J59564P7320p0014m0140j4858
19187A838744J4976j49174P9042J93471K6475J51459J28168P457k34299l85169
$$ plain form
19177 1671150 1507591 1606089 1598768 1592485 1653768 1907728 1934181 1773948 1583320 1339957 1229718
19166 1229718 1143470 1070588 1063498 940682 805640 950924 1075302 977815 938510 991567 1003913
19155 1003913 986839 1052688 907973 1167693 1536890 1538678 1526301 1448076 1236827 1378041
19145 1378041 1458589 1492821 1469238 1597355 1788443 1939161 2179037 2136567 2155568 2209694
19135 2209694 2086982 2093239 2361986 2396338 2313239 2333303 2334547 2100071 2237046 2312089 2611562
19124 2611562 2659774 2653770 2682655 2668949 2777062 2865086 2977248 3149180 3239134 3407556 3635591
19113 3635591 3650399 3640126 3556795 3642825 3835350 4111483 4361572 4743637 4950361 5199356
19103 5199356 5548488 5879540 6349870 6936640 7519898 8199709 8816384 9323765 10005854
$$ packed form
19177A671150j63559R8498p321o283O1283K53960K6453j60233j90628k43363j10239
19166A229718q6248p2882p090j22816j35042J45284J24378r7487l9305N3057J2346
19155A003913j7074O5849j44715K59720L69197J788j2377p8225k11249J41214
19145A378041Q0548L4232k3583J28117J91088J50718K39876m2470J9001N4126
19135B209694j22712O257K68747L4352q3099K0064J244k34476J36975P5043K99473
19124B611562M8212o004K8885j3706J08113Q8024J12162J71932Q9954J68422K28035
19113C635591J4808j0273q3331Q6030J92525K76133K50089L82065K06724K48995
19103E199356L49132L31052M70330N86770N83258O79811O16675N07381O82089
$$ plain form
19094 10005854 10750816 11570743 12866345 14352430 15717043 17038364 18394862 19840907
19086 19840907 21357313 23382361 26284260 29857078 34806234 41689049 50980616 62893398
19078 62893398 76468243 88904756 96481803 98393981 99439610 104316859 115738041 136539099
19070 136539099 170269357 220943606 291787727 380359550 467894213 517897567 511093084
19063 511093084 471095727 418421227 352967941 284460421 228691621 191486253 170018639
19056 170018639 160470906 159630790 164101611 168030130 164059669 148517897 125558915 102411983
19048 102411983 83431883 69376173 59170434 51950044 46580615 42703365 39859441
19041 39859441 37503123 35742191 34076329 33050036 32358066 31973670 32107868 32836858 33807249
$$ packed form
19094A0005854P44962Q19927J295602J486085J364613J321321J356498J446045
19086A9840907J516406K025048K901899L572818M949156O882815R291567J1912782
19078F2893398J3574845J2436513P577047J912178J045629M877249J1421182K0801058
19070A36539099L3730258N0674249P0844121Q8571823Q7534663N0003354o804483
19063E11093084l9997357n2674500o5453286o8507520n5768800l7205368k1467614
19056A70018639r547733q40116M470821L928519l970461j5541772k2958982k3146932
19048A02411983j8980100j4055710j0205739p220390n369429l877250k843924
19041C9859441k356318j760932j665862j026293o91970l84396J34198P28990R70391
$$ plain form
19032 33807249 35356950 37802586 41478657 47056195 55440662 67354105 83175482 101864647
19024 101864647 120568519 133887669 137439116 133767528 130194579 133159466 146678990
19017 146678990 172533431 211170316 258124208 301568922 331828457 354289471 372907619
19010 372907619 365813108 314294351 241224587 178772316 135860999 108277694 91008618
19003 91008618 80551222 74895075 72633057 71901824 70027970 64730171 55707834 45835229
18995 45835229 37381001 31040967 26494498 23191751 20821089 18976619 17508159 16225289
18987 16225289 14906615 13627775 12182697 10935240 10050971 9436350 8749670 7952944 7494478
18978 7494478 7089206 6866604 6782285 6746596 6478419 6105297 5522867 5068441 4718495 4631547
$$ packed form
19032C3807249J549701K445636L676071N577538Q384467J1913443J5821377J8689165
19024A01864647J8703872J3319150L551447l671588l572949K964887J3519524
19017A46678990K5854441L8636885M6953892M3444714L0259535K2461014J8618148
19010C72907619p094511n1518757p3069764o2452271m2911317k7583305j7269076
19003I1008618j0457396n656147k262018p31233j873854n297799r022337r872605
18995D5835229q454228o340034m546469l302747k370662j844470j468460j282870
18987A6225289j318674j278840j445078j247457q84269o14621o86680p96726m58466
18978G494478m05272k22602q4319l5689k68177l73122n82430m54426l49946q6948
$$ plain form
18968 4631547 4497734 4280285 4161064 4122035 3887378 3754007 3794793 3564796 3410500 3256756
18958 3256756 3126170 2981101 2943170 2767552 2488481 2342882 2151719 1972643 1928672 2006738
18948 2006738 2023989 1805074 1666339 1708104 1768105 1723230 1635364 1651649 1372462 1206913
18938 1206913 1032428 895927 917727 1076987 1144909 1185773 1268596 1270721 1397752 1296032
18928 1296032 1182887 902320 925750 1181218 1353088 1472501 1603635 1841412 1998419 1940045
18918 1940045 1650690 1295597 1361888 1243456 1147875 1277469 1223661 1280516 1246064 1151980
18908 1151980 1187648 1274085 1140546 1163950 1042068 721695 754366 799209 1066247 1042873
18898 1042873 900437 818240 722117 790975 868199 803489 998938 1095540 1085016 1094792 1080626
$$ packed form
18968D631547j33813k17449j19221l9029k34657j33371M0786k29997j54296j53744
18958C256756j30586j45069l7931j75618k79071j45599j91163j79076m3971P8066
18948B006738J7251k18915j38735M1765O0001m4875q7866J6285k79187j65549
18938A206913j74485j36501K1800J59260O7922M0864Q2823K125J27031j01720
18928A296032j13145k80567K3430K55468J71870J19413J31134K37777J57007n8374
18918A940045k89355l55093O6291j18432r5581J29594n3808N6855l4452r4084
18908A151980L5668Q6437j33539K3404j21882l20373L2671M4843K67038k3374
18898A042873j42436q2197r6123O8858P7224o4710J95449R6602j0524R776j4166
$$ plain form
18887 1080626 1082674 859762 630026 593275 855754 945160 1129739 1518312 1644564 1744397
18877 1744397 1632179 1620431 1554663 1458644 1634323 1872473 2006622 2036587 2200007 2118430
18867 2118430 1762336 1626924 1511138 1258392 990043 936416 1000716 1165772 1186640 1144439
18857 1144439 951892 838099 837645 714446 723686 633524 530741 634159 848522 878843 764595
18846 764595 602054 298948 426135 458052 380438 434987 740447 819193 693490 604838
18836 604838 710081 803273 676072 718015 924503 917436 873524 796842 926971 972212 1117931
18825 1117931 1279945 1440635 1520446 1414277 1334094 1107689 939769 797235 792272 648692
18815 648692 667819 751942 848978 834084 871343 848163 702619 548399 484490 475454 442202
$$ packed form
18887A080626K048k22912k29736l6751K62479Q9406J84579L88573J26252R9833
18877A744397j12218j1748o5768r6019J75679K38150J34149K9965J63420q1577
18867B118430l56094j35412j15786k52746k68349n3627O4300J65056K0868m2201
18857A144439j92547j13793m54j23199R240r0162j02783J03418K14363L0321j14248
18846G64595j62541l03106J27187L1917p7614N4549L05460P8746j25703q8652
18836F04838J05243R3192j27201M1943K06488p067m3912p6682J30129M5241J45719
18825A117931J62014J60690P9811j06169q0183k26405j67920j42534m963j43580
18815F48692J9127Q4123R7036j4894L7259k3180j45544j54220o3909r036l3252
$$ plain form
18804 442202 324328 355834 263498 213689 301977 461380 349651 288890 247801 261469 392245
18793 392245 316285 219058 472915 725681 705079 752931 567757 238491 136197 205415
18783 205415 212290 429567 551068 499207 660006 739048 858327 921563 824180 552795 374919
18772 374919 397083 292704 357926 422480 566158 573945 562200 744270 1031236 969684 837723
18761 837723 713800 705705 493876 422225 450272 451899 865067 1004740 845103 760679 803980
18750 803980 952007 841871 699939 649160 465448 497976 377245 443891 754993 896470
18740 896470 870176 829118 874170 832279 763053 869319 845752 912062 1091273 1244138 1213466
18729 1213466 1321983 1380727 1754684 2231064 2802310 3133590 3103366 3020181 2837263 2697402
$$ packed form
18804D42202j17874L1506r2336m9809Q8288J59403j11729o0761m1089J3668J30776
18793C92245p5960r7227K53857K52766k0602M7852j85174l29266j02294O9218
18783B05415O875K17277J21501n1861J60799P9042J19279O3236r7383k71385j77876
18772C74919K2164j04379O5222O4554J43678P787j1745J82070K86966o1552j31961
18761H37723j23923q095k11829p1651K8047J627M13168J39673j59637q4424M3301
18750H03980J48027j10136j41932n0779j83712L2528j20731O6646L11102J41477
18740H96470k6294m1058M5052m1891o9226J06266k3567O6310J79211J52865l0672
18729A213466J08517N8744L73957M76380N71246L31280l0224q3185j82918j39861
$$ plain form
18719 2697402 2663621 2599398 2431500 2244349 2213955 2241025 2236155 2538125 2785799 3040253
18709 3040253 3086580 3153633 3192749 3081742 2851946 2769077 2869685 2715191 2474315 2347318
18699 2347318 2074146 1737082 1762889 1702512 1423050 1160016 1406886 1730907 1804911 1788266
18689 1788266 1813903 1626869 1675675 1896208 2130002 2161986 2365237 2796393 2890699 2513452
18679 2513452 2492771 2651231 2969561 3208141 3271442 3512892 3906006 4177815 4165072 3936058
18669 3936058 3606044 3435871 3082610 2720098 2370062 2324504 2414273 2296161 1977846 1975478
18659 1975478 2130614 2076840 2018951 1915850 1912182 1956767 1758773 1467680 1329326 1312441
18649 1312441 1384221 1684721 2201535 2496016 2661104 2745375 2777879 3091924 3374295 3739317
$$ packed form
18719B697402l3781o4223j67898j87151l0394K7070m870L01970K47674K54454
18709C040253M6327O7053L9116j11007k29796q2869J00608j54494k40876j26997
18699B347318k73172l37064K5807o0377k79462k63034K46870L24021P4004j6645
18689A788266K5637j87034M8806K20533K33794L1984K03251M31156R4306l77247
18679B513452k0681J58460L18330K38580O3301K41450L93114K71809j2743k29014
18669C936058l30014j70173l53261l62512l50036m5558Q9769j18112l18315k368
18659A975478J55136n3774n7889j03101l668M4585j97994k91093j38354j6885
18649A312441P1780L00500N16814K94481J65088Q4271L2504L14045K82371L65022
$$ plain form
18639 3739317 3994558 4355358 4549424 4809791 4727176 4332399 3855004 3359847 2800762 2806353
18629 2806353 2870418 3050593 2860249 2626321 2477853 2401001 2432909 2572214 2570978 2737553
18619 2737553 3127292 3521985 3627012 3702672 3642612 3745327 3771308 3823186 3978473 3934067
18609 3934067 3575848 3220804 3218764 3160441 3026368 3325557 3645989 3938135 4532323 4944715
18599 4944715 5117087 5352530 5507026 5960171 6679455 7172463 7442426 7876388 8604945
18590 8604945 9633710 10861697 12274345 14153887 16486723 19874705 24848961 32315974
18582 32315974 43224296 59285740 80988978 106129406 125055408 127108762 118488110
18575 118488110 114198872 119098097 126707996 123077780 102570393 76972187 57199849
$$ packed form
18639C739317K55241L60800J94066K60367q2615l94777m77395m95157n59085N591
18629B806353O4065J80175j90344k33928j48468p6852L1908J39305j236J66575
18619B737553L89739L94693J05027P5660o0060J02715K5981N1878J55287m4406
18609C934067l58219l55044k040n8323j34073K99189L20432K92146N94188M12392
18599D944715J72372K35443J54496M53145P19284M93008K69963M33962P28557
18590H604945J028765J227987J412648J879542K332836L387982M974256P467013
18582C2315974J0908322J6061444K1703238K5140428J8926002K053354q620652
18575A18488110m289238M899225P609899l630216k0507387k5598206j9772338
$$ plain form
18568 57199849 44234162 35614292 29698739 25618909 22970659 21283379 20328691 19898984
18560 19898984 19614370 19807091 20605542 21459186 23120063 25867823 29917384 36277962 45669130
18551 45669130 59173483 77357866 99042154 118020438 124560440 119252816 113960418
18544 113960418 115927841 121699861 121016692 106473227 84330238 64895246 51508878
18537 51508878 43326517 38745873 36997742 37552629 40508515 46732805 57109427 72490114
18529 72490114 92348962 111619991 119935693 115134726 108448275 108428107 113982042 115890861
18521 115890861 104144080 82161872 61407165 46614566 37046071 30583024 26248132
18514 26248132 23432764 21443945 20136306 19252567 18516047 18321161 18451173 18842378 19660732
$$ packed form
18568E7199849j2965687q619870n915553m079830k648250j687280r54688m29707
18560A9898984k84614J92721P98451Q53644J660877K747760M049561O360578R391168
18551D5669130J3504353J8184383K1684288J8978284O540002n307624n292398
18544A13960418J967423N772020o83169j4543465k2142989j9434992j3386368
18537E1508878q182361m580644j748131N54887K955886O224290J0376622J5380687
18529G2490114J9858848J9271029Q315702m800967o686451k0168N553935J908819
18521A15890861j1746781k1982208k0754707j4792599r568495o463047m334892
18514B6248132k815368j988819j307639q83739p36520j94886J30012L91205Q18354
$$ plain form
18505 19660732 21199031 23836921 28065986 34628554 44543250 59198086 79123373 101258361
18497 101258361 114862859 112508004 103634978 101054667 106823934 113060126 106485534 84791756
18489 84791756 61327972 44098262 32730891 25369476 20379169 17023214 14455662 12336558
18481 12336558 10607370 9332517 8443014 7779720 7173830 6704542 6269875 5796848 5492480
18472 5492480 5376813 5198743 4893922 4453976 3785829 3520177 3421612 3566210 3548670 3484666
18462 3484666 3654695 3593714 3366307 3464617 3443136 3052792 2745602 2511677 2582316 2564742
18452 2564742 2451750 2290829 1935099 1662751 1478820 1399469 1419185 1398060 1435517 1344594
18442 1344594 1365527 1557349 1718729 1653960 1689163 1680505 1580147 1587720 1788565 1717111 1446618
$$ packed form
18505A9660732J538299K637890M229065O562568R914696J4654836J9925287K2134988
18497A01258361J3604498k354855q873026k580311N769267O236192o574592k1693778
18489H4791756k3463784j7229710j1367371p361415m990307l355955k567552k119104
18481A2336558j729188j274853q89503o63294o05890m69288m34667m73027l04368
18472E492480j15667j78070l04821m39946o68147k65652r8565J44598j7540o4004
18462C484666J70029o0981k27407R8310k1481l90344l07190k33925P0639j7574
18452B564742j12992j60921l55730k72348j83931p9351J9716k1125L7457r0923
18442A344594K0933J91822J61380o4769L5203q658j00358P573K00845p1454k70493
$$ plain form
18431 1446618 1230640 1061795 975944 978945 908067 902788 901402 851721 717178 874604 819985
18420 819985 869843 818975 821696 773786 631307 665563 763690 805922 865882 1032711 1398887
18409 1398887 1546670 1577357 1582457 1574331 1698845 1590742 1310647 1231728 969754 881771 1014126
18398 1014126 878223 653694 516127 412539 447029 684737 838922 864017 836494 897129
18388 897129 783997 913767 1122332 1288822 1224051 1055275 857545 427871 331956 531420
18378 531420 854955 1015999 932601 815919 522039 585080 530004 218453 327352 505280
18368 505280 572824 659355 818712 1087414 1238178 1272029 1387015 1421405 1322867 1139371
18358 1139371 1157233 1139030 1170258 1144335 1008572 892368 727365 711526 841667 807636
$$ packed form
18431A446618k15978j68845q5851L001p0878n279j386m9681j34543J57426n4619
18420H19985M9858n0868K721m7910j42479L4256R8127M2232N9960J66829L66176
18409A398887J47783L0687N100q126J24514j08103k80095p8919k61974q7983J32355
18398A014126j35903k24529j37567j03588L4490K37708J54185K5095k7523O0635
18388H97129j13132J29770K08565J66490o4771j68776j97730m29674r5915J99464
18378E31420L23535J61044q3398j16682k93880O3041n5076l11551J08899J77928
18368E05280O7544Q6531J59357K68702J50764L3851J14986L4390r8538j83496
18358A139371J7862j8203L1228k5923j35763j16204j65003j5839J30141l4031
$$ plain form
18348 807636 896280 1014115 967277 894957 967503 860619 704119 752012 877301 1103257
18338 1103257 1314270 1249461 1049671 1110899 1276552 1381373 1265522 1143689 1134577 1055448
18328 1055448 917889 946915 960059 1232513 1225740 939414 1098688 1058954 1060180 995060 956648
18317 956648 851993 790603 776733 839322 789836 752229 795458 958593 939982 956621 956986
18306 956986 1028556 1146265 1072304 786570 849083 869527 647481 619421 500557 376735
18296 376735 355622 285543 162039 260073 472187 725930 673385 582634 389638 364676 374115
18285 374115 429628 204049 110627 176140 327493 433079 261820 183410 283123 367733 402638
18274 402638 505567 500251 428716 403274 353685 402665 190994 148248 149841 210554 168593
$$ packed form
18348H07636Q8644J17835m6838p2320P2546j06884j56500M7893J25289K25956
18338A103257K11013o4809j99790O1228J65653J04821j15851j21833r112p9129
18328A055448j37559K9026J3144K72454o773k86326J59274l9734J226o5120l8412
18317I56648j04655o1390j3870O2589m9486l7607M3229J63135j8611J6639L65
18306I56986P1570J17709p3961k85734O2513K0444k22046k8060j18864j23822
18296C76735k1113p0079j23504R8034K12114K53743n2545r0751j92996k4962R439
18285C74115N5513k25579r3422O5513J51353J05586j71259p8410R9713Q4610L4905
18274D02638J02929n316p1535k5442m9589M8980k11671m2746J593O0713m1961
$$ plain form
18263 168593 128667 72279 118510 136135 266741 349843 377233 464760 444560 537877 533695
18252 533695 525202 469360 493087 330446 128865 271222 357885 508828 630651 622349 610834
18241 610834 693554 681717 752926 1084639 1339822 1407570 1417762 1566053 1642301 1751452 2008622
18230 2008622 2076402 2060858 1989535 1765242 1761575 1650804 1522949 1300557 1124730 1107303
18220 1107303 962939 872300 979214 877586 771257 753235 781810 675963 718529 565846
18210 565846 404112 359881 299400 321444 432078 285089 122644 215971 175732 208648 186954
18199 186954 131037 122584 307506 474731 361492 279890 408031 520561 477449 474908 737743
18188 737743 1005654 1019017 1055311 1182672 1190055 1117807 1028864 1306011 1603767 1559114 1460265
$$ packed form
18263A68593l9926n6388M6231J7625J30606Q3102K7390Q7527k0200R3317m182
18252E33695q493n5842K3727j62641k01581J42357Q6663J50943J21823q302j1515
18241F10834Q2720j1837P1209L31713K55183O7748J0192J48291P6248J09151K57170
18230B008622O7780j5544p1323k24293l667j10771j27855k22392j75827j7427
18220A107303j44364r0639J06914j01628j06329j8022K8575j05847M2566j52683
18210E65846j61734m4231o0481K2044J10634j46989j62445R3327m0239L2916k1694
18199A86954n5917q453J84922J67225j13239q1602J28141J12530m3112k541K62835
18188G37743K67911J3363L6294J27361P383p2248q8943K77147K97756m4653r8849
$$ plain form
18177 1460265 1366778 1398062 1274531 1055508 720054 566239 530757 381063 195402 299858
18167 299858 259320 106608 114893 230971 249505 335297 381826 272684 320979 267868 220635
18156 220635 95473 25087 -98145 -18327 171078 80221 11398 -52882 -135337 -261486 -137054
18145 -137054 -51901 -20775 136938 44608 209843 187799 93861 126698 155332 125240 261423
18134 261423 113119 -16627 12270 215801 212830 110503 123091 -39000 -60870 43612
18124 43612 237461 314985 270168 136085 44776 72297 244598 242065 42195 22829 93227
18113 93227 86356 156644 178732 55709 -51380 93805 154942 35348 28165 -6965 -59589
18102 -59589 118078 220241 316980 346666 368842 398904 229523 142766 -62935 -205975 -166483
$$ packed form
18177A460265r3487L1284j23531k19023l35454j53815l5482j49694j85661J04456
18167B99858m0538j52712Q285J16078J8534Q5792M6529j09142M8295n3111m7233
18156B20635j25162p0386j23232P9818J89405r0857o8823o4280q2455j26149J24432
18145a37054Q5153L1126J57713r2330J65235k2044r3938L2837K8634l0092J36183
18134B61423j48304j29746K8897K03531k971j02327J2588j62091k1870J04482
18124D3612J93849P7524m4817j34083r1309K7521J72301k533j99870j9366P0398
18113I3227o871P0288K2088j23023j07089J45185O1137j19594p183l5130n2624
18102e9589J77667J02163R6739K9686K2176L0062j69381q6757k05701j43040L9492
$$ plain form
18091 -166483 -227635 -180555 -188020 37289 173114 94039 -97563 -230445 -260313 -182189 -108464
18080 -108464 22119 -14600 157490 211915 221723 300467 -42619 -20298 106740 223614 145024
18069 145024 259157 291169 348151 332207 250491 387631 227717 80267 202355 191414
18059 191414 77713 88381 173820 144979 320151 422437 552657 633644 563472 714654
18049 714654 689936 598861 593910 569897 400600 221912 222416 137658 84649 127914 73132 -33847
18037 -33847 119537 315565 333342 163747 55960 -164411 -308557 -89768 -146654 -215373
18027 -215373 -163246 101771 148225 456965 707908 590489 374773 331593 233504 275001
18017 275001 306825 180881 92978 265235 499043 198261 139931 198677 42817 -17385
$$ packed form
18091a66483o1152M7080p465K25309J35825p9075j91602j32882k9868P8124P3725
18080a08464J30583l6719J72090N4425R808P8744l43086K2321J27038J16874p8590
18069A45024J14133L2012N6982j5944q1716J37140j59914j47450J22088j0941
18059A91414j13701J0668Q5439k8841J75172J02286J30220Q0987p0172J51182
18049G14654k4718r1075m951k4013j69297j78688N04q4758n3009M3265n4782j06979
18037c3847J53384J96028J7777j69595j07787k20371j44146K18789n6886o8719
18027b15373N2127K65017M6454L08740K50943j17419k15716m3180r8089M1497
18017B75001L1824j25944q7903J72257K33808l00782n8330N8746j55860o0202
$$ plain form
18007 -17385 101397 335886 273732 124158 107205 100848 222226 194363 309034 360883 527100
17996 527100 699934 628735 272929 111002 118007 159276 221190 76380 11537 -42572 -142894
17985 -142894 -180424 -155905 -129243 -175348 4614 -54348 -285412 -334131 -249232 -266617 -120795
17974 -120795 64971 167123 50610 98918 85741 92277 309162 412931 346602 147072
17964 147072 -33880 -171487 -189016 -27207 47979 -9765 -64419 -120439 -75010 90099 236412
17953 236412 281144 217636 97543 -117631 -267403 -294480 -199648 -39862 -66627 50393
17943 50393 -95890 -186649 -59932 -75944 -188322 -164970 -173797 -173143 -83728 -98855 -247955
17932 -247955 -148760 -174164 -60832 -6134 -105710 -316527 -396579 -220673 -192085 -193636 -312220
$$ packed form
18007a7385J18782K34489o2154j49574j6953o357J21378k7863J14671N1849J66217
17996E27100J72834p1199l55806j61927P005M1269O1914j44810o4843n4109j00322
17985a42894l7530K4519K6662m6105J79962n8962k31064m8719Q4899j7385J45822
17974a20795J85766J02152j16513M8308j3177O536K16885J03769o6329j99530
17964A47072j80952j37607j7529J61809P5186n7744n4654n6020M5429J65109J46313
17953B36412M4732o3508j20093k15174j49772k7077R4832J59786k6765J17020
17943E0393j46283r0759J26717j6012j12378K3352q827O54Q9415j5127j49100
17932b47955R9195k5404J13332N4698r9576k10817q0052J75906K8588j551j18584
$$ plain form
17921 -312220 -113502 -146962 -236188 -242582 -288550 -193259 -316952 -457912 -532067 -690871 -552064
17910 -552064 -493761 -563261 -616544 -543475 -410878 -171365 -13734 -180753 -305800 -165158
17900 -165158 -251480 -474924 -454062 -421856 -382105 -251569 -214440 -249141 -242748 -190817 -312010
17889 -312010 -420525 -397860 -210668 -111931 -48869 14763 -72036 -93758 -148836 -213762 -253627
17878 -253627 -108318 -198256 -251721 -131600 -120480 -44087 203874 348799 221747 168384
17868 168384 107826 -36473 -45207 45624 -48311 -241640 -177315 -113254 -472985 -377064 -114218
17857 -114218 -81579 -243741 -194903 -80899 72551 136360 122561 34122 -73765 -271207
17847 -271207 -392737 -413525 -482942 -468139 -250108 -152366 -119809 -87333 -168698 -159950 -255486
$$ packed form
17921c12220J98718l3460q9226o394m5968R5291j23693j40960p4155j58804J38807
17910e52064N8303o9500n3283P3069J32597K39513J57631j67019j25047J40642
17900a65158q6322k23444K0862L2206L9751J30536L7129l4701O393N1931j21193
17889c12010j08515K2665J87192R8737O3062O3632q6799k1722n5078o4926l9865
17878b53627J45309q9938n3465J20121J1120P6393K47961J44925j27052n3363
17868A68384o0558j44299q734R0831r3935j93329O4325O4061l59731R5921K62846
17857a14218L2639j62162M8838J14004J53450O3809j3799q8439j07887j97442
17847b71207j21530k0788o9417J4803K18031R7742L2557L2476q1365Q748r5536
$$ plain form
17836 -255486 -112076 -151700 -64370 182955 145032 -132629 -299138 -130186 -93054 -256869
17826 -256869 -246579 -306858 -235782 -315015 -426717 -345199 -211746 -135049 -108415 -80501 -104919
17815 -104919 -149937 -330090 -391499 -551020 -506013 -217986 66397 126668 -141375 -258229
17805 -258229 -92092 271185 362689 337878 139473 -20201 25882 246218 215679 24655
17795 24655 -113290 -161512 -99699 -8430 55588 -18359 -34340 114865 75916 -26298 -113190
17784 -113190 -228919 -286657 -142575 -138834 -148861 -131058 -218816 -167661 -96497 -104776 23401
17773 23401 98747 59635 -244851 -199634 12522 -162085 -167369 -90425 -159180 -266864 -245406
17762 -245406 -256642 -228421 -23358 244967 210707 489 -130433 -165349 -121857 -209956 -313818
$$ packed form
17836b55486J43410l9624Q7330K47325l7923k77661j66509J68952L7132j63815
17826b56869J0290o0279P1076p9233j11702Q1518J33453P6697K6634K7914k4418
17815a04919m5018j80153o1409j59521M5007K88027K84383O0271k68043j16854
17805b58229J66137L63277R1504k4811j98405j59674M6083K20336l0539j91024
17795B4655j37945m8222O1813R1269O4018p3947j5981J49205l8949j02214q6892
17784a13190j15729n7738J44082L741j0027J7803q7758N1155P1164q279J28177
17773B3401P5346l9112l04486M5217K12156j74607n284P6944o8755j07684K1458
17762b45406j1236K8221K05063K68325l4260k10218j30922l4916M3492q8099j03862
$$ plain form
17751 -313818 -328766 -137999 -21568 -37639 -182004 -96285 -116706 -224825 -138079 -100325 -61740
17740 -61740 -53854 12745 42196 -24122 -32435 -313050 -258131 1241 98712 -12300 71529
17729 71529 -102580 -276452 -387584 -366710 -248424 -129312 -81723 -183253 -96379 -70388
17719 -70388 44224 8523 102005 36062 4789 153289 236615 219713 344986 210200 -28946
17708 -28946 -137927 -123250 -161504 -107342 -20516 32463 95124 45331 -123347 -91456 -11742
17697 -11742 59462 -38434 -67181 -190285 -409850 -257184 -174319 -134780 56993 126815 50583
17686 50583 -108443 -162402 -231622 -279036 -220762 -57406 -99991 -150783 -16716 5228 14838
17675 14838 -48980 -148457 -213593 -231487 -104546 14901 -2694 -124591 -193121 -363868 -525544
$$ packed form
17751c13818j4948J90767J16431j6071j44365Q5719k0421j08119Q6746L7754L8585
17740f1740P886O6599K9451o6318q313k80615N4919K59372R7471j11012Q3829
17729G1529j74109j73872j11132K0874J18286J19112M7589j01530Q6874K5991
17719g0388J14612l5701R3482o5943l1273J48500Q3326j6902J25273j34786k39146
17708b8946j08981J4677l8254N4162Q6826N2979O2661m9793j68678L1891P9714
17697a1742P1204r7896k8747j23104k19565J52666Q2865L9539J91773O9822p6232
17686E0583j59026n3959o9220m7414N8274J63356m2585n0792J34067K1944R610
17675A4838o3818r9477o5136j7894J26941J19447j7595j21897o8530j70747j61676
$$ plain form
17664 -525544 -369527 -279823 -244782 -229725 -358988 -424493 -376637 -386722 -276357 -140113 -95201
17653 -95201 -34797 -151090 -49746 322454 498659 472709 265861 117344 21358 -43199
17643 -43199 -36815 -147662 -168772 -101335 84009 134388 -2465 -125396 -192391 -233173 -153702
17632 -153702 -1586 -45800 -159670 -56890 88858 131649 154471 92064 -35245 39313
17622 39313 110960 64196 -145 -47506 -99574 -49059 123012 -46652 -287818 -335268 -261381
17611 -261381 -220119 -66832 60972 101738 35194 -58446 -129261 2047 105598 77626 13525
17600 13525 -34428 -118241 -288111 -220680 -142489 -108381 -157389 -165558 -67069 -93793 -272479
17589 -272479 -322282 -231776 -412550 -483724 -413673 -148937 -71020 -402978 -541857 -408139
$$ packed form
17664e25544J56017Q9704L5041J5057j29263o5505M7856j0085J10365J36244M4912
17653i5201O0404j16293J01344L72200J76205k5950k06848j48517r5986o4557
17643d3199O384j10847k1110O7437J85344N0379j36853j22931o6995m0782P9471
17632a53702J52116m4214j13870J02780J45748M2791K2822o2407j27309P4558
17622C9313P1647m6764o4341m7361n2068N0515J72071j69664k41166m7450P3887
17611b61381M1262J53287J27804M0766o6544r3640p0815J31308J03551k7972o4101
17600A3525m7953q3813j69870O7431P8191L4108m9008q169R8489k6724j78686
17589b72479m9803R0506j80774p1174P0051K64736P7917l31958j38879J33718
$$ plain form
17579 -408139 -335004 -326434 -259689 -201304 56173 212026 165949 113955 137669 -58512 -145388
17568 -145388 -95967 -73995 -45675 -134717 -51774 82721 110223 179280 243079 146471 202679
17557 202679 239361 114028 85739 117452 62006 21833 42405 61528 135627 149860 126498
17546 126498 -24583 -81317 206 -84668 -134036 -103586 -201410 -357968 -499384 -414286 -198620
17535 -198620 44213 105409 -12379 128815 138294 49702 71681 144364 110169 -18875 -4628
17524 -4628 -101296 -73830 -33854 74051 135577 89120 127159 244119 239244 -56829 -119930
17513 -119930 -68179 -167997 -230707 -191971 -204618 -293784 -229298 -184004 -291925 -325840 -285667
17502 -285667 -177985 -66995 -12400 175155 403242 381346 271551 249087 174935 107007
$$ packed form
17579d08139P3135Q570O6745N8385K57477J55853m6077n1994K3714j96181q6876
17568a45388M9421K1972K8320q9042Q2943J34495K7502O9057O3799r6608N6208
17557B02679L6682j25333k8289L1713n5446m0173K0572J9123P4099J4233k3362
17546A26498j51081n6734Q1523q4874m9368L0450r7824j56558j41416Q5098K15666
17535a98620K42833O1196j17788J41194R479q8592K1979P2683l4195j29044J4247
17524d628r6668K7466L9976J07905O1526m6457L8039J16960m875k96073o3101
17513a19930N1751r9818o2710L8736j2647q9166O4486M5294j07921l3915M0173
17502b85667J07682J10990N4595J87555K28087k1896j09795k2464p4152o7928
$$ plain form
17492 107007 42356 -188879 -288958 -149213 -17289 -56969 -123862 -146456 -134781 -119777 -129597
17481 -129597 3814 99141 194701 175933 5151 7058 2719 40544 166981 161936 221033
17470 221033 332536 353812 494843 719781 750654 584724 422830 208987 56942 249736
17460 249736 414160 423482 460325 424346 347684 395682 304387 53408 188892 245759 338158
17449 338158 258079 139496 78951 312 40934 24760 -43668 -25417 -5269 62449 -34601
17438 -34601 -212256 -343781 -224915 -266108 -33887 26786 -120011 55598 163301 106265
17428 106265 188146 127416 -84132 -93311 57050 115487 174198 107101 108092 45873 158107
17417 158107 206974 322647 328677 350959 504909 407860 424012 538576 455636 432720 402545
$$ packed form
17492A07007o4651k31235j00079J39745J31924l9680o6893k2594J1675J5004r820
17481a29597J33411R5327R5560j8768j70782J907m339L7825J26437n045N9097
17470B21033J11503K1276J41031K24938L0873j65930j61894k13843j52045J92794
17460B49736J64424R322L6843l5979p6662M7998r1295k50979J35484N6867R2399
17449C38158q0079j18583o0545p8639M0622j6174o8428J8251K0148O7718r7050
17438c4601j77655j31525J18866m1193K32221O0673j46797J75609J07703n7036
17428A06265Q1881o0730k11548r179J50361N8437N8711o7097R91o2219J12234
17417A58107M8867J15673O030K2282J53950r7049J6152J14564q2940k2916l0175
$$ plain form
17406 402545 152471 194229 347622 322643 410051 443384 504171 491252 425506 370392 251990
17395 251990 64289 -20774 45929 26948 -59237 -88373 -172656 -127867 -123928 2626 -74856
17384 -74856 -159517 -181542 -93159 -185273 -201434 -186760 -246415 -160532 46003 100475 102916 79833
17372 79833 90900 134854 5961 -151882 -165008 -94330 -14931 160110 123322 65972 -13885
17361 -13885 -48071 185586 233506 -22671 -101024 -1736 -65563 -123430 -23065 142476 173980
17350 173980 181840 71040 4857 -77950 51103 160295 -36879 119756 362583 240144
17340 240144 101159 72071 43402 -96025 -209670 -189452 -51579 172981 15844 -38069
17330 -38069 -8047 -276308 -390402 -181500 -169590 -72815 -2992 26172 58506 137327 65799
$$ packed form
17406D02545k50074M1758J53393k4979Q7408L3333O0787j2919o5746n5114j18402
17395B51990j87701q5063O6703j8981q6185k9136q4283M4789L939J26554p7482
17384g4856q4661k2025Q8383r2114j6161J4674n9655Q5883K06535N4472K441k3083
17372G9833J1067M3954j28893j57843j3126P0678P9399J75041l6788n7350p9857
17361a3885l4186K33657M7920k56177p8353R9288o3827n7867J00365J65541L1504
17350A73980P860j10800o6183q2807J29053J09192j97174J56635K42827j22439
17340B40144j38985k9088k8669j39427j13645K0218J37873K24560j57137n3913
17330c8069L0022k68261j14094K08902J1910R6775O9823K9164L2334P8821p1528
$$ plain form
17319 65799 -55944 -194823 -147884 -53597 51535 62267 105391 157195 150663 183643 347678
17308 347678 388734 300943 84819 27813 -76681 -195625 -63918 -7553 -39973 78732
17298 78732 156764 242514 409613 416625 255839 52964 -95475 -61634 26832 64993 169134
17287 169134 258735 257720 179237 111887 -34197 -54243 12873 18711 55277 -131156 -234240
17276 -234240 -311642 -316926 -259630 -200595 -223393 -305741 -196905 -80899 -33380 60490 252536
17265 252536 293995 299516 242435 163500 344152 267218 -81703 -190941 -150143 42901 19931
17254 19931 -108640 -126749 -34481 195549 242244 16071 -104280 -144673 -252322 -309285 -286495
17243 -286495 -328624 -289990 -164453 -121518 -49924 50999 43989 140381 320573 246716 184887
$$ packed form
17319F5799j21743j38879M6939R4287J05132J0732M3124N1804o532L2980J64035
17308C47678M1056q7791k16124n7006j04494j18944J31707N6365l2420J18705
17298G8732P8032Q5750J67099P012j60786k02875j48439L3841Q8466L8161J04141
17287A69134Q9601j015p8483o7350j46084k0046O7116N838L6566j86433j03084
17276b34240p7402n284N7296N9035k2798q2348J08836J16006M7519R3870J92046
17265B52536M1459N521n7081p8935J80652p6934l48921j09238M0798J93044k2970
17254A9931j28571j8109R2268K30030M6695k26173j20351m0393j07649n6963K2790
17243b86495m2129L8634J25537M2935P1594J00923p010R6392J80192p3857o1829
$$ plain form
17232 184887 199689 181541 79966 -20795 61193 37038 133196 134697 132653 156100 168880
17221 168880 159956 280630 330894 374108 308584 444521 487093 480820 286711 104885 163503
17210 163503 218970 191262 82720 16425 33409 242957 158840 158249 206758 75828 126925
17199 126925 179501 87007 9570 68638 152305 360507 439758 293894 91727 67118 164235
17188 164235 150599 99392 159595 220654 104659 103497 -162013 -230819 -61065 152975 43945
17177 43945 -79397 -67384 -33671 -11988 127450 75006 10230 106820 115884 177804 251806
17166 251806 372261 300263 71527 -146302 -121999 26493 226303 248698 114544 236282
17156 236282 345606 380803 138915 -150233 -175439 -82820 -21552 -55801 -11552 73727 168318
$$ packed form
17232A84887J4802j8148j01575j00761Q1988k4155R6158J501k044K3447J2780
17221A68880q924J20674N0264M3214o5524J35937M2572o273j94109j81826N8618
17210A63503N5467k7708j08542o6295J6984K09548q4117n91M8509j30930N1097
17199A26925N2576r2494p7437N9068Q3667K08202P9251j45864k02167k4609R7117
17188A64235j3636n1207O0203O1059j15995j162k65510o8806J69754K14040j09030
17177D3945j23342J2013L3713K1683J39438n2444o4776R6590R064O1920P4002
17166B51806J20455p1998k28736k17829K4303J48492J99810K2395j34154J21738
17156B36282J09324L5197k41888k89148k5206R2619O1268l4249M4249Q5279R4591
$$ plain form
17145 168318 180601 -153032 -105085 35910 215561 181073 369602 466785 325350 58050
17135 58050 -36524 -48468 -160541 -420749 -380479 -133786 419 102102 105291 192705 307912
17124 307912 446725 587621 466680 331849 342932 99390 -166228 -241163 -286260 -7383
17114 -7383 32706 91344 1405 -110097 -99136 35861 53585 76612 177313 210395 294382
17103 294382 326894 295534 186823 56990 -28930 24018 95254 91098 234707 437560 412337
17092 412337 99521 81894 277344 159833 222516 260536 20969 -3515 86734 116785 262754
17081 262754 141110 -13326 -12224 233909 290195 176915 67587 -35490 44923 94782
17071 94782 113926 -18776 110177 19037 -48472 46236 102266 118277 105826 78634 53200
$$ packed form
17145A68318J2283l33633M7947J40995J79651l4488J88529R7183j41435k67300
17135E8050r4574j1944j12073k60208M0270K46693J34205J01683L189Q7414J15207
17124C07912J38813J40896j20941j34831J1083k43542k65618p4935m5097K78877
17114g383M0089N8638q9939j11502J0961J34997J7724K3027J00701L3082Q3987
17103B94382L2512l1360j08711j29833q5920N2948P1236m156J43609K02853k5223
17092D12337l12816j7627J95450j17511O2683L8020k39567k4484R0249L0051J45969
17081B62754j21644j54436J102K46133N6286j13280j09328j03077Q0413M9859
17071I4782J9144j32702J28953r1140o7509R4708N6030J6011j2451k7192k5434
$$ plain form
17060 53200 53241 204716 138602 10176 107016 112438 10699 -97232 -265406 -186755 32796
17049 32796 281385 352514 407244 542609 579902 355661 138067 -1307 -84140 -183471 -28109
17038 -28109 146997 263435 236218 64257 -14903 196977 205522 -4504 -39590 59320 269098
17027 269098 318643 224993 57386 284388 203789 126411 136389 -37823 68193 123470 156710
17016 156710 146463 223490 383920 422201 317650 264020 214840 128114 764 -111161 56855
17005 56855 145085 78994 259964 439793 564461 625935 448557 331760 381341 393437 235187
16994 235187 214330 251110 185718 259754 91601 9815 84107 -30235 -28674 135642 361374
16983 361374 474934 461488 517142 503606 495020 225138 124503 21194 155478 189516 55131
$$ packed form
17060E3200M1J51475o6114j28426R6840N422j01739j07931j68174P8651K19551
17049C2796K48589P1129N4730J35365L7293k24241k17594j39374q2833r9331J55362
17038b8109J75106J16438k7217j71961p9160K11880Q545k10026l5086R8910K09778
17027B69098M9545r3650j67607K27002q0599p7378R978j74212J06016N5277L3240
17016A56710j0247P7027J60430L8281j04551n3630m9180q6726j27350j11925J68016
17005E6855Q8230o6091J80970J79829J24668O1474j77378j16797M9581J2096j58250
16994B35187k0857L6780o5392P4036j68153q1786P4292j14342J561J64316K25732
16983C61374J13560j3446N5654j3536q586k69882j00635j03309J34284L4038j34385
$$ plain form
16972 55131 -129879 -84831 -235155 -224385 -123393 125412 274810 556756 506161 228069
16962 228069 77930 24253 143411 224174 196474 336173 275337 131262 -118248 -262420
16952 -262420 -101203 7680 -32901 -15331 9114 7186 60039 113786 156464 214104 281107
16941 281107 357456 307626 318758 405197 361857 324191 356988 384910 246964 117295 -33860
16930 -33860 34400 128315 141797 145468 268657 305747 320174 313778 272163 267020 287607 316882
16918 316882 377484 291132 177607 149481 275056 490954 442790 350938 421161 511478 377355
16907 377355 304735 298337 353434 489512 506218 481425 348023 193286 75818 -8273 134915
16896 134915 250240 373470 120661 -24880 231619 181759 142633 250409 324560 351447
$$ packed form
16972E5131j85010M5048j50324J0770J00992K48805J49398K81946n0595k78092
16962B28069j50139n3677J19158Q0763k7700J39699o0836j44075k49510j44172
16952b62420J61217J08883m0581J7570K4445j928N2853N3747M2678N7640O7003
16941B81107P6349m9830J1132Q6439m3340l7666L2797K7922j37946j29669j51155
16930c3860O8260R3915J3482L671J23189L7090J4427o396m1615n143K0587K9275
16918C16882O0602q6352j13525k8126J25575K15898m8164r1852P0223R0317j34123
16907C77355p2620o398N5097J36078J6706k4793j33402j54737j17468q4091J43188
16896A34915J15325J23230k52809j45541K56499m9860l9126J07776P4151K6887
$$ plain form
16886 351447 227833 145727 -8855 -57171 -115258 -203359 -126890 83438 166241 276556 223915
16875 223915 160228 185795 134801 164749 138384 151303 179355 123916 112783 138882 48132
16864 48132 75175 -75551 -233958 -244467 -19503 212357 303949 271886 195799 59005 -88201
16853 -88201 -139182 -154482 -90650 -65344 -98652 -126058 -10373 229972 337246 172670 132287
16842 132287 112554 113288 284333 373489 176400 22950 145962 152543 146225 45641 80294
16831 80294 261587 292690 236129 276661 214784 75656 46337 108148 170410 419576 353340
16820 353340 256255 250856 164479 88988 -35778 -84963 20047 158267 280516 226354 105613
16809 105613 23065 113225 138513 6190 75437 186405 90197 -92711 -255007 -154090
$$ packed form
16886C51447j23614q2106j54582m8316n8087q8101P6469K10328Q2803J10315n2641
16875B23915o3687K5567n0994K9948k6365J2919K8052n5439j1133K6099r0750
16864D8132K7043j50726j58407j0509K24964K31860R1592l2063p6087j36794j47206
16853h8201n0981j5300O3832K5306l3308k7406J15685K40345J07274j64576m0383
16842A32287j9733P34J71045Q9156j97089j53450J23012O581o318j00584L4653
16831H0294J81293L1103n6561M0532o1877j39128k9319O1811O2262K49166o6236
16820C53340r7085n399q6377p5491j24766m9185J05010J38220J22249n4162j20741
16809A05613q2548R0160K5288j32323O9247J10968r6208j82908j62296J00917
$$ plain form
16799 -154090 125097 460686 417094 373907 337097 190296 -57578 -46440 114554 177874
16789 177874 211109 221922 55390 262348 318625 300414 398368 311391 408434 632598 631459
16778 631459 467480 366724 306108 383804 487942 716278 631648 397153 324769 369565
16768 369565 491226 470589 420820 343148 347247 302682 311537 401475 399312 445926 432416 299101
16756 299101 400829 558942 363206 162168 165428 246952 501068 587883 424554 231417
16746 231417 -12539 91860 478054 588648 538222 442814 206637 401654 424914 270208
16736 270208 372343 266114 412168 523539 303561 314693 305387 351903 343708 433411 305798
16725 305798 344234 454126 340706 297837 189664 -143555 -22036 391807 481769 412679
$$ packed form
16799a54090K79187L35589m3592m3187l6810j46801k47874J1138J60994O3320
16789A77874L3235J0813j66532K06958N6277j8211R7954q6977R7043K24164j139
16778F31459j63979j00756o0616P7696J04138K28336q4630k34495p2384M4796
16768C69565J21661k0637m9769p7672M099m4565Q855Q9938k163M6614j3510j33315
16756B99101J01728J58113j95736k01038L260Q1524K54116Q6815j63329j93137
16746B31417k43956J04399L86194J10594n0426r5408k36177J95017K3260j54706
16736B70208J02135j06229J46054J11371k19978J1132r306M6516q195Q9703j27613
16725C05798L8436J09892j13420m2869j08173l33219J21519M13843Q9962o9090
$$ plain form
16715 412679 409706 334606 403236 572025 515365 391350 358404 419031 501976 549240 384875
16704 384875 379027 296319 270050 268036 354039 547518 648230 654585 541420 491868 416228
16693 416228 496365 415351 227136 212999 158555 73159 35297 109023 265022 415160 337247
16682 337247 365085 441091 313070 343625 355692 362126 263310 85656 282098 416430 364148
16671 364148 228079 251952 294912 440197 411642 59470 -150211 -67611 13414 3830 167431
16660 167431 331067 262967 92156 57937 193021 369257 551542 506124 601392 652017
16650 652017 545034 329795 223480 140613 159578 257328 380050 211544 221366 243128 350226
16639 350226 227332 146354 132428 313502 317700 233951 292146 351417 469757 323097 235228
$$ packed form
16715D12679k973p5100O8630J68789n6660j24015l2946O0627Q2945M7264j64365
16704C84875n848q2708k6269k014Q6003J93479J00712O355j13165m9552p5640
16693D16228Q0137q1014j88215j4137n4444q5396l7862P3726J55999J50138p7913
16682C37247K7838P6006j28021L0555J2067O434r8816j77654J96442J34332n2282
16671C64148j36069K3873M2960J45285k8555l52172k09681Q2600Q1025r584J63601
16660A67431J63636o8100j70811l4219J35084J76236J82285m5418R5268N0625
16650F52017j06983k15239j06315q2867J8965R7750J22722j68506R822K1762J07098
16639C50226j22894q0978j3926J81074M198q3749N8195N9271J18340j46660q7869
$$ plain form
16628 235228 233668 257276 269393 270377 436218 516362 444226 503711 506355 495834 405737 406675
16616 406675 345872 323038 201329 429844 500271 450863 190437 68528 184511 452653
16606 452653 385054 139515 107493 295942 405191 253847 250354 291861 367035 246006 155432
16595 155432 151621 216625 53816 123407 422471 442516 450319 449218 562530 556054 448535
16584 448535 347827 362671 378531 254177 164802 65437 68634 286048 646204 814216 566939
16573 566939 300264 263704 98390 60832 151221 104457 146541 382950 419697 519389 575536
16562 575536 633515 561724 483720 333622 435105 533231 508542 442928 357512 292343 151362
16551 151362 341491 321861 234954 373527 602778 510528 560532 459953 339805 284208
$$ packed form
16628B35228j560K3608J2117R84J65841Q0144p2136N9485K644j0521r0097R38
16616D06675o0803k2834j21709K28515P0427m9408k60426j21909J15983K68142
16606D52653o7599k45539l2022J88449J09249j51344l493M1507P5174j21029r0574
16595A55432l811O5004j62809O9591K99064K0045P803j101J13312o476j07519
16584D48535j00708J4844J5860j24354q9375r9365L197K17414L60156J68012k47277
16573E66939k66675l6560j65314l7558R0389m6764M2084K36409L6747R9692N6147
16562E75536N7979p1791p8004j50098J01483R8126k4689o5614q5416o5169j40981
16551A51362J90129j9630q6907J38573K29251r2250N0004j00579j20148n5597
$$ plain form
16541 284208 366891 244595 307398 315409 382760 587204 532228 361978 350097 488882 379240
16530 379240 120403 98719 278689 71903 11635 179856 323562 428180 373827 391449
16520 391449 435697 290593 93075 236014 428905 293456 203115 205887 250101 310261 283128
16509 283128 261571 106683 213734 264771 247317 148272 234948 460616 604135 446338
16499 446338 251019 299651 311615 489555 550703 499006 427477 271639 250862 320621 175920
16488 175920 293497 263206 391135 517105 479174 434839 352008 251225 253895 311309 406298
16477 406298 416281 438510 574093 641152 501903 350608 353744 465241 464388 462802 468645 586954
16465 586954 638469 593438 577075 487031 380058 381684 432718 473002 548257 593741 594474 751781
$$ packed form
16541B84208Q2683j22296O2803Q011O7351K04444n4976j70250j1881J38785j09642
16530C79240k58837k1684J79970k06786o0268J68221J43706J04618n4353J7622
16520C91449M4248j45104j97518J42939J92891j35449r0341K772M4214O0160k7133
16509B83128k1557j54888J07051N1037j7454r9045Q6676K25668J43519j57797
16499D46338j95319M8632J1964J77940O1148n1697p1529j55838k0777O9759j44701
16488A75920J17577l0291J27929J25970l7931m4335q2831j00783K670N7414R4989
16477D06298R983K2229J35583O7059j39249j51295L136J11497q53j586N843J18309
16465E86954N1515m5031j6363r0044j06973J626N1034M0284P5255M5484P33J57307
$$ plain form
16453 751781 771624 666523 611596 659472 620451 517972 471926 340026 374623 344948 442748
16442 442748 554001 477921 515445 530904 534189 580861 682453 669312 495964 450973 429953
16431 429953 402905 364342 501325 581830 640631 601179 748886 711670 536253 493945 413718
16420 413718 318797 331316 228226 126722 101578 167266 163207 279838 222606 131511 275523
16409 275523 530455 751456 878274 694557 589884 680478 664698 629087 452319 301622
16399 301622 411166 485208 516086 467113 546527 681499 622661 748858 788003 553759 397570
16388 397570 508638 427652 382664 474800 484752 572225 585515 746539 926406 871397 624863
16377 624863 493880 426821 414807 476795 508129 574937 685652 809970 815018 606645 574322
$$ packed form
16453G51781J9843j05101n4927M7876l9021j02479m6046j31900L4597k9675R7800
16442D42748J11253p6080L7524J5459L285M6672J01592j3141j73348m4991k1020
16431D29953k7048l8563J36983Q0505N8801l9452J47707l7216j75417m2308q0227
16420D13718r4921J2519j03090j01504k5144O5688m059J16631n7232r1095J44012
16409B75523K54932K21001J26818j83717j04673R0594j5780l5611j76768j50697
16399C01622J09544P4042L0878m8973P9414J34972n8838J26197L9145k34244j56189
16388C97570J11068q0986m4988R2136R952Q7473J3290J61024J79867n5009k46534
16377F24863j30983o7059j2014O1988L1334O6808J10715J24318N048k08373l2323
$$ plain form
16366 574322 614324 574857 637097 775231 762248 699337 784634 853736 802300 646704 518842
16355 518842 398284 463322 681192 752378 603183 412341 545158 612870 671860 686700
16345 686700 536172 342294 239381 505350 617853 583317 505727 674438 622573 598542
16335 598542 655351 691460 746858 741554 740093 634418 629018 648555 745256 653178 563552 482093
16323 482093 470600 401041 422051 430160 461943 426103 342247 369346 646302 818621 945712
16312 945712 820246 739857 729948 664117 583403 599073 518837 438150 312285 379708 476487
16301 476487 515684 761260 884664 840715 728283 654883 696565 673037 521492 627015
16291 627015 674753 834517 908354 571214 515924 601331 587901 561595 532229 792070 778182
$$ packed form
16366E74322M0002l9467O2240J38134j2983o2911Q5297O9102n1436j55596j27862
16355E18842j20558O5038K17870P1186j49195j90842J32817O7712N8990J4840
16345F86700j50528j93878j02913K65969J12503l4536p7590J68711n1865k4031
16335E98542N6809L6109N5398n304j461j05675n400J9537R6701r2078q9626q1459
16323D82093j1493o9559K1010Q109L1783l5840q3856K7099K76956J72319J27091
16312I45712j25466q0389r909o5831q0714J5670q0236q0687j25865O7423R6779
16301D76487L9197K45576J23404m3949j12432p3400M1682k3528j51545J05523
16291F27015M7738J59764P3837l37140n5290Q5407j3430k6306k9366K59841j3888
$$ plain form
16280 778182 623145 555039 544987 550391 626921 589816 399146 452922 377672 350052 452374
16269 452374 442347 328620 494208 519390 463948 378407 433387 504584 466237 426171 489120
16258 489120 490615 464636 486953 631255 1045222 1080157 1030476 896972 831728 870475 818515
16247 818515 660216 677864 574091 600741 630565 669008 604090 728851 692798 591455 602550
16236 602550 647640 634312 608416 736099 831930 833014 762446 568849 490989 718076 615152
16225 615152 529661 726144 602649 505832 590750 726629 683216 653651 760810 869475
16215 869475 1023812 1150250 940906 840799 714218 683467 723500 846947 710986 612392
16205 612392 768064 923477 1132343 1042971 818310 808813 815560 774714 812051 832833 745763
$$ packed form
16280G78182j55037o8106j0052N404P6530l7105j90670N3776p5250k7620J02322
16269D52374j0027j13727J65588K5182n5442q5541N4980P1197l8347m0066O2949
16258D89120J495k5979K2317J44302M13967L4935m9681j33504o5244L8747n1960
16247H18515j58299J7648j03773K6650K9824L8443o4918J24761l6053j01343J1095
16236F02550M5090j3328k5896J27683R5831J084p0568j93597p7860K27087j02924
16225F15152q5491J96483j23495r6817Q4918J35879m3413k9565J07159J08665
16215H69475J54337J26438k09344j00107j26581l0751M0033J23447j35961r8594
16205F12392J55672J55413K08866q9372k24661r497O747m0846L7337K0782q7070
$$ plain form
16194 745763 772450 843969 911567 832883 914300 985265 808867 768402 834893 909020 802672
16183 802672 700112 530732 437268 438200 557335 666156 768727 659845 306642 411530
16173 411530 578735 620881 583200 542781 715698 772704 882941 1004712 911307 766695
16163 766695 724550 827952 813496 740755 500487 516624 571792 489596 334820 482539 653945
16152 653945 624852 661132 829599 922214 907673 721150 603285 580777 610913 521209 414404
16141 414404 500964 653408 676379 670356 608140 558941 610842 721937 973097 1076086 957522
16130 957522 1027343 1154704 1216129 1002754 787588 886323 818533 716729 745018 685933 628571
16119 628571 591257 677900 687428 698269 709942 739121 640537 349537 503699 614379 721705
$$ packed form
16194G45763K6687P1519O7598p8684Q1417P0965j76398m0465O6491P4127j06348
16183H02672j02560j69380r3464R32J19135J08821J02571j08882l53203J04888
16173D11530J67205M2146l7681m0419J72917N7006J10237J21771r3405j44612
16163G66695m2145J03402j4456p2741k40268J6137N5168q2196j54776J47719J71406
16152F53945k9093L6280J68467R2615j4541j86523j17865k2508L0136q9704j06805
16141D14404Q6560J52444K2971o023o2216m9199N1901J11095K51160J02989j18564
16130I57522O9821J27361O1425k13375k15166R8735o7790j01804K8289n9085n7362
16119F28571l7314Q6643R528J0841J1673K9179r8584k91000J54162J10680J07326
$$ plain form
16108 721705 927425 770029 740749 552107 545534 713355 756587 731708 626102 625469 640331
16097 640331 907083 951174 856383 923129 914702 901642 909355 736252 821825 994071 869301
16086 869301 622705 667091 755866 949419 992076 890761 977100 827936 743152 908940
16076 908940 1035528 1008534 999648 884230 905827 1018292 1015252 918385 848889 977771 908920
16065 908920 881498 806389 740784 579449 662446 873516 911852 1017466 1062630 923487 879864
16054 879864 877082 838036 1046175 936613 748033 718156 664923 836160 837077 720212 764637
16043 764637 845584 889281 1019631 902092 874299 799074 776414 915286 939697 968393 996783
16032 996783 929747 692728 555210 741571 800639 613848 601127 767640 988115 1040380
$$ packed form
16108G21705K05720j57396k9280j88642o573J67821M3232k4879j05606o33J4862
16097F40331K66752M4091r4791O6746q427j3060P713j73103Q5573J72246j24770
16086H69301k46596M4386Q8775J93553M2657j01315Q6339j49164q4784J65788
16076I08940J26588k6994q886j15418K1597J12465l040r6867o9496J28882o8851
16065I08920k7422p5109o5605j61335Q2997K11070L8336J05614M5164j39143m3623
16054H79864k782l9046K08139j09562j88580k9877n3233J71237R17j16865M4425
16043G64637Q0947M3697J30350j17539k7793p5225k2660J38872K4411K8696K8390
16032I96783o7036k37019j37518J86361N9068j86791j2721J66513K20475N2265
$$ plain form
16022 1040380 1147813 1032383 928598 1027652 1086369 989406 1001967 1007373 991098 958794 773183
16011 773183 665651 845779 1021787 878274 786151 978826 1072450 1195378 1037820 1196045
16001 1196045 1407283 1481406 1434130 1215629 989183 1029387 984537 903326 804772 823501 801694
15990 801694 892645 828513 792105 925194 837626 727857 844401 932452 863380 583069 618966
15979 618966 675262 657747 726167 813472 798960 679965 856422 889797 712833 682484 587091
15968 587091 581151 768392 981847 1207289 1194039 999587 1225621 1194145 941414 676926
15958 676926 556842 581410 585550 571907 712623 819655 852789 832511 1052368 1134217 1186958
15947 1186958 1085641 918214 983847 1086407 1059184 1149436 1130335 1322671 1354917 1179234
$$ packed form
16022A040380J07433j15430j03785R9054N8717r6963J2561N406j6275l2304j85611
16011G73183j07532J80128J76008j43513r2123J92675R3624J22928j57558J58225
16001A196045K11238P4123m7276k18501k26446M0204m4850q1211r8554J8729k1807
15990H01694R0951o4132l6408J33089q7568j09769J16544Q8051o9072k80311L5897
15979F18966N6296j7515O8420Q7305j4512j18995J76457L3375j76964l0349r5393
15968E87091n940J87241K13455K25442j3250j94452K26034l1476k52731k64488
15958F76926j20084K4568M140j3643J40716J07032L3134k0278K19857Q1849N2741
15947A186958j01317j67427O5633J02560k7223R0252j9101J92336L2246j75683
$$ plain form
15937 1179234 1155530 1102019 1030404 1069577 1148547 1000711 896724 1042493 1118657 1042352 1056493
15926 1056493 1016542 877607 934993 1025183 1006795 976362 1065435 908859 856127 985467 989216
15915 989216 1026881 1010499 900059 902768 1014277 994617 984560 1132349 1195950 1099335 847951
15904 847951 823980 964851 1091190 1169983 1108410 1112751 1286364 1323998 1218756 1184375 1206237
15893 1206237 1386631 1370310 1081422 1026840 975564 1088040 951026 844480 868722 916623
15883 916623 792461 747343 821722 810356 763048 919387 939864 864628 992539 1135576 1112811
15872 1112811 1223662 1207563 1305873 1308251 1459472 1474207 1441295 1343181 1302464 1339602 1102091
15861 1102091 775533 757277 838402 876545 1099348 1180653 1180820 962532 943558 1173774 1265218
$$ packed form
15937A179234k3704n3511p1615L9173P8970j47836j03987J45769P6164p6305J4141
15926A056493l9951j38935N7386R0190j8388l0433Q9073j56576n2732J29340L749
15915I89216L7665j6382j10440K709J11509j9660j0057J47789O3601r6615k51384
15904H47951k3971J40871J26339P8793o1573M341J73613L7634j05242l4381K1862
15893A206237J80394j6321k88888n4582n1276J12476j37014j06546K4242M7901
15883I16623j24162m5118P4379j1366m7308J56339K0477p5236J27911J43037k2765
15872A112811J10851j6099R8310K378J51221J4735l2912r8114m0717L7138k37511
15861A102091l26558j8256Q1125L8143K22803Q1305J67k18288j8974K30216R1444
$$ plain form
15850 1265218 1210114 1186134 1210913 1077279 969660 894340 1052786 1161515 1120333 1110129
15840 1110129 1107298 1247607 1220424 1165407 1188641 1080368 903901 963241 893590 951005 879362
15829 879362 790867 813532 872741 1118645 1179780 1053363 1032569 947002 1010997 1010133 1100254
15818 1100254 1217178 1074499 1167506 1212287 1039042 1042350 1184088 1198330 1142029 1134431 1111077
15807 1111077 1096743 1132879 1116406 1030083 1064105 1120170 1157416 1131885 1082420 907629 1017605
15796 1017605 936425 912652 1118795 1153453 1192627 1112430 1190132 1151350 1045792 896997 692924
15785 692924 792080 785294 887083 990567 954339 1019969 1076327 1229792 1267234 1301917 1362219
15774 1362219 1219346 1274038 1370351 1434271 1373758 1226724 1168096 1228110 1098938 999985 1118867
$$ packed form
15850A265218n5104k3980K4779j33634j07619p5320J58446J08729m1182j0204
15840A110129k831J40309k7183n5017K3234j08273j76467N9340o9651N7415p1643
15829H79362q8495K2665N9209K45904O1135j26417k0794q5567O3995q64R0121
15818A100254J16924j42679R3007M4781j73245L308J41738J4242n6301p598k3354
15807A111077j4334L6136j6473q6323L4022N6065L7246k5531m9465j74791J09976
15796A017605q1180k3773K06143L4658L9174q0197P7702l8782j05558j48795k04073
15785F92924R9156o786J01789J03484l6228O5630N6358J53465L7442L4683O0302
15774A362219j42873N4692R6313O3920o0513j47034n8628O0014j29172r8953J18882
$$ plain form
15763 1118867 1174011 1063738 950951 916535 836926 807032 971971 852871 807757 1069491
15753 1069491 1157764 1127941 1053268 1275982 1517825 1669810 1706177 1644134 1605863 1562353 1331264
15742 1331264 1186746 1258800 1427551 1409151 1286760 1238104 1404075 1506316 1376586 1417836
15732 1417836 1427308 1234985 1211307 1217884 1257713 1329757 1273714 1417808 1329430 1264824 1082485
15721 1082485 1054662 1219760 1324458 1227921 1201357 1059257 869755 856559 875483 1023312
15711 1023312 1088000 1179252 1281640 1474019 1518797 1364939 1299055 1202034 1134021 1232344 1143584
15700 1143584 1091546 1046468 1034985 1182706 1294963 1202302 1276244 1092230 1168133 1361849
15690 1361849 1274282 1111812 992944 1028210 1245187 1224080 1214638 1291769 1227619 1189717 1347424
$$ packed form
15763A118867N5144j10273j12787l4416p9609k9894J64939j19100m5114K61734
15753A069491Q8273k9823p4673K22714K41843J51985L6367o2043l8271m3510k31089
15742A331264j44518P2054J68751j8400j22391m8656J65971J02241j29730M1250
15732A417836R472j92323k3678O577L9829P2044n6043J44094q8378o4606j82339
15721A082485k7823J65098J04698r6537k6564j42100j89502j3196J8924J47829
15711A023312O4688R1252J02388J92379M4778j53858o5884r7021o8013R8323q8760
15700A143584n2038m5078j1483J47721J12257r2661P3942j84014P5903J93716
15690A361849q7567j62470j18868L5266K16977k1107r442P7131o4150l7902J57707
$$ plain form
15679 1347424 1322592 1383057 1513679 1674405 1778823 1789723 1781840 1654073 1600432 1800982
15669 1800982 1594606 1330845 1137229 1148358 1180073 1128317 1247270 1131368 1022560 1146138
15659 1146138 1131060 1079882 1290154 1570617 1576374 1506628 1567169 1616267 1552628 1439543 1393674
15648 1393674 1363736 1297429 1227294 1339599 1376004 1465304 1470821 1503786 1694274 1683985 1456455
15637 1456455 1502368 1696647 1612635 1681133 1552748 1444552 1335679 1223114 1328337 1349224
15627 1349224 1495999 1476428 1436676 1416158 1485089 1596564 1586676 1291518 1157955 1269425
15617 1269425 1259244 966164 905691 951633 1099706 1261834 1357050 1383669 1337399 1305042 1446397
15606 1446397 1597975 1566821 1484151 1460290 1425838 1445787 1498018 1666529 1630723 1509083 1488426
$$ packed form
15679A347424k4832O0465J30622J60726J04418J0900p883j27767n3641K00550
15669A800982k06376k63761j93616J1129L1715n1756J18953j15902j08808J23578
15659A146138j5078n1178K10272K80463N757o9746O0541M9098o3639j13085m5869
15648A393674k9938o6307p0135J12305L6405Q9300N517L2965J90488j0289k27530
15637A456455M5913J94279q4012O8498j28385j08196j08873j12565J05223K0887
15627A349224J46775j9571l9752k0518O8931J11475r888k95158j33563J11470
15617A269425j0181k93080o0473M5942J48073J62128R5216K6619m6270l2357J41355
15606A446397J51578l1154q2670k3861l4452J9949N2231J68511l5806j21640k0657
$$ plain form
15595 1488426 1690903 1703125 1382870 1310728 1372164 1283774 1198111 1309167 1568967 1412036
15585 1412036 1485670 1692099 1781122 1570665 1595937 1773363 1703351 1890841 1729265 1549041
15575 1549041 1715591 1739352 1546727 1487161 1581852 1593329 1574885 1706110 1819454 1851319
15565 1851319 1722010 1762980 1912698 1962555 1929764 1817389 1531578 1441052 1488786 1476449
15555 1476449 1466163 1414641 1599805 1607785 1665628 1609615 1715986 1749810 1674196 1607711 1787429
15544 1787429 1995670 2117353 2218309 2060498 1955511 2056481 2126408 1959054 1811547 1709057
15534 1709057 1637428 1507328 1298310 1220984 1218906 1250919 1331043 1538214 1636002 1576937 1514389
15523 1514389 1689820 1673453 1504475 1639113 1686021 1750006 2080877 1850285 1619802 1592736
$$ packed form
15595A488426K02477J2222l20255p2142O1436q8390q5663J11056K59800j56931
15585A412036P3634K06429Q9023k10457K5272J77426p0012J87490j61576j80224
15575A549041J66550K3761j92625n9566R4691J1477j8444J31225J13344L1865
15565A851319j29309M0970J49718M9857l2791j12375k85811r0526M7734j2337
15555A476449j0286n1522J85164P980N7843n6013J06371L3824p5614o6485J79718
15544A787429K08241J21683J00956j57811j04987J00970O9927j67354j47507j02490
15534A709057p1629j30100k09018p7326k078L2013Q0124K07171R7788n9065o2548
15523A514389J75431j6367j68978J34638M6908O3985L30871k30592k30483k7066
$$ plain form
15513 1592736 1496076 1605125 1646544 1749249 1861569 1924047 1804461 1572952 1503853 1633152
15503 1633152 1700052 1738806 1728564 1675173 1629109 1433863 1537377 1723250 1697111 1742569 1597093
15492 1597093 1423431 1242226 1483537 1591589 1665742 1723655 1782037 1785975 1721794 1726091 1738550
15481 1738550 1737661 1819962 1810897 1927837 1895127 1979976 1988879 1832304 1541505 1479701 1505565
15470 1505565 1587044 1667056 1870830 2058685 1876798 1711772 1696755 1599698 1565932 1756104
15460 1756104 1772819 1818162 1748377 1509324 1631416 1970661 1917906 1769682 1609372 1494315
15450 1494315 1621612 1709292 1900851 2010636 1886973 1754920 1796352 1959434 2090295 2219676
15440 2219676 1902351 1683251 1769076 1896631 1946762 1949676 1875932 1924804 1909072 2001465 2132432
$$ packed form
15513A592736r6660J09049M1419J02705J12320O2478j19586k31509o9099J29299
15503A633152O6900L8754j0242n3391m6064j95246J03514J85873k6139M5458j45476
15492A597093j73662j81205K41311J08052P4153N7913N8382L938o4181M297J2459
15481A738550q89Q2301r065J16940l2710Q4849Q903j56575k90799o1804K5864
15470A505565Q1479Q0012K03774J87855j81887j65026j5017r7057l3766J90172
15460A756104J6715M5343o9785k39053J22092L39245n2755j48224j60310j15057
15450A494315J27297Q7680J91559J09785j23663j32053M1432J63082J30861J29381
15440B219676l17325k19100Q5825J27555N0131K914p3744M8872j5732R2393J30967
$$ plain form
15429 2132432 2047347 2213004 2139566 1646719 1515620 1546890 1427298 1422422 1591049 1660391
15419 1660391 1709081 1806177 1963610 1880411 1820028 1936977 2072148 2179067 2028493 1965322
15409 1965322 2060239 2028175 2072369 2187932 2263440 2122157 2138199 2123796 1897718 1723269
15399 1723269 1600827 1486498 1608785 1834344 1827516 1849809 2139108 1951329 1799289 1741370
15389 1741370 1789831 1853314 1846671 1870110 1710786 1666133 1757637 1881858 1844756 1805302 1937068
15378 1937068 1943287 1803259 1653616 1795055 1831599 2035357 2019577 1973996 1960902 2105226
15368 2105226 2172658 2105732 2133443 1952169 1948471 2022970 1980770 1873490 2028519 1948518 1876992
15357 1876992 1966231 2097108 1918626 1921771 1882482 1906087 2156888 2328946 2169999 2073036
$$ packed form
15429B132432q5085J65657p3438m92847j31099L1270j19592m876J68627O9342
15419A660391M8690R7096J57433q3199o0383J16949J35171J06919j50574o3171
15409A965322R4917l2064M4194J15563P5508j41283J6042j4403k26078j74449
15399A723269j22442j14329J22287K25559o828K2293K89299j87779j52040n7919
15389A741370M8461O3483o643K3439j59324m4653R1504J24221l7102l9454J31766
15378A937068O219j40028j49643J41439L6544K03758j5780m5581j3094J44324
15368B105226O7432o6926K7711j81274l698P4499m2200j07280J55029q0001p1526
15357A876992Q9239J30877j78482L145l9289K3605K50801J72058j58947r6963
$$ plain form
15347 2073036 2081750 1912521 1864838 1870282 1908595 2049927 1994917 1856113 2114617 2227642 2221507
15336 2221507 2360703 2375081 2356270 2297952 2318312 2416524 2634559 2610180 2381472 2104339
15326 2104339 2162855 2323067 2299820 2250058 2074196 2022028 2082980 2045952 2030931 1983556 1984713
15315 1984713 2075308 2192302 2258492 2232699 2153671 2319643 2338633 2093590 1880432 1945106
15305 1945106 1954673 1886049 2117950 2190212 2026159 2005099 2017026 2049532 1984423 1887670 2057562
15294 2057562 2078272 2268083 2172198 2211646 2232666 2293462 2181151 2145757 2238811 2022379 1814461
15283 1814461 1881612 2056435 2479351 2520501 2390627 2304819 2139437 2128989 2136827 2222548 2152897
15272 2152897 2281726 2451299 2385362 2374403 2401970 2211682 2233833 2450551 2472193 2437175
$$ packed form
15347B073036Q714j69229m7683N444L8313J41332n5010j38804K58504J13025o135
15336B221507J39196J4378j8811n8318K0360R8212K18035k4379k28708k77133
15326B104339N8516J60212k3247m9762j75862n2168O0952l7028j5021m7375J157
15315A984713R0595J16994O6190k5793p9028J65972J8990k45043k13158O4674
15305A945106R567o8624K31901P2262j64053k1060J1927L2506o5109r6753J69892
15294B057562K0710J89811r5885L9448K1020O0796j12311l5394R3054k16432k07918
15283A814461O7151J74823M22916M1150j29874q5808j65382j0448P838Q5721o9651
15272B152897J28829J69573o5937j0959K7567j90288K2151K16718K1642l5018
$$ plain form
15262 2437175 2172001 1962550 2001988 2012063 2127016 2174412 2114581 2089862 2071736 2188511
15252 2188511 2283558 2440852 2428138 2371754 2286065 2225667 2224487 2340429 2367071 2395015 2399927
15241 2399927 2528698 2653363 2618614 2497424 2393659 2472108 2590476 2591241 2472612 2452234
15231 2452234 2395812 2295837 2320533 2382715 2404027 2380493 2264458 2170546 2126978 2322812 2427181
15220 2427181 2324412 2344131 2510236 2468314 2339524 2450545 2551275 2591136 2626662 2545573
15210 2545573 2606048 2511807 2315636 2228463 2314746 2238681 2160606 2165437 2240746 2330253 2331097 2440008
15198 2440008 2481408 2372938 2394779 2454435 2585426 2575502 2406332 2568593 2521045 2435172 2592665
15187 2592665 2565800 2605068 2536352 2500425 2449447 2345134 2451910 2622036 2476494 2420715
$$ packed form
15262B437175k65174k09451L9438J0075J14953M7396n9831k4719j8126J16775
15252B188511R5047J57294j2714n6384q5689o0398j180J15942K6642K7944M912
15241B399927J28771J24665l4749j21190j03765P8449J18368P65j18629k0378
15231B452234n6422r9975K4696O2182K1312k3534j16035r3912m3568J95834J04369
15220B427181j02769J9719J66105m1922j28790J11021J00730L9861L5526q1089
15210B545573O0475r4241j96171q7173Q6283p6065p8075M831P5309Q9507Q44J08911
15198B440008M1400j08470K1841N9656J30991r924j69170J62261m7548q5873J57493
15187B592665k6865L9268o8716l5927n0978j04313J06776J70126j45542n5779
$$ plain form
15177 2420715 2419713 2577518 2600367 2613035 2622390 2531011 2373472 2282408 2409869 2458839 2399869
15166 2399869 2368774 2251524 2241221 2274406 2353297 2401615 2398948 2218133 2262091 2421094 2608762
15155 2608762 2588977 2550464 2610209 2477665 2539209 2759876 2722763 2621122 2530569 2304824
15145 2304824 2389395 2491912 2515037 2744912 2902821 2843262 2764353 2752199 2739169 2792360 2585769
15134 2585769 2505693 2583707 2451496 2393257 2528403 2564361 2608647 2574628 2586776 2620635 2517327
15123 2517327 2373354 2340201 2492244 2500963 2521240 2363229 2325316 2460505 2587713 2524214
15113 2524214 2518828 2672676 2787451 2892527 2925178 2930727 2962844 2884858 2925096 2908330 2832684
15102 2832684 2666190 2680183 2751036 2807268 2893365 2859214 2861468 2902518 2992728 2959263 2815000
$$ packed form
15177B420715j002J57805K2849J2668R355r1379j57539r1064J27461M8970n8970
15166B399869l1095j17250j0303L3185P8891M8318k667j80815M3958J59003J87668
15155B608762j9785l8513N9745j32544O1544K20667l7113j01641r0553k25745
15145B304824Q4571J02517K3125K29875J57909n9559p8909j2154j3030N3191k06591
15134B585769q0076P8014j32211n8239J35146L5958M4286l4019J2148L3859j03308
15123B517327j43973l3153J52043Q719K0277j58011l7913J35189J27208o3499
15113B524214n386J53848J14775J05076L2651N549L2117p7986M0238j6766p5646
15102B832684j66494J3993P0853N6232Q6097l4151K254M1050R0210l3465j44263
$$ plain form
15091 2815000 2755189 2919116 2972951 2824932 2742467 2716091 2710205 2690901 2779293 2817572 2811289
15080 2811289 2798707 2856739 2930134 2713860 2731571 2642918 2696004 2887998 2851202 2881414 2954769
15069 2954769 3084200 3133604 3076577 3070414 3172450 3126970 2881641 2965312 3078316 3169896 3099935
15058 3099935 2928443 2927465 3067861 3032225 2990519 3008083 2989337 2864360 2875449 2764177 2791616
15047 2791616 2831555 2888207 2995425 3188236 3180558 3102328 3048269 3017223 2978138 3027189 2980848
15036 2980848 2915240 2996791 3067466 3041459 2957289 2948450 3146260 3151052 3150028 2974886 2762059
15025 2762059 2791843 3039029 3327667 3238814 2987675 2980246 3313338 3202722 3081451 3146183
15015 3146183 3025375 2925489 3078108 3155685 3055397 3114461 3099839 3186768 3303514 3312544 3300586
$$ packed form
15091B815000n9811J63927N3835j48019q2465k6376n886j9304Q8392L8279o283
15080B811289j2582N8032P3395k16274J7711q8653N3086J91994l6796L0212P3355
15069B954769J29431M9404n7027o163J02036m5480k45329Q3671J13004R1580o9961
15058C099935j71492r78J40396l5636m1706J7564j8746j24977J1089j11272K7439
15047B791616L9939N6652J07218J92811p678p8230n4059l1046l9085M9051m6341
15036B980848o5608Q1551P0675k6007q4170q839J97810M792j024j75142k12827
15025B762059K9784K47186K88638q8853k51139p429L33092j10616j21271O4732
15015C146183j20808r9886J52619P7577j00288N9064j4622Q6929J16746R030j1958
$$ plain form
15004 3300586 3563057 3581401 3235243 3087588 3255457 3397007 3181909 3263422 3211337 3286058
14994 3286058 3315785 3244465 3129005 3068832 3120900 3333595 3480257 3676300 3669876 3516600
14984 3516600 3323839 3203758 3055893 2979220 3154321 3339819 3361979 3373417 3429970 3178170
14974 3178170 3143187 3358063 3510691 3512373 3530510 3637248 3568659 3486821 3367733 3159159
14964 3159159 3196525 3152956 3059877 2879687 2882534 3061586 3142423 3141493 3414362 3413540 3303950
14953 3303950 3263381 3340719 3463844 3466000 3378134 3476968 3424665 3448468 3412241 3530263 3608745
14942 3608745 3504191 3430437 3452664 3592646 3624727 3478389 3408398 3450279 3564212 3644800
14932 3644800 3637994 3463132 3533229 3617300 3785513 3689844 3637874 3634481 3692027 3571616 3609519
$$ packed form
15004C300586K62471J8344l46158j47655J67869J41550k15098Q1513n2085P4721
14994C286058K9727p1320j15460o0173N2068K12695J46662J96043o424j53276
14984C516600j92761j20081j47865p6673J75101J85498K2160J1438N6553k51800
14974C178170l4983K14876J52628J682J8137J06738o8589q1838j19088k08574
14964C159159L7366m3569r3079j80190K847J79052Q0837r30K72869q22j09590
14953C303950m0569P7338J23125K156q7866R8834n2303K3803l6227J18022P8482
14942C608745j04554p3754K2227J39982L2081j46338o9991M1881J13933Q0588
14932C644800o806j74862P0097Q4071J68213r5669n1970l393N7546j20411L7903
$$ plain form
14921 3609519 3715762 3595917 3514770 3451268 3462616 3249009 3255333 3442547 3561966 3456836
14911 3456836 3326635 3331977 3543679 3711992 3474180 3426442 3492471 3454210 3499899 3506733 3614559
14900 3614559 3642418 3375193 3371471 3363798 3444993 3559586 3418221 3534594 3714873 3641429 3560864
14889 3560864 3611937 3746887 3600728 3510149 3647143 3784054 3833853 3578745 3429454 3442423
14879 3442423 3594602 3719400 3834002 3802346 3744632 3770074 3697691 3723868 3792125 3730997 3764421
14868 3764421 3903760 3798170 3531703 3534121 3519667 3587101 3755442 3677161 3763382 3887889
14858 3887889 3963682 3723643 3864813 3957948 3583359 3418617 3478589 3727066 3741682 3698566
14848 3698566 3769266 3780352 3746503 3740639 3684199 3866970 3801359 3697150 3792690 3935545 3975604
$$ packed form
14921C609519J06243j19845q1147o3502J1348k13607O324J87214J19419j05130
14911C456836j30201N342K11702J68313k37812m7738O6029l8261M5689O834J07826
14900C614559K7859k67225l722p673Q1195J14593j41365J16373J80279p3444q0565
14889C560864N1073J34950j46159r0579J36994J36911M9799k55108j49291J2969
14879C442423J52179J24798J14602l1656n7714K5442p2383K6177O8257o1128L3424
14868C764421J39339j05590k66467K418j4454O7434J68341p8281Q6221J24507
14858C887889P5793k40039J41170R3135l74589j64742N9972K48477J4616m3116
14848C698566P0700J1086l3849n864n6440J82771o5611j04209R5540J42855M0059
$$ plain form
14837 3975604 3973308 3859329 3764784 3789242 3780833 3720688 3619772 3618990 3721582 3864090 3810922
14826 3810922 3663711 3733929 3899797 4048085 3891272 3611319 3612610 3636397 3642739 3640334 3643285
14815 3643285 3916536 4130738 4096025 4095913 4246037 4206275 4194523 4161848 4104011 4118162 4148923
14804 4148923 4232873 4363201 4412524 4325525 4316859 4248292 4098304 3965136 3950657 4138746 4346262
14793 4346262 4512818 4399701 4281481 4252191 4162958 4260022 4232076 4204511 4332100 4488950
14783 4488950 4338589 4358950 4205471 4194599 4213190 4275853 4065881 4106835 4232487 4292550
14773 4292550 4259161 4226548 4210954 4292719 4238462 4125484 4332876 4477156 4405946 4313093 4250304
14762 4250304 4234405 4303201 4341833 4298250 4238732 4344924 4364333 4361759 4675749 4721987 4507305
$$ packed form
14837C975604k296j13979r4545K4458q409o0145j00916p82J02592J42508n3168
14826C810922j47211P0218J65868J48288j56813k79953J291K3787O342k405K951
14815C643285K73251K14202l4713j12J50124l9762j1752l2675n7837J4151L0761
14804D148923Q3950J30328M9323q6999q666o8567j49988j33168j4479J88089K07516
14793D346262J66556j13117j18220k9290q9233R7064k7946k7565J27589J56850
14783D488950j50361K0361j53479j0872J8591O2663k09972M0954J25652O0063
14773D292550l3389l2613j5594Q1765n4257j12978K07392J44280p1210r2853o2789
14762D250304j5899O8796L8632m3583n9518J06192J9409k574L13990M6238k14682
$$ plain form
14751 4507305 4314420 4196389 4051501 4069034 4341108 4605644 4729910 4686875 4489650 4494624
14741 4494624 4568897 4457696 4339745 4268687 4111096 4262366 4436004 4543529 4508563 4426490
14731 4426490 4335566 4277838 4290143 4277016 4324973 4217810 4283419 4390009 4525118 4615108 4524017
14720 4524017 4431962 4481001 4480562 4540481 4509874 4505913 4619616 4610724 4459348 4479726 4590909
14709 4590909 4770901 4832536 4800800 4885531 4796663 4651042 4453830 4310490 4267005 4285910
14699 4285910 4360955 4506828 4636920 4644626 4448638 4490134 4575426 4733629 4728751 4646835 4553470
14688 4553470 4418388 4491115 4712540 4697287 4463196 4640683 4742835 4783073 4723960 4704735
14678 4704735 4745683 4803635 4721535 4781802 4801769 4862677 4725841 4681685 4647605 4709392 4852156
$$ packed form
14751D507305j92885j18031j44888J7533K72074K64536J24266m3035j97225M974
14741D494624P4273j11201j17951p1058j57591J51270J73638J07525l4966q2073
14731D426490r0924n7728J2305j3127M7957j07163O5609J06590J35109Q9990r1091
14720D524017r2055M9039m39N9919l0607l961J13703q892j51376K0378J11183
14709D590909J79992O1635l1736Q4731q8868j45621j97212j43340m3485J8905
14699D285910P5045J45873J30092P706j95988M1496Q5292J58203m878q1916r3365
14688D553470j35082P2727K21425j5253k34091J77487J02152M0238n9113j9225
14678D704735M0948N7952q2100O0267J9967O0908j36836m4156l4080O1787J42764
$$ plain form
14667 4852156 5029595 5208867 4993087 4882689 4867964 4967460 4941183 4793788 4650291 4770928
14657 4770928 4786154 4795932 4854848 4732768 4652302 4713882 4910232 5043911 5121013 5017652 5003248
14646 5003248 5105825 5215330 5229916 5107875 4934869 4909598 5111589 5192998 5349857 5317160
14636 5317160 5375965 5343891 5333580 5249223 5225701 5203923 4957543 4865917 5008665 5270182 5312734
14625 5312734 5093246 5068229 5206302 5183072 5120746 5126306 5146593 5125295 5125806 5208597 5314274
14614 5314274 5189516 5235432 5249028 5235106 5266020 5209171 5202773 5138396 5093585 5174582 5085409
14603 5085409 5167764 5306183 5316872 5253892 5166775 5155239 4991820 5091887 5207314 5199198 5309989
14592 5309989 5336108 5324979 5406711 5366157 5342923 5377781 5481554 5520597 5626662 5468921 5663671
$$ packed form
14667D852156J77439J79272k15780j10398j4725R9496k6277j47395j43497J20637
14657D770928J5226R778N8916j22080q0466O1580J96350J33679P7102j03361j4404
14646E003248J02577J09505J4586j22041j73006k5271K01991Q1409J56859l2697
14636E317160N8805l2074j0311q4357k3522k1778k46380r1626J42748K61517M2552
14625E312734k19488k5017J38073k3230o2326N560K0287k1298N11Q2791J05677
14614E314274j24758M5916J3596j3922L0914n6849o398o4377m4811Q0997q9173
14603E085409Q2355J38419J0689o2980q7117j1536j63419J00067J15427q116J10791
14592E309989K6119j1129Q1732m0554k3234L4858J03773L9043J06065j57741J94750
$$ plain form
14581 5663671 5880217 5605690 5564312 5558834 5511556 5451506 5527901 5477892 5640305 5797571 5768122
14570 5768122 5586358 5230716 5227923 5546359 5664852 5639246 5717188 5733152 5596337 5516064
14560 5516064 5666476 5724245 5721670 5565506 5470549 5496723 5528168 5503121 5509816 5497975 5570865
14549 5570865 5436900 5503138 5627761 5733906 5759128 5804308 5806795 5603926 5781088 6006048
14539 6006048 6020299 5904443 5845825 5802457 5845132 5843558 5665261 5612491 5636094 5682768 5792957
14528 5792957 5695229 5781550 5753197 5822880 5811196 5824331 5992634 5987339 5910450 5957567 5942848
14517 5942848 6049766 6153167 6137511 6191099 6230117 5938715 5970329 5931530 6083196 6343413
14507 6343413 6275406 5890672 6008649 5899689 5995374 6100477 5943077 5824335 5779398 5655941
$$ packed form
14581E663671K16546k74527m1378n478m7278o0050P6395n0009J62413J57266k9449
14570E768122j81764l55642k793L18436J18493k5606P7942J5964j36815q0273
14560E516064J50412N7769k575j56164r4957K6174L1445k5047O695j1841P2890
14549E570865j33965O6238J24623J06145K5222M5180K487k02869J77162K24960
14539F006048J4251j15856n8618m3368M2675j574j78297n2770K3603M6674J10189
14528E792957r7728Q6321k8353O9683j1684J3135J68303n295p6889M7117j4719
14517E942848J06918J03401j5656N3588L9018k91402L1614l8799J51666K60217
14507F343413o8007l84734J17977j08960R5685J05103j57400j18742m4937j23457
$$ plain form
14497 5655941 5611669 5735139 6050659 6119427 5944841 5926112 6104353 6024952 5953010 5822301
14487 5822301 5912790 6013259 6008774 5921436 6113848 6114848 6004212 6053798 6159384 5994909 5945219
14476 5945219 6085029 6144997 6172466 6166057 6187639 6296449 6401448 6464633 6320607 6522238
14466 6522238 6476208 6361047 6409659 6465695 6554547 6543900 6359836 6210592 6447307 6570201
14456 6570201 6909553 6942564 6909864 6753095 6714497 6713854 6664749 6641030 6501335 6329933 6452408
14445 6452408 6786832 6861468 6859314 6717737 6578724 6448563 6631712 6701842 6641434 6569263
14435 6569263 6527821 6585874 6564230 6601467 6627733 6472873 6407829 6526183 6765104 6891947
14425 6891947 6751854 6751149 6719299 6775201 6907090 6961818 7054019 7075758 7069969 6977817 6873333
$$ packed form
14497E655941m4272J23470L15520O8768j74586j8729J78241p9401p1942j30709
14487E822301R0489J00469m485q7338J92412J000j10636M9586J05586j64475m9690
14476E945219J39810N9968K7469o409K1582J08810J04999O3185j44026K01631
14466F522238m6030j15161M8612N6036Q8852j0647j84064j49244K36715J22894
14456F570201L39352L3011l2700j56769l8598o43m9105k3719j39695j71402J22475
14445F452408L34424P4636k154j41577j39013j30161J83149P0130o0408p2171
14435F569263m1442N8053k1644L7237K6266j54860o5044J18354K38921J26843
14425F891947j40093p05l1850N5902J31889N4728R2201K1739n789r2152j04484
$$ plain form
14414 6873333 6864244 6963234 6728690 6675192 6769517 6841075 6872443 6992481 7196482 7235921 7240763
14403 7240763 7198681 7163033 7167918 7025562 6969113 6913984 7067304 7018534 7104578 7103304 6981916
14392 6981916 6981883 6991852 7006467 7029286 6941265 6880680 7022781 7075368 7051867 7123082 7198135 7354106
14380 7354106 7414827 7231980 7066148 7237462 7372083 7357876 7158084 7121464 7273486 7261797
14370 7261797 7501341 7497679 7357542 7436595 7532399 7525269 7596735 7500849 7599090 7603766 7418297
14359 7418297 7423829 7475115 7498243 7648821 7816086 7806058 7697666 7699631 7560500 7595372 7614097
14348 7614097 7447785 7487263 7488694 7390725 7532525 7583535 7560131 7488303 7498794 7441000 7465435
14337 7465435 7506851 7551845 7614980 7649077 7794691 7914990 7906841 7858057 7770451 7840559 7853658
$$ packed form
14414F873333r089R8990k34544n3498R4325P1558L1368J20038K04001L9439M842
14403G240763m2082l5648M885j42356n6449n5129J53320m8770Q6044j274j21388
14392F981916l3R969J4615K2819q8021o0585J42101N2587k3501P1215P5053J55971
14380G354106O0721j82847j65832J71314J34621j4207j99792l6620J52022j1689
14370G261797K39544l662j40137P9053R5804p130P1466r5886R8241M676j85469
14359G418297N532N1286K3128J50578J67265j0028j08392J965j39131L4872J8725
14348G614097j66312L9478J431r7969J41800N1010k3404p1828J0491n7794K4435
14337G465435M1416M4994O3135L4097J45614J20299q149m8784q7606P0108J3099
$$ plain form
14326 7853658 7790067 7730002 7609583 7586831 7520851 7585272 7984543 8058046 7995082 8041742 7925168
14315 7925168 7715372 7700274 7816237 7877091 8016614 8064890 8001481 7954068 7984409 8138819
14305 8138819 8062901 8040737 8086047 8167482 8184002 8223320 8130164 7929778 7909841 8044499 8065263
14294 8065263 8134332 8241717 8126970 8070123 8236604 8266520 8172491 8335851 8414462 8498692
14284 8498692 8608858 8351343 8081155 7965901 8057729 8391873 8620344 8660754 8651187 8765219
14274 8765219 8874239 8690654 8473896 8497123 8420868 8444046 8439606 8356040 8412957 8407129 8537475
14263 8537475 8774341 8964735 8853099 8619398 8704963 8939375 8948151 8814067 8734288 8776257
14253 8776257 8849306 8874085 8950246 8812315 8645014 8614127 8497109 8618780 8868934 9101078
$$ packed form
14326G853658o3591o0065j20419k2752o5980O4421L99271P3503o2964M6660j16574
14315G925168k09796j5098J15963O0854J39523M8276o3409m7413L0341J54410
14305H138819p5918k2164M5310Q1435J6520L9318r3156k00386j9937J34658K0764
14294H065263O9069J07385j14747n6847J66481K9916r4029J63360P8611Q4230
14284H498692J10166k57515k70188j15254R1828L34144K28471M0410r567J14032
14274H765219J09020j83585k16758K3227p6255K3178m440q3566N6917n828J30346
14263H537475K36866J90394j11636k33701Q5565K34412Q776j34084p9779M1969
14253H776257P3049K4779P6161j37931j67301l0887j17018J21671K50154K32144
$$ plain form
14243 9101078 9184909 9146039 9009902 8895586 8838160 8767421 8741107 8810740 9055530 9055895 9075635
14232 9075635 9051766 9220390 9180099 9142350 9097273 9215676 9311964 9186304 9214369 9327373
14222 9327373 9386399 9262344 9102781 9089336 9116565 8946784 9182931 9413417 9249966 9284512
14212 9284512 9239484 9359695 9595726 9704188 9546815 9442197 9590063 9734758 9830098 9759690
14202 9759690 9706191 9665339 9437905 9330618 9526674 9511903 9496567 9600014 9601443 9580914 9459563
14191 9459563 9354543 9296081 9454033 9524761 9688721 9743479 9731031 9657024 9463949 9411663
14181 9411663 9587552 9830121 9781192 9706370 9630096 9614889 9853619 9916478 9860751 9789651 9723000
14170 9723000 9766529 9948002 10140065 10108477 10105605 10154678 10093835 10044626 10132336 10118713 10094749
$$ packed form
14243I101078Q3831l8870j36137j14316n7426p0739k6314O9633K44790L65J9740
14232I075635k3869J68624m0291l7749m5077J18403R6288j25660K8065J13004
14222I327373N9026j24055j59563j3445K7229j69781K36147K30486j63451L4546
14212I284512m5028J20211K36031J08462j57373j04618J47866J44695R5340p0408
14202I759690n3499m0852k27434j07287J96056j4771j5336J03447J429k0529j21351
14191I459563j05020n8462J57952P0728J63960N4758j2448p4007j93075n2286
14181I411663J75889K42569m8929p4822p6274j5207K38730O2859n5727p1100o6651
14170I723000M3529J81473J92063l1588k872M9073o0843m9209Q7710j3623k3964
$$ plain form
14159 10094749 10056923 10019063 10113527 10108336 10200580 10240190 10240811 10272238 10191768 10076499 10121332
14148 10121332 10452193 10674441 10475242 10318131 10196784 10278508 10348407 10361971 10284824 10186169
14138 10186169 10166103 10311425 10253562 10142864 10433958 10620060 10704323 10716449 10634538 10483766
14128 10483766 10461270 10530716 10503730 10519101 10590517 10815805 10821375 10766329 10740941 10674067 10697320
14117 10697320 10767939 10638902 10755754 10673915 10793405 10916726 10884721 11020307 11006340 10960601
14107 10960601 10558083 10490934 10699428 10787906 10779573 10829977 10970454 11241807 11448891 11422492
14097 11422492 11410662 11591712 11578666 11420899 11306661 11194341 11179862 11165384 11315195 11432811
14087 11432811 11447447 11379166 11313714 11249301 11320682 11441330 11512257 11355741 11274778 11358785 11524154
$$ packed form
14159A0094749l7826l7860R4464n191R2244L9610O21L1427q0470j15269M4833
14148A0121332L30861K22248j99199j57111j21347Q1724O9899J3564p7147r8655
14138A0186169k0066J45322n7863j10698K91094J86102Q4263J2126q1911j50772
14128A0483766k2496O9446k6986J5371P1416K25288N570n5046k5388o6874K3253
14117A0697320P0619j29037J16852q1839J19490J23321l2005J35586j3967m5739
14107A0960601m02518o7149K08494Q8478q333N0404J40477K71353K07084k6399
14097A1422492j1830J81050j3046j57767j14238j12320j4479j4478J49811J17616
14087A1432811J4636o8281o5452o4413P1381J20648P0927j56516q0963Q4007J65369
$$ plain form
14076 11524154 11537400 11240438 11149699 11004781 10983700 11032795 11214446 11526932 11713276 11841652
14066 11841652 11901212 11811658 11799221 11877211 11759062 11594020 11628979 11818357 11851887 11889730
$$ packed form
14076A1524154J3246k96962r0739j44918k1081M9095J81651L12486J86344J28376
14066A1841652N9560q9554j2437P7990j18149j65042L4959J89378L3530L7843
$$ [...]
##END NTUPLES=NMR SPECTRUM
##END=
