##TITLE=Analysis number 326677
Compound Code cc 48313
Book Reference 470/162
Project Code adrs
Chemist Name mikem
##JCAMPDX= 6.0         $$ Bruker NMR JCAMP-DX V2.0
##DATA TYPE= NMR SPECTRUM
##DATA CLASS= NTUPLES
##ORIGIN= Bruker BioSpin GmbH
##OWNER= nmr
$$ XWIN-NMR		Version 3.5
$$ Fri Feb 16 11:58:46 2007 GMT Standard Time (UT+0h)  MAYBRIDGE\nmr@NMR_250MHZ
##.OBSERVE FREQUENCY= 250.131544655141
##.OBSERVE NUCLEUS= ^1H
##.ACQUISITION MODE= SIMULTANEOUS (DQD)
##.ACQUISITION SCHEME= undefined
##.AVERAGES= 16
##.DIGITISER RES= 18
##SPECTROMETER/DATA SYSTEM= dpx250
##.PULSE SEQUENCE= zg30
##.SOLVENT NAME= CDCl3
##.SHIFT REFERENCE= (INTERNAL, CDCl3, 0, 16.4935)
##AUDIT TRAIL= $$ (NUMBER, WHEN, WHO, WHERE, WHAT)
$$ ##TITLE= Audit trail, XWIN-NMR		Version 3.5
$$ ##JCAMPDX= 5.01
$$ ##ORIGIN= Bruker BioSpin GmbH
$$ ##OWNER= nmr
$$ C:\u/data/dgb/nmr/ADRS/1100/pdata/1/auditp.txt
$$ ##AUDIT TRAIL=  $$ (NUMBER, WHEN, WHO, WHERE, WHAT)
(   1,<2007-02-16 11:58:17.69 +000>,<MAYBRIDGE\nmr>,<NMR_250MHZ>,
      <created by zg, POWCHK disabled, PULCHK disabled
       configuration hash MD5:
       49 4B E0 1D 92 C2 6B 37 9F E6 65 BC 52 41 86 1D
       data hash MD5: 64K
       D0 19 84 E5 43 03 29 E0 74 5E 48 06 60 7A 7C E0>)
(   2,<2007-02-16 11:58:35.16 +000>,<MAYBRIDGE\nmr>,<NMR_250MHZ>,
      <Start of raw data processing
       ef LB = 0.3 FT_mod = 6 PKNL = 1 SI = 32K 
       data hash MD5: 32K
       7E A8 CD 1E 0F 48 56 93 AE B4 90 75 DF 32 A6 EC>)
(   3,<2007-02-16 11:58:39.49 +000>,<MAYBRIDGE\nmr>,<NMR_250MHZ>,
      <apk 
       data hash MD5: 32K
       23 AF B8 E3 D1 CD C6 40 00 E9 C0 05 0E 99 58 46>)
(   4,<2007-02-16 11:58:40.71 +000>,<MAYBRIDGE\nmr>,<NMR_250MHZ>,
      <abs ABSG = 5 
       data hash MD5: 32K
       64 A4 50 4F 4F 35 24 D0 5E 13 33 C6 7A FE 7F 62>)
$$ ##END=
$$ 
$$ hash MD5
$$ 34 1E 93 01 2F FA 21 F7 CF B0 6A A8 1D C3 C8 67
##$RELAX= 
##$RELAX= 
##$RELAX= 
##$RELAX= 
##$RELAX= 
##$RELAX= 
##$RELAX= 
$$ Bruker specific parameters
$$ --------------------------
##$DU= <C:\u>
##$EXPNO= 1100
##$NAME= <ADRS>
##$PROCNO= 1
##$TYPE= <nmr>
##$USER= <dgb>
##$AMP= (0..31)
100 100 100 100 100 100 100 100 100 100 100 100 100 100 100 100 100 100 
100 100 100 100 100 100 100 100 100 100 100 100 100 100 
##$AQSEQ= 0
##$AQ_mod= 3
##$AUNM= <au_zg>
##$AUTOPOS= <53 >
##$BF1= 250.13
##$BF2= 250.13
##$BF3= 250.13
##$BF4= 250.13
##$BF5= 500.13
##$BF6= 500.13
##$BF7= 500.13
##$BF8= 500.13
##$BYTORDA= 1
##$CFDGTYP= 0
##$CFRGTYP= 5
##$CHEMSTR= <none>
##$CNST= (0..31)
1 1 145 1 1 1 1 1 1 1 1 1 1 1 1 1 1 1 1 1 1 1 1 1 1 1 1 1 1 1 1 1 
##$CPDPRG= <>
##$CPDPRG1= <>
##$CPDPRG2= <>
##$CPDPRG3= <>
##$CPDPRG4= <mlev>
##$CPDPRG5= <mlev>
##$CPDPRG6= <mlev>
##$CPDPRG7= <mlev>
##$CPDPRG8= <mlev>
##$CPDPRGB= <>
##$CPDPRGT= <>
##$D= (0..31)
0 1 0 0 0 0 0 0 0 0.06 0 0 0 0 0 0 0.0002 0 0 0 0 0 0 0 0 0 0 0 0 0 0 
0 
##$DATE= 1171627096
##$DBL= (0..7)
120 120 120 120 120 120 120 120 
##$DBP= (0..7)
150 150 150 150 150 150 150 150 
##$DBP07= 0
##$DBPNAM0= <>
##$DBPNAM1= <>
$$ [...]
##$SUBNAM7= <"">
##$SUBNAM8= <"">
##$SUBNAM9= <"">
##$SW= 20.6930455092707
##$SWIBOX= (0..15)
0 0 3 0 0 0 0 0 0 0 0 0 0 0 0 0 
##$SW_h= 5175.983436853
##$TD= 65536
##$TD0= 1
##$TE= 295.16
##$TE2= 300
##$TE3= 300
##$TEG= 300
##$TL= (0..7)
0 120 120 120 120 120 120 120 
##$TP= (0..7)
150 150 150 150 150 150 150 150 
##$TP07= 0
##$TPNAME0= <>
##$TPNAME1= <>
##$TPNAME2= <>
##$TPNAME3= <>
##$TPNAME4= <>
##$TPNAME5= <>
##$TPNAME6= <>
##$TPNAME7= <>
##$TPOAL= (0..7)
0.5 0.5 0.5 0.5 0.5 0.5 0.5 0.5 
##$TPOFFS= (0..7)
0 0 0 0 0 0 0 0 
##$TUNHIN= 0
##$TUNHOUT= 0
##$TUNXOUT= 0
##$USERA1= <user>
##$USERA2= <user>
##$USERA3= <user>
##$USERA4= <user>
##$USERA5= <user>
##$V9= 5
##$VALIST= <valist>
##$VCLIST= <CCCCCCCCCCCCCCC>
##$VD= 0
##$VDLIST= <DDDDDDDDDDDDDDD>
##$VPLIST= <PPPPPPPPPPPPPPP>
##$VTLIST= <TTTTTTTTTTTTTTT>
##$WBST= 1024
##$WBSW= 4
##$XGAIN= (0..3)
0 0 0 0 
##$XL= 0
##$YL= 0
##$YMAX_a= 686747
##$YMIN_a= -590386
##$ZGOPTNS= <>
##$ZL1= 120
##$ZL2= 120
##$ZL3= 120
##$ZL4= 120
##$ABSF1= 16.49345
##$ABSF2= -4.199722
##$ABSG= 5
##$ABSL= 3
##$ALPHA= 0
##$AQORDER= 0
##$ASSFAC= 0
##$ASSFACI= 0
##$ASSFACX= 0
##$ASSWID= 0
##$AUNMP= <proc_1d>
##$AZFE= 0.1
##$AZFW= 0.1
##$BCFW= 0
##$BC_mod= 0
##$BYTORDP= 0
##$COROFFS= 0
##$CY= 12.5
##$DATMOD= 1
##$DC= 0
##$DFILT= <>
##$DTYPP= 0
##$F1P= 14.0000005364418
##$F2P= -0.99999901652339
##$FCOR= 0.5
##$FTSIZE= 32768
##$FT_mod= 6
##$GAMMA= 0
##$GB= 0
##$INTBC= 1
##$INTSCL= 1
##$ISEN= 128
##$LB= 0.3
##$LEV0= 0
##$LPBIN= 0
##$MAXI= 10000
##$MC2= 0
##$MEAN= 0
##$ME_mod= 0
##$MI= 0
##$NCOEF= 0
##$NC_proc= -2
##$NLEV= 6
##$NOISF1= 0
##$NOISF2= 0
##$NSP= 0
##$NTH_PI= 0
##$NZP= 0
##$OFFSET= 16.49345
##$PC= 1
##$PHC0= 72.29428
##$PHC1= 7.683538
##$PH_mod= 1
##$PKNL= yes
##$PPARMOD= 0
##$PSCAL= 4
##$PSIGN= 0
##$REVERSE= no
##$SF= 250.130007140566
##$SI= 32768
##$SIGF1= 0
##$SIGF2= 0
##$SINO= 400
##$SIOLD= 32768
##$SREGLST= <1H.CDCl3>
##$SSB= 0
##$STSI= 32768
##$STSR= 0
##$SW_p= 5175.98343685301
##$SYMM= 0
##$S_DEV= 0
##$TDeff= 65536
##$TDoff= 0
##$TI= <Analysis number 999999
Compound Code 99
Book Reference 9
Project Code 9>
##$TILT= no
##$TM1= 0
##$TM2= 0
##$TOPLEV= 0
##$USERP1= <user>
##$USERP2= <user>
##$USERP3= <user>
##$USERP4= <user>
##$USERP5= <user>
##$WDW= 1
##$XDIM= 32768
##$YMAX_p= 427979092
##$YMIN_p= -16968
$$ End of Bruker specific parameters
$$ ---------------------------------
##NTUPLES= NMR SPECTRUM
##VAR_NAME=  FREQUENCY,     SPECTRUM/REAL,   SPECTRUM/IMAG
##SYMBOL=    X,             R,               I
##VAR_TYPE=  INDEPENDENT,   DEPENDENT,       DEPENDENT
##VAR_FORM=  AFFN,          ASDF,            ASDF
##VAR_DIM=   32768,         32768,           32768
##UNITS=     HZ,            ARBITRARY UNITS, ARBITRARY UNITS
##FACTOR=    0.157963299565203, 1,           1
##FIRST=     4125.50680749272, 0,            0
##LAST=      -1050.47662936029, 0,           0
##MIN=       -1050.47662936029, -16968,      0
##MAX=       4125.50680749272, 427979092,    0
$$ Real data points
##PAGE= N=1
##DATA TABLE= (X++(R..R)), XYDATA
$$ [...]
##PAGE= N=2
##DATA TABLE= (X++(I..I)), XYDATA
17994e234916j0894759j0744185q730439m908874j671095J257925K982008L486599
17986c4457736L307562K830995K334755J931531J634098J399147J219822J078096
17978a8721730R72676Q95721Q30091P71914P13245O48373N76423N02617M28829
17969a2381841L71814L24049K89421K84324K79716K85851K95201K97787K96089
17960i657589K91646K79173K62684K44508K33785K17759K07141J97583J87930
17951g535380J80639J73565J68231J61143J51541J41128J35425J28365J19722
17942f175621J17643J18979J16681J11957J11246J07141J03218R9743R2343Q8093
17932e108577Q4488Q3915Q0546P9726P4285P0237P0735P3721P0348O8703O8425
$$ plain form
17994 -5234916 -16129675 -26873860 -35604299 -40513173 -42184268 -40926343 -37944335 -34457736
17986 -34457736 -31150174 -28319179 -25984424 -24052893 -22418795 -21019648 -19799826 -18721730
17978 -18721730 -17749054 -16853333 -16023242 -15251328 -14538083 -13889710 -13313287 -12810670 -12381841
17969 -12381841 -12010027 -11685978 -11396557 -11112233 -10832517 -10546666 -10251465 -9953678 -9657589
17960 -9657589 -9365943 -9086770 -8824086 -8579578 -8345793 -8128034 -7920893 -7723310 -7535380
17951 -7535380 -7354741 -7181176 -7012945 -6851802 -6700261 -6559133 -6423708 -6295343 -6175621
17942 -6175621 -6057978 -5938999 -5822318 -5710361 -5599115 -5491974 -5388756 -5289013 -5196670 -5108577
17932 -5108577 -5024089 -4940174 -4859628 -4779902 -4705617 -4635380 -4564645 -4490924 -4420576 -4351873 -4283448
17921d283448O7079O9926O2478O0408N8565N5604N3056N5995N4207M9761N0823
17910c645546M5604M5359M9914M7357M7374M2525M0930M4941M5340L7724L8535
17899c159943L8341M0140L6871L2758L6522L8311L3184L0976L2429L5144L4014
17888b771253L0909L1072L0915L0567L0131L4022K7554K0917K0732K0341K0912
17877b473181K2736L0515K9974K2097K3065K3893K5151K4862K3214K1533K0871
17866b205270J9722J9441K1901J5693J9050K3637K0029K3341K2575K3954J8202
17855a977725J8321J4202J2912J5373J5208K0292K3371K2383J7970J7770J7915
17844a782008J6265J5533J6082J1259J1329R340J4197J3188J5801J5661J1956
$$ plain form
17921 -4283448 -4216369 -4146443 -4083965 -4023557 -3964992 -3909388 -3856332 -3800337 -3746130 -3696369 -3645546
17910 -3645546 -3599942 -3554583 -3504669 -3457312 -3409938 -3367413 -3326483 -3281542 -3236202 -3198478 -3159943
17899 -3159943 -3121602 -3081462 -3044591 -3011833 -2975311 -2937000 -2903816 -2872840 -2840411 -2805267 -2771253
17888 -2771253 -2740344 -2709272 -2678357 -2647790 -2617659 -2583637 -2556083 -2535166 -2514434 -2494093 -2473181
17877 -2473181 -2450445 -2419930 -2389956 -2367859 -2344794 -2320901 -2295750 -2270888 -2247674 -2226141 -2205270
17866 -2205270 -2185548 -2166107 -2144206 -2128513 -2109463 -2085826 -2065797 -2042456 -2019881 -1995927 -1977725
17855 -1977725 -1959404 -1945202 -1932290 -1916917 -1901709 -1881417 -1858046 -1835663 -1817693 -1799923 -1782008
17844 -1782008 -1765743 -1750210 -1734128 -1722869 -1711540 -1702200 -1688003 -1674815 -1659014 -1643353 -1631397
17833a631397J6123J9752J6276J3217J2032J0789J1989J3492J3946Q854R427J3139
17821a472361J8339J6455J4114J5501J5650J3352J2373J4367J0373J0101R681
17810a322055Q578J1953J2933R319J3485J4318J3052Q788R857J1905J3078J0860
17798a183929Q948J2040R835R804R447O853R451R375O013R890J0109J0247Q816
17785a063101N599P715J1351O715P421Q919J0262N928Q358Q906P696Q531J0373
17772i55327Q002P322Q551Q121R703R429Q166M651M495J0769R268P926P554R242
17758h42128N954M812O725O390K670N314P217R537Q060M851O859N870O774M610
17744g56485K745N839P431N616L186J449N280N927P586P340N506N237N199Q733
$$ plain form
17833 -1631397 -1615274 -1595522 -1579246 -1566029 -1553997 -1543208 -1531219 -1517727 -1503781 -1494927 -1485500 -1472361
17821 -1472361 -1454022 -1437567 -1423453 -1407952 -1392302 -1378950 -1366577 -1352210 -1341837 -1331736 -1322055
17810 -1322055 -1313477 -1301524 -1288591 -1279272 -1265787 -1251469 -1238417 -1229629 -1219772 -1207867 -1194789 -1183929
17798 -1183929 -1174981 -1162941 -1153106 -1143302 -1133855 -1127002 -1117551 -1108176 -1102163 -1092273 -1082164 -1071917 -1063101
17785 -1063101 -1057502 -1049787 -1038436 -1031721 -1024300 -1015381 -1005119 -999191 -990833 -981927 -974231 -965700 -955327
17772 -955327 -947325 -940003 -931452 -923331 -913628 -904199 -896033 -891382 -886887 -876118 -866850 -858924 -851370 -842128
17758 -842128 -836174 -831362 -824637 -818247 -815577 -810263 -803046 -793509 -785449 -780598 -773739 -767869 -761095 -756485
17744 -756485 -753740 -747901 -740470 -734854 -731668 -730219 -724939 -719012 -711426 -704086 -698580 -693343 -688144 -679411
17730f79411J0525L192J395L730Q703O949K345N548P313M365M519O041N645M513
17716f04628N833Q287K701M041M202L114N224R053P668M801M848K360J749M157
17702e36590N777O309K758K081K088O696O400P328O814M818P479J586j182M577
17688d73061O150J636L207K122K053L431P466Q612O496L385N331M951M629N954
17674d07638J590O023L145L411m13O208N339M289N797K748J43L044L890P492M351
17659c50581L504J340M213P528M160N422K089Q79L800M319K911N891K763M414
17645b97348L700K787K201P053O645M003L426p48J351L208O240P147K70J077O636
17630b42352N875L247K862P22L519L897P165N422L538L669J916K381J605M974
$$ plain form
17730 -679411 -668886 -665694 -664299 -660569 -651866 -644917 -642572 -637024 -629711 -625346 -620827 -614786 -609141 -604628
17716 -604628 -598795 -590508 -587807 -583766 -579564 -576450 -571226 -562173 -554505 -549704 -544856 -542496 -540747 -536590
17702 -536590 -530813 -524504 -521746 -519665 -517577 -510881 -504481 -497153 -490339 -485521 -478042 -476456 -477638 -473061
17688 -473061 -466911 -465275 -462068 -459946 -457893 -454462 -446996 -438384 -431888 -428503 -423172 -418221 -413592 -407638
17674 -407638 -406048 -400025 -396880 -393469 -393882 -387674 -382335 -378046 -372249 -369501 -369358 -366314 -362424 -354932 -350581
17659 -350581 -347077 -345737 -341524 -333996 -329836 -324414 -322325 -321446 -317646 -313327 -310416 -304525 -301762 -297348
17645 -297348 -293648 -290861 -288660 -281607 -274962 -270959 -267533 -268281 -266930 -263722 -257482 -250335 -250065 -248988 -242352
17630 -242352 -236477 -233230 -230368 -229646 -226127 -222230 -215065 -209643 -206105 -202436 -200520 -198139 -196534 -191560
17616a91560K580J132J274J550N19N623O326L556Q98K669K537L979L225K694L431
17601a49567M178O039M167K819j696o55O210N523J971J327L874L352L859L566
17587a05033M607M833M085L909K808K723J679K824K458M155J267K962M519L960
17573e8244M790L006K608J533L084R95K873M809R864R576K026K762k53L700M821
17558b050L427J232M427M686M926N33L165J0068O547O054M948N452O452R483P255
17543G6605O958J1867J1823J4510J3328J5388K0539K1595K2958J3073O14l335
17531B25923k297k1531o2819p4765m4825k3724n0395p8048n5392j1607K874q54
17519a97460L804J4370J8782K0161J6527J7230J3050J2000J2587Q935J1499J0012
$$ plain form
17616 -191560 -188980 -187848 -186574 -185024 -184505 -178882 -172556 -169000 -168102 -165433 -162896 -158917 -155692 -152998 -149567
17601 -149567 -145389 -139350 -135183 -132364 -134060 -134715 -128505 -122982 -121011 -119684 -115810 -112458 -108599 -105033
17587 -105033 -100426 -95593 -91508 -87599 -84791 -82068 -80389 -77565 -75107 -70952 -69685 -66723 -62204 -58244
17573 -58244 -53454 -50448 -47840 -46307 -43223 -42228 -39355 -34546 -24682 -15106 -13080 -10318 -10571 -6871 -2050
17558 -2050 1377 2609 7036 11722 16648 17181 20346 30414 36961 43015 47963 53415 59867 69350 76605
17543 76605 83563 95430 107253 121763 135091 150479 171018 192613 215571 228644 229258 225923
17531 225923 223626 202095 139276 64511 19686 -4038 -54433 -132481 -187873 -199480 -196606 -197460
17519 -197460 -193656 -179286 -160504 -140343 -123816 -106586 -93536 -81536 -68949 -60014 -48515 -38503
17507c8503O496P701O263Q337O787L100L579L529O922M572K615L803K818K477
17493C0496L235N276N874J658L723J894L905O269P37L092J501M116L972N190O358
17478H7296M830L136J452J07L174M792J727M81L427N391M638K588J314O180M263
17463A34796M107N674J682J014N100J906L422M977K728k93M24N156O269N250P220
17448A89432N884N049N182K891O707Q034J0678R924q042k3685o449Q316R434J2563
17434B35918J5318J0867Q878J4419J5544J2209J6174K0015J9211J3915O801r512
17422C79757k7245m6383n3931n8275n2902k7168k188J4629K7192L2079L2257K1367
17410B39189J0912r5k3374n1385o4394o1226n0750k6338m145M955J5836J8966
$$ plain form
17507 -38503 -32007 -24306 -18043 -9706 -2919 181 3760 7289 14211 18783 21398 25201 28019 30496
17493 30496 33731 39007 44881 46539 50262 52156 56061 62330 63067 66159 67660 71776 75748 80938 87296
17478 87296 92126 95262 96714 96821 99995 104787 106514 106995 110422 115813 120451 123039 124353 130533 134796
17463 134796 138903 144577 146259 147273 152373 154279 157701 162678 165406 165113 165537 170693 176962 182212 189432
17448 189432 195316 200365 205547 208438 215145 223179 233857 243781 235739 212054 205605 213921 223355 235918
17434 235918 251236 262103 270981 285400 300944 313153 329327 349342 368553 382468 389269 379757
17422 379757 352512 306129 252198 193923 141021 113853 111665 126294 153486 185565 217822 239189
17410 239189 250101 250006 226632 175247 110853 49627 -1123 -27461 -31606 -26651 -10815 8151
17398H151J7709J4886J4274J1322J0856R840J0975P430M013O169Q814O331P292
17385A38062O232P646M165K670M792P63J280J782N164M428L754K473K22Q00Q80
17370A85113L219Q231P770K815l7K185K3K335J118J772K139M816M043J530N62
17355B27634K303L474L686L020Q11p38k76J643M178J205P95L894J663p22l5J094
17339B53629N781J278M277O164k844j256K354K364K242K056K700M150J33J569
17325B84597M236M481n54n81R80L706M395K120K331l573P94L263Q36J957j986
17310C07002O221M529O57J357K470M69j110M80K224K428J575p49k625O69N68M253
17294C30418J138K618K177P57O092K762m512O33L758M479J031k56k490p74J392
$$ plain form
17398 8151 25860 40746 55020 66342 77198 87038 98013 105443 109456 115625 124439 130770 138062
17385 138062 144294 151940 156105 158775 163567 164330 165610 167392 172556 176984 180738 183211 183433 184233 185113
17370 185113 188332 196563 204333 207148 207111 209296 209319 211654 212772 214544 216683 221499 225542 227072 227634
17355 227634 229937 233411 237097 240117 240928 240190 239914 241557 245735 246940 247735 251629 253292 252570 252535 253629
17339 253629 259410 260688 264965 271129 268285 267029 269383 271747 273989 276045 278745 282895 283028 284597
17325 284597 288833 293314 292760 292179 293159 296865 301260 303380 305711 302138 302932 306195 307031 308988 307002
17310 307002 313223 317752 318409 319766 322236 322705 321595 322075 324299 326727 328302 327553 324928 325597 326165 330418
17294 330418 331556 334174 336351 337108 343200 345962 341450 342083 345841 350320 351351 351095 348605 347831 349223
17279C49223J65O30K928K869L729J823L019J224L491J580L198L59N4j288p41K917
17263C75180J758J38K944J078J518J853N33L76K883M249K585J468k651O37K335
17248C96884J439J953O85l51J102N490K190j268m611j169r80K87J989M253M434
17233D12327l80O25J935K732K388J158n68K616m25l099k65j233J349K170P36N870
17217D27936O446K847k98j583m62L81M25L183L292J423J090L29j304J870m971
17202D40604m73K203J815M045L101L074K436Q89J163K242J368j264n04R87J07
17187D61793L545K206J860M411L147p13m37j15j22P51j286J224L026L576J622
17172D84488p13J497L844M310l59l83J67j05P73K151L776O83j283M182l08j587
$$ plain form
17279 349223 349388 350018 352946 355815 359544 361367 364386 365610 369101 370681 373879 374238 374292 373004 372263 375180
17263 375180 376938 377076 380020 381098 382616 384469 385002 385378 388261 392510 395095 396563 393912 394549 396884
17248 396884 398323 400276 400961 400610 401712 407202 409392 408124 403513 402344 401364 401651 403640 407893 412327
17233 412327 411947 412572 414507 417239 419627 420785 420217 422833 422408 419309 419044 417811 419160 421330 422066 427936
17217 427936 434382 437229 436931 435348 434886 435267 435692 438875 442167 443590 444680 445009 443705 445575 440604
17202 440604 440131 442334 444149 448194 451295 454369 456805 457694 458857 461099 462467 461203 460699 461686 461793
17187 461793 465338 467544 469404 473815 476962 476249 475812 475697 475575 476326 475040 476264 479290 482866 484488
17172 484488 483775 485272 489116 493426 493067 492684 492851 492746 493519 495670 499446 500129 498846 503028 502720 501133
17156E01133N194P379j220R47j523M996K395k697l436K467N359J763N483L074
17142E31314j014k186r62L669j347J209O14l464J738K718j833Q90J177P53J155
17127E34431K369L124J032j996K54J196J062K578L570J027O55J268o38K054Q50
17112E52836Q80M644n95J67M074Q13K182J576O44P3J862K575K306L178J584m026
17096E74773J084K049l162J03L005j350J565K480K781M631J111O78r12M742L398
17081E96976k450r9L030L674K829L29k027J081O91J566p32J337O036K488j160
17066F13569J330j247K460K271k308j928p23L902J810J819j812Q18M152K668K235
17051F29016J768L33P22J126l040k302J841K077J919K698N759K22j488K196J562
$$ plain form
17156 501133 506327 513706 512486 513433 511910 516906 519301 516604 513168 515635 520994 522757 528240 531314
17142 531314 530300 528114 527152 530821 529474 530683 531297 527833 529571 532289 530456 531346 532523 533276 534431
17127 534431 536800 539924 540956 538960 539214 540410 541472 544050 547620 548647 549302 550570 549932 551986 552836
17112 552836 553716 558360 557765 557932 562006 562819 565001 566577 567221 567294 569156 571731 574037 577215 578799 574773
17096 574773 575857 577906 574744 574847 577852 576502 578067 580547 583328 587959 589070 589748 588836 593578 596976
17081 596976 594526 594427 597457 601131 603960 604289 602262 603343 604034 605600 604868 606205 612241 614729 613569
17066 613569 614899 613652 616112 618383 616075 614147 613424 617326 619136 620955 619143 619961 624113 626781 629016
17051 629016 630784 631117 631839 632965 629925 627623 629464 631541 633460 636158 641917 642139 640651 642847 644409
17036F44409Q85q42L103L036k251k54M74M680J042J665K24K840J372J758j239
17021F60902j82K206J791l24n59r38J272K115j317J259K168J947M213K475K326
17006F79354M824O54L81O27J747J321p84L63P98K612p11q1K041j148K052p96P78
16989F94032R86M307L509M916j179j602L176N501K337P01J014l211k007L330K791
16974G18601K163J082l665K310M866M303K75k605J389K368l74j425Q43J450K010
16959G33591K350k622j057L120P161K419k900L391Q92K19J624J365O50J960J299
16944G53462J369j248j03J028M252L649M232L52J606Q78M40L27J876j99j54O98
16928G72465p52m69N268K660m86O13N555P719J905n14l857J198l44L481Q68k868
$$ plain form
17036 644409 645294 644452 647555 650591 648340 648086 648560 653240 654282 655947 656171 659011 660383 662141 660902
17021 660902 660720 662926 664717 664393 663834 662896 664168 666283 664966 666225 668393 670340 674553 677028 679354
17006 679354 684178 684832 685213 685840 687587 688908 688124 688487 689285 691897 691186 691105 693146 691998 694050 693254 694032
16989 694032 695018 699325 702834 707750 706571 704969 708145 713646 715983 716684 717698 714487 712480 715810 718601
16974 718601 720764 721846 718181 720491 725357 729660 729935 727330 728719 731087 730713 729288 730131 731581 733591
16959 733591 735941 733319 732262 735382 742543 744962 742062 745453 746345 746564 748188 749553 750203 752163 753462
16944 753462 754831 753583 753480 754508 758760 762409 766641 766993 768599 769477 769917 770244 772120 771921 771767 772465
16928 772465 771713 771244 776512 779172 778686 779299 784854 792573 794478 793964 790107 791305 790961 794442 795310 792442
16912G92442N830K817m14J458J749l63Q09K194P61j162M1M082J115M599Q77J289
16896H18124K387K786K370J86k678n55O41L323P06M07J582j083J278q69R82K757
16880H32344j654L178M540K748K868J096J873M395J571M067o78m3M569k19m89
16865H60166K942J752K488K730o44j988L447K39M37J917M77K475o72O33l32K750
16849H78817L789J863L138K980O2k430J408M643K894j58K08Q57M358N499M02J685
16833I10015J934L161L028L886J959P74K916L563M200M67l160l628J831P011M272
16818I42229N995J718J738l05Q26j213J425M408L397J773N239L34R19N69j581
16803I67471K574L770M622L626O97J636P132K328p7K022R77J270L944M732L841
$$ plain form
16912 792442 798272 801089 800675 802133 803882 803519 804328 806522 807283 806121 806162 810244 811359 815958 816835 818124
16896 818124 820511 823297 825667 825853 823175 822620 823261 826584 827290 827697 829279 828196 829474 828605 829587 832344
16880 832344 830690 833868 838408 841156 844024 845120 846993 851388 852959 857026 856348 856305 860874 860655 860166
16865 860166 863108 864860 867348 870078 869434 867446 870893 871132 871569 873486 873963 876438 875766 876399 876067 878817
16849 878817 882606 884469 887607 890587 890649 888219 889627 894270 897164 897006 897214 898071 902429 907928 908330 910015
16833 910015 911949 915110 918138 922024 923983 924757 927673 931236 935436 935903 932743 929115 930946 937957 942229
16818 942229 948224 949942 951680 951375 952201 950988 952413 956821 960218 961991 967230 967564 968483 969052 967471
16803 967471 970045 973815 978437 982063 982760 984396 991528 993856 993779 995801 996778 998048 1001992 1006724 1010565
16788A010565K992M054J087J755Q707M26M030P839N468K719L958O727N015N440
16774A070782J1850P037N140N018Q097J1163J3607J2937J7454K3182K3342K2152
16762A231761J1211q147k8084n2426p3807p4867n1549k7737k502J9294L2663L5431
16750A011241L4104K6076J8222m49k6090m9003p5047o8926m3492l3039j2967J2491
16738G93121K2184J9465K0959K0959J6776J2583R326J1079R262Q325P189N230
16726I56458M027O146N133J773L953P124J0303O329K382O722O351K033j471r85
16712A016278L597J869J299O13L245M931N218M968N791L656Q21L272K485P21L821
16697A062585L993K678L900M218L806O53k362L49J376M580N733L110N068K484
$$ plain form
16788 1010565 1013557 1017611 1018698 1020453 1029160 1029586 1033616 1041455 1046923 1049642 1053600 1060327 1065342 1070782
16774 1070782 1082632 1089669 1094809 1099827 1107924 1119087 1132694 1145631 1163085 1186267 1209609 1231761
16762 1231761 1242972 1234825 1206741 1154315 1080508 1005641 954092 926355 923853 943147 975810 1011241
16750 1011241 1045345 1071421 1089643 1089194 1063104 1014101 939054 870128 826636 793597 780630 793121
16738 793121 815305 834770 855729 876688 893464 906047 915373 926452 935714 944039 951228 956458
16726 956458 960485 966631 971764 973537 977490 984614 994917 1001246 1003628 1010350 1016701 1018734 1017263 1016278
16712 1016278 1019875 1021744 1023043 1023656 1026901 1031832 1037050 1042018 1047809 1051465 1052286 1055558 1058043 1058764 1062585
16697 1062585 1066578 1069256 1073156 1077374 1081180 1081833 1079471 1079820 1081196 1085776 1091509 1094619 1099687 1102171
16683A102171L473O152J444O96j48J601L785K172J764J004Q11J097M259K614J214
16668A134109N308K766K918M308K971r27J086N12K134r39L100J047L354L941Q080
16653A173768N260K798J040J448L484J435M643J454J306K385L496K935K761J79
16639A208392K60N161K876K351k16J981M723K973J639K468K574N091L885N598
16625A249756K798K534K042J329k073j197N964P121K202K934M158N565L232L917
16611A290282P288L157j063J69M179L825M035N713K51J132L875L790j044K326
16597A327915J408L190N141M535L207K128J550L546L814L863L547J213J290L444
16583A369791J657M630O111L334N386M188r68K409L695M944K198K336j000K759
$$ plain form
16683 1102171 1105644 1111796 1113240 1113936 1113788 1115389 1119174 1121346 1123110 1124114 1124925 1126022 1130281 1132895 1134109
16668 1134109 1139417 1142183 1145101 1149409 1152380 1151453 1152539 1153051 1155185 1154246 1157346 1158393 1161747 1165688 1173768
16653 1173768 1179028 1181826 1182866 1184314 1187798 1189233 1193876 1195330 1196636 1199021 1202517 1205452 1208213 1208392
16639 1208392 1208652 1213813 1216689 1219040 1218824 1220805 1225528 1228501 1230140 1232608 1235182 1240273 1244158 1249756
16625 1249756 1252554 1255088 1257130 1258459 1256386 1255189 1261153 1268274 1270476 1273410 1277568 1283133 1286365 1290282
16611 1290282 1297570 1300727 1299664 1299833 1304012 1307837 1311872 1317585 1317836 1318968 1322843 1326633 1325589 1327915
16597 1327915 1329323 1332513 1337654 1342189 1345396 1347524 1349074 1352620 1356434 1360297 1363844 1365057 1366347 1369791
16583 1369791 1371448 1376078 1382189 1385523 1390909 1395097 1394129 1396538 1400233 1405177 1407375 1409711 1408711 1411470
16569A411470M010K715M725M775L834K213J535M632M882Q58N987N997O37J992
16555A460262N324p1k078P536N09K287M927M104L259M366O253N473M735L667O800
16540A517353j277L450L062K864K916N470M899M140O66J760O048O359L210M512
16526A565432N806N723J570J158N022n36K372N501M319O892P425N709N150M285
16512A625828K167M467M919N774K962K557L083L658O109N810Q399Q271P487P731
16498A699222P722L937J319M868K989K336Q134N212J366K982N967M826O385Q708
16484A765973N920O942Q255O788M525N172m75P329P802O506P679Q056P429O412
16470A854313P323P076O485P963O732N836N112L110K282n34J707N91l1M559O897
$$ plain form
16569 1411470 1415480 1418195 1422920 1427695 1431529 1433742 1435277 1439909 1444791 1445649 1451636 1457633 1458270 1460262
16555 1460262 1465586 1465515 1463437 1470973 1471482 1473769 1478696 1482800 1486059 1490425 1496678 1502151 1506886 1510553 1517353
16540 1517353 1516076 1519526 1522588 1525452 1528368 1533838 1538737 1542877 1543543 1545303 1551351 1557710 1560920 1565432
16526 1565432 1571238 1576961 1578531 1579689 1584711 1584175 1586547 1592048 1596367 1603259 1610684 1616393 1621543 1625828
16512 1625828 1627995 1632462 1637381 1643155 1646117 1648674 1651757 1655415 1661524 1667334 1675733 1684004 1691491 1699222
16498 1699222 1706944 1710881 1712200 1717068 1720057 1722393 1730527 1735739 1737105 1740087 1746054 1750880 1757265 1765973
16484 1765973 1771893 1778835 1787090 1793878 1798403 1803575 1803100 1810429 1818231 1824737 1832416 1840472 1847901 1854313
16470 1854313 1861636 1868712 1875197 1883160 1889892 1895728 1900840 1903950 1906232 1905698 1907405 1907996 1907965 1912524 1919421
16455A919421P864J0539P749P278Q504M300M313K852n4j028m56Q64Q715P975Q267
16440A997103R848R243O102J1760P894O825O857J0209P278P645R223R361Q536
16427B107884P016P591P440N849O326P672Q241J1287J2342O912O138J0379R445
16414B214522R923J3074J2907J1784N179L895J0202R724J0470J2878R866Q862
16402B333286J0793R799J1202J3627R887O890M749L979J0771J2112J1217Q102
16390B446414J2650J3998J2138J6803J2368O135J0365R477O175O577R924J3162
16378B576186J2739J3725J2522J4912J8333J3778J3841J7551J0877R096J3575
16367B727135R334P302J6171J8099J9035K5420K2313J7609J7950J9775J3131J3567
$$ plain form
16455 1919421 1927285 1937824 1945573 1952851 1961355 1965655 1969968 1972820 1972766 1971738 1971282 1972146 1980861 1988836 1997103
16440 1997103 2006951 2016194 2022296 2034056 2041950 2048775 2055632 2065841 2073119 2080764 2089987 2099348 2107884
16427 2107884 2114900 2122491 2129931 2135780 2142106 2149778 2158019 2169306 2181648 2188560 2194698 2205077 2214522
16414 2214522 2224445 2237519 2250426 2262210 2267389 2271284 2281486 2291210 2301680 2314558 2324424 2333286
16402 2333286 2344079 2353878 2365080 2378707 2388594 2395484 2400233 2404212 2414983 2427095 2438312 2446414
16390 2446414 2459064 2473062 2485200 2502003 2514371 2520506 2530871 2540348 2546523 2553100 2563024 2576186
16378 2576186 2588925 2602650 2615172 2630084 2648417 2662195 2676036 2693587 2704464 2713560 2727135
16367 2727135 2736469 2743771 2759942 2778041 2797076 2822496 2844809 2862418 2880368 2900143 2913274 2926841
16355B926841J2057J4381J3842J6089J7590K0565K0780K2248J9920K2199K2896
16344C129408K4923K1200K1741K0278K0094K1400K1258J8415J4248J0575J3071
16333C336611J4436J9783K0999K1283K6825K5187K5818L3244L3770K7222K3638
16322C608816K2858K2489J7476K3964K2716K4286K4676K8500L2986L4900L4746
16311C898413L7870L3791L3717L6011M0605L5911L3035L9144M1719M1367M0077
16300D311660M0503M0155M0146M3536M3339L9753M4373M6765M4877N0458N0390
16289D795955N0937N3968N2719N1961N3501N6173N8345N8824O0701N8054O1615
16278E412753O1683O3578P0602P2950P7195Q0451Q6665Q3728Q3837Q6106Q8325
$$ plain form
16355 2926841 2938898 2953279 2967121 2983210 3000800 3021365 3042145 3064393 3084313 3106512 3129408
16344 3129408 3154331 3175531 3197272 3217550 3237644 3259044 3280302 3298717 3312965 3323540 3336611
16333 3336611 3351047 3370830 3391829 3413112 3439937 3465124 3490942 3524186 3557956 3585178 3608816
16322 3608816 3631674 3654163 3671639 3695603 3718319 3742605 3767281 3795781 3828767 3863667 3898413
16311 3898413 3936283 3970074 4003791 4039802 4080407 4116318 4149353 4188497 4230216 4271583 4311660
16300 4311660 4352163 4392318 4432464 4476000 4519339 4559092 4603465 4650230 4695107 4745565 4795955
16289 4795955 4846892 4900860 4953579 5005540 5059041 5115214 5173559 5232383 5293084 5351138 5412753
16278 5412753 5474436 5538014 5608616 5681566 5758761 5839212 5925877 6009605 6093442 6179548 6267873
16267F267873R0422Q9543R1007R5347R8188J04415J10522J16706J20150J29771
16257G313944J37192J37130J41980J42035J48318J50728J55650J63068J71087
16248H661132J79196J88924K05419K23153K36974K49418K67459K78124K90349
16239A0780148K94610K99091K98349L07878L20427L29447L66538M34376M90519
16230A3921383N44531O07787O52896O81633P31990P90119Q51575R30583J033893
16221B0746390J205740J422186J695515K055740K486388L002145L578355L995716
16213D0188175L699556J675362k644346o397735q828818j3440736j3902986q303582
16205g955110m899302j803854K866314N753431O575971O475852N529085K838083
$$ plain form
16267 6267873 6358295 6447838 6538845 6634192 6732380 6836795 6947317 7064023 7184173 7313944
16257 7313944 7451136 7588266 7730246 7872281 8020599 8171327 8326977 8490045 8661132
16248 8661132 8840328 9029252 9234671 9457824 9694798 9944216 10211675 10489799 10780148
16239 10780148 11074758 11373849 11672198 11980076 12300503 12629950 12996488 13430864 13921383
16230 13921383 14465914 15073701 15726597 16408230 17140220 17930339 18781914 19712497 20746390
16221 20746390 21952130 23374316 25069831 27125571 29611959 32614104 36192459 40188175
16213 40188175 43887731 45563093 42918747 36521012 27692194 14251458 348472 -7955110
16205 -7955110 -12854412 -14658266 -11791952 -6038521 537450 7013302 12542387 15380470
16197A5380470j874652n489599q016759j3023214j3609577q332855n489264k890458
16189d3345908J251760L547484L826396L401143K868654K405170K042110J741959
16181b2261232J482835J256365J054865Q85848P60929O81022O25434N99905N96895
16172a4317134N75698N45049N23174M86536M38962L85975L36094K92951K58422
16163a0474273K58959K60739K58670K61990K64478K55145K43026K32636K18876
16154h219754K03294J97036J88823J79426J71699J65490J55599J47057J37814
16145f673516J30184J28139J20042J20906J18804J16415J14565J12147J06485
16136e605829J01901J00633R1765Q7098Q4178P9895P6321P3264P3806P2887P3679
$$ plain form
16197 15380470 13505818 8016219 -540 -13023754 -26633331 -34966186 -40455450 -43345908
16189 -43345908 -42094148 -38546664 -34720268 -31319125 -28450471 -26045301 -24003191 -22261232
16181 -22261232 -20778397 -19522032 -18467167 -17581319 -16820390 -16139368 -15513934 -14914029 -14317134
16172 -14317134 -13741436 -13196387 -12673213 -12186677 -11747715 -11361740 -11025646 -10732695 -10474273
16163 -10474273 -10215314 -9954575 -9695905 -9433915 -9169437 -8914292 -8671266 -8438630 -8219754
16154 -8219754 -8016460 -7819424 -7630601 -7451175 -7279476 -7113986 -6958387 -6811330 -6673516
16145 -6673516 -6543332 -6415193 -6295151 -6174245 -6055441 -5939026 -5824461 -5712314 -5605829
16136 -5605829 -5503928 -5403295 -5311530 -5224432 -5140254 -5060359 -4984038 -4910774 -4836968 -4764081 -4690402
16125d690402P1716P1112O8474O8982O9320O6286O0970N6691N6843N6764N2081
16114c991163N3212N4013N0290N2633M9699M8277M8981M5110M5159M1473L9580
16103c462736M2381M2949M4293L7616M0465L6428L8765L5545L1298L4102L4541
16092c044353L2002K9925K9566K9711L3737L2613L2906L0663L0188K7510K6309
16081b709223K4611K0531K2132K5306K3113K2753K2927K6447K4661K4018K8834
16070b443890K7172K0713K4470K3157J5623J8065K1612J8981J6027J9491K1170
16059b217409K3051J9335K0586J7674J8811J6238J5199J7686J5356J8198J6838
16048b018437K1370K1228K0889J8555J3164J2821J4177J4446J2875R176J3838
$$ plain form
16125 -4690402 -4618686 -4547574 -4479100 -4410118 -4340798 -4274512 -4213542 -4156851 -4100008 -4043244 -3991163
16114 -3991163 -3937951 -3883938 -3833648 -3781015 -3731316 -3683039 -3634058 -3588948 -3543789 -3502316 -3462736
16103 -3462736 -3420355 -3377406 -3333113 -3295497 -3255032 -3218604 -3179839 -3144294 -3112996 -3078894 -3044353
16092 -3044353 -3012351 -2982426 -2952860 -2923149 -2889412 -2856799 -2823893 -2793230 -2763042 -2735532 -2709223
16081 -2709223 -2684612 -2664081 -2641949 -2616643 -2593530 -2570777 -2547850 -2521403 -2496742 -2472724 -2443890
16070 -2443890 -2416718 -2396005 -2371535 -2348378 -2332755 -2314690 -2293078 -2274097 -2258070 -2238579 -2217409
16059 -2217409 -2194358 -2175023 -2154437 -2136763 -2117952 -2101714 -2086515 -2068829 -2053473 -2035275 -2018437
16048 -2018437 -1997067 -1975839 -1954950 -1936395 -1923231 -1910410 -1896233 -1881787 -1868912 -1859736 -1845898
16037a845898P298J0605J7135K1474J4549J5550J4167J7171J5257J4028J2833
16026a685831Q539P496J1353J6583J1011J2997J3752J4636J7246J6111J1246J2515
16014a532346J7200J1619O337R543J1274J1235P771J3221J6363J3964R722J4392
16002a389705J4874J1272J0977Q119O861Q017Q335R414J0184J2623J5971R583
15990a263475K603O7K688R901R117J1413J1307R660P341J0748J2299R334R272
15977a157725P481J1388Q408P121O231P667N236O772R648Q088P137Q307P349J0363
15963a046529O828M684J1274Q682N081O988M227L600M397N434L891M820P385O317
15949i62921R152O897N804N490O851P751O794O135J310K672M571L499O051O071
$$ plain form
16037 -1845898 -1838600 -1827995 -1810860 -1789386 -1774837 -1759287 -1745120 -1727949 -1712692 -1698664 -1685831
16026 -1685831 -1677292 -1669796 -1658443 -1641860 -1630849 -1617852 -1604100 -1589464 -1572218 -1556107 -1544861 -1532346
16014 -1532346 -1515146 -1503527 -1497190 -1487647 -1476373 -1465138 -1457367 -1444146 -1427783 -1413819 -1404097 -1389705
16002 -1389705 -1374831 -1363559 -1352582 -1344463 -1337602 -1329585 -1321250 -1311836 -1301652 -1289029 -1273058 -1263475
15990 -1263475 -1260872 -1260805 -1258117 -1248216 -1239099 -1227686 -1216379 -1206719 -1199378 -1188630 -1176331 -1166997 -1157725
15977 -1157725 -1150244 -1138856 -1130448 -1123327 -1117096 -1109429 -1104193 -1097421 -1087773 -1079685 -1072548 -1064241 -1056892 -1046529
15963 -1046529 -1039701 -1035017 -1023743 -1015061 -1009980 -1002992 -998765 -995165 -990768 -985334 -981443 -976623 -969238 -962921
15949 -962921 -953769 -946872 -941068 -935578 -928727 -920976 -914182 -908047 -906737 -904065 -899494 -895995 -889944 -883873
15935h83873Q223N613Q628N947L721P483P840J0734O748J040K414M460M274O041
15921h00707q66L518N172N472O388O006P249N005L541O649Q069N753L933P178
15907g27640P146M543N080N093N348L069k69K600K407k57O065N684Q063Q992K554
15892f61522M95N878O372M098J526J811M191K650K320J713K411P207R166M187
15878f07497O061M375J062N867Q482M268K664L095N371J998J299L310O800O683
15864e46162K480K646L377M117M011K197R47M370J779J273L350N904N426K966
15850e01319P780O656M690M394L088N258L133J045L774K779K203J637L682M216
15836d46984Q35K871P430N045J75j807Q77L504M931L390M487O361K022j859L257
$$ plain form
15935 -883873 -875650 -870037 -861409 -855462 -851741 -844258 -836418 -825684 -818936 -817896 -815482 -811022 -806748 -800707
15921 -800707 -801573 -798055 -792883 -787411 -781023 -775017 -767768 -762763 -759222 -752573 -744504 -738751 -734818 -727640
15907 -727640 -720494 -715951 -710871 -705778 -700430 -697361 -697630 -695030 -692623 -692880 -686815 -681131 -673068 -664076 -661522
15892 -661522 -661027 -655149 -648777 -644679 -643153 -641342 -637151 -634501 -632181 -630468 -628057 -620850 -611684 -607497
15878 -607497 -601436 -597061 -595999 -590132 -581650 -577382 -574718 -571623 -566252 -564254 -562955 -559645 -552845 -546162
15864 -546162 -543682 -541036 -537659 -533542 -529531 -527334 -526387 -522017 -520238 -518965 -515615 -509711 -504285 -501319
15850 -501319 -493539 -486883 -482193 -477799 -474711 -469453 -466320 -465275 -461501 -458722 -456519 -454882 -451200 -446984
15836 -446984 -446149 -443278 -435848 -430803 -430628 -432435 -431558 -428054 -423123 -419733 -415246 -408885 -406863 -408722 -405465
15821d05465M439L260J836J218J758N566M983P01O774M357l25J199M125M532L618
15806c57424O076N341j630K611O291K718K658J616M247J409j41O15M96M563L154
15791c17400J337p9R42L886P637L492K950J928M877J040K277K247k231K555O421
15776b78121O366j550j841M933O121J885L001L53K704M390J572K249N87J002K251
15761b44098M936N658K004J306K637K145J877K450O80M333J714J437P038K430
15747b03453P21K97K61J967N21N531L138N931M010L541n8N154R21k405K344m09
15731a71988m29O154O037L006M418L530K245R71j171p03L482P976M782M809L523
15716a23358l7O13K702M228J451q90O61M351M449K131r42K45J022P23L034J616
$$ plain form
15821 -405465 -401026 -397766 -395930 -394712 -392954 -387388 -382405 -381704 -374930 -370573 -370898 -369699 -365574 -361042 -357424
15806 -357424 -351348 -346007 -347637 -345026 -338735 -336017 -333359 -331743 -327496 -326087 -326228 -325613 -325117 -320554 -317400
15791 -317400 -316063 -316142 -315200 -311314 -303677 -300185 -297235 -295307 -290430 -289390 -287113 -284866 -287097 -284542 -278121
15776 -278121 -271755 -273305 -275146 -270213 -264092 -262207 -259206 -258853 -256149 -251759 -250187 -247938 -247351 -246349 -244098
15761 -244098 -239162 -233504 -231500 -230194 -227557 -225412 -223535 -221085 -220405 -216072 -214358 -212921 -205883 -203453
15747 -203453 -202732 -202435 -202174 -200207 -199686 -194155 -191017 -185086 -181076 -177535 -177593 -172439 -171518 -173923 -171579 -171988
15731 -171988 -172417 -166263 -160226 -157220 -152802 -149272 -147027 -146056 -147227 -147930 -144448 -136472 -131690 -126881 -123358
15716 -123358 -123395 -122782 -120080 -115852 -114401 -115291 -114630 -110279 -105830 -103699 -104641 -104396 -103374 -102651 -99617 -98001
15700i8001N288K924O345K532L48J702J561K826M823L395L330L966J975L592M195
15685d9199K048L929L641J242L336N141O785M251J817K629M028P745N440K076
15671D909J151L818O658Q315R397Q968R713O920Q465J2421J5490J3932K0110J9573
15657A49840K1837K0773N930k1337l9820n6163p9067o2100l3865k1015K144K5707
15645h7136L3746L6651L4602K3014M550j3588l1013n3894p3767o2205l6296k4915
15633b50251o063J4128K0991J7475J8916J6855J5140J5676J2190K958Q648Q060
15621a05277M928O785P166O007N539O062M126P207L849J285J501K278N202L315
15607d0027J766J121K390L739K329K266L874M323M413L090M390j049k15M259K440
$$ plain form
15700 -98001 -92713 -89789 -83444 -80912 -80564 -78862 -77301 -74475 -69652 -66257 -62927 -58961 -56986 -53394 -49199
15685 -49199 -47151 -43222 -39581 -38339 -35003 -29862 -23077 -18826 -17009 -14380 -10352 -2607 2833 4909
15671 4909 6060 9878 16536 24851 34248 43216 52929 59849 68314 80735 96225 110157 130267 149840
15657 149840 171677 192450 198380 177043 137223 81060 1993 -60107 -93972 -114987 -112843 -87136
15645 -87136 -53390 -16739 17863 40877 45427 31839 826 -53068 -126835 -189040 -225336 -250251
15633 -250251 -256314 -242186 -221195 -203720 -184804 -167949 -152809 -137133 -124943 -121985 -113337 -105277
15621 -105277 -100349 -93564 -86398 -80391 -74852 -68790 -64664 -57457 -53608 -52323 -50822 -48544 -43342 -40027
15607 -40027 -38261 -37140 -34750 -31011 -28682 -26416 -22542 -18219 -13806 -10716 -6326 -7375 -7590 -3331 -891
15592h91k14K592K341L130K230K031J751M417L161J173R20K280O454J759K025
15577C5159L498j70m118J342L445K703P54k430N433L027M290K677m09j637L270
15562E6834J979Q13q54q90r53K816M062K394K249J554K719q1R35K366j911k192
15546G1840O187N380J510J030l78j63J32Q82L653J462K729N356O27K863O17j736
15530A01991j089J280L84M505N836m79L30J518k283r29M236K491K156K495J585
15515A24027o5P09J528L098L264k437o585L338L834j877J268N277M386R06Q97
15500A41568J628M89j132M78J081J263K648l2k499n49K738N370l43N78K789J295
15484A57370P03M270M263K78j788R20N31K722L572RJ351Q88j128j139r57l36K364
$$ plain form
15592 -891 -1105 1487 3828 6958 9188 11219 12970 17387 20548 21721 22641 24921 31375 33134 35159
15577 35159 38657 38487 34369 35711 39156 41859 42613 40183 45616 48643 52933 55610 55201 53564 56834
15562 56834 58813 59626 58772 57882 56929 59745 63807 66201 68450 70004 72723 72642 73577 75943 74032 71840
15546 71840 78027 83407 84917 85947 85569 85406 85538 86420 90073 91535 94264 99620 100247 103110 103727 101991
15530 101991 100902 102182 102566 107071 112907 112428 112758 114276 111993 111064 115300 117791 119947 122442 124027
15515 124027 123962 124671 126199 129297 132561 130124 123539 126877 130711 128834 130102 135379 139765 140671 141568
15500 141568 143196 143685 142553 143031 144112 145375 148023 147991 145492 144943 147681 153051 152708 153286 156075 157370
15484 157370 158073 162343 166606 166884 165096 166016 166547 169269 172841 172850 174201 175089 173961 172822 171865 171529 173893
15467A73893K509J316K436P53N36K458O65k57Q18L528J916Q71j739K793J570N61
15451A94627L312M29M650k360k439J794M665N35M80M22o45J32M36J409q00o97
15435B05950L084M391K817L67m68k507l162Q43N315M272k472M99O902M536J350
15420B31717J646J080r40n85J958j121M30l11K134Q53J281m08K305K61P59K823
15404B43882L046j510j008K625K171K722K605J617j719p77K473K129R82o99J438
15389B59977L071R12J999K53J070J177K85r02o41J663J63K126j104j748L191M397
15373B75889K244K91m24r97k901l10M971J327L908M840L852l32m108k6M82J641
15357B90347L902J761K959n46l393j668Q88M156J589m66m79k022j128L323M47
$$ plain form
15467 173893 176402 177718 180154 180907 181443 183901 184566 184309 185127 188655 190571 191442 189703 192496 194066 194627
15451 194627 197939 198368 203018 200658 198219 200013 204678 205213 205693 206115 205470 205602 206038 207447 206647 205950
15435 205950 209034 213425 216242 216609 216141 213634 210472 211315 216630 220902 218430 218929 225831 230367 231717
15420 231717 233363 234443 233503 232918 234876 233755 234185 233874 236008 236861 238142 237734 240039 240300 241059 243882
15404 243882 246928 245418 244410 247035 249206 251928 254533 256150 254431 253654 256127 258256 259238 258539 259977
15389 259977 263048 263960 265959 266212 267282 268459 268744 267842 267201 268864 269027 271153 270049 268301 271492 275889
15373 275889 278133 278424 278000 277003 274102 273792 278763 280090 283998 288838 292690 292358 288250 288224 288706 290347
15357 290347 294249 296010 298969 298423 295030 293362 294250 298406 299995 299529 299050 297028 295900 299223 299670
15342B99670J895O327M59p11J344K515K315K687m277j989L844L249J627m41J67
15327C18681j290K371K952J134J749k25K53L971K123l794l068J406M72O15M476
15312C31826j031r4l43L544J936j195O97n49l832O68M275L082k136J037m52N74
15296C38007M091K504q96n10p51K508J649K554J880R1J247J200J565J382j22k114
15280C54285j049N972J655J983L74k063K103K784M333P55m52l221j194J207j253
15265C66219J569M80L4J474N30r38K156j498l861M298R81J495K271M370K468J066
15249C83114j47o85k841j189j369L266L737L088M305q29j415l436P1M35J005L652
15233C90762L764K124J108K673P88r39Q56j007r56J74J685L701m62l54l808k230
$$ plain form
15342 299670 301565 307892 308351 307640 308984 311499 313814 316501 312224 310235 314079 317328 318955 318514 318681
15327 318681 317391 319762 322714 323848 325597 325372 325625 329596 331719 327925 324857 326263 326735 327350 331826
15312 331826 330795 330701 330358 333902 335838 334643 335340 334791 330959 331627 335902 338984 336848 337885 337433 338007
15296 338007 342098 344602 343706 343196 342445 344953 346602 349156 351036 351127 352374 353574 355139 356521 356399 354285
15280 354285 353236 359208 360863 362846 363220 361157 363260 366044 370377 371132 370680 367459 366265 367472 366219
15265 366219 367788 368268 368302 369776 370306 369368 371524 370026 366165 370463 371444 372939 375210 379580 382048 383114
15249 383114 382967 382282 379441 378252 376883 380149 383886 386974 391279 390450 389035 385599 385670 386105 387110 390762
15233 390762 394526 396650 397758 400431 401219 400280 401136 400129 399173 399347 401032 404733 404271 403917 400109 397879
15217C97879K576L114K769J889k509k295n9j98L334M363K289J434j319O69J96
15202D14132L506M436j954O74K169L221K771R71K235P34r12j493J71L19Q63L369
15186D35212K991q99L440K761j197O57l28J14l460k118j910n25P86j31M359K987
15170D42739K599j552L88M499J496r20K162r80J140J228L60J569L35j126J102
15155D55039J255j276l115K318J433j43p99K065K621Q0j529k856m316P505M483
15140D62765k25P40K266L600k066J10K87R81k727L40J948L80n80R91L879J572
15124D74261K51j430k05L124O048L47j891K826L184r97J458L58p78M92K106J122
15108D90276k98r58J211M310k700J682O47J589K649L054J457k377k83R71K668
$$ plain form
15217 397879 400455 403569 406338 408227 405718 403423 403364 403166 406500 410863 413152 414586 413267 413936 414132
15202 414132 417638 422074 420120 420794 422963 426184 428955 429926 432161 432895 431983 430490 430661 430980 431843 435212
15186 435212 438203 437304 440744 443505 442308 442965 442637 442751 439291 437173 435263 434738 435524 435393 439752 442739
15170 442739 445338 443786 444174 448673 450169 449249 451411 450431 451571 452799 453159 454728 455063 453937 455039
15155 455039 456294 455018 451903 454221 455654 455511 454712 456777 459398 459478 457949 455093 450777 458282 462765
15140 462765 462540 463280 465546 469146 467080 467190 467477 468458 465731 466071 468019 468399 467819 468810 472689 474261
15124 474261 474512 473082 472877 476001 482049 482396 480505 483331 486515 485518 486976 487334 486556 487048 489154 490276
15108 490276 489978 489020 490231 494541 491841 493523 494170 495759 498408 501462 502919 500542 500259 501230 503898
15093E03898K168J803j764k81L876O44K105q55k298L914K154Q60k022K7r55j379
15077E11895r85J502M598J88j181K79L434O64o17l139k59K713K277M64L715K20
15061E25768j316k793J682L372J864j644r0L596K572o47R24J063K78j107k135
15046E31387l557J664N161M334j204L364O98N23j075j728N036L6k881o76K915
15031E43997K213m59j239j29k745J706K369N97R36r7J168N170j315l072M4K542
15015E51686J53n0J483N271J220J361j684k37p79M65M971J407j885K17L113J300
14999E68012j312m297J566j109k82J758J31K481K120j430K062j804k665M795O235
14984E76261L369j279j279R88K274j104J556L75j474M08j738J066M599L039R24
$$ plain form
15093 503898 506066 507869 506105 505824 509700 510344 512449 511594 509296 513210 515364 516224 514202 514229 513274 511895
15077 511895 510910 512412 517010 517198 516017 516296 519730 520394 519777 516638 516379 519092 521369 521833 525548 525768
15061 525768 524452 521659 523341 526713 528577 526933 526843 530439 533011 532364 533288 534351 534629 533522 531387
15046 531387 527830 529494 534655 538989 537785 541149 541847 542370 541295 539567 544603 544639 541758 541082 543997
15031 543997 546210 545751 544512 544383 541638 543344 545713 546310 547246 547149 548317 553487 552172 549100 549144 551686
15015 551686 551839 551789 553272 558543 559763 561124 559440 559203 558424 558889 563860 565267 563382 563599 566712 568012
14999 568012 566700 562403 563969 562860 562578 564336 564467 566948 569068 567638 569700 567896 565231 570026 576261
14984 576261 579630 578351 577072 578060 580334 579230 580786 581161 579687 580095 578357 579423 584022 587061 587985
14969E87985K45K134L092j75k139k670j901J140m55J226L116J531q72J781L213
14954E97251J465L71J59J045J725j033q23J798J335l009R9k505o66J736J523M161
14938F04632O033L249j26j021j091j310J018J138m67J790K672k606j139Q03M038
14923F17613j366k23O24L332K897r66J251k879k859R50N230N537k723j040M63
14908F25841M44M213L540j023J383K010J24p24K505O81q95o32j904J750K49J954
14892F39516L382N23K096J496l92l858k895J971M403k59J381L030J489j985P35
14877F50633j166k215J072N354J187k570M02M012M431j574L415J95k517k692K05
14862F58172K373Q36n41N35J439n34l5N15K994K513k310P9J975J709l64j266J570
$$ plain form
14969 587985 588230 590364 593456 593281 591142 588472 586571 587711 587256 588482 591598 593129 592257 594038 597251
14954 597251 598716 599087 599246 600291 602016 600983 600160 601958 603293 600284 600383 597878 597212 598948 600471 604632
14938 604632 610665 613914 613788 612767 611676 610366 611384 612522 612055 613845 616517 613911 612772 613575 617613
14923 617613 616247 616024 616648 619980 622877 621911 623162 620283 617424 618374 623604 629141 626418 625378 625841
14908 625841 626285 630498 634038 633015 634398 636408 636532 635808 638313 638994 638099 637467 635563 637313 637562 639516
14892 639516 642898 643421 645517 647013 646621 642763 639868 641839 646242 645983 647364 650394 651883 649898 650633
14877 650633 649467 647252 648324 653678 654865 652295 652697 656709 661140 659566 662981 663176 660659 657967 658172
14862 658172 660545 661381 660840 661375 662814 662280 662245 662760 665754 668267 665957 666036 668011 669720 669356 668090 669660
14845F69660j016J604K471J699o65J18j24L674N649J980l801j96k044K546K669
14830F84224p22k197k750L219K968J411K28R93O37K379K5P42q08J023O53J319
14814F93344Q61L12P85K690Q71m98L9L236J349j523j557k300l79M41J267N0K500
14797G01488L201K31m474J131l34M251r8J025J175k03L56L775M122J313j184j0
14781G15765N33k089J726K752P83k078J063Q35J017M143q17k680O7J041M71R75
14765G23507j114j759M918K680J22K184L058j34q22J799L176o73p90J48j033O97
14749G35964k15N4K070Q24J110L737J901J091l35j683J118J849j003J41J123r4
14733G47652j310J682J825K020N389J466P07m11j628q76J223P49J859K457m716
$$ plain form
14845 669660 668644 670248 672719 674418 673753 673871 673747 677421 683070 685050 681249 681053 679009 681555 684224
14830 684224 683502 681305 678555 681774 684742 686153 686381 687374 688011 690390 690415 691157 690349 691372 692025 693344
14814 693344 694205 694517 695302 697992 698863 698365 698404 701640 702989 701466 699909 697609 697230 697671 698938 698988 701488
14797 701488 704689 704920 700446 701577 701243 705494 705396 706421 707596 707393 707749 711524 715646 716959 715775 715765
14781 715765 716298 714209 715935 718687 719470 717392 718455 719290 720307 724450 723633 720953 721020 722061 722532 723507
14765 723507 722393 720634 725552 728232 728354 730538 733596 733462 732640 734439 737615 736942 736152 736300 735267 735964
14749 735964 735749 735803 737873 738697 739807 743544 745445 746536 746201 744518 745636 747485 746482 746623 747746 747652
14733 747652 746342 748024 749849 751869 757258 758724 759431 759020 757392 756516 757739 758488 760347 762804 758088
14718G58088j635m53J078J532O06J540R05J377k489j178K97N932M492J07p0k860
14702G67269j012J393k026J550O77j085J665N283N226J66k539r91k159J592M40
14687G75449L61L89J446J320J939M38M333J550j915J508K8K909l864q72l51J362
14671G86030J471L484K142P38L256J036j226r02L643J237L653m01j573K132J214
14656H05934k221k723k936K113L228Q65L476q05J66j377K212k107j720L334K611
14641H10050O37K180L106P87N654K3k121k305j120M551Q6k87j527l22Q23J714
14625H21929Q87k373O0K670J83O97Q06L184K548k469P73J713J624K740j247j300
14609H32425N15P95J95J789j319R18J546l092K88K814K366j118K955M267L296
$$ plain form
14718 758088 756453 756000 757078 758610 759216 760756 761661 763038 760549 759371 759668 765600 770092 770199 770129 767269
14702 767269 766257 767650 765624 767174 767851 766766 768431 773714 778940 779106 776567 775576 773417 775009 775449
14687 775449 775810 776199 777645 778965 780904 781342 785675 787225 785310 786818 786846 789755 785891 785019 784668 786030
14671 786030 787501 790985 793127 793865 797121 798157 796931 796029 799672 800909 804562 804161 802588 804720 805934
14656 805934 803713 800990 798054 800167 803395 804260 807736 806931 807097 805720 807932 805825 804105 807439 810050
14641 810050 810687 812867 815973 816760 822414 822437 820316 818011 816891 821442 821528 821241 819714 819392 820215 821929
14625 821929 822816 820443 820503 823173 823356 824053 824859 828043 830591 828122 828895 830608 832232 834972 833725 832425
14609 832425 832940 833735 833930 835719 834400 835318 836864 833772 834060 836874 839240 838122 841077 845344 848640
14594H48640l7r09j240r49L48L496J302J641j297j82j526k958K169O61J650J845
14578H52654J145L389K272K207J625J298k694l810l24J191K590L753M25K624k286
14563H66059j380L658L615j018J043L89K715O02l467K297J321l098l515j288N280
14548H73213N44K601L219L553K805J944p72k79J126r9o92n017J872Q30J916J700
14532H88464J797J830J733Q81L86J145K607L484m28j123o17o65L57r46o61j657
14516H96587j652L175L137k930k885P9N659J960j643k64K861R78J19N97J203K463
14500I09444L442K219j758k143L211L296j267p74n39j995J330l96L522L657N052
14485I26301R97L2j029L80K056J718K014J692k060j574j125J085j369j0J703K467
$$ plain form
14594 848640 848603 847694 846454 845505 845853 849349 850651 852292 850995 850813 849287 846329 848498 849159 850809 852654
14578 852654 853799 857188 859460 861667 863292 864590 861896 858086 857762 858953 861543 865296 865721 868345 866059
14563 866059 864679 868337 871952 870934 871977 872366 875081 875683 872216 874513 875834 872736 869221 867933 873213
14548 873213 873757 876358 879577 883130 885935 887879 887107 886828 887954 887855 887163 882146 884018 884848 886764 888464
14532 888464 890261 892091 893824 894705 895091 896236 898843 902327 901899 900776 900159 899494 899851 898905 898244 896587
14516 896587 894935 898110 901247 898317 895432 895511 901170 903130 901487 901223 904084 905062 905181 905778 906981 909444
14500 909444 912886 915105 913347 911204 914415 917711 916444 915670 915131 913136 914466 914070 917592 921249 926301
14485 926301 927298 927330 926301 926681 928737 930455 932469 934161 932101 930527 929402 930487 929118 929108 930811 933278
14469I33278J023M188N19j552r13K320P9L414O195l02k94k471n25K900J072j445
14453I47486J408M059J574L99N88q36k70m49L75j627K627M962L025M110k003j179
14437I64249P26j989k439j55K731L931N85L370K399q05k425J434L788J978J505
14422I78883J654l88k182j860p52J783K807l74j01j49N23k54p65L197k142J29
14406I80009Q84J561K154M618Q87R59L890O171K794o652k649r92m03K568L029
14391I98828L80M778O40j153M8N43J615j893k476j666K136L18j619J949L637J059
14375A007124k277K89J676N503M108J246P61P25L734J373J082P50k90l469j039
14360A021296j011J850K644J965q68J090J424L060K008P28J005o68l685k144j313
$$ plain form
14469 933278 934301 938489 939008 937456 936543 938863 938942 942356 948551 948249 947955 945484 944959 947859 948931 947486
14453 947486 948894 952953 954527 954926 955514 954678 954408 953959 954334 952707 955334 960296 963321 967431 965428 964249
14437 964249 964975 962986 960547 960392 963123 967054 967639 971009 973408 972603 970178 971612 975400 977378 978883
14422 978883 980537 980149 977967 976107 975355 977138 979945 979571 979470 979321 979844 979590 978825 982022 979880 980009
14406 980009 980893 982454 984608 989226 990113 991072 994962 1001133 1003927 997275 994626 993634 993231 995799 998828
14391 998828 999208 1003986 1004626 1003473 1003521 1004064 1005679 1003786 1001310 999644 1001780 1002098 1000479 1002428 1006065 1007124
14375 1007124 1004847 1005136 1006812 1012315 1016423 1017669 1018430 1019155 1022889 1024262 1025344 1026094 1025804 1022335 1021296
14360 1021296 1020285 1022135 1024779 1026744 1025876 1026966 1028390 1031450 1033458 1034186 1035191 1034523 1030838 1028694 1027381
14345A027381J37K47K355J764L680L197J939q09j205R87L505K253L71K149J911
14330A049862R59p43J660r11l12J821Q46m110K2L434L743J10O98J74j906J666
14314A057013L92n83L728K345K75K376L706K031J925O50l349k368J59J243M579
14299A074122K88o74M850L110k97J630L788K077q89O85k13l508Q87K45m37L804
14283A089468O265k054k177j173j575K005J368J172n91k463k070K83L937N144
14269A097539L222j245J789j907m976q54N724M413M489J270K150K441j488M1p85
14254A111823k671K498L638K684J328o90O45J652J950Q39q30j374J811L233K255
14239A128791k20k051k914O50M127K735J876K289l905K177M104P83M015J348P02
$$ plain form
14345 1027381 1027518 1027765 1030120 1031884 1035564 1038761 1040700 1039891 1038686 1039673 1043178 1045431 1045802 1047951 1049862
14330 1049862 1050821 1050078 1051738 1050827 1050515 1052336 1053182 1049072 1049094 1052528 1056271 1056381 1057079 1057253 1055347 1057013
14314 1057013 1057405 1056822 1060550 1062895 1063170 1065546 1069252 1071283 1073208 1073858 1070509 1068141 1068300 1069543 1074122
14299 1074122 1074410 1073736 1078586 1081696 1081399 1083029 1086817 1088894 1088005 1088690 1088477 1084969 1085856 1086101 1085664 1089468
14283 1089468 1095733 1093679 1091502 1090329 1088754 1090759 1092127 1093299 1092708 1090245 1088175 1088458 1092395 1097539
14269 1097539 1100761 1099516 1101305 1099398 1094422 1093568 1099292 1103705 1108194 1109464 1111614 1114055 1112567 1112608 1111823
14254 1111823 1109152 1111650 1115288 1117972 1119300 1118610 1119255 1120907 1122857 1123696 1122866 1121492 1123303 1126536 1128791
14239 1128791 1128571 1126520 1123606 1124256 1128383 1131118 1132994 1135283 1131378 1133555 1137659 1138442 1142457 1143805 1144507
14224A144507M84J408l3k208J792j42L206K810k082k285j71M284L593J000k144
14209A154019k665K462K046J246L89j319P20L085K298J521q29Q03K906J938J728
14194A170348m11P23Q10j655n53J92R88Q43K219J615J419J618K062k69K494M74
14178A182917j375k24l42K571K937M259r85L182k087l256K97K737L1K402N337
14163A198401K67M23J44l362k756J789M260J798J301K401J689J653M262l090P15
14148A209895N762Q73j26L44j830j67K067K770K510k655j85k35L34K603M674O17
14132A227251j236j173J659M940K973L056M184K12R68Q40j032J708k020K643J148
14117A246121p35j300N78j57K575M457K2O90J678K962M277o14q27J630K022M17
$$ plain form
14224 1144507 1144991 1146399 1146366 1144158 1145950 1145808 1149014 1151824 1149742 1147457 1147286 1151570 1155163 1156163 1154019
14209 1154019 1151354 1153816 1155862 1157108 1157497 1156178 1156898 1159983 1162281 1163802 1162973 1163776 1166682 1168620 1170348
14194 1170348 1169937 1170660 1171470 1169815 1169262 1169454 1170442 1171285 1173504 1175119 1176538 1178156 1180218 1179949 1182443 1182917
14178 1182917 1181542 1181318 1180976 1183547 1186484 1190743 1189758 1192940 1190853 1187597 1187894 1190631 1190662 1193064 1198401
14163 1198401 1198668 1199091 1199235 1195873 1193117 1194906 1199166 1200964 1202265 1204666 1206355 1208008 1212270 1209180 1209895
14148 1209895 1215657 1216530 1216404 1216748 1214918 1214751 1216818 1219588 1222098 1219443 1219258 1219023 1219357 1221960 1226634 1227251
14132 1227251 1226015 1224842 1226501 1231441 1234414 1237470 1241654 1241866 1242834 1243674 1242642 1244350 1242330 1244973 1246121
14117 1246121 1245386 1244086 1244664 1244507 1247082 1251539 1251561 1252251 1253929 1256891 1261168 1260554 1259727 1261357 1263379 1263796
14101A263796K55n05q57r2r25K54M118J817M584J832k609oJ596R2J834L415p63
14084A277836p87K283K924k194l814q92L193M010M048K222j817K755J181J496
14070A292444P19l44L970N541K107l095j483M945r1m523j801L24O27p86M389M848
14054A307791M720J925J485K720o76k658O59k222q21L288K757K110j705J665j752
14039A319286n56K395J800J745K002J901K176P56J127l29j598n65K194N030M239
14024A341603J483l315R72L273L939K371o69j626k685l30Q23L432N268J763j346
14009A354956J256K70K820K680L934K934K354k46J260n09o83O13j329L388J683
13994A375381J658K048Q88j030R93L245N024J053R52O91L244J556k935j823k49
$$ plain form
14101 1263796 1264051 1263546 1262689 1262597 1261672 1261926 1266044 1267861 1272445 1274277 1271668 1271662 1273258 1273350 1275184 1278599 1277836
14084 1277836 1277049 1279332 1282256 1280062 1276248 1275356 1278549 1282559 1286607 1288829 1287012 1289767 1290948 1292444
14070 1292444 1293163 1292819 1296789 1302330 1304437 1301342 1299859 1304804 1304713 1300190 1298389 1298713 1299340 1298554 1302943 1307791
14054 1307791 1312511 1314436 1315921 1318641 1317965 1315307 1315966 1313744 1312923 1316211 1318968 1321078 1319373 1321038 1319286
14039 1319286 1318730 1321125 1322925 1324670 1326672 1328573 1330749 1331505 1332632 1332303 1330705 1330140 1332334 1337364 1341603
14024 1341603 1343086 1339771 1340743 1344016 1347955 1350326 1349657 1348031 1345346 1345016 1345839 1349271 1354539 1356302 1354956
14009 1354956 1356212 1356482 1359302 1361982 1365916 1368850 1371204 1370958 1372218 1371709 1371026 1371639 1370310 1373698 1375381
13994 1375381 1377039 1379087 1379975 1378945 1379938 1383183 1388207 1389260 1390212 1390903 1394147 1395703 1392768 1390945 1390696
13979A390696K577r44J99J444O67M250R62N38M274J61j531J445J556Q37J674M579
13963A413384M82j672k046K361M595k811L318O433K139P16j177n22o64L361Q30
13948A428727J418m67J841J339Q85L886q76o88L184O547%j971j291j969p66N707
13932A445506j48J049M821L491K18J388L576K082l657N2J144J626M045J469O33
13917A467295K143k170J518O377K623l057O37O185O81p230L182K233J374J303
13903A483094n51L476P39J778K905K373k509J714L672R79Q75J222M82K479M48
13888A503176J513L14P36J23J582N292k378j001K051M356L336J805J800P97M87
13873A523989K509M432j006L99J557j695O88J509K054J731N743L430J976K24j882
$$ plain form
13979 1390696 1393273 1392329 1392528 1393972 1394639 1398889 1399851 1400389 1404663 1404824 1403293 1404738 1406294 1407131 1408805 1413384
13963 1413384 1413866 1412194 1410148 1412509 1417104 1414293 1417611 1424044 1426183 1426899 1425722 1425200 1424536 1427897 1428727
13948 1428727 1430145 1429678 1431519 1432858 1433743 1437629 1436753 1436065 1439249 1445796 1445796 1443825 1442534 1440565 1439799 1445506
13932 1445506 1445358 1446407 1451228 1454719 1454937 1456325 1459901 1461983 1458326 1458378 1459522 1461148 1465193 1466662 1467295
13917 1467295 1469438 1467268 1468786 1475163 1477786 1474729 1475366 1481551 1482232 1475002 1478184 1480417 1481791 1483094
13903 1483094 1482543 1486019 1486758 1488536 1491441 1493814 1491305 1493019 1496691 1497670 1498545 1499767 1500249 1502728 1503176
13888 1503176 1504689 1505003 1505739 1505862 1507444 1512736 1510358 1509357 1511408 1515764 1519100 1520905 1522705 1523502 1523989
13873 1523989 1526498 1530930 1529924 1530323 1531880 1530185 1530873 1532382 1534436 1536167 1541910 1545340 1547316 1547540 1545658
13858A545658j576m20K573L573J904J89K62P74j395K424K135p3m6N78Q025J883
13842A566468K135K375K617L267L002O46o04J247L56K974O83N9M028K550j277
13827A590526K931J797J747k288K67J771j487j489M31q21J364N233P22Q34K776
13812A604314J752L385M008J438K119M229k95j469J707J995N872L863j101j354
13798A630463L771K716j902P5P97K627J489k741J971L245J450J265J083j97L213
13783A649325K825K296J033M458J587M9l26j131J013M108O446J698j055j596k73
13768A670457J572k27M062M176j025J356N772K469K288K358Q54j271L86K066J835
13753A697128r92J146J85K987N325K856K574L614O42j268J48r24q13J998N211
$$ plain form
13858 1545658 1544082 1543662 1546235 1549808 1551712 1551901 1552163 1552937 1551542 1553966 1556101 1556028 1555982 1556560 1564585 1566468
13842 1566468 1568603 1570978 1573595 1576862 1579864 1580510 1579906 1581153 1581509 1584483 1585166 1585225 1589253 1591803 1590526
13827 1590526 1593457 1595254 1597001 1594713 1594980 1596751 1595264 1593775 1594206 1593385 1594749 1599982 1600704 1601538 1604314
13812 1604314 1606066 1609451 1613459 1614897 1617016 1621245 1620950 1619481 1621188 1623183 1629055 1632918 1631817 1630463
13798 1630463 1634234 1636950 1635048 1635123 1635920 1638547 1640036 1637295 1639266 1642511 1643961 1645226 1646309 1646112 1649325
13783 1649325 1652150 1654446 1655479 1659937 1661524 1661573 1661247 1660116 1661129 1665237 1671683 1673381 1672326 1670730 1670457
13768 1670457 1672029 1671802 1675864 1680040 1679015 1680371 1686143 1688612 1690900 1693258 1694112 1692841 1693227 1695293 1697128
13753 1697128 1696136 1697282 1697467 1700454 1705779 1708635 1711209 1714823 1715465 1714197 1714345 1713421 1712608 1714606 1719817
13738A719817N363K765p49L176N839L023j724J157j102M827L861J269J531k954
13724A746099q79j592L68L025K737L036M661J923j010L542L034M098O3M346L851
13709A777302J227J417K369j62L602J544J943P53k599M608J886J334O21L317k090
13694A797072O44M069L636O44J359L046J506K676K50K40M326P24o77L038J47K090
13678A824790R12o53K875R49j075K704L249K103K311j404j49J457M549O29Q55
13663A844102M945L867q15R33J278L535K710J452K705K953K139M691K339K87R04
13648A878025M67L54L077R29p3k36M893M360J096K069J559K62K760M844K151l21
13632A906216J798K687K110O74R10M268K359M362K80j028O23J146K563J641N500
$$ plain form
13738 1719817 1725180 1727945 1727196 1730372 1736211 1739234 1737510 1738667 1737565 1742392 1746253 1747522 1749053 1746099
13724 1746099 1745220 1743628 1743996 1747021 1749758 1752794 1757455 1759378 1758368 1761910 1764944 1769042 1769105 1773451 1777302
13709 1777302 1778529 1779946 1782315 1782153 1785755 1787299 1789242 1789995 1787396 1792004 1793890 1795224 1795845 1799162 1797072
13694 1797072 1797716 1801785 1805421 1806065 1807424 1810470 1811976 1814652 1814902 1815142 1819468 1820192 1819515 1822553 1822700 1824790
13678 1824790 1825702 1825049 1827924 1828873 1827798 1830502 1833751 1835854 1838165 1836761 1836612 1838069 1842618 1843247 1844102
13663 1844102 1849047 1852914 1852099 1853032 1854310 1857845 1860555 1862007 1864712 1867665 1869804 1874495 1876834 1877121 1878025
13648 1878025 1878492 1878846 1881923 1882852 1882779 1882543 1887436 1891796 1892892 1894961 1896520 1896782 1899542 1904386 1906537 1906216
13632 1906216 1908014 1910701 1912811 1913485 1914395 1918663 1921022 1925384 1925664 1924636 1925259 1926405 1928968 1930609 1936109
13617A936109M426J975L850j467j241J547M373M057M275M577K621k489n41M461
13603A966533K812K091J336K272K877L177K308J754M715l50J950J276Q87K143
13589A995781L116O20K214L604K862o79k326n25N185M995M088j79M699K841J496
13574B027792K616N310N67k47K498L899j84J858J903K17L293N413K252J537K262
13559B060986L895J276L344J954o7L07L690r8O73M596l49L809L574M035L050Q54
13543B095529j380K176L972J072K805L501L309L538K871J655K644j360J432J876
13529B123640j007n6p65K510K305L042J559M422O933K412L062K835N53L43N187
13514B156975P06K471L336K805O615N055K819L052J780L213L318L571J887N295
$$ plain form
13617 1936109 1940535 1942510 1946360 1944893 1943652 1945199 1949572 1953629 1957904 1962481 1965102 1962613 1962072 1966533
13603 1966533 1969345 1971436 1972772 1975044 1977921 1981098 1983406 1985160 1989875 1989525 1991475 1992751 1993638 1995781
13589 1995781 1998897 1999517 2001731 2005335 2008197 2007518 2005192 2004667 2009852 2014847 2018935 2018756 2023455 2026296 2027792
13574 2027792 2030408 2035718 2036285 2036038 2038536 2042435 2042251 2044109 2046012 2046229 2049522 2054935 2057187 2058724 2060986
13559 2060986 2064881 2066157 2069501 2071455 2071388 2071695 2075385 2075287 2075960 2080556 2080207 2084016 2087590 2091625 2094675 2095529
13543 2095529 2094149 2096325 2100297 2101369 2104174 2107675 2110984 2114522 2117393 2119048 2121692 2120332 2121764 2123640
13529 2123640 2122633 2122577 2121812 2124322 2126627 2129669 2131228 2135650 2142583 2144995 2148057 2150892 2151445 2151788 2156975
13514 2156975 2157681 2160152 2163488 2166293 2172908 2177963 2180782 2183834 2185614 2188827 2192145 2195716 2197603 2202898
13500B202898L958J144j884l36L269M430L117Q81k52K005N132M793J641J19L030
13485B233945M451N381J85q07L544M996O031J424J91K038L926J398K899O374K119
13470B278095p3O68K562K076M177L692J624M410K268j161K166J155L350L042J522
13455B309573K576M978J194K805M469L034K201M412k6j664M126Q477J0285J338
13441B357778l008J365M941O421M234M20L173J325J635K519K350M278r46J896
13427B388381N403O551J468J365M450M864L482J572K022O245L029J850J623J165
13413B433470L300O635M158M081K153M678M910P85N58N72K777K970M867L898J415
13398B481227M345L897J041P1P32K492J811N307K302K361N256N956L436K567k97
$$ plain form
13500 2202898 2206856 2208000 2206116 2205780 2209049 2213479 2216596 2217477 2217225 2219230 2224362 2229155 2230796 2230915 2233945
13485 2233945 2238396 2243777 2243962 2243155 2246699 2251695 2257726 2259150 2259341 2261379 2265305 2266703 2269602 2275976 2278095
13470 2278095 2278022 2278690 2281252 2283328 2287505 2291197 2292821 2297231 2299499 2298338 2300504 2301659 2305009 2308051 2309573
13455 2309573 2312149 2317127 2318321 2321126 2325595 2328629 2330830 2335242 2335216 2333552 2337678 2346155 2356440 2357778
13441 2357778 2354770 2356135 2361076 2367497 2371731 2372151 2375324 2376649 2378284 2380803 2383153 2387431 2386485 2388381
13427 2388381 2393784 2400335 2401803 2403168 2407618 2412482 2415964 2417536 2419558 2425803 2428832 2430682 2432305 2433470
13413 2433470 2436770 2443405 2447563 2451644 2453797 2458475 2463385 2464170 2464728 2465300 2468077 2471047 2475914 2479812 2481227
13398 2481227 2485572 2489469 2490510 2490581 2491313 2493805 2495616 2500923 2503225 2505586 2510842 2516798 2520234 2522801 2522504
13383B522504M202M679l8K032P515R418M863lj097K479M584M548K174p13K219
13368B569366N760L838J769L443M529N702O569K834N97J296L579K526L459M254
13354B619521M046M986O628L891J943K773K62L486L373M932N696J441J811N426
13340B670215O929O131M470L164L811K787K985L247L829M709M14J475O869K363
13326B723398L229M536K967K711K347J236M344M661N717N055N431M793J564R66
13312B772955O247K353N700O916L286N202r42L374Q266K545K868P207L931L251
13298B833159N595O248N67l54J792M501N526K172N479N987N172N113J539N554
13284B888050M305L44L858L906M332Q749L488N653K767L217O140K045J627P916
$$ plain form
13383 2522504 2526706 2531385 2531347 2533379 2540894 2550312 2555175 2555172 2554075 2556554 2561138 2565686 2567860 2567147 2569366
13368 2569366 2575126 2578964 2580733 2584176 2588705 2594407 2600976 2603810 2604407 2605703 2609282 2611808 2615267 2619521
13354 2619521 2623567 2628553 2635181 2639072 2641015 2643788 2644050 2647536 2650909 2655841 2661537 2662978 2664789 2670215
13340 2670215 2677144 2683275 2687745 2690909 2694720 2697507 2700492 2703739 2707568 2712277 2712691 2714166 2721035 2723398
13326 2723398 2726627 2731163 2734130 2736841 2739188 2740424 2744768 2749429 2755146 2760201 2765632 2770425 2771989 2772955
13312 2772955 2779202 2781555 2787255 2794171 2797457 2802659 2801717 2805091 2813357 2815902 2818770 2825977 2829908 2833159
13298 2833159 2838754 2845002 2845569 2845215 2847007 2851508 2857034 2859206 2864685 2870672 2875844 2880957 2882496 2888050
13284 2888050 2892355 2892699 2896557 2900463 2904795 2913544 2917032 2922685 2925452 2928669 2934809 2936854 2938481 2946397
13270B946397J1549O554jJ833O850P108L461K714J797J730L425N920N415M443
13256C009195N446P975P677L745K751J968L022O248O385P124N099L845J438M485
13242C076403Q912K868N760N510O513M590J716M584M011P464K195K68M060P083
13228C141937M339L276M178M096M627P862O777P392N076K437M745M007L599N383
13214C209731K864N468K210N684P199P248O459O379M161O622O921Q358O794K629
13200C288727M618K918M996O346P598N696Q676O544K676N856P582N606P966M526
13186C370331L057N724L140p06O171N637O422R603J0787P126N702P477L388M305
13172C448164N344L981O687Q260N930K016O787O010M358J0007O408N432J0022
$$ plain form
13270 2946397 2957946 2964500 2964499 2966332 2973182 2980290 2983751 2986465 2988262 2989992 2993417 2999337 3004752 3009195
13256 3009195 3014641 3022616 3030293 3034038 3036789 3038757 3041779 3048027 3054412 3061536 3066635 3070480 3071918 3076403
13242 3076403 3085315 3088183 3093943 3099453 3105966 3110556 3112272 3116856 3120867 3128331 3130526 3130794 3134854 3141937
13228 3141937 3146276 3149552 3153730 3157826 3162453 3170315 3177092 3184484 3189560 3191997 3196742 3200749 3204348 3209731
13214 3209731 3212595 3218063 3220273 3225957 3233156 3240404 3246863 3253242 3257403 3264025 3270946 3279304 3286098 3288727
13200 3288727 3293345 3296263 3301259 3307605 3315203 3320899 3329575 3336119 3338795 3344651 3352233 3357839 3365805 3370331
13186 3370331 3373388 3379112 3382252 3381546 3387717 3393354 3399776 3409379 3420166 3427292 3432994 3440471 3443859 3448164
13172 3448164 3453508 3457489 3464176 3472436 3478366 3480382 3487169 3493179 3497537 3507544 3513952 3519384 3529406
13159C529406P382J0870Q447L649O407O340P580P046J319N520N248O301O845O447
13145C618807O058R230P577N520N867P377M728P127N444N595O232R017Q249J0163
13131C716991Q907P073R184N683L938Q958Q649M901Q149J1732Q299P980M720K648
13117C817812R028R342N455P735P290J0770N839O823O577O127P248P975J0882
13104C918903R950P781P997Q866N888N610O076J2098J1864R341J0483J1816J1350
13091D038023Q599O602L779Q790J0562R162J0949J0678R399O780Q802J0475P138
13078D149738O357Q501O380Q348J0733J1458J2940J4186J3208J3291J0570Q991
13066D274701J0148Q559J0358J2540J3282J4208J1342J3256J3182J1511J5575
$$ plain form
13159 3529406 3536788 3547658 3556105 3559754 3566161 3572501 3580081 3587127 3588446 3593966 3599214 3605515 3612360 3618807
13145 3618807 3624865 3634095 3641672 3647192 3653059 3660436 3665164 3672291 3677735 3683330 3689562 3698579 3706828 3716991
13131 3716991 3725898 3732971 3742155 3747838 3751776 3760734 3769383 3774284 3782433 3794165 3802464 3810444 3815164 3817812
13117 3817812 3826840 3836182 3841637 3849372 3856662 3867432 3873271 3880094 3886671 3892798 3900046 3908021 3918903
13104 3918903 3928853 3936634 3944631 3953497 3959385 3964995 3971071 3983169 3995033 4004374 4014857 4026673 4038023
13091 4038023 4046622 4053224 4057003 4065793 4076355 4085517 4096466 4107144 4116543 4123323 4132125 4142600 4149738
13078 4149738 4156095 4164596 4170976 4179324 4190057 4201515 4214455 4228641 4241849 4255140 4265710 4274701
13066 4274701 4284849 4293408 4303766 4316306 4329588 4343796 4355138 4368394 4381576 4393087 4408662
13055D408662J5176J3219J7259J8738J7308J3443J1577J5450J4759J4047R169
13044D568807J2361J2462O676O505J6280K0622K8172L4936L9102L6599L3057K5000
13032D840579K2771K4871K7591L8941M4871N1100O2245P2252Q1434R1295J04562
13021E462512J24530J55270J81912J68358L7056k38192n52267p19750o74272m26118
13011C519039r4845J30922J98421J80643J44021J21351J05429R6581R0277R5086
13001D586925R7425R1939J01970J11721J13145R1268L9704l3335j23593k13858
12991D863311k70993k75931k21872j34822m3833L1717P9918J02870R2728P2320
12981D295413N7602N7006N1441M2400L7665M2501L8902L2746K9823K5931K1057
$$ plain form
13055 4408662 4423838 4437057 4454316 4473054 4490362 4503805 4515382 4530832 4545591 4559638 4568807
13044 4568807 4581168 4593630 4600306 4606811 4623091 4643713 4671885 4706821 4745923 4782522 4815579 4840579
13032 4840579 4863350 4888221 4915812 4954753 4999624 5050724 5112969 5185221 5266655 5357950 5462512
13021 5462512 5587042 5742312 5924224 6092582 6129638 5891446 5339179 4619429 3945157 3519039
13011 3519039 3424194 3555116 3753537 3934180 4078201 4199552 4304981 4401562 4491839 4586925
13001 4586925 4684350 4776289 4878259 4989980 5103125 5194393 5234097 5200762 5077169 4863311
12991 4863311 4592318 4316387 4094515 3959693 3915860 3947577 4027495 4130365 4223093 4295413
12981 4295413 4353015 4410021 4461462 4503862 4541527 4584028 4622930 4655676 4685499 4711430 4732487
12970D732487K2090K5353K6608K6688K4824K4857K0550J9782K0166J9516J9059
12959D981980K0709J8638J8838J9995K1441K0264J2828J4063K0199K1554K0533
12948E191042J8086J8262J6607J6239J8090J5802J5464J9779J9549J9365J9975
12937E388260J8168J4617J3464R994J3886J9900J8949J9641J9756J6253J9171
12926E572059J7500J5273J7172J7744J8303J9507K0847J6588J6566J5873J4668
12915E762100K0072J9922J7970J8685J6586K1980K5238K1840J7706J7461J7266
12904E976826J6962J7511J8990K0660J6123K0854K2656J7140J5340J6763J8884
12893F178709K0260J8925J7067J2406R787P716J0632J8538K6548K9777L5848L9885
$$ plain form
12970 4732487 4754577 4779930 4806538 4833226 4858050 4882907 4903457 4923239 4943405 4962921 4981980
12959 4981980 5002689 5021327 5040165 5060160 5081601 5101865 5114693 5128756 5148955 5170509 5191042
12948 5191042 5209128 5227390 5243997 5260236 5278326 5294128 5309592 5329371 5348920 5368285 5388260
12937 5388260 5406428 5421045 5434509 5444503 5458389 5478289 5497238 5516879 5536635 5552888 5572059
12926 5572059 5589559 5604832 5622004 5639748 5658051 5677558 5698405 5714993 5731559 5747432 5762100
12915 5762100 5782172 5802094 5820064 5838749 5855335 5877315 5902553 5924393 5942099 5959560 5976826
12904 5976826 5993788 6011299 6030289 6050949 6067072 6087926 6110582 6127722 6143062 6159825 6178709
12893 6178709 6198969 6217894 6234961 6247367 6257154 6264870 6275502 6294040 6320588 6350365 6386213 6426098
12881F426098L2833K5388J9066J9166K0974J5977K1059K6066K9889L4574L4592
12870F705682L2661L1473K8186K6792K5121K3594K1762K3211J9790J6833J7247
12859F972352K1344K6449K9405K8283K9417K7576K6893K8048K9168K4543K2429
12848G265907L2956L5383L6236L4380L8678L5721L5091L7922L8565L6236M0828
12837G667903M5511M9204N1180M5895L8385K0876K007k3794l4234l2241j5120
12826G815572J3008K9256L7157M0928L6699L2187K4527J5307J2467J2445J7318
12815H086871K1992K7293L2272M1651M7447M6155M7667M7872M6831M2390L9107
12804H527548L9404M2163M0480M1751M0172M1707M8978M6215M1768L7181L1579
$$ plain form
12881 6426098 6458931 6484319 6503385 6522551 6543525 6559502 6580561 6606627 6636516 6671090 6705682
12870 6705682 6738343 6769816 6798002 6824794 6849915 6873509 6895271 6918482 6938272 6955105 6972352
12859 6972352 6993696 7020145 7049550 7077833 7107250 7134826 7161719 7189767 7218935 7243478 7265907
12848 7265907 7298863 7334246 7370482 7404862 7443540 7479261 7514352 7552274 7590839 7627075 7667903
12837 7667903 7713414 7762618 7813798 7859693 7898078 7918954 7920961 7897167 7862933 7830692 7815572
12826 7815572 7828580 7857836 7894993 7935921 7972620 8004807 8029334 8044641 8057108 8069553 8086871
12815 8086871 8108863 8136156 8168428 8210079 8257526 8303681 8351348 8399220 8446051 8488441 8527548
12804 8527548 8566952 8609115 8649595 8691346 8731518 8773225 8822203 8868418 8910186 8947367 8978946
12793H978946L5011L8870M0562M1730M3113M5728L8620L8087L8777M1551N0143
12782I431138N9521O1234N9581N1295M8078M3711M2023M4656N2354N7357O4667
12771A0015615O0822N3615N4225N1814M5433L8049L0418K7521L1453L6042M5695
12760A0490702O4253P3055P3639O7322N4141M8121M0709L7948M2915M3896N1592
12749A1088293O3273P1856P1594P4189P8458P5977P5576P1952O7053O8186O6781
12738A1873188O2917O1201O1581O1414O5189Q0296J01289J17637J20698J15971
12728A2721381R9634P7447N7242O0251P4886Q7596J02345J08254J10857J07769
12718A3607662R7540R3937R6208R7848R6593J03696J12841J13551J14228J20444
$$ plain form
12793 8978946 9013957 9052827 9093389 9135119 9178232 9223960 9262580 9300667 9339444 9380995 9431138
12782 9431138 9490659 9551893 9611474 9662769 9710847 9754558 9796581 9841237 9893591 9950948 10015615
12771 10015615 10076437 10130052 10184277 10236091 10281524 10319573 10349991 10377512 10408965 10445007 10490702
12760 10490702 10554955 10628010 10701649 10768971 10823112 10871233 10911942 10949890 10992805 11036701 11088293
12749 11088293 11151566 11223422 11295016 11369205 11447663 11523640 11599216 11671168 11738221 11806407 11873188
12738 11873188 11936105 11997306 12058887 12120301 12185490 12265786 12367075 12484712 12605410 12721381
12728 12721381 12821015 12898462 12955704 13015955 13090841 13178437 13280782 13389036 13499893 13607662
12718 13607662 13705202 13799139 13895347 13993195 14089788 14193484 14306325 14419876 14534104 14654548
12708A4654548J25609J26943J27230J06658O9741M0568L4777M5865P1425J08059
12698A5511423J36077J51289J47735J35740J34069J29350J24794J23708J25527
12689A6719712J31897J38195J46215J51951J65062J68094J72450J78020J81986
12680A8153582J71909J68870J71648J76427J87887J96413K01752K03054K04623
12671A9836165K02218K03078K09778K15106K27965K29213K34027K32099K28476
12662B1818125K25004K31103K45162K56789K70965K82152K88860K93933K97542
12653B4209635K99355L02118L05622L09561L13382L23408L34270L45671L56972
12644B7099994L73987L96236M18181M38859M50900M60007M67718M70204M74743
$$ plain form
12708 14654548 14780157 14907100 15034330 15140988 15210729 15251297 15286074 15331939 15403364 15511423
12698 15511423 15647500 15798789 15946524 16082264 16216333 16345683 16470477 16594185 16719712
12689 16719712 16851609 16989804 17136019 17287970 17453032 17621126 17793576 17971596 18153582
12680 18153582 18325491 18494361 18666009 18842436 19030323 19226736 19428488 19631542 19836165
12671 19836165 20038383 20241461 20451239 20666345 20894310 21123523 21357550 21589649 21818125
12662 21818125 22043129 22274232 22519394 22776183 23047148 23329300 23618160 23912093 24209635
12653 24209635 24508990 24811108 25116730 25426291 25739673 26063081 26397351 26743022 27099994
12644 27099994 27473981 27870217 28288398 28727257 29178157 29638164 30105882 30576086 31050829
12635C1050829M88143N05845N18626N35848N59572N77692O00591O23551O52444
12626C6113141O89309P20948P44870P67461P82860Q02879Q34995Q69913R17697
12617D3244073R65739J023783J087393J140878J197499J252939J311425J377623
12609E2601352J458547J554466J665754J778903J891601K017881K165284K332089
12601F7465877K529433K752907K991684L249312L520665L822295M150337M495233
12593I4977743M897282N438061O162939P090931Q232294R536199J0976733J2629245
12585A59941427J4753724J7751910K1786199K6288255K8522647K1257213n912577
12578B84388798n0209873r0376142j04725131r6388809o6597160j8690788K5175482
$$ plain form
12635 31050829 31538972 32044817 32563443 33099291 33658863 34236555 34837146 35460697 36113141
12626 36113141 36802450 37523398 38268268 39035729 39818589 40621468 41456463 42326376 43244073
12617 43244073 44209812 45233595 46320988 47461866 48659365 49912304 51223729 52601352
12609 52601352 54059899 55614365 57280119 59059022 60950623 62968504 65133788 67465877
12601 67465877 69995310 72748217 75739901 78989213 82509878 86332173 90482510 94977743
12593 94977743 99875025 105313086 111476025 118566956 126799250 136335449 147312182 159941427
12585 159941427 174695151 192447061 214233260 240521515 269044162 290301375 284388798
12578 284388798 234178925 143802783 39077652 -57311157 -123908317 -142599105 -117423623
12571a17423623M2064780L5139442J7049148k681816j9850476l3754865l9893593
12564a19351003l7192666k8416318j6135218k961986Q385869J4655752J5704477
12557a65311093J4039534J1853808R997933Q569920P469172O572673N805998N129640
12549i5872415M517788L993138L593549L304419L083618K910157K753163K591043
12541f9125540K415483K247046K089273J944728J824572J727931J640895J564379
12533e3671233J483403J407214J328565J249851J181702J123643J064735J013318
12525d3818802R79184R51530R10671Q60162Q09859P84447P66144P41627P10370
12516c6304808O74778O37053O04223N86819N67033N47586N25878N14870N09079
$$ plain form
12571 -117423623 -75358843 -40219401 -23170253 -25852069 -45702545 -79457410 -119351003
12564 -119351003 -156543669 -184959987 -201095205 -204057191 -195671322 -181015570 -165311093
12557 -165311093 -151271559 -139417751 -129419818 -120849898 -113380726 -106808053 -101002055 -95872415
12549 -95872415 -91354627 -87361489 -83767940 -80463521 -77379903 -74469746 -71716583 -69125540
12541 -69125540 -66710057 -64463011 -62373738 -60429010 -58604438 -56876507 -55235612 -53671233
12533 -53671233 -52187830 -50780616 -49452051 -48202200 -47020498 -45896855 -44832120 -43818802
12525 -43818802 -42839618 -41888088 -40977417 -40117255 -39307396 -38522949 -37756805 -37015178 -36304808
12516 -36304808 -35630030 -34992977 -34388754 -33801935 -33234902 -32687316 -32161438 -31646568 -31137489
12507c1137489N06339N04870M89631M68119M35560L96394L74497L71533L74727
12498b7215819L68682L64727L58382L45881L43351L43256L43269L33841L28719
12489b4085711L15831L04208K87769K74888K62185K62074K62575K59156K53767
12480b1603258K46071K35507K26294K22934K20743K17489K12143K10308K09871
12471a9601898K05963K00504J98946J84763J71713J63582J54139J51431J53548
12462a8017309J54061J55847J59076J60027J59099J60970J62964J59767J53800
12453a6591698J57142J59834J54542J22499R9022Q9260P9995Q2067J04268J30318
12443a5412751J37521J39224J31855J19561J07962J04117J03051J03718J08257
$$ plain form
12507 -31137489 -30631150 -30126280 -29636649 -29168530 -28732970 -28336576 -27962079 -27590546 -27215819
12498 -27215819 -26847137 -26482410 -26124028 -25778147 -25434796 -25091540 -24748271 -24414430 -24085711
12489 -24085711 -23769880 -23465672 -23177903 -22903015 -22640830 -22378756 -22116181 -21857025 -21603258
12480 -21603258 -21357187 -21121680 -20895386 -20672452 -20451709 -20234220 -20022077 -19811769 -19601898
12471 -19601898 -19395935 -19195431 -18996485 -18811722 -18640009 -18476427 -18322288 -18170857 -18017309
12462 -18017309 -17863248 -17707401 -17548325 -17388298 -17229199 -17068229 -16905265 -16745498 -16591698
12453 -16591698 -16434556 -16274722 -16120180 -15997681 -15898659 -15809399 -15729404 -15647337 -15543069 -15412751
12443 -15412751 -15275230 -15136006 -15004151 -14884590 -14776628 -14672511 -14569460 -14465742 -14357485
12434a4357485J14578J16529J14909J04759R7518Q8149Q2726R9958J20868J19025
12424a3298466R7474P2970N8958N5711O1416Q0463J05146J16405J12193R3037
12414a2444693Q2465P4969O2177M5310M3292M9646N9912O6203P6405Q9108R0637
12403a1704569Q1669O2585N3017N6269N9395N5274N3046N0571M7704M8271N3804
12392a1082964O2330P1772Q3993R2166R7253R0855Q1459O4094N8857N7531N7388
12381a0265266N3702N2690N3049N8880O3927O9320O7123O0537M8845M1706L6918
12370i658569L6122L9986M7618N3938N7827N4805M5990M3990M3492L8234M0812
12359i155755M5185M8270M6364M6735M7696M0313L7894M2536M4138M1039M2526
$$ plain form
12434 -14357485 -14242907 -14126378 -14011469 -13906710 -13809192 -13721043 -13638317 -13538359 -13417491 -13298466
12424 -13298466 -13200992 -13128022 -13069064 -13013353 -12951937 -12871474 -12766328 -12649923 -12537730 -12444693
12414 -12444693 -12362228 -12287259 -12225082 -12179772 -12136480 -12086834 -12026922 -11960719 -11884314 -11795206 -11704569
12403 -11704569 -11622900 -11560315 -11507298 -11451029 -11391634 -11336360 -11283314 -11232743 -11185039 -11136768 -11082964
12392 -11082964 -11020634 -10948862 -10864869 -10772703 -10675450 -10584595 -10503136 -10439042 -10380185 -10322654 -10265266
12381 -10265266 -10211564 -10158874 -10105825 -10046945 -9983018 -9913698 -9846575 -9786038 -9737193 -9695487 -9658569
12370 -9658569 -9622447 -9582461 -9534843 -9480905 -9423078 -9368273 -9322283 -9278293 -9234801 -9196567 -9155755
12359 -9155755 -9110570 -9062300 -9015936 -8969201 -8921505 -8881192 -8843298 -8800762 -8756624 -8715585 -8673059
12348h673059M6496M8628M9106M6028L8583L5013L9145L7762M1278M3729M2664
12337h204627M1358M0310L7550L4333L4617L5547L9382M1768M2450M0944L9834
12326g776534L0258K3086J5170R164J5994K2560K9998L3387L8354M0763L8579
12315g479221L1662K5475K3628K5452K3444J5659J0589K0020K1039K5029K8196
12304g229028K9159K6771K8520L1608K9514K9369K8633K8117K5562K2650K6532
12293f922593L0834L6475L6395L0107L0259K9802K5436K4368K4004K8992K7879
12282f598042K2988K0546K5315K5112K6589K7069K7199L0553K4774K0329J7797
12271f329771J3492J0206J0069J2937J2745K0725K8009K7269K6662L1898L0512
$$ plain form
12348 -8673059 -8626563 -8577935 -8528829 -8482801 -8444218 -8409205 -8370060 -8332298 -8291020 -8247291 -8204627
12337 -8204627 -8163269 -8122959 -8085409 -8051076 -8016459 -7980912 -7941530 -7899762 -7857312 -7816368 -7776534
12326 -7776534 -7746276 -7723190 -7708020 -7698856 -7682862 -7660302 -7630304 -7596917 -7558563 -7517800 -7479221
12315 -7479221 -7447559 -7422084 -7398456 -7373004 -7349560 -7333901 -7323312 -7303292 -7282253 -7257224 -7229028
12304 -7229028 -7199869 -7173098 -7144578 -7112970 -7083456 -7054087 -7025454 -6997337 -6971775 -6949125 -6922593
12293 -6922593 -6891759 -6855284 -6818889 -6788782 -6758523 -6728721 -6703285 -6678917 -6654913 -6625921 -6598042
12282 -6598042 -6575054 -6554508 -6529193 -6504081 -6477492 -6450423 -6423224 -6392671 -6367897 -6347568 -6329771
12271 -6329771 -6316279 -6306073 -6296004 -6283067 -6270322 -6249597 -6221588 -6194319 -6167657 -6135759 -6105247
12260f105247K1034J7341J6810K1036K5576L0597L0909L3441L9437L4330K6882
12249e807854J4020q864j7874o728J4036K8114K4464K5547K9013K5486K4240K4168
12237e632232K1262K3782K1495K1258J5173J4615J8369K2467J8066J6003K0125
12226e419617J7525J3501J5111J7951J9679K4308K5177K7931K9294L2739L2864
12215e163537K9966L5440K5747m476m2546o0699n1520k2998Q602K9280L3832L3935
12203e148974K2881K5259K6659K5316K3684J8812J6865J0067R345J5919J8449
12192d935718K0012K4452K2921J6332J6815J3360J1377J7211J7953K5222K7918
12181d722145K2455K2499K4214K0622K6469K7942J3823K650j3162j5582K016J7749
$$ plain form
12260 -6105247 -6084213 -6066872 -6050062 -6029026 -6003450 -5972853 -5941944 -5908503 -5869066 -5834736 -5807854
12249 -5807854 -5793834 -5802698 -5820572 -5827300 -5813264 -5785150 -5760686 -5735139 -5706126 -5680640 -5656400 -5632232
12237 -5632232 -5610970 -5587188 -5565693 -5544435 -5529262 -5514647 -5496278 -5473811 -5455745 -5439742 -5419617
12226 -5419617 -5402092 -5388591 -5373480 -5355529 -5335850 -5311542 -5286365 -5258434 -5229140 -5196401 -5163537
12215 -5163537 -5133571 -5098131 -5072384 -5076860 -5119406 -5180105 -5231625 -5254623 -5246021 -5216741 -5182909 -5148974
12203 -5148974 -5126093 -5100834 -5074175 -5048859 -5025175 -5006363 -4989498 -4979431 -4970086 -4954167 -4935718
12192 -4935718 -4915706 -4891254 -4868333 -4852001 -4835186 -4821826 -4810449 -4793238 -4775285 -4750063 -4722145
12181 -4722145 -4699690 -4677191 -4652977 -4632355 -4605886 -4577944 -4564121 -4561471 -4574633 -4590215 -4588199 -4570450
12169d570450K7005K8531K2047K4420K3756K7016K7841L2415L3667L3300L2303
12158d258149K8864K5166K8457L4075L6200L6992L6509L9785M3230M3912N0815
12147c854144N8784O5426P6217Q9808J02419J17621J39944J64948J79457J67139
12137b692381J32784O3186o3675k86627o02879q76643r35325p56140l91886j2019
12127f421605K08019K56078K20916J80974J44918J20222J05408R2055P8750O3540
12117d950725N0887L7237K6699K5507L2453M4697M9089M5673L8950L3631L1666
12106d534236K8417K3443J8177J8257K1844J9169K0460K2990K4828K0266K0526
12095d295859K1556J7615J5365J9384J7371J4879J4140J5362J5858J2946J6336
$$ plain form
12169 -4570450 -4543445 -4514914 -4492867 -4468447 -4444691 -4417675 -4389834 -4357419 -4323752 -4290452 -4258149
12158 -4258149 -4229285 -4204119 -4175662 -4141587 -4105387 -4068395 -4031886 -3992101 -3948871 -3904959 -3854144
12147 -3854144 -3795360 -3729934 -3653717 -3563909 -3461490 -3343869 -3203925 -3038977 -2859520 -2692381
12137 -2692381 -2559597 -2496411 -2560086 -2846713 -3449592 -4326235 -5261560 -6017700 -6409586 -6421605
12127 -6421605 -6213586 -5957508 -5736592 -5555618 -5410700 -5290478 -5185070 -5093015 -5014265 -4950725
12117 -4950725 -4899838 -4862601 -4835902 -4810395 -4777942 -4733245 -4684156 -4638483 -4599533 -4565902 -4534236
12106 -4534236 -4505819 -4482376 -4464199 -4445942 -4424098 -4404929 -4384469 -4361479 -4336651 -4316385 -4295859
12095 -4295859 -4274303 -4256688 -4241323 -4221939 -4204568 -4189689 -4175549 -4160187 -4144329 -4131383 -4115047
12084d115047J4725J1964J1716Q734J0285J2531J4668J8924J6591J3580R704R776
12072c961849J5794J3279J4668J3081J2382L011n437k909O422R643J2734J3595
12060c855586J2685J4369J2586R084R303J5478J2452P621P504J2075J4666J2281
12048c715482J3486Q281J808n862J862J0621J0983J1080Q961Q438N128O246J1070
12035c623380J1353P969M264L600Q063P040O139N266J0360J1350N757M221Q183
12022c529815J2913J1484J0313P439J1059J1811M050M248O278P562O981O001O902
12009c422774Q187R833J0327R495N766M115Q303P310N723P910Q826M279O709O198
11995c319793N794O191P193P161P361O780O409Q571Q280N216O345P157O741P501
$$ plain form
12084 -4115047 -4100322 -4088358 -4076642 -4067908 -4057623 -4045092 -4030424 -4011500 -3994909 -3981329 -3971625 -3961849
12072 -3961849 -3946055 -3932776 -3918108 -3905027 -3892645 -3889634 -3895071 -3897980 -3891558 -3881915 -3869181 -3855586
12060 -3855586 -3842901 -3828532 -3815946 -3806862 -3797559 -3782081 -3769629 -3762008 -3754504 -3742429 -3727763 -3715482
12048 -3715482 -3701996 -3693715 -3691907 -3697769 -3695907 -3685286 -3674303 -3663223 -3654262 -3645824 -3640696 -3634450 -3623380
12035 -3623380 -3612027 -3604058 -3599794 -3596194 -3588131 -3581091 -3574952 -3569686 -3559326 -3547976 -3542219 -3537998 -3529815
12022 -3529815 -3516902 -3505418 -3495105 -3487666 -3476607 -3464796 -3460746 -3456498 -3450220 -3442658 -3435677 -3429676 -3422774
12009 -3422774 -3414587 -3404754 -3394427 -3384932 -3379166 -3375051 -3366748 -3359438 -3353715 -3345805 -3336979 -3332700 -3325991 -3319793
11995 -3319793 -3313999 -3307808 -3300615 -3293454 -3286093 -3279313 -3272904 -3264333 -3256053 -3250837 -3244492 -3237335 -3230594 -3223093
11981c223093Q576Q878N417N374N747R396M217J717M472M770N679O704N985L817
11967c142344P809Q453Q301P914L661N656O812N792O254N039L165O998R084P193
11953c050213Q180J0251N567K069K089M018P226K246n13K927O958P345L812P035
11939b981003Q534P781P055J793J194R49P744Q669M189M880M296N113M839N982
11925b907985J1250M071M284P639O987O485N991L156L131L432O388P347N427Q415
11911b823982O123M600P957O695M054N192L262O087L244J482J185O478P193P869
11897b752561M835N880P044L257L795J044p60O639O120J133O512P511N809J401
11883b692341N826P808M678L111L106L422K441K673L510N806L663L671Q215N757
$$ plain form
11981 -3223093 -3214517 -3205639 -3200222 -3194848 -3189101 -3179705 -3175488 -3173771 -3169299 -3164529 -3158850 -3152146 -3146161 -3142344
11967 -3142344 -3134535 -3126082 -3117781 -3109867 -3106206 -3100550 -3093738 -3087946 -3081692 -3076653 -3073488 -3066490 -3057406 -3050213
11953 -3050213 -3042033 -3031782 -3026215 -3024146 -3022057 -3018039 -3010813 -3008567 -3009080 -3006153 -2999195 -2991850 -2988038 -2981003
11939 -2981003 -2972469 -2964688 -2957633 -2955840 -2954646 -2953697 -2945953 -2937284 -2933095 -2928215 -2923919 -2918806 -2913967 -2907985
11925 -2907985 -2896735 -2892664 -2888380 -2880741 -2873754 -2867269 -2861278 -2858122 -2854991 -2851559 -2845171 -2837824 -2832397 -2823982
11911 -2823982 -2817859 -2813259 -2805302 -2798607 -2794553 -2789361 -2786099 -2780012 -2776768 -2775286 -2774101 -2767623 -2760430 -2752561
11897 -2752561 -2747726 -2741846 -2734802 -2731545 -2727750 -2726706 -2727466 -2720827 -2714707 -2713574 -2707062 -2699551 -2693742 -2692341
11883 -2692341 -2686515 -2678707 -2674029 -2670918 -2667812 -2664390 -2661949 -2659276 -2655766 -2649960 -2646297 -2642626 -2634411 -2628654
11869b628654O775N318M027R70J559M027N125M367M202L738N704L254L687P699
11855b568202L556M708P335N876J995J881L616J855K939N941P586P574O108M358
11841b502874N702M098N637M900J854L492L854L429L861N621M329O941N748P929
11827b435479O148k627j3700o779J941N340P397Q307P070K372J052J710M891M304
11813b408053J008N707N279L490O452P372K038p09N185Q425O180N667R53K267
11799b348739K348M064L182L711L631M680P254O872J700L681L627J548K975O518
11785b292948M250O082M919K403N342M970M813N39o044o265m185L588P186P166
11771b258184M823J776N576R383L584L205J623P994N477J256K263L484N835Q688
$$ plain form
11869 -2628654 -2621879 -2616561 -2612534 -2611564 -2610005 -2605978 -2600853 -2596486 -2592284 -2588546 -2582842 -2579588 -2575901 -2568202
11855 -2568202 -2564646 -2559938 -2552603 -2546727 -2544732 -2542851 -2539235 -2537380 -2534441 -2528500 -2520914 -2513340 -2507232 -2502874
11841 -2502874 -2497172 -2493074 -2487437 -2482537 -2480683 -2477191 -2473337 -2469908 -2466047 -2460426 -2456097 -2449156 -2443408 -2435479
11827 -2435479 -2429331 -2431958 -2445658 -2452437 -2450496 -2445156 -2437759 -2429452 -2422382 -2420010 -2418958 -2417248 -2412357 -2408053
11813 -2408053 -2407045 -2401338 -2396059 -2392569 -2386117 -2378745 -2376707 -2377416 -2372231 -2363806 -2357626 -2351959 -2351006 -2348739
11799 -2348739 -2346391 -2342327 -2339145 -2335434 -2331803 -2327123 -2319869 -2312997 -2311297 -2307616 -2303989 -2302441 -2299466 -2292948
11785 -2292948 -2288698 -2282616 -2277697 -2275294 -2269952 -2264982 -2260169 -2259630 -2265674 -2271939 -2276124 -2272536 -2265350 -2258184
11771 -2258184 -2253361 -2251585 -2246009 -2236626 -2233042 -2229837 -2228214 -2220220 -2214743 -2213487 -2211224 -2207740 -2201905 -2193217
11757b193217q63q083j851K344P58K068M350O346M613K728P103J957N195M676
11743b161876N156N843L181J905n89K852M632O98L178O143L564J790J863K971
11729b118689L793L098M223N282M226P270N395K198Q09q94O751L767O22K75K852
11714b069022N106Q858P428O072L782L337k39o236j0084k134L821O126M763M554
11700b033868J266N102M429K951M527L937L833N343N548P24o75K712K633M004
11686a987534M717J230P17L999L930L174L513Q04O24N666L336K775N523K823J802
11671a942901L395m69K63K916M185J509K412K201J192K090M982K988N478K176
11657a907583n10P689K766J156J428J793M747N166J616J6J050J954M496N898Q13
$$ plain form
11757 -2193217 -2194080 -2202163 -2204014 -2201670 -2200912 -2198844 -2194494 -2188148 -2183535 -2180807 -2173704 -2171747 -2166552 -2161876
11743 -2161876 -2156720 -2150877 -2147696 -2145791 -2146380 -2143528 -2138896 -2138198 -2135020 -2128877 -2125313 -2123523 -2121660 -2118689
11729 -2118689 -2114896 -2111798 -2107575 -2102293 -2098067 -2090797 -2085402 -2083204 -2082395 -2083289 -2076538 -2072771 -2072149 -2071874 -2069022
11714 -2069022 -2063916 -2055058 -2047630 -2041558 -2037776 -2034439 -2034678 -2040914 -2050998 -2053132 -2049311 -2043185 -2038422 -2033868
11700 -2033868 -2032602 -2027500 -2023071 -2020120 -2015593 -2011656 -2007823 -2002480 -1996932 -1996208 -1996883 -1994171 -1991538 -1987534
11686 -1987534 -1982817 -1981587 -1980870 -1976871 -1972941 -1969767 -1966254 -1965450 -1964826 -1959160 -1955824 -1953049 -1947526 -1944703 -1942901
11671 -1942901 -1939506 -1939975 -1939712 -1936796 -1932611 -1931102 -1928690 -1926489 -1925297 -1923207 -1918225 -1915237 -1909759 -1907583
11657 -1907583 -1908093 -1900404 -1897638 -1896482 -1895054 -1893261 -1888514 -1883348 -1881732 -1881716 -1880666 -1878712 -1874216 -1868318 -1867505
11642a867505l474J285Q351L965J052K164J245o13K719N063O257n07J098J834
11628a837066L636q8L4K998M334L718j924K486L921K989Q73N081K709K378K163
11613a801758L131L533O999N841R62Q9J060K502M674K258J593K996J758M369M612
11598a755381K491j215j32K604M409N77K759J749K494J522o12J748O483N619K09
11583a724676K854J300k463M233N851o3K493P590M028P16j410L383L041q86J099
11568a692910j454j82O164N943L736M292L066N508N638J717j166L011q27p73L967
11553a654270L132Q52L553J36n43K880J147J742L331L852M808K254K043N55J948
11538a622580J317M874K628J758J891J145L007R26j18K836R37K714L750R41K29
$$ plain form
11642 -1867505 -1870979 -1869694 -1861343 -1857378 -1856326 -1854162 -1852917 -1853530 -1850811 -1845748 -1839491 -1839998 -1838900 -1837066
11628 -1837066 -1833430 -1833518 -1833484 -1830486 -1826152 -1822434 -1824358 -1821872 -1817951 -1814962 -1814089 -1809008 -1806299 -1803921 -1801758
11613 -1801758 -1798627 -1795094 -1788095 -1782254 -1781292 -1781203 -1780143 -1777641 -1772967 -1770709 -1769116 -1766120 -1764362 -1759993 -1755381
11598 -1755381 -1752890 -1754105 -1754237 -1751633 -1747224 -1746647 -1743888 -1742139 -1739645 -1738123 -1738735 -1736987 -1730504 -1724885 -1724676
11583 -1724676 -1721822 -1720522 -1722985 -1718752 -1712901 -1712964 -1710471 -1702881 -1698853 -1698137 -1699547 -1696164 -1693123 -1694009 -1692910
11568 -1692910 -1694364 -1694546 -1688382 -1682439 -1678703 -1674411 -1671345 -1665837 -1660199 -1658482 -1659648 -1656637 -1657464 -1658237 -1654270
11553 -1654270 -1651138 -1650286 -1646733 -1646597 -1647140 -1644260 -1643113 -1641371 -1638040 -1634188 -1629380 -1627126 -1625083 -1624528 -1622580
11538 -1622580 -1621263 -1616389 -1613761 -1612003 -1610112 -1608967 -1605960 -1605034 -1605152 -1602316 -1601379 -1598665 -1594915 -1593974 -1593745
11523a593745K660K333n19K411M489M166J750K711M69R73K082M071j743J151M887
11508a561854M800K4j257N535K739L319Q17J061L838M191M18P80J319J751j073
11493a533592J558O300M801J107K268r92J318J354L772L527P58K51L216L165k97
11478a501486J272N699L043K393L44Q98K276K438K5O66O67N227K541j665K912
11463a472750K190M119K612J193N92L524J816N57j007L100J768J778J940L955
11449a444613M510K293n25K087K178M080L287K869K766j828n542J391M024Q54
11435a422169K199N75J570M112k016J634N377L338j79J843K209L380O115L902
11421a388110J257J922J788j126k534K5N754O120L115j871K61N811J599J580M
$$ plain form
11523 -1593745 -1591085 -1588752 -1589271 -1586860 -1582371 -1578205 -1576455 -1573744 -1573275 -1572302 -1570220 -1566149 -1567892 -1566741 -1561854
11508 -1561854 -1557054 -1557030 -1558287 -1552752 -1550013 -1546694 -1545877 -1544816 -1540978 -1536787 -1536369 -1535589 -1534270 -1532519 -1533592
11493 -1533592 -1532034 -1525734 -1520933 -1519826 -1517558 -1518550 -1517232 -1515878 -1512106 -1508579 -1507821 -1507570 -1504354 -1501189 -1501486
11478 -1501486 -1500214 -1494515 -1491472 -1489079 -1488735 -1487837 -1485561 -1483123 -1483098 -1482432 -1481765 -1476538 -1473997 -1475662 -1472750
11463 -1472750 -1470560 -1466441 -1463829 -1462636 -1462044 -1458520 -1456704 -1456147 -1457154 -1454054 -1452286 -1450508 -1448568 -1444613
11449 -1444613 -1440103 -1437810 -1438335 -1436248 -1434070 -1429990 -1426703 -1423834 -1421068 -1422896 -1428438 -1427047 -1423023 -1422169
11435 -1422169 -1419970 -1419395 -1417825 -1413713 -1415729 -1414095 -1408718 -1405380 -1405559 -1403716 -1401507 -1398127 -1392012 -1388110
11421 -1388110 -1386853 -1384931 -1383143 -1384269 -1386803 -1386778 -1381024 -1374904 -1371789 -1373660 -1373399 -1367588 -1365989 -1364409 -1364405
11406a364405L948N262o88pJ976J932J448K653P87L27J616J32p41J558M022K702
11390a337478K438J221L347j36K878K937J222l65J6L757n48P07P936L655k62M3
11374a308632O16k07K085M478O721K783m222l429J642M555K0L795R52l703L186
11359a289360K423K146N370M937J061J166N35o57K168J078M440K936K161J709
11345a257887J425Q87P00J066L940n27k141K531M977J574L26k230J27L476N536
11330a236220L419k098k471K317K451L291N923O71j413L272N620M781K792J522
11316a206143K306p03j736m21J464J156j922J713K928N58L443q50q54P30j085
11301a199416N10n98Q65L744P72K886L444L999M549J053K72r14J085L693N649
$$ plain form
11406 -1364405 -1360457 -1355195 -1355883 -1355890 -1353914 -1351982 -1350534 -1347881 -1347094 -1346767 -1345151 -1345019 -1345760 -1344202 -1340180 -1337478
11390 -1337478 -1335040 -1333819 -1330472 -1330608 -1327730 -1324793 -1323571 -1323936 -1323920 -1320163 -1320711 -1320004 -1312068 -1308413 -1308675 -1308632
11374 -1308632 -1308016 -1308223 -1306138 -1301660 -1294939 -1292156 -1296378 -1299807 -1298165 -1293610 -1293590 -1289795 -1288843 -1292546 -1289360
11359 -1289360 -1286937 -1284791 -1279421 -1274484 -1273423 -1272257 -1271722 -1272379 -1270211 -1269133 -1264693 -1261757 -1259596 -1257887
11345 -1257887 -1256462 -1255575 -1254875 -1253809 -1249869 -1250396 -1252537 -1250006 -1245029 -1243455 -1243129 -1245359 -1245232 -1241756 -1236220
11330 -1236220 -1232801 -1234899 -1237370 -1235053 -1232602 -1229311 -1223388 -1222717 -1224130 -1220858 -1215238 -1210457 -1207665 -1206143
11316 -1206143 -1203837 -1204540 -1206276 -1206697 -1205233 -1204077 -1205999 -1204286 -1201358 -1200800 -1197357 -1198207 -1199061 -1198331 -1199416
11301 -1199416 -1198906 -1199504 -1198639 -1194895 -1194123 -1191237 -1187793 -1183794 -1179245 -1178192 -1177920 -1178834 -1177749 -1174056 -1168407
11286a168407L350o54L45J240k69J453K787L504N209J239N54J73M043L76Q22m38
11270a144673J335J719J514J564N126J547j31J463J807L941M052M138k221j673
11256a120492J649m74M023J618K112Q80K517P05k06p01k990j039J201j630j628
11241a114455L722L733P847M728J291j080M077K906L31p86q97Q33K634M968K479
11226a077669K738m345R6M939J779R28R32K067J841J354J233K183j509L44L37
11211a062752j534J929K176N285L155L763N285k52K91K817J488k512N49M335K357
11196a033620m8J587L971M397Q32k372m130l53J231l116j100K664K978K481Q65
11181a023733N342K764n59J911J200M23J411l04K921J084J836K515M422M706K472
$$ plain form
11286 -1168407 -1165057 -1165711 -1165366 -1164126 -1164395 -1162942 -1160155 -1156651 -1151442 -1150203 -1149649 -1149476 -1145433 -1145057 -1144235 -1144673
11270 -1144673 -1143338 -1141619 -1140105 -1138541 -1133415 -1131868 -1131999 -1130536 -1128729 -1124788 -1120736 -1116598 -1118819 -1120492
11256 -1120492 -1118843 -1119317 -1115294 -1113676 -1111564 -1110684 -1108167 -1107462 -1107668 -1108369 -1111359 -1112398 -1111197 -1112827 -1114455
11241 -1114455 -1110733 -1107000 -1099153 -1094425 -1093134 -1094214 -1090137 -1087231 -1086900 -1087686 -1088583 -1087750 -1085116 -1080148 -1077669
11226 -1077669 -1074931 -1079276 -1079180 -1074241 -1072462 -1071534 -1070602 -1068535 -1066694 -1065340 -1064107 -1061924 -1063433 -1063089 -1062752
11211 -1062752 -1064286 -1062357 -1060181 -1054896 -1051741 -1047978 -1042693 -1042945 -1042654 -1039837 -1038349 -1040861 -1040312 -1035977 -1033620
11196 -1033620 -1033668 -1032081 -1028110 -1023713 -1022881 -1025253 -1029383 -1029736 -1028505 -1031621 -1032721 -1030057 -1027079 -1024598 -1023733
11181 -1023733 -1018391 -1015627 -1016186 -1014275 -1013075 -1012652 -1011241 -1011545 -1008624 -1007540 -1005704 -1003189 -998767 -994061 -991589
11166i91589j15L66k57L25K589J499L2M433K487J618m88N46L880O286O138q40
11150i63090k518j12n146l419q19Q77O10N796J531L138R31l395P34M484J338k005
11134i61065l05K614L759J120N96J188J049M002L389J290M86K351l20M11o28Q1
11118i39982k318K994M559O51K049N250K153R57K610N115L345J788j795j053r29
11103i14606J994M90j239K789L894j609j487L214K925J73O357O486J120j639l818
11088h94956P20L344L234l44J39J480L59l365K297N451L484k02J302L197L107
11073h70753k548J64j146K231J381k038J513J754N915J841J064J831k522j373
11059h62686J234M650L413J530J74j633k209J418J901K397L892K984J424L263
$$ plain form
11166 -991589 -991704 -991338 -991595 -991270 -988681 -987182 -987150 -982717 -980230 -978612 -979100 -978554 -974674 -968388 -962250 -963090
11150 -963090 -965608 -965720 -970866 -974285 -975104 -974227 -973617 -967821 -966290 -963152 -962221 -965616 -964882 -960398 -959060 -961065
11134 -961065 -961370 -958756 -954997 -953877 -953281 -952093 -951044 -947042 -943653 -942363 -941877 -939526 -939846 -939435 -940063 -939982
11118 -939982 -942300 -939306 -934747 -934096 -932047 -926797 -924644 -923687 -921077 -915962 -912617 -910829 -912624 -913677 -914606
11103 -914606 -912612 -912122 -913361 -910572 -906678 -908287 -909774 -906560 -903635 -903462 -897105 -890619 -889499 -891138 -894956
11088 -894956 -894236 -890892 -887658 -888002 -887863 -886383 -886024 -889389 -887092 -881641 -878157 -878359 -877057 -873860 -870753
11073 -870753 -873301 -873137 -874283 -872052 -870671 -872709 -871196 -869442 -863527 -861686 -860622 -858791 -861313 -862686
11059 -862686 -861452 -856802 -853389 -851859 -851685 -853318 -855527 -854109 -852208 -849811 -845919 -842935 -841511 -838248
11045h38248l154kL815M544L330M285J14k929k697k40p83O132N287L523L339q43
11029h14527n592k163m274n20L729N118M201K285n28j25J806j199K546J039k287
11014h10491L092L607L686j57J49J612M1O7M2L563Q58M148K097k52o24K396M264
10997g81902J432k9J721K36L727K123J001j037n76P51L108J569O37k58L181M327
10981g59989L43K209K369K228j918j444J247J145K439J540L561p26k392M007L814
10966g41567l92K091K035J840M259J112q47J244M621j203j022R36j778n46K666
10951g26551O168%k196j338J665O83J341O90K996N970M585P2l284J017k80q03
10935g09265J577N582Q215M73m342J230p95K42L389k84k080L84l46j198M252M478
$$ plain form
11045 -838248 -841402 -841404 -837589 -833045 -829715 -825430 -825316 -828245 -830942 -831182 -831965 -825833 -820546 -817023 -813684 -814527
11029 -814527 -820119 -822282 -826556 -827076 -823347 -818229 -814028 -811743 -812271 -812396 -810590 -811789 -809243 -808204 -810491
11014 -810491 -807399 -803792 -800106 -800263 -800114 -798502 -798461 -798394 -798352 -794789 -793931 -789783 -787686 -787938 -788562 -786166 -781902
10997 -781902 -780470 -780499 -778778 -778542 -774815 -772692 -771691 -772728 -773304 -772553 -769445 -767876 -767239 -767497 -764316 -759989
10981 -759989 -759646 -757437 -755068 -752840 -754758 -756202 -754955 -753810 -751371 -749831 -746270 -746996 -749388 -745381 -741567
10966 -741567 -741959 -739868 -737833 -735993 -731734 -730622 -731469 -730225 -725604 -726807 -727829 -726893 -728671 -729217 -726551
10951 -726551 -720383 -720383 -722579 -723917 -722252 -721569 -720228 -719538 -716542 -710572 -705987 -705915 -709199 -708182 -708462 -709265
10935 -709265 -707688 -702106 -693891 -693418 -697760 -696530 -697325 -697083 -693694 -693978 -696058 -695674 -696020 -697218 -692966 -688488
10919f88488J146r52m97K382l1L242L747M334L623O04J412j104j112N189K550
10904f63955l09O567r1k592j48r45J562m15J110O943N46n99M588K140Q44k885
10888f47639j811K128M833j575LN931M801K040M264L345Q100P848n475j3845j8813
10873f45865j1922l465l18N041K964M318M811K464J535M020J333R39O07K878K949
10858f27711M794M379K213O18K316M28J749M134j461J042P65o36r26j840J292
10843f08844L888K698o55n25L456K016J795j322M215P92K683N87M086K417K61
10828e82452Q4j362J853J049j841J099J2p49Q2J367p04J421K709L433L760K904
10812e67335L183j325J660K295O21R18J374k008n80J63J999K334K947J209M37
$$ plain form
10919 -688488 -687342 -688294 -688791 -686409 -686440 -683198 -679451 -675117 -671494 -670890 -669478 -670582 -671694 -666505 -663955
10904 -663955 -664264 -657697 -657788 -660380 -660528 -661473 -659911 -660326 -659216 -652273 -651727 -652326 -647738 -645598 -644754 -647639
10888 -647639 -649450 -647322 -642489 -644064 -644061 -638130 -633329 -631289 -627025 -623680 -615580 -607732 -613207 -627052 -645865
10873 -645865 -657787 -661252 -661570 -656529 -653565 -649247 -644436 -641972 -640437 -636417 -635084 -634145 -633538 -630660 -627711
10858 -627711 -622917 -618538 -616325 -615707 -613391 -612963 -611214 -607080 -608541 -607499 -606734 -607370 -608296 -610136 -608844
10843 -608844 -604956 -602258 -602913 -603438 -599982 -597966 -596171 -597493 -593278 -592486 -589803 -589216 -585130 -582713 -582452
10828 -582452 -582368 -583730 -581877 -580828 -582669 -581570 -581558 -582307 -582225 -580858 -581562 -580141 -577432 -573999 -570239 -567335
10812 -567335 -564152 -565477 -563817 -561522 -560901 -559983 -558609 -560617 -561197 -561034 -559035 -556701 -553754 -552545 -552108
10797e52108R78M116J264K757K144j530q61l53k504L017J047K885M144J406j091
10782e34689J635L216L266M40L557j114k504n71J128L635L524J256j831j436O59
10767e19829L467O088N28J18K379M854J099l836o081J88R04N661O120N97J604
10752d96139k384L369k6K500M05K084K292J091R17Q07P62l10l47K550K388J426
10736d78615L113J787j544K991M76l793K733K935K01K179R4J589O9m7O40N957
10720d59235L306N4l028J989K683K183K52l38L225j099r31J345K190K814r2P69
10704d43913K048K212L724j092m208k842L102K439K074J604j533Q48M220M908
10690d26409J825L968K807k601j094J084k65j911l34P24L853L652L946J987P7
$$ plain form
10797 -552108 -551130 -547014 -545750 -542993 -540849 -542379 -543240 -543593 -546097 -543080 -542033 -539148 -535004 -533598 -534689
10782 -534689 -533054 -529838 -526572 -526132 -522575 -523689 -526193 -526764 -525636 -522001 -518477 -517221 -519052 -520488 -519829
10767 -519829 -516362 -510274 -509746 -509628 -507249 -502395 -501296 -505132 -511213 -511025 -510121 -504460 -498340 -497743 -496139
10752 -496139 -498523 -495154 -495180 -492680 -492275 -490191 -487899 -486808 -485891 -485084 -484322 -484632 -484979 -482429 -480041 -478615
10736 -478615 -475502 -473715 -475259 -472268 -471792 -475585 -472852 -469917 -469716 -467537 -467443 -465854 -465785 -465832 -465192 -459235
10720 -459235 -455929 -455875 -458903 -456914 -454231 -452048 -451796 -452134 -448909 -450008 -450939 -449594 -447404 -444590 -444682 -443913
10704 -443913 -441865 -439653 -435929 -437021 -441229 -444071 -440969 -438530 -436456 -434852 -436385 -435537 -431317 -426409
10690 -426409 -424584 -420616 -417809 -420410 -421504 -420420 -420685 -422596 -422930 -422206 -418353 -414701 -410755 -408768 -408691
10675d08691q11K197K525k279PP25j208J81J640K421J929K408O761L523O22M874
10659c83176J240j105K288J310l082n048j689M446N795j811j368q33J716N079
10645c76238P09J237K616k445J471M637l47o94J419J526k06J885J156J920J568
10630c59786J505P8K901K602K095L139n79J33J13q80K31L248L060Q27K626J045
10614c37642M619J257J281R81j274J67M014J465n786k001j417J39O79L16M228
10599c28974J141K245J138J198L093K322L459M186k86j715K53j728L486J284K308
10584c06590J764k235K044j17j97M14J907N144M569j796j429K475K845Q29k033
10569b92406K940K243L532N619J485K089l255j632J808K021J171J477P21K019
$$ plain form
10675 -408691 -409502 -407305 -404780 -407059 -407052 -406327 -407535 -407354 -405714 -403293 -401364 -398956 -392195 -388672 -388050 -383176
10659 -383176 -381936 -383041 -380753 -379443 -382525 -387573 -389262 -384816 -379021 -380832 -382200 -383033 -381317 -376238
10645 -376238 -375529 -374292 -371676 -374121 -372650 -368013 -368360 -369054 -367635 -366109 -366315 -364430 -363274 -361354 -359786
10630 -359786 -358281 -358203 -355302 -352700 -350605 -347466 -348045 -347912 -347799 -348679 -348448 -345200 -342140 -341313 -338687 -337642
10614 -337642 -333023 -331766 -330485 -329504 -330778 -330611 -326597 -325132 -330918 -332919 -334336 -334197 -333518 -333202 -328974
10599 -328974 -327833 -325588 -324450 -323252 -320159 -317837 -314378 -310192 -310478 -312193 -311940 -313668 -310182 -308898 -306590
10584 -306590 -304826 -307061 -305017 -305134 -305331 -304917 -303010 -297866 -293297 -295093 -296522 -294047 -291202 -290373 -292406
10569 -292406 -289466 -287223 -283691 -278072 -276587 -274498 -277753 -279385 -277577 -275556 -274385 -272908 -272187 -270168
10555b70168J043N97J676O224J717M918M011K42j297K179J1k246r71l03k261J679
10539b52949L018M733J136j882J47L24K133k590M796K199J462L06P50M207r9l261
10523b35570L539O086o10P53l38m210L419J705L564P838n85K172L425J382k670
10508b10100O03O08p84K525K0j079N019M167L996K827J795p1l12M106L912J258
10492a81510l027l471L027J627L619j932M25L799J49k267K951M246J293j129l94
10477a72594J932N431J662k89J993K566j268J805J138L615j144n00r29r60K032
10462a55510J156M88J826O143J914J743J834K631k977n79J404J661j627J375K197
10447a36321K198K418K026K563J045K856J634l06k137k2L028L340J477j188K189
$$ plain form
10555 -270168 -269125 -268528 -266852 -260628 -258911 -253993 -249982 -249740 -251037 -248858 -248847 -251093 -252064 -252367 -254628 -252949
10539 -252949 -249931 -245198 -244062 -245944 -245797 -245473 -243340 -245930 -241134 -238935 -237473 -237167 -236417 -232210 -232309 -235570
10523 -235570 -232031 -225945 -226555 -225802 -226140 -230350 -226931 -225226 -221662 -213824 -214409 -212237 -208812 -207430 -210100
10508 -210100 -209497 -208889 -209673 -207148 -207128 -208207 -203188 -199021 -195025 -192198 -190403 -190474 -190786 -186680 -182768 -181510
10492 -181510 -184537 -188008 -184981 -183354 -179735 -181667 -181242 -177443 -177294 -179561 -176610 -172364 -171071 -172200 -172594
10477 -172594 -170662 -165231 -163569 -163858 -161865 -159299 -160567 -158762 -157624 -154009 -155153 -155653 -156582 -157542 -155510
10462 -155510 -154354 -153866 -152040 -145897 -143983 -142240 -140406 -137775 -140752 -141331 -139927 -138266 -139893 -138518 -136321
10447 -136321 -134123 -131705 -129679 -127116 -126071 -123215 -121581 -121887 -124024 -124046 -121018 -117678 -116201 -117389 -115200
10432a15200M071M235K915m01j60m25K733K592J972K618L551J475l461J734L021
10417h8730L968O61j27j695K919P100J791k618n81M901K780K61j391J952K650
10402f6159K962K516J932j01r57L872N92L287K098N243N268R11J901P97K454N016
10386b8368K996p70j566K778M672K635K013J637N882K915O593O246J0774N626
10372B4063N795J3620J4362J0479N791j1890m6551o9133m5795j2451R766J2979
10360h8965P341Q783R411N888P269L054L068N572N867J560J117K186K331O253
10346a9265R31m239Q46L745N188M999P73O27L069K191M05j91J561M442K973K742
10330A0797K415L531K919K117O70R56K475J116K905k94P62p64Q80K458L673J936
$$ plain form
10432 -115200 -111129 -106894 -103979 -104380 -104540 -104965 -102232 -99640 -97668 -95050 -91499 -90024 -93485 -91751 -88730
10417 -88730 -84762 -84101 -84228 -85923 -83004 -75904 -74113 -76731 -77312 -72411 -69631 -69370 -70761 -68809 -66159
10402 -66159 -63197 -60681 -58749 -58850 -59807 -55935 -55343 -52056 -49958 -44715 -39447 -38536 -36635 -35838 -33384 -28368
10386 -28368 -25372 -26142 -27708 -24930 -20258 -17623 -15610 -13973 -8091 -5176 1417 7663 18437 24063
10372 24063 29858 43478 57840 68319 74110 62220 15669 -53464 -99259 -111710 -101944 -88965
10360 -88965 -81624 -72841 -63430 -57542 -50273 -47219 -44151 -38579 -32712 -31152 -30035 -27849 -25518 -19265
10346 -19265 -18334 -22573 -21727 -17982 -12794 -7795 -7022 -6395 -3326 -1135 -730 -921 640 5082 8055 10797
10330 10797 13212 16743 19662 21779 22449 23405 25880 26996 29901 29607 30369 29605 30485 32943 36616 38552
10314C8552K457O25K074M249L702J563l017L662M639K63L248K167k08L22k088
10299F2210K306J612J595L113q21K032K021M394L714n20K372P30K538P92J870
10284H9958M758J547J568k029Q12K511K647K184K841J926L875r04j862J297K477
10269A13606L708J648K857K891l174J041L609L197K625J334L282M114L323j041
10255A43020l906k570M722M980J493L537L711N71m300L4K821K770k14J401L140
10240A61210K699Q15M851J810J516J383L471K425j136Q53N398L717L714l109j348
10225A88269M70O11N134J719M651M829j986L9O680N133m52J923J96j241M048K580
10209B22603m16K940M225j882m02K957J071O42M543K064N35K643K293k95O80L547
$$ plain form
10314 38552 41009 41634 43708 47957 51659 53222 50205 53867 58506 58769 62017 64184 63976 64298 62210
10299 62210 64516 66128 67723 70836 70015 72047 74068 78462 82176 81656 84028 84758 87296 88088 89958
10284 89958 94716 96263 97831 95802 96614 99125 101772 103956 106797 108723 112598 111694 109832 111129 113606
10269 113606 117314 118962 121819 124710 121536 122577 126186 129383 132008 133342 136624 140738 144061 143020
10255 143020 139114 136544 141266 146246 147739 151276 154987 155558 151258 151292 154113 156883 156669 158070 161210
10240 161210 163909 164724 169575 171385 172901 174284 177755 180180 179044 179897 185295 189012 192726 189617 188269
10225 188269 188739 189350 194484 196203 200854 205683 203697 203736 210416 215549 215097 217020 217216 215975 220023 222603
10209 222603 222187 225127 229352 227470 227068 230025 231096 231738 236281 238345 238880 241523 243816 243521 244201 247748
10193B47748J014J566M595o05O04M887L443K091M605K796J073L002J06k523R79
10178B75381K735M670M433K034K732J896M56M301k055J748K616r7M599J93O56
10163C06298K674K565J972N12K731K389L916N324k55j79K062L010M745k484L213
10148C38493M770M241K508j560L206N833K855K613J197Q82L401M871L850J500
10134C78660K633J255L554J696J120M789K390L895N154K817K150K504L498L212
10120D19327O764j789Q23J477j337N208N834L359K756J007M673M631N065L971
10106D61769N498P059O127L558K877O835L127O518P605N604O751N380O236J0302
10092E45246O989M925J0283P744P836Q820J4532J3099J0357J7901K6110K9169
$$ plain form
10193 247748 248762 250328 254923 254318 254922 259809 263252 265343 269948 272744 273817 276819 276925 274402 275381
10178 275381 278116 282786 287219 289253 291985 293881 294337 298638 296583 298331 300947 300850 305449 305642 306298
10163 306298 308972 311537 313509 314021 316752 319141 323057 328381 328126 327947 330009 333019 337764 335280 338493
10148 338493 343263 347504 350012 348452 351658 357491 360346 362959 364156 365038 368439 373310 377160 378660
10134 378660 381293 382548 386102 387798 388918 393707 396097 399992 405146 407963 410113 412617 416115 419327
10120 419327 426091 424302 425125 426602 425265 430473 436307 439666 442422 443429 448102 452733 457798 461769
10106 461769 467267 474326 480453 484011 486888 493723 496850 503368 510973 516577 523328 528708 534944 545246
10092 545246 552235 557160 567443 575187 583023 591843 606375 619474 629831 647732 673842 703011
10080G03011L1218L8237M4557M4522L3089j1354o3598o0810l3824p8339j79847
10069D66862j76728p2252k8365n5263o1190l933L7608M8699M4925L5719K5091
10058B61173K4605K2602J7771J1921R364J0236J2722J1336Q783M660K690j730
10046C96133N77O938R625N968R079J2053P950O053L064P502M539J159N430N478
10032D81548R92N747N412n36K065M015P152K286J481R126Q523j791J735L660J114
10017E32529L339M985M403M613K984L029J506K801K275O753K916R23J460J504
10003E76020N576M514M305K664K065K064L958M177M882M243L797L462J465L290
9989F26482M919M006R10K086M800L937M807M386q33k67N796N610p8K050N666J500
$$ plain form
10080 703011 734229 772466 817023 861545 894634 883280 819682 758872 725048 646709 466862
10069 466862 290134 217882 189517 134254 73064 69131 106739 155438 200363 236082 261173
10058 261173 285778 308380 326151 338072 347436 357672 370394 381730 390513 395173 397863 396133
10046 396133 396710 403648 413273 419241 428320 440373 448323 454376 457440 464942 469481 470640 476070 481548
10032 481548 482540 488287 493699 493163 495228 499243 506395 508681 510162 519288 527811 526020 527755 531415 532529
10017 532529 535868 540853 545256 549869 552853 555882 557388 560189 562464 569217 572133 573056 574516 576020
10003 576020 581596 586110 590415 593079 595144 597208 601166 605343 610225 614468 618265 621727 623192 626482
9989 626482 631401 635407 636317 638403 643203 647140 651947 656333 655500 655233 661029 666639 666561 668611 674277 675777
9973F75777J907K218j87N495P013J600M187O675N463J910N154K176j77J872K672
9958G23755M063K095N477O69j692L034M128M303N391K867N154L779N252J635Q34
9943G70744K974j736K933L797M137L465L685K870M962M498l27K423K212j185L557
9928H09009N483O755J831N887O555L525N315K895J858M924N291K186J3L238L176
9913H67941K429L366J956M730P153P218K959M608L550L802J469j750l813L58K681
9898I08657O626O260L976M808N541M436K553L827K930K762N230L060K305J824
9884I64795K744K633L430O401P725M108L339M329L643O093M802M321K779K347
9870A023489J972O257J669L119M276K663N300O612K887M505M357M589J550N226
$$ plain form
9973 675777 677684 679902 679715 685210 692223 693823 698010 704685 710148 712058 717212 719388 719211 721083 723755
9958 723755 727818 729913 735390 736059 734367 737401 741529 745832 751223 754090 759244 763023 768275 769910 770744
9943 770744 773718 771982 774915 778712 782849 786314 789999 792869 797831 802329 802002 804425 806637 805452 809009
9928 809009 814492 821247 823078 828965 835520 839045 844360 847255 849113 854037 859328 861514 861527 864765 867941
9913 867941 870370 873736 875692 880422 887575 894793 897752 902360 905910 909712 911181 909431 905618 905976 908657
9898 908657 915283 921543 925519 930327 935868 940304 942857 946684 949614 952376 957606 960666 962971 964795
9884 964795 967539 970172 973602 980003 987728 991836 995175 999504 1003147 1009240 1014042 1018363 1021142 1023489
9870 1023489 1025461 1031718 1033387 1036506 1040782 1043445 1048745 1055357 1058244 1062749 1067106 1071695 1073245 1078471
9856A078471L889L480p14L870M278M265P175N870M117K044L806O316L793N372
9842A136032M396J429K335N089L045L745M681O363Q251M559M321J84M390O581
9828A195401K709L672K284L596P324Q051N705J798L170K653L715O361O924K377
9814A255740N198L803M13K755R491R933Q823N904P294O113M693L267n13L410M099
9799A330423K325O584Q176K190L015M437P691O652J450M108M040P013O034N221
9785A399359N439O659P257O71M649P601N763P224M914O041M237N846N316N322
9771A476298N879P351L449N871P920O850K202L930J2250O939L257N574J0233M198
9757A562201L635P671O344M260N847P381R215K622K659O716O189O446O880O421
$$ plain form
9856 1078471 1082360 1085840 1085126 1088996 1093274 1097539 1104714 1110584 1114701 1116745 1120551 1126867 1130660 1136032
9842 1136032 1140428 1141857 1144192 1149281 1152326 1156071 1160752 1167115 1175366 1179925 1184246 1184430 1188820 1195401
9828 1195401 1198110 1201782 1204066 1207662 1214986 1223037 1228742 1230540 1233710 1236363 1240078 1246439 1253363 1255740
9814 1255740 1260938 1264741 1265154 1267909 1277400 1287333 1296156 1302060 1309354 1315467 1320160 1323427 1322914 1326324 1330423
9799 1330423 1332748 1339332 1347508 1349698 1352713 1357150 1364841 1371493 1372943 1377051 1381091 1388104 1394138 1399359
9785 1399359 1404798 1411457 1418714 1419385 1424034 1431635 1437398 1444622 1449536 1455577 1459814 1465660 1470976 1476298
9771 1476298 1482177 1489528 1492977 1498848 1506768 1513618 1515820 1519750 1532000 1538939 1542196 1547770 1558003 1562201
9757 1562201 1565836 1573507 1579851 1584111 1589958 1597339 1606554 1609176 1611835 1618551 1624740 1631186 1638066 1644487
9743A644487Q891P830L569P21J212O415Q703O931P568O739M767K781K254M295
9729A717163J0355J2100Q202N525O620O425N034P307R601P424O361J0245P761
9716A820123K478L749J0468Q887R598P333P287P596N452L909Q811J1318J0598
9703A917607O418M377M640Q687J1163P428Q624J1709P136N047O513N818Q293O819
9689B020279L043M942Q651J1618R804J1858N131O118J0547J2681J0705R874O943
9676B132194K256P507P681Q629J0386R095R760R479J1697J1602P627J0130R484
9663B247527J0953J1539J0163P014J2149J1521O380N366R972R806J1056R567J1736
9650B374749R895Q023O569R900J3045J1523J2785J0052Q302N627P142J1100J2652
$$ plain form
9743 1644487 1653378 1661208 1664777 1665498 1666710 1673125 1681828 1688759 1696327 1703066 1707833 1710614 1712868 1717163
9729 1717163 1727518 1739618 1747820 1753345 1759965 1766390 1771424 1778731 1788332 1795756 1802117 1812362 1820123
9716 1820123 1822601 1826350 1836818 1845705 1855303 1862636 1869923 1877519 1882971 1886880 1895691 1907009 1917607
9703 1917607 1924025 1928402 1933042 1941729 1952892 1960320 1968944 1980653 1987789 1992836 1999349 2005167 2013460 2020279
9689 2020279 2023322 2028264 2036915 2048533 2058337 2070195 2075326 2081444 2091991 2104672 2115377 2125251 2132194
9676 2132194 2134450 2141957 2149638 2158267 2168653 2177748 2187508 2196987 2208684 2220286 2227913 2238043 2247527
9663 2247527 2258480 2270019 2280182 2287196 2299345 2310866 2317246 2322612 2332584 2342390 2353446 2363013 2374749
9650 2374749 2384644 2392667 2399236 2409136 2422181 2433704 2446489 2456541 2464843 2470470 2477612 2488712 2501364
9637B501364J2070J3452J2892J3814J3971J6250J3363J2507J5388J7248J4363
9626B656682J0740J2561J2428J2258J1769J1944J5753J4050J2221J8801K2562
9615B811769L1759L3236L1602K0312l358l0727m2848m4069m7204l4985q342J6673
9603B733818L0052L4168K8109K0025K3536K1587J8481J8409J4326J7042K0871
9592B980424J7303J7685K0238J6460J4678J6629J8673J3967J0973J4313J8250
9581C159593J4907J5052J4913J6972J7765J5200J4981J2792J7588J5512J4951
9570C330226K0407J8780J6612J5619J9219K0225J9620J7642J4382J6756K1699
9559C531187J8277J9284K1576K0552K1485J9956J9224J6917J1714J9280K2194
$$ plain form
9637 2501364 2513434 2526886 2539778 2553592 2567563 2583813 2597176 2609683 2625071 2642319 2656682
9626 2656682 2667422 2679983 2692411 2704669 2716438 2728382 2744135 2758185 2770406 2789207 2811769
9615 2811769 2843528 2876764 2908366 2928678 2925320 2894593 2851745 2807676 2760472 2725487 2717145 2733818
9603 2733818 2763870 2798038 2826147 2846172 2869708 2891295 2909776 2928185 2942511 2959553 2980424
9592 2980424 2997727 3015412 3035650 3052110 3066788 3083417 3102090 3116057 3127030 3141343 3159593
9581 3159593 3174500 3189552 3204465 3221437 3239202 3254402 3269383 3282175 3299763 3315275 3330226
9570 3330226 3350633 3369413 3386025 3401644 3420863 3441088 3460708 3478350 3492732 3509488 3531187
9559 3531187 3549464 3568748 3590324 3610876 3632361 3652317 3671541 3688458 3700172 3719452 3741646
9548C741646J7535J7813J6027J9796K2857K1137J8257J6642K1180K4063K4538
9537C961491K1808K2562K2204K1135K0729K0144K0958K5381K3393K6936K3059
9526D209800J7035K0446K3717K4980K8009K7177K6872K6332K3433K2658K3304
9515D473763K5659K6674K4779K8607K9514K7914K5772K8417K9010K6086K8294
9504D774489K9897L2072L1327K9316L0050K7810L1598L0400L0380L1708L0853
9493E109900L3951L3342L1682L3113L1880L2710L1293L3189L4535L6184L3349
9482E475128L3990L2842L3918L7387M1588L4413M0418L7631L5784L7125L9400
9471E879624M3300M0337L8333M0436M1822M0003M0008M0748M1622M0715M4319
$$ plain form
9548 3741646 3759181 3776994 3793021 3812817 3835674 3856811 3875068 3891710 3912890 3936953 3961491
9537 3961491 3983299 4005861 4028065 4049200 4069929 4090073 4111031 4136412 4159805 4186741 4209800
9526 4209800 4226835 4247281 4270998 4295978 4323987 4351164 4378036 4404368 4427801 4450459 4473763
9515 4473763 4499422 4526096 4550875 4579482 4608996 4636910 4662682 4691099 4720109 4746195 4774489
9504 4774489 4804386 4836458 4867785 4897101 4927151 4954961 4986559 5016959 5047339 5079047 5109900
9493 5109900 5143851 5177193 5208875 5241988 5273868 5306578 5337871 5371060 5405595 5441779 5475128
9482 5475128 5509118 5541960 5575878 5613265 5654853 5689266 5729684 5767315 5803099 5840224 5879624
9471 5879624 5922924 5963261 6001594 6042030 6083852 6123855 6163863 6204611 6246233 6286948 6331267
9460F331267M7451M3824M3685M5231M1878M5677M5829M6172N0749M8466M8334
9449F838563M9777M9138M7491M8945N1589N0502M8109N2708N3956M8621N1753
9438G391152N2158N3099N2117N2651N6139N6597N8719N4796N7406N8125O0065
9427H003024N5882N6769N8310N8453N9783O0401N8415N9237O0999N8467O2604
9416H652344O0632N7066N8582N9996N9896N7851O0779N7228N7351N9915N6862
9405I298502N5443N4908N3747N3471N3655N4636N1667M7316M6535M9029L8336
9394I857245L9172M1839L8392L4426K9539K8826K7227K5384K1010J3754O371J207
9382A0164392K190m648j1258j8511k7262k6741l7623m8184n3015n7930o6748p7709
$$ plain form
9460 6331267 6378718 6422542 6466227 6511458 6553336 6599013 6644842 6691014 6741763 6790229 6838563
9449 6838563 6888340 6937478 6984969 7033914 7085503 7136005 7184114 7236822 7290778 7339399 7391152
9438 7391152 7443310 7496409 7548526 7601177 7657316 7713913 7772632 7827428 7884834 7942959 8003024
9427 8003024 8058906 8115675 8173985 8232438 8292221 8352622 8411037 8470274 8531273 8589740 8652344
9416 8652344 8712976 8770042 8828624 8888620 8948516 9006367 9067146 9124374 9181725 9241640 9298502
9405 9298502 9353945 9408853 9462600 9516071 9569726 9624362 9676029 9723345 9769880 9818909 9857245
9394 9857245 9896417 9938256 9976648 10011074 10040613 10069439 10096666 10122050 10143060 10156814 10163185 10164392
9382 10164392 10166582 10161934 10150676 10132165 10104903 10078162 10040539 9992355 9939340 9881410 9814662 9736953
9370I736953r3477j00261j11791j27348j36060j47485j62502j71820j86765k00637
9360H298807k14978k30238k44775k57205k71819k85803k99041l14636l31534l50566
9350E498212l65156l72867l84285l95586m09326m22103m33190m38949m45368m51891
9340A379491m57344m63590m68818m66024m64602m63172m65154m62293m55738m50152
9330c237396m43135m30643m24673m17058m05001l92847l77606l61938l50224l39305
9320g179826l21369l09722k93931k79682k69484k58990k43200k26319k12822k00789
9310i796134j84585j66572j54420j40835j28743j19427j10512r9242q6051p6735
9300a1063256o9114o0218n2391m4632l7745k8938k2414j6244j3459n410L51N806
$$ plain form
9370 9736953 9643476 9543215 9431424 9304076 9168016 9020531 8858029 8686209 8499444 8298807
9360 8298807 8083829 7853591 7608816 7351611 7079792 6793989 6494948 6180312 5848778 5498212
9350 5498212 5133056 4760189 4375904 3980318 3570992 3148889 2715699 2276750 1831382 1379491
9340 1379491 922147 458557 -10261 -476285 -940887 -1404059 -1869213 -2331506 -2787244 -3237396
9330 -3237396 -3680531 -4111174 -4535847 -4952905 -5357906 -5750753 -6128359 -6490297 -6840521 -7179826
9320 -7179826 -7501195 -7810917 -8104848 -8384530 -8654014 -8913004 -9156204 -9382523 -9595345 -9796134
9310 -9796134 -9980719 -10147291 -10301711 -10442546 -10571289 -10690716 -10801228 -10900470 -10986521 -11063256
9300 -11063256 -11132370 -11192588 -11244979 -11289611 -11327356 -11356294 -11378708 -11394952 -11408411 -11413821 -11413470 -11407664
9288a1407664J2345J5091K0053K3245K6487K6560L1276L4828L3869L8199L7046
9277a1108665L4118L6826M0345M7198M7886M8416N0373N2401N8134N6636N7960
9266a0578372N4848N5889N8566O2076O1234N6015N3694N6268O1092N9517N7084
9255i942089N7625N8608O0966O1667N6996N7763O1219N8031N4592N4622N8192
9244i301808N5696N3508N3563N3283M9451N3230N4041N3371N2401N1749N4384
9233h717131N3355N0658N0928N2811N1317M8897N1112M6688M5967M7937M8495
9222h168966M8558M4549M9132N2607M4032M4831M3670M2921M2293M3955M6076
9211g666342M3569M3899L8966L8328M0742L9980M0536M0711L2960L6447M0282
$$ plain form
9288 -11407664 -11395319 -11380228 -11360175 -11336930 -11310443 -11283883 -11252607 -11217779 -11183910 -11145711 -11108665
9277 -11108665 -11074547 -11037721 -10997376 -10950178 -10902292 -10853876 -10803503 -10751102 -10692968 -10636332 -10578372
9266 -10578372 -10523524 -10467635 -10409069 -10346993 -10285759 -10229744 -10176050 -10119782 -10058690 -9999173 -9942089
9255 -9942089 -9884464 -9825856 -9764890 -9703223 -9646227 -9588464 -9527245 -9469214 -9414622 -9360000 -9301808
9244 -9301808 -9246112 -9192604 -9139041 -9085758 -9036307 -8983077 -8929036 -8875665 -8823264 -8771515 -8717131
9233 -8717131 -8663776 -8613118 -8562190 -8509379 -8458062 -8409165 -8358053 -8311365 -8265398 -8217461 -8168966
9222 -8168966 -8120408 -8075859 -8026727 -7974120 -7930088 -7885257 -7841587 -7798666 -7756373 -7712418 -7666342
9211 -7666342 -7622773 -7578874 -7539908 -7501580 -7460838 -7420858 -7380322 -7339611 -7306651 -7270204 -7229922
9200g229922L9846L7759L8095L9422L5506L7290M0321L4072L4242L6536K9850
9189f826983L5389L7795L1216L6399L4548K9597L2789L8687L8491L4971L2556
9178f444545K9321K8235K7584L3585L3150K6038K5814L1958L2933K8321K7581
9167f120025K5363K3144K6557L0564K8363K5374K6478K7019K7177L1470L1187
9156e817329K5136K3991K5592K5198K5235K6139L1279L0230K5355K5300K5312
9145e528562K0444K2413K6179K4620K2417K5341L1050K8617K9681L2041K6301
9134e239458K2770K4836K3029K1625K0436Q989n056j7461j0177P939K1157K7194
9122e094177K9136K9385K9343K8106K7296K8429K8342K4922K1640J3062Q688J0289
$$ plain form
9200 -7229922 -7190076 -7152317 -7114222 -7074800 -7039294 -7002004 -6961683 -6927611 -6893369 -6856833 -6826983
9189 -6826983 -6791594 -6753799 -6722583 -6686184 -6651636 -6622039 -6589250 -6550563 -6512072 -6477101 -6444545
9178 -6444545 -6415224 -6386989 -6359405 -6325820 -6292670 -6266632 -6240818 -6208860 -6175927 -6147606 -6120025
9167 -6120025 -6094662 -6071518 -6044961 -6014397 -5986034 -5960660 -5934182 -5907163 -5879986 -5848516 -5817329
9156 -5817329 -5792193 -5768202 -5742610 -5717412 -5692177 -5666038 -5634759 -5604529 -5579174 -5553874 -5528562
9145 -5528562 -5508118 -5485705 -5459526 -5434906 -5412489 -5387148 -5356098 -5327481 -5297800 -5265759 -5239458
9134 -5239458 -5216688 -5191852 -5168823 -5147198 -5126762 -5117773 -5122829 -5140290 -5150467 -5142528 -5121371 -5094177
9122 -5094177 -5065041 -5035656 -5006313 -4978207 -4950911 -4922482 -4894140 -4869218 -4847578 -4834516 -4825828 -4815539
9110d815539P060P936J0350J3576J3129J6020J9383J6624K1738K1982K0435K3827
9098d623479K9350K9189L7879L7382L4097K3498q35l8145o8614o9696l9175O09
9086d647940K8081L4371L4565L2839K9122K3894K1677J8920J8268J8602J9651
9075d367950J5820Q827R645J0203O188N91r03P70M373J2038K0217K3132J9518
9062d237531K1373K3295K0682K0386K1536K0340J7968J0748k125j8299k2635j1365
9050d135627L725J4433J9202J8453J6975J9672J5896J6383J4533J4382J2693J2914
9038c956366J0628J2779J7923J6029J2857J2379R271P727J0276J1921J2394J3875
9026c808307J1975Q234P987J1188J1290R536J1593J1968R408J2335J3749J0073
$$ plain form
9110 -4815539 -4808479 -4800543 -4790193 -4776617 -4763488 -4747468 -4728085 -4711461 -4689723 -4667741 -4647306 -4623479
9098 -4623479 -4594129 -4564940 -4527061 -4489679 -4455582 -4432084 -4432919 -4471064 -4539678 -4609374 -4648549 -4647940
9086 -4647940 -4619859 -4585488 -4550923 -4518084 -4488962 -4465068 -4443391 -4424471 -4406203 -4387601 -4367950
9075 -4367950 -4352130 -4343303 -4333658 -4323455 -4317267 -4316676 -4317579 -4316809 -4312436 -4300398 -4280181 -4257049 -4237531
9062 -4237531 -4216158 -4192863 -4172181 -4151795 -4130259 -4109919 -4091951 -4081203 -4083328 -4101627 -4124262 -4135627
9050 -4135627 -4131902 -4117469 -4098267 -4079814 -4062839 -4043167 -4027271 -4010888 -3996355 -3981973 -3969280 -3956366
9038 -3956366 -3945738 -3932959 -3915036 -3899007 -3886150 -3873771 -3864500 -3856773 -3846497 -3834576 -3822182 -3808307
9026 -3808307 -3796332 -3788098 -3780111 -3768923 -3757633 -3748097 -3736504 -3724536 -3715128 -3702793 -3689044 -3678971
9014c678971O578Q986N805P590J0000J1135O628Q864J0958J0859J1235O869P300
9001c566164J1345J2492R626Q246R903J0430R837P818O918R987R428J0416J0088
8988c439630Q288R420Q156P954P851M715O809Q383P153R758N748P062O510P460
8974c334363Q054Q419J0255J2485P920P391J2144P807M416P373L792N479R212
8961c229616M559l99M279J1469J0500K800Q483J7176J0773P424R021M406K843
8948c136282J0057J0304K916K964O183K298K186J2354J5461Q021L423L499Q368
8935c048248P435K581N795R736Q286R418Q042O508N838L356N738N969P797P419
8921b954330M906P563J0789J0290K349J841O408M675M633P258L700K086P996P347
$$ plain form
9014 -3678971 -3672393 -3663407 -3657602 -3650012 -3640012 -3628877 -3622249 -3613385 -3602427 -3591568 -3580333 -3573464 -3566164
9001 -3566164 -3554819 -3542327 -3532701 -3524455 -3514552 -3504122 -3494285 -3486467 -3479549 -3469562 -3460134 -3449718 -3439630
8988 -3439630 -3431342 -3421922 -3413766 -3405812 -3397961 -3393246 -3386437 -3378054 -3370901 -3361143 -3355395 -3348333 -3341823 -3334363
8974 -3334363 -3326309 -3317890 -3307635 -3295150 -3287230 -3279839 -3267695 -3259888 -3255472 -3248099 -3244307 -3238828 -3229616
8961 -3229616 -3225057 -3225456 -3221177 -3209708 -3199208 -3196408 -3187925 -3170749 -3159976 -3152552 -3143531 -3139125 -3136282
8948 -3136282 -3126225 -3115921 -3113005 -3110041 -3103858 -3101560 -3099374 -3087020 -3071559 -3063538 -3060115 -3056616 -3048248
8935 -3048248 -3040813 -3038232 -3032437 -3022701 -3014415 -3004997 -2996955 -2990447 -2984609 -2981253 -2975515 -2969546 -2961749 -2954330
8921 -2954330 -2949424 -2941861 -2931072 -2920782 -2918433 -2916592 -2910184 -2905509 -2900876 -2893618 -2889918 -2887832 -2879836 -2872489
8907b872489Q172P976N726O406Q412K313L864N228O588P722L927P433O939O225
8893b785558M973J830O061R360P326M601L294N318O060O425N038K554Q432P741
8879b706545Q510R966L884J929K835P711P440M170N448M210O033J1551O021K580
8865b624257O748P284J989L885J506P625N328N264N814O233M154Q819P287M331
8851b547990L513R45K459R454P931M095O215O013Q183M856N298N694N292M505
8837b473537O918O075K866M564R679P940M157N300R787N338M083N697Q958P088
8823b385087L587N567M776N948P153M987M654O437Q756O995O582O531P601R261
8809b296252O087L849N623M688O842P062M958K795Q856Q117N927R803R757Q632
$$ plain form
8907 -2872489 -2864317 -2856341 -2850615 -2844209 -2835797 -2833484 -2829620 -2824392 -2817804 -2810082 -2806155 -2798722 -2791783 -2785558
8893 -2785558 -2780585 -2778755 -2772694 -2763334 -2756008 -2751407 -2748113 -2742795 -2736735 -2730310 -2725272 -2722718 -2714286 -2706545
8879 -2706545 -2698035 -2688069 -2684185 -2682256 -2679421 -2671710 -2664270 -2660100 -2654652 -2650442 -2644409 -2632858 -2626837 -2624257
8865 -2624257 -2617509 -2610225 -2608236 -2604351 -2602845 -2595220 -2589892 -2584628 -2578814 -2572581 -2568427 -2559608 -2552321 -2547990
8851 -2547990 -2544477 -2543532 -2541073 -2531619 -2523688 -2519593 -2513378 -2507365 -2499182 -2494326 -2489028 -2483334 -2478042 -2473537
8837 -2473537 -2466619 -2460544 -2457678 -2453114 -2443435 -2435495 -2431338 -2426038 -2416251 -2410913 -2406830 -2401133 -2392175 -2385087
8823 -2385087 -2381500 -2375933 -2371157 -2365209 -2358056 -2353069 -2348415 -2341978 -2333222 -2326227 -2319645 -2313114 -2305513 -2296252
8809 -2296252 -2290165 -2286316 -2280693 -2276005 -2269163 -2262101 -2257143 -2254348 -2245492 -2237375 -2231448 -2221645 -2211888 -2203256
8795b203256J0623R102P926R590R449P124P916R601J1781J1923O973R060J2941
8782b079247J5208P232J0398J4122J1270J3474J2612J0265J2006J5639J4836J7487
8770a924698J9057J5247J7313K3304K2675K1805K4566K6944K9125K6845L0476
8759a667341L1497L9346L9749M4817M5249M8781N2472N3369N8307O7057P4828
8748a111869Q0608Q7737J07454J50591K00838K55178L13298L75153M17389L43979
8738A220356n5600j069714k412323k423184j004443P2700M01424M07824L44066
8729d518894K77791K25976J86377J46886J15696Q9314O9622O0276N8417N9131
8719c229408N2190M7812M7302M6595L8199L6356L7739L4146K9581K6920K4589
$$ plain form
8795 -2203256 -2192633 -2183531 -2175605 -2166015 -2156566 -2149442 -2141526 -2131925 -2120144 -2108221 -2101248 -2092188 -2079247
8782 -2079247 -2064039 -2056807 -2046409 -2032287 -2021017 -2007543 -1994931 -1984666 -1972660 -1957021 -1942185 -1924698
8770 -1924698 -1905641 -1890394 -1873081 -1849777 -1827102 -1805297 -1780731 -1753787 -1724662 -1697817 -1667341
8759 -1667341 -1635844 -1596498 -1556749 -1511932 -1466683 -1417902 -1365430 -1312061 -1253754 -1186697 -1111869
8748 -1111869 -1031261 -943524 -836070 -685479 -484641 -229463 83835 458988 876377 1220356
8738 1220356 1164756 95042 -2317281 -4740465 -5744908 -5672208 -5270784 -4862960 -4518894
8729 -4518894 -4241103 -4015127 -3828750 -3681864 -3566168 -3476854 -3407232 -3346956 -3288539 -3229408
8719 -3229408 -3177218 -3129406 -3082104 -3035509 -2997310 -2960954 -2923215 -2889069 -2859488 -2832568 -2807979
8708b807979K6611K1403K1316K0815J5798J9196K1554J9846J3058J6505J5589
8697b596288J0143J4163J5052Q226J0560J2821J3872J1896O391R884R976R401
8685b463903J0589R411O535N101Q730J1928J1154P482M041N317P595M352N431
8672b366237P036N074L542M571M460O509O212L859M674M778P272Q336O632O769
8658b286513O317P088O202P178N948N822N074L451J455K566L540L899M464N995
8644b217514N403M960M599K503L697L628K288K274N541N250M883L662M641M424
8630b159761K668J565K942L843L755M828P120L353m34K016M901K082J705K131
8616b117286M416N691O098N238L221K225n16r84j554J185K969n29j025L151M893
$$ plain form
8708 -2807979 -2781368 -2759965 -2738649 -2717834 -2702036 -2682840 -2661286 -2641440 -2628382 -2611877 -2596288
8697 -2596288 -2586145 -2571982 -2556930 -2548704 -2538144 -2525323 -2511451 -2499555 -2493164 -2483280 -2473304 -2463903
8685 -2463903 -2453314 -2443903 -2437368 -2432267 -2423537 -2411609 -2400455 -2392973 -2388932 -2383615 -2376020 -2371668 -2366237
8672 -2366237 -2359201 -2354127 -2350585 -2346014 -2341554 -2335045 -2328833 -2324974 -2320300 -2315522 -2308250 -2299914 -2293282 -2286513
8658 -2286513 -2280196 -2273108 -2266906 -2259728 -2253780 -2247958 -2242884 -2239433 -2237978 -2235412 -2231872 -2227973 -2223509 -2217514
8644 -2217514 -2212111 -2207151 -2202552 -2200049 -2196352 -2192724 -2190436 -2188162 -2182621 -2177371 -2172488 -2168826 -2164185 -2159761
8630 -2159761 -2157093 -2155528 -2152586 -2148743 -2144988 -2140160 -2133040 -2129687 -2130121 -2128105 -2123204 -2121122 -2119417 -2117286
8616 -2117286 -2112870 -2107179 -2101081 -2095843 -2092622 -2090397 -2090913 -2091897 -2093451 -2092266 -2089297 -2089826 -2090851 -2087700 -2082807
8601b082807M550R247O539K918o8J121L876P663L30R64Q014N961K330K295K550
8586b024517J599k682j378L821J018M521L687M369J895L383L378K373J123J847
8572a995563M129P013N316K105K327J384Q19K9k818J068M020L545L048L054j071
8557a961595J092L842M666M336O221J249L094L248k75P01K567K341M970J90j203
8542a924556L025M422L070L245J843j425M395N950L984J004j012J270L248K744
8528a888793K952j22Q7Q19m31K249K242p02J126O627M308n5N00L614J592J415
8512a862572N017L833J302K018J915L253L603K062K063L851L033m36K783l19J098
8497a827496J579J088J891K983j236M89L848J273M392N621L246j020J943J999
$$ plain form
8601 -2082807 -2078257 -2069010 -2062471 -2059553 -2059621 -2058500 -2054624 -2046961 -2046631 -2045667 -2037653 -2031692 -2029362 -2027067 -2024517
8586 -2024517 -2022918 -2025600 -2026978 -2023157 -2022139 -2017618 -2013931 -2009562 -2007667 -2004284 -2000906 -1998533 -1997410 -1995563
8572 -1995563 -1991434 -1984421 -1979105 -1977000 -1974673 -1973289 -1972470 -1972441 -1975259 -1974191 -1970171 -1966626 -1963578 -1960524 -1961595
8557 -1961595 -1960503 -1956661 -1951995 -1947659 -1941438 -1940189 -1937095 -1933847 -1934122 -1933421 -1930854 -1928513 -1923543 -1923353 -1924556
8542 -1924556 -1921531 -1917109 -1914039 -1910794 -1908951 -1910376 -1905981 -1900031 -1896047 -1895043 -1896055 -1894785 -1891537 -1888793
8528 -1888793 -1885841 -1885963 -1885876 -1885057 -1885488 -1883239 -1880997 -1881699 -1880573 -1873946 -1869638 -1869693 -1869193 -1865579 -1863987 -1862572
8512 -1862572 -1857555 -1853722 -1852420 -1850402 -1848487 -1845234 -1841631 -1839569 -1837506 -1833655 -1830622 -1831058 -1828275 -1828594 -1827496
8497 -1827496 -1825917 -1824829 -1822938 -1819955 -1821191 -1820702 -1816854 -1815581 -1811189 -1805568 -1802322 -1803342 -1801399 -1799400
8483a799400k209J828K877j96J495N490J460K542J223N396K763L633K285M12J159
8468a769242K229k335j1L077j99K647j33q79L999N217M455J996j48n52K180M732
8452a742967J670M81P47J635M160L072M289J540L505L893J630J511J390J943K841
8437a708660K004K713M093j62K074K939L061M088P553J564J88P124N148N48K707
8422a663018M704N251Q469M400N412Q369Q095M963J1095J3194J2484J4018J1023
8409a551541Q158R460J9851K4209L434q3941j89253j44078k5581K6885L1632K8907
8397a841858K7763J9319J2749J1355J0887Q616J0132O511M939K646M077L826J988
8384a717050n37M022M506N087O076O773O426K485J794J092M094L896l410J851
$$ plain form
8483 -1799400 -1801609 -1799781 -1796904 -1797100 -1795605 -1790115 -1788655 -1786113 -1784890 -1779494 -1776731 -1773098 -1770813 -1770401 -1769242
8468 -1769242 -1767013 -1769348 -1769359 -1766282 -1766481 -1763834 -1763967 -1764846 -1760847 -1755630 -1751175 -1749179 -1749327 -1749879 -1747699 -1742967
8452 -1742967 -1741297 -1740816 -1740069 -1738434 -1734274 -1731202 -1726913 -1725373 -1721868 -1717975 -1716345 -1714834 -1713444 -1711501 -1708660
8437 -1708660 -1706656 -1703943 -1699850 -1700012 -1697938 -1694999 -1691938 -1687850 -1680297 -1678733 -1678545 -1671421 -1666273 -1665725 -1663018
8422 -1663018 -1658314 -1653063 -1644594 -1640194 -1634782 -1626413 -1618318 -1613355 -1602260 -1589066 -1576582 -1562564 -1551541
8409 -1551541 -1543383 -1533923 -1514072 -1489863 -1486429 -1570370 -1759623 -1903701 -1929282 -1902397 -1870765 -1841858
8397 -1841858 -1814095 -1794776 -1782027 -1770672 -1759785 -1751169 -1741037 -1734526 -1729587 -1726941 -1722864 -1719038 -1717050
8384 -1717050 -1717587 -1713565 -1709059 -1703972 -1697896 -1691123 -1684697 -1682212 -1680418 -1679326 -1675232 -1671336 -1674746 -1672895
8370a672895J987k563R80O090M458O078M151K792J292p26J581K744N54L012j580
8355a642045K296L059N306j083j804L310K593N402N280J09j191R1K813K795K758
8340a610311L706L23m20J810n190m784l110Q68l24N18K762K707R84J553P98J379
8324a606731k23K722O534N73k642P695O652K462K704j895l20L050L352N52J088
8309a574427M336L928L073L630K08M69J188J479j259p68R373O336l395J181L315
8294a541333L552J644J454M287J919M761K898P229N159Q21O037Q139P916J4827
8280a470690J6843J1001n930m6177p5507n1310j1396J2123J5193R593J0975R991
8268a575291O892Q297N843L546P758K830M713J662L600K782O97k144j043O26N525
$$ plain form
8370 -1672895 -1670908 -1673471 -1672491 -1666401 -1661943 -1655865 -1651714 -1648922 -1647630 -1648356 -1646775 -1644031 -1643477 -1640465 -1642045
8355 -1642045 -1639749 -1636690 -1631384 -1632467 -1634271 -1630961 -1628368 -1622966 -1617686 -1617577 -1618768 -1618677 -1615864 -1613069 -1610311
8340 -1610311 -1606605 -1606282 -1606702 -1604892 -1610082 -1614866 -1617976 -1617108 -1617432 -1616914 -1614152 -1611445 -1610461 -1608908 -1608110 -1606731
8324 -1606731 -1606954 -1604232 -1597698 -1597125 -1599767 -1592072 -1585420 -1582958 -1580254 -1582149 -1582469 -1579419 -1576067 -1575515 -1574427
8309 -1574427 -1570091 -1566163 -1563090 -1559460 -1559252 -1558783 -1557595 -1556116 -1557375 -1558143 -1548770 -1542434 -1545829 -1544648 -1541333
8294 -1541333 -1537781 -1536137 -1534683 -1530396 -1528477 -1523716 -1520818 -1513589 -1508430 -1507609 -1501572 -1493433 -1485517 -1470690
8280 -1470690 -1453847 -1442846 -1448776 -1494953 -1570460 -1621770 -1633166 -1621043 -1605850 -1596257 -1585282 -1575291
8268 -1575291 -1568399 -1560102 -1554259 -1550713 -1542955 -1540125 -1535412 -1533750 -1530150 -1527368 -1526671 -1528815 -1529858 -1529232 -1523707
8253a523707L710N664O494k45L860O162N618O132L998N803O207J0034J2362J2332
8239a435576J2244j295l8323p1164n4211j1583R563J5125J2884R131N936N617
8227a541652Q995P932J632O192K372J208L768M475J654m71j160L361K024p30n0
8212a500450j267J738l345J011K318N049M066K097K079L008k301k6K190L506L820
8197a476507j73R33J633J082o95K526J87k42J465P78J385K353K819K320L81O23
8181a459132L161K468j680L007K375m39J099L167K794K866q87j783j542J787J971
8166a440768q50j107K474J234L260L67k119M91r41J943J324K624K798m37n98K603
8150a427702K629N229N98j623j608J529J845k391k306O4M881N591K665j387o03
$$ plain form
8253 -1523707 -1519997 -1514333 -1507839 -1508084 -1504224 -1498062 -1492444 -1486312 -1482314 -1476511 -1470304 -1460270 -1447908 -1435576
8239 -1435576 -1423332 -1424627 -1462950 -1534114 -1588325 -1599908 -1590345 -1575220 -1562336 -1553205 -1547269 -1541652
8227 -1541652 -1532657 -1524725 -1523093 -1516901 -1514529 -1513321 -1509553 -1505078 -1503424 -1503895 -1505055 -1501694 -1499670 -1500400 -1500450
8212 -1500450 -1501717 -1499979 -1503324 -1502313 -1499995 -1494946 -1490880 -1488783 -1486704 -1483696 -1485997 -1486023 -1483833 -1480327 -1476507
8197 -1476507 -1476680 -1475747 -1474114 -1473032 -1473727 -1471201 -1471014 -1471256 -1469791 -1469013 -1467628 -1465275 -1462456 -1460136 -1459755 -1459132
8181 -1459132 -1455971 -1453503 -1455183 -1452176 -1449801 -1450240 -1449141 -1445974 -1443180 -1440314 -1441201 -1442984 -1444526 -1442739 -1440768
8166 -1440768 -1441618 -1442725 -1440251 -1439017 -1435757 -1435390 -1437509 -1437018 -1437959 -1436016 -1434692 -1432068 -1429270 -1429707 -1430305 -1427702
8150 -1427702 -1425073 -1419844 -1419246 -1420869 -1422477 -1420948 -1419103 -1421494 -1423800 -1423736 -1418855 -1413264 -1410599 -1411986 -1412589
8135a412589K397J070K012M508k70m433j742m42L925J571L901L227k508j580n98
8120a401551j387M81M458M408J019n89p35k486J979K422M573k197k778k84M907
8105a387760N464O22Q71l60r15K678K900J275k522K92J27K002O127L427Jjk362
8088a368134J105n65J127J161j60m83m56p7L013P14k168M42j965K376P787k25
8072a356508j478k934J456K602M265N159J542j859L552q39k302M24J610n31j917
8057a347758J320M591K486j579p98j753J693M3j148o21O03L756P96j402j573K610
8041a338734M095L059k178J181L037L300Q38j212J329r25K106j219L14R38J679
8026a322392K336L613N018j63k730J349K980J856j892j170K54L088N13L095J126
$$ plain form
8135 -1412589 -1410192 -1409122 -1407110 -1402602 -1402872 -1407305 -1409047 -1409489 -1405564 -1403993 -1400092 -1396865 -1399373 -1400953 -1401551
8120 -1401551 -1402938 -1402457 -1397999 -1393591 -1392572 -1393161 -1393896 -1396382 -1394403 -1391981 -1387408 -1389605 -1392383 -1392667 -1387760
8105 -1387760 -1382296 -1381674 -1380803 -1381163 -1382078 -1379400 -1376500 -1375225 -1377747 -1377455 -1377328 -1375326 -1369199 -1365772 -1365771 -1365772 -1368134
8088 -1368134 -1367029 -1367594 -1366467 -1365306 -1365466 -1365949 -1366405 -1366482 -1363469 -1362755 -1364923 -1364481 -1366446 -1364070 -1356283 -1356508
8072 -1356508 -1357986 -1360920 -1359464 -1356862 -1352597 -1347438 -1345896 -1347755 -1344203 -1345042 -1347344 -1346920 -1345310 -1345841 -1347758
8057 -1347758 -1346438 -1341847 -1339361 -1340940 -1341738 -1343491 -1341798 -1341755 -1342903 -1343524 -1342921 -1339165 -1338369 -1339771 -1341344 -1338734
8041 -1338734 -1334639 -1331580 -1333758 -1332577 -1329540 -1326240 -1325402 -1326614 -1325285 -1326210 -1324104 -1325323 -1325009 -1324071 -1322392
8026 -1322392 -1320056 -1316443 -1311425 -1311588 -1314318 -1312969 -1309989 -1308133 -1310025 -1311195 -1310941 -1307853 -1307340 -1304245 -1303119
8011a303119n63j560p90J588K642K195R33j521k58n730P97m71L161M563l267l606
7995a305006j622M323K464J352j24M6J008L508K778J910m21J089L689oj671j406
7979a288089N9J314j694l521N389o9n17j399J985K343J75Q99L443K108o29j573
7963a279776j594O87M198K25k28L328K418j350k006p67o09J591J575K918L170
7948a266220j274L526K293Q4J673j147J991K699k28J163J246m03J876p86J31j883
7932a255259J380l048l509j68m92J142L274L695K898K72Q63N02o74J232M739J338
7916a241815q2J479M004j463j271J406M260l815o13J830R56k398j699J406L016
7901a234799n75O10M145M020k54k221l64l2j081q01L63Q37L205K004j59J520K009
$$ plain form
8011 -1303119 -1303682 -1305242 -1306032 -1304444 -1301802 -1299607 -1298674 -1300195 -1300453 -1306183 -1305386 -1305857 -1302696 -1298133 -1301400 -1305006
7995 -1305006 -1306628 -1302305 -1299841 -1298489 -1298613 -1298567 -1297559 -1294051 -1291273 -1289363 -1289784 -1288695 -1285006 -1285012 -1286683 -1288089
7979 -1288089 -1288030 -1286716 -1288410 -1291931 -1286542 -1286611 -1287128 -1288527 -1286542 -1284199 -1284024 -1283125 -1279682 -1277574 -1278203 -1279776
7963 -1279776 -1281370 -1280683 -1276485 -1276260 -1276488 -1273160 -1270742 -1272092 -1274098 -1274865 -1275474 -1273883 -1272308 -1269390 -1266220
7948 -1266220 -1267494 -1263968 -1261675 -1261591 -1259918 -1261065 -1259074 -1256375 -1256603 -1255440 -1254194 -1254597 -1252721 -1253507 -1253376 -1255259
7932 -1255259 -1253879 -1256927 -1260436 -1260604 -1261096 -1259954 -1256680 -1252985 -1250087 -1249815 -1248952 -1248450 -1249124 -1247892 -1243153 -1241815
7916 -1241815 -1241897 -1240418 -1236414 -1237877 -1239148 -1237742 -1233482 -1237297 -1237910 -1236080 -1235124 -1237522 -1239221 -1237815 -1234799
7901 -1234799 -1235374 -1234764 -1230619 -1226599 -1226853 -1229074 -1229438 -1229470 -1230551 -1231352 -1230989 -1230152 -1226947 -1224943 -1225102 -1223582 -1221573
7884a221573m30R45n13N10J966R24Q40m21r03O43j541j463k706J782N00K159J356
7867a217925j332q56J529J374J046K067J353J503L196J226k981j556O99j232L019
7852a208870K790L60J460K509J643j829N55J28k17P29K72J036j005M84L363j019
7836a197611n44k08l40J520L666n9l626J987M636l282k974j209j653J979J218
7821a196500N09J497R89K254o88j545o53K554K256Q64k773R33K839J672J835k606
7805a186563n69L321K7k179M991N804K934K3j207m789k024J815K148K615j422
7790a175075M79o67m06j83J17l135m26N632K918j417k184k544o69L275J213N647
7774a167425r16j983J753K388l028j489J542K229K728O50M0K857q08k875r16L653
$$ plain form
7884 -1221573 -1222003 -1221058 -1221571 -1221061 -1219095 -1218171 -1217331 -1217752 -1218655 -1218012 -1219553 -1221016 -1223722 -1221940 -1221440 -1219281 -1217925
7867 -1217925 -1219257 -1220113 -1218584 -1217210 -1216164 -1214097 -1212744 -1211241 -1208045 -1206819 -1209800 -1211356 -1210657 -1211889 -1208870
7852 -1208870 -1206080 -1205720 -1204260 -1201751 -1200108 -1201937 -1201382 -1201254 -1201471 -1200742 -1200470 -1199434 -1200439 -1199955 -1196592 -1197611
7836 -1197611 -1198155 -1198363 -1198703 -1197183 -1193517 -1193576 -1197202 -1195215 -1190579 -1193861 -1196835 -1198044 -1199697 -1197718 -1196500
7821 -1196500 -1195991 -1194494 -1193505 -1191251 -1191939 -1193484 -1194137 -1191583 -1189327 -1188463 -1191236 -1190303 -1187464 -1185792 -1183957 -1186563
7805 -1186563 -1187132 -1183811 -1183784 -1185963 -1180972 -1175168 -1172234 -1172211 -1173418 -1178207 -1180231 -1178416 -1176268 -1173653 -1175075
7790 -1175075 -1174596 -1175263 -1175669 -1175852 -1175735 -1178870 -1179296 -1173664 -1170746 -1172163 -1174347 -1176891 -1177560 -1174285 -1173072 -1167425
7774 -1167425 -1168341 -1170324 -1168571 -1166183 -1169211 -1170700 -1169158 -1166929 -1164201 -1163551 -1163511 -1160654 -1161462 -1164337 -1165253 -1161600
7758a161600K256J723J464K527j399k893P69J00R25L130M332p26j161K6k661J217
7742a151971K891K829j55l152L500J473l592K955q13j665j730N032m021j029L53
7727a149095J160L017j066m08M783J796J410j787J187M287P58j190j60K67k394
7712a137435L361J190j526N04K641j65l68j340K061M951K916n99k179K397K28
7697a123363j685J04R63K897l04j060q93J48J774k52K876J422j437k1l487J973
7681a120345L347K955k87k345j518n12l285o65O06K381N252j948j960P04O044
7666a111576L438j427k21j250L83K023K764K255l599Q58K937M415j192k564r75
7651a103731l722o60j63P25L172L317k227J900R84j308J157L164J704R89Q60O48
$$ plain form
7758 -1161600 -1159344 -1157621 -1156157 -1153630 -1155029 -1157922 -1157153 -1157053 -1156128 -1152998 -1148666 -1149392 -1150553 -1150527 -1153188 -1151971
7742 -1151971 -1149080 -1146251 -1146406 -1149558 -1146058 -1144585 -1148177 -1145222 -1146035 -1147700 -1149430 -1144398 -1148419 -1149448 -1149095
7727 -1149095 -1147935 -1144918 -1145984 -1146392 -1141609 -1139813 -1138403 -1140190 -1139003 -1134716 -1133958 -1135148 -1135308 -1135041 -1137435
7712 -1137435 -1134074 -1132884 -1134410 -1133906 -1131265 -1131430 -1131798 -1133138 -1131077 -1126126 -1123210 -1123809 -1125988 -1123591 -1123363
7697 -1123363 -1125048 -1124944 -1123981 -1121084 -1121388 -1122448 -1123341 -1123193 -1121419 -1121671 -1118795 -1117373 -1118810 -1118831 -1122318 -1120345
7681 -1120345 -1116998 -1114043 -1114330 -1116675 -1118193 -1118705 -1121990 -1122655 -1122049 -1119668 -1114416 -1116364 -1118324 -1117620 -1111576
7666 -1111576 -1108138 -1109565 -1109786 -1111036 -1110653 -1108630 -1105866 -1103611 -1107210 -1106352 -1103415 -1099000 -1100192 -1102756 -1103731
7651 -1103731 -1107453 -1108113 -1108276 -1107551 -1104379 -1101062 -1103289 -1101389 -1100405 -1101713 -1100556 -1097392 -1095688 -1094699 -1093839 -1093191
7635a093191O92J761j709j688m95j65J145k709K237K509J977Q65P11K062L351
7620a082647j278j316k285l009J223M189M59k31l210j599J327J424N66O21M20
7605a085346M02J020M366J050j885J676k269j059M853L414l377l707L07J405o28
7590a079778j917O115M158J849k843j661n5j297j462K511q47l134K487M324J983
7575a069567j493k058N99J547O244K60l973P37K158M311M77k04k439k537O3l889
7559a069764K292L059K773j669k210J234L523K354J510n09L974j706m397J632
7545a057904L991L06j023o1q01j202J104K647M288L200k804n93N82j709r70l908
7529a054857J28J927J904q13L356l22k317K204K806j748n6j622k051L754L567
$$ plain form
7635 -1093191 -1092499 -1090738 -1092447 -1094135 -1094630 -1094795 -1093650 -1096359 -1094122 -1091613 -1089636 -1088771 -1088060 -1085998 -1082647
7620 -1082647 -1083925 -1085241 -1087526 -1090535 -1089312 -1085123 -1084664 -1084895 -1088105 -1089704 -1088377 -1086953 -1086387 -1085766 -1085346
7605 -1085346 -1084944 -1083924 -1079558 -1078508 -1080393 -1078717 -1080986 -1082045 -1077192 -1073778 -1077155 -1080862 -1080555 -1079150 -1079778
7590 -1079778 -1081695 -1075580 -1071422 -1069573 -1072416 -1074077 -1074132 -1075429 -1076891 -1074380 -1075227 -1078361 -1075874 -1071550 -1069567
7575 -1069567 -1071060 -1073118 -1072519 -1070972 -1064728 -1064468 -1068441 -1067704 -1065546 -1061235 -1060758 -1060962 -1063401 -1065938 -1065875 -1069764
7559 -1069764 -1067472 -1064413 -1061640 -1063309 -1065519 -1064285 -1060762 -1058408 -1056898 -1057407 -1053433 -1055139 -1059536 -1057904
7545 -1057904 -1053913 -1053607 -1054630 -1054691 -1055492 -1056694 -1055590 -1052943 -1048655 -1045455 -1048259 -1048852 -1048270 -1049979 -1050949 -1054857
7529 -1054857 -1054729 -1052802 -1050898 -1051711 -1048355 -1048677 -1050994 -1048790 -1045984 -1047732 -1047788 -1049410 -1051461 -1047707 -1044140
7514a044140J768R38k100j208L79N592L125J20j606k022k668k180J699J490O38
7499a040175J619M75l020j128K908N425L103P72k067j094P26K091L3k758o67Q14
7483a032943J845L93k540J399K524P44j568J589K588L002J501k482k643K089K65
7468a024237p97k880j508M808R9j074j095k743L149M264j1l615J142r32J317K403
7452a021710L205R55k443J218L193J733p62j049O75k520M28J19m03j301L510L959
7436a011193j245j536j028K636J30j84k090M06J950J479K650K445j753k8o02n28
7420a008491L635Q66q31K94M47m70Q68k32J040J849J152k019O99J368K480j595
7404i98940J45N76j276L592k462Q97J083L67K16L76j180k05m53o4n55L420N270
$$ plain form
7514 -1044140 -1042372 -1041434 -1043534 -1044742 -1044363 -1038771 -1035646 -1035526 -1037132 -1039154 -1041822 -1044002 -1042303 -1040813 -1040175
7499 -1040175 -1038556 -1038081 -1041101 -1042229 -1039321 -1033896 -1030793 -1030021 -1032088 -1033182 -1032456 -1030365 -1030332 -1033090 -1033757 -1032943
7483 -1032943 -1031098 -1030705 -1033245 -1031846 -1029322 -1028578 -1030146 -1028557 -1025969 -1022967 -1021466 -1023948 -1026591 -1024502 -1024237
7468 -1024237 -1025034 -1027914 -1029422 -1024614 -1024515 -1025589 -1026684 -1029427 -1026278 -1022014 -1022025 -1025640 -1024498 -1025430 -1024113 -1021710
7452 -1021710 -1018505 -1017550 -1019993 -1018775 -1015582 -1013849 -1014611 -1015660 -1014985 -1017505 -1017077 -1016958 -1017361 -1018662 -1015152 -1011193
7436 -1011193 -1012438 -1013974 -1015002 -1012366 -1012236 -1012420 -1014510 -1014104 -1012154 -1010675 -1008025 -1005580 -1007333 -1007361 -1007963 -1008491
7420 -1008491 -1004856 -1003990 -1004821 -1004527 -1004080 -1004550 -1003682 -1003914 -1002874 -1001025 -999873 -1001892 -1001193 -999825 -997345 -998940
7404 -998940 -998795 -998219 -999495 -995903 -998365 -997468 -996385 -996018 -995802 -995426 -996606 -996811 -997264 -997328 -997883 -994463 -989193
7387i89193J544q16l070J468J369L08o78j742N45l58P40J849j396J410k962m81
7371i91463J79j47j791Q12K152K578m87r2L217N30N24J500R54j79j010L63K215
7354i80145N59l429K188Q64O06n27j56k298l779r66L059J629L90N121P12P00O52
7337i74820K043J070k765l432q36K02n47j491j237L448K310j574J297K216n77
7322i74693K34J167j171k43O070K558l195n92K633N49N26J837j126m337j711J140
7306i70354L062N41M68j306K411J354j899k615k920M76J695O648K50p24r29J122
7290i62720l346j412J309K719J766P20r99o03L544M46k666K310j414j436J862
7275i59920o5j944K336M97P16J430K430P58N10J462j887J458M879K075K038j389
$$ plain form
7387 -989193 -987649 -988465 -991535 -990067 -988698 -988390 -989068 -990810 -990265 -990623 -989883 -988034 -989430 -988020 -990982 -991463
7371 -991463 -991284 -991431 -993222 -992410 -990258 -987680 -988167 -988259 -985042 -984512 -983988 -982488 -981534 -981713 -982723 -982360 -980145
7354 -980145 -979586 -983015 -980827 -979963 -979357 -979884 -980040 -982338 -986117 -987083 -984024 -982395 -982005 -976884 -976172 -975472 -974820
7337 -974820 -972777 -971707 -974472 -977904 -978740 -978538 -979085 -980576 -981813 -978365 -976055 -977629 -976332 -974116 -974693
7322 -974693 -974459 -973292 -974463 -974706 -968636 -966078 -969273 -969865 -967232 -966683 -966157 -964320 -965446 -969783 -971494 -970354
7306 -970354 -967292 -966751 -966283 -967589 -965178 -963824 -965723 -968338 -971258 -970782 -969087 -962439 -962189 -962913 -963842 -962720
7290 -962720 -966066 -967478 -966169 -963450 -961684 -960964 -961963 -962566 -959022 -958576 -961242 -958932 -960346 -961782 -959920
7275 -959920 -959985 -961929 -959593 -959096 -958380 -956950 -954520 -953762 -953252 -951790 -953677 -952219 -947340 -945265 -943227 -944616
7259i44616j19k123k146R59J7J411j449m87j937J627M29l74k51J23L822N10j590
7242i46194l35k860L81N37J507j889N56K252J755k407J076j059j632J235J66O96
7226i46215J254K274L120M05j413P93r21j384J392r16j744K892L368K167l14R58
7210i34284J799K951m33k697mJ613l248l543N825j239l324p43J115N244K466N66
7194i27936K223k105o97K387j436k698k070J475J916l351q81J967J113j583j076
7179i32752K245o64q60K029M092L045J86p81N46K366L668J975r12r63k059L147
7163i15692P85n743j428l925l072oK97J577N230K935M247j863q85J255K622M61
$$ plain form
7259 -944616 -944735 -946858 -949004 -948045 -948028 -946617 -948066 -948553 -950490 -948863 -948434 -948808 -949059 -948936 -945114 -944604 -946194
7242 -946194 -946529 -949389 -949008 -948471 -946964 -948853 -948297 -946045 -944290 -946697 -945621 -946680 -948312 -947077 -946911 -946215
7226 -946215 -944961 -942687 -939567 -939162 -940575 -939782 -940703 -942087 -940695 -941611 -943355 -940463 -937095 -934928 -935242 -934284
7210 -934284 -932485 -929534 -929967 -932664 -932668 -931055 -934303 -937846 -932021 -933260 -936584 -937327 -936212 -930968 -928502 -927936
7194 -927936 -925713 -927818 -928515 -926128 -927564 -930262 -932332 -930857 -928941 -932292 -933173 -931206 -930093 -931676 -932752
7179 -932752 -930507 -931171 -932031 -930002 -925910 -922865 -922679 -923460 -922914 -920548 -916880 -914905 -915817 -916780 -918839 -915692
7163 -915692 -914907 -920650 -922078 -926003 -929075 -929081 -928784 -927207 -921977 -919042 -914795 -916658 -917543 -916288 -913666 -913205
$$ [...]
##END NTUPLES=NMR SPECTRUM
##END=
