##TITLE=Analysis number 327748
Compound Code km 03009
Book Reference 194978 a
Project Code adrs flro3
Chemist Name jom
##JCAMPDX= 6.0         $$ Bruker NMR JCAMP-DX V2.0
##DATA TYPE= NMR SPECTRUM
##DATA CLASS= NTUPLES
##ORIGIN= Bruker BioSpin GmbH
##OWNER= nmr
$$ XWIN-NMR		Version 3.5
$$ Tue Apr  3 13:28:46 2007 GMT Daylight Time (UT+1h)  MAYBRIDGE\nmr@NMR_250MHZ
##.OBSERVE FREQUENCY= 250.131544655141
##.OBSERVE NUCLEUS= ^1H
##.ACQUISITION MODE= SIMULTANEOUS (DQD)
##.ACQUISITION SCHEME= undefined
##.AVERAGES= 16
##.DIGITISER RES= 18
##SPECTROMETER/DATA SYSTEM= dpx250
##.PULSE SEQUENCE= zg30
##.SOLVENT NAME= DMSO
##.SHIFT REFERENCE= (INTERNAL, DMSO, 0, 16.522)
##AUDIT TRAIL= $$ (NUMBER, WHEN, WHO, WHERE, WHAT)
$$ ##TITLE= Audit trail, XWIN-NMR		Version 3.5
$$ ##JCAMPDX= 5.01
$$ ##ORIGIN= Bruker BioSpin GmbH
$$ ##OWNER= nmr
$$ C:\u/data/dgb/nmr/ADRS/380/pdata/1/auditp.txt
$$ ##AUDIT TRAIL=  $$ (NUMBER, WHEN, WHO, WHERE, WHAT)
(   1,<2007-04-03 13:28:21.35 +100>,<MAYBRIDGE\nmr>,<NMR_250MHZ>,
      <created by zg, POWCHK disabled, PULCHK disabled
       configuration hash MD5:
       49 4B E0 1D 92 C2 6B 37 9F E6 65 BC 52 41 86 1D
       data hash MD5: 64K
       37 32 0A D1 EC 03 4E AE C7 67 D2 E9 5D B0 02 A0>)
(   2,<2007-04-03 13:28:36.07 +100>,<MAYBRIDGE\nmr>,<NMR_250MHZ>,
      <Start of raw data processing
       ef LB = 0.3 FT_mod = 6 PKNL = 1 SI = 32K 
       data hash MD5: 32K
       58 6E CE 25 32 4A A1 F0 A1 41 A9 E2 F6 07 55 3F>)
(   3,<2007-04-03 13:28:37.74 +100>,<MAYBRIDGE\nmr>,<NMR_250MHZ>,
      <apk 
       data hash MD5: 32K
       35 4F A3 29 09 16 FF 9B 4C 61 32 AA 14 FD E6 D9>)
(   4,<2007-04-03 13:28:38.51 +100>,<MAYBRIDGE\nmr>,<NMR_250MHZ>,
      <abs ABSG = 5 
       data hash MD5: 32K
       09 C7 15 86 74 F5 76 A5 28 9C CF DF 7E 01 9E 31>)
$$ ##END=
$$ 
$$ hash MD5
$$ 5A FC C7 27 A0 26 42 2D D6 24 1F FD FE B0 D9 D2
##$RELAX= 
##$RELAX= 
##$RELAX= 
##$RELAX= 
##$RELAX= 
##$RELAX= 
##$RELAX= 
$$ Bruker specific parameters
$$ --------------------------
##$DU= <C:\u>
##$EXPNO= 380
##$NAME= <ADRS>
##$PROCNO= 1
##$TYPE= <nmr>
##$USER= <dgb>
##$AMP= (0..31)
100 100 100 100 100 100 100 100 100 100 100 100 100 100 100 100 100 100 
100 100 100 100 100 100 100 100 100 100 100 100 100 100 
##$AQSEQ= 0
##$AQ_mod= 3
##$AUNM= <au_zg>
##$AUTOPOS= <13 >
##$BF1= 250.13
##$BF2= 250.13
##$BF3= 250.13
##$BF4= 250.13
##$BF5= 500.13
##$BF6= 500.13
##$BF7= 500.13
##$BF8= 500.13
##$BYTORDA= 1
##$CFDGTYP= 0
##$CFRGTYP= 5
##$CHEMSTR= <none>
##$CNST= (0..31)
1 1 145 1 1 1 1 1 1 1 1 1 1 1 1 1 1 1 1 1 1 1 1 1 1 1 1 1 1 1 1 1 
##$CPDPRG= <>
##$CPDPRG1= <>
##$CPDPRG2= <>
##$CPDPRG3= <>
##$CPDPRG4= <mlev>
##$CPDPRG5= <mlev>
##$CPDPRG6= <mlev>
##$CPDPRG7= <mlev>
##$CPDPRG8= <mlev>
##$CPDPRGB= <>
##$CPDPRGT= <>
##$D= (0..31)
0 1 0 0 0 0 0 0 0 0.06 0 0 0 0 0 0 0.0002 0 0 0 0 0 0 0 0 0 0 0 0 0 0 
0 
##$DATE= 1175603299
##$DBL= (0..7)
120 120 120 120 120 120 120 120 
##$DBP= (0..7)
150 150 150 150 150 150 150 150 
##$DBP07= 0
##$DBPNAM0= <>
##$DBPNAM1= <>
$$ [...]
##$SUBNAM7= <"">
##$SUBNAM8= <"">
##$SUBNAM9= <"">
##$SW= 20.6930455092707
##$SWIBOX= (0..15)
0 0 3 0 0 0 0 0 0 0 0 0 0 0 0 0 
##$SW_h= 5175.983436853
##$TD= 65536
##$TD0= 1
##$TE= 683.16
##$TE2= 300
##$TE3= 300
##$TEG= 300
##$TL= (0..7)
0 120 120 120 120 120 120 120 
##$TP= (0..7)
150 150 150 150 150 150 150 150 
##$TP07= 0
##$TPNAME0= <>
##$TPNAME1= <>
##$TPNAME2= <>
##$TPNAME3= <>
##$TPNAME4= <>
##$TPNAME5= <>
##$TPNAME6= <>
##$TPNAME7= <>
##$TPOAL= (0..7)
0.5 0.5 0.5 0.5 0.5 0.5 0.5 0.5 
##$TPOFFS= (0..7)
0 0 0 0 0 0 0 0 
##$TUNHIN= 0
##$TUNHOUT= 0
##$TUNXOUT= 0
##$USERA1= <user>
##$USERA2= <user>
##$USERA3= <user>
##$USERA4= <user>
##$USERA5= <user>
##$V9= 5
##$VALIST= <valist>
##$VCLIST= <CCCCCCCCCCCCCCC>
##$VD= 0
##$VDLIST= <DDDDDDDDDDDDDDD>
##$VPLIST= <PPPPPPPPPPPPPPP>
##$VTLIST= <TTTTTTTTTTTTTTT>
##$WBST= 1024
##$WBSW= 4
##$XGAIN= (0..3)
0 0 0 0 
##$XL= 0
##$YL= 0
##$YMAX_a= 415081
##$YMIN_a= -490743
##$ZGOPTNS= <>
##$ZL1= 120
##$ZL2= 120
##$ZL3= 120
##$ZL4= 120
##$ABSF1= 16.522
##$ABSF2= -4.171173
##$ABSG= 5
##$ABSL= 3
##$ALPHA= 0
##$AQORDER= 0
##$ASSFAC= 0
##$ASSFACI= 0
##$ASSFACX= 0
##$ASSWID= 0
##$AUNMP= <proc_1d>
##$AZFE= 0.1
##$AZFW= 0.1
##$BCFW= 0
##$BC_mod= 0
##$BYTORDP= 0
##$COROFFS= 0
##$CY= 12.5
##$DATMOD= 1
##$DC= 0
##$DFILT= <>
##$DTYPP= 0
##$F1P= 14.0000005364418
##$F2P= -0.99999901652339
##$FCOR= 0.5
##$FTSIZE= 32768
##$FT_mod= 6
##$GAMMA= 0
##$GB= 0
##$INTBC= 1
##$INTSCL= 1
##$ISEN= 128
##$LB= 0.3
##$LEV0= 0
##$LPBIN= 0
##$MAXI= 10000
##$MC2= 0
##$MEAN= 0
##$ME_mod= 0
##$MI= 0
##$NCOEF= 0
##$NC_proc= -4
##$NLEV= 6
##$NOISF1= 0
##$NOISF2= 0
##$NSP= 0
##$NTH_PI= 0
##$NZP= 0
##$OFFSET= 16.522
##$PC= 1
##$PHC0= 223.7103
##$PHC1= 4.157219
##$PH_mod= 1
##$PKNL= yes
##$PPARMOD= 0
##$PSCAL= 4
##$PSIGN= 0
##$REVERSE= no
##$SF= 250.13
##$SI= 32768
##$SIGF1= 0
##$SIGF2= 0
##$SINO= 400
##$SIOLD= 32768
##$SREGLST= <1H.DMSO>
##$SSB= 0
##$STSI= 32768
##$STSR= 0
##$SW_p= 5175.98343685301
##$SYMM= 0
##$S_DEV= 0
##$TDeff= 65536
##$TDoff= 0
##$TI= <Analysis number 999999
Compound Code 99
Book Reference 9
Project Code 9>
##$TILT= no
##$TM1= 0
##$TM2= 0
##$TOPLEV= 0
##$USERP1= <user>
##$USERP2= <user>
##$USERP3= <user>
##$USERP4= <user>
##$USERP5= <user>
##$WDW= 1
##$XDIM= 32768
##$YMAX_p= 396887141
##$YMIN_p= -223247
$$ End of Bruker specific parameters
$$ ---------------------------------
##NTUPLES= NMR SPECTRUM
##VAR_NAME=  FREQUENCY,     SPECTRUM/REAL,   SPECTRUM/IMAG
##SYMBOL=    X,             R,               I
##VAR_TYPE=  INDEPENDENT,   DEPENDENT,       DEPENDENT
##VAR_FORM=  AFFN,          ASDF,            ASDF
##VAR_DIM=   32768,         32768,           32768
##UNITS=     HZ,            ARBITRARY UNITS, ARBITRARY UNITS
##FACTOR=    0.157963299565203, 1,           1
##FIRST=     4132.6476996994, 0,             0
##LAST=      -1043.33573715361, 0,           0
##MIN=       -1043.33573715361, -223247,     0
##MAX=       4132.6476996994, 396887141,     0
$$ Real data points
##PAGE= N=1
##DATA TABLE= (X++(R..R)), XYDATA
$$ [...]
19532A517695L7143O5961O5766J72204K34862J92804K76405L25064J61594J11103
19522C160601K01681J81718J88497L78440M97433O21031O73664P47102R26938
19513G577105J155220J597919K354378L605803N517041Q641113J2811638J6851374
19505F0111591J8092576J5403148N130408j1204847j6111065q811242L61850Q210256
19497G1182675J3852320J5215924J1547206j822757j9266477k1596964j4393910
19490E4718017q791732n989159m375478l199112k180812j412079p62833j76131
19482B7830681J85582K27604L50758J300031L243012O381840J0656549J5565820
19474F5741877J8517245J7466746J0264912p063817j8846978j3913199l723062
$$ y = [1517695, 1554838, 1620799, 1686565, 1858769, 2093631, 2286435, 2562840, 2887904, 3049498, 3160601, 3362282, 3544000, 3732497, 4110937, 4608370, 5229401, 5903065, 6650167, 7577105, 8732325, 10330244, 12684622, 16290425, 21807466, 30448579, 43260217, 60111591, 78204167, 93607315, 98737723, 87532876, 71421811, 62610569, 62972419, 71182675, 85034995, 100250919, 111798125, 109975368, 90708891, 69111927, 54718017, 45926285, 39937126, 35561648, 32362536, 30181724, 28769645, 28006812, 27830681, 28016263, 28243867, 28594625, 29894656, 33137668, 39519508, 50176057, 65741877, 84259122, 101725868, 111990780, 104926963, 86079985, 72166786, 68443724]
19467F8443724M986833J1767930J4792692J2966548L600556j4284206k3042888
19460G9231189j7908615j1135272p512972n792671m580009l485878k643859j943781
19452B4228132j375595j078044j135145j670014j980919j937798j685335j359094
19444A2006188j097787r08775q59984q84262r25003p56589n80395l94756m06824
19435E191813m13353l52855l00058l38260l01077k73766l45993k30954k16949
19426B418548k31709j63248j75590r8604j08846j01061r1763o7348n3339m1168
19416A285872n4501m0952k2565n5889j38639o8589q2756P813k0634p0185J9101
19405G58076n3328p4709m3227l7188k8211k8094j7724L409j070J9842l7763J170
$$ y = [68443724, 73430557, 85198487, 99991179, 112957727, 116558283, 102274077, 79231189, 61322574, 50187302, 42674330, 36881659, 32301650, 28815772, 26171913, 24228132, 22852537, 21774493, 20639348, 18969334, 16988415, 15050617, 13365282, 12006188, 10908401, 9999626, 9139642, 8255380, 7330377, 6573788, 5993393, 5598637, 5191813, 4778460, 4425605, 4125547, 3787287, 3486210, 3212444, 2866451, 2635497, 2418548, 2186839, 2023591, 1848001, 1749397, 1640551, 1539490, 1447727, 1380379, 1327040, 1285872, 1231371, 1190419, 1167854, 1111965, 973326, 904737, 821981, 829794, 809160, 738975, 758076, 704748, 630039, 586812, 549624, 521413, 493319, 475595, 479004, 477934, 497776, 460013, 461183]
19393D61183n4885K3378m2717K020L77k9450J9930k2003M4102K7820K4783L4279
19381D88817L437o792M7015l318o4793n4633l4104n5910k5984N1546P3476J6935
19369D35692m7370l0816J7736j7336p0577r17O729J6540j0227k4884l2781J0621
19357B52410K1120o0440R729J0860l8625J0928N7849J8291l4956K4495J06025
19346C77686L8178k2369j03447n577L4002L7601L0497J2096J891m1537l8025n5610
19334B65386n5823l4199j505K4111l782O531q189R201j3752J1793L7484K1542
19322B58798k0130o8578m9135n5394P868L2017L2184J9413J6778K589K1078k7236
19310A70252p109J362r981k6282L3481J2018j2212p7444k1005L8884J2272L0260
$$ y = [461183, 406298, 429676, 386959, 388979, 389356, 359906, 379836, 357833, 401935, 429755, 454538, 488817, 492254, 485462, 532477, 529159, 464366, 409733, 375629, 319719, 293735, 345281, 418757, 435692, 388322, 357506, 375242, 357906, 287329, 286412, 293141, 309681, 299454, 274570, 241789, 252410, 273530, 213090, 222819, 233679, 195054, 205982, 263831, 282122, 247166, 271661, 377686, 415864, 393495, 290048, 284471, 318473, 356074, 386571, 398667, 400558, 359021, 320996, 265386, 209563, 175364, 173859, 197970, 194188, 200719, 192530, 201731, 187979, 199772, 237256, 258798, 238668, 170090, 120955, 65561, 73429, 105446, 137630, 157043, 173821, 176410, 197488, 170252, 163143, 164505, 154524, 128242, 161723, 173741, 161529, 84085, 63080, 101964, 114236, 144496]
19298A44496K636j3068m473P548k6047k8423M3944o1323n8850L4912J5913N7043
19286A14308M1609L2162l2849n223l6922k0446o488K5107K5564q160j6637p3659
19274C8366o8165l3124j6034J1016K8586L6400K0439P752j0217J3217O753k023
19262C2966r193l442J5767J1366K8552j0320o1164M6165Q2610P2722J5125k7650
19250A93504n6453k3644R593J1466l6979k08m7121j2718R7100K5766Q756m2965
19238A26097o6865K9637L8747L862l8099N972j0375m4872M3872K0754j7939j4727
19226G6064J1965p607n4685o1648K9287j1630M2757L1539k5141k0123M2662P0150
19214A23590K7051j4054P468N610k064O554l3311o8677m4293P0666M9153J1673
$$ y = [144496, 147132, 134064, 129591, 137139, 111092, 82669, 126613, 65290, 6440, 41352, 57265, 114308, 155917, 188079, 155230, 150007, 113085, 92639, 86151, 111258, 136822, 128662, 112025, 38366, -29799, -62923, -78957, -67941, -39355, -2955, 17484, 25236, 15019, 28236, 34989, 32966, 23773, 20331, 36098, 47464, 76016, 65696, 4532, 50697, 133307, 206029, 221154, 193504, 137051, 113407, 123000, 134466, 97487, 97279, 50158, 37440, 134540, 160306, 169062, 126097, 59232, 88869, 127616, 131478, 93379, 99351, 88976, 44104, 87976, 108730, 90791, 76064, 88029, 80422, 25737, -35911, -6624, -18254, 24503, 56042, 30901, 10778, 53440, 123590, 150641, 136587, 144055, 149665, 147601, 154155, 120844, 52167, 7874, 78540, 127693, 139366]
19202A39366K7763n8666m9115M0874n3433L8843L1492j6448o2552q2431Q417K6007
19190i883K2222k819l1663K0586L475L1094P1089R1984L8042l5089j11512m9811
19178C7715M8992M9843K5098k3376k77k6324l3858J7771M7338M43k7317O824p561
19165A15311N3851P482j677m3450j0642R44k5485K9310j6360L698L209Q191L5978
19152A60360l288o6893o6077N907k734m2987M2138O1828L3399m6844m6242l3012
19140d445L358K6839L563K4797m7782K2051L3211M706l0984j2400L4416L5625
19128I2955N261L5867J92m8288l4989m6191n824j8494K9167L6585K3345O890J5727
19115I2203q2184j5688O1542R2615K1922k7070Q234l2713O3346M0387l1455k3102
$$ y = [139366, 167129, 108463, 59348, 100222, 46789, 85632, 117124, 100676, 38124, -44307, -35890, -9883, 12339, 9520, -22143, -1557, 1918, 33012, 104101, 196085, 234127, 199038, 87526, 37715, 86707, 136550, 161648, 138272, 137995, 111671, 77813, 95584, 142922, 143365, 116048, 122872, 115311, 169162, 176644, 174967, 131517, 120875, 121819, 96334, 125644, 109284, 112982, 116191, 124382, 160360, 157072, 90179, 24102, 30009, 27275, -15712, 26426, 88254, 121653, 74809, 28567, -4445, -1087, 25752, 29315, 54112, 6330, 28381, 61592, 66298, 35314, 22914, 57330, 92955, 98216, 134083, 134275, 85987, 50998, 4807, -1017, -19511, 9656, 46241, 69586, 76476, 92203, 10019, -5669, 55873, 148488, 170410, 143340, 151574, 118861, 182207, 222594, 191139, 168037]
19103A68037q907M8861N6204m1732q1234m2307K4455j814o7547q14L9559K3788
19091A16549p398l1130K8065P5734m4698l5894m4642m8306O1953r32n5508K5557
19079C9350J55M3793N2929r804j1374N853K1670N355r170L9067L2596L451l1097
19066A82774o7233j0673P6481L9843L5739q9015l8983L5865L0499M8917J6035
19055B60249k9708o985M7434p5675q8474R316k1204L4652Q1165M2058k3681j8923
19043B10224n6405L9245L9065j6342k8919N4350O7583j4069m650q666j0644j029
19031B69743N2747M1679k436m9711j6679m0620K6119K0774K3849J6052k5177p4128
19019B42212m3315J3379m57J6650J178N1232O4637L5145j2403l2241j6233m1880
$$ y = [168037, 159130, 207991, 264195, 222463, 141229, 98922, 123377, 121563, 54016, 53202, 92761, 116549, 109151, 78021, 106086, 181820, 137122, 101228, 56586, 8280, 70233, 69301, 13793, 39350, 39505, 83298, 136227, 126423, 115049, 120902, 142572, 147927, 138757, 177824, 210420, 213871, 182774, 115541, 104868, 181349, 221192, 256931, 167916, 128933, 164798, 195297, 244214, 260249, 230541, 223556, 270990, 195315, 106841, 116157, 94953, 129605, 210770, 252828, 229147, 210224, 153819, 193064, 232129, 215787, 186868, 241218, 308801, 294732, 290082, 281416, 270772, 269743, 322490, 364169, 361733, 312022, 295343, 254723, 280842, 301616, 325465, 341517, 316340, 242212, 198897, 212276, 211819, 228469, 229647, 280879, 345516, 380661, 368258, 336017, 319784, 277904]
19007B77904M200N86L9200Q4948M4494n7550m4891m3158l025Q620K6844M8162
18995C86334j1115J60O4910M6271j549J4105K4168K2309J3551l318Q011M3053
18983F06890J1282L393K469K8756O8754J0302J3059O0311J03153M9568J3629J20625
18971A092191J63182J18428Q7460K9335K5410k924M8762J43777J41236J85264
18961B032121J84486J59440O6644K3992J2276J28485K26372K96779L49672M87790
18951C968057N65103O39482O77032N41875O04551Q59016J141775J593462K232560
18942A2822913L127625M615196P010608J0736268J5720951J9817945J9040994
18935I2892500J0762229o081412j7334023j3308821m062657M200445J1499736
$$ y = [277904, 282104, 282690, 321890, 406838, 451332, 393782, 348891, 305733, 302708, 311328, 338172, 386334, 375219, 375379, 440289, 486560, 485011, 499116, 523284, 545593, 559144, 555826, 563837, 606890, 618172, 621565, 624034, 652790, 721544, 731846, 744905, 805216, 908369, 957937, 971566, 1092191, 1255373, 1373801, 1461261, 1490596, 1516006, 1513082, 1561844, 1705621, 1846857, 2032121, 2216607, 2376047, 2442691, 2466683, 2478959, 2607444, 2833816, 3130595, 3480267, 3968057, 4533160, 5172642, 5849674, 6391549, 6996100, 7855116, 8996891, 10590353, 12822913, 15950538, 20565734, 27576342, 38312610, 54033561, 73851506, 92892500, 103654729, 97573317, 80239294, 66930473, 62867816, 67068261, 78567997]
18928G8567997J6233521J4857811N024041j2956090k1702317j6517983r702364
18921E3804616n751444l628942j933380j74317K065140N119824R537067J5168472
18913G4207036K0048898J9787290J1648204o461175k0810481j7363815p116840
18906G3939117K116863R927209J5159750J4334616N182677j2436734k2818757
18899H5404741j8656390j1727785p624945n805153m750052l952671l341727k696665
18891B6849353k128885j501944j254730j531001j876546j900881j728801j614256
18883A3312309j469709j294316r89267q70067p69194o31403p00005n40312m18903
18874E629133l63030k29784j87517k59378k06922k37602k80103j95871j85776
$$ y = [78567997, 94801518, 109659329, 114683370, 101727280, 80024963, 63506980, 53804616, 48053172, 44424230, 42490850, 42316533, 44381673, 49501497, 59038564, 74207036, 94255934, 114043224, 125691428, 119230253, 98419772, 81055957, 73939117, 76055980, 85983189, 101142939, 115477555, 120660232, 108223498, 85404741, 66748351, 55020566, 47395621, 41590468, 36840416, 32887745, 29546018, 26849353, 24720468, 23218524, 21963794, 20432793, 18556247, 16655366, 14926565, 13312309, 11842600, 10548284, 9559017, 8688950, 7919756, 7288353, 6588348, 6048036, 5629133, 5266103, 5036319, 4848802, 4589424, 4382502, 4144900, 3864797, 3668926, 3483150]
18865C483150j43351j81456k84786l31304k33065k05324j54702o4402q6959j47806
18855A649995q0673q5594n5588p4790j31292j28869l7524L1374m5136o3072r7302
18844H81529j35554l7514R962K1006m731q8533l2731J6717L1970k9364m8739r611
18832E74407n6117m4918J4234m4692j8964N4594K6114L2435j2186j6411l6102
18821D72394l4100j7526k6641M1871J057P5832k9298l5635K3935l735O6043J1544
18809E45741n3454l3724j7606L8229L1016J480m8157k727P6885l6169n4488p8917
18797C68109m2316K165L401j1633J2066N9457k2093j4727J6417J933m3206N6881
18785C86454P7942J4057j16857o4735j0002j3649L1408J6276K5377J7976m2120
$$ y = [3483150, 3339799, 3158343, 2873557, 2542253, 2309188, 2103864, 1949162, 1884760, 1797801, 1649995, 1569322, 1483728, 1428140, 1353350, 1222058, 1093189, 1055665, 1087039, 1041903, 978831, 881529, 745975, 708461, 718423, 739429, 734698, 646165, 613434, 630151, 662121, 632757, 584018, 574407, 518290, 473372, 487606, 442914, 423950, 478544, 504658, 537093, 524907, 508496, 472394, 438294, 420768, 394127, 435998, 437055, 512887, 483589, 447954, 471889, 468154, 534197, 545741, 492287, 458563, 440957, 479186, 510202, 511682, 463525, 460798, 537683, 501514, 447026, 368109, 325793, 327958, 331359, 319726, 331792, 391249, 369156, 354429, 370846, 372779, 329573, 386454, 464396, 478453, 361596, 296861, 286859, 273210, 304618, 320894, 346271, 364247, 322127]
18774C22127o43k5556j6200M328L2565J5474j2621o4525l7242k3657r935l2483
18762A51632K3177O1628l4063j8717k1344L8729J9258K0168o4063k0278R085j0909
18750A54303R501M6582K5417Q905o5602m3754j6371o081m198l697k6228j2915
18738F5862k0493M9220K6214M8622M2699l1982j5789j8476N8708J335l3536L0757
18726B03141k2101n1350P609m9892P9k8113K1126L3019K4454P2760K05M2597K1925
18713B75459j6724n2081J3635k2349p784o0806n4352n988L7850P3295R9585P8559
18701C58299K6658K7084O909k4617K5694k0899j02401K6136k876P679l4332o7846
18689B25488p401L3387L1614M5939M0462k8479l9623j2705m4664K2931N7043N7533
$$ y = [322127, 321484, 295928, 279728, 284056, 316621, 332095, 319474, 254949, 217707, 194050, 184115, 151632, 174809, 236437, 202374, 183657, 162313, 201042, 220300, 240468, 176405, 156127, 165212, 154303, 163804, 210386, 235803, 244708, 179106, 135352, 118981, 112900, 108702, 105005, 78777, 65862, 45369, 94589, 120803, 169425, 212124, 180142, 164353, 145877, 204585, 205920, 172384, 203141, 181040, 129690, 137299, 87407, 87486, 59373, 80499, 113518, 137972, 210732, 210937, 253534, 275459, 258735, 206654, 220289, 197940, 190156, 129350, 74998, 69010, 106860, 180155, 279740, 358299, 384957, 412041, 418950, 394333, 420027, 399128, 296727, 322863, 319987, 327666, 293334, 225488, 218087, 251474, 283088, 329027, 369489, 341010, 301387, 288682, 244018, 266949, 323992, 381525]
18677C81525Q6705O2702O159J6789J0053m4268K0371Q6397R717m4959k5503r323
18665E56365l2064k4156n7871j39359p1762j606K4780l9890k4399o5045n9709
18654F5284P4262O1167P504L5698q632L6968o536O3260N8358o348M3152J1620
18642D35757j4775n9477o0112l9709n1938M485k4890o125m0260k3209l074m727
18630A11946l8441j5217J2966O3706o551k0170J6310K7662o3142m2402p935L912
18618D2644J291L949j3801M539J6458N0057J5910j0793n956j6723N656K0599p7965
18605C5865k6741l9384L426K0312J5733l8831N0293M6297r0486j02242L6593P3839
18593a5326M5654J8109M6188j5712n6890q082l1595j0916K7238K2276k2190r896
$$ y = [381525, 468230, 530932, 537091, 553880, 563933, 519665, 540036, 626433, 636150, 591191, 565688, 556365, 524301, 500145, 442274, 302915, 231153, 229547, 254327, 214437, 190038, 124993, 65284, 139546, 200713, 208217, 243915, 235283, 272251, 265715, 328975, 387333, 380985, 424137, 435757, 420982, 361505, 301393, 261684, 209746, 214231, 189341, 183216, 142956, 119747, 116673, 111946, 73505, 58288, 71254, 134960, 128409, 108239, 124549, 152211, 89069, 46667, 38732, 42644, 43935, 47884, 34083, 38622, 55080, 105137, 121047, 110254, 104298, 87575, 93231, 113830, 35865, 9124, -30260, -26834, -6522, 9211, -29620, 20673, 66970, -23516, -125758, -89165, -15326, 30328, 48437, 94625, 78913, 22023, 13941, -17654, -28570, -1332, 20944, -1246, -11142]
18581a1142j8941J371L2922r099K9267j2517l8888j5117j6896M9902K8294r325
18569I831j4425K2480K4562k7212l0062J3368k5706j8078N6363O4350O5210j232
18557A39449j7660p2854m5766J2767l1608q1094m6443N2000M355M895K5471Q8368
18545C1880O4083p3995o3663r708m253n37j7881J1304P518K6752j4968j2494m58
18532e6420m324N450j0084l0916K0319M477J3076r687k2028l097l2178J3304K0952
18519i1156l879P6758J8288k8370L6934L208k5473m5637J5530n525m0747M4923
18507d5146J6989k070M4632Q7461M6091k5550K1412Q742k8777k4617j32595l4208
18495f7636K2080M5310J9446p6604L0652M976j1967m3884J2685J4500O5755j9265
$$ y = [-11142, -30083, -28712, 4210, -4889, 24378, 11861, -27027, -42144, -59040, -9138, 19156, 9831, -4594, 17886, 42448, 15236, -14826, -1458, -27164, -45242, 11121, 75471, 140681, 139449, 121789, 48935, 3169, 15936, -15672, -96766, -143209, -91209, -86854, -81959, -56488, 31880, 95963, 21968, -41695, -51403, -55656, -56193, -74074, -62770, -55252, -28500, -43468, -55962, -56420, -60744, -55294, -65378, -96294, -75975, -71498, -58422, -68109, -90137, -93234, -125412, -112108, -91156, -95035, -18277, 11, -28359, 8575, 11783, -13690, -59327, -43797, -49322, -90069, -45146, -28157, -30227, 14405, 101866, 147957, 122407, 143819, 152561, 123784, 99167, -33428, -67636, -45556, -246, 19200, -57404, -26752, -21776, -33743, -77627, -64942, -50442, 15313, -3952]
18483c952o2975N4905J6413k0247L311N0507L3057J9489n9520j7241L4455l5153
18471A3049N7672J01693l1088j02907j6894M123j0814K3094j593L8058K5611k2460
18459G7544m0422L2635j9268m864M246l5805p310N6295j21K5660K9042j9041j8235
18446H0356N583o0489l5471j9044P5830k8598j3251N7585J4117N9520K4200n9953
18434A00385n1165k5650K3395k4953l9122k2961L7899L1900m3287l2335l4308
18423h0202J7864j3697K6538M8490P1402J0891n780K5138J5960m263n8629L5106
18411H8818M4004J9275k7957M2014l6816k4922j1578J4081q307k2474J2779j2127
18399G6790m1823k3158k9965M5773O5019M3741L5297K4273l9598l4886k3606J18581
$$ y = [-3952, -66927, -12022, 4391, -15856, -12545, 37962, 71019, 90508, 30988, 13747, 48202, 13049, 70721, 172414, 141326, 38419, 21525, 25648, 14834, 37928, 36335, 74393, 100004, 77544, 37122, 69757, 50489, 45625, 49871, 14066, 6756, 63051, 62930, 88590, 117632, 98591, 80356, 85939, 25450, -10021, -29065, 46765, 18167, 4916, 62501, 76618, 136138, 160338, 100385, 49220, 23570, 46965, 22012, -17110, -40071, -2172, 29728, -13559, -45894, -80202, -62338, -76035, -49497, -1007, 70395, 81286, 75506, 100644, 116604, 112341, 53712, 88818, 132822, 152097, 124140, 166154, 129338, 104416, 92838, 106919, 98612, 76138, 88917, 76790, 34967, 11809, -18156, 27617, 92636, 136377, 171674, 195947, 156349, 121463, 97857, 216438]
18387B16438J03675M2614K4801O6085J7319L4883O8924l8593q1549m4018k3182
18376C87397P7966O8715K2021L8416L4505p0751o8885k8690q8914k2788k6265
18365C22727k9132K2527M146k7574L6620J61121J71607P2572r618l3047r6574
18354E95375n7781k851M6473K2502K3584J6503l6486r0769l0932n3840o1838n4117
18342C15823m2072l4861r222m5286J919r707l1390M6558l941O192l2147o3147
18330I8719J9301k1987k1480L4592k6864n347Q571K634m541J2542P1841l9507
18318A28474L0068M7220k4907m6005l840m3273k3981p841J5695N452L1733l440
18306A05355K796M0133K2620j0408p701j5033K8689r1238K4778N3348n4827l0506
$$ y = [216438, 320113, 362727, 387528, 453613, 470932, 505815, 574739, 536146, 454597, 410579, 387397, 465363, 534078, 556099, 594515, 629020, 558269, 489384, 460694, 371780, 348992, 322727, 293595, 316122, 320268, 292694, 329314, 490435, 662042, 734614, 724996, 691949, 595375, 537594, 534743, 581216, 603718, 627302, 643805, 607319, 516550, 485618, 431778, 369940, 315823, 273751, 238890, 229668, 184382, 186301, 176594, 145204, 191762, 187821, 194013, 161866, 98719, 118020, 96033, 74553, 109145, 82281, 76934, 85505, 88139, 83598, 96140, 167981, 128474, 158542, 205762, 180855, 134850, 131010, 87737, 63756, 55915, 71610, 77062, 108795, 105355, 108151, 148284, 170904, 160496, 152795, 137762, 166451, 75213, 99991, 153339, 98512, 68006]
18294F8006K6073k90O909Q727N7417L2930l0282m5825K8765P5187M4267l7667
18282B34217J1166l440k1857l3864J5082o493J9006l1819p0178l7589k5260j3479
18270C5492O4190P4100o698k5154K6158L812j7915M182L745K8270j2315j6262
18258A61605K6053J0845q0929O2620Q2690J07761J5512n6462n5454j32177j8785
18247A23279k758O6328J0511k5132o1950K6621N4417k2496K3664K5575M0366L1694
18235B90119j6931J0343N3287o148P279J6216L7292L8121J4854m3606j07623l8637
18223B54566K6573M9839K8653M2503P525n2799J4820J6896o2930k9822M3429M9228
18211C88481J1194k4336l6418N3196o953N187L2098R0895Q2193L5675l6076Q813
$$ y = [68006, 94079, 93789, 100698, 109425, 166842, 199772, 169490, 123665, 152430, 227617, 271884, 234217, 245383, 241943, 220086, 186222, 201304, 194811, 213817, 181998, 111820, 74231, 48971, 35492, 99682, 173782, 167084, 141930, 168088, 171900, 153985, 158167, 161912, 190182, 177867, 161605, 187658, 198503, 117574, 180194, 262884, 370645, 386157, 329695, 274241, 142064, 123279, 120521, 186849, 197360, 172228, 110278, 136899, 191316, 168820, 192484, 218059, 258425, 290119, 273188, 283531, 336818, 330670, 337949, 354165, 391457, 429578, 444432, 400826, 293203, 254566, 281139, 330978, 359631, 402134, 409659, 356860, 371680, 388576, 325646, 295824, 339253, 388481, 399675, 375339, 338921, 392117, 385164, 390351, 422449, 513344, 595537, 631212, 595136, 603949]
18199F03949l2677M9321N1203N5319N7993J12554M5793J05920J91751J80087J21307
18188A542520R9014q1045r1269J8189J5033M6387J29504K24461K02251J24471
18178B229516J39792J61274K25435K41250K08328K00975J73821K59285L35130
18169D174806N08714N75061Q63396J084342J426596J870211K586710L875750O193156
18160B3158742R934092J4988353J9845893K0909319J5743246J05283k0330751
18153H4354177k3339184j5340618q922932n477613l623148k457026j665896j025130
18145B2502630m70413J20267M72873M02562Q1866K94879J189582K773392N117587
18136C2485225Q654034J3499042J8328356K0135325J6701698M379110j2836004
$$ y = [603949, 571272, 620593, 671796, 727115, 785108, 897662, 943455, 1049375, 1241126, 1421213, 1542520, 1641534, 1560489, 1469220, 1487409, 1502442, 1548829, 1678333, 1902794, 2105045, 2229516, 2369308, 2530582, 2756017, 2997267, 3205595, 3406570, 3580391, 3839676, 4174806, 4683520, 5258581, 6121977, 7206319, 8632915, 10503126, 13089836, 16965586, 23158742, 33092834, 48081187, 67927080, 88836399, 104579645, 104684928, 84354177, 61014993, 45674375, 36751443, 31273830, 27650682, 25193656, 23527760, 22502630, 22032217, 22152484, 22625357, 23027919, 23109785, 23404664, 24594246, 27367638, 32485225, 41139259, 54638301, 72966657, 93101982, 109803680, 114182790, 101346786]
18129A01346786j4489768l456798P590178J3806620J3284317M152107j4742405
18122A07491037k4363683j8806314j1374529o903826m913128m202229l576404
18115C3350924k818215k079872j324603o87157m77615o98046p17087m1597J282698
18106B5789430L099997N949405J0136427J4997319J8141140J6389877P679565
18099A02183160j1378396k2986437j8461440j1294965o910332m564274l197304
18092B3390012k383469j778451j297216j010955o40803o16620j057360j502756
18084A3102382j525044j311440j150806r43529p39183p16969o58244m80317m13591
18075E163259l28919l16721l15788l22964l23273k04342j46902j34860r3351k71464
$$ y = [101346786, 86857018, 83400220, 90990398, 104797018, 118081335, 122233442, 107491037, 83127354, 64321040, 52946511, 46042685, 41129557, 36927328, 33350924, 30532709, 28452837, 27128234, 26441077, 25963462, 25265416, 24548329, 24506732, 25789430, 28889427, 34838832, 44975259, 59972578, 78113718, 94503595, 102183160, 90804764, 67818327, 49356887, 38061922, 31151590, 26587316, 23390012, 21006543, 19228092, 17930876, 16919921, 16279118, 15662498, 14605138, 13102382, 11577338, 10265898, 9115092, 8171563, 7432380, 6715411, 6057167, 5576850, 5163259, 4834340, 4517619, 4201831, 3878867, 3555594, 3351252, 3204350, 3069490, 2976139, 2704675]
18065B704675l04433k36894j67472j62742j87447r8351r4311m7756r7654q5618
18055A221997o1572j04912r6053l1030o3180q084j113o2648j8703K0033j9526
18044G75209j3483m4677n4589l5119j5481R33J3245j3769o2882k4091J7120J4959
18032E57375j9044k8088p986j3895p9629m2928k3178j8696J539K9668o173l0109
18020C18856K2810J827l5718k9772K881L3171L6265K1815p279m995L0272N5617
18008D45750M3242j3943j8270m3810l2108j931P1161j5614l1091K6284n3011p4782
17996C01877l5192m4543l9344P500L1497O0908L6692m6874J5525l4166o763q4232
17984A62885k9265K3261j4739j5255J5720J2844Q0699M9532j1521L2910K7092
$$ y = [2704675, 2400242, 2163348, 1995876, 1833134, 1645687, 1547336, 1453025, 1405269, 1307615, 1221997, 1160425, 1055513, 959460, 928430, 865250, 857166, 856053, 793405, 774702, 794735, 775209, 761726, 717049, 662460, 627341, 611860, 612793, 626038, 612269, 549387, 525296, 542416, 557375, 538331, 510243, 502257, 488362, 408733, 365805, 342627, 323931, 325470, 355138, 348965, 318856, 341666, 343493, 307775, 278003, 280884, 314055, 350320, 372135, 364856, 359861, 390133, 445750, 488992, 475049, 456779, 412969, 380861, 378930, 450091, 434477, 403386, 429670, 376659, 301877, 266685, 222142, 182798, 190298, 221795, 282703, 319395, 272521, 288046, 253880, 247117, 162885, 133620, 156881, 142142, 126887, 142607, 155451, 236150, 285682, 274161, 307071, 334163]
17973C34163L6319p1742r3652l7498q609p4054J0287K2372k4071r155M5091L0338
17961A59789j9679j7556J0109l9218L6952M3253k1056l4063K0039O093k701p449
17949A34513l6585j1876P263j8331Q802J05004M8066m6734m2901J3734j351k4629
17937A34975J5638l589j8979l3548j1019n9770n7169J084J0762O0229P567K1531
17925F7712O8257N9857n9514o9086o3897L2365L5251R297r798l4033l0891J3064
17913A8584K3171M6343j5386l2354Q145P023J2932q883k5949j8610L2377N9955
17901A07348L3076k5602o9687R758K6001L1619j5781k2984l4743J4294l1280m0848
17889a8829L9897J4485L8637L7100l8570l399p970L4697K3104m9874j089l5492
$$ y = [334163, 370482, 298740, 205088, 167590, 158981, 84927, 95214, 117586, 93515, 84360, 129451, 159789, 140110, 122554, 132663, 93445, 130397, 173650, 152594, 118531, 138570, 144663, 141962, 134513, 97928, 86052, 93315, 74984, 83786, 188790, 236856, 190122, 147221, 160955, 159604, 134975, 150613, 147024, 128045, 94497, 83478, 23708, -33461, -32377, -21615, 38614, 46181, 67712, 135969, 195826, 136312, 67226, 3329, 35694, 70945, 80242, 70444, 36411, 5520, 18584, 41755, 88098, 72712, 40358, 48503, 55526, 68458, 59575, 33626, 15016, 47393, 107348, 140424, 114822, 45135, 54893, 80894, 112513, 96732, 73748, 39005, 53299, 22019, -18829, 21068, 35553, 74190, 111290, 72720, 69321, 61351, 96048, 119152, 69278, 68189, 32697]
17877C2697m9860K428P793M158N1263L6685N826n9604Lj2290k3446j7673j0533
17864c2553K77K6680l4782K9124J7380J2104j8614p7520k7837Q9711K5091l0105
17852b1044j0515l2770j8987R836Q587K9196L9213M7770K634K4724J9756k5876
17840G2524l9380N012K1178L0081m503o9612p415j258J0746o363o2463l9951M6213
17827d5191J6401k7850P1902N1396q667j3335m2096l0432M0553K8902l2556k3762
17815a4735m552O2991J7491R319l59J406K6911l8556m738m5015L1189M9716m7918
17802D3150p0511n2482n7967m293M7183L7803Q5290K8565K9635q3786n1380r6664
17790a45457N977J21437P8212m9074m4423P329L5951N952m4953m3202O0404K9389
$$ y = [32697, -17163, -14735, -6942, -2784, 48479, 85164, 90990, 31386, 31389, 19099, -4347, -22020, -32553, -32276, -5596, -40378, -11254, 6126, 18230, -384, -77904, -105741, -16030, 9061, -21044, -31559, -64329, -83316, -73480, -64893, -35697, 3516, 51286, 53920, 78644, 98400, 72524, 33144, 38156, 59334, 89415, 84912, 15300, 7885, 6627, 17373, 11010, -51453, -91404, -45191, -28790, -56640, 15262, 66658, 57991, 44656, 2560, -27872, 12681, 41583, 9027, -14735, -19287, 43704, 61195, 70514, 70155, 71561, 98472, 59916, 55178, 10163, 41352, 91068, 43150, -27361, -79843, -137810, -142103, -94920, -57117, 28173, 56738, 86373, 2587, -48793, -145457, -139480, -18043, 60169, 11095, -33328, -25999, 9952, 15904, -29049, -72251, -11847, 17542]
17778A7542N4366o865m8097l8490m295M8547J3741n8203k214k9806j0683N5915
17766h542M6242p2795k607N1019k9180p5634k1886L6163O6153k3495n1230L2472
17754e3320J7997J1901J2188l1774J5516J4593N300o372n2237m9511M3993N3165
17742a8561j2365r821k4732K4156j6543Q247J0553n8943l8882N9364O5145N6706
17730D4324K4250l4453o5366J008l4488J3519J1577J9082K2084L3651n2695r71
17718a8478M3924p007k725j6934m5769P693N8385J5208j7246m0861k4599M3528
17706d881O0472K3692j08479o0927j1578M0009r429l8966K9927K0585J5777L8267
17694e531k011j7523P062K7955J6937L6181J679r0384m4763P1617Q1067K2549
$$ y = [17542, 71908, 65043, 16946, -21544, -25839, 22708, 36449, -21754, -23968, -53774, -64457, -8542, 37700, -35095, -37702, 13317, -15863, -91497, -113383, -77220, -11067, -34562, -85792, -53320, -35323, -23422, -11234, -43008, -27492, -12899, -7599, -13971, -66208, -115719, -71726, -18561, -30926, -40747, -65479, -41323, -57866, -49619, -39066, -98009, -136891, -77527, -12382, 44324, 68574, 34121, -31245, -30237, -64725, -51206, -39629, -20547, 1537, 35188, -17507, -18478, 25446, 18439, 15714, -1220, -46989, -39296, 19089, 34297, 17051, -23810, -48409, -4881, 55591, 79283, -29196, -90123, -101701, -61692, -71121, -110087, -80160, -59575, -43798, -5531, -7542, -25065, -18003, 9952, 26889, 63070, 64749, -25635, -70398, 1219, 82286, 104835]
17682A04835J3195k1528k5698j1574j4520n2609n1330J1044j4684L3648L2767
17671C546J9309m1327m7142q824J5372k0472N0496L6563k5150k2285O4427O1254
17659H5767o4917l7786J2965M425j2613m3305O208K6283M0854m1446k4565r882
17647e8012R016k372M3463N0204J9069m9589P394j8350l1067p6657K363Q1591
17635b2947K1737j2951j2041j6577M4295O362K0963M0734n161o843L39m938k3946
17622B9026l2488J8091m4035j9401l264P0748K3202J9230Q6262N2797o3712j1721
17610A24735P5831P6574P1332K0194L513K3420l5682p0975q5836l2846m7547q1205
17598D1508k5144L1467L853m273K0371l7223L2900P1913N8867L0774L7791j617
$$ y = [104835, 118030, 96502, 70804, 59230, 44710, -7899, -59229, -48185, -62869, -29221, 3546, 22855, -18472, -65614, -74438, -59066, -79538, -29042, 7521, -17629, -39914, 24513, 85767, 20850, -16936, -3971, 454, -12159, -55464, -49256, -22973, 17881, -23565, -48130, -58012, -48996, -51368, -7905, 42299, 61368, 11779, 19173, 823, -30244, -106901, -104538, -22947, -1210, -14161, -26202, -42779, 1516, 7878, 28841, 69575, 64414, 57571, 57910, 52972, 29026, -3462, 14629, -29406, -48807, -52071, 18677, 41879, 61109, 147371, 200168, 136456, 124735, 200566, 277140, 348472, 368666, 372179, 395599, 359917, 288942, 203106, 170260, 122713, 41508, 16364, 47831, 51684, 47411, 67782, 30559, 63459, 135372, 194239, 225013, 262804, 261187]
17586B61187j167K7847O7559K2405L9792K7782k4928J0810N4519P4872J7793N1940
17574F30411l7744n9567q7689o5858j44875j5590j3475k7772J8337N2711m6854
17563B02035n6003N747K0119L9m7792P367k6412M5347N4133Q5726N7790J18721
17551D66817L5098o2096q4161q6825j07844j5731k672o8553l3231M5956m5665
17540D1093k5405L1294L5185K0057p585J6455M1347p754q75r040k1468J2250q2228
17527D3326q902o746m5394j3714K4877O3188K6879j0764O903j7126n6293n8791
17515e2557l5504L4577J0175j3183k2928j5980l1412J3683L2954O4261j675l0555
17503d8144j97N8206Q514j13882o7179j3803L7380M9401Q452J7897J7834l1128
$$ y = [261187, 260020, 287867, 355426, 377831, 417623, 445405, 420477, 431287, 485806, 560678, 578471, 630411, 592667, 533100, 445411, 379553, 234678, 219088, 205613, 177841, 196178, 248889, 202035, 146032, 151779, 171898, 171937, 124145, 131512, 105100, 150447, 204580, 290306, 348096, 466817, 501915, 439819, 355658, 268833, 160989, 145258, 142586, 74033, 40802, 86758, 41093, 15688, 46982, 82167, 102224, 94639, 111094, 152441, 144687, 143812, 134772, 113304, 125554, 43326, 34424, 27678, -17716, -31430, -6553, 56635, 83514, 72750, 79653, 62527, 6234, -52557, -88061, -53484, -43309, -56492, -79420, -95400, -126812, -113129, -80175, -15914, -17589, -48144, -48341, 9865, 18379, -95503, -162682, -176485, -139105, -89704, -81252, -63355, -45521, -76649]
17491g6649j7925L274O504L3041M3329Q132j8691k9038j9239n16k782Q0602N2366
17478F2408J0831q6849k3903J0613Q6410k1682K3648M6990K2718n8312r4020k6174
17466d7322n8440J8615N5619m176N1151K2444l6525R438L5068k502m1859L509
17454E020m8986J6572m1785j597J9787K3386k6114N7319O0466l1859m5768P172
17442f387N102J2202q139n7835J9009J1139M20N8671Q573l1984J5098M691l6054
17429e494l5392j6530l6002Q9066M3198j5689n710k8655Q744q750N149K5048o968
17416A2015k2383J14k1802l4764K929J2446n993P4787M1804m7124l8209l50J2945
17403a3585M814j6314J4720l7003k3975J542J4975m5624m2439J4835K2327l964
$$ y = [-76649, -94574, -91300, -84796, -51755, -8426, -294, -18985, -48023, -67262, -67778, -70560, 10042, 62408, 73239, -13610, -37513, -26900, 59510, 37828, 61476, 108466, 131184, 72872, -21148, -47322, -105762, -87147, -31528, -35704, 15447, 37891, 1366, 10804, 45872, 43370, 1511, 5020, -43966, -27394, -69179, -70776, -50989, -27603, -53717, 3602, 64068, 32209, -13559, -6387, -1285, 10917, 2778, -55057, -36048, -24909, -24489, 34182, 42755, 10771, 25869, 30560, -5494, -40886, -57416, -93418, -4352, 38846, 23157, 17447, -11208, -2464, -11214, -6065, 18983, 12015, -10368, -10254, -32056, -66820, -63891, -51445, -57438, 17349, 59153, 12029, -26180, -26530, -13585, -8771, -25085, -10365, -47368, -71343, -69801, -54826, -100450, -142889, -128054, -105727, -109691]
17391a09691k2733K9762K8748O66l9155J9507K2106M8212n288n2566L2436J7207
17379c0789m004K1162l2856m1585j7081J7618k9935M855K0003N5133O4855l3558
17367f182n8236k2556n207M3579M3884L5795J1097n0757k5102K6120K3770k1026
17355d821n1213j3671L3917l94j8822J0747k1049m4014R442O3954k5051o395L1230
17342c6140J0862l9100N145q44m1789L5808M9796j0987j8517M3279L4848j1049
17330B1312J8612r948o6159J6916J9710m571L8678L1349n5503m2193Q125K3135
17318e37l825n6048k0071L8409K2817j4476K8152L426J5052l859j3237J6921K0779
17305C3503J9866l2156Q232M0993k5555l6489j158N7212k3193k6890m2818J7202
$$ y = [-109691, -132424, -102662, -73914, -73248, -112403, -92896, -70790, -22578, -27866, -80432, -47996, -30789, -34793, -13631, -46487, -88072, -105153, -87535, -117470, -112615, -92612, -37479, 27376, -6182, -64418, -86974, -92181, -48602, -4718, 31077, 42174, -8583, -33685, -7565, 16205, -4821, -56034, -69705, -35788, -36182, -55004, -44257, -65306, -109320, -99878, -35924, -60975, -67370, -36140, -25278, -64378, -59233, -60077, -101866, -66058, -16262, -27249, -45766, -2487, 32361, 21312, 39924, 29976, -36183, -19267, 443, -4128, 34550, 65899, 10396, -31797, -23672, -537, -4362, -60410, -80481, -42072, -19255, -33731, -5579, -2153, 12899, 9040, -4197, 12724, 33503, 53369, 21213, 29445, 70438, 44883, 8394, 7236, 64448, 41255, 14365, -28453, -11251]
17293a1251L1359J0965N545J942m7082l4239L0267L6502k0677l1324N0038N2316
17281G4361j7252q6778m2237j127M9K5991N709l6694L1364N5931K2159J8673m436
17268D5713n2037L3202l855q426m8517L4211j5319N038L8998L8443k0870m7955
17256a374j02975q028K7456m7193K9011M8001j3677j1550m7097p806L9341O2013
17244c3878O773j6629P775j4735j6503N2791J8243L2748l2172k9306K4168J4364
17232A3639l4811l7148m5719j5356K1306J1713N7857J1303K2325M5164o2429q2902
17220i5058k6384l8494M638P3907J7140J1049N4820l1161K2001N7091n0316m0654
17208d1421K4424M1637l7021m9797l5607L0481L6595k4574J1837O628L1111j4598
$$ y = [-11251, 20108, 31073, 36618, 38560, -8522, -42761, -12494, 24008, 3331, -27993, 22045, 74361, 57109, -29669, -71906, -73033, -72984, -46993, -41284, -77978, -46614, 9317, 31476, 50149, 45713, -6324, 26878, 23023, 14597, -33920, 291, -15028, -9990, 29008, 67451, 46581, -1374, -104349, -112377, -84921, -132114, -103103, -55102, -68779, -80329, -127426, -135232, -95891, -33878, -27105, -43734, -35959, -50694, -67197, -14406, 3837, 36585, 4413, -24893, -725, 13639, -21172, -58320, -104039, -119395, -98089, -86376, -28519, -17216, 5109, 50273, -12156, -95058, -121442, -159936, -155298, -81391, -64251, -53202, 1618, -29543, -7542, 49549, -767, -41421, -16997, 24640, -12381, -62178, -97785, -67304, -30709, -55283, -43446, -36818, -5707, -20305]
17196b0305j1664k531n2450L5580Q1542M1869J7426n5410q0771l1538M3623J7804
17184a6825m273J056J6780m4276p1693m4424R6098R1057J512j7550m3964O369
17172c0133n9907l1966J8280k1474k225L7734J5815O109K5015j523J8925R91P88
17159b3571K1595m6255m8760K0365R610j2748M4164K4891j0030k9777M2022l2647
17147d1141m7581k7049R368L0300L0909o2920P026J3541J3156q020k5333k9363
17135a37107J0112M7064P0485r163o073J0381J6587o6660q523j7140L594L6335
17123e0108P0149l7711l8813L6540n7650m9864O9479K2339L4999K1789p1949o5301
17111a16101L4117N5813N1005j8694L676J0419m1332j6158N5035K876o7157m3280
$$ y = [-20305, -31969, -34500, -86950, -51370, 30172, 72041, 89467, 34057, -46714, -78252, -34629, -16825, -21098, -20042, -3262, -47538, -119231, -163655, -67557, 23500, 25012, 7462, -36502, -30133, -90040, -122006, -103726, -125200, -127425, -89691, -73876, -67767, -42752, -44275, -25350, -24359, -23571, -1976, -48231, -96991, -76626, -67016, -79764, -35600, -10709, -20739, -50516, -8494, -41141, -88722, -115771, -106403, -76103, -45194, -108114, -101088, -87547, -74391, -82411, -107744, -137107, -126995, -79931, -9446, -18609, -24682, -14301, 2286, -64374, -72897, -90037, -86443, -50108, 20041, -17670, -56483, -19943, -77593, -127457, -57978, -35639, -640, 21149, -50800, -116101, -81984, -26171, 24834, 6140, 9816, 20235, -21097, -37255, 17780, 20656, -46501, -89781]
17099h9781L4678K002k3445J9306k6739K7394L3533N7799j9147n3435r9652j7929
17087a55416L2594J6979K9428M9692J0158J92K1084L1103k0148o4952m2893k1648
17075a13827M0247m179M0501K7007l4295n31M3603K9300m879k018j0650n6271
17063d5992n266J7360n0795n4147K1956L7047J2773L6060j0774k847P0878P378
17051C3631o3026k5210j5379l3783L546M4701K6196j9984m495N3001l3444r120
17039d3366L5844j331K2202K888L692j4697l0996j6992Q252L0L96n99m3714O495
17025g1896L3732J7304m6335k6020k3123j2861P1042N3678m7334m4568Q357q1053
17013a69077M183O4863K0794j5647q081Q3646L2362o1019L4775q432l4495K0441
$$ y = [-89781, -55103, -53101, -76546, -57240, -83979, -56585, -23052, 34747, 15600, -37835, -137487, -155416, -122822, -105843, -76415, -26723, -16565, -16373, 4711, 35814, 15666, -49286, -92179, -113827, -73580, -77759, -37258, -10251, -44546, -45077, -1474, 27826, 22947, 20929, 10279, -45992, -51258, -33898, -84693, -138840, -116884, -79837, -67064, -31004, -41778, -44625, 26253, 33631, -29395, -54605, -69984, -103767, -100221, -55520, -29324, -49308, -53803, -802, -34246, -43366, -7522, -8853, 13349, 16237, 19929, 5232, -25764, -42756, -34504, -34474, -34078, -34677, -78391, -71896, -38164, -20860, -67195, -93215, -116338, -129199, -58157, -4479, -51813, -96381, -88024, -169077, -164894, -100031, -79237, -94884, -102965, -19319, 13043, -47976, -13201, -21633, -56128, -35687]
17001c5687j7153J2096M6982P754o5360m138L9433j6948l7415k2583M1559L5379
16989a6081R374l7423L8263O4277k7695J5068J6879n2806J6331j4068j9551n1632
16977e9064j4401P3995J7741k148l4899r940o243K1932k2717K0620L5915r9014
16965g8223j3176k9249k3667K4644K8683N6083o720K3958m7554l003K0405j5224
16953f3043m242L3425k0038o1888l0029P2364P6596L8161j0937l255j0621l0459
16941a3966m2367O444m7684k5050K9040l1888n3798P2799R9587L3436m0123J6575
16929C005j758O018o0026P1113K5490r6337p3771q268O0155R0694K7497p6508
16917c2696m9438l968l6610L5295Q23l1655M760K5624P9224M0537K7909K5386
$$ y = [-35687, -52840, -40744, 6238, 13992, -51368, -55506, -16073, -33021, -70436, -93019, -51460, -16081, -6707, -44130, -5867, 58410, 30715, 45783, 62662, 9856, 26187, 12119, -7432, -59064, -73465, 530, 18271, 16123, -18776, -28716, -34959, -13027, -35744, -15124, 20791, -78223, -91399, -120648, -144315, -119671, -90988, -34905, -41625, -17667, -65221, -68224, -47819, -63043, -67285, -33860, -53898, -115786, -145815, -73451, 3145, 41306, 30369, 27114, 16493, -13966, -56333, -49889, -97573, -122623, -93583, -125471, -179269, -106470, -6883, 26553, -13570, 3005, 1247, 7265, -52761, 18352, 43842, -52495, -126266, -134534, -74379, 16315, 43812, -32696, -82134, -86102, -122712, -87417, -86594, -118249, -113489, -87865, -8641, 31896, 59805, 85191]
16905H5191n025m1018k5426k315m0109k8081N6795l3102l2148j783k5097j0601
16893a02719J8980J4819k7372J2841k926K2684L091j1331n671m1974J7249O599
16881i5730M965K052k5918l180M1782M611N7256O2906J1241k1343n8399K720L9110
16868B2073L2984m2623q7901j90R6428M5077K6231L196n4705o9793q069m2820
16856h0112k8252l444r441N2202P510o881K1622M1516L71J1443k515n2296k0407
16843f8684l9159j249N7363k7799q5425q614J7869j1691L4545Q693k860L0064
16831i6947J5755N482K6639m802m6258k1188L3335K6749l2963k3187M8832k4877
16819i3430j4227J8400K8354O4177n076p7209m1361m6008j5034J312Q5558O3012
$$ y = [85191, 80166, 39148, 13722, 11407, -28702, -56783, 12, -33090, -65238, -67021, -92118, -102719, -83739, -68920, -96292, -83451, -86377, -63693, -60602, -71933, -77604, -119578, -102329, -95730, -90765, -88713, -114631, -117811, -76029, -71418, -14162, 48744, 59985, 38642, -19757, -17037, 22073, 55057, 12434, -75467, -75657, 20771, 65848, 92079, 95275, 40570, -29223, -37292, -80112, -108364, -111808, -121249, -69047, -61537, -68418, -46796, -5280, -4909, 6534, 4019, -48277, -68684, -107843, -109092, -51729, -79528, -164953, -173567, -155698, -167389, -132844, -124151, -127011, -96947, -81192, -75710, -49071, -53873, -100131, -121319, -87984, -61235, -94198, -117385, -68553, -93430, -107657, -89257, -60903, 3274, -1802, -79011, -120372, -166380, -181414, -180102, -94544, -31532]
16807c1532J0354j706j3081J2152L429K7548l5697l1906L0676K9434J6351l1717
16795a5695l3821o0358n652J7022Q367J9111M9843p7763p329L5871N4274J8895
16783B765j9043k5007o3009J8533K6690l3453m7780P9970N3427l0509m4837l4694
16771a16947M2310k0526k7532Q762M5586j5367N97K0721N9435P940k7273L0859
16759H565L637m2561k4139M5170M0064k9737n1788k8960L1666K6592L773l7964
16747e5682Q851J3594J5233N1059Q065L911J7911l3781m7651m2943L612K2454
16735c5367r813o0482M3646p053O308L062j5367J6109N5533n45m6624J7699l2867
16722f5761M400L9434n257R180M2449k7708n5422k1910k1832N725K1683M8202
$$ y = [-31532, -21178, -22884, -35965, -23813, -20384, 7164, -28533, -60439, -29763, -329, 16022, -15695, -49516, -109874, -115526, -98504, -90137, -71026, -21183, -98946, -106275, -70404, -16130, 2765, -16278, -41285, -104294, -85761, -59071, -92524, -140304, -60334, -6907, -37416, -82253, -116947, -74637, -95163, -122695, -113933, -68347, -83714, -83117, -62396, -2961, 4979, -22294, 8565, 12202, -30359, -54498, -9328, 30736, 999, -50789, -79749, -48083, -21491, -17718, -55682, -46831, -33237, -18004, 33055, 41120, 45031, 62942, 29161, -18490, -61433, -57821, -35367, -45180, -105662, -62016, -69069, -62761, -59699, -75066, -58957, -3424, -3969, -50593, -32894, -65761, -61361, -21927, -27184, -18004, 24445, -3263, -58685, -80595, -102427, -96702, -75019, -26817]
16710b6817j6730J9407l0237k5959J7298J5694m203j4880J5940J0636M1112L9513
16698D0774l2724K4277Q913l5552o581n0056k0572n9321J7510L8154j6828J7272
16686g4734o886j8842N569L2885O5741k2906p2183M6921M6613k1623k5071k1496
16674f6012K5864P0535l5206m8721p698L4443m188k1584k4667R332k5689J2096
16662h1495p935J7282O746K8727m51p5926M88K7931j9005l2893K2535O2958N4935
16649C897R550O244k0658l4322q446Q038k3885m9852O360j3995L5737J7317L8126
16636b5889J7766j1017J4732j638k5607l3875k7995L1932j3728m7266j1057l578
16624a37220J8957l8043M573M0112N7385j9904j8602n395j9398p234k495M8389
$$ y = [-26817, -43547, -24140, -54377, -80336, -63038, -47344, -51547, -66427, -50487, -39851, 1261, 40774, 8050, 32327, 41240, 5688, -893, -50949, -71521, -130842, -113332, -75178, -92006, -74734, -81620, -100462, -94893, -62008, 3733, -19173, -91356, -44435, 2178, -19445, -44516, -66012, -40148, 30387, -4819, -53540, -61238, -26795, -30983, -52567, -77234, -67902, -93591, -81495, -89430, -72148, -65402, -36675, -37126, -113052, -112564, -84633, -103638, -136531, -113996, -51038, 3897, 13447, 19691, -967, -35289, -43735, -35697, -59582, -109434, -103074, -117069, -81332, -64015, -25889, -8123, -19140, -4408, -6046, -31653, -65528, -93523, -61591, -75319, -122585, -133642, -137220, -118263, -156306, -151733, -111621, -54236, -74140, -92742, -98137, -117535, -124769, -127264, -78875]
16612g8875P8838n034j4763M5750K0936l8404k1826n4412k9600n375l8188l0461
16600a71414Q4195o71o747L0128K2224j9574R140O348m9333L6407j306k3051k3257
16587a06911j5405O99l5200J2794K8369J7083P8089K632l2677k5646N8346o4182
16575h2009l0754J2800J01308P2884j8327k0431q7799j9852M3318k5991L1921
16564b2932L2869k1205j14808k6552K621M7636M8043k8599j7234L3803j8677j3254
16552i8289L2090K2367k6368j9350l105M5134j2229p331L3645l054L0402P636
16540A548K3192O172j8443J1522q3171K4571K0154j6848N5401M1010n7K3401m2271
16527D6181k5405N176k5920N8802L1036j2022m3802j4916l4656k9323J9479K8958
$$ y = [-78875, -37, -5071, -19834, 25916, 46852, 8448, -13378, -67790, -97390, -102765, -140953, -171414, -87219, -87890, -94637, -64509, -42285, -61859, -52719, -46371, -95704, -59297, -60603, -83654, -106911, -122316, -121617, -156817, -144023, -115654, -98571, -20482, -17850, -50527, -76173, -17827, -82009, -112763, -99963, 1345, 74229, 55902, 35471, -52328, -72180, -28862, -54853, -22932, 9937, -11268, -126076, -152628, -150007, -102371, -54328, -82927, -100161, -66358, -85035, -98289, -66199, -43832, -70200, -89550, -92655, -47521, -59750, -67081, -33436, -36490, -6088, 1548, 24740, 30912, 12469, 23991, -59180, -34609, -14455, -31303, 24098, 65108, 65051, 88452, 46181, 20776, 25952, 32, 58834, 89870, 77848, 34046, 19130, -15526, -44849, -25370, 3588]
16515C588N272n4404l4598R7202k0223m0366j5309J8056o121K4129p577j5215
16503d5566k2353J4956M930p182l0772p2795K3680J9511L940j140N2446j350l9137
16490a00832P3957M4022p516m5132m5277n3833L3915L8790P4420l374m3042k1864
16478e5766k8220L3574j9242L2496O0007r112m2384J3580P779K0573o899M2009
16466D8395J6232p0142L0514k4796k5104m8361q577L9021K0248N5788n0738p8119
16454i5639l6302M1205K4795K1870N7856P279n2734p2138k2555K4279L0095k2100
16442i4089R660m9848K5241P2832K2473j03485n6140O6991m5555R368P1315J2467
16430e8770M3944l1138j2762K6742K1060l2512p045k3716O153m3914J438O3013
$$ y = [3588, 8860, -45544, -80142, 17060, -3163, -43529, -58838, -40782, -46903, -22774, -30351, -45566, -67919, -52963, -48033, -55215, -85987, -158782, -135102, -115591, -111651, -112791, -60345, -61695, -100832, -26875, 17147, 9631, -35501, -80778, -134611, -100696, -61906, 12514, 9140, -33902, -55766, -83986, -50412, -69654, -37158, 22849, 13737, -28647, -15067, -7288, 13285, 6386, 48395, 64627, -5515, 24999, 203, -24901, -73262, -81839, -42818, -22570, 33218, -17520, -95639, -131941, -90736, -65941, -44071, 13785, 21064, -31670, -103808, -126363, -102084, -71989, -94089, -84429, -134277, -109036, -36204, -13731, -117216, -173356, -106365, -151920, -142552, -71237, -58770, -14826, -45964, -58726, -31984, -10924, -43436, -50481, -74197, -68044, -111958, -110520, -47507]
16418d7507K0256j538R071l014j1422J2418J2095N5238k5450l6616j7087L8747
16406E191M1380l4695m5944O476J2129k088J1017K6384K8906k0765m1888l6591
16394e0488l2416l1104j4360J5164J3008M7338N0158j2387J147K4582k3741n9054
16382g2153j2456K9073N159J8439j9548J864K8996l2791k3222j486n006N0520
16370c2611N8708r3456j3511M7917o3406m18O9884O820J1461J5l4544J3567k8765
16357e8339l7634j0156M9678K728m2522p207r35L4853R1090M0714l1614k0513
16345A0143m335j7591K3405o0481p4019L9902O7534M1842k9310o2374Q424J242
16333e5618j5417K4430J6633P340K5579k153L184j0150j6940j0784m0933K9181
$$ y = [-47507, -27251, -28789, -19718, -22732, -34154, -21736, -9641, 45597, 20147, -16469, -33556, 5191, 46571, 11876, -34068, -27592, -15463, -17551, -6534, 19850, 48756, 27991, -13897, -50488, -82904, -114008, -128368, -113204, -100196, -52858, -2700, -15087, -13940, 10642, -13099, -72153, -84609, -55536, -50377, -31938, -51486, -49622, -20626, -53417, -76639, -78125, -83131, -32611, 26097, -67359, -80870, -32953, -96359, -96777, -26893, -20073, -8612, -8597, -43141, -29574, -58339, -95973, -106129, -56451, -53723, -96245, -103452, -104387, -69534, 21556, 62270, 30656, 10143, 5808, -11783, 11622, -48859, -122878, -82976, -15442, 26400, -2910, -65284, -56860, -55618, -71035, -46605, -29972, -22632, 2947, 794, 3978, -6172, -23112, -33896, -74829, -45648]
16321d5648l1263j4357M9793J4599J1015l5683m1364L542R948M0358L2851j7530
16309b3739k1485R394k1446M9246o428j3610k7363J0383p392J2930J6994M0466
16297A7950p224l6487J80n153M3862K0176Q636O514k2501Q106o0921L7096k884
16284G350k6656l9399o840m8705L1225J8772L275Q98J4459l265o5156j3481N0914
16271g6609R547P104j3387K6196j6000j4846K120J5008J1942Q189q70k5805l0871
16258i8282k0681L4464K0741j9347j9893J8963j1365J35527Q5l5021j0543l546
16246h898j8473P603j2203O328K5143l94J1062k7720j6791K0115N279J8156r484
16233b77l9370L4723j370k5159N9650K8242K1371l9716L1575K8830j5492n625
$$ y = [-45648, -76911, -91268, -41475, -26876, -15861, -51544, -92908, -89366, -79418, -39060, -6209, -23739, -45224, -35830, -57276, -8030, -14458, -28068, -55431, -45048, -52440, -39510, -22516, 17950, 10726, -25761, -25581, -30734, 13128, 33304, 41940, 48454, 25953, 34059, -26862, 10234, 7350, -19306, -58705, -65545, -114250, -83025, -64253, -60978, -60080, -45621, -48886, -114042, -127523, -76609, -67062, -59958, -73345, -47149, -63149, -77995, -75875, -60867, -48925, -40736, -41606, -67411, -98282, -118963, -84499, -63758, -83105, -102998, -84035, -95400, 40127, 40212, 5191, -5352, -8898, -27371, -19768, -31971, -25643, -500, -894, 10168, -17552, -34343, -14228, -8949, 9207, -277, -39647, -4924, -6294, -31453, 28197, 56439, 77810, 38094, 69669, 98499, 83007, 77382]
16221G7382m5546k4019l691L4541K5406n7435n3714P830L2117k9672J0112L7978
16209A1289P668N083L065k2762K394P49M6081P933k456N154J8524J4441j2847
16196H4316q952o7564O073L9512k0400O891J5855k4353n815n9799k9511j4437
16184g8184r717J6670L0997p146k124N5871n44p0178J390M1026K6400L5304N0206
16171H9971k4098n3275J3790j9663m8719N505L0428n97q5l709J908k7373k9985
16158f5902L8419J4102p695N2574m093J006o8919l9083K3691L2943J385l0427
16146e1999Q314l4380k2074O9155o517p133J1194K8809M1223L4349J8519K43n7301
16133C2402o5141k642J3324N6599L3622L9063L673j5299p5702r520J5675m5518
$$ y = [77382, 31836, 7817, 4126, 38667, 64073, 6638, -47076, -39246, -7129, -36801, -26689, 11289, 18957, 24040, 27105, 4343, 6737, 7486, 53567, 61500, 59044, 64198, 82722, 97163, 84316, 75364, 7800, 13873, 53385, 32985, 39876, 55731, 31378, 25563, -34236, -63747, -78184, -87901, -71231, -40234, -47380, -49504, 6367, 5823, -64355, -62965, -21939, 4461, 39765, 89971, 65873, 12598, 26388, 6725, -41994, -36489, -6061, -6658, -6743, -10452, -8544, -35917, -65902, -27483, -13381, -21076, 31498, 27405, 28411, -40508, -79591, -55900, -22957, -21572, -51999, -43685, -78065, -100139, -30984, -37501, -44634, -33440, -4631, 36592, 70941, 89460, 89703, 32402, -32739, -35381, -22057, 34542, 68164, 107227, 110900, 95601, 19899, 10379, 26054, -19464]
16121a9464j04930l8186L5990Q6775J04831q931n4037k7612K1237r140j6514K4909
16109e072J8547M1207j9371m8483l8311j2738N0767P119K9834m1236L3323l6272
16097b0686n3315N9538M7639n919l713N3800p373m8155J3610j8894O164k3475
16085g79J3143l0907j3304l3459m5029p2120K6235M8421q53J4835k7380q588J7501
16072a12284K4601j315n751o5151J4562K8369J3036J6107m1842N0239M6151o703
16060c9981L2443l1147K6650J6203m101l1852N269M3256K8025j8528n5495k8280
16048e7538K4179M8634J552p6956q168j6587J0880M3538L4321J1208p2656m1383
16036i8976M0598l2034j5296r033O9064N5127k8753k4318K1844m3646o4735L707
$$ y = [-19464, -124394, -162580, -126590, -39815, 65016, 56085, 2048, -25564, -4327, -13467, -29981, -5072, 13475, 54682, 35311, -13172, -51483, -64221, -13454, -6335, 23499, -17737, 15586, -20686, -74001, -14463, 33176, 27257, 23544, 77344, 69971, 21816, 35426, 16532, 22696, -779, 12364, -18543, -31847, -65306, -110335, -182455, -156220, -107799, -108652, -93817, -121197, -129785, -112284, -87683, -88998, -94749, -159900, -145338, -116969, -103933, -87826, -129668, -79429, -33278, -39981, -7538, -38685, -12035, 4168, 67, -31785, -26516, 16740, 44765, 26237, -29258, -57538, -33359, 15275, 16827, -60129, -68297, -84884, -74004, -30466, 3855, 15063, -57593, -98976, -58378, -90412, -105708, -114741, -45677, 9450, -19303, -43621, -21777, -65423, -130158, -126451]
16024a26451K9391K0427J1948n4796J2763l2431M9936J143K120K2824m7493L5069
16012g5550M1507L7339k5039J4853L8631q961j9245r3669l98O5473L2218L071
16000A0230K9275k0740k3306n5422l655J9958M4914K8637j5091j0479J2609k7906
15988a0976k458k6931p5665J2834J09952L5900J3514k1450k850k8496p5k1341
15976a8042j6579l43l0740K3511m7557n201L2931M7724j1156L5628O7726k6718
15964E1184l905K6083L9703l6010l1320M4179o1446l193Q805n7864m0483K2286
15952d1981L1070p817n2787N254J5650L4582L1096o901n9955m4467K539L7807
15940e5910J4816M8663N929L1332O834p1192o0786K8121N7433l7870m281J3564
$$ y = [-126451, -97060, -76633, -64685, -119481, -106718, -139149, -89213, -88070, -85950, -63126, -110619, -75550, -34043, 3296, -21743, -6890, 31741, 22780, 3535, -90134, -90532, -25059, 7159, 10230, 39505, 18765, -4541, -59963, -63618, -43660, 1254, 29891, 14800, 4321, 16930, -10976, -13434, -40365, -116030, -103196, 6756, 42656, 56170, 34720, 31870, 3374, 3299, -18042, -34621, -34964, -65704, -42193, -89750, -94951, -62020, -14296, -25452, 10176, 77902, 51184, 47279, 73362, 113065, 77055, 45735, 89914, 28468, 25275, 34080, -23784, -64267, -41981, -10911, -18728, -71515, -66261, -50611, -16029, 15067, 8166, -51789, -96256, -93717, -55910, -41094, 7569, 13498, 44830, 51664, -19528, -80314, -52193, 5240, -32630, -36911, -23347]
15928b3347m5910l6091N7201K5855K6442l4995J9629N6693L819N766l127p3107
15916b1172l6711J7519j2517l811M0975J0670P5227J3903n0472j4101l5747k4367
15904d0604j9554J8260n7332k9827K9356L8005M3034j0841m2156j6941k0442P340
15892a01702O3989j4728m1253L7545O7722K4057K6148K6282K8932o1120l2948
15881B2924J1713k5522n1145Q385R576J6846N975n0035j1510k9229J3362N3620
15869b5040m654k2202L7800l773k3903O13N5660l2113j8882n1531m129j9463j7189
15856a28806J0204Q1297L7755k2693O0769N5942K3475L2806l169r1883o6210N11
15844a0002K6485L799K6616l5079L8966O236L2652J3289q9727p4283N4614j5489
$$ y = [-23347, -69257, -105348, -48147, -22292, 4150, -30845, -11216, 45477, 49296, 55062, 51935, -21172, -57883, -40364, -52881, -56692, -15717, -5047, 70180, 84083, 33611, 19510, -16237, -40604, -60158, -41898, -99230, -129057, -99701, -61696, -18662, -29503, -71659, -88600, -109042, -101702, -37713, -52441, -93694, -56149, 11573, 35630, 61778, 88060, 116992, 55872, 22924, 34637, 9115, -42030, -33645, -24069, -7223, -1248, -51283, -62793, -92022, -78660, -25040, -29694, -51896, -14096, -17869, -41772, -41159, 14501, -17612, -36494, -88025, -92154, -111617, -128806, -118602, -37305, 450, -22243, 38526, 94468, 117943, 150749, 147580, 55697, -10513, -10002, 16483, 20282, 46898, 11819, 50785, 57021, 89673, 102962, 13235, -61048, -6434, -21923]
15832b1923n5632m0231P0486K9739j2424J809J5037l1q2913N876M0709o6203O623
15819a09078L6095j6050K6023P2279N1677m5898l9374k4992p7781L218N5531j021
15807f9371l3981L1847r116L0983K7029m850J5762L7376k4780N508j4863l2432
15795d0888j0254K9216q2155m2329K9291M8798P545J2637L4789Q934l0078k4511
15783e9005O3477J01850P558k8000p2115n3027L4592K526K7138J0567m7363J4373
15771B571k2443k789J4054J2848K965K6213J1353j5638j4012O6686n194n1214
15759B5400l516R426J2697j1642k1178J1674m2363m3731k6193L1208Q5260P160
15747C4202j4973J4078J0946L0075K4943q0181l4886p3083m9351K8975M4962L1138
$$ y = [-21923, -77555, -117786, -47300, -17561, -29985, -28176, -13139, -13170, -96083, -90207, -49498, -115701, -109078, -72983, -89033, -63010, 9269, 60946, 15048, -24326, -49318, -127099, -123881, -68350, -69371, -103352, -71505, -80621, -49638, -22609, -27459, -11697, 25679, 899, 6407, -8456, -40888, -51142, -21926, -104081, -146410, -117119, -68321, -60776, -48139, -13350, -4416, -34494, -59005, 4472, 106322, 113880, 85880, 13765, -39262, -4670, -2144, 24994, 35561, -11802, 2571, -19872, -22661, -8607, 4241, 7206, 33419, 44772, 29134, 15122, 81808, 76614, 25400, 21884, 31310, 44007, 32365, 11187, 22861, -19502, -63233, -89426, -58218, 27042, 34202, 19229, 33307, 44253, 74328, 99271, 19090, -15796, -88879, -138230, -109255, -64293, -33155]
15735c3155M7178j6068P90Q2516O0614j2964k2179n898l5195n6117J747L394k8155
15722a3492K2164K6553J4453j2449p8147O839j1363k476j6419l5649m3126k107
15710a45219J04528m1359l3993R579O864M6268j051j4622J1277p7314J4357O1598
15698e9087J7644M0458P141j4644j8210K7774N3842k0532m7263m5773K0032K2363
15686a6255N7658J1627r797p6837o9795N988K2350k032Q659N31m190K2798J7012
15673c2283J9941J9962q018Q593N155l747k0162j0457j6263k39J6554K2596N0733
15660E2365p616m0374M116M985J1300J8577r426k5372l5589l9234L7808J2482
15648a5978M9779Q535K6769L9538j6481m4244l4963L1702r943J8206k3230l5887
$$ y = [-33155, 14023, -2045, -1255, 81261, 141875, 128911, 106732, 100834, 65639, 9522, 11269, 14663, -13492, 8672, 35225, 49678, 37229, -40918, -34079, -45442, -47918, -64337, -99986, -143112, -145219, -40691, -82050, -116043, -106464, -99600, -53332, -54383, -69005, -57728, -135042, -120685, -59087, -41443, -985, 6156, -8488, -26698, 1076, 54918, 34386, -12877, -58650, -38618, -16255, 41403, 53030, 43233, -33604, -103399, -97411, -75061, -77093, -68434, -67903, -72093, -49295, -32283, -12342, 7620, -398, 8195, 13350, 9603, -10559, -21016, -37279, -37518, -20964, 1632, 52365, 44749, 4375, 8491, 13476, 24776, 43353, 33927, 8555, -27034, -66268, -28460, -15978, 33801, 42336, 69105, 108643, 92162, 47918, 12955, 44657, 34714, 52920, 29690, -6197]
15636f197l3532K5369n227m7327L3358L5276J5107k9579J9449l0699N992P5105
15624E7095j017k9684L6037p8588J2136m8622l1416P576R0409L0755l3645n2136
15612d1100j6143r791k9045M1454o8292J3794K5853n889k0174J5579M5063N0496
15600A805k4163k695m512l3276m2648l1654K9120O1161P441k3896L1541N5909
15588B4133L086M1762l6178l3519J660K6723k3156j6133j0955J9954M058n3150
15576e1715P465j6438k2188K1936N6173p979j8916N07J5590K725k3025J1844O9420
15563D5399L3792l4647p484M0361j1774m1173p704M9121k2148j252l4161p520
15551H10k2327m3207J1048M6796J0455P910q9907j3638L9399J8519l550l2235
$$ y = [-6197, -39729, -14360, -19587, -66914, -33556, 1720, 16827, -12752, 6697, -24002, -18010, 57095, 56078, 26394, 62431, -16157, -4021, -52643, -84059, -76483, 13926, 44681, 11036, -41100, -57243, -67034, -96079, -54625, -122917, -109123, -83270, -89159, -109333, -93754, -48691, 1805, -22358, -25053, -29565, -62841, -105489, -137143, -108023, -46862, -39421, -63317, -31776, 24133, 27219, 68981, 32803, -716, 944, 27667, 4511, -11622, -22577, -2623, 1435, -51715, -44250, -60688, -82876, -60940, -4767, -12746, -31662, -31155, -15565, -12840, -35865, -24021, 45399, 79191, 44544, 37060, 77421, 65647, 24474, 16770, 65891, 43743, 42491, 8330, 810, -21517, -64724, -53676, -6880, 3575, 11485, -78422, -92060, -52661, -34142, -37692, -69927]
15539f9927M3922J4057L7101N579j17985M6524N1310j8074j1658k9048R949K6400
15527a1850K9521r915p9897j3907Q432L933M4297M1267M168r045j6441m4147o6097
15514a19681J6447M6950M3300J8433J2416N2705m4874p6099R406k409l5252j052
15502g9710N3021J6278k7860q836L000M0525R0518l8868k3482O614o319l4771
15490i890l0223j877q092K9355L1035P9896J9466p4041m4067O996l5671J7781
15478a9332K0163M2278M546o1248J5220L1565j3945p8703j8596L2620N284M7006
15466F858K477j3854k7518p541L1080J7540n434L6614J0033N750l9461n2079j7815
15453e3350K07N0832J7454j9021K5205q044n920o4425M8506L1422K4997l262p6850
$$ y = [-69927, -26005, -11948, 25153, 30732, -87253, -40729, 10581, -7493, -19151, -48199, -38250, -11850, 17671, 7756, -72141, -86048, -77616, -73683, -29386, 11881, 16049, 7004, -9437, -53584, -119681, -103234, -56284, -12984, 5449, 17865, 70570, 25696, -50403, -40997, -43406, -78658, -79710, -26689, -10411, -38271, -47107, -44107, -3582, 86936, 48068, 24586, 31200, 24881, -9890, -40113, -41990, -50082, -20727, 10308, 90204, 109670, 35629, -8438, -1442, -37113, -19332, 831, 43109, 47655, -13593, 1627, 33192, 19247, -59456, -78052, -45432, -40148, 6858, 9335, -4519, -32037, -39578, -8498, 9042, 3608, 40222, 50255, 56005, 16544, -35535, -53350, -53143, -2311, 15143, -3878, 21327, 13283, 7363, -57062, -8556, 22866, 47863, 44601, -32249]
15440c2249o972M9856K7533m4181k5686K7765M6175q978r269n466n3068l6168
15428g0708j5123O0078j7406l5667O419L9929J1336P074l2322L8279L9628m4509
15416a2992m4264O2553R027q091K5450m7970k8773J4974J7336L9849J4382j0230
15404C1251m1460L0062o3977m0178N4235M912n2358M2832J1502N470P2691m0780
15392A4202q1227J7235L7034r25P1J4630k241K922o7487k6058R9112Q4014J8641
15379A09923m1400o3337l4739k5252k8431K3278L3724L0615J5359k5141j3433
15368a8834K8131m388J2110q640J3025J4146k6657m9052l2158J4855J6980N610
15356c4872l034Q113J1743L715j9292r749K9494m0625m3199J06124K6513l3763
$$ y = [-32249, -39221, 10635, 38168, -6013, -31699, -3934, 42241, 33263, 23994, 18528, -34540, -70708, -85831, -25753, -43159, -78826, -72407, -32478, -21142, -14068, -46390, -8111, 31517, -12992, -57256, 5297, 14324, 6233, 31683, -16287, -45060, -30086, -12750, 27099, 41481, 31251, -10209, 19853, -44124, -84302, -30067, -25155, -77513, -34681, -23179, -17709, 54982, 14202, -67025, -49790, -12756, -13681, -13610, 1020, -1221, 1701, -65786, -91844, 7268, 91282, 109923, 68523, 5186, -29553, -54805, -83236, -59958, -26234, 4381, 19740, -5401, -18834, 9297, 4909, 17019, 8379, 21404, 35550, 8893, -40159, -72317, -57462, -40482, -34872, -37906, -29793, -18050, -14335, -33627, -43376, -13882, -54507, -97706, 8418, 34931, 1168]
15344A168m0498m3746l8969M4347J03151K5633j1563o619l6192k5039j4104K5050
15332a7381m0090p4741k5748K6758M2926j4759J663L4600R1056p361n5837q026
15320d6940N95K8822O431J3211O2709J01003l9447p2858q9303m4859j0273K360
15308h8549P2381k6021m0420J1095M248j5678L8832J0286m356j124M896l6802
15296g1212Q321P0544R0908o2110j15567N967J1860J3379l1939K5072K7490j9103
15284d6390j0417r9L641m594N1843O9550J4547M83K0108k5129m2804k7074O577
15271A0242L6245K5707O2252L4386J6556n8305o4613Q563l0853j10425R763L7806
15259b2676N2824K8146j0756q271l7266n5602l7124J9223L3467L7465l623q516
$$ y = [1168, -39330, -83076, -122045, -77698, 25453, 51086, 39523, 32904, -3288, -28327, -42431, -17381, -57471, -132212, -157960, -131202, -88276, -103035, -101372, -66772, 24284, 16923, -38914, -46940, -46345, -17523, -11092, 2119, 64828, 165831, 126384, 53526, -35777, -80636, -90909, -88549, -16168, -42189, -82609, -71514, -67266, -82944, -44112, -33826, -38182, -39306, -34410, -71212, -62891, 7653, 98561, 36451, -79116, -73149, -61289, -47910, -79849, -54777, -27287, -46390, -56807, -56906, -53265, -57859, -6016, 63534, 78081, 78564, 98672, 73543, 30739, 3665, 10242, 46487, 72194, 134446, 168832, 185388, 127083, 62470, 71033, 40180, -70245, -60482, -22676, 30148, 58294, 47538, 39267, 2001, -53601, -90725, -71502, -38035, -570, -4193, -12709]
15247a2709j3797p8834p0313o564R5937M1978M2316P7404m430n9144P350K3284
15235D2478m6036K0484L769j3639N9203m4840q5414R084m344N9820K9029m5012
15223a5418m178K8761o6406J1578L3483R162R759N5467o308q763M3034K0288M3735
15210A54194p9284K15q4958k7322J4032J9015R436j2526k7293j7885L2557n928
15198b5747K8896P8496M4304m056r6464p9262P0011N5149r275q4656j9841j1454
15186e3899P191N9592K1416o731j3498O491p1023J2403J1962p444Q314M157p599
15173b8668M0047l585m367n770M1147O29j0599M1917j6458l7248l384L0151L5855
15160G9667K818l3935k3257l4474m0501m6979j8466Q3774P7298k519L5570K2501
$$ y = [-12709, -26506, -105340, -175653, -182217, -86280, -44302, -1986, 75418, 70988, 11844, 19194, 42478, -3558, 16926, 20695, 7056, 66259, 21419, -63995, -54911, -59255, 565, 29594, -15418, -19596, 9165, -57241, -45663, -12180, -3018, 6741, 62208, 55900, 47137, 90171, 110459, 154194, 74910, 75125, -9833, -37155, -23123, -4108, 5328, -7198, -34491, -52376, -19819, -25747, 3149, 81645, 125949, 121893, 25429, -53833, 16178, 71327, 62052, -22604, -42445, -53899, -46708, 12884, 34300, 27569, 14071, 20562, -50461, -38058, -26096, -33540, -25226, -21069, -28668, 11379, 7794, 3427, -2343, 38804, 39433, 28834, 70751, 54293, 17045, 13661, 43812, 79667, 82485, 48550, 25293, -9181, -49682, -96661, -115127, -31353, 45945, 43426, 78996, 101497]
15148A01497l691j564j3424k5188Q400J6549o0369m3917j154N0829j8940k2283
15136a3255l3400m1095K0690L4059J2741N173n4491L5129O8454m4617l4220M850
15124c9982J9232R634j3914L5905j6465k56l175M395j5398l9791P887N0998O1149
15111F0219J9812K3187L5318l0381l6290l9523k7641q860M8923O49m4450L3102
15099C4065K1260J4777j4035O282L4770K5571m2l4232L327L0399j5450n9159l9488
15086H045J0344M440m9569j6322J9266L242P300M1197m142l5335N930L2097N3976
15073H0469N985l9283J2290m3636q639j0427O714K6499j6498j661L615o937m810
15060C681K6438M733R690o0436p4284J9852o537m6852N0551Q4046L6095m5536
$$ y = [101497, 97806, 96242, 82818, 57630, 66030, 82579, 22210, -21707, -22861, 27968, 9028, -13255, -46655, -87750, -67060, -33001, -20260, -15087, -69578, -34449, 34005, -10612, -44832, -39982, -20750, -11116, -25030, 10875, -5590, -5846, -9021, -4626, -20024, -59815, -51928, -930, 60219, 80031, 103218, 138536, 108155, 71865, 32342, 4701, -4159, 44764, 45413, 963, 34065, 55325, 70102, 56067, 62349, 97119, 122690, 122648, 88416, 91743, 122142, 106692, 47533, 8045, 18389, 22829, -26740, -43062, -23796, -20554, -13254, 27943, 23801, -11534, -5604, 26493, 80469, 86454, 47171, 59461, 15825, 7186, -3241, 3473, 29972, 13474, 11813, 15428, 8491, 3681, 30119, 34852, 44542, -15894, -90178, -70326, -76863, -123715, -73164, 10882, 46977, 1441]
15048A441n6095n360M7958J207L068r164L4792M0889M6933j3692m4727m2618j9668
15035a5036M0514k1292O624L1565P3066J5452l3861j6577n9812K6476P889l4343
15023B0665n2848P183j2712o3014P547M9885M2418O536n4383p2310M6769J7354
15011e6910J0381N423J328m6933N1180O4871L267K7844j0530j7492m8712k0271
14999c6554j5463K3964N7540j5725n123M917K3113N2572K6221l1915k5402k7279
14987C0866p075l0473K331j2170M6788M957J0460k5197k0216r767L8110n3513
14975b4899o89K4202j8589p872m3174j1092j20M5210N2297K9324J8014J4880N56
14962G8048l1574k2064M5056K324n8035m522J9879M1438J6198j2617l9346m7280
$$ y = [1441, -54654, -60014, -12056, -10849, -7781, -16945, 17847, 58736, 105669, 91977, 47250, 4632, -15036, 25478, 4186, 10810, 42375, 115441, 130893, 97032, 80455, 20643, 47119, 55008, 20665, -32183, -25000, -37712, -100726, -93179, -43294, -876, 5660, -48723, -121033, -74264, -56910, -46529, -41106, -39778, -86711, -35531, 29340, 32607, 60451, 49921, 32429, -16283, -36554, -52017, -28053, 29487, 13762, 8639, 13556, 36669, 89241, 115462, 83547, 58145, 30866, 23791, -6682, -4351, -16521, 30267, 35224, 45684, 20487, 271, -9496, 28614, -24899, -25588, -1386, -19975, -27847, -71021, -82113, -82233, -37023, 15274, 44598, 62612, 77492, 78048, 46474, 24410, 69466, 71790, 13755, 9233, 29112, 70550, 86748, 74131, 34785, -12495]
14950a2495k9227k7258l2400m5060J8316Q0406M7514m6360n2966N6017r114j1686
14938f4313J2499n4404L2649M3855K1496j455m4151l1432K0889L7661j6583N699
14926c7590M5185n317n0579K0888Q544k0862k1614j7287L0890N9284l1901j5270
14914c5629M2424L5474j622J9755K0438j0605l6435p8302k1519r473m641J4807
14902f5328M3358R7465o239m8481j7447K5953M968j8506K2972L7416P450m7827
14890C5754n8296J6921M7046N242n5845j540J450m9924k6341k508l0108L514j8036
14877a32671L9099J3204J5M0447K5163J4924J670O3259l6618l9670j6047j3963
14865d1188L4656Q6995p813o1491o6706l963J146P024Q2802j0757J6822l6427
$$ y = [-12495, -41722, -68980, -101380, -146440, -128124, -47718, -204, -46564, -99530, -43513, -52627, -64313, -51814, -106218, -73569, -29714, -8218, -9673, -53824, -85256, -64367, -26706, -43289, -37590, 7595, 2278, -48301, -27413, -18869, -39731, -61345, -78632, -47742, 11542, -20359, -35629, 6795, 42269, 40647, 60402, 80840, 70235, 33800, -44502, -66021, -75494, -80135, -65328, -21970, 75495, 69256, 20775, 3328, 29281, 34249, 15743, 38715, 76131, 83581, 35754, -22542, -5621, 41425, 46667, -9178, -10718, -9268, -59192, -85533, -88041, -118149, -114635, -132671, -93572, -80368, -80353, -39906, -14743, 181, 1851, 65110, 28492, -11178, -27225, -41188, -6532, 80463, 72650, 11159, -55547, -59510, -58364, -51340, 31462, 20705, 37527, 1100]
14853A100L7358O701k2106j923K5992M0984J7857k0750m9413m1538L0974K80J6720
14840D2236M30J8355o445j9650l1558k6471l342l5718K1344M4082j5119M1340
14828B9484j4778n7889k1572M7861k1151k5919N801K5192Q77k8718M2014L6262
14816A7464l5218P959J5746L3679J4160l956l5399K2673L1041k7462l9059L4213
14804C5841L7376j2961l3874m1919k3192l2408J0549j5329j7073L5048O0209l3935
14792c1668l2029N1459K9329j5659R486k6391p6374k9285N1555Q3411o443K1054
14780B8445k6712l0502M3926P2096O9421L913o5945l550L7294m9161M7742n348
14768A21619m2776m1024q2411n4509m2189K3342L9468J2652l6336J1130J4622
$$ y = [1100, 38458, 45159, 23053, 21130, 47122, 88106, 105963, 85213, 35800, -5738, 25236, 25516, 42236, 42666, 61021, 54576, 34926, 3368, -23103, -26445, -62163, -40819, 3263, -11856, 29484, 14706, -43183, -64755, -16894, -38045, -63964, -58163, -32971, -32094, -60812, -18798, 17464, -17754, -9795, 5951, 39630, 53790, 49834, 14435, 37108, 68149, 40687, 1628, 35841, 73217, 60256, 26382, -15537, -38729, -71137, -60588, -75917, -92990, -57942, 2267, -31668, -63697, -12238, 17091, 1432, 10918, -15473, -91847, -121132, -69577, 13834, 7391, 28445, 1733, -28769, 15157, 87253, 156674, 160587, 94642, 91092, 128386, 79225, 126967, 121619, 78843, 37819, -44592, -99101, -141290, -117948, -78480, -65828, -102164, -91034, -76412]
14757g6412R482N9675J2701L45K5856J822O1275J7121j9174n216k4440M7766K3605
14744A34406k1668p1893k5282L6179M0709j4671L8983N011j2699K4252j3416n278
14732A14633j9452o8877l8264m8233L1124M1764l0033l0353k2654j3489M3946
14721c9888M8349J3919K6585o12m9057k6000r436m975j5611J8857O457m363M946
14708c0829K4727m579L3968M3568M4048n5517o6921n1037J6027K7767J9196j0208
14696i790K6980K4305Q7350P611o5056n563J1952l1234n9723J5488K6546K5997
14684E4863L0578L812k3117R791J8487K2094r408l6383l670j9486J8944J3388
14672G9893j6909J6121k24J3216J790P92l2048o500J2768K6904k1085L8930m4160
$$ y = [-76412, -66930, -7255, 5446, 5791, 31647, 33469, 94744, 111865, 92691, 87475, 63035, 110801, 134406, 112738, 40845, 15563, 51742, 92451, 77780, 116763, 121774, 109075, 133327, 119911, 114633, 95181, 26304, -11960, -60193, -29069, 12695, -17338, -47691, -70345, -83834, -39888, 8461, 22380, 48965, 48353, -704, -26704, -36140, -41115, -56726, -37869, -31412, -35775, -30829, -6102, -10681, 23287, 66855, 110903, 55386, -11535, -62572, -46545, -18778, 418, -9790, 17190, 41495, 128845, 136456, 71400, 65837, 77789, 46555, -13168, 2320, 28866, 54863, 85441, 89253, 66136, 75927, 94414, 116508, 107100, 70717, 67047, 47561, 66505, 79893, 62984, 79105, 78881, 92097, 93887, 94679, 62631, 56131, 68899, 95803, 74718, 113648, 69488]
14659F9488r1934j6175j8266j3937j5538K9558O7186J6954L4002P9717J0044q2397
14647F8702l4572j0167q976j4066j9583J8543M6745m985n7076J9542J5482K9132
14635D8721O570q595j9171K8538J4495n1939L2642L1576O927l6603j4949j3336
14623B4876m2616N3185J593K2956j0919l4506j2487L8191M2414L8922J30P577
14611A29316K4860O0420l6991l1349k2395o0484q305k5335l4093L1612N3864j5286
14599F5834q318k3668q565J2009j3446m2360K9566M5232l8915m9117k6347L0394
14587b7701l2754j1251L7728J7419J1284M5418k6930j17402O792Q2424P641J6959
14575I627J2662l3003P716K6066L5654m3540r843m0408m4279L088N6073O7396
$$ y = [69488, -22446, -38621, -56887, -70824, -86362, -56804, 10382, 27336, 61338, 141055, 151099, 68702, 34130, 23963, 14987, 921, -18662, -119, 46626, 41641, -15435, 4107, 19589, 48721, 55291, 46696, 27525, 56063, 70558, 18619, 51261, 82837, 89764, 53161, 38212, 24876, -17740, 35445, 37038, 59994, 49075, 14569, 2082, 40273, 82687, 121609, 121739, 129316, 154176, 214596, 177605, 146256, 123861, 63377, 55072, 29737, -4356, 27256, 81120, 65834, 57516, 33848, 25283, 37292, 23846, -18514, 11052, 56284, 17369, -31748, -58095, -27701, -60455, -71706, -33978, -16559, -5275, 40143, 13213, -104189, -97397, -14973, -7332, 9627, 22289, -10714, -2998, 23068, 58722, 15182, 5339, -35069, -79348, -76260, -20187, 47209]
14563D7209Q393m0736L8658J435k2307L3551N904j1533Q780P823M3120L0814L5838
14550A86949q6632j06031J6864J6638J1954J9690K259K3295j1892k2551K1890
14539G2433n2030L6998J4989r080M0859k7338K1995j4327J1212k8762J5572j3475
14527F9046m125j5751l0239K9795N2579K8722j6850j296M413J2169m0585j1459
14515G6419k307r181o530m816k6631J1263L3186R82l1764n7142j02765k7021O3948
14502h2359P3957O6421O2898M5418m1519l0733M7131M3774m8228n1261j14M689
14490I0074m008n8875m6197L399j1724K7343N6972L436L6334L5967K3477o0796
14478I5402q3727k2044K4938J43n581K0915J6829n852K9195K6476O6305N6836
$$ y = [47209, 55602, 14866, 53524, 54959, 32652, 66203, 72107, 60574, 69354, 77177, 120297, 151111, 186949, 100317, -5714, 11150, 27788, 39742, 59432, 61691, 84986, 73094, 50543, 72433, 20403, 57401, 72390, 63310, 104169, 76831, 98826, 84499, 95711, 66949, 82521, 69046, 64921, 49170, 18931, 48726, 101305, 130027, 113177, 111881, 116294, 128463, 87878, 76419, 74112, 64931, 58401, 53585, 26954, 38217, 71403, 72385, 40621, -16521, -119286, -146307, -82359, -8402, 58019, 120917, 166335, 124816, 94083, 141214, 184988, 136760, 85499, 85385, 90074, 86066, 27191, -19006, -15607, -27331, 12, 56984, 60420, 96754, 132721, 156198, 95402, 11675, -10369, 14569, 14712, 9131, 30046, 46875, 41023, 70218, 96694, 162999, 219835]
14466B19835m1522J1201l7109m5861K8548K38L1231m063l2755n1326J3780M6636
14454A38833K1536q530k7380o8760P698j4877o246K5078O7196j1858m7290m6475
14442B8925l6322J5170L7673K1495k6025k0509p122L3419K1910K003m9341r094
14430A2182M6667K6532O255l0139m694l152J6586R186k9265K5890L1808K2146
14418A30002k8565P543P249J3956K1319n4244m1333M9779O0288K6304K3773l1918
14406A84153K7052Q4377L7329m102K2447P6253R7055Q3188M0757L1645J03450
14395G83604J34017K20910J34219J28287J50154J04691P0721P2681Q5155l198
14385A881241r2490j41009j31391j51263j11060r8520r3973j29357j07921n6047
$$ y = [219835, 178313, 189514, 152405, 106544, 135092, 135330, 166561, 162498, 129743, 78417, 92197, 138833, 160369, 151839, 124459, 55699, 63397, 48520, 42274, 67352, 134548, 122690, 75400, 28925, -7397, 7773, 45446, 66941, 40916, 20407, 13285, 46704, 68614, 70617, 21276, 12182, 58849, 85381, 91636, 61497, 56803, 53651, 70237, 79423, 50158, 76048, 107856, 130002, 101437, 108980, 116229, 130185, 151504, 97260, 55927, 105706, 165994, 192298, 216071, 184153, 211205, 295582, 332911, 328809, 351256, 427509, 524564, 607752, 648509, 680154, 783604, 917621, 1138531, 1272750, 1401037, 1551191, 1655882, 1726603, 1799284, 1884439, 1881241, 1788751, 1647742, 1516351, 1365088, 1254028, 1155508, 1061535, 932178, 824257, 768210]
14375G68210P122k1155p3569j3095k3831n3943p7932n2122q870n0446m9513k6971
14363C23885j0261K1783K0063J2701j0943l1913k4453p9060l7547m3310Q848M9993
14351A99786J7283m3090j4227k5928l2362j9083K888J6657L0253p2835l4198j1474
14339A3670N6792P0392M3145K5693j4575k1242l0639J2011Q761j323K859j9776
14327A45768K358k8348l0568r30M8382K4181n4635j4053m4364j3177k6582M6478
14315E4510l5998Q53j9106J5986O3475L747q249Q657O019M558m6483m2677M982
14302A0274Q019M5956M2408k0777n750O7172j8522k3176J4787j7551m338K0285
14290A18787k4351n9587M0778J8880p405K1663k7995K9173R4377M8531K0068N925
$$ y = [768210, 775332, 754177, 680608, 667513, 643682, 589739, 511807, 459685, 450815, 400369, 350856, 323885, 313624, 335407, 355470, 368171, 357228, 325315, 300862, 221802, 184255, 140945, 149793, 199786, 217069, 173979, 159752, 133824, 101462, 82379, 85267, 101924, 132177, 59342, 25144, 13670, 70462, 140854, 183999, 209692, 195117, 173875, 143236, 155247, 164008, 162685, 165544, 145768, 148126, 119778, 89210, 88280, 136662, 160843, 106208, 92155, 47791, 34614, 8032, 54510, 18512, 19365, 259, 16245, 79720, 83467, 75218, 83875, 89894, 94452, 47969, 5292, 10274, 18293, 64249, 106657, 85880, 80130, 147302, 128780, 105604, 120391, 102840, 98502, 118787, 94436, 34849, 75627, 94507, 87102, 108765, 80770, 109943, 204320, 252851, 272919, 278844]
14278B78844q9429m7052J019k9028L1779L2202n74k4272O479j7135k4023m8372
14266G0438l5934N5449L3540k0070o7857M7264J22397N344K613k6331k0910K395
14254A68338o733J4082K1060J9223j6800m8336j0698L6962j8053o3402J3274J4522
14242A23439m6097n0R88k8224P0860Q0821m988J173J656N633m2922L2775l4624
14229A60440j00743M1056J00237L7229J5450K6618N29j2840j4845p0570m3282
14218A39279k7742J1524M6373N5514m25j305k3789n408l8097K5442J8382J9228
14206B18976J976L5860k4828L8925J835J6984K5957R8456K8063j8306L5000J1894
14194D70792M4296L30m8983j1751l9695o4199m2616k9120m2219j6549K1536L8347
$$ y = [278844, 189415, 142363, 143382, 114354, 146133, 178335, 177761, 153489, 159968, 142833, 118810, 70438, 34504, 89953, 123493, 103423, 35566, 82830, 205227, 210571, 213184, 186853, 165943, 168338, 161605, 175687, 196747, 215970, 199170, 150834, 140136, 177098, 159045, 95643, 108917, 123439, 77342, 77292, 78280, 50056, 120916, 201737, 196749, 197922, 199578, 205211, 162289, 195064, 160440, 59697, 100753, 200990, 238219, 253669, 280287, 280816, 267976, 253131, 182561, 139279, 111537, 123061, 169434, 224948, 224523, 223218, 199429, 194021, 155924, 181366, 199748, 218976, 220952, 256812, 231984, 270909, 272744, 289728, 315685, 414141, 442204, 423898, 458898, 470792, 515088, 515418, 466435, 454684, 414989, 350790, 308174, 279054, 236835, 220286, 241822, 280169]
14182B80169j1914k4679L9215N1262j90m4089k7736J0932k7631K0502q318L285
14170B60808l115k9185l7592Q785K0787N831O395M1310k4198k1189L1431O9953
14158C30021O310o271L561l9589j0048q685K3114L4449l053K367j2241O7521l1584
14145C55872p7379L8711L1837j3184m8924n0629k3205J28186R2122m0430l3818
14134C59159K9976L3477j7377q076L8543j8314k7546k5764o1810K3556J7480J5459
14122C58763q294L1333Q9192L7291p2862j01258r229N9454Q7395L0869l2291k4972
14110D45391l3533j7549k1595M855P3577O5516L9501l1503m1249j8836L420j6191
14098D51804o3115m5211L1756M9845J0937J8928N258l4143j4374N4358O0949p857
$$ y = [280169, 268255, 243576, 282791, 334053, 333863, 289774, 262038, 272970, 245339, 265841, 257523, 260808, 257693, 228508, 190916, 199701, 220488, 226319, 232714, 274024, 249826, 228637, 260068, 330021, 336331, 330060, 333621, 294032, 283984, 275299, 298413, 332862, 329809, 332176, 319935, 387456, 355872, 278493, 317204, 349041, 335857, 286933, 236304, 213099, 341285, 433407, 392977, 359159, 389135, 422612, 405235, 397159, 435702, 417388, 389842, 364078, 302268, 325824, 343304, 358763, 350469, 381802, 470994, 508285, 435423, 334165, 324936, 384390, 471785, 502654, 470363, 445391, 411858, 394309, 372714, 377569, 451146, 516662, 556163, 524660, 483411, 464575, 467995, 451804, 388689, 343478, 375234, 425079, 436016, 454944, 460202, 426059, 411685, 466043, 526992, 519135]
14086E19135k9700K8227M4713Q0073K6085j4142O746l7080J6574R4586J02768
14075H37985J00712J36276L8169k4416m4159J2871P619k1927j06798o4585Q05
14064H72552J7691n3957n1000L1600J5710l4848J6821O3482O6133O684j9182k5477
14052I06209O9071Q1449K02L1756J9607l5736m679M2681N9476Q7216M4659O3141
14040A365052O375K0260J8319L7911o6202m9817j707N2741N8094K2523q03R345
14028A472091M2894L6090J0798M2998O362J4722r711j1383P6787J08100N0083
14017A839831L4477L2835Q2512L2839M8355l8320K5987N3010Q2390J17570R4315
14006B405801O6906O9443O5304M9119R6320Q3683N3870J15237J34520J24931O6392
$$ y = [519135, 489435, 517662, 562375, 642448, 668533, 654391, 661137, 624057, 640631, 735217, 837985, 938697, 1074973, 1113142, 1088726, 1044567, 1057438, 1065057, 1043130, 936332, 871747, 872552, 890243, 836286, 785286, 816886, 832596, 797748, 814569, 878051, 944184, 950868, 931686, 906209, 975280, 1056729, 1056931, 1088687, 1108294, 1072558, 1067879, 1110560, 1170036, 1257252, 1301911, 1365052, 1371427, 1391687, 1410006, 1447917, 1381715, 1331898, 1330191, 1382932, 1441026, 1463549, 1462746, 1472091, 1514985, 1551075, 1561873, 1604871, 1611233, 1625955, 1616244, 1604861, 1681648, 1789748, 1839831, 1874308, 1907143, 1989655, 2022494, 2070849, 2032529, 2058516, 2111526, 2193916, 2311486, 2405801, 2472707, 2542150, 2607454, 2656573, 2752893, 2836576, 2890446, 3005683, 3140203, 3265134, 3331526]
13995C331526J36249J24086J58584K11679J51621K15386K24212K21669K09952
13986D984964K62734K78264K84360K63888K94237M01855L93943K87590L60752
13977G812587M03469M68976N75335O07402O54009P33278Q39577R79140J081824
13968A4155597J175923J457113J614374J886150K191715K494855K843529L294084
13960C1113340L796825M324769N170325O301183P782276R714007J2275887J5608131
13952I6086743J9919253K5251723L1334269L7225268M1552007M2661778L9330673
13945C33361714L1769780K1550976J0204671j142119j2343055k2909885l1139013
13938C29353069l5532096l5471889l2058242k7089978k2020754j7826451j4626163
$$ y = [3331526, 3467775, 3591861, 3750445, 3962124, 4113745, 4329131, 4553343, 4775012, 4984964, 5247698, 5525962, 5810322, 6074210, 6368447, 6770302, 7164245, 7451835, 7812587, 8216056, 8685032, 9260367, 9867769, 10521778, 11255056, 12094633, 13073773, 14155597, 15331520, 16788633, 18403007, 20289157, 22480872, 24975727, 27819256, 31113340, 34910165, 39234934, 44405259, 50706442, 58488718, 68202725, 80478612, 96086743, 116005996, 141257719, 172591988, 209817256, 251369263, 294031041, 333361714, 365131494, 386682470, 396887141, 395745022, 383401967, 360492082, 329353069, 293820973, 258349084, 226290842, 199200864, 177180110, 159353659, 144727496]
13931A44727496j2300387j0709786r500381q750167q380660p977602p631353p332108
13923G2145052o838934o202486n628300n013927m455591l982446l509718l134554
13915C3379096k805888k511078k323456k061755j889405j665139j497414j390278
13907A7234683j228277j126822j092575j048466q39648q27261p64100p11998o11862
13898H983674n50528m89682n19113m27261m14349m64185m15465l24550k78779
13889E099762k89224k14274j76171j62639j89570k23071j57499j64293j29005
13880C394016j10558r6206k02297j52386j39378j28242o0884q8841j06040o9039
13870B240145l5899k2247l1952l6894l4106r2637q9077m5741l1885q5282l3096
$$ y = [144727496, 132427109, 121717323, 112216942, 103466775, 95086115, 87108513, 79477160, 72145052, 65306118, 59103632, 53475332, 48461405, 44005814, 40023368, 36513650, 33379096, 30573208, 28062130, 25738674, 23676919, 21787514, 20122375, 18624961, 17234683, 16006406, 14879584, 13787009, 12738543, 11898895, 11071634, 10307534, 9595536, 8983674, 8433146, 7943464, 7424351, 6997090, 6582741, 6118556, 5703091, 5378541, 5099762, 4810538, 4596264, 4420093, 4257454, 4067884, 3844813, 3687314, 3523021, 3394016, 3283458, 3187252, 2984955, 2832569, 2693191, 2564949, 2504065, 2415224, 2309184, 2240145, 2204246, 2181999, 2150047, 2113153, 2079047, 1986410, 1897333, 1851592, 1819707, 1734425, 1701329]
13859A701329j6306O700j8837l8637k1476j3311o8015k2236l3682k2190l9438
13848A413901n0306r7736p6209L0792N1713K008m535l9096o6254o4305L7241p9241
13836A057973n1111j8499J3814k587L8119M0265J7893P138o6376k3032Q3682J0905
13824A108184l9216N046Q4654N2603K9834P144j3370j718m9745k4387j09147r4470
13812I55412k7828n7083o1413l4927N0722k0319L9535J9888m9651k5301j6001
13801G73034Q912J1896j3960o1618J1890M2216k9768L2803N4474p5565m5815M3984
13789G52483M4839K1919j1631j9802r3194m6109m3435m5598k3640N0787L1489
13778F18108j9518M53l6132k4138j3006N853j6362k0597j367j7430J1490j0687
$$ y = [1701329, 1685023, 1691723, 1672886, 1634249, 1612773, 1599462, 1531447, 1509211, 1475529, 1453339, 1413901, 1363595, 1265859, 1189650, 1220442, 1272155, 1274163, 1269628, 1230532, 1164278, 1099973, 1137214, 1057973, 1006862, 988363, 1002177, 999590, 1037709, 1077974, 1095867, 1103005, 1036629, 1013597, 1097279, 1108184, 1068968, 1074014, 1158668, 1211271, 1241105, 1248249, 1234879, 1233161, 1183416, 1159029, 1049882, 955412, 927584, 870501, 809088, 774161, 824883, 804564, 844099, 863987, 814336, 789035, 773034, 781946, 793842, 779882, 718264, 730154, 772370, 742602, 775405, 829879, 754314, 708499, 752483, 797322, 819241, 807610, 787808, 694614, 648505, 605070, 559472, 535832, 586619, 618108, 598590, 599043, 562911, 538773, 525767, 531620, 515258, 494661, 493294, 475864, 487354, 476667]
13766D76667N508l7806p2504N4504o620n8030l8006J6450J803n0935j1025L9250
13754C19256m2054j7473L2683k6722j0058L1020J188j1553k4038J5113P7065K8756
13742C73183l8307j7055p3246l1294O702m4750j4387k1190j03213L4248L9138
13731A09829J3777l0456J7332R5453J02307k0998o4955J656M32J7600M5829L1465
13719C19271j2754n316l3920j5032p7766l6164K0326N964j732K0200j0856m0090
13707A32131l0425k1724O1263M7450k9442o6830q422O487O943K1277Q44Q7916
13695B07468M2842J1224L1684m1014k9150k0534p2037j7633M0960k535p2778P9267
13683A57764J6853R285K0739j4354k0063j8727r117l1753N0279N5341K619o9859
$$ y = [476667, 482175, 444369, 371865, 426369, 419749, 361719, 323713, 340163, 341966, 291031, 280006, 319256, 277202, 259729, 292412, 265690, 255632, 286652, 287840, 276287, 252249, 267362, 344427, 373183, 334876, 317821, 244575, 213281, 219983, 175233, 160846, 139656, 36443, 70691, 109829, 123606, 93150, 110482, 205935, 308242, 287244, 222289, 223945, 224377, 241977, 287806, 319271, 306517, 301201, 267281, 252249, 174483, 138319, 158645, 164609, 162877, 183077, 172221, 132131, 101706, 79982, 141245, 188695, 159253, 92423, 84001, 90488, 97431, 118708, 119552, 207468, 250310, 261534, 293218, 252204, 223054, 202520, 130483, 112850, 153810, 151275, 78497, 157764, 174617, 183902, 204641, 190287, 170224, 151497, 142380, 110627, 160906, 216247, 218866, 149007]
13671A49007j9500J1715L9916Q4731l8647m9338k9307K9695J5106k490K2376M0889
13659B54153M2126M2561n8281j9501Q590P575j8095m6784k2405m0739O2304K8077
13647B39581n1912j5679k3628q301K8570J2013J1713J0751q9222l9500l4119M0881
13635H1148L4121j2874K3818j420L120q0117m9945k1636j2057J0651N9160L7648
13623G1617K1439L885j9369q5584K3018J22737O9593l3870m5904k2583j2178K8891
13611A21692l910J0115J1828n303k6995r403J1527k2312l3562o6860J5241N5350
13599E7408L066p842J5468K7092Q724n5546L189k6203R6676L5660L8865j4863
13587A81694L8706J0282q8049j609J6158q473m7159J5291O2517L7267j2303m7157
$$ y = [149007, 129507, 141222, 181138, 265869, 227222, 177884, 148577, 178272, 193378, 190888, 213264, 254153, 296279, 338840, 280559, 261058, 269648, 277223, 259128, 212344, 189939, 149200, 211504, 239581, 187669, 171990, 148362, 140061, 168631, 180644, 192357, 203108, 113886, 74386, 40267, 81148, 115269, 102395, 126213, 124793, 127913, 47796, -2149, -23785, -35842, -25191, 33969, 71617, 93056, 96941, 77572, -8012, 15006, 137743, 207336, 173466, 127562, 104979, 92801, 121692, 117782, 127897, 139725, 134422, 107427, 98024, 109551, 87239, 53677, -13183, 2058, 57408, 60474, 52632, 68100, 95192, 103916, 48370, 51559, 25356, 122032, 157692, 196557, 181694, 220400, 230682, 142633, 141024, 157182, 148709, 101550, 116841, 179358, 216625, 204322, 157165]
13575A57165K5158N2548K2144Q6785R6646O6219L5927J87601K39138L04004K22418
13564A495753L8647k56686l33798k66323j72428q0854m8499Q775K6229L2109m3296
13553C99629n4835m8482j5213J03954K3835m7971K3944l5369j7183K428L4744
13542C69481O9247J9535R4569J28228J84592K49506L36475M77471O15002M60004
13532C004110L0276m71778n67438m28666l55843j81122j54174j54941k7499k5014
13522F67911m2976p041L0828j8745k4080M2758L7514j14699o7463r56K8738P5697
13510F07486M8643J4944M6875P3014J31167J75215K61576L32122M11305L80870
13500B483217K04743q0834k56439j29057p2507k0721m283m5086m6877M671m7703
$$ y = [157165, 182323, 234871, 257015, 343800, 440446, 506665, 542592, 730193, 969331, 1273335, 1495753, 1534400, 1277714, 943916, 677593, 505165, 424311, 375812, 384587, 410816, 442925, 399629, 344794, 296312, 281099, 385053, 408888, 360917, 384861, 349492, 332309, 334737, 369481, 438728, 458263, 552832, 681060, 865652, 1115158, 1451633, 1929104, 2544106, 3004110, 3034386, 2562608, 1995170, 1566504, 1210661, 1029539, 875365, 720424, 692925, 667911, 624935, 617894, 648722, 629977, 605897, 648655, 686169, 571470, 504007, 503051, 531789, 607486, 656129, 671073, 717948, 790962, 922129, 1097344, 1358920, 1691042, 2102347, 2483217, 2687960, 2607126, 2350687, 2221630, 2149123, 2128402, 2124119, 2079033, 2032156, 2036827, 1989124]
13489A989124k04539k04810r5751j36203j34832m4220p6748j30148j06959o7343
13479G87571n0858k3959k9874o0446n2687m0452K8128l6789o0547j38357o1485
13468B60245l5433O844r518l1885J2521J6578j12L7363k2505l6807o4887m8992
13456H3412J2994N2861J3722O676J5290l6366k1925m948N978j6196m6322q845
13444E6331M312k0051N5868N9079j1389n7975l5897p539m645N851M4435K5716
13432A14096n5532k7996P9267M5526K5049k6808m4919J1142n598K7821L5406M555
13420A82009n1535l3642m8816M694o607O180j3407j7457k7763k5555J3627L8459
13408B0187p508K6241N250n164K5155j4275k6840L6916M9338K1314p2655m5043
$$ y = [1989124, 1784585, 1579775, 1484024, 1347821, 1212989, 1168769, 1092021, 961873, 854914, 787571, 736713, 712754, 682880, 622434, 569747, 529295, 557423, 520634, 460087, 321730, 260245, 224812, 231656, 222138, 190253, 202774, 219352, 219240, 256603, 234098, 197291, 132404, 83412, 96406, 149267, 162989, 169665, 184955, 148589, 126664, 121716, 127694, 111498, 65176, 56331, 60643, 40592, 96460, 155539, 144150, 86175, 50278, 42739, 38094, 43945, 88380, 114096, 58564, 30568, 109835, 155361, 180410, 153602, 108683, 119825, 114227, 142048, 177454, 182009, 130474, 96832, 48016, 52710, 46103, 52283, 38876, 21419, -6344, -31899, -18272, 20187, 12679, 38920, 44170, 39006, 64161, 49886, 23046, 59962, 109300, 130614, 57959, 12916]
13396A2916R091k5220k0052M3327q983l8767N7313K4904j4183o3915J0676N2556
13384C9663j9101n3731k2100N259M6642M0303M1971L6234Q988l2735k7673K7051
13372I0771l2911k980l3105p0342n498m6794N2519J00153K5750O282l0198r2214
13360c8567J7910M6111K505l6637r960M6231l723j194n1403j3146k8949K7533
13348d3289j0964k053L7315k2406J2066N2569j5930m8332L3159l368l7568k5460
13336g4261L1331K6644K7936k2164m5242N476K4610O1413p873m7994m7209M3189
13324b4144Q1040J0526l0040n9488j9939P383J1477K6631N0067q895L2897M8987
13312A26502l517l2065k4422J1187q454l1784o826Q386k0136j4133l7640K6251
$$ y = [12916, 22007, -3213, -23265, 20062, 11079, -27688, 29625, 54529, 40346, -23569, -12893, 39663, 20562, -33169, -55269, -50010, -3368, 36935, 78906, 115140, 124128, 91393, 63720, 90771, 57860, 54880, 21775, -48567, -54065, -100859, -48340, 51813, 77563, 83845, 53647, -38567, -20657, 25454, 27959, -8678, -18638, 27593, 23870, 22676, -28727, -41873, -70822, -43289, -54253, -56306, -18991, -41397, -29331, 23238, 7308, -41024, -7865, -11233, -48801, -74261, -42930, -16286, 11650, -10514, -55756, -50280, -25670, 35743, 27870, -20124, -67333, -24144, 56896, 67422, 37382, -22106, -42045, -34662, -23185, 3446, 53513, 44618, 77515, 126502, 122985, 90920, 66498, 77685, 69231, 37447, 30621, 39007, 18871, 4738, -32902, -6651]
13300f651L8624k2293J4295M433l5350K0446L4993K3088m0862j3032L2504O8585
13288A18780j4401k6534m3616r7958q4677M8383L4278N2646P0598R715o1775P062
13276A2501r24J0247k397p2723j00794L4055P4815K5414K3139L2416N5681N1733
13264A43163j0340k0140l887Q093k0202m747j1695l9970m756K6637k2297l8274
13252A585j4455R684M0610p60m470l645K3158K0102j9289K424l5651k1496m0710
13239d2913L3960N7720m9979m2627M3688j2139l1975k1706M3273N6434K5134j9773
13227C9097j0371L0424m0187p8431o8282N2166n282j4305k134k861L0808J9170
13215e0188M3921K609J9593M1943p540K1621n3909j8621n867J1040j8888Q723
$$ y = [-6651, 31973, 9680, 23975, 28408, -6942, 13504, 48497, 71585, 30723, 17691, 50195, 118780, 104379, 77845, 34229, -63729, -148406, -100023, -65745, -13099, 57499, 67214, 5439, 12501, 11577, 21824, 19427, -53296, -154090, -120035, -45220, -19806, 3333, 35749, 91430, 143163, 132823, 112683, 108796, 116889, 96687, 91940, 80245, 40275, 35519, 62156, 39859, 1585, -12870, -3186, 37424, 36664, 32194, 28549, 51707, 71809, 52520, 54944, 19293, -2203, -42913, -8953, 48767, -1212, -43839, -151, -12290, -44265, -65971, -22698, 33736, 58870, 39097, 28726, 59150, 18963, -59468, -127750, -75584, -80866, -95171, -97305, -100166, -69358, -50188, -6267, -3658, 15935, 57878, 50338, 71959, 18050, -571, -6438, 4602, -14286, -5563]
13203e563k8992k7875K9341O9795J4282j4941l7841Q527L9499L463M1702k4673
13191F6724J1390r217m0409j9921l8917K5485P672p430j6410K7257N2175M3180
13179A01579P741p9954o4052j6777M6714N4974K412M8252m4328m7207J4541L2061
13167E5956j074j9490o6835n6847l957L0446O5268L2276K649o9282J87K1954K1118
13154A2369M4506l722p0660N1150Q7520N422q602p766L1189k7119j7673J3650
13142A10264m0220p4009q6504K3629P1246j245m4650j2775K3163N1025K5697l8101
13130G520m2098K91P399K2474m0616M1677M2776q263M335M0043N4605k8496o08
13117A01039m064l4522K2702M8754k4674j6567n7899J0110N603j410m4680l248
$$ y = [-5563, -34555, -62430, -33089, 36706, 50988, 36047, -1794, 6733, 46232, 49695, 91397, 66724, 78114, 68897, 28488, 8567, -30350, -4865, 2807, -4623, -21033, 6224, 58399, 101579, 109320, 29366, -34686, -51463, -4749, 50225, 52637, 100889, 56561, 9354, 23895, 55956, 54882, 35392, -31443, -88290, -92247, -61801, 3467, 35743, 38392, -30890, -30703, -8749, 12369, 56875, 53153, -17507, 33643, 121163, 126585, 117983, 110217, 141406, 114287, 96614, 110264, 70044, -3965, -90469, -66840, 4406, 3161, -41489, -54264, -31101, 19924, 45621, 7520, -34578, -34287, -26888, -4414, -45030, -3353, 39423, 31160, 35495, 75538, 130143, 101647, 101039, 96975, 62453, 85155, 133909, 109235, 92668, 34769, 44879, 50482, 49072, 4392, 1144]
13105A144M3031J2020J5089m6623j4734M5324Q552k0863o7506j9094k6291n518
13093g5469K9874M2205J5445Q074P2664J1328j494R9252k907p3837o8001k9831
13081B7303j7772K2144L0235R1p3230m5811P56K7217l634N6251q085J3930m1703
13068a2308p649L2680P4068O6709o7189o217Q088N9516p159p5481m1105r990K2980
13055C6943n184m7072J7551r136J5710O210L3082q284j5628o1146q497L3525N2661
13042D0735L350j7514N239l1925j1552j585r8722k5255O9113J1749J6625N3365
13030A3623J1979L2975j0198l6626q739N0801K1528o986p326M2093J0169p466
13018A05827k8257o5115l6792n759M1068m4666R337K3525K0828j1407J0516j1939
$$ y = [1144, 44175, 56195, 71284, 24661, 9927, 55251, 63803, 42940, -24566, -43660, -69951, -75469, -45595, -3390, 12055, 20129, 92793, 104121, 102627, 201879, 198972, 125135, 57134, 27303, 9531, 31675, 61910, 62001, -11229, -57040, -56284, -29067, -32701, 23550, 15465, 29395, -12308, -19957, 12723, 86791, 153500, 86311, 80094, 88182, 147698, 140539, 65058, 23953, 13963, 36943, 31759, -15313, 2238, -6898, 8812, 15022, 48104, 39820, 24192, -36954, -45451, -11926, 40735, 44085, 26571, 31810, -115, -11667, -13252, -111974, -137229, -68116, -56367, -39742, 13623, 25602, 58577, 48379, 11753, 3014, 53815, 75343, 68357, 61031, 103124, 113293, 105827, 77570, 12455, -24337, -30096, 10972, -33694, -24357, -832, 19996, 8589, 19105, 7166]
13006G166m2692k718P318J6638N305j2j4077N4331j950p475l4419m3379q363k3827
12992h8154K3483K9241P265m3421K0029N2096L7992L766m7611J7163J7605j6027
12980A3427n6213j8654m0964k010O7335O7541l0879k4843q669j0973l1026j8486
12968i4414J5281P1117L4919k4865j8697k8239r330J3721J7299m6908K6497N2120
12956H501K2014m9359o5842O835L2727k6631O4549M0334O997J8938o7540k446
12944a0923M5596K9934K49k8444j2202m2977L874Q596J5691J5477L5061K1495
12932H1427l8048o8242K4340J562L407j621P7281M1652L0118J072j8955k8538
12920A05455l8612l0798J311k2389J0984l0018j7143p991j0443L3186J4162l4329
$$ y = [7166, -35526, -38244, -30926, -14288, -8983, -8995, -23072, 31259, 29309, 21834, -12585, -55964, -64327, -88154, -64671, -35430, -28165, -71586, -51557, 539, 38531, 42297, -5314, 11849, 29454, 13427, -42786, -61440, -102404, -104414, -37079, 30462, -417, -25260, -33929, -44902, -75928, -94414, -79133, -8016, 26903, 2038, -16659, -44898, -54228, -40507, -23208, -70116, -43619, 8501, 30515, -18844, -84686, -77851, -45124, -71755, -7206, 33128, 40125, 59063, -8477, -10923, 34673, 64607, 64856, 36412, 24210, -18767, -14893, -6297, 9394, 24871, 59932, 81427, 43379, -24863, -523, 1039, 4446, 2825, 80106, 121758, 151876, 152948, 133993, 105455, 66843, 36045, 37356, 14967, 25951, -4067, -21210, -29201, -39644, -6458, 7704, -26625]
12908b6625j5151L3613R2593n874m9263j2513m5748n9842l2431n9977N8689P2081
12896e0448J8182j7168L2956J5028M9960M6614k1014o6051l6980r562j4018m7937
12884a00438n015O3951L4601n4049k4316L4152K807P316J2020N0107K8906j4510
12872C5532m1215k7848L801L6574k5350J2434N5655Q285J163l9839J9273L4656
12860G3121k7889j562n6087n5375M2189N7985j7378m6431k5366J7776P1325P1111
12848A03419o5597n5742l5751k1921L472O826j7299J11k885L2014O0669j598k7116
12835b1398l8010L2821k346n4698O4796N2717o0643m4847J0699L9433M8453j078
12823B5899M462M2083k1979l5069J361j5741M588M6849m7898j0339q646l7235
$$ y = [-26625, -41776, -8163, 84430, 78556, 29293, 16780, -28968, -88810, -121241, -181218, -122529, -50448, -32266, -49434, -16478, -1450, 48510, 95124, 74110, 8059, -28921, -38483, -52501, -100438, -105453, -41502, -6901, -60950, -85266, -51114, -48307, -40991, -28971, 21136, 50042, 35532, -5683, -33531, -29730, 6844, -18506, -6072, 49583, 57868, 59031, 19192, 38465, 73121, 45232, 43670, -12417, -67792, -25603, 32382, 15004, -31427, -56793, -39017, 32308, 103419, 37822, -17920, -53671, -75592, -72120, -65294, -82593, -82482, -85367, -53353, 7316, 5718, -21398, -59408, -26587, -28933, -83631, -18835, 33882, -26761, -71608, -60909, -21476, 26977, 25899, 30361, 72444, 50465, 15396, 16757, 1016, 5604, 52453, 4555, -5784, -14430, -51665]
12811e1665K706N9000M0143n7229j2579k013J5662l1780N983M8042L3833j5643
12799C4460j4817N9957N771o5032l3642p847R37o828L7822Q7891r071L2964K545
12786A25110k4690n9689J29M637k7994J2497N778j7655k0484N861O492k0287N1080
12773D0785K3053l320m9042o2738K7246N5132m6124m5724K9583M7116L328J6759
12761C6054k9589j08441j4592K5987M1953k3494Q691L6649L9485O0416J8031n1460
12749C9690K547M206J6070L805M537r559o8118J842K4739J8763M6663M016l5549
12736E3652j02960r832N9543M2228O1006J0636j3218j1036r332j8043m3306j9092
12724B46J6864j4369J2427k1287j7780l2800n0236m951N1237L5290N16K6246j5981
$$ y = [-51665, -48959, 10041, 50184, -7045, -19624, -21637, -5975, -37755, -31772, 16270, 50103, 34460, 19643, 79600, 85371, 20339, -13303, -21150, -20213, -27041, 10781, 98672, 89601, 122565, 125110, 100420, 40731, 40860, 45497, 17503, 30000, 35778, 18123, -2361, 3500, 9992, -10295, 40785, 63838, 60518, 11476, -51262, -24016, 31116, -15008, -60732, -31149, 15967, 19295, 36054, 6465, -101976, -116568, -90581, -48628, -72122, -63431, -26782, 12703, 73119, 91150, 39690, 42237, 46443, 62513, 66318, 70855, 61296, -6822, -4980, 19759, 38522, 85185, 89201, 53652, -49308, -59140, 403, 42631, 103637, 114273, 101055, 90019, 80687, 62644, 19338, 246, 17110, 2741, 15168, -6119, -23899, -56699, -106935, -111886, -60649, -25359, -24843, 1403, -14578]
12711a4578j9587o007l1215P4805k803M8643O5743q887k3972q4965n9333J8241
12699d3915K891K1846l5253k2722K8446J1617K9240k2874M038q568k0917J6617
12687c9554K8812M7978k4983j00351k8444J7895j0024K9736M6412J6776p9994
12676i5741l2221J8987O0223L8544K3503l6224j7238K7461j3073k6031k4335k0015
12664i6160j5057n7340L0260Q9353P9739J0851k8855r227K377O8020m5108j7697
12652A1156K0195n1698n2734Q873N0478L4396N2078P099K5871k3226o7856J923
12640A6555k3481K3605r64J3360o0809l209j6457j3113J0347L3731N3165M4471
12628G7201o7719k7717l3150K1713O3441k2939k0098J4003K3820k759k7758j40
$$ y = [-14578, -34165, -40172, -71387, 3418, 615, 49258, 115001, 106114, 82142, -2823, -62156, -43915, -41024, -19178, -54431, -77153, -48707, -37090, -7850, -30724, -26686, -35254, -56171, -39554, -10742, 37236, 12253, -88098, -116542, -98647, -108671, -78935, -32523, -15747, -95741, -127962, -108975, -48752, -10208, 13295, -22929, -40167, -12706, -25779, -51810, -76145, -96160, -111217, -168557, -138297, -48944, 30795, 41646, 12791, 3564, 5941, 73961, 28853, 11156, 31351, -20347, -73081, -64208, -13730, 20666, 72744, 79843, 105714, 82488, 14632, 16555, -6926, 16679, 15715, 29075, -31734, -34943, -51400, -64513, -54166, -20435, 32730, 77201, 9482, -18235, -51385, -29672, 33769, 10830, -9268, 4735, 28555, 25796, -1962, -2102]
12616b102r290M3115k0975L827J6104J7102J2677M904k0808J2103N505j7230k6763
12603A8169m1922o7117M7700M5606k9190l5775O5500N2904R0763l580j3941K0316
12591A49433m8528n9411k9874l8584j1764J2244J2116M1299q0036j7280M8570
12580b1815L2450k5381l6003K3393j2742j4404K3593K0150J5789o480j5514p178
12568b4142p264m2705k1837K2993K6202j9809L0660M988q6186k3677L6717J9184
12556h4876K1412j591j4879K9454J1253K6817k1177k6409K1605P4254K5319N349
12544F6531j3635J3609O3239P4677j13899j00791j9844P940M3537J342Q220J1009
12532D1935P4777k784K18j8015J7761m4600k2227J7697J0159j3165j9080o0228
$$ y = [-2102, -11392, 31723, 10748, 14575, 30679, 47781, 60458, 65362, 44554, 56657, 62162, 44932, 18169, -23753, -90870, -43170, 2436, -26754, -62529, 2971, 55875, 146638, 143058, 129117, 149433, 100905, 41494, 11620, -26964, -38728, -26484, -14368, 26931, -53105, -70385, -21815, 10635, -14746, -50749, -27356, -40098, -54502, -30909, -10759, 5030, -1450, -16964, -24142, -31406, -74111, -95948, -72955, -46753, -66562, -35902, -30914, -117100, -140777, -104060, -84876, -63464, -65055, -79934, -50480, -39227, -12410, -33587, -59996, -38391, 35863, 61182, 66531, 52896, 66505, 129744, 204421, 90522, -10269, -30113, -22173, 21364, 22706, 30926, 41935, 116712, 113928, 114146, 96131, 113892, 69292, 47065, 64762, 74921, 61756, 42676, -17552]
12520a7552k9135P2865J9698M622J8818j2215k992J2142P994k9600l5981n7229
12508d8565J7813K6213K2669l289j02677M0796N7634Q679q149N420K2728K0202
12496E9474p081n3050J4465O2808k2774m4121k7283r766n9107j4447k9593L8111
12484i2364N5001L8881p316R536J9009k9831J8104L2649J7241J3049L3454j6807
12472I0606l2303j7225k4134p7413J6129J9434l9086P103O3948O1018m789n417
12460E7871n4754J0624k6106L9457K7512n95L3285L7088o9012l2028Q75K1070
12448D5287J3282j8684k3471J6185J7691j223q710o8067o3824m1253l2619N5422
12436a09984R5891K1157l7131M4975K6240k1061j7395k77J6301Q78K762J4869
$$ y = [-17552, -46687, 26178, 45876, 50498, 69316, 57101, 54109, 66251, 74245, 44645, 8664, -48565, -30752, -4539, 18130, 14841, -87836, -47040, 10594, 19273, 11124, 16544, 39272, 59474, 52393, -657, 13808, 76616, 53842, 9721, -17562, -27328, -86435, -100882, -130475, -92364, -37363, 1518, -5798, 3738, 22747, -7084, 11020, 43669, 60910, 73959, 107413, 90606, 58303, 41078, 16944, -60469, -44340, -24906, -63992, -56889, 7059, 68077, 63288, 57871, 3117, 13741, -12365, 27092, 54604, 54009, 87294, 124382, 55370, 23342, 24217, 45287, 58569, 39885, 16414, 32599, 50290, 49067, 40357, -27710, -91534, -132787, -165406, -109984, -14093, 7064, -30067, 14908, 41148, 20087, 2692, 2415, 18716, 19594, 22356, 37225]
12424C7225l9947L338q393j6084L829K9922k4950L8259Q717q4242m092P8214M1784
12411F3580L5829m5211p8047m8383l6223J3794P6667M1117O0948j3806j04985
12400c4720k1729L5529M8660L4397j4623l1386O306m6632l205J6319k0281m5042
12388g6407L4728K1298N8082Q5318m0980l6448j3531m5295M575K5593P4424o408
12376H4949n8598o4339l2974O536K8755L9996k0260J5417J4822R031j5348j6580
12364h593l8695n3586N815N2390L2765M929O038j7209J3576K9904l9229k166N3384
12351C9323L3898m383K1018J1713m1734m8291K5528j7770k8427k5520M1475n912
12339I18K8069K2484n2828n096K2546L2795J0441R992N3581m8004j9928l4999
$$ y = [37225, -2722, 616, -7777, -23861, -20032, 9890, -15060, 23199, 31916, -52326, -56418, 21796, 63580, 99409, 54198, -23849, -72232, -108455, -94661, -17994, 23123, 84071, 70265, -34720, -56449, -20920, 27740, 62137, 47514, 16128, 22434, -24198, -27403, -11084, -31365, -76407, -41679, -20381, 37701, 123019, 82039, 45591, 32060, -13235, -8660, 16933, 91357, 84949, 26351, -37988, -70962, -64426, -35671, 4325, -15935, -518, 14304, 23335, 7987, -8593, -47288, -100874, -95059, -42669, -9904, -4975, 1063, -16146, -2570, 27334, -11895, -14061, 39323, 73221, 68838, 89856, 101569, 59835, 11544, 37072, 19302, -9125, -34645, 6830, 918, 28987, 51471, -1357, -6453, 16093, 48888, 59329, 69321, 122902, 74898, 54970, 19971]
12327A9971K2463K1572J4939Q3516n2217j02687k5816k2706k450L5352J16990
12316A08927q542q7608n0949k3883N2855M1908J5174P4869k7992m7181m5692j8670
12304a6784j2431O5421P2195P814p3272o8537L1793L2168J8651j7293J8749J8576
12292G7050k1983k3118k7053M9821N1902m5881m1548m6047j6685m4438O2447K1653
12280c880J7868j6559j5091n0714K8137J11735J9687l9718l7921R929O706M0269
12268G0448J4446l0860o4997l4426m3497j0516L146R534J2364K6070O1042J2913
12256B5667N3996j4352l2705Q975Q163k5611j5434l5244k3301M2070P3226j3179
12244E2271j1991N878K7261o145n1839j085K515m9992O563n873l2579p75O4206
$$ y = [19971, 42434, 64006, 78945, 162461, 110244, 7557, -18259, -40965, -43415, -8063, 108927, 100385, 12777, -38172, -62055, -9200, 32708, 47882, 122751, 94759, 47578, 1886, -16784, -29215, 36206, 108401, 116215, 42943, -25594, 6199, 38367, 57018, 39725, 58474, 77050, 55067, 31949, 4896, 54717, 106619, 60738, 19190, -26857, -43542, -87980, -25533, -3880, 13988, -2571, -17662, -68376, -40239, 71496, 91183, 51465, 13544, 23473, 30179, 70448, 84894, 54034, -10963, -45389, -88886, -99402, -96256, -86722, -74358, -48288, 12754, 25667, 79663, 65311, 32606, 41581, 49744, 24133, 8699, -26545, -49846, -7776, 65450, 52271, 40280, 46158, 73419, 67274, 15435, 14350, 16865, -33127, -26564, -32437, -65016, -65791, -1585]
12231a585O7028k9140o7202J9419N3398j0518L1205J8831M0140n409j7679K2087
12219A20575l2396l3332l8144J9207L435j4230l8132j16821p631N6674R4336j2479
12207A062L4352K3473L6582j3048J7991r562k4441K0326L2022J5426R552o788
12195A36947m1461r8035n0302J1688J1899P5994J8700j6189O428N7993J6755n7639
12183G2778k5352k5135l1870l800L5059L6312M6996N9227L4631l4257k8767n039
12171A30783j6283J5104K8601K633N073O1474j3850j1965N6678Q4067J29373J22223
12159E93911P1589O0213L4411q3735j45492j02192j08417m7361k7268m0834j8983
12148A85842J5694n9021m7974M5586L7083j2880m2124k3099m723K5675j4759m7884
$$ y = [-1585, 65443, 36303, -30899, -11480, 41918, 31400, 62605, 81436, 121576, 116167, 98488, 120575, 88179, 54847, 16703, 35910, 39345, 25115, -13017, -129838, -137469, -80795, 13541, 1062, 35414, 58887, 95469, 82421, 100412, 90850, 66409, 86735, 118757, 134183, 143735, 136947, 95486, -2549, -52851, -41163, -29264, 46730, 65430, 49241, 55669, 113662, 130417, 72778, 47426, 22291, -9579, -13379, 21680, 57992, 104988, 164215, 198846, 164589, 135822, 130783, 114500, 129604, 158205, 160838, 165911, 227385, 213535, 201570, 258248, 342315, 471688, 593911, 665500, 725713, 760124, 676389, 530897, 428705, 320288, 272927, 245659, 204825, 185842, 201536, 142515, 94541, 140127, 177210, 164330, 122206, 99107, 94384, 120059, 105300, 57416]
12136E7416j2358N0281N8105R7900R3045O8050Q8027Q1454J40931R1628j5872
12125G98607j24635o9331k538k7834K5458P8113J87372J88822K80354L73281M17958
12114B125627K03770j09973m05265m61603l33316j71944o6492n7950r7973l3135
12104E91746l5598n6097p695Q2711N4008o0083j319n7784o9915l8009n383P9322
12092D75904K304J1161m1571q220M2069O2872K32485L78269L80890M54046L12577
12081B302786Q428l58659m46587l59018j76092j5135J17340J57764K46460L48877
12071A826164L98239L77802M4698l86254n25554l63753k66174j73680j44730l3556
12061G53202n7351k5027J5356k694p4224o416K662J6573k7663j10001p0294p3778
$$ y = [57416, 45058, 95339, 153444, 251344, 344389, 412439, 500466, 581920, 722851, 814479, 798607, 673972, 604641, 602103, 574269, 599727, 677840, 865212, 1054034, 1334388, 1707669, 2125627, 2329397, 2219424, 1814159, 1352556, 1019240, 847296, 780804, 722854, 624881, 591746, 556148, 500051, 492356, 575067, 629075, 568992, 567673, 509889, 439974, 401965, 396582, 475904, 478208, 489369, 447798, 439578, 481647, 544519, 777004, 1155273, 1536163, 1990209, 2302786, 2311214, 1952555, 1505968, 1146950, 970858, 955723, 1073063, 1230827, 1477287, 1826164, 2224403, 2602205, 2646903, 2260649, 1735095, 1371342, 1105168, 931488, 786758, 753202, 695851, 670824, 686180, 683486, 609262, 602846, 605508, 622081, 594418, 484417, 414123, 340345]
12049C40345k677L7424Q2726J4159j6513Q6321J54902J38811K33917M61174M58571
12038A989160L11927L5493l30707m60753l77745j86413q0497J8442O185l630O8123
12027I89585J44649J41214K8941j83427j39596o4104j09238j63444j32380m4179
12017D68021M1814K5540n2620j1229K4240l7341j4208k0443j2861r520k2870K5590
12005D04113q606j655j8411L6587K1010O4084K8674N1226P7453R5040J40554J40743
11993A030812J06374p17j62572j51553j17286r2334m4824K866J1172K8930o2448
11982E48420m673j1124J3263K6477q051M7550R8022O2319L8228L5830K7592J550
11970H75403J7969R023O097J01582M5822m86P8220M8394N9451P3073P5732K8321
$$ y = [340345, 337668, 375092, 457818, 471977, 455464, 541785, 696687, 835498, 1069415, 1530589, 1989160, 2301087, 2336580, 2005873, 1545120, 1167375, 980962, 900465, 918907, 925092, 921462, 989585, 1134234, 1275448, 1304389, 1120962, 981366, 917262, 808024, 644580, 512200, 468021, 509835, 535375, 482755, 471526, 495766, 458425, 444217, 423774, 410913, 401393, 378523, 404113, 395507, 393852, 375441, 412028, 433038, 497122, 525796, 577022, 654475, 749515, 890069, 1030812, 1137186, 1136469, 973897, 822344, 705058, 612724, 567900, 570766, 581938, 610868, 548420, 543747, 532623, 545886, 572363, 564312, 611862, 709884, 772203, 810431, 846261, 873853, 875403, 893372, 902395, 908492, 1010074, 1055896, 1055410, 1133630, 1182024, 1241475, 1314548, 1390280, 1418601]
11958A418601N7484M1927O7041Q1280J47007J32654J63712K02996J84703K64514
11948B761919K61989K88238K99166L63150M60571N88329O31190P44735Q60853
11939G260140J089418J369806J783400K323646L014456M149932N884888Q637469
11931C5513155J2961995J9293362K7614520L5013230L4200497J6565751j5146268
11924A66016242l5414950l1998565k1756755j4285907r759720p101460n269144
11917D0429741l925326k849234k044822j378356j011457j374507k167496k733986
11909B2944557k752069k466267k172602j794209j536604j308797j115034r98627
11901H800348q17121p55285o64610n82438n41359l97036m49537l83658l38355
$$ y = [1418601, 1476085, 1518012, 1585053, 1666333, 1813340, 1945994, 2109706, 2312702, 2497405, 2761919, 3023908, 3312146, 3611312, 3974462, 4435033, 5023362, 5654552, 6399287, 7260140, 8349558, 9719364, 11502764, 13826410, 16840866, 20990798, 26875686, 35513155, 48475150, 67768512, 95383032, 130396262, 164596759, 181162510, 166016242, 130601292, 98602727, 76845972, 62560065, 52800345, 45698885, 40429741, 36504415, 33655181, 31610359, 30232003, 29220546, 27846039, 25678543, 22944557, 20192488, 17726221, 15553619, 13759410, 12222806, 10914009, 9798975, 8800348, 7983227, 7227942, 6563332, 5980894, 5439535, 5042499, 4592962, 4209304, 3870949]
11892C870949l30408k71131k67125j43881k07858j95392j49127j71859j96058
11883A938110j85305j01040j15768q2352j28375j49174j19143j14786p6944l8985
11873H26238o2927n9468p2615n5533m2390Q843o347n2984l0612m2594J8477N7448
11861D85536J4607K6393k166k5948n5011m7895m1040j5247J2819j3241l2311j6830
11849B89666q7843q0863P5510O4324k6189k8128M7018r871l2761J7174k7533m1231
11837A59273L3290r540J5598k7528m0790l617K9700K8218K0503k9536k1638K2408
11825A76341j7103L7495N6871m946o92k7847J131K5950M5478k0504l371k7331
11813B41472J2480k4490j6968K5874l761L1514j7767l5752J749k9320J0032M2807
$$ y = [3870949, 3540541, 3269410, 3002285, 2858404, 2650546, 2455154, 2306027, 2134168, 1938110, 1752805, 1651765, 1535997, 1453645, 1325270, 1176096, 1056953, 942167, 865223, 826238, 763311, 703843, 631228, 575695, 533305, 542148, 535801, 482817, 452205, 409611, 428088, 485536, 500143, 526536, 524370, 498422, 443411, 395516, 354476, 339229, 352048, 338807, 306496, 289666, 201823, 120960, 196470, 260794, 234605, 206477, 253495, 243624, 210863, 228037, 200504, 159273, 192563, 183023, 198621, 171093, 130303, 126686, 156386, 184604, 205107, 175571, 153933, 176341, 159238, 196733, 253604, 248658, 247966, 220119, 221250, 247200, 292678, 272174, 268803, 241472, 253952, 229462, 212494, 238368, 234607, 266121, 248354, 212602, 214351, 185031, 195063, 237870]
11801B37870J02667L7331q3753j10367n2993o624L9370l832M387l422m9359k5146
11789H6129L5136L5804K3341m4022J3204J254o2474n8904m9590O782O7568N7938
11777A12166K2533m304n181r650l9351N4954l7241l2150L101R015J0563n542k5531
11764E3382J3547m2883O159l1808J3939J7222M0490O656m2898n0818j1095L9308
11752A1201o228K1736J8372P727l4517N553k9571k8709Q2937L4673J2767m1808
11740E4133J5406M4428l1576n0648Q710o308k1630k1849k7816m8198j4933O8115
11728c2166R8977K0488l0337j9552n3348j8965j5615P1042P6188M1003k103m3163
11716I2449k0708l7309j492K6961j595p9844l0105P840j0689J3037M1812K9346
$$ y = [237870, 340537, 377868, 294115, 183748, 130755, 124131, 163501, 159669, 164056, 160634, 111275, 86129, 121265, 157069, 180410, 136388, 149592, 150846, 88372, 29468, -20122, -13340, 54228, 112166, 134699, 130395, 125214, 115564, 76213, 131167, 93926, 61776, 64877, 73892, 84455, 78913, 53382, 66929, 24046, 30205, -1603, 12336, 29558, 70048, 76704, 33806, -17012, -28107, 11201, 4973, 26709, 45081, 52808, 18291, 23844, -5727, -34436, 48501, 83174, 95941, 54133, 69539, 113967, 82391, 31743, 40453, 34145, 12515, -9334, -37150, -85348, -100281, -32166, 66811, 87299, 56962, 37410, -15938, -34903, -50518, 20524, 96712, 137715, 135612, 92449, 71741, 34432, 32940, 59901, 58306, -21538, -51643, -43803, -54492, -41455, 357, 29703]
11704B9703K5191J72m2224M118K4656q917L8282M8478j4874j3380l0930L2207
11692I2482r268j957p3985p4769l3037K4076P9905k931N8168K8921j092n0508
11680C6005K0977L0949J4506j0669k7280j8065K4868p3230n3437P444K7836k102
11668b2198N6022N1958J2340Q1494J25406O1362J03685m515j40296j14468m0409
11657A70381n2077O874p907k3477j9460n345K2234k7636J5795o0106K4036K8521
11645G1833l571o2894n6781L0689M3464N6990K2738L3100j2777m7331J9141P0468
11633A65069N8644L8872O6445J16577R4704J5429j21310j16095m2183p2068m2498
11622A61586l073r5071j5195M4217K2525P0448P153k2737L3062k8099k1608k2563
$$ y = [29703, 54894, 55066, 12842, 16960, 41616, 32699, 70981, 119459, 104585, 91205, 60275, 92482, 83214, 81257, 7272, -67497, -100534, -76458, 3447, 516, 58684, 87605, 86513, 36005, 56982, 87931, 102437, 91768, 64488, 46423, 71291, -1939, -55376, -47932, -20096, -22198, 33824, 85782, 98122, 179616, 305022, 366384, 470069, 465554, 325258, 210790, 170381, 118304, 125178, 117271, 93794, 74334, 68989, 91223, 63587, 79382, 19276, 43312, 71833, 68262, 5368, -51413, -20724, 22740, 79730, 102468, 135568, 122791, 75460, 94601, 165069, 223713, 262585, 329030, 445607, 540311, 555740, 434430, 318335, 276152, 204084, 161586, 158513, 63442, 48247, 92464, 114989, 185437, 192590, 169853, 202915, 174816, 153208, 130645]
11610A30645o6937N295J4456Q543j5834m5193N871K0970p4585m9712N2734J6027
11598B280k7882J0773M4651k7688M086L7825m707k0916r998k28O7733M954j2562
11585F8321j0922k6317J5796L1685l3703n1744l1648L4880J0720L4875k2376k1283
11573a716m6366k0769M2702L1923L3480k3780k1958j0268m6179j7552O8444L89
11561a1650L0996M807j6900n803L9211K05M635K2856R684k5952O407k9766l4119
11548e389K2886j5389n802M7290J1563J6085K2900m849n8727k3425O7714L1674
11536A06531m2659k5850P6632j17820J2835J4604M5287M9188p4370n2682L7400
11525B9096O919M0622L1273j3412n5875M036O229J5363m4926k6671n610j5406
$$ y = [130645, 63708, 69003, 83459, 92002, 76168, 30975, 36846, 57816, -16769, -66481, -13747, 2280, -25602, -14829, 29822, 2134, 6220, 44045, 39338, 18422, 8424, 8196, 75929, 80883, 68321, 57399, 31082, 46878, 78563, 44860, -6884, -38532, -3652, 7068, 41943, 19567, -1716, -48082, -68851, -26149, 5774, 39254, 15474, -6484, -16752, -62931, -80483, -12039, -11650, 19346, 24153, 7253, 1450, 40661, 40866, 45501, 68357, 78041, 52089, 58496, 28730, -5389, 17497, 2108, -3694, 43596, 55159, 71244, 94144, 89295, 30568, 7143, 74857, 106531, 63872, 38022, 114654, -3166, 9669, 24273, 69560, 118748, 44378, -8304, 29096, 36015, 76637, 107910, 94498, 38623, 42659, 48888, 64251, 19325, -7346, -12956, -28362]
11513b8362j4718M86l45k333M4438j0607p799R774m4605K9249K5721N3243R7611
11500A51753J5385o4496k5603n9131K5355R652J5849K0318N793k0778n05n856
11488F7736k271j7282k4604J2772m6316k9122N2251l237m0152j7712O3690N2880
11476F8633J9110l559n2763q1883K7753K0895K4029J7355L6946Q649l5599o32
11464D8934L0126j4937j6798n811J3753L8503M1416j9228q4280q2936J74K1949
11452b9135M6191K8730o761k0721n0557k069M7180M5895M4413l481k2618l695
11440G3372m5686k7545o6737O380M0295K2537K0567m4935j3462K1842N463k3908
11428c1817m366N813M5434M6917m6433m5145J9707J8203j3442l6750j5242M0617
$$ y = [-28362, -43080, -42594, -42939, -45272, -834, -11441, -19240, -9466, -54071, -24822, 899, 54142, 151753, 167138, 102642, 77039, 17908, 43263, 52915, 68764, 89082, 94875, 74097, 73592, 67736, 65465, 48183, 23579, 36351, -9965, -39087, 13164, 9927, -30225, -47937, 15753, 68633, 87743, 84184, 31421, -50462, -22709, -1814, 22215, 39570, 76516, 85165, 49566, 48934, 79060, 64123, 47325, 41514, 55267, 93770, 135186, 115958, 31678, -51258, -51084, -29135, 17056, 45786, 39025, 18304, -32253, -34322, 12858, 58753, 103166, 99685, 77067, 73372, 27686, 141, -66596, -60216, -19921, 2616, 23183, -21752, -35214, -13372, -7909, -31817, -36183, -30370, 15064, 61981, 15548, -29597, -9890, 8313, -5129, -41879, -57121, -16504]
11416a6504M8571L5553j874l7701m3132m5304m2070K1580j5601L137K2647M3346
11404b7352J4348J6221J6727M0707n4209j6899J1088N216k206J9481N1542L8734
11392A13398R790n8547l6326J3814j1351m2855Q168L5916k5580N171O464J6917
11380C4979L677K4390j5969p1172Q279J7611l0437N3976j5026M4284N426J7922
11368G7940m4828p764K2517j8143j00894q2566M3181L1616J8J7042N9646Q71J7813
11355A6449M3641j5487n2365K2478l7500J5760m899M71p802j7522l0573K1655
11343d5694M2760M7919M8876L3483N7646J3051o1649k8898J8276o982p2892J3093
11331E8989m946l6759n3447L988J9775J752j966M896m1763J0697j4509o4021P4155
$$ y = [-16504, 32067, 67620, 65746, 28045, -15087, -60391, -102461, -80881, -96482, -93345, -70698, -27352, -13004, 3217, 19944, 60651, 6442, -10457, 631, 5847, 3641, 23122, 74664, 113398, 123188, 64641, 28315, 42129, 30778, -12077, -3909, 32007, 6427, 11598, 18062, 34979, 38656, 63046, 47077, -24095, -15816, 1795, -28642, 25334, 10308, 54592, 60018, 77940, 33112, 25348, 47865, 29722, -71172, -153738, -110557, -78941, -78923, -61881, -2235, -1364, 16449, 60090, 44603, -7762, 14716, -22784, -7024, -11923, -11452, -19254, -36776, -67349, -45694, -2934, 44985, 93861, 127344, 184990, 198041, 136392, 107494, 125770, 118788, 45896, 58989, 54043, 17284, -36163, -32175, -12400, -10648, -12614, -7718, -49481, -38784, -53293, -117314, -43159]
11318d3159K5455K8791K7495o406q7680p332N4700K833k4377P45P2073M4557q97
11305H6798m2279m9626j4914K7791K897k5526M386n91k33l2721N3687N2876j5640
11292D6905j0777q298l0445l8787O0468O1379k7576j2049n1663n6053j3362K4947
11280e5311k5189r325O5713P688J9611J20063R574m9142l3910m9734j3875l8222
11268e2059L413l3154K9983N0858J4734r525P8991j8121k2202k7564l4912O610
11256a2948l1843r578p604J913o8722J4923K9855R5880j6632n0628J09096l2756
11244B0956q0906k7638k0509K8256k8336n0995L171J9082L131R232K6003J4410
11232h4143K0758K8597K2226L3709j9841m162k2591K5300J3451l1608o9981m5937
$$ y = [-43159, -17704, 11087, 38582, 32176, -55504, -62836, -8136, -5303, -29680, -28935, 43138, 87695, 86798, 44519, -5107, -20021, 7770, 10667, -14859, -10473, -11064, -11297, -44018, 9669, 62545, 46905, 36128, 27830, -2615, -41402, 19066, 80445, 52869, 40820, -10843, -66896, -80258, -55311, -80500, -89825, -24112, -16424, 3187, 123250, 132824, 83682, 49772, 38, -13837, -52059, -48646, -81800, -51817, -959, 13775, 4250, 83241, 65120, 42918, 15354, -19558, -12948, -44791, -54369, -61973, -60060, -128782, -113859, -84004, 11876, -4756, -55384, 53712, 20956, -59950, -87588, -108097, -79841, -108177, -159172, -156001, -136919, -133788, -124556, -98553, -84143, -63385, -34788, -12562, 21147, 1306, -2856, -25447, -147, 13304, -18304, -88285, -134222]
11220a34222N7315J16698N3645j5125l8449J7140M8647k1076p5947j5987N6487
11209D9126N6303p625n7564q6190l2097L2907P633K1316k2244n4730m4338R9311
11197c8192Q4052o4436m2869o035O0826M8130k1571j371J5865J2815K2600J3645
11185H3459k568l2639k4592k1765J3461J0333K1669O6625P311j33624q0283J9155
11173g3458L6281O230j5511J1598Q2020k1238j4469N283L2984j3521L4462q500
11161F2161m6810J4757j3171L2718N2533m4784m8563r216Q973j900P1705o72l0681
11148D7050J9257K9787j7921n2884p2174J6144J442l238L2409O1156K5895Q325
11136I5248n2115k1219m8825m4702J5238J1366N6671O700k0648j6807j8230J20227
$$ y = [-134222, -76907, 39791, 93436, 78311, 39862, 57002, 105649, 84573, 8626, -7361, 49126, 105429, 97804, 40240, -45950, -78047, -45140, -37507, -16191, -38435, -93165, -137503, -38192, 45860, -18576, -61445, -67480, -6654, 41476, 19905, 18534, 34399, 47214, 69814, 83459, 80891, 48252, 23660, 1895, 15356, 25689, 47358, 113983, 121294, -12330, -92613, -73458, -37177, -30947, -46458, -34860, 47160, 25922, 11453, 16736, 49720, 36199, 70661, 62161, 15351, 30108, 16937, 49655, 102188, 57404, 8841, -375, 8598, 6698, 78403, 77731, 47050, 66307, 96094, 78173, 25289, -46885, -30741, -29299, -32537, -128, 61028, 86923, 95248, 43133, 21914, -26911, -71613, -56375, -45009, 11662, 18362, -2286, -19093, -37323, 82904]
11124H2904K4274o1608p8447j1603M2329j2600M4672N2645p463l0469M7149L2583
11112A24366j5947m8804k9689l3399m3276K9216K0726N9066l1444M304N9376j9226
11100G5269k3022q6085M5497Q391n330K017J0305q5j9130Q411K7685Q302K0048
11087G2273M3392j4520n4870J8623p868j7760n8371l4264K3876O6895o1661k0217
11075d4472M6719j205K5929K5787n2349k3591l0387K0375R2753L9367O39N790
11063A05355l4689k6240O1208K4740l5514j7507l4438m9649J5555Q2469R5745
11052A87035l8046m2237j5416M002N0249L2348k9776j8486m4652N7220N4057m1994
11040A54304j0610M2789L1943l832j6896L9681L0201J7933M1031l1709p5000j4796
$$ y = [82904, 107178, 45570, -32877, -44480, -2151, -14751, 29921, 82566, 75103, 44634, 91783, 124366, 108419, 59615, 29926, -3473, -46749, -17533, 3193, 62259, 30815, 35119, 94495, 75269, 52247, -33838, 11659, 20050, 14720, 16737, 27042, 26957, 7827, 16238, 43923, 52225, 72273, 115665, 101145, 46275, 64898, 57030, 39270, -19101, -53365, -29489, 37406, -24255, -44472, 2247, 1042, 26971, 52758, 409, -23182, -53569, -33194, 59559, 98926, 99565, 105355, 70666, 44426, 105634, 130374, 94860, 77353, 42915, -6734, 8821, 91290, 187035, 148989, 106752, 91336, 95338, 145587, 177935, 148159, 129673, 85021, 142241, 196298, 154304, 143694, 186483, 218426, 214594, 197698, 237379, 267580, 285513, 326544, 294835, 219835, 205039]
11028B05039O5727K6501J199L7007O0316K612L0434K7232p4660P717J7492l2722
11016C73894k3475J0692J7739r1227l5243k3235K6695J04554K7272l5786o8236
11005B83644m3812J7970k9064k9988K565K2128K1009M0553j1004k5128n0914m8935
10993A49024l637k3442L0464L4362l2188j3632N683N841k8002n4827p666L7815
10981I9795j0983r057k3437J5775K0026m0063p0030j5831K330J9976j0454l5607
10969e7560j1004L5373l683N0303L8389j9974p2804P590N3187q171j1864M4253
10957D4035J9170k7079l321N6240J5690M958J2989l5169o8812n9886j1863J3036
10945d0012N0673M5390k1754J1275k835j214J0654K7387R764l4827k869J9947
$$ y = [205039, 270766, 297267, 298466, 335473, 395789, 398401, 428835, 456067, 381407, 389124, 406616, 373894, 350419, 361111, 378850, 287623, 252380, 229145, 255840, 360394, 387666, 351880, 283644, 239832, 257802, 228738, 198750, 201315, 223443, 244452, 285005, 274001, 248873, 197959, 149024, 145387, 121945, 152409, 186771, 154583, 140951, 146634, 152475, 124473, 69646, 61980, 99795, 88812, 79755, 56318, 72093, 92119, 52056, -17974, -33805, -31475, -11499, -21953, -57560, -68564, -33191, -36874, 13429, 51818, 31844, -40960, -33370, 19817, 11646, -218, 44035, 63205, 36126, 32805, 89045, 104735, 109693, 122682, 87513, 18701, -41185, -53048, -40012, 10661, 56051, 34297, 45572, 42737, 41523, 52177, 79564, 89328, 54501, 51632, 71579]
10933G1579L1914p20n3083p6550l1566M2148K8536o9676l2936K1536P5304m3549
10921c7063J3971l702l6965K3797K2425K7362l0801n0962L6329J239k4908K6945
10909c2333J7352m3474N2230R1423k363k0962l6740r472P314Q405n0715N145l164
10896a7354j9220l2768J3195O3322P5466j795N472O5044P693J6183j3251q8191
10884G3796p5060k8135l0208M1958J4846j0412k0814j22J2301P000J6393k4636
10872b3093K599L9070O7940J1528J5599l0292q7071J2822J7127m6445K079K9032
10860A0895j2459O2888K9913j2623R039L4575n7617q216L6752K1772n6547J0521
10848F8893j9291j3285l126m557K6734J9317M1021J604l8849k1054J853J7896
$$ y = [71579, 103493, 102773, 49690, -26860, -58426, -16278, 12258, -57418, -90354, -68818, 6486, -37063, -23092, -26794, -63759, -39962, -17537, 9825, -20976, -71938, -35609, -34370, -59278, -32333, -14981, -58455, -6225, 85198, 82835, 61873, 25133, 15661, 22975, 31380, -19335, -14190, -17354, -36574, -69342, -56147, 7175, 82641, 80846, 86318, 151362, 159055, 175238, 161987, 73796, -1264, -29399, -59607, -17649, -2803, -13215, -34029, -34151, -21850, -14850, 1543, -23093, -20494, 18576, 86516, 98044, 113643, 83351, -3720, 9102, 26229, -20216, -18137, 10895, -1564, 61324, 91237, 78614, 87653, 122228, 64611, 56395, 93147, 114919, 58372, 68893, 49602, 36317, 33191, 28634, 55368, 74685, 115706, 117310, 78461, 57407, 59260, 77156]
10836G7156o429K3449j1253N588k8029k0425j5504j0886K3333m9052J482K1926
10824A1356R665K4418J9574J1512L7613p1368n8490J4704K7141K0002k7611Q230
10812B6746M8728J2467p039K5356N9887O62p8313l348K6235r780k1220J4611j7494
10799G7498j5194K0782P295K6587j9407m3403N7178N072q7496o7844k616K823
10787c8725Q861j3266K2247J8278Q326O187N5192M3799j8037l1769k5097l635
10775C2361M8070M7685l1128o2691k8703O373j3650j2166j4042k228P2519L8039
10763H0439L8429K6793j4827k9048j2399r329M3518k2426R307Q3564M9146N074
10751B48241p0595r2694l8441J7702K5755q201j3700J4128N1122P2170l0602n3169
$$ y = [77156, 70727, 94176, 82923, 88511, 60482, 40057, 24553, 13667, 37000, -12052, -10570, 11356, 21021, 45439, 65013, 76525, 114138, 42770, -15720, -1016, 26125, 46127, 18516, 26746, 75474, 87941, 80902, 106258, 166145, 166807, 88494, 85146, 111381, 101601, 80381, 94992, 77498, 62304, 83086, 90381, 116968, 97561, 54158, 111336, 116408, 28912, -38932, -41548, -38725, -29864, -43130, -20883, -2605, 5721, 11908, 67100, 110899, 92862, 61093, 35996, 32361, 80431, 128116, 96988, 34297, 5594, 11967, -1683, -13849, -27891, -30119, 42400, 80439, 118868, 145661, 130834, 101786, 89387, 80058, 123576, 101150, 110457, 194021, 243167, 248241, 177646, 84952, 46511, 64213, 89968, 81767, 68067, 82195, 133317, 205487, 174885, 121716]
10739A21716q1648O9705K2678j1627J2627k0118J0234K6391j3887p01J9140J915
10727A56425j712J053k7249J3524j2027L5850m337N9631Q2984k0869j3180k9396
10715B40697n4036q8122m5426l4288Q395Q6456P7420N8754K8226k5970p5796j7171
10703A59139k7506L7151J8351j4796J4030M6436O110O152M4467R501j981k6304
10691B70750J9495j6850J818O316l5919l1797P8115R1172L2729r630q7169r2001
10679B27029n517l8724j2872L6978L6376R1788P9809K5063m9315o3441K3145M9654
10667C99973p826k0365j6186p3275J7150M6297K7764k2307L8044O1194R6990N8499
10655F05952J3641J8593K0089N4505j2986J5980L1941M4353P3378J8029q0518
$$ y = [121716, 40068, 109773, 132451, 120824, 133451, 113333, 123567, 149958, 136071, 135370, 154510, 156425, 154713, 155766, 128517, 142041, 130014, 165864, 161527, 221158, 304142, 283273, 270093, 240697, 186661, 98539, 53113, 18825, 27220, 113676, 191096, 249850, 278076, 252106, 176310, 159139, 131633, 168784, 187135, 172339, 186369, 232805, 238915, 245067, 289534, 299035, 297054, 270750, 290245, 273395, 275213, 281529, 245610, 213813, 291928, 383100, 415829, 406199, 319030, 227029, 221512, 182788, 169916, 206894, 243270, 335058, 414867, 439930, 390615, 327174, 350319, 399973, 392147, 371782, 355596, 282321, 299471, 345768, 373532, 351225, 389269, 450463, 547453, 605952, 619593, 638186, 658275, 712780, 699794, 715774, 747715, 792068, 865446, 883475, 802957]
10644H02957O216N0510O5478O2886N7671M4628R6468J51450J49172K47176K36303
10633A970915J67023J44676J67887J87092J76392K98433L42095L34456N29169
10624D318138P50908R82967J221832J660166K185899K681422L146234L370396
10616B0317962L104723K260561J067520L1936l43984O6887Q16416J955900L322658
10607C2600579M769333O015401O565775N638077L345493J72838k459973l218697
10599E3428826k283386n06779J491722L734992N803899P295809P635010N967529
10591H2567622K037200k767344o313164p176004n991689l923904j790418J97580
10583E6839879K024452L276664L459377K102986p22330l995356o115619o403818
$$ y = [802957, 809173, 859683, 925161, 988047, 1045718, 1090346, 1186814, 1338264, 1487436, 1734612, 1970915, 2137938, 2282614, 2450501, 2637593, 2813985, 3112418, 3454513, 3788969, 4318138, 5069046, 6052013, 7273845, 8934011, 11119910, 13801332, 16947566, 20317962, 23422685, 25683246, 26750766, 26782702, 26438718, 26505605, 27322021, 29277921, 32600579, 37369912, 43385313, 49951088, 55589165, 58934658, 59107496, 56647523, 53428826, 51145440, 50638661, 52130383, 55865375, 61669274, 68965083, 76600093, 82567622, 84604822, 81837478, 75524314, 68348310, 62356621, 58432717, 56642299, 56839879, 58864331, 62140995, 65600372, 67703358, 66981028, 62985672, 56870053, 50466235]
10575E0466235n480615l962606k598757j462943m27567J37495N1555m92033j557574
10566C4673190k861686l714660l783932l378307k845702k306850j911699j500004
10558A2370350j185632j054630q06722o40546p27228p91563p11696o46193n87942
10549E218198m94823m33954m77079l66076l08514k37020k29737k47169j82090
10540B241736j58596k16910j89876j95445j27880o6190j10171j31334r1103m9723
10530I04508n5973j9862l4876n1187j30487r1131L1835N2438j0182n2777j08950
10519D33356m3005m303J0099l7493l9574l2734J3375l1326n3707M4634J7758k8706
10507B48374n541k385K5455j3509m1868j21584M1740M9594J3528k7242Q015k7736
$$ y = [50466235, 44985620, 41023014, 38424257, 36961314, 36533747, 36671242, 36722797, 36230764, 34673190, 31811504, 28096844, 24312912, 20934605, 18088903, 15782053, 13870354, 12370350, 11184718, 10130088, 9323366, 8682820, 7955592, 7164029, 6452333, 5806140, 5218198, 4723375, 4289421, 3812342, 3446266, 3137752, 2900732, 2670995, 2423826, 2241736, 2083140, 1866230, 1676354, 1480909, 1353029, 1286839, 1176668, 1045334, 954231, 904508, 848535, 828673, 793797, 742610, 612123, 520992, 552827, 605265, 595083, 542306, 433356, 390351, 386048, 396147, 358654, 319080, 286346, 299721, 268395, 214688, 259322, 277080, 248374, 242833, 240448, 265903, 252394, 210526, 88942, 130682, 180276, 193804, 166562, 174577, 146841]
10495A46841k7062k1437J1115j2080j549L2811k6870P458O2608J6117j3295J2437
10483A87094N5642J3852k9731o8J3227L756j1364k5613J3874p2640m0040l3179
10471G4810K685L5936P1215J363N612j4257j7733N9281k089k4031q5114L78N2367
10458A60423o1l7928k955L8524L4044m931%L5095L8471M415m6993o9153k6937
10445A22014j208O1923N9656p699n5662m7583j8939Q681m325R653j9198o0563
10433D6750k832j3516J6692J5255N2805J4460k3867j6608Q041j1784K8331J6859
10421A30586m8551n74l0847k2651k918l210k1387J0469O0629O2212O376j992m7705
10408I0437j2647j8902k5075o4351k4623M4840n635L7081k0542N586K411J1744
$$ y = [146841, 119779, 98342, 109457, 97377, 95828, 128639, 101769, 109227, 171835, 187952, 174657, 187094, 242736, 256588, 226857, 226789, 240016, 243772, 232408, 206795, 220669, 148029, 107989, 74810, 77495, 113431, 184646, 186009, 191621, 177364, 159631, 218912, 216823, 192792, 107678, 108056, 160423, 160362, 122434, 119479, 158003, 192047, 187116, 187116, 222211, 260682, 265097, 218104, 148951, 122014, 120806, 182729, 242385, 234686, 179024, 131441, 112502, 121183, 116858, 126511, 107313, 46750, 43918, 30402, 47094, 62349, 115154, 129614, 105747, 89139, 97180, 85396, 113727, 130586, 82035, 81461, 50614, 27963, 25045, 21835, 448, 10917, 71546, 133758, 140134, 138142, 90437, 77790, 58888, 33813, -30538, -55161, -10321, -15956, 21125, 583, 6169, 8580, 20324]
10396B0324r152l3485j3149N9177O5652L5158j6560o6350j06516n9553N4763Q2090
10384A2399J1050k5852n8425J475L3816k8649L2902K4433O3605q526l0592j8064
10372I572M1513p3114R598Q773l9691l7939J7624K6809P8480L4079n2772o3037
10360d0105o7304j0418J0579O2665J5504l993O5548n2323n2834l6742m677N0195
10348f3905Q1481R3427N5908j04632r0145J3091j7740j5921J1803L710o82j4902
10336d8507M1602J6358L4630L9801J1221J2442k1660l6217J3177L1653K9058k1112
10324A02446m9550r5583m3698J08227K6425l09j6657M2085J5000q0323k3984K2107
10312F186j6901k228J1396r396N3556N457N502K3247R496n079p103j6542k2981
$$ y = [20324, 11172, -22313, -35462, 23715, 89367, 124525, 107965, 41615, -64901, -124454, -69691, 12399, 23449, -2403, -60828, -59353, -25537, -54186, -21284, 3149, 66754, 58228, 27636, 9572, 51085, -22029, -12431, -3658, -43349, -81288, -63664, -36855, 41625, 75704, 22932, -40105, -107409, -117827, -107248, -44583, -29079, -33072, 32476, -19847, -72681, -109423, -114100, -63905, 17576, 111003, 166911, 62279, -27866, -14775, -32515, -48436, -36633, -32923, -33605, -48507, -6905, 9453, 44083, 83884, 95105, 107547, 85887, 49670, 62847, 94500, 123558, 102446, 52896, -42687, -86385, 21842, 48267, 47958, 31301, 73386, 88386, 8063, -15921, 6186, -10715, -12943, -1547, -10943, 42613, 48070, 53572, 76819, 86315, 81236, 74133, 57591, 34610]
10299C4610k9275Q8774k5867o318L7437L7040k0231j8616p5779j6553j2034l3007
10287c9819l6401J9920N0512K101m882n69L1156L4125L7296n899r3884l8051K857
10274d1538L0770L2838J3800m7150k065N7996K338l5754r65R435L5529N1800k036
10261A04998M912n9184n6267M5547K8623k3677J6715l1394J7777K6663o8704l3975
10249b7966P932J1277l0303Q857J8667K1239l897m0550K4660J3539j0945j9220
10237b6710n0318k7154N720L9435M9883L2303m4564k3819j9757J335L1542K7776
10225d328k6852k1650O027L2444O2229k9861o1688j98r802q963R158L1935K4282
10212B733k7825l7814K4659k8583K1972q46m1531Q245L5001j443L005O0605O006
$$ y = [34610, 5335, 94109, 68242, 61924, 99361, 136401, 116170, 97554, 21775, 5222, -6812, -39819, -76220, -56300, -5788, -3687, -8569, -9138, 22018, 56143, 93439, 87540, -6344, -44395, -41538, -10768, 22070, 35870, -11280, -13345, 44651, 46989, 11235, 10270, 19705, 55234, 107034, 104998, 109910, 50726, -5541, 40006, 68629, 44952, 61667, 30273, 48050, 74713, 6009, -27966, -20034, -8757, -39060, -30203, -11536, 9703, 5806, -34744, -10084, 3455, -7490, -26710, -77028, -104182, -98462, -59027, -9144, 23159, -21405, -45224, -64981, -63646, -32104, -4328, -31180, -52830, -46803, -14359, 47870, 18009, -43679, -43877, -53679, -62642, -53484, -21549, 2733, -25092, -62906, -38247, -66830, -44858, -45704, -87235, -78990, -43989, -45432, -42427, 18178, 24184]
10199B4184L5478o2125k0299J6455q12J6932J8909M1078j5966m0480J5713J555
10187C0622j2776L0457K1805o531q0830L9735J11115M2057Q900k8044k2276K7767
10175A62001K0282n4328l1110j3007N2694J35650K3226R189K1060k593R154p0099
10163B62119l8877J4494R4058O5374P978j3808R942M0445Q1036O571o4617n0118
10151D14597p3162m1603j0840n430J9058k21o0841k7409O7069O9365o831o7563
10139B76189o235k8977n6027m5677m1525l613O4638Q6779m0137m0257J7058l5543
10127A46673J6493n354j02721o9297k6884m2004J29780N1376l0623m9122l1590
10116a3273J7566J0744L3534k1080l4716j7740j9001K0145j0056k7552m0166M6958
$$ y = [24184, 59662, -2463, -22762, -6307, -7119, 9813, 28722, 69800, 53834, 13354, 29067, 30622, 17846, 48303, 70108, 63577, -17253, 22482, 133597, 175654, 184554, 156510, 134234, 162001, 182283, 127955, 96845, 83838, 136532, 272182, 295408, 304597, 325657, 323064, 332218, 262119, 223242, 237736, 331794, 397168, 405146, 391338, 401280, 441725, 522761, 529332, 464715, 414597, 341435, 299832, 288992, 283562, 302620, 302399, 241558, 214149, 281218, 350583, 343752, 276189, 269954, 240977, 184950, 139273, 97748, 94135, 158773, 245552, 205415, 165158, 182216, 146673, 163166, 157812, 55091, -14206, -41090, -83094, 46686, 98062, 67439, 18317, -13273, 4293, 15037, 48571, 27491, -7225, -24965, -43966, -23821, -33877, -61429, -101595, -54637]
10104e4637k2269P1067L2932n0925p1301L2498M6494L1890R2402O2506j06269
10093F4388n4339M183k1954J7501k9238k885J1402P413L2998m5324m5995l1459
10081i3309L6946L4051K8474j7986l153K0191L9120n1119j812M4350l1657J0771
10069A4867N6001j5943j3847J9739m4859j5582j0719j4165L0867r924L2882j5667
10057A3650J3484K3935m5187o9754p880j7985R410L9135R047j108l1982n2965
10045a18200J6338K3824R234j9609p587k8719K744j4998J3544K0494J8685k5233
10033a09483q400L2621L18p107J9182k2484L0109P158j3999N2711P3190J2309
10021F6125l5730K4235K9788N143j5052j6812N596k3355j9605K2421K0281l9707
$$ y = [-54637, -76906, -5839, 27093, -23832, -95133, -62635, -16141, 15749, 108151, 170657, 64388, 10049, 14232, -7722, 9779, -19459, -22344, -10942, -3529, 29469, -15855, -61850, -93309, -56363, -22312, 6162, -11824, -14977, 5214, 44334, -6785, -8597, 35753, 4096, 14867, 70868, 54925, 41078, 60817, 15958, 376, -10343, -24508, 6359, -3565, 29317, 13650, 27134, 51069, 5882, -63872, -71752, -89737, -80327, -41192, -32145, -33253, -65235, -118200, -101862, -78038, -68804, -88413, -96000, -124719, -121975, -136973, -123429, -102935, -84250, -109483, -117883, -85262, -84944, -92051, -72869, -95353, -65244, -58086, -72085, -19374, 53816, 66125, 30395, 54630, 84418, 89561, 74509, 57697, 63293, 39938, 20333, 42754, 63035, 23328]
10009B3328k2438L7410K8511K8990p4726j4156j8305l2687J4389k7165N8273O4244
9997F5668q672r8329q948J475K9625L9147k7008m1462n716J4146O1209L0363p4826
9984b3328m778K3758m2765m1468l0258J4333M0536N103q716K7684j5914j3716
9972f9529M5033M7177p32L365J6825J1826o854o5110k0216p3481O5211L2290k4456
9959c8651k0146l0408J9939k5559l5349P6327K83m3504j7349N975M8489M6763
9947a3190J9618j2301k1256j4888M3932Q2966k4070m7116J5738l1061l4520P4621
9935C8473R991m2374k0556j3039o674m881K7552J0059K395l1841l0488n4264k037
9922a17684j8416k0808K4311K5928O201J1604n207N5510N2334P3130r173j9178
$$ y = [23328, 890, 38300, 66811, 95801, 21075, 6919, -11386, -44073, -29684, -56849, 1424, 65668, 56996, -41333, -50281, -48806, -19181, 19966, -7042, -48504, -54220, -40074, 21135, 51498, -23328, -28106, -4348, -47113, -88581, -118839, -104506, -63970, -58867, -67583, -39899, -55813, -69529, -24496, 22681, 21949, 25314, 42139, 53965, 47111, -17999, -38215, -111696, -46485, -14195, -38651, -58797, -89205, -69266, -94825, -130174, -53847, -53564, -97068, -114417, -108442, -59953, -13190, 6428, -5873, -27129, -42017, 1915, 84881, 60811, 13695, 29433, -1628, -36148, 38473, 48464, 6090, -14466, -27505, -34179, -39060, -11508, -1449, 946, -30895, -61383, -115647, -117684, -136100, -156908, -132597, -106669, -100468, -88864, -94071, -38561, 13773, 86903, 77730, 58552]
9910E8552l4642k2205Q369K3135K2837O433k4827r8038j6145K6958L6283K8580
9898A5290l4356J0727q654m0142N712O7283J3245l6578j1072j3973o1054m4996
9886a38568M5908N2148M6593J3954l4205K4344l8772n745K9599j1180M0844J9679
9874D4599p6023l3894K2279k0676j3195m756K9878N3540O606O23K0155k9679m999
9861e542j7602M781l395K1817l8588k6950K0686J9794N0118j9733N8015m7853
9849A5548o1492k6527n582P0524L9217j8225m8209m233j8027L2978K6155R792
9837A1919N4779j5431o1733j1051k8439K7063N7952k9n8886k8690J5836L5858
9825h52J4802J7224o2988n7328M1933J5941L7551L6994m3248J4704J1839j7452
$$ y = [58552, 23910, 1705, 10074, 33209, 56046, 62479, 37652, -60386, -76531, -49573, -13290, 15290, -19066, -8339, -16993, -57135, -51423, 15860, 29105, -7473, -18545, -32518, -93572, -138568, -92660, -40512, 6081, 20035, -14170, 10174, -28598, -34343, -4744, -15924, 24920, 44599, -31424, -65318, -43039, -63715, -76910, -81666, -51788, 1752, 8358, 8981, 29136, -543, -5542, -23144, -18363, -21758, 59, -38529, -65479, -44793, -24999, 25119, 5386, 63401, 15548, -45944, -72471, -78053, -7529, 31688, 13463, -34746, -38979, -57006, -24028, 2127, 11919, 66698, 51267, -10466, -21517, -49956, -22893, 35059, 35030, -23856, -52546, -36710, -852, 13950, 31174, -31814, -89142, -47209, -31268, 6283, 43277, 29, 14733, 26572, 9120]
9813I120l0592L4424K3715o7113r683p856P018Q938n2716L0902j8706k0262L3102
9800e9709M6874M973n5472j3794J4513L9037N3066l1601J1358o564J9371o780
9788A5272j5090J9719K5965K3168q355L890n6654L6656k5879M447N400q1338p993
9775f0792N5670J1748o4378K7572K3475j3685k0853m7845l0550N6395K0771k0845
9763f3317m9488m1156N2475N2431Q398j1161j2834j6371m64J00908K2797q1381
9751c9163N26l669M9373M768l872l3959q244j1538o242Q474m622M2689J1260N0945
9737E6726J6088p6659p5964Q506j1262R5297K8763j0414m096j022o348m9334l0241
9724e9960L5643M565K8937P740K9834j1334l3834o1698m906L0038l9471n08J4181
$$ y = [9120, -21472, 12952, 36667, -30446, -40129, -47985, -40967, -32029, -84745, -53843, -72549, -92811, -59709, -12835, -7862, -63334, -77128, -62615, -23578, 29488, -2113, 9245, 2681, 22052, 15272, 182, 19901, 45866, 69034, 60679, 64569, 7915, 44571, 18692, 23139, 28539, -52799, -60792, -5122, 6626, -57752, -30180, -6705, -20390, -41243, -89088, -119638, -63243, -42472, -63317, -112805, -153961, -101486, -49055, -40657, -51818, -64652, -81023, -81487, 19421, 42218, -39163, -38637, -42306, 7067, 11835, 7963, -25996, -34240, -45778, -52020, -43546, -48168, -5479, 5781, 56726, 72814, -3845, -79809, -71303, -82565, 12732, 41495, 31081, 26985, 25963, 19615, -29719, -59960, -24317, -19752, 9185, 16925, 46759, 35425, 1591, -60107, -65013, -34975, -74446, -74954, -60773]
9711f0773M851Q609m2275O308K6836J6434l584J1J5544k0363K9736M6752J4749
9698D2835M346k5543j656L5369K6164o2015P792L8698k117k392n0549k799j6098
9685g965l598m4244K5455M4310n3016j0899k8040L2875O2773j0714k9941J9378
9673c626J4486J1467K3147j2737q302K221j8159j191K4156K986l2205l8824L1717
9660d864O2290j0319N114m6839k1860K217R0885R2662O3475J4711m7076p6435
9648A23961J1590m249l9838J6315m8669m1002n6933M1353J7056L346J6660N4591
9636I4181m3171J489Q620m5348l4446k2937j0456M1420O1792l8866l5458l5082
9624e8262M0825m0406j7074K5836j5310n3577K4569n056O4492J9518m2211k1001
$$ y = [-60773, -55922, -47313, -89588, -83280, -56444, -40010, -43594, -43583, -28039, -48402, -18666, 28086, 42835, 47181, 21638, 19982, 55351, 81515, 19500, 27292, 65990, 63873, 61481, 10932, 8133, -7965, -11563, -55807, -30352, 13958, -39058, -49957, -77997, -45122, 17651, 6937, -23004, -3626, 10860, 22327, 45474, 32737, 24435, 26656, 8497, 7306, 31462, 34448, 2243, -36581, -4864, 57426, 47107, 52221, 5382, -16478, -14261, 76624, 169286, 232761, 247472, 200396, 123961, 135551, 131302, 91464, 107779, 59110, 18108, -38825, 2528, 19584, 22930, 39590, 94181, 51010, 52499, 61119, 15771, -18675, -41612, -52068, -10648, 51144, 12278, -23180, -58262, -17437, -57843, -74917, -49081, -64391, -117968, -93399, -98455, -33963, -14445, -56656, -77657]
9612g7657q337J6986p0821K5307N9951P152l2543L4688J2719N440J8596M0011
9600C1492n7128m191Q5138N281m4711m7591K9696K217J4197N597n4183l0352k0148
9587h4686L2754M5287k3004J4927q623q4134J2905O6280p96q6469n5550M9659
9575a21450L2283k0034m9711J4455N514N4330N3175k001N0655j8850N1461k8720
9563B1107o2757j5450Q236K5735o141l2311L6158Q948l0281Q240m5603M9358k802
9550c7563J1555J6459N4735n8715J719M8036K0099j0914p4063p4627J4036j9380
9538a08623K0026N2980P2573M4033n373l4997L4198o2265l9603k1049P2684l7790
9526a3206l2263M0935p282q6814j5832M2661K3469j1902N758q974j792k8544J2630
$$ y = [-77657, -85994, -69008, -139829, -114522, -54571, -47419, -79962, -45274, -32555, -27115, -8519, 31492, -25636, -29827, 55311, 60592, 15881, -31710, -2014, 203, 14400, 19997, -34186, -64538, -84686, -51932, -6645, -29649, -14722, -23345, -107479, -94574, -28294, -29090, -115559, -171109, -121450, -89167, -109201, -158912, -144457, -138943, -84613, -31438, -33439, 17216, -1634, 49827, 21107, -41650, -57100, -48864, -23129, -29270, -61581, -25423, -16475, -46756, -38516, -84119, -34761, -37563, -26008, -9549, 45186, -13529, -11810, 36226, 56325, 45411, -28652, -103279, -89243, -108623, -88597, -35617, 36956, 80989, 75616, 40619, 74817, 12552, -27051, -48100, 24584, -13206, -45469, -4534, -11816, -98630, -114462, -71801, -48332, -60234, -54476, -63450, -65242, -93786, -81156]
9513h1156O4076L1264k307O255J4964M3176p219m560l4949l9207j3124l8321q310
9500f9418L6905P004p547l6206M4844p239p1255j5762J1838N4786m3668P658R2949
9487D889M2826p8276m0344K1397P168j2672K2347J4012p4355L0817n551n722L1353
9474d2111k9694m7597K0208K6139M2335N6328L0988O268m1599J2070L476r946
9462B6865m2779j7619n3381q031p743M262L6933r031K3505L2228k4214K3296N2907
9449C7198J8727n4390o1820M2278j7780l6379l895O3687J3016N934J9960l8164
9437a1628k1803R382K8121k464K4442M212k8201l3957K719O14M777K4786l182
9424b182L6319p132p1881l3257J2616L9497j6861n785l9241m1932L0625K5556
$$ y = [-81156, -17080, 14184, 11877, 18132, 33096, 76272, 69053, 64493, 29544, -9663, -22787, -61108, -69418, -32513, -25509, -33056, -69262, -24418, -31657, -102912, -118674, -106836, -52050, -95718, -88060, 4889, 47715, -30561, -70905, -49508, -42340, -55012, -32665, -18653, -93008, -62191, -67742, -73464, -42111, -71805, -119402, -99194, -73055, -30720, 25608, 56596, 62864, 21265, 33335, 36811, 26865, -15914, -33533, -86914, -94945, -102688, -98426, -61493, -70524, -47019, -14791, -39005, -15709, 37198, 55925, 1535, -60285, -18007, -35787, -72166, -76061, -12374, 642, 6576, 26536, -11628, -33431, -24049, 4072, 1608, 26050, 30262, 2061, -31896, -29177, -28563, -23786, 1000, -2182, 34137, 27005, -44876, -78133, -65517, -26020, -42881, -48666, -87907, -129839, -99214, -73658]
9412g3658N4840o653P4823k445p2665q867L5298J9069j6686k1909Q840j6478L7637
9399A1146O1647J6247k7303J3862K798j5551j6351N1855j3457q0543p7992j1046
9387h4688J9885L3886k3315Q65k3982j5929N0483N1605l526k8047o7527j3717
9375a04007O0428N5635L310p6270m264M3260j1193j2980k495Q148p999M3070m2182
9362d7539l4844R152O637r560k0758O6830k0653m4871N595Q263K0851o484l8636
9349a06017O6035O6870j9649k2087J6555K3535J5550k2748p8226n4575K8372M7437
9337c8948k6300o672k8827l280K6203k358l4092L6118Q0661P358n8365j2622O4793
9324C669R530N489M1065J582l2838k5840L5896K2541p668j0705L1607Q840n146
$$ y = [-73658, -18818, -25471, 49352, 46907, -25758, -34625, 673, 19742, 3056, -18853, -10013, -26491, 11146, 72793, 89040, 61737, 75599, 78397, 62846, 46495, 98350, 84893, 4350, -73642, -84688, -64803, -30917, -54232, -53367, -77349, -93278, -42795, 8810, 5284, -22763, -90290, -104007, -43579, 12056, 15366, -60904, -65168, -21908, -33101, -46081, -48576, -40428, -48427, -5357, -47539, -82383, -73231, -66594, -76154, -96912, -30082, -50735, -95606, -90011, -81748, -60897, -67381, -106017, -39982, 26888, 7239, -14848, 1707, 25242, 40792, 18044, -60182, -114757, -86385, -38948, -65248, -71920, -100747, -104027, -77824, -80182, -114274, -78156, 2505, 9863, -48502, -61124, 3669, 13199, 18688, 59753, 61335, 28497, 2657, 38553, 61094, 53426, 42721, 74328, 83168, 78022]
9311G8022k4148j4076l3906n0681l4123P25L8278k4141k7210j3255P1045K7480
9299e990l7329P774L7766p773l9607n591L5454N2948j0606J3733l4018m5492K8374
9286a0357J4161J4404M925m419J4457p0915n3675l013J4765J1490q857r212p82
9273h7028K0998L8249J486l2198j9832m960p165Q1211K9496P590j5347J2389j1559
9260A3330L7859m5359j5503K9496m3045k1211k3691l814N2700M0730O6702P454
9248I5648l8627n8423n1598K9537J3117k8805L9293m0086l1101j5740R729J8128
9236e8928K0045q427L1630L0128K4508J2608j8124o0615k1793l744K1134n1252
9224h2830m3544J6881M8041k9846k2464j0089K4541J16413l073l2897j233j2810
$$ y = [78022, 53874, 39798, 5892, -44789, -78912, -78187, -39909, -64050, -91260, -104515, -33470, -5990, -43319, -35545, 2221, -5552, -45159, -50750, -15296, 37652, 27046, 40779, 6761, -38731, -10357, 3804, 18208, 23133, 18714, 33171, -37744, -91419, -94432, -79667, -68177, -77034, -86246, -87028, -66030, -27781, -26295, -58493, -78325, -83285, -90450, -9239, 20257, 27847, 12500, 24889, 13330, 51189, 5830, -9673, 19823, -23222, -44433, -68124, -71938, -19238, 21492, 88194, 95648, 57021, -1402, -53000, -23463, -10346, -39151, 142, -39944, -71045, -86785, -77056, -58928, -38883, -47310, -15680, 14448, 38956, 51564, 33440, -27175, -48968, -52712, -31578, -82830, -126374, -109493, -61452, -91298, -113762, -123851, -99310, 17103, 14030, -18867, -20100, -32910]
9212c2910J2900J8605M104J7283l2802j061M607M2122J2028n761o2453p568M6931
9199A6025q448K4464m1356k9704k6959L5979N5008K7127m9267j7084n22J8028
9187C291j5036p5080m7096J4529K2899J6905N305j5374j3207J7618K7783L6106
9175b1357j3697L794N0729k0574l6860l3075j987N5439j0491L543J4972m8013
9163e7577j9746R5643N5819k4310J6554J868J518n0540K3798k9452L4613M036
9151E2224N413k1232O576Q20M188l3038o860N998l7790k3596L6197N5202j335
9138D2767j9637m2138P807j6821J0920K1646K4539M911l9245m465J3570k136n178
9125c460M568J980m0519R673J0217N067N7035L8937J3834n9709l6511K5242L445
$$ y = [-32910, -20010, -1405, 2699, 19982, -12820, -13881, -9274, 32848, 44876, 39115, -23338, -30906, 16025, 7577, 32041, -9315, -39019, -65978, -29999, 25009, 52136, 2869, -14215, -14737, 3291, -11745, -86825, -133921, -119392, -96493, -79588, -74283, -89657, -102864, -85246, -57463, -21357, -35054, -31260, 19469, -1105, -37965, -71040, -73027, -17588, -28079, -24536, -9564, -57577, -77323, 18320, 74139, 49829, 66383, 68251, 69769, 19229, 43027, 13575, 48188, 52224, 57637, 36405, 42981, 43801, 47989, 14951, 8091, 14089, -23701, -47297, -11100, 44102, 42767, 23130, -19008, -11201, -28022, -17102, 4544, 29083, 33994, -5251, -9716, 3854, 1718, -3460, 1108, 3088, -37431, -27758, -17541, -12474, 44561, 83498, 97332, 37623, 1112, 26354, 29799]
9112B9799j7641J2646K0131p731j4181j5426O344l1793Q133K1440l8784j8257
9100d5320K3870M2751j2970l0288l7990Q462P0937j1341m0651K1194J777k8569
9088c8138K3037l2902o5651L186R5908L3710j4624l8p4813J5791M4355J9924l6833
9075b7088m3863K8626P437J9173Q4284L8548j7018l0761M761k1234M9306l0108
9063F2063l957L0189K3502m6050m8191O1500l5834m7024J166l6127L0604l883
9051a2042k4716r280M3331J0964K1583j2785l4069j0070K2982K8512K1976J8347
9039F4733M946k0438k7696j6957n360m349L2237p53j3579L8534j6741m0207l0307
9026c5937O558j695m5668J3027K1301k7535j0948O3897J8044l2788k3956L270
$$ y = [29799, 12158, 24804, 44935, 37204, 23023, 7597, 13941, -17852, -9719, 11721, -27063, -45320, -21450, 21301, 8331, -21957, -59947, -51485, 19452, 8111, -32540, -11346, -9569, -38138, -15101, -48003, -113654, -110468, -14560, 19150, 4526, 4488, -70325, -54534, -10179, 9745, -27088, -70951, -42325, -34888, -15715, 68569, 107117, 90099, 59338, 64099, 42865, 92171, 62063, 58106, 88295, 111797, 65747, 17556, 79056, 43222, -3802, -2636, -38763, -8159, -12042, -36758, -46038, -2707, 8257, 29840, 17055, -17014, -27084, -4102, 24410, 46386, 64733, 69679, 49241, 21545, 4588, -772, -5121, 27116, 26363, 12784, 51318, 34577, -5630, -35937, -29379, -31074, -76742, -63715, -42414, -69949, -80897, -17000, 1044, -31744, -55700, -52430]
9014e2430K7441n7238n6094Q935O8656N3196J8609l6991k8100k3293N9869J04565
9002H7125N368m3177j8576L6944L1446n0311j2248n582o9510j4507N567q727n1113
8989a07301L616N3859J9015k3310j7542J0529k9935J6558M9087J3259L9766K9451
8977E7052j6614K0249m6908q788L681L4704n8104n9480j527L2449l868l3391J3061
8964f7484K4499J4521K7404K0531J0554L2368j9776J714j199m0701q214M3459
8952C7676O3758r200m9527q7636J255J3238J0503J7446R333j8968J412K2423M8095
8939E9808k375k7363l588M0975j408n1611k4826J8898o123l159k889r360p743
8926b0764p793j2072J0510j8489p63M8760K304Q06K958k9839l229k1580j0167
$$ y = [-52430, -24989, -82227, -138321, -129386, -60730, -7534, 11075, -25916, -54016, -77309, -17440, 87125, 92493, 49316, 30740, 67684, 99130, 48819, 36571, 30989, -38521, -53028, -47461, -56188, -107301, -103685, -49826, -30811, -54121, -71663, -61134, -91069, -74511, -25424, -12165, 27601, 57052, 40438, 60687, 13779, 4991, 8672, 43376, -14728, -74208, -75735, -43286, -47154, -80545, -67484, -42985, -28464, -1060, 19471, 30025, 62393, 42617, 44331, 43132, 2431, -5783, 37676, 101434, 92234, 42707, -44929, -43674, -30436, -19933, -2487, 6846, -12122, -10710, 11713, 59808, 57433, 30070, 26482, 67457, 66049, 14438, -10388, 8510, 2387, -772, -3661, -13021, -20764, -28557, -40629, -30119, -48608, -49371, -611, 1693, 2499, 5457, -24382, -27611, -49191, -59358]
8913e9358M1198P761R583k255J0177k5076j1061j6694J471O364O3377o538J1367
8900C0316J3036m112j4317J7146l9364k6492L603j9385k7322P90j1736m062J636
8887h0263N3547n9121l06M3218L1040m0860l0894k457M615p938m6093j7815P2683
8874h0644m1580n3270m046K5654Q5818N1154l3883k7384O1151m0142j8150l2539
8862a07861j7051L1602K9696L7038J9561K6p2717p723N4344R3247M0913l486N573
8849A03162k43k7175p0207m287M3027L4416k2448o0198M0769j4874l666l7684
8837a9408l4337m4655q8810M1897Q0940M6475L5830K0361j5754j10634m0698Q3312
8825d5481J071J3431J1079j5418K9565j2958N7985J44847J0548r7516J4922J0702
$$ y = [-59358, -18160, -10399, -816, -3071, 7106, -17970, -29031, -45725, -44254, -37890, 25487, 18949, 30316, 43352, 39240, 24923, 42069, 2705, -23787, -20184, -39569, -66891, -66101, -77837, -81899, -80263, -26716, -85837, -86143, -42925, -11885, -52745, -83639, -86096, -81481, -89419, -135512, -153327, -80644, -122224, -175494, -179540, -153886, -68068, -16914, -50797, -78181, -17030, -57172, -75322, -107861, -124912, -93310, -63614, -26576, -7015, -6989, -79706, -87429, -33085, 60162, 101075, 97589, 103162, 102919, 75744, 5537, 1250, 44277, 78693, 56245, -3953, 36816, 21942, 18276, -19408, -53745, -98400, -187210, -145313, -64373, -17898, 17932, 38293, 22539, -88095, -128793, -45481, -44410, -30979, -19900, -35318, -5753, -18711, 39274, 184121, 194669, 97153, 112075, 122777]
8813A22777m2781l4623m3989m1473J325N2722L2911m7629k5148M5294J3540j2335
8801B0591j7375n117L3510J8831K4196j2165n7253k5424J8227k1284l240J6565
8789i938Q164o5592L2817L3169r2104L4104P5203l9182p23R128j180R376k1652
8776b8410j7687N5737J4418m0571L8069O683R175K3416k9848n3089o118N5252
8764B7027K237p9440j4046J7422J9549j5425K1192l461j9506J9387L9600l0592
8752a6056j7260P743j5194J0901R692L0860O1070l0841Q120m6140j8477k6355
8740d1937j7670J6087L4954P3360m0120l1022J6812r28K4061K342l362l6579l8056
8727d2058N1442N9368m2476n312R792m2612r2368m8736M5652M6939O5174M573
$$ y = [122777, 79996, 45373, 1384, -40089, -38764, 13958, 46869, -760, -25908, 19386, 32926, 20591, 3216, -1901, 31609, 50440, 74636, 62471, 5218, -20206, -1979, -23263, -26503, -9938, -1774, -67366, -34549, -1380, -93484, -59380, 15823, -23359, -24082, -14954, -16134, -6758, -28410, -46097, 9640, 24058, -16513, 21556, 28239, 37414, 60830, 30982, -22107, -28225, 27027, 29264, -50176, -64222, -46800, -27251, -42676, -21484, -24945, -44451, -25064, 14536, -16056, -33316, -25573, -40767, -29866, -20174, 10686, 71756, 40915, 49035, 2895, -15582, -41937, -59607, -43520, -8566, 64794, 24674, -6348, 10464, 9536, 33597, 35939, 32577, -4002, -42058, 9384, 68752, 26276, 20964, 30756, -11856, -104224, -152960, -107308, -60369, 4805, 9378]
8715I378k9843o305L6587N638k3744m3724O33K6311R303K6587M0122Q404n38k3432
8701C5377m7267r088M4477N491r473M6288j015m7496j4938N0807P895m2973j864
8688A6221j039l5038l0258O609K3268j9042q808N2259K2309k3355r795q881m4983
8675f0533J9155O9271L1503R976J198L0439m895m5423J4674l8913j9790n4084
8663d7422m5679K1650n6010j4633L7711L6631j1249j3100J6693R4075K9877m9962
8651a418L4710J355r3285m0639O2296J01182k2799n4266K2183Q2785m5993R121
8639E5232l3786L9893K8579j2590p5572P914N1895j2630k7890j5131n7791n0437
8627a02314N6047L4867J0054N9492O5585Q631l5590l4325L1262K9363k7120p420
$$ y = [9378, -20465, -26770, 9817, 15455, -8289, -52013, -51380, -25069, -15766, 10821, 50943, 59347, 58809, 35377, -11890, -20978, 23499, 28990, 19517, 65805, 64790, 17294, 2356, 53163, 61058, 18085, 16221, 15182, -19856, -50114, -43505, -20237, -39279, -48087, 4172, 26481, 3126, -6669, -15550, -60533, -41378, 27893, 59396, 69372, 70570, 101009, 96114, 50691, 65365, 26452, 6662, -47422, -93101, -71451, -127461, -142094, -104383, -67752, -79001, -92101, -75408, 18667, 48544, -1418, 33292, 34647, -58638, -99277, -36981, 64201, 41402, -12864, 9319, 92104, 46111, 55232, 21446, 61339, 89918, 77328, 1756, 9670, 61565, 48935, 21045, 5914, -51877, -102314, -46267, -11400, -1346, 58146, 123731, 132362, 96772, 62447, 93709, 123072, 95952, 88532]
8615H8532L4467N4084l2392j9445l6908j12902p3267M0204J02039M7152k7577
8604F3987j7301p8211m9323J7953M4614L7484j7625m0245L1963M1266k9680m4263
8592c9381l636N2063J5705n3189m2689O4329k4628p737M4457J9637j5691p502
8580A738P4187L3129j14592m2286M1263M2313R318r687j1210M843j6812K7426
8568C9630M2088j51L6623m7489n8646l2491R130K558J3423j5555m383j1649j6907
8555d3819J1419L4543L3200M8733L1411R81m944k0169m5227m1888k8129N703N2535
8542C4349L3672l3753n8647R440J7023K0190m2314m5678N8247k332N684k2033
8530b6152K1294M3815j7090n9129k5599N1173J6945m4703m3080O485J1865J389
$$ y = [88532, 122999, 177083, 144691, 125246, 88338, -24564, -97831, -57627, 44412, 91564, 63987, 46686, -31525, -80848, -62895, -18281, 19203, 1578, -38667, -6704, 34562, 4882, -39381, -43017, 9046, 24751, -28438, -71127, -6798, -31426, -39163, 5294, 24931, 9240, 1738, 75925, 109054, -5538, -47824, -6561, 35752, 45070, 35383, 24173, 29016, 12204, 39630, 81718, 81567, 118190, 70701, 12055, -20436, -11306, -8748, 4675, -10880, -15263, -26912, -43819, -32400, 2143, 35343, 84076, 115487, 116468, 111524, 91355, 46128, 4240, -23889, -18186, 34349, 68021, 34268, -24379, -14939, 2084, 22274, -20040, -65718, -7471, -9803, -4119, -26152, -4858, 38957, 21867, -37262, -62861, -11688, 5257, -39446, -82526, -76041, -64176, -62787]
8518f2787p570k4108o302L0800O5751r002n4157l2798M3324m603l5292L7920N0243
8505h581M4368n2577o9883M609K6306P2306n2074l6669J1300K5129K6760j1665
8493b0671k0906J8592J014l4891J175L6995O1560J0487m1538l3502N924r049M4433
8480A9623n071O4854m1458m4993j6528j9686j5504L0320j4109J3944N5772K3549
8468E0713J7068J2522K0172k8859O378J9547r640n9607J6851j9100J0133N1134
8456H7312p496m5349L4795L5544m142n5639L8794R13m1735p629k5094K4488K936
8443C7698J9435J0416j7959j562J3014K0509L4308K4157k5611o8557J515N335
8431E2698M015m9774J3146m7317N3512O1358o74J4248P0096M2925l3802l7856
$$ y = [-62787, -70357, -94465, -100767, -69967, -4216, -13218, -67375, -100173, -56849, -61452, -96744, -58824, -8581, 35787, -16790, -86673, -82064, -55758, 16548, -35526, -72195, -60895, -35766, -9006, -20671, -41577, -22985, -21971, -56862, -55687, -18692, 42868, 53355, 11817, -21685, -15761, -24810, 19623, 14552, 79406, 37948, -7045, -23573, -43259, -58763, -28443, -42552, -28608, 27164, 50713, 67781, 80303, 100475, 71616, 77994, 97541, 87901, 28294, 45145, 26045, 36178, 87312, 79816, 34467, 69262, 104806, 100664, 45025, 83819, 84732, 42997, 35368, 10274, 34762, 37698, 57133, 67549, 49590, 48028, 61042, 81551, 115859, 140016, 114405, 45848, 47363, 52698, 56713, 6939, 20085, -27232, 26280, 87638, 86964, 101212, 171308, 214233, 180431, 142575]
8419A42575j3698k8496o9694j5792l6375m5162Q8034J5870J8854j8161k1151q432
8407H372j8385L090L0892N1992J1550q0818n1367J5040K1369L7192L581n4950
8395b2442Q7N0798J1399q662k2593K8119k1982Q410P5474r384l6049j9803M4849
8382G8221p988p8743o031L3043K0027l0109j6551R427K4383R481J0961l0686L5672
8369E1107M4068j2977j1958j7193j6653O592P1850L4650k0218L3127j765O797
8357A67427K4217q335N0819k0471J8746N3204J41892P3725R9658J72292L15276
8346A088450O16297Q97689R82446Q74681L49862o92911j089075q66343n28213
8337A632883l62326k74451j13795l0302q1925M826l4566o9152l2389k6249q4290
$$ y = [142575, 128877, 100381, 30687, 14895, -21480, -66642, 21392, 37262, 56116, 37955, 16804, 8372, -10013, -6923, 23969, 75961, 87511, 6693, -44674, -29634, -8265, 28927, 32508, -22442, -22355, 28443, 39842, 31180, 8587, 36706, 14724, 23134, 98608, 89224, 53175, 33372, 78221, 70233, -8510, -14541, 18502, 38529, 8420, -8131, 1296, 25679, 35160, 46121, 15435, 51107, 95175, 82198, 70240, 53047, 36394, 42986, 114836, 149486, 129268, 162395, 160630, 167427, 191644, 183309, 234128, 213657, 232403, 285607, 427499, 501224, 600882, 773174, 1088450, 1704747, 2602436, 3584882, 4459563, 4809425, 4116514, 3027439, 2161096, 1632883, 1270557, 996106, 882311, 852009, 770084, 774910, 740344, 671192, 638803, 612554, 528264]
8326E28264k2633n7324n5914o5337l5822o1810k9934N3126N0040J7862M2358K0675
8314C83551R330j7809P0077Q4528L1155N8540P5995O0154J47547K04099L81368
8303A488535O60113J004946J523371J858937J796455R88098r48914k221926j868159
8294D281456j120710o72317m13526k70623j65379k10911j21903n8513j3548j5161
8284A218865l2028j27136j30919j38628j17304o0306j42777p3755l929O5532K0765
$$ y = [528264, 505631, 448307, 392393, 327056, 291234, 229424, 199490, 252616, 302656, 320518, 362876, 383551, 392881, 375072, 445149, 529677, 560832, 619372, 695367, 755521, 903068, 1107167, 1488535, 2148648, 3153594, 4676965, 6535902, 8332357, 9320455, 8371541, 6149615, 4281456, 3160746, 2488429, 2074903, 1804280, 1638901, 1427990, 1306087, 1247574, 1234026, 1218865, 1186837, 1059701, 928782, 790154, 672850, 612544, 469767, 396012, 392083, 457615, 478380]
$$ [...]
##END NTUPLES=NMR SPECTRUM
##END=
