##TITLE=Analysis number 327621
Compound Code km 03728
Book Reference 196857
Project Code adrs flro3
Chemist Name jom
##JCAMPDX= 6.0         $$ Bruker NMR JCAMP-DX V2.0
##DATA TYPE= NMR SPECTRUM
##DATA CLASS= NTUPLES
##ORIGIN= Bruker BioSpin GmbH
##OWNER= nmr
$$ XWIN-NMR		Version 3.5
$$ Wed Mar 28 10:23:04 2007 GMT Daylight Time (UT+1h)  MAYBRIDGE\nmr@NMR_250MHZ
##.OBSERVE FREQUENCY= 250.131544655141
##.OBSERVE NUCLEUS= ^1H
##.ACQUISITION MODE= SIMULTANEOUS (DQD)
##.ACQUISITION SCHEME= undefined
##.AVERAGES= 16
##.DIGITISER RES= 18
##SPECTROMETER/DATA SYSTEM= dpx250
##.PULSE SEQUENCE= zg30
##.SOLVENT NAME= CDCl3
##.SHIFT REFERENCE= (INTERNAL, CDCl3, 0, 16.522)
##AUDIT TRAIL= $$ (NUMBER, WHEN, WHO, WHERE, WHAT)
$$ ##TITLE= Audit trail, XWIN-NMR		Version 3.5
$$ ##JCAMPDX= 5.01
$$ ##ORIGIN= Bruker BioSpin GmbH
$$ ##OWNER= nmr
$$ C:\u/data/dgb/nmr/ADRS/2420/pdata/1/auditp.txt
$$ ##AUDIT TRAIL=  $$ (NUMBER, WHEN, WHO, WHERE, WHAT)
(   1,<2007-03-28 10:22:38.66 +100>,<MAYBRIDGE\nmr>,<NMR_250MHZ>,
      <created by zg, POWCHK disabled, PULCHK disabled
       configuration hash MD5:
       49 4B E0 1D 92 C2 6B 37 9F E6 65 BC 52 41 86 1D
       data hash MD5: 64K
       41 63 61 50 EB BE 3C 7C B4 F8 73 73 A1 2B 81 9E>)
(   2,<2007-03-28 10:22:54.46 +100>,<MAYBRIDGE\nmr>,<NMR_250MHZ>,
      <Start of raw data processing
       ef LB = 0.3 FT_mod = 6 PKNL = 1 SI = 32K 
       data hash MD5: 32K
       14 32 18 67 15 95 57 36 93 B3 A6 50 27 2C E4 1C>)
(   3,<2007-03-28 10:22:56.22 +100>,<MAYBRIDGE\nmr>,<NMR_250MHZ>,
      <apk 
       data hash MD5: 32K
       8C 46 7D 7C A5 83 61 53 68 8B 9C 8F EE 1C F4 35>)
(   4,<2007-03-28 10:22:56.96 +100>,<MAYBRIDGE\nmr>,<NMR_250MHZ>,
      <abs ABSG = 5 
       data hash MD5: 32K
       3D F6 60 CD 20 30 54 11 0D 40 22 34 DB 3E F5 81>)
$$ ##END=
$$ 
$$ hash MD5
$$ 2E 72 6B 6F FD 9C DE C9 C7 2E 57 79 B4 70 5E E6
##$RELAX= 
##$RELAX= 
##$RELAX= 
##$RELAX= 
##$RELAX= 
##$RELAX= 
##$RELAX= 
$$ Bruker specific parameters
$$ --------------------------
##$DU= <C:\u>
##$EXPNO= 2420
##$NAME= <ADRS>
##$PROCNO= 1
##$TYPE= <nmr>
##$USER= <dgb>
##$AMP= (0..31)
100 100 100 100 100 100 100 100 100 100 100 100 100 100 100 100 100 100 
100 100 100 100 100 100 100 100 100 100 100 100 100 100 
##$AQSEQ= 0
##$AQ_mod= 3
##$AUNM= <au_zg>
##$AUTOPOS= <8 >
##$BF1= 250.13
##$BF2= 250.13
##$BF3= 250.13
##$BF4= 250.13
##$BF5= 500.13
##$BF6= 500.13
##$BF7= 500.13
##$BF8= 500.13
##$BYTORDA= 1
##$CFDGTYP= 0
##$CFRGTYP= 5
##$CHEMSTR= <none>
##$CNST= (0..31)
1 1 145 1 1 1 1 1 1 1 1 1 1 1 1 1 1 1 1 1 1 1 1 1 1 1 1 1 1 1 1 1 
##$CPDPRG= <>
##$CPDPRG1= <>
##$CPDPRG2= <>
##$CPDPRG3= <>
##$CPDPRG4= <mlev>
##$CPDPRG5= <mlev>
##$CPDPRG6= <mlev>
##$CPDPRG7= <mlev>
##$CPDPRG8= <mlev>
##$CPDPRGB= <>
##$CPDPRGT= <>
##$D= (0..31)
0 1 0 0 0 0 0 0 0 0.06 0 0 0 0 0 0 0.0002 0 0 0 0 0 0 0 0 0 0 0 0 0 0 
0 
##$DATE= 1175073757
##$DBL= (0..7)
120 120 120 120 120 120 120 120 
##$DBP= (0..7)
150 150 150 150 150 150 150 150 
##$DBP07= 0
##$DBPNAM0= <>
##$DBPNAM1= <>
$$ [...]
##$SUBNAM7= <"">
##$SUBNAM8= <"">
##$SUBNAM9= <"">
##$SW= 20.6930455092707
##$SWIBOX= (0..15)
0 0 3 0 0 0 0 0 0 0 0 0 0 0 0 0 
##$SW_h= 5175.983436853
##$TD= 65536
##$TD0= 1
##$TE= 683.16
##$TE2= 300
##$TE3= 300
##$TEG= 300
##$TL= (0..7)
0 120 120 120 120 120 120 120 
##$TP= (0..7)
150 150 150 150 150 150 150 150 
##$TP07= 0
##$TPNAME0= <>
##$TPNAME1= <>
##$TPNAME2= <>
##$TPNAME3= <>
##$TPNAME4= <>
##$TPNAME5= <>
##$TPNAME6= <>
##$TPNAME7= <>
##$TPOAL= (0..7)
0.5 0.5 0.5 0.5 0.5 0.5 0.5 0.5 
##$TPOFFS= (0..7)
0 0 0 0 0 0 0 0 
##$TUNHIN= 0
##$TUNHOUT= 0
##$TUNXOUT= 0
##$USERA1= <user>
##$USERA2= <user>
##$USERA3= <user>
##$USERA4= <user>
##$USERA5= <user>
##$V9= 5
##$VALIST= <valist>
##$VCLIST= <CCCCCCCCCCCCCCC>
##$VD= 0
##$VDLIST= <DDDDDDDDDDDDDDD>
##$VPLIST= <PPPPPPPPPPPPPPP>
##$VTLIST= <TTTTTTTTTTTTTTT>
##$WBST= 1024
##$WBSW= 4
##$XGAIN= (0..3)
0 0 0 0 
##$XL= 0
##$YL= 0
##$YMAX_a= 225705
##$YMIN_a= -320230
##$ZGOPTNS= <>
##$ZL1= 120
##$ZL2= 120
##$ZL3= 120
##$ZL4= 120
##$ABSF1= 16.522
##$ABSF2= -4.171173
##$ABSG= 5
##$ABSL= 3
##$ALPHA= 0
##$AQORDER= 0
##$ASSFAC= 0
##$ASSFACI= 0
##$ASSFACX= 0
##$ASSWID= 0
##$AUNMP= <proc_1d>
##$AZFE= 0.1
##$AZFW= 0.1
##$BCFW= 0
##$BC_mod= 0
##$BYTORDP= 0
##$COROFFS= 0
##$CY= 12.5
##$DATMOD= 1
##$DC= 0
##$DFILT= <>
##$DTYPP= 0
##$F1P= 14.0000005364418
##$F2P= -0.99999901652339
##$FCOR= 0.5
##$FTSIZE= 32768
##$FT_mod= 6
##$GAMMA= 0
##$GB= 0
##$INTBC= 1
##$INTSCL= 1
##$ISEN= 128
##$LB= 0.3
##$LEV0= 0
##$LPBIN= 0
##$MAXI= 10000
##$MC2= 0
##$MEAN= 0
##$ME_mod= 0
##$MI= 0
##$NCOEF= 0
##$NC_proc= -5
##$NLEV= 6
##$NOISF1= 0
##$NOISF2= 0
##$NSP= 0
##$NTH_PI= 0
##$NZP= 0
##$OFFSET= 16.522
##$PC= 1
##$PHC0= 236.2019
##$PHC1= 5.777181
##$PH_mod= 1
##$PKNL= yes
##$PPARMOD= 0
##$PSCAL= 4
##$PSIGN= 0
##$REVERSE= no
##$SF= 250.13
##$SI= 32768
##$SIGF1= 0
##$SIGF2= 0
##$SINO= 400
##$SIOLD= 32768
##$SREGLST= <1H.CDCl3>
##$SSB= 0
##$STSI= 32768
##$STSR= 0
##$SW_p= 5175.98343685301
##$SYMM= 0
##$S_DEV= 0
##$TDeff= 65536
##$TDoff= 0
##$TI= <Analysis number 999999
Compound Code 99
Book Reference 9
Project Code 9>
##$TILT= no
##$TM1= 0
##$TM2= 0
##$TOPLEV= 0
##$USERP1= <user>
##$USERP2= <user>
##$USERP3= <user>
##$USERP4= <user>
##$USERP5= <user>
##$WDW= 1
##$XDIM= 32768
##$YMAX_p= 451318644
##$YMIN_p= -629422
$$ End of Bruker specific parameters
$$ ---------------------------------
##NTUPLES= NMR SPECTRUM
##VAR_NAME=  FREQUENCY,     SPECTRUM/REAL,   SPECTRUM/IMAG
##SYMBOL=    X,             R,               I
##VAR_TYPE=  INDEPENDENT,   DEPENDENT,       DEPENDENT
##VAR_FORM=  AFFN,          ASDF,            ASDF
##VAR_DIM=   32768,         32768,           32768
##UNITS=     HZ,            ARBITRARY UNITS, ARBITRARY UNITS
##FACTOR=    0.157963299565203, 1,           1
##FIRST=     4132.6476996994, 0,             0
##LAST=      -1043.33573715361, 0,           0
##MIN=       -1043.33573715361, -629422,     0
##MAX=       4132.6476996994, 451318644,     0
$$ Real data points
##PAGE= N=1
##DATA TABLE= (X++(R..R)), XYDATA
$$ [...]
13260B16347Q012m1477k5689R107O921M5047J34887J0583p897M6270J9728L596
13248D25435J7976k8777j74820Q5367J69658p5290p609j51779q6503J8639J4349
13237B06646P0918o1196j20848k31188J2015K10368J14637M9340q9966M4537J3630
13226B18893j11842o9929n4486n255L5349Q826n1125P4247Q2547N9902M6351J29377
13214C62855J76138O6003j41190j42200j45577K4262Q2186O1009r444o2370j77452
13203I4220j14374p5752L1040J87122J09741k3200K6643j56096J8886j65546m5208
13192a12524L9635R1886L4917K9610N7143r3799R0858j58732p0381J7416n57K0364
13180e4164J37537J12844n2976r8414q1532l884n6743j06620j21942J69404J27408
$$ plain form
13260 216347 224359 182882 157193 166300 173221 218268 353155 363738 355841 402111 421839 425435
13248 425435 443411 414634 239814 325181 494839 419549 411940 260161 173658 192297 206646
13237 206646 277564 216368 95520 -135668 -123653 86715 201352 250692 160726 205263 218893
13226 218893 107051 37122 -17364 -22619 12730 21556 -29569 44678 127225 187127 233478 362855
13214 362855 538993 604996 463806 321606 176029 200291 282477 343486 334042 271672 94220
13203 94220 -20154 -95906 -64866 122256 231997 208797 235440 79344 98230 -67316 -112524
13192 -112524 -72889 18997 53914 83524 140667 46868 137726 -21006 -91387 -73971 -74528 -54164
13180 -54164 83373 196217 143241 44827 -36705 -40589 -97332 -203952 -325894 -156490 -29082
13169b9082r8522L4526J12948J03884k3315O8578l893r5986j289M5608k3492O9381
13157A59346O648J8281J93890j06954m9739k7942m1898L9824j2064m0586j46969
13146h163j00796l267K22624K74597r105p8509j0405m1271j15361m0247k7411
13135F2686j64539J3900j973j12193M2655P4371J87872J07489M5051r2110j72282
13124i073R9960J45439k8586m4006j6633J996O4797J2978j35367J7341O9894n6491
13112A22249j92297q1546R3953P5539j29252j35830J56532K46517J45699l2140
13102B69424j15614k45553r387r081o4760O5664Q562Q6685K29108J0176j47432
13091G7792j06546j17409O1232K38975p5903j27572O9951J27920J10817l7228
$$ plain form
13169 -29082 -127604 -93078 19870 123754 100439 169017 165124 69138 67849 113457 89965 159346
13157 159346 165994 184275 378165 271211 221472 193530 151632 191456 179392 138806 -8163
13146 -8163 -108959 -112226 110398 384995 375890 297381 286976 245705 130344 90097 62686
13135 62686 -101853 -87953 -89926 -202119 -159464 -85093 102779 210268 255319 163209 -9073
13124 -9073 90887 236326 207740 163734 147101 149097 213894 226872 91505 108846 178740 122249
13112 122249 -70048 -151594 -57641 17898 -111354 -247184 -90652 155865 301564 269424
13102 269424 153810 -91743 -101130 -110211 -174971 -109307 -100745 -14060 215048 225224 77792
13091 77792 -28754 -146163 -84931 154044 78141 -49431 20520 148440 259257 222029
13081B22029P900N4281l9264j19967J43020J16328r0729k4748K1413M9509q1935
13070B57837j01375j32397p0208K72611J16680r3680j29262P8129L6639m9372
13060A85602N5146q368j07256m6113o8489J19751p305o9677j78727L1202R4890
13049F56k1897P7452l0304j06518l9818j15009K16516J06614j06780N0956N4641
13038H6509M5275J18573J3412j4177j61314p2364j7628r1889J41734J8147j37188
13027g0910Q0542K02597p922J28395K17183J82694Q3122R3071k5580m0870j35778
13016G06544j43273j39947j32646Q4499R6563k56586j23550O7400j9729j4161
13006A25114l6600J8292n4938m4838m085J20035Q2220k05483j1383n6712P3560
$$ plain form
13081 222029 229929 284210 244946 124979 267999 384327 293598 268850 290263 339772 257837
13070 257837 156462 24065 -46143 226468 343148 249468 120206 198335 234974 185602
13060 185602 240748 232380 125124 79011 10522 130273 122968 53291 -125436 -94234 656
13049 656 -21241 56211 25907 -80611 -120429 -235438 -18922 87692 -19088 31868 86509
13038 86509 131784 250357 263769 249592 88278 15914 -1714 -93603 48131 66278 -70910
13027 -70910 9632 212229 204307 332702 549885 732579 815701 908772 883192 842322 706544
13016 706544 563271 423324 290678 375177 471740 215154 91604 159004 139275 125114
13006 125114 88514 106806 51868 7030 2945 122980 205200 -283 -11666 -68378 5182
12995E182Q1351k3122n5142R3913n2211P3928j777j22225p6560R1253J05685P546
12983A27821j20747j36609o9394L03231K65019K03621K67201J59997J67534J56920
12973A324594M7591k82810k97521m49676k17841Q6147J14402p4937j04071O0462
12963B06340N0406j00980j16727o5713k1574j3310j05977j41327k262J51632J49880
12952i612l4845J4819N495J23750J26783M2011j8860M2047j12838j84115J03655
12941I8290r3400j20860k9350M4368n2724J25915P7441O3658K20026j23797r9657
12930A09910J23212R9585K2329k0834m0678l34246j61246J02355l1670M0894K2554
12919f7835j4412m8850j8003J52255Q8766n5145p1893L3659R3195J3481J2642
$$ plain form
12995 5182 86533 63411 8269 102182 49971 123899 122122 -103 -76663 14590 120275 127821
12983 127821 7074 -129535 -198929 104302 369321 572942 840143 1000140 1167674 1324594
12973 1324594 1372185 1089375 791854 342178 124337 210484 324886 249949 145878 206340
12963 206340 256746 155766 39039 -26674 -48248 -61558 -167535 -308862 -311124 -159492 -9612
12952 -9612 -44457 -29638 -24143 99607 226390 268401 249541 291588 178750 -5365 98290
12941 98290 4890 -115970 -145320 -100952 -153676 -27761 49680 113338 333364 209567 109910
12930 109910 233122 332707 355036 334202 293524 -40722 -201968 -99613 -131283 -90389 -67835
12919 -67835 -82247 -131097 -149100 3155 91921 36776 -35117 -1458 91737 105218 117860
12908A17860l5338p4001p2793j33175l6493J66241J58845K9990l511J44647m1526
12897B20746k73675j50115P782J23295o7077m2663N4065k5234K8841J48808K59591
12886B84364Q823q6806j37261j77603k7228k450J35954N1856j92525k3045J34954
12875c0967k4188K6734j04348L9346l1310R2572P3973J00401l0464o05L8575J14531
12863B64250k47637o1413K4926L9756q7624l9355M3458J51630J65743J6527j27683
12852A42578L1612J83389Q973j70763q0791k82880r8141K42959o4618q3838J49466
12841b2054J05195j21292N3704Q5264R772m7048j30857M9665L8620J21232L42
12830A42543l0262k6666j0980m0436j12842n7787n4164R6749j5405n5779K9176
$$ plain form
12908 117860 82522 8521 -64272 -197447 -233940 -67699 91146 121136 117625 262272 220746
12897 220746 -52929 -203044 -195262 -71967 -139044 -181707 -127642 -152876 -124035 24773 284364
12886 284364 293187 206381 69120 -108483 -135711 -138161 -2207 49649 -142876 -165921 -30967
12875 -30967 -55155 -28421 -132769 -93423 -124733 -32161 41812 142213 111749 111144 149719 264250
12863 264250 16613 -44800 -19874 19882 -67742 -107097 -63639 87991 253734 270261 142578
12852 142578 174190 357579 366552 195789 114998 -167882 -266023 -23064 -87682 -171520 -22054
12841 -22054 83141 -38151 15553 100817 110589 63541 -67316 -17651 20969 142201 142543
12830 142543 112281 85615 74635 34199 -78643 -136430 -190594 -93845 -109250 -165029 -135853
12819a35853j1927o535J9580N5321k674q74q2499J494J16246J70850j51991j95303
12807b24165j51946R9615J96011K5717P0567J22917N6293m2259j25695J215P1735
12796A00005J5319k22020p1553J55385R4128j40334O7634J07594J57642N5300
12786C19100j79007j96259J7501J27192l8087M599j67826N528M8194o6415L4152
12775i1328K4857J4925k5242k9951m9329m4865R9932L54J22702R6283l0757j01246
12763a3665J34232J17966K3232j16059l5059p6921K7890j07379q9611J28129K19743
12752B12498j29127j27966Q7545l5475N8956J61057J55002q6581j40871J28307
12742B83345J26250j7173j84646j69388m7012M6801j45443J5408o0622k8875m488
$$ plain form
12819 -135853 -147780 -154315 -134735 -79414 -82088 -82962 -165461 -163967 -47721 123129 -28862 -224165
12807 -224165 -376111 -276496 -80485 -54768 15799 138716 195009 152750 27055 28270 100005
12796 100005 115324 -106696 -178249 -22864 71264 -69070 -1436 106158 263800 319100
12786 319100 140093 -56166 -38665 88527 50440 55039 -112787 -107259 -59065 -125480 -91328
12775 -91328 -66471 -51546 -76788 -106739 -156068 -200933 -101001 -100647 22055 118338 87581 -13665
12763 -13665 120567 238533 261765 145706 110647 33726 61616 -45763 -135374 -7245 212498
12752 212498 83371 -44595 42950 7475 66431 227488 382490 295909 155038 283345
12742 283345 409595 392422 207776 38388 -8624 38177 -107266 -91858 -152480 -181355 -185843
12731a85843k3815L09131J76760j84798l3493K6489R682o1912k21639r6854N4925
12720b31367K12802O7820R6926J66912M7881m3486J9755L0842K30440R9272R8463
12709G96260k0394j68764k56428J0176j10704n4150o7479J3948j06173k3320K1821
12698C4793J20605q2365j10598P8003j40619Q6012R0526J645r1596q6118o4694
12687a64406O4411J3437L1715l2420J04980J18508j1207j37985M2499L6962m4817
12676B1677O3871Q9666Q9250k8526P456p3768m0716n9757k4247k3433l2412K7225
12664A6286j02964q2779R1222L1149n3659K9340R7593M1996r4481q8225k1061
12653a35583o2115N1682J86358J52485L2256p2987j12362j13960j66196L6784
$$ plain form
12731 -185843 -209658 99473 276233 91435 57942 84431 94113 32201 -189438 -286292 -231367
12720 -231367 -18565 49255 146181 313093 360974 317488 337243 368085 598525 697797 796260
12709 796260 775866 607102 350674 360850 250146 195996 128517 142465 36292 12972 34793
12698 34793 155398 73033 -37565 40438 -100181 -14169 76357 78002 -13594 -99712 -164406
12687 -164406 -99995 -86558 -54843 -87263 17717 136225 125018 -12967 29532 66494 21677
12676 21677 85548 175214 264464 235938 243394 169626 128910 69153 44906 21473 -10939 16286
12664 16286 -86678 -169457 -78235 -47086 -100745 -71405 26188 68184 -26297 -114522 -135583
12653 -135583 -197698 -146016 40342 192827 225083 152096 39734 -74226 -240422 -203638
12643b03638K15088q9821J14989J51782r0559r897n0308J1455j95381p8409J00361
12632a24338R6270J48139n237j3365J03138Q9781m2528p9615l14498j56743J61909
12621a37087N9287Q7439r7326J41114M1835k0496q2672J09531k1249j05069J07438
12610H2745R1166J28969j40375R382M5763k04370j44120L0246O916k8052P788
12599a13942p8734L5312L3009j07527J37032J36114R0408j13917k09935k1822
12589b14002R0366J07318P2737k5844m8443q2070j888j23779M5709J05207j03183
12578a77872j05394J29830J88927P2573j39170l0309J09677L9612K6956j7796
12568I7034j34755K5948j4500J2997Q2886r2849m746l3337N0034J8065q6829N6865
$$ plain form
12643 -203638 11450 -78371 36618 188400 97841 87944 37636 49091 -146290 -224699 -124338
12632 -124338 -28068 120071 114834 101469 204607 294388 251860 172245 -142253 -298996 -137087
12621 -137087 -77800 9639 -87687 53427 95262 74766 -7906 101625 80376 -24693 82745
12610 82745 173911 302880 162505 171887 217650 13280 -130840 -100594 -93678 -121730 -113942
12599 -113942 -192676 -157364 -124355 -231882 -94850 41264 131672 17755 -192180 -214002
12589 -214002 -123636 -16318 56419 30575 -17868 -99938 -101826 -225605 -179896 -74689 -177872
12578 -177872 -283266 -153436 35491 108064 -31106 -61415 48262 87874 114830 97034
12568 97034 -37721 -11773 -26273 -13276 69610 -23239 -27985 -61322 -11288 6777 -80052 -23187
12556b3187p3189j70816j8082K11643L0181N496J05365K1268J10369L0521m0210
12545A89359j38794R381j44879m8385R0257O2574k6104j23071r0583K46419J83967
12534B10141M7561P3385j94974j05376J06620R6461M0475J44055k14224q2610
12524A21514N2097o3379L5030M9826k09195n9486k5537j46753k0518K65804J36615
12513A36018M2527M130n5532j0406O6163J14679K2406j62454j02443j36463j68696
12502b50071k7644N5705J94691J69592K04510j31373K5476o2912k19248j28937
12492a70211o563p4366r5008K6749Q4000n7871J65356p3919J25072J83601m6198
12481F0642o1072j47251o3487L8467K35728m039n0759N1404O3069j11520k19552
$$ plain form
12556 -23187 -96376 -267192 -285274 -73631 -43450 -37954 67411 88679 199048 229569 189359
12545 189359 50565 59946 -84933 -133318 -43061 19513 -6591 -129662 -220245 26174 210141
12534 210141 257702 331087 136113 30737 137357 233818 274293 418348 204124 121514
12524 121514 173611 110232 145262 195088 -14107 -73593 -99130 -245883 -266401 -597 136018
12513 136018 178545 182675 127143 116737 182900 297579 319985 157531 55088 -81375 -250071
12502 -250071 -277715 -222010 -27319 142273 346783 215410 240886 177974 -41274 -170211
12492 -170211 -176774 -251140 -346148 -319399 -235399 -293270 -127914 -201833 -76761 106840 60642
12481 60642 -430 -147681 -211168 -172701 63027 58988 8229 59633 122702 11182 -208370
12470b08370o2913K77807P4079J91830j3610m3987j42745l427L1624J49704j61135
12459H8857m5342K401k7723m3473J25291K7305j60313j62140j6764J39406J13735
12448D1240p3158J39022o2860k9322r246j51725N7140N9192K8934Q0915J00077
12437A80209Q8789j40772n6087n76J09825l6433j23406p4969J15321r849j3692
12426C8360k3732O387j06968L8037K53107K2201k01353k12869r4517k5555J31404
12415a75498N4927L6888j99136k0455J93012J4484o1258r8960Q9607R7979j29286
12404a97696j9133J38057N7130R2148J3570M9710o2161q5588J3878J03057P8457
12393A81429r715l5284j09399q9267j25912q2754L8135Q4129J27720J38271K7127
$$ plain form
12470 -208370 -271283 6524 80603 272433 258823 214836 72091 68664 100288 249992 88857
12459 88857 43515 45916 18193 -25280 100011 127316 -32997 -195137 -211901 -72495 41240
12448 41240 -31918 107104 44244 14922 5676 -146049 -88909 -29717 -783 80132 180209
12437 180209 268998 128226 72139 71563 181388 144955 21549 -53420 61901 52052 38360
12426 38360 14628 21015 -85953 -47916 205191 227392 26039 -186830 -281347 -306902 -175498
12415 -175498 -120571 -83683 -282819 -303274 -110262 -95778 -157036 -255996 -166389 -68410 -197696
12404 -197696 -216829 -78772 -21642 70506 84076 133786 71625 -13963 -85 102972 181429
12393 181429 171714 136430 27031 -62236 -188148 -270902 -232767 -148638 -20918 117353 144480
12382A44480L7200j04551K5104r743m3596K4002j15607L1182O5010Q6053J05161
12371B44695j43318j49613p8945Q0392K1852L5349l6568k38457J42918K51056
12361A29361r2575k6174P013L5136J74558O0752q3303k8790j04647j74458j1707
12350a14834O4418k2540N9190R9569O7990j34884q8475J4896p2332L22144J03256
12339B98398j42434j38995m6106k7874l086k7209j41024M370J21580l553J24049
12328A8116o4463j65841J07598L4253J0481q8360j75171o4936N9513q6393J92459
12317b22744J52649k6242K1377O8385j53289r5177j74J68127K06220L7190m2388
12306A13934q0064q0488J10852K3174K00457R5332j07697j6794j07862l1635J8358
$$ plain form
12382 144480 181680 77129 102233 92490 48894 72896 -42711 -11529 53481 139534 244695
12371 244695 101377 -48236 -127181 -46789 -24937 10412 -26156 -264613 -121695 129361
12361 129361 36786 10612 17625 52761 227319 288071 204768 175978 71331 -103127 -114834
12350 -114834 -50416 -72956 -13766 85803 153793 18909 -69566 -54670 -127002 195142 298398
12339 298398 155964 16969 -29137 -57011 -60097 -87306 -228330 -223960 -102380 -105933 18116
12328 18116 -46347 -212188 -104590 -70337 -59856 -148216 -323387 -388323 -328810 -415203 -222744
12317 -222744 -70095 -96337 -74960 -6575 -159864 -255041 -255215 -87088 119132 156322 113934
12306 113934 33870 -46618 64234 87408 287865 383197 275500 258706 150844 119209 137567
12295A37567R5333k2130j33081M6975J85218K3106q3621K8911r8262k40197n3180
12284a13361Q0676L2778j6620K3131J57537m1097k66979r5693M1792m8804O0247
12273a86393j11208J46910L12343q2580j0456r3007J06621P6084O018l7213m3909
12262H3210j35740L8466J3692l0317O1056J24040m9280j12395l9813l9601n3851
12251a40533j20851p8856p459J14362j5637J34751M5367j50243n3521J47372m253
12240a29501j6319J82348j36814p8875m5114m6326J50189Q7241r2332L6283N5374
12229c3846J40385O7328r2704r4692j4267K9121J400J5379j8259k5735P7167N1332
12217A02609P9324K3846L273p8516l711j4381j00642m6085n4145o0671J22294
$$ plain form
12295 137567 232900 210770 77689 124664 309882 332988 249367 278278 180016 -60181 -113361
12284 -113361 -32685 93 -16527 6604 164141 123044 -143935 -239628 -197836 -246640 -186393
12273 -186393 -297601 -150691 161652 79072 68616 -24391 82230 158314 164332 127119 83210
12262 83210 -52530 -14064 -372 -30689 30367 154407 105127 -7268 -47081 -86682 -140533
12251 -140533 -261384 -340240 -347699 -233337 -248974 -114223 -68856 -219099 -272620 -125248 -129501
12240 -129501 -145820 36528 -100286 -179161 -224275 -270601 -120412 -33171 -125503 -89220 -33846
12229 -33846 106539 173867 81163 -13529 -27796 1325 2725 18104 -155 -25890 51277 102609
12217 102609 181933 205779 209052 130536 126825 112444 11802 -34283 -88428 -149099 -26805
12206b6805j4394J3417L859j67232L0257n6154J64781j2000j72648Q3198J49032
12195d689m3119L341Q5503M5844o168r1506J07271J1223J9104j32477k44728M0993
12183b09408j7184j16070K55358J05733j61261p6083K458P1531o7997R4661J92498
12172G4236o8367m6956k0012m0794p6321Q300j02592J0655J79457J45624J35061
12161A98291O5828K0574j15722k37234p7401J4891l0705Q3924R7886J1582l8388
12150f474k0435p509j3573K14165j21367k0095j7777m5634j34202q3595k9791
12139b86287K2598J42284Q5173J00966L783p2508q5428o401j3444K179J6687P3649
12127a6749K5842n740J08082J21517k7255L8868l7160J07433J76444k8879j53344
$$ plain form
12206 -26805 -41199 -27782 -23923 -191155 -160898 -217052 -52271 -64271 -236919 -153721 -4689
12195 -4689 -47808 -44467 41036 86880 80712 -10794 96477 107700 126804 -5673 -250401 -209408
12183 -209408 -226592 -342662 -87304 18429 -142832 -218915 -216457 -144926 -212923 -118262 74236
12172 74236 5869 -41087 -61099 -101893 -178214 -169914 -272506 -261851 -82394 63230 198291
12161 198291 264119 284693 168971 -68263 -145664 -130773 -161478 -77554 20332 31914 -6474
12150 -6474 -26909 -34418 -47991 166174 44807 24712 6935 -38699 -172901 -256496 -286287
12139 -286287 -263689 -121405 -36232 64734 68517 -3991 -89419 -95820 -109264 -107085 -90398 -16749
12127 -16749 9093 3353 111435 232952 205697 244565 207405 314838 491282 462403 309059
12116C09059m6206M7231J5442l2177m5472p0718k03420o5911P914J11003j02520
12105g5775j5027j880J95479K3669j8614n3386j14073m8546N7295J46917N2295
12094A48354K36451Q0093l0424J7196j7220R635J07457K12732J40524J14529j33634
12083H85693j61614m7020n2958r8639j04701j13741j02874p1971P1294J53280
12073C56749M2929k24996q9801k4012l1682o7413o5657q4036n3160J11624K76449
12062A46994J76846j05636k45581l6732J6889K6073R2554j04228O4658J79993
12052B11830O7154q0822n4337n7583R8282Q0862j0721J57201O9901J9959N4488
12041E56214q1801O2665j42726j37941j55225N2643O6815m7915P0194n3850j67244
$$ plain form
12116 309059 262853 310084 325526 293349 247877 177159 -26261 -92172 -84258 26745 -75775
12105 -75775 -90802 -92682 102797 126466 107852 54466 -59607 -108153 -50858 96059 148354
12094 148354 384805 464898 434474 451670 434450 444085 551542 764274 904798 1019327 885693
12083 885693 724079 677059 624101 525462 420761 307020 204146 132175 203469 356749
12073 356749 399678 174682 84881 60869 29187 -38226 -103883 -187919 -241079 -129455 146994
12062 146994 323840 218204 -27377 -64109 -47220 -21147 71407 -32821 31837 211830
12052 211830 278984 198162 143825 86242 184524 265386 254665 411866 481767 501726 556214
12041 556214 474413 537078 394352 256411 101186 153829 220644 172729 242923 189073 21829
12030B1829M9377M9902J80017J88551r005k04873l40691J46877K38307j26820
12020A93471p0338L3383Q337o9702n0983j06940k06195k3833O7836q6854O9101
12009b42717K6811J29847N3241L6954k13923p2051R8928K02412Q2344L5081j07491
11998B9436j53684J26863J58080r7988j19152o4157O872o5044q5674P4627j4733
11987b04554o0177Q2481j28125J1047j38123M6586K45009J81500O9744j30550
11977b5162L4109o9973J0285j41508o0197J14113o3734p6521N3306J20172P5311
11966b9799q455M9971O8323J56446J09624n8282o0565j3605l7957n6052o9983
11955D9666m266o2868k2205l6150M3072R3820M5384j50064j81880l2907k1451
$$ plain form
12030 21829 71206 121108 301125 489676 480671 275798 -64893 81984 320291 193471
12020 193471 123133 156516 164853 95151 44168 -62772 -268967 -292800 -224964 -311818 -242717
12009 -242717 -215906 -86059 -32818 4136 -209787 -281838 -182910 19502 101846 136927 29436
11998 29436 -124248 2615 160695 62707 -56445 -120602 -113730 -178774 -264448 -189821 -204554
11987 -204554 -264731 -182250 -310375 -299328 -437451 -390865 -145856 35644 105388 -25162
11977 -25162 8947 -61026 -50741 -192249 -252446 -138333 -202067 -278588 -225282 -105110 -29799
11966 -29799 -38254 11717 80040 236486 346110 287828 227263 213658 175701 119649 49666
11955 49666 45400 -17468 -39673 -75823 -32751 61069 106453 -43611 -225491 -258398 -279849
11944b79849N3550P7844L096N1505J89597O9954r8552J1392j9019L2812O3991
11933A56321j68700k67566J1789J67624R6537J02021j56489Q6533K2782m9248
11923A604k4142j33795j47789J04168Q3840p9010Q4267K64651l8531k71008q7152
11912b42897O5491M0275o6745R2082M5778n4564j3410O3078L0947R532N0585n671
11900A4481o4980O9700J90393J90539O8474o4204L0169o5968q4601J24957j74010
11889B34950j23464J1553k7504O471P4214j5255L950o0245m8115M7823P4671k1532
11877A57517r0635j03549O4827J53426k2974j39043P3897J52060N655k6902R6781
11866C21060J14298j31417j63222M0582J39128J01074P5933K2260j36777p5448
$$ plain form
11944 -279849 -226299 -148455 -145359 -93854 95743 165697 67145 78537 59518 92330 156321
11933 156321 -12379 -279945 -268156 -100532 -3995 98026 -58463 28070 50852 1604
11923 1604 -22538 -156333 -304122 -199954 -116114 -195124 -110857 153794 115263 -155745 -242897
11912 -242897 -177406 -137131 -203876 -111794 -66016 -120580 -133990 -70912 -39965 -30433 20152 14481
11900 14481 -50499 19201 209594 400133 468607 404403 434572 368604 284003 408960 234950
11889 234950 111486 123039 95535 102006 176220 160965 164915 104670 56555 104378 179049 157517
11877 157517 66882 -36667 28160 181586 158612 19569 93466 245526 251181 224279 321060
11866 321060 435358 303941 140719 181301 320429 421503 497436 519696 382919 307471
11856C07471R1674J6652r4048J42875K60616Q6488J32358J73960k9054k18119
11846H70873r4013P6025o3317j90549n3233L9277k71547j28232J32742Q4540J03696
11835E06262p8443r2308r5663j81203j63797L9266J67503J09681p4050m2740j14572
11824b0064o7757N5692Q4563L1973n0499L5673J46858J12407j4240j52444K10474
11813C72636J72157N101L4777j74294k61966j3628k4162o7600Q5543K21427K32744
11802E82735Q4927J7446k70233k94528l3896J50142J25810j80663p2143J0369
11792A19966J61588J69122L5377k01300N1337l8432R6262p1714j89081O2428L8414
11781B33967r010L7226n3183q331j45765j8808l6099K2435j8695k9575j9739J84766
$$ plain form
11856 307471 399145 415797 321749 464624 725240 811728 944086 1118046 1088992 870873
11846 870873 776860 852885 789568 599019 545786 585063 313516 185284 318026 402566 506262
11835 506262 427819 335511 239848 58645 -105152 -65886 101617 211298 137248 94508 -20064
11824 -20064 -87821 -32129 52434 84407 33908 69581 216439 328846 314606 162162 372636
11813 372636 544793 549894 584671 410377 148411 134783 110621 43021 128564 349991 582735
11802 582735 667662 685108 414875 120347 86451 236593 362403 181740 109597 119966
11792 119966 281554 450676 486053 284753 336090 297658 393920 322206 133125 195553 233967
11781 233967 224957 262183 209000 200669 54904 36096 -3 22432 3737 -25838 -45577 139189
11769A39189Q6936l3356J09622n456J96397o3267Q419k3483j97647R2033P5922
11758C85309M5922J9837J3927J0763K37743J10580N8217l4959J46960n0366K3522
11747I67455j47905L912Q9017o6501o7703P7354J97089J61931N0133K69928J49766
11736A684476J820Q229L5234J95438K55491L14850L10198K72573L24601L26791
11726C729701M48953N12373O64182O86406N34335P45964J131530J430798J556284
11717A1440526K056103K485108L294953M223908N516275O973890Q347187R532003
11709E3869953R992152R149411O471596L130890j160913n032618p408275q582583
11701F0429613q763687p973261o712989n277234m143884l015683k114656j575740
$$ plain form
11769 139189 226125 192769 302391 296935 493332 430065 438484 415001 217354 309387 385309
11758 385309 431231 451068 464995 475758 713501 824081 882298 847339 994299 943933 967455
11747 967455 819550 823462 912479 845978 778275 855629 1052718 1214649 1264782 1534710 1684476
11736 1684476 1686296 1694525 1729759 1925197 2180688 2495538 2805736 3078309 3402910 3729701
11726 3729701 4178654 4691027 5355209 6041615 6575950 7321914 8453444 9884242 11440526
11717 11440526 13496629 15981737 19276690 23500598 29016873 35990763 44337950 53869953
11709 53869953 63862105 73011516 79483112 82614002 81453089 76420471 69012196 60429613
11701 60429613 51665926 43692665 36979676 31702442 27558558 24542875 22428219 20852479
11693B0852479j369315j138866r52831p06073m58675l28189p3219J65346M85745
11684A6476402O64955J094108J385937J881185K510217L219980M153074N788608
11676C7174466P178010Q517917J0442249J2770088J4552315J4771145J3175157
11669A18581347R741877M922341O86930k257758l770389n539441p536379r168386
11661A05660142j0825649j2471465j2681405j1697999r894025p947321o163079
11654C3979199m551258l450484k820626k054705j416601j097845r22640n46194
11646A7118846m54170j88088J54721L47459N61003J047819J450019K050704K486832
11637B4575145K979985L171993L411392M140701N463137P581116R937112J1337835
$$ plain form
11693 20852479 19483164 18344298 17391467 16685394 16226719 15898530 15825311 15990657 16476402
11684 16476402 17141357 18235465 19621402 21502587 24012804 27232784 31385858 37174466
11676 37174466 44352476 52870393 63312642 76082730 90635045 105406190 118581347
11669 118581347 128323224 133245565 133932495 131674737 127904348 122364907 114828528 105660142
11661 105660142 94834493 82363028 69681623 57983624 48089599 40142278 33979199
11654 33979199 29427941 25977457 23156831 21102126 19685525 18587680 17665040 17118846
11646 17118846 16664676 16476588 16631309 16978768 17539771 18587590 20037609 22088313 24575145
11637 24575145 27555130 30727123 34138515 38279216 43742353 51323469 61260581 72598416
11629G2598416J1396667Q756287L496681k863028q439507j1762715j2670904j1362425
11621D9149472r328525p050666n491173m259632l340851k714496k247324j874173
11613A2842632j391058j138001j240053q98674n91324o11370p24629o13304m33287
11604E200932k91958l95738m83462l50950j02109k41825l87151k17507q296j57416
11594B564520j60599r2464j50863l13007j97231j21743r4285J69730M5560Q1694
11584A731312J63846l01874r1169q0959j40287j94465l625K22754j6137R7515
11574A386911O4952L7639r1256J2682j09690p7575n597K7907R2821l3770l6092
11563A268932M0071o0359l15558k85343j3037K16956O027j52095r3122J02871
$$ plain form
11629 72598416 83995083 92751370 96248051 93385023 84945516 73182801 60511897 49149472
11621 49149472 39820947 32770281 27279108 23019476 19678625 16964129 14716805 12842632
11613 12842632 11451574 10313573 9073520 8174846 7583522 6972152 6247523 5634219 5200932
11604 5200932 4908974 4513236 4029774 3678824 3576715 3334890 2947739 2730232 2721936 2564520
11594 2564520 2403921 2311457 2160594 1847587 1650356 1528613 1434328 1604058 1649618 1731312
11584 1731312 1895158 1593284 1502115 1421156 1280869 1086404 1082779 1305533 1289396 1386911
11574 1386911 1451863 1489502 1398246 1410928 1301238 1223663 1218066 1245973 1338794 1305024 1268932
11563 1268932 1309003 1248644 933086 647743 634706 851662 857689 705594 612472 715343
11553G15343Q8528K046N080m559j19278n8625q8712J08929P9205q4135j92982
11542D50840j77751j44540J67109n5708K5473J63986L2339j06145k529M6343j11377
11531B88040J00799J33329l2310J12191j8816M494K2534m5195n2576n4704n2603
11520D05183q6427J26922J54225L4231j54849n9955j26596q285J6972J04821J4185
11509D20427J16666K00537J9504J40079K32183K4827k47396k27356J35711r552
11499H05630m7437L1208K795R5918P6758j1410j72676m0456N5489J2762J52005
11488I60586J81448K2081N2478J65336J31361J80212J30795J5498Q5494o7186
11478A858103R8352L74375M09614L97083L71012K81931N67980R40101R81580J033466
$$ plain form
11553 715343 803871 805917 810997 806438 687160 628535 539823 648752 727957 643822 450840
11542 450840 273089 128549 295658 239950 265423 429409 461748 355603 353074 399417 288040
11531 288040 388839 522168 489858 602049 583233 587727 610261 565066 512490 457786 405183
11520 405183 318756 445678 599903 634134 479285 419330 292734 284449 301421 406242 420427
11509 420427 537093 737630 757134 897213 1129396 1154223 906827 679471 815182 805630
11499 805630 758193 789401 792196 888114 964872 953462 780786 740330 795819 808581 960586
11488 960586 1142034 1164115 1216593 1381929 1513290 1693502 1824297 1839795 1925289 1858103
11478 1858103 1956455 2330830 2740444 3137527 3508539 3790470 4358450 5298551 6280131 7313597
11468G313597R53961J256930J572909J790802K569385L338516M919665O934176
11460C0649941J0234106J5603224K2090555K4412676J6994542J251207j3683115
11453A07553136k1229530k1474962j7277283j2303052q187336n533873l665095
11446A7882005k505586j816115j197507j013555r98484q67829p06503n78839o05195
11437G592392l09747j51340K4914O837j169J27339J94370N00023O97429J012324
11427I693372J459732K169787L085134L801977L234748J795860R16635J200369
11419B7357614K257878L906300O164450R599841J4193138K1819070L2292838M1434643
11411A59025772L8356785J9448893j969307j5327566k5802872l2916197l2344383
$$ plain form
11468 7313597 8267558 9524488 11097397 12888199 15457584 18796100 23715765 30649941
11460 30649941 40884047 56487271 78577826 102990502 119985044 121236251 107553136
11453 107553136 86323606 64848644 47571361 35268309 27080973 21547100 17882005
11446 17882005 15376419 13560304 12362797 11349242 10350758 9482929 8776426 8197587 7592392
11437 7592392 7282645 7131305 7156219 7163056 7161887 7289226 7483596 7983619 8681048 9693372
11427 9693372 11153104 13322891 16408025 20210002 23444750 25240610 26157245 27357614
11419 27357614 29615492 33521792 39686242 49286083 63479221 85298291 117591129 159025772
11411 159025772 197382557 216831450 214862143 199534577 173731705 140815508 108471125
11404A08471125k7628702k0749779j4359836r145363n285453k863507j585596
11397B6852889r82379j103580j637554j808625k085542k200823k175043k101766
11389A2757577j670880j125020q46594m84614l50749l73112l65361j4507L74070
11380G900810L76466L70503R56608J140097J098247J029848J247210J553113K462782
11371A8135684L404758M699378O687488R759214J4354623K1171074K6774309K3470687
11363A28457215Q436492j0013534k2039112k4976811k1477232j6017988j0898416
11356C1470614p344771m915568l069856k187201j464330r30486j073871j044476
11348I440055j168031j025632p19783p50281o67787m84572m41957l62189k97792
$$ plain form
11404 108471125 80842423 60092644 45732808 36587445 31301992 28438485 26852889
11397 26852889 25870510 24766930 23129376 21320751 19235209 17034386 14859343 12757577
11389 12757577 11086697 9961677 9115083 8630469 8279720 7906608 7541247 7526740 7900810
11380 7900810 8277276 8647779 9604387 10744484 11842731 12872579 14119789 15672902 18135684
11371 18135684 21540442 26239820 32927308 42686522 57041145 78212219 104986528 128457215
11363 128457215 136893707 126880173 104841061 79864250 58387018 42369030 31470614
11356 31470614 24125843 19210275 16140419 13953218 12488888 11558402 10484531 9440055
11348 9440055 8272024 7246392 6526609 5776328 5108541 4623969 4182012 3819823 3522031
11339C522031k40642j98787l19840k32307n9999j68523j55748q3184k78472k44009
11329A540520O2900L4831p4389j42546r3243k9901R0235J18891j13305q2726l6687
11318A274580N8738J2035N2843n7067j11735j44951K4270L0364J02814j31652
11308A110239j84465m3409M6122r4164L3763K1253m7015j24766l2210J08542K0910
11297H14800r1730m7359J05602O5799K7387R1416L1278M9935N1045j59016O6879
11286A006036L3092n5176j55121q4713J2285l2976j63221r9839K4714p497N5702
11275E33286m2885k7643R431j4508J3862K61548L1363l3639P7538J0817o1617
11264G57553R5400n3875N7470k682k07090o6740j75654j54775K2662J67945O3291
$$ plain form
11339 3522031 3281389 3082602 2762762 2530455 2470456 2301933 2146185 2063001 1784529 1540520
11329 1540520 1603420 1638251 1563862 1421316 1328073 1298172 1388407 1507298 1393993 1311267 1274580
11318 1274580 1333318 1345353 1398196 1341129 1229394 1084443 1108713 1139077 1241891 1110239
11308 1110239 925774 882365 928487 834323 868086 889339 842324 717558 685348 793890 814800
11297 814800 723070 675711 781313 847112 874499 965915 997193 1047128 1098173 939157 1006036
11286 1006036 1039128 983952 828831 744118 756403 723427 560206 460367 485081 477584 533286
11275 533286 490401 462758 472189 457681 471543 733091 764454 730815 808353 819170 757553
11264 757553 852953 799078 856548 853866 646776 580036 404382 249607 272269 440214 503505
11253E03505j7910J65380N1805J49177Q6723K1431K5562p3177j02565n7812q1735
11242F70384K981L5208p2909p318n3626m0349J2393o5133K65879R2220k74175
11231E65555k79744O4146o6633k6256O977m8577q4459M2730J1502n9744Q4191
11220B09688K23577r7494n4637J13712J5584q0299k2069Q9134p640N9307J66800
11209F15663j12655q0496K9204R8367m968j51031j42260l2651K63097J11895j61355
11198D32810O424j27255j63508j69189J86817n7361o0695J49561J97392L3988
11188D28984J24107r0419q2154m7265n1835K2491J24495j24962n2483l5549J19172
11177C34582q7949j27780K1547p6032q4720M8899l7520r8539K0781j21313O2846
$$ plain form
11253 503505 485595 650975 702780 851957 938680 960111 985673 912496 809931 752119 670384
11242 670384 673365 708573 635664 628346 574720 534371 546764 481631 747510 839730 565555
11231 565555 285811 349957 283324 257068 264045 215468 131009 173739 185241 125497 209688
11220 209688 433265 335771 281134 394846 410430 330131 308062 397196 389556 448863 615663
11209 615663 503008 422512 451716 550083 545115 394084 251824 219173 482270 594165 432810
11198 432810 439234 311979 148471 -20718 166099 108738 48043 197604 394996 428984
11188 428984 553091 462672 380518 333253 281418 303909 428404 303442 250959 215410 334582
11177 334582 246633 118853 140400 64368 -20352 28547 -8973 -107512 -86731 -208044 -145198
11166a45198J31878R1636L3259r7106R0241N32Q762J06506n4217K7295M3170o5848
11154A70910r7478O0942j07788M6757J12652J03584m238o2977j62254j26469o9769
11143a36128O0646K46259L5194P610J39854p2651k2770l8413N7783P8099r0606
11132B64877n1893p9410J4450r1211j16951J11354J34004J35767j21075m4738
11122A55174j43230r7267k7063K9458J08330J97528J03866m3070k36880R4116
11112A40962J4675l9283p2285J65314R4378j5411L02J3309J24566j1637j38881
11101B76009R794L9530n4511J23737J52545J49538k23640r9417m315R0990J09132
11090E69392Q1504j35480l711Q5700n645p2710o507j4000M1701j38476j66109
$$ plain form
11166 -145198 -13320 78316 111575 14469 104710 105242 114004 220510 166293 193588 236758 170910
11154 170910 73432 134374 26586 73343 185995 289579 285341 222364 60110 -66359 -136128
11143 -136128 -75482 170777 205971 213581 353435 280784 258014 219601 277384 355483 264877
11132 264877 212984 133574 148024 56813 -60138 51216 185220 320987 199912 155174
11122 155174 11944 -85323 -112386 -82928 25402 222930 326796 283726 46846 140962
11112 140962 155637 116354 44069 209383 303761 288350 288652 301961 426527 414890 276009
11101 276009 285803 325333 270822 394559 547104 696642 473002 373585 369270 460260 569392
11090 569392 650896 515416 511705 597405 591760 519050 512543 498543 540244 401768 235659
11079B35659j24184J62286R8487o7942j68232K6321j75534m9652P3129K31506
11069B41844J49887Q495m2196r9301O1357j06815p7743J1422N4224N5206j0648
11058B45732J40041J83243k5141P3893J81043j56654p8567k61838O8619K69325
11048F39696O8628k4951j90559p4394r6305p9751J51887q836K585n3655J01982
11037D36327l4423n0081K1791K37026Q7083j91693j92789j44335k0583j66899
11027a8576M6725r6532L2663J78039J60854P86j55107o1175J14509J73906J76617
11016E52709N7953k05874J00588M28919J9224K7270O3815j96262q8693j14685
11006F44964j76484l9695n5306j50299j89477o4897l1233m6475J10802J57242
$$ plain form
11079 235659 111475 273761 372248 304306 136074 162395 -13139 -62791 10338 241844
11069 241844 391731 400226 358030 258729 320086 213271 135528 146950 201174 256380 245732
11058 245732 385773 569016 543875 617768 798811 642157 563590 301752 370371 639696
11048 639696 708324 683373 492814 418420 322115 242364 394251 385415 388000 334345 436327
11037 436327 401904 351823 373614 610640 697723 506030 313241 168906 148323 -18576
11027 -18576 28149 -68383 -35720 142319 303173 303959 148852 87677 202186 376092 552709
11016 552709 610662 404788 505376 934295 953519 980789 1044604 848342 759649 644964
11006 644964 468480 428785 373479 223180 33703 -31194 -62427 -108902 1900 159142
10996A59142P341J73679J79658P0482j02575j9478j74689l2850N4970M6676n0535
10985C11821j77991m2612K08609Q6163M4808l7274l8624K9519j9922j3176R6867
10974D48188J6939j44890r7854r0247J14318J26273K37458R1130n177R0733P4163
10963H61034J28931q7594l0598Q908p4618O2497k42449j60069j78315j75270j5149
10952I7308L222r1920j65381N5494R0915J9340l2334m3051k7182l4001m0822j7597
10940a86009J92179l034j88929Q0182K06232m645j38043M5612k7049K28938R360
10929B14794o712j34428q536P4836k4910J1819l4970R700O9810K28299L36253
10918G35955J11728k6123j34n583k63708j97530N9391M2752j95826r7220n1187
$$ plain form
10996 159142 166483 340162 519820 590302 487727 468249 293560 260710 315680 362356 311821
10985 311821 133830 91218 299827 385990 430798 393524 354900 384419 364497 351321 448188
10974 448188 465127 320237 222383 132136 246454 372727 610185 701315 696138 786871 861034
10963 861034 989965 902371 871773 880681 806063 868560 626111 466042 287727 112457 97308
10952 97308 100530 8610 -156771 -101277 -10362 8978 -23356 -66407 -93589 -127590 -168412 -186009
10940 -186009 6170 3136 -185793 -105611 100621 95976 -42067 3545 -23504 205434 214794
10929 214794 208082 73654 65118 139954 115044 126863 91893 101593 171403 399702 735955
10918 735955 847683 821560 821426 815843 552135 354605 413996 456748 260922 163702 112515
10907A12515k9535j36029l1956O9408j61216O1122J17466K20408J94341r95r3325
10896C22204j17419j69946p9708k6604n2992J95443O8484J24506M1473j5309k97246
10885g114l7290R7399L8232j19020j24683o2964N5771r705J17659J06249L0542
10874H5076n4828j88988J20976o0748K0330M3893J67107P5072j28006P6835J11390
10863B68109Q9701J47081j23267j41434j15418j7798j30089j29841q4049L5477
10853b01528J46384J67259J85554L5397J9447o1249j18569m9869M3347p746O5184
10842B23611J79836J11462L6137q3647n7362j66503O7909p9296n1736k453J12071
10831B90029q5561k7114R3231j29625p1514N5504p5071n6414R2511q3482M7163
$$ plain form
10907 112515 82980 -53049 -85005 -15597 -176813 -115691 1775 222183 416524 415529 322204
10896 322204 204785 34839 -44869 -71473 -124465 70978 139462 263968 305441 290132 -7114
10885 -7114 -44404 52995 91227 -27793 -152476 -215440 -159669 -169374 -51715 54534 85076
10874 85076 30248 -158740 -37764 -98512 -78182 -34289 132818 207890 79884 156719 268109
10863 268109 357810 504891 381624 240190 124772 106974 -23115 -152956 -237005 -201528
10853 -201528 -55144 112115 297669 333066 352513 291264 172695 122826 166173 158427 223611
10842 223611 403447 514909 551046 467399 410037 243534 311443 232147 180411 177958 290029
10831 290029 204468 177354 270585 140960 69446 124950 49879 -6535 85976 2494 49657
10820D9657P1724j08673l4029J74553K8896j28335j48936O9573n9175j69876J81193
10809g3428J87792J0888l045Q5922J64839l4229o3702j4522j4675j38327k1185
10798H6328j11783R4419J95174j8025j46128p6304P3716M5813l0007p2769J3098
10787E3532j6605M4559K0417l7435M4793m5902O2633J764J2897R852K2283P168
10775A79956m8110n7379m8275N533J676J39627L0142O383k9497M9240J450j20799
10763A09947k9969P1829o8815Q6599m628P1107J30368j9678J4248J9483j6468
10752C64023j32556J4503N5004n0339O6846l6589j09876L1598J24192R7088M5150
10741D69044P8351M7892q7748l4925J76905P2543j82194K144M767Q4732R1057
$$ plain form
10820 49657 121381 12708 -21321 153232 182128 53793 -95143 -25570 -84745 -254621 -73428
10809 -73428 114364 125252 122207 208129 372968 338739 275037 260515 245840 107513 86328
10798 86328 -25455 68964 264138 246113 99985 23681 97397 143210 113203 40434 53532
10787 53532 36927 81486 101903 64468 109261 63359 125992 127756 140653 150505 172788 179956
10775 179956 131846 74467 26192 31725 33401 173028 203170 209553 180056 229296 230746 109947
10763 109947 79978 151807 82992 169591 164963 236070 366438 346760 361008 380491 364023
10752 364023 231467 245970 300974 250635 317481 280892 171016 202614 326806 423894 469044
10741 469044 547395 595287 507539 472614 649519 722062 539868 542012 546779 631511 722568
10730G22568L4600j1157J22358J15733J05568J36846l3897o5475p2095L5534J03462
10719A194045M6179J10908R5910K08327J87780J31589K61143K78083j4642K22650
10709B721972N19116L98155O68841M41447M28329M27850N54034O77456J112840
10700G950040J448904J804905K264404K878223L672283M329325N394105O415593
10692C6157782Q002391R402826J0034720R165162N904729J181214l371870p072740
10684F9404214q742688q899472p790748o219855m693090l462428k443307k260153
10676B4892473j987003j465229r84343r63013m37945n19630p59642o66083m67525
10667A6642060l62495j53669L29410O67753J254423J598853K363649L245522M202013
$$ plain form
10730 722568 757168 746011 868369 984102 1089670 1226516 1192619 1127144 1055049 1090583 1194045
10719 1194045 1240224 1351132 1447042 1655369 1843149 1974738 2235881 2513964 2499322 2721972
10709 2721972 3241088 3639243 4308084 4749531 5177860 5605710 6159744 6837200 7950040
10700 7950040 9398944 11203849 13468253 16346476 20018759 24348084 29742189 36157782
10692 36157782 44160173 53562999 63597719 72762881 78667610 79848824 76476954 69404214
10684 69404214 60661526 51762054 43971306 37751451 33058361 29595933 27152626 24892473
10676 24892473 22905470 21440241 20455898 19492885 19054940 18535310 17775668 17109585 16642060
10667 16642060 16279565 16125896 16455306 17123059 18377482 19976335 22339984 25585506 29787519
10658B9787519N240256O665177Q337086J0522750J2811053J4107950J2732598
10651A00204389Q575151L851664N1878k640298m222952n216389n340627m567642
10643I0695174l108697j345563r58300k486394n183429p817826r608032r874927
10635E0312006q930406p169168n382394l965471k852219j953868j211406r44989
10627A7902085n99459k46018l1911L78459N93854Q03915J319158J727288J913554
10618B3760925J998253K080313K294933K895549L762117M828844N892578P818856
10610E5332368R681652J1006373J0700096Q223422L898124j418954o314995j0049975
10602H1058111j1847368j1820590j0415653q766025p200230n450122m232916l422583
$$ plain form
10658 29787519 35027775 41692952 50030038 60552788 73363841 87471791 100204389
10651 100204389 108779540 112631204 112683082 110042784 105819832 100603443 95262816 90695174
10643 90695174 87586477 86240914 85282614 82796220 77612791 69794965 60186933 50312006
10635 50312006 41381600 34212432 28830038 24864567 22012348 20058480 18847074 17902085
10627 17902085 17302626 17056608 17024697 17403156 17997010 18800925 20120083 21847371 23760925
10618 23760925 25759178 27839491 30134424 33029973 36792090 41620934 47513512 55332368
10610 55332368 65014020 76020393 86720489 94943911 98842035 97423081 91108086 81058111
10602 81058111 69210743 57390153 46974500 38208475 31008245 25558123 21325207 17902624
10594A7902624k704559k139122j574214j346069j138117p78221o88330n89885
10586F944107n93594m04962n73374m99061l26716m00468l42296k78323k38445
10577C286868j61882j75186k71356j64563N1175p2986Q0973k34907j06763j01696
10567B129677j59652j58125k02596j30445J01701r5646q0681J13937j89498j84663
10557A144009L3973j3371J23255l1656n0211J1459m5473J57995M2829k41444k35514
10546H95851m7826J15711n067j27807J8625J28592P6531j85018k78415j2858R5367
10535F73686L18639K14682l1399k77834j00121j8788k04365N5216j29800q9099
10525D10817N7488M8115m1572q9368L6200J40688j8932l725j45438j12915J09038
$$ plain form
10594 17902624 15198065 13058943 11484729 10138660 9000543 8222322 7533992 6944107
10586 6944107 6350513 5945551 5372177 4873116 4546400 4145932 3803636 3525313 3286868
10577 3286868 3124986 2949800 2678444 2513881 2565056 2492070 2573043 2338136 2231373 2129677
10567 2129677 1970025 1811900 1609304 1478859 1580560 1484914 1404233 1518170 1328672 1144009
10557 1144009 1177982 1164611 1287866 1256210 1205999 1217458 1171985 1329980 1372809 1131365 895851
10546 895851 848025 963736 958669 830862 849487 978079 1054610 869592 591177 578319 673686
10535 673686 992325 1207007 1175608 897774 797653 778865 574500 629716 499916 410817
10525 410817 468305 516420 474848 385480 421680 562368 543436 539711 394273 281358 390396
10514C90396R5413k44537p7508K17274M5415J4602k28398j29771O5980n0229M0134
10503A38771J88060J170N5174n6406m0318k9268J14226J33386M9948r1842N7837
10492E20738j12414k10194j6187k8660Q2462J90366p6076q7674L9947K8824O4229
10481C95361j17751n7070k9018j11288R3771K263L2412j5763m7543K0523J34272
10470C00169Q7686N2948O091P9944j47050j87419q8169J06676J41893Q6899k41246
10459A98422m7295L8080J79544N3206P6720o3538j6883P3669K16j762j31630o311
10447C52438Q3813P0215L9048q7465k88184N1485N1438N8543q9648q6535r2910
10436F2238O1668J16214l2937n1703Q1699r1985J14599M8311M2604m3549k7785
$$ plain form
10514 390396 485809 241272 163764 381038 426453 441055 212657 82886 148866 98637 138771
10503 138771 326831 328001 383175 326769 286451 257183 371409 504795 554743 462901 520738
10492 520738 408324 198130 181943 153283 235745 426111 350035 262361 302308 331132 395361
10481 395361 277610 220540 191522 80234 174005 176268 208680 192917 145374 165897 300169
10470 300169 387855 440803 446894 526838 379788 192369 104200 210876 352769 439668 198422
10459 198422 151127 189207 368751 421957 498677 435139 418256 491925 492141 490379 358749 352438
10447 352438 436251 506466 545514 458049 169865 221350 272788 331331 241683 155148 62238
10436 62238 123906 240120 207183 155480 237179 145194 259793 308104 350708 307159 279374
10425B79374P8461K3720k6136o5604j3301q7438j28071l9082J44060K8280k17594
10414b3331N6326K55069p0474m5066n3443J59161q1987k38348m4678j19606N3247
10403a53130m389k779K2942m3055R2815J44882N2093J03061J4377o1675L2632
10392A97774p8785N4540k3943l8663q2030j39772l7381K08077K23604P531r9350
10381A91602m0075p6287P842K0957q376j22102M1103P1851J17794Q7017k15541
10370G5785j23572J22369l6035r6428n0709J03436K21283N3460q270k1562K1074
10359B60831K4776l205n5608N041P1582k9520k00790j23227J6904K77492L8707
10348B82983l4427j0642k4795J32379o4482o2794o0016k080J15195J20231P2747
$$ plain form
10425 279374 357835 381555 355419 289815 276514 189076 61005 21923 165983 194263 -23331
10414 -23331 32995 288064 217590 172524 119081 278242 196255 -42093 -86771 -206377 -153130
10403 -153130 -157519 -160298 -137356 -180411 -87596 57286 109379 212440 226817 165142 197774
10392 197774 118989 173529 149586 110923 28893 -110879 -148260 59817 283421 290952 191602
10381 191602 151527 75240 83082 104039 95663 -26439 14664 86515 204309 291326 75785
10370 75785 -47787 74582 38547 -57881 -108590 -5154 216129 269589 261319 239757 260831
10359 260831 285607 282402 226794 231835 303417 273897 73107 -50120 -33216 244276 282983
10348 282983 248556 237914 213119 345498 281016 218222 158206 156126 271321 391552 464299
10337D64299m7875O8684k1546q3073o8752j07110n5824o3870r1986r6808m0990
10326a44851P8385M2961j07721N1586Q221J52571K0546o8168k4753R9435J21581
10315B29793j12183j03451n3725K37949J63156j21307q9774L4829j3962q072r465
10304A53788l4590J81644l7041j19985N0427J12795J21357K0803j06049m5771
10294B97378J20907M3402J00012j48169m1603J501n5049n122J54843R8973p4768
10283D92305l4946J04320L7104j10023k0550J14079n7474J0243j5217j38329n0364
10272C31148N4050J15258j09250M343M1688J19067M8909R265P4999N023j06838
10261E87662J0388J07747j32501r1216r4101Q0307J18M7376M9376j8444j27258
$$ plain form
10337 464299 416424 485108 463562 380489 311737 204627 148803 84933 -7053 -103861 -144851
10326 -144851 -66466 -23505 -131226 -79640 -71419 81152 101698 33530 8777 108212 229793
10315 229793 117610 14159 -39566 198383 361539 240232 150458 185287 171325 163253 153788
10304 153788 119198 300842 263801 143816 194243 307038 428395 449198 343149 297378
10294 297378 418285 461687 561699 413530 371927 373428 318379 313257 468100 567073 492305
10283 492305 457359 561679 598783 488760 468210 582289 524815 535058 519841 381512 331148
10272 331148 385198 500456 391206 395549 437237 556304 605213 614478 689477 694500 587662
10261 587662 598050 705797 573296 482080 387979 468286 468404 515780 565156 546712 419454
10250D19454j56124o1404j06208J09364K95888K88803J1058r2645L9116J19786
10240H67088j2168n9747j22310j55280m3963J98044J86400j12771j72018q9312
10230D83963Q8782M1026j8880j7647L3726k8914k7981O3520j65175j78518m9670
10219B24232J03269J58410j01417j11178K20580r829m7153J12497J31733n8521
10209F22623j80128K2612m399q5999N6228R5130r1000r341J74230J6354j18063
10198D98247L9882Q457j70502r5432j97132N5542J72042O0239q8217m5406R661
10187B47381L9264q137n9149o6524o2517l19228m9324J8390J39900J62583J16573
10176A59212P7239O2795j3725j30205j75896j7359K8768p8772q6779M4486n3382
$$ plain form
10250 419454 263330 201926 95718 205082 500970 789773 800831 708186 747302 867088
10240 867088 854920 795173 672863 517583 473620 671664 858064 745293 573275 483963
10230 483963 572745 613771 594891 577244 610970 582056 554075 617595 452420 273902 224232
10219 224232 327501 485911 384494 273316 493896 484067 436914 549411 681144 622623
10209 622623 442495 465107 460708 374709 430937 526067 435067 425726 599956 616310 498247
10198 498247 538129 546586 376084 280652 83520 139062 311104 371343 283126 237720 247381
10187 247381 286645 278508 219359 152835 90318 -228910 -278234 -259844 -119944 42639 159212
10176 159212 236451 299246 285521 155316 -20580 -37939 -9171 -87943 -174722 -130236 -183618
10165a83618l7414P6001J7734P4679r511j44714r3581k1305J19434J20655J47252
10154F5612j61047j75866n091K44151P8279N9067K06830j8244q3163j40893J9585
10143H9220k8143o8404p9150J7655J7906k8231l5314K3728R6658j1447L0277Q6390
10131A11145q5288n2716l6358R7841J76528P0720k18497k03086k2657P3202J21734
10120C2568r3496n2787J4877M8155j31161O3023J53288j6027J40427l952N4820
10109B09735M3984j36651k5114J0447k5878r4269n5652q4722J39347K06062K07811
10098C95100P9815j22319j28947Q6512J17105P201m2513o8150r384K11572o6912
10087D59080N1595k02638j76251r8668r9623J27126J87727J32564J25754p0717
$$ plain form
10165 -183618 -221032 -145031 -127297 -52618 -62129 -206843 -300424 -321729 -202295 -81640 65612
10154 65612 -95435 -271301 -276392 -32241 46038 105105 311935 293691 210528 69635 89220
10143 89220 61077 -7327 -86477 -68822 -50916 -79147 -114461 -90733 5925 -5522 24755 111145
10131 111145 25857 -26859 -63217 34624 211152 281872 63375 -139711 -162368 -89166 32568
10120 32568 -60928 -113715 -98838 -50683 -181844 -118821 34467 18440 158867 154915 209735
10109 209735 253719 117068 91954 102401 76523 -17746 -73398 -158120 -18773 187289 395100
10098 395100 474915 352596 223649 310161 427266 434467 391954 323804 314420 525992 459080
10087 459080 510675 308037 131786 33118 -66505 60621 248348 380912 506666 435949
10077D35949q2491m1697J4656j06901j23961M3116q9777n6356J30462J88246l9545
10066B71701m1239L5506j28741j69922R5254j613O0931K75527J9018M763m6876
10055C74309j62742p0891M1885J72825P3028M1106Q4691P6087l5356R3315j44588
10044E43669p0446l384l8580O5706k0744m7944r4401o3977k7833j12028P120k4193
10032A12965M1742J03470K5117q8200j30519k0249k0529K4658k3512m3032K16994
10021A98905M6696j07908P3163J00913o6714j19471M2325J39074n4072q6866J12372
10010B78417R6929p5172P9258R4525p7770q7893K1528J67419k2380o9487o1180
9999C44194R3461N4050J39940O7146J18123p9488R848J52452o7540j76491J1876
$$ plain form
10077 435949 353458 311761 326417 219516 95555 138671 48894 -7462 123000 311246 271701
10066 271701 230462 265968 137227 -32695 62559 60946 121877 397404 416422 421185 374309
10055 374309 211567 140676 182561 355386 428414 469520 554211 630298 594942 688257 543669
10044 543669 473223 469839 431259 496965 476221 428277 333876 269899 242066 130038 137158 112965
10032 112965 154707 258177 283294 195094 64575 44326 23797 48455 24943 -18089 198905
10021 198905 245601 137693 210856 311769 245055 125584 167909 306983 252911 166045 278417
10010 278417 375346 300174 379432 473957 396187 308294 329822 497241 474861 405374 344194
9999 344194 437655 491705 631645 698791 816914 737426 747274 899726 832186 655695 667571
9988F67571k11181p273K14907J28831j95881L2238J74791Q8215k13157l3935n3394
9977E91732l2319l2444m6111J09091K77512K4557j46340l8478K3869M2638j15698
9966F58009O9256P4383J75473K73619M0327J22432j25224N4331J12983O4328J69048
9955A688965K07733J96392K55056L39188L89375M98763M13624M48358N72860Q26202
9945E836516Q09322J078989J488851J636448K257089K857072L191479L026639
9937B2182405K232827J234901j91089j565864k329532k660405k474619j843416
9929A4585208j342115r18649n10140n11285n34777o68631n87431o52363n43673
9920H316144k75571j55928q3669R5902L16732N01937L74542M55440Q38555J123294
$$ plain form
9988 667571 456390 449117 664024 792855 596974 629212 804003 892218 679061 645126 591732
9977 591732 559413 526969 480858 589949 867461 892018 745678 707200 731069 773707 658009
9966 658009 727265 801648 977121 1250740 1291067 1413499 1288275 1342606 1455589 1519917 1688965
9955 1688965 1896698 2093090 2348146 2687334 3076709 3575472 3989096 4437454 5010314 5836516
9945 5836516 6645838 7724827 9213678 10850126 13107215 15964287 19155766 22182405
9937 22182405 24415232 25650133 25459044 23893180 21563648 18903243 16428624 14585208
9929 14585208 13243093 12324444 11814304 11303019 10768242 10099611 9512180 8859817 8316144
9920 8316144 8040573 7884645 7800976 7896878 8213610 8715547 9090089 9545529 10384084 11507378
9910A1507378J324351J769691K310212K886217L928969M889856N735068N379117
9902C9730859M274039K855596K413117K959781L877094M517329M218658K929534
9894F7776007R83315j282747l263555m669414n550768n698358n750526n213556
9886C7330398m762766m327789l372849k861895k288159j707518j231505o91094
9878A6086823j72623J15767K16141L51975R31664J112608J857242K561874L548005
9869B6609476M445237L764174K135544J059857J041417K158235L639987M802319
9861D9656246N939785P288865Q433409R150209Q067290M690970o0437l870280
9853H9296057o433811p419661p127031n968864m722847l764382l662034m415695
$$ plain form
9910 11507378 12831729 14601420 16911632 19797849 23726818 28616674 34351742 39730859
9902 39730859 44004898 46860494 49273611 52233392 56110486 60627815 64846473 67776007
9894 67776007 68759322 67476575 64213020 59543606 53992838 48294480 42543954 37330398
9886 37330398 32567632 28239843 24866994 22005099 19716940 18009422 16777917 16086823
9878 16086823 15914200 16029967 16246108 16598083 17529747 18642355 20499597 23061471 26609476
9869 26609476 31054713 34818887 36954431 38014288 39055705 41213940 44853927 49656246
9861 49656246 55596031 62884896 71318305 80468514 88535804 93226774 93166337 89296057
9853 89296057 82862246 75442585 68315554 62346690 57623843 53859461 50197427 45781732
9845D5781732n172666n509452n025485m205009l319318k225493j568462j278315
9837A7477532q93445n18544l47208j23314M0631M94768R23522J371086J716442
9828B0141470J929197K002464K243122K605678K820775K630559K646095L187419
9820D0206779L888951M290292M138746L241626K097835J073462M54561p18902
9812E8673350k685115m657324o449960o996518o458001n349013m329957l258320
9804A8489142k654395j848420j516540j233323q48440p08046p31450l02601l02698
9795H343229l49230q8915J61039K27751J69088K32778M20746K00940j7891J37198
9785I436733R7078M158J32389O21008R36137J309850J736947J948395J713086
$$ plain form
9845 45781732 40609066 35099614 30074129 25869120 22549802 20324309 18755847 17477532
9837 17477532 16584087 16065543 15718335 15595021 15635652 16130420 17053942 18425028 20141470
9828 20141470 22070667 24073131 26316253 28921931 31742706 34373265 37019360 40206779
9820 40206779 44095730 48386022 52524768 55766394 57864229 58937691 59392252 58673350
9812 58673350 55988235 51330911 44880951 37884433 31426432 26077419 21747462 18489142
9804 18489142 15834747 13986327 12469787 11236464 10388024 9679978 8948528 8645927 8343229
9795 8343229 7993999 7905084 8066123 8293874 8462962 8695740 9116486 9317426 9299535 9436733
9785 9436733 9533811 9537969 9670358 10291366 11227503 12537353 14274300 16222695 17935781
9776A7935781J141719L64404m21361j239273k293851k490443k137031j660369
9768I199576j607094j358964q56918o68792m65760m94724l48028l01108l72382
9759B725806k25125o3519j00892k46565j64464M0266k9190k24171k62978j50957
9749A298211j33188J98858J57493m8328l24211o4370J32906J34884J50870n9769
9739A443356j64832j73077j57572j85666j88620j3261J71834J7499O275j33249
9729F22687j53038m3886P4625J38986N0970k814q9207O0481j7115k4322J65466
9718G82833n567n0742M4948L892l1102l8733J31131J90410l1187l26778o0114
9707F08991J60273J34598P683m4162N143J53265N0647r167q3228J93904J37560
$$ plain form
9776 17935781 19077500 19441904 19020543 17781270 15487419 12996976 10859945 9199576
9768 9199576 7592482 6233518 5376600 4707808 4242048 3747324 3399296 3098188 2725806
9759 2725806 2500681 2437162 2336270 2089705 1925241 1965507 1936317 1712146 1449168 1298211
9749 1298211 1165023 1363881 1521374 1473046 1148835 1084465 1217371 1352255 1503125 1443356
9739 1443356 1278524 1105447 947875 762209 573589 560328 732162 749661 755936 622687
9729 622687 469649 425763 500388 639374 690344 687530 598323 658804 641689 617367 782833
9718 782833 777266 726524 771472 775364 744262 705529 836660 1027070 995883 669105 608991
9707 608991 769264 903862 911545 867383 872526 1025791 1076438 1067271 984043 1177947 1315507
9696A315507K6047N5039J45440L02710M17156L63093L58610N07797P76436J302328
9686E570163J848474K211046K361440J819260M56314j084225j964880k225940
9678H991652j960021j521514r69335o33655p50610n78643l39538j91842q4609
9669A961885K46562j10560k75044O3671Q6693Q0643J84944K1498n1041j21068
9659B088183J1450J93650L30851K19497L14826M34257L42897N85037L64752M33732
9649E319132N25772O31864Q91160J128683J623152K291767L089572M238527N592798
9640B5332427O549866P177063P565656P929300O857486K247465m059660q396073
9632E1203530j0092679r504029p320431n375054l533897k671490j915656j163582
$$ plain form
9696 1315507 1341554 1396593 1542033 1844743 2261899 2624992 2983602 3491399 4267835 5570163
9686 5570163 7418637 9629683 11991123 13810383 14266697 13182472 11217592 8991652
9678 8991652 7031631 5510117 4540782 3907127 3156517 2577874 2238336 2046494 1961885
9669 1961885 2208447 2097887 1822843 1886514 1973207 2053850 2238794 2260292 2209251 2088183
9659 2088183 2099633 2293283 2624134 2843631 3158457 3592714 3935611 4520648 4885400 5319132
9649 5319132 5844904 6476768 7367928 8496611 10119763 12411530 15501102 19739629 25332427
9640 25332427 31882293 39059356 46625012 54554312 61411798 63659263 59599603 51203530
9632 51203530 41110851 31606822 24286391 18911337 15377440 12705950 10790294 9626712
9624I626712o95471o45962n89869m42166l94278l69760m23977m61837l76343j77500
9614E049549J53401K14487K52005K40379L47940M03249N61051Q40129J121060
9605I183250J218121J279291J029419J120420J341960J708991K643228L744271
9597B3268951N470153P328126R765369J2195015J4763858J5471902J4213908J1911656
9589A14388938P310194k77161j0314042j7679096j9788423j7569663j3519230
9582D2551517r489263o371544m171915l056077k058892j384273r80900q10449
9574A4228204r56510j044827j292512j154768o98718l65672o02507l44337n8265
9565G710088L3881L7456M23820N20592O23809J098030J460812J428771J280141
$$ plain form
9624 9626712 8931241 8285279 7695410 7253244 6858966 6489206 6065229 5603392 5227049 5049549
9614 5049549 5202950 5417437 5669442 5909821 6257761 6661010 7222061 8062190 9183250
9605 9183250 10401371 11680662 12710081 13830501 15172461 16881452 19524680 23268951
9597 23268951 28739104 36067230 45832599 58027614 72791472 88263374 102477282 114388938
9589 114388938 121699132 121421971 111107929 93428833 73640410 56070747 42551517
9582 42551517 33062254 26690710 22518795 19462718 17403826 16019553 15038653 14228204
9574 14228204 13271694 12226867 10934355 9779587 9080869 8715197 8112690 7768353 7710088
9565 7710088 7743969 7781425 8205245 8725837 9349646 10447676 11908488 13337259 14617400
9556A4617400J252088J147558J340149J864382L021130M411205N932019Q159217
9548D1745148J0969972J3814091J6601686J8101054J5535375J0031296K498812
9541A29297434q922604j7918486k1050202j9331491j5076360j0745005p243032
9534B9010254m906908l303358k328473j708296j238103j039842j214208j245279
9526A2025787j357810j194576j010156o97872n79427l41809k59578l59299j82022
9517F043238k45743j20611K28842L91187M57818O53380J047263Q31173N51687
9508I838234P28062P61882R13758J452826K399274L484263M680943O645364Q594747
9499C9499353J0067905J0663219Q960313L150076m896174j0205221j1990670j0953984
$$ plain form
9556 14617400 15869488 17017046 18357195 20221577 23242707 27653912 33585931 41745148
9548 41745148 52715120 66529211 83130897 101231951 116767326 126798622 129297434
9541 129297434 120374830 102456344 81406142 62074651 46998291 36253286 29010254
9534 29010254 24103346 20799988 18471515 16763219 15525116 14485274 13271066 12025787
9526 12025787 10667977 9473401 8463245 7765373 7185946 6844137 6584559 6225260 6043238
9517 6043238 5797495 5676884 5905726 6296913 6754731 7408111 8455374 9286547 9838234
9508 9838234 10566296 11328178 12241936 13694762 16094036 19578299 24259242 30904606 39499353
9499 39499353 49567258 60230477 69190790 72340866 67444692 57239471 45248801 34294817
9491C4294817q439229n940741m053256k505394j956911j077817p69773o45456
9483H906240q37795q14026o92070o82394p25628m74267l99140l62511l15466l01386
9473C301557r4859j18312j38323k14456r7107o8706j58772Q7800J14584m120L13272
9462B922558P2941R3397K37129M79554N44503M31583O80753J124344J826630K398218
9452A0811610K713129K378547R49468r81598k190998k485186k258284j725747
9444G210941j367835j084942p63897k81508l41764k68623k08178k40232l5458
9435B618504l70234l30503l6836o8346l42548l07131O2530J73129q4478O1462
9425A375549q2465q6625m6488r1505n6927j02527k1255J0496P3953j3703j3027
$$ plain form
9491 34294817 25855588 19914847 15861591 13356197 11399286 10321469 9551696 8906240
9483 8906240 8068445 7254419 6562349 5879955 5154327 4680060 4280920 3918409 3602943 3301557
9473 3301557 3206698 3088386 2950063 2735607 2638500 2569794 2411022 2498822 2613406 2609286 2922558
9462 2922558 2995499 3088896 3326025 3805579 4350082 4781665 5462418 6586762 8413392 10811610
9452 10811610 13524739 15903286 16852754 15871156 13680158 11194972 8936688 7210941
9444 7210941 5843106 4758164 3994267 3712759 3370995 3102372 2894194 2653962 2618504
9435 2618504 2248270 1917767 1880931 1812585 1470037 1162906 1225436 1398565 1314087 1375549
9425 1375549 1293084 1206459 1159971 1068466 1011539 909012 887757 898253 972206 958503 945476
9414I45476k8855M5888l7895J01186N7043p7609q5797m8912Q0357m2868k845K03116
9402A108285J05318N4665n851J40063L8567k51724j95207Q1431O9460j50232M2693
9391A037468R0606j22787J9265k06k02584m3142R4062R5850j35591q8299Q6962
9380H31604K2785j7122K4324j18129p7516K71693K22573P2505j61979j77451j56168
9369G37119k63002J1753J78301J33598p33J45696J7454k1516J49479j65982k06441
9358G15726p5698P8377P4804k6518N0714P2352l5700m7885P1114j53126j53009
9347E71151L3353o6242k1425J58059j13872j48930Q953j11724K08118P6237K8047
9336F21725J6608N9555K27027J69461j06576j30298o9782j97274N8595J40149
$$ plain form
9414 945476 916621 962509 924614 1025800 1082843 1005234 919437 870525 950882 908014 905169 1108285
9402 1108285 1213603 1268268 1262417 1402480 1441047 1189323 994116 1075547 1145007 994775 1037468
9391 1037468 1128074 1005287 1024552 1024346 821762 778620 872682 968532 832941 744642 831604
9380 831604 854389 837267 861591 743462 665946 937639 1160212 1232717 1070738 893287 737119
9369 737119 474117 485870 664171 797769 797036 942732 960186 938670 1088149 922167 715726
9358 715726 640028 718405 793209 766691 817405 889757 854057 806172 877286 724160 571151
9347 571151 604504 538262 516837 674896 561024 412094 421047 309323 517441 593678 621725
9336 621725 638333 697888 924915 1094376 987800 857502 787720 590446 649041 789190
9326G89190J00683Q3956J3761j67739o9342o1709j97808J23304P5240q4727j36410
9315D68399p0603m6792J59794J41497L8718k0456Q1704J68710M8573o7827r5164
9304H06553p7218J64344Q9870r3226q848m4882j2758j09054j57326M8448j37825
9293D68078j35515Q2344M0618J31401K5195j03196K00100J02514j86524j56835
9283D68180K2143J54217q0831o6936J18454J13549k097M8935R6265n666n2240
9272H13973p8267r2522Q3328J22644J51206P2532m093j35739Q66l8215P4446l7489
9260I32670o1932j3096r1253k42338M9721J63586J40149p0991J1249J20463J56747
9249A094975J0289r0535j65391p9185n4628n6292N9083Q0630p4360J24872K20352
$$ plain form
9326 789190 889873 973829 987590 819851 750509 688800 490992 614296 689536 604809 468399
9315 468399 397796 351004 510798 652295 691013 670557 752261 920971 969544 901717 806553
9304 806553 729335 893679 983549 890323 881475 836593 823835 714781 557455 605903 468078
9293 468078 332563 414907 455525 586926 612121 508925 709025 811539 625015 468180
9283 468180 490323 644540 563709 496773 615227 728776 726679 775614 871879 866213 813973
9272 813973 735706 643184 726512 849156 1000362 1072894 1068801 933062 933928 895713 970159 932670
9260 932670 870738 857642 766389 524051 573772 737358 877507 806516 817765 938228 1094975
9249 1094975 1105264 1014729 849338 770153 715525 659233 718316 798946 724586 849458 1069810
9238A069810J20513J80994K20116K59761K22983J7458j58508l46548k53521r3070
9228A239988j86873r7217J17254O225l4060j05891j51958m0710q9093N6374k3080
9217F90959j0300p294k6656J03154L3276R682j00108j7210J74148l5202o3103
9206G51346p7736q7133q3398j89534p33q036J84675J91273M1295O5819L1325K42468
9194A061631J18822L0543K83745M10756L49734M61438J91656j56711k88238n42987
9184A920389l15286P561J23464K5495k35959q5059m9728j92547j04477j48374
9174I45479j65554p0096j34754q2393K17190J97317j33029p5946r536r8851J67714
9163G57541J18310J42550j3808p3761l3700j91262P8221J23706n4778o4006K2669
$$ plain form
9238 1069810 1190323 1371317 1591433 1851194 2074177 2091635 1933127 1586579 1333058 1239988
9228 1239988 1053115 955898 1073152 1079377 1045317 939426 787468 746758 657665 714039 690959
9217 690959 680659 673365 646709 749863 783139 792821 692713 675503 849651 814449 751346
9206 751346 673610 586477 503079 313545 312812 304776 489451 680724 722019 787838 819163 1061631
9194 1061631 1180453 1210996 1494741 1905497 2255231 2716669 2908325 2751614 2463376 1920389
9184 1920389 1605103 1612664 1736128 1761623 1525664 1440605 1390877 1198330 1093853 945479
9174 945479 779925 709829 575075 492682 709872 907189 774160 698214 688678 589827 757541
9163 757541 875851 1018401 1004593 930832 897132 705870 784091 907797 853019 789013 811682
9152H11682J2696m8136J843J23970K7433Q4828K57617M4004J32394J48382R5842
9141A692555M7889P1336k33578j25126k04656j5139J52994J80239J83484l4529
9131A715469n0638o935n9597r5443L804M5017L7771J66898R792k09831l1332l4625
9119A490350k5512K98231J67808Q5822K46340K23272K05797M07924K90789K34245
9109C625066M76533O68741N64429Q86246J073771J350318J864436K477191L289061
9100A6275792M243820N703052Q080986J1089429J4315614J4314616P341098l221909
9092G8142498j0653134j3416270j2540638j0054053p289666n127381l599580k656521
9084A2805255k016207j563721j209681q94429r05850p70674n86372m91513l37769
$$ plain form
9152 811682 824378 776242 778085 902055 929488 1014316 1271933 1315937 1448331 1596713 1692555
9141 1692555 1740444 1811780 1578202 1453076 1248420 1233281 1386275 1566514 1749998 1715469
9131 1715469 1664831 1657896 1598299 1502856 1506660 1551677 1589448 1756346 1766138 1556307 1524975 1490350
9119 1490350 1464838 1763069 1930877 2016699 2263039 2486311 2692108 3100032 3390821 3625066
9109 3625066 4101599 4770340 5334769 6221015 7294786 8645104 10509540 12986731 16275792
9100 16275792 20519612 26222664 34303650 45393079 59708693 74023309 81364407 78142498
9092 78142498 67489364 54073094 41532456 31478403 24188737 19061356 15461776 12805255
9084 12805255 10789048 9225327 8015646 7121217 6215367 5444693 4858321 4366808 4029039
9075D029039j30839l02783l38041k97815r453k22565k59823j60726k17754o8070
9065B021170o7873j10614m9510q4431J2192j30107o5932j84848k62620M2113J21643
9054A241183N8266J7394q0354j45366j22014M0216J04380O0306K78089J16670
9044A568770p8244k5547j006j53920J2382N0965j07970j60047l1429j13096n2568
9033I08290P5394K22256m075J37407O9720k26902j15464j63392M7262J89620P8111
9022A218227p1152l0074J62080j14661j65487j64188n5503k5402M968N2742j02644
9011G08906m5642p9728j8998J8947P9456J15363R1364N0211J93050J84063q1143
9000A215849k45028p4786k9102q1307K654l3342l9071m6814J45442J7731j95198
$$ plain form
9075 4029039 3898200 3595417 3257376 2959561 2950108 2727543 2467720 2306994 2089240 2021170
9065 2021170 1953297 1842683 1793173 1708742 1720934 1590827 1524895 1340047 1077427 1119540 1241183
9054 1241183 1299449 1316843 1236489 1091123 969109 1009325 1113705 1174011 1452100 1568770
9044 1568770 1490526 1464979 1463973 1310053 1322435 1373400 1265430 1105383 1073954 960858 908290
9033 908290 983684 1205940 1201865 1339272 1408992 1182090 1066626 903234 950496 1140116 1218227
9022 1218227 1147075 1117001 1279081 1164420 998933 834745 779242 753840 758808 811550 708906
9011 708906 663264 583536 564538 583485 662941 778304 869668 919879 1112929 1296992 1215849
9000 1215849 970821 896035 866933 785626 788280 754938 715867 669053 814495 832226 637028
8989F37028o0599l1220J79982K61287J40360j38982j1599Q078r500j6590p0318
8978H87927p502m5870n6653j01324O3800J26849K7577j9251l6475L1544Q981j58598
8966G21005q2243J36503J58849R1050J8832L9559j09888n9942j895o0915j3311
8955H37604L1360L5620J61252j12512k73614M7401K5584J47515Q7450N2526j71710
8944H68476j11042J71273K32130J23221q2998j96360o5257j11661n9435R3992
8934H62339M9777q3309r2342q3766M7293K90050r1398k10478m2757k10779K7430
8923D62060K30012J10443J0398j03412M0132K23524J79820J47420p1076j94332
8913A034989j26790j0922J8545l5618j16578q6159O6658O7644l9193J23834J17961
$$ plain form
8989 637028 576429 545209 725191 986478 1126838 987856 976257 984335 974835 958245 887927
8978 887927 880425 834555 777902 676578 740378 867227 894804 875553 839078 870622 879603 721005
8966 721005 638762 775265 934114 1025164 1043996 1083555 973667 913725 911830 850915 837604
8955 837604 868964 904584 1065836 953324 679710 727111 752695 900210 987660 1040186 868476
8944 868476 757434 928707 1160837 1284058 1201060 1004700 939443 827782 768347 862339
8934 862339 912116 828807 736465 652699 699992 990042 898644 688166 645409 434630 462060
8923 462060 692072 802515 812913 709501 749633 973157 1152977 1300397 1229321 1034989
8913 1034989 908199 897277 915822 880204 763626 677467 744125 811769 772576 896410 1014371
8902A014371O6024M7833J60410N8543j4500l0781k097O4395n2685j23911j71476
8891A016126J05897k4044m2733O5345N5743l2303J43842Q8523O7480J31015j592
8880A573299j70305j33674K00349p8942j71134q6071n3974R7692J34208J21555
8870A433003K78771J03011P0898J49462K30259K79748J27200J48850J02150p6583
8860B846769K9944K4293J87045K36954K73700J79088K54880K85637L49744N36203
8850E204257P18165J151459J145793J317692J693009J855461K235183K843601
8842A8164620M117876N830796P915516J0795712J5888137K5176763M0115144N3067005
8834A81071569L9064437j331535l1951015m3482442m0728942l0143354j9612686
$$ plain form
8902 1014371 1080395 1128228 1288638 1347181 1332681 1301900 1299803 1364198 1311513 1187602 1016126
8891 1016126 1122023 1097979 1055246 1120591 1176334 1144031 1287873 1376396 1443876 1574891 1573299
8880 1573299 1402994 1269320 1469669 1390727 1219593 1133522 1079548 1177240 1311448 1433003
8870 1433003 1711774 1814785 1885683 2035145 2265404 2545152 2672352 2821202 2923352 2846769
8860 2846769 2876713 2901006 3088051 3325005 3598705 3777793 4032673 4318310 4668054 5204257
8850 5204257 5922422 7073881 8219674 9537366 11230375 13085836 15321019 18164620
8842 18164620 22282496 28113292 36028808 46824520 62712657 87889420 128004564 181071569
8834 181071569 220136006 218804471 186853456 143371014 102642072 72498718 52886032
8827E2886032j2605279q300417n648725l987375k794751k287428j603864j113016
8819A4545177p42821n42174n23001o50348m44040k85884p6221o5464l7957L9950
8809A1217217Q1401K10749L29830Q61787R40098J366419K002249K493416K627764
8800B2130930L050682M034036N614899P746522J0695467J4486185J9538756K8608556
8792A15906033M6235106P7930649J15452833R4038066J755957o6583606r2688604
8785B92046434q6962220o3301256m0866964k5741646j6576543j1127350p645327
8778C9825128n615867m105030l018364k323590j802884j744949j657264j578166
8770A7979014j380742j189239p93636n19626m44339m45341m83165o45766l83823
$$ plain form
8827 52886032 40280753 31980336 26331611 22344236 19549485 17262057 15658193 14545177
8819 14545177 13802356 13260182 12737181 12086833 11642793 11356909 11280688 11215224 11177267 11217217
8809 11217217 11298618 11509367 11839197 12700984 13641082 15007501 17009750 19503166 22130930
8800 22130930 25181612 29215648 34830547 42577069 53272536 67758721 87297477 115906033
8792 115906033 162141139 240071788 355524621 449562687 451318644 384735038 292046434
8785 292046434 205084214 141782958 100915994 75174348 58597805 47470455 39825128
8778 39825128 34209261 30104231 27085867 24762277 22959393 21214444 19557180 17979014
8770 17979014 16598272 15409033 14615397 14095771 13651432 13206091 12722926 12077160 11693337
8761A1693337n5527P6157M63249Q95520J170268J229089J329539J879621K635738
8752B1316991L693018N134975O861989R385701J3556344K1186577L3824765M8451618
8744A63411978M4327845Q618668k5843636m1345656m1611369l2184424k1407916
8737E3965490j3607641q946526n969515l905021l058832k343799j807844j197005
8729A3129307p69877q77606j039073q57348o73144n10102m26939m32896m40862
8720G101460m13443m18484l50821m30570j44517p3717l55975k95571o0760o7970
8710D489632k65716l76928k45812k14273k7418N9801q1710n2824j67142j59003
8700B958607L2604p7698L7862J86760J85806j61193q9368O7572k6863p3886Q6343
$$ plain form
8761 11693337 11637810 11713967 12177216 13072736 14243004 15472093 16801632 18681253 21316991
8752 21316991 25010009 30144984 37006973 46392674 59949018 81135595 114960360 163411978
8744 163411978 207739823 216358491 190514855 149169199 107557830 75373406 53965490
8737 53965490 40357849 31411323 25441808 21536787 18477955 16134156 14326312 13129307
8729 13129307 12359430 11481824 10442751 9585403 8912259 8402157 7975218 7542322 7101460
8720 7101460 6688017 6269533 5918712 5488142 5343625 5269908 4913933 4618362 4557602 4489632
8710 4489632 4223916 3846988 3601176 3386903 3359485 3419286 3337576 3284752 3117610 2958607
8700 2958607 2991211 2913513 2951375 3138135 3323941 3162748 3073380 3140952 3114089 3040203 3126546
8689C126546J48825j13172L0243m0781L4188Q9829q9946j10708N318K21229L48046
8678C649617J67591R9925l8506j95599j29839K1788l501L9334j34828j23078k19802
8667C133102j18086l290N5120R4255j48426N6551J01923O6868J57373n9434j23877
8656C212079R0963K1797O2008R0384m4141J9161O1641J56119J37719J13154K2043
8645C942927K5538J02187J07142r4741k24741m7153R9218Q5933l752P7547L87754
8634D457859K76218J6447L4871J6121O5303Q3530J46466Q3347m4604r2068J93842
8623E237332J49886J96943K61053m7336J75536K95053K21992J91843K18118L32033
8613G232453L59230L81436K67149M12063N94350N69970M39456N71536O59702O33250
$$ plain form
8689 3126546 3275371 3162199 3192442 3151661 3185849 3275678 3185732 3075024 3080342 3301571 3649617
8678 3649617 3817208 3917133 3878627 3683028 3553189 3574977 3571476 3610810 3475982 3352904 3133102
8667 3133102 3015016 3011726 3066846 3161101 3012675 3069226 3171149 3238017 3395390 3335956 3212079
8656 3212079 3303042 3324839 3386847 3477231 3433090 3452251 3513892 3670011 3807730 3920884 3942927
8645 3942927 3968465 4070652 4177794 4083053 3858312 3811159 3910377 3996310 3992558 4070105 4457859
8634 4457859 4734077 4750524 4785395 4801516 4866819 4950349 5096815 5180162 5135558 5043490 5237332
8623 5237332 5387218 5584161 5845214 5797878 5973414 6268467 6490459 6682302 6900420 7232453
8613 7232453 7591683 7973119 8240268 8652331 9246681 9816651 10256107 10827643 11487345 12120595
8603A2120595P94967J035816R05898R03745J118161J035519R21676J046028J158823
8594B1041228Q72350M26980l4355o18177j109428j301872j620323j683836j266374
8585A4706193j268808j019362r63081p89568n25303m24130n60702m44364m82064
8576H228811k75072k47884l84868l43557m56458m05991j82984k52804k24499k3943
8566E430751p8429n0454q1603n1300m8683r2328q2952q7334j8212o0273j55633
8555D623550k1538j6765j01293j32122j91596J25303j19618j7789Q7948j14869
8545D121211k21796j3007P1251O6545n4291N133l3249j22872l2239Q6397p6780
8534C796303k2577q5039k23353j2426M6956j05735j8659R3133J80623R148j91336
$$ plain form
8603 12120595 12915562 13951378 14857276 15761021 16879182 17914701 18836377 19882405 21041228
8594 21041228 21913578 22340558 22306203 21688026 20578598 19276726 17656403 15972567 14706193
8585 14706193 13437385 12418023 11454942 10665374 10140071 9715941 9155239 8710875 8228811
8576 8228811 7953739 7705855 7320987 6977430 6520972 6114981 5931997 5679193 5454694 5430751
8566 5430751 5352322 5301868 5220265 5168965 5120282 5027954 4945002 4857668 4839456 4779183 4623550
8555 4623550 4602012 4585247 4483954 4351832 4160236 4285539 4165921 4148132 4236080 4121211
8545 4121211 3899415 3886408 3957659 4024204 3969913 3975046 3941797 3818925 3786686 3873083 3796303
8534 3796303 3773726 3688687 3465334 3452908 3499864 3394129 3375470 3468603 3649226 3658374 3467038
8523C467038j23661p2433k47204j9069J41757l9815j22064k83774j45238O4414
8513B619951N4266r9224Q298k7947J46954J78509j06000j03352r8699j33381j93020
8502B246355N8364j02657O5855R6040j02866L439J64076m0675r5772l9228n1441
8491B201490L8634l3194j06785M4264J1185K0906O2494K5796L5242J13450j3596
8480B399886O2187K00474J05882l5331k4035l9045k04469j64503J39899R0519
8470B531464j02978L7909L4755N4949m7453M2882J71576N0332j93394K8278J2646
8459B620966N1961p178r3840K54135o979p3777J22699J65442L7059o0111K5653
8448C036030P7294J76950j1640J26942L02377J95829K52145J73880K25555N07539
$$ plain form
8523 3467038 3343377 3270944 3023740 3004671 3146428 3106613 2984549 2700775 2555537 2619951
8513 2619951 2674217 2574993 2583291 2555344 2702298 2880807 2774807 2671455 2572756 2439375 2246355
8502 2246355 2304719 2202062 2267917 2363957 2261091 2264530 2428606 2387931 2292159 2252931 2201490
8491 2201490 2240124 2206930 2100145 2144409 2155594 2176500 2238994 2264790 2300032 2413482 2399886
8480 2399886 2462073 2662547 2768429 2733098 2709063 2670018 2465549 2301046 2440945 2531464
8470 2531464 2428486 2466395 2501150 2556099 2508646 2551528 2723104 2773436 2580042 2608320 2620966
8459 2620966 2672927 2665749 2571909 2826044 2819065 2745288 2867987 3033429 3070488 3010377 3036030
8448 3036030 3113324 3290274 3278634 3405576 3707953 3903782 4155927 4329807 4555362 5062901
8438E062901M39762O20755M91427L20656L85345O20588P45256J010360J248603
8429A0945653J636138J858831K224929K735875L496897M795384O621032R173595
8421D3488334J3341912J9491750K7465516L5001700L6424813K4472952K118054
8414B01805031k0011228l3180070l4790867k9511343k1929986j5039387r985463
8407C7356687o597535m667392l525533k557809j866395j476053j015120r53505
8399A4697345q80700m32361l05889k63859k57122j18395K45246K45980M85482
8390A3415727K59472K15919M85484Q69126J095280J527605J981770K191837K044253
8381B4086473K867931L801388N021980P074509R411657J3038408J8141194K6896613
$$ plain form
8438 5062901 5502663 6123418 6614845 6935501 7320846 7941434 8686690 9697050 10945653
8429 10945653 12581791 14440622 16665551 19401426 22898323 27693707 34314739 43488334
8421 43488334 56830246 76321996 103787512 138789212 175214025 199686977 201805031
8414 201805031 181793803 148613733 113822866 84311523 62381537 47342150 37356687
8407 37356687 30759152 26091760 22566227 20008418 18142023 16665970 15650850 14697345
8399 14697345 13816645 13384284 13078395 12814536 12557414 12439019 12684265 12930245 13415727
8390 13415727 13675199 13891118 14376602 15245728 16341008 17868613 19850383 22042220 24086473
8381 24086473 26954404 30755792 35777772 42852281 52263938 65302346 83443540 110340153
8373A10340153M2608287O7136429Q7648330P3070134K4379934k8926624o4758683
8366C11497960p4106212o4289461m7968148l2728910k1626857j4634540j0102673
8359D6041159p208510n290191m043528k993675k245257j975955j756500j490689
8351A9036854j303595j067981m51921o58528q62078p99828n60830m84431l98920
8342A2448742r2637J62869J50688M93502Q08120O56054P30884J011149J157269
8333A7526640J951281K933816L890497N495718P306326J0583976J5332799K1779943
8325H6800996K8379826L0032476K2157710N007000j3134278k5864799k9662220
8318A03716711k6548607k0632850j4349720r658194o558260m478033l361975k381609
$$ plain form
8373 110340153 152948440 220084869 307733199 380803333 405183267 376256643 311497960
8366 311497960 237391748 173102287 125134139 92405229 70778372 56143832 46041159
8359 46041159 38832649 33542458 29498930 26505255 24259998 22284043 20527543 19036854
8351 19036854 17733259 16665278 16213357 15554829 14692751 13892923 13332093 12847662 12448742
8342 12448742 12356105 12518974 12669662 13163164 13971284 14627338 15358222 16369371 17526640
8333 17526640 19477921 22411737 26302234 31797952 39104278 49688254 65021053 86800996
8325 86800996 115180822 145213298 167371008 172378008 159243730 133378931 103716711
8318 103716711 77168104 56535254 42185534 32527340 25969080 21491047 18129072 15747463
8310A5747463j771463j402578j043652r47234j032748p59267n29749m91138n55014
8301G214620n81664m03203m99872m17914k03186j35384l20363l66729k29148q5581
8291C971576j45766k65751Q169J3402k17149k1613M7429j53232l8063j90757r7445
8280B910800o5036j835n6262o7265j41036M1975N3172R674J01001q2916j75455
8269B526817n1833j15695p2926J26366j2658k48566M6955q4874J9437n3238Q4422
8258B164207j7508k60556j03674q020J31597O6042p8920o9554n0685k2950M1137
8247A791116R0744j22373j08042p6198r5125j9228j16005J43052K46848J68676
8237A903465j27998K3806J3313j03694j44004j01079j0088K9033m5554L1910J63586
$$ plain form
8310 15747463 13976000 12573422 11529770 10582536 9549788 8790521 8260772 7769634 7214620
8301 7214620 6632956 6229753 5729881 5311967 5108781 4973397 4653034 4286305 4057157 3971576
8291 3971576 3825810 3560059 3568228 3581630 3364481 3342868 3390297 3237065 3199002 3008245 2910800
8280 2910800 2845764 2843929 2787667 2720402 2579366 2621341 2674513 2684187 2785188 2702272 2526817
8269 2526817 2474984 2359289 2286363 2412729 2400071 2151505 2198460 2113586 2133023 2079785 2164207
8258 2164207 2146699 1886143 1782469 1774449 1906046 1972088 1893168 1823614 1772929 1749979 1791116
8247 1791116 1881860 1759487 1651445 1575247 1480122 1460894 1344889 1487941 1734789 1903465
8237 1903465 1775467 1799273 1812586 1708892 1564888 1463809 1453721 1482754 1437200 1469110 1632696
8226A632696Q0681N361l0941m7680j52065o3647q8021j91104n1839L7515J66222
8215A297178M7330J4854r1283l6840N3591L2693l025J47861Q6097j86558j98380
8204A163518r5574J20040J41143j69138m6081L8877j15739k373q447q325M1334
8193A059235r4585m0120O3113j06294l3051l222O8433J9379K9493K4765O6537
8182A053683J31137N7092J20736O039j10468P0817o7367k21408M5880O3199J2671
8171A162011P0706J35097k15795K082N7785Q2830j51729j2120n575j81857L8688
8160I82123K40481K31682J4350j17740j30387L5473J9585n8898o6611l8783k6140
8149A085135P3262J34225r665q9442j0571P9130k411o7465p1334n5114m717J73387
$$ plain form
8226 1632696 1713377 1718738 1687797 1640117 1488052 1424405 1336384 1145280 1093441 1130956 1297178
8215 1297178 1344508 1359362 1268079 1231239 1284830 1317523 1314498 1462359 1548456 1361898 1163518
8204 1163518 1067944 1187984 1329127 1159989 1113908 1152785 1037046 1034673 1026226 1017901 1059235
8193 1059235 964650 924530 987643 881349 848298 845076 913509 932888 962381 987146 1053683
8182 1053683 1184820 1241912 1362648 1368687 1258219 1329036 1261669 1040261 1086141 1149340 1162011
8171 1162011 1232717 1367814 1152019 1154101 1211886 1294716 1142987 1130867 1125292 943435 982123
8160 982123 1222604 1454286 1468636 1350896 1220509 1255982 1275567 1216669 1150058 1111275 1085135
8149 1085135 1158397 1292622 1282957 1193515 1182944 1262074 1259663 1192198 1120864 1065750 1061033 1234420
8137A234420j44488m5675l053m7595N1892J67336j28277j61899J1824R8428J48652
8126A181565K31701j63070r829q3563j12217m5216N2250J88488Q7435j24133j40284
8115A063127o0230J30238N1333m4683q8853J17791R8208K4183j48538n9141M5082
8104A128517j12427P9633j16702n9701J62613K00509p5551j4663J72900J8191
8094A383319k16598J791J2998R6637l5499j08930J43808l5561j98928k0549J01854
8083A124342P5468M7408O7372q0118j15855P8091Q6715l9284P1456J37547O5402
8072A518544p8484m7171k1013R987R9681K16910J23780j50853l9462M6413P9497
8061A757829K73641j55981l34492r0406K5185p4225J39352L06259K80507Q8049
$$ plain form
8137 1234420 1089932 1044257 1041204 993609 1045501 1212837 1084560 922661 934485 1032913 1181565
8126 1181565 1413266 1250196 1240367 1156804 1044587 999371 1051621 1240109 1327544 1203411 1063127
8115 1063127 1002897 1133135 1184468 1139785 1050932 1168723 1266931 1291114 1142576 1083435 1128517
8104 1128517 1016090 1095723 979021 919320 1081933 1282442 1206891 1192228 1365128 1383319
8094 1383319 1166721 1168512 1181510 1278147 1242648 1133718 1277526 1241965 1043037 1022488 1124342
8083 1124342 1199810 1247218 1314590 1234472 1118617 1196708 1283423 1244139 1315595 1453142 1518544
8072 1518544 1440060 1392889 1371876 1381863 1481544 1698454 1822234 1671381 1631919 1678332 1757829
8061 1757829 2031470 1875489 1540997 1450591 1475776 1401551 1540903 1847162 2127669 2215718
8051B215718J3188m1547J22839J52271J70248J78896m024k31004j85409R3865
8041B485041O8344L3437K8171M4699o6363K28045J2308j66602j32994n30k1749
8030B511807J19432J69992k0399J2473R4631p419o9291j7706J21649j6713O2224
8019B960680K50659L76471K88117J18111K75759K88787J45194P7554q8848o1825
8009D630659q9966K71248K04660J26649J95615J68246J83103L47537M45094K89142
7999F771987L25079O2713r5707k14404l37303k55186k93915j44853k22729k19049
7989E376633k12019k22933k96147l31355l32581k15456r0604L5589k00244r5830
7979C415053J19960J73002n1929K2696K28587J08782J70097J59210K57935M48128
$$ plain form
8051 2215718 2228906 2187359 2310198 2462469 2632717 2811613 2807589 2576585 2391176 2485041
8041 2485041 2553385 2586822 2614993 2659692 2593329 2821374 2833682 2667080 2534086 2533556 2511807
8030 2511807 2631239 2801231 2780832 2793305 2887936 2880517 2811226 2793520 2915169 2898456 2960680
8019 2960680 3211339 3587810 3875927 3994038 4269797 4558584 4703778 4781332 4692484 4630659
8009 4630659 4540693 4811941 5016601 5143250 5338865 5507111 5690214 6037751 6482845 6771987
7999 6771987 7097066 7159779 7064072 6849668 6512365 6257179 5963264 5818411 5595682 5376633
7989 5376633 5164614 4941681 4645534 4314179 3981598 3766142 3675538 3711127 3510883 3415053
7979 3415053 3535013 3708015 3656086 3678782 3907369 4016151 4186248 4345458 4603393 5051521
7969E051521O32996P03393L30652J2417k00642o7497P4040J14484K38148J85107
7959G074619Q7408M5106L33014J56120M0486p0969k48178l39802k03015o8483
7949F806306k30835m14397l88583m27538l01592j85997l11910k90740j41510j98949
7939C914255k85425j03712n7951j10104L4311r8764q7411N7866J3757j1467J5034
7928C280389j55386K12261K14010K11182K85654L57454L52739J82942J03670k1593
7918E023322o4759l1015j99285k83952j03589p9415k29377r9920j21300q5550
7908C725160J19302j8426j83748l48595k34976k03950k86295j07392j41775k197
7898B317108j23360k34875K4433P3321J05977j29180k39578J0759J03031k42958
$$ plain form
7969 5051521 5684517 6387910 6718562 6730979 6530337 6462840 6536880 6651364 6889512 7074619
7959 7074619 7162027 7207133 7540147 7696267 7736753 7665784 7417606 7077804 6874789 6806306
7949 6806306 6575471 6161074 5772491 5344953 5043361 4857364 4545454 4254714 4113204 3914255
7939 3914255 3628830 3525118 3467167 3357063 3391374 3292610 3205199 3263065 3276822 3265355 3280389
7928 3280389 3125003 3337264 3551274 3762456 4048110 4405564 4758303 4941245 5044915 5023322
7918 5023322 4958563 4927548 4728263 4444311 4340722 4261307 4031930 3932010 3810710 3725160
7908 3725160 3844462 3826036 3642288 3293693 3058717 2854767 2568472 2461080 2319305 2317108
7898 2317108 2193748 1958873 1983306 2056627 2162604 2033424 1793846 1804605 1907636 1664678
7888A664678j36343j89441m2648j270N6591r0463J79835J23796N9941k9460k709
7877A592507K00480Q5698j23816l13673j65821l5282J01285M1834K2521Q3583
7867A489316O0823j14271j55416j31181l2344J30177p330j73166o9223m4617n9939
7856H92829j28945J43775J10458j8407j56264N979J43868N9559m3843m9029j42764
7845H17216n6886J43128j93667j00048J35411Q1518m4721j962J42278J02407N8951
7834A083625m8964j16256q7393r1411m6459Q0032n7964o9716P2713J31541O905
7823H56653j04776j14706k1433m1499r3698K53591J27958k44683p3088L2859n1367
7812E25811r5257P8792J75313j8187k33511j35412l1734L9748q480j9483Q7826
$$ plain form
7888 1664678 1528335 1338894 1296246 1294976 1351567 1261104 1440939 1564735 1624676 1595216 1592507
7877 1592507 1792987 1878685 1754869 1441196 1275375 1240093 1341378 1383212 1405733 1489316
7867 1489316 1550139 1435868 1280452 1149271 1116927 1247104 1239774 1066608 997385 952768 892829
7856 892829 763884 907659 1018117 999710 843446 849425 993293 1052852 1009009 959980 817216
7845 817216 760330 903458 709791 609743 745154 826672 781951 779989 922267 1024674 1083625
7834 1083625 1034661 918405 831012 739601 693142 773174 715210 645494 718207 849748 856653
7823 856653 751877 637171 615738 574239 480541 734132 862090 617407 544319 577178 525811
7812 525811 430554 509346 684659 666472 432961 297549 265815 305563 297083 277600 365426
7801C65426K0379O5278J07823l0155j51616j05447P7830J35039k292J301J02268
7790E85834J08511j88037j08440Q888J68855O9096n7568j01681j51057j58557
7780A75844p1132K10734J38185K1576L2976l4377j09916q8963P9581J59579q9741
7769D24346k6116J94889m8391N5794M8697p8050l3958J25609R0160j68362j18693
7758D65925O3O8458j59472m7023P0223J11878p6067j5231k0365L7930O7257k08720
7746B94856K3830j70773j06510J06986l5840K1791J20800j49560j03756Q4755
7736H6579O9200O158m4084p5332j24413J3961J10552J25531n030q299N3158J24840
7724C32821n5412j05415q0422k9906P119L5340P1649K32983J8426j8038n449j2757
$$ plain form
7801 365426 385805 451083 558906 528751 377135 271688 349518 484557 482265 483566 585834
7790 585834 694345 506308 397868 406756 575611 644707 587139 485458 334401 175844
7780 175844 104712 315446 453631 475207 508183 473806 363890 274927 354508 514087 424346
7769 424346 398230 593119 544728 600522 649219 571169 537211 662820 752980 584618 465925
7758 465925 465988 534446 374974 327951 398174 510052 433985 418754 398389 436319 503576 294856
7746 294856 318686 147913 41403 148389 112549 134340 255140 105580 1824 86579
7736 86579 155779 161937 117853 42521 -81892 -67931 42621 168152 163122 154823 207981 332821
7724 332821 277409 171994 91572 61666 68785 104125 175774 408757 427183 409145 403696 390939
7712C90939k6297J1463J50485N108j08743L7970N5127j7470J1820N8216p4209
7701D94409n2398k59386p6945L9521K2411l3816M90J33959K5166q472l649j72970
7689A08320P5030J53787n452k75244l2435J33724K22823J3715n9251k42075k22845
7678a29903m3571J05020k9343j29792J08952J00493o6530N0672n5745O6772K6737
7667C762N3330J26308l7124k3715R9246P6140R188j59257p1805P8280P1417r5232
7655A30538j55099M6786L6144L8276N3738k4167J729j7361J07945l0944j25443
7644F2142p2091J13855n3762r691O7760J03979M1816J76084J22830p9511Q7606
7633E61017k9933l11150k53647O8923Q9964N5996r3j6082Q8872j2104o4393j09523
$$ plain form
7712 390939 364642 376105 526590 531698 422955 460925 516052 498582 510402 568618 494409
7701 494409 442011 182625 105680 145201 167612 133796 134286 268245 293411 284939 281290 108320
7689 108320 183350 337137 331685 56441 24006 157730 380553 394268 335017 92942 -129903
7678 -129903 -173474 -68454 -97797 -227589 -118637 -18144 -84674 -34002 -89747 -22975 3762
7667 3762 57092 183400 146276 122561 221807 297947 307135 147878 76073 154353 225770 130538
7655 130538 -24561 22225 58369 96645 150383 126216 127945 110584 218529 187585 62142
7644 62142 -9949 103906 50144 40453 108213 212192 254008 430092 552922 473411 561017
7633 561017 531084 219934 -33713 35210 125174 181170 181077 164995 253867 241763 177370 67847
7621F7847n1439N7204O242r028O0205j9257L8474J15850j00872p497K7761K71191
7609D56681J68529Q1195J05500j97475j49499j12027k64J5082O8907J3089J5756
7598D65474n3839k41098p3786o7151m4772J78555N4543J67536l7259l36255j28755
7587a16807j01265M8357J56546K45632r0513k7480J0352L2664L4277o7442K7805
7576A52126k0251M4795J6740J01215m0686L0691o1605J9767Q0289M5195j37993
7565B30283O7362K89065R945k06770p2489p3460o4283L7866J8041N8803n3181
7554B41182l8739q6506Q10n3436j9333J09780k9909l5449P2227r1637Q0207q2103
7542F7094q5781R6239j717n4235j34306M7492n1114R3619M9583N8086J21312K8381
$$ plain form
7621 67847 16408 73612 79854 70826 131031 111774 150248 266098 165226 157729 185490 456681
7609 456681 625210 706405 811905 614430 464931 352904 352640 367722 436629 449718 465474
7598 465474 411635 170537 96751 29600 -15172 163383 217926 385462 348203 11948 -116807
7587 -116807 -218072 -169715 -13169 232463 141950 114470 124822 157486 191763 124321 152126
7576 152126 131875 176670 193410 294625 253939 284630 223025 242792 323081 368276 230283
7565 230283 297645 586710 596655 389885 317396 243936 179653 217519 235560 294363 241182
7554 241182 202443 115937 116747 63311 43978 153758 123849 88400 160627 68990 149197 67094
7542 67094 -18687 77552 75835 21600 -112706 -65214 -116328 -22709 26874 84960 206272 234653
7530B34653k9183m3322J5147l3183Q2528L5o8588j9910p9099k00178K8111K23506
7518A10517K47047J5740J05883j00056k06444r3432R0241m1714j3828J0256J7920
7507A42130J23973J9479l6948n5090O2768J35721O0238j79895r5618P2124K6010
7496B74892J8701n5996l3092k6415r1761k04935J26713K38355P7810j1024p3680
7485B39568j6135q3444j59567r3290M2598R486J45427J89732r7965k12684j00413
7474a36687J28889P5590m7662j3369P9131J22479l138K3595k00202o2539J2123
7463b1790R2117l5929O1870j75027Q8399L7479J43538P4064r1506k03258m7845
7452g7888k6804r8783J43386K05453k4328r8604o6762r7344J0401Q2381Q6998
$$ plain form
7530 234653 205470 162148 177295 144112 226640 226675 158087 138177 59078 -141100 -112989 110517
7518 110517 357564 373304 479187 379131 172687 79255 169496 127782 113954 124210 142130
7507 142130 266103 285582 248634 193544 256312 392033 452271 272376 176758 248882 274892
7496 274892 293593 237597 204505 178090 86329 -118606 8107 246462 324272 313248 239568
7485 239568 223433 139989 -19578 -112868 -70270 -60784 84643 274375 176410 -36274 -136687
7474 -136687 -7798 67792 20130 6761 85892 208371 205233 228828 28626 -33913 -21790
7463 -21790 70327 34398 96268 -78759 9640 47119 190657 264721 173215 -30043 -77888
7452 -77888 -104692 -203475 -60089 145364 121036 22432 -44330 -141674 -131273 -48892 38106
7441C8106N5430K28195j13638j40671q1612P2393L0789n4609J04083p7406j15251
7430e4191r3146O9741j9847J77721J62930n7717K981j34932n3536o771j1932m7476
7418f6175J79366O6881P102n6053r3565j28813O3316j0345j35831l4370Q9641
7407a18846J23810m3700J20945J54780r755j0165Q4903j02564k6575L669L0536
7396B07038j54687r6967n8125J20965Q0921J7177p2138n1533k0538P7113J46266
7385A95492m4130p9235l8909M2270M6091k32361p9503J65202J13068j29590m9193
7374i0798o2985j13227K20142L02201q816k13306j46479N5171p753o8992J26133
7363h709M1690j17542M1497J59973J19145n4242j10708m9034J78810O6850M253
$$ plain form
7441 38106 93536 321731 208093 67422 -14190 58203 88992 34383 138466 61060 -54191
7430 -54191 -147337 -77596 -97443 80278 243208 185491 188472 53540 4 -6767 -18699 -66175
7418 -66175 113191 180072 187174 131121 37556 -91257 -27941 -38286 -174117 -208487 -118846
7407 -118846 4964 -38736 82209 236989 227234 217069 301972 199408 172833 176502 207038
7396 207038 52351 -44616 -102741 18224 99145 116322 44184 -7349 -27887 49226 195492
7385 195492 151362 72127 33218 75488 121579 -110782 -190285 -25083 87985 -41605 -90798
7374 -90798 -153783 -267010 -46868 255333 246517 33211 -113268 -58097 -65850 -134842 -8709
7363 -8709 32981 -84561 -43064 116909 236054 181812 71104 22070 200880 267730 271983
7352B71983m1930M3541r6662j54739M8712q208J16126J59759Q5165j36397j10675
7341A76675l04089m2318j11807k0541K12192J08889P7134R7333J5877j19275j2032
7330G8038j07343k6559Q580n0741j04221j5508K0254l043J02805j354J32105J27147
7318A60160l6879j39513q4124P7950J52021N5919Q2549q968j48713K9408Q4301
7307B24111O3666r4949j48046J9535j2710J12689n0829o7671j48182K8802J14978
7296D1394J13173l1351j92519k5286j07945n8794R3135J02546Q5234K0457n7747
7285a7703J30612L4864k07344j39268M2016J69134M9190J11502j26225j08227
7275f1449J288P7497q5046j88948q1805J20447O1458o3058N2646J74962J37056
$$ plain form
7352 271983 230053 273594 176932 22193 70905 62697 178823 338582 423747 287350 176675
7341 176675 -127414 -169732 -281539 -302080 -89888 19001 96135 193468 209345 90070 78038
7330 78038 -29305 -55864 -47284 -98025 -202246 -217754 -197500 -200543 -97738 -99092 33013 160160
7318 160160 123281 -16232 -100356 -22406 129615 185534 268083 259115 110402 139810 224111
7307 224111 287777 192828 44782 64317 51607 164296 113467 45796 -102386 -73584 41394
7296 41394 154567 123216 -69303 -94589 -202534 -261328 -168193 -65647 19587 40044 -17703
7285 -17703 112909 147773 -59571 -198839 -156823 12311 61501 173003 46778 -61449
7275 -61449 -60161 17336 -67710 -256658 -338463 -218016 -156558 -219616 -166970 7992 145048
7264A45048J25018R8141n7493j49439j5249Q2609p2449k9877k05772k1626L0779
7253g0310l8213R4161p535r1673J11175k5314P3301J49189n450j18015j9043J00298
7241A52571N9519j10675n9292N2593L2713J8807K7887L5355j27602r2737J13788
7230A02927R5529n4171j21987j81666Q972J3009r4290R000J30224O8474J91131
7219A67152K59872J4493j09578J06834m5913j60370j74391l3460j28929J21689
7209A7399J29588p4312j93732R2314N7321R1757K8839Q634j3728P7755r0255l207
7197A28373N6998J4590Q286q9456j85372l5675j01159l4783P4785K21911J06547
7186A65045p8072O8018k26623j16598O2091M1695R8106K5471K4530o4890p9190
$$ plain form
7264 145048 270066 368207 310714 161275 146026 228635 156186 126309 -79463 -101089 -70310
7253 -70310 -108523 -14362 -21897 -113570 -2395 -27709 45592 194781 189331 71316 52273 152571
7241 152571 212090 101415 42123 94716 127429 146236 174123 209478 81876 -10861 102927
7230 102927 198456 144285 22298 -159368 -150396 -137387 -231677 -222677 -92453 -23979 167152
7219 167152 427024 441517 331939 438773 392860 232490 58099 24639 -104290 17399
7209 17399 146987 72675 -121057 -28743 28578 120335 149174 157808 144080 221835 131580 128373
7197 128373 185371 199961 208247 118791 -66581 -102256 -203415 -238198 -163413 58498 165045
7186 165045 86973 154991 -71632 -188230 -126139 -84444 13662 39133 63663 -1227 -80417
7175h0417M8593J1105O8354n1045j58457M8206O6154j4370j16337k5524J23361
7164h0377J12155R8668N3684Q1117j54596l4571R4586P9012k482n1775j37821
7153E7600l9249N7325K4938k0653j46093J9378l9728j26296k8496Q5661K03263
7142D7650k3428J63548J832m6089R7557k0936j63745M4914M6382P5091L3149q421
7130B47504J18279J34494k1951j7810j18774k2492j53934j87446J1309M665J86555
7119A80399m3861R777J03507r477r7877k9210p1674K65k5227R1667J49615J39757
7107C97661j31758n919K0854j46043r2074o8850J01002K1299j36391j25856p1785
7096b37860P2229m0595P0818N7027r8282P472J4092p3336n0207J46265O4998r3844
$$ plain form
7175 -80417 -31824 -20719 47635 -3410 -161867 -113661 -47507 -61877 -178214 -203738 -80377
7164 -80377 31778 130446 184130 265247 110651 76080 170666 249678 247196 195421 57600
7153 57600 18351 75676 100614 79961 -66132 -46754 -86482 -212778 -241274 -155613 47650
7142 47650 24222 187770 189602 143513 241070 220134 56389 101303 147685 222776 255925 247504
7130 247504 365783 500277 478326 460516 341742 319250 165316 -22130 -10821 -6156 180399
7119 180399 136538 146315 249822 240345 142468 113258 41584 41849 16622 108289 257904 397661
7107 397661 265903 259984 280838 134795 42721 -26129 74873 96172 -40219 -166075 -237860
7096 -237860 -165631 -206226 -135408 -78381 -176663 -169191 -155099 -228435 -278642 -132377 -67379 -161223
7084a61223L2821J32978J98286J06547J37985l9778p4720j34111j38570k49416
7074a89201L9993K35012K26312J96630l5664k70622L1192j16695j54575j10694
7064a48312Q7507k6537K908K4876J10742r7505J72912m8809j21408n3231J54340
7053E7483R546k6973L1164m4276J76309Q2766K4267p1879j533j6603o0623k08349
7041d8701M1890J59752j31484J5094p8250o0549q6206q7226o1045R1175J11084
7030a34466J7867L0454p1893q4954J01022K22931Q7209q6128J5227p7975p1263
7019e1969M8661j95M5024P7383J32723J2897j09794L6413R8396j38918j00524
7008E0097N376r9894j39431J02323K7937L9225O2246J50174M7917J00169n5335
$$ plain form
7084 -161223 -128402 4576 202862 309409 447394 407616 332896 198785 60215 -189201
7074 -189201 -149208 85804 312116 508746 473082 202460 233652 116957 -37618 -148312
7064 -148312 -60805 -87342 -84434 -59558 51184 -46321 126591 77782 -43626 -96857 57483
7053 57483 67029 40056 71220 26944 203253 286019 310286 238407 236874 220271 159648 -48701
7041 -48701 -6811 152941 21457 36551 -41699 -102248 -188454 -275680 -336725 -245550 -134466
7030 -134466 -116599 -86145 -158038 -242992 -141970 80961 168170 82042 97269 19294 -51969
7019 -51969 -3308 -3503 41521 118904 251627 264524 154730 191143 289539 150621 50097
7008 50097 55473 -44421 -183852 -81529 -53592 -14367 47879 198053 245970 346139 290804
6997B90804j89495o7810Q483l3615M3073P230j65887j19004N310K42591p8456
6986e6776k24378J57961q4430o7108J73937L3518j99O5621p1273n4469Q9677J1318
6974b6601L4422j1269J71055J22179j29350j44198j613m1505p375j16812n7265
6963b08332M7368N9728J28152K3061k5278j87092m4674J40167N9592N9494K5127
6952G7313J04230n829r2421j73965j02902j21144K09290J3780j18650K5748J08188
6941g6362J77172Q0179N8046j37455k30219k0460K32791Q6377r0163p55J75543
6930B54694k3595K866n8820j36871K26978O0622p1060r6912j61032M2095K08619
6919B47584M648L7137P702j97451j08064J53624J14813q0405j87463L3859j47602
$$ plain form
6997 290804 101309 33499 41982 8367 51440 58670 -107217 -226221 -220911 21680 -56776
6986 -56776 -281154 -123193 -207623 -274731 -100794 -67276 -67475 -1854 -73127 -127596 -37919 -26601
6974 -26601 7821 -3448 167607 289786 160436 16238 14625 -26880 -34255 -151067 -208332
6963 -208332 -160964 -101236 26916 49977 24699 -162393 -207067 -66900 -7308 52186 77313
6952 77313 181543 175714 83293 -90672 -193574 -314718 -105428 -91648 -210298 -184550 -76362
6941 -76362 100810 180989 239035 101580 -128639 -149099 83692 170069 79906 79151 254694
6930 254694 231099 233965 175145 38274 265252 325874 254814 157902 -3130 38965 247584
6919 247584 252232 289369 297071 99620 -8444 145180 259993 179588 -7875 25984 -121618
6908a21618j04547J16298N8987J2895N499q2170n2724n5850M6729J01605q4671
6897a59567m0243K65395K6228j49904k9954j10574J15055R2888j6937l7113k8519
6886g3245J0692L6489Q5532q8593l3992j17822k6188O1501N8243N5660k4288r9209
6874a55220l8580o4920N6290J8162m7806k4969O6963J77394K10380j17311r7242
6863a6859r915M5755L8704k8331j56735L7116o4808j82587o6497K00428K23521
6852A9792J48183q2021p3641J64896K3925k87698p3532K45905J46450l4996j961
6841A95302P8431J9026j15877k2273r6467j03649j23101k2343K7371K1375M5570
6830i6635M8625L3350p432p2663k5616N8048O7047m1849m9097O7639J228m769
$$ plain form
6908 -121618 -226165 -109867 -50880 -37985 -32486 -114656 -167380 -223230 -176501 -74896 -159567
6897 -159567 -199810 65585 91813 -58091 -88045 -198619 -83564 9324 -7613 -44726 -73245
6886 -73245 -62553 -26064 59468 -29125 -63117 -180939 -207127 -145626 -87383 -31723 -56011 -155220
6874 -155220 -193800 -258720 -202430 -184268 -232074 -257043 -190080 -12686 197694 80383 -16859
6863 -16859 -26774 18981 57685 29354 -127381 -90265 -155073 -337660 -404157 -203729 19792
6852 19792 167975 85954 12313 177209 201134 -86564 -160096 85809 232259 197263 195302
6841 195302 273733 292759 176882 154609 58142 -45507 -168608 -190951 -163580 -142205 -96635
6830 -96635 -48010 -14660 -22092 -94755 -120371 -62323 4724 -37125 -86222 -18583 -17355 -22124
6818b2124j14965j16794j9154M0224o0239j70430P3732J11264J50872N179N7406
6807f5029P1682j25120l9676j7412Q6794J64933J75295j50780p1716J7444J20218
6796A66633J04494j32676n4064R4927j70197k34614J25463J53995J19793j1814
6786A61940j43340L7172O0441O2647J16450j37513r4122o1335p2506j36488j94148
6775d00802L7968K81926P906L9577J79998J0307n7139p084j04190N9612J23433
6764A71512J16522o9016K1787k3694o7385J08204j47423r0163J06940k78994j71802
6753c23512J73549j1577K6796q2355J09356J83368K9251k05466k3833j89O8501
6742e6111j04196J668K40118j18625j59990n412N3652J57407j8148q8541K600
$$ plain form
6818 -22124 -137089 -253883 -273037 -232813 -293052 -463482 -389750 -278486 -127614 -122435 -65029
6807 -65029 6653 -118467 -158143 -175555 -88761 76172 251467 100687 28971 46415 166633
6796 166633 271127 138451 84387 179314 9117 -225497 -100034 53961 173754 161940
6786 161940 18600 55772 116213 178860 295310 157797 63675 2340 -70166 -206654 -400802
6775 -400802 -362834 -80908 -73002 -33425 146573 156880 99741 92657 -11533 48079 171512
6764 171512 288034 219018 240805 217111 149726 257930 110507 20344 127284 -151710 -323512
6753 -323512 -149963 -161540 -134744 -217099 -107743 75625 104876 -100590 -124423 -124612 -56111
6742 -56111 -160307 -158639 81479 -37146 -197136 -202548 -148896 8511 -9637 -98178 -95578
6731i5578N457J11177M955j1890J7718N3984q9016L4410M6678P7619Q3142P0532
6719C09188R163J44029P2961o7441n4204k5984j9767O1680m9461J46838j12408
6708D14594m2700j63697m9406J1888Q9683r5174j29636K7416q3347l0212O1789
6697A1198P9485J92769o741j98870j24509k9057K9014Q5426M2294k2182p1591
6686a2764Q4087R9283M0935p3724R666M8762N3773K2334J26968j40614Q707o7773
6674A99640j82827N5603n4089n7030j17416o0419L9888K5887r7572J63043K12822
6663A27530J43340m7346k44208j3443O4543P3799j52206j45418O7678R6721J7545
6652a1465K52181Q95k76032q7744j2223m5916R4984O733o9716J15679K15461O3168
$$ plain form
6731 -95578 -90121 21056 26011 14121 31839 85823 -3193 31217 77895 155514 238656 309188
6719 309188 318351 462380 535341 467900 413696 387712 367945 429625 380164 527002 414594
6708 414594 371894 208197 158791 170679 260362 165188 35552 62968 -20379 -50591 11198
6697 11198 90683 283452 276711 77841 -46668 -75725 -46711 38715 81009 58827 -12764
6686 -12764 71323 170606 211541 137817 147483 196245 250018 272352 399320 258706 267413 199640
6674 199640 16813 72416 18327 -38703 -156119 -216538 -176650 -150763 -248335 -85292 127530
6663 127530 270870 223524 -20684 -34127 30416 104215 -47991 -193409 -125731 -29010 -11465
6652 -11465 240716 241611 -34421 -122165 -134388 -180304 -85320 -78587 -148303 -32624 182837 246005
6640B46005j43047n0874l612j16043j08578P0802J65094P020j3519j51453Q4131
6629a4074J9152K2448J64874k17160k94075J23730J95597Q6071j06659k90907
6619c11003O5883N9484J292K4347J48818J03230K6231j47022m6560K4904p3733
6608a24129M4429R84M1108j15218j5216r9472n3036K8132K44952J26529O7336
6597A46399q7638J9211l5275o1939k20398j00873p3429K00032R5351J18410q4395
6586h4544j83661p6103J58746J59819J21105n6076j51727M5965J61501n4456J06917
6575A47486k06827o7974Q0737J55928J46053P2653o3428m9469k05466q826p7658
6564g6791k8861J10348P8512P5267J04206k411m2711k06321K6284j8416L167O5198
$$ plain form
6640 246005 102958 52084 48472 -67571 -176149 -105347 59747 66767 53248 -98205 -14074
6629 -14074 5078 27526 192400 -24760 -318835 -195105 492 86563 -20096 -311003
6619 -311003 -245120 -185636 -184344 -159997 -11179 92051 118282 -28740 -75300 -50396 -124129
6608 -124129 -79700 -78716 -37608 -152826 -168042 -267514 -320550 -292418 -47466 79063 146399
6597 146399 58761 77972 42697 -19242 -239640 -340513 -413942 -213910 -118559 -149 -84544
6586 -84544 -268205 -344308 -185562 -25743 95362 39286 -112441 -66476 95025 40569 147486
6575 147486 -59341 -127315 -46578 109350 255403 328056 264628 215159 9693 867 -76791
6564 -76791 -105652 4696 83208 158475 262681 260270 217559 11238 37522 19106 22273 87471
6552H7471Q2118k1810R5127j48363j70601N3467L7302o0349m9756M2439K1153
6541c1802p2858q9477o6747O6376p6604k3663L0726r5510R1133J16536L8947k9683
6529a42626j03658J3309P0324J45082P2457p5119k8121N6300R8865J77318o8453
6518B15678o5809N8137r624j05880j43449J45985k9523l05751j3618n8225R3099
6507b18980J73585N1958L0043N9944K0629j62375K1799P9613L6681O8396j67998
6496f705L0496O9511L3559m2881r1676K2437l3890j12488m0967m379j9247J4407
6484a81823O7146J90344P947j14632r6709p1938J26251l2231r881N6343R5109
6473C5926O5646o9889n6552j1590k47478J18808R8063J34785j19555J2807J9884
$$ plain form
6552 87471 169589 147779 242906 94543 -76058 -22591 14711 -45638 -95394 -52955 -31802
6541 -31802 -104660 -194137 -260884 -194508 -271112 -294775 -264049 -359559 -268426 -151890 -112943 -142626
6529 -142626 -246284 -232975 -162651 -17569 54888 -20231 -48352 7948 106813 284131 215678
6518 215678 149869 208006 198382 92502 -50947 95038 65515 -240236 -253854 -312079 -218980
6507 -218980 -45395 6563 36606 96550 117179 -45196 -23397 56216 92897 161293 -6705
6496 -6705 23791 93302 126861 83980 -7696 14741 -19149 -131637 -172604 -176983 -196230 -181823
6484 -181823 -114677 75667 83614 -31018 -127727 -199665 -73414 -105645 -115526 -59183 35926
6473 35926 101572 31683 -24869 -36459 -283937 -165129 -67066 67719 -51836 -39029 -19145
6462a9145j50912j10403J33800K37635l0016j66923o900O6678J80858Q2708r0754
6451A26626J2013k11600j17460m1100P3447n8650r6300J37650J44907l8236l6672
6440a05375k0259O7584P7814R6934j26707j30355j72065O2516p7767N4882O375
6429b66423p125J32674M9633j84077n2951m4938L30279J29617l1314l9909m4028
6418b8562k6289J34533K0209l12944o4262N2357K01890j4329L950M2553L9462
6407D8568J07661k7178j18205n4669P7298J419J9632j30112O4640J17874N1414
6396A58342j17605L3048L4610R0983q8950l075r3063j16569L7739J08711J02597
6385A46768j39205j11712J28301J9506j5118K08742l4509L6670j44305p9770J59712
$$ plain form
6462 -19145 -170057 -280460 -146660 90975 60959 -105964 -112864 -46186 134672 217380 126626
6451 126626 138639 -72961 -190421 -231521 -158074 -216724 -313024 -175374 -30467 -68703 -105375
6440 -105375 -125634 -58050 19764 116698 -10009 -140364 -312429 -249913 -327680 -272798 -266423
6429 -266423 -273548 -140874 -91241 -275318 -328269 -373207 -42928 86689 55375 15466 -28562
6418 -28562 -54851 79682 99891 -213053 -277315 -224958 -23068 -37397 -33447 9106 48568
6407 48568 156229 129051 10846 -43823 33475 34894 54526 -75586 -10946 106928 158342
6396 158342 40737 73785 108395 199378 110428 107353 14290 -102279 -64540 44171 146768
6385 146768 7563 -104149 24152 43658 28540 237282 202773 239443 95138 15368 175080
6374A75080K11081M0968k11194j92546K6446K0000k5837j36520J8377J74824L5942
6363A36621r3689j5618k6123L6494P938o2666J33252J59616j08542k0468J09945
6352B56760j19855o8087r371N2314j8860j55573k16472R8886N0481J3780j08j36663
6340b52768j16546L3428M5587K1459k0969M4593K14113J30867j82784M1096J50546
6329A08622K5824j18801k32540k917Q6358k9810p1128j50518R4992J00207J64445
6318b5266q2235q8794o3964n2241J71950J01900L4402R3470J90368M6908m4470
6307B82028k24390j50164R086n1733j4787J19699R9399p1205r8967l4495K10580
6296G5051J96094k0390p5946k16026k91855Q337K95139M3102K13139K81135l1277
$$ plain form
6374 175080 386161 427129 215935 23389 49835 69835 43998 -92522 -74145 100679 136621
6363 136621 42932 27314 1191 37685 45623 -17043 116209 275825 167283 146815 256760
6352 256760 136905 68818 59447 111761 92901 -62672 -279144 -180258 -129777 -115997 -116105 -252768
6340 -252768 -369314 -335886 -290299 -268840 -289809 -245216 -31103 99764 -83020 -41924 108622
6329 108622 134446 15645 -216895 -219812 -133454 -163264 -234392 -384910 -289918 -189711 -25266
6318 -25266 -107501 -196295 -260259 -312500 -140550 -38650 -4248 89222 279590 326498 282028
6307 282028 57638 -92526 -83440 -135173 -149960 -30261 69138 -2067 -101034 -135529 75051
6296 75051 271145 250755 174809 -41217 -333072 -324735 -29596 13506 226645 507780 476503
6285D76503j82606k07313j91917q1429k8437P6194J39411J39528J44662M7707
6275C32303j09436P6844l4387o3300k97272j07692j09544P3064n8374M0891k2941
6264b79844Q8957O9010P5365K0943p106n9564o7686N5724J36515M0412J39789
6253B12515j64944k98536j68893l672K96880K5142m0749M0840r5854k17318m7345
6242d61934J14993J36146M7349O750M616o0055J29542J04143Q4555l4396m6165
6231B5544J56928J3839K9093j57628j06504o2550Q8158n6749n3331K12348Q6270
6220A75418r1360n3954m426j07851j96637K51877m379J458J12160J56336J14768
6209C53410j4246j41455k38007k01214P6559L16715J95576n60j24980k62932j46720
$$ plain form
6285 476503 293897 86584 -105333 -186762 -215199 -139005 406 139934 284596 332303
6275 332303 222867 299711 265324 202024 -95248 -202940 -312484 -239420 -297794 -256903 -279844
6264 -279844 -190887 -121877 -46512 -25569 -32675 -92239 -159925 -104201 32314 72726 212515
6253 212515 47571 -250965 -419858 -423530 -126650 -101508 -142257 -101417 -197271 -414589 -461934
6242 -461934 -346941 -210795 -163446 -156696 -152080 -212135 -82593 21550 106105 71709 25544
6231 25544 182472 196311 225404 67776 -38728 -101278 -13120 -69869 -123200 89148 175418
6220 175418 84058 30104 25678 -82173 -278810 -26933 -31312 -29854 82306 238642 353410
6209 353410 339164 197709 -40298 -241512 -164953 151762 347338 346778 221798 -41134 -187854
6198a87854Q0207n8835r0404K28108J0238O5648J02581j00328J2890J9115j1206
6187G0160m7526r9622Q5954L51052O3106j02176p6110k05160j87242J02789o2567
6176a07342l7860j115O6069Q4320M079O280j01391j62455j61031j18657P7999
6165d51104J314O9789J93965M1020k2512K5468R4902J7082k5424p0012j50120
6154b75632P99L0564R8366Q4825n1220l2360j5058Q1356K1600Q8054K1753O2475
6142A15522o6867j82890p6028j2980k316j0516J09053J79358Q8261m0805J06620
6131B06412q3955j137R5270M8412j10240o739M0656n114J62210j14013j57135
6120G4627q2001N0167L7285k00110Q0153N1598Q2132N7544M093J00379r7155m4071
$$ plain form
6198 -187854 -107647 -166482 -256886 -28778 -18540 47108 149689 49361 62251 81366 70160
6187 70160 22634 -76988 8966 360018 423124 320948 244838 39678 -147564 -44775 -107342
6176 -107342 -145202 -146317 -80248 4072 8151 14431 -86960 -249415 -410446 -529103 -451104
6165 -451104 -449790 -380001 -186036 -145016 -167528 -142060 -47158 -30076 -55500 -125512 -275632
6154 -275632 -274833 -244269 -145903 -61078 -112298 -144658 -159716 -78360 -56760 31294 53047 115522
6142 115522 48655 -134235 -210263 -223243 -225559 -236075 -127022 52336 140597 99792 206412
6131 206412 122457 121320 216590 265002 154762 148023 188679 183565 345775 231762 74627
6120 74627 -7374 42793 80078 -120032 -39879 11719 93851 151395 155488 255867 158712 114641
6108A14641N4614Q838K4468j37779J69455N4110p0031p4993m3030r6478l6971
6097c3156n5343R010L7868J1396M9033p8330O3799j05625k855K0524K8811j18013
6085a72881N8685K43958Q9426k22802k68740j0222J45567R070J60954J4453j37154
6074h9686M7093J78320M6639o8735j44783m3866J17236J08600j90438m8848P9428
6063i040M3428Q1239P7007k862l6531j60920k23740m6513M6033Q7686P3956j8589
6051h8846K17101j28140j63436J56550N5681j45324j20753j11249j3575k5710
6041c67701K63259R3792O8736j65308j7335P4808k1832q8597p4865J74378n936
6030f6601K4880N8386j61636O7625L3766q4422M4132l2357J58519N6753j10586
$$ plain form
6108 114641 169255 178093 202561 64782 234237 288347 218316 143323 100293 3815 -33156
6097 -33156 -88499 -79489 -41621 -30225 18808 -59522 4277 -101348 -104203 -83679 -54868 -172881
6085 -172881 -114196 129762 219188 -3614 -272354 -282576 -137009 -127939 33015 47468 -89686
6074 -89686 -42593 135727 182366 113631 -31152 -75018 42218 150818 -39620 -88468 -9040
6063 -9040 34388 115627 192634 189772 153241 -7679 -231419 -277932 -231899 -144213 -70257 -88846
6051 -88846 128255 115 -163321 -6771 48910 -96414 -217167 -328416 -341991 -367701
6041 -367701 -104442 -10650 58086 -107222 -124557 -49749 -71581 -160178 -235043 -60665 -66601
6030 -66601 -41721 16665 -144971 -77346 -43580 -128002 -83870 -116227 42292 99045 -11541
6019a1541p1364q1069k08091M0462J64850O0733k3302o8435j4781o2364n5560
6008c30462J23644K02324P4078p5411L8775K4421J02184O7637J2726j87977q6557
5997c4618l319j01171Q9632p9485J20118K26531j12349J9677j7154M8798P291
5986A63951m7322k2166j3246N497K9780K2495j8890N5487J34711o3180j0915j94906
5974D1296N2787l0771J30073L2216j87641n0650j03290n5737J09632J93881n2753
5963G9043J2521m4249j99305n4012R535n5378m5800M0495K4153J1238l5217O8760
5951a88216n6074p6308K33891k8503J7948J32110K16208J3574q8250K1685p2261
5940A25804r7263j31738k24834N279J41832N2018K7742J9818k2118J55579J79317
$$ plain form
6019 -11541 -82905 -163974 -372065 -331603 -166753 -106020 -129322 -197757 -212538 -274902 -330462
6008 -330462 -206818 -4494 69584 -5827 32948 57369 159553 227190 239916 51939 -34618
5997 -34618 -37937 -139108 -49476 -128961 -8843 217688 105339 125016 107862 156660 163951
5986 163951 116629 94463 81217 86714 116494 138989 120099 175586 310297 247117 236202 41296
5974 41296 94083 63312 193385 225601 37960 -12690 -115980 -171717 -62085 131796 79043
5963 79043 91564 47315 -151990 -206002 -196467 -251845 -297645 -257150 -232997 -221759 -256976 -188216
5951 -188216 -244290 -320598 -86707 -115210 -97262 34848 251056 264630 176380 198065 125804
5940 125804 28541 -103197 -328031 -322752 -180920 -128902 -101160 -81342 -103460 52119 231436
5929B31436J183k00692j11955J0498J4013K995K44790P7297k93248j56361J55306
5918b4738J37146N4671j11035K0840Q06R3641J20739j74007k13327n7391j82089
5907c34744n6863R1100j16480M3745J72303O6540J09085O7900J05192k50063k62531
5896c64816K7696M5235k6256J20282Q2556J67378l8357j09133J38990k7514r4073
5885g8012m894N0897p4811j21580j1400O3406J24425j08364k6849K03516J60699
5874A77033K4198J9062M733k49689j31861o3953q1895N7277N8376j37667m9087
5863c73473n8036Q9473J55889J24721l4771k2138J56090J03309k1305m563j91824
5852g6628p261J6896K43545K176R2531j63150j61553r9828J4709J68061l5623
$$ plain form
5929 231436 232619 31927 -80028 -69530 -55517 -52522 192268 269565 -23683 -180044 -24738
5918 -24738 112408 167079 56044 76884 77690 171331 292070 118063 -95264 -152655 -334744
5907 -334744 -391607 -300507 -416987 -373242 -200939 -134399 -25314 42586 147778 -102285 -364816
5896 -364816 -337120 -291885 -318141 -197859 -115303 52075 13718 -95415 43575 16061 -78012
5885 -78012 -82906 -32009 -106820 -228400 -239800 -176394 -51969 -160333 -187182 16334 177033
5874 177033 201231 220293 225026 -24663 -156524 -220477 -302372 -245095 -186719 -324386 -373473
5863 -373473 -431509 -342036 -186147 -61426 -96197 -118335 37755 141064 119759 115196 -76628
5852 -76628 -83889 -66993 176552 178728 271259 108109 -53444 -153272 -138563 29498 -6125
5841f125j47132r5793L7311l4794O4108J43696J55147q0474j71968k20998J39324
5830b17698K28080K1245M1507L3548j69598j52023Q9582J31623J43292j76484
5820b6926q6025n8748J6804N9749O8120q8053r7710j9042L2810M429M0791R6247
5808e7554J83203p225J29947m1038k0980j46828r2270M8132j47630K999L8540
5797a10704M0375K3508n8139J39669J48195n4050k20384q5433j17215j30238R4739
5786c29677Q4899O1368o5511J30904j2563P3561P3135l7411l021n4744J9600O1321
5774A861m1860o4269K0612m7061O2649M4093N5429P7008q9386k8437o1273j23056
5762a93690j77539N3551K29167O5900l7864j30176m214J05789P1329J1843m6412
$$ plain form
5841 -6125 -153257 -249050 -211739 -246533 -182425 -38729 116418 35944 -136024 -357022 -217698
5830 -217698 10382 31627 73134 106682 -62916 -214939 -125357 6266 149558 -26926
5820 -26926 -112951 -171699 -154895 -95146 -27026 -115079 -212789 -231831 -199021 -194592 -153801 -57554
5808 -57554 125649 118424 248371 207333 186353 39525 -52745 -4613 -152243 -149244 -110704
5797 -110704 -70329 -46821 -104960 34709 182904 128854 -91530 -176963 -294178 -424416 -329677
5786 -329677 -244778 -183410 -248921 -118017 -130580 -57019 16116 -21295 -24316 -79060 -59460 1861
5774 1861 -39999 -104268 -83656 -130717 -68068 -23975 31454 108462 19076 -9361 -70634 -193690
5762 -193690 -371229 -317678 -88511 -22611 -60475 -190651 -194865 -89076 -17747 -5904 -52316
5751e2316N3075j4832L0984J0559j09645k38370o4104K7160L7591J20472J96222
5740c204N1331l3572J09655j27500M1498P7319j9161p3286n1440r859j08357k43944
5728c90520K6872R4455J40078Q4216Q56k0611n1322Q7878J82950m9876M1583O8606
5716B15165p4359O7711R3717o1263r8314k02196j77618n196Q3001J19522Q5001
5705D5171M3752m0301l6541R666M7416j294K9630J91833j13102M6125P0079J864
5693B94298j23066j2428j3660j64215o0830l6602O1493J86922L7295n1816k7061
5682I0330m1925m5733J23600M446j58798j21083J3782L6416K8217M5048j47180
5671a72880j64892J55414k6686j0411J63471R9065n8232p986Q7159m5783r2511
$$ plain form
5751 -52316 759 -14073 16911 27470 -82175 -320545 -384649 -357489 -319898 -199426 -3204
5740 -3204 48127 14555 124210 -3290 38208 115527 96366 23080 -28360 -38219 -146576 -390520
5728 -390520 -363648 -269193 -129115 -44899 -44043 -64654 -115976 -28098 154852 104976 146559 215165
5716 215165 140806 208517 302234 240971 142657 -59539 -237157 -242353 -159352 -39830 45171
5705 45171 88923 48622 12081 21747 69163 67869 97499 289332 176230 222355 292434 294298
5693 294298 171232 158804 145144 -19071 -79901 -116503 -55010 131912 169207 117391 90330
5682 90330 48405 2672 126272 130718 -28080 -149163 -135381 -98965 -70748 -25700 -172880
5671 -172880 -337772 -182358 -209044 -219455 -55984 43081 -15151 -23137 64022 18239 -74272
5660g4272J0226m5829J33454J10819k2203j38444j50121k7892l6310J28603M0582
5649g1387M9747K17558J03548p8448k04406L1834Q5118J0186L4154j02943J00540
5638A75501L7563j63144J3533k34821l6401k129j55065L5784J07479N452L5075
5627a81173J53436J29414o57j11202O5250q4845o8636l0515k3537L975Q8091n0542
5615a10941Q1255L0532M7756L3714k26139r8269J25608J89438R1818j05957J18345
5604A77160J38087Q917o9485j23321J3251J03439m1249j39257q0600j1880R6802
5593G1864J84887p4813k37684j37217K3000J16686j2560j52395J2835J58457R6149
5582D9209p2441k14876r2029N8606J07815O1279R0902N7096P5701Q3635J08938
$$ plain form
5660 -74272 -64046 -109875 23579 134398 112195 -26249 -176370 -204262 -240572 -111969 -71387
5649 -71387 -21640 195918 299466 221018 16612 48446 133564 143750 177904 74961 175501
5638 175501 213064 49920 63453 -171368 -207769 -209898 -364963 -329179 -221700 -216248 -181173
5627 -181173 -27737 101677 101020 -10182 55068 -29777 -98413 -128928 -152465 -148490 -60399 -110941
5615 -110941 -29686 846 48602 82316 -143823 -242092 -116484 72954 164772 58815 177160
5604 177160 315247 324164 254679 131358 144609 248048 206799 67542 -13058 -24938 71864
5593 71864 256751 181938 -55746 -192963 -169963 -53277 -65837 -218232 -205397 -46940 49209
5582 49209 -23232 -238108 -330137 -271531 -163716 -102437 -11535 45561 121262 204897 313835
5571C13835k51309j57278l2405K204p5059o6764O720J65590J57003M0982o0289
5560D3230M1492j37625j02798r380J5904Q535K5844K3749M9228n9535l5362m5575
5548a82293k383K4439m0104o9477M6564J57943L1145M9559J2881j32801j5049
5537a19576l3840K67735P5393j39637j1028O3849m9986q5949O295m3300k4837
5526i4881J6172J25960K0899R799J60781J0183o3004j32589K2295J25870P3107
5515B74592n7942k5258j60271k5341p0321M6338k21316p6767Q9148K17648J58392
5504A48902j057O7555O5433j90149j71754p8333m7599j24143J55246P9613o298
5493a02584O8353R0150p9326M0856q4053j33181J33810m1241j2639O1638j17865
$$ plain form
5571 313835 62526 -94752 -127157 -124953 -200012 -266776 -260056 -94466 62537 103519 43230
5560 43230 84722 -52903 -155701 -165081 -149177 -140642 -114798 -91049 -41821 -101356 -136718 -182293
5548 -182293 -184676 -160237 -200341 -269818 -223254 -65311 -34166 15393 28274 -104527 -119576
5537 -119576 -153416 114319 189712 50075 39047 102896 52910 -33039 -26744 -70044 -94881
5526 -94881 -78709 47251 68150 77949 238730 248913 185909 53320 75615 201485 274592
5515 274592 216650 191392 31121 5780 -64541 -18203 -239519 -316286 -227138 -9490 148902
5504 148902 147845 215400 280833 90684 -81070 -159403 -207002 -331145 -175899 -96286 -102584
5493 -102584 -34231 55919 -23407 17449 -66604 -199785 -65975 -107216 -119855 -58217 -176082
5482a76082Q6092M4821r5080l1542R8446j00303q7488J12540J13939O9368m7530
5471a2819k6398k01274j60560k07296K90445M02535P0922k13895j17344j23513
5461b99197J94295J56238l1226l5866K6677N0606j05366M7453K22428J57446K7984
5450D11472o003j18077k40724r0929m0957j94890r4229j7875j00595J6505K22630
5439b53672L7827j56310j5710K47157J07551l2480k28694L8097P4222J1589J67743
5428b680J8823M9388k09132N2553J96205J36853l8694M3930M4167l482j87596
5417A00335k6297N8292j7369q3705Q0501J0328O4163j35371j92620j36350Q9143
5406a88950K08500J9765k13622j28915O02o5987J27976J17039J0941j0756N5179
$$ plain form
5482 -176082 -89990 -45169 -140249 -171791 -73345 -173648 -261136 -148596 -34657 34711 -12819
5471 -12819 -39217 -240491 -401051 -608347 -317902 84633 155555 -58340 -175684 -299197
5461 -299197 -104902 51336 20110 -15756 10921 61527 -43839 3614 226042 383488 411472
5450 411472 405469 287392 46668 -44261 -85218 -280108 -374337 -392212 -492807 -476302 -253672
5439 -253672 -215845 -372155 -387865 -140708 -33157 -65637 -294331 -256234 -182012 -170423 -2680
5428 -2680 16143 65531 -143601 -91048 105157 242010 203316 247246 291413 287931 100335
5417 100335 74038 132330 114961 31256 111757 122085 186248 50877 -141743 -278093 -188950
5406 -188950 19550 39315 -174307 -303222 -302620 -368607 -240631 -123592 -112651 -123407 -68228
5395f8228J14356j14793j13589o6478K7141J23463O3578n525m3352J68457J04140
5384A89170r4073L0724R58j11909m3217k6980j6620j19055n3881k6472N887K6899
5372b38569n0813k5665Q5702J64852P1163Q1350Q1150j19743j91971P3747l7798
5361a06595o6221M6696J79281J8416j55934j11206L7401m5549J40160J18553R1117
5350A46119Q7258p9983p1198J27436N0333j34930j03035M4212N4973k1137J71234
5339B71282n9737p4586j60656j01604j35708J13231p028J38114O0330J90448J26571
5328C60657j36265j21360O4188J22776k8329Q5347j51395k17444p3604j75210
5318b70639m8650J77700J35505J12727Q2322m1825q3713j25853p4202j785J8679
$$ plain form
5395 -68228 46128 -68665 -182254 -248732 -221591 -98128 -34550 -40075 -83427 85030 189170
5384 189170 95097 125821 126779 14870 -28347 -55327 -71947 -191002 -244883 -271355 -265468 -238569
5372 -238569 -289382 -315047 -229345 -64493 6670 88020 169170 49427 -142544 -68797 -106595
5361 -106595 -172816 -126120 53161 71577 -84357 -195563 -158162 -203711 -63551 55002 146119
5350 146119 233377 153394 82196 209632 259965 125035 22000 66212 121185 100048 271282
5339 271282 211545 136959 -23697 -125301 -261009 -147778 -154806 -16692 43638 234086 360657
5328 360657 224392 103032 167220 289996 261667 347014 195619 -21825 -95429 -270639
5318 -270639 -319289 -141589 -6084 106643 188965 147140 63427 -62426 -136628 -138413 -119734
5307a19734J2686l5814o2903o3697J22384Q3813l376L7765P8937r3417J11299
5296F7943J61908j39234j52291p4706K6515k1574O7114R8417j4617k2108j0762
5285a3395j14426p3883r2042K01486P7718k20802l1596J63810m5536j91313j71416
5274e11395K34663J27894R8572k5500k20625q2948R816O2405J08796p7499Q0706
5263a95115L7560K45208N0747j10561j16640m0726l1974P8774Q5548j1514j04167
5252a12860R46J51529Q0637J875J03596o1266j71462k05144l252K9231O7241p5788
5240a94717j30318J40341J04531Q0824K48j79881P6284J38813P0887m3581j00483
5229c7052j55669J49381K30654l5421k09785q6545O3818K8495J16465n9Q9660
$$ plain form
5307 -119734 -107048 -142862 -205765 -269462 -147078 -63265 -66641 -28876 50061 -43356 67943
5296 67943 229851 90617 -61674 -136380 -109865 -131439 -64325 34092 19475 -2633 -13395
5285 -13395 -127821 -201704 -293746 -92260 -14542 -235344 -266940 -103130 -148666 -339979 -511395
5274 -511395 -276732 -148838 -50266 -75766 -296391 -379339 -369523 -307118 -198322 -275821 -195115
5263 -195115 -157555 87653 138400 27839 -88801 -129527 -161501 -82727 2821 -8693 -112860
5252 -112860 -111914 39615 120252 122127 225723 164457 -7005 -212149 -215401 -186170 -118929 -194717
5240 -194717 -325035 -184694 -80163 661 909 -178972 -102688 36125 107012 63431 -37052
5229 -37052 -192721 -43340 187314 151893 -57892 -144437 -80619 -52124 64341 64282 153942
5218A53942J7553J752n5164j57650j05189J35927L2567l948q7601j01845O8936
5207a00720r617J28056M7433L1771N6917O6848k70012K9633M4693L2177q3761
5196b6582M0229p4536j63532J05476M7588J21853r540O9885K1415O0216r0564
5185A01908j97980n2730K1571K3227L0736P2053r1709J05069J4659o6403L1443
5174h156j5213M768n4026J11961Q6250p4270K2296m6072L9679P1231l5858R6728
5162A99318J4821K8793j41988k03092j2526N3069J11971O5845L7786j04830O6360
5151A15527K9585j1148o0258j64713m1331j8420m1083m7760p273L0114Q0038Q0894
5139e5828J10283L1861n682j65695j33653O5230P6469n6870j6107J18262q3212
$$ plain form
5218 153942 171495 173247 118083 -39567 -144756 -8829 23738 19790 -67811 -169656 -100720
5207 -100720 -110337 17719 65152 96923 153840 220688 -49324 -19691 25002 57179 -26582
5196 -26582 13647 -60889 -224421 -118945 -71357 50496 40956 110841 132256 192472 101908
5185 101908 -96072 -148802 -127231 -104004 -73268 -1215 -92924 12145 26804 -39599 -8156
5174 -8156 -23369 -18601 -72627 39334 125584 51314 73610 27538 67217 138448 102590 199318
5162 199318 214139 242932 100944 -102148 -114674 -61605 50366 116211 153997 49167 115527
5151 115527 145112 133964 73706 -91007 -132338 -150758 -191841 -239601 -246874 -216760 -136722 -55828
5139 -55828 54455 86316 80634 -85061 -218714 -153484 -77015 -133885 -149992 -31730 -114942
5128a14942M5632J3473J07989J04805L202j72174n5549k4980K4125M1611J18962
5117I2154M2437J79343k00545k90157k30626K9455j1331j41147J20174J98968
5107b11275J30456N9906L3888k2378m8105j19654o9470J9505J75969J9612r2551
5096a24097r6741j51K16028Q9496J5806j83921J8559J32324P2880k5884p9169
5085C5130J8385m7117n7960k4909J08510P7426L8539m461K8316O3427P2020o7537
5073B39769j36563p9032k53574l2700J26470N0273j7703k189j1709k8575l6647
5062a82180O360j70405N9804P2117R0873n5875J47133J19185J1279k26928j15813
5051b44450K03333o7897k1818o5449o5236Q8496J69104R4591j03228l9720N4915
$$ plain form
5128 -114942 -69310 -55837 52152 156957 160159 -12015 -67564 -92544 -68419 -26808 92154
5117 92154 134591 313934 113389 -176768 -407394 -377939 -389270 -530417 -410243 -211275
5107 -211275 -80819 -20913 12975 -9403 -57508 -177162 -246632 -227127 -51158 -31546 -124097
5096 -124097 -220838 -220989 -4961 84535 100341 -83580 -65021 67303 140183 114299 35130
5085 35130 53515 6398 -51562 -76471 32039 109465 148004 143543 171859 235286 307306 239769
5073 239769 103206 24174 -229400 -262100 -135630 -85357 -103060 -105249 -116958 -145533 -182180
5062 -182180 -175820 -346225 -286421 -214304 -123431 -179306 -32173 87012 98291 -128637 -244450
5051 -244450 -41117 -109014 -130832 -196281 -261517 -173021 -3917 90674 -12554 -52274 2641
5040B641r7289j81323M4479J38714P2039K76949j58408k1182j02867j34287K16752
5029E6218O9869j46481j07112K4146j21599m7366M5499p9956J29403K78532r3070
5018H083k57155N1434L5488r5409L4720R8659P5303p2437J0916Q2861j32046J0951
5006a48632K10705R2419j84656j0556n7195r273j29501M6927p4497m9625J77271
4995a36613J29434n9675N343m3308j06999J3314J10577k2682j29490R4020m4136
4984a90215j40898R2144J05128R2268J04062J44447q7899j88795m5472k8405j4990
4973a58625R3273J29968N3131K1611m4720m9972j7957K7703j2780Q6294m7596
4962H0330M6251n9114r9530J38788J64253q281k46706j15946j59899M2715N3267
$$ plain form
5040 2641 -94648 -275971 -231492 -92778 -20739 256210 97802 76620 -26247 -160534 56218
5029 56218 126087 -20394 -127506 -103360 -224959 -272325 -226826 -306782 -177379 101153 8083
5018 8083 -249072 -197638 -162150 -257559 -222839 -124180 -48877 -121314 -110398 -27537 -159583 -148632
5006 -148632 62073 154492 -30164 -40720 -97915 -107188 -236689 -189762 -264259 -313884 -136613
4995 -136613 -7179 -66854 -61511 -104819 -211818 -198504 -87927 -110609 -240099 -146079 -190215
4984 -190215 -331113 -238969 -133841 -41573 62489 206936 119037 -69758 -115230 -143635 -158625
4973 -158625 -65352 64616 117747 139358 94638 44666 26709 54412 41632 127926 80330
4962 80330 126581 67467 -32063 106725 270978 262697 15991 -99955 -259854 -217139 -163872
4951a63872M3954M4668j400r8051M1575J11312p9953j53481J86573J87544j24396
4940e527m6536K6846J5050o3653j66994n0573K93213K6951m7424J10372J04961
4929A96686O0611m5446o8664P7230r0578m5997k3607o6046J46217K29733j19298
4918B50841o3629n7656R1417M0033k20577j25900O2510N6133k0171K0918n2176
4907a8257j01880J63022o6000p0785R9115M1062j60866n7078R1759k5452n0486
4896a55846J7918O1809J18310L0776j88700j53521o1492R9848M1954Q0301Q0229
4885b8414R2150R6434l3135j56310Q5741J89667j49723j05580N2903n8832j04675
4874a19774j21406M2715J34920M1481J1155k3068L3255n6828j00438m4626L0644
$$ plain form
4951 -163872 -119918 -75250 -76650 -174701 -133126 -21814 -101767 -255248 -68675 118869 -5527
4940 -5527 -52063 -25217 -10167 -73820 -240814 -291387 1826 28777 -18647 91725 196686
4929 196686 257297 211851 143187 220417 129839 83842 60235 -5811 140406 370139 250841
4918 250841 187212 129556 220973 261006 40429 -85471 -22961 33172 13001 33919 -18257
4907 -18257 -120137 42885 -23115 -93900 5215 46277 -114589 -171667 -79908 -105360 -155846
4896 -155846 -137928 -76119 42191 72967 -115733 -269254 -330746 -230898 -188944 -108643 -28414
4885 -28414 63736 160170 127035 -29275 56466 246133 96410 -9170 43733 -15099 -119774
4874 -119774 -241180 -198465 -63545 -22064 -10909 -33977 -722 -57550 -157988 -202614 -171970
4863a71970J24482p073k88844j40842K5451K93124q156j93544M5565Q4377K1834
4852b15596q9661K2883J13589J58549j10279p1578J9587m6607L7792L687m2026
4841b19660k4413O797k9302M8606M2941J24101J4199K6706N1867j92596J71202
4830B0448l965j26633m8738m1488J73537M7197j600r2836j21143Q3138Q889r6993
4818b00187p4390J20047L0479l0236k0860j27361J96393j20307j91396O7057L14251
4807c6510M1360l9554K4124o4457J8088K6743j87834p6111k3690m8900Q6899O4126
4795b15716M4425M9493j21090r0277L5782J64335K35181L9261j24223o0400r5041
4784a38270P3209N8756J8124j52525j33148j1970O9108L3774L5855m0199q7359
$$ plain form
4863 -171970 -47488 -54561 -343405 -484247 -458796 -165672 -173828 -367372 -321807 -237430 -215596
4852 -215596 -305257 -282374 -168785 -10236 -120515 -192093 -172506 -219113 -181321 -177634 -219660
4841 -219660 -244073 -237276 -266578 -217972 -175031 -50930 -36731 -10025 41842 -150754 20448
4830 20448 16483 -110150 -158888 -200376 -26839 20358 18758 -74078 -195221 -112083 -103194 -200187
4818 -200187 -274577 -154530 -124051 -154287 -175147 -302508 -106115 -226422 -417818 -350761 -36510
4807 -36510 4850 -34704 -10580 -75037 -56949 -30206 -218040 -294151 -317841 -366741 -279842 -215716
4795 -215716 -171291 -121798 -242888 -333165 -297383 -133048 102133 141394 17171 -43229 -138270
4784 -138270 -65061 -6305 11819 -140706 -273854 -285824 -216716 -182942 -147087 -187286 -274645
4773b74645O0848M0298Q5212N669P9922N7389j17123j00960J12146O6575j2394
4762B937K6779j66897j65720P4171N6979p0921m6506L5145J24919M1047n061P079
4750h6049O6756J0841P4259n8632j16818M0656R6244o8292m1845J25973K74985
4739C18078r3961r4816j22986J22218K53055j14881k29486o6642k5031r6570J18282
4728c2740K32558k4425j37037k25635j34881J86384R4297P0561L14p4692j13447
4717a58743r6386J32881K38085K02512m1259M3369p6673q4143n8190n2855Q9434
4706A38032K3480j11442k3563n984O1017L3421r9764J7001J03517p9274N145j8617
4694D2969r3988j7117J2687O4153J69782p0681K0517m062m947l8080J3825p3471
$$ plain form
4773 -274645 -213797 -173499 -88287 -82618 -2696 54693 -62430 -163390 -51244 15331 2937
4762 2937 29716 -137181 -302901 -228730 -171751 -242672 -289178 -254033 -129114 -88067 -93128 -86049
4750 -86049 -19293 -8452 65807 7175 -109643 -68987 27257 -41035 -82880 43093 318078
4739 318078 224117 129301 6315 128533 381588 266707 37221 -29421 -54452 -151022 -32740
4728 -32740 199818 175393 38356 -187279 -322160 -135776 -41479 29082 29396 -45296 -158743
4717 -158743 -255129 -122248 115837 318349 277090 320459 243786 159643 101453 48598 138032
4706 138032 161512 50070 26507 20523 81540 114961 15197 32198 135715 56441 61586 42969
4694 42969 -51019 -68136 -55449 8704 178486 107805 128322 124260 119313 81233 95058 21587
4682B1587j94817L942J66482J00073P0396p3411k25500j25224R9587J36557P8346
4671E8018p1160j40954j55755N4553K1721J40565J35311j41829k4076J13613O3288
4660E3295K0739l1769O597l2556j18246O7487K39378l7800K6803r3239R3778j2542
4648A81925j85338j02836l1176l0454j4357o7589J34047K47495K956j70887j30702
4637a66916J22176J2783R0181L5541r9985o7386K0571J54383J95988l5336j30385
4626A31615K6319j29422K8572l7714l2600K6976O9567J44673p4458j8560L7412
4615A72380j05474j38345r6844P6205n5712p352P7846k6607j8321J59590J75896
4604B13262j34519k17699J4496J66680J12513r9872j57329r6827o7761J92993
$$ plain form
4682 21587 -173230 -169288 -2806 97267 167663 94252 -131248 -256472 -156885 -20328 58018
4671 58018 -13142 -154096 -309851 -255298 -233577 -93012 42299 -99530 -123606 -9993 53295
4660 53295 74034 42265 48862 16306 -101940 -34453 204925 167125 193928 100689 194467 181925
4648 181925 -3413 -106249 -137425 -167879 -182236 -249825 -115778 131717 134673 -36214 -166916
4637 -166916 -44740 -31957 58224 93765 -6220 -73606 -53035 101348 297336 262000 131615
4626 131615 157934 28512 57084 19370 -13230 13746 83313 227986 153528 134968 172380
4615 172380 66906 -71439 -168283 -92078 -147790 -155142 -77296 -103903 -122224 37366 213262
4604 213262 78743 -138956 -124460 42220 154733 54861 -102468 -199295 -267056 -74063
4594g4063M413n275J6882j65354j5057N2178K05935J48900j45417j07390Q1327
4583b921o4999j58930J4704L7014J06312O8370o330q4250L3348n5479p6824j02110
4571b92095J00763J83590L1339q5961k8978p6857o6495j05720q5237J76579R2343
4560a56729j92710L3095O4337l8792O0497J24373L8701p5555N1330J0254o7842
4549a49041R6590J23849O8061J17570k6252j73741N231P4269N0425q9432l7247
4538F0282k633l9843j06284J85121J34839q2719k7667r8155j24252j89897l1070
4527c22278K16697L8444l480j04983p475K45517k2205r2962k8458K31206j9296
4516A30727r2566M230j69491j18483P9053J67967j72265Q485L3047K03025n5694
$$ plain form
4594 -74063 -69650 -74925 -58043 -223397 -238454 -186276 19659 168559 23142 -84248 -2921
4583 -2921 -67920 -226850 -212146 -175132 -68820 -450 -6780 -91030 -57682 -113161 -189985 -292095
4571 -292095 -191332 -7742 23597 -62364 -91342 -168199 -234694 -340414 -425651 -249072 -156729
4560 -156729 -349439 -316344 -252007 -290799 -230302 -105929 -67228 -142783 -91453 -81199 -149041
4549 -149041 -52451 71398 139459 257029 230777 57036 62267 136536 186961 97529 60282
4538 60282 57649 17806 -88478 96643 231482 148763 121096 22941 -101311 -291208 -322278
4527 -322278 -105581 -67137 -70617 -175600 -183075 62442 40237 -52725 -81183 150023 130727
4516 130727 38161 42391 -127100 -245583 -166530 1437 -170828 -162343 -129296 73729 18035
4505A8035N8594J23742L0858j912p3531n9722j09626n4008K3917k8047j56728
4494b28428k8070J8493J7642R9982J03162L2336J6475r8109q8374m5930J24429
4483g6392J89471O0638L6435n4995n6835k22006k5007J38859L7730p2165n948
4472e0215J58415K16986P6078k69304l9602L4988q0986o796l8416M346R0625M3925
4460A40044J9883j52103k32075M6817R9951J39247l1910j0403n0538j12975N7562
4449h6500J0904o3243P2234J52165P568P5754M2956j17511k1374N4212q4391j13203
4437g0429p7672j38277J20964L29794K4354K3966q0188J214M2420Q9634k099N0200
4425C13881j3299k41869j53431K9644K27085J4495Q6221j60815o2517n8391M7983
$$ plain form
4505 18035 76629 200371 231229 229317 155786 96064 -13562 -67570 -43653 -71700 -228428
4494 -228428 -256498 -238005 -220363 -120381 -17219 15117 31592 -66517 -154891 -200821 -76392
4483 -76392 113079 173717 210152 155157 98322 -123684 -148691 -9832 27898 -44267 -50215
4472 -50215 108200 325186 401264 131960 92358 127346 46360 39564 1148 5494 96119 140044
4460 140044 159927 7824 -224251 -177434 -77483 61764 29854 19451 -31087 -144062 -86500
4449 -86500 -75596 -138839 -66605 85560 93128 168882 211838 94327 72953 127165 42774 -70429
4437 -70429 -148101 -286378 -165414 164380 188734 212700 132512 133726 176146 265780 263681 313881
4425 313881 300582 58713 -94718 -65074 162011 176506 262727 101912 39395 -18996 28987
4414B8987m2336j61613o3829Q7978K13130J11173j05942N7982m2837O0270J05378
4403B48341N000j68577j53591P8139Q9178p6241J4938K2871N5226k13672q3468
4392a81856J21160K9303k0204N1891k2202N420l4661k7297j9122J34388r7705
4381f0885q9362q4194j1062j2841j7635L3062J27248R5478J25713j0423J12546
4370B07645P0536q033p1736k0594J83092j53419o1259N8748J21708o7007q9206
4359A70475q0292m3305k2748j86410r515J47240N1530P8627m4947j04366J87959
4348A44248q1458k7165J24490j05553j87539m3985j6636J7358P9115J69638k0234
4337E2279j68580j599n4114O4132J6006j45005j30729O8388J50600P428J29990
$$ plain form
4414 28987 -13349 -174962 -238791 -150813 62317 173490 67548 125530 82693 142963 248341
4403 248341 253341 84764 -68827 9312 98490 22249 37187 60058 115284 -98388 -181856
4392 -181856 -60696 -31393 -51597 294 -21908 -16488 -51149 -78446 -97568 36820 -60885
4381 -60885 -150247 -234441 -245503 -258344 -275979 -242917 -115669 -20191 105522 95099 207645
4370 207645 278181 270148 198412 177818 360910 207491 146232 204980 326688 259681 170475
4359 170475 90183 46878 24130 -162280 -171795 -24555 26975 105602 60655 -43711 144248
4348 144248 62790 35625 160115 54562 -132977 -176962 -193598 -176240 -97125 72513 52279
4337 52279 -116301 -117900 -172014 -107882 -91876 -236881 -367610 -299222 -148622 -141194 -11204
4326a1204j2862o7863q973m344n166o5082o0612k6138J42252J02835J34037l4443
4314H2437j77976j47386O4413K6080J61659J04502N737j12392p3693n3286K0654
4303i9251J93610M9960k10285j44821J0622J36349N4548j1598L0663J5327M6156
4292G1280N8303L3244J93Q4j64303j8363K9197o9621k1013L4897j0910j4025p934
4279g8971k45307l3619R4527J64429K14094J64397Q0563k9508k59154o5466J63939
4268A69924J68916k26870k17030N6128J71699r5319n7809N7792J03866n7088j5932
4257E8277R1165l618O6238O2267j63555J4249n1876j72777r8428J9713J22289
4246e6056o8772J7176J34786O1523j86958n5403J05818r3934j58186P5905J85044
$$ plain form
4326 -11204 -24066 -91929 -100902 -105246 -110412 -175494 -236106 -262244 -119992 -17157 116880 82437
4314 82437 -95539 -242925 -178512 -152432 9227 113729 119466 7074 -66619 -119905 -99251
4303 -99251 94359 144319 -65966 -210787 -200165 -63816 -9268 -20866 9797 25124 71280
4292 71280 129583 162827 163020 163104 -1199 -19562 9635 -59986 -80999 -46102 -57012 -71037 -78971
4279 -78971 -324278 -357897 -263370 -98941 115153 279550 360113 330605 71451 5985 169924
4268 169924 338840 111970 -105060 -48932 122767 27448 -30361 27431 131297 74209 58277
4257 58277 149442 145824 212062 274329 110774 125023 73147 -99630 -198058 -178345 -56056
4246 -56056 -124828 -107652 27134 88657 -98301 -153704 -47886 -141820 -300006 -224101 -39057
4235c9057m6043q8461Q8759K04385J2569k0348P2978K2306J36801j5266j68524
4224A60099r1429m250j74778L3832N5232l2534m3285O7983N2614j81659j61363
4213c19538N6806J75117J10894J45953q8366j5332P8832j47482N7891p540n9875
4202a2640J85416o237j85507j15081p4519m6166R6361P8601j6891J25424K0874
4191D9635o9105j19592p3968k4623K8588K4643R5092J1015P265K88293O627j9613
4179B04257K8886K9462n5767K9729q5948n9043j83686k36984j6318J80774J62668
4168a970J9941j26792j15326K20502P0567J92707J13385L141P606j44035O2835
4157C02561j0177j35468q0919K6962j44944k47162r4738O0961R1053J4456P6068
$$ plain form
4235 -39057 -85100 -173561 -84802 119583 132152 111804 184782 207088 343889 328623 160099
4224 160099 68670 64420 -110358 -76526 -21294 -53828 -97113 -29130 23484 -158175 -319538
4213 -319538 -262732 -87615 23279 169232 80866 65534 144366 -3116 54775 47235 -12640
4202 -12640 172776 166539 -18968 -134049 -208568 -254734 -158373 -79772 -96663 28761 49635
4191 49635 -19470 -139062 -213030 -237653 -209065 -184422 -89330 -78315 -71050 217243 223870 204257
4179 204257 233143 262605 206838 236567 150619 91576 -92110 -329094 -345412 -164638 -1970
4168 -1970 17971 -108821 -224147 -3645 66922 259629 373014 376155 383761 239726 302561
4157 302561 292384 156916 75997 102959 -41985 -289147 -383885 -322924 -231871 -217415 -141347
4146a41347J20796J5213l1160O3234j7485K7564l6667l8203j04006j75564J72150
4135a45475J24955j3950m496l8085J59314p9050j51653J56441J40609j27935j24182
4124a03507P9871m052o4462M1627N1660l751j66362J11905M020q2580N9278k456
4112g8809o4799k03402L2280O8751R4593J42061P1314M3504L8608k6441j45655
4101b7995k1074l987j03383j9786r3740K4886J47930J12891M8016Q1099p9135
4090F5722j06895k7354Q1893j32358j66629m0028J8535J4745J03846L08339k4728
4079I5088j10476r5644l1769M9139N3327n1049M7185l7072K8093J52250J50587
4068B49659n5506j65833N6700N944l9229J4679j42612r4866M9538r421j1592J6429
$$ plain form
4146 -141347 -20551 -5338 -36498 26736 9251 36815 148 -38055 -142061 -317625 -145475
4135 -145475 -20520 -34470 -38966 -77051 82263 3213 -148440 8001 148610 20675 -103507
4124 -103507 -23636 -27688 -92150 -50523 1137 -2614 -168976 -57071 -53051 -135631 -76353 -78809
4112 -78809 -143608 -347010 -314730 -245979 -151386 -9325 61989 105493 144101 117660 -27995
4101 -27995 -49069 -53056 -156439 -176225 -269965 -245079 -97149 15742 63758 144857 65722
4090 65722 -41173 -68527 13366 -118992 -285621 -325649 -307114 -292369 -188523 119816 95088
4079 95088 -15388 -111032 -142801 -93662 -40335 -91384 -44199 -81271 -53178 99072 249659
4068 249659 194153 28320 85020 90964 51735 66414 -76198 -171064 -121526 -130947 -142539 -126110
4056a26110L9635N7664R2151m0979r0842j02941O0741J10509l8121R8064J09656
4045A69427M1320J4322j06944N666j03766q4009K7627O1419q8910p2421K3833
4034a12436j18676P2036Q0014J36604j9563n3006O293n2727k7560q4790M457J04696
4022f4658J71545L0088j43302K240J11734R2707J60334P5175j67534r0137j05202
4011G2990j7065R164l7846j09084j39483p452n7443n759l2691K9997J42595N5124
3999i6953J63892J31918l0994n7621J59884o3726L8481J73681j26921j88755j67226
3988f4340k5858J56163j25812k45287Q3098K57567n7825l6533k26105q4297p997
3977c77226o9304N2369J1346J6118R7269J89811J93928R2343q2369k29719J34982
$$ plain form
4056 -126110 -86475 -28811 63340 22361 -68481 -171422 -110681 -172 -38293 59771 169427
4045 169427 210747 225069 118125 123791 20025 -63984 -36357 25062 -63848 -136269 -112436
4034 -112436 -231112 -159076 -79062 57542 37979 -15027 -8734 -61461 -89021 -173811 -169354 -64658
4022 -64658 106887 136975 -6327 -4087 107647 200354 360688 435863 268329 178192 72990
4011 72990 55925 65089 27243 -81841 -221324 -228776 -286219 -291978 -324669 -294672 -152077 -96953
3999 -96953 66939 198857 167863 110242 270126 206400 244881 418562 291641 102886 -64340
3988 -64340 -90198 65965 -59847 -305134 -222036 35531 -22294 -58827 -284932 -369229 -377226
3977 -377226 -446530 -394161 -382815 -366697 -269428 -79617 114311 206654 124285 -105434 29548
3966B9548k90j41088j6128j6612l158o4437P0877m5527J21798L0227J32254m5170
3954E2294j11324k47869j18955j0103P9266K33273J64233M1334j80775k02097
3944c00723K7845J09690O439l6110J80348O3520r8079j66181L9455k6101o3619
3933b63516J56006l3816J6107K29536J19416K044j28348M5806j03947j41521j19862
3922b22095N3130m1352J48110J63581j8562K9684j07558j43183p4165J66756J37223
3911I1569L7419j57696K7525J487l5324J47031n2228Q4410J00545R9873P2754
3900D17365o0468o6031j32940j28990N403M8858Q5011o2216j94176L2271j20827
3889a76740R2561O3576J6230P5815j03599k33252L3808P4786J63463R6568r6680
$$ plain form
3966 29548 29258 -111830 -127958 -144570 -147728 -212165 -141288 -186815 -65017 -34790 97464 52294
3954 52294 -59030 -306899 -425854 -435957 -356691 -123418 40815 82149 -98626 -300723
3944 -300723 -272878 -163188 -156749 -192859 -12511 51009 -47070 -213251 -173796 -199897 -263516
3933 -263516 -107510 -141326 -125219 104317 223733 225777 97429 143235 39288 -102233 -222095
3922 -222095 -168965 -210317 -62207 101374 82812 112496 4938 -138245 -212410 -45654 91569
3911 91569 128988 -28708 -1183 304 -35020 112011 59783 144193 244738 344611 417365
3900 417365 356897 290866 157926 28936 34339 83197 168208 105992 -88184 -55913 -176740
3889 -176740 -84179 -20603 -4373 71442 -32157 -265409 -231601 -156815 6648 103216 6536
3878F536J02864K67329j13996k10419L617J48552m8006r5859j01757j29507Q1216
3867h9430R7648K07396L9579p8911j19413j82442J46288j282p4139p9603J7691
3856a16618M9466P9401J17092j23491j39950O0278M9652J2251P6291o5924o7470
3845f9022M9573K03688o0932j17346j42006j30956J71802K50045O0287j36603
3835G8530k05203J92354R5530j89070j16682J4186M0791K97768N9046j53202n844
3824A08204l5110j33472r7474K2091N982J11925q667K9837N7242Q6631M3097J26490
3812C16776l4525j69338K8000O4554K5478Q0507Q5030j61521k06363k55645J07163
3801a19884N4663j9584N9341K9384L8307L2758L4388J5309J3260j51355m365J461
$$ plain form
3878 6536 109400 376729 262733 52314 55931 204483 156477 60618 -41139 -170646 -89430
3867 -89430 8218 215614 255193 176282 56869 -125573 20715 19433 -54706 -134309 -116618
3856 -116618 -67152 12249 129341 5850 -134100 -73822 -24170 -11919 64372 -1552 -69022
3845 -69022 -19449 184239 123307 5961 -136045 -267001 -95199 154846 215133 78530
3835 78530 -126673 65681 161211 -27859 -144541 -130355 -89564 208204 267250 114048 108204
3824 108204 73094 -60378 -157852 -135761 -129779 -17854 -26521 3316 60558 147189 190286 316776
3812 316776 282251 112913 140913 205467 230945 311452 396482 234961 28598 -227047 -119884
3801 -119884 -65221 -84805 -25464 3920 42227 74985 109373 124682 137942 -13413 -17778 -16317
3789a6317j5989J4402N2243J7224q0383k12913n7725J46809J3679r2739o3916
3778b95625J8824l2235J70811J61425j5709K8006O3314m6187J9154k0387j65448
3767a14057k3124L3378j6407p2987J04209J50986q145j22126Q3047j12438l0543
3756a28207j59184J0015L12395P216M9223O2652j75838j17886m6589J58506O8950
3745D1253K1532k00581l9392Q9505l8682M5936N7658K8621J7266k0301l4102R7877
3733F6590j93087L32J29213o7786L6075j26723j60311l436k6863J3866K43879
3722h8251k5001q299O9602P0307J39715l5469k1041R7924J36226o9954j39415
3711A26344N0599m6623p4987o3177q6816k1104p7134L4326O2594R875K8768M3890
$$ plain form
3789 -16317 -32306 -17904 34339 51563 -28820 -241733 -299458 -152649 -138970 -231709 -295625
3778 -295625 -276801 -309036 -138225 23200 7491 35497 98811 52624 71778 51391 -114057
3767 -114057 -137181 -103803 -120210 -193197 -88988 61998 53853 -68273 14774 -97664 -128207
3756 -128207 -287391 -277376 35019 42235 91458 154110 -21728 -139614 -186203 -27697 41253
3745 41253 62785 -137796 -177188 -87683 -126365 -80429 -22771 5850 23116 2815 -31287 66590
3733 66590 -126497 -126165 3048 -64738 -28663 -155386 -315697 -319133 -345996 -332130 -88251
3722 -88251 -113252 -121551 -51949 18358 158073 122604 101563 199487 335713 265759 126344
3711 126344 176943 130320 55333 -7844 -94660 -115764 -192898 -158572 -95978 -86103 -57335 -13445
3699a3445J34611j67030L6693J31181n6715K748M888j26665N0989K57342N3291
3688C07888j6840k0895l6879m8404j21475o8731r586k9457K211R4245k37732l9425
3676b25080J92306P8385Q6933J3411p5538j11030o0207J46554j93704m0943J77826
3665a1087R0495j0984j22710J85209N1826K1392Q1672L9231j48242k4096j9584
3654A33122j21980j46915P019J87278J6134J41701J19494l28987j69054J39662
3644b2526O7858k6005j59581l9999K37073l94o1577l319q8545O5777j8381K8063
3632b1556R9168L0006J08533n543r9577r9706O0453k3891j3969r1337J37407J4459
3620I4447M0748j55006n5370R861n2515J33843J52841j6052p1369O6088P5948
$$ plain form
3699 -13445 121166 -45864 -9171 122010 65295 68043 72931 -53734 -2745 254597 307888
3688 307888 291048 270153 233274 184870 63395 -5336 -14922 -44379 -42168 52077 -185655 -225080
3676 -225080 -32774 45611 132544 145955 70417 -40613 -100820 45734 -147970 -188913 -11087
3665 -11087 79408 68424 -54286 130923 182749 204141 285813 325044 176802 152706 133122
3654 133122 11142 -135773 -128754 58524 74658 216359 335853 6866 -162188 -22526
3644 -22526 45332 19327 -140254 -180253 56820 56426 -5151 -8470 -97015 -31238 -49619 -21556
3632 -21556 77612 107618 216151 210608 111031 11325 71778 47887 33918 -57419 79988 94447
3620 94447 135195 -19811 -75181 -65320 -117835 16008 168849 152797 81428 147516 223464
3609B23464n4129j66502l937P2149Q6754M6591O0219m7609j35771j87015k6064
3598a31850J06894J24631j6685l6226j39885n8700L8964J2761q821J03095K7409
3587B1587M1278J50973K9174Q9665q7691j35873K481J31468J08631k11449j33769
3576F475p7864j48547J38434P8667J21382L2111j7561J2502q1037M4874O8021
3565A77457K8269m0368k24102n635Q5654p7953P7022J66942N4784m5828K1579
3554B17821K3342K1935k88517k8300N8993J63178K7671j16203q4729q1419K0318
3543f5910l8679m3182O744j7240k4984J40912n717J06434J1941l1829K7874J3659
3531H0023J55614J43168l7724j88514j71280o4630M5805J458n8059J6372J18905
$$ plain form
3609 223464 169335 2833 -1104 71045 157799 204390 264609 217000 81229 -105786 -131850
3598 -131850 -24956 99675 82990 46764 -93121 -151821 -112857 -100096 -108917 -5822 21587
3587 21587 62865 213838 243012 332677 244986 109113 111594 243062 351693 140244 6475
3576 6475 -71389 -219936 -81502 -2835 118547 150658 133097 145599 64562 109436 177457
3565 177457 205726 165358 -58744 -64379 21275 -56678 20344 187286 242070 196242 217821
3554 217821 241163 263098 -25419 -53719 5274 168452 196123 79920 -4809 -86228 -65910
3543 -65910 -104589 -147771 -141027 -158267 -183251 -42339 -48056 58378 70319 38490 66364 80023
3531 80023 235637 378805 341081 152567 -18713 -83343 -37538 -36080 -94139 -77767 41138
3520D1138j16972K3190Q7652K2217j03045r6699P8675l952n2212J7041j50424
3509b53391M3572J06562P6252p6649J8615L17099M7858j36694p197j29699q2249
3498g5921o1836j69498J52722p40j26396j43313j1655J21611o2010n4322J2683
3487d18675K03942J40108L8224o2148L8399K2126N4272P8542p510j42174R192
3476d5702l8543j08558J10153L3924j9634m7077J0170K1865j2683p9006j69649
3465c44740k218K24933P9134J3336n6796J50500L1141q7865m678J4422J08842
3454A26011n2146m6892j26290k7963J35691J49665m5073n2577j1893P2247J4441
3443A35221j02139p4515M2833p924O62O4706P9961L683l0097o7780L885n938j454
$$ plain form
3520 41138 -75834 -52644 35008 57225 -45820 -142519 -63844 -67796 -120008 -102967 -253391
3509 -253391 -209819 -103257 -27005 -103654 -85039 232060 279918 143224 136027 6328 -75921
3498 -75921 -137757 -307255 -154533 -155273 -281669 -424982 -436637 -315026 -377036 -431358 -418675
3487 -418675 -214733 -74625 -36401 -98549 -60150 -38024 16248 94790 87280 -54894 -45702
3476 -45702 -84245 -192803 -82650 -48726 -68360 -115437 -105267 -83402 -96085 -175091 -344740
3465 -344740 -346958 -122025 -42891 -29555 -86351 64149 95290 7425 2747 17169 126011
3454 126011 73865 26973 -99317 -127280 8411 158076 113003 60426 48533 120780 135221
3443 135221 33082 -41433 1400 -6524 -5862 58844 138805 142488 112391 44611 48496 42558 41104
3430D1104O4930J00887M0860J6136k61054j84340K06489J90131n3178m2162n6036
3419F3767q7312M5498J13121O024j59368J2180J59009Q774l111O4710j98502M719
3407B9509J10043Q0625j38933j56351n8361J69540R2375j8134J29688k4474q0838
3396A34689L6562j87425j41430J2778j8419j05796Q1774K027l6560K8367J32752
3385f0681N8389j13583j34269M5199Q2861J0897k0848O9680j083j3263K9723J07246
3373F0268J23710K7992p6013q3348M4Q7657j34767j63969N8661Q7127P0451J41247
3361A99060P1400o8777j35386j02141p1294K9914k0445n8923j7050l9445J41915
3350g1172K86834j24036j24146J84983J02309p3021P0938m3605j73597O1423j21477
$$ plain form
3430 41104 106034 206921 247781 263917 2863 -181477 25012 215143 161965 119803 63767
3419 63767 -23545 21953 135074 141098 -18270 -6090 152919 161693 158582 223292 24790 29509
3407 29509 139552 220177 81244 -75107 -133468 36072 128447 110313 240001 215527 134689
3396 134689 171251 -16174 -157604 -144826 -163245 -269041 -187267 -185240 -221800 -193433 -60681
3385 -60681 -2292 -115875 -250144 -204945 -122084 -111187 -132035 -62355 -63438 -76701 -46978 60268
3373 60268 183978 211970 135957 52609 52653 140310 5543 -158426 -99765 -12638 57813 199060
3361 199060 270460 201683 66297 -35844 -107138 -77224 -97669 -156592 -173642 -213087 -71172
3350 -71172 215662 91626 -32520 152463 254772 181751 252689 209084 35487 96910 -24567
3339b4567l1902M089P1124o0328j35925L284J35339L9759j986m5913l2035n1769
3327a30830k2875O3632J89270J03540q8165n2769j06387k6650K6819R3183k4855
3316B3913J48444k46431j69347L6945m6909o205J94709J66854P0967M844j13823
3305F3961l93J04950j51205j24222o0274O6370P9386M1582J5837r5662P8771J90619
3293B09720m3747n2253k09348o5782q642P5395O3700r9016M2611J3006K7240L2249
3281a4867J32431r1557j61883l3682N3656q15j807l435k6519L7203l7336j79879
3269c28490o4322J52393K5714Q6827m0618j3754R6534n957j28060Q5815J24092
3258i826j02448j923J30678j1504k6567L5233j65376M5987R9956K1187N753l3797
$$ plain form
3339 -24567 -56469 -52380 18744 -41584 -177509 -174225 -38886 873 -1113 -47026 -79061 -130830
3327 -130830 -153705 -90073 99197 202737 114572 61803 -44584 -71234 -44415 48768 23913
3316 23913 172357 -74074 -243421 -206476 -253385 -259590 -64881 101973 172940 177784 63961
3305 63961 63568 168518 17313 -106909 -167183 -100813 -21427 20155 35992 -59670 19101 209720
3293 209720 165973 113720 -95628 -161410 -170052 -94657 -30957 -129973 -87362 -74356 -47116 -14867
3281 -14867 117564 26007 -135876 -169558 -115902 -116717 -118524 -121959 -148478 -111275 -148611 -328490
3269 -328490 -392812 -240419 -214705 -127878 -168496 -182250 -85716 -91673 -219733 -133918 -9826
3258 -9826 -112274 -114197 16481 4977 -21590 13643 -151733 -105746 -5790 15397 21150 -12647
3246a2647J09104K12720J8740k33539j25842J28443J0622j13234N0215j68809
3236a24227m6973q0463N2976J90685R6321l6906p3515k74134R1933R4258n7569
3225a67614P249O4323Q1485o2077j64015J36019J13558j27001P3991r8888r1139
3214b34109M6148j3682J05607R5470J703p5167O7401m7523J05305o6428k90961
3203c06236j32133J41342J45766J04856K00220J03080Q0051p5043o9270j97104
3193d471k3040l8869J02156R4278J05046M2293j39890m7443N9178n7561J12807
3182B04484P089j72427j2016L9506j85298q243k0491R4424l4413j83695m925J48903
3170a27102k322K17606J52480R917N554j60932j75887j63905L6047l0587N6387
$$ plain form
3246 -12647 96457 309177 327917 94378 -31464 96979 107601 -5633 44582 -124227
3236 -124227 -171200 -251663 -198687 -8002 88319 51413 -22102 -296236 -204303 -110045 -167614
3225 -167614 -160365 -96042 -14557 -76634 -240649 -104630 8928 -118073 -44082 -142970 -234109
3214 -234109 -187961 -201643 -96036 -566 1137 -74030 -6629 -54152 51153 -15275 -306236
3203 -306236 -438369 -297027 -151261 -46405 153815 256895 336946 261903 192633 -4471
3193 -4471 -27511 -66380 35776 130054 235100 277393 137503 90060 149238 91677 204484
3182 204484 211573 39146 27130 66636 -118662 -126905 -147396 -52972 -87385 -271080 -276005 -127102
3170 -127102 -129424 88182 240662 250579 256133 95201 -80686 -244591 -208544 -239131 -182744
3159a82744O1424P4311M906q5844o4343j3186J3390P7903J8182K67229J24420
3148B95648p5928j88500j6225o1124j00811k25814K1727J61442J54046J13161
3138G7622M7863L6621J27240L3811j56166m7038k44951j16766q9605J85982J44272
3127a115J02297l1618p9062j34016R934o3772J7747J26788J00427J8762m6949
3116A9423n3739K2268K6581o143m367J7911Q1814J71548q677q2947j84470j25487
3104a26285q303j04189j31758J64519P0724Q357Q5757k3425N6263J30218q0720
3093D1158p4900o1449K8487k2308J38310k25j14901j25923r3902J08670L8682
3082a38301P3082J11774j48979j26060J31075P7253p6134o3733k7507M469J2573
$$ plain form
3159 -182744 -121320 -47009 -42103 -127947 -192290 -205476 -192086 -114183 -96001 171228 295648
3148 295648 219720 31220 14995 -46129 -146940 -372754 -351027 -189585 -35539 77622
3138 77622 125485 162106 289346 323157 166991 119953 -124998 -241764 -331369 -145387 -1115
3127 -1115 101182 69564 -9498 -143514 -133580 -197352 -179605 -52817 47610 66372 19423
3116 19423 -34316 -12048 14533 8390 4023 21934 103748 275296 266619 183672 -798 -126285
3104 -126285 -134588 -238777 -370535 -206016 -135292 -126935 -41178 -64603 -8340 121878 41158
3093 41158 -33742 -95191 -66704 -89012 49298 49073 -65828 -191751 -285653 -176983 -138301
3082 -138301 -65219 46555 -102424 -228484 -97409 -20156 -96290 -160023 -187530 -183061 -170488
3071a70488J54008j15748L1812J80892L2126R65r2307m2773l8297R7943Q0228
3060A18361r6347j53994N610J12597J92373r1852l5472j00839J8877j22637q5127
3049b38450O4708J65586J70221j4851K7848n9588j0119K74n357k3591m3113L7510
3037G1078j48021J40451l142j02908L1352N9199L8590r3302j14484R822J21512
$$ plain form
3071 -170488 -16480 -132228 -100416 80476 112602 113567 21260 -21513 -59810 38133 118361
3060 118361 22014 -131980 -126370 -13773 178600 86748 51276 -49563 -30686 -153323 -238450
3049 -238450 -173742 -8156 162065 147214 175062 115474 105355 105629 100272 76681 33568 71078
3037 71078 -76943 63508 60366 -42542 -11190 48009 86599 -6703 -121187 -111365 10147
$$ [...]
##END NTUPLES=NMR SPECTRUM
##END=
