##TITLE=Analysis number 327795
Compound Code km 06649
Book Reference 235087
Project Code adrs  flro3
Chemist Name jom
##JCAMPDX= 6.0         $$ Bruker NMR JCAMP-DX V2.0
##DATA TYPE= NMR SPECTRUM
##DATA CLASS= NTUPLES
##ORIGIN= Bruker BioSpin GmbH
##OWNER= nmr
$$ XWIN-NMR		Version 3.5
$$ Tue Apr 10 12:07:11 2007 GMT Daylight Time (UT+1h)  MAYBRIDGE\nmr@NMR_250MHZ
##.OBSERVE FREQUENCY= 250.131544655141
##.OBSERVE NUCLEUS= ^1H
##.ACQUISITION MODE= SIMULTANEOUS (DQD)
##.ACQUISITION SCHEME= undefined
##.AVERAGES= 16
##.DIGITISER RES= 18
##SPECTROMETER/DATA SYSTEM= dpx250
##.PULSE SEQUENCE= zg30
##.SOLVENT NAME= DMSO
##.SHIFT REFERENCE= (INTERNAL, DMSO, 0, 16.522)
##AUDIT TRAIL= $$ (NUMBER, WHEN, WHO, WHERE, WHAT)
$$ ##TITLE= Audit trail, XWIN-NMR		Version 3.5
$$ ##JCAMPDX= 5.01
$$ ##ORIGIN= Bruker BioSpin GmbH
$$ ##OWNER= nmr
$$ C:\u/data/dgb/nmr/ADRS/780/pdata/1/auditp.txt
$$ ##AUDIT TRAIL=  $$ (NUMBER, WHEN, WHO, WHERE, WHAT)
(   1,<2007-04-10 12:06:49.82 +100>,<MAYBRIDGE\nmr>,<NMR_250MHZ>,
      <created by zg, POWCHK disabled, PULCHK disabled
       configuration hash MD5:
       49 4B E0 1D 92 C2 6B 37 9F E6 65 BC 52 41 86 1D
       data hash MD5: 64K
       84 39 11 E7 BB 9E EF 2B 0B BD 93 9B 2B CD 59 53>)
(   2,<2007-04-10 12:07:03.74 +100>,<MAYBRIDGE\nmr>,<NMR_250MHZ>,
      <Start of raw data processing
       ef LB = 0.3 FT_mod = 6 PKNL = 1 SI = 32K 
       data hash MD5: 32K
       3B E2 7E E4 8E F2 80 F2 C2 97 8B 22 72 52 2C 9C>)
(   3,<2007-04-10 12:07:05.42 +100>,<MAYBRIDGE\nmr>,<NMR_250MHZ>,
      <apk 
       data hash MD5: 32K
       2D 42 DC 6C 01 23 A9 F0 33 74 44 3E 69 91 7E 05>)
(   4,<2007-04-10 12:07:06.10 +100>,<MAYBRIDGE\nmr>,<NMR_250MHZ>,
      <abs ABSG = 5 
       data hash MD5: 32K
       32 CD 3C 18 C0 46 FB 9D 96 39 D5 76 AD 5F 84 0C>)
$$ ##END=
$$ 
$$ hash MD5
$$ 3C CD DE B6 79 66 FB 01 05 26 BC 68 27 F0 A3 6C
##$RELAX= 
##$RELAX= 
##$RELAX= 
##$RELAX= 
##$RELAX= 
##$RELAX= 
##$RELAX= 
$$ Bruker specific parameters
$$ --------------------------
##$DU= <C:\u>
##$EXPNO= 780
##$NAME= <ADRS>
##$PROCNO= 1
##$TYPE= <nmr>
##$USER= <dgb>
##$AMP= (0..31)
100 100 100 100 100 100 100 100 100 100 100 100 100 100 100 100 100 100 
100 100 100 100 100 100 100 100 100 100 100 100 100 100 
##$AQSEQ= 0
##$AQ_mod= 3
##$AUNM= <au_zg>
##$AUTOPOS= <23 >
##$BF1= 250.13
##$BF2= 250.13
##$BF3= 250.13
##$BF4= 250.13
##$BF5= 500.13
##$BF6= 500.13
##$BF7= 500.13
##$BF8= 500.13
##$BYTORDA= 1
##$CFDGTYP= 0
##$CFRGTYP= 5
##$CHEMSTR= <none>
##$CNST= (0..31)
1 1 145 1 1 1 1 1 1 1 1 1 1 1 1 1 1 1 1 1 1 1 1 1 1 1 1 1 1 1 1 1 
##$CPDPRG= <>
##$CPDPRG1= <>
##$CPDPRG2= <>
##$CPDPRG3= <>
##$CPDPRG4= <mlev>
##$CPDPRG5= <mlev>
##$CPDPRG6= <mlev>
##$CPDPRG7= <mlev>
##$CPDPRG8= <mlev>
##$CPDPRGB= <>
##$CPDPRGT= <>
##$D= (0..31)
0 1 0 0 0 0 0 0 0 0.06 0 0 0 0 0 0 0.0002 0 0 0 0 0 0 0 0 0 0 0 0 0 0 
0 
##$DATE= 1176203208
##$DBL= (0..7)
120 120 120 120 120 120 120 120 
##$DBP= (0..7)
150 150 150 150 150 150 150 150 
##$DBP07= 0
##$DBPNAM0= <>
##$DBPNAM1= <>
$$ [...]
##$SUBNAM6= <"">
##$SUBNAM7= <"">
##$SUBNAM8= <"">
##$SUBNAM9= <"">
##$SW= 20.6930455092707
##$SWIBOX= (0..15)
0 0 3 0 0 0 0 0 0 0 0 0 0 0 0 0 
##$SW_h= 5175.983436853
##$TD= 65536
##$TD0= 1
##$TE= 683.16
##$TE2= 300
##$TE3= 300
##$TEG= 300
##$TL= (0..7)
0 120 120 120 120 120 120 120 
##$TP= (0..7)
150 150 150 150 150 150 150 150 
##$TP07= 0
##$TPNAME0= <>
##$TPNAME1= <>
##$TPNAME2= <>
##$TPNAME3= <>
##$TPNAME4= <>
##$TPNAME5= <>
##$TPNAME6= <>
##$TPNAME7= <>
##$TPOAL= (0..7)
0.5 0.5 0.5 0.5 0.5 0.5 0.5 0.5 
##$TPOFFS= (0..7)
0 0 0 0 0 0 0 0 
##$TUNHIN= 0
##$TUNHOUT= 0
##$TUNXOUT= 0
##$USERA1= <user>
##$USERA2= <user>
##$USERA3= <user>
##$USERA4= <user>
##$USERA5= <user>
##$V9= 5
##$VALIST= <valist>
##$VCLIST= <CCCCCCCCCCCCCCC>
##$VD= 0
##$VDLIST= <DDDDDDDDDDDDDDD>
##$VPLIST= <PPPPPPPPPPPPPPP>
##$VTLIST= <TTTTTTTTTTTTTTT>
##$WBST= 1024
##$WBSW= 4
##$XGAIN= (0..3)
0 0 0 0 
##$XL= 0
##$YL= 0
##$YMAX_a= 359777
##$YMIN_a= -396577
##$ZGOPTNS= <>
##$ZL1= 120
##$ZL2= 120
##$ZL3= 120
##$ZL4= 120
##$ABSF1= 16.522
##$ABSF2= -4.171173
##$ABSG= 5
##$ABSL= 3
##$ALPHA= 0
##$AQORDER= 0
##$ASSFAC= 0
##$ASSFACI= 0
##$ASSFACX= 0
##$ASSWID= 0
##$AUNMP= <proc_1d>
##$AZFE= 0.1
##$AZFW= 0.1
##$BCFW= 0
##$BC_mod= 0
##$BYTORDP= 0
##$COROFFS= 0
##$CY= 12.5
##$DATMOD= 1
##$DC= 0
##$DFILT= <>
##$DTYPP= 0
##$F1P= 14.0000005364418
##$F2P= -0.99999901652339
##$FCOR= 0.5
##$FTSIZE= 32768
##$FT_mod= 6
##$GAMMA= 0
##$GB= 0
##$INTBC= 1
##$INTSCL= 1
##$ISEN= 128
##$LB= 0.3
##$LEV0= 0
##$LPBIN= 0
##$MAXI= 10000
##$MC2= 0
##$MEAN= 0
##$ME_mod= 0
##$MI= 0
##$NCOEF= 0
##$NC_proc= -4
##$NLEV= 6
##$NOISF1= 0
##$NOISF2= 0
##$NSP= 0
##$NTH_PI= 0
##$NZP= 0
##$OFFSET= 16.522
##$PC= 1
##$PHC0= 218.9685
##$PHC1= 6.97048
##$PH_mod= 1
##$PKNL= yes
##$PPARMOD= 0
##$PSCAL= 4
##$PSIGN= 0
##$REVERSE= no
##$SF= 250.13
##$SI= 32768
##$SIGF1= 0
##$SIGF2= 0
##$SINO= 400
##$SIOLD= 32768
##$SREGLST= <1H.DMSO>
##$SSB= 0
##$STSI= 32768
##$STSR= 0
##$SW_p= 5175.98343685301
##$SYMM= 0
##$S_DEV= 0
##$TDeff= 65536
##$TDoff= 0
##$TI= <Analysis number 999999
Compound Code 99
Book Reference 9
Project Code 9>
##$TILT= no
##$TM1= 0
##$TM2= 0
##$TOPLEV= 0
##$USERP1= <user>
##$USERP2= <user>
##$USERP3= <user>
##$USERP4= <user>
##$USERP5= <user>
##$WDW= 1
##$XDIM= 32768
##$YMAX_p= 536062403
##$YMIN_p= -179547
$$ End of Bruker specific parameters
$$ ---------------------------------
##NTUPLES= NMR SPECTRUM
##VAR_NAME=  FREQUENCY,     SPECTRUM/REAL,   SPECTRUM/IMAG
##SYMBOL=    X,             R,               I
##VAR_TYPE=  INDEPENDENT,   DEPENDENT,       DEPENDENT
##VAR_FORM=  AFFN,          ASDF,            ASDF
##VAR_DIM=   32768,         32768,           32768
##UNITS=     HZ,            ARBITRARY UNITS, ARBITRARY UNITS
##FACTOR=    0.157963299565203, 1,           1
##FIRST=     4132.6476996994, 0,             0
##LAST=      -1043.33573715361, 0,           0
##MIN=       -1043.33573715361, -179547,     0
##MAX=       4132.6476996994, 536062403,     0
$$ Real data points
##PAGE= N=1
##DATA TABLE= (X++(R..R)), XYDATA
$$ [...]
17641C6689558P614512J2116330J6455096K0611719K3518068J7499403q9079j3496015
17633A20919592j0430373Q16657Q475569O066223k977095p990606r437104j1070344
17625I4372519j4598630j5035878j0355303m399716J136963O484758J1251897
17618F8856610J2701922N473087n580577q063583o085299k875522L691672J1216240
17610G9334550J5788640J1488176k553641j5813544j7574403j2074812p589595
17603E1005371p616308p046744l953507j410465m98261m89593J096980L836953
17595C4924426N834738N390683J327883k523684j606032K339715O120806P125838
17587E8934373L690074n99613j43041N031722J1020803J2860565P566679J72940
$$ plain form
17641 36689558 44304070 56420400 72875496 93487215 117005283 134504686 134415607 120919592
17633 120919592 110489219 111305876 119781445 125847668 122870573 114879967 105442863 94372519
17625 94372519 79773889 64738011 54382708 49982992 51119955 57604713 68856610
17618 68856610 81558532 87031619 81451042 73387459 67302160 64426638 68118310 79334550
17610 79334550 95123190 106611366 104057725 88244181 70669778 58594966 51005371
17603 51005371 43389063 36342319 32388812 30978347 30480086 29990493 31087473 34924426
17595 34924426 40759164 46149847 47477730 44954046 43348014 45687729 51808535 58934373
17587 58934373 62624447 62024834 61881793 66913515 77934318 90794883 98361562 98534502
17579I8534502l678911j707401O369160J4213579J0939327q904775k3874789j9232710
17571G2657982q039172Q1436j88428q757216j0886367o358839j246850K333850
17563C9596396K523274k459631o583685n914107k910380n35103p7238j229071
17555B2410455l436160m728342l548886k202716j417824j046251q47429p18158
17547D464689n06585l63840l09821k80652k45474k08945j46054j29443j34078
17538B139797r9359j05026j45128j70065r5397o8268m0760o3650j14299j00430
17528A137415m1007p5631o7774m2232q4425m0073K7452q694m858m6497n3055n2809
17516F47812n2420j9718j0081L2752k5046r91J121l5104k8521L6868n0843j4094
$$ plain form
17579 98534502 94855591 93148190 99517350 113730929 124670256 115765481 91890692 72657982
17571 72657982 64618810 64700246 64511818 55754602 44868235 38509396 37262546 39596396
17563 39596396 42119670 39660039 33076354 27162247 24251867 23716764 23639526 22410455
17555 22410455 18974295 14245953 10697067 8494351 7076527 6030276 5182847 4464689
17547 4464689 3958104 3594264 3284443 3003791 2758317 2549372 2403318 2273875 2139797
17538 2139797 2040438 1935412 1790284 1620219 1524822 1456554 1415794 1352144 1237845 1137415
17528 1137415 1096408 1020777 953003 910771 826346 786273 813725 805031 800173 753676 700621 647812
17516 647812 595392 575674 565593 598345 573299 572308 573429 538325 509804 546672 495829 481735
17504D81735p665J430Q039m4088K8244J3984m813p085j2862J2182l3855k5017
17492D10229N1365Q95n1068L671j6112k0382L752n7092l6283K3273n7778k544
17480B51926N2525M8846k0310k6076l8264j1565l5064O124J0329Q192L2798K216
17468B81677k9998l7434n127J9049J4315Q895j6807l618k6446j7430K090K9107
17456B18273K3655j1704n3843K4600N7690K9554k8983J0980J9038l4231l09J0554
17444B65274K7556j9097k0982J0064k276o1006m886k924k3158k6020M1458K0157
17432B04160k1282J1046j3086l2537N355j9245k1903k5980L4816M0379J6902J8792
17420A97417l1452J256m4178J0977n760l7128k8609M9519o026m9574q0331N0773
$$ plain form
17504 481735 474070 475500 483539 439451 467695 481679 476866 469781 456919 469101 435246 410229
17492 410229 461594 462489 411421 415092 398980 378598 382350 325258 288975 312248 254470 251926
17480 251926 304451 353297 332987 306911 268647 257082 222018 228142 238471 246663 279461 281677
17468 281677 251679 214245 209118 228167 242482 251377 234570 230952 204506 187076 189166 218273
17456 218273 241928 230224 176381 200981 258671 288225 259242 270222 289260 255029 254720 265274
17444 265274 292830 273733 252751 262815 260539 199533 194647 191723 168565 142545 184003 204160
17432 204160 182878 193924 180838 148301 153656 134411 112508 86528 121344 161723 178625 197417
17420 197417 165965 167221 123043 134020 128260 91132 62523 112042 106016 56442 -23889 26884
17408B6884M5541k6103l9132k7323L0267N1555L4245k3337J7150R985J061M3018
17396A43811L334O36j9995p6193k3437J026p296M373M2790J6137M4774m5102k4860
17383E9998L6982R480k4742k1278l4552q254J2660P3468m425j8720J399N637J4319
17370A01972j6047m2475J3129N152K5561j0882m2325l5713L6912L7532L214j2011
17358F4019J1706k7923k7456n6267m553L3253K5310L2868j0546l4395r977j3922
17346a7883j6733L1512J4581l30J9907N3167K5520o457o513O2176J4528k3490
17334A49985p4168o8655j2800L0491P0835j7464K9590J7792m5629k3401J6199
17323G2775M7581j8267m9074p053J2384o3897J4843O7381j9648o830L2398l4297
$$ plain form
17408 26884 72425 46322 7190 -20133 10134 61689 95934 72597 89747 99732 100793 143811
17396 143811 147145 147781 127786 51593 28156 29182 21886 26259 69049 85186 129960 84858 59998
17383 59998 96980 106460 81718 60440 25888 17634 30294 103762 99337 80617 82016 87653 101972
17370 101972 85925 43450 56579 61731 87292 76410 34085 -1628 35284 72816 76030 64019
17358 64019 75725 47802 20346 -35921 -40474 -7221 18089 50957 40411 6016 -3961 -17883
17346 -17883 -34616 -3104 11477 11147 31054 84221 109741 103284 96771 158947 173475 149985
17334 149985 75817 7162 -5638 24853 95688 78224 107814 125606 79977 56576 72775
17323 72775 120356 102089 53015 45962 58346 -5551 9292 76673 57025 50195 82593 48296
17311D8296n2065N942M963M2300L4957Q97J3511j4067l6272l7181J761K5059j0396
17298B7705l2528k2182j3452L3822o634m2235J7348K4607M5626K057J6490r512
17286D1112o45j0734l6324l4092m133M3623J8131k3585O817k775n930L5159J3591
17273D0215l0735k9562k4767j5139J7801L8789K6993J9083n0389m0192k8048L9476
17261c6475J6391j1832n095k9997J1930N5861O260m1595j5181j5389L2642Q6972
17249E4492Q661m8246j550o275j4760L0695k9868m3583l5244L9060L1231J7832
17237B445K8131L0401M7278J9423k0526l4871j8888o862k0369j0532j8194k376
17225d940q890k8536l7906j5476J4227M3728L2967P130j941k212L8117k8178J0192
$$ plain form
17311 48296 -3769 2173 7136 49436 84393 85290 98801 84734 48462 11281 13042 38101 27705
17298 27705 -4823 -27005 -40457 -6635 -13269 -55504 -38156 -13549 32077 34134 50624 41112
17286 41112 40467 29733 -6591 -40683 -44816 -1193 16938 -6647 170 -2605 -8535 26624 40215
17273 40215 9480 -20082 -44849 -59988 -42187 -3398 23595 42678 -7711 -47903 -75951 -36475
17261 -36475 -20084 -31916 -37011 -67008 -55078 783 7043 -34552 -49733 -65122 -32480 54492
17249 54492 63153 14907 13357 7082 -7678 23017 -6851 -50434 -85678 -46618 -15387 2445
17237 2445 30576 60977 108255 127678 107152 72281 53393 46531 26162 15630 -2564 -4940
17225 -4940 -13830 -42366 -80272 -95748 -81521 -37793 -4826 2304 363 -1849 36268 8090 18282
17212A8282L6777m375l7524p540L4446O5286l6689n8086N207m1431R434M7848
17200C1635N6868p21k5253m6412L4182J3803m316k6937j1745M8485N1010k4874
17188I5725k5894k7215j3708J5227l6519q223K6879K6287J518J4368K437o8340
17176B542l795N257o2195K7179L9664J0971j1970N349J1451L6612m3872N279M8429
17163G0901l8599p9515K028K7719M2317L678l5483M4458M527q156K9115O2760
17151A25750L8145N7221P045K4475J8885n2k8570m5830J9188L4222J5241K0138
17139B85858L7826P4354J3538j0109M2889M1142j533m2230n4631O248J4408K8972
17127D36732j0909j4326J458m272J3738L2790o727m278k0728l3312r710N326O616
$$ plain form
17212 18282 55059 50684 13160 5620 40066 105352 68663 10577 15784 -25647 -16213 31635
17200 31635 88503 87782 62529 16117 50299 64102 59786 32849 21104 69589 120599 95725
17188 95725 69831 42616 28908 44135 7616 -607 26272 52559 54077 68445 70882 2542
17176 2542 -1253 4004 -58191 -31012 8652 19623 7653 13002 24453 61065 17193 22472 70901
17163 70901 32302 -47213 -45185 -17466 24851 28529 -6954 37504 42031 33875 62990 125750
17151 125750 163895 221116 228161 252636 271521 271469 242899 197069 216257 250479 265720 285858
17139 285858 323684 398038 411576 401467 444356 485498 483965 441735 387104 393352 407760 436732
17127 436732 425823 411497 412955 408683 422421 455211 448484 444206 423478 390166 380456 385782 392398
17114C92398k4924n3263j429J8285j4963K8137L1112m703m4316p198L2885K1599
17102C73620l319N6355l480l0969J4899j0240m3699m4451m3371m8786J0350L4867
17090B61776L9064L9638L5038Q289j2082M8371K6649k1491m5484q339k4994R710
17078C56145l0450M172Q621j7979J750J8750r109o3037k300N0093k6598K7258
17066C17316L0776O0984N074k6066k1750p961N1626K6954N54l5494n673m8617
17054C47723n0593n0673J1091n430m9258n7610k4552m6291J5052R293l0351k6792
17042D1609k2377p921J2938L7956O298M966k2483J1170N5859J834k7713o3851
17030B8285m1408J0896R330J9984k7689m0917l0808L3721K9352K8473j4852k6235
$$ plain form
17114 392398 367474 314211 312782 331067 316104 344241 375353 370650 326334 319136 352021 373620
17102 373620 370301 426656 423176 392207 407106 396866 353167 308716 265345 216559 226909 261776
17090 261776 300840 340478 375516 383805 371723 420094 446743 425252 379768 371429 346435 356145
17078 356145 325695 329867 338488 320509 322259 341009 331900 268863 266563 316656 290058 317316
17066 317316 348092 409076 414150 388084 366334 358373 409999 436953 437507 402013 396340 347723
17054 347723 297130 246457 257548 252118 202860 145250 120698 74407 89459 98752 68401 41609
17042 41609 19232 11311 24249 62205 68503 73469 50986 62156 118015 119849 92136 28285
17030 28285 -13123 -2227 7103 27087 -602 -41519 -72327 -38606 -9254 19219 4367 -21868
17018b1868k2007L582J7044N1780K1107n0691P178k5756p947K3329l866k9657
17006c7772k627n259N1785O6720n622j7832j8010l8827l2155m0337J2669L9590
16994b7677K3899o114p294K9055L9979J3261l3631m9675L1079m0050k2086j4068
16982f3322k6897p271o118j5832K7303M6486j055R091M2084K9754P1491k8039
16970G7675j9882m985j3512m1754l4278m3517k8768l6392Q488M0621j0091l8693
16958a45088J2624k0777R971L9878O136M1737K5690Q177L2558K2279K8501K7347
16946H9033m069l1440n0283q956l3826J0426K6405l0722l3707L8428J5428q582
16934b1865K3434m6521J791P3975N7072k4172r654o8848J2413K5253J6850L1186
$$ plain form
17018 -21868 -43875 -40293 -23249 28531 49638 -1053 6125 -19631 -27578 -4249 -8115 -37772
17006 -37772 -40399 -45658 6127 72847 67225 49393 31383 -7444 -39599 -79936 -67267 -27677
16994 -27677 -3778 -9892 -17186 11869 51848 65109 31478 -18197 12882 -27168 -49254 -63322
16982 -63322 -90219 -97490 -103608 -119440 -92137 -45651 -46706 -37615 4469 34223 105714 77675
16970 77675 57793 52808 39296 -2458 -36736 -80253 -109021 -145413 -136925 -96304 -106395 -145088
16958 -145088 -132464 -153241 -143270 -103392 -97256 -55519 -29829 -21652 10906 33185 61686 89033
16946 89033 84964 53524 3241 -5715 -39541 -29115 -2710 -33432 -67139 -28711 -13283 -21865
16934 -21865 1569 -44952 -43161 30814 87886 63714 54060 -14788 -2375 22878 39728 70914
16922G0914j0320o1821n082j6698K7110j785R094k6579K8872k2399m0561M265
16910d4990M4158L4819m8600r1910L5865L7077j8265l3399J7637K2809k1481J0062
16898e6218M4456r764j907k5618K4113L5492J7854m0914n1134K0574K7150N97
16886a5319j8153O391m3253L4483K4991m4406m0828q913K0926M4768j7204M280
16874e2237K0248K0202K3597M8902L6182J1755q0080p6072k8442J1337l0335L3053
16862f1890J0439j5756j2484P3469N1916M732j7386k9116l8401k5205N547J7086
16850c7049J8105o854k0164l8901j0563L450J2419L6990j1270M0405k2474J9174
16838a6732j1881r397k5270J8652L6741l0910M184M834k1472M1494j54j8535l2486
$$ plain form
16922 70914 60594 -1227 -6309 -23007 4103 2318 11412 -15167 13705 -8694 -49255 -44990
16910 -44990 -832 33987 -14613 -106523 -70658 -33581 -51846 -85245 -67608 -44799 -66280 -56218
16898 -56218 -11762 -21526 -23433 -49051 -24938 10554 28408 -12506 -63640 -43066 -15916 -15319
16886 -15319 -33472 -27081 -70334 -35851 -10860 -55266 -96094 -105007 -84081 -39313 -56517 -52237
16874 -52237 -31989 -11787 11810 60712 96894 108649 28569 -47503 -75945 -64608 -94943 -61890
16862 -61890 -51451 -67207 -79691 -6222 45694 50426 33040 3924 -34477 -59682 -54135 -37049
16850 -37049 -18944 -25798 -45962 -84863 -95426 -91976 -79557 -42567 -53837 -13432 -35906 -16732
16838 -16732 -28613 -38010 -63280 -44628 -7887 -38797 -34613 -29779 -51251 -9757 -9911 -28446 -60932
16825f0932q249N4651K4121j1117l0574k969J8315J464j4409K019J1228K496P901
16812f055Q68j4339L536j5211K9973N8352j8088l6427l9205k4351K8174P4722
16800D1949j1932O191k2096L1872j4071p3967p1662R917L0881M2898L0575L0305
16788C0860J6835J3089M693l1860o1680j0001N8101K956j0751P749L450j6410
16776G031j6758j1859N462l0197J8430L9050J0756m7693j9809J845j8849M3642
16764a8949j89k4949j3648p39j4413M0747R910m7005J8840N0339K4229j3044K6878
16751C8007L5748p1439o359K1570k182o675q548K2479J0185J4400j0038p2155
16739c5007j1361L4468p885J5870n907Q215r245j7332N322j2280j4145j3336K0905
$$ plain form
16825 -60932 -69181 -14530 9591 -1526 -32100 -35069 -16754 -15290 -29699 -27680 -16452 -13956 -6055
16812 -6055 -5187 -19526 -15990 -31201 -1228 57124 39036 2609 -36596 -60947 -32773 41949
16800 41949 30017 36208 14112 45984 31913 -42054 -113716 -103799 -72918 -30020 555 30860
16788 30860 47695 60784 65477 33617 -28063 -38064 20037 22993 12242 19991 23441 7031
16776 7031 -9727 -21586 -16124 -46321 -27891 11159 21915 -25778 -45587 -43742 -62591 -18949
16764 -18949 -19138 -44087 -57735 -58474 -72887 -32140 -22230 -69235 -50395 -56 24173 11129 38007
16751 38007 73755 2316 -4043 17527 15345 8670 122 22601 32786 47186 37148 -35007
16739 -35007 -46368 -11900 -19785 -3915 -9822 -1607 -10852 -28184 -22862 -35142 -49287 -62623 -41718
16726d1718k2033o955L5173M7650j9956l7627k0655M5628k573k7367J6175m344
16714c8602o0814M2893L9946j1235P97M8762L6918j8383o0533M020K081m925n411
16701b4486L2581K1838m3612r663l7449j344K7051J8014k1439k4917Q316k68J3513
16688d1865q342m8382L7656J5672k3493N418K9532R152k5767K8616k2812k0602
16676f5217m950M0830R281l0722m407J381j6591K0147M3954N4168n469l8256l3506
16663b9357l0785M835N6008J3189m4569l2764j3683O69M8036j7309o3429N676
16651a03483M3613K6459J8449m5751l3487L974M6814M6748M1764l4903m6437K9065
16639g175J7183J4393K350m249K6835O521k3018m4369n5608p0236J2581O8496
$$ plain form
16726 -41718 -63751 -70706 -35533 12117 -7839 -45466 -66121 -20493 -23066 -50433 -34258 -38602
16714 -38602 -99416 -56523 -16577 -27812 -27015 21747 58665 40282 -20251 -16231 -14150 -19075 -24486
16701 -24486 8095 29933 -13679 -23342 -60791 -62135 -35084 -17070 -38509 -63426 -55110 -55378 -41865
16688 -41865 -50207 -98589 -60933 -45261 -68754 -63336 -33804 -24652 -50419 -21803 -44615 -65217
16676 -65217 -70167 -29337 -20056 -50778 -55185 -53804 -70395 -50248 -6294 47874 42405 4149 -29357
16663 -29357 -60142 -55307 701 13890 -30679 -63443 -77126 -76457 -28421 -45730 -109159 -103483
16651 -103483 -59870 -33411 -14962 -60713 -94200 -90226 -43412 3336 45100 10197 -36240 -7175
16639 -7175 10008 24401 26751 22502 49337 55858 32840 -11529 -67137 -137373 -124792 -56296
16627e6296N9126K5503j0398m3862M3336Q473l2009l1336M85O649k002M3977J6946
16614B8592l1012j1681j4683J3424J9914J221k9704J6133M4943j5416j6452L2337
16602C7616K4123j777j7645k5265K710j5186q102j4053k4912l2509j1590r059
16590i5649K9240k6664l537L8029L6813O316m199k4639Q690J8942M9973j0585
16578B2730k613j9132K6524k5433m3869j2917K1848K5959N284O653k1080j2599
16566b8645J7564L752M818L6651J0585k2447l5701K6900o112k914K0548J6339
16554D1338p6760m8901M2630N6728K0409j3198k065k4540K2937O570K9448k274
16542E2322j0288o3822J2906L092J6409J3927M0880j1158m9552J8178l5923M7551
$$ plain form
16627 -56296 2830 28333 17935 -25927 17409 25882 -6127 -37463 -36978 -30329 -32331 11646 28592
16614 28592 -2420 -14101 -28784 -15360 4554 5775 -23929 -7796 37147 21731 5279 37616
16602 37616 61739 59962 42317 17052 19762 4576 -3526 -17579 -42491 -75000 -86590 -95649
16590 -95649 -66409 -93073 -96610 -58581 -21768 -15452 -19651 -44290 -35600 -16658 33315 22730
16578 22730 20117 985 27509 2076 -41793 -54710 -32862 -6903 -1619 5034 -16046 -28645
16566 -28645 -11081 -7329 -2511 34140 44725 22278 -13423 13477 7365 4451 24999 41338
16554 41338 -35422 -84323 -41693 15035 35444 22246 20181 -4359 18578 25148 54596 52322
16542 52322 42034 -21788 -8882 -5790 10619 24546 65426 54268 4716 22894 -13029 34522
16530C4522j8736k3431L615J0576J1817J7339J4207J3701k9492l3829o5992k8497
16518i4200L2394J7969j1941K0663J8389J4308j7467R64P170m963K4924l6624
16506b8414j7344M6272j2553K1031N836k3927M836j836L6170J4713j5398k5450
16494C936p5647m9402M2673K8340L5070K2936l7930k6562l2430j5146J6239K4565
16482f3358M462J5849K0553k634J5866P592m9559N407k0055K740K0881l60k1722
16469f4338P2524M5368N876j9975n4369j0946J9224J7173L248J7212p483J4011
16457C7525R582O644l8757o4772J9564L8720L350l2026j688J5114l5857k3385
16445f5986K7709L6463m70K4026m443m6743j5678L0808L4190N576K1713j9993
$$ plain form
16530 34522 15786 -7645 -4030 6546 18363 35702 49909 63610 34118 289 -65703 -94200
16518 -94200 -61806 -43837 -55778 -35115 -16726 -2418 -19885 -18921 -11751 -16714 8210 -28414
16506 -28414 -45758 514 -12039 8992 14828 -9099 -4263 -6099 30071 44784 29386 3936
16494 3936 -71711 -121113 -78440 -50100 -15030 7906 -30024 -56586 -89016 -104162 -87923 -63358
16482 -63358 -58896 -43047 -22494 -25128 -9262 -1670 -51229 -45822 -65877 -63137 -42256 -42616 -64338
16469 -64338 8186 53554 59430 39455 -14914 -25860 -6636 10537 13785 30997 23514 37525
16457 37525 47107 53751 14994 -49778 -30214 8506 11856 -20170 -21858 -6744 -42601 -65986
16445 -65986 -38277 -1814 -2284 21742 17299 -29444 -45122 -14314 19876 25452 47165 27172
16433B7172J4408J1897k7068l7045K22l522L0605k1139p933m6758K9869N7956
16421B8664L0653j2669k851P2302P263k8218j9881n831j5354J4508J3241l8537
16409D3290p7844K1820J5336N9643j0951l2768L271O905o2595l0197j9240N1227
16397c2103L1937j5066l8123J4414k7499L6406n576J2103K5214r910M6315K30
16385C8342r540p787l7376j9143k164K8167L7311P575M720q200l6850L0333p079
16372A8309k2697k6407Q490N436m8834l2864L9908K6091k63Q142k9796J3009L6462
16359e014o413j4315L8920m6943j7661M3396J7891j7355l7604K4803O1931l0603
16347A1033m6044q537O1580k0213q370P411P087l2461m8700j3219M3633J9700
$$ plain form
16433 27172 41580 53477 26409 -10636 -10414 -13936 16669 -4470 -12403 -59161 -29292 28664
16421 28664 59317 46648 43797 116099 123362 95144 75263 69432 54078 68586 81827 43290
16409 43290 -34554 -12734 2602 62245 51294 18526 21797 28702 -33893 -64090 -83330 -32103
16397 -32103 -166 -15232 -53355 -38941 -66440 -30034 -35610 -23507 1707 -8203 38112 38342
16385 38342 28802 21015 -16361 -35504 -37668 -9501 27810 35385 40105 31905 -4945 25388 18309
16372 18309 -4388 -30795 -22305 -16869 -65703 -98567 -58659 -32568 -32831 -24689 -54485 -41476 -5014
16359 -5014 -11427 -25742 13178 -33765 -51426 -8030 9861 -7494 -45098 -20295 41636 11033
16347 11033 -35011 -43548 18032 -2181 -10551 -3140 3947 -28514 -77214 -90433 -46800 -27100
16335b7100k1284k0463N1896M3210j9016J1445l9324p406P060m059l7852k8120
16323i1013r007Q5644M5518k7414j0304K7862J0909l6281k7270k1938M4007j559
16311a0846k0685k6184l3057j867O2853L4954k9291n1813J005L7515J7431j8135
16299c8120J731Q7496K3964j3158l7270j1940j5551n3307M726J2296J274N403
16287c2456N063N700l3665k6361M7953J6579l3680R353j366k3823K5600K934j0910
16274d9079m7353q828K0387M9151K5901j6362j5352N602R192j6969K1694N4417
16262C2401J3078j6842j3162k8466l1202J1310M0501j7137r548j0153J4581j9030
16250c3669l6366L1162L6357O082m0222p87L3785j840J9209j8132P521P537Q528
$$ plain form
16335 -27100 -48384 -68847 -16951 26259 7243 18688 -20636 -28042 -20982 -25041 -62893 -91013
16323 -91013 -100020 -14376 31142 3728 -6576 21286 32195 -4086 -31356 -53294 -9287 -10846
16311 -10846 -31531 -57715 -90772 -92639 -29786 5168 -24123 -75936 -74931 -37416 -19985 -38120
16299 -38120 -36389 51107 75071 61913 24643 12703 -2848 -56155 -51429 -39133 -37859 -32456
16287 -32456 -27393 -21693 -55358 -81719 -33766 -17187 -50867 -41514 -42880 -66703 -41103 -38169 -49079
16274 -49079 -96432 -105260 -84873 -35722 -9821 -26183 -41535 -35933 -26741 -43710 -22016 32401
16262 32401 45479 28637 15475 -12991 -44193 -32883 7618 -9519 -19067 -29220 -14639 -33669
16250 -33669 -70035 -38873 -2516 3566 -36656 -37443 -3658 -5498 13711 -4421 3100 10637 19165
16237A9165k8809j0848K8247K9360l572L4409k1398k9806m2300J0011K552n773
16225a8762n2174P756O0827M7479n7975k6461o285J3231L1921J2432K6804J4457
16213E3250l9237k8959q730J4253J2406k8440J35P043j0153L5681j0569l4105
16201c7425r259Q476N014l0362J2834o08K644P158m086j4372J1859l3651J4074
16188f7704P5247O788m844K9866j3471j4645k8970L0783m9585k5815k2470J7463
16176f7357J8492M0690j8202J8552j6716l2915l2011K8288K2742K3101k6285N0164
16164H543K3273k0844j7889J5401j94o7449m1939J814L3936K6435J9334k9861
16152d9440j3309q737j8188N3282J3310n2770l0184J0463N3178J1138M0683N1153
$$ plain form
16237 19165 -9644 -20492 7755 37115 33543 67952 46554 16748 -25552 -15541 -12989 -18762
16225 -18762 -70936 -63180 -2353 45126 -12849 -39310 -45595 -32364 -443 11989 38793 53250
16213 53250 14013 -14946 -23676 -9423 2983 -25457 -25322 -18279 -28432 7249 -3320 -37425
16201 -37425 -46684 -38208 -33194 -63556 -50722 -51330 -48686 -41528 -45614 -59986 -48127 -81778 -67704
16188 -67704 7543 14331 9487 39353 25882 11237 -17733 13050 -36535 -62350 -84820 -67357
16176 -67357 -48865 -8175 -26377 -7825 -24541 -57456 -89467 -61179 -38437 -15336 -41621 8543
16164 8543 31816 10972 -6917 8484 8290 -59159 -101098 -99284 -65348 -38913 -19579 -49440
16152 -49440 -62749 -71486 -89674 -36392 -23082 -75852 -106036 -95573 -42395 -31257 9426 60579
16140F0579m9071o7365N487M4202L0129M520J859j3227K3485l1085Q002L5127
16128E2642p3819q5715K780K8679M3251J1988K2020m0959j2339j1502K8136L5393
16116E55N113K7704J4999m4524j7842P656l878n9511m6084L5188N5708M7328k0050
16103B362k2173O721q652j6369M2755M3392Q8k879P042M515k9984m0587m0906
16090e4675K871N6016J8009m8962k0262J335Q347K907l1552M115M1931J8648j8691
16077a9963M293L0468L383o3012m3575M9773K0700Q462L226R940r217k8733O164
16064b8091L0435L4344L3889j773R478j4029Q886k2969m0314K868j154L622K4365
16051C9557k2366j2513J8858J323J9053j0487n122J0333p231k0473l4701l705
$$ plain form
16140 60579 11508 -55857 -50370 -6168 23961 28481 30340 17113 40598 9513 17515 52642
16128 52642 -21177 -106892 -104112 -75433 -32182 -20194 1826 -39133 -51472 -62974 -34838 555
16116 555 5668 33372 48371 3847 -13995 -6339 -10217 -69728 -115812 -80624 -24916 22412 2362
16103 2362 -19811 -13090 -21742 -38111 4644 48036 48124 45245 52287 56802 26818 -13769 -54675
16090 -54675 -51804 4212 22221 -26741 -47003 -45668 -37321 -34414 -65966 -61851 -19920 -1272 -19963
16077 -19963 -15670 14798 18181 -44831 -88406 -38633 -17933 -9471 -6245 3695 -5522 -34255 -28091
16064 -28091 2344 36688 70577 68804 78282 64253 73139 50170 9856 12724 11570 15192 39557
16051 39557 17191 4678 23536 24859 43912 33425 28303 38636 31405 10932 -23769 -27474
16039b7474O0923k4417l0478m971K5841j7445L1727j1209l7105m5478m1245K1219
16027a00112O4023j043N509K23J6253J5389K957L3944Q069r910o528m5938l3429
16014e0593P163O4298K0775o1157k3928N913j586L5698M7549j4641j572n5383
16002b7464k0048O0902L0153j3077j3417j5642Q901r77m0163o595P1214Q364m3406
15989a255m9483j9685N3658j4572K7446O625L5816j7140l3347l0601j006M8250
15977D706L8718J1238l479q075m8394n2213J1353k9373k898j820P505J9832j4545
15964f7445J6271K6477m8486N0482N7388J1486J3019L191l0819j1843k1294P73
15952h00k5790K4665L329k3095l1327Q452J6515m708J0581k2094K0137L9968K7729
$$ plain form
16039 -27474 33449 9032 -21446 -26417 -576 -18021 13706 2497 -34608 -80086 -121331 -100112
16027 -100112 -36089 -37132 -31623 -31400 -15147 242 3199 37143 45212 35302 28774 -17164 -50593
16014 -50593 -43430 20868 41643 -19514 -43442 -37529 -39115 -3417 44132 29491 27919 -27464
16002 -27464 -47512 13390 43543 30466 17049 1407 10308 9331 -30832 -37427 33787 42151 -1255
15989 -1255 -50738 -70423 -16765 -31337 -3891 2734 38550 21410 -11937 -42538 -43544 4706
15977 4706 43424 54662 51183 43108 -5286 -57499 -46146 -75519 -78417 -80237 -72732 -52900 -67445
15964 -67445 -51174 -24697 -73183 -22701 34687 46173 59192 62383 31564 19721 -1573 -800
15952 -800 -26590 -1925 1404 -21691 -53018 -44566 -28051 -32759 -22178 -44272 -24135 15833 43562
15939D3562j3510J5870k3934m2109j0775J7013P7172N5752j8194n503m5345l2298
15927A7701K2481L1265J2194j457J1195P623o3206j3469J9329k4893K4689J2138
15915E5590K5901n0526r3261K11K4719K4844J6275k1286j0530l346m139m0062
15903g5610j2946P682J8915M3100J952q607j4616j8917K1438L0688J483L3780
15891B8342M2285J6181K5327J9487J4627j2799m9221l2045J5976J6148Q926m9858
15879D3376n9608K889O691j5975N697K7725N94j9923R016N93Q032K5533R285j663
15865D2262p0074q682o624m2761J2427P0873K9782J6511J4272J8072M52n6410
15853B0100p981n563j4504J0791m8489R292K9225N0607J8302j7957K876m274o9758
$$ plain form
15939 43562 30052 45922 21988 -20121 -30896 -13883 63289 119041 100847 95344 49999 17701
15927 17701 40182 71447 83641 82184 93379 101002 37796 24327 43656 18763 43452 55590
15915 55590 81491 30965 -62296 -62085 -37366 -12522 3753 -17533 -28063 -31409 -35548 -75610
15903 -75610 -88556 -80874 -61959 -18859 -16907 -25514 -40130 -59047 -37609 -6921 -5438 28342
15891 28342 70627 86808 112135 131622 146249 133450 84229 52184 68160 84308 93234 43376
15879 43376 -16232 -13343 -6652 -22627 -16930 10795 11389 -8534 482 1075 9107 34640 43925 42262
15865 42262 -27812 -36494 -43118 -85879 -73452 -2579 27203 43714 57986 76058 76510 20100
15853 20100 12119 6556 -7948 2843 -45646 -36354 -7129 43478 61780 43823 46699 42425 -27333
15840b7333L3018N8455m2325n5323k2415O5174Q680q091k0918K6868J5313n710
15828B5393l6612L203L608J2974K3372J2121J3998K731m1372p4441N947j410j0111
15815f0599L1064K686k3393L6897N045m596K7889L7750K0426j4333L671L434l1406
15802C4535K644k1058l664Q627j1827n880K247j9895N965k0909K0818j2066Q155
15789a2308J1024L9068j5347J3285m8528P562r143o958K1505k3833K9970Q626
15777A4923m5191O051J9572j8430J2791K8249Q784L4516J3652Q86l950j309M2136
15764A12680m0861n7344k6797L4961L0843n1123k7596J1126p439m697J2700L6843
15752B3296J1302l1148P811j9428J7830n245O080k5030j0830k8078j6927K1660
$$ plain form
15840 -27333 5685 64140 21815 -33508 -55923 9251 17931 9840 -11078 15790 31103 25393
15828 25393 -11219 -8016 -4408 8566 31938 44059 58057 60788 19416 -55025 -49078 -50488 -60599
15815 -60599 -29535 -26849 -50242 -13345 -8300 -12896 14993 52743 73169 58836 62507 65941 34535
15802 34535 37179 16121 12457 21084 9257 3377 5624 -14271 -8306 -29215 -8397 -20463 -12308
15789 -12308 -1284 37784 22437 35722 -12806 -5244 -14387 -21345 160 -23673 6297 14923
15777 14923 -30268 -24217 -4645 -23075 -10284 17965 26749 61265 74917 75803 71853 70544 112680
15764 112680 71819 14475 -12322 22639 53482 2359 -25237 -14111 -21550 -26247 -13547 23296
15752 23296 34598 3450 11261 -8167 9663 4418 10498 -14532 -25362 -53440 -70367 -48707
15740d8707P605L3526M7324J3750k9741k3444L3772K5082o5699k7897L2107J4734
15728A2412r992j229n1010k4304K8379L0997J3818l6129J0102q566j8472j0410
15716f4404J4433P5611L5653N377N59k4266K1417m598m1419j1929j1860Q567P749
15703A0890O084j3738j179R959K1189r238J7370k2094j0453J3094J8076j4827
15691B5133L324M8202n6718J0342j6270o5928J0818J8147j453l8499m7974k43
15679a11119L6860L8397j8077J2979J4841j3186K0284Kq479L7932J4026j9312
15667E148j9452M14J0833L132K1965K0735j0742M3186m59o4666m5149R799Q282
15654a6974L0082K7747j9981J1903p928p741R561o2095k6258K3431J1343K2889
$$ plain form
15740 -48707 -41102 -7576 39748 53498 23757 313 34085 59167 -6532 -34429 -2322 12412
15728 12412 2420 1191 -49819 -74123 -45744 -14747 -929 -37058 -26956 -35522 -53994 -64404
15716 -64404 -49971 25640 61293 66670 67229 42963 64380 59782 18363 6434 -5426 3141 10890
15703 10890 16974 3236 2057 12016 33205 23967 41337 19243 8790 21884 39960 25133
15691 25133 28457 76659 19941 30283 14013 -51915 -41097 -22950 -24403 -62902 -110876 -111119
15679 -111119 -74259 -35862 -53939 -40960 -26119 -39305 -19021 -19019 -27498 10434 24460 5148
15667 5148 -14304 -13890 -3057 75 22040 42775 32033 75219 74760 10094 -35055 -25256 -16974
15654 -16974 13108 40855 20874 32777 24849 17108 26669 -35426 -61684 -38253 -26910 -4021
15642d021q255r658K5291n250k2665j5669K719P46k7057O171L485l18K6454q151
15628c6178J364N2697P8074n723o7354l6147K3206L9836P46k3171j2334O218j3377
15615G857l354m627l5982L3085K4336k2810K7227O0035J6852p378m2168j2700
15603D0373k7225j816J2482m844M643j1780k6491j7149j0528N2504M3577K3430
15591G7176K2821p3847n5211k7893J9722J0935j0642k2754n6875K7065J9805k8859
15579i8557k4582K3307K1691p801J6730K3100J5743M2069j844l0204Q536K4005
15567A2193L6905r09m5128m2861q168K0238k8462o169K4066P3499j5616J8324
15555C7912q214J0838j4202j6715k5872Q033Q758j8159l0071L1895M1583J5640
$$ plain form
15642 -4021 -12276 -21934 3357 -1893 -24558 -40227 -37508 -36762 -63819 -57648 -54163 -54481 -28027 -36178
15628 -36178 -34814 17883 95957 90234 22880 -13267 9939 49775 50521 27350 15016 21234 7857
15615 7857 4503 -124 -36106 -3021 21315 -1495 25732 85767 102619 95241 53073 40373
15603 40373 13148 11332 23814 18970 23613 11833 -14658 -31807 -42335 10169 53746 77176
15591 77176 99997 26150 -29061 -56954 -37232 -26297 -36939 -59693 -116568 -89503 -69698 -98557
15579 -98557 -123139 -99832 -78141 -85942 -69212 -46112 -30369 11700 9856 -20348 -11812 12193
15567 12193 49098 48189 3061 -39800 -47968 -27730 -56192 -62361 -38295 35204 19588 37912
15555 37912 29698 40536 26334 9619 -16253 -8220 538 -17621 -47692 -15797 25786 41426
15543D1426J7734n119p851l7712j5671j2697l0745J4726M7107L9935R709j7782
15531D3060q517k9753k7735M207j349Q829m3306k5744N5892L720J5287J2927j4204
15518f686K8033K1215J1827k5525l1627k1127N257m6107m214P544J4569l6437
15506h3278l9877L9812P6671L076J7364q685k5058n930j1829K3789j2042K2663
15494c324M3738n196l4550o1993p505m1967M9139P8740m406l0914l2591j7888
15482f8717J6307j2420P782Q126m412r784j4938k0087M3991M4613M7037n870L3868
15469F5496J3823k8703k9938n9274k6251J1410J0462J5151M0371l0073m5993J8980
15457d4539P339l5400L006K8140N940N2373K4175j1240K419j1234k7326K49J7815
$$ plain form
15543 41426 59160 54041 46190 8478 -7193 -19890 -50635 -35909 11198 51133 60842 43060
15531 43060 34543 4790 -22945 -18738 -20087 -11258 -54564 -80308 -24416 -20696 -5409 7518 -6686
15518 -6686 21347 42562 54389 28864 -2763 -23890 -18633 -64740 -68954 -61410 -46841 -83278
15506 -83278 -123155 -83343 -6672 -3596 13768 5083 -19975 -25905 -37734 -13945 -25987 -3324
15494 -3324 40414 35218 668 -61325 -68830 -110797 -61658 17082 12676 -18238 -50829 -68717
15482 -68717 -52410 -64830 -57048 -48922 -53334 -63118 -78056 -98143 -54152 -9539 37498 31628 65496
15469 65496 79319 50616 20678 -38596 -64847 -53437 -42975 -27824 12547 -17526 -63519 -44539
15457 -44539 -37200 -72600 -69594 -41454 -35514 16859 41034 29794 32213 20979 -6347 -6098 11717
15444A1717N3363q270m4887k4979n988q442K1068J1206N0321j1426o2449j9240
15432c8006J2964n305l3304l5042j9826K4345J3600K1306r248k994K5801J9973
15420b5736j2667J6307L7293L350m2623j889N4036k3640k6758J6079M0489l0310
15408C931p294O660p0836J2247K935l2363K128P0276N5211k5658k5042l2729k491
15395d3025K0878M285P751j7110K397j6205K731M3252J4777L661k461j6932M8106
15382E2105k9860l9662j1657M1242J5947L7233J0297k4423p0733J7786O0313m628
15370E3960l8329l047j1099j325k317n2334l1019j1100M5066R430Q4k8745J8157
15357e2618L1542K2122p659j5173R518m521J6686k5828l456L5387J7001n8919
$$ plain form
15444 11717 65080 56810 11923 -13056 -19044 -27486 -6418 4788 55109 43683 -18766 -38006
15432 -38006 -25042 -30347 -63651 -98693 -118519 -94174 -80574 -59268 -68516 -71510 -45709 -25736
15420 -25736 -38403 -22096 15197 18547 -24076 -25965 28071 4431 -22327 -6248 34241 3931
15408 3931 -3363 3297 -67539 -55292 -52357 -84720 -82592 -12316 42895 17237 -7805 -40534 -43025
15395 -43025 -22147 -17862 -10111 -27221 -24824 -41029 -38298 4954 19731 23392 20931 3999 52105
15382 52105 22245 -17417 -29074 12168 28115 65348 75645 51222 -19511 -1725 58588 53960
15370 53960 15631 12584 1485 160 -2157 -54491 -85510 -96610 -51544 -42114 -42030 -70775 -52618
15357 -52618 -21076 1046 -6613 -21786 -12268 -16789 -103 -25931 -29387 6000 23001 -35918
15345c5918j5098M0664L1078K5225j5582p44p947k1165j5347K1367J178j6774
15333i063K324j3925q067J4915R767p670l3189l1777j4691L5178L0749j2599j7902
15320e5950k077l3128j900n390N6848M2785M97m1909k3776J1388P8618K883m8934
15307b0045P649L0359M648J225L703q409p410k2089J8291J359K4997L2383l6138
15294C0523o5655k5809r33L3210R932J5813J4603m8741L21q181l2853J5438M0275
15281b2057n366J2914n041r708n560m4039m523J4738M1058J9418m445q304l5058
15268e5973Q06L2677M3219q728m7842L6303J4652N878J5017N493K4610J7349n4021
15255B9440q2868m129R486L9839L0120q47J0714l4303l720K2501j1891k7349k6302
$$ plain form
15345 -35918 -51016 -10352 20726 45951 30369 29625 21678 513 -14834 6533 7711 -9063
15333 -9063 -6739 -20664 -28731 -13816 -4049 -11719 -44908 -76685 -91376 -56198 -25449 -38048 -55950
15320 -55950 -58027 -91155 -93055 -98445 -41597 1188 1685 -40224 -64000 -52612 26006 28889 -20045
15307 -20045 -12396 17963 22611 23836 27539 19130 11720 -10369 7922 9281 34278 66661 30523
15294 30523 -35132 -60941 -61874 -28664 -18732 -2919 11684 -37057 -36736 -44917 -77770 -62332 -22057
15281 -22057 -27423 -14509 -19550 -29258 -34818 -78857 -83380 -68642 -27584 -8166 -12611 -20915 -55973
15268 -55973 -55167 -22490 20729 12001 -35841 462 15114 20992 36009 41502 66112 83461 29440
15255 29440 -53428 -57557 -48071 -8232 21888 21041 31755 -2548 -6268 16233 4342 -23007 -49309
15242d9309o105J545L6520q132K963j9730j826l8929k9627M7480J0937P526M1585
15229e102j4195m1K8523L2818J3280K5989l1813P337N5749J2077n3891l3945l6030
15216G56n7977k8990O869M4322J050N3123K9785j0787J1064k5668j1030R737l7072
15203a4818k0301J1870L8922K9736j3847o742J4204n7690j5345M8995Q3432k1906
15191G6510n4329j1138l1501j7733J3849J4852J7804j4409n9432m6506P411l0283
15179a34905L3374J9200J3089P1865J4364M9732J2753l1065J4698j073m2806k6722
15167g496K7931M879m9697J816J94n953j2497L3350P829n9920k349L4711l3486
15154f0688K5254N4422L8947l7354l903R57m6558j0390L0840J1249n3239J3323
$$ plain form
15242 -49309 -55414 -53869 -17349 -25481 -22518 -42248 -44074 -83003 -112630 -65150 -54213 -46687 -5102
15229 -5102 -19297 -19338 9185 42003 55283 81272 49459 56796 112545 124622 70731 36786 756
15216 756 -57221 -86211 -79342 -35020 -33970 19153 48938 38151 49215 23547 12517 22254 -14818
15203 -14818 -35119 -23249 15673 45409 31562 24820 39024 -18666 -34011 14984 98416 76510
15191 76510 22181 11043 -20458 -38191 -24342 -9490 8314 -6095 -65527 -112033 -104622 -134905
15179 -134905 -101531 -82331 -69242 2623 16987 66719 79472 48407 63105 62032 19226 -7496
15167 -7496 20435 25314 -24383 -22567 -22373 -28326 -40823 -7473 356 -59564 -61913 -27202 -60688
15154 -60688 -35434 18988 57935 20581 16678 17635 -28923 -39313 -8473 2776 -50463 -37140
15142c7140N8996k013l9746p18j0294J5129J2637M3860l2170j3377K3146K6225
15130D4535q5389l4527J2708O3526k2036m3742M4733N6565k619l9242l8936P2852
15118B8428O3319m0400m2114Q634K8763k8977k6130K3149J5553J7551K1436l804
15106F5408o5367j3632M6215J5922k9293J8773k4587n2171l2565M0574M7703o731
15094A0249j5414P914M3227m3021l6960K3583p463J1806N5048J2592J6185K7728
15082A05474m5912o5480J3824J6045K1149N145P413j7604o0555k2145j3096j3107
15070f8849J9300O833j783K8263q531j1262j8922K3327m484N6592J1788K359j0589
15057B4042q981n701K1652j5474J8113m3497m4610J4580N1897K9956j0822l7372
$$ plain form
15142 -37140 21856 19843 -19903 -20621 -30915 -15786 -3149 40711 8541 -4836 18310 44535
15130 44535 -40854 -75381 -62673 853 -21183 -64925 -20192 36373 33754 -5488 -44424 28428
15118 28428 91747 51347 9233 17867 46630 17653 -8477 14672 30225 47776 69212 65408
15106 65408 41 -13591 32624 48546 19253 38026 13439 -38732 -71297 -30723 16980 10249
15094 10249 -5165 2749 45976 2955 -34005 -10422 -17885 -6079 48969 61561 77746 105474
15082 105474 59562 -5918 7906 23951 45100 50245 57658 40054 -20501 -42646 -55742 -68849
15070 -68849 -49549 -42716 -44499 -16236 -24767 -36029 -54951 -31624 -36108 20484 32272 34631 24042
15057 24042 15061 9360 31012 15538 33651 -9846 -54456 -39876 12021 41977 31155 -6217
15045f217m5221J27J3466L2087k6596l8300J9343j2835M9645J2150Q136K3474
15033B9259o8l0247r093J5308q660k0269J6890o570j9301k665n1600O476n234
15020h5774M6273K0713n927k884J5047j291j4104L208m5482q007k001J489L0960
15007d7780R174K2697R480k7718l7492L0848L8944N593m1005J0491J3933J5000
14995B165N468J9309k8331j1214L1305J9179j4337P4807J2781o3300n8813j991
14983a2972O1668K9152p675k1033m9478l7186m2511k1019j5493R303M2327K4679
14971d0238m6796l7764M4933M6160J1479j9928L7877M2922j7137O788l3987J6101
14959A0410J3815k3313l1122L2991J1739j8181J4513K1796J0359j0553k5708k2807
$$ plain form
15045 -6217 -51438 -51311 -37845 -5758 -32354 -70654 -51311 -64146 -14501 -2351 5785 29259
15033 29259 29191 -1056 -10149 5159 -3501 -23770 -6880 -13450 -32751 -35416 -87016 -80540 -85774
15020 -85774 -39501 -18788 -24715 -27599 -12552 -13843 -27947 -24739 -70221 -78228 -80229 -78740 -47780
15007 -47780 -38606 -15909 -6429 -34147 -71639 -40791 -1847 3746 -37259 -26768 -12835 2165
14995 2165 7633 26942 -1389 -12603 18702 37881 23544 98351 111132 47832 -10981 -12972
14983 -12972 48696 77848 70173 49140 -338 -37524 -80035 -101054 -116547 -107244 -64917 -40238
14971 -40238 -87034 -124798 -79865 -33705 -22226 -42154 -4277 38645 21508 28296 -5691 10410
14959 10410 24225 912 -30210 2781 14520 -3661 10852 32648 43007 32454 6746 -16061
14947a6061J3186K2414J3204o644R940r637K2146N209L21J9705l2361l5818j0632
14934e028p6l2803M6362N972n0753j0328j9605l5264k4709L8450K2992r568J1843
14921f2515J9292N1665L3508M1732R041j0444k7932l1264l0111J3284m367p194
14909e305j0225l548n2580r012O4653L2256L260m0673k6897j0632J3484K155j6407
14896e9471L3043M4038L1107P00N6562K810j5785j8106L124L242k9528j0353k4404
14883A6979J7345M9607m9908m9185n0524K9834J1659k9446K2288O9399l0932o9282
14871f2166J5434J4642r762M8412L0247m6813K2980L0337j1292O914N476j43j4299
14858B9967m2825l8294m046M4952K140k4406j2606r365K1573l0952N7222M4856
$$ plain form
14947 -16061 -2875 19539 32743 26099 36039 26402 48548 53757 54078 73783 41422 5604 -5028
14934 -5028 -5104 -37907 8455 14427 -36326 -46654 -66259 -101523 -126232 -87782 -64790 -74358 -62515
14921 -62515 -43223 8442 41950 83682 92723 82279 54347 23083 -7028 6256 1889 -5305
14909 -5305 -15530 -19078 -71658 -80670 -16017 16239 19499 -21174 -48071 -58703 -45219 -43064 -59471
14896 -59471 -26428 17610 48717 49417 105979 108789 93004 74898 78022 81264 51736 41383 16979
14883 16979 34324 83931 34023 -15162 -65686 -35852 -24193 -53639 -31351 38048 7116 -62166
14871 -62166 -46732 -32090 -41852 6560 36807 -10006 12974 43311 32019 38933 44409 44266 29967
14858 29967 -12858 -51152 -55198 -10246 -8106 -32512 -45118 -54483 -32910 -63862 -6640 38216
14846C8216K8472j2066k6225j6535J0203r324K0876p906r710r662M2972M735o1299
14833g253R524L9981J6671j6807l5795J6671L2107r958k6701l0611O354L1638
14821B5821J3302K1417o190j9502n6665m0816K9904n644K1402K5206k1n011j3710
14808a0507L028K0085j416k3850n957M5340r556K2732J9978m334j8703p5584L0174
14795h570M2760m135l6235P020M6355K780J7442M2338K4523m7826m0869P138P861
14782F0582l2428p2558k3568j2409R189J0594J1937L5796J1261q945Q050j4931
14770a7430j8206R430K6463J5853q340J8156L0305R058m2909j4303j2809k1985
14758b6717l0347j6797L6486L4584L7123M478j9975R542N906K642Q89j7594j8343
$$ plain form
14846 38216 66688 54622 28397 11862 22065 12741 33617 25711 16001 6339 49311 54046 -7253
14833 -7253 2271 42252 58923 42116 6321 22992 55099 45141 18440 -12171 -5817 25821
14821 25821 39123 60540 54350 34848 -21817 -62633 -32729 -38373 -16971 8235 8214 3203 -10507
14808 -10507 -7479 12606 11190 -12660 -18617 26723 17167 39899 59877 55543 36840 -38744 -8570
14795 -8570 34190 30055 -6180 840 47195 49975 67417 109755 134278 86452 45583 52721 60582
14782 60582 28154 -44404 -67972 -80381 -71192 -60598 -48661 -12865 -1604 -10549 -2499 -17430
14770 -17430 -35636 -26206 257 16110 7770 25926 56231 65289 22380 8077 -4732 -26717
14758 -26717 -57064 -73861 -37375 -2791 34332 38810 18835 28377 34283 36925 37814 20220 1877
14745A877r914L436K1139K3008l1007j0094K6601K7984k4230j9920j0985l4192
14733c6297p593K1916P504O687m2130l5685P4224j2341l1606l6912M5012J4460
14721c2761N080k241J0665J7152j7530k3115L9051J482M854j4168m6926J5866
14709d2591N0519M1017j3403m3841j7603P528K7935l4720J5579N8668N7452K0939
14697A27479l1125j1673l9757l8529K3552l708m7866o680L3627J915J1606L7250
14685E6091j4575n5759M648j2761M7713N3528K8798J1420j9266k6987P216k6800
14673E3266k7967M422j4778r854j0768K1631K7508r646k0576j1137J87K1974N61
14660B4823m5009j1820P0936K3493m4222p0139m5101l953L1728K0029L2601L1966
$$ plain form
14745 1877 -8037 -4601 16538 39546 8539 -1555 25046 53030 28800 8880 -2105 -36297
14733 -36297 -43890 -21974 -14470 -7783 -49913 -85598 -11374 -23715 -55321 -92233 -47221 -32761
14721 -32761 -27681 -29922 -19257 -2105 -19635 -42750 -3699 -2217 2637 -11531 -58457 -42591
14709 -42591 7928 48945 35542 -8299 -25902 -18374 9561 -25159 -9580 49088 106540 127479
14697 127479 96354 84681 44924 6395 29947 26239 -21627 -28307 5320 7235 18841 56091
14685 56091 41516 -14243 -9595 -22356 25357 78885 107683 119103 99837 72850 80066 53266
14673 53266 25299 29721 14943 5089 -5679 15952 43460 33814 13238 2101 2288 24262 24823
14660 24823 -20186 -32006 38930 62423 18201 -51938 -97039 -100992 -69264 -49235 -16634 15332
14648A5332L5292K6778J2609k1259m9834l601J2661m2474m2505P0175K5771m0015
14636a070o099J9625j195j9151R903k5377K8650L5649j5646K0122l8892j6229
14624i710L3519j6537k6484l1616N0907L6914j8544k9630J133J9336J5322o7673
14612d3063p1600Q172N3789L8410K6701l540p047o656K2574M8913M5586q618l0644
14599G2977p533l2602j184L237l6132o1241j7247N2627K3602n2371l2222J104
14587h6985J2737K1497O4221J2124k3049o8361k8977K5215J6246L7850L1215j1721
14575B012N0021r781j6803k8858k0266M0172p035n596K8631J2195k1677j2916
14563A0099L6042l0455J3690P482n957l9357Q596r932l7257l0201K5962K720L2973
$$ plain form
14648 15332 50624 77402 90011 68752 18918 15317 27978 -14496 -57001 13174 38945 -1070
14636 -1070 -7169 12456 11261 -7890 2013 -23364 5286 40935 25289 45411 6519 -9710
14624 -9710 23809 7272 -19212 -50828 79 36993 18449 -11181 -10048 9288 24610 -43063
14612 -43063 -114663 -106491 -52702 -14292 12409 8869 1822 -4834 17740 66653 112239 103621 72977
14599 72977 65444 32842 31658 34895 -1237 -62478 -79725 -27098 -3496 -55867 -88089 -86985
14587 -86985 -74248 -52751 11470 23594 545 -67816 -96793 -71578 -55332 -17482 13733 2012
14575 2012 52033 42252 25449 -3409 -23675 16497 9462 3866 32497 44692 23015 10099
14563 10099 46141 15686 29376 36858 30901 -8456 140 -9792 -47049 -77250 -51288 -48568 -15595
14550a5595J4394M470L0300j3526l8716k2211M2114O91J3066N7041K136m1993
14538C2171l3522J6364k3649r837J5087M4072K1174j2042k7004M476R075Q097
14526D4462k6126K6979K195p355k3102J5894J5853L7331J537j3749q7493l7604
14514e1178j8111K6616K0640k0604l1439M4397N0717L4248J0521k1281l364j061
14502D0101k0504j0495J6956k093J8809l7648R024j5722m1023O107J5238O500
14490a4750K0261K9666k106o032Q048j9366N7745k7633k1209j042J9556p491j9925
14477A5722R280L6733J9842l0701J202L9549j0840k0109l7706K2074M704m0777
14465H973j4753K0653J8198O7983J3572k3415l2659m685m9295k4286J3484r525
$$ plain form
14550 -15595 -1201 3269 33569 20043 -18673 -40884 1230 1921 14987 72028 74164 32171
14538 32171 -1351 15013 -8636 -18473 -3386 40686 61860 49818 22814 27290 36365 44462
14526 44462 18336 45315 47510 40155 17053 32947 48800 86131 87668 73919 -13574 -51178
14514 -51178 -69289 -42673 -22033 -42637 -74076 -29679 21038 55286 65807 44526 41162 40101
14502 40101 19597 9102 26058 23965 42774 5126 14150 -1572 -42595 -36488 -21250 -14750
14490 -14750 5511 35177 33071 27039 35087 15721 73466 45833 24624 23582 43138 35647 15722
14477 15722 25002 61735 81577 50876 52078 91627 80787 60678 22972 45046 49750 8973
14465 8973 -5780 14873 33071 101054 114626 91211 58552 53867 4572 -19714 -6230 -15755
14453a5755k1651l987Q4952R854r102k5988L731K0705j6029o672Q611K3997K420
14440E5086j6452K448J3621j6554J853k3300k3196r580O684j9573J3029J2415
14428c519k58L7006L7929Q626j5520l2200J3113j2516N478j5882k5496L878j965
14415a326l8528J3748l9846J7071J4607J5255R632o210K227j090P933L0492J7058
14402D1023L728J2128m5679k3618K7833j9591j3692P485j093k2236l2599J3744
14390e2567L536p314L9920K3334L0129k0128p493n306K4496j4611k8537j5851
14378c0392j040L6568K5602j5429N187P1771J5089j7216o469r408J6025J9893
14366A10181n8602o043J9408l0823j5976o173k1215J8539K8911j1115j1626O0454
$$ plain form
14453 -15755 -37406 -41393 43559 53413 44311 18323 22054 42759 26730 20058 28669 52666 55086
14440 55086 38634 41082 54703 38149 40002 16702 -6494 -16074 -9390 -28963 -15934 -3519
14428 -3519 -3777 33229 71158 79784 64264 32064 45177 32661 38139 22257 -3239 639 -1326
14415 -1326 -39854 -26106 -65952 -48881 -34274 -19019 -9387 -15597 -13370 -14460 -6527 23965 41023
14402 41023 44751 56879 11200 -12418 15415 -4176 -17868 -10383 -11476 -33712 -66311 -52567
14390 -52567 -49031 -56345 -16425 6909 37038 16910 9417 4111 28607 13996 -14541 -30392
14378 -30392 -31432 5136 30738 15309 20496 92267 107356 90140 83671 74263 90288 110181
14366 110181 51579 45536 64944 34121 18145 11972 -9243 9296 38207 27092 15466 75920
14354G5920K3093m7657l9940M1690m1778m553K980M623m8591o106L0368J9845
14342I894q38o660K4583q671R71L5961m4899l3259J6649J4364Q870j0666J8871
14329B5170R959K3652J4286j1681r323k6207K3387n393l7971K0319l520k2107
14317E71j0556l9688K3205L2084M9836K7186J1024m8660M965n914K2244r432q925
14304D7940M3874M8385k1369m0836l3799l1656j2164J1887L9832j6535l984j3142
14292A8433q71n524Q438p498m9929j1790L2389N1154K3821K8851L5826k6135l4195
14279F2970N587K5139J5612m6932m1926K9294K0882l6359M4737l386l9336M108
14267D0390j167j849M4168j1846n8881k8417L0387K5864J4746n063m7971r822
$$ plain form
14354 75920 99013 51356 11416 53106 11328 6775 9755 14378 -34213 -40319 -9951 9894
14342 9894 9056 2396 26979 18308 19279 55240 10341 -22918 -6269 8095 16965 6299 25170
14329 25170 35129 58781 73067 61386 52063 25856 49243 43850 5879 26198 22678 571
14317 571 -9985 -49673 -26468 5616 55452 82638 93662 45002 49967 44053 66297 56865 47940
14304 47940 91814 140199 118830 77994 44195 12539 375 12262 52094 35559 31575 18433
14292 18433 17562 12038 20476 12978 -36951 -48741 -16352 34802 58623 87474 123300 97165 62970
14279 62970 68557 93696 109308 62376 20450 49744 70626 34267 79004 75618 36282 40390
14267 40390 39223 37374 81542 69696 10815 -17602 12785 38649 53395 48332 361 -9461
14255i461L9169k7126j2536J1371K1057M241M484J4616K4012J0307j0820l9115
14243C0199L112K4432M4275m3746l5926J8155J8058k6668M7031J5875k424l2795
14231E9578m8387n97K0413L6826K3620J9411J8274l7678o3518l3934N2471P4420
14219A20899j0322m4490M181K4166j7138j480p882J001l9604m3062k5288L1468
14207g551N0887M6444P951k2281m7956J5849J8520n874k2179K445L2593J6107
14195H4955l3537n639N0921R5059J7360n1317L9873Q0117J11342Q5371Q5960R116
14183E69581j22329j57248r9585L859l1387j05167k5817J6799j398J1474L5261
14172I4043L2353R602r251k9395L631j2570P643k8763o8188k6217J3719L4293
$$ plain form
14255 -9461 29708 2582 -9954 1417 22474 26715 31199 45815 69827 80134 69314 30199
14243 30199 33311 57743 102018 58272 22346 40501 58559 31891 78922 94797 92373 59578
14231 59578 11191 10594 31007 67833 91453 110864 129138 91460 27942 -5992 46479 120899
14219 120899 110577 66087 70268 94434 77296 75816 67934 68935 29331 -13731 -39019 -7551
14207 -7551 43336 89780 97731 75450 27494 43343 61863 55989 33810 36255 68848 84955
14195 84955 51418 45779 96700 191759 209119 157802 197675 277792 389134 474505 560465 569581
14183 569581 447252 290004 190419 194278 162891 57724 31907 48706 47308 58782 94043
14172 94043 126396 135998 126747 97352 100983 88413 96056 67293 -895 -27112 -13393 20900
14160B0900L7481j0463j1374m1196k3473L1338K7401m2444J259L5297J7435k8653
14148A3508Q171l9786J6897M9200R268k1836J9725M0477j380m6514m2572r394
14136d236j5100L9889n124o495k613l3233L5119M5932k2917J3346L3823j1292
14124F7099m5830l5555K2785j2818M8088J5989m0002n0930K0819L1045j0194n1102
14112d0606P5171K1013m1091K7489q765J8533r833k8749k1528J5857q133l7323
14100c7965m0141j4950P3908J0115J816L5766O5432N769q247m050n5874l4213
14088b634N742J4394J5888j1946N46r283k754R165K0455L4026k046n930j9898
14075D5725m3896j4103K4056K9566j78l7509k6919j4771k7637j3177N8103L2176
$$ plain form
14160 20900 58381 47918 36544 -4652 -28125 3213 30614 -11830 -10571 24726 42161 13508
14148 13508 21679 -18107 -1210 47990 57258 35422 55147 95624 94244 47730 5158 -4236
14136 -4236 -19336 20553 15429 8934 6321 -26912 8207 54139 31222 44568 78391 67099
14124 67099 21269 -14286 8499 -4319 43769 59758 19756 -31174 -10355 20690 10496 -40606
14112 -40606 34565 55578 14487 41976 33211 51744 41911 13162 -8366 7491 -642 -37965
14100 -37965 -78106 -93056 -19148 -9033 -7217 28549 93981 99750 91503 87453 31579 -2634
14088 -2634 3108 17502 33390 21444 21990 12707 9953 19118 39573 73599 71553 65623 45725
14075 45725 1829 -12274 11782 41348 41170 3661 -23258 -38029 -65666 -78843 -20740 11436
14063A1436k9128K5190L3638M4479r428l8058j63k5500k9008M270L5195M1046
14051F3969j8698j5867j2098m2122j4479J5933L9009j184R359K6660k4901r056
14039A6525M4191L1444L134o2272m8939M522n682K3464K3028J8338k7914J5837
14027C5676j5255k6384M444O409K2130l8348l505K3644L5560J9878o406m0709
14015A7134P552L4046J0965K2613M494l4243P101J0757k0477j6602l581Q070j206
14002D6623J1128K8461l7887k9096m18k8977j7101j4312M4442N4654J9309k4548
13990E2278o621m6116j3608J411R729N3618M3514Q847j2701m607q801r52j2627
13977F3364o344j6099k2271k9241K3241J0704l3068M420K8930j8333k8366k301
$$ plain form
14063 11436 -17692 7498 41136 85615 76187 38129 37966 12466 -16542 -12272 22923 63969
14051 63969 45271 29404 17306 -24816 -39295 -23362 15647 14463 23822 50482 25581 16525
14039 16525 60716 92160 95294 33022 -15917 -11395 -17077 6387 29415 47753 19839 35676
14027 35676 20421 -5963 -1519 4890 27020 -11328 -14833 8811 44371 64249 57843 17134
14015 17134 24686 58732 69697 92310 96804 62561 69662 80419 59942 43340 39759 47829 46623
14002 46623 57751 86212 48325 19229 18811 -10166 -27267 -41579 2863 57517 76826 52278
13990 52278 45657 -459 -14067 -12656 -2927 50691 94205 103052 90351 85744 76943 75991 63364
13977 63364 57020 40921 18650 -10591 12650 23354 -9714 -5294 23636 5303 -23063 -25364
13965b5364Q157P2217P633L3211J7932j9992m7373k0506p176J7446K6905j7757
13953D5333j5567N62q01j5884k4352K4124K5967k3208k2938j472L325o034Q086
13940b859m2j437n9651K6020L9614M5454k4081k4118l4091j4944j0375k6243N600
13927h1153L6062J9005M660L2745M7216j0193o4045m2048P218N0829J3203m025
13915I474r374k2690P2132O8761L49o8311j4608J3606J3190k0140k14L010N1459
13902I6644J6542M857k2951k2773j5758O890J5581k6239l081O28M1823J9784j8148
13889I3799k4950o6799m3425M6129r864k2759N8119M6151p118k927O10k5357M6796
13876H8405M8626r745n4199n1839J4877K4913m1243k7377N297M7941l580j8847
$$ plain form
13965 -25364 -17207 55010 62643 95854 113786 93794 46421 25915 18739 36185 63090 45333
13953 45333 29766 30328 29527 13643 -10709 13415 39382 16174 -6764 -8236 -4911 -10945 -2859
13940 -2859 -2901 -4338 -63989 -37969 1645 47099 23018 -1100 -35191 -50135 -60510 -86753 -81153
13927 -81153 -45091 -26086 -21426 11319 58535 48342 -15703 -57751 -50533 296 13499 9474
13915 9474 100 -22590 49542 118303 118652 50341 35733 49339 62529 42389 42175 45185 96644
13902 96644 113186 118043 95092 72319 56561 63451 79032 52793 49712 50340 92163 111947 93799
13889 93799 68849 2050 -41375 4754 -5110 -27869 30250 76401 69283 66356 66966 41609 88405
13876 88405 137031 127286 73087 21248 36125 61038 19795 -7582 -2285 45656 42076 23229
13864B3229K8668k6733n1379L411L2955L1734n503L1529j2969o862J290P935L802
13851F1107L4954K6333k0712j1520l2030o847L607j3700m8908O548M680K5691
13839B9203J9659j956k629L1094K6577j5969k6605J5946J0587l8161r499K4157
13827F2404P467k5432j492K1861j7309m0395m7763k8465O939O1723O201K159J8982
13814B6880k7384k0625K3039M4183N6717l906m993j34j1960l7211j9811L354K7936
13801E6085K777k3239K9434K6686l8662Q239J996m9866l2632k3199K218K0839
13789a9324J4090l99Q8509K9574Q467l9121n8415L0759M7452n666J6997K1513
13777A34436j1037k0499m96l7930k1407K2746j5633j6836L0206Q812j7503m6975
$$ plain form
13864 23229 51897 25164 -26215 -22804 10151 41885 36382 67911 54942 48080 49370 57305 61107
13851 61107 96061 122394 101682 90162 58132 51285 54892 41192 -7716 -1168 3512 29203
13839 29203 48862 46906 44277 75371 101948 85979 59374 75320 85907 47746 38247 62404
13827 62404 69871 44439 42947 64808 47499 7104 -40659 -69124 -62185 -462 5739 7898 26880
13814 26880 -504 -21129 1910 46093 102810 98904 93911 93777 81817 44606 24795 28149 56085
13801 56085 58862 35623 65057 91743 53081 61320 63316 13450 -19182 -42381 -40163 -19324
13789 -19324 -5234 -5633 82876 112450 120917 81796 23381 54140 101592 95926 112923 134436
13777 134436 123399 102900 102404 64474 43067 65813 50180 33344 63550 72362 54859 7884
13765G884m9416l78K7355K9585l978J0545r098J4147L2390q712n4829p1446M375
13752g1576K9692O7253P2283j8176k9142r180M3281j889J2924q973L6622J7544
13740A40663o3032k8073j2033j0712J3300K6650J7729p85K496K1547J3745p608
13728A13887J4627M1449p146p6287n8404k5720L4676M8495k5036j757J8530O139
13716H3453K2373J0099J8346O026J3479J658L2909R989O9859Q3659R4918J8949
13704D65717n453j9832l778o5606q9497l1171R774o424m6215M147m8597o2937
13692A00128k6184k1375j2627K6542P642M2326K9368K4502J977k2219k4453L7871
13680A63498N0011l9094l9869Q703j2458Q0284K5067J5971r868j471L0304R0135
$$ plain form
13765 7884 -41532 -41910 -14555 15030 11052 21597 12499 26646 59036 50324 -4505 -75951 -71576
13752 -71576 -41884 25369 97652 79476 50334 41154 84435 82546 95470 86497 123119 140663
13740 140663 77631 49558 37525 26813 40113 66763 84492 83707 86203 107750 121495 113887
13728 113887 128514 169963 162817 86530 28126 2406 37082 85577 60541 58784 77314 83453
13716 83453 105826 115925 134271 140297 153776 155434 188343 198332 268191 351850 446768 465717
13704 465717 460264 440432 436654 371048 281551 250380 260154 253730 207515 211662 163065 100128
13692 100128 73944 52569 39942 66484 74126 116452 145820 170322 172299 150080 125627 163498
13680 163498 213509 174415 134546 143249 130791 211075 236142 252113 242245 240774 271078 361213
13668C61213O8000N8212J32803J54429J61438J44161L2704r1857j29918j37679
13658G53506j45306r8077j04549r3901J0483o6185m1342K1456N594m4208m5406
13647A52065p4190k0192M1250Q561k5300K3562M4700Q749k3751M0899k4663j0499
13635A41191k0515J329L637K0856j6216M8305N5918J4145J3583M5721N3547Q9653
13623D51154L7183L9369L5907k2900m6144n9779m3679p4794p9655l4021k5525
13612A77116k8375P399L7896M429N146n224P253j6193k5471L2506j272m2258k9497
13599A23455n2098j6443m1211m402K0768K7324K4186k3575j9618k6389k4501J7867
13587E363L7941L1613J4822j8495K3403J1682k4874q38m319K910J6833j903l8239
$$ plain form
13668 361213 429213 487425 620228 774657 936095 1080256 1112960 1021103 891185 753506
13658 753506 608200 510123 405574 311673 322156 255971 214629 236085 241679 197471 152065
13647 152065 77875 57683 98933 107494 82194 105756 150456 159205 135454 176353 151690 141191
13635 141191 120676 122005 125642 146498 130282 178587 234505 248650 262233 307954 361501 451154
13623 451154 488337 527706 563613 540713 494569 434790 391111 316317 236662 202641 177116
13612 177116 148741 156140 194036 198465 203611 198387 205640 189447 163976 196482 195210 152952 123455
13599 123455 71357 54914 13703 9301 30069 57393 81579 58004 38386 11997 -12504 5363
13587 5363 43304 74917 89739 71244 94647 106329 81455 80617 76298 79208 96041 94138 55899
13574E5899J2149j9464K1227N5092r508j6107L3736k052j3712r888K9815K115
13562A39302n281m473k1791l7309j7342q401p577m906K6798L5344M0222j0264
13550A24322N213J4440n9076k5866K5906N3366J7691l5470k743O422j8907k7808
13538G7490K1348O447l9744r063P83N633J3099J7882J5954k8999K0106M3741L3471
13525A78148J0032k2690l1275k9047r678M1909J3891l8717m194N491M1500k562
13513A52808k6414P334Q626m6722l2085K0070M1866K9244r439n599l9316j8149
13501H2224L8082J9220j4490k5544K8063R917l2222K6167K443m7017K8749J1867
13489A27459j5031l5273K1027j6973k2722J675M8825R525n5489L079p639j371
$$ plain form
13574 55899 68048 48584 69811 124903 115395 99288 133024 130972 117260 107372 137187 139302
13562 139302 134021 129548 107757 70448 53106 44705 37128 32222 59020 94364 134586 124322
13550 124322 129535 143975 84899 59033 84939 138305 155996 120526 117783 124205 105298 77490
13538 77490 98838 105285 65541 56478 57261 62894 75993 93875 109829 80830 100936 144677 178148
13525 178148 188180 165490 134215 105168 95490 137399 151290 112573 108379 113870 155370 152808
13513 152808 126394 133728 142354 95632 63547 83617 125483 154727 145288 139689 100373 82224
13501 82224 120306 139526 125036 99492 127555 137472 105250 131417 133860 86843 115592 127459
13489 127459 112428 77155 98182 81209 58487 60162 108987 118512 63023 66102 58463 57092
13477E7092M6886O8164k83j8153K4778L3684J412o7736m852q925L7789l1589m3475
13464I4792O6901J1625k6103L0939K3539J0878J3635J4925l0114k0665k7649n3806
13452A08897j2259O2672M567k0427L1022K9140k1237l3723O967J0251m195R821
13440A71496k7879l4831n706J981J1265k8231l5998K6637K0643L2649J8095J4771
13428A64892k2761L511J9626J670Jr001r341o918K2657K2995N167o980n389L6154
13414B16283k3053m8301k0264K2421j2190P075j1357k6158M8321L2958K745K5555
13402B14035J8956J5040k6875l1652R646L8319J5067k6947l5683K3455K3515l7055
13390A99821k0300P087l7093K534K9868k6635l0121J2985K622K3692J2437r11
$$ plain form
13477 57092 103978 172142 171859 153706 178484 212168 213580 145844 140992 132067 169856 138267 94792
13464 94792 161693 173318 147215 178154 201693 212571 226206 241131 211017 190352 162703 108897
13452 108897 96638 159310 163877 143450 174472 203612 182375 148652 155619 165870 161675 171496
13440 171496 143617 108786 103080 105061 116326 88095 52097 78734 99377 132026 150121 164892
13428 164892 142131 145642 165268 166938 166939 157938 148597 141679 164336 187331 192498 185518 180129 216283
13414 216283 193230 144929 124665 147086 134896 141971 130614 104456 152777 185735 188480 214035
13402 214035 232991 248031 221156 189504 199150 237469 252536 225589 189906 213361 236876 199821
13390 199821 179521 186608 149515 152049 181917 155282 125161 138146 140768 164460 176897 175986
13378A75986K5682n020L3704K3397k1670n742O7340J8544o0440m3228K3948l2954
13366A99547J3579N9364K1651K5973j1468m8441l7551k7879J7775Q638K163O405
13354B29756j3728q421M577p169L0197j5800l1731N8246p631l8031N070M0826
13342B46161P1428K8920P232K5611K7749N021j6433l2388L6275P0517N3242J1837
13330E35172J2003Q134q978j0064j1420m0931p014j5995l4840n8714j0519J5522
13318C72356K3997P0808N4608K5798M545J1100M95J732P376k0997l4800l1434
13306D85584J5755J6817L9386K6471K1512n32N7593K4415N2654M580k9375n409
13294G09451O6911N6869N1737P6332M2621o620J3672R0804N6285J8926l047L1676
$$ plain form
13378 175986 201668 196648 230352 253749 232079 226337 293677 312221 251781 208553 232501 199547
13366 199547 213126 272490 294141 320114 308646 260205 222654 194775 212550 221188 223351 229756
13354 229756 216028 207607 212184 205015 235212 219412 187681 245927 238296 200265 205335 246161
13342 246161 317589 346509 353741 379352 407101 412122 395689 363301 399576 470093 523335 535172
13330 535172 547175 555309 546331 536267 524847 483916 476902 460907 426067 367353 356834 372356
13318 372356 396353 467161 521769 547567 552112 563212 563707 565439 572815 551818 517018 485584
13306 485584 501339 518156 557542 584013 605525 604993 662586 687001 739655 744235 714860 709451
13294 709451 776362 833231 884968 961300 1003921 997301 1010973 1101777 1158062 1176988 1173941 1205617
13282A205617M411L0730Q1400M8697M0491O3222J10465O2542O6515J52921J39952
13271B006963J15662J00477J76377J48224J45976K26293K64445L02580L56280
13262C843277M08657M76818N90497O94869Q47448J070176J360194J733700K178500
13253A3204136K845333L677673M922787O912930R595141J2831971J5652052J5929435
13245H5571458J1212282J282021r366097j5261597j5454645j2646465r356152
13238C5980805o792776m962920l657583k893727k245442j743545j331373j014932
13230A1338507p15174n32032l79776j94898q3202O0666J51408K88209M31394O04254
13220A0969356P43516Q67771J094953J479703J861109K322923L114508M067641
$$ plain form
13282 1205617 1210028 1240758 1322158 1370855 1411346 1474568 1585033 1647575 1714090 1867011 2006963
13271 2006963 2122625 2223102 2399479 2547703 2693679 2919972 3184417 3486997 3843277
13262 3843277 4251934 4728752 5319249 6014118 6861566 7931742 9291936 11025636 13204136
13253 13204136 16049469 19727142 24649929 31562859 41158000 53989971 69642023 85571458
13245 85571458 96783740 98065761 88699664 73438067 57983422 45336957 35980805
13238 35980805 29188029 24225109 20567526 17673799 15428357 13684812 12353439 11338507
13230 11338507 10623333 10091301 9711525 9516627 9433425 9494091 9645499 9933708 10365102 10969356
13220 10969356 11712872 12580643 13675596 15155299 17016408 19339331 22453839 26521480
13212B6521480N372144P139886R655021J3549837J9341031K7047596L5166569
13205A43793564L9602172L3141345J0448329k0483599m0625489m1679277l2320381
13198I1876664k2384049j5133711j0548188p722230n921206m608467l569955k860135
13190A9128723k295174j787622j451770j128490q48576p02370m93178k72379j97452
13181I951712j03943P8773J51401L41113M75826O23932R03500J136928J529127
13172A5088369K062239K705152L672272N044690O904361R524969J2867467J6170639
13164G4040158J7168708J3296882L373608q698300j6639059j8001692j5139264
13157D9401041j1329079q057279n835499m384373l310431k591917k078550j714100
$$ plain form
13212 26521480 31893624 39033510 48688531 62238368 81579399 108626995 143793564
13205 143793564 183395736 216537081 226985410 206501811 165876322 124197045 91876664
13198 91876664 69492615 54358904 43810716 36088486 30167280 25558813 21988858 19128723
13190 19128723 16833549 15045927 13594157 12465667 11617091 10914721 10421543 10149164 9951712
13181 9951712 9847769 9926542 10077943 10419056 10894882 11518814 12422314 13559242 15088369
13172 15088369 17150608 19855760 23528032 28572722 35477083 45002052 57869519 74040158
13164 74040158 91208866 104505748 107879356 99181056 82541997 64540305 49401041
13157 49401041 38071962 30014683 24179184 19794811 16484380 13892463 11813913 10099813
13149A0099813j370903j138345r58150p39297o55488n17228l87998m01268l48066
13140C583070l18276k49602k21624j96610j40488j65725j49480j29401j42712
13131A869152o0158r9365j35673q9408m9918j1863l7852m0135q8738n4951m1393
13120A159698n1577n5253m8463k0510L0693j7948L768k5051m921l4486j2637o7904
13108H55409p7474k0360K4756r105J4032m9709p3803j3383j0768l8948j8142n069
13096E77436n3k7792q445J1315l6018M248j3452n5477m4094J0571j6734J0255
13084D11760J8343j0205p65J7595j5648J3473M419R921N3871J2802n912l4485
13072D75169l2442l9400L9569L2048q0373R284Q1050M3308n5655m4988J60K1723
$$ plain form
13149 10099813 8728910 7590565 6632415 5893118 5237630 4720402 4332404 3931136 3583070
13140 3583070 3264794 3015192 2793568 2596958 2456470 2290745 2141265 2011864 1869152
13131 1869152 1808994 1709629 1573956 1484548 1434630 1422767 1384915 1344780 1256042 1201091 1159698
13120 1159698 1108121 1052868 1004405 983895 1014588 996640 1000408 975357 970436 935950 923313 855409
13108 855409 777935 757575 782331 773226 787258 737549 663746 650363 639595 600647 582505 577436
13096 577436 577383 549591 541146 552461 516443 520691 507239 451762 407668 418239 401505 411760
13084 411760 430103 419898 419133 436728 421080 434553 438972 448893 502764 515566 509654 475169
13072 475169 442727 403327 442896 474944 394571 403855 484905 528213 472558 427570 427730 449453
13060D49453j3996n1367o7566J1660K0414P439j2817L138k5011m2721j27L7231
13048C15730l370J3580p017j7480N865Q423q366m2485j8743J3239L7983k4380
13036B72979k8880L9997J0408j88N2178K243n1644l2268k74M8909N553l7273j1428
13023B70312l7276K845K6592J8921K4245r262l3097K186m7099j4929K9229P722
13011B40389Q155K0330r968j8110m3751k7037k0612J3611l1247n0938J5557N2911
12999A49290M2866K0800L3808n777q9247k3439m339k0497K2219L15l5905J7528
12987A07622L8292J7760N2976k6115l0993N4769j1116j6885N730k3335j8118K9725
12975A80312j5662k1260l27l0285k7242M7341K960l7710m3791j3978J3836M1603
$$ plain form
13060 449453 435457 384090 316524 328184 348598 356037 343220 346358 321347 278626 278499 315730
13048 315730 312360 325940 318923 301443 307308 315731 307365 264880 246137 259376 297359 272979
13036 272979 244099 284096 294504 294316 346494 348737 297093 264825 264551 313460 319013 281740 270312
13023 270312 233036 235881 262473 281394 305639 296377 263280 265466 218367 203438 232667 240389
13011 240389 248544 268874 258906 240796 197045 170008 149396 163007 131760 80822 96379 149290
12999 149290 192156 212956 246764 240987 151740 128301 123962 103465 125684 125999 90094 107622
12987 107622 145914 163674 216650 190535 159542 214311 203195 186310 192040 168705 150587 180312
12975 180312 164650 143390 143063 112778 85536 132877 135837 98127 54336 40358 54194 95797
12963I5797K2286M4091p39k65J6756l3072o6105k0528L9851J7453L4143p43O228
12950A55153J0908K547k5908j2393J2038K2622l8327j5033m610K8452j5532k4306
12938I5611J4858k5389k3630J1479J2106K4521M6492m9945O916N1782L132n0868
12926A17065O039L4865j8866K3437j0919l9614k9774k5457M5431J8153r019l6497
12914G4844p840O4866j4361k7603N722K1699j8941m2737j7521J1092Q6439N496
12902A41155o5073m8657j8412J1945O6568M6383k9719n1559j4004M301M0723J0054
12890I3705r059o6640M126N9765K9670K4525n9741j4439K9981J6396L5646l1584
12878A12351m8939j4945l5430k850J5954N0279J671K0545o922j1921J0643M533
$$ plain form
12963 95797 118083 162174 161435 161170 177926 144854 78749 58221 98072 115525 149668 148925 155153
12950 155153 166061 168608 142700 130307 142345 164967 126640 111607 106997 135449 119917 95611
12938 95611 110469 85080 61450 72929 85035 109556 156048 106103 113019 164801 167933 117065
12926 117065 123104 157969 139103 162540 151621 112007 82233 56776 102207 120360 111341 74844
12914 74844 67004 131870 117509 89906 95628 117327 98386 55649 38128 49220 135659 141155
12902 141155 76082 27425 9013 20958 87526 133909 104190 52631 38627 42928 83651 93705
12890 93705 84646 18006 22132 81897 111567 136092 76351 61912 91893 108289 143935 112351
12878 112351 63412 48467 13037 10187 26141 76420 78091 98636 91714 79793 90436 94969
12866I4969R502L4040N9922r821o3589k5002J9935J8954l5888k1575L8676K3537
12854A43660n5875j8683N358J841N6823J0966J7487K0148P73k6723j0730j590
12842A43455m5116K0480J5322m72o2700l3159J4693K3443k251j7204j3538K1449
12830F4402M7585L4945Q652L354K8709o0423o6950J3917K7747J707q687r648O5660
12817A50970J4603k5388K170o120j3481M3559k5616n3170k8698J5005M0847K6921
12805A41602J1904k5488k6324j6638j3718m456l4766M2136L3685L9228j3454N2425
12793A86136m6894l4272L8957J5840J0668Q569L12o6925M5617J27360L4596p962
12781C12002N6968Q1141O0757J3742m0962k9972m5832L8953k8731p3046n7796
$$ plain form
12866 94969 104471 138511 198433 188612 125023 100021 119956 138910 103022 81447 120123 143660
12854 143660 87785 69102 74460 76301 133124 144090 161577 181725 182498 155775 145045 143455
12842 143455 98339 118819 134141 133669 70969 37810 52503 75946 73695 56491 42953 64402
12830 64402 111987 146932 155584 158938 187647 127224 60274 74191 101938 103645 94958 85310 150970
12817 150970 165573 140185 142355 136235 122754 166313 140697 87527 58829 73834 114681 141602
12805 141602 153506 128018 101694 85056 71338 66882 32116 74252 107937 147165 133711 186136
12793 186136 139242 104970 143927 159767 170435 179004 179316 112391 158008 285368 319964 312002
12781 312002 368970 450111 510868 524610 483648 453676 407844 446797 418066 345020 287224
12770B87224p0778n0850p91R083K8474O616m1827m4400L1183N2972N9234j9468
12758B46672o5860l6711l668Q236j0837M4834M6577J2258M862k7366J8758L8323
12746B76078j2354M3990O6748Q0531Q2826J04933J04619P2526J83779J37318K8158
12735A169152r4876j81646j82870j54840m6089m0544l0541p5305j05450k9685
12725B27306M2341k3184L274L2984j2947m0113m7109n373J2446r908M655K6136
12713B10508j0442k4083J5242J5945J8167K748J0423j54j687N7349N4727L1794
12701C80537K0413K9661k1188L2335N8033M2132L952k1929j5708j02823p9576
12690C25839n1228Q524J8335p9919k3818j3700l919r204q25J3220k3673K3469
$$ plain form
12770 287224 216446 165596 164805 173888 202362 208978 167151 122751 153934 206906 266140 246672
12758 246672 180812 144101 140433 148669 137832 182666 229243 241501 246363 218997 237755 276078
12746 276078 263724 307714 374462 454993 537819 642752 747371 819897 1003676 1140994 1169152
12735 1169152 1074276 892630 709760 554920 508831 468287 437746 362441 256991 227306
12725 227306 269647 246463 249737 282721 269774 229661 182552 177179 189625 179717 184372 210508
12713 210508 200066 175983 191225 207170 225337 228085 238508 238354 236667 294016 348743 380537
12701 380537 400950 430611 409423 441758 499791 541923 545875 523946 508238 405415 325839
12690 325839 274611 283135 301470 221551 197733 184033 180114 170910 170085 183305 159632 183101
12678A83101j5779j6015j9116K0599Q958J7204M86M773K0038l4998m6344j7799
12666A05108K2928k03l0093J1948j0338J131L77m85p399K8683J5356L4876k3609
12653A48280m0440J0888K5279l7409j5475K752K9937K9658l1669j6553J9596j22
12641A24722k2092m3440J0649K5741O6614k3152j8651j2199L3168p486Q147L2411
12629A74432j701j7381k7942j2684j1592m2165Q283L1842L4030P5439K5043j3124
12617B22480m4105m3845J730O0278M1846l8682o4520K148K3072O192m8887l6535
12605H1172N245R042q610J3613K4624P0720N4836Q460k5034n1906j5327k9811
12593A37024n4339L9500Q890m4482j2721P718p867J223J3576L4215L4450l8207
$$ plain form
12678 183101 167322 151307 132191 152790 161748 178952 179438 184211 204249 169251 122907 105108
12666 105108 128036 127833 97740 109688 99350 100481 100858 100373 92974 121657 137013 171889 148280
12653 148280 107840 118728 144007 106598 91123 93875 123812 153470 121801 105248 124844 124722
12641 124722 102630 59190 69839 95580 162194 139042 120391 108192 141360 133874 142021 174432
12629 174432 172731 155350 127408 114724 103132 60967 69250 101092 135122 210561 235604 222480
12617 222480 178375 134530 136260 196538 238384 199702 135182 137330 160402 166594 117707 81172
12605 81172 86417 95459 86849 100462 125086 195806 250642 259102 234068 182162 166835 137024
12593 137024 82685 122185 131075 86593 73872 81590 73723 74946 88522 122737 157187 118980
12581A18980l3133J7717K7890K7791L7470k616J8351J8398O282l3855l1953j1157
12569A60165l6025j7231q019M3543N654m3542j3873k5818L2468M7566M567R1776
12557B41231K557k1413k727p6938l0067l858j0626q819j1797n872K6060j135J5587
12544A12183j8416L8753k7823q500J7744M3528N8247O931j2956k2055K4417k1767
12532A90286n0379m2119k3649L9984O1425K5458l4676m1814l8068k0843j308J188
12520F5485N6089K6358N924J901O419l9243R062L3707K0491J1969J0888j5968
12508A93082l8070M6461O2356m3060k1721J5460j2759k1180j7649k1995L9799
12497A80724j0475l0412o457M0758M8868j2473o4870k2332j7804M4251K5956m014
$$ plain form
12581 118980 85847 103564 131454 159245 196715 194099 212450 230848 237130 203275 171322 160165
12569 160165 124140 106909 98890 142433 148087 104545 90672 64854 97322 144888 149455 241231
12557 241231 243788 222375 219648 142710 112643 108785 98159 89340 77543 71671 97731 96596 112183
12544 112183 93767 132520 104697 96197 113941 157469 215716 222647 209691 187636 212053 190286
12532 190286 139907 97788 74139 114123 175548 201006 166330 124516 86448 65605 64297 65485
12520 65485 121574 147932 153856 155757 162176 122933 131995 165702 186193 198162 209050 193082
12508 193082 155012 201473 263829 220769 199048 214508 201749 180569 162920 140925 180724
12497 180724 170249 139837 133380 174138 223006 210533 145663 123331 105527 149778 175734 171720
12485A71720n609M374l398n419l0093j7968L2072K1828M7576K1747K4108m1369
12473B19569Q519O685K1281K0560J2208n8366l8802O991K4900K3087K3760j8252
12461B52140n752K3321j6885o1194k5733k751L967J7964j0827L1879J2830p883
12449B11076K024j8056j7687N5548M5404l3131l7201q801l9700K3081K4116l5472
12437A71201K0768K5102N7984j667p566q274o1885L495K1511J6334k573k6173
12425B08257K5097J07825j2744k4730j2247M5808N132M8054M7780L5939J03975
12414E78146J30056J05473J12971J17305K33195K80384L12724L17272J38515j01287
12404B224754l43767l68409k95745j87060j71743j12171j00573l2807j6497o6877
$$ plain form
12485 171720 166111 170485 167087 161668 131575 113607 145679 167507 215083 236830 260938 219569
12473 219569 228088 234773 256054 276614 288822 230456 191654 198645 223545 246632 270392 252140
12461 252140 246388 269709 252824 191630 165897 163146 167113 185077 174250 206129 218959 211076
12449 211076 213100 195044 177357 232905 278309 245178 207977 199176 159476 182557 206673 171201
12437 171201 191969 217071 275055 273388 265822 257548 195663 199158 220669 237003 234430 208257
12425 208257 233354 341179 328435 303705 291458 337266 342398 390452 438232 474171 578146
12414 578146 708202 813675 926646 1043951 1277146 1557530 1870254 2187526 2326041 2224754
12404 2224754 1880987 1512578 1216833 1029773 858030 745859 645286 612479 595982 529105
12394E29105m585M691k5849o4085l2853m3468l6710L6543p097J0286m2090n0196
12382B73692J9165M0562j8431K3504N623N058O410q866k9301k3816l7827k678
12370B53095L5880r273K9447P8118M0928o8554q1539l5818L6780M3576K46j7597
12358C05289j2049Q89j0585k9076k0270J2844K2056M9594J0870J9606n5149l2315
12346B61704J5332K7755J4141J1773K090L713L2027k8351j1629K8709J4372o6301
12334C05335j0076m693j079J004J1964m881o913k6553K2056L887p870r036L095
12321B76240p013Q973J8070J3876L2558j8427m890M176O143K9863j9322l9067
12309C01180M9010O0327L1903j0853l1396J2128m4802n0804k5144l2966m937J4621
$$ plain form
12394 529105 524520 529211 503362 439277 406424 362956 326246 362789 355692 365978 323888 273692
12382 273692 292857 333419 314988 338492 344115 349173 355583 346717 317416 293600 255773 253095
12370 253095 288975 279702 309149 387267 428195 359641 278102 242284 279064 322640 322886 305289
12358 305289 293240 294129 283544 254468 234198 247042 269098 318692 329562 349168 294019 261704
12346 261704 277036 304791 318932 330705 332795 336508 368535 340184 328555 357264 371636 305335
12334 305335 295259 290566 289487 290491 302455 297574 290661 264108 286164 290051 282181 273145 276240
12321 276240 269227 278200 296270 310146 342704 324277 319387 323563 329706 359569 340247 301180
12309 301180 350190 410517 442420 431567 400171 412299 367497 316693 291549 258583 253646 268267
12297B68267M4717P2343L6011k1484M834K3871l2653m3392l956k5580k92J0299
12285C32985P9549N1942R25k9756p3712J6027k4573M185L6200j2243j0410R506
12273C80625Q235m5168O372K1696J8045K9942L4862l9988n9080l6144J8993L3732
12261C72122Q102k3803k561M2937M8160Q783K5822j4893l6899l8304K2974N5466
12249D67906K276j52l0863j1402J1551l0809r945J5337J0255L7888N2813J6162
12237E31017J4636j2786m6693Q276K339L97m4785k1957L3418j1971N240N2693
12225E09824O5616P168O2764L1973J6461P2781J23171J13316j7783r8487j03997
12214G82807m8365l7114k9264k4173L7496j4951n1860J5103j7289k9318n0284
$$ plain form
12297 268267 312984 385327 421338 399854 404688 428559 395906 352514 348558 322978 322686 332985
12285 332985 412534 464476 465401 435645 361933 377960 353387 357572 393772 381529 371119 380625
12273 380625 388860 343692 350064 371760 389805 419747 454609 414621 355541 319397 338390 372122
12261 372122 380224 356421 353860 396797 444957 453740 479562 464669 427770 389466 412440 467906
12249 467906 470182 470030 439167 427765 439316 408507 398562 413899 424154 462042 514855 531017
12237 531017 545653 532867 486174 494450 496789 497186 452401 430444 463862 451891 457131 509824
12225 509824 575440 582608 645372 677345 693806 766587 889758 1003074 985291 886804 782807
12214 782807 734442 697328 668064 643891 681387 666436 614576 629679 612390 583072 532788
12203E32788r021N2204N171k3573O371K2400L003M0752N396L4216O972j6939k9619
12190F30121J9664J2810k2704l6392P267L122L1312L4104J8759N6513K3199k516
12178G75259j0002n0260m4849q484J0538M6979N9632M0388k9098l5146l938K1628
12166G72647K3101J1750J5352N794N2345l6816p5887J1382M9735j3413j3650q192
12154G94148k4690J5848M8686q589j3837j2526L2546N1984N7639J1311J1265n445
12142I58340J1847l2950k199J7734k4253J2621M1490M1998m6375j3188O5602j7899
12130A012768m0445K396L0096N5994K0819K961O8212P1104K8649L6493K0726J8795
12118A328568M2551J29515J05976M7131O2199O6699P187m0521p7753r8802j08786
$$ plain form
12203 532788 523767 575971 581142 557569 563940 586340 589343 630095 635491 669707 676679 659740 630121
12190 630121 649785 662595 639891 603499 610766 613888 645200 679304 698063 754576 777775 775259
12178 775259 765257 714997 670148 661664 672202 719181 778813 819201 790103 754957 751019 772647
12166 772647 795748 807498 822850 828644 880989 844173 768286 779668 829403 815990 802340 794148
12154 794148 769458 785306 833992 825403 811566 799040 831586 883570 941209 952520 963785 958340
12142 958340 970187 937237 935038 952772 928519 941140 982630 1024628 978253 965065 1030667 1012768
12130 1012768 972323 974719 1004815 1060809 1081628 1084589 1152801 1223905 1252554 1289047 1309773 1328568
12118 1328568 1371119 1500634 1606610 1653741 1715940 1782639 1789826 1749305 1671552 1572750 1463964
12107A463964j00646J985k475l2481O970k6456N6775M2587K5911K4948L7636K2306
12095A521024P2442J10414J14389P2089P0374O3006N532m6790j03074j12777r985
12084A756644l348M745K8378J6975j027P920l1749Q206R2481L6749j8790M0776
12072A937960J8109j4293K6881l528j664P7013J5549j3195j5062k224M1216M9957
12060B116719Q3727L2918J1206P204N5353O5090M3177J0541K7017K2377J8846
12049B494175J7857N6995P8569M2389L7311K0539k0907K5479N7466K4968L1291
12038B866132Q1619N2128M0031M6081M9626N1823L1472O7983Q3688J00047O0589
12027C531219M5971N0088K3043Q5181Q3435L8631M8939R5599J07619K3204P0369
$$ plain form
12107 1463964 1363318 1365303 1362828 1330347 1337317 1310861 1367636 1410223 1436134 1461082 1498718 1521024
12095 1521024 1593466 1703880 1818269 1890358 1960732 2023738 2029270 1982480 1879406 1766629 1756644
12084 1756644 1753296 1758041 1786419 1803394 1802367 1810287 1778538 1786744 1879225 1915974 1897184 1937960
12072 1937960 1956069 1941776 1968657 1965129 1963465 2040478 2056027 2042832 2027770 2025546 2066762 2116719
12060 2116719 2200446 2233364 2244570 2251774 2307127 2372217 2415394 2425935 2452952 2475329 2494175
12049 2494175 2512032 2569027 2647596 2689985 2727296 2747835 2726928 2752407 2809873 2834841 2866132
12038 2866132 2947751 2999879 3039910 3085991 3135617 3187440 3218912 3286895 3370583 3470630 3531219
12027 3531219 3577190 3627278 3650321 3735502 3818937 3857568 3906507 4002106 4109725 4132929 4203298
12016D203298J37790J48125J69086J47884J19337J11464J04008J39229J43354
12007E423575J74393J12169J55529J69126J42099J55564K09943K07465K52444
11998G002307J96543K50137K72282L17705K94681K71767L92475M76672N32056
11989A0006625O30196P34013Q14026R46724J177055J476113J842906K218983K548602
11980B2395243K458676K202230K277756K728694L543441M902830O687967R199613
11972E6396450J2779180J8137524K6778812M0741221O1692814Q8798983J11836827
11965D17161811J01247458J7653134r3365486j23781794r4713955o1928708l9756997
11958A22515463k6234053j8175021j3467927j0296372p696161n642273m163117
$$ plain form
12016 4203298 4341088 4489213 4658299 4806183 4925520 5036984 5140992 5280221 5423575
12007 5423575 5597968 5710137 5865666 6034792 6176891 6332455 6542398 6749863 7002307
11998 7002307 7198850 7448987 7721269 8038974 8333655 8605422 8997897 9474569 10006625
11989 10006625 10636821 11370834 12184860 13131584 14308639 15784752 17627658 19846641 22395243
11980 22395243 24853919 27056149 29333905 32062599 35606040 40508870 47196837 56396450
11972 56396450 69175630 87313154 114091966 154833187 216526001 305324984 417161811
11965 417161811 518409269 536062403 442696917 318915123 224201168 162272460 122515463
11958 122515463 96281410 78106389 64638462 54342090 46645929 41003656 36840539
11951C6840539l162947k533169k192106j821771j531004j626800j955959j813592
11943B0203191j411230j118875r65662p43990n50397m72917m79122m34840m04761
11934A3621397l53597l04582k86904k68676k55709j99561k11633j28453j25428
11925A1486854j34015j01509j35681j34970j26747j82053j41293j14513j20133
11916A0295940j02248q3483p7397j00507m3710o5086j31348j24768q5054j44478
11906I337861q0856j02342j47572r7102m0294q2614j59629o7915o6695j49153
11896H343689j46977r1530j32064j21781j03958j05429j01310o3740r8479o9066
11886G309355r4856j12876j39988j35577j37577l9019p5446j40857j19168q2435
$$ plain form
11951 36840539 33677592 31144423 28952317 27130546 25599542 23972742 22016783 20203191
11943 20203191 18791961 17673086 16707424 15963434 15413037 14940120 14460998 14026158 13621397
11934 13621397 13267800 12963218 12676314 12407638 12151929 11952368 11740735 11612282 11486854
11925 11486854 11352839 11251330 11115649 10980679 10853932 10671879 10530586 10416073 10295940
11916 10295940 10193692 10110209 10032812 9932305 9888595 9823509 9692161 9567393 9482339 9337861
11906 9337861 9257005 9154663 9007091 8909989 8869695 8787081 8627452 8559537 8492842 8343689
11896 8343689 8196712 8105182 7973118 7851337 7747379 7641950 7540640 7476900 7378421 7309355
11886 7309355 7214499 7101623 6961635 6826058 6688481 6649462 6574016 6433159 6313991 6231556
11876F231556j12617o2977o4061j22759j36803l6853j5551j02938j14137q4570
11866E378290p8641m0869m1075m0328r8443j21690q7051r9322j59170j25054j8916
11855D467731k2725k6615l9788n4770m4869o3552m5787p4969r2644p3940p2584
11844C855488k2476m3388l4082n8944p242M3515J7118J5845o2251q3209r6758
11833C523616r1503Q581k712k4426o9360r3796n9274n9497m6379k2064p3515k0694
11821B968977m9998m3334p865p0362q7610n0075k0765l5585l3512k7687m0125
11810B502059m450L044k4908J6830l859Q466J341J4763M2020M3833K9124k8013
11798B600250o2246k9372p6261j09466q6429k779J4350k7479p5485p7974n4556
$$ plain form
11876 6231556 6118939 6055962 5991901 5869142 5732339 5695486 5679935 5576997 5462860 5378290
11866 5378290 5299649 5258780 5217705 5177377 5078934 4957244 4870193 4770871 4611701 4486647 4467731
11855 4467731 4445006 4418391 4378603 4323833 4278964 4215412 4169625 4094656 4002012 3928072 3855488
11844 3855488 3833012 3789624 3755542 3696598 3689356 3732871 3749989 3765834 3703583 3620374 3523616
11833 3523616 3432113 3440694 3437982 3413556 3344196 3250400 3191126 3131629 3085250 3063186 2989671 2968977
11821 2968977 2918979 2875645 2867780 2797418 2709808 2659733 2638968 2603383 2569871 2542184 2502059
11810 2502059 2497609 2500653 2475745 2492575 2488716 2497182 2498523 2513286 2555306 2599139 2628263 2600250
11798 2600250 2538004 2508632 2432371 2322905 2236476 2233697 2248047 2220568 2145083 2067109 2012553
11787B012553R00m2820r3346j1945q306M185l7950J9734l3550P908n5631q4694
11775A677038l590M7664O762l5213j7031j7881k8112m9036l3325L262K3745Q9051
11763A663334Q6121R1910J50365J55659P5014O3189L2955j03715j36425j46631
11753A931776j09823j06735j11463j01868j04660o9624j190K7588m6925j0981
11743A296095j8353k9301k2851l8999n7008K3199j6900q851j3011r4405m4939
11732I74676L7831K5855J3569N5933J1047j3970k8716j9379K7332K8766K6158
11721A139102k4219N9105O2263P6819J13220M0288q2062j11184p8042q8219j01406
11710A005665j5060N2088j0467k8680l3149m4787J5024K213m910k0216l470k0039
$$ plain form
11787 2012553 2013453 1970633 1877287 1865342 1857036 1861221 1823271 1843005 1809455 1817363 1761732 1677038
11775 1677038 1673448 1721112 1727874 1692661 1675630 1657749 1629637 1580601 1547276 1550538 1574283 1663334
11763 1663334 1749455 1841365 1991730 2147389 2222403 2285592 2318547 2214832 2078407 1931776
11753 1931776 1821953 1715218 1603755 1501887 1397227 1327603 1326413 1354001 1307076 1296095
11743 1296095 1277742 1248441 1225590 1186591 1129583 1152782 1135882 1127031 1114020 1019615 974676
11732 974676 1012507 1038362 1051931 1107864 1118911 1104941 1076225 1056846 1084178 1112944 1139102
11721 1139102 1114883 1173988 1236251 1313070 1426290 1466578 1384516 1273332 1195290 1107071 1005665
11710 1005665 990605 1042693 1032226 1003546 970397 925610 940634 942847 937937 917721 914251 894212
11698H94212j0471m3045l0797l782o314J3974n496L2125k3739l0183r339l5114
11686G42031J4953K8953k9305j056L539q844O941J1608o1131n8133j0580O1898
11674G00874j9926J5919j3914m756o970J1119J7167m2446m2152p318J6415J494
11662F25506k9527j5885J8205J5196R833m2973k0482n3243l8011O3694M1135M687
11650E78135j9838l7755k108Q037J5168K7829j4727m1384N0429j0119m841K1354
11638E70180L2404p585p077k2668m9893j6453J7382K0306L0298j6957m8079J6868
11626E18726l5364j1847j4920m0247p063j0770K6781O0779K7258j6572m45K7484
11614E23800L694j3865j9994J0009r577l47p450k4368J2268k7027Q675K8111l1906
$$ plain form
11698 894212 883741 840696 809899 806117 799803 813777 808281 840406 816667 786484 777145 742031
11686 742031 756984 785937 756632 755576 759115 750271 757212 768820 707689 649556 638976 700874
11674 700874 680948 696867 682953 678197 671227 682346 699513 657067 614915 607597 624012 625506
11662 625506 595979 580094 598299 613495 623328 580355 559873 506630 468619 532313 573448 578135
11650 578135 558297 520542 518434 526471 541639 569468 554741 513357 563786 553667 548826 570180
11638 570180 602584 594999 587922 565254 515361 498908 516290 536596 566894 549937 501858 518726
11626 518726 483362 471515 456595 416348 409285 398515 425296 486075 513333 496761 496316 523800
11614 523800 527494 513629 493635 503644 494067 493720 486270 461902 474170 447143 455818 483929 452023
11601D52023k4758O149K0619j3372Q90j1671j6582l5835J0090N1552L0062m8830
11589D20337L2065K6826j8696j6360J3718l9741n4870o720M944K4681J9444M9172
11577D54800L9401K7352L8934M118J8240K2116j5155P954m8336l1290j3135j04610
11565D00389l9685J9151j950J2618L9028k7780k7571j1268L8209J2236O603P388
11553D27368K1955K9050k4025m4366J0912J3747j7408j0735l498J3765J6385m402
11541D28748J064L8726M0152J5408K7382J0380R563o996n4546l175N3659K6519
11529E86884J5276N634M5534L2109N3360Q9506O1846J50827K16006L15846L71078
11518A943906M02132K25378m9840l71924m10731l64709k43727j53436j33531j19322
$$ plain form
11601 452023 427265 433414 454033 440661 441551 429880 413298 377463 387553 439105 469167 420337
11589 420337 452402 479228 460532 444172 457890 418149 363279 356559 361503 386184 405628 454800
11577 454800 494201 521553 560487 564605 582845 604961 589806 597760 549424 518134 504999 400389
11565 400389 360704 379855 377905 390523 429551 401771 374200 362932 401141 413377 419980 427368
11553 427368 449323 478373 454348 409982 420894 434641 417233 406498 403000 416765 433150 428748
11541 428748 429812 468538 508690 524098 551480 561860 571423 564427 509881 506706 560365 586884
11529 586884 602160 607794 653328 685437 738797 828303 890149 1040976 1256982 1572828 1943906
11518 1943906 2346038 2571416 2521576 2149652 1738921 1374212 1130485 977049 843518 724196
11508G24196m7454m0724k1539l8394l7284Q248j8837l3454k893J2105Q535j87
11496E12318n369j6008l5729p53L0638K0299l6454J0575N9447J1618k2404m310
11484E23868k1316k1937k1671n663m3413M1343K9117q0733j0136j0871k9553n717
11472C43318M35M0522O6494K244j1485q225K2610J3247M2556p0177k6399P0655
11460D85795L9222l0102j4519R678L9747L8140n2743j2734L3534K8442L4402J3886
11448F12748J6983M9814O4328M2550j0941L490j2413m8452k7079k0024l3313o796
11436F30895r787q078n2099N414N7836J9084n320k5509l6659K452L6669N1557
11424F66455J5416l6020k236J3198L3001M5308L0445J1689J3647Q22m89K9991
$$ plain form
11508 724196 676742 636018 614479 576085 538801 547049 528212 494758 491865 503970 512505 512318
11496 512318 506949 490941 455212 454459 485097 505396 468942 479517 538964 550582 528178 523868
11484 523868 502552 480615 458944 453281 409868 451211 480328 399595 389459 378588 349035 343318
11472 343318 343753 384275 450769 453013 441528 433303 455913 469160 511716 441539 415140 485795
11460 485795 525017 494915 480396 490074 529821 567961 515218 502484 536018 564460 598862 612748
11448 612748 629731 679545 743873 786423 775482 778972 766559 718107 691028 671004 637691 630895
11436 630895 621108 613030 560931 566345 624181 643265 637945 612436 575777 578229 614898 666455
11424 666455 681871 645851 643615 656813 689814 735122 765567 777256 790903 791725 791236 821227
11412H21227M6250O3836Q9688M6075K1790N6264P5207K8990K4830L3142J6302
11401A323601l5359j7552Q952N7183J2760N9885K2491M5282J26270L3370J8499
11390A655382N6663J17588J96913M8077L5595J41957J82044J92284K62690K47268
11380C136461K62142L40900L80813M61606O12731O18926P62328R09387J064355
11371H549649J209984J562766K011134K521328L327869M550891O331208R006640
11363C9071469J2572405J6314860J8807589J6764623P335329o805878j7081250
11356H6979147j8855122j5556733j1474040q116384n847524m302695l201769k415058
11348A7209822j828828j394948j061471q64565o62048n09481m11601k60786j58377
$$ plain form
11412 821227 867477 931313 1021001 1067076 1088866 1145130 1220337 1249327 1274157 1307299 1323601
11401 1323601 1288242 1270690 1279642 1336825 1349585 1409470 1431961 1477243 1603513 1636883 1655382
11390 1655382 1712045 1829633 2026546 2074623 2110218 2252175 2434219 2626503 2889193 3136461
11380 3136461 3398603 3739503 4120316 4581922 5194653 5813579 6575907 7485294 8549649
11371 8549649 9759633 11322399 13333533 15854861 19182730 23733621 30064829 39071469
11363 39071469 51643874 67958734 86766323 103530946 110866275 104060397 86979147
11356 86979147 68124025 52567292 41093252 32976868 27129344 22826649 19624880 17209822
11348 17209822 15380994 13986046 12924575 12060010 11397962 10888481 10476880 10216094 10057717
11339A0057717L4815J98070L61219N72183Q21053J034876J229947J424707J629815
11330A7364402J994646K530252L220395M219194N750401Q047756J1640766J7182225
11322G1950037K5210616L5463224M4415426M2471936J6709192k2886320m3827159
11315A69506952m2122485l2211287k2635147j5711855j1060265q071242o125808
11308C1568863m595230l455522k660788k161169j749028j552094j304897j118686
11300A2971449r53863p23192n54527l66746j45109K7805J52854K86861L68315
11291A1063847M60578O54989Q96983J118613J457058K058416K818530L926339
11283B4455353N431887P510122J0391571J3655330J6278350J5408976Q171447
$$ plain form
11339 10057717 10092532 10290602 10651821 11224004 12045057 13079933 14309880 15734587 17364402
11330 17364402 19359048 21889300 25109695 29328889 35079290 43127046 54767812 71950037
11322 71950037 97160653 132623877 177039303 219511239 236220431 213334111 169506952
11315 169506952 127384467 95173180 72538033 56826178 45765913 37694671 31568863
11308 31568863 26973633 23518111 20857323 18696154 16947126 15395032 14090135 12971449
11300 12971449 12017586 11294394 10739867 10373121 10228012 10255817 10408671 10695532 11063847
11291 11063847 11524425 12179414 13076397 14195010 15652068 17710484 20529014 24455353
11283 24455353 29887240 37397362 47788933 61444263 77722613 93131589 101303036
11276A01303036m490829j5222993j8151541j5366217j1321031q077618n718586
11269B2954221m134337l209113k394321j791124j372290j130278r61807r10965
11261G049986q20445p24095n86606m93268l78838l71236l04702k54712k57647
11252B858437k51002j61910j12273j13864j45848j51971j50550m7605j9662j12896
11242A590856n3570m7772r2860j16106q1838r3783k6590K624j1977M754n6120
11231A017618m1963J6507p3173o6364k4094j6453j199m0713J528L0314l8272k7909
11219G35827j4177k7219m3417o0329n649K2316L6384m584p0046n1969R305L5445
11207E61887K103j9911n6336j0928p037k272J3323p78l0650J8674m569k9468L9428
$$ plain form
11276 101303036 96812207 81589214 63437673 48071456 36750425 28672807 22954221
11269 22954221 18819884 15610771 13216450 11425326 10053036 8922758 7960951 7049986
11261 7049986 6229541 5505446 4918840 4425572 4046734 3675498 3370796 3116084 2858437
11252 2858437 2607435 2445525 2333252 2219388 2073540 1921569 1771019 1723414 1703752 1590856
11242 1590856 1537286 1489514 1396654 1280548 1198710 1104927 1078337 1080961 1068984 1073738 1017618
11231 1017618 975655 992162 918989 852625 828531 812078 810879 770166 771694 802008 763736 735827
11219 735827 721650 694431 651014 590685 585036 607352 643736 639152 569106 517137 526442 561887
11207 561887 563990 544079 487743 476815 469778 467506 480829 480051 449401 468075 463506 434038 473466
11194D73466J7303n5761k2046L1827M1222j808K0580J424k3406J416l6939o293
11182D40985N507M714j7611o4446M1912Q1038k2932j6756o9727o7404k7687k9695
11170B57898n183K7354m333o5418N4273Q9283k0464N60J9507K2701n7561l9948
11158B78669K787N1829J4583l284Q084k9872l0155j9330J4118L834j1633q77j4008
11145B64745J4188K914m50k9754q248L9032M8236J86K2787k39l5901l959p734
11132C05803J8541j6537J1027k834j5950j1761j9400m361J8291m6797j5194J6735
11120B37563m0715L4415M4539L8044K4027l7436j5040m1196l4162r457L2374K7138
11108B60094m4101K5938k0433o308K9219Q89k0820J1833O424J4177J2975j0009
$$ plain form
11194 473466 490769 435008 412962 444789 486011 484203 504783 506207 482801 484217 447278 440985
11182 440985 446492 451206 433595 369149 411061 492099 469167 452411 382684 315280 287593 257898
11170 257898 252715 280069 275736 210318 264591 353874 333410 333970 353477 376178 318617 278669
11158 278669 281456 333285 347868 344584 352668 322796 292641 273311 287429 291263 279630 278753 264745
11145 264745 278933 281847 281397 251643 243395 282427 330663 330849 353636 353397 317496 313537 305803
11132 305803 324344 307807 318834 316000 300050 288289 268889 264528 282819 236022 220828 237563
11120 237563 196848 231263 275802 313846 337873 300437 285397 244201 210039 200582 232956 260094
11108 260094 215993 241931 221498 215190 244409 245298 224478 236311 242735 256912 269887 259878
11096B59878o374j1644j7259J575k0526j9301l0528L4040k7679o1382j0420K1545
11084A11925L6762L0398L6000P506k2280k514L7625J2327J0261n317k8586j022
11072B23085J4947l652n0547m6740k5097q561L7839L6539J940m1915L2947o3670
11060A07115l5335K6058K5072M8169J4430j9565K483P009k4516p533J9591M9018
11048B11996P530L8503o279o714L7343Q741m5894m1145M1253N1944J5177j1629
11036C00826k8744K1294K9394J8544Q1150J2250n8189k4771L4428p026l2524O482
11024C53114N6912M9486M4431P0093N0620k8820j10610r9463o4024L6740N4329
11013D12808N097m405j5030L445K8814N0318n1108m8979o3984o3098r846n838
$$ plain form
11096 259878 253504 241860 224601 226176 205650 186349 155821 189861 162182 100800 90380 111925
11084 111925 148687 179085 215085 222591 200311 197797 235422 247749 258010 252693 224107 223085
11072 223085 238032 234380 183833 137093 111996 103435 141274 177813 179753 137838 170785 107115
11060 107115 71780 97838 122910 171079 185509 165944 168427 175436 150920 143387 162978 211996
11048 211996 219526 258029 251750 245036 282379 291120 245226 204081 245334 297278 312455 300826
11036 300826 272082 293376 322770 341314 422464 434714 376525 351754 386182 379156 346632 353114
11024 353114 410026 459512 503943 574036 624656 595836 485226 385763 321739 358479 412808
11013 412808 417905 413500 398470 401915 430729 481047 429939 380960 316976 253878 244032 238194
11001B38194R63P653K7436M8284l2725q1251l0134K5403Q428k371o356k3902k0717
10988A58905l2633p159O394j7047L1391l1290L32o570j6015J6843R040k1442K7576
10975A18325J3851l3093k459k4102M914L9238J7822M2847m790o0362n7531j2133
10963D2527P598M7939j8453l4003J2754J2526L4944L2510k6855P382K3556j8024
10951A24401k1890l5013l0058J0191j1963K8586L7329J7916J6932j3703k1749
10940A00979M811m0613m5395k0206M3675L0615L8585J8801J4309l287o7842p921
10928F6511K9445Q863M4425n82Q114M0726L554L7538M2989N6135J5986J4075O4572
10915D32351M6600N8202j198k6645k7572n7260q2970k2890k9056r6041k7745m262
$$ plain form
11001 238194 239157 246810 274246 322530 289805 208554 178420 203823 212251 209880 203524 179622 158905
10988 158905 126272 119113 125507 108460 139851 108561 108893 102323 86308 103151 112191 90749 118325
10975 118325 132176 99083 96624 72522 77436 116674 134496 177343 172553 112191 54660 42527
10963 42527 50125 98064 79611 45608 58362 70888 105832 138342 111487 118869 142425 124401
10951 124401 102511 67498 37440 47631 35668 64254 101583 119499 136431 122728 100979
10940 100979 105790 65177 19782 -424 43251 73866 112451 131252 145561 142274 74432 66511
10928 66511 95956 104819 149244 148662 156776 197502 201056 238594 281583 337718 353704 367779 432351
10915 432351 478951 537153 535955 509310 481738 424478 341508 318618 289562 193521 165776 161514
10903A61514k2125l2197K8597K7151L7686j7563J87j1327j2181M941j3655K348
10891A53376j0823k5143K0187L8506M7472p676j2895M8812o301J4374J6363L5001
10879C11253P7006P7897K8286J34269J51519J87365J24112p275j00253j65755
10869H18424j88109j20230q5037l6254k2019r7604j8368m405k0756j1881k160
10858B11601M0698K7243l6989j7074j3598K82L8950J1863k6186l7862o863K0252
10846B12317O349J0389m9979j05O4420l4052k4866J5066M4377M0875L3477Q1450
10834C99718P9239P3077M7413o6468l0556m6575p3297r2313n8156m6300K5473
10823B11255j0792j9195k5749J1440n515m5411k5764p020J2882o022j9309P167
$$ plain form
10903 161514 139389 107192 135789 162940 200626 183063 183250 171923 159742 164683 151028 153376
10891 153376 142553 117410 137597 176103 223575 215899 203004 251816 245515 259889 276252 311253
10879 311253 388259 466156 494442 628711 780230 967595 1091707 1084432 984179 818424
10869 818424 630315 510085 425048 388794 366775 269171 250803 246398 225642 213761 211601
10858 211601 252299 279542 242553 225479 211881 212163 251113 262976 236790 198928 192065 212317
10846 212317 218666 229055 179076 178971 243391 209339 184473 199539 243916 284791 318268 399718
10834 399718 478957 552034 599447 532979 502423 455848 382551 290238 232082 185782 211255
10823 211255 200463 181268 155519 166959 161444 116033 90269 83249 96131 90109 70800 77967
10811G7967k94j0327K5231q32n1406l2290m4937L747M7119O8308j4385j7954k8139
10798B1808J4489K189J0662O4648k1553P243L2173l6784m3888k3622o752N7670
10786G8283K0995k4683R002K8730k1390j1189j7493K8992j6614n5173l6894M6031
10774B8597J6406K6367J9200J9281L3860n1516M7283L3103j4980l2582k9731j6966
10762G8322r515K6319O350m0142j5767J8608k208k9292l8784L003M8098n92N3247
10749I7647k5324K0584M4469j3638l8605K033P523L962J6772M0152k6094m3711
10737H5770J3113L6431J4875j7872m8463p4678L4337O4266N7654L2598K8756L4745
10725B61532M789m1433l2042p15R752J4708m6119k0640l9991R660L8248J4014
$$ plain form
10811 77967 77673 67346 92577 91745 40339 8049 -36888 -33141 13978 82286 67901 49947 21808
10798 21808 36297 38486 49148 113796 92243 99486 131659 94875 50987 27365 20613 78283
10786 78283 99278 74595 83597 112327 90937 79748 62255 91247 74633 19460 -17434 28597
10774 28597 45003 71370 90570 109851 143711 92195 139478 172581 157601 125019 95288 78322
10762 78322 68807 95126 101476 61334 45567 64175 61967 32675 -6109 -3106 44992 44400 97647
10749 97647 72323 92907 137376 123738 85133 87166 94689 98651 115423 155575 129481 85770
10737 85770 98883 135314 150189 132317 83854 9176 43513 107779 165433 198031 226787 261532
10725 261532 266321 224888 192846 192131 201883 216591 170472 149832 109841 119501 157749 171763
10713A71763k0910k5498j6872j2768M0771N3449N6309r963o2507l3197m2410J0096
10701A08263k3320n203K9598N4478P7362R940k728k4409j7525k1828k5724K8156
10689A87060p404M9P359P1372l0307l0392k8786k7256J0726l1708L4241J807j2813
10676A43948P480J9365K7365L7293J2085L296m8149l3571K8210O9558j1448l8460
10664B16972O795n376j9741L3309L4342M7937M130J0370J3190n084L5153L1268
10652D03265N3646O0713M219K1844N7673L1361m4241n2149O68l053J9995L8612
10640E92553O1942j3561K4222Q1314Q5607J51423J70479J77735J94472J87643
10630A713829J52906R6133J49570J43982J65424K69762M03282N21581P18782J045554
$$ plain form
10713 171763 150853 125355 108483 95715 136486 189935 246244 236281 173774 140577 98167 108263
10701 108263 84943 79740 109338 163816 241178 251118 248390 223981 206456 184628 158904 187060
10689 187060 179656 179705 187064 258436 228129 197737 168951 141695 152421 120713 154954 156761 143948
10676 143948 151428 170793 198158 235451 247536 250832 202683 169112 197322 266880 255432 216972
10664 216972 223767 218391 198650 231959 266301 314238 318368 328738 341928 336844 371997 403265
10652 403265 456911 517624 521843 543687 601360 632721 588480 536331 536999 533946 553941 592553
10640 592553 654495 640934 665156 746470 832077 983500 1153979 1331714 1526186 1713829
10630 1713829 1866735 1962868 2112438 2256420 2421844 2691606 3094888 3616469 4335251 5380805
10620E380805J458489K029578K640066L374153M100011M235576L126245R71752
10612B7316675j021079j877557j443052l44074R81766K574734M484542O579594
10604C7251549Q414831Q705015N698415l20729n343431o549334n017434k489241
10596D0349641J76832K852568N811945Q794788J0979604J0577326N264590l941587
10588H0865707j0766502j1605477r012977n761809k759993o1050K463507M657881
10580D8019287O044533N271349J264459m884406q922663q973506o843087m452384
10572B6523582k442639q59780L81678J313292J640029J130015p04762l026850
10564B3954565m357266m300766l497870k641180j924586j388634j027051p52030
$$ plain form
10620 5380805 6839294 8868872 11508938 14883091 18983102 23218678 26344923 27316675
10612 27316675 26295596 24418039 22974987 22630913 23612679 26187413 30671955 37251549
10604 37251549 45666380 54371395 60069810 59749081 54405650 47856316 42838882 40349641
10596 40349641 40526473 43379041 49190986 57985774 68965378 79542704 84807294 80865707
10588 80865707 70099205 58493728 49480751 43718942 40958949 40897899 43361406 48019287
10580 48019287 54063820 59335169 60599628 55715222 46792559 37819053 30975966 26523582
10572 26523582 24080943 23221163 23602841 24916133 26556162 27686177 26981415 23954565
10564 23954565 19597299 15296533 11798663 9157483 7232897 5844263 4817212 4065182
10556D065182o03329m97901m02507k28486k17734k33999j88031j51143j54963
10547A387089j49459q8712j04797q0771l4399m8746n0477l2839r958p2402m2244
10536F72285o3471k4352m849j2469J9849m6220o1833n034m3807n2198p782O04
10524C70723J4159j7875k2578M90K155N7832j5405l4994n9937j7692r857q368
10512B58653n6733j9964J2031K2517N46m2854o052l2530J2627M6229p392n6339
10500A30739L3704M5256M5496k1467l8122P050R18n615j8404j8477n5417L4110
10488A39771k6925l5804M6597M7803l1543r147k9032L0126l8526K0887L6767M0594
10476A91568N049j7349l8673l9216L2852M5275L4601m9794j9270R62N5559M965
$$ plain form
10556 4065182 3461853 2963952 2561445 2332959 2115225 1881226 1693195 1542052 1387089
10547 1387089 1237630 1148918 1044121 963350 928951 880205 829728 796889 786931 714529 672285
10536 672285 608814 584462 579613 567144 586993 540773 478940 473906 430099 377901 370119 370723
10524 370723 384882 367007 344429 344919 347074 404906 389501 354507 294570 276878 267021 258653
10512 258653 201920 181956 193987 216504 217050 174196 168144 135614 148241 194470 187078 130739
10500 130739 164443 209699 255195 233728 195606 202656 203574 197959 179555 161078 105661 139771
10488 139771 112846 77042 123639 171442 139899 130752 101720 131846 93320 114207 150974 191568
10476 191568 196617 179268 140595 101379 134231 179506 214107 164313 145043 146005 201564 206529
10464B06529l6544j3612L3367K257n7484j9344M7632R219q3786p8326j2945N9024
10452E5987N661K4529j5762k183Q348K4284K3886l0531j0919N8173Q387m8583
10440A01277l8152k1887J9014P8004O4015p407J4210O698l9493k9912J491J4282
10428A62140J1257n194k9141j1109m1443o0138m6898L2906N8933Q179K910k2795
10416E9607o6874n790k7847j9535J9896N4424N9980L2986k1737l9446L8529J1083
10404I5276k5943J6307k9244m428K3959O9295n4445m7478K2192N1915j6530K3591
10392A24467P589N3169O183l6452l9672M563k1375p703Q353L2406K0578l2167
10380A19939n8269k1593k3803L996p78k1588L2161j5239q289l2502K1451K1535
$$ plain form
10464 206529 169985 156373 189740 191997 134513 115169 162801 172020 88234 9908 -3037 55987
10452 55987 61648 86177 70415 68232 76580 100864 124750 94219 83300 141473 149860 101277
10440 101277 63125 41238 60252 138256 202271 194864 209074 215772 176279 146367 147858 162140
10428 162140 173397 168203 139062 127953 86510 26372 -20526 12380 71313 79492 82402 59607
10416 59607 -7267 -13057 -40904 -60439 -40543 13881 73861 106847 85110 45664 84193 95276
10404 95276 69333 85640 56396 51968 75927 145222 90777 43299 65491 117406 100876 124467
10392 124467 132056 185225 191408 154956 115284 119847 98472 90769 99122 131528 152106 119939
10380 119939 61670 40077 16274 20270 19492 -2096 30065 14826 6537 -25965 -4514 17021
10368A7021m743l7450o938N3717L9299N944K6414K3212m9257m6527l6763K8927
10356A2856o7987j0402O7448L1535j8517m63K5768n114L1595M5336M9804r83m1346
10343A19530j673J6245j6065m4304K7841K6003j1673l1218n0086L1816k8568l6205
10331A643K5649N0087n4373o791P2837M3296k3322K060K6258J6118j7227m4308
10319I1927L3405J8362j5312m7151k7675N259l075l0072J6705K8638K9318p377
10307I2952R845J4753j0205l2395o3055J4187L7428J2784n0176J1159R976M745
10295E1998L7222j9952l1697j4934K6205o200M3835l2025q1294j4962K9279Q742
10283c783J9827Q091K5308n922M045K3227K4964n545L213L7312L9454N5328L6117
$$ plain form
10368 17021 12278 -25172 -32110 21607 60906 66850 93264 116476 67219 20692 -16071 12856
10356 12856 -55131 -65533 1915 33450 14933 14470 40238 35124 66719 112055 161859 160876 119530
10343 119530 117857 134102 118037 73733 101574 127577 115904 84686 34600 66416 37848 1643
10331 1643 27292 77379 23006 16215 89052 132348 109026 111086 137344 153462 136235 91927
10319 91927 125332 143694 128382 81231 53556 58815 55740 25668 42373 71011 100329 92952
10307 92952 102797 117550 107345 74950 11895 26082 63510 76294 26118 37277 47253 51998
10295 51998 89220 69268 37571 22637 48842 42642 86477 54452 -26842 -41804 -12525 -3783
10283 -3783 16044 24135 49443 43521 47566 70793 95757 90212 93425 130737 170191 225519 261636
10270B61636M6299L6065j4178k9200k649l2321o9528m2155k7503m5330K7376J8451
10258A26963j1714l0280n0029j4000j9649l5653l8677N9751P330k9826K3407L7403
10246B5026J9153r214Q743J9071J2852N756k9985j9538O1015j377k9500m1946
10234B0056J5158j0713k6680n696J7238q777O34J8408L5350n1779k2787K192m125
10221b1521q945J2982M5506j9094k0665M911j2213J5035L2968k7646m2M117R367
10208A4760j8311L2998K8693l9192j8191K7067J5551K3519N0290j7767o8800l5681
10196e064J4982K7404p288k3404j455j6757j7476j4956J9089k7623L1545O6516
10184D5513k4435j2746M696M5000P2611L6023J48l2080N1075K2227j1804k3183
$$ plain form
10270 261636 307935 344000 329822 300622 297973 265652 196124 153969 126466 81136 108512 126963
10258 126963 115249 84969 34940 20940 1291 -34362 -73039 -13288 -5958 -35784 -12377 25026
10246 25026 44179 34965 43708 62779 75631 81387 51402 31864 92879 91502 62002 20056
10234 20056 35214 24501 -2179 -7875 9363 586 1220 19628 54978 3199 -19588 -17396 -21521
10221 -21521 -30466 -17484 28022 8928 -11737 -6826 -19039 -4004 28964 1318 1276 5393 14760
10208 14760 -3551 29447 58140 18948 757 27824 43375 66894 117184 99417 30617 -5064
10196 -5064 9918 37322 30034 6630 5175 -11582 -29058 -44014 -24925 -52548 -21003 45513
10184 45513 21078 8332 13028 58028 130639 166662 166810 134730 185805 208032 196228 173045
10172A73045m381Q966R272P7191O5843K9280M4730J6259l7713o2779m3118k0569
10160B56026j1484j77M429M4275O1049N6915O5335k4361n8339k1115o7664o220
10148B98669o654n3131J2675K7955N4462L5768K585k3111r1487n7459l6677p115
10136A56480n4699n2158K9248M4041k4373l3870M9219j3766j1083M546j5711L6063
10124A13937J6736n511k611n3412P75m16k6867o3671m8739L9769J0388M7930O9135
10111I7443j590l8048Q184J9381j3100j2795m1877m6700N178k364J5333K1561
10099A0606k07M5908M1968l4173p1063m128l2587J9735L2200J6386k1193j9810
10087a6358p377K2942M1694K2342J9962l1079N491j000j5503m931m4593L2708
$$ plain form
10172 173045 168664 177630 186902 264093 329936 359216 403946 420205 382492 319713 276595 256026
10160 256026 244542 244365 248794 293069 354118 411033 476368 452007 393668 372553 304889 298669
10148 298669 292015 238884 251559 279514 333976 369744 372329 349218 257731 200272 163595 156480
10136 156480 101781 49623 78871 122912 98539 64669 113888 100122 89039 93585 77874 113937
10124 113937 130673 125162 122551 69139 69914 69498 42631 -21040 -69779 -30010 -19622 28308 97443
10111 97443 95853 57805 65989 85370 72270 59475 17598 -29102 -23924 -26288 -10955 10606
10099 10606 10399 56307 98275 64102 -6961 -11089 -43676 -23941 8259 24645 3452 -16358
10087 -16358 -23735 -793 40901 63243 83205 52126 57617 56617 41114 36183 -8410 24298
10075B4298L3082j743r652k2754m5298n292r218l3764k8874L4426L5097J6748
10063a2944K401j3748r652J6821q996M8534k4019J369L4411P390j5903K4860j4391
10050C6133p684J6828r0752m4042P032L8658J2005J8469J2039j3305N7889Q8799
10038A32069q452m0379l7801l3805o311j7184j7944J3874K8856K5478j8694N435
10026B5142j0850M1640J6597k9664j6482j3267L5366P260k4704k1289L2005M4861
10014H6615R503l2171m4138J2437O8728K6531m2289l5311o645l2762n2543K0510
10002b1535J5740K8317m137J5275m3780o6556M105p807l0789K6720J1624l3014
9990a05837j694J3699K943N7759M5462L0156j7064M210J2680K8661M079L560m9124
$$ plain form
10075 24298 57380 55637 45985 23231 -22067 -27359 -36577 -70341 -99215 -64789 -29692 -12944
10063 -12944 -10543 -24291 -33943 -17122 -26118 22416 -1603 -234 34177 41567 25664 50524 36133
10050 36133 28449 45277 -45475 -89517 -82485 -43827 -31822 -13353 -1314 -14619 43270 132069
10038 132069 123617 83238 45437 11632 5321 -11863 -29807 -15933 12923 38401 19707 25142
10026 25142 14292 55932 72529 42865 26383 13116 48482 55742 31038 9749 41754 86615
10014 86615 96118 63947 19809 32246 100974 127505 85216 49905 43260 10498 -42045 -21535
10002 -21535 -5795 22522 18385 33660 -10120 -76676 -72571 -80378 -111167 -84447 -72823 -105837
9990 -105837 -107531 -93832 -90889 -33130 12332 42488 25424 29634 42314 70975 75054 78614 29490
9977B9490l8192l8329k703O3161O122p9843k6153P9574M2770j6239K762J6123
9965C8543K9824J3605k5653m0806j099M2058j1091k784r272K0305k1437n7119
9953b4926J1551J0896O6667R291n3342k5467K9154k3759J7242J2973k2421j5462
9941g603J9088K5506J6905Q403J9852M7512N5571N0190N3157J07059J62361J71563
9929G29564r5576k59962r7424l6000l4100l4382o168m6746k8080k484k514m865
9917H1263k6806k6192n0392o555M168N5021J7009l1024n9615o648L4628O1807
9905D6664K1718N62o3760J5777J9993k2287Q322j3581M5583L0470l4399m7525
9893G537k7999q556O7342j1859m8656j3404N6095j0548j5414M4439j389m4097
$$ plain form
9977 29490 -8702 -47031 -49734 13427 19549 -60294 -86447 -6873 35897 19658 22420 38543
9965 38543 68367 81972 56319 15513 14414 56472 45381 42597 33325 53630 32193 -24926
9953 -24926 -13375 -2479 64188 73479 20137 -5330 23824 65 17307 30280 7859 -7603
9941 -7603 11485 36991 53896 62299 82151 129663 185234 235424 288581 395640 558001 729564
9929 729564 633988 374026 276602 240602 206502 172120 165952 119206 91126 88642 86128 81263
9917 81263 54457 28265 -22127 -28682 -24514 30507 47516 16492 -43123 -49771 -15143 46664
9905 46664 68382 68944 5184 20961 40954 18667 26989 13408 58991 89461 55062 7537
9893 7537 -20462 -29018 38324 26465 -22191 -35595 20500 9952 -5462 38977 37588 -6509
9881f509J9824l1528p320O2260j2282m4013j7745M1129O3246K1897m4878J9515
9869F3596J5739p606m4265k49K60n868k8499k8371P172K7460k5909M427k909k7535
9855e2557J6696J6043K6964K3630P793l155j8967j7519r432o100m171O9479K3993
9842G2697q9576k0014M9834K6373J3057Q151J8471p4232r742O0113L0850j8815
9830F7167k4772o0965j6553L7709J1739J9663K0489O9765L000l2633n1852k0820
9818B1937K6839m2948J0p443M3241M0750j0628n676l991n995j1794j9841k0884
9805C577N171K7123n1893l0953J4408M4914O4527J2175m2692l3124n582j0478
9793b827q630P661k3049j9363j0202l841L1156J4036j2862k0669p481M3756L1652
$$ plain form
9881 -6509 13315 -18213 -25533 36727 24445 -19568 -37313 3816 67062 88959 44081 63596
9869 63596 79335 71729 27464 27215 27475 21607 -6892 -35263 -28091 -631 -26540 -22113 -25022 -52557
9855 -52557 -35861 -19818 7146 30776 38569 35414 16447 -1072 -10504 -16604 -20775 48704 72697
9842 72697 -16879 -36893 12941 39314 52371 60522 78993 4761 -4981 55132 85982 67167
9830 67167 42395 -18570 -35123 2586 14325 33988 54477 124242 127242 94609 42757 21937
9818 21937 48776 5828 5838 -1605 41636 82386 71758 66082 62091 56096 44302 24461 3577
9805 3577 8748 35871 -16022 -46975 -32567 12347 76874 89049 46357 13233 7651 -2827
9793 -2827 -11457 -3796 -26845 -46208 -56410 -60251 -29095 -15059 -27921 -48590 -56071 -12315 19337
9780A9337n180j1364n0843l5249L0004K8676R0039l5865k0071M867L3857O008
9768E4216j4292n3627l6461M931L3339q746r349o34m0707l2817l153O9687N1389
9755A3776J6769m5281j9458m2020j9444M1661L3031k0549J8045L3884M0153L9018
9743H9585m7073k1395l8695K155L3357k3585k020Q9383O8933l3785k1496M2476
9731A37840o5441n0707K1681N075l4083k6081Q256K6599j7422j030k5532k390
9719b3235J9436j2579r795p321k048J6691q119L881l8750j9540J864L3262R765
9706c6488J2459J9454J6123J3720N837M565m9305m0946j0280m711L0581O2303
9694B3312J3876l4924m196P5035L0772k9068r0719m4626L5701R242Q207K6797
$$ plain form
9780 19337 14157 2793 -48050 -83299 -53295 -24619 65420 29555 9484 14351 48208 54216
9768 54216 39924 -13703 -50164 -45233 -11894 -20640 -29989 -30623 -71330 -104147 -107300 -37613 13776
9755 13776 30545 -14736 -34194 -76214 -95658 -53997 -20966 -41515 -23470 10414 50567 89585
9743 89585 42512 21117 -17578 -15423 17934 -5651 -7671 81712 150645 116860 95364 137840
9731 137840 72399 21692 43373 48448 14365 -11716 -3460 23139 5717 4687 -20845 -23235
9719 -23235 -3799 -16378 -26173 -33494 -35542 -18851 -26970 -23089 -61839 -81379 -79515 -46253 -36488
9706 -36488 -24029 -4575 11548 25268 31105 35670 -13635 -54581 -64861 -69572 -38991 23312
9694 23312 37188 2264 -1932 73103 103875 74807 -15912 -60538 -24837 -15595 -7388 19409
9682A9409j0694K3034O673o9288n2092J7591K4746N7396K3J8839R273p584K0320
9669E7646L7922M2437l2013o7876n6895K0000j9744j8105r570k3214L4033N3497
9657A8118L7968M8877P0196J20440J40321P0776j74825j05092o8986q1392J833
9646G8234l978j5810o0247K990K7292k5166J2269K4279J0545N1117n2141l0477
9634A8907k1758L2380J1082k5380j7092K3526r755k5732J1840L8654k1290Q730
9622B4112M5756K0281j9629j9724k5630K939p48r406L1351p606j2134L5921L935
9609F9418l2401k1160o84N602j3859n7278j5853k107m0633J7162K5444L8283J2001
9596a6065J0329J3941l3193N371o29n5192j9234M0814N3799K2827J5856J1980
$$ plain form
9682 19409 8715 31749 38422 -30866 -82958 -65367 -40621 16775 16798 35637 44910 37326 57646
9669 57646 95568 138005 105992 38116 -18779 1221 -18523 -36628 -46198 -69412 -35379 18118
9657 18118 56086 104963 175159 295599 435920 506696 331871 226779 157793 76401 78234
9646 78234 74256 58446 -1801 1189 28481 3315 15584 39863 50408 101525 49384 18907
9634 18907 -2851 29529 40611 15231 -1861 21665 11910 -13822 -1982 36672 15382 24112
9622 24112 69868 90149 70520 50796 25166 28105 27357 17951 49302 41696 29562 65483 69418
9609 69418 37017 15857 15173 20775 6916 -50362 -66215 -68322 -108955 -91793 -66349 -28066 -16065
9596 -16065 -5736 8205 -24988 -19617 -20246 -75438 -94672 -53858 -59 22768 38624 50604
9584E0604l9949m6529k2439M865L8609M9738P502l5051j4292J5411j4390K4509
9572A8588K5117l817l5969k6323k2060J4342k351l4067L817J8904nl54N3110l5421
9558b6489N96J7922O369P63k1527L908M456R850Q056M3019J492k6561l6079j9117
9544c3342N4379m3471n5458L7160N2205O632r66L6664j9741n6138J6151K3349
9532A7424j1031l7219k4798L1458L9825j984p009l1629j5534J5138J8239n363
9520a2483r041N466J4360k6209l563p824L1136J7751Q29K9472k5758Q106Q704
9507C0946n3946n127J1871L6669M0865j9619j2375n892j1559j2658M4590R499
9495E3264o6722j3584m8853j8731N980k1074P189j2611M4852N3036j7156j3688
$$ plain form
9584 50604 10655 -35874 -58313 -53448 -14839 34899 42401 7350 -6942 8469 -5921 18588
9572 18588 43705 39888 3919 -22404 -44464 -30122 -32473 -66540 -62723 -43819 -43824 -44178 8932 -26489
9558 -26489 -25893 -7971 -1602 -839 -22366 -18458 -14002 -4152 3904 46923 48415 21854 -14225 -33342
9544 -33342 21037 -22434 -77892 -40732 11473 18105 17139 53803 34062 -22076 -5925 17424
9532 17424 6393 -30826 -55624 -24166 15659 13675 6666 -24963 -40497 -25359 -7120 -12483
9520 -12483 -21524 -16058 -1698 -27907 -31470 -39294 -8158 9593 10422 39894 14136 22242 30946
9507 30946 -23000 -28127 -16256 20413 61278 41659 29284 23392 11833 -825 43765 53264
9495 53264 -13458 -27042 -75895 -94626 -88646 -109720 -102531 -115142 -70290 -17254 -34410 -48098
9483d8098l4472J0408L7692M017Kk5864j5591O908j4507j1509N9928Q8793l5088
9470B2619j5990K8093m420R995k538M945J0389J4773k2149J8532J9349p847J9841
9457I5592j0984j5251n664J7732K448P357K3931j0091q5877j7541J0352m483L527
9444A1048R585n727k2716M76K4599J079k7214l0157J7163N207M7243J9234J4082
9431F3902j7411m7348J8407M4342k1677l1086j4232j6043j4614p374m0966O908
9419g7192N7528K0699k0013j0203N2099O8944J13l8275m3615k9132R998P618K1319
9406A9888J0563K9673L28r831k8645M061R50n2032M8599q793n830k3803k3418
9393c8290M6078j037m5080K0129K8557k3575j8476J0976K5553J6946O046K8005
$$ plain form
9483 -48098 -82570 -72162 -34470 -30453 -30451 -56315 -71906 -64998 -79505 -91014 -31086 57707 22619
9470 22619 6629 34722 30302 40297 37759 42704 53093 67866 45717 64249 83598 75751 95592
9457 95592 84608 69357 63693 81425 83873 91230 115161 105070 19193 1652 12004 7521 11048
9444 11048 20633 14906 -7810 -7334 17265 18344 -8870 -39027 -21864 -16657 30586 49820 63902
9431 63902 46491 -857 17550 61892 40215 9129 -5103 -21146 -35760 -43134 -84100 -77192
9419 -77192 -19664 1035 -18978 -29181 22918 91862 91975 53700 10085 -19047 -9049 -1431 19888
9406 19888 30451 60124 60452 50621 21976 26037 26987 -25045 23554 14761 8931 -14872 -38290
9393 -38290 7788 6751 -38329 -18200 10357 -13218 -31694 -20718 4835 21781 27827 55832
9381E5832r481J2341q952m9740J1906m1335K0784J8087M1270n760l0531k0866
9369f445J1872M9927n367l1187K673j4114l41K1551j8759J5380L2554O238M391
9356F8373j5207k8958k9340n62J3191N3692L1035n2553j7027J7943Q78l8859j7085
9343a4479k3882L5729L5078l6249p657M215J5081K4757l3887k5079j4579j8204
9331e9156J1887L0238M1391J1298l8412j7700L5986K6387j7334l3722j172K8995
9319A8686M8292N31M154k9831k2563O274N841l1847m5799N4319K8968j7365o412
9306A3248k5025J2826m652j3046L2595M997j7113l2443K1711K4772k4750j915
9294h795r623n655J1875j2085J9012m1335k4214P545M9400K2753K141n7310q193
$$ plain form
9381 55832 46351 58692 49740 0 11906 -29429 -8645 9442 50712 44952 14421 -6445
9369 -6445 5427 55354 49987 18800 21473 7359 7018 28569 9810 25190 57744 63982 68373
9356 68373 53166 24208 -5132 -5694 7497 61189 92224 39671 22644 40587 41465 2606 -14479
9343 -14479 -38361 -2632 32446 -3803 -11460 -7245 7836 32593 -1294 -26373 -40952 -59156
9331 -59156 -47269 -17031 24360 35658 -2754 -20454 15532 41919 24585 -9137 -10309 18686
9319 18686 66978 67509 71663 41832 19269 25543 31384 -463 -46262 8057 37025 19660 13248
9306 13248 -11777 1049 -3603 -16649 15946 20943 3830 -28613 -6902 17870 -6880 -8795
9294 -8795 -18418 -24073 -12198 -24283 -5271 -46606 -70820 -63275 -13875 8878 11019 -46291 -54484
9281e4484J3047N334r649n0468R335N3896K9348q655m020K2840p745k7552L855
9268b4918J1556p184J3136J6098K6365j0810o4489k5803L4394j325K7386L4242
9256B8648l521k2988k6839l7153R936L2263k7344m48J9084k8653K08J1842J018
9243d3947j0237K1929j4445O747K4795o1404k2775R329J5923M0485P7153j8307
9231B5246R984r132k9552l6378p1989O816P4617J1845p168m559j4483J591J8276
9218b4886K6393j5867q334j1392O4506P7189k2545r3732l4345N39K9975L704M5597
9205C6802j3995o600j3921J6650J7335k9103m0614L1594J6028l5825l1658j1368
9193f4675L2051P0366K4995j2869j2496l6266l3883L788k3610K1389M7776q082
$$ plain form
9281 -54484 -41437 -36103 -45752 -96220 -86885 -32989 -3641 -12296 -16316 6524 -1221 -28773 -24918
9268 -24918 -13362 -20546 -7410 8688 35053 24243 -40246 -66049 -31655 -32980 -5594 28648
9256 28648 25127 2139 -24700 -61853 -51917 -19654 -46998 -47446 -28362 -57015 -56807 -44965 -43947
9243 -43947 -54184 -32255 -46700 -39953 -15158 -76562 -99337 -90008 -74085 -33600 43553 25246
9231 25246 35230 26098 -3454 -39832 -111821 -105005 -30388 -18543 -25711 -30270 -44753 -43162 -24886
9218 -24886 1507 -14360 -22694 -34086 30420 107609 85064 -8668 -43013 -42474 -12499 -8795 36802
9205 36802 22807 16207 2286 18936 36271 7168 -33446 -1852 14176 -21649 -53307 -64675
9193 -64675 -32624 37742 62737 49868 37372 1106 -32777 -28989 -52599 -31210 16566 8484
9181H484J8039J3517l5848m4827m4649K809K5179K4301k3957J3000J8965K3149
9169a838k4965k930L8221K2185K021K7727J7039k1520l0384j9160K1383L7988
9157F5767l7523m1913j6070L0538J6917n6812k9249K2451N9287K6973n2316k4611
9145c6561J0308l3021J142O7118j1798j2037K2394o812n2129j7465j027L7975
9133c1913K4261j5997j1883K6889k493l1562l3211J0128K687L2566q779K945k743
9120c9105L563L9423K1181m44J7581K1868Q945K8521J579k4318p609m7761k9227
9107e803K0306M1571J5247k0448l0372m9634l0484J1260J0373o738j5971M1172
9095a9521N2380k2687o010K8222m0891j4765k5722j868O0463J3630k6749k5539
$$ plain form
9181 8484 26523 40040 4192 -40635 -85284 -82475 -57296 -32995 -56952 -43952 -24987 -1838
9169 -1838 -26803 -29733 8488 30673 32694 60421 77460 55940 25556 6396 27779 65767
9157 65767 28244 -13669 -29739 799 17716 -39096 -68345 -45894 13393 40366 -11950 -36561
9145 -36561 -26253 -59274 -58132 8986 -2812 -14849 7545 733 -51396 -68861 -69888 -31913
9133 -31913 -7652 -23649 -35532 -8643 -11136 -42698 -75909 -65781 -63094 -30528 -39307 -36362 -39105
9120 -39105 -35542 3881 25062 24618 42199 64067 73012 101533 103112 78794 71185 23424 -5803
9107 -5803 14503 56074 71321 50873 20501 -29133 -59617 -48357 -37984 -44722 -60693 -19521
9095 -19521 32859 10172 4162 32384 -8507 -23272 -48994 -50862 9601 23231 -3518 -29057
9083b9057J4190K0578o2040o358J5658J8064m771J3649K1295K6867M6890M2900
9071A17865j4940o7775n0835k0501m7456M9547L2545p673M9K0295m84J0817R19
9058B2373K4415j2499o588q679l9446q071J2211K1126J7530j4213K577q4958j6775
9045i0997L2559O8243K2788r196L570k5160j1816K148K2255J4078K117Q114r651
9032B9052k5983J4316o685L8830N642m1342j0551j2801L1909J2543m7122k8123
9020d0315j9435j0809M8730m273l6018l6147K9932L2098L6905m989J5486K6078
9008C7243N1302L206j5478p1097p5746j4528N9027K2798l9614j2854n098K9295
8996c1544r962k2069J0177j5910Q138L3150m6292l8737N665O4932K0720j1944
$$ plain form
9083 -29057 -14867 5711 -56329 -62687 -47029 -28965 -33736 -20087 1208 28075 74965 117865
9071 117865 102925 35150 -15685 -36186 -83642 -34095 -1550 -9223 -9174 11121 10637 21454 22373
9058 22373 46788 34289 27701 19022 -20424 -28495 -16284 4842 22372 8159 10736 -74222 -90997
9045 -90997 -58438 9805 32593 23397 26967 1807 -10009 -7861 14394 28472 30589 38703 29052
9032 29052 3069 17385 10700 49530 55172 13830 3279 -9522 22387 34930 -12192 -40315
9020 -40315 -59750 -70559 -21829 -26102 -62120 -98267 -68335 -36237 668 -4321 11165 37243
9008 37243 88545 91751 76273 5176 -70570 -85098 -26071 -3273 -42887 -55741 -60839 -31544
8996 -31544 -41506 -63575 -53398 -69308 -61170 -28020 -74312 -113049 -107384 -42452 -21732 -33676
8984c3676l3027n609M5862O1376J1164n791j3293l1423l089L6863K1222l0990
8972A9589J6128Q663M890k4585J9284L4614k3570l9533N983o60J3984K1001q117
8959D7671k0280p155j2447Q895L1476o651k7818j7021l4589J5204K669j7224L8810
8946A540M3117k4788k7540o1069R323N0048J1881L000J5898P304K5585j2190j1363
8933C0746j2837j3488n840M2236l5227o5842l4973j217J5486P178L3003K2803
8921a7972j133l1756l6923L0115L1625k1429L4682J2225k9170j709J1960J1955
8909g530k3783j3789M1096j473l679j3929M1346K4217k6367j8815L7582l2562
8897B314m9809J1154J3800P913n479O146K2309P709Q802l7198j961k3213n395
$$ plain form
8984 -33676 -66703 -72312 -26450 34926 46090 40299 27006 -4417 -7506 29357 50579 19589
8972 19589 35717 44380 49270 24685 43969 78583 55013 15480 21463 20803 34787 55788 47671
8959 47671 27391 20236 7789 16684 48160 41509 13691 -3330 -37919 -22715 -20046 -37270 1540
8946 1540 44657 19869 -7671 -68740 -59417 -9369 2512 5512 21410 28714 54299 42109 30746
8933 30746 17909 4421 -1419 40817 5590 -60252 -95225 -96442 -80956 -73778 -40775 -17972
8921 -17972 -19105 -50861 -87784 -57669 -26044 -47473 -12791 -566 -29736 -31445 -19485 -7530
8909 -7530 -31313 -45102 -4006 -5479 -9158 -23087 18259 42476 16109 -2706 34876 2314
8897 2314 -47495 -36341 -22541 -14628 -20107 -13961 8348 16057 24859 -12339 -14300 -37513 -42908
8884d2908j7637l4004O5057J5287L142M4757J4011m3956n677K3115O889K2793
8872E0869j4198j9842r449L618K8480J6620l0635j1155j7987r37O2R245J7318
8859B2009R203L3644L147k5626j5376j3615M0297K7526J67j173J7304m1818j6336
8846C9353m3541k5765j2480J8679K6422m737q779K0433J2687k3199K797j9605
8834a7735l266M6430j4464m485J055j1157k0433J928J9462L0392K6717j363L88
8821E3469J259o5838J2576K4788m8067L179j5206l2769j8186K646J9804M803M5724
8808a1818K3174j2294j667q376j2463K55L7210q884l4248k1192M6086L1103j6633
8795A0253K9628n349p911N9299j4210l4621q626n716j7382j0157P080M1599K6453
$$ plain form
8884 -42908 -60545 -94549 -29492 -14205 -11063 33694 47705 3749 -1928 21187 28076 50869
8872 50869 36671 16829 7380 10998 39478 56098 25463 14308 -3679 -4616 -4554 4691 22009
8859 22009 31212 64856 68003 42377 27001 13386 53683 81209 81376 80203 97507 55689 39353
8846 39353 -4188 -29953 -42433 -23754 2668 -2069 -10848 9585 22272 -927 1870 -17735
8834 -17735 -21001 25429 10965 6480 7535 -3622 -24055 -22127 -2665 27727 54444 53081 53469
8821 53469 54728 -11110 1466 26254 -21813 -18634 -33840 -66609 -84795 -82149 -62345 -57542 -11818
8808 -11818 11356 -938 -2605 -10981 -23444 -23189 14021 5137 -29111 -50303 -4217 26886 10253
8795 10253 39881 34532 26621 85920 71710 37089 28463 22747 5365 -4792 2288 43887 70340
8782G0340o091q349J164j6006n8711o802q557l3386L7714o80k7802M8015K6218
8769A7067r002J4916K6251P224j6358l0713K9530N9239J0285J5410N941n616k6919
8756I7255m2348j2400j5591O587j0590j0624q710q324r829L6758K7676J1481m5626
8743A5715k3392j7296n836j7744p244L5045K8041J8744k365o3395J140j5908K9815
8730b4680O8740J0561j1335k0085l3390L3958k8853j5268L0294j7636j2017K0141
8718D30M3019n120m971l553j2657j495j0122k838M3452R274q5057k403L0902Q389
8704G250J189K956k5462J9607j6353J5263P2537k3111m5540o66m00n8730j530
8691e2990J3914O8859k617o725Q054M8603l4273k7332o3010L0138N8988j4836
$$ plain form
8782 70340 64249 55900 57064 41058 -17653 -24455 -33012 -66398 -28684 -29364 -57166 -9151 17067
8769 17067 8065 22981 49232 56456 40098 9385 38915 98154 108439 123849 129790 124174 97255
8756 97255 54907 42507 26916 33503 22913 12289 3579 -4745 -14574 22184 49860 61341 15715
8743 15715 -7677 -24973 -30809 -48553 -55797 -20752 7289 26033 23668 -39727 -38587 -54495 -24680
8730 -24680 44060 54621 43286 23201 -10189 23769 -5084 -20352 9942 -7694 -19711 430
8718 430 43449 38329 33358 29805 17148 15653 5531 2693 46145 55419 -29638 -32041 -1139 7250
8704 7250 8439 11395 -14067 5540 -10813 4450 76987 53876 8336 7670 7270 -51460 -52990
8691 -52990 -39076 29783 27166 20441 28495 77098 42825 15493 -47517 -17379 41609 26773
8679B6773L36K2580k7842j8080k4380M5789K597l0238K4984L1827P393J899P34
8666F4372m6753m3465L6049J8289l0373j9488j0112J198N8851K7940o181l0626
8654A9701j8120j4132M8839j314K4826j1133j7301r47J4302J058k298J2448l2517
8641B3412k543L555l6815l538m2430P62o780K6667K2721P0919k2797j2095J9945
8628D0983k3297l3914l1739N0633j0910j0068M4678L2658l9546j0131O784l3800
8616a7669o377J1056L6572R865q793J5430l805K6510J2755k1250l3038M5193O4764
8603A31213K2498M920j7314k2247l6637m1710k2968l62K9457J4142Q130p7947
8591h825n2967M5888M6868J466j6739j022M783J5650q664L9480J7535k0524k6814
$$ plain form
8679 26773 27109 49689 21847 3767 -20613 25176 27773 -2465 22519 54346 61739 63638 64372
8666 64372 17619 -25846 10203 28492 -1881 -21369 -31481 -30283 28568 56508 50327 19701
8654 19701 1581 -12551 36288 34974 59800 48667 31366 30419 44721 45779 43481 55929 23412
8641 23412 20869 24424 -12391 -15929 -58359 -57597 -64377 -37710 -14989 55930 33133 21038 40983
8628 40983 17686 -16228 -47967 2666 -8244 -18312 26366 59024 19478 9347 16131 -17669
8616 -17669 -24046 -12990 23582 33447 24654 40084 36279 62789 75544 54294 21256 66449 131213
8603 131213 153711 158631 141317 119070 82433 40723 17755 17393 46850 60992 69122 -8825
8591 -8825 -61792 -15904 30964 32430 15691 14669 19452 35102 26438 65918 83453 62929 36115
8578C6115J4759m70j363j6489J0067J2783K9925n655R031m251N489j8857q438
8565F2646q799k008m3435j3955J9067M3731j5784q3327Q334q650j3157n670o055
8552f7062K6129J5060k8211j8457k5872M6479P3428O450k9949k7662N9177J3139
8540D2649R788K7934j3819j7820m5018j2447K8059N791k4228j8188L008N3588
8528C9297J2198l4752j339o79L3k7320k7191J6445K7836J9756k4501m1334J5750
8515b5801K4426R941j5360L788J0018k6625K2317l969r581K8175M0811j9313k3145
8502A5682o691J4880L685p320R95o614k6436k0740J5276L0249M8030l6498o1206
8489c6708k1192m722P728L5397K5110j3836P473K0518n5718j150Q731P583m2537
$$ plain form
8578 36115 50874 50404 49041 32552 42619 55402 85327 79672 88703 84452 89941 71084 62646
8565 62646 53847 51839 8404 -5551 13516 57247 41463 -41864 -33530 -42180 -55337 -61007 -67062
8552 -67062 -40933 -25873 -54084 -72541 -98413 -51934 21494 27944 -2005 -29667 29510 42649
8540 42649 52437 80371 66552 48732 3714 -8733 19326 25117 889 -17299 -14291 39297
8528 39297 51495 16743 15404 14725 14758 -12562 -39753 -23308 4528 24284 -217 -41551 -25801
8515 -25801 -1375 8566 -6794 -3006 7012 -19613 2704 -1265 -10846 17329 58140 38827 15682
8502 15682 8991 23871 27556 20236 21231 14617 -11819 -32559 -17283 12966 60996 24498 -36708
8489 -36708 -57900 -62622 -54894 -19497 5613 -8223 -750 19768 -35950 -37100 -28369 -20786 -63323
8476f3323j8217M3257r26N6255P5491r480m9426k3137k0620j4109k6864j9752
8464g0851L3871R997j5951J7689Q826K742m1469j848M4247L0941j9944j9852L6296
8451A4694O134k5866j8206K2527j2635K4363M9022q33n425o437l4770K0700M3507
8438G6775K1167k5288Q882K1058k8479j7317O095j1385k3611J7257J6559M135
8426F5848R84k5822j3964o639L5466l0741m7042r505R390j4594O579l408l1933
8413f5381M7931j1600k9929J172l6879L7216J1973k8003q7P1664M0059j5699k8504
8400f067k4032j1735l5160m1811j9232L545N2806j767k1097L8283K6523K9861
8388i883L5808N0597m4901l8406k5957P38l589M4929N3562j9335k0363J2262J2361
$$ plain form
8476 -63323 -81540 -38283 -39209 17046 92537 83057 33631 10494 -10126 -24235 -51099 -70851
8464 -70851 -36980 -26983 -42934 -25245 -16419 -13677 -55146 -56994 -12747 18194 -1750 -21602 14694
8451 14694 20828 -5038 -23244 -717 -13352 11011 60033 59200 53775 47338 12568 33268 76775
8438 76775 97942 72654 81536 102594 74115 56798 62893 51508 27897 45154 61713 65848
8426 65848 66832 41010 27046 20407 55873 25132 -21910 -31415 -22025 -36619 -30040 -33448 -65381
8413 -65381 -17450 -29050 -58979 -57807 -94686 -57470 -45497 -73500 -73587 -1923 38136 22437 -6067
8400 -6067 -30099 -41834 -76994 -118805 -138037 -134492 -81686 -83453 -104550 -66267 -39744 -9883
8388 -9883 25925 76522 31621 -6785 -32742 -32004 -35593 9336 62898 43563 23200 35462 47823
8375D7823r60j2936J3927j1654J2678k7096J2973L6888j1606k5100k0099K684
8363A7522J213K2035O740L3540m478o9896j0846j7753m0018l5280K2349L5684
8351c9188L8257J9461k3345j9070N89J8238K1513P520k593j569P988j4549K5010
8338C8262j9652J6477N7371j1394J0507J9302m068j7152j2070l2086r064L100
8326C9533m0458l0484k265J5436K0821M4753k4610J0103L9947K8340j7358M562
8314H8320j7847k1047n7242L4074J4914l4189r45P790m3722K5131M0353l1770
8302C820k2791J5900Q159K0730J1819n1389J0780l5077K06K0054L3734J7015K7973
8289F0933J7488n443j7603Q295m987l4172m741m6368N3057J8977J3594j9006l0240
$$ plain form
8375 47823 46863 33927 47854 36200 48878 21782 34755 71643 60037 34937 14838 17522
8363 17522 18735 40770 47510 81050 76572 6676 -4170 -21923 -61941 -97221 -74872 -39188
8351 -39188 -931 18530 -4815 -23885 -23296 -5058 16455 23975 21382 19813 27801 13252 38262
8338 38262 18610 35087 92458 81064 91571 110873 106805 89653 77583 45497 36433 39533
8326 39533 -925 -31409 -33674 -18238 2583 47336 22726 32829 72776 101116 83758 88320
8314 88320 70473 49426 -7816 26258 41172 6983 6038 13828 -29894 -4763 35590 3820
8302 3820 -18971 -3071 5088 25818 37637 -13752 -2972 -38049 -37843 -17789 15945 32960 60933
8289 60933 78421 72978 55375 63670 58683 24511 19770 -26598 26459 45436 59030 40024 9784
8276I784n3460K7686K2491o1601l3602L2268J9991l7141r87P4109K0752o743m730
8263H817l7429m9508Q233P4145K0014K7104k2031k007j867K6844j4408k5613j0140
8250B154L659j8498L2078N6524M1368k1913m7718L6500M0116n6120l7983K921
8238C3088k2815J7507J0589k9820K571J9286J8560J4566o155J414j058k0926m7562
8225a0755k3754O535J7402Q260k6866K8781L4578j396Q261l2322R862K5160n1183
8212g437n6381J4855K4913j00j6001r532J261k6694N2581P3146l3376m1820o123
8199c0708O316K252k8718J944K9668K7384K6765J5757j7889l3152j9307Q738l9317
8186e0267R110K3223j9328j6453M8011r057j2971N044N6563j5381j0156q371K6211
$$ plain form
8276 9784 -43676 -15990 6501 -55100 -88702 -56434 -36443 -73584 -74571 -462 20290 13547 8817
8263 8817 -28612 -78120 -69887 4258 24272 51376 29345 27338 25471 52315 37907 12294 2154
8250 2154 5813 -12685 19393 75917 117285 95372 47654 84154 124270 68150 30167 33088
8238 33088 10273 27780 38369 8549 11120 30406 48966 63532 57377 58791 57733 36807 -10755
8225 -10755 -34509 -27974 -10572 -2312 -29178 -397 34181 32785 41046 8724 18586 43746 -7437
8212 -7437 -63818 -48963 -24050 -24150 -40151 -49683 -48422 -75116 -22535 50611 17235 -24585 -30708
8199 -30708 -24392 -22140 -50858 -48914 -19246 8138 34903 50660 32771 -381 -19688 -10950 -50267
8186 -50267 -41157 -17934 -37262 -53715 -5704 -14761 -27732 -22688 33875 18494 8338 -33 26178
8173B6178j9521m4505k2408J5778O551K7263k0773K678K7724J2898m0749p881
8161c6767J4971k4331j3438N012M6256L4360L5514O314m0129o221L8501k4253
8149C5789o4813k2311j8815N8271M4985K4496j0889J8584K328p8559q349N3406
8137C4123k9962J9616k5410j5149p852M0197k3515k5945J299M579L3038J505j545
8124D979n7571r869K3933K0386m0524q431o357N324N9515j4699k642l0004j4007
8111f9967J3897L0657O543L9633M6365J2144k5329k673l3730j9411k9910k5603
8099e7384l058Q3812L1260l2460l608N5430p498L866k8715o958q239J1441l4151
8086C738m0532r579m2495l375n314Q7311J2120o678k0027l9345j7646J3517Q24
$$ plain form
8173 26178 6657 -37848 -60256 -44478 -37927 -10664 -31437 -28759 -1035 11863 -28886 -36767
8161 -36767 -21796 -46127 -59565 -54553 -8297 26063 61577 67891 27762 21541 60042 35789
8149 35789 -29024 -51335 -70150 -11879 33106 57602 46713 65297 67625 -10934 -19283 34123
8137 34123 4161 23777 -1633 -16782 -24634 15563 -7952 -33897 -32598 -28019 5019 6524 4979
8124 4979 -52592 -62461 -38528 -18142 -58666 -67097 -73454 -68130 -8615 -23314 -25956 -55960 -69967
8111 -69967 -56070 -25413 -18870 20763 67128 79272 53943 51270 17540 -1871 -31781 -57384
8099 -57384 -60442 23370 54630 22170 18562 73992 66494 70360 41645 34687 26448 37889 3738
8086 3738 -36794 -46373 -88868 -92243 -97557 -10246 1874 -4804 -24831 -64176 -81822 -68305 -67481
8073f7481J6559L2976k4806J6351L3893q324P428R47K9130J8143j6455L0393j4706
8060E4048j6651j3307m209K2010J0738k5155k4050N230k2981m0122O7265j3461
8048f45j9574J1509J5172l4790J8026L6347o509k6049J9941l0052J5346k3537
8036b4815K3198N5331q601m6295O122k2352M846M8932j2594m1150n8401l9157
8024a14936L0451P3916M3441l191k8659k3911j5974L4470L6439q229Q920j0768
8012B1969j3971k0470J4011L1445o787n1366n2089M5532p326l1860O191L2583
8000c2138K2304n811m850O213L3274J411p0151m5723O5430O7797p336j9962K2873
7987C3331J1294l5988K904L3780m1058M739K8052J9362p0314l1445K6928K0991
$$ plain form
8073 -67481 -50922 -17946 -42752 -26401 7492 -832 6596 7543 36673 54816 38361 68754 54048
8060 54048 37397 24090 19881 41891 52629 27474 3424 8654 -14327 -54449 12816 -645
8048 -645 -20219 -8710 6462 -28328 -10302 26045 19536 -6513 13428 -16624 -1278 -24815
8036 -24815 -1617 53714 45113 -1182 4940 -17412 -12566 36366 23772 -17378 -75779 -114936
8024 -114936 -84485 -10569 32872 29681 1022 -22889 -38863 -4393 32046 23817 32737 21969
8012 21969 7998 -12472 1539 32984 26197 -25169 -77258 -31726 -39052 -70912 -64721 -32138
8000 -32138 -9834 -15645 -20495 -14282 18992 20403 -49748 -95471 -30041 37756 30420 10458 33331
7987 33331 44625 8637 11541 45321 4263 9002 37054 56416 -13898 -45343 -18415 2576
7975B576K1106k1441l834J5234P970j7775l2809N1N4033J9747k1960o510J3200
7962B9588k1650m9297q004R070O47p910L548l233N727L5818J8865p127M129J2139
7948B2310L0405J5751J3625M2245l8761o5110p785K9051j5578r477l0029o998
7936b0351P033q792J4404K3874L885K6736j7004R673K3324M939n4034k5839k091
7923a4243O1491J3031K598L4295l5934q4804J6109K5136N238m4866j5820l227
7911d0996R618M1803J9478L0014J6013k9077K3651l1799n3965J343J0415Q706
7899E204J3984J1478Q116k4861j6001M968l3604N2423r620j2122k5560k9238K3503
7886c1330L320M9245J6713k4997j0205L8889k8264l6215j1386o68k8046L643M1787
$$ plain form
7975 2576 23682 2241 -1593 13641 21611 3836 -28973 -28922 25111 44858 22898 16388 29588
7962 29588 7938 -41359 -49363 -40293 -39646 -47556 -44008 -47241 -41514 -5696 13169 6042 10171 22310
7948 22310 52715 68466 82091 124336 85575 20465 12680 41731 26153 16676 -13353 -20351
7936 -20351 -13318 -22110 -7706 16168 20053 46789 29785 39458 62782 67721 13687 -12152 -14243
7923 -14243 47248 60279 62877 97172 61238 -23566 -7457 17679 22917 -21949 -37769 -40996
7911 -40996 -31378 10425 29903 59917 75930 46853 70504 38705 -15260 -13917 -3502 5204
7899 5204 19188 30666 38782 13921 -2080 2888 -30716 21707 12087 -35 -25595 -54833 -31330
7886 -31330 -28010 21235 37948 12951 2746 41635 13371 -22844 -34230 -34898 -62944 -59301 -17514
7873a7514o954m798J8801l5103j8400J3946M4567m0904K8175K1612n82m2748J1000
7860b8902L3864J8652k3059J2374k614L6845Q136k5010L1673m027l2450q350K3572
7847D0704l0190k6023N704l8066l3511K4414K5599O4173J0035p4164l4081M6530
7835a8876K0833k0496j3045j292j6787P437O1313l59N098N973p217j1791m0130
7822b9339K1100q037q183p798k8971J4858K7385m6546j1828L3198k8480m277Q691
7809f8227k065J9811J7039m2210O952K5322Q937P7758M66l1371J1069M0762j5420
7796D8823l3882m2811M9188J1460p118j8815J2675J0597l6310J2596K4198O566
7784C7167j3235m2414N627N9927k0101l9556l6840k0756M885K4860N244K3952
$$ plain form
7873 -17514 -24468 -29266 -10465 -45568 -63968 -50022 -5455 -46359 -18184 3428 2846 -39902 -28902
7860 -28902 4962 23614 555 12929 10315 47160 55296 30286 61959 57932 25482 17132 40704
7847 40704 10514 -15509 -9805 -47871 -81382 -56968 -31369 32804 42839 -31325 -65406 -18876
7835 -18876 1957 -18539 -31584 -32876 -49663 -42226 19087 18728 23826 29799 22582 10791 -29339
7822 -29339 -8239 -16276 -24459 -32257 -61228 -46370 -18985 -65531 -77359 -44161 -72641 -76918 -68227
7809 -68227 -70292 -50481 -33442 -75652 -68700 -43378 -34441 43317 43783 12412 23481 64243 48823
7796 48823 14941 -27870 21318 32778 25660 6845 19520 30117 -6193 6403 30601 37167
7784 37167 23932 -18482 -12855 47072 26971 -12585 -49425 -70181 -65296 -40436 -35192 -11240
7772a1240K9162o239k801L4520n678P106J8094l4030k9008k5243j1635J3492K6683
7759C183j4041r478n981O079j8736J2549Q395j3828o60M5484K4152K4444l0249
7746C1313J4229L3449k0926m5989n0165l1474j2408M2669M8069K6073Q755j3825
7734B9770k578k1367l1653O306J8506k1549j2265J7309o445J311q04K1593k203
7721d069o313L5943K500P133m4344j7003R454K1766O303M6209P673m3049r334
7708A2869l1011j7861J1110J4331j2080l320N7507M0609k569j0888l8603k72j5292
7695D530j8450k8453P54L0244K2097k0576j3278K1592R169K8553l2646j9978k2565
7682c9007K2323P1805M6308l900J6880L5322j408o5475o0711k2949K507K4833
$$ plain form
7772 -11240 17922 11683 8882 43402 37724 44830 62924 28894 -114 -25357 -36992 -23500 3183
7759 3183 -10858 -20336 -26317 -20238 -38974 -26425 -18030 -31858 -32518 12966 37118 61562 31313
7746 31313 45542 78991 58065 12076 -38089 -69563 -81971 -39302 8767 34840 43595 29770
7734 29770 27192 5825 -25828 -19522 -1016 -22565 -34830 -17521 -23966 -22655 -23459 -1866 -4069
7721 -4069 -10382 25561 28061 35194 -9150 -26153 -16699 5067 11370 57579 65252 22203 12869
7708 12869 -18142 -36003 -24893 -10562 -22642 -25962 31545 72154 69585 58697 20094 19822 4530
7695 4530 -13920 -42373 -41619 -11375 10722 -9854 -23132 -1540 7629 36182 3536 -16442 -39007
7682 -39007 -16684 55121 101429 97529 114409 149731 148323 82848 22137 -812 1695 26528
7670B6528j8006l3196J3191L3015M8267J900o2143m9085J7555P170m6745O2219
7658F70j5276l9315M1551J5243K3310M7993l1770j7816J1466M900p704k0481l1990
7645a9219p133Q152K5335p954L2692J1854l4384q599m1591j1422K3210k4948Q62
7632e3145J933O2588J9593m8173K044P485L6259m763k2688n5605L7880J3756l1665
7619c4501R596K2879n370k5871j2172J6189j8186K1961l1866k9146J6701K8816
7607d0970L0342L9213N2833J6724q063k2882J1785l0751j994n0298l6717j7213
7595e7991K7892L2665K9271K3025K4629k3840j8675j8628j7834o914L0263J0221
7583C4084N8571M4748P35k0671n3979M091j3386k4068L593M2276k5116p8370J9831
$$ plain form
7670 26528 8522 -24674 -11483 21532 69799 71699 9556 -39529 -21974 -14804 -61549 670
7658 670 -14606 -53921 -12370 2873 26183 74176 42406 24590 36056 40956 33252 12771 -19219
7645 -19219 -26352 -18200 7135 -819 31873 43727 9343 744 -40847 -52269 -29059 -54007 -53145
7632 -53145 -51212 11376 30969 -17204 -15160 -7675 28584 23821 1133 -54472 -16592 -2836 -34501
7619 -34501 -24905 -2026 -7396 -33267 -45439 -29250 -47436 -25475 -57341 -86487 -69786 -40970
7607 -40970 -10628 28585 81418 98142 90079 67197 78982 48231 46237 -4061 -40778 -57991
7595 -57991 -30099 2566 31837 54862 79491 55651 36976 18348 514 -6400 23863 34084
7583 34084 92655 137403 138138 117467 63488 67579 54193 30125 33718 75994 50878 -27492 -7661
7570g661K3662K5444L0546l4780n2715l5821j8486J6667M4183K8231J0826o030
7558B4066j966P347k2562M8005M5261l4390o9303l0415j0569k6904j2797O188
7546g8039O2929J9313M1527j2660m323K8620L0268l5355q150m1184l6377L2449
7534i82P0933J748k1919l4842M985j2056n2452J5817K5324k890K9930M4706q961
7521E9341l1825m0438k002j7511k3918N2912L2287R281N198Q66J297k2482k9860
7508f854j1955l4329M698M8868o313k4806o5795j3283N0953P2722M0470m0277
7496A4099j5576J6793N5179L957j691l4121l1863j3933l4519L3391J5957k0598
7484a2925j055m3304p306M86j0371J6160N3074K6667m0482J7480K4898m0401m1807
$$ plain form
7570 -7661 16001 41445 71991 37211 -15504 -51325 -69811 -53144 -8961 19270 30096 24066
7558 24066 22100 29447 6885 54890 100151 65761 -3542 -33957 -44526 -71430 -84227 -78039
7546 -78039 -15110 4203 45730 33070 28747 57367 87635 52280 44130 2946 -33431 -982
7534 -982 69951 71699 49780 14938 19923 7867 -44585 -28768 -3444 -6334 23596 68302 59341
7521 59341 27516 -12922 -14924 -32435 -56353 -3441 28846 38127 43325 44191 45488 23006 -6854
7508 -6854 -18809 -53138 -48440 428 -5885 -30691 -96486 -109769 -58816 13906 54376 14099
7496 14099 -1477 15316 70495 74452 72761 38640 6777 -7156 -41675 -8284 7673 -12925
7484 -12925 -13980 -57284 -64590 -64104 -74475 -58315 -5241 21426 -19056 -1576 23322 -17079 -58886
7471e8886p751K5295O253R917J8663l918O477j7176l0075l544K0189K660M7920
7458A6024J2383j6068K1042k5036O27n3595k3361l532j0590K0750M8334M4472
7446C1450K9107J1433j9363j0284J9791m0355j6479k1315j1022K9539K5844k0903
7434G443q5156m754l6385P461J6267M7865O0916k1765k3930K9437M465J0924Q730
7421B1518k0914J0314m919j4145l0803k864K4265L5005k9822j5065R628K0217
7409B415K6192J1852K9651n731l4440k0382J7553k7121l2428J0764K9729k730
7397E324N169q574o3103j2446L5220K9630K7417j0169j7925J74J6460O667L940
7384A7784J18N882n400m9454k5245K6073j9647J3045O2189K863l6817p524J2139
$$ plain form
7471 -58886 -66637 -41342 -35089 -25172 -6509 -10427 -3950 -21126 -51201 -54745 -34556 -31896 16024
7458 16024 28407 12339 33381 8345 8972 -44623 -67984 -71516 -82106 -61356 -13022 31450
7446 31450 60557 71990 52627 42343 62134 21779 5300 -16015 -27037 2502 28346 7443
7434 7443 -77713 -82467 -118852 -111391 -95124 -47259 13657 -8108 -32038 -2601 1864 12788 21518
7421 21518 604 10918 5999 -8146 -38949 -41813 -17548 17457 -12365 -27430 -17802 2415
7409 2415 28607 40459 70110 64379 29939 9557 27110 -11 -32439 -21675 8054 5324
7397 5324 10493 1919 -61184 -73630 -38410 -8780 18637 8468 -9457 -9283 7177 13844 17784
7384 17784 17902 23784 18384 -31070 -56315 -30242 -49889 -36844 25345 28208 -8609 -16133 -3994
7371c994l0724k8795L9163K5124K9364K1012O646K4969m2289j8827P973J0345
7359C9967m2703j3166l032N193M9792L2889m590J94o5638J510K8494M4437k1089
7346E2258m7746J381L270k0258k692L3422q413k4668k8382K5031J0861n01p736
7333a4173L9632L3948j0708k426K1416k5928k5375k5002k3401j9192J0773J5401
7321b5035K2721r612J105M0695M352K0652j2637l3210j6388L958j2963l505L0956
7308A1089j3769l4531J1937m4773p7453J3381L0246M0669R9446K2613J6914l6172
7296C9597p7013J7162L0516J0951k2159j0627L2551p473j3973n2193j071L1942
7284b1790m2382m827K7978J4522J8597J3274J6097J6112q893J8036J0547j2687
$$ plain form
7371 -3994 -34718 -63513 -24350 774 30138 51150 57796 82765 40476 21649 29622 39967
7359 39967 -2736 -15902 -18934 -13741 36051 68940 64350 64544 -1094 416 28910 73347 52258
7346 52258 4512 5893 9163 -11095 -13787 19635 11222 -13446 -41828 -16797 -5936 -6437 -14173
7333 -14173 25459 59407 48699 46273 67689 41761 16386 -8616 -32017 -51209 -40436 -25035
7321 -25035 -2314 -11926 -10821 29874 34226 54878 42241 9031 -7357 -3399 -16362 -19867 11089
7308 11089 -2680 -37211 -25274 -70047 -147500 -134119 -103873 -63204 36242 58855 75769 39597
7296 39597 -37416 -20254 10262 21213 -946 -11573 20978 13505 -468 -52661 -53732 -21790
7284 -21790 -64172 -68999 -41021 -26499 -7902 5372 21469 37581 28688 46724 57271 44584
7272D4584p535l5830l1277l016o692p272j7345K057k5995q465M4280K5668O038
7259b0800j1763p781n811j4466L7492L7714L117m045j5736j6797M1231l583n615
7246A3157K475J246j2587j1636J3274J1936K3738k4110L684L3441P319k9254j782
7233C0901q123n113l7265m942k0079L2042K6603l6421k7426P794Q397j7536Q70
7220e0298K1150K3239o720L8971M5201K698K6819m7838o4594j9981N036n100J8206
7207a3211Q089l1680l877K4941k7455J5754l3141r34P2098K5021j8666m973n647
7194F319J6744m890K1189K4663j4258n1989m7584j8108J4032N2462M8501n1543
7182d462j2752M2103m0047m815J2712K5369M172J9027K78l1178J280l259R155
$$ plain form
7272 44584 37049 1219 -30058 -33074 -39766 -47038 -64383 -62326 -88321 -96786 -52506 -26838 -20800
7259 -20800 -32563 -40344 -46155 -60621 -23129 14585 17702 13657 -2079 -18876 22355 18772 13157
7246 13157 15632 16878 4291 -7345 5929 17865 41603 17493 21177 54618 61937 32683 30901
7233 30901 22778 17665 -19600 -24542 -44621 -12579 14024 -22397 -49823 -42029 -33632 -51168 -50298
7220 -50298 -29148 -5909 -12629 26342 71543 74241 101060 53222 -11372 -31353 -26317 -31417 -13211
7207 -13211 -5122 -36802 -40679 -15738 -43193 -27439 -60580 -61514 10584 35605 16939 11966 6319
7194 6319 23063 18173 39362 64025 49767 -2222 -49806 -67914 -53882 -1420 47081 -4462
7182 -4462 -17214 24889 -15158 -19973 -7261 18108 22280 41307 41585 10407 11687 8428 17583
7169A7583j9059J3395k6820m9121l38J9040L6601M3638L6033j5096q967j0712
7157C6177N158o6634o0722L4636Q816n9709q381Q431K2705j1622J5439m0273l1488
7144a47467j7885N9873O2039K6994j7186p370R006q763k1160N549P3617K9166
7132D6413q0742K177M1345L4232k5214r882k5774J1314J2004K8064K8888k2029
7120D0796n191J800k4528P991l8364k4026O769M274K1847m806k0437j0661J9686
7107b4850N7682J4283o3334m5260N9338L7354l151m4064l4525P6045L3487n4173
7095H832j95n0267m4016m9222l3197j1482J4298M5885O9670K8925L641L641n2982
7082f6469l7433J1315l798K9720O1387O60p591j455K806L058M492N1249K0420
$$ plain form
7169 17583 -1476 11919 -14901 -64022 -64360 -45320 -8719 34919 70952 55856 46889 36177
7157 36177 41335 -25299 -86021 -51385 -42569 -102278 -110659 -102228 -79523 -91145 -75706 -115979 -147467
7144 -147467 -165352 -105479 -43440 -16446 -33632 -41002 -31996 -40759 -61919 -56370 17247 46413
7132 46413 -34329 -32152 9193 43425 18211 8329 -17445 -6131 5873 33937 62825 40796
7120 40796 35605 37405 12877 20868 -17496 -41522 -34753 -30479 -8632 -13438 -33875 -44536 -24850
7107 -24850 32832 47115 -16219 -61479 -2141 35213 32062 -12002 -46527 29518 63005 8832
7095 8832 8637 -41630 -85646 -134868 -168065 -179547 -165249 -119364 -49694 -20769 -17128 -13487 -66469
7082 -66469 -103902 -92587 -96385 -66665 -5278 -4618 -12209 -13664 -10858 -7800 -3308 47941 68361
7069F8361j9906R78r118n763q046n7070j2281l8725k5417P375m0644M5844L7026
7056e7386J1870K9877L3262L6071J4645m638k5686m8898M13K0428j4861m9593
7044e4496j7810M8214K6723J8620j6672j9047J3680k7424J360j2558K0641L4311
7032A5542P227j3198j0272j9848m0359j111K7092j9176m6242K7918J7837j0700
7020f5290O017J6747P092r676J119M4839N5850q409n7217j1677J3798m8101R911
7007d4997K6168J3026J743j8196j6782L7166L038k2861L097K7461J4354K8710
6995E1927m350j9390J956J6965k8459m7076L7334Q678l570P450k0484k8798m4009
6982g1826J2357M9910P08j438J3077l3524k8644J2075j0804k4369M5295q811k7985
$$ plain form
7069 68361 48455 49433 40315 34552 26506 -30564 -42845 -81570 -106987 -99612 -140256 -94412 -57386
7056 -57386 -45516 -15639 17623 53694 68339 63701 38015 -10883 -10470 9958 -4903 -54496
7044 -54496 -72306 -24092 2631 21251 4579 -14468 -788 -28212 -26852 -39410 -18769 15542
7032 15542 22769 9571 -701 -20549 -60908 -62019 -34927 -54103 -100345 -72427 -54590 -65290
7020 -65290 -59273 -42526 -35434 -45110 -43991 848 56698 48289 -8928 -20605 -6807 -54908 -44997
7007 -44997 -18829 -5803 -4060 -22256 -39038 -1872 1166 -21695 -18598 8863 23217 51927
6995 51927 47577 28187 30143 47108 18649 -28427 8907 17585 14015 21465 981 -27817 -71826
6982 -71826 -59469 -9559 -8851 -10289 2788 -30736 -59380 -47305 -58109 -82478 -37183 -45994 -73979
6969g3979L2833l010K3351K6963K2197O615J4915M669n630m1898l992k0092j041
6956a8099o277O507J9602K1731j0231k1164J808L4884n838k0904n780L2848l184
6943B5903l8495j2757K8813o345R10K7263j791N942n0337l119K5030j8984P037
6930a0930K012k4936M925j1946m7584k2157K5779O4295J4812m62L3718L6253L0332
6917I4111k1211n2372j6965l3606L6213k0773m9903J1542M3635M9087R835n4067
6905d474j4647O4364n235K7408L0268K378m2612l8098L9173P186k6263l8368l749
6892b669m0869n395J0238M1764P7343L199J5873k3127o0141p0238Q313K5022J9331
6879a356J594J1431k5111j9858K2686j9438K62n241j9117J7856j3501n0108Q595
$$ plain form
6969 -73979 -41146 -44156 -20805 6158 28355 34970 49885 54554 48924 7026 3034 -17058 -18099
6956 -18099 -24376 -17869 1733 23464 13233 -7931 -6123 28761 22923 2019 -3761 29087 25903
6943 25903 -12592 -25349 3464 -2881 -1971 25292 23501 29443 -20894 -24013 1017 -17967 -10930
6930 -10930 -8918 -33854 -28929 -40875 -88459 -110616 -84837 -20542 -5730 -6192 27526 63779 94111
6917 94111 72900 20528 3563 -30043 6170 -14603 -64506 -52964 -9329 39758 49593 -4474
6905 -4474 -19121 45243 40008 67416 97684 100062 57450 19352 58525 65711 39448 1080 -2669
6892 -2669 -43538 -48933 -38695 3069 80412 83611 99484 76357 16216 -54022 -45709 -20687 -1356
6879 -1356 238 11669 -13442 -33300 -10614 -30052 -29790 -35031 -54148 -36292 -49793 -99901 -91306
6866i1306K1173M6168K0819p3200p699N1961M4782k1764k725l1759o6106K4453
6854h5203K1761j2934Q296O709L0008K889J249l7474K6273n443j0593k5835O2921
6841a7376N0031n0092j8048l3831k7754M7243J0637K595J2343j2103o100L1670
6829a0785o289m1459l272J9008O378J7634k625j9458M5855M9300J7792m1048l0183
6816H48j2266j4317k106j6642k4258O9294k439m0001M7401j7061J1836L4385j2235
6803B2439o5360k9517K2777P3729K1127q94n0475j4222L2943j1141l77j7767j691
6790a8429J4041k6086M6065M62k9050m1128l5802L0186J0535j05j5850J2777K1542
6777c0842Q941j7073r462J2990j0898Q128P576M8960O165p011k3771j0638q718
$$ plain form
6866 -91306 -70133 -23965 -3146 -76346 -84045 -32084 12698 -9066 -11791 -43550 -109656 -85203
6854 -85203 -63442 -76376 -68080 -61371 -31363 -28474 -27225 -64699 -38426 -43869 -54462 -80297 -17376
6841 -17376 32655 -17437 -35485 -69316 -97070 -49827 -39190 -36595 -24252 -36355 -42455 -10785
6829 -10785 -17074 -58533 -61805 -42797 -36419 -18785 -21410 -40868 4987 54287 72079 31031 848
6816 848 -11418 -25735 -27841 -44483 -68741 553 -1886 -41887 5514 -11547 289 34674 22439
6803 22439 -42921 -72438 -49661 24068 45195 44301 -6174 -20396 12547 1406 1029 -16738 -18429
6790 -18429 -4388 -30474 15591 16053 -12997 -54125 -89927 -59741 -49206 -49311 -65161 -52384 -30842
6777 -30842 -21901 -38974 -48436 -35446 -46344 -38216 -30640 18320 24485 17474 -6297 -16935 -25653
6764b5653j8121J7785N1391O627l5411m4904j480o52l7945N4264M4085K1539m8054
6751a6529n1375L4864p578Q732K2258J2052M4074K6018K383j1128k7421p891M248
6738C2707N4928l0314Q590J3292m7366n3517n520J832K0478k3282j379l6167j5443
6725h1161R7481L5354J1033j3635j615k2107m5775j2393p932J5925K8371k87k9583
6712b6324j2206J3053J5385l4772K854o760L683J259J2590q475M1994L1304J2758
6699D6343j9041j2659j8918J3788O766J343K418O175K0430k6104m0138L6597K6349
6686D3349k1316j4158o707J4586J6402r844k1722q605K1297m370l1434K1161K1585
6673B0224j382m3483k2818J5128J2228j4348p395p2178J4333M3044j6572L745
$$ plain form
6764 -25653 -43774 -25989 25402 32029 -3382 -48286 -49766 -50418 -88363 -34099 9986 31525 -16529
6751 -16529 -67904 -33040 -40618 -31886 -9628 2424 46498 72516 74899 63771 36350 28459 32707
6738 32707 87635 57321 65911 79203 31837 -21680 -27200 -25368 -4890 -28172 -29551 -65718 -81161
6725 -81161 16320 51674 62707 49072 47457 25350 -20425 -32818 -40750 -24825 3546 3259 -26324
6712 -26324 -38530 -25477 -10092 -44864 -42010 -48770 -45087 -43828 -31238 -39713 2281 33585 46343
6699 46343 27302 14643 -4275 9513 16279 17622 20040 26215 46645 20541 -19597 17000 43349
6686 43349 22033 7875 1168 15754 32156 22312 590 -8015 13282 8912 -22522 -1361 20224
6673 20224 18842 -24641 -47459 -32331 -20103 -34451 -41846 -114024 -99691 -56647 -73219 -69474
6661f9474K517L6704O8877m9309k4220j9879j5061M0060J3235k9277L7770k3760
6649c1817j9954j5295L1265M8697K1814r361l6631J5311J7213K2680l8943l2401
6637b7422j8635P904K7298K638k0012l0344J736k607N475r257K4720o026p993
6624e2525K6701j0987J3721L4714j7442l5188k4886J3657J8968O0725M6169n715
6612F7912j4967p854r434O634q637j0830l8468j729M0381k224n1105K77M495Q60
6598b4689k090j8243j6600K1733k4405p23L623K0628j081K4218L6721J4142j3694
6585A9540l3589k535Q52J5416M240P962k856J2350j2200m1490R911k0728j9553
6572f2680L3633L5747K5198l7457j3414L140n0619k4283K5090J4405L3324q313
$$ plain form
6661 -69474 -66957 -30253 38624 -10685 -34905 -54784 -69845 -29785 -16550 -45827 -8057 -31817
6649 -31817 -51771 -67066 -35801 12896 34710 25349 -11282 4029 21242 43922 4979 -27422
6637 -27422 -46057 -38153 -10855 -8217 -28229 -58573 -56837 -59444 -53969 -63226 -38506 -44532 -52525
6624 -52525 -25824 -36811 -23090 11624 -5818 -41006 -65892 -52235 -33267 27458 73627 67912
6612 67912 52945 45091 35657 42291 33654 22824 -15644 -17373 23008 20784 -30321 -30044 -25549 -24689
6598 -24689 -26779 -45022 -61622 -39889 -64294 -65017 -61394 -40766 -41847 -17629 19092 33234 19540
6585 19540 -14049 -16584 -15732 -316 3924 11886 9030 21380 9180 -32310 -22399 -43127 -62680
6572 -62680 -29047 6700 31898 -5559 -18973 -15833 -66452 -90735 -65645 -51240 -17916 -26229
6560b6229j3068k0624K0429M3852L0828j3235j659K0721K8923j8147j8430L784
6548C7145k231P09L171L9919j6501q411K4969k6019l4751l4517q967n0716k9321
6535a05521O9797L8322M091J1601O799j2292k7193L2632k2087m2947O180K4921
6523a5697l3692J1198J5704n0893j2019N1218Q326k3128M5800K7429j033R995
6511C3208N094j4685n971n466k8101l6901L2746M6160N283K904K9922j5268l9574
6498I351k4317O6061l229k513M5802m7244l6102l123j9784L5203R652j842q160
6485A9755j7874R749k261m2602j3657k1248L4581N4269q198j5613Q567L1007J6016
6472E2491k1968k6498l9366K0021L1586k7299l5404j7141L5992o557j1804J4235
$$ plain form
6560 -26229 -39297 -59921 -39492 4360 35188 21953 20294 41015 69938 51791 33361 37145
6548 37145 34914 35623 38794 78713 62212 53801 78770 52751 18000 -16517 -25484 -76200 -105521
6535 -105521 -35724 2598 6689 18290 25089 12797 -14396 18236 -3851 -46798 -40618 -15697
6523 -15697 -49389 -38191 -22487 -73380 -85399 -34181 -25855 -48983 -3183 24246 23213 33208
6511 33208 38302 23617 17646 12180 -15921 -52822 -20076 26084 31367 34271 64193 48925 9351
6498 9351 -14966 51095 47866 45353 91155 43911 7809 4686 -15098 20105 29757 27915 19755
6485 19755 1881 11630 9369 -33233 -46890 -68138 -33557 20712 12514 -3099 5468 36475 52491
6472 52491 30523 4025 -35341 -15320 16266 -11033 -46437 -63578 -27586 -34143 -45947 -31712
6460c1712L7141j7134j8350j8053m321K9172r062N217l8250j2438J7771J9940
6448d0079J7182J6446N763j5053J0092N329q864l8326L558M5685N235j5726p964
6435a6722J4472L6855L2264J5601k3488k7316M056K5272k4817Q88r446k6005M1585
6422D3199L3495n7641l6802J4277o005M0026P284j0789J3382p432Q816L7601m097
6409G5314k7487J976k0221l2952j5561m8759M111N5943O589N362l0422L0088O6360
6396G0341k2827k2798j7330N117L188p417O5615k5020k2346J4107J884m5072J4667
6383A2109L7544p815k8781m3146m7346j622M5544M5727K8414j5141j668K1699
6371D5518o7018j8842M8984M5814m2958k2846L4915J1918N796j0823o728l1033
$$ plain form
6460 -31712 5429 -11705 -30055 -48108 -52429 -23257 -32319 -27102 -65352 -77790 -60019 -40079
6448 -40079 -22897 -6451 -688 -15741 -5649 -320 -9184 -47510 -43952 1733 6968 -8758 -16722
6435 -16722 -2250 34605 66869 82470 58982 31666 35722 60994 36177 37065 27619 1614 43199
6422 43199 76694 19053 -17749 -3472 -9477 30549 37833 27044 40426 32994 41810 79411 75314
6409 75314 47827 49803 29582 -3370 -18931 -67690 -63579 -7636 -1047 4315 -26107 3981 70341
6396 70341 47514 24716 7386 12503 15691 8274 73889 48869 26523 40630 42514 -2558 12109
6383 12109 49653 41838 13057 -30089 -77435 -79057 -33513 12214 40628 25487 23819 45518
6371 45518 -21500 -40342 8642 54456 11498 -11348 23567 35485 41281 30458 23730 -7303
6359g303Q478j1602J1674J8806Q669J2814l171l0530o5443l206J0098J900L3445
6346a5371m9057m8272Q0353O0004l0212m4301q142o912L6551L9671L1856k1360
6334B4808o5505q9401l7047N4759K5866Q363L3713O4236j641J5472K0073n3685
6322A1P73L6221j8985j3155L462J9556j2982j7562J673R6515n523p1601L897o130
6308A6170j6799j852M1595J3151Q350k2788j9877n528j6338l4775P388M7546K4583
6295D0826L948K6124R396r975k8388m1737n2871L1406J4103L1797K5684k2490
6283B7823r998r599k2639L4453L7841j9557j704j8069l6702k2750J3430Q49L533
6270b3089j3685L3763K6081P943k7110q596M2550k2873l8921O324j7670J2755
$$ plain form
6359 -7303 1175 -10427 1247 20053 28722 41536 38365 7835 -57608 -60814 -50716 -48816 -15371
6346 -15371 -64428 -112700 -32347 27657 -2555 -46856 -54998 -61910 -25359 14312 46168 24808
6334 24808 -40697 -130098 -167145 -112386 -86520 -78157 -44444 19792 18151 33623 53696 11
6322 11 784 37005 18020 4865 8327 27883 14901 -2661 -988 95527 90004 18403 22300 16170
6308 16170 -629 -2481 39114 52265 60615 37827 17950 12422 -3916 -38691 -31303 16243 40826
6295 40826 44774 70898 80294 70319 41931 194 -52677 -21271 -7168 24629 50313 27823
6283 27823 17825 8226 -14413 20040 57881 38324 36620 18551 -18151 -40901 -27471 -26622 -23089
6270 -23089 -36774 -3011 23070 31013 3903 -4693 37857 14984 -23937 -17613 -35283 -22528
6258b2528l9403k8236K3312N0960L639l7287k6394n2780J1850O4396J2385M984
6246c5102k3042N4904K002p274J0444j0970K5536M1103K232n9592k5548J8424
6234f883J7255k303j818J2338j3414k0887j0183R681M3771j2254j1081L8264J0884
6221E3370j8596m5858n2991o41L6143j1883l9726K4522J1801J9917K6855K1963
6209B4876m671k9131O764o003J7673n072o0169L1118N5124j9823l1712O211k2454
6196c7269J4070M7999j4256p233L4851Q525n6464j7637k1533l353q354l5671k674
$$ plain form
6258 -22528 -61931 -90167 -66855 -15895 -12256 -49543 -75937 -128717 -116867 -52471 -40086 -35102
6246 -35102 -58144 -3240 -1238 -8512 1932 -9038 16498 57601 59833 241 -25307 -6883
6234 -6883 10372 8069 6251 18589 5175 -15712 -25895 -16214 27557 15303 4222 42486 53370
6221 53370 34774 -11084 -64075 -64716 -28573 -40456 -80182 -55660 -43859 -23942 2913 24876
6209 24876 20205 -8926 -2162 -8165 9508 4436 -55733 -24615 30509 10686 -21026 -14815 -37269
6196 -37269 -23199 24800 10544 3311 38162 46687 -9777 -27414 -48947 -52300 -60654 -96325 -98999
$$ [...]
##END NTUPLES=NMR SPECTRUM
##END=
