##TITLE=Analysis number 327977
Compound Code km 08258
Project Code adrs
Chemist Name aci
##JCAMPDX= 6.0         $$ Bruker NMR JCAMP-DX V2.0
##DATA TYPE= NMR SPECTRUM
##DATA CLASS= NTUPLES
##ORIGIN= Bruker BioSpin GmbH
##OWNER= nmr
$$ XWIN-NMR		Version 3.5
$$ Mon Apr 23 13:55:02 2007 GMT Daylight Time (UT+1h)  MAYBRIDGE\nmr@NMR_250MHZ
##.OBSERVE FREQUENCY= 250.131544655141
##.OBSERVE NUCLEUS= ^1H
##.ACQUISITION MODE= SIMULTANEOUS (DQD)
##.ACQUISITION SCHEME= undefined
##.AVERAGES= 16
##.DIGITISER RES= 18
##SPECTROMETER/DATA SYSTEM= dpx250
##.PULSE SEQUENCE= zg30
##.SOLVENT NAME= CDCl3
##.SHIFT REFERENCE= (INTERNAL, CDCl3, 0, 16.522)
##AUDIT TRAIL= $$ (NUMBER, WHEN, WHO, WHERE, WHAT)
$$ ##TITLE= Audit trail, XWIN-NMR		Version 3.5
$$ ##JCAMPDX= 5.01
$$ ##ORIGIN= Bruker BioSpin GmbH
$$ ##OWNER= nmr
$$ C:\u/data/dgb/nmr/ADRS/2860/pdata/1/auditp.txt
$$ ##AUDIT TRAIL=  $$ (NUMBER, WHEN, WHO, WHERE, WHAT)
(   1,<2007-04-23 13:54:38.81 +100>,<MAYBRIDGE\nmr>,<NMR_250MHZ>,
      <created by zg, POWCHK disabled, PULCHK disabled
       configuration hash MD5:
       49 4B E0 1D 92 C2 6B 37 9F E6 65 BC 52 41 86 1D
       data hash MD5: 64K
       02 FC D7 A7 4D F5 04 17 49 09 5C F6 E1 3F 14 32>)
(   2,<2007-04-23 13:54:52.37 +100>,<MAYBRIDGE\nmr>,<NMR_250MHZ>,
      <Start of raw data processing
       ef LB = 0.3 FT_mod = 6 PKNL = 1 SI = 32K 
       data hash MD5: 32K
       8D 32 41 8A FE 60 EA 3A 6B 27 68 0E FC A3 62 B6>)
(   3,<2007-04-23 13:54:53.95 +100>,<MAYBRIDGE\nmr>,<NMR_250MHZ>,
      <apk 
       data hash MD5: 32K
       BF 85 AA 44 EF 0B 75 76 A9 E7 59 D3 E3 AC D6 C9>)
(   4,<2007-04-23 13:54:54.65 +100>,<MAYBRIDGE\nmr>,<NMR_250MHZ>,
      <abs ABSG = 5 
       data hash MD5: 32K
       AB 68 A8 A5 06 F2 67 B2 1B 3D B2 50 46 2F 68 44>)
$$ ##END=
$$ 
$$ hash MD5
$$ 53 33 7C 8C 3A 23 A1 3E B7 C3 DA AF 19 1B 0C 07
##$RELAX= 
##$RELAX= 
##$RELAX= 
##$RELAX= 
##$RELAX= 
##$RELAX= 
##$RELAX= 
$$ Bruker specific parameters
$$ --------------------------
##$DU= <C:\u>
##$EXPNO= 2860
##$NAME= <ADRS>
##$PROCNO= 1
##$TYPE= <nmr>
##$USER= <dgb>
##$AMP= (0..31)
100 100 100 100 100 100 100 100 100 100 100 100 100 100 100 100 100 100 
100 100 100 100 100 100 100 100 100 100 100 100 100 100 
##$AQSEQ= 0
##$AQ_mod= 3
##$AUNM= <au_zg>
##$AUTOPOS= <33 >
##$BF1= 250.13
##$BF2= 250.13
##$BF3= 250.13
##$BF4= 250.13
##$BF5= 500.13
##$BF6= 500.13
##$BF7= 500.13
##$BF8= 500.13
##$BYTORDA= 1
##$CFDGTYP= 0
##$CFRGTYP= 5
##$CHEMSTR= <none>
##$CNST= (0..31)
1 1 145 1 1 1 1 1 1 1 1 1 1 1 1 1 1 1 1 1 1 1 1 1 1 1 1 1 1 1 1 1 
##$CPDPRG= <>
##$CPDPRG1= <>
##$CPDPRG2= <>
##$CPDPRG3= <>
##$CPDPRG4= <mlev>
##$CPDPRG5= <mlev>
##$CPDPRG6= <mlev>
##$CPDPRG7= <mlev>
##$CPDPRG8= <mlev>
##$CPDPRGB= <>
##$CPDPRGT= <>
##$D= (0..31)
0 1 0 0 0 0 0 0 0 0.06 0 0 0 0 0 0 0.0002 0 0 0 0 0 0 0 0 0 0 0 0 0 0 
0 
##$DATE= 1177332877
##$DBL= (0..7)
120 120 120 120 120 120 120 120 
##$DBP= (0..7)
150 150 150 150 150 150 150 150 
##$DBP07= 0
##$DBPNAM0= <>
##$DBPNAM1= <>
##$DBPNAM2= <>
##$DBPNAM3= <>
$$ [...]
##$SUBNAM7= <"">
##$SUBNAM8= <"">
##$SUBNAM9= <"">
##$SW= 20.6930455092707
##$SWIBOX= (0..15)
0 0 3 0 0 0 0 0 0 0 0 0 0 0 0 0 
##$SW_h= 5175.983436853
##$TD= 65536
##$TD0= 1
##$TE= 683.16
##$TE2= 300
##$TE3= 300
##$TEG= 300
##$TL= (0..7)
0 120 120 120 120 120 120 120 
##$TP= (0..7)
150 150 150 150 150 150 150 150 
##$TP07= 0
##$TPNAME0= <>
##$TPNAME1= <>
##$TPNAME2= <>
##$TPNAME3= <>
##$TPNAME4= <>
##$TPNAME5= <>
##$TPNAME6= <>
##$TPNAME7= <>
##$TPOAL= (0..7)
0.5 0.5 0.5 0.5 0.5 0.5 0.5 0.5 
##$TPOFFS= (0..7)
0 0 0 0 0 0 0 0 
##$TUNHIN= 0
##$TUNHOUT= 0
##$TUNXOUT= 0
##$USERA1= <user>
##$USERA2= <user>
##$USERA3= <user>
##$USERA4= <user>
##$USERA5= <user>
##$V9= 5
##$VALIST= <valist>
##$VCLIST= <CCCCCCCCCCCCCCC>
##$VD= 0
##$VDLIST= <DDDDDDDDDDDDDDD>
##$VPLIST= <PPPPPPPPPPPPPPP>
##$VTLIST= <TTTTTTTTTTTTTTT>
##$WBST= 1024
##$WBSW= 4
##$XGAIN= (0..3)
0 0 0 0 
##$XL= 0
##$YL= 0
##$YMAX_a= 470981
##$YMIN_a= -482943
##$ZGOPTNS= <>
##$ZL1= 120
##$ZL2= 120
##$ZL3= 120
##$ZL4= 120
##$ABSF1= 16.522
##$ABSF2= -4.171173
##$ABSG= 5
##$ABSL= 3
##$ALPHA= 0
##$AQORDER= 0
##$ASSFAC= 0
##$ASSFACI= 0
##$ASSFACX= 0
##$ASSWID= 0
##$AUNMP= <proc_1d>
##$AZFE= 0.1
##$AZFW= 0.1
##$BCFW= 0
##$BC_mod= 0
##$BYTORDP= 0
##$COROFFS= 0
##$CY= 12.5
##$DATMOD= 1
##$DC= 0
##$DFILT= <>
##$DTYPP= 0
##$F1P= 14.0000005364418
##$F2P= -0.99999901652339
##$FCOR= 0.5
##$FTSIZE= 32768
##$FT_mod= 6
##$GAMMA= 0
##$GB= 0
##$INTBC= 1
##$INTSCL= 1
##$ISEN= 128
##$LB= 0.3
##$LEV0= 0
##$LPBIN= 0
##$MAXI= 10000
##$MC2= 0
##$MEAN= 0
##$ME_mod= 0
##$MI= 0
##$NCOEF= 0
##$NC_proc= -3
##$NLEV= 6
##$NOISF1= 0
##$NOISF2= 0
##$NSP= 0
##$NTH_PI= 0
##$NZP= 0
##$OFFSET= 16.522
##$PC= 1
##$PHC0= 229.6429
##$PHC1= 5.499296
##$PH_mod= 1
##$PKNL= yes
##$PPARMOD= 0
##$PSCAL= 4
##$PSIGN= 0
##$REVERSE= no
##$SF= 250.13
##$SI= 32768
##$SIGF1= 0
##$SIGF2= 0
##$SINO= 400
##$SIOLD= 32768
##$SREGLST= <1H.CDCl3>
##$SSB= 0
##$STSI= 32768
##$STSR= 0
##$SW_p= 5175.98343685301
##$SYMM= 0
##$S_DEV= 0
##$TDeff= 65536
##$TDoff= 0
##$TI= <Analysis number 999999
Compound Code 99
Book Reference 9
Project Code 9>
##$TILT= no
##$TM1= 0
##$TM2= 0
##$TOPLEV= 0
##$USERP1= <user>
##$USERP2= <user>
##$USERP3= <user>
##$USERP4= <user>
##$USERP5= <user>
##$WDW= 1
##$XDIM= 32768
##$YMAX_p= 402085385
##$YMIN_p= -52174
$$ End of Bruker specific parameters
$$ ---------------------------------
##NTUPLES= NMR SPECTRUM
##VAR_NAME=  FREQUENCY,     SPECTRUM/REAL,   SPECTRUM/IMAG
##SYMBOL=    X,             R,               I
##VAR_TYPE=  INDEPENDENT,   DEPENDENT,       DEPENDENT
##VAR_FORM=  AFFN,          ASDF,            ASDF
##VAR_DIM=   32768,         32768,           32768
##UNITS=     HZ,            ARBITRARY UNITS, ARBITRARY UNITS
##FACTOR=    0.157963299565203, 1,           1
##FIRST=     4132.6476996994, 0,             0
##LAST=      -1043.33573715361, 0,           0
##MIN=       -1043.33573715361, -52174,      0
##MAX=       4132.6476996994, 402085385,     0
$$ Real data points
##PAGE= N=1
##DATA TABLE= (X++(R..R)), XYDATA
$$ [...]
16113c2310J3146k160q37O60P217L19J1270r05q465p14J016k766m787L478M049
16098a1789O01j7931p862O887J3743J9616K90k0565Q547N743o220O861N175p946
16084d850l976l096J5526K945j3657o507R728p179K327R69q229K237O952O573
16070b37n47J0195J4050l697r995k385L117L885j1317j2254q581J0436N808j2027
16056a3549j2609n85K1415O73l938Q903J247m838j4460j2205Q772L365j008O292
16042a2525R351m08J102K348n651m68P473J8315M613j4189P18N34j805P161j822
16027A4747p372j5460M872Q798R759j944j5355j4220l58j6201j3279Q819J6718
16014b0476J171K989q485J2820O042j9752j338J0389J073K257K883j0867K569
$$ y = [-32310, -19164, -21324, -22161, -21501, -14284, -13965, -2695, -3600, -12065, -12779, -11763, -14529, -19316, -15838, -11789, -11188, -29119, -36981, -30094, -16351, 3265, 3555, -17010, -8463, -2720, -8940, -2079, 3096, -4850, -8826, -11922, 3604, 6549, -7108, -13615, -3887, -11066, -8739, -7770, -15999, -13762, -6810, -237, -784, 9411, 23461, 19764, 9769, 7384, 10501, 14386, 3069, -9185, -17766, -7330, -1522, -13549, -26158, -26743, -5328, -4655, -8593, 310, 1557, -3281, -17741, -29946, -21174, -17809, -18817, -12525, -3174, -3582, -2480, -132, -5783, -6251, 1222, 19537, 24150, 9961, 10679, 11213, 9408, 16569, 14747, 7375, -8085, -3213, 5585, 15344, 13400, -1955, -16175, -16533, -32734, -46013, -37194, -20476, -19305, -16316, -24801, -11981, -5939, -25691, -27029, -16640, -15567, -13310, -10427, -21294, -18725]
16001a8725L318J4685J8454j9186j4046O545J0237P030n758K484J6617n300j5216
15988A139r417j951j0712q146J3158N257j1334k206J215J4362J7670l101k463
15975C471N017j7688m05K505q23k37k978J132j489k446P045O512q385l348M412
15960g705K906Q391j687j173L050L54j2262r459J254Q930O083O060n238m41j0535
15945a1472o602j337J3674J519r108j709j112j9769O496O544L521p551p593r92
15931c5491M372Q666J7412J3550j728r328p704N432k016P741j466r136r110m239
15917b3045J945J5743J1352M369k3290q152M811n065k241o274M657R06m493j28
15903b8905J5759k62j3429J29o266J1243J0149J0671Q162k840L385o079n336L49
$$ y = [-18725, -15407, -722, 17732, -1454, -15500, -8955, 1282, 8312, 2554, 5038, 21655, 16355, 1139, -8278, -10229, -20941, -29087, -15929, -10672, -22006, -24212, -22997, -8635, 9035, 5934, 3471, 8488, -9200, -9605, -7100, -7923, -8160, -11138, -10006, -11495, -13941, -6896, -384, -8769, -12117, -7705, -4799, 3592, 1905, 732, 3782, 4136, -8126, -17585, -16331, -7401, -1318, 4742, -496, -937, -11472, -18074, -19411, -5737, -4218, -13326, -15035, -16147, -35916, -29420, -22876, -19355, -26906, -34499, -35491, -31119, -22453, -5041, 8509, 6781, -2547, -10251, -4819, -6835, 906, -560, -9696, -18806, -23045, -21100, -5357, 5995, 10364, -12926, -21078, -16267, -21332, -23573, -29847, -25190, -24284, -28777, -28905, -13146, -13408, -26837, -26708, -32974, -21731, -11582, -911, 7251, 4411, 7796, 1717, -3619, -3270]
15889c270l177M085j0348j75N367m63o297j2678k572M59K964K936o233j649J1401
15874a9650J3575q731l563J911j1841P572O019o518N969M342J1141L013n895K738
15860H2j8020j3539L911M913J0103o185n850J280J217N550k769Q655N604k620
15846g668M226Q823l174p537n421o318j14Q779j5740N896J682P002J2069k103
15832D02k541m533n454J2305P417m814J4374j106o529r232j709m475K97p253O368
15817f483R803M06P204J899P403o715n371l325r972j9126M215Q982J544J451n050
15802a3135j6187k450J4227p646o003J2487J1190R285J359l057j841j084j2614
15789a5469J7367L938k572p941q416n190K628J8415n721o954m568J5474M203m305
$$ y = [-3270, -6447, -2362, -12710, -12885, -7518, -7981, -14278, -26956, -29528, -29069, -26105, -23169, -29402, -31051, -19650, -6075, -14806, -18369, -16458, -28299, -20727, -14708, -21226, -15257, -10915, 226, 3239, -2656, 82, -17938, -31477, -27566, -22653, -12550, -18735, -24585, -23305, -22088, -16538, -19307, -10652, -5048, -7668, -3442, 5381, 2207, -5330, -10751, -17069, -17183, -8404, -24144, -18248, -16566, -9564, 2505, 402, -2139, -6672, -12126, 179, 7596, 2782, 17156, 16050, 9521, 289, -1420, -5895, -5598, -12851, -6483, 3320, 3726, 10930, 12829, 20232, 13517, 8146, 4821, -5151, -24277, -20062, -11080, -9536, -8085, -13135, -29322, -31772, -17545, -25191, -31194, -18707, -7517, 1768, 3127, 70, -1771, -2855, -15469, 1898, 5836, 3264, -4677, -13093, -18283, -15655, 2760, -2961, -9915, -14483, 991, 5194, 889]
15775H89m657j0665j5276J1990J4194l817j03K705O787O292p815j668P035J0786
15761A6677q257j3159j4973R15P452L634J9038j2630k0373j784P517l313j392
15748b0648j504l641Q476L623q821J206J4981J4893j5734m073R27m560j1433p369
15734c3677J7020K1180J2670l908k30m606n747o692J2777R048j1821j129r887
15721e002n395p05K588P260J267o931L116k721J1918k816j3600O410J538l926
15707f999l835J5968K125j1683o400r410k876M31Q552J183q123K518j5704l969
15693c8222K297K3776K0972N330j5380j4647K664m916m418J4420J1375n933k818
15680e500J3265O261l840k796j1165l102P370q470j2006J2218O730m268J606q929
$$ y = [889, -3768, -14433, -29709, -17719, -3525, -7342, -7445, -4740, 2047, 8339, 524, -1144, 5891, 16677, 8420, -4739, -19712, -18797, -11345, -7711, 11327, -1303, -21676, -23460, -15943, -19256, -20648, -22152, -25793, -17317, -13694, -22515, -21309, -6328, 8565, -7169, -11242, -10315, -14875, -26308, -33677, -16657, 4523, 17193, 13285, 13055, 8449, 2702, -3990, 8787, 17835, 6014, 4885, -5002, -10397, -11102, -8514, -1254, 13, -6918, -3802, -6523, 5395, 2579, -11021, -4611, -3073, -6999, -10834, 5134, 7259, -4424, -10824, -20234, -23110, -22679, -14127, -12944, -21067, -18549, -34253, -38222, -35925, -12149, 8823, 14153, -1227, -15874, -13210, -18126, -22544, -8124, 3251, -2682, -5500, 7765, 14026, 10186, 7390, -3775, -6877, 493, -7977, -19983, -7765, -1035, -5303, -3697, -12626]
15666a2626j0932K504l044K198O110L437M230K24l317L249R184M182k1p29L21
15651D970m897K0862j733l819j0265j879J1721M420q703L876j0286k390j154L999
15637D722o520m936k6518j1023Q884k396K905N131K3087J0335j2392j078p37R682
15623h54p190l318J4599l665j6681q80l499r63P573k620n041O981Q719K563p554
15608a1830k401J3999l214n600N629k584L502O007j3539o483Q108M445m730j4514
15594b3205q580J0581j298P814o438n235l4J3003N522Q556o099j7260L31N512
15580a6830M797j856j0273L948l51P796K5719J2456L169r024j9205j5688P761
15567g581K610n502n363M111J1383J657O220l023l469P856J0284j1094j1593l272
$$ y = [-12626, -23558, -21054, -24098, -21900, -15790, -12353, -8123, -7899, -11216, -7967, 1217, 5399, 5378, 4649, 4970, 73, 20935, 19202, 15383, 5118, 3239, 14960, 19380, 10677, 14553, 4267, 1877, 723, 4722, -1798, -6734, -33252, -44275, -35391, -37787, -34882, -29751, -6664, 3671, -8721, -9799, -10536, -854, -8044, -11362, 3237, -428, -17109, -17989, -21488, -22451, -14878, -17498, -22539, -15558, -6839, -4276, -11830, -14231, -232, -3446, -9046, -3417, -6001, -2499, 3508, -10031, -16514, -8406, -3961, -8691, -23205, -31785, -21204, -22502, -14688, -21126, -26361, -26395, -13392, -7870, 686, -5413, -22673, -22342, -16830, -12033, -13889, -24162, -20214, -20565, -12769, 12950, 25406, 28575, 19551, 346, -15342, -7581, -4971, -10473, -15836, -11725, -342, 1315, 7535, 4512, 1043, 8899, 19183, 8089, -3504, -6776]
15553f776l590n074l592J795J0858P799R754k473n697j783R014k26l376j917n340
15538f24J4321M108j4214q442L457O206J397j277K100K212R198J42j442o259P206
15523A8089N881j7137j0256Q892R861O302j1358j5265j1589n607k351P782N330
15510a1426N190l132J1912J4892q31j0812m523q422M666J5091j151j4772j2209
15497a5527o332L204R628J4790m764j0137j9130J1505Q443J680k974o052J3852
15484a814M331J0352J5386l603j1240o984l940K149K871k343j0458j78j1271j258
15470a8000j995P501J2176N511n059Q45j0116j243R091J9608M274l00p791j6769
15456b267m123l900o03N963M321m140R76j680J2131J2018n514j705k26j115o085
$$ y = [-6776, -10366, -15440, -19032, -17237, -6379, 1420, 11174, 8701, 3004, 1221, 10235, 10009, 6633, 4716, -624, 13697, 17805, 3591, -4851, -1394, 4812, 6209, 4932, 7032, 9244, 18442, 18584, 17142, 10883, 18089, 23970, 6833, -3423, 5469, 15330, 21632, 10274, -4991, -16580, -22187, -24538, -16756, -11426, -6236, -9368, 2544, 17436, 16605, 5793, 1270, -7152, -2486, 12605, 11454, -3318, -15527, -21859, -18655, -9027, 5763, 999, -9138, -28268, -16763, -8320, -6640, -9614, -15666, -1814, 2517, 12869, 28255, 24652, 13412, 6428, 2488, 4637, 7508, 5165, -5293, -5471, -16742, -18000, -19995, -12494, -318, 5193, 134, 979, -9137, -10380, -1289, 18319, 22593, 22293, 14502, -2267, -6390, -10290, -10893, -4930, -609, -4749, -3773, -5453, 6678, 18696, 13182, 11477, 11251, 10136, 4051]
15441D051M506M660J3969j1111r373J5448r11q194r571j1082Q945j125p118J4402
15427G496J7077j5282k674J2605N597j1000j5407n217n914j689J8597l558j1680
15414a1049L482R385K643J015j47j9397p333P909J444J600R311k612j0396j0826
15400b4971J5892P71p764j561Q037L308q079Q687J0114p459M444l883j117q771
15386a2352J870P89M973M8N062J968L048M675j4652k222J5741O62j0828k479n247
15371h944L241j2174J710J1278J986m878L360K539K650Q405r889r892o005p481
15357b4094j1111N812K3911P757J45o143j737j084J409r398j5664Q349R106J373
15343a1369N00K720J4385M232j1064L542J3163l824O012m066n993M258J0698j463
$$ y = [4051, 8557, 13217, 27186, 16075, 6702, 22150, 21239, 13045, 3474, -7608, 1337, 212, -6906, 7496, 24573, 9291, 6617, 19222, 24819, 13819, -1588, -6805, -12719, -14408, 4189, 631, -11049, -7567, 1818, 4461, 5476, 5329, -14068, -21401, -13492, -12048, -10448, -1137, -3749, -14145, -24971, -9079, -8308, -16072, -17633, -9596, -6288, -14367, -5680, 4434, -3025, 1419, -2464, -3581, -12352, -10482, -9693, -4720, -4672, 390, 2358, 5406, 10081, -4571, -6793, 8948, 9610, -1218, -3697, -8944, -5703, -17877, -16167, -4889, -2903, -7781, -4421, -1882, 768, 9173, -716, -10608, -16613, -24094, -35205, -29393, -5482, 2275, 2420, -3723, -5460, -6544, -5135, -14533, -30197, -21848, -12742, -11369, -10869, -8149, 6236, 10468, -596, 2946, 16109, 12285, 18297, 14231, 8238, 12496, 23194, 21731]
15329B1731j2466l505r225n034O893r407R002J6616n725J910j0696q468J0580
15316B206R052m343P42k599p826j532L012j3304k201P867o510M936J2538K651
15302D689o23k474q491j3130m130P534Q866M672R035K268p498j785L134m713O370
15287C724m386O61P307k455j7529M705J0753M83j2069n454J8749J1722J1947j0792
15273A7366j1289j104l654j2470o956J6618k161j2689R296K2301k072j1531j0084
15260h429k719j301J5621O870m783J848M196o000k959L179K360M900N939K826
15246B1548R57N030k943p197j4220j3702m637j1788l333J0038K502k432L649j260
15232a7788N011k155P018k726L592P978j1914l758L544J4527J0358K570j887j3278
$$ y = [21731, 9265, 5760, -3465, -8499, -1606, -11013, -2011, 14605, 8880, 10790, 94, -8374, 2206, 11258, 6915, 7657, 5058, -2768, -4300, -1288, -14592, -16793, -8926, -15436, -10500, 2038, 4689, 4066, 1592, -6899, -20029, -24159, -16625, -7759, -3087, 5948, 8216, 718, -1067, 2067, -2646, 3724, -662, -1, 7306, 4851, -12678, -7973, 2780, 3263, -8806, -14260, 4489, 16211, 28158, 17366, 6077, 4973, 1319, -11151, -18107, -1489, -3650, -16339, -7043, 15258, 13186, 1655, -8429, -11148, -12449, 3172, 10042, 5259, 7107, 11303, 5303, 2344, 5523, 7883, 12783, 18722, 21548, 22505, 27535, 24592, 17395, 3175, -10527, -15164, -26952, -30285, -20247, -17745, -20177, -16528, -17788, -12777, -14932, -7914, -10640, -7048, 930, -10984, -14742, -11198, 3329, 13687, 16257, 14370, 1092]
15218A092j5717j889l788k78J8732L402q580P71l523r213j7102n0o984L826J7703
15203b1598J782j71L501J3314k305j0792q183j194J79P028J6924K55l530L310
15189a480J2880M908j338J6608k611j7859j4723r881k150q41L507Q475K295J778
15175d32l232m749j249o684Q663J8254l556j3234k963j27M363r013k063J335Q66
15160a3821k881p293j262J1180j344K427K2665L382J358j2660j7806n524M064
15147a7515K2973R298n657m243j6698q238K331M514o891n243J923L230k685o315
15133b9216M17l895m214L215J4250K0068m050j4172l453O803j1564j028P62L381
15119b2696Q296M288j6882j0144N698P306j3917J0203Q810J0426J2398L64j1397
$$ y = [1092, -14625, -16514, -20302, -20580, -1848, 1554, -7026, -6255, -9778, -18991, -36093, -36143, -43127, -39301, -21598, -19816, -19987, -16486, -3172, -5477, -16269, -24452, -25646, -25467, -18439, -1515, -1260, -4790, -1480, 11400, 16308, 14970, 31578, 28967, 11108, -3615, -13496, -15646, -16487, -12980, -4505, -2210, -432, -3664, -8413, -9662, -16346, -7683, 10571, 7015, -6219, -9182, -9309, -4946, -13959, -16022, -14687, -13821, -16702, -23995, -25257, -14077, -15421, -12994, 9671, 13053, 14411, 1751, -16055, -21579, -17515, 5458, 14756, 9099, 4856, -11842, -20080, -17749, -13235, -20126, -25369, -23446, -20216, -22901, -29216, -28799, -32694, -36908, -33693, -19443, 625, -3425, -17597, -21050, -14247, -25811, -26839, -26077, -22696, -14400, -10112, -26994, -37138, -31440, -24134, -38051, -27848, -19038, -8612, 3786, 4150, -7247]
15106g247r294l363P941P623l07K947N083J1314J788q75K872O366j1049k0571
15092f772k2678k516R344J5722J0812k220j599J641j997p412n271j454N97J6960
15078C157K358o576J411O889m74o688Q477q08L872j2533p730k241N952j81m048
15063i163l197N419P126r664q502N817K1032j367n825o717J24Q885P238k382j1013
15048b189J199R309n201l112o883m086K083l226K259O565P69M030P161q771n110
15033e203L845K736Q789N078J786l970l663N976L890l40J583J0234k417o123j4767
15018G434m923J2320P401p300j3903q250J6672K444j7325n499l168J4257j675
15005a515n424N90j1236P721J1974J7929M018k2277j7747J0754J426M545j672
$$ y = [-7247, -16541, -19904, -11963, -4340, -4647, -1700, 3383, 14697, 16485, 15610, 18482, 24848, 13799, -6772, -29450, -31966, -22622, -6900, 3912, 1692, 93, 1734, -263, -7675, -12946, -14400, -13803, 3157, 5515, -1061, 350, 7239, 6765, 77, 8554, 7746, 11618, -915, -8645, -10886, -4934, -5115, -9163, -12360, -6941, 185, -9479, -17981, -12164, 8868, 7501, 1676, -5041, -4917, 3968, 11206, 8824, -2189, -990, 8319, 3118, 6, -6877, -10963, -8880, -12106, -9847, -3282, -2513, 1517, 8678, -93, -5203, -1358, 1378, 10167, 15245, 17031, 13061, 9398, 15374, 19264, 18924, 20507, 30741, 28324, 22201, 7434, 2511, 14831, 22232, 14932, 1029, -7221, 9451, 11895, -5430, -10929, -14097, 160, -1515, -6939, -6349, -17585, -9864, 2110, 20039, 24057, 1780, -15967, -5213, -3787, 758, -914]
14992i14j2810K387J6069l148k728n095J0277J1342n013j0157m211q042P188k010
14978f865j2419r151J8212K663M932j630j2393Q077J0676j882J006j1564q375
14965a8713J5131m791L824K232L572R627Q095J2665J5650r410j6420j0752o551
14952D159n794P39K843p764p902M543K634P65P401J2858L003q317j3360l103k563
14937i858Q697m288k281N086j423m958o023K424N284l61o312m569k093R110J2520
14922I55R765j1230j2525J0820K644P871M465j2922j6710M539J9202P894j2151
14909B617O94O69l916q094n672M265Q589L334P013M027j8815J9657J191r583K366
14894H342l160j8602K172P700J732j079l98M452j660o095J1201N696k0955l298
$$ y = [-914, -13724, -11337, 4732, 1584, -1144, -6239, 4038, 15380, 10367, 210, -4001, -12043, -4855, -6865, -19284, -28435, -10223, -7560, -2628, -4258, -16651, -8574, 2102, 220, 1226, -10338, -18713, -3582, -8373, -4549, -2317, 1255, 10882, 18977, 31642, 47292, 37882, 21462, 10710, 4159, -1635, -896, 1947, -5817, -13719, -9176, -6542, -5777, 1624, 14482, 17485, 9168, -4192, -7295, -9858, -1161, -5449, -7730, -2644, -4067, -9025, -15048, -12624, -7340, -7701, -14013, -18582, -20675, -11565, 955, 10720, -510, -13035, -2215, 429, 8300, 12765, -157, -16867, -12328, 6874, 14768, 2617, 3311, 3980, 64, -8030, -13702, -9437, -848, 2486, 9499, 13526, -5289, 14368, 15559, 5976, 8342, 5182, -13420, -11248, -3548, -1816, -2895, -3293, 1159, -501, -6596, 4605, 10301, -10654, -13952]
14880a3952Q113P427O241L804p576r965J108P647O64j752Q30o738J6775l857O137
14865A4906K685m018o075m245l956m130N971J7099R992J319J0341k249j9749k3992
14851f101L115J7852q743J211N64J146q652r2m955N97N107Q978j0500P598L69
14836G494j159k015j913Q836p01j3955K059J1208n2N09o086O35M311j2837p76
14821d442Q14m824m384m675P523J6894K079L027J4824o883r075Q54j110m275p309
14806i62p773k817O743o93K908M971P469P530k006l421j1787k427J4695n92p091
14791D747k768o464n710J2527J0100p004j7314j464J1266P339l032Q254O802j698
14777A5581J0977o182j0554m906j0989J5302q445j424N020L823j0247n631m347
$$ y = [-13952, -5839, 1588, 7829, 11633, 4057, -5908, -4800, 2847, 3511, 1759, 2589, -4149, 12626, 8769, 14906, 17591, 13573, 7498, 3253, -703, -4833, 1138, 18237, 28229, 29548, 39889, 37640, 17891, -6101, -2986, 14866, 6123, 7334, 7898, 9044, 392, 300, -4655, -4058, 1049, 10027, -473, 7125, 7494, 6335, 4320, 2407, 11243, 10542, -3413, -1354, 9854, 9802, 10311, 4225, 4860, 9171, -3666, -4442, -3628, -8452, -12836, -17511, -9988, 6906, 8985, 12012, 26836, 19953, 10878, 11732, 10622, 6347, -962, -8735, -11552, -4809, -5502, -2594, 2377, 9846, 17376, 15370, 11949, 162, -2265, 12430, 11838, 4747, 1979, -4485, -10195, 2332, 12432, 5428, -11886, -13350, -2084, 5255, 2223, 10477, 17279, 15581, 26558, 20376, 9822, 4916, -6073, 9229, 784, -640, 4380, 8203, -2044, -7675, -12022]
14764a2022l931l796L880J2384N388J374Q640r160j1518K659J1577O722p919p052
14750b774L855o683m537K142N843J0406j0273q551J0311Q977l962m760j8530j9626
14736c8162N059O743M754J2805O793j776L520O596o389r501J3660O714r843l553
14722b580J552P729P456L324j444M170J1283j9097l584k348r90M319P216m002
14708A3004J134L604j2380J406m255k287o376O592M727j2967r232K943L73m085
14694a7799J0910Q776j098n103Q135k436q686j76n167R273k837j8572M462L927
14680a6391k201k363N758L56j576M352O742l083l97o504J9885m626N816l461j1327
14665i020k131Q38N169O39n490r984J8832O444j0833n692N764K4152O261l017
$$ y = [-12022, -15953, -19749, -15869, -3485, 1903, 3277, 11917, 2757, -8761, -6102, 5475, 12197, 4278, -2774, 1081, -5602, -10139, -7997, -2154, 8252, -2021, -10572, -261, 8716, 4754, -6, -18536, -38162, -33103, -26360, -21606, -8801, -2008, -3784, -264, 6332, -57, -9558, 4102, 10816, 973, -2580, -1028, 6701, 14157, 17481, 16037, 20207, 31490, 12393, 8809, 6461, 5471, 9790, 17006, 13004, 14138, 17742, 5362, 6768, 2513, 226, -6150, 442, 5169, -7798, -17030, -14087, -13714, -17799, -6889, 1887, 789, -4314, 3821, 1385, -7301, -7477, -12644, -3371, -6208, -24780, -20318, -16391, -18592, -20955, -15197, -14841, -16417, -12065, -5323, -8406, -8803, -15307, 4578, -48, 5768, 2307, -9020, -11151, -10313, -5144, -4505, -9995, -19979, -1147, 5297, -5536, -11228, -5464, 18688, 24949, 21932]
14651B1932J34o264j0444m786k481K053N527k39k470N184M294o783k638p552n387
14636i920p130k082N958J7912O674O02M039Q858L183J701M08M101j6364j4473
14622C467P771j4229l458j23K344r068Q448O9K555J1044R519Q26r121L907J817
14607A5768L333l175n388M850l275m049o37K829J664J552K642L144O037L489m891
14592B3893k0197j632Q054j108k690n897p771K191J813j0763l229N268j013l788
14578a6869J02l679J1436l484k076j513Q909J3810o79j1953j4279R598K0613M462
14564A4398j8502M450J0175o024n729j776o117P508J3071o789lJ1026q652q72
14550F164m629M46m483o688J6884j455P570J566Q994p519j7700m366r278Q247
$$ y = [21932, 22066, 15802, 5358, 572, -1909, 144, 5671, 5432, 2962, 8146, 12440, 5657, 3019, -4533, -9920, -17050, -19132, -13174, 4738, 11412, 12014, 16053, 24911, 28094, 29795, 30203, 34304, 17940, 3467, 11238, -2991, -6449, -6572, -4228, -13296, -4848, -4779, -2224, 8820, 18339, 19165, 10044, 13951, 15768, 19101, 15926, 10538, 15388, 12113, 8064, 7427, 10256, 11920, 13472, 16114, 19258, 25295, 28784, 23893, 3696, 2064, 10118, 9010, 6320, 423, -7348, -5157, -3344, -14107, -17336, -12068, -13081, -16869, -16767, -20446, -9010, -12494, -14570, -16083, -7174, 6636, 5957, -5996, -20275, -10677, 9936, 14398, -4104, 346, 10521, 4497, -1232, -3008, -9125, -1617, 11454, 4665, 4662, 15688, 7036, 6164, 1535, 1981, -2502, -9190, 7694, 6239, 13809, 15375, 24369, 16850, -850, -5216, -14494, -6247]
14536f247M456M020M663q361r667L467K0511J448r503o150j0031J1259R953l802
14522F016r210m621M054k764j0770N326K2262M223j5277q39O184Q898Q955l901
14508A8536Q374J802q706j1442j4454m072l484J0046K6477N433o676r29r363n60
14494A0982l204J898j3421J503o046P155Q321k723K796P178n237j0355K20l544
14480d477m10j1043q338K810M302k872o85O699j490J2131J0971k585q366j3005
14466a6358L29Q503l023q4N75R537L788j2447j0663l558J5094J1688N715j0435
14452a339o104J3458N192L349L424J162n435P941O67j7121k812j994k163J0329
14438H554Q197L849j4995j0415p53J4148k601Q489Q938o649R23J3323l72q559
$$ y = [-6247, -1791, 2229, 6892, -1469, -11136, -7669, 12842, 14290, 4787, -1363, -11394, -135, 9818, 6016, -3194, -7815, -3761, -6525, -17295, -11969, 10293, 14516, -761, -1600, 4584, 13482, 22437, 18536, 26910, 28712, 20006, 8564, -5890, -9962, -13446, -3400, 23077, 28510, 21834, 20905, 11542, 10982, 7778, 9676, -3745, -2242, -8288, -1133, 7188, 4465, 7261, 14439, 9202, -1153, -933, -4477, -4887, -15930, -24268, -21458, -17156, -20028, -20713, -14014, -15504, -3373, 7598, 5013, -3353, -16358, -16029, -7526, -10549, -10633, -10058, -521, 3267, -9180, -19843, -23401, -8307, 3381, 9096, -1339, -7443, 6015, 11207, 14556, 17980, 19142, 13707, 21648, 22315, 5194, 2382, 388, -1775, 8554, 16751, 20600, 5605, -4810, -5563, 8585, 5984, 14473, 23411, 16762, 17685, 31008, 30636, 22077]
14424B2077r790l181p976j6910j256P209p459j0493J0281J1713J8821J4884l048
14411B4872q40l124n565p621K865j0461p846M839J1587l583k852j577m605j731
14397e642l139j2806p165p980M902M82P189K1217K5969q416p98j4952P70k1716
14383b2085k908q75l54k067P724l410j9999R2J7835J4385Q907J716r686m457J3783
14368a399J210n442m207r853l155J0882J9959P411p135p854p482l128J83R486
14354e24M988L555n972K704j8367o290M959Q501J2147J2636m373l90J0995j18
14340B4451m429P586K754j609l867j0842k063m825j4552j858J2769j380k333k49
14326d47r48O413J4628j976q949k298Q601n648n117k214O257n731k720J4746J7397
$$ y = [22077, 12287, 9106, 1130, -15780, -17036, -9827, -17286, -27779, -17498, -5785, 13036, 27920, 24872, 24032, 20908, 15343, 7722, 10587, 126, -7720, -2881, 8706, 5123, 2271, 694, -3911, -5642, -8781, -21587, -28752, -36732, -31830, -31348, -24159, -2942, 23027, 14611, 13813, -1139, -369, -22085, -24993, -25868, -26222, -28289, -20565, -23975, -43974, -43882, -26047, -11662, -2755, -1039, -10725, -15182, -1399, -189, -5631, -9838, -19691, -22846, -11964, 7995, 15406, 8271, 417, -7065, -10193, -10010, -524, 4464, 8019, 2047, 4751, -13616, -19906, -14947, -6446, 5701, 18337, 13964, 13574, 24569, 24451, 20022, 27608, 30362, 28753, 24886, 14044, 11981, 7156, -7396, -9254, 3515, 2135, -198, -447, -1395, 5018, 19646, 17670, 8721, 6423, 15024, 9376, 4259, 2045, 8302, 2571, -149, 14597, 31994]
14311C1994K552j5080m890K609K07l628m209J1115R34j5332j0122l392J5956L712
14297A2426j2734o642P318P291K432m328o697r560J7935n38k1141j0557P106K2678
14283D989J3015p7j5242j718J2531l845J2530J1763j0466r821n632o767j297J376
14269A339J108P25N145K44L089p337J889K850J552J1779k560j0019o594j6551
14255a3341J1491J7336p893j5883J898K301N223m092R400M844j145L316L552J0352
14241B7359N342j9569r783p400K246K698q010n333m01O624P571p15N77k51K40
14226A195J0032L362PL951j8898o323P147J3462j3481o424p09l181K733R051k778
14211h54J094j951J5351J3018j944j5587O56j593n400r945L06J9123J2776j4320
$$ y = [31994, 34546, 19466, 14576, 17185, 17392, 13764, 9555, 20670, 21604, 6272, -3850, -7242, 8714, 12426, -308, -6950, 368, 7659, 10091, 5763, -934, -10494, 7441, 6903, -14238, -24795, -17689, 4989, 18004, 17927, 2685, 967, 13498, 9653, 22183, 33946, 23480, 13659, 8027, 1260, -37, 1339, 2447, 3172, 8317, 8561, 11650, 4313, 6202, 9052, 10604, 22383, 19823, 9804, 3210, -13341, -1850, 15486, 7593, -8290, -6392, -4091, 1132, -2960, 6440, 11284, 10139, 13455, 17007, 27359, 32701, 13132, 3349, -4051, -1805, 893, -7117, -12450, -12851, -6227, 1344, 629, 1206, 955, 1195, 11227, 14589, 14596, 18547, -351, -6674, 473, 13935, 454, -5970, -6679, -9860, -7127, 1924, -854, 240, -1711, 13640, 26658, 24714, 9127, 9783, 8190, 2790, -7155, -6849, 12274, 25050, 10730]
14197A0730j5468j0514L330Q518m166J0225N050n750L857J3799j450j0171j350
14184F640n68m842l281o22j732n486R357r327M126j211R276J0801M253j4775j6272
14169a3663j3106L847J4429J7037M571r321j7642N841m61j550k639J0967l053
14156d743J861r513j340J3304O220l945R821Q434K582J575M916n574q35l190p045
14141A2528K183j2755j2469q681J1364K921O890M287l247r343J4465lj3961p980
14127a3801M26O323O075m09J231P193R128K1148m166j6673M266m306k320o265
14113G850J0753m789O999K502l272j4403J428o23p838m039O61j806Q91P769J0642
14098A2725l415L806p194m849N562p304k364J2732J1393p830j6073j4727K009
$$ y = [10730, -4738, -15252, -11922, -3404, -7570, 2655, 7705, 1955, 5812, 19611, 18161, 7990, 6640, 6072, 1230, -2051, -2673, -4405, -9891, -534, -9861, -5735, -6946, 2330, 13131, 17384, 2609, -13663, -26769, -22922, -8493, 8544, 13115, 3794, -13848, -8007, -8468, -10018, -12657, -1690, -4743, -2882, -12395, -13735, -431, 5789, 1844, 11665, 20099, 22681, 24256, 29172, 23598, 22763, 19573, 12528, 14711, 1956, -10513, -19194, -7830, -4909, 1981, 6268, 3021, -6322, 8143, 8140, -5821, -13801, -13375, -7052, -977, -1386, -155, 7038, 16166, 37314, 33148, 16475, 20741, 16435, 14115, 7850, 18603, 13814, 20813, 23315, 20043, 5640, 7068, 6445, -1393, -5432, -4771, -6577, -5686, 2083, 12725, 9310, 13116, 5922, 1073, 6635, -669, -3033, 9699, 21092, 13262, -2811, -17538, -15529]
14085a5529J8448J6632Q491j5236r284L347N428J6287m411k2037j3978j4624J0630
14072a5836J8055O958O216L10k080P448J742j2697j0904Q617j6231o964J1907
14059c459k03L865O749N440n833J0062J483j3652n502J1884j2995j3870j484Q452
14045i063P877M803k826j0125L158K0491O46O277J1779n099l146m904j494m278
14031A4096l292N991j0021M034R009Q061J2367l696j5968j617j961L600o767L884
14017A7720R510j698r335j1431J0238M124P955p434N86q710L669J1212j0839j0614
14003D953O991j432n970L059m776Q706M015j7429o37k122j159K3412J1629L383
13989C2623R096o458j2923n386N01j5544l558J8899J4894M409j2779K919l195
$$ y = [-15529, 2919, 19551, 28042, 12806, 3522, 6869, 12297, 28584, 24173, 2136, -11842, -26466, -15836, 2219, 9177, 15393, 15703, 13623, 21071, 22813, 10116, -788, 7829, -8402, -15366, -3459, -3662, 203, 6952, 12392, 6559, 16621, 18104, 4452, -1050, 10834, -2161, -16031, -17515, -9063, -1186, 3617, 791, -9334, -6176, 14315, 14961, 21238, 33017, 27918, 24772, 19868, 18374, 14096, 10804, 16795, 6774, 10808, 19817, 27878, 40245, 36549, 20581, 18964, 17003, 20603, 13836, 17720, 27230, 25532, 16197, 4766, 15004, 19128, 27083, 19649, 20235, 11525, 15194, 26406, 15567, 4953, 11944, 10512, 4542, 7601, 2825, 11531, 15546, -1883, -2520, -4642, -5801, 17611, 29240, 32623, 41719, 35261, 22338, 16952, 17453, 1909, -1649, 17250, 32144, 36553, 23774, 26693, 23498]
13976B3498q849j4325O63R900Q347L824n507l235n055l171L45K231q90n211L167
13961E732L375j7239q826L643Q086m60l554J3585N097j2104O70k718J402k549
13947e860N945k882J556J9800Q990l641j204m53K676m825j6580n54n384r415o740
13932a8571J1451k584Q061M227O138J3420O95o605n672J0595P514r624j432P507
13918B5120k296j1626j0571j1363r08P472M071o449k848J3491J0885M539m970
13905A4547P180M62j2737r635j0512N44P435J4406K894J054n052r216n474LM351
13890B50J6152j572q49N952j0763q697L541P576k132j0838L445M506L829K929
13876A3329m488N089q508j502p623l596P018N113n033N763M987R660K20r087n277
$$ y = [23498, 14649, 324, 987, 10887, 19234, 23058, 17551, 14316, 9261, 6090, 6435, 8666, 7776, 2565, 5732, 9107, -8132, -16958, -13315, -5229, -5689, -9243, 4342, 9439, -2665, -1995, -4713, -3311, -5860, 85, -2797, -1241, 18559, 27549, 23908, 22704, 22251, 24927, 20102, 3522, 2968, -2416, -11831, -18571, -7120, -9704, -1643, 2584, 8722, 22142, 22837, 16232, 10560, 21155, 28669, 19045, 17613, 25120, 22824, 11198, 627, -10736, -11644, -4172, -101, -6550, -9398, 4093, 14978, 19517, 14547, 21727, 22189, 9452, -183, -10695, -10151, -2716, 11690, 14584, 15638, 10586, 1370, -4104, -4101, 250, 16402, 14830, 13981, 19933, 9170, 473, 4014, 11590, 9458, -1380, 2065, 6571, 10400, 13329, 8841, 13930, 5422, 3920, -3703, -7299, -281, 4832, -201, 5562, 10549, 20209, 20429, 11342, 6065]
13861F065q038J266J0074l037O701N608l070q35n487q086R820J829k323j992l052
13846E443m526k830j945K777J2429L567k60j1397m745P751J5151J0199K517j1455
13832B2676j4664n5Q603M446j165L707m470l154J0940Q171J124n426j9020j384
13818A0329R728R08J3710J65j4243L693J984j7543j3638Q986K265j255o823Q328
13804F594N132j309p727m038K122N272Q791J2396p792p887l022M224m437j7222
13790h903J1396P326q640n442J3033O833J2913j740j9354K359K1772q554n149
13777A7850O464j0261j5156o920J1063K2930N623j0799M808k694p510n031k846
13764G521K6362J8136L480O40j1141o043J967n950j7100K493P167L013j0729l134
$$ y = [6065, -1973, -707, 9367, 6330, 13031, 18639, 15569, 14734, 9247, 1161, 10981, 12810, 10487, 8495, 5443, 917, -1913, -3858, -1081, 11348, 14915, 14655, 3258, -1487, 6264, 21415, 31614, 34131, 22676, 8012, 7957, 16560, 21006, 19841, 23548, 19078, 15924, 26864, 35035, 36159, 30733, 11713, 10329, 20057, 20965, 34675, 34840, 20597, 24290, 26274, 8731, -4907, 4079, 6344, 5089, -1734, 6594, 11726, 10417, 2690, -1348, 774, 6046, 14837, 27233, 19441, 11554, 8532, 12756, 8319, -8903, 2493, 9819, 1179, -4263, 8770, 15603, 28516, 26776, 7422, 9781, 31553, 22999, 17850, 24314, 14053, -1103, -8023, 3040, 25970, 31593, 20794, 25602, 22908, 15398, 10367, 7521, 33883, 52019, 55499, 56139, 44998, 38955, 40922, 34972, 17872, 20365, 27532, 30545, 19816, 16682]
13750A6682R175M843J019n640q858k33J1159J5066m044q878M261p914j0329M442
13736B0751O938M968l149o452j134j2273L99R716L355M345R41n653k773j4950
13722E029j3548O365k051Q91L780K3024J7736R78o936j4862j5677n897p094M76
13708g786O883J1157N465Q381N120N00M242J5804j115j9333j7861J2656Q350M595
13694C7058L311m462n439J33j251j4398Q913J6806j794k0409n501J2616J0986
13681C6569M498j355j524m682k3961q750O926Q023K38l423r515p857J2943J1062
13667A9192R762Q50p925m240k641j062o144Q965n819m777n198N778K677J3139
13653B2557J5174J300j4183J0115M109k518m167N89o194n839j1886j3565M504
$$ y = [16682, 25857, 30700, 31719, 26079, 17221, 16988, 28147, 43213, 39169, 30291, 34552, 26638, 16309, 20751, 27689, 32657, 29508, 23056, 21922, 9649, 10048, 19764, 23119, 27464, 28405, 22752, 19979, 5029, -8519, -2154, -4205, -3314, 466, 23490, 41226, 42204, 35268, 20406, 4729, -1168, -8262, -7786, -903, 10254, 15719, 24100, 29220, 29720, 33962, 49766, 48651, 29318, 11457, 24113, 32463, 37058, 40369, 35907, 30468, 30601, 29350, 14952, 23865, 40671, 38877, 18468, 12967, 25583, 36569, 41067, 39712, 38188, 33506, 9545, 795, 7721, 15744, 15982, 12559, 3044, -4813, 8130, 19192, 28954, 29804, 21879, 17639, 14998, 13936, 7792, 16757, 10938, 6161, 963, 6741, 9418, 22557, 37731, 39031, 24848, 34963, 39072, 36554, 32387, 32976, 26782, 20943, 9057, -4508, -4]
13640dK3456J3267k912N813k911k0808o573J050P594o972r85K766m422M504l589
13625I274L809J315J1370P817j158J0027J840L405k471l875J365m623j3558P41
13611B5278j752O395J869R672m365K315M747o512Q20k12r93p083L994L239r68
13596C6444L346P302j3401j4327j637J2456l714J985k629N872O929N647J276q
13582D5541K908M60r51M777K90Q167q382r147l399L237m855n309p01N271J033
13567C8940J8881q20j0417j1023J2588P331m142k863J618M439j1607q317L252
13554C7860m616M09J8277K0115K36q663m221M081P445j3913k872J875P68L407
13540F0188N98J395m841j5156l589n005L658o334j4874J604J1970P637j358o590
$$ y = [-4, 23452, 36719, 33807, 39620, 36709, 15901, 9328, 10378, 17972, 11000, 10015, 12781, 8359, 12863, 9274, 13083, 14398, 25768, 33585, 32427, 42454, 44294, 47699, 45228, 41353, 42718, 38095, 24537, 25278, 23526, 29921, 31790, 41462, 37097, 39412, 44159, 37647, 38467, 38255, 37262, 30179, 34173, 37412, 36444, 39790, 47092, 33691, 19364, 17727, 30183, 26469, 28454, 25825, 31697, 38626, 44273, 45549, 45541, 48449, 48909, 47958, 52735, 53025, 61192, 52810, 43663, 40264, 43501, 38646, 33337, 32636, 37907, 38940, 57821, 57001, 46584, 35561, 48149, 55480, 51338, 48475, 50093, 54532, 42925, 34608, 37860, 33244, 33653, 51930, 72045, 72281, 63618, 59397, 63478, 70923, 57010, 54138, 56013, 56781, 60188, 60786, 62181, 57340, 42184, 38595, 33590, 37248, 30914, 16040, 17644, 29614, 37251, 35893, 29303]
13526B9303j8J0231Q255J9721N98j6735k453q218R832J3006K341J825j0342m964
13512E2382q901N453P311p266J102M302N076J090O278j041l29R328Q304q618J1838
13497H6309R193K2800J3776O131M923L3422K0479L2034K6542L1298K6324J7913
13485C31144o742l8530k5263k8931m1297l2846p218P7j3545l5424k705O681k379
13472A03022n740j0689j1138L364r636n731L938o242m910K775m058J380K66L572
13458F0173P440L397m448J1571J3706M413L998n408m206Q48o629J985J9024M871
13444A10735J2127J0119J7217K4537L6793L9562M9760N9827N4821L7438L5123
13433D88059K2755l350k2585l5753m1022j4934k8413l5738m3177l6714k4415j9237
$$ y = [29303, 29285, 39516, 47771, 67492, 68090, 51355, 48902, 40684, 50516, 63522, 65863, 67688, 57346, 52382, 43481, 48934, 56245, 48979, 50081, 54383, 59459, 60549, 66827, 65786, 65457, 74785, 83089, 74471, 86309, 95502, 118302, 132078, 138209, 143132, 176554, 197033, 229067, 255609, 286907, 313231, 331144, 324402, 285872, 260609, 231678, 190381, 157535, 150317, 150394, 136849, 101425, 98720, 105401, 103022, 97282, 86593, 75455, 78819, 69183, 63452, 67390, 61148, 56238, 59013, 54955, 56335, 56601, 60173, 67613, 71010, 66562, 78133, 91839, 96252, 100250, 94842, 90636, 91484, 84855, 86840, 105864, 110735, 122862, 132981, 150198, 174735, 211528, 251090, 300850, 360677, 415498, 452936, 488059, 510814, 507464, 484879, 449126, 408104, 393170, 364757, 329019, 285842, 249128, 224713, 205476]
13421B05476k5991j8804j3531r321j3384k4864p905j6080p67Q125K988o404q454
13408G1084O119l785k411J790J784M732j4398j1865r031l437J0027J4477j1177
13395E3909M80K0815J3223M536O897P186M982M047J0211R785N859L3748K5390
13382B01068K7427N0711O3403M3487K1051k4299k9655l8381m9261m3199m1389
13371A80963l0782j9964j9097j3149k30l344O199J1147o847j4088o734M517K768
13358I1359J927j584q2n117J161M137P655p04n759j4993j4181r833J3647J0994
13344G8627p14N013R660j9595q885j1242j2501o43J4838J2266k56j0095m482m948
13330D7043L977j093J3947Q872n548M185J437J2076j9623k147l814M026J1116
$$ y = [205476, 179485, 160681, 147150, 137829, 124445, 99581, 91676, 75596, 74829, 82954, 85942, 79538, 71084, 77203, 73418, 71007, 72797, 74581, 79313, 64915, 53050, 44019, 40582, 50609, 65086, 53909, 54389, 75204, 88427, 92963, 99860, 107046, 112028, 116075, 126286, 136071, 141930, 175678, 201068, 228495, 279206, 342609, 386096, 407147, 382848, 353193, 314812, 265551, 222352, 180963, 150181, 130217, 111120, 97971, 97741, 94397, 100596, 111743, 104896, 90808, 84074, 88591, 91359, 93286, 91702, 91620, 86503, 87664, 91801, 99456, 98752, 92993, 78000, 63819, 53986, 67633, 78627, 77913, 82926, 92586, 72991, 64106, 52864, 40363, 39720, 54558, 66824, 66568, 56473, 51991, 47043, 51020, 49927, 63874, 72746, 67198, 71383, 72820, 84896, 65273, 63126, 59312, 63338, 74454]
13317G4454l010J3435o678j8701k812J8582K6673O374j1591q928j3967j2367J6762
13304G8226J7983P584j1610k834r305J0531N207L230m786P83J5960K669j161J2744
13290A25221J588K992n108j5308m397P327K932o214k801k192R813m022m217K522
13276A08136j2172L161O236r72N121K002K747P022L915p683n239n855P283q359
13262A05343R374J1190K877p455K846J963Q865J5995j074j439Q34j252K81k41
13248A48107r69J2803J0267j863j624J0480P820N732J3447J1933N478P332L120
13235B32063L086N173J6743N502l93k248j512j5141K664P672M73Q896o881q324
13221B47773O587K5947O222N968R595Q100l294K108L775K1727K3052L846R270
$$ y = [74454, 71444, 84879, 78201, 59500, 56688, 75270, 101943, 108317, 96726, 87798, 73831, 61464, 78226, 96209, 103793, 92183, 89349, 80044, 90575, 95782, 99012, 94226, 95009, 110969, 113638, 112477, 125221, 126809, 129801, 124693, 109385, 104988, 112315, 115247, 109033, 106232, 104040, 113853, 109831, 105614, 108136, 95964, 99125, 105361, 104389, 109510, 111512, 114259, 121281, 125196, 117513, 112274, 106419, 113702, 105343, 114717, 125907, 128784, 121329, 124175, 126138, 135003, 150998, 149924, 148485, 149319, 148067, 148348, 148107, 147138, 159941, 170208, 168345, 166721, 177201, 185021, 190753, 204200, 216133, 221611, 228943, 232063, 235149, 240322, 257065, 262567, 262174, 259926, 258414, 243273, 245937, 253609, 254082, 262978, 256097, 247773, 254360, 280307, 286529, 292497, 302092, 310192, 306898, 309006, 312781, 334508, 357560, 361406, 370676]
13208C70676j152J5019K9902M949l154M719L3217J3404O803K2973M5080M1992
13196E84428M4569K3022L0390K6296L4382K2538L9944O1402M1394L6335M6589
13185I91289M9169L3031M5062M1648N6041O6977L3181L9822N4150N2551N0126
13174A513047M9192L7171M3517K6826J0133J7206L0110K0412P977l895o812k202
13162A742682j3094k788L387M456J4653J4107k40o51J9521L2157J6929j5807k5342
13149A789970j0537O4l979l951M030J8192J9211K0632K8672L6576L2403M8015
13137A979298N1501M3700N5044N9291O2480P8972Q2865N9980O5035Q5245P8502
13126B701913P3353O8784N3869O4829Q2050O9253M9285N0015N2870M3462K3842
$$ y = [370676, 369524, 384543, 414445, 419394, 416240, 420959, 454176, 467580, 474383, 497356, 542436, 584428, 628997, 652019, 682409, 708705, 743087, 765625, 805569, 866971, 908365, 944700, 991289, 1040458, 1073489, 1118551, 1160199, 1216240, 1283217, 1316398, 1356220, 1410370, 1462921, 1513047, 1562239, 1599410, 1642927, 1669753, 1679886, 1697092, 1727202, 1747614, 1755591, 1751696, 1744884, 1742682, 1729588, 1726800, 1730187, 1734643, 1749296, 1763403, 1763163, 1762512, 1782033, 1814190, 1831119, 1815312, 1789970, 1779433, 1779497, 1775518, 1771567, 1775597, 1793789, 1813000, 1833632, 1862304, 1898880, 1931283, 1979298, 2030799, 2074499, 2129543, 2188834, 2251314, 2330286, 2413151, 2473131, 2538166, 2623411, 2701913, 2775266, 2844050, 2897919, 2962748, 3044798, 3114051, 3163336, 3213351, 3266221, 3309683, 3333525]
13115C333525Q467l538j4405M566l115n653k4681l4732l1957l8796l7005k9017
13103C123659m8934m4899l5711l8423l1257l3765l6917l2624k7698k8793M470
13092B769108j297J1026j320j1150J5155N601J0905K1795K0836M1189K9304L1679
13080B942831M8784M9821N0099N4874O8606O3047O2831P2786O7993O3350O7129
13069C612151Q4416R7747R3253J04800J12012J29846J09218J17644J31049J42000
13059D734136J34134J51571J81351J93133K37178K73556L23894L94204M61345
13050G084502N39590O59030Q13213R82959J203971J489167J882693K378898L079784
13041B0113807M002942N124197O287189P069607O828703N045382J959676j613736
$$ y = [3333525, 3341992, 3338454, 3324049, 3328615, 3325500, 3319847, 3295166, 3260434, 3228477, 3189681, 3152676, 3123659, 3074725, 3029826, 2994115, 2955692, 2924435, 2890670, 2853753, 2821129, 2793431, 2764638, 2769108, 2767811, 2778837, 2777517, 2766367, 2781522, 2787123, 2798028, 2819823, 2840659, 2881848, 2911152, 2942831, 2991615, 3041436, 3091535, 3146409, 3215015, 3278062, 3340893, 3413679, 3481672, 3545022, 3612151, 3696567, 3794314, 3887567, 3992367, 4104379, 4234225, 4343443, 4461087, 4592136, 4734136, 4868270, 5019841, 5201192, 5394325, 5631503, 5905059, 6228953, 6623157, 7084502, 7624092, 8283122, 9096335, 10079294, 11283265, 12772432, 14655125, 17034023, 20113807, 24116749, 29240946, 35528135, 42597742, 49426445, 54471827, 56431503, 54817767]
13033E4817767m654138o395406o739459o076680n005040l892934k932691k156685
13025A6964734j578659j194863j022384j036664j094904j074971r47042p90278
13017H224969o42219m90834l71766k69798k01059j30350o5872l5510K7575Q5626
13007F130762J26484J78255K34741K86591L32437M02631M85762N98730P16329
12998I492722Q49730J030495J247592J523149J859643K260996K821231L593325
12990B4678883M620512N988316P678061R603790J1224285J1536776R644601N717368
12982I0692592J209049k466498m795829n668582n339720m751237m995949o232853
12974E7650973p484748p842158p198523o043184m850393l819913l029972k393142
$$ y = [54817767, 50163629, 43768223, 37028764, 30952084, 25947044, 22054110, 19121419, 16964734, 15386075, 14191212, 13168828, 12132164, 11037260, 9962289, 9015247, 8224969, 7582750, 7091916, 6720150, 6450352, 6249293, 6118943, 6053071, 6017561, 6045136, 6130762, 6257246, 6435501, 6670242, 6956833, 7289270, 7691901, 8177663, 8776393, 9492722, 10342452, 11372947, 12620539, 14143688, 16003331, 18264327, 21085558, 24678883, 29299395, 35287711, 42965772, 52569562, 63793847, 75330623, 84975224, 90692592, 91901641, 89435143, 84639314, 78970732, 73631012, 68879775, 63883826, 57650973, 50166225, 42324067, 35125544, 29082360, 24231967, 20412054, 17382082, 14988940]
12966A4988940j890748j545834j288385j067428q42525o80425n90190m78129l71236
12957F234040k84845k52257j70411j07864o6431l4119K3172Q3186J24241J81494
12947E730206K50828K93993L70519M88328O33943Q04412J004723J252371J487072
12938A2316395J643323J730692J816814K085063K635900L561205M824315O317977
12930C6931684P718097Q406254P491105M456462j07413m602411p566720q555311
12922D4171747q032602o778212n426809m246689l331769k622691k086884j712876
12914I933215j413764j144342r52435p93378o72883n75337m92333m01401l42554
12905C144788k98849k54101k26592k03895j68808j51741j14624j12015j09240
$$ y = [14988940, 13098192, 11552358, 10263973, 9196545, 8354020, 7673595, 7083405, 6605276, 6234040, 5949195, 5696938, 5526527, 5418663, 5352232, 5318113, 5341285, 5424471, 5548712, 5730206, 5981034, 6275027, 6645546, 7133874, 7767817, 8572229, 9576952, 10829323, 12316395, 13959718, 15690410, 17507224, 19592287, 22228187, 25789392, 30613707, 36931684, 44649781, 53056035, 60547140, 65003602, 64896189, 60293778, 52727058, 44171747, 36139145, 29360933, 23934124, 19687435, 16355666, 13732975, 11646091, 9933215, 8519451, 7375109, 6422674, 5629296, 4956413, 4381076, 3888743, 3487342, 3144788, 2845939, 2591838, 2365246, 2161351, 1992543, 1840802, 1726178, 1614163, 1504923]
12896A504923r1922p8226p6931q4901o5415n4224o2065o0074n2814l7515l8334
12885H02502m2929k8898l1430l6617l2969k6593l5504j6591j4661k1253k0794
12874D94263k5090k667J149k6594q823k0676j9639j6975Q142L848o537r435p072
12861C63894p031r519o478K006K769j2309N06j5458k607j1910k1419N960J5705
12848C04109J136j7687k0496j469J4685o834j0043j9636j3284j774K559o513j0410
12835B14343m690j1193l499l288J1955N838j6014k1188R046K0620l874J296o064
12822A93288q471L281O139O253K3083J7634K1287L2730L7961L1433J4482k126
12810C76974k7588m9160m0757l4178o853j1675j5803k7889o022m829q342j5395
$$ y = [1504923, 1413001, 1334775, 1257844, 1172943, 1107528, 1053304, 991239, 931165, 878351, 840836, 802502, 759573, 730675, 699245, 662628, 629659, 603066, 567562, 550971, 536310, 515057, 494263, 469173, 466506, 467655, 441061, 432238, 411562, 391923, 374948, 383090, 386938, 380401, 370966, 363894, 356863, 347344, 340866, 342872, 345641, 333332, 333838, 318380, 315773, 303863, 282444, 288404, 304109, 305245, 287558, 267062, 265593, 280278, 273444, 263401, 243765, 230481, 228707, 231266, 224753, 214343, 209653, 198460, 194961, 191673, 203628, 209466, 193452, 172264, 181310, 201930, 198056, 199352, 193288, 184817, 188098, 194237, 200490, 223573, 241207, 262494, 295224, 333185, 364618, 379100, 376974, 349386, 300226, 259469, 225291, 218438, 206763, 190960, 163071, 157049, 152220, 143878, 128483]
12798A28483n229M717l231J0856P721j1407l924q068n034p802m15j532N147j0206
12784A00076K792q593p033O326m528R65k788j2929O83l076q248l868P13J3723
12770G4215K0205j0380n623J863J1295o592J162m041k1576m724L895J2520k406
12757F9813q164M598l73L887j533j0060l050o270m059p44J053J1684m889o195
12743D5698o790l392L980J386P161J555M63p528K997n614j6153m38j1750J419
12729A2994N187K802R95O572j576M424K745J649M463K906j969J169J4172K132
12715E8665l841r076n468L826k2044j8281P446M50J0795J8838P164j5146l074
12702C0254Q322j340j540N496j537p321Q174o36M066J219j1778o46N364K130L20
$$ y = [128483, 123254, 127971, 124740, 135596, 143317, 131910, 127986, 119918, 114884, 107082, 106667, 105135, 110282, 100076, 102868, 94275, 87242, 93568, 89040, 90005, 87217, 74288, 74971, 71895, 63647, 59779, 60492, 74215, 94420, 84040, 78417, 80280, 91575, 84983, 86145, 82104, 60528, 55804, 59699, 72219, 69813, 61649, 66247, 65874, 69761, 68228, 58168, 55118, 48848, 44789, 44045, 45098, 56782, 51893, 45698, 38908, 35516, 39496, 40882, 48043, 49598, 50061, 42533, 45530, 39916, 23763, 23325, 11575, 12994, 18181, 20983, 21978, 28550, 26974, 31398, 34143, 35792, 40255, 43161, 41192, 42361, 56533, 58665, 54824, 45748, 40280, 44106, 22062, 3781, 11227, 11677, 22472, 41310, 48474, 33328, 30254, 38576, 37236, 35696, 41192, 39655, 32334, 40508, 39872, 43938, 45157, 33379, 32733, 38097, 40227, 40547]
12687D0547j0826l489J2156Q415R285j1053o619j3312r432j3958l215K283K7758
12674B8540R644l3m533q020M764r45p298q303J0033J8720k475J168J2262j2304
12660D1220l075J0347J635j5640K64J2162J0780q546l552j2452m101J748L793
12647C4583J493j0959k822K607J0107j258l0K382J0185P190L286m658o652M429
12633D9883L44k821K015o726j9890m479L729J5886m800J2075K931j0379m11m155
12619C3202O744N701k520m04R233J3719k760q211j3324j3505m069J2975J1204
12606D7985l749n334j2711r083M211P290M631j4187R862J6536N383J0987o050
12593E5771j3353J506J9778N758r449M453K723J1868J6025J4257J9034L0894L3245
$$ y = [40547, 29721, 26232, 38388, 46803, 56088, 45035, 38416, 25104, 15672, 1714, -1501, 782, 28540, 38184, 38151, 33618, 25598, 30362, 29417, 22119, 13816, 23849, 42569, 40094, 41262, 53524, 41220, 38145, 48492, 50127, 34487, 34751, 46913, 57693, 49147, 45595, 33143, 29042, 30790, 34583, 36076, 25117, 22295, 24902, 35009, 33751, 33721, 36103, 46288, 53478, 56764, 52106, 45454, 49883, 50227, 47406, 49421, 42695, 22805, 18326, 22055, 37941, 33141, 45216, 48147, 37768, 37357, 33202, 39946, 45647, 43127, 42723, 51956, 65675, 62915, 54704, 41380, 27875, 23806, 36781, 47985, 44236, 38902, 26191, 17108, 21319, 28609, 33240, 19053, 28915, 45451, 50834, 61821, 55771, 42418, 43924, 63702, 69460, 60011, 64464, 67187, 79055, 95080, 109337, 128371, 159265, 192510]
12580A92510K1223L0247K9023J9792p032j0079l5097k3098j5515k4126k3865j4469
12568A39514j1078k3426j499J763m793k0851j367j5307r453L72Q069m163j0499
12555D7282J51M979j738k400l863j5758L632M344j0013P351J2382o60O80L714
12541E0083J5963J7170J8363J7832O294j0133O169K3948J6564J9223K4781L2776
12529B39033M1748M3352M8720N2340N1711N435j6435j7250j9364k2609k7884k1037
12517C57760p490k9121l1334k9639k2031l0621l0218m3051k7949P328r277j3368
12505I0989l177j682q109n190j740q991m299q90N89j1177J496n699j900p167j163
12490C1890O943n010J1850J8437R715P272l911J642P294Q817Q422P144N112j344
$$ y = [192510, 213733, 243980, 273003, 292795, 285763, 275684, 240587, 217489, 201974, 177848, 153983, 139514, 128436, 105010, 103511, 105274, 100481, 79630, 78263, 62956, 53503, 53875, 61944, 57781, 47282, 47433, 52412, 50674, 48274, 44411, 28653, 32285, 36629, 26616, 33967, 46349, 45689, 46369, 50083, 66046, 83216, 101579, 119411, 125705, 115572, 121741, 145689, 162253, 181476, 206257, 239033, 280781, 324133, 372853, 425193, 476904, 482339, 465904, 448654, 429290, 406681, 378797, 357760, 350270, 321149, 289815, 260176, 238145, 207524, 177306, 134255, 106306, 113634, 104357, 90989, 87812, 86130, 78021, 72831, 71091, 62100, 57801, 56911, 57500, 46323, 47819, 42120, 40220, 33053, 31890, 38833, 33823, 45673, 64110, 73825, 81097, 77186, 78828, 86122, 94939, 103361, 110505, 115617, 114273]
12476A14273J1414K0966K4368L0093M2673M7881K7810J6227J9477j2055m1738
12465C01389l8110n2026l7207l1222j9976j0011j9016j9801j2254p713l966J0653
12453F0740q134q854l143m359j0492j141m418N457j208l237k076j3676P243J845
12439A4547K283J1905K002l425q644k4656K685K1280o685p747J583L206J2939
12426B1273N491j1655n838l247J1877N889m738L063O691p059p223n314r741M636
12412D105R160R551k563J871j665j674L778l23K291k393M347K644J741j7235j4157
12397e22O03O256q99N720m574K258o98K331j508l514j2705R626J0682n588k506
12382D962J4397o00m724j564k74P306J478Q87j288j1279l704Q967n373O828j451
$$ y = [114273, 125687, 146653, 171021, 201114, 243787, 291668, 319478, 335705, 355182, 343127, 301389, 263279, 211253, 174046, 142824, 122848, 112837, 93821, 74020, 61766, 54053, 50087, 60740, 52606, 43752, 40609, 36250, 25758, 24617, 20199, 25656, 24448, 21211, 19135, 5459, 12702, 14547, 16830, 28735, 30737, 27312, 18668, -5988, -3303, 17977, 11292, 3545, 5128, 8334, 21273, 26764, 15109, 9271, 6024, 17901, 23790, 19052, 22115, 28806, 21747, 14524, 9210, -531, 4105, 13265, 22816, 20253, 22124, 20459, 18785, 22563, 22240, 24531, 22138, 26485, 29129, 30870, 13635, -522, 81, 6337, 5438, 11158, 6584, 8842, 8144, 10475, 8967, 5453, -7252, 2374, 13056, 7468, 4962, 19359, 18759, 14035, 12471, 12197, 19503, 20981, 21868, 20580, 9301, 5597, 14564, 9191, 16019, 14568]
12367A4568p057k256m733Q847n241k003J1669J574m317p665P404J6850l959p312
12353A6369k749M536j61n56l868K016J442J0466r147j1508m219R027L462J820
12339A6930N35j444j302j2405K991N829K88l618o075Q655j51m732p789m537R604
12324B779J8601R246Q552j4011k771J842p80j459q081o505j117k801P636J9626
12310C0757m469l958o197q090n63j0191k81M386M155M611j064K262j1247m77l73
12295g39j964O256n471j9969K353K1545J3881o973q676R490J1629K60j422k938
12281A7262o600Q031N386K278o301k00r725o67Q831j334j4158q331J6737K3802
12267C5011J297j3503j2106N178P651L363j5911k129m097P936K0600K488m015
$$ y = [14568, 7511, 5255, 522, 9369, 4128, 2125, 13794, 15368, 11051, 3386, 10790, 27640, 23681, 16369, 13620, 18156, 17995, 17439, 13571, 15587, 17029, 27495, 18348, 6840, 2621, 11648, 15110, 16930, 17465, 16021, 14719, 2314, 5305, 11134, 11422, 7804, 1729, 10384, 10233, 5501, -2288, -6825, 2779, 21380, 30626, 39178, 25167, 22396, 24238, 23458, 21999, 13918, 7413, 6296, 3495, 11131, 30757, 26288, 22330, 16133, 8043, 7480, -2711, -2992, 1394, 5549, 10160, 9096, 11358, 111, -366, -739, -2703, 3553, -1918, -21887, -19534, 2011, 15892, 8919, 243, 9733, 21362, 21622, 20200, 17262, 10662, 18693, 24079, 26357, 20056, 19856, 10131, 9464, 18295, 16961, 2803, -5528, 11209, 35011, 36308, 22805, 10699, 15877, 23528, 26891, 10980, 8851, 4754, 12690, 33290, 35778, 31763]
12254C1763l932m474j1403l676K607j456j1329o990J0865J8591K302q453Q291
12241B2706K570N471q372p632J2303k863j2696l404k958O03j542K128J250k204
12227E360J400m985L545K2471J421j0474p710l239m180J515J4408K113l325q117
12213A0203Q636J231m686K108J247J32O515j45J826j4548m069J816Q782J5774
12199C4822p344l418M132R266N524r001q262n231K245j324j042J0275N71r665
12185B1548l652P267N626J961n388l661k427J615J3062J0833o07K689J7852l586
12171F3132j7244j1785k1426l708j2409Q634j344L84P630L947j250J8350O047
12158C8958j4338j648J8202J2293p96j3287p348m781L250L249P12J66o871P143
$$ y = [31763, 27831, 23357, 11954, 8278, 10885, 9429, -1900, -8890, 1975, 20566, 22868, 14415, 22706, 25276, 30747, 22375, 14743, 27046, 24183, 11487, 8083, 5125, 5728, 4186, 6314, 7564, 5360, 6760, 1775, 5320, 27791, 29212, 18738, 11028, 7789, 3609, 5124, 19532, 21645, 18320, 10203, 18839, 20070, 15384, 17492, 18739, 18871, 25386, 25241, 27067, 12519, 8450, 10266, 19048, 34822, 27478, 24060, 28192, 37458, 42982, 33981, 25719, 20488, 22733, 21409, 20367, 30642, 31213, 21548, 17896, 25163, 30789, 32750, 27362, 23701, 21274, 22889, 35951, 46784, 46177, 48866, 66718, 63132, 45888, 34103, 12677, 8969, -3440, 5194, 3850, 4234, 11864, 15811, 14561, 32911, 38958, 24620, 22972, 41174, 53467, 52671, 39384, 32036, 27255, 30505, 33754, 34466, 34632, 27761, 34904]
12144C4904Q260j3535n696r953K078J4207J0553M79n131q025r793K317N624p027
12130A9262o242R437O09P213P107N19j661P873k564n443n222M96j0321O628J788
12115B9479Q362M532o041K407P003r845k506m740j2359n196l096l169M66J1723
12101A7020Q078L346p992L517J7427J1296m457J822n223O788q872j1078R000M933
12087D5605J1480J6215R02R78J079N932J8880J5203R659m312L199J4903J5322
12074A55045K5580L3603J3144J7024M100N591O553n093j3441r537j4822j1388
12062B06359k104j4161l896k4214k4558j5790j2324j0126j6071k4244p214m003
12050D7654k597n461j844P818M592K1931L584r782K007l83N427j2730R052j898
$$ y = [34904, 43164, 29629, 23933, 13980, 16058, 30265, 40818, 41297, 36166, 28141, 18348, 20665, 26289, 19262, 13020, 22457, 23066, 30279, 37386, 37905, 36244, 44117, 41553, 36110, 30888, 31384, 21063, 27691, 29479, 37841, 42373, 36332, 38739, 45742, 35897, 33391, 28651, 16292, 11096, 8000, 4831, 5297, 17020, 25098, 28444, 20452, 23969, 41396, 52692, 48235, 50057, 44834, 51622, 42750, 31672, 40672, 45605, 57085, 73300, 74202, 75180, 76259, 82191, 101071, 116274, 125933, 121621, 124820, 139723, 155045, 180625, 214228, 227372, 244396, 248496, 254087, 260640, 255547, 242106, 232569, 217747, 206359, 204255, 190094, 186198, 161984, 137426, 121636, 109312, 99186, 83115, 58871, 51657, 47654, 45057, 39596, 37752, 45570, 50162, 72093, 75677, 65895, 67902, 67519, 72946, 60216, 69268, 67370]
12036F7370Q085J0122K0784O035N046J199n389m562K5172K9851K3815K3298K2067
12023B32893J5474J1306J4388J3719K5373K4270K2701J2352O815J376M456j5524
12011C69599k1362K832j2552k6030k7274j0974l2027l8715k8952j3684j8911j3072
11999A28878o621k448l103M638q702j3118p905r346L80J4308j234o284l25j0841
11985G8277M377q34r331J0116M845j5320o934P038J3670R157J2068J1595l91R324
11971A27657J0187J7715N784J1737K3099J4865o439l141P417J3473J2020m452
11959B29922m384m132l526k822j6946j8773j1904j9424j1090J382k602r708j5344
11946A10649j5882L841J2896q144j9204M840n845j171q936Q836J4776j2893k684
$$ y = [67370, 75455, 85577, 106361, 112396, 117442, 118641, 113252, 108690, 133862, 163713, 187528, 210826, 232893, 248367, 259673, 274061, 287780, 313153, 337423, 360124, 372476, 379291, 380667, 385123, 369599, 348237, 351069, 338517, 312487, 285213, 274239, 242212, 203497, 174545, 160861, 141950, 128878, 122257, 119809, 116706, 121344, 112642, 99524, 91619, 82273, 82653, 96961, 95727, 89443, 89118, 78277, 82654, 81820, 72489, 82605, 87450, 72130, 65196, 72234, 85904, 95061, 107129, 118724, 118333, 127657, 137844, 155559, 161343, 173080, 196179, 211044, 204605, 201464, 208881, 222354, 234374, 229922, 225538, 221406, 217880, 215058, 198112, 179339, 167435, 148011, 136921, 138303, 135701, 125993, 110649, 94767, 98608, 111504, 103360, 84156, 88996, 83151, 81980, 73044, 81880, 96656, 83763, 81079]
11933H1079L889p36j5744j5605J2357L44l752J1748k654j278J984j1934j4137
11920D5561j433J3016J2404J5423l99r58l333J0334P898m062l126J182O333N496
11906A04336N811p629n217J807k038J55m839J1816J2519O977L416q475l959m669
11892A10011K5J37J222r76K556M659o640k105q088J715m949j7398M991K70J925
11877H7355o536n621J6017M002K631K214O87L218N904j982r286j8385R183P421
11863I6822J4956m852N193M49J076J521j554l981J3596L072J993L956n737K887
11849A29397J0426O680m250M083p144q584L060l335J1861j952p841j168N230L910
11835A40373P675J498j6998r82q852K545R487m011j3559l53l348j2301o059K499
$$ y = [81079, 84968, 84232, 68488, 52883, 65240, 65584, 61832, 73580, 70926, 69648, 71632, 59698, 45561, 44128, 57144, 69548, 84971, 84572, 83614, 80281, 90615, 98513, 94451, 91325, 92507, 98840, 104336, 110147, 102518, 97301, 99108, 97070, 97225, 92386, 104202, 116721, 123698, 127114, 118639, 114680, 110011, 110036, 110173, 111395, 110419, 112975, 117634, 110994, 108889, 100801, 102516, 97567, 80169, 85160, 85430, 87355, 80819, 75198, 91215, 95217, 97848, 100062, 100749, 103967, 109871, 107889, 98603, 80218, 89401, 96822, 111778, 106926, 112119, 112568, 113644, 115165, 113611, 109630, 123226, 126298, 128291, 132247, 126510, 129397, 139823, 146503, 142253, 146336, 139192, 130608, 133668, 130333, 142194, 140242, 132401, 131233, 136463, 140373, 148048, 149546, 132548, 131566, 122714, 125259, 134746, 130735, 117176, 116823, 113475, 101174, 95115, 97614]
11821I7614O717j1485O29K1257J1725j1083j5699Q667J6610Q019k414l585l528
11808A23444K630M319J2193K698p236o582O610M782L828J959J0048r336M778J4550
11794A68685l75k021N968J753J8312J6937p098p978q196J758Q56R593O825p421
11780A97598j3880R157N660N052M250R823J5414M744O156O18O803J0105J9824
11767B81324J4941J9590J8079n8J3330J6423J5657l016K258p327k6135k2072j9919
11754C03075k021o560r391q337j3947o371J5276N739o712k3052l949J325m140
11741B40935j557P503J355N619P642L750l33R157J3727N542K1092J1030j7414
11728C08048J1358J3831J2204J8461m690R067j60j243J6797J3857r006Q835J2314
$$ y = [97614, 104331, 92846, 93475, 114732, 126457, 115374, 99675, 108342, 124952, 132971, 130557, 126972, 123444, 126074, 130393, 142586, 145284, 138048, 131466, 138076, 142858, 146686, 148645, 158693, 149357, 154135, 168685, 168310, 166289, 172257, 174010, 192322, 209259, 202161, 194183, 185987, 187745, 188601, 198194, 205019, 197598, 183718, 192875, 198535, 203587, 207837, 217660, 233074, 237818, 243974, 244592, 251395, 261500, 281324, 296265, 315855, 333934, 333876, 347206, 363629, 379286, 376270, 378528, 371201, 345066, 322994, 303075, 301054, 294494, 285103, 276766, 262819, 256448, 271724, 277463, 270751, 247699, 243750, 245075, 240935, 239378, 246881, 248236, 253855, 261497, 265247, 264914, 274071, 287798, 293340, 314432, 325462, 308048, 319406, 333237, 345441, 363902, 359212, 368279, 368119, 366876, 383673, 397530, 388524, 397359, 409673]
11715D09673K0264J3199J9895m27j7132J2284K9168J1880r593J2376J4351K0804
11703E36742K0336R29J0804Q315K2417L3174K0664K1197K3559L4234M9782M4228
11691H26381M7501M3760L9246L8781M8210M1082N3324P2521P0928P0966O7255
11680A419955R6802R4967J13669J27344J28912J40884J63300J71349J88103K39216
11670B884501K42197K74171L35150L85706M57753N40711O46455Q06039R90862
11661G563545J213938J504543J877229K300121K714634L027752L171860L094913
11653B6468535K911617K700437K513465K364822K172416J804963J208142L53788
11645D2498185n94163j408117j919069k144525k300781k477498k699430k874495
$$ y = [409673, 429937, 443136, 463031, 462604, 445472, 457756, 486924, 498804, 489211, 501587, 515938, 536742, 557078, 558007, 568811, 577126, 599543, 632717, 653381, 674578, 698137, 732371, 782153, 826381, 873882, 917642, 956888, 995669, 1043879, 1084961, 1138285, 1210806, 1281734, 1352700, 1419955, 1516757, 1611724, 1725393, 1852737, 1981649, 2122533, 2285833, 2457182, 2645285, 2884501, 3126698, 3400869, 3736019, 4121725, 4579478, 5120189, 5766644, 6572683, 7563545, 8777483, 10282026, 12159255, 14459376, 17174010, 20201762, 23373622, 26468535, 29380152, 32080589, 34594054, 36958876, 39131292, 40936255, 42144397, 42498185, 41904022, 40495905, 38576836, 36432311, 34131530, 31654032, 28954602, 26080107]
11637B6080107k924424k791522k509479k174151j831543j493311j203298r94184
11629A0158195q35081p04165n97309m87696l74174k87367k17765j27959m3883
11620F482796K7993P8173J63552K38201L14306M07546N01268O58311Q47200J068681
11610A0788027J349640J690020K070260K441422K748941L012182L293423L648396
11602C1042311M038976M441784M752027M850018M609110L968599L106087K370581
11594F3179493J896390J438729Q11734k6850j067480k198623l240544m012188
11586E6780661m350886m414949m363046m335376m327242m277943m078973l682306
11578B2949940l156197k620148k141136j734022j400240j149710r23453p69654
$$ y = [26080107, 23155683, 20364161, 17854682, 15680531, 13848988, 12355677, 11152379, 10158195, 9323114, 8618949, 8021640, 7533944, 7159770, 6872403, 6654638, 6526679, 6482796, 6510789, 6588962, 6752514, 6990715, 7305021, 7712567, 8213835, 8872146, 9719346, 10788027, 12137667, 13827687, 15897947, 18339369, 21088310, 24100492, 27393915, 31042311, 35081287, 39523071, 44275098, 49125116, 53734226, 57702825, 60808912, 63179493, 65075883, 66514612, 67326346, 67299496, 66232016, 64033393, 60792849, 56780661, 52429775, 48014826, 43651780, 39316404, 34989162, 30711219, 26632246, 22949940, 19793743, 17173595, 15032459, 13298437, 11898197, 10748487, 9825034, 9055380]
11570I055380o43854n11979m24539l19781k40679j80552j21700l6384O0551J13102
11560F749565J82719K61178L06237L88161M89930N95950P48009R30809J154122
11551A1806680J419121J707231K009732K257346K407852K453048K368241K195045
11543B8624296K009282J839272J652686J372459R51469L35264l93593j092538
11535C5298597j672355k008837k163004k297248k438028k555273k616623k560580
11527A6986649k353326k043192j714322j407622j160985r57205p79435o43183
11519E927379n40343m48027l98684l33403k81626k29546k15692j88200j53588
11510C138270j56965j45063j07249j01589r4644p3232p8592o7461n6424m6890
$$ y = [9055380, 8411526, 7899547, 7475008, 7155227, 6914548, 6733996, 6612296, 6575912, 6636463, 6749565, 6932284, 7193462, 7499699, 7887860, 8377790, 8973740, 9721749, 10652558, 11806680, 13225801, 14933032, 16942764, 19200110, 21607962, 24061010, 26429251, 28624296, 30633578, 32472850, 34125536, 35497995, 36449464, 36784728, 36391135, 35298597, 33626242, 31617405, 29454401, 27157153, 24719125, 22163852, 19547229, 16986649, 14633323, 12590131, 10875809, 9468187, 8307202, 7349997, 6570562, 5927379, 5387036, 4939009, 4540325, 4206922, 3925296, 3695750, 3480058, 3291858, 3138270, 2981305, 2836242, 2728993, 2627404, 2532760, 2459528, 2380936, 2313475, 2257051, 2210161]
11500B210161m8305m6253k5339k0094k4444j0266j0133M855o401r465q499j3134
11488A992683J4293K3587J5261P950K0640K5226K4072K5826K3010K1102J9361
11477B213011L9465L1550J5961J3718L3204M9370L5692J6530K4318O427J9881
11466B499127J2161R079J0377P169j1679r148m649O23n666k9632l4649k6753l2379
11453B383981l7733l3314k5937j0628j3478j6973p049j1336j3651n216j3650n842
11441B189174K414k5420O115K2434L0923J0277n033J6782L3774M2036K8100K9706
11429B381282N1466N2673M9138M2010M1841N6056N7571L5629L1438K4916L6572
11418B860592M5076L7010K8073J3412j027l511J6121l214k6370k8206l4078l2473
$$ y = [2210161, 2161856, 2115603, 2090264, 2070170, 2045726, 2035460, 2025327, 2030182, 2023781, 2014316, 2005817, 1992683, 2006976, 2030563, 2045824, 2053774, 2074414, 2099640, 2123712, 2149538, 2172548, 2193650, 2213011, 2252476, 2284026, 2299987, 2313705, 2346909, 2396279, 2431971, 2448501, 2472819, 2479246, 2499127, 2511288, 2520367, 2530744, 2537913, 2526234, 2517086, 2512437, 2513060, 2507394, 2477762, 2443113, 2416360, 2383981, 2346248, 2312934, 2286997, 2276369, 2262891, 2245918, 2238869, 2227533, 2213882, 2208666, 2195016, 2189174, 2191588, 2166168, 2172283, 2194717, 2225640, 2235917, 2230884, 2247666, 2281440, 2323476, 2351576, 2381282, 2432748, 2485421, 2534559, 2576569, 2618410, 2674466, 2732037, 2767666, 2799104, 2824020, 2860592, 2905668, 2942678, 2970751, 2984163, 2983136, 2979625, 2995746, 2992532, 2966162, 2937956, 2903878, 2871405]
11406B871405l2130l2230m7751m3229n8331o4638n3520o2559p1351o1504o1999
11395B282163o8117n6196m6898l2444m0495p5056n9739m1835m7191l9983j4077
11384A760132k3502m0627k0223j8926l9757k6150j0319j714o863K99p763L483
11372A568070J263p822K79l863m857j3984N497K0469P976M606j1908O88o994j1448
11358A547972p582j1092j8620j0257n985k7023m4589n7901m4639j9235k0932m1545
11346A238572l7491m9240m8589m4060l8727m6065m9963l6059l5164m6670l9520
11335G67024m0825l5144k2254l1739l2744l2420j8911j4967k4155k2604j8432
11324D72829j6530j3970j3225j9330k2075j7350j7549p018j0590j5693k7525j7938
$$ y = [2871405, 2839275, 2807045, 2759294, 2716065, 2657734, 2593096, 2539576, 2477017, 2405666, 2344162, 2282163, 2214046, 2157850, 2110952, 2078508, 2038013, 1962957, 1903218, 1861383, 1814192, 1774209, 1760132, 1736630, 1696003, 1675780, 1656854, 1617097, 1590947, 1580628, 1578914, 1572051, 1572350, 1564587, 1568070, 1569333, 1561511, 1561790, 1557927, 1553070, 1539086, 1544583, 1565052, 1573028, 1577634, 1565726, 1566414, 1559420, 1547972, 1540390, 1529298, 1510678, 1500421, 1494436, 1467413, 1422824, 1364923, 1320284, 1301049, 1280117, 1238572, 1201081, 1151841, 1103252, 1059192, 1020465, 974400, 924437, 888378, 853214, 806544, 767024, 726199, 691055, 668801, 637062, 604318, 571898, 552987, 538020, 513865, 491261, 472829, 456299, 442329, 429104, 409774, 387699, 370349, 352800, 345782, 335192, 319499, 291974, 274036]
11312B74036n239J094k0030j3189j2376r377o248j974k195j0949k427m098j0688
11299A76340p972k456k0958M784j1508n178j381k297n261j169j621m408O39j3225
11285A04329o821p447N515M159K312j2994J136J672N023Q407N845n338j4080p683
11271H4035o653J252j395J7680l629p879n630j4095o134J1182R785N070j3427
11258G0162J551J3607L465o801j479J2196M528j7410j9837p8J107N234L654R780
11244G9679L514o256q569L240m757p90L538j249L468J2531l3j114J1050M251J1391
11229A09894K4910K3966J3454J3069K1370R97N234J7740J3483J4728m249L057
11217B57653N817j686n596j2065p595j7846k3027n020o635l2633j7758j2711j9231
$$ y = [274036, 268797, 269891, 249861, 236672, 224296, 214919, 208671, 206697, 204502, 193553, 191126, 187028, 176340, 168368, 165912, 144954, 149738, 138230, 133052, 131671, 129374, 124113, 122944, 121323, 116915, 117554, 104329, 97508, 90061, 95576, 99735, 102047, 89053, 90189, 91861, 96884, 105291, 111136, 105798, 91718, 84035, 77382, 78634, 77239, 94919, 91290, 83411, 77781, 63686, 57552, 68734, 78519, 83589, 70162, 71713, 85320, 88785, 81984, 80505, 92701, 97229, 79819, 59982, 59904, 61011, 66245, 69899, 79679, 83193, 76937, 68368, 71608, 66851, 66061, 69599, 68350, 71818, 84349, 84316, 83202, 94252, 98503, 109894, 134804, 158770, 172224, 185293, 206663, 207660, 212894, 230634, 244117, 258845, 254596, 257653, 263470, 261784, 256188, 244123, 236528, 218682, 195655, 190635, 184000, 151367, 133609, 120898, 101667]
11204A01667j084j1746k0353P88O490N658p404m234M336J5234j0758j9606k306
11191E6682K1440J4271m176j499k638M805j084J422K483J4415J956P413J4240
11178A29730J2641J5182K9206J2139J9877J2082J9163K4310L0874K4115J3432
11167C42751O595J804J4839J0841J161m659j3593q623r231k1164k7137k8401l1302
11154B33881k1612k5363k5095j3274j2788j8327j7997j0436j0593r241L862l355
11142F9662K716P70L940j8291p782j309J7242J5220N270R24j1495n654K253K234
11128G5700O359J287Q809P040N138q032R987J5507L263J574P624J3776O208O852
11114A61092R547J4490J2701J4459L725N084l513k3178p598o029k4159r581j164
$$ y = [101667, 100583, 88837, 68484, 69272, 75762, 81420, 74016, 69782, 74118, 89352, 78594, 58988, 56682, 78122, 92393, 88217, 86718, 84080, 88885, 87801, 89223, 91706, 106121, 108077, 115490, 129730, 142371, 157553, 186759, 198898, 218775, 230857, 250020, 274330, 305204, 329319, 342751, 349346, 351150, 365989, 376830, 377991, 373332, 359739, 351116, 341885, 320721, 293584, 265183, 233881, 212269, 186906, 161811, 148537, 135749, 117422, 99425, 88989, 78396, 69155, 73017, 69662, 72378, 73148, 77088, 58797, 51015, 49706, 66948, 82168, 87438, 88362, 76867, 71213, 73466, 75700, 82059, 83346, 92155, 99195, 104333, 96301, 106288, 121795, 125058, 126632, 134256, 148032, 154240, 161092, 170639, 185129, 197830, 212289, 216014, 221098, 217585, 194407, 186809, 180780, 156621, 147040, 145876]
11101A45876j7353j5288r773j2678j3278j6246O841J1870m196m024j5461J392
11089E7682l916J1991J2145j5715j7735j5893J028M177J3872J0767p649j3894
11077C6860O778P622j2831j6767k776L34J5501R365J913k079n228m418J4190o203
11063D2261p579O737j0550o59o981j801J3718Q996q843j1086k0536J027R098P507
11049B1309n37J0533o470J4Q936J5335L46k298n883J3089m591r115N600M332q217
11034D2383J812K406j707r141L317m376m459J0998M387n736n732Q138r933j061
11020C1296M522Q61J399j1153m740M034o072q203K228J0641L861M393j4410n952
11006A2705M279N104j684J5018r17o416n873N651J0704j0862j3146J2981R324
$$ y = [145876, 128523, 113235, 103462, 90784, 77506, 61260, 68101, 79971, 75775, 71751, 56290, 57682, 53766, 65757, 77902, 62187, 44452, 28559, 29587, 33764, 47636, 58403, 50754, 36860, 43638, 51260, 38429, 21662, 18886, 19220, 34721, 44086, 45999, 43920, 38692, 34274, 48464, 42261, 34682, 41419, 30869, 30210, 23229, 21428, 35146, 44142, 35299, 24213, 3677, 4704, 13802, 21309, 20772, 31305, 24835, 24849, 33785, 49120, 49466, 47168, 41285, 54374, 49783, 40668, 46268, 50600, 42383, 44195, 46601, 44894, 35753, 39070, 34694, 30235, 41233, 45620, 39884, 34152, 42290, 32357, 31296, 35818, 36679, 38078, 26925, 22185, 26219, 20147, 11944, 14172, 24813, 28674, 33067, 18657, 12705, 16984, 22088, 20404, 35422, 34505, 28089, 22216, 27867, 38571, 27709, 14563, 27544, 36868]
10993C6868m310j3844Q098R112L299j05l761K981n419k0145k645J7483k156r758
10979A5698l289m776m312M78o197o145R456M023J6775J7344M497j5090L866Q567
10965D0895R279o921q101l026j695p26r577O76j454m909l279Q212p46j2353M47
10950F722J310J630J091J6275L567o757j3256n264N202J355n596M851Q430M776
10936B4336J651j5474l213M331J0146Q384j2963J0200J2207K981j2203k0490p184
10923B709q149L089L426j167N444J2764n769j4392j69J9454L240L020M45r981
10909A3964J0135J3579L800o424r664L859M629j1775N329L88n612k054k507p719
10895I928j144m007o575l790J1507k221j07J7058J1822L761o446j1031n52j152
$$ y = [36868, 32558, 18714, 26812, 35924, 39223, 39118, 35357, 38338, 32919, 12774, 10129, 27612, 25456, 15698, 12409, 7633, 3321, 3799, -2398, -8543, 913, 4936, 21711, 39055, 43552, 28462, 32328, 40895, 50174, 43253, 35152, 32126, 30431, 29705, 20128, 20804, 19350, 14441, 11162, 19374, 18628, 6275, 6722, 8032, 9662, 10753, 27028, 30595, 23838, 10582, 5318, 10520, 11875, 6279, 11130, 19560, 24336, 25987, 10513, 7300, 11631, 21777, 30161, 17198, 27398, 39605, 42586, 30383, 9893, 2709, -5440, -2351, 1075, -92, 5352, 18116, 12347, -2045, -2214, 17240, 20480, 23500, 23945, 13964, 24099, 37678, 41478, 35054, 25390, 29249, 33878, 22103, 27432, 27820, 22208, 20154, 17647, 9928, 8784, 4777, -1798, -5588, 5919, 3698, 3591, 20649, 32471, 36232, 29786, 18755, 18203, 17051]
10881A7051j1665M160O663L518K484J4327J5434J055j6146o32r957m279J196J334
10867B4543n760R151J428N646l950n252m2n622j793o488P805O617j259R28j565
10852B4387K790J564K543o082l669N158R44R62j8300o398J318J8433N668R158
10838C8476j0363k227j489N868J2814j1623L086j2503j3416L111l729O094m353
10825I746Q880M460L09J0166r29o921l624q03l35k627P874J2021J286n605K500
10810C6398L493Q293O07j3808R952J5491L283l009k739j862O493J3441j795p01
10796G3537R254Q815n329j3702k387O223j2568L087k253k553l281M142J9603P4
10782H2662j5562j4167j3541N27O703O215p700O91o569K352N485l940r748L05
$$ y = [17051, 5386, 9546, 16209, 19727, 22211, 36538, 51972, 53027, 36881, 36249, 26292, 22013, 23209, 24543, 18783, 27934, 29362, 35008, 31058, 25806, 25764, 20142, 18349, 11861, 19666, 26283, 25024, 25952, 24387, 27177, 28741, 31284, 25202, 21533, 26691, 27635, 28597, 10297, 3899, 5217, 23650, 29318, 38476, 28113, 25886, 24397, 30265, 43079, 31456, 34542, 22039, 8623, 11734, 8005, 14099, 9746, 18626, 23086, 23395, 33561, 32632, 25711, 22087, 21284, 20949, 18322, 26196, 38217, 39503, 33898, 36398, 39891, 48184, 48791, 34983, 44935, 60426, 63709, 60700, 57961, 56099, 62592, 76033, 74238, 73537, 82791, 91606, 86277, 72575, 70188, 76411, 63843, 66930, 64677, 62124, 58843, 62985, 82588, 82662, 67100, 52933, 39392, 39919, 46622, 52837, 45137, 45828, 39259, 41611, 47096, 43156, 33408, 33713]
10768C3713j983R137J5262N081j2556r692k363J3039l255l300J495Q65j3590j3644
10754A8209O272J3206J7566k762l609M105M814l658q327j2712m952P622K59j7989
10740A8044K90J8987l218j4112P599R071l602l038J398k071j212O475k6k293j858
10725C0434Q546j3203k834Q825Q336Q711l267j317J4781j6657p135r894n180J8414
10711C8560N067q295M170J7488k90O162r561L78P673k3075j0123l137L568r67
10697B7618J4798L963K295j2770R27J7137o223j4825J1408P592J803m410p20j1274
10683C7319n798K3015K3247L046l973n214n978q720J070j077J0238n814j2333
10670D9028m665q823Q772l844j813j719m558m320K688O860r197J3928J0330o022
$$ y = [33713, 31730, 40867, 56129, 61210, 48654, 38962, 36599, 49638, 46383, 43083, 44578, 45443, 31853, 18209, 24481, 37687, 55253, 52491, 48882, 52987, 57801, 54143, 45816, 33104, 28152, 35774, 36033, 18044, 18334, 37321, 34103, 19991, 27590, 36661, 33059, 30021, 31419, 29348, 28136, 34611, 34585, 32292, 30434, 38980, 25777, 22943, 31768, 40104, 48815, 45548, 44231, 59012, 42355, 35220, 25326, 20146, 38560, 43627, 35332, 39502, 56990, 56700, 62862, 53301, 53679, 61352, 38277, 28154, 25017, 28585, 27618, 42416, 46379, 48674, 35904, 36831, 53968, 47745, 32920, 44328, 51920, 53723, 49313, 48593, 37319, 31521, 54536, 77783, 80829, 76856, 71642, 65664, 56944, 58014, 56937, 67175, 61361, 49028, 44363, 35540, 44312, 40468, 38655, 36936, 32378, 28058, 30746, 37606, 28409, 42337, 52667, 46645]
10656D6645L963J5175Q49O351O148j0139p175j4774j0190J518m747P117N410O471
10642E2622J7652R201j4998L322o051j8505n291K824L542J0038Q574J912M477
10629F9319j5575k71P056l921n961O550o22L369J759k3j0070M437J2371J0443
10615G8861L221j1311k602M643K571L085j553p826j4326L784J6255J0671M664
10602I0137M70r470j5145m940j531p129o673r235J2242K9729J1855q733L315Q188
10588I3080m24j4938j246J6207l14n111k408m642l335M598J5988j0747k2002o229
10574E8477J1377L510N222J5630J3940q169N876L486j0810J820L284j2943j3315
10561G7385N011J2041j3264j13K2735K1421o500r712j98J3543K018M095Q720j1000
$$ y = [46645, 50608, 65783, 66632, 72983, 79131, 68992, 61817, 47043, 36853, 38371, 33624, 40741, 46151, 52622, 70274, 79475, 64477, 67799, 61748, 43243, 37952, 40776, 44318, 54356, 62930, 64842, 69319, 53744, 53473, 60529, 56608, 50647, 57197, 56575, 59944, 61703, 61680, 51610, 56047, 68418, 78861, 82082, 70771, 68169, 72812, 75383, 78468, 76915, 69089, 54763, 58547, 74802, 85473, 90137, 90607, 81137, 65992, 61052, 59521, 52392, 45719, 36484, 48726, 78455, 90310, 81577, 84892, 93080, 92656, 77718, 76472, 92679, 92365, 87254, 84846, 80204, 76869, 81467, 97455, 86708, 64706, 58477, 69854, 73364, 78586, 94216, 108156, 99987, 105863, 109349, 98539, 100359, 103643, 90700, 77385, 82396, 94437, 81173, 81060, 103795, 125216, 118716, 109004, 108806, 122349, 124367, 128462, 137182, 126182]
10547A26182k7612p47p596o844J079R666R560o888P514r00r940j8286J1357J030
10533H7575O175R083R848L592k378N852K8627K6095L409j0312N913L256j1547
10520A65188J0264J2142j3914j5249P839J8964M87J0814N365q20L498J5748K08
10507B20534K978J0955o165L965n097l072J5327J1800K1892J8217J0195L186J2766
10494C17481P553K6058K7495J5442J1155L0279L6871M3015M7521M5372Q8920J17772
10482H14934J53913J85166K44941L11468L44411K77304J33755q3100k45249l05914
10472A831629l00135k54873k00382j43668j06246o7089n4501m7623k9573j8860
10462F08679j1671r005j3246p105K7623J0641N793J3364J3610L794N264R171Q850
$$ y = [126182, 98570, 97823, 90227, 83383, 84462, 94128, 103688, 96800, 104314, 103414, 93474, 75188, 86545, 87575, 93750, 102833, 112681, 116273, 113895, 119747, 148374, 174469, 177878, 167566, 173479, 176735, 165188, 175452, 187594, 173680, 158431, 166270, 185234, 185721, 196535, 201900, 201080, 204578, 220326, 220534, 223512, 234467, 228302, 232267, 227170, 224098, 239425, 251225, 273117, 291334, 301529, 304715, 317481, 325034, 351092, 378587, 394029, 405184, 435463, 472334, 515349, 562870, 608242, 697162, 814934, 968847, 1154013, 1398954, 1710422, 2054833, 2332137, 2465892, 2382792, 2137543, 1831629, 1531494, 1276621, 1076239, 932571, 826325, 759236, 704735, 657112, 627539, 608679, 597008, 588003, 574757, 567652, 595275, 605916, 611709, 625073, 638683, 642477, 647741, 656912, 665762]
10449F65762J0918K3445K8384J4570K677J4475J9850J8606J9206L4412L1598J4378
10437H98281L0156N6893L4564L2294M3072M2657M4108K7621L1958M1769L0274
10426A313647M6626O7594P6070O4014O6762O6772Q6089R0121R3104R3394R1235
10415B155428R7605J12584J20925J13741J47154J41869J35900J57730J87626J91768
10405C562330J84225J78817K05580K21664K36125K33714K28395K45618K56170
10396E552638K58240K60503K42552K31176K31664K39977K19783K00382J86327
10387G623242J58248J15950P6407L9149J6200j0744m5458p5693j04658j34456
10377G658187j59498j94144j82096j87896k27267k21324k03512k19700k31547
$$ y = [665762, 676680, 700125, 728509, 743079, 745756, 760231, 780081, 798687, 817893, 852305, 883903, 898281, 928437, 985330, 1019894, 1052188, 1095260, 1137917, 1182025, 1209646, 1241604, 1283373, 1313647, 1360273, 1427867, 1503937, 1567951, 1634713, 1701485, 1787574, 1877695, 1970799, 2064193, 2155428, 2253033, 2365617, 2486542, 2600283, 2747437, 2889306, 3025206, 3182936, 3370562, 3562330, 3746555, 3925372, 4130952, 4352616, 4588741, 4822455, 5050850, 5296468, 5552638, 5810878, 6071381, 6313933, 6545109, 6776773, 7016750, 7236533, 7436915, 7623242, 7781490, 7897440, 7973847, 8012996, 8029196, 8018452, 7972994, 7897301, 7792643, 7658187, 7498689, 7304545, 7122449, 6934553, 6707286, 6485962, 6282450, 6062750, 5831203]
10368E831203k24562k14241k19189k10575k06609j81717j67085j65996j63041
10359D078188j47090j56898j46259j39769j25604j17824j03339j03257j16138
10350B922010r5514q6927p5835p7352o8343n6659n9751n4043m0302m7145m9058
10339B211081m6564m1803o0533n5664l5451m0514l1236m9217m6055l0457j5741
10328A757846j8269k7732k9373k6981j7195j3006q99M616N7158R7961J28572J63247
10316B075945J57146J75999J71233J21294O0749n303n3656j16774j81556k25326
10306B179751k11457j90802j83235j76169j31020j07773q7816m5576k1042k9660
10296I95201l2581k1946l9425j9160j1262j4384k529n565k0632k2473j3891l0718
$$ y = [5831203, 5606641, 5392400, 5173211, 4962636, 4756027, 4574310, 4407225, 4241229, 4078188, 3931098, 3774200, 3627941, 3488172, 3362568, 3244744, 3141405, 3038148, 2922010, 2826496, 2739569, 2663734, 2586382, 2518039, 2461380, 2401629, 2347586, 2307284, 2260139, 2211081, 2164517, 2122714, 2062181, 2006517, 1971066, 1930552, 1899316, 1850099, 1804044, 1773587, 1757846, 1739577, 1711845, 1682472, 1655491, 1638296, 1625290, 1624391, 1629007, 1686165, 1784126, 1912698, 2075945, 2233091, 2409090, 2580323, 2701617, 2762366, 2757063, 2703407, 2586633, 2405077, 2179751, 1968294, 1777492, 1594257, 1418088, 1287068, 1179295, 1091479, 1045903, 1024861, 995201, 962620, 940674, 901249, 882089, 870827, 856443, 853914, 848349, 827717, 805244, 791353, 760635]
10284G60635l3451k4525j0331l648J5390K836n297J0495p067o975j0098P412O490
10271G01866J0682K8876Q780J2409J1555l605l258L365K157L418r134k97m946
10258G61868r876j6488j0233o431o194J23n337r276l081K421m252p880j9900j1233
10244F54231J5852J2779Q602J127M965K163J3959M738M309l905K608P06O582O606
10230G35322q663P198K247j243K471Q863J5007K688l449J091j2990j2434N447
10217G41555K2663J2554R830K725j805k913J2642K3493K4117L5134L5466K8743
10205I44204J4041j0527Q627j2543N45K3559K7286L1712J9167j829j1593j0739
10193A021910q69Q44O520O158M434j3429k1579j0817N282J5430J4266J9357K0571
$$ y = [760635, 727184, 702659, 692328, 688680, 704070, 706906, 701609, 712104, 705037, 698062, 687964, 695376, 701866, 712548, 741424, 750204, 762613, 774168, 770563, 767305, 770670, 772827, 776245, 767111, 766814, 761868, 751992, 735504, 725271, 718840, 712646, 712769, 707432, 698156, 695075, 697496, 693244, 685364, 665464, 654231, 670083, 682862, 691464, 692591, 697556, 699719, 713678, 718416, 722725, 718820, 721428, 722134, 728716, 735322, 726659, 733857, 736104, 734861, 737332, 746195, 761202, 763890, 760441, 761532, 748542, 736108, 741555, 764218, 776772, 786602, 789327, 787522, 784609, 797251, 820744, 844861, 879995, 915461, 944204, 958245, 947718, 956345, 943802, 944347, 967906, 995192, 1026904, 1046071, 1044242, 1032649, 1021910, 1021041, 1021885, 1028405, 1034563, 1038997, 1025568, 1003989, 993172, 998454, 1013884, 1028150, 1047507, 1068078]
10180A068078Q075R691Q048J2238P738L545k254n959J5228J0115M661R69P821
10167A147994O776K4645J0474m053Q127J3873R213J4152K5160L0368L3884L1676
10155A352289K5861J5444J8641K9432K4314M2424L6223M5520L5668L8427L4917
10144A699160L4348K8349K1076L0276L6786N2462M4228M7424M5908N2725O5870
10133B158612M6689N4075P3764P4020O2244R3209Q4743R6324J26369J28735J18318
10122C117102J28442J37933J59807J68015J71428J58495J55805J80656J81389
10113D559072J96006K02077K26152K56054K83288K99247L22588L65476M06558
10104G116518M52644M89617N56522O28509P11766P90241Q91144J010442J167770
$$ y = [1068078, 1076153, 1085844, 1093892, 1106130, 1113868, 1117413, 1115159, 1109200, 1124428, 1134543, 1139204, 1140173, 1147994, 1154770, 1179415, 1189889, 1185836, 1193963, 1207836, 1217049, 1231201, 1256361, 1286729, 1320613, 1352289, 1378150, 1393594, 1412235, 1441667, 1465981, 1508405, 1544628, 1590148, 1625816, 1664243, 1699160, 1733508, 1761857, 1782933, 1813209, 1849995, 1902457, 1946685, 1994109, 2040017, 2092742, 2158612, 2205301, 2259376, 2333140, 2407160, 2469404, 2562613, 2647356, 2743680, 2870049, 2998784, 3117102, 3245544, 3383477, 3543284, 3711299, 3882727, 4041222, 4197027, 4377683, 4559072, 4755078, 4957155, 5183307, 5439361, 5722649, 6021896, 6344484, 6709960, 7116518, 7569162, 8058779, 8615301, 9243810, 9955576, 10745817, 11636961, 12647403, 13815173]
10095A3815173J370671J577374J750561J907963J973273K040718K216354K536790
10087B9188877L058028L798744M749631O001616P763438J0143558J3402981J7863812
10079I5970685K3945813L2126537M2586619N4101633O2208218N7998398L3147482
10072D02085385o820859m2210959n8931901n8530196m9661291l9139504k9920952
10065A16869723k2712265j7316322j3369188j0470484q295574o619538n241819
10058C2844533m151745l294949k610765k097449j721645j533463j497675j514778
10050A4422064j473471j348224j167959r82317q31670p21304o21217n16031m56919
10041F302952m24593l60782l43569l23862l06559k62471k42592k29791k22462
$$ y = [13815173, 15185844, 16763218, 18513779, 20421742, 22395015, 24435733, 26652087, 29188877, 32246905, 36045649, 40795280, 46796896, 54560334, 64703892, 78106873, 95970685, 119916498, 152043035, 194629654, 248731287, 310939505, 368937903, 402085385, 395264526, 353053567, 294121666, 235591470, 185930179, 146790675, 116869723, 94157458, 76841136, 63471948, 53001464, 44705890, 38086352, 32844533, 28692788, 25397839, 22787074, 20689625, 18967980, 17434517, 15936842, 14422064, 12948593, 11600369, 10432410, 9450093, 8618423, 7897119, 7275902, 6759871, 6302952, 5878359, 5517577, 5174008, 4850146, 4543587, 4281116, 4038524, 3808733, 3586271]
10032C586271k30783k00850j66102j54331j20843j18733j06830p7590o6017n8038
10022B286154p5180q3307p7645o6221n8020n6105m6808n0865n5957p0575p5298
10011A570173n2074m6297o5027o7206n2371m4952l3964m1185l2904m8989n2648
10000A032556l7398k9827l2990k5892j2619n380o541k2008j4400j4643k1259j2903
9988G96696j9199k0524j5897j02j4032k5603j9532k2084k9776l0348r196k3728
9976E66675m918P44j7186m0501j0386j5563k8034k5105j3277M467j1024j7450
9964C88442r231R265l473l589k077j3515k2219p383l325j6806K252M591K8406
9951C51338J5990J2789K2686L9011L5184K8511K1341J1480k3831l0241k5518k1280
$$ y = [3586271, 3355488, 3154638, 2988536, 2834205, 2713362, 2594629, 2487799, 2410209, 2344192, 2286154, 2210974, 2127667, 2050022, 1983801, 1925781, 1869676, 1822868, 1772003, 1716046, 1645471, 1570173, 1518099, 1471802, 1406775, 1339569, 1287198, 1242246, 1208282, 1167097, 1134193, 1085204, 1032556, 995158, 965331, 932341, 906449, 893830, 888450, 881909, 859901, 845501, 830858, 809599, 796696, 777497, 756973, 741076, 740974, 726942, 701339, 681807, 659723, 629947, 599599, 590403, 566675, 561757, 562501, 545315, 504814, 494428, 478865, 450831, 425726, 412449, 416916, 405892, 388442, 379211, 388476, 385003, 381414, 379337, 365822, 343603, 336220, 332895, 316089, 318341, 322932, 351338, 367328, 380117, 402803, 441814, 476998, 505509, 526850, 538330, 514499, 484258, 458740, 437460]
9939D37460j437K523K632k1557k7777k5057j3658k2494j8383j6744p036j0438
9927B78034j0024j1900j8568j7723o453p973q754K913J625j1395l720L9R861q742
9913A87220k359P412j0606j0255L267R441l281N451K149J151O409K044N868N386
9899B09297k3833k0772o968p966k217p975k513j0471j3001o326j0655o853O198
9886I5945N299j8628j4120j5790l097o5J0445J7771J5427K4139M9191Q2467N9878
9873C08862k1696l9706k6566k000R855j334j0827j5410P240j2300j2184l200j1641
9860A69093j2500j1331o373p440j7554l633l630J1086q698j6397l199R121o049
9847I2496k058j1895l964P180O85j6111n993m625m651L792N347j1779O182J9030
$$ y = [437460, 436023, 438546, 441178, 419621, 391844, 366787, 353129, 330635, 312252, 295508, 288472, 278034, 268010, 256110, 237542, 219819, 213366, 205393, 196639, 199552, 201177, 189782, 186062, 186101, 195962, 187220, 184861, 192273, 181667, 171412, 174679, 184120, 180839, 186290, 188439, 189590, 195999, 198043, 203911, 209297, 185464, 164692, 157724, 149758, 147541, 139566, 137053, 126582, 113581, 107255, 96600, 89747, 95945, 101244, 82616, 68496, 52706, 49609, 49544, 59989, 77760, 93187, 117326, 166517, 248984, 308862, 287166, 247460, 220894, 218894, 228749, 227415, 216588, 201178, 208418, 196118, 183934, 180734, 169093, 156593, 145262, 138889, 131449, 113895, 110262, 106632, 117718, 109020, 92623, 89424, 98545, 92496, 90438, 78543, 74579, 81759, 82444, 66333, 60340, 55715, 51064, 54856, 60203, 48424, 54606, 73636]
9833G3636K1715K209m198O226j0926j1738m635j0291k906j4075j5531j0174M907
9820B4219j4184Q65N01j7149q71J8765K0623p07M658O684Q016M110j6156j2507
9806B6867J3977L834n85l097m457j3122J5221L236j3025N166J3376N310r427j157
9792D2117K881o36l991k978q611j2611K77k409l419L757L823M825p413j1888m104
9777c80P550O409l676k684J2230q19o010p154m268J0207K1145n235j805J4889
9763D0399J5746m016j714L342q99j605J1925J704j5629r662o57P823Q645M875
9749F0277Q4R62q400j0354Q57J632q303Q47K277o937m810N622O076J3738Q089
9734F1657p870L51j2264k3093n221O4Q45k079M4R3k784M062K862p797N377J8825
$$ y = [73636, 95351, 97560, 93362, 99588, 88662, 76924, 72289, 61998, 59092, 45017, 29486, 19312, 24219, 10035, 10900, 11401, -5748, -6619, 12146, 32769, 32062, 36720, 43404, 51420, 55530, 39374, 26867, 40844, 44678, 44093, 40996, 36539, 23417, 38638, 41874, 28849, 34015, 47391, 52701, 43274, 42117, 44998, 44362, 40371, 37393, 28782, 16171, 16448, 14039, 10620, 14377, 18200, 23025, 15612, 3724, -380, 7170, 13579, 9903, 7219, 19449, 18630, 12620, 5466, 1198, 11405, 32550, 27315, 25510, 40399, 56145, 52129, 50415, 53757, 52858, 51253, 63178, 64882, 49253, 39591, 38934, 46757, 55402, 60277, 60361, 61323, 52923, 42569, 43426, 45058, 36755, 37602, 39879, 32942, 28132, 33754, 39830, 53568, 61657, 53787, 54138, 41874, 18781, 13560, 13624, 14469, 12390, 12434, 12527, 9743, 13805, 16667, 8870, 14247, 33072]
9718C3072k076m129J5510K989l771q286l943L457J156j3352k594R208l701n596
9704A7944J9131O242L323K13L290p67l489L134Q196N715J2404J383l56O832J0864
9689I4059O311M131M801P475K274M564J3634J9408J2251L975K2185L3278K4410
9676B52756K9589J8935L1335O0849P0165R9404J42434J79349K48377L10721L40005
9665A783919K93106J22956j02639k56823l22504l22535k54282j76714j44152j11557
9655E08775j03207q1769n2448n1801l6555k1021j9736j8359n298L421p891o543
9643A07568q324j794M86p427J572m139j401l975k220n883M083O751m884j361k855
9628G6197j2507j4474o24J662N414K646k148p652j2421Q334K1016J0921m755P943
$$ y = [33072, 30996, 26867, 42377, 45366, 41595, 33309, 29366, 32823, 33979, 20627, 18033, 27241, 23540, 17944, 37075, 43317, 46640, 46853, 50143, 49376, 45887, 49021, 57217, 62932, 75336, 76719, 76363, 83195, 94059, 100370, 104501, 109302, 116777, 119051, 123615, 137249, 156657, 168908, 172883, 195068, 228346, 252756, 282345, 301280, 332615, 393464, 463629, 563033, 705467, 884816, 1133193, 1443914, 1783919, 2077025, 2199981, 2097342, 1840519, 1518015, 1195480, 941198, 764484, 620332, 508775, 405568, 323799, 271351, 219550, 182995, 161974, 142238, 123879, 118581, 122002, 114111, 107568, 99244, 97450, 97936, 90509, 92081, 87942, 86541, 82566, 80346, 74463, 78546, 85297, 80413, 79052, 76197, 63690, 49216, 48592, 50254, 55668, 58314, 56166, 48514, 36093, 44427, 65443, 76364, 71609, 79552]
9614G9552R991l281K857K148j8876k826k864r14m763n401r406N975O357K291Q095
9599F8935j1180q313j859K296P021K2871J3356M309O418j9853j3178q226p122
9586E5475J1629L826K609k123O484K159j998N706L366m807r342N487J0588L763
9572I2822P027R84n264J6978n214j7590l069K796K1170N982k415r161j1966O079
9558I9159K8436M442M247K0986K5028L682R406O192K674O990J2785o11l115N242
9544B25543J0826K6564K1591K1305K4397K2129J3270J7859K6607K3051L8631N1359
9532E23132M1448M9840M5383N4856O1348O6477P8511R2844J26370J55174J74693
9521A470076K11142K56480L00865L84895N44172P32927R94292J378496J988430
$$ y = [79552, 89543, 86262, 89119, 91267, 72391, 69565, 66701, 65787, 61024, 55623, 46217, 52192, 58549, 60840, 68935, 57755, 49442, 47583, 49879, 56900, 79771, 93127, 97436, 103854, 84001, 70823, 62597, 55475, 67104, 70930, 73539, 71416, 77900, 80059, 78061, 83767, 87133, 82326, 72984, 78471, 89059, 92822, 99849, 100833, 95569, 112547, 107333, 89743, 86674, 89470, 110640, 116622, 114207, 105046, 93080, 99159, 127595, 132037, 136284, 157270, 182298, 185980, 195386, 201578, 204252, 211242, 224027, 223416, 220301, 225543, 236369, 262933, 284524, 305829, 330226, 352355, 365625, 383484, 410091, 433142, 471773, 523132, 564580, 614420, 659803, 714659, 776007, 842484, 920995, 1013839, 1140209, 1295383, 1470076, 1681218, 1937698, 2238563, 2623458, 3167630, 3900557, 4894849, 6273345, 8261775]
9512H261775K903330M233918N906545P068292N609870N12664m647964o557304
9504B3291126n885661m457376l181567k256725j617952j163485q78776o81885
9496C167699n34416m15133l19007k62582k00908j61085j52616j29602r9598q3424
9486H09328p3503o4674p0227m5142m5684n5828n2450k3768k2083j9241j5497n62
9474C20669j7054k0531j1516j7764j2528p593q203k0432l1495k9390j1928M791
9462A37026J544n231m227K688o41m410j6996j7057R961N096n276j136L33j8538
9448H3136k867j0373R571R862R30j0809J0436Q862k492j980j0133j8025q179l430
9434E4509j6558j2096k144J875q528L861m966P245j426K724J1572J1446J3246
$$ y = [8261775, 11165105, 15399023, 21305568, 28373860, 33983730, 34496394, 29848430, 23291126, 17405465, 12948089, 9766522, 7509797, 5891845, 4728360, 3849584, 3167699, 2633283, 2218150, 1899143, 1636561, 1435653, 1274568, 1121952, 992350, 892752, 809328, 735825, 671151, 600924, 555782, 510098, 454270, 401820, 378052, 355969, 336728, 321231, 320669, 303615, 283084, 271568, 253804, 241276, 233683, 225480, 205048, 173553, 144163, 132235, 137026, 138570, 133339, 129112, 131800, 131159, 126749, 109753, 92696, 102657, 107753, 102477, 101341, 101674, 83136, 80269, 69896, 79467, 89329, 90259, 79450, 89886, 98748, 96256, 94276, 84143, 66118, 57939, 54509, 37951, 25855, 23711, 25586, 17058, 20919, 15953, 23198, 21772, 24496, 36068, 47514, 60760]
9421F0760N371l547p370o480r741k949K459O049o540k838P603j4832M238J7498
9407D9681k670j0747j4750j3984m981l237M36Q002m771M964l476J0833p4M440
9393A9666J0361j0810j7706j47L759J5694j0516L448J3980M36m240j448N816n588
9379B2705m208R590M06k148M532O904O991j8961o390j1660m903M626j0743P896
9365D637j2516j6213J0406L705K361k745l167j105K616M106J811L811Q789L306
9351I802j4503r301Q921O064J47N498r742m715m89O159K578R87j7441l619o352
9336b6006k85J4285o661r556K292o245N897K8819J5766j2574j8167P972q4L324
9322a223M253n625j1189J3450R483R086P082q370j6850k131j055N623N463M229
$$ y = [60760, 66131, 62584, 55214, 48734, 38993, 36044, 38503, 44552, 38012, 35174, 42777, 27945, 32183, 49681, 47011, 36264, 21514, 7530, 2549, -688, -252, 7750, 2979, 7943, 4467, 15300, 15226, 19666, 30027, 19217, 1511, 1364, 5123, 20817, 10301, 13749, 27729, 28165, 23925, 22477, 28293, 22705, 18497, 28087, 28493, 26345, 30877, 37781, 44772, 25811, 19421, 7761, 2858, 7484, -3259, 4637, -7879, -24092, -13686, -9981, -7620, -10365, -13532, -14637, -12021, -7915, -6104, -2293, 6496, 9802, -4701, -14002, -5081, 983, 1130, 6628, -3114, -7829, -8318, -2159, 419, 1406, -16035, -19654, -26006, -26291, -12006, -18667, -28223, -25931, -32176, -26279, 2540, 18306, 5732, -12435, -4463, -4547, -1223, 3030, -2595, -13784, -334, 9149, 18235, 25317, 16947, 97, -2034, -3089, 2534, 7997, 12226]
9308A2226N169l514o531n023M145L289l466l362o841k749L514J886N119M646n555
9293B953l168j2519l445K1385M293q719n719m884k597m836j961Q46L942n125J2580
9278f974O735N224K085k537m549j6216k1850N81P380N476L064J7746l467l238
9264a0540J4573m886j1627P526o59o468P800K239q05j0279p908Q793Q39k990O937
9249g455n887j6395J0621M812m558P494J632q857q391J0545P673k092k127o136
9235a9121L801N925J0392R879K412J02l676q601o002j0574k009K5675J0060j0071
9221H192j7586q540J0254o465r540M942R268r22J4553j886J265N69M615r706k565
9206c552r548j3350Q531J2148r324j6941O603Q916O70O920m708P887K801m097
$$ y = [12226, 17395, 13881, 7350, 2327, 6472, 9761, 6295, 2933, -3908, -6657, -3143, -1257, 3862, 8508, 2953, -215, -12734, -16179, 5206, 9499, 780, -4939, -9823, -12420, -17256, -19217, -18371, -14429, -19554, -6974, -239, 4985, 7070, 4533, -16, -16232, -38082, -37501, -30121, -24645, -21581, -3835, -7302, -10540, 4033, -853, -12480, -4954, -5613, -12081, -4281, -2042, -2847, -13126, -21034, -12241, -11402, -14392, -7455, -13342, -29737, -19116, -14304, -18862, -11368, -9736, -18593, -26984, -16439, -8766, -10858, -12985, -19121, -15320, -9395, 997, 10876, 13288, 13390, 9714, 1113, -4889, -15463, -17472, 8203, 18263, 8192, -9394, -17934, -7680, -14145, -23685, -18743, -9475, -10397, 4156, 2270, 3535, 4104, 8719, -987, -3552, -13100, -26450, -17919, -5771, -15095, -32036, -25433, -16517, -15847, -8927, -13635, -5748, -2947, -7044]
9192g044k449J4406J3117K96p703m497j0600q118j637j0560q67N851j2733L114
9178b9424J9962j226O598N495J1892N310J255k548j4205K21J1981L450m475p917
9164F369n529j2505q458p143J801J7987K4503k580j0067M778j4666j7178N409
9151a7279J8724J2191j8719m967J1556J840r263J0682l981l798M650N652k801
9138D487r967j0687N865Q459l061q17K849J974l3l096M089l745j8391J3400J6460
9123G786j5773L030R883j0517q063J076j05m759O920J4342J2445j2734j4199M450
9109f218J0206p166j1688L864R480p525j1400j724k630j847K7919K0858M815j2961
9095A3983j84k707K495K614L889j3560j3387N169R367m710o049J0939J1483K515
$$ y = [-7044, -9493, 4913, 18030, 18326, 10623, 6126, -4474, -12592, -14229, -24789, -25656, -19805, -32538, -29424, -9462, -10688, -4090, 1405, 13297, 18607, 19862, 17314, 3109, 3330, 15311, 18761, 14286, 6369, 840, -11665, -20123, -27266, -25465, -7478, 17025, 14445, 4378, 9156, -5510, -22688, -17279, 1445, 13636, -5083, -10050, 1506, 3346, -5917, 4765, 784, -3014, 1636, 7288, 4487, -5480, -16167, -10302, -1843, -4904, -5721, -2872, -898, -931, -4027, 62, -3683, -22074, -8674, 7786, -7987, -4957, 4926, -5591, -13654, -12578, -12683, -17442, -10522, 3820, 16265, 3531, -10668, -6218, 3988, -3178, -14866, -11002, -1522, -9047, -20447, -22171, -24801, -26648, 1271, 22129, 26944, 13983, 13799, 11092, 13587, 16201, 20090, 6530, -6857, -1688, 7679, 2969, -3080, 7859, 19342, 21857]
9081B1857r657j1732j7928l754J6414Q542L585R752o089o117j5226K725O832L092
9067B296R366r750m011K0316K694j233R124J758j4467j5120k252n668j4691J604
9053b0034J9164J3070j254k3528r285O70K012J2714P325L184J1374l296j2913
9040g97j0211Q833n567L667P884O456n301r527J0645p695o396M029m65M357j1722
9025a1810j2600l962R818Q770J9426j621p492l186k489o343q411J0518M080L813
9011a489L999q874o160P513J6543M764j490q281r954m191m976j1250j812J3198
8997a2460Q454L50o033J0430L771n908P357o222l385o985L334J565j0024j6391
8983c2147o618P211J2660L094O707K295J475j2918J953r93L028K230P649L608
$$ y = [21857, 12200, 468, -17460, -21214, -4800, 3742, 7327, 17079, 10990, 4873, -10353, -7628, -796, 2296, 11662, 1912, -2099, 18217, 20911, 19678, 28802, 30560, 16093, 973, -1279, -6947, -21638, -20034, -870, 12200, 10946, -12582, -21867, -21197, -19185, -6471, 854, 4038, 15412, 12116, -797, -11008, -2175, -7742, -4075, 3809, 10265, 4964, -4563, 6082, -1613, -8009, -3980, -4445, -88, -11810, -24410, -28372, -18554, -9784, 9642, 8021, 529, -2657, -5146, -11489, -19900, -9382, -5302, -1489, 2510, -6364, -12524, -5011, 11532, 16296, 14806, 6525, -3429, -7620, -12596, -23846, -25658, -12460, -4006, -3656, -9689, 741, 4512, -1396, 5961, -261, -3646, -10631, -7297, -5732, -15756, -32147, -38765, -31554, -18894, -15800, -9093, -6798, -5323, -18241, -16288, -17281, -14253, -12023, -4374, -766]
8969g66m474p571O949J2579M694k726j0309K712l764Q328J37o067j466o81l648
8954f073m201J0234O252k080Q61j1298j29k488j1265j975J0299J8047l796o396
8940d008P959R10o947j2252o374j936R426n639j9877M0P756J9948K987L68k343
8925i982J4887P603j863j5645j2995l563q712M783L084Q925O032N871p40R26m828
8910f217k814o098K149R26P061L13J0593J0842j1726M109K374j3386j1062q03
8896a3739K412m868J485j011o684l248J4101L620N751L761P442o506P613j6919
8882f790j9738m470J6158K183O031j290J0277M357j699M095j966j5470n191R377
8868d136k039l925n524L47j061J121J2826n192j0100o889P030L111J464J004k176
$$ y = [-766, -5240, -12811, -5862, 6717, 11411, 8685, -1624, 1088, -2676, 5652, 5789, -278, -1744, -2425, -6073, -10274, -40, 6212, 4132, 4993, -6305, -6434, -8922, -20187, -22162, -11863, 6184, 2388, -4008, 3951, 4861, -2086, -14338, -20712, -22648, -13222, -18861, -38738, -38698, -30942, -10994, -8007, -7639, -9982, 4905, 12508, 10645, -5000, -17995, -21558, -30270, -25487, -22403, -13478, -7446, -1575, -2315, -1389, -6217, -9031, -15129, -12980, -12054, -4993, -4680, 5913, 16755, 5029, 9138, 11512, -1874, -12936, -13739, -11327, -16195, -14710, -15721, -22405, -25653, -11552, -7932, -2181, 1580, 9022, 2516, 10129, -6790, -26528, -30998, -14840, -12657, -6626, -7916, 2361, 6718, 5019, 9114, 7148, -8322, -13513, -4136, -6175, -10100, -15624, -15277, -16338, -15217, -2391, -7583, -17683, -24572, -17542, -14431, -12967, -11963, -14139]
8853a4139K3183K4j6741n889N82m21Q357J5728p212m626R33J071K958L987P600
8838A5395o04n040l117n767P390j192q529l365j1000r905J0930q31j463n246O760
8823a5584J0461J0165j0551m127P370j951M752j1217j8283k836o370q898O556
8810d0513J6434N494M385j947m411m005l565m509N360J340J4402L014j0284k208
8796b1013J0981K0028J858r663r915L077L452L428j634J1222N98p942p013l977
8782f513p855n68o592j922J359M602M836k155M511L912m149j0321O269J3687J0733
8767I834j0800r341M471j4480J4299K3172m000j0252j2857K498L601M945O475
8754G565l46q290j4653r898Q698J5790J2539j6855o655J19P88Q342N38O27J3900
$$ y = [-14139, 9044, 9068, -7673, -13562, -12980, -13401, -5044, 10684, 3472, -1154, -221, 850, 3808, 7795, 15395, 14791, 9751, 6634, 867, 8257, 7065, -1464, -4829, -15829, -25734, -14804, -15635, -17098, -22344, -15584, -5123, 5042, -5509, -9636, -2266, -4217, 535, -10682, -28965, -31801, -38171, -47069, -40513, -24079, -18585, -14200, -16147, -20558, -24563, -28128, -32637, -27277, -25937, -11535, -8521, -18805, -21013, -10032, 9996, 11854, 2191, -7724, -4647, -1195, 2233, 599, 11821, 12419, 4477, -2536, -6513, -14368, -14936, -21528, -23450, -22091, -17489, -12653, -14808, -10297, -6385, -10534, -20855, -14586, -899, 9834, -966, -10307, -5836, -20316, -6017, 17155, 13155, 2903, -9954, -7456, -3855, 1090, 7565, 7219, -1071, -15724, -25622, -16924, -1134, 11405, -5450, -12105, -11986, -11198, -2856, -2318, -1691, 12209]
8739A2209k070j7312o277o133J4689J9479r930l797P805Q581r328p1M772M731
8725A7348K376q686j2823N437M852O15l156l662r27p402R27Q517P998k609K0119
8710B8924L594q199j7632r804L874J6767J3827j870k3760k0979o331L797J243
8697a6549R507K161q247J033J3409J0585K86j3053k9442p176R519L124J767O020
8683a7056Q131K836Q778n112p716n78m960J301L64N544J1417M796J908r380K098
8668B371O937J522j6936J021N986m223q329m269R153J4398j031M528k276m885
8654C967O9l04R11J950J480J6750N256l2055K595J0043M524O028m605l789M249
8639A7069J6014J2856j6506j2125j2510J1763J961l44l952j6850k304J0897R620
$$ y = [12209, 10139, -7173, -13450, -19583, -4894, 14585, 4655, 858, 8663, 17244, 7916, 7845, 12617, 17348, 19724, 11038, -1785, 3652, 8504, 9119, 5963, 2301, 1374, -6028, -5101, 3416, 11414, 8805, 28924, 32518, 24319, 6687, -3117, 757, 17524, 31351, 29481, 5721, -15258, -21589, -17792, -16549, -7042, -4881, -13128, -12095, 1314, 11899, 12185, -868, -30310, -37486, -27967, -24843, -23076, -17056, -8925, -6089, 2689, -2423, -10139, -10717, -15677, -14376, -14012, -8468, 2949, 7745, 9653, 273, 2371, 9308, 10830, -6106, -5085, 901, -3322, -11651, -15920, -6767, 7631, 6600, 11128, 8852, 3967, 4036, 3732, 4643, 6593, 8073, 24823, 30079, -1976, 619, 10662, 15186, 21214, 16609, 12820, 17069, 33083, 45939, 29433, 17308, 4798, 16561, 18522, 18178, 14226, -2624, -4928, 5969, 15589]
8626A5589q919O511J823j0098P849l951j895J001j850m145N774n519j564n604
8612d998J4632M456M050n072k220l503O19J183J9115J9517j426j4802l032K236
8598C0755o132m4Q68K098q059P909N825m466j865Q552k832l647j2481o576O68
8583A0573P041l399L580J387j391K019n344n796n264j691K2313R205j0143r259
8569A3831m942K802o960M382J5069J0007k716j0070m530m970j912J2368k230Q564
8555B8693J3710J4938o688j9841n095n158j1071Q65J2189j209j2146J64p295j1187
8541i131l680l454K892R724o058K678R779K746j249j7847j7711J3091J7921k663
8527b962j0726o999R919o013p763N28J5621K7155J2760p384K469k034j7704j1128
$$ y = [15589, 6670, 13181, 15004, 4906, 12755, 8804, 6909, 7910, 6060, 1915, 7689, 2170, 606, -4998, 9634, 14090, 18140, 13068, 10848, 7345, 7964, 9147, 28262, 47779, 46353, 31551, 28519, 30755, 24623, 24579, 25447, 27545, 19486, 27395, 33220, 28754, 26889, 35441, 32609, 28962, 16481, 9905, 10573, 17614, 14215, 17795, 19182, 17791, 19810, 14466, 8670, 3406, 1715, 24028, 33233, 23090, 13831, 8889, 11691, 4731, 9113, 24182, 34189, 31473, 21403, 16873, 11903, 9991, 22359, 20129, 28693, 42403, 57341, 50653, 30812, 25717, 20559, 9488, 10353, 22542, 21333, 9187, 9351, 2056, -9131, -12811, -16265, -13373, -3649, -9707, -7029, 2750, 5496, 4247, -13600, -31311, -18220, -299, -2962, -13688, -20687, -10768, -16781, -24544, -24016, -8395, 18760, 31520, 24136, 26605, 24571, 6867, -4261]
8513d261r386j3158J1851J9728k382j4454J97R407L803j650p92Q01j4155O408
8499h043J6296m93j5424m994o43J532R362Q962m217r087j244O384q815q000L938
8484a4486j277L049M182J943R215M409K447m592l486n009m406l040o25R791k198
8469d083q630j996j693N607N809j4138j283J5530J0174k674q08q586r171o974
8455b2916M655N833N14M351q408R494J2267j570l819O423O336j3217k5926q553
8441c4536Q473Q807O806J392O298L014P624j1509o381N698Q971j552r941J216
8427e620o674o456K624M036O953l938L578p337n350j0455K709L888o707N517L95
8412b2837j1708K821O293Q100M598J1924O78k231j2827j3899L886J8184P65j1603
$$ y = [-4261, -13647, -26805, -14954, 4774, 2392, -12062, -11865, -2458, 1345, -305, -1097, -296, -14451, -8043, 8253, 7760, -7664, -12658, -13301, -11769, -2407, 6555, 2338, -6749, -7993, -1609, -10424, -18424, -14486, -15763, -12714, -8532, -6589, 2626, 7035, 9482, 4890, 1404, -3605, -8011, -11051, -11676, -1885, -4083, -12713, -14709, -16402, -10795, -4986, -19124, -20407, -4877, 5297, 2623, 1815, -6771, -15942, -22916, -18261, -12428, -11914, -7563, -15971, -6477, 5790, 4220, 401, 6824, 13160, -57, -25983, -34536, -26063, -17256, -10450, -9058, -2760, 254, 7878, -3631, -10012, -4314, 4657, 3105, -6836, -5620, -12294, -18750, -16126, -12090, -5137, -9075, -5497, -12834, -18184, -28639, -25930, -22042, -28749, -23232, -22837, -34545, -31724, -25431, -17331, -12733, -809, -131, -2362, -15189, -29088, -25202, -7018, -6253, -17856]
8398a7856l687Q626J7555R08P681P032k165k3179j2427Q333L340k060J3975Q910
8384A4986r74N679l784j5993j2980j757N536Q891J2571j8098j6393J1128K154
8371i034l870J1677Q649K76m357r262N782k365j8829J501p33o748K750R179J0862
8356d522J0826j593q532n954O568O365P425n601q851j1481J458Q445k48p202J3719
8341H22P226l43l712l103p454o720N190l623n840J1711J2292P843J565o65M939
8326B0128J0684o180k9044o279P373J2906j1166j0476j1122J454J2379R048J250
8313I55m912N029m992J972j4538k347Q53p320J0157R884M108p68L818K719j4759
8298a0141k151m985n818Q601J2131K762R828J1l101r355l204j0196M793l80k717
$$ y = [-17856, -21543, -12917, 4638, 5546, 13227, 20259, 18094, -5085, -17512, -9179, -5839, -7899, 6076, 14986, 14012, 19691, 15907, -86, -13066, -14823, -9287, -396, 12175, -5923, -22316, -11188, -9034, -12904, -1227, 7422, 7698, 3341, -5921, -139, -2504, -21333, -19832, -20565, -27313, -24563, -15384, -4522, 6304, 4711, -3821, -9775, -3207, 3158, 10583, 4982, -3869, -15350, -13892, -5447, -5695, -12897, 822, 8048, 7705, 3993, 890, -6564, -13284, -8094, -11717, -17557, -5846, 6446, 14289, 15854, 15189, 20128, 30812, 24632, -4412, -10691, -3318, 9588, -1578, -12054, -23176, -21722, -9343, -295, 955, -3957, 1072, -3920, -1948, -16486, -18833, -17980, -25300, -15143, -5259, -1151, -1919, 1899, 4618, -10141, -12292, -17277, -23095, -14494, -2363, 399, 10227, 10238, 7137, -2218, -5422, -15618, -10825, -11205, -13922]
8283a3922M463O421N530q167R00l813j0176J156p512R380O559L383j5607n261
8269b6666R655k903l702J17J0692n721o193J3471N714J2279O327P028m203o305
8255I590L991j2364j8930o597l783O265J0709r964K354R504p371j4025k920J6121
8241a7420P401j012l229o789n972Q583J2425j2529j0024J01Q217K2872L804j5147
8227h719l754j797N074n115O735J1505O60Q712R332m101j473q336p063N745N098
8212A2503O498P987k0395j0064M122n63J658m464N747j484p273m876o295o527
8198b3426L467L962j2015J3443o9l946L979J2930Q194P770q73r551P485J479o217
8183F612n181k2015j82J8469J708j1721k983J0695R646L986j3809j1686Q296K690
$$ y = [-13922, -9459, -3038, 2492, -5675, -4775, -8588, -18764, -17608, -25120, -15740, -9181, -5798, -21405, -26666, -17011, -19914, -23616, -23499, -12807, -18528, -24721, -11250, -5536, 6743, 13070, 20098, 15895, 9590, 13581, 1217, -17713, -24310, -28093, -21828, -11119, -21083, -18729, -9225, -16596, -30621, -33541, -17420, -10019, -11031, -14260, -21049, -27021, -18438, -6013, -18542, -28566, -28465, -20248, 2624, 6428, -8719, -12473, -14270, -9196, -14311, -7576, 3929, 4589, 13301, 22633, 18532, 17059, 8723, 1660, 7405, 12503, 19001, 26988, 6593, -3471, 651, 88, 1746, -2718, 3029, 1545, -5728, -10604, -16899, -23426, -19959, -15997, -28012, -14569, -14638, -18584, -14605, -1675, 6519, 14289, 13416, 3865, 11350, 12829, 6612, 1431, -20584, -20766, -2297, -589, -12310, -15293, -4598, 5048, 9034, -4775, -16461, -8165, -5475]
8169e475P593O461J368Q601m144j5003P262J095q593j191j1115K916J1284l943
8155b884n063O667j4566m207j136m818J5994r697k600p910J224K0701K0209R788
8141B1702o171j2846O90O588L752j54j0067m357R661j347k6135l667J841J0718
8127i792J3837M883J133o329N422R803k443j6969j7688k64r570J2086p348p596
8113c0835N569J1092M99q236o322L706J6358M677J0553o71m015k597q736j0051
8099a9009J0938N781M584J216Q172q684p869n52M189J0030q665j0319P233j4956
8085a7911O09J9317L009j7425j0542J0156Q330R015n516l041M265R278n088j6229
8071a1773p936l458k408P144Q610q84o632R85p425K809J2762J0357n003m084j3261
$$ y = [-5475, 2118, 8579, 9947, 18548, 14404, -599, 6663, 7758, -835, -2026, -13141, -10225, 1059, -2884, -7947, -1280, -15846, -20053, -21189, -26007, -10013, -19710, -22310, -30220, -28996, -8295, 11914, 21702, 15531, 2685, 3375, 9963, 13715, 13561, 3494, -863, 8798, 7451, -18684, -22351, -20510, -9792, 4045, 8928, 10061, 3732, 9154, 18957, 16514, -455, -18143, -18407, -27977, -15891, -23239, -30835, -25266, -14174, -13675, -21911, -28233, -24527, -8169, -3492, 7061, 6390, 2375, -222, -8958, -19009, -8071, -2290, 2294, 3510, 11682, 2998, -4871, -5423, -1234, 8796, 131, -10188, -2955, -17911, -17302, 2015, 5024, -12401, -22943, -12787, -4457, 4558, -958, -3999, 266, 9544, 4456, -11773, -19709, -23167, -25575, -18431, -9821, -10705, -17337, -16352, -23777, -20968, -8206, 2151, -2852, -6936, -20197]
8056b0197j5276M393O282O522R042O096k670L153r774k405O807J774N381P470
8042F598N387j065M065j381m695J625J8826p079N075n203J226J8013N566r701
8028C7257o14q707p719j1937J9296J0153m662J212q130m535m418j7390L30L142
8014C278K22J412p311M633O953O311l680j1369K087k258K355j4463L72J1212J0159
7999I913R807l202J2480Q52j400O23k2636L246J1953J1021O402J2998P773N195
7985F5025j4208k3952j4574j759P796k233N318Q396m633O428J0392K582j4888
7972B9690J12q006m893p204k0664j6939n103R543Q465J657k866n633K3064M144
7958E367L378N275J0339K699l356J911J0454j414j9225m78k718o247k226J1223
$$ y = [-20197, -35473, -31080, -24798, -18276, -9234, -3138, -5808, -2655, -12429, -14834, -8027, -6253, -872, 6598, 11985, 10920, 14985, 13604, 8909, 10534, 29360, 22281, 27356, 22153, 23379, 41392, 46958, 37257, 36643, 27936, 20217, 8280, 27576, 37729, 33067, 34279, 26149, 21614, 17196, -194, 136, 3278, 3500, 4912, -2399, 2234, 9187, 15498, 11818, 449, 2536, 278, 2633, -11830, -11458, -246, 9913, 19720, 16518, 28998, 29850, 28450, 29073, 6437, 9683, 21636, 32657, 39059, 52057, 59830, 65025, 50817, 26865, 12291, 10532, 18328, 16095, 21413, 29809, 25176, 31604, 41996, 44578, 29690, 29802, 21796, 16903, 9699, -10965, -27904, -33007, -23464, -14999, -13342, -16208, -21841, 1223, 5367, 8745, 14020, 24359, 27058, 23702, 25613, 36067, 34653, 15428, 14950, 12232, 5985, 3759, 14982]
7944A4982J5324J3338j0402J391J1979O137n278q523j0073J0089J4770j279j4236
7931C8219o255n471j2314j5613K61R259N0k550k346o401J0912J2135p27r924n712
7916C523N531J15m251j1624J0983O801j887L703K443l439P785p036M200J0360
7902B7207J0068J4606j0274j5623j676R769j3633M316K666j0560j7085M666K405
7889F852n429J6081J35l103M7N12N37j208J547r697l744P33q271j492J4168L014
7873A0682j0715j616M922M38k856p646l420m123J5275o585q457R106J2483r18
7859F570k227P261Q540m360O031P051n811j193l554j2794o025L135q745q50J568
7844e403p282J150o061J7524R257n882J2815L165j1976k066J1527J1179o342n451
$$ y = [14982, 30306, 43644, 33242, 34633, 46612, 52749, 47471, 38948, 28875, 38964, 53734, 52455, 38219, 31964, 26493, 14179, -1434, -1173, 8086, 8136, 5586, 3240, -3161, 7751, 19886, 19159, 9235, 3523, 9054, 9169, 4918, -6706, 4277, 11078, 9191, 12894, 15337, 11898, 19683, 12647, 16847, 27207, 37275, 51881, 41607, 25984, 24308, 34077, 20444, 24760, 27426, 16866, -219, 4447, 6852, 1423, 17504, 17639, 14536, 14583, 15095, 15632, 14424, 15971, 6274, 2530, 3263, -5008, -6500, 7668, 10682, -33, -1649, 3273, 3711, 855, -6791, -10211, -14334, 941, -5644, -14101, -4995, 7488, 6570, 4343, 11604, 20144, 15784, 21815, 28866, 23055, 21862, 18308, 5514, -511, 2624, -6121, -6971, -5403, -12685, -11535, -17596, -72, 9185, 3303, 16118, 19283, 7307, 5241, 16768, 27947, 21605, 16154]
7830A6154n324j9290j157P370J2518l807j91m851j2958n919n12j201K057J2999
7816d112R366m644k312j381k152J5297o230j6066O932J782J717j3044j3714J4288
7802a4273N855Q555Q456j419p13m227n473k2817R06J5894J3256O467J415j1303
7788E79k394m502M569p961N667J1336N405k750J63J237j857m072p810m908P231
7773f7R929p741j4412R922r71l968j0089q550O394O276P124K017n168o865L563
7758a2606j008P634J2024L899L490j7901r678k356k410k992l626P920J7529J5216
7744A5135q932j9169L89J8509J1399k684m817M686P366K51n606o72l666o184j819
7729D186j2479r574L968j955M079J4490J9625m543j4408M521L518N308j0743k1449
$$ y = [16154, 10830, -8460, -9617, -2247, 10271, 6464, 6273, 1422, -11536, -17455, -17967, -19168, -17111, -4112, 5254, 610, -1702, -3083, -5235, 10062, 3832, -12234, -5302, -3520, -1803, -14847, -28561, -14273, -8418, 137, 8593, 7174, 6461, 2234, -3239, -26056, -25150, -9256, 4000, 10467, 11882, 579, -1815, -6317, -1748, -9709, -4042, 7294, 12699, 9949, 10112, 11349, 9492, 5420, -2390, -7298, -67, 9862, 2121, -12291, -2369, -3340, -7308, -17397, -25947, -19553, -13277, -6153, -4136, -9304, -16169, -12606, -13614, -5980, 6044, 9943, 13433, -4468, -14146, -16502, -18912, -21904, -25530, -17610, -81, 15135, 6203, -12966, -12577, 5932, 17331, 14647, 9830, 14516, 21882, 22133, 16527, 15855, 12189, 6005, 4186, -8293, -17867, -13899, -15854, -11775, 2715, 22340, 17797, 3389, 7910, 11428, 16736, 5993, -15456]
7715a5456j525J618j063K1513M797J77k043j1314O358J211k441m771j0286J681
7701a1544J2146n192K468k902j5907k38J4772j0391q462Q189K672J428J2207q978
7687i732J575J3987R199J6799Rk0087k9301J934K718p25r167o85J5011q75m16
7672i756N226Q439M081l385j1540j224j083O043n367q789J2143J3278j1753L050
7658f37P316J2477j1296j4280k486J1854J5878o712j3984K724J4195J0589k285
7645B3353j4637q483j3581K812J0105Q112L768K539p854j0543q70J588m378J1673
7631C604l473l838R831K034L457q333N22q439j0149r447M587J1487J5095J0896
7617A7834j0111J0015l082j4468L251o805M980p847J398R337n528m653j8181K393
$$ y = [-15456, -16981, -15363, -16426, 5087, 9884, 10061, 8018, -3296, 3062, 4273, 1832, -2939, -13225, -11544, 602, -4590, -2122, -5024, -20931, -21169, -6397, -16788, -25250, -17061, -14389, -12961, -754, -9732, -8157, 5830, 15029, 31828, 31837, 11750, -17551, -15617, -12899, -13624, -22791, -23476, -8465, -9340, -9756, -4530, 3909, 7990, 4605, -6935, -8159, -9242, -3199, -8566, -17355, -5212, 8066, -3687, -637, 6679, 19156, 7860, -6420, -8906, 2948, 18826, 12114, -1870, 854, 15049, 25638, 23353, 8716, 233, -13348, -10536, -431, 7681, 11449, 13988, 6134, -4409, -5279, -3691, -8069, 3604, 131, -3707, 6124, 8158, 11615, 3282, 3804, -4635, -14784, -24231, -19644, -8157, 6938, 17834, 7723, 17738, 14656, 188, 3439, -3366, 1614, -6233, -4835, 4502, -1026, -5679, -23860, -21467]
7603b1467O136R052J995J4182L998M575J083J957q172k307k802l532Q254J871
7589A4823K49l966l277q770N847p478l085J323p679O5K505M771J0864R851q097
7574G946P29m753j2964N229r05R248R007n875L513O08k033n604n615m580j3423
7559a9472N645M114m433p42N726L548P400N702P702J4656p379p840P645K024l100
7544B1196j0490o654o205o829q324J1281J2777k61m206r686j5704j79J4123L090
7530f071J029Q094r725J511L630L060N677J19p546j4296o009K990O214p771j294
7515b0388P561L335O189K0606j3470j2722l97p745k093R16N252O176O661J0560
7501A0441n248p043j6471o553j3931N114J1307M049P757Q137j57J2012J2631j1348
$$ y = [-21467, -15331, -6279, -4284, 9898, 13896, 18471, 19554, 21511, 13339, 11032, 8230, 4698, 12952, 14823, 15072, 11106, 7829, -941, 4906, -2572, -5657, -4334, -12013, -11948, -9443, -4672, 6192, 16043, 7946, 8675, 3922, -9042, -3813, -4718, 4530, 13537, 7662, 11175, 11783, 9750, 4146, -1469, -6049, -19472, -13827, -9713, -14146, -14888, -9162, -5614, 1786, 7488, 15190, 29846, 22467, 14627, 22272, 24296, 21196, 10706, 4052, -2153, -8982, -17306, -6025, 6752, 6491, 2285, -7401, -23105, -23284, -9161, -6071, -5042, 3052, -6673, -5162, -1532, 1528, 7205, 7324, -222, -14518, -20527, -17537, -11323, -19094, -20388, -12827, -9492, -3303, 17303, 3833, -8889, -9286, -17031, -19124, -18208, -12956, -6780, -119, 10441, 5193, -1850, -18321, -24874, -38805, -33691, -22384, -18335, -10578, -2441, -2598, 9414, 22045, 10697]
7487A0697J525j525l812q36j0270r405k254J0134Q637k213J64J590p236j56j922
7472f882k78J237j354l374J152m015k569J0064L968o981j0500P437P058j783n176
7457a1996q156l216P38q186J580J7944j353J067O873l066J2750J0254K683j1612
7443F304j2375K665J4603J142p072k2215l012j521L736J3571k68P877J5338j4942
7429C831j5266L329R316p793r004k520Q310K814Q583J187o742j2560l197R700
7415a0012q570j1412N767P729J466J311R852K104n493k284J359J1331m067K296
7401A377p681j5428o596O062J4368L580n003N130J048R196l882j6037j9189M27
7387c2628J6834r777M089m439n32J8931N178j2269m216J929N390J0367N299J3026
$$ y = [10697, 12222, 10697, 6885, 6049, -4221, -13626, -15880, -5746, 2891, 678, 842, 2432, -4804, -4960, -6882, -7160, -5923, -7277, -10651, -9499, -13514, -16083, -6019, -2051, -9032, -19532, -12095, -5037, -6820, -11996, -20152, -23368, -22630, -30816, -29236, -11292, -12645, -11578, -4705, -7771, 4979, 15233, 17916, 6304, -6071, -3406, 11197, 12339, 5267, -16948, -19960, -21481, -17745, -4174, -4442, 3435, 18773, 3831, -11435, -8106, 1210, -6583, -15587, -18107, -9797, -6983, 1600, 2787, -3955, -16515, -19712, -10012, -18582, -29994, -24227, -16498, -15032, -13721, -3869, -1765, -7258, -9542, -8183, 3148, -919, 1377, -6304, -21732, -28328, -22266, -7898, -4318, -9321, -4191, -3143, 6053, 2171, -13866, -33055, -32628, -15794, -25571, -21482, -25921, -26453, -7522, -2344, -14613, -18829, -16900, -11510, -1143, 4156, 17182]
7373A7182o810k4944m205k177k80N067P210J6138N51j144P41k275n442m032J2752
7358H332j867r809j3356N247O528L015J808K699n49j993k920j281J582k477q732
7343a3773r018O09R293R243N059O617N762J331r7l587m159l262Q81o065J1105
7328I939M27p93l353j1732L602P371K217k651P71J2803k040j3224j8779J0141
7314e301J7013J4048j1222k0231N955J1675k076q266K18q051J473L538p883q870
7300a7980J989O393l783p146J9687J1001l367J478o453l08J852l161l221o777
7286i796Q306J362L703J2883K615j4581j3883J565P692q33J214M819K582o442
7272A206j428M67m879q822K878m416j1894l54j923Q652K0856P414q372n173J2855
$$ y = [17182, 10372, -14572, -18777, -20954, -21234, -16167, -8957, 7181, 7732, 6588, 7329, 5054, -388, -4420, 8332, 6465, -3344, -16700, -11453, -4925, -1910, -102, 2597, 2048, 55, -2865, -4146, -2564, -5041, -13773, -22791, -22182, -12889, -3646, 1413, 8030, 13792, 15123, 15026, 11439, 7280, 4018, 4899, -1166, 9939, 10366, 9573, 6220, -5512, -1910, 5461, 7678, 5027, 5798, 18601, 16561, 3337, -15442, -5301, 11712, 25760, 14538, -5693, 262, 11937, 9861, 1595, 1813, -6238, -4765, -1227, -9110, -17980, -15991, -9598, -13381, -20527, -840, 10161, 6794, 8272, 1819, 1511, 3363, 202, -3019, -9796, -1490, -128, 3575, 16458, 19073, 4492, -9391, -7826, -134, -967, 247, 5066, 7648, 1206, -222, 245, -4634, -13456, -10578, -14994, -26888, -27242, -29165, -20513, 343, 7757, -615, -5788, 7067]
7257G067O315O34m535J165j5505j0177J425p227J1730m415l754K051k471N60P928
7242i209M821j1586q444N398Q470n844O813R84J255J8665N874o483J235k423L080
7227A2606k803j0434j1716j515M492R855K850p007K017K19L877j4384q971J0146
7213a0768j3239j024J6875N529J506l619j038r916N441J0049q508j2379l371k13
7199b4675K330l599j015J4255J009m309j362l235j792N33J6871j076m247n216
7185a5528l169L653k935q16J2339o362j1344J900j390O849K945J823q269j244
7171b1548n18K565N969P859O964P859P180K233K189q669j024L494j6016l1633
7157c3096N412O299J1715R204R177l172r680K21o068k06J2518P942Q873M492l248
$$ y = [7067, 13382, 14016, 9481, 10646, -4859, -15036, -13611, -20838, -9108, -13523, -17277, -15226, -17697, -17137, -9209, -4388, -15974, -24418, -19020, -10550, -16394, -9581, -8597, -7342, 11323, 17197, 10714, 11949, 9526, 12606, 9803, -631, -12347, -13862, -9370, 485, 3335, -3672, -1655, -1436, 2441, -11943, -20914, -10768, -24007, -25031, -8156, -2627, -1121, -4740, -5778, -15694, -10253, -204, -8712, -21091, -24462, -24675, -22345, -25944, -26959, -12704, -11695, -16004, -17366, -20601, -22393, -21860, -4989, -6065, -10312, -15528, -18697, -15044, -17979, -18795, -6456, -12818, -24162, -22262, -23652, -16803, -13858, -12035, -20304, -21548, -22066, -19501, -13532, -5673, 1291, 9150, 16330, 18563, 20752, 12083, 11059, 14553, -1463, -33096, -27684, -21385, -9670, -466, 8711, 5539, -4141, -3920, -9988, -10194, 2324, 10266, 19139, 23631, 20383]
7142B0383j1768m856n704n945q520q1J0670o881o657J6096N582j2855l53l159
7128a4048M723P631j0605o364L971j885J9677M397j6413J957R980l185l132q916
7114a2212k494k676J6069O618M4p492K816p387j4046k680k149n465j295K0574
7100a1775J1741N78j5330l493K716J3690N047N400j4146o096J1275N208J411J50
7086F376K221N944L870m108j060P032k595n520o149P954Q860l037j3615M058J4085
7071B4316k243q824j6727m932J992N752M455o957j0760Q41R853J3510L297j2573
7057A000j2208l905j9062J1373R279L118J1437M687L879j6087m635l700J932O38
7043a2254O273L769n252q795L768j230j654L1470K3091q566o872j0863j302j0465
$$ y = [20383, 8615, 3759, -1945, -7890, -16410, -16491, -5821, -12702, -19359, -3263, 2319, -10536, -10889, -14048, -9325, -1694, -12299, -18663, -14692, -16577, 3100, 7497, -8916, -6959, 3021, -164, -3296, -12212, -14706, -17382, -1313, 5305, 5349, -2143, 673, -6714, -20760, -23440, -25589, -31054, -32349, -11775, -34, 544, -14786, -18279, -15563, -1873, 3174, 8574, -5572, -11668, -393, 4815, 6226, 6376, 8597, 14541, 18411, 14303, 13243, 20275, 17680, 12160, 6011, 13965, 22825, 19788, 6173, 10231, 24316, 22073, 13249, -3478, -8410, -6418, -666, 3789, -3168, -13928, -13087, -3234, 10276, 13573, 1000, -11208, -15113, -34175, -22802, -13523, -10405, 1032, 5719, 9598, -6489, -11124, -14824, -12892, -12254, -5981, -2212, -7464, -16259, -12491, -13721, -15375, 16095, 39186, 30620, 23748, 12885, 11583, 1118]
7029A118K228Q682r24j1568n10P475J3431J260r906m676M831j2116j500J591p901
7014h485j1365K381J2124j4563K03m680M148Q765P316J2736O077O645j8603j3026
7000a0327P22R569l22j0113J0532J0928K383L788K196l073n463j503q574j893
6986a150K825r188m021m308Q79k829J2878J3798r26k0380k008K4706K2883j6047
6972A7112k1199k316m320j2270K235P848j5668j6696P14N769M954R253P970J6167
6958d47m132p713q66n804Q589n067o85n94P005M833k016O97M995N693O158q549
6942B097j2316o125l956K2933j999K027J8410n33j7792n67j0147j3491k972J4115
6928a0316R947j3753k493j319P815P713K0769R896j9741j2764P373o454r297Q488
$$ y = [1118, 3346, 12028, 11104, -464, -974, 6501, 19932, 21192, 11286, 6610, 11441, -675, -2175, -584, -8485, -19850, -17469, -5345, -19908, -19705, -24385, -20237, -11472, -4156, 8580, 14657, 21302, 2699, -10327, -9605, -36, -358, -10471, 61, 10989, 13372, 17160, 19356, 16283, 10820, 9317, 743, -1150, 1675, -7513, -11534, -15842, -14963, -17792, -4914, 8884, 7958, -12422, -14430, 10276, 33159, 17112, -4087, -6403, -10723, -22993, -20758, -12910, -28578, -45274, -44560, -38791, -33837, -24584, -16614, -447, -4579, -12292, -13158, -18962, -10373, -15440, -16125, -16719, -9714, -4881, -6897, -6200, -1205, 4488, 10646, 2097, -10219, -16344, -20300, 2633, 634, 2661, 21071, 20538, 2746, 2179, -7968, -21459, -24431, -10316, -369, -14122, -16615, -17934, -10119, -2406, 18363, 28259, 8518, -4246, 3127, -3327, -12624, -4136]
6914d136Q847m74l661L514O187N801P720m650l94p50q250q786j5561k034l687
6899b0314L649P16r46L638k033J003J2782J163j649m291j6897n698n43n397J5544
6884a9273l466j977q30J5033P930j301l952k2934r428P436N902R806J407J285
6870a4362J4944J1502l539r818O727K211j1236j6610j2220m643J3087J9706P027
6857B776R413j0721j3933L089j063l143P053k458J285M944o121J001j644M283
6843e239j744R325j993j6985j3933J7246K0165m414l41j83J132L075m553k924
6829a366J31n195n428m65J883j25Q613J5818j944r849q314N309k039q928k138
6814a4037l689J1036K663K823j762j344P715m981R373Q62n345N950M9K226R612
$$ y = [-4136, 4711, 4237, 576, 4090, 10277, 16078, 23798, 19148, 18754, 18004, 9754, 968, -14593, -16627, -20314, -16665, -15949, -16895, -13257, -15290, -14287, -1505, -342, -1991, -6282, -23179, -28877, -29420, -34817, -19273, -22739, -24716, -25546, -10513, -2583, -3884, -7836, -30770, -40198, -32762, -26860, -17054, -15647, -14362, 582, 12084, 8545, -1273, 5454, 7665, -3571, -20181, -32401, -37044, -23957, -4251, 2776, 12189, 1468, -12465, -9376, -10439, -13582, -6529, -8987, -7702, -2758, -8879, -7878, -9522, -5239, -6983, 2342, 349, -16636, -30569, -13323, 6842, 2428, 2087, 1904, 3036, 6111, 1558, -1366, -1235, -6430, -11858, -12323, -10440, -10565, -1952, 13866, 11922, 2073, -6241, -932, -2971, -11899, -14037, -17726, -6690, -4027, -1204, -2966, -4310, 3405, -1576, 7797, 8659, 3314, 9264, 9313, 11539, 21151]
6799B1151Q15q316p967L142j539o011M577r5M450J53j5475j345p88J039P648J9398
6783B0837J202k1260q579K880o013o5J40m990R96k216j0086Q148J8981r48j2743
6768a3716m712R862j1239o074l571M102O138P62R418O521j114o845J506N696o11
6753c877m731J3673R477k439p463p919j2285J398J7359M851J0344J054M095N960
6739B9497m846k2651p868o495J7406n463o80k926p185p57R459P387n515r599r642
6724a9878j043K851Q93q073J3514P687J3743p165k0728L53K1374p190J84r173
6710a2651k232n348L288R148J0206L772L774J349j282j2265j268P033k359l955
6696b790j5096k245J0344Q161j2230L05O075j031K61N384J4174q710l714k324
$$ y = [21151, 21966, 13650, 5683, 8825, 7286, 1275, 5852, 5757, 10207, 10360, -5115, -6460, -7248, -6209, 1439, 20837, 22039, 779, -7800, -4920, -10933, -10998, -10858, -15848, -14852, -17068, -27154, -19006, -25, -973, -13716, -18428, -8566, -19805, -25879, -29450, -25348, -19210, -18448, -9030, -2509, -3623, -10468, -8962, -3266, -3877, -8608, 5065, 14542, 12103, 4640, -3279, -15564, -14166, 3193, 8044, 18388, 19442, 23537, 29497, 24651, 2000, -5868, -12363, 5043, -420, -1100, -4026, -11211, -11968, -2509, 4878, -637, -10236, -19878, -20921, -18070, -17177, -25250, -11736, -4049, 9694, 2529, -18199, -17846, 3528, -3662, -3478, -12651, -14883, -20231, -16943, -7795, 2411, 6183, 9957, 11306, 10024, -2241, -3509, 3524, 1165, -2790, -17886, -20131, -9787, -1626, -13856, -13551, -7476, -8507, -8246, -2862, 11312, 2602, -1112, -3436]
6682c436k346k935Q413N616M458m891q9j4279l830j356N705J7941M716r863m916
6667a092l487m091m754L741Q625J926N071j1213k3481j535K2378J3798Q56j3152
6653f410Q413R832o753k3422j7313J4529J9025Q482n417o355O127P173k052J298
6639G157J309K559J0225K818l542K874j2076n031R029o325n814j991J643M392
6625G227M472R052q279o259K392l024l670N172R583j384j0532k1110m295L019
6611a7636O396Q076j3277O236J1966J5505l547o490q682j931k16q041Q08J5012
6597D179M071m365j3880r861N550P987m045o194L754P388O485J152Q021k2679
6583a2437r160L083o919L593r544N093K0657O118l414J605J1156p40r022j0346
$$ y = [-3436, -5782, -8717, -304, 5312, 9770, 4879, 4790, -9489, -13319, -14675, -8970, 8971, 13687, 3824, -1092, -4579, -8670, -13424, -9683, -1058, 868, 5939, -5274, -28755, -30290, -7912, 5886, 6742, -6410, 2003, 11835, 5082, -18340, -35653, -21124, -2099, 6383, 966, -5389, 738, 7911, 5859, 7157, 8466, 11025, 21250, 24068, 20526, 23400, 11324, 6293, 15322, 8997, 3183, 1192, 2835, 7227, 11699, 20751, 12472, 6213, 8605, 5581, 1911, 7083, 16666, 15282, 4750, -16360, -20655, -17636, -11240, -3164, -16441, -10205, 1761, 17266, 13719, 7229, -1453, -3384, -3600, -11641, -10833, 4179, 8250, 3885, -9995, -19856, -14306, -6319, -10364, -16558, -12804, -5416, 1069, 2221, 10242, -12437, -21597, -18514, -25433, -21840, -31384, -26291, -5634, 484, -2930, -1325, 9831, 9091, 69, -10277]
6569a0277J022L177l571J0327j062p756M697Q200O687M565L184Q95j632o397j4891
6554b832p880l510J665L375K333J3452K894l689K039N195j1577q964n403O230
6540f672O345P760Q519Q244j7150r286J2124J631p294M189l304j4497j2154K295
6526a9250J1183L614m455o879O365L28L691j06N83j2734O024P511J158r155J3210
6511A088N513N835r85j2915j0604n342M623J2301J1546J779K638j0634M082K634
6497A1559J1217O71j3002n031m390j1633m707Q451Q345O513m000k1586j1048l197
6483c1838L467O959J3404J2164m495O881j0244K853q361j784j1814M590P37j926
6469a9407J2259N765O390O177j1192l26N12q92j0796l177p00M355n087k813M739
$$ y = [-10277, -9255, -6078, -9649, 678, -384, -8140, -3443, 4757, 11444, 16009, 19193, 20088, 18456, 12059, -2832, -10712, -14222, -12557, -9182, -6849, 6603, 9497, 5808, 7847, 13042, 1465, -7499, -12902, -6672, -327, 7433, 15952, 24196, 7046, -2240, 9884, 11515, 4221, 8410, 5106, -9391, -21545, -19250, -8067, -4453, -8908, -15787, -9422, -9094, -5403, -5509, -4926, -17660, -11636, -4125, -2967, -12122, 1088, 6601, 12436, 11451, -1464, -12068, -17410, -12787, -486, 11060, 12839, 15477, 4843, 8925, 11559, 22776, 23447, 10445, 5414, 1024, -10609, -15316, -6865, 1480, 7993, 3993, -17593, -28641, -31838, -28371, -21412, -8008, 4156, -339, 6542, -3702, -849, -9210, -10994, -22808, -18218, -17481, -19407, -7148, -1383, 5007, 11184, -8, -334, 178, -714, -11510, -14687, -15387, -11032, -16119, -18932, -14193]
6454a4193J6783p695j1754K1804j370j5093n120N194R50L206o761j5739Q404J4448
6440f936J612j2110J064J5292O845l075m970n298J059j1880j3560J7104l931j2175
6426c0959l041O097P448J1634j1522j3472J734J6340P839P30o308p718o203k436
6412b9837J6250L540p065K889o975J7273J0879n226l597K1905l268q180O368l658
6398A1298l947n079m466J0264j820j1957j541J396o135R13L428J0801K655RK734
6383H553N974j5119j0811m85n675N005J0008j5554j1506J0J1450J1461k060m929
6369a3678o316n030Q354R639m361N453R694p426j1881N959J0553l265m176j32
6355f613l844n497O34M983M767Q969%J3736P665j0888p130m327L525N942j868
$$ y = [-14193, 2590, -5105, -16859, 4945, 3575, -11518, -16638, -11444, -10494, -7288, -14049, -29788, -21384, -6936, -5324, -17434, -16370, -1078, 5767, 2692, -2278, -7576, -6517, -18397, -31957, -14853, -18784, -30959, -34000, -27903, -20455, -8821, -20343, -33815, -32081, -15741, -7902, -7172, -13480, -21198, -27401, -29837, -13587, -10047, -17112, -14223, -21198, -3925, 6954, 1728, -1869, 20036, 16768, 8588, 14956, 11298, 7351, 2272, -2194, 8070, 6250, -5707, -7248, -5852, -11987, -11074, -7646, 3155, 5810, 5819, 8553, 14527, -592, -11403, -11888, -17563, -12558, -2550, -18104, -29610, -29600, -18150, -6689, -8749, -13678, -19994, -25024, -16670, -7031, -11392, -5939, 3755, -3671, -15552, -9593, 960, -2305, -6481, -6613, -10457, -15954, -15320, -10337, -5570, 3399, 3399, 17135, 24800, 13912, 6782, 2455, 5980, 11922, 10054]
6340A0054N734n082K456k259K329K698q237j1918l230N846j094q562K22Q445j425
6325d023L084P457o616p190o900P595J0675J0243l720r029r735P188q212L158
6311f025o36J531R374j035P006p772m196k370k244k48N995J8301J673j5325l511
6296E18L724L794L32Q37l396n502J277o243n274k02m193n605j3115J4767J8684
6281D03R772q822J0537n241p744N547K433n506N003J404m071j6404J700J011J319
6266h659l656M229M043j3581P1J3613J418K157k54l737p997M009l216k762J800
6251a2522M782P152J9022n833m854N364J3855k37q080n898q112p162m437N49P212
6236H01N958M302j4559n213q766q20R425q058n1q760J10J1375j416j324R605J3627
$$ y = [10054, 15788, 10706, 13162, 10903, 13232, 15930, 7693, -4225, -7455, -1609, -2703, -11265, -11043, -2598, -4023, -939, 6518, -98, -7288, -14188, -6593, 4082, 14325, 10605, 1576, -8159, -971, -9183, -6025, -6661, -5130, 4244, 3209, 10215, 2443, -1753, -4123, -6367, -6615, -620, 17681, 19354, 4029, 518, 4242, 8036, 8368, 9205, 5809, 307, 1584, -4659, -9933, -10135, -14328, -19933, -33048, -18281, 403, 10175, 1353, 11890, 6649, -1095, 4452, 6885, 1379, 6382, 7786, 3715, -12689, -10989, -9978, -8659, -12315, -8086, -4043, -17624, -17553, -3940, -2522, -365, -619, -4356, -12353, -8344, -11560, -14322, -12522, -7740, -588, 18434, 12601, 7747, 13111, 26966, 26729, 18649, 12751, 4639, -2523, -6960, -6411, 801, 6759, 11061, -3498, -8711, -17477, -18297, -8872, -16930, -16981, -25741, -25631, -14256, -15672, -16996, -7391, 6236]
6220F236j993k7802j0476n055J5144J8948j0729q640j3095L070J2700j0022k772
6207c4486M825J4546L453J5313k598q962M187K092N495P156p496m802J3474P619
6193A9816j3378j7293N280J4129L152M654j4194r314o898M38j515j996n538L140
6179a9517O587p30l686l73P896L438J1813N868l20J098j9323r43J0825O82J2992
6164A6307O936k1218n415m279j762l134J5198J2859O647o084j0156j0112j136
6151e349J0969l737j0182l178p868m34J0079J7393j8505l585J4785Q393J2027
6138B0808M213j9182J439O908N689O52q235j5633j5522k76O352J67P335Q506l053
6123A68k0966n173Q600M926O527L037J144J0088Q558m016p888r360l130m079J0624
$$ y = [6236, 4243, -23559, -34035, -39090, -23946, -4998, -15727, -24367, -37462, -34392, -21692, -31714, -34486, -29661, -15115, -11662, 3651, 1053, -7909, -3722, -1630, 3865, 11021, 3525, -1277, 12197, 19816, 6438, -10855, -5575, 8554, 11706, 16360, 2166, -7148, -14046, -13608, -15123, -17119, -22657, -19517, -12930, -13660, -17346, -17719, -9823, -6385, 5428, 11296, 10976, 12074, -7249, -8192, 2633, 3315, 16307, 23243, 2025, -3390, -7669, -9431, -12565, 2633, 15492, 22139, 16055, 5899, -4213, -5349, 5620, 1883, -8299, -11477, -19345, -19779, -9700, 7693, -10812, -14397, 388, 8781, 20808, 25021, 5839, 7278, 14186, 19875, 20527, 12292, -3341, -18863, -19139, -12787, -12620, -5285, 3221, 168, -20798, -25971, -17371, -12445, -5918, -2881, -1737, 8351, 16909, 12893, 5005, -4355, -7485, -11564, -940]
6108i40J2382n336j0408j1226p510Q246P204L392j888M763j922o974M956O318
6094A057j0450L054P357J6358J4625o619j2464q89N07n952J785O499O130L271
6080B4269J88j3727p535n140R025M452q585N489m66N677M0M097L225j2124r237
6065c52J38L227l459m506l996k511j769k407R424J046k757R386q60k030R494J1078
6049A9146L617j3492j2763K8L389j723M119J4722L787J830j3027j2551j0519R066
6035d371O202K605n930m097p76q908q956L903N105P943J2057J110j5428J822N716
6020b003L103j160j0735l726J0045K909m212k199N56p52J1039j00n022J4591r450
6005B884q363K075J1658L238R684q346J256L107J936m141o554o880q29q455r367
$$ y = [-940, 11442, 6106, -4302, -15528, -23038, -14792, -7588, -4196, -6084, -1321, -3243, -10217, -5261, 1057, -9393, -6339, 1018, 17376, 32001, 25382, 12918, 12029, 12536, 6584, 8369, 14868, 20998, 24269, 24457, 10730, 3195, -1945, 7080, 11532, 2947, 8436, 7970, 13647, 13687, 17784, 21009, 8885, -352, -214, 3013, -446, -4952, -8948, -11459, -13228, -15635, -6211, -5165, -7922, 1464, 604, -1426, 8068, 19146, 22763, 9271, -3492, -3464, -75, -1798, 2321, 17043, 20830, 22660, 9633, -2918, -13437, -4371, 1831, 4436, -1494, -5591, -6367, -15275, -24231, -20328, -15223, -7280, 4777, 5887, -9541, -7719, -2003, 1100, -60, -10795, -14521, -4476, -1567, -5779, -7978, -7422, -8174, 2865, 2765, -2257, 12334, 2884, -5479, -3404, 8254, 11492, 21176, 12830, 14086, 17193, 19129, 14988, 8434, 1554, 725, -7730, -17097]
5990a7097O78N361J82Q769k91O347m552r645L111k309j2745M97O331M876N655
5975d832J201J5035O99j5903q632Q041J0288M921k202j3121r478K485j116n12
5961a3126M30J8410Q386l504j2881l618M724O338j5628j1538J8025K3757m171
5948A5604j8151N800L938k578j0389j318J0083J3366o938m142n314P709R97q005
5934F62j2676j0041P244O970M736L689p294K416m473J1181N232k054j7294j1279
5920b2981J5783J4709o718q480r791Q967j465O518O099o242J489o639J1287K535
5906E071p20L730L050O87j208L978P550p284j9171j1242o747J8912M936j0902
5892i360P148Q29j0611Q310M795L285j126l644K918o773j4761L913J488l541J2689
$$ y = [-17097, -16419, -11058, -10876, -2107, -2398, 3949, -603, -10248, -7137, -9446, -22191, -21694, -15363, -10487, -4832, -3631, 11404, 12103, -3800, -12432, -4391, 5897, 10818, 8616, -4505, -13983, -11498, -12614, -13126, -12696, 5714, 14100, 10596, -2285, -5903, -1179, 5159, -10469, -22007, -3982, 19775, 15604, -2547, 3253, 7191, 4613, -5776, -7094, 2989, 16355, 9417, 5275, -39, 7670, 8667, 662, -12014, -22055, -14811, -7841, -3105, 584, -6710, -4294, -8767, 2414, 7646, 5592, -11702, -22981, -7198, 7511, 793, -7687, -17478, -8511, -9976, -3458, 2641, -3601, -2112, -8751, 2536, 5071, 4351, 8081, 11131, 11818, 10610, 14588, 22138, 14854, -4317, -15559, -22306, -3394, 1542, -9360, -2212, -1383, -11994, -3684, 1111, 4396, 3270, -374, 2544, -4229, -18990, -15077, -13589, -17130, -4441]
5877d441K135p856R373MQ06L847L431K784q791M405j278J834k301L17L217r121
5861a635n024q280q33m647O550J7335J343J547R538J466k601R127j578l822j5568
5846B918j4585L492r017m204N836N790N14Q437L927p275J972N32O417N103L76
5831A0233j1038l043L18J3816k110q548N281r25M435r447p268N293Q427P968M974
5816A8366L271m467k2154j336p241q380n164L283J0568J0177K364r674J101P402
5802a884J0668l492Q377k030j1080N861M921l505m496k678j947j586j028r422
5788a3321j3622J5674L14N433J1291r590l21n158j764M31J3254L250J656J298
5774H825j4824m741J1530O888L894N175j3676j2747j881l126p817M49J6148K392
$$ y = [-4441, -2306, -10162, -789, -785, 21, 3868, 7299, 10083, 1292, 5697, 4419, 6253, 3952, 4269, 7486, -1635, -6659, -14939, -15772, -20419, -13869, 3466, 4809, 6356, 15894, 17360, 14759, 23886, 22308, 18486, 2918, -11667, -8175, -17192, -21396, -15560, -9770, -9256, -819, 3108, -4167, -2195, -1663, 4754, 9857, 10233, -805, -3848, -3530, 10286, 8176, -372, 4909, 3984, 8419, -1028, -8296, -3003, 5424, 13392, 18366, 21637, 17170, -4984, -6320, -13561, -21941, -27105, -23822, -13254, -3077, -713, -10387, -9286, -1884, 8784, 5292, 13669, 11639, 559, 6420, 11341, 7836, 3340, 662, -1285, -2871, -3899, -13321, -26943, -11269, -10955, -5522, 5769, -3821, -4142, -9300, -11064, -10633, 2621, 5871, 7527, 8825, -5999, -10740, 790, 7678, 11572, 16747, 3071, -9676, -11557, -14683, -22500, -22051, -5903, -3511]
5760c511j2268k438J9448R783j1908k541j548j1961j9160J1017N628L962J015
5747a4482j407j1879J0236j1972j241J7904j1053p27J1011P722k240J8479r181
5734A170q686j444j3610m737R906L185P846Q916N585n455K370o60o642j749M577
5719E72N709J58p166L962P631k347p869j1628r297J0324J4317P390N553R76N070
5704B3355j198r830k184p35M90O352n118K950k848l389L456K433j790k612r655
5689c23k691l498n107p230O801P941J8226N032j0332k884o248O511J9690K969
5675B8857o077j1543j5987j672N132L035l166J8214K754r013N849O427r156K724
5661A6378N918J1272J0989M868n374j2437r692L33M512L286j3572j159j041j5346
$$ y = [-3511, -15779, -18217, 1231, 11014, -894, -3435, -4983, -16944, -36104, -25087, -19459, -15497, -14482, -15889, -27768, -17532, -29504, -30745, -12841, -23894, -24621, -13610, -5888, -8128, 10351, 1170, -7516, -8960, -22570, -27307, -17401, -14216, -6370, 2546, 8131, 2676, 5046, 4386, -2256, -4005, 572, 6281, 6439, -727, 3235, 10866, 8519, 650, -10978, -20275, -9951, 4366, 11756, 17309, 18285, 23355, 22157, 12327, 10143, 9408, 9898, 16250, 11132, 14082, 11234, 7845, 11301, 13734, 11944, 9332, -323, -3014, -6512, -11619, -18849, -12048, -4107, 14119, 19151, 8819, 5935, -313, 6198, 25888, 28857, 22780, 11237, -4750, -6422, -1290, 1745, -1421, 16793, 19547, 10534, 16383, 22810, 13654, 16378, 22296, 33568, 44557, 49425, 44051, 31614, 21922, 22255, 26767, 30053, 16481, 15322, 14281, -1065]
5647a065n31k769j7367M423Q79Q192Q43J771r19l620J214Q992Q102O643P235r072
5631A2951K356N573o610j8356j2415o19O155P130J2824L740l011l522j0657q770
5617a3231o714r475L052J1929O937J0069P984R409n133K953l592j0115k476O583
5603H180P626j2966j2678r42m409l771N317K166k399Q306j026J536L51j3564r23
5588a9196R792j522k292R333J1767j8K35j4195j52J0787Q517n301l87R992P919
5573B5279p341k543p598k750J919j925M34Q384N435l419j8377m987J2730o790
5559a549n648J5368J9807L304K032j0084j5696j553J1198J316L210j1450j6819
5546f564q80P444N640M42k649j3401l352O034J0083K2456L638n897L53Q826n802
$$ y = [-1065, -1596, -4365, -21732, -17309, -16430, -8238, -7395, -5624, -6543, -10163, -8949, 43, 8145, 14788, 22023, 12951, 15307, 20880, 14270, -4086, -16501, -17120, -10965, -3835, 8989, 12729, 9718, 6196, -4461, -13231, -19945, -29420, -26368, -14439, -7502, 2567, 10551, 19960, 14827, 17780, 14188, 4073, 1597, 8180, 15806, 2840, -9838, -10780, -15189, -18960, -13643, -11477, -13876, -5570, -6596, -5060, -4709, -18273, -19196, -9404, -10926, -13218, -3885, 7882, 7864, 8099, -6096, -6248, 4539, 13056, 7755, 7368, 17360, 25279, 17938, 15395, 7797, 5047, 6966, 5041, 5475, 13859, 19294, 15875, -2502, -7489, 5241, -1549, -7197, 8171, 27978, 31282, 33314, 23230, 7534, 5981, 17179, 18495, 21705, 10255, -6564, -7444, 0, 5640, 6082, 3433, -9968, -13320, -7286, 2797, 25253, 28891, 22994, 23347, 32173, 26371]
5531B6371k2889j1946Q115m725m158K0954r99q549K17j3047k093J220R236M455
5517B162m63q118M471n600l715r093k773L871m695L091O278L83j32O648J2581
5502D896O721l809j0367P11j90N301P411J554K385J359n169l389J453j0557L2
5487a658P782M443l432L74k7736m51R056L102J2439r515j1261K820M671n639r477
5472b4482n471N812Q940K5J5275R004j0526j2871J2025M534j1804J6798J4695
5459B1954K344k1891p815k84j252L963N181k364j649r661o191o083k32Q516M208
5444a1256M28O66j597O876j890P659l58M178k946P155k390K059m019m123J485
5429A927K715n162J0187P127k0103j0891q42J3498P77m207P920k840k2992n695
$$ y = [26371, 3482, -8464, -349, -5074, -9232, 11722, 10723, 2174, 2391, -10656, -12749, -11529, -2293, 2162, 1699, -6419, -1948, -7548, -11263, -20356, -23129, -19258, -23953, -20862, -14584, -14201, -14333, -7685, 4896, 11617, 7808, -2559, -1848, -2038, 3263, 10674, 12228, 14613, 15972, 10803, 7414, 8867, -1690, -1658, 6124, 10567, 7135, 7509, -20227, -20678, -11622, -8520, 3919, -5596, -16857, -14037, -9366, -15005, -24482, -29953, -24141, -15201, -15176, 99, 9103, -1423, -14294, -2269, 2265, -9539, 7259, 21954, 24298, 2407, -5408, -5692, -6944, -2981, 2200, -164, -1813, -11474, -17665, -23748, -23980, -15464, -11256, -10828, -10162, -11759, -4883, -6773, 886, 528, 4706, 1760, 8915, 6525, 8584, 4565, 442, 1927, 4642, -520, 9667, 16794, -3309, -14200, -15042, -1544, -767, -4974, 2946, 106, -22886, -28581]
5415b8581J1203N092K984j834J1652J1599j852N89m094l265J1586J1461m907j4611
5401G022j104m633N710O11l560p660J034N938q280r589J0529N501r491k591R731
5386h32l978N885O650J519j1368l387n688p279O502Q502O338p094q529M948K432
5371e379P3p983o942n076J2762J6644o590N384K81o836n216n08L042K289N439
5356A384M341J4119r931j2384j462m76J6745J3605j1035j8376j2348o9R332J6681
5342A0126j679l611m061J0060j0005p182J3564J0562o719j3699J281J6513r288
5329E862j0585j7459O243N813J3341J0150J0383m465m670q437j442m487L130O767
5315A0144j2377j1711L226k132m45P93J467K013R636j1732J4087M224j2886r097
$$ y = [-28581, -17378, -12286, -9302, -11136, 516, 12115, 10263, 10852, 6758, 3493, 15079, 26540, 21633, 7022, 5918, 1285, 6995, 7606, 4046, -3614, -2580, 3358, -4922, -14511, -3982, 1519, -7972, -10563, -832, -4810, 1075, 7725, 9244, -2124, -5511, -11199, -18478, -11976, -3474, 2864, -4230, -12759, -7811, -5379, -5306, -13289, -20231, -25307, -12545, 4099, -2491, 2893, 3174, -3662, -8878, -9386, -6344, -4055, 1384, 5725, 19844, 9913, -2471, -3933, -4409, 12336, 25941, 14906, -3470, -15818, -15887, -6555, 10126, 8447, 4836, 775, 10835, 830, -6352, 7212, 17774, 11055, -2644, -1363, 15150, 5862, -4723, -22182, -15939, -10126, 3215, 13365, 23748, 19283, 14613, 6176, 4734, 247, 3377, 10144, -2233, -13944, -10718, -12850, -13295, -12502, -11035, -9022, 614, -11118, 2969, 7193, -5693, -14790]
5301a4790K441J5707J3017L754k873p31j0474n540q001L689Q284P815M900N758
5287B2956Q52j6457j3293k37Q565Q854J420j720P95k963J796J0175J082o408M551
5272A9968l217J119n610k986J0265N727j1660k3392j1737O662j3310l848J6711
5259a5308R296L035n922J885R946l218j6864j5738J1580J5494m228R016L820l387
5245e93q912o509L075L47j331J609J8948K263p237O772k49j4585j1748J748R431
5230f971R535K5108M09j803j0040k531j9728J0323J3305n716n15j164n242J599
5216F569m311k078j32j054l986J119K658Q750J6286j2941j2357j3482j603n172
5202b1734l858j263P566J8495Q246N458q618j1288o850m393j322J248K746J9317
$$ y = [-14790, -12349, 3358, 16375, 20129, 17256, 16525, 6051, 511, -7490, -3801, 4483, 12298, 17198, 22956, 23808, 7351, -5942, -6179, 2386, 11240, 12660, 10940, 11735, 8772, 10568, 20743, 21825, 15417, 19968, 16751, 17870, 12260, 9274, 19539, 25266, 13606, -9786, -21523, -14861, -28171, -32019, -15308, -6012, -2977, -8899, -7014, 2932, -286, -17150, -32888, -21308, -5814, -10042, -1026, 2794, -593, -9505, -16014, -12939, -12592, -13923, -12314, 6634, 8897, 1660, 8432, 8183, -6402, -18150, -16402, -6971, 2564, 27672, 28081, 26278, 16238, 13707, -6021, 4302, 17607, 11891, 11376, 10212, 4970, 6569, 2258, 180, 48, -1006, -4992, -3873, -1215, 7535, 23821, 10880, -1477, -14959, -16562, -21734, -25592, -26855, -19289, -794, 7452, 12910, 4292, -6996, -13846, -18239, -19561, -18313, -15567, 3750]
5188C750p8M28Q487L672p95k541j9460j0984K625N043J4173j0994j0286J7220
5174B60R731K196r397q84l476l591N958l610k929O516M393m57j2206l771J9649
5159H382Q520o680j0383m493o679n045p455J0147k701M711R583K973L035k661
5145A254n846N42k727r987N222J682J012J4081n87K507k557l85O356k869j0589
5130b891J1689K167k5697r137J8834J7421K156j2425j4034N228J0039R520q223
5117D647j4146q382o299J5111K0607M568m84N892j3084o998J449K169o354j397
5103b701l469P838N307o359k814k414o399j077M27L255J6657j0215j2790m208
5089a8962Q70o421k664N08L434J0626R892R716R300n862j1826j7497k4008Q498
$$ y = [3750, 3672, 4100, 12587, 16259, 15464, 12923, -6537, -17521, -14896, -9853, 4320, -6674, -16960, 260, 9991, 12187, 2790, 1906, -1570, -5161, 797, -2813, -5742, 774, 5167, 4710, -7496, -11267, 8382, 16902, 10222, -161, -4654, -11333, -16378, -23833, -13686, -16387, -11676, -2093, 880, 3915, 1254, -4592, -4050, -6777, -16764, -11542, -9860, -8848, 5233, 4646, 7153, 4596, 4211, 10567, 7698, -2891, 8798, 10965, -14732, -23869, -5035, 12386, 14542, 2117, -11917, -6689, 3350, 12870, 4647, -9499, -17881, -24180, -9069, 11538, 16106, 15622, 21514, 8430, 1432, 2881, 5050, -1304, -2701, -6170, 1668, 6975, 616, -2198, -4612, -11011, -12088, -11661, -8406, 8251, -1964, -14754, -18962, -18092, -24513, -27177, -26669, -23235, -12609, -2717, 6999, 16299, 10437, -1389, -18886, -42894, -34396]
5075c4396J0569Q596J5479Q733r844j1311K817J439L135M957k432J0043j865J0414
5061A6334L307r503p399k2266m451R668O401N032o320j5817r525K7135J4302L687
5047A0585j5693n667P355r76O255O085j331o318Q072K08J1984k75l224p079r967
5032A4N38P234M157L761K100j3451k1207r413N956P775J1303J2669J2778j246
5018B2968l918q970m155k91J319P257j8999p710J4466J8189n600j6018J997P540
5004H075j232R879J128l719K008j1077j1526Q396J2451K889l337M743R78L727
4990B3383j3717j0112J288O077K2389p117k1935j7690p947p163m397Q474K0726
4977g741R554o073M381M589N261p725m713M566O503o887k0231j463o104L906K1326
$$ y = [-34396, -23827, -15231, 248, 8981, -863, -12174, -9357, -7918, -4783, 174, -2258, 7785, 5920, 16334, 19641, 10138, 2739, -19527, -23978, -14310, -7909, -2877, -9197, -25014, -34539, -7404, 6898, 10585, -5108, -10775, -3420, -4396, 1859, 7944, 6613, 295, 8367, 8575, 20559, 20284, 17060, 9981, 14, 552, 7786, 11943, 15704, 17804, 4353, -16854, -26267, -20311, -12536, -1233, 11436, 24214, 22968, 19050, 10080, 5925, 5634, 6953, 14210, -4789, -12499, 1967, 20156, 14556, -1462, 535, 8075, 6843, 16722, 17850, 14131, 16139, 5062, -6464, 1932, 14383, 17272, 13935, 18678, 19656, 23383, 9666, -446, 842, 6919, 29308, 22191, 256, -17434, -25381, -32544, -36941, -28467, -7741, 1813, -4260, 121, 4710, 9971, 2246, -2467, 2099, 8602, 1715, -18516, -19979, -26083, -22177, -851]
4962h51J3545J669o606J058O015j1607k413p056N68P49R077m472j0513J937O905
4947a995r176O540O146q11O576K209n153m760l247K476n830j1738O892J6543J102
4932E774m593k16L924p685r56j12K65M517J8548P317M802p979j3229l350j695
4917E332j7975L749N910J744P404K859q709l313O421m288n921j616N389M870J248
4902C104p464j0142j880j3973n942P345O739J7225J6926O394j1794j4908j0391
4889a8761R55j336q510L638P887N653p656j3332K298Q229M537J3907N805r013
4875e699N92L145j111J1467K709P39J204j4589j3475J0344R059o073l391p820
4861a2899k348l087Q832K781j2022q046J4261M361j790J1740m301j0478K777J3594
$$ y = [-851, 12694, 14363, 7757, 8815, 14830, 3223, 810, -6246, -5678, -4929, 4148, -324, -10837, -8900, -1995, -11171, -4631, 1515, 704, 7280, 9489, 4336, -424, -3671, -1195, -7025, -18763, -11871, 4672, 5774, 1181, 965, 4889, -2796, -3752, -3864, -3599, 918, 19466, 26783, 31585, 23606, 10377, 7027, 5332, -12643, -8894, -2984, -1240, 6164, 9023, 314, -2999, 3422, -866, -6787, -8403, -3014, 1856, 3104, -4360, -14502, -16382, -30355, -36297, -28952, -22213, -4988, 11938, 18332, 6538, -8370, -18761, -17806, -19142, -27652, -24014, -16127, -10474, -18130, -31462, -29164, -20935, -16398, -2491, 3314, -5699, -5107, -1962, -3073, 8394, 11103, 11842, 13046, -1543, -15018, -4674, 4385, -1688, -5079, -12899, -15247, -18334, -9502, -6721, -18743, -26789, -12528, -8167, -9957, 1783, -2518, -12996, -10219, 3375]
4847C375N217L346m228Q692o052j0459k80l207M449O373j628J3253N934j9671
4833E114k3631N992L4596j1757j5246o803J966Q426P856n53n638o837M876O122
4819D483N708o475p284k12p044L21J160N343n475J934l980J2274J088J7043J262
4804B0146K582l539o093R731J714q159K160q14l643K87q582M493m552n387J3376
4789A3720J1410J0209o872j4240l782j069l386r006N656j0651j4626L368O446
4776a2823N36K4922J1098m501L156n981j6091R67P370R706L0Q127j2251j2673
4762A592K505P143j4368j2848m372J3111l712m824p380R716J0443r475M395R757
4748A683p05j0744r105J1690l615L387J1158p37J0221r719J580P993k19P666l566
$$ y = [3375, 8592, 11938, 7710, 16402, 10350, -109, -389, -3596, 853, 7226, 5598, 18851, 24785, 5114, -18517, -12525, 22071, 10314, -4932, -11735, -9769, -1343, 6513, 5960, 322, -6515, -1639, 4483, 10191, 3716, -3568, -3780, -10824, -10503, -9343, -4000, -9475, -7541, -11521, 753, 1841, 18884, 20146, 22728, 19189, 13096, 22827, 24541, 16382, 18542, 17728, 14085, 14372, 5790, 10283, 5731, 344, 13720, 25130, 35339, 28467, 14227, 10445, 9376, 5990, -3016, 2640, -8011, -22637, -19269, -12823, -12287, 12635, 23733, 19232, 22388, 16407, 316, 1283, 8653, 18359, 18389, 26516, 14265, 1592, 4097, 11240, -3128, -15976, -20348, -7237, -10949, -15773, -23153, -13437, -2994, -12469, -8074, 1683, 978, -9766, -18871, -7181, -10796, -7409, 3749, 3012, 13233, 3514, 5094, 13087, 12868, 20534, 16968]
4733A6968N620P502j5616j0911r530j5938Q329J098m380P01J660J9476J1959j340
4719A5598p980j74q63k269j1123L905J793J1862l28q450J705l404p678k638J1660
4704A616L968m275j373m019p560j797j569J820Q283M272K869k26p899M481J1082
4689I673K521p968j3258j488K3041q30p652j3249j505q017r466O13r82j1695j773
4674d2035L207J4987j471J322J1940N384Q77j524k928o555L691L472J4718J4423
4660A9508L784l267o980p498L440J1466j126j0810O647j589o540N379J041K657
4646A6112J133O8j0952o541J504N936j5949p94J1591N837j215j0970K959o475
4632g756r421J0296J0174K781N920N675N407j4749j0973r797J2589L840j3962
$$ y = [16968, 22588, 30090, 14474, 3563, -5967, -21905, -13576, -12478, -16858, -16157, -14497, 4979, 16938, 15598, 7618, 7444, 6581, 4312, -6811, -2906, -1113, 10749, 10421, 1971, 3676, 272, -7406, -10044, 1616, 5584, 1309, -64, -4083, -11643, -13440, -15009, -13189, -4906, -634, 2235, 2009, -5890, -1409, 9673, 12194, 4226, -9032, -10520, 12521, 11691, 4039, -9210, -10715, -18732, -28198, -27585, -28567, -40262, -42035, -38828, -23841, -25312, -23990, -12050, -6666, -5789, -7313, -10241, -16796, -13105, -9633, 5085, 19508, 23292, 20025, 13045, 5547, 8987, 20453, 19327, 8517, 15164, 13575, 7035, 12414, 13455, 16112, 17245, 17313, 6361, -180, 1324, 7260, -8689, -9483, 2108, 7945, 6730, -4240, -1281, -7756, -17177, -6881, 3293, 6074, 11994, 17669, 23076, 8327, -2646, -12443, 146, 3986, -9976]
4619i976k227j399J374J954J3349M453j3908J680m168KJ2079O586q115l754R372
4604G302J9992r30j2553k293L261p908J593n479o648K2187N670O680r58r165q930
4589A1821j4990q285n062N692J4474J6473J0519j1666k871j2520j3930M996J139
4576d210Q101L409J916J0647j3669j2596J703J68N495o37p522p987J5186Q725
4562H729k638Q4N116O530O524m424o165j0279j2443R514J7836p088j0220L209
4548D285M686n735K124j2837r336P779O311N688q558R062J2881j044j4006K991
4534D291m807p795J036J0172k15j225R439p566L599l571Q430q309j3912R7l315
4519a3651J2366J6665p532j4887l765N012R405k605L481J2373J4716k772l142
$$ y = [-9976, -12203, -13602, -12228, -10274, 3075, 7528, -6380, -4700, -8868, -8866, 3213, 9799, 1684, -2070, 7302, 27294, 26364, 13811, 11518, 14779, 6871, 8464, 2985, -3663, 18524, 24194, 30874, 29916, 20751, 11821, -3169, -11454, -16516, -10824, 3650, 20123, 30642, 18976, 16105, 3585, -10345, -5349, -4210, 3891, 7300, 9216, 19863, 6194, -6402, -4699, -4531, 964, 327, -7195, -15182, 4, 8729, 6091, 6175, 11291, 17821, 24345, 19921, 13756, 3477, -8966, 548, 18384, 11296, 1076, 4285, 8971, 3236, 5360, -7477, -16813, -9034, -2723, 2965, -5593, 3469, 16350, 15306, 1300, 4291, -516, -8311, -7275, 2897, 2682, 1457, 10896, 3330, 6929, 3358, 11788, 3479, -10433, -10336, -13651, -1285, 15380, 7848, -7039, -10804, -5792, 3613, 1008, 4489, 16862, 31578, 28806, 25664]
4506B5664N045m490n905o756j2098M21j538l123R401R501n96l361K240n527j1047
4491b169m035l194N886P419q315R454R882N583r332o327M949J3498p113j4799
4477A387L127P705l724o672j649M739J917Q283l129q697J3361M255j2459r959
4463a515M230j782l36n538j207R073o070M574O23N04Q505N606l788o98n32j258
4447A0391Q526o39o872n881L309p112r172L652J1114J2602P629j0008m331J0321
4433B3529l821j7257l191j322m044R283J5563l529j3134k4515m664J1918R093
4420f091J7728J0177n948l992k3701o688J4694L337L573N410J6724L454m934K761
4406B6504k813j9175q995j998l812P907M172J4807Q152J883j0545p56k0425M89
$$ y = [25664, 30709, 26219, 20314, 13558, 1460, 1881, 343, -2780, 6621, 16122, 15526, 12165, 14405, 8878, -2169, -6204, -9398, -3512, 3907, -4408, 5046, 14928, 20511, 11179, 4852, 9801, 23299, 16186, 1387, 4514, 12219, 8495, 1823, 174, 4913, 6830, 15113, 11984, 3287, 16648, 20903, 8444, -1515, 2715, 933, 597, -4941, -6148, 2925, -3145, 1429, 2052, 2556, 11061, 16667, 12879, 12181, 11649, 10391, 18917, 18278, 11406, 5525, 8834, 1722, -7450, -3798, 7316, 19918, 27547, 17539, 13208, 23529, 19708, 2451, -740, -2062, -6106, 3177, 18740, 15211, 2077, -22438, -27102, -15184, -6091, 11637, 21814, 15866, 11874, -11827, -18515, -3821, -484, 3089, 8499, 25223, 28677, 23743, 26504, 23691, 4516, -4479, -6477, -10289, -2382, 1790, 16597, 24749, 26632, 16087, 15331, -5094, -4605]
4392d605K208j1847n33N767K0094R669j0551j3995j067L584n252k488O1n845j17
4377a4917L585J2295j724J861n273o433j264j079M240q635P501J6226J2597r389
4363I591j8055k599M931O914j9015n627L616P751O746J0145j592j3506P38j921
4349a1883m135P266O165J4389J78n113M137p249q119q02o406O988K421O563R748
4334A4148j6546K110R434r51l289j4413Q108l02M189k562K366J4541O167n966
4320A7034L872R775j5026m659L012j1962j138P544R92j5216n353J501Q107r270
4306a0787K960J0481o492L423R010p077k59l455j042K690M477O855K0112o255
4292B4641j3732j025P625J413K905n288O762l456m705K140j7760O085J3985o300
$$ y = [-4605, -2397, -14244, -14777, -9010, 11084, 20753, 10202, -3793, -4860, -1276, -6528, -9016, -8955, -14800, -14917, -11332, 963, -761, 1100, -4173, -10606, -11870, -12949, -8709, -17344, -9843, 6383, 18980, 9591, -8464, -11063, -6132, 782, -18233, -23860, -20244, -12493, -5747, 4398, 2806, -10700, -9962, -11883, -16018, -8752, -2587, 11802, 11980, 6867, 11004, 3755, -4364, -5166, -11572, -4584, -2163, 4400, 14148, -2398, -288, 9146, 8195, 4906, -9507, -1399, -1701, 2488, -74, 2292, 16833, 23000, 17034, 20906, 30681, 15655, 10996, 14008, 2046, 908, 8452, 9444, -5772, -11125, -9624, -1517, -10787, -7827, 2654, -3838, -415, 8595, 1518, 1259, -2196, -3238, -548, 3929, 10784, 30896, 24641, 10909, 9884, 17509, 18922, 21827, 16539, 23301, 19845, 15140, 17280, -480, 5605, 19590, 13290]
4278A3290j6441L25j714j1529R70l925J4269Q595J0383L564j704p787l754N413
4264I955m384o5J3700J696K643p654j2898r586q558R777J0714j1323j259K284
4250d958J25J1106O293L527o608j0101j102P594J576L746n42O22k9782n694L634
4235b0564M219M725J0290J1272j5161p746R271j1275q878J0235j886m406J2130
4222g774J1728r01N753m325j0629l939L000O268j31p970O041P181J0667r737j3038
4207g806K034J8738J0257j0827j2716M163M514j891q92P188j0459q910O578j5280
4193a5309o76J0963J076r983j1600J0825K2724p444r269j7880k74J5225J3157
4180A535L563j601J956l43j5110n896l186m653q356J2295J501M870J4373o260
$$ y = [13290, -3151, -2826, -4540, -16069, -15099, -19024, -4755, 3840, 14223, 17787, 16083, 8296, 4542, 9955, 5571, 5506, 19206, 20902, 23545, 15891, 2993, -6593, -15151, -5374, 5340, -5983, -7242, -4958, -4833, 6273, 12566, 16093, 9485, -616, -1718, 5876, 7452, 11198, 10656, 11278, -18504, -24198, -20564, -16345, -11620, -1330, 9942, -5219, -12965, -3694, -14969, -23847, -13612, -15498, -19904, -7774, 3954, 3053, 8806, 4481, -6148, -10087, -7087, -819, -950, -8920, -2879, 4302, 14969, 5232, -7806, -5772, 12966, 23223, 12396, -320, 3843, 8357, 6466, 5574, 12762, 2303, -6607, -29, -15309, -15985, -5022, -3946, -13929, -25529, -14704, 8020, 576, -8693, -26573, -26847, -11622, 1535, 5098, 3497, 5453, 5110, -10000, -15896, -19082, -23735, -32091, -19796, -18295, -13425, 948, -5312]
4166e312n5p589J0396J6578o515o400O228K337o293j676m741l360J1485j0404
4152e321p187O638J762q19j828Q632P658J2570O146j5899n829m936q185M085k105
4137d618k885j3734O419J3089P593m440n571j7152l062K8646q776j901L802k110
4123d700N041R81Q886Q179N53j1119k331n691Q852J2121j1446j4240J391N101
4109A578J4340k664k668m918J071k300j800q992m628L241J0481R428R963p947
4095A4185n775L267K560J222j6402j0184O823l622p703K301O059L094J1542o284
4081A083N461j470j1458l017n455L436R637o170j851J3209M785l572o802j731
4067c915K0041J3602m972q022l921j2071L340r125j6615R912L408K309m672p697
$$ y = [-5312, -5367, -12956, -2560, 14018, 7503, 1103, 7331, 9668, 3375, 1699, -3042, -6402, 5083, -5321, -12508, -5870, -4108, -4927, -6755, 1877, 9535, 22105, 28251, 12352, 6523, 1587, -6598, -2513, -4618, -7503, -21237, -14818, -1729, 5864, 1424, -4147, -21299, -24361, 4285, -4491, -6392, -2590, -4700, 341, 1322, 10208, 18387, 18940, 7821, 5490, -201, 8651, 20772, 9326, -4914, -3523, 1578, 15918, 13254, 10586, 5668, 6739, 4439, 2639, -6353, -10981, -7740, 2741, 12169, 22132, 14185, 8410, 11677, 14237, 15459, -943, -11127, -4304, -7926, -15629, -13328, -7269, -4175, 7367, 1083, 6544, 5074, -6384, -9401, -14856, -11420, -1783, -7953, -9804, 3405, 8190, 4618, -2184, -3915, 16126, 29728, 24756, 16734, 12813, 742, 4082, -5043, -21658, -11746, -8338, -6029, -10701, -18398]
4053a8398J252Q631p611J1648J9082Q797j0609n73j4578j2015L601J5261J2729
4040A7217r02j0402j5740p064J4041j57N754N866L369J644J0999M711k0532m179
4026D625O48n900q476j7120k978J2910Q396R292M625j6262j384M581J1865J1125
4012A5947K769M629n174j2062p604R735N329m49J995k021K41j4574r334K968J0594
3997B989k186P780O713jP652o284p211k126q87M015j03M319j2855j0074J5123
3982F864r180p344N130j382J3271q548q960J086R199J0473P0r870q609q398J1386
3967d812P22j610N938R094j0221M874J1648l634n122m611M004R081N033p670p228
3952E486n389o789k567J7452J8898q630k4089o387m746l886K120J311J825L82
$$ y = [-18398, -17146, -8515, -16126, -4478, 14604, 23401, 12792, 12219, -2359, -14374, -10773, 4488, 17217, 16315, 5913, -9827, -16891, -2850, -3007, 2747, 8613, 11982, 13626, 24625, 29336, 8804, 4625, 5273, -627, -9103, -26223, -29201, -16291, -7895, 1397, 6022, -10240, -11624, -7043, 4822, 15947, 18716, 23345, 18171, 6109, -1495, 8240, 13569, 13120, 15115, 13094, 13335, -1239, -10573, -7605, 2989, 803, 8583, 15296, 15295, 22947, 16663, 9452, 7326, 6439, 10454, 10351, 14670, 1815, -8259, 6864, -2316, -9660, -4530, -5912, 7359, -1189, -10149, -9063, 136, 10609, 10679, 809, -7800, -16198, -4812, -4090, -5700, 238, 9332, -889, 3985, 15633, 11999, 6877, 2266, 6270, 15351, 20384, 12714, 5486, 97, -6692, -9259, 8193, 27091, 18461, -5628, -12015, -16761, -20647, -18527, -17216, -15391, -15009]
3938a5009p583M639j923O828J5923K722j2429o31K406J1093N037J1093J0887m812
3924B8241j1293j2921L371M001n990n046J8012l172j0798k45o84m689l993j0722
3910a5928j4971j3368p57J8993m994j037J0657J9349K002R303l081q765K390q792
3896h999r141J8751R89l097p602J0144o124p996L160K893J700J386m408L690k654
3881g308P399j46l068K518l19K669P218Q956J0539p327p073N274K902j2744j0314
3866h24j583K703J043N508j093n090L634M796j712p165J1718R999j2877k002p649
3851e94O113R22j3162l807N834k134m947l370P455R234P174j687j0892r443j199
3836a4503J6448O409m611k0816j4362Q202n826J5003J9921R8K750N430k473r783
$$ y = [-15009, -22592, -17953, -19876, -13048, 2875, 5597, -6832, -7463, -5057, 6036, 11073, 22166, 33053, 28241, 16948, 4027, 7398, 11399, 5409, 363, 18375, 15203, 4405, 4160, 3476, -1213, -5206, -15928, -30899, -44267, -45024, -26031, -31025, -32062, -21405, -2056, -54, 9249, 6168, -2597, -207, -8999, -18140, 611, 1600, -1497, -9099, 1045, -5079, -13075, -9915, -7022, -5322, -3936, -8344, -4654, -7308, 91, -55, -3123, -605, -924, 1745, 8963, 17919, 28458, 21131, 14058, 19332, 22234, 9490, -824, -2407, 296, 1339, 6847, 5754, 664, 4298, 9094, 7382, 217, 11935, 21934, 9057, 7055, -594, 5519, 6441, -6721, -10528, -4694, -6828, -11775, -15145, -7690, 1544, 8718, 7031, -3861, -13304, -14503, 1945, 8354, 3743, -17073, -31435, -23233, -29059, -14056, 5865, 5963, 8713, 14143, 11670, 1887]
3822A887R806N579j473j8899j2741j0598K266J7783l649j817m438J4404J7369
3809A5479q31m379q057K380j279j4016l533J7158L501j0226n502N978o593j531
3795a1451J1100J7988l690n404q369r160K136L769O799l321P827L157P03p584
3781D500N10N587J263j3639k645o433l879N285O475j6381q941O284J1224R314
3767a476Q872m197p113o642p189K0338J1861o436o114n969j3065K404P061k148
3753i813k774J4420K152N142j5157j1937J4847L891J387J7105M759q43P634j558
3739B9255j7371j3005n903O513N454j0923k924o049L213J320p192J9181J4562
3726A6131R727j3157l122K068q201k612N954J2273j093n566J0662J1044o704k704
$$ y = [1887, 11693, 17272, 15799, -3100, -15841, -26439, -24173, -6390, -10039, -11856, -16294, -1890, 15479, 14648, 10269, 2212, 4592, 3313, -10703, -14236, 2922, 6423, -3803, -9305, -3327, -9920, -11451, -351, 17637, 13947, 8543, 174, -8986, -6850, -3081, 3718, 397, 8224, 11381, 12084, 4500, 5010, 10597, 11860, -1779, -4424, -10857, -14736, -9451, -2976, -19357, -28298, -22014, -10790, -1476, 7396, 3199, -3914, -10556, -17745, 2593, 14454, 8018, 1904, -4065, -17130, -14726, -7665, -9813, -12587, 1833, 3985, 9127, -6030, -17967, -3120, 771, 2158, 19263, 24022, 23179, 30813, 29255, 11884, -1121, -7024, -511, 4943, -5980, -8904, -14953, -11740, -10420, -17612, 1569, 16131, 25858, 12701, 9579, 11647, 3446, 834, 6788, 19061, 17968, 12402, 23064, 34108, 27404, 24700]
3712B4700o074N423l048j1343K32J915j5123j2339o00N682l027P000L493J730
3698a379n226J755J2142J4321L609P189j4074j4240j0708j5195Q427N046R272
3685I39p83l178J1845j3783l999N787l906q9J0294J1720o487J3223m839j094R421
3670B5071j2302j2018j29l095l319J912O714j3215Q462J0149n839M789j2707p384
3656a2911P740P07m364j106Q058k111o024L03N788J0251m009p1q848k127k730
3641a1454J3227o97k346r837O767j530q666M082Q148P115L83m779n648J118m203
3626h320p16J2439R625j1940j1424k415j0062J0258K1529J1237K979j0076j8862
3613e748q857l464J5404o12j5979j2116L830Q271M723L271M36N495j961l331O338
$$ y = [24700, 18626, 24049, 21001, 9658, 9890, 11805, -3318, -15657, -16257, -10575, -13602, -6602, -3109, -1379, -6605, -4850, 7292, 21613, 25222, 32411, 18337, 4097, -6611, -21806, -13379, -8333, 939, 156, -3022, 8823, -4960, -8959, -3172, -7078, -7167, 3127, 14847, 8360, 21583, 16744, 15650, 25071, 12769, 751, 622, -2473, -5792, -3880, 2834, -10381, -1919, 8230, 2391, 7180, -5527, -12911, -5171, -4464, -8828, -9934, -1876, -3987, -10011, -9708, -3920, 6331, 2322, 2251, -6597, -8724, -11454, 1773, 1076, -1270, -11107, -4340, -5870, -14536, -10454, -2306, 4809, 5192, 413, -5235, -4117, -8320, -9036, 3403, 13028, 1088, -10336, -12751, -22813, -12555, 8974, 20211, 23190, 13114, -5748, -14605, -18069, -2665, -3277, -19256, -31372, -27542, -19271, -14548, -11277, -10841, -5346, -7307, -10638, -4300]
3598d300N015l218j7991R113L033N747m173M481q41R194M076j2144K790l750o279
3583i247L111J6601R737j424l910n433M513n350q202o09p227j22K463O211J1718
3568A2830L934P79j865k599j7349j051N693O888L460j1108p018p397m61n262m60
3553b0986P835Q810J3658j911L831j0117r623K463K600Q589O679K662n441P564
3539A6613L531j4335n135J2500O813j8040o786J0939L953j1147N990K920j663
3526F153j35J2712R40p684q344j5217J358J7145P810J770K841M702m751j3113
3512F187j2540q81J1485j4642j0314l505J3331J4608N184J100j1539q318J0107
3499B63M405j0764r000r34M089N248k76r59N23M585J1735m087r873l602m278j27
$$ y = [-4300, 715, -2503, -20494, -11381, -8348, -2601, -6774, -2293, -3134, 6060, 10136, -2008, 782, -2968, -9247, -6136, 10465, 20202, 18778, 14868, 9435, 13948, 8598, 396, -213, -7440, -7562, -5099, 1112, 12830, 16764, 17543, 15678, 13079, -4270, -5321, 372, 7260, 10720, -388, -7406, -14803, -15264, -20526, -20986, -13151, -4341, 9317, 7406, 11237, 1120, -8503, -6040, -3440, 5149, 11828, 14490, 9049, 16613, 20144, 5809, 674, 13174, 19987, 1947, -4839, 6100, 10053, -1094, 4896, 7816, 6153, 6018, 18730, 19670, 11986, 3642, -11575, -10217, 6928, 14738, 16508, 19349, 24051, 19300, 6187, -6353, -7234, 4251, -10391, -20705, -24210, -10879, 3729, 8913, 10013, -1526, -9844, 263, 4668, -6096, -15096, -16030, -11941, -6693, -6969, -7928, -7405, -2820, 8915, 4828, -5045, -8647, -12925, -13052]
$$ [...]
##END NTUPLES=NMR SPECTRUM
##END=
