##TITLE=Analysis number 326975
Compound Code km 08380
Project Code adrs
Chemist Name af chempharm
##JCAMPDX= 6.0         $$ Bruker NMR JCAMP-DX V2.0
##DATA TYPE= NMR SPECTRUM
##DATA CLASS= NTUPLES
##ORIGIN= Bruker BioSpin GmbH
##OWNER= nmr
$$ XWIN-NMR		Version 3.5
$$ Mon Mar  5 13:52:23 2007 GMT Standard Time (UT+0h)  MAYBRIDGE\nmr@NMR_250MHZ
##.OBSERVE FREQUENCY= 250.131544655141
##.OBSERVE NUCLEUS= ^1H
##.ACQUISITION MODE= SIMULTANEOUS (DQD)
##.ACQUISITION SCHEME= undefined
##.AVERAGES= 16
##.DIGITISER RES= 18
##SPECTROMETER/DATA SYSTEM= dpx250
##.PULSE SEQUENCE= zg30
##.SOLVENT NAME= DMSO
##.SHIFT REFERENCE= (INTERNAL, DMSO, 0, 16.522)
##AUDIT TRAIL= $$ (NUMBER, WHEN, WHO, WHERE, WHAT)
$$ ##TITLE= Audit trail, XWIN-NMR		Version 3.5
$$ ##JCAMPDX= 5.01
$$ ##ORIGIN= Bruker BioSpin GmbH
$$ ##OWNER= nmr
$$ C:\u/data/dgb/nmr/ADRS/340/pdata/1/auditp.txt
$$ ##AUDIT TRAIL=  $$ (NUMBER, WHEN, WHO, WHERE, WHAT)
(   1,<2007-03-05 13:52:01.34 +000>,<MAYBRIDGE\nmr>,<NMR_250MHZ>,
      <created by zg, POWCHK disabled, PULCHK disabled
       configuration hash MD5:
       49 4B E0 1D 92 C2 6B 37 9F E6 65 BC 52 41 86 1D
       data hash MD5: 64K
       6B 50 D8 38 0E 31 3A 05 CC 8B 3E CE E8 66 6F C5>)
(   2,<2007-03-05 13:52:15.15 +000>,<MAYBRIDGE\nmr>,<NMR_250MHZ>,
      <Start of raw data processing
       ef LB = 0.3 FT_mod = 6 PKNL = 1 SI = 32K 
       data hash MD5: 32K
       D4 A4 DC 4C 13 44 30 2E E7 07 28 EB 68 2A 34 43>)
(   3,<2007-03-05 13:52:16.78 +000>,<MAYBRIDGE\nmr>,<NMR_250MHZ>,
      <apk 
       data hash MD5: 32K
       20 4A 24 49 FF 8C C2 7D 97 15 DA 4F 27 88 6A D7>)
(   4,<2007-03-05 13:52:17.48 +000>,<MAYBRIDGE\nmr>,<NMR_250MHZ>,
      <abs ABSG = 5 
       data hash MD5: 32K
       32 13 4A 84 9A EB 8C D3 E9 7C 7D 0C 3D CF 18 82>)
$$ ##END=
$$ 
$$ hash MD5
$$ 06 FE 27 36 E1 A7 68 58 15 AE 62 6F 24 F1 CB 78
##$RELAX= 
##$RELAX= 
##$RELAX= 
##$RELAX= 
##$RELAX= 
##$RELAX= 
##$RELAX= 
$$ Bruker specific parameters
$$ --------------------------
##$DU= <C:\u>
##$EXPNO= 340
##$NAME= <ADRS>
##$PROCNO= 1
##$TYPE= <nmr>
##$USER= <dgb>
##$AMP= (0..31)
100 100 100 100 100 100 100 100 100 100 100 100 100 100 100 100 100 100 
100 100 100 100 100 100 100 100 100 100 100 100 100 100 
##$AQSEQ= 0
##$AQ_mod= 3
##$AUNM= <au_zg>
##$AUTOPOS= <33 >
##$BF1= 250.13
##$BF2= 250.13
##$BF3= 250.13
##$BF4= 250.13
##$BF5= 500.13
##$BF6= 500.13
##$BF7= 500.13
##$BF8= 500.13
##$BYTORDA= 1
##$CFDGTYP= 0
##$CFRGTYP= 5
##$CHEMSTR= <none>
##$CNST= (0..31)
1 1 145 1 1 1 1 1 1 1 1 1 1 1 1 1 1 1 1 1 1 1 1 1 1 1 1 1 1 1 1 1 
##$CPDPRG= <>
##$CPDPRG1= <>
##$CPDPRG2= <>
##$CPDPRG3= <>
##$CPDPRG4= <mlev>
##$CPDPRG5= <mlev>
##$CPDPRG6= <mlev>
##$CPDPRG7= <mlev>
##$CPDPRG8= <mlev>
##$CPDPRGB= <>
##$CPDPRGT= <>
##$D= (0..31)
0 1 0 0 0 0 0 0 0 0.06 0 0 0 0 0 0 0.0002 0 0 0 0 0 0 0 0 0 0 0 0 0 0 
0 
##$DATE= 1173102720
##$DBL= (0..7)
120 120 120 120 120 120 120 120 
##$DBP= (0..7)
150 150 150 150 150 150 150 150 
##$DBP07= 0
##$DBPNAM0= <>
##$DBPNAM1= <>
##$DBPNAM2= <>
$$ [...]
##$SUBNAM6= <"">
##$SUBNAM7= <"">
##$SUBNAM8= <"">
##$SUBNAM9= <"">
##$SW= 20.6930455092707
##$SWIBOX= (0..15)
0 0 3 0 0 0 0 0 0 0 0 0 0 0 0 0 
##$SW_h= 5175.983436853
##$TD= 65536
##$TD0= 1
##$TE= 295.16
##$TE2= 300
##$TE3= 300
##$TEG= 300
##$TL= (0..7)
0 120 120 120 120 120 120 120 
##$TP= (0..7)
150 150 150 150 150 150 150 150 
##$TP07= 0
##$TPNAME0= <>
##$TPNAME1= <>
##$TPNAME2= <>
##$TPNAME3= <>
##$TPNAME4= <>
##$TPNAME5= <>
##$TPNAME6= <>
##$TPNAME7= <>
##$TPOAL= (0..7)
0.5 0.5 0.5 0.5 0.5 0.5 0.5 0.5 
##$TPOFFS= (0..7)
0 0 0 0 0 0 0 0 
##$TUNHIN= 0
##$TUNHOUT= 0
##$TUNXOUT= 0
##$USERA1= <user>
##$USERA2= <user>
##$USERA3= <user>
##$USERA4= <user>
##$USERA5= <user>
##$V9= 5
##$VALIST= <valist>
##$VCLIST= <CCCCCCCCCCCCCCC>
##$VD= 0
##$VDLIST= <DDDDDDDDDDDDDDD>
##$VPLIST= <PPPPPPPPPPPPPPP>
##$VTLIST= <TTTTTTTTTTTTTTT>
##$WBST= 1024
##$WBSW= 4
##$XGAIN= (0..3)
0 0 0 0 
##$XL= 0
##$YL= 0
##$YMAX_a= 215243
##$YMIN_a= -279201
##$ZGOPTNS= <>
##$ZL1= 120
##$ZL2= 120
##$ZL3= 120
##$ZL4= 120
##$ABSF1= 16.522
##$ABSF2= -4.171173
##$ABSG= 5
##$ABSL= 3
##$ALPHA= 0
##$AQORDER= 0
##$ASSFAC= 0
##$ASSFACI= 0
##$ASSFACX= 0
##$ASSWID= 0
##$AUNMP= <proc_1d>
##$AZFE= 0.1
##$AZFW= 0.1
##$BCFW= 0
##$BC_mod= 0
##$BYTORDP= 0
##$COROFFS= 0
##$CY= 12.5
##$DATMOD= 1
##$DC= 0
##$DFILT= <>
##$DTYPP= 0
##$F1P= 14.0000005364418
##$F2P= -0.99999901652339
##$FCOR= 0.5
##$FTSIZE= 32768
##$FT_mod= 6
##$GAMMA= 0
##$GB= 0
##$INTBC= 1
##$INTSCL= 1
##$ISEN= 128
##$LB= 0.3
##$LEV0= 0
##$LPBIN= 0
##$MAXI= 10000
##$MC2= 0
##$MEAN= 0
##$ME_mod= 0
##$MI= 0
##$NCOEF= 0
##$NC_proc= -4
##$NLEV= 6
##$NOISF1= 0
##$NOISF2= 0
##$NSP= 0
##$NTH_PI= 0
##$NZP= 0
##$OFFSET= 16.522
##$PC= 1
##$PHC0= 213.5178
##$PHC1= 8.55974
##$PH_mod= 1
##$PKNL= yes
##$PPARMOD= 0
##$PSCAL= 4
##$PSIGN= 0
##$REVERSE= no
##$SF= 250.13
##$SI= 32768
##$SIGF1= 0
##$SIGF2= 0
##$SINO= 400
##$SIOLD= 32768
##$SREGLST= <1H.DMSO>
##$SSB= 0
##$STSI= 32768
##$STSR= 0
##$SW_p= 5175.98343685301
##$SYMM= 0
##$S_DEV= 0
##$TDeff= 65536
##$TDoff= 0
##$TI= <Analysis number 999999
Compound Code 99
Book Reference 9
Project Code 9>
##$TILT= no
##$TM1= 0
##$TM2= 0
##$TOPLEV= 0
##$USERP1= <user>
##$USERP2= <user>
##$USERP3= <user>
##$USERP4= <user>
##$USERP5= <user>
##$WDW= 1
##$XDIM= 32768
##$YMAX_p= 404385514
##$YMIN_p= -237370
$$ End of Bruker specific parameters
$$ ---------------------------------
##NTUPLES= NMR SPECTRUM
##VAR_NAME=  FREQUENCY,     SPECTRUM/REAL,   SPECTRUM/IMAG
##SYMBOL=    X,             R,               I
##VAR_TYPE=  INDEPENDENT,   DEPENDENT,       DEPENDENT
##VAR_FORM=  AFFN,          ASDF,            ASDF
##VAR_DIM=   32768,         32768,           32768
##UNITS=     HZ,            ARBITRARY UNITS, ARBITRARY UNITS
##FACTOR=    0.157963299565203, 1,           1
##FIRST=     4132.6476996994, 0,             0
##LAST=      -1043.33573715361, 0,           0
##MIN=       -1043.33573715361, -237370,     0
##MAX=       4132.6476996994, 404385514,     0
$$ Real data points
##PAGE= N=1
##DATA TABLE= (X++(R..R)), XYDATA
$$ [...]
20443a14865R2108K6390M1202k6524q5151n5366O083Q1455k7813l9929N8449m8813
20431i2774M2848j2527L3003R7856P216J3457P8006m808n7302n5774m2517J7413
20419B4097j9387n0174L777j4441j3865M6094L9327r59m9534q660q0852N3077
20407g1500j1284J7258R5248j0609J9633l9977p2023m1920M4964K6090p5778k2529
20395a42427M4558J5148J8724L5058Q0305K471r3100l7358O177K4885k0772J5687
20383e0644K1085L6264p4041M1327P1820K3758P463J7697o3022o5861J5355J6420
20371b379n6879j0814k2438O213J8058K7444K1738K0969J5300L432J0503k6590
20359D557K471L9709Q276m310j4682l2941l9644J1957O9443N5609M1983m5407
$$ y = [-114865, -22757, 3633, 44835, 18311, -66840, -122206, -116123, -34668, -62481, -102410, -43961, -92774, -49926, -62453, -29450, 68406, 75622, 89079, 167085, 162277, 104975, 49201, 6684, 24097, 4710, -45464, -41687, -56128, -69993, -23899, 15428, 14469, -35065, -43725, -124577, -71500, -82784, -65526, 29722, 19113, 38746, -1231, -73254, -115174, -70210, -44120, -119898, -142427, -97869, -82721, -63997, -28939, 51366, 53837, -39263, -76621, -70444, -45559, -66331, -50644, -29559, 6705, -67336, -26009, 45811, 69569, 77032, 94729, 31707, -34154, -18799, -2379, -59258, -70072, -92510, -86297, -68239, -40795, -19057, 1912, 17212, 20644, 31147, 4557, 7028, 46737, 55013, 50703, 36021, 3080, -36564, -24607, 44836, 100445, 142428, 97021]
20347I7021j8992q6739o1253L6317K4111N5523J3182r6189p2466O3143M9597j2718
20335i463L2792p9096j9842Q2535M7459l0014l6405k1861R0255J9762p8072r4146
20323i6096J4164L1139N9056L9932l8471n0636L7168k8111j5521K7504l9838k2076
20311h1786J08715K7418m4321J5972k816K3797n19K6731N4900k5830m8201l8333
20299A5727j6744l7300J8323P3764J1079l0712j8635l3351L5379M4626q1421m1614
20287f0879l978J5043n155j1837L3052P6311M0480n983m9888r848J0371m3849
20275a6160m82J1419n0208j8915K3917L9288K0858q645k8701k4089P0610N239
20263B4131P5822K5429q9389m4736k5469K2956l6203l729K8416L6k7042k1859
$$ y = [97021, 78029, -8710, -69963, -33646, -9535, 45988, 59170, -37019, -109485, -46342, 3255, -9463, 23329, -55767, -75609, 6926, 54385, 24371, -12034, -33895, 56360, 76122, -1950, -96096, -81932, -50793, 8263, 48195, 9724, -40912, -3744, -31855, -47376, -19872, -59710, -81786, 26929, 54347, 10026, 25998, 23182, 46979, 46460, 73191, 128091, 102261, 54060, 15727, -1017, -38317, -19994, 53770, 64849, 34137, 15502, -17849, 17530, 62156, -19265, -60879, -64857, -49814, -54969, -66806, -33754, 42557, 83037, 77054, 27166, 17318, 27689, -16160, -16642, -5223, -55431, -74346, -50429, -11141, 9717, 1072, -27629, -51718, 18892, 24131, 99953, 125382, 35993, -8743, -34212, -11256, -47459, -51188, -22772, -22736, -49778, -71637]
20251g1637Q7891l7678l4609P8792N3829J1545j2268m5274k303k2258p6417n0717
20239a21104K1233l3679k9340M0953O5725K4227M359Q9227K7504n4467k2914k7331
20227a5607N795Q761J2478m8325J9521O6129K9253K9691q3656p0511L6453K3174
20215A3156j7856L670K5217M709q7174l4492q735J0299P6714l018L4475Q0109
20203I7074M3923j099o0834m0158m0437n2612L6509O5766m5307O0534l9026m4111
20191a9778L1304l3545n0196K5290M7532m1341L0068p768n8842O411J21019L6067
20179H6221q8175l1890K3619M02r6212r8806K3862O5442N0664O1615M3411r766
20167C0387o3241J7989R6483j2964o3794p0452J0293J5407o1855L348Q149K1643
$$ y = [-71637, 16254, -21424, -56033, 22759, 76588, 88133, 75865, 30591, 28288, 6030, -70387, -121104, -99871, -133550, -162890, -121937, -56212, -31985, -27626, 61601, 89105, 34638, 11724, -15607, -9812, -1051, 11427, -36898, -17377, 48752, 78005, 107696, 24040, -46471, -10018, 13156, -4700, -1030, 24187, 28896, -58278, -92770, -101505, -91206, -14492, -17510, 16965, 97074, 140997, 139898, 79064, 38906, -1531, -54143, -17634, 48132, 2825, 63359, 24333, -19778, 11526, -22019, -72215, -46925, 607, -40734, -10666, -18434, -77276, -70865, 50154, 86221, -1954, -33844, -10225, -9823, -106035, -204841, -180979, -115537, -64873, -3258, 40153, 30387, -32854, -14865, 81618, 68654, 4860, -65592, -55299, -39892, -101747, -98399, -90250, -68607]
20155f8607n639O0004O7744K7474j487j2857o3225j3817j8699J7422j7447K742
20143b6392M4441j461J1141L0249O2253n3419n5133l8048m7070N0083J9439m2432
20131d6349k629k9087M1241K6882l650L8241j7434l3400o3321m7173L3401M6027
20119e7251P2214k3812M4724O124j1222k4818M759J0704k5104j5757j9380P9775
20107D0956j7288N601J176o215M4042m277j07754q0046K3757Q598J843K2246J3458
20094e3903k5886J4526J2235N3217n406Q952M7502O5662l5494j1536m0884r653
20082A9332R404N8571n7062j02422O0370O1321M409P265P3304J2433j1048k088
20070A33789o0570l5986j8172m9627p727O142L1598M96m175k1398o613o0660k27
$$ y = [-68607, -74246, -14242, 53502, 80976, 79489, 66632, 3407, -10410, -29109, -11687, -29134, -26392, 18049, 16588, 27729, 57978, 120231, 66812, 11679, -26369, -73439, -23356, -3917, -46349, -48978, -78065, -36824, -9942, -13592, 24649, 7215, -26185, -89506, -136679, -103278, -57251, 14963, -8849, 35875, 41999, 30777, 5959, 10718, 21422, -3682, -19439, -38819, 40956, 23668, 29269, 30445, 24230, 68272, 63995, -43759, -123805, -100048, -91450, -89607, -67361, -53903, -79789, -65263, -53028, 189, -5217, 3735, 51237, 116899, 81405, 69869, 28985, 19332, 28736, 87307, 30245, -72177, -11807, 49514, 53923, 61188, 134492, 146925, 135877, 133789, 73219, 37233, 19061, -30566, -38293, -32151, -553, -57, -4232, -25630, -32243, -92903, -93130]
20057i3130L4766K7215r012k2908K4546p7096m5444J23206M2683O6804m5610o9117
20045d3097j2694k7585K5715M2680L7031J8925n7645o3823m92M281m2643P298
20033a12049J9994Q1081L5924K8277K4836l0016m5520n0204k970j9180N962n187
20021f9052q887J1568l3097n6546M7149K9544j2345M1589r93K3691J7945k2497
20009c1931o1350M1479j8835k2612l3435n7585J01949J5713M248j9914m848q192
19997i5313j0257K905P4280Q077m5506p1082m7123l4980K2211O6906N0968k1665
19985a00579p2142j3163k78L2691M5165Q521j1147k4061K5025L8621J1747J4719
19973d4881k8208l1507K8698m706o5735j1796N0379O0771M1071O848J1576j3786
$$ y = [-93130, -58364, -31149, -40161, -63069, -38523, -115619, -161063, -37857, 4826, 71630, 26020, -43097, -55791, -83376, -57661, -14981, 22050, 40975, -16670, -80493, -80985, -76704, -119347, -112049, -92055, -10974, 24950, 53227, 78063, 48047, 2527, -47677, -50647, -69827, -63865, -69052, -77939, -66371, -99468, -156014, -108865, -79321, -91666, -50077, -51070, -27379, -9434, -31931, -93281, -51802, -70637, -93249, -126684, -184269, -82320, -66607, -62359, -82273, -87121, -95313, -105570, -102665, -28385, -20308, -65814, -136896, -184019, -218999, -196788, -129882, -78914, -100579, -172721, -185884, -186162, -153471, -108306, -99785, -110932, -134993, -109968, -71347, -59600, -44881, -73089, -104596, -75898, -80604, -146339, -158135, -107756, -46985, -5914, 934, 12510, -1276]
19961a276n3477n1202l1434J768J276M6046N336Q494P458l3393n6465J3214P3332
19948g0323o4887l4855L3628N6550N1433Q806K6815J1337l6834k117L9089l2998
19936a4356n0334l1442J7150N9956M5724k9411J9993M5427K5335k5299L9512j1671
19924I0584p553M5525K0276n1331j653p4430m2609k1844P8228L7881O63M2386
19912A16123l7974n084M3868M1005j5603m1655m9100l8554m6820J8740k1117K5284
19900a0887O4558m2845n3654Q9361p38N414m7747k3117O54K5344j2414l0066r962
19887d6099N3984j4650P374l0067O037J3977P9904j843l9459n5564J3430J7759
19875D783P9583j5842k7845L9505J8788L142k9032j7909q6207l0026L5127n605
$$ y = [-1276, -54753, -105955, -137389, -135621, -134345, -88299, -82963, -74469, -67011, -100404, -156869, -143655, -70323, -135210, -170065, -136437, -79887, -28454, -19648, 7167, 18504, -18330, -20447, 18642, -14356, -64690, -96132, -78982, -19026, 26698, -2713, 17280, 62707, 88042, 62743, 102255, 90584, 83031, 128556, 148832, 97501, 95848, 21418, -21191, -43035, 35193, 73074, 73737, 116123, 78149, 73065, 116933, 157938, 142335, 100680, 51580, 13026, -33794, -15054, -36171, -10887, 53671, 10826, -42828, 46533, 45795, 51209, 3462, -19655, -19001, 6343, -6071, -36137, -46099, 7885, -6765, 609, -29458, -23421, -9444, 70460, 68617, 29158, -26406, -12976, 4783, 84366, 68524, 40679, 80184, 98972, 102114, 73082, 55173, -31034, -61060, -25933, -31538]
19863c1538j3700n583M0637O1060K6699l457j604j7795j00865j9716Q221L2478
19851b5163j2034l4693l83L0364J0439m3340k2028P1940N2023J5735q3923l5325
19839g6388m4838O0590Q7773k1642l6236J3095M6323K8860M647j2598p3098k9136
19827e2648K5355L9291q738k0566l6672k1702j8496n167K2188J7400J8979l6188
19815g6964l2002O8593O7804L7952J7722K1945m9522L3982q9053n3525J4910J1359
19803b6799M2548J8185J5666M630p3861n924J9025j7744O059j0939O2291M5223
19791G8360k6542n175j6721j1426K6540P381O788L7437k8720l467j4231L192L1214
19778H4630L9953p1005n3765n59O908M7957M8935R716o5208m3079l6085M1522
$$ y = [-31538, -45238, -50821, -10184, 50876, 77575, 74118, 72514, 54719, -46146, -65862, -57641, -25163, -37197, -71890, -72273, -41909, -31470, -74810, -96838, -24898, 27125, 42860, -41063, -76388, -121226, -60636, 27137, 5495, -30741, -17646, 28677, 57537, 62184, 49586, -23512, -52648, -27293, 11998, 3260, -17306, -53978, -75680, -94176, -99343, -77155, -59755, -40776, -76964, -108966, -40373, 27431, 65383, 83105, 105050, 55528, 89510, 457, -53068, -38158, -26799, 15749, 33934, 49600, 54230, -19631, -25555, -6530, -24274, -18215, -29154, 33137, 78360, 51818, 46643, 29922, 18496, 45036, 52417, 59205, 96642, 67922, 64455, 50224, 53416, 84630, 124583, 53578, -187, -746, 6162, 54119, 103054, 112770, 47562, 4483, -31602, 9920]
19766I920M7638r5219m5847M0326J0837K5133k743J6874l6964M115J7663P3126
19754F4859N4383j8649n6908m8722l9244J2914J3527n3951J01103K4864O916r429
19742E1663j0502J347j0498j4437k5305o6635j5662J0260J3567l001m2188J07526
19730c865N3618o6452m8341k7281P155M690n2247o6340Q1296O4002n794M2226
19718a7333K0949J0949q0731L9630M7337M3156q72r5601l5711P697M3880N4740
19706C8090P3763k327p7222o0648P470K3891L8247K2631M5998J8312l60m1713
19694H6132n3315l3744J5095q630M428L5278k7134l0272L0790J192l8831k9185
19682d8196L0090q866J0433m680m9878l447O09k727p072M4236k6544Q3119J6343
$$ y = [9920, 57558, -37661, -83508, -43182, -32345, -7212, -9955, 6919, -30045, -25930, -8267, 64859, 119242, 100593, 43685, -5037, -44281, -31367, -17840, -71791, 29312, 54176, 61092, 51663, 41161, 42508, 32010, 17573, -7732, -74367, -90029, -79769, -66202, -69203, -111391, -3865, 49753, -16699, -65040, -92321, -85166, -80476, -132723, -199063, -117767, -53765, -59559, -17333, 3616, 14565, -66166, -26536, 20801, 63957, 63085, -32516, -68227, -60530, -16650, 38090, 111853, 109526, 32304, -28344, -20874, 3017, 41264, 63895, 109893, 128205, 127845, 86132, 32817, -927, 14168, 5538, 9966, 45244, 18110, -12162, 18628, 19820, -19011, -48196, -18106, -26972, -16539, -21219, -71097, -74544, -73935, -76662, -83734, -39498, -66042, 17077, 33420]
19669C3420J6639L9905k5498q7606n6356N3320J0809j28935p8669L1263M2201
19658a49507O6990R7051l669N88r307j9387J5373k8514L733J9060L4937K4648
19646E1996j3928k5056J0414k6563l6830J6530q31K6465k5950l7069L2166o9228
19634i7884n5726N8041O5784N7104o2729q6133J5075J6963O8615j5806K9122J2782
19622E208j8689N3947P199m9439J7013M6905p5199q5633J6785j6361m0476R260
19610a29480J4365J08450j6468J4075Q792j7566K481M0322N8246J4153j6764r4562
19598a3956j07885N10N2465R3442K8722m4621m6498K0494O8610M0530J9299j8630
19586I2482k8725l4625k1225l2j42940J43M8616M9355J9272O883R73J1081J9571
$$ y = [33420, 50059, 89964, 64466, -23140, -79496, -26176, -15367, -144302, -222971, -191708, -149507, -82517, 14534, 10865, 11453, 2146, -17241, -1868, -30382, -26649, -7589, 27348, 51996, 38068, 13012, 23426, -3137, -39967, -23437, -24268, 2197, -23753, -60822, -28656, -97884, -153610, -95569, -29785, 27319, -35410, -121543, -106468, -89505, -20890, -36696, -7574, 5208, -13481, 40466, 47665, -1774, 15239, 62144, -13055, -98688, -81903, -98264, -138740, -129480, -115115, -6665, -23133, -9058, -266, -17832, -15351, 24971, 83217, 97370, 80606, -13956, -121841, -121331, -68866, 24576, 53298, 8677, -37821, -17327, 51283, 91813, 111112, 92482, 63757, 29132, 7907, 7875, -135065, -134922, -86306, -36951, -17679, -10796, -9823, 1258, 20829]
19573B0829l7033m8828o547O4022Q1183M593m3597R566k6894m6478Q300M3785
19561B2901m5908j8584N5289L5763l6871q453J5060p6558K0495L42j2689K5069
19549b4144k3283J5493M5513k7954j0261q454M0884P989n7292m709J4129K8673
19537c416L4896N9063r097n1281P773N9977o1313n4537k234M356j4808m7849j12297
19524a90767M0507J5313o221l4302N4380N5769q467K1552j9129l6817J6112K7126
19512f4944n323K5779M2024O2158K4149O692o8568m8136m5668R760J5953k4163
19500g0287j8464J901K5525K725K2353K5127M4846j0112o3646O0734Q218p7618
19488d8698l5658l2700k0005m3050L7867O3080P3905P7565j6608j0806K4880n2256
$$ y = [20829, -16204, -65032, -71579, -7557, 73626, 78219, 34622, 44188, 17294, -29184, -20884, 22901, -23007, -41591, 13698, 49461, 12590, 4137, 19197, -57361, -36866, -36524, -49213, -24144, -47427, -31934, 13579, -14375, -24636, -33090, 7794, 15783, -41509, -46218, -32089, -3416, 31480, 90543, 81446, 30165, 37938, 97915, 36602, -17935, -20169, -15813, -30621, -78470, -190767, -150260, -134947, -141168, -175470, -121090, -65321, -73788, -52236, -71365, -108182, -92070, -64944, -70267, -44488, -2464, 59694, 83843, 90535, 21967, -26169, -71837, -62077, -46124, -70287, -88751, -86850, -61325, -58600, -36247, -11120, 33726, 23614, -40032, 20702, 28920, -48698, -84356, -117056, -137061, -180111, -142244, -79164, -5259, 72306, 55698, 44892, 69772, 17516]
19476A7516p2905R48N7026N1891K7414j5364K1999r683j02915k5850L5345L8440
19464B3862L0019k0867l9868n4412o1581J4183P6015N1771m7994k4062Q3225J2457
19452D2748k6688L7278j1403j08264k6561K2472N2936J0888q2617l7212O9885
19441e6538R1441m3892j05034m3034N5881M4811L8423L1022J9223L5899m3265
19430B4937k6152j3370j2557p4656j2766M0193M8428J3273J3715n2851k5460J4022
19418f3244k9272J3909M0910o492j4384L1612j478q732j4690K6970k4273J1822
19406c7342J3165K1237L980q25J4379k2620K1698k2396j639k7736K402n0279L7505
19393d8471M1218k6910J4985J09472n571o2454j7481l1105j7666j5456K732k1473
$$ y = [17516, -55389, -54441, 2585, 54476, 81890, 66526, 88525, 78842, -24073, -49923, -14578, 23862, 53881, 33014, -6854, -61266, -122847, -108664, -32649, 19122, -28872, -52934, 30291, 42748, 16060, 53338, 41935, -66329, -92890, -70418, -17482, -6594, -89211, -126423, -56538, 34903, -8989, -114023, -157057, -101176, -56365, -17942, 13080, 32303, 68202, 24937, -1215, -14585, -27142, -101798, -114564, -74371, -25943, -12670, 1045, -51806, -77266, -63244, -92516, -78607, -37697, -44189, -58573, -26961, -28439, -37171, -51861, -24891, -49164, -37342, -24177, -2940, 1040, 215, 14594, -8026, 13672, -8724, -10363, -38099, -35697, -85976, -48471, -7253, -34163, -19178, 90294, 84723, 22269, 4788, -26317, -43983, -59439, -56707, -78180]
19381g8180j6486j4800K7555O0129M2372m928n9683M567M9663m0352o8647K3846
19369g4944K2093J926K9385J7067J250p3734j4444J8792Q015k36N757M3758M1296
19356B5981L6352L1381j1130l7007o4768J7101K5459J232m0687N309L809J9667
19344A2699l9381n712L7943J01368k1960q8128m0238m4068P671r36j0346j9471
19332a10559K2600O5763N5753J3609k418m8083k9035J4552M8772M6472l4973j01746
19320e9293o3908n886J04967j4989j9945L1360q191J9807J4751L7641K0120L1099
19308H7533r602n3086j9342l6705j9389l1456J0822N714L4698L5394q006r38N0192
19295D5829K1915k4739r3707n3135L5503M9906n966l4552K6064K9269l746O2211
$$ y = [-78180, -94666, -109466, -81911, -21782, 20590, 15662, -44021, -39454, 10209, -30143, -98790, -74944, -52851, -50925, -21540, -4473, -3223, -76957, -91401, -72609, -64594, -64830, -59073, -15315, 25981, 62333, 93714, 82584, 45577, -19191, -2090, 23369, 24601, -16086, -10777, -6968, 12699, -26682, -32394, 5549, 106917, 84957, -3171, -43409, -87477, -79806, -80742, -91088, -110559, -87959, -22196, 33557, 47166, 44748, -3335, -32370, -17818, 30954, 77426, 42453, -59293, -123201, -129087, -24120, -39109, -59054, -27694, -35885, -16078, -1327, 36314, 56434, 87533, 77931, 24845, 5503, -31202, -50591, -82047, -71225, -65511, -30813, 4581, -3425, -4363, 45829, 67744, 43005, -50702, -103837, -68334, -18428, -24394, -58946, -32882, -3613, -7359, 54852]
19283E4852j0772l8093Q2049M150o4069k4768M8873k9781k4187L6229n471j7558
19271A1454L5403N8299L6366o3194p0848N373o8491k2569M3433k7161j83K0690
19259d1428Q9083N9292K6214p3799n6642o66K2846l0646J3561K9786n2713k2827
19247c7939J4353N3127k6097r466J060P6867N0141m3216l1078L0557j2439l8368
19235B7502p7112M931O2504O2650L904k5507Q5282J946l8343j8466N9332O9402
19223B18025O966j8463r8593m2516J1854n502J2153N0433Q311l6266n2196K0083
19211G4289l0386K3866n820k8658O6453J6095L3351l4488l4250m2648j9930j9715
19199a841n1437J3074O1296K3898J8106K3635M910o4818j065O3542n8912R468
$$ y = [54852, 44080, 5987, 88036, 92186, 28117, 3349, 52222, 22441, -1746, 34483, 29012, 11454, 46857, 105156, 141522, 78328, 7480, 12853, -55638, -78207, -34774, -61935, -62118, -41428, 47655, 106947, 133161, 59362, 2720, 2054, 24900, -5746, 7815, 37601, -15112, -37939, -23586, 29541, 3444, -6022, -4962, 71905, 122046, 78830, 47752, 78309, 65870, 27502, -49610, -44679, 17825, 80475, 84379, 58872, 144154, 146100, 107757, 89291, 148623, 218025, 224991, 206528, 107935, 65419, 77273, 71771, 83924, 134357, 142668, 106402, 54206, 74289, 43903, 67769, 61949, 33291, 99744, 115839, 149190, 114702, 80452, 37804, 17874, -1841, -53278, -40204, 21092, 44990, 63096, 86731, 91641, 26823, 25758, 89300, 30388, 39856]
19187C9856M6764K7053k098n268o2042k5655J3960l6490k505K1403P992m756j6232
19174A982L2095Q5385M4105l6834m6028K3823M2624m5500Q370j9448l4857O9733
19162A25450N8678l4541j15346j17418m038M8743l0624M4009M7657K179N5249
19151G9998k4514o725L9559n6290p7438l5981J3965j5367p2488l3087O5563O0657
19139f2148M3443J0095n0262l9169L8878L2558j9845O691P3138j1798k5620J44
19127c895k4716N573j8164m107L3387K8519M9134K3994p6099l3093k6756l7153
19115h3376K8355L480j353K3509K7654M6423m979l1105n5824K4280P6727O960
19103F0751q0001p0203K0254K778o0680K587P7658N0176K3180j3640o4095L0651
$$ y = [39856, 86620, 113673, 111575, 106307, 44265, 18610, 32570, -3920, -6425, 14978, 22970, 18214, 1982, 34077, 119462, 163567, 126733, 80705, 104528, 147152, 101652, 110022, 90574, 55717, 125450, 184128, 149587, 34241, -83177, -87215, -38472, -69096, -25087, 22570, 24749, 79998, 55484, 48759, 88318, 32028, -45410, -81391, -67426, -82793, -155281, -188368, -122805, -62148, -18705, -8610, -58872, -98041, -59163, -26605, -46450, -39759, 33379, 21581, -4039, -3895, -28611, -23038, -41202, -45309, -11922, 16597, 65731, 89725, 13626, -19467, -46223, -83376, -55021, -51541, -52894, -29385, -1731, 44692, 39713, 8608, -47216, -22936, 53791, 60751, -19250, -89453, -69199, -66421, -127101, -124514, -46856, 3320, 26500, 12860, -51235, -20584]
19091b0584R6800o1132j4515J1741j9162n5294J6163N3641K0976k6759p031L0149
19079B4993k34j6942o9024j808O4062J02182k2863J1306k7203p8915R102M6067
19067D0723J638o9550p586J4294J0339M829j9788k2878j3996J1096j1828N4436
19055h271J0841P4320M6044M14o4412o2463p67n6948j6412J2418K8901K6174j2913
19042b3074n0063K9361J4704r803M6183J2886p4829K1726L3760K1668l2598J7977
19030G898k8432l6092K8531M0167o487o3162Q4492N5292r632n1164L2277q298
19018D5390j04562L2095J21097J4998r7643k9785k7963k4195J878N772J6518P0224
19006B3824n477j0107l4970M3308M8283J465n2836l1112J7895K8419J1937n0468
$$ y = [-20584, 76216, 15084, 569, 12310, -6852, -62146, -45983, 7658, 28634, 1875, -5156, 24993, 24759, 7817, -61207, -63015, 1047, 103229, 80366, 91672, 64469, -14446, -5344, 40723, 42361, -27189, -34775, -20481, -10142, -5313, -25101, -47979, -61975, -50879, -62707, -8271, 2570, 76890, 122934, 123348, 58936, -3527, -4294, -61242, -77654, -65236, -36335, -10161, -23074, -73137, -43776, -29072, -38875, 7308, 20194, -54635, -32909, 851, 22519, -10079, 7898, -20534, -56626, -28095, 12072, 5585, -57577, 26915, 82207, 72575, 21411, 53688, 45390, -59172, -27077, 94020, 109018, 11375, -18410, -46373, -70568, -68690, -62918, -46400, 23824, 18347, 8240, -26730, 16578, 64861, 66326, 13490, -17622, 273, 28692, 40629, -9839]
18994i839k8816r781K7041k2205K0351j1094P274l9281K268Q0558L2229L802r1693
18981c9186m5923j8980M5108P3155Q5132k2095p2453k5826j2299J5107P307K7491
18969A6538j6056j8552M2965M2907l0098j4349L3051r2626k3602n274k9058k8976
18957a23130M7656O5637n5096Q388k3632m5364q066j1437l85L9824K9814J9113
18945e6678P0941R44k095j175k2839j10204j01787N7562N7870M996j306O0292
18933d3479P9443j6401o3542l4841J1471M992m1532j7787K3663K8139Q1777p7597
18921f5694m1117N1094L6334K8863K3730k8407k8963j458j1741L4110n2665l4896
18909i0810L799n661K6675L4443R575O3106M0470p9992l8055o1770Q734N663r729
$$ y = [-9839, -38655, -48436, -21395, -43600, -23249, -34343, -27069, -66350, -64082, 16476, 48705, 52507, -39186, -85109, -104089, -58981, 14174, 99306, 77211, 4758, -21068, -33367, -18260, -10953, 16538, 482, -18070, 24895, 67802, 37704, 23355, 56406, -36220, -59822, -65096, -94154, -123130, -75474, -9837, -64933, -56545, -80177, -125541, -133607, -145044, -145429, -105605, -75791, -56678, 14263, 15207, 13112, 11937, -10902, -121106, -222893, -165331, -107461, -102465, -103771, -43479, 35964, 19563, -43979, -78820, -67349, -62357, -103889, -121676, -98013, -69874, 11903, -65694, -106811, -55717, -19383, 9480, 33210, 4803, -24160, -25618, -37359, -3249, -55914, -90810, -87011, -92672, -65997, -31554, -21979, 41127, 81597, 1605, -36450, -98220, -89486, -83823, -93552]
18896i3552j474O7614K6353N221M2363k5007r2626j36544J4705J43152Q3471n7609
18884b3933m3570j8680k4657K387N0310N4676J2926J1074l7550o758M3978K4727
18872D4930m2141r292J9841k0200l3929N5728Q3468k1933j3741m773l5278J0576
18860C3256j3988J9456P9897k7432p818j00583n3964M7329J01100l396l4902l6065
18848B890l9725K1274l3285M358K687k6244N6315J25156l0380q8651N2604J097
18836D8096l2648J2758m139k1869K0931j9209l2103j2242J2736l5976j6657J7135
18824f3187n87K7569L8478r38j313K5210J9170m0711l8048K060p76K6029J0384
18811C340n720p064P692M252K107J4090m1501Q3097K4491n5316l1999k234M8189
$$ y = [-93552, -95026, -27412, -1059, 4162, 46525, 21518, -71108, -207652, -192947, -49795, 33676, -23933, -67503, -86183, -110840, -108453, -58143, -3467, 9459, 20533, -17017, -23775, 20203, 44930, 2789, -6503, 13338, -6862, -40791, 14937, 98405, 76472, 62731, 57958, 22680, 33256, 19268, 38724, 118621, 91189, 83371, -17212, -71176, -23847, 77253, 73857, 38955, 2890, -36835, -15561, -48846, -44488, -41801, -68045, -11730, 113426, 83046, -5605, 46999, 48096, 15448, 28206, 24067, 2198, 23129, 3920, -28183, -40425, -27689, -63665, -80322, -63187, -63774, -36205, 2273, 1335, 22, 25232, 44402, 3691, -34357, -32297, -33073, -7044, 3340, -2380, -9444, -1752, 2500, 4607, 18697, -22804, 60293, 84784, 29468, -2531, -4765, 43424]
18798D3424O199N084l5084o4807k8105k1881M205M1394p697N4133l2070l3639
18786f8844J7348L391P8791P060o7744p309o239r04M1785K6269k2686q0631P6867
18773b846k857l3025O5638k0271o617k5386K464k4101p040k844m6210M246R4880
18760c969M2633q1836L472k3261N8855J6140r136N180o0049j5939L9690N9049
18748C0829K3248o040p0261l8612K4070q483q0224L0705M5835k6588J5408O5052
18736D939J399l0843q403J1557J6767Q0933p9819K1471M9334m0463n1782l9200
18724f4110P2265N0850n2278l4666j0849m5158M5249J01201j0937Q1464O1428
18713A94459k269r9790o4289K0813N4621L8164K0942m1069n3655m0291L6929M8791
$$ y = [43424, 49623, 54707, 19623, -45184, -73289, -95170, -90965, -49571, -57268, -3135, -35205, -68844, -51496, -48105, 30686, 37746, -29998, -37307, -43546, -44450, -2665, 23604, 918, -79713, -2846, -5703, -38728, 26910, 6639, 22, -25364, -22900, -47001, -54041, -56885, -103095, -98849, -3969, 38664, -43172, -39700, -62961, -4106, 12034, 2898, 8078, -51971, -67910, -28220, 30829, 54077, 48037, -22224, -60836, -36766, -45249, -125473, -94768, -48933, -75521, -60113, 4939, 6338, -24505, -32908, -21351, -4584, 76349, -3470, 18001, 67335, 26872, -24910, -64110, 8155, 59005, 6727, -27939, -38788, -83946, -38697, 62504, 51567, 133031, 194459, 192190, 92400, 28111, 48924, 103545, 141709, 162651, 121582, 67927, 27636, 64565, 113356]
18701A13356J4309M5254K4880L1604M5067O61J8300k5105j0867k2088j1239l8177
18689A85955p1452o4897K4386L0083k6106k7859N593L64k8160k075k9234l2122
18677c5524M524k1116O426K6155M0184M5449N2497O8129m3852o6462m2679M587
18665C8318J5632m9893M865O7487M0715k378o6879K8154M3771J1946N269k4277
18653A12730k3143n8522Q250Q7859L7044L7251N5442N2756M4581k2163m0779l1878
18641B59428n8952L1581K6322k306j6097l4961l4201M9184l0904r0272o3418L7508
18629G2912J1905M232n2592K1233m7933o4505M8762J4406L7071p6251J6737K6882
18617A2859J9658n08j8421M7250L3129k4049J6659r794n2635K17Q201j9603P0926
$$ y = [113356, 127665, 172919, 197799, 229403, 274470, 275131, 293431, 268326, 257459, 235371, 224132, 185955, 114503, 49606, 73992, 104075, 77969, 50110, 55703, 56067, 27907, 25832, -3402, -35524, -31000, -52116, -45690, -19535, 20649, 66098, 118595, 186724, 142872, 76410, 33731, 38318, 53950, 4057, 8922, 76409, 117124, 114746, 47867, 76021, 119792, 131738, 137007, 112730, 89587, 31065, 39315, 127174, 164218, 201469, 256911, 309667, 354248, 332085, 291306, 259428, 200476, 232057, 258379, 256073, 239976, 205015, 170814, 219998, 189094, 98822, 35404, 72912, 84817, 89049, 36457, 57690, 9757, -54748, -5986, 8420, 45491, -30760, -14023, 12859, 32517, 32009, 13588, 60838, 93967, 69918, 86577, 76783, 24148, 24365, 32566, 12963, 83889]
18604H3889N9235r282q779p9019k6837l773l965J6773m101M3514O0231k9028m785
18591I4073l6949J4824M208L6926n1919n1359n8889M6477J8880k3177k5831k9845
18579f2581r036M2757n8966n6341Q9492O8635k7119j7863N3332R8668j9903n4309
18567D6766m5711l4517K6287l8824p8796n5589J1957Q1492N5573J4364M0084k1898
18555A188J4160m290P179r588N4157K2601n3253o5988j2571j6416r931L9449M3068
18542I765K8294J3536j508j02731m3260J673K8934P1962l1189k5615j0212j1773
18530g2124Q0305N0913l5659J748m8151J0474R862j3761n6187m52J9533K3107
18518c0392k9779l9288r400P5748L5764o6696o027L9568L1738m4838K5221N3895
$$ y = [83889, 143124, 133842, 125063, 46044, 19207, 15434, 11469, 28242, 24141, 67655, 127886, 98858, 94073, 57124, 71948, 76156, 113082, 61163, 9804, -49085, -2608, 16272, -6905, -32736, -62581, -71617, -28860, -87826, -144167, -54675, 13960, -13159, -31022, 22310, 120978, 101075, 46766, 1055, -33462, -7175, -45999, -124795, -180384, -168427, -86935, -31362, -16998, 23086, 1188, 15348, 11058, 18237, 8649, 62806, 85407, 32154, -33834, -46405, -62821, -72752, -33303, 9765, 38059, 51595, 50087, -52644, -95904, -94231, -65297, 6665, -24524, -50139, -60351, -72124, 8181, 59094, 23435, 25183, -22968, -12494, -2632, -16393, -72580, -73032, -53499, -30392, -60171, -99459, -108859, -33111, 2653, -64043, -70070, -30502, 1236, -43602, -18381, 35514]
18506C5514M7295J8095r9009k1975N0066J1790J3630J5621m4203j5139N7666P5046
18494A44397M6337P094m7530o6837n8824p4578j598o69K8203J4064m0610J6385
18482c4166L3262K4124L9862l2726l9624l2340J9913o977K1509j3150l4500j3487
18470f8300J7664M2547L4970k1524j7473l0351l953j3084N6584M4205l855J9178
18458E6608m7541q5518K9906m274J8059L0025l7511R301M0345K7868L8762o762
18446F9268m5461j8466o031j0487l5152k252J0542n2642j2895N6425K2775o6771
18434i1147L2428J8451P3303M5066K9382L2990L6791m5705m7337n0866l6532K3482
18422B0306p91K916J7071J7650N8582K150q2193o2385J6231o5636J6620M6818
$$ y = [35514, 82809, 100904, 1895, -20080, 29986, 41776, 55406, 71027, 26824, 11685, 69351, 144397, 190734, 197828, 150298, 83461, 24637, -49941, -51539, -52208, -24005, -9941, -50551, -34166, -904, 23220, 63082, 30356, -9268, -41608, -21695, -28672, -7163, -20313, -54813, -68300, -50636, -8089, 26881, 5357, -12116, -42467, -46420, -59504, -2920, 41285, 37430, 56608, 9067, -76451, -46545, -50819, -32760, -2735, -40246, -30945, 9400, 37268, 76030, 69268, 23807, 5341, -690, -11177, -46329, -48581, -38039, -90681, -103576, -47151, -24376, -91147, -58719, -40268, 33035, 78101, 107483, 140473, 177264, 131559, 84222, 33356, -3176, 20306, 19515, 22431, 39502, 57152, 115734, 117884, 35691, -26694, -10463, -76099, -59479, -12661]
18410a2661J5200N6480K6041n1349o1800P563M4214k4214l2479M1323l501J9858
18398B4675J4880L2708O431l8240k8146l4982O347N9703P3917l0658k8939o5540
18386g844j4253N836M2852K778J210k1537J9059l3453O120j8039k3487P900O2108
18373B9250O0437J0821k3125l7183k0775k684o0505o880M4250N9015J0344o0175
18361B790J6366m388K9636M0654M5548M7466k3110r5040R04L0831J6585p9981
18349B8261p2242J6524K0849M4272L0544L2362J8342l7272m5352n4699M0151J08733
18337A30473j1303J2218P789l3653k8503K949r403N479O0744M4876j1999n3665
18325A16002K533l4185j06574j793M2486J3407Q198P6097m3233m3566Q3816L4384
$$ y = [-12661, 2539, 59019, 85060, 33711, -28089, -20526, 23688, -526, -33005, 8318, 4817, 24675, 39555, 72263, 78694, 40454, 12308, -22674, -16327, 43376, 117293, 86635, 57696, -7844, -22097, -16261, 26591, 29369, 30579, 9042, 28101, -5352, 768, -17271, -40758, -32858, 29250, 89687, 100508, 77383, 40200, 19425, 16741, -43764, -50644, -6394, 52621, 62965, 2790, 19156, 14768, 44404, 85058, 130606, 178072, 154962, 59922, 60826, 91657, 108242, 28261, -43981, -27457, -6608, 37664, 68208, 100570, 118912, 81640, 36288, -18411, 21740, 130473, 119170, 131388, 139177, 105524, 77021, 79970, 70567, 76046, 136790, 181666, 169667, 116002, 118535, 84350, -22224, -24017, 18469, 31876, 40074, 116171, 72938, 29372, 113188, 147572]
18313A47572l8516o1845M065N8999L8834O9714l5109k5812J5156n5341Q191K1637
18301A47545M882k1902l6754L1265J19057r698K033l0233p5190K3301L0587q298
18289A76595L9705K2146j7939n0851j8234P0797N3813J3980l941j2970p6333n5801
18277A40967n1960K2873O6197j7522k9852L9079n2784n0048N67N9601K2446k0990
18265A28574k3111k189m953k8105J09390K8287O8533o667o5684L7179P0977o198
18253C06033r6787j1814l4632L6097M0773L9394M4371J4218M3690k2281k1514
18242C37548K5230o8435l6951K9240p42L8703L2714l5697j0613m2193n042K5376
18230B89138K5644K6780Q4176K0608M7986L9109j7589Q973o168k8957L484L2957
$$ y = [147572, 109056, 47211, 51276, 110275, 149109, 218823, 183714, 157902, 173058, 117717, 125908, 147545, 152427, 130525, 93771, 125036, 244093, 234395, 236428, 206195, 131005, 154306, 184893, 176595, 216300, 238446, 220507, 169656, 151422, 222219, 276032, 290012, 286071, 273101, 196768, 140967, 89007, 111880, 178077, 160555, 130703, 169782, 116998, 66950, 67517, 127118, 149564, 128574, 105463, 103274, 98321, 70216, 179606, 207893, 276426, 269759, 204075, 241254, 312231, 306033, 209246, 197432, 162800, 198897, 239670, 279064, 323435, 337653, 381343, 359062, 337548, 362778, 294343, 257392, 286632, 285890, 324593, 357307, 321610, 310997, 268804, 263762, 289138, 314782, 341562, 425738, 446346, 494332, 533441, 515852, 524825, 518657, 489700, 493184, 526141]
18218E26141O8000R6511J16881J27043J20498R9156J16294L3152l1868K1493Q5447
18207A378748J31300L7822Q7588Q0522J80838J81447J94022L16796N36455P88948
18197C914486J168415J661568K383471L248917M094819M763483N065702N396101
18189C1696962O150068O998471O484402L732646L03959o84993j32464j167362
18181E3381689m618721p274738p103410n493146m552646m457753m349727l678041
18173A1853507k661207j858456j350781r02695n84844m50945k68061r6050N5901
18164C736369O4412J33279J31929n4502j88044j93589p8067R7232J43863J31391
18154C924273Q3459J5755p0614j66726q4986J37549M37646N99651Q70551J385723
$$ y = [526141, 594141, 690652, 807533, 934576, 1055074, 1154230, 1270524, 1303676, 1271808, 1293301, 1378748, 1510048, 1547870, 1635458, 1715980, 1896818, 2078265, 2272287, 2589083, 3125538, 3914486, 5082901, 6744469, 9127940, 12376857, 16471676, 21235159, 26300861, 31696962, 37847030, 44845501, 51329903, 55062549, 55366508, 54681515, 54549051, 53381689, 48762968, 41488230, 34384820, 28891674, 24339028, 19881275, 15531548, 11853507, 9192300, 7333844, 5983063, 5080368, 4495524, 4044579, 3776518, 3680468, 3736369, 3800781, 3934060, 4065989, 4011487, 3823443, 3629854, 3551787, 3649019, 3792882, 3924273, 4007732, 4023487, 3952873, 3786147, 3701161, 3838710, 4276356, 4876007, 5746558, 7132281]
18144G132281K069541K950375M090056N135518N872649O175981O544858P731924
18136D7703183Q708601P570535L702497j77708o23293L4040j945575o552171r276089
18127D9144020q418996o496530n626275n561128n288845m327934l228842k214537
18119G980933j507439j101047q05158n89205l99891l60553l11480k62052j93174
18110B450934k18331j84803j72123j32099j23723j47180j41281j24662j82145
18101A024587j77263j20720p7753n5534n3820p3731k7808k3392m8467l0898L3975
18090C69176L1434N9310M6988n7878j45790o9914L452R586J6093L7629p3203k4016
18078B02867R2683J12078N845Q8284O8219J430M9357L2354k7450q645j5507j480
$$ y = [7132281, 9201822, 12152197, 16242253, 21377771, 27250420, 33426401, 39971259, 47703183, 56411784, 63982319, 67684816, 67507108, 66883815, 66917855, 64972280, 58420109, 49144020, 40725024, 34228494, 28602219, 23041091, 17752246, 13424312, 10195470, 7980933, 6473494, 5372447, 4567289, 3978084, 3578193, 3217640, 2906160, 2644108, 2450934, 2232603, 2047800, 1875677, 1743578, 1619855, 1472675, 1331394, 1206732, 1024587, 847324, 726604, 648851, 593317, 539497, 465766, 437958, 414566, 366099, 335201, 369176, 400610, 459920, 506908, 449030, 303240, 233326, 236778, 246364, 262457, 300086, 226883, 202867, 295550, 407628, 413473, 501757, 569976, 571406, 620763, 653117, 625667, 617022, 601515, 600035]
18066F00035q886m6339o6338K2604K8556N3014M9404M470m4702q704j175J0783
18054E92722j6781o1203p4212j27439q1078j7128l1379n9719j0524r897q5807
18043A7555O599Q3265M9121m4320m3864l1957k0813O2238M7911l8493n6888q62
18031B9492l1085j632O0587K0259j6206j5423j4846J3324L5756L5754q457n521
18019A02002p446k0249m296M3964M835R612P664p1445o57l62m537J4232Q1735
18006A55052N4746j6541l4658k8420p3004k5681j2149K1341N6881l314J4130l8024
17994G0359N9761l6363n6322o8243M4428R0006J9262l0681k7160K2791R52j1644
17982G7146K3212l2142n7371P056J7946J4800O6424N114o3186o1107K5552J3214
$$ y = [600035, 591149, 544810, 478472, 501076, 529632, 582646, 632050, 636520, 591818, 583114, 581939, 592722, 575941, 514738, 440526, 313087, 232009, 214881, 183502, 123783, 113259, 103362, 17555, 24154, 107419, 156540, 112220, 68356, 36399, 15586, 77824, 125735, 87242, 30354, 29492, -1593, -3225, 57362, 77621, 61415, 45992, 31146, 44470, 80226, 115980, 107523, 102002, 94556, 74307, 70011, 113975, 118810, 128422, 136086, 64641, 63984, 63622, 59085, 73317, 155052, 209798, 193257, 158599, 130179, 57175, 31494, 19345, 40686, 97567, 94253, 108383, 70359, 130120, 93757, 37435, -30808, 13620, 103626, 122888, 92207, 65047, 87838, 88790, 77146, 100358, 68216, 10845, 17901, 35847, 50647, 117071, 122185, 58999, -2108, 23444, 36658]
17970C6658j3819l9070L2579J1868l8908j201j9525m545J1789K0506m883J8207
17958I656j4595L1555j5288l3906L0260j325j146p908L9925j7267L8478K4358
17946H2797k0675K5272M8301l4588K1395k4490n166L5497k8317j14060l6818M8242
17934b610Q8711O7145j7862j5865k7239m6740l1666p54M804K6029K3713j7648
17922E0018K321R397L735j3948Q5067n0800O103L9042m4873r773j4012k5284o4892
17909b7899N392k9623o0672J0356Q7044M6328L2913m9224K2088M5529M7540K7165
17897A56937m274k2497m3158M3730L0477j4659j7520J5570j0021J9249j1381p642
17885A34811m8050K0275N9314n700l734L6577J0425j1333J2405m8231L4567p0958
$$ y = [36658, 22839, -16231, 16348, 28216, -10692, -11893, -31418, -35963, -24174, -3668, -8551, 9656, -4939, 26616, 11328, -22578, 7682, 6357, 5211, -2697, 37228, 19961, 58439, 82797, 62122, 87394, 135695, 101107, 122502, 98012, 92846, 128343, 100026, -14034, -50852, -2610, 86101, 153246, 135384, 119519, 92280, 45540, 13874, 13120, 17924, 43953, 67666, 50018, 52339, 61736, 65471, 51523, 136590, 85790, 91893, 130935, 86062, 76289, 62277, 36993, -27899, -22507, -52130, -112802, -102446, -15402, 30926, 63839, 14615, 36703, 82232, 129772, 156937, 152663, 130166, 87008, 130738, 161215, 146556, 129036, 144606, 134585, 153834, 142453, 134811, 86761, 107036, 166350, 160650, 156916, 193493, 203918, 192585, 204990, 156759, 191326, 120368]
17873A20368J2502J8363n0898k5029L6631M625O9725J4019q2942r6480m2560J0052
17861a1624P9182r267j6758j1268n9977O2933M9116M3332M9640M3228L3554q6697
17849A65394n9951q5438P377k4798m7297l5020Q516N2142l1841J0483O2652Q2767
17837A04986N4661J8776n1413J3515O8590J8572k0676l7573m2294J647L7497M1708
17825B07996Q0162M881j1802q7913p6260O3369J27873R3718l5849k5394N0802
17814C91583o150K0399l7122n3008m7894p7193o5609l2162M9080O4396k7215K2555
17802B01660R605j9247j5351o352m1208L8157P5258L7218k288J2426o4525l2369
17790A92984n3480k6002j3157l441N8932n740n2528m921J06205o5621p3435j00440
$$ y = [120368, 132870, 151233, 100335, 75306, 111937, 116562, 186287, 200306, 117364, 20884, -21676, -11624, 67558, 58291, 41533, 30265, -29712, 33221, 82337, 125669, 175309, 218537, 252091, 165394, 105443, 20005, 27382, 2584, -44713, -79733, -71217, -19075, -50916, -40433, 22219, 104986, 159647, 178423, 127010, 140525, 209115, 227687, 207011, 169438, 127144, 128791, 166288, 207996, 288158, 293039, 281237, 193324, 117064, 180433, 308306, 402024, 366175, 340781, 391583, 385433, 405832, 368710, 315702, 267808, 190615, 125006, 92844, 141924, 206320, 179105, 201660, 211265, 192018, 176667, 170315, 129107, 167264, 242522, 279740, 277452, 289878, 225353, 192984, 139504, 113502, 100345, 96904, 155836, 150096, 97568, 92647, 198852, 133231, 59796, -40644]
17778d0644R358L5366L5250M9267m5778j9385O1983L5066R940l4468p53n4677
17766D0525J4356J3353N7606M4760m241Q187j5607k6850l0604m3614J5786J6498
17754I0155N0493J06281P8659K6478o5561r5604J06035J14375K313l0597p4479
17743C08548l0743j6039Q557K172J5891n5069k5630L7999K6451O9748K2685K2504
17731C87074N8895M8540L9151M956n1862K9845J6664K9248O9350K0986M2410M9104
17719G44361O6974J06264J13510O0539p9139j8768N9705P5821N0478J9962J52194
17708A351901J93479K26304J44838J73514K46332J90723K26473L46006M91546
17699C591116P62165J047119J596243K572966M132487O113152Q524317J0276419
$$ y = [-40644, -31286, 4080, 39330, 88597, 42819, 23434, 85417, 120483, 130423, 95955, 95202, 40525, 54881, 68234, 125840, 170600, 166359, 174546, 158939, 132089, 101485, 57871, 73657, 90155, 140648, 246929, 325588, 352066, 286505, 190901, 296936, 411311, 413624, 383027, 308548, 277805, 261766, 270323, 272495, 288386, 233317, 207687, 245686, 272137, 341885, 364570, 387074, 445969, 494509, 533660, 538616, 486754, 516599, 533263, 562511, 631861, 652847, 695257, 744361, 811335, 917599, 1031109, 1091648, 1012509, 993741, 1053446, 1129267, 1179745, 1199707, 1351901, 1545380, 1771684, 1916522, 2090036, 2336368, 2527091, 2753564, 3099570, 3591116, 4353281, 5400400, 6996643, 9569609, 13702096, 19815248, 28339565, 38615984]
17691C8615984R919472O748630l29107q059365j0486568r023738o247583l145510
17683A7992215m91314J888258M602488P539993J0440403J1925997J0306535M495989
17675F8700564n282082j2643263j3536456j1207851p847501m989193l138422k088347
17667G967449j340416r34335o24757m84589l55127k51978k22053j59135q8307
17658C506752l3155j3692L3336J18545J01362J05977J21515O9865L4914J32809
17648D178228K02515M00074R04870J480411K212604L210295M674250O464939P698999
17639C1427185P183630M227249j498049o804934p829132o460421m269897j913032
17631A4062599J24768K139370M466657P201954R754749J0805933Q790710K939802
$$ y = [38615984, 48535456, 55284086, 54954979, 46895614, 36409046, 27385308, 21137725, 17992215, 17500901, 19389159, 23991647, 31531640, 41972043, 53898040, 64204575, 68700564, 63418482, 50775219, 37238763, 26030912, 18183411, 13194218, 10055796, 7967449, 6627033, 5692698, 5067941, 4583352, 4228225, 3976247, 3754194, 3595059, 3506752, 3473597, 3459905, 3493241, 3611786, 3713148, 3819125, 3940640, 4010505, 4045419, 4178228, 4380743, 4780817, 5685687, 7166098, 9378702, 12588997, 17263247, 23728186, 31427185, 38610815, 42838064, 41340015, 34535081, 26705949, 20245528, 15975631, 14062599, 14187367, 16326737, 20793394, 27995348, 37750097, 48556030, 57346740, 60286542]
17623F0286542o350138j1869105j1668882r432283o494472m093518k522012j679435
17615F176697j131173p40029m79252m01815l47389k58007j60465k81115k65270
17606B112182j79900j08194j42676j79008j35578O261L0424L8097p799l4846n7756
17595A341207o7630o3134K0959J8403N2768K2773m1391m0922M521R7314Q8135
17584A433003J41137K51096K36402K94331K80186K00794J73518K61927K98765
17575C571159L24028N37766O86095Q98589J200040J652015K551820M107495O465995
17566B1995002R967972J3952976J7203297J7106330J1453392L088217O1531P35756
17558I5564473k798005j2277148j7829882j4701142q000531j191397M568031R359808
$$ y = [60286542, 53936404, 42067299, 30398417, 20966134, 14471662, 10378144, 7856132, 6176697, 5045524, 4305495, 3826243, 3424428, 3077039, 2819032, 2658567, 2377452, 2112182, 1932282, 1824088, 1681412, 1502404, 1366826, 1373087, 1403511, 1441608, 1433809, 1398963, 1341207, 1273577, 1210443, 1231402, 1249805, 1302573, 1325346, 1283955, 1243033, 1247554, 1344868, 1433003, 1574140, 1825236, 2061638, 2355969, 2636155, 2836949, 3010467, 3272394, 3571159, 3895187, 4432953, 5119048, 6017637, 7217677, 8869692, 11421512, 15529007, 21995002, 31962974, 45915950, 63119247, 80225577, 91678969, 94767186, 94828717, 95564473, 92766468, 80489320, 62659438, 47958296, 39957765, 38766368, 43334399, 52694207]
17550E2694207J1850471J0234848L869879k399979l276790k909173o671551j2708925
17542E0682987j4180413j1157344p271667m570220k934757j941539j406846j042202
17534F177999p81299o25384m12174m43876m45268l99191l12660l04375k57491
17525B196281k78402k36808k32150j94689r0740o1410j05961r4574o8235j14439
17515G18873l6772j1738k5537j0005q6282n0473j0358k1786n6702J033o2606o7668
17503B79979L6803j5069m1762j4211K4133M6490R58O59l4865M1799q86m0594J889
17490B85323N0884L0081j793m9137j7231r862M0580J9241l9069q929k0702j8538
17478B60848k4520n8521o3988j8334Q158J146k7231p576n230K2275K5758L5354
$$ y = [52694207, 64544678, 74779526, 78649405, 76249426, 72972636, 70063463, 63391912, 50682987, 36502574, 25345230, 18073563, 13503343, 10568586, 8627047, 7220201, 6177999, 5396700, 4771316, 4359142, 3915266, 3469998, 3070807, 2758147, 2453772, 2196281, 1917879, 1681071, 1448921, 1254232, 1163492, 1102082, 996121, 901547, 833312, 718873, 682101, 670363, 644826, 634821, 548539, 498066, 487708, 465922, 409220, 410253, 347647, 279979, 316782, 301713, 259951, 245740, 269873, 316363, 317321, 317980, 283115, 324914, 324028, 283434, 285323, 336207, 366288, 364495, 315358, 298127, 288265, 328845, 348086, 309017, 300088, 279386, 260848, 236328, 177807, 113819, 95485, 103643, 104789, 77558, 69982, 64752, 87027, 112785, 148139]
17466A48139J8036l1747K9262Q407p5879j9283M2915l6704N613J2111j514L9935
17454A39291J1989o1865n1200m6728l3342R160J1785M655O410M0992n378n1781
17442b6012k7960J1639l7192P4976J4157k9838L157M6999N3221N498n4202n9518
17430b5075R103K9951K1373O3008M4691N3796n2956q1999M958k3867m762N800
17418D4021O5801M8329o4183K7858K2656j3650l1256k5086K8007J5452k5738J4020
17406A06231M0102m3209p1594m1935J3632K7493K7031n2729J085m09P7626O568
17394H9892k1244l7322o1527J7703m3662j8407K9925J1626j4066p879M7637N5873
17382D8549J8247n8617n1822k9348K4369L5088m4716k9978K8313M6363j5579j7115
$$ y = [148139, 166175, 134428, 163690, 172097, 96218, 76935, 119850, 83146, 88759, 100870, 99356, 139291, 151280, 89415, 38215, -8513, -41855, -32695, -20910, -16255, -9845, 31147, 25769, -26012, -53972, -42333, -79525, -4549, 9608, -20230, -17073, 29926, 83147, 88645, 34443, -25075, -15972, 13979, 35352, 98360, 143051, 196847, 143891, 61892, 66850, 42983, 38221, 44021, 109822, 158151, 93968, 121826, 144482, 130832, 99576, 74490, 102497, 117949, 92211, 106231, 146333, 103124, 31530, -10405, 3227, 30720, 57751, 5022, 6107, 5698, 83324, 89892, 68648, 31326, -30201, -12498, -56160, -74567, -44642, -33016, -47082, -54961, -7324, 48549, 66796, 8179, -43643, -72991, -48622, -13534, -58250, -88228, -59915, -13552, -29131, -46246]
17370d6246k0318P0001K7492K3884O5496M4518j3303P7863N557n6409m4872j8500
17358A15163J4780m8061k832o2995l0896L1561N2708L7411o8847n0125K499J06760
17346I7126J9863j0937M1770m4990l5616M4392J0266j1469l8608l7314P97J9093
17334E4373L6952o4440l7138k1687J0939l8415K1345O9749j7770o9561K8645P7467
17322E0459k000L697l6933m3788O535l8961L3967K5511k0469K3876J7777N5954
17310G5625J1690P310J1127k8538q7222N873J3948k4290K2496k9182o474k5127
17298e2764M5532M5427L3284K0516o228J1206K1114m1790l1585J5444L125p1157
17286g876K9793J0910Q64n6124j3203k9329J7040P5422l7905m3970L6688M2610
$$ y = [-46246, -66564, 3437, 30929, 54813, 120309, 164827, 151524, 229387, 234944, 178535, 133663, 115163, 129943, 81882, 79050, 16055, -14841, 16720, 69428, 106839, 37992, -12133, -9634, 97126, 116989, 106052, 147822, 102832, 67216, 111608, 121874, 110405, 71797, 34483, 35280, 54373, 91325, 26885, -10253, -31940, -21001, -59416, -38071, 31678, 13908, -55653, -27008, 50459, 48459, 52156, 15223, -28565, -22030, -60991, -27024, -1513, -21982, 1894, 19671, 75625, 87315, 94625, 105752, 77214, -10008, -4135, 9813, -14477, 8019, -21163, -27637, -52764, -7232, 38195, 71479, 91995, 85767, 96973, 118087, 76297, 44712, 60156, 63281, -7876, 21917, 32827, 33691, -22433, -35636, -64965, -47925, 27497, -10408, -54378, -17690, 24920]
17274B4920m9686q7906K2217O0142j4774R040K0397K5953L0483k3396k0373L5705
17262C2722o74j5183P0719j9818j4196j4895O3194R3790q0173m0664m5362l5354
17250e894j5302J9029L8345p6117J8586K5373J6286J3067L3272N5936o729m0743
17238G5109o8864J4304Q8966L8785R659j8953m5112p4624o4625m0790L4279O2491
17226A0625l199j1682j4363o0515N4852L6155n9953p4583m5969O319P649n303
17214a59967M1404P352N5212k0810j3070M4771q232K001l0888k1818J9852L4245
17202d9948q804N1084M0261j5216M4919j5219k711M325Q589m7190M5134l107Q5523
17189A37640J17583J4048n6929p775K2657J1579q9665n1968o0319k3397J2169
$$ y = [24920, -24766, -112672, -90455, -30313, -45087, -36047, -15650, 10303, 40786, 17390, -2983, 32722, 32048, 16865, 87584, 67766, 53570, 38675, 101869, 195659, 115486, 74822, 29460, -5894, -21196, -2167, 36178, -39939, -21353, 4020, 20306, 33373, 66645, 122581, 115852, 75109, 6245, 20549, 109515, 148300, 157959, 139006, 93894, 19270, -45355, -86145, -51866, 10625, 7426, -4256, -18619, -79134, -24282, 11873, -48080, -122663, -168632, -162313, -154664, -159967, -118563, -111211, -55999, -76809, -89879, -45108, -53340, -51339, -82227, -104045, -84193, -49948, -58752, -7668, 32593, 17377, 62296, 47077, 44366, 48691, 57280, 10090, 55224, 52117, 137640, 255223, 269271, 212342, 204567, 227224, 238803, 149138, 97170, 36851, 13454, 25623]
17178B5623P4117M1515l6448P5223J8722M1617L0460K3715p6123p1784n788l3924
17166A06925p6398K151M8686K9580m1460l4596j4138r346o2473j9260K429J8475
17154d9425L1991L5546J8213m870o268m321l7173o8428j0099K6706M1560L6789
17142A0221J5409K0317Q3831j3604J8668J31484J49312J0360n4468j28625q0911
17131A61994J8741p6138l3377j5201j7214J210l26P8201J7961k936R338L4329
17119A76582K273n5396o2674j9475Q921j4681k7154J115M7484n987n8400n0287
17107e7679j57L3479l843J5091o165j4653K769L0811J8513r401l4259n6059o498
17094h8051L762N7298P5590M479n3611n6990J3587m4612m7805L6150R9494K1182
$$ y = [25623, 99740, 141255, 104807, 180030, 198752, 240369, 270829, 294544, 218421, 146637, 140849, 106925, 30527, 32678, 81364, 110944, 69484, 34888, 20750, 11404, -51069, -70329, -67900, -49425, -17434, 18112, 36325, 31455, 25187, 20866, -16307, -84735, -94834, -68128, -26568, 10221, 25630, 45947, 129778, 116174, 134842, 266326, 415638, 425998, 371530, 242905, 161994, 180735, 104597, 71220, 56019, 38805, 40015, 39689, 117890, 135851, 132915, 142253, 176582, 178855, 123459, 60785, 41310, 50231, 35550, 8396, 9511, 56995, 51008, -7392, -57679, -57836, -24357, -28200, -13109, -19274, -33927, -31158, -347, 18166, 8765, -25494, -81553, -88051, -84289, -26991, 48599, 53078, -533, -57523, -43936, -88548, -136353, -100203, -709, 20473]
17082B0473J980J9084k3637K6168L4775m6928o0501K6023l3717m0605O2731K9935
17070A5781J6185L4153m3443M377n3418K9007Q8855k1319n8318J9319J2660p6098
17058c2259p9401R0499Q0174L1427j7562N1952n0308L1432R8374J25096N9772
17047C89196N3299l793k2521K056m4562j9059q0044o3534J8605j0688L5098M8258
17035C02311J23038O8815o65l1447l8484n4159j50176j25351p9978K3978L3394
17024G1276o9397k6539K6144J6453n5970k9773P7233j220p3085l2722N7717J5368
17012b4515l8962q7448J9035J5770J9266N3756P243L7314J5315k8407o582K7419
17000I204J3542K3720j6054l3141L243M2079m0920l1827l9364j3636L7775q919
$$ y = [20473, 22453, 41537, 17900, 44068, 78843, 31915, -28586, -2563, -36280, -76885, -14154, 15781, 31966, 66119, 22676, 27053, -26365, 2642, 91497, 70178, 11860, 31179, 43839, -32259, -111660, -21161, 59013, 90440, 72878, 124830, 74522, 105954, 204328, 329424, 389196, 442495, 438702, 416181, 418237, 373675, 354616, 274572, 211038, 229643, 218955, 254053, 302311, 425349, 494164, 493499, 462052, 423568, 369409, 219233, 93882, 13904, 37882, 71276, 1879, -24660, 1484, 17937, -38033, -67806, 9427, 8207, -64878, -97600, -39883, -24515, -63477, -150925, -131890, -116120, -96854, -43098, -35855, 1459, 16774, -11633, -18215, 9204, 22746, 46466, 30412, -2729, 514, 42593, 1673, -30154, -69518, -83154, -45379, -54298]
16988e4298L815K5511P0777K9365j5287l2387p992L467j1779p3804l1189N2535
16976d1266N9354O785m5790J7151k4637j4440M3872o951R468j5373J4280l3041
16964c0588k9293L1496k7292K7182L6451j03709r617P2653P4711k9754o297l8526
16952c2583j753m9788r451L8101K0524n7479K8207N7582L4716r433m5250p3059
16940i9666q4311n214q279K2375R3049J8085o9722L288N8666M6277J011k1247
16928d5688m1794j2798j380J2735N2529O843o2325p540K1377k7387n8752O9627
16916i4553K8932N0599j8819m0265K3561L1875K0966M069J4077N2594n4945j03444
16904h5353k2288K9859k8214L8116L9820m7251J1856J85N831l1744J8165q435
$$ y = [-54298, -50483, -24972, 45805, 75170, 59883, 27496, 19504, 22971, 11192, -62612, -93801, -41266, 18088, 24873, -20917, -3766, -28403, -42843, 1029, -5922, 3546, -11827, 2453, -30588, -59881, -28385, -55677, -28495, 7956, -95753, -105370, -32717, 41994, 12240, 5943, -32583, -34336, -84124, -93575, -55474, -34950, -92429, -64222, -6640, 28076, 18643, -26607, -99666, -183977, -189191, -197470, -175095, -82046, -63961, -133683, -130395, -71729, -25452, -24441, -45688, -87482, -100280, -101660, -88925, -36396, -29553, -91878, -99418, -78041, -105428, -164180, -94553, -65621, -15022, -33841, -74106, -50545, -18670, 2296, 6365, 20442, 73036, 18091, -85353, -107641, -77782, -105996, -67880, -28060, -75311, -63455, -63270, -57439, -89183, -71018, -79453]
16892g9453l7624j1642m0354M0479L9588R6390J2384M5186l3850o7731J0721J7083
16880h823M058m9517j0658j9586k1454M2415l7493P920J5664L8808O5212m0015
16868a3469m6249p926L6072j7730N4983l435l8655N2290j7814q9074j4106L4275
16856g0838L0324L1656l1201j9275P0401M1848k9562j7429o8867j2405l711m734
16844h3793j3358K973K2262j2685L4895J2096m0534J3137n2517K6484J0185o2270
16832a43125m3259J1980J9428J4429P0220N3241k1636m475n8632K838J0868k0321
16820a08444k5119O161J2392P7491J2281N1152j9566J8542m11j6810l540M1380
16808D5509m4730k5885l2519J3577J8266k6988k543l8379m8145N660M7499P996
$$ y = [-79453, -117077, -128719, -169073, -128594, -89006, 7384, 19768, 64954, 31104, -36627, -25906, -8823, -4765, -54282, -64940, -84526, -105980, -63565, -101058, -93138, -77474, -38666, 26546, -13469, -59718, -67644, -31572, -49302, 5681, 2246, -36409, 15881, -1933, -91007, -105113, -70838, -40514, -8858, -40059, -59334, 11067, 52915, 23353, 5924, -62943, -75348, -79059, -83793, -97151, -94178, -71916, -84601, -49706, -37610, -78144, -65007, -117524, -91040, -80855, -143125, -186384, -174404, -154976, -140547, -70327, -17086, -38722, -43197, -101829, -98991, -88123, -108444, -133563, -127402, -115010, -37519, -25238, 25914, 6348, 24890, 24479, 7669, 4129, 45509, 779, -25106, -57625, -44048, -25782, -52770, -55313, -93692, -141837, -136177, -88678, -80682]
16796h0682k2581J4881J8851K0082N6846k8804l4825q195J0164L1994K795m0912
16784f0386l8865J8780J0529R7092M8173p1069o0986j7348M1994M5757O5703n1952
16772B7422m2437o291K456K3735J3173M770l2678l2866L8904O4205l726j05016
16760d8349J9937l264J3836M3195N1154K55J1566j5502J5167n9794M1501k2117
16748D7585r016O3885J7362l3150o6616j8363K2218p692o9485r795J366o778o1768
16735a30247l2379L9458l208L004o396O3679J03114J8161m3771r443q285K2139
16723A5826j5992q8715j1113M1240N3080J915o3200j7073O837R107K4193M31j7093
16710f0557l819Q5691j4763j11011k5895M0158J6010N815K0996O0498N14N8577
$$ y = [-80682, -103263, -88382, -69531, -49449, 7397, -21407, -56232, -64427, -54263, -22269, -19474, -60386, -99251, -80471, -69942, 27150, 75323, 4254, -56732, -74080, -32086, 13671, 79374, 27422, -15015, -21306, -18850, 4885, 18058, 22828, -9850, -42716, -3812, 60393, 56667, -48349, -28412, -31676, -17840, 25355, 76509, 76764, 88330, 72828, 87995, 28201, 69702, 47585, 38569, 102454, 119816, 86666, 20050, 1687, 23905, 16213, -53272, -63067, -61701, -68479, -130247, -162626, -123168, -126376, -123372, -129768, -66089, 37025, 55186, 11415, 1972, -6313, 15826, -166, -88881, -99994, -58754, -5674, -3759, -66959, -84032, -77195, -68088, -43895, -43464, -60557, -64376, 21315, 6552, -104459, -130354, -90196, -74186, -68371, -47375, 13123, 13637, 72214]
16698G2214n0814n8384n3775m9481K7843J02897M5635j4270j10891N509P8764
16687d753L648J0110L2535p302q1745j9112K4360L9910L305l2188n038K6726J6890
16674G346L3938k269m9720m5355m5419P6321O0703K3160n1795p3330N28n6735
16662a22627J3404O0028M4099K8097M3211l6211o3711k82K4456L0522P2953J2883
16650A06822q2502l1987j9033k0572m8078m5121Q158N8015J0526n6996m385L8451
16638h6702q920M5557J3136K1305L691k7595N45J1315r241n4850N0208L5468m3113
16625d9196K3650Q997K3697K6087m4569o6371J0486K8431q51J0493r606o1328
16613a00080m2718L0461M1535o453k8417P3626P6406J2989K547O41M313J3849
$$ y = [72214, 21400, -36984, -90759, -140240, -112397, -9500, 36135, 21865, -89026, -83517, -4753, -1105, 9005, 41540, 34238, -47507, -66619, -42259, -2349, 956, -31232, -36270, -9544, 7346, 41284, 39015, -10705, -56060, -101479, -25158, 35545, 58705, 6910, -66420, -65892, -122627, -109223, -49195, -5096, 23001, 66212, 30001, -33710, -33992, -9536, 20986, 93939, 106822, 24320, -7667, -26700, -47272, -95350, -140471, -132313, -74298, -63772, -120768, -125153, -86702, -95622, -50065, -36929, -15624, -11933, -39528, -38983, -27668, -36909, -91759, -41551, -6083, -49196, -25546, -16549, 7148, 33235, -11334, -77705, -67219, -38788, -39639, -29146, -38752, -100080, -142798, -112337, -70802, -77255, -105672, -32046, 44360, 57349, 59896, 60537, 64850, 78699]
16601G8699l6507K2350J1936l4656l1278j2244M4101J600l9258m5558p1840M4518
16589f8137Q7247k831n200j0947l0805m384O5110l789m7628l8831l7171N9634
16577c7732L9595N236k9940m6659M653j0300o170K0656R897L6887J8739K692O3085
16564G0639N3317k5300o9896n4716p7225K5207N4670O0181o129o572r0899j6917
16552h3640J5421M8936N511j6646K3600M1495p6395o8094J4163Q659K0428K770
16540f3792J20782R078p1739m8834l710L2471p489j6709p888l5030O3683k4758
16528e3935m8357k7371N451J7625N8093p267q1158j2430q619O0070M2552o5807
16516a21153O1807M9358J4692m5641m4724n3651J0817K8329J3464J3316J6091
$$ y = [78699, 42192, 64542, 76478, 41822, 10544, -1700, 42401, 44001, 4743, -40815, -112655, -68137, 19110, 16279, 11079, 132, -30673, -35057, 30053, 26264, -21364, -60195, -97366, -37732, 1863, 7099, -22841, -69500, -64847, -75147, -81317, -60661, -50764, -13877, 4862, 7554, 70639, 123956, 98656, 28760, -25956, -103181, -77974, -23304, 36877, 30748, 24176, -66723, -83640, -68219, -19283, -13772, -30418, -6818, 34677, -41718, -109812, -95649, -86990, -66562, -63792, 56990, 66068, -5671, -54505, -58215, -25744, -33233, -49942, -57830, -92860, -29177, -53935, -102292, -129663, -124212, -106587, -48494, -55761, -136919, -149349, -157968, -97898, -55346, -121153, -59346, -9988, 4704, -40937, -85661, -139312, -128495, -100166, -86702, -73386, -57295]
16505e7295m3644J8090q394J5198P1690o3986m0398N0002N2656l9798k4676K0323
16493e0232L8189K6643m9971n5330J7916J27551L1920k4577m4411j5523J1807
16482A3982l0768L1079J3368N031K5998l2239n5955l6056k2587l4620Q63N9476
16470f2428M2309N897m5964J1936K77L953l0946l368N245K4810N9523m6485m0489
16457g5730M6654j0240K8595o9077k9455q430M358m201L1255p838J220L2425n4890
16444a15354K674j6811J5502M096K4277O3886O5251m8088m9737K3179N5201M4039
16432F8115k7722l5873M4243n2817p3645J4314K8115O8442L8469k9741m6112L500
16420g12o087l1918M0993O8734K2842n6454j01692L0491K4022K5782N6293n0188
$$ y = [-57295, -100939, -82849, -91243, -76045, -4355, -68341, -108739, -58737, -6081, -45879, -70555, -50232, -12043, 14600, -35371, -90701, -72785, 54766, 86686, 62109, 17698, 2175, 13982, -16786, 14293, 27661, 32692, 58690, 26451, -29504, -65560, -88147, -122767, -121904, -62428, -20119, -14222, -60186, -48250, -47973, -44020, -74966, -78334, -73089, -48279, 11244, -35241, -75730, -29076, -39316, -10721, -79798, -109253, -117683, -113325, -117526, -86271, -94109, -92889, -60464, -115354, -112680, -129491, -113989, -109893, -85616, -21730, 43521, -4567, -54304, -31125, 24076, 68115, 40393, 4520, 48763, -4054, -77699, -63385, -35270, 33172, 71641, 41900, -4212, -712, -6799, -38717, 2276, 71010, 93852, 37398, -64294, -33803, -9781, 16001, 72294, 22106]
16408B2106J4963K3722k6409L3049q0620k9815O876N5041L8302O7839M508O589
16396A36151P918j5417N532j7988j0497n079k8579k9813o8980L3039Q3679n700
16384H4266o292N724n4739m7992R075O2075N74p4218j04271O0309L6823N923J0843
16371a1900j7357L6356k4526l7683p9933J9031O4266O9684K8463m845k8488j9743
16359f675o0868j0746J42441O1368j6711j9445l6908m3836k4605L4644p002l4176
16347b2519l0981K3056j5498k7570m2199J2596J1101J4524K6170L8783O3338J0377
16335F1178k5732O382K0762N1504k090o1692J1534Q040k3456k0698L7930j7965
16323D5697j9936j4883n0696M0668L4153m7470j2544K5809J0924P9293J8932p1108
$$ y = [22106, 37069, 60791, 34382, 67431, -13189, -43004, -36128, 18913, 57215, 125054, 129562, 136151, 144069, 128652, 134184, 116196, 105699, 100620, 72041, 42228, -26752, 6287, 89966, 84266, 77974, 83698, 28959, -19033, -9958, 52117, 52691, -21527, -125798, -65489, -28666, -22743, -11900, -29257, 7099, -17427, -55110, -135043, -116012, -51746, 17938, 46401, 41556, 13068, -6675, -67543, -78289, 64152, 125520, 108809, 89364, 52456, 8620, -15985, 18659, 11657, -22519, -53500, -30444, -45942, -73512, -115711, -103115, -92014, -77490, -51320, -12537, 50801, 61178, 35446, 41828, 62590, 114094, 112004, 50312, 61846, 69886, 46430, 25732, 63662, 45697, 25761, 10878, -39818, 850, 35003, -12467, -25011, 798, 11722, 91015, 109947, 38839]
16311C8839k1712k4636k7233N9455M7526K974k6923k3280J1661k7616P948l4067
16299a7064j9648K2270K1865J1820q181j5750l1274J9451L0333m0579R926O4504
16287D7673k2362J8252o430p3636k0986N8946J9404m5047L5810M0944o6288p8428
16275i2148m7207K2514J00140L3672j6354M0546J9786J6860l4973n1283q1056
16264h9503j7596J17688M0844j7541k810q2731R713L7122l0928m1271J9277O2519
16252D783m6084N487M0293k5968L3999M3443k6570j8770o2540J0113P6599J5007
16240D9792K1246o3796o4227L1229J9501M3909k3979J8196k2753o0319j8498n176
16228g4875M8954K6570O961k2616m4694k0566N09M0626N8260j5846l1967j9699
$$ y = [38839, 17127, -7509, -34742, 24713, 72239, 75213, 48290, 25010, 36671, 9055, 17003, -17064, -36712, -14442, 7423, 19243, 11062, -4688, -35962, -16511, 13822, -26757, -16831, 47673, 25311, 43563, 37133, -36503, -57489, 1457, 20861, -24186, 11624, 52568, -13720, -92148, -139355, -116841, -16701, 16971, 617, 41163, 60949, 77809, 42836, -8447, -89503, -107099, 10589, 51433, 33892, 31082, -51649, -41936, -4814, -35742, -77013, -57736, 4783, -41301, -35814, 4479, -21489, 12510, 55953, 29383, 10613, -51927, -41814, 34785, 49792, 71038, 7242, -56985, -25756, -6255, 37654, 13675, 31871, 9118, -51201, -69699, -74875, -25921, 649, 7610, -15006, -59700, -80266, -79757, -39131, 19129, 3283, -28684, -48383]
16216d8383J3551O1915p0979j5373R680j0259J3902Q5489m1344k7669J4146J4488
16204h36l098n9762n9152N6284J22615L7119l375N8978L3525m6675m6834j12517
16192b3728k6987k664M7770R7287n444m8869q4458j6460L7536J2641n3421m4681
16180a11478l8863J6941J4546L9359J2046J665J505M7204l817K5116l306l8720
16168c7802n6904P9859n7414j06056M0869J59761J4485j2094k0326n5776k4313
16157g5711P04J303l234K1902O2504m0846p2142l0643J9900J6513K336N2605K0279
16144b4530M2870K6184k9432L5016l730k6276j9585n6161n849K7590L3657l924
16132d170r8580K4556Q3454M3481N67N364j3514N9216m3116l3785k7588j02734
$$ y = [-48383, -34832, 27083, -43896, -59269, -49589, -59848, -45946, 39543, -1801, -29470, -15324, -836, -3934, -63696, -122848, -66564, 56051, 93170, 89795, 148773, 182298, 135623, 88789, -23728, -50715, -53379, -5609, 91678, 86234, 37365, -47093, -63553, -26017, -13376, -66797, -111478, -150341, -133400, -118854, -79495, -67449, -65784, -64279, -17075, -20892, 4224, 918, -37802, -94706, -14847, -72261, -178317, -137448, 22313, 36798, 24704, 4378, -51398, -75711, -75007, -73704, -76938, -55036, 7468, -33378, -105520, -136163, -116263, -99750, -97414, -44809, -24530, 18340, 44524, 15092, 50108, 46378, 20102, 517, -55644, -61493, -33903, -246, -4170, -102750, -78194, 5260, 48741, 49308, 54672, 41158, 100374, 57258, 23473, -4115, -106849]
16120a06849J3435J03705P4383Q128K8590m7296L260M2808j2196l3013m0004k4932
16108A0019l1371j3134K4382k8123K3663N8838L3699j7661o4290k9469k654j2696
16096d8797M3740P9280J5466j9966o5448r243N8127j1003l9532J2970K0569J8654
16084E4817m4226m4402N7546N5073K7068k8623n8991k4945k5150p619k9118j4975
16072h3545J9512R4226J9334j9118l6216m6278N7888k0157M0909P5388K2337q2180
16060D2100m2199J738J5225K2522L923n8598k0615J0165K5386J5118J15734rp8132
16047E2358k2068M5325j1912n2050J1808j0854j6905L7586L9425K2032q1222m528
16035H995m4631l5330p528P3992N1094j5544M829L309r985j2086j4158J1203q450
$$ y = [-106849, -93414, 10291, 84674, 92802, 121392, 74096, 77356, 120164, 107968, 74955, 34951, 10019, -21352, -34486, -10104, -38227, -14564, 44274, 77973, 60312, -3978, -33447, -36101, -48797, -5057, 74223, 89689, 69723, 4275, -4968, 53159, 42156, 2624, 15594, 36163, 54817, 10591, -33811, 23735, 78808, 105876, 77253, 18262, -6683, -31833, -39452, -68570, -83545, -64033, 30193, 49527, 30409, -5807, -52085, 5803, -14354, 26555, 101943, 124280, 42100, -99, 1639, 16864, 39386, 43309, -15289, -35904, -25739, -353, 14765, 130499, 130490, 52358, 30290, 75615, 63703, 11653, 23461, 12607, -4298, 33288, 72713, 94745, 13523, 8995, -35636, -70966, -78494, -4502, 46592, 31048, 35877, 39186, 29201, 17115, 2957, 14160, 5710]
16022E710M0247j6867M1954M1659p4464j14902j2916O1366m125l9934M7824K5126
16010F78J7520N656m6749j442J7584L4565Q7261M0039n935R058j4677N225j8515
15997A30268r838n0669j7968k8670O727N4830J462o0938j8751j3821Q842J0022
15985A1496O5307L2699m5923l768J7516j2727o4343k6617M1503J4689K1802j3470
15973C8164l9267m3531L5345j5907j2722l1070L0965P4232l82K144m6634J5926
15961G263L9273P4967K9195n692m3312l3764k5581k6430l4224q3701k5886O0009
15949f7883M1196m183N8642P5288M9310k5907j24743j58138k9584L0121M2369
15938a13512n540L5053P0647O5737N2638m0289k1846K8997N4610p1178j33554
$$ y = [5710, 45957, 29090, 71044, 112703, 38239, -76663, -89579, -28213, -32338, -72272, -24448, 678, 18198, 23854, -22895, -24337, -6753, 27812, 115073, 155112, 149177, 158235, 143558, 148783, 130268, 120430, 69761, 51793, 23123, 29850, 84680, 86142, 25204, 6453, -7368, 1474, 11496, 76803, 109502, 63579, 59811, 77327, 64600, 257, -26360, 15143, 29832, 51634, 38164, -1103, -44634, -9289, -25196, -37918, -68988, -38023, 36209, 35827, 37971, -8663, 7263, 46536, 121503, 150698, 145006, 101694, 67930, 42349, 15919, -18305, -102006, -127892, -67883, -26687, -30870, 27772, 103060, 152370, 126463, 1720, -156418, -186002, -155881, -113512, -119052, -83999, -13352, 52385, 105023, 64734, 42888, 71885, 126495, 55317, -78237]
15927g8237O3854M5876L5108J19553j2411o8183K3565Q492l5313m8129j1312N1757
15915I4620Q2166k3278j18403j0505J3019M7155N1441j8675m4832m9477j2257
15904A0974J3031K6187O1029J7583k0240L1114K5874q0749k4739p621k8674k2901
15892H68j9262r20M6997K3719J3375l3805p146m5880l1817j7131J2894L9279Q2400
15879F3571O6709k471k5209p8617m1338K4295j101K9640l452k110M1092j6913
15867E4096l9028l3487l6599O001J6640P3623j7049k1396Q696P379J5832q419
15855B6289K3435l7662R135M9265Q405p8062K252O1737m85L5685k1643j8231l1915
15842B8205j1597k1306M9063k838j3749l5624J5402M3070M7462m9715n2049n9865
$$ y = [-78237, -14383, 31493, 66601, 186154, 173743, 105560, 129125, 137617, 102304, 54175, 42863, 94620, 176786, 153508, 35105, 24600, 37619, 84774, 136215, 117540, 72708, 23231, 10974, 24005, 50192, 111221, 128804, 108564, 139678, 165552, 84803, 60064, 52443, 23769, 868, -18394, -19314, 27683, 51402, 64777, 30972, 23826, -22054, -53871, -71002, -58108, -18829, 63571, 130280, 127809, 102600, 23983, -17355, 6940, 5839, 35479, 32027, 29917, 71009, 54096, 15068, -18419, -55018, -49017, -32377, 41246, 24197, 2801, 11497, 18876, 34708, 26289, 49724, 12062, 21197, 70462, 78867, 805, 3057, 64794, 64309, 99994, 78351, 60120, 28205, 16608, -4698, 44365, 41527, 27778, -7846, 7556, 50626, 98088, 48373, -3676, -63541]
15830f3541n1800K3268O8095k0602J21397P0149l7981J4474L4359m8722l0521
15819G8575m2189L5502l6526K7525n9804j7399J585k2196k9081J7726J08863L6450
15807I9031k7307l4651j6233k5575K2429Q0601N9739N9565n027l5692q4168M297
15795I7009J2629R836k9874m134j1433N4023K4288j8744M8909K2523l3485n6865
15783A14682k8659q930o604L0194l3075j3795n716K9394M9505N8176j1790n944
15771A67438r0819j8391n6822K8658K1605J7744L1041M8075Q1031M8094j7172
15760B60482o0777l6096J9411L1277m2365n2858k4924O840M8995j957n4447P896
15748A01477L1341l4484n7505N3184J3348j0341k4091j0993k5269k1137J4173
$$ y = [-63541, -115341, -92073, -23978, -44580, 76817, 146966, 108985, 123459, 157818, 109096, 78575, 36386, 71888, 35362, 62887, 3083, -14316, -12731, -34927, -64008, -46282, 62581, 99031, 71724, 37073, 20840, -4735, 17694, 98295, 158034, 217599, 212572, 176880, 92712, 97009, 109638, 119474, 89600, 85466, 74033, 128056, 152344, 133600, 182509, 205032, 171547, 114682, 86023, 77093, 70489, 100683, 67608, 53813, 48097, 77491, 126996, 185172, 173382, 167438, 76619, 58228, 1406, 30064, 51669, 69413, 100454, 148529, 229560, 277654, 260482, 199705, 163609, 183020, 214297, 171932, 119074, 94150, 100990, 149985, 148028, 93581, 101477, 132818, 98334, 40829, 94013, 107361, 97020, 72929, 61936, 36667, 15530, 29703]
15737B9703L4598K8367k4923n7219K9215K8825J0380n4861K3157O5510J2244k369
15725A22627j2643J1038L0319O0433K585K2426j4745N396k3457L4297J1304J5233
15713B64813J1000q4644K9073n8156o3566L7761K1507k6641J0910K6534j8086
15702A50505k4430k9677n0760J1776J0876M8379K2839m9447l3358K8860n587R733
15690H9709o511K0015p547L0118N1284n3728J5825L2836P8904L5250P543l0004
15678B63694Q896J9646J3477P062N3438N1804J20410P3134Q8176Q9016p655r5181
15666F85917j33656r5985o9882k3376j493O1283j1482n0641n3639m2674J3968
15655B78340M3128J3823L6285l2131k754m348q608O2983P3339J303l9636K7955
$$ y = [29703, 64301, 92668, 67745, 10526, 39741, 68566, 78946, 24085, 47242, 112752, 124996, 122627, 109984, 121022, 151341, 211774, 214359, 236785, 222040, 227436, 203979, 238276, 249580, 264813, 275813, 191169, 220242, 162086, 98520, 136281, 157788, 131147, 142057, 168591, 150505, 126075, 96398, 45638, 57414, 68290, 116669, 139508, 90061, 56703, 85563, 79976, 89709, 83198, 103213, 95666, 125784, 177068, 123340, 139165, 172001, 250905, 286155, 293698, 263694, 272590, 292236, 305713, 312775, 366213, 418017, 538427, 611561, 699737, 788753, 781098, 685917, 552261, 456276, 386394, 363018, 361525, 422808, 411326, 360685, 307046, 264372, 278340, 321468, 335291, 371576, 339445, 336691, 332343, 323735, 386718, 460057, 461360, 421724, 449679]
15643D49679N39l4245o2233J6599j4758m9961r58N8177M3169r205j7547K1570
15631D00826l2056p591P2905p925j8811k9165p0822n353j0663J3761J2985j9569
15619B98522l0676P96J3381O8204R3370L0495J9240m5730K2430j9191L209k2547
15607D31503l5990J9636r824L3247J7969R838K5972O109l9705j6933L3841j1640
15595D64023m1946O454L7087r635j6766O2903o6533o1780L3224K8364M5735O850
15583D87980R884j9675M6339k512j04257K113L8490L3454K9336j4008k3317J2144
15571D95971J1285R7425N4302r5753k0424J512J2263N8014K2037q3941k2147L854
15559E34398j2419l0124J4421J3634O405K6651N7437k0681K530P3851K2756m0810
$$ y = [449679, 450218, 415973, 353740, 370339, 355581, 305620, 304662, 362839, 406008, 396803, 379256, 400826, 368770, 361179, 434084, 426159, 407348, 378183, 307361, 302008, 291345, 305106, 318091, 298522, 267846, 268642, 282023, 350227, 443597, 474092, 493332, 447602, 470032, 450841, 454050, 431503, 395513, 415149, 405325, 438572, 456541, 466379, 492351, 498460, 458755, 441822, 475663, 464023, 422077, 428531, 465618, 455983, 439217, 502120, 435587, 373807, 407031, 435395, 481130, 487980, 497864, 478189, 524528, 522016, 417759, 419872, 458362, 491816, 521152, 507144, 483827, 495971, 507256, 604681, 658983, 563230, 542806, 544318, 556581, 614595, 636632, 552691, 530544, 534398, 521979, 491855, 506276, 519910, 526315, 552966, 610403, 589722, 592252, 666103, 688859, 648049]
15547F48049n4866L4698J4176j6819N3890L6734q230K2724o9574J3080R0612L1844
15535G96318o0313j0366P642P933L1914J05277R9145j2854q2112O7573M1139k4260
15523I67036K7832L4373L8244J1017o68L7014o746o2728J6163Q0127N4239L8533
15511A234436n6565k0984J11832K3849j2854M1613l0L5953O3128K3982k5759J00788
15499A519389M7380l7496o721K8577O9734K0693K4982j1031N5670L6940N2823
15488A800940L9008Q625L4220J20479J1323J0143O3656P0655Q9120P2346M4998
15477B365513Q3648Q8295J02249R1944O3551L5899J7325J3437J66329J76874R5723
15466C300787N3163Q6412J11783J35099J56491J33969J80802J01370J62845J63302
$$ y = [648049, 593183, 627881, 642057, 625238, 679128, 715862, 707632, 730356, 660782, 673862, 764474, 796318, 736005, 725639, 733281, 741214, 773128, 878405, 977550, 964696, 882584, 950157, 991296, 967036, 994868, 1029241, 1067485, 1078502, 1077834, 1114848, 1108102, 1045374, 1061537, 1141664, 1195903, 1234436, 1177871, 1156887, 1268719, 1292568, 1279714, 1321327, 1321297, 1357250, 1420378, 1444360, 1418601, 1519389, 1566769, 1529273, 1522552, 1551129, 1620863, 1641556, 1666538, 1655507, 1711177, 1748117, 1800940, 1839948, 1848573, 1882793, 2003272, 2014595, 2024738, 2088394, 2159049, 2248169, 2320515, 2365513, 2449161, 2537456, 2639705, 2731649, 2795200, 2831099, 2848424, 2861861, 3028190, 3205064, 3300787, 3353950, 3440362, 3552145, 3687244, 3843735, 3977704, 4158506, 4259876, 4422721, 4586023]
15456D586023R9061J57497K25493K14018K57690J74250J76526K02512K21739K56207
15446F571016K70368K56512L91237L75577M09268M56722M28730M24140M71826
15437A0055396N45466N30169N98893O54587P63771Q29705R04671J008666J049786
15428A6941110J097144J174258J308247J470952J625863J710139J839949K063074
15420B9230736K298751K506636K746644L047198L321000L664574L947198M330190
15412E5092927M623599M847001M996568N059596M980529M617333M023175L277860
15404I1518588K394557J347169Q2356j186168k231277l203002l986661m433985
15396H0301577m708877m808181m717530m565642m418903m195212l741551l402206
$$ y = [4586023, 4685084, 4842581, 5068074, 5282092, 5539782, 5714032, 5890558, 6093070, 6314809, 6571016, 6841384, 7097896, 7489133, 7864710, 8273978, 8730700, 9159430, 9583570, 10055396, 10600862, 11131031, 11729924, 12384511, 13148282, 13977987, 14882658, 15891324, 16941110, 18038254, 19212512, 20520759, 21991711, 23617574, 25327713, 27167662, 29230736, 31529487, 34036123, 36782767, 39829965, 43150965, 46815539, 50762737, 55092927, 59716526, 64563527, 69560095, 74619691, 79600220, 84217553, 88240728, 91518588, 93913145, 95260314, 95342670, 94156502, 91925225, 88722223, 84735562, 80301577, 75592700, 70784519, 66066989, 61501347, 57082444, 52887232, 49145681, 45743475]
15388D5743475l151747k844616k610455k341144k117786j878661j658821j460328
15380B7679917j405698j268971j099369r79837r77529r69329r13816q43202q94007
15371A8328159r22992q92858q35262q44437q14554p03388o59687o49781o27653
15362A1377547m80180m81315m30450l45978l04207l01025l34743l61104k89692
15353H048853l74775l84286l84334l08733l69666l95841l16861k46714k67175
15344E000468j93946k23481k04821j95860j80286j60956j51182j56930j05283
15335C427723o8974j6254j27595j44829o3700q5608m0821j16717r4497k1195o0304
15324B587229p2810k5126n5110n7953p3909j30968q1369o1413n3725o0416l3367
$$ y = [45743475, 42591728, 39747112, 37136657, 34795513, 32677727, 30799066, 29140245, 27679917, 26274219, 25005248, 23905879, 22926042, 21948513, 20979184, 20065368, 19222166, 18328159, 17405167, 16512309, 15677047, 14832610, 14018056, 13314668, 12654981, 12005200, 11377547, 10897367, 10416052, 9985602, 9639624, 9335417, 9034392, 8699649, 8338545, 8048853, 7674078, 7289792, 6905458, 6596725, 6227059, 5831218, 5514357, 5267643, 5000468, 4806522, 4583041, 4378220, 4182360, 4002074, 3841118, 3689936, 3533006, 3427723, 3358749, 3342495, 3214900, 3070071, 3006371, 2920763, 2879942, 2763225, 2668728, 2647533, 2587229, 2514419, 2489293, 2434183, 2376230, 2302321, 2171353, 2089984, 2028571, 1974846, 1914430, 1881063]
15313A881063M8770K2005k4561n4264j06961r1660N7071N231p7156n4133L1925
15302A637330p3419q3729l5307r3865m5775N774O9690K1000n3784r4887m0846
15291A212182o5388m9291p313M4725K5144p06j21152m9683O4348K0565J2308j3475
15279A072264k4190o4536l2294m0940o542K6385N0011N0408J8137j0456l7915
15268A000332L1808j8169J9258r599q3617p6143l0322r392j50197k1741O8538
15257G20756P7821J5763n926j8937k2573j1271j997Q0260k3595j8093l1557m7282
15245G13369m9271P7077M7377p7962o4961n9713l9051j2896L6614M3820p611l6131
15233E70661K8961l2115q329j9693M994L4205j3970j12527k5379J7932O8058J5539
$$ y = [1881063, 1929833, 1951838, 1927277, 1873013, 1766052, 1674392, 1731463, 1736694, 1659538, 1605405, 1637330, 1563911, 1480182, 1444875, 1351010, 1305235, 1311009, 1380699, 1401699, 1347915, 1253028, 1212182, 1146794, 1097503, 1090190, 1134915, 1160059, 1159353, 1038201, 988518, 1052866, 1073431, 1085739, 1072264, 1048074, 983538, 951244, 910304, 903762, 930147, 980158, 1030566, 1048703, 1038247, 1000332, 1032140, 1013971, 1033229, 1023630, 940013, 863870, 833548, 824156, 673959, 652218, 720756, 798577, 814340, 808414, 789477, 766904, 755633, 753636, 833896, 810301, 792208, 760651, 713369, 664098, 741175, 788552, 710590, 645629, 585916, 546865, 533969, 570583, 614403, 606792, 570661, 599622, 567507, 559178, 539485, 544479, 578684, 564714, 452187, 426808, 444740, 512798, 528337]
15221E28337k7086R408k0352j6007K007r794l4845l8699N460l1313k4305O9561
15209D12372N6387n3330j5637l1265o6020M7850P2021q1286M2597L7354M073K7222
15197D52338L2929k1497j0213l0335j8862l1100q4862p0232K8464L3565j7147
15186B63048L1924K4022O4790j7088o5649k1031j735P6626J00747j8101l0988
15175D06565l7381O2314j8581o5827J2179M089L8446N326m6876R666J7001k2838
15163C64083L0563m8172L4646j4373k4267o5762n8037k7916K6352N0646J1454
15152B79217K7085L6598j7874L6824j6731l8848p4821O7621J01642O0354K3854
15141D84921l0380j2651O3781J31921Q4399M1211j7288J04645K895j31567j12994
$$ y = [528337, 501251, 510659, 490307, 474300, 476307, 466513, 431668, 392969, 398429, 367116, 342811, 412372, 468759, 415429, 399792, 368527, 302507, 350357, 422378, 341092, 383689, 421043, 425116, 452338, 485267, 463770, 453557, 423222, 404360, 373260, 288398, 218166, 246630, 280195, 263048, 294972, 318994, 383784, 366696, 301047, 280016, 278281, 354907, 455654, 437553, 406565, 369184, 431498, 412917, 347090, 359269, 363358, 401804, 407130, 360254, 369920, 386921, 364083, 394646, 346474, 381120, 366747, 342480, 276718, 218681, 190765, 217117, 267763, 279217, 306302, 342900, 325026, 361850, 345119, 306271, 231450, 299071, 400713, 461067, 484921, 454541, 441890, 505671, 637592, 721991, 763202, 745914, 850559, 853454, 721887, 608893]
15130F08893k5928K8491m0857j7999k9670k9781J3545l5742j2903M393o8047k7193
15118C67202j6073o0084K8467Q982K496Q816j656k2415p3813q837P6696O1615
15106C71396L248l0832M26N988n1454l3381K6887m6334q0539o2686L7821M2273
15094A82813N1770K6999Q012J5593k280l303O385n2589o4541R8424M1441j6548
15082B92176l3040J4429l3188k8518O7018J24704l0469r0842j1373O7806n0782
15071B87921j295K6648l3029p5314j2727M7429J1033O04L2924J4359j162q6414
15059B10977k7521p0471k0515j0657Q6672N5723p795N0420L4395r368K6218M992
15047C23070m9332j3307k1157p381m8612K548k5014J737k1044K0801J8669K3246
$$ y = [608893, 582965, 611456, 570599, 552600, 522930, 493149, 506694, 470952, 458049, 462442, 394395, 367202, 351129, 291045, 319512, 328494, 330990, 339806, 338150, 315735, 241922, 233085, 309781, 371396, 374644, 343812, 344238, 350226, 298772, 265391, 292278, 245944, 165405, 102719, 140540, 182813, 234583, 261582, 269594, 285187, 282907, 279604, 285989, 233400, 168859, 267283, 308724, 292176, 259136, 273565, 240377, 211859, 278877, 403581, 373112, 282270, 270897, 338703, 287921, 286626, 313274, 280245, 204931, 192204, 239633, 250666, 251270, 284194, 298553, 297391, 210977, 183456, 112985, 92470, 81813, 168485, 224208, 216413, 266833, 301228, 291860, 318078, 323070, 273738, 260431, 239274, 231893, 183281, 185829, 160815, 162552, 141508, 162309, 180978, 204224]
15035B04224j9023l0131l0167l6522M6321j9061l9598L1057K082P051K9815k876
15023A43172L2337k4016J576K4821P7910K5830j138j7078n293L1867j756m9913
15011B38319k4870j1244p7244q8308K0828R4559L1869L7303P8152O2124L1221
15000C92709j6682O5626M916J3396L7352P614L4109L9425r8722o3067L55k2256
14988C94775n4034k7084m2684j0981N6506K7998k3620r1302N6990J03714J988
14977C92266l6543p602J12534M958q7332m8530O3560K1971o7678L5347J1560K5865
14965D20376R5960r775m009K0600m5147m6630r2636k1153J34145L4770M8222l9218
14953D95505k7347L3620l2760L4797M2365M8087Q487R819k950J0443q789N771
$$ y = [204224, 185201, 155070, 124903, 88381, 134702, 115641, 76043, 107100, 109182, 116233, 146048, 143172, 175509, 151493, 153069, 177890, 255800, 281630, 280492, 263414, 258121, 289988, 288232, 238319, 213449, 202205, 124961, 36653, 57481, 152040, 183909, 221212, 299364, 361488, 392709, 376027, 441653, 446569, 459965, 497317, 504931, 539040, 578465, 479743, 416676, 417031, 394775, 340741, 313657, 270973, 259992, 316498, 344496, 320876, 229574, 286564, 390278, 392266, 355723, 348121, 460655, 465613, 378281, 329751, 393311, 415282, 347604, 382951, 394511, 420376, 516336, 506561, 502552, 523152, 478005, 431375, 338739, 317586, 451731, 486501, 534723, 495505, 468158, 501778, 469018, 503815, 546180, 594267, 602754, 612573, 609623, 620066, 611277, 617048]
14941F17048K6017M6027L0620j9795L029K0918M0020Q5389K8715K9659Q7507N8236
14929A053390J6565l550J1445J19393M4122k7851Q3479Q1552O1995M1592J12115
14918A594247Q8275J64408J89790K10862J70437P2841N7358L5418N9547J06939
14908B750122Q6721N1899Q4184J00058J72020J43883J41026K17871L58248L47212
14898D453244M26542M57262N03483N68779P36171R35748J145082J391223J516804
14889A2134338J824971K308849K915533L905476N288275P087370R890810J4289474
14881E9645096K0562226K8728290L7082359M1329227L7387998K6170959J3024906
14874B63931061M078218n30590n066718j3311956k5945916l7307312m1344168
$$ y = [617048, 643065, 689092, 719712, 699917, 702946, 723864, 763884, 849273, 877988, 907647, 995154, 1053390, 1069955, 1066405, 1077850, 1197243, 1241365, 1213514, 1296993, 1378545, 1440540, 1482132, 1594247, 1682522, 1846930, 2036720, 2247582, 2418019, 2490860, 2548218, 2583636, 2643183, 2750122, 2836843, 2888742, 2972926, 3072984, 3245004, 3388887, 3529913, 3747784, 4106032, 4453244, 4879786, 5337048, 5840531, 6409310, 7145481, 8081229, 9226311, 10617534, 12134338, 13959309, 16268158, 19183691, 23089167, 28377442, 35464812, 45355622, 59645096, 80207322, 108935612, 146017971, 187347198, 224735196, 250906155, 263931061, 268009279, 267478689, 262411971, 249100015, 223154099, 185846787, 144502619]
14867A44502619l6910198k7594057j8858366j2846336r013239o602646n075363
14860B7602414m003690l154161k503274k090342j843731j718562j447887j314992
14852I525775j147941r19930p40896o74482n84848n37809m56633l31115k55204
14843C876917k33441k21005k48108k55101j46542j15938k38085k12790j01973
14834B103934q441l0969j10428r7044r8733k2141j60148j00024l3359j0535m3827
14823A388285r2334p9727n8919J3182O3474J4110Q5282O5387L002J139J6419m0493
14811A378807q5063J1710J6122j19432j42029q1255q9176J948n4271o2904j24992
14800F49465m3039j6237l1671J434K7031K2109k0835n6961J6828j407j8696k7364
$$ y = [144502619, 107592421, 79998364, 61139998, 48293662, 39280423, 32677777, 27602414, 23598724, 20444563, 17941289, 15850947, 14007216, 12288654, 10840767, 9525775, 8377834, 7457904, 6717008, 6042526, 5457678, 4919869, 4463236, 4132121, 3876917, 3643476, 3422471, 3174363, 2919262, 2772720, 2656782, 2418697, 2205907, 2103934, 2095493, 2064524, 1954096, 1857052, 1758319, 1736178, 1576030, 1476006, 1442647, 1432112, 1388285, 1295951, 1216224, 1157305, 1170487, 1233961, 1248071, 1333353, 1398740, 1401742, 1402881, 1419300, 1378807, 1293744, 1305454, 1321576, 1202144, 1060115, 978860, 889684, 891632, 837361, 774457, 649465, 606426, 590189, 558518, 559952, 586983, 609092, 588257, 531296, 548124, 546717, 528021, 500657]
14788E00657n996m9698o8471q837N7249J2644j8372K6920k317m4918k1679P617
14776C84799K079m2734Q2523J3099j3979K0606q616J1403m5912J0627j7817q1444
14764C14634J2285o1225K7193j1338k1523R85J6201o407o3218k4279k1356J8687
14752A80639K0573J3170N9329P7360J7664Q2515Q3698R736m3330j9787M3354N1959
14740E76880r46k5226j1403n431m4975j00773r7641k7557K1636j0363R88l3049
14728B42140p8680L232J3918k7814O5442Q961j3699m014j5676J5275O3348n4258
14716B18175k319M9602l7292M304J0219K0720k9658j9240j5244L2627L07L801
14704B36002j9469k6992o7139k3062L7285J2981j0492N102l6115m3993M6434M087
$$ y = [500657, 494661, 444963, 376492, 367655, 424904, 437548, 419176, 446096, 443779, 398861, 377182, 384799, 386878, 344144, 426667, 439766, 425787, 446393, 437777, 449180, 403268, 413895, 396078, 314634, 326919, 265694, 292887, 281549, 260026, 261011, 277212, 270805, 207587, 183308, 161952, 180639, 201212, 214382, 273711, 351071, 368735, 451250, 534948, 544684, 501354, 481567, 524921, 576880, 575934, 550708, 539305, 533874, 488899, 388126, 290485, 262928, 284564, 274201, 275189, 242140, 163460, 166692, 180610, 152796, 218238, 227199, 213500, 209486, 193810, 209085, 272433, 218175, 215856, 265458, 228166, 232470, 242689, 263409, 233751, 214511, 199267, 231894, 232201, 236002, 216533, 189541, 122402, 99340, 136625, 149606, 139114, 144216, 108101, 64108, 110542, 114629]
14692A14629p2990k7902Q790N3538J2341k5271k4256J4113N4497K5163k0130m0222
14680G2300P268M9096j9786n9728P407N681Q535k0050k5516l4584K9208O5045
14668H4876M3401q991N645m1730k4407K621k2337j9362k0943j7651N7787p914
14656C0995j2336M7050J4912o214O9409K2700j2969j5932m2452n8748K4626K5037
14644H6078L9105l2713r5252j6149N6433K7771M158O6664k8299l744n0556m6892
14632F604j3309N4799N0525K2148j9833k8485l1989R389L8037N8540J7706k877
14620A61255J274k4659p534m19K5764m3133l7741n4287m5677K3369N2081O1542
14608A11835L5076K93r6190K3480J8530J7195j0130m1397k7181m519j3685K9540
$$ y = [114629, 41639, 13737, 22527, 76065, 88406, 63135, 38879, 52992, 107489, 132652, 112522, 72300, 79568, 128664, 108878, 49150, 56557, 62238, 70773, 50723, 25207, -9377, 19831, 84876, 128277, 119286, 124931, 83201, 58794, 61415, 39078, 19716, -1227, -18878, 38909, 30995, 18659, 65709, 80621, 74407, 143816, 166516, 153547, 137615, 95163, 36415, 61041, 86078, 125183, 92470, -2782, -18931, 37502, 65273, 69431, 136095, 107796, 104052, 53496, 6604, -6705, 48094, 98619, 120767, 100934, 72449, 40460, 49849, 87886, 146426, 164132, 161255, 162529, 137870, 130336, 129917, 155681, 112548, 74807, 20520, -25157, -1788, 50293, 111835, 146911, 147204, 51014, 74494, 93024, 110219, 100089, 58692, 31511, 26992, 13307, 42847]
14596D2847O1696M1785K3065L1054o1838l1509K1494l2583J7308m9117m6480J9258
14584C6980k6582p3563o174j919L3833K267n7664N0723R5686J5039k9351l6000
14572C275n2801J534J40997M6595q7631k9284N3045l9597J3126K095j0810j16534
14560g5990J0308K2557L6445K6964J8611O1097o4466k6812O7769Q8629j2618q8762
14548F3732j9278Q4985J7141j15068l5374L7712o1750l3436m7762J2473L5692
14537f0933N1527O1945N0139m9083K3205M153n0570J3912J3428J1096j1431n5422
14525A966J4461L3407J4224m6507m0215M397N0191M1305P626m71o8045j0723N464
14512G080r600K3419L014J06653L0741k7204q6080n1437L206L8152k206j6635
$$ y = [42847, 104543, 146328, 169393, 200447, 138609, 107100, 128594, 96011, 113319, 64202, 17722, 36980, 10398, -63165, -69339, -71258, -37425, -35158, -92822, -42099, 53587, 68626, 39275, 3275, -49526, -47992, 93005, 139600, 51969, 22685, 75730, 36133, 49259, 51354, 40544, -75990, -65682, -43125, -6680, 20284, 38895, 99992, 35526, 8714, 76483, 165112, 152494, 63732, 44454, 129439, 146580, 31512, -3862, 33850, -27900, -61336, -109098, -96625, -60933, -9406, 52539, 102678, 53595, 76800, 80953, 30383, 44295, 57723, 68819, 57388, 1966, 16427, 49834, 64058, 17551, -22664, -18267, 31924, 73229, 80855, 80384, 12339, 1616, 7080, -2520, 20899, 23913, 130566, 161307, 134103, 48023, -3414, -208, 37944, 35738, 19103]
14500A9103k7199K7570L2616N1834K1060m4302l1624m1378J4960L3237Q714L7282
14488A01873j2982k2212N4881K8141R915o9170J1576J601n4346J4462P6488K0810
14476A61037j12577j0683j4357k6934K7084M6338K6157q165q4645K7027J1607
14465D1889K4891K95o4931k7725J3016J434P5424J6782j9690k2086k7191K8427
14453D0535M4304o9264j484k2269n5481P4785J18479p356p7163m6252J6196P187
14441B2217l1617n476q438m6857M4896N1734M32n6209l6331o7750O3566M4118
14429b5715k1626l6689o361L305J1371n6991P0942N9294k0490O605J9306p305
14417d354m2169L3397N4771J2160j2900K7144k9349n4902j3899O1936J05625j482
$$ y = [19103, -8096, 19474, 52090, 103924, 124984, 80682, 49058, 7680, 22640, 55877, 64591, 101873, 88891, 66679, 121560, 149701, 159616, 90446, 102022, 103623, 49277, 63739, 140227, 161037, 48460, 37777, 23420, -3514, 23570, 69908, 96065, 87900, 3255, 30282, 41889, 66780, 67075, 2144, -25581, -12565, -11131, 64293, 81075, 61385, 39299, 12108, 40535, 84839, 15575, 14091, -8178, -63659, 11126, 129605, 122249, 45086, -1166, 15030, 22217, -9400, -14876, -23314, -70171, -25275, 26459, 26891, -29318, -65649, -133399, -69833, -25715, -47341, -84030, -90391, -87086, -75715, -132706, -61764, -2470, -22960, -16355, 2951, -4354, -46523, -13126, 41645, 53805, 40905, 68049, 38700, -16202, -30101, 31835, 137460, 135978]
14405A35978n7874L3974K7546n5533k7337r99J1654N8087O0593O095M5086J04142
14393C41412R0390J01614J19625J43356J30095R9221L4327N7381P9563N0048k7757
14382A219275k9995p1684j85474k00964k08459j03861l3215l4781p4431o1592
14372B14819l3254m11N3723k3175m3669k0053J3324l3162p9608j1920j4457m3802
14360b1645L6367Q4499k8652L1267m2665m2244L4835o1204J0601R8848k3808N6393
14348A32592L2589k9665j9988m1812P566J1097m5508j1217J6330L0698K6965L3773
14336A43420m67k0269l73J1905k5801k3901K453K801p782n4562N0696O5859M0613
14323A84592j5690m9923q8420K7422o9403j14339K5987K653N5934R3695o4965
$$ y = [135978, 78104, 112078, 139624, 84091, 56754, 55755, 67409, 125496, 186089, 192184, 237270, 341412, 431802, 533416, 653041, 796397, 926492, 1025713, 1060040, 1117421, 1196984, 1247032, 1219275, 1189280, 1117596, 932122, 731158, 522699, 418838, 385623, 350842, 276411, 214819, 181565, 181154, 234877, 211702, 168033, 147980, 161304, 128142, 48534, 36614, 22157, -21645, 14722, 99221, 70569, 101836, 59171, 16927, 51762, -9442, 1159, 100007, 76199, 132592, 165181, 135516, 115528, 73716, 81282, 92379, 46871, 35654, 51984, 82682, 109647, 143420, 142953, 122684, 122311, 134216, 108415, 84514, 86967, 89768, 81986, 27424, 78120, 143979, 184592, 168902, 118979, 30559, 57981, -11422, -125761, -99774, -97121, -41187, 52508, -12457]
14312a2457j17722n3258j935K0489l3127J7241O9579Q8587O9919N020j6213J5027
14300E1150O524L6850L1654q727q1791j05122K9725K6326j9630K3084L8672k8434
14288B81q3645l5888L7739Q7438N4652J4291N3395k9822j9096m584l0847m8863
14276d949J609J8481l7549k8835L068J409L6030N8687P0455J1988j0617o9854
14264D9923l2153L7284J9186j4457n8249m1576p4212j8379M9546M3859K6050p392
14252b0570j0787j4058j329M0712k815n1312j9182N0662N3403k158Q448J7537
14240D8551K4471q0294j3027J3869J03779K0184m0472j0294k4655m6513J7569
14229A3168L1000K0499N3919n035o8490N2240N2829K193p0490n3279j04206p021
$$ y = [-12457, -130179, -183437, -185372, -164883, -198010, -180769, -111190, -22603, 47316, 52336, 36123, 51150, 57674, 94524, 126178, 117451, 35660, -69462, -39737, -13411, -33041, -9957, 28715, 281, -83364, -119252, -81513, 5925, 60577, 74868, 128263, 98441, 79345, 74761, 43914, -4949, -3340, 15141, -22408, -51243, -48175, -46766, -10736, 47951, 118406, 130394, 119777, 49923, 17770, 55054, 74240, 59783, 1534, -40042, -114254, -132633, -83087, -39228, -13178, -20570, -31357, -45415, -46744, -6032, -8847, -60159, -79341, -28679, 24724, 22566, 31014, 48551, 73022, -7272, -20299, -6430, 97349, 117533, 77061, 66767, 42112, -4401, 13168, 44168, 64667, 118586, 113551, 45061, 97301, 150130, 152323, 81833, 28554, -75652, -82673]
14217h2673k4983j3448L0997M9277P5653k0533l875P1543r304o6207R886K4505
14205D0838n0437o9211k0054J9062J2850p513o512L8423J1908K443m352L5800
14193C245N081K2217j7737n6950m4022j2703r46L4588M246r063m6975L7143L8705
14180d3171N4456k4173l7053L1715L1463P070N179j1742k2362J5607n5425j834
14168e0270P4157J7549K142m6054n9520m678n6458n6091J4070P6632K1211Q4160
14156A6850N0338l1901l2275L340L10M3441M7255N6454m9151k5799J4592n6425
14144C7029k4683m4245o5577j5646J1746P9722L0663M1824l2921j4093j6190j1578
14132b3949l7169J5962N7108m2595p7950J2006R7419j4057j1561K8393k2699n1034
$$ y = [-82673, -107656, -121104, -90107, -40830, 34823, 14290, 10415, 81958, 72654, 6447, 16333, 40838, -9599, -78810, -98864, -79802, -66952, -74465, -80977, -42554, -30646, -28203, -32555, 3245, 8326, 30543, 12806, -44144, -88166, -100869, -101815, -67227, -62981, -72044, -119019, -81876, -43171, 11285, -12888, -49941, -18226, 13237, 20307, 25486, 13744, -8618, 6989, -48436, -50270, 23887, 41436, 43578, -2476, -61996, -66674, -123132, -179223, -165153, -88521, -67310, 16850, 67188, 35287, 3012, 6352, 6662, 50103, 97358, 153812, 104661, 78862, 93454, 37029, 12346, -31899, -97476, -113122, -101376, -21654, 9009, 50833, 17912, 3819, -12371, -23949, -61118, -45156, 11952, -30643, -108593, -96587, 832, -13225, -24786, 3607, -19092, -70126]
14120g0126p958o0975l0489M8707N2800K3962M6984L3800l0092J9576j6431l869
14108E889O8n3517j3460J7480L711K5673K5803j4827j3368K0416K6209j1365k9443
14095a0731o6629K8527j0233J9396N5115j2277j8669L6154O71K0588O1478K8469
14083A31859K4368o419l3714o6720o9719l6364l7285m501J5643R4792O0608j855
14071G0693Q654p2211l8670j8395J4891J7825M783L3687N3702j7488J874J8156
14059G7501O5141M2010l1230j02135j1988M145l2924m2944k8603L1614l1630J970
14047e9073m3867r923J7249j2457M8016P0548J05851J4938n9543k0437Q371q1486
14035b1813n2081M230K368j7239l263J2925P3305L0258j2078m0790k8636k2315
$$ y = [-70126, -78084, -139059, -169548, -120841, -68041, -44079, 2905, 36705, 6613, 26189, 9758, 5889, 5957, -47560, -61020, -43540, -39829, -14156, 11647, -3180, -16548, 3868, 30077, 18712, -10731, -77360, -48833, -59066, -39670, 15445, 3168, -15501, 20653, 21324, 41912, 103390, 131859, 156227, 149808, 116094, 49374, -20345, -56709, -93994, -98495, -82852, 11940, 72548, 70693, 79347, 7136, -31534, -49929, -35038, -17213, -12430, 21257, 74959, 57471, 59345, 77501, 142642, 184652, 153422, 51287, 39299, 43444, 10520, -32424, -61027, -29413, -61043, -59073, -102940, -112863, -95614, -108071, -60055, 10493, 116344, 131282, 71739, 51302, 59673, -21813, -73894, -69664, -67296, -84535, -87798, -74873, -1568, 28690, 16612, -24178, -52814, -75129]
14023g5129p079R3065N088o7748j1500l5957j3591L6501K8688L4080M1466n5368
14011b7484o7141n8096K1680Q2427R9617J03619J295p400m622q3841j13270K0217
13999c2999j4282K2763L9562K6531J317q0747K7088K3660L0712o4260n0573L8355
13987c2873L0908L089j3579L9278N961q9526J1023M1738o9744J9561j3636R043
13975e8757n8343j1376P4226N1631R5457J523o1032k903K1332l2456l7900l5866
13963e4464Q5971J7641m027k6615k0519L8589Q9754K4025o8539k8574n4927L3208
13951C1523J710m3550q870M1196L2224l1916k214n2528n459k6169Q614l0035j9608
13938a05082K4609l6398J8694P2175K8523N2857m9321LM947M4803m6495j3809
$$ y = [-75129, -82208, 10857, 15945, -51803, -63303, -99260, -112851, -76350, -47662, -13582, 27884, -27484, -94625, -152721, -131041, -48614, 51003, 154622, 155917, 148517, 143895, 60054, -53216, -32999, -47281, -24518, 15044, 41575, 42892, -37855, -10767, 12893, 43605, -20655, -71228, -32873, -1965, 1124, -12455, 26823, 32784, -56742, -45719, -3981, -73725, -54164, -67800, -58757, -117100, -128476, -54250, -2619, 92838, 94361, 33329, 30426, 51758, 19302, -18598, -54464, 31507, 49148, 45121, 18506, -2013, 36576, 126330, 150355, 81816, 53242, -1685, 31523, 33233, -10317, -19187, 22009, 54233, 22317, 20103, -32425, -37884, -64053, -55439, -85474, -105082, -80473, -116871, -98177, -26002, 2521, 55378, 6057, 6060, 11007, 55810, 9315, -4494]
13926d494L2356Q0845O558m9581m1973K342r979J9342l1064m4204J3317k9383
13914e5918l5979N579J2692L9015k1275J2341O1857l5248l0351L6102O4576N6287
13902A09678j9916O248n6103k6747M4374l4595l5845K2945J7910k1177j1986J5472
13890A0258N2014N0774o928l7723j5005l9103m0436p080L0490N1995P026K5491
13878H1773j9734L9159k1618k9407M152L7068k5281K3108l9753n6410j2408j0206
13866b9557j0350p275M3835N5470Q5903l2325k1624q6494o712N6013K4557M466
13854G5907m897n3770k5036l7464m2351M8567R0262k401L3272o3315k5020m500
13842a0746J3118N2308J4587p7496N4869M175m5512k6519K5599j4256q023q218
$$ y = [-4494, 27862, 108707, 115265, 65684, 23711, 26053, 16074, 35416, 4352, -39852, -26535, -55918, -91897, -86318, -73626, -34611, -55886, -43545, 18312, -16936, -47287, -11185, 53391, 109678, 89762, 96010, 39907, 13160, 57534, 22939, -12906, 10039, 27949, 6772, -5214, 10258, 62272, 113046, 106118, 68395, 53390, 14287, -26149, -33229, -2739, 49256, 56282, 81773, 62039, 101198, 79580, 50173, 54325, 91393, 66112, 89220, 49467, -6943, -19351, -29557, -39907, -47182, -3347, 52123, 138026, 105701, 84077, -2417, -9129, 46884, 71441, 75907, 71010, 17240, -7796, -45260, -87611, -39044, 51218, 48817, 82089, 18774, -6246, -10746, 2372, 54680, 69267, -8229, 46640, 50815, 5303, -21216, 4383, -9873, -17896, -26114]
13830b6114k2600L8348N269o877j2758N1234N7476j0436j19040J2745q9260k8751
13818a50764K4705O6292m522M6492K5723M477l4997k3317M2486J813k1205o7505
13806i0322L369O918q064k7698P9236M4138l1083L0728K6058l0208J7532j3948
13794F656n793K9132k0317K3948j4847l9372q906M2506R988n374j203l5648O8329
13781D9099n3065n8896L4437P2133K4432n2284p2309M20N8170J0296l4983N3358
13769C0808P4926J0754m2428q5039L8297J8144J8215k9889K4721O5653o0012j11838
13757d7688n9322M0272J06682M5752l8225j05764r6033j5626L6290M4700P5509
13746a3453m423j1333J1864O1887L6566p0029m5941J124L2803n7259J5750L5098
$$ y = [-26114, -48714, -10366, -5097, -11974, -24732, 26502, 83978, 73542, -45498, -32753, -122013, -150764, -126059, -59767, -64289, -17797, 7926, 12403, -22594, -45911, -3425, -1612, -22817, -90322, -86953, -80035, -88099, -115797, -36561, 7577, -23506, 7222, 33280, 3072, 20604, 6656, 863, 29995, 9678, 33626, 18779, -20593, -29499, 13007, 22995, 17621, 16418, -19230, 49099, -3966, -62862, -28425, 43708, 68140, 15856, -56453, -56033, 2137, 12433, -22550, 30808, 105734, 116488, 74060, -10979, 27318, 45462, 63677, 33788, 58509, 124162, 64150, -47688, -107010, -66738, 39944, 85696, 47471, -58293, -154326, -169952, -133662, -88962, -13453, -17876, -29209, -17345, 44542, 81108, 11079, -34862, -33738, -935, -58194, -42444, -7346]
13734g346L5996j6439m153O4430K0044Q525o2534n5295M626J2692k3033p2773
13722i5260O038K3594m2415K002J438J4917J03174L5798m9962l2721J1500K0983
13710i14O868K6516L6683J1196j9149O6692n9311r2692l8739P79m9718k9899P24
13697a40964M0266J9924J7305P0854K8669m0868M4139j5256k0742K9698k7663
13686E362N1084k4357k3994J7096M6971K9535q9297o4927j71M4485q171k6842
13674d3226j8225l1958p3936n3218P4942O3530M804j20l455N2840L1948k6357
13662b2431j3345j0513J9392N3704K5280m4100m9809J7793l1693L1527N4906L5110
13650F5821l3182m5968J904j5567M0886m142m7501L5930N2367N368n5576q9797
$$ y = [-7346, 28650, 12211, 8058, 72488, 92532, 101057, 38523, -16772, -12146, 546, -22487, -95260, -89222, -65628, -108043, -106041, -104603, -89686, 13488, 49286, -676, -33397, -21897, -914, 5954, 32470, 69153, 80349, 61200, 127892, 68581, -24111, -62850, -62071, -111789, -141688, -140964, -100698, -80774, -63469, 7385, 36054, -4814, 39325, 24069, 3327, 33025, 5362, 56446, 32089, 8095, 25191, 72162, 101697, 12400, -52527, -52698, -8213, -16384, -43226, -61451, -93409, -167345, -220563, -145621, -82091, -77287, -77407, -80862, -28022, 3926, -22431, -35776, -46289, -26897, 26807, 52087, 7987, -41822, -24029, -55722, -24195, 30711, 65821, 32639, -13329, -11425, -26992, 13894, 9752, -37749, -1819, 50548, 55916, 340, -89457]
13638h9457p6248K1702O3529N4298M1233j1350J9193r676R9966L3936p1708l9931
13626C5487M299R279R92k5825N811k8370K8929M9897R487l6962k3050M4380K4447
13613I8801l9413m7544l5168N2751J1922n9338l2598N5633M33l800K8879j6422
13601A4136J2600L2918k302k4872k8269j9091L7102L020k4058j8544l701L0554
13589I493k1303K4048J176N3568R546j5620p271m2664r1917J098N9049K2683N2761
13576E4647j077o7825N3182k7687m1540m577K2869L0200L9755k8658n2347N2408
13564B9350N0264j0573l0365J4823n243q062J8350r007J1707K5419o4669k0096
13552A898N124L9304O2989J3736l7835R221q8961k487P5433j0280l0912m4953
$$ y = [-89457, -165705, -144003, -80474, -26176, 15057, 3707, 22900, 13224, 113190, 147126, 75418, 35487, 39786, 49065, 50057, 24232, 30043, 1673, 30602, 80499, 89986, 53024, 29974, 74354, 98801, 59388, 11844, -23324, 29427, 41349, -17989, -50587, 5046, 5479, 1679, 30558, 14136, 26736, 59654, 57352, 32480, 4211, -14880, 22222, 25242, 1184, -17360, -21061, 9493, -11810, 12238, 13414, 66982, 76528, 60908, 53637, 10973, -80944, -79846, -20797, 1886, 54647, 53570, -14255, 38927, 11240, -30300, -34877, -12008, 18192, 57947, 29289, -23058, 29350, 79614, 69041, 38676, 53499, 48256, 40194, 58544, 49537, 61244, 86663, 21994, 1898, 7022, 46326, 109315, 123051, 85216, 94437, 5476, 2989, 78422, 68142, 37230, -7723]
13540g723K3059k4951m2191m7061l770N8872P1312J1256o2170j8944N7526q992
13528F223k642O3721J8512l4661j9409N9655K9854n8768k3212n3231M764j155
13516a0349L732k5829k4543O7017P0737J2810j7249L2527R318q3887m6511k4434
13504c6661m7394l4215Q961n358O497O4799L177j6034K1279L0455n372k8010P2589
13491C4713p89l7791k8725J0400O6232r639o7500j00955k8297N5989P5229P2779
13479D1646l910N191j6999n3396l4435M9575J9953n4404l6944K3326j579l5148
13467i7124r283Q448K7192K4717j5457m9442m556N0459j4326k1092J0877j7164
13455a06751j942r450j3864l5938l8061l1364L584J03538J24620q185l975M193
$$ y = [-7723, 15336, -9615, -51806, -98867, -102637, -43765, 27547, 38803, -23367, -42311, 15215, 6223, 3581, 67302, 85814, 51153, 31744, 91399, 121253, 62485, 39273, -13958, -9194, -10349, -6617, -32446, -56989, 10028, 80765, 93575, 76326, 108853, 118171, 34284, -12227, -36661, -84055, -118270, -109309, -114667, -108170, -43371, -40194, -56228, -34949, -4494, -9866, -37876, 34713, 33924, -3867, -32592, -22192, 44040, 34401, -33099, -134054, -162351, -106362, -31133, 41646, 37736, 42927, 25928, -27468, -61903, -12328, 7625, -46779, -83723, -60397, -61976, -97124, -106407, -97959, -70767, -46050, -61507, -110949, -115505, -65046, -79372, -100464, -89587, -106751, -108693, -118143, -132007, -167945, -206006, -237370, -233786, -130248, -5628, -13813, -17788, -13595]
13443a3595j8556j4264O9312j3416q1909K3767M4464L357J1821j7094K2113M9536
13431F5536l7606k7173K6798J4121r764m6977J6199j1154L41N2528n8248k022
13419a7421J3905M9069L5686j4628k0804l3809n4631n0937N2591N3545p750p578
13407b762q194n603m76k7746K4670R150M3863K5355o423l5018l0915K6713n8333
13394d5719j086k4930M9855L0073K2873k7121k7152J9809J3488K4592k8643L8346
13382D4385Q44n0720r772j3655J8553j1268k8318L4535L320l9343L4504j4190
13370c1125L3716J7866k9430N931L7339Q6374m6953o1562L5230J9912m8154l579
13358A5565L8776n0080k6657J1770L3009l9293n8K8570j0365j02324j5669L0435
$$ y = [-13595, -32151, -46415, 22897, 9481, -72428, -48661, -4197, -840, 10981, -6113, 16000, 65536, 27930, 757, 27555, 41676, 31912, -15065, 1134, -10020, -9679, 42849, -15399, -17421, -3516, 45553, 81239, 66611, 45807, 11998, -42633, -93570, -40979, 12566, 4816, -2762, -10956, -16559, -17035, -44781, -20111, -10961, 32902, 58257, 51834, 16816, -14099, 12614, -45719, -46805, -71735, -21880, 8193, 31066, 3945, -23207, -3398, 10090, 34682, 6039, 44385, 45229, -5491, -15263, -28918, -10365, -21633, -49951, -15416, -12096, -51439, -16935, -31125, 2591, 20457, -8973, -3042, 34297, 120671, 73718, 12156, 47386, 67298, 19144, 15565, 54341, 4261, -22396, -10626, 22383, -16910, -16968, 11602, 1237, -101087, -116756, -86321]
13346h6321l4718J022Q8953p021L1561L6647k1879M5292m529r6806m1910J6012
13334g3697q446m3526K6631N6388J4542L5211P3932L071n8317m4540q661k3129
13322e0541J8035L9123n9705j7143n589K6309J5778J6432k6288j7622L5684J0701
13310a4826K7248k6613m2943j9400M650k2444n219K508J0334j8054M2319J7788
13298d4652j5690k1381j457J0167o042M1736R5012R787k5911l1872l8559k1962
13286e0824l7178O0314M2818Q2989l6415q4135M049O1374J2421l2845j8971J992
13274E589J7675k8965p281N0402N1088J7594l5330n4963J6553m476L6619j166
13262F3339q603M987P1248N3038m5681p6521o2573k3037L0637q1647m4933O0563
$$ y = [-86321, -121039, -120017, -31064, -38085, -6524, 30123, 8244, 53536, 49007, -47799, -89709, -73697, -82143, -125669, -99038, -42650, -28108, 7103, 81035, 84106, 25789, -18751, -27412, -50541, -32506, 6617, -53088, -70231, -75820, -49511, -33733, -17301, -43589, -61211, -25527, -14826, 12422, -14191, -57134, -76534, -71884, -94328, -99547, -97039, -86705, -104759, -62440, -44652, -60342, -81723, -83180, -73013, -79055, -37319, 57693, 67480, 41569, 9697, -28862, -50824, -88002, -27688, 15130, 98119, 61704, -22431, -18382, 42992, 55413, 22568, 3597, 5589, 23264, -5701, -12982, 37420, 88508, 106102, 70772, 15809, 32362, 27886, 64505, 63339, 54736, 59723, 130971, 184009, 138328, 61807, -766, -23803, 6834, -74813, -119746, -59183]
13250e9183k2917J2178N5577k0501M086k3303m2304K4J0268j871k412K0298O7644
13237b416N7278L2852j6138J4335r091J0440j3775p2237M7137L179K970k9842
13225B4692J3265J4538J4123m7241q1755K1238J8726N2625N1660J1018r365m3666
13213C9858n9628k5893J9892R1213J7352J608j8683j7996n7568J0530J3076N4395
13201F8156K7409J3585o4548o8334p991J8804M5901J9302j973M0569j4199m3250
13189C3431k5268K4299O1227J15330J22176N7476q8216j03941o3325n0285K6615
13178A09519k3649o6147j3153j09919J1243J2090P4975P251N2231P9621l7223
13167I6839p0829n8303P8292L7210p7581k069p135j8718P7125O2781J00092N0318
$$ y = [-59183, -82100, -69922, -14345, -34846, -30760, -54063, -96367, -96343, -86075, -87946, -90358, -70060, -2416, 54862, 87714, 71576, 85911, 76820, 87260, 73485, 1248, 48385, 51564, 54534, 24692, 37957, 52495, 66618, 19377, -62378, -41140, -22414, 30211, 81871, 92889, 83524, 39858, -19770, -45663, -25771, 65442, 82794, 84402, 65719, 47723, -9845, 685, 13761, 68156, 95565, 109150, 44602, -23732, -31723, -12919, 32982, 52284, 50311, 90880, 76681, 33431, 8163, 32462, 93689, 209019, 331195, 388671, 300455, 196514, 133189, 82904, 109519, 85870, 19723, 6570, -103349, -92106, -80016, -5041, 2210, 54441, 134062, 96839, 26010, -32293, 45999, 83209, 5628, 3559, -3576, -22294, 54831, 117612, 217704, 268022]
13155B68022n9536Q6064J66149J94731J04383j33508j71575j88889j30371l0007
13145A05463j2000j06495p729L2467Q569J5125j552K0749n893k8525M3832M0925
13133A04936J3205o246l6640J805k523m340M2097l4366o9480j4943Q9699J01544
13121A84748J21096J26832K03585J75046m8452j16051j38645j61203j35308l8829
13111A72819P026q46l2987n887m8536l9897r005P302m2153j5741l4239l3091O1379
13098a3856M2486n0368m7754K2342K6894O6810j2279n25J1639l6806O7546O1680
13086A37809J25792N6242m4921o3534k8453n7536p1540l8971j1354m3776j1965
13075e2207J03910L0660K6843L9091j7152r9822j17990p5233K4332N2431N9318
$$ y = [268022, 208486, 294550, 460699, 655430, 759813, 626305, 454730, 265841, 135470, 105463, 93463, -13032, -20761, 11706, 20275, 35400, 33848, 54597, 48704, 20179, 64011, 104936, 118141, 111895, 75255, 77060, 74537, 70197, 112294, 77928, 8448, -6495, 83204, 184748, 305844, 432676, 636261, 811307, 762855, 646804, 508159, 346956, 211648, 172819, 179845, 178999, 146012, 140125, 91589, 51692, 42687, 49989, 7836, -7905, -42144, -75235, -13856, 28630, -21738, -69492, -47150, -20256, 46554, 34275, 33750, 45389, 8583, 76129, 137809, 263601, 319843, 274922, 211388, 182935, 125399, 53859, 14888, 3534, -40242, -52207, 51703, 82363, 109206, 148297, 131145, 31323, -86667, -161900, -137568, -85137, -25819]
13064b5819j1117l6959J619J6795K3583J6464k4261l2695K217l3975j5540l0346
13052a50034M7812R91j8400L9763J4257j8105J06249j6315K0995k0761k8912o4601
13040h7061m5077J03635L5769J3071n4547o5272J5655J2088m192K9057J6329M8541
13028A7996Q3834J2845o2198l4821n0280J4318M9o83K2250K5044n4612j8873L3765
13015a1366J2790o0103J8033k4479L4156J6726P8459l2237j1585J4363L2456O3373
13003A30586K3446l0038k0639p6896L711M1537J1736J2307J4082K9q6188k8179
12991d506N1521N781K5652j01030k8319M8432M0324J6295M9312n6239p4680l6062
12979f3519k807L7345J9530q796l9734j5253P8135K6074k0456n7463n5012M2672
$$ y = [-25819, -36936, -73895, -72276, -55481, -31898, -15434, -39695, -72390, -70173, -104148, -119688, -150034, -102222, -101231, -119631, -79868, -65611, -83716, 22533, 6218, 27213, 6452, -22460, -87061, -132138, -28503, 7266, 20337, -34210, -99482, -83827, -71739, -75931, -46874, -30545, 17996, 101830, 114675, 52477, 17656, -32624, -18306, -18257, -18940, 3310, 28354, -26258, -45131, -11366, 1424, -58679, -40646, -65125, -30969, -14243, 64216, 31979, 20394, 34757, 67213, 130586, 154032, 123994, 103355, 26459, 30170, 71707, 83443, 95750, 109832, 109861, 23673, -4506, 47015, 52796, 78448, -22582, -50901, -2469, 37855, 54150, 103462, 47223, -27457, -63519, -66326, -28981, -9451, -18247, -57981, -73234, 4901, 30975, 10519, -46944, -101956, -59284]
12967e9284l9779J6358n7543k3984N0263K9133K8132K2887L6872j8143P030j6493
12955b4551j9135j9101j7626m5108K9504Q166q2877l6969L5065O8888P1509J3536
12943a8699j0282k7010n9229K3861M7855N1290K6549r543o754m4514j938O5260
12931C6846M612R3269k1305o8435p6321q246P941k4338j15853q018R3054R378
12919g7416N2477o857L9365k5142m8255n841O67j590k3260K5801n1208m0257k3882
12906a85398j7201M3016J9841j2157M0526K377N5083Q0989j1564k9306K2994L5203
12894D4403m4303n0723j6206L1028M8402L2168j9519m4936N1203K9719q94j4972
12882D5370K3642M9681l0623q9077l4759Q642L6012J5108k2435L9220J4916k7359
$$ y = [-59284, -99063, -82705, -140248, -164232, -113969, -84836, -56704, -33817, 3055, -15088, -8058, -24551, -43686, -62787, -80413, -125521, -96017, -87851, -170728, -207697, -172632, -103744, -32235, -18699, -28981, -55991, -115220, -91359, -43504, 7786, 34335, 24792, 18038, -26476, -28414, 36846, 41458, 134727, 113422, 44987, -31334, -39580, -31639, -55977, -171830, -179848, -86794, -77416, -24939, -31796, 7569, -17573, -65828, -71669, -71002, -72592, -95852, -70051, -121259, -161516, -185398, -202599, -159583, -139742, -151899, -111373, -108996, -53913, 27076, 15512, -13794, 9200, 44403, 100, -50623, -66829, -35801, 12601, 44769, 25250, -19686, 31517, 61236, 60342, 45370, 69012, 118693, 88070, -1007, -35766, -27124, 8888, 23996, 1561, 40781, 55697, 28338]
12870B8338J4586O640p5527j1748O3842K4996p5461m2240J9158l4902j8812L1206
12858f9924L3647N1444K1822j6711j1906N641K3398Q4835j161j5679n3557n4207
12846b358N9139N3098J2991m6246l1979k4004j3549m0835m3538j5913m236L5290
12834f2140J10585q58l5765l631J2004m0924L0989M8708q013J271j0737n7975
12822a6486l1387K6822m1743K3363K8038l8639K5603N3961k0239l0374j0912M0888
12810H895M8121L0070n6035k557m351n0585M5341N0460R8958m4127j08292K130
12798A8028j496K9556m5084K565R047k9261j6230M5252k9116k5537J5220J24487
12786I7431N4332p5974j02569R94k4614J1956q1098r857M1746L4169r673k2919
$$ y = [28338, 42924, 49564, -25963, -37711, 26131, 51127, -24334, -66574, -47416, -82318, -101130, -69924, -36277, 15167, 36989, 20278, 8372, 14013, 37411, 122246, 121085, 105406, 51849, -2358, 56781, 109879, 122870, 76624, 44645, 20641, 7092, -33743, -77281, -93194, -97430, -62140, 48445, 47587, 11822, 8191, 20195, -20729, 10260, 58968, 50955, 52226, 41489, -16486, -47873, -21051, -62794, -39431, -11393, -50032, -24429, 29532, 9293, -21081, -31993, 8895, 57016, 87086, 31051, 28494, 24143, -26442, 18899, 69359, 168317, 124190, 15898, 18028, 16532, 46088, 1004, 3569, 12616, -16645, -32875, 12377, -16739, -42276, -27056, 97431, 151763, 75789, -26780, -25786, -50400, -38444, -119542, -129399, -87653, -53484, -63157, -86076]
12774h6076N434L6666J3415l8888K4728J2003J7884N8113N8766o6918m9146j1049
12762b5068M7715J6463K3667K7004K9595o632j7745o71J3089P291J3366k3017
12750A05057j7974K493p0207o4594n8467N8965O8455J056N181M3983n017m2131
12738B6800m1113N4521M6799k846Q655j5300L0424k797j0884j27181K5221K5390
12726A7689L9318K1974J7964n5529k3023o1189n1324M9124K8902J921p710M177
12714a7706P900O974P36k2314l0290M3349M4145k3072J4363q317m4740j4230m476
12701d7678P333K0749K9075L4774L6129k5220m6327l6696j8489o7349j2888L7173
12689h9414O6064K4355j4604L4939O3437M4369j6833l3288p3845p3698p75M4217
$$ y = [-86076, -80642, -43976, -30561, -69449, -44721, -32718, -14834, 43279, 102045, 35127, -14019, -25068, 22647, 39110, 62777, 89781, 119376, 112744, 94999, 94328, 107417, 114708, 128074, 105057, 87083, 89576, 19369, -45225, -103692, -44727, 23728, 24784, 29965, 73948, 68931, 26800, -14313, 40208, 87007, 84161, 92816, 77516, 107940, 105143, 94259, -32922, -7701, 17689, 57007, 78981, 96945, 41416, 18393, -42796, -94120, -44996, -16094, -14173, -21883, -17706, -9806, -2832, -2096, -24410, -54700, -11351, 32794, 9722, 24085, 15768, -28972, -43202, -47678, -40345, -19596, 9479, 44253, 80382, 55162, 8835, -27861, -46350, -113699, -126587, -89414, -23350, 1005, -13599, 21340, 84777, 129146, 112313, 79025, 5180, -68518, -69293, -25076]
12677b5076O104K8508k2535K3155j0018o106L0516j7544O977m8693o609J148j3878
12664e4051l0151N3992O8210p184l9430j3498O4167k9592k8646l0505k4458P4629
12652C483K8370n5500l041J6183K5121M0803M7842j684l3969j4589p699p9842
12640c4522k0913J6804L3189L7288J3917j5655r023J3709l530L2157k3944q447
12628C1030K0953M2386M1860M3032K0064q3531k3527o6720p082J6708k921k1231
12616A1021M318O9577J6821j9647L558n8077p8174O664K3518K8137p839O6404
12604F6281M3627l896M4034P2650J12839N0682j26150j41950m7987n3078k2810
12593e758M6950j7959l2804k9328K9180O5404k0055k4409L8768K3129p048m5872
$$ y = [-25076, -18972, 9536, -12999, 10156, 138, -5968, 24548, 7004, 13981, -34712, -41321, -40173, -54051, -84202, -30210, 38000, 30816, -8614, -22112, 42055, 12463, -16183, -46688, -71146, 3483, 31853, -23647, -26688, -10505, 14616, 55419, 103261, 101577, 67608, 53019, 45320, -34522, -55435, -38631, -5442, 31846, 45763, 30108, 21085, 34794, 31264, 63421, 39477, 31030, 51983, 94369, 136229, 179261, 199325, 115794, 92267, 25547, 18465, 35173, 32252, 11021, 15339, 84916, 101737, 82090, 85648, 27571, -50603, -43939, -20421, 7716, -123, 66281, 109908, 106012, 150046, 222696, 335535, 386217, 260067, 118117, 70130, 17052, -5758, 41192, 23233, -9571, -38899, -9719, 55685, 35630, 11221, 49989, 73118, 66070, 20198]
12581B0198N809k6323L2158k5752k6946L6876J996k492o9135J2436Q8630J13627
12569A61082o7683o6114n652M374j2840m2040J1131M9779K3132M532o6649n2189
12557e9137R8117J9049n1896q5943k2436K1295M9072o472l5775k2665J4564P7631
12545d596O232R266k2950l9850J9108j350m7260l2950J8066K7453m6290O4966
12533e0155N8855o7245k2983N1562M1660L2178J9789K8516o5146j7999N3267K177
12521F4476p0254r1518K437J7187J9N9591J6673R899M2922l8333p5317J5706N0205
12508C693K9222q406n8714J7463O1162O086j914O3708M3410j27518m6518k1915
12496d0241J342J9850K8280R160l7775j378L2345n7229j439N4139J5043j3412
$$ y = [20198, 26007, -316, 31842, 6090, -20856, 16020, 18016, 15524, -53611, -41175, 47455, 161082, 93399, 27285, 21633, 26007, 13167, -28873, -17742, 32037, 55169, 59701, -6948, -59137, 38980, 58029, 6133, -79810, -102246, -80951, -31879, -38351, -74126, -96791, -82227, -4596, 1636, 10902, -12048, -51898, -32790, -34140, -81400, -114350, -96284, -68831, -115121, -50155, 8700, -58545, -81528, -29966, 11694, 43872, 63661, 92177, 27031, 9032, 62299, 64476, -5778, -97296, -94859, -77672, -77653, -18062, -1389, 8510, 51432, 13099, -62218, -46512, 3693, 32915, 24509, -34205, -16742, 44420, 50506, 48592, 112300, 155710, 28192, -18326, -40241, -38899, -19049, 9231, 18391, -19384, -20762, 11583, -45646, -47085, 7054, 22097, 8685]
12484H685r0860P905L4219J46823P9008n3792m0102q0513j9631K8754J2125r749
12472B2872J0614k7703L277j8841j0552j6944p1511k745q879Q8793R1668j7272
12460D2777n2705l2738l2187M9991M4768q173J0199j8429n0543j6716N856K8790
12448b9110M7175K410k3975p7655k2347K6016Q4992q2214l7060N3095Q2280K7470
12436E1077l4925K9269K5804k7572m5311o2672O297J8284J9957o290j6355J5200
12424b7237L5840K2216j5691M8387K5798m0658L82K1699N0620K5588n4196r2549
12412A99k2538j0503J0292p797j9070N1985k1476L3813L3177q6747J232J10646
12400G3213P8889n837o8630j9082P522O5749l2334m6011l0100q8442J7394K8613
$$ y = [8685, -82175, -74270, -40051, 106772, 185780, 131988, 91886, 11373, -8258, 20496, 32621, 22872, 33486, 5783, 9060, -9781, -20333, -37277, -108788, -111533, -120412, -31619, 60049, 42777, -9928, -42666, -74853, -24862, 19906, 11733, 21932, 3503, -47040, -63756, -57900, -29110, 18065, 20475, -3500, -81155, -103502, -77486, 7506, -74708, -111768, -58673, 23607, 51077, 16152, 45421, 71225, 43653, -1658, -64330, -58033, -39749, -19792, -26082, -42437, -27237, 8603, 30819, 15128, 63515, 89313, 48655, 49037, 70736, 121356, 146944, 92748, 199, -22339, -32842, -22550, -30347, -49417, 2568, -18908, 14905, 48082, -38665, -37433, 73213, 152102, 146265, 77635, 58553, 66075, 131824, 99490, 53479, 23379, -65063, -47669, -19056]
12388a9056P304J2142n004K0058j7718k0300M694M9655J09215k4548j07242K537
12376A1737L5724J1132L3810j5785M1673J26056P55r8132q4160J3245k4901l8314
12364A2840m0995o0960Q825K7758M6667r10q0337k6342P9283L9663P245k3852
12352a1115j289j4891k093N8889K1524j0529m537Q360k9902M8058J161o4481n2935
12339e3780N7168Q7401L1583q885O550p3788q4261J1037J9562O7060O7339K7718
12327A54704l3179o6634p4490L3917L1519L7243Q855j30278j1430L2896L2619
12316A5742O5534L2972N3154P987j3771m1895L2636j5262n6964k4532M7443j8563
12304H4481k2920K3975O1207Q4435k0460n716R0688n6729q387Q7396Q2138R0952
$$ y = [-19056, -11752, 390, -4614, 15444, -2274, -22574, -17880, 31775, 140990, 116442, 9200, 11737, 47461, 58593, 92403, 76618, 118291, 244347, 245102, 146970, 62810, 76055, 51154, 12840, -28155, -89115, -80290, -52532, -5865, -6775, -87112, -113454, -34171, 5492, 12737, -11115, -12404, -27295, -29388, 29501, 51025, 40496, 35959, 44319, 14417, 62475, 63636, -845, -53780, 3388, 90789, 122372, 113487, 120037, 46249, -38012, -26975, -7413, 59647, 126986, 154704, 121525, 54891, -19599, 14318, 45837, 83080, 91935, -38343, -49773, -16877, 15742, 81276, 114248, 167402, 175389, 161618, 119723, 152359, 137097, 80133, 55601, 103044, 84481, 61561, 85536, 146743, 231178, 210718, 205002, 295690, 238961, 230574, 317970, 400108, 491060]
12292D91060J27250J20780J6067Q1653J50750K37409K88948L87300N77371P80370
12282C258958J138741K030160L929392O956213J1110369J5804480J5028948n792387
12274E3464874k1594742j4534981o743900l321145j926817j111400p85549o83786
12266B762554m17304l41384l45291k18030j53153q9017k11766j78441q5642q4247
12256F38279j16806r9399K727o3342j4818l4902l7313p3k4939L1257J1384k7427
12244B64628o9M4228q813j7264n2907j16464m5655R0195m8499o9775L0404N9911
12232A29920P9675j6087l7857l0637j5375r4271j0709L7369p373o7129j1923J9442
12220b4955n553M260j4335m252K5139J00902M6940o1622o988l4689k6623K3348
$$ y = [491060, 618310, 739090, 755157, 836810, 987560, 1224969, 1513917, 1901217, 2478588, 3258958, 4397699, 6427859, 10357251, 17313464, 28423833, 44228313, 59257261, 53464874, 31870132, 17335151, 10591251, 7270106, 5343289, 4231889, 3446340, 2762554, 2345250, 2003866, 1658575, 1440545, 1287392, 1198375, 986609, 808168, 722526, 638279, 521473, 422074, 424801, 361459, 346641, 311739, 274426, 274353, 249414, 280671, 292055, 264628, 264559, 308787, 299974, 282710, 229803, 113339, 67684, 157879, 109380, 39605, 70009, 129920, 209595, 193508, 155651, 125014, 109639, 15368, 4659, 42028, 34655, -32474, -44397, -24955, -30508, -26248, -40583, -44835, -19696, 81206, 128146, 66524, 59536, 24847, -1776, 21572]
12208B1572M7548L1523K839q897L0429n0842l8415M9376O0071k958l501l7599
12196A01146m0671L120k3947j2337n282k8071L6569J702J4930L9816J3297k668
12184I7604l5647n0196P518q275M8835J7406J9697J8522m5509m6337P1480O1172
12172A56270L8955M4537J2042o9938n1394r478n923m5255J258r809j6289K0490
12160F5466J034n879l3013N004J1687j0837k2789l5053J656N1187J360j2519k8928
12147a1624j7244J7423l634J318j4381q075k8066l7379j5858K9735N6004K4237
12135g544Q260K0638N037R664L7830N8178l1543p8230k7277l2246M590N7061N0957
12122G5375L5024k7436l1627K8393M9548J5478P86K4410j9314j6475k5238l3639
$$ y = [21572, 69120, 100643, 103482, 94585, 125014, 74172, 35757, 85133, 145204, 142246, 138745, 101146, 60475, 63595, 39648, 27311, 22029, -6042, 30527, 32229, 47159, 86975, 100272, 97604, 61957, 11761, 19279, 11004, 59839, 77245, 96942, 115464, 69955, 23618, 95098, 156270, 195225, 239762, 251804, 181866, 130472, 120994, 115071, 69816, 71074, 61265, 44976, 65466, 66500, 60621, 27608, 32612, 44299, 33462, 10673, -24380, -22724, 28463, 29823, 17304, -11624, -28868, -11445, -15079, -13761, -28142, -36217, -64283, -101662, -117520, -87785, -31781, -7544, 716, 21354, 26391, 36055, 73885, 132063, 100520, 22290, -4987, -37233, -32643, 24418, 75375, 110399, 82963, 51336, 79729, 129277, 144755, 145541, 169951, 150637, 134162, 108924, 75285]
12110G5285k0390k763q7388m2833N3755Q022k7619n7686k733J5740L8971M3675
12098e964k8631k5817M4133O6479M3984J2145J1587L2394l6319m4141Q734Q649
12086H7233r570J0159p7433o9174l4414n727l5150M6380M9072R2056L1748n6592
12074B8588l3931k9893K9699O4414P1222J420j1077P881j9182j7146J8592k5056
12062H5531k4136l828n2905j13438L8690N7825J2171P5994j01540m7064r592J8597
12050f3695P3965r260p1384r66J65252J45341R7325J24416J16742l5230n1130
12039D91376r2391q1402j6500k2934j3151r6647m1624j0359J1767j8351j1926
12028I7858K5209O2250k304K347m0397L3986O1058q398R13J978P676L4713n4371
$$ y = [75285, 54895, 52132, -35256, -78089, -24334, -16312, -43931, -101617, -104350, -88610, -49639, -5964, -34595, -60412, -16279, 50200, 94184, 106329, 117916, 150310, 113991, 69850, 78584, 87233, 77663, 87822, 10389, -58785, -93199, -98926, -134076, -87696, -38624, 53432, 85180, 28588, -5343, -35236, -5537, 58877, 130099, 131519, 120442, 128323, 109141, 91995, 110587, 85531, 61395, 57567, 4662, -108776, -70086, -12261, -90, 75904, -25636, -72700, -82292, -63695, 10270, 1010, -70374, -71340, 93912, 239253, 336578, 460994, 577736, 542506, 491376, 398985, 317583, 301083, 278149, 264998, 168351, 126727, 116368, 128135, 109784, 97858, 123067, 185317, 183013, 185360, 144963, 178949, 240007, 231609, 232522, 234500, 242176, 276889, 222518]
12015B22518l8012o441p775K5619n1854K7406M0810m378l1962K5564K4421k0534
12003B05382L8892N0021j0719n0866j00617j9566N9122M3392L5134P6708K9139
11992C56022P9252k7586n8134l4843o7823L3483K7777J4186O5434k8569j0063
11981C49136M5861M0889L3558k549n806L7077M6360Q8227O9224k5955l7911k5679
11969F12432R0811O5379M5449j9999J9855l6133L226P1596R0728Q9026P7468M8558
11957A158396O8152O5486M039J4777J34678J24991J28566O6203M0604J09918Q2726
11946A998536J90738K27829K11192K30363K27299K80076L15200L27081M87680
11937D495994M61272M39404N68669Q35214J070850J295595J568771K058896K576470
$$ y = [222518, 184506, 178065, 170290, 195909, 144055, 171461, 212271, 207893, 175931, 201495, 225916, 205382, 244274, 294295, 283576, 232710, 132093, 112527, 171649, 215041, 250175, 326883, 356022, 435274, 407688, 349554, 314711, 246888, 280371, 308148, 322334, 387768, 359199, 349136, 394997, 435886, 469444, 466895, 461089, 498166, 544526, 632753, 701977, 676022, 638111, 612432, 703243, 768622, 814071, 794072, 813927, 777794, 781020, 852616, 943344, 1032370, 1109838, 1158396, 1226548, 1292034, 1296073, 1310850, 1445528, 1570519, 1699085, 1765288, 1805892, 1915810, 1998536, 2189274, 2417103, 2628295, 2858658, 3085957, 3366033, 3681233, 4008314, 4495994, 4957266, 5396670, 5965339, 6800553, 7871403, 9166998, 10735769, 12794665, 15371135]
11928A5371135L421378M705508O753079R842045J5309831K4494475L9020506N8766839
11920A77684796Q0226592R0792827N5681299m1768227j06231631q9762070n5293553
11913A11330033l2681566k0343643j3302111r127110o472298m753502l652176
11906B0997627k842554k303582j959953j696236j427030j208347j072427q48313
11898G639185p43599o44116m91798m29057k93778k14138q2764M7701R0333L07999
11888E185968M42790N45243O58994O49951O66636P44781P48848M83379q7939o23249
11878I415402r16956r51424q12680p86855q72191p77269o31368n61376n10106
11869B595177l53819k26679k47677j63351j54911r8288r5279j29181j46329j2641
$$ y = [15371135, 18792513, 23498021, 30251100, 40093145, 55402976, 79897451, 118917957, 177684796, 257911388, 348704215, 404385514, 362617287, 256385656, 166623586, 111330033, 78648467, 58304824, 45002713, 35875603, 29403305, 24649803, 20997627, 18155073, 15851491, 13891538, 12195302, 10768272, 9559925, 8487498, 7639185, 6895586, 6251470, 5759672, 5330615, 5036837, 4822699, 4739935, 4787636, 4877969, 5185968, 5628758, 6174001, 6832995, 7482946, 8149582, 8894363, 9643211, 10126590, 10038651, 9415402, 8498446, 7547022, 6734342, 5947487, 5075296, 4298027, 3666659, 3105283, 2595177, 2241358, 2014679, 1767002, 1603651, 1448740, 1350452, 1255173, 1125992, 979663, 967022]
11859I67022m6682p5172J1344p8813m5859K73n1698j7037j5719k116r0723k6250
11847E28570K380J9896Q437l7072r681n7731L2422J518n579K8628N9946K8384
11835F00118l3713J115p1683o7332k409l9812M6677M8570P432J7125l0380L3764
11823E09472J9875J1826j9289k0145q5158l4939q679r7059k4079O2063L2731K9329
11811C75948m2234n4823J6129m4376m7701k4067k7153o4431L5819J18589k2025
11800B19675n8892l8142m1461K686L8631K4366O4753M3775M6890L0443J40471
11789D73195L9656r56m1944k6745l4410r5449r2335n333P9002J3219m5589k2511
11777B39800j1997o3909M1173L4433K8015p4357l5592j4551P723N3081K5633k8899
$$ y = [967022, 920340, 845168, 856512, 777699, 731840, 732113, 680415, 663378, 647659, 645543, 554820, 528570, 530950, 550846, 559283, 522211, 512530, 454799, 487221, 488739, 483160, 511788, 571734, 600118, 566405, 567520, 495837, 428505, 426096, 386284, 432961, 481531, 488963, 506088, 475708, 509472, 529347, 541173, 521884, 501739, 416581, 381642, 372963, 275904, 251825, 313888, 346619, 375948, 333714, 278891, 295020, 250644, 202943, 178876, 151723, 87292, 123111, 241700, 219675, 160783, 122641, 81180, 83866, 122497, 146863, 211616, 255391, 302281, 332724, 473195, 512851, 511895, 469951, 443206, 408796, 313347, 221012, 215679, 294681, 307900, 262311, 239800, 227803, 163894, 205067, 239500, 267515, 193158, 157566, 143015, 150738, 203819, 229452, 200553]
11765B00553p3565m3473l0736L4723l2065q164L8643K5024J3685j3691K0399P4493
11753B05826K2582m4596L309j9276n3228k0703j2396J2409j0284k1418j7658n6491
11741a1924J2296j3384o464Q570O6607N7583n2944N0954O6670o4623o5284l2642
11729A5415n173j2459N6681J6527J4711j0551m4605k1959l5548Q3550M8703l8673
11717F6619k0952M140m275K5699j904j0964J3736N3205j3468n9579m4248j0683
11705b674L6300J6896o6951k5601O3940J6846J1410K6053L8025k3535n9164K2072
11693E3617J4101j3623p1841p43R1362O1657J5887q0817q2205L3599K1765K7192
11681F9951L1556k477k0097Q4774J4965n6349j5635K7972k9460j5406L3797p2637
$$ y = [200553, 126988, 83515, 52779, 87502, 55437, 47273, 85916, 110940, 124625, 110934, 131333, 205826, 228408, 183812, 187121, 167845, 114617, 93914, 81518, 93927, 83643, 62225, 44567, -11924, 372, -13012, -19476, -10906, 55701, 113284, 60340, 111294, 177964, 113341, 48057, 15415, 10242, -2217, 54464, 70991, 85702, 75151, 30546, 8587, -26961, 56589, 105292, 66619, 45667, 49807, 45532, 71231, 69327, 58363, 72099, 125304, 111836, 52257, 8009, -2674, 33626, 50522, -16429, -42030, 21910, 38756, 50166, 76219, 114244, 90709, 31545, 53617, 67718, 54095, -17746, -18489, 72873, 134530, 150417, 69600, -12605, 20994, 42759, 69951, 101507, 99030, 78933, 163707, 178672, 122323, 106688, 134660, 105200, 89794, 123591, 50954]
11669E0954k7415R8215J69965J82724K62966M16239N69255P71964Q61356N1140
11659C407363r91425j026051m88097k47507j16594q2373k4307o2596M1540k0395
11649C89558m3868o1408n5737q4237m3449J0155P073n1481J359O5591O0871P899
11637B02326M8122M1326M1028P1772J32924J93528L64716N58729P90966Q88133
11627C333570K26269q53062j011008o79496l62942j86318o4252j06963j09324
11618A86474p7725j8327l188r52J2055q30o6291n45o922l6211P2029M9957J8160
11605A27684P152k6161j5709L1387k8201k9284n1864P4616O0437q867m8550r0608
11593B032M0560n0221m0379m1252K657N0025P1838J3449L2649L907k6777o185
$$ y = [50954, 23539, 121754, 291719, 474443, 737409, 1153648, 1722903, 2494867, 3356223, 3407363, 2415938, 1389887, 901790, 654283, 537689, 455316, 431009, 368413, 409953, 389558, 345690, 284282, 228545, 144308, 100859, 111014, 118087, 66606, 67965, 133556, 194427, 202326, 250448, 291774, 332802, 404574, 537498, 731026, 1095742, 1654471, 2445437, 3333570, 3559839, 2706777, 1695769, 1016273, 653331, 467013, 402761, 295798, 186474, 108749, 90422, 87234, 86282, 98337, 97507, 31216, 30671, 23749, -12462, 59567, 109524, 127684, 134836, 108675, 92966, 124353, 96152, 66868, 15004, 89620, 150057, 141190, 92640, 2032, 42592, -7629, -48008, -89260, -86603, -36578, 35260, 48709, 81358, 85265, 58488, 52303]
11581E2303L2578l676l6336N3358J162l9799j23980r310N913J1859N1128J8487
11569A3687O0525L4891P981k3765k9219o2488n2790l037P8064Q7875P5014j3403
11557A73335j00045q4751j6956K7900M393q698j0351K5401L7979l8405n1313P1444
11545B9933P0869j4570m6839o4669n2026N9595K7276m8685k8925n423k1123k9453
11533a24040N6997O1323q972l6133M4359O8487J1274K7505l8211n3884M6878J5751
11521G1334m4426K8782J5175L2708j6584n1359J518J1216j03839j4082N4584N5051
11509D0078O651J6778k8622l4601k1444m3859K8397j0229L4142K516J0515j0793
11497a0471j9370Q415m2514l2013L2766M5914J09837n6331j50024n2485O071N1956
$$ y = [52303, 84881, 81205, 44869, 98227, 99389, 59590, -64390, -73700, -67787, -55928, -4800, 13687, 74212, 109103, 117084, 93319, 64100, 1612, -51178, -54215, 23849, 111724, 186738, 173335, 73290, -11461, -28417, -517, 3876, -4822, -15173, 10228, 48207, 9802, -41511, 29933, 100802, 86232, 39393, -25276, -77302, -17707, 9569, -39116, -68041, -73464, -94587, -124040, -67043, -5720, -14692, -50825, -6466, 62021, 73295, 100800, 62589, 8705, 55583, 71334, 26908, 55690, 70865, 103573, 86989, 35630, 37148, 48364, -55475, -69557, -14973, 40078, 46729, 63507, 34885, 284, -21160, -65019, -36622, -46851, -12709, -10193, 322, -10471, -29841, -21426, -63940, -95953, -63187, -17273, 92564, 36233, -113791, -166276, -160205, -108249]
11485a08249K8730m338o101P9224l3099K7467M791k3756K8711n372l8134l847
11473e3973Q4862l6102o3264L8416L9808O6642m73o2368j8544M0153J5236n1407
11461a014n0829n422o204n8569p3195M1939N0381j486N6582L9800M0158p588l305
11448B1248J02676L4768O511o0512J77k8880K7122j0955O828j2581p681K3342
11436A02063r8704m0205N8105N6103Q710k1882m6233j504j4098J1095J4165N3998
11424H1613Q85o0243l8144K3044L501k0268l6204j6634k2940L8242R780n1887
11412h9255l9691j540O3811P6934M2415j2092l0933M7742O999m3p6085Q18J4526
11399C606n1024k4543j5217j1935J5783J8408M5556j3494k0999O2489L4373j05521
$$ y = [-108249, -79519, -83857, -89958, -10734, -43833, -16366, -11575, -35331, -6620, -11992, -50126, -53973, 30889, -5213, -68477, -30061, 9747, 76389, 75916, 13548, -4996, 35157, 50393, -1014, -51843, -57265, -63469, -122038, -195233, -153294, -102913, -104399, -47817, -8017, 32141, 24553, 21248, 123924, 158692, 165203, 104691, 104868, 75988, 103110, 92155, 98983, 86402, 78721, 102063, 3359, -36846, 21259, 77362, 86072, 64190, 17957, 16453, 2355, 13450, 27615, 81613, 82498, 22255, -15889, 7155, 10656, -9612, -45816, -62450, -85390, -47148, -37368, -89255, -128946, -130486, -66675, 10259, 52674, 40582, 9649, 57391, 64390, 64347, -11738, -10920, 3606, -47418, -71961, -87178, -99113, -83330, -64922, -19366, -32860, -53859, 8630, 43003, -62518]
11387f2518L3273L4844o260m4495m7760M1818P1405j468m2210r348N6117K8161
11375E1559N6467P5130j00983j25373J3949K4717P4220J0904M0751K0378j5284
11364A26435l2961p9586k7401o065k6114L6833K9005J9321P8530k1723j13757
11353a7483l2597J24671J8495j8082N1709m9850o9671O6752J9010o3898l2371
11342c315O3182P904n7250n660L3427o449J1623l8448J1034L0767J5894j5684
11330D7025o5556r61K8259N328K403k8298k5210N220k1029P745j0092K515n1746
11317a04397O141M9523O3250P272k188n6222m5196L4208K4381l8544j1393o6521
11305a39686N6487M8765J658o152p0032k4582O1291J05655Q482j17588l5570N4713
$$ y = [-62518, -29245, 5599, -661, -45156, -92916, -51098, 20307, 18839, -23371, -32719, 23398, 51559, 108026, 183156, 82173, -43200, -29251, -4534, 69686, 80590, 121341, 141719, 126435, 93474, 13888, -13513, -19578, -45692, -8859, 20146, 39467, 117997, 96274, -17483, -50080, 74591, 93086, 75004, 126713, 76863, 7192, 73944, 92954, 29056, -3315, 59867, 67771, 10521, 4861, 38288, 31839, 43462, 5014, 16048, 46815, 62709, 47025, -18531, -19492, 8767, 14095, 16498, -11800, -37010, -31790, -52819, -45074, -55166, -52651, -104397, -98256, -48733, 14517, 21789, 19601, -36621, -81817, -47609, -23228, -61772, -73165, -139686, -83199, -34434, -32776, -38928, -108960, -133542, -72251, 33404, 41886, -75702, -111272, -56559]
11293e6559L4785O3802k7581r2598p396M2079M8407j7576m1467O632j7845k150
11281f7467N309K9754K0278P752m093O4976j0732l5404n0925N5058L2952n9458
11269a2000M917l6099N71N5135L6851J6305P258j294p2318k65M2967k7011q1378
11256f6361j21496M5833O2481k342k8573M368Q3042J4530n3204K3974L1534l0150
11244c6364j3224O5986J3493k0778j06499n2285j987M8555P6648P971L488J8097
11232C101r017o162n1131j8859L2398Q1854o9757n5458K2394J7773R9458P703
11220E4297n5044l4991K5971K173K5356O144O37j8515L3445L5807J4824Q7408
11208A77512J70454J54608K71695K61620J14104n5762j09627j82479k94429k25423
$$ y = [-56559, -21774, 42028, 14447, -78151, -85547, -43468, 4939, -12637, -54104, -47472, -65317, -67467, -62158, -32404, -12126, -4374, -8467, 56509, 45777, 10373, -40552, 14506, 47458, -12000, -7083, -43182, -42611, 12524, 49375, 65680, 72938, 71644, -674, -939, 42028, 15017, -66361, -187857, -142024, -79543, -81885, -110458, -106090, -23048, -8518, -61722, -37748, -6214, -36364, -49588, 16398, 29891, 9113, -97386, -149671, -151658, -103103, -26455, -18484, -14996, 3101, -5916, -12078, -63209, -82068, -49670, 32184, -37573, -93031, -70637, -52864, 46594, 54297, -747, -35738, -9767, -7594, 17762, 23906, 24543, 6028, 39473, 75280, 90104, 177512, 347966, 502574, 774269, 1035889, 1149993, 1094231, 984604, 802125, 507696, 282273]
11198B82273j32604k2316l2808m4540p5737N068j4382p010N6598m915L4878n1499
11186f994q6461j2670l8305R6115Q1811q725L8543M5005o4151j4719m4985j6822
11174c2358j1140m8898k3557K6677L9950M549L3735K8391K195r3066J7549P9628
11162B3655m1287j8916m2742Q654q851J3880O8815J8487M3888M1423k2597p5280
11150I129R03K6315N202q3070o7617j2855l550N3860M7082M2708L65n7368J9633
11137a9263J5932M6667R58j872o034j1813m3944l1532M91n9233K8769O7877L1949
11124A8952P5048K3589k6796n3575n3341j4313j4019K144L9229l138l6701P3141
11112C0220O4514K0284l3325k7723l9342L7011O7927r4959l6439L8188j710k9728
$$ y = [282273, 149669, 127353, 94545, 50005, -25732, -20664, -35046, -42056, 14542, 9627, 44505, -6994, -93455, -106125, -144430, -48315, 33496, 24771, 63314, 108319, 44168, 29449, -15536, -32358, -43498, -92396, -115953, -89276, -49326, -44777, -11042, 17349, 19544, -73522, -55973, 23655, -17632, -36548, -79290, -70636, -79487, -65607, 3208, 21695, 65583, 107006, 84409, 9129, 10032, 36347, 41549, -41521, -109138, -121993, -125543, -71683, -24601, 18107, 18472, -38896, -19263, -3331, 43336, 44294, 42422, 36388, 24575, -19369, -50901, -50410, -109643, -80874, -12997, 18952, 94000, 117589, 90793, 37218, -16123, -30436, -44455, -42311, -3082, -6220, -42921, 30220, 94734, 115018, 81693, 53970, 14628, 51639, 119566, 24607, -11832, 26356, 24646, -5082]
11100e082l8240k3681J9182J0933m214J6349J8162M2466L2955K8745k5264k0246
11088E2065q5596k2325K3237J5301K5154p0047p0394N6928N8535J1664l0698R175
11076b7001O3681k6064o5559P3450r092j6485P093J1266J060n3958m3348j9458
11064a04415P134L7868J6677m2611O162J8563N3354M6446L2310M6684K2788j7679
11052A23281j4771J98m2439k6393O0821J5124k6620P3360R6552l5845l9539N0079
11040B33808J5542P950j5894Q5128P1992P0387J02113J53233M5262m2874p2218
11029F54429q0205j03219p9145O6253R7273P1372J03728J33697J00662R8521j22599
11018I40767j92464j32136o9474l2377M2306M7748O9133j2373j7278J43507L2496
$$ y = [-5082, -43322, -67003, -47821, -36888, -41102, -24753, -6591, 35875, 68830, 97575, 72311, 52065, -33531, -55856, -32619, -17318, 7836, -62211, -132605, -75677, -17142, -5478, -36176, -27001, 36680, 10616, -54943, 18507, 9415, -7070, 23, 11289, 12349, -41609, -84957, -104415, -97281, -59413, -42736, -85347, -79185, -60622, -7268, 39178, 71488, 118172, 140960, 123281, 108510, 108708, 66269, 39876, 100697, 115821, 89201, 162561, 259113, 223268, 183729, 233808, 249350, 257300, 241406, 326534, 398526, 468913, 571026, 724259, 769521, 726647, 654429, 574224, 471005, 391860, 458113, 555386, 626758, 730486, 864183, 964845, 1063366, 940767, 748303, 616167, 546693, 514316, 556622, 604370, 673503, 661130, 643852, 787359, 819855]
11007H19855q2945j29629p1531r3052j09739k8232n2034M070Q8379M6797J8886
10996D10825k1284q5041m5853p5010j18859p6937k4252M2968p408L327N6877N2934
10984A12287Q614q678k3876m1574k3275j4447l5374j285n810o5494j7853L908
10972a12857L7226J4449J4061L0295P905j3045O4406N5133L6936M2586K6014j9130
10960A83979p7427j6163M3602R7716O9942J51931K89798J91919K2882L3096J13609
10949A104884j5804j36647k01153j30503j2598J2057j41707p5063r0775k9198
10939B83493l1491q1144j18359l7149K7267k5687j4429l091M315J6000K6676N58
10927D6959M1057j3640l110O1761K2450P653o100K7091N013m2329K9525L0105
$$ y = [819855, 736910, 607281, 535750, 442698, 332959, 304727, 252693, 256763, 345142, 391939, 410825, 389541, 304500, 258647, 183637, 64778, -12159, -36411, 6557, -851, 2476, 59353, 112287, 120901, 112223, 88347, 46773, 23498, 9051, -26323, -27608, -33418, -98912, -116765, -112857, -75631, -61182, -47121, -16826, -8921, -21966, 42440, 97573, 134509, 177095, 203109, 183979, 106552, 90389, 133991, 231707, 301649, 453580, 743378, 935297, 958179, 991275, 1104884, 1089080, 952433, 751280, 620777, 608179, 620236, 478529, 403466, 312691, 283493, 252002, 170858, 52499, 15350, 42617, 16930, 2501, -590, 3725, 19725, 46401, 46959, 88016, 74376, 71266, 133027, 155477, 163130, 157030, 184121, 189134, 146805, 176330, 206435]
10915B06435o257J44654R3353K0581o8219m2126l7718o5520r7270o6066J1118
10904I2965M8668r2328o8134k6354k4424L3005K1403k7275J1011m096J0775J7159
10892g625l5592n5470J3397M7124O138j8422j8004M3869k2951M8686K1468O0602
10880H3220K7818q590j12353q636j959k9632R231k8130n317P758O8378k9190o6761
10867i4163J1316J8466j634J7760M1897J05866K7941m2395j6786m8544K1913J8147
10855E9784o9664Q12O871k1038K6248M5126P8296N0111K0876j5819p860J2358
10843A86101o4435n9018m5838l9527q539K8898K2064M9649K8240o0134n035n3355
10831b0929L1854J2964j2317N5704L7286L5978J2319n5817l2528o1776L8194j5084
$$ y = [206435, 200178, 344832, 438185, 458766, 390547, 348421, 310703, 245183, 147913, 81847, 92965, 141633, 49305, -18829, -45183, -69607, -36602, -15199, -42474, -31463, -35559, -24784, -7625, -43217, -98687, -85290, -38166, -32028, -50450, -68454, -24585, -47536, 1150, 22618, 83220, 111038, 102448, -9905, -18541, -20500, -50132, -40901, -69031, -74348, -66590, 1788, -27402, -94163, -82847, -64381, -66015, -48255, -6358, 99508, 127449, 85054, 68268, 19724, 41637, 59784, -9880, -9068, -2197, -23235, 3013, 48139, 126435, 176546, 197422, 181603, 173743, 186101, 121666, 62648, 16810, -22717, -31256, -2358, 19706, 69355, 97595, 37461, 32426, -20929, 10925, 23889, 11572, 67276, 104562, 140540, 152859, 97042, 64514, 2738, 40932, 25848]
10819B5848n5825Q374r858k3920K8497N5675J1474k8501R216n7343K1659N2662
10807C7958J9615q2416p7673J2763N6990m2404o478L5080L9881N9196o1608k7054
10795c6150M1378M5108K1123k8365J9197k4912j6936M0043m671L081k8393q1997
10783e1494n7615J9036K2834K9782M561l5857L0002k1463J5585l8658K0954N1465
10771a0868l266k3139K6100N2066K5268J0642M4056M9343p1718r0141n2162q854
10759e2673K0413L8081L5903o8412m4385j791m0957l7226O4070J2473n323J8358
10747f1469n5989l0603N9864P7051j6920m1000J3715K6063M2006O1889o4859k5312
10735a5564J7575m5280l0906K5994N001O3128Q7868P1968R612K2705k1318m4064
$$ y = [25848, -29977, -21603, -31461, -55381, -26884, 28791, 40265, 11764, 20980, -36363, -14704, 37958, 57573, -24843, -102516, -89753, -32763, -75167, -81645, -46565, -6684, 52512, -9096, -36150, 5228, 50336, 71459, 43094, 62291, 37379, 20443, 60486, 55815, 58896, 30503, -51494, -109109, -90073, -67239, -37457, -32896, -68753, -38751, -60214, -44629, -83287, -62333, -10868, -14134, -37273, -11173, 40893, 66161, 76803, 120859, 170202, 98484, 8343, -43819, -52673, -32260, 5821, 41724, -26688, -71073, -72864, -113821, -151047, -86977, -74504, -79827, -61469, -117458, -148061, -88197, -11146, -28066, -69066, -55351, -29288, 12718, 74607, 9748, -15564, 2011, -43269, -74175, -48181, -43180, 19948, 107816, 179784, 189396, 212101, 190783, 146719]
10723A46719j2646l433j4078l0968K4147R085M173R715K5248N5704P4702p345
10711B81023p3678j0768J9122K541o3984k9162M0619N0420P6744K6609R425k7703
10699C01208j06389o2948o345J2273P049P9753p224o5386m8524K660q307k0798
10687G7022k1085M8835R4215k6017O784n7602m0894L4282K4045J26564O0495o4838
10675B61806l7987k0223M9395k236j8931l7332n686K4353L3433O7321J9393k0414
10663C12892m6381R3088r254q8248L579J7497o7937j2357J04892K6169J24678
10652D58618O2863l0299P3595K0161K913K2672P2447P3451J2912Q964P0242Q3432
10640I31971M1478Q8662J02567J23011J49922J96536J95122K73354L67514M07554
$$ y = [146719, 134073, 130640, 116562, 85594, 109741, 118826, 122999, 132714, 157962, 213666, 288368, 281023, 207345, 196577, 215699, 218240, 154256, 125094, 165713, 216133, 292877, 319486, 328911, 301208, 194819, 131871, 125526, 137799, 144848, 224601, 217377, 151991, 103467, 106127, 97820, 77022, 55937, 104772, 198987, 172970, 179754, 122152, 81258, 115540, 139585, 266149, 326644, 261806, 223819, 203596, 252991, 250755, 231824, 194492, 188806, 213159, 246592, 313913, 333306, 312892, 266511, 359599, 350345, 262097, 265676, 283173, 215236, 202879, 307771, 333940, 458618, 521481, 491182, 564777, 584938, 587851, 610523, 682970, 756421, 769333, 778297, 848539, 931971, 973449, 1062111, 1164678, 1287689, 1437611, 1634147, 1829269, 2102623, 2470137, 2877691]
10630B877691L15926K09564K38242L89365N22906O82588Q53433J283619J794909
10621I168243K509104L511358M945608O639823Q412918R669104R285651O014509
10613F0156318R73223l150367m418321l058323k94213L239093P351429J1967103
10605G2765942J6742404J9992681J8561206R618592m002854j3642678j4801829
10598A05233464j0514273m296622K220168Q949072J6070212K2411252K5602484
10591A65675757K1462398O712962j3378090k5933337k6021495j9496552j1716242
10584I7305401m494626J881256P673772J2289379J3950313R965463q11838j3978434
10576A23780686k1055614j9791237j4653922r224582m634604j007315J740338
$$ y = [2877691, 3193617, 3403181, 3641423, 4030788, 4553694, 5236282, 6089715, 7373334, 9168243, 11677347, 15188705, 20134313, 26774136, 35187054, 44856158, 54141809, 60156318, 61129541, 57979174, 53560853, 50502530, 50208317, 53447410, 60798839, 72765942, 89508346, 109501027, 128062233, 137680825, 133677971, 120035293, 105233464, 94719191, 90422569, 92642737, 101591809, 117662021, 140073273, 165675757, 187138155, 193851117, 180473027, 154539690, 128518195, 109021643, 97305401, 92810775, 94692031, 102365803, 114655182, 128605495, 138570958, 137759120, 123780686, 102725072, 82933835, 68279913, 59055331, 54420727, 53413412, 55153750]
10569E5153750L486993L706498J481558k936493p849738j0291199r677674p690391
10561B5383304n704153m048461k882857k112602j591003j240073r90839p67584
10553F045732o31625n55356m51655m61921m32581l51224k87454k60384j72456
10544B441076j74585k17504j40545j47193j33294j52414r6419j16259n9317J2816
10534A216362l8988n9030l3738m6310l9491m168m7495j06234p6092M256q543j7926
10522G42603L2324k8167o1561k8703m4952m2222R776K4895L8965M0532K820m1451
10510F44859q3092r0010n4127J6402K2597K6573M2910j3040p877j0650J0053j1703
10498D92895K09M769k4928k5956n6010N9815J9843l323J5357O754n5963o2248
$$ y = [55153750, 58640743, 62347241, 63828799, 60892306, 53042568, 42751369, 33073695, 25383304, 19679151, 15630690, 12747833, 10635231, 9044228, 7804155, 6813316, 6045732, 5414107, 4858751, 4407096, 3945175, 3512594, 3161370, 2873916, 2613532, 2441076, 2266491, 2048987, 1908442, 1761249, 1627955, 1475541, 1379122, 1262863, 1203546, 1216362, 1177374, 1118344, 1084606, 1038296, 998805, 994637, 947142, 840908, 764816, 769072, 760529, 742603, 774927, 746760, 685199, 656496, 611544, 569322, 579098, 603993, 642958, 683490, 686310, 644859, 561767, 471757, 417630, 434032, 456629, 483202, 526112, 513072, 505195, 494545, 504598, 492895, 493104, 497873, 472945, 446989, 390979, 450794, 470637, 467314, 482671, 489425, 433462, 371214]
10486C71214m2483l5331o8177J8218p276m8923j7394L8974N6041J4641N5587N8300
10474C93391L4234l649n6434o0530o5141l2571k034J28093P1364M0984J08113
10463E55820J5287j13114n9582k2898m0052m1320l2462m304N3020O2820K5572
10452C98787l4737l8997j409P3704P0405j121n9832o4183m3969K9729K7064K8327
10440C83768k9758j5737n0929L2030J993k0528O2957j8132k4390n8421n720J6996
10428B74129k2908L7829J2563l4967r1987j7680m7823J6637M4653N2318Q8784
10417C11548J384q4105o6299M7019j4198n5825n6756L5956L229n9414L5191R101
10405A06831K6353o394K5346J3414n0766k666j3653K1045O7506k0461j03947m581
$$ y = [371214, 328731, 293400, 225223, 243441, 236165, 187242, 169848, 208822, 264863, 279504, 335091, 393391, 427625, 423976, 367542, 307012, 241871, 209300, 207266, 335359, 406723, 447707, 555820, 571107, 457993, 398411, 375513, 335461, 294141, 261679, 257375, 310395, 373215, 398787, 364050, 325053, 323644, 397348, 467753, 466632, 406800, 342617, 298648, 328377, 355441, 383768, 354010, 338273, 287344, 319374, 321367, 300839, 363796, 345664, 321274, 262853, 257133, 274129, 251221, 289050, 301613, 266646, 174659, 156979, 109156, 125793, 170446, 222764, 311548, 312932, 228827, 162528, 209547, 195349, 139524, 82768, 118724, 121953, 62539, 97730, 106831, 133184, 126790, 152136, 165550, 114784, 112118, 98465, 119510, 187016, 166555, 62608, 58027]
10393E8027M4054K6089q617o993K6528k0824k630M8169N1218k0405J3056L1484
10381B39156J2540p1807n739q742n1180o2726M007O0959J0571m1522O2602K8297
10369A76416k6873M6690N7535J26m8506m3996J6312j1502P105O1890M585k0036
10357B19746k9844j8222m5987k0418j5517M2761P6419K3533p3098n7406K9601
10346A31568N8360m0322k40j12111N0982O5793M6225k2511l8419M045L5797l0006
10334A49161N601J3954l3275l4194l0998j4491N8958R3642N507r527l4479K1051
10322A90910n9196k9287r08N5657L6472o5337n4756j02273R002N6251K1305q688
10310D9152p102r575L6281M7953L4267k7693k3012L961K1281k4797n8896M8240
$$ y = [58027, 102081, 128170, 119553, 112560, 139088, 118264, 115634, 163803, 215021, 194616, 207672, 239156, 251696, 179889, 174150, 165408, 114228, 51502, 55509, 116468, 127039, 85517, 148119, 176416, 149543, 196233, 253768, 253894, 205388, 161392, 177704, 166202, 173307, 235197, 239782, 219746, 189902, 171680, 125693, 105275, 89758, 132519, 208938, 232471, 159373, 101967, 131568, 189928, 149606, 149366, 37255, 88237, 154030, 200255, 177744, 139325, 143370, 179167, 149161, 154762, 168716, 135441, 101247, 70249, 55758, 114716, 208358, 213865, 204338, 169859, 190910, 131714, 102427, 101519, 157176, 193648, 128311, 73555, -28718, -19716, 36535, 57840, 49152, 42050, 32475, 68756, 116709, 150976, 123283, 100271, 104232, 125513, 100716, 41820, 90060]
10298I0060P8662j8561j3487l3686q3545J1936N4237J3140L0121o0308l088N8041
10286A23522j1251m913M2825K7239p6752r3299J5695M0161l5567K872L6578Q1719
10274A48829K6763k370l0630l0438j1935m7957L4160L4045K889j3769m7201n3963
10262H423P990L8317m704Kj1527Q128O8523q095k6362n4163j6557n5195m902q71
10248e0993O4610J0433J0434K6143N3965L8647l8769p2566p0438P960K6839O5544
10236G1809L1467N0192J7709r0295k3120N699p302J2756m652o0797k7240R1592
10224F7818R1166o0696K457j1171m6062j7053o2349K0923M7457L312r747M083
10212C0138j460k8911k5801N5678k314j3215k8222O0730K5179l6825p4607k2773
$$ y = [90060, 168722, 150161, 136674, 102988, 19443, 31379, 85616, 98756, 128877, 68569, 65481, 123522, 112271, 107358, 150183, 177422, 100670, 7371, 23066, 63227, 27660, 30532, 67110, 148829, 175592, 173222, 142592, 112154, 100219, 52262, 86422, 120467, 123356, 109587, 62386, 8423, 16413, 54730, 50026, 50028, 38501, 46629, 115152, 107057, 80695, 26532, 9975, -45220, -50122, -50993, 13617, 24050, 34484, 60627, 114592, 153239, 114470, 41904, -28534, -20574, 6265, 71809, 103276, 153468, 171177, 80882, 57762, 63461, 56159, 68915, 64263, 3466, -23774, 67818, 158984, 98288, 100745, 89574, 43512, 26459, -35890, -14967, 32490, 35802, 26055, 30138, 28678, -233, -26034, 29644, 27330, 14115, -14107, 46623, 71802, 34977, -39630, -62403]
10200f2403m5010L1904L7335J7443K7117J5021k8279L1111L0982m4538l4352K7001
10188C332K2853L9299O7111K6315j4434N613J17749Q9452j5475j7720K1754l160
10176C42689K5249O90P4869l7697q793N8952N1310M5284Q2469J30966P6037p060
10164H34965q2452m1834O334J9158n4884j2108L0672J06036J05739J84793J27207
10153A223626m6854j49629j26715j35524o7375k3024n0803k3280L9234M7178R6267
10142G83101M3903l8954q0936j39150j14510l7881o5998m6002O1003M3941m9679
10131C58838l3076n0963m8319j4913m4552m0571K5547J6848o7043n257l1580p2668
10119g709k3546J04283P9707k610L3229p1355n6302J1411q4439k4940M3107j6326
$$ y = [-62403, -107413, -75509, -38174, -20731, 6386, 21407, -6872, 24239, 55221, 10683, -23669, 3332, 26185, 65484, 132595, 158910, 144476, 150089, 267838, 357290, 341815, 324095, 345849, 342689, 367938, 368628, 443497, 405800, 397007, 455959, 507269, 552553, 635022, 765988, 842025, 834965, 752513, 710679, 717013, 736171, 681287, 669179, 699851, 805887, 911626, 1096419, 1223626, 1176772, 1027143, 900428, 764904, 697529, 674505, 623702, 600422, 639656, 686834, 783101, 827004, 788050, 707114, 567964, 453454, 415573, 349575, 303573, 364576, 408517, 358838, 325762, 274799, 226480, 211567, 167015, 126444, 151991, 168839, 101796, 96539, 64959, -7709, -31255, 73028, 152735, 150125, 183354, 111999, 55697, 67108, -17331, -42271, 836, -15490]
10107a5490J1317P6955k9854M0832k5494l444r8538l2844P0708K2510M5365J0605
10095G2628L1532p2713L7893p2424r0580O2742N7570L0610m5256L9890N0198K314
10083A04404l5953l0430m1852n4500J5423M0220p4688m3318J7835R4978K493n5943
10071f1331L903N1755k9921o4810L2944N2949M76L0838L9656j1192L4764j8116
10059F1915n2866o2600p746L6418P528J587o550M8468Q1969j0599K0385L1867
10047A49776r697j5956M398m3639l9538n394k5941M0432O7133j5151r1797k0899
10035f273M37M1464L5379P885k9574p4531J4379P3785L0052N4435K4214r9464
10023G2188n9201l1078j2276m4479l706O4335j1305k5838J0139P7866K8494l759
$$ y = [-15490, -4173, 72782, 42928, 83760, 58266, 54822, -43716, -76560, -5852, 16658, 62023, 72628, 104160, 31447, 69340, -3084, -93664, -30922, 26648, 57258, 12002, 51892, 102090, 104404, 68451, 38021, -3831, -58331, -42908, -2688, -77376, -120694, -102859, -7881, -5388, -61331, -57428, -5673, -35594, -100404, -67460, -14511, -14035, 16803, 56459, 45267, 80031, 61915, 9049, -53551, -61297, -24879, -17351, -15764, -22314, 26154, 108123, 97524, 117909, 149776, 140079, 124123, 128521, 84882, 45344, 39950, 14009, 54441, 121574, 106423, 14626, -6273, -5836, 35628, 71007, 78892, 49318, -25213, -10834, 62951, 93003, 147438, 171652, 72188, 12987, -18091, -30367, -74846, -78552, -14217, -25522, -51360, -41221, 36645, 65139, 61380]
10011F1380J061k3123l7636L359p1072R880q747l420Q4777N1183K1310m2122p0631
9998b3801L8585N1201m4691o778m749N856m484k5352J2143J4864j2104K6861P1081
9985I8632k8958o6142j0184K3385N69q8178q0330R5633k8568m5507M1209M0339
9973d8100k415J8804L3407j2369m6453K0507L5473m719K415M5163K5068J6327
9961H3108o469l4507K9276n5928R83M7955j7245j1908n5285m892K517j0678l673
9948c6746k8780J8497L7812K7123j2232L3022M7354K5905O1757k6379j14606q6125
9936e3398O4051K2446j5938O2988J12291Q6359O352j13364q6597m6619J3977n3307
9924g59P351N3098l73q503o0312k0255J1581J534j6179O969L6332N1895k3543
$$ y = [61380, 62441, 39318, 1682, 5041, -66031, -56151, -64898, -68318, 16459, 67642, 88952, 46830, -23801, 14784, 65985, 21294, 14516, 9767, 15623, 11139, -14213, -2070, 12794, 690, 27551, 98632, 69674, 3532, -6652, 16733, 17302, -70876, -151206, -55573, -84141, -129648, -88439, -48100, -50515, -31711, 1696, -10673, -57126, -36619, -1146, -5865, -3450, 41713, 66781, 83108, 76639, 42132, 71408, 15480, 16463, 64418, 47173, 35265, -20020, -24912, -22395, -33073, -36746, -65526, -47029, -9217, 17906, 5674, 38696, 86050, 111955, 173712, 147333, 32727, -53398, 10653, 33099, 17161, 80149, 192440, 278799, 285151, 171787, 85190, 38571, 52548, -759, 6592, 59690, 59317, 50814, -9498, -29753, -18172, -16638, -32817, -25848, 10484, 62379, 38836]
9911C8836n9964J6612r092k3607K5455J765q818l0440rJ5326K1174Q1892J13121
9898A82251L732o2829k3239o9498j319k57n7261k5590O332L3338L8017l6430J3184
9885D31K685N9873O659p2034P498k2412j9960K6971k0083J9279M6585l7148j5774
9872a7430L3531M4135k6319r6084N910M6267J3837l048K6958M631K193Q767k7796
9859A5552j0828j4438K9698L4660N247o9530o7281l9478P3633J16347j766l6281
9847C5535O537J2325k9069R878n2724m0780J8561Q1060R9263P637k4338o6856
9835E7029L394m3085N864L1477J1559n0225K936Q743n9657P914M4099k7121j2191
9822a9264K1998K085O3683n7948r3333J5107J7380P4942Q4602k9537L3839j9038
$$ y = [38836, -21128, -4516, -13608, -37215, -11760, -9995, -18813, -49253, -49262, -33936, -12762, 69130, 182251, 185983, 123154, 99915, 30417, 29098, 28841, -28420, -54010, -47678, -14340, 23677, -12753, 431, 3116, 62989, 69648, -2386, 5112, -17300, -37260, -10289, -30372, -11093, 35492, -1656, -17430, 16101, 60236, 33917, -62167, -56257, -9990, 3847, 799, 27757, 32388, 34581, 43348, 15552, 4724, -9714, 19984, 54644, 59891, -9639, -76920, -116398, -42765, 73582, 71816, 35535, 42072, 54397, 25328, 35206, -17518, -58298, -39737, 41323, 140586, 148223, 123885, 57029, 60423, 17338, 23202, 54679, 66238, 16013, 18949, 27692, -31965, -24051, 20048, -7073, -19264, 2734, 4819, 68502, 10554, -82779, -67672, -50292, 24650, 109252, 79715, 113554, 94516]
9810I4516k9883N0785K4410o8399l5128m0321J0311m9108k6058P8083O5936l1504
9798D3640k9781o5329L0753K3784L9974k0643K6878N0724L2323l6568m8673k1821
9786B5261k0917N3595k9675K15M1191N2291M4899J48328K04454R7997j22822j63691
9774C31126j58913j9956l188K7243o993r4052p5019j3028N4217l666R663o285
9762D1149j3807P3664j6419m3198M859J7331O847n9801r009m2112L4389M0670
9750C4563O115K3200l6199J9242m610k9018p91j2092j547l027q4213k6462O205
9737a08634l0686k0461K7105m338N0085J6591M3571J9136J254k4070K5467r069
9725a4049j3577K4541j7486j1455J9174M9732L962M0407L9094L3250j7632o1703
$$ y = [94516, 64633, 115418, 139828, 71429, 36301, -4020, 6291, -42817, -68875, 9208, 75144, 43640, 13859, -51470, -20717, 3067, 43041, 22398, 49276, 100000, 132323, 95755, 47082, 25261, 4344, 57939, 28264, 28479, 69670, 121961, 166860, 315188, 519642, 617639, 494817, 331126, 172213, 152257, 149069, 176312, 169319, 75267, 248, -12780, 41437, 37771, 47434, 41149, 27342, 101006, 84587, 41389, 46248, 63579, 70426, 10625, 1616, -40496, -6107, 34563, 40678, 63878, 27679, 46921, 42311, 13293, 12502, 410, -1137, -4164, -88377, -114839, -108634, -139320, -159781, -132676, -137014, -86929, -70338, -26767, -7631, -6377, -30447, -4980, -14049, -27626, -3085, -20571, -32026, -12852, 36880, 40842, 81249, 120343, 153593, 135961, 74258]
9713G4258m3698Q905j5358P8376k6936r7606n4141J10411N7681J3097k4536q557
9701G1896l2780l9094p6755L4420J0351j1290L7945j2613l13P280j5994N437O3020
9688D1510M0930l4886o1063l3511K6180N1904k5774k5220L1432J2439j1381p640
9676D920P19K3104L3700J9340k333k5891j1918m5424j4892L6891J5805Q75j5685
9663A9211o8486K9806N5200p532j9329o8241K9848J04468k8919m0666M7317k6844
9651B5833m5840l566O6787k2200j1585N541j5280J0304M8230M6345q3188k7124
9639e743K2618j953j6924K441j9150j9315R3828L3986N1661l4589M3556L3168
9627A83584q5154n6282L1015R1575r4378o7801O809l410l5003n0601L138O4381
$$ y = [74258, 30560, 39465, 24107, 102483, 75547, -22059, -76200, 34211, 91892, 104989, 80453, 71896, 39116, 22, -76733, -42313, -31962, -43252, -5307, -17920, -18233, -10953, -26947, -21510, 41510, 82440, 47554, -13509, -47020, -20840, 31064, 5290, -19930, 11502, 23941, 12560, 4920, 5639, 28743, 62443, 81783, 79450, 53559, 41641, -3783, -18675, 18216, 34021, 34896, 19211, -49275, -19469, 35731, 28199, 8870, -59371, -29523, 74945, 46026, 5360, 52677, 25833, -20007, -23573, 43214, 21014, 9429, 14970, -310, 9994, 58224, 104569, 21381, -5743, 16875, 14922, -2002, 439, -18711, -38026, 55802, 89788, 141449, 106860, 150416, 183584, 98430, 42148, 73163, 164738, 70360, 2559, 9368, 5958, -29045, -79646, -76508, -12127]
9615a2127j793J4356J6092k4897L5331L6131P0878k8963o006L0601l2249q2896
9603A4458l3231K3907J2669l6515n0200o0054P733q234J7805J0395J856L9991
9591e9420R2528O4959K8496k6416r4063J6999J6012Q027l3344J0222M7407j9245
9579E2162p2092j2657j7052N145R298J8298J193J1229m930p098r249L093l8284
9566f0944J2592K7836O2041K6554k1066p1295o6724M7052O3369J7978K6322o0696
9554C019j3861L3702J7925p9014n6399J5688L6851L4148M4935L0309j5554k5091
9542B6658o574K2245k7682L393M8973l6944j02753n0041J8298M9173N1477n721
9530i498k9667K6986K0996m4410J2446K9019n9616q0514P988J01462P5205j1410
$$ y = [-12127, -13920, 436, 16528, -8369, 26962, 63093, 133971, 105008, 99002, 129603, 97354, 14458, -18773, 5134, 17803, -18712, -68912, -128966, -121233, -129467, -111662, -101267, -99411, -59420, 33108, 98067, 126563, 100147, 6084, 23083, 39095, 47122, 13778, 24000, 71407, 52162, -19930, -32587, -49639, -44494, -35196, -16898, -15705, -4476, -9406, -16504, -25753, -22660, -60944, -48352, -20516, 41525, 68079, 47013, -24282, -91006, -43954, 19415, 37393, 63715, 3019, -10842, 22860, 40785, -38229, -94628, -78940, -42089, -7941, 36994, 67303, 51749, 26658, 20084, 42329, 14647, 18040, 67013, 30069, -72684, -122725, -104427, -55254, -3777, -9498, -39165, -12179, 8817, -35593, -23147, 5872, -53744, -134258, -126270, -24808, 50397, 38987]
9518C8987k6377K5923M7276k1283j3876o516q493K8102J01120q067j8695K311
9506A40412l0435j2609K4326K6132L7440l2531j5001k7962p4360K9545N1469J9554
9494A35980o8852m8575n0687l4472K4714N2463J2632J3259j0805m1798j6660K7090
9482e711M8664O6484o325o9215l9539k480P6155j6506p3667k6291P5369M7474
9470G4412J7011k1443l4283N5965Q0145M4042M951p2958k7149P637l4499k560
9458I1271n457k3905m0924l3874J3669m116K0337J3008J7909k9456j12257n1774
9446a45569M7083M5582J3826L0614N9569L1347P684j40236k5419m2433K5650k1274
9434a13576N3829N1106j435m0381K2628L1543j5067p303N724L1972j0441l7946
$$ y = [38987, 12610, 38533, 85809, 64526, 50650, 44134, 35641, 63743, 164863, 156796, 138101, 140412, 109977, 97368, 121694, 147826, 185266, 152735, 137734, 109772, 35412, 64957, 116426, 135980, 67128, 18553, -32134, -66606, -41892, 10571, 23203, 36462, 25657, -16141, -32801, -5711, 42953, 109437, 103112, 33897, -5642, -8122, 68033, 51527, -22140, -48431, 26938, 74412, 91423, 69980, 35697, 91662, 171807, 215849, 220800, 147842, 120693, 128330, 93831, 91271, 85814, 61909, 20985, -12889, 780, -3336, 17001, 30009, 47918, 18462, -93795, -145569, -98486, -52904, -39078, -8464, 51105, 82452, 90136, -50100, -75519, -117952, -92302, -113576, -59747, -8641, -10076, -50457, -27829, 3714, -11353, -18656, -12932, 19040, 8599, -29347]
9422b9347k1309j1206O8874L3642k6692k4151o682j2000K3698N7099N8931K5447
9410A36304L8324m8445j6898k4960n9m2004J7812K1136K0824l3885l3394o1872
9398b7117k1222N4014l3651O460L3173P8768K2315K847l8596m9849N5700j7562
9386F5280k8770n77J080j0356K3045J0089J4032n0562p819j9539O4516l9800o2798
9373d2179O0772N6068m4083K2388P906J3970K5960K4560q5936l7577L7671l0870
9361H650r3188K0646N5765j8163J7263l1570k5622j2920K4401O8584m4130p380
9349c7664J9477m2450L5364k6317o796k313M231j1389R32K6566r145M5592k7984
9336c1896J3452K6700k1098k3141m3014N5854M6758L7896n8172p2571J3595O8486
$$ y = [-29347, -50656, -61862, 7012, 40654, 13962, -10189, -16871, -28871, -5173, 51926, 110857, 136304, 174628, 126183, 109285, 84325, 84266, 42262, 60074, 81210, 102034, 68149, 34755, -27117, -48339, 5675, -27976, -21516, 11657, 90425, 112740, 115587, 76991, 27142, 82842, 65280, 36510, 35933, 37013, 26657, 49702, 59791, 73823, 23261, 15442, -4097, 60419, 20619, -42179, 18593, 74661, 30578, 52966, 60872, 74842, 100802, 125362, 39426, 1849, 39520, 8650, -84538, -63892, -8127, -26290, -9027, -40597, -66219, -79139, -54738, 13846, -30284, -37664, -18187, -60637, -25273, -51590, -58386, -60699, -56468, -67857, -66925, -40359, -49504, -3912, -31896, -18444, 8256, -12842, -35983, -78997, -23143, 23615, 61511, 3339, -69232, -55637, 12849]
9324A2849j7177l3236Q0865Q5245M2661p8497r5636o1388l649K9548m35O0480
9312B1630K8126m4503J486l9562j5093r146M530J6091K2089j9876M9570L3520
9300D8862l0068l2780m4271K4302M1849L276P5971K8413o1726m7821k6962M327
9288a6628J3106l9918k0400k2220M8849O7379M1106Q130n0559o4773j0868J2260
9276c4536k8343Q205M897J0745J1169L3094j1959q9516J4215K6719q478M9101
9264a4687m590M932K2537q9601l8484P1977L9166Q5393L8325m6361o1334n3367
9252d6094k831l1403J1243l494M7557L7105j4095K9697K9740j4746Q846j7222
9240C4303l8464L3266P0254o0238o0917N606l365j8589k2848N1851q482m4198
$$ y = [12849, -4328, -37564, 43301, 128546, 171207, 92710, -2926, -64314, -67963, -38415, -38850, 21630, 49756, 5253, 6739, -32823, -47916, -57062, -52532, -36441, -14352, -34228, 15342, 48862, 18794, -13986, -58257, -33955, 7894, 11170, 87141, 115554, 53828, 6007, -20955, -16628, -3522, -43440, -63840, -86060, -37211, 30168, 71274, 79404, 28845, -35928, -46796, -34536, -62879, -54674, -49777, -39032, -27863, 5231, -6728, -96244, -82029, -55310, -63788, -14687, -19277, -14345, 8192, -81409, -119893, -47916, -8750, 76643, 114968, 68607, 7273, -46094, -48925, -80328, -69085, -72579, -25022, 12083, -2012, 27685, 57425, 42679, 51525, 34303, -4161, 29105, 99359, 39121, -21796, -16190, -19555, -38144, -60992, -9141, -17623, -61821]
$$ [...]
##END NTUPLES=NMR SPECTRUM
##END=
