##TITLE=Analysis number 327775
Compound Code mo 00072
Book Reference 232207
Project Code adrs flro3
Chemist Name jom
##JCAMPDX= 6.0         $$ Bruker NMR JCAMP-DX V2.0
##DATA TYPE= NMR SPECTRUM
##DATA CLASS= NTUPLES
##ORIGIN= Bruker BioSpin GmbH
##OWNER= nmr
$$ XWIN-NMR		Version 3.5
$$ Thu Apr  5 09:16:26 2007 GMT Daylight Time (UT+1h)  MAYBRIDGE\nmr@NMR_250MHZ
##.OBSERVE FREQUENCY= 250.131544655141
##.OBSERVE NUCLEUS= ^1H
##.ACQUISITION MODE= SIMULTANEOUS (DQD)
##.ACQUISITION SCHEME= undefined
##.AVERAGES= 16
##.DIGITISER RES= 18
##SPECTROMETER/DATA SYSTEM= dpx250
##.PULSE SEQUENCE= zg30
##.SOLVENT NAME= CDCl3
##.SHIFT REFERENCE= (INTERNAL, CDCl3, 0, 16.522)
##AUDIT TRAIL= $$ (NUMBER, WHEN, WHO, WHERE, WHAT)
$$ ##TITLE= Audit trail, XWIN-NMR		Version 3.5
$$ ##JCAMPDX= 5.01
$$ ##ORIGIN= Bruker BioSpin GmbH
$$ ##OWNER= nmr
$$ C:\u/data/dgb/nmr/ADRS/590/pdata/1/auditp.txt
$$ ##AUDIT TRAIL=  $$ (NUMBER, WHEN, WHO, WHERE, WHAT)
(   1,<2007-04-05 09:16:02.74 +100>,<MAYBRIDGE\nmr>,<NMR_250MHZ>,
      <created by zg, POWCHK disabled, PULCHK disabled
       configuration hash MD5:
       49 4B E0 1D 92 C2 6B 37 9F E6 65 BC 52 41 86 1D
       data hash MD5: 64K
       80 AE 4B A0 64 77 D1 C8 7A 66 10 1F 7F FB 9E D5>)
(   2,<2007-04-05 09:16:16.28 +100>,<MAYBRIDGE\nmr>,<NMR_250MHZ>,
      <Start of raw data processing
       ef LB = 0.3 FT_mod = 6 PKNL = 1 SI = 32K 
       data hash MD5: 32K
       2E 63 91 B9 D5 B5 42 4C CD E0 34 61 18 D7 90 C2>)
(   3,<2007-04-05 09:16:18.16 +100>,<MAYBRIDGE\nmr>,<NMR_250MHZ>,
      <apk 
       data hash MD5: 32K
       FA 04 DC 00 34 8C F7 E8 AB A7 8E 4D 81 D2 0C 36>)
(   4,<2007-04-05 09:16:18.91 +100>,<MAYBRIDGE\nmr>,<NMR_250MHZ>,
      <abs ABSG = 5 
       data hash MD5: 32K
       E9 38 D2 93 E3 27 6B 21 C9 C6 0A 71 BB 41 DC 72>)
$$ ##END=
$$ 
$$ hash MD5
$$ 82 66 2C 91 44 B8 73 FF F7 9F 18 88 8D A7 BC 99
##$RELAX= 
##$RELAX= 
##$RELAX= 
##$RELAX= 
##$RELAX= 
##$RELAX= 
##$RELAX= 
$$ Bruker specific parameters
$$ --------------------------
##$DU= <C:\u>
##$EXPNO= 590
##$NAME= <ADRS>
##$PROCNO= 1
##$TYPE= <nmr>
##$USER= <dgb>
##$AMP= (0..31)
100 100 100 100 100 100 100 100 100 100 100 100 100 100 100 100 100 100 
100 100 100 100 100 100 100 100 100 100 100 100 100 100 
##$AQSEQ= 0
##$AQ_mod= 3
##$AUNM= <au_zg>
##$AUTOPOS= <3 >
##$BF1= 250.13
##$BF2= 250.13
##$BF3= 250.13
##$BF4= 250.13
##$BF5= 500.13
##$BF6= 500.13
##$BF7= 500.13
##$BF8= 500.13
##$BYTORDA= 1
##$CFDGTYP= 0
##$CFRGTYP= 5
##$CHEMSTR= <none>
##$CNST= (0..31)
1 1 145 1 1 1 1 1 1 1 1 1 1 1 1 1 1 1 1 1 1 1 1 1 1 1 1 1 1 1 1 1 
##$CPDPRG= <>
##$CPDPRG1= <>
##$CPDPRG2= <>
##$CPDPRG3= <>
##$CPDPRG4= <mlev>
##$CPDPRG5= <mlev>
##$CPDPRG6= <mlev>
##$CPDPRG7= <mlev>
##$CPDPRG8= <mlev>
##$CPDPRGB= <>
##$CPDPRGT= <>
##$D= (0..31)
0 1 0 0 0 0 0 0 0 0.06 0 0 0 0 0 0 0.0002 0 0 0 0 0 0 0 0 0 0 0 0 0 0 
0 
##$DATE= 1175760961
##$DBL= (0..7)
120 120 120 120 120 120 120 120 
##$DBP= (0..7)
150 150 150 150 150 150 150 150 
##$DBP07= 0
##$DBPNAM0= <>
##$DBPNAM1= <>
$$ [...]
##$SUBNAM7= <"">
##$SUBNAM8= <"">
##$SUBNAM9= <"">
##$SW= 20.6930455092707
##$SWIBOX= (0..15)
0 0 3 0 0 0 0 0 0 0 0 0 0 0 0 0 
##$SW_h= 5175.983436853
##$TD= 65536
##$TD0= 1
##$TE= 683.16
##$TE2= 300
##$TE3= 300
##$TEG= 300
##$TL= (0..7)
0 120 120 120 120 120 120 120 
##$TP= (0..7)
150 150 150 150 150 150 150 150 
##$TP07= 0
##$TPNAME0= <>
##$TPNAME1= <>
##$TPNAME2= <>
##$TPNAME3= <>
##$TPNAME4= <>
##$TPNAME5= <>
##$TPNAME6= <>
##$TPNAME7= <>
##$TPOAL= (0..7)
0.5 0.5 0.5 0.5 0.5 0.5 0.5 0.5 
##$TPOFFS= (0..7)
0 0 0 0 0 0 0 0 
##$TUNHIN= 0
##$TUNHOUT= 0
##$TUNXOUT= 0
##$USERA1= <user>
##$USERA2= <user>
##$USERA3= <user>
##$USERA4= <user>
##$USERA5= <user>
##$V9= 5
##$VALIST= <valist>
##$VCLIST= <CCCCCCCCCCCCCCC>
##$VD= 0
##$VDLIST= <DDDDDDDDDDDDDDD>
##$VPLIST= <PPPPPPPPPPPPPPP>
##$VTLIST= <TTTTTTTTTTTTTTT>
##$WBST= 1024
##$WBSW= 4
##$XGAIN= (0..3)
0 0 0 0 
##$XL= 0
##$YL= 0
##$YMAX_a= 248671
##$YMIN_a= -463625
##$ZGOPTNS= <>
##$ZL1= 120
##$ZL2= 120
##$ZL3= 120
##$ZL4= 120
##$ABSF1= 16.522
##$ABSF2= -4.171173
##$ABSG= 5
##$ABSL= 3
##$ALPHA= 0
##$AQORDER= 0
##$ASSFAC= 0
##$ASSFACI= 0
##$ASSFACX= 0
##$ASSWID= 0
##$AUNMP= <proc_1d>
##$AZFE= 0.1
##$AZFW= 0.1
##$BCFW= 0
##$BC_mod= 0
##$BYTORDP= 0
##$COROFFS= 0
##$CY= 12.5
##$DATMOD= 1
##$DC= 0
##$DFILT= <>
##$DTYPP= 0
##$F1P= 14.0000005364418
##$F2P= -0.99999901652339
##$FCOR= 0.5
##$FTSIZE= 32768
##$FT_mod= 6
##$GAMMA= 0
##$GB= 0
##$INTBC= 1
##$INTSCL= 1
##$ISEN= 128
##$LB= 0.3
##$LEV0= 0
##$LPBIN= 0
##$MAXI= 10000
##$MC2= 0
##$MEAN= 0
##$ME_mod= 0
##$MI= 0
##$NCOEF= 0
##$NC_proc= -6
##$NLEV= 6
##$NOISF1= 0
##$NOISF2= 0
##$NSP= 0
##$NTH_PI= 0
##$NZP= 0
##$OFFSET= 16.522
##$PC= 1
##$PHC0= 223.4233
##$PHC1= 23.73226
##$PH_mod= 1
##$PKNL= yes
##$PPARMOD= 0
##$PSCAL= 4
##$PSIGN= 0
##$REVERSE= no
##$SF= 250.13
##$SI= 32768
##$SIGF1= 0
##$SIGF2= 0
##$SINO= 400
##$SIOLD= 32768
##$SREGLST= <1H.CDCl3>
##$SSB= 0
##$STSI= 32768
##$STSR= 0
##$SW_p= 5175.98343685301
##$SYMM= 0
##$S_DEV= 0
##$TDeff= 65536
##$TDoff= 0
##$TI= <Analysis number 999999
Compound Code 99
Book Reference 9
Project Code 9>
##$TILT= no
##$TM1= 0
##$TM2= 0
##$TOPLEV= 0
##$USERP1= <user>
##$USERP2= <user>
##$USERP3= <user>
##$USERP4= <user>
##$USERP5= <user>
##$WDW= 1
##$XDIM= 32768
##$YMAX_p= 525684219
##$YMIN_p= -885857
$$ End of Bruker specific parameters
$$ ---------------------------------
##NTUPLES= NMR SPECTRUM
##VAR_NAME=  FREQUENCY,     SPECTRUM/REAL,   SPECTRUM/IMAG
##SYMBOL=    X,             R,               I
##VAR_TYPE=  INDEPENDENT,   DEPENDENT,       DEPENDENT
##VAR_FORM=  AFFN,          ASDF,            ASDF
##VAR_DIM=   32768,         32768,           32768
##UNITS=     HZ,            ARBITRARY UNITS, ARBITRARY UNITS
##FACTOR=    0.157963299565203, 1,           1
##FIRST=     4132.6476996994, 0,             0
##LAST=      -1043.33573715361, 0,           0
##MIN=       -1043.33573715361, -885857,     0
##MAX=       4132.6476996994, 525684219,     0
$$ Real data points
##PAGE= N=1
##DATA TABLE= (X++(R..R)), XYDATA
$$ [...]
19308E54015l0927L8353q3030M1651k0685R3144n0734o5356p0151l55893j50429
$$ 554015 523088 561441 478411 520062 499377 592521 541787 476431 406280 50387 -100042
19297a00042K67207Q3394j00069J86272K38154Q121L749o0501J03565k3848j13682
$$ -100042 167165 250559 150490 336762 574916 583037 586786 526285 629850 606002 492320
19286D92320j98917k31669r6264p1429J86201K47718K12525r6332j29019K18675
$$ 492320 293403 61734 -34530 -105959 80242 327960 540485 444153 315134 533809
19276E33809k14525j03856M7309q6192j35017p4689N9024M2413L26152l4692l49983
$$ 533809 319284 215428 262737 176545 41528 -33161 25863 68276 394428 359736 9753
19265I753J16900R3739Q2442j73134o7101J27778j33524J85841j83288j33005
$$ 9753 126653 220392 302834 129700 62599 190377 56853 242694 59406 -73599
19255g3599K0628J50140M3230P7325l6253k4261K9822m4019j57810k37428j52614
$$ -73599 -52971 97169 140399 217724 181471 157210 187032 143013 -14797 -252225 -404839
19244d04839L71439M28010K42182r2120k82967L034r1657q1003j93501N6063p106
$$ -404839 -33400 394610 636792 544672 261705 264739 173082 92079 -101422 -45359 -52465
19233e2465J4632J7080Q5208j85893L09365L8226m18038l639K85489J6883J33465
$$ -52465 -37833 -20753 64455 -121438 187927 226153 -191885 -195524 89965 106848 240313
19222B40313P5750j2087k0763Q8777j16295j23957k56421p1609J93558O9139O6490
$$ 240313 316063 303976 283213 371990 255695 131738 -124683 -196292 -2734 66405 132895
19211A32895K8815R3807J11189j47708l74493J6177J80389j6522k03880k3121
$$ 132895 161710 255517 366706 218998 -155495 -139318 41071 24549 -179331 -202452
19201b02452r0617L4944j60995k8923J10064j72938K38086J88075o151j47554
$$ -202452 -293069 -258125 -419120 -448043 -337979 -510917 -272831 -84756 -90907 -238461
19191b38461M5673q5629L8599m5140k1252K02090J11892J23619P2593q423K6831
$$ -238461 -192788 -278417 -239818 -284958 -306210 -104120 7772 131391 203984 195561 222392
19180B22392k55131o4807N6724J06765J98782K519J05944J15442l51150j97427
$$ 222392 -32739 -97546 -40822 65943 264725 267244 373188 488630 137480 -59947
19170e9947j29329j21572r7915K72528n0080J76510J30621P257n0693R4386J26897
$$ -59947 -189276 -310848 -408763 -136235 -186315 -9805 120816 128073 77380 171766 298663
19159B98663j49840J38552J47953j06747j34855R4851j4904p2682j34217l13730
$$ 298663 148823 287375 435328 328581 193726 288577 273673 200991 66774 -246956
19149b46956o9596L39550J53115k5711p3745L3110j02305j31352p3411L50821
$$ -246956 -316552 22998 176113 150402 76657 109767 7462 -123890 -197301 153520
19139A53520K98367k11328l21548o1281r6257n140K7605Q1054J8448N8142j09631
$$ 153520 451887 240559 -80989 -142270 -238527 -243667 -216062 -135008 -116560 -58418 -168049
19128a68049j14362K4310J27019J15002P7328J45758L53552k49486j45548l5146
$$ -168049 -282411 -258101 -131082 -16080 61248 207006 560558 311072 165524 130378
19118A30378J57558r1898J07393j0383p8451j52986q1556J60781n3380l30838
$$ 130378 287936 196038 303431 293048 214597 61611 -19945 140836 87456 -243382
19108b43382r2991P0485K8497K64905N6204o9l9963j23170l1697K92505K35781
$$ -243382 -336373 -265888 -237391 27514 83718 83649 43686 -79484 -111181 181324 417105
19097D17105P8079k40336l13042n6182K11326K34311O2987l41119j59559J76080
$$ 417105 495184 254848 -58194 -114376 96950 331261 394248 53129 -106430 69650
19087F9650k4676j43349j26931J9304N0651M5381j89861j07113J71601J45216
$$ 69650 44974 -98375 -225306 -206002 -155351 -109970 -299831 -406944 -235343 -90127
19077i0127j86269k36041N6618K02538n2494Q5764K09867L7085q942N6435K7242
$$ -90127 -276396 -512437 -455819 -253281 -305775 -220011 -10144 26941 17999 74434 101676
19066A01676J09570M5224j01029l6965j86527N5737q45Q6811R7076o7002j26728
$$ 101676 211246 256470 155441 118476 -68051 -12314 -13159 73652 170728 103726 -23002
19055b3002J4203K2837j5602P6367p3130K4497o3567N8317N956p5668m9948R63
$$ -23002 -8799 14038 -1564 74803 1673 26170 -37397 20920 26876 -48792 -98740 -97777
19043i7777J67876O8479O1572L523l5437j11733p2850l01342N237j37095n502
$$ -97777 70099 138578 200150 203673 168236 56503 -16347 -317689 -312452 -449547 -455049
19032d55049R3217J9793n2648J24112J38713J80895L32890j07024l09472k08594
$$ -455049 -361832 -342039 -394687 -270575 -131862 49033 381923 274899 -34573 -243167
19022b43167m7568J59555J72411p511j02068J8601J1729M5671k84779j56044M6714
$$ -243167 -290735 -131180 41231 33720 -68348 -49747 -38018 7653 -277126 -433170 -386456
19011c86456J00967k0705j04170J32581K66351r7866j77846j25350K5881n8688
$$ -386456 -285489 -306194 -410364 -277783 -11432 -109298 -287144 -412494 -386613 -445301
19001d45301q0587l8537q8143j07607M88294L53076k4887r4177j1291j5437l2073
$$ -445301 -525888 -564425 -652568 -760175 -271881 81195 56308 -37869 -49160 -64597 -96670
18990i6670r2042p7201p0874O9152R3004K36214J43881l17006k29019M1865K79808
$$ -96670 -188712 -265913 -336787 -267635 -174631 61583 205464 -111542 -340561 -298696 -18888
18979a8888J16417k08634O8446j90942J18121N0220j6175k0319J94035m162l3315
$$ -18888 97529 -111105 -42659 -233601 -115480 -65260 -81435 -101754 92281 88119 54804
18968E4804j20273k78186j70647r2964J1983N0810J05379K95048N4688J13637
$$ 54804 -65469 -343655 -514302 -607266 -595283 -544473 -439094 -144046 -89358 24279
18958B4279n021p3719M938l1011J54624j43234j27263L51369J13573j56580m7863
$$ 24279 19258 -54461 -49523 -80534 74090 -69144 -196407 154962 268535 111955 64092
18947F4092M7247j7366j29307m3124j2217m1303j02333L10791K75294r9269j95259
$$ 64092 111339 93973 -35334 -78458 -90675 -131978 -234311 76480 351774 252505 57246
18936E7246j98622L0876K3453Q5499j73122j92664R2080P522j95843Q4659K66547
$$ 57246 -141376 -110500 -87047 -1548 -174670 -367334 -275254 -267732 -463575 -378916 -112369
18925a12369J01398k99848m5238N37485J74564l28254k78057L8553q4389k7319
$$ -112369 -10971 -310819 -356057 181428 355992 27738 -250319 -211766 -296155 -323474
18915c23474K25618q9942j4115j9994j78128J4433j12645j02997J73431K66674
$$ -323474 -97856 -187798 -201913 -221907 -400035 -385602 -498247 -601244 -427813 -161139
18905a61139J55465l3988K05972J85385j34311j84571j93066j25760J94222j088
$$ -161139 -5674 -39662 166310 351695 217384 32813 -160253 -286013 -91791 -92879
18895i2879j8572k7148j98354J12071k8058n3991j42423K4011L6576k88619J38726
$$ -92879 -111451 -138599 -336953 -224882 -252940 -306931 -449354 -425343 -388767 -677386 -538660
18884e38660L19028R0503P6670L61074K42950p9756m68819O0381M4566q1985m6152
$$ -538660 -219632 -129129 -52459 308615 551565 471809 2990 63371 107937 25952 -20200
18873b0200l02866M7924J05515p4791K5376O1721j27971J36757M7350k25290Q8787
$$ -20200 -323066 -275142 -169627 -244418 -219042 -157321 -285292 -148535 -101185 -326475 -237688
18862b37688J34972K8644K76117j73823k55435N2381J8212n4306M9633K8230p0472
$$ -237688 -102716 -74072 202045 28222 -227213 -174832 -156620 -210926 -161293 -133063 -203535
18851b03535q8337J95146Q8544J54598J09334J17458o5045o4763j95842k58810
$$ -203535 -291872 -96726 -8182 146416 255750 373208 308163 243400 47558 -211252
18841b11252l33003Q017J42633K20531J47752p2730j41859k93512q4138P8705
$$ -211252 -544255 -536238 -393605 -173074 -25322 -98052 -239911 -533423 -617561 -538856
18831e38856J15370P2677K49057J0877N2665J18997J04535j85131R3187O5644
$$ -538856 -423486 -350809 -101752 -90875 -38210 80787 185322 191 93378 159022
18821A59022j85240j75121K46966K59861j27995j98638j58135P9387J96590J53942
$$ 159022 -26218 -201339 45627 305488 177493 -21145 -179280 -99893 96697 250639
18811B50639M7705l29536j50131N9033j12811J29409j4717O2295j77868J80836
$$ 250639 298344 -31192 -181323 -122290 -235101 -105692 -120409 -58114 -235982 -55146
18801e5146J01986j1453K09855Q3272j22817k24512j60308J49379J37586J07789
$$ -55146 46840 35387 245242 328514 205697 -18815 -179123 -29744 107842 215631
18791B15631j68766P7209P9380j2785j96242j91519M5801P0356j11519J36365
$$ 215631 46865 124074 203454 190669 -5573 -197092 -151291 -80935 -192454 -56089
18781e6089L87588N5620k51491O5636N9624K0249Q9090R9502q6099L1341K43990
$$ -56089 331499 387119 135628 201264 260888 281137 370227 469729 383630 414971 658961
18770F58961J76820K81543M50971O77071o9388o58365n54821k54743k99807j56173
$$ 658961 835781 1117324 1568295 2245366 2175978 1517613 962792 708049 408242 252069
18760B52069P652L39275K4212j89747j77145J42925m6752o0712l8269p3596M6384
$$ 252069 259721 598996 623208 433461 256316 399241 352489 291777 253508 179912 226296
18749B26296k23218k88883j60267Q1090n0561K47501J45826M7767M4505Q7457
$$ 226296 3078 -285805 -446072 -364982 -415543 -168042 -22216 25551 70056 157513
18739A57513k33169l63699P3791K31048K68393j11948j66259J2096Q1196K65583
$$ 157513 -75656 -439355 -365564 -134516 133877 21929 -144330 -132234 -51038 214545
18729B14545j73336j95805n740J72295l9817L4450J15516J73932M631k34168j01864
$$ 214545 41209 -154596 -160336 11959 -27858 6592 122108 296040 300671 66503 -35361
18718c5361j15042k3831K38279j38891q2374K48774m9834R677n3111j45312K1605
$$ -35361 -150403 -174234 64045 -74846 -157220 91554 41720 51397 -1714 -147026 -125421
18707a25421L2770m3346O7340p9804Q2025j60355J08180J24069L0152j05107K17303
$$ -125421 -92651 -135997 -68657 -148461 -66436 -226791 -118611 5458 35610 -69497 147806
18696A47806p3524q3911Q1312m1768K11496p3954j02234J93568M1745J9335J86124
$$ 147806 74282 -9629 71683 29915 241411 167457 65223 258791 300536 319871 505995
18685E05995J5114k25353k0371j00767k56559l55448j16525J22395r4703M8208
$$ 505995 521109 295756 275385 174618 -81941 -437389 -553914 -431519 -526222 -478014
18675d78014L57581k7990J97904J5888j23193P1346j93153j54522M7079J59744
$$ -478014 -120433 -148423 49481 65369 -57824 13522 -179631 -334153 -287074 -127330
18665a27330J83042P6032m3018j45257k12652m832q23p0360r4833J7754O113J02348
$$ -127330 55712 131744 88726 -56531 -269183 -274015 -274838 -345198 -440031 -422277 -416164 -313816
18653c13816J18291K01528J05332k16048j49499L5027r4791K01399J19007j15027
$$ -313816 -195525 6003 111335 -104713 -254212 -219185 -313976 -112577 6430 -108597
18643a08597k3186j68460j36198J54084L5053j6642K8925P1492J00045m7137p312
$$ -108597 -131783 -300243 -436441 -282357 -247304 -263946 -235021 -163529 -63484 -110621 -117933
18632a17933M8994k37288o5052O1073J99451k3952J7346n6611j17330l1052L27064
$$ -117933 -68939 -306227 -371279 -310206 -110755 -134707 -117361 -173972 -291302 -322354 4710
18621D710J17268R101N607K0559q718j89773O0844L00796P2995p7604m061j83656
$$ 4710 121978 131079 136686 157245 148527 -41246 19598 320394 393389 315785 311724 128068
18609A28068M2101Q2851P4763O7003r2795J08264j25496k03230L1498R6897J02653
$$ 128068 170169 253020 327783 394786 301991 410255 284759 81529 113027 209924 312577
18598C12577l16264o8390O322j04280O3616J03500R4742o3785Q346l2903o3925
$$ 312577 -3687 -72077 -65755 -170035 -106419 -2919 91823 28038 36384 3481 -60444
18587f0444j64892q2661j31967J14086L07670O0149Q7877q1095j16231k19524
$$ -60444 -225336 -307997 -439964 -325878 -18208 41941 129818 48723 -67508 -287032
18577b87032q1665M24399K18142j77161k74442r6711l65273J74462L21557j102
$$ -287032 -368697 55702 273844 96683 -177759 -274470 -639743 -465281 -143724 -144826
18567a44826j36672n4763J78302j07634j15090K74109J09187J14536J47208q7091
$$ -144826 -281498 -336261 -157959 -265593 -380683 -106574 2613 117149 264357 177266
18557A77266j5457J69377m3600l3856m0721l0793j39840k7831j69285l9490J00060
$$ 177266 161809 331186 287586 253730 213009 182216 42376 14545 -154740 -194230 -94170
18546i4170l3365p5248K92745J88204J08875o0170k94223k42283l47889O9270
$$ -94170 -127535 -202783 89962 278166 387041 326871 32648 -209635 -557524 -488254
18536d88254N9004N9056J53011K8575L2440k7643l5835j63559m2537n8364J68101
$$ -488254 -429250 -370194 -217183 -188608 -156168 -183811 -219646 -383205 -425742 -484106 -316005
18525c16005J9407N4701J21569j1838j26667p9069L1836r5319j03869K59775L9271
$$ -316005 -296598 -241897 -120328 -132166 -258833 -337902 -306066 -401385 -505254 -245479 -206208
18514b06208j89858j5820M3322m609J2274M7597K6875Q3656q4750J59755k04398
$$ -206208 -396066 -411886 -368564 -373173 -360899 -313302 -286427 -202771 -287521 -127766 -332164
18503c32164j09796P2870o2100J73213J92267J90298K36346p4641k86536p736
$$ -332164 -441960 -369090 -431190 -257977 -65710 124588 360934 286293 -243 -7979
18493g979P488k86550k7553K07609Q8565k15824j31303p3429q2651l6099L11358
$$ -7979 -491 -287041 -314594 -106985 -18420 -234244 -365547 -438976 -521627 -557726 -246368
18482b46368J12450L11533k8040r4417k6741J40334J53085k51250k68795j04761
$$ -246368 -133918 177615 149575 55158 28417 168751 321836 70586 -198209 -302970
18472c02970j15831m1298R5930O3589P4288J79172j75615k8306O2395J72289P5853
$$ -302970 -418801 -460099 -364169 -300580 -226292 -47120 -222735 -251041 -188646 -16357 59496
18461E9496J96886l4421j87750L3537R2477j85511K5510R5523l8292j35690M1858
$$ 59496 256382 221961 34211 67748 160225 -25286 224 95747 57455 -78235 -36377
18450c6377J89195p7587k11507J19978j22875P9256N5929m3817R1341l4002J90178
$$ -36377 152818 75231 -136276 -16298 -139173 -59917 -3988 -47805 43536 9534 199712
18439A99712L7539j05551q8054Q748j0575J01017q7685k2970O9767k25558j37973
$$ 199712 237251 131700 43646 52394 41819 142836 55151 32181 101948 -123610 -261583
18428b61583J7940P9176k11719m8942R1692J10342J28898J55997J97261K53207
$$ -261583 -243643 -164467 -376186 -425128 -333436 -223094 -94196 61801 259062 512269
18418E12269J35729j38330j19240q397j28602n2502J7180j41203j6039j93121
$$ 512269 647998 509668 390428 382031 253429 200927 218107 76904 60865 -132256
18408a32256P7809J57163J60194j11195j42367L9462m2065o1124J95795J76078
$$ -132256 -54447 102716 262910 151715 9348 48810 6745 -54379 141416 317494
18398C17494m6199M6171j77561p4479Q3046K4760k6401q2197j0826k50411Q431
$$ 317494 271295 317466 139905 65426 148472 173232 146831 64634 53808 -196603 -188172
18387a88172J53967K63845j32291K08818K87411j17502k47940l54893k53138K16631
$$ -188172 -34205 229640 97349 306167 593578 476076 228136 -126757 -379895 -163264
18377a63264K77763N3568j85512j19211J11925k5987j78783L4372O8315N1187
$$ -163264 114499 168067 -17445 -136656 -24731 -50718 -229501 -195129 -126814 -75627
18367g5627L36223J39032j77705K207J85159J52223j07116k31642j41203j7943
$$ -75627 260596 399628 221923 224130 409289 561512 454396 222754 81551 63608
18357F3608j53267l5762L5706J58658j4308O7328K1535j28796R7224r7642L2805
$$ 63608 -89659 -125421 -89715 68943 54635 121963 143498 14702 111926 14284 47089
18346D7089p5578n950J16449j32799r2083Q1501J34507j5868Q7797J68399r9192
$$ 47089 -28489 -34439 82010 -50789 -142872 -61371 73136 57268 145065 313464 214272
18335B14272L6673m5776l3125Q2476j81910k6566m1766K69432J0129K5008M2273
$$ 214272 250945 205169 172044 254520 72610 46044 4278 273710 283839 308847 351120
18324C51120j67144N9086o5622p249N201n6598J45407L61122p9407l78276k12835
$$ 351120 183976 243062 177440 170191 175392 118794 264201 625323 545916 167640 -45195
18313d5195q1424K43067J82683K34815O4299j41354j23961j0080j51666k00875
$$ -45195 -126619 116448 299131 533946 598245 456891 332930 322850 171184 -29691
18303b9691l3099L1628k06897j27311K36669R4165K01437J63258M7955k9706j56470
$$ -29691 -62790 -31162 -238059 -365370 -128701 -34536 166901 330159 378114 348408 191938
18292A91938j32958K94226K53685m3050j31444j82190j76151n8632r6441m7280
$$ 191938 58980 353206 606891 563841 432397 250207 74056 15424 -81017 -128297
18282a28297J01732J17234J24879j63210j45299k2993K44271J11915O4949O9669
$$ -128297 -26565 90669 215548 52338 -92961 -115954 128317 240232 305181 374850
18272C74850m9478l97651k43718J66751P802J94066K98386K62989m00451l03011
$$ 374850 325372 -72279 -315997 -149246 -141444 52622 351008 613997 213546 -89465
18262h9465m5568j28203Q2856K45623R2550J79348j46264k09964K30488K14716
$$ -89465 -135033 -263236 -180380 65243 157793 337141 190877 -19087 211401 426117
18252D26117k67361k19127J0508j27903L9654K19356J07587L0225k24414j95056
$$ 426117 158756 -60371 -49863 -177766 -138112 81244 188831 219056 -5358 -200414
18242b00414L23518M09732Q3414J42750N2025K3904K6665K91982Q8635m1913k70525
$$ -200414 123104 532836 616250 759000 811025 834929 861594 1153576 1242211 1200298 929773
18231I29773r7009n388k74044l23620j12877m2331m6362k6958J63161J82083K14684
$$ 929773 832764 827376 553332 229712 116835 74504 28142 1184 164345 346428 561112
18220E61112j766Q9283N0151j69339J6087j40657j2051j25237n8087J44434K34193
$$ 561112 559346 648629 698780 529441 545528 404871 392820 267583 209496 353930 588123
18209E88123J95865n1754j74421J06723J48878J3218k25236K5058N478j98283
$$ 588123 783988 732234 557813 664536 813414 826632 601396 626454 631932 433649
18199D33649J76265K29827j88406l81663j255J14180j22876M6625K11951K13334
$$ 433649 609914 839741 651335 269672 268417 382597 259721 306346 518297 731631
18189G31631K5427Q7662j44454j9574j84751J28484j13208P1611K0389j88097
$$ 731631 757058 844720 700266 680692 495941 624425 511217 582828 603217 415120
18179D15120j93444n2978L7298J40663K36611J91033j25931J20522l8228J1432
$$ 415120 221676 168698 205996 346659 583270 774303 648372 768894 730666 742098
18169G42098N8513K73580J65118j62522j72374k89245l76452J75945L54195L68473
$$ 742098 800611 1074191 1239309 1076787 904413 615168 238716 414661 768856 1137329
18159A137329K1827k179j13784l096m3863k21357L2701J63406o0891J87407m3648
$$ 1137329 1159156 1156977 1043193 1040097 996234 774877 807578 970984 910093 1097500 1053852
18148A053852k3871K2737K19372K89837N51383J0558k95590J30583K89547M2276
$$ 1053852 1029981 1052718 1272090 1561927 2113310 2123868 1828278 1958861 2248408 2290684
18138B290684o6725j3767L06337J75120O8193K23665K87757M55071N4894L56151
$$ 2290684 2223959 2210192 2516529 2691649 2759842 2983507 3271264 3726335 3781229 4137380
18128D137380Q23082N46206L34402N64770P66277J136937J560008J545470J879316
$$ 4137380 4960462 5506668 5841070 6405840 7172117 8309054 9869062 11414532 13293848
18119A3293848K316060L577692N171502P216256R962836J5286465K3968127L8192003
$$ 13293848 15609908 19187600 24359102 31575358 41538194 56824659 80792786 118984789
18111A18984789O0931379Q9405298J00205384M2313460o7230551j17524697p9442754
$$ 118984789 179916168 269321466 369526850 411840310 344609759 227085062 147642308
18104A47642308m1280267k2907634j4225092j0050255p021923n006099l743633
$$ 147642308 106362041 83454407 69229315 59179060 52157137 47151038 43407405
18097D3407405k919871k030829j491424k142002l259138l533911l320317l034747
$$ 43407405 40487534 38456705 36965281 34823279 31564141 28030230 24709913 21675166
18089B1675166k493300j925549j841327j736422j283762j007897j040659j191919
$$ 21675166 19181866 17256317 15414990 13678568 12394806 11386909 10346250 9154331
18081I154331r59282o48568n39250o27385p74136q14611m52156k37022j08857
$$ 9154331 8195049 7546481 7007231 6379846 5605710 4791099 4338943 4101921 3993064
18072C993064l77861p13389j02449l29340m06954l2395J08454k88124m69856k73453
$$ 3993064 3615203 2901814 2799365 2470025 2063071 2030676 2139130 1851006 1381150 1107697
18062A107697n1208r3074k1783N1442k7349J8454k62710r1153L9090o3741Q6230
$$ 1107697 1056489 963415 941632 993074 965725 984179 721469 630316 669406 605665 691895
18051F91895J13162p9563m84065m33997J19243N48011p4755j03811J8971j96167
$$ 691895 805057 725494 241429 -192568 -73325 474686 399931 296120 315091 118924
18041A18924J5820k4751j11010r0806j62451O1759N143J15902l9168L6730J73201
$$ 118924 134744 109993 -1017 -91823 -254274 -192515 -187372 -71470 -110638 -73908 99293
18030I9293j56441q9249k8261k98213R3725J06301j4371Q5886J88095j59218P9274
$$ 99293 -57148 -146397 -174658 -472871 -379146 -272845 -287216 -201330 -13235 -172453 -93179
18019i3179j63635J17184L5543J18021k562N0727j48571l8313N2647n7276m7504
$$ -93179 -256814 -139630 -104087 13934 11372 62099 -86472 -124785 -72138 -129414 -176918
18008a76918P1176M9734J15171o2333q6747K9865p994K28811K9004j02010J58339
$$ -176918 -105742 -56008 59163 -3170 -89917 -60052 -68046 160765 189769 87759 246098
17997B46098J29104j96894j63301j85242Q4987n970L2438N4823P156L6017k38255
$$ 246098 375202 178308 15007 -170235 -85248 -91218 -58780 -3957 3199 39216 -199039
17986a99039o7965P5248K1422k03281k08145n0282K62984K39481K20710k36439
$$ -199039 -267004 -191756 -170334 -373615 -581760 -632042 -369058 -129577 91133 -145306
17976a45306J33176L0873J73015n0693k66244p8321m6119m9740k1901P6045K47485
$$ -145306 -12130 18743 191758 141065 -125179 -203500 -249619 -299359 -321260 -245215 2270
17965B270N8770j71004n1103l7194L11197J66741j19092M0192j51546m5119K8321
$$ 2270 61040 -109964 -161067 -198261 112936 279677 160585 200777 49231 4112 32433
17954C2433J4938l41094K7236K85333J12169p5446K09809l9021j36990L5141n1984
$$ 32433 47371 -293723 -266487 18846 131015 55569 265378 226357 89367 124508 72524
17943G2524j01722o6783Q5327K11414M9958k62221l00363j15343k11631N7930
$$ 72524 -29198 -95981 -10654 200760 250718 -11503 -311866 -427209 -638840 -580910
17933e80910J6526K56659K37887q6785O1977J00208J2351M3461J1651j19240J6707
$$ -580910 -564384 -307725 -69838 -156623 -94646 5562 17913 61374 73025 -46215 -29508
17922b9508K39672J59988j86252q7875J01196m7052j29770J55532j6721m7198
$$ -29508 210164 370152 183900 96025 197221 150169 20399 175931 159210 112012
17912A12012j8820j28179k02829K5145N2022J98043P1169m075K3472L1638Q9868
$$ 112012 93192 -34987 -237816 -212671 -160649 37394 108563 104488 127960 159598 249466
17901B49466m7531m53250p5153K25342P4367o9486j9430l3895m2531j17340L0141
$$ 249466 201935 -251315 -326468 -101126 -26759 -96245 -115675 -149570 -192101 -309441 -279300
17890b79300p3250P5050K01591J72871k2124n3990N8866J82732R3662N5814k78828
$$ -279300 -352550 -277500 -75909 96962 74838 20848 79714 262446 356108 411922 133094
17879A33094j16705J2619k72092l9258j56711m3526J68738M0294l8930J30552
$$ 133094 16389 29008 -243084 -282342 -439053 -482579 -313841 -273547 -312477 -181925
17869a81925J4972K252J04695j84843q544K82109J40354M0602O9477J545j72105
$$ -181925 -166953 -164701 -60006 -244849 -253393 28716 169070 209672 279149 280694 108589
17858A08589j78892R897q6167O1119J6123J30655o9672l3421L5457P7697k1800
$$ 108589 -70303 -60406 -146573 -85454 -69331 61324 -8348 -41769 -6312 71385 49585
17847D9585p7695Q3016l8856M9253K14235L92948n07346j17726l5619k22955j18338
$$ 49585 -28110 54906 16050 65303 279538 672486 165140 47414 11795 -211160 -329498
17836c29498J04348j88000k44726J90041L70965P2868j8254K07570j27654m6766
$$ -329498 -225150 -413150 -657876 -467835 -96870 -24002 -42256 165314 37660 -9106
17826i106j54497M0154k12988k20354j44537K97210L41189j61268m2504K7198
$$ -9106 -163603 -123449 -336437 -556791 -701328 -404118 -62929 -224197 -266701 -239503
17816b39503j09327J07864L16581m0233J10851O9058j12850r4360k90529j20626
$$ -239503 -348830 -240966 75615 35382 146233 215291 102441 8081 -282448 -403074
17806d03074O4741K43188J32793J48333O5131P3924j87346j5480J58794R4185
$$ -403074 -338333 -95145 37648 185981 251112 325036 137690 122210 281004 375189
17796C75189r0334j90195j46222n4547r9670J49347Q2899o3775j02978n6174j9429
$$ 375189 284855 94660 -51562 -106109 -205779 -56432 26467 -37308 -140286 -196460 -215889
17785b15889L8958P3356R0870J16780J50196J72629N150k64716Q9954Q2408J27829
$$ -215889 -176931 -103575 -12705 104075 254271 426900 432050 167334 257288 339696 467525
17774D67525J86983K22171p4949k6081o210K71569K49723J14658Q504J28162N12225
$$ 467525 654508 876679 801730 775649 769439 1041008 1290731 1405389 1413893 1542055 2054280
17763B054280K40136q6997M9206K49255J59522k04756m83100n58814M9584L6338
$$ 2054280 2294416 2207419 2256625 2505880 2665402 2460646 1977546 1418732 1468316 1504654
17753A504654l7555l60484j55702k36346r8867r3307p1259M2385J4855j07322
$$ 1504654 1467099 1106615 950913 714567 615700 522393 451134 493519 508374 401052
17743D01052P5034J90518j23150J87611j4371m36681j90689K5857O7091R7039
$$ 401052 476086 666604 543454 731065 716694 280013 89324 115181 182272 279311
17733B79311k0749J69480K35189J62898l0810L4949O2572j45520k28244m7372
$$ 279311 258562 428042 663231 826129 795319 830268 892840 747320 519076 471704
17723D71704j3180k8026j90071j47830j61440N2598J99329J57635L52202J12909
$$ 471704 458524 430498 240427 92597 -68843 -16245 183084 340719 692921 805830
17713H05830J05885Q232K61470L41910K02353L74422K15271K95458J27037j07240
$$ 805830 911715 919947 1181417 1523327 1725680 2100102 2315373 2610831 2737868 2630628
17703B630628k35258l36595k22844r4043k47381m6448J2569j74339l11626k91923
$$ 2630628 2395370 2058775 1835931 1741888 1494507 1448059 1460628 1286289 974663 682740
17693F82740l04255j95486J59181q4413J56031J585R4441J1424n8418k8633J46774
$$ 682740 378485 182999 342180 257767 413798 415383 509824 521248 462830 434197 580971
17682E80971L9010O3724k37764j82822J9181j85106o2317j09711R0980K30389
$$ 580971 619981 683705 445941 263119 282300 97194 34877 -74834 16146 246535
17672B46535K90776J02478l97902m4926J09564J39232k2719R7468p9927m4998
$$ 246535 537311 639789 241887 196961 306525 445757 423038 520506 440579 395581
17662C95581n8153r2736J31560P179j09759n5707l45158J25834J01797R4513m3582
$$ 395581 337428 244692 376252 383431 273672 217965 -127193 -1359 100438 194951 151369
17651A51369J76643o1757J27425R7828r2317j96119j44365M0905O8508n0255k06037
$$ 151369 328012 266255 393680 491508 399191 203072 58707 99612 168120 117865 -88172
17640h8172o4176P3699o2886l0847Q4091O6570k18475M3425L65747N4335P9642
$$ -88172 -152348 -78649 -141535 -172382 -88291 -21721 -240196 -196771 168976 223311 302953
17629C02953q2944L16313j69188j05248m471j12686p9329q310J53594K25114N2402
$$ 302953 220009 536322 367134 261886 257415 144729 65400 57090 210684 435798 488200
17618D88200p5015K2207j21616j53402J73990J10981J7139j32899O5996P8483
$$ 488200 413185 435392 313776 160374 334364 445345 462484 329585 395581 474064
17608D74064L8107k3335j01731k05536j58389n2558L33756J89862j72127j64491
$$ 474064 512171 488836 387105 181569 23180 -29378 304378 494240 322113 157622
17598A57622J61297k86199j55510l65o7806j4997Q3344o2337R3463K51650P9403
$$ 157622 318919 32720 -122790 -123155 -190961 -205958 -122614 -184951 -91488 160162 239565
17587B39565N2578K9279n0448n1887j47224k28401P1185K19559J06663n7495j33238
$$ 239565 292143 321422 270974 219087 71863 -156538 -85353 134206 240869 183374 50136
17576E0136P3148J95763L5161N0659k59055n959Q0515j10645n0990Q1255j22794
$$ 50136 123284 319047 354208 404867 145812 139853 220368 109723 58733 139988 17194
17565A7194J9376J68809K29863r0426j22675m5529j54124K4827J54950j24821
$$ 17194 36570 205379 435242 344816 222141 176612 22488 47315 202265 77444
17555G7444n6866j15203K39916M15967R3598j46136l70296k58524R756J40866
$$ 77444 20578 -94625 145291 561258 654856 508720 138424 -120100 -110344 30522
17545C0522k2772o4399J51736K10992r5975j09083L67672P4125r2674j05878q4717
$$ 30522 7750 -56649 95087 306079 210104 101021 468693 542818 450144 344266 259549
17534B59549j5029k8409q0235j77966p5077K5747K91159K43688K52107k45996
$$ 259549 244520 216111 135876 -42090 -117167 -91420 199739 443427 695534 449538
17524D49538j71180J10811J5095M9879k43838l8276P6857K6586J02483J6134j55109
$$ 449538 278358 389169 404264 454143 210305 172029 248886 275472 377955 394089 238980
17513B38980j67J85792J49383o069j67616M7063j32363J5419L28809q2401o4858
$$ 238980 238813 424605 573988 567919 400303 447366 315003 330422 659231 576830 511972
17502E11972J11100r653r7705q3797L11558j41362L2857J40189l5976J29191L06877
$$ 511972 623072 613419 515714 431917 743475 602113 634970 775159 739183 868374 1175251
17491A175251l34263j03812n8558J0914n6195k46609J97219J30734P5812N4505
$$ 1175251 840988 737176 678618 689532 633337 386728 583947 714681 790493 844998
17481H44998m7265N1210q7847l12909J8088K17104K13133J16934p5506j64633
$$ 844998 797733 848943 761096 448187 466275 683379 896512 1013446 937940 773307
17471G73307k91342p0137j56699q7053K33374J89826M7175L0127n2278k00403
$$ 773307 481965 411828 255129 168076 401450 591276 638451 668578 616300 415897
17461D15897o1011k42358K24333J86433K7069j6953q9746P072J6011J21466k18507
$$ 415897 354886 112528 336861 523294 550363 533410 443664 450736 466747 588213 369706
17450C69706J1985R3751j37263o6384j6731K61447M21624O06746O00356q2397
$$ 369706 381691 475442 338179 271795 255064 516511 938135 1544881 2145237 2062840
17440B062840l90612m17662j14786j96382j68804N3946J35928K49789P4945j46849
$$ 2062840 1672228 1254566 1139780 943398 774594 828540 964468 1214257 1289202 1142353
17430A142353p1165P0652O6295j66972j69394L21318N5122k50980l3245J04236
$$ 1142353 1071188 1141840 1208135 1041163 871769 1193087 1248209 997229 963984 1068220
17420A068220O7037J21028j79274n6381j00425j10863r7751l8166r3389n2560
$$ 1068220 1135257 1256285 1077011 1020630 920205 809342 711591 673425 580036 527476
17410E27476j18859K28225j24253r3524J33518K49981l30393k03100L5792m5910
$$ 527476 408617 636842 512589 419065 552583 802564 472171 269071 304863 258953
17400B58953j58555M8234K57374K05491Q3942k9349j88722J01287q7415l0941
$$ 258953 100398 148632 406006 611497 695439 666090 477368 578655 491240 460299
17390D60299K3290k2206J05311P242r9438K63928K64949n3046o8580k53799R6428
$$ 460299 483589 461383 566694 573936 474498 738426 1003375 950329 881749 627950 724378
17379G24378l6207q1503k65649J09674J74829R8303J09797O7522J8041L6408k1066
$$ 724378 688171 606668 341019 450693 625522 723825 833622 901144 919185 955593 934527
17368I34527N8404J50275L27323P9881R7462L53691K62986Q8367J2910o2822j73395
$$ 934527 992931 1143206 1470529 1550410 1647872 2001563 2264549 2352916 2365826 2303004 2129609
17357B129609m4105J29217j41754N116o1163j64714k45630k92411l9882n5609
$$ 2129609 2085504 2214721 2072967 2078083 2016920 1852206 1606576 1314165 1274283 1218674
17347A218674l1525J604r7784J78007K39090J8013J31273k57919k65556Q2540
$$ 1218674 1187149 1188753 1090969 1268976 1508066 1526079 1657352 1399433 1133877 1216417
17337A216417P8032K63982K92258m4555j73947J42501K06342P6508o8557j87425
$$ 1216417 1294449 1558431 1850689 1806134 1632187 1774688 1981030 2057538 1988981 1801556
17327A801556k49181L5344q3786K63394o8330j32978J8177N7007K5087J77040
$$ 1801556 1552375 1587719 1503933 1767327 1698997 1566019 1584196 1641203 1666290 1843330
17317A843330j72001J22226L2560K72510K4610l8433J32255J39453l9325K75496
$$ 1843330 1671329 1793555 1826115 2098625 2123235 2084802 2217057 2356510 2317185 2592681
17307B592681K10622L19321m3071K042J91661P6099J32128j06583k7418J66807
$$ 2592681 2803303 3122624 3079553 3081595 3273256 3349355 3481483 3374900 3347482 3514289
17297C514289P889P5352L0574J89239r7122k61108l16742L3802J51947M42686
$$ 3514289 3522178 3597530 3628104 3817343 3720221 3459113 3142371 3176173 3328120 3770806
17287C770806M01890J30188j59092K30884r2487M6498J11259N35N1284J64857
$$ 3770806 4172696 4302884 4143792 4374676 4282189 4328687 4439946 4440481 4491765 4656622
17277D656622L15109J91744N7980L83119O22649O63722N28887M65830N36387N02897
$$ 4656622 4971731 5163475 5221455 5604574 6227223 6890945 7419832 7885662 8422049 8924946
17267H924946O44461P33753O80221O97631N03739L72386M44776M59564M28165
$$ 8924946 9569407 10303160 10983381 11681012 12184751 12557137 13001913 13461477 13889642
17258A3889642N60349N13643O25040R08277Q92655J111939J589233K318965K858448
$$ 13889642 14449991 14963634 15588674 16496951 17389606 18501545 20090778 22409743 25268191
17249B5268191L795442M809258O222960Q204733J0902025J4740684K0181609K6887818
$$ 25268191 29063633 33872891 40095851 48300584 59202609 73943293 94124902 121012720
17241A21012720L4408351M1914815M8291505N2136173N2560700M7613155L6858411
$$ 121012720 155421071 197335886 245627391 297763564 350324264 397937419 434795830
17234D34795830K1958682O408346r125828k4000711l7261401m5090829m6790118
$$ 434795830 456754512 463162858 454037030 430036319 392774918 347684089 300893971
17227C00893971m4280260l9469761l3684825k6914154k0650828j5219193j1727643
$$ 300893971 256613711 217143950 183459125 156544971 135894143 120674950 108947307
17220A08947307r562920q168472p407853o561276n751136n520390n013367m445346
$$ 108947307 99384387 91215915 83808062 77246786 71495650 65975260 60961893 56516547
17212E6516547l774647l328843k835594k397647j854016j889262j715465j393809
$$ 56516547 52741900 49413057 46577463 44179816 42325800 40436538 38721073 37327264
17204C7327264j273452j392867j220526q17008q58831p50018o07845k38398k89660
$$ 37327264 36053812 34660945 33440419 32623411 31764580 31014562 30406717 30168319 29878659
17195B9878659M11371J117338J679490K237642L343896N057959P290105R549529
$$ 29878659 30290030 31407368 33086858 35324500 38668396 43726355 51016460 60565989
17187F0565989J2900204J7881928K4695316L2379109M0224954M7459531N2794951
$$ 60565989 73466193 91348121 116043437 148422546 188647500 236107031 288901982
17180B88901982N4842575N2064271M3311888K9425994J2976121l389370j9287452
$$ 288901982 343744557 395808828 439120716 468546710 481522831 478133461 458846009
17173D58846009l3689246m4302004m8610193m7648887m3825787l8192537l1297489
$$ 458846009 425156763 380854759 332244566 284595679 240769892 202577355 171279866
17166A71279866k4284976j8553428j4081432j1194255r418328p948220p313573
$$ 171279866 146994890 128441462 114360030 103165775 93747447 85799227 78485654
17159G8485654o806482o175722n868270n400442m922062m404777m038382l372785
$$ 78485654 71679172 65503450 59635180 54234738 49312676 44907899 40869517 37496732
17151C7496732k932478k547202k148674j910724k102547k158008k024291j693484
$$ 37496732 34564254 32017052 29868378 27957654 25855107 23697099 21672808 19979324
17143A9979324j544106j423996j435233j323815j135526j126634j199176j066240
$$ 19979324 18435218 17011222 15575989 14252174 13116648 11990014 10790838 9724598
17135I724598q39744o48758m33814n85637q72399p06119l52908m02234o08597
$$ 9724598 8884854 8236096 7802282 7216645 6344246 5638127 5285219 4882985 4274388
17126D274388m23698j58442k20463l87196k55720k34843j08182p6928j05768j66662
$$ 4274388 3850690 3692248 3471785 3084589 2828869 2594026 2485844 2408916 2303148 2136486
17116B136486j69497k26403j15857k72681n36548l10946j53468q9503m4924k20746
$$ 2136486 1966989 1740586 1624729 1352048 815500 504554 351086 261583 216659 -4087
17106d087j86805p268Q5824J76626L7957P6943J39522j07158j03632j45483Q3800
$$ -4087 -190892 -198160 -112336 64290 102247 179190 318712 211554 107922 -37561 46239
17095D6239J75670L29641p3893k11680k54546j66902J677K97572k7279l50814
$$ 46239 221909 551550 477657 265977 11431 -155471 -153794 143778 116499 -234315
17085b34315J70900N8821j00203J70404L39542j4738j25270K00963N9138k04749
$$ -234315 -63415 -4594 -104797 65607 405149 390411 265141 466104 525242 320493
17075C20493p1953j09134Q5709K09115J67K9170k47094J4335j63181j21443J65129
$$ 320493 248540 139406 225115 434230 434397 463567 216473 230808 67627 -53816 111313
17064A11313M1105k56041r5460J18022J79112K81216r516j31048k38446K6846
$$ 111313 152418 -103623 -199083 -81061 98051 379267 369751 238703 257 27103
17054B7103j53819q3571K522j2107l8922j23507L22024J271j72546j72127P9171
$$ 27103 -126716 -210287 -207765 -219872 -258794 -382301 -60277 -59006 -231552 -403679 -324508
17043c24508k5233p4722N4751j11780K20387K74635l4423p6687N4084L98945o0175
$$ -324508 -349741 -424463 -369712 -481492 -261105 13530 -20893 -97580 -43496 355449 295274
17032B95274k53291p3069J96855K37282K27490J5256p6208l6347j54721p532j17872
$$ 295274 41983 -31086 165769 403051 630541 645797 569589 533242 378521 370989 253117
17021B53117l1660K59997j16782q3798N6164J8361lj78276r0931k0612O075n7440
$$ 253117 221457 481454 364672 280874 337038 355399 355396 177120 86189 65577 71652 14212
17009A4212n8572J55978j32729J28224p278p1323K77593K3613j76943o6624J78341
$$ 14212 -44360 111618 -21111 107113 99835 28512 306105 329718 152775 86151 264492
16998B64492J02613j65659o6418k32459k77948P25m4485J39525K6491M3785N095
$$ 264492 367105 201446 135028 -97431 -375379 -374654 -419139 -279614 -253123 -209338 -204243
16987b04243N8021N1783O0746j11740J75288J33406q5416r7691j28135J47898
$$ -204243 -146222 -94439 -33693 -145433 29855 163261 77845 -19846 -147981 -83
16977h3R1979Q1060K47322o6896q2499r2229k5968N6232k4053k20164k61059j50598
$$ -83 91896 172956 420278 353382 270883 178654 152686 208918 184865 -35299 -296358 -446956
16965d46956k6334j23741K34229J64526J68923j91807J871J08036k72845R8124
$$ -446956 -473290 -597031 -362802 -198276 -29353 -221160 -219289 -111253 -384098 -285974
16955b85974J59353j74190m626P5889o8487o5267j55172J40801M1154J14654O4916
$$ -285974 -126621 -300811 -305437 -229548 -298035 -363302 -518474 -377673 -336519 -221865 -156949
16944a56949j86150k81008l6262j03062M2675J67022J69964K3974J29614J78561
$$ -156949 -343099 -624107 -660369 -763431 -720756 -553734 -383770 -359796 -230182 -51621
16934e1621o6353j86578j84304p7774K22677K33004q15j2655n3403O579k13673
$$ -51621 -117974 -304552 -488856 -566630 -343953 -110949 -111764 -124419 -177822 -171243 -384916
16923c84916P7452K70092N8087m70471l74236J74682O8557L1947K80328J77265
$$ -384916 -307464 -37372 20715 -449756 -823992 -649310 -580753 -548806 -268478 -91213
16913i1213K16936R3347j49005J8934k25439m9040r2022N7579J65378O7905P2725
$$ -91213 125723 219070 70065 88999 -136440 -185480 -277502 -219923 -54545 13360 86085
16902H6085R2539j1732l43783p8701j6165k36539j21538k8684R2265J22106O7976
$$ 86085 178624 166892 -176891 -255592 -271757 -508296 -629834 -658518 -566253 -444147 -376171
16891c76171J97296J12218J09114J20198n0090k10663o4402M016K58605Q3342
$$ -376171 -178875 -66657 42457 162655 112565 -98098 -162500 -158484 100121 183463
16881A83463O6681J07013J87174j09036j59050l54402r8241J9172J23706k4632
$$ 183463 250144 357157 544331 435295 276245 -78157 -176398 -157226 -33520 -58152
16871e8152j00375J42209M2598r4640o7588j28782j29355j5329J79424k0422k04055
$$ -58152 -158527 -16318 26280 -68360 -135948 -264730 -394085 -409414 -229990 -250412 -454467
16860d54467j66505K30024K3708K03373J10504O5184J36746k60254l24705k24844
$$ -454467 -620972 -390948 -367240 -163867 -53363 11821 148567 -111687 -436392 -661236
16850f61236K46914J86187L91733j07893l57875M6714J04578Q2313p954p8990
$$ -661236 -414322 -228135 163598 55705 -302170 -255456 -150878 -68565 -76519 -155509
16840a55509M326J13278j36935J37053o975j72271K62616j56623k92219Q7680
$$ -155509 -151183 -37905 -174840 -37787 -44762 -217033 45583 -111040 -403259 -315579
16830c15579J03076Q9396N8915q2439k53163j30572J53334K42894J92229j93532
$$ -315579 -212503 -123107 -64192 -146631 -399794 -530366 -377032 -134138 58091 -135441
16820a35441j23708M4965o3961L04343r193k37031j07961K00266k6276J17730
$$ -135441 -259149 -214184 -278145 26198 17005 -220026 -327987 -127721 -153997 -36267
16810c6267J3518j08457m8045q3496K25461O8035M2753O916K15161J36673k09434
$$ -36267 -22749 -131206 -179251 -262747 -37286 30749 73502 80418 295579 432252 222818
16799B22818q6894M5504l08640l5734K9368P6766l3362O414n7158k25253k10161
$$ 222818 135924 181428 -127212 -162946 -133578 -56812 -90174 -83760 -140918 -366171 -576332
16788e76332J22072K08815K37754j70881j56462K83889J37341j05430l18044j16243
$$ -576332 -454260 -245445 -7691 -178572 -335034 -51145 86196 -19234 -337278 -453521
16778d53521L36275R5871j68591n5011k1663j53138j26904K98732J57480n3571
$$ -453521 -117246 -21375 -189966 -244977 -266640 -419778 -546682 -247950 -90470 -144041
16768a44041J79829K9357J7741j11546J15619L01659K2497j97284k96204k47715
$$ -144041 35788 65145 82886 -28660 86959 388618 411115 213831 -82373 -330088
16758c30088k55903J82526K88032J03381r7377j25245q8006K39799K5455L5249
$$ -330088 -585991 -403465 -115433 -12052 -109429 -234674 -322680 -82881 -57426 -22177
16748b2177Q3940k0663K2683j9679K11163R6738l040j86810j4538k6026j19100
$$ -22177 61763 41100 63783 44104 255267 352005 348965 162155 147617 121591 2491
16737B491R6673J36828n3239j27616M140m5351j9367L7905q5169J12939p0824
$$ 2491 99164 235992 182753 55137 59277 13926 -5441 32464 -52705 60234 -10590
16726a0590j68642p1830m7954m3243R2462k6386p2027M8114K35003O3152p1630
$$ -10590 -179232 -251062 -299016 -342259 -249797 -276183 -348210 -300096 -65093 -1941 -73571
16715g3571j07388J86988J21679l56972k5274L54025K48855P633J89947J68536
$$ -73571 -180959 6029 127708 -229264 -254538 99487 348342 355975 545922 714458
16705G14458L43437J07762K20913M27252K20020k7346J30684J97833O094k07636
$$ 714458 1057895 1165657 1386570 1813822 2033842 2006496 2137180 2335013 2341107 2133471
16695B133471j15558m14033l28001j18091k07657k82914n2931P320j34048p1588
$$ 2133471 2017913 1603880 1275879 1157788 950131 667217 614286 621606 487558 415970
16685D15970p1457j67116j10354R51l662J32176J28821j37386j21225k3332N338
$$ 415970 344513 177397 67043 67994 64332 196508 325329 187943 66718 43386 48724
16674D8724J0384j47894K07002J39620j92938k65477j98391J47625J71618K37549
$$ 48724 59108 -88786 118216 257836 64898 -200579 -398970 -251345 -79727 157822
16664A57822J00209n1614p1695k83096l3734K56578J99707j76082p5420L1641
$$ 157822 258031 206417 134722 -148374 -182108 74470 274177 98095 22675 54316
16654E4316R9076J52834k5188j13948K44782J03386m2215L52751L76584K63073
$$ 54316 153392 306226 281038 167090 411872 515258 473043 825794 1202378 1465451
16644A465451J86205J97568J14957J79693j38362j96890m3803Q2508j80635j89803
$$ 1465451 1651656 1849224 1964181 2143874 2005512 1808622 1764819 1847327 1666692 1476889
16634A476889l98783n00933j32701o1371j87666K01631J07380o7162n8988R3603
$$ 1476889 1078106 577173 444472 383101 195435 397066 504446 437284 378296 471899
16624D71899j7357k76077l91489J33329P1771J3520O6344Q5530P7969o7474r4368
$$ 471899 454542 178465 -213024 -79695 -7924 5596 71940 157470 235439 167965 73597
16613G3597j13864j73728J48004j332l8975o1730J6027J85433j9092n7954R4199
$$ 73597 -40267 -213995 -65991 -67323 -106298 -168028 -152001 33432 14340 -43614 50585
16602E0585n1673k18050M1269J71254P6540j42629J89482J4498q3371k44572r8785
$$ 50585 -1088 -219138 -177869 -6615 69925 -72704 116778 131276 47905 -196667 -295452
16591b95452K5064K78932L09170L3850r6612o7528k3900N4338N8376j99070j84852
$$ -295452 -270388 8544 317714 351564 254952 187424 163524 217862 276238 77168 -107684
16580a07684o0046J97944P0597k3014K914j2041J05952n2514j61324K81236r1160
$$ -107684 -167730 30214 100811 77797 80711 68670 174622 122108 -39216 242020 150860
16569A50860k44949k16902P3488j2354m2597J45381L16355L1501k66007k54179
$$ 150860 -94089 -310991 -237503 -249857 -292454 -147073 169282 200783 -65224 -319403
16559c19403P621J24313K22445J29085q2110Q6836M5137q0252j7561p0782K1268
$$ -319403 -311782 -187469 34976 164061 81951 168787 213924 133672 116111 45329 66597
16548F6597m6069k20286j93264N2120N28504J76339j40364l19355k58829M6650
$$ 66597 20528 -199758 -393022 -340902 187602 363941 223577 -95778 -354607 -307957
16538c07957J73531P7976K13429j28959q6965r8500l5207j21m0185m1842P0236
$$ -307957 -134426 -56450 156979 28020 -58945 -157445 -192652 -192773 -232958 -274800 -204564
16527b04564J6307M2277P7796J27685K0325N0420q702j26236J50516J65690k6308
$$ -204564 -188257 -145980 -68184 59501 79826 130246 121544 -4692 145824 311514 285206
16516B85206l9513j90951J21582R0141j65434M0632r3351m9463j18687J0299m8686
$$ 285206 245693 54742 176324 266465 101031 141663 48312 -1151 -119838 -109539 -158225
16505a58225J7969n4106q3159J61987R5294q6555n240J18374J5102j57748k45517
$$ -158225 -140256 -194362 -277521 -115534 -20240 -106795 -112035 6339 21441 -136307 -381824
16494c81824J98128K29588N2044l19964j87635p4045P0417K70041j09460r3749
$$ -381824 -183696 45892 97936 -222028 -409663 -483708 -413291 -143250 -252710 -346459
16484c46459K66715J06923j39583r5528K8094j17801K4871K15561l1835L4122
$$ -346459 -79744 27179 -112404 -207932 -179838 -297639 -272768 -57207 -89042 -54920
16474e4920J514r843L1657j2561J82971J36372j18699j20807R671k5321N930k68138
$$ -54920 -53406 -63249 -31592 -44153 138818 275190 156491 35684 45355 20034 25964 -242174
16462b42174K9205O4379K1176j06326o1489R2728K79967j0634k16884q4698M12572
$$ -242174 -212969 -148590 -127414 -233740 -295229 -202501 77466 66832 -150052 -234750 177822
16451A77822j06195O3308R2859m8634J09442Q2469l22k26322l5574k5031j63082
$$ 177822 71627 134935 227794 179160 288602 371071 370749 144427 108853 83822 -79260
16440g9260j26512K23476J63991N3382L5901j07689j41025J49579n6818o8344
$$ -79260 -205772 17704 181695 235077 270978 163289 22264 171843 115025 46681
16430D6681p3438j71109j71828K57944J75487j31565o4801J36930J14060j49336
$$ 46681 -26757 -197866 -369694 -111750 63737 -67828 -132629 4301 118361 -30975
16420c0975K18256k16801j67629N4387q9824J9188J17521R0669r3195Q6618m9923
$$ -30975 187281 -29520 -197149 -142762 -232586 -213398 -95877 -5208 -98403 -11785 -61708
16409f1708m9098j16239R0245J62431M3383p4898J7552R7102J53704k13509k58193
$$ -61708 -110806 -227045 -136800 25631 69014 -5884 11668 108770 262474 48965 -209228
16398b09228Q3520J71139j0540j64095j9362m6471J64009L08466J99536j01762
$$ -209228 -125708 45431 34891 -129204 -148566 -195037 -31028 277438 476974 375212
16388C75212K3870l4618K1433n3755j36497k21711L5639j10670L2419J13494J3934
$$ 375212 399082 364464 385897 332142 195645 -26066 9573 -101097 -68678 44816 58750
16377E8750k1248P3012j36182m183k4087J60937K22710l8923K5474q3834j00618
$$ 58750 37502 110514 -25668 -29851 -53938 106999 329709 290786 316260 232426 131808
16366A31808l4385r462P9264k86495J2461J71909R9625q5613q3374k1531L60486
$$ 131808 97423 87961 167225 -119270 -106809 65100 164725 79112 -4262 -25793 334693
16355C34693L1213k17508j08187J6260J91820J06648k2123r3045o5907N0881n2683
$$ 334693 365906 148398 40211 56471 248291 354939 332816 239771 173864 224745 172062
16344A72062l32513O2509J07063o2641O4150l6496k0140K41871K30019N7236J18492
$$ 172062 -160451 -97942 9121 -53520 10630 -25866 -46006 195865 425884 483120 601612
16333F01612N2111J26274r6140J4918l04810j05288N9115M7739j19017j61355
$$ 601612 653723 779997 683857 698775 393965 288677 347792 395531 276514 115159
16323A15159m6091J21670q0546N9830l82261J52860K98227N7037j949p5621o9418
$$ 115159 69068 190738 110192 170022 -212239 -59379 238848 295885 293936 218315 148897
16312A48897j99822k06566j91978l9711J11829J49784J96211J10900K37464m6618
$$ 148897 -50925 -257491 -449469 -489180 -377351 -227567 -31356 79544 317008 270390
16302B70390k21854j23215p1946p226L4201K11615Q4438j08611j32542j84513
$$ 270390 48536 -74679 -146625 -153851 -119650 91965 176403 67792 -64750 -249263
16292b49263j28691L35637J58557N2917o4651j81657M5200Q0471J21075l8233
$$ -249263 -377954 -42317 116240 169157 104506 -77151 -31951 48520 169595 131362
16282A31362k33994J6289K1291K4821o2483J30802n5585J40093l9247m158K1987
$$ 131362 -102632 -86343 -65052 -40231 -102714 28088 -27497 112596 73349 69191 91178
16271I1178J70678j37230j35147N1984J09920N6032J59497j02960j82832P8428
$$ 91178 261856 124626 -10521 41463 151383 207415 366912 263952 81120 159548
16261A59548K76097k26304k23552l7959P4770J73122k1132J1996J11534j32477
$$ 159548 435645 209341 -14211 -52170 22600 195722 174590 186586 298120 165643
16251A65643q4171J12918J31257J79432k49286k21199L700K29542k6280Q847j50704
$$ 165643 81472 194390 325647 505079 255793 34594 38294 267836 241556 250403 99699
16240I9699L4000K4485K12471r1528k05598m2974r1610l7320J39530J80449j0872
$$ 99699 133699 158184 370655 279127 73529 30555 -61055 -98375 41155 221604 210732
16229B10732Q8647J5280k55376j55516K78468M59539N8943k85219N3442J21965
$$ 210732 299379 314659 59283 -96233 182235 641774 700717 415498 468940 590905
16219E90905n049m64243j86341J66760J11437k52246l7830K30402j19581j89394
$$ 590905 585856 121613 -64728 102032 213469 -38777 -76607 153795 34214 -155180
16209a55180j8855q6707M18607K48907j62299j14011j19084M4461j00356q920
$$ -155180 -174035 -260742 157865 406772 244473 130462 11378 55839 -44517 -53437
16199e3437J78680q3608m09749R177R0298J31833M27863J63744R1310j6344Q6894
$$ -53437 125243 41635 -368114 -358937 -268639 -136806 291057 454801 546111 529767 616661
16188F16661p4962j51447j89134q3905j40999n930K59969K2120n7562J91593Q765
$$ 616661 541699 390252 201118 117213 -23786 -29716 230253 252373 194811 386404 395169
16177C95169l7705j0018j26127J59660O9562k89904L9050J07263k57903j52784
$$ 395169 357464 347446 221319 380979 450541 160637 199687 306950 49047 -103737
16167a03737L32390K63070q6344n0582k93990O2144K85092J33302j05806q1772
$$ -103737 228653 491723 405379 354797 60807 122951 408043 541345 435539 353767
16157C53767j84903Q6418n3567l42107k53691j12668M67580N55899J1142p7751
$$ 353767 168864 255282 201715 -140392 -394083 -506751 -39171 516728 527870 450119
16147D50119J30136k16870n0266j48622M5030n200j68865K50659J94853M6359
$$ 450119 580255 363385 313119 164497 209527 204327 35462 286121 480974 527333
16137E27333j06313k3480k33966j92259j18593L35003J78785k1798J48603O0576
$$ 527333 421020 397540 163574 -28685 -147278 187725 366510 344712 493315 553891
16127E53891L3893k27922j91869k17788r8120j02836L8966J31459J85497N3337
$$ 553891 587784 359862 167993 -49795 -147915 -250751 -211785 -80326 105171 158508
16117A58508j25216R0685K05818J86355k4924j22080o1448q432j19232J95251
$$ 158508 33292 123977 329795 516150 491226 369146 307698 299266 180034 375285
16107C75285J72679k69746p1708j20644r6762K16043L6847L04710K03792j29764
$$ 375285 547964 278218 206510 85866 -10896 205147 241994 546704 750496 620732
16097F20732j57507k9354j61115l4669L5354j13236Q6714J09885K04993J6576
$$ 620732 463225 433871 272756 238087 273441 160205 246919 356804 561797 578373
16087E78373j61932L9458k85988k39716J20426J53480N8250O0928O1561k8958
$$ 578373 416441 455899 169911 -69805 50621 204101 262351 323279 384840 355882
16077C55882j24192M3389j08429K1974Q7482J63689k3357j35024j42084P7650
$$ 355882 231690 275079 166650 188624 276106 439795 416438 281414 139330 216980
16067B16980R0606j3992R0747N9496M2564r9795k21959j21756j10192J89882P7686
$$ 216980 307586 293594 384341 443837 486401 386606 164647 42891 -67301 122581 200267
16056B00267l13827k8738M39467J68489o7271j54915o6585L2434L16129M9608
$$ 200267 -113560 -142298 297169 465658 398387 243472 176887 209321 525450 575058
16046E75058k36818j02829K66105L2569p3861m9545l9307P9436j37299P0304N3138
$$ 575058 338240 235411 501516 534085 460224 410679 371372 450808 313509 383813 436951
16035D36951m6157K15501K2510p2313K0809k00972o9434N1798J04687J5503M7575
$$ 436951 390794 606295 628805 556492 577301 376329 306895 358693 463380 478883 526458
16024E26458r1168j80764J16429m6690o5347l9229K76941J4533O5843j47989j64775
$$ 526458 435290 254526 370955 324265 258918 219689 496630 511163 577006 429017 264242
16013B64242P5263L72404J22026r8346k42974k48546J37371Q3099k3355L09998
$$ 264242 339505 711909 833935 735589 492615 244069 381440 464539 441184 751182
16003G51182R7953k69211n9465j6488N6584J45374P0295P4660k39893l23840J67238
$$ 751182 849135 579924 520459 503971 560555 705929 776224 850884 610991 287151 454389
15992D54389J13958j20170m0482k07239r8656K57252J03152J27084R6754J57013
$$ 454389 568347 448177 407695 200456 101800 359052 462204 589288 686042 843055
15982H43055J18273j10777k82480l5831O7418M1101L9689o2188K1742k76350j1188
$$ 843055 961328 850551 568071 532240 599658 640759 680448 618260 640002 363652 352464
15971C52464R1102j09216n0242j0945J67638J96612L2677J16864J19464j73803
$$ 352464 443566 334350 284108 273163 440801 637413 670090 786954 906418 732615
15961G32615m40954Q6161J50512K8355J19972N4249K7811p9670j42498N1749n6399
$$ 732615 291661 377822 528334 556689 676661 730910 758721 679051 536553 588302 531903
15950E31903K9129J29705M1578j38842j80940j92524m3900K93212J29819l00858
$$ 531903 561032 690737 732315 593473 412533 220009 176109 469321 599140 298282
15940B98282j63413K22232K73784J85390j93451L6331Q6162m313j20004J2062
$$ 298282 134869 357101 630885 816275 622824 659155 745317 741004 621000 633062
15930F33062j0273k05707Q4946J64863J07873j63668K1495m4523J2897m2831Q8720
$$ 633062 622789 417082 502028 666891 774764 611096 632591 588068 600965 558134 646854
15919F46854j06953j13476P9925J96798O3080l4174O718o5724o0389J48066K30830
$$ 646854 539901 426425 506350 703148 766228 732054 738772 673048 612659 760725 991555
15908I91555k734k16151j57206M6196R0011P836l2214R0247J0855j35647p3336
$$ 991555 988821 772670 615464 661660 751671 759507 727293 817540 828395 692748 619412
15897F19412j44588K51323j69683J8138o8810r289K23592p5198J90808R4282M8670
$$ 619412 474824 726147 556464 574602 505792 496503 720095 644897 835705 929987 978657
15886I78657P9919l0699m6435Q770J13343j4168O7120m7161j85690k09346P9187
$$ 978657 1058576 1027877 981442 990212 1103555 1089387 1156507 1109346 923656 714310 793497
15875G93497K14089k56996n7239j1595j0203L9645Q7135j58441k7969K56620j9304
$$ 793497 1007586 750590 693351 681756 671553 711198 798333 639892 611923 868543 849239
15864H49239K8639K26254K07240m3078j86881j67690n783k7463O3133J7724L2000
$$ 849239 877878 1104132 1311372 1268294 1081413 913723 907940 880477 943610 961334 993334
15853I93334k8239Q3771j18760J3856K06565j38996j06997Q538J0449O7054k2851
$$ 993334 965095 1048866 930106 943962 1150527 1011531 904534 913072 923521 990575 967724
15842I67724J43355j43714k24962R6565J66328q927j78241m8789M0180o8947j41349
$$ 967724 1111079 967365 742403 838968 1005296 996369 818128 769339 809519 740572 599223
15831E99223J13547n0782m511J7608k7662K5969N418J47127P6809l9047J9750
$$ 599223 712770 661988 657477 675085 647423 673392 678810 825937 902746 863699 883449
15820H83449n3214K30262j20084k62612k9350R6882N4017J24025K57104R8586
$$ 883449 830235 1060497 940413 677801 648451 745333 799350 923375 1180479 1279065
15810A279065R4198j87031l80701L5141J37516M4166J47152p8389l84226K7022
$$ 1279065 1373263 1186232 805531 840672 978188 1022354 1169506 1091117 706891 733913
15800G33913K24921J43220l8196j13372q5491O946J96961Q8918J80719n3654K5131
$$ 733913 958834 1102054 1063858 950486 864995 871941 1068902 1157820 1338539 1284885 1310016
15789A310016K56375j32476k81318k00497K3599L23135j11866j97031j14676k08377
$$ 1310016 1566391 1433915 1152597 952100 975699 1298834 1186968 989937 875261 666884
15779F66884j08990K36248P9904k7688J21241L2166J74107P2878K7781m8782k37193
$$ 666884 557894 794142 874046 846358 967599 999765 1173872 1246750 1274531 1225749 988556
15768I88556j3554n6038j79202n6982m1228O540J74296J3334J9224k40489J42357
$$ 988556 975002 918964 739762 682780 641552 648092 822388 835722 854946 614457 756814
15757G56814K50848j09641m1431N9057j48343K17334L40689L11911K26753j73907
$$ 756814 1007662 898021 856590 915647 767304 984638 1325327 1637238 1863991 1690084
15747A690084m10489l84812o0813m9263J36258k8123j93858L8114L42645J80022
$$ 1690084 1279595 894783 833970 784707 920965 892842 698984 737098 1079743 1259765
15737A259765p6874m0528J81222J27355n30l09816k24892L30501L30886J63944
$$ 1259765 1182891 1142363 1323585 1450940 1450410 1140594 915702 1246203 1577089 1741033
15727A741033P971q2688l13355l57690j31329J98166P9008o319k246J67004l5648
$$ 1741033 1749004 1666316 1352961 995271 863942 1062108 1141116 1134797 1132551 1299555 1263907
15716A263907m1165M1957n9092K3289L2966j02161P5844J13016m2219j02365k50222
$$ 1263907 1222742 1264699 1205607 1228896 1261862 1159701 1235545 1348561 1306342 1203977 953755
15705I53755K3151j69707J36561K2246J49182J64523K20235J30367j03034j80163
$$ 953755 976906 807199 943760 966006 1115188 1279711 1499946 1630313 1527279 1347116
15695A347116O1929L9671o8373r9170L1061P8281J32905j0844M5447r4849K6507
$$ 1347116 1409045 1448716 1380343 1281173 1312234 1390515 1523420 1512576 1558023 1463174 1489681
15684A489681J82990j62457k37970n590o7936J47797L0586O0011J24723Q4094
$$ 1489681 1672671 1510214 1272244 1266654 1198718 1346515 1377101 1437112 1561835 1645929
15674A645929J28602m5860k33353l62148p6327N6145r2278o3904m3276J02947
$$ 1645929 1774531 1728671 1495318 1133170 1056843 1112988 1020710 956806 913530 1016477
15664A016477J41682N0057J12338Q9476L7292j8961p247J24606J38904K6292j1752
$$ 1016477 1158159 1208216 1320554 1410030 1447322 1428361 1421114 1545720 1684624 1710916 1699164
15653A699164o5714M8305j9236j43911j48883j60501j8392K34372J72470K45498
$$ 1699164 1633450 1681755 1662519 1518608 1369725 1209224 1190832 1425204 1597674 1843172
15643A843172J47392l38764p6775n8469j46706p9866J24230P9372K24506J26610
$$ 1843172 1990564 1651800 1575025 1516556 1369850 1289984 1414214 1493586 1718092 1844702
15633A844702k03169k96329m0078K02624K95962M9796j70946l36917k23576k4821
$$ 1844702 1641533 1345204 1305126 1507750 1803712 1853508 1682562 1345645 1122069 1097248
15623A097248M21990K90218q6548j14640j62988J28019K37514J67227j06834k51300
$$ 1097248 1519238 1809456 1722908 1608268 1445280 1573299 1810813 1978040 1871206 1619906
15613A619906K0433o4371j27959k4683L00557O268j79320O6106J24157J43444
$$ 1619906 1640339 1575968 1448009 1423326 1723883 1730151 1550831 1616937 1741094 1884538
15603A884538K30697K5213q4983j87069j00135j58245p9994j39764K83116P5324
$$ 1884538 2115235 2140448 2055465 1868396 1768261 1610016 1530022 1390258 1673374 1748698
15593A748698q5684L46288J81206j49638k78663N9749J41325p1753N3844K36011
$$ 1748698 1663014 2009302 2190508 2040870 1762207 1821956 1963281 1891528 1945372 2181383
15583B181383J59580K7287j17958j565k13914j2759K18711O9371j53522J50560
$$ 2181383 2340963 2368250 2250292 2248727 2034813 2022054 2240765 2310136 2156614 2307174
15573B307174J48542j87545j56342j54646j13846J33377j8626j45660j19989k48812
$$ 2307174 2455716 2268171 2111829 1957183 1843337 1976714 1958088 1812428 1692439 1443627
15563A443627j00113O1202L06425Q1241J96826j02935J8387k70248P076L5859
$$ 1443627 1343514 1404716 1711141 1792382 1989208 1886273 1904660 1634412 1641488 1677347
15553A677347J53205K29653p5073L5842o3212R792J5187j30132J43805K83830
$$ 1677347 1830552 2060205 1985132 2020974 1957762 1967554 1982741 1852609 1996414 2280244
15543B280244K16023J36008r0156j48947j45882k32J35197J09449j26758r4450
$$ 2280244 2496267 2632275 2542119 2393172 2247290 2247058 2382255 2491704 2364946 2270496
15533B270496j11400k4303m7446K53859K07716P7676j3366k47020n7060j90584
$$ 2270496 2159096 2134793 2087347 2341206 2548922 2626598 2613232 2366212 2309152 2118568
15523B118568j4672K65033L46301P7953k26776j19343K71604L21106r3002k61815
$$ 2118568 2103896 2368929 2715230 2793183 2566407 2447064 2718668 3039774 2946772 2684957
15513B684957k15437j13189q9701J71258M33954J06290n6480j98956j72924J31628
$$ 2684957 2469520 2356331 2266630 2437888 2871842 2978132 2921652 2722696 2549772 2681400
15503B681400P2805J91131l32060j89444K95612k204l8197P285R2016J54831p2559
$$ 2681400 2754205 2945336 2613276 2423832 2719444 2717240 2679043 2686328 2778344 2933175 2860616
15492B860616j96121q4617j61931J48688L04594L1869p6364o0698n1439N8398
$$ 2860616 2664495 2579878 2417947 2566635 2871229 2903098 2826734 2766036 2714597 2772995
15482B772995j7152O1975K20168N9623o4211j23761j90867K21382J48810J00570
$$ 2772995 2755843 2817818 3037986 3097609 3033398 2909637 2718770 2940152 3088962 3189532
15472C189532j1542j42770r6435J73796K25999l31764j72163J78115J39434l9053
$$ 3189532 3177990 3035220 2938785 3112581 3338580 3006816 2834653 3012768 3152202 3113149
15462C113149L7048k09057p1648K1255J76384P3693O5851p0040J8229O0769k08429
$$ 3113149 3150197 2941140 2869492 2890747 3067131 3140824 3206675 3136635 3154864 3215633 3007204
15451C007204K39144K67704j03483j91086K0202K8264J82099J36307n2969J40216
$$ 3007204 3246348 3514052 3410569 3219483 3239685 3267949 3450048 3586355 3533386 3673602
15441C673602j4079k05717q3155j99355k0169j5757J05171j2133J64256P9782
$$ 3673602 3659523 3453806 3370651 3171296 3151127 3135370 3240541 3228408 3392664 3472446
15431C472446j0437L3877Q1902j15189K81199P2362k13233q3683o8486p0755j1031
$$ 3472446 3462009 3495886 3577788 3462599 3743798 3816160 3602927 3519244 3450758 3380003 3368972
15420C368972k35375J15871K4527J01391K78532K15132k4526K419j29981J06017
$$ 3368972 3133597 3249468 3273995 3375386 3653918 3869050 3844524 3846943 3716962 3822979
15410C822979J33105j46232Q6823M644O5412J67058J74707k81856j72531j36532
$$ 3822979 3956084 3809852 3896675 3901319 3966731 4133789 4308496 4026640 3854109 3717577
15400C717577Q9067l444j02885j58982N2348J81945J92903J99445J21615J85233
$$ 3717577 3806644 3803200 3700315 3541333 3593681 3775626 3968529 4167974 4289589 4474822
15390D474822j81229J09321j31188j62914R9149j8924j28897l7352J67385K05890
$$ 4474822 4293593 4402914 4271726 4108812 4207961 4189037 4060140 4022788 4190173 4396063
15380D396063L7167k38883k2293K9620j03154q6286l6512J69922L21537N2810
$$ 4396063 4433230 4194347 4172054 4201674 4098520 4012234 3975722 4145644 4467181 4519991
15370D519991k12923j23081Q7677N1540O5600O0882J79848K3748r7441q7598K7127
$$ 4519991 4307068 4183987 4271664 4323204 4388804 4449686 4629534 4653282 4555841 4468243 4495370
15359D495370J18980j35899j42756Q9011L38474R6249j28741m0305j494p3212
$$ 4495370 4614350 4478451 4335695 4424706 4763180 4859429 4730688 4690383 4688889 4615677
15349D615677n7922J80682j022K5115K74238O7410J63070j56351K407k7707l7080
$$ 4615677 4557755 4738437 4737415 4762530 5036768 5104178 5267248 5110897 5113304 5085597 5048517
15338E048517R9416O1277J51646J8209o9116J85486p0955R8706r1972J06761k05185
$$ 5048517 5147933 5209210 5360856 5379065 5309949 5495435 5424480 5523186 5431214 5537975 5332790
15327E332790O6889R824J30631k29721j61820K0498L109J78305K8842J59130R9368
$$ 5332790 5399679 5409503 5540134 5310413 5148593 5169091 5172200 5350505 5379347 5538477 5637845
15316E637845Q7234J89778K11562R8255k0759k69766j1514L6851r3906p5418M1014
$$ 5637845 5725079 5914857 6126419 6224674 6203915 5934149 5922635 5959486 5865580 5790162 5831176
15305E831176l7985K2033J68063J67920l29973j99998R4683n3788P1242J71942
$$ 5831176 5793191 5815224 5983287 6151207 5821234 5621236 5715919 5662131 5733373 5905315
15295E905315J51461J06418k15659j59987N3428J88017J2037l3047J9858J92704
$$ 5905315 6056776 6163194 5947535 5787548 5840976 6028993 6041030 6007983 6027841 6220545
15285F220545L40102N0535n4578J95004p5094j46183J09041k5115J53161J52385
$$ 6220545 6560647 6611182 6556604 6751608 6676514 6530331 6639372 6614257 6767418 6919803
15275F919803j11515J44628L5082J61932R6013j20619R1784L2947k02605k6329
$$ 6919803 6808288 6952916 6987998 7149930 7245943 7125324 7217108 7250055 7047450 7021121
15265G021121L3082j03811n032R6531L7659N728K34232K21604j24856K6792J46468
$$ 7021121 7054203 6950392 6945360 7041891 7079550 7085278 7319510 7541114 7416258 7443050 7589518
15254G589518P1081j33357n8607N6041J73022P6999J11610K61472L3558j91371
$$ 7589518 7660599 7527242 7468635 7524676 7697698 7774697 7886307 8147779 8181337 7989966
15244G989966R047O3172J42381J24522K58282K45734L2285m1999q7533K3981M311
$$ 7989966 7999013 8062185 8204566 8329088 8587370 8833104 8865389 8823390 8735857 8759838 8764149
15233H764149J10616j06361q5347R4797K9166m6372J62543R6645K5412j29045
$$ 8764149 8874765 8768404 8683057 8777854 8807020 8760648 8923191 9019836 9045248 8916203
15223H916203P5579P0591m5722K5379Q3071L9967J61186O8490L2153J08654N0309
$$ 8916203 8991782 9062373 9016651 9042030 9125101 9165068 9326254 9394744 9426897 9535551 9585860
15212I585860J36397o1016j60505l1266j1719K50386K32363K98104O4974J04028
$$ 9585860 9722257 9661241 9500736 9469470 9457751 9708137 9940500 10238604 10303578 10407606
15202A0407606j15705j60738J35972p5066q278K81929J86745J26370l0861J35911
$$ 10407606 10291901 10131163 10267135 10192069 10183791 10465720 10652465 10778835 10747974 10883885
15192A0883885P5317J08692j0504k34392Q5214J59582J3662M4089K2550j7012
$$ 10883885 10959202 11067894 11057390 10822998 10908212 11067794 11081456 11125545 11148095 11131083
15182A1131083J52998M52798J67508j96762P099J31577r4150N8145j24803M1797
$$ 11131083 11284081 11736879 11904387 11707625 11714724 11846301 11752151 11810296 11685493 11727290
15172A1727290J06398P3919O86715J58n9951L260j3656L25734j97684n6879K53448
$$ 11727290 11833688 11907607 12594322 12594480 12534529 12537789 12524133 12849867 12652183 12595304 12848752
15161A2848752K27574k20742M471j36126K01661K78614J87311k10155J47653K53032
$$ 12848752 13076326 12855584 12860055 12723929 12925590 13204204 13391515 13181360 13329013 13582045
15151A3582045K30619K41241J09987K7049o4443l05037o4040L77635M54092o657
$$ 13582045 13812664 14053905 14163892 14190941 14126498 13821461 13757421 14135056 14589148 14582491
15141A4582491p5792j4650Q9503J68748N9199Q2112r3886Q0304K23082J9903J88474
$$ 14582491 14506699 14492049 14581552 14750300 14809499 14891611 14797725 14878029 15101111 15121014 15309488
15130A5309488J23594j80540J72937M52956M62898Q3599m02844K4299J05614Q0920
$$ 15309488 15433082 15252542 15425479 15878435 16341333 16424932 16022088 16046387 16152001 16232921
15120A6232921J08564N2682j2070J27719L2466L15239P1422P1632q2055J96331
$$ 16232921 16341485 16394167 16382097 16509816 16542282 16857521 16928943 17000575 16918520 17114851
15110A7114851L32642J69486J37899r3490Q7929J8661L4787J82951K12732O1838
$$ 17114851 17447493 17616979 17754878 17661388 17749317 17767978 17802765 17985716 18198448 18260286
15100A8260286l875j22535K8692J64721J38508L9181L00527J64621K43123K06506
$$ 18260286 18256411 18133876 18162568 18327289 18465797 18504978 18805505 18970126 19213249 19419755
15090A9419755o2359L5484K22622K3120Q3351J58943J257J18084J55724J17098
$$ 19419755 19357396 19392880 19615502 19638622 19721973 19880916 19882173 20000257 20155981 20273079
15080B0273079J15079K43455J26638r0233j15651k0760L61025J86700J41887J98741
$$ 20273079 20388158 20631613 20758251 20668018 20552367 20531607 20892632 21079332 21221219 21419960
15070B1419960R7992J65288J532J56950J67438O1103j14504K4562L17906M08564
$$ 21419960 21517952 21683240 21684772 21841722 22009160 22070263 21955759 21980321 22298227 22706791
15060B2706791m2417o9601M1213J34408K28130J75361K51703L6049O8256J37332
$$ 22706791 22664374 22594773 22635986 22770394 22998524 23173885 23425588 23461637 23529893 23667225
15050B3667225J64391K34698M53860K28126J36019J24106K45503Q0659m28668
$$ 23667225 23831616 24066314 24520174 24748300 24884319 25008425 25253928 25334587 24905919
15041B4905919r0148q6635P2937J83486K62873J55497R2889K99487L36194J63999
$$ 24905919 24815771 24729136 24802073 24985559 25248432 25403929 25496818 25796305 26132499 26296498
15031B6296498J7477K06932K31854M37086J66314o0786L9905N9153J33317J46071
$$ 26296498 26313975 26520907 26752761 27189847 27356161 27295375 27335280 27394433 27527750 27673821
15021B7673821J91183J15634r0670L0416n0348k5784K23993L17968K05521L00294
$$ 27673821 27865004 27980638 27889968 27920384 27870036 27844252 28068245 28386213 28591734 28892028
15011B8892028L90000L80430K77567Q1417M87744O72725N47541q13J14007K56489
$$ 28892028 29282028 29662458 29940025 30021442 30509186 31181911 31729452 31728639 31842646 32099135
15001C2099135K01748P878J50401M0215k47848j60739j44509l1235J0774k00825
$$ 32099135 32300883 32308761 32459162 32499377 32251529 32090790 31946281 31915046 31925820 31724995
14991C1724995o066j06412J41763k6761N9854L09718J60946J0984M0853j32531
$$ 31724995 31718929 31612517 31754280 31727519 31787373 32097091 32258037 32269021 32309874 32177343
14981C2177343j83187m6432L4527K50032K59363p0141M6122L0877j6077J9500
$$ 32177343 31994156 31947724 31982251 32232283 32491646 32421505 32467627 32498504 32482427 32501927
14971C2501927O0036J04226K68365r580J71183J16975J15227N1465K15515J32111
$$ 32501927 32561963 32666189 32934554 32924974 33096157 33213132 33328359 33379824 33595339 33727450
14961C3727450j37562j76652J41210J59007J17963O5345J95432j78039K4789K14802
$$ 33727450 33589888 33413236 33554446 33713453 33831416 33896761 34092193 33914154 33938943 34153745
14951C4153745J78500L14343N34143L74037K71030L64317L06758K11104j26180
$$ 34153745 34332245 34646588 35180731 35554768 35825798 36190115 36496873 36707977 36581797
14942C6581797p9595j28713k59272l23587r2341l99328o29162j91007k0418j24214
$$ 36581797 36502202 36373489 36114217 35790630 35698289 35298961 34669799 34478792 34458374 34334160
14932C4334160k6863L3433L9791j48965j22108J35807K16990k03645k33134J45979
$$ 34334160 34307297 34340730 34380521 34231556 34109448 34245255 34462245 34258600 34025466 34171445
14922C4171445n7197j33657O3469k61096l92451m3450K51624K40274j4117j05632
$$ 34171445 34114248 33980591 34044060 33782964 33390513 33347063 33598687 33838961 33824844 33719212
14912C3719212J7217R899n7146j42441p318p5803j7239j52745j70546J72313K37975
$$ 33719212 33736429 33746328 33689182 33546741 33539423 33463620 33446381 33293636 33123090 33295403 33533378
14901C3533378k58771l92770l88947R8034L75117k07736k39059k9419j7139j08535
$$ 33533378 33274607 32881837 32492890 32590924 32966041 32758305 32519246 32489827 32472688 32364153
14891C2364153j45496n14940k15137O1735K13335n2709k47003q1521n3001q2191
$$ 32364153 32218657 31703717 31488580 31550315 31763650 31710941 31463938 31382417 31329416 31247225
14881C1247225j132k04137j31913o2112P8989o7631j52679l38999l82693K03567
$$ 31247225 31246093 31041956 30910043 30847931 30926920 30859289 30706610 30367611 29984918 30188485
14871C0188485L68427k16385n35294k71181k55462J74096m3630l52794r2421R3114
$$ 30188485 30556912 30340527 29805233 29534052 29278590 29452686 29409056 29056262 28963841 29056955
14861B9056955J1099q0966j95474k32010k64508k41407J00570K00830k07189l4567
$$ 29056955 29068054 28987088 28791614 28559604 28295096 28053689 28154259 28355089 28147900 28113333
14851B8113333P352p7137j88185j84131k6867l74367m47276M4529K61331j06937
$$ 28113333 28120685 28043548 27855363 27671232 27644365 27269998 26822722 26867251 27128582 27021645
14841B7021645k60264j55696j48035k86583k09488J29837Q6626m7264n9275j16090
$$ 27021645 26761381 26605685 26457650 26171067 25961579 26091416 26178042 26130778 26071503 25955413
14831B5955413j23002j98336l71003j26562k17752k52491J5173j22042j46532
$$ 25955413 25832411 25634075 25263072 25136510 24918758 24666267 24681440 24559398 24412866
14822B4412866j24195L6978k7866k05396m32471j17507l00007l73447k4496J69230
$$ 24412866 24288671 24325649 24297783 24092387 23659916 23542409 23242402 22868955 22844459 23013689
14812B3013689k366P7866k2001m34223j56146j9526k7047j63462K6111r4457k91461
$$ 23013689 23011323 23089189 23067188 22632965 22476819 22457293 22430246 22266784 22292895 22198438 21906977
14801B1906977q780k08914j06169j63512j63004j45231N2470N9267L7157j67861
$$ 21906977 21898197 21689283 21583114 21419602 21256598 21111367 21163837 21223104 21260261 21092400
14791B1092400m87505k12080l8162k06940k58308j66063m8493P338R6421l5572
$$ 21092400 20604895 20392815 20354653 20147713 19889405 19723342 19674849 19682187 19778608 19743036
14781A9743036j79947k32576J2073J46567j26607k38073j52848k94257j72351
$$ 19743036 19563089 19330513 19342586 19489153 19362546 19124473 18971625 18677368 18505017
14772A8505017J9839j46349p5137K746k07754j00355N6761N6066m1720M632O098
$$ 18505017 18524856 18378507 18303370 18306116 18098362 17998007 18054768 18110834 18069114 18073746 18079844
14761A8079844k03553k86448k79187l46517n9945o3496o0823J47745j35438j86612
$$ 18079844 17876291 17589843 17310656 16964139 16904194 16840698 16779875 16927620 16792182 16605570
14751A6605570L21301l7867j20026J91890j58704k69479K0809m2936l06868k08491
$$ 16605570 16926871 16889004 16768978 16960868 16802164 16532685 16553494 16510558 16203690 15995199
14741A5995199m13649l39544o13R2364J79892J67913j29200p4063j14102k0882
$$ 15995199 15581550 15242006 15241393 15333757 15513649 15681562 15552362 15478299 15364197 15343315
14731A5343315k92396p1614j97214l51663k64844j38977R7423j24713o5784J53359
$$ 15343315 15050919 14979305 14782091 14430428 14165584 14026607 14124030 13999317 13933533 14086892
14721A4086892K8511N7358K70838m2193l45114k87377L6034k17525k54608k95281
$$ 14086892 14115403 14172761 14443599 14401406 14056292 13768915 13804949 13587424 13332816 13037535
14711A3037535k40541J6178J20524K83875N0171k83541k97267k33961n7935n7883
$$ 13037535 12796994 12813172 12933696 13217571 13267742 12984201 12686934 12452973 12395038 12337155
14701A2337155l20687k86954P6729O4369J55975R5582J72665J3834p6524j06923
$$ 12337155 12016468 11729514 11806243 11870612 12026587 12122169 12294834 12308668 12232144 12125221
14691A2125221j9415P355j56268l37639R815j5522p3331j21145J01271j07766
$$ 12125221 12105806 12113161 11956893 11619254 11629069 11613547 11540216 11419071 11520342 11412576
14681A1412576p0419j33349n2662k8581P4607j24590l16598j44682j39038j65747
$$ 11412576 11342157 11208808 11156146 11127565 11202172 11077582 10760984 10616302 10477264 10311517
14671A0311517p4220J49666Q1486k44101q4695K16366k15260r4637J96859J44117
$$ 10311517 10237297 10386963 10468449 10224348 10139653 10356019 10140759 10046122 10242981 10387098
14661A0387098q709k21080j92358o386J17297j90787n1838M7283k64387j28484
$$ 10387098 10378389 10157309 9964951 9958565 10075862 9885075 9833237 9880520 9616133 9487649
14651I487649p0375K8825j02269k48503L7718L9756k77180o7120J27218r9014
$$ 9487649 9417274 9446099 9343830 9095327 9133045 9172801 8895621 8828501 8955719 8856705
14641H856705O5618l9962k52474P6843J75428q4822j41975n354m3256j14297o9801
$$ 8856705 8922323 8882361 8629887 8706730 8882158 8797336 8655361 8650007 8606751 8492454 8422653
14630H422653J46985K06898j01262O7828N9097P0379L14832P9893p870K24406
$$ 8422653 8569638 8776536 8675274 8743102 8802199 8872578 9187410 9267303 9259433 9483839
14620I483839J15921j07059j73538r06j06959j93278k21928m30242j5231l6489
$$ 9483839 9599760 9492701 9319163 9318257 9211298 9018020 8796092 8365850 8350619 8314130
14610H314130j72466j38962R1120N3019o5811j55656k49373R9528L5175k6662
$$ 8314130 8141664 8002702 8093822 8146841 8081030 7925374 7676001 7775529 7810704 7784042
14600G784042J84449J66206k32145j04661K14394l8081j82938K20688k16346j32994
$$ 7784042 7968491 8134697 7902552 7797891 8012285 7974204 7791266 8011954 7795608 7662614
14590G662614M7302k13239L0415J03953J10968j0986k85554q6835j55730p7948
$$ 7662614 7709916 7496677 7527092 7631045 7742013 7731027 7445473 7358638 7202908 7124960
14580G124960j1761l949L8428J6714M9005k75765j14512K4532J14622K86850J66715
$$ 7124960 7113199 7109250 7147678 7164392 7213397 6937632 6823120 6847652 6962274 7249124 7415839
14569G415839O4003J79792K04033K57575K64401j15240N8830K01899P9878m5927
$$ 7415839 7479842 7659634 7863667 8121242 8385643 8270403 8329233 8531132 8611010 8565083
14559H565083j58568m28828j84057q124j01497Q0824n8671j64364P2033J43571
$$ 8565083 8406515 7977687 7793630 7785506 7684009 7764833 7706162 7541798 7613831 7757402
14549G757402P2507j33990j78851K19754J04819j00p8157N4291J66786j06606
$$ 7757402 7829909 7695919 7517068 7736822 7841641 7841541 7763384 7817675 7984461 7877855
14539G877855n3340J01121J42845L36051J69657k8757o3186o7870Q1951M29418
$$ 7877855 7824515 7925636 8068481 8404532 8574189 8545432 8482246 8414376 8496327 8925745
14529H925745L57121L16340J63799K87979K86619K76520J24829K58919N18695
$$ 8925745 9282866 9599206 9763005 10050984 10337603 10614123 10738952 10997871 11516566
14520A1516566O08656O66151O85679P94845J047244J404969J309494J375646J841618
$$ 11516566 12125222 12791373 13477052 14271897 15319141 16724110 18033604 19409250 21250868
14511B1250868K527583K817596L784984N091229O673737R157481J2722225J7880849
$$ 21250868 23778451 26596047 30381031 35472260 42145997 51303478 64025703 81906552
14503H1906552K4860400L3345792M3584471N3363459O1548329O5247835O2567474
$$ 81906552 106766952 140112744 183697215 237060674 298609003 363856838 426424312
14496D26424312N2387495L4465203J2407209j0171540l0983288m6909034n5333680
$$ 426424312 478811807 513277010 525684219 515512679 484529391 437620357 382286677
14489C82286677n6376539n2101916m4257529l5521253k7354220k0251624j5134299
$$ 382286677 325910138 273808222 229550693 194029440 166675220 146423596 131289297
14482A31289297j1842839r560933q242468p573163p094931o915941o405380n817574
$$ 131289297 119446458 109885525 101643057 94069894 86974963 80059022 73653642 67836068
14474F7836068n314645n057339m536818l968080l334020l166548k838808k259754
$$ 67836068 62521423 57464084 52927266 48959186 45625166 42458618 39619810 37360056
14466C7360056k038382j684037j449856j302107j109673r44930l11611r4981j6309
$$ 37360056 35321674 33637637 32187781 30885674 29776001 28831071 28519460 28424479 28408170
14457B8408170K99843N81907J190164J301177J929463K716595L724929N213363
$$ 28408170 28708013 29289920 30480084 31781261 33710724 36427319 40152248 45365611
14449D5365611P252042J0085008J4445718K0391437K8070886L7610427M7517162
$$ 45365611 52617653 62702661 77148379 97539816 125610702 163221129 210738291
14442B10738291N6367751O1581442O1721959N4504621L9789121J9822241k163666
$$ 210738291 267106042 328687484 390409443 444914064 484703185 504525426 502361760
14435E02361760k3155185m0355759n1277175n4806181n2283847m5993435l7574977
$$ 502361760 479206575 438850816 387573641 332767460 280483613 234490178 196915201
14428A96915201k9479582k2098761j6311483j2748741j0249504q710289p784963
$$ 196915201 167435619 145336858 129025375 116276634 106027130 97316841 89531878
14421H9531878o994430o501793o129262n705352n582444n281256m490870m037027
$$ 89531878 82537448 76035655 69906393 64201041 58618597 53337341 48846471 44809444
14413D4809444l939180l442475l147902k667038k275586k086735j907870j783253
$$ 44809444 40870264 37427789 34279887 31612849 29337263 27250528 25342658 23559405
14405B3559405j641476j165771j518864j068560r29959q61502j073894j064971
$$ 23559405 21917929 20752158 19233294 18164734 17234775 16373273 15299379 14234408
14397A4234408o46563o91469o67463q83738n08798o28946o32046r9949k45753
$$ 14234408 13587845 12896376 12228913 11345175 10836377 10207431 9575385 9475436 9229683
14388I229683o24213l23621l2879j36791j61564j82620p4221k37633m44071k51882
$$ 9229683 8605470 8281849 8248970 8112179 7950615 7767995 7693774 7456141 7012070 6760188
14378F760188l31491k55732l36512k59268k27127j11115j47482J2785j28181k96327
$$ 6760188 6428697 6172965 5836453 5577185 5350058 5238943 5091461 5104246 4976065 4679738
14368D679738j80099j75828l10051o6212K45599L32737J93260N4687J31638Q1872
$$ 4679738 4499639 4323811 4013760 3947548 4193147 4525884 4719144 4773831 4905469 4987341
14358D987341N1558n6759l3740Q2870N5274k37514K140j54399l7620p6080l4099
$$ 4987341 5038899 4982140 4948400 5031270 5086544 4849030 4851170 4696771 4659151 4583071 4548972
14347D548972J6251J37825O5934r7921p1682j66079j64505j80900j05132K09581
$$ 4548972 4565223 4703048 4768982 4671061 4599379 4433300 4268795 4087895 3982763 4192344
14337D192344o5370J76624L4891j11107K1891j76693N8127j53993j60327o2504
$$ 4192344 4126974 4303598 4338489 4227382 4249273 4072580 4130707 3976714 3816387 3753883
14327C753883m952K2496J10295j21299j9876j4826j80405r3564q2216j91301j13402
$$ 3753883 3748931 3771427 3881722 3760423 3740547 3725721 3545316 3451752 3369536 3178235 3064833
14316C064833L2058r1964Q5432n7037n9611K2921j0719j41366j84756m5830K860
$$ 3064833 3096891 3004927 3090359 3033322 2973711 2996632 2985913 2844547 2659791 2613961 2616821
14305B616821J60815n4553J17613Q1571j66719J20884J03628K84174J09680j71442
$$ 2616821 2777636 2723083 2840696 2922267 2755548 2876432 2980060 3264234 3373914 3202472
14295C202472j26798k3426M9442r4956K0314K16156k07312l0153J57846k7007
$$ 3202472 3075674 3052248 3101690 3006734 3027048 3243204 3035892 3005739 3163585 3136578
14285C136578n9515J7497L9215m1044j12043r5434L370L98926L16600n1424r6594
$$ 3136578 3077063 3094560 3133775 3092731 2980688 2885254 2888624 3287550 3604150 3552726 3456132
14274C456132q5744j12752O1068M1275l0840j24100m0620j72811k7605m6079j09506
$$ 3456132 3370388 3257636 3318704 3359979 3329139 3205039 3164419 2991608 2964003 2917924 2808418
14263B808418K2390n4813R3396r1489j50607J85332L01068j60692j81108P6703
$$ 2808418 2830808 2775995 2869391 2777902 2627295 2812627 3113695 2953003 2771895 2848598
14253B848598J504N8641n3937o4022N8748J06478P8276j83789j65359O1630r4104
$$ 2848598 2850102 2908743 2854806 2790784 2849532 2956010 3034286 2850497 2685138 2746768 2652664
14242B652664k27182J6867K8813p2164p3342j28347K2944J72072K62599r3129
$$ 2652664 2425482 2442349 2471162 2398998 2325656 2197309 2220253 2392325 2654924 2561795
14232B561795m4563J32280J04675j74182q0777l48993l7104K54764J90311M8539
$$ 2561795 2517232 2649512 2754187 2580005 2499228 2150235 2113131 2367895 2558206 2606745
14222B606745j00950k46809j36353m5856J01663o5031O9084Q5695r8331O6985
$$ 2606745 2505795 2258986 2122633 2076777 2178440 2113409 2182493 2268188 2169857 2236842
14212B236842N7624J4973j93474j38900J49268o641n5848K02968j02122k478N044
$$ 2236842 2294466 2309439 2115965 1977065 2126333 2119692 2063844 2266812 2164690 2162212 2167256
14201B167256R318j24525k0934n0896m486j405J868K12140K54176o9002j28396
$$ 2167256 2176574 2052049 2031115 1980219 1975733 1974328 1976196 2188336 2442512 2373510 2245114
14190B245114q1952k50473j7231m6371l4849k09509J06246K71973k0027Q7753
$$ 2245114 2163162 1912689 1895458 1849087 1814238 1604729 1710975 1982948 1962921 2050674
14180B050674L46192l5312l61009N1858k00241q849K02749j3219l81555j72717
$$ 2050674 2396866 2361554 2000545 2052403 1852162 1843313 2046062 2032843 1651288 1478571
14170A478571j39467J46611K34517J34868q1889j30970j70144J29002j5149J65245
$$ 1478571 1339104 1485715 1720232 1855100 1773211 1642241 1472097 1601099 1585950 1751195
14160A751195K19778q1281M9184K59643K3092N1410k04896j99283q7346m5881
$$ 1751195 1970973 1889692 1938876 2198519 2221611 2273021 2068125 1868842 1781496 1735615
14150A735615L07260J51557j9797O4529j99359m0471j81053j03713r103n2846
$$ 1735615 2042875 2194432 2174635 2239164 2039805 1999334 1818281 1714568 1705465 1652619
14140A652619R594K47321O0248k42526j20904l7398K667J73995k205k9683j9006
$$ 1652619 1662213 1909534 1969782 1727256 1606352 1568954 1571621 1745616 1743411 1713728 1694722
14129A694722j82647m1600Q0091K54265J50346n6243l36031j32165J24285m6425
$$ 1694722 1512075 1470475 1550566 1804831 1955177 1898934 1562903 1430738 1555023 1508598
14119A508598j64479L0768K27567j17070k1860K60116j36522j37273J25752K03745
$$ 1508598 1344119 1374887 1602454 1485384 1463524 1723640 1587118 1449845 1575597 1779342
14109A779342j3851M782p5808k04594n3748J16772J43639Q5359P9707k14388l6490
$$ 1779342 1765491 1770273 1694465 1489871 1436123 1552895 1696534 1781893 1861600 1647212 1610722
14098A610722q9457k26896J34812J46977j57780j53342m0567k0553p5652J13898
$$ 1610722 1521265 1294369 1429181 1576158 1418378 1265036 1224469 1203916 1128264 1242162
14088A242162L9842o7478l9749j6522J39744k58509k926L8684J4322J7184j5317
$$ 1242162 1282004 1214526 1174777 1158255 1297999 1039490 1036564 1075248 1089570 1106754 1091437
14077A091437p180J68586M05296O493l34060j40744j79136k04715j01819J68981
$$ 1091437 1084257 1252843 1658139 1664632 1330572 1189828 1010692 805977 704158 873139
14067H73139J14893J91193k5969K23876M9307n0863J47901M3332j67993m7702
$$ 873139 988032 1179225 1153256 1377132 1426439 1375576 1523477 1566809 1398816 1351114
14057A351114j27775Q259K5624L3211K6045k05310J01759P9796K12872N8627r0229
$$ 1351114 1223339 1231598 1257222 1290433 1316478 1111168 1212927 1292723 1505595 1564222 1473993
14046A473993K9711M2059Q329J16058M860k35809j01290p8372j1076J7108p297
$$ 1473993 1503704 1545763 1554092 1670150 1675010 1439201 1337911 1259539 1248463 1265571 1258274
14035A258274j93816r2117q1090R4322J52367l0280n8791j72231p0426K29785
$$ 1258274 1064458 972341 891251 985573 1137940 1107660 1048869 876638 806212 1035997
14025A035997L38912J31336j43762j21593j00090k36161p3219r8257K61334N3208
$$ 1035997 1374909 1506245 1362483 1240890 1140800 904639 831420 733163 994497 1047705
14015A047705K45636K72500N5641J1741o7342l8977j69315K8730J61295k46489
$$ 1047705 1293341 1565841 1621482 1633223 1565881 1526904 1357589 1386319 1547614 1301125
14005A301125J48039q7620l57704r1398L42982L68940J69532k05294k61722O7910
$$ 1301125 1449164 1361544 1003840 912442 1255424 1624364 1793896 1588602 1326880 1394790
13995A394790J30382q3882p7501K16928J86238k35770J78751K98916O3632L67755
$$ 1394790 1525172 1441290 1363789 1580717 1766955 1531185 1709936 2008852 2072484 2440239
13985B440239N16945M93129L75981O0365J49566j81240l93956O6329p5050m45769
$$ 2440239 2957184 3450313 3826294 3886659 4036225 3854985 3461029 3527358 3452308 3006539
13975C006539l84037l77253k76741n47466k74629K49673J82963J37982p6834j34960
$$ 3006539 2622502 2245249 1968508 1421042 1146413 1396086 1579049 1717031 1640197 1505237
13965A505237k58238j39323m4973J54570K01082q6661k61724j55129J0608J31870
$$ 1505237 1246999 1107676 1062703 1217273 1418355 1331694 1069970 914841 925449 1057319
13955A057319K2840J97426L4029o9656l01664j17661J81991J38374j58762J49115
$$ 1057319 1080159 1277585 1311614 1241958 940294 822633 1004624 1142998 984236 1133351
13945A133351k65076n8046J2963K41997j33232O2580J31792Q3625L2677J29061
$$ 1133351 868275 810229 823192 1065189 931957 994537 1126329 1209954 1242631 1371692
13935A371692K00700J8488J13349J39466L18449P2998J50371L97425L56518M11164
$$ 1371692 1572392 1590880 1704229 1843695 2162144 2235142 2385513 2782938 3139456 3550620
13925C550620K08537K06392k52285m02253j57679k23873l07362l03941k84187
$$ 3550620 3759157 3965549 3713264 3311011 3153332 2929459 2622097 2318156 2033969
13916B033969j29618r2032p4863R9692j96852k1030P4091l2430m14910j22206
$$ 2033969 1904351 1812319 1737456 1837148 1640296 1619266 1693357 1660927 1246017 1123811
13906A123811K47894K6708m7611j03041j07439M197J35476J89745l55221l79015
$$ 1123811 1371705 1398413 1350802 1247761 1140322 1144519 1279995 1469740 1114519 735504
13896G35504j16448J91578P6875j01099j11449L7642j04536J08483L89485j29924
$$ 735504 619056 810634 887509 786410 674961 712603 608067 716550 1106035 976111
13886I76111k25882n889M0880J4734o0986O8731q2733j53202J33041O1570j66007
$$ 976111 750229 744340 785220 799954 738968 807699 724966 571764 704805 766375 600368
13875F00368m7575O3183J18099j31260o2090m957J93480J12711J27361o3321p9379
$$ 600368 552793 615976 734075 602815 540725 535768 729248 841959 969320 905999 826620
13864H26620j43790j18164J49735j38405k42772m6931P0817J59995l2541J70532
$$ 826620 682830 564666 714401 575996 333224 286293 357110 517105 484564 655096
13854F55096L28318M4142j67655q435L3910q728o9509K4298j96147K4053J67579
$$ 655096 983414 1027556 859901 851466 885376 876648 807139 831437 635290 659343 826922
13843H26922l108J23199m6416j47192j31325K5107j32626q8506K30013K16384
$$ 826922 823814 947013 900597 753405 622080 647187 514561 426055 656068 872452
13833H72452j1944R4546J13228r5657J02003j77935j53032m4436J91658O1362
$$ 872452 860508 955054 1068282 972625 1074628 896693 743661 699225 890883 952245
13823I52245N9303p8561L089n1408l6242M6388O3311n7104Q7845j0076K2506p7824
$$ 952245 1011548 932987 936076 884668 848426 894814 958125 901021 988866 978790 1001296 923472
13811I23472j37765J27827o7723J01699J75502j38470j39187O7039J69386p192
$$ 923472 785707 913534 845811 947510 1123012 984542 845355 912394 1081780 1074588
13801A074588j73764N705M1448p3008J10853M1878l65451j53557j18353P7027
$$ 1074588 900824 906529 947977 874969 985822 1027700 662249 508692 390339 467366
13791D67366J40592J40269j0294k14697M5633K39673k0985j76969j03197J54237
$$ 467366 607958 748227 737933 523236 568869 808542 787557 610588 507391 661628
13781F61628K51053O2809J61448R871j10833M0063n8050J89590j76365r7576M8940
$$ 661628 912681 975490 1136938 1146809 1035976 1076039 1017989 1207579 1031214 933638 982578
13770I82578p0323q0083Q05m4196k8665r9937R6709K79844j69156q6262r7732
$$ 982578 912255 832172 832977 788781 760116 660179 756888 1036732 867576 781314 683582
13759F83582J16983K0059J0589j30031M2027k3414o0301m2987p0442O3774Q5468
$$ 683582 800565 820624 831213 701182 743209 719795 659494 616507 546065 609839 695307
13748F95307N3474m0892j27537j22098p6836L42707k6532O0757l0934j42559o6098
$$ 695307 748781 707889 580352 458254 381418 724125 697593 758350 727416 584857 518759
13737E18759R6609J61735j03234j68257j5549Q0076J67352K70851P5692J5043
$$ 518759 615368 777103 673869 505612 490063 570139 737491 1008342 1084034 1099077
13727A099077l04333j18369J56069j59041K986O8696P3164M874j18473o3445j576
$$ 1099077 794744 676375 832444 673403 676389 745085 818249 823123 704650 641205 639629
13716F39629J15058J3216j2049P036O7492Q0460r2624k32344j20514N2857O3467
$$ 639629 754687 767903 755854 762890 830382 910842 818218 585874 465360 518217 581684
13705E81684R7635J02520K35052q0330j70907N6993j30622m2687J21035J1178
$$ 581684 679319 781839 1016891 936561 765654 822647 692025 649338 770373 781551
13695G81551j58963P5214J1266o0409J9555P784R6007K48927j1064m08957j07315
$$ 781551 622588 697802 709068 648659 668214 675998 772005 1020932 1009868 600911 493596
13684D93596J07044K4576j51409r337J79825J95141m290o6461j0966j91932l48982
$$ 493596 600640 625216 473807 464470 644295 839436 835146 768685 757719 565787 216805
13673B16805O7972K38446O6563O3919k27246l32454l6915M21806L80313J34001
$$ 216805 284777 523223 589786 653705 426459 94005 57090 478896 859209 993210
13663I93210l74299o1014J51879K45633J36054l7552j77067k52494j61161J41896
$$ 993210 618911 557897 709776 955409 1091463 1053911 876844 624350 463189 605085
13653F05085L41835J3808j82463j3710j01654M6761J46159m8427p5252k4285L22167
$$ 605085 946920 960728 778265 764555 662901 709662 855821 807394 732142 707857 1030024
13642A030024N7872j26959N0369M3095J83261J30205r8768k53669j7711J22552
$$ 1030024 1087896 960937 1011306 1054401 1237662 1367867 1269099 1015430 997719 1120271
13632A120271J56376j06442k06689J29705L4934j18427P4297o2270m3916j12236
$$ 1120271 1276647 1170205 963516 1093221 1128155 1009728 1084025 1021755 977839 865603
13622H65603j14607n7827j10089L3563J79077J49109J14014j41212j8158J90888
$$ 865603 750996 693169 583080 616643 795720 944829 1058843 917631 899473 1090361
13612A090361r0479l06935j30335j50073J14791j623L8157P5595j3029O991J29153
$$ 1090361 999882 692947 562612 412539 527330 525707 563864 639459 626430 633421 762574
13601G62574K36680K73357j43643q4842j71295j32898l5395O6748J16189j99760
$$ 762574 999254 1272611 1128968 1044126 872831 739933 704538 771286 887475 687715
13591F87715j49143L8315P3611L47900p059Q8010n7251l0637k01665k43580k57109
$$ 687715 538572 576887 650498 998398 991339 1079349 1022098 991461 789796 546216 289107
13580B89107j59872J47532N53533K54060k78027j10406J08660J27291M5915j03588
$$ 289107 129235 276767 830300 1084360 806333 695927 804587 931878 977793 874205
13570H74205P8722J1415J57737K15083r260o4158k70520o0274K26320J57578j51603
$$ 874205 952927 964342 1122079 1337162 1327902 1263744 993224 932950 1159270 1316848 1165245
13559A165245K9040k808L2549k25956k293P8522J50251J05968N8191l28089N4931
$$ 1165245 1194285 1191477 1224026 998070 995777 1074299 1224550 1330518 1388709 1060620 1115551
13548A115551L46469J19100N6043k51686k11192J00995j08388j62312J89129m544
$$ 1115551 1462020 1581120 1637163 1385477 1174285 1275280 1166892 1004580 1193709 1189165
13538A189165l1967p71j6327J13422Q5861L3925j01754O5082n8678j8913J34055
$$ 1189165 1157198 1156427 1140100 1253522 1339383 1373308 1271554 1336636 1277958 1259045 1393100
13527A393100o6777r8545m6901N4718r2700j90976j67241K80847K00884k64358
$$ 1393100 1326323 1227778 1180877 1235595 1142895 951919 784678 1065525 1266409 1002051
13517A002051m9046k351Q2518J74696R0455j40814R4625j39447k24655O9080M05706
$$ 1002051 953005 950654 1033172 1207868 1298323 1157509 1252134 1112687 888032 957112 1362818
13506A362818L06936n881j45439m3698p806N7217p5242L7538l2048j78788j35450
$$ 1362818 1669754 1663873 1518434 1474736 1466930 1524147 1448905 1486443 1454395 1275607 1140157
13495A140157K4376l6171k385J78498m5695M9034K84753P7664P7753N8856J89911
$$ 1140157 1164533 1128362 1125977 1304475 1258780 1307814 1592567 1670231 1747984 1806840 1996751
13484A996751o0086k26410Q369o0294O9330j23498j85227L5577L85559k0302P6304
$$ 1996751 1936665 1710255 1718624 1658330 1727660 1604162 1418935 1454512 1840071 1819769 1896073
13473A896073J31067J30147j94706r1305K58095L10539J2697r1103r7029q8284
$$ 1896073 2027140 2157287 1962581 1871276 2129371 2439910 2452607 2361504 2264475 2176191
13463B176191j42184J38025M51736M8993k30745r8940j0318j13453r4338Q9998
$$ 2176191 2034007 2172032 2623768 2672761 2442016 2343076 2332758 2219305 2124967 2214965
13453B214965L39379J86145O0313K3526n7383R5891q8013j19649l11227o7459
$$ 2214965 2554344 2740489 2800802 2824328 2766945 2862836 2774823 2655174 2343947 2276488
13443B276488J44872K1697L27504J66104j12142j33503j06141r2763P4798K05460
$$ 2276488 2421360 2443057 2770561 2936665 2824523 2691020 2584879 2492116 2566914 2772374
13433B772374R5879j12680n3209K1549N8017O2758R1408n7553k21218L0952K70025
$$ 2772374 2868253 2755573 2702364 2723913 2781930 2844688 2936096 2878543 2657325 2688277 2958302
13422B958302J77500j38080l6161j92762r6425J12150j16789l9894p8504j69475
$$ 2958302 3135802 2997722 2961561 2768799 2672374 2784524 2667735 2627841 2549337 2379862
13412B379862j73430j9448J31281j74272K6150J13477Q8831J20642K6514n8091
$$ 2379862 2206432 2186984 2318265 2143993 2170143 2283620 2372451 2493093 2519607 2461516
13402B461516r7604r3743k5829m5180L48568R5484n8113j96836j30094K68833
$$ 2461516 2363912 2270169 2244340 2199160 2547728 2643212 2585099 2388263 2258169 2527002
13392B527002j5345j33728j71078q0854r3527J893j62147m9323M4396n8582Q7053
$$ 2527002 2511657 2377929 2206851 2125997 2032470 2034363 1872216 1822893 1867289 1808707 1895760
13381A895760R2681J59746N388j09243K74307J67646J53498l08154k0177j12322
$$ 1895760 1988441 2148187 2153575 2044332 2318639 2486285 2639783 2331629 2311452 2199130
13371B199130R6070K3283j06371l9946K5397K18331k2944k577p4899k6502r2092
$$ 2199130 2295200 2318483 2212112 2172166 2197563 2415894 2392950 2390373 2315474 2288972 2196880
13360B196880k54316j69215k7742Q0443J28077o720J57841j9049m506q3038O4348
$$ 2196880 1942564 1773349 1745607 1826050 1954127 1947407 2105248 2086199 2081693 1998655 2063003
13349B063003n5876J30571R0706O8661j53365R0888k8323J84501j01005O0721
$$ 2063003 2007127 2137698 2228404 2297065 2143700 2234588 2206265 2390766 2289761 2350482
13339B350482J204P4149n4139l58852k18637J61872L12934J93675K37078o2814
$$ 2350482 2351686 2425835 2371696 2012844 1794207 1956079 2269013 2462688 2699766 2636952
13329B636952q1617j33276K0194J22663r7944J08907n1698P7170M2694K3462j45133
$$ 2636952 2555335 2422059 2442253 2564916 2466972 2575879 2524181 2601351 2644045 2667507 2522374
13318B522374j8650J66673J14212j9419p703K04287r788p5444n5400Q9275O7615
$$ 2522374 2503724 2670397 2784609 2765190 2757487 2961774 2951986 2876542 2821142 2910417 2978032
13307B978032k22729j55772l2499j49866J75387Q0568J5987J50065k4324o0546
$$ 2978032 2755303 2599531 2567032 2417166 2592553 2673121 2689108 2839173 2814849 2754303
13297B754303K84529P3177k06082k64773j57616L01275J82314p5027k07500L13507
$$ 2754303 3038832 3112009 2905927 2641154 2483538 2784813 2967127 2892100 2684600 2998107
13287B998107L88574Q1341J37558q4966m2744j57297j03367p0759j71920q6714
$$ 2998107 3386681 3468022 3605580 3520614 3477870 3320573 3217206 3146447 2974527 2887813
13277B887813M7383L69180P6050R6113O3757K7766j02938n8257l997O7411J04930
$$ 2887813 2935196 3304376 3380426 3476539 3540296 3568062 3465124 3406867 3402870 3470281 3575211
13266C575211Q2676J10452K4024o0322o3838J88192J90703Q5526p5029p0823k2627
$$ 3575211 3657887 3768339 3792363 3732041 3668203 3856395 4047098 4132624 4057595 3986772 3964145
13255C964145j00032j46741r178N1031J7147k4284K51034J26881p5866M2331P5676
$$ 3964145 3864113 3717372 3708194 3759225 3776372 3752088 4003122 4130003 4054137 4096468 4172144
13244D172144J08810J96407J9273o3764k7507J75041j21324k2482N9113K00015
$$ 4172144 4280954 4477361 4496634 4432870 4405363 4580404 4459080 4436598 4495711 4695726
13234D695726L21696M9426k35950K82172J66723k19767j23084J4661j711J48809
$$ 4695726 5017422 5066848 4830898 5113070 5279793 5060026 4936942 4951603 4949892 5098701
13224E098701J35410J2426K03907J92813o956k09810K18727K19679k01077l36324
$$ 5098701 5234111 5246537 5450444 5643257 5636301 5426491 5645218 5864897 5663820 5327496
13214E327496j11522L53747K89209J58835p5743n0670J65963J24597j21684l2804
$$ 5327496 5215974 5569721 5858930 6017765 5942022 5891352 6057315 6181912 6060228 6027424
13204F027424N2821j9846J86838j6252J25727K41116L59114L444m5861J30965
$$ 6027424 6080245 6060399 6247237 6230985 6356712 6597828 6956942 6960386 6914525 7045490
13194G045490j61050J27809J26919K82160K12350J8228q5758k18738r9837J38371
$$ 7045490 6884440 7012249 7139168 7421328 7633678 7651906 7566148 7347410 7247573 7385944
13184G385944N0590R4298R9350K85841K62028J15342Q7971L03486L32583Q189
$$ 7385944 7436534 7530832 7630182 7916023 8178051 8293393 8381364 8684850 9017433 9025622
13174I025622N9357j71969M37641K48004j58302J36272Q7365k01319J5415K49275
$$ 9025622 9084979 8913010 9350651 9598655 9440353 9576625 9663990 9462671 9478086 9727361
13164I727361K09990K30232L27174k0934o5292L36867K18926P419L24023K82895
$$ 9727361 9937351 10167583 10494757 10473823 10408531 10745398 10964324 10971743 11295766 11578661
13154A1578661m3128j52L80118L97793j05716J5544K34382K63959L30202K65427
$$ 11578661 11535533 11535381 11915499 12313292 12207576 12223120 12457502 12721461 13051663 13317090
13144A3317090K91286K24226J69610K21885L29703K32404K704j8328L74931K02366
$$ 13317090 13608376 13832602 14002212 14224097 14553800 14786204 14788908 14770580 15145511 15347877
13134A5347877L20361M39440J71088K11563K47641J06986K38007J68579J86766
$$ 15347877 15668238 16107678 16278766 16490329 16737970 16844956 17082963 17251542 17438308
13125A7438308K80403M9826K9924N14531K30372M31789L87076L59352M61186O39720
$$ 17438308 17718711 17768537 17798461 18312992 18543364 18975153 19362229 19721581 20182767 20822487
13115B0822487N64681L64981R6189K68947M08926M24433K71047K92618M55586
$$ 20822487 21387168 21752149 21848338 22117285 22526211 22950644 23221691 23514309 23969895
13106B3969895N07699O20826M06516L49675O33250P21465Q38384N71043N16558
$$ 23969895 24477594 25098420 25504936 25854611 26487861 27209326 28047710 28618753 29135311
13097B9135311O03817O64960M04688N42542L71512L67975P49657Q98433J011247
$$ 29135311 29739128 30404088 30808776 31351318 31722830 32090805 32840462 33738895 34750142
13088C4750142O39255N96284R45184J075657R29829R43976J010748J000875R08182
$$ 34750142 35389397 35985681 36930865 38006522 38936351 39880327 40891075 41891950 42800132
13079D2800132J025025J108473J227263J041086J121581J181889J217403J231127
$$ 42800132 43825157 44933630 46160893 47201979 48323560 49505449 50722852 51953979
13071E1953979J192788J416046J610862J712260J597480J514245J834989K222213
$$ 51953979 53146767 54562813 56173675 57885935 59483415 60997660 62832649 65054862
13063F5054862J849835K080345J950064J827148K153108K309976K528797K695631
$$ 65054862 66904697 68985042 70935106 72762254 74915362 77225338 79754135 82449766
13055H2449766K488257K445782K779710L135845L268227L001808L360742L180858
$$ 82449766 84938023 87383805 90163515 93299360 96567587 99569395 102930137 106110995
13047A06110995L324336L613714L693236M111855M170713M023020M040389M210617
$$ 106110995 109435331 113049045 116742281 120854136 125024849 129047869 133088258 137298875
13039A37298875M532215M276504M462612M946291M974325M796385M745584M779426
$$ 137298875 141831090 146107594 150570206 155516497 160490822 165287207 170032791 174812217
13031A74812217M989760M878354M424990M589057M774852M750019M784262M455127
$$ 174812217 179801977 184680331 189105321 193694378 198469230 203219249 208003511 212458638
13023B12458638M360337M373819M438849M043671L798184L706611L662474L531494
$$ 212458638 216818975 221192794 225631643 229675314 233473498 237180109 240842583 244374077
13015B44374077L596294L378969L003508K605528K767198K598111K553803K309132
$$ 244374077 247970371 251349340 254352848 256958376 259725574 262323685 264877488 267186620
13007B67186620K299400K072649J715077J502139J255658J243072J213289J038527
$$ 267186620 269486020 271558669 273273746 274775885 276031543 277274615 278487904 279526431
12999B79526431O11843o8944K37527K14227P6190q2412n28514o51144o93436j306679
$$ 279526431 280138274 280069330 280306857 280521084 280597274 280514862 279986348 279335204 278641768 277335089
12989B77335089j510694j510381j854784j903749j736604j879959k475000k981276
$$ 277335089 275824395 274314014 272459230 270555481 268818877 266938918 264463918 261482642
12981B61482642k805302k831371l130364l347281l442609l591843l834297l840745
$$ 261482642 258677340 255845969 252715605 249368324 245925715 242333872 238499575 234658830
12973B34658830m167458m265492m491829m320325m440706m767676m785213m775476
$$ 234658830 230491372 226225880 221734051 217413726 212973020 208205344 203420131 198644655
12965A98644655m577810m732024m930256m757457m669695m652694m537751m519753
$$ 198644655 194066845 189334821 184404565 179647108 174977413 170324719 165786968 161267215
12957A61267215m494602m370299m357797m195126l877048l681700l883575m064599
$$ 161267215 156772613 152402314 148044517 143849391 139972343 136290643 132407068 128342469
12949A28342469m105817l364823l241247l171748l326377l523869l160576k858292
$$ 128342469 124236652 120871829 117630582 114458834 111132457 107608588 104448012 101589720
12941A01589720k973409k978145k729583k699001k597497k425123k113063k331453
$$ 101589720 98616311 95638166 92908583 90209582 87612085 85186962 83073899 80742446
12933H0742446k200704j959558j928545j884700k199949k202086j703301j465100
$$ 80742446 78541742 76582184 74653639 72768939 70568990 68366904 66663603 65198503
12925F5198503j525955j802563j762277j573398j416254j199980r77686j169197
$$ 65198503 63672548 61869985 60107708 58534310 57118056 55918076 54940390 53771193
12917E3771193j268086j383510j462418j269897r70405j081636j024916r24245
$$ 53771193 52503107 51119597 49657179 48387282 47416877 46335241 45310325 44386080
12909D4386080q10591r39148r70180q65165p60798p89891p26540p96857r22478
$$ 44386080 43575489 42636341 41666161 40800996 40040198 39250307 38523767 37726910 36804432
12900C6804432o95117o62198p54905m23404n31783q90762p74075o38855l96177
$$ 36804432 36109315 35447117 34692212 34268808 33737025 32846263 32072188 31433333 31037156
12891C1037156n65558m55809n59470m70105p03194n02932n24930k73799k00600
$$ 31037156 30471598 30015789 29456319 28986214 28283020 27780088 27255158 26981359 26780759
12882B6780759o08780o62260n60411l53300l93558l53824l47551j62452k96396
$$ 26780759 26171979 25509719 24949308 24596008 24202450 23848626 23501075 23338623 23042227
12873B3042227k35394k46324k35251n30632l09217l25366m95540k78597l39404
$$ 23042227 22806833 22560509 22325258 21794626 21485409 21160043 20664503 20385906 20046502
12864B0046502k15558l26903q0016j6377m1870k93859k15414m16431k61309l48395
$$ 20046502 19830944 19504041 19424025 19407648 19365778 19071919 18856505 18440074 18178765 17830370
12854A7830370l54852j07494j05153J10186k35901l47740k53117j34226k78793
$$ 17830370 17475518 17368024 17262871 17373057 17137156 16789416 16536299 16402073 16123280
12845A6123280j46997l83306k59264j46475J2012l3233k7662j05072k362j59841
$$ 16123280 15976283 15592977 15333713 15187238 15199250 15166017 15138355 15033283 15030921 14871080
12835A4871080l32199j93135m72509l23631m2841K3974l39486k13137j00771K10858
$$ 14871080 14538881 14345746 13873237 13549606 13506765 13530739 13191253 12978116 12877345 13088203
12825A3088203p4434j71752m25219j16695k49358l74174j1084O9407p6727n781
$$ 13088203 13013769 12842017 12416798 12300103 12050745 11676571 11665487 11734894 11658167 11652386
12815A1652386R8627k20967n73326k12080r1126l408j52573k2613L3236j34742
$$ 11652386 11751013 11530046 10956720 10744640 10653514 10650106 10497533 10474920 10508156 10373414
12805A0373414q4209j22212k60733n9935j75091l31751K7480J65000k38359K7761
$$ 10373414 10289205 10166993 9906260 9846325 9671234 9339483 9366963 9531963 9293604 9321365
12795I321365k49080k32767J17386Q0040k6685j77288k5835k44066k22102j01107
$$ 9321365 9072285 8839518 8956904 9036944 9010259 8832971 8807136 8563070 8340968 8239861
12785H239861o55o3153K74153J8562K6197j48648m05295j98484N5286L0764q4404
$$ 8239861 8239206 8176053 8450206 8468768 8494965 8346317 7941022 7742538 7797824 7828588 7744184
12774G744184Q2985k4541l56426J20951p865k09587M07q8018p3474Q447O8015
$$ 7744184 7827169 7802628 7446202 7567153 7559288 7349701 7350108 7262090 7188616 7197063 7265078
12763G265078M9747k98575k16402K05434j34895j83009J51707l2676K52896O077
$$ 7265078 7314825 7016250 6799848 7005282 6870387 6687378 6839085 6806409 7059305 7065382
12753G065382q6446j52016j86069L1691N3526m0546J47311J08065p7554k54942
$$ 7065382 6978936 6826920 6640851 6672542 6726068 6685522 6832833 6940898 6863344 6608402
12743F608402j43037n3739k61761k93053j41560k39871n7864J31228P6833j26297
$$ 6608402 6465365 6411626 6149865 5856812 5715252 5475381 5417517 5548745 5625578 5499281
12733E499281J33840N1161j18729k29406r9879J41317K81823p0983j64717k44270
$$ 5499281 5633121 5684282 5565553 5336147 5236268 5377585 5659408 5588425 5423708 5179438
12723E179438Q7954O5969N3454J20831j58748j28328j61016N0507N3597n0445
$$ 5179438 5267392 5333361 5386815 5507646 5348898 5220570 5059554 5110061 5163658 5113213
12713E113213j16783j01324r3044q9455l1991o171l4738j72158K0880P9302l1838
$$ 5113213 4996430 4895106 4802062 4712607 4680616 4674445 4639707 4467549 4488429 4567731 4535893
12702D535893j19392J13837K56059n1550j4498o7212l03574j82782n8524K0122
$$ 4535893 4416501 4530338 4786397 4734847 4720349 4653137 4349563 4166781 4108257 4128379
12692D128379j81808j3570J39903K03690j68027m5023R0782K46688j3740q8988
$$ 4128379 3946571 3933001 4072904 4276594 4108567 4063544 4154326 4401014 4387274 4298286
12682D298286p3602l4449k18761j19240J1754J64999j39619L4659R7353R4721
$$ 4298286 4224684 4190235 3971474 3852234 3863988 4028987 3889368 3924027 4021380 4116101
12672D116101j8853L0429j77342p4855r4883L1781j7409L678m238j87112P3229
$$ 4116101 4097248 4127677 3950335 3875480 3780597 3812378 3794969 3798647 3794409 3607297 3680526
12661C680526J15112k8096j98715J48157J62293j7774k63839J03485j26844j95879
$$ 3680526 3795638 3767542 3568827 3716984 3879277 3861503 3597664 3701149 3574305 3378426
12651C378426N8181M8318M9818J22772p3225k04589K1633j0655N4165j2352j83077
$$ 3378426 3436607 3484925 3534743 3657515 3584290 3379701 3401334 3390679 3444844 3432492 3249415
12640C249415l712J11142m5776o1068j14804J23647J73930j44172m32991j06833
$$ 3249415 3245703 3356845 3311069 3250001 3135197 3258844 3432774 3288602 2855611 2748778
12630B748778K88198K7887j04119K77406K49651j91495K18134J43830l8918j24818
$$ 2748778 3036976 3064863 2960744 3238150 3487801 3296306 3514440 3658270 3619352 3494534
12620C494534j15368l5190j61013P3186j17740k13036j43892J37928N7406J4964
$$ 3494534 3379166 3343976 3182963 3256149 3138409 2925373 2781481 2919409 2976815 2991779
12610B991779L096o6524j11329n2309R7249J77548m3781j22416M8736R5871M562
$$ 2991779 2994875 2928351 2817022 2764713 2861962 3039510 2995729 2873313 2922049 3017920 3022482
12599C022482J33623J61837k5114j03647Q5122K31028J34557k08554j99676P289
$$ 3022482 3156105 3317942 3292828 3189181 3274303 3505331 3639888 3431334 3231658 3238947
12589C238947J26315R0620j87557r2646J34878m6639R9201j55161n5473J7584
$$ 3238947 3365262 3455882 3268325 3175679 3310557 3263918 3363119 3207958 3152485 3170069
12579C170069K70858K71949o8861O137J33951R2230J62824k12680q3144j29705
$$ 3170069 3440927 3712876 3644015 3650152 3784103 3876333 4039157 3826477 3743333 3613628
12569C613628j13376L7788l5574l8148J75968L31127K45348n0942k39344k27462
$$ 3613628 3500252 3538040 3502466 3464318 3640286 3971413 4216761 4165819 3926475 3699013
12559C699013P1330K15863K35934Q5584N5609j4056k44258l13486j25251K06356
$$ 3699013 3770343 3986206 4222140 4307724 4363333 4349277 4105019 3791533 3666282 3872638
12549C872638J30695j23977J88600q9682o0274P5871m0734J79576J65475J4482
$$ 3872638 4003333 3879356 4067956 3978274 3918000 3993871 3953137 4132713 4298188 4312670
12539D312670O6187l70149j89552j10077N8736K11545K68622o370n8123J76841
$$ 4312670 4378857 4008708 3819156 3709079 3767815 3979360 4247982 4241612 4183489 4360330
12529D360330M22245j18866k92170l751N1408J98362R0990q5960P5139L07079
$$ 4360330 4782575 4663709 4371539 4367788 4419196 4617558 4708548 4622588 4697727 5004806
12519E004806r7989k46936R9915J62574J31411P8808j68457J8071j52800j11602
$$ 5004806 4906817 4659881 4759796 4922370 5053781 5132589 4964132 4982203 4829403 4717801
12509D717801k1661J91151N6682J64109L19103J79743j97783l32389j08438M902
$$ 4717801 4696140 4887291 4943973 5108082 5427185 5606928 5409145 5076756 4968318 4973220
12499D973220l2859k06527L7453k61113k87103Q8368M65066J16046k15747m8586
$$ 4973220 4940361 4733834 4771287 4510174 4223071 4311439 4776505 4892551 4676804 4628218
12489D628218J11479j74727l74763k09330K7896L04754L70976l451m48917j70644
$$ 4628218 4739697 4564970 4190207 3980877 4008773 4313527 4684503 4681052 4232135 4061491
12479D061491K703Q7245j38246j44530p314k20660j90478p3167k11621j3226k58410
$$ 4061491 4064194 4151439 4013193 3868663 3861349 3640689 3450211 3377044 3165423 3152197 2893787
12468B893787j89978j10295J66511J39926K42822J0487k31786j48897k66672j24231
$$ 2893787 2703809 2593514 2760025 2899951 3142773 3153260 2921474 2772577 2505905 2381674
12458B381674O7990J38831J73599R7022J18328n5750l4860j47985m7536K719j33062
$$ 2381674 2449664 2588495 2762094 2859116 2977444 2921694 2886834 2738849 2691313 2694032 2560970
12447B560970r8434K5970j56007k4594j9660k00258r2006l65771j67488J05196
$$ 2560970 2462536 2488506 2332499 2307905 2288245 2087987 1995981 1630210 1462722 1567918
12437A567918l2039L0418M859J7492O7985j27899J04072J88396q9275k42852L0144
$$ 1567918 1535879 1566297 1571156 1588648 1656633 1528734 1632806 1821202 1731927 1489075 1519219
12426A519219K14223O1722j76067J44404P3097j69159k49183J0808L4984o9063
$$ 1519219 1733442 1795164 1619097 1763501 1836598 1667439 1418256 1429064 1464048 1394985
12416A394985K24520k13303j20448K9515L00341J30480K87849N954k48635k33293
$$ 1394985 1619505 1406202 1285754 1315269 1615610 1746090 2033939 2039893 1791258 1557965
12406A557965k55387J59930R6479j61318m0855j77485j76009L84240K33768R2153
$$ 1557965 1302578 1462508 1558987 1397669 1356814 1179329 1003320 1387560 1621328 1713481
12396A713481P2914Q9575o5031n4260K55873O8550k21698l49723n1905P3115J35699
$$ 1713481 1786395 1875970 1810939 1756679 2012552 2081102 1859404 1509681 1457776 1530891 1666590
12385A666590l6698J70749J82580p8094l18051o9594K32419J29510J6006l16379
$$ 1666590 1629892 1800641 1983221 1905127 1587076 1517482 1749901 1879411 1895417 1579038
12375A579038j58547P6251J24176j15993j04479K26686j2951J31213j63365J86366
$$ 1579038 1420491 1496742 1620918 1504925 1400446 1627132 1614181 1745394 1582029 1768395
12365A768395J57129j52014j13966l6203p249M2814n7933j63663M3423J48840
$$ 1768395 1925524 1773510 1659544 1623341 1616092 1658906 1600973 1437310 1480733 1629573
12355A629573J72942N4089q2103m5985K6090n2210P9280J59336J06223j08867
$$ 1629573 1802515 1856604 1774501 1728516 1754606 1702396 1781676 1941012 2047235 1938368
12345A938368Q889j50948J04753P4564n1330k2311j62630p343K33311L4856q1246
$$ 1938368 1947257 1796309 1901062 1975626 1924296 1901985 1739355 1732012 1965323 2000179 1918933
12334A918933K11579J24342j27436l16257n6443q911K55543J76716J3543p7639
$$ 1918933 2130512 2254854 2127418 1811161 1754718 1745807 2001350 2178066 2191609 2113970
12324B113970J77238Q78p3551Q7660L3479p0984j14792j26161J28607j00545j22194
$$ 2113970 2291208 2292086 2218535 2306195 2339674 2268690 2153898 2027737 2156344 2055799 1933605
12313A933605K4680l8039q8514J46826J07656K543j50616j0652O5962k1693K36982
$$ 1933605 1958285 1920246 1831732 1978558 2086214 2088757 1938141 1927489 1993451 1971758 2208740
12302B208740j3509J11303L3359j64412j53158o2046J71305O9295L5310K6885
$$ 2208740 2195231 2306534 2339893 2175481 2022323 1960277 2131582 2200877 2236187 2263072
12292B263072J84966J5601l6370k17022j25729J41895J00098L84551K12036K9670
$$ 2263072 2448038 2463639 2427269 2210247 2084518 2226413 2326511 2711062 2923098 2952768
12282B952768j5567j09654J5420R6987o5808Q4594L40659Q9030K0912k1445J11639
$$ 2952768 2937201 2827547 2842967 2939954 2874146 2958740 3299399 3388429 3409341 3387896 3499535
12271C499535J84395J64644j13282l0686j4440R2438K51217K47144K63516J40737
$$ 3499535 3683930 3848574 3735292 3704606 3690166 3782604 4033821 4280965 4544481 4685218
12261D685218J88473L72152N00215M13024L04676L62058J68607M3428L72181K72369
$$ 4685218 4873691 5245843 5746058 6159082 6463758 6825816 6994423 7037851 7410032 7682401
12251G682401o0977j8837Q6643j76050Q3055n9091N655J38490K21414R7481J60825
$$ 7682401 7621424 7602587 7689230 7513180 7596235 7537144 7542799 7681289 7902703 8000184 8161009
12240H161009N4023J51781K3853J99528P5362J6479J19366J0098Q0885j17503
$$ 8161009 8215032 8366813 8390666 8590194 8665556 8682035 8801401 8811499 8892384 8774881
12230H774881k81507j07390J5489l2788j13237j28884j55787l76517j88554J534
$$ 8774881 8493374 8385984 8401473 8368685 8255448 8126564 7970777 7594260 7405706 7407240
12220G407240j65992k60149k15928p5463j238k859m3222o9459J578l05116o4072
$$ 7407240 7241248 6981099 6765171 6689708 6688470 6685611 6642389 6572930 6574508 6269392 6205320
12209F205320p2960L4986J84993n4681R7940J78702J67708k02404m5539L9024
$$ 6205320 6132360 6167346 6352339 6297658 6395598 6574300 6742008 6539604 6494065 6533089
12199F533089j11449K56402L39637J16267K69465o4259k0423O073M7918L45009
$$ 6533089 6421640 6678042 7017679 7133946 7403411 7339152 7318729 7324802 7372720 7717729
12189G717729K22232j31174k3977p0462n1227J57993J95990K18198Q3683l9317
$$ 7717729 7939961 7808787 7784810 7714348 7663121 7821114 8017104 8235302 8318985 8279668
12179H279668Q8661M64240J35621k25700N4264O6328K23045K27553K47926J22707
$$ 8279668 8368329 8832569 8968190 8742490 8796754 8863082 9086127 9313680 9561606 9684313
12169I684313j21169K340K12197J82570J39163M09763M48352K10783J64388J92872
$$ 9684313 9563144 9565484 9777681 9960251 10099414 10509177 10957529 11168312 11332700 11525572
12159A1525572L57928N3444K37033J71026J34250K16931J79460J18258K02671
$$ 11525572 11883500 11936944 12173977 12345003 12479253 12696184 12875644 12993902 13196573
12150A3196573J56535N22565J78532K29048L25252N80424M28771M6347k5365N29465
$$ 13196573 13353108 13875673 14054205 14283253 14608505 15188929 15617700 15664047 15638682 16168147
12140A6168147O08658L33032L26574M44749L08834J44379N79782P78111M96710
$$ 16168147 16776805 17109837 17436411 17881160 18189994 18334373 18914155 19692266 20188976
12131B0188976M06896K08990N31696Q92368O33848P78299O84310O43602R31366
$$ 20188976 20595872 20804862 21336558 22228926 22862774 23641073 24325383 24968985 25900351
12122B5900351J057891J262514Q38039P35445R76883J149190J167542J020982
$$ 25900351 26958242 28220756 29058795 29794240 30771123 31920313 33087855 34108837
12114C4108837J531213J659480J616926J614110J888415K030265J981014K073360
$$ 34108837 35640050 37299530 38916456 40530566 42418981 44449246 46430260 48503620
12106D8503620K498655K834553K816901K746831L330911L793054M399976M439260
$$ 48503620 51002275 53836828 56653729 59400560 62731471 66524525 70924501 75363761
12098G5363761M597602N457895N892233O353307P153601P790158Q408063R222815
$$ 75363761 79961363 85419258 91311491 97664798 104818399 112608557 121016620 130239435
12090A30239435J0432150J1106921J2355819J3452921J4279397J5375446J6175919
$$ 130239435 140671585 151778506 164134325 177587246 191866643 207242089 223418008
12083B23418008J6994012J7384796J7092991J6870078J5715531J4111022J2246280
$$ 223418008 240412020 257796816 274889807 291759885 307475416 321586438 333832718
12076C33832718R868966P759691O207644M729972L485848L265032L328641L885195
$$ 333832718 343701684 351461375 357669019 362398991 365884839 369149871 372478512 376363707
12068C76363707M507530N513791O469219P574242Q434782Q837426R159143R048112
$$ 376363707 380871237 386385028 392854247 400428489 408863271 417700697 426859840 435907952
12060D35907952Q618178P742852O474519N121427L472844J738783L5230j806182
$$ 435907952 444526130 452268982 458743501 463864928 467337772 469076555 469111785 467305603
12052D67305603l506407n013972o142206o691846o906648o807995o654863n814464
$$ 467305603 463799196 458785224 452643018 445951172 439044524 432236529 425581666 419767202
12044D19767202n304793m468464l573221k714131k011254j843308j935773k607174
$$ 419767202 414462409 409993945 406420724 403706593 401695339 399852031 397916258 395309084
12036C95309084l548116n007634o940707q957768j0645290j2452887j3944661
$$ 395309084 391760968 386753334 379812627 370854859 360209569 347756682 333812021
12029C33812021j4867616j5118273j5256552j5130536j4762195j4529967j3226175
$$ 333812021 318944405 303826132 288569580 273439044 258676849 244146882 230920707
12022B30920707j2437639j1912425j1339156j0607242j0012315r601705r078654
$$ 230920707 218483068 206570643 195231487 184624245 174611930 165010225 155931571
12015A55931571q268866p739181p244152o765536o458876o303603n545672n221677
$$ 155931571 147662705 139923524 132679372 125913836 119454960 113151357 107605685 102384008
12007A02384008n129313m662679m440345l908556l557833l691638l260887l185076
$$ 102384008 97254695 92592016 88151671 84243115 80685282 76993644 73732757 70547681
11999G0547681l180981k969144k753583k575429k296183j901297j852561j989717
$$ 70547681 67366700 64397556 61643973 59068544 56772361 54871064 53018503 51028786
11991E1028786k011868j721484j545573j563825j645663j634666j168277j031352
$$ 51028786 49016918 47295434 45749861 44186036 42540373 40905707 39737430 38706078
11983C8706078q90897r54281j079414j198092j065660j044032j010032r28345
$$ 38706078 37815181 36860900 35781486 34583394 33517734 32473702 31463670 30535325
11975C0535325q33489q02830n22727o07577r96667o64132l39580p23337p13177
$$ 30535325 29701836 28899006 28376279 27768702 26772035 26107903 25768323 25044986 24331809
11966B4331809n79180n71939m64214m91072m16074p40596n05942k62030j56492
$$ 24331809 23752629 23180690 22716476 22225404 21809330 21068734 20562792 20300762 20144270
11957B0144270m38763n39437l77403m15838m52592k28050l30767j85889l71728
$$ 20144270 19705507 19166070 18788667 18372829 17920237 17692187 17361420 17175531 16803803
11948A6803803m29019p9701k8862j19945l36966k96187k43805k17344k30233m54413
$$ 16803803 16374784 16295083 16266221 16146276 15809310 15513123 15269318 15051974 14821741 14367328
11938A4367328j82395j46547j04893l09741k01879k91797L3307P1620k41807m56633
$$ 14367328 14184933 14038386 13933493 13623752 13421873 13130076 13163383 13235003 12993196 12536563
11928A2536563k43510j29289j42625k02633N838j13580O539L00669L6093k57089
$$ 12536563 12293053 12163764 12021139 11818506 11824344 11710764 11717303 12017972 12054065 11796976
11918A1796976k38804k03636q0134j39830Q1173o9826l75998l36394j81487O8806
$$ 11796976 11558172 11354536 11274402 11134572 11215745 11145919 10769921 10433527 10252040 10320846
11908A0320846j92165J40475l4608k39318j08146J99885K5014k98764l63943l01473
$$ 10320846 10128681 10269156 10234548 9995230 9887084 10086969 10111983 9813219 9449276 9147803
11898I147803K1767o899m7259n0278J14910k35808k15302k35450j20046Q0301
$$ 9147803 9169570 9162671 9115412 9065134 9180044 8944236 8728934 8493484 8373438 8453739
11888H453739j35282q5986o5204k09938r8359n9737r2860r9041j53088k51038
$$ 8453739 8318457 8232471 8167267 7957329 7858970 7799233 7706373 7607332 7454244 7203206
11878G203206k20796K1751J19437J36732j0855j26757j00998p8148K26622j77384
$$ 7203206 6982410 7004161 7123598 7260330 7249475 7122718 7021720 6943572 7170194 6992810
11868F992810m22806O1906J84586J16182R9555j95671j16624K9779j09754j30081
$$ 6992810 6570004 6631910 6816496 6932678 7032233 6836562 6719938 6749717 6639963 6509882
11858F509882k86441m2305J70916j77038P3107N4985k87699l70162j00127Q570
$$ 6509882 6223441 6181136 6352052 6175014 6248121 6303106 6015407 5645245 5545118 5553688
11848E553688q9957p7389O7483K67871n0757m56478l07581k12088J62772Q9450
$$ 5553688 5463731 5386342 5453825 5721696 5670939 5214461 4906880 4694792 4857564 4947014
11838D947014J62391K43609L7153Q4387p78l82912k70575o6596L2470P0649N6454
$$ 4947014 5109405 5353014 5390167 5474554 5473776 5090864 4820289 4753693 4786163 4856812 4913266
11827D913266j64717k20849M2500K8373q6238k29531k24632J0602q1064l5936
$$ 4913266 4748549 4527700 4570200 4598573 4512335 4282804 4058172 4068774 3987710 3951774
11817C951774K81246J47421R1195o2387M3026j59002J04125J11166j05963j51977
$$ 3951774 4233020 4380441 4471636 4409249 4452275 4293273 4397398 4508564 4402601 4250624
11807D250624j35976o8715J27220J44502J6388j07178j79523k59403J39521M0288
$$ 4250624 4114648 4045933 4173153 4317655 4334043 4226865 4047342 3787939 3927460 3967748
11797C967748k6354R1288L48742J79776J11837k8757k52237l12470j19966R2782
$$ 3967748 3941394 4032682 4381424 4561200 4673037 4644280 4392043 4079573 3959607 4052389
11787D052389j55763l04702K3101J57030j32265j38834J42469p2565r8405J62652
$$ 4052389 3896626 3591924 3615025 3772055 3639790 3500956 3643425 3570860 3472455 3635107
11777C635107m6585o5172n1245l5388l124N7543j33752k56078K61068J73536j31794
$$ 3635107 3588522 3523350 3472105 3436717 3433593 3491136 3357384 3101306 3362374 3535910 3404116
11766C404116R7520K3768J45092j61359j03106m7575q2314K13580j26568j10373
$$ 3404116 3501636 3525404 3670496 3509137 3406031 3358456 3276142 3489722 3363154 3252781
11756C252781J53418Q2529j05305j45919q138j81265k37707p2051O0809L0712
$$ 3252781 3406199 3488728 3383423 3237504 3229366 3048101 2810394 2738343 2799152 2829864
11746B829864L23357R3521p8214j49786k4358r2331L5575j05615r1037j94642
$$ 2829864 3153221 3246742 3168528 3018742 2994384 2902053 2937628 2832013 2740976 2546334
11736B546334j50286L390n9008P5889J01751K1804J44549k0972K74141K25015
$$ 2546334 2396048 2399438 2340430 2416319 2518070 2539874 2684423 2663451 2937592 3162607
11726C162607j77439l70870l7938J12284M0822q8717k48109o0359m251R1605O9957
$$ 3162607 2985168 2614298 2576360 2688644 2729466 2640749 2392640 2332281 2328030 2419635 2489592
11715B489592j04781N15L3171L0322J27013o5572K0034q1735J360r4458j01634
$$ 2489592 2384811 2385326 2418497 2448819 2575832 2510260 2530294 2448559 2449919 2355461 2253827
11704B253827r9910N5750K07668J30222k3463J91238K41505j53492l41932j45208
$$ 2253827 2153917 2209667 2417335 2547557 2524094 2715332 2956837 2803345 2461413 2316205
11694B316205k07382j0214K73983J42721q7277j13598q1910L286k20l924j72030
$$ 2316205 2108823 2098609 2372592 2515313 2428036 2314438 2232528 2235814 2235594 2231670 2059640
11683B059640J6879J03797m2039J21459J27584K39626j15473J78023o4518q9598
$$ 2059640 2076519 2180316 2138277 2259736 2387320 2626946 2511473 2689496 2624978 2535380
11673B535380l28018m908J87375K88337j21537j57795j47410O588j99836n733
$$ 2535380 2207362 2202454 2389829 2678166 2556629 2398834 2251424 2258012 2058176 2052443
11663B052443O2838M60343K555j09632k01163O0985J41374M2071k5504j43503
$$ 2052443 2115281 2575624 2578179 2468547 2267384 2328369 2469743 2511814 2486310 2342807
11653B342807j27146j19933K02716J31721J0171j02281k49930O5383J35960L9716
$$ 2342807 2215661 2095728 2298444 2430165 2440336 2338055 2088125 2153508 2289468 2329184
11643B329184j36993K4613N5162J47258J17247l8079K48887J33228L16Q3144Q4803
$$ 2329184 2192191 2216804 2271966 2419224 2536471 2498392 2747279 2880507 2880823 2963967 3048770
11632C048770M3202J67180J41082r5662J703N18557K86387J43891p7238j9782
$$ 3048770 3091972 3259152 3400234 3304572 3306275 3824832 4111219 4255110 4177872 4158090
11622D158090j19451K13829L88634j2512q5605k63029j81098J35521K85029j56166
$$ 4158090 4038639 4252468 4641102 4628590 4542985 4279956 4098858 4234379 4519408 4363242
11612D363242l41145k2771K05339j0308j39443J6722K17697k6502k86631k35046
$$ 4363242 4022097 3999326 4204665 4194357 4054914 4071636 4289333 4262831 3976200 3741154
11602C741154O4395J33430q6999j8620L22089O8363R7122k36385k84286q0045
$$ 3741154 3805549 3938979 3851980 3833360 4155449 4223812 4320934 4084549 3800263 3720218
11592C720218R2652m8299j09299j15837K01821J29228J76319M038j96957j38601
$$ 3720218 3812870 3764571 3655272 3539435 3741256 3870484 4046803 4050841 3853884 3715283
11582C715283m5618l4625K8315j13188O1364j71875k75303r4345p087R1171r4039
$$ 3715283 3669665 3635040 3663355 3550167 3611531 3439656 3164353 3070008 3062921 3154092 3060053
11571C060053O2803K9281J37585j90386l55587k12249K76313l7198k99265p8859
$$ 3060053 3122856 3152137 3289722 3099336 2743749 2531500 2807813 2770615 2471350 2392491
11561B392491K14157j51295k75103L9978L13159J29809q1090P225j79163n3183
$$ 2392491 2606648 2455353 2180250 2220228 2533387 2663196 2582106 2589331 2410168 2356985
11551B356985J21252k05442j35581J37200l9684j47868J95684j20097O9670L01218
$$ 2356985 2478237 2272795 2137214 2274414 2234730 2086862 2282546 2162449 2232119 2533337
11541B533337j54658l68482j39374K43712o9794j05452Q9555r14J264n4455k51949
$$ 2533337 2378679 2010197 1870823 2114535 2044741 1939289 2028844 2027930 2029194 1974739 1722790
11530A722790j41151r0052R5675n3790k1509M269P1383m8547k0179j5428M7239
$$ 1722790 1581639 1491587 1587262 1533472 1511963 1516232 1587615 1539068 1518889 1503461 1550700
11519A550700K3365j9834J3982j76466J56408j00939j00458K16500m0720Q3371
$$ 1550700 1574065 1554231 1568213 1391747 1548155 1447216 1346758 1563258 1522538 1605909
11509A605909N1210r4693k3499n2426J15126N4478j35789j84463N6614j59635
$$ 1605909 1657119 1562426 1538927 1486501 1601627 1656105 1520316 1335853 1392467 1232832
11499A232832N7357P6604Q2149J2614L14499m9757Q459p8382j29649m6536J29476
$$ 1232832 1290189 1366793 1448942 1461556 1776055 1726298 1734757 1656375 1526726 1480190 1609666
11488A609666j1427j79543L3393K9063j8727N3252l1135l0072J18997K74944j19701
$$ 1609666 1598239 1418696 1452089 1481152 1462425 1515677 1484542 1454470 1573467 1848411 1728710
11477A728710M924l3121j7324l3485n9055j99294m111J28442l8530J10554j54131
$$ 1728710 1733634 1700513 1683189 1649704 1590649 1391355 1387244 1515686 1477156 1587710 1433579
11466A433579J79941k2238l17475r4270o7431o339J02962J299R3448m8464o2067
$$ 1433579 1613520 1591282 1273807 1179537 1112106 1105767 1208729 1210028 1303476 1255012 1192945
11455A192945J40973J56810L1334R2601q5566j89181k81011j08419K2352L07353
$$ 1192945 1333918 1490728 1522062 1614663 1529097 1339916 1058905 950486 972838 1280191
11445A280191J62675K101J8521Q7925J54650j87503k9059k26653J94656R2518
$$ 1280191 1442866 1444967 1463488 1551413 1706063 1518560 1489501 1262848 1457504 1550022
11435A550022J4089p5765L6941J95032k1956k82291l47323k8198R5261q4510j92090
$$ 1550022 1564111 1488346 1525287 1720319 1698363 1416072 1068749 1040551 1135812 1051302 859212
11424H59212j91158Q6052L4632J23656L03724J70960j69361j45033j73360J36265
$$ 859212 668054 754106 788738 912394 1216118 1387078 1217717 1072684 899324 1035589
11414A035589K32008Q2407k34298J45828o62j76767j27304R5496L9597m8222J73788
$$ 1035589 1267597 1350004 1115706 1261534 1260872 1084105 956801 1052297 1091894 1043672 1217460
11403A217460j9449M3433L5748j67281J31929J28847J14670j63080q7963J35812
$$ 1217460 1198011 1241444 1277192 1109911 1241840 1370687 1485357 1322277 1234314 1370126
11393A370126J99502j81129j19450m5843j0603J82636K20150J06584j75776j16532
$$ 1370126 1569628 1388499 1269049 1223206 1212603 1395239 1615389 1721973 1546197 1429665
11383A429665j85694q2925K52649J44733k09315j39134L2770N1357J75954Q2519
$$ 1429665 1243971 1161046 1413695 1558428 1349113 1209979 1242749 1294106 1470060 1552579
11373A552579j51041r9624j9277j81965j37142j83326o3061M20269Q0821Q0299
$$ 1552579 1401538 1301914 1282637 1100672 963530 780204 717143 1137412 1218233 1298532
11363A298532l9816o7664m1479r8356m25834m6952L48396R5959r4998O0720L945
$$ 1298532 1258716 1191052 1149573 1051217 625383 578431 926827 1022786 927788 988508 992453
11352I92453r428j08426K06963L64321n7920k4703J9360p1745k2866j87822j21785
$$ 992453 983025 874599 1081562 1445883 1387963 1363260 1382620 1310875 1288009 1100187 978402
11341I78402M6293K22686J75273Q4189l94218k67149N038j8561K41882K2527l9335
$$ 978402 1024695 1247381 1422654 1506843 1112625 845476 850514 831953 1073835 1096362 1057027
11330A057027r970k6995n3551p8354p5885m2458O0356J58294R6791O8786n2862
$$ 1057027 1047057 1020062 966511 888157 812272 769814 830170 988464 1085255 1154041 1101179
11319A101179j2650r3099q3145R5197J68754J65420k23339k12008J80623K37245
$$ 1101179 1088529 995430 912285 1007482 1176236 1341656 1118317 906309 1086932 1324177
11309A324177J2156n9573J30183k6733j47697j52772k3241K3868J20580J16003
$$ 1324177 1336333 1276760 1406943 1380210 1232513 1079741 1056500 1080368 1200948 1316951
11299A316951j07717k40523J29949q5825j73866J04677J50830J89003J44357k3307
$$ 1316951 1209234 968711 1098660 1012835 838969 943646 1094476 1283479 1427836 1404529
11289A404529J10274j19114j99121K5026J90621j66683k36861p9169J59584k56014
$$ 1404529 1514803 1395689 1196568 1221594 1412215 1245532 1008671 929502 1089086 833072
11279H33072R1254J37286j14545J73667K23990K2226J06421n6089M7503K6237
$$ 833072 924326 1061612 947067 1120734 1344724 1366950 1473371 1417282 1464785 1491022
11269A491022l4164J71925M7271r2932j51192j35246R9310L60820J36125j97959
$$ 1491022 1456858 1628783 1676054 1583122 1431930 1296684 1395994 1756814 1892939 1694980
11259A694980k03150k80317j94757p7066J06231J32485j97417P143N3167L31690
$$ 1694980 1491830 1211513 1016756 939690 1045921 1178406 980989 988132 1041299 1372989
11249A372989J51194j2942M5823j39799k55988j49600k10166J71316M4492j6235
$$ 1372989 1524183 1511241 1557064 1417265 1161277 1011677 801511 972827 1017319 1001084
11239A001084o7587K0275J06113Q0276K03802J43736r6700K92782K35582l36931
$$ 1001084 933497 953772 1059885 1140161 1343963 1487699 1390999 1683781 1919363 1582432
11229A582432k89982K9952J90258n4909j54359j3116l70914l0819K31855K02680
$$ 1582432 1292450 1322402 1512660 1457751 1303392 1290276 919362 888543 1120398 1323078
11219A323078J21900l6386j16316N1815p9185q0783k62358l26197L6822J83409
$$ 1323078 1444978 1408592 1292276 1344091 1264906 1184123 921765 595568 632390 815799
11209H15799L6765L8092j87780N9592Q4553q5661K3354n1453n5248J10456K54253
$$ 815799 852564 890656 702876 762468 847021 761360 784714 733261 678013 788469 1042722
11198A042722m2254j80015K16291L10461J41374M1107K24596j3286k54885j82332
$$ 1042722 1000468 820453 1036744 1347205 1488579 1529686 1754282 1740996 1486111 1303779
11188A303779k47341m4750K01277o1562n9439n27J05691k1928o8085k25279J43813
$$ 1303779 1056438 1011688 1212965 1151403 1091964 1091437 1197128 1175200 1107115 881836 1025649
11177A025649j8780K37199N8366m10003j22500K25438J4620j375k29914P909J9037
$$ 1025649 1006869 1244068 1302434 892431 769931 995369 1009989 1008614 778700 786609 805646
11166H05646m3383Q100o9503J62423J82710J41888L43356J89945j01596j49180
$$ 805646 762263 770363 700860 863283 1045993 1187881 1531237 1721182 1619586 1470406
11156A470406j80718j15730J46948j8128k82333R2415K31966L5287q8158J44468
$$ 1470406 1289688 1173958 1320906 1302778 1020445 1112860 1344826 1380113 1291955 1436423
11146A436423j76049j44717n4336J26525J49269q2526k44682J6705J40018R341
$$ 1436423 1260374 1115657 1061321 1187846 1337115 1254589 1009907 1026612 1166630 1175971
11136A175971R3938j75228j94318J14447l7997j22392k3533K5098j28701n9457
$$ 1175971 1269909 1094681 900363 1014810 976813 854421 830888 855986 727285 667828
11126F67828L68522k03885O8476K4908j51037J38526K83101J56853J65451r6420
$$ 667828 1036350 832465 900941 925849 774812 913338 1196439 1353292 1518743 1422323
11116A422323j59606o6014J46999J51497j75765p3204J79796r3711j26723j68441
$$ 1422323 1262717 1196703 1343702 1495199 1319434 1246230 1426026 1332315 1205592 1037151
11106A037151j11914J45036m9899j17963Q210L38956K67119r5458k26194j18094
$$ 1037151 925237 1070273 1020374 902411 910621 1249577 1516696 1421238 1195044 1076950
11096A076950l18997q1242L4704m8416J51790J49962q6992k06153J91137K0290
$$ 1076950 757953 676711 711415 662999 814789 964751 877759 671606 862743 883033
11086H83033R9395j38902L7560j3875P3458q4972o4038J68044L4350R9229K2067
$$ 883033 982428 843526 881086 867211 940669 855697 791659 959703 994053 1093282 1115349
11075A115349M1244m3957n79802P9761K88482j02266J99517M7577k04260o437
$$ 1115349 1156593 1112636 532834 612595 901077 798811 998328 1045905 841645 835208
11065H35208r7027J3888P9002J27654J1749M2471Q0990J79472J24779l770k36687
$$ 835208 738181 752069 831071 958725 970474 1012945 1093935 1273407 1398186 1394416 1157729
11054A157729q1669j38722J19375j40357q8898K47755J56357J70718j79333k69702
$$ 1157729 1076060 937338 1056713 916356 827458 1075213 1231570 1402288 1222955 953253
11044I53253P9538J4151J70215K6710k39354n3342M7979k5278O6792J00440k13924
$$ 953253 1032791 1046942 1217157 1243867 1004513 951171 999150 973872 1040664 1141104 927180
11033I27180p2490K30811M7094l20745M803j03975j40551m9980K94215K76463
$$ 927180 854690 1085501 1132595 811850 816653 712678 572127 522147 816362 1092825
11023A092825K2168q44q1544j16460K3565J6279j11979K7965j66055o3445K97226
$$ 1092825 1114993 1114149 1032605 916145 939710 955989 844010 871975 705920 642475 939701
11012I39701J07776l1956J08338j51202j73639k22487r9676K09290K79292j22495
$$ 939701 1047477 1015521 1123859 972657 799018 576531 476855 686145 965437 842942
11002H42942j06999P7369O9533k01678j86589r936p7788j54886R1386n8761m9419
$$ 842942 735943 813312 882845 681167 494578 484642 406854 251968 343354 284593 235174
10991B35174J00147J7471K3831J12269R2657N7629j48200j62050J22487K45774
$$ 235174 335321 352792 376623 488892 581549 639178 490978 328928 451415 697189
10981F97189J65442j03619r5665J7493R7830k55722O1646Q3618j33755K7684r9407
$$ 697189 862631 759012 663347 680840 778670 522948 584594 668212 534457 562141 462734
10970D62734p8739K58174K46932k4565J7186r8391r4763M0337O6773j64031j30495
$$ 462734 383995 642169 889101 864536 881722 783331 688568 728905 795678 631647 501152
10959E01152J54146j73577j55170J31901J19329J82337K9785L7142j38000o6074
$$ 501152 655298 481721 326551 458452 577781 760118 789903 827045 689045 622971
10949F22971j63641J50059n352L6732J58216J47852K143m036L8931l00290j65066
$$ 622971 459330 609389 604037 640769 798985 946837 948980 944944 983875 683585 518519
10938E18519j28281l6311q6053J44653O8335P0964J74365j44809j28813K52012
$$ 518519 390238 353927 267874 412527 480862 551826 726191 581382 452569 704581
10928G04581p790j23891l32936q101p2514R9868J56803o9578K84704n785j91037
$$ 704581 696791 572900 239964 231863 159349 259217 416020 346442 631146 625361 434324
10917D34324P3363L01120j54587l58838j50231M8609K60465L1644j01945L1560
$$ 434324 507687 808807 654220 295382 145151 193760 454225 485869 383924 415484
10907D15484J19858R0024N2242J5465J21155J39528k36138L1749N1862j0039o2438
$$ 415484 535342 625366 677608 693073 814228 953756 717618 749367 801229 791190 728752
10896G28752k15J08328n7654l2724k5095Q6798j20499l38132M309Q7589J56999
$$ 728752 728537 836865 779211 746487 721392 808190 687691 349559 353868 441457 598456
10885E98456O6297j17296j16415L57353K08071j67129M9674j15787j1704J97381
$$ 598456 664753 547457 431042 788395 996466 829337 879011 763224 751520 948901
10875I48901j30283k13786q563M2669j44433J08304o662j47370M3461R9812K9669
$$ 948901 818618 604832 596269 638938 494505 602809 596147 448777 492238 592050 621719
10864F21719k7799k27064k0315P4689j80022J17867j652r0507j19331P1582J76323
$$ 621719 593920 366856 346541 421230 241208 359075 357423 266916 147585 219167 395490
10853C95490J82161M82892P9647m65764m59110k7925L15701J29099k6712J85277
$$ 395490 577651 1060543 1140190 674426 215316 187391 503092 632191 605479 790756
10843G90756j6848p0668m2535N2977j36255J0364j11614k33469q0627K516k5944
$$ 790756 773908 703240 660705 713682 577427 587791 476177 242708 162081 164597 138653
10832A38653K87801M12907j8815m13821J549K68367j44838j45738R0010J5548
$$ 138653 426454 839361 820546 406725 408274 676641 531803 386065 476075 491623
10822D91623j02470K59595K75114Q5463j44560j38214J01895j36962j33654j36200
$$ 491623 389153 648748 923862 1009325 864765 726551 828446 691484 557830 421630
10812D21630M7119p709J3183K63764j15613j38125r9468o6672P7249P5934j64336
$$ 421630 468749 461040 474223 737987 622374 484249 384781 318109 395358 471292 306956
10801C06956N2731q0010J63214K45617J09961k52450l58486M802j22774J02833
$$ 306956 359687 279677 442891 688508 798469 546019 187533 192335 69561 172394
10791A72394J44978M1004K6594R1212o2057M3331j78246Q3850N3824j09716J79419
$$ 172394 317372 358376 384970 476182 414125 457456 279210 363060 416884 307168 486587
10780D86587O7697P1420J67240j54720k17748k63715m4024J00157j52297o832
$$ 486587 554284 625704 792944 638224 420476 156761 112737 212894 60597 53765
10770E3765J84909J50072R1137P5600O9965J96929J06333j29764k11481k65517
$$ 53765 238674 388746 479883 555483 625448 822377 928710 798946 587465 321948
10760C21948N8387o3225k8963K90866n1429k58232q5679O745L9712Q4097j64987
$$ 321948 380335 317110 288147 579013 527584 269352 183673 190418 230130 314227 149240
10749A49240j92882J89772J14263Q5335O5836p6683j23297L9706j7564R2991N532
$$ 149240 -43642 146130 260393 345728 411564 334881 211584 251290 233726 326717 332249
10738C32249k3980M4581K60222j85798p2618J45431M370k5474J59904k75030j71433
$$ 332249 308269 352850 613072 427274 354656 500087 504457 478983 638887 363857 192424
10727A92424J24692K3139R1788j4348J62427J22009m7062k17124J1026M8700J99715
$$ 192424 317116 340255 432043 417695 580122 702131 655069 437945 448971 497671 697386
10716F97386M2432o8039m40737r8359l122j0593j32285n7292J93979J23668J71354
$$ 697386 739818 671779 231042 132683 129561 118968 -13317 -70609 123370 247038 418392
10705D18392K24468l1044k08046k35600L7722p5967k4911N9963P7524J79490K20232
$$ 418392 642860 611816 403770 168170 205892 129925 105014 164977 242501 421991 642223
10694F42223j10551k55495J5690L5854J75049J09863m35834Q293J75179m4868
$$ 642223 531672 276177 291867 327721 502770 612633 176799 185092 360271 315403
10684C15403J13440K20790K4516m7766J4588j05497k10995J54630N8616n8481
$$ 315403 428843 649633 674149 626383 640971 535474 324479 479109 537725 479244
10674D79244j1963j03048q4589j8424j10453J1920l6736L52533Q1887j25508K6602
$$ 479244 467281 364233 279644 261220 150767 162687 125951 478484 560371 434863 461465
10663D61465o6493l6632L21546r545k2254N5336k6885j50574k64705j91308J11788
$$ 461465 394972 358340 679886 670341 648087 703423 676538 525964 261259 69951 181739
10652A81739L84087K89558L1483k11716j86392j02548J6967N7585N4103j44110
$$ 181739 565826 855384 886867 675151 488759 386211 403178 460763 514866 370756
10642C70756K09383j20986l34162J48829L10930J88110j20105j24406l03516j30657
$$ 370756 580139 459153 124991 273820 584750 772860 652755 528349 224833 94176
10632I4176K6235K60794J47815o9682j25362R5368J25566Q4688K1902p7282j82140
$$ 94176 120411 381205 529020 459338 333976 429344 554910 639598 661500 584218 402078
10621D02078p5407J2287j08021N1811O4825k05968K4115O3608p8139k34635P9389
$$ 402078 326671 338958 230937 282748 347573 141605 165720 229328 151189 -83446 -4057
10610d057L8352N0158Q0115l9959R6945J61377J00002k71221L6132J37296N924
$$ -4057 34295 84453 164568 124609 221554 382931 482933 211712 247844 385140 391064
10599C91064K17239L2992l38236r3962k1597P5898M7745q2564J39306p5307J57721
$$ 391064 608303 641295 303059 209097 187500 263398 311143 228579 367885 292578 450299
10588D50299L06532r6933j95799j54293j42012o5493K0302J91463J46224P122
$$ 450299 756831 659898 464099 309806 167794 102301 122603 314066 460290 467412
10578D67412r0554j24254m4008J04054J71592K5978L7747J26119j60326L9207
$$ 467412 376858 252604 208596 312650 484242 510220 547967 674086 513760 552967
10568E52967K41980k43417l88089M528Q0661J41730J04414K7141k285R4819j26459
$$ 552967 794947 551530 163441 167969 248630 390360 494774 521915 519630 614449 487990
10557D87990n3419N7897m5550K0384R0565K013l9499p2147k3368l6066O4277J99185
$$ 487990 434571 492468 446918 467302 557867 559880 520381 448234 424866 388800 453077 652262
10545F52262Q6092j76096l32104k10663P8049J08780l0063M3298L4569n9468j7779
$$ 652262 738354 562258 230154 19491 97540 206320 176257 219555 254124 194656 176877
10534A76877N729m1574j07584K0622j93746J60931J25799J06757N4765n1945j18883
$$ 176877 182606 141032 33448 54070 -139676 21255 147054 253811 308576 256631 137748
10523A37748O9219j74300j72349J32842P7797J98024O7042p6748k03538j35162
$$ 137748 206967 32667 -139682 -6840 70957 268981 336023 259275 55737 -79425
10513g9425O0280J48482K6788l25285q9670K55849J03210K86703J9629M0266K87709
$$ -79425 -19145 129337 156125 -169160 -258830 -2981 100229 386932 406561 446827 734536
10502G34536j95657k97049N1211J0477j3713m3167k66556J47329J47129j47176
$$ 734536 538879 241830 293041 303518 289805 246638 -19918 127411 274540 127364
10492A27364M3551j2498K1914J31488J487m17001k63686J62212J91980j45395
$$ 127364 170915 158417 180331 311819 313306 -103695 -367381 -205169 -13189 -158584
10482a58584J26411J2406J50682O4245J9107p3519j42608l32170l9121J86602
$$ -158584 -32173 -19767 130915 195160 214267 140748 -1860 -334030 -373151 -186549
10472a86549K35562P2483j74943j42079J86060J22930J52996J0366K6645K15188
$$ -186549 49013 121496 -53447 -195526 -9466 113464 266460 276826 303471 518659
10462E18659K35205k68932r7447Q440K11593P5744k041J15121j6333j81246o9006
$$ 518659 753864 484932 387485 395925 607518 683262 681221 796342 780009 598763 529757
10451E29757p8658K4419o5331j02958J88920R3594O5701J3788j19557k52909j12822
$$ 529757 451099 475518 410187 307229 496149 589743 655444 669232 549675 296766 183944
10440A83944R0358O9081J6431K34937n1662m36404l36858K48466L88337q7588
$$ 183944 274302 343383 359814 594751 543089 106685 -230173 18293 406630 319042
10430C19042M90j67042O8429L16221j10788r2221n7570p4757K5020J11303l3671
$$ 319042 319532 152490 220919 537140 426352 334131 276561 201804 226824 338127 304456
10419C04456m8482P1986J59863k9520j87978j18308M3315J67332J64821J09964
$$ 304456 255974 327960 487823 458303 270325 152017 195332 362664 527485 637449
10409F37449l3388j8156K4029j04320J6613J18390k3725J60995k13166j78411
$$ 637449 604061 585905 609934 505614 522227 640617 616892 777887 564721 386310
10399C86310p8580J02339K429M8957J2640o979M2246P0050O5214k32748k28584
$$ 386310 307730 410069 412498 461455 474095 467116 509362 579412 644626 411878 183294
10388A83294k89452L833N7318J55141J98791M9791k487N893Q1497Q040N2077p090
$$ 183294 -106158 -102325 -45007 110134 308925 358716 356229 362122 443619 451659 503736 496646
10376D96646n1347k48191J23116q2471R0385j66271J15039K06635l20523n271
$$ 496646 445299 197108 320224 237753 328138 161867 276906 483541 163018 157747
10366A57747J60209J1083m1253Q1717r5306k02863j3344j33758K8320M11955J29357
$$ 157747 317956 329039 287786 369503 274197 71334 57990 -75768 -47448 364507 493864
10355D93864j34692r1355m4786n6908J87801K5621J22545j57858L9714J34489
$$ 493864 359172 267817 223031 166123 353924 379545 502090 344232 383946 518435
10345E18435K15111m7528K5170k1131k35870l55835j64261L0736J46436k8100
$$ 518435 733546 686018 711188 690057 454187 98352 -65909 -35173 111263 83163
10335H3163k7701K43669L0725P9242K82214j41126j46468P9443j24031k10052
$$ 83163 55462 299131 329856 409098 691312 550186 403718 483161 359130 149078
10325A49078n4610J22781Q5379J12216j27888k64096o6535l7243o8256j25975
$$ 149078 94468 217249 302628 414844 286956 22860 -43675 -80918 -149174 -275149
10315b75149p7818K21015J41000K95734O3828q5145j73628J87323O3498J81648
$$ -275149 -352967 -131952 9048 304782 368610 283465 109837 297160 360658 542306
10305E42306q1933o5734P9523M4988k06040q6892J02049l8018j51526k29194J25434
$$ 542306 460373 394639 474162 519150 313110 226218 328267 290249 138723 -90471 34963
10294C4963L37370p2706j29071m8142j5526K7774k77657p8955K04853J95802L5226
$$ 34963 372333 299627 170556 122414 106888 134662 -142995 -221950 -17097 178705 213931
10283B13931p4325k13867J59316Q0036j4308L20381J07117j10460r2305p6816
$$ 213931 139606 -74261 85055 165091 150783 471164 578281 467821 375516 298700
10273B98700k49866j70532l35024R8900M12866N0435J0508J12148j08760J51589
$$ 298700 48834 -121698 -456722 -357822 55044 105479 115987 228135 119375 270964
10263B70964J95652m922L3360j66486m468j02069K7655P0928P1892j42963k7425
$$ 270964 466616 461694 495054 328568 324100 222031 249686 320614 392506 249543 222118
10252B22118k7164k72260J10477J62145k24408K5557K44456l2194O6263P3848
$$ 222118 194954 -77306 33171 195316 -29092 -3535 240921 208727 274990 348838
10242C48838J50157j00529j20388m4388J26285K3703N3061p1575L6829j33162
$$ 348838 498995 398466 278078 233690 359975 383678 436739 365164 401993 268831
10232B68831j95392J33882N8286J58679K4567k98205r2046m8607k0053J94418
$$ 268831 73439 207321 265607 424286 448853 150648 58602 9995 -10058 184360
10222A84360K00713q347Q4432J10912k50200l12676O6989P1512K81095j06420
$$ 184360 385073 376726 461158 572070 321870 9194 76183 147695 428790 322370
10212C22370k12216J70736q1660Q7824N9357J25890j81065K1304K6238j84141
$$ 322370 110154 280890 199230 287054 346411 472301 291236 312540 338778 154637
10202A54637O4208k3469K01561J67150K8737k41649j41014j31357J20081J97437
$$ 154637 218845 195376 396937 564087 592824 351175 210161 78804 198885 396322
10192C96322j84198r1579L00308L7594o1985p0936k84880R3034J48550o2786P0856
$$ 396322 212124 120545 420853 458447 396462 325526 40646 133680 282230 219444 290300
10181B90300j67200L4272j89139J05853R5952n3391K14285P6998m0047n3470j24777
$$ 290300 123100 157372 -31767 74086 170038 116647 330932 407930 367883 314413 189636
10170A89636j3003O8834J11613N2150J73595n5676k07785l92593k04779L16295
$$ 189636 176633 245467 357080 409230 582825 527149 319364 -73229 -278008 38287
10160C8287j81842q0254J87418J33954K5496j09478J65422J30702k79827J2366
$$ 38287 -143555 -223809 -36391 97563 123059 13581 179003 309705 29878 42244
10150D2244j21995j6802M5519J41555J3367P8337j5273q3925j01750j20895J42991
$$ 42244 -79751 -96553 -51034 90521 103888 182225 166952 83027 -18723 -139618 3373
10139C373L4059q9165o0547Q3181L84986J31787Q224j40041o9530K7550j30609
$$ 3373 37432 -51733 -112280 -29099 355887 487674 495898 355857 286327 313877 183268
10128A83268j4324j4281K0316J67380L8503J65862Q6166J29762n2390J04084k49727
$$ 183268 168944 154663 174979 342359 380862 546724 632890 762652 710262 814346 564619
10117E64619J999K58780j84566k76676N903k67734J8398J35998J38400K15867
$$ 564619 566618 825398 640832 364156 370059 102325 120723 256721 395121 610988
10107F10988j43635k80316j03451r4981Q1970K30964j51753j41298J43476o5226
$$ 610988 467353 187037 83586 -11395 70575 301539 149786 8488 151964 86738
10097H6738m2620J02052n4601J35282J67153m3940R1162J63861R4239m4244j11728
$$ 86738 44118 146170 91569 226851 394004 350064 441226 605087 699326 655082 543354
10086E43354k79809l8180j3612N7369k75755k31881k3097K21408M8008J2737J47920
$$ 543354 263545 225365 211753 269122 -6633 -238514 -261611 -40203 7805 20542 168462
10075A68462J36523J65925j27864k38309O1108Q7418J04687O9046p2480n7636
$$ 168462 304985 470910 343046 104737 165845 253263 357950 426996 354516 296880
10065B96880J19796r5357j83822o1113r4097j343k5644J59148l3083Q6795j167
$$ 296880 416676 321319 137497 76384 -17713 -19056 -44700 114448 81365 168160 166993
10054A66993K64106o2443q6039K5907J55018K1789j85327K9483K04925J50666
$$ 166993 431099 368656 282617 308524 463542 485331 300004 329487 534412 685078
10044F85078J54053J70603M4938j15818l03605j23587J42850J3640k43548n6403
$$ 685078 839131 1009734 1054672 938854 635249 511662 654512 668152 424604 368201
10034C68201J00095J57686j97110l99739o4433R9030n9913J3546j7982M7319K73344
$$ 368201 468296 625982 428872 29133 -35300 63730 3817 17363 -619 46700 320044
10023C20044K5564P2153j5396k2263r5289j12827k62808j20136N2371K07280O6054
$$ 320044 345608 417761 402365 380102 284813 171986 -90822 -210958 -158587 48693 114747
10012A14747L5012p0143j19656L5039J92253j7030j99624J12912K9402K40828
$$ 114747 149759 79616 -40040 -5001 187252 170222 -29402 83510 112912 353740
10002C53740K52222l07540l5174P3899K13472P3432j2251k94641l85715k33445
$$ 353740 605962 298422 263248 337147 550619 624051 611800 317159 -68556 -302001
9992c02001m765J18729m1416J15417J28673p8537N0086K0857k3905L74q5304L9534
$$ -302001 -306766 -188037 -229453 -114036 14637 -63900 -13814 7043 -16862 -16488 -101792 -62258
9980f2258J00525N3827L7556Q7699k3874j23426j09851Q0453J64110q4116j1972
$$ -62258 38267 92094 129650 217349 193475 70049 -39802 40651 204761 120645 108673
9969A08673R1558j8404j45208q4531p3923n9143J62429J12740R6773n6719j18377
$$ 108673 200231 181827 36619 -47912 -121835 -180978 -18549 94191 190964 134245 15868
9958A5868K2279o3099m2597R3507K04821P7877m213Q7900K74976m9402l4230j83650
$$ 15868 38147 -24952 -67549 25958 230779 308656 304443 392343 667319 617917 583687 400037
9946D00037j08731J04571p3004L2118j13961k23062N9054j14433p8081o589K92320
$$ 400037 291306 395877 322873 354991 241030 17968 77022 -37411 -115492 -122081 170239
9935A70239Q4291j94465n3430l2399o98J26067J50510j78877o8318J50091l6615
$$ 170239 254530 60065 6635 -25764 -26462 99605 250115 71238 2920 153011 116396
9924A16396r1573K43574r0877J4557j70955r5372k58029J98977L23335J83725
$$ 116396 24823 268397 177520 192077 21122 -74250 -332279 -133302 190033 373758
9914C73758k138r9223l11643q8052k4883j62948L2787M8952L55943J50108l0136
$$ 373758 371620 272397 -39246 -127298 -152181 -315129 -282342 -233390 122553 272661 242525
9903B42525K5477J2074r0659N807M2637K4576J23891j23744k05544j55748K2190
$$ 242525 268002 280076 189417 195224 237861 262437 386328 262584 57040 -98708 -76518
9892g6518J17903O1300J00452J60814K72482O8541j47546j23239k22741j89265
$$ -76518 41385 102685 203137 363951 636433 704974 557428 434189 211448 22183
9882B2183j64459L8176l9912K64925K82421J2690J15965J83286k02551r3194k58002
$$ 22183 -142276 -104100 -144012 120913 403334 416024 531989 715275 512724 419530 161528
9871A61528n5365N6841k81460j54151M0749L11902J31846j34252P7450j53824
$$ 161528 106163 163004 -118456 -272607 -231858 80044 211890 77638 155088 1264
9861A264p7037L00851K90467k45564j44024j28650N41J73518Q1818l1832J83734
$$ 1264 -75773 225078 515545 269981 125957 -2693 -2152 171366 253184 221352 405086
9850D05086Q9296j47624J84817r0001j44224O5103j00444o1865P1811K32586K74366
$$ 405086 494382 346758 531575 441574 297350 362453 262009 200144 271955 504541 778907
9839G78907j38966k63352l5901K29131k66635j89478m9280L943L39363M5116k39982
$$ 778907 639941 376589 340688 569819 303184 113706 64426 68369 407732 452848 212866
9828B12866k7024J31732q8373L8825K20j07782J30470J49987J99488R3254k4158
$$ 212866 185842 317574 229201 268026 268246 160464 290934 440921 640409 733663 709505
9817G09505l30483o7473j50380Q2984k382P3689k1867k25782O4380J3563o4682
$$ 709505 379022 311549 161169 244153 241771 315460 293593 67811 132191 145754 81072
9806H1072k47428j2499n4943K5215L15852K73706K66136k79096k363o9804m4774
$$ 81072 -166356 -178855 -233798 -208583 107269 380975 647111 368015 365652 295848 251074
9795B51074M16683K21676q4416j03190j23616k68420k34253k27528J42954Q1489
$$ 251074 667757 889433 805017 701827 578211 309791 75538 -151990 -9036 72453
9785G2453l02038j4853J98072M5146P2078R5626l1990j7698M297J81890L2528
$$ 72453 -229585 -244438 -46366 -1220 70858 166484 134494 116796 121093 302983 335511
9774C35511M3469O1394j29344j49637K4187K26862J38564o5673j36123k37255
$$ 335511 378980 440374 311030 161393 185580 412442 551006 485333 349210 111955
9764A11955K35480r4328k35707J68458Q6800R2147Q5216L14511k82564k35561
$$ 111955 347435 253107 17400 185858 272658 364805 450021 764532 481968 246407
9754B46407l4909M0200J57095J56126p6747j59408p0239l7123J0599q6750J22269
$$ 246407 211498 251698 408793 564919 488172 328764 258525 221402 232001 145251 267520
9743B67520J79077L0729J9358k57125L8404J2980j8575P8155J04792R6191j05174
$$ 267520 446597 477326 496684 239559 277963 290943 272368 350523 455315 551506 446332
9732D46332r1107j04739L080J47617j05533k09254j80085J74007J83722J07461
$$ 446332 355225 250486 253566 401183 295650 86396 -93689 80318 264040 371501
9722C71501q9842p577L0642k60450l8466J40422k75391j8539j95393p8847J81307
$$ 371501 281659 274082 304724 44274 5808 146230 -129161 -147700 -343093 -421940 -240633
9711b40633M7748P4568K10324R3933n7439J44283K4473J95352o2169j23868j68892
$$ -240633 -192885 -118317 92007 185940 128501 272784 297257 492609 430440 306572 137680
9700A37680L330J1762n9105k41305M2453k06k7959j1107J05708J9013P5001n7913
$$ 137680 141010 152772 93667 -147638 -105185 -105391 -133350 -144457 -38749 -19736 55265 -2648
9688b648N8341j20298J15590J89388Q446k29345j71786K54925J13196j34700o3029
$$ -2648 55693 -64605 50985 240373 248819 19474 -152312 102613 215809 81109 18080
9677A8080k2221J7959N2887O4274k4533l6384k53708k3469L96318P6376m5529
$$ 18080 -4141 13818 66705 130979 106446 70062 -183646 -207115 189203 265579 220050
9666B20050l5623k85265N1323K2317M7407J32557k21499j61481K92390Q7234J25475
$$ 220050 184427 -100838 -49515 -27198 20209 152766 -68733 -230214 62176 149410 274885
9655B74885R0748P4754j26656j90862j47088O7294J0866k26515k5915J92864Q2888
$$ 274885 365633 440387 313731 122869 -24219 43075 53941 -172574 -198489 -5625 77263
9644G7263k36168j78382J83974K58250J61630N4941m4652k32799r3139R357J07107
$$ 77263 -158905 -337287 -153313 104937 266567 321508 276856 44057 -49082 -39725 67382
9633F7382J40418j74127J33140J0059j50728P2112M0296J6668M3656O4724m3821
$$ 67382 207800 33673 166813 176872 26144 98256 138552 155220 198876 263600 219779
9622B19779M9990j42610j04650J0067J47787k49824p1435J0277Q41K12479j50848
$$ 219779 269769 127159 22509 32576 180363 -69461 -140896 -130619 -129778 82701 -68147
9611f8147r1668J01930J30756J00843K24681J93383k37465o8496j95582n2835
$$ -68147 -159815 -57885 72871 173714 398395 591778 354313 285817 90235 37400
$$ [...]
##END NTUPLES=NMR SPECTRUM
##END=
