##TITLE=Analysis number 327867
Compound Code mo 07110
Project Code adrs 
Chemist Name vekton
##JCAMPDX= 6.0         $$ Bruker NMR JCAMP-DX V2.0
##DATA TYPE= NMR SPECTRUM
##DATA CLASS= NTUPLES
##ORIGIN= Bruker BioSpin GmbH
##OWNER= nmr
$$ XWIN-NMR		Version 3.5
$$ Fri Apr 13 09:55:09 2007 GMT Daylight Time (UT+1h)  MAYBRIDGE\nmr@NMR_250MHZ
##.OBSERVE FREQUENCY= 250.131544655141
##.OBSERVE NUCLEUS= ^1H
##.ACQUISITION MODE= SIMULTANEOUS (DQD)
##.ACQUISITION SCHEME= undefined
##.AVERAGES= 16
##.DIGITISER RES= 18
##SPECTROMETER/DATA SYSTEM= dpx250
##.PULSE SEQUENCE= zg30
##.SOLVENT NAME= CDCl3
##.SHIFT REFERENCE= (INTERNAL, CDCl3, 0, 16.522)
##AUDIT TRAIL= $$ (NUMBER, WHEN, WHO, WHERE, WHAT)
$$ ##TITLE= Audit trail, XWIN-NMR		Version 3.5
$$ ##JCAMPDX= 5.01
$$ ##ORIGIN= Bruker BioSpin GmbH
$$ ##OWNER= nmr
$$ C:\u/data/dgb/nmr/ADRS/1400/pdata/1/auditp.txt
$$ ##AUDIT TRAIL=  $$ (NUMBER, WHEN, WHO, WHERE, WHAT)
(   1,<2007-04-13 09:54:47.20 +100>,<MAYBRIDGE\nmr>,<NMR_250MHZ>,
      <created by zg, POWCHK disabled, PULCHK disabled
       configuration hash MD5:
       49 4B E0 1D 92 C2 6B 37 9F E6 65 BC 52 41 86 1D
       data hash MD5: 64K
       70 87 96 18 D4 C3 3C F4 1C B4 58 D1 A4 3D FD C2>)
(   2,<2007-04-13 09:55:00.26 +100>,<MAYBRIDGE\nmr>,<NMR_250MHZ>,
      <Start of raw data processing
       ef LB = 0.3 FT_mod = 6 PKNL = 1 SI = 32K 
       data hash MD5: 32K
       BF CA 2E 5A DB 40 AE EA 1E 48 04 7F 8A EA 76 0C>)
(   3,<2007-04-13 09:55:01.87 +100>,<MAYBRIDGE\nmr>,<NMR_250MHZ>,
      <apk 
       data hash MD5: 32K
       7C 31 A3 F4 D7 D3 A6 1E 21 DF 66 FE 77 30 21 2C>)
(   4,<2007-04-13 09:55:02.57 +100>,<MAYBRIDGE\nmr>,<NMR_250MHZ>,
      <abs ABSG = 5 
       data hash MD5: 32K
       34 8C 61 9B 41 C5 47 1F F1 29 68 E9 0E B5 38 9A>)
$$ ##END=
$$ 
$$ hash MD5
$$ 14 CD 9D D1 18 96 18 F1 2D C2 B1 3C 4B 5C 5C 29
##$RELAX= 
##$RELAX= 
##$RELAX= 
##$RELAX= 
##$RELAX= 
##$RELAX= 
##$RELAX= 
$$ Bruker specific parameters
$$ --------------------------
##$DU= <C:\u>
##$EXPNO= 1400
##$NAME= <ADRS>
##$PROCNO= 1
##$TYPE= <nmr>
##$USER= <dgb>
##$AMP= (0..31)
100 100 100 100 100 100 100 100 100 100 100 100 100 100 100 100 100 100 
100 100 100 100 100 100 100 100 100 100 100 100 100 100 
##$AQSEQ= 0
##$AQ_mod= 3
##$AUNM= <au_zg>
##$AUTOPOS= <1 >
##$BF1= 250.13
##$BF2= 250.13
##$BF3= 250.13
##$BF4= 250.13
##$BF5= 500.13
##$BF6= 500.13
##$BF7= 500.13
##$BF8= 500.13
##$BYTORDA= 1
##$CFDGTYP= 0
##$CFRGTYP= 5
##$CHEMSTR= <none>
##$CNST= (0..31)
1 1 145 1 1 1 1 1 1 1 1 1 1 1 1 1 1 1 1 1 1 1 1 1 1 1 1 1 1 1 1 1 
##$CPDPRG= <>
##$CPDPRG1= <>
##$CPDPRG2= <>
##$CPDPRG3= <>
##$CPDPRG4= <mlev>
##$CPDPRG5= <mlev>
##$CPDPRG6= <mlev>
##$CPDPRG7= <mlev>
##$CPDPRG8= <mlev>
##$CPDPRGB= <>
##$CPDPRGT= <>
##$D= (0..31)
0 1 0 0 0 0 0 0 0 0.06 0 0 0 0 0 0 0.0002 0 0 0 0 0 0 0 0 0 0 0 0 0 0 
0 
##$DATE= 1176454486
##$DBL= (0..7)
120 120 120 120 120 120 120 120 
##$DBP= (0..7)
150 150 150 150 150 150 150 150 
##$DBP07= 0
##$DBPNAM0= <>
##$DBPNAM1= <>
##$DBPNAM2= <>
$$ [...]
##$SUBNAM7= <"">
##$SUBNAM8= <"">
##$SUBNAM9= <"">
##$SW= 20.6930455092707
##$SWIBOX= (0..15)
0 0 3 0 0 0 0 0 0 0 0 0 0 0 0 0 
##$SW_h= 5175.983436853
##$TD= 65536
##$TD0= 1
##$TE= 683.16
##$TE2= 300
##$TE3= 300
##$TEG= 300
##$TL= (0..7)
0 120 120 120 120 120 120 120 
##$TP= (0..7)
150 150 150 150 150 150 150 150 
##$TP07= 0
##$TPNAME0= <>
##$TPNAME1= <>
##$TPNAME2= <>
##$TPNAME3= <>
##$TPNAME4= <>
##$TPNAME5= <>
##$TPNAME6= <>
##$TPNAME7= <>
##$TPOAL= (0..7)
0.5 0.5 0.5 0.5 0.5 0.5 0.5 0.5 
##$TPOFFS= (0..7)
0 0 0 0 0 0 0 0 
##$TUNHIN= 0
##$TUNHOUT= 0
##$TUNXOUT= 0
##$USERA1= <user>
##$USERA2= <user>
##$USERA3= <user>
##$USERA4= <user>
##$USERA5= <user>
##$V9= 5
##$VALIST= <valist>
##$VCLIST= <CCCCCCCCCCCCCCC>
##$VD= 0
##$VDLIST= <DDDDDDDDDDDDDDD>
##$VPLIST= <PPPPPPPPPPPPPPP>
##$VTLIST= <TTTTTTTTTTTTTTT>
##$WBST= 1024
##$WBSW= 4
##$XGAIN= (0..3)
0 0 0 0 
##$XL= 0
##$YL= 0
##$YMAX_a= 294105
##$YMIN_a= -354773
##$ZGOPTNS= <>
##$ZL1= 120
##$ZL2= 120
##$ZL3= 120
##$ZL4= 120
##$ABSF1= 16.522
##$ABSF2= -4.171173
##$ABSG= 5
##$ABSL= 3
##$ALPHA= 0
##$AQORDER= 0
##$ASSFAC= 0
##$ASSFACI= 0
##$ASSFACX= 0
##$ASSWID= 0
##$AUNMP= <proc_1d>
##$AZFE= 0.1
##$AZFW= 0.1
##$BCFW= 0
##$BC_mod= 0
##$BYTORDP= 0
##$COROFFS= 0
##$CY= 12.5
##$DATMOD= 1
##$DC= 0
##$DFILT= <>
##$DTYPP= 0
##$F1P= 14.0000005364418
##$F2P= -0.99999901652339
##$FCOR= 0.5
##$FTSIZE= 32768
##$FT_mod= 6
##$GAMMA= 0
##$GB= 0
##$INTBC= 1
##$INTSCL= 1
##$ISEN= 128
##$LB= 0.3
##$LEV0= 0
##$LPBIN= 0
##$MAXI= 10000
##$MC2= 0
##$MEAN= 0
##$ME_mod= 0
##$MI= 0
##$NCOEF= 0
##$NC_proc= -5
##$NLEV= 6
##$NOISF1= 0
##$NOISF2= 0
##$NSP= 0
##$NTH_PI= 0
##$NZP= 0
##$OFFSET= 16.522
##$PC= 1
##$PHC0= 231.1697
##$PHC1= 8.045321
##$PH_mod= 1
##$PKNL= yes
##$PPARMOD= 0
##$PSCAL= 4
##$PSIGN= 0
##$REVERSE= no
##$SF= 250.13
##$SI= 32768
##$SIGF1= 0
##$SIGF2= 0
##$SINO= 400
##$SIOLD= 32768
##$SREGLST= <1H.CDCl3>
##$SSB= 0
##$STSI= 32768
##$STSR= 0
##$SW_p= 5175.98343685301
##$SYMM= 0
##$S_DEV= 0
##$TDeff= 65536
##$TDoff= 0
##$TI= <Analysis number 999999
Compound Code 99
Book Reference 9
Project Code 9>
##$TILT= no
##$TM1= 0
##$TM2= 0
##$TOPLEV= 0
##$USERP1= <user>
##$USERP2= <user>
##$USERP3= <user>
##$USERP4= <user>
##$USERP5= <user>
##$WDW= 1
##$XDIM= 32768
##$YMAX_p= 410239105
##$YMIN_p= -506458
$$ End of Bruker specific parameters
$$ ---------------------------------
##NTUPLES= NMR SPECTRUM
##VAR_NAME=  FREQUENCY,     SPECTRUM/REAL,   SPECTRUM/IMAG
##SYMBOL=    X,             R,               I
##VAR_TYPE=  INDEPENDENT,   DEPENDENT,       DEPENDENT
##VAR_FORM=  AFFN,          ASDF,            ASDF
##VAR_DIM=   32768,         32768,           32768
##UNITS=     HZ,            ARBITRARY UNITS, ARBITRARY UNITS
##FACTOR=    0.157963299565203, 1,           1
##FIRST=     4132.6476996994, 0,             0
##LAST=      -1043.33573715361, 0,           0
##MIN=       -1043.33573715361, -506458,     0
##MAX=       4132.6476996994, 410239105,     0
$$ Real data points
##PAGE= N=1
##DATA TABLE= (X++(R..R)), XYDATA
$$ [...]
18540 -41342 -168261 -100259 73949 103712 -3530 47178 90808 174446 253930 394963 415793
18529 415793 302558 179045 263521 282271 347532 392364 382086 447226 439778 347128 345715
18518 345715 432107 402264 205681 153531 157463 193025 248534 251580 308175 145049 -26835
18507 -26835 -20216 -38981 -168112 -181642 -121085 -47316 62351 133905 47859 -51428 -42371 -81652
18495 -81652 40687 205840 151702 12478 38112 188763 104079 129730 205194 301508 211971
18484 211971 184190 264259 419988 505419 446931 384210 311238 155149 261953 230147 124281
18473 124281 154220 224950 211238 313993 401271 361613 291847 283456 269461 312864 363793
18462 363793 343353 165506 6507 -41912 27421 -32429 -181086 -103067 -129880 -48068 81920
18451 81920 164553 256783 191481 152619 35794 -25921 55813 107167 112764 103342 153115 96254
18439 96254 -42168 -84287 -167404 -239399 -277008 -227833 -204617 -106709 -8588 -15081 -18524 -122826
18427 -122826 -123092 -26079 67145 81568 61385 -8297 40066 99818 132611 63823 9908 19669
18415 19669 219919 258621 124621 80296 89335 152508 197469 213783 133308 81955 130912
18404 130912 226422 262808 218381 283859 423285 382902 369111 359123 386136 415781 393857
18393 393857 360990 447264 486426 525138 663073 665263 605598 574179 504641 403762 428536
18382 428536 418542 371079 433690 417280 396974 500870 530944 595049 533875 446556 361868
18371 361868 468359 588899 463207 316276 393658 266124 98690 101547 254826 275309
18361 275309 150995 47468 83763 71900 -26461 24922 134952 44723 -8242 91860 140434
18350 140434 -55467 -92905 -47639 -86991 -311470 -306170 -158129 -9885 -55566 -224556 -184572
18339 -184572 8420 177453 178852 104215 -22268 -38960 88180 204737 183803 151815 89577
18328 89577 66804 175505 254223 127079 54564 -71713 -46304 -3903 -73065 -36415 44403
18317 44403 60400 83237 13709 69499 174394 268963 401128 490165 554757 506605 376655
18306 376655 117895 121990 84247 -23297 -61481 -72789 -77128 88097 140101 96955 -5186
18295 -5186 -35451 162104 274027 248249 273004 204307 202878 241532 213640 193831 259916 180338
18283 180338 98934 262453 368342 303595 338881 380257 426629 366511 344908 438433 482722
18272 482722 370089 279173 366262 417633 429256 533007 517046 406373 610824 914416
18262 914416 1169904 1408056 1441685 1430811 1435860 1389556 1144667 951297 802587 588067
18252 588067 488345 576027 515613 451373 371443 366904 406773 396230 304942 239615 355165
18241 355165 452211 378561 331899 227847 327666 434974 360104 239188 237242 345279 437967
18230 437967 453092 491882 547314 715333 818100 722174 743213 975701 926024 864103 944860
18219 944860 1069550 1165133 1301944 1438333 1606763 1786793 2123105 2246606 2242113 2518155
18209 2518155 2881263 3054926 3098538 3110278 3256041 3405057 3679091 4131124 4732272 5327729
18199 5327729 5899290 6590229 7559013 8681472 10339132 12323395 14710129 17765705 21570156
18190 21570156 26277729 31740757 37748047 43642433 48280231 49756013 47523725 42598162
18182 42598162 35557392 27110350 19525576 14048645 10548782 8348404 6928181 6009741
18174 6009741 5394355 4775656 4403535 4382402 4402146 4447803 4428125 4547268 4774689 5104398
18164 5104398 5310599 5360518 5536001 5838527 6162060 6478380 6981621 7756797 8869027
18155 8869027 10073230 11148393 12549467 14150578 16032181 17921538 19943396 22483629
18147 22483629 25620171 29598527 34490208 40832145 49002211 59216073 71211114 85398387
18139 85398387 101376499 117499516 130205692 135452666 131671867 120014318 102013700
18132 102013700 80562196 60014781 44100963 33559208 27166220 23792558 22234099
18125 22234099 21525349 21537784 22031566 23108105 24597530 26282544 28460294 31246094 34686926
18116 34686926 39147234 44485683 51462444 61268431 76287258 96338038 117809751 136830255
18108 136830255 160852772 194978024 222313666 201842620 131032075 79447049 54330271
18101 54330271 41937336 35596918 32390565 31111621 31265575 32716073 35285398 39365827
18093 39365827 44949123 52257969 61297933 71754750 83376638 94459681 101462231 101632474
18085 101632474 95143868 83861505 68305955 50995388 36487155 26230585 19690818
18078 19690818 15495891 12690179 10841142 9423207 8262981 7284649 6325387 5676072
18070 5676072 5334638 5074191 4598542 4288234 4109714 4003083 4013999 3976256 3905788 3795739
18060 3795739 3627179 3537094 3490039 3378829 3240616 3105811 2827440 2593573 2447917 2275476
18050 2275476 2198923 2205473 2127082 1981499 1921403 1742134 1687927 1851332 1936420 1897648 1803565
18039 1803565 1780811 1764114 1723122 1744113 1910987 2050795 2068030 2071354 2128283 2072305 1994566
18028 1994566 2160309 2313224 2413652 2610871 2790604 3076977 3192057 3422389 3850391
18019 3850391 3983509 4390429 5029906 5575857 6169832 6757996 7613291 8608606 9609736
18010 9609736 10684726 11993806 13670124 15653476 17985780 20806453 24435935 29000845
18002 29000845 34908247 41831128 48965666 57055056 66810690 75967400 79663492 76038117
17994 76038117 73093688 74834202 81298334 91890799 102972566 107616328 103342519 98877010
17986 98877010 96685706 89859506 78107639 69705760 66638679 68051066 72266923 73814496
17978 73814496 65080479 47420151 32442208 23462936 18220011 15080181 13116292 11623164
17970 11623164 10494966 9620081 9079568 8931795 8887638 8902239 8993738 9142121 9437490 9828240
17960 9828240 10223119 10820830 11697019 12815083 14355276 16213528 18692356 22044216 25892298
17951 25892298 29653370 34164218 39329478 43612663 43759165 40668384 39244612 40774429
17943 40774429 45102592 51491171 57358861 59845037 59586193 60063681 59622341 53516344
17935 53516344 45039504 40057618 38464816 39483270 41586803 41240158 34649968 24648372
17927 24648372 17231352 12812461 10244304 8748805 7849690 7088875 6484260 6160697 6043196
17918 6043196 5970454 5835091 5778221 5802980 5711856 5724383 6054948 6471151 6853287 7462228
17908 7462228 8251423 9173723 10147608 11142176 12146323 13491593 15060998 16866031 19091663
17899 19091663 21883169 25456120 29903018 35652647 42805299 51267337 61076900 72466860
17891 72466860 85050522 95763348 100413562 99644872 96704081 90386800 81202921 75648482
17883 75648482 76519582 82465173 92478238 104937376 116437682 123707491 128704836 133400544
17875 133400544 133505866 126605936 115716855 105403658 94510893 80798287 69910526
17868 69910526 64978178 65020068 68813129 74301011 77824382 75830851 69168412 60780980
17860 60780980 49515955 36400804 26012801 19538153 15514420 12817746 10817875 9193415
17852 9193415 8021263 7213249 6603903 6101900 5762167 5375985 5051930 4661863 4134487
17843 4134487 3855462 3547001 3404783 3119485 2874127 2805721 2695631 2640154 2631682 2449266
17833 2449266 2128534 1960405 1918217 1858658 1789344 1649565 1606553 1448214 1317928 1157953
17823 1157953 1223636 1303613 1387983 1412138 1426618 1296235 1135617 1106404 1047060 832745 738974
17812 738974 778620 950777 1194963 1133732 1044201 937521 883609 934356 1069060 1116581 1033208
17801 1033208 930431 1011628 988867 1003138 1016594 1017598 991797 985309 902154 858869 742684
17790 742684 671433 606737 518976 585659 645563 706500 854356 988370 887183 804760 724678
17779 724678 797256 864269 799092 771364 809274 719385 794403 1048933 1084234 994587 1138745
17768 1138745 1229272 1227563 1104506 1001863 1059416 969681 994631 1120516 1139349 1217565 1400939
17757 1400939 1512031 1561332 1392380 1266495 1343712 1258969 1012004 956440 963028 915130 997611
17746 997611 1062701 1036808 997429 1048552 1083383 1039905 899033 745304 639841 497495 607489
17735 607489 623856 633162 552144 603676 529480 574743 792969 890473 865943 638696 590573
17724 590573 587387 764740 903682 942085 929948 938052 1059291 1109374 1007175 775007 642679
17713 642679 666584 579587 607870 618165 646889 753981 818470 807986 933046 1092526 1276772
17702 1276772 1251219 1305465 1232833 1121245 1011931 930287 957038 998963 1058407 961502 829789
17691 829789 656200 661002 717631 575746 541810 491851 420099 389167 296844 262517 383485
17680 383485 441236 420090 482991 405179 432005 423758 400032 329868 209215 262329 349079
17669 349079 439811 620566 650993 626267 482399 263332 271029 259832 388120 392370 317883
17658 317883 274722 281523 325025 342281 291141 208066 75261 158687 276209 373874 420996
17647 420996 428200 308753 310273 395192 478197 492749 483684 416591 283519 235724 59973
17636 59973 102975 286264 453472 541950 463708 566748 741388 572373 539863 489802 539060
17625 539060 630954 783673 902973 953559 956083 1005910 1102550 1146495 1105387 786491 640037
17614 640037 423911 353363 448229 538760 425460 374248 353784 311943 339889 436461 484583
17603 484583 448455 391901 303027 289539 244684 231282 296247 403259 582417 612161 440678
17592 440678 407622 458465 285505 159546 201620 198784 159307 248300 379387 273937 167013
17581 167013 244681 319753 432840 319153 363765 505817 535313 597756 705245 750891 889612
17570 889612 774362 703751 772453 670146 558683 785367 777415 583818 416289 385569
17560 385569 384177 461697 531303 590322 577482 671256 529167 578445 662312 609333 598885
17549 598885 624745 542472 478034 452667 507261 657771 744336 781888 636247 567860 586368
17538 586368 668385 695527 705514 704789 698350 872833 1025057 942718 939930 977758 1050325 1103385
17526 1103385 1190091 1205287 1355577 1300043 1167646 1338666 1482511 1393854 1449868 1758469
17516 1758469 2113171 2324765 2582920 2834891 3153418 3600505 4055573 4616504 5284866
17507 5284866 6046109 6895634 7866109 8985087 10414409 12109605 13969465 16130915 18726828
17498 18726828 22241819 26947469 32651675 38860534 45576452 53368216 61749688 67352396
17490 67352396 66016317 59993769 56086745 56102897 59174756 64100164 67109125 63586420
17482 63586420 55435597 49827351 48678422 50475776 54558633 60135162 64244987 62670753
17474 62670753 55925214 50036622 47659579 48268189 50668072 51578974 46300436 35424446
17466 35424446 25488878 19114656 15339556 13001092 11477310 10477108 9947355 9724800
17458 9724800 9647181 9622968 9973825 10720755 11674619 12700937 13870946 15223918 16977063
17449 16977063 19193874 21965917 25799135 30600257 35855918 41632879 48482300 55762738
17441 55762738 60291661 58650639 53034769 49254555 48910474 51522851 55806469 58427611
17433 58427611 55435280 48414139 43512628 42408115 43643555 46875334 51767420 55494480
17425 55494480 53938214 47617094 42166778 40040700 40647442 42793959 43698325 39510692
17417 39510692 29993757 20851567 15082625 11578195 9369104 7841912 6699641 5846360
17409 5846360 5266256 4603104 4175776 3854419 3586954 3309794 3209601 3169826 3064774 3016278
17399 3016278 2744821 2507739 2211933 1968817 1810006 1772479 1750397 1608685 1551277 1457217
17389 1457217 1346001 1287565 1343387 1260027 1302704 1265806 1252458 1254194 1250571 1238183 1258434
17378 1258434 1371834 1442404 1432390 1351734 1350346 1280693 1254962 1206019 1130728 1156856 1289350
17367 1289350 1238184 1045520 1058336 1035119 1060329 1209885 1262908 1233286 1114318 1072089 1034829
17356 1034829 1002671 958016 905569 819686 723797 755347 879534 1151296 1077921 822782 768267
17345 768267 783774 666838 649383 561132 526985 460551 507807 546333 534193 498824 565093
17334 565093 593476 392143 275378 314030 390520 435160 435250 387028 233800 281230 299470
17323 299470 313814 331510 375206 306406 254399 250122 278042 346859 419260 438908 376562 313381
17311 313381 379493 372995 414816 530928 589792 604969 513995 495924 375277 360618 398019
17300 398019 398601 329892 257189 357171 409347 402211 455645 323560 264288 265181 381852 412643
17288 412643 305433 274153 304981 217205 215623 269771 379922 404687 295320 157874 126915
17277 126915 174068 285229 214990 146074 233839 241224 269701 287504 375420 313781 68400
17266 68400 71169 188097 188957 275055 331687 383355 353759 361488 322361 286268 308712 399272
17254 399272 430950 411912 377438 182277 96365 17014 31330 114998 156244 300578 350065
17243 350065 326813 377207 516261 513989 441393 391881 446768 522410 566033 568502 444585
17232 444585 450446 343177 92564 -11317 8167 203211 277285 327648 404218 538186 499995
17221 499995 461021 334014 333671 370675 277710 272907 288204 218643 98944 68633 156278 -473
17209 -473 93237 92651 112715 236765 377538 313655 145078 114614 73401 170580 200220 284488
17197 284488 288047 86762 -25241 115757 373391 530165 454272 305908 231359 325238
17187 325238 331188 246339 281445 394902 416679 409777 386564 365074 256789 215371 138660
17176 138660 230218 358086 289633 270466 190140 296019 417964 360253 192225 113004 101338
17165 101338 111334 29387 29421 -53393 49278 185235 218986 208379 243998 265875 316572 332237
17153 332237 247491 182362 150100 54272 -112375 -44333 133686 16383 -5303 101676 18944
17142 18944 83664 114424 244139 277324 158423 -59164 -93876 9143 51572 48765 -45686
17131 -45686 -103476 39079 107174 98747 100238 147329 263394 212642 197896 250323 250513 242919
17119 242919 138532 7045 -6016 -2519 -98314 -74237 -122921 -7608 72263 -18853 -68519
17108 -68519 -158592 -165716 -152514 -139341 -53586 -28567 -4870 -21615 -102019 -50356 70469 79420
17096 79420 121366 41633 44816 215418 270411 331200 312919 256550 198007 139376 129086 73939
17084 73939 15297 -59619 -103749 -105729 100391 227575 262420 301611 252799 241924 201849
17073 201849 211501 260426 217868 214018 316375 157580 68197 112080 107678 125747 129085 127633
17061 127633 -25619 19497 13935 -143483 -129158 -57807 48629 112402 188903 174310 191106
17050 191106 197760 172189 266729 200388 31570 10516 61174 185828 81401 -47485 -112365
17039 -112365 -29122 43766 71779 24440 68483 138313 145756 167543 69162 151672 372617
17028 372617 477638 410642 259240 197467 180097 187213 260136 266193 318279 351637 280891
17017 280891 238784 142303 187547 112570 71381 35356 -7712 -103772 -61657 47192 167254
17006 167254 248567 334134 200089 122782 126302 105261 277377 412197 368234 365699 385629
16995 385629 419037 266193 152557 31427 28989 145977 252326 409117 521258 482362
16985 482362 372148 360785 371183 277551 299584 227484 154623 246942 348349 416179 413550
16974 413550 385668 395893 377792 384660 257799 162339 232760 274842 283588 202233 141104 117107
16962 117107 330314 319323 134010 136923 202075 155596 107388 103225 115620 154397 211069
16951 211069 138061 78537 29515 -8220 -140460 -144451 -69869 42477 115283 43685 104121
16940 104121 351342 416707 330101 281969 270574 204327 159569 128275 232565 361924 327967
16929 327967 273898 239801 339498 452721 392704 448171 374932 403451 407063 317821 318954 391223
16917 391223 401884 287810 180714 238603 263779 163303 47579 -104618 -43556 17407
16907 17407 156382 205076 42960 -46279 -33183 37802 19537 -77675 -27803 133539 139772
16896 139772 201529 178331 43619 90440 55061 100347 139812 92384 100167 -2513 35685
16885 35685 135041 217137 268897 32787 -158726 -147619 -96850 35641 -27315 -224576 -112167
16874 -112167 4961 -18717 -128729 -158817 -87451 -147327 -11298 84914 85209 51071 22698
16863 22698 -74841 -2167 151165 225722 26927 51376 25495 32995 91598 102469 167365
16852 167365 135062 109161 127216 100295 77498 197627 199377 125339 72217 84831 59560
16841 59560 23865 41108 150798 170421 171399 188403 226460 269689 150694 55002 27770 31451
16829 31451 31643 -10335 -51544 -41445 43507 10977 -65674 -3565 100016 269644 225198 229351
16817 229351 185873 127114 4108 -141198 -128436 -125302 -89488 -59688 -126927 -148195 -53969
16806 -53969 66946 -2707 -174496 -108317 1584 10182 28334 -68037 -119054 -99680 -87754
16795 -87754 -41290 57269 -14281 -91151 -76875 -41008 -47550 -25011 30390 180450 274654 141802
16783 141802 12557 -48965 -144988 -183308 -120901 13406 -59026 -208517 -274624 -243007 -135616
16772 -135616 -107507 -223537 -313228 -221087 -108682 1610 -27637 -118221 -108356 -20799 -1818
16761 -1818 120751 173329 63397 -41999 34631 36266 -35875 -35213 13187 120682 174558 64498
16749 64498 -24484 106372 291810 212424 69664 136501 77285 79858 24797 -14353 115561
16738 115561 156673 139105 138798 140219 87520 -85777 -107262 -96977 -59486 96197 58453 84309
16726 84309 215253 242983 148923 146701 88087 -22917 -53157 -39310 29957 67453 234969
16715 234969 311021 202216 6180 -11571 810 -50648 -31155 142987 204000 216565 39055
16704 39055 27168 94781 152651 45376 27009 142376 169599 114575 75126 14943 -14581
16693 -14581 -43522 -19311 -53933 -67944 -125523 -336985 -36615 116012 32115 24675 42689
16682 42689 -556 80001 -15533 29742 53962 161621 29218 -4761 -19634 -101367 56373
16671 56373 139123 109251 143413 140679 116561 86881 152041 101683 102827 227417 255729 158754
16659 158754 67939 13796 62955 -39656 -72576 -36096 -11309 110030 189995 169638 77606
16648 77606 78817 87723 39821 87471 172868 110490 162360 51406 -54779 -20533 -94909 -269388
16636 -269388 -280167 -196942 -143227 -182447 -146964 -35625 -26248 -67487 21029 74881 19403
16625 19403 -49458 -45181 -13621 58426 119469 162835 166187 114272 34739 80914 129515 227642
16613 227642 230508 101262 38219 -142803 -189493 -212023 -182585 -185555 -182016 -118508 -10207
16602 -10207 86374 8847 -50761 -160907 -97280 -29379 -49764 99182 155668 122301 3393
16591 3393 -71168 -100452 -50180 -43628 -98064 -21452 -72053 -48993 88562 150602 37309 55005
16579 55005 104925 66120 9905 -38878 14030 -69299 -86589 638 -38490 56007 69806 3669
16567 3669 -30763 -156441 -92486 31599 33417 4163 86087 -20266 15100 260328 276622
16556 276622 138695 -22417 -41502 -9993 -149475 -278152 -401557 -283016 -240547 -309297
16546 -309297 -234271 -303743 -325708 -263449 -240141 -142028 -11811 1359 59932 235745 392517
16535 392517 351691 244019 138862 151523 -16505 -171101 -163391 -43129 -125427 -172655 -32357
16524 -32357 -50075 3584 155263 145620 241508 195134 1919 -20336 2179 4780 -59736 -46613
16512 -46613 -43371 -123492 1610 39410 -1383 -69021 -33646 -19444 -16679 62075 124101 238894
16500 238894 38640 -186110 -274921 -154224 -93549 -23267 22379 28041 50171 208457 193835
16489 193835 110757 225642 289375 138356 186080 101724 -8733 -80560 -209098 -114861 -5502
16478 -5502 -67252 -182928 -106316 -86853 -97359 -150945 -38947 -69320 -75622 2535 10333 45670
16466 45670 -82299 -83658 -16364 -17583 4086 -96147 -96423 -99136 24827 47604 -47126 9243
16454 9243 -54424 -144597 -49446 -91977 -193836 -184990 -81227 -34214 -88981 -173305 33438
16443 33438 280598 319661 251597 76572 -127843 -117352 3738 115142 105630 99937 171173
16432 171173 61588 105938 98373 -16408 -38607 2302 66333 174993 196350 124374 160616
16421 160616 106500 14139 -4294 -29717 -45932 -21483 21387 -56053 10697 30561 20657 32104
16409 32104 -115406 -113854 12041 7804 88337 68001 52887 83176 104022 251816 187839
16398 187839 160049 118454 2951 -58736 -18023 -12905 -145749 -181443 -91457 -54017 -2525
16387 -2525 -119271 -188529 13096 30649 -18922 -64347 -201702 -228916 -132667 -98209 -249704
16376 -249704 -251918 -72712 145220 273432 224887 101694 -45728 -116300 -67783 -43459 -13268
16365 -13268 -58783 -56735 -63280 -18866 52388 23423 -94896 -156302 -187667 -85279 -71113 -15708
16353 -15708 23629 -57684 -169086 -152117 -137116 189 -1598 191038 245492 256631 152295
16342 152295 163756 62264 58711 3060 -82236 -116479 -46849 -32449 -85410 -142991 -146641 -52775
16330 -52775 -140394 -232981 -336735 -203086 -132455 -42157 -60101 -91760 -39165 -227002 -306901
16319 -306901 -209859 8517 -54393 -58551 -31938 -10183 45738 38185 -77604 -144651 -124658
16308 -124658 -141778 -201306 -150227 -11035 -16298 55409 217881 263332 266576 191578 20123
16297 20123 21581 137263 175498 56897 36346 -45920 -41832 -51627 -80207 -74348 -32267 69347
16285 69347 130155 136850 46879 -62408 -33497 -91065 -123090 -88554 28492 72564 77592 18330
16273 18330 -97000 -7411 14264 -71463 8551 77908 78841 15758 14526 65083 94208 -41910
16261 -41910 39556 229734 209350 102921 112743 74525 103188 -22585 -138141 -182173 -86647
16250 -86647 -73236 -76346 -47941 -40256 -17917 48926 134009 107688 -2402 -59932 -87345 -19893
16238 -19893 49345 29032 -91044 -45363 7430 25606 -4366 -202319 -143656 39872 149473
16227 149473 278963 223432 189868 291222 361758 292564 156337 22855 121537 66270 177553
16216 177553 251820 247814 216720 171520 207940 134161 114076 191487 198133 167557 186154 204808
16204 204808 108775 95671 130767 182693 240897 337776 351090 434725 550310 531487 638436
16193 638436 874560 946042 1003831 1086764 1247957 1272396 1353480 1448145 1577746 1511429 1512739
16182 1512739 1422022 1408277 1353283 1276446 1124659 984079 927653 932532 801777 732527 657530
16171 657530 508464 427528 413718 310188 123782 127554 116522 156279 206189 163489 144703
16160 144703 124817 52022 19899 231421 337244 249010 86073 -5664 122697 270843
16150 270843 105583 -103826 -139158 -123623 18596 145245 126957 -8988 -33205 62095
16140 62095 168279 165104 135700 36307 81208 75068 -33012 -259732 -228505 -62599 55906
16129 55906 110731 98624 128913 96336 27017 34175 50142 -56872 -62010 -54409 40050 13877
16117 13877 56325 65008 26577 -34263 32912 29061 6514 14562 88869 149402 121211 5593
16105 5593 -11282 122740 129710 51444 -96790 -1223 90297 109039 208632 70723 76087 62127
16093 62127 74339 204921 172994 289254 156346 -30406 4956 -83547 -63561 4866 -95339
16082 -95339 -189002 -135460 -107659 -70030 -120034 -102396 -111216 -83095 -28197 150867 96692 -16741
16070 -16741 -44027 -134255 -125519 -30849 128357 113683 65457 -22972 -147122 -76553 20326
16059 20326 109300 29997 43332 103759 36995 120552 209148 150998 92095 89466 108426 70682
16047 70682 108668 84903 172653 253277 89675 -88913 -87144 -22658 6502 30846 -23395
16036 -23395 18972 -103873 -321222 -393330 -371247 -189118 -27330 -47362 -160224 -99198 -3360
16025 -3360 -2379 -46773 103526 81413 9218 -15263 -2249 77690 82063 -90920 -46497 46142
16013 46142 -59559 21057 112369 91229 87936 83452 120751 61952 -42597 -42906 -185163 -296366
16001 -296366 -253347 -179174 -47164 -39121 -1970 99806 -28015 -67660 -49763 -68431 -68807
15990 -68807 -16434 -31341 82502 119109 15166 -36522 -23322 -52950 -129099 -94626 -2744
15979 -2744 -109884 -146953 -234060 -162323 -50413 -31491 53103 -26501 -53083 -41890 11492
15968 11492 134590 206284 177349 86708 -13417 -86744 -251320 -186861 -49745 110264 212469
15957 212469 217244 127152 145111 185450 246993 178432 110903 -44752 -171299 -88744 -47470
15946 -47470 2242 -86802 -102108 -19972 -9827 33091 13583 78397 124768 92574 -16559
15935 -16559 -5334 88763 25271 -128502 -89408 -95624 -83879 -113633 -67030 -47360 100323
15924 100323 160067 54799 -62554 1244 11602 -50797 -46052 15791 -30815 -107225 -130439
15913 -130439 -132573 -50288 -38427 56548 70626 141220 174426 88655 103564 28333 20745 84318
15901 84318 21538 -59759 -17802 74455 92220 91285 134499 193018 129459 137650 33994 8652
15889 8652 195269 316344 311217 162396 32048 29965 105497 140602 165451 125568 43972
15878 43972 -108799 -114082 -87778 -112305 -158504 -122123 -27780 -147559 -83352 77107 180612
15867 180612 84023 53460 -25673 -58497 -39757 -103718 -175325 -64929 79725 124000 109607
15856 109607 107844 -23600 -110479 -152591 -115105 -150264 -228538 -196456 -62522 54293 147065
15845 147065 212873 53114 -203132 -223266 -117588 -31033 114221 156324 185623 207037 178117
15834 178117 50258 -115369 -232854 -183850 -203409 -387635 -287807 -120467 -56454 -82937
15824 -82937 -156205 -160261 -75080 -15112 -55230 -166663 -138014 -91674 61834 175634 289292
15813 289292 197869 -44527 -130323 -96393 -113560 -76769 -45817 -33976 -147246 -190789 -237811
15802 -237811 -183586 -25612 -35254 4558 37788 63509 -91333 -58897 48434 1129 -186202
15791 -186202 -17326 106110 64557 13470 -61788 -43086 -62310 -133976 -43331 64867 30150
15780 30150 -73761 -112730 -66029 67228 10244 63479 210812 176385 48706 14080 17746
15769 17746 -32216 -65877 -71762 -50898 -192690 -399460 -373516 -243654 -153295 30105 131708
15758 131708 112049 106607 40128 -21709 -15893 -75668 -89477 28176 25275 23 -206499 -290431
15746 -290431 -302809 -219535 -241763 -131858 33494 7139 -94996 -52230 35794 -62891 -152808
15735 -152808 10309 93575 76620 -10285 18382 108953 226343 142339 -79840 -152626 -213737
15724 -213737 -216274 -196214 -103848 -105617 -104117 26712 154013 186312 304162 342291 253573
15713 253573 162968 127687 101976 151547 139261 196815 238908 255090 311010 212090 4092
15702 4092 -73264 -8701 107217 193902 99333 140692 103371 -22723 -32109 -14595 155518
15691 155518 109154 98353 105346 108247 37892 -30255 -77157 -113091 -78054 -1301 33532 60341
15679 60341 55697 53869 175187 188243 113269 73421 111448 112974 102265 70021 89061 -107168
15667 -107168 -177815 -210783 -113782 -168585 -60267 12061 -61675 -195987 -107372 -102351 -81903
15656 -81903 -7121 149774 8504 -57554 -47184 -127874 -103593 -29416 19850 22324 4963
15645 4963 12457 -54791 47138 91344 53811 126670 156167 145530 8336 -40902 67780
15634 67780 213268 235583 79490 67117 -21201 -69613 -134478 -41656 44195 192789 131899
15623 131899 3096 -53892 7143 13123 104620 145320 187876 192893 120907 189887 279956 190049
15611 190049 81156 -87863 -29765 -35460 -70276 -101349 -101433 -7627 98120 173358 -6846
15600 -6846 -93387 65238 107273 -42248 -126123 -119634 -25369 -12471 76042 133498 102161 173103
15588 173103 233305 381364 386408 193418 34256 45114 13590 46193 5889 -54573 -59804
15577 -59804 -133915 -171730 -27372 -2578 -66684 -122713 -202862 -126205 -151811 -219645 -196699
15566 -196699 -137130 -246995 -150871 -82084 -57168 -23965 64543 98516 9835 748 122487
15555 122487 245214 337955 155783 -38493 -32203 -66191 -24672 15273 62676 -15284 -28869
15544 -28869 -22640 -125034 -42679 96028 134897 153319 71490 54449 -16248 -92664 -144934
15533 -144934 -234734 -72879 1793 53014 54415 -9461 -97346 -167655 -125275 -112408 -57968
15522 -57968 -43484 25925 -42836 61328 38554 -52057 61792 123408 1315 -9558 18077
15511 18077 -61121 -111150 -196386 -108026 -167061 -209698 -77289 -125801 -210255 -183438 -210806
15500 -210806 -163083 10150 39377 -41827 -112158 -87187 42290 44453 89879 -16851 -184550
15489 -184550 -277683 -258040 -214711 -86734 -15731 -111634 -86917 -93903 -100922 -92240 -104724 -107624
15477 -107624 80589 35542 -143677 -295802 -173991 -56034 -17941 -111586 -158121 -57171
15467 -57171 20328 -93625 -217711 -263984 -47499 55965 45642 -18402 50121 115372 60011
15456 60011 -61581 294 -5593 20093 -35289 11053 1679 -88261 -29962 18735 -21818 108266
15444 108266 25407 26410 27385 137845 163487 143787 100206 30606 56960 74545 200306 212703
15432 212703 138753 127707 98852 174248 327384 227680 114536 237241 264944 239429 156190
15421 156190 135430 117608 75471 204262 154755 40515 60019 30543 45199 -11785 -63414
15410 -63414 -115476 -178383 -181600 -34217 39709 -107064 -202386 -11213 -13956 -283 163429
15399 163429 202828 265855 235865 25081 -41909 93677 79767 -18696 -100578 -53090 16092
15388 16092 -44095 22269 -154467 -446576 -403400 -323188 -258119 -138645 -194595 -162137 -100743
15377 -100743 -116895 5662 87773 52077 122136 165684 131414 65357 -72723 -105961 -102414
15366 -102414 118632 53765 42749 40299 -11733 -16674 -53219 -16032 -61170 -78303 -31382 -52048
15354 -52048 -27889 27359 -5353 -95220 48752 29566 59502 93762 19040 -20270 -46748
15343 -46748 -48035 -139339 -184703 -156339 -115792 -59504 -74691 -10886 -15220 3002 45159 34469
15331 34469 37222 -24038 -78176 -26085 213208 268372 234110 215622 204801 229145 198147 147796
15319 147796 26658 -2916 19280 -76344 15618 49012 79631 75528 90200 36951 224240
15308 224240 226923 122030 -11265 -44546 58536 234912 199289 114234 -5014 20296 61854
15297 61854 10062 -29743 123539 115359 72316 109267 223958 302554 239327 111404 45904
15286 45904 57642 -96508 -80356 -124312 -149151 -138888 -111279 -53557 -27552 -55724 -118612
15275 -118612 24762 78892 -5744 -94522 -23771 -61431 -149263 -158107 -129208 -94027 -35187
15264 -35187 34054 -77904 -136394 -178420 -236489 -289702 -271054 -221439 -213006 -201300 -184047 -190782
15252 -190782 -229294 -179811 -122189 43600 43579 1145 -20009 -29496 -30337 -12524 -27187 31293
15240 31293 -13624 -39116 93094 193919 211765 28411 -86803 39062 90921 54479 55333
15229 55333 -46487 -58522 26 119200 79093 550 -53660 -233840 -246355 -203435 -32611
15218 -32611 -56210 -18962 -31665 56297 59535 -25048 -95636 -27094 131564 219044 211594 23771
15206 23771 -101185 -82458 558 33740 -57481 -72214 1230 -69561 -4611 117740 150101
15195 150101 -8379 -75353 -141202 -273332 -223202 -43446 -99396 -91092 -22349 43019 -10323
15184 -10323 -42949 -15430 89222 42180 -50371 -124646 -64913 -44206 -158212 -198430 -114441
15173 -114441 -164882 -256928 -202067 -122510 -120402 13544 118869 50591 97120 110023 148901
15162 148901 159697 129381 192423 86295 -50853 -217853 -166607 -33482 -108612 -108061 -31193
15151 -31193 -26697 65931 161945 224091 19432 -218593 -176187 -133772 -150198 -54841 -28776
15140 -28776 -90992 -47454 -19608 -63779 -140717 -142262 21903 10557 -30259 10650 -34881 -118929
15128 -118929 -64857 -105876 -124206 -86079 -151094 -88560 -54659 -127643 -90697 41421 86812
15117 86812 97240 10612 -110291 -106247 -85004 -55930 -116817 -2585 138519 180769 41105
15106 41105 -49411 7943 40987 -114569 -131909 -56463 83042 226652 283937 208496 245286
15095 245286 205021 158788 249602 175887 -72884 -46273 -115710 -120094 87588 136061 127692
15084 127692 61304 -98779 -79028 18017 -31937 -42878 -26068 56291 17267 -233933 -197567
15073 -197567 -53212 -127226 -147454 -144855 -145185 -144221 -61758 19577 -38674 -27266 26914 22483
15061 22483 84478 -31721 -57426 -78619 -73075 -55600 -121165 -172408 -264056 -301231 -238694 -288011
15049 -288011 -424906 -363883 -303132 -192280 -128424 -101125 46791 67949 -13770 -78790 -28187
15038 -28187 -5178 -87042 -68139 -9872 103658 56839 33371 -49486 -51616 -129062 -172048 -98321
15026 -98321 -84202 -98633 -38926 -44148 -173886 -120789 49690 40223 -54881 -72438 -128195 -97605
15014 -97605 23260 109069 93628 52427 -56644 -71560 -106661 -59416 -128299 -206148 -243541
15003 -243541 -126744 -48979 -169292 -67335 -106244 -181825 -117775 5073 16029 32983 66193
14992 66193 78406 109836 132509 -47644 -181942 -236585 -218218 -145307 -142257 -208455 -221613
14981 -221613 -132385 -103353 -91093 -52099 17367 101179 69405 157855 18516 -141618 -97130
14970 -97130 24615 -50965 -8668 -4746 -2561 -120120 -57791 -113050 -103966 -50304 -38604 -20496
14958 -20496 -36616 121005 139969 192936 223296 74818 81 29432 33895 153534 124450
14947 124450 15730 35874 28044 -59437 -43997 -71484 -139688 -185492 -207505 -294707 -106191
14936 -106191 -97670 -173248 -134615 -79540 -4508 -23977 -30801 63819 -18567 -152245 -146472 -15543
14924 -15543 -29263 -21344 36423 -2141 25450 91694 119804 53662 21990 -21455 -3464 146309
14912 146309 139037 65087 33453 17327 1162 -10489 60521 52220 132974 77020 46170 50183
14900 50183 18148 -42104 -93337 -180781 -177186 -60303 42000 -2474 15395 10006 24531 118505
14888 118505 140795 30445 4834 92504 51273 -104316 -162250 -115006 -161899 -196534 -195939
14877 -195939 -124497 -135270 -228338 -309799 -212109 -39095 41607 41435 24436 105187 150130 -1423
14865 -1423 16356 116206 89289 10737 -59769 -110635 -143994 -125000 -5143 1709 -52041 -140095
14853 -140095 -104299 -29387 -77602 -44280 49050 17891 28422 174152 354025 344298 343665 357504
14841 357504 275819 220266 -30614 -100582 11619 55498 135430 64304 20896 17627 -59590
14830 -59590 -157157 -199188 -284384 -285630 -142192 -94016 -106982 -128784 -72324 -8284 35973 18752
14818 18752 86644 45255 89012 22559 -6921 -93843 -50051 -42991 -147028 -96841 39961
14807 39961 -64285 -205104 -264556 -275692 -170511 -75595 -8874 54306 77575 164685 233125
14796 233125 94047 49496 66821 162135 125662 -10329 920 -83543 -42343 53097 34778
14785 34778 -115463 -159441 -203353 -115595 -17229 -31452 -96130 -88169 -96949 -3299 42353 72986
14773 72986 46921 -14612 -4610 -17200 -163143 -124397 -18773 -91833 -124825 -26272 10732
14762 10732 -39596 67912 174573 216078 121404 -121554 -145049 -134238 -193434 -170879 -232438
14751 -232438 -163312 -33299 42975 27325 26432 34381 -5709 54102 13026 74113 117931 59248
14739 59248 126560 237809 192878 121349 -50453 -189095 -158462 -111394 -52439 28810 98555
14728 98555 63732 -24996 20529 47355 -12413 -122504 -161917 -206963 -195355 -220087 -183765
14717 -183765 -144795 -225339 -272852 -230426 -210813 -141316 -128715 -114125 -180481 -244585 -137164
14706 -137164 -82773 -159835 -187573 -64959 -108808 -143015 -59936 -76930 -64521 1204 36020
14695 36020 -14049 -108676 -44371 -87021 -180360 -163871 -247241 -224489 53504 209656 198650
14684 198650 61815 -116417 -149499 65231 190905 118060 -125350 -198518 -154834 -103995
14674 -103995 -139180 -240522 -347411 -207418 -128154 -137871 -141504 -115385 -151530 55501 49036
14663 49036 -193406 -233852 -165041 -117565 -100420 -161870 -141685 -164173 -134357 -59310 84008
14652 84008 99876 11465 69864 113173 154334 159619 117552 4384 74507 146425 130922 76749
14640 76749 122191 139327 109416 114464 20293 79174 35062 23369 70228 157513 126480 -46122
14628 -46122 -73554 52069 -40737 -119277 20557 -9652 -26463 -37694 25609 -49311 -62930
14617 -62930 -16165 62131 9251 -81935 90847 69901 14491 62533 -10597 -170613 -229556
14606 -229556 -171464 -24648 49548 -32182 -63232 -31972 14272 -20389 2096 98495 181471
14595 181471 266146 276472 325501 375137 208760 -20160 -236115 -256124 -230195 -327646 -213322
14584 -213322 -128665 -65113 -44753 -181027 -140813 -99912 107004 152002 26244 -96740 -138527
14573 -138527 -219310 -245969 -223199 -181884 -150403 -70816 93974 70751 115084 79113 59638
14562 59638 106502 135312 142272 84327 -11799 -166239 -204105 -129703 -100873 -115777 -58304 39760
14550 39760 54631 12099 1720 63549 118654 -11352 32010 -8588 -118685 -140798 -126526
14539 -126526 -32314 -69720 -71465 131065 250268 118048 96056 109207 -14658 -71571 -107874
14528 -107874 -102477 -118563 -286922 -257766 -70345 -124165 -230983 -125942 94085 231670
14518 231670 304848 349774 161204 44474 -65200 -86926 -94693 39602 112295 -21009 28496
14507 28496 215468 126619 -82232 -61995 -63470 -122019 -115659 -93525 -92405 -33774 -118546 -81211
14495 -81211 46732 16692 -30998 29328 153234 194110 47257 -11031 40744 106220 9986
14484 9986 -50092 -165099 -128623 12579 64584 9037 -53691 19190 1088 44864 74537
14473 74537 222231 306170 210961 118943 120794 125047 20673 -120997 -177693 -188289 -78499
14462 -78499 -24099 -45054 -89671 -16473 -51099 -45930 35744 44541 -183142 -253922 -161528 -126042
14450 -126042 -36714 6361 -82676 -117577 -90873 -110394 -92531 -139848 -72717 -3306 107341
14439 107341 42770 -72255 38422 -53284 -39814 151192 142191 97940 13257 2908 59122
14428 59122 62095 44402 67362 85276 79250 96562 -92213 -103682 36775 110756 141431 103353
14416 103353 -20772 -46645 -111655 60338 84104 260447 221434 100638 90129 104765 152863
14405 152863 99186 -95102 -190651 -118852 4682 -69892 31997 22058 107132 87710 86703
14394 86703 155907 201905 210220 71655 -20097 -140603 -112837 7020 40802 81105 -1880
14383 -1880 -59904 -51194 -25758 -48986 -9323 -78875 -45687 -20615 -46101 -90719 -73008 -115673
14371 -115673 -134123 -219897 -215466 -238681 -184970 -228811 -117890 16765 116181 150524 -28931
14360 -28931 -134083 -83973 -26595 121007 236304 23535 43134 57649 82742 88295 -96989
14349 -96989 -217030 -102638 -11742 25473 96405 227069 213618 156008 144373 34252 -53294
14338 -53294 -35978 13416 -64718 115252 244157 307903 312492 201904 114663 93011 103259
14327 103259 83211 83533 143051 114588 59508 141881 72765 37015 -11326 -49440 -100063 -152529
14315 -152529 -112725 -177710 -59684 -45134 -24799 -11276 -183410 -133134 48921 18562 32140
14304 32140 149777 122352 45852 28424 46124 12859 -4334 27783 -55232 -181381 -167908
14293 -167908 -88860 -50694 -185031 -210795 -99437 -4219 -63590 90769 53416 -109303 -172690
14282 -172690 -71827 -108955 -76180 26766 78053 67450 -93565 -113812 -15827 122027 155890
14271 155890 48941 46633 -73564 -82093 -32796 -98455 8731 155014 246481 212911 162719
14260 162719 152922 147509 185353 74234 93256 118335 -943 5547 -37489 36125 44532 -77851
14248 -77851 -88917 -129373 -160084 -119353 31477 65209 -14212 93427 145829 129886 50147
14237 50147 10338 -25534 -37605 -51565 -91636 -138750 -196471 -198296 -91948 -93046 -119163 -176515
14225 -176515 -75773 40537 2613 -49113 -45246 38621 55355 -56628 -61976 -106826 -99160
14214 -99160 50274 62184 -41105 -87718 -133743 -27765 69992 76910 35979 114816 61823
14203 61823 -35199 22261 217255 303318 354043 178350 20456 6740 125790 200771 218874
14192 218874 61922 -83839 -201785 -176288 -201107 -207004 -147110 -221560 -136853 -154442 -225750
14181 -225750 -167898 -31877 10943 -18630 -71133 -124160 -77821 67627 102782 30529 -62484
14170 -62484 -58857 -47765 70932 73926 27290 5740 76978 7491 -39220 -91583 -171363 -314173
14158 -314173 -280724 -85347 -39297 -25724 -70393 -91205 -50812 -113552 -9079 77809 -17454
14147 -17454 7631 -34172 -35166 87612 5588 -6562 22015 -28682 -34198 -62782 10995 -14073
14135 -14073 -62136 -118544 -81850 -20633 7310 30851 153314 185153 177293 156381 82598 -52028
14123 -52028 -46768 4626 29446 58219 25789 -112424 -102883 -9420 -41802 -180089 -193810 -204391
14111 -204391 -167941 -119198 -164385 -117916 -78082 72872 143574 173865 109496 11502 13679
14100 13679 107800 77851 -56619 -154885 -34290 72302 60316 68110 85996 -26377 -82028
14089 -82028 37159 94835 3224 -152370 -91079 88967 177524 84938 -96101 -147072 -105471
14078 -105471 -154345 -94512 28514 -68826 -209986 -128323 -48693 19686 7152 -53805 4865
14067 4865 -6701 62622 76621 116192 39350 -5023 -79754 28864 159834 122982 33774
14056 33774 -66029 -146720 -133491 -85274 -80519 -83033 25963 44218 29855 37829 -78772 -202853
14044 -202853 -246415 -210929 36320 68640 55569 -20865 -127933 -149318 -33774 -143786 -208238
14033 -208238 -242189 -187846 -161872 -179973 -115406 -64213 -103699 -115517 -109380 -84717 -59784 36922
14021 36922 162309 154948 201814 48616 46831 106733 168274 27431 129766 215307 241543
14010 241543 228268 83533 49199 -118423 -207012 -95347 1310 71032 -61257 -45609 93239
13999 93239 165782 -25207 -89045 -55219 -18383 -7955 -77371 2259 37807 40306 31191 -152296
13987 -152296 -292674 -295633 -202471 11958 232381 162787 217 -29511 45976 109495 90268
13976 90268 169242 278633 277799 166915 101907 12383 35693 -15310 -136161 -156950 -208932
13965 -208932 -281453 -171091 -23023 -4301 18093 4427 -79628 -240723 -223531 -206467 -50629
13954 -50629 190275 271618 264788 79548 22771 169559 140871 88770 50303 10604 -23638
13943 -23638 -58766 -83445 -77711 -159598 -12171 -17124 -33427 -40903 -57803 60311 35230 11200
13931 11200 97213 -27670 -52480 -148635 -245135 -186869 -227581 -194622 -142359 37860 112992
13920 112992 141480 116522 44183 86075 175113 161279 69302 109672 -124121 -68834 61001
13909 61001 172290 158737 32334 -82559 -145044 -178428 -91455 -107935 -39232 59237 67720
13898 67720 -42698 -38820 60177 225724 277900 117514 -60765 12904 59271 105490 174445
13887 174445 183769 267570 307749 326387 263188 118070 53159 258076 274007 193207 45511
13876 45511 -23288 39077 93939 121702 75130 -49371 -165898 -111988 -77507 -42372 -177924
13865 -177924 -142499 -50913 16322 33631 -90006 -275680 -239380 -161290 20360 166392 86952
13854 86952 -16264 -21363 -67111 -14433 44305 101973 182855 176209 69875 39169 222054
13843 222054 137899 15771 -39618 -142536 -192356 -108717 2793 187601 303381 283665
13833 283665 84055 27412 -27059 47313 122954 158905 177594 -4047 -138184 -132869 -135714
13822 -135714 -155654 -245266 -144763 -115413 -89362 -37020 50361 94801 34074 44689 36622
13811 36622 68452 194634 327697 276294 64659 39589 77152 108003 145941 -25765 -201245
13800 -201245 -161173 -58146 -54374 -105600 -157111 -162382 -140914 -2426 114407 176977 32576
13789 32576 -77220 -185475 -148578 -156883 -184679 -217861 -118837 -13255 32887 91807 168462
13778 168462 198449 159760 143587 164592 4557 -134953 -163688 -177252 -196729 -141121 -148594
13767 -148594 -61691 74282 148617 137483 13875 -39676 -37145 -173186 -212815 -193241 -112109
13756 -112109 -165247 -248320 -190464 -143009 -78638 94234 189332 293323 244596 261958 167328
13745 167328 103849 72260 86722 31277 33385 -4383 -9343 102671 132705 206942 214851 166141
13733 166141 138958 54976 -2271 32347 79136 108692 -2930 -58426 -49828 -109485 -108854 -57240
13721 -57240 -35425 -70072 -54485 15720 62990 37543 -57129 -65177 -4367 -15495 -83552 -17431
13709 -17431 -34938 -156557 23843 135348 24485 -121268 -96431 3349 -33651 53095 -20640
13698 -20640 -75811 -41452 -12260 -13432 -124662 -276632 -219261 -115679 -9023 74733 33785
13687 33785 46235 -96459 -208954 -89121 37533 69314 145691 206056 201041 253084 156948
13676 156948 50060 18944 -24918 -99163 -70216 27332 133720 183000 77281 -118590 -5969
13665 -5969 63300 106427 41717 -76217 -105077 -65825 -76740 90749 171674 75912 -64410
13654 -64410 -160197 -139388 -156728 -92875 -32535 -85533 -67481 -73687 -51721 -47257 7579 74578
13642 74578 132300 45650 111162 225234 165092 34166 -71359 -80521 -23586 52176 39305
13631 39305 -66597 -20043 -41691 -96889 -28105 24297 58528 138663 24233 63397 125047
13620 125047 58093 33092 55506 -4642 -2321 29034 -77711 -107063 24408 26720 74577
13609 74577 44460 -45902 64917 62430 41100 77948 -33080 18600 20881 84718 217711
13598 217711 171463 186117 189055 127896 168169 139204 -10312 65898 198773 230588 176170
13587 176170 132704 -66204 -217982 -252378 -132298 -23797 8804 101525 82569 37971 -95493
13576 -95493 -173685 -143918 13324 167796 244334 270232 163822 3313 -65332 91276 213176
13565 213176 92208 -91629 -213431 -225131 -198048 -62278 -46233 -138836 -178628 -173507 -276620
13554 -276620 -315691 -366955 -309188 -295762 -187386 82639 161904 127736 17495 -76875 -88694
13543 -88694 -36906 -16939 -112119 4401 223049 324687 292784 221540 148093 155599 166122
13532 166122 100832 173844 270684 125633 -44548 -212316 -239379 -214808 -195366 -269154 -231869
13521 -231869 -181304 -220069 -193779 -95565 -82053 -14727 44835 72083 5928 -5755 -71016
13510 -71016 -203872 -203263 -189214 -112664 -86816 29423 41508 -25311 75545 104309 70528
13499 70528 70678 158122 186726 111222 12081 -37000 -53066 -13567 -13995 -45783 -31328 48127
13487 48127 -5046 13316 37755 30351 99733 225156 165851 -26926 13640 225339 268804
13476 268804 287155 298349 163914 46542 123908 157842 83074 -1108 102902 186385 154141
13465 154141 90212 85798 83684 13433 47597 38327 88331 119907 148922 -9522 -69168 -63327
13453 -63327 822 55592 52842 72877 53270 30632 17266 141758 244267 225117 126421
13442 126421 -114365 -163773 -49592 46064 94714 94019 73119 90229 51254 182394 219378
13431 219378 204386 191061 162167 71611 102177 50967 77279 119215 -35329 -28965 27688
13420 27688 -82889 -57700 61165 73586 -22782 -20913 -9556 -31286 -34581 -69179 -157266 -271096
13408 -271096 -200458 -36454 132064 87218 51476 -7134 -63163 -111342 -22411 -52128 -234269
13397 -234269 -226104 -16601 70382 83643 35170 -7208 -52312 -115649 -88442 99146 -18242
13386 -18242 1398 -64537 -120865 7110 -160823 -138898 -39539 -33480 82002 176384 151670
13375 151670 61508 69201 161928 163010 196342 213803 169577 41074 -50547 62212 95897
13364 95897 240013 190136 130806 -29637 -89389 -44557 35574 22616 157823 235972 246736
13353 246736 264194 101632 52555 -141147 -114112 -29813 14890 130787 149659 104725 -14329
13342 -14329 -3209 51478 43349 71532 11712 -84355 -116693 -97483 -66150 75131 155097 81636
13330 81636 11808 132991 63899 -61572 59608 110895 134851 87752 -32411 -45705 -71112
13319 -71112 -53208 -63186 68228 192832 170774 229580 94067 -23722 48241 108338 31128
13308 31128 10774 92426 153697 212636 134433 57398 58806 124733 112267 101039 93685 68882
13296 68882 5511 -38771 -65626 -27443 25420 1768 65402 241767 330314 245237 144358
13285 144358 14100 -49178 86634 128738 7284 81918 229484 250542 136365 100015
13275 100015 94541 95483 -19488 -63238 -58223 -2110 60842 89405 80219 117135 142074 175427
13263 175427 243083 270945 260733 169547 244024 186844 207478 277110 255275 178658 136699
13252 136699 117396 151458 160676 166066 177832 95571 62983 171560 223456 202090 168587 159821
13240 159821 161789 124296 109465 -13228 52463 -9261 27131 154453 299907 383380 355012
13229 355012 211303 75573 123804 265801 299846 302816 256403 177701 197059 231850 235028
13218 235028 121044 175408 293798 354521 345126 280566 299882 191545 244932 328443 318844
13207 318844 315179 307600 235017 220572 177137 141491 169166 119170 252160 312117 230452 157413
13195 157413 139331 167118 145412 75908 61337 117506 303159 297711 282716 273576 207680 150548
13183 150548 129856 227107 263001 202756 94955 88089 192887 163616 282107 392930 438233
13172 438233 424371 322108 208811 317750 347391 346515 375897 392045 402907 446389 478331
13161 478331 325526 257834 288130 226323 293619 422404 499901 384168 383139 422618 420008
13150 420008 382945 149121 159394 277233 337837 307976 429857 514363 480334 383919 393586
13139 393586 404100 337008 180001 86339 169448 179532 213058 190056 267841 356971 357222 378719
13127 378719 306119 275027 369814 379075 494392 532449 536060 507019 312067 312457 349596 373912
13115 373912 493804 644893 611032 476413 398638 427572 450066 485838 542288 527093 514403
13104 514403 542627 518959 571097 582953 549338 557466 617152 776541 852042 749585 664688
13093 664688 543913 604844 635011 640869 646363 753076 801159 756958 704160 639859 647429 797178
13081 797178 828094 898615 819880 687862 725146 798191 804338 811629 882204 1049277 1151419
13070 1151419 1071924 1057885 1128971 1210801 1317662 1218930 1180224 1423044 1605572 1644843 1628115
13059 1628115 1473213 1413588 1188922 1024311 1007322 882162 906936 998944 952700 787223
13049 787223 633677 581266 632274 579773 543171 666454 652836 641591 636490 737439 875157
13038 875157 998075 1041109 986261 907083 851232 823267 751817 718249 762953 849509 851204
13027 851204 948809 906537 972316 954599 1028216 1000859 930675 977141 1109909 1181227 1260637
13016 1260637 1301307 1204595 1104005 1093299 1128359 1182931 1153688 1062435 1067833 999296 1075276
13005 1075276 1175610 1271816 1194365 1075800 1196079 1317874 1236664 1043477 1104817 1189717
12995 1189717 1282601 1394891 1444289 1380186 1501950 1726332 1736079 1688477 1675744 1561334 1394283
12984 1394283 1366929 1461693 1501697 1538044 1624755 1754398 1538393 1560108 1764727 1793019 1737258
12973 1737258 1778537 1832435 1748226 1703532 1668178 1739568 1744957 1883243 1988210 2016417 2113173
12962 2113173 2272476 2476190 2408979 2329766 2343537 2255408 2355209 2371745 2331818 2281021 2301806
12951 2301806 2372512 2531748 2604303 2590518 2615421 2651167 2776757 2819969 2912234 2970099 2927110
12940 2927110 2819081 2718128 2778004 2938727 3172528 3258552 3313090 3169312 3165247 3243540
12930 3243540 3376597 3502003 3460546 3444853 3533235 3636079 3666541 3556229 3612007 3754013
12920 3754013 3762217 3808035 3910038 4007150 4134617 4321888 4518799 4552726 4587747 4676866 4651512
12909 4651512 4726181 4928298 5020140 4974106 5126275 5177560 5460521 5763960 5920437 5953956
12899 5953956 6101799 6258864 6299408 6452663 6583706 6671995 6780744 6990534 7173788 7359801
12889 7359801 7569315 7739503 7852760 8032521 8336512 8598119 8715220 8891181 9164002
12880 9164002 9512430 9633270 9770985 10028943 10256315 10534345 10944249 11315529 11696675
12871 11696675 12057943 12459882 12846896 13242033 13648439 14099760 14500846 14873615 15415447
12862 15415447 15982391 16554397 17012573 17627384 18232346 18858155 19561351 20352247 21239094
12853 21239094 21837964 22510083 23261877 24067902 24971445 26091080 27252678 28439243 29615633
12844 29615633 30890159 31982057 33244082 34619451 36125573 37599601 39377634 41181953
12836 41181953 42859605 44792052 46787737 48829857 50813073 52941698 55251653 57765434
12828 57765434 60282924 62665984 65148996 67769254 70487722 73334653 75992197 78725663
12820 78725663 81471316 84182425 86879005 89466379 91915373 94153342 96321304 98121254
12812 98121254 99475464 100579391 101600099 102481946 102858677 102834818 102472040 101753998 100599537
12803 100599537 99131655 97483557 95569096 93490238 91351054 88986834 86310830 83655309
12795 83655309 80781672 77879115 75197867 72421660 69652883 66898917 64242131 61711762
12787 61711762 59234752 56922812 54602254 52216295 50074010 47988793 46007858 44184066
12779 44184066 42386446 40513233 38864603 37261463 35720930 34345172 32969032 31717481
12771 31717481 30516600 29393243 28370631 27473329 26534325 25464113 24684106 23926978 23028781
12762 23028781 22238112 21470670 20782751 20220775 19567838 18857364 18159302 17641053 16987087
12753 16987087 16323428 15729797 15300782 14942872 14675287 14300719 13856516 13443604 12979369
12744 12979369 12652042 12424938 12194234 11863195 11551855 11260520 10955438 10724476 10491093
12735 10491093 10270998 9817613 9529440 9335878 9275152 9068519 8800036 8461214 8193161
12726 8193161 7933974 7787193 7748238 7581457 7515941 7324549 7126433 6935359 6813794 6757242
12716 6757242 6670426 6523684 6354617 6164311 6053884 6014515 5920581 5870300 5826699 5746236
12706 5746236 5554942 5442495 5332446 5292964 5460930 5283554 5095284 5098676 5112776 5000604
12696 5000604 4914644 4861349 4748690 4726514 4698247 4531894 4452902 4368025 4182423 4069334
12686 4069334 4018870 4074306 3965530 3808547 3558756 3598969 3717158 3624739 3431142 3564916
12676 3564916 3572037 3562774 3394582 3238307 3189279 3158961 3052118 2990305 3126898 3127704 3034936
12665 3034936 2871187 2735964 2697598 2857245 2890560 2861445 2920044 2892769 2827203 2739881 2626717
12654 2626717 2564302 2521920 2509230 2459622 2334322 2354770 2404463 2244624 2228359 2140722 1977030
12643 1977030 2020020 2055832 1964670 1960151 1855569 1703386 1620016 1692188 1950037 2055141 1957221
12632 1957221 1853568 1824623 1932194 1978293 2029017 2020972 2052518 1890578 1712873 1696992 1704216
12621 1704216 1799487 1735044 1627217 1639299 1815914 1862765 1791340 1600937 1564716 1518047 1433264
12610 1433264 1329045 1366155 1489559 1641987 1622187 1588828 1525458 1446521 1383781 1446650 1502774
12599 1502774 1434048 1406319 1417322 1451030 1560606 1642569 1443383 1237847 1403032 1431363
12589 1431363 1417148 1397933 1510979 1612492 1703935 1627795 1624220 1565237 1575380 1500874 1217401
12578 1217401 1107217 1112987 1089951 1242571 1239689 1167940 1153935 1315155 1383898 1303658 1134740
12567 1134740 1215040 1282882 1365900 1419722 1374691 1181124 1116860 1265602 1536536 1679111
12557 1679111 1720174 1586744 1605712 1793313 1866604 1977797 2258328 2399961 2385863 2370735
12547 2370735 2223542 2097466 2079561 2002324 1877458 1962769 2119339 2005804 1970809 2080285
12537 2080285 2015860 1769270 1627630 1566988 1438289 1318144 1062688 992820 1040054 880817
12527 880817 910253 940438 914345 844533 1049699 1106556 1126733 1136697 1032553 879350 926679
12516 926679 1094402 1220391 1255018 1200609 1207705 1115626 1184415 1377281 1460358 1469930 1614235
12505 1614235 1731176 1729044 1579962 1511244 1519476 1509193 1514955 1636314 1651393 1686149 1707926
12494 1707926 1744926 1735956 1518654 1382838 1244889 1054521 921660 952595 828079 667433
12484 667433 632093 644099 675017 592956 614598 609804 767588 710099 773298 858377 805893
12473 805893 738428 735331 643971 714856 839760 871917 858359 768407 745844 757631 965130
12462 965130 1216828 1327360 1168684 1026422 974469 877459 749888 825459 743037 605608
12452 605608 567306 649436 759526 893545 903618 810193 714057 711030 726088 686957 529817
12441 529817 473696 527971 534018 502224 468848 449870 272128 312161 260933 333305 444448
12430 444448 440248 420271 447989 469569 585384 659399 470729 356181 310543 306768 339804
12419 339804 578855 750074 699882 556271 570818 425714 338712 256961 155371 282084
12409 282084 275387 276483 307583 401074 320160 180223 288438 317622 460906 425158 223490
12398 223490 157504 233086 328339 277520 273077 160494 15208 26212 221530 181545 216572
12387 216572 255321 295792 429132 410261 383149 393915 502695 651535 617361 536004 375081
12376 375081 461750 537850 445694 382671 373580 413716 308239 229831 210419 149125 131686
12365 131686 194772 173969 209247 158437 128725 235596 246014 269568 418196 472912 417811
12354 417811 379858 238991 185907 97609 84480 80099 131052 263406 270293 196946 204689 133159
12342 133159 90875 134862 187064 145703 97794 70139 82310 128328 220113 424816 415009
12331 415009 476892 539274 389913 355320 383175 407028 384126 316833 254915 210184 269990
12320 269990 266665 170954 251338 199050 240809 323896 328380 283413 259305 217739 164441 -17524
12308 -17524 -40945 122317 218819 173287 296199 399504 253445 199458 30294 -53451 -14965
12297 -14965 168895 205770 127949 184747 188578 112454 99064 141094 113372 136842 67390 38908
12285 38908 57949 99333 173242 237748 320425 363911 305375 248319 154720 215429 219172 227379
12273 227379 182584 91606 229826 281212 328349 326477 271254 324861 104110 -1843 214898
12262 214898 392468 421813 360686 392602 305220 274653 329056 403640 414132 344217 195108
12251 195108 249408 438787 505260 526535 536542 537362 638089 828031 933696 921797 783279
12240 783279 720625 610741 622865 648761 512525 487715 580506 506809 527491 552596 558767
12229 558767 490643 556227 625041 653621 686799 788783 1091760 969300 749119 514330
12219 514330 405548 579958 634693 650253 696379 773347 822727 837165 803815 915756 903306
12208 903306 920287 1052037 1079927 1152775 1358068 1572648 1818494 2030356 2287577 2343319
12198 2343319 2249307 2098888 1755854 1381532 1023053 797085 791834 754561 778876 719609
12188 719609 741358 715935 789215 883506 975708 823397 685521 592350 580307 600176 600847
12177 600847 539165 441551 262790 242643 283579 299698 369367 550730 697619 698952 574043
12166 574043 577232 517093 442945 432219 478516 513081 501275 452803 484486 645683 707266
12155 707266 746093 622540 556210 479768 347610 334526 424645 394188 292531 413293 443181
12144 443181 266459 186055 164513 51211 96459 25653 -34842 -17915 -87175 -159991 -160301
12133 -160301 -215703 -138781 -13054 170444 165395 93331 51815 139025 124742 54807 37133
12122 37133 6981 67023 196895 342650 297504 256229 89443 60818 101144 196692 115092
12111 115092 63494 111086 63283 53090 26274 147570 182763 166446 216977 137791 196720
12100 196720 213667 177726 199595 68497 51314 -70485 -136943 -5372 99286 96903 74203
12089 74203 81520 55979 -76087 -251377 -158798 -100725 -76228 -47457 -42828 -39641 4842 10668
12077 10668 -44635 1276 4196 89825 132721 29183 -55949 -204556 -259432 -323167 -272318
12066 -272318 -204361 -129771 -23510 109241 74653 -39281 -140561 -135131 -33811 11057 -50262
12055 -50262 -32336 51892 79815 180165 150097 104316 45744 107106 177757 121350 56390
12044 56390 -53785 12757 82571 150474 179926 184370 143194 186965 190674 197463 284661 256259
12032 256259 193809 185541 229804 147768 222045 129601 43255 81670 235951 351906 393277
12021 393277 295065 115976 25479 -36377 55433 217381 136277 44759 -21658 57620 39160
12010 39160 75179 69769 66641 4914 28032 56722 113121 -50949 -17040 -39231 -120620 -1925
11998 -1925 144042 198108 222400 198021 72895 23257 -9245 -74641 -145647 74225 201694
11987 201694 136492 49618 147101 58920 -112458 -101815 -113725 -157621 -286400 -318096 -223731
11976 -223731 -176458 -87764 -18968 70341 177976 161527 101578 139694 186262 269487 121517
11965 121517 70329 55301 137363 218129 203447 354687 356535 325847 304818 170028 44813
11954 44813 122639 254907 255525 310278 175782 147845 177903 227167 348564 348806 218461 94095
11942 94095 99496 98247 239509 180380 109318 50834 120226 92392 188820 415398 546418
11931 546418 570493 464809 470101 543530 545439 577591 504659 651407 769201 834213 863712
11920 863712 705517 666529 600353 453152 301811 253213 171084 460548 660132 716715
11910 716715 717166 797227 777775 780723 899078 941644 817033 713421 782166 836360 753321
11899 753321 752115 719035 760442 893670 992312 960306 941961 1105344 1298465 1226722 1194959
11888 1194959 1280298 1458123 1539287 1628235 1848352 2057143 2256891 2404855 2561971 2585065
11878 2585065 2589294 2508550 2261760 2055349 1948514 2019430 2102879 2353638 2543906 2765312
11868 2765312 3089290 3563127 3856801 3913153 3941574 3842416 3485425 3134528 2907205 2627658
11858 2627658 2506129 2559229 2646695 2718532 2718751 2762067 2815110 2861415 3033338 3156055 3315305
11847 3315305 3549370 3650594 3812888 3796555 3598469 3316252 3209177 3168705 3154858 3259543
11837 3259543 3438034 3485880 3476986 3501999 3558511 3817622 4165452 4568838 4921577 5452330
11827 5452330 6126824 6792202 7524751 8390111 9397814 10168397 10656932 10941208 11354742
11818 11354742 11902968 12826586 14094557 15496007 16836252 17922727 18644608 19319891 20341088
11809 20341088 21804441 23856489 26094176 28024189 29761084 31679242 34241684 37885728
11801 37885728 42403229 47972979 55361567 64857109 76682324 90938014 107240662 124131173
11793 124131173 139521896 151068427 155522729 148231015 129023564 106793258 90004380
11786 90004380 80486210 76179029 74760646 74652768 74963344 75822997 77586687 80632433
11778 80632433 84799606 90296915 96434881 101056109 102150482 100484918 99074927 100142290
11770 100142290 103728787 108354551 113123912 118852658 126455387 134579100 140163269 141354354
11762 141354354 139798196 138325709 138537486 141851790 148894079 158838389 171669875 188355703
11754 188355703 209935502 237554491 270994089 309418016 350827205 387603595 403675677
11747 403675677 384057522 331503838 269974077 217109155 178115015 153645780 140077436
11740 140077436 132429722 127351942 124044310 123022392 123903214 126312250 129614266 131358480
11732 131358480 129300417 122451825 112985978 104952905 100295266 98529882 97688139 96883580
11724 96883580 96864757 97797440 98816975 98129525 94482101 88675704 83479294 81058551 81504307
11715 81504307 83935727 87590330 92164832 97502468 104090675 112638189 122947767 134956316
11707 134956316 148228488 159850049 163457952 152175727 127260094 99395353 75977648
11700 75977648 58668829 46721400 39072675 34407909 31345373 29397482 28116878 27103017
11692 27103017 26364672 25737418 25221489 24401205 23216204 21725225 20556151 19885302 19565453
11683 19565453 19240732 18636086 17515070 16088091 14900246 13957862 13410607 13086456 12849102
11674 12849102 12459052 11726888 10827718 9725532 8887007 8303359 7773216 7366193 7203208
11665 7203208 7015410 6881311 6931655 7005087 6953832 6886974 6934314 7106579 7220769 7370933
11655 7370933 7603769 7878214 8299957 8863032 9227492 9400813 9203264 8867682 8516050
11646 8516050 7926631 7518514 7232823 6981907 6677120 6478776 6265349 5970160 5952760 5985587
11636 5985587 6179059 6469084 6766110 6908491 6849852 6612741 6133990 5531400 4963910 4638811
11626 4638811 4370838 4068208 3696514 3490944 3405331 3407569 3412546 3450201 3549179 3453883 3328815
11615 3328815 3345019 3434491 3502099 3332680 3219095 3108688 3101935 3132446 3246517 3338540 3263356
11604 3263356 3180316 3016908 2726622 2401653 2195661 2080236 2059092 1946609 1842002 1492833
11594 1492833 1392230 1377551 1285012 1186107 1251521 1309376 1402222 1413593 1211340 1075180 1169853
11583 1169853 1250031 1213258 1208022 1279318 1318030 1303218 1228629 1199850 1202686 1093611 1078426
11572 1078426 1060473 1003186 887387 938362 1061189 1089567 942213 824872 881944 985583
11562 985583 980105 972287 1016087 894399 916751 870525 796974 929332 997490 975196 886392
11551 886392 871717 947379 1054982 1150853 1060850 1059527 1017825 923838 950318 977365 929997
11540 929997 830128 784974 958987 965014 922851 923677 894551 874990 857854 802097 704760 598563
11528 598563 694093 742712 838063 822086 807519 808140 822322 872551 752050 719639 818162 849753
11516 849753 793375 683235 623020 617289 690323 785467 681197 591582 562406 604307 729443
11505 729443 776362 576821 467484 471199 464327 602208 617198 512982 498782 535967 583155
11494 583155 534068 587721 529628 583941 631321 589624 620876 684862 613216 516708 461658
11483 461658 579997 643157 665137 590741 576686 536663 434258 612051 686818 768474 705290
11472 705290 579384 585759 519708 644925 563568 478632 619996 641627 636501 605143 721873
11461 721873 674705 692418 631978 587704 553483 553677 541333 633743 552410 462409 429979 449097
11449 449097 363985 305033 463133 525763 472168 461835 503365 536062 412636 450988 626176
11438 626176 662690 664590 651812 748430 655499 567075 603424 587836 511039 439912 456132 647136
11426 647136 628736 560415 435051 296358 264015 281177 316126 426533 514786 491473 487136
11415 487136 612530 716469 545090 539073 485356 511297 430505 426939 453804 589424 742788
11404 742788 692567 652371 420012 499217 670828 665981 661520 623634 650042 544187 455823
11393 455823 426008 408003 410131 370473 288719 405610 456712 353089 425840 576011 419560
11382 419560 453850 460169 406529 436586 443914 422575 427323 563959 587166 677374 637493 694309
11370 694309 669489 555866 579775 573258 515069 574027 551451 507443 500069 413563 337065 240691
11358 240691 246924 291230 270186 339705 395419 452522 349769 407148 580020 724607 708971
11347 708971 540489 555386 469565 591252 701581 694113 613145 556287 598021 659685 828790
11336 828790 1033053 1018922 962400 1006368 1051297 874427 701398 720104 716046 677172 781584
11325 781584 695008 675787 782953 727896 785891 865823 776516 756323 822300 681455 663126
11314 663126 688100 612551 741882 867287 862857 937297 1030352 956485 917266 1172792 1211775
11303 1211775 1154884 1108685 994983 853598 816173 746593 780223 1004245 1332580 1696663
11293 1696663 1863554 1944776 2120751 2346950 2497923 2369004 1911914 1590271 1258741 1020827
11283 1020827 776109 775587 771827 647360 619923 688604 651159 733309 848675 1048084 1089267
11272 1089267 993690 848560 786668 792643 761750 550340 495066 599824 669832 779432 936052
11261 936052 999246 938718 793564 648574 589449 502395 634880 689634 773525 748549 832601
11250 832601 1001728 1158284 1246992 1382452 1384203 1143124 970273 809889 572607 431745
11240 431745 468389 447861 360250 339182 363834 398146 300287 308254 284163 229150 398874
11229 398874 519792 471917 557830 451295 374759 245312 238929 281835 244066 127086 47886
11218 47886 -19928 23084 57078 61348 16588 97598 133192 100896 128999 249159 276569 374295
11206 374295 481876 450888 325881 313805 380325 340528 185232 214885 247344 251706 302977
11195 302977 334960 315373 227271 187608 158319 34012 -140107 -210832 -237543 -115842 -4638
11184 -4638 41819 47290 236209 345776 427596 494465 537093 411774 229993 105900 169612
11173 169612 282936 337742 144766 41768 36288 161661 365179 411585 307858 253249
11163 253249 210846 148696 132971 33628 70933 174353 127826 110467 108548 162965 305321
11152 305321 369802 405094 426287 343927 302299 243816 189904 84867 44282 24112 -46866
11141 -46866 -84707 -20032 7740 57089 -43896 -113456 -72524 -127041 -103931 26949 63356
11130 63356 47254 67796 233278 327679 159134 111067 116024 130718 35077 -89819 -126816
11119 -126816 -31517 50445 149330 96476 155522 143401 198608 267565 276875 277198 160234 68049
11107 68049 139751 148906 30737 -35372 -99462 -20061 38844 26565 85251 68472 110025 84509
11095 84509 106410 158304 218745 221471 231832 321271 220162 104051 121702 95810 90296 91807
11083 91807 150563 309555 395413 318678 262848 211629 138711 211255 187200 186539 278566 331675
11071 331675 121066 -30954 57019 181854 318579 386404 306126 200370 179685 -6350
11061 -6350 -110972 -33463 -30832 107311 110583 59444 144671 92839 162897 111752 126066 33406
11049 33406 11949 85297 113014 138955 258557 205161 66296 64900 108993 232173 208878
11038 208878 124800 109497 194211 214549 166113 212889 186822 147442 143944 179127 66013
11027 66013 63572 146921 240247 317215 269753 204085 132097 39888 84698 -60635 -152027 -93124
11015 -93124 60009 168257 80500 84735 206023 177425 118974 216491 303566 221955 43867
11004 43867 20619 40476 162543 424166 426662 354333 274896 271028 230991 171884 97793 121420
10992 121420 98380 -29869 32232 67238 17250 -54924 -164173 -159873 -127416 -93921 12406
10981 12406 9761 99828 136923 111084 112865 58433 -3515 -90231 -205377 -180928 -71324 59922
10969 59922 -3912 -56687 -19454 105594 210650 166046 89211 168803 118518 15789 -15570
10958 -15570 33811 120734 179864 198158 245991 88217 -134021 -196352 -56168 51932 238370
10947 238370 385158 384018 204282 122401 88513 27006 -27398 171235 217071 224383 243994
10936 243994 272927 329839 246777 68964 142253 146845 171239 271571 269713 210769 44617
10925 44617 -22870 -71014 -104050 -31003 73224 127687 115726 7559 -34128 -56264 79524
10914 79524 193594 279526 168964 130265 164232 60712 -37076 -40707 -15924 -71332 -162404
10903 -162404 -164407 28811 75302 20129 -6521 69838 56044 -96435 -44758 -26524 -27801
10892 -27801 -88973 -222862 -232261 -124171 -134994 -250357 -228734 -52653 68934 53204 123797
10881 123797 81276 119105 79071 -22715 62888 194639 285801 410313 295475 209836 205147
10870 205147 366427 274337 144240 155681 234512 136093 81593 21559 22230 37791 81023
10859 81023 95418 104182 116981 24636 -40774 -101597 -124318 -63692 7836 68132 135639 124003
10847 124003 145343 108450 -3866 -157810 -47494 89514 118780 204789 84388 45293
10837 45293 -710 -6728 -86465 -49399 45269 43952 -47648 11982 73803 76044 -28227 71517
10825 71517 40388 65730 26129 38850 84868 159720 210985 184917 174624 37706 -78896
10814 -78896 -19813 79377 206293 155821 69193 64825 27596 -46730 76368 155510 122838
10803 122838 155937 54465 -53666 -124868 -59601 -4755 -2865 10748 -86761 -112707 37186
10792 37186 -36487 -128082 -241563 -283668 -186042 -70189 -35219 -50508 47831 60714 102489
10781 102489 149154 130422 70489 -147772 -73644 -99863 -306906 -325427 -251086 -95167 5915
10770 5915 20891 -116440 -190714 -47383 27836 64774 -12004 -61523 -43752 -44931 -38869 -77674
10758 -77674 -50724 157155 225767 342642 354346 301961 89296 -84507 47046 -33310 -6900
10747 -6900 -59370 -97793 54216 204949 270058 292445 120403 -34083 1459 -46325 27858
10736 27858 30470 -76047 -103685 -98185 -168619 -251440 -147221 -99007 -131920 -89214 55571
10725 55571 32086 43877 -97953 -80230 -94439 -153171 -126551 -59689 38263 96967 -524
10714 -524 65586 87889 -54823 -127365 -16668 109222 21066 -28038 -55764 2934 135908
10703 135908 85216 -55494 -59266 -12871 7619 -106162 -197317 -307512 -228303 -208727 -174016
10692 -174016 -194567 -221368 -281655 -238576 -56321 116497 -39683 -254352 -222415 -89201
10682 -89201 -56445 -30957 -52962 -57989 38949 133149 191987 147085 104820 140568 97499 -96098
10670 -96098 -283816 -307575 -147665 37240 82020 64966 -133838 -232570 -205419 -58914 -102507
10659 -102507 -97012 -197 15933 13810 -8389 -127067 -188095 -319132 -295835 -141271 -125385
10648 -125385 -84864 29928 21772 60236 2128 -55447 43726 29537 -16758 -71578 -50843
10637 -50843 130594 241883 178162 126533 196417 144909 -17871 46624 60070 168999 115699
10626 115699 45713 86881 158501 202056 68951 -95294 -209403 -116409 104937 170256 153778
10615 153778 80363 -75085 7943 100179 81353 128318 126979 121208 97285 159216 141280 186021
10603 186021 73807 -2049 14766 8215 7234 12569 23068 80658 -25800 -93387 -112476 -60814
10591 -60814 71989 124720 120082 113793 13979 -128802 -110540 -20389 103389 12129 -143704
10580 -143704 -197364 -224981 -188128 -95954 -8559 -110463 -162454 -214491 -126659 -108591 -159957
10569 -159957 -111100 -166948 -192881 -156350 -32011 40045 -66283 -158300 -197022 -155038 -110224
10558 -110224 -118117 -204229 -16737 -31385 11405 -35389 -140731 -168942 -66490 -184251 -158063
10547 -158063 -196107 -220508 -253091 -204103 -181003 -122128 -57119 63945 176762 184853 41485
10536 41485 -88082 -94782 29705 -4667 -18019 -132231 -98580 -72707 -57139 69047 66990
10525 66990 -17933 128563 13560 -34407 -114557 -84849 -225697 -287919 -253769 -25274 38401
10514 38401 -18324 -75813 -49876 -84321 -30901 -21762 -99384 -182380 -233203 -104467 -130066 -234086
10502 -234086 -295805 -170750 -110408 -94612 -60984 -43123 66548 190579 282415 81892 -60612
10491 -60612 -138601 -77260 -88334 -79737 -93137 -233224 -330353 -326296 -183178 -102486 128699
10480 128699 111954 5858 -37098 -12450 45404 1953 1561 -82647 -87917 -55902 -75433 -75370
10468 -75370 -134865 -165115 -112019 -91267 105269 276652 209734 156424 101408 63574 73497
10457 73497 138429 264216 301547 217098 20661 -42672 -66395 -186508 -222304 -137811 -47683
10446 -47683 -102432 -99605 40739 152216 202727 175682 184848 71761 85928 143774 -1920
10435 -1920 -122056 -174120 -118487 -121104 -22144 -14315 -122122 -231850 -118370 -260024 -318564
10424 -318564 -282912 -235556 -53965 56869 101437 172669 127872 -7349 80265 89957 -22785
10413 -22785 -18926 27131 35239 167116 193943 45782 -64156 -119778 -314 24100 50892
10402 50892 -14629 67782 126714 9587 16713 6449 -46367 -124089 -180538 -147718 -188584 -302594
10390 -302594 -218725 -53086 -42865 -33609 86856 126356 76213 25380 -36691 -105572 -63809
10379 -63809 -10343 33910 19511 -185138 -263384 -142919 -66818 5681 36161 126211 93043
10368 93043 6311 5009 49310 -12699 12794 -10709 -181900 -259320 -14969 22184 -71828
10357 -71828 -312290 -344168 -208334 -169679 -85854 -21634 -27834 23125 146549 205099 149066
10346 149066 80198 61165 40092 -36013 -146487 -140958 -103523 17179 -49015 -56951 -59802 -48458
10334 -48458 -41712 33306 85806 -45159 -18893 117879 107432 32790 -118905 -114333 -21827
10323 -21827 66761 63964 86398 72810 -38918 -23713 4419 -93441 -224605 -156051 -52008
10312 -52008 -58790 -23954 -79418 -223646 -177342 -147863 -177361 -193478 -100246 48343 91369
10301 91369 2219 -161166 -149854 -153682 -147376 -141616 -122000 11505 106004 99851 -51749 -85710
10289 -85710 -185301 -64681 -22597 22211 58313 9210 9168 -64658 -163170 -130276 -84678 -105333
10277 -105333 -101226 -112612 -112785 16388 106173 75800 -43888 -179648 -198705 -95972 -175600
10266 -175600 -184276 -158654 -100639 -117322 -83870 -21983 -162387 -187334 -259056 -230942 -163391
10255 -163391 -195256 -195700 -274376 -253197 -184914 -75863 -38503 33607 21805 5478 -63853 -157470
10243 -157470 -210964 -210582 -92551 -18267 -41664 -23385 -59693 28625 32748 -47040 -120791 -145348
10231 -145348 -153763 -143124 -71918 -111252 -176908 -146262 -72378 -80513 -103659 -274812 -371784 -380338
10219 -380338 -389538 -270000 -133246 -176392 -112487 -22992 -141525 -57435 -33352 -81808 -176797
10208 -176797 -212837 -225284 -217455 -133525 -195996 -230911 -159399 -34448 125923 188216 46336
10197 46336 56486 52099 -20029 -113325 -157346 -98489 -111071 -117338 -111054 -213317 -215678 -173113
10185 -173113 -108176 -144566 -150283 -63548 140535 183458 115946 132603 116823 128737 128555 34037
10173 34037 -182083 -217591 -81503 16111 51800 -5879 -33310 -68295 -105168 -174863 -177182
10162 -177182 -99810 -16508 37735 -41753 -60930 -51162 83284 41271 45503 140113 190839 134884
10150 134884 37941 37994 -85938 -146043 -140108 -132496 -238303 -227558 -298051 -307634 -184014 -9243
10138 -9243 -5795 -46446 -128701 -248592 -306195 -277239 -284608 -167334 -139737 -127046 -65360 6709
10126 6709 85296 97550 33177 81826 135424 26997 -74886 -66067 -21902 -23251 31289 -159380
10114 -159380 -105116 -157864 -119405 -22122 27125 2404 -41347 -40832 -90479 -173245 -242269 -340153
10102 -340153 -384164 -282439 -196264 -182235 -300602 -285821 -241346 -231549 -213940 -258047 -269783
10091 -269783 -250789 -141336 -46444 -150928 -197271 -47547 -1376 -92346 -104414 -155015 -255357
10080 -255357 -42823 10915 117829 52350 -90597 -163819 -102367 -105062 -18644 105741 -6769
10069 -6769 -10509 67995 81864 3836 -33114 -96105 -40426 62460 -19445 -41089 80018 68821
10057 68821 -135097 -148344 -32537 -3300 -32603 177017 443567 616322 712256 802329 863925
10046 863925 1017576 989056 652814 141252 112209 166147 71356 182074 289099 262308
10036 262308 185507 70944 -34294 -192789 -239845 -259873 -284841 -173759 -107240 -9862 -48136
10025 -48136 -128033 -91973 -63583 -195970 -299418 -235292 -206364 -91241 -45306 -28934 -66664
10014 -66664 -264582 -362892 -413593 -415393 -302650 -345696 -362806 -218383 -101446 -8851 26147
10003 26147 -126343 -215744 -275806 -236028 -141323 -147644 -128172 -42654 19187 57484 43922 -39469
9991 -39469 17407 -47941 14526 76235 30067 37796 -46342 -116451 -101694 -61924 -133979 -247793
9979 -247793 -253633 -156380 -145052 -126757 -200229 -155519 -6771 -82873 -61006 -886 -33681 -37922
9967 -37922 -156856 -115636 47238 201946 222513 17185 -125394 -48745 -74451 -179924 -217216
9956 -217216 -80391 -77053 -221734 -225419 -225619 -245584 -192911 -164417 -176814 -159244 -123682 -152804
9944 -152804 -135540 -168027 -308908 -406027 -450008 -322328 -209885 -153351 -29073 -93872 -201550
9933 -201550 -245070 -225353 -123238 32533 46391 -19914 60848 71457 -31875 -57691 -102652
9922 -102652 -142398 -197686 -248017 -206734 -50179 -16050 -70965 -65935 -110453 -168480 -176822 -29446
9910 -29446 185296 241192 179859 256874 101156 12594 81158 119005 209860 176986 253780
9899 253780 264526 341625 443859 322242 120596 2580 -7719 95986 158378 134314 56090
9888 56090 21880 -35603 -34933 -149604 -199988 -134616 50123 66614 90594 -22136 -131861
9877 -131861 -178133 -142710 28868 12175 104077 191066 285338 400926 353525 281441 245262
9866 245262 246294 322491 353940 420627 528913 657134 632258 744460 872604 1050674 1109029
9855 1109029 1117265 1093139 1014604 959871 844125 630958 605742 488693 326171 317449 127058
9844 127058 107970 212666 17862 -61214 44482 91204 -17994 -60915 -101180 51689 115841
9833 115841 70637 -98287 -3538 162024 395893 431668 341412 349051 484953 516015 451853
9822 451853 441286 333039 426089 543840 740137 992377 1150428 1320542 1390029 1336546
9812 1336546 1345360 1360089 1240773 1052377 949855 784928 602051 545344 339872 383953
9802 383953 477781 352408 312566 278346 121890 100520 295501 363616 183454 196108 120952
9791 120952 154006 195677 197426 230419 112612 106483 250042 351713 412441 301593 164790
9780 164790 5209 -39296 149067 382209 430353 501064 552607 731507 878022 1080153
9770 1080153 1153050 1225735 1298926 1228521 1067135 858787 783793 762895 631192 538459 480247
9759 480247 262545 157342 13216 -53104 277 58853 119671 99454 -73203 -174858 -167229
9748 -167229 -128931 -90050 -126462 -63876 -30635 -118755 -191323 -233327 -329266 -391305 -398072 -287568
9736 -287568 -119346 -131010 -122079 -88647 -61222 -37414 16128 46781 62250 187064 289474
9725 289474 332909 241171 348674 334346 268850 163829 83701 -10211 -58348 -111038 -147572
9714 -147572 -166205 -134312 29569 143526 67399 -81555 -55241 -131652 -270869 -249642 -120193
9703 -120193 -61930 -48504 -72492 -10191 -43827 -84663 -199897 -37549 17352 -76735 -200137
9692 -200137 -247799 -308135 -378873 -322125 -241600 -163648 -121368 -57816 -139267 -16288 55804
9681 55804 13880 54378 59512 160171 114292 92825 -31385 -58489 -19248 -117796 -168744 -182987
9669 -182987 -138523 -78261 -142032 -179672 -197227 -150414 -71399 -31901 -8360 -11141 -61716 -73465
9657 -73465 -23658 96357 127934 82204 133314 77910 -42949 32127 -65354 -64400 17235 23271
9645 23271 24131 39545 26026 -79718 -169059 -203143 -96848 76515 92468 29198 100319 199438
9633 199438 166352 -32611 -110297 -72299 -79048 -49106 -13372 71906 3320 -27196 147826
9622 147826 160121 175849 189829 142912 101926 -40606 -326678 -318501 -220664 -135746 -116615
9611 -116615 -60588 -91086 -178312 -158301 -27369 95932 141442 -13669 -39939 17901 -101824
9600 -101824 -137312 -177551 -145500 -117106 -91713 -92722 -157149 -58024 -16668 -69394 -116703 -73495
9588 -73495 37343 127704 -15500 -98373 -44435 106013 133418 47607 -104416 -79737 -102009
9577 -102009 -210148 -176453 -106852 -37254 -142376 -270189 -391378 -224327 48059 54096 17134
9566 17134 -1791 54022 144707 90223 176189 275135 222924 288041 364340 299966 170374 112214
9554 112214 168248 214939 322244 519249 631522 514791 461543 508066 390318 285603
9544 285603 90681 -85741 -14542 178111 131795 82983 130586 132008 232434 206891 213647
9533 213647 340470 491300 490123 551678 757206 857382 908717 971072 1056894 971113 831308
9522 831308 926282 1160479 1465983 1724199 1806650 1885735 1996379 2006692 2208972 2664462
9512 2664462 2988867 3186373 3626693 3902468 4077143 4082685 4083453 4099412 4126301 4266150 4634542
9501 4634542 4992741 5168696 5139086 4988832 4798698 4603420 4400509 4200204 4132219 4096211
9491 4096211 4090761 4166981 4313250 4471059 4631276 5093411 5605961 6194852 7028297 7897294
9481 7897294 8921549 10005523 11283172 12648736 13624702 13858878 13594981 13105092 12312831
9472 12312831 11514286 10888714 10363394 9893691 9447414 9083734 8722055 8442273 7987548
9463 7987548 7739000 7759986 8096268 8485359 9112151 9906076 10990965 12302516 13915873
9454 13915873 15849639 17771539 19743265 21932700 24385016 27062527 30231716 34207463
9446 34207463 39106462 45033743 52359677 61336947 72599133 86311298 102248278 118468359
9438 118468359 133173053 146359735 156804546 158890104 146800299 124343315 101605899
9431 101605899 83508513 71139566 64017134 60922725 60809213 63256637 67742357 74149827
9423 74149827 82463839 92647392 104257950 115905775 126297764 134292046 140792747 145865582
9415 145865582 148401112 149108590 149789624 150357192 148985456 145516682 141182400 137005371
9407 137005371 132883779 128940920 126715920 127433628 130786329 136814887 147018091 162987937
9399 162987937 186202253 217358937 255169815 296571489 338938749 380047880 410239105
9392 410239105 408918321 363157588 291519665 224127400 173657650 140549643 120893952
9385 120893952 110426050 105660503 104832278 107112348 111574718 117252705 123072967 128639820
9377 128639820 134019991 138718953 142788689 146219955 147778479 146436990 142426061 137448144
9369 137448144 133163050 128075029 120261416 109953969 98297157 86218135 75578488
9362 75578488 68276305 64020426 62640157 63674373 66884721 72393147 80423250 90942256
9354 90942256 103415093 116867993 130352382 142578411 149921231 146559088 129840659
9347 129840659 105990737 84295505 66655746 52460639 41531400 33820788 28485704
9340 28485704 24804258 22087242 20103182 18609482 17185650 16045653 15155064 14350619
9332 14350619 13471738 12761212 12028169 11426460 10870788 10538634 10393398 10559163 10741434
9323 10741434 10953190 11138271 11459309 11666223 11858351 12031943 12117257 12300844 12788491 13288775
9313 13288775 13814869 14145213 14192576 13935984 13204128 12237180 11091521 9717013 8312105
9304 8312105 7223844 6501116 5918742 5538770 5323565 5205370 5205244 5163345 5145272 5179437
9294 5179437 5234429 5381334 5607791 5822885 5890472 6098689 6200799 6230958 6144967 6064682
9284 6064682 5865993 5589413 5250417 5078355 4959316 4809324 4615104 4486856 4349591 4047798
9274 4047798 3726208 3390020 3137624 2898207 2776074 2775427 2729505 2474851 2293749 2323790
9264 2323790 2308311 2267895 2286428 2151334 1991110 1896629 1938733 1868033 1898498 1973286 1960017
9253 1960017 1934773 1887504 1734539 1742154 1765820 1810041 1648976 1565823 1478363 1446649 1471725
9242 1471725 1359738 1204961 1150235 1304243 1420483 1303592 1243592 1415521 1403232 1204651
9232 1204651 1042682 1203247 1270017 1068846 1005157 1037835 1008157 1102050 1099221 1084340 1178249
9221 1178249 1286748 1219725 1220156 1274756 1332073 1343783 1205701 1191275 1103644 1077744 1023268
9210 1023268 914657 896904 937092 991649 1210450 1269753 1144334 1172527 1233629 1182009 928505
9199 928505 768848 836337 976100 978153 918181 837796 791092 783747 819351 846201 882270 800729
9187 800729 756400 723036 653441 532278 676235 934302 1002284 964506 889525 898849 798368
9176 798368 617369 644283 689104 665593 716285 831727 822109 742023 846789 803222 747846
9165 747846 806474 718212 621383 512124 562122 771053 891630 994812 1073723 982561 812398
9154 812398 759488 787953 864982 849977 812919 742109 731014 711103 866787 880937 833892
9143 833892 916880 1057373 1092612 1086244 1091863 1235817 1464838 1670604 1792525 2067734 2324593
9132 2324593 2518147 2822656 3093448 3517025 4255646 4910431 5416680 6115843 6823778 7883932
9122 7883932 9245538 10671597 12461885 14957192 18286818 22605857 27631197 32802034
9114 32802034 38148524 44905238 52056496 53746130 44216978 29986477 19738561 13780079
9106 13780079 10315772 7983549 6335712 5115991 4308465 3764874 3352755 2908024 2471799
9097 2471799 2281469 2116500 1899806 1730635 1725814 1663731 1649649 1528654 1524529 1611688 1622524
9086 1622524 1570940 1530704 1425106 1412942 1282220 1151265 1069525 1096037 1187446 1202172 1077857
9075 1077857 840948 832405 970846 852406 877409 865660 917019 976236 1009642 1007938 1022581
9064 1022581 1015852 1011092 1134427 1081873 1073884 1165335 1259433 1339941 1251427 1074556 1038411 1114422
9052 1114422 1126234 1154026 1073203 1029142 915134 854358 807349 872584 891177 848111 900571
9041 900571 817445 630348 591280 647936 799234 796409 757474 703954 650717 681183 730266
9030 730266 728971 662012 839031 858422 861757 797666 867583 911458 894625 821353 812176 982657
9018 982657 1205905 1432578 1441030 1508901 1584411 1717541 1888300 1817253 1667940 1610003 1571339
9007 1571339 1509022 1236804 845682 656794 771823 773808 618978 496309 390745 491621
8997 491621 543241 518740 531142 532680 434902 541776 639181 652461 815504 834897 751498
8986 751498 598954 541180 706088 717764 749991 873954 913391 991668 1086697 1060351 1183515
8975 1183515 1341982 1398063 1624674 1891443 2011170 2177180 2315320 2350320 2240075 2058728
8965 2058728 1978911 1766638 1533491 1363483 1070398 958654 909177 939258 895622 756035
8955 756035 544551 515273 388180 279734 352537 455322 523669 538755 587771 474471 310090
8944 310090 183821 120668 209346 274243 497239 527413 653517 615886 573238 631357 755533
8933 755533 850547 884945 938799 1022102 1094312 1223546 1220184 1211306 1165597 1193329 1201772 1253324
8921 1253324 1336204 1210664 1165174 1045158 810641 712350 608137 487963 500344 477448
8911 477448 318861 436335 488899 470804 314526 292212 331012 398933 570656 652251 524222
8900 524222 511138 496273 433605 432559 452268 394737 443886 455560 444858 562305 614455 470214
8888 470214 316607 460791 694233 626736 504201 495325 566997 617682 671616 513301 366546
8877 366546 440340 465834 399381 440057 408123 331189 321571 429378 470891 380678 490808
8866 490808 511161 547852 426399 161366 107136 178032 257107 326765 422011 398430 375207
8855 375207 334384 303898 321212 347128 390255 503640 561739 409467 199649 263648 249854
8844 249854 311992 325907 443527 297905 173457 57289 -9663 152884 228013 193563 133625
8833 133625 382321 396825 450554 327935 288346 327827 222453 195172 255766 161644 94803
8822 94803 59315 116665 205436 268065 307101 336739 261334 201670 161370 156324 141965 306457
8810 306457 406902 405723 317410 238585 418998 484091 410036 336296 390696 336362 340573 265614
8798 265614 239748 274609 241535 209078 226766 315670 190949 170581 265445 280415 194346
8787 194346 133071 263682 276944 258271 380959 337195 293309 140797 120428 193536 251723
8776 251723 238914 172609 251081 257198 335265 357643 317333 308751 261415 199822 273070 286215
8764 286215 139224 48045 27180 80338 84606 49949 129015 213845 251307 162595 175076 233035
8752 233035 178340 138340 151833 249313 143324 15011 1203 -136219 -199759 -61529 103318
8741 103318 186915 161247 286085 311543 335895 305916 339442 202894 175377 200541 122765
8730 122765 -23246 16754 126783 147086 221562 325047 404430 399290 468809 376114 61189
8719 61189 9566 197133 138261 57537 -24042 46255 169465 223030 84928 125317 176544
8708 176544 133517 29541 132458 189025 28413 140959 266066 394530 383176 292654
8698 292654 164965 26190 -51862 -7826 70433 177533 234493 168525 210467 234411 154630
8687 154630 169286 127371 143424 179621 165994 6162 34600 112458 170540 228561 105154
8676 105154 88 10683 -7461 -40847 -124861 -77069 -40223 99820 175973 163575 240712
8665 240712 314510 291852 147800 103732 121325 71645 -51055 -46346 51515 188010 263575
8654 263575 247668 286788 135348 -15387 16869 21169 57168 183583 215993 146251 135121
8643 135121 233021 221776 266719 146759 201580 196386 166488 258677 200984 299854 308370 303738
8631 303738 276491 188627 221135 269254 354586 519680 660917 839406 940005 1118728 1168369
8620 1168369 1498891 1801596 1987588 1974989 1684573 1085483 738795 613239 551230 607926
8610 607926 515100 462341 407823 506099 415406 345956 185543 331069 489025 511716 480007
8599 480007 587427 685448 604673 455933 574234 783616 849611 819947 736912 543455 514199
8588 514199 547640 512154 617946 784794 829397 856207 1029060 1176161 1285503 1371320 1812717
8577 1812717 2342327 2644278 2964635 3553994 3986144 3901465 2831762 1742869 1231115
8568 1231115 969064 870031 957193 1051743 1219771 1308479 1310260 1246522 1134110 900063 710663
8557 710663 641689 578994 497587 443915 458413 380710 408064 455766 368206 443998 510120 375765
8545 375765 365054 459362 472516 503481 451235 548657 583824 554949 520013 653810 897914
8534 897914 1154481 1250880 1354393 1610165 1829392 2151798 2206840 1954406 1343262 842134
8524 842134 644578 538970 517903 386021 342961 453534 372287 229329 260594 300648 137295
8513 137295 70649 56073 74692 -23425 97580 266271 346517 367329 390431 316817 253987
8502 253987 163816 194128 184722 193012 225728 210514 206944 94230 129151 158857 146835 140439
8490 140439 146638 144951 31300 -3041 39714 82064 130524 216793 196570 195725 205706 4437
8478 4437 -85904 163058 229446 117148 174098 178202 112064 101442 58114 42806 212773 321395
8466 321395 236228 171829 297195 323668 208044 66076 103414 123534 81168 44039 -52008
8455 -52008 -153802 -207167 -215636 -183573 -205099 -92202 -104435 27465 28647 -15605 376 41255
8443 41255 162440 172510 91661 76991 17595 37817 51016 133222 165382 137300 30335
8432 30335 -19074 25624 -82583 -120680 -24624 2367 -3179 49983 140592 41933 -93968 84439
8420 84439 130809 130717 143391 42769 -84887 -84024 113855 182286 124245 42486 133733 126628
8408 126628 122766 121630 88014 43448 71838 104804 86243 35852 -23244 -55687 -82164 -105019
8396 -105019 -83442 -11263 12143 45678 159128 157753 71179 83117 48631 24951 -68146 -47945
8384 -47945 -10059 -44406 14487 95745 113660 125023 -49755 -110094 -15912 235 -86232 44823
8372 44823 124251 -70119 -79789 64673 119228 -10312 60599 24489 -21340 71469 88779
8361 88779 -36089 -25394 -13086 73650 186077 98902 51523 19785 -18318 -53390 -18271
8350 -18271 68255 54977 239345 381893 358426 356418 381550 274111 156001 -32086 18865
8339 18865 86078 35552 -22699 -76795 -87595 -110122 -127392 -115205 -90681 -100442 -39156 97921
8327 97921 228346 222448 124315 -12780 -151048 -269041 -184972 -39623 25743 115818 216929
8316 216929 245551 184290 150767 116629 228047 274057 241434 200607 46129 17730 14200
8305 14200 -67628 2708 36010 109273 133000 110433 1161 -46408 -50188 -94360 97685 350832
8293 350832 306463 203681 158271 132783 239359 333609 291660 196092 213006 192280 48485
8282 48485 -153119 -57402 -126309 -48195 93167 30846 32699 140353 122174 32278 18485
8271 18485 -181123 -228019 -2811 35482 10716 -24708 -17159 132448 73611 113866 -17428
8260 -17428 -21906 23211 -20296 39439 59319 110354 116535 118954 41419 -55329 -119393 -113916 -90499
8247 -90499 -90484 -56135 73627 32604 39773 69003 -83833 -83032 66579 79534 32260 79592
8235 79592 80194 155206 270136 272426 170734 292079 247419 56292 124835 358666 404520
8224 404520 286394 225111 249407 117940 165756 20669 63134 125657 117462 13245 -82903
8213 -82903 37395 187821 160897 68229 76079 -15056 -107569 -130284 -180454 -210246 -132880 13567
8201 13567 86107 139899 218963 190846 83912 95412 179810 181496 25365 -46501 -17478 42462
8189 42462 154063 289024 220812 106449 148624 251736 121855 95463 41243 -19494 -7813
8178 -7813 26008 100915 122815 103120 25828 -9012 22449 186630 187813 213627 265610 223626
8166 223626 156195 65961 85598 141263 5587 -164986 -177194 -142008 56431 56688 -2568
8155 -2568 -14856 -115533 -64270 153474 147307 -50424 -103791 -34413 -7626 62138 129879 147556
8143 147556 51331 -57335 70202 127286 167111 81220 -22922 -37307 -25027 1249 42660
8132 42660 -33994 2378 107646 104011 147668 112386 -1016 -27286 30418 15363 -16502 26644
8120 26644 139885 107665 197430 136974 54283 116100 96332 89253 238998 330601 317401 220651
8108 220651 90687 90543 113453 72681 73473 155637 118237 92745 -21321 36060 197582 198398
8096 198398 220162 431127 481256 553337 470653 257954 72070 69045 97923 216831 199246
8085 199246 148975 -35486 -68508 -17627 72436 57694 83168 48769 164304 251730 148418
8074 148418 157432 3311 -107591 -110924 -64083 45928 -17436 -79082 -56903 -11602 99201
8063 99201 83326 19735 119713 313682 191435 115605 26587 -38000 89361 178224 187313
8052 187313 189488 150309 -19650 16067 -48368 -150491 -134139 -27599 105055 20962 -71527
8041 -71527 17416 57742 121201 133756 224940 186861 130108 115799 168440 152958 1714 -44957
8029 -44957 -65363 -92646 3253 237967 190426 151131 118147 74062 67651 -49578 27422 -84867
8017 -84867 -122054 -93570 -253 155084 163159 113359 90636 158335 31951 28693 -93339 -14007
8005 -14007 82701 5316 42179 42625 75242 138380 215011 239291 180657 198217 236045 300938
7993 300938 98037 -106460 -24637 56154 11706 -113514 -126726 -187582 18482 153650 161044
7982 161044 176772 191227 202582 75852 34043 122029 161107 108956 50415 -16849 -48231
7971 -48231 74979 148220 321790 318687 448961 385310 216653 94893 -18136 -127508 -38915
7960 -38915 80344 146622 76347 26458 -59046 -36022 -2437 44925 -32350 -24418 74801 38279
7948 38279 77178 70950 231066 209740 288951 299527 173612 151850 218397 271619 258090 314066
7936 314066 355910 270317 195814 164511 156460 19220 8935 69933 -4220 -26216 17982 -36863
7924 -36863 -10768 61306 167594 198908 273219 291214 154578 164543 155003 152880 125580 121840
7912 121840 58225 73671 100301 -49449 -69081 73108 159300 100918 150832 155161 202708
7901 202708 111764 172243 286306 236151 106084 58006 201225 297067 145794 80628 226631
7890 226631 231314 268792 334573 210641 -12164 44118 244931 248396 130705 165553 139876
7879 139876 38025 4926 52397 115407 148977 338981 274697 75016 76226 124130 59453
7868 59453 64807 109963 72464 91795 119615 237812 205609 161745 55418 47401 40651 -23095
7856 -23095 -16175 -51987 -69061 -47965 85984 195696 42182 4864 135356 150533 132242
7845 132242 167190 330486 378083 289316 233388 357465 408755 370734 258913 128901 -13134
7834 -13134 -114276 -185988 -24163 -68347 -60324 -52469 -178176 -109160 -29140 -10166 40940 199087
7822 199087 157444 -3100 16027 10789 107438 260296 255994 194669 153617 -51023 -44071 59063
7810 59063 137891 240274 -40528 -226985 -150613 -154375 -136055 -195068 -139879 -94217 56551
7799 56551 71996 -139470 -307465 -121085 -75226 -25000 146372 125319 101071 -21242 -184166
7788 -184166 -163600 -124941 -88624 -31386 255049 286071 123237 127864 98105 56895 27911
7777 27911 -54093 -27242 12226 43823 1624 33751 101068 155258 238443 186376 151439 135272
7765 135272 243376 293714 258165 130122 40864 69557 35347 18615 13625 -6244 -14397 36534
7753 36534 81778 86690 223625 237209 98519 77063 81385 12607 -19583 -31765 -126136 -348748
7741 -348748 -201462 56321 222026 238100 154637 153366 140633 88179 -66 -39924 -154930
7730 -154930 -78043 75583 71539 73326 -66789 -131451 -72634 -88365 -74023 83354 76780 -63111
7718 -63111 -219886 -236433 -154705 -143696 -2166 35294 82564 -22529 -125250 -195013 -90440
7707 -90440 -99878 -140876 -47893 -8360 -11510 -87778 -14204 73304 37200 120354 110061 63392
7695 63392 41728 197308 210400 196438 180064 394 -93192 -15478 -33457 -114351 -85601
7684 -85601 -51650 -28123 -23788 -14174 1930 81108 -49121 -116976 -104971 -10976 13751 -51445
7672 -51445 9199 113963 151635 160120 68667 -70384 -51365 -15883 -4510 -8902 75606 19705
7660 19705 25869 51570 41791 106787 168764 156291 143777 16389 103621 193358 72298 10902
7648 10902 -24318 -17472 -26157 5897 142020 185723 169789 92750 218239 104937 78264 99797
7636 99797 19589 -80788 71344 116534 5187 -130454 -137290 34660 209758 207915 101479
7625 101479 3388 85410 348681 252870 155496 170302 64046 120620 179028 195979 148187
7614 148187 276812 253194 180250 50652 -124564 -29966 112900 89018 102652 42717 -16509
7603 -16509 109720 280618 310138 344761 227334 148360 64072 -83064 -192695 -36474 10812
7592 10812 28916 2146 17857 -16107 -76568 -226878 -320645 -158608 -123433 -105432 -70449
7581 -70449 28632 86223 3842 -114258 -150138 -18724 51943 125067 129085 124173 182152 254968
7569 254968 264847 260120 174676 11189 -45527 28761 106008 69804 -56867 -135307 -140234 -190249
7557 -190249 -248142 -202849 -177885 -9267 41297 -104482 -230658 -202751 -80561 -169816 -170559
7546 -170559 -26730 -32369 -141622 -131968 -23422 95416 -33 189060 200965 100340 61616
7535 61616 -64281 36765 -8388 -43961 -110292 -269727 -81749 82685 3852 -24717 9801
7524 9801 -24454 5147 35382 -2451 -63417 -63018 -179277 -254657 -91276 -31818 98605 193832
7512 193832 59710 129359 201684 42101 131195 161364 162769 189823 192646 106048 -13446
7501 -13446 -10969 -66124 -50506 -56637 38801 170390 147771 -13488 -84716 695 6964 -129268
7489 -129268 -167751 -23424 86237 203981 204964 319226 342986 332948 279156 213164 154081
7478 154081 82143 -44905 42514 -48655 -68569 -92719 -96110 -23017 43945 17813 30323 171480
7466 171480 226511 166390 263073 174770 88618 2493 -54602 -32883 61189 63981 98533 171144
7454 171144 2418 -126275 -98994 -113458 -170149 -115865 -10046 -75472 -110124 -150692 -60781
7443 -60781 -60184 -20010 57349 117621 126194 161014 58933 -15473 -59241 138393 190417 106583
7431 106583 113481 81590 212903 244766 127663 63801 -86201 -61870 68167 148995 32589
7420 32589 -119189 -152551 -94417 -81937 -128479 -163653 -142339 -79670 -78051 -89946 -150264 -236113
7408 -236113 -267471 -126126 -163109 -144966 19107 74040 204998 288966 287588 103886 20159
7397 20159 -9716 -108685 -124539 -117771 -187835 -207381 -286069 -398920 -348078 -152753 -27678
7386 -27678 145739 58880 36338 147033 170437 4386 7387 16655 -629 -118494 -96547
7375 -96547 48483 209953 261057 279353 142957 75671 98682 102887 67442 28402 27619 25383
7363 25383 102682 100008 103087 362477 338465 75164 -152441 -264394 -354246 -278547 -195618
7352 -195618 -133422 -79437 -112597 -58435 43301 78203 191262 222457 221467 173491 75019 145013
7340 145013 132360 178724 252187 174804 223445 147451 121468 134204 144555 86640 43687 21358
7328 21358 23372 -24319 1255 35217 109333 44330 17483 16323 74829 -34017 118935 144246
7316 144246 61481 -84696 -86183 -31765 -4221 -53332 -24526 -45892 -113247 -3510 22684
7305 22684 -12284 44466 -14845 -36210 70394 257094 248596 66234 13426 43855 24373
7294 24373 -69382 -81193 72115 115411 -73713 -188849 -167628 -69424 -77797 -10808 -82350
7283 -82350 -169875 -25551 22326 2754 -10464 -20415 -36744 29416 -51892 -118709 -146415 -151347
7271 -151347 42936 215571 197259 218753 142974 117627 12539 -107808 -15114 33194 91677
7260 91677 146431 80733 9417 -66783 -148578 -264770 -101468 -94371 -99209 -53339 59496 154756
7248 154756 220830 231973 95994 -58022 -120805 -138190 -124818 -46912 94777 -21801 23705
7237 23705 109423 152448 117252 59496 50995 76334 26068 -68956 -149918 -326041 -493103 -299954
7225 -299954 -137988 -49207 -45167 -147906 -50906 93163 75122 -81484 -226531 -282930 -122977
7214 -122977 147245 348570 162331 42226 132704 90513 -35554 -158812 -25850 103828
7204 103828 134633 40077 -140048 -174297 -119463 -8553 -59409 -11511 6794 111821 77295
7193 77295 90008 180110 188630 186306 89130 28620 80224 60531 38944 116880 -74077 -157032
7181 -157032 -168270 -104021 -15261 189811 298314 288584 227409 63642 -50664 -71634 78935
7170 78935 98880 59194 127911 113572 76053 49060 -71381 -70182 -88337 -114752 -107011 -125010
7158 -125010 -33083 25492 129087 199050 184890 158382 174730 137381 -84269 -232270 -276542
7147 -276542 -152973 -4605 -10410 -146945 -142760 -67855 46470 115971 66905 -25777 78292
7136 78292 66974 -36260 -92245 12350 101267 135939 -51469 -138001 -185413 -287151 -387075
7125 -387075 -255095 -65135 28144 54928 82067 73555 60108 -60656 -22904 -21357 -36280
7114 -36280 -49236 -63342 -82257 -49240 15975 174357 289553 306054 220696 16735 -279068
7103 -279068 -358911 -135399 -81884 -4526 -85105 -145919 -242981 -253372 -248089 -228715 -191126 -125239
7091 -125239 -108881 -215312 -145754 -18385 -262 50440 208180 145147 -122546 -123254 120212
7080 120212 242727 267031 76176 17273 43328 24920 -70542 -18300 116430 93119 87312
7069 87312 133979 104816 28419 -4840 -327 -53948 31851 167083 82670 101200 211382 87928
7057 87928 141253 203867 128218 56111 18424 8997 108829 -6636 -3853 54165 6828 -86994
7045 -86994 -110406 -157022 -168108 13348 189436 180422 148161 236677 140905 15202 135187
7034 135187 187712 144155 24564 -79738 -18463 -74422 -89091 -75806 -23168 19719 163641
7023 163641 162385 -2047 -160256 -12644 -248 -65940 70846 127466 102533 -30338 26683
7012 26683 213460 226213 194026 203846 23481 -205683 -253575 -286863 -250451 -196725 -154124
7001 -154124 -79936 55409 -22274 -54050 -82127 -144392 -87406 35275 -4819 -98573 -127332
6990 -127332 -214371 -162426 -113460 -9594 39752 27404 12315 196188 225822 75547 -53280
6979 -53280 -219926 -195576 18788 127801 81550 29438 -77357 -180946 -171205 -4004 166498
6968 166498 82925 5840 -56410 611 -22988 -31415 -75993 -30451 -48807 -174283 -244129 -227639
6956 -227639 -285090 -234954 -193756 -217177 -95283 116593 122410 109011 -36079 25351 -33576
6945 -33576 -124008 -159035 -153238 34157 36980 5658 434 65597 85590 57532 -7481 96407
6933 96407 173088 208046 216720 216539 207674 191332 104718 36463 114468 91379 60563 -79575
6921 -79575 -156706 -77456 43853 -23605 -110790 -179717 -122410 -136950 -267792 -328659 -357941
6910 -357941 -231490 -34749 107434 123257 59006 120718 170988 170885 217467 222053 317500 366940
6898 366940 346891 260513 155666 161301 142127 80948 68937 80547 2937 -76215 16676 35308
6886 35308 62896 146977 138246 65948 148153 266750 292862 122053 -46012 -17901 6762
6875 6762 -56126 -61882 39910 49755 -74748 -169602 -100789 -24994 -52720 -56169 -5847 113753
6863 113753 10461 6619 -17442 -63332 -163618 -201554 -107735 -67301 -86753 -56680 -33238
6852 -33238 45621 8968 -79616 -13222 -17998 -64414 -154912 -21505 -31584 -105691 -105078 -17731
6840 -17731 68894 123927 146725 156390 147881 115373 148286 -23796 -66202 -70134 -3657 -68830
6828 -68830 -100548 -117498 -87408 2267 65116 89381 112633 135022 52010 21155 -55077 -69698
6816 -69698 -141352 -269174 -309649 -177171 -183006 -159340 -182790 -303344 -279004 -62746 -8918
6805 -8918 -31554 -13268 131155 151513 27465 -40984 55504 159236 270687 37953 -62946
6794 -62946 -73203 10549 83151 36754 -15791 -117324 -149411 -19247 53514 58222 43683 228786
6782 228786 280265 197429 103837 18537 -37148 -74810 -86278 -49524 -73590 -15525 -42635 -37234
6770 -37234 6720 74993 51185 213964 322169 342571 360896 235490 219833 144434 -6082
6759 -6082 -18696 94402 229730 341139 242621 249489 97546 -30411 -25010 -115253 -111583 1395
6747 1395 32230 167335 288945 121246 -37700 -17125 111205 55814 69818 118930 26185
6736 26185 62084 77520 141082 148010 143130 70929 1531 2747 -10948 -48543 11562 127670
6724 127670 -61555 -169556 -156736 -101326 -170306 -192037 -114025 -225209 -148217 66090 -683
6713 -683 -62023 3443 100860 178907 174870 17242 98841 110984 43275 29370 -78153 -140683
6701 -140683 -195572 -75580 -137566 -97687 -107460 -35287 -42856 -88525 -91158 -93791 -28061 -61559
6689 -61559 -157464 -111641 -122645 -165266 -318571 -308386 -259997 -134574 -26405 -92478 -145018
6678 -145018 -225202 -129043 40844 -156893 -224011 -182229 -114080 -101406 -84715 -31770 -2006
6667 -2006 -28642 -7848 109209 268461 306303 260658 229195 269440 171666 106273 125385 21617
6655 21617 12376 254178 163559 37411 -86662 -118209 -40168 -12263 10394 37610 -24239
6644 -24239 47603 77014 89844 66671 102117 -25341 -143016 -148513 -270226 -298358 -153283
6633 -153283 -13160 -52626 -72782 -72796 -159351 -165263 -216680 -235102 -5901 86336 87256 15671
6621 15671 -52658 -164965 -249452 -145820 -148818 -55714 -48809 -111699 -156703 -73214 95538 166183
6609 166183 64116 44561 143987 42159 -98202 -11927 -6445 -80457 -89256 -22386 9396
6598 9396 -29839 -71314 2269 12520 -149299 -150799 4383 564 10244 59939 39021 -30837
6586 -30837 39506 97930 131142 25558 21644 82125 11335 -31861 -15765 -89241 -173537 -20644
6574 -20644 82176 36241 18088 234243 305695 180867 6046 -19010 88095 130213 7405
6563 7405 -21974 58727 184255 118035 129315 137151 116430 -36229 48130 178332 190469 89909
6551 89909 38520 46898 115588 123237 138425 115241 -38534 -123158 -48432 77072 178977 170887
6539 170887 158359 177890 40930 -74918 21366 33733 28376 84731 126423 112163 -21593
6528 -21593 -56161 -66194 -5645 57333 -61608 -111694 -84101 -29974 -169688 -257267 -187529
6517 -187529 -40016 66821 -7084 -151120 -108568 14952 8797 -82076 -151295 -96632 38803
6506 38803 21338 68032 38460 30328 21517 -3460 -104192 -150333 -76467 106244 202883 190432
6494 190432 114089 20351 -13054 -82763 -76658 -86524 -42028 -60098 -136436 -234224 -158200 -84940
6482 -84940 -85949 -169345 -80978 -17827 -36278 -85873 -78438 -33890 -121188 -69355 -200062 -373095
6470 -373095 -218312 -73970 -46912 20400 -110959 -206875 -258952 -152641 -105178 -161955 -127625
6459 -127625 -37179 -63839 -57050 -2276 -65777 -162799 -128810 -78998 -43297 -15652 -97469 -124958
6447 -124958 -109620 -200905 -239467 -173654 -178876 -139171 -142032 -272166 -279625 -148324 -136232 -87903
6435 -87903 -125189 -28800 -15191 -32684 35005 50143 80765 32591 -25247 -158167 -69388 23348
6423 23348 -49170 39647 22670 66223 103982 38508 50788 115235 174887 134993 51136 -72009
6411 -72009 -136766 -261548 -194502 -58969 4292 37271 -48301 13417 97329 74508 9701
6400 9701 -15200 -49777 -103993 14120 109026 12164 43482 103406 97836 -44669 -227224 -184680
6388 -184680 -166290 -96044 -23441 100546 98178 136647 302958 257751 197711 81006 77849
6377 77849 -20517 -138518 -141135 -78250 -20058 22388 46034 -10829 -95995 28854 32341 -33800
6365 -33800 -192891 -125902 -61686 20174 70894 -48204 -44576 -121476 -160029 -138139 -110033 -73815
6353 -73815 86711 193445 133987 157774 219879 226716 135987 42447 -10617 42657 -27908 -147990
6341 -147990 -118729 -19672 -148138 -192162 -188600 -114363 -143281 -157543 -58886 14139 40196 43736
6329 43736 58871 -43711 58770 143677 181647 144427 32450 -30392 138748 130464 87353
6318 87353 167968 133157 58047 -93867 -152866 -197349 -155836 -87754 -138391 -39885 46591 -5737
6306 -5737 -5168 -25998 94104 19778 -78405 -188038 -139693 -16381 41073 -20041 -105054 -155176
6294 -155176 -60680 -71461 -160397 -142760 -34405 131943 104126 153674 -2756 -102196 -134883
6283 -134883 -123888 -138517 -111106 -141516 -75718 36474 138094 24883 -51008 -25076 78119
6272 78119 129093 93818 141345 91402 8239 -9608 -79632 -52753 61061 199884 205139 162096
6260 162096 49943 112399 228478 261061 208888 256 -67575 -60265 -81477 -160520 -184055
6249 -184055 -15662 102309 94860 76248 109844 208569 356798 300865 151671 117451 -175653
6238 -175653 -169811 20723 -24379 -51143 -50353 18243 -50435 -62044 -19550 59587 145686 169072
6226 169072 106202 86818 4907 27327 -42181 -43657 -5166 -19300 32487 134417 80189 -29151
6214 -29151 23852 18102 -55025 -132306 -66790 62753 40023 -76663 -118187 -196987 -144665 -205740
6202 -205740 -214826 -286204 -217998 -144628 -69136 -194249 -498393 -493713 -253693 -220883 -104711
6191 -104711 -122743 -102784 -202875 -185779 -191768 -938 25255 40623 84958 120495 93515
6180 93515 25339 -13814 76960 99755 -5675 14173 -21957 -14671 61303 30329 50928 60673
6168 60673 175623 87575 110950 107661 37576 15445 121047 23180 -18148 101634 229358
6157 229358 150085 100155 61714 17859 102771 107346 102253 28333 14554 84376 130223 200511
6145 200511 145538 -10032 -36938 -113808 -135827 -326329 -213949 -187735 -177644 -48936 100762
6134 100762 39595 -39313 1613 109185 -63327 -144811 -60041 -68594 -106265 -51746 31629
6123 31629 -83937 -115093 -6328 62117 28923 3943 -133337 -209772 -256223 -209774 -160403
6112 -160403 -157353 -108661 -36859 144925 205782 149254 82557 41594 -8813 -89963 -148499 -170052
6100 -170052 -98329 38919 16185 -119150 -137683 -77126 9093 91155 157184 129950 -19718
6089 -19718 69424 97368 97786 106722 -51525 -184314 -232107 -146640 -120873 -153264 -236728 -108981
6077 -108981 6033 -98105 -125067 -40649 -11813 33482 150598 146150 186446 283541 195233
6066 195233 116037 82057 82663 63064 -77105 -151681 -87253 16268 70452 6147 14669 -75406
6054 -75406 -100713 -3766 -44690 -249551 -277838 -203714 -159186 -125327 -7113 -2379 -159168
6043 -159168 -124990 -23955 -82727 -60199 -138265 -210298 -77060 -380 -146995 -71028 66364
6032 66364 32155 -60532 -38024 -53878 -79425 -42387 -12125 75600 125796 201425 125775 48279
6020 48279 77090 26445 -75015 14035 181718 173509 67486 -45953 -52763 -205556 -259813
6009 -259813 -346960 -338075 -117266 9862 97972 -21284 30125 82222 148096 180818 230827
5998 230827 247743 181122 -7909 -104457 -169561 -122039 76987 -21245 -104148 -78180 384
5987 384 -46749 -183314 -300268 -147871 9237 86310 148861 175283 152813 70560 82310
5976 82310 88943 24409 -47662 7270 46037 -41917 -118764 -112356 -56224 16456 -59131 -295641
5964 -295641 -210049 -73591 -51036 8629 143504 203381 220617 212985 213942 237765 168048 213610
5952 213610 258862 150230 -25042 -93062 27432 108303 79715 22627 -21852 -2734 -62339
5941 -62339 -128165 -70456 -3254 1878 30285 -67761 -188973 -3487 74411 27014 90665 -16101
5929 -16101 -164333 -187000 -113901 -139807 -143904 -20356 9131 -41442 -62685 -42131 62450
5918 62450 126420 22821 -159029 -249517 -92640 44249 19572 147729 105741 -107916 -163535
5907 -163535 -44591 66367 111103 31145 -61535 -54937 -129245 -173589 -178538 -95230 -76630 -132961
5895 -132961 -85087 -117424 -112887 -81064 2122 -43200 -245657 -296487 -141141 -80610 -144999
5884 -144999 -94782 -41269 -22785 121236 94410 -54392 -162346 -145118 49413 45806 98075
5873 98075 150156 168483 74843 76826 112992 82848 4419 4501 67235 115546 36740 -110415
5861 -110415 -65267 3627 -47447 -136102 -133009 -81881 -48400 53444 103445 -38884 -107273
5850 -107273 -142455 -192590 -101819 88082 140460 19065 -68743 68364 -69942 -217595 -167093
5839 -167093 -122066 -164733 -143113 -171261 -74668 6501 -110264 -231069 -178432 -86793 104631
5828 104631 263457 362359 271390 170383 125974 140692 240107 270600 211790 111730 93926
5817 93926 194927 71099 39392 74442 16922 102718 -11290 -127689 -180704 -230391 -79771
5806 -79771 -76229 -78259 -86075 -10696 78686 120362 63843 78568 35802 -51683 -77101 -123509
5794 -123509 -77191 -66129 77110 73823 115000 119683 42818 26551 -20742 24840 87049 -4097
5782 -4097 -67183 -66004 -68456 -78312 21197 154996 103194 -47177 -193667 -242578 -171077 -250088
5770 -250088 -255964 -171288 -181353 -17840 -21509 -36415 -56777 -158215 -184035 -104064 -129650 -250018
5758 -250018 -184081 -101879 -153831 -313225 -306640 -244189 -94630 -134773 -142196 -75854 -222662
5747 -222662 -289465 -159840 -38404 -16409 -62353 -59633 27426 93971 102856 139121 170153 116833
5735 116833 168709 113934 26566 91711 117742 71751 40088 -49943 -3858 -8144 -40949 -70407
5723 -70407 -146146 -167046 -190188 -214282 -161908 -115318 -105588 2980 -61993 -77892 -66613 -80123
5711 -80123 -141920 -143373 -83980 -3865 117846 75551 -116955 -205690 -110073 6912 95531
5700 95531 -14443 -198902 -176028 -113617 -27921 -9715 116084 220559 218952 111085 -19460
5689 -19460 24501 110263 59066 -12784 -67244 -5138 -60166 -130933 -140737 -63121 -176251 -217717
5677 -217717 -140327 -120765 -249034 -314520 -218226 -177938 -75515 -101525 -175540 -129748 -194423
5666 -194423 -166455 -200113 -170302 68865 149891 122675 18945 -55181 -136104 -144557 -236049
5655 -236049 -134858 -105079 -22839 2914 -14612 -180286 -215103 -252181 -144909 -47031 34848
5644 34848 82456 -52870 -34554 -47677 -307473 -289284 -174613 -192082 -154831 -138858 -168045
5633 -168045 -206829 -240835 -198237 -21214 -59300 -80835 -19005 -3019 -117556 -33455 33207
5622 33207 34751 -42391 -40439 -152890 -180855 -110492 90617 77254 23418 132751 209873 247345
5610 247345 249103 149572 103201 -58668 -269335 -273482 -287519 -191130 -127313 -167142 -123098 -53465
5598 -53465 -87803 -111374 -160335 -79574 -17754 -1017 -25013 22711 49655 -81448 -271822
5587 -271822 -356923 -256936 -89066 35793 -80698 989 -55292 -99364 -102579 -99719 6685
5576 6685 -53500 -32178 -32441 72910 -126150 -153967 -170437 -191345 -127652 21206 39786 -64968
5564 -64968 -78170 -37786 -9902 -129546 26458 -79956 -141783 -140097 -69486 -131024 -257694
5553 -257694 -225340 -137903 -92749 -91081 6449 150972 177627 67294 -36763 -29111 77019
5542 77019 -12211 -96414 -7013 42083 -10766 -1982 -14155 37131 78763 235513 205588 131131
5530 131131 52806 122896 235702 168700 -21569 -79428 -53888 -52637 -41701 -4477 -78685
5519 -78685 -47612 68153 101957 -2892 30934 103108 122231 -50840 -194402 -201588 -67731
5508 -67731 -5139 -128005 -283056 -62562 163728 216304 127443 40244 69918 106421 81067
5497 81067 76721 147005 181053 36429 -36341 31063 105538 108452 98741 130893 98730 77738
5485 77738 -7522 -93736 79100 143107 81939 -87978 -197233 -297387 -252655 -166429 -176333
5474 -176333 -186140 -194369 -55228 -8989 -158135 -114915 4485 35246 60974 57383 34488 16444
5462 16444 73864 -22075 -51563 -26860 62490 65350 79495 162763 108972 -76080 -74894 -75762
5450 -75762 -89131 -107538 -24383 -38816 -123643 -61935 122453 238958 272336 304378 200767
5439 200767 90257 24575 90543 140062 101497 154855 288880 355515 218042 125708 69103
5428 69103 -16079 -129500 -136015 -101344 -26074 3202 123849 248301 48614 61698 85753
5417 85753 33976 81910 -8982 -148470 -88516 -81218 -234137 -223721 -136272 -112955 -87912 2235
5405 2235 -72436 -106665 -57351 -87517 -259380 -185175 -174705 -194368 -178163 -90561 41421 65807
5393 65807 29073 -34508 23866 -13517 34303 -84713 -162862 -78207 -130174 -210594 -134939 -167427
5381 -167427 -114831 -162641 -142507 63197 168266 134576 237996 120977 -150408 -195684 -130996
5370 -130996 -127966 -12211 -13950 -32288 -41297 25635 64822 -96192 -127316 -133241 -190829 -347826
5358 -347826 -178170 -116138 -22576 59411 26373 51235 -36429 -59367 -22577 17948 -15719
5347 -15719 -90537 -110029 -82249 -99347 -122418 -62897 -49748 -76935 -78046 -151366 -101259 -91045
5335 -91045 -189311 -184149 -249303 -275161 -386464 -360830 -241206 -169450 -81849 13391 64705 81537
5323 81537 86891 150168 151081 130529 62745 -118433 -223512 -202476 -178792 -224336 -201917 -70634
5311 -70634 95628 50380 28240 55195 75374 70129 123956 197378 253627 98426 46412 -27181
5299 -27181 -71685 -146744 -190305 -146730 -145024 -118375 -163484 -96998 20719 40339 81151 105208
5287 105208 -36814 -134294 -56025 -121011 -56532 71351 244756 295636 261334 -699 89219
5276 89219 85111 53376 58205 58614 -41026 -192629 -272146 -162279 -79086 22186 -21632 5873
5264 5873 -34216 -103425 -133931 -147477 -83824 -72863 -43441 59969 78286 48017 -69486 -3230
5252 -3230 57025 55231 9941 -44628 -596 56347 -60201 -163444 -160538 -235239 -234636 -93714
5240 -93714 -32495 -23349 -148042 -122109 -82099 -218478 -354188 -299929 -293090 -185390 -117033
5229 -117033 -69440 -114022 -33958 -2066 65263 77245 -48897 -173985 -182623 -301707 -324393
5218 -324393 -223353 -136499 -75164 -43149 -25521 -9606 -115779 -99182 -29267 -38008 11232
5207 11232 53875 91672 32616 314 -51359 2431 -64342 -20618 33832 -150726 -172934 -165034
5195 -165034 -58090 -91511 -157727 -288212 -223253 -217911 -130669 -95007 -117479 -213404 -118840
5184 -118840 166836 195368 94866 -22407 -4410 -85935 -110139 -41891 41502 4190 58627
5173 58627 -88772 -63280 6800 -151000 -207753 -29502 75102 152630 177747 57304 63921
5162 63921 -55100 -78468 -22388 -12334 82154 -4515 -51139 -71255 -68421 -91837 -43269 -41955
5150 -41955 140895 142459 81834 40049 -2837 -129575 -199233 -220781 -238293 -218473 -225666 -128907
5138 -128907 -17782 -58860 16233 86007 50416 133233 12607 -106845 -159272 -136645 120112
5127 120112 164876 166436 158723 61157 76860 70345 89983 122297 81576 -74906 -77158 -65935
5115 -65935 -44161 -122389 -60419 -96647 -168101 -82207 12359 -173103 -134419 9662 32842
5104 32842 4706 -6002 29506 -54866 -120545 -127307 -201632 -211286 -161129 -44252 -63462 26742
5092 26742 86167 -53849 -161025 -149803 -69398 114329 102444 -19353 -78110 -30665 -123437
5081 -123437 -264014 -254913 -164266 -117609 -119524 -99247 -181192 -111893 -73840 -138855 -118725 -151074
5069 -151074 -14529 -51357 -135520 -91249 -13779 7462 -47833 -35158 -192963 -274160 -127536
5058 -127536 35084 -25389 -76851 24663 -14126 80696 197667 126196 108472 76707 82706
5047 82706 143571 74219 25291 -72272 -158317 -244988 -162200 -123062 -231607 -237095 -204445 -140593
5035 -140593 -132363 -1439 -7499 29276 42444 8669 -58290 -102413 -79101 14166 184368 206394
5023 206394 160491 8979 14372 129689 176512 120720 145935 81337 -56211 -37248 75000
5012 75000 87222 75534 40905 -21143 56366 -5023 29357 132806 10410 -104816 -94572
5001 -94572 -56747 -39732 -58288 -23206 -28665 40405 45541 98914 -60621 -249438 -232112 -164228
4989 -164228 -82356 -97854 -43488 -50051 52724 43537 37353 24894 81986 154593 71360 -188444
4977 -188444 -265371 -220994 -224921 -97163 -46420 -97607 -128684 -111536 -170960 -162493 -142606 -63293
4965 -63293 40183 38985 -18260 -125716 -184213 -161589 -53736 32568 130138 104317 -89794
4954 -89794 34394 25431 -13617 8484 -99328 38821 179962 193809 -38442 -74181 -97837
4943 -97837 -154585 -37979 80614 23322 -47805 50427 13809 -144951 -287310 -183812 -89858
4932 -89858 -54257 51474 123758 58800 45849 22832 -9969 -4120 -25230 -151658 -167366 -65675
4920 -65675 -29279 113142 229945 250851 82688 1181 -37753 -116201 86928 188027 183792
4909 183792 202755 105899 3320 -20015 153972 125141 155788 78327 75741 91178 29632
4898 29632 -51025 35296 18018 -38570 10174 62292 -89259 -54137 48440 35733 -113321
4887 -113321 -56225 198471 261250 152948 79779 3107 -104318 -106437 -201617 -181493 -163448
4876 -163448 48303 58647 53811 88725 -62997 40029 174553 171724 124965 -36475 -35341
4865 -35341 34853 316 16716 110463 53699 82539 62146 -33117 -25137 -27369 -51852 -25521
4853 -25521 -6785 -4360 -81364 -92863 -114571 -182017 -140728 -169200 -242254 -308433 -285397 -141195
4841 -141195 -18304 -118889 -234680 -299879 -286724 -121159 -81250 -135101 -83992 -93998 -100271
4830 -100271 -104492 -234695 -297709 -154090 -9532 29232 61995 147465 197046 135772 -23421
4819 -23421 14701 62694 89869 -73410 -273586 -308906 -250839 -193897 -116279 -22189 -26331 -104637
4807 -104637 -258108 -194873 -139428 -32037 73038 70393 101686 177110 130736 -73909 -28934
4796 -28934 50042 68639 120787 46517 -35552 -187609 -264083 -255279 -203629 -89286 -981 -107187
4784 -107187 -165330 -85571 -147708 -252834 -271946 -217273 -35795 120557 224444 221432 107968
4773 107968 -82117 -109911 42351 26329 92192 151674 154673 160354 -85419 -99913 32521
4762 32521 56283 17023 -22448 70352 139515 188781 335337 239196 140974 251200 325069
4751 325069 306042 271545 167813 47085 12966 80583 50159 -74068 -123227 -45534 16322
4740 16322 13779 12976 -82114 -131431 32686 35272 540 -11927 -24907 -83636 -104959 -40230
4728 -40230 68882 53164 3946 7965 -53186 93296 33968 116226 2453 -105371 -71287
4717 -71287 -46247 -44256 80474 73974 -19108 87285 95892 -13537 -178739 -217424 -105692
4706 -105692 36473 145085 171835 268398 255461 100666 30878 59429 8246 -133563 -106247
4695 -106247 -45881 100725 94002 -1550 -70634 86480 166470 -35262 -192833 -96210 -77768
4684 -77768 -116834 -24734 42166 -120502 -142912 -69115 -117691 -250440 -270734 -287770 -221258
4673 -221258 -96262 15346 19233 -60379 -8534 -23317 -70565 37831 122010 -3989 -66967
4662 -66967 -141756 -236828 -144217 144806 149629 111255 256436 347270 331147 112017 119620 85015
4650 85015 181508 207161 136710 45006 121888 157284 163713 124882 22000 -173719 -207204 -230000
4638 -230000 -161335 23973 91292 -74057 -64837 -23269 -44666 -165758 -190557 37307 190869
4627 190869 77748 -135130 -220432 -103606 -50713 -20421 -28700 25309 80079 39211 -93159
4616 -93159 -62368 1213 122434 201952 141422 35319 -65460 -29159 -58172 -166354 -202326
4605 -202326 -198066 -212611 -81953 106591 9486 70109 106180 26604 -15397 -66092 -311128
4594 -311128 -501082 -364745 -135011 90361 107459 26583 -61882 -40891 -22832 -34168 -121608
4583 -121608 -174044 -157115 -212931 -223173 -145343 -82798 -9803 79799 85166 -40727 -171032
4572 -171032 -230519 -99147 40363 -94512 -149036 -190448 -28754 7589 18282 -41234 -24076
4561 -24076 134209 189617 113374 -5464 -25021 -44664 -35841 14802 97742 44130 -32256 75466
4549 75466 197078 183814 219141 244170 100410 -56097 -61048 -94621 32550 84549 57372
4538 57372 60203 62876 125035 54659 -42433 -99888 -123369 -79504 37154 -54850 -169334 -162326
4526 -162326 -205586 -106789 58294 84517 -55489 -137576 45776 88481 -67768 -119413 -126996
4515 -126996 -199401 -291130 -373865 -358450 -191040 -218877 -177903 -173841 -152769 -64124 -61058 -7953
4503 -7953 -88785 -61557 -101289 -133894 -172735 -305001 -354190 -181975 -140176 -68582 -91363 -179285
4491 -179285 -92657 -105908 -75744 -85048 -13181 -49596 -13993 -35683 -25386 -132433 -269021
4480 -269021 -335008 -303295 -235836 -11928 9866 -73646 1993 44714 -69377 -118107 -175435
4469 -175435 -91096 -132761 -210014 -90789 -19866 98828 220017 78038 213554 216882 103484
4458 103484 20802 -122369 -313717 -242098 -62339 52630 126795 76033 -33057 -31930 -56107
4447 -56107 -209933 -124920 79368 89133 66408 -56753 -54084 -57030 55032 -16314 -181700
4436 -181700 -143271 -73283 -40441 17231 -97567 -132156 -111789 -30647 -4085 61270 183985
4425 183985 285971 230073 69332 7635 -18314 -38517 -135183 -83736 -131156 -147088 -92237
4414 -92237 -86806 -64399 -7413 134083 287353 177127 66378 -66188 -67833 -124811 -143525
4403 -143525 -67383 -54757 -107528 -76087 -38798 -128201 -224402 -354525 -356978 -308854 -173149
4392 -173149 -37000 42940 -115470 -240870 -250929 -127123 -99356 10562 43610 8790 8885
4381 8885 -61091 -99306 -75831 -7381 -44766 -155495 -157171 -101 -27908 -109042 -182472 -165441
4369 -165441 -138097 -159668 -162340 -59103 53163 141809 172190 86149 -148162 -136234 107747
4358 107747 216813 226843 302642 245776 72190 -14829 20986 48669 -54869 -63090 -80490
4347 -80490 -187483 -141197 51824 133947 239945 104764 24797 60888 -47864 -48647 -58056
4336 -58056 2866 -76635 -84089 119881 284813 203105 152583 138209 92494 -16101 -109987
4325 -109987 -114807 -20856 82235 86049 24885 -99394 -105744 -124733 -152128 -94057 -98874 -180532
4313 -180532 -148254 -157348 -16807 38254 -84859 -89787 63059 118087 27271 -22266 -45903
4302 -45903 -37936 -254910 -238960 -216898 -237561 -137727 -18303 50363 153524 149401 128727 162315
4290 162315 95409 81716 -24956 -126740 -64015 155 74616 128344 -28554 -9464 -21241
4279 -21241 -170038 -257036 -186147 -28951 -108085 -62149 41544 76518 77923 61075 121747
4268 121747 57872 -45536 -30210 32458 53172 52811 28558 21128 63883 13045 -41249 -79144
4256 -79144 -112957 -146327 -145552 -185332 -32329 -36031 -32472 81846 90924 73325 142216 282307
4244 282307 286806 258968 182971 152675 57093 45671 18859 -63898 -135259 -146807 -177814 -101752
4232 -101752 -13312 -58039 17310 91286 19064 -166882 -167495 -211573 -187493 -197211 -191058 -162492
4220 -162492 -109380 -195453 -225152 -145074 1449 -72 -60721 -121347 -138335 -155357 -170484 -302903
4208 -302903 -414843 -341979 -191403 -134982 -77139 44643 162755 50348 -837 -25674 79081
4197 79081 158276 -76468 -141549 -237189 -291287 -190020 -105248 101336 68418 -29605 -28745 -11613
4185 -11613 5511 64385 229303 259255 128716 -294 -44563 -66675 -144186 -277209 -214323
4174 -214323 -134948 -172120 -129374 -147128 -99501 -173270 -34936 -417 -86708 -97494 -31796
4163 -31796 143850 281778 103708 40239 37969 92843 125659 114625 117373 -112709 -217245
4152 -217245 -124786 -796 90567 31978 -52988 -101954 -29322 42737 95442 78128 3747
4141 3747 -13435 27679 38873 -130191 -187570 -131741 -113439 -91821 -119175 -48066 -43210 70947
4129 70947 87334 -2163 -83857 -21143 9081 -103754 -143727 -94946 -98127 -138569 -108089 -44501
4117 -44501 -106047 -40984 156360 131761 76759 31540 87116 26430 -32643 -46928 21278 -31536
4105 -31536 -174437 -93165 -10563 -23288 -34581 -37129 -57581 -56382 -126326 -136412 -25393 69807
4093 69807 -62331 -47639 28501 18865 58977 128285 177886 229968 361189 341921 199464
4082 199464 23784 -112366 -21388 27707 12558 895 -63064 -46 39026 11575 91407
4071 91407 76797 72747 126098 78509 -46417 -13603 60011 134495 122916 -62273 -49425 -70029
4059 -70029 6244 86761 113447 -54529 -65381 124448 138517 160436 176478 179690 189824 86966
4047 86966 24068 -17390 27039 -123749 -145519 -150605 -186099 36284 167054 208215 168096
4036 168096 158716 -11525 -37113 9076 27438 112474 102932 120970 138875 36231 -30521 76152
4024 76152 57115 9832 -107825 -83464 -53181 -136754 -131813 -155950 -75069 -918 80269 29410
4012 29410 -69379 -170065 -110030 -89037 -178285 -185185 -139344 -177812 -22851 44289 14035 435
4000 435 -18546 -89986 -10362 39341 99043 5748 -25629 -7228 139110 257338 213819 135219
3988 135219 9081 -117 -177962 -330546 -344774 -177393 -84171 -108147 -107165 -148811 -163247
3977 -163247 -114120 2257 -6118 -49939 76255 55571 121444 128497 57708 30702 46920 -50400
3965 -50400 64507 50495 1183 62440 -1597 -74207 -35412 -73383 -128384 -156269 -93372 -109014
3953 -109014 -122447 -119282 -70149 107637 99680 -41873 -11421 -47425 -100099 -141313 -150714 -34029
3941 -34029 6308 -27326 -40663 -173290 -185720 -25251 -22777 10356 -44303 -82046 12377 -130785
3929 -130785 -264256 -282505 -223872 -196996 -175357 -139280 -76727 -193218 -169539 -142549 -148173
3918 -148173 -267570 -197222 -33747 106239 -67858 -171767 -105938 -22138 9848 104466 43195
3907 43195 -41981 -72924 -161020 15675 86344 -2161 -86893 -20868 46168 -7235 48446 73039
3895 73039 -60979 -239925 -194425 -161891 -71115 -175432 -199567 -190984 -157026 -113295 -7478
3884 -7478 24312 59719 82159 107396 -32361 -56847 -53546 25265 155421 197307 125773 34424
3872 34424 -13631 -137433 -154608 9570 -31957 -69805 156009 280973 209556 94595 23484
3861 23484 -106416 -150176 -116008 10904 77 -75157 -23071 -5963 -96835 -7583 28019
3850 28019 -109786 -195502 -56750 79989 33973 144113 161233 -31166 -171547 -268239 -238168
3839 -238168 -115973 -76878 -37657 120384 167499 99733 168599 131316 -31594 -104725 -18024
3828 -18024 78995 10179 52615 124044 -19219 -53713 18789 -92959 -118089 -29088 -80661
3817 -80661 -207609 -71134 210917 322432 103323 -52962 -108327 37426 91671 99352 -44356
3806 -44356 23153 -61731 -137154 -144578 -88596 -22000 -106740 -43833 -42261 -154278 -232050 -173528
3794 -173528 -144920 -123577 -202852 -98982 12202 -51179 -93153 36010 97717 -21445 -5037
3783 -5037 30010 90643 208392 168737 115807 44516 45539 156602 94742 70269 -21222 -204322
3771 -204322 -170000 -40470 9 -141215 -25643 166247 166839 165872 118637 54251 -28872 -32788
3759 -32788 70339 81415 134621 148725 195177 329568 226573 51287 -47553 -60997 5711
3748 5711 120301 120395 66821 201042 218471 2529 -162224 -201831 -98458 4003 101659
3737 101659 180023 158748 104277 78740 85478 25226 -65666 -76805 -67737 13965 -28218 -101990
3725 -101990 -192476 -171070 -50220 -120144 -223181 -234624 -19966 200768 228845 243288 154228
3714 154228 11942 71705 132240 79940 -44010 -3494 28257 140511 246474 193939 95730
3703 95730 5536 -105241 -182953 -75269 403 136283 19812 -124889 -118556 -120010 334
3692 334 -75273 -81628 -24710 -53789 -58863 41877 -768 -104827 -48125 -102540 -202574 -196854
3680 -196854 -90215 108971 197719 66453 23558 53851 48196 111154 127571 65108 116714
3669 116714 136152 103047 45172 47124 -42668 -129851 63227 173512 136906 166236 169251 97128
3657 97128 112270 94119 173675 318694 369093 314460 273594 187836 138308 176715 134203 -89422
3645 -89422 -51729 -964 115923 137811 39687 58811 42197 98369 -27788 -103417 -110576 -28483
3633 -28483 176782 144513 37384 46786 59420 21069 -6209 -104257 -158475 -109674 -138388 -155708
3621 -155708 2223 169680 138378 12823 -831 -48524 -120707 -95262 -88096 -86966 -51625
3610 -51625 -62247 -6116 23904 -86224 -46830 -80286 -29652 15813 27140 -103574 -160887
3599 -160887 -103172 68448 165823 115476 151759 118291 109388 95999 95688 -106575 -51280 37533
3587 37533 17008 61898 139958 53176 55867 94224 109766 -25247 -58242 60402 151505 100201
3575 100201 -7264 17568 24933 39090 -49238 -91283 -121629 -140045 -20303 89531 54476
3564 54476 18849 -97432 -234655 -257828 -188590 -175059 -201861 -195139 -128998 -98455 -197728 -231038
3552 -231038 -157033 88676 123668 30885 -70163 -116784 -91930 -252950 -238476 -139261 35931
3541 35931 109407 -90268 -152987 -63214 -71793 -66266 -134745 -98890 -13881 104233 125350 96825
3529 96825 88379 -20630 -79153 -87203 -167994 -197601 -265356 -333330 -275695 -159550 -44777 72364
3517 72364 -90287 -313012 -400747 -414342 -312059 -260596 -176893 -171333 -112674 -31171 -82875
3506 -82875 -120071 -65789 -125898 -132895 -79457 -24355 107788 142519 6222 -164764 -213190
3495 -213190 -156184 -129063 -139823 -142729 -62548 -128802 -211845 -305419 -146713 -34806 -74856
3484 -74856 -123422 -199953 -142117 -59698 7316 -63556 -74181 -78479 -154213 -241598 -263173 -333544
3472 -333544 -193873 -23164 131728 128812 643 -72389 -52858 -21510 -17848 59055 87142
3461 87142 21553 70975 134452 51583 -9870 11407 -22447 53249 -20432 -158832 -255433 -280076
3449 -280076 -209149 -183149 -8910 -4242 76298 110642 108143 92911 111285 20910 -67344 -55033
3437 -55033 -125537 -141164 -128973 -72362 34193 198884 153967 157476 165636 154500 282842 221454
3425 221454 92443 110719 53867 80532 21038 -122050 -148810 62885 116749 83236 139554
3414 139554 102681 9643 52210 120512 41661 118095 173337 107858 122444 54955 -34699 -105074
3402 -105074 18012 94636 207101 177342 227228 314881 283864 161496 219286 170186 168946
3391 168946 374175 520614 482892 366564 110697 79630 76463 55810 67349 158027 -78240
3380 -78240 -238154 -101515 -80314 -31138 -20013 -18235 -107653 -120754 -254762 -188786 -130390
3369 -130390 -131389 -88048 -66145 -136439 -237351 -354859 -382418 -341054 -300106 -233423 -87219
3358 -87219 12547 96033 90820 -65723 -151760 -219206 -261613 -92351 65757 -19455 -127333
3347 -127333 -168118 -56573 -89698 -129732 -115790 -133509 -145457 -44420 17132 -70268 -154441
3336 -154441 -192941 -121011 -90123 -144720 -158048 -142264 -104053 -137436 -115342 10672 145352
3325 145352 254742 301802 195773 117736 112347 79062 40148 -52980 -76551 -142730 -126168
3314 -126168 -157784 -85756 50507 -10927 -42258 8571 -33805 -77631 -127275 -115886 -104937
3303 -104937 -244485 -211474 -53116 -64407 -62251 -34488 -23067 -46389 -54417 5475 10827 -22794
3291 -22794 5861 51194 -83445 -118706 -137664 -70019 -51183 -8828 114130 150424 184087
3280 184087 186189 226513 162373 31768 -27277 -134323 -4653 13917 -101432 -216140 -158329
3269 -158329 -32153 115465 119512 249492 149900 -2920 -163657 -97890 -62676 1190 65404
3258 65404 34092 108535 85780 1775 -64440 -65851 -22748 -151148 -164896 -281441 -179113
3247 -179113 32184 178408 85553 -34416 38619 -34454 -79789 -175154 -74111 149876 145988
3236 145988 102315 52810 11976 -93520 -88595 -36161 42358 -81832 -183513 -109065 -40965
3225 -40965 -79940 -87128 80523 228694 224193 78825 4123 -99948 -28414 -59729 -185165
3214 -185165 -204139 -289802 -226358 -198915 -107954 -193692 -40448 26291 53456 24577 41383
3203 41383 -72539 -88511 -46139 -89219 -89097 46980 84510 29279 -89406 -51800 1938 -98825
3191 -98825 -162532 -99555 -104399 -116158 -89787 -53373 -13940 -102431 -161477 -147566 -75711 -49871
3179 -49871 45986 113627 117615 205936 147086 90846 127951 204051 119604 -62679 -123696 -89837
3167 -89837 108248 170775 79552 111919 41398 46373 74923 27018 -12740 47556 62906 21531
3155 21531 3739 22754 159893 278493 329787 109859 -15554 -27132 -72395 -5706 103741
3144 103741 118237 3897 120602 337008 276174 264508 239890 134065 43847 105053 110795
3133 110795 -11126 14106 109925 88390 172126 78148 -93344 98698 278045 87659 31879
3122 31879 22126 118616 144508 179630 109351 29165 -14532 -116743 -113723 -108143 18210 149928
3110 149928 140730 88486 95044 -63267 -214639 -187720 -104790 -55341 457 -34427 -99322 -215595
3098 -215595 -277208 -277256 -225630 -188617 -242506 -204420 -5398 106285 106021 -7913 -61084 -165801
3086 -165801 -103605 23405 -99567 -264289 -160227 -98040 -109537 -67058 103492 246858
3076 246858 252185 132488 18999 69770 171485 268430 154640 84906 145550 196521 206308
3065 206308 144423 220054 154507 -71295 -116527 -147508 -240606 -184564 -61814 -62353 115838
3054 115838 164894 54220 211951 116078 -10158 30811 62133 -45261 -132998 -260451 -149722
3043 -149722 -56139 -5826 138215 113477 110063 231994 363612 209641 103710 -65514 12147
3032 12147 20261 -2796 30512 7748 -602 10606 -275 -129365 -102366 -97391 -116888 -50819
3020 -50819 38407 58277 116739 159462 123704 181197 88754 140799 194969 142488 127295 -32483
3008 -32483 65773 159998 160007 185875 138058 32420 -128186 -72820 23326 140284 171204 124611
2996 124611 120645 4468 -55399 -44154 19945 -16998 136350 124591 61570 -38818 -105014
2985 -105014 -55872 82217 -4098 -78410 -18244 163725 190875 182969 210511 207682 179224 73069
2973 73069 94897 125739 150363 174797 189276 163360 207405 147519 36378 7370 168914
2962 168914 215305 100251 52821 81817 32561 79108 124552 41476 7040 -2174 61158 43210
2950 43210 -199449 -322024 -255323 -202377 -196380 -227142 -325790 -326966 -173710 -5677 23717
2939 23717 19482 51870 151945 43426 115798 100558 61534 -140586 -105043 622 -17298
2928 -17298 94771 119144 75408 -77491 -111230 -70996 -71357 -103262 -85944 -131293 -80186 14747
2916 14747 -10509 -28549 65804 99587 6644 -77966 -163937 -115137 -21926 -35413 -72673 -94861
2904 -94861 -69327 6456 145800 107369 -33171 -12090 78311 125804 162265 142056 45300
2893 45300 22974 52588 43272 -19777 62468 9942 21631 119531 191879 56776 -96311 -98991
2881 -98991 -10670 -17372 75044 43857 -63544 -128273 -149363 -193398 -180262 -91026 -80682 -158578
2869 -158578 -117304 -30163 -26750 18296 557 48802 85695 157296 41852 -114540 -183505
2858 -183505 -149996 -3026 9172 -73038 -114921 -92702 46491 206353 377393 306941 58071
2847 58071 27616 -125215 -360711 -319147 -295031 -256730 -277693 -112250 33813 57544 7131
2836 7131 57885 102613 69065 160020 107092 -83754 -76662 8599 22793 77131 143620 74674
2824 74674 -33451 -112990 -61516 184731 164632 61243 134537 202974 217152 186404 130153
2813 130153 178795 239199 172233 113069 14577 40468 10436 -136154 -268869 -381054 -295773
2802 -295773 -39838 84657 -25102 -107730 55035 155780 173572 175836 191246 194323 288640
2791 288640 297265 202707 116689 157485 131920 58107 83776 67877 154123 2844 -158257
2780 -158257 -3841 166990 295258 218531 161297 53415 123244 45399 -26249 -50552 -122525
2769 -122525 -161348 -115334 -73499 -60664 -91862 -126475 -141056 -79041 -52979 89875 56756
2758 56756 132509 150535 244928 182410 138711 160304 158724 68286 31133 -28694 -162536 -142519
2746 -142519 -86444 -140617 -60425 -157633 -28515 29752 343 36792 78165 78184 159182 16796
2734 16796 -28423 -929 52318 100487 -22046 12874 -83067 -136883 -138916 -65491 93692 227203
2722 227203 293482 250029 153356 31019 53526 164604 223785 287581 197398 115776 191266
2711 191266 266508 227208 276053 341932 194383 -41854 -206536 -109108 -32615 -144661 -197234
2700 -197234 -55684 120499 159940 193963 149774 102545 112665 128906 46703 -49738 -70795
2689 -70795 -82092 -49520 -430 99496 286273 262823 175171 124189 -11107 -194762 -245201
2678 -245201 -145726 -98997 -90330 -46373 13467 9310 88645 59918 -10332 -156727 -181760 -79707
2666 -79707 28784 -9945 -133469 -42219 -4327 -60988 -118672 3734 104888 49721 57370
2655 57370 -101576 -113750 -75099 -28504 -131692 -167757 -188247 -113284 -84069 -62309 -69600 -95570
2643 -95570 10749 100656 108160 91877 23980 -80187 -50450 151314 207105 202077 84397
2632 84397 3824 13022 116787 15294 -50505 100076 85906 52595 -40398 -97007 -19150
2621 -19150 -64622 -212126 -308685 -298231 -302472 -311384 -163796 -181046 -288882 -311954 -157325
2610 -157325 16884 -42869 -202955 -226053 -203656 -130171 -12758 133218 107553 48677 111164
2599 111164 111526 53346 112403 91054 17211 -57449 -1484 24105 -28272 53413 18360 -74295
2587 -74295 -61919 52102 137456 67504 117005 186126 295986 196731 64389 -67865 -73825
2576 -73825 142749 152100 14691 -107677 -52176 -94926 -54866 -5326 57036 93295 39791
2565 39791 -203839 -229702 -153222 -230390 -275823 -159297 -120961 -87938 38381 166638 185605
2554 185605 81869 34163 70305 76824 30605 -7585 -43764 47143 110980 116081 -37514 -177208
2542 -177208 -204478 -97216 101549 121974 130330 140940 103235 55013 23420 -3850 1250 -47632
2530 -47632 -29838 -9318 127592 220318 217082 213567 153650 108376 216350 120755 104236 121491
2518 121491 45052 -82183 29744 170238 79766 179016 77265 -97941 -118077 -66407 20959
2507 20959 82760 -18890 -51642 22368 -1996 -8003 30322 -2407 3181 -7903 28083 -40177
2495 -40177 -54393 177025 205815 72100 -134252 -193200 -52749 -2220 89727 140619 190912
2484 190912 92271 -64617 -57840 -31237 -60671 -4342 161900 153851 187800 196886 191306 85135
2472 85135 -52761 -26406 -33604 48318 36731 -19253 -83163 -87603 -52255 7541 128270 85281
2460 85281 70396 -26907 -116703 -89507 -13967 -52177 -116696 -15579 163993 266191 297809
2449 297809 387757 543977 482736 442617 404995 285680 158167 95308 37872 27874 -43182
2438 -43182 -60554 9925 143584 147561 68583 101924 160359 69862 -102678 -44251 -45050 40290
2426 40290 6584 -70539 -84732 -14369 82588 41074 -66395 8714 195190 188160 69610
2415 69610 -23230 25193 47730 43154 94907 -33815 -59881 -99194 -131046 -80432 -74442 958
2403 958 161739 250738 105050 66751 29616 64349 68450 66750 7656 1736 -64095 -237950
2391 -237950 -189745 -147324 -111449 -21566 -46963 -117806 -81489 -116001 -57558 -12912 -77626 -229031
2379 -229031 -190605 -25612 -27487 -118325 -128707 -176582 -269330 -169274 -58917 -111822 -80862
2368 -80862 -19343 13751 -92653 -226377 -357481 -177439 -15474 45655 64326 -35369 -55215
2357 -55215 -144730 -135930 86082 114129 -25964 155 155912 240480 225613 235924 224425
2346 224425 205430 263965 276195 132321 142211 152097 63134 -173607 -245977 -187515 -160356 -219619
2334 -219619 -111443 -52455 -50804 -70747 -147464 -167884 -73562 -192941 -340075 -200271 -59935
2323 -59935 -73814 -38267 116454 127034 192468 317515 210975 96938 38978 -93344 -122941
2312 -122941 -80187 -205346 -148720 -81741 -89174 5490 -48724 -31983 65604 154576 254307 205769
2300 205769 -65284 -187029 -254405 -252230 26119 160965 35186 130838 131880 998 9953
2289 9953 35450 73427 47808 -34653 84955 112054 -79633 -105159 -110647 -67544 15647 -6131
2277 -6131 -9295 -4232 36833 -54050 -120933 -39244 173383 247212 30351 -78814 -83629 -26776
2265 -26776 19996 46366 64113 163000 168964 208256 187055 130083 -48613 -149513 -88182 -64067
2253 -64067 -15945 150937 205553 122011 -31633 -58152 121553 190912 147097 202156 256312
2242 256312 241066 101038 69192 51823 35143 175705 189070 166229 144394 154102 42665
2231 42665 64477 -83174 -47945 116207 90891 46573 61339 -98809 -179043 -44686 34397
2220 34397 100108 224292 307069 302906 189137 -34359 -48251 67821 156601 113212 68051
2209 68051 -27038 -26995 -6915 -116374 -172994 -46310 55639 145162 87978 -89392 -111519 -161558
2197 -161558 -235193 -219492 30678 197891 157370 100909 62526 47075 -16327 30094 132678
2186 132678 56505 97808 12029 -1458 28149 127218 62228 -47877 -16583 -74336 -63387
2175 -63387 30186 23864 -79478 -81261 -80329 -161133 -322120 -297586 65228 127056 78459 29770
2163 29770 1329 -7619 -62184 -86099 -121261 -124079 -143916 -71407 72442 156520 128014 -24486
2151 -24486 -182817 -229150 -233855 -213236 -90320 29287 150945 120069 148042 217479 90321
2140 90321 16885 23390 -74116 -145568 -189877 -165570 -113134 -157161 -149251 -32520 -5876 -93966
2128 -93966 -30136 -34858 -56583 63718 19666 19218 -27911 38316 68883 83534 174936 252806
2116 252806 262203 180544 145735 -41381 -108229 -159342 -89823 7789 -98891 -1795 43044
2105 43044 -92179 -130142 -44901 -66887 -67438 -43537 48687 63581 120211 167668 96058 -49811
2093 -49811 64175 144608 15033 -220349 -335879 -283218 -145754 -131972 -231693 -224299 -143556
2082 -143556 -161858 -66307 -28784 -200227 -306152 -245235 -167695 25088 -49009 -239264 -157227
2071 -157227 -152328 -235707 -191750 -183952 -132346 -61496 -71827 -107274 -123375 -135117 -30450 -40501
2059 -40501 22486 8014 -32407 20924 6200 -30613 -51644 -78468 33237 132705 165393 118004
2047 118004 74452 161979 56350 35448 57168 -41000 -116297 -318910 -222039 -64804 44964
2036 44964 18600 -48316 -38735 -50693 -68555 -67471 -92323 -54002 -32895 -72872 -81663 -34837
2024 -34837 -36608 -2314 -59633 -95377 33035 84622 167637 179268 120271 40078 16888 -29252
2012 -29252 -62981 -70064 24200 183726 174328 23298 100261 195928 273590 147915 190957 198037
2000 198037 111670 50048 35203 112404 106893 103220 111606 47335 35455 -23321 94541 194629
1988 194629 151188 120271 50923 -42682 -43173 -58241 -83566 -187599 -241926 -164572 -11398 -10756
1976 -10756 152311 269795 177414 5879 33807 -32678 -63721 -47711 -131964 -122509 -119560 -221817
1964 -221817 -258941 -65627 -100044 -127407 22046 71563 -45667 -90740 -114239 9150 155173
1953 155173 35579 -92375 7867 24816 16559 171346 75823 7767 156286 165980 74151
1942 74151 29981 64559 -32560 -279164 -400193 -374528 -147597 -122558 -215681 -73590 -18803
1931 -18803 -78105 36703 124610 101537 26316 48145 -2692 -118864 -194433 -131311 -89496
1920 -89496 -47615 -97456 -173456 -191057 -100876 -71913 -115855 -116416 20434 52413 -74964 -83604
1908 -83604 -67465 123165 104824 -14327 3028 37632 156419 324311 286354 181023 -30703
1897 -30703 -91971 -95019 -56923 14038 -64805 -86745 -155211 -64048 -109596 -118246 -110460 -149605
1885 -149605 -111199 -28362 -69607 -199912 -190535 -65746 44558 40790 -62871 -20923 -65277
1874 -65277 -94797 -153440 -76742 -688 -14322 6710 -29451 -16132 201258 217185 187745 178089
1862 178089 128276 62906 39346 69607 -10347 -122667 -154612 -160167 -91582 -62889 -47618 31304
1850 31304 -17283 -76859 -32875 -14962 -112849 -133051 64265 34540 29299 212844 246828 176593
1838 176593 39156 -62172 55345 133564 66807 47157 45292 177127 175356 155613 205981
1827 205981 124277 19366 -17143 -15105 -27445 -122498 -143806 -37802 195147 52933 -90717
1816 -90717 -93699 -88050 -37585 150795 194092 124592 61180 -41236 -158097 -121250 -52042 -51842
1804 -51842 -131413 -33770 -11732 -67151 -34890 -42164 -120759 -119036 -231543 -289769 -149114 -9030
1792 -9030 73963 152277 254755 181682 -29585 -163468 -151327 -49884 -59191 -115411 -89508
1781 -89508 33081 -134802 -245537 -207198 -156354 -103179 -144789 -20670 -26380 26540 72431
1770 72431 93517 54405 53238 -60527 -129774 -114543 -130460 -128724 -84674 -103406 -71355 -30808
1758 -30808 110756 198635 215392 194459 161142 -25018 -99974 -97037 -58748 -97194 -194754 -350965
1746 -350965 -162218 13730 -71177 -105255 -116724 -66737 -70469 -58652 -63515 -118281 -189992 -141641
1734 -141641 -21279 -3306 -8437 -5220 20773 41935 114678 188620 236289 188371 209658 303442
1722 303442 251991 115500 158756 113545 -49363 32511 23676 50006 -44140 30327 272802
1711 272802 204142 117457 113701 16427 57188 151182 35687 -33057 -31272 -28981 46683 -467
1699 -467 90973 151551 93936 143550 124446 100739 89311 94281 78654 115026 62976 -172237
1687 -172237 -288746 -265106 -250343 -206093 -117524 -65149 -96697 -115891 -40827 -22915 89110
1676 89110 59891 -98577 -164070 -42562 162193 175570 95589 106317 87171 81429 59716
1665 59716 26236 75302 144397 77430 65138 30946 40219 -25116 17682 2559 -23591 -13458
1653 -13458 -89090 -198584 -242039 -252296 -77855 -3451 -57366 -61387 84578 74427 -35718
1642 -35718 74562 71182 107965 140337 111732 98762 3989 22078 -120925 -73745 113187
1631 113187 218746 176942 77790 90500 -13201 32620 48231 76296 121928 31057 -16567
1620 -16567 37150 58241 -46758 -36433 11693 12285 -28054 -67930 -65557 -75405 8766 13178 90881
1607 90881 67865 -64667 -58816 -50134 8377 -37641 -92446 -66786 -24924 30215 119334 73231
1595 73231 7554 -89132 -90212 -81505 -40584 -64943 -37876 67853 203783 19085 -42775 -43194
1583 -43194 26852 25843 200670 219992 256318 183029 161853 197643 230526 345437 235530
1572 235530 93363 -1341 45958 158722 132585 -22360 -41577 -40932 -101790 -101858 -61153 37982
1560 37982 21807 -120830 -134649 -82525 -45950 39398 53355 -8258 -80809 -23624 -42056 -51169
1548 -51169 -152459 -258414 -170508 -6738 38442 36233 -18883 -98221 -79995 77998 139562
1537 139562 106442 40232 86744 150138 206095 138792 -3787 38719 55791 126973 213304
1526 213304 199712 -3535 -176524 -175431 -110539 -149431 17051 8427 75132 195538 152166
1515 152166 85341 35001 -54188 -41352 -122484 -93312 -102381 3332 99276 88328 66968 -29001
1503 -29001 -98630 -156165 -250449 -114763 -43866 50330 55584 -7931 -56315 -22268 25785 -44057
1491 -44057 -43506 33878 -49003 -186479 -90026 -110587 -182777 -86249 -86500 -163120 -140969 -28949
1479 -28949 88972 60756 117160 114459 176291 173890 56135 -66097 -118123 25964 123209
1468 123209 82486 -91296 34650 40158 116008 65928 62106 92420 52455 65071 -44136
1457 -44136 -15106 129421 168515 198100 164997 173502 191419 115646 41095 -17729 48696 37143
1445 37143 45913 100080 144940 98169 31705 68068 69724 174176 167435 223827 148538 187292
1433 187292 222651 233858 123143 -61689 -204089 -113169 -138585 -73616 -22805 76506 175506
1422 175506 152981 156931 35939 13741 -37034 -83158 40788 -26292 -12899 45383 160904
1411 160904 245760 125537 48467 -135286 -128954 -156057 -82155 -31736 -32222 2829 45408 -8244
1399 -8244 -13078 -51872 -90058 -124523 3680 55113 -46460 -57117 -28973 30483 76573 36493
1387 36493 -105806 -234024 -143037 -57518 -96871 -88500 -58521 -55024 -128186 -172291 -18856 109273
1375 109273 214844 293112 227245 104826 49983 88721 112918 6820 -7800 54377 85197
1364 85197 121272 20689 51968 55988 -36264 -93827 -21586 -24413 -13191 97213 10601 -14084
1352 -14084 24544 -3990 -135573 -26074 109849 64910 33059 64717 78188 145963 131778
1341 131778 81983 67769 3231 -191380 -308969 -265550 -114190 -87721 25242 66544 35612
1330 35612 48293 -44223 -20997 10938 -30489 18396 139418 282008 170473 169221 157915
1319 157915 28386 -26232 -129094 -179542 -234257 -284364 -164216 -147167 -71183 94560 181172
1308 181172 100899 112128 47816 59074 12895 11031 79519 79089 -10046 -35383 -49567 -127760
1296 -127760 -138188 -69576 878 -92571 -8832 49560 -126440 -130291 -70649 -190273 -219666
1285 -219666 -201857 71133 233095 19907 -18245 10583 66442 101215 -7682 -90654 -256384
1274 -256384 -213008 -65376 162652 196309 52989 41657 121799 144625 104260 21311 -20814
1263 -20814 13221 58476 94051 -55111 -161623 -8877 92036 103876 232454 323906 338026
1252 338026 252910 99915 123260 24208 -136780 -74469 -75945 -211981 -222740 -121962 -74030
1241 -74030 -93065 -47616 61540 108177 40430 111472 46364 172470 225820 128908 44644
1230 44644 -78136 -88049 -13500 50175 -342 74141 108385 70494 119230 193464 233738 188215
1218 188215 102400 -17512 34151 36873 64055 114011 108178 66247 -10335 32009 -55339 -113662
1206 -113662 -38176 7759 -190489 -193182 -36167 58173 144637 230207 210455 122794 95746
1195 95746 151533 54072 133832 220120 284088 225333 59866 77569 109690 167831 142105 131392
1183 131392 288934 140949 15138 29942 94313 68093 -15928 -40861 88573 115280 -8948
1172 -8948 -55425 -38007 -93166 -136437 -91559 -145795 -199457 -201194 -151367 -90924 -122808 -106746
1160 -106746 -64226 -33696 -6867 -30690 17279 116216 271625 283246 278432 108510 102062 152969
1148 152969 103095 99889 28784 164133 268224 234071 117515 -29628 -8724 112631 53564
1137 53564 -57959 -74060 30483 158410 57533 -66696 -105998 -151330 -137932 35764 41184
1126 41184 125550 163879 157569 124913 78990 9424 -17892 39472 266053 346891 294114 91127
1114 91127 163888 304540 279961 289427 123430 -3592 -42485 24310 90472 28104 -73307
1103 -73307 -21120 -22014 -13886 28163 84393 16843 51214 90469 52094 13483 58030 60663 102735
1090 102735 -6241 -104832 -138374 -149662 3517 272132 245756 144383 -6350 -76582 -100814
1079 -100814 -31061 -20335 75445 238834 354765 367568 282227 196087 -21873 -107427 -74967
1068 -74967 -46405 -125592 -144131 -156987 -226770 -139888 -174428 -132351 -206895 -320309 -443031
1057 -443031 -398124 -315377 -239325 -167724 -110514 659 182831 157730 68309 16354 141139
1046 141139 187793 183649 121438 155892 107180 80037 41755 -292 51705 39960 28155 75722
1034 75722 -106218 -153108 258 17820 6772 -53907 -61911 -36241 134366 151917 44264
1023 44264 -19189 -71361 -93299 -47907 11174 122575 206206 145158 102921 -37169 18725
1012 18725 95229 -28007 -50909 -109533 -197058 -117392 -53392 68646 100978 118310 80390
1001 80390 145056 93619 -13534 -92349 -142705 -172145 -77558 108456 89346 184324 176850 27366
989 27366 -108822 -299266 -254898 -156388 -131882 -2936 134824 159571 91447 61199 73760
978 73760 115211 101711 81737 -20784 -64818 -41086 117552 152165 -630 -36563 5630
967 5630 -23200 -110065 -127671 -128959 64110 -3092 -71110 -5671 119558 151334 99075 127151
955 127151 49946 66113 15829 -112489 117649 308393 258003 84974 -8424 53327 36281
944 36281 -18897 -80352 -55242 -66878 -124308 -16261 87438 23393 -43460 -131005 -134853 -139695
932 -139695 -157421 -109801 -24128 83339 197846 169009 120753 179661 -91838 -186151 -135248
921 -135248 -18664 55583 39756 29624 43322 8799 -36979 -54554 -21157 -25205 129978 82300
909 82300 -49753 -73775 -28543 -16737 81455 92145 70111 52993 33435 190876 93205 -7478
897 -7478 -77593 -8642 19516 35943 112482 55853 84751 76270 124151 162820 180224 309844
885 309844 308038 211391 167119 45066 -1800 26723 -21963 -74407 -123149 46082 160367
874 160367 125204 67480 135287 139993 140062 178526 154609 86717 92995 77032 -16444 9095 46364
861 46364 -33153 -123868 -99567 -41307 -32002 -146122 -135293 -17075 114152 121415 27623 62760
849 62760 113664 34734 58325 76493 111808 45786 158931 169617 171176 123514 -49253 -184060
837 -184060 -175749 -200022 -91116 -1537 -21137 -30988 1234 53484 -60339 -160177 -46770 -15586
825 -15586 -26133 -113788 -206393 -260891 -167922 -50166 -53321 -112939 -134585 -100286 -50515 62473
813 62473 77903 -42462 -74559 -74645 -188884 -248419 -150320 -47557 85441 204062 245233 278980
801 278980 116232 72287 192046 342934 343920 242687 200296 175471 253336 245789 152769 82164
789 82164 129347 170276 100622 215003 288849 308071 226740 117364 97551 132675 161194 190796
777 190796 126746 111916 186569 221746 143393 51365 -43335 107832 247791 276986 218589
766 218589 206479 163481 86417 110208 -87448 39490 150807 176580 78162 155425 123935
755 123935 51759 -20644 -2441 168419 53655 -91255 -86147 -127892 -88698 39451 212184
744 212184 151856 21648 99760 47166 56057 85779 45632 229419 425853 366718 250072
733 250072 123417 -5945 162820 330582 288091 331048 239407 128938 136324 130391 215047
722 215047 304457 192032 11550 5933 233224 305410 143604 163117 368433 358778 337341
711 337341 293923 256213 199054 260882 280456 225908 187709 146001 23216 13728 206159 334556
699 334556 471001 390697 177987 159549 133102 153305 107329 79522 145449 4135 70902
688 70902 128409 39226 -15795 60565 124645 181295 189408 158012 153771 339847 469561 398314
676 398314 279834 125374 45005 14958 -33168 92075 126171 -9582 -42727 -189263 -309497
665 -309497 -275535 -237007 -123228 -8443 91266 42903 54606 83526 101560 106840 261364
654 261364 189674 95253 -19067 36313 61900 7403 -105371 -198635 -207881 -129852 -23691
643 -23691 91997 136704 226698 224430 26350 -162664 -18954 61154 -17688 -2168 52676
632 52676 -47167 -81905 25364 62633 109495 109615 153048 39203 150037 201561 138920 107520
620 107520 80598 259007 222378 99217 225056 273514 238287 194607 175873 187830 146650
609 146650 -9534 23178 130705 139820 203168 330534 343219 179441 62225 -38344 -90880
598 -90880 -99541 -198768 -171196 -142512 32893 -36803 22396 187828 218222 240544 315412 451667
586 451667 488854 393702 182423 35792 19581 63245 137211 178913 133897 94482 135534
575 135534 67976 58813 112289 108889 52818 223062 147017 160764 203200 115968 91117 214098
563 214098 282524 93013 37842 134802 161585 122548 201469 314941 162461 26375 62764
552 62764 79982 158590 246242 239051 142501 29278 99592 158433 256661 190048 84152 28115
540 28115 -3142 54602 15160 46953 109542 211960 155862 95230 87603 49978 33950 20618
528 20618 98785 15128 11062 28162 50265 98840 8082 -38792 78111 139227 33409 44868
516 44868 164997 200855 113611 150489 250967 304843 131767 76987 95161 101905 173422 238016
504 238016 117271 -11710 -46680 13252 -936 -27038 73728 133023 108968 84770 41614
493 41614 93870 126602 97312 -41500 -124567 -126653 -171340 6155 223728 283185 106088
482 106088 48659 100469 45119 6843 14068 61595 -8846 -83432 -38018 26205 -88864 -220619
470 -220619 -226827 -135090 43995 6899 -82202 -163903 -138153 -101290 -86572 -19244 50049 79615
458 79615 79701 97532 232024 305903 243656 172667 263428 314183 254373 97234 214503 311150
446 311150 375209 247269 67360 -32679 42083 -19160 -128167 -79998 84861 86932 99732
435 99732 63440 25819 63513 105628 125397 180126 266482 350724 381939 347189 285649 136839
423 136839 117443 123479 225470 304620 307746 286408 309717 320906 236003 26201 -49765 76105
411 76105 135140 225033 268280 166771 165526 64538 66741 91038 149464 57851 166634 343870
399 343870 265164 164718 190083 252005 228805 182155 82284 51412 -21288 87556 301088
388 301088 248287 294293 167866 136292 170976 213464 221212 40642 63627 46868 57500 118707
376 118707 151254 117625 -32726 10524 -88410 24657 180965 249635 272802 257416 162948
365 162948 151927 277631 412296 339780 200002 88313 80692 75779 285824 428542 420280
354 420280 399770 294623 236253 202171 242116 202211 20003 32403 161731 247140 179576
343 179576 184436 170272 160634 91638 266267 272586 200002 156225 186604 173179 166212 172952 107466
330 107466 12989 77107 143019 210231 303900 166214 102077 143601 65214 19707 8372 -12151
318 -12151 3102 22466 123641 83629 85483 146643 255247 300938 255263 183655 151853 137372
306 137372 146722 202827 247088 244964 210342 109502 102538 163902 105793 53831 89392 88897 -16661
293 -16661 38416 111907 190723 213906 168008 109945 -58701 -148613 -94466 -17521 -114395 -213038
281 -213038 -240711 -161246 -96842 -32368 40155 153030 317979 233129 213051 133452 37522
270 37522 97926 22031 -47990 -53628 1248 159013 255898 54735 -112856 -55295 -21196 -66052
258 -66052 -104611 -53863 100399 159257 79897 -7123 -518 1255 -37724 23981 -642 -3897
246 -3897 151990 170765 136379 93063 22348 18499 -8735 254 -19146 -33869 -6570 95622
234 95622 182581 185853 184561 185921 213913 200837 196300 173785 86452 12085 31224 111435 72790
221 72790 175517 249655 250952 248428 253120 253112 207176 119508 94687 192586 172308 103657 128378
208 128378 126722 90031 221215 219348 156822 97346 118154 145829 182589 156597 91153 139198
196 139198 224644 246865 253500 199121 189926 133311 50498 -14241 124094 90964 46602 -2667
184 -2667 84081 84035 60772 9935 -114639 -95942 -33989 76754 111289 129001 207941 268764
172 268764 293703 308871 274175 244637 180482 138593 106229 102447 107050 55777 24417 77781
160 77781 148440 149282 188390 229663 221500 185448 115371 24701 65463 60656 55544 -39470 -107106
147 -107106 28148 102617 127350 290166 287437 196316 128610 232003 238176 153290 89721 1060
135 1060 20793 42366 -40749 -19829 1202 28910 61021 216963 254540 170251 73552 83346
123 83346 43403 -4377 -66045 -30719 -87284 9756 -6386 58750 55189 50867 115246 103807
111 103807 74575 71966 34483 18405 90100 214792 228456 238535 191866 60759 42322 60335
99 60335 67868 49803 80724 114855 142399 174742 241710 199134 160428 207075 202202 79719
87 79719 57319 150466 110395 181305 169627 199554 317592 341822 291330 217689 113132 -77253
75 -77253 -6688 -10054 -5287 125963 129947 52541 109401 150123 163665 176054 251309 211135 142244
62 142244 146075 225768 177033 196785 274092 191058 129718 138734 83342 101582 96724 64543 139966
49 139966 67593 116064 182853 177327 109300 74400 -11920 19452 86419 135348 94987 -281
37 -281 -39418 -5761 25990 101028 24523 -28774 -33079 53362 137498 104925 120111 116926 193629
24 193629 86692 74527 144431 133126 74540 95372 196798 233478 168175 191634 183411 203981
12 203981 136096 82136 89717 67450 79608 59246 85728 79505 156672 139420 184534 260705
0 260705
$$ Imaginary data points
##PAGE= N=2
##DATA TABLE= (X++(I..I)), XYDATA
32767 8537 63197 221250 274432 242852 312829 315710 217801 197846 157613 176041 191123 189768
32755 189768 261861 310399 259090 254888 211085 160237 206132 214140 117967 166666 232061 263926
32743 263926 272117 255013 365687 401699 420986 405877 423958 498879 466802 452287 512160
32732 512160 523457 417928 316970 388398 372036 353019 424513 418244 412976 385265 412751
32721 412751 369057 409877 475927 453237 443698 405568 368235 369091 382891 497684 530690 430292
32709 430292 361994 443457 426180 386779 337183 376014 459686 448626 412203 454508 367117
32698 367117 389440 411219 403843 319620 339817 395842 375285 386426 506998 507034 498344 520706
32686 520706 411922 277268 280064 371337 442528 476656 459645 557641 577940 616450 636053
32675 636053 633691 627474 567669 510583 486512 402728 390098 438440 423546 365818 460396 470451
32663 470451 425277 464456 491490 425163 270437 277987 283350 383595 555523 583344 576859
32652 576859 527056 575125 639427 589404 613148 620648 587128 561232 562453 548244 609249 598968
32640 598968 588084 640328 552689 501996 654619 706014 640856 515046 528002 564439 489890
32629 489890 410278 349256 354103 459325 512971 478880 572885 633333 587040 605893 608435 587720
32617 587720 719241 799926 705505 708254 609427 501126 518299 621185 694868 616542 623182
32606 623182 684175 707534 720304 759728 707667 670187 599051 691937 692147 678092 697203 638697
32594 638697 577450 483574 459880 520518 535439 390685 458361 570532 621269 702104 793778
32583 793778 688518 624249 738834 770707 815352 818328 715132 737403 758735 753041 772619
32572 772619 772645 738122 703530 773125 824008 801043 831169 696585 802776 864694 847237 802520
32560 802520 895520 864765 957970 1032181 879543 809895 857654 962679 832261 867706 902046
32549 902046 849180 900366 954751 990337 969676 930450 938257 925904 755664 661459 753480
$$ [...]
##END NTUPLES=NMR SPECTRUM
##END=
