##TITLE=Analysis number 327642
Compound Code mo 07344
Project Code adrs
Chemist Name ugmt
##JCAMPDX= 6.0         $$ Bruker NMR JCAMP-DX V2.0
##DATA TYPE= NMR SPECTRUM
##DATA CLASS= NTUPLES
##ORIGIN= Bruker BioSpin GmbH
##OWNER= nmr
$$ XWIN-NMR		Version 3.5
$$ Thu Mar 29 09:20:12 2007 GMT Daylight Time (UT+1h)  MAYBRIDGE\nmr@NMR_250MHZ
##.OBSERVE FREQUENCY= 250.131544655141
##.OBSERVE NUCLEUS= ^1H
##.ACQUISITION MODE= SIMULTANEOUS (DQD)
##.ACQUISITION SCHEME= undefined
##.AVERAGES= 16
##.DIGITISER RES= 18
##SPECTROMETER/DATA SYSTEM= dpx250
##.PULSE SEQUENCE= zg30
##.SOLVENT NAME= DMSO
##.SHIFT REFERENCE= (INTERNAL, DMSO, 0, 16.522)
##AUDIT TRAIL= $$ (NUMBER, WHEN, WHO, WHERE, WHAT)
$$ ##TITLE= Audit trail, XWIN-NMR		Version 3.5
$$ ##JCAMPDX= 5.01
$$ ##ORIGIN= Bruker BioSpin GmbH
$$ ##OWNER= nmr
$$ C:\u/data/dgb/nmr/ADRS/2540/pdata/1/auditp.txt
$$ ##AUDIT TRAIL=  $$ (NUMBER, WHEN, WHO, WHERE, WHAT)
(   1,<2007-03-29 09:19:45.55 +100>,<MAYBRIDGE\nmr>,<NMR_250MHZ>,
      <created by zg, POWCHK disabled, PULCHK disabled
       configuration hash MD5:
       49 4B E0 1D 92 C2 6B 37 9F E6 65 BC 52 41 86 1D
       data hash MD5: 64K
       2A F6 09 CD EA E0 06 BE 6C E3 71 69 12 06 1F C0>)
(   2,<2007-03-29 09:20:01.63 +100>,<MAYBRIDGE\nmr>,<NMR_250MHZ>,
      <Start of raw data processing
       ef LB = 0.3 FT_mod = 6 PKNL = 1 SI = 32K 
       data hash MD5: 32K
       CA 83 8D D6 31 9D EB CB 90 76 75 9E C0 FD 24 AD>)
(   3,<2007-03-29 09:20:03.29 +100>,<MAYBRIDGE\nmr>,<NMR_250MHZ>,
      <apk 
       data hash MD5: 32K
       34 DA 9A A3 C1 D1 D4 F3 35 E3 03 01 99 12 6C E4>)
(   4,<2007-03-29 09:20:04.07 +100>,<MAYBRIDGE\nmr>,<NMR_250MHZ>,
      <abs ABSG = 5 
       data hash MD5: 32K
       03 DE 75 4A 53 32 70 54 7F C6 7D C4 D1 A4 2B B6>)
$$ ##END=
$$ 
$$ hash MD5
$$ 93 AC 7A 15 C1 CD 52 90 BF 0F D9 B3 4A BA AF 69
##$RELAX= 
##$RELAX= 
##$RELAX= 
##$RELAX= 
##$RELAX= 
##$RELAX= 
##$RELAX= 
$$ Bruker specific parameters
$$ --------------------------
##$DU= <C:\u>
##$EXPNO= 2540
##$NAME= <ADRS>
##$PROCNO= 1
##$TYPE= <nmr>
##$USER= <dgb>
##$AMP= (0..31)
100 100 100 100 100 100 100 100 100 100 100 100 100 100 100 100 100 100 
100 100 100 100 100 100 100 100 100 100 100 100 100 100 
##$AQSEQ= 0
##$AQ_mod= 3
##$AUNM= <au_zg>
##$AUTOPOS= <60 >
##$BF1= 250.13
##$BF2= 250.13
##$BF3= 250.13
##$BF4= 250.13
##$BF5= 500.13
##$BF6= 500.13
##$BF7= 500.13
##$BF8= 500.13
##$BYTORDA= 1
##$CFDGTYP= 0
##$CFRGTYP= 5
##$CHEMSTR= <none>
##$CNST= (0..31)
1 1 145 1 1 1 1 1 1 1 1 1 1 1 1 1 1 1 1 1 1 1 1 1 1 1 1 1 1 1 1 1 
##$CPDPRG= <>
##$CPDPRG1= <>
##$CPDPRG2= <>
##$CPDPRG3= <>
##$CPDPRG4= <mlev>
##$CPDPRG5= <mlev>
##$CPDPRG6= <mlev>
##$CPDPRG7= <mlev>
##$CPDPRG8= <mlev>
##$CPDPRGB= <>
##$CPDPRGT= <>
##$D= (0..31)
0 1 0 0 0 0 0 0 0 0.06 0 0 0 0 0 0 0.0002 0 0 0 0 0 0 0 0 0 0 0 0 0 0 
0 
##$DATE= 1175156384
##$DBL= (0..7)
120 120 120 120 120 120 120 120 
##$DBP= (0..7)
150 150 150 150 150 150 150 150 
##$DBP07= 0
##$DBPNAM0= <>
##$DBPNAM1= <>
##$DBPNAM2= <>
##$DBPNAM3= <>
$$ [...]
##$SUBNAM7= <"">
##$SUBNAM8= <"">
##$SUBNAM9= <"">
##$SW= 20.6930455092707
##$SWIBOX= (0..15)
0 0 3 0 0 0 0 0 0 0 0 0 0 0 0 0 
##$SW_h= 5175.983436853
##$TD= 65536
##$TD0= 1
##$TE= 683.16
##$TE2= 300
##$TE3= 300
##$TEG= 300
##$TL= (0..7)
0 120 120 120 120 120 120 120 
##$TP= (0..7)
150 150 150 150 150 150 150 150 
##$TP07= 0
##$TPNAME0= <>
##$TPNAME1= <>
##$TPNAME2= <>
##$TPNAME3= <>
##$TPNAME4= <>
##$TPNAME5= <>
##$TPNAME6= <>
##$TPNAME7= <>
##$TPOAL= (0..7)
0.5 0.5 0.5 0.5 0.5 0.5 0.5 0.5 
##$TPOFFS= (0..7)
0 0 0 0 0 0 0 0 
##$TUNHIN= 0
##$TUNHOUT= 0
##$TUNXOUT= 0
##$USERA1= <user>
##$USERA2= <user>
##$USERA3= <user>
##$USERA4= <user>
##$USERA5= <user>
##$V9= 5
##$VALIST= <valist>
##$VCLIST= <CCCCCCCCCCCCCCC>
##$VD= 0
##$VDLIST= <DDDDDDDDDDDDDDD>
##$VPLIST= <PPPPPPPPPPPPPPP>
##$VTLIST= <TTTTTTTTTTTTTTT>
##$WBST= 1024
##$WBSW= 4
##$XGAIN= (0..3)
0 0 0 0 
##$XL= 0
##$YL= 0
##$YMAX_a= 213599
##$YMIN_a= -270219
##$ZGOPTNS= <>
##$ZL1= 120
##$ZL2= 120
##$ZL3= 120
##$ZL4= 120
##$ABSF1= 16.522
##$ABSF2= -4.171173
##$ABSG= 5
##$ABSL= 3
##$ALPHA= 0
##$AQORDER= 0
##$ASSFAC= 0
##$ASSFACI= 0
##$ASSFACX= 0
##$ASSWID= 0
##$AUNMP= <proc_1d>
##$AZFE= 0.1
##$AZFW= 0.1
##$BCFW= 0
##$BC_mod= 0
##$BYTORDP= 0
##$COROFFS= 0
##$CY= 12.5
##$DATMOD= 1
##$DC= 0
##$DFILT= <>
##$DTYPP= 0
##$F1P= 14.0000005364418
##$F2P= -0.99999901652339
##$FCOR= 0.5
##$FTSIZE= 32768
##$FT_mod= 6
##$GAMMA= 0
##$GB= 0
##$INTBC= 1
##$INTSCL= 1
##$ISEN= 128
##$LB= 0.3
##$LEV0= 0
##$LPBIN= 0
##$MAXI= 10000
##$MC2= 0
##$MEAN= 0
##$ME_mod= 0
##$MI= 0
##$NCOEF= 0
##$NC_proc= -5
##$NLEV= 6
##$NOISF1= 0
##$NOISF2= 0
##$NSP= 0
##$NTH_PI= 0
##$NZP= 0
##$OFFSET= 16.522
##$PC= 1
##$PHC0= 224.7094
##$PHC1= 7.811711
##$PH_mod= 1
##$PKNL= yes
##$PPARMOD= 0
##$PSCAL= 4
##$PSIGN= 0
##$REVERSE= no
##$SF= 250.13
##$SI= 32768
##$SIGF1= 0
##$SIGF2= 0
##$SINO= 400
##$SIOLD= 32768
##$SREGLST= <1H.DMSO>
##$SSB= 0
##$STSI= 32768
##$STSR= 0
##$SW_p= 5175.98343685301
##$SYMM= 0
##$S_DEV= 0
##$TDeff= 65536
##$TDoff= 0
##$TI= <Analysis number 999999
Compound Code 99
Book Reference 9
Project Code 9>
##$TILT= no
##$TM1= 0
##$TM2= 0
##$TOPLEV= 0
##$USERP1= <user>
##$USERP2= <user>
##$USERP3= <user>
##$USERP4= <user>
##$USERP5= <user>
##$WDW= 1
##$XDIM= 32768
##$YMAX_p= 477298200
##$YMIN_p= -679958
$$ End of Bruker specific parameters
$$ ---------------------------------
##NTUPLES= NMR SPECTRUM
##VAR_NAME=  FREQUENCY,     SPECTRUM/REAL,   SPECTRUM/IMAG
##SYMBOL=    X,             R,               I
##VAR_TYPE=  INDEPENDENT,   DEPENDENT,       DEPENDENT
##VAR_FORM=  AFFN,          ASDF,            ASDF
##VAR_DIM=   32768,         32768,           32768
##UNITS=     HZ,            ARBITRARY UNITS, ARBITRARY UNITS
##FACTOR=    0.157963299565203, 1,           1
##FIRST=     4132.6476996994, 0,             0
##LAST=      -1043.33573715361, 0,           0
##MIN=       -1043.33573715361, -679958,     0
##MAX=       4132.6476996994, 477298200,     0
$$ Real data points
##PAGE= N=1
##DATA TABLE= (X++(R..R)), XYDATA
$$ [...]
$$ plain form
17196 109436 161012 172846 92885 -81160 15299 106309 84695 118563 20134 -167340 -34643
17185 -34643 -26572 22842 -82693 11949 113627 153322 226214 56590 -53533 -52433 -25577
17174 -25577 -24547 123831 103813 -148006 -331508 -380381 -223865 -65421 127576 116904 36118
17163 36118 -74642 -125216 -47116 -108282 -91043 11053 -11456 -367501 -445193 -389437 -273739
17152 -273739 -328777 -224374 -200690 -262193 -255004 -147924 82465 271008 200205 113885 218087
17141 218087 168922 99145 51043 81186 220259 137296 115645 107418 110643 110576 88596 77260
17129 77260 -15273 -230430 -201011 -126390 53478 5363 -72761 -52636 -8173 -57270 60092
17118 60092 15352 19226 116454 180861 104069 142690 5396 -2388 -96830 -89570 -81165 44028
$$ packed form
17196A09436N1576J1834p9961j74045R6459R1010k1614L3868r8429j87474J32697
17185c4643Q071M9414j05535R4642J01678L9695P2892j69624j10123J100K6856
17174b5577J030J48378k0018k51819j83502m8873J56516J58444J92997j0672q0786
17163C6118j10760n0574P8100o1166J7239J02096k2509l56045p7692N5756J15698
17152b73739n5038J04403K3684o1503P189J07080K30389J88543p0803q6320J04202
17141B18087m9165o9777m8102L0143J39073q2963k1651q227L225o7k1980j1336
17129G7260r2533k15157K9419P4621J79868m8115p8124K0125M4463m9097J17362
17118F0092m4740L874R7228O4407p6792L8621j37294p784r4442P260Q405J25193
$$ plain form
17106 44028 8596 -9745 116229 -22429 -120979 -79901 -148461 -163390 34862 155278 42294
17095 42294 -8868 95553 146039 59989 44190 -101192 -222875 -269632 -253546 -192454 -228498
17084 -228498 -321887 -350822 -226505 -98348 113675 280642 361183 277479 226912 131786 32693
17073 32693 -44074 -59719 -12196 158841 399621 272283 203230 257577 285650 249097 64946
17062 64946 43514 2507 -2285 -209504 -306332 -130466 7216 -39128 1893 72076 56392
17051 56392 127114 139495 -55489 -137570 -219469 -276368 -235454 -159348 -120210 -204790 -257586
17040 -257586 -219271 -172520 -318855 -223157 -229459 -339714 -171542 3593 84383 39727 62893
17029 62893 -45938 -78314 53942 139230 107727 120982 138162 143346 50000 29830 104231
$$ packed form
17106D4028l5432j8341J25974j38658r8550M1078o8560j4929J98252J20416j12984
17095D2294n1162J04421N0486q6050j5799j45382j21683m6757J6086O1092l6044
17084b28498r3389k8935J24317J28157K12023J66967Q0541q3704n0567r5126r9093
17073C2693p6767j5645M7523J71037K40780j27338o9053N4347K8073l6553j84151
17062F4946k1432m1007m792k07219r6828J75866J37682m6344M1021P0183j5684
17051E6392P0722J2381j94984q2081q1899n6899M0914P6106L9138q4580n2796
17040b57586L8315M6751j46335R5698o302j10255J68172J75135Q0790m4656K3166
17029F2893j08831l2376J32256Q5288l1503J3255J7180N184r3346k0170P4401
$$ plain form
17018 104231 20687 -67794 -63472 63387 103302 189435 99799 -37907 -210395 -212444 -153672
17007 -153672 -83230 -238921 -283048 -270996 -288487 -295363 -234053 -156899 -306716 -278869 -181893
16996 -181893 -217697 -120738 -20360 -3489 82178 146665 224130 55687 -57519 -1771 -129163
16985 -129163 -40678 234265 172764 -159138 -203142 -182928 -126375 -88600 -172777 -70347 32671
16974 32671 63722 161 78958 145319 98365 59510 128712 78499 48103 178980 217842
16963 217842 216897 100137 141447 153836 318812 335287 300398 147423 -35412 -107090 -109895
16952 -109895 -97599 -40174 -45545 -165137 -307709 -428950 -443321 -358177 -260701 -255100 -219978
16941 -219978 -242353 -186935 -117145 -117549 10441 111220 103232 107594 265577 105587 -15379
$$ packed form
17018A04231q3544q8481M322J26859L9915Q6133q9636j37706j72488k049N8772
17007a53672P0442j55691m4127J2052j7491o876O1310P7154j49817K7847R6976
16996a81893l5804R6959J00378J6871Q5667O4487P7465j68443j13206N5748j27392
16985a29163Q8485K74943o1501l31902m4004K0214N6553L7775q4177J02430J03018
16974C2671L1051o3561P8797O6361m6954l8855O9202n0213l0396J30877L8862
16963B17842r45j16760M1310J2389J64976J6475l4889j52975j82835p1678k805
16952a09895J2296N7425n371j19592j42572j21241j4371Q5144R7476N601L5122
16941b19978k2375N5418O9790m04J27990J00779p988M362J57983j59990j20966
$$ plain form
16930 -15379 -111157 -171575 -212062 -150804 -328620 -361706 -193969 -157068 -47350 7634 -41151
16919 -41151 16238 139342 196167 281497 140064 120026 -74613 -212688 -212779 -73727 -97040
16908 -97040 -24056 64405 55117 99846 -105298 -157663 -93929 -71862 -69035 56989 -5299 -63756
16896 -63756 -116408 -61990 1204 51847 63421 122357 -20448 -253720 -286825 -129130 -31509
16885 -31509 85541 197606 218171 91682 -41152 -79473 -68595 -85414 -40891 -11624 -75652
16874 -75652 -177320 -268936 -140710 97877 59745 166968 204809 106297 66471 -22330 -98216
16863 -98216 -169956 -222343 -172137 143899 279675 29840 -38158 -111836 -228186 -59672 64835
16852 64835 -148879 -269684 -315136 -354629 -554159 -487777 -333789 -229508 -97370 35923
$$ packed form
16930a5379r5778o0418m0487O1258j77816l3086J67737L6901J09718N4984m8785
16919d1151N7389J23104N6825Q5330j41433k0038j94639j38075r1J39052k3313
16908i7040P2984Q8461r288M4729k05144n2365O3734K2067K827J26024o2288n8457
16896f3756n2652N4418O3194N0643J1574N8936j42805k33272l3105J57695R7621
16885c1509J17050J12065K0565j26489j32834l8321J0878j6819M4523K9267o4028
16874g5652j01668r1616J28226K38587l8132J07223L7841r8512l9826q8801p5886
16863i8216p1740n2387N0206L16036J35776k49835o7998p3678j16350J68514J24507
16852F4835k13714j20805m5452l9493j99530O6382J53988J04281J32138J33293
$$ plain form
16842 35923 -13162 -281410 -209353 30023 138155 219884 338774 211480 29941 -16348
16832 -16348 42217 118441 34412 -40478 36699 46469 -49265 -253783 -208163 -305989 -353962 -336759
16820 -336759 -199508 -80507 -121110 -130552 -104670 -135453 -231450 -261773 -215315 -156700 -162406
16809 -162406 -99687 -155280 -132871 -233559 -300207 -233236 -141496 -145641 -141651 -40396 389
16798 389 -12412 -92453 -100054 -12095 -46153 8625 104443 83954 37650 184238 -82535 -82639
16786 -82639 -2093 -19103 190 178196 99565 50131 45494 -58689 -107757 -153343 -368187
16775 -368187 -446857 -453991 -296766 -202638 -117175 -81369 36507 98076 -61554 -103405 27188
16764 27188 734 -9180 -142017 -264147 -256310 -139429 63119 160196 320356 281113 272920
$$ packed form
16842C5923m9085k68248P2057K39376J08132Q1729J18890j27294j81539m6289
16832a6348N8565P6224q4029p4890P7177R770r5734k04518M5620r7826m7973J7203
16820c36759J37251J19001m0603r442K5882l0783r5997l0323M6458N8615n706
16809a62406O2719n5593K2409j00688o6648O6971R1740m145L990J01255M0785
16798C89j2801q0041p601Q7959l4058N4778R5818k0489m6304J46588k66773j04
16786h2639Q0546j7010J9293J78006p8631m9434m637j04183m9068m5586k14844
16775c68187p8670p134J57225R4128Q5463L5806J17876O1569j59630m1851J30593
16764B7188k6454r914j32837j22130P837J16881K02548R7077J60160l9243q193
$$ plain form
16753 272920 153198 28318 -72465 -139613 -153860 -63026 104490 145109 122802 59802 -1292
16742 -1292 -31163 -85531 -125348 -209686 -121653 -190761 -206266 -79056 -50159 -42535 7954 44337
16730 44337 93227 -28723 -200026 -303271 -318647 -206198 -93882 -87740 26482 784 -40755
16719 -40755 -253404 -308828 -102666 105037 214924 246468 135903 136288 -11556 -66548 3651
16708 3651 -85703 76411 163398 4507 -77106 9497 -364 77848 132877 74078 31931 49962
16696 49962 41424 35134 173724 57441 -95748 102889 175117 38983 -101995 -98516 -103669
16685 -103669 -98735 -83904 -130306 -120204 140249 192946 123673 115928 66705 63253 -78465 -13636
16673 -13636 40121 -133560 -229487 -217127 -74564 3618 -6192 -66648 -35735 -26869 91621
$$ packed form
16753B72920j19722j24880j00783o7148j4247R0834J67516M0619k2307o3000o1094
16742a292k9871n4368l9817q4338Q8033o9108j5505J27210K8897P624N0489L6383
16730D4337M8890j21950j71303j03245j5376J12449J12316O142J14222k5698m1539
16719d0755k12649n5424K06162K07703J09887L1544j10565L85j47844n4992P0199
16708C651q9354J62114Q6987j58891q1613Q6603r861P8212N5029n8799m2147J8031
16696D9962q538o290J38590j16283j53189J98637P2228j36134j40978L479n153
16685a03669M934J4831m6402J0102K60453N2697o9273p745m9223l452j41718O4829
16673a3636N3757j73681r5927J2360J42563P8182r810o0456L0913Q866J18490
$$ plain form
16662 91621 64497 -43730 -252855 -171429 -18268 -16712 68656 11406 49117 146209 200494
16651 200494 144992 146181 201297 71403 -13772 84042 73046 -76015 -51068 -60392 -94227
16640 -94227 -39770 -91865 -9954 65557 178356 212463 210398 127112 4902 44603 92759
16629 92759 71415 -62148 -263796 -274070 -262077 -179017 -156541 -184460 -131214 -67712 -77018
16618 -77018 -95525 -115565 -80457 66202 173475 17971 -203127 -502458 -441059 -129706
16608 -129706 -26983 -1602 120756 24447 -71407 -169898 -317546 -173282 -51656 19177
16598 19177 22013 -27924 -114474 -266678 -217787 -128476 -19040 95327 5885 -68963 -68542 130149
16586 130149 199929 160244 255619 179407 -85918 -147807 -18671 154057 51366 -29069 38756
$$ packed form
16662I1621k7124j08227k09125Q1426J53161J556Q5368n7250L7711R7092N4285
16651B00494n5502J189N5116j29894q5175R7814j0996j49061K4947r324l3835
16640i4227N4457n2095Q1911P5511J12799L4107k065q3286j22210L9701M8156
16629I2759k1344j33563k01648j0274J1993Q3060K2476k7919N3246O3502r306
16618g7018j8507k0040L5108J46659J07273j55504k21098k99331O1399L11353
16608a29706J02723K5381J22358r6309r5854r8491j47648J44264J21626P0833
16598A9177K836m9937q6550j52204M8891Q9311J09436J14367q9442p4848M21J98691
16586A30149O9780l9685R5375p6212k65325o1889J29136J72728j02691q0435O7825
$$ plain form
16575 38756 -98834 -279167 -96594 -79963 -272581 -512218 -475115 -429157 -326941 -42704
16565 -42704 95161 104297 46441 90938 -11354 -62531 49336 243753 319435 168681 -29732
16554 -29732 -100105 -224581 -239480 -80834 -58556 -98126 -69754 5439 81737 -897 36257
16543 36257 -78708 -37211 35695 1318 -18483 -91453 -157129 -188904 -197033 -161655 -54099
16532 -54099 40046 -47259 2391 98454 79095 -93547 -67544 33646 168635 81734 116763
16521 116763 -33445 -66521 3182 -20050 -232393 -219355 -176060 -92146 -139690 -172546 -281312
16510 -281312 -300370 -177831 -157336 -131281 -163041 -117929 16834 3837 -24410 -12458 109618
16499 109618 42161 -236897 -214041 -46555 63554 107400 141563 169055 183114 75204 -16335
$$ packed form
16575C8756j37590j80333J82573J6631j92618k39637L7103M5958J02216K84237
16565d2704J37865R136n7856M4497j02292n1177J11867J94417P5682j50754j98413
16554b9732p0373j24476j4899J58646K2278l9570K8372P5193P6298q2634L7154
16543C6257j14965M1497P2906l4377j9801p2970o5676l1775q129L5378J07556
16532e4099R4145q7305M9650R6063j9359j72642K6003J01190J34989q6901L5029
16521A16763j50208l3076O9703k3232k12343J3038M3295Q3914m7544l2856j08766
16510b81312j9058J22539K0495K6055l1760M5112J34763j2997k8247J1952J22076
16499A09618o7457k79058K2856J67486J10109M3846L4163K7492J4059j07910r1539
$$ plain form
16488 -16335 -22641 -20863 -24386 7761 39190 10088 28225 51587 -33972 -61071 -16798 22473
16476 22473 112990 1805 24862 -38785 -49611 12867 -3325 -56797 -60379 44932 30540
16465 30540 -54952 -199526 -111733 -179483 -311236 -45241 6351 -58189 -241138 -429416 -371100
16454 -371100 -98337 19186 34269 59466 4791 94278 106827 213001 209085 337957 253170
16443 253170 290093 275894 244392 157773 112047 -648 -38884 41133 12455 -677 -36336
16432 -36336 -121449 -49914 -46838 154381 271850 88993 184983 59280 -60555 -59662 15500
16421 15500 106296 47663 40882 -81593 -312772 -519824 -453128 -233844 -208370 -138428 -218944
16410 -218944 -161289 -87097 -185278 -100712 -43297 -56675 -28968 -44672 -92846 -206610 -272024
$$ packed form
16488a6335o306J778l523L2147L1429k9102J8137K3362q5559k7099M4273L9271
16476B2473R0517j11185K3057o3647j0826O2478j6192n3472l582J05311j4392
16465C0540q5492j44574Q7793o7750j31753K65995N1592o4540j82949j88278N8316
16454c71100K72763J17523J5083K5197n4675Q9487J2549J06174l916J28872q4787
16443B53170L6923j4199l1502q6619m5726j12695l8236Q0017k8678j3132l5659
16432c6336q5113P1535L076K01219J17469j82857R5990j25703j19835Q93P5162
16421A5500R0796n8633o781j22475k31179k07052O6696K19284K5474O9942q0516
16410b18944N7655P4192r8181Q4566N7415j3378K7707j5704m8174j13764o5414
$$ plain form
16399 -272024 -131103 -42391 -67506 -29599 -53267 -46508 140731 123220 -142019 -73769 58376
16388 58376 -56797 88813 232019 350856 268306 166786 86305 74495 -15427 -15153 -15937
16377 -15937 32958 -84871 -105653 36279 -32869 -128255 5625 128352 210110 186618 161938
16366 161938 309717 201473 -75968 -158703 -98327 30656 79276 1116 -96851 -53759 127194
16355 127194 143437 208742 164974 80520 53991 -75880 -138056 -13267 28729 -6418 53384
16344 53384 123865 33354 -83830 -117363 -108409 41071 169416 200796 192193 65611 -19404
16333 -19404 -166391 -274921 -131654 27034 -71300 -183372 -95442 -160784 -247209 -192659 -138063
16322 -138063 90399 84448 93574 162557 189285 167841 -29958 -74476 10999 66748 174373
$$ packed form
16399b72024J40921Q8712k5115L7907k3668O759J87239j7511k65239O8250J32145
16388E8376j15173J45610J43206J18837q2550j01520q0481j1810q9922K74p84
16377a5937M8895j17829k0782J41932o9148r5386J33880J22727Q1758k3492k4680
16366A61938J47779j08244k77441q2735O0376J28983M8620p8160r7967M3092J80953
16355A27194J6243O5305m3768q4454k6529j29871o2176J24789M1996l5147N9802
16344E3384P0481r0511j17184l3533Q954J49480J28345L1380q603j26582q5015
16333a9404j46987j08530J43267J58688r8334j12072Q7930o5342q6425N4550N4596
16322a38063K28462n951R126O8983K6728k1444j97799m4518Q5475N5749J07625
$$ plain form
16311 174373 259220 140176 -110722 -324558 -310864 -233569 -199919 -169764 -155586 -79519 -20385
16300 -20385 -51947 52626 87174 86334 87917 145435 124633 -91494 94615 325459 164401
16289 164401 34131 -170435 -42354 52699 -77813 -73828 -113191 -146694 -137763 12449 126784
16278 126784 128774 161855 27337 -74187 44525 173477 176193 91303 39943 -9834 98256
16267 98256 156858 16058 -122718 -42497 25255 -79587 -132073 -85106 144581 275405 198728
16256 198728 335270 176258 -43071 -185951 -110017 -106356 -142783 -84584 1678 79100 -51130
16245 -51130 -149070 -39475 23136 50712 156679 235736 105721 10230 -102808 -24393 -73374
16234 -73374 -118608 -151412 -70322 -159324 -138707 38422 -135204 -135398 -45630 -46792 -140021 -117859
$$ packed form
16311A74373Q4847j19044k50898k13836J3694P7295L3650L0155J4178P6067N9134
16300b0385l1562J04573L4548q40J583N7518k0802k16127J86109K30844j61058
16289A64401j30270k04566J28081R5053j30512L985l9363l3503Q931J50212J14335
16278A26784J990L3081j34518j01524J18712J28952K716q4890n1360m9777J08090
16267I8256N8602j40800j38776Q0221O7752j04842n2486M6967K29687J30824p6677
16256A98728J36542j59012k19329j42880P5934L661l6427N8199Q6262P7422j30230
16245e1130r7940J09595O2611K7576J05967P9057j30015r5491j13038P8415m8981
16234g3374m5234l2804Q1090q9002K0617J77129j73626j94Q9768j162r3229K2162
$$ plain form
16222 -117859 -106966 -64402 -149678 -241017 -262351 -226849 -121903 -7144 61647 2638 22588
16211 22588 44238 -136206 -228569 -190698 -187531 -44948 4007 -40828 -55920 -215431 -159156
16200 -159156 -159239 -375410 -497617 -369322 -129823 14177 -94331 -238655 -50695 178750
16190 178750 303038 149746 -15857 66961 -43925 3645 130183 101211 6593 81867
16180 81867 43379 -11037 -21356 -39327 56099 46431 106060 218335 238646 112483 -71508
16169 -71508 -132938 -37949 78343 -16383 -78134 -24098 -98828 -135329 -98129 -68882 -113318
16158 -113318 -121827 -34185 32092 183763 25664 99340 130963 136832 154712 262876 161322
16147 161322 37649 42019 -30265 -159044 -126405 -165205 -159818 -69525 -129563 -118309 -170456
$$ packed form
16222a17859J0893M2564q5276r1339k1334L5502J04946J14759O8791n9009J9950
16211B2588K1650j80444r2363L7871L167J42583M8955m4835j5092j59511N6275
16200a59156q3k16171j22207J28295K39499J44000j08508j44324J87960K29445
16190A78750J24288j53292j65603Q2818j10886M7570J26538k8972r4618P5274
16180H1867l8488n4416j0319j7971R5426r668N9629J12275K0311j26163j83991
16169g1508o1430R4989J16292r4726o1751N4036p4730l6501L7200K9247m4436
16158a13318q509Q7642O6277J51671j58099P3676L1623N869J7880J08164j01554
16147A61322j23673M370p2284j28779L2639l8800N387R0293o0038J1254n2147
$$ plain form
16136 -170456 -112367 125417 181565 69529 -10256 -3368 91792 45285 22096 132437 191213
16125 191213 39909 29755 -151124 -233499 -223428 -225977 -140251 -156903 -130235 -19154 -34994
16114 -34994 -190091 -315990 -161326 -38385 -52841 -132508 -116273 -70126 18621 -129015 -172228
16103 -172228 -10819 40029 -29351 63379 98900 170285 122675 31330 -32033 61192 -21626
16092 -21626 -169912 -149987 -90277 44583 131596 -6413 -13405 163627 20530 -209755 -264960
16081 -264960 -137011 -49573 -64906 -84412 -53249 -14387 -25821 48767 1677 -42943 -25359
16070 -25359 -22498 16416 61104 116885 276132 220643 37160 -93734 -183583 -131109 -140865
16059 -140865 -249122 -145276 29839 80273 126151 -58255 -221068 -160568 63287 159918
$$ packed form
16136a70456N8089K37784N6148j12036p9785O888R5160m6507k3189J10341N8776
16125A91213j51304j0154j80879q2375J0071k549Q5726j6652K6668J11081j5840
16114c4994j55097j25899J54664J22941j4456p9667J6235M6147Q8747j47636m3213
16103a72228J61409N0848o9380R2730L5521P1385m7610r1345o3363R3225q2818
16092b1626j48286J9925N9710J34860Q7013j38009o992J77032j43097k30285n5205
16081b64960J27949Q7438j5333j9506L1163L8862j1434P4588m7090m4620J7584
16070b5359K861L8914M4688N5781J59247n5489j83483j30894q9849N2474r756
16059a40865j08257J03846J75115N0434M5878j84406j62813O0500K23855R6631
$$ plain form
16049 159918 194283 44551 -89416 -158007 -153479 -119636 -82836 -32011 -21134 87013 93016
16038 93016 137758 213274 204761 18285 84013 10186 -30444 47016 73621 -57286 -138144
16027 -138144 -44418 -36319 -100456 -81360 -39552 -22711 -24784 -152137 -159351 55048 -64279
16016 -64279 -191960 -222571 -206370 -36790 119137 143107 42308 -81129 -184363 -238601
16006 -238601 -283055 -210259 -109451 -236621 -220650 59263 142553 128776 6796 -141455
15996 -141455 -144860 -31058 82153 68167 28890 26041 -17203 -148373 -27763 170001 145314
15985 145314 -17840 -44007 60443 16423 176477 171073 135572 87023 79248 105193 24107
15974 24107 -144254 -208067 -108821 -209202 -126954 56926 63343 -82175 -147323 -120232 -184495
$$ packed form
16049A59918L4365j49732j33967o8591M528L3843L6800N0825J0877J08147O003
16038I3016M4742P5516q513j86476O5728p3827m0630P7460K6605j30907q0858
16027a38144R3726Q099o4137J9096M1808J6841k073j27353p214K14399j19327
16016f4279j27681l0611J6201J69580J55927K3970j00799j23437j03234n4238
16006b38601m4454P2796J00808j27170J5971K79913Q3290j3777j21980j48251
15996a41455l405J13802J13211j3986l9277k849m3244j31170J20610J97764k4687
15985A45314j63154k6167J04450m4020J60054n404l5501m8549p775K5945q1086
15974B4107j68361o3813R9246j00381Q2248J83880O417j45518o5148K7091o4263
$$ plain form
15963 -184495 -215440 -300266 -210516 -243095 -257100 -359866 -242693 -129790 -229770 -115482 -180491
15952 -180491 -73494 22435 -101919 -45413 9498 77805 44750 130868 214580 101441 43818
15941 43818 103594 221783 174829 213932 110544 -38750 2037 -153935 -216163 -112791 -282234
15930 -282234 -216599 -61297 -63233 2586 64216 74378 131360 -16380 -297039 -256130 -214324
15919 -214324 -220279 -58777 68403 54457 88039 129013 126749 87051 -21181 7744 -21273
15908 -21273 84351 -29520 -199371 -198305 -96263 17727 26162 -45589 -29828 -644 89799
15897 89799 160684 72210 -94388 -167302 -113039 12496 53139 -31718 -43542 -6569 -19166
15886 -19166 13217 37515 -21389 -94377 -235260 -213112 13190 29593 173011 158720 -25549
$$ packed form
15963a84495l0945q4826Q9750l2579j4005j02766J17173J12903r9980J14288o5009
15952a80491J06997R5929j24354N6506N4911O8307l3055Q6118Q3712j13139n7623
15941D3818N9776J18189m6954L9103j03388j49294M0787j55972o2228J03372j69443
15930b82234O5635J55302j936O5819O1630J0162N6982j47740k80659M0909M1806
15919b14324n955J61502J27180j3946L3582M0974k264l9698j08232K8925k9017
15908b1273J05624j13871j69851J066J02042J13990Q435p1751J5761K9184R0443
15897H9799P0885q8474j66598p2914N4263J25535M0643q4857j1824L6973j2597
15886a9166L2383K4298n8904p2988j40883K2148K26302J6403J43418j4291j84269
$$ plain form
15875 -25549 -36181 -1070 124541 43077 -142688 -182221 -154809 -97177 33081 68056 70898
15864 70898 65186 6212 -12812 -3134 -174003 -193885 -49307 137577 232754 282655 184775
15853 184775 108748 28568 36969 127171 48562 33461 170786 109205 130997 166479 104143
15842 104143 32973 179600 87014 -66705 -60054 -239984 -305000 -156248 -63596 -124629 -125016
15831 -125016 -44863 48424 75671 24229 59678 -18313 -158277 -231628 -27701 -37266 -84547
15820 -84547 89506 66807 -17281 -24342 39076 6167 -48753 -46477 41743 -78399 -143245 -114893
15808 -114893 -28250 -129010 -147938 -123100 -159914 -149917 -161860 78616 149043 136331 145205
15797 145205 113960 -147268 -258841 -189304 -81530 -42525 -42848 -115929 -100993 -124046 -145827
$$ packed form
15875b5549j0632L5111J25611q1464j85765l9533K7412N7632J30258L4975K842
15864G0898n712n8974j9024R678j70869j9882J44578J86884R5177M9901r7880
15853A84775p6027q0180Q401R0202p8609j5101J37325o1581K1792L5482o2336
15842A04143p1170J46627r2586j53719O651j79930o5016J48752R2652o1033l87
15831a25016Q0153R3287K7247n1442L5449p7991j39964p3351K03927r565m7281
15820h4547J74053k2699q4088p061O3418l2909n4920K276Q8220j20142o4846K8352
15808a14893Q6643j00760j8928K4838l6814R997j1943K40476P0427j2712Q874
15797A45205l1245k61228j11573O9537J07774L9005l23p3081J4936k3053k1781
$$ plain form
15786 -145827 -43468 35750 75517 120285 30261 -249008 -300973 -131875 -224594 -302188 -295700
15775 -295700 -164670 12186 -17858 -200355 -270278 -276487 -232167 -143077 -12201 -92572 -258088
15764 -258088 -186028 -126242 -114710 -27661 -84373 -198728 -1521 9211 50049 96518 -21049
15753 -21049 -108722 73620 222527 170539 171782 338110 337332 379480 442535 283356 100589
15742 100589 -92387 -65878 -135498 -156355 -135111 103432 194495 157145 175555 194368 192350
15731 192350 285487 129226 -91378 -63676 -76795 96208 75924 -50127 122446 162550
15721 162550 125366 228368 151097 -85332 -252469 -403889 -367851 -427588 -369276 -239313
15711 -239313 -133536 -163842 -144572 -140329 -71556 61982 123276 44440 -4106 61268 24547
$$ packed form
15786a45827J02359P9218L9767M4768r0024k79269n1965J69098r2719p7594O488
15775b95700J31030J76856l0044j82497o9923o209M4320Q9090J30876q0371j65516
15764b58088P2060N9786J1532Q7049n6712j14355J97207J0732M0838M6469j17567
15753b1049q7673J82342J48907n1988J243J66328p78M2148O3055j59179j82767
15742A00589j92976K6509o9620k0857K1244K38543R1063l7350J8410J8813k018
15731A92350R3137j56261k20604K7702j3119J73003k0284j26051J72573M0104
15721A62550l7184J03002p7271k36429j67137j51420L6038n9737N8312J29963
15711b39313J05777l0306J9270M243O8773J33538O1294p8836m8546O5374l6721
$$ plain form
15700 24547 66609 104202 36272 -115836 -230185 -129879 -92312 -36060 -187094 -281015 -212267
15689 -212267 -274905 -355517 -368290 -292775 -240456 -167429 -121691 44586 70567 -62104 -125303
15678 -125303 -206408 -158891 -44003 -61521 -119515 -79138 -65884 -121277 -253763 -292388 -129990
15667 -129990 7526 158418 -163763 -237456 -222463 -200171 -383608 -366022 -303052 -239869 -118258
15656 -118258 -20547 -60285 28808 99095 -950 -22738 29116 -63537 -183600 -97582 -92405
15645 -92405 -127696 -216546 -211531 -34822 43807 -53223 -62729 -145690 -161333 -213917 -247081 -262689
15633 -262689 -244997 -118867 149937 243068 135265 -6968 -24404 61289 79260 174324 194752
15622 194752 25324 -86826 -7270 65786 124790 152886 142559 40670 120673 62177 28849
$$ packed form
15700B4547M2062L7593o7930j52108j14349J00306L7567N6252j51034r3921O8748
15689b12267o2638q0612j2773P5515N2319P3027M5738J66277K5981j32671o3199
15678a25303q1105M7517J14888j7518n7994M0377J3254n5393j32486l8625J62398
15667a29990J37516J50892l22181p3693J4993K2292j83437J7586O2970O3183J21611
15656a18258R7711l9738Q9093P0287j00045k1788N1854r2653j20063Q6018N177
15645i2405l5291q8850N015J76709P8629r7030r506q2961j5643n2584l3164j5608
15633b62689J7692J26130K68804R3131j07803j42233j7436Q5693J7971R5064K0428
15622A94752j69428j12150P9556P3056N9004K8096j0327j01889Q0003n8496l3328
$$ plain form
15611 28849 -160396 -231537 -203967 -62079 34325 -126259 -120839 -23897 12703 -7138 -18855
15600 -18855 98284 48903 -36648 -230302 -387732 -482010 -293346 -150948 -156397 -105905 -114327
15589 -114327 -31187 -52920 -42488 -187549 -140467 -247837 -125301 -51865 -163902 -190673 -37713
15578 -37713 66697 -131007 -189919 -282114 -195961 -17264 76152 -106616 -182289 -61396 -49247
15567 -49247 -26667 -83292 -187067 -211123 -127481 -196535 -204004 -105534 -47781 -57750 -19962 17848
15555 17848 109595 -83019 -424607 -448698 -298811 -101818 29832 68928 -21568 50123 16922
15544 16922 -141509 -92126 -43985 -34556 -55191 -16225 91264 36856 -6922 175855 159238
15533 159238 95892 74504 216928 250426 212244 190987 92002 -158371 -45621 111384 89061
$$ packed form
15611B8849j89245p1141K7570J41888R6404j60584N420R6942L6600j9841j1717
15600a8855J17139m9381q5551j93654j57430r4278J88664J42398n449N0492q422
15589a14327Q3140k1733J0432j45061M7082j07370J22536P3436j12037k6771J52960
15578c7713J04410j97704n8912r2195Q6153J78697R3416j82768p5673J20893J2149
15567d9247K2580n6625j03775k4056Q3642o9054p469R8470N7753r969L7788L7810
15555A7848R1747j92614l41588k4091J49887J96993J31650L9096r0496P1691l3201
15544A6922j58431M9383M8141R429k0635L8966J07489n4408m3778J82777j6617
15533A59238o3346k1388J42424L3498l8182k1257r8985k50373J12750J57005k2323
$$ plain form
15522 89061 125696 72617 -19825 7741 183528 292080 203158 174262 180041 171103 128868 50004
15510 50004 -57503 -77501 -80585 -43482 20262 -93971 -39233 94787 69927 -38343 -14627
15499 -14627 185878 110199 71748 115537 81211 143390 211077 132150 -21781 -56600 43464
15488 43464 68711 14978 134649 108147 -41308 -30050 62227 200286 209224 187743 38048
15477 38048 123193 -26390 -262705 -8332 270168 323633 163809 128570 133080 114562 72948
15466 72948 112317 -95275 -89580 -188278 25702 79633 -10941 40889 -59096 85622 106752
15455 106752 252823 286244 134977 175898 95744 -18462 96141 7569 -62810 -160585 96401
15444 96401 212024 117956 101884 80901 -33414 84249 44275 152483 149962 -17640 -85552
$$ packed form
15522H9061L6635n3079r2442K7566J75787J08552q8922k8896N779q938m2235p8864
15510E0004j07507j9998l084L7103O3744j14233N4738J34020k4860j08270K3716
15499a4627K00505p5679l8451M3789l4326O2179O7687p8927j53931l4819J00064
15488D3464K5247n3733J19671k6502j49455J1258R2277J38059Q938k1481j49695
15477C8048Q5145j49583k36315K54373K78500N3465j59824l5239M510j8518m1614
15466G2948L9369k07592N695r8698K13980N3931r0574N1830r9985J44718K1130
15455A06752J46071L3421j51267M0921q0154j14206J14603q8572p0379r7775K56986
15444I6401J15623r4068j6072k0983j14315J17663l9974J08208k521j67602o7912
$$ plain form
15433 -85552 59450 36030 -8739 -139839 -214878 -116422 83341 22317 12263 -28657 -100815
15422 -100815 -185388 -160788 -167487 -113338 -86087 -27562 -78160 -79033 -60465 -132969 -83286 -46118
15410 -46118 -58288 -24328 -56773 -170014 -158180 -58341 -198145 -480992 -451350 -226350 -108926
15399 -108926 -67319 -139249 -30500 -29397 -4155 47191 -30592 56269 97611 319540 317661
15388 317661 14555 -199040 -251154 -133378 -67680 -1248 38366 -4820 -146705 -247781
15378 -247781 -255016 -293903 -142590 18651 6797 -17552 -103746 -36752 -65894 18571 101771
15367 101771 45731 -43335 26008 -113916 -273440 -572858 -647184 -544230 -440063 -334392
15357 -334392 -278466 -240754 -275638 -345867 -176100 -32143 116825 42643 -64745 -60865 25941
$$ packed form
15433h5552J45002k3420m4769j31100p5039R8456J99763o1024j0054m0920p2158
15422a00815q4573K4600o699N4149K7251N8525n0598q73J8568p2504M9683L7168
15410d6118j2170L3960l2445j13241J1834R9839j39804k82847K9642K25000J17424
15399a08926M1607p1930J08749J103K5242N1346p7783Q6861M1342K21929j879
15388C17661l03106k13595n2114J17776O5698O6432L9614m3186j41885j01076
15378b47781p235l8887J51313J61241j1854k4349q6194O6994k9142Q4465Q3200
15367A01771n6040q9066O9343j39924j59524k99418p4326J02954J04167J05671
15357c34392N5926L7712l4884p0229J69767J43957J48968p4182j07388L880Q6806
$$ plain form
15346 25941 -64388 -89981 -27901 -22176 -162435 -218959 -197357 -226779 -243387 -359794 -411625
15335 -411625 -361404 -220568 -141994 -32690 188855 163507 -87682 -201592 -171833 -70496
15325 -70496 -201771 -233956 -113579 -20283 -35681 -108142 -28216 30854 -6034 -167671 135
15314 135 36645 -70083 -63173 27745 11581 -3764 -43472 -142699 -63320 54116 21636 26346
15302 26346 -50241 -88839 -35499 8266 -140904 -285840 -372648 -364746 -249503 -188842 -24523
15291 -24523 -16 -34999 -46747 -177742 -212595 -130658 -48611 -52131 -177389 -161485 -91674
15280 -91674 -221254 6661 165335 112727 81302 128945 -16536 74288 237164 303072 269841
15269 269841 200780 18449 -46612 -125905 23630 35914 97048 86835 144923 193800 130243
$$ packed form
15346B5941r0329k5593O2080N725j40259n6524K1602k9422j6608j16407n1831
15335d11625N0221J40836P8574J09304K21545k5348k51189j13910K9759J01337
15325g0496j31275l2185J20377R3296j5398p2461P9926N9070l6888j61637J67806
15314A35L6510j06728O910R0918j6164j5345l9708r9227P9379J17436l2480M710
15302B6346p6587l8598N3340M3765j49170j44936q6808P902J15243O0661J64319
15291b4523K4507l4983j1748j30995l4853Q1937Q2047l520j25258J5904O9811
15280i1674j29580K27915J58674n2608l1425M7643j45481R0824J62876O5908l3231
15269B69841o9061j82331o5061p9293J49535J2284O1134j0213N8088M8877o3557
$$ plain form
15258 130243 44743 74269 -7413 222693 207715 10816 39606 219046 264758 213611 39766
15247 39766 -101687 -93784 -55781 -83571 -186664 -122994 -244556 -170094 -150968 -193117 -157521
15236 -157521 -62718 137466 73894 -139849 -287257 -139592 -78026 -10536 14599 -45128 -17301
15225 -17301 -12441 -4504 298859 91510 5087 142835 148860 94035 -141295 -153274 -47333
15214 -47333 65839 164661 -37440 54638 16953 9712 -75153 -173964 -95628 -125221 -23995
15203 -23995 -25517 -25439 85373 7789 -578 22603 40566 -143757 -267344 -273890 -118560 38358
15191 38358 121660 74799 48883 16033 -106699 -115244 -127291 11660 134216 109613 24984
15180 24984 -100154 137161 235317 201351 175632 20369 -2439 -71418 66288 153345 31664
$$ packed form
15258A30243q5500K9526q1682K30106j4978j96899K8790J79440M5712n1147j73845
15247C9766j41453P903L8003k7790j03093O3670j21562P4462J9126m2149L5596
15236a57521R4803K00184o3572k13743j47408J47665O1566O7490K5135n9727K7827
15225a7301M860P937L03363k07349q6423J37748O025n4825k35330j1979J05941
15214d7333J13172R8822k02101R2078l7685p241q4865r8811P8336k9593J01226
15203b3995j522P8J10812p7584q367K3181J7963j84323j23587o546J55330J56918
15191C8358Q3302m6861k5916l2850j22732q545j2047J38951J22556k4603q4629
15180B4984j25138K37315R8156l3966k5719j55263k2808o8979J37706Q7057j21681
$$ plain form
15169 31664 -64096 88325 251501 320737 112393 51232 18099 8288 67552 -65163 -88254
15158 -88254 -127173 -152197 -113730 -125526 55957 243669 156645 137658 140029 162967 124608
15147 124608 142763 187662 183089 194858 74610 16565 -27828 -121559 -60130 17653 -18013
15136 -18013 96641 141655 13478 69929 120103 115005 140531 90209 25908 135436 167675
15125 167675 -16164 -66163 -124040 -186805 -247062 -273085 -274833 -167279 -37319 38505 272931
15114 272931 163605 11535 -83184 -176116 -269625 -115026 32103 18301 32298 -6676 50913
15103 50913 95613 120336 -157273 -239179 -59881 10515 -110528 -93745 72964 194956 257505
15092 257505 240127 138576 122436 107329 238631 279656 105788 -126483 -143653 50433
$$ packed form
15169C1664r5760J52421J63176O9236k08344o1161l3133r811N9264j32715k3091
15158h8254l8919k5024L8467j1796J81483J87712q7024j8987K371K2938l8359
15147A24608J8155M4899m573J1769j20248n8045m4393r3731O1429P7783l5666
15136a8013J14654M5014j28177N6451N0174n098K5526n0322o4301J09528L2239
15125A67675j83839m9999n7877o2765o0257k6023j748J07554J29960P5824K34426
15114B72931j09326j52070r4719r2932r3509J54599J47129j3802J3997l8974N7589
15103E0913M4700K4723k77609q1906J79298P0396j21043J6783J66709J21992O2549
15092B57505j7378j01551j6140j5107J31302M1025j73868k32271j7170J94086
$$ plain form
15082 50433 256302 236055 93569 145589 9103 112964 106895 53095 -545 8228 84925
15071 84925 138446 334011 261340 239378 184692 123456 298923 276523 170962 119729 34418
15060 34418 711 30303 28826 -146045 -149068 -94349 -215889 -207613 -184602 -133732 54523 164141
15048 164141 71757 317209 412477 289982 166049 54636 36791 -22804 23087 52227 -75858
15037 -75858 -156188 -188318 -135028 -44525 -38647 -76123 -107702 -29636 100077 190571 218565 280859
15025 280859 232066 74516 5726 -30152 8120 45918 165010 345349 231788 101431
15015 101431 102615 137645 192161 25785 5181 63295 143991 -9964 -206337 -282211 -114530
15004 -114530 82320 233536 242100 262271 267044 81391 -71335 -194478 -316647 -280962 -182808
$$ packed form
15082E0433K05869k0247j42486N2020j36486J03861o069n3800n3640Q773P6697
15071H4925N3521J95565p2671k1962n4686o1236J75467k2400j05561n1233q5311
15060C4418l3707K9592j477j74871l023N4719j21540Q276K3011N0870J88255J09618
15048A64141r2384K45452R5268j22495j23933j11413j7845n9595M5891K9140j28085
15037g5858q0330l2130N3290R0503N878l7476l1579P8066J29713R0494K7994O2294
15025B80859m8793j57550o8790l5878L8272L7798J19092J80339j13561j30357
15015A01431J184L5030N4516j66376k0604N8114Q0696j53955j96373p5874J67681
15004a14530J96850J51216Q564K0171M773j85653j52726j23143j22169L5685R8154
$$ plain form
14993 -182808 -398579 -361347 -217792 -206373 -255629 -346732 -215255 -63863 -17294 26751 116649
14982 116649 240886 142606 115337 -15023 4606 21821 -85449 -249889 -339644 -76917
14972 -76917 61507 250374 198104 76499 -63775 61480 160675 142863 -45120 97478
14962 97478 310293 185465 156793 246398 192749 -19197 -114844 -314342 -306891 -153102 101438
14951 101438 213586 23671 2772 -14392 -205132 -233317 -158249 2854 78286 56984 96431
14940 96431 193765 68744 -103214 56380 168530 155155 14467 110685 262119 146889
14930 146889 80650 110429 229150 269173 296172 153307 17941 666 241689 170740 61613
14919 61613 92805 -64395 -11278 -100840 -29908 -179660 -348521 -223637 -71122 -58704 -205084
$$ packed form
14993a82808k15771L7232J43555J1419m9256r1103J31477J51392M6569M4045Q9898
14982A16649J24237r8280k7269j30360J9629J7215j07270j64440q9755K62727
14972g6917J38424J88867n2270j21605j40274J25255R9195j7812j87983J42598
14962I7478K12815j24828k8672Q9605n3649k11946r5647j99498P451J53789K54540
14951A01438J12148j89915k0899j7164j90740k8185P5068J61103P5432k1302L9447
14940I6431R7334j25021j71958J59594J12150j3375j40688R6218J51434j15230
14930A46889o6239K9779J18721M0023K6999j42865j35366j7275K41023p0949j09127
14919F1613L1192j57200N3117q9562P0932j49752j68861J24884J52515J2418j46380
$$ plain form
14908 -205084 -231138 -63940 -39316 -50029 38962 -30967 75984 97940 66249 12091 -77428
14897 -77428 81754 97324 65575 67427 131644 267615 143616 69857 63319 112452 29123
14886 29123 -88270 -41665 -186002 -307086 -140536 46104 159709 306975 260138 58656
14876 58656 -76289 -70319 -110868 -231821 -198896 -128741 -211737 -209700 -29367 32327 77726
14865 77726 59326 33934 29991 -74188 15010 136182 176755 133984 118184 247680 267745
14854 267745 347045 112245 38221 65239 45099 51441 108630 193491 330028 343388 233987
14843 233987 152287 147731 251634 229142 12168 -246577 -275392 -278664 -198688 -316845 -100709
14832 -100709 -88162 -68317 -4486 -109494 -214711 -102772 23831 37524 -37015 -4241 152767
$$ packed form
14908b05084k6054J67198K4624j0713Q8991o9929J06951K1956l1691n4158q9519
14897g7428J59182J5570l1749J852O4217J35971j23999p3759o538M9133q3329
14886B9123j17393M6605j44337j21084J66550J86640J13605J47266m6837k01482
14876E8656j34945N970m0549j20953L2925P0155q2996K037J80333O1694M5399
14865G7726j8400k5392l943j04179Q9198J21172M0573m2771j5800J29496K0065
14854B67745P9300k34800p4024K7018k0140O342N7189Q4861J36537J3360j09401
14843B33987q1700m556J03903k2492k16974k58745k8815l272P9976j18157K16136
14832a00709J2547J9845O3831j05008j05217J11939J26603J3693p4539L2774J57008
$$ plain form
14821 152767 116739 62118 40454 -26952 173006 444378 355780 128517 -17401 184349
14811 184349 359303 136433 34387 85471 33130 -3333 -243971 -230046 -78865 -149322
14801 -149322 -277324 -146635 132738 107126 54075 44572 -75525 -114873 -146229 -37613 -128777
14790 -128777 -192679 -112950 6835 -85045 -38393 -113487 -37542 54021 22362 8450 -38891
14779 -38891 -118805 34434 -27919 -159521 -173819 -82272 -7870 -11978 -159322 -223145 -63589
14768 -63589 -72087 -125926 76710 186544 148309 116787 3328 -61065 24427 50393 -92226
14757 -92226 -115462 36884 172362 178527 165344 20836 -159495 -166085 -86392 -121450 -188971
14746 -188971 -308186 -199611 -107733 -146722 -69962 55854 208023 111817 117562 73350 -54617
$$ packed form
14821A52767l6028n4621k1664o7406J99958K71372q8598k27263j45918K01750
14811A84349J74954k22870j02046N1084n2341l6463k40638J3925J51181p0457
14801a49322j28002J30689K79373k5612n3051r503j20097l9348l1356J08616r1164
14790a28777o3902P9729J19785r1880M6652p5094P5945R1563l1659j3912m7341
14779c8891p9914J53239o2353j31602j4298R1547P4402m108j47344o3823J59556
14768f3589q498n3839K02636J09834l8235l1522j13459o4393Q5492K5966j42619
14757i2226k3236J52346J35478O165j3183j44508j80331o590P9693l5058o7521
14746a88971j19215J08575R1878l8989P6760J25816J52169r6206N745m4212j27967
$$ plain form
14735 -54617 -75419 -107461 5092 -62142 -130406 -131115 28909 -43968 -132760 -60238 133413
14724 133413 79701 -121818 -76927 108038 -28771 55412 195958 338550 275016 221652
14714 221652 99575 112034 152091 52938 -36100 -141390 -123075 -33814 8601 112917 40722
14703 40722 -44445 43915 214392 144766 178758 303137 365063 354221 229337 12650 -52554
14692 -52554 -11678 67990 172188 37693 -160482 -203301 9936 -55428 -262871 -468503
14682 -468503 -464304 -236812 -132397 -64467 -101535 -133301 -129024 -136478 -17282 3193 -75067
14671 -75067 -6099 123090 228526 215183 68480 -72788 -105805 -11475 -39074 128337 304440
14660 304440 316413 122553 -90010 -149384 46200 32747 -34154 -28454 32961 76096 -73719
$$ packed form
14735e4617k0802l2042J12553o7234o8264p09J60024p2877q8792P2522J93651
14724A33413n3712k01519M4891J84965j36809Q4183J40546J42592o3534n3364
14714B21652j22077J2459M0057r9153q9038j05290J8315Q9261M2415J04316p2195
14703D0722q5167Q8360J70477o9626L3992J24379O1926j0842j24884k16687o5204
14692e2554M0876P9668J04198j34495j98175m2819K13237o5364k07443k05632
14682d68503M199K27492J04415O7930l7068l1766M277p454J19196K0475p8260
14671g5067O8968J29189J05436j3343j46703j41268l3017R4330k7599J67411J76103
14660C04440J1973j93860k12563n9374J95584j3453o6901N700O1415M3135j49815
$$ plain form
14649 -73719 -356806 -444761 -331717 -155727 136000 181870 138724 12380 40294 139328 188094
14638 188094 89679 33028 65893 -45562 29000 128704 191184 262957 205522 203145 200694 74316
14626 74316 -17829 -38217 -35254 -37720 122333 168786 117661 203931 211899 77479 24582 291915
14614 291915 457285 240392 226498 372507 448776 292936 136048 145731 210499 2486
14604 2486 -67126 -124926 -107282 -50679 -92466 -100920 -810 -55726 -94820 -50293 20384 71282
14592 71282 180053 338153 334617 170300 96277 175648 170767 70861 -89519 -112899 7277
14581 7277 58053 -52939 -16255 39330 92922 173759 164344 41477 -545 80365 233742
14570 233742 170637 34901 104496 106136 -39128 -80314 -153609 -21638 229064 279532 100233
$$ packed form
14649g3719k83087q7955J13044J75990K91727M5870m3146j26344K7914R9034M8766
14638A88094r8415n6651L2865j11455P4562R9704O2480P1773n7435k377k451j26378
14626G4316r2145k0388K963k466J60053M6453n1125Q6270P968j34420n2897K67333
14614B91915J65370k16893j3894J46009P6269j55840j56888R683O4768k08013
14604B486o9612n7800J7644N6603m1787q454J00110n4916l9094M4527P0677N0898
14592G1282J08771J58100l536j64317p4023P9371m881r9906j60380k3380J20176
14581G277N0776j10992L6684N5585N3592Q0837r415j22867m2022Q0910J53377
14570B33742o3105j35736O9595J640j45264m1186p3295J31971K50702N0468j79299
$$ plain form
14559 100233 -31370 107010 56778 69586 129587 50091 116092 118744 76572 73198 41915
14548 41915 -63337 -169469 -240848 -252141 -265540 -174466 -205609 -433870 -344919 -84227 -24685
14537 -24685 -29162 -78355 -180544 -82012 20663 -3485 17707 -2942 89616 97670 66423 -48060
14525 -48060 -29289 -109192 -120533 8422 99947 -17146 -35140 1099 127384 206322 109132
14514 109132 -27961 -83291 -103273 -277004 -280062 -232660 -243896 -87600 56869 183543 303828
14503 303828 499385 533721 340750 120849 160814 247783 155002 159665 81572 -70567 -51709
14492 -51709 -38594 47694 136516 30562 -71980 -86936 34658 51076 -531 -100737 -170725
14481 -170725 -208752 -30941 206001 270199 105909 -77932 -313002 -275110 -184366 -43889
$$ packed form
14559A00233j31603J38380n0232J2808O0001p9496O6001K652m2172l374l1283
14548D1915j05252j06132p1379j1293j3399R1074l1143k28261Q8951K60692N9542
14537b4685m477m9193j02189R8532J02675k4148K1192k0649R2558Q054l1247j14483
14525d8060J8771p9903j1341J28955R1525j17093j7994L6239J26285P8938r7190
14514A09132j37093n5330j9982j73731l058M7402j1236J56296J44469J26674J20285
14503C03828J95557L4336j92971k19901L9965Q6969r2781M663p8093j52139J8858
14492e1709J3115Q6288Q8822j05954j02542j4956J21594J6418n1607j00206o9988
14481a70725l8027J77811K36942O4198j64290j83841k35070L7892R0744J40477
$$ plain form
14471 -43889 19631 -93899 -98326 -131220 -101515 -116260 -122934 -32722 100156 -49348 -49688 -68751
14459 -68751 -274793 -267175 -9911 116190 64793 -36809 -42310 -4606 -30036 89500 130516
14448 130516 177576 208334 145353 111330 186821 228329 170683 32764 -42348 -73967 -73225 -159225
14436 -159225 -199448 -357495 -292249 -172198 -126290 23261 110249 33557 77309 69304 64034
14425 64034 195739 246529 40579 60757 157456 154123 16478 -82471 -74060 -65570 3157 -24842
14413 -24842 -141910 -56725 -69433 -155345 -224793 -143409 -122150 -193973 -151743 -172572 -316323
14402 -316323 -82514 5023 -49596 -132038 41793 99975 97626 -19464 -103300 -82398 149804
14391 149804 134125 145612 263728 142079 52247 17165 2493 -215201 -154968 39941 17240
$$ packed form
14471d3889O3520j13530m427l2894K9705j4745o674R0212J32878j49504l40j9063
14459f8751k06042P618K57264J26101n1397j01602n501L7704k5430J19536M1016
14448A30516M7060L0758o2981l4023P5491M1508n7646j37919p5112l1619P42q6000
14436a59225m0223j58047O5246J20051M5908J49551Q6988p6692M3752q005n270
14425F4034J31705N0790k05950K0178R6699l333j37645r8949Q411Q490O8727k7999
14413b4842j17068Q5185j2708q5912o9448Q1384K1259p1823M2230k0829j43751
14402c16323K33809Q7537n4619q2442J73831N8182k349j17090q3836K0902K32202
14391A49804j5679J1487J18116j21649q9832l5082j4672k17694O0233J94909k2701
$$ plain form
14380 17240 -114782 -190778 -99740 10827 193385 178813 129174 14741 89088 155757 75660
14369 75660 -4102 13686 -27192 -52886 -151323 -218319 -74203 109413 224176 120005 -145517
14358 -145517 -172437 -178792 -248576 -378660 -419221 -355994 -173358 -120385 -65918 638 62454
14347 62454 60360 6972 -120193 -120950 17897 45875 -108663 -79769 -59791 -187566 -328065
14336 -328065 -280132 -253689 -214197 -274768 -286600 -242640 -416321 -423143 -170114 77912 128979
14325 128979 -70042 -268820 -262680 -369726 -367245 -290832 -121361 -160986 -56500 71236 116974
14314 116974 22064 507 80706 85147 63571 110936 102778 -88394 -137814 -67702 -196433
14303 -196433 -104463 -46503 -41624 -58225 20022 73450 179178 270999 191606 -99663 -217699
$$ packed form
14380A7240j32022p5996R1038J10567J82558j4572m9639j14433P4347O6669q0097
14369G5660p9762J7788m0878k5694r8437o6996J44116J83616J14763j04171k65522
14358a45517k6920o355o9784j30084m0561O3227J82636N2973N4467O6556O1816
14347F2454k094n3388j27165p57J38847K7978j54538K8894J9978j27775j40499
14336c28065M7933K6443L9492o0571j1832M3960j73681o822K53029K48026N1067
14325A28979j99021j98778O140j07046K481P6413J69471l9625J04486J27736M5738
14314A16974r4910k1557Q0199M441k1576M7365q158j91172m9420P0112j28731
14303a96433R1970N7960M879j6601P8247N3428J05728R1821p9393k91269j18036
$$ plain form
14292 -217699 -283091 -304479 -349259 -130879 -146332 -191730 -316922 -149254 86577 51420 68525
14281 68525 73504 209482 394960 384389 252437 280374 201127 44518 -28452 -31532 15338
14270 15338 -236009 -372777 -263490 -107901 55161 1118 -158845 -258332 -257500 -330720 -226843
14259 -226843 -235830 -318279 -233418 -298996 -336738 -296262 -63251 119027 10478 -54800 -27296
14248 -27296 22888 -183540 -131794 -28920 66696 -53753 -225029 -132573 12478 46861 36679
14237 36679 60443 94661 60385 135056 191792 195529 180670 66675 -168916 -151988 -79627
14226 -79627 141694 19628 -204395 -410168 -410620 -335289 -143006 -119738 -248444 -309613 -239255
14215 -239255 -105392 -94165 -132818 -121411 -61675 -33787 41656 71706 135966 94160 -19334
$$ packed form
14292b17699o5392k1388m4780K18380j5453m5398j25192J67668K35831l5157J7105
14281F8525M979J35978J85478j0571j31952K7937p9247j56609p2970l080M6870
14270A5338k51347j36768J09287J55589J63062n4043j59963r9487Q32p3220J03877
14259b26843q987q2449Q4861o5578l7742M0476K33011J82278j08549o5278K7504
14248b7296N0184k06428N1746J02874R5616j20449j71276R2456J45051L4383j0182
14237C6679K3764L4218l4276P4671N6736L737j4859j13995k35591J6928P2361
14226g9627K21321j22066k24023k05773m52P5331J92283K3268j28706o1169P0358
14215b39255J33863J1227l8653J1407N9736K7888P5443L0050O4260m1806j13494
$$ plain form
14204 -19334 -104974 -108480 -58025 -136457 -140943 -75120 -79776 -29926 25399 -44353 -142220 -190358
14192 -190358 -54491 2071 -19380 39608 -20288 -41419 -109456 -100436 -25550 100594 138896
14181 138896 75293 -18324 -33347 -202450 -198168 -211133 -200647 -229278 -142067 -214727 -187863
14170 -187863 -74696 -157811 -100845 -87492 -99113 -79406 24861 107323 30376 -38725 -50628
14159 -50628 -17816 21999 -12474 21366 19479 -123974 -189059 -181667 -24420 68908 116089 64185
14147 64185 19681 -14329 -21021 66103 165625 156106 197130 263453 332434 382782 317949 226817
14135 226817 105671 201193 303500 152800 -77650 -99586 -159632 -258893 -75523 127545
14125 127545 209124 113817 -97502 -40516 99512 95596 72423 14654 -172118 -818 158709
$$ packed form
14204a9334q5640l506N0455p8432m486O5823m656M9850N5325o9752r7867m8138
14192a90358J35867N6562k1451N8988n9896k1131o8037R020P4886J26144L8302
14181A38896o3603r3617j5023j69103M282j2965J0486k8631Q7211p2660K6864
14170a87863J13167q3115N6966J3353j1621J9707J04267Q2462p6947o9101j1903
14159e0628L2812L9815l4473L3840j887j43453o5085P392J57247R3328M7181n1904
14147F4185m4504l4010o692Q7124R9522r519M1024O6323O8981N0348o4833r1132
14135B26817j21146R5522J02307j50700k30450k1936o0046r9261J83370K03068
14125A27545Q1579r5307k11319N6986J40028l916k3173n7769j86772J71300J59527
$$ plain form
14114 158709 90205 119136 -85648 -151115 -59389 -87952 -98452 -211589 -363360 -234771 -122438
14103 -122438 -27952 -86537 -9616 26792 143716 14385 -84918 15090 -89053 -190082
14093 -190082 -81450 -192281 -184714 -114479 -231049 -205529 -276866 -319744 -354582 -393263 -276708
14082 -276708 -294594 -310297 -323943 -266462 -205939 -272907 -176133 -72003 -14147 -61311 -216507
14071 -216507 -155104 -13887 139345 201929 140651 115500 37616 -1200 -16111 -14043 -140407
14060 -140407 -351586 -340989 -201920 -171808 -186525 -260231 -293515 -314944 -270874 -128870 -4446
14049 -4446 39039 49313 -40019 -41164 -125324 -10370 70566 64161 74068 -153168 -198142 -261419
14037 -261419 -242406 -236570 -160369 -76489 -34935 -77435 -234245 -317046 -368945 -182963 4270
$$ packed form
14114A58709o8504K8931k04784o5467R1726k8563j0500j13137j51771J28589J12333
14103a22438R4486n8585P6921L6408J16924j29331r9303J00008j04143j01029
14093a90082J08632j10831P567P0235j16570K5520p1337m2878l4838l8681J16555
14082b76708j7886j5703j3646N7481O0523o6968R6774J04130N7856m7164j55196
14071b16507O1403J41217J53232O2584o1278k5151p7884l8816j4911K068j26364
14060a40407k11179J0597J39069L0112j4717p3706l3284k1429M4070J42004J24424
14049d446M3485J0274q9332j145q4160J14954Q0936o405R907k27236m4974o3277
14037b61419J9013N836P6201Q3880M1554m2500j56810q2801n1899J85982J87233
$$ plain form
14026 4270 61978 39927 25699 -36370 -115605 54210 110349 68912 -42845 -108709 -233329
14015 -233329 -84922 29442 241682 407328 213753 269529 340958 145653 39100 155439
14005 155439 44859 -51405 -187233 -119780 -143813 -290515 -267039 -218438 -234591 -223820 -29276
13994 -29276 93582 -39815 -4712 146092 140207 81863 154746 101540 30634 -43620 -24001
13983 -24001 21999 -65730 23505 -104422 -100529 101503 132576 -33038 -51584 -22803 38257
13972 38257 150297 -97667 -338301 -330634 -233364 -141477 -81536 -97386 -55383 21061 18412
13961 18412 98334 194829 115873 -74953 -26909 15678 125662 93176 153198 166607 113495
13950 113495 174524 88043 -88185 -134310 -212774 -298927 -329388 -174064 65189 162801 62076
$$ packed form
14026D270N7708k2051j4228o2069p9235J69815N6139m1437j11757o5864j24620
14015b33329J48407J14364K12240J65646j93575N5776P1429j95305j06553J16339
14005A55439j10580r6264j35828O7453k4033j46702K3476M8601j6153J0771J94544
13994b9276J22858j33397L5103J50804n885n8344P2883n3206p0906p4254J9619
13983b4001M6000q7729Q9235j27927L893K02032L1073j65614j8546K8781O1060
13972C8257J12040k47964k40634P667R7270R1887N9941j5850M2003P6444k649
13961A8412P9922R6495p8956j90826M8044M2587J09984l2486O0022J3409n3112
13950A13495O1029q6481j76228m6125p8464q6153l0461J55324K39253R7612j00725
$$ plain form
13939 62076 69239 38346 4915 145295 180811 109886 105529 183558 114759 -66161 -169794
13928 -169794 -234087 -216973 -146346 -57118 15571 79418 199236 323615 413876 264520 197168
13917 197168 141725 179145 287153 197694 131739 223855 283028 227906 99146 75596 4568
13906 4568 11593 59361 -19750 98622 48333 -86438 -164368 -127509 -167956 -245086 -225494 -138528
13894 -138528 -118012 5967 -64740 -9316 32508 -100276 -371436 -283870 -338492 -320197 -153401
13883 -153401 -118417 -365953 -340689 -253444 -193907 -55665 -31643 -153398 -158153 -76617 -91553
13872 -91553 -304464 -212265 -103104 -147427 -72255 -65080 -173496 -234998 -153953 -94273 25718
13861 25718 96328 70934 17686 -15693 -391 -40490 -82863 -115811 -68364 73653 212138
$$ packed form
13939F2076P163l0893l3431J40380L5516p0925m357P8029o8799j80920j03633
13928a69794o4293J7114P0627Q9228P2689O3847J19818J24379R0261j49356o7352
13917A97168n5443L7420J08008q9459o5955R2116N9173n5122j28760k3550p1028
13906D568P025M7768p9111J18372n0289j34771p7930L6859m0447p7130J9592Q6966
13894a38528K0516J23979p0707N5424M1824j32784k71160Q7566n4622J8295J66796
13883a53401L4984k47536K5264Q7245N9537J38242K4022j21755m755Q1536j4936
13872i1553k12911R2199J09161m4323P5172P175j08416o1502Q1045N9680J19991
13861B5718P0610k5394n3248l3379J5302m0099m2373l2948M7447J42017J38485
$$ plain form
13850 212138 113944 -2929 -201371 -71962 86768 53093 -35135 -55201 90021 123778
13840 123778 10939 -34672 135036 379215 314919 134050 -8242 -24743 -149018 -84333
13830 -84333 -16800 110443 56901 -192813 -197415 -145497 -130847 -44329 -9280 5698 -7251
13819 -7251 -26932 8760 -56577 -163386 -117637 42673 118301 161654 222847 220194 260158 320778
13807 320778 272825 92625 60409 94207 -127757 -229182 -154990 43922 13617 37333 27800
13796 27800 -213838 -262963 -74958 64416 78652 65825 -37253 176336 393370 262168
13786 262168 68806 -60139 -184988 -172882 -184439 -234845 -199867 -366204 -565346 -465917
13776 -465917 -479987 -555292 -356855 -234879 -361899 -450844 -337851 -303429 -353912 -350728 -133165
$$ packed form
13850B12138r8194j16873j98442J29409J58730l3675q8228k0066J45222L3757
13840A23778j12839m5611J69708K44179o4296j80869j42292j6501j24275O4685
13830h4333O7533J27243n3542k49714m602N1918J4650Q6518L5049J4978j2949
13819g251j9681L5692o5337j06809M5749J60310P5628M3353O1193k653L9964O0620
13807C20778m7953j80200l2216L3798k21964j01425P4192J98912l0305K3716r533
13796B7800k41638m9125J88005J39374J4236j2827j03078K13589K17034j31202
13786B62168j93362j28945j24849J2106j1557n0406L4978j66337j99142R9429
13776d65917j4070p5305J98437J21976j27020q8945J12993L4422n0483L184K17563
$$ plain form
13765 -133165 -111178 -24548 6094 20765 -20189 6453 -103487 -119029 -103734 -172368 -237192
13754 -237192 -311905 -332365 -244480 -190321 -98274 -146655 -125763 -73722 -186151 -326035 -449571
13743 -449571 -364170 -81704 -77239 -7355 -16286 -107664 -50376 9624 34482 131822 107857 33989
13731 33989 116581 133976 189711 39879 -37339 16828 154376 103659 -178146 -185619 878
13720 878 50431 12810 -46350 -13578 126796 216939 95460 16026 -52938 85322 180414
13709 180414 241516 20643 -90155 -40191 52064 56479 -16351 -165392 -39419 79479 75933
13698 75933 -129612 -150335 -234760 -217559 -111324 8278 50928 12162 -5851 -80265 -94838
13687 -94838 15909 220731 214818 131935 -41836 196472 221467 27071 -55307 -213199 -168704
$$ packed form
13765a33165K1987Q6630L0642J4671m0954K6642j09940j5542J5295o8634o4824
13754b37192p4713k0460Q7885N4159R2047m8381K0892N2041j12429j39884j23536
13743d49571Q5401K82466M465O9884q931r1378N7288O0000K4858R7340k3965p3868
13731C3989Q2592J7395N5735j49832p7218N4167J37548n0717k81805p473J86497
13720H78M9553l7621n9160L2772J40374R0143j21479p9434o8964J38260R5092
13709A80414O1102k20873j10798M9964R2255M415p2830j49041J25973J18898l546
13698G5933k05545k0723q4425J7201J06235J19602M2650l8766j8013p4414j4573
13687i4838J10747K04822n913q2883j73771K38308K4995j94396q2378j57892M4495
$$ plain form
13676 -168704 -117416 -124071 -65216 -16720 -173250 -270191 -229713 -87144 -57656 -107491 -182579
13665 -182579 -97961 -54627 -107859 16116 -27648 -31290 -48049 -75298 -3051 166700 258828
13654 258828 263679 276096 207351 18012 -38246 -36712 -98140 -59232 -131359 -145850 -6298
13643 -6298 94727 63284 26889 -173736 -303039 -278345 -174885 -70695 196979 388773
13633 388773 371873 355977 214656 289145 170530 -24248 44840 194136 349214 183774
13623 183774 182055 125956 -584 -110531 -155636 -47272 149559 239752 190680 229181 167622
13612 167622 103861 -55226 -84198 -21851 135664 34066 -70740 -216226 -86966 98553
13602 98553 79707 50688 -76742 -63159 -61785 -164557 -32117 8379 -21271 189252 268250
$$ packed form
13676a68704N1288o655N8855M8496j56530r6941M0478J42569K9488m9835p5088
13665a82579Q4618M3334n3232J23975m3764l642j6759k7249P2247J69751R2128
13654B58828M851J2417o8745j89339n6258J534o1428L8908p2127j4491J39552
13643f298J01025l1443l6395k00625j29303K4694J03460J04190K67674J91794
13633C88773j6900j5896j41321P4489j18615j94778O9088J49296J55078j65440
13623A83774j719n6099j26540j09947m5105J08364J96831R0193m9072L8501o1559
13612A67622o3761j59087k8972O2347J57515j01598j04806j45486J29260J85519
13602I8553j8846k9019j27430J3583J374j02772J32440M0496k9650K10523P8998
$$ plain form
13591 268250 202649 156857 40931 26806 -118871 -166842 -78964 -16461 109782 151674 12069
13580 12069 -8271 9054 42472 -92304 -55415 -117539 -187551 -73689 118616 -3553 -59884
13569 -59884 -17138 -7638 -97083 44080 124066 42147 -55238 118503 256836 190188 -22008
13558 -22008 -124350 -107759 50664 76280 47692 74219 153659 248857 164001 150988 212882
13547 212882 215160 -4209 -54529 -85630 -136411 -127558 124515 310143 250644 289241 311335
13536 311335 280496 271484 125614 -155916 -313129 -305400 -210642 -79020 -115641 -131489 23930
13525 23930 -18631 -8636 105786 107932 -13293 23542 49196 26909 -61059 -67021 -133374 -280292
13513 -280292 -129043 -70091 -36843 -143813 -86473 -146172 -115685 106758 276598 204960 134218
$$ packed form
13591B68250o5601m5792j15926j4125j45677m7971Q7878O2503J26243M1892j39605
13580A2069k0340J7325L3418j34776L6889o2124p0012J13862J92305j22169n6331
13569e9884M2746R500q9445J41163P9986q1919r7385J73741J38333o6648k12196
13558b2008j02342J6591J58423K5616k8588K6527P9440R5198q4856j3013O1894
13547B12882K278k19369n0320l1101n0781Q853K52073J85628n9499L8597K2094
13536C11335l0839r012j45870k81530j57213P729R4758J31622l6621j5848J55419
13525B3930m2561R995J14422K146j21225L6835K5654k2287q7968n962o6353j46918
13513b80292J51249N8952L3248j06970N7340n9699L0487K22443J69840p1638p0742
$$ plain form
13502 134218 72712 -48562 -156946 -332707 -311208 -202618 -77173 -95936 -107561 136446
13492 136446 265822 -15905 -159020 -122020 -93110 -172382 -66261 -58584 -82943 -120503 -254055
13481 -254055 -291208 -372420 -205521 -1894 4642 -108326 -215059 -180128 -151928 -129258 -91438
13470 -91438 53774 70139 -96901 -42839 105772 178764 117829 -57441 -68118 -3353 -46471
13459 -46471 -83426 -173281 -80681 -158591 -150799 66727 42743 -925 1983 31762 21234 -142663
13447 -142663 -168139 48900 57854 -49738 -164990 -24720 14298 30759 137989 97047 -52378
13436 -52378 -66756 -121477 -308410 -163789 -26059 -73182 -115234 -236956 -358754 -336156 -198620
13425 -198620 -79225 -152963 -233467 -220716 -242802 -309298 -280984 -126028 -14560 -59985 -105807
$$ packed form
13502A34218o1506j21274j08384j75761K1499J08590J25445j8763j1625K44007
13492A36446J29376k81727j43115L7000K8910p9272J06121P677k4359l7560j33552
13481b54055l7153q1212J66899K03627O536j12968j06733L4931K8200K2670L7820
13470i1438J45212J6365j67040N4062J48611P2992o0935j75270j0677O4765m3118
13459d6471l6955q9855R2600p7910P792K17526k3984m3668K908K9779j0528j63897
13447a42663k5476K17039Q954j07592j15252J40270L9018J6461J07230m0942j49425
13436e2378j4378n4721j86933J44621J37730m7123m2052j21722j21798K2598J37536
13425a98620J19395p3738q0504J2751k2086o6496K8314J54956J11468m5425m5822
$$ plain form
13414 -105807 32697 -34414 -36548 38941 192949 235402 364110 409458 368528 329852 245473
13403 245473 105316 -81266 -58609 -157220 567 176434 108633 24932 13026 95038 69561
13392 69561 4631 -36212 -151543 -16088 -4329 -48721 88746 135244 89294 -16880 17265
13381 17265 -51931 -14621 95375 72787 -17929 80541 -19741 -112000 -100396 38470 179410
13370 179410 291865 361131 378991 377587 287218 281322 139167 -78684 -99310 87797 78293
13359 78293 -154572 -219012 -224726 -148051 -22231 20089 70521 82814 55588 71536 91626
13348 91626 174107 128979 138343 23396 -182174 -97220 28587 28238 87470 -41625 -158885
13337 -158885 -204804 -86211 -112712 -42772 68684 43287 4058 214096 295196 229301 198909
$$ packed form
13414a05807J38504o7111k134P5489J54008M2453J28708M5348m0930l8676q4379
13403B45473j40157j86582K2657r8611J57787J75867o7801q3701j1906Q2012k5477
13392F9561o4930m0843j15331J35455J1759m4392J37467M6498m5950j06174L4145
13381A7265o9196L7310J09996k2588r0716R8470j00282r2259J1604J38866J40940
13370A79410J12455O9266J7860j404r0369n896j42155k17851k0626J87107r504
13359G8293k32865o4440n714P6675J25820M2320N0432J2293k7226J5948K0090
13348I1626Q2481m5128R364j14947k05570Q4954J25807l49N9232j29095j17260
13337a58885m5919J18593k6501O9940J11456k5397l9229K10038Q1100o5895l0392
$$ plain form
13326 198909 361931 333937 239824 176251 77083 121855 17909 -160239 -209084 -170015 -76061
13315 -76061 -26765 -12429 -39177 -194705 -167758 -33831 68673 112896 -93983 -92368 201273
13304 201273 224030 145776 72183 37413 102860 48746 -13957 77901 219406 103948 -92021
13293 -92021 -56383 -130355 -160434 -17978 208300 295934 308979 284180 219559 178172 11915
13282 11915 -67811 -1008 64538 74142 5108 -12435 67312 99099 119958 68716 65066 115085
13270 115085 137419 62950 -86129 -118817 -96795 -60525 -163163 -132193 -48407 -93544 -216081
13259 -216081 -259987 -133010 -112070 -186224 -117690 -130426 13452 173270 -59846 -176917
13249 -176917 -126949 -121647 -35899 -47347 -61271 1616 -34212 -44590 -24238 -10191 -7968 90901
$$ packed form
13326A98909J63022k7994r4113o3573r9168M4772j03946j78148m8845L9069R3954
13315g6061M9296J4336k6748j55528K6947J33927J02504M4223k06879J615K93641
13304B01273K2757p8254p3593l4770O5447n4114o2703R1858J41505j15458j95969
13293i2021L5638p3972l0079J42456K26278Q7634J3045k4799o4621m1387j66257
13282A1915p9726O6803O5546R604o9034j7543P9747L1787K0859n1242l650N0019
13270A15085K2334p4469j49079l2688K2022L6270j02638L0970Q3786m5137j22537
13259b16081m3906J26977K0940p4154O8534j2736J43878J59818k33116j17071
13249a76917M9968N302Q5748j1448j3924O2887l5828j0378K0352J4047K223R8869
$$ plain form
13237 90901 -2364 -159892 -248956 -276952 -194534 -122211 52693 58342 -26939 -18621 -68038 -168756
13225 -168756 -263091 -361700 -287237 -120802 -34054 -30429 4640 29899 -59778 -211359 -116879
13214 -116879 -94609 -155187 -10333 116785 113569 94155 52976 -29950 -46443 -49255 -7774
13203 -7774 -9117 32958 -82525 -49869 -81911 -198691 -146822 -112451 -19631 48320 17586 -100712
13191 -100712 -46760 103663 2954 -56210 -164824 -117920 147562 228844 54650 -298310
13181 -298310 -293486 -132406 -56442 -38761 7107 27906 65925 140752 19061 25925 -97639
13170 -97639 -171743 -72120 279649 487736 631591 485020 314335 252181 44055 -188179
13160 -188179 14021 220981 171760 56186 14970 93279 170297 302439 295913 230850 304283
$$ packed form
13237I0901r3265j57528q9064k7996Q2418P2323J74904N649q5281Q318m9417j00718
13225a68756r4335r8609P4463J66435Q6748L625L5069K5259q9677j51581R4480
13214a16879K2270o0578J44854J27118l216j9414m1179q2926j6493k812M1481
13203g774j343M2075j15483L2656l2042j16780N1869L4371R2820O7951l0734j18298
13191a00712N3952J50423j00709n9164j08614M6904K65482Q1282j74194l52960
13181b98310M824J61080P5964J7681M5868K0799L8019P4827j21691O864j23564
13170i7639p4104R9623L51769K08087J43855j46571j70685o2154k08126k32234
13160a88179K02200K06960m9221j15574m1216P8309P7018J32142o526o5063P3433
$$ plain form
13149 304283 302714 315785 168832 5399 -116237 -48124 -43255 -117143 -74181 -161327 -177115
13138 -177115 -194890 -121010 -14461 17300 -40081 -153441 -210845 -61552 -8258 -245180 -417786
13127 -417786 -259252 -53089 -111497 -127282 -60656 233789 224163 130508 150888 78549 13693
13116 13693 13463 71801 191572 200006 142940 92318 156255 -39763 58540 217125 200482 188075
13104 188075 149202 179435 54612 16959 -29796 -114770 -197940 -466989 -418202 -252274 -224572
13093 -224572 -92643 107608 46696 -108804 -201826 -90674 27777 147720 133905 209189
13083 209189 147764 99961 4516 -127715 -207424 -194406 -133791 -29637 -1736 7447 -127087
13072 -127087 -154525 -181842 -326800 -263061 -241273 -332151 -171947 -70717 143595 82906 150055
$$ packed form
13149C04283j569J3071j46953j63433j21636O8113M869p3888M2962q7146j5788
13138a77115j7775P3880J06549L1761n7381j13360n7404J49293N3294k36922j72606
13127d17786J58534K06163n8408j5785O6626K94445r626r3655K0380p2339o4856
13116A3693k30N8338J19771Q434n7066n0622O3937j96018R8303J58585j6643j2407
13104A88075l8873L0233j24823l7653m6755q4974q3170k69049M8787J65928K7702
13093b24572J31929K00251o0912j55500r3022J11152J18451J19943j3815P5284
13083B09189o1425m7803r5445j32231p9709J3018O0615J04154K7901R183j34534
13072a27087k7438k7317j44958O3739K1788r0878J60204J01230K14312o0689O7149
$$ plain form
13061 150055 154651 214655 213841 47971 -64722 20395 140341 132208 136304 231917 183592 70044
13049 70044 80000 205126 181652 268622 242824 94025 -64149 -42135 -96414 -98791 -92095 -58502
13037 -58502 -176042 -362126 -301753 -270267 -193253 -85286 -49084 -140664 -105736 -164712 -340823
13026 -340823 -225904 -126863 -102314 57741 175527 48547 -8951 13100 -132338 -235936
13016 -235936 -210714 -206639 -38598 168447 172623 -16952 -165034 -188815 -133206 -53018 -114906
13005 -114906 -72033 -71779 49988 143969 -10880 -136192 -167763 -150332 -125443 4871 63017
12994 63017 21108 -29334 -48405 51348 83244 23428 80381 -33403 -1096 144665 77766
12983 77766 -41134 -223953 -41992 213927 119583 -138967 -170311 -5999 178105 161709
$$ packed form
13061A50055M596O0004q14j65870j12693Q5117J19946q133M096R5613m8325j13548
13049G0044R956J25126k3474Q6970k5798j48799j58174K2014n4279k377O696L3593
13037e8502j17540j86084O0373L1486P7014J07967L6202r1580L4928n8976j76111
13026c40823J14919R9041K4549J60055J17786j26980n7498K2051j45438j03598
13016b35936K5222M075J68041K07045M176j89575j48082k3781N5609Q0188o1888
13005a14906M2873K54J21767R3981j54849j25312l1571J7431K4889J30314N8146
12994F3017m1909n0442j9071R9753L1896n9816N6953j13784L2307J45761o6899
12983G7766j18900j82819J81961K55919r4344k58550l1344J64312J84104j6396
$$ plain form
12973 161709 112587 184490 154125 35721 -99391 -72791 -98699 26113 190265 215503 238506
12962 238506 225167 260544 174016 58746 -32387 -2603 94464 100540 48453 -11327 -20740 187578
12950 187578 208200 172153 75896 -44927 -75705 -70175 19015 -91586 -238557 -102084 61201
12939 61201 127340 132346 230509 143359 80766 -53148 -67074 -82618 -9752 77733 108783 45626
12927 45626 63460 40326 -11779 -30177 22809 48103 32825 94317 66343 122485 21599
12916 21599 -49374 -24519 -69997 -52755 -21519 -23527 -172019 -337254 -240918 -170101 -109554
12905 -109554 -35457 -118483 -219380 -72183 -28982 85819 55635 113128 88137 61602 278827
12894 278827 326790 -52406 -131254 -173197 -277543 -252804 -31252 93414 196461 179861
$$ packed form
12973A61709m9122P1903l0365j18404j35112K6600k5908J24812J64152K5238K3003
12962B38506j3339L5377q6528j15270r1133K9784R7067O076n2087n9780r413K08318
12950A87578K0622l6047r6257j20823l0778N530Q9190j10601j46971J36473J63285
12939F1201O6139N006R8163q7150o2593j33914j3926j5544P2866Q7485L1050o3157
12927D5626J7834k3134n2105j8398N2986K5294j5278O1492k7974N6142j00886
12916B1599p0973K4855m5478J7242L1236k008j48492j65235R6336P0817O0547
12905a09554P4097q3026j00897J47197M3201J14801l0184N7493k4991k6535K17225
12894B78827M7963l79196p8848m1943j04346K4739K21552J24666J03047j6600
$$ plain form
12884 179861 66045 18723 232547 403870 448388 409004 290170 155711 97241 155043
12874 155043 125120 61163 -27569 -61325 -155128 -164674 45316 117792 77007 970 -74506
12863 -74506 -98332 -20533 -100636 -40883 58153 113801 80638 -72148 -63267 57605 43062
12852 43062 183311 275504 271374 214963 45212 -104744 -33687 -65262 -8637 59773 -48743
12841 -48743 -89508 31830 14155 4055 58912 61789 39103 -79757 -221587 -34510 181145
12830 181145 232752 101445 -113793 -127704 -109647 -119849 30779 66244 174567 399498
12820 399498 378482 181228 43314 -16711 -164298 -115691 116103 232212 24825 -138563
12810 -138563 -160732 -81801 -133878 -196044 -146058 -15181 24425 23431 20992 27908 204888 134234
$$ packed form
12884A79861j13816m7322K13824J71323M4518l9384j18834j34459n8470N7802
12874A55043k9923o3957q8732l3756r3803r546K09990P2476m0785p6037p5476
12863g4506k3826P7799q0103N9753R9036N5648l3163j52786Q881J20872j4543
12852D3062J40249R2193m130n6411j69751j49956P1057l1575N6625O8410j08516
12841d8743m0765J21338j7675j0100N4857K877k2686j18860j41830J87077K15655
12830A81145N1607j31307k15238j3911J8057j0202J50628L5465J08323K24931
12820C99498k1016j97254j37914o0025j47587M8607K31794J16109k07387j63388
12810a38563k2169P8931n2077o2166M9986J30877L9606r94k439O916J76980p0654
$$ plain form
12798 134234 79568 72483 56123 76965 154225 64841 104879 197496 45191 -101320 -129996
12787 -129996 27312 -93311 -203379 -185548 -66849 -82240 -67000 4921 194214 298354
12777 298354 167215 171071 116881 100411 47619 91680 113920 54883 -53402 -145882 -52601
12766 -52601 -31219 37856 67794 102056 234564 196239 102019 128993 162811 180061 -84443
12755 -84443 -154848 -172802 -184717 33705 285853 248452 198229 82386 84559 66655 53077
12744 53077 6411 -27385 -100606 -201464 -79460 -62 19630 -136299 -138565 10290 76049
12733 76049 -8863 -16093 -34957 -203584 -111449 -27145 -55204 -254030 -258488 -117717 46892
12722 46892 -126959 -274693 -279623 -253045 -305207 -208305 -77711 4328 -20726 10179 -60397
$$ packed form
12798A34234n4666p085j6360K0842P7260q9384M0038R2617j52305j46511k8676
12787a29996J57308j20623j10068J7831J18699j5391J5240P1921J89293J04140
12777B98354j31139L856n4190j6470n2792M4061K2240n9037j08285r2480R3281
12766e2601K1382O9075K9938L4262J32508l8325r4220K6974L3818J7250k64504
12755h4443p0405j7954j1915K18422K52148l7401n0223j15843K173j7904j3578
12744E3077m6666l3796p3221j00858J22004P9398J9692j55929k266J48855O5759
12733G6049q4912p230j8864j68627R2135Q4304k8059j98826m458J40771J64609
12722D6892j73851j47734m930K6578n2162R6902J30594Q2039k5054L0905p0576
$$ plain form
12711 -60397 -155659 -181449 -198622 -66723 136522 178819 -45630 -285832 -168398 -73415 -82934
12700 -82934 -148823 -243768 -117657 96963 286238 198658 3322 39555 158152 -12309
12690 -12309 76802 165307 27087 -16418 -166448 -273609 -154086 -260962 -409353 -338467
12680 -338467 -298014 -215211 -257526 -163090 -213187 -274017 -112393 51555 50438 -92526 -149037
12669 -149037 -229467 -135337 -83429 122626 64346 122728 51038 -100043 -305633 -301713 -21779
12658 -21779 158676 98510 267635 351699 358549 225075 98825 -80429 -112834 -132254 -145825
12647 -145825 -129131 -134099 5476 82614 93002 10701 19581 171477 279852 325022 355800
12636 355800 237748 268419 252503 121097 -35259 -56685 -82079 -99863 -41125 -30206 -132486
$$ packed form
12711f0397r5262k5790j7173J31899K03245M2297k24449k40202J17434R4983r519
12700h2934o5889r4945J26111K14620J89275q7580j95336L6233J18597j70461
12690a2309Q9111Q8505j38220m3505j50030j07161J19523j06876j48391P0886
12680c38467M0453Q2803m2315R4436n0097o0830J61624J63948j117j42964n6511
12669a49037q0430R4130N1908K06055n8280N8382p1690j51081k05590L920K79934
12658b1779J80455o0166J69125Q4064O850j33474j26250j79254l2405j9420j3571
12647a45825J6694m968J39575P7138J0388q2301Q880J51896J08375M5170L0778
12636C55800j18052L0671j5916j31406j56356k1426k5394j7784N8738J0919j02280
$$ plain form
12625 -132486 -163435 -184403 -177380 -170653 -236617 -109924 -5381 19777 -31774 -83445 -143208
12614 -143208 -76229 127207 14542 -132816 -145069 -56956 125087 400144 345547 323437
12604 323437 343715 397430 492578 514127 386270 225023 190392 208123 205055 169342 86908
12593 86908 -7057 -17202 -126856 -159321 -39697 117037 120947 38955 -194755 -199883 -85705
12582 -85705 5018 33112 109761 65027 -56572 -83308 187493 330754 315442 164457 8211
12571 8211 101163 -10145 -100730 -23299 -22214 -118272 -84514 -141637 -48444 28280 -23801 -49909
12559 -49909 -67441 -19185 20815 87679 151508 50800 97293 -45031 -159486 -69400 148752
12548 148752 299456 287648 177590 72089 31518 77378 52535 37280 -45193 -64936 -119124
$$ packed form
12625a32486l0949k0968P023O727o5964J26693J04543K5158n1551n1671n9763
12614a43208O6979K03436j12665j47358j2253Q8113J82043K75057n4597k2110
12604C23437K0278N3715R5148K1549j27857j61247l4631J7731l068l5713q2434
12593H6908r3965j0145j09654l2465J19624J56734L910q1992k33710n128J14178
12582h5705R0723K8094P6649m4734j21599k6736K70801J43261j5312j50985j56246
12571H211R2952j11308r0585P7431J085r6058L3758n7123R3193P6724n2081k6108
12559d9909j7532M8256M0000O6864O3829j00708M6493j42324j14455R0086K18152
12548A48752J50704j1808j10058j05501m0571M5860k4843j5255q2473j9743n4188
$$ plain form
12537 -119124 -4117 263712 379869 62837 -67691 -12166 25657 -69918 -81314 -154141
12527 -154141 -188618 -379550 -288693 -53608 113982 26338 11681 87012 -50845 -46579 3391
12516 3391 -149859 -184789 -188720 -50095 15766 -17099 43138 30822 -31249 -84007 -146444 -101084
12504 -101084 10328 97367 117039 92477 -13707 -70183 -71980 -74966 -61857 7706 100055
12493 100055 320001 281288 215127 72802 270334 244795 113833 84 -20158 92338
12483 92338 341641 396233 327976 253544 161755 78931 50963 13675 -16890 -68236 100047
12472 100047 141308 20215 -57718 8284 42272 110933 153910 117841 89591 48568 192806
12461 192806 100586 750 4151 92962 -34743 66895 121508 71218 47776 61154 65771
$$ packed form
12537a19124J15007K67829J16157l17032j30528N5525L7823r5575j1396p2827
12527a54141l4477j90932R0857K35085J67590q7644j4657P5331j37857M266M9970
12516C391j53250l4930l931J38625O5861l2865O0237j2316o2071n2758o2437M5360
12504a01084J11412Q7039J9672k4562j06184n6476j797k986J3109O9563R2349
12493A00055K19946l8713o6161j42325J97532k5539j30962j13749k0242J12496
12483I2338K49303N4592o8257p4432r1789q2824k7968l7288l0565n1346J68283
12472A00047M1261j21093p7933O6002L3988O8661M2977l6069k8250m1023J44238
12461A92806r2220r9836L401Q8811j27705J01638N4613n0290k3442J3378M617
$$ plain form
12450 65771 120440 71198 2819 -45139 -177892 -188968 -54785 114174 -100935 -147249 -18857
12439 -18857 47257 -43748 -113690 -80904 109231 346608 387615 104086 7619 59206 102103
12428 102103 890 -36564 -15321 65602 -111528 -47503 49542 82354 34672 52918 98167
12417 98167 57167 44080 3942 -26667 20783 84755 -19425 29766 159044 267278 304577
12406 304577 193897 163891 438938 620811 515409 279984 128286 33054 -50588 -179905
12396 -179905 -261360 -111819 -9911 106511 130917 267176 270566 248798 358099 471911
12386 471911 431137 215172 136114 110401 163524 244066 407019 273528 142334 148937 250982
12375 250982 239431 132854 188953 187388 47113 53467 96473 163016 235541 157009 14438
$$ packed form
12450F5771N4669m9242o8379m7958j32753j1076J34183J68959k15109m6314J28392
12439a8857O6114r1005o9942L2786J90135K37377M1007k83529r6467N1587M2897
12428A02103j01213l7454K1243Q0923j77130O4025R7045L2812m7682J8246M5249
12417I8167m1000j3087m0138l0609M7450O3972j04180M9191J29278J08234L7299
12406C04577j10680l0006K75047J81873j05402k35425j51698r5232q3642j29317
12396a79905q1455J49541J01908J16422K4406J36259L390k1768J09301J13812
12386D71911m0774k15965p9058k5713N3123Q0542J62953j33491j31194O603J02045
12375B50982j1551j06577N6099j565j40275O354M3006O6543P2525p8532j42571
$$ plain form
12364 14438 137574 270182 359172 215019 272012 338861 373880 406183 330977 396666 306173
12353 306173 278370 279567 358136 443180 464856 349703 342335 269405 314865 466787 496365
12342 496365 492111 611928 757093 887720 979581 994868 1138622 1267110 1305064 1344925 1401192
12331 1401192 1457772 1709952 1999903 2200749 2469184 2979060 3473767 3883409 4543080 5216244
12321 5216244 5827043 6021563 5786909 5487140 5149828 4822601 4304354 3684499 3377081
12312 3377081 3017936 2615934 2245037 2018341 1771179 1525884 1279465 1225298 1138719 999246
12302 999246 937206 715478 608163 592830 593815 545841 455142 340012 334928 396169 439464
12291 439464 396034 400051 351832 171704 169330 318869 449027 482462 440639 244088 228497
$$ packed form
12364A4438J23136J32608Q8990j44153N6993O6849L5019L2303p5206O5689r0493
12353C06173k7803J197P8569Q5044K1676j15153p368p2930M5460J51922K9578
12342D96365m254J19817J45165J30627R1861J5287J43754J28488L7954L9861N6267
12331A401192N6580K52180K89951K00846K68435N09876M94707M09642O59671O73164
12321E216244O10799J94520k34654k99769l37312l27227n18247o19855l07418
12312C377081l59145m02002l70897k26696k47162k45295k46419n4167q6579j39473
12302I99246o2040k21728j07315j5333R85m7974r0699j15130n084O1241M3295
12291D39464m3430M017m8219j80128k374J49539J30158L3435m1823j96551j5591
$$ plain form
12280 228497 363468 281617 297926 136614 -46277 84321 15802 -109012 105610 221436
12270 221436 254580 194222 241427 372971 278936 263235 139083 179494 249881 393986 473775
12259 473775 431208 353920 434996 429191 259075 204033 104411 81699 147829 287788 422578
12248 422578 506151 363737 359949 400191 488666 661810 795077 615966 489901 332292
12238 332292 323819 275437 353535 425535 295134 417702 517964 551569 660975 678376 862425
12227 862425 902157 915145 986828 973307 892915 910298 975400 796577 623496 566935 494131
12216 494131 422260 513908 510072 298963 222249 332222 325193 289490 347328 172765 193076
12205 193076 306812 408725 313564 272639 309781 314244 254678 140683 152639 330086 258887
$$ packed form
12280B28497J34971q1851J6309j61312j82891J30598o8519j24814K14622J15826
12270B21436L3144o0358M7205J31544r4035j5701j24152M0411P0387J44105P9789
12259D73775m2567p7288Q1076n805j70116n5042r9622k2712O6130J39959J34790
12248D22578Q3573j42414l788M0242Q8475J73144J33267j79111j26065j57609
12238C32292q473m8382P8098P2000j30401J22568J00262L3605J09406J7401J84049
12227H62425L9732J2988P1683j3521q0392J7383O5102j78823j73081n6561p2804
12216D94131p1871R1648l836k11109p6714J09973p029l5703N7838j74563K0311
12205A93076J13736J01913r5161m0925L7142M463n9566j13995J1956J77447p1199
$$ plain form
12194 258887 243149 151433 136217 289098 461536 444786 280865 130491 257056 266273 206444
12183 206444 286576 492472 531882 619427 756553 876160 983982 1002663 1078039 956651
12173 956651 1117812 1175411 1195222 1336625 1462962 1499340 1663897 1902483 2083577 2285064
12163 2285064 2575748 2830553 3278714 3896105 4585737 5020800 5239548 5636698 5827351
12154 5827351 5732151 5448568 5021022 4650327 4321079 3891162 3329846 2802698 2370326 2130869
12144 2130869 1884510 1626709 1539840 1424392 1329243 1312471 1143479 955765 894663 1017355
12134 1017355 999361 913815 794529 723379 722703 660837 548256 502818 563533 677986 753621
12123 753621 790738 830988 837457 674881 418071 354674 385221 384965 442857 471843 539673 695386
$$ packed form
12194B58887j5738r1716j5216J52881J72438j6750j63921j50374J26565R217n9829
12183B06444Q0132K05896L9410Q7545J37126J19607J07822J8681P5376j21388
12173I56651J61161N7599J9811J41403J26337L6378J64557K38586J81094K01487
12163B285064K90684K54805M48161O17391O89632M35063K18748L97150J90653
12154E827351r5200k83583m27546l70695l29248m29917n61316n27148m32372k39457
12144B130869k46359k57801q6869j15448r5149j6772j68992j87714o1102J22692
12134A017355j7994q5546j19286p1150o76o1866j12581m5438O0715J14453P5635
12123G53621L7117M0250O469j62576k56810o3397L0547k56N7892K8986O7830J55713
$$ plain form
12111 695386 544411 495352 448648 556092 566086 513407 548212 459302 593198 706999 560470
12100 560470 339681 471164 629498 627292 431906 423391 591371 652576 676362 545065 606974
12089 606974 673419 681544 694459 754624 825774 771677 714081 579956 522972 510895 726618
12078 726618 824045 845347 938600 937265 752030 795037 744248 611224 597711 602553 726441
12067 726441 811381 889176 1098789 1231954 1266603 1257582 1338850 1372041 1190167 1240892 1229908
12056 1229908 1201746 1219661 1125403 1157121 1098336 1115335 1200929 1364578 1181261 983414 957800
12045 957800 1000980 945683 888667 1103651 1250346 1196741 1219398 1138076 1220668 1290545 1234378
12034 1234378 1113684 949836 989578 995326 1030856 1047088 977946 914438 1112927 1262818 1269660
$$ packed form
12111F95386j50975m9059m6704J07444R994n2679L4805q8910J33896J13801j46529
12100E60470k20789J31483J58334k206j95386q515J67980O1205K3786j31297O1909
12089F06974O6445Q125J2915O0165P1150n4097n7596j34125n6984j2077K15723
12078G26618R7427K1302R3253j335j85235M3007n0789j33024j3513M842J23888
12067G26441Q4940P7795K09613J33165L4649r021Q1268L3191j81874N0725j0984
12056A229908k8162J7915r4258L1718n8785J6999Q5594J63649j83317j97847k5614
12045I57800M3180n5297n7016K14984J46695n3605K2657q1322Q2592O9877n6167
12034A234378j20694j63848L9742N748L5530J6232o9142o3508J98489J49891O842
$$ plain form
12023 1269660 1308233 1415552 1472846 1509047 1542076 1642629 1747113 1634983 1533085 1573648
12013 1573648 1652600 1812528 1726959 1575386 1639073 1899059 1957421 2163573 2283029 2333973
12003 2333973 2518452 2699571 2719038 2641822 2520259 2478567 2612493 2852681 2842621 2884948
11993 2884948 3027974 3010723 3124771 3274280 3602802 3720610 3677947 3763382 3852320 3902323
11983 3902323 3858893 4075298 4277692 4482175 4690648 4868890 5260228 5566511 5762528 5903402
11973 5903402 5829389 6135822 6454100 6678922 7035434 7395273 7887492 8367346 8659224 8897649
11963 8897649 9135470 9604450 10224726 10886325 11466447 12197771 12788624 13583816 14495549
11954 14495549 15348931 16344004 17471374 18681328 19957008 21440459 23097037 24901932
$$ packed form
12023A269660L8573J07319N7294L6201L3029J00553J04484j12130j01898M0563
12013A573648P8952J59928q5569j51573O3687K59986N8362K06152J19456N0944
12003B333973J84479J81119J9467p7216j21563m1692J33926K40188j0060M2327
11993B884948J43026j7251J14048J49509L28522J17808m2663Q5435Q8938N0003
11983C902323m3430K16405K02394K04483K08473J78242L91338L06283J96017J40874
11973E903402p4013L06433L18278K24822L56512L59839M92219M79854K91878K38425
11963H897649K37821M68980O20276O61599N80122P31324N90853P95192R11733
11954A4495549Q53382R95073J127370J209954J275680J483451J656578J804895
$$ plain form
11946 24901932 26749684 29023036 31525575 34298707 37436150 41252948 45520118 50422627
11938 50422627 55968296 62338054 69756154 78341876 88611018 100429684 114206303 130483643
11930 130483643 149212442 170102578 193172744 217752101 242305595 264732847 282257120
11923 282257120 292184705 293154561 285073432 269441664 248663764 225073912 201164703
11916 201164703 178539574 157965665 139388115 123131749 109196768 97030591 86672883
11909 86672883 77769843 69958236 63201568 57246757 52136495 47555054 43515803 39840077
11901 39840077 36642018 33842813 31173857 28868866 26842633 25252200 23661960 22163729
11893 22163729 20705016 19388250 18211703 17173504 16165903 15187371 14457164 13717843
$$ packed form
11946B4901932J847752K273352K502539K773132L137443L816798M267170M902509
11938E0422627N545669O369758P418100Q585722J0269142J1818666J3776619J6277340
11930A30483643J8728799K0890136K3070166K4579357K4553494K2427252J7524273
11923B82257120R927585R69856q081129j5631768k0777900k3589852k3909209
11916B01164703k2625129k0573909j8577550j6256366j3934981j2166177j0357708
11909H6672883q903040p811607o756668n954811n110262m581441m039251l675726
11901C9840077l198059k799205k668956k304991k026233j590433j590240j498231
11893B2163729j458713j316766j176547j038199j007601r78532p30207p39321
$$ plain form
11885 13717843 12974709 12303266 11676613 11357622 10786319 10134227 9702604 9492651 9231348
11876 9231348 8937326 8558995 8164051 7856967 7481031 7220346 6968052 6803668 6631213
11867 6631213 6336060 6090069 5848505 5589887 5408308 5196867 5156186 5004451 4743667 4608805
11857 4608805 4551040 4471548 4191947 4238836 4084203 3880549 3815509 3737548 3685022 3686686 3471892
11846 3471892 3302920 3259743 3386876 3553081 3178146 2861578 3019148 3039856 3071206 2800851
11836 2800851 2680181 2630845 2541174 2533290 2515258 2410347 2288759 2252799 2381952 2378736 2204706
11825 2204706 2250825 2468545 2589777 2590686 2405874 2182704 2073877 2141544 1969194 1867568
11815 1867568 1985234 2003281 2121174 1969890 1909641 1864789 1947019 1957382 1951969 1871045 1687749
$$ packed form
11885A3717843p43134o71443o26653l18991n71303o52092m31623k09953k61303
11876I231348k94022l78331l94944l07084l75936k60685k52294j64384j72455
11867F631213k95153k45991k41564k58618j81579k11441m0681j51735k60784j34862
11857D608805n7765p9492k79601M6889j54633k03654o5040p7961n2526J664k14794
11846C471892j68972m3177J27133J66205l74935l16568J57570K0708L1350k70355
11836B800851j20670m9336q9671p884j8032j04911j21588l5960J29153l216j74030
11825B204706M6119K17720J21232R09j84812k23170j08827O7667j72350j01626
11815A867568J17666J8047J17893j51284o0249m4852Q2230J0363n413q0924j83296
$$ plain form
11804 1687749 1585910 1654491 1645378 1670387 1661663 1789666 1823050 1769554 1767747 1787661 1752201
11793 1752201 1546610 1381590 1299239 1201896 1120022 1211731 1323983 1276642 1348506 1304463 1335037
11782 1335037 1071696 936864 898060 794802 771466 855879 1060105 1120818 1063549 927568
11772 927568 1154120 1148498 1051410 1083921 994233 912862 913051 1011111 912256 779003 746485 822219
11760 822219 818806 593833 457615 517548 648907 794265 817084 826373 828925 921036 829243
11749 829243 833625 974158 1046839 903809 793414 759958 634445 609676 521682 623037 745784
11738 745784 832053 952510 873739 672645 546157 644605 574939 552456 541799 377500 280843
11727 280843 425333 520142 596910 806789 826228 533991 308008 292301 376181 589022
$$ packed form
11804A687749j01839O8581r113K5009q724J28003L3384n3496j807J9914l5460
11793A752201k05591j65020q2351r7343q1874R1709J12252m7341P1864m4043L0574
11782A335037k63341j34832l8804j03258k3336Q4413K04226O0713n7269j35981
11772I27568K26552n622r7088L2511q9688q1371J89R8060r8855j33253l2518P5734
11760H22219l413k24973j36218N9933J31359J45358K2819R289K552R2111r1793
11749H29243M382J40533P2681j43030j10395l3456j25513k4769q7994J01355J22747
11738G45784Q6269J20457p8771k01094j26488R8448o9666k2483j0657j64299r6657
11727B80843J44490R4809P6768K09879J9439k92237k25983j5707Q3880K12841
$$ plain form
11717 589022 603968 627178 587643 466192 404962 378000 421132 407968 362927 184823 89824
11706 89824 134417 242714 393491 693695 715492 710295 626705 458387 533469 545642 409840
11695 409840 289016 217950 299967 322467 450038 645369 497756 500565 396829 325922 378765
11684 378765 442044 408134 364926 443036 503658 536779 585416 717879 725872 587048 519492
11673 519492 530255 552488 338348 222469 162230 213100 355285 241440 296171 202048 213341
11662 213341 301741 421172 536075 599750 529911 414990 346934 366665 393530 469688 549971
11651 549971 520793 574367 416563 201333 214981 93669 51062 40141 145735 158735 77959
11640 77959 109437 53757 120705 219200 280312 327073 267083 235394 163626 250310 164509 -37551
$$ packed form
11717E89022J4946K3210l9535j21451o1230k6962M3132j3164m5041j78104r4999
11706H9824M4593J08297J50777L00204K1797n197q3590j68318P5082J2173j35802
11695D09840j20824p1066Q2017K2500J27571J95331j47613K809j03736p0907N2843
11684C78765O3279l3910m3208P8110O0622L3121M8637J32463P993j38824o7556
11673E19492J0763K2233k14140j15879o0239N0870J42185j13845N4731r4123J1293
11662B13341Q8400J19431J14903O3675o9839j14921o8056J9731K6865P6158Q0283
11651E49971k9178N3574j57804k15230J3648j21312m2607j0921J05594J3000q0776
11640G7959L1478n5680O6948R8495O1112M6761n9990l1689p1768Q6684q5801k02060
$$ plain form
11628 -37551 79759 317649 336543 154040 191545 136127 219205 259479 206966 212685 166580
11617 166580 309684 277205 281450 455837 509845 388647 447732 424658 425801 414760 330632
11606 330632 268064 276575 258027 317861 456684 454375 401459 357839 281542 236638 230396 217192
11594 217192 304718 251916 34234 68750 218828 343310 304424 150260 108176 90118 242273
11583 242273 407461 351227 305732 230596 107640 -61123 27227 132242 138960 72619 109734
11572 109734 196906 287631 358167 365100 296766 256570 375686 322939 377679 337630 209557
11561 209557 138815 194824 292008 313072 404326 300718 446337 636681 556702 487331 427419
11550 427419 367225 289942 241440 233105 280850 249232 315911 269110 164204 111410 169179
$$ packed form
11628c7551J17310K37890J8894j82503L7505n5418Q3078M0274n2513N719m6105
11617A66580J43104l2479M245J74387N4008j21198N9085k3074J143j1041q4128
11606C30632o2568Q511j8548N9834J38823k309n2916m3620p6297m4904o242j3204
11594B17192Q7526n2802k17682L4516J50078J24482l8886j54164m2084j8058J52155
11583B42273J65188n6234m5495p5136j22956j68763Q8350J05015O718o6341L7115
11572A09734Q7172R0725P0536O933o8334m0196J19116n2747N4740m0049j28073
11561B09557p0742N6009R7184K1064R1254j03608J45619J90344p9979o9371n9912
11550D27419o0194p7283m8502q335M7745l1618O6679m6801j04906n2794N7769
$$ plain form
11539 169179 317138 333931 235373 186112 180628 217458 158824 40481 284549 332542 230665
11528 230665 183344 174747 167769 48896 -33878 12781 182199 217473 57465 203397 353175
11517 353175 379248 382404 406722 301702 182946 168199 233598 253288 217566 117143 181113
11506 181113 332095 505182 382406 272420 134072 2869 62309 74403 170269 193541
11496 193541 159404 287064 137931 2541 134617 266540 244561 205115 275150 254576
11486 254576 116488 162041 268829 308271 202432 110794 74137 137873 217106 169276 39908
11475 39908 -61650 -36609 -63927 161280 298831 254182 191743 5301 28001 138310 182309
11464 182309 118250 89280 125214 60134 224531 257113 181706 38491 196766 332549 313255
$$ packed form
11539A69179J47959J6793r8558m9261n484L6830n8634j18343K44068M7993j01877
11528B30665m7321q597o978j18873q2774M6659J69418L5274j60008J45932J49778
11517C53175K6073L156K4318j05020j18756j4747O5399J9690l5722j00423O3970
11506A81113J50982J73087j22776j09986j38348j31203N9440J2094R5866K3272
11496A93541l4137J27660j49133j35390J32076J31923k1979l9446P0035k0574
11486B54576j38088M5553J06788L9442j05839r1638l6657O3736P9233m7830j29368
11475C9908j01558K5041k7318K25207J37551m4649o2439j86442K2700J10309M3999
11464A82309o4059k8970L5934o5080J64397L2582p5407j43215J58275J35783j9294
$$ plain form
11453 313255 159331 96058 3681 -34763 -76466 -58989 8694 32032 213314 275966 242191
11442 242191 298633 244323 145028 281632 237521 39857 -4449 -57258 -69474 -2069 53471
11431 53471 88113 88942 98946 153278 86353 -15284 43053 -45203 -42415 130155 288016 274558
11419 274558 274180 368840 308530 177581 42944 83672 38322 31641 57567 114150 136053 43862
11407 43862 -40964 -82906 -11055 244920 307710 332785 278819 220032 142949 92145 141403
11396 141403 157700 62499 109773 -67722 -71566 9566 17834 129356 296722 183668 137115
11385 137115 86596 -76198 -248844 -193773 -194308 -152117 -49921 33171 125598 86920 2753
11374 2753 -5144 -99507 -108936 13908 128859 59827 47779 74585 51776 -20509 97977 155359
$$ packed form
11453C13255j53924o3273r2377l8444m1703J7477O7683K3338J81282O2652l3775
11442B42191N6442n4310r9295J36604m4111j97664m4306n2809j2216O7405N5540
11431E3471L4642Q29J0004N4332o6925j01637N8337q8256K788J72570J57861j3458
11419B74558l78R4660o0310j30949j34637M0728m5350o681K5926N6583K1903r2191
11407D3862q4826m1942P1851K55975O2790K5075n3966n8787p7083n0804M9258
11396A41403J6297r5201M7274j77495l844Q1132Q268J11522J67366j13054m6553
11385A37115n0519j62794j72646N5071n35M2191J02196Q3092R2427l8678q4167
11374B753p897r4363r429J22844J14951o9032j2048K6806k2809p2285J18486N7382
$$ plain form
11362 155359 295337 276384 254252 294914 441685 463021 495224 424980 375507 358152 267682
11351 267682 8174 -5808 139781 131315 -35700 -97203 -285833 -205785 -4780 -19334 -68931
11340 -68931 15399 -36732 32748 67150 39948 64272 100583 78174 -39102 -21155 -84565
11329 -84565 -154796 -149299 -22489 69493 -105307 -166879 -273224 -141831 113803 166130 206664
11318 206664 239373 175016 276341 139488 51226 165398 233625 236005 140310 198085 378756
11307 378756 196478 113142 215181 138931 36794 -38060 200802 287234 203735 27812
11297 27812 53035 -16780 -100054 -80969 30484 -91660 -44453 55221 63687 -44295 -72556
11286 -72556 30187 147256 1664 -107137 -7630 186115 247222 38355 11426 11660 -19252
$$ packed form
11362A55359J39978j8953k2132M0662J46771K1336L2203p0244m9473j7355r0470
11351B67682k59508j3982J45589q466j67015o1503j88630Q0048K01005j4554m9597
11340f8931Q4330n2131O9480L4402k7202K4324L6311k2409j17276J7947o3410
11329h4565p0231N497J26810R1982j74800o1572j06345J31393K55634N2327M0534
11318B06664L2709o4357J01325j36853q8262J14172O8227K380r5695N7775J80671
11307C78756j82278q3336J02039p6250j02137p4854K38862Q6432q3499j75923
11297B7812K5223o9815q3274J9085J11453j22144M7207R9674Q466j07982k8261
11286g2556J02743J17069j45592j08801R9507J93745O1107k08867k6929K34l0912
$$ plain form
11275 -19252 -5640 -110226 26627 75016 14278 44737 -72308 -56325 -38196 158417 179750
11264 179750 96884 232520 314400 137758 88798 183414 153763 45451 -123728 -192883 -184685
11253 -184685 -119580 -96308 -70170 -202654 -204241 -43874 -2384 4749 -69775 -99118 -36202
11242 -36202 -153940 -82181 125365 268414 237134 46769 -100433 30321 79623 104025
11232 104025 261665 375017 422247 372177 177351 139487 170343 141626 82932 132559 130633
11221 130633 199602 133241 108519 48993 -133567 -81521 -55628 -176496 -102708 -15680 174860
11210 174860 369574 422302 486407 466036 296266 157802 150832 177604 217667 287198 426685
11199 426685 481108 483727 287779 92050 31277 225601 314939 422558 363175 220957 112552
$$ packed form
11275a9252J3612j04586J36853M8389o0738L0459j17045J5983J8129J96613K1333
11264A79750q2866J35636Q1880j76642m8960R4616k9651j08312j69179o9155Q198
11253a84685O5105K3272K6138j32484j587J60367M1490P133p4524k9343O2916
11242c6202j17738P1759K07546J43049l1280j90365j47202J30754M9302K4402
11232A04025J57640J13352M7230n0070j94826l7864L0856k8717n8694M9627j926
11221A30633O8969o6361k4722n9526j82560N2046K5893j20868P3788Q7028J90540
11210A74860J94714N2728O4105k0371j69770j38464o970K6772M0063O9531J39487
11199D26685N4423K619j95948j95729o0773J94324Q9338J07619n9383j42218j08405
$$ plain form
11188 112552 139141 171093 137943 -26280 -59528 54826 230757 293057 147518 72120 50117
11177 50117 34555 -22241 -1737 196485 296698 229424 207277 123429 23794 -334 134760
11166 134760 71738 -119241 -229192 -134462 -108471 -45880 31739 -48696 -133593 -174256 -217851
11155 -217851 -102986 45797 205876 244037 154553 68750 104951 107049 115789 85380 13188
11144 13188 78919 70375 53232 102907 141955 89241 95953 19600 -7991 25053 15765 135029
11132 135029 313610 257780 145511 -2697 -53977 -57894 -106288 78145 343448 331336 112423
11121 112423 -67136 -50709 158337 207106 122350 -23241 -133831 -42019 -131062 -193936 -60406
11110 -60406 111240 167982 -31209 -132634 -122404 -69788 -103550 -48891 -53906 -59261 43085
$$ packed form
11188A12552K6589L1952l3150j64223l3248J14354J75931O2300j45539p5398k2003
11177E0117j5562n6796K0504J98222J00213o7274k2147q3848r9635k4128J35094
11166A34760o3022j90979j09951R4730K5991O2591P7619q0435q4897m0663m3595
11155b17851J14865J48783J60079L8161q9484q5803L6201K098Q740l0409p2192
11144A3188O5731q544j7143M9675L9048n2714O712p6353k7591L3044r288J19264
11132A35029J78581n5830j12269j48208n1280l917m8394J84433K65303j2112k18913
11121A12423j79559J6427K09046M8769q4756j45591j10590R1812q9043o2874J33530
11110f0406J71646N6742j99191j01425J0230N2616l3762N4659n015n355J02346
$$ plain form
11099 43085 64991 -21322 -9927 -34100 -19568 -7464 103170 261389 285993 258269 199554
11088 199554 -28592 -275954 -214653 -140957 -97160 -5952 -16329 27491 -59466 -118 91537
11077 91537 76831 22768 -34182 -46597 -10551 554 -157233 -210494 -157298 -171565 -137277
11066 -137277 -140137 -141996 -156694 -86100 54148 251986 360141 178156 -62992 -101805 -32071
11055 -32071 118461 249639 96227 -84472 -289299 -307077 -81534 254009 339676 349237
11045 349237 487488 513309 402890 339717 324601 315895 368904 588016 646632 721326 891433
11034 891433 1058928 1142757 1260987 1231240 991616 1038946 1026385 800576 808697 908965 1078208
11023 1078208 1306089 1689943 2031067 2132645 1905018 1534467 1360663 1393863 1236202 1128962
$$ packed form
11099D3085K1906q6313J1395k4173J4532J2104J10634J58219K4604k7724n8715
11088A99554k28146k47362O1301P3696M3797R1208j0377M3820q6957N9348R1655
11077I1537j4706n4063n6950j2415L6046J1105j57787n3261N3196j4267L4288
11066a37277k860j859j4698P0594J40248J97838J08155j81985k41148l8813O9734
11055c2071J50532J31178j53412j80699k04827j7778K25543L35543Q5667R561
11045C49237J38251K5821j10419o3173j5116q706N3009K19112N8616P4694J70107
11034H91433J67495Q3829J18230k9747k39624M7330j2561k25809Q121J00268J69243
11023A078208K27881L83854L41124J01578k27627l70551j73804L3200j57661j07240
$$ plain form
11013 1128962 1151816 1091062 1193878 1313475 1334765 1305466 1086364 924682 809636 715045
11003 715045 484524 398935 322355 478598 544735 565674 522366 497360 410526 374515 309711
10992 309711 316652 383913 275782 286831 328132 276792 81950 -18718 -13727 -17817 -125434
10981 -125434 -169981 -129538 -20989 -50953 97982 98545 82534 189833 351893 179869 -24395
10970 -24395 -1250 91189 162345 56104 127922 279436 249322 97914 -17514 34872 -13523
10959 -13523 -3194 -85406 -12662 24811 -145213 -130751 141489 342560 462135 481255 334705
10948 334705 359472 374608 297110 215861 216535 283349 161715 66039 94728 86627 83518 65846
10936 65846 96698 122333 128261 58455 106615 177441 126666 212010 335352 368801 319414 274467
$$ packed form
11013A128962K2854o0754J02816J19597K1290k9299k19102j61682j15046r4591
11003G15045k30521q5589p6580J56243O6137K0939m3308k5006q6834l6011o4804
10992C09711O941O7261j08131J1049M1301n1340j94842j00668M991m090j07617
10981a25434m4547M0443J08549k9964J48935N63j6011J07299J62060j72024k04264
10970b4395K3145R2439P1156j06241P1818J51514l0114j51408j15428N2386m8395
10959a3523J0329q2212P2744L7473j70024J4462K72240K01071J19575J9120j46550
10948C34705K4767J5136p7498q1249O74O6814j21634r5676K8689q101l109j7672
10936F5846L0852K5635N928o9806M8160P0826n0775Q5344J23342L3449m9387m4947
$$ plain form
10924 274467 241320 110573 51179 -50484 -194237 -200745 -78568 18623 7847 15873 46114
10913 46114 42911 -22238 56142 78226 78378 39525 -52436 -174041 -153921 -115681 20917 94951
10901 94951 70400 64283 171965 178848 -98417 -188397 -55896 58535 -22012 -233267 -112244
10890 -112244 37885 62716 237537 353285 263530 266523 154920 90885 -70113 -194804
10880 -194804 -210489 -132028 58829 134741 59608 124138 96406 73955 77352 225025 181208
10869 181208 142817 92156 -18979 -32803 20464 -19418 -146152 -59657 -68473 5695 54785
10858 54785 26197 -20226 14902 140671 79131 -16112 54639 115043 108053 177609 173997 134848
10846 134848 248588 414071 445690 502095 443859 288774 145220 94181 133794 124300 237731
$$ packed form
10924B74467l3147j30747n9394j01663j43753o508J22177R7191j0776Q026L0241
10913D6114l203o5149P8380K2084J52l8853r1961j21605K0120L8240J36598P4034
10901I4951k4551o117J07682O883k77265q9980J32501J14431q0547k11255J21023
10890a12244J50129K4831J74821J15748q9755K993j11603o4035j60998j24691
10880a94804j5685P8461J90857P5912p5133O4530k7732k2451L397J47673m3817
10869A81208l8391n0661j11135j3824N3267l9882j26734Q6495q816P4168M9090
10858E4785k8588m6423L5128J25769o1540r5243P0751O0404o990O9556l612l9149
10846A34848J13740J65483L1619N6405n8236j55085j43554n1039L9613r494J13431
$$ plain form
10835 237731 339334 325541 250624 -36051 -228904 -115879 -71265 -53339 -14705 -59627 -11317
10824 -11317 -57170 -10511 155720 216682 152594 135909 36700 126771 -52567 -154632 -129258
10813 -129258 -90333 -18319 18059 16890 -58030 32486 21631 -91479 -94060 -80910 110793
10802 110793 15204 -69452 2844 -66195 27506 75183 76158 138616 121060 -67217 -78420 -104901
10790 -104901 -71268 -57806 -179119 -260847 -154975 125854 155472 88618 -93803 -99039 16144
10779 16144 127236 -26157 -144063 -91541 74321 66263 -220870 -285778 -210772 -119081 -67007
10768 -67007 3951 -42622 -71580 33981 113177 30873 20007 163542 205389 287086 283831
10757 283831 356502 329004 82346 12133 -42546 -111013 -89611 -67988 -88394 4549 -4795
$$ packed form
10835B37731J01603j3793p4917k86675j92853J13025M4614J7926L8634m4922M8310
10824a1317m5853M6659J66231O0962o4088j6685r9209R0071j79338j02065K5374
10813a29258L8925P2014L6378j169p4920R0516j0855j13110k581J3150J91703
10802A10793r5589q4656P2296o9039R3701M7677R75O2458j7556j88277j1203k6481
10790a04901L3633J3462j21313q1728J05872K80829K9618o6854j82421n236J15183
10779A6144J11092j53393j17906N2522J65862q058k87133o4908P5006R1691N2074
10768f7007P0958m6573k8958J05561P9196q2304j0866J43535M1847Q1697l255
10757B83831P2671k7498k46658p0213n4679o8467K1402K1623k0406R2943r344
$$ plain form
10746 -4795 -22754 144145 369740 326959 223774 214834 151232 204785 294383 322058 338108
10735 338108 305929 113488 -13350 -10343 25904 150907 238828 210880 222032 397736 330577
10724 330577 472787 353651 209684 104189 -22446 71535 104574 156417 31308 -220263
10714 -220263 -228620 -150135 -239998 -263230 -139946 51438 65293 -181302 -337405 -155887 -24914
10703 -24914 -104220 -172449 -54129 -377 -7116 -113243 36926 173037 215332 141221 -25665
10692 -25665 -127929 -100488 -90871 -5646 48961 73731 6311 -14675 -159427 -119479 -84775
10681 -84775 -121613 -113090 1174 130771 123977 202976 309832 96039 12872 122742 241618
10670 241618 326677 353396 381602 495042 505449 542350 729924 860339 1092896 1573310
$$ packed form
10746d795j7959J66899K25595m2781j03185q940o3602N3553Q9598K7675J6050
10735C38108l2179j92441j26838L007L6247J25003Q7921k7948J1152J75704o7159
10724C30577J42210j19136j43967j05495j26635R3981L3039N1843j25109k51571
10714b20263q357P8485q9863k3232J23284J91384J3855k46595j56103J81518J30973
10703b4914p9306o8229J18320N3752o739j06127J50169J36111M2295p4111j66886
10692b5665j02264K7441R617Q5225N4607K4770o7420k0986j44752L9948L4704
10681h4775l6838Q523J14264J29597o794P8999J06856k13793q3167J09870J18876
10670B41618Q5059K6719K8206J13440J0407L6901J87574J30415K32557M80414
$$ plain form
10660 1573310 2041756 2688813 3442319 4379413 5400466 6206771 6285159 5971173 5377842
10651 5377842 4491324 3891120 3523473 3247976 2801896 2502031 2167465 2018981 2034375 2015212
10641 2015212 1925310 1863294 1851630 2062160 2197734 2462499 2761576 3214320 3867640 4721054
10631 4721054 5458979 5936981 6456996 6754080 7171155 7962068 8935956 10103465 12045513
10622 12045513 14781250 18865127 24508373 31826251 41685491 54482221 70069341 85943194
10614 85943194 97836914 102008371 99080715 92653448 87131963 85506310 89053876 98755820
10606 98755820 115744178 140941067 173153270 205499337 225921730 225728918 208055033
10599 208055033 184635950 165522028 155209045 154979809 165536963 187721714 221786262
$$ packed form
10660A573310M68446O47057P53506R37094J021053Q06305P8388l13986n93331
10651E377842q86518o00204l67647k75497m46080k99865l34566j48484J5394j9163
10641B015212q9902o2016j1664K10530J35574K64765K99077M52744O53320Q53414
10631D721054P37925M78002N20015K97084M17075P90913R73888J167509J942048
10622A2045513K735737M083877N643246P317878R859240J2796730J5587120J5873853
10614H5943194J1893720M171457k927656o427267n521485j625653L547566R701944
10606I8755820J6988358K5196889L2212203L2346067K0422393j92812j7673885
10599B08055033k3419083j9113922j0312983k29236J0557154K2184751L4064548
$$ plain form
10592 221786262 263870372 302544429 320919704 308158551 271735856 229244676 194407445
10585 194407445 171526178 160145497 159301179 168379689 186197386 208885921 227877329
10578 227877329 231682969 214647233 183326024 150462369 123985659 106098672 95877057
10571 95877057 91903006 92969969 97712228 103719720 107406362 104406132 93552231 77842319
10563 77842319 61714085 48177295 37794084 30043639 24420035 20483258 17383878 15096199
10555 15096199 13386649 11995792 10888763 9752207 8628368 7588553 6921806 6438065
10547 6438065 5973738 5592786 5241109 4896681 4566670 4467819 4284744 3973192 3720970 3353029
10537 3353029 3096739 3051453 2846126 2842812 2810649 2656446 2470245 2415916 2406118 2371014 2326957
$$ packed form
10592B21786262M2084110L8674057J8375275j2761153l6422695m2491180l4837231
10585A94407445k2881267j1380681q44318R078510J7817697K2688535J8991408
10578B27877329L805640j7035736l1321209l2863655k6476710j7886987j0221615
10571I5877057l974051J066963M742259O007492L686642l000230j0853901j5709912
10563G7842319j6128234j3536790j0383211p750445n623604l936777l099380k287679
10555A5096199j709550j390857j107029j136556j123839j039815o66747m83741
10547F438065m64327l80952l51677l44428l30011r8851j83075l11552k52222l67941
10537C353029k56290m5286k05327l314l2163j54203j86201n4329r798l5104m4057
$$ plain form
10526 2326957 2235009 2143863 1830027 1745770 1679588 1596914 1627454 1549221 1401422 1473786 1409153
10515 1409153 1316388 1257354 1248372 1385395 1446215 1370971 1292700 1437195 1505443 1594330 1611074
10504 1611074 1503536 1388685 1201236 1014914 940731 1025126 1159460 1176904 1076377 1078789
10494 1078789 1145042 1411001 1435772 1182335 1124798 1254735 1287682 1213228 1071379 929055
10484 929055 846405 915504 942734 928334 1007457 935483 975047 1034030 1121152 1116575 1268444
10473 1268444 1152639 991694 906122 864265 848560 867310 877053 1057827 1298168 1291556 1414631
10462 1414631 1243356 1040973 1007911 991151 947365 904662 863747 976689 1077570 913456
10452 913456 792180 756972 674648 513498 542265 612258 696415 719348 775846 875670 793198
$$ packed form
10526B326957r1948r1146l13836q4257o6182q2674L0540p8233j47799P2364o4633
10515A409153r2765n9034q982J37023O0820p5244p8271J44495O8248Q8887J6744
10504A611074j07538j14851j87449j86322p4183Q4395J34334J7444j00527K412
10494A078789O6253K65959K4771k53437n7537J29937L2947p4454j41849j42324
10484I29055q2650O9099K7230j4400P9123p1974L9564N8983Q7122m577J51869
10473A268444j15805j60945q5572m1857j5705J8750R743J80774K40341o612J23075
10462A414631j71275k02383l3062j6760m3786m2703m0915J12942J00881j64114
10452I13456j21276l5208q2324j61150K8767O9993Q4157K2933N6498R9824q2472
$$ plain form
10441 793198 765339 655940 682705 639884 628530 507142 488585 551087 593144 517818 494408
10430 494408 493645 495160 700055 849316 849986 770647 649909 706828 657311 586293 766560 703075
10418 703075 517193 460190 504257 544042 524473 530595 629586 655686 777275 816058 699678
10407 699678 595042 581237 688132 676097 567168 589268 588631 717663 606895 403929 448763
10396 448763 387263 305387 297579 406300 573486 541175 452061 551065 454946 279163 228257
10385 228257 230626 444803 579585 412185 219139 223951 170555 316679 304561 262157 216049
10374 216049 168148 240016 163827 273437 451982 393315 170841 44841 -21277 175212
10364 175212 290009 283876 248554 252331 40142 29398 -45437 -61680 91465 212164 329292
$$ packed form
10441G93198k7859j09399K6765m2821j1354j21388j8557O2502M2057p5326k3410
10430D94408p63J515K04895J49261O70p9339j20738N6919m9517p1018J80267o3485
10418G03075j85882n7003M4067L9785j9569O122R8991K6100J21589L8783j16380
10407F99678j04636j3805J06895j2035j08929K2100o37J29032j10768k02966M4834
10396D48763o1500q1876p808J08721J67186l2311q9114R9004r6119j75783n0906
10385B28257K369K14177J34782j67400j93046M812n3396J46124j2118m2404m6108
10374B16049m7901P1868p6189J09610J78545n8667k22474j26000o6118J96489
10364A75212J14797o133l5322L777k12189j0744p4835j6243J53145J20699J17128
$$ plain form
10353 329292 186415 266306 522621 573524 468489 626644 524699 222372 83304 -14241
10343 -14241 136415 208466 288802 422073 482631 377007 205495 205880 197453 258589 439006
10332 439006 429583 389420 365472 305939 219508 100945 167810 200274 224508 359793 287132
10321 287132 202049 215862 245492 277758 205910 231476 83904 234021 90312 127227 143525
10310 143525 44174 17226 92237 244585 396834 311536 224876 219053 179330 243332 238906
10299 238906 333051 336332 290655 317490 472044 411605 349487 584843 520620 377377 447449
10288 447449 242409 43028 115468 443883 524542 537539 649045 596532 592280 628441 734392
10277 734392 915400 1090094 1414461 1807966 2499128 3366286 4351422 5510045 6903511
$$ packed form
10353C29292j42877P9891K56315N0903j05035J58155j01945l02327j39068r7545
10343a4241J50656P2051Q0336J33271O0558j05624j71512L85q427O1136J80417
10332D39006r423m0163k3948n9533q6431j18563O6865L2464K4234J35285p2661
10321B87132q5083J3813K9630L2266p1848K5566j47572J50117j43709L6915J6298
10310A43525r9351k6948P5011J52348J52249q5298q6660n823l9723O4002m426
10299B38906R4145L281m5677K6835J54554o0439o2118K35356o4223j43243P0072
10288D47449k05040j99381P2440L28415Q0659J2997J11506n2513m252L6161J05951
10277G34392J81008J74694L24367L93505O91162Q67158R85136J158623J393466
$$ plain form
10268 6903511 8499347 9813005 10340401 10303289 10155271 9691629 8906224 7757271 6379849
10259 6379849 5338853 4311730 3457908 2468591 1781782 1334671 1025923 949478 917199
10250 917199 960238 794354 578748 503489 594996 715282 705579 565160 465829 457934 387626
10239 387626 382238 439929 382603 371849 255224 301492 310574 338921 234509 101734 49597
10228 49597 -3813 -12428 -239396 -92985 41794 52998 236736 347037 339359 272654 163378
10217 163378 39528 121896 95051 168372 191157 123973 -42779 81631 218825 359025
10207 359025 324935 269769 180235 241980 235923 182974 202365 213170 333181 371170 220916
10196 220916 211300 50348 97548 77804 15317 -4651 39987 312915 358181 324308 332288
$$ packed form
10268F903511J595836J313658N27396l7112j48018m63642p85405j148953j377422
10259F379849j040996j027123q53822r89317o86809m47111l08748p6445l2279
10250I17199M3039j65884k15606p5259R1507J20286r703j40419r9331p895p0308
10239C87626n388N7691n7326j0754j16625M6268R082K8347j04412j32775n2137
10228D9597n3410q615k26968J46411J34779J1204J83738J10301p678o6705j09276
10217A63378j23850Q2368k6845P3321K2785o7184j66752J24410J37194J40200
10207C59025l4090n5166q9534O1745o057n2949J9391J0805J20011L7989j50254
10196B20916r616j60952M7200j9744o2487j9968M4638K72928M5266l3873P980
$$ plain form
10185 332288 420642 362664 557268 476654 192666 354557 589061 600434 616643 616229 680161
10174 680161 759277 654438 504618 618605 805358 924122 1061991 1059052 1192394 1264333
10164 1264333 1305494 1167442 955368 1034603 992802 1058514 1222874 1293036 1476486 1557784
10154 1557784 1734366 1890106 1739250 1401308 1128718 1050664 969521 837147 762518 845232
10144 845232 1164160 1448241 1672227 1742153 1566847 1143041 874092 783488 709883 650273
10134 650273 623928 703764 676218 628425 652935 746446 925979 773067 586634 374088 107677
10123 107677 195386 347381 546281 575632 539394 416546 166059 54118 63837 149906 1465
10112 1465 -132385 -135072 -137116 27358 66681 116339 233953 270314 311297 285504 50092
$$ packed form
10185C32288Q8354n7978J94604q0614k83988J61891K34504J1373J6209m14O3932
10174F80161P9116j04839j49820J13987J86753J18764J37869k939J33342P1939
10164A264333M1161j38052k12074P9235m1801O5712J64360P0162J83450Q1298
10154A557784J76582J55740j50856l37942k72590p8054q1143j32374p4629Q2714
10144H45232L18928K84081K23986O9926j75306m23806k68949r0604p3605n9610
10134F50273k6345P9836k7546m7793K4510R3511J79533j52912j86433k12546k66411
10123A07677Q7709J51995J98900K9351l6238j22848k50487j11941R719Q6069j48441
10112A465j33850k687k044J64474L9323M9658J17614L6361M0983k5793k35412
$$ plain form
10101 50092 -30782 -22059 109819 124333 137281 267268 254852 220273 291641 290676 131510 4291
10089 4291 66412 283507 193834 -42590 -143049 -140722 -51393 -126741 91562 266529 86838
10078 86838 -56999 -160444 -185350 -144200 -186853 -267660 -163448 131835 268322 419582
10068 419582 291787 107337 23082 12691 -38370 30532 67614 107660 169088 176388 114315
10057 114315 -46241 -97632 -162793 -202896 -84901 -14507 15402 143720 181034 55625 -56
10046 -56 -46829 -178748 -232095 -162993 -153958 -69661 12193 69531 34269 -61966 51411 118955
10034 118955 10072 -193210 -199735 9659 -2429 -55333 -74400 -80592 -27620 19172 -130367
10023 -130367 -162563 -11196 242489 166739 85520 140204 109499 48077 147553 96219 -14757
$$ packed form
10101E0092q0874Q723J31878J4514J2948J29987j2416l4579P1368r65j59166j27219
10089D291O2121K17095q9673k36424j00459K327Q9329p5348K18303J74967j79691
10078H6838j43837j03445k4906M1150m2653q0807J04212K95283J36487J51260
10068D19582j27795j84450q4255j0391n1061O8902L7082M0046O1428P300o2073
10057A14315j60556n1391o5161m0103J17995P0394K9909J28318L7314j25409n5681
10046e6m6773j31919n3347O9102R035Q4297Q1854N7338l5262r6235J13377O7544
10034A18955j08883k03282o525K09394j2088n2904j9067o192N2972M6792j49539
10023a30367l2196J51367K53685p5750q1219N4684l0705o1422R9476n1334j10976
$$ plain form
10012 -14757 102328 156378 30060 -115360 -119950 -102993 -64387 -6086 20277 -41969 40127
10001 40127 66938 1998 -49630 189267 198834 83884 -8949 18561 -45742 185920 305352
9990 305352 261048 174018 127723 146042 -53524 15812 255818 417422 292769 263792 323101
9979 323101 161720 22868 11525 95239 129618 89553 65547 98734 104475 57073 141614
9968 141614 214306 174718 104517 213256 392351 423163 151359 -44397 -37083 145260 298925
9957 298925 251825 132379 84207 136378 -22937 55532 134764 70319 -16747 10543 9348
9946 9348 -31270 -28958 112956 237776 214677 70242 15495 43031 107356 60271 262475
9935 262475 148198 84386 151103 55304 -89684 -180721 -46907 -69932 3721 159450 200649
$$ packed form
10012a4757J17085N4050j26318j45420m590J6957L8606N8301K6363o2246Q2096
10001D0127K6811o4940n1628K38897R567j14950r2833K7510o4303K31662J19432
9990C05352m4304q7030m6295J8319j99566O9336K40006J61604j24653k8977N9309
9979C23101j61381j38852j1343Q3714L4379m0065k4006L3187N741m7402Q4541
9968A41614P2692l9588p0201J08739J79095L0812k71804j95756P314J82343J53665
9957B98925m7100j19446m8172N2171j59315P8469P9232o4445q7066K7290j195
9946I348m0618K312J41914J24820k3099j44435n4747K7536O4325m7085K02204
9935B62475j14277o3812O6717r5799j44988r1037J33814k3025P3653J55729M1199
$$ plain form
9924 200649 116677 159448 233331 149203 244311 269023 201612 144462 228450 148518 74492 137958
9912 137958 265209 114059 -217987 -313237 -194532 117443 310960 316378 276495 147042
9902 147042 184350 272168 240290 133486 61722 -62700 -36907 99816 151697 -52502 -72694
9891 -72694 -26666 -27378 131474 148713 -21310 -187697 -166861 -221260 -181425 -111971 -113440 -160626
9879 -160626 -118202 -27624 -118848 -149614 -203072 -117222 -19695 140529 176324 252895 203340
9868 203340 228692 182127 -3841 -12861 19650 70895 150850 159612 202760 166968 67067 -47767
9856 -47767 261 111274 102424 4401 -75914 -8907 159827 210531 28258 17883 38551
9845 38551 -123584 -26752 -44468 -159708 -253276 -223333 -225805 -44322 89158 182658 159386
$$ packed form
9924B00649q3972M2771P3883q4128R5108K4712o7411n7150Q3988p9932p4026O3466
9912A37958J27251j51150l32046r5250J18705L11975J93517N418l9883j29453
9902A47042L7308Q7818l1878j06804p1764j24422K5793J36723N1881k04199k0192
9891g2694M6028p12J58852J7239j70023j66387K0836n4399L9835O9454j469m7186
9879a60626M2424R0578r1224l0766n3458Q5850R7527J60224L5795P6571m9555
9868B03340K5352m6565j85968r020L2511N1245P9955Q762M3148l5792r9901j14834
9856d7767M8028J11013q850r8023q0315O7007J68734N0704j82273j0375K0668
9845C8551j62135R6832j7716j15240r3568K9943k472J81483J33480R3500k3272
$$ plain form
9834 159386 143304 173870 116960 56492 -32312 10502 -18622 -22949 -44862 -26624 -155364 -145790
9822 -145790 25837 10936 139384 156364 183972 286084 197395 18 -36612 96882 104665
9811 104665 70170 18006 117920 252123 126165 64467 -7762 47796 140768 221001 37237
9800 37237 -55884 62312 46790 -8278 -3787 107498 123460 319024 306368 151044 220502
9789 220502 154072 190200 258803 266003 271557 255106 32505 156227 255022 179987 230920 -59134
9777 -59134 -156848 -89181 -13261 -19001 -49360 -4551 4331 -110258 96751 211203 244269 201133
9765 201133 183610 -46416 -60514 109744 96108 -46923 -123939 1970 -203765 -340714
9755 -340714 -159082 -60603 -52806 142357 112897 -78981 -156580 -183851 -216258 46698 -21072
$$ packed form
9834A59386j6082L0566n6910o0468q8804M2814k9124m327k1913J8238j28740R574
9822a45790J71627j4901J28448J6980K7608J02112q8689j97377l6630J33494P783
9811A04665l4495n2164R9914J34203j25958o1698p2229N5558R2972Q0233j83764
9800C7237r3121J18196j5522n5068M491J11285J5962J95564j2656j55324O9458
9789B20502o6430L6128O8603P200N554j6451k22601J23722R8795p5035N0933k90054
9777e9134r7714O7667P5920n740l0359M4809Q882j14589K07009J14452L3066m3136
9765B01133j7523k30026j4098J70258j3636j43031p7016J25909k05735j36949
9755c40714J81632R8479P797J95163k9460j91878p7599k7271l2407K62956o7770
$$ plain form
9744 -21072 -95245 -162715 -25840 -8855 -142134 -124359 75363 -18754 156295 214118 117686
9733 117686 165552 118051 13051 126752 174956 153940 -199 -35172 -57992 -100171 -134212
9722 -134212 17925 75440 117035 -31745 -41022 191349 127783 26738 74571 113829 98569
9711 98569 91104 186860 215952 154268 135012 72487 38958 75346 41457 19829 -12971 11337
9699 11337 -69161 -45108 -54678 -209595 -29352 33412 -2652 -62520 25683 -67778 -12020 49692
9687 49692 -54007 -20089 75944 169804 -6263 -104070 -76627 -58553 -76516 -148703 -74581
9676 -74581 92362 173513 39981 -20453 -65706 161778 104393 133215 173201 30213 46810
9665 46810 217417 204007 62008 59457 30034 180225 419431 452236 518729 564171 577031
$$ packed form
9744b1072p4173o7470J36875J6985j33279J7775J99722r4117J75049N7823r6432
9733A17686M7866m7501j05000J13701M8204k1016j54139l4973k2820m2179l4041
9722a34212J52137N7515M1595j48780r277K32371o3566j01045M7833L9258j5260
9711I8569p465R5756K9092o1684j9256o2525l3529L6388l3889k1628l2800K4308
9699A1337q0498K4053r570j54917J80243O2764l6064n9868Q8203r3461N5758O1712
9687D9692j03699L3918R6033R3860j76067r7807K7443J8074j7963p2187P4122
9676g4581J66943Q1151j33532o0434m5253K27484n7385K8822L9986j42988J6597
9665D6810J70607j3410j41999k551k9423J50191K39206L2805O6493M5442J2860
$$ plain form
9654 577031 969065 1771707 2508358 2710034 2115564 1377915 791384 578896 407887 114688
9644 114688 85230 86507 15934 1980 43061 -39860 -6675 80191 173526 107838 13227 18692
9632 18692 -42422 -49472 104452 222654 157849 95134 258569 245836 116906 -46802 -143979
9621 -143979 -110551 -69863 55400 91646 -56115 -135324 -116920 -200803 -256719 -161060 -19985
9610 -19985 16331 317209 503366 245241 93505 38456 -41413 65501 22481 -3356 -154415
9599 -154415 -303817 -232396 -9744 73817 24292 48758 31419 -74918 -142787 -184609 -194737
9588 -194737 -106377 76470 64179 8584 -57816 15319 91233 30561 55719 -111791 -275328
9577 -275328 -322688 -112411 -4993 104918 181990 180420 122720 72793 132431 12905 150754
$$ packed form
9654E77031L92034Q02642P36651K01676n94470p37649n86531k12488j71009k93199
9644A14688k9458J277p0573j3954M1081q2921L3185Q6866R3335o5688r4611N465
9632A8692o1114p050J53924J18202o4805o2715J63435j2733j28930j63708r7177
9621a43979L3428M0688J25263L6246j47761p9209J8404q3883n5916R5659J41075
9610a9985L6316L00878J86157k58125j51736n5049p9869J06914m3020k5837j51059
9599a54415j49402P1421K22652Q3561m9525K4466j7339j06337o7869m1822j0128
9588a94737Q8360J82847j2291n5595o6400P3135P5914o0672K5158j67510j63537
9577b75328m7360K10277J07418J09911P7072j570n7700m9927N9638j19526J37849
$$ plain form
9566 150754 89929 111067 22011 6851 22882 -12878 -215040 -98672 -18151 -44264 18310
9555 18310 6547 29890 -13640 15941 -63623 -104768 83041 108645 200877 226993 111455
9544 111455 48817 -88022 -110259 -292738 -282095 -490413 -592168 -595312 -521855 -329302 -236697
9533 -236697 -67627 -38413 -52950 -79057 -155317 -280735 -347179 -377601 -262785 -86924 -130084
9522 -130084 -48268 139078 118338 64671 -129889 -132956 -55750 -47032 -172371 -167506 -201457 -208111
9510 -208111 -219691 -270198 -221238 -124993 14169 104689 153918 104051 44833 -70507 -218166
9499 -218166 -308346 -155291 -128024 -130362 -65795 -9126 186623 193251 85221 57657 179629
9488 179629 135365 197669 155065 121826 -59780 -132001 -59892 -161408 -165790 -682 107490
$$ packed form
9566A50754o0825K1138q9056j5160J6031l5760k02162J16368Q0521k6113O2574
9555A8310j1763K3343m3530K9581p9564m1145J87809K5604R2232K6116j15538
9544A11455o2638j36839k2237j82479J0643k08318j01755l144P3457J92553R2605
9533b36697J69070K9214j4537k6107p6260j25418o6444l0422J14816J75861m3160
9522a30084Q1816J87346k0740n3667j94560l067P7206Q718j25339M865l3951o654
9510b08111j1580n0507M8960R6245J39162R0520M9229m9867n9218j15340j47659
9499b18166r0180J53055K7267k338O4567N6669J95749O628j08030k7564J21972
9488A79629m4264O2304m2604l3239j81606p2221P2109j01516m382J65108J08172
$$ plain form
9477 107490 61447 32387 -9459 -68653 -116161 -65447 11832 16330 270218 174566 127953 56910
9465 56910 -111415 -46501 157694 193570 99218 -108351 -209157 -143476 -7764 -109070 -80818
9454 -80818 -231676 -351901 -325292 -300705 -233376 -150823 -114607 -41770 -143224 -171926 -128570
9443 -128570 -408349 -447970 -440138 -94833 126581 50354 46946 -50783 -148748 -67060 69241
9432 69241 67827 -42360 27109 -62608 -149590 -166178 -90284 -101888 -34804 -91498 -98625 -182938
9420 -182938 -250289 -302410 -422812 -360991 -266888 -225607 -123264 61159 187745 165747 174074
9409 174074 -52080 -124915 66119 202891 178410 284863 198747 231535 148432 78049 55387
9398 55387 137696 196106 49018 -56113 -110014 -157226 -104936 30884 96195 64765 -14418
$$ packed form
9477A07490m6043k9060m1846n9194m7508N0714P7279M498K53888r5652m6613p1043
9465E6910j68325O4914K04195L5876r4352k07569j00806O5681J35712j01306K8252
9454h0818j50858j20225K6609K4587O7329Q2553L6216P2837j01454k8702M3356
9443a28570k79779l9621P832L45305K21414p6227l408r7729r7965Q1688J36301
9432F9241j414j10187O9469q9717q6982j6588P5894j1604O7084n6694p127q4313
9420a82938o7351n2121j20402O1821R4103M1281J02343J84423J26586k1998Q327
9409A74074k26154p2835J91034J36772k4481J06453q6116L2788q3103p0383k2662
9398E5387Q2309N8410j47088j05131n3901m7212N2290J35820O5311l1430p9183
$$ plain form
9387 -14418 117033 56366 -60543 -59916 -36146 -45287 119463 220430 117094 123647 123669 5098
9375 5098 -28658 4371 -9572 46858 31086 -47051 -104234 -144362 -84906 115369 25524 -106395
9363 -106395 -132862 -176888 -91608 49960 10014 28714 94646 77586 61398 110487 -38559
9352 -38559 -111176 -171009 -163235 -152950 86259 199974 167920 19643 248619 403472 282001
9341 282001 105552 40476 35530 117583 -116758 -238443 -274071 -113742 -170727 -191988 -141889
9330 -141889 -137533 -185380 -330048 -469086 -335074 -199371 -165666 -248443 -322830 -226820 -200990
9319 -200990 -172420 -225253 -195434 -330885 -390192 -350742 -260187 -150597 -140854 -172471 -215925
9308 -215925 -189579 16465 92799 -589 -28582 -49833 -27768 -65451 14066 11259 -58567 -47194
$$ packed form
9387a4418J31451o0667j16909O27K3770r141J64750J00967j03336O553K2j18571
9375E098l3756L3029j3943N6430j5772p8137n7183m0128N9456K00275q9845j31919
9363a06395k6467m4026Q5280J41568l9946J8700O5932j7060j6188M9089j49046
9352c8559p2617n9833P774J0285K39209J13715l2054j48277K28976J54853j21471
9341B82001j76449o5076m946Q2053k34341j21685l5628J60329n6985k1261N0099
9330a41889M356m7847j44668j39038J34012J35703L3705q2777p4387R6010K5830
9319b00990K8570n2833K9819j35451n9307L9450R0555J09590R743l1617m3454
9308b15925K6346K06044P6334r3388k7993k1251K2065l7683P9517k807o9826J1373
$$ plain form
9296 -47194 11326 34010 45527 222362 161773 150002 -56736 -85315 -112053 -8731 140497
9285 140497 196562 174164 40405 -21067 -257921 -129071 50767 -50393 -265313 -329235
9275 -329235 -385233 -397581 -182587 -29521 33254 119681 68608 2468 72651 339399 325543
9264 325543 124478 -25602 124256 339939 269052 306395 186143 -4883 55288 105590
9254 105590 81235 72337 33232 133944 -25523 29730 114787 112679 93884 8598 34997 133348
9242 133348 67683 112288 207191 177730 128858 277475 339209 290812 145600 226675 246619
9231 246619 349790 264698 79642 88921 144544 193869 88595 31461 63068 -63278 -91304
9220 -91304 -142571 41587 194582 -14056 -76464 -195767 -304078 -245877 -48575 67104
$$ packed form
9296d7194N8520K2684J1517J76835o0589j1771k06738k8579k6738J03322J49228
9285A40497N6065k2398j33759o1472k36854J28850J79838j01160k14920o3922
9275c29235n5998j2348K14994J53066O2775Q6427n1073o6140P0183K66748j3856
9264C25543k01065j50080J49858K15683p0887L7343j20252j91026O0171N0302
9254A05590k4355q898l9105J00712j59467N5253Q5057k108j8795q5286K6399R8351
9242A33348o5665M4605R4903k9461m8872J48617O1734m8397j45212Q1075J9944
9231B46619J03171q5092j85056R279N5623M9325j05274n7134L1607j26346k8026
9220i1304n1267J84158J52995k08638o2408j19303j08311N8201J97302J15679
$$ plain form
9210 67104 11488 14570 -42980 -25326 -1183 63148 45120 60716 61862 89029 177349 159355
9198 159355 156416 289008 268490 177379 84926 3133 -46734 115052 177594 139508 138061 196618
9186 196618 286019 267604 270806 121359 -4104 58097 59377 32622 7706 -126836 -234544
9175 -234544 -199550 -237954 -280714 -327753 -306985 -315015 -440159 -226353 -26464 34545 -10046
9164 -10046 98801 -8905 -25318 35038 131632 106587 123779 108691 38925 21754 160351
9153 160351 227491 261575 61966 -94213 -99840 -74621 -93077 -69418 74303 185810 166720
9142 166720 120076 115793 91453 117879 199625 341964 327681 348928 135779 -58668 204060
9131 204060 318257 295254 277535 232810 160787 155549 83019 104120 86104 -16371 -73097
$$ packed form
9210F7104n5616L082n7550J7654K4143O4331j8028J5596J146K7167Q8320j7994
9198A59355k939J32592k0518r1111r2453q1793m9867J61786O2542l8086j447N8557
9186A96618Q9401j8415L202j49447j25463O2201J280k6755k4916j34542j07708
9175b34544L4994l8404m2760m7039K0768q030j25144K13806J99889O1009m4591
9164a0046J08847j07706j6413O0356R6594k5045J7192j5088o9766j7171J38597
9153A60351O7140L4084j99609j56179n627K5219j8456K3659J43721J11507j9090
9142A66720m6644m283k4340K6426Q1746J42339j4283K1247k13149j94447K62728
9131B04060J14197k3003j7719m4725p2023n238p2530K1101j8016j02475n6726
$$ plain form
9120 -73097 -166183 -174748 -135162 -140395 -18750 91485 -114138 -118181 130777 216381 141032 -5357
9108 -5357 -48183 -4640 117612 111763 -106644 -341517 -173549 -79735 -214625 -262435 -230749
9097 -230749 -186653 -70144 -10669 182910 46257 -86744 -71771 -148835 -48023 -44226 -72699
9086 -72699 -28372 12882 10563 -69659 -52154 -34457 21647 95746 239329 321314 162340 47938
9074 47938 -2386 2804 48702 205116 269570 191671 150705 65955 65357 -73922 -183984 -346070
9062 -346070 -254637 -62286 -95891 -18477 -26388 -6623 201962 121607 89887 195110 102777
9051 102777 -60783 -87096 -50404 -95367 -100833 -116354 -122202 -81670 -110552 -226723 -373122
9040 -373122 -281340 -135345 3430 68756 19458 -39114 16525 -147267 -272995 -255082 -160159
$$ packed form
9120g3097r3086q565L9586n233J21645J10235k05623m043K48958Q5604p5349j46389
9108e357m2826M3543J22252n849k18407k34873J67968R3814j34890m7810L1686
9097b30749M4096J16509N9475J93579j36653j33001J4973p7064J00812L797k8473
9086g2699M4327M1254k319q0222J7505J7697N6104P4099J43583Q1985j58974j14402
9074D7938n0324N190M5898J56414O4454p7899m0966q4750n98j39279j10062j62086
9062c46070R1433J92351l3605P7414p911J9765K08585q0355l1720J05223r2333
9051A02777j63560k6313L6692m4963n466j5521n848M0532k8882j16171j46399
9040c73122R1782J45995J38775O5326m9298n8572N5639j63792j25728J7913R4923
$$ plain form
9029 -160159 23880 197958 225853 61370 -110354 -225059 -320155 -296041 -147296 -150477 -101438
9018 -101438 -97999 -88479 -156127 -134676 -221008 -235080 -130532 -49393 -95100 -235364 -272876 -292999
9006 -292999 -216713 -75720 -24599 161789 17049 -1344 109535 136253 97262 156587 95568
8995 95568 -64872 -189638 -73516 134432 186779 72484 -121681 -352707 -207297 -154798
8985 -154798 -192967 -214813 -184137 -235785 -66891 116149 124810 120077 -53075 -130769 -293176
8974 -293176 -257359 -300888 -292564 -126282 -110563 -75607 -134317 -203793 -129838 -145777 -130970 -180763
8962 -180763 -182710 -142757 -147561 -197266 -123593 -70151 -21844 -145433 -133747 19051 -79516 -253065
8950 -253065 -83709 -9260 -172666 -169101 -142457 -123134 -153365 -199773 -131773 -156337 -101574
$$ packed form
9029a60159J84039J74078K7895j64483j71724j14705r5096K4114J48745l181M9039
9018a01438L439R520o7648K1451q6332j4072J04548Q1139m5707j40264l7512k0123
9006b92999P6286J40993N1121J86388j44740j8393J10879K6718l8991N9325o1019
8995I5568j60440j24766J16122K07948N2347j14295j94165k31026J45410N2499
8985a54798l8169k1846L0676n1648J68894J83040Q661m733j73152p7694j62407
8974b93176L5817m3529Q324J66282J5719L4956n8710o9476P3955j5939J4807m9793
8962a80763j947L9953m804m9705P3673N3442M8307j23589J1686J52798r8567j73549
8950b53065J69356P4449j63406L565K6644J9323l0231m6408O8000k4564N4763
$$ plain form
8939 -101574 7816 53698 76307 90829 41947 113535 96176 90141 136640 119731 162251 285320
8927 285320 149289 49249 31445 215984 266627 144032 214353 96598 -122397 -86052
8917 -86052 12611 135666 77855 50518 41576 69809 27754 -64436 4300 30013 -89891 -120035
8905 -120035 -198226 -100079 35472 113551 79826 -102040 -225817 -247923 -61154 -7386 16267
8894 16267 -86466 -61679 -8570 25759 45274 -131639 -67762 -70352 -29693 -2423 59084 239983
8882 239983 149563 -103200 32098 -27607 -96165 20217 95280 -19877 -90586 -189413 -175614
8871 -175614 -67495 -223412 -210285 -181267 -155454 -48169 -151544 -194921 -50345 -39943 -28108
8860 -28108 41787 246197 339200 169873 71690 61561 -96886 -178479 -239523 -230219 -155495
$$ packed form
8939a01574J09390M5882K2609J4522m8882P1588j7359o035M6499j6909M2520J23069
8927B85320j36031j00040j7804J84539N0643j22595P0321j17755k18995L6345
8917h6052R8663J23055n7811k7337q942K8233m2055r2190O8736K5713j19904l0144
8905a20035p8191R8147J35551P8079l3725j81866j23777k2106J86769N3768K3653
8894A6267j02733K4787N3109L4329J9515j76913O3877k590M0659K7270O1507J80899
8882B39983r0420k52763J35298n9705o8558J16382P5063j15157p0709r8827J3799
8871a75614J08119j55917J3127K9018K5813J07285j03375m3377J44576J0402J1835
8860b8108O9895K04410R3003j69327r8183j0129j58447q1593o1044R304P4724
$$ plain form
8849 -155495 -22887 67352 17309 116659 176284 189864 287516 280298 66332 -59205 -59061 -21329
8837 -21329 -88427 -18572 187378 171302 9493 59632 34535 20835 73720 -10466 -115115
8826 -115115 -73061 -122363 -111276 35218 128258 44341 -139785 -170095 -109111 -5351 286697
8815 286697 247620 186294 256374 179509 33345 -32443 -26584 184097 255564 259270 175410 16463
8803 16463 -252209 -258939 -71619 33703 79852 26079 -12106 133052 164632 45053 -176594
8792 -176594 -46326 -61943 -110288 -110691 -167390 -3574 -7698 -63687 -83979 -216467 -19971
8781 -19971 111243 17309 -47463 -175568 -13872 -404 -196303 -65632 -190754 -23966
8771 -23966 78779 94608 60694 87643 13843 -86150 -16875 -9564 60963 119641 65236 -124161
$$ packed form
8849a55495J32608R0239n0043R9350N9625J3580R7652p218k13966j25537J44L7732
8837b1329o7098O9855K05950j6076j61809N0139k5097j3700N2885q4186j04649
8826a15115M2054m9302J1087J46494R3040q3917j84126l0310O0984J03760K92048
8815B86697l9077o1326P0080p6865j46164o5788N859K10681P1467L706q3860j58947
8803A6463k68672o730J87320J05322M6149n3773l8185J45158L1580j19579k21647
8792a76594J30268j5617m8345m03n6699J63816m124n5989k0292j32488J96496
8781a9971J31214r3934o4772j28105J61696J3468j95899J30671j25122J66788
8771b3966J02745J5829l3914K6949p3800r9993O9275P311P0527N8678n4405j89397
$$ plain form
8759 -124161 -69186 -109694 -28325 -100927 -201054 -86617 -21019 -62969 -19892 73373 213721
8748 213721 196774 305242 283066 107794 -24266 -93699 7784 -83235 68579 125792 53275
8737 53275 -164464 -68692 185303 85327 211796 171320 27890 -64467 -63604 154591 151986
8726 151986 50126 82305 49658 -76551 -123050 -182061 -169510 -332833 -321737 -244488 -146868
8715 -146868 -133366 -126315 -227647 -166891 -386202 -432522 -373480 -196757 -270327 -363673 -379219
8704 -379219 -228549 -155591 -153337 -225482 -83445 -49352 -111002 -60577 -67870 -166915 -165743 -130161
8692 -130161 -49880 -64402 -82808 -6947 15728 -158743 -38701 6398 -38967 -75964 58701
8681 58701 84168 180194 181397 -10285 106383 164440 224234 49771 -7573 -28442 -115760
$$ packed form
8759a24161N4975m0508Q1369p2602j00127J14437O5598m1950M3077R3265J40348
8748B13721j6947J08468k2176j75272j32060o9433J01483r1019J51814N7213p2517
8737E3275k17739R5772K53995r9976J26469m0476j43430r2357Q63K18195k605
8726A51986j01860L2179l2647j26209m6499n9011J2551j63323J1096P7249R7620
8715a46868J3502P051j01332O0756k19311m6320N9042J76723p3570r3346j5546
8704c79219J50670P2958K254p2145J42037L4093o1650N0425p293r9045J172L5582
8692a30161Q0281j4522j8406P5861K2675j74471J20042M5099m5365l6997J34665
8681E8701K5467R6026J203j91682J16668N8057N9794j74463n7344k0869q7318
$$ plain form
8670 -115760 -11632 -120024 -388331 -558650 -521711 -388409 -351736 -316883 -228933 -219203 -269242
8659 -269242 -173629 -91685 -60967 -43405 -120071 -198546 -155994 -193749 -395808 -315398 -124764
8648 -124764 -160336 -235850 -181886 -236958 -268419 -259143 -28728 -3119 -3635 -55797 -196983 -246186
8636 -246186 -210113 -129198 -245583 -97383 32594 54837 141213 208696 261237 177190 56007
8625 56007 64165 29712 53600 201845 110467 34732 24410 -42193 -120329 -42263 18382 7334
8613 7334 117642 265828 206157 228386 194006 195885 109080 20782 -22885 -74912 -114032 -214704
8601 -214704 -129217 -101784 -143996 -213528 -356353 -348285 -28678 148101 68318 -48810 -136676
8590 -136676 -206981 -141753 -84724 15872 27121 29989 -14458 -76746 -157668 -187175 -99313 -110748
$$ packed form
8670a15760J04128j08392k68307j70319L6939J33302L6673L4853Q7950R730n0039
8659b69242R5613Q1944L0718J7562p6666p8475M2552l7755k02059Q0410J90634
8648a24764l5572p5514N3964n5072l1461R276K30415K5609n16n2162j41186m9203
8636b46186L6073Q0915j16385J48200J29977K2243Q6376O7483N2541q4047j21183
8625E6007Q158l4453K3888J48245r1378p5735j0322o6603p8136P8066O0645j1048
8613G334J10308J48186n9671K2229l4380J879q6805q8298m3667n2027l9120j00672
8601b14704Q5487K7433m2212o9532j42825Q068L19607J76779p9783j17128q7866
8590a36676p0305O5228N7029J00596J1249K868m4447o2288q0922k9507Q7862j1435
$$ plain form
8578 -110748 -86785 31430 41031 -37145 -121639 -98216 -128473 -192919 -65719 3304 44570
8567 44570 86693 73194 46787 35461 -43126 -55561 -36362 137644 89960 79925 145034 348140
8555 348140 485830 336158 248135 239671 14093 -173706 -190295 -161199 -52134 -26847 -20200
8544 -20200 -67699 -17735 4574 -242215 -393174 -424425 -279444 -153538 -22038 94350 116834
8533 116834 140802 -71567 -125735 -36454 -56080 99776 283119 27778 -62241 -189761 -224138
8522 -224138 -51030 -24877 12793 13944 -85995 -62307 14099 -43773 -176142 -227915 -258299
8511 -258299 -146716 -75113 -60707 -26568 19367 -43472 -62488 -72212 -89977 -164882 -45288
8500 -45288 156942 282743 103538 -93993 -84824 10617 77192 69738 93986 229145 76820
$$ packed form
8578a10748K3963J18215R601p8176q4494K3423l0257o4446J27200O9023M1266
8567D4570M2123j3499k6407j1326p8587j2435J9199J74006m7684j0035O5109K03106
8555C48140J37690j49672q8023q464k25578j87799j6589K9096J09065K5287O647
8544b0200m7499M9964K2309k46789j50959l1251J44981J25906J31500J16388K2484
8533A16834K3968k12369n4168Q9281j9626J55856J83343k55341r0019j27520l4377
8522b24138J73108K6153L7670J151r9939K3688P6406n7872j32369n1773l0384
8511b58299J11583P1603J4406L4139M5935o2839j9016r724j7765p4905J19594
8500d5288K02230J25801j79205j97531R169R5441O6575p454K4248J35159j52325
$$ plain form
8489 76820 -9687 152714 21927 -60541 -88022 -132283 -229202 -415230 -319512 -297953 -266701
8478 -266701 -95926 71555 390163 357187 252426 256819 156790 -64142 -190201 -3315
8468 -3315 -25586 -225982 -401709 -481006 -381761 -245119 -41959 -7906 -98990 -218074 -42394
8457 -42394 109970 -54170 -11597 67779 196533 86494 -12815 133351 260322 131188
8447 131188 3556 97271 127754 -17983 -84407 -12174 -59310 -134252 -88773 -80724 34829
8436 34829 165795 276989 332177 293382 239293 221923 311664 306035 222334 131603 133132 153781
8424 153781 56912 34701 110650 142030 131050 123874 115044 213989 239622 61433 44547 -11280
8412 -11280 -71867 -217132 -128965 -133715 -148690 -240361 -203177 -19749 -28413 -17960 56896 197461
$$ packed form
8489G6820q6507J62401j30787q2468k7481m4261r6919j86028R5718K1559L1252
8478b66701J70775J67481L18608l2976j04761M393j00029k20932j26059J86886
8468c315k2271k00396j75727p9297R9245J36642K03160L4053r1084j19084J75680
8457d2394J52364j64140M2573P9376J28754j10039r9309J46166J26971j29134
8447A31188j27632R3715L0483j45737o6424P2233m7136p4942M5479Q049J15553
8436C4829J30966J11194N5188l8795n4089j7370Q9741n629q3701r0731J529K0649
8424A53781r6869k2211P5949L1380j0980p176q830R8945K5633j78189j6886n5827
8412a1280o0587j45265Q8167m750j4975r1671L7184J83428q664J0453P4856J40565
$$ plain form
8400 197461 313232 269254 114675 198799 54934 -28869 -32453 -20508 -84494 -215298 -178864
8389 -178864 -35149 14684 -27355 70771 147135 96893 -5824 -192902 -225524 -117075 9798
8378 9798 -83048 -178506 -101059 -188855 -183468 -64560 -128357 -109096 -43362 66888 248436 247206
8366 247206 43186 -128632 -115300 85458 38396 -34398 52777 32126 40133 63790 57542
8355 57542 88012 110658 130128 1710 -135081 -76736 155260 74656 56779 46416 18860
8344 18860 -9943 -118322 -141930 29111 -4325 5943 67346 67149 16310 -38326 20661 91632
8332 91632 9680 255969 206667 55801 -64516 -116568 -9234 112948 122774 -5557 -118554
8321 -118554 -167757 -174281 -155859 -78622 -84435 6654 185555 247421 135474 77844 67472 31143
$$ packed form
8400A97461J15771m3978j54579Q4124j43865q3803l584J1945o3986j30804L6434
8389a78864J43715M9833m2039R8126P6364n0242j02717j87078l2622J08449J26873
8378I798r2846r5458P7447q7796N387J18908o3797J9261O5734J10250J81548j230
8366B47206k04020j71818J3332K00758m7062p2794Q7175k0651Q007K3657o248
8355E7542L0470K2646J9470j28418j36791N8345K31996q0604j7877j0363k7556
8344A8860k8803j08379k3608J71041l3436J0268O1403j97n0839n4636N8987P0971
8332I1632q1952K46289m9302j50866j20317n2052J07334J22182R826j28331j12997
8321a18554m9203o524J8422P7237n813R1089J78901O1866j11947n7630j0372l6329
$$ plain form
8309 31143 -5073 126972 -521 4830 66405 193865 183731 193653 51221 16912 23764 -18111
8297 -18111 18076 57529 35732 131733 126433 116805 93648 88692 75408 120836 160204 83490
8285 83490 47479 21458 73940 -304 28474 42443 -81493 -119638 -164213 -171303 -120791 -142865
8273 -142865 -169318 -163865 1272 42525 -174097 -103146 -25135 -54089 -228960 -194121 -74449
8262 -74449 26858 115119 146393 53432 151288 269678 69397 63842 -69669 -75744 41639
8251 41639 -10216 93325 65353 -95806 -180838 -132793 -129520 -296129 -225526 -145124 -241899
8240 -241899 -211886 -92507 14707 50709 -118956 -198844 -134089 14070 10449 -30617 -47402
8229 -47402 -12926 -60783 -193593 -303336 -226734 -105021 94580 126405 34332 -100138 -74884
$$ packed form
8309C1143l6216J32045j27493N351O1575J27460j0134R922j42432l4309O852m1875
8297a8111L6187L9453k1797R6001n300r628k3157m956j3284M5428L9368p6714
8285H3490l6011k6021N2482p4244K8778J3969j23936l8145m4575p090N0512k2074
8273a42865k6453N453J65137M1253k16622P0951P8011k8954j74871L4839J19672
8262g4449J01307Q8261L1274r2961R7856J18390k00281n555j33511o075J17383
8251D1639n1855J03541k7972j61159q5032M8045L273j66609P0603Q0402r6775
8240b41899L0013J19379J07214L6002j69665p9888O4755J48159l621m1066j6785
8229d7402L4476m7857j32810j09743P6602J21713J99601L1825r2073j34470K5254
$$ plain form
8218 -74884 103077 256441 159324 175266 110506 107215 49089 -102208 -173300 -128915 -5862
8207 -5862 50047 -120271 -170346 -136947 -160864 -91913 49334 73992 58 -126458 -12346
8196 -12346 71012 56476 186742 106171 90431 83721 1617 42448 87974 33329 28224 -120420
8184 -120420 -248756 -288325 -139161 -9792 64921 113819 133119 6968 69940 242739 192862
8173 192862 152860 98510 57523 30549 23358 -2256 48959 -11356 -88661 -91854 -30581 -188410
8161 -188410 -118898 221280 340182 305667 180678 132863 207406 249353 272114 199317 103542
8150 103542 87583 25235 64399 -121402 -93538 -29292 -61145 -78189 37215 65601 -26738
8139 -26738 13876 -91747 -295103 -244718 -43132 -3695 -60114 -95558 -173565 -308703 -200448
$$ packed form
8218g4884J77961J53364r7117J5942o4760l291n8126j51297p1092M4385J23053
8207e862N5909j70318n0075L3399k3917O8951J41247K4658p3934j26516J14112
8196a2346Q3358j4536J30266q0571j5740o710q2104M0831M5526n4645n105j48644
8184a20420j28336l9569J49164J29369P4713M8898J9300j26151O2972J72799m9877
8173A92862m0002n4350m0987k6974p191k5614N1215o0315p7305l193O1273j57829
8161a88410O9512L40178J18902l4515j24989m7815P4543M1947K2761p2797r5775
8150A03542j5959o2348L9164j85801K7864O4246l1853j7044J15404K8386r2339
8139b6738M0614j05623k03356N0385K01586L9437n6419l5444p8007j35138J08255
$$ plain form
8128 -200448 -146164 -130337 -88432 -175639 -137851 -3068 -135402 -168274 -20390 64951 225817
8117 225817 336244 152621 -2667 69018 215141 377849 320227 56812 -42389 -136463
8107 -136463 -127083 -165806 -116508 -189861 -207273 -72715 30159 150847 205381 129708 536
8096 536 127278 182893 59176 26185 69122 225810 340925 126561 -27818 -262543 -175765
8085 -175765 -51683 -99565 -13863 14290 22099 -58746 -121829 64857 119366 97621 -26289
8074 -26289 -65119 -28910 3077 -29364 -152335 -239356 -230046 -73882 -29872 15475 -43966 -126044
8062 -126044 -77706 46111 -32688 4238 -71635 -189248 -251200 -125613 -57959 -135300 -145783
8051 -145783 -71156 -147436 28383 84335 3417 265725 330194 106109 -95073 -130159 -60725
$$ packed form
8128b00448N4284J5827M1905q7207L7788J34783j32334l2872J47884Q5341J60866
8117B25817J10427j83623j55288P1685J46123J62708n7622k63415r9201r4074
8107a36463R380l8723M9298p3353j7412J34558J02874J20688N4534p5673j29172
8096E36J26742N5615j23717l2991M2937J56688J15115k14364j54379k34725Q6778
8085a75765J24082m7882Q5702K8153P809q0845o3083J86686N4509k1745j23910
8074b6289l8830L6209L1987l2441j22971q7021R310J56164M4010M5347n9441q2078
8062a26044M8338J23817p8799L6926p5873j17613o1952J25587O7654p7341j0483
8051a45783P4627p6280J75819N5952q0918K62308O4469k24085k01182l5086O9434
$$ plain form
8040 -60725 -32324 51009 159510 122801 84493 33506 -16911 66148 158464 159027 184991 144786
8028 144786 148441 201768 157972 -37578 -61596 820 179125 236314 132393 -65463 -17853
8017 -17853 132443 123920 55271 86490 49507 -90972 -196364 -3774 -36828 38992 22184
8006 22184 -69031 -9463 -29374 21079 15055 266090 248584 139108 109656 134460 34564 -55095
7994 -55095 -53139 -94908 -94128 -20523 87189 173799 41490 -91113 -43232 80428 25739 42064
7982 42064 151617 162862 163541 186896 270880 148190 141289 216589 198069 262216 203410 136606
7970 136606 39221 -25801 60120 204473 314854 157716 35881 47914 151189 394577
7960 394577 407119 177158 -43298 47695 -31932 -98195 11064 31441 148006 261070 170388
$$ packed form
8040f0725K8401Q3333J08501l6709l8308n0987n0417Q3059R2316N63K5964m0205
8028A44786L655N3327m3796j95550k4018O2416J78305N7189j03921j97856M7610
8017a7853J50296q523o8649L1219l6983j40479j05392J92590l3054P5820j6808
8006B2184r1215N9568j9911N0453o024K51035j7506j09476k9452K4804r9896q9659
7994e5095J956m1769P80P3605J07712Q6610j32309j32603M7881J23660n4689J6325
7982D2064J09553J1245O79K3355Q3984j22690o901P5300j8520O4147n8806o6804
7970A36606r7385o5022Q5921J44353J10381j57138j21835J2033J03275K43388
7960C94577J2542k29961k20456R0993p9627o6263J09259K0377J16565J13064r0682
$$ plain form
7949 170388 -47710 -106986 -113864 129739 201570 199985 289828 332336 231633 161458 142983
7938 142983 78939 12945 34565 -7561 100671 105461 39429 23337 -73196 -214448 -427188
7927 -427188 -446255 -250570 -89614 24956 23289 -11027 32987 -76595 -118028 -52583 55348
7916 55348 216714 412994 352454 308169 220707 106041 162968 215844 58923 56726 -57519
7905 -57519 -70309 56470 18550 35829 125949 98103 231268 268597 157785 -48698 86587
7894 86587 98056 -86474 -138681 -127047 -99414 -6864 128496 114094 -111730 -112006 17432
7883 17432 134686 32866 -72091 51759 143209 196115 119375 73199 33424 -67177 -83980
7872 -83980 159681 296914 273473 56392 -59388 -33162 52939 14393 42764 -6063 -68085
$$ packed form
7949A70388k18098n9276o878K43603P1831j585Q9843M2508j00703p0175j8475
7938A42983o4044o5994K1620m2126J08232M790o6032j6092r6533j41252k12740
7927d27188j9067J95685J60956J14570j667l4316M4014j09582m1433O5445J07931
7916E5348J61366J96280o0540m4285q7462j14666N6927N2876j56921k197j14245
7905e7519j2790J26779l7920J7279R0120k7846J33165L7329j10812k06483J35285
7894H6587J1469j84530n2207J1634K7633R2550J35360j4402k25824k76J29438
7883A7432J17254j01820j04957J23850R1450N2906p6740m6176l9775j00601j6803
7872h3980K43661J37233k3441k17081j15780K6226Q6101l8546K8371m8827o2022
$$ plain form
7861 -68085 -67561 -161095 -291875 -428839 -411243 -220931 -237268 -99460 27801 87626 167501
7850 167501 114491 -15400 -87960 -211849 -23231 105521 63550 46610 -122058 -171369 -94792
7839 -94792 -34623 -57595 -59623 109478 42518 6120 -8060 -81062 -129122 -34331 -79873 -249894
7827 -249894 -179345 -28503 137466 290919 203841 150633 267042 230133 3806 -200355
7817 -200355 -235915 -83682 -28103 -44495 -117985 -139327 -77226 126585 259341 53885 -96677
7806 -96677 -124976 -57095 -10467 -18528 5013 57765 -81302 -40632 16972 79170 -9267 -112896
7794 -112896 -242885 -177842 -77795 -122321 -130901 -155651 -127203 72674 79702 -121964 -226351
7783 -226351 -122287 -95302 -22518 -55156 19523 -107315 -121737 -138964 85159 143135 170666
$$ packed form
7861f8085N24r3534j30780j36964J7596J90312j6337J37808J27261N9825P9875
7850A67501n3010j29891p2560j23889J88618J28752m1971j6940j68668m9311P6577
7839i4792O0169k2972k028J69101o6960l6398j4180p3002m8060R4791m5542j70021
7827b49894P0549J50842J65969J53453q7078n3208J16409l6909k26327k04161
7817b00355l5560J52233N5579j6392p3490k1342O2101K03811J32756k05456j50562
7806i6677k8299O7881M6628q061K3541N2752j39067M0670N7604O2198q8437j03629
7794a12896j29989O5043J00047m4526q580k4750K8448J99877P028k01666j04387
7783b26351J04064K6985P2784l2638P4679j26838j4422j7227K24123N7976K7531
$$ plain form
7772 170666 203000 311478 238649 104642 -15305 -136931 -80201 -58897 38135 -33495 -155810
7761 -155810 -85833 20014 -37692 -59947 -170291 -246246 -87133 -129417 -196453 -221162 -245204
7750 -245204 -265133 -320789 -191419 27908 154104 197830 206343 143953 -118158 -165308 -235231
7739 -235231 -277125 -249888 -188594 -141232 -58855 -49831 -136174 -275123 -356445 -250776 -24298
7728 -24298 49183 219678 198406 271735 143039 -19050 -47178 -47803 -71388 -16597 89914
7717 89914 237335 -29835 -203127 -193070 -175845 20601 103006 -12871 -137468 -82180 -19088
7706 -19088 126333 57142 23821 -41833 12836 132210 119986 58796 -54115 55656 269526
7695 269526 292360 305504 276831 296276 184353 -120234 -202289 -273641 -290015 -114925 -135765
$$ packed form
7772A70666L2334J08478p2829j34007j19947j21626N6730K1304R7032p1630j22315
7761a55810O9977J05847n7706k2255j10344p5955J59113m2284o7036k4709k4042
7750b45204j9929n5656J29370K19327J26196M3726Q513o2390k62111m7150o9923
7739b35231m1894K7237O1294M7362Q2377R024q6343j38949q1322J05669K26478
7728b4298P3481J70495k1272P3329j28696j62089k8128o25k3585N4791J06511
7717H9914J47421k67170j73292J0057J7225J96446Q2405j15877j24597N5288O3092
7706a9088J45421o9191l3321o5654N4669J19374j2224o1190j12911J09771K13870
7695B69526K2834J3144k8673J9445j11923l04587q2055p1352j6374J75090k0840
$$ plain form
7684 -135765 -112394 66601 44972 -2296 -118638 -172603 -61567 -195260 -143163 -4704 67713
7673 67713 97074 68280 27014 -87949 -124937 -114642 -272989 -148611 -141790 -2536 27064
7662 27064 -114439 -211512 -182818 -323281 -104909 53644 64329 87229 154786 176275 114696
7651 114696 -15553 -41633 20502 -16496 15247 177348 142541 197146 132173 67336 176377
7640 176377 75127 154212 211854 114155 -44166 -204178 -54535 198154 252004 233731 37540
7629 37540 115691 195593 140687 113667 -38117 -76604 -28685 -105863 -133700 -190607 -27523
7618 -27523 -12743 -47951 31168 107031 131944 9165 -126288 -158059 -284128 -144783 -208430
7607 -208430 -260785 -193123 -220974 -181315 -154747 -83134 -45219 10042 -39898 -4135 -124769
$$ packed form
7684a35765K3371J78995k1629m7268j16342n3965J11036j33693N2097J38459P2417
7673F7713K9361k8794m1266j14963l6988J0295j58347J24378O821J39254K9600
7662B7064j41503r7073K8694j40463K18372J58553J0685K2900O7557K1489o1579
7651A14696j30249k6080O2135l6998L1743J62101l4807N4605o4973o4837J09041
7640A76377j01250P9085N7642r7699j58321j60012J49643K52689N3850j8273j96191
7629C7540P8151P9902n4906k7020j51784l8487M7919p7178k7837n6907J63084
7618b7523J4780l5208P9119P5863K4913j22779j35453l1771j26069J39345o3647
7607b08430n2355O7662k7851L9659K6568P1613L7915N5261m9940L5763j20634
$$ plain form
7596 -124769 -132154 -24487 10943 40946 92523 126468 240121 387255 302657 -13321 -166723
7585 -166723 -192398 -71010 -31235 -126903 -29985 13390 -51066 25844 -115725 -66898 -76564
7574 -76564 -68291 -69601 44302 59788 93529 -8779 -162612 -145347 -134619 -57781 83841
7563 83841 57454 49131 114915 -30397 -117367 -71104 -180048 -123556 -128909 -87486 -38784 -72555
7551 -72555 -28037 -67441 -75091 54997 280419 514665 434138 418838 301041 414412 554223
7540 554223 490998 272796 149582 43797 -132890 -119659 -179983 -173337 -111380 64757 199838
7529 199838 21831 -254426 -203424 40759 115266 79968 -9272 -1652 -457 -27237 169521
7518 169521 248907 -23529 -176859 -15821 108293 116118 50546 -81799 -143998 39304 130147
$$ packed form
7596a24769p385J07667L5430L0003N1577L3945J13653J47134q4598l15978j53402
7585a66723k5675J21388L9775r5668R6918M3375o4456P6910j41569M8827r666
7574g6564Q273j310J13903J5486L3741j02308j53833J7265J0728P6838J41622
7563H3841k6387q323O5784j45312q6970M6263j08944N6492n353M1423M8702l3771
7551g2555M4518l9404p650J30088K25422K34246q0527j5300j17797J13371J39811
7540E54223o3225k18202j23214j05785j76687J3231o0324O646O1957J76137J35081
7529A99838j78007k76257N1002K44183P4507l5298q9240P620J195k6780J96758
7518A69521P9386k72436j53330J61038J24114P825o5572j32345o2199J83302R0843
$$ plain form
7507 130147 109264 54184 -107352 100876 258806 131953 -3208 -153132 -176364 -136685
7497 -136685 -34981 43636 154730 137300 52728 139677 204271 100326 -159223 -222953 -136053
7486 -136053 -147979 -114529 3960 -11556 -63421 -93513 12638 -52706 -130499 -153409 -315645
7475 -315645 -224790 -58453 -27697 -159372 -466200 -454726 -305587 -212923 -41088 -45563 -150501
7464 -150501 -94761 -70756 70738 146380 89362 110604 79123 39805 -178837 -237247 -132508
7453 -132508 -182069 -230063 -191987 -178152 -55420 -76861 -293379 -201678 -202323 -287249 -271944 -360073
7441 -360073 -447995 -345680 -118799 -60376 52366 11970 -120700 -87762 -54224 -168645 -272819
7430 -272819 -62236 35253 31474 1870 -125846 -93075 -185133 -184855 -76602 -86730 -85702 -28198
$$ packed form
7507A30147k0883n5080j61536K08228J57930j26853j35161j49924k3232L9679
7497a36685J01704P8617J11094j7430q4572Q6949O4594j03945k59549o3730Q6900
7486a36053j1926L3450J18489j5516n1865l0092J06151o5344p7793k2910j62236
7475c15645R0855J66337L0756j31675l06828J1474J49139R2664J71835m475j04938
7464a50501N5740K4005J41494P5642n7018K1242l1481l9318k18642n8410J04739
7453a32508m9561m7994L8076J3835J22732k1441k16518R1701o45q4926J5305q8129
7441c60073q7922J02315K26881N8423J12742m0396j32670L2938L3538j14421j04174
7430b72819K10583R7489l779k9604j27716L2771r2058K78J08253j0128J028N7504
$$ plain form
7418 -28198 -102701 -92543 -183313 -79075 25683 61741 -128509 -115722 35998 210540 305396
7407 305396 140759 -41570 43009 120382 133058 137300 190758 289836 111533 61258 63070
7396 63070 77860 75428 117955 143706 94992 30245 -80210 -186392 -187180 -45644 -76597 26978
7384 26978 21199 40835 198894 90966 119995 20900 28671 42426 -24687 -113390 40739 11887
7372 11887 60490 100026 225989 243574 305018 250768 96058 -103056 -162103 -141758 -132549
7361 -132549 -106488 -100461 2229 46017 -11940 25468 41790 -24248 -56521 -8796 23916 180739
7349 180739 157546 117862 28798 -35470 67228 48120 -43597 -62694 31572 66027 20275
7338 20275 -18137 161098 131170 39574 -81938 -91460 13058 -164417 -173041 -6052 120509
$$ packed form
7418b8198p4503J0158r0770J04238J04758L6058j90250J2787J51720J74542R4856
7407C05396j64637j82329Q4579P7373J2676M242N3458R9078j78303n0275J812
7396F3070J4790k432M2527K5751m8714o4747j10455j06182p88J41536l0953J03575
7384B6978n779J9636J58059j07928K9029r9095P771J3755o7113q8703J54129k8852
7372A1887M8603L9536J25963J7585O1444n4250j54710j99114n9047K0345R209
7361a32549K6061O027J02690M3788n7957L7408J6322o6038l2273M7725L2712J56823
7349A80739k3193l9684q9064o4268J02698j9108r1717j9097R4266L4455m5752
7338B0275l8412J79235k9928r1596j21512r522J04518j77475q624J66989J26561
$$ plain form
7327 120509 180566 65016 -43501 -100235 171453 103690 -38209 -32864 130502 284447 225128
7316 225128 234179 198696 53341 -27908 29424 -110430 -41224 6578 40907 12065 60935
7305 60935 13353 99410 89830 112291 55938 157487 147229 34696 15331 -116491 -162920
7294 -162920 -107630 -103574 -171940 -163366 -152069 -65703 -18161 -106083 -252779 -153438 79947 105909
7282 105909 -160885 -238879 -120065 -87496 -57895 118336 200438 63977 -52384 -145857 -164607
7271 -164607 -83508 857 13469 -28039 -138017 -136412 -184569 -264454 -283087 -73804 13355
7260 13355 -37041 -36755 3786 19647 57641 150601 216869 282763 163973 92729 -7175 8711
7248 8711 -54287 -76301 -43876 -69500 -24616 81402 86254 -104401 -212501 -152048 -136728 -49302
$$ packed form
7327A20509O0057j15550j08517n6734K71688o7763j41899N345J63366J53945n9319
7316B25128R051l5483j45355q1249N7332j39854O9206M7802L4329k8842M8870
7305F0935m7582Q6057r580K2461n6353J01549j0258j12533j9365j31822m6429
7294a62920N5290M056o8366Q574J1297Q6366M7542q7922j46696R9341K33385K5962
7282A05909k66794p7994J18814L2569K9601J76231Q2102j36461j16361r3473j8750
7271a64607Q1099Q4365J2612m1508j09978J605m8157p9885j8633K09283Q7159
7260A3355n0396K86M0541J5861L7994R2960O6268O5894j18790p1244r9904J5886
7248H711o2998k2014L2425k5624M4884J06018M852j90655j08100O0453J5320Q7426
$$ plain form
7236 -49302 175500 169511 72506 49738 121273 -3274 -280296 -327423 -256016 -261101 -150201
7225 -150201 -37305 -70254 -149085 -76529 -77364 -101945 -131748 -72422 -92965 -133782 6582 -4703
7213 -4703 -82150 -33358 -84730 -274556 -423739 -335185 -206318 -81377 -77104 -75568 -77524 -123007
7201 -123007 -60465 17820 19784 -67201 -102994 43729 219738 331064 176188 -13165 -106322
7190 -106322 -90797 -113221 117522 93209 63014 44876 63209 -4324 -32842 -64317 -89206
7179 -89206 20924 -10573 124965 110749 144725 109954 57493 -17864 -76592 71735 176071
7168 176071 242685 304590 395747 223213 -6811 82593 142122 229878 76776 -9654 39620
7157 39620 16742 29652 68542 217618 152609 22699 79955 -11958 -134727 -33177 167127
$$ packed form
7236d9302K24802n989r7005k2768P1535j24547k77022m7127P1407n085J10900
7225a50201J12896l2949p8831P2556q35k4581k9803N9326k0543m0817J40364j1285
7213d703p7447M8792n1372j89826j49183Q8554J28867J24941M273J536j956m5483
7201a23007O2542P8285J964q6985l5793J46723J76009J11326j54876j89353r3157
7190a06322J5525k2424K30743k4313l0195j8138J8333o7533k8518l1475k4889
7179h9206J10130l1497J35538j4216L3976l4771n2461p5357n8728J48327J04336
7168A76071O6614O1905R1157j72534k30024Q9404N9529Q7756j53102q6430M9274
7157C9620k2878J2910L8890J49076o5009j29910N7256r1913j22769J01550K00304
$$ plain form
7146 167127 306380 158848 231736 182094 80624 53328 108001 157288 22359 10782 -42648
7135 -42648 -55390 67969 133934 223732 217117 55790 15434 4033 4885 2680 66634 209867
7123 209867 81309 -98530 -162203 -194694 -116445 -181906 -3606 -4620 -1598 35702 53794
7112 53794 -10789 -144885 -174109 -173046 -100735 -82841 -156495 -95384 120081 72317 -30549
7101 -30549 149933 220412 37715 -9905 129581 118759 364624 294141 -24537 -35442 -28830
7090 -28830 25480 85056 71536 22631 53348 123850 108862 156735 140714 159438 197163 193686
7078 193686 114076 45514 -38167 -69853 54482 11436 50048 135993 -12757 -233164 -244556
7067 -244556 -162376 -163936 -247609 -218580 -167255 -56579 -44665 -23044 -61041 -41575 -41832 9328
$$ packed form
7146A67127J39253j47532P2888m9642j01470k7296N4673M9287j34929j1577n3430
7135d2648j2742J23359O5965Q9798o615j61327m0356j1401Q52k205O3954J43233
7123B09867j28558j79839o3673l2491P8249o5461J78300j014L022L7300J8092
7112E3794o4583j34096k9224J063P2311J7894p3654O1111K15465m7764j02866
7101c0549J80482P0479j82697m7620J39486j0822K45865p0483l18678j0905O612
7090b8830N4310N9576j3520m8905L0717P0502j4988M7873j6021J8724L7725l477
7078A93686p9610o8562q3681l1686J24335m3046L8612Q5945j48750k20407j1392
7067b44556Q2180j560q3673K9029N1325J10676J1914K1621l7997J9466k57N1160
$$ plain form
7055 9328 21139 -178790 -244342 -219841 -129759 -142568 -191789 -155633 -89749 24726 -43837 -65140
7043 -65140 -208380 -203029 -46140 -51779 -74506 -11335 -11023 40863 -23885 -147306 -90695 15826
7031 15826 56841 -13124 -30162 -74864 -9507 -24146 -126075 -117882 -58016 7455 119225 127208
7019 127208 117859 139168 44672 -85032 -190366 -159814 -83931 -105696 -34671 -132888 -222854
7008 -222854 -125243 46271 40928 -97324 -85336 -87445 -58785 13537 -12429 -95242 -13929 159542
6996 159542 70295 6159 108976 118361 118745 -19392 -190215 -109967 -2181 47935 103795
6985 103795 225786 176724 196747 230120 238482 24141 -163367 -226990 -175432 -147757 -104085
6974 -104085 -65874 -19670 25745 91912 42280 -1579 -186599 -328533 -384623 -332934 -167901
$$ packed form
7055I328J1811j99929o5552K4501R0082j2809m9221L6156O5884J14475o8563k1303
7043f5140j43240N351J56889n639k2727O3171L12N1886o4748j23421N6611J06521
7031A5826M1015o9965j7038m4702O5357j4639j01929Q193N9866O5471J11770P983
7019A27208r349K1309r4496j29704j05334L0552P5883k1765P1025r8217q9966
7008b22854R7611J71514n343j38252J1988k109K8660P2322k5966q2813Q1313J73471
6996A59542q9247o4136J02817R385L84j38137j70823Q0248J07786N0116N5860
6985A03795J21991m9062K0023L3373Q362k14341j87508o3623N1558K7675M3672
6974a04085L8211M6204M5415O6167m9632m3859j85020j41934n6090N1689J65033
$$ plain form
6963 -167901 -39916 13262 -33762 -111939 -109162 -116539 34266 172281 -47103 -161602 -134126
6952 -134126 -93917 29923 15574 -199231 -319478 -293276 -41630 92543 146751 -84287
6942 -84287 -102451 84536 79808 141136 183597 122707 15601 56559 20401 -120452 -82681
6931 -82681 34680 -57032 -89365 -152556 -227580 -227978 -181398 -165017 -186727 -138092 -239349 -172417
6919 -172417 112482 36063 -43749 10747 194618 307804 96568 -138976 2079 61208
6909 61208 54767 -39990 115496 223791 85540 -18827 27798 -1002 26617 112485 75107
6898 75107 71360 -69418 -242006 -96108 -207280 -40872 72215 58420 24099 36599 66229
6887 66229 116187 60302 68926 137827 231808 169583 77566 136322 105625 -43789 -115524 9055
$$ packed form
6963a67901J27985N3178m7024p8177K777p377J50805J38015k19384j14499K7476
6952a34126M0209J23840j4349k14805j20247K6202K51646J34173N4208k31038
6942h4287j8164J86987m728O1328M2461o0890j07106M0958l6158j40853L7771
6931h2681J17361r1712l2333o3191p5024l98M6580J6381k1710M8635j01257O6932
6919a72417K84899p6419p9812N4496J83871J13186k11236k35544J41055N9129
6909F1208o441r4757J55486J08295j38251j04367M6625k8800K7619Q5868l7378
6898G5107l747j40778j72588J45898j11172J66408J13087j3795l4321J2500K9630
6887F6229M9958n5885Q624O8901R3981o2225r2017N8756l0697j49414p1735J24579
$$ plain form
6875 9055 183902 120001 29413 -53196 -102665 -150076 -155719 -162584 -192575 -124695 -122935 -101537
6863 -101537 -3413 -35089 -123216 -89653 -24023 -68164 -220587 -89831 -60810 -33084 68282
6852 68282 73737 62579 -38546 46041 190658 155927 78357 -40304 -265483 -364251 -212481
6841 -212481 -26908 152703 238864 302701 250805 89310 1435 -99136 -261612 -180337 -92614
6830 -92614 88584 185828 124673 97404 212806 191766 257800 226189 120473 148441 177849
6819 177849 195547 195296 65553 -3594 -36439 -129960 -86154 82604 75082 61745 20012 52670
6807 52670 96976 133505 -28257 -161981 -6588 13696 -167915 -134591 -60001 -188071 -438692
6796 -438692 -411564 -398100 -319093 -265809 -218609 -185221 -103313 62906 42333 -123405 -231099
$$ packed form
6875I055J74847o3901r0588q2609m9469m7411n643o865k9991O7880J760K1398
6863a01537R8124l1676q8127L3563O5630m4141j52423J30756K9021K7726J01366
6852F8282N455j1158j01125Q4587J44617l4731p7570j18661k25179r8768J51770
6841b12481J85573J79611Q6161O3837n1896j61495q7875j00571j62476Q1275Q7723
6830i2614J81198R7244o1155k7269J15402k1040O6034l1611j05716K7968K9408
6819A77849J7698k51j29743o9147l2845r3521M3806J68758p522j3337m1733L2658
6807E2670M4306L6529j61762j33724J55393K0284j81611L3324P4590j28070k50621
6796d38692K7128J3464P9007N3284M7200L3388Q1908J66219k0573j65738j07694
$$ plain form
6785 -231099 -302963 -314898 -126388 -120877 -270190 -228359 -264054 -307406 -156788 -159753 -261964
6774 -261964 -212385 -262212 -161862 12589 139586 111677 134981 113118 -17877 -76729 -62263
6763 -62263 -92567 -18123 -185497 -110197 927 35341 -19792 80158 122007 87594 -38442
6752 -38442 71086 234218 218761 248988 216453 110285 -35363 32405 96456 111052 195783
6741 195783 359366 318473 425361 422518 333991 299243 283585 249642 134266 1849 -230248
6730 -230248 -154186 62033 104598 75398 -74815 -93665 -73280 -71781 130595 174105 123854
6719 123854 -133889 -203272 -144962 -250555 -208774 14825 -3740 -53628 -29864 60831 -48997
6708 -48997 -38288 32826 119718 225446 130017 78008 -19765 -140938 -77478 -108703 -147406
$$ packed form
6785b31099p1864j1935J88510N511j49313M1831l5695m3352J50618k965j02211
6774b61964M9579m9827J00350J74451J26997k7909K3304k1863j30995n8852J4466
6763f2263l0304P4444j67374P5300J11124L4414n5133R9950M1849l4413j26036
6752c8442J09528J63132j5457L0227l2535j06168j45648O7768O4051J4596Q4731
6741A95783J63583m0893J06888k843q8527l4748j5658l3943j15376j32417k32097
6730b30248P6062K16219M2565k9200j50213j8850K0385J499K02376M3510n0251
6719A23854k57743o9383N8310j05593M1781K23599j8565m9888K3764R0695j09828
6708d8997J0709P1114Q6892J05728r5429n2009r7773j21173O3460l1225l8703
$$ plain form
6697 -147406 -113866 -74916 -77140 -34254 13587 42377 -36902 -21588 -3700 -27908 144134 154030
6685 154030 171672 147893 201780 134847 133676 10945 -16149 -175394 -215053 -197997 -331893
6674 -331893 -283284 -195013 -279888 -316359 -165540 -76238 -181661 -64627 -17373 -77531 -77902
6663 -77902 -217860 -290407 18298 106888 -17722 -58947 -110708 -142747 -299816 -402869 -409516
6652 -409516 -256458 -39510 103949 102367 65642 92792 68285 58091 56918 113887 64096
6641 64096 -37560 -78267 -124826 -67094 136963 191673 135197 30048 -23115 -33303 -39110
6630 -39110 -38559 -139423 61859 -6911 9834 23021 26845 168293 188420 209197 76404 -19358
6618 -19358 28709 24159 -15725 -115031 -45642 -5661 72257 80293 46542 43565 85971 221270
$$ packed form
6697a47406L3540L8950k224M2886M7841K8790p9279J5314J7888k4208J72042R896
6685A54030J7642k3779N3887o6933j171j22731k7094j59245l9659J7056j33896
6674c31893M8609Q8271q4875l6471J50819Q9302j05423J17034M7254o0158l71
6663g7902j39958p2547L08705Q8590j24610m1225n1761l2039j57069j03053o647
6652d09516J53058K16948J43459j582l6725K7150k4507j0194j173N6969m9791
6641F4096j01656m0707m6559N7732K04057N4710n6476j05149n3163j0188n807
6630c9110N51j00864K01282o8770J6745J3187L824J41448K0127K0777j32793r5762
6618a9358M8067m550l9884r9306O9389L9981P7918Q036l3751k977M2406J35299
$$ [...]
##END NTUPLES=NMR SPECTRUM
##END=
