##TITLE=Analysis number 318144
Compound Code cc 26704
Book Reference 449/90
Project Code adrs
Chemist Name davee
##JCAMPDX= 6.0         $$ Bruker NMR JCAMP-DX V2.0
##DATA TYPE= NMR SPECTRUM
##DATA CLASS= NTUPLES
##ORIGIN= Bruker BioSpin GmbH
##OWNER= nmr
$$ XWIN-NMR		Version 3.5
$$ Thu Mar 16 12:28:38 2006 GMT Standard Time (UT+0h)  MAYBRIDGE\nmr@NMR_250MHZ
##.OBSERVE FREQUENCY= 250.131544655141
##.OBSERVE NUCLEUS= ^1H
##.ACQUISITION MODE= SIMULTANEOUS (DQD)
##.ACQUISITION SCHEME= undefined
##.AVERAGES= 16
##.DIGITISER RES= 18
##SPECTROMETER/DATA SYSTEM= dpx250
##.PULSE SEQUENCE= zg30
##.SOLVENT NAME= CDCl3
##.SHIFT REFERENCE= (INTERNAL, CDCl3, 0, 16.4522)
##AUDIT TRAIL= $$ (NUMBER, WHEN, WHO, WHERE, WHAT)
$$ ##TITLE= Audit trail, XWIN-NMR		Version 3.5
$$ ##JCAMPDX= 5.01
$$ ##ORIGIN= Bruker BioSpin GmbH
$$ ##OWNER= nmr
$$ C:\u/data/dgb/nmr/ADRS/870/pdata/1/auditp.txt
$$ ##AUDIT TRAIL=  $$ (NUMBER, WHEN, WHO, WHERE, WHAT)
(   1,<2006-03-16 12:28:02.49 +000>,<MAYBRIDGE\nmr>,<NMR_250MHZ>,
      <created by zg, POWCHK disabled, PULCHK disabled
       configuration hash MD5:
       84 BC 41 DB A1 6E 1D 46 DA 25 12 A5 C1 ED C5 3A
       data hash MD5: 64K
       A3 70 A9 B1 CF 6F 0A F0 72 E3 66 51 3F 5C 24 AA>)
(   2,<2006-03-16 12:28:25.46 +000>,<MAYBRIDGE\nmr>,<NMR_250MHZ>,
      <Start of raw data processing
       ef LB = 0.3 FT_mod = 6 PKNL = 1 SI = 32K 
       data hash MD5: 32K
       3F 66 E0 F6 D8 75 81 B4 F3 FC 78 02 4E AA 2E B3>)
(   3,<2006-03-16 12:28:28.52 +000>,<MAYBRIDGE\nmr>,<NMR_250MHZ>,
      <apk 
       data hash MD5: 32K
       94 3A 85 13 A5 54 C8 00 47 CB 6C 7E 57 4E 60 7A>)
(   4,<2006-03-16 12:28:29.29 +000>,<MAYBRIDGE\nmr>,<NMR_250MHZ>,
      <abs ABSG = 5 
       data hash MD5: 32K
       AD 04 A4 91 CF 30 08 50 82 AB DA 38 77 8A FC AE>)
$$ ##END=
$$ 
$$ hash MD5
$$ 8F C6 82 11 5F 10 F0 C1 1F 6E AD 14 6F 10 85 75
##$RELAX= 
##$RELAX= 
##$RELAX= 
##$RELAX= 
##$RELAX= 
##$RELAX= 
##$RELAX= 
$$ Bruker specific parameters
$$ --------------------------
##$DU= <C:\u>
##$EXPNO= 870
##$NAME= <ADRS>
##$PROCNO= 1
##$TYPE= <nmr>
##$USER= <dgb>
##$AMP= (0..31)
100 100 100 100 100 100 100 100 100 100 100 100 100 100 100 100 100 100 
100 100 100 100 100 100 100 100 100 100 100 100 100 100 
##$AQSEQ= 0
##$AQ_mod= 3
##$AUNM= <au_zg>
##$AUTOPOS= <23 >
##$BF1= 250.13
##$BF2= 250.13
##$BF3= 250.13
##$BF4= 250.13
##$BF5= 500.13
##$BF6= 500.13
##$BF7= 500.13
##$BF8= 500.13
##$BYTORDA= 1
##$CFDGTYP= 0
##$CFRGTYP= 5
##$CHEMSTR= <none>
##$CNST= (0..31)
1 1 145 1 1 1 1 1 1 1 1 1 1 1 1 1 1 1 1 1 1 1 1 1 1 1 1 1 1 1 1 1 
##$CPDPRG= <>
##$CPDPRG1= <>
##$CPDPRG2= <>
##$CPDPRG3= <>
##$CPDPRG4= <mlev>
##$CPDPRG5= <mlev>
##$CPDPRG6= <mlev>
##$CPDPRG7= <mlev>
##$CPDPRG8= <mlev>
##$CPDPRGB= <>
##$CPDPRGT= <>
##$D= (0..31)
0 1 0 0 0 0 0 0 0 0.06 0 0 0 0 0 0 0.0002 0 0 0 0 0 0 0 0 0 0 0 0 0 0 
0 
##$DATE= 1142512081
##$DBL= (0..7)
120 120 120 120 120 120 120 120 
##$DBP= (0..7)
150 150 150 150 150 150 150 150 
##$DBP07= 0
##$DBPNAM0= <>
##$DBPNAM1= <>
$$ [...]
##$SUBNAM7= <"">
##$SUBNAM8= <"">
##$SUBNAM9= <"">
##$SW= 20.6930455092707
##$SWIBOX= (0..15)
0 0 3 0 0 0 0 0 0 0 0 0 0 0 0 0 
##$SW_h= 5175.983436853
##$TD= 65536
##$TD0= 1
##$TE= 294.16
##$TE2= 300
##$TE3= 300
##$TEG= 300
##$TL= (0..7)
0 120 120 120 120 120 120 120 
##$TP= (0..7)
150 150 150 150 150 150 150 150 
##$TP07= 0
##$TPNAME0= <>
##$TPNAME1= <>
##$TPNAME2= <>
##$TPNAME3= <>
##$TPNAME4= <>
##$TPNAME5= <>
##$TPNAME6= <>
##$TPNAME7= <>
##$TPOAL= (0..7)
0.5 0.5 0.5 0.5 0.5 0.5 0.5 0.5 
##$TPOFFS= (0..7)
0 0 0 0 0 0 0 0 
##$TUNHIN= 0
##$TUNHOUT= 0
##$TUNXOUT= 0
##$USERA1= <user>
##$USERA2= <user>
##$USERA3= <user>
##$USERA4= <user>
##$USERA5= <user>
##$V9= 5
##$VALIST= <valist>
##$VCLIST= <CCCCCCCCCCCCCCC>
##$VD= 0
##$VDLIST= <DDDDDDDDDDDDDDD>
##$VPLIST= <PPPPPPPPPPPPPPP>
##$VTLIST= <TTTTTTTTTTTTTTT>
##$WBST= 1024
##$WBSW= 4
##$XGAIN= (0..3)
0 0 0 0 
##$XL= 0
##$YL= 0
##$YMAX_a= 508546
##$YMIN_a= -488277
##$ZGOPTNS= <>
##$ZL1= 120
##$ZL2= 120
##$ZL3= 120
##$ZL4= 120
##$ABSF1= 16.45223
##$ABSF2= -4.240942
##$ABSG= 5
##$ABSL= 3
##$ALPHA= 0
##$AQORDER= 0
##$ASSFAC= 0
##$ASSFACI= 0
##$ASSFACX= 0
##$ASSWID= 0
##$AUNMP= <proc_1d>
##$AZFE= 0.1
##$AZFW= 0.1
##$BCFW= 0
##$BC_mod= 0
##$BYTORDP= 0
##$COROFFS= 0
##$CY= 12.5
##$DATMOD= 1
##$DC= 0
##$DFILT= <>
##$DTYPP= 0
##$F1P= 14.0000005364418
##$F2P= -0.99999901652339
##$FCOR= 0.5
##$FTSIZE= 32768
##$FT_mod= 6
##$GAMMA= 0
##$GB= 0
##$INTBC= 1
##$INTSCL= 1
##$ISEN= 128
##$LB= 0.3
##$LEV0= 0
##$LPBIN= 0
##$MAXI= 10000
##$MC2= 0
##$MEAN= 0
##$ME_mod= 0
##$MI= 0
##$NCOEF= 0
##$NC_proc= -2
##$NLEV= 6
##$NOISF1= 0
##$NOISF2= 0
##$NSP= 0
##$NTH_PI= 0
##$NZP= 0
##$OFFSET= 16.45223
##$PC= 1
##$PHC0= 173.5617
##$PHC1= 5.82053
##$PH_mod= 1
##$PKNL= yes
##$PPARMOD= 0
##$PSCAL= 4
##$PSIGN= 0
##$REVERSE= no
##$SF= 250.130017451059
##$SI= 32768
##$SIGF1= 0
##$SIGF2= 0
##$SINO= 400
##$SIOLD= 32768
##$SREGLST= <1H.CDCl3>
##$SSB= 0
##$STSI= 32768
##$STSR= 0
##$SW_p= 5175.98343685301
##$SYMM= 0
##$S_DEV= 0
##$TDeff= 65536
##$TDoff= 0
##$TI= <Analysis number 999999
Compound Code 99
Book Reference 9
Project Code 9>
##$TILT= no
##$TM1= 0
##$TM2= 0
##$TOPLEV= 0
##$USERP1= <user>
##$USERP2= <user>
##$USERP3= <user>
##$USERP4= <user>
##$USERP5= <user>
##$WDW= 1
##$XDIM= 32768
##$YMAX_p= 355489308
##$YMIN_p= -44749
$$ End of Bruker specific parameters
$$ ---------------------------------
##NTUPLES= NMR SPECTRUM
##VAR_NAME=  FREQUENCY,     SPECTRUM/REAL,   SPECTRUM/IMAG
##SYMBOL=    X,             R,               I
##VAR_TYPE=  INDEPENDENT,   DEPENDENT,       DEPENDENT
##VAR_FORM=  AFFN,          ASDF,            ASDF
##VAR_DIM=   32768,         32768,           32768
##UNITS=     HZ,            ARBITRARY UNITS, ARBITRARY UNITS
##FACTOR=    0.157963299565203, 1,           1
##FIRST=     4115.1966904406, 0,             0
##LAST=      -1060.78674641241, 0,           0
##MIN=       -1060.78674641241, -44749,      0
##MAX=       4115.1966904406, 355489308,     0
$$ Real data points
##PAGE= N=1
##DATA TABLE= (X++(R..R)), XYDATA
$$ [...]
21789 6391 7864 -1499 -8327 7540 14968 6171 7107 10089 2980 -6278 -10747 -7141 -7837 -8250 -3571
21774 -3571 7200 13077 11489 -13085 -22787 -17262 -12682 -11137 -8512 -8957 -4237 7447 6444 11333
21760 11333 14808 2305 -4317 1042 3774 -3061 -9925 -12499 -15135 -18278 -19543 -17029 -12254 -10425
21746 -10425 -15376 -9714 -3639 9330 8906 13128 5364 4751 10099 8406 6517 6351 2315 -3301 -12593
21731 -12593 -7888 -5451 -12946 -15122 -9027 -5354 -8596 -2723 -7762 -10406 -5853 -110 -5958 -5944 -4698
21716 -4698 -2357 10318 22172 18334 5232 104 -2618 -9766 -19048 -20949 -7559 -10127 -6280 -3802
21702 -3802 -2539 -3612 -5262 -5494 -11533 -17086 -14387 -10594 -2209 1823 5647 16036 6094 3507 5622
21687 5622 4003 1882 -1986 63 -143 -2094 -11299 -9488 261 -7782 -10581 -15875 -27220 -29704 -19605
21672 -19605 -933 2949 5755 7195 -3463 -15250 -10021 -3532 -4209 2626 -972 -4630 -17515 -25034
21658 -25034 -33975 -18434 -4086 -669 4933 3255 8739 15273 13582 7114 4228 1342 2723 4196
21644 4196 13391 9497 -1531 -8198 -12031 -4790 -11798 -8865 -8275 -7283 -773 -2239 -5108 -8176 -5274
21629 -5274 -2674 4410 -5653 -16277 -11811 -26467 -32871 -21884 -8074 -8395 -12325 -9078 -7216 694
21615 694 -3642 -6543 -6680 -7283 -1381 3821 3701 -1517 -8982 -6603 5853 12169 7167 2821 -951
21600 -951 -4051 -5917 -9099 -22354 -27625 -28320 -31124 -29805 -23630 -26562 -33916 -30183 -24658 -29394 -20789
21585 -20789 -12496 -1055 2145 -3236 -11795 -12624 194 781 -2435 7951 9413 5880 8644 -1628
21571 -1628 -7464 -7003 -2819 -10025 -4415 -9827 -8598 -5694 -10479 -3392 4379 832 -8371 -1994 2441
21556 2441 12286 8155 7677 7400 -1699 -13135 -20285 -20175 -6899 -7602 -14489 -23993 -20746 -7126 -19598
21541 -19598 -23809 -25324 -18331 -1366 14012 14890 7229 11303 16565 11169 8119 12165 5873 14354
21527 14354 5584 -4125 227 2355 -3049 -10787 -29987 -23134 -11774 -11274 -5721 -6026 -17151 -27346
21513 -27346 -23181 -15872 -13766 -5889 -9886 -12904 177 -3305 -3191 -5064 -2829 -3840 4879 3908 -1265
21498 -1265 6664 1662 -8559 -14864 -24308 -27218 -19268 82 4565 11183 8656 -9712 -15133 -2065
21484 -2065 3765 -14123 -25902 -25833 -22863 -13840 -1990 2823 12275 12310 9887 21598 15783 620
21470 620 -9837 -3817 10740 16056 -1232 -11838 -1361 -3338 -5519 -11210 -8343 -2643 -896 -1470
21456 -1470 -13765 -10984 -9420 -7110 -8938 -2851 1761 2355 3020 3342 -6590 -14258 -6803 -7566 -4376
21441 -4376 1501 3015 -1331 -1746 777 1200 5562 6886 9010 3747 -10212 -17184 -13824 -2240 -1393
21426 -1393 -14717 -15053 -21080 -15183 -21750 -15266 -6834 -1345 -7956 -4031 6195 6568 -2212 -3518 1169
21411 1169 3377 10884 21334 14957 16631 16991 14389 2279 4523 20066 20071 13408 6733 13615 6394
21396 6394 2785 -8741 -18773 -17801 -6382 9444 3335 -6292 -10067 -197 3970 8655 6196 -4519
21382 -4519 -8882 -7969 -7923 -6570 2309 -6188 -7220 -5313 1523 -1305 8001 23414 15741 7896 -2495
21367 -2495 -1410 -10451 -12307 -14631 -9950 -6505 -16940 -22642 -16020 -9724 4838 9208 4862 905
21353 905 -2668 -6900 -13075 -9410 -3331 1028 6295 -3865 -18930 -10663 -9451 -14591 -14172 -16038 -13825
21338 -13825 -5322 -10007 -18305 -19373 -25270 -16193 -15552 -15505 -16099 -844 -751 -17838 -17103 -13743 -12585 -3061
21322 -3061 1495 -4956 1999 1324 -10198 -10712 -20805 -18501 -3114 -2160 -8456 -1966 -21401 -19442
21308 -19442 -9065 -17338 -20627 -10403 -13093 -27296 -33718 -26850 -13785 -9443 -8667 -4208 -2519 -5454
21294 -5454 2565 7356 19870 22214 17542 11638 11827 -6575 -20174 -8461 659 11340 19336 11842
21280 11842 7434 4593 -6377 -8466 947 -287 -2245 1983 -9494 -13351 -14548 -18365 -11837 950
21266 950 -237 -15621 -16309 -13228 -16640 -23414 -27859 -23619 -19925 -11207 -9520 -15644 -14992 -5564 -3284
21251 -3284 -3132 -4021 -970 -6144 -1827 -8730 -12872 -2014 706 -14136 -11302 -1311 -4254 -15579
21237 -15579 -14646 3457 7780 8946 8971 9018 1775 -6526 -24631 -40941 -38530 -22825 -8784 -7076
21223 -7076 -8936 -11526 -8469 -7469 -10903 -12353 4685 367 -1544 -7541 -5164 -5127 -10796 -17484 -21295
21208 -21295 -15397 -22025 -25141 -23422 -41177 -29271 -10316 -11366 -9680 -13131 -8948 833 5836 10356
21194 10356 14578 9424 -2297 -2385 -2717 2949 4241 6521 1806 4414 398 -10765 -10914 -9272 -13090
21179 -13090 -17126 -10059 693 -9799 -20063 -24852 -17463 -7124 -3070 8132 -1403 -30097 -16995
21166 -16995 -1658 5266 3204 6253 -4583 -16562 -18837 -30170 -18024 -9927 -9525 -19236 -18197
21153 -18197 -4615 -1407 -9758 -14479 -27652 -35836 -24181 -17847 -11752 -18868 -28684 -21530 -16179 -17554
21139 -17554 -17673 -22885 -9502 -5215 -6085 -14738 -8867 -10295 -12385 -9036 -17604 -7468 -1562 -592 5149
21124 5149 9375 7663 1818 2494 5321 6799 7950 6955 4455 1416 728 317 -5469 -9265 -10048 -13684
21108 -13684 -19697 -6353 -994 -9842 -7622 -6048 -4223 3983 8461 7267 11958 21336 23277 6158
21094 6158 3118 -3702 -19136 -26215 -22596 -17783 -12091 -2803 -2605 -2905 -974 -2873 -5430 4754 11548
21079 11548 10515 -1043 -17551 -20755 -20591 -9632 -8278 -16862 -18792 -6735 5499 -3597 -8870
21066 -8870 -10743 -2359 -2130 -12450 -14412 -10089 -1651 2181 5425 5307 -8838 -21896 -21717 -29888 -32981
21051 -32981 -19490 1727 -197 -7009 -5047 -2710 -11847 -4306 3178 -3624 -17386 -14652 -4295
21038 -4295 -2201 -4490 -786 319 -6213 -3607 -6684 -10647 -16453 -13122 -4177 -14306 -11524 -7335
21024 -7335 -5825 11497 17891 15173 4207 4610 7734 11401 21101 18113 15399 12295 3058 -8613
21010 -8613 -14537 -6520 -12804 -7179 5821 4000 3977 -1113 7112 10025 -226 -6414 -1706 8910
20996 8910 3695 -4879 -7648 -10435 -18079 -14006 -3390 -6330 -12499 -19328 -18813 -3184 3622 -1306
20982 -1306 -6935 -9000 -6788 -18483 -21357 -18672 -22273 -25558 -24512 -7933 -218 -8988 -12764 -13995
20968 -13995 -13344 -9118 -1154 -1587 -10499 -9177 -3825 1945 11489 9174 7258 7222 15203 20857 17952
20953 17952 7958 9154 4353 -3496 2441 6447 9622 -8289 -15985 -12902 -21481 -29894 -17729 -3670
20939 -3670 -5136 -5241 -4460 -5136 -14562 -15373 -9669 -18731 -17889 -7711 -4185 3956 4272 -6510 1241 10609
20923 10609 20043 15575 10867 -7174 -11120 -19282 -17743 -20511 -17226 -11917 -4025 -1189 -5705 2473
20909 2473 8709 11279 4372 4217 2771 -7458 -13509 -11935 -4147 -4931 -11700 -12809 -12343 -14748 -9255
20894 -9255 3638 7991 -6055 -8196 -20958 -32470 -28335 -28603 -18586 -22933 -25729 -18787 -20587 -23955
20880 -23955 -17005 3563 14679 16697 18075 18465 9986 -6789 -14677 -16596 -29111 -27648 -7347
20867 -7347 -6023 -14780 -9491 -5555 -8902 -10440 -2435 -1002 8726 3879 8556 12320 7414 12955 7726
20852 7726 17155 20174 8177 2337 -11777 -11307 -12959 -23033 -22642 -26978 -29704 -16757 -16269 -19866
20838 -19866 -29410 -26647 -20996 -17000 -8893 -16629 -19553 -7748 -5505 -9842 -25909 -25885 -24942 -16124 1325
20823 1325 5759 772 -13344 -23585 -24432 -11471 3495 11676 -6612 -16342 -20486 -11174 6864
20810 6864 17537 10848 1186 -9154 -16091 -1547 -6239 -1349 -5853 -25226 -23705 -22299 -23790 -17328
20796 -17328 -5856 -12744 -20496 -17962 -11878 4226 8058 6591 13932 15231 5473 1911 -5248 -4352
20782 -4352 -2225 -6387 -7414 -3121 5907 4037 -522 -6063 -5991 -9853 -9229 603 6319 6033 -5177
20767 -5177 -18773 -26529 -29246 -18928 -17674 -10283 -15506 -16522 -17524 -2544 3637 6084 14475 15316
20753 15316 -1132 -3922 18315 27034 19915 2104 -4101 4627 4763 -3693 -15897 -26990 -17896
20740 -17896 -15019 -15787 -5495 10220 10389 4458 8915 14571 6490 -795 -2142 5503 9879 2737
20726 2737 -16705 -22865 -23780 -7546 6059 -2151 -9841 -20791 -9076 -8164 -12330 -20695 -18532 -8703
20712 -8703 -16191 -6395 3411 2648 -3642 -14565 -18890 -8925 -3922 -7900 -17400 -9213 -8711 -24687 -27741
20697 -27741 -10838 -2967 1303 7422 -1808 -14532 -12204 -10423 -11423 -11192 -12989 -8643 -2945 -3961
20683 -3961 -109 -4680 -2548 3006 12211 9588 9085 6004 6415 -5079 -16800 -22590 -25614 -24336 -18535
20668 -18535 -13994 -4027 -1344 -9532 -14704 -635 -10446 -8094 263 8510 -4153 -17799 -7698
20655 -7698 -6153 -14556 -12105 -4691 5096 10940 12869 4717 -4206 -7353 8210 2473 -4395 -18266
20641 -18266 -9795 -86 -3131 -16207 -9414 2228 -6360 -12110 -15871 -7198 -8022 -5616 -5669 6807
20627 6807 13748 8496 9959 8773 1931 -7412 -11667 -9247 774 1365 168 1156 5826 8221 4523
20612 4523 5073 3137 -3034 -18151 -8701 15304 19653 14976 -6586 -22733 -24127 -14659 -7372 2042
20598 2042 -6723 -19211 -16134 -7068 -179 6088 11356 5256 5596 -6294 -9003 5785 9688 -7517
20584 -7517 -15502 -8910 -8678 -7247 -6059 -67 -3466 -8363 -3993 -5862 -9487 -8051 -4988 -10857 -22223
20569 -22223 -10899 -7907 -18386 -27860 -27005 -24994 -20629 -17268 -6846 -12495 -8981 -1032 -5033 -3327
20555 -3327 8279 1376 -3806 1624 -5910 2468 11835 5547 5648 10043 1985 -3464 -10408 -10971 -8741
20540 -8741 -11594 -7255 3711 14188 12908 13872 13441 9519 11079 12538 13317 13921 3531 -6355 -2876
20525 -2876 -8900 -4788 2092 8954 7385 268 4237 8504 11764 1373 -7924 -14286 -5787 11172
20511 11172 19567 19309 18125 12722 -6309 -15625 -12770 -14125 -13992 -7257 -8316 -3097 6941 -311
20497 -311 -4901 2474 5604 -4795 -3415 7022 -4113 -3453 4409 3047 633 4700 -2104 -9013
20483 -9013 -3821 -9897 -18092 -18174 -7503 -3609 -4860 4752 10182 1314 -5893 -2671 5822 -4184 -1523
20468 -1523 7084 -2443 -8620 -10728 -13445 -13027 -10274 -4907 -4576 -1146 589 -6439 -13005 -9174 -9486
20453 -9486 -12528 -16332 -15297 -9781 -1924 4086 8554 19180 29010 23165 14258 8367 9866 12285
20439 12285 4877 1254 -1904 1859 21023 34070 38305 26446 15959 7660 813 -6390 -14896
20426 -14896 -20868 -14111 -16443 -10629 -4820 4193 -3901 -16093 -3084 -5659 -6618 -302 4482 4007
20412 4007 -6644 -5409 -2240 -9117 -8022 -17698 -29346 -32319 -23354 -11302 -10472 -19658 -16755 -14429
20398 -14429 -13185 -16845 -8139 -14768 -9548 -2865 -4598 2491 2750 9178 10291 6939 3901 112 -299
20383 -299 -562 -6617 -5898 -413 -4295 2524 11851 5777 8538 1587 -1880 -6236 -9162 -1511 1862
20368 1862 -5027 -8323 -11640 -9827 -9177 -5686 -6259 -12275 -17110 -6843 2103 933 -6281 -12109 -12187
20353 -12187 -22594 -15054 -9356 -16315 -14063 -5064 -1347 4102 7312 3720 -5355 -10868 -14273 -12341
20339 -12341 -11890 -2569 12428 13370 8018 -9823 -16786 -7774 -6297 -14956 -13005 -11032 -21873 -15057
20325 -15057 -12908 -8465 4862 8620 7509 -5635 -4076 11422 4314 -11287 -17978 -14757 -12619
20312 -12619 -9132 36 -6502 -7725 -10633 -7423 -17846 -17190 -13205 -9952 -3331 -1702 -5399 -7730
20298 -7730 -4971 -5647 46 -11090 -15573 -20188 -27468 -23852 -18630 -4036 519 1785 71 10258
20284 10258 21228 17469 6138 -7376 -13826 -7646 -5925 -8269 -12890 -18060 -14799 -1065 4170
20271 4170 1824 6511 10986 13632 332 -18597 -15918 5078 2857 -1716 7059 9215 6501 6797
20257 6797 -4457 -17646 -6539 -532 2304 -10438 -27454 -26977 -14066 -7492 -8566 -7273 -2863
20244 -2863 -11201 -3809 8428 17600 15499 7257 -5583 -11379 -14755 -9659 -15282 -11850 -5434 -11037
20230 -11037 -25305 -25052 -18013 -6899 1592 -7968 -16153 -13118 -9162 -5337 -920 11889 9385 -5930
20216 -5930 6663 12172 -1535 -13624 -24186 -18745 -13024 1417 9047 10605 9014 5034 -6681
20203 -6681 -19389 -17741 -12363 -8603 -4251 -3271 -8068 -5334 -6279 -77 16043 20477 15774 1657
20189 1657 -14864 -22471 -27450 -19188 -4077 9191 15570 1687 -417 -4580 -4228 -7125 -1402 -9627
20175 -9627 -7321 -11795 -14867 -5775 -10311 -29976 -23377 -9770 555 -1012 1831 4426 -8108 -8479
20161 -8479 -16056 -15949 -564 8614 1805 -2052 -3788 -9176 -2665 -18289 -19199 -16273 -15392 -9536 -3811
20146 -3811 77 5301 2069 6382 4236 4563 5879 3042 3614 7555 -5807 -8081 -9948 -3831 -6054
20131 -6054 -10886 7074 23297 18288 717 -1029 1138 975 5771 11481 8096 13066 16490 6726
20117 6726 -2973 -9973 2408 19428 28314 18522 15403 9837 1649 6584 3790 -340 -1172 -1150 9573
20102 9573 11939 -2558 -5555 -4783 -8292 9230 10849 -7457 -8366 -8003 -9741 -11670 -12349 -10745 -11331
20087 -11331 -8762 3424 2010 -1336 -6734 -17619 -19200 -12535 -6530 5863 11048 123 -14531
20074 -14531 -22904 -13013 -2228 6106 8115 -1696 -7401 -4870 8163 860 -2699 12402 10694 -2884
20060 -2884 611 11173 14073 -10074 -14488 -2468 -1725 136 2403 6507 2570 6245 10312 -1071
20046 -1071 -10752 -13690 -3376 -839 7966 14602 8893 11518 10549 4426 4020 -2790 -1699 7486 14680
20031 14680 11966 -4632 799 6814 8223 1820 -6507 -8489 -8468 -6896 -9049 1932 17668 22674
20017 22674 19233 17313 10366 11398 16072 14472 14784 9933 -3468 -16729 -14859 -14159 -9685 -900
20003 -900 11762 24110 35838 16720 606 -2175 1774 885 2529 9102 13198 21970 27909 20417
19989 20417 13501 -1001 4997 17620 15288 11377 23841 23692 13142 2056 6133 5827 3505 7753
19975 7753 11049 -2515 -5402 8639 16569 29043 12131 -7208 2670 12148 9732 6788 11228
19962 11228 8630 1077 -12964 -8892 -9816 -22080 -23152 -16023 -7366 7908 4998 -3548 -2785 3236
19948 3236 -5476 -6068 3363 -3379 -2712 4093 9095 11391 12471 21321 25840 28894 30839 25566 17782
19933 17782 9906 911 3998 201 -10799 -12955 -18096 -15499 -15613 -7668 -6968 9415 13118 23291
19919 23291 40070 35440 38538 47073 44885 45992 51823 50042 50791 51060 45280 59601 72626 89855
19905 89855 100028 97091 93266 87151 75501 72295 72895 81525 97033 120588 150721 171194 178831
19892 178831 153670 131261 112695 108600 116395 129643 145740 143542 137033 130148 131777 134937 129617
19879 129617 131479 119363 96326 79585 79682 95627 104234 108709 120190 137528 150122 167654 161544
19866 161544 136734 132619 128955 109660 98696 100522 90223 82958 94589 116310 131108 125483
19854 125483 119573 129500 137569 154874 152260 134706 130374 128814 121723 126563 140561 140682 140117 133498
19840 133498 137412 154154 146000 138823 135061 118903 117207 119108 124169 128536 128885 99906 85183
19827 85183 76077 71887 66553 57209 37506 18822 16994 23796 34192 44813 32339 19614 12823
19814 12823 13017 19239 21635 9671 6580 20324 16452 16606 17735 23217 23671 12479 3881 -5240
19800 -5240 -7453 1453 -1808 -2253 160 672 2827 9429 20301 16937 13375 19743 17728 3357 1151
19785 1151 17531 18349 20621 20747 23198 17743 12054 8752 -4024 -15099 -5659 11662 21065 25964
19771 25964 19382 10098 3486 14048 12441 12959 14747 20669 25865 26242 25182 18026 2340 918
19757 918 6044 5720 10679 21683 21517 16505 22189 15074 4165 11077 20171 20911 9294 13962 17083
19742 17083 10459 9812 15347 10420 18567 27835 33959 30190 22588 15764 9017 19443 27868 26660
19728 26660 8506 5043 4239 9824 18332 17899 20129 18204 26819 27133 24630 21368 17337 22954 17793
19713 17793 2233 13595 26459 27638 20774 14645 15395 4891 -1489 277 3742 8534 4155 3594
19699 3594 8740 7960 1665 -1363 7028 11175 9865 20654 29526 29563 27934 23826 26765 24598 20951
19684 20951 21399 22153 16652 15066 11655 11817 18492 22919 28229 40518 34046 16353 13947 13602 22585
19669 22585 26300 25810 27910 38313 36855 30624 36965 39736 38496 26594 21024 22751 18357 22212
19655 22212 18853 15204 26090 27832 24568 19161 22780 42147 59145 54900 51529 55706 63681 66711
19641 66711 63100 63528 55788 52364 54868 47727 40746 49149 63014 82414 89323 80550 80296 78087
19627 78087 77692 76020 69866 76551 89164 105231 107754 93753 67338 70354 89538 79970 72124
19614 72124 83762 95856 98238 99219 104901 90371 77550 72906 77799 85870 88977 87143 85325 86949
19600 86949 83235 71850 69744 80845 91023 91367 93461 92504 91418 76149 71851 84047 100469
19587 100469 97306 102097 103828 106593 117153 128363 141556 133756 121381 118505 118408 118617 121803 121792
19573 121792 113057 99306 97761 112616 119541 110290 111145 111958 118868 112288 105649 90998 89673 97132
19559 97132 93360 75966 65846 62750 55506 68531 83918 76533 81563 80816 76254 81638 85394 83735
19545 83735 87465 101874 124401 138835 157236 162118 142371 127128 135917 145676 139441 142463 151173
19532 151173 161986 160838 148913 134349 117859 110228 110910 130548 134653 136019 140139 133241 120798
19519 120798 92245 83685 97867 112617 119351 116406 107588 105627 108250 111342 108942 110011 107326
19506 107326 108160 102497 106158 117184 103534 92986 99893 112831 120862 113255 128938 144052 153456
19493 153456 159335 147089 153161 166298 168390 159796 142701 136523 144468 143983 140497 157407 170020
19480 170020 182247 206569 216830 199374 174447 170900 185331 183324 181077 191758 220849 264161
19468 264161 322314 380393 412618 392116 341697 289096 239041 211089 206825 216355 212547 193127
19456 193127 177607 174259 185481 187659 207992 209239 224405 242185 237086 219256 210673 216349 227278
19443 227278 243003 243739 257437 263988 264537 288193 306781 308631 332224 366618 391565 427470 474290
19430 474290 555355 679344 840294 1009697 1139728 1265825 1357455 1381627 1326522 1255457
19420 1255457 1246031 1290306 1428685 1615715 1794841 2015905 2371318 2957584 3745589 4401831
19410 4401831 4496588 4052215 3406465 2902024 2629735 2550791 2596315 2728356 2908904 3186616
19400 3186616 3634401 4221689 4694449 4960954 5184212 5674527 6674253 8432549 11279928
19391 11279928 15599177 21534658 28579814 33994476 34200195 29359881 22585166 17111188
19383 17111188 13874612 12456223 12518470 14111587 17400255 21576286 24759045 26759137
19375 26759137 29282798 33574222 37272813 36509354 31062409 23897487 18144266 14735401
19367 14735401 13173353 12814448 12838084 12632233 12212684 12024770 12627474 14376504 17359191
19358 17359191 21025565 24330672 26359499 26650077 26237732 26874932 29486080 33486753
19350 33486753 37750928 40289557 38879365 33576942 26823275 21294747 18086182 17032679
19342 17032679 17728841 19484476 20846187 20585329 18892604 17010089 16255412 17299384
19334 17299384 19755084 21894393 22465893 21652612 20671288 21069948 24144619 30129064 35816796
19325 35816796 36471174 31734609 25012815 20077395 17794827 16729098 15418212 13633524
19317 13633524 11838515 10243336 8733323 7299254 6135578 5369147 4941548 4758612
19309 4758612 4782486 4980812 5135884 5002237 4589568 4112828 3789047 3653043 3623402 3684350
19299 3684350 3859750 4200847 4616047 4845883 4755271 4393944 3922073 3469977 3103925 2837735
19289 2837735 2661627 2582031 2568922 2544171 2474727 2379525 2276901 2161558 2009110 1835767
19279 1835767 1680609 1570256 1470321 1361673 1254310 1161989 1070733 1017891 999192 974746
19269 974746 959097 931283 889093 845913 809909 787080 801175 834186 843433 835778 796006 770723
19257 770723 763580 763168 742605 714598 685725 656981 633239 640571 667936 681907 686852 684439 663677
19244 663677 616175 584200 573089 572931 577122 578398 567573 557923 551308 544163 541414 524596 502930
19231 502930 475325 440290 409649 376937 356303 350920 363611 369806 358336 345952 332289 307127
19219 307127 291541 276646 259719 246461 237810 236102 232068 221603 201099 206955 209403 205101 203347
19206 203347 191005 185886 183617 187590 179907 175782 178365 168572 161726 164880 169001 178723 184876 177299
19192 177299 162176 164320 159426 153927 149960 137127 133199 144513 150115 139816 144795 144671 137715
19179 137715 134762 133825 127751 112166 96378 92617 96117 104412 95431 99677 94294 77971 63374
19166 63374 73880 85303 91340 102816 105701 99362 97076 96840 95050 95045 85834 85374 82485 77295 72924
19151 72924 76758 78656 83883 104368 112865 105298 86310 77127 68390 62683 66362 74697 74606 71620
19137 71620 70732 75067 82535 75976 71910 72974 72589 66265 64730 77509 85761 86514 86610 81413 76260
19122 76260 75167 79954 73966 74154 68441 69221 58290 49718 47800 63793 77478 76008 83950 83789
19108 83789 72939 61959 61338 70091 67026 65264 75017 68104 68851 72618 65436 56442 61108 63373
19094 63373 65420 62787 67267 76418 88895 88399 94497 92537 93229 90334 88062 84658 89858 95233 91373
19079 91373 91154 96794 87687 81803 92432 86229 81428 75677 81532 93726 106507 122910 129137 153795
19065 153795 172111 192871 215073 234385 240849 243232 252731 244528 233129 237624 259803 286869
19053 286869 307661 308352 284374 261548 245071 242977 241027 224856 210865 221347 225954 214382
19041 214382 220462 216077 195555 193161 207459 217451 227159 241346 272717 293139 289019 282537 269536
19028 269536 272626 293398 336623 380064 420397 484503 594129 758886 963160 1121134 1183138
19017 1183138 1163624 1153448 1174028 1251464 1367011 1513195 1657383 1716265 1646010 1477478
19007 1477478 1299339 1163566 1063762 972790 926220 939654 963330 975371 945789 846008 720617
18996 720617 610650 527922 463482 402223 363176 338412 311565 319230 345809 380174 424345
18985 424345 466351 505880 550918 585244 615434 605530 575655 547225 546963 561196 591175 671737
18973 671737 807797 1000065 1209364 1429659 1664218 1841946 1869929 1749892 1534490 1303956
18963 1303956 1123243 1013023 986636 1059322 1218795 1390718 1464658 1407355 1285930 1143886
18953 1143886 1001536 873126 745772 627487 535617 453510 395903 343682 295908 279359
18943 279359 269372 252699 225660 200810 185705 165040 153854 160655 176011 194250 209184 205103
18931 205103 215738 218756 204593 195013 184717 183751 189561 200083 218101 237442 232729 231049 245201
18918 245201 237797 226017 195705 176445 160572 139721 118775 111908 112336 120108 119999 115038 119363
18905 119363 130568 142230 133269 129140 135553 131445 130114 138724 153432 151269 128654 95671 88559
18892 88559 89319 95698 107491 96812 88827 100884 100200 90414 93732 89407 79689 70640 85076 109947
18878 109947 130189 138764 141113 129784 117238 115996 119401 134344 153088 172661 181564 187885 179612
18865 179612 166648 153319 148518 147605 132019 122256 123060 117841 123665 144557 161529 169734 171827
18852 171827 179692 206314 239590 261963 274031 269191 240894 211432 184070 155898 143279 125563
18840 125563 123335 145116 164407 175351 189445 197837 205732 183948 166092 156706 164052 185268
18828 185268 203463 225432 238083 223145 183301 145515 141820 139154 154016 159775 156316 177769
18816 177769 204670 200203 182267 163906 137105 124450 133129 137958 143537 148776 153628 176112 192695
18803 192695 192232 179146 165245 146398 120946 119627 108821 100640 90183 84958 83185 83331 83387 96602
18789 96602 92744 88529 86846 73153 73496 81151 85106 66464 48082 44865 44943 38471 47342 63676
18775 63676 79898 82364 74916 69645 60083 55012 91209 137060 162029 157314 133766 95921 78894
18762 78894 61788 47346 48515 56816 57903 59341 64219 65031 58205 53150 40389 34363 44527 54911
18748 54911 51239 39478 54370 50405 65755 80969 62689 50369 49027 59669 55128 49298 59554
18735 59554 63224 68093 76976 84846 92522 93452 92353 95477 106403 109088 117065 119650 119340 108727
18721 108727 115549 100028 98910 96329 87031 86313 86313 98600 111542 129567 141503 132136 114649 103097
18707 103097 102640 102400 103471 116251 118771 109846 106398 105869 102144 101484 108811 108163 105558 107046 117667
18692 117667 126846 130720 126643 129115 128468 120749 112689 107702 117601 129567 135721 133375 127449 117370
18678 117370 118706 123039 119633 102937 89530 79017 76359 70991 73352 80937 95019 110707 104549
18665 104549 105201 102925 95441 94668 97167 118049 132835 132496 122728 128045 147201 138439 129944 119573
18651 119573 106715 99594 110007 118700 127873 134154 128359 113871 118576 125274 124791 122065 118058 130258
18637 130258 135567 136019 138851 138245 134465 119695 117992 122979 128282 138663 144557 150235 159373 164412
18623 164412 175848 172883 163609 166921 161326 172257 190342 197200 194202 207715 215856 213442 210838
18610 210838 210246 205906 199469 192951 191237 201662 206401 215332 221195 208905 196436 197219 178312 173853
18596 173853 187753 199007 219047 245271 260408 275569 285233 304273 333288 339133 320486 301508
18584 301508 291241 292169 301315 320977 362341 396959 409107 384893 341397 327692 324144 326206
18572 326206 333245 350428 350483 340239 330721 311353 292472 283505 286914 295652 312143 324184 329212
18559 329212 333366 342582 361900 382451 407545 431075 461740 484830 491364 480894 471938 457014
18547 457014 455677 475058 491457 508024 546889 570713 585749 619283 669741 737628 814399 923198
18535 923198 1059671 1206666 1351724 1440817 1456462 1406251 1309641 1202887 1095986 1050497
18525 1050497 1027426 1015509 1023274 1038023 1092486 1186968 1346811 1597215 1894518 2061783 2014446
18514 2014446 1836798 1647894 1532742 1474530 1474060 1510470 1580003 1710893 1893124 2093946
18504 2093946 2265723 2397946 2547710 2811776 3266285 3977683 5078676 6615834 8277890
18495 8277890 9528975 10148166 10012296 9256153 8266070 7449333 7088246 7169916 7574532
18486 7574532 8301680 9481275 11075213 12367765 12852472 12874439 13267835 14703563 17405606
18477 17405606 21012952 24587926 28262792 34006080 45353102 65270719 88192741 98047277
18469 98047277 88898675 68549257 49400035 37072666 30350754 27273244 26824959 28862247
18461 28862247 33422432 39317831 44815249 50359441 57533878 66050561 73101366 76041288
18453 76041288 73239576 64686219 52768321 41017754 32065185 26437534 23517900 22626822
18445 22626822 23021045 24199379 26417158 29807806 33419465 35537975 35221834 33736198
18437 33736198 33435871 36141618 41204754 44875909 44183322 40173157 36441809 36166551
18429 36166551 40049851 45816789 49580612 48401143 41946338 33209227 25412058 20276104
18421 20276104 17374701 15398062 13581400 11946849 10878808 10656323 11332126 12476808
18413 12476808 12990003 12268577 10789704 9478657 8935383 9382389 10824826 12571115 13222831
18404 13222831 12316879 10568431 9081286 8329056 8075469 7791364 7136903 6252042 5435330
18395 5435330 4901354 4664474 4586698 4518719 4349682 4109028 3862724 3620939 3340694 3026270
18385 3026270 2745767 2542391 2399185 2322595 2331065 2441243 2649212 2858075 2927945 2838652
18375 2838652 2733679 2769673 2876188 2861934 2715442 2530046 2444565 2515783 2746876 3040280
18365 3040280 3147264 2987048 2670560 2392178 2231000 2151818 2074450 1933938 1776989 1645217
18355 1645217 1535635 1469146 1437930 1457434 1543451 1686995 1799187 1824754 1757971 1629392
18345 1629392 1483879 1356397 1266596 1192132 1139608 1114488 1107482 1088113 1047838 985473 905391
18334 905391 810141 732388 673673 648489 643937 651344 658517 670139 657857 621647 574286 521237
18322 521237 466488 431091 409880 401694 390298 385614 387703 384816 377801 364781 342390 322898
18310 322898 304218 292110 296767 301552 306208 306971 311189 304538 296712 287334 266044 242239 227423
18297 227423 216128 215991 219850 212403 190286 183783 185555 171000 166591 159246 145735 146227 157632
18284 157632 159933 158275 146212 137601 141941 139782 131641 114060 101115 106141 117029 125385 135606
18271 135606 135860 143846 142555 142834 134944 124364 121315 131673 135109 129676 121852 105877 102928 116036
18257 116036 120769 126811 123304 121742 112955 103224 105504 108608 98633 96747 86233 83470 83001 94419
18243 94419 99991 101245 96969 94254 93144 89175 86740 83212 74270 88495 85507 83353 77662 75397
18229 75397 82210 102077 102212 91659 95884 99955 107389 100553 89056 88416 89408 72720 49666 45834
18215 45834 64784 70620 74144 80147 82034 70230 70693 71162 77201 75323 62162 65532 60219 58321
18201 58321 64955 68375 57142 43501 48592 69804 77688 66727 56891 63258 66993 64098 71313
18188 71313 77158 78407 77074 71422 61878 55894 48673 62177 72174 64832 59019 72757 79477 82889
18174 82889 78130 74726 68986 59401 50559 46650 48383 61694 69926 69398 77716 95189 108905 108582
18160 108582 94423 90553 79637 71827 60128 53157 58247 63095 74724 85366 81480 83754 92341
18147 92341 100579 103116 103111 111967 116775 117570 128555 128416 134197 128346 142603 177942 188508 182009 180836
18132 180836 184022 197863 208638 231820 250216 259934 295617 331815 372226 421218 473248 539459
18120 539459 623596 728453 864372 1057706 1313985 1633148 2100794 2882432 4255422 6812648
18110 6812648 11577213 17866323 20797722 18461654 13034311 8130933 5204168 3584895
18102 3584895 2630517 2016655 1588198 1291817 1073044 922026 812480 712458 624375 556339
18092 556339 496171 447613 402317 353899 327681 305630 292516 272231 257775 249770 234492 227819
18080 227819 215211 203427 190379 182716 167749 155789 149492 148534 140390 126901 119638 123833 119937
18067 119937 124332 111595 104240 97206 90449 89292 83683 86614 79835 60382 49903 43358 51961
18054 51961 52708 56341 52861 57831 52731 59212 64132 45863 39601 43434 32409 33814 43616 45750
18040 45750 41649 34386 36192 40114 39568 45817 51679 38813 36811 37833 32977 38408 42583 42635 55829
18025 55829 44117 31264 30964 38998 33866 35968 37832 34316 40866 42183 39280 44235 57647 71867
18011 71867 76199 77575 70995 66557 62470 66551 75830 83435 83619 82252 79596 74812 78415 89287
17997 89287 101982 115140 128373 134793 134053 133550 117663 94545 101162 127886 130290 131536 155312
17984 155312 165097 160000 140738 146550 143289 134522 138827 144927 131695 119524 118192 115332 122617
17971 122617 144358 164896 174552 179863 178226 144688 141966 154897 171358 189010 173839 159537
17959 159537 160024 154540 145073 147569 136860 136737 141600 145461 164602 193915 222448 250795 258364
17946 258364 249353 224258 200230 180569 164385 153865 155412 146281 156102 184700 200883 197090
17934 197090 195566 208968 235532 242517 261146 270596 258060 232776 203064 185121 171962 169089
17922 169089 162712 150507 146219 144610 153106 168046 178639 176828 164310 156264 158481 152295 156782
17909 156782 163988 163922 157889 147227 141608 138322 133825 122396 123010 124651 123181 111992 99496 80832
17895 80832 57256 54933 77348 102619 107066 112433 133930 143381 155836 143307 119940 95409
17883 95409 76753 77844 81318 81146 75987 81812 81395 95926 116845 149707 159724 135589 105071
17870 105071 89315 83395 70906 50896 30856 38051 44361 36388 33555 26935 30311 25333 28513
17857 28513 34979 33711 25207 27455 33667 31456 19226 23602 28284 36678 32728 40530 40385 25208
17843 25208 17177 14371 15121 11950 15191 9932 8503 4746 1795 -5937 -13347 -20012 -23432 -22733 -23086
17828 -23086 -7810 11346 21190 26173 16058 -4527 -5128 7509 8646 2453 2700 13040 8617
17815 8617 6178 8501 16428 13774 2107 5862 14873 9981 3295 -2217 -9933 -18847 -17617 -13379
17801 -13379 -6369 -7212 -20718 -17776 -16175 -18892 -4733 7420 5668 6907 4203 9198 688 -787
17787 -787 1857 5649 -7653 -14617 -10566 -17261 -12584 -14572 -4546 8201 10999 2952 -6960 -5792
17773 -5792 -7959 -14962 -11389 -6639 -7915 -17336 -11956 -10871 -701 3152 207 -6162 -251 14581
17759 14581 23393 16630 5404 14861 16445 11288 7135 4583 19515 30793 24693 15524 11255 -2075
17745 -2075 -8530 -3120 4903 15103 14869 19217 11226 1 -11927 -10051 -7220 3355 22778 18240
17731 18240 18110 12521 3334 -7817 -9118 -17061 -15768 -15613 -17180 -16620 -11192 1495 4053 2665 6841
17716 6841 9241 8678 -990 -19044 -14388 -18154 -10371 -12307 -9413 -15271 -18126 -9649 -8135 -12120 -9949
17701 -9949 -12157 -10487 -16142 -14181 -903 11911 17445 7684 -5298 1782 -2501 1887 9340 1353
17687 1353 -7487 -5482 -11093 -6237 6277 12636 19107 28052 26848 18362 11863 5275 -1532 -11187
17673 -11187 -5197 3268 5710 15898 11178 -1535 1516 7431 10662 18240 15519 7683 12570 15680
17659 15680 6063 -968 -10095 -21005 -13572 -10537 -11475 -1150 3303 7711 -3664 -6638 -4043 -7767
17645 -7767 -13512 -12592 -8408 1103 -2826 8188 3436 98 -9382 -9986 1773 12886 15270 8253
17631 8253 -4132 -3237 1917 -1547 -6861 -11246 -20110 -2861 10100 -2206 999 2571 8709 12458
17617 12458 14909 6244 10196 24752 31046 21498 7205 2782 -9003 -13329 -17121 -9543 5837
17604 5837 11686 9624 -2109 2019 6059 5860 4504 13689 10486 2676 2513 -949 -5294 -3469 8453
17589 8453 22962 9650 -2179 -8325 -9933 -12076 -12964 -12924 -11016 -10129 -8801 -8051 -14725 -25217 -29651
17574 -29651 -29260 -5399 4817 9619 1791 -2376 -6432 -17064 -16059 -17758 -30667 -39360 -21581
17561 -21581 3626 1661 -6255 -16061 -12945 -8213 -4778 -9149 -6414 -3404 -6495 -10972 -18649 -22638
17547 -22638 -13437 1094 12522 19629 14447 -2904 -1144 2369 7916 1301 -11965 -3492 -6009
17534 -6009 -18776 -15408 -20769 -22286 -21237 -16184 -15798 -12029 -15921 -14471 -12797 853 8790 6748
17520 6748 -5597 -2406 -6362 -6979 -5216 -13557 -10696 -9992 -14581 -22523 -25540 -15319 -6945 -12321 -7726
17505 -7726 -2736 15 3495 11664 17905 16557 25833 18870 -3286 -9744 -4112 8582 4539 -3902
17491 -3902 2806 6794 8858 13382 19512 12030 2570 -7176 -4068 3299 4889 663 -3129 441 8017
17476 8017 16852 19781 13030 10301 5740 7283 9756 4476 7497 10781 1373 -6943 -12721 -3085 -4789
17461 -4789 -11838 -16488 -23486 -24374 -10885 -3557 -13219 -20793 -11932 2661 -1548 -4967 -1674 -3655
17447 -3655 7197 13124 29937 52856 85060 117848 114083 87746 62817 37926 16591 11906
17435 11906 1730 3818 -488 5184 11579 9865 7629 9817 11508 11952 -436 -4221 216 3109
17421 3109 2122 294 -7387 3363 5203 -9450 -12166 -13444 -2424 -1666 2821 3923 -9232 -21567
17407 -21567 -16504 -14000 -3488 -2241 -7953 -5057 -13291 -13650 -7991 -9513 -6434 -15030 -8560 -4903
17393 -4903 -5355 -16782 -15925 534 -2441 -12296 -14976 -26413 -16918 -7226 10000 6715 15015 18075
17379 18075 10214 17029 10650 5051 3890 8087 11051 5460 -14401 -27684 -20606 -19011 -13656 -8499
17365 -8499 -8705 -9169 1434 3418 7846 -3408 -6733 1806 2209 8022 -4350 -11362 4735 8690
17351 8690 -5938 -9828 -4500 5036 -6572 -6520 -7492 -15726 -17662 -18136 -21500 -6088 9281 6476 9254
17336 9254 17620 21221 19704 11194 7253 9895 12341 2551 2529 2344 -10140 -4022 -8956 -18427 -25605
17321 -25605 -22317 -3605 -971 -4692 -9128 -10821 -8582 1252 21853 13807 -11333 -18582 -20608 -19109
17307 -19109 -13815 236 9229 11761 17109 5834 -4494 -15693 -16907 -26707 -31375 -27265 -11590
17294 -11590 -979 3403 11877 7855 -7157 -9481 -2852 -10595 -16348 -16994 -13436 -14530 -11772 -2542
17280 -2542 -5039 -17900 -22711 -26835 -21121 -17249 -8800 -3956 4364 12431 4491 -1044 -10719 2046
17266 2046 6781 15133 7546 634 12480 15737 13244 -437 -8096 -14893 -28922 -32637 -35687 -26744
17252 -26744 -8946 8624 18078 20192 23423 11124 -6469 -1113 10151 6501 316 -5601 -4632
17239 -4632 -15510 -28845 -16825 -5217 -2600 10564 7399 10985 10879 15826 17103 13454 4063 -230
17225 -230 10254 7142 1843 -2164 -7719 -17473 -19744 -15645 -2436 3881 -13030 -17911 -10344 1564
17211 1564 1813 4833 1525 1092 3797 6848 -2105 -1369 1105 -329 -3940 -7303 -9261 -11043 -11050 -2208
17195 -2208 1465 -1132 -9192 -8473 2928 3088 -14595 -8889 6146 12429 7229 2685 3693 6825
17181 6825 13476 4767 -4994 -4553 -2377 14006 3699 -11532 -8908 4866 3594 6772 6309 503
17167 503 -10148 -16109 -2750 1575 -1367 -14424 -22283 -13324 -13145 -5476 -3715 2478 648 -8329
17153 -8329 4313 12028 8040 -213 -9392 -14663 -15298 -20701 -18812 -14158 -10942 -14314 -12357 -12215 -18333
17138 -18333 -28625 -19015 6988 16998 11539 2485 1870 3239 -5648 -2736 1203 697 14645 12484
17124 12484 1111 -6075 -4625 -3652 6759 7256 473 -1265 2947 9952 8521 280 -4142 -13417
17110 -13417 -13324 -396 7513 1941 12812 2838 4069 3053 3823 3317 -2684 -10277 -17449 -15448 -17187
17095 -17187 -4438 613 8109 16692 7850 1878 942 -956 -4222 -5147 -5627 -5601 -5495 -10328 -4127 -3034
17079 -3034 6650 5106 -9094 -14586 -8730 4213 -13780 -5178 1976 -4374 1287 -13228 -25542
17066 -25542 -19817 -6782 -1108 -2682 2956 9636 11317 9178 -7198 -3313 7503 -3282 -4411
17053 -4411 -4458 -10841 -7914 -5560 -4210 -4277 -1091 -6320 -8624 -4004 -8936 -10749 263 2718 630
17038 630 -5145 -13466 -11546 -4088 3706 3303 8683 7586 -2076 -12967 -4464 2218 11000 11629 5325
17023 5325 -2143 7360 2119 -12144 2920 20834 13797 9028 7739 16104 23963 15852 23437 16343
17009 16343 -1212 -843 3103 6737 -5331 -12894 -7616 -4435 -7933 -5494 -12871 -7409 3439 5518
16995 5518 5271 -1442 -5179 5318 11325 11980 7648 8231 -757 -3276 2309 -1869 -1907 -3506 -3937 3683
16979 3683 889 -1135 18369 14865 8285 7638 16479 20375 5034 -1550 -7874 -5468 -10007 -7653
16965 -7653 -7766 -4330 -1968 2539 -2622 -6433 -2635 -4856 -2087 -4554 -3465 -11920 -10666 -1449 -6660
16950 -6660 -8368 -2957 -8103 -1545 -3896 -1235 5524 5648 -1728 -6660 -15252 -10598 -6698 -9193 -8673
16935 -8673 -2423 12177 17269 1152 -1966 -9778 -13545 1678 2766 -6152 -2036 4558 4753 -834
16921 -834 -10431 -22225 -31239 -29244 -18084 -6006 7290 3782 -43 -3402 -5728 -8954 -14579 -16246
16907 -16246 -16228 -14514 -10943 -2806 -6284 -19690 -23321 -31547 -26586 -20670 -23497 -18335 -2433 7339
16893 7339 16180 9114 4347 6357 -411 1937 -1285 2436 7900 10182 9907 -7709 -15835 -3133
16879 -3133 4966 -2247 -10348 -19801 -15687 348 4831 6662 -3146 -13794 -6444 7949 8190 17809
16865 17809 10956 5459 3289 5352 9785 5620 -7428 2266 4515 8588 14237 13748 8265 5660
16851 5660 12698 3369 -2696 -1467 -3701 7464 20019 21545 17035 19933 18105 10550 -1293 -2996
16837 -2996 -6660 -1818 1351 -5268 -15554 -15467 -7138 -3216 -11206 -11598 -5487 3450 -1555 -14992 -23316
16822 -23316 -17536 -5391 -1175 -2715 -1029 5130 12315 9752 16463 18763 23736 16115 4972 9447
16808 9447 14517 1743 -4378 11535 10535 8019 7727 3785 2628 1928 -2025 -15126 -11291 -4346
16794 -4346 -4413 4240 4846 4366 3135 5064 1542 -2691 -4641 -1976 -2582 -7772 2062 9447 10545 9527
16778 9527 4444 6655 -394 -6564 -6339 -3820 -480 7395 7821 7004 5500 5771 -1001 -10457 -8874 -10774
16762 -10774 -19263 -26298 -26231 -4565 3151 -4105 3117 3059 -4914 -4093 3545 5036 1120 -5799 -13842
16747 -13842 -8332 4302 12605 -1374 -6922 -12087 -11651 -1487 9270 11692 7538 14375 16871 6872
16733 6872 4740 -5902 4605 17386 17343 7318 11299 17070 9420 8857 12496 16095 10951 5910
16719 5910 -901 498 6180 6943 676 -12914 -17380 -13256 -13431 -15640 -10622 413 317 -2911 -4345
16704 -4345 9797 14685 14441 6406 6220 -2665 514 7045 12056 19989 20591 17495 23715 17964 9407
16689 9407 4132 13893 20354 7746 -491 7382 1033 3583 18660 17403 17704 27819 23115 17696
16675 17696 8422 6843 533 -2131 2607 16030 15512 2494 483 5056 7542 12377 7824 7109
16661 7109 11113 -1859 2337 8726 3646 -4932 -13359 -14263 -2178 4805 1178 1310 8338 7550 1807
16646 1807 3062 -346 -1026 -5808 -8980 3117 8905 5531 3041 2809 97 10674 12836 4975 1686
16631 1686 12867 18069 10100 21182 26863 24586 21739 31234 40889 37786 29614 30222 23980 15356
16617 15356 16183 13225 15244 28920 29596 10532 12303 19656 19912 5412 -1763 -229 -5833 -15569
16603 -15569 -13473 -14489 -10955 4950 11514 1929 176 2074 1672 1683 -5838 -6254 4613 17779 17703
16588 17703 19669 14947 1195 -3766 9997 20273 24043 17254 8834 16350 18523 8099 14958
16575 14958 22220 24918 33579 36782 31415 26330 24138 23508 17922 21095 29908 33406 32376 30502 20177
16560 20177 13266 18306 25302 23416 10746 2214 5724 -1220 330 6816 20193 19793 27224 24645
16546 24645 16006 14018 14807 20685 19106 13731 18127 28199 45475 46971 32634 15014 8012 23498
16532 23498 21620 9653 18403 30437 34078 28624 30054 27456 32935 40834 45109 46384 42272 32095
16518 32095 12787 5427 13856 8961 7255 12315 11166 17918 32236 44146 43362 33538 40570 44883
16504 44883 29709 13991 4827 8437 862 11050 36441 36290 29813 19266 29533 26334 24613
16491 24613 13229 25810 43651 38999 29407 35971 40664 42116 34458 29778 30432 35514 38092 47929
16477 47929 51550 49026 47462 38392 46015 38025 31640 22420 31963 51709 64403 59890 51202 48212
16463 48212 49903 48410 50369 53360 53766 48137 44274 41629 46787 49027 48761 47891 39822 51767 54467
16448 54467 53758 54429 54211 39609 41520 52936 49710 35699 22898 26959 27587 33459 55097 61539
16434 61539 60246 53006 32287 17670 18088 28765 48363 60429 66923 68203 55968 51038 54667
16421 54667 59383 56030 51239 42850 56603 68658 76255 73411 68994 69367 62766 62619 67415 65159
16407 65159 68828 61810 60211 64385 60434 66781 74638 74042 67730 45541 28012 37386 37078 43386
16393 43386 42876 40948 47081 50577 60121 55912 50377 48949 51181 46832 45153 47460 49123 48169 50760
16378 50760 55112 59067 56685 56210 52771 49489 35791 38084 49520 34617 30639 37378 51966 62362
16364 62362 54318 56865 63594 64714 65710 76272 63226 54216 54751 56143 55229 53155 52880 53488 43282
16349 43282 39056 35594 36443 38424 39549 44638 51834 50463 50684 55555 54409 59199 57615 51056 48112
16334 48112 51231 74599 80376 66722 62368 62994 58284 47868 57801 60441 55024 52174 59341 58327
16320 58327 62435 59351 51427 62255 68702 66037 56354 55584 59001 59309 62188 75214 73835 62188
16306 62188 47833 43560 51567 56916 54839 63552 71970 67986 64568 57593 49649 46132 56801 57602
16292 57602 52143 46211 53891 52426 40726 44186 57103 71815 71699 66548 67310 58352 57771 42568
16278 42568 33607 40877 44104 44762 40153 39242 51785 55221 45156 43136 46081 45484 47249 54495 56032
16263 56032 63052 55400 47716 41871 29196 29687 48555 58275 57097 45097 41003 39863 39158 43108
16249 43108 36865 33127 39262 34523 26222 35359 45705 39110 33554 32015 38563 43686 32422 30387
16235 30387 25718 26428 39876 42765 40179 39058 42729 37415 34771 41235 47902 37328 34334 37881
16221 37881 45076 48518 43718 42150 33963 27296 24298 20243 22916 30714 32593 49962 39213 22227
16207 22227 20285 23854 14690 18406 23699 47263 46129 35761 38065 39642 37010 30010 32895 31244
16193 31244 29919 35053 31508 31418 42287 47330 47888 47387 42210 37233 41861 30286 27386 24114 28159
16178 28159 34960 39298 36275 17553 22596 36927 28633 25964 34072 31794 33537 26857 36880 33311
16164 33311 27571 26202 10107 -552 8688 8332 5039 1266 12159 18244 18069 16860 15045 18403
16150 18403 16204 9752 6684 5692 12313 32130 41983 37700 35662 28574 28148 22686 12422 8692
16136 8692 22990 34956 29522 18299 23177 23832 20723 32940 43647 49155 48350 48958 43078 24338
16122 24338 6775 19324 24340 16653 20327 24257 29977 32494 23290 14373 14019 25380 23916 26459
16108 26459 30986 35229 20778 19018 12864 4191 2911 11877 22737 31911 37115 32380 18217 20228
16094 20228 28543 32885 29231 35772 30393 36045 30603 22823 16996 12187 -785 2897 4949 11256
16080 11256 17352 16940 19492 25880 32350 26575 18555 19716 33243 37228 34126 35442 34842 36799 35800
16065 35800 48479 45210 44933 45733 46903 40473 55687 60997 44231 21969 21779 25089 15486 16265
16051 16265 26554 40126 40774 18806 15231 11448 429 -2256 6682 5698 988 15143 34470
16038 34470 34285 33060 6613 991 2885 13184 22361 22140 18302 17271 21178 23943 14692 7983
16024 7983 12821 14980 11301 7033 10301 8716 16620 33384 41025 38655 31956 28991 28860 32929 43597
16009 43597 33382 20044 10637 14226 18532 15289 6922 21267 23516 26708 22632 27063 32075 24019
15995 24019 10978 15356 27322 25959 24428 18786 23419 22952 28115 26217 25298 26508 28683 19727
15981 19727 7839 -12942 -14941 -7716 1736 3921 7120 8507 18046 26162 34548 28487 22743 22434
15967 22434 31754 46206 37700 26914 28203 22866 18016 24790 29147 32029 25701 23534 10581 12763
15953 12763 2993 11580 29767 24714 24896 32825 30180 26187 35079 21577 10211 -47 2568 15499
15939 15499 19723 27020 37989 35055 32464 38655 41462 40097 27165 29710 35492 40423 44494 42831
15925 42831 30594 27553 36215 48121 46342 31402 24503 30821 31636 21331 17290 20297 17665 9976
15911 9976 -2083 -14827 955 10775 903 582 15389 23443 19020 23873 21500 16080 11082 14924
15897 14924 8129 -1100 12352 17127 -5987 -11144 -17024 -11904 -8852 -491 7956 10954 7993 6879
15883 6879 13188 15679 14584 11785 10269 12387 19522 23437 4386 141 -1246 7099 12753 17731
15869 17731 22637 11677 973 1644 5920 19694 13988 19406 26986 32034 36917 15856 7447 2506
15855 2506 -3364 10593 32397 31285 24802 15529 47 15774 23896 32669 31687 22243 16738 27770
15841 27770 38203 33724 37787 46288 50650 44236 35095 39420 34901 39124 40298 36359 21947 22114
15827 22114 24656 36957 37459 38748 23830 18814 16691 5985 8155 15591 20313 29501 27056 24949
15813 24949 25479 19333 12153 18831 24453 31198 32868 33633 38722 61087 65945 51320 42018 42352 38088
15798 38088 35822 20288 27991 43044 40341 49157 66378 59269 47219 40539 41781 30387 32378
15785 32378 44564 46905 28535 3346 -215 12630 31328 36852 37504 43549 48061 43624 31552
15772 31552 14196 19280 29511 21668 26724 28494 25313 23166 17618 16627 10717 18083 20068 27105
15758 27105 35744 33561 37916 44021 46929 48528 48740 51793 37501 23557 13782 15934 23619 29732
15744 29732 39093 41170 38573 35336 33161 34262 32132 27773 34931 32725 39766 33735 36257 33436
15730 33436 45698 45151 26423 32305 41006 40766 45711 46266 54923 52997 47349 47442 39028 32518 21764
15715 21764 35228 44528 50804 48548 41081 38640 37226 29235 32580 32360 31339 34385 33361 34568
15701 34568 36522 40474 43999 50000 41268 32335 36861 46876 42274 50274 56305 46685 40968 47531
15687 47531 55283 56892 54537 50237 35804 29233 23186 30045 29878 34911 37062 37129 36296 21903 34788
15672 34788 58575 69082 54182 44812 57741 77595 80345 77213 54069 48435 60314 61011 37418
15659 37418 28597 22978 23001 21411 31665 31493 27592 24802 29061 37900 45828 48577 54117 60739 64122
15644 64122 61716 53024 55582 44561 31081 31243 39831 42380 51170 43656 29699 14951 36043
15631 36043 42929 32431 37606 36225 46599 58060 61008 64312 71608 67063 53971 49018 56805
15618 56805 63324 61827 58805 46264 32381 47188 65882 59138 49861 38146 46746 68005 66064
15605 66064 61542 64134 61223 49208 56498 61041 55629 55140 45513 45444 63151 53031 46130 47735
15591 47735 59268 65799 64866 67529 66086 60098 51444 62746 66877 64326 58462 66982 56069 49749
15577 49749 47192 43555 54551 64216 53987 62611 60874 50872 47450 45580 47606 50064 54185 54223
15563 54223 43402 38370 35644 42724 40126 34334 32696 42409 50418 68448 77674 61239 45456
15550 45456 48073 49938 49372 64957 66306 53004 44904 30938 36834 47961 54465 59914 54545 49254
15536 49254 53953 49964 42710 49294 48471 46325 45211 41738 45713 57903 63351 57533 54207 52158
15522 52158 59437 57862 57136 61123 66357 65777 55670 56599 62727 57669 51702 48460 51526 63453 68201
15507 68201 71661 56423 46472 49307 47253 45717 37873 34482 39910 43433 41183 50468 40694 30869
15493 30869 36367 33142 34868 45166 46862 49904 56655 57633 58390 59073 51391 51245 67065 55951 42424
15478 42424 53703 52908 54349 55395 46344 42663 43522 39649 31371 30203 37438 42618 34777 33806 35057
15463 35057 39222 53238 54416 38506 32652 32322 34996 36832 38363 31611 29591 33096 15048 17167
15449 17167 28786 45613 39777 32377 39191 27676 16330 17922 27336 20855 21043 35115 42479
15436 42479 27353 19404 19898 14036 17650 28058 23661 26705 36192 36784 25488 29981 30392 28878
15422 28878 29524 27451 29696 20335 21003 21823 11729 4081 8831 13187 14482 6688 7580 19761 20158
15407 20158 14731 17729 21325 14749 20641 34662 30882 29170 26250 32578 39177 39140 38890 26739 5823
15392 5823 7237 9001 19476 26387 25669 22474 12074 14148 11822 8709 10388 20895 19066 23491
15378 23491 24896 26594 28618 13210 15184 23742 25108 23460 22701 21975 22163 26759 31498 23704 24936
15363 24936 30503 27386 33808 31924 29238 36211 47878 52803 49083 30833 24797 23906 16705 5301
15349 5301 2038 -395 16214 13091 5168 13879 15134 16066 28471 27722 19600 12956 8915 10483 11208
15334 11208 10076 5346 2959 6740 6044 12871 20412 6072 10418 13157 19966 17843 9094 4472
15320 4472 12718 9642 5484 5716 6440 13035 14005 8771 2862 11460 8149 5991 15436 13433 9692
15305 9692 12862 12993 5088 5296 -8048 2723 6803 8340 11027 17345 20408 11074 1827 1609 5174
15290 5174 532 -508 -4545 872 9500 6891 1771 4479 11657 14265 6323 -3174 -10676 -11054 -19189
15275 -19189 -9492 6186 7050 9270 19812 17506 10109 -1265 5161 9140 24229 24653 28642 23990
15261 23990 8947 7423 3445 -488 -142 2189 2432 11951 7016 13221 24930 15427 10575 11694
15247 11694 8460 3422 9886 2857 5384 11363 2586 7835 9793 15684 6176 506 -4434 -3851 -6897
15232 -6897 -9793 -3608 -8181 -13164 -14934 -709 5982 -2004 -14084 -5126 2474 3507 1558 -5295
15218 -5295 -2795 -582 3675 14499 26922 27917 18628 20282 22638 22696 13272 2864 -16480 -29376
15204 -29376 -14468 -7783 -20906 -35715 -26075 -18515 -9573 -1334 12457 20789 17515 8361 9762
15191 9762 416 -11692 -16815 -10033 8641 10414 11053 8678 -983 -15033 -16540 -20437 -14950 -3939
15177 -3939 -10778 -16541 -13129 -11056 -22498 -14844 252 17616 20739 23780 21512 28903 36688 27220
15163 27220 10020 -443 -1574 10376 7892 9443 15822 19423 7726 -1497 -1030 -6239 -6787 847
15149 847 8214 9455 7583 -3523 -18297 -18086 -13616 -5963 -4639 -14496 -9121 -8033 4210 -2210
15135 -2210 -6903 -6953 -7774 -4333 -10539 -7918 -10418 -19583 -5260 3677 6545 4531 2576 5977 7794
15120 7794 1415 1505 16976 16624 14269 19540 19238 10880 -1552 -12923 -13030 -7522 3426 4767 -1497
15105 -1497 42 -19542 -32665 -21026 -9090 1173 4706 10989 26414 21686 16325 2288 -14489
15092 -14489 -27447 -13955 -2607 -2313 -5487 -16174 -17845 -10933 -6836 -11313 -6255 2255 1879 -4600
15078 -4600 -200 -4198 -5617 -6646 -17400 -21974 -3883 6614 -14062 -14380 -2008 1061 10340 5633
15064 5633 565 9992 26477 17979 20120 5931 -2083 -3133 3105 5041 -2637 -7635 934 2703
15050 2703 -4354 -10813 -2721 13484 10854 6337 9903 -6276 -7719 -13605 -32529 -31321 -20728 -14035
15036 -14035 -6912 -2396 -9691 -24125 -14922 -1408 9141 -613 -13791 -17439 -17585 -16761 -15220 -17484
15022 -17484 -2902 5629 7244 2696 6042 585 2357 15533 19155 21092 27696 17406 7661 2828
15008 2828 7186 27638 30006 22602 15636 18921 26174 23908 8864 -18548 -8884 -32 3437 2504
14994 2504 6793 -1213 -6533 -13970 -15019 -14474 -6037 10034 18382 13108 12920 10108 6757 13870 5679
14979 5679 -6658 -13049 -4644 -6921 315 17497 15205 8377 -524 1802 9636 5085 -1644 -5025
14965 -5025 -6137 -4110 -9643 -8725 -3886 -3384 -17243 -25139 -14707 -15271 -12847 -18009 -11102 -2270 -5769
14950 -5769 -14674 -15804 -10695 -10564 4835 14024 6357 385 9631 10259 10227 14252 8938 16620 11173
14935 11173 10672 7203 -7311 -26046 -27682 -23272 -415 3807 6140 -2762 2990 18514 18906 16630
14921 16630 19615 15208 13491 12759 22674 32262 16678 -1652 4560 4863 -3430 -8940 -14831 -1119
14907 -1119 -1358 -11436 -6665 2149 2088 -13056 -18624 -18188 -10460 -17556 -26626 -28718 -29137 -17654 -5191
14892 -5191 -16225 -14496 -12174 -7306 -6441 -3911 -7708 -14047 -9174 -8959 -1544 4978 -1175 -1262 -7309
14877 -7309 -2715 -6017 -8599 -11519 -26670 -33532 -29286 -21158 -24286 -18985 -2106 2376 857 -4248
14863 -4248 -417 -1969 -4333 -4045 5195 11561 9877 10347 1857 3498 9755 6109 1782 -5183 -7632
14848 -7632 -2799 10605 17181 10765 -11802 -17885 -11797 -11905 -713 -3372 -2618 462 5471 8353
14834 8353 12528 10240 16204 19081 2814 -9121 -12456 -10783 -16474 -2687 -1082 -3419 4675 900
14820 900 -6857 -13501 -19170 -24495 -24363 -23695 -18548 -22101 -29494 -22325 -8328 1635 -2693 4160 1626
14805 1626 -13750 -22590 -17902 -600 12938 8953 -8764 -11902 -6186 -4241 -4239 -10222 -1672 -5221
14791 -5221 -7634 -1895 -603 6669 94 -1785 -12693 -12326 -2746 263 2105 4286 4736 3137 -5418
14776 -5418 -1221 8346 -1379 -7330 11747 19860 18929 13183 -1446 -10926 629 -5788 -75 6420
14762 6420 4912 -7581 -9035 -2348 -1490 -3045 -3510 583 -2715 -7898 722 -6460 -1591 2439 8432
14747 8432 15380 11052 1694 6156 19164 13828 -89 -3577 -10382 -12881 -18646 -11069 -479 -3630
14733 -3630 -4952 9038 8745 7138 8396 21045 17797 18904 20094 17646 10460 4051 1543 2216 4105
14718 4105 11634 7425 6605 9228 8280 16349 1022 -5062 429 -5393 -17694 -12636 -1514 -4097
14704 -4097 -15652 -11432 -7026 -10058 10864 16108 7110 3430 -7551 -12498 -7206 -12842 -13517 -9230
14690 -9230 -6110 -6468 -13238 -30228 -32847 -32349 -27325 -26915 -22357 -22893 -12737 -12843 -11720 -11342 -17867 -16796
14674 -16796 -15697 -8065 -1791 855 -1013 -882 6872 4746 213 642 6678 -5929 -7551 -7764 -6091
14659 -6091 -3055 -5420 -10178 -2685 -3432 -7080 2486 14637 28844 42033 30895 9275 768 -2549
14645 -2549 4771 12433 11822 5920 2289 11993 5854 7406 -6515 -8645 8700 26322 24486 8524
14631 8524 2168 -3874 2726 3393 -6125 -10420 -18713 -10523 -9403 -12731 -10327 -8735 2481 15543
14617 15543 16271 14703 5132 887 -6437 -4584 -5399 -12586 -10054 2144 14122 12942 -1624 2496
14603 2496 -7821 -19350 -20475 -19847 -6786 10251 25309 25290 15835 16408 5897 9947 15185 15853
14589 15853 10860 4051 7849 12216 17640 18283 20053 36460 29032 20320 25213 20297 13199 10807
14575 10807 7155 6391 2430 -8234 -9915 -4281 -3461 1398 4574 8813 11614 9402 22820 35906
14561 35906 55012 71159 77338 101050 146504 195246 254530 319292 372291 406948 419787 395473
14549 395473 347074 279694 223906 180834 144250 109502 72638 46930 31144 24452 26711 22145
14537 22145 7447 11204 5226 -3655 8081 13918 11262 15206 22785 14588 2488 -21 11816
14524 11816 19213 22222 7790 7936 14719 11412 14072 -222 -10173 -9867 -6769 -10335 -12059 -4084
14510 -4084 -8839 -10490 -5899 -3051 2621 -3246 -15060 -13608 -6072 -5511 -10895 -13428 -22201 -17262 -27664
14495 -27664 -23876 -13204 -7009 -6809 -6768 -2305 -1934 -6920 -13696 -9842 -17204 -18537 -16387 -8822 6345
14480 6345 3480 -625 -11880 -13859 -16111 -20950 -21627 -15199 -8570 -11321 -9616 -569 -296 -2677 -78
14465 -78 2087 5476 -2109 -1063 14397 15253 10207 5453 7119 13746 12768 -1038 -7308 -21822 -20828
14450 -20828 -7072 -3557 -10840 -19734 -21298 -14975 -10571 -10209 -9560 -7084 -483 188 -588 -8397 -12956
14435 -12956 -11245 -6681 -2737 -1542 -12063 -26061 -22739 -6231 3228 9362 14878 9920 1224 -11461
14421 -11461 -10007 -2750 4434 6941 -1343 -5031 -2318 -5543 -2778 724 8799 8024 2883 6309 5161
14406 5161 8414 9099 10028 5756 -9017 -11724 -13281 -20400 -13179 -11605 -19822 -16027 -13685 -10750 -11863
14391 -11863 -17937 -6348 -4677 896 -3809 -2888 -14820 -18066 -14747 -20727 -6028 -910 -8564 -9823
14377 -9823 -6703 -8879 -12969 -11850 -1302 1206 2557 2596 6733 375 -14189 -15303 -7730 1286 11446
14362 11446 2293 -2286 15411 6397 -3934 -16674 -10869 6510 5675 -5268 -4700 472 -558 10996
14348 10996 19016 8172 1544 -4759 9082 8348 -392 -2911 -4169 -963 2784 1887 1311 11533
14334 11533 7331 9322 97 -3753 -10702 -8998 -10766 5388 7140 8200 15771 13744 6859 4784
14320 4784 -780 4016 7593 943 -2193 -7044 -10588 -5985 -5129 -993 4096 113 -676 -5051 -13888
14305 -13888 -19130 -9873 -11103 -17476 -11428 -7455 -8363 -15801 -19191 -25226 -29923 -24604 -16107 -22301 -12004
14290 -12004 -11570 -18422 -18298 2526 14594 3050 -3575 -4490 -17888 -18942 -5113 -2916 8403 13699
14276 13699 21984 33898 41050 30127 21048 14010 16793 25743 5369 -4959 -6117 9182 13212
14263 13212 15106 20710 21915 13799 16798 12088 -8567 -11905 -1417 -6757 -2130 10607 21144
14250 21144 21794 17721 14513 19250 19006 22572 26185 26000 21738 22927 33065 19573 1616 -473
14236 -473 5742 -4781 -9949 5549 14949 21115 11623 5762 2783 -3820 -5472 1651 2537 -1442 4886
14221 4886 12722 11549 129 -5783 118 -703 -4267 -8194 5306 3800 -15760 -19988 -19532 -10330
14207 -10330 -12256 -5810 -2570 -4415 -10721 -15057 -28190 -15722 -5778 -1957 -9979 -12133 -15788 -23576
14193 -23576 -19729 -6449 -3361 -12916 -7888 -12619 -21722 -15109 -2295 -544 -9402 -9710 -11106 -25851
14179 -25851 -24910 -18637 -1682 144 -16133 -21835 -18335 -22627 -18592 -19405 -21148 -17685 -7335 -3725
14165 -3725 -1446 2474 5518 3539 8851 -1752 -5398 -13 -22982 -32051 -19531 -5945 -12547 -5798
14151 -5798 -4656 -12049 -18518 -26854 -25433 -17692 -3722 9286 11125 10002 9678 8735 14498 4187
14137 4187 -3602 -1629 2589 1932 -2850 -10979 1430 -2029 5997 16942 6538 -4371 -7097 -859
14123 -859 10293 12608 7552 -5653 -19430 -12790 -13149 -817 -5022 -8097 -4766 -200 1983 -488
14109 -488 1958 9364 8698 2177 6128 882 -1633 -5617 -11655 -12377 -14157 -2658 -2776 -10588 -15502
14094 -15502 -16408 -13145 -14213 -13189 -28920 -37161 -21017 -7926 -4989 -9187 -13469 -19700 -29656 -35843
14080 -35843 -29966 -21059 -10029 5646 3487 -11541 -11562 -16730 -10153 -2156 -189 4325 12319 3130
14066 3130 -4574 1128 5480 -2251 -5954 -3837 -7772 -16903 1478 -688 -11212 -10398 -7136 -1943
14052 -1943 22108 18822 3713 -4287 -188 7784 13426 1283 4248 9353 2017 -8321 -8053 4973
14038 4973 8301 20100 24617 19216 -3463 -12063 -2502 -6826 -19154 -12384 -5917 -6407 -3842 -4385
14024 -4385 -8914 -16559 -22213 -13088 -6273 -19500 -18539 -8463 -2946 12274 8385 -382 5428 9135
14010 9135 1315 -6243 -6563 8308 6493 5748 16090 12318 2686 3837 170 -2637 3273 16404
13996 16404 11487 -1676 -2747 1259 -795 1366 -8546 -13055 -8676 -4545 -6592 -4355 -15914 -33119
13982 -33119 -26356 -15786 -9995 -10581 2953 5294 1118 2440 13460 11707 -644 -10430 -11063 -7800
13968 -7800 -25107 -22346 -21161 -31639 -22010 -13746 -11775 -5117 -4198 -4545 -11702 -14620 8662 15761
13954 15761 8071 12759 13301 5374 -14115 -18262 -5938 -975 -4620 -8369 -8197 -14300 -10563 -10731 -10837
13939 -10837 -2756 6289 3327 -8588 -8424 -17170 -22296 -20438 -18860 -22045 -17569 -4781 4405 -898
13925 -898 -12698 -13549 -8657 -6791 -3464 1250 -552 -3469 -14143 -20470 -25190 -15443 1143 8331
13911 8331 -2040 6115 15487 16327 -8226 -4963 6118 -158 -7436 4094 6961 -280 -857 -2651
13897 -2651 -699 11687 24666 11969 1275 9971 19671 27922 35042 55951 68757 78181 83715
13884 83715 88389 109645 125139 129295 134073 129849 139957 137082 130760 123657 104860 80051 66228
13871 66228 67086 67307 64772 49018 34440 36869 42162 42663 30234 16811 26496 34583 24881 1298
13857 1298 -3838 75 5810 3320 7483 -3319 -17088 -4447 7544 23095 32359 28757 35524
13844 35524 43672 48796 54949 61950 63464 65419 71974 77259 96426 111963 131547 133739 124643 126150
13830 126150 137244 132939 122238 100460 77992 80582 84701 95339 105770 106502 129319 175803
13818 175803 230294 316376 422319 543514 647024 707853 728114 674717 568742 454737
13808 454737 340732 247151 175919 122719 95158 71482 59902 67422 60983 53676 57013 49292
13796 49292 36447 43781 46952 37648 37588 28565 28586 37771 29711 27183 35104 17615 18716 26557 29650
13781 29650 21526 25322 28541 19760 2658 -7222 -6544 5538 11016 11403 6522 9212 -612 -15330
13767 -15330 -15531 -13620 -10645 -17033 -17980 -10578 -2509 3169 11963 10834 10910 11064 10677 15664 19488 14653
13751 14653 5545 8658 12305 13462 10112 5526 4743 6803 3581 -7633 -14710 -17353 -6736 4
13737 4 -4292 -1418 4523 8698 9082 -10257 -4133 14364 9710 -5561 -13264 -12667 2158 -10801 -8689
13722 -8689 -3376 -3916 1250 -13512 -22277 -10452 1299 3693 -2036 -13610 -18399 -20413 -13146 1340
13708 1340 -640 -8636 -13044 -14256 -11549 -16590 -13921 -7077 -16088 -23348 -22469 -15400 -6711 62 -2222
13693 -2222 -5702 3382 -4457 3904 11840 5888 10489 13548 21504 4476 -9496 135 1026 -4562
13679 -4562 1176 10208 10236 8668 11274 3692 -9664 -7547 -14496 -13186 -16494 -11412 -1039 5182 -493
13664 -493 5602 -5164 -2809 -254 1971 9503 17330 24089 19704 8384 -3046 -7791 -4131 -9335
13650 -9335 -14049 -15056 -9253 -9721 -15615 -12153 -374 -4261 -12406 -13090 -13212 -9392 -5842 -1220 -7642
13635 -7642 1288 9580 7706 3802 -8776 -16746 -13154 -4231 -5065 -2108 2489 6056 5177 1032 -5049
13620 -5049 -9109 -3181 -9136 -229 907 5027 3419 167 8056 656 -10200 -4542 -2576 -3536 -6516
13605 -6516 -17543 -14391 -2921 109 2030 564 -3514 5923 3644 233 -8191 -9363 -2673 -1583
13591 -1583 -3653 -1790 5582 5326 -14676 -15416 -10981 -15129 -13991 -22600 -20290 -10039 5509 384
13577 384 -3709 -2134 -1003 4780 -5565 -26131 -25519 -29438 -12977 -7735 -8814 -9898 -5001 12700
13563 12700 21610 13090 5826 12024 9254 -4983 -419 1324 1170 -284 2048 13892 -301 7594
13549 7594 10264 5653 11662 29008 53374 83890 115116 124442 128490 139219 148869 165482 160254
13536 160254 142613 112164 81975 57217 44505 33470 14087 5395 13770 16316 7290 2032
13524 2032 -3001 -4355 15191 23470 9144 -7017 -18736 -17226 -431 -778 6171 18936 15252
13511 15252 8501 10246 9908 6251 3726 4288 -4205 -16098 -5016 4383 4325 4799 9910 21497 22367
13496 22367 23130 19407 16158 8669 -1192 -8599 -9319 -795 3029 -3916 -10931 -18846 -14717 -14279 -24570
13481 -24570 -21303 -8846 -11371 -11874 -10945 -1218 12012 -384 -14975 -8628 4004 3905 -6135 -16143
13467 -16143 -14251 -13636 -13014 -5144 4661 10049 2863 -172 -5475 -10806 -5715 -5632 -7169 -4291 -13222
13452 -13222 -12257 -15886 -17246 -7821 -1914 1308 7202 7109 16497 14757 -6578 -4246 4267 7687 3772
13437 3772 6583 19191 14408 -6393 -1209 7839 10526 9040 9069 11269 8286 -1936 -4285 -2610
13423 -2610 -6328 -21187 -29407 -29904 -18261 -12784 1523 10571 4904 -2765 -2931 3080 5549 2939
13409 2939 -12017 -12113 -18126 -12768 4376 9283 13578 14239 18334 14825 11895 16362 23024 18850 2713
13394 2713 -2567 1702 -925 3033 13543 8139 -213 -4024 -7755 -3591 12139 20603 19015 9272
13380 9272 2797 1503 9043 10707 7875 5940 -1208 -1507 1894 712 6261 12820 16019 6848 -10710
13365 -10710 -10232 744 7622 10947 10274 7472 6133 8398 1688 -2556 -6459 1015 2431 -3338 1183
13350 1183 8596 -554 -14390 -19065 -26735 -24501 -5594 3166 -5033 -6562 -10538 -2521 429 -1359
13336 -1359 -4533 53 -1807 4499 9185 12572 13044 6170 -2329 -130 2515 5199 9649 2613 -18838
13321 -18838 -30875 -21324 -3336 -6565 -8516 -2319 3677 6224 1120 -6592 -8196 -13332 -12714 -2280
13307 -2280 2730 -5952 -26953 -28242 -21902 -18985 -10938 -4573 9292 12118 13203 10899 7199 -9885
13293 -9885 -7052 -9045 -15192 -18849 -7173 -2515 -472 5018 17441 17469 18912 7915 -3005 -5970
13279 -5970 -11963 -16187 -9000 -3492 -2985 -9161 -1695 1675 8613 6861 4393 11951 12818 -614 -10848
13264 -10848 -12804 -6141 -7460 -7844 2493 4704 -426 2490 9515 9981 3509 -1644 8891 5385
13250 5385 1181 9242 4600 2106 8499 5376 10256 19676 21116 -1575 -11167 -6611 -14062 -10485
13236 -10485 6394 -2620 -19181 -22911 -9780 -11689 -6859 -9321 -5472 -8181 -9965 -22022 -31431
13223 -31431 -18775 -18930 -19102 -17400 -28010 -26265 -10492 -9589 -11853 -12038 -19205 -24954 -30511 -25250 -9932
13208 -9932 -6377 -6298 -13349 -11456 -16699 -15359 -7507 -12152 -18554 -10192 2519 4689 9191 14438 5966
13193 5966 4439 8924 11006 -3723 -2393 -13745 -9612 14205 20078 4256 -14157 -17966 -413
13180 -413 6619 -1533 252 -10028 -23533 -32148 -27119 -19506 -12526 -18960 -930 12042 -3582 -10468
13166 -10468 -24050 -21802 -19225 -18043 -14811 -10627 -15120 -18279 -18686 -31166 -29131 -23260 -8601 -9691
13152 -9691 -26680 -24641 -15405 -16354 -4948 -19 4842 11716 6361 418 -11249 -14223 -6328 -1057
13138 -1057 -5449 -13284 -10537 -9832 -13301 -15234 -12457 -11922 -1154 -14049 -24387 -11040 -4206 -5468
13124 -5468 -12474 -17263 -18235 -17520 -16826 -14188 -10492 -767 -14027 -24833 -20747 5316 14732 6094 -13809
13109 -13809 -21909 -8248 -2793 -9636 -19699 -9238 5237 3554 -9290 -8153 3540 10701 10358
13096 10358 1609 -16398 -24636 -25222 -13791 -3439 -9371 -14459 -11410 -7178 -1678 4982 5684 15369
13082 15369 11247 2974 -303 2125 4711 -3253 10640 8364 12633 18424 18410 5253 -11488 -11073
13068 -11073 -21926 -13782 -746 8030 -1555 4141 6976 195 -10376 -8905 -10918 -8311 -14042 -14177
13054 -14177 -9546 -2081 6656 3748 -7070 -13126 -13366 -17106 -15927 -3825 -3363 -5879 -9052 -8598 -7976
13039 -7976 -2105 -5182 -12467 -19473 -21365 -16422 -9518 18 7186 -1260 -10364 -10610 -11550 -9347 -12163
13024 -12163 -3845 -3225 -10305 -8646 -9080 -3475 3319 8105 9410 9117 12837 9548 7425 6607 5567
13009 5567 -9847 -11703 2743 4690 -5334 -9658 -6880 -14058 -15303 -13783 -6292 -7234 -15484 -20852
12995 -20852 -24505 -36446 -15390 -6210 -3290 3237 -3158 -11544 -16473 -18266 -11422 -6054 3284 -2405
12981 -2405 1302 2615 -889 1837 1637 -110 -3428 -6976 -6275 1779 204 -4160 -10520 -10864 -5082
12966 -5082 -1217 -2120 -6682 -15092 -18969 -20208 -20518 -11592 -18771 -23912 -1866 6023 -676 -4781 -3543
12951 -3543 -567 2781 8593 -2678 4229 6430 6346 6504 5403 9118 11602 11957 2551 -14118 -17782
12936 -17782 -24513 -27985 -26685 -17387 -12529 -11264 -9346 -12487 -11900 -12582 -13727 -11889 1130 -4531 -6845
12921 -6845 2712 1699 -6503 -11184 -18060 -28516 -20030 -10065 -2525 -10107 -21261 -19325 -16658 -17645
12907 -17645 -18841 -29002 -33129 -23290 -17900 -20391 -26030 -24333 -19506 -13141 -5219 -3937 -6080 -126
12893 -126 -765 7941 3914 436 2049 -9711 -22085 -11315 -330 -1035 -5075 -13772 -17009 -14577
12879 -14577 -9896 -10239 -7851 -7983 -5098 -15818 -17400 -14329 -8686 -13562 -17253 -14939 -1036 5991
12865 5991 -6924 -15361 -14724 -5354 -7138 10606 27064 10213 2726 1463 -923 -4190 2041 -8250
12851 -8250 -17752 -24754 -23762 -25796 -22383 -16579 -4261 11822 14961 8058 -6192 -18275 -4373 -4540
12837 -4540 -7780 -11774 -21754 -29157 -17823 -8587 -9701 -7832 -7381 2666 12926 4872 -5554 -6553
12823 -6553 -11656 1783 10330 8310 6811 -2353 -7262 -6118 -5645 -13534 -24833 -22159 -12085 -3864
12809 -3864 -7101 -9687 -814 4000 4829 706 -4831 -15422 -7687 12531 23180 14647 1366 -8472
12795 -8472 -15723 -16989 -6959 12755 11576 12412 23280 15531 -1280 -3208 -5352 -5181 -16224 -14469
12781 -14469 -17791 -19653 -25153 -15291 -9737 1767 -1820 -4990 -54 5304 16856 10441 3929 12766
12767 12766 14802 15149 9254 -7311 -22608 -27212 -31689 -33694 -27566 -20484 -14918 -17794 -17361 -17519 -9024
12752 -9024 -13521 -7119 -8684 -9390 -8460 -16770 -23436 -17211 -22605 -22126 -16191 -26801 -11103 1490 17754
12737 17754 6947 2597 4180 912 -301 2169 -7583 -15765 -19199 -4120 -5174 -5289 -6151 5427
12723 5427 5505 -4516 -12031 -11797 -10872 -19709 -27535 -20723 -6791 4991 4698 227 -675 -9523 -29900
12708 -29900 -41483 -33612 -14464 3732 7717 8293 7990 14407 13739 2317 2003 -1343 -618 -3686 -7946
12693 -7946 -3140 -2522 -16295 -15069 -11172 1411 5692 -7946 -11143 -7100 -6507 -6316 2061 8602 3986
12678 3986 5914 1412 -15925 -23056 -11275 -3330 -4959 26 6468 5544 4294 -629 5748 -87
12664 -87 -8281 -13510 1522 8560 8368 -4684 -5732 7689 -125 -4074 2054 1520 -8602 -17958 -23778
12649 -23778 -23317 -13371 3379 10936 7697 -3714 -3593 895 -5707 -6748 -14076 -8361 -226 -2253
12635 -2253 -11613 -12567 -6336 -8960 -19717 -19450 -20500 -29556 -18342 -4788 -61 -5790 -11087 -10371 -12619
12620 -12619 -6146 -2666 252 6482 12238 2358 -11847 -19044 -25399 -21683 -15532 -7358 -12933 -10964
12606 -10964 -230 2987 1096 1848 440 -5930 -2605 -3222 2282 -5646 -12957 -10759 -11842 -11325 -4085
12591 -4085 -5550 -3850 -17897 -27476 -19747 -7406 -2076 5637 5351 5604 15532 17612 11492 3507 890
12576 890 -4048 -3145 -5989 -9083 -12685 -584 -7573 -26081 -24193 -15777 -27682 -16879 -11310 -13165
12562 -13165 -11121 -12608 -13211 -11162 -15485 -23328 -22440 -28514 -30203 -24106 -27402 -23591 -2252 -9250 -28892
12547 -28892 -39957 -33967 -20157 -12480 -5982 -14010 -10200 -8966 -14512 -14778 -5228 7286 4743 6
12533 6 3637 5218 9358 -1812 -10219 -5364 -4200 -19010 -19719 -21358 -23455 -20446 -17720 -14960 -10388
12518 -10388 -7759 -2956 -98 -5318 -7986 -971 16737 10942 908 -6995 -6601 -14845 -20137 -26910
12504 -26910 -34643 -31726 -25604 -19560 -2583 824 -13527 -25846 -14772 -10195 5848 8162 -351
12491 -351 -7194 -3780 -2232 3518 -6629 -19450 -14283 -8603 -9890 -14876 -25245 -30297 -9897 -3797
12477 -3797 -8009 -6603 -5589 -1190 -10087 -5808 8705 8158 -2361 -16824 -17592 463 13468 -2713
12463 -2713 -7127 -5930 -1905 -19250 -10995 -9350 -8306 -4190 -7348 -1387 -6437 -9650 7306 14171
12449 14171 19654 12884 3668 7417 -6744 -13395 -13716 -23799 -32409 -22040 -15463 -15043 -15901 -13064
12435 -13064 -6456 9152 10371 7076 -1239 5065 8278 6771 9004 4795 4601 8550 11567 3341
12421 3341 5028 5411 4486 5016 10760 7341 -5745 -4811 6110 -1978 -1464 -909 -2072 -9159 -20629
12406 -20629 -18630 -10016 -3991 -10485 358 5317 -2267 -7401 -8097 -9939 -9804 -11363 -20028 -22831 -25506
12391 -25506 -16828 -2850 2845 4843 3817 -11374 -29782 -29665 -21619 -15743 -9207 -16912 -28513 -18289
12377 -18289 -19201 -10669 -9858 -14227 -2107 -5026 -9203 -19681 -15805 -5985 -2952 -2798 -5626 -4902 -12206
12362 -12206 -16959 -11505 -6846 1749 1612 15889 15801 3455 -2568 -5365 -1152 -5926 -3298 4411 7464
12347 7464 -5723 -13158 -6652 4942 8130 -2466 -1508 -9595 -14795 -12068 -1331 -2017 -12245 -13893
12333 -13893 -6359 1484 -1948 -15055 -12422 -10385 -5053 -10793 -10965 7725 22087 18940 11731 18445
12319 18445 7838 4558 8788 16083 10641 909 6632 -5809 -15754 -5507 -634 638 12319
12306 12319 11635 7441 -326 -19996 -15362 -682 3946 18496 34123 37778 38568 38103 18148 5383
12292 5383 14840 13351 2122 -5802 -11226 -16126 -23587 -24880 -19564 -13422 -1650 -4931 -10704 -15779
12278 -15779 -16916 -4755 4257 7430 17251 9017 -1722 -5147 -4820 2090 -10034 -20091 -26032 -25477
12264 -25477 -23065 -8207 -2619 -2443 2504 7566 10738 7612 -1735 -7778 -16742 -15517 -9095 6099
12250 6099 11073 -4802 -1563 -946 -4054 6065 7771 -10086 -13148 -10816 -6579 -4550 -2653 -9483
12236 -9483 -9005 -10860 -13546 -10129 -1793 -5423 -9721 6191 3718 -5478 -11732 -16957 -28310 -25638
12222 -25638 -27837 -18913 -8373 -3789 -3149 -912 1135 -1968 -7705 -9429 -9830 2627 -3052 -9880
12208 -9880 -3453 13850 16002 5540 5261 7789 -2464 -7073 -6003 -5985 -861 -8765 -16227 -21429 -14678
12193 -14678 -11014 -1931 -7876 -15441 -4165 -3019 1813 -6440 -6054 -7928 -6107 -9322 -4806 -7448
12179 -7448 -10932 -5541 -565 2514 3903 2687 -3206 -3465 -6310 -4889 10438 1884 -2821 -7491 -12477
12164 -12477 1782 11395 3459 447 2655 13492 12086 13943 11537 11126 7582 8151 7058 6939 6251
12149 6251 10104 -3237 -20858 -22075 -16029 -6124 -967 10698 17865 8415 -423 5581 -4378 -14729
12135 -14729 -11514 -3548 664 -10841 -24810 -24345 -10145 -6181 1854 -1178 -1090 4618 -2431 1628
12121 1628 3659 5235 1899 3960 10346 7320 8213 6792 5260 4405 -6957 -17652 -15627 -19565 -9413
12106 -9413 -4425 -7704 2348 9981 7962 -3323 -4958 -8084 -18437 -17604 -15947 -8467 -5967 -6480
12092 -6480 -7132 2118 7508 11272 8748 6962 -277 6545 9957 14840 6750 -1057 -7759 -14682 -13988
12077 -13988 -16937 -23062 -14317 12284 21926 12777 16738 20590 10573 -1281 8053 17906 15051 13641
12063 13641 21594 23007 15447 8407 13822 16808 26950 31150 42854 55583 56074 63345 112670 182041
12049 182041 270219 377742 409485 363135 276713 195756 133606 98739 70988 51727 35627
12038 35627 29344 20209 24673 31571 37534 24628 15690 10958 7541 -591 -2725 -4472 8389 23353
12024 23353 27867 21072 18298 17303 10076 9359 11494 7162 -3171 -6158 -7967 -3160 2704 -2590 -10667
12009 -10667 -2868 -2208 -11113 -17126 -9765 -8122 -19824 -16557 -5901 18 -3381 -4917 -7674 -7140
11995 -7140 -12401 -17547 -31211 -31852 -22859 -15843 1507 12386 20404 11071 -2683 -18802 -35454
11982 -35454 -33435 -33186 -22130 -15980 -17023 -12558 -7232 4274 13825 16370 -3943 -20240 -16162 -12019
11968 -12019 -21979 -9973 -9303 -5884 6380 4260 -6572 -15676 -15990 -12534 -5024 5296 12800 11602
11954 11602 14360 18271 16112 6658 -1923 9315 18298 20938 19632 9466 -3608 -9174 839
11941 839 5379 -3586 -3699 6084 9665 10670 4874 2511 2287 -9939 -12703 -1705 2878 8646 13932
11926 13932 17344 8019 2116 -4045 -7654 -14904 -15684 -19273 -14816 -11201 -5925 3136 9677 3092 -1578
11911 -1578 4989 11913 19873 15994 11689 22001 21302 21911 14434 3795 1668 -1717 9968 10244 7561
11896 7561 -1629 -8488 -9614 -66 4494 4590 -857 -4184 -5119 -1305 -6628 -6906 -5667 -2047 -3473 -5374
11880 -5374 2278 4520 -5235 -10122 -1257 4518 5854 11363 5735 3781 -4494 -13880 -17873 -11000 -9522
11865 -9522 -2390 9293 10605 13932 19823 5087 10066 15396 -320 -9120 -19035 -16292 -8079 9300
11851 9300 15737 15033 7982 -3982 -11988 -14227 990 13416 1997 -7072 -15032 -6537 3211 19035
11837 19035 22680 13901 13596 11817 3161 -2197 -258 4071 70 -6618 -11900 -1728 8416 6241
11823 6241 9136 677 -3086 16945 24683 30664 13357 3230 2045 -3175 -2553 -3073 -5098 -1587
11809 -1587 -14229 -11265 14466 13369 11022 12714 2635 8208 18544 10961 6301 6740 2543 -6529
11795 -6529 -1692 -754 -2265 2327 -9443 -9423 -2436 -2169 -14806 -14853 -18035 -8725 1031 7793 -926 -8329
11779 -8329 -12071 -17097 -10076 -7345 -7363 -15380 -12630 -3461 4263 14005 17591 16307 8514 -4094 -7817
11764 -7817 -15834 -20494 -11992 -5751 -2728 -15026 -16869 -5072 -956 -13694 -34916 -38119 -19023
11751 -19023 -671 -5788 -7870 -3272 -1737 -1080 -4507 -544 -13468 -14601 -7645 14767 15395 14209
11737 14209 17411 18060 14156 3553 6617 5962 14607 19552 15209 8763 4681 2488 409 -4103 -18134
11722 -18134 -11137 -2997 3910 -1888 -5271 1107 26 -4695 -1491 -5380 3526 21417 41219 55981
11708 55981 68920 76776 60892 38097 32312 40909 24453 15378 19965 23352 13129 -2017 -13917
11695 -13917 -10120 -18684 -28600 -7666 -2742 -3831 -7142 -8174 -6681 5664 10986 17046 23324 10990
11681 10990 -1665 909 4183 11514 20539 25614 7311 2825 1863 4243 2977 1322 -12025 -23865
11667 -23865 -13827 -10349 -2539 1915 -5182 -2741 1585 -14637 -21706 -10622 -5883 -5595 -1681 5571
11653 5571 11102 11898 8755 -705 -4323 -6192 4928 11996 11492 15874 16687 9432 108 2380 11541
11638 11541 7119 -8322 -9869 1178 -6035 -6400 615 -3856 -18541 -13706 -3135 -5264 -8430 -13407
11624 -13407 253 3335 3239 -6371 -7158 -1960 5507 3593 272 9971 15812 16711 8109 11772 17701
11609 17701 24082 28085 22322 9841 6877 -2093 -4308 -3846 1802 16904 30147 46912 55863 49685
11595 49685 39881 40332 46470 33394 21486 4537 -2436 12240 13514 -7395 -6756 -1535 416 14852
11581 14852 3523 -2778 5918 5809 -9488 -6662 -10633 -5236 2016 10195 6581 -90 1968 12249
11567 12249 18899 16813 15059 14182 11624 2706 1509 15323 16584 24499 33919 26450 26879 14997
11553 14997 8404 739 -2893 13939 11682 -4567 -8622 -147 5996 6077 10124 15143 12183 -602
11539 -602 158 789 5473 3500 -2832 -7681 431 7474 13909 23873 26696 31433 27981 26940 17225
11524 17225 3518 -3106 -185 12379 20383 16712 8112 17895 23538 12004 5928 7306 4103 -1786
11510 -1786 5053 19711 25275 9496 8416 15055 5604 2647 2116 -1647 -3353 2267 12419 11189
11496 11189 18908 13843 8936 231 6639 1472 -3139 12819 48 -2145 1193 7466 6798 -7177
11482 -7177 -11365 -4204 -382 310 1996 17582 27301 34582 42012 38907 40335 35894 22271 5092
11468 5092 12706 18758 29439 30462 21337 12851 13984 13271 15493 6727 3053 -8201 -10885 -3594
11454 -3594 710 11877 24418 15510 3 -902 2845 9065 7581 -313 -3306 -14501 -16730 -23177
11440 -23177 -21457 -13653 -3960 617 583 2980 10688 5006 -4169 1052 3316 4050 5427 3209 8221
11425 8221 9995 3880 4338 10361 13234 6104 2270 1625 6207 8746 18420 18766 19520 32871 37430
11410 37430 42017 40837 26580 22553 18792 20136 25077 24933 9286 3817 6035 25955 25952 9309
11396 9309 6245 3507 1069 2135 3171 23742 23843 24988 19675 8937 12265 29860 20245 15259
11382 15259 17591 26113 26600 18437 8252 8287 18089 18748 21351 29569 27898 12797 10334 4601 4065
11367 4065 -202 11048 23127 28199 30190 24901 10986 5151 25535 35678 34649 32366 27699
11354 27699 13189 16337 20222 26321 28866 26025 28369 21171 7944 5908 11624 23354 36626
11341 36626 47505 52290 48882 53309 69332 79749 79436 67518 71420 76102 84646 81668 81575 80031
11327 80031 85662 95701 113294 116186 134232 143390 171022 207339 257274 323627 417333 572154
11315 572154 846742 1278132 1769905 1988141 1806604 1401611 988162 690784 512038 415039
11305 415039 348823 302072 270077 248466 240242 244562 250004 245666 244506 241539 257188 270129 293328
11292 293328 340508 388335 442958 491334 564950 663492 779863 908336 1065274 1302490 1653180
11281 1653180 2229229 3203724 4764763 6840501 8928303 10375773 10876058 10308259 8765431
11272 8765431 6707923 4777170 3339620 2395406 1807897 1418675 1151531 971901 853288
11263 853288 768406 700049 616642 546833 478593 409317 357469 317700 306802 295185 274306
11252 274306 256481 234972 209996 200297 188517 183268 167279 162617 164623 157243 162184 165808 158330
11239 158330 145636 132240 136856 136982 130757 130915 118752 110739 103147 85438 80878 92619 96349
11226 96349 90647 82078 72557 70368 70125 75601 83117 82672 73694 86342 86186 77513 67406 58334 53240
11211 53240 46357 37295 38810 59399 84594 91371 100761 94653 86104 79977 81601 64917 57674 81223
11197 81223 105006 104914 101985 97978 99166 102970 112854 121986 131193 153684 141435 127980 137067 155846
11183 155846 175268 199968 229966 251008 281636 298737 343113 394296 439764 503002 574607
11172 574607 672949 807092 986437 1214748 1558670 2124095 3063206 4506354 6359615
11163 6359615 8042479 9033351 9393786 9478749 9161665 8098160 6436589 4716792 3394535
11154 3394535 2537077 1978767 1608553 1341909 1128295 942526 792752 675702 584337 528008
11144 528008 488045 444885 400972 368606 330004 290106 266918 248212 228730 216312 201249
11133 201249 180657 169525 183256 170719 168683 168196 162988 155917 148736 134696 144995 165880 166211
11120 166211 162591 157684 140657 133668 140629 130219 114491 101154 102447 84336 66691 49928
11108 49928 47790 46924 52836 38791 24649 10884 5009 -4454 6806 22614 54774 77938 70494
11095 70494 57985 56399 55429 68130 81055 114049 133087 129774 114687 103957 109512 114149 107088
11082 107088 94448 90944 99784 107826 117771 112634 101302 98185 88843 79580 81173 81381 81775 96594
11068 96594 108564 114059 121917 132938 141868 132228 106473 104697 121536 159466 178946 175454 172585
11055 172585 164944 170646 202227 225994 230335 211586 195514 182001 168443 154146 145483 130528
11043 130528 138642 142349 144008 145658 165099 164209 174020 188702 184430 189395 188112 158102 115056
11030 115056 92972 46200 -20026 -37734 -31496 378 48713 71899 77993 78026 91777 113907
11018 113907 129089 135899 124933 117835 137806 170691 200058 219965 249991 310829 370650 423265
11006 423265 439809 426237 376930 339166 321097 304519 290198 272466 258215 237921 232056 222777
10994 222777 205870 221995 240455 250701 253780 260250 263911 280567 292272 299284 311192 314896
10982 314896 311474 313857 336959 357948 379068 394720 400380 393591 403639 403063 404171 412124 434428
10969 434428 444422 456987 472801 492030 521094 539690 564089 586241 602588 620061 647988 668619
10957 668619 691778 707156 722313 730167 729854 709400 701150 692164 692413 707119 730066 784330 848962
10944 848962 917638 1003561 1073941 1122150 1188246 1282426 1385513 1490164 1605519 1729205 1860601
10933 1860601 2012454 2194656 2399655 2613734 2862189 3156780 3524422 4027292 4708576
10924 4708576 5408461 5811803 5896634 5891936 5999778 6327674 6861471 7596829 8548921 9791242
10914 9791242 11422044 13561985 16370426 19953306 24184435 29122464 35524273 44980699
10906 44980699 60199042 85934824 130674348 204410793 296901751 355489308 341493095
10899 341493095 270322063 186555050 124292004 85869950 62572615 47843955 38132258
10892 38132258 31459960 26486928 22448074 19108961 16435747 14346897 12664685 11278391
10884 11278391 10121273 9142460 8344938 7734585 7327913 7137288 7156887 7167026 6835199
10875 6835199 6144617 5323407 4622845 4110745 3761343 3516566 3342341 3191445 3035846
10866 3035846 2879213 2732121 2595809 2464199 2324424 2184485 2039038 1893402 1783582
10857 1783582 1691926 1597245 1517028 1432932 1347161 1262163 1179479 1093309 1017180 939964 868152
10846 868152 818828 787017 751234 714151 681994 671273 662578 650542 631166 628192 625811 605372
10834 605372 576901 539797 523166 512872 506288 499600 488277 464361 432313 408261 398744 404507
10822 404507 410298 410112 408105 395732 384010 379116 369015 366947 360935 339535 329097 333016 333803
10809 333803 350987 370048 371188 357525 337073 314843 296075 278520 266679 272867 275153 265560
10797 265560 251850 240785 230352 226134 228591 237080 249722 243700 249179 268548 267508 249331 238907
10784 238907 244030 240995 243407 246317 255155 264911 290044 328047 377591 412079 405424 372032 328260
10771 328260 298229 260997 223088 195056 176776 171776 167131 157968 145964 144689 139330 133411 130556
10758 130556 128271 121435 122341 108738 105261 90905 77839 65339 67160 96277 111942 105274 80930
10745 80930 57017 49915 63653 90478 109507 116100 105002 101067 85865 80040 82412 90923 106217
10732 106217 105310 100049 100296 103302 92941 84944 83137 83872 95888 108757 126978 126869 117355 119588
10718 119588 126051 122647 130358 134311 137432 132508 125468 146648 171668 184872 204217 224497 267677
10705 267677 346672 466850 637990 790842 876029 899968 905051 917813 908537 846517 740271
10694 740271 614457 504232 415833 347019 302550 269090 235829 200993 186588 169530 143581
10683 143581 149697 170343 203986 246318 319626 439923 600969 705785 686821 572706 430607
10672 430607 312031 237952 195496 159348 152627 140942 130147 117961 103273 77797 57134
10661 57134 50758 53931 57678 45617 41717 55319 60831 55487 50073 35194 22074 28051 23262
10648 23262 18498 18340 28501 28175 22987 28263 41244 49923 32579 21654 35181 51473 54125
10635 54125 70624 78979 68025 61062 64067 62615 62160 65351 64245 54731 42040 37635 50153 58396
10621 58396 51755 47476 40727 39551 43051 36738 45112 38944 41110 61742 68579 60871 61433 62286 56585
10606 56585 56407 64777 85389 100290 100256 83682 64893 41958 17661 4483 15069 35529 54890
10593 54890 71958 82089 85974 80470 87527 68389 59304 66056 58010 43215 43383 43807 56281 68728
10579 68728 86193 98739 109035 114612 114105 114806 118892 116843 130846 149421 154084 139427 128929
10566 128929 121671 109571 92023 76353 64029 71518 69370 70952 66616 61803 56993 43049 38227
10553 38227 41162 42427 38963 20067 7132 27167 41177 32380 45739 58220 50219 34669 26350
10540 26350 39550 36720 32542 30994 23920 29879 31765 41166 52108 40238 25858 40151 47046
10527 47046 49552 63438 55962 32071 24182 22229 29859 48555 49248 43026 43358 65349 80848 75516
10513 75516 77867 71326 76190 73154 73843 88013 100626 91071 81104 84387 78840 64739 64515 68436
10499 68436 82186 96783 100126 109189 124574 143797 173246 200148 244217 310084 396201 538812
10487 538812 779060 1162725 1649951 1942016 1860897 1489651 1063034 751883 550962 422679
10477 422679 356106 323221 282701 260517 240284 232907 221580 203515 203333 213059 238471 304560
10465 304560 403520 518549 646885 773870 844134 837526 752083 635559 511776 415268 334776
10454 334776 267879 242377 243385 236433 240394 269758 309855 380446 482933 627064 859799
10443 859799 1140293 1397629 1562410 1572037 1435036 1189198 935281 703894 534703 410843
10433 410843 336026 295101 256011 220470 202718 199091 221583 254887 288103 317918 346049 374446
10421 374446 390143 383132 373510 339042 285445 245368 216735 194558 185976 177973 186020 214053
10409 214053 241415 276163 322701 387420 431258 424014 396260 349121 303913 253669 193102 161917
10397 161917 143198 120664 122837 114891 96564 87973 88677 63946 48789 54991 72402 85190 81964
10384 81964 66044 52852 48167 47843 45581 40456 37452 45766 61703 77463 76329 63766 67766
10371 67766 55786 50158 44754 35041 41354 40715 33067 29235 21020 23376 24973 30519 45636 38277
10357 38277 31617 23540 17776 12889 13367 12940 19479 26224 17891 14099 14169 13667 10613 14313 21509 35940
10341 35940 41029 33885 35347 32538 31819 31640 25184 13227 3283 5367 -2710 -9315 -2083 4616 11490
10326 11490 10058 3758 6376 16337 6863 9862 22037 28097 17526 7982 -989 -4820 -696 4290
10312 4290 5767 4732 3487 9254 2383 135 6904 7735 12729 9481 2422 -405 -2262 -3130 4988
10297 4988 1463 23090 28992 29719 25625 9461 2371 3529 14826 25423 42852 56881 49383
10284 49383 35651 19262 22169 29341 28726 32592 37970 41774 35138 37460 32572 26768 23424 18152
10270 18152 13824 16257 21703 17869 14313 24056 13999 6496 13308 15055 27343 20089 6984 10685
10256 10685 10375 7815 -2355 -4818 17131 20378 12611 11163 14955 16752 18925 18370 14973 8578
10242 8578 16287 22120 15973 10832 14731 17342 22296 23322 17063 18077 27452 26919 19346 10467 15328
10227 15328 16089 16164 16617 15944 17998 13042 14535 9403 6084 2604 -3955 -3340 608 2887 7934 12871
10211 12871 20921 26177 31479 31392 23461 31348 32157 19934 22551 28702 19724 6947 13338 17457 12885
10196 12885 9346 6961 8496 5642 11971 6125 8250 5000 2057 -2291 -2362 15596 12954 4313 17943
10181 17943 11203 9078 10013 22398 40781 38622 24183 13704 11995 12127 9765 19183 20251 16203
10167 16203 10916 4178 11470 8167 12844 18144 19814 11442 6419 3358 -7247 -2252 7900 15987
10153 15987 29063 27080 27599 38009 27426 22924 20808 19660 20723 26335 25283 20112 20231 28064
10139 28064 25019 11309 4919 9619 11287 8325 9514 398 -7623 7383 3579 695 3624 8963
10125 8963 9168 22765 3560 -13439 -877 4206 7679 16609 22588 14413 13538 5743 10483 14027
10111 14027 12221 1978 4200 11167 3686 797 6972 12307 13174 21955 27722 28891 20351 6297
10097 6297 5383 10041 12356 13323 3223 533 3741 6287 12239 11351 3563 2330 -205 1444 5097
10082 5097 18239 7208 12280 18314 13628 2686 -7057 -13034 -262 12287 16641 2662 6283
10069 6283 9280 10263 11189 16945 11952 7889 7276 12168 6413 8548 10220 -1518 -5160 -878 3496
10054 3496 10353 8832 13628 14227 20391 17891 18346 15922 4912 18650 13044 2576 10345 18111
10040 18111 9330 8249 2533 11742 9853 11866 13072 11750 8801 20783 27261 29430 30318 25458
10026 25458 17886 19520 20811 21042 34101 32519 33275 22598 14021 23122 28206 25682 30843 31715 18672
10011 18672 13970 14061 11274 5644 6383 12820 16378 23309 13637 13395 28480 22672 18298 19468 4654
9996 4654 10954 26581 33603 30631 29472 10209 8770 8797 7358 5253 5468 12682 4564 -153 7629
9981 7629 5759 6384 5220 2694 7576 8969 10108 -36 -2598 266 2668 11065 7266 -259 3318
9966 3318 11473 11235 14593 14660 7618 -6488 -11631 -3547 6629 9233 10798 10776 9311 13185 21433 41813
9950 41813 46994 40311 24503 22362 21625 22437 27408 26672 20353 19206 23855 29655 33714 50059 63646
9935 63646 73768 88754 114234 157956 237018 344459 541572 805796 958296 933388 769769
9924 769769 556650 384620 269270 192725 143009 123404 92107 83798 74194 55695 53400 47224
9912 47224 25595 15204 25240 18310 25896 21049 15758 19995 11168 8073 8043 19263 10699 -8224
9898 -8224 -3119 8238 173 2811 -1140 1405 16205 24677 25580 21864 16667 22037 24876 18048 19060
9883 19060 17951 12967 9157 21305 21561 12705 -11774 -20754 -7862 3468 4947 -1063 1069 11012
9869 11012 20151 24091 30038 28838 14342 2238 1775 -1612 -1643 11703 18372 23250 18170 15617 19925
9854 19925 14397 12640 4004 16271 22114 20961 18550 11172 12360 11789 23995 12828 10929 14688
9840 14688 9399 12224 20509 17668 5575 7280 34895 39274 22063 2987 8595 7929 -4680 -8012
9826 -8012 -11501 -11292 529 6492 9767 11939 6866 -4184 -26501 -22118 -21379 -18794 -27567 -39348
9812 -39348 -28351 -22745 -27340 -19265 5618 23595 18218 5659 6541 12363 13200 10196 7841 16878
9798 16878 16836 15558 19975 21907 33104 46234 52812 64884 85133 96080 98245 95843 71636 49038
9784 49038 28335 9423 9966 13008 22916 22422 15780 10663 3428 -397 12032 30618 19756 3691
9770 3691 -6689 -5475 6531 -4747 -8476 1355 5359 12270 24456 22979 5823 -2793 -9070 -8877
9756 -8877 -16525 -19037 -25152 -20111 -4950 -5655 301 9297 25983 29291 19389 8806 11944 19218
9742 19218 17037 23699 22324 13507 23163 16847 22580 35415 28518 20514 22860 827 -1865 -4096
9728 -4096 -739 7996 12972 95 -11199 -15077 -12382 -2204 -1015 -1338 -10957 -22647 -23325 -2975
9714 -2975 11518 -7191 -21228 -16067 -10256 -775 17152 33827 33975 19399 -2358 -2236 5490 9112
9700 9112 -129 5670 21164 19686 11315 10228 13636 25277 19786 16409 12910 8001 -821 -1593 3550
9685 3550 -6882 -17289 -16587 -7944 -4814 -5081 2230 5212 -269 7078 16897 14545 16151 6784 -9224
9670 -9224 -10440 -11115 -13201 -11345 -5816 -898 8825 18791 11335 -3854 -10706 -210 12582 19850
9656 19850 2944 1763 11064 11092 2890 4799 12836 5338 6313 14626 25232 20978 12297 7641 11817
9641 11817 8159 9764 14264 24469 24463 16746 20250 11918 15830 20492 22415 18853 20050 13260 24345
9626 24345 18850 9338 7302 -4965 -5332 -993 6874 6986 11023 9893 13936 24726 31191 26883 30399
9611 30399 19069 20265 15105 14413 8076 -7390 -1824 4289 4830 -525 -3077 2697 9162 18870 13496
9596 13496 20709 43635 56391 47192 29975 21311 13958 18980 26859 32373 19985 16039 6540 6048
9582 6048 13118 15399 18828 17064 13805 27625 29398 17341 11779 19154 30230 19959 9240 13565
9568 13565 6921 10346 4569 504 325 -3929 7232 6876 14858 10068 727 8833 9760 13032 5492
9553 5492 -8039 -7902 3041 20166 32014 37411 46938 39251 34662 33946 32798 29220 26380 13817
9539 13817 18380 31427 33747 35947 35860 37020 38303 49654 46333 32521 30226 24989 15753 35359
9525 35359 38445 39360 36329 25035 11936 7816 9595 14283 20055 27635 36464 41151 50108 41506
9511 41506 38430 37485 51764 52442 45996 55500 46978 33995 43556 46964 47764 59680 64105 60490 62830
9496 62830 53669 40261 33793 33489 41524 44546 45859 52985 54213 45376 58121 63543 77148 90337
9482 90337 83807 68520 73217 74420 65204 63027 73765 74352 77790 82391 90006 84030 87429 95220
9468 95220 107776 124335 121726 111974 98311 101452 119180 131688 135970 117599 107513 102778 112461
9455 112461 115324 114949 126516 144079 155007 139620 131274 127234 135678 147684 158056 158904 146641
9442 146641 141497 153596 178040 190502 193726 198181 188915 190865 192301 200417 210090 214073 234521
9429 234521 233822 236010 241553 239467 254563 260118 249646 250298 250360 264292 279964 299977 318913 323977
9415 323977 336484 340873 359799 362730 359579 363206 372064 375949 368168 381417 390211 397384 403694 395486
9401 395486 393176 404314 409733 420011 427706 422031 426155 430963 436831 436411 436757 433817 426790 429654
9387 429654 421662 423373 425263 412306 413318 398356 379233 381130 377942 372977 361092 344906 340492
9374 340492 348986 345841 338276 326190 316216 313666 304809 298885 296574 295759 287688 280845 274441 268412
9360 268412 257318 253336 247452 236093 233354 223778 212565 213518 215146 217424 210511 217639 210755 194643
9346 194643 184435 179511 171033 169118 178654 176200 170026 164187 176496 173260 165207 150031 139598
9333 139598 125332 128563 129333 125870 119048 119257 115235 112142 111569 112007 104553 106139 99099 101394 98113
9318 98113 101204 93012 91917 90591 93199 92420 85819 74905 76335 77569 74594 70883 69855 73699 67248
9303 67248 70777 70679 67095 56295 62561 77123 71155 65842 63494 69844 87373 85029 73810 70568
9289 70568 75038 78948 73000 66669 67698 68256 63877 61931 53399 57669 61000 49007 49982 47803 51561
9274 51561 45674 47262 54668 58065 45942 45317 50501 56086 51790 46960 42250 29467 22272 24647
9260 24647 34386 28544 35153 39063 27481 29261 33504 36321 43026 56448 50703 30958 26317 29250
9246 29250 28233 17845 13133 19365 17814 6042 1718 14562 11731 6507 13116 11252 -3230 -5399
9232 -5399 10766 13873 17670 31337 42717 46779 35005 26249 20057 11623 16238 16803 -1721 490
9218 490 13700 28006 32408 24391 24690 28878 31300 32839 25074 13282 11963 3969 -5582 44 9074
9203 9074 19094 20240 27622 35856 35411 20536 12061 16318 16313 20488 15294 8224 -3743 -6865 -10965
9188 -10965 -218 4322 -1944 -5593 8563 14205 20044 19046 14330 7185 12298 13139 18614 19382 17427
9173 17427 25541 31885 21773 11101 5157 -1169 -14949 -24764 -10421 1013 761 6141 -4991
9160 -4991 -2883 2142 2003 -1958 -36 4249 9219 7052 1613 866 -2539 -1631 -4623 -6239 -5727 715
9144 715 7104 17997 28461 23441 36586 33109 29162 26391 25462 29856 29428 29078 28821 25944 30098
9129 30098 29563 32976 22427 15525 21750 19046 23158 24469 27575 29982 23918 24135 22083 18350 17295
9114 17295 12521 13799 11226 5598 8308 7980 3611 14102 25673 25114 22979 35878 25957 13860
9100 13860 12827 7138 8761 8951 -389 6588 9414 5085 1165 -2245 -4277 5387 4121 3552 420
9085 420 10702 16513 16574 9257 6821 15688 22424 21567 13684 15108 23000 25295 17023 11585 4750 7672
9069 7672 15556 5537 8737 7100 6035 9454 8316 5049 -5980 -20792 -22272 -18067 -9894 -7262
9055 -7262 -3340 -171 -4479 -5747 1289 2562 -3545 -3469 -6288 -18704 -17436 -9892 3585 16808 7941
9040 7941 -2643 9407 13694 14918 10122 7330 12194 24998 21374 15607 9201 8245 3644 15853
9026 15853 15185 15674 12962 9350 13812 22495 22918 18312 8811 -1804 -9068 -12477 -414 -4079 -7388
9011 -7388 4226 10671 5960 14893 31408 23746 27413 28432 16469 14046 12578 11913 2373 12196
8997 12196 17813 5003 5553 24882 29218 20623 13378 6061 7222 5296 12535 19859 29420 12281
8983 12281 5054 5807 8403 16349 13419 11237 6047 6950 14071 20078 191 -15067 -15616 -22128 -21341
8968 -21341 -13759 -10546 -7342 199 5558 5841 8123 3993 12581 6858 -3096 -4985 -8025 -6886 179
8953 179 12932 -3959 -21128 -20577 -14479 -19326 -10977 -1006 -1269 -4969 -799 -8382 -6701 -4898 1396
8938 1396 14387 1577 -2368 -6269 9941 11757 9194 8748 1194 -3347 -2890 4694 3690 1959 11623
8923 11623 19177 22247 24562 27195 12966 15286 4820 -6181 -10245 -5850 1560 4338 -12525 -10364
8909 -10364 -10891 -11033 -4734 -5596 -3058 -12920 -13341 1148 4521 -3947 -9165 -14877 -17626 -25424 -18191
8894 -18191 -6181 -1048 -10707 -8976 17027 18374 13290 9526 17116 16861 13636 10182 10311 13730 12877
8879 12877 9752 14513 13594 11138 13459 12651 4307 1764 8937 8774 10362 -4554 6306 17019 26742
8864 26742 39119 25029 20379 23967 18809 3337 -8321 -4349 1776 3452 -7370 -4649 9607
8851 9607 15471 13388 15779 9574 10057 1210 -6489 3716 18619 20885 16387 1880 -1551 2686
8837 2686 4266 848 -3200 -344 -6280 -13600 -10820 -1039 9665 9010 6825 3449 -2473 1146 -2933
8822 -2933 5850 -2200 -4277 -1145 5453 10643 12973 13031 -878 -2402 -6413 -214 2657 -6618 1351
8807 1351 8536 10131 12016 13828 3361 10693 7002 -4832 -4020 8733 7912 1330 4295 8895 7349
8792 7349 14718 19397 17500 11098 9348 12853 6612 2738 6971 16955 20098 21192 11001 15030 16964
8777 16964 18298 15300 13238 8844 6253 3243 -706 -5983 -13220 -8744 -3531 244 6051 5010 9009
8762 9009 12593 5630 11249 14544 9616 -8140 -12995 -8746 -4096 3224 -63 -8107 -6039 -5283 -5924
8747 -5924 -7108 -11897 -8125 -11095 -17617 -20615 -11394 -1310 5544 6427 3085 -6245 -7051 -6829 -12700
8732 -12700 -16488 -61 9006 15884 15799 18197 15271 14415 6362 -845 3975 7784 8359 6639 1068
8717 1068 7381 3902 -5488 -13278 -12855 -20220 -16297 -12666 2861 11699 5200 -2986 3507 13704 15272
8702 15272 13371 2496 -5249 -1746 7681 18293 26687 14613 8314 6990 7446 7005 12259 11334 17387
8687 17387 11355 8029 9802 6256 8153 1520 2282 6315 -1341 7862 24354 34887 19799 7886
8673 7886 17308 32446 44144 40304 30446 29110 26344 10598 17264 16248 13776 11066 14178 18152
8659 18152 21703 31032 22847 1760 5592 15804 -2709 -19952 -11797 1343 2128 7365 2781 -169
8645 -169 2479 -1350 -6614 -4843 -11329 -11469 -10273 -7523 -5574 4084 8940 1249 7219 6480 9025 11607
8629 11607 14843 13954 1172 4259 17480 28765 24806 10055 -5182 -19227 -26320 -7288 16451
8616 16451 18630 22797 16203 17382 7219 7405 13153 14157 21208 20195 19581 14184 7595 15815 29511
8601 29511 31033 37501 35863 31588 39369 44866 34101 28071 43266 56384 65310 60209 54558 52338
8587 52338 59368 72216 77574 85348 89853 84556 75370 87130 100430 84762 63168 51695 50673
8574 50673 41476 18015 19569 31556 30137 14259 4591 6880 3906 9343 24727 26899 22716 26446
8560 26446 17837 12336 10682 17306 17608 16066 20419 11368 20621 35105 37024 40624 27132 28022 36835
8545 36835 24528 19547 22285 4222 1510 6129 11382 4536 4505 8254 18242 10198 2643 1867 -4336
8530 -4336 163 12928 28936 21335 14295 4036 -3025 2262 8407 9036 5661 13806 12009 8588
8516 8588 3892 -987 6392 26798 35535 21388 7932 12119 14701 7522 12318 25327 29210 10809
8502 10809 4171 -2616 -7954 8304 14485 7117 9019 16930 15497 2814 3416 14461 13502 10264
8488 10264 22034 27386 19683 23398 20332 11962 4576 -1064 110 124 -1582 1144 3536 13010 8167
8473 8167 3831 17780 4024 -4170 -633 -5855 1250 10437 6606 539 13956 18376 2075 -8552
8459 -8552 -7787 -13866 -15377 -17655 -13669 -7295 -4863 -2500 -6881 -4395 4326 -5796 -7986 2246 7825
8444 7825 2535 8222 18892 14099 6249 1315 -4692 -2232 -997 -89 -5092 2376 11319 20186 22786
8429 22786 26624 20496 22272 18860 16239 11608 14155 7879 7261 3484 1405 -1282 5038 1291 -918
8414 -918 641 6230 13807 15180 7152 5039 -4561 -6083 -1664 8253 18890 22290 23068 20310 12551
8399 12551 20426 19900 16805 954 -9519 -8991 -18058 -12114 -1842 7293 967 -5154 -1270 -4634
8385 -4634 4374 -2654 3081 1789 10338 19006 6340 161 7804 904 -4987 -5941 -2491 3658 11882
8370 11882 4311 -4976 -4487 -5895 -16539 -11551 -1232 4884 5296 1834 1439 2860 -9054 -3226 2217
8355 2217 -583 -2892 -9998 -17898 -28744 -28787 -16865 -16630 -28792 -33686 -24920 -23292 -20416 -8995 -5267
8340 -5267 -7801 -3773 1632 4120 6801 -8156 -15116 3008 7665 7621 2596 -4631 -10372 -4909 -2869
8325 -2869 9379 20349 27091 20105 3530 -559 -2105 -1175 -3434 -7744 -7194 -11025 1210 15115
8311 15115 22156 14466 -3235 -13181 -4923 -5945 -10359 -6636 -5535 1129 5602 1074 -16851 -22942
8297 -22942 -20756 -14583 -16740 -16826 -14132 -17550 -22132 -23762 -15681 -15515 -17174 -5313 -8319 -16645 -15495
8282 -15495 -13491 -9531 -12953 -13365 -17702 -22735 3042 17924 27558 27156 19895 12620 7924 15440 16101
8267 16101 18026 14676 8656 2654 20170 15016 10346 6822 325 -1625 -7927 -13377 -5723 3273
8253 3273 4721 -3742 -11633 -15879 -12483 4087 12512 7453 10542 4913 300 -7968 -14414 -11555 -14011
8238 -14011 -19204 -24909 -26677 -27277 -20714 -13634 -9015 -1601 14345 24614 19245 4072 -15595 -3225
8224 -3225 8069 -2026 -3875 -3131 -15075 -18622 -13667 -14507 -22875 -20997 -16937 -4426 -2523 -1692 1140
8209 1140 6756 8219 10150 7504 5934 -5832 -11933 -7885 -1347 -3987 4253 9364 -5909 -27316
8195 -27316 -17905 -9357 -10023 -7887 -2762 -4915 9897 18799 8447 14670 15230 7498 6924 9201 -303
8180 -303 6446 8457 -7479 -11515 -4464 3286 16948 17287 9578 -3862 -4070 7448 8908 10336 12850
8165 12850 23551 27908 19444 13113 7818 -4719 -1264 540 10488 10106 5147 -7337 -16648 -15980
8151 -15980 -12633 -5782 4291 2155 -1301 -1416 -9796 -7603 -16833 -15118 -4083 -2599 2709 -8451
8137 -8451 -11996 -15739 -8114 21924 26460 4185 -1220 -2035 -6253 -6657 4106 5291 2771 -11327
8123 -11327 -15673 -7742 -7053 -6904 -1906 -5089 1311 5663 2660 -3867 -4384 -15847 -24156 -9752 -2047
8108 -2047 -7624 -8332 -5181 242 444 9723 12057 4742 21079 21035 9907 5160 11293 14959 1690
8093 1690 -7293 -8297 -8466 -6802 1950 4854 3207 -7695 2083 7522 1485 3640 2595 3213 1610
8078 1610 5092 4773 2330 -16051 -17795 -20396 -16342 -7746 -6149 -4955 -5648 -10835 -6376 4767 6635
8063 6635 3549 -609 11848 17767 12138 1794 -14607 -12789 15884 29014 24122 29204 31362 33310
8049 33310 30090 20032 11701 12280 22765 11485 12556 17354 2541 3554 8884 10634 6636 -5337
8035 -5337 -7511 -4694 -3097 -963 2839 12185 12558 22841 19763 5071 4709 1907 15438 17708 22249
8020 22249 16328 16570 15013 18550 28227 26155 6144 -9 2624 13401 19139 24058 25602 23714
8006 23714 21948 32420 39266 32880 33216 30157 18222 7151 35 3713 -1424 -4437 -12171 -2874
7992 -2874 6475 8455 10827 15859 25361 27001 22246 18579 9190 5754 -8997 -7425 -11512 -17663 -8300
7977 -8300 -6410 -6007 -44 13867 16888 18124 15959 13443 13159 8485 6752 6508 12783 18862 2994
7962 2994 -10102 -8219 -2639 2593 12898 24482 23944 22152 18448 29760 27256 17683 4728 -4218
7948 -4218 -1646 6339 15013 25264 14227 10472 7558 2432 -2746 -4972 1338 11646 18502 7388
7934 7388 -4527 5275 15247 16747 13989 7949 -2864 -6377 -6123 3063 7354 21321 18610 27087
7920 27087 22164 12674 10713 12018 8300 441 15175 29230 17144 539 1357 -1374 -1727 -253
7906 -253 11620 21602 13696 5827 2972 9526 10743 8263 5080 -6078 -3572 -190 -802 3093 9116
7891 9116 15078 18474 9742 8227 13537 14739 11793 18504 12560 -4015 52 6191 9138 1234 -830
7876 -830 4872 13520 13774 5309 -6466 -5269 6922 2221 5029 17079 14154 4706 1152 13016
7862 13016 24977 22118 10782 2571 9353 17011 655 -525 -1791 79 -3940 -1184 1726 10456
7848 10456 19664 16527 17060 10313 15188 1506 -18125 -20694 -17170 -17865 -17569 -17631 -10076 6560 -799
7833 -799 -16536 -20486 -8574 1319 -2105 -3133 -12767 -21267 -26891 -23212 -17735 -5529 -6474 -11960 -4119
7818 -4119 -1415 -6246 -21449 -27418 -31621 -24443 -18738 -14548 -9050 -14376 -17814 -14634 -5556 1759 3045
7803 3045 1694 1623 658 -10503 -9319 2128 18896 18299 -1343 -8491 -20681 -18480 -11490 -5262 -3084
7788 -3084 -665 1488 7296 4331 -4728 -9838 -6235 3400 -286 -12398 -16378 -5317 -1393 1883
7774 1883 3908 3445 1306 1834 12389 8316 6979 9186 6351 573 6858 11101 1564 1179 -2270
7759 -2270 4071 9904 4352 -3636 -5296 -3142 13647 18878 3350 1962 16171 24375 34158 35583
7745 35583 25575 13998 -1441 -1626 -833 5393 7209 1720 -3930 -14578 -6670 -7578 -10158 -14179
7731 -14179 -20114 -18679 -5185 -10977 -12697 -8901 -15802 -15363 -13211 -10903 3327 25488 20942 -2231
7717 -2231 -10250 -16588 -6476 -714 -4449 -6213 -8716 2357 3914 -224 15644 10821 -13026 -25805
7703 -25805 -30894 -14065 -2988 -1349 -3259 -13801 -12684 -2210 7394 10538 11388 -757 -10505 -13889
7689 -13889 -10229 -5982 -7100 -4714 -4420 3702 7891 3544 -3379 4736 15 -7835 -12519 -12890 -6926
7674 -6926 -4960 3552 9414 7478 -686 -4437 -7340 -3084 13292 9306 -5487 -1082 -9651 -11989
7660 -11989 -2309 -2224 -3458 2377 3641 -7356 -9686 -4122 282 -13027 -15257 -12796 -3650 6104 5155
7645 5155 -6906 -11081 1518 647 -7620 -7432 -12495 -7959 -13344 -9171 -5453 1527 -4739 -16954 -16105
7630 -16105 -450 9033 6898 123 -1226 -4658 -13020 -5418 6652 2766 4260 -2892 -7113 -4206
7616 -4206 -6681 -6425 5652 11008 8380 11261 7277 2385 5994 1323 -6403 -16664 -19027 -11558 -5087
7601 -5087 -3381 3464 -549 -8225 2468 9015 5012 5333 7168 -3690 -2323 -212 -5977 1670 12837
7586 12837 9241 10553 12471 4668 -8936 -14162 -4072 3823 10002 7079 15802 8333 -729 -2968
7572 -2968 8334 7167 2017 2148 9604 2003 -14651 -27480 -20889 -11381 -10569 -19675 -24651 -24759 -18507
7557 -18507 -12852 -11324 -7499 -16254 -22757 -18906 -21939 -19309 -12526 -12074 -7387 1146 -5928 -13980 -6776
7542 -6776 -12631 -10458 -11664 -17364 -11495 -7077 -7899 -8119 -14374 -15320 -13237 -24996 -18827 -24251 -22381
7527 -22381 -16075 -9744 2744 1534 -7024 -6405 -3703 4616 8635 1855 -5887 -4807 -10912 -3776 -6843
7512 -6843 -9048 -3742 -2912 2544 6399 7 -11275 -14894 -12381 -6224 -6489 -11301 -24771 -31589 -27026
7497 -27026 -7581 6469 10324 7802 7825 -2669 -14349 -14822 506 1390 -9466 -11963 -9804 -6128
7483 -6128 22 4785 -1243 -21011 -17755 -18458 -13235 -14228 -18620 -17627 -13573 -7404 -9303 -17855 -31908
7468 -31908 -19028 -9465 -10246 -14669 -15045 -13987 -5724 6616 7675 1105 -4616 -1017 1014 3725 5493
7453 5493 -14899 -19221 -18773 -8736 -13712 -13387 -9649 -9182 -4236 -3362 -7486 -16337 -25836 -28863 -26438
7438 -26438 -17327 -9295 1190 14479 17388 9833 9795 12818 12246 4286 -6644 -28025 -41012 -41593
7424 -41593 -42002 -35934 -21516 -16583 -5345 -10598 -4088 4842 3937 3511 17091 -71 -8470 -15537
7410 -15537 -18800 -20269 -17809 -14986 -4114 13687 19348 14535 8385 -6484 -5070 4709 2476 6589
7396 6589 -2582 -5550 -10926 -17409 -24931 -27020 -17561 -6410 896 11784 14785 8170 5793 -4971
7382 -4971 -16654 -16393 -4795 -13447 -17757 -8622 -3801 -16349 -21611 -10188 -2768 470 10401 4047
7368 4047 -1486 -10112 -10625 -14010 -2622 -1226 6061 6660 -6731 -1141 -10812 -12232 -4539 4698 16744
7353 16744 10648 9388 6915 -1409 -3483 -3630 -932 5744 5807 -2233 6899 11651 12507 1130 -2401
7338 -2401 696 1943 7282 11984 14074 -8068 -32023 -24255 -11636 1594 574 -4167 0 216
7324 216 1441 -315 -1091 7525 4125 -1013 310 3541 9948 9550 -2295 -6733 -4495 7923 7177
7309 7177 3076 -10661 -10240 -1705 -7467 -2183 5913 14913 21963 1741 -11292 -11052 -14028 -19219 -9723
7294 -9723 -11227 -20573 -19509 -8119 4002 -1457 -10524 -541 4602 4552 3067 9434 5639 -7054 -7336
7279 -7336 -14011 -5389 5945 1906 950 -1079 4794 -4361 -15207 -10011 -5949 -10230 -9925 -7820 -9992
7264 -9992 -11985 -16457 -14911 -16628 -5203 7944 1967 -3665 -9366 -12051 -9022 -7749 -16823 -4030
7250 -4030 -240 -3861 -5397 -8090 -4481 -2908 -10383 -345 10041 3668 -6335 -27000 -20096 -6258
7236 -6258 -7048 -6819 -6712 -12317 -9525 -10167 -7297 -6899 3962 6426 -3704 -75 3262 -710 1930 -98
7220 -98 -3990 8846 14847 2069 6581 9201 -2182 -18266 -19524 -25419 -22580 -13232 -16275 -15682 -16009
7205 -16009 -6354 -7773 -13747 -24381 -12107 -2581 -98 -10142 -13783 -16457 -12552 -6807 1530 -5448
7191 -5448 -4462 -1796 -967 6714 11695 10571 -8229 -17290 -17044 -15573 -9077 930 18098 13660 7116
7176 7116 6870 3435 -2693 -5266 9984 6591 3948 4279 3492 9926 8911 -2189 -7209 -6821 11431
7161 11431 28960 18827 5129 9716 15104 19189 14609 -2322 -9284 -14775 -19092 -21927 -11816
7148 -11816 5995 10974 4567 4484 625 -4143 4 -4407 -7045 -2304 2845 -13200 -14014 6501 5763
7133 5763 -1046 89 -4476 -476 9313 27530 32800 18213 9858 -101 -1143 1228 300 -18107
7119 -18107 -19251 -15530 -10632 -11931 -4758 -7591 7830 19129 18368 26730 20078 14524 5339 12028
7105 12028 40482 50996 46752 30816 14067 11811 24164 22393 10840 15477 12200 1062 -4232
7092 -4232 -61 7359 21019 30612 28339 44546 60127 57684 37262 20296 13234 9210 1452 2220
7078 2220 -5181 -6840 -465 -9151 -17251 -13103 -6913 -3531 7018 -4859 -10932 -7465 -16317 -14966
7064 -14966 -10474 -21468 -20961 -15745 -18432 -11425 -6232 -7283 -6872 -7964 -9974 -751 3865 275 -6775
7049 -6775 -19995 -20917 -12690 -11342 -6184 -7736 -10633 -8104 -113 -2306 754 8807 11080 8648 -2753
7034 -2753 -17640 -22034 -6096 -4503 366 12159 18119 10427 6798 1415 3518 -4105 -13314 -9599
7020 -9599 -14060 -6426 -5406 -4048 -1484 9376 2365 -7286 -7304 4991 9174 7873 7610 299 9197
7005 9197 9888 -10755 -11693 -11219 1114 15149 11641 2910 -1856 -4947 -4631 -5266 -6690 -3170 -7799
6990 -7799 -25974 -29930 -30887 -25380 -24586 -19589 -3850 -2873 6130 20014 18270 -140 -127 2066 3594
6975 3594 -6842 -5885 -7573 -14000 -8486 -1371 415 2918 6813 8185 -1536 -5560 -5838 -1239 3024
6960 3024 -2421 -8635 -17032 -6459 4117 -6245 -3764 -1970 -5685 -658 -4178 -9190 -4659 -1312
6946 -1312 -7561 -14109 -5801 11502 2913 -3432 -4059 -5824 -1208 4782 -2977 -12626 -11897 -10059 -9621
6931 -9621 -4652 -9987 -19331 -15432 -10812 -8779 -14537 -19577 -22718 -17104 -6985 -7474 -9070 -10077 608
6916 608 11795 -474 -13553 -14069 -12369 2279 1330 -1271 8576 7909 -9148 -12581 -9749 -1923 1773
6901 1773 -3282 -14766 -16446 -7572 -6359 -1432 1731 -3427 -6118 -11421 -1389 -3247 -6267 -13938
6887 -13938 -27783 -21849 -9255 -2339 -8237 -18671 -17005 -9856 -2468 13307 10289 -300 3486
6874 3486 841 -2401 -4146 50 619 -2709 2380 -476 -2692 9314 17113 -5288 -28221 -20077
6860 -20077 -5243 -5073 2309 5008 -8015 -16558 -9483 2479 3929 3710 3252 3178 5591 -1713 -10414
6845 -10414 -12301 -12119 -4575 11170 11703 2250 -5821 -5861 -254 8943 17382 12421 10248 14401 6167
6830 6167 8058 14155 5100 -6128 -6736 -7992 -9070 8674 15378 17903 18657 27923 17793 4319
6816 4319 9058 18553 13008 6753 5571 8465 4226 -9396 3030 22464 32688 29733 21994 21257
6802 21257 18744 25343 32061 27433 22262 21523 23305 16065 19887 31629 29487 30348 23163 12172 16643
6787 16643 10129 6005 3889 -2244 721 1295 -577 -3814 7487 26539 40507 33692 19870 18221
6773 18221 23562 14409 16161 29953 28174 21930 24740 34831 43744 39636 32960 33861 44292 43576
6759 43576 48255 53132 61998 58520 60413 67186 74084 80910 101541 124514 133047 135371 142554 163247
6745 163247 193468 237880 293216 377281 487141 585163 643547 617384 553814 475404 418726
6734 418726 386611 385692 399746 418284 463371 526340 609871 717957 841212 1010532 1246421
6723 1246421 1555989 1999263 2660369 3680764 5227990 7524341 10312303 12259057 12015325
6714 12015325 9860114 7118095 4921036 3470683 2545461 1935497 1515530 1215886 1006729
6705 1006729 856384 744815 655297 589536 534640 483148 453461 432606 415791 417874 438805
6694 438805 488588 519337 518914 469841 392214 324068 257252 208273 189078 170226 157184 147651
6682 147651 129592 122952 128829 132283 142456 158209 178750 178433 155070 125809 99376 82467 66929
6669 66929 54308 46624 32666 13285 15753 17398 25758 33844 25751 14287 20906 27117 22288 29158
6655 29158 34952 35583 39331 43995 25460 11542 8599 14705 18483 15994 23726 29512 27441 15011
6641 15011 6013 4821 7883 8758 -4355 -1548 2906 21056 19847 6338 12343 9655 -6579 -13598
6627 -13598 -8672 -6969 -14356 -8866 -6062 5666 13308 17849 12624 17695 15579 7021 798 9187
6613 9187 17208 12637 5813 -6674 1170 7450 7439 1114 -9563 -18861 -20420 -13125 443 -71 6109
6598 6109 13396 9999 5277 -7305 -1345 3734 -1047 4380 15574 29076 33264 24165 25050 22602
6584 22602 14038 -322 2312 9575 5356 12826 5458 1526 14087 16465 5959 7460 4707 -3670
6570 -3670 -6112 -12259 -3019 -980 -1970 -1442 -6440 -3333 15680 26763 22025 3377 6013 12134 3907
6555 3907 -7021 -17566 -34650 -26265 -12294 -1673 -3438 -5883 -4894 -15145 -1964 5955 3461
6542 3461 160 -1189 2105 501 676 1503 11256 16870 11132 9432 1114 1670 12295 29682 26592
6527 26592 14500 13118 22712 14207 556 9123 19468 8006 14523 25827 27554 17808 16884 14782
6513 14782 14411 9570 3351 2308 2828 8409 357 2437 -3503 -11987 -15469 3954 12140 10100 4671
6498 4671 12945 3639 -5368 2155 -2520 -6103 -8552 -11425 -9858 1964 6847 10078 15471 5134
6484 5134 10742 2651 -16023 -30791 -37962 -27077 -20375 -11589 -675 -794 259 -2283 -1207 367
6470 367 -2335 -17088 -24329 -22900 -5671 -1189 3865 7476 13378 10123 9684 14601 7805 2332 -7792
6455 -7792 -15032 -7161 8263 10480 4839 210 5008 -2765 593 4006 -7382 -8321 2518 8212
6441 8212 11574 1324 1150 2168 -4727 -10666 5156 4934 520 5054 10879 4740 -2597 -8965 -16540
6426 -16540 -12055 -6524 -4457 2467 4454 -1017 1510 9819 10190 962 -17422 -24075 -30747 -30946 -21657
6411 -21657 -19275 -19019 -9847 -993 2558 -4819 -19621 -19410 -11408 -9528 -3445 -3408 -13593 -2543 -5677
6396 -5677 -3802 -2474 -4649 1521 -1073 1776 1916 2960 15687 9728 -10421 -11554 -2541 7185 5446
6381 5446 7761 14044 15279 2458 -8723 -2439 -2500 393 -1286 -2819 -9147 -15328 -14667 -19966 -22296
6366 -22296 -23789 -13699 14369 18745 10180 13479 21275 26152 9011 -18427 -21274 -9630 -2823
6353 -2823 -2734 4113 -4385 -1612 -455 6645 10761 7488 12814 9072 17786 33636 44263 47379 46921
6338 46921 34418 32259 28851 14952 855 -11092 -7638 -4939 10472 19958 9833 11802 3515
6325 3515 -11815 -4759 -4823 -9666 -10133 -9487 419 8440 -83 -1464 -5567 379 8928 12759 12642 17563
6309 17563 17226 1854 -3909 3946 3383 11223 -3911 -10564 -15279 -22880 -31362 -21640 -8402 -831
6295 -831 -7599 3014 5164 975 -8800 -23447 -11475 2652 -1710 -4148 -4731 3015 11232 13107
6281 13107 11536 6824 -5162 -15529 -20261 -39541 -38863 -28664 -27164 -14868 -10432 -12996 -13463 -10526
6267 -10526 -9457 -2752 7694 1775 4642 3785 2205 5294 -1283 -8721 -7632 -2478 -1626 -4059 -13411
6252 -13411 -34919 -28749 -10861 693 4043 659 -9492 -9486 -18234 -13036 -7474 -13722 -11360 -7333
6238 -7333 -18308 -26236 -35264 -25792 -14362 -26 6013 1080 -5253 -8664 -8103 -1740 1282 14661
6224 14661 10991 -11950 -20672 -11676 -5408 -10866 -15786 -10714 183 7705 -6543 -9095 -18104 -11140
6210 -11140 -2407 -11155 -16396 -1416 5549 5361 -5279 -15374 -14604 -14331 -9864 -10542 -17013 -2689 1457
6195 1457 -6502 -19508 -20810 -11319 -2176 1158 -5292 -19363 -24943 -27148 -22109 -23303 -23274 -22691 -20520
6180 -20520 -3846 2987 7363 2188 -1668 4262 -2976 -2893 -910 -3011 -232 -9072 -16573 -15179 -15746
6165 -15746 -16045 -16019 -6547 -1888 4918 4850 -944 -946 -8588 -20149 -11604 3122 -4227 -3865 -7145 -5897
6149 -5897 -6409 -19 -3429 -6121 5458 3885 430 2994 6014 13047 6132 -2997 -13888 -12483 -23
6134 -23 -500 -3826 -4466 -6788 -10218 -11156 -7902 -5605 -19481 -21698 -21331 -13484 -4751 -15122 -19242 -31659
6118 -31659 -32269 -26250 -15303 -6026 4715 3630 -4922 -3196 12035 18949 3264 -1617 -7382 -14561
6104 -14561 -6153 9317 7143 -2720 8450 3119 -4274 -2799 -4976 -7691 -9709 -15712 -29650 -17860
6090 -17860 -7477 10356 4344 -7067 -5225 7680 6242 10247 11946 9671 15821 24106 14629 9455
6076 9455 -390 -6485 -5757 -12647 -19602 -9971 7931 15199 13131 3475 -5353 -2540 -8647 -14440 -14122
6061 -14122 -17936 -22806 -29268 -14792 -11550 -14037 -8377 -1422 1125 -8083 -7338 -3155 -263 -1071 -504
6046 -504 8169 12875 2774 -4258 -11786 -5563 -7655 -14058 -12275 -6210 3087 -1735 -3011 -3613 -8720
6031 -8720 -4384 3628 -5476 -9573 -11800 -15950 -9573 -14707 -16518 -12966 -5588 -187 1900 7082 13768
6016 13768 11613 7990 2599 368 2325 13958 7579 -5717 -11997 -7563 -179 7510 5631 -3719
6002 -3719 -7232 -15 -327 -6233 -7083 -5916 -8032 -5142 -9944 -13590 -10104 -175 -1507 1867 4322
5987 4322 -6033 -7606 -1649 7150 14827 11834 3157 2660 4714 10130 4038 -964 -9894 -17513 -13671
5972 -13671 -15531 -29595 -41367 -34867 -16546 -5554 -2238 3596 6691 15311 6653 10301 2223 -9765
5958 -9765 -18853 -25272 -21702 -16112 -9826 -11229 -13085 -8750 -15107 -13416 -8351 -3941 2539 -12182 -22053
5943 -22053 -21131 -9194 -3799 -9490 -15690 -20028 -14261 -11251 -11864 4798 16607 22634 8663 -17348
5929 -17348 -25877 -29925 -29924 -7140 -1557 -1197 2526 7278 11021 7778 476 1019 164 -6545 -14154 -8582
5913 -8582 -3708 -4495 2352 8620 15302 12005 -2277 -18220 -12964 -6264 -12007 412 -2317 -13592
5899 -13592 -29082 -36210 -30799 -18010 -8580 -2354 3652 4639 17000 18188 20267 23883 11911 366
5885 366 -14086 -16734 -5389 -6874 -2376 -1378 11652 15067 11639 3906 -2007 -1728 1238 3794 3851
5870 3851 2594 -8441 -14565 -17071 -16376 -11828 -11260 -12409 -20916 -29430 -19122 -11314 -9447 -15871 -15275
5855 -15275 -7828 7938 4343 -5118 -6977 -4468 14010 19318 13350 6018 12033 5636 -4478 -8055
5841 -8055 -5441 -6862 -16451 -20111 -16770 -16243 -14086 -9635 -16095 -15707 -11659 -2883 5488 14098 12469
5826 12469 -2272 -9744 -2711 -3462 18 5874 -1347 -7435 -15004 -20064 -24094 -27158 -18226 -3102
5812 -3102 -14250 -22969 -31265 -26620 -17931 -12003 -7976 4116 92 -6035 -265 2237 11029 22373
5798 22373 22310 11469 9480 9657 9525 11128 3406 -12115 -7976 -2619 -4283 -1198 3032 14592 9037
5783 9037 18529 13220 2419 -1078 2645 -2439 -7584 4606 7196 3950 142 191 9124 16661 18423
5768 18423 21496 13768 10033 7770 -8888 -8932 -3489 -23133 -23377 -13837 -6093 -6644 -3716 -2121 4429
5753 4429 4579 1225 -4650 4289 2190 161 4367 15826 13863 7685 8627 -1180 -2324 10640 12326
5738 12326 18394 12461 12427 2060 6992 12492 8153 14214 18309 7940 1824 629 -7270 -12944 -21687
5723 -21687 -20428 -24698 -14971 -2619 2855 10399 13468 4753 -10421 -19592 -7856 7599 10363 -1122
5709 -1122 -7474 265 -1810 -4926 -16051 -10865 -5640 -4974 -891 6170 16893 6806 -848 -10406
5695 -10406 -15190 -14959 -15475 -8086 -4136 4377 4253 -15509 -23180 -18699 -9430 -7219 -7847 -4605 -12611
5680 -12611 -20182 -22849 -15021 -3075 2130 3165 6563 5932 -3068 2526 196 -7709 -7571 -11642 -4630
5665 -4630 -2141 -11984 -20411 -16819 -16032 -12983 -4214 -6869 506 -4168 -5943 -11745 -11363 -5370 -10031
5650 -10031 -14236 2011 7660 -4530 -9949 -16679 -21074 -18114 -6531 11541 14657 1151 -10399
5637 -10399 -20226 -19181 -21746 -23469 -8862 -2128 1571 9503 5645 -7663 -11037 -6625 -16822 -15083
5623 -15083 -13600 -14146 -19426 -9289 -2778 -11706 -11466 -2392 -9577 -15104 -4066 9016 19676 23476
5609 23476 7697 6278 12460 1824 7793 3649 8972 21807 21051 6713 8731 12611 15296 7049
5595 7049 13001 25087 19930 16571 16214 12443 20887 27804 15156 8051 1947 -10173 6415 12876
5581 12876 33699 33628 19977 16641 10405 7699 13305 9479 3919 9277 11004 -2303 -23616 -23100
5567 -23100 -25359 -28030 -14581 4503 5336 5902 1083 -9507 -8848 -5691 -2 -148 -3259 -9900 -10474
5552 -10474 -4003 -10600 -10067 -11528 -6367 -9610 -913 9017 4063 -8288 -22511 -16988 -19912 -16316
5538 -16316 -15189 -16976 -26923 -25901 -12136 6849 16490 17874 2478 -542 -4672 -8423 -9814 2678
5524 2678 1967 -274 3231 8716 17587 15654 4830 6625 1083 6131 14750 11532 -5632 -14939 -6687
5509 -6687 -1714 -8922 -22226 -20038 -17644 -9817 -5140 2518 -4033 -5383 -111 3824 4393 8425 17002
5494 17002 18833 17196 8636 -5300 -11170 -10202 1818 11104 5696 -5289 -13120 -7139 1682 -513
5480 -513 -1663 -3635 -22191 -21102 -21460 -15797 -17879 -11134 4066 7869 13458 8445 4531 6986 4394
5465 4394 1054 -825 -7873 -1274 -4981 -2176 -11441 -8065 -6701 -11407 -7302 8393 3787 -3347 5529
5450 5529 22444 21321 20725 5497 -3055 -1868 6285 10587 869 -3857 1930 2641 1402 3932 -2085
5435 -2085 708 -8749 3118 8451 4820 -5999 -12202 -5850 3904 11534 10546 13451 24016 23728 9638
5420 9638 3937 -2015 -8198 -14320 -18168 -16498 -8193 -14071 -20221 -8039 -201 3871 -1917 -917 -1947
5405 -1947 -13230 -16014 -31 10360 -2488 -9443 -12296 -24380 -21477 -11019 -2370 -2356 1478 6157
5391 6157 -4766 -1038 -9370 -3567 7704 13121 7935 -12090 -13279 4848 12633 9685 6134 -15882
5377 -15882 -26976 -23269 -11721 -282 3962 -3487 -14849 -9566 -6346 -7865 -5510 5486 5523 2293
5363 2293 -2935 -10458 -13600 -10866 -11741 -10930 -7794 -5989 -17006 -13890 -19324 -7202 -5363 -10948 -10148
5348 -10148 -16642 -24861 -21743 -18403 -19143 -20740 -16130 -10878 -4158 -1738 2633 1137 -2656 -3771 2899
5333 2899 7441 11301 2928 -5870 -12864 -14387 -8891 -10389 -9343 -5896 5768 14893 18196 5018
5319 5018 1358 6269 14522 6617 5643 13131 9487 8099 -4015 -4374 13059 11632 6926 -6987 -15262
5304 -15262 -13803 779 -3475 -7068 193 8183 -4470 -13631 5924 -2208 -8833 -9019 -9242 -11321
5290 -11321 -16721 -6782 -7471 -10703 -13246 -15700 -2292 4477 -1147 12874 5491 -5096 -12607 -1881
5276 -1881 -3728 -10172 -4306 -9228 -16123 -19903 -33746 -37391 -26008 -19543 -20746 -15458 -16141 -17091 -18151
5261 -18151 -15966 -1084 1931 485 -2440 -424 -6573 -5845 -885 -6875 -16010 -18396 -10130 -10931 -14673
5246 -14673 -24464 -27164 -8033 3313 -893 2411 11140 19154 9893 13547 13581 16021 24135 33698 24608
5231 24608 17121 11112 610 -1053 -6994 -1944 -18 7955 8176 17681 17305 7192 -1022 -4847 -6643
5216 -6643 -1330 2834 -16732 -14273 11 8185 6734 9050 12616 11411 -2016 -8125 -9716 -20413
5202 -20413 -7383 3752 -928 -7332 -10878 -14892 -20689 -13075 5096 6845 2234 8963 11618 2151
5188 2151 3318 4516 -8568 -23722 -16952 -13115 -20139 -23769 -24273 -16139 -22441 -19211 -1083 6445
5174 6445 14286 6343 6237 10141 4017 -2202 -2723 -3729 -1670 -4208 -3093 -5041 -11707 -951 497
5159 497 175 3633 17700 17220 4396 -13124 -5481 -6215 -10550 -25626 -21723 -6686 -5030 -11244 -15576
5144 -15576 -10629 -9136 -8673 -901 -104 4861 1356 257 2076 -10881 -19443 -9408 -10565 -6774 11974
5129 11974 17531 18971 11993 1505 -14309 -10833 -3446 -1778 -9235 -6991 13342 9566 5826 1089
5115 1089 -969 -2394 13094 4586 -3894 -3655 -10375 -20610 -17356 -13404 -23201 -10093 -14093 -17966
5101 -17966 -17409 -14336 -3165 -139 -866 -4790 1809 5051 425 -13301 -9133 -3869 -5472 -7239 10584
5086 10584 18146 8062 4557 -2456 -9494 -1588 -5968 -10349 -2378 5727 614 -11058 -11132 -10266 -12656
5071 -12656 -12373 -10152 -2223 2314 14471 6398 -1172 1663 5949 5894 -483 -6058 -17854 -24706 -16016
5056 -16016 -10172 -7818 -16429 -21682 -18622 -3441 -5812 -13606 -15972 -17086 -16268 1385 5363 -2349
5042 -2349 -13134 -10867 -15225 -17962 -15098 -1529 3940 -5078 5241 6396 6903 4358 9831 12970
5028 12970 -292 8905 20775 11252 7974 5493 -1586 4039 9835 -1800 -4685 2575 -6704 -9466
5014 -9466 14818 8252 -7704 -10299 1337 5150 4555 10882 23447 24836 11732 3476 2395 -13447
5000 -13447 -14504 687 2689 6986 7292 -7209 -17128 -14414 -6988 -8271 -12872 -6935 -7682 -12737 5992
4985 5992 7609 12430 7398 -5990 -7256 -8747 -11474 -12289 -11186 -11002 -2452 2018 2741 11580 -658
4970 -658 -17086 -16516 -14432 -9109 -10106 -7407 -3693 15998 20827 -1438 -13044 -3084 -3048 -9767 -13721
4955 -13721 -6656 1769 -5845 -2351 -6335 -549 2797 -9481 -9981 -14192 -1403 -3549 -4354 -1346 -5411
4940 -5411 -8065 2431 19972 27627 23972 9816 -614 -5664 -1888 7046 517 -5509 15671 27315
4926 27315 27796 21314 13000 -1488 -7046 -8562 -10082 -5835 2075 11366 13662 -8055 -6771 9087
4912 9087 7526 9359 7015 -6836 -13599 -7189 10081 19869 20566 8523 -10096 -16481 -6015 -1339
4898 -1339 3430 6431 1376 -10727 -19748 -26956 -16161 -2783 -1289 663 1592 1321 -1800 -11997
4884 -11997 -6249 748 1306 357 -188 -5518 -12423 -12336 -7427 -6845 -648 -5852 -7847 302 -178 992
4868 992 1241 -7121 -9813 5672 10532 11208 -3105 -1223 7094 6406 2750 9656 7619 -2715 -10310
4853 -10310 -14522 -12504 -13580 4882 3586 2538 -1778 4803 4831 -3866 -17287 -13276 -11217 -15232 -20746
4838 -20746 -11220 -1041 -9517 -7885 -12019 -2741 20128 27698 19681 9817 118 36 -5733 -9208 -4030
4823 -4030 -1264 -3479 -9822 -14314 -15770 -7867 -16591 -21496 -7352 2597 -4318 -3583 -8866 -8086 -3027
4808 -3027 -9577 -16645 -10775 4485 8714 7525 -1725 -8773 -7223 -4239 -4101 -2301 1760 -2819 -15207
4793 -15207 -17558 -6019 -2460 37 -7939 -5420 81 19249 24524 24416 22309 14589 9060 16196
4779 16196 21752 20893 18616 21115 20240 16043 8624 -4423 -13402 -15620 -4555 3230 6898 -620 -5897
4764 -5897 -10062 -15567 -9599 -4748 7876 -370 -2886 2454 6085 7080 -2998 -9778 -11086 -11159 -8918
4749 -8918 -12279 -21509 -29892 -14795 -4483 -11243 -18540 -17665 -23874 -18057 -28824 -23154 -18293 -22280
4735 -22280 -20728 -26588 -30622 -29373 -22060 -17697 -8138 -155 -9884 -9397 -4099 -11075 -18121 -20097 -16667
4720 -16667 -17383 -15148 -9523 3264 960 -3629 -4072 -10402 -17151 -10959 1335 3597 10882 19355 18187
4705 18187 5733 6651 12242 10591 1173 2995 930 4755 9417 10090 5078 4788 -2621 -11811 -5228
4690 -5228 -7574 -18974 -12202 -7899 -1605 -1335 -35 8446 -3715 -6679 9781 3123 -8564 -4400
4676 -4400 6221 17654 28969 25425 11990 1078 -648 800 -1803 -7061 -17420 -19623 -19330 -16795
4662 -16795 -6378 11336 15994 13919 15152 5381 -12775 -13397 -10450 -13219 -13721 -10418 2279 5363
4648 5363 -616 5532 8757 8503 5143 -1788 -1974 -7754 -15399 -26451 -27331 -12039 -538 6421 5082
4633 5082 -2699 -2734 1339 15853 17772 12536 3033 -7073 -9620 -6840 1034 17673 21249 18561 1415
4618 1415 -5164 -1379 -17786 -26217 -21477 -10853 -5344 -4089 -8453 3532 3752 1640 -4778 -14255
4604 -14255 -13933 -4885 9729 4358 -2971 -4799 -5246 2791 -1537 -9325 -590 -362 8337 10667 61
4589 61 -1266 -4503 -14423 -7307 19241 16364 42 2713 9796 5051 -8813 -12122 -6266 -3367 -10023
4574 -10023 -22090 -15629 -1091 -85 -3857 -4225 -15996 -16246 -22838 -15443 -3542 971 7183 6554
4560 6554 -6766 -9544 -6921 -9405 -16116 -20967 -9536 9984 14851 9746 5042 -1574 -15412 -15184
4546 -15184 -5427 -2386 -22 3959 -5060 -1472 -1609 -16315 -19566 -21248 -8844 5390 11372 8933
4532 8933 1611 663 -9257 -4889 -9192 1522 -6174 -18762 -22205 -1830 9307 14568 6382 3711
4518 3711 -3870 -10196 -11510 -11869 -9458 6780 6449 870 1580 -2973 -15021 -17692 -12606 -4135 -5455
4503 -5455 -13270 -19106 -14168 -13527 -9256 10700 2457 -8128 -13810 -9357 7888 23180 36195 25421
4489 25421 9709 4956 -16203 -24949 -18773 -3674 14275 11720 15343 20442 1024 957 3039 -2262
4475 -2262 -5827 -7939 -5065 11255 18029 18113 9010 4020 -127 1733 7134 5080 -3961 -8263 -10369
4460 -10369 -12859 -17036 -24375 -20061 -2298 2448 -2390 -1828 1858 -6851 8373 24671 15301 3891
4446 3891 1983 3526 1005 -6463 -5198 -2950 -1869 -2775 -4135 -4378 -956 -3951 -26371 -29752 -15740
4431 -15740 -3640 3187 -9740 -14953 -25410 -28711 -21265 -13904 -10935 -3869 1062 -7061 -9737 3708
4417 3708 9103 -4009 -8177 -8298 341 4857 9718 -1550 -6703 -20354 -21087 -3528 1913 2462 10007
4402 10007 10463 12172 13091 17413 7154 3183 -5298 1165 -6526 -16603 -12587 -19933 -11792 -8358 -3049
4387 -3049 -8192 -9352 -8802 -9405 5966 15653 14785 13275 11622 7228 6381 -6589 -4560 -1523 12048
4372 12048 12017 4361 -13919 -10211 5405 25770 30430 19035 889 -28558 -17300 -9461 -7358
4359 -7358 -5128 -8542 -18034 -29869 -29925 -29758 -26858 -29477 -25526 -12307 -2702 -13881 -6744 935 6083
4344 6083 17109 25165 21362 10258 11960 9191 8246 12882 8056 -7828 -7422 -4079 5488 3191 -4106
4329 -4106 -219 -4781 3384 9339 -2225 4538 18409 27004 31194 29320 3962 -15668 -6484 9906
4315 9906 17053 18658 18862 3676 -4833 -11840 -11818 -10350 -1522 -3321 6667 6371 10045 12265 8083 -95
4299 -95 -3289 6420 491 -2316 -488 -1467 1720 7350 4645 -9809 -27536 -37801 -26870 -15709
4285 -15709 -17692 -21587 -21832 -22314 -22971 -26529 -31369 -23145 -14827 -11467 -6395 -13160 -24198 -22293 -34173
4270 -34173 -37688 -23071 -12867 -14581 -12940 -10575 -6712 -5343 -17975 -27863 -21945 -17159 -9705 -623
4256 -623 3353 5461 15418 9143 142 2710 14149 22787 13411 9991 2071 2158 -1321 -3125 -12172
4241 -12172 -17973 -14079 -9885 -4064 -5514 -17552 -10380 -12572 -19990 -12714 -11139 1875 14123 -3
4227 -3 -11148 -7673 1910 5250 7290 9949 10156 4378 -10263 -8858 2133 7577 2801 -1531 -2778
4212 -2778 -5450 -3673 -1006 -10104 -9536 -14384 -27405 -36442 -26598 -12536 -23 10122 18121 10777
4198 10777 11181 2308 -6524 -4798 -3512 -13557 -17384 -13708 -7492 -17249 -17410 -9266 -11381 -11050 -13740
4183 -13740 -19622 -14051 -6744 -6904 -19704 -18856 -16602 -16383 -21534 -13364 -6076 -14759 -19042 -18331 -26133
4168 -26133 -22044 -21143 -17234 -10529 -12949 1341 13266 8761 5714 11104 8938 10465 7068 -5028
4154 -5028 -9307 3900 7653 7993 4052 13509 17768 18803 11009 1258 -3551 -6797 -8224 -2245 -1190
4139 -1190 -5769 -11473 -10455 -25191 -16289 -2942 4596 -6033 -718 11869 19817 7033 146 9848
4125 9848 14493 4318 -6097 -3350 7718 2447 -8866 893 7885 10998 13757 693 2831 4423
4111 4423 6314 11309 2788 -3929 -804 -1693 -1251 -905 -14301 -17164 -13164 -15661 -11786 -257 13414
4096 13414 11010 7234 2706 -8911 -6892 10771 18979 2285 -2954 137 -5507 -883 -14876 -18451
4082 -18451 -18827 -17901 -22221 -13595 -6666 7 6582 9465 10299 6834 -2112 -16161 -23884 -18648 -23724
4067 -23724 -25936 -15064 -3516 -2076 9968 9396 5964 4817 11832 11849 10734 14282 6892 1308 -12505
4052 -12505 -18855 -11699 -8364 2233 7061 4286 4249 7229 -534 -9265 -21386 -20990 -11283 -7209 -8025
4037 -8025 -6645 -2278 -380 -4011 -13341 -1993 18454 25680 21947 16157 17401 21247 9982 -2940
4023 -2940 -8974 -8134 -10392 -4797 -15544 -14200 -2718 -6420 -2491 157 10206 4455 -290 1488
4009 1488 -7094 692 6212 -5723 -13152 -12366 -9487 -2371 645 -1777 -10987 -18635 -23569 -27259 -22999
3994 -22999 -18503 -5194 4862 3816 -4536 3477 6912 -4315 -9817 -1064 3573 7855 192 -7243
3980 -7243 -3566 -92 281 -7710 -4243 7518 14705 19208 10161 -2750 -2536 -1909 -960 -8389 -12705
3965 -12705 -6799 -6674 -838 -1547 1288 -3514 -9673 -8026 -1483 2234 10822 10910 5524 -3410 -10343 -5582
3949 -5582 5632 17185 5142 -1644 6685 15494 16524 22515 17263 18112 14479 50 -2301 -2916
3935 -2916 -12518 -17524 -18950 -11461 -1878 -1782 -3717 -8731 -4594 3984 -2036 -1673 -1312 -4594 -3527 -3265
3919 -3265 -10122 -13210 -6678 -3307 -2025 3317 14305 15955 10606 5760 9315 14194 9648 1232 6689
3904 6689 13010 12843 13778 11977 4544 11431 12162 -2051 -12635 4075 1821 7455 17830 14237 6788
3889 6788 -3054 -766 7690 13476 9850 -8051 -9864 -1926 1271 -957 335 -7221 -16269 -26250 -9383
3874 -9383 -43 -4095 -1820 -15939 -18238 -22239 -19597 -10921 -17263 -29383 -26257 -2599 9380 16686
3860 16686 10373 1496 8227 12147 -2908 -12955 -21798 -22659 -20572 -16527 -8778 -15625 -19094 -20996
3846 -20996 -30838 -37052 -22609 -16235 -10610 -15066 -10550 -13641 -20784 -14786 -16868 -7875 -5062 -13657
3832 -13657 -18789 -19268 -3887 4396 -2469 -1993 3525 417 -2813 5795 17573 15843 13300 8543 1525
3817 1525 -4837 -10765 -1466 2126 -7738 -2151 -1174 -1541 -4121 -6307 -3222 -5810 -7682 -5296 860
3802 860 -3115 -17483 -9125 -1026 4131 -3578 -15471 -16022 1608 -2911 -12652 -5844 -7258 -6765 -7133
3787 -7133 2937 15467 25110 21709 1207 -16424 -11501 638 9486 8037 7912 10187 5967 7538
3773 7538 3831 4724 8151 -8694 -10585 -13756 -14546 -13678 208 -3490 -13269 -19873 -10890 8283 12131
3758 12131 17980 20132 7612 -814 190 5751 5584 8086 1557 -2921 -8596 -11790 -7214 11706
3744 11706 10032 437 -10826 207 3797 13183 3365 3718 -3048 -2247 927 10199 15986 14417 10356
3729 10356 5101 8406 12046 1860 8012 11880 21205 20306 9201 5245 -7466 -13330 -17569 -12716
3715 -12716 -5092 -7349 -6757 5589 -6352 -12745 -12152 -13926 -9105 -6923 -10124 -3206 6464 15579 25511
3700 25511 18043 10735 10775 4432 8156 10857 27490 24038 12882 104 695 434 416 -7637 -18876
3685 -18876 -19057 -11937 -23290 -20796 -10943 -10347 -20033 -21824 -9776 -11494 -13841 -8711 -9572 -10339 -18140
3670 -18140 -18031 -13915 -5188 5159 1153 -7646 -8436 -5540 -6978 8785 15209 17678 4770 -1969
3656 -1969 -3265 -3519 -7311 2041 2803 320 -4154 6265 8662 142 -1306 817 5337 4732 6582
3641 6582 4722 4906 9424 6960 3963 9479 17369 11961 2359 5511 12905 14675 17572 9753 467
3626 467 715 -433 2487 -3642 -6381 9128 15150 7173 12090 19808 8601 -4785 -11315 -1495 10824
3611 10824 13300 11065 4149 3992 -3074 -12435 -9044 -4681 -984 3045 -4989 -8162 -9535 2851 2594
3596 2594 12560 14299 13086 3812 3102 -2164 -2317 -1648 -8228 257 -4964 -5781 -1314 5882 16894 13814
3580 13814 11339 16905 24533 12728 -5663 -17105 -22920 -21558 -15389 -12164 -7367 -21067 -17888 -2568
3566 -2568 -7451 -5398 7433 17998 11140 -2041 -6016 -16039 -21807 -18856 -13013 -10339 -2564 -3803
3552 -3803 -11883 -7053 6489 989 -1156 -1028 449 5942 8071 1927 -3550 -13806 -29289 -31257
3538 -31257 -34712 -28740 -20029 -3719 4520 10355 5164 -6995 -20641 -12104 -2040 -4926 -6501 7335
3524 7335 11448 9205 13591 4331 -10968 -20391 -19062 -8835 2544 13760 9747 -2731 -19039
3511 -19039 -18371 -16403 -10772 5022 11044 13136 17471 15087 11968 5907 -7291 3064 9123 1441
3497 1441 -542 10294 3620 -4174 -5368 5051 -4311 -4744 -2248 7140 18459 10794 7468 6751 7731
3482 7731 9337 -5157 -11873 -12120 -8744 -9866 -12802 -2879 3138 2303 -15425 -32269 -20647 -7669
3468 -7669 -6114 2792 10023 12111 -118 -1743 -6419 -11489 -4293 -3633 -734 11492 2928 -213 4109
3453 4109 6592 7554 8431 11293 12323 5860 -6664 -1118 8550 18170 8494 -5402 -3296 1434 -197
3438 -197 -5171 -24966 -30430 -32110 -26639 -11073 -3926 -10007 -8376 -3538 5385 1333 2033 8757 2303
3423 2303 24 11829 10326 -8480 -2016 562 -13389 -16859 -9916 -13272 -18539 -17798 -5745 817
3409 817 -13308 -13661 -4734 -3177 -7432 -14540 -13596 -20440 -21445 -17877 -16400 -11968 -18346 -13481 -3426
3394 -3426 3303 -1716 -15957 -9488 4127 -3144 -11907 -13068 -7122 -15889 -18087 -23938 -30734 -23251
3380 -23251 -12825 -11526 -8419 2430 9980 14823 5044 -10407 -20095 -17687 -724 3049 13441
3367 13441 19169 9825 -526 -14378 -16348 -9195 -10160 -9001 -12162 -9504 -2039 -2761 2243 7435 4448
3352 4448 0 -5642 240 5245 15375 -775 -16353 -20748 -1600 10286 2629 -8678 -13472
3339 -13472 -11487 -12617 -6996 -1642 -13737 -19970 -7734 8968 16272 14597 4144 7514 11080 -3453
3325 -3453 -10348 -7840 -7804 -12807 -12488 -6027 -6585 -9677 -7323 -13748 -13066 -9736 -5537 2918 8950 -2257
3309 -2257 -5995 -3248 -6450 -17473 -21024 -27397 -17748 -10523 -1910 2307 10764 6752 -7345 -6374 -634
3294 -634 8493 2952 -17381 -19598 -27040 -31911 -22495 -20206 -17440 -22361 -29815 -19071 -11910 -14050 -18604
3279 -18604 -13440 -3597 -640 3078 -18844 -22072 -13837 -4582 15821 29298 43018 40298 21905
3266 21905 2912 10038 17759 16235 14719 13917 9023 18292 27004 14686 23798 25975 19918 15300
3252 15300 11473 1588 2117 71 1459 -2821 -1917 -1916 -10961 -118 13619 11536 14020 17170 9587
3237 9587 6622 997 4486 15977 13734 12011 7272 -3705 -14062 -2871 12334 22403 19778
3224 19778 6714 14503 23498 15806 15213 16420 14172 20419 36625 29149 1102 -5301 -4916 -15316
3210 -15316 -23327 -3002 9220 7918 16113 12752 -613 7205 13447 12856 17605 14592 17981 34431
3196 34431 27173 14367 813 11999 6240 9457 9046 8444 -2770 -2853 294 4932 -4062 -7510 -1
3181 -1 -2238 -11868 -19103 -14011 -7295 787 636 -1480 -1456 2680 8937 -1910 -5888 -6407 -12585 -16292
3165 -16292 -17067 -24255 -9678 2206 2973 3987 7154 9571 9728 -12300 -21275 -7223 7661 5311
3151 5311 5443 10729 15327 21204 17269 1597 -6672 8085 18077 26396 7400 -7092 -10516 -5476
3137 -5476 -11868 -16605 -4635 -29 10333 14358 16923 11021 16600 17336 16390 3774 3529 5929 3792
3122 3792 6103 10276 9110 3170 -2453 -1772 -2253 61 7806 5579 13490 16656 14229 1562 -7432
3107 -7432 -3683 -2837 -9873 -4683 -4574 -4238 -10074 -22158 -25255 -14544 -8815 4655 8528 8597 12771
3092 12771 21572 20634 23952 11636 -3467 -3123 4178 2652 7831 5654 10154 16742 17017 11094 13341
3077 13341 8558 9823 17447 13257 8664 554 -1415 -20904 -31986 -29666 -32473 -28447 -16687 -8078
3063 -8078 -4067 -14327 -10554 -5284 -13788 -1378 5478 6782 6103 -18106 -19351 -16024 -11820 -3504
3049 -3504 -10374 -9637 -10855 -11105 -10690 -10101 -27065 -26660 -25613 -14138 -15992 -16863 -8089 -7656 -14604 -12283
3033 -12283 -10767 -14404 -5408 2655 3472 -1597 6467 19355 30280 25836 20787 5202 4215 14488
3019 14488 17457 12631 6027 8301 12318 2540 2433 5372 6157 -7035 -7450 -9094 -6530 -4598 713
3004 713 388 -11153 -2131 -1531 -2430 -9068 -20179 -16030 -14034 -19022 -4934 4787 7116 14414 -2025
2989 -2025 -6052 -10061 -21701 -22909 -9424 8165 10917 11021 15588 26134 24725 20461 11295 -8077
2975 -8077 -7211 -1267 -7539 -12249 -8684 -5567 12212 21745 10621 12039 13847 13310 12166 3456 1851
2960 1851 -2999 -6071 -6143 9007 10316 -2578 -9808 -10381 -19552 -24614 -12288 -6623 -3443 -3900 -5952
2945 -5952 -3543 -949 7617 3208 -9227 -17923 -11916 -2007 -4504 -6006 1443 -117 -95 -5552 237
2930 237 -4810 -4467 8971 9378 3114 -747 -2103 -15837 -17613 -18041 -24702 -10843 4266 -847 -2168
2915 -2168 -1407 -11689 -6348 1164 -3307 170 5560 10968 14004 8909 6726 13668 17429 14694 5344
2900 5344 4562 -8783 -7992 -13669 -8133 -2299 -7432 -5858 -7163 -10860 -8371 -8305 -7360 -6789 -4574 4681
2884 4681 14815 13365 3866 -5377 -2392 4972 7157 8302 16461 16298 12905 14076 9671 5361 -10457
2869 -10457 -17435 -13849 -10405 -12218 -17337 -18281 -9992 1320 10216 8250 16269 12445 145 12937
2855 12937 17331 11919 10033 17266 13496 4587 6284 9839 4240 -7420 -8181 8178 17058 16956 7674
2840 7674 -4341 -5720 6283 11695 17560 10003 4542 4294 39 -4375 1726 10494 -11805 -16801
2826 -16801 -6325 -7681 -5477 3039 -9105 -25079 -16815 -8486 -9711 -6435 -3978 -9878 -11372 -26973
2812 -26973 -17478 1942 17690 20707 14701 2608 -1468 15396 15818 21065 19980 8937 136 -1096
2798 -1096 -3442 -2490 -10122 -6700 -16623 -17717 -18883 -13004 -3061 -367 -16624 -18608 2932 7523 1219
2783 1219 -1889 2585 4900 12231 16718 14686 19738 19948 23432 16503 10465 -4359 -9480 -7446 -252
2768 -252 3423 -4376 -5129 6474 18870 24888 -15 -13998 -10400 -403 5707 14786 19357 17604
2754 17604 12280 232 -1948 -496 10039 11525 3967 6658 6249 5413 8681 15238 11580 5211 1633
2739 1633 1781 -1844 784 -3479 -14120 -11409 -1825 -6885 -11164 -14495 -15313 -13563 -10299 4108 7195
2724 7195 84 1986 1724 -273 -387 3716 12018 22114 19638 22816 27666 25844 32193 22589 19965
2709 19965 26427 21051 21428 17324 -196 9298 3963 -1319 3687 10970 10547 4719 5364 9641 13565
2694 13565 10103 -2868 -8162 -1696 1179 4171 8441 11969 2929 -198 2874 1791 1145 5797 14250
2679 14250 -2160 -13531 -5343 -124 -5236 -10618 4061 10790 6853 250 6137 -725 4740 10007
2665 10007 10382 6302 1075 9578 12010 3030 4939 -14004 -22545 -14732 -4359 200 3327 11931
2651 11931 1826 -3631 -2365 -8512 -16708 -8774 -1874 4436 1113 10197 9499 10719 9217 18451 18245
2636 18245 6592 13904 11419 6832 -401 9615 18639 12922 10703 16375 13236 11264 2696 1444
2622 1444 -5865 4582 23907 32070 12305 -7506 -15451 -17014 -10918 -5339 -12419 -14096 -7520 -1685
2608 -1685 5216 6259 -5031 162 -3823 -2514 1105 6400 1349 -9057 -3043 -3552 486 265 -14359
2593 -14359 -14306 -633 -2743 -7458 6974 17851 17931 10092 6545 12241 28651 27444 34978 39370 37163
2578 37163 35792 17666 1553 5020 13835 7540 5488 7767 10884 6342 609 9459 917 -15913
2564 -15913 -14544 -7601 -7556 -11229 -4320 -6730 -535 13442 14597 7122 5113 10960 16290 13044 13777
2549 13777 16729 15948 18928 9183 4965 -1166 7061 15124 6487 8520 11560 10327 12009 6047 7653
2534 7653 11655 12926 7794 12959 10058 1837 -3146 -12598 -4912 12311 2832 -13398 -14502 -10072
2520 -10072 -10738 -11103 -20796 -10261 4060 -5112 -17702 -8727 1829 -12768 -24667 -18934 -11798 -10837
2506 -10837 -13979 -9913 -2520 10729 12896 16680 19927 21546 13188 -477 693 -278 -1332 9545
2492 9545 23937 22423 13929 4810 -8883 -8709 2067 -672 8560 18251 29819 33939 18611 9713
2478 9713 10331 16435 5693 -334 2665 25436 44317 18351 -3272 -10492 -18166 -16388 2445 -1728
2464 -1728 -6093 534 5488 8894 -149 -13106 -27806 -18592 -10994 -4032 3294 10420 14107 5033
2450 5033 -7002 -4418 1869 -4218 4463 8067 4053 5082 -4970 -12288 -7753 12012 14564 4460
2436 4460 385 10410 11692 -4580 -13454 -9816 1894 -2832 -3608 1071 -2356 -1595 -4131 -13340 -6590
2421 -6590 -5173 -3753 5288 12950 15529 22563 20562 16146 1589 2273 -2541 2435 17479 10173 13740
2406 13740 27076 20317 3568 5507 -6431 -6594 -15927 -15160 -19462 -19902 -8897 -5846 -11451 -13326
2392 -13326 -22759 -31664 -28537 -20263 -6221 -4834 -8312 -12380 -25634 -15917 -10672 -8937 -13141 -32841
2378 -32841 -33479 -18171 -2737 -1749 5425 1663 9737 1653 79 8472 6511 780 -3229 -13947
2364 -13947 -17662 -5341 1586 2573 21694 21336 21740 6264 6829 3696 3740 16973 27808 30026 16996
2349 16996 7520 13427 16259 20970 11104 11016 2531 -14207 -16949 -14514 -12127 -18479 -13193 -2166 414
2334 414 3634 19425 15324 10459 6292 1071 -10976 -9397 -5660 -1769 -8448 -2039 -3536 -6008 -4983
2319 -4983 -4118 12166 16403 12900 14918 12401 -6717 -12731 1930 8991 8811 9780 1273 -10934 -13199
2304 -13199 -9743 -16567 -20941 -13520 4896 11548 14978 26174 39362 38891 19855 10910 14667 18717
2290 18717 3607 -14654 -14894 -6112 -6328 -2377 -9055 -7542 9060 349 -13140 -18156 -14433 -2679
2276 -2679 2686 2120 -6842 -8714 -3931 -1605 -10207 -14661 -21011 -15869 -5088 -13966 -21600 -6000 8424
2261 8424 18680 13289 10264 7748 -3433 -15466 -18649 -13162 -10166 -6466 -10629 -8947 -7411 -10120
2247 -10120 19 3798 13282 8539 868 -4634 -12308 -5421 2961 -6889 -10480 -4072 -8611 -283
2233 -283 8305 -6477 -19119 -11598 3121 9729 4109 -1904 -3504 10713 16810 7508 -2653 -225
2219 -225 5094 -2516 -11552 -5522 1810 -5409 3228 10872 8703 8716 6536 10969 14170 19915 17158 10186
2203 10186 13787 11932 4810 842 17534 21953 15298 13973 23639 22010 17026 8564 13949 17203
2189 17203 17138 10173 9616 974 -9741 -9790 -6613 1441 11894 721 -1666 -7006 -5972 968 -10709
2174 -10709 -11011 -3575 -9578 -19575 -14267 -9505 -169 3827 6692 -2117 -6218 1669 -2555 -12425 -16103
2159 -16103 -15346 -13396 -4193 -4184 -877 2295 7029 6285 -7987 -5406 -27332 -20503 -8348 2704 1163
2144 1163 -2314 1127 4353 -67 6013 7555 -515 -1411 -8645 -5253 4474 -4608 -13135 -17170 -17129 -20845
2128 -20845 -27870 -30397 -18898 -12379 -15983 -6303 -6088 -5251 -3746 -193 4535 7118 4003 6227 191
2113 191 -10026 -8451 -128 4373 358 -6503 -10923 -9427 -9315 -11032 -10056 4040 471 -3902 1369
2098 1369 -441 181 1772 16335 111 -6950 8525 8539 323 3957 12103 12171 22203 27594 27235
2083 27235 17195 7399 2716 -4920 -1879 -4705 -4551 4855 9986 3981 -4469 -12204 -13868 -11013 -8662
2068 -8662 -8607 -5734 -4720 4650 10576 6055 5581 -2892 -5564 47 5611 15179 7136 -456 -5665 -15362
2052 -15362 -20102 -27358 -21876 6089 11379 3561 -7524 -10592 -6578 -7371 -10751 -9167 -16400 -4938
2038 -4938 -7361 3984 674 -2678 -7430 -7566 -4418 -4548 5574 -1511 -14931 -15824 702 12206
2024 12206 -11162 -11639 -11872 -7060 3221 6505 3057 7049 10084 10705 7660 2109 -1669 1934 4686
2009 4686 11397 22159 21860 16065 11581 4376 955 17570 16812 14976 14113 15678 23312 19340 17543
1994 17543 7614 -8816 -14293 -17957 -22130 -19691 -14776 -35 21393 15829 -541 -5065 3240 4975
1980 4975 -9463 -5728 9454 9892 10501 9919 10125 6212 12648 14636 8485 8863 -613 -3827 -4122 -9242
1964 -9242 -12601 -3805 -6275 -6690 -6336 5178 5865 1793 12061 17198 17053 11712 7813 12421 12773 14394
1948 14394 10076 -1921 2774 -2859 -910 -1919 -1622 441 -7103 -10570 -14643 -2073 2216 -166
1934 -166 -193 -726 4314 7177 -9272 -18116 -24188 -4693 -692 -2508 -8630 460 4441 7839 4701
1919 4701 11882 21250 9692 11006 12271 19511 7671 -8111 -6590 -5736 5149 1523 645 -7391
1905 -7391 -9465 -11182 -12411 -13060 -3833 1738 18647 14251 15714 9624 9228 19428 19686 10258 9972
1890 9972 -1571 -3694 -7275 -1106 -6089 -13874 -9196 -4440 6798 6296 1981 3802 1181 -4366 -4099
1875 -4099 -3867 1091 7591 12145 15097 12656 4944 -6289 -2803 498 -8037 -6298 4520 10874 8621
1860 8621 2854 672 -10443 -19150 -22332 -25394 -25945 -26955 -22200 -21694 -19836 -9287 -8475 -10127 -7204
1845 -7204 4539 3126 -13264 -10037 8684 24476 4044 3548 11467 14032 8077 2022 -3628 -2816
1831 -2816 -1012 4605 4480 -3499 -342 -1270 -6227 -3005 442 6058 11405 9924 8240 14673 13196
1816 13196 3411 -7236 -13778 -16221 -6933 -1063 684 51 -202 -13879 -10659 -9051 -7526 -954 4250
1801 4250 -4424 -12920 -15292 -4971 7261 15038 18082 17994 7080 5042 -4438 863 9790 18772 13823
1786 13823 7164 -943 -4549 5353 8972 17605 20632 13047 837 -6104 -6971 -8197 -13431 -14803 -7020
1771 -7020 -4767 3579 6180 2819 5483 561 4228 -2919 -6126 -1488 -16346 -16464 -5136 -6668 -8795
1756 -8795 -5155 -16806 -17201 -15956 -5703 1995 -1215 5505 -4661 -23960 -23831 -26396 -24023 -16514
1742 -16514 -16112 -18779 -17484 -6126 -4113 -2186 -12070 -4752 -2516 -1340 -16240 -23703 -22784 -13663 -3166
1727 -3166 548 -3832 -451 -8068 -18305 -23257 -24357 -1767 3023 -4567 -11413 -12465 -10067 13794
1713 13794 17421 19733 4446 -650 10226 9808 8268 3487 6395 5098 5421 10864 8612 4582 8531
1698 8531 17534 21753 18208 15349 16969 14131 15890 25547 15963 1799 7664 19011 24609 13090
1684 13090 6 4518 1369 -1557 1343 -1417 -1260 5668 5958 -5241 -3618 5370 11645 5997 991
1669 991 -8279 -17142 -19503 -19483 -6394 4733 3064 -1326 910 -4091 -15695 -15860 -23495 -25653 -24360
1654 -24360 -25514 -14074 -3636 -2435 -3707 3646 197 -9398 -13425 -5855 -8468 -15082 -13511 -16636
1640 -16636 -15899 -8255 -12480 -10462 8844 17259 8350 4370 821 -4662 -3070 6669 13650 17898 11524
1625 11524 12846 7793 -1482 -3255 -807 -10672 -7221 -6554 7178 9163 13594 24440 13792 3023
1611 3023 -501 -8348 -11370 -15418 -8770 5995 -1344 -4487 -3532 -3219 2094 5356 -100 2157 10781
1596 10781 8238 7921 6919 6343 8158 11396 4786 3906 5745 7925 8976 9946 -11974 -4419 3251
1581 3251 7682 754 -9785 -5572 8976 5191 14799 27917 27292 16194 13894 22323 20230 4981
1567 4981 -3735 -12757 -16028 -14202 4070 16493 3224 -688 4968 896 5253 -7678 -4510 19580
1553 19580 31020 26940 18649 8983 16950 20020 -2665 -13869 -13930 -13655 -9984 -3601 8434 12782
1539 12782 13997 14305 11937 2771 -7880 -1202 18268 12403 12322 20838 24673 28918 25518 15005 9082
1524 9082 4928 -12631 -14016 -6844 -1891 84 -6724 -13940 -9427 4176 10727 16250 5890 3008
1510 3008 -18502 -20374 -14577 -7341 -2843 -6626 -1355 -4183 -7442 4303 3657 -10418 -2641 -3055 613
1495 613 9229 17234 11240 914 -4290 -10785 -9070 5824 6915 -1298 -3455 3977 2202 -3799 -6557
1480 -6557 -11286 -8765 -5456 -5493 17142 28088 12048 7661 17347 14617 11043 15737 16353 12901 9451
1465 9451 6185 5714 16273 15852 8749 12233 4567 5856 21749 25020 13463 10031 11910 -2253
1451 -2253 -9175 -3632 8563 6505 -969 -8478 -11945 -10321 680 4058 -45 -5003 -3908 0
1437 0 -11011 -17823 -12221 -918 7077 8772 7074 4243 -2575 -1886 -2490 8486 8419 18255 16098 11014
1421 11014 -4739 -8382 -14148 -18809 -593 3243 12288 16356 3072 -5604 2990 1510 5507 3508
1407 3508 2256 -8033 -14762 -24661 -27305 -20892 -12974 -3355 2137 -1536 -2644 -3854 1317 11977
1393 11977 14313 5841 -1109 -1870 -3858 -10215 -6758 10768 15569 24548 17845 4593 -1644 -11899
1379 -11899 7001 23462 10639 1995 2980 -924 6692 15360 20763 10723 -3815 -9939 5937
1366 5937 6580 -7909 -10000 -6250 -4879 963 2182 3772 -2101 886 8104 -9907 -17562 -12715 -5555
1351 -5555 -2426 2181 11027 7263 13698 21449 8770 3064 10298 24297 14725 1723 10439 17602
1337 17602 2800 -2606 2552 -5462 -1577 17101 18010 18038 11414 -3291 -17405 -14731 -11512 -8997
1323 -8997 -2380 3803 7956 16118 7739 -1530 -3167 -4111 -4442 -1521 -1539 -617 -2468 4328 556 -2735
1307 -2735 -10468 -10645 -8429 -998 9825 12051 8565 10872 11035 8627 11686 6700 -3229 -5374 -6774
1292 -6774 -11072 -18996 -13360 -5845 -9083 -18605 -19053 -20565 -17575 -6043 -8006 -4700 8826 16863 15540
1277 15540 5225 10769 4704 5118 5016 -4254 -13832 -19037 -17830 -18517 -17092 -6005 -1920 3741 4498
1262 4498 -4853 11005 19715 3709 -317 8720 9934 7726 -2276 1682 12311 14926 9312 9176
1248 9176 13950 25657 26200 21287 12907 1479 2017 3871 8479 4907 4383 7753 23958 27628 21868
1233 21868 20037 14848 4620 7214 13869 18791 30148 28090 15744 20425 25882 19047 15804 5395
1219 5395 230 -6518 -7344 -4764 3363 8960 9405 9241 2261 2562 615 9747 10464 5238 4983 -2613
1203 -2613 -13505 -20917 -14545 -3817 2039 -2725 2441 4026 -59 2818 9193 6971 -182 1045
1189 1045 8890 9749 2003 -1478 429 -1072 -16304 -28712 -31374 -10728 -8025 -14919 -15668 -7391 1335
1174 1335 8320 6556 11573 15374 22905 30309 27378 13028 9365 4717 286 -458 10283 16245 10542
1159 10542 -1700 -1360 -2314 2326 -7471 -11798 -11740 -11248 8795 12791 763 7217 9273 18058 18401
1144 18401 18561 948 -10137 -9794 -9750 -1994 6772 8996 3190 -3071 -11950 83 5363 10010 7752
1129 7752 1238 -7212 3566 17206 12560 -8504 -10696 3472 839 6094 5114 -4848 -6082 3897
1115 3897 4663 13239 7442 1068 6271 12039 10755 12809 5644 -6119 -12173 -9246 -799 4601 3239
1100 3239 -1920 3655 -5791 -4465 -3072 -469 6362 13816 11666 -2244 -16175 -5215 6561 15226
1086 15226 15752 14048 -374 -5967 -11304 -14029 -962 4784 -756 -1337 -3972 -4264 -9915 -12314 -15144
1071 -15144 -11148 -10590 3044 3170 -7553 -19409 -17220 -13763 -63 6877 13949 6662 3858 10359
1057 10359 18331 21513 15303 -1376 -9826 -16911 -22196 -24836 -25369 -15188 -6996 -5432 -2059 4625
1043 4625 4426 1479 6765 14640 9180 6392 1605 5267 2064 3874 1213 6788 7377 -623 -2560
1028 -2560 -1721 4335 9840 14415 10167 -9138 -13490 -4956 -13747 -19036 -2507 1554 14672 26573
1014 26573 8781 -418 -5797 -10484 -20562 -23705 -18022 -7305 -12377 -7107 712 959 -12639 -15477
1000 -15477 -9599 -6993 -5855 2056 9128 17251 6067 -10403 -2499 5917 7110 7867 -322 -2946
986 -2946 6092 6507 -3577 1380 11206 7286 -493 -192 1392 7108 10506 10219 19987 25518 26359 13271
970 13271 26186 21197 16052 4303 -3260 4957 17744 16541 11023 1687 5227 12350 20176 24616
956 24616 18731 4964 -924 2664 -3040 -3131 -10548 -13901 -9258 3853 -3648 -17572 -18091 -12555 -5687
941 -5687 -942 12145 19297 5396 -6549 -13281 -7167 4501 1313 4983 11301 4980 3211 1807
927 1807 11493 5208 -5631 -17020 -9852 11602 14840 16789 19357 13703 5404 -4022 -5073 -1919
913 -1919 -5156 2115 -2279 -10582 -20341 -28238 -23404 -10630 -15106 -17049 -9868 -11464 -4790 -1801 -4386
898 -4386 8324 17166 13347 14778 17603 16544 20750 23130 19492 12806 11349 18848 11548 -7029 202
883 202 972 1268 -434 -7614 -58 9943 1468 759 4322 3701 7952 11109 -1907 -9407 -10631 -1988
867 -1988 -3274 -12000 -16759 -3617 10366 14129 10169 747 -1750 11235 20687 13387 4681 -5343
853 -5343 -9802 -49 8246 8841 -721 -1953 -5109 -7812 -9129 -10695 5820 10516 8378 6154 15005
838 15005 16309 10510 15004 8552 -5426 6116 12347 6737 2004 8701 6899 7105 3792 -5546 1061
823 1061 13679 18936 11085 5238 16121 15559 12534 9899 9925 488 -4255 -7955 -10827 -17266 -21014
808 -21014 -1175 8726 9876 4228 6785 5340 -6965 -6093 -429 1378 -2544 -1633 7434 11430 7239
793 7239 8001 10097 8814 -7224 -22027 -20237 -5604 -315 4771 9606 -1848 2053 8196 22953
779 22953 25621 11841 4821 6392 11222 17622 23520 7269 -8530 -13923 -6990 3080 20 759
765 759 -13833 -17214 -14603 -15563 -6100 7654 2840 7548 11838 10619 17521 15679 9831 4824 13190
750 13190 26692 24425 19081 22236 12204 6626 -8060 -4559 6564 16553 21674 4852 -10420
737 -10420 -12466 -21615 -8850 9815 10240 11453 13783 12942 11765 -1269 -1936 -1503 10879 11290 1293
722 1293 -14902 -19374 -19072 -23510 -25797 -19590 -11947 -1724 8233 7128 -12054 -20280 -6154 -12303
708 -12303 -9013 -10849 -4169 -8286 -4425 -10891 -6689 1908 -158 -2593 -3831 -630 5370 10206 9312
693 9312 -254 -9168 163 12560 6242 536 -6301 -12648 -2426 9012 4623 7588 13716 -545
679 -545 1610 8739 5587 11707 15194 7558 1575 -2756 -4767 68 928 7069 6095 -2222 -603 6540
663 6540 15351 5272 -583 725 9192 2647 -1691 5135 4601 9398 5900 160 7300 6928 4718
648 4718 2679 10810 24202 21270 19419 10353 4417 -4578 -635 395 -5812 -7909 1363 5185 1160
633 1160 -547 5108 11725 23094 26451 23576 14263 8054 13018 7769 -6444 1275 9323 5244 -1554
618 -1554 3597 5415 3954 -5341 -14753 -10459 -19010 -12846 8617 17553 22930 15264 12667 11633 12054
603 12054 13330 9575 12399 8744 5729 1457 -11820 -15239 -8278 -5350 1687 1677 -11570 -12507 -1114
588 -1114 8325 -2423 -12970 -13491 -3719 10473 8944 714 2308 7539 -2420 -3478 12017 19295
574 19295 18245 3770 -1626 5734 6883 12722 15147 5695 -14064 -23005 -12735 -7963 618 -2238
560 -2238 -5186 -5894 -4793 -7097 -7045 -50 -83 -8527 -3732 4450 16309 14782 11802 11992 13891 4490
544 4490 -110 2845 7967 5283 5233 12236 18681 18017 9620 -1095 -28367 -31341 -27993 -17340 -7466
529 -7466 -3854 3670 -7867 265 8203 11296 11603 -4402 -11124 -3973 -1123 -2214 -2634 4977 911
514 911 -8834 -11131 -1499 -1034 -2068 8654 11857 11176 6577 3350 15236 10741 9716 2727 2681 -3831
498 -3831 -289 -4065 4014 4108 -6831 -12102 -4539 7078 -4656 -9368 -6609 -2935 -2620 4134 8661
483 8661 10946 6866 -1029 -10259 -3756 1095 -1918 3802 18660 20050 11036 4816 -6853 -5630 -5240
468 -5240 -8793 10041 11024 11633 9942 -4351 -1669 6771 17016 24279 21525 13179 10423 5738 2856
453 2856 5827 9030 12156 8914 3483 6076 -5617 -3092 6855 11765 6855 6153 7019 5152 7134
438 7134 16666 -6079 -14794 -21953 -19553 -19005 -14431 -15374 -14366 -12133 -1016 8135 30352 31639 24169
423 24169 18068 13212 11145 13796 14788 19879 25639 27068 23416 15953 12432 3361 -3386 -652 -4429
408 -4429 -7712 -13324 -18992 -7889 744 4326 2136 -3161 -5781 -8386 -16252 -36688 -36361 -22225 -3638
393 -3638 -5418 -12987 -7703 -10614 -10065 -5908 -12479 -16264 -12264 4521 11419 7229 4610 847 5822
378 5822 7511 5587 17287 24422 13983 10190 5369 -452 1800 -214 -2245 -8805 -12975 -10419 -13752
363 -13752 -13034 -17353 -12319 -8019 -5277 2920 10603 4414 10876 11810 16830 18232 10256 14885 8452
348 8452 7399 15616 11732 12170 15901 15486 870 -6109 -6140 -7645 11466 10488 -4985 -12566 -16580 -10365
332 -10365 -19410 -25149 -24498 -22641 -2397 9499 8698 -1952 2827 9370 14371 25103 16031 2160
318 2160 2345 4584 5656 2278 3322 820 5397 16658 17965 -551 -11492 -12575 -12162 -11288 1306
303 1306 17074 14324 -4114 -7923 -6051 4060 10014 6620 10814 790 -6405 -4034 8162 23718
289 23718 28361 29513 24614 13872 9237 3524 1865 738 2611 8243 15880 10998 4692 -3699 -10708
274 -10708 -11282 -5539 13180 16063 14994 11752 -332 -2286 18350 31157 25328 16636 9353 -1928
260 -1928 -2828 2937 -950 7659 4343 2873 -6056 5040 8631 3831 -1240 6400 9860 9689 11981
245 11981 9170 531 7623 3530 -8979 -1895 235 -4720 -11163 -12708 -16613 -15552 -8170 -521 -1902
230 -1902 -2971 12421 3387 -9649 -12463 -8920 8468 7505 3942 4078 9701 7534 5032 18936 22209
215 22209 11922 14850 7540 3278 1684 1962 6946 -571 -8378 -6040 -5478 -12988 -13462 -7635 -7192 -8965
199 -8965 -1973 5733 12549 17184 2981 -9720 -8307 -9610 -3431 3298 3282 -6945 -12865 -6427 7951
184 7951 6945 5289 1639 4799 6265 -1010 -7972 -6290 -1410 -4173 -9122 -1614 -2514 -8547 -277
169 -277 866 2188 248 4978 -169 2504 3959 -4732 -8944 -12931 -4116 -302 4453 10297 7361
154 7361 268 -3291 -1937 -2830 -6276 -17931 -16805 -10135 52 11530 8169 4820 -4294 279 1461
139 1461 -2224 70 -1793 60 5135 10468 6085 6838 -394 3292 13341 18048 13134 9863 8086
124 8086 8791 8222 12827 9716 2843 4284 12749 5796 2945 11123 11816 10202 6774 8897 11252 1079
108 1079 -3503 2625 7885 3759 10958 6069 -3408 -6843 2229 969 -4467 -2162 -1529 1862 -313
93 -313 3011 2351 2449 6939 1858 1606 -5641 -14630 -10952 -2584 9642 10775 7719 10159 15907 15849 11751
76 11751 1479 -747 -1965 1284 6102 8616 1900 -9124 1589 5308 5176 7806 8373 1900 -3286
61 -3286 -5371 -1395 -2705 1881 9380 13168 4200 -1124 -1444 -981 5624 3404 -1500 -3238 2861 -674
45 -674 -10036 -10178 226 504 228 -8531 -5416 1800 3188 -3030 -4344 -3925 -1864 -6755 -7039 1022 10601
28 10601 3035 -2801 7523 13356 15445 17486 15043 9830 1332 -3258 -4421 -405 10873 16220 5068
13 5068 -4997 -4517 -5673 -9188 -3480 620 -9130 -2627 -2521 6245 8174 10063 7706
0 7706
$$ Imaginary data points
##PAGE= N=2
##DATA TABLE= (X++(I..I)), XYDATA
32767 77099 78156 76181 72575 64927 64591 68692 68440 66745 73202 68825 61206 62271 67458 79513 89183
32752 89183 84936 88521 92292 91700 88739 83632 91483 88606 85255 84144 82280 81281 86153 86309 80746
32737 80746 79155 75168 70865 60900 67913 85369 94177 92423 98123 97530 95140 98242 90049 83424
32723 83424 81317 85088 78466 86190 100964 101825 94223 90576 85501 78641 83092 90366 96042 93955
32709 93955 90884 93762 96115 99110 85058 82942 89967 95053 92484 95620 108224 115624 111868 114131
32695 114131 115522 110653 105618 108902 116087 121801 124445 128373 127265 119090 119021 118373 116135 115290 112652
32680 112652 117249 116236 119311 121801 124028 129769 128424 120407 123595 123816 126638 123312 115766 112220
32666 112220 114882 121479 119288 125401 117082 114813 120683 124467 121345 125903 129826 127272 123449 117811
32652 117811 109428 117707 117146 109036 108627 120917 121871 120985 130240 123463 117060 113467 117000 129477 132913
32637 132913 127916 136091 139872 143799 143628 137744 130883 127351 132968 133521 131154 137762 142763 139479 139203
32622 139203 136880 135891 140795 143050 140264 134841 136133 135936 133299 132861 144883 152846 150525 133929
32608 133929 121857 115824 117088 129184 139234 134087 141426 149111 146886 152664 150759 152774 148988
32595 148988 145338 144502 149055 152072 150705 144178 143380 149423 149993 145828 153701 155303 148638 145042 151937
32580 151937 165334 163146 155297 151827 139170 138304 137927 145618 135999 143147 161049 168120 169553 169265
32566 169265 160626 161660 156383 154091 149825 152213 148380 150451 148187 153652 164556 163989 156907 155926
32552 155926 159973 167173 166637 167059 165604 173891 168875 168925 175723 171715 170943 178972 184394 183979 172929
32537 172929 161229 159314 153625 157644 172575 186333 196171 187983 176850 168593 163855 156466 157898
32524 157898 166324 171876 173245 174487 166572 165021 165505 173145 186918 193024 190336 180552 171271 172917
32510 172917 175855 186357 190462 181834 182386 187367 196697 191582 181749 182354 177664 168316 176912 188403
32496 188403 185590 175623 166628 167888 175709 179967 177226 179750 182252 177319 181523 176899 168761 169319
32482 169319 178677 187638 194912 201200 203268 196997 196259 203814 194584 187399 195141 198884 210565 221165
32468 221165 222081 220081 218949 220019 219286 208517 198495 196930 186337 183228 185442 183889 190048 193740
32454 193740 194042 200698 200950 192986 196406 194933 200320 210024 214816 214474 208660 201917 198027 199674 190834
32439 190834 189830 184593 182036 185670 190422 204821 206942 205159 211833 206287 210836 221304 228916 234113
32425 234113 228955 213250 201678 197417 190677 190227 201048 199324 207553 215977 212154 210384 211553 209026
32411 209026 201187 194819 194340 186760 193958 201459 200650 187809 180143 191159 209189 210596 209757 209024
32397 209024 204539 204664 201984 215097 213899 204800 213624 214038 219266 217097 215652 221102 224195 217156
32383 217156 204307 197515 201214 202721 199011 210479 217911 222745 216859 217368 213697 196162 199760 209305
32369 209305 219643 219136 211683 212713 216468 221643 214630 205308 213407 212111 223724 230276 222642 223247
32355 223247 221162 208231 211146 213058 199180 206006 206364 204492 210337 215702 213443 220053 225985 224228
32341 224228 217247 210433 204934 206372 213473 206451 214016 211367 210796 217388 228782 219528 199864 198605
32327 198605 200887 207141 213017 216176 216694 228271 219455 218665 221963 220138 218520 217989 208092 216725 227231
32312 227231 223737 208261 204505 210788 206787 200669 204833 216492 219926 223862 233084 225013 216198 209518
32298 209518 222852 230302 236638 239675 236796 224013 223088 223239 229135 240813 240848 241777 239265 238756 238904
32283 238904 233609 225427 226204 221814 225517 227407 225951 228644 232270 231444 242951 231796 220879 224261
32269 224261 226028 226618 227145 222633 225554 221205 214521 213484 227855 236699 229578 221617 225791 219082
32255 219082 219037 223121 222971 224879 220485 224987 229997 229204 237635 237995 231088 231478 233623 233337 227138 216496
32239 216496 220291 235667 238766 243884 249157 245586 239362 238562 236842 227513 228166 235124 238824 254179
$$ [...]
##END NTUPLES=NMR SPECTRUM
##END=
