##TITLE=Analysis number 315021
Compound Code cc 27224
Book Reference 422/125
Project Code adrs
Chemist Name robb
##JCAMPDX= 6.0         $$ Bruker NMR JCAMP-DX V2.0
##DATA TYPE= NMR SPECTRUM
##DATA CLASS= NTUPLES
##ORIGIN= Bruker BioSpin GmbH
##OWNER= NMR
$$ XWIN-NMR		Version 3.5
$$ Thu Nov  3 09:27:53 2005 GMT Standard Time (UT+0h)  MAYBRIDGE\NMR@NMR_250MHZ
##.OBSERVE FREQUENCY= 250.131544655141
##.OBSERVE NUCLEUS= ^1H
##.ACQUISITION MODE= SIMULTANEOUS (DQD)
##.ACQUISITION SCHEME= undefined
##.AVERAGES= 16
##.DIGITISER RES= 18
##SPECTROMETER/DATA SYSTEM= dpx250
##.PULSE SEQUENCE= zg30
##.SOLVENT NAME= CDCl3
##.SHIFT REFERENCE= (INTERNAL, CDCl3, 0, 16.422)
##AUDIT TRAIL= $$ (NUMBER, WHEN, WHO, WHERE, WHAT)
$$ ##TITLE= Audit trail, XWIN-NMR		Version 3.5
$$ ##JCAMPDX= 5.01
$$ ##ORIGIN= Bruker BioSpin GmbH
$$ ##OWNER= NMR
$$ C:\u/data/dgb/nmr/ADRS/11860/pdata/1/auditp.txt
$$ ##AUDIT TRAIL=  $$ (NUMBER, WHEN, WHO, WHERE, WHAT)
(   1,<2005-11-03 09:27:21.07 +000>,<MAYBRIDGE\NMR>,<NMR_250MHZ>,
      <created by zg, POWCHK disabled, PULCHK disabled
       configuration hash MD5:
       62 19 C7 07 E1 42 D1 B7 37 6C 3D D0 77 39 F9 E6
       data hash MD5: 64K
       CB 5A 7A 60 C6 7D 01 BE B8 C6 63 AC E3 FB 76 37>)
(   2,<2005-11-03 09:27:36.11 +000>,<MAYBRIDGE\NMR>,<NMR_250MHZ>,
      <Start of raw data processing
       ef LB = 0.3 FT_mod = 6 PKNL = 1 SI = 32K 
       data hash MD5: 32K
       C0 2A DB 9A CB B7 9A 44 D1 27 8F E9 B4 68 E7 9E>)
(   3,<2005-11-03 09:27:38.14 +000>,<MAYBRIDGE\NMR>,<NMR_250MHZ>,
      <apk 
       data hash MD5: 32K
       A9 43 77 7F FC 23 72 65 99 38 27 A8 13 E8 87 1C>)
(   4,<2005-11-03 09:27:39.25 +000>,<MAYBRIDGE\NMR>,<NMR_250MHZ>,
      <abs ABSG = 5 
       data hash MD5: 32K
       94 72 07 0D 93 37 1C 26 3C 4C 98 71 68 5C 86 A0>)
$$ ##END=
$$ 
$$ hash MD5
$$ 39 6B 66 6A 29 48 F2 EC C9 3F 43 08 B0 2F 1B 40
##$RELAX= 
##$RELAX= 
##$RELAX= 
##$RELAX= 
##$RELAX= 
##$RELAX= 
##$RELAX= 
$$ Bruker specific parameters
$$ --------------------------
##$DU= <C:\u>
##$EXPNO= 11860
##$NAME= <ADRS>
##$PROCNO= 1
##$TYPE= <nmr>
##$USER= <dgb>
##$AMP= (0..31)
100 100 100 100 100 100 100 100 100 100 100 100 100 100 100 100 100 100 
100 100 100 100 100 100 100 100 100 100 100 100 100 100 
##$AQSEQ= 0
##$AQ_mod= 3
##$AUNM= <au_zg>
##$AUTOPOS= <3 >
##$BF1= 250.13
##$BF2= 250.13
##$BF3= 250.13
##$BF4= 250.13
##$BF5= 500.13
##$BF6= 500.13
##$BF7= 500.13
##$BF8= 500.13
##$BYTORDA= 1
##$CFDGTYP= 0
##$CFRGTYP= 5
##$CHEMSTR= <none>
##$CNST= (0..31)
1 1 145 1 1 1 1 1 1 1 1 1 1 1 1 1 1 1 1 1 1 1 1 1 1 1 1 1 1 1 1 1 
##$CPDPRG= <>
##$CPDPRG1= <>
##$CPDPRG2= <>
##$CPDPRG3= <>
##$CPDPRG4= <mlev>
##$CPDPRG5= <mlev>
##$CPDPRG6= <mlev>
##$CPDPRG7= <mlev>
##$CPDPRG8= <mlev>
##$CPDPRGB= <>
##$CPDPRGT= <>
##$D= (0..31)
0 1 0 0 0 0 0 0 0 0.06 0 0 0 0 0 0 0.0002 0 0 0 0 0 0 0 0 0 0 0 0 0 0 
0 
##$DATE= 1131010040
##$DBL= (0..7)
120 120 120 120 120 120 120 120 
##$DBP= (0..7)
150 150 150 150 150 150 150 150 
##$DBP07= 0
##$DBPNAM0= <>
##$DBPNAM1= <>
$$ [...]
##$SUBNAM7= <"">
##$SUBNAM8= <"">
##$SUBNAM9= <"">
##$SW= 20.6930455092707
##$SWIBOX= (0..15)
0 0 3 0 0 0 0 0 0 0 0 0 0 0 0 0 
##$SW_h= 5175.983436853
##$TD= 65536
##$TD0= 1
##$TE= 296.16
##$TE2= 300
##$TE3= 300
##$TEG= 300
##$TL= (0..7)
0 120 120 120 120 120 120 120 
##$TP= (0..7)
150 150 150 150 150 150 150 150 
##$TP07= 0
##$TPNAME0= <>
##$TPNAME1= <>
##$TPNAME2= <>
##$TPNAME3= <>
##$TPNAME4= <>
##$TPNAME5= <>
##$TPNAME6= <>
##$TPNAME7= <>
##$TPOAL= (0..7)
0.5 0.5 0.5 0.5 0.5 0.5 0.5 0.5 
##$TPOFFS= (0..7)
0 0 0 0 0 0 0 0 
##$TUNHIN= 0
##$TUNHOUT= 0
##$TUNXOUT= 0
##$USERA1= <user>
##$USERA2= <user>
##$USERA3= <user>
##$USERA4= <user>
##$USERA5= <user>
##$V9= 5
##$VALIST= <valist>
##$VCLIST= <CCCCCCCCCCCCCCC>
##$VD= 0
##$VDLIST= <DDDDDDDDDDDDDDD>
##$VPLIST= <PPPPPPPPPPPPPPP>
##$VTLIST= <TTTTTTTTTTTTTTT>
##$WBST= 1024
##$WBSW= 4
##$XGAIN= (0..3)
0 0 0 0 
##$XL= 0
##$YL= 0
##$YMAX_a= 755682
##$YMIN_a= -615122
##$ZGOPTNS= <>
##$ZL1= 120
##$ZL2= 120
##$ZL3= 120
##$ZL4= 120
##$ABSF1= 16.42197
##$ABSF2= -4.2712
##$ABSG= 5
##$ABSL= 3
##$ALPHA= 0
##$AQORDER= 0
##$ASSFAC= 0
##$ASSFACI= 0
##$ASSFACX= 0
##$ASSWID= 0
##$AUNMP= <proc_1d>
##$AZFE= 0.1
##$AZFW= 0.1
##$BCFW= 0
##$BC_mod= 0
##$BYTORDP= 0
##$COROFFS= 0
##$CY= 12.5
##$DATMOD= 1
##$DC= 0
##$DFILT= <>
##$DTYPP= 0
##$F1P= 14.0000005364418
##$F2P= -0.99999901652339
##$FCOR= 0.5
##$FTSIZE= 32768
##$FT_mod= 6
##$GAMMA= 0
##$GB= 0
##$INTBC= 1
##$INTSCL= 1
##$ISEN= 128
##$LB= 0.3
##$LEV0= 0
##$LPBIN= 0
##$MAXI= 10000
##$MC2= 0
##$MEAN= 0
##$ME_mod= 0
##$MI= 0
##$NCOEF= 0
##$NC_proc= -1
##$NLEV= 6
##$NOISF1= 0
##$NOISF2= 0
##$NSP= 0
##$NTH_PI= 0
##$NZP= 0
##$OFFSET= 16.42197
##$PC= 1
##$PHC0= 71.05425
##$PHC1= 7.038287
##$PH_mod= 1
##$PKNL= yes
##$PPARMOD= 0
##$PSCAL= 4
##$PSIGN= 0
##$REVERSE= no
##$SF= 250.130025018257
##$SI= 32768
##$SIGF1= 0
##$SIGF2= 0
##$SINO= 400
##$SIOLD= 32768
##$SREGLST= <1H.CDCl3>
##$SSB= 0
##$STSI= 32768
##$STSR= 0
##$SW_p= 5175.98343685301
##$SYMM= 0
##$S_DEV= 0
##$TDeff= 65536
##$TDoff= 0
##$TI= <Analysis number 999999
Compound Code 99
Book Reference 9
Project Code 9>
##$TILT= no
##$TM1= 0
##$TM2= 0
##$TOPLEV= 0
##$USERP1= <user>
##$USERP2= <user>
##$USERP3= <user>
##$USERP4= <user>
##$USERP5= <user>
##$WDW= 1
##$XDIM= 32768
##$YMAX_p= 301592313
##$YMIN_p= -170233
$$ End of Bruker specific parameters
$$ ---------------------------------
##NTUPLES= NMR SPECTRUM
##VAR_NAME=  FREQUENCY,     SPECTRUM/REAL,   SPECTRUM/IMAG
##SYMBOL=    X,             R,               I
##VAR_TYPE=  INDEPENDENT,   DEPENDENT,       DEPENDENT
##VAR_FORM=  AFFN,          ASDF,            ASDF
##VAR_DIM=   32768,         32768,           32768
##UNITS=     HZ,            ARBITRARY UNITS, ARBITRARY UNITS
##FACTOR=    0.157963299565203, 1,           1
##FIRST=     4107.62785885475, 0,            0
##LAST=      -1068.35557799826, 0,           0
##MIN=       -1068.35557799826, -170233,     0
##MAX=       4107.62785885475, 301592313,    0
$$ Real data points
##PAGE= N=1
##DATA TABLE= (X++(R..R)), XYDATA
$$ [...]
20576 -8038 -7517 -6445 -3246 -1415 -2775 -1825 -501 -2493 -2491 -2785 -5005 -4326 -5665 -5928 -5430 -5440 -4276
20559 -4276 -3275 -1108 -3634 -7382 -8339 -9681 -8031 -7120 -6475 -4664 -3160 -2392 -1214 210 -1588 434
20543 434 269 400 626 -143 -2029 1643 293 -301 -2991 -4021 -2083 -2374 -3546 -2020 -556 -968 1227
20526 1227 1386 -4619 -5501 -3353 -1572 -2487 -3100 -717 -1182 -1741 -323 390 717 -406 -4189 -6118 -3644
20509 -3644 -1386 -191 -1545 -108 970 -366 967 2666 -599 -3861 -5406 -3681 -1329 -959 3055
20494 3055 4491 4241 2280 1024 490 65 -964 1238 2209 -1179 3058 1015 -3501 -4342 -2147 -531
20478 -531 -1803 -4782 -2333 -265 1029 2648 1086 -89 1768 -1883 -2095 1723 160 -949 -1287
20463 -1287 -2808 -5923 -2813 -3230 -815 765 -1235 -3562 -4985 -5285 -6597 -4435 -1055 -929 -3402
20448 -3402 -1727 -502 1144 416 -1995 -2738 -1081 2768 5818 109 -4036 -5885 -6989 -3372 1121
20433 1121 1761 -681 -5077 -5642 -4947 -4725 -3821 -3098 -5426 -5788 -5885 -3069 -345 98 -379 -1485 455
20416 455 3601 5301 -816 -3816 -1457 -81 -1145 748 -221 -3471 -4964 -3541 -3345 -4053 -3931 -753
20400 -753 -3061 -5681 -5352 -4435 -2891 -3945 -2455 -2751 -4895 -4282 -4240 -6010 -5175 -6127 -6217 -4132 -3155 -2939
20382 -2939 -2194 -2188 -4560 -3811 -1677 -691 -539 1718 3794 1724 38 -3042 -4010 -345 -317 -3798 -4089
20365 -4089 -2990 -551 -1467 -1020 -2730 -5314 -7495 -6431 -5713 -6264 -5964 -3703 -1779 1196 778 856 409
20348 409 -1475 -5377 -3764 -394 20 -2596 -2825 -605 -1761 -365 4754 6455 1367 -552 -1969
20333 -1969 -3706 -2909 -3592 -5382 -8449 -8878 -6894 -5340 -5604 -6360 -5915 -4500 278 2583 748 1516
20317 1516 1421 96 -1047 -3649 -2766 -31 3848 2946 -1122 -2703 -2001 -2185 -2730 -2606 -2787 -3766 -4936
20300 -4936 -3199 -2130 -1095 -4629 -5287 -4529 221 2166 -523 -760 -1331 -675 -169 3099 5863 7216
20284 7216 2700 -253 -1892 -687 -598 2893 3091 3475 5708 4127 1909 430 -2442 -3038 -2551 -698
20268 -698 -862 -2023 -2021 -2086 -264 -877 -2853 -1944 -4858 -6528 -5966 -4226 -440 2249 -1024 -3556 -2768
20251 -2768 -1846 -871 3201 3683 2981 1584 3980 1273 2459 2443 1024 771 2059 3825 4927 2977
20235 2977 2148 2514 2841 -607 -741 -3760 -3895 -2672 -5380 -4734 -4755 -5120 -4333 -1407 915 3947 3972 1141
20217 1141 -2917 -4512 -2731 -1936 -1141 627 902 1116 158 -539 -1078 -888 -775 -881 -2313 -4087 -4820
20200 -4820 -5478 -7007 -6026 -5459 -4004 -1088 1320 -497 -1431 -1932 -1985 -578 1641 -5078 -10527 -6909
20184 -6909 -3967 657 1255 2373 1056 -395 -1020 -2498 -4179 -4311 -2959 -3511 -3348 -446 1683 -2460
20168 -2460 -2715 -4646 -6750 -5287 -4696 -4300 -2009 1138 371 3600 2280 -2371 -667 142 -1073 -1561
20152 -1561 -1517 2306 2807 953 512 1855 2518 2866 7 518 580 -789 541 2717 1836 2315 2441 -29
20134 -29 -3131 -515 891 299 -1443 -771 -762 -308 -2827 -4877 -2044 339 -1660 -2938 4280 2772 682
20117 682 -434 -1022 -3502 -2810 -3383 -4228 -7159 -7257 -4967 -1441 -963 -3963 -4816 -2876 -1205 -4097 -6441
20100 -6441 -5047 -2229 -3580 -5828 -3674 -3478 -4994 -2352 -457 -1210 3388 4965 1831 1017 270 -2633
20084 -2633 -6154 -5635 166 1494 319 -522 -2116 -3285 -1737 1853 727 1323 -1435 -2245 -1165 -3634
20068 -3634 -4553 -3012 24 -1890 -2599 -3078 -2922 -3030 -2848 -1732 3506 4790 3459 1353 -3286 -4882
20052 -4882 -2633 -3231 577 4963 3206 2852 5272 7500 6399 4222 3226 3861 2494 -417 -148 1907
20036 1907 -232 582 2993 2493 2875 177 -506 2721 6663 6697 857 -4927 -4695 -3565 -4868 -6880
20020 -6880 -8564 -9645 -8023 -4956 -3431 -2374 -5191 -4265 -2527 -2400 -3551 -3533 -3991 -2757 -1628 2092
20004 2092 2832 977 2577 501 -813 -607 -1560 -479 1773 2161 3280 1977 -2455 -4375 -1869 2590
19988 2590 2305 1730 3700 4733 6256 4982 5796 4849 2867 -1295 -6010 -2707 -2132 293 -437 -907
19972 -907 -1277 -2278 -3582 -3972 -4339 -2891 -1462 -138 -832 -91 -1116 -4230 -5462 -3762 -2427 -2126
19956 -2126 -2368 -802 -313 1253 3984 4531 1567 144 -2023 -6954 -5856 -3710 -4010 -2147 2741 4970
19940 4970 3099 -2304 -3834 -3849 -4504 -4088 -2753 -1160 -4065 -3798 -3765 -1522 -1066 537 995 1260 1882
19923 1882 -2073 -1128 -2545 -4148 -2335 -534 -201 -1898 -2541 -966 -2713 -2101 -3180 -3685 -5161 -5708
19907 -5708 -5982 -5264 -3292 -2138 -511 -1905 -3895 -4378 -2619 578 134 -1274 624 729 1348 -901
19891 -901 -1023 -1878 1174 1745 1238 -652 -2839 -3664 -2441 -4815 -6231 -6251 -6564 -6097 -4628 -2687 -290
19874 -290 2693 5460 4553 1825 1616 939 4559 5645 3130 1901 1411 -505 -2275 -873 3292 2531
19858 2531 -1894 -1129 -1875 -2378 -238 1509 1389 -686 -3167 -5560 -10045 -7970 -3009 -551 -791 -2431
19842 -2431 -233 69 -795 -969 1714 3005 914 -404 -609 -651 -2490 -1914 698 2504 2316 903 -1456
19825 -1456 -2412 -290 52 -971 -2572 -3647 -2599 -1945 -758 -1339 -591 -3306 -2432 -2112 1758 3152
19809 3152 1547 -1930 -4535 -5906 -4833 -8926 -7064 -3218 1822 -78 -1757 -1446 -4299 -2350 -2747
19794 -2747 -4635 -4630 -2300 -2963 -1553 -175 -235 -1418 -3930 -1438 -2315 -5804 -7015 -4334 -2733 -3662 -2735
19777 -2735 -1872 13 2463 3220 2931 -1038 -6715 -8627 -7919 -6412 -4687 -3320 -1638 -3435 -4094 -2917
19761 -2917 -2235 -2679 -3038 -3143 -776 2227 5024 3051 2901 4692 5006 1801 1024 2736 3759 3215 1896
19744 1896 -1177 -344 -301 1441 -683 2056 2468 5509 7633 4766 4101 1053 1561 -385 -787 334
19728 334 -1714 -410 1017 1870 1793 1032 2465 5637 3311 1579 2578 2611 344 167 3691 288 -865
19711 -865 -2921 -4918 -2575 -2627 -4615 -6222 -8663 -8317 -8236 -5654 -3693 -3872 -1099 -1535 -763 -389 -1515
19694 -1515 -3276 -7083 -7069 -4944 -2878 -292 119 1197 -745 162 -1195 -3849 -4576 -3187 -2301 -2002
19678 -2002 -1460 -1720 -3108 30 -1849 -2842 -4268 -5887 -2981 -1383 -1899 -2155 -2979 -1019 731 -100
19662 -100 3911 5789 5236 1899 -984 -1346 -826 -3316 -3944 -5010 -6472 -3444 1210 2300 1901 319
19646 319 1550 1046 99 -4423 -5562 -2890 1068 -1941 -5686 -2526 983 1950 -474 1484 -1049 -1881
19630 -1881 1350 3342 1121 -674 -2518 -3211 -2345 -3329 -3128 -346 -359 -2291 -1941 731 1989 5538
19614 5538 3471 836 -289 -323 3015 5853 5488 4992 2342 1511 3675 4566 3044 821 809 148 -418
19597 -418 -6063 -8741 -6865 -6729 -4532 -5442 -5242 -5387 -4306 -420 1859 818 2018 4173 1989 1043
19581 1043 1179 3457 2080 912 397 -1412 -915 -21 -934 -1773 -2969 -1794 -2563 -1680 -2428 -4971 -3909
19564 -3909 302 795 -1629 -5249 -5558 -4718 -3177 -2113 -2089 -2557 -2513 -2774 -2576 755 1019 1174 1634 -640
19546 -640 -2545 -1985 -3001 -1287 -920 -1089 -1604 -181 1509 63 1419 2321 2693 -428 -1254 874 -3056
19529 -3056 -1313 -1439 -1466 2641 4136 3186 1523 624 51 -283 -3141 -3111 1005 1566 -460 -2793 -7472
19512 -7472 -8547 -5232 -5187 -4107 -3207 -2062 1815 3644 3928 902 -1020 1766 1559 527 493 -176 1962
19495 1962 8775 9519 6182 2716 3917 5906 7760 11037 11245 7929 4387 3116 3299 3443 6512 8482
19479 8482 9733 10085 5893 1709 1196 1324 2535 3439 4149 4373 3819 1409 -777 -5062 -4443 -2836 -188
19462 -188 8377 9269 7827 6312 5680 6156 4182 -2122 -151 4191 2401 1194 -2096 -2641 -1624 1244
19446 1244 1711 1103 1081 348 2680 3412 4642 3242 3500 2775 2910 3179 2078 55 -2816 -2888 -2351 796
19428 796 4183 2034 2685 -1084 -9150 -8662 -2161 2610 3316 1833 2089 1183 814 1533 546 -629 1292
19411 1292 -1465 -2703 1206 3712 5897 13829 20078 22925 21769 28782 34375 35954 39554 41074 42231
19396 42231 43241 45522 44446 40778 37448 33537 30301 27030 22110 18041 13683 11276 12020 10277 8616
19381 8616 6831 5434 2056 -887 -1955 -2688 -2160 -1072 371 2648 788 -3162 -5702 -3183 -3151 -3492
19365 -3492 -1254 1096 3909 2649 1770 247 -2243 -2281 -1094 -91 -1863 -4333 -5359 -3616 953
19350 953 4166 3186 -1227 -2328 -2546 -1199 -1970 -1600 1526 4359 5646 5369 8300 4817 2728 2455
19334 2455 5335 9583 7355 2873 6055 6956 6824 8336 8941 8756 6744 5470 5720 4524 3120 1230
19318 1230 -844 -1619 -2267 538 -84 -1564 -2237 2547 4118 3421 1767 1031 -2842 1652 5879 7021
19302 7021 5954 3947 3385 2154 4561 1738 -2806 -1570 -697 -1823 -2140 -713 1102 1978 2255 4322
19286 4322 3525 2749 3229 2067 224 488 1116 -965 -3483 -3293 185 3198 3822 -1412 -4057 -4099 -6354
19269 -6354 -6324 -5696 -1829 -709 -1494 -3558 -6849 -5731 -3794 -3313 -5077 -4746 -1013 2344 3023 3572 4919
19252 4919 5250 7809 6472 6284 7110 6846 5742 4140 2503 3842 5102 5839 5132 6047 5402 3213 -1720
19235 -1720 -1505 2966 4167 2835 2645 2949 -759 -1615 946 1741 2904 296 -143 -981 -1979 -267 248
19218 248 1483 749 503 -2815 -6325 -6839 -7378 -7437 -7673 -6931 -3344 -1032 -336 919 1286 -2715 -4522
19201 -4522 -5900 752 6056 5395 6853 5089 6760 6856 5535 3797 2421 -224 1386 1917 4740 8906
19185 8906 9232 6499 2395 1135 1580 707 1340 3057 5426 2509 -1735 -1874 28 -1998 -1600 1131
19169 1131 2984 7718 4912 -962 -3081 -4026 -4767 -1549 552 471 -1747 -3695 -4416 -2198 -819 -2007
19153 -2007 -3995 -5872 -5162 -500 -86 -315 -2963 -3406 182 838 1732 1955 -571 -1310 63 -168 -3972
19136 -3972 -6445 -4677 -3641 -3069 -1003 420 3610 2636 -705 -4386 -3404 -4127 -879 606 2220 134
19120 134 -1213 -440 -1044 -528 1643 4923 8037 4708 2364 2472 4854 4858 5867 6363 3969 1848 2422
19103 2422 367 -855 248 3766 1191 -564 -1095 -1235 -1964 -3933 -4251 -866 2186 1256 3721 1688
19087 1688 -488 1613 5309 4798 1973 2508 4370 6430 6215 6918 5621 4980 -632 -2883 -3172 -4771
19071 -4771 -1831 -1841 -1804 -832 1874 1822 -2001 -2204 -720 -4357 -1585 1164 3687 5344 3838 4263 1411
19054 1411 -338 2027 3802 2858 2517 2230 347 -4066 -5844 -4633 471 4397 6054 5191 3371 2565
19038 2565 3754 5391 3447 1906 -523 575 2102 3026 3489 2500 2597 274 -380 1513 3516 5270
19022 5270 2957 2410 3155 4897 6025 5236 4785 4357 1102 870 -1542 -1246 -814 -2691 -2161 -39 4295
19005 4295 5045 4311 6741 6882 4317 4909 4345 -1180 -1130 -547 885 4277 3902 1232 88 -883 -106
18988 -106 3769 6259 4712 4034 3232 -441 -3701 292 3582 786 -2030 -386 -2587 -5900 -4191
18973 -4191 848 4239 3992 -533 -2143 -3170 -2428 -2718 -609 -519 -525 -2281 -3697 -2215 56 662 1051
18956 1051 -2478 -1478 -1040 -1255 -187 -627 -2323 -5366 -2328 1203 1855 309 48 -1134 -661 1695
18940 1695 4465 2955 -2784 -5148 -2237 -1272 -3065 247 1402 -313 -2449 -3183 -529 -240 242 1098
18924 1098 1865 698 1793 -29 950 -226 -2328 897 2951 1545 -1581 -1604 -1348 -1911 -2178 -3101 1265
18907 1265 1234 1657 2979 1375 1371 1173 2478 2294 -863 -3651 -3889 -6893 -6529 -5124 -2920 -1176 -2369
18890 -2369 -532 2587 354 829 1044 2598 3056 -1154 -3156 -4352 -3962 -4765 -7790 -6054 -1998 -1618
18874 -1618 -1670 -353 -2456 -595 345 1161 2570 2209 2448 3948 2600 -714 -3715 -4233 -6737 -6535 -3563
18857 -3563 -777 2050 1359 -326 -1163 -4561 -5409 -3778 -2645 -4358 -4557 -4149 -3399 -113 -1088 -520 -490
18840 -490 2762 5160 2865 2599 3498 -570 -1613 3234 184 -1334 -1360 -470 -240 -917 1784 4244 3080
18823 3080 1297 -259 1165 1315 1828 4844 5248 2897 3441 3637 5592 6068 7274 7690 6970 3598 714
18806 714 1043 763 2240 1451 1275 4127 5481 4811 823 -1203 -793 501 -1705 -4087 -5554 -2327
18790 -2327 1390 867 1791 1743 -863 -620 943 -2882 -949 980 1572 4109 4583 5560 7930 7102 5451
18773 5451 8215 9595 9995 9747 9415 7668 9739 12380 18957 27088 31108 29178 23409 16189 9785
18758 9785 8932 9087 8035 7647 5446 8071 6900 2521 1096 784 -315 -1709 -908 42 -1177 514
18742 514 631 1838 2381 873 3124 5866 5462 3779 3507 4341 5274 4083 5559 1787 16 3086
18726 3086 3276 4746 5559 8025 9912 9030 9021 4777 3085 544 1696 984 -251 3016 2907 1876 1676
18709 1676 3201 4221 3937 5252 4454 4032 4125 3508 2958 4207 5860 5192 4632 1543 2241 5973 6111
18692 6111 4826 9805 11676 11338 12704 13477 10273 8197 9215 11045 11817 12879 14555 13274 7221
18677 7221 4188 5913 7510 10058 8302 8198 12854 10555 6638 4138 2189 576 1528 4530 4020
18662 4020 135 -1367 -1410 -748 -242 2904 4083 4770 3290 933 2468 3590 3659 4705 3531 -540
18646 -540 67 1645 4201 4577 4647 1664 89 178 1297 2241 1203 -1197 1007 2600 6955 10270 12198
18629 12198 13123 11670 12969 13254 14429 15063 20040 21262 17583 13190 16481 15008 11583 12817 12754 11541
18613 11541 10714 8487 7043 5162 4396 5724 6469 5674 8883 10189 9583 8539 7354 6655 3729 5674
18597 5674 11143 13416 12999 9862 8474 6571 5647 4204 4335 4557 5645 4665 6806 6637 5684 8373
18581 8373 8390 5306 5294 6256 4780 7107 11646 12550 11315 11861 14333 14163 14714 14441 16076 17683 17397
18564 17397 15161 11379 10519 10951 7910 5215 5494 6945 6450 6888 8505 9122 7859 10107 12804 12028
18548 12028 13515 12686 11054 9376 9187 5630 3833 4174 4932 5913 4494 3606 3178 3345 4115 4632 8338
18531 8338 7500 3563 3429 5166 8874 7114 4147 6125 5438 3301 3808 1026 1684 3310 3511 5746
18515 5746 7181 8385 10222 8748 4771 6816 7026 6897 8002 8691 7634 7150 8567 9653 7540 7702
18499 7702 6630 8054 11436 11448 8711 9265 8467 5683 2861 480 -482 -20 -398 3214 6928 7876 11199
18482 11199 12915 11218 9838 5836 6203 10905 16161 15198 13149 13447 15208 14424 14339 17114 23475 27461
18466 27461 34992 41319 42749 44410 48357 56764 61530 65943 66458 70205 73823 77273 76134 73907 73302
18451 73302 67386 62035 56405 53064 47726 41001 36409 34919 28906 24471 23981 20814 19068 17684 14352
18436 14352 13411 16915 16729 15433 15272 15806 17078 13604 12286 12138 10532 12321 15843 17073 18885 22782
18420 22782 28278 33658 38048 42479 45318 49422 54327 59968 66278 71301 72676 74104 75312 76513
18406 76513 79466 81500 80928 76598 74887 73257 69677 70067 65689 61082 56072 52179 47232 44648 47944
18391 47944 55123 63598 71338 74830 76324 74936 72465 71893 71868 72845 72542 68447 62720 53892 46137 42586
18375 42586 41877 42379 42164 39305 34003 29208 24133 20184 20837 16500 15029 15953 14251 13345 11367 13066
18359 13066 12240 14044 17016 20388 20604 20898 19298 18198 23427 32907 39165 40987 43067 46530 56971
18344 56971 66695 71525 72394 73687 73512 70544 69235 72876 75583 79406 78130 73282 64618 54234 48165
18329 48165 45174 42842 40214 39830 36117 30281 25647 23995 22499 21661 21094 19458 15014 15982 16759 13704
18313 13704 12215 16643 20668 26050 30294 34543 37688 33805 35362 35394 33028 30940 27431 23491 22235
18298 22235 23811 25723 25078 24357 24702 26963 27205 25838 23979 22329 20563 22958 23847 21146 19110 19430
18282 19430 18658 19252 23002 21796 18930 18840 16646 15043 14083 14462 13656 11502 15361 17727 16787 16518 16997
18265 16997 16367 20681 26705 29254 33070 39121 46246 45058 44054 43055 38102 34818 33005 30929 27919
18250 27919 24264 21490 25010 26411 27581 21511 20214 21483 20130 21631 24523 25349 22918 20779 24630
18235 24630 29187 30606 30709 31288 29100 23577 22017 19262 16675 19114 22271 22260 19647 15966 15022 15021
18219 15021 16542 17547 19036 22141 25390 26684 29171 27560 27985 27353 25399 25841 25460 26846 29110
18204 29110 27398 24963 27058 27391 26600 25211 23366 20637 23001 27004 24841 25221 27661 28231 23691
18189 23691 20804 18833 16297 13056 14583 17603 19734 16403 15424 16288 17942 17222 14739 14916 16177
18174 16177 14646 15458 16902 20246 22054 17986 18364 25327 31250 36047 34564 34384 35008 34634 34226 36794
18158 36794 37859 39992 44491 47700 48479 48170 48499 49746 55705 56576 53605 56205 58206 56941 53236
18143 53236 48988 48913 52038 54208 55228 53712 52160 52890 55358 59241 61813 62275 64561 63612 63054 62304
18127 62304 65816 67837 73683 81734 85799 90107 95091 103273 115124 132326 153062 180810 217120
18114 217120 261515 325287 412767 544209 751463 1089243 1697371 2817044 4432540 5660145
18104 5660145 5594545 4697390 4088852 3234605 2107964 1366583 944820 691570 533359
18095 533359 427256 352459 300227 260531 225229 196197 175791 160969 150726 135404 124301
18084 124301 115542 112107 104658 95919 90568 88446 83778 80460 78008 77442 76915 74340 70762 65905 62872
18069 62872 60539 56873 55002 51735 48166 46139 42928 42094 40308 41397 41364 37960 36628 38784 39624
18054 39624 38360 38341 41974 45188 48394 45863 44492 48014 50069 54127 57043 56092 54782 58781 61008
18039 61008 63320 63968 61859 62675 65439 65362 65092 66417 69978 72824 70460 72144 73184 73357 76016 79447
18023 79447 79723 80620 81868 85774 87538 91430 95354 97542 98304 100815 103230 106695 108429 107307 107012
18008 107012 107235 110473 110783 113351 124451 132690 139879 148709 156929 165523 175276 187091 204850 221093
17994 221093 240582 260222 274954 291877 313182 332612 350519 372830 395546 420112 445965
17983 445965 475613 509724 554373 609298 679786 774299 907281 1103517 1386368 1769461 2245684
17972 2245684 2811848 3487993 4258622 5050099 5862990 6733706 7641024 8534199 9242709
17963 9242709 9765653 10332511 10788355 11002926 11144230 11202742 11172910 11006874 10483861 9781168
17953 9781168 9121866 8289375 7332441 6425753 5519820 4689613 3923557 3212373 2650620
17944 2650620 2222164 1881708 1634838 1461670 1333083 1238218 1171585 1129896 1104229 1092622
17934 1092622 1094328 1110409 1136386 1183393 1258985 1377438 1564425 1848114 2254890 2775608
17924 2775608 3396579 4137062 5001760 5916816 6847946 7847698 8901915 9978282 10930443
17915 10930443 11621403 12315521 12988564 13391840 13665181 13882634 13989912 13992438 13643468 12920080
17905 12920080 12196125 11353121 10319159 9371945 8552110 7950298 7598335 7341785 7135699
17896 7135699 6939374 6762399 6787243 7184084 8024471 9182698 10280612 10958222 11054611
17887 11054611 10741980 10286603 9996042 10065790 10421571 10787516 10788798 10269087 9319729 8217611
17877 8217611 7168745 6338314 5755183 5298461 4840117 4305873 3731611 3150715 2612147
17868 2612147 2163711 1824488 1593724 1448350 1363217 1312810 1290067 1287616 1300363 1335014 1405418
17857 1405418 1530866 1736929 2069676 2585633 3316696 4198193 5069034 5767669 6238861
17848 6238861 6644162 7227571 8198510 9615914 11207547 12494366 13079889 12970040 12464182
17839 12464182 11900882 11638360 11788208 12173268 12393899 12109031 11231608 9979555 8649532
17830 8649532 7462457 6570125 5937701 5416005 4855491 4215265 3545732 2887204 2295195
17821 2295195 1809372 1443421 1184250 1004633 875301 776153 698565 636259 586371 547275
17811 547275 510931 477839 453240 428840 405836 380175 352130 329974 310878 294026 275981
17800 275981 257517 242242 230148 218838 204599 192302 182560 171740 164784 160608 152635 142485
17788 142485 138393 134303 128716 123343 118412 118432 115404 110973 105911 103707 103018 96568 93321 92011 91329
17773 91329 92403 88198 83894 84213 84099 82058 81733 80797 81071 80047 79023 74485 75222 74350 73949 70747
17757 70747 67673 65285 66012 67686 65917 62638 63774 66242 66196 63459 63366 62492 67095 66448 62419 62305
17741 62305 61095 56675 52908 53658 57179 59768 65912 69384 71373 71611 69078 67455 65425 66728 63745
17726 63745 56455 54225 54624 52258 45504 41714 42970 43415 43651 44486 39596 34527 32286 29882 30333 28603
17710 28603 28254 28307 29475 32312 33536 35106 39105 40586 41952 40696 40041 38985 43169 44586 42425
17695 42425 41421 43583 45836 47563 49994 51528 52795 55193 55506 53748 53878 53419 52636 53291 55695 57879
17679 57879 59719 61142 62148 60864 56481 51403 51317 50787 48919 46772 41370 34122 30244 31262 28559
17664 28559 30067 30949 32806 33755 34227 41129 41378 40794 42766 43342 41663 43171 42653 42497 41990 39064 36374
17647 36374 31243 30089 26272 25354 29915 34643 34427 33084 33539 37470 38054 40509 40482 35027 30445 28686
17631 28686 29678 30178 30146 27777 27561 26377 29636 30527 28591 26889 28027 27551 25303 22502 20602 22797
17615 22797 23109 24912 28990 33732 39495 42180 42414 43730 41991 40851 37458 35426 32006 27357 22236
17600 22236 16515 15391 17188 18251 25531 32228 35815 34302 34120 35785 37986 39696 42232 39683 36753
17585 36753 33699 32980 34211 32565 32026 34638 41894 44299 39853 45203 47886 49243 48196 47102 46723
17570 46723 46790 44655 38338 33825 32857 31529 30199 29222 31423 30892 32401 29591 25209 22429 18466 13294
17554 13294 11338 13169 12850 12299 14306 19081 18399 17111 17805 19537 21692 24299 27804 30979 30386 29271
17538 29271 32275 31275 28863 30051 34866 44193 49230 51387 52197 59494 66737 67168 66391 65741 63224
17523 63224 62521 58750 54979 48156 45524 45684 45495 39879 37892 37556 36090 36347 35499 36750 38152 34941
17507 34941 33414 32572 33709 34181 35914 39461 43656 46197 51171 53614 52329 54068 58697 60772 63270
17492 63270 64712 69821 77570 82706 82067 84484 91497 95354 101121 115233 128644 141679 158373 177037
17478 177037 211284 248321 285713 321768 343098 345544 339843 331746 316992 305083 299920 307021
17466 307021 325427 347988 380345 418774 471259 539226 628725 738981 888665 1095401 1392530
17455 1392530 1824633 2475455 3472269 4965061 7042806 9573864 12143942 14090700 14916359
17446 14916359 14428897 12916209 10792616 8488672 6374750 4651436 3395347 2538649
17438 2538649 1968227 1578291 1310312 1122979 995095 913197 861681 844395 858094 891588
17428 891588 929641 972425 1006995 1022779 1011688 978736 945108 917538 887036 864970 856471 865053
17416 865053 895965 948041 1024194 1133394 1292683 1507648 1804622 2231759 2855916 3781172
17406 3781172 5178081 7256535 10169900 13829892 17771302 21191444 23261226 23508771
17398 23508771 21971843 19132969 15647428 12123925 9026346 6573844 4797806 3579243
17390 3579243 2758953 2206829 1832215 1567233 1361633 1200427 1072176 974360 903796 851729
17380 851729 817442 789562 773873 772421 780688 792650 799580 795361 780892 752462 720707 690401
17368 690401 672928 674016 700618 757199 846278 964591 1109539 1300636 1583456 2010701 2664402
17357 2664402 3655935 5065266 6792945 8537476 9828560 10330990 9935866 8850125 7353457
17348 7353457 5748130 4285031 3102588 2241329 1650769 1257179 989344 803925 672519
17339 672519 578295 504513 443112 393079 353487 321693 294554 275932 265000 262572 265234 276665
17327 276665 284877 284199 275547 256640 233803 205757 180429 158252 139370 124668 113020 104932
17315 104932 98089 91929 84252 80344 78049 75037 73266 72890 68058 61509 58522 61072 60391 56592 53713
17300 53713 53525 58430 59607 57926 59267 61150 64277 65236 62534 61733 60433 54036 50182 47245 45247
17285 45247 46959 49647 46956 46969 47796 42375 40393 37146 37224 35117 34700 33255 28306 23820 20565 15667
17269 15667 11191 15373 18569 21295 23650 19259 17883 17588 16115 17763 14910 11538 10688 12114 14550
17254 14550 15218 15585 17793 20222 24866 27417 30393 35128 41307 46014 45534 40658 35318 26208 21920
17239 21920 19945 18367 16586 17172 19059 19934 17438 18824 21082 19741 18806 17114 12353 10036 9877
17224 9877 8227 3920 5659 9125 10713 8588 8605 8267 6699 3155 -4804 -10356 -6074 -5125 -5404 -4489
17208 -4489 520 3265 3348 5480 11723 16598 19337 22073 24457 25416 26374 26004 22772 19783 16758 12882
17192 12882 9644 6447 8026 10710 11943 11057 8305 9552 12627 15416 18960 16021 16739 13602 13412
17177 13412 14091 14725 11578 9450 6716 6843 9189 7904 5640 3403 2394 1171 3040 5345 5288 4787
17161 4787 3218 6308 8461 7319 5586 7408 8506 7108 7751 9703 8837 8965 5286 4098 6157
17146 6157 9144 12660 13071 9350 8952 10261 11486 7743 8518 9750 6209 11107 18376 14348 12362
17131 12362 12423 12529 12789 10872 8209 5517 782 3293 3304 5150 7377 6093 6364 5833 5336 7991 7023
17114 7023 3608 3426 4303 2507 3022 6279 5014 3662 4515 2345 1684 1637 -651 -514 2710 4557 4149
17097 4149 922 153 132 1303 518 1569 4065 6907 8826 8146 6702 5201 3494 2025 1081 1774
17081 1774 -1087 1808 3477 1472 3756 6194 4276 2759 867 661 -1894 -1817 -2067 -292 738 915
17065 915 2615 -543 -1290 683 4472 8578 5154 2534 1416 3069 5848 5775 3209 4113 5659 8995
17049 8995 8786 3972 2524 1296 3310 2002 -982 1392 1965 3568 4245 4168 853 -537 408 2104
17033 2104 3519 1849 1797 1039 -2187 -2022 -2032 -2355 -2338 -403 -901 -4796 -3591 430 1149 -2285 -4307
17016 -4307 -1390 2091 2829 1989 360 -1087 -798 -655 2664 4790 5691 3871 -188 -2001 1798 5468
17000 5468 4894 3799 -857 -2556 -817 -4682 -8201 -5907 -1565 231 450 46 -1138 -3160 -4171
16985 -4171 -3872 -1374 -1700 -1718 -2555 -3545 -2371 -1534 288 2762 1213 1757 759 210 447 -101 767 -1504
16967 -1504 -584 1606 2631 1119 1942 -535 -1393 208 446 2559 4158 3453 687 -2467 -4072 -3319
16951 -3319 -1826 -86 -1162 -114 127 1270 6801 6920 7660 13403 21111 32928 43430 53633 63740
16936 63740 68376 68269 62894 54780 45805 36404 31744 28030 22641 17841 13574 8038 4880 3674 4452
16921 4452 3760 2409 5701 5797 5457 3508 397 -2063 -1726 -4046 -2244 2657 7569 8817 7661 1355
16905 1355 -1921 -4023 -2740 291 2374 4644 7787 11875 16108 18538 28005 39152 47207 63477
16891 63477 85120 104315 117482 123610 117666 105668 90907 71915 54387 42453 32396 24699
16879 24699 18689 16030 13016 10717 11064 7834 3419 2123 3963 5477 5258 1024 -271 598 2179
16864 2179 2945 2445 -1648 -1019 43 1709 5421 4277 2785 149 1013 4652 8088 10424 9660 8888
16848 8888 11050 14368 17598 24784 34222 44141 53500 57731 56941 54591 46549 40979 34426 26457 20229
16833 20229 12653 8869 10031 8487 7602 7578 4927 -573 -5133 -4593 -1879 1682 3938 1688 643
16818 643 -436 64 -2183 -4033 -3379 -2629 -319 -546 -228 -1665 -1955 -5024 -6057 -2652 -620 -761 -2012
16801 -2012 -4499 -2188 -188 -332 -11 393 136 -1077 -1349 -560 -1260 -617 1540 767 -68 -338 1197
16784 1197 3252 3976 3714 2553 -1684 -7405 -6046 -4323 -4605 -1163 1974 -42 872 -939 -45 3038
16768 3038 1028 -1988 1221 678 -4093 -4375 -949 2725 3986 3275 3975 1048 1300 -353 -2943 1526
16752 1526 4300 8811 5979 -907 -5722 -6096 -3170 -2937 -2458 -2657 -4023 -2941 -3505 -4068 -3642 -1888
16736 -1888 -4217 -5984 -3787 -4473 -5575 -4728 -3454 -4850 -4308 -5988 -4076 -2912 -4969 -3661 -3938 -2069
16720 -2069 -2732 -2483 -1071 -5837 -7665 -5394 -5471 -5888 -6751 -6891 -8567 -7253 -7332 -7351 -6019 -3910 -2373
16703 -2373 -3341 -4325 -4496 -3316 -2666 -3016 -3475 -4096 -4237 -3740 -2199 -2367 -3937 -3071 -2881 -2269 -4281 -2992
16685 -2992 2471 402 -5020 -7324 -6015 -3626 -3482 -1613 922 -3968 -6042 -5329 -2333 -550 -1003
16670 -1003 -2606 -1764 -297 -3598 -6577 -5885 -4965 -4426 -5496 -5000 -3630 -2309 -2987 -1174 -1829 -2726 -3039
16653 -3039 -3941 -5645 -7124 -8775 -6221 -3707 -5683 -6975 -1463 -2368 -4871 -6646 -6852 -6475 -5593 -4892
16637 -4892 -2569 -2890 -1501 -1708 -2923 253 2131 1712 -2198 -1420 140 -801 1595 1925 2776 2935 5540
16620 5540 6389 4997 2000 905 234 630 2066 2907 5782 6492 2996 -439 -742 1758 5149 4021
16604 4021 3779 4326 1010 1750 6481 7413 8489 7899 5272 3552 3037 2368 2044 -1109 1397 4826 4155
16587 4155 5610 8159 6857 5663 6204 4450 365 -786 -1610 1174 1102 1062 965 1570 -1999 -4373 -1745
16570 -1745 -2489 -3462 -738 186 -2699 -5959 -7876 -8163 -7210 -5810 -2441 -245 4252 2437 -2482 -3508
16554 -3508 -2585 -3761 -5035 -2506 -1337 -3437 -4447 -7501 -8743 -8166 -6085 -2797 -1520 60 4130
16539 4130 2735 1759 -1444 -2333 688 -539 -275 1182 3554 683 -1541 -5 -511 -1030 2276 3666
16523 3666 1545 -293 -2946 -3345 -3217 -2008 -1926 -1652 -3277 -1872 1129 1400 3352 3761 1816 2658 3417
16506 3417 1331 10 890 -1971 -2283 -2526 -4386 -4049 658 3210 1759 -775 -5243 -5534 -1050 2394
16490 2394 348 -1515 -3462 -8232 -6508 -5163 -7836 -7702 -6218 -2386 -5669 -8543 -8930 -6570 -1918
16475 -1918 -478 180 -725 -1146 -1191 951 -856 -1453 -1551 -2685 -849 3775 2921 -905 -1459 -1857 -1494 -693
16457 -693 -2889 -7398 -6848 -5241 -3462 -2173 -2384 -1844 -2397 -1267 2218 -232 -476 -12 -366 1169 2211
16440 2211 3785 3702 1039 -3178 81 665 879 2401 1978 2443 4438 5527 5972 1473 -5117 -7751
16424 -7751 -3768 1729 1992 -3087 -3133 -5387 -4106 -2201 -1843 985 -2025 -3346 -793 -2860 -7018 -5872
16408 -5872 -4647 -3119 -3319 -325 395 68 -955 -251 887 5557 6713 3318 1243 194 1788 3852
16392 3852 5376 2372 2137 -1910 -6777 -7738 -6754 -8554 -8301 -9377 -7241 -4832 -5558 -3196 1086 420
16376 420 -142 32 -1436 -2615 -2505 -5800 -7327 -5124 -2436 -1550 -4386 -4933 -1540 -3005 -2998 -1430 -44
16359 -44 -664 -2297 -2927 -2680 -3080 -5427 -8631 -9918 -8855 -8659 -4786 -5503 -7282 -5574 -4192 -1599 -2811
16342 -2811 -2036 -7709 -12227 -11519 -10182 -8581 -8423 -9030 -8145 -7887 -5512 -4300 -3024 -1020 -604 -3050
16326 -3050 -2494 -1267 -1593 -2535 -4854 -6818 -3575 -3539 -2574 -1317 -625 -654 -2877 -5011 -2749 1386 504
16309 504 1926 1711 2177 6932 5669 3977 3003 -839 -2932 -836 -61 -2449 -2273 -3486 -3118 -2733 -4616
16292 -4616 -5701 -882 3746 3632 1229 2498 2980 -1103 -4671 -8759 -6399 -3894 -2268 -4379 -2803
16277 -2803 -3111 -131 3223 -179 -2829 -3633 -3195 -3720 -4284 -6158 -3845 -1272 -4749 -4538 -988 624
16261 624 -2282 -3217 -4532 -2552 -2159 -5042 -4191 -4658 -6303 -6942 -4906 -2589 -2192 -5633 -7298 -7188 -2714
16244 -2714 -581 -1101 -3396 -2455 1857 1948 3171 5108 6668 3091 274 -369 -1483 -5046 -5225 -4121
16228 -4121 -3827 -2974 -3859 -9466 -9237 -7479 -4097 -5417 -7632 -7453 -6584 -5561 -6819 -7451 -7546 -6668 -5568
16211 -5568 -4121 -3924 -5909 -9425 -6304 -701 528 -620 -3694 -3158 -1840 -3126 -4532 -4299 -517
16196 -517 1163 428 -1253 -2821 -4878 -3894 -4582 -4124 -496 746 1262 -1190 -5193 -7437 -4458 -596
16180 -596 -2393 -4178 -4675 -2700 -3789 -7017 -6392 -4160 -3571 -5105 -6732 -4211 -2472 -12 2171 -104
16164 -104 -974 -1023 -3720 -2958 -3594 -3487 -1612 -971 1517 970 -552 -6027 -7309 -5639 -4508 -2203 -1665
16147 -1665 -3119 -1631 -120 382 215 -71 -1299 274 1243 2678 3268 1781 1592 108 -873 -2531
16131 -2531 -1614 -1571 -440 913 -575 -5209 -4217 -2793 -2631 -3511 -3095 -3383 -1386 -2758 -2863 -3561 -3703
16114 -3703 1143 2291 -619 -2847 -4239 -4029 -4968 -6537 -7085 -6433 -5780 -7211 -9217 -8528 -8069 -4518
16098 -4518 -1493 -610 1434 608 1224 1498 -1571 -1837 -3764 -4014 -4106 -2759 -1546 148 768 -592 -2768
16081 -2768 -6887 -7837 -4552 -2179 -4511 -6102 -7347 -6419 -2587 -1334 -2985 -3769 -2462 -2645 -2214 -4456
16065 -4456 -3251 -3571 -6647 -8119 -6459 -4981 -3260 -3101 -1927 -978 1167 -40 -1007 -2182 -3016 -2592
16049 -2592 -1889 -3238 -2083 -5008 -4025 -512 88 -1235 -3477 -4763 -3615 -2900 -2182 -5958 -7971 -3662
16033 -3662 -5334 -6281 -7218 -6291 -5034 -3532 -2561 -4347 -5335 -4753 -4123 -2262 -2675 -6098 -6711 -8302 -10544
16016 -10544 -10357 -5089 -3640 -3341 -2860 -3900 -7307 -10006 -11014 -6706 -4993 -3416 -5035 -5555 -1155
16001 -1155 -1930 -1578 45 -2239 -2955 -3799 -3191 -2560 -2872 -2184 -673 133 -299 -2556 -3763 -4928 -1418
15984 -1418 -3194 -4075 -1580 -68 -630 -2107 -605 -2764 -5737 -1043 3697 2014 -2206 -2867 -5147
15969 -5147 -3641 -3319 -4173 -6391 -7949 -5306 -2466 -1767 -2161 -2890 -2982 -4323 -4848 -3253 -2811 -1389 -5
15952 -5 -3417 -2318 1314 1304 307 -1761 -2889 -4914 -3801 -5834 -6479 -7569 -3245 -1077 -1900 -3994 -4667
15935 -4667 -3269 -3227 -1518 -189 -1543 -2309 -4045 -5212 -1729 1052 776 -3476 -5233 -3502 -27 1317
15919 1317 -193 -1841 -4487 -3136 326 2772 891 -1773 -3296 -18 -1942 -2249 -2491 -1256 1344
15904 1344 -2559 -3319 -1578 -741 3310 1142 930 2279 2965 3438 1658 638 -219 -1629 -814 607
15888 607 -1047 -3679 -3552 -5999 -6784 -2895 -2664 -2058 -458 -129 -1935 -2540 -5836 -8906 -5942 -2799
15872 -2799 1612 1346 -294 -2176 -3627 -4172 -4041 -6736 -7443 -4042 -4863 -2055 -1945 -772 -961 2669
15856 2669 3128 -1312 -5538 -6229 -3370 712 3463 5099 3982 -2735 -5346 -5524 -3351 -2547 -4040 -4611
15840 -4611 -3859 -3111 556 2289 -2157 -1829 568 1500 -4 -4556 -6608 -7562 -8620 -5099 -1107 -865
15824 -865 -4143 -5770 -6627 -6376 -8048 -8361 -6910 -6724 -4067 -4515 -6852 -5987 -5174 -6007 -5733 -5915 -6449 -8618
15806 -8618 -8443 -6071 -2270 -2574 -5291 -1427 -538 1416 -1387 -5669 -6005 -5347 -4563 -3294 -1139 -814
15790 -814 -1546 -5035 -3047 774 -2650 -3828 -2955 -2569 -5029 -5371 -5319 -5166 -5936 -6586 -6614 1476 3124 1921
15772 1921 -323 196 -1173 -4225 -4677 -5973 -2209 -3594 -5445 -4168 -4715 -5717 -7303 -4440 -4107 -7764
15756 -7764 -7029 -4273 -3870 -5311 -5983 -4979 -6660 -7533 -4486 475 1256 3109 4939 2484 1229 669
15740 669 -2604 -3747 -3228 -2569 -1683 -2974 -1004 -1240 -3163 -4161 -3600 -3416 -1607 -93 -3357 -4561 -1977
15723 -1977 -842 1486 2450 1090 1303 2529 61 -2933 -3178 -3612 -5288 -5195 -4598 -3825 -2814 -4623 -7675
15706 -7675 -5842 -2080 834 5283 8298 9116 7168 3990 5271 4848 -128 474 2037 -2533 -4882
15691 -4882 -3968 -2752 -3286 -1665 980 -408 -3744 -5284 -3764 -1640 -1935 -3193 -4612 -4383 -4957 -3727
15675 -3727 1547 1591 -1503 -1736 898 3841 2878 13 1316 687 -2127 -3550 -4718 -7957 -5131 -1647
15659 -1647 -1515 -716 -1729 -2218 -3061 -2989 -1897 -3038 -5192 -6488 -6632 -5887 -7607 -9267 -5557 -1921 -2304
15642 -2304 -2224 -1608 -2171 -1767 -4784 -6930 -2788 -3889 -7802 -7544 -1030 -733 -2219 681 -5 -2545 -3129
15625 -3129 -2368 -1105 -2538 -4667 -4277 912 404 -5199 -5009 -683 2721 2273 -1090 -3322 -4618 -4326
15609 -4326 -2399 -1724 2803 2954 919 -653 -1184 -494 -2764 -297 171 -921 -593 257 -920 -3216
15593 -3216 -4959 -6378 -8615 -5048 -3126 -3355 -5113 -3046 -4272 -5238 -8415 -6224 -6634 -8507 -5934
15578 -5934 -7349 -4456 -1809 -5839 -3731 -3261 -822 1202 768 -11 2179 -401 -3910 -3994 -5629 -5281
15562 -5281 -1013 691 2337 3774 2954 1312 1623 100 -3665 -2852 -1234 0 -1089 -1264 -1051 -5467
15546 -5467 -6577 -221 672 591 -265 -340 177 -1886 -5309 -5939 -6692 -6675 -6180 -7184 -6858 -7282 -5226 -6182
15528 -6182 -8404 -8869 -10773 -8252 -6387 -5576 -5750 -6809 -8407 -7506 -6282 -4554 -3515 1269 4775 -304
15512 -304 -5157 -5762 -5760 -3564 -2272 -1145 538 -2122 -2961 -790 -1868 -272 690 -121 -2566 -2387 -5385
15495 -5385 -5930 -1487 -1298 937 4355 1268 -464 795 257 877 -1966 -4911 -5185 -1649 268 772
15479 772 99 -3938 -5236 -6196 -7179 -4684 -4265 -3710 -6947 -11674 -10625 -8270 -9602 -7865 -5663 -2846
15463 -2846 -499 -4809 -7355 -6135 -4259 -4167 -4954 -7279 -7284 -6279 -6929 -7940 -6422 -2870 2165 2911 -1532
15446 -1532 -4456 432 3352 4524 2881 1461 -1548 -1780 -1695 -2114 -1684 -909 -2778 -3276 -2601 -739 1733
15429 1733 2486 2768 1728 1303 -2484 -5872 -4361 -443 535 -1282 -4155 -2208 836 1302 1775 3713
15413 3713 3522 676 -327 -2855 -2773 212 -602 -1668 -1263 -3791 -1755 -509 -2122 -2670 -3214 -3052 -527
15396 -527 -2279 -3350 -6078 -5468 -3607 -2200 -3745 -8228 -8592 -5787 -5867 -1280 530 2289 2392 854
15380 854 -1778 -4571 -6163 -7356 -2569 -1703 1715 3197 2187 82 -2490 -2228 -1985 -1226 -2416 -3989
15364 -3989 -2121 -2508 16 666 -3931 -4685 -4613 -2299 -3004 -4366 -3053 -3933 -4295 -6533 -4341 -2196 -4263
15347 -4263 -4285 -3378 -5270 -1171 549 -1792 -3381 -5337 -1463 375 -1828 -3602 -2850 -3663 -5376 -5651
15331 -5651 -8566 -10251 -5130 -1142 -14 1740 764 -824 -1269 -2184 -3874 -5338 -6526 -4562 -5866
15316 -5866 -7066 -6888 -2632 162 1424 2293 4805 3276 -2128 -3323 -4967 -6744 -5750 -5520 -5951 -3404
15300 -3404 325 752 -1107 -3006 -1055 -1211 -4923 -5091 -3067 -2584 -2592 166 1870 1798 3228 -1734 -6008
15283 -6008 -6250 -4513 -7980 -12256 -9647 -6886 -6804 -7121 -7926 -6515 -2669 -4134 -6846 -8504 -6604 -5804
15267 -5804 -7610 -6725 -4140 -4412 -4117 -4328 -4294 -2510 -2669 -2323 -4853 -4458 -5576 -5587 -4596 -6136 -6689 -3320
15249 -3320 -424 -2623 -2050 -96 3568 6970 6212 1892 76 186 1180 2165 3440 5588 3253 -1062
15233 -1062 -2904 -3358 -525 -1028 -2224 -2732 -3754 -2557 278 159 -327 -2126 -6281 -4587 -1404 2341
15217 2341 1931 365 1451 -384 -1200 163 -1656 -3756 -3013 -2759 -2238 -1343 376 1066 -2119 -4518
15201 -4518 -4628 -4045 -1822 -4552 -7371 -5281 -234 55 -2711 -4985 -3629 -804 -1962 -4972 -5646 -6704
15185 -6704 -7174 -6407 -6700 -3343 -956 -1339 -1511 3337 3973 2062 1347 2551 -943 -3720 -1660 -18
15169 -18 -2262 -3603 -1378 882 14 -3077 -5825 -6384 -1726 -3002 -2949 -5542 -7857 -6949 -3806 -2234
15153 -2234 -1824 -2195 -159 1755 2136 2739 612 -1551 -3454 -4338 -2426 -831 -3521 -2859 -3314 -3243 -4170
15136 -4170 -6252 -9442 -9817 -5816 -4121 -974 -2685 -3922 -4971 -6292 -6629 -5631 -4761 -4758 -5441 -7531 -7367
15119 -7367 -5001 -2220 -2527 -3929 -5777 -5824 -6352 -6813 -6502 -9000 -7259 -7602 -8852 -5494 -620 -12 -5283
15102 -5283 -7555 -8764 -8103 -6863 -2469 -2627 -3882 -1315 1129 3129 4719 5315 1800 -498 -909 246
15086 246 85 -2227 -4410 -3853 -1152 -2148 -4830 -3273 2856 5774 186 -2554 -450 -1511 -1998 263
15070 263 -2518 -4957 -6720 -5309 -3589 -3689 -5201 -6625 -5671 -5559 -4748 -3501 455 2518 4072 1496
15054 1496 142 838 -736 -1239 -4036 -2846 -926 796 -180 -1259 942 -1270 -1381 767 -1021 -3980
15038 -3980 -4310 -2714 -3382 -5498 -4225 -4184 -3510 -3627 -2558 -102 1561 -519 1358 -49 -1245 -1821
15022 -1821 -2093 -5311 -4703 -5897 -6309 -3098 -4632 -5239 -5561 -5945 -7322 -7947 -9220 -6129 -2858 -996
15006 -996 -326 558 3368 2581 1517 -1797 -4656 -4347 -4246 -3154 -500 2681 3885 1993 909 -1038
14990 -1038 -1298 -2616 110 2976 3371 1596 4267 5694 5119 947 541 -1234 99 3818 3444 -1481
14974 -1481 -1224 -4563 -4849 -4570 -6260 -5330 -6126 -5458 -4378 -2417 -2740 -1333 583 462 -4698 -3282 668
14957 668 5243 2750 1812 2665 -705 -5273 -5238 -4370 -736 1362 3460 4566 2791 1782 1684 -1302 -4424
14940 -4424 -4128 -3339 -1326 -2299 -2927 255 2596 2268 3332 1860 2205 -583 -2696 -1559 -1034 -2174
14924 -2174 -5064 -3819 -1217 -1225 -3038 -3724 -3616 -4946 -3740 -5474 -4798 -4392 -3511 -4263 -3872 -6718 -6899
14907 -6899 -3269 -2949 -481 -2181 -425 2040 2889 6106 6407 4235 4717 8265 9386 6701 4013 374
14891 374 1550 257 1106 1969 2826 4681 2222 -74 -287 -1982 -2053 -1758 3356 2717 -283 -2158 2059
14874 2059 463 -916 547 1043 809 1041 -2513 -3844 -3506 -864 -89 -296 -277 -638 -1480 701 -581
14857 -581 -1714 1790 2238 4930 7897 7267 7442 10796 4878 2668 5155 6595 9981 6871 5704 7169
14841 7169 11688 16417 18007 19068 21256 20320 21288 19379 17007 14277 12280 10069 7527 8025 7252 5275
14825 5275 433 -2003 -3914 -2500 -124 2427 5040 653 -4055 -5094 -4443 -4737 -1307 642 -4756
14810 -4756 -5083 -2428 -5001 -5121 -4491 -5806 -4305 -6517 -7205 -4868 -6682 -4063 -1508 -1617 -4575 -5275
14794 -5275 -6190 -4362 -3382 -1851 -1927 -4277 -1291 2645 -371 -1945 -236 1788 1016 -1337 -1139 -1636
14778 -1636 -2879 -3136 -147 8 -2064 -5089 -2801 -2887 -6160 -9100 -8188 -2978 603 2931 -537 -3764
14762 -3764 -3041 -797 1301 5322 517 322 504 -1181 -2176 -4088 -5659 -3103 388 1032 -852 -2121
14746 -2121 -2657 -1504 -3131 -4761 -7712 -7653 -3021 -115 -1168 -3471 -2561 -1810 -3425 -3429 -6317 -2496 -2672
14729 -2672 -3617 -4344 -6938 -7639 -3666 -3258 -946 695 585 -2379 -114 -1205 -3090 -4898 -6190 -5297
14713 -5297 -2449 -1739 -1428 -2335 -1142 -810 -867 -1234 -2598 -1658 -3406 -997 19 -2762 -4539 -5111 -8424
14696 -8424 -5657 -1126 -749 520 1356 487 -265 -272 -984 -1724 783 -227 -3040 -7312 -9104 -10260 -6553
14679 -6553 -6281 -5541 -4765 -2506 -4264 -6205 -5384 -5286 -9046 -8839 -6252 -1539 -1722 -6300 -3249 -1303 -2001
14662 -2001 -953 -1841 -4118 -2857 -1711 -4169 -7091 -2682 -612 673 -2209 -4074 -5740 -4660 -2790
14647 -2790 228 -2676 -3189 -3056 -3598 -1120 -567 -2279 -4391 -4945 -2225 246 -340 -3690 -5208 -5660
14631 -5660 -6055 -3557 81 -3406 -2315 441 -884 -2307 673 865 -4339 -7181 -5480 -1184 750
14616 750 1034 2405 4589 5188 3193 1212 1143 1180 1455 2383 3863 5186 5080 -703 -2217 -258 -2269
14599 -2269 -908 1351 2042 1129 -2759 -4849 -6734 -5416 -6058 -6644 -6806 -5537 -2543 -1234 -1674 -4220
14583 -4220 -5695 -4053 -34 -433 168 2428 3225 2211 670 -1230 -1723 1733 3001 1764 555 3845
14567 3845 2944 -61 -708 -1362 -3036 -5232 -4415 -4830 -5170 -1834 1434 3733 2406 -194 -255 955 -665
14550 -665 312 499 -2725 -1640 -2582 -1467 3028 5122 6861 6093 4662 2012 -1101 -1406 -982 -2154
14534 -2154 -1397 -268 -646 -2462 -1438 -2996 -7768 -9596 -8625 -8240 -4430 -754 2583 -1486 -2868 -704
14518 -704 1206 4109 2536 1478 2970 2658 355 -2206 -699 -95 2316 2753 1037 -203 -709 461
14502 461 2104 3544 1276 626 -1059 -1860 -2268 -2378 -2261 1044 3732 6653 4352 1225 -2971 -4306
14486 -4306 -3722 -824 -380 3038 3386 3967 4672 2893 5204 9118 8963 7684 5860 5315 3221 2593 -468
14469 -468 -4707 -3653 291 -742 1596 -1328 -2816 -219 1418 3304 5777 4031 1356 -4540 -4077
14454 -4077 -2445 -3156 -4420 -3621 1228 2647 2619 -864 -2175 471 -761 -1625 -2585 -471 -426 -28 2092
14437 2092 6387 2503 685 -3117 -4565 -7037 -5809 -4898 -4476 -3293 -1711 -500 2186 809 2407
14422 2407 3678 5275 3744 3612 5120 6922 5722 2004 583 369 2162 6571 8615 5444 560
14407 560 -1467 -1717 319 5773 9885 12493 11968 12168 11398 9249 8907 10857 15044 18125 19029 20529
14391 20529 26960 30362 34810 43927 51804 63384 76812 101632 147737 209018 281887 362205 436099
14378 436099 486967 506774 495449 448697 380003 302617 229195 169082 123271 92328 72762
14367 72762 62975 57677 52597 44327 37898 32877 29720 26598 24482 21522 18240 14600 11254 10059
14353 10059 12506 15790 15646 14303 10091 10459 12644 7959 8760 8082 8265 8323 10768 10980 10629 7512 6303
14336 6303 7474 7136 5840 4438 6697 7552 10072 8943 10282 15009 15451 14270 12382 11922 11284 10155
14320 10155 12363 13030 8868 9737 8824 4855 31 -1479 -392 1447 2680 6180 7085 6236 5102 9207
14304 9207 9279 5144 4750 5183 3989 516 -2217 -529 1185 663 158 1710 2519 6541 7749 4535
14288 4535 6202 6969 7876 8527 9863 14915 15195 13049 16281 15731 13319 11126 8537 5137 4423 4891
14272 4891 6701 7081 7813 8531 10205 9460 5886 262 -1452 -1639 455 2593 -1053 -2586 -2474 -2698
14256 -2698 -3097 -1124 535 77 -3679 -3057 -902 392 1505 813 599 941 -1199 -3385 -5197 -2221
14240 -2221 3779 3159 -114 -1324 -3973 -5411 -2975 -273 -996 -2124 4483 9254 5365 1959 -1196
14225 -1196 -798 128 1702 1890 3717 2113 4181 7938 7057 2449 -1856 -5873 -8155 -10604 -11396 -10936
14209 -10936 -11875 -16058 -14641 -11689 -8775 -4943 -692 3608 4771 8340 7805 8888 12355 11051 9316
14194 9316 7376 5070 3768 4052 5148 1947 3527 5242 2650 4595 3216 4402 3377 1735 950
14179 950 1010 173 3508 2818 3138 5765 3002 -219 1669 5087 5157 4299 6243 6941 4426 7625 11085
14162 11085 11576 13537 14910 16611 21334 26144 28812 29824 37449 46896 51095 50467 49110 47570 42598
14147 42598 34770 28358 23141 17525 12574 14852 18813 20937 18982 19178 16484 15214 13522 15622 17373
14132 17373 15564 12382 9646 10289 12058 15027 15242 14856 12230 15279 15377 9452 -367 -4682 -3409 -4691
14116 -4691 -2575 593 2893 5675 7876 6340 2396 1786 4865 5574 7179 6075 6427 8081 10753
14101 10753 11030 10042 12988 17940 25040 33296 36744 44556 50050 57202 68837 76274 79050 82230 80772
14086 80772 73043 62908 54935 44025 34434 28412 27066 27449 28154 28704 24388 29076 29702 29023 30865
14071 30865 31082 30713 28843 28270 32674 35394 36107 35970 32659 32395 29317 26880 13845 -7286 -29501
14056 -29501 -48773 -63541 -70552 -70582 -65850 -59063 -45286 -31413 -10175 16327 33111 51683 71760
14043 71760 86367 94589 97179 92070 81229 69061 63635 56457 53002 54083 61944 71213 82098
14030 82098 93904 103548 108305 117004 126423 132382 138317 139816 140407 139318 136335 128968 119378 109620
14016 109620 103265 98776 90622 85584 77501 73228 73913 71478 72646 75300 74457 75469 75498 73405 74063
14001 74063 76754 75332 80806 82830 80740 77459 80600 81490 81708 76144 74787 75319 76214 78395 81938
13986 81938 84058 83900 82612 84977 89524 92658 88560 87666 86520 83923 82198 81140 76919 76949 75694
13971 75694 77122 79564 81576 85266 89199 96154 101056 108519 114882 121445 123485 126090 129241 132923
13957 132923 136636 141612 145743 156039 168337 182892 197476 209397 221768 232958 242206 253177
13945 253177 267518 283327 297263 308831 317767 330768 343090 356068 371793 388520 405074 427924
13933 427924 459550 500775 548836 599336 657386 722271 788328 864129 950844 1047828 1159008
13922 1159008 1299116 1473644 1694096 1965492 2284587 2657868 3080337 3544548 4040862
13913 4040862 4576936 5165527 5863820 6752499 7978114 9804007 12654562 17265021 24657495
13904 24657495 35563274 49566203 64855969 78969797 89280242 93824617 91879791
13897 91879791 83719194 71333705 57339483 43873930 32450731 23550256 17209712
13890 17209712 13061501 10389275 8618232 7385184 6470468 5742310 5115159 4542974 3997477
13881 3997477 3470074 2987355 2567947 2212839 1924151 1693873 1512344 1367226 1248371
13872 1248371 1149033 1062469 988322 921244 867486 822616 781682 740608 698660 658154 620899
13861 620899 586800 557968 528217 498359 474330 454322 436260 420305 404531 391078 374871
13850 374871 361441 350212 339873 331268 321257 316748 308442 301051 292539 282744 273714 265276 250810
13837 250810 238314 231170 222478 215931 210483 207251 208053 211459 213971 212928 211817 213232 220603 225666
13823 225666 222091 215925 207660 196796 184845 174668 169800 161184 147155 137509 133130 133233 126901
13810 126901 118625 114763 109696 104921 99325 94920 91391 91148 92258 87171 81270 79496 79007 77700 76550
13795 76550 79138 77862 76040 81458 83983 82212 79412 82161 86659 90363 93638 99633 99461 96585 88922
13780 88922 81526 75497 71800 68693 62567 56673 51500 44693 37338 29718 25912 23255 25683 26627 30376
13765 30376 36803 45997 48173 45339 45309 50983 54348 55566 57125 62296 67099 74652 76518 78996 80882
13750 80882 88801 103007 112430 124190 135847 142253 140930 135768 120079 97824 78996 65803 52269
13737 52269 38829 34201 29711 25184 24691 25611 22597 19731 19388 22258 17514 14613 12959 8279 8051
13722 8051 11136 14371 14434 13720 14841 10369 4557 -2086 -4662 -12076 -24767 -35720 -44866 -43656 -37727
13707 -37727 -28055 -16235 -6055 4488 13643 18330 20975 23476 22602 23853 20373 18071 19546 21122
13693 21122 21071 22295 24300 27020 27674 29455 30139 30323 31738 31411 28522 25873 28034 26388 25342 24335
13677 24335 23001 21382 18365 17337 16869 21429 23111 23610 22406 21421 18876 17036 14109 9386 11333
13662 11333 10464 8479 9442 11486 15571 19302 22902 22260 23562 25127 24048 21328 17945 17682 14069
13647 14069 12803 12682 10873 7593 4412 3674 8168 12151 11587 9270 10863 11621 15062 15629 15116 15693
13631 15693 15869 12660 8142 5270 8016 10461 12615 14966 12011 6440 3992 6390 8689 8172 6784
13616 6784 7614 7369 2563 4847 6268 3275 3733 4933 6454 4401 3608 3085 688 5801 8252 5976
13600 5976 2706 379 3647 5522 5993 10089 11587 15139 19689 23375 25164 24249 21124 21292 19778
13585 19778 19099 17295 13112 8411 7638 6014 2083 3222 4874 4133 1344 -609 1151 3405 2244
13570 2244 4425 5082 477 -2459 -1630 -90 2176 976 1663 4794 5916 5059 3721 4529 2621 672
13554 672 4654 6804 4784 3765 5077 7589 7448 9005 9229 10357 4659 20 390 1411 2192 3705
13538 3705 4270 6296 5882 3446 2251 3578 5019 4425 1388 -71 -176 -70 -596 -658 -3964 -3605 495
13521 495 1903 1567 1329 296 925 808 1148 282 -1757 574 5748 2945 3564 4405 2988 5493 6919
13504 6919 6920 6529 2640 1945 5149 4421 91 -797 -318 -1295 -802 629 2117 1558 -1424 -2364 -669 3373
13486 3373 1766 -879 -2873 -21 -151 -2471 -1964 -2123 -3496 -1555 -4052 -8312 -8374 -4282 -4362 -6873
13470 -6873 -2654 1292 2021 4418 3449 1660 3204 4377 5531 7559 4586 2045 -231 -1848 -4306
13455 -4306 -5027 -3853 -651 -555 -4340 -5913 -2363 -617 -2737 -2332 1979 4713 2859 646 1545 8138
13439 8138 8754 9737 12430 12477 9262 8683 10604 13518 17748 24296 28937 34040 36824 37518 39385 48479
13423 48479 56736 69234 87262 116590 162992 227359 306944 387649 458073 500088 512835 489136
13411 489136 433486 361447 288510 218262 157556 115527 89666 70829 56472 46504 38000 36024
13399 36024 33058 25918 18929 17411 15636 10159 6848 5873 3062 4181 6003 6621 5338 6554 6924
13384 6924 7273 10028 11429 12025 9292 7391 3340 3057 4063 2508 3206 6055 7448 10075 6554 2505
13368 2505 -1776 -742 1299 437 115 -1427 -3193 -1770 33 -1507 -773 543 -584 -2305 530
13353 530 5273 6170 2882 1573 4560 5467 7273 10163 7854 8181 8203 6312 7676 7916 11365 11747 10080
13336 10080 9408 10200 10981 9418 10633 11594 11496 11074 13733 10973 9500 9227 10918 7184 5932 7560
13320 7560 9100 10510 14086 14520 11265 8962 10313 11270 14151 16448 19036 23560 25627 27354 29645
13305 29645 29979 30347 32016 31766 34398 34541 32755 28971 22688 21610 25843 26511 27076 24397 20717 16835
13289 16835 15073 14031 16636 17053 16200 12891 10619 8402 7537 6529 3193 2899 3588 2608 3572 3206
13273 3206 6418 9656 8442 7182 6827 8033 6827 7076 9242 11040 11151 14503 15783 13689 8914
13258 8914 11563 12592 10144 8832 6462 4526 5651 6070 2009 -1891 -1793 -1439 -1484 -100 1983 1340
13242 1340 1441 6208 7702 4919 6206 7783 4902 4010 4195 3588 2389 -721 -1195 -2831 -5941 -5994
13226 -5994 -851 3990 1727 185 -3183 -2289 -2003 -3416 -6939 -7791 -3357 -315 -544 -385 -3018 -5603
13210 -5603 -4375 -5672 -7592 -4406 -4929 -4307 -1759 -2917 -3849 -1220 -306 -588 -3605 -5537 -5344 -5289 -8154
13193 -8154 -7973 -6801 -4651 -3198 -2277 -5435 -5227 -3610 -2863 -707 602 1122 10 -3447 -3195 -814
13177 -814 -689 -2687 -4368 -2789 -1135 -416 -908 -1934 -3325 -3122 -2323 -6268 -7047 -3801 -2312 -2635 -1898
13160 -1898 -1803 -661 676 -1577 -1231 -1518 538 -3037 -5190 -727 212 4 1388 2365 1002 1991 1765
13143 1765 4269 5833 7952 8014 7004 4100 3540 2623 4089 4462 1622 2799 2534 2179 4519 4908 2767
13126 2767 3917 6059 7348 6437 3150 2689 845 243 -218 -478 -1902 -506 3065 3565 1585 2979
13110 2979 2339 2439 -1493 -6278 -5243 -1355 3169 2788 407 170 -757 -349 1937 3658 171 -3713
13094 -3713 -5592 -6374 -5336 -5902 -1332 724 -554 -1557 -1037 2763 6379 2988 -871 -4280 -2921
13079 -2921 -2626 -2118 -1750 -222 -948 -3240 -4092 -2039 4092 3523 2741 5784 10306 8614 4515 1477
13063 1477 80 -487 -3179 -4275 -4895 -6679 -4482 -3533 -1661 122 -2338 -2753 -35 2024 2563 3660
13047 3660 -458 -2085 70 1222 2200 2149 -265 -3074 -3738 -1542 -413 -2490 162 -229 -1340 1300
13031 1300 1031 1185 -193 -2632 -4322 -2679 76 1484 -673 -3160 -3607 -1883 -1014 -1224 -569 -710
13015 -710 -2834 -4360 -1750 -1678 -3889 -2148 989 1984 1587 -1268 -116 1326 740 -243 1019 -1117
12999 -1117 -3048 -2651 -2047 -1965 -73 2857 2906 3618 3513 3315 2112 960 1238 4647 4474 684 -2967
12982 -2967 -453 4050 4858 4425 5578 3254 321 2638 3833 1859 3435 6805 6031 7259 8451
12967 8451 6179 7189 6554 4277 3428 4405 7008 7490 6388 6006 8276 6754 7075 7555 4753 2647
12951 2647 5128 4048 2644 1987 150 -3599 -1347 1722 2940 4405 3654 1916 4821 6322 9204
12936 9204 10082 7441 6503 1735 -1154 -1472 -4142 -2899 -1189 2103 4586 1591 -755 991 2491
12921 2491 460 -102 2212 7198 6599 4833 2063 1242 -2437 -3662 -5535 -4982 -3244 -1239 -4361 -8965
12905 -8965 -6328 -4737 -3821 -3475 -1591 -110 521 947 1148 2895 4890 2802 3662 3048 2156 2205 5264
12888 5264 7619 2710 -294 3509 7140 5722 3575 5330 5174 5630 5877 8468 9746 7300 6433 6972
12872 6972 4717 4419 7453 4990 804 -344 619 2778 3484 3892 4842 1177 -1443 690 257 -731
12856 -731 1314 1622 393 -2250 -2287 -1550 1740 1360 349 783 2854 -336 -502 3353 5228 2894 1831
12839 1831 -534 -3931 -7871 -6897 -5610 -1217 -1594 -2178 -2852 -2884 -2252 -580 -63 31 -310 1945 2315 874
12821 874 -902 -4597 -4543 -3867 -3410 -3367 -1146 255 834 -299 -5925 -9223 -7759 -4895 -6681 -3675 -1867
12804 -1867 1081 2868 3453 3750 4593 3805 1941 571 3278 3911 3282 -59 -2186 -3246 -3236 -5007 -6073
12787 -6073 -7257 -6778 -5803 -4115 -2149 117 596 1428 5885 9188 17282 23681 33168 42147 47086 40598
12771 40598 35304 29862 22585 13521 8877 5763 5048 3984 3671 5249 4508 3749 2247 1391 2937 3506
12755 3506 1851 1518 899 212 943 3341 6091 3153 1440 -1039 -2962 -4841 -3352 -5354 -6056 -6255
12739 -6255 -8069 -5754 -2174 -529 517 -2906 -5196 -4758 -1901 3321 5438 3047 2816 3635 -984
12724 -984 -2206 -1398 -2431 -4171 -3463 -2039 1196 -1702 -848 4304 6298 4608 6724 10804 12505 13671
12708 13671 14977 19750 26013 37653 54802 70027 87894 112134 135588 144064 128406 109334
12696 109334 94542 73312 50895 30970 20028 15709 11450 6486 3477 6355 8189 5309 3677
12683 3677 2756 5082 5920 3609 -698 -3989 -2927 -1881 -2526 -1284 -3096 -738 1651 2188 508 962
12667 962 2948 1965 1816 3302 2625 4048 5549 7561 6025 7488 11432 14935 18740 20273 24664 26669
12651 26669 28736 31735 30667 28040 24920 22062 18513 18806 15886 13337 10631 10058 9391 12411 15680
12636 15680 20188 30476 47048 74921 94529 89659 74357 64577 53824 38682 25832 18812
12624 18812 11835 8923 7658 7292 4898 1697 -1111 -2848 -4008 -4014 -3303 -3604 -2715 -512 -2273 -1377
12608 -1377 -717 -5039 -8139 -5579 -2617 -1712 -1770 1044 3702 4853 2949 578 -3763 -1409 1193 1109
12592 1109 1843 3715 6068 6901 6420 5084 -488 -2349 1172 4702 6384 3519 1082 -1524 -5413
12577 -5413 -5836 -4687 -5700 -6190 -3465 -1949 -6191 -4155 -450 271 1805 -362 -2639 -5165 -5562 -2720
12561 -2720 -626 -2436 -2553 -1972 -87 2029 1982 583 -51 -5224 -5380 -4945 -5312 -3126 -1384 -2153 -1064
12544 -1064 284 542 1539 5559 6075 1508 -2144 -1340 -2050 -1084 -642 -3498 -4794 -1923 -698 -1297 -2401
12527 -2401 -2243 1804 2051 -316 255 -3009 -5858 -6342 -5874 -5278 -5886 -5357 -3494 -4868 -5755 -5609 -6608
12510 -6608 -5799 -4698 -5698 -4780 -1450 4081 6172 6165 4832 -2413 -2158 -910 -1129 1090 622 1159 1802
12493 1802 -1479 -1972 1638 3507 5916 4790 5376 8385 12425 12992 9473 6845 4302 6203 7238
12478 7238 5150 1293 614 2317 4402 7242 7311 4248 2796 2142 1951 1731 -2015 -3887 -2925 -1610
12462 -1610 2995 3828 4332 4523 5021 3599 234 -1952 52 -66 3063 7839 11607 10930 7389 4801
12446 4801 1475 310 1480 1050 -975 680 3679 3063 2699 3068 -949 -1147 3792 4890 5945 1612
12430 1612 -720 -251 1116 1904 1664 -1862 -2436 -2196 -2472 359 -2926 -2307 -239 1766 1884 2922 -1044
12413 -1044 -3521 -2983 -4963 -3843 -885 -904 -3171 -1218 -4725 -8418 -7476 -3623 -4868 -6298 -5406 -5516
12397 -5516 -9649 -10020 -9664 -6749 -3398 321 656 -278 -1276 -1602 670 350 223 998 951 -951 -4505
12380 -4505 -5301 -5366 -3082 -83 -3623 -3680 -2034 -2176 -3248 -11564 -14186 -13044 -8124 -2638 -364 -2032
12364 -2032 -5209 -7123 -4117 2044 2653 -1121 -2821 2172 7072 6082 1620 -2250 -3687 -6349 -5113
12349 -5113 -6657 -9079 -4229 -1347 -6028 -3524 -2335 -4231 -3765 -605 545 -88 547 -368 -4752 -7976
12333 -7976 -7094 -5735 -3893 2006 4621 1818 3621 3872 239 -3818 -3054 -2251 -2626 -2437 -2185 -2234 -4484
12316 -4484 -5618 -4752 -899 -2375 -311 -1605 -1636 -1186 -2235 -574 -3646 -6036 -5550 -4523 -5234 -7893
12300 -7893 -5668 -1025 -2023 414 685 1260 2874 4640 6561 3956 2199 4331 4907 5835 4309 1077
12284 1077 1187 3495 1616 1311 1444 -1794 -3052 -3788 -5100 -2431 -336 3568 8711 6371 6154 8603
12268 8603 7838 5639 1887 -181 432 174 -1961 785 613 -663 732 4671 7329 4585 2634 3839
12252 3839 6089 5150 3253 2872 1170 -2029 -620 4149 7515 4530 1993 2403 2447 6367 6396 6398 8048
12235 8048 6985 6101 5736 4562 4911 8580 4881 2912 1430 3267 5651 2749 2970 3061 2117 2764 2607
12218 2607 2692 1955 -109 4628 8040 8823 7235 7500 9715 9039 7753 5200 2540 2757 1342 1878 905
12201 905 -2171 -5979 -7060 -3189 -1355 633 149 -2363 -1950 -414 -2776 -6974 -5214 -5018 -4040 -3896
12185 -3896 -3158 -3228 -1403 1957 2381 -2542 -6174 -3918 -3639 -2172 63 5551 7516 7695 7585 6362
12169 6362 4974 5687 3434 5813 6055 1829 3273 2974 4124 4236 1795 3722 6348 4049 -247 227
12153 227 2091 4627 3732 2564 1561 2518 -148 -5022 -3235 -4285 -2345 256 760 2385 2214 3580
12137 3580 5201 3636 894 -499 1303 -2292 -7568 -7307 -6401 -5484 -3275 -806 510 -4418 -4380 -583
12121 -583 275 -687 -607 -240 -1737 -803 -1152 2065 3219 916 4161 4473 1048 1037 2681 2551 -124 -4389
12103 -4389 -101 2502 252 -3128 -7442 -6734 -7350 -8881 -8594 -4205 -6515 -5917 -3796 -4544 -5787 -3007
12087 -3007 361 1777 -1924 -3580 -4501 -5046 -4910 -2781 -154 431 -741 -2398 -3771 -2230 -641 4332
12071 4332 7756 4500 551 649 553 -1365 1615 4400 3481 4398 4490 3521 221 -236 -1010 740 4161
12054 4161 1645 -3346 -9323 -8107 -5637 -5666 -7515 -4289 -3077 -3420 -3314 -5517 -3278 111 3997 5570
12038 5570 4701 75 -890 -63 -1768 -1105 1808 1610 -4450 -6923 -4817 9 294 2467 3142 -2339
12022 -2339 -4663 -4215 -4105 -2915 -6142 -5529 -5395 -3623 -3562 -2783 -2247 -156 -900 1370 4329 4399 1336
12005 1336 1269 2261 2797 2564 1359 123 187 1845 1858 5133 6990 5055 2711 3555 5504 3613 2844
11988 2844 3882 4875 6151 8664 7370 3770 134 1574 4812 6586 9653 8946 6183 4574 6798
11973 6798 7177 6515 4575 1662 2619 1658 -323 -3179 -6275 -6303 -7171 -7679 -10946 -10385 -6715 -4385 -5511
11956 -5511 -5762 -6745 -3709 -3335 -5241 -5327 -5250 -5534 -3866 -4355 -5065 -1964 -343 -1967 -6536 -5775 -2974
11939 -2974 -3379 -4634 -3106 -4599 -3761 -1791 -2796 916 2948 4661 5096 4022 167 -497 -1491 -3312
11923 -3312 -2028 -2835 -4309 -6764 -6296 -5286 -5352 -536 -371 -6634 -7407 -3852 -3479 -675 -2117 -5399
11907 -5399 -5507 -4003 -1370 -1800 -5568 -4145 -3452 -1080 -305 411 753 -994 -1711 1186 4224 6458
11891 6458 4077 2744 728 -2062 -334 -2241 -3613 -1958 -506 1503 -1786 -4943 -3238 -3685 -4162
11876 -4162 2457 1586 -3536 -5653 -9290 -9875 -9254 -6221 -5406 -4483 -6112 -6015 -1669 -345 -368 677 1535
11859 1535 1935 5210 6113 4100 5310 2101 2856 5082 3965 4995 6874 5876 5765 6298 6061 8389
11843 8389 7787 7349 6286 6064 9074 14099 18617 18006 20136 22164 26569 29662 29073 31666 36046 41231
11827 41231 53962 69354 91505 118450 147404 176699 200509 221649 243095 260283 279992 297212
11815 297212 306314 306494 295792 280550 261801 246884 228684 203699 173040 141386 114587 92305
11803 92305 74041 60938 53347 44535 32929 25898 21298 17360 15149 14191 13688 13102 10672 10081 10985
11788 10985 8788 6641 6977 5158 2217 3301 4149 3293 5625 6998 5543 5032 6683 6142 4103 2209
11772 2209 -625 1230 3803 2746 2773 9288 12738 15123 14659 16257 16303 17243 14392 12252 12596 9789
11756 9789 6860 5263 4617 1499 1360 4405 7489 6146 1053 1020 2585 3486 3664 2798 4910 4716 4267
11739 4267 3619 2379 284 -151 -769 -3309 -3959 -4828 -4769 -6529 -3693 240 1379 1309 107 98 526 540
11721 540 -786 -4123 -5295 -4070 -5866 -5707 -5142 -6138 -6793 -8802 -10108 -9352 -6794 -4342 -2790 -3378
11705 -3378 -3091 -3165 -4754 -4740 -3965 -1562 340 1156 1488 1322 1130 -781 -2440 -958 -2090 -168 1308
11688 1308 1931 1753 1566 3518 2975 6460 10179 8299 8053 6092 4713 7016 8552 7934 7812 6956 6022
11671 6022 5814 2848 600 2177 2341 5297 8831 9248 8013 8825 13577 21632 28570 27663 26543 27544
11655 27544 33427 32943 29503 29515 34473 36723 41136 42194 42267 42741 43311 39755 35974 32032 29537 25438
11639 25438 24811 23970 22932 21965 19522 18694 17131 15330 16883 18881 18122 13775 10453 11623 10644 8565
11623 8565 7613 8199 7098 5980 5476 2891 3416 2011 1086 3160 5464 8525 11542 15987 23110 34807
11607 34807 44014 52259 60597 63432 66932 67373 64692 59370 50994 49514 50118 49526 50129 51854 54143
11592 54143 55336 56108 53806 53659 54218 55625 55780 56402 55095 51034 48349 46190 41342 36972 36590 33635
11576 33635 28076 25082 21961 22753 24610 24140 22605 22967 22110 21072 22458 22396 19220 11275 4669 2256
11560 2256 -699 -3393 -9666 -18522 -24231 -28765 -34118 -39373 -45418 -43470 -40612 -40146 -38189 -35797 -31244
11545 -31244 -23767 -19354 -12246 -11144 -6200 2 7344 12624 20315 27831 34351 36810 37039 38199 43317
11530 43317 48773 55627 62930 67582 70507 71821 72506 74778 72118 70628 70243 69354 68341 66529 60728
11515 60728 54310 52004 50017 49287 48290 43217 40288 43930 43644 45708 48076 49719 51407 57473 61750
11500 61750 62302 63361 67323 70750 69610 69736 70022 70542 70775 72724 73293 73474 76753 77496 76734 79158 81574
11483 81574 78477 78660 84428 86237 83100 84898 84622 83386 81030 83617 85953 86136 85461 90286 95339
11468 95339 94728 98880 103067 110408 118628 124212 129489 132329 139675 148672 161507 169254 173633 179681
11454 179681 183540 189214 196724 204776 214927 223292 233457 242395 253630 269867 282151 292272 306955
11441 306955 324141 343357 362699 380125 402414 426139 452079 481533 519473 562518 613060
11430 613060 671563 739374 820971 914538 1025517 1161557 1318906 1494897 1692174 1919632
11420 1919632 2177143 2459479 2772300 3130800 3550479 4057267 4679122 5470388 6516263
11411 6516263 7952752 10004570 12972914 17108274 22326313 28004342 33262444 37648176
11403 37648176 41459631 45346327 49610634 53807468 57014893 58418781 57771048 55559410
11395 55559410 52643218 49611808 46407134 42595023 37966454 32731013 27306593 22096926
11387 22096926 17454607 13658804 10804624 8741203 7256635 6155672 5307644 4635871
11379 4635871 4082234 3614198 3212445 2861493 2550991 2273692 2033387 1822413 1632855
11370 1632855 1466888 1320474 1197965 1095033 1006299 933735 869969 813770 765898 721918
11360 721918 680955 646083 614836 585584 558336 531625 503851 481424 461943 444846 425977
11349 425977 411172 395515 379183 367864 356703 346266 336754 327936 318530 307920 299502 291728
11337 291728 281899 275169 265606 256574 251301 245186 233822 227024 223897 218371 210710 203862 199229 193811
11323 193811 188606 179900 173413 168388 162658 155672 149389 144817 140247 134664 131992 132378 131083 126912
11309 126912 124783 122456 119204 116870 114048 112905 114966 112857 110090 107554 109172 113798 116059 112179
11295 112179 112197 113052 115500 115161 116436 114640 111319 107219 108811 106531 101951 94471 93795 93866 96386 95358
11279 95358 89306 77783 69881 62411 58673 56151 52145 49819 47228 43478 40543 40776 36018 35308 37220
11264 37220 37918 39908 39775 39667 43553 44865 49514 53467 57948 62131 69056 73873 78679 83715 90035
11249 90035 95874 99792 100735 103373 104543 104239 105887 104663 101055 93848 87194 79211 70573 64833 59557
11234 59557 51476 44855 39063 33102 27538 21831 18224 16631 16387 15789 14070 13692 13938 14262 12215 11579
11218 11579 9508 4666 2231 866 -3174 -6869 -10221 -9951 -8425 -10316 -9875 -10759 -9080 -3475 -3540 -889
11202 -889 -268 3082 6272 7166 8752 12578 15188 19240 24242 27206 29031 29333 28751 27948 26039 25608
11186 25608 26176 23177 22381 23612 26124 28029 29484 29874 24533 22765 22791 23473 22687 23635 17011 13455
11170 13455 13877 15693 16222 15780 10665 10846 12013 13924 14290 15131 16407 12742 12674 17076 20773 21378 22294
11153 22294 19426 16120 16458 18607 19929 21079 19149 17066 16538 19251 18651 18142 19630 20700 21865
11138 21865 23244 21773 17710 14391 12208 14088 15343 13852 9516 8164 6631 5618 7926 10688
11124 10688 14612 12192 8460 10437 13313 12904 9308 6725 5373 6277 8208 10764 11630 8674 9258
11109 9258 11060 8820 8677 11146 10624 11207 9234 8267 9323 7160 8874 11117 13877 11690 13314 14223
11093 14223 15930 17881 21075 21900 24350 26311 24980 25830 25605 23939 21169 20514 19430 20392 17985 15714
11077 15714 18146 18805 18241 18720 18174 18922 16278 16061 16234 15604 12513 10249 9554 10904 9018 7586 6533
11060 6533 8808 13192 12832 11097 9053 5274 5352 7775 10308 11668 8384 7948 8651 11529 15322 14123
11044 14123 10201 6847 2851 1734 2886 4419 5207 3661 4836 2543 789 -717 502 4760 7400
11029 7400 8033 7720 4730 4033 3582 4578 4787 2944 -703 -4786 -4006 -3097 -1119 1351 842 -316 247
11012 247 2541 2297 8454 9052 5431 6218 7945 5463 9930 10213 8212 11414 14532 16053 16556 17024
10996 17024 15011 13447 15914 17518 25747 31111 35498 40884 48614 58895 76252 100415 126977
10983 126977 152063 178546 203352 225345 247812 271366 291287 306028 309250 301342 292145 280722
10971 280722 267811 255614 233781 206115 177398 145826 117379 93627 74158 57201 45583
10960 45583 41244 38095 35681 31235 27748 21351 16192 11422 9578 11020 13096 10888 7986 7467 -117
10945 -117 -1846 2043 2258 1316 915 1797 953 1131 722 4388 5960 6122 5331 7248 4945 3561 3501 5015
10927 5015 7473 5864 6416 5920 6673 8302 6045 3300 2253 141 -1832 -1042 4666 6600 9912 7165
10911 7165 3747 2657 3089 2945 3965 5544 6948 6107 6088 9647 9781 7853 5233 -1317 -3504 -2172
10895 -2172 109 2835 2630 -219 -1311 -3359 -3263 648 1316 3488 6592 4880 6077 7063 7252 6562
10879 6562 5784 5078 3600 3177 3951 6048 6489 1956 2142 1083 -1618 -396 122 -818 3095 5954 4670
10862 4670 447 1928 3791 234 -3347 -5138 -6323 -4226 -1739 -1498 444 -1841 -2941 118 1144
10847 1144 1742 2614 200 2736 3035 287 313 980 2135 2039 -116 -2031 -1931 -1162 -1772 -617 1202
10830 1202 3236 3238 3262 3511 5474 5109 -216 839 2747 2570 -2635 -1765 422 2635 2209 585 -283
10813 -283 -95 -374 351 -1284 -639 -500 -2554 -734 707 681 505 2777 4408 3501 431 -1527 -2644
10796 -2644 -2720 -2395 -1399 3403 5605 6711 5129 2144 1821 2392 6345 4730 3419 452 -84 -1769
10780 -1769 -2903 -5283 -4911 -1312 -770 -941 -1187 -125 1173 4181 2630 1126 -208 -2251 -2342 -2274 398
10763 398 -95 1112 586 2743 4205 2258 1294 544 459 -1906 -611 2340 2998 752 -1017 -1508 -2560
10746 -2560 -4005 -3416 -407 -1358 -3854 -4316 -2810 209 456 959 3386 5234 7668 9380 6848 4963
10730 4963 88 -3052 -76 -811 -466 3363 3385 3652 5260 3273 -1190 -3616 -919 -687 840 486
10714 486 -439 -582 -5152 -4064 228 1562 3528 -257 -1903 -3282 -4655 -4098 -312 1436 897 1726
10698 1726 9 -2647 -3169 -4550 -4269 -4887 -4579 -3610 -4088 -3752 -2553 -2780 -651 1397 1582 -600 -2376
10681 -2376 -1224 202 737 610 -653 -2307 -524 -2980 -3688 -190 -802 -1798 -891 496 193 -447 -3330
10664 -3330 -2791 -1626 469 837 -9 -1541 315 680 -2053 -2182 540 1656 2091 452 -2468 -3866
10648 -3866 -4547 -5629 -4439 -3604 -2649 -2858 -3765 -4320 -3386 -4518 -2860 -3405 -4675 -3649 -1609 -809 -1885
10631 -1885 -1384 1788 714 -3525 -631 2977 3304 3113 2124 -252 399 1758 3517 5820 5889 6228 5764
10614 5764 5396 3986 3026 3326 -1887 793 2645 3822 2032 -1090 -1891 -1934 -883 480 -604 -4948
10598 -4948 -4412 441 2441 2587 3206 3696 5164 5420 2260 2677 2861 1564 -2006 -4140 -3194 -2846 -2785
10581 -2785 -2778 -1962 -679 -1029 -1640 1462 335 -3928 -5055 -4010 -966 1093 4187 6699 8511 10298
10565 10298 10672 7894 6797 5220 4193 2881 1281 1377 2197 2050 770 -897 -1378 -3457 -1053 -2323
10549 -2323 -4751 -5037 -5509 -6927 -9557 -7584 -6276 -10421 -13377 -7363 -2996 -1050 -1565 -2845 941
10534 941 3658 328 -823 -200 3538 4099 2438 1403 100 705 1746 2803 1747 1736 -376 -3948
10518 -3948 -1412 2579 3712 6148 7614 4766 3967 5500 7079 5469 4043 4070 4573 6856 5271 1472
10502 1472 340 1339 4052 6074 6365 977 -1745 -4008 -2377 -1707 1466 2790 1213 1263 2699 -456
10486 -456 -931 2338 288 364 2782 5612 8145 7801 4343 1388 2796 -35 -964 -1307 -1380 -2927 -5865
10469 -5865 -3516 -582 3106 8134 7604 7873 6539 5925 4884 6721 6636 1927 1268 2873 3553 4406 4563
10452 4563 7215 7547 3333 -2241 -6069 -6560 -3572 -2708 -2250 -78 4486 4367 734 311 358 1836 1236
10435 1236 -586 -3403 -5718 -2899 -470 -689 -2947 -2618 -3257 -4564 -2510 11 1183 1329 -209 2033
10419 2033 673 -963 -2149 -1207 -1877 -3572 -3285 -2700 -2932 -2561 1982 2785 1763 804 -1057 -1142 -3922
10402 -3922 -3542 -586 -1375 -2181 -2074 1244 2839 1651 -554 -955 2014 3404 6481 3757 1628 1089
10386 1089 -1163 -1688 245 1673 2079 4727 5242 4571 1698 4808 7818 11428 19760 24810 25754 24271
10370 24271 21758 18001 11445 8419 6785 5671 2821 2405 97 -3224 -2144 1070 1985 3640 3748
10355 3748 3994 1868 4507 4458 1046 -4950 -8813 -5100 -134 4458 4463 3788 -268 -1344 -3980 -2378
10339 -2378 -1819 -745 955 -1901 -2870 -1677 405 2626 675 -1724 1410 2687 3382 6407 5583 4170
10323 4170 5585 4792 4689 5288 4291 2969 2626 587 -35 1833 2134 2869 2775 -483 -989 -1147 -1817 1550
10305 1550 5662 6485 6456 7436 7170 7710 6916 7542 2476 -2155 -928 2038 4364 4926 3326 2101 3677
10288 3677 3956 4862 7543 9856 5275 2852 2243 1380 -1308 -761 -2792 -1784 1297 2969 2051 1177
10272 1177 -1355 -6123 -5539 -3141 -1694 -2656 -4314 -2637 -1493 951 1465 1900 2129 4965 2379 1359
10256 1359 279 -3829 -5822 -100 3188 2629 -1698 -2142 -772 1347 3354 5312 1943 -45 2470
10241 2470 3414 3205 161 -1488 -109 984 584 -629 -2633 996 5142 4808 2546 5167 6730 7461
10225 7461 5758 4155 1713 966 3945 3367 545 725 1319 2366 134 2247 3649 1585 148 1871
10209 1871 3205 4820 4924 1870 -895 -3318 -3118 -568 1084 3740 8236 11650 12643 14929 17110
10194 17110 18452 13965 13713 14135 18264 16857 14188 14516 12473 9802 9398 8781 7680 4404 3433 2624
10178 2624 -2211 -4906 -2994 -2389 -3477 -699 1627 1203 1052 -1 -2815 -1549 -2232 -4041 -5995 -5832
10162 -5832 -3745 -3648 -2899 -475 -237 1703 2493 2000 455 -1241 -798 2339 2915 134 -448 -941 891
10145 891 4346 2483 2062 1163 -1313 -3548 -2412 1780 1666 -281 -99 -1583 -1364 -1025 77 2761
10129 2761 3706 2391 1707 1137 1884 3155 -896 -5069 -2120 3104 4128 2586 728 -2825 -2589 -1497
10113 -1497 -1202 -255 -2410 -4006 -2734 1735 2994 5424 9110 9658 10169 8110 2960 1133 943 1852
10097 1852 3410 3833 382 579 3741 2273 918 145 1330 1822 3577 3754 846 -1639 -1878 -2072
10081 -2072 -1402 -1539 -2321 -5508 -174 570 1082 3028 4907 6023 4500 3709 2596 3287 1475 2993
10065 2993 2172 2807 4403 1825 -1395 -1693 -1897 -2348 -2032 -2207 893 3559 6371 5407 3704 2826 1893
10048 1893 2854 -2068 -7358 -9119 -4581 939 1488 -1183 -983 -1486 -1293 1241 1593 2926 2355 -2042
10032 -2042 -3869 -2552 255 1555 1128 953 3768 3929 5003 5267 2611 3506 2153 -1270 1182 4735
10016 4735 4360 821 1118 4232 6417 5619 1531 572 -1534 -1075 -1752 4221 7570 10229 10283 7420 7123
9999 7123 7341 6065 2610 1538 262 -381 -659 -2067 -4287 -4770 -4774 -3226 -3450 -3194 -968 -93 1465
9982 1465 -649 -377 1617 845 -83 125 -1344 -2270 2598 5852 3621 3121 5074 7959 8198 9790 9507
9965 9507 8346 4711 2483 752 3497 4816 4098 1633 3405 3384 2698 4510 10019 13821 11960 9664
9949 9664 8503 6624 5078 2051 613 5565 9931 9575 10054 7428 5011 3278 3680 1580 1989 1698
9933 1698 6747 10982 11677 8669 4947 2796 1816 1933 -2657 -2060 132 2103 2207 5789 8752 6759
9917 6759 4012 3280 4202 972 -700 2314 4359 7921 7620 8986 8499 5082 339 -3697 663 4305
9901 4305 3171 40 767 1276 1646 2549 2249 3006 2411 577 632 -2267 -1227 1814 3021 7465 10732
9884 10732 10682 7013 7598 11463 11318 9513 5153 3083 1099 2434 3740 3326 2985 -548 -2573 1631
9868 1631 1938 477 -2385 -5402 388 1301 2175 5800 6434 3859 -1042 -3922 -3364 -1493 -2598 -429
9852 -429 572 -1307 2370 4731 3722 3377 3334 3668 2549 3652 7168 9228 10151 12802 13035 13006 12224
9835 12224 12104 9463 7293 6919 7107 3860 3032 531 205 1976 -436 -107 2621 3130 1031 -697
9819 -697 -3681 -3615 -403 75 966 -1799 -435 614 446 769 628 3228 8693 10857 8165 3578 984
9802 984 2565 743 551 1637 847 1733 2354 4640 7098 4790 5559 6806 4924 2745 2966 672 -1058
9785 -1058 1326 2638 3308 2472 1643 1344 1511 7061 8327 7101 7885 7561 8051 5419 4004 987 658
9768 658 -1443 698 1547 670 1537 3068 4771 1927 1913 5111 6911 3097 1932 764 26 129 3660
9751 3660 4595 6285 7126 5175 1455 1337 1942 -611 -216 956 3387 2429 1667 3221 5406 3118 4251
9734 4251 4959 2687 4656 7953 9241 10781 9464 12370 16904 17304 14879 11871 7774 7335 8137 6328
9718 6328 6542 6603 7118 9523 9017 5557 7411 8011 9502 11377 15639 20178 24363 27563 32932 36284
9702 36284 40510 43391 43682 44056 40180 39124 37984 35753 40380 44200 43228 41953 37163 30707 26647
9687 26647 23561 19086 18882 19325 22756 19774 16383 13781 11555 7046 4831 8347 9509 6966 3205
9672 3205 4090 5966 2384 1220 4292 6607 5663 5656 6582 8294 8379 8252 10337 7887 8384 10759 11872
9655 11872 11101 9747 12726 16623 14428 12620 7854 5835 6018 5179 4652 5899 3734 1728 6770 9883
9639 9883 11828 12404 16345 17441 17196 18097 18087 18028 22235 21475 21295 22377 23992 24488 24816 22220 20773 21126
9621 21126 20220 21558 24428 26963 31416 31356 31811 31118 31424 30015 33679 33183 36628 44616 45359 42710 42689
9604 42689 47327 50236 54141 58647 60806 62839 65642 65502 64062 62194 60003 58374 58711 57081 59707
9589 59707 58951 56105 56738 57004 54696 49018 45835 40477 40460 39523 37413 33626 30209 32903 37494 39716
9573 39716 41732 42538 43988 44475 46681 47434 45836 44326 43326 41624 39611 37491 40911 45464 47737
9558 47737 51648 55317 58695 61358 63735 64581 65855 68809 69743 72617 72872 68822 65760 64810 60969 51575
9542 51575 47341 41377 34483 30552 27466 26290 22823 22021 20278 16135 19068 20880 23186 26950 27608
9527 27608 27473 27999 23677 21989 20355 18357 17210 17119 15561 15773 16296 20603 22359 20773 18689 17991
9511 17991 18933 21006 21506 18194 20610 24044 23536 21648 22659 21604 25543 29396 28364 24550 28027
9496 28027 28426 27034 28006 28380 28864 27319 26446 26884 28118 31674 39090 48678 52588 58745 64772 65680
9480 65680 64401 63750 60392 59098 58969 59340 63919 67502 67868 69385 68521 63880 55997 44819 37771 29641
9464 29641 19969 16406 14294 12392 9735 6987 7905 9167 12765 14399 17120 22028 26135 30476 32812
9449 32812 35545 35308 37069 37470 36402 37434 39309 42820 42438 43350 46794 51275 53558 55917 58879 57525
9433 57525 56683 58471 55175 50716 45354 42875 43669 41120 39746 38564 36092 35253 37281 38753 42785
9418 42785 47625 49569 49666 50468 51787 54149 56272 54686 54978 56368 62166 66428 71130 74740 80314 82378
9402 82378 85499 90041 95654 106172 118621 133477 151605 166323 185883 221013 266924 331115
9390 331115 421504 540977 687888 854344 1019645 1157922 1249695 1290587 1265850 1174214 1044729
9379 1044729 895101 739236 596327 477929 386230 314546 263368 225603 197183 173445 163452
9368 163452 151726 138333 126199 115156 106882 100272 96486 91061 87943 84830 80948 79708 78144
9355 78144 79818 79877 81903 78193 73110 71269 70074 67634 63136 57836 57943 59459 58071 57675 55562 57120
9339 57120 54224 53129 53340 49967 47257 44500 40307 40046 35820 32070 32427 35734 41083 41279 38666 35142
9323 35142 36027 41436 42825 43124 42087 45785 45929 45243 43031 39639 35883 33791 31066 28868 27910 27611
9307 27611 32152 33222 28160 23179 20047 16663 14558 7082 -350 -9869 -13051 -16628 -18274 -17878 -15313
9292 -15313 -1377 12780 30524 46614 54878 55164 52483 48371 47262 47451 48502 50604 50462 47599
9278 47599 45142 44054 44421 46275 47190 44262 43493 45990 46728 49363 51303 54402 61107 70015 78319 86683
9262 86683 92705 97050 99024 99538 98828 100465 95112 87160 77746 70419 71113 76826 84174 87354 87477 89934
9246 89934 99491 113313 120019 118222 108432 105513 115050 141583 178506 197134 189620 168440 143341
9233 143341 117909 101068 88014 78730 77683 87320 96219 99175 105620 107534 102592 95824 95367 95463
9219 95463 95742 96363 94629 91643 92611 91786 89203 88726 91311 90198 84110 73288 61549 52907 45397
9204 45397 39376 42559 44243 46736 48870 47016 43044 44346 48241 52959 62512 70355 80324 91007
9190 91007 102158 111281 113604 113141 110080 110207 113397 115828 127279 144652 165650 190224 208603 220248
9176 220248 234658 263196 281549 268349 233729 193790 157475 132724 117171 110172 108624 105974
9164 105974 107612 114124 121309 127680 130781 131877 133122 127985 125966 130414 139373 150295 166433 177956
9150 177956 177803 172380 164202 149422 122270 79595 13364 -65971 -133553 -167734 -170233 -155713 -134748
9137 -134748 -97953 -50917 -11047 17657 43320 66251 83357 96111 112830 131751 147613 160535
9125 160535 173113 189575 207495 231441 260197 294654 344635 414038 492484 561997 633831 717331
9113 717331 801162 895561 1024266 1212451 1442484 1663772 1850189 1972894 2008644 1943727
9103 1943727 1788542 1582288 1367368 1170225 1000512 863939 755029 664599 596025 544603
9093 544603 497756 458661 428427 408038 395979 388490 382254 372130 363385 359056 358090 353382 348418
9080 348418 352414 363298 379437 397918 432226 474805 512680 545948 578669 600139 597647 571106
9068 571106 541391 506829 473110 440648 417119 392440 372008 360051 348806 344803 345769 344541
9056 344541 351899 363777 378038 399794 421823 446811 466127 480623 491213 497639 500716 502774
9044 502774 503861 513616 533952 566522 608047 655694 702806 747953 792974 840402 893060 940310
9032 940310 986711 1031123 1076818 1127808 1184921 1244424 1304894 1360659 1407340 1458161 1522802 1604237
9020 1604237 1713475 1836716 1978276 2140005 2326547 2540876 2783656 3052397 3330488 3621773
9010 3621773 3951258 4339504 4790044 5331073 6001100 6817640 7803353 9016526 10549513
9001 10549513 12473336 14745357 17143662 19506206 22047086 25209492 29433090 35416240
8993 35416240 44291481 57750098 78587348 111259371 160329104 222468832 277638681
8986 277638681 301592313 289454478 259471759 223354400 178365582 132016891 95652307
8979 95652307 70755980 54126959 42892153 35180143 29829515 26067347 23255655 20841273
8971 20841273 18520338 16281939 14230023 12376646 10730788 9354553 8244332 7343672
8963 7343672 6595003 5948491 5384092 4913380 4525919 4191886 3901049 3652817 3447294 3266551
8953 3266551 3102166 2947076 2795371 2645229 2501887 2361602 2226519 2095164 1976844 1872093
8943 1872093 1778244 1695498 1618776 1550623 1495438 1453235 1420405 1395676 1375547 1352942 1330162
8932 1330162 1304635 1277609 1247255 1213353 1175159 1133511 1090695 1046217 1005257 970416 942166
8921 942166 920707 896258 874074 854302 839117 824701 807637 791184 779433 764803 743465 719128
8909 719128 692996 663669 637243 609090 584866 571710 563988 553685 542728 530631 516344 497231
8897 497231 481257 469359 458412 446201 433321 419383 402959 387967 379906 371333 362216 352380
8885 352380 344131 339039 335290 333975 337380 338133 335293 333328 332554 330406 328594 330314 334955 337177 336171
8870 336171 339866 350382 355984 345705 310588 265993 244162 256787 277098 273347 246623 206991
8858 206991 163159 135143 124968 135939 146843 156206 168654 184564 196706 204550 210020 216346
8846 216346 221138 224962 228837 236451 247182 258895 271987 286162 302887 321395 342093 372814
8834 372814 422134 487127 536544 536910 492649 433584 372413 306833 246965 200839 167951 151341
8822 151341 144184 138184 131069 126642 125223 123600 117960 113710 106433 95323 85248 83194 86086 91368
8808 91368 93386 98557 100993 100887 99302 87309 64863 40870 19636 -7039 -38451 -67705 -88221
8795 -88221 -82980 -47955 -779 29462 38081 43915 55099 72725 84576 88749 92892 94823 97503
8782 97503 100773 102842 104940 111377 116481 117928 122423 124811 125785 123284 122226 125888 130955 134541 137396
8767 137396 135231 132627 122284 113404 108322 100233 96088 93515 90331 91192 89823 90686 93264 93560 86481
8752 86481 81034 80179 77045 77141 78822 78266 78365 82655 90668 97062 104339 109442 113752 110216 105209 100473
8736 100473 94566 90392 88607 88354 89880 84692 79073 75580 76848 81799 86887 90034 92291 91061 89685
8721 89685 89228 89039 88546 82784 77633 78029 78409 80320 82888 82531 74237 72920 73656 73376 73043 73211 78731
8704 78731 83944 83691 80892 76763 71948 70373 71352 72080 73556 74066 73424 72528 73104 71800 67916 66899
8688 66899 64682 62572 62402 63489 64386 67169 74039 88635 107602 124251 134129 139616 143709 140797
8674 140797 132434 124110 125405 123341 114958 108803 105429 102607 108924 116633 126735 139029 144811 144547
8660 144547 142472 140947 138052 137612 138302 139969 139115 137041 130339 122275 115288 106907 95442 87551 82729
8645 82729 78866 77643 76351 74271 75193 76375 74979 75162 75615 79643 82459 83605 86570 88679 90487
8630 90487 91479 96368 98065 95746 92879 92433 88093 84923 76957 71222 67208 63964 63411 64255 67599 68154
8614 68154 70522 72604 77065 83240 91540 100079 108467 112176 114307 119501 127066 129643 133541 140225 151736
8599 151736 165385 178279 184911 190158 203187 222993 246380 282135 332845 405856 504185 629348
8587 629348 777228 942904 1106208 1236345 1315107 1335343 1287627 1176381 1035796 881659
8577 881659 724577 581989 463946 372355 305223 253023 216423 192861 170499 155150 140910
8566 140910 128804 119375 109546 101996 96291 93416 90221 85628 82380 78097 76837 73992 72753 67108
8552 67108 64139 62906 63603 57101 51769 50722 47537 43507 42119 42917 44103 46060 43631 38527 35629
8537 35629 32275 34054 33362 30322 28699 28687 30298 34813 36257 35638 32411 34341 38546 40271 36393 31750
8521 31750 28177 29572 36101 45686 52764 54828 54416 57634 58928 59250 59357 57415 54830 52681 48557
8506 48557 43896 41355 40094 38611 38135 32357 28444 29978 30880 32006 35239 35065 33807 34549 32811 32342
8490 32342 31920 28770 26682 28144 29413 30770 28559 26407 25438 27070 29815 29826 28235 27408 27756 27455
8474 27455 26892 27581 25318 28593 29906 31860 28889 28182 29522 26948 23820 24268 22764 25787 28543 27181
8458 27181 27564 32501 34420 30575 30729 29827 26931 28604 26662 24774 23472 19455 21241 23304 25123
8443 25123 24991 25020 29715 33776 32422 37049 39604 39303 39114 37808 35064 31614 33772 32734 31983 29746
8427 29746 26251 19952 21868 26503 29432 25900 23714 24979 28927 29993 28367 31511 33605 34369 37893
8412 37893 39821 39546 39250 33950 31948 27759 29404 27542 23829 23859 28276 30682 30458 26036 23805 23402
8396 23402 23784 22491 25113 24014 24339 21056 16318 18684 20983 21413 20974 21202 20092 17429 15101 13553
8380 13553 10529 13313 11167 10480 11337 13260 14780 15739 15332 18311 20189 21129 20888 20306 17796 15324
8364 15324 19602 18740 18109 20258 22480 23364 19878 16441 16512 18358 21268 25178 27622 28100 24676 24181
8348 24181 24535 22879 24803 25870 26606 26368 25586 25546 26375 27264 27622 27722 26094 25898 27307 29200 27629
8331 27629 27367 26528 25665 22826 21587 24579 26402 28288 25471 26127 25422 23449 25048 23092 19648 16990
8315 16990 16578 21755 27202 30149 27908 28628 30213 32038 30650 26385 24824 26410 29764 29175 29659 30862
8299 30862 30148 28611 26429 25576 27737 30056 29057 28749 28828 29124 27979 29532 31576 31269 26896 26955 29737
8282 29737 30699 29709 26234 23497 24783 25925 24639 24609 27502 28732 25147 22654 24337 23200 22583 20179
8266 20179 18026 20951 25569 25348 26463 26202 26498 27088 31432 37294 39431 40413 47299 50789 51357 45786
8250 45786 41759 42863 40323 39233 42759 47237 48064 44996 44598 44581 44630 38027 31255 26324 24524 26874
8234 26874 28618 26505 24038 25899 28906 27600 25990 24815 26769 27917 28508 30627 33944 36352 37223
8219 37223 38535 39283 40059 40441 40915 42404 49189 51295 54014 55888 59880 59991 60626 61181 58323 61132
8203 61132 68227 75763 78612 79881 78461 74735 70528 62675 55334 50410 47976 44388 37759 34628 37759
8188 37759 40211 38229 38552 37444 37301 37087 41613 48232 52526 61864 66429 71667 75133 74640 73582 69536
8172 69536 62455 57525 53630 47694 40078 40579 40467 39218 40848 42434 45237 47557 51490 54663 56530
8157 56530 53715 53441 52185 50185 47943 45528 41880 40361 38953 41769 43385 41783 46285 48644 51907
8142 51907 53552 53299 57563 60772 61386 66452 71340 72950 73585 73764 70499 67147 60784 54195 49668 45743
8126 45743 43160 41254 38529 35059 35917 36066 35388 34070 36965 37026 36413 36122 33666 30876 32684 31600
8110 31600 32886 33387 31922 33871 33303 32304 35764 37801 36398 37239 37472 38669 41531 46785 46303 46960
8094 46960 48675 49506 42926 38390 33067 28157 26417 28636 29482 28571 30668 32728 30149 34206 37351
8079 37351 37555 38925 39584 39764 37682 36640 36637 36373 37404 36835 37926 40909 40975 44244 47945 45877 43480
8062 43480 42749 40724 37550 34039 31492 31933 29832 29723 31001 33261 33517 37565 41932 43494 40527 36073
8046 36073 37380 37740 39316 40648 43932 50673 55432 60635 64534 63381 60588 56445 50949 46001 42824
8031 42824 43588 39941 35616 34198 32334 35180 36859 38306 39683 40746 40411 39667 32886 27849 24747
8016 24747 27106 29420 29940 23376 19902 21538 24110 27299 30730 33089 33448 32415 35184 35916 32898
8001 32898 32086 34046 37704 36026 34022 30942 27396 24746 23786 24067 21500 22354 28215 28740 27373 27470
7985 27470 28450 30110 32480 32238 31676 29592 28243 28966 28559 26885 24082 20402 20830 25156 24260 22207
7969 22207 21588 23685 27264 28347 27574 27092 29989 31785 28858 27826 27881 26906 26444 26401 28455 25861 24961
7952 24961 24564 25597 22558 19152 17249 17536 18408 19121 21077 21202 21566 24024 23889 23399 21943 20538 23171
7935 23171 23847 22380 21574 19199 15880 14649 16249 18705 21855 20341 19673 20127 20972 18275 14182 12313
7919 12313 12396 14792 14919 10488 9430 10629 10887 12831 14587 14936 15446 14246 15213 13402 11416 13660
7903 13660 12262 11696 9705 10075 11293 11239 11633 10497 9914 9806 8548 6254 6178 5305 4702 5738 6997
7886 6997 6568 7075 10429 8519 9484 7175 5205 5692 4201 -858 1921 5843 4577 2816 5588 6755
7870 6755 6287 5910 8631 11963 10044 7615 8009 7894 4019 552 3253 5949 5028 6541 8204 9715
7854 9715 6450 8003 10529 12242 12084 8599 6603 8773 10342 10746 12271 12209 10326 11253 10199 11780
7838 11780 10413 9758 13643 14290 12843 11400 10287 5337 5559 5235 4962 5109 3396 5986 6442 3800
7822 3800 5340 9849 10927 9043 6803 6399 4823 5325 6591 9260 9237 6654 6880 7116 9059 11737
7806 11737 10982 11046 8399 8054 9008 9472 9012 8878 8823 9321 8880 6328 5177 7131 5677 6632 6899 10343
7788 10343 11525 11856 10262 10441 9935 9290 10693 9513 9422 10235 9665 6615 6649 7027 4622 6506 5034
7771 5034 7156 6277 10470 10718 5861 2955 5162 3409 2091 633 5256 8586 7397 5976 8763
7756 8763 8354 4307 6926 9680 9041 8467 8356 10024 11110 8710 8071 9667 7849 3769 1260 -451
7740 -451 3412 4282 5874 7879 8785 6974 8095 11322 10651 8063 6389 2610 5815 4852 5985 8726
7724 8726 9041 7722 10456 13793 11526 10832 9517 6878 5581 3868 1826 1793 3024 1922 3108 3880
7708 3880 2063 -573 5304 7928 6796 4317 6028 5487 4404 5944 5414 3981 993 2251 4619
7693 4619 2618 2930 3665 5839 4889 5602 1595 -701 3663 5403 6206 5018 5031 4021 2515 1875 3954
7676 3954 3819 2274 1321 -1466 2361 6475 5563 1176 -1832 -2252 -1921 -2041 -3558 -1469 -1098 648 -250
7659 -250 -1720 -527 1100 1318 2267 2657 4158 3295 2338 3288 3365 3422 3507 3770 5620 3857 5150 4889 6947
7640 6947 6100 5597 5587 7417 9569 8836 7698 8551 7151 5961 7183 8209 10971 9164 5877 8510
7624 8510 9964 5209 -338 -866 -797 1475 2924 1501 771 2845 3571 5002 5326 4180 4051 4703 6091
7607 6091 5801 5293 4727 2631 3931 1582 -78 93 2285 -135 -2305 -2308 1340 2222 626 2584 3071
7590 3071 4659 9633 7065 2925 1284 561 -1877 -2526 -2754 -2613 -1148 965 1943 3341 7525 8145
7574 8145 8056 5320 2020 333 -180 643 -1687 -3623 -2760 -1079 941 3590 1226 -1706 -3389 -2335
7558 -2335 -1930 -4637 -5075 -2050 -499 3515 4368 1791 -1624 1312 2701 1568 3332 1744 -934 -1367
7542 -1367 -2191 -257 1421 2938 4028 5568 4745 4693 4184 1113 -2250 -1652 -2870 -648 -139 3514 5597
7525 5597 2649 4613 8751 10543 7409 3819 2634 2482 -277 1983 4715 5639 4811 3187 3649 2378
7509 2378 -1711 -137 1875 4004 4250 3310 3412 4253 2897 2039 1112 1471 606 1838 3582 4809 6619
7492 6619 6388 2340 -3495 -5091 -2904 -4754 -4871 -3762 -2957 -3073 -1666 2916 5241 3711 -1038 481
7476 481 1271 -198 2200 1005 -440 -2495 -4106 -2786 -133 -1719 -2680 4710 8384 7773 6613 1943
7460 1943 -1800 -2171 -741 -1393 -4462 -5731 -659 1135 4778 4845 7241 8759 8898 7940 7615 9307 7754
7443 7754 6594 4894 3649 2290 1422 5772 6542 5003 229 -1136 1651 5954 9033 7505 4981
7428 4981 4732 7207 4861 2386 672 508 781 -93 -1637 -348 -1223 332 137 -1764 189 290 809
7411 809 -1365 -1983 -3503 -6095 -4336 -2621 1331 3364 2804 1082 4208 5937 2619 -4 3567 2524
7395 2524 -39 -1144 371 2040 2842 5081 2134 -447 -141 3659 2627 -378 -415 1191 2302 -253
7379 -253 -1294 -478 -530 -2641 -2976 -2053 -7 -2768 -1633 807 -986 861 4471 5968 8200 6671
7363 6671 1335 620 371 -2858 -7630 -5266 -544 -4473 -4963 -880 421 -3396 -3927 -351 4800 8269
7347 8269 5583 2142 2491 4766 5057 2553 -1775 -1791 1093 4412 3993 4348 5002 4927 3441 2948 1426
7330 1426 -1443 -1752 -1497 592 4079 4356 2264 997 -2642 -3326 -4592 -2432 -1610 1330 3864 524
7314 524 -1043 954 2129 85 -4789 -2309 1778 1678 3397 3206 1872 3453 2130 1105 -1633 -1639
7298 -1639 1373 3301 2519 1192 -1523 -3890 -3525 -65 -167 267 792 1921 1670 -552 -2599 -1880 1942
7281 1942 5825 7891 5822 1382 893 1262 1904 4158 5219 5234 2075 809 2371 1861 1780 1234 1527
7264 1527 1922 1832 3450 2586 2340 391 814 2352 1758 181 -836 -1789 2908 6042 2683 2413 3711
7247 3711 3465 2655 2866 1353 -1939 -722 3625 4224 3034 5299 5061 2319 1605 317 373 2029 3585
7230 3585 6033 3968 2280 2138 1631 -592 950 3938 5789 3446 376 1699 -389 -3661 -3926 -851
7214 -851 -3391 -4137 -1665 1764 4979 1701 -72 1417 -71 -450 1813 3032 2502 427 1311 689
7198 689 -1144 -881 2900 2480 1330 1265 -87 1537 4382 2279 -2621 -5255 -2496 1316 857 1490 3009
7181 3009 5061 5874 2369 1200 1891 4301 4257 5035 5440 1856 27 -892 -300 -2233 -8347 -6645 -3867
7164 -3867 -6451 -5460 -3296 469 4790 6627 4319 -941 -2914 -4515 -4145 -3596 -1803 -2336 -1379 -1184
7148 -1184 -2327 679 4235 4161 3208 5790 5031 3003 2193 1981 2301 3495 2476 1262 2707 345 -1971
7131 -1971 -2315 -740 -1624 -1195 -1293 -1654 1077 1394 1828 -1274 -2865 -2520 -417 664 2474 1843 553
7114 553 1498 7475 6310 4284 1776 -1612 -2930 -3531 -5634 -3577 -2666 -1256 -502 -1045 -634 -70 -1363
7097 -1363 -2881 -5140 -4993 -2014 -2104 -2365 -1436 -3337 -4518 -4452 -6266 -7513 -4683 -3400 -4133 -2678 -1887
7080 -1887 -1030 -2574 -3686 -2964 1172 40 -4928 -5169 -2824 -3849 -5906 -4374 1264 1416 -458 -2847
7064 -2847 -3383 -2652 -2321 -1504 199 -1605 -2595 -1141 -873 914 -1339 -2605 -1815 -1991 -1294 77 -3073
7047 -3073 -8344 -10096 -8210 -7718 -7680 -9447 -6782 -7053 -8340 -4344 -4247 -2092 -3296 -5550 -6220 -5371 -6096
7030 -6096 -5437 -2143 -2934 -6292 -6778 -5729 -4294 -5971 -4835 -2873 -2287 -544 1690 1054 1142 1431 3207
7013 3207 7061 3577 1143 -779 13 -411 -3565 -4491 -2173 1171 1194 774 -502 -575 -1568 -5100 -7597
6996 -7597 -5927 -5989 -6937 -3385 252 4206 5233 2980 2180 -942 -394 1708 1094 -3739 -3936 -147 2124
6979 2124 809 -2125 -1504 -1970 -1170 2925 4433 1204 2205 3130 3292 6644 4061 761 940 3154
6963 3154 -69 -3781 -1650 130 224 1052 1700 1960 898 182 1575 28 -1130 -493 -2861 -2630 -2640
6946 -2640 -3411 -2768 -5286 -5068 -4500 -1733 -847 -790 -862 -3185 -3387 820 3839 4152 3598 2813 -197 -1287
6928 -1287 -2190 -474 -1422 -999 1654 3690 7827 4417 1471 -902 291 770 -202 1035 1595 3295
6912 3295 4139 3806 2534 1949 5825 7921 3383 1838 448 3618 7215 10366 8814 4868 2971 5401
6896 5401 6054 3300 1541 3046 4983 1199 -1122 -2072 -135 2820 1617 -1708 -2810 -3798 -1970 -961
6880 -961 -1646 -4911 -3690 -1983 -896 1112 -32 -4243 -3598 -3841 264 1283 -67 -1113 956 1512
6864 1512 3399 -120 -4711 -3337 -787 554 1957 148 613 1858 829 -1095 -170 -813 -4529 -4470
6848 -4470 -3606 772 5739 6357 4029 29 -1981 -3 2096 1303 -1744 -2692 -691 3234 5483 3854
6832 3854 3214 2762 1655 -1589 -3458 1236 842 591 -3525 1913 2759 2243 4666 3820 5316 7475 6366
6815 6366 892 -306 3756 6115 4469 5378 4374 1645 2486 1927 1395 1204 -1689 -1089 -1688 -2672 884
6798 884 4747 4598 7184 12099 16168 17742 21882 34400 46279 47357 39920 35910 33140 27653 20223
6783 20223 14764 11487 9869 7831 9426 9421 12993 16776 25692 34526 45869 52849 60085 69958 83534
6768 83534 95239 108432 120510 127835 133361 133267 117293 95313 76234 57486 37283 25013 18170
6755 18170 14461 13872 10822 6003 5809 8336 7665 8156 9614 8011 7309 5803 4615 4018 3340 1710
6739 1710 4873 6626 6201 5541 4645 1896 1315 3131 3506 1097 -1689 1558 3909 1325 -1175 0
6723 0 -835 -424 342 -1385 -1330 -310 2303 -528 -2111 -2759 -3338 -2800 -1101 419 988 4895 7932 5155
6705 5155 1302 -1925 1928 1831 394 -776 -1281 189 3593 1193 -1098 -460 1242 4322 1625 62
6689 62 3950 5239 1201 -866 -175 731 579 1686 1293 1074 -2804 -3115 -2738 -232 2581 2646 2851 659
6671 659 498 -344 -626 -514 1184 5131 3886 3176 1620 2635 7515 6498 3709 3601 2766 1047 -1417
6654 -1417 -1217 816 4237 2085 72 -3975 -3541 -2381 -3371 -188 -551 -863 -112 -2029 320 2239
6638 2239 3133 292 646 139 -3666 -3120 -51 2743 1949 -514 -1016 1359 -252 -3887 -2437 -1496 -724
6621 -724 -1660 -1306 338 4582 3069 -3104 -6300 -3993 3437 6240 5063 1350 1028 4216 -1378 -4507
6605 -4507 -1492 -2039 -4916 -3480 -790 -403 603 -2241 -1167 -2311 -5570 -9956 -10620 -9287 -7453 -7272
6589 -7272 -7685 -6270 -6077 -10389 -8103 -4883 961 -292 -2156 -1182 -1017 -81 1112 2822 4193 2951
6573 2951 1802 -573 -1643 -3366 632 1224 -2946 -3539 -3055 -3026 1150 3702 4952 2188 -2024 -4375
6557 -4375 -4760 -1938 1441 2091 1645 494 987 509 -84 -879 -2443 -3727 -398 4193 3503 490 618
6540 618 -752 361 -1455 13 2376 4065 3794 1928 217 419 2725 1839 3491 6192 4240 791
6524 791 2925 4853 4652 -81 -117 2839 5049 2894 -448 -5572 -4942 -1064 610 2094 5296 2706
6508 2706 558 1530 1290 -3186 -3974 -1963 1242 6610 4642 1229 924 1097 585 1484 994 4068 4854
6491 4854 1945 -1984 -4271 -5238 -2119 -313 1884 3431 3151 1048 -5045 -4974 -1336 692 -1552 91
6475 91 -376 -759 -1686 -2700 -2802 -2816 -4277 -3848 25 3823 2984 1995 4367 4315 796 -2436 -2693 -4959
6457 -4959 -3926 -943 279 -1755 -1606 -840 282 3124 1840 -3789 -5228 -3764 -2788 -281 -559 -1688
6441 -1688 1856 3749 1964 1553 3427 2864 406 142 249 -66 -3183 -4645 -2691 2628 3577 3670 3928
6424 3928 4966 3415 -1155 -2246 1238 3420 3022 -534 -2989 -6164 -4525 -3410 -6158 -6119 -4661 -3327
6408 -3327 -4047 -5797 -6122 -4461 -3963 -750 -4149 -9553 -9017 -4986 -3275 -2977 -3024 -3614 -4239 -3837 -2463
6391 -2463 -3170 -1795 3924 6047 4164 5583 6292 6396 1901 -2523 -593 200 919 3836 7636 5516
6375 5516 5473 2336 957 1193 1595 -2588 -3395 595 1565 -978 -3352 -2088 -2275 -1053 -1859 -3125 -3605
6358 -3605 -4365 -1954 248 -371 -2851 -812 1358 1367 233 -3236 -1986 -844 -865 -2511 -2736 -1769 -2805
6341 -2805 -4532 -5979 -4302 -8286 -9200 -5560 -3697 -2751 -5679 -4920 -4579 -5443 -2458 -1803 274 -2995
6325 -2995 -5946 -4364 -3325 -2627 -2666 -1873 -1808 -3017 -6781 -5532 -2821 -952 -2809 653 48 -1335 1143
6308 1143 -1452 -4432 -3065 -1415 1683 1792 -2732 -3495 -2838 -304 -427 206 5107 5167 7861 3615 -453
6291 -453 -904 101 2044 1740 -925 1937 4212 1722 -287 812 3088 3771 2483 -1708 -4931 -3903
6275 -3903 -4637 -7806 -7122 -4367 -5890 -5247 -3988 -785 610 1732 6833 9135 4972 1507 1295 939
6259 939 3658 3470 3795 4401 1918 189 -1161 -296 -584 -1104 -294 2279 2308 2305 -1742 -3922 -3485 -2932 -2723
6240 -2723 -2303 -3353 -5608 -7579 -3044 1329 4171 5739 5957 3212 45 371 281 951 -2646 -1459
6224 -1459 1406 -851 -3458 -2160 -3951 -1876 -3274 -5765 -4457 -5783 -4320 234 2087 1069 -1351
6209 -1351 -3885 -6470 -6405 -3824 -308 -1209 -328 1637 -1641 -4342 -4269 -5454 -5057 -2971 -2487 -2563 -2308 -380
6191 -380 1812 3088 1126 1485 1806 0 332 -2328 -2170 -569 -1747 -1964 -5284 -6023 -4499 -5715 -4182
6174 -4182 -3361 -1975 -309 -4418 -7120 -3183 -689 295 -4111 -5944 -3026 -711 -3440 -2254 939
6159 939 2247 7016 9501 4725 -483 -3421 -4536 -3695 -5523 -6171 -2755 -5535 -3822 -3126 -4225 -4839
6143 -4839 -3649 -4189 -1471 39 -601 1132 2363 1224 155 -862 -2327 -2334 1658 1970 1180 2676 5018
6126 5018 5794 5138 812 -2621 -3523 -1645 -838 1923 3574 3532 -1428 -4142 -3872 -5532 -4726 -3938 -4745
6109 -4745 -3575 -1118 127 3582 4638 2064 -4698 -2028 2497 1528 275 -2200 -2622 -1989 -914 -1252
6093 -1252 -112 538 1182 1636 2387 2048 1167 -1158 -1744 -1436 -3797 -4915 -3169 -2692 -2972 -1489 -755 -3243
6075 -3243 -1996 2086 2375 -880 -1369 -2108 -5103 -3156 -311 -90 -2387 -3206 -5983 -7265 -7654 -6420
6059 -6420 -5124 -2363 1884 1585 -876 -975 110 482 -966 -2383 -2999 -3848 -5565 -3804 -3814 -5783 -5043
6042 -5043 -1563 -1558 -2498 -3450 -2912 -2445 -6618 -4570 567 -2548 -4616 -2742 218 -1185 -1714 -2311 -1994
6025 -1994 -5752 -6288 -5993 -4727 -7938 -10208 -7517 -7420 -6702 -5374 -4971 -3376 -2825 -2505 -2818 -2274 -2517 -5382
6007 -5382 -7779 -7871 -5797 -3331 -2954 -864 1240 3408 2526 1430 -142 496 3394 1796 -679 -4868
5991 -4868 -6619 -5956 -5197 -7828 -7965 -8168 -7364 -5341 -6352 -6325 -2275 -299 -1796 -1503 -1193 887 640
5974 640 885 568 -623 -1186 -1830 -2020 481 -836 -450 142 -679 -2928 -1325 -1934 -4450 -3048 -1964
5957 -1964 -576 2204 2033 5804 5717 2635 1819 -149 1442 2695 2180 784 -793 -1501 -3388 -930
5941 -930 -2694 -2705 -2177 -1776 -1110 -2093 -146 2126 1950 -718 119 -1006 -333 -823 -1824 -3235 -4735 -4234
5923 -4234 -2912 -635 1878 2331 -25 -1646 -2732 -181 1523 1733 554 1172 876 4 -2665 -4787
5907 -4787 -5497 -2189 1467 -1771 -3550 -3770 -3998 -2251 -1673 -2499 -2259 -4677 -5921 -7380 -6550 -3428 -3963
5890 -3963 -2151 1833 3551 1096 -833 -893 -1177 -1354 -1097 -272 -1086 -3647 -827 461 -2033 -3527 -3414
5873 -3414 -2651 -3781 -3425 -3418 -4514 -2775 -2027 -4898 -8768 -6300 -6607 -7042 -5196 -3885 -5109 -5362 -619
5856 -619 -564 -1189 -4024 -2700 -3266 -3968 -2898 -4643 -3518 -3277 -3079 -1555 55 -1818 -2228 -1993 -2702 -6137
5838 -6137 -5979 -3783 -1674 769 2524 -743 -1858 -1545 -2519 -2268 -5930 -6153 -2965 -1698 -733 -2071
5822 -2071 -441 -1132 -3846 -3586 -3116 -2114 -2011 -772 -1360 -3472 -3762 -329 708 -1619 -3402 -3189 -317
5805 -317 1035 -1950 -5197 -4681 -3250 -665 587 526 1125 2096 3028 5186 6140 4519 1375 869 -847
5788 -847 -1117 -2291 -543 1037 895 1067 1176 167 989 1457 2775 1890 3173 3058 -1062 -2472 -2051
5771 -2051 -950 -533 -1206 -2192 -898 -837 527 2206 1865 -1207 -1192 -208 -1366 -2627 10 2735 6230
5754 6230 2956 605 1204 1087 -167 -1666 -1425 -3666 -1628 791 3403 3906 350 -1479 -1205 654
5738 654 -481 -1177 -4702 -7646 -6070 -3736 -2699 -4085 -2967 -1529 -1378 -3359 -1791 -2945 -1082 -225
5722 -225 1897 1345 -2400 -4327 -6108 -1984 916 700 -309 -2025 -1647 -3837 -4431 -6651 -5549 -2511
5706 -2511 -1710 -1630 1149 26 -2184 -3606 -1719 55 -2150 -1216 -273 -869 -3537 -3095 239 1457 -12
5689 -12 1705 3459 3812 2331 -1471 -3866 -2771 -7 66 -2319 -3578 -5247 -4139 -142 2177 1512
5673 1512 2077 1708 4141 4787 307 -59 757 2462 2361 3102 2324 -1479 -4010 -2072 -4711 -4694 -3727 -2737
5655 -2737 -2905 -3739 -6139 -6987 -4161 -4401 -6346 -10089 -4704 2047 297 -2510 -5406 -4432 -7971 -9951
5639 -9951 -5745 -4180 -1441 -587 -799 -2801 -2367 -1662 -3146 -309 893 3629 2457 1738 -1718 -5924
5623 -5924 -6193 529 5457 4886 4768 2732 -1200 -2298 480 2814 5083 4608 4036 3196 3482 2803 557
5606 557 -5235 -5612 -4533 -2917 -368 1320 160 -1339 -2361 -3290 -4422 -2189 -259 -15 -415 1
5590 1 -1918 -4042 -5441 -5565 -1205 1052 -3421 -4234 -4117 -8206 -4771 -2369 831 -1170 -3064 -4613
5574 -4613 -3355 746 3389 1795 1851 3768 4639 4360 4789 2981 4043 5902 4444 -66 -1102 2587
5558 2587 2262 3079 1086 3155 4068 3328 3044 6544 7067 4230 4711 1593 -1763 -1296 -2486 -1626 1633
5541 1633 8027 8457 5362 4253 1760 1853 4776 4470 525 -1819 -3287 -3712 -4156 -2433 597 -494
5525 -494 -510 -2705 -6443 -5500 -3623 -1683 -567 -1545 1443 4889 3329 -1249 -1285 -3550 -4170 -3063 117
5508 117 1535 -3114 -5246 -5351 -4553 -5094 -3908 -4412 -8366 -8042 -4088 -3791 -4749 -4619 -5038 -8414 -8995 -6138
5490 -6138 -3334 -1105 3095 1032 -681 1048 2151 78 -2023 -2448 -2377 -62 316 1378 2662 1710
5474 1710 2155 2187 778 -2300 -4731 -3625 -2060 -4017 -6464 -6734 -6015 -5860 -6438 -10675 -7421 -3788 -1166
5457 -1166 2452 2501 1923 1825 1028 2425 3389 4304 3634 2843 -135 -129 2342 2685 759 1285 -357 -295 41
5438 41 2026 1463 -1145 -1244 386 -1688 -2865 -1535 -959 -4243 -6237 -4562 -5043 -6465 -5670 -4103 -1609
5421 -1609 265 1285 -87 3312 1551 146 -908 -4556 -2469 1532 210 -1281 -920 -1661 -3785
5406 -3785 -4002 -1861 -312 1543 4402 5647 4412 2228 841 -3664 -5407 -8639 -8591 -7617 -5161 -1946
5390 -1946 -1369 905 4032 7277 9735 9532 6994 -2068 -9051 -7295 -3236 -2276 -5327 -3164 -260 -541
5374 -541 2367 3750 1441 -986 -1804 -2864 -2562 1880 1939 -360 -958 -982 3756 4767 4327 2851 -2134
5357 -2134 -3010 -786 -1396 -2902 -3485 -1339 -147 -3086 -3041 -348 -315 -3537 -4330 -2392 -3520 -3126 -2152
5340 -2152 -3600 -3373 -442 542 -1644 -2964 -2732 -1621 335 1840 733 -1286 -2889 -5255 -3746 385
5324 385 638 3704 3016 1839 135 480 98 -3017 -4418 -760 1875 -825 -2068 -3475 -2188 242
5308 242 -576 -3128 -3507 -1504 -19 1802 648 -1622 1248 -523 -2146 -1296 -722 565 -648 -246
5292 -246 510 362 -127 -1291 -4780 -4688 -4413 -2470 1661 -2387 -6002 -4507 -4574 -725 1054 -3151 -3997
5275 -3997 -2322 -2558 -1756 -4169 -6056 -5676 -5867 -4723 -5954 -7277 -3184 -1341 -3335 -3609 -4672 -2567
5259 -2567 -954 1281 -1254 561 311 -2436 -2903 -183 3312 3391 -1776 -6133 -5022 -3282 -596 -3119
5243 -3119 -3410 -1128 402 -97 -1388 -2415 -3233 -1420 -986 -2630 -2204 -2025 -3645 -628 737 1498 -923
5226 -923 -3254 -1487 -1539 2494 3364 -1040 -1548 -1373 -780 44 2418 6157 5241 2996 559 -1498 -1816
5209 -1816 -342 178 -692 -1131 -542 -351 -1627 -2135 -4717 -4088 -3967 -2779 66 -404 -3214 -3953 -3273 -2823
5191 -2823 -4065 -2914 -2609 -2487 639 1197 -1248 -3594 -6305 -4401 -1317 -646 236 -744 -3309 -2485 -2017
5174 -2017 -3561 -2685 -3612 -2608 -2302 -2888 -2485 -2791 3024 4697 2837 -2938 -3289 -1947 341 72 -5299
5157 -5299 -4410 -4563 -2291 -960 -1397 -141 -622 -2138 -1839 -4853 -1870 -592 -164 -588 -1947 30 3122
5140 3122 1127 -2369 -2481 -2627 -4644 -4611 -6299 -5000 657 2174 -537 -448 778 -1870 -3551 -3665 -2159
5123 -2159 939 -1401 -5064 -7409 -8415 -9765 -7851 -6017 -7019 -2866 -2935 -3345 -3625 -4693 -4098 -1304
5107 -1304 30 -4669 -4856 -829 814 -2260 -3451 -2466 -4678 -4083 -1409 -480 494 620 1581 3802 5151
5090 5151 2647 745 2417 807 -3236 -4477 -2964 -3701 -5520 -5336 -2032 1171 -234 -738 -2857 -3255
5074 -3255 -2695 -4271 -5476 -3260 -1184 -1714 -2842 617 -1743 -2431 -1437 -2698 -4752 -5348 -2248 1252
5058 1252 676 -56 160 -6166 -6343 -3029 -3087 -4000 -4316 -3252 -3486 214 89 1014 3470 5465 5222 4732
5040 4732 3844 3218 4452 4487 766 1318 3376 2005 -1348 -659 -1781 -5783 -9116 -11453 -5209 -1672
5024 -1672 -1841 -1205 -314 -1195 -1662 -1303 472 2845 2841 1061 1265 1418 -2807 -3558 -3477 59 -1214 3154
5006 3154 7159 7000 5857 2992 1833 3594 1207 -824 -3146 -1040 -1794 -5009 -5124 -5021 -2643 604
4990 604 -1300 -4472 -4523 -5174 -5518 -4756 -1354 -2140 -2248 -6378 -8278 -6625 -5085 -4483 -3408 -3190 -2529 431
4972 431 3354 1881 -482 -3249 -1933 -1986 -2928 -3596 -1021 1440 1363 945 -407 1774 2157 3321 369
4955 369 1115 -1350 -1950 -145 -586 -6428 -6372 -3130 -2624 -2031 -2171 -110 4337 2709 1211 2011 1815 2469
4937 2469 2652 4909 4310 1394 -3409 -3568 -2775 -142 -574 -1652 -2279 -1367 -2428 -3959 -4080 -4712 -4301
4920 -4301 -3150 -1162 -1027 1375 5783 4817 2977 1656 -577 -2667 -602 -3054 -4045 460 1756 1373
4904 1373 -2546 -2222 -998 668 1227 -394 -77 -1700 -4086 -3064 -2371 -2887 -2193 2220 4664 4482 6006
4887 6006 5491 163 -922 -536 -11 2242 1754 -796 -369 -4030 -3393 -1680 -2457 -3042 -4455 -4586 -7809
4870 -7809 -9570 -5607 -2772 -5104 -4885 -4119 -2648 651 362 1565 1784 2172 361 1343 1111 -224 -984
4853 -984 -4112 -3924 -3730 -6263 -5850 -3625 -1261 977 1093 2073 -1809 -4595 -4645 -1462 -2623 -2814 -1128
4836 -1128 1688 -2475 -5697 -5154 -4519 -1767 -4071 -4445 -5879 -5579 -2443 -166 1971 339 -1137 -3529
4820 -3529 -3131 -4724 -6030 -4789 -3277 -3320 -1371 -4939 -5838 -5234 -4734 -4157 -2179 -2932 -3702 -470 -1889
4803 -1889 -2358 -3736 -2041 2157 462 -2906 -3888 -1839 -1971 -630 -2213 -3797 -7125 -8485 -6393 -5538
4787 -5538 -5395 -5259 -1715 -1437 -2136 -560 2725 17 -3050 -4180 -5964 -4895 -2255 -788 1382 462
4771 462 -3713 -1827 1288 850 -6201 -4999 93 846 -1375 -3551 -5465 -6657 -2867 -2654 -3618 -4685
4755 -4685 -3422 -2318 936 -565 -1656 -3096 -2697 -1861 -3503 -2675 -1253 -1953 981 2954 966 -40
4739 -40 -38 -758 -2471 -4491 -8366 -3870 1048 3978 3439 2570 1140 -3529 -3761 -5611 -5814 -5241 -3532 -3390
4721 -3390 -3990 -3668 -2698 -3000 -1968 -1974 -3792 -4660 -882 2133 498 -729 626 1071 -1590 -4589 -5499
4704 -5499 -3097 1743 397 -2875 112 829 -956 -535 -96 -1575 -3037 -3937 -2664 1007 1300 2675
4688 2675 2371 3880 3762 1966 301 249 -791 -930 -4695 -4053 -3035 -3262 -5656 -4771 -2636 96 946
4671 946 3001 2796 1943 2232 1552 2042 312 2816 5602 4868 2312 797 -4923 -5473 -2506 -532 589
4654 589 -329 1759 3040 3256 3028 -1062 -1597 -2981 -2826 -2597 -4161 -5217 -1796 314 1532 -1064 -929
4637 -929 1041 -121 -2035 -2128 -1857 -3164 -5324 -3318 714 -751 -575 2092 366 180 -824 -3374
4621 -3374 -4341 -2477 143 -1758 -1155 -122 1684 624 -1724 -4265 -3674 -5139 -6619 -6063 -2348 -2952
4605 -2952 -2885 -1889 -2576 44 3055 2326 3188 5440 8108 6009 3359 2101 3885 3525 2206 3387 180
4588 180 205 -463 -3384 -4173 -5527 -1120 -701 1820 2480 2610 2499 3018 3067 -30 -4540 -5783 -3010 -2442
4570 -2442 -4198 -5134 -5500 -8574 -10328 -7994 -4062 -6165 -7731 -7644 -5061 -6264 -4354 -2161 -1281 -1255 -3163
4553 -3163 -1518 -2071 -2833 -2910 -575 316 593 -2136 -7193 -4996 -3042 -3728 -3848 -6740 -7691 -5159 -2117
4536 -2117 -1314 -4059 -3073 569 -1415 -4338 -5268 -1991 950 1119 2345 1796 1505 -1598 -3709 -2943 -2407
4519 -2407 1056 3168 1578 3012 1507 -1000 -2633 -4362 -2134 -347 1216 -989 -2351 2659 5310
4504 5310 4279 2712 1570 -328 -290 1401 1784 334 -714 -229 -1729 -2315 574 -1886 -9095 -10203
4488 -10203 -5035 -2166 969 3022 3024 5584 4649 -722 -3129 -2202 -3611 -5547 -4072 -424 -1207 -689
4472 -689 1310 -3779 -4988 -4686 -4839 -5838 -5482 -3950 -2588 -717 -2541 -1295 -547 -1961 -1605 1566 1322
4455 1322 -1406 -4226 -3134 609 -349 -799 -18 2958 3196 2534 4295 2846 1244 1684 786 1160 1476
4438 1476 -603 -4083 -3457 1273 1268 -79 -5100 -9331 -8864 -5881 -6565 -5049 -2930 -112 576 1102 1420
4421 1420 -851 -1192 -74 203 -4394 -5490 -1492 2653 107 -2428 -1790 -3157 -2692 -1551 -2535 -5201
4405 -5201 -8244 -3693 -980 236 -2365 -2080 -4215 -4614 -3912 -3652 -1565 -3735 -5579 -6029 -4164 -418
4389 -418 1409 922 -635 -819 -1041 -2792 -3925 -3816 -2932 -3260 -2339 -3509 -3596 -1545 -3305 -2461 -531 1737
4371 1737 874 1745 -2340 -3476 -111 -729 382 -1774 -3893 -4052 -7398 -8596 -7248 -5250 -3994 -4322
4355 -4322 -2771 -1451 -969 1728 3877 2472 342 -1049 -1733 -1861 -618 1251 -1760 -1516 -1695 -2105
4339 -2105 -2805 -5153 -7714 -6336 -2756 -4022 -7362 -5874 -6388 -7298 -2836 -1779 590 -650 -2131 -1247
4323 -1247 -395 369 -3654 -6941 -2924 -1912 -2369 -2614 -571 173 -199 -1994 -1499 -3724 -5174 -3465 -3067
4306 -3067 -4124 -2629 -595 743 4787 1165 -2818 -1725 -23 91 -960 2732 2308 -193 1196
4291 1196 4066 847 -2333 -1484 -5013 -7325 -5282 -1071 2181 4160 3834 4433 830 556 3550 2501
4275 2501 2128 3463 2195 2566 2763 830 2449 597 -487 2299 -209 1307 209 -2488 -2145 -885
4259 -885 -440 -1170 1686 -621 -1561 189 2960 5352 5701 6565 5799 1741 -834 -2300 -4976 -5287 -683
4242 -683 2882 2914 2718 3085 -1929 -3054 -2409 1924 2679 959 -2140 -2845 -3754 -2942 -3082 -504 -2643 -3189
4224 -3189 -1486 -1888 -2558 -1978 -1882 1848 3005 883 1364 982 3183 3155 951 -1202 -3044 -2246 -719
4207 -719 342 -652 -1434 -1344 -1804 -3827 -2479 -1303 -3426 -1991 -2194 -2645 1569 2999 -833 -7812 -8277
4190 -8277 -5986 -5161 -530 798 1199 2179 -1078 -6253 -5141 -4363 -5246 -5652 -4288 569 2683 -2714
4174 -2714 -7380 -7621 -5915 -4743 -5212 -6472 -6573 -5669 -6400 -4028 -1650 -2485 -2532 -1734 1054 -901 2202
4157 2202 4136 2808 -1254 -1290 1551 2420 2363 1449 -215 -1129 -64 1194 3140 4858 2826 1088 1577
4140 1577 1854 2492 4862 7128 5322 7717 6198 4947 5445 1177 -1194 -2735 -3491 -4165 -3341 -2395 -2644
4123 -2644 -153 4944 -1005 -3356 -217 -164 -1456 -65 -3134 -5242 -3959 -409 4925 6418 5730 5586
4107 5586 351 -1448 -2367 -2573 -4110 -4365 -1674 157 -590 922 2872 3893 1618 -1941 -2654 -831
4091 -831 2956 6472 8317 4565 1058 3836 4445 4275 7252 5549 4903 2101 -504 -2868 -1016 5382
4075 5382 9585 8698 8071 7344 5557 2044 -1572 -2655 -2221 -1419 126 -260 -1074 -5036 -7424 -8609 -4384
4058 -4384 -2895 -1000 -445 -2277 -3763 -1656 1861 3928 5003 1821 1144 204 827 2048 2769 3384
4042 3384 1798 2839 2941 2856 5322 5581 4349 8389 8585 3301 4093 3465 3956 4318 2622 136 -106
4025 -106 -971 -2704 -2078 -2940 -1620 334 -1045 -1654 -442 2623 1649 1799 4898 2199 2864 3328 3243 1326
4007 1326 -1041 -2919 -4804 -3408 -3279 -4567 -3941 -5992 -2324 2824 5566 3258 -696 -5394 -9559
3992 -9559 -8772 -1881 1815 2732 -1583 -2687 -6045 -7062 -4985 -3245 -1278 -4892 -7037 -8168 -6466
3977 -6466 -6685 -5526 -1176 -2331 -4363 -2223 2220 3845 3354 5070 5667 5151 2276 1139 -2700 -4292
3961 -4292 -1167 333 -2361 -4714 -2000 1338 2781 5390 2595 157 -2247 -3711 -2094 2114 1376
3946 1376 -2121 -1954 806 2003 2648 1737 -2794 -2363 -227 1234 -642 -3530 -5628 -3647 -1760 -273
3930 -273 -602 -159 1108 164 50 3357 3377 -448 -3366 -3354 -3672 -1432 2566 -493 -2463 762 967 -600
3912 -600 -1535 -727 1633 -1016 -5129 -4820 -6210 -7074 -5040 -3980 -2190 -2287 -2526 -2653 -715 -1769 -3446
3895 -3446 -558 -1355 -7391 -6810 -6005 -5095 -2640 -3697 -3756 1373 2836 1706 847 -280 173 -962 -117
3878 -117 -1352 -2610 -2953 -175 1860 874 1453 1306 3554 2363 -46 -523 -563 740 567 1170 -3115
3861 -3115 -2807 -5078 -3965 -1756 -3940 -4106 -5985 -8498 -11365 -12716 -10225 -11771 -7283 -4108 -3544 -3901
3845 -3901 -3259 -7752 -8311 -4742 -545 1090 -2194 -2740 -1479 324 2480 -1029 -1282 -2093 -3968 -2898
3829 -2898 -3828 -305 1852 239 -2189 -3407 -368 -393 -145 3600 7365 6148 4518 3237 -201 -1053
3813 -1053 882 841 -4100 -5065 -3754 -3876 -4675 -2870 -1292 -2189 -2743 -852 548 913 -446 -285 -855
3796 -855 367 424 -2069 -6679 -7101 -1975 -2586 185 1672 -489 1160 -2924 -2423 -2887 -6694 -8619 -6404
3779 -6404 -2045 -309 893 -1633 -1600 -2653 -3186 -3266 -1388 472 -1724 -3559 -2064 -3147 -4442 -7162
3763 -7162 -9269 -7551 -3256 -2773 -2822 -762 -1530 96 -171 -351 -441 -164 -1250 -2611 -3433 -3499 -4422 -6222
3745 -6222 -6615 -3355 -1508 -1570 74 949 1541 1531 -496 -1448 1612 1382 -1663 -444 -3146 -5677 -3232
3728 -3232 -4314 -4642 -3582 534 3204 357 1019 -475 949 1913 1776 3861 4896 4240 199 -1697
3712 -1697 -3115 -4451 -3353 -3618 -5887 -3187 -4018 -5849 -3587 -1630 292 214 -79 -602 -3166 -2911 -2332
3695 -2332 -1841 -1814 -1060 1009 -959 -1879 -3410 -6326 -3823 -1424 -2028 -2933 -2496 -4724 -5195 -2959 526
3678 526 3827 1395 -1684 -3094 -1273 1946 5829 4673 2297 2719 2157 1790 132 -1682 -675 1268
3662 1268 -76 -1205 7 613 939 -1682 -5192 -4709 -1190 1429 1857 1300 3618 1459 -1420 -5001
3646 -5001 -5910 -4819 -3674 -1524 958 3027 796 859 1635 3755 2974 150 2922 3683 1844 980 863
3629 863 755 -1199 -3613 -2226 -3562 -2088 -2171 -4637 -2574 -493 721 2280 2521 -99 -839 -1700 -2810
3612 -2810 -4389 -3679 -1141 -540 -2819 -909 1612 480 245 2800 4610 4060 3276 2059 -1708 -2363
3596 -2363 -3024 -3027 -2975 -285 363 -104 842 -443 -1301 -776 719 -1205 -3530 -5731 -3796 -3701 -6454 -2770
3578 -2770 -240 -557 -1324 -1571 -3590 -3577 -5286 -4189 -3517 -3998 -2727 -2706 -6110 -6313 -5039 -4115 -2847 -2013
3560 -2013 -1602 -2227 -2374 -1438 -903 -2421 -2889 -2625 -2892 -4229 202 3166 2929 2357 2566 2479 737 -980
3542 -980 -1912 -1816 1605 221 909 719 962 1454 770 2021 4956 4259 2922 1903 2234 2846 132 1895
3524 1895 1822 -71 -634 -3812 -2442 -1602 -2169 798 2730 1940 1247 1445 1155 3244 798 -168 1210
3507 1210 2029 1376 -1323 905 -156 -1552 -4370 -3963 -2599 -1332 -1291 -1398 490 260 976 -2664 -4094
3490 -4094 24 1344 1581 1438 -3456 -5212 -5186 -2262 291 -3602 -5480 -1232 1092 -193 -1230 -1886
3474 -1886 -2571 -3084 -2033 1694 1355 -764 -3682 -4342 -819 2067 5164 3370 -2871 -1503 -1865 -2148
3458 -2148 -405 149 1414 -645 -3422 -6497 -6301 -7914 -6365 -260 93 -4018 -2151 363 25 -2303
3442 -2303 -4282 -5230 -5792 -5719 -5367 -1041 196 -3536 -6100 -5177 -3668 -2460 -1380 -1223 -294 1092 1988
3425 1988 2478 -545 311 145 -669 -2261 -2372 934 -549 -1298 -2610 -1810 -1074 273 655 1162 -1864
3408 -1864 -3164 273 1220 -1169 -749 -352 -1555 -4299 -5102 -6083 -7922 -6204 -3169 -116 -476 -3328
3392 -3328 -3801 -2669 -1623 -3264 -3057 423 3771 6492 8176 8017 4894 5482 3642 1045 -1944 -3138
3376 -3138 -100 3173 2740 3979 3422 -340 -1002 864 367 1494 -970 -854 -2443 -776 95 188 803
3359 803 1964 -828 -693 -1579 -1314 1623 2960 1172 2127 1935 761 -247 1999 1568 1260 1769 608
3342 608 -2347 -1167 922 2694 -1387 -1645 1078 2183 -1121 -4135 -5415 -5691 -121 189 -934 945
3326 945 1524 1861 3271 1742 -2513 -4612 -3535 -2636 -1682 1434 1448 2177 5496 7109 10109 11044 7960
3309 7960 8592 6136 -518 440 -531 -3063 -5245 -4927 -1456 4203 3673 1902 1884 3181 301 -2883 -3900
3292 -3900 -1564 1033 2965 -1776 -2737 -3146 -3072 -4043 -5395 -4687 -5301 -3421 -1405 654 4527 5529 5307
3275 5307 1252 -1413 -2247 -2747 422 1926 1893 2314 3319 -1303 -5295 -3496 -2265 -554 4183 6288
3259 6288 4573 4694 3287 3476 2295 677 342 -2589 853 1628 3616 2208 -1738 -6512 -5372 -3771
3243 -3771 -4070 -6245 -5535 -3735 -2980 -4645 -3715 -989 1275 1307 838 646 52 -2138 -1646 2051 -1272
3226 -1272 761 4951 1978 1120 2873 5888 5134 1908 -2493 -1519 48 -43 -3710 -4642 -3711 -103 754
3209 754 -206 1275 733 -1307 -4296 -5558 -7195 -6300 -4696 -2488 3790 1941 2032 2152 680 1515 3233
3192 3233 1859 28 -3181 -4824 -2504 1628 1997 1465 -2099 -593 -263 -1052 -14 -661 -187 575 -1057
3175 -1057 -808 -4150 -5458 -1644 -241 -1277 -1650 4046 4303 1494 1770 3787 5423 4287 1473 3285
3159 3285 6437 704 -3616 -4513 -2430 -2002 -2960 -3353 -2278 -3827 -4587 -5682 -5557 -1327 -2053 -2318 159
3142 159 3613 2740 -726 -2382 -1334 -1178 -1280 -1352 -2198 -3389 -4888 -2516 2902 4383 4729 6542 5884
3125 5884 3402 -255 -4317 -2698 -1228 630 557 1311 -337 -3390 -3182 -2760 -778 -676 -1620 -4357 -3711
3108 -3711 -541 1017 845 -869 -2576 -4598 -6661 -5056 -499 -1881 -3248 -4248 -3889 -2179 -210
3093 -210 2711 3696 1587 4249 4057 1381 -527 66 2569 -262 1772 229 -3267 -1258 2645 5630
3077 5630 4499 1449 -119 -963 -3676 -5375 -4389 -5098 -5153 -3361 122 2311 900 517 2168 3364
3061 3364 1577 -525 -731 74 -3283 -5990 -2896 -3172 -4988 -4980 -1362 14 -2678 -4057 -1975 1361
3045 1361 121 -2103 -773 2009 2027 4123 3801 4160 1267 -808 -2615 -5340 -5799 -5207 -3641 890
3029 890 2827 2670 1829 4984 8493 4232 1934 2085 2414 1966 2107 1459 1920 3312 3996 3995 4102 -1420
3011 -1420 -203 2033 452 -2019 -4050 -2067 -3599 -3991 -1704 -851 -3024 -2088 -1097 1268 -186 -770
2995 -770 -561 -4158 -2701 2990 2757 717 -1770 -4171 -4199 -3028 -3852 -7501 -4919 -2116 78 4166
2979 4166 5693 4446 -161 -2400 -2186 2944 2738 1947 1549 467 129 -54 -3034 44 510 -348 -335
2962 -335 -1119 -664 -709 -1499 -777 -405 -601 -2071 254 2369 282 749 -485 -297 475 -2872 -5469 -2532
2944 -2532 2842 2171 1116 1667 2459 2408 1170 -756 -814 -452 3335 3164 -805 -2188 -364 -737 1404
2927 1404 2486 1198 2942 2404 934 1183 953 -45 -2534 -429 1466 4475 5623 3346 869 3083
2911 3083 664 607 2648 1416 -197 3055 3059 -191 -429 273 2297 4378 4816 6877 6724 2897 1876
2894 1876 3002 100 -5091 -5082 -2936 -1872 -3450 -2444 -806 -520 1714 3084 -728 -5035 -8486 -8106
2878 -8106 -2545 363 1157 673 861 4268 5169 4520 1145 -75 2516 3657 3195 3965 7331 9318 6336
2861 6336 3621 2321 3016 3564 1902 1272 592 -1855 -3310 -1955 -1239 560 4316 2966 791 603
2845 603 -1085 -4509 -1603 1116 1526 318 1442 405 -777 1743 5543 2417 -867 294 1107 2782
2829 2782 1483 876 3656 5432 7799 5937 3793 -1265 1546 3534 5225 4410 2073 101 -3741
2814 -3741 -6276 -6262 -4676 -5573 -6013 -5214 -2704 -1912 351 -1824 -1567 -1143 -952 -1126 -1482 -2153 13 4543
2796 4543 4191 4865 3212 455 3059 7375 5862 1520 -186 -1253 175 -1116 -1414 -1197 -1369 -1163
2780 -1163 -555 -456 -3150 -1247 -1329 -3691 -3587 -5795 -7533 -5884 -3599 -2135 -839 -5362 -5006 -3009 -1805
2763 -1805 -3361 -3583 -454 1194 -703 -2783 -364 137 2475 1703 924 -477 -2560 -1382 -3261 -2047
2747 -2047 514 -359 -445 2099 4165 3202 1720 -1656 -3288 -2514 2285 5541 2603 554 -891 -3170
2731 -3170 -2211 1395 1544 -572 -1774 -1122 -1448 1971 4593 5642 2392 263 284 1254 2033 3103 -2959
2714 -2959 -6511 -4345 -3128 662 4546 5145 1698 -611 -1789 -3175 -1012 -698 -3405 -3928 -2893 -2908
2698 -2908 -1566 -856 -2710 -2050 -2599 -898 2083 -349 -306 -198 -103 1720 1774 2798 3706 2799 4164 4697
2680 4697 4903 4502 1776 1586 3277 1200 394 3267 3808 3984 2759 1856 1249 1445 1367 3150 4709 5202
2662 5202 1235 576 -1024 -1366 -1233 394 77 -2174 -759 -1173 297 3340 2439 3144 1339 65 -1264
2645 -1264 -1430 451 -1701 -2117 -596 3437 2027 1319 3513 1470 -2927 -2963 1586 2038 645 -20 -525
2628 -525 -1434 1088 804 -1136 -6541 -6869 -3314 1356 3380 4238 2618 2711 5758 5627 5567 2259 -1113
2611 -1113 -2516 -3962 -3696 -849 1796 -495 -2854 -2175 -316 37 -1464 -5313 -5137 -4828 -1227 -723
2595 -723 -2335 -2454 -1052 663 2482 3202 4607 6375 7079 3387 709 -305 -2965 -4672 -2602 -2014
2579 -2014 -4596 -2474 -316 438 -4197 -5159 -1753 906 841 678 603 1914 -1031 -1528 -2415 -1332 -461
2562 -461 -1985 -2468 -4331 -4236 -1467 -1781 -4978 -3734 -453 1970 755 -4247 -4891 -2363 1269 347 1918
2545 1918 3601 -33 -3007 -1302 -1679 -2060 -640 3266 1386 -497 569 653 203 1738 1741 166 -1680
2528 -1680 -683 3116 2403 -486 -1381 0 663 -1890 -4800 -5371 -6656 -4059 2010 3928 2771 -674
2512 -674 -1483 -2231 -2515 -5870 -8053 -5009 -812 1872 877 1712 3261 3527 1506 646 -699 -4371 -3477
2495 -3477 -2554 855 3101 4653 3450 2297 804 -3158 -2430 -1403 -3005 -5106 -3043 -694 1307
2480 1307 5471 6698 3745 5010 6156 4013 4689 5390 3319 2610 3249 6268 6213 4833 6120 8408
2464 8408 6510 3519 492 -1437 -300 2768 2718 -1669 -3238 -3989 -3745 -817 973 1198 -730 -1809
2448 -1809 -600 468 -2183 -1963 -1795 -1354 427 -918 -6414 -3675 -511 -2383 -1744 268 3704 439
2432 439 -1998 -6474 -7721 -6989 -3432 -402 1283 -1124 -2482 -427 -249 28 1445 737 -3083 -6465
2416 -6465 -6493 -3309 -3973 -3860 -6024 -6179 -4058 -5953 -6678 -4412 -2089 -1107 1027 1316 -1778 804 -2116
2399 -2116 -4899 -3213 -905 1680 4457 2585 1243 -1299 -5334 -5245 -4065 -2290 1798 519 -4563
2384 -4563 -5882 -6203 -6360 -3823 -2347 -1508 -1421 827 2165 235 345 -2 355 -6 -3776 -2643 -1678
2367 -1678 -4086 -4733 -4368 -3515 -4662 -4371 -3513 -1549 2018 4214 6103 7160 5022 -208 -1837 -2985
2351 -2985 -4170 -604 3516 2633 281 -1435 -1111 1274 3623 4974 779 620 3955 3658 1986 1762
2335 1762 469 -2921 -1663 829 244 -267 -613 1828 3010 2923 -707 -419 -356 -1185 -798 297 110 4187
2317 4187 4761 4426 2608 -634 -1412 -3545 -3512 -1671 4708 6925 6341 3635 185 -1887 -5274 -8872
2301 -8872 -7213 -3799 -5418 -4975 -1431 -1498 -5482 -3488 -2805 -3120 -2851 -1654 -43 583 1176 1591 546
2284 546 2422 2458 387 953 3661 3655 398 882 4084 3163 3173 7698 7715 5633 5238 5215 -131 -2322 -216
2265 -216 865 2504 6418 5300 1813 -1483 -1862 -177 -2074 825 1199 727 1988 666 985 3602
2249 3602 1214 -517 -1452 273 3998 2188 1414 481 63 -154 483 252 1252 1807 616 348 2304
2232 2304 -831 -2024 -1157 -2379 -6146 -6778 -2660 1070 -66 957 2269 4022 2915 2935 518 -453
2216 -453 -1233 -2063 -3819 -5610 -4203 893 -528 889 2332 3398 4222 3448 868 1462 3815 3402 4291
2199 4291 3051 -1139 -2816 -783 2252 2659 2036 -1246 -4794 -4531 -4333 212 181 1998 6168 7109 5644
2182 5644 2853 2190 385 -3118 -6093 -4823 -3741 -1415 -259 1284 3113 4977 4919 3690 3810 4442
2166 4442 3339 1287 223 -2114 -2658 -2223 -1508 -1934 -6165 -5750 -1745 -197 -2753 -5535 -4817 506
2150 506 2921 3052 775 -1874 -3517 -1460 -5167 -8109 -8100 -4740 -404 -920 -1750 -1571 1225 2184 1370
2133 1370 1419 1619 -1940 -873 577 -4184 -7648 -6031 -6863 -3415 2627 2585 685 -107 -818 -340 2240
2116 2240 6048 8339 5622 2335 4167 4492 2311 1925 2416 4002 3333 1856 -1676 -2273 608 2933
2100 2933 3836 1658 -1198 -1140 1064 1771 -398 -93 2083 -508 -628 2695 4807 5690 4470 1466 -624
2083 -624 -439 4488 2479 -1019 -592 -324 -1681 -3771 -5931 -4052 -398 1240 3312 1742 -247 606
2067 606 3612 3310 1671 331 75 -10 -2588 -6169 -7311 -5568 -1784 105 2799 4448 4699 2505
2051 2505 1930 404 -1413 -2381 -734 240 -1957 -204 1258 384 -1462 -1 598 13 -1025 279
2035 279 1656 -1213 -847 2520 2967 1595 227 -641 1586 2525 2596 -586 -4040 -3586 -4692 -5198 -5947
2018 -5947 -5982 -4133 -4548 -4451 -2361 403 3648 4704 2595 702 459 -319 -835 1382 876 803 -593 -1174
2000 -1174 -815 -204 -89 -2081 -2212 -2279 -1365 871 -985 -687 4625 1328 -1851 -2699 -595 907 -174
1983 -174 -2458 -1859 247 -578 -3024 -4509 -4875 -2877 2470 6307 9048 8029 5088 2054 397 2174
1967 2174 3439 649 -170 945 2113 4269 5659 8396 7487 5601 3304 675 -779 -2206 -2216 941
1951 941 1704 3261 2559 2079 3693 1654 1332 1367 347 -2121 -3167 -2604 -1808 -194 803 -1857 -926 3021
1933 3021 3372 5245 3172 -264 -1007 -1482 2373 3617 5980 4365 2965 2073 -498 -1649 -1380 557
1917 557 247 -802 -5244 -4905 -4419 -3076 -1405 -1630 -2877 -6342 -7333 -7101 -4517 1268 5493 6780 4197
1900 4197 3015 2320 1370 2307 3048 5934 5148 1748 -1385 216 2228 3128 2145 853 2649 3679 3215
1883 3215 601 -3418 -4176 -1485 -3410 -3594 -987 -485 -846 -149 -678 -447 -2269 -4753 -6182 -4249 -6220
1866 -6220 -6705 -4399 -848 -341 -4063 -3976 -3081 -1981 -1579 -1756 -3022 -4021 383 4853 5480 4814 3006
1849 3006 3251 5122 3966 1524 -2668 -5829 -3687 -1519 1218 2083 3042 2417 3353 3734 3066 1698 3560
1832 3560 1732 3172 4613 7698 5990 3093 5981 5345 3742 680 -3062 -7244 -6313 -2323 460
1817 460 2202 2881 1840 680 1853 2772 3630 3076 -596 -2258 -3290 -4250 -4924 -4556 -3018 -2360 -3816
1800 -3816 -2820 429 688 2855 339 -2122 -2115 1220 -1188 1210 1491 1209 133 -504 1308 779 1631
1783 1631 3211 2157 1725 2728 1721 28 -2468 -3524 -4314 -5922 -4799 -511 3953 3481 2689 719
1767 719 -3570 -3387 -2867 944 5469 7747 7606 5138 1650 -148 2720 1555 594 770 529 1284 2809
1750 2809 2504 1089 1425 1770 -1917 -3286 -1646 1167 3195 3178 1477 2852 3386 2770 3529 2976 1914
1733 1914 1097 -461 -1967 -1988 2660 -244 -4275 -4795 -1414 -625 -242 1061 -261 -1899 -1207 -150 97
1716 97 1224 -1771 -3537 -1030 1685 1764 -244 -1365 -438 269 721 -1979 -1669 2116 1176 245 1827
1699 1827 824 1369 2513 2324 804 -1210 -4244 -6846 -6318 -3139 -2344 16 -2255 -6597 -3636 3046
1683 3046 5787 6914 4996 3267 2909 1961 1261 -672 2661 2437 4065 6097 1620 -1570 -1242 1197
1667 1197 2004 1893 4582 6118 4743 2755 2229 9 -2286 -1824 -2454 -3912 -4945 -2685 -3833 -3102
1651 -3102 -3859 -1306 -8 1644 827 -507 1973 3546 -292 -987 -226 1338 836 2411 1279 2822
1635 2822 2701 2518 674 -2160 -4723 -5317 -4897 -736 213 -984 110 2066 3527 4042 1112 -7275
1619 -7275 -10190 -5953 -4359 -3444 -1051 3000 2433 4334 2144 2476 2503 1731 -1648 -4722 -6964 -3432
1603 -3432 3920 4736 4847 4210 914 2047 6175 7030 3551 -567 -649 -546 246 -625 -1301 -1751 -2373 -2797
1585 -2797 433 665 855 -2409 -2872 127 932 841 -631 -399 724 2257 2665 -643 -3266 -3686 -4418
1568 -4418 -3570 -1453 2193 2650 949 1480 3474 4813 5752 8207 8360 9426 8770 5204 3731 5201
1552 5201 5057 3222 -1160 -1997 577 -117 1833 2423 -1789 -2409 -642 125 349 -926 721 1822 2089
1535 2089 780 1056 2741 492 -113 -104 -2303 304 2055 2401 -2585 -2248 -1134 -4021 -4785 -1238 1727
1518 1727 2619 2645 1052 458 3934 7615 6173 3218 5699 7585 5215 244 -2516 -1952 -1395 -2423
1502 -2423 -7012 -7152 -7078 -7493 -5350 -2943 -4255 -5750 -5588 -4663 -3 6384 6241 5860 5812 4418 5632
1485 5632 4148 4830 4031 -1062 -1659 565 1005 -1 -650 90 2617 2065 2163 4296 1991 -2058 393
1468 393 4252 6115 6791 4571 -3683 -6850 -4000 -1865 -923 -77 3256 6013 5263 6029 8168 6881
1452 6881 3130 4957 6184 5282 3663 4643 -93 -2162 -1348 -1269 -708 2793 2612 2422 733 708 1490 2586
1434 2586 4123 2181 273 -83 4077 3871 3904 6203 4729 3360 2327 -747 -1994 -2880 -617 2333
1418 2333 675 751 1764 2209 2986 3641 2280 1930 1624 1168 926 -1297 -12 2954 2650 1213 -907
1401 -907 18 41 567 349 -894 -1058 2905 3423 3897 1541 1720 398 -96 2194 2659 858 2365 4231
1383 4231 5598 5154 6572 5820 2452 1090 4144 4569 2318 73 2341 4261 4077 4720 4257 5401
1367 5401 5686 4246 3575 4688 4915 1848 687 -2385 -4202 -2732 -1025 -1107 -644 -1128 -1440 -3556 -7060
1350 -7060 -4799 -1286 -3527 -3369 -3124 -3176 -2265 -2739 -5050 -1336 -862 -2941 -3481 -4794 -5392 -2700 -822
1333 -822 351 -275 87 2183 1817 2927 6415 9462 8104 6416 5747 4787 7262 7241 6660 7185 5914
1316 5914 6318 4998 3148 5336 7163 7202 4605 2549 4790 7821 5998 7264 7198 4890 4993 844
1300 844 2192 4292 3311 4889 4842 2138 3440 2756 1437 2478 3544 1061 993 1608 2945 1630 2642
1283 2642 2809 3218 4991 7018 4897 -210 -3117 -2316 -1328 1922 594 -2082 -52 -1005 -586 -506 -147
1266 -147 -152 1583 2441 -987 -5256 -4101 -473 719 2121 5863 8686 10433 8540 4923 3266 1497
1250 1497 257 -62 1340 3336 2980 2881 5349 4956 2122 16 1891 2836 1767 1330 -1978 -4432 -4852
1233 -4852 -3631 -121 139 2087 1628 2379 3866 2747 -371 -2759 -2525 -286 -27 -1007 -102 950 -872
1216 -872 1909 3201 2778 3183 1659 3024 3897 1672 1979 5059 6054 3835 4188 2481 2484 945 972 -1596
1198 -1596 1592 4513 2331 671 1881 3919 5855 6609 6155 3540 1737 635 -2674 -1392 716
1183 716 240 393 1231 1019 2026 3277 2499 2978 5902 8662 7802 6286 5095 3859 5766 4300 4360
1166 4360 5609 2516 3512 3660 4794 3230 2827 2479 3414 2030 1178 9 -2372 542 1622 645 -574
1149 -574 -2547 -2343 -2178 -425 4960 2854 1657 2944 4663 7197 7531 6408 2049 1008 4923 5820
1133 5820 2078 816 -1547 -2853 576 5250 3279 1311 530 1494 925 -2089 -3477 -3935 -188 1352
1117 1352 5011 2390 -2239 -449 -1419 756 4585 4089 3141 4885 6242 4178 3882 4464 1413 -1337
1101 -1337 -2883 259 970 590 1813 2307 20 -891 -696 1925 5786 5563 3453 2878 2663 2722 603
1084 603 796 3610 6675 4850 3137 -192 3128 3197 2280 -729 2176 3165 4402 3529 74 1817 3086
1067 3086 2256 1853 2267 243 -3908 -4217 -3415 -2692 -1033 -1794 49 1082 -296 -3806 -4701 -3694 -1973
1050 -1973 -1665 -531 493 490 -143 -1129 529 -300 -961 -1983 1260 3261 3427 3838 5420 5434 4405 5358
1032 5358 3958 2332 75 -1688 463 3600 2489 3036 3066 -2349 -3640 1918 1844 800 4341 7560
1016 7560 4751 2691 1408 750 408 474 -209 -1254 -1395 -1616 -5716 -6861 -4903 691 2910 1343 1796
999 1796 -255 -316 2178 4500 4619 3600 1131 1733 832 4551 4999 -378 1371 945 4966 6786 3122
982 3122 2056 6006 7568 2802 -2334 -3021 1774 5367 6867 6581 5811 7001 8821 7249 3022 3885
966 3885 3271 1827 -1009 -1639 1178 -1224 -343 1674 384 -711 -190 -2260 -1572 163 -24 -357 -5024
949 -5024 -3297 -1027 -3646 -1508 -1520 -1136 -886 -755 345 305 -1606 -1822 -1645 -2505 -3736 -2298 1846 206
931 206 655 6158 7335 4012 3208 1191 -1673 -2691 -1744 -599 410 1901 1996 811 -1598 -1027 1371
914 1371 1376 186 -3000 -3711 -3117 -2885 -1699 -10 3032 5921 4079 -446 -1293 2765 5111 2777 2499
897 2499 3393 2067 2351 3127 1817 134 702 2686 5719 6261 3493 1968 2654 2339 2090 974 -1096
880 -1096 -4474 -5633 -3401 -550 977 2387 3840 2741 3426 -1717 -604 1843 2142 -1062 -3282 -2379
864 -2379 -245 -1266 2010 2167 1151 -424 2501 1378 1248 2026 754 -673 -277 -2327 -3151 -3640 198
847 198 -1675 -1029 1289 -194 138 245 467 2700 2560 2026 4033 1962 1894 4746 2892 3051 1765 79
829 79 -370 -949 -2531 -2375 -311 1658 4588 2378 -1600 -5336 -5687 -4468 -865 -216 1568 936 3812
812 3812 3916 -1285 -490 527 2488 3597 2215 -4715 -2997 -3935 -2220 412 -678 -1079 -1601 -3235
796 -3235 -2120 -1121 442 1098 2280 5648 153 -2552 533 1525 -3762 -2283 300 601 2033 2062 -934
779 -934 -3936 -547 600 -542 -2762 -450 2092 4156 6022 4889 4070 2478 5949 7166 4940 5579
763 5579 2482 1785 -331 -2880 -2294 -1177 1485 2173 2492 1061 129 2520 4933 5923 4363 5061 4903
746 4903 2766 1848 -138 513 3643 6276 6693 5179 2175 -564 726 2507 2195 4532 5789 1964
730 1964 -3025 -3465 -1614 -1776 -1598 -3953 -5111 -303 2734 3245 2673 1963 1291 2665 2880 -179 -1184
713 -1184 2931 5553 7323 7542 4264 1212 4639 5449 4936 1686 1047 1254 165 3151 3883 1907 1823
696 1823 1365 3661 4874 4009 4695 3514 2360 4846 1598 -426 1120 2182 -1844 -240 -2812 -5018
680 -5018 -3553 -2154 893 3708 4917 5416 2445 -1517 -1949 77 796 -1040 -2165 -1889 -4275 -4892
664 -4892 -4018 -2792 -537 -1475 -3157 -3188 -1569 -961 -2170 -952 1299 1383 1429 3241 1088 711 617 1481
646 1481 3539 8372 7161 4543 1074 -67 266 -405 -690 1485 3882 2187 125 812 879 983 -1405
629 -1405 -648 518 551 -744 -2848 -3645 -3559 -3262 3895 5080 1269 2082 3896 3085 1875 799 388 2967
611 2967 2607 1678 1116 2089 18 13 -484 86 -960 1645 382 1863 5041 4767 4054 488 3874 5847
593 5847 4595 -315 -1758 -648 -1213 -965 -1618 -3009 -4388 -938 44 1567 3263 3157 5511 4965 2051
576 2051 1148 1206 2466 1424 -2427 -3093 -2952 -3006 -2606 -2036 723 3226 1924 2708 -110 -3569 890 3746
558 3746 4031 3239 3860 1808 -981 -1825 -1471 75 1411 -411 2610 1592 -930 -1303 645 2456 1551
541 1551 272 392 1494 3056 3566 4417 2722 -1598 135 1145 1791 4609 3592 3910 2828 3989
525 3989 2185 -1125 91 -2771 -4478 -4541 -4452 -3852 -2615 -1271 -225 387 3041 3729 210 1058 2268
508 2268 1510 2047 5241 7600 6660 6271 3658 -778 -3305 -1877 -477 -1608 -1926 -4970 -6393 -2925
492 -2925 -1467 -119 -826 -3476 -4044 -7601 -9772 -6817 -3727 -3928 -3871 -2126 -5741 -7802 -4018 1012
476 1012 423 179 -313 888 1857 3917 4545 1641 497 1695 3191 2219 2235 4367 2158 -123 -1049
459 -1049 2395 1041 -1451 -1528 -1856 -1717 2130 -1512 -6528 -7435 -3863 -357 -318 -682 -594 2524 5596 5081
441 5081 4718 1903 -1096 -1169 1164 3902 4220 3857 6350 7615 6673 4588 5533 3659 2013 -406 -52
424 -52 112 945 1647 2053 -997 -2045 1699 7168 5645 3146 3064 4917 3593 2862 -496 1593 2506 603
406 603 443 3210 4400 3842 1392 -625 -966 2591 3689 3136 -1826 -1629 549 2329 4346 3140 2402
389 2402 434 304 -831 1433 4513 5513 6696 5566 3347 332 1153 4533 2962 618 1400 -733
373 -733 -1900 -2750 -3 4426 5873 3234 2441 976 893 835 -444 720 1988 2577 1946 3213 2796 4507
355 4507 6242 6747 3703 909 -582 -1942 -3064 -1273 606 1918 2761 1662 3727 4436 939 -2096
339 -2096 -2836 2865 2472 -611 478 2095 -662 179 1294 2412 2745 1839 2118 3051 3378 1714 2079
322 2079 1860 698 3439 2907 2535 1204 -64 -1777 -1169 1695 3591 2867 4328 5053 3960 4520 2510
305 2510 -655 886 1198 1911 240 -1181 692 1332 3133 1684 -417 -2948 -1755 -2171 -2288 -1376 653
288 653 1921 4033 5732 5935 4700 1106 455 1341 3045 1448 1249 2838 3971 4315 2106 -51 -260
271 -260 -777 668 283 2070 2803 1915 1390 3278 3475 2245 1336 1548 -1339 -2018 -1479 -2766 -3896 1305
253 1305 4223 2756 2384 2058 1159 -275 2508 4526 2812 2616 459 -322 -2287 233 1699 1130 1272
236 1272 1283 -694 -601 -1028 854 2598 3274 3010 2619 3035 1711 473 54 -595 775 156 -2216 -5480
218 -5480 -5309 -843 405 -316 -365 1492 1511 290 -1521 -2107 -2656 1222 909 -532 1169 3486 4242 4879
200 4879 6734 5899 4280 3671 1679 1373 1122 1154 -1837 -1550 -648 -1483 -1702 -1420 -2123 -1059 91 -2200
182 -2200 -1223 -504 407 2013 2504 5513 2957 -827 -445 2046 2401 1380 -583 116 1050 -351 -830
165 -830 -615 3081 3426 2872 3459 3866 3059 1427 -700 -2216 -328 -924 208 1613 1767 -858 -1745 846
147 846 175 -714 2943 4192 4385 3551 663 1330 2001 1061 1124 2739 2677 2231 3013 143 619 1769 3809
128 3809 5308 5960 6201 5216 4000 2106 2448 1076 -159 358 -13 -605 695 1799 -459 1056 2561
111 2561 1435 -721 -1227 -4059 -2263 -665 -915 -982 157 -960 -2273 -1895 -2565 987 2592 -376 -1298
94 -1298 1289 1686 718 1226 1560 913 -39 -140 1319 3713 2858 1126 778 2300 2685 608 511 2790
76 2790 3480 336 425 700 1341 2625 4612 3854 2701 1191 182 698 645 1698 2109 1037 1724 1798 928
57 928 1350 2657 1542 2099 2394 1732 2839 3513 2902 1262 296 -39 -2289 -1575 -864 181 -672 -815 1227
38 1227 2384 2729 4582 6495 4066 1356 672 -256 -2358 -3418 -3128 -717 269 -555 1570 3796 3654
21 3654 3918 5389 5692 1549 1889 1081 353 956 994 1207 281 402 694 529 -1775 450 2558 3259 4525
2 4525 4043 4425
0 4425
$$ Imaginary data points
##PAGE= N=2
##DATA TABLE= (X++(I..I)), XYDATA
32767 20189 20389 22848 23369 21692 24202 27582 27678 26490 24673 23545 24603 26362 25989 25993 27594 30626
32751 30626 31492 30154 29331 30107 30422 30513 30522 29914 31950 32276 29608 29478 31842 35406 35717 37258 36907 35181
32733 35181 33479 32760 32065 35859 36990 35923 36348 34458 30763 30752 32705 35595 36634 36809 37982 36676
32717 36676 33382 33486 36844 38643 38178 39207 42250 42098 42858 44278 43647 43895 42974 43099 42035 41221 40471
32700 40471 42334 44956 45675 46552 46656 44849 45950 48195 49531 47401 45789 48024 50289 49525 51373
32685 51373 51722 51245 51252 51199 51398 52777 53890 55049 54989 53444 51742 50606 53212 54166 55760 56354 54741
32668 54741 52555 52351 51540 52938 53220 50572 51345 54919 54671 53323 54466 54592 55823 57819 57421 58217
32652 58217 58397 61590 60864 58415 57048 58311 59609 61002 62011 60354 58564 58472 58076 57640 58064 60453
32636 60453 62946 65417 66152 66349 67020 65484 61812 61287 60960 61890 62630 62782 62101 62514 62875 64669 65478
32619 65478 64293 64180 67098 70104 70546 72723 73989 72751 72306 73438 70583 68650 68296 67668 70293 71845
32603 71845 73171 74745 71264 71446 73105 72190 68225 65814 70002 76091 77351 75343 75035 74968 73138 73126
32587 73126 72588 74643 77649 75254 75367 75454 74197 75108 73108 71713 72147 72050 74932 79357 81095 80288 80490
32570 80490 79939 79533 79624 80450 83398 85277 85699 84022 82858 85867 84576 83021 84615 85181 83664 83671 83797
32553 83797 80154 80637 82728 82357 84313 86953 87083 85133 83572 85173 86781 86669 86704 88370 88175 88343
32537 88343 88558 89416 89150 88488 89737 92654 94292 94074 91617 89978 91308 96606 96445 96669 95526 94383
32521 94383 93201 94593 92721 93319 93578 93659 92935 93441 94847 96599 96839 97483 97957 97643 97580 97662 95513 91929
32503 91929 92992 96243 95265 92607 94683 99193 95813 92137 91703 93133 93384 94945 98274 101438 102216
32488 102216 102408 102101 101193 101245 102667 103745 104925 103414 99167 98262 97012 98469 99378 98960 98125 100628
32472 100628 99546 100466 99685 98348 99217 102127 104166 102317 103080 102677 102085 103156 104926 103971 101051 96006
32456 96006 95844 98948 99628 100081 103380 104024 102285 103533 103454 104582 107104 107434 107234 105817 107021 106974 107519
32439 107519 106990 109888 108974 108443 107425 104451 103654 102336 103146 105730 109356 111852 111829 109393 111085 112121
32423 112121 108313 106628 107355 110001 111191 112095 111817 109249 108225 108781 108286 107993 107254 107143 106362 107550
32407 107550 109662 112554 113635 114755 115105 112270 111489 111587 110681 109896 108175 109877 112319 112308 111677 110545
32391 110545 110970 112624 112685 115189 113130 110090 110986 108806 109795 110640 109152 112164 115118 113363 114488 117533
32375 117533 119479 119795 119904 120730 118150 116662 116007 115864 114617 116368 115639 115791 117643 118338 118494 116924
32359 116924 113592 113701 116588 118185 120832 121537 118530 117062 116358 114127 111792 111145 112992 115251 118031
32344 118031 120174 117980 116110 112754 112228 115118 115350 115787 117457 122217 122319 123180 123696 121462 122167 119608
32328 119608 118008 118361 118522 118597 119668 120837 120155 118042 118847 121606 123330 122578 118789 119032 121143 119994
32312 119994 119025 118949 118070 119389 122659 124415 125107 124077 123582 124665 122837 122365 122857 125659 125968 127017
32296 127017 129276 129118 126926 126807 124712 122822 122128 120172 115813 114840 116677 120906 121520 123678 125235
32281 125235 122931 122339 120348 121799 124592 127074 126188 121451 119486 122560 122308 122165 124163 123608 120819
32266 120819 120871 122822 124756 125324 123134 121198 122067 122297 125444 127334 124352 121709 122285 121736 124854 127179
32250 127179 124563 124869 124586 123396 119768 119855 123019 124658 124614 120433 118747 121500 122338 125208 131496 129317
32234 129317 126030 122515 121449 122205 123404 124943 125529 127373 125905 126674 127182 125147 125525 126435 125272 123805
32218 123805 124326 125885 124981 127464 126038 122664 122441 121853 120899 122111 123593 120737 121459 123901 126000 121345
32202 121345 118644 119438 121791 125070 123790 122802 122036 122500 122886 126502 124982 122413 120568 121244 120183 122212
32186 122212 125270 124431 127026 129825 127491 128902 127092 124633 121708 121542 123117 122149 123818 128037 129243
32171 129243 126593 127739 128190 126728 129408 129730 128258 125646 122469 119834 121149 124228 125249 126575 128543
32156 128543 126747 126332 132107 134722 130549 129846 130782 128158 127105 125964 124921 123433 120723 121724 122404
32141 122404 122986 124710 126833 129346 128847 128468 129328 128761 127712 126906 123376 122977 125533 126523 126831 127353 127191
32124 127191 127191 128041 127892 128828 128013 123672 122969 123941 124317 122489 125350 127287 129958 131393 130435 128663 126169
32107 126169 125580 127441 125521 127040 127955 126540 125148 126062 126447 127577 130297 131508 130396 130093 128910
32092 128910 127163 126146 127917 130000 127197 123824 125167 126450 125740 125196 124649 125118 125777 125342 124880 127683
32076 127683 130724 130589 126723 126112 123608 125304 127657 127870 125623 123587 126232 128356 126546 124989 121283
32061 121283 121249 123837 121458 119150 118134 122215 126292 126833 125856 125126 126196 125540 122752 123322 125902 128129
32045 128129 127863 127890 127780 127696 126975 128932 132228 132744 131223 130852 125489 118232 118022 119797 121390 122339 120504
32028 120504 123282 126599 125977 123761 124171 122061 119407 120977 123199 125064 123821 123716 124347 125400 125027
32013 125027 128816 132028 129060 126697 125210 122749 124432 126077 125093 124560 128338 129398 128119 125495 124617
31998 124617 124768 127754 125648 126597 129503 129877 131209 132125 132433 132049 129533 126836 126713 124424 122532 123491
31982 123491 129599 129011 128728 130631 129832 126746 126317 129002 132191 132206 130220 127537 125506 122460 123149 123541
31966 123541 122302 122659 122654 124383 124547 122049 126010 123108 120931 122860 125426 126857 127122 124363 124400 129479
31950 129479 132777 131392 129511 129239 129609 129502 130609 129436 129907 129601 130473 132429 131062 131332 132304 132029
31934 132029 131098 128694 125642 124952 124750 125735 128748 130018 130743 131316 131793 132643 132981 129914 124719 122357
31918 122357 124436 125406 126417 128771 127927 125867 126538 125847 126526 131044 133191 131531 126477 127096 129169 133628
31902 133628 133353 129973 127430 130210 132673 133994 136371 136197 135962 132350 130961 131340 130490 133965 136865
31887 136865 135369 132854 132251 132915 131277 132537 132799 133054 128753 124479 125167 124292 123768 129510 129631 128821
31871 128821 127551 128519 130149 128818 126698 129597 131839 130447 128685 127942 128337 130877 131682 129608 129346
31856 129346 129702 128135 127363 123308 124696 125171 124779 128017 130623 126701 127256 129245 133324 134664 133845 133101
31840 133101 133208 128650 126178 125400 125192 127612 127235 126583 127179 128509 129199 125720 126433 129587 132896 130683
31824 130683 130812 130770 130317 127858 128837 128862 128167 127614 128964 130250 131286 128983 121627 121447 126944 127994 124790
31807 124790 124827 127798 129436 129084 128162 127101 126524 128982 132268 129279 125404 129592 133191 133082 131091 130333
31791 130333 130779 132255 129631 126399 127388 128610 128166 129140 128279 127352 125312 125939 130099 132968 134450 131613
31775 131613 130412 132234 131349 131441 130907 132071 131768 127972 128432 134627 134869 134302 133564 135221 132494 131197
31759 131197 130874 129413 129948 128473 128952 125508 126783 128749 130988 129933 131189 131834 132022 135006 131418
31744 131418 127613 127334 128624 127593 129240 132578 133076 133056 133865 132517 129973 130003 133832 135993 134325 135558
31728 135558 134800 133699 130324 126155 124985 128012 129621 132273 134210 132934 132857 133867 131956 127368 126090
31713 126090 128533 127782 127961 129143 124889 126755 128905 129142 130110 128540 128800 130257 130112 131739 132664 131912
31697 131912 133857 136356 134991 132488 132869 134514 133628 132219 134122 132678 130221 129428 130781 128701 128561
31682 128561 129249 129253 131890 134435 133846 132368 129537 131793 134499 132656 131874 131644 135437 136360 137045 133035
31666 133035 131840 132055 131606 132534 131669 130514 128647 126583 127181 128128 126834 127073 129039 129250 132797 134116
31650 134116 133389 136729 136101 137705 136379 137200 134222 132804 133668 133405 134826 132040 129154 126720 127562 133236
31634 133236 134530 135577 135374 133173 131965 128472 128961 130747 132229 131676 128075 127158 129303 133185 133100 129660
31618 129660 126952 126976 123588 124576 127740 131197 134635 135959 133777 132039 134970 135765 134712 131070 127954
31603 127954 128778 130925 131341 129213 128033 131735 133491 129912 127401 128177 130985 129919 128487 128837 127986
31588 127986 129792 133093 132493 133144 133193 133334 132199 131888 134906 134721 136713 138158 138429 136993 135128 132310
31572 132310 131955 131493 132525 132978 132514 134847 135521 134839 134724 133176 128478 127947 130461 130314 129420 128851 127722
31555 127722 128038 129981 129394 130888 133579 135447 133322 134706 134779 135759 137445 135333 134538 132971 131391 128904
31539 128904 132028 134588 136589 138374 134317 131153 131887 132616 134390 133498 128976 128048 129240 132430 133176
31524 133176 132799 132383 133707 132835 132619 132675 132147 133665 133429 135040 136924 136937 132218 132016 133769 133188 132082
31507 132082 132680 130637 125815 124986 129981 132220 134509 136851 135223 135651 136681 136704 136032 135025 135048 131765
31491 131765 129543 132097 134272 134626 131412 133358 135411 135438 135356 136311 134765 134005 135927 136921 135685 134955
31475 134955 133920 131649 131286 131602 134874 131771 131818 134743 133269 132888 130616 130380 132473 131914 131693 131477
31459 131477 133092 132266 130123 127148 125288 127148 128376 128353 128444 127745 128036 123036 121636 127135 131083 129531
31443 129531 130846 132892 134378 134232 132620 132358 131422 128329 126205 127054 127905 127663 129972 132385 134874 137380
31427 137380 136823 133192 133551 131471 124428 122816 126540 129868 131728 129453 126428 126965 126804 127193 129190
31412 129190 133465 133456 133733 136717 139420 137710 138030 137176 137487 136964 134862 134911 133518 132554 133983 135423 135439
31395 135439 137521 139442 138015 137989 139226 139118 136964 134622 133025 134105 136233 133090 132138 133841 136954
31380 136954 136705 136531 135946 138172 137197 137320 136605 136076 133596 131540 132490 132891 133445 133302 131812 128644 126713
31363 126713 128662 133141 132909 131888 134305 134830 137626 136854 135782 133004 134457 134213 136051 138066 137184
31348 137184 136030 132340 130879 131629 135485 140613 137430 133632 134215 133604 132413 132671 134011 132948 130761
31333 130761 128006 129995 130489 130920 131606 132404 132521 131867 132612 132678 133201 133083 131830 130961 130765 132136 128568
31316 128568 128212 130239 129439 125760 126235 129275 132285 134377 135192 133513 133716 133400 133044 134627 136859 135737
31300 135737 134467 137826 138647 134979 134296 135022 136239 139421 141650 140642 138803 136344 133950 134410 132085
31285 132085 135183 136280 136100 135435 131845 130475 134374 135258 133857 131792 134169 134345 133242 134518 137683
31270 137683 135864 132365 133404 136096 138598 137916 136557 137151 138608 134872 131856 132111 130994 130508 132548
31255 132548 134750 132870 132688 131566 130595 132345 132826 133524 132947 134712 135739 135350 134007 131843 131239 130322
31239 130322 129400 130042 129335 131173 133308 134794 132971 132251 130326 129726 128238 127838 130873 134052 135908 134757
31223 134757 133464 131015 131944 130915 131470 132187 133731 134514 136479 136207 134593 136463 133911 132214 134398
31208 134398 139445 139838 139608 139206 137497 137824 138359 138436 134407 131403 131018 131393 130304 128875 130726 127346
31192 127346 127932 132981 133255 133534 134346 133898 132398 131960 135434 136431 134411 133071 131580 134156 131343 128719
31176 128719 126750 126939 128480 129074 130657 130275 131424 134712 134703 131343 130539 128680 127995 129790 130553 128007
31160 128007 131884 138017 141101 141338 142356 141096 139465 133605 129970 131883 134420 134008 135175 134422 132927
31145 132927 134090 134450 136686 138452 138538 135758 135590 137374 136425 137274 135254 131945 130976 131172 131926 133502
31129 133502 136452 139181 139024 135606 135418 136105 136836 135714 133713 133123 134104 134367 136647 137957 135798 135804 137204
31112 137204 134293 133023 132366 135209 138426 136411 134405 136587 138007 138674 138470 137197 138148 139464 139036
31097 139036 137934 137585 137824 136628 135622 134739 134704 136595 137284 137121 133806 132538 135849 133541 131463 131992
31081 131992 133614 133509 137000 136482 135125 138042 138145 138802 141034 140147 134684 134742 133390 131326 132849 133479
31065 133479 133363 136097 136363 138087 136856 136790 135603 135550 136463 138345 137290 133752 133744 133357 135732 135234 132842
31048 132842 134420 132812 134536 138749 138027 137099 135778 134428 133618 135048 134296 135688 138272 137002 137603
31033 137603 141647 140061 136278 135089 131875 130951 132545 133846 135106 136637 134731 135238 136557 133234 130185
31018 130185 131947 135674 134707 135028 134386 133334 131809 133311 135342 131961 129969 131312 131464 130186 132324
31003 132324 134117 135743 136286 136510 136900 136345 134189 132293 133421 132908 132509 131940 128690 127040 128316 130857
30987 130857 132965 132754 135760 139185 140089 140638 142310 142377 140179 138970 134428 129317 131074 134320 140077
30972 140077 142129 136784 134769 137421 136925 140081 138936 134981 133179 132849 128022 129146 135596 139353 139668
30957 139668 134744 133949 135873 135478 133682 134005 137900 137086 136803 136244 137675 139291 137755 136347 137051 136046
30941 136046 132920 132576 135386 133148 130204 130504 130927 128984 131603 135569 136230 136944 136700 137071 138449 140878
30925 140878 143299 144183 143365 141322 138707 136660 135311 133817 130901 133461 134361 135191 135537 134233 133187
30910 133187 130491 130026 130618 135956 136518 136050 133222 134933 139114 138190 134333 131581 132318 134677 135155 132085
30894 132085 130619 130533 131316 136349 138142 136478 134658 134242 133036 133443 134248 136025 135918 134187 132104 131063
30878 131063 131141 132435 138067 141842 141798 142648 141584 139438 137081 139367 139674 137920 137560 132230 134383 136946
30862 136946 134196 135582 136125 135640 136264 135037 133451 132082 132020 133700 133703 135041 135372 138389 138376 138891 139737
30845 139737 137493 135499 136733 138356 138625 140277 138614 136208 131633 132158 129629 130278 130893 135073 134997 131790
30829 131790 134632 135652 137562 136817 135203 132891 136139 137996 137249 134190 133538 137533 138069 136148 136680
30814 136680 133274 131648 133132 134560 133503 136585 138377 139646 137485 136110 135563 131748 131034 134776 138974
30799 138974 142182 141594 140089 136626 136461 133074 134969 137227 134929 133773 131273 133110 132442 131026 132798
30784 132798 134717 137288 136401 133829 135346 136031 138498 140262 141210 140084 140883 142117 140167 138682 137191
30769 137191 135530 135480 135484 137824 140978 144638 145132 141901 138199 138466 138991 138032 138885 142503 141602 139723 138800
30752 138800 139038 139125 139457 141463 139031 140762 140946 137308 137302 139336 137873 136230 136221 133593 134231 137355 134219
30735 134219 132465 134369 136958 137704 136186 134461 135839 137968 139743 138697 137307 135365 133694 134104 135659
30720 135659 137833 139804 139940 138954 140625 140341 138837 140233 140218 139680 139343 138277 140808 137568 133629 134676
30704 134676 138279 139801 135525 133597 135330 140298 141128 139780 138957 138690 140872 145310 142305 141922 141830 142078
30688 142078 140493 139177 139310 140474 141313 140724 140279 140340 139063 139321 136268 136141 138300 139244 136050 136274 138375
30671 138375 138104 136408 138671 136399 135309 138075 141360 142296 141353 141743 140672 139126 139830 139395 142439 141820
30655 141820 140352 139396 138733 136644 136443 140159 137289 137432 137470 135475 135743 140430 142133 146272 145641 141893
30639 141893 141373 141921 138393 137841 141060 141025 137647 135074 137373 140915 138702 135164 134276 132375 137122 140050
30623 140050 137870 137741 140358 139609 137233 136454 137477 136936 137773 139906 142702 142941 142522 139932 139870 138702
30607 138702 139538 141013 140963 139336 138389 135083 132957 133450 133354 133967 135070 137817 137646 138850 140177 137952
30591 137952 136206 135444 137392 135982 136034 136679 137595 137376 136948 138079 137888 137000 136595 135319 137834 138888 138197
30574 138197 137904 139244 139336 140628 139636 138933 138684 136896 137927 138343 137366 135379 134520 137674 138174 138994 141437
30557 141437 143843 141952 142301 141925 140594 140774 139261 138583 135629 134139 135354 140103 141978 139875 138232
30542 138232 139103 140096 137893 134224 134765 133758 133393 134250 134934 137332 140489 140367 139083 137103 137040 138987
30526 138987 140634 142193 141578 142362 139497 136441 135252 134017 133750 135821 136011 137427 140045 139258 137566
30511 137566 135067 134400 140190 141410 141615 139511 137993 138449 139823 141501 143072 142631 142080 141236 138275 135732
30495 135732 138773 140750 141056 140164 139421 138489 138987 137896 139195 138138 137711 140428 140198 138837 136551 137397
30479 137397 139856 141480 140986 143028 143610 143255 138488 136533 136463 137547 138333 140389 140407 141182 139659 138212
30463 138212 138246 136230 135951 140102 142455 142818 140139 137407 138805 139677 141450 141537 143199 144559 143405 144147
30447 144147 143217 138423 137836 138754 139130 139806 138846 136810 139704 142340 142110 141325 139755 136784 136795 138817 136568
30430 136568 133797 134586 137000 135746 136461 135666 136027 136253 136055 138384 140370 141269 139044 138596 138148 138295 137053
30413 137053 140827 138957 138488 139492 139998 139662 136866 136098 138015 136596 136643 137869 135828 136050 139701 141279
30397 141279 142030 142845 142120 139231 137047 141817 140246 137289 136306 134318 135231 137708 139853 137620 137281 137516
30381 137516 140361 141001 140841 142078 141043 138901 142056 139425 136181 136283 137055 137734 136184 135110 133332
30366 133332 134043 135675 134780 136049 137734 136871 137968 142364 140849 137883 139333 141284 141149 140615 142839
30351 142839 141699 139003 139556 139028 138733 136079 134448 134781 134918 139725 140650 141434 141352 137360 136868 137548 140128
30334 140128 144434 144325 141578 141354 142076 138818 137735 134548 139288 142273 141729 141839 140416 139304 140476
30319 140476 141999 141468 139803 135788 133966 137450 140038 140980 143733 145269 142058 140424 142498 143936 144494
30304 144494 141088 139563 141157 140549 138644 140388 140616 139215 140504 141460 137865 135177 134949 137311 140095
30289 140095 144962 144053 142968 144436 142033 141519 141340 144166 143205 141465 144297 145745 142744 140385 142725
30274 142725 145209 141524 139894 140202 142406 143188 141225 140977 142609 144660 140284 139925 137037 138294 142850
30259 142850 146141 146817 143215 144175 145425 143199 142254 141765 145191 142305 137338 141661 146192 144268 142190
30244 142190 141737 141188 144941 145882 141320 137656 136605 136942 134908 133237 132763 137760 142403 143933 142458
30229 142458 140625 138126 136528 135541 136556 140363 139664 138769 138118 137912 140500 141318 141152 137732 136653 140553
30213 140553 141402 138727 135143 136039 139323 142659 144216 141740 140009 141004 143176 140504 135870 136680 138539
30198 138539 141145 142906 142151 139179 138382 142006 144929 144684 143214 143914 143051 141934 141749 143906 147325 148256
30182 148256 147158 148524 144429 145621 145892 145809 143610 145452 146429 145034 143225 144214 142184 140382 141171 141458
30166 141458 137233 137223 141538 144505 145211 144531 144770 144725 142477 143306 142515 141985 141612 141500 136168 137026 140110
30149 140110 138656 136555 139916 142498 143260 142914 142467 145884 145865 145747 146670 144001 141610 141195 140704 142368
30133 142368 144227 142434 143186 143917 143845 142398 145905 146230 144646 143496 143397 142861 140841 138895 139892 141923
30117 141923 141024 141012 138923 138932 142571 145908 144446 142587 142600 140988 140447 141817 145108 144958 143052 143080 142215
30100 142215 141656 141170 139180 140962 146040 144764 143398 143142 144633 145402 140896 139964 140698 144048 142583 139897
30084 139897 140673 140301 140753 137569 136998 136948 140959 141291 137935 140055 142593 144718 145722 145756 145474 145884 146042
30067 146042 146500 145726 147389 145005 140723 137071 140344 143726 144370 142332 140275 142293 140905 138684 137622
30052 137622 140996 142089 141958 141881 141003 140697 143723 144831 146361 145882 143964 145257 146196 143212 141651 140845
30036 140845 139809 138283 139844 144005 145600 144272 143913 142178 141539 143524 143962 143597 142901 142493 145632 145994
30020 145994 143094 139786 142234 143259 141748 142420 141870 140565 142855 143079 143842 144360 143712 141643 139057 138813
30004 138813 136466 137118 140038 141716 142323 142166 144360 146353 146112 145875 146248 148758 149451 147045 146046 146061 144289
29987 144289 145293 146960 146275 145177 145146 145385 149627 150627 146838 142349 142493 141000 142119 140667 138692
29972 138692 143218 143160 144008 143171 141658 144442 145282 145094 145340 145191 142010 142908 143517 143040 139583 138671 139537
29955 139537 140867 138689 140152 144387 146363 144939 141040 138886 140958 142974 141652 142209 145367 146841
29941 146841 147142 147438 148919 147409 145320 145157 142620 141117 142160 142074 142329 141643 144206 144594 146875 144175
29925 144175 147221 148116 145568 144126 146069 147581 148496 147754 143184 139862 140846 144068 144206 144540 142757 142122
29909 142122 142392 145895 145325 145075 144751 146576 147325 148771 149980 149701 147749 146859 143680 142752 144960 145568
29893 145568 144153 142298 144583 145806 145742 141936 139569 142011 141965 139917 141942 143565 143770 142526 141424
29878 141424 141591 140965 141964 141479 143076 144992 147411 148062 146408 145391 142770 141624 142401 141834 141782 144507
29862 144507 144711 140802 142751 144169 145641 144109 141984 142831 143421 146019 143319 141198 139957 140499 141745
29847 141745 143389 144763 144692 144769 144207 139933 138369 142277 146167 148069 147198 146309 147835 146513 145378 145880
29831 145880 146437 143801 141661 143068 146109 148245 148449 146997 150087 151040 146620 145353 145261 144698 144828 142206
29815 142206 143292 141775 139327 135746 139834 143674 147567 152213 154536 152010 147841 142095 142156 144700 146960
29800 146960 146165 147001 148350 148244 149093 149334 150037 151316 150047 147779 149542 148042 146911 147622 145390 142702
29784 142702 142914 143294 143141 142862 141499 141113 141967 142075 141900 142007 143596 143497 144471 143781 144474 144259 147257 148160
29766 148160 148113 149907 150558 149759 149445 149552 151026 149745 146645 143894 144723 144897 144376 143621 142192 143705 144331
29749 144331 145140 145114 148539 149079 149512 147654 149550 145336 143926 143312 144530 144356 145589 145902 144187 144095 146088
29732 146088 144520 145855 149055 149127 148448 147097 146379 150168 151192 150902 145533 145596 148998 149580 148544 146022
29716 146022 146202 150001 147817 150212 149358 145443 143241 142974 143065 144796 146779 147247 145156 143738 143033 144312
29700 144312 145158 147385 147300 145364 147774 148557 143499 143900 143972 146104 145329 143660 144449 141338 139970 139581 139842
29683 139842 143182 144968 143589 144367 147203 146267 145935 143831 140786 144148 148639 150040 147941 144387 143290
29668 143290 145855 145679 147001 148951 148422 148879 149320 149607 147382 146712 146876 143533 141795 140711 140252 139991
29652 139991 141024 141633 143641 146860 148881 144943 140953 140548 141753 142602 143157 142574 141455 140302 142455
29637 142455 142947 143602 144631 145491 146998 143923 144133 143820 142498 143721 148558 150733 150337 150809 151295 148622
29621 148622 148167 148326 146991 148015 147791 145306 148446 151940 149915 149508 151770 150496 149150 147170 147006
29606 147006 148083 147310 145322 148486 150389 149396 147485 148267 148355 150528 147992 147731 145705 146674 147120 147557
29590 147557 150602 152113 148362 147815 147347 148627 151321 149640 142069 141350 144434 142067 142045 143492 144098 145756
29574 145756 147112 146742 148547 146949 143339 146703 148706 150159 149863 149044 149053 147901 148411 149554 149656 146056
29558 146056 146873 147852 147483 147789 147352 147824 146865 145669 147888 149383 149523 150607 150857 151617 151076 147191 148136
29541 148136 150630 151763 152603 150676 148555 144962 145555 146037 149167 150804 146378 146585 148222 147040 147704
29526 147704 146452 145111 142140 137200 138138 140262 140435 143814 148714 145778 145850 147039 146541 147892 149304
$$ [...]
##END NTUPLES=NMR SPECTRUM
##END=
