##TITLE=Analysis number 318633
Compound Code cc 28704
Book Reference 407/113
Project Code adrs
Chemist Name andyw
##JCAMPDX= 6.0         $$ Bruker NMR JCAMP-DX V2.0
##DATA TYPE= NMR SPECTRUM
##DATA CLASS= NTUPLES
##ORIGIN= Bruker BioSpin GmbH
##OWNER= nmr
$$ XWIN-NMR		Version 3.5
$$ Thu Apr  6 11:26:01 2006 GMT Daylight Time (UT+1h)  MAYBRIDGE\nmr@NMR_250MHZ
##.OBSERVE FREQUENCY= 250.131544655141
##.OBSERVE NUCLEUS= ^1H
##.ACQUISITION MODE= SIMULTANEOUS (DQD)
##.ACQUISITION SCHEME= undefined
##.AVERAGES= 16
##.DIGITISER RES= 18
##SPECTROMETER/DATA SYSTEM= dpx250
##.PULSE SEQUENCE= zg30
##.SOLVENT NAME= DMSO
##.SHIFT REFERENCE= (INTERNAL, DMSO, 0, 16.522)
##AUDIT TRAIL= $$ (NUMBER, WHEN, WHO, WHERE, WHAT)
$$ ##TITLE= Audit trail, XWIN-NMR		Version 3.5
$$ ##JCAMPDX= 5.01
$$ ##ORIGIN= Bruker BioSpin GmbH
$$ ##OWNER= nmr
$$ C:\u/data/dgb/nmr/ADRS/2280/pdata/1/auditp.txt
$$ ##AUDIT TRAIL=  $$ (NUMBER, WHEN, WHO, WHERE, WHAT)
(   1,<2006-04-06 11:25:28.34 +100>,<MAYBRIDGE\nmr>,<NMR_250MHZ>,
      <created by zg, POWCHK disabled, PULCHK disabled
       configuration hash MD5:
       84 BC 41 DB A1 6E 1D 46 DA 25 12 A5 C1 ED C5 3A
       data hash MD5: 64K
       D3 44 C4 A8 CF 31 EA 25 ED 78 71 F0 CA D6 11 F9>)
(   2,<2006-04-06 11:25:50.16 +100>,<MAYBRIDGE\nmr>,<NMR_250MHZ>,
      <Start of raw data processing
       ef LB = 0.3 FT_mod = 6 PKNL = 1 SI = 32K 
       data hash MD5: 32K
       49 D5 E4 B8 11 F2 E7 8E CD 23 BE 39 4F B7 99 6D>)
(   3,<2006-04-06 11:25:51.90 +100>,<MAYBRIDGE\nmr>,<NMR_250MHZ>,
      <apk 
       data hash MD5: 32K
       FA 39 3B EC 46 11 48 DE 43 8E 79 30 1A 73 4D 37>)
(   4,<2006-04-06 11:25:52.96 +100>,<MAYBRIDGE\nmr>,<NMR_250MHZ>,
      <abs ABSG = 5 
       data hash MD5: 32K
       F7 BF 1C A8 DB 28 8D 65 1D 28 0A 37 8B 9B D5 7E>)
$$ ##END=
$$ 
$$ hash MD5
$$ DB 1B B6 39 13 C2 9B BD 6A 05 2C 48 81 4C C5 B9
##$RELAX= 
##$RELAX= 
##$RELAX= 
##$RELAX= 
##$RELAX= 
##$RELAX= 
##$RELAX= 
$$ Bruker specific parameters
$$ --------------------------
##$DU= <C:\u>
##$EXPNO= 2280
##$NAME= <ADRS>
##$PROCNO= 1
##$TYPE= <nmr>
##$USER= <dgb>
##$AMP= (0..31)
100 100 100 100 100 100 100 100 100 100 100 100 100 100 100 100 100 100 
100 100 100 100 100 100 100 100 100 100 100 100 100 100 
##$AQSEQ= 0
##$AQ_mod= 3
##$AUNM= <au_zg>
##$AUTOPOS= <19 >
##$BF1= 250.13
##$BF2= 250.13
##$BF3= 250.13
##$BF4= 250.13
##$BF5= 500.13
##$BF6= 500.13
##$BF7= 500.13
##$BF8= 500.13
##$BYTORDA= 1
##$CFDGTYP= 0
##$CFRGTYP= 5
##$CHEMSTR= <none>
##$CNST= (0..31)
1 1 145 1 1 1 1 1 1 1 1 1 1 1 1 1 1 1 1 1 1 1 1 1 1 1 1 1 1 1 1 1 
##$CPDPRG= <>
##$CPDPRG1= <>
##$CPDPRG2= <>
##$CPDPRG3= <>
##$CPDPRG4= <mlev>
##$CPDPRG5= <mlev>
##$CPDPRG6= <mlev>
##$CPDPRG7= <mlev>
##$CPDPRG8= <mlev>
##$CPDPRGB= <>
##$CPDPRGT= <>
##$D= (0..31)
0 1 0 0 0 0 0 0 0 0.06 0 0 0 0 0 0 0.0002 0 0 0 0 0 0 0 0 0 0 0 0 0 0 
0 
##$DATE= 1144319123
##$DBL= (0..7)
120 120 120 120 120 120 120 120 
##$DBP= (0..7)
150 150 150 150 150 150 150 150 
##$DBP07= 0
##$DBPNAM0= <>
##$DBPNAM1= <>
$$ [...]
##$SUBNAM7= <"">
##$SUBNAM8= <"">
##$SUBNAM9= <"">
##$SW= 20.6930455092707
##$SWIBOX= (0..15)
0 0 3 0 0 0 0 0 0 0 0 0 0 0 0 0 
##$SW_h= 5175.983436853
##$TD= 65536
##$TD0= 1
##$TE= 294.16
##$TE2= 300
##$TE3= 300
##$TEG= 300
##$TL= (0..7)
0 120 120 120 120 120 120 120 
##$TP= (0..7)
150 150 150 150 150 150 150 150 
##$TP07= 0
##$TPNAME0= <>
##$TPNAME1= <>
##$TPNAME2= <>
##$TPNAME3= <>
##$TPNAME4= <>
##$TPNAME5= <>
##$TPNAME6= <>
##$TPNAME7= <>
##$TPOAL= (0..7)
0.5 0.5 0.5 0.5 0.5 0.5 0.5 0.5 
##$TPOFFS= (0..7)
0 0 0 0 0 0 0 0 
##$TUNHIN= 0
##$TUNHOUT= 0
##$TUNXOUT= 0
##$USERA1= <user>
##$USERA2= <user>
##$USERA3= <user>
##$USERA4= <user>
##$USERA5= <user>
##$V9= 5
##$VALIST= <valist>
##$VCLIST= <CCCCCCCCCCCCCCC>
##$VD= 0
##$VDLIST= <DDDDDDDDDDDDDDD>
##$VPLIST= <PPPPPPPPPPPPPPP>
##$VTLIST= <TTTTTTTTTTTTTTT>
##$WBST= 1024
##$WBSW= 4
##$XGAIN= (0..3)
0 0 0 0 
##$XL= 0
##$YL= 0
##$YMAX_a= 195425
##$YMIN_a= -325576
##$ZGOPTNS= <>
##$ZL1= 120
##$ZL2= 120
##$ZL3= 120
##$ZL4= 120
##$ABSF1= 16.522
##$ABSF2= -4.171173
##$ABSG= 5
##$ABSL= 3
##$ALPHA= 0
##$AQORDER= 0
##$ASSFAC= 0
##$ASSFACI= 0
##$ASSFACX= 0
##$ASSWID= 0
##$AUNMP= <proc_1d>
##$AZFE= 0.1
##$AZFW= 0.1
##$BCFW= 0
##$BC_mod= 0
##$BYTORDP= 0
##$COROFFS= 0
##$CY= 12.5
##$DATMOD= 1
##$DC= 0
##$DFILT= <>
##$DTYPP= 0
##$F1P= 14.0000005364418
##$F2P= -0.99999901652339
##$FCOR= 0.5
##$FTSIZE= 32768
##$FT_mod= 6
##$GAMMA= 0
##$GB= 0
##$INTBC= 1
##$INTSCL= 1
##$ISEN= 128
##$LB= 0.3
##$LEV0= 0
##$LPBIN= 0
##$MAXI= 10000
##$MC2= 0
##$MEAN= 0
##$ME_mod= 0
##$MI= 0
##$NCOEF= 0
##$NC_proc= -5
##$NLEV= 6
##$NOISF1= 0
##$NOISF2= 0
##$NSP= 0
##$NTH_PI= 0
##$NZP= 0
##$OFFSET= 16.522
##$PC= 1
##$PHC0= 168.0135
##$PHC1= 6.341566
##$PH_mod= 1
##$PKNL= yes
##$PPARMOD= 0
##$PSCAL= 4
##$PSIGN= 0
##$REVERSE= no
##$SF= 250.13
##$SI= 32768
##$SIGF1= 0
##$SIGF2= 0
##$SINO= 400
##$SIOLD= 32768
##$SREGLST= <1H.DMSO>
##$SSB= 0
##$STSI= 32768
##$STSR= 0
##$SW_p= 5175.98343685301
##$SYMM= 0
##$S_DEV= 0
##$TDeff= 65536
##$TDoff= 0
##$TI= <Analysis number 999999
Compound Code 99
Book Reference 9
Project Code 9>
##$TILT= no
##$TM1= 0
##$TM2= 0
##$TOPLEV= 0
##$USERP1= <user>
##$USERP2= <user>
##$USERP3= <user>
##$USERP4= <user>
##$USERP5= <user>
##$WDW= 1
##$XDIM= 32768
##$YMAX_p= 322552113
##$YMIN_p= -1023681
$$ End of Bruker specific parameters
$$ ---------------------------------
##NTUPLES= NMR SPECTRUM
##VAR_NAME=  FREQUENCY,     SPECTRUM/REAL,   SPECTRUM/IMAG
##SYMBOL=    X,             R,               I
##VAR_TYPE=  INDEPENDENT,   DEPENDENT,       DEPENDENT
##VAR_FORM=  AFFN,          ASDF,            ASDF
##VAR_DIM=   32768,         32768,           32768
##UNITS=     HZ,            ARBITRARY UNITS, ARBITRARY UNITS
##FACTOR=    0.157963299565203, 1,           1
##FIRST=     4132.6476996994, 0,             0
##LAST=      -1043.33573715361, 0,           0
##MIN=       -1043.33573715361, -1023681,    0
##MAX=       4132.6476996994, 322552113,     0
$$ Real data points
##PAGE= N=1
##DATA TABLE= (X++(R..R)), XYDATA
$$ [...]
$$ plain form
17038 -143294 -62096 192803 118599 -180257 -195901 -75217 -21969 49022 154691 251167 239168
17027 239168 202726 332410 271343 81761 1570 31137 25833 410580 493494 417116 252786
17016 252786 -15814 -278827 -415481 -428693 -265987 262082 379211 13383 -63206 42347
17006 42347 176150 176742 -110091 178022 239309 225954 292356 441189 294030 151697 165682
16995 165682 138068 31354 -230805 -415608 -481538 -484202 -411937 -256792 29652 206814
16985 206814 204164 185285 256875 366158 407534 367861 145294 -203779 -142192 -24602 34811
16974 34811 177187 253271 391456 194383 -9038 178299 399383 84678 -203471 -249772
16964 -249772 -16421 76490 27923 -98222 -82181 2929 -76554 -351741 -232445 -107067
$$ packed form
17038a43294Q1198K54899p4204k98856j5644J20684N3248P0991J05669R6476j1999
17027B39168l6442J29684o1067j89582q0191K9567n304L84747Q2914p6378j64330
17016B52786k68600k63013j36654j3212J62706N28069J17129l65828p6589J05553
17006D2347J33803N92k86833K88113O1287j3355O6402J48833j47159j42333J3985
16995A65682k7614j06714k62159j84803o5930k664P2265J55145K86444J77162
16985B06814k650j8879P1590J09283M1376l9673k22567l49073O1587J17590N9413
16974C4811J42376P6084J38185j97073k03421J87337K21084l14705k88149m6301
16964b49772K33351R2911m8567j26145J6041Q5110p9483k75187J19296J25378
$$ plain form
16954 -107067 -108215 -238966 -138479 136649 -74252 -96178 -228227 -315598 -256136 -361976
16944 -361976 -160424 -33100 65510 139452 75182 -4302 -278730 -399831 -396136 -386334 -222132
16933 -222132 106261 168091 -27190 27821 240249 -133229 -293501 -491533 -496328 -250431
16923 -250431 -163204 -30473 -144400 -423019 -387303 -142255 -4746 -108170 -162610 -324476
16913 -324476 -66215 94080 162940 43381 -66937 -155056 -117789 -138838 -293373 -211267
16903 -211267 -124974 -80099 191221 386903 -42528 -268666 -273436 -403484 -130006 78814
16893 78814 73680 -27096 1807 -45911 91146 11697 78266 185482 75659 233025 324145
16882 324145 122580 -111052 -200207 -235001 -197971 -119096 -141802 -55520 928 19389 -165688
$$ packed form
16954a07067j148j30751J00487K75128k10901k1926j32049q7371N9462j05840
16944c61976K01552J27324R8610P3942o4270p9484k74428j21101L695R802J64202
16933b22132L28393O1830j95281N5011K12428l73478j60272j98032m795K45897
16923b50431Q7227J32731j13927k78619L5716K45048J37509j03424n4440j61866
16913c24476K58261J60295O8860j19559j10318q8119L7267k1049j54535Q2106
16903b11267Q6293M4875K71320J95682m29431k26138m770j30048K73478K08820
16893G8814n134j00776K8903m7718J37057p9449O6569J07216j09823J57366R1120
16882C24145k01565k33632q9155l4794L7030P8875k2706Q6282N6448J8461j85077
$$ plain form
16871 -165688 -308538 -110958 221094 206280 -289768 -358299 -237589 -208661 -32113 -640
16861 -640 70853 80388 145399 210682 -48718 -48301 -68713 -104432 -71867 7446 -41856 -114945
16849 -114945 -243394 -491802 -599160 -399577 -168963 -87709 -143157 -357260 -311396 -73221
16839 -73221 31810 -100815 -117639 71556 153677 -38543 -121473 -76296 84669 123675 18045
16828 18045 109749 84242 -241439 -283242 -74650 -42268 -62222 -263286 -395906 -425692 -476880
16817 -476880 -154645 114524 251013 484432 179808 -84245 -60952 42761 91772 -64453
16807 -64453 -344116 -361654 -117843 -219703 -291389 -184269 -62887 -53462 -114895 -113040 -135162
16796 -135162 -129820 -274739 -554511 -498168 -416145 -322537 -180686 -118518 -111619 -98424 69858
$$ packed form
16871a65688j42850J97580L32052j4814m96048o8531J20710K8928J76548L1473
16861f40P1493R535O5011O5283k59400M17k0412l5719L2565P9313m9302p3089
16849a14945j28449k48408j07358J99583K30614Q1254n5448k14103M5864K38175
16839g3221J05031j32625j6824J89195Q2121j92220q2930M5177J60965L9006j05630
16828A8045R1704k5507l25681m1803K08592L2382j9954k01064j32620k9786n1188
16817d76880L22235K69169J36489K33419l04624k64053K3293J03713M9011j56225
16807f4453k79663j7538K43811j01860p1686J07120J21382R425o1433J855k2122
16796a35162N342j44919k79772N6343Q2023R3608J41851O2168O899J3195J68282
$$ plain form
16785 69858 84772 -130817 -263083 -309566 -109344 157503 -36761 -102711 51063 160413
16775 160413 298851 166745 259536 129106 155260 67385 140198 77835 128602 138841 29231
16764 29231 45544 -50040 -177680 -66922 21556 -116752 -152146 -317531 -234473 -350761 -434690
16753 -434690 -323675 -213658 77995 70274 95300 -5454 -41083 160078 310486 27793
16743 27793 -89205 50376 -105223 -167575 -100339 88735 -69944 -233042 -137465 36895
16733 36895 -64742 -200991 -229367 -68215 271448 329279 302727 464627 522588 638454
16723 638454 687230 471169 141999 258950 450144 336778 229824 415106 408283 230958
16713 230958 207833 78170 256959 283034 273816 187590 159068 109071 3070 85048 -129393
$$ packed form
16785F9858J4914k15589j32266m6483K00222K66847j94264o5950J53774J09350
16775A60413J38438j32106R2791j30430K6154q7875P2813o2363N0767J0239j09610
16764B9231J6313r5584j27640J10758Q8478j38308l5394j65385Q3058j16288q3929
16753d34690J11015J10017K91653p721K5026j00754l5629K01161J50408k82693
16743B7793j16998J39581j55599o2352O7236J89074j58679j63098R5577J74360
16733C6895j01637j36249k8376J61152L39663N7831k6552J61900N7961J15866
16723F38454M8776k16061l29170J16951J91194j13366j06954J85282o823j77325
16713B30958k3125j29663J78789K6075r218q6226k8522m9997j06001Q1978k14441
$$ plain form
16702 -129393 -212884 -47206 239668 236627 88464 357756 433992 347848 614852 667817 429026
16691 429026 108322 -58837 -140824 -9373 627 -171648 -227382 -339198 -240266 -488249
16681 -488249 -667235 -379871 127387 332492 131653 118809 -4741 -84993 -161869 -41430
16671 -41430 42543 -37927 -246058 -320039 -177629 -135194 -199894 -310490 -213692 303556 352394
16660 352394 342369 227604 140677 -223848 -153742 203344 252688 140594 74363 -115180
16650 -115180 -265351 -86001 -97299 -111832 -194020 -181698 7593 -35864 -199976 -217912 -285867
16639 -285867 -68681 43546 -205657 -244566 -164379 71892 178202 56421 34806 16076
16629 16076 -83769 -62576 -4895 -49400 69118 320033 223668 -131797 -319119 -315464 -242111
$$ packed form
16702a29393q3491J65678K86874l041j48163K69292P6236q6144K67004N2965k38791
16691D29026l20704j67159q1987J31451J0000j72275n5734j11816R8932k47983
16681d88249j78986K87364N07258K05105k00839j2844j23550q0252p6876J20439
16671d1430Q3973q0470k08131p3981J42410M2435o4700j10596R6798N17248M8838
16660C52394j0025j14765q6927l64525P0106L57086M9344j12094o6231j89543
16650a15180j50171J79350j1298j4533q2188J2322J89291m3457j64112j7936o7955
16639b85867K17186J12227k49203l8909Q0187K36271J06310j21781k1615j8730
16629A6076r9845K1193N7681m4505J18518K50915r6365l55465j87322L655P3353
$$ plain form
16618 -242111 -261577 -147854 -209084 -68220 -47215 83595 57540 161813 250442 355147
16608 355147 260288 106117 -85118 -236729 -40284 102975 -80235 14821 -4450 -17051
16598 -17051 -78407 -231090 -126817 26810 198461 121281 55838 52068 166233 4087 -186269
16587 -186269 -288239 -345754 -156222 245500 280388 164313 179375 435733 372736 270918
16577 270918 418753 504857 521523 563570 464394 396082 354245 365961 598855 1038480 1050510
16566 1050510 1089363 1089682 949934 790514 849027 719504 407860 450149 671725 783686
16556 783686 638752 570834 529751 395406 123244 302869 467409 624044 603207 526380
16546 526380 505604 385221 -49443 -260752 -175693 120544 379385 432229 280538 397316
$$ packed form
16618b42111j9466J13723o1230J40864K1005J30810k6055J04273Q8629J04705
16608C55147r4859j54171j91235j51611J96445J43259j83210R5056j9271j2601
16598a7051o1356j52683J04273J53627J71651p7180o5443l770J14165j62146j90356
16587a86269j01970n7515J89532M01722L4888j16075J5062K56358o2997j01818
16577B70918J47835Q6104J6666M2047r9176o8312m1837J1716K32894M39625J2030
16566A050510L8853L19j39748j59420N8513j29523l11644M2289K21576J11961
16556G83686j44934o7918m1083j34345k72162J79625J64540J56635k0837p6827
16546E26380k0776j20383m34664k11309Q5059K96237K58841N2844j51691J16778
$$ plain form
16536 397316 663384 594105 550104 549588 375510 452695 314347 288666 235804 408612 339209
16525 339209 247957 -41362 -286949 53280 260892 228517 338476 357991 291733 176381
16515 176381 63362 -1631 -78790 164074 291565 46984 89549 387775 494516 501742
16505 501742 445229 309344 183740 207953 323030 175486 -67895 -171539 -98116 -132138
16495 -132138 -223812 -280199 -74640 -192598 -158410 -62458 -201240 -40894 180353 186618 199483
16484 199483 213935 152054 -3852 232697 220424 93306 179203 24867 27773 85930 -5407
16473 -5407 -168088 -259504 -220951 -38637 121981 172699 372192 244107 235873 287731 133704
16462 133704 -71585 -51969 -44155 196636 246473 199557 206708 30871 -79419 -113491 4911
$$ packed form
16536C97316K66068o9279m4001n16j74078P7185j38348k5681n2862J72808o9403
16525C39209r1252k89319k45587L40229K07612l2375J09959J9515o6258j15352
16515A76381j13019o4993p7159K42864J27491k44581M2565K98226J06741P226
16505E01742n6513j35885j25604K4213J15077j47544k43381j03644P3423l4022
16495a32138r1674n6387K05559j17958L4188R5952j38782J60346K21247O265J2865
16484A99483J4452o1881j55906K36549j2273j27118Q5897j54336K906N8157r1337
16473e407j62681r1416L8553J82314J60618N0718J99493j28085q234N1858j54027
16462A33704k05289J9616P814K40791M9837m6916P151j75837j10290l4072J18402
$$ plain form
16451 4911 21032 50154 65965 -244709 -245933 -147767 35714 -93219 -114910 -182568 76202
16440 76202 115095 234241 250470 294882 300137 103292 -191092 -103906 128695 125681 -207693
16429 -207693 -275057 -463681 -512504 -359235 -92231 76491 6643 -102703 116252 156715
16419 156715 129849 -65772 -226258 -68342 112882 32033 -218333 -236527 -349492 -188029
16409 -188029 33767 9001 -245406 -463501 -590543 -625110 -523007 -505229 -649397 -520554
16399 -520554 -243933 -41006 80014 -173164 -193846 -260505 -216042 -179946 -251130 -371155
16389 -371155 -361131 -222515 1655 25422 -28530 -40972 -18970 -146034 -276856 -384359
16379 -384359 -495938 -425686 -431332 -230182 -165672 106905 148238 229584 152193 175128 167622
$$ packed form
16451D911J6121K9122J5811l10674j224R8166J83481j28933k1691o7658K58770
16440G6202L8893J19146J6229M4412N255j96845k94384Q7186K32601l014l33374
16429b07693o7364j88624m8823J53269K67004J68722o9848j09346K18955M0463
16419A56715k6866j95621j60486J57916J81224q0849k50366j8194j12965J61463
16409a88029K21796k4766k54407k18095j27042l4567J02103J7778j44168J28843
16399e20554K76621K02927J21020k53178k0682o6659M4463L6096p1184j20025
16389c71155J0024J38616K24170K3767n3952j2442K2002j27064j30822j07503
16379c84359j11579P0252n646K01150O4510K72577M1333Q1346p7391K2935p506
$$ plain form
16368 167622 143234 441831 462578 174039 92463 353044 335389 314109 169004 -227605
16358 -227605 -410243 -372870 -253141 72695 242374 89160 -224083 -270761 -106820 -426102
16348 -426102 -573272 -390245 -161298 -268191 -75027 62557 -134105 14834 44508 -161475
16338 -161475 -172585 -134596 -47048 -157501 89758 367862 353855 214682 276859 246090 180483
16327 180483 267823 -56531 -497071 -531010 -251717 -223116 -52616 -57961 -339844 -334512 -180308
16316 -180308 -162137 -276018 -173519 -15381 173246 51582 17148 86511 53051 -114168
16306 -114168 -440550 -478797 -258997 -204242 -146476 -156661 -344700 -337624 -116495 193253 301851
16295 301851 105647 36677 13236 -117465 -38005 -21300 60005 199368 131043 169502 290345
$$ packed form
16368A67622k4388K98597K0747k88539q1576K60581j7655k1280j45105l96609
16358b27605j82638L7373J19729L25836J69679j53214l13243m6678J63941l19282
16348d26102j47170J83027K28947j06893J93164J37584j96662J48939K9674k05983
16338a61475j1110L7989Q7548j10453K47259K78104j4007j39173O2177l0769o5607
16327A80483Q7340l24354m40540l3939K79293K8601J70500n345k81883N332J54204
16316a80308J8171j13881J02499J58138J88627j21664l4434O9363l3460j67219
16306a14168l26382l8247K19800N4755N7766j0185j88039P076K21129L09748J08598
16295C01851j96204o8970k3441j30701P9460J6705Q1305J39363o8325L8459J20843
$$ plain form
16284 290345 455434 452032 76037 -63214 -96940 -213581 -194889 69649 416985 392759
16274 392759 -9519 -48465 186460 316796 87415 -115100 -151042 -4535 51922 164594
16264 164594 62949 -17534 -127696 -272821 -84483 -67559 -338214 -367094 -195509 -77912
16254 -77912 -106984 76286 106762 101088 156736 -20205 -301408 -280534 -289184 -250445 -291786
16243 -291786 -345512 -498642 -384408 -205374 -148603 -76550 -124653 -322185 -322346 -179633 -55787
16232 -55787 -38210 -24700 89383 225315 33404 -297075 -223283 -128969 -212413 -117958 -11273
16221 -11273 20 119386 323898 185230 -31938 84546 -76001 -67304 41417 -103670
16211 -103670 -300406 -367964 -35175 -62709 -203840 55360 181269 72800 -128184 -281249
$$ packed form
16284B90345J65089l402l75995j39251l3726j16641J8692K64538L47336k4226
16274C92759m02278l8946K34925J30336k29381k02515l5942J46507N6457J12672
16264A64594j01645q0483j10162j45125J88338J6924k70655k8880J71585J17597
16254g7912k9072J83270L0476n674N5648j76941k81203K0874q650L8739m1341
16243b91786n3726j53130J14234J79034N6771P2053m8103j97532j61J42713J23846
16232e5787J7577J3510J14083J35932j91911l30479P3792R4314q3444R4455J06685
16221a1273J1293J19366K04512j38668k17168J16484j60547Q697J08721j45087
16211a03670j96736o7558L32789k7534j41131K59200J25909j08469k00984j53065
$$ plain form
16201 -281249 -148963 -133953 142384 228825 3716 -136345 -222438 -193505 -183174 -150993 -170330
16190 -170330 -259184 -176408 -121335 -168293 -41746 22844 116480 83145 42709 -233727 -535323
16179 -535323 -491324 -265931 -565341 -609567 -462566 -350180 -314899 -284269 -296112 -411731
16169 -411731 -560995 -478691 -284556 -73760 92791 58609 -237916 -300253 -55555 -187501
16159 -187501 -194270 -147236 -127062 -229443 -162023 -90141 -280343 -234331 -337667 -214812 -122556
16148 -122556 -194997 -200007 -175130 -288428 -230712 -82741 -26639 -80820 -25375 171307 64176
16137 64176 -125385 -177785 -222600 -203154 -197343 -23950 210355 480091 255600 -60814 -291826
16126 -291826 -157897 -274276 -353366 -165711 -78882 -122703 -351508 -300903 -84142 -43242
$$ packed form
16201b81249J32286J5010K76337Q6441k25109j40061q6093K8933J0331L2181j9337
16190a70330q8854Q2776N5073m6958J26547O4590R3636l3335m0436k76436l01596
16179e35323M3999K25393k99410m4226J47001J12386L5281L0630j1843j15619
16169d11731j49264Q2304J94135K10796J66551l4182k96525o2337K44698j31946
16159a87501o769M7034K0174j02381O7420P1882j90202M6012j03336J22855R2256
16148a22556p2441n010K4877j13298N7716J47971N6102n4181N5445J96682j07131
16137F4176j89561n2400m4815J9446N811J73393K34305K69736k24491l16414k31012
16126b91826J33929j16379p9090J87655Q6829m3821k28805N0605K16761M0900
$$ plain form
16116 -43242 50672 -8277 -17494 -123752 -23573 -25154 -124737 -266421 -374385 -250624 -108802
16105 -108802 -332544 -334812 -397635 -341309 -263374 -163657 -189831 -328441 -398443 -518748 -526947
16094 -526947 -269723 -71793 34034 200473 316096 313915 58465 -49827 108911 188484
16084 188484 228120 267155 76135 -111818 -174169 -102409 110486 203084 100743 287388
16074 287388 338697 280520 -55567 -259996 -102210 -121997 -149702 -101123 -98504 -263356 -244016
16063 -244016 -105791 -72203 12486 -64229 -61882 39942 22187 31806 70475 -69100 -253077
16052 -253077 -207938 -212233 -404192 -423767 -338241 -268429 -64407 -216527 -349277 -210827 61695
16041 61695 158581 185223 88225 -224370 -308467 -346336 -155948 -86434 15722 -129253 -242938
$$ packed form
16116d3242R3914n8949r217j06258J00179j581r9583j41684j07964J23761J41822
16105a08802k23742k268o2823N6326P7935R9717k6174j38610p0002j20305q199
16094e26947K57224J97930J05827J66439J15623k181k55450j08292J58738P9573
16084A88484L9636L9035j91020j87953o2351P1760K12895R2598j02341J86645
16074B87388N1309n8177l36087k04429J57786j9787k7705M8579K619j64852J9340
16063b44016J38225L3588Q4689p6715K347J01824j7755R619L8669j39575j83977
16052b53077M5139m295j91959j9575Q5526O9812K04022j52120j32750J38450K72522
16041F1695R6886K6642r6998l12595q4097l7869J90388O9514J02156j44975j13685
$$ plain form
16030 -242938 -236260 4126 -167702 -308058 -356637 -260133 -152841 -272382 -236575 -279895 -423860
16019 -423860 -416533 -265357 -260565 -299511 -361954 -252432 -345290 -376194 -387166 -608934 -763483
16008 -763483 -720308 -545834 -267898 -108740 -92469 -153807 54978 112559 -241631 -370360
15998 -370360 -371974 -361767 -338363 -335253 -388976 -171183 -146090 -77600 -64354 -128893 -243149
15987 -243149 -167021 62563 28125 103329 85670 -55664 -379426 -476658 -240413 165604
15977 165604 58257 -39444 -274203 -404212 -188681 -13854 246711 122053 -3048 -143976
15967 -143976 -67104 130157 170662 355971 226908 108830 441980 555014 492744 374293
15957 374293 298779 131261 186977 403046 338202 340713 259994 -48320 46077 16018 -117640
$$ packed form
16030b42938O678K40386j71828j40356m8579R6504J07292j19541L5807m3320j43965
16019d23860P327J51176M792l8946o2443J09522r2858l0904j0972k21768j54549
16008g63483M3175J74474K77936J59158J6271o1338K08785N7581l54190j28729
15998c70360j614J0207K3404L110n3723K17793K5093O8490J3246o4539j14256
15987b43149P6128K29584l4438P5204j7659j41334l23762r7232K36245M06017
15977A65604j07347r7701k34759j30009K15531J74827K60565j24658j25101j40928
15967a43976P6872J97261M0505J85309j29063j18078L33150J13034o2270j18451
15957C74293p5514j67518N5716K16069o4844K511q0719l08314R4397l0059j33658
$$ plain form
15946 -117640 -194298 -62190 -74025 -8244 -68113 226679 599786 549062 382258 269861
15936 269861 370507 300910 262168 83208 -257247 -95729 -98127 -81235 -168174 -169384 -358960
15925 -358960 -395295 -169919 -167661 10262 -133550 -241870 -4240 -4302 -79262 -60755 22448
15914 22448 304627 239159 32764 23525 -148752 17170 189700 174088 119595 121527 108693
15903 108693 33212 -9416 47082 398886 539200 431733 143361 -195392 -61198 147308
15893 147308 95462 3794 42559 -118707 -202322 -30454 41651 83633 -10702 -189289 -325896
15882 -325896 -533699 -411079 -456196 -286576 -187772 -403322 -535542 -373366 84671 397828
15872 397828 218272 -83139 -283997 -301513 -521597 -808924 -753657 -427503 -372292 -128405
$$ packed form
15946a17640p6658J32108j1835O5781n9869K94792L73107n0724j66804j12397
15936B69861J00646o9597l8742j78960l40455J61518k398J6892q6939j210j89576
15925c58960l6335K25376K258J77923j43812j08320K37630o2p4960J8507Q3203
15914B2448K82179o5468k06395r239j72277J65922J72530j5612n4493J932j2834
15903A08693p5481m2628N6498L51804J40314j07467k88372l38753J34194K08506
15893A47308n1846r1668L8765j61266q3615J71868P2105M1982r4335j78587j36607
15882c25896k07803J22620m5117J69620R8804k15550j32220J62176M58037L13157
15872C97828j79556l01411k00858j7516k20084k87327N5267L26154N5211K43887
$$ plain form
15862 -128405 -105613 -404137 -369600 -126585 116711 152963 -38176 -162000 -87351 -103429
15852 -103429 82088 179005 141795 342617 241755 286061 353488 222258 225667 96992 -73448
15841 -73448 -97253 -190562 -95599 13353 56611 5450 -249331 -128987 17215 73115 -236512
15830 -236512 -563742 -652798 -454216 -238006 30910 27981 17613 -64023 -137785 -230225 -217656
15819 -217656 -151691 -50950 -217731 -347389 -294427 -301761 -322791 -236422 24573 92348 -96363
15808 -96363 -254652 -584339 -665637 -674907 -420799 -382434 -304160 -349539 -279588 76863 184862
15797 184862 44340 -24350 -118759 -58723 -147252 -211162 -221580 -220107 -22471 64688 287802
15786 287802 432889 248011 64486 -322745 -379251 -409152 -565641 -332982 -217111 29180
$$ packed form
15862a28405K2792k98524L4537K43015K43296L6252j91139j23824P4649j6078
15852a03429J85517R6917l7210K00822j00862M4306O7427j31230L409j28675j70440
15841g3448k3805r3309R4963J08952M3258n1161k54781J20344J46202N5900l09627
15830b36512l27230q9056J98582K16210K68916k929j0368q1636p3762r2440J2569
15819b17656O5965J00741j66781j29658N2962p334k1030Q6369K60995O7775j88711
15808i6363j58289l29687q1298r270K54108L8365P8274m5379O9951L56451J07999
15797A84862j40522o8690r4409O0036q8529o3910j0418J473J97636Q7159K23114
15786B87802J45087j84878j83525l87231n6506k9901j56489K32659J15871K46291
$$ plain form
15776 29180 333857 228227 33379 156649 44424 20469 -50686 160160 315077 112847
15766 112847 -54478 -171686 -312797 -336075 -230803 -220546 -249294 -76402 152765 165273
15756 165273 -12324 -79448 66705 85035 -122248 31647 163032 -7382 72184 -18216
15746 -18216 -61691 -72827 -95725 -57237 268754 492403 452139 363697 375478 340474 240582
15735 240582 221928 192972 108643 88963 49343 -93629 -135868 -43376 69030 -146249 -38389
15724 -38389 10589 136650 -39283 -29983 104729 342003 478999 272276 169981 233664
15714 233664 113907 168992 -34454 -275478 -455036 -561074 -465293 -287233 -265005 -237230
15704 -237230 30640 -90027 -328289 -365498 -232778 -230276 -72195 26119 8780 34775 -132312
$$ packed form
15776B9180L04677j05630j94848J23270j12225k3955p1155K10846J54917k02230
15766A12847j67325j17208j41111k3278J05272J0257k8748J72892K29167J2508
15756A65273j77597o7124J46153J8330k07283J53895J31385j70414P9566r0400
15746a8216m3475j1136k2898L8488L25991K23649m0264q8442J1781l5004r9892
15735B40582j8654k8956q4329j9680l9620j42972m2239R2492J12406k15279J07860
15724c8389M8978J26061j75933R300J34712K37274J36996k06723j02295O3683
15714B33664j19757N5085k03446k41024j79558j06038R5781J78060K2228K7775
15704b37230K67870j20667k38262l7209J32720K502J58081R8314j7339K5995j67087
$$ plain form
15693 -132312 -159687 55497 -195082 -135216 -50027 -168868 -294512 -28437 206922 79087
15683 79087 -117653 -100235 -62239 48345 -171119 -118389 -72923 -122726 -114399 -141893 -261151
15672 -261151 -50360 -192751 -186263 -27613 3350 -308971 -48340 115234 11831 -86172
15662 -86172 -960 112891 96373 27737 28092 -167632 -36769 222261 143117 -19692 -165146
15651 -165146 -211511 -159517 -2272 -25506 -156886 -172911 -217178 -213281 -311808 -214389 28740
15640 28740 178348 176634 50486 -104691 -293158 -256035 -39331 293589 -38733 -39537 107144
15629 107144 34314 -65702 179776 -20286 -113859 -158917 -157595 -173683 54606 86599 -17331
15618 -17331 -149336 -116939 -126515 -132674 -230073 -242688 -124482 -28577 37238 -147160 -124823
$$ packed form
15693a32312k7375K15184k50579N9866Q5189j18841j25644K66075K35359j27835
15683G9087j96740J7418L7996J10584k19464N2730M5466m9803Q327k7494j19258
15672b61151K10791j42391O488J58650L0963l12321K60631J63574j03403r8003
15662h6172Q5212J13851j6518o8636L55j95724J30863K59030p9144j62809j45454
15651a65146m6365N1994J57245k3234j31380j6025m4267L897r8527R7419K43129
15640B8740J49608j714j26148j55177j88467L7123K16704L32920l32322q04J46681
15629A07144p2830j00016K45478k00062r3573m5058J322j6088K28289L1993j03930
15618a7331j32005L2397r576o159r7399j2615J18206R5905O5815j84398K2337
$$ plain form
15607 -124823 -227356 -344173 -358425 -247531 -322197 -362634 -420973 -697228 -664848 -547131
15597 -547131 -700439 -580797 -500169 -378611 -366831 -424283 -241297 67312 105461 10736
15587 10736 -112888 -156612 -132616 -213260 -164161 -267913 -236222 -20268 145270 66950 -218800
15576 -218800 -315523 -282117 -464681 -602309 -270297 -241698 -309293 -281248 -245501 -141573 -109033
15565 -109033 -116086 216836 595583 509821 209907 148672 188493 -52146 -116101 -7129 361
15554 361 -12017 -228846 -387217 -196507 98053 186202 54992 -240961 -335180 -264714 -73863
15543 -73863 252704 259876 135200 101827 -187440 -70434 137513 116439 85722 -33617 -221902
15532 -221902 -255094 -531683 -480758 -609547 -480008 -264590 -56635 91214 -41252 -41469
$$ packed form
15607a24823j02533j16817j4252J10894p4666m0437n8339k76255L2380J17717
15597e47131j53308J19642Q0628J21558J1780n7452J82986L08609L8149r4725
15587A0736j23624m3724K3996q0644M9099j03752L1691K15954J65538p8320k85750
15576b18800r6723L3406j82564j37628L32012K8599o7595K8045L5747J03928L2540
15565a09033p053L32922L78747q5762k99914o1235L9821k40639o3955J08972P490
15554C61j2378k16829j58371J90710K94560Q8149j31210k95953r4219P0466J90851
15543g3863L26567P172j24676l3373k89267J17006K07947k1074l0717j19339j88285
15532b21902l3192k76589N0925j28789J29539K15418K07955J47849j32466k17
$$ plain form
15522 -41469 -5373 -57944 -29117 7400 -25203 90965 -209198 -229807 144350 5902 -293194
15511 -293194 -66016 83682 30544 -237958 -352666 -148486 -161789 -158833 11100 58638
15501 58638 -66010 -119158 -75937 -62468 -102842 -28061 -179448 66620 57651 -198499 -143025
15490 -143025 96156 143800 148682 65053 156952 47335 -84813 -97583 -56273 -89410 -158040
15479 -158040 -494721 -591256 -303699 -144407 -9663 34428 86972 68922 131139 156207 -48987
15468 -48987 -325773 -333682 -308089 -158035 -76827 -173994 -321699 -243880 -87744 -174458 -210268
15457 -210268 -76110 -200414 -438927 -463979 -287227 -370840 -535663 -295887 -40932 99299
15447 99299 196579 134296 80051 2980 84203 -151102 -72376 -30812 -4610 -52728 -229066
$$ packed form
15522d1469L6096n2571K8827L6517l2603J16168l00163k0609L74157j38448k99096
15511b93194K27178J49698n3138k68502j14708K04180j3303K956J69933M7538
15501E8638j24648n3148M3221J3469m0374P4781j51387K46068q969k56150N5474
15490a43025K39181M7644M882q3629R1899j09617j32148j2770M1310l3137o8630
15479a58040l36681r6535K87557J59292J34744M4091N2544j8050O2217K5068k05194
15468d8987k76786p909K5593J50054Q1208r7167j47705P7819J56136q6714l5810
15457b10268J34158j24304k38513k5052J76752q3613j64823K39776K54955J40231
15447I9299R7280o2283n4245p7071Q1223k35305P8726M1564K6202m8118j76338
$$ plain form
15436 -229066 -334197 -314601 -315543 45257 161937 -82095 -252611 -419586 -503960 -179153
15426 -179153 -147674 -56651 90040 105103 -24320 171656 171244 -123099 -143441 -219225 7405
15415 7405 19297 -142709 -201213 -247733 -128780 -137404 -313123 -154592 -241968 -398438 -419880
15404 -419880 -296603 -83240 -57805 168470 280450 392818 384745 396014 232992 -105097
15394 -105097 -322048 -503200 -600013 -498906 -435997 -488848 -362039 -254200 -230737 -66455
15384 -66455 102837 -84826 -347490 -455411 -212936 134811 244453 141843 -61627 -26154
15374 -26154 -41803 -26357 116048 133839 -5067 197956 51641 -223326 -50331 -137301
15364 -137301 -152530 -105357 98864 127890 142111 205937 104539 107325 -64002 -147310 -217226
$$ packed form
15436b29066j05131J9596r42L60800J16680k44032j70516j66975q4374L24807
15426a79153L1479R1023J46691J5063j29423J95976m12k94343k0342p5784K26630
15415G405J1892j62006n8504m6520J18953q624j75719J58531q7376j56470k1442
15404d19880J23277K13363K5435K26275J11980J12368q073J1269j63022l38089
15394a05097k16951j81152r6813J01107O2909n2851J26809J07839K3463J64282
15384f6455J69292j87663k62664j07921K42475L47747J09642j02610k03470L5473
15374b6154j5649J5446J42405J7791j38906K03023j46315k74967J72995q6970
15364a37301j5229M7173K04221K9026J4221O3826j01398K786j71327q3308o9916
$$ plain form
15353 -217226 -158263 -53688 -124623 177196 560830 644747 534198 397416 180692 30795
15343 30795 87119 120130 -47486 -277897 -275522 -5387 182568 185709 109541 209495 148846
15332 148846 50979 -231372 -531500 -459446 -330322 -248489 -144799 -161499 80893 157489
15322 157489 346958 554405 247216 132129 223589 195616 25432 76695 -189570 -334296
15312 -334296 -330235 -299279 -377611 -148651 11537 42230 -107251 -70022 19816 263251 233585
15301 233585 182670 34843 108796 126607 -63092 -23547 98515 -67279 -299674 -283374
15291 -283374 -343735 -281307 -114661 -39695 -52665 -259626 -98034 13068 151392 112281
15281 112281 -188014 -279036 -56471 -215348 -238179 -213554 -301088 -288780 -402398 -260592
$$ packed form
15353b17226N8963J04575p0935L01819L83634Q3917j10549j36782k16724j49897
15343C0795N6324L3011j67616k30411K375K70135J87955L141p6168R9954o0649
15332A48846r7867k82351l00128P2054J29124Q1833J03690j6700K42392P6596
15322A57489J89469K07447l07189j15087R1460k7973j70184N1263k66265j44726
15312c34296M061L0956p8332K28960J60188L0693j49481L7229Q9838K43435k9666
15301B33585n0915j47827P3953J7811j89699L9545J22062j65794k32395J6300
15291b83374o0361O2428J66646P4966j2970k06961J61592J11102J38324l9111
15281A12281l00295r1022K22565j58877k2831K4625q7534J2308j13618J41806
$$ plain form
15271 -260592 -33039 152082 239377 91302 23553 -51935 -160909 13059 39366 -180300
15261 -180300 -201092 -150084 12318 94984 146295 295438 31349 -233653 -158581 -117830 -128971
15250 -128971 -137479 -299192 -220287 -187431 -128645 -20937 106516 179064 243151 290880 397653
15239 397653 535379 271974 11192 -20133 76558 161114 284379 254380 141552 48810
15229 48810 -24543 -70235 -8252 54363 107880 -6513 -100274 -119600 -131706 -183559 -143716
15218 -143716 -225796 -350867 -366393 -259518 -158208 -165313 -120237 -196360 -253958 -241037 -46913
15207 -46913 212269 365550 79370 34319 -119374 20139 -79473 -418835 -431085 -131071
15197 -131071 -125380 -128847 73574 310978 485127 411199 246182 192864 222270 126939 132133
$$ packed form
15271b60592K27553J85121Q7295j48075o7749p5488j08974J73968K6307k19666
15261a80300k0792N1008J62402Q2666N1311J49143k64089k65002P5072M0751j1141
15250a28971q508j61713P8905L2856N8786J07708J27453P2548O4087M7729J06773
15239C97653J37726k63405k60782l1325R6691Q4556J23265k9999j12828r2742
15229D8810p3353m5692O1983O2615N3517j14393r3761j9326j2106n1853L9843
15218a43716q2080j25071j5526J06875J01310p105M5076p6123n7598J2921J94124
15207d6913K59182J53281k86180m5051j53693J39513r9612l39362j2250L00014
15197a31071N691l467K02421K37404J74149p3928j65017n3318K9406r5331N194
$$ plain form
15186 132133 96627 -107826 -62427 22780 180719 181657 285903 268664 384206 205679 -130814
15175 -130814 -293408 -378836 -331534 -264526 -44363 -36755 -190621 -276141 -15257 307742 339743
15164 339743 353468 385820 343960 86113 38104 58792 113128 13643 -22072 -198647 -266876
15153 -266876 35297 218650 32570 -155852 -439289 -194758 -116307 -55163 -138093 -255975
15143 -255975 -66866 257590 313020 7649 -57302 252458 176593 62663 -13399 -191
15133 -191 37730 109160 89630 166973 202278 147482 148734 -40714 -343330 -372216 -269605 59507
15121 59507 198083 -10152 -24778 139055 216702 423470 374186 320252 32814 -142889
15111 -142889 -257934 -38909 223026 152253 114992 175314 322487 393723 289921 161585
$$ packed form
15186A32133l5506k04453M5399Q5207J57939R38J04246j7239J15542j78527l36493
15175a30814j62594q5428M7302O7008K20163P608j53866q5520K60884L22999L2001
15164C39743J3725L2352m1860k57847m8009K0688N4336r9485l5715j76575o8229
15153b66876L02173J83353j86080j88422k83437K44531P8451O1144q2930j17882
15143b55975J89109L24456N5430l05371o4951L09760p5865j13930p6062J3208
15133a91L7921P1430j9530P7343L5305n4796J252j89448l02616k8886J02611L29112
15121E9507J38576k08235j4626J63833P7647K06768m9284n3934k87438j75703
15111a42889j15045K19025K61935p0773l7261O0322J47173P1236j03802j28336
$$ plain form
15101 161585 156683 114104 212041 96746 -14314 -90321 -55907 9927 -26082 -38098 -7231
15090 -7231 61993 252521 306603 139683 -47857 -133319 -290802 -412531 -422678 -207248 -216581
15079 -216581 101147 291220 274888 400328 218024 226107 297931 230888 105563 -251947
15069 -251947 -340741 -330837 -318816 -223318 -295161 -267587 -173252 166593 480846 500048 331783
15058 331783 322275 298546 278271 150119 107329 148416 225330 283416 368571 198535 225653
15047 225653 147153 2183 80716 -22306 -251189 -298523 -122401 79458 238641 339442
15037 339442 227835 -17728 -131401 -86946 -58287 -137125 -154815 -42737 -94554 -131262 -198005
15026 -198005 -66366 -174665 -95666 183938 370288 339953 152036 -21020 -76222 -162205
$$ packed form
15101A61585m902m2579R7937j15295j11060p6007L4414O5834l6009j2016L0867
15090g231O9224J90528N4082j66920j87540q5462j57483j21729j0147K15430r333
15079b16581L17728J90073j6332J25440j82304Q083P1824o7043j25325l57510
15069b51947q8794R904J2021R5498p1843K7574R4335L39845L14253J9202j68265
15058C31783r508k3729k0275j28152m2790M1087P6914N8086Q5155j70036K7118
15047B25653p8500j44970P8533j03022k28883m7334J76122K01859J59183J00801
15037C39442j11607k45563j13673M4455K8659p8838j7690J12078n1817l6708o6743
15026a98005J31639j08299P8999K79604J86350l0335j87917j73056n5202q5983
$$ plain form
15016 -162205 -408750 -347611 -44324 172448 199189 125354 293152 101427 13009 218064
15006 218064 270983 221130 403399 84364 -236139 -107871 45062 52806 61259 160830 316061
14995 316061 339576 178034 81019 81070 -48174 49120 4701 -248624 -217771 -35735 -14188
14984 -14188 82401 49411 164409 76197 -113714 684 204217 400304 467320 589815
14974 589815 466134 352984 120369 -51280 3168 114416 -36693 3346 76849 -67195
14964 -67195 479 88269 90706 7731 70797 72060 23740 5736 -44291 -68820 -138340 -84956
14952 -84956 -61280 -86761 -274244 -410697 -272870 -254274 -184312 112072 216231 204046 201233
14941 201233 131114 291745 366406 537125 571195 830219 905076 1090405 1455646 1908717
$$ packed form
15016a62205k46545O1139L03287K16772K6741p3835J67798j91725q8418K05055
15006B18064N2919m9853J82269l19035l20503J28268J52933P744Q453R9571J55231
14995C16061K3515j61542r7015N1j29244R7294m4419k53325L0853J82036K1547
14984a4188R6589l2990J14998q8212j89911J14398K03533J96087O7016J22495
14974E89815j23681j13150k32615j71649N4448J11248j51109M0039P3503j44044
14964f7195O7674Q7790K437q2975O3066J263m8320j8004n0027k4529o9520N3384
14952h4956K3676k5481j87483j36453J37827J8596O9962K96384J04159j2185k813
14941B01233p0119J60631P4661J70719L4070K59024P4857J85329L65241M53071
$$ plain form
14931 1908717 2179105 2213670 2132987 2120746 2131848 2153728 2128297 2056347 1869953 1755191 1752777
14920 1752777 1531174 1072402 596882 579280 501606 767085 1001419 875466 561337 524533
14910 524533 547022 552396 494813 266803 3183 -157669 -41355 -32064 -203113 -94972 110457
14899 110457 -12627 -98067 9601 410167 467959 322943 308512 349799 321464 173516
14889 173516 327999 355615 435623 578983 304524 106327 -12726 -18480 86652 -192215
14879 -192215 -98807 22849 27430 -147200 -180685 -14741 138348 147585 219554 355073 323781
14868 323781 265356 363356 217067 167035 318871 633691 576727 282928 94953 82285
14858 82285 168577 109583 87117 -53835 -125649 -307232 -374149 -353061 -221775 -214213 -94283
$$ packed form
14931A908717K70388L4565q0683j2241J1102K1880k5431p1950j86394j14762k414
14920A752777k21603m58772m75520j7602p7674K65479K34334j25953l14129l6804
14910E24533K2489N374n7583k28010k63620j60852J16314R291j71049J08141K05429
14899A10457j23084q5440J07668M00566N7792j45016j4431M1287k8335j47948
14889A73516J54483K7616Q0008J43360k74459j98197j19053n754J05132k78867
14879a92215R3408J21656M581j74630l3485J65944J53089R237P1969J35519l1292
14868C23781n8425R8000j46289n0032J51836L14820n6964k93799j87975j2668
14858H2285Q6292n8994k2466j40952p1814j81583o6917K1088J31286P562J19930
$$ plain form
14847 -94283 -181799 69563 -28806 -164620 -44682 194406 353081 155719 66591 44971
14837 44971 86667 206539 24668 150727 359019 494774 379650 86308 -84622 -307967
14827 -307967 -351801 -494623 -287050 -40203 -39877 -72195 -51209 134478 174125 68237 -28786
14816 -28786 289023 427572 105854 412123 597879 369159 128434 261057 228565 305155
14806 305155 286336 133415 87147 137045 -72891 -136115 -153570 -88211 240286 282201 325724
14795 325724 387201 423984 379303 181901 111901 320069 299851 229989 -7053 -67332 55254
14784 55254 -62691 -161279 -65741 -11592 120590 86417 -32754 -199026 -213683 -314610 -203277
14773 -203277 -59952 178791 348364 507312 449385 441765 320615 140877 93507 65377
$$ packed form
14847i4283q7516K51362r8369j35814J19938K39088J58675j97362q9128k1620
14837D4971M1696J19872j81871J26059K08292J35755j15124k93342j70930k23345
14827c07967m3834j42822K07573K46847L26l2318K0986J85687L9647j05888r7023
14816b8786L17809J38549l21718L06269J85756k28720k40725J32623l2492P6590
14806C05155j8819j52921m6268M9898k09936o3224j7455O5359L28497M1915M3523
14795C25724O1477L6783m4681j97402p0000K08168k0218o9862k37042o0279J22586
14784E5254j17945r8588R5538N4149J32182l4173j19171j66272j4657j00927J11333
14773b03277J43325K38743J69573J58948n7927p620j21150j79738m7370k8130
$$ plain form
14763 65377 -115846 -341425 -421991 -294978 -100222 -101627 -246357 -314766 -146933 -70647 78449
14752 78449 24427 77175 135000 -100382 -487548 -643298 -624994 -244853 -359653 -650578
14742 -650578 -496793 -187018 -70267 -377819 -406165 -228731 -135033 -59306 54985 151658
14732 151658 200612 36536 67068 168601 -168039 -426070 -471510 -453371 -248230 116237
14722 116237 302386 114849 -16209 -172330 -432924 -401859 -368325 -232840 -11299 73952
14712 73952 -53545 -70415 -100570 -20688 151647 353468 304576 253687 -51846 -130686 -153703
14701 -153703 -50619 172809 129899 313390 62770 -204096 -147846 94860 147442 366483
14691 366483 312920 221079 120712 -233654 -254341 -128756 -81643 -134077 -100584 3900 164327
$$ packed form
14763F5377j81223k25579q0566J27013J94756j405j44730o8409J67833P6286J49096
14752G8449n4022N2748N7825k35382l87166j55750J8304L80141j14800k90925
14742f50578J53785L09775J16751l07552k8346J77434R3698P5727J14291R6673
14732A51658M8954j64076L0532J01533l36640k58031m5440J8139K05141L64467
14722A16237J86149j87537j31058j56121k60594L1065L3534J35485K21541Q5251
14712G3952j27497j6870l0155P9882J72335K01821m8892n0889l05533p8840k3017
14701a53703J03084K23428m2910J83491k50620k66866N6250K42706N2582K19041
14691C66483n3563r1841j00367l54366k0687J25585M7113n2434L3493J04484J60427
$$ plain form
14680 164327 253275 239444 307629 -72596 -276349 -266293 -319532 -292890 -208945 -202984 -23717
14669 -23717 -112818 -96694 -144211 -71585 53089 137550 286701 173465 83990 -44655 -107248
14658 -107248 -230534 -560199 -697143 -645849 -453629 -362292 -236639 13661 125430 165487
14648 165487 -102627 -263513 -492030 -153136 -69037 107301 167684 220572 353082 170056
14638 170056 34077 -25571 -19011 -5131 200836 262061 125335 118836 157169 103502 -49295
14627 -49295 -50088 208296 312670 221946 241349 486193 578245 252896 -60962 -62263 -157799
14616 -157799 -121321 15079 142868 104362 -32981 6403 52361 38240 -219509 -329673
14606 -329673 -127568 -50935 -168516 -166907 32964 -137822 -130121 -221656 -518067 -391604 -92398
$$ packed form
14680A64327Q8948j3831O8185l80225k03753J0056n3239K6642Q3945N961J79267
14669b3717q9101J6124m7517P2626J24674Q4461J49151j13236q9475j28645o2593
14658a07248j23286l29665j36944N1294J92220R1337J25653K50300J11769M0057
14648A65487k68114j60886k28517L38894Q4099J76338O0383N2888J32510j83026
14638A70056j35979n9648O560J3880K05967O1225j36726o499L8333n3667j52797
14627d9295p93K58384J04374r0724J9403K44844R2052l25349l13858j301r5536
14616a57799L6478J36400J27789l8506j37343L9384M5958j4121k57749j10164
14606c29673K02105P6633j17581J609J99871j70786P701r1535k96411J26463K99206
$$ plain form
14595 -92398 -48340 -245591 -272039 -235139 -282593 -345465 -227846 -189960 -148961 -250939 -413123
14584 -413123 -414548 -504730 -399520 -129557 -47673 -93341 -118852 31174 56352 87378 249402
14573 249402 118391 17833 -123617 -44232 56427 163867 109973 -111540 -158637 -73765
14563 -73765 3471 44597 276000 478552 479796 500817 498708 622229 572522 493135 423245
14552 423245 142538 -68758 51923 64213 234232 322949 262497 149134 170939 273364
14542 273364 220728 144460 -5555 -99910 22423 -32354 18266 119689 270410 141444
14532 141444 -204300 -112867 83866 -97567 -72513 -80278 -145678 -236729 -465525 -213287 -100639
14521 -100639 -140728 -271039 -281940 -161089 -376524 -333679 -450005 -388695 -296890 -398758
$$ packed form
14595i2398M4058j97251k6448L6900m7454o2872J17619L7886M0999j01978j62184
14584d13123j425r0182J05210K69963Q1884m5668k5511J50026K5178L1026J62024
14573B49402j31011j00558j41450P9385J00659J07440n3894k21513m7097Q4872
14563g3765P7236M1126K31403K02552J244K1021k109J23521m9707p9387o9890
14552D23245k80707k11296J20681J2290J70019Q8717o0452j13363K1805J02425
14542B73364n2636p6268j50015r4355J22333n4777N0620J01423J50721j28966
14532A41444l45744R1433J96733j81433K5054p765o5400r1051k28796K52238J12648
14521a00639m0089j30311j0901J20851k15435M2845j16326O1310R1805j01868
$$ plain form
14511 -398758 -337029 -112577 48893 159992 -55835 -70472 31030 285585 405953 288215
14501 288215 86847 -144138 -205784 -24681 240627 338520 290439 43532 60628 110453
14491 110453 40712 -99968 -163998 -121280 -306364 -149967 -128564 -76434 16965 119857 -12780
14480 -12780 -10076 56713 -204710 -181025 6636 95721 42944 55043 164025 4781 -58146
14469 -58146 32307 38060 75490 154332 107554 100905 137550 139733 324215 341889 236259 64391
14457 64391 -17627 -116682 31016 45825 149710 238270 147047 253991 195039 -189302 -250338
14446 -250338 -151397 -208982 -65186 72241 101888 265373 260298 235411 46412 151339 166596
14435 166596 133688 36956 -55259 -91313 77134 473167 471309 -12998 -243825 -114448 -163301
$$ packed form
14511c98758O1729K24452J61470J11099k15827j4637J01502K54555J20368j17738
14501B88215k01368k30985o1646J81103K65308R7893m8081k46907J7096M9825
14491A10453o9741j40680o4030M2718j85084J56397K1403N2130R3399J02892j32637
14480a2780K704O6789k61423K3685J87661Q9085n2777J2099J08982j59244o2927
14469e8146R0453N753L7430P8842m6778o649L6645K183J84482J7674j05630j71868
14457F4391q2018r9055J47698J4809J03885Q8560r1223J06944n8952l84341o1036
14446b50338R8941n7585J43796J37427K9647J63485n075k4887j88999J04927J5257
14435A66596l2908r6732r2215l6054J68447L96033j858m84307k30827J29377m8853
$$ plain form
14424 -163301 -314459 -295100 -206323 -330003 -236593 111872 144504 161257 59463 37862 151136
14413 151136 455230 434753 332728 208052 -48228 -148179 -80177 -105438 73458 196864
14403 196864 242943 197417 307004 477226 623966 421107 323358 238702 172964 175187 172395
14392 172395 357862 169356 -131729 -218510 126279 469727 439166 296535 193850 105433
14382 105433 65315 -239484 -367200 -220666 -62735 130024 327641 42136 -344575 -200164
14372 -200164 -74465 119796 75873 19115 24166 78712 -171719 -176227 -36181 111816 94398
14361 94398 -30919 -111273 -448866 -619971 -578946 -532423 -543482 -613492 -606875 -544578 -303211
14350 -303211 -156395 41464 439740 476613 440583 267404 138447 17866 28618 30668
$$ packed form
14424a63301j51158J9359Q8777j23680R3410L48465L2632J6753j01794k1601J13274
14413A51136L04094k0477j02025j24676k56280r9951O8002k5261J78896J23406
14403A96864M6079m5526J09587J70222J46740k02859r7749q4656o5738K223k792
14392A72395J85467j88506l01085q6781L44789L43448l0561j42631j02685q8417
14382A05433m0118l04799j27716J46534J57931J92759J97617k85505l86711J44411
14372b00164J25699J94261m3923n6758N051N4546k50431m508J40046J47997j7418
14361I4398j25317q0354l37593j71105M1025M6523j1059p0010O617O2297K41367
14350c03211J46816J97859L98276L6873l6030j73179j28957j20581J0752K050
$$ plain form
14340 30668 172562 53152 -136625 206423 328631 232432 96723 89264 15853 186297
14330 186297 294478 -103809 -432471 -240013 -122372 -230718 -144230 -77798 -877 55455
14320 55455 131691 183892 240707 322985 224950 223444 266877 -65083 -347893 -288193 22281
14309 22281 227570 206444 222366 171632 203995 302679 512217 298124 -231657 -378687 -258739
14298 -258739 -279284 -176308 -275525 -240670 -73896 -201699 -192178 -132903 -100725 195185 313083
14287 313083 99892 176596 65346 -107352 -111181 -209801 -113233 81087 195570 133814 132030
14276 132030 197011 366271 281341 -92396 -131022 -19754 -361650 -315663 -114963 -165698
14266 -165698 -191279 -185265 -219980 -75945 -48400 297364 503170 494895 451066 487411 500405
$$ packed form
14340C0668J41894j19410j89777L43048J22208r6199j35709p459p3411J70444
14330A86297J08181l98287l28662J92458J17641j08346Q6488O6432P6921N6332
14320E5455P6236N2201N6815Q2278r8035j506M3433l31960k82810N9700L10474
14309B2281K05289k1126J5922n0734L2363R8684K09538k14093n29781j47030J19948
14298b58739k0545J02976r9217L4855J66774j27803R521N9275L2178K95910J17898
14287C13083k13191P6704j11250j72698l829r8620R6568J94320J14483o1756j784
14276A32030O4981J69260q4930l73737l8626J11268l41896M5987K00700n0735
14266a65698k5581O014l4715J44035K7545L45764K05806q275m3829L6345J2994
$$ plain form
14255 500405 401835 73083 -52358 35632 -118282 -109992 -47658 -228695 -526406 -324870
14245 -324870 -283544 -331855 -149826 188633 139170 -96811 -103228 72041 158268 141928 290667
14234 290667 356117 211691 115969 110780 9311 -7187 139725 293686 398247 113232
14224 113232 9987 28319 106727 -35244 32961 155826 -50826 -32667 9161 29307 -197838
14213 -197838 -247042 109581 148426 140534 93158 -1816 -39201 133486 284241 367136 205728
14202 205728 -41133 -56908 1978 -21053 -165562 -257444 -242188 -180490 55456 228728 243912
14191 243912 253831 223760 120636 111923 74948 -110448 -78112 288403 385790 157847 213671
14180 213671 23615 -256201 -182730 -10327 -103109 -5299 105399 28804 -13385 -104957 45566
$$ packed form
14255E00405r8570l28752j25441Q7990j53914Q290O2334j81037k97711K01536
14245c24870M1326m8311J82029L38459m9463k35981o417J75269Q6227j6340J48739
14234B90667O5450j44426r5722n189j01469j6498J46912J53961J04561k85015
14224A13232j03245J8332P8408j41971O8205J22865k06652J8159M1828K0146k27145
14213a97838m9204L56623L8845p892m7376r4974l7385J72687J50755Q2895j61408
14202B05728k46861j5775N8886k3031j44509r1882J5256O1698K35946J73272J5184
14191B43912R919l0071j03124q713l6975j85396L2336L66515R7387k27943N5824
14180B13671j90056k79816P3471J72403r2782R7810J10698p6595m2189r1572J50523
$$ plain form
14169 45566 -19049 -51171 -122776 -75274 132844 140648 130260 231974 256400 144278 241993
14158 241993 164095 14154 -24073 68211 -133447 -120580 -81708 -463556 -524537 -449392 -76647
14147 -76647 199415 -23949 -474562 -484506 -105675 137298 163691 -60288 -269187 -385136
14137 -385136 -299489 -430080 -693758 -635131 -485150 -247659 37227 77289 126633 148517
14127 148517 -5998 -267142 -227845 -338616 -367976 -310684 -127162 -170697 -202788 -71487
14117 -71487 -19481 67798 110612 5914 -161358 -174535 -69185 -144546 -165907 -131471 4712
14106 4712 129009 -3039 200524 170471 -171530 -186266 -252168 -373246 -473298 -168903
14096 -168903 31657 311643 578577 587378 485492 272345 122249 16815 -17629 -259404
$$ packed form
14169D5566o4615l2122p1605M7502K08118P804j0388J01714K4426j12122R7715
14158B41993p7898j49941l8227R2284k01658J2867L8872l81848o0981P5145L72745
14147g6647K76062k23364m50613r944L78831K42973K6393k23979k08899j15949
14137c85136Q5647j30591k63678N8627J49981K37491K84886M0062M9344K1884
14127A48517j54515k61144L9297j10771k9360N7292J83522m3535l2091J31301
14117g1487N2006Q7279M2814j04698j67272j3177J05350p5361k1361L4436J36183
14106D712J24297j32048K03563l0053l42001j4736o5902j21078j00052L04395
14096a68903K00560K79986K66934Q801j01886k13147j50096j05434l4444k41775
$$ plain form
14086 -259404 -339468 -117383 42702 6039 -49477 2757 -39273 -323718 -400402 -232776 211624
14075 211624 231494 17849 40601 116452 320072 360028 319454 568981 413673 163545
14065 163545 149256 173681 112284 -35760 -302970 -557617 -562698 -496211 -294889 -127889 48733
14054 48733 -221091 -215923 118954 84154 -45806 -9692 25248 8592 51092 74075 196695
14043 196695 324631 135381 -24201 274570 261532 38827 -211084 -220305 -163604 -172892 59690
14032 59690 203059 354907 269828 205015 227561 53013 -100906 -486348 -337302 -1453
14022 -1453 117538 139792 360629 443195 128460 130030 219337 122853 105742 262972 189049
14011 189049 344089 316498 489193 431209 223708 128985 129428 141066 248901 252722 290257
$$ packed form
14086b59404q0064K22085J60085l6663n5516N2234m2030k84445p6684J67626M44400
14075B11624J9870k13645K2752P5851K03620L9956m0574K49527j55308k50128
14065A63545j4289K4425o1397j48044k67210k54647n081O6487K01322J67000J76622
14054D8733k69824N168L34877l4800j29960L6114L4940j6656M2500K2983J22620
14043A96695J27936j89250j59582K98771j3038k22705k49911r221N6701r288K32582
14032E9690J43369J51848q5079o4813K2546j74548j53919l85442J49046L35849
14022a453J18991K2254K20837Q2566l14735J570Q9307r6484j7111J57230p3923
14011A89049J55040k7591J72695n7984k07501r4723M43J1638J07835L821L7535
$$ plain form
14000 290257 405849 540392 452380 469786 393125 274334 7383 -171342 -350968 -366948
13990 -366948 -245883 -231928 -309628 -254496 -250585 14293 10750 126008 165156 105759 -182201
13979 -182201 -34181 -37047 60676 103364 18363 -37711 142817 400992 88449 -19564 -14828
13968 -14828 -179340 -116308 -122746 -110243 -322915 -379121 -283602 -69604 -23784 -326001 -344928
13957 -344928 -147820 -22575 -224828 -343406 -338044 -460644 -74282 -20947 -289002 -564931
13947 -564931 -464347 -289146 -36677 347449 24675 -235598 -4841 285663 424284 379997
13937 379997 -67832 -469748 -678923 -665915 -720807 -417797 -358031 -376932 -375345 75150 197621
13926 197621 228170 357370 239502 -61215 -48601 16381 63402 -124581 -323341 -257959
$$ packed form
14000B90257J15592J34543q8012J7406p6661j18791k66951j78725j79626j5980
13990c66948J21065J3955p7700N5132L911K64878l543J15258L9148n9397k87960
13979a82201J48020k866R7723M2688q5001n6074J80528K58175l12543j08013M736
13968a4828j64512O3032o438J2503k12672n6206R5519K13998M5820l02217j8927
13957c44928J97108J25245k02253j18578N362j22600L86362N3335k68055k75929
13947e64931J00584J75201K52469L84126l22774k60273K30757K90504J38621m4287
13937C79997m47829m01916k09175J3008n4892L03010N9766j8901J587M50495J22471
13926A97621L0549J29200j17868l00717J2614O4982M7021j87983j98760O5382
$$ plain form
13916 -257959 -142598 28635 20655 103753 19626 -217558 -158843 -232746 6919 310979 297230
13905 297230 251975 174647 -151378 -203114 -244596 -434083 -502786 -351548 -206731 -196409 -126034
13894 -126034 12891 324877 172306 -132684 -202609 -316973 -471860 -357955 -192207 149079
13884 149079 272244 195570 310955 237694 246579 380895 32588 -144326 -160207 -105736 37617
13873 37617 38714 -341280 -591708 -362764 -166668 -62089 4286 77363 148249 53621 -11573
13862 -11573 19529 98154 -29604 263004 353425 194611 -41849 -184410 -138690 -167360 -135544
13851 -135544 79382 165012 226065 382440 94192 -127559 -124262 10933 89286 133726 170777
13840 170777 41728 184302 229480 33748 2387 108501 134739 -125176 -327807 -170986
$$ packed form
13916b57959J15361J71233p980Q3098q4127k37184N8715p3903K39665L04060j3749
13905B97230m5255p7328l26025n1736m1482j89487o8703J51238J44817J0322P0375
13894a26034J38925L11986j52571l04990o9925j14364j54887J13905J65748L41286
13884A49079J23165p6674J15385p3261Q885J34316l48307j76914j5881N4471J43353
13873C7617J097l79994k50428K28944J96096J04579O6375P3077P0886r4628o5194
13862a1573L1102P8625j27758K92608R0421j58814k36460j42561M5720k8670L1816
13851a35544K14926Q5630O1053J56375k88248k21751L297J35195P8353M4440L7051
13840A70777j29049J42574M5178j95732l1361J06114K6238k59915k02631J56821
$$ plain form
13830 -170986 -130334 102698 410991 184248 128925 144880 -26577 -18998 -29019 -128290 -76050
13819 -76050 278689 350116 348110 109038 10705 -160881 -44684 214346 311975 324883 23319
13808 23319 -232005 -391191 -475991 -214540 -99567 -226949 -68952 -55458 -303590 -319764
13798 -319764 -234963 -205694 -155369 71619 68197 57045 233344 160744 109355 52757 -218026
13787 -218026 -323392 -198206 -105178 106556 111865 -66446 -119178 43211 166534 166884 115489
13776 115489 198403 324982 54799 -17274 -168485 -19761 217188 25723 155323 20078
13766 20078 -123947 -444722 -516100 -354983 -223883 -189096 -94815 -3500 155300 76665 -121389
13755 -121389 -245639 -147815 40266 -177788 -444588 -615939 -475767 -507362 -492411 -208139
$$ packed form
13830a70986M0652K33032L08293k26743n5323J5955j71457P579j0021r9271N2240
13819g6050L54739P1427k006k39072r8333j71586J16197K59030R7629J2908l01564
13808B3319k55324j59186q4800K61451J14973j27382J57997J3494k48132j6174
13798c19764Q4801K9269N0325K26988l422j1152J76299p2600n1389n6598k70783
13787b18026j05366J25186R3028K11734N309j78311n2732J62389J23323L50n1395
13776A15489Q2914J26579k70183p2073j51211J48724K36949j91465J29600j35245
13766B0078j44025l20775p1378J61117J31100L4787R4281R1315J58800p8635j98054
13755a21389j24250R7824J88081k18054k66800j71351J40172l1595J4951K84272
$$ plain form
13745 -208139 -294327 -423758 -421690 -306659 -76406 50508 -46680 107814 196248 209982 128387
13734 128387 -280084 -515576 -377896 -212949 -171962 -155345 -109910 86827 968 -44069
13724 -44069 -84743 -27718 10120 -103679 -128058 -169041 37144 -67385 -412111 -454571 -250811
13713 -250811 -114984 -155635 -215738 -25695 -16625 -217560 -408638 -290996 -191210 -218182 34561
13702 34561 58548 -41247 -155921 -228554 -48363 102497 47393 104032 163825 66705 120467
13691 120467 10067 -78603 31580 196580 396981 650423 702458 201355 202120 174797 182655
13680 182655 185587 110314 -28507 153571 231463 127400 29340 -174065 -253139 -32022 -39329
13669 -39329 -240412 -248730 -155374 -229242 -390705 -142603 -91503 -186563 -272726 -322583 -67083
$$ packed form
13745b08139q6188j29431K068J15031K30253J26914r7188J54494Q8434J3734q1595
13734A28387m08471k35492J37680J64947M0987J6617M5435J96737q5859m5037
13724d4069m0674N7025L7838j13799k4379m0983K06185j04529l44726m2460K03760
13713b50811J35827m0651o0103J90043R070k00935j91078J17642R9786k6972K52743
13702C4561K3987r9795j14674p2633J80191J50860n5104N6639N9793r7120N3762
13691A20467j10400q8670J10183J65000K00401K53442N2035n01103P65k7323P858
13680A82655K932p5273j38821J82078P7892j04063r8060k03405p9074K21117p307
13669c9329k01083q318R3356p3868j61463K48102N1100r5060q6163m9857K55500
$$ plain form
13658 -67083 12731 -69704 -247384 -299864 -141449 -191199 -105544 -154988 -182957 -266466 -183003
13647 -183003 -214111 68926 -69484 10737 246344 395201 208523 -80556 -308503 -193843
13637 -193843 -102277 2526 -25347 -49034 -93590 -250541 -474112 -385103 -368578 -328409 -123918
13626 -123918 23598 -140417 -408217 -514017 -522150 -94133 14252 -170618 -196198 -118363
13616 -118363 76742 -9490 -80341 105259 304416 406085 452025 421721 344205 54207
13606 54207 60421 -15487 -109355 -40419 -52553 263030 239455 289519 278881 161018 83527
13595 83527 64254 31657 -191471 -147461 -177105 -22599 56401 257105 297176 5525 -186426
13584 -186426 26864 167039 369496 162120 -10411 -301095 -324103 -160364 -186821 -184249
$$ packed form
13658f7083P9814q2435j77680n2480J58415m9750Q5655m9444k7969q3509Q3463
13647a83003l1108K83037j38410Q0221K35607J48857j86678k89079k27947J14660
13637a93843R1566J04803k7873k3687m4556j56951k23571Q9009J6525M0169K04491
13626a23918J47516j64015k67800j05800q133M28017J08385j84870k5580P7835
13616a18363J95105q6232p0851J85600J99157J01669M5940l0304p7516k89998
13606E4207O214p5908r3868O8936j2134L15583k3575N0064j0638j17863p7491
13595H3527j9273l2597k23128M4010k9644J54506P9000K00704M0071k91651j91951
13584a86426K13290J40175K02457k07376j72531k90684k3008J63739k6457K572
$$ plain form
13574 -184249 -88369 51412 -73790 -452560 -594354 -559958 -349907 -349990 -199428 -127341 -188812
13563 -188812 -42777 -181896 -110350 25042 130366 35697 -24108 159766 241438 -82934
13553 -82934 -334921 -201204 -237500 -234092 -151790 -193305 -358824 -365829 -175790 38687 18777
13542 18777 4748 -6084 -89961 -141796 150534 296722 388608 484365 140093 -181061 -287671
13531 -287671 -147589 14665 118096 59675 88779 159050 19675 -175430 -111934 -80749
13521 -80749 -36444 96158 291213 298368 141403 29865 -54295 -262559 -113767 199953
13511 199953 336083 201077 270587 287794 140601 -2069 -150519 -227400 -246255 -36181
13501 -36181 133706 120244 56257 19564 63082 -208073 -258424 -195805 -258276 -219087 -25802
$$ packed form
13574a84249R5880J39781j25202l78770j41794L4396K10051q3J50562P2087o1471
13563a88812J46035j39119P1546J35392J05324r4669n9805J83874Q1672l24372
13553h2934k51987J33717l6296L408Q2302m1515j65519p005J90039K14477j9910
13542A8777j4029j0832q3877n1835K92330J46188R1886R5757l44272l21154j06610
13531b87671J40082J62254J03431n8421K9104P0271j39375j95105O3496L1185
13521h0749M4305J32602J95055P155j56965j11538q4160k08264J48792L13720
13511A99953J36130j35006O9510J7207j47193j42670j48450p6881j8855K10074
13501c6181J69887j3462o3987l6693M3518k71155n0351O2619o2471L9189J93285
$$ plain form
13490 -25802 38623 -394 221980 559093 516782 288464 132811 247449 287855 380499 559870
13479 559870 643675 599798 235512 150378 -64991 -280358 -74355 -154073 -215364 84968
13469 84968 205161 84089 -110225 -214069 -73867 127062 210543 271130 241458 -40055
13459 -40055 -37520 222907 -9383 -84597 -60211 -228460 -12424 223934 -12222 -128237
13449 -128237 -51751 18706 23479 -152250 -328117 -192455 -19508 -110970 -47067 9132 8066
13438 8066 67748 143656 155219 238681 211796 410636 551359 430654 179350 63214 280331
13427 280331 287335 111316 -143024 -347765 -271805 -157609 -30025 -177437 -372265 -227706
13417 -227706 -111195 -142419 197437 392388 96487 121061 398722 276154 117064 -12245
$$ packed form
13490b5802O4425l9017K22374L37113m2311k28318j55653J14638M0406R2644J79371
13479E59870Q3805m3877l64286q5134k15369k15367K06003p9718o1291L00332
13469H4968J20193j21072j94314j03844J40202K00929Q3481O0587k9672k81513
13459d0055K535K60427k32290p5214K4386j68249K16036K36358k36156j16015
13449a28237P6486P0457M773j75729j75867J35662J72947r1462O3903N6199j066
13438H066N9682P5908J1563Q3462k6885J98840J40723j20705k51304j16136K17117
13427B80331P004j76019k54340k04741P5960J14196J27584j47412j94828J44559
13417b27706J16511l1224L39856J94951k95901K4574K77661j22568j59090j29309
$$ plain form
13407 -12245 -191466 -62831 31219 15452 7906 -204126 -355042 -422000 -437238 -465578 -331764
13396 -331764 -254350 -248300 -128614 -230051 -397950 -398393 -338491 -359503 40122 86314 -154911
13385 -154911 -269145 -233375 -81143 -228264 -151145 56052 -40219 -213777 -270214 -338900
13375 -338900 -480585 -545344 -218411 86040 175364 256679 48010 11851 -168034 -132132
13365 -132132 -161437 -205771 -340684 -148478 20362 289565 268700 210500 16651 -218272
13355 -218272 -310120 -358196 -353776 -77912 189151 411871 474012 466468 273572 194428 199675
13344 199675 228386 128091 -131580 -268494 -164457 258631 447211 539200 347847 -29716
13334 -29716 -174759 -68583 96862 62523 5453 49627 -98350 -84376 -82878 12667 -189394
$$ packed form
13407a2245j79221J28635R4050j5767p546k12032j50916o6958j5238k8340J33814
13396c31764P7414O050J19686j01437j67899m43N9902k1012L99625M6192k41225
13385a54911j14234L5770J52232j47121P7119K07197r6271j73558n6437o8686
13375c38900j41685o4759L26933L04451Q9324Q1315k08669l6159j79885L5902
13365a32132k9305m4334j34913J92206J68840K69203k0865n8200j93849k34923
13355b18272r1848m8076M420K75864K67063K22720O2141p544j92896p9144N247
13344A99675K8711j00295k59671j36914J04037M23088J88580R1989j91353l77563
13334b9716j45043J06176J65445l4339n7070M4174j47977J3974J498R5545k02061
$$ plain form
13323 -189394 -394730 -342777 -156671 -132893 58346 232296 121290 -367740 -399108 -172226
13313 -172226 -261479 -149049 -187977 -398632 -305268 -59863 -71800 80769 183352 297851
13303 297851 210818 -16156 -236305 -189160 49738 232011 279524 317892 292608 120498
13293 120498 -56583 -103802 231242 189243 121596 178328 132284 -19720 52433 174912 340190
13282 340190 256113 132062 142848 59918 -55502 44722 54057 -48471 17968 144287 198979
13271 198979 165102 62617 78496 257434 116466 -13424 7678 -22839 130220 90514
13261 90514 -50727 96701 120966 7889 -205979 5499 40735 -32249 32914 99549 86317
13250 86317 184785 44830 84256 19555 142407 284083 498312 361768 135889 -25645
$$ packed form
13323a89394k05336N1953J86106K3778J91239J73950j11006m89030l1368K26882
13313a72226q9253J12430l8928k10655R3364K45405j1937J52569J02583J14499
13303B97851q7033k26974k20149M7145K38898J82273M7513L8368k5284j72110
13293A20498j77081m7219L35044m1999o7647N6732m6044j52004P2153J22479J65278
13282C40190q4077j24051J0786q2930j15420J00224R335j02528O6439J26319N4692
13271A98979l3877j02485J5879J78938j40968j29890K1102l0517J53059l9706
13261I0514j41241J47428K4265j13077k13868K11478L5236p2984O5163O6635j3232
13250H6317R8468j39955L9426o4701J22852J41676K14229j36544k25879j61534
$$ plain form
13240 -25645 -46144 137097 7395 -70856 -5275 9141 81629 -5558 901 -202361 -217808
13229 -217808 -455199 -456105 -98030 3534 158283 131376 -9877 -42393 41560 33095 -227996
13218 -227996 6517 2705 -131769 -132186 -250559 -235357 -108425 -148173 -153863 -15203 142690
13207 142690 284304 107989 -88931 31224 86958 -146600 41806 145271 259513 65006
13197 65006 -182884 -17860 48121 20872 127118 374642 531629 313255 -83143 63867
13187 63867 87247 190217 102894 114004 254270 285661 190678 -47 80917 -26138 -21465
13176 -21465 -40789 50237 102440 134520 -147353 -388464 -618910 -586818 -318419 -274899 -196926
13165 -196926 -27966 -186438 -320737 -338648 -56336 11003 367221 509647 421297 393608
$$ packed form
13240b5645k0499J83241j29702p8251O5581J4416P2488q7187O459k03262j5447
13229b17808k37391r06L58075J01564J54749k6907j41253l2516Q3953q465k61091
13218b27996K34513l812j34474m17j18373J5202J26932l9748n690J38660J57893
13207A42690J41614j76315j96920J20155N5734k33558J88406J03465J14242j94507
13197F5006k47890J65024O5981k7249J06246K47524J56987k18374l96398J47010
13187F3867K3380J02970q7323J1110J40266L1391r4983j90725Q0964j07055M673
13176b1465j9324R1026N2203L2080k81873k41111k30446L2092K68399M3520P7973
13165a96926J68960j58472j34299j7911K82312O7339L56218J42426q8350k7689
$$ plain form
13155 393608 -7898 -208944 -165053 -128452 6131 195218 311361 375323 481557 751964
13145 751964 733214 709933 491902 122104 147444 -16986 -117127 -97651 -4302 135411
13135 135411 44206 -73347 -120060 -134910 -143392 -79068 -6936 129054 256595 56639 75779
13124 75779 180440 258279 93170 58957 3133 56275 272301 297893 77382 23979 -156034
13113 -156034 -313978 -322631 -235509 -112071 30978 -26197 -297137 -434430 -204562 -221997
13103 -221997 -149399 349639 302030 38113 29301 328800 293404 18602 -229423 -306651 -250519
13092 -250519 -133026 -19824 -173094 -449895 -278337 -142094 -69625 -56661 137364 284756
13082 284756 365449 263052 14964 -290352 -348137 5950 352006 266652 200121 193217 -145771
$$ packed form
13155C93608m01506k01046M3891L6601J34583J89087J16143O3962J06234K70407
13145G51964j8750k3281k18031l69798K5340j64430j00141J9476R3349J39713
13135A35411r1205j17553m6713j4850q482O4324P2132J35990J27541j99956J9140
13124G5779J04661P7839j65109l4213n5824N3142K16026K5592k20511n3403j80013
13113a56034j57944q653Q7122J23438J43049n7175k70940j37293K29868j7435
13103b21997P2598M99038m7609k63917q812K99499l5396k74802k48025p7228N6132
13092b50519J17493J13202j53270k76801J71558J36243P2469J2964J94025J47392
13082B84756Q0693j02397k48088l05316n7785L54087L46056q5354o6531o904l38988
$$ plain form
13071 -145771 -33950 152259 149537 238482 258672 195500 -109140 -172697 -123442 44293 79265
13060 79265 -140599 194731 230451 118429 -133438 -165407 5704 382176 272970 23340
13050 23340 -126216 -287279 -319169 -106782 -207039 -252186 -106488 -99894 -78747 -307575 -86786
13039 -86786 140333 72786 143759 -39415 -159723 -117121 -89182 -281625 -102023 157765
13029 157765 253365 182628 95160 175905 403440 420826 390318 478400 492585 140068 154801
13018 154801 118473 233217 335738 205649 74474 246179 467071 318431 -19777 -178082
13008 -178082 -309892 -241432 -130956 124085 196321 158044 63770 -201527 -300406 -424331
12998 -424331 -381124 -235048 -122942 -211684 -354405 -529479 -519563 -634435 -392598 -255745
$$ packed form
13071a45771J11821J86209k722Q8945K0190o3172l04640o3557M9255J67735L4972
13060G9265k19864L35330L5720j12022k51867l1969J71111L76472j09206k49630
13050B3340j49556j61063l1890K12387j00257m5147J45698O594K1147k28828K20789
13039h6786K27119o7547P0973j83174j20308M2602K7939j92443J79602K59788
13029A57765R5600p0737q7468Q0745K27535J7386l0508Q8082J4185l52517J4733
13018A54801l6328J14744J02521j30089j31175J71705K20892j48640l38208j58305
13008a78082j31810O8460J10476K55041P2236l8277r4274k65297r8879j23925
12998d24331M3207J46076J12106q8742j42721j75074R916j14872K41837J36853
$$ plain form
12988 -255745 -190702 -138514 -177153 -16351 61404 66940 -164128 -179210 -235559 -200066 8851
12977 8851 7009 -120234 -157974 -67852 -28657 86939 169149 166246 100265 -5390 -128929
12966 -128929 -74699 254080 353413 254137 244108 218924 131335 3552 -84382 -74941 -45749
12955 -45749 -64491 -54622 130876 98202 50922 46680 -82649 -63235 -94737 -93655 -459098 -516700
12943 -516700 -314392 -439469 -348899 -413868 -406497 -225625 -108004 -359973 -393450 -383786 -429985
12932 -429985 -306833 -114313 -66369 -235634 -282156 -234361 -109985 -25688 48543 -19923 -123562
12921 -123562 -178839 -164380 8272 117671 242708 163141 267532 159781 -337612 -494643
12911 -494643 -572450 -590159 -268573 -4120 96173 78918 23534 192193 -17910 -46239
$$ packed form
12988b55745O5043N2188l8639J60802P7755N536k31068j5082n6349L5493K08917
12977H851j842j27243l7740R0122L9195J15596Q2210k903o5981j05655j23539
12966a28929N4230L28779R9333r9276j0029k5184q7589j27783q7934R441K9192
12955d5749j8742R869J85498l2674m7280m242j29329J9414l1502J082l65443n7602
12943e16700K02308j25077R0570o4969P371J80872J17621k51969l3477R664m6199
12932d29985J23152J92520M7944j69265m6522M7795J24376Q4297P4231o8466j03639
12921a23562n5277J4459J72652J09399J25037p9567J04391j07751m97393j57031
12911d94643p7807j7709L21586K64453J00293j7255n5384J68659k10103k8329
$$ plain form
12901 -46239 230441 432792 417476 123737 -170720 -7043 -100947 -281128 -300059 -129347
12891 -129347 70148 232357 120748 1689 268538 471611 417932 387780 466695 299760
12881 299760 204276 -27890 39530 137269 345990 187793 86983 66242 -52262 -1349
12871 -1349 129768 58824 117243 198802 135245 -19846 20220 72306 47541 -150054 -260436
12860 -260436 -220585 -145864 -119836 -31729 -23194 -77065 -66180 132284 199101 162912 203434
12849 203434 201848 101735 42203 -21743 -109938 -63711 51638 4516 -173495 22755 423353
12838 423353 298776 748 -33506 -48715 9106 43630 14426 20337 24989 122336 76041
12827 76041 -53430 -197013 -247026 -313178 -67081 -107679 -86323 -81198 -518 102057 65916
$$ packed form
12901d6239K76680K02351j5316k93739k94457J63677r3904j80181j8931J70712
12891a29347J99495J62209j11609j19059K66849K03073n3679l0152P8915j66935
12881B99760r5484k32166O7420R7739K08721j58197j00810k0741j18504N0913
12871a349J31117p0944N8419Q1559o3557j55091M0066N2086k4765j97595j10382
12860b60436L9851P4721K6028Q8107Q535n3871J0885J98464O6817l6189M0522
12849B03434j586j00113n9532o3946q8195M6227J15349m7122j78011J96250M00598
12838D23353j24577k98028l4254j5209N7821L4524k9204N911M652R7347m6295
12827G6041j29471j43583n0013o6152K46097m0598K1356N125Q0680J02575l6141
$$ plain form
12816 65916 39047 -77664 81488 197987 330160 357597 69200 -55979 82311 108385
12806 108385 -16677 19523 -68905 -316013 -416471 -205435 55330 -4610 -66298 -131472
12796 -131472 -171497 -118534 2227 85224 -65459 -138324 128379 400428 787720 1046640
12786 1046640 831825 776439 639902 278245 -123543 -119731 -771 154640 174853 225411
12776 225411 337491 292337 439661 548013 563464 590453 540328 520373 477274 249659 -82639
12765 -82639 -188377 -364755 -310699 -261466 55121 326501 399699 427361 386630 212173 252441
12754 252441 104632 27267 -136101 -26042 -9471 -188718 -323933 -786051 -659676 -311439
12744 -311439 -184067 19808 218508 215886 80564 279134 485071 487761 350040 58322
$$ packed form
12816F5916k6869j16711J59152J16499J32173K7437k88397j25179J38290K6074
12806A08385j25062L6200q8428k47108j00458K11036K60765n9940o1688o5174
12796a31472m0025N2963J20761Q2997j50683p2865K66703K72049L87292K58920
12786A046640k14815n5386j36537l61657m01788L812J18960J55411K0213N0558
12776B25411J12080m5154J47324J08352J5451K6989n0125j9955m3099k27615l32298
12765h2639j05738j76378N4056M9233L16587K71380P3198K7662m0731j74457M0268
12754B52441j47809p7365j63368J10059J6571j79247j35215m62118J26375L48237
12744c11439J27372K03875J98700k622j35322J98570K05937K690j37721k91718
$$ plain form
12734 58322 -16901 10702 87612 65388 70457 104600 291621 337196 242057 160093 42173
12723 42173 62461 -63992 -131280 -97972 -32640 -130794 -515858 -537898 -547254 -435084 -255979
12712 -255979 -138727 76575 17732 -33849 -17103 450876 481691 303053 24728 60493
12702 60493 -43679 -19919 -156809 -81174 101813 1419 141580 -31955 -92357 -79228
12692 -79228 29670 149628 -64302 -332884 -513252 -370694 -49979 17850 68141 -41123
12682 -41123 28751 123155 35338 -50289 -68611 20620 91175 305310 167378 96502 214519
12671 214519 91582 -52669 58195 91638 429626 360835 250156 227815 -22841 -173768
12661 -173768 -335491 -252657 -177441 -61921 -137004 -231627 -195645 -72386 -217678 -278978 -197899
$$ packed form
12734E8322p5223K7603P6910k2224N069L4143J87021M5575r5139q1964j17920
12723D2173K0288j26453o7288L3308O5332r8154l85064k2040r356J12170J79105
12712b55979J17252K15302n8843n1581J6746M67979L0815j78638k78325L5765
12702F0493j04172K3760j36890P5635J82987j00394J40161j73535o0402J3129
12692g9228J08898J19958k13930k68582j80368J42558L20715O7829N0291j09264
12682d1123O9874R4404q7817q5627j8322Q9231P0555K14135j37932p0876J18017
12671B14519j22937j44251J10864L3443L37988o8791j10679k2341k50656j50927
12661a73768j61723Q2834P5216J15520p5083r4623L5982J23259j45292o1300Q1079
$$ plain form
12650 -197899 -33249 18741 -135555 -12391 180066 -46364 -74230 187689 72457 82772
12640 82772 152182 -55269 -227278 -131284 -285649 -151317 -152046 5978 44617 -146123 -96669
12629 -96669 -24714 53133 7578 -152701 -159351 -81001 -118403 -273787 -368339 -127169 100926
12618 100926 314821 287171 71236 -227976 -180135 -170835 -118819 55345 35770 101187 105832
12607 105832 -208319 -396919 -326676 -160715 48568 224253 133538 -126256 -178018 3588
12597 3588 8190 12088 -51287 -42782 -69786 -100146 52760 206315 144496 -95273 -78479 107441
12585 107441 146438 -77976 -216110 -114257 -107354 -104460 -204652 -326573 -177681 -4656
12575 -4656 173247 245709 212873 202490 264552 88774 145701 288990 335772 205312 214507
$$ packed form
12650a97899J64650N1990j54296J23164J92457k26430k7866K61919j15232J0315
12640H2772O9410k07451j72009R5994j54365J34332p29J58024L8639j90740M9454
12629i6669P1955P7847m5555j60279o650P8350l7402j55384r4552K41170K28095
12618A00926K13895k7650k15935k99212M7841R300N2016J74164j9575O5417M645
12607A05832l14151j88600P0243J65961K09283J75685r0715k59794n1762J81606
12597C588M602L898o3375Q505k7004l0360J52906J53555o1819k39769J6794J85920
12585A07441L8997k24414j38134J01853O903K894j00192j21921J48892J73025
12575d656J77903P2462l2836j0383O2062j75778N6927J43289M6782j30460R195
$$ plain form
12564 214507 328000 255679 74024 -23803 69309 -25062 -223321 -208236 -148175 -160179 -109728
12553 -109728 13514 -31533 -169290 -189027 65408 70368 214369 337289 389247 483217 100887
12542 100887 -8462 16613 -59022 -246660 -404037 -250073 -145345 -422387 -263247 -153516
12532 -153516 -377020 -415612 -308054 -334812 -294444 -198397 -131168 -243953 -121523 11102
12522 11102 32832 101870 83970 24602 191028 326162 299234 396031 522494 360841 259931
12511 259931 123183 72666 -21203 126577 66342 -113909 -17608 -136246 -156330 -2764
12501 -2764 60545 66921 -127604 -177859 -65538 111058 103378 -209622 -151765 -117155 -26686
12490 -26686 96307 355797 515133 728358 882708 616055 533964 675997 611277 362602
$$ packed form
12564B14507J13493p2321j81655r7827R3112r4371j98259J5085O0061j2004N0451
12553a09728J23242m5047j37757j9737K54435M960J44001J22920N1958R3970l82330
12542A00887j09349K5075p5635j87638j57377J53964J04728k77042J59140J09731
12532a53516k23504l8592J07558k6758M0368R6047O7229j12785J22430J32625
12522A1102K1730O9038j7900n9368J66426J35134k6928R6797J26463j61653j00910
12511B59931j36748n0517r3869J47780o0235j80251R6301j18638k0084J53566
12501b764O3309O376j94525n0255J12321J76596p680l13000N7857L4610R0469
12490b6686J22993K59490J59336K13225J54350k66653q2091J42033o4720k48675
$$ plain form
12480 362602 252887 27745 27864 95542 182765 461389 650192 280660 -98184 19889
12470 19889 234365 198907 317404 84220 121890 40667 113045 -2940 -412766 -443220 -202229
12459 -202229 154920 459026 360506 39659 -56642 96523 -62221 -67864 49275 -51970
12449 -51970 -356338 -472695 -281960 20082 41633 -19414 -95120 -217531 -51543 167980
12439 167980 16217 -185299 -23159 -56815 -103418 -168040 -125145 -89409 -141687 -135850 -98112
12428 -98112 -259819 -307390 -245452 -200277 -167032 5777 74956 9947 168795 116980 139234
12417 139234 138248 132686 138890 50442 -145272 -3727 48558 -218029 -509178 -694778 -547057
12406 -547057 -249613 -24571 86671 61945 -8212 140006 354518 238872 -147592 -201589
$$ packed form
12480C62602j09715k25142J19O7678Q7223K78624J88803l69532l78844J18073
12470A9889K14476l5458J18497k33184L7670q1223P2378j15985m09826l0454K40991
12459b02229L57149L04106r8520l20847r6301J53165j58744n643J17139j01245
12449e1970l04368j16357J90735L02042K1551o1047p5706j22411J65988K19523
12439A67980j51763k01516J62140l3656m6603o4622M2895L5736n2278N837L7738
12428i8112j61707m7571O1938M5175L3245J72809O9179o5009J58848n1815K2254
12417A39234r86n562O204q8448j95714J41545N2285k66587k91149j85600J47721
12406e47057K97444K25042J11242k4726p0157J48218K14512j15646l86464n3997
$$ plain form
12396 -201589 -151976 -153533 -55796 -198609 -102059 260234 153476 213266 60252 116647 -43083
12385 -43083 -342330 -288852 -223252 -241631 -280253 -71628 111861 232314 395944 382401 184667
12374 184667 -17118 84358 180663 10206 -591169 -602977 -368791 -249916 -296978 -348313
12364 -348313 -57475 161595 168236 141358 -195856 -159849 22651 11512 6248 -230437 -42334
12353 -42334 199915 35010 -67796 92005 252750 414844 633460 397715 218946 396543
12343 396543 393055 470305 518161 418698 93590 -89331 -199544 -212420 -8408 134885 -5375
12332 -5375 -13594 195832 229171 259825 457962 359848 89474 178394 63690 -61749 50877
12321 50877 451536 637247 345761 215314 229134 165930 16270 -40604 41177 206900
$$ packed form
12396b01589M9613j557R7737j42813R6550L62293j06758N9790j53014N6395j59730
12385d3083k99247N3478O5600j8379l8622K08625J83489J20453J63630j3543j97734
12374A84667k01785J01476R6305j70457o01375j1808K34186J18875m7062n1335
12364c48313K90838K19070O641k6878l37214L6007J82500j1139n264k36685J88103
12353d2334K42249j64905j02806J59801J60745J62094K18616k35745j78769J77597
12343C96543l488P7250M7856r9463l25108j82921j10213j2876K04012J43293j40260
12332e375q219K09426L3339L0654J98137r8114k70374Q8920j14704j25439J12626
12321E0877M00659J85711k91486j30447J3820o3204j49660n6874Q1781J65723
$$ plain form
12311 206900 33981 -99805 974 -35786 -51006 22062 -33361 84981 248195 73391
12301 73391 -231230 -144994 -224115 -157459 -27578 164596 101060 -240983 -366558 -430183 -495224
12290 -495224 -468497 -265638 -203767 157659 168244 -27461 -261680 -205458 -63313 98174
12280 98174 171985 -24618 -161103 -184311 31530 296776 340796 302523 172574 165039 185627
12269 185627 -35309 -56868 252530 96690 -296903 -527130 -410245 -471735 -418836 -138823
12259 -138823 73785 262760 269810 175309 449260 522241 510007 681752 671882 547537 521295
12248 521295 393244 449144 558079 406365 284235 413372 379177 296478 234895 6776
12238 6776 -18568 14788 -44324 83759 159894 83657 -47953 79117 107126 29656 -119615
$$ packed form
12311B06900j72919j33786J00779l6760j5220P3068n5423J18342J63214j74804
12301G3391l04621Q6236p9121O6656J29881J92174o3536l42043j25575o3625o5041
12290d95224K6727K02859O1871L61426J0585j95705k34219N6222J42145J61487
12280I8174P3811j96603j36485k3208K15841K65246M4020l8273j29949p535K0588
12269A85627k20936k1559L09398j55840l93593k30227J16885o1490N2899K80013
12259a38823K12608J88975P050r4501K73951P2981j2234J71745r870j24345k6242
12248E21295j28051N5900J08935j51714j22130J29137l4195q2699o1583k28119
12238F776k5344L3356n9112J28083P6135p6237j31610J27070K8009p7470j49271
$$ plain form
12227 -119615 -46627 278603 384046 216483 -59946 -269470 -151136 117789 378467 297513
12217 297513 61916 8993 80092 55476 -87066 -225081 96278 158293 310455 650272
12207 650272 749155 550586 489376 244222 156071 300593 180846 175332 258501 117557 -9682
12196 -9682 84047 -81942 -232390 -251157 -163798 51260 157667 81573 -181549 -201231 -77041
12185 -77041 139365 382502 451992 402702 358417 397563 436836 375610 289179 228390 -46613
12174 -46613 28903 14835 84194 110339 -22199 -157119 -20770 -53770 -42422 -12791 345996
12163 345996 466527 441859 459261 358173 97723 128967 167834 224458 215200 25146 220724
12152 220724 209234 140308 249446 117121 -82751 104327 230725 60894 -25815 3464
$$ packed form
12227a19615P2988L25230J05443j67563k76429k09524J18334K68925K60678q0954
12217B97513k35597n2923P1099k4616j42542j38015L21359O2015J52162L39817
12207F50272R8883j98569o1210k45154q8151J44522j19747n514Q3169j40944j27239
12196i682R3729j65989j50448j8767Q7359K15058J06407p6094k63122j9682J24190
12185g7041K16406K43137O9490m9290m4285L9146L9273o1226q6431o0789k75003
12174d6613P5516j4068O9359K6145j32538j34920J36349l3000J1348K9631L58787
12163C45996J20531k4668J7402j01088k60450L1244L8867N6624r258j90054J95578
12152B20724j1490o8926J09138j32325j99872J87078J26398j69831q6709K9279
$$ plain form
12142 3464 301079 485699 479311 554511 504936 208262 123518 -29951 -92544 -40752 5592
12131 5592 -82232 -74124 -117056 303430 559491 488737 345416 177128 -39665 -212424 -25602
12120 -25602 103045 181485 96122 -100192 2163 -22347 49280 58964 264652 523906 284090
12109 284090 333080 443877 125812 -11017 -32099 -179231 -332033 -159531 125976 137167
12099 137167 14884 -78274 -38453 187925 302711 324601 311286 476942 462366 149871
12089 149871 15482 31107 186255 333440 239196 200236 234991 565553 733098 414976
12079 414976 73618 -119509 -127305 -39388 -27825 29334 -74963 -171506 -114154 -72421 51636
12068 51636 254629 237950 155916 314278 583788 443060 116906 52993 -1345 65638 320198
$$ packed form
12142C464K97615J84620o388P5200m9575k96674q4744j53469o2593N1792M6344
12131E592q7824Q108m2932M20486K56061p0754j43321j68288k16793j72759J86822
12120b5602J28647P8440q5363j96314J02355k4510P1627R684K05688K59254k39816
12109B84090M8990J10797l18065j36829k1082j47132j52802J72502K85507J1191
12099A37167j22283r3158L9821K26378J14786K1890j3315J65656j4576l12495
12089A49871j34389J5625J55148J47185r4244l8960L4755L30562J67545l18122
12079D14976l41358j93127p796Q7917J1563N7159j04297r6543N7352M1733J24057
12068E1636K02993j6679q2034J58362K69510j40728l26154o3913n4338O6983K54560
$$ plain form
12057 320198 567753 735283 917814 1019406 916413 702561 801082 1045015 945453 1013401
12047 1013401 950303 873366 1021032 1094601 1159004 1225039 1220697 1272684 1287752 1190224 1211602
12036 1211602 1268628 1390186 1260296 1043976 1031403 986200 936468 874088 984010 1079287
12026 1079287 1232637 1125298 1123097 1051979 877889 1032062 1120546 1014291 1157823 1177018
12016 1177018 824588 657798 600491 559563 190241 361994 412333 505429 721875 904265
12006 904265 1092409 828716 645100 649852 601338 764018 824068 801083 644833 895785
11996 895785 952634 976086 918109 725523 765327 805192 927929 994002 918463 826447 928061
11985 928061 937423 826987 1067008 1177211 994917 900141 1025859 1158608 1249594 1187745
$$ packed form
12057C20198K47555J67530J82531J01592j02993k13852R8521K43933r9562O7948
12047A013401o3098p6937J47666P3569O4403O6035m342N1987J5068r7528K1378
12036A211602N7026J21558j29890k16320j2573m5203m9732o2380J09922R5277
12026A079287J53350j07339k201p1118j74090J54173Q8484j06255J43532J9195
12016A177018l52430j66790n7307m0928l69322J71753N0339R3096K16446J82390
12006I04265J88144k63693j83616M752m8514J62680O0050k2985j56250K50952
11996H95785N6849K3452n7977j92586L9804L9865J22737O6073p5539r2016J01614
11985I28061R362j10436K40021J10203j82294r4776J25718J32749R0986o1849
$$ plain form
11975 1187745 1229873 1243187 1079094 1077124 1125985 1164260 1245599 1248733 1520150 1669985 1816542
11964 1816542 1949359 2056865 1970871 1932332 1839503 1824785 2159522 2249005 2378378 2327891
11954 2327891 2432283 2765999 2820730 3002075 3025992 3121205 3332327 3930421 4470499 4790905
11944 4790905 4999734 5845590 6660824 7250660 8206579 9251533 10257556 11518140 12973852
11935 12973852 14894344 17555371 20417775 24394326 29747840 37108365 47834343 64236249
11927 64236249 88824334 126129150 176969599 229259012 266394171 293101384 317296393
11920 317296393 322552113 280222940 211301546 153563193 114932967 90072859 73678795
11913 73678795 62299772 54076774 47758186 42672320 38482540 35300345 32609697 30594719
$$ packed form
11975A187745M2128J3314j64093j970M8861L8275Q1339L134K71417J49835J46557
11964A816542J32817J07506q5994l8539r2829j4718L34737Q9483J29373n0487
11954B327891J04392L33716N4731J81345K3917R5213K11122N98094N40078L20406
11944D790905K08829Q45856Q15234N89836R55919J044954J006023J260584J455712
11935A2973852J920492K661027K862404L976551N353514P360525J0725978J6401906
11927F4236249K4588085L7304816N0840449N2289413L7135159K6707213K4195009
11920C17296393N255720m2329173o8921394n7738353l8630226k4860108j6394064
11913G3678795j1379023q222998o318588n085866m189780l182195k690648k014978
$$ plain form
11905 30594719 28771349 27157899 25576627 24445971 23833743 23192254 22610052 21862630 20938196
11896 20938196 20229152 19627259 19064119 18678707 18448081 18355739 18254781 18187680 18055452 18273848
11886 18273848 18397111 18167558 18201484 17891795 17349477 16408074 15592093 14939185 14354980
11877 14354980 13491254 12928558 12138897 11667636 11250926 10675527 10071308 9591562 9067958
11868 9067958 8626516 8749392 8726242 8507236 8191689 7998998 7785212 7562185 7546410 7361862
11858 7361862 7129127 6816880 6425094 6302250 6051261 5730126 5778669 5613355 5606938 5627877
11848 5627877 5440302 5310389 5193224 4851414 4658980 4705326 4476450 4348594 4207321 3909021
11838 3909021 4008275 4043694 4231190 4252493 4156839 3990393 3782601 3603114 3474656 3531095
$$ packed form
11905C0594719j823370j613450j581272j130656o12228o41489n82202p47422r24434
11896B0938196p09044o01893n63140l85412k30626r2342j00958o7101j32228K18396
11886A8273848J23263k29553L3926l09689n42318r41403q15981o52908n84205
11877A4354980q63726n62696p89661m71261m16710n75399o04219m79746n23604
11868I067958m41442J22876k3150k19006l15547j92691k13786k23027j5775j84548
11858G361862k32735l12247l91786j22844k50989l21135M8543j65314o417K0939
11848E627877j87575j29913j17165l41810j92434M6346k28876j27856j41273k98300
11838C909021R9254L5419J87496K1303r5654j66446k07792j79487j28458N6439
$$ plain form
11828 3531095 3490352 3538198 3547318 3457527 3263837 3050909 2956917 2856432 2865014 2635588 2311740
11817 2311740 2227957 2379497 2502901 2916897 3152648 2968635 2805713 2723475 2879696 2856395
11807 2856395 2938056 3191533 3457387 3561950 3414471 3264141 3134691 2919773 2725144 2643814
11797 2643814 2771055 2766440 2651500 2845730 3135218 2797431 2483744 2481454 2415833 2529296
11787 2529296 2544281 2475445 2208040 2084447 2005361 1899672 1890249 1978515 2015483 2197270 2124131
11776 2124131 1882910 1592650 1599927 1861692 2028813 1925770 1744628 1746392 1852890 2006661
11766 2006661 1919209 1801958 1412448 1286932 1504011 1351889 1438982 1694157 1647729 1415676
11756 1415676 1529453 1654341 1612873 1394906 1278909 1407655 1593791 1509779 1181099 1168205
$$ packed form
11828C531095m0743M7846R120q9791j93690k12928r3992j00485Q582k29426l23848
11817B311740q3783J51540J23404M13996K35751j84013j62922q2238J56221k3301
11807B856395Q1661K53477K65854J04563j47479j50330j29450k14918j94629q1330
11797B643814J27241m615j14940J94230K89488l37787l13687k290o5621J13463
11787B529296J4985o8836k67405j23593p9086j05689r423Q8266L6968J81787p3139
11776B124131k41221k90260P277K61765J67121j03043j81142J764J06498J53771
11766B006661q7452j17251l89510j25516K17079j52122Q7093K55175m6428k32053
11756A415676J13777J24888m1468k17967j15997J28746J86136q4012l28680j2894
$$ plain form
11746 1168205 1242281 1254921 1123299 1048372 983507 1029463 878987 739145 805399 836675 762289
11735 762289 614597 671106 707690 774111 1011499 952905 954197 1070418 1124783 1159736 917137
11724 917137 805744 713570 764807 718876 581579 526337 723254 769814 730348 566640 581261
11713 581261 737003 829298 986847 1026726 944012 800786 815455 833272 714469 406302
11703 406302 253591 181063 346594 317166 505985 604883 507490 787282 1065233 1108350
11693 1108350 906423 554401 611164 567557 449801 354632 336807 329003 412960 547638 476563
11682 476563 384276 177470 437908 600946 375900 49207 46265 51144 146519 337222 442962
11671 442962 481120 350529 279829 399406 564505 427928 506405 443933 282768 100934
$$ packed form
11746A168205P4076J2640j31622p4927o4865M5956j50476j39842O6254L1276p4386
11735G62289j47692N6509L6584O6421K37388n8594J292J16221N4365L4953k42599
11724I17137j11393r2174N1237m5931j37297n5242J96917M6560l9466j63708J4621
11713E81261J55742R2295J57549L9879q2714j43226J4669J7817j18803l08167
11703D06302j52711p2528J65531k9428J88819R8898r7393K79792K77951M3117
11693A108350k01927l52022N6763m3607j17756r5169j7825p804Q3957J34678p1075
11682D76563r2287k06806K60438J63038k25046l26693k942M879R5375J90703J05740
11671D42962L8158j30591p0700J19577J65099j36577P8477o2472j61165j81834
$$ plain form
11661 100934 7867 43593 140338 19554 -147870 -113951 25016 -13663 -37526 -124559 38670
11650 38670 100398 128455 182956 243997 343546 488884 678039 605696 456957 103533 -169229
11639 -169229 -77577 -40989 46109 143449 -46660 -30504 -24010 146940 223417 246838 162800
11628 162800 243707 246970 31306 382044 433631 169652 284059 227495 265151 42319 43580
11617 43580 248599 120190 -75173 151675 379273 370559 -75288 -437874 -287891 -230781
11607 -230781 -134012 -27034 19313 -87761 -266699 -139617 -9456 -57037 -119433 -155056
11597 -155056 -295540 -197481 -24586 87137 222284 94921 55688 102429 252379 138886
11587 138886 98631 78243 122969 176002 184949 -88407 -117765 -121954 -145688 -249956 -209420
$$ packed form
11661A00934r3067L5726R6745j20784j67424L3919J38967l8679k3863q7033J63229
11650C8670O1728K8057N4501O1041R9549J45338J89155p2343j48739l53424k72762
11639a69229R1652L6588Q7098R7340j90109J6156O494J70950P6477K3421q4038
11628A62800Q0907L263k15664L50738N1587k63979J14407n6564L7656k22832J261
11617D3580K05019j28409j95363K26848K27598q714m45847l62586J49983N7110
11607b30781R6769J06978M6347j07074j78938J27082J30161m7581o2396l5623
11597a55056j40484R8059J72895J11723J35147j27363l9233M6741J49950j13493
11587A38886m0255k0388M4726N3033Q947k73356k9358m189k3734j04268M0536
$$ plain form
11576 -209420 -56318 68077 9621 121198 489399 561475 488889 205138 -204091 -367855
11566 -367855 -151175 -72759 -139808 -213683 -180259 43758 91202 -22909 -251925 -343939 -282338
11555 -282338 -124808 39472 211374 358805 161092 -186931 -76273 129405 116437 -259144
11545 -259144 -456699 -692276 -465222 -131481 167292 229730 134013 -107402 -378979 -433931
11535 -433931 -186525 -120902 -216646 -105305 -90195 -210560 -147650 -152089 -37994 -159421 -179477
11524 -179477 -37210 17008 149572 175737 63265 20124 306678 482282 414247 252844
11514 252844 271369 134294 -195950 -63757 -71330 -136456 -11955 103111 48129 138729 219482
11503 219482 123397 90834 32092 54079 24600 -56061 -163652 -219227 -288651 -118865 -42726
$$ packed form
11576b09420J53102J24395n8456J11577L68201P2076p2586k83751m09229j63764
11566c67855K16680P8416o7049p3875L3424K24017M7444j14111k29016r2014O1601
11555b82338J57530J64280J71902J47431j97713l48023J10658K05678j2968l75581
11545b59144j97555k35577K27054L33741K98773O2438r5717k41415k71577n4952
11535d33931K47406O5623r5744J11341J5110j20365O2910m439J14095j21427k0056
11524a79477J42267N4218J32564K6165j12472m3141K86554J75604o8035j61403
11514B52844J8525j37075l30244J32193p573o5126J24501J15066n4982R0600Q0753
11503B19482r6085l2563n8742K1987k9479q0661j07591n5575o9424J69786P6139
$$ plain form
11492 -42726 46041 95284 68315 37063 -37917 -112622 -41826 -34111 -225279 -170175 -11142
11481 -11142 52112 62729 -133671 -270356 -119528 23441 302237 245156 122336 170327
11471 170327 -28810 -45510 43111 197653 319468 302346 362096 430049 418302 348378 152496
11460 152496 138560 98253 79865 121364 -11335 -326948 -254412 -280418 -448314 -324439 -112776
11449 -112776 -104969 -99445 -95874 -22910 3326 -140495 -177080 -58029 -111181 -135433 -56626 -292494
11437 -292494 -192666 -150703 -150624 -238934 -251303 -413026 -258691 -117510 -90603 -221263 -181126
11426 -181126 338377 670895 415542 -47465 -294586 -411226 -561919 -235033 13872 97973
11416 97973 37582 103387 229194 412212 372342 462062 329445 78727 -9671 -166592 -268800
$$ packed form
11492d2726Q8767M9243k6969l1252p4980p4705P0796P715j91168N5104J59033
11481a1142O3254J0617j96400j36685J50828J42969K78796n7081j22820M7991
11471A70327j99137j6700Q8621J54542J21815j7122N9750O7953j1747o9924j95882
11460A52496j3936m0307j8388M1499j32699l15613P2536k6006j67896J23875K11663
11449a12776P807N524L571P2964K6236j43821l6585J19051n3152k4252P8807k35868
11437b92494R9828M1963P9q8310j2369j61723J54335J41181K6907j30660M0137
11426a81126N19503L32518k55353m63007k47121j16640j50693L26886K48905Q4101
11416I7973o0391O5805J25807J83018l9870Q9720j32617k50718q8398j56921j02208
$$ plain form
11405 -268800 -478274 -276315 -45945 149177 260926 -68952 -522243 -628720 -641426 -425957
11395 -425957 -261464 -119836 3153 78982 120288 112572 126458 -221676 -286078 -253127 61179
11384 61179 86808 4222 100294 101632 122929 230278 358421 258035 111767 200312 136916
11373 136916 97956 -6030 59904 -206116 -275681 79972 105490 -83596 -174663 -102261 -77296
11362 -77296 -201411 -168806 -145513 -196201 49820 308592 337624 322258 228497 -66147 -19095
11351 -19095 -44408 -135433 -38315 153896 308634 544898 722738 681089 481225 75285
11341 75285 -347491 -296434 -186395 -125293 40836 236844 206014 147413 60596 -100701 20348
11330 20348 437817 375903 297922 239239 16303 -213471 -81030 -167308 -245460 -141196 -234550
$$ packed form
11405b68800k09474K01959K30370J95122J11749l29878m53291j06477j2706K15469
11395d25957J64493J41628J22989P5829M1306p716J3886l48134o4402L2951L14306
11384F1179K5629q2586R6072J338K1297J07349J28143j00386j46268Q8545o3396
11373A36916l8960j03986O5934k66020o9565L55653K5518j89086r1067P2402K4965
11362g7296j24115L2605K3293n0688K46021K58772K9032j5366r3761k94644M7052
11351a9095k5313r1025R7118J92211J54738K36264J77840m1649j99864m05940
11341G5285m22776N1057J10039O1102J66129J96008l0830n8601q6817j61297J21049
11330B0348M17469o1914p7981n8683k22936k29774J32441q6278p8152J04264r3354
$$ plain form
11319 -234550 -95182 93904 54585 118669 28918 117386 268042 557501 565628 257340 207503
11308 207503 46500 -101187 -131065 -151980 -239974 -151617 -40709 94986 -122088 -164254
11298 -164254 -76433 255186 289910 94608 -63942 -64476 -201783 -218821 -18537 217796 22670
11287 22670 -24323 -10771 76085 408357 578572 233408 157882 270693 500131 504635 639892
11276 639892 586254 10519 -176004 141029 317897 336230 79586 -139968 -107201 -17871
11266 -17871 252853 383959 152230 -25686 -200549 -305224 -272857 -232514 -93065 191225
11256 191225 255911 211324 57010 127963 349250 373235 253135 97758 134052 379258
11246 379258 671672 623969 466029 439976 417414 219526 30279 81002 320849 450140
$$ packed form
11319b34550J39368J89086l9319O4084q9751Q8468J50656K89459Q127l08288m9837
11308B07503j61003j47687k9878k0915q7994Q8357J10908J35695k17074m2166
11298a64254Q7821L31619L4724j95302j58550n34j37307j7038K00284K36333j95126
11287B2670m6993J3552Q6856L32272J70215l45164p5526J12811K29438M504J35257
11276F39892n3638n75735j86523L17033J76868J8333k56644k19554L2767Q9330
11266a7871K70724J31106k31729j77916j74863j04675L2367M0343J39449K84290
11256A91225O4686m4587j54314P0953K21287K3985j20100j55377L6294K45206
11246C79258K92414m7703j57940k6053k2562j97888j89247N0723K39847J29291
$$ plain form
11236 450140 370978 250580 -121127 -424711 -370827 -189366 -155842 -50124 -43736 40489 39782
11225 39782 -58680 -126857 -199540 -314471 -239147 -22224 -126572 -246556 -233102 -254374 -341129
11214 -341129 -304870 -149925 179746 302476 146199 212704 69094 34578 47618 -164391
11204 -164391 -216114 -196973 -206269 -102013 69201 -153844 -299189 -302914 -291891 -360601 -111898
11193 -111898 -76806 -278823 -320995 -275239 -165160 17670 -130710 -253813 -216367 148198
11183 148198 286334 210587 230876 164763 205343 208125 63550 72344 7469 93196 249213
11172 249213 156083 101360 -64362 -163893 -179995 142131 371172 297808 170592 150680 25864
11161 25864 -17509 -242745 -385421 -264755 -190415 -175946 -806 -53704 61980 222730
$$ packed form
11236D50140p9162j20398l71707l03584N3884J81461L3524J05718O388Q4225p07
11225C9782r8462o8177p2683j14931P5324K16923j04348j19984J3454k1272q6755
11214c41129L6259J54945L29671J22730j56277O6505j43610l4516J3040k12009
11204a64391n1723J9141r296J04256J71214k23045j45345l725J1023o8710K48703
11193a11898L5092k02017m2172M5756J10079J82830j48380j23103L7446L64565
11183A48198J38136p5747K0289o6113M0580K782j44575Q794o4875Q5727J56017
11172B49213r3130n4723j65722r9531j6102L22126K29041p3364j27216j9912j24816
11161B5864m3373k25236j42676J20666P4340J4469J75140n2898J15684J60750
$$ plain form
11151 222730 351134 373372 201961 -87266 19360 -14653 7037 24345 -114816 -137761
11141 -137761 -50762 5431 -3356 -129019 -128079 122479 242948 -92456 -124422 -48419 78314
11130 78314 258006 393574 546823 686620 465680 399180 387074 233315 134282 173113
11120 173113 460322 261710 266605 118909 54398 -23981 -51551 -103360 -176527 -347833 -287176
11109 -287176 34524 245506 96463 156548 260540 392008 358411 379670 282386 343391
11099 343391 354514 189013 205953 58736 -143920 -206310 -9424 117751 138100 324113
11089 324113 412075 233322 -82338 131566 75381 -16563 225793 359221 313904 253090
11079 253090 272243 201918 2223 33852 23332 190705 171282 127396 150507 68072 -20091
$$ packed form
11151B22730J28404K2238j71411k89227J06626l4013K1690J7308j39161k2945
11141a37761Q6999N6193q787j25663R40K50558J20469l35404l1966P6003J26733
11130G8314J79692J35568J53249J39797k20940o6500j2106j53759r9033L8831
11120A73113K87209j98612M895j47696o4511p8379k7570n1809p3167j71306O0657
11109b87176L21700K10982j49043O0085J03992J31468l3597K1259r7284O1005
11099C43391J1123j65501J6940j47217k02656o2390J96886J27175K0349J86013
11089C24113Q7962j78753l15660K13904n6185r1944K42356J33428m5317o0814
11079B53090J9153p0325j99695L1629j0520J67373j9423m3886K3111q2435q8163
$$ plain form
11068 -20091 -368781 -313063 -34736 118504 8596 52965 453566 256279 -84021 -193763
11058 -193763 -379546 -285672 -190593 41677 174980 408423 650056 519479 314234 239121
11048 239121 82524 99815 -92239 221104 715583 857289 714454 583858 446825 620809
11038 620809 937430 903010 916474 793653 856970 1184518 1285319 1200635 1266916 1431692
11028 1431692 1445996 1345108 1243415 1311255 1324422 1399775 1492901 1588516 1650802 1597776 1709404
11017 1709404 1513268 1247343 1191734 1355864 1244598 1416436 1308147 1270463 1201807 1374264
11007 1374264 1443066 1370497 1312389 1102359 994295 669831 673679 738064 854397 877843 873417
10996 873417 739881 884131 826226 669397 443178 489628 608853 648963 850138 692893
$$ packed form
11068b0091l48690N5718K78327J53240j09908M4369M00601j97287l40300j09742
11058a93763j85783R3874R5079K32270J33303K33443K41633j30577k05245p5113
11048B39121j56597J7291j92054L13343M94479J41706j42835j30596j37033J73984
11038F20809L16621l4420J3464j22821O3317L27548J00801q4684O6281J64776
11028A431692J4304j00888j01693O7840J3167P5353R3126R5615O2286n3026J11628
11017A709404j96136k65925n5609J64130j11266J71838j08289l7684o8656J72457
11007A374264O8802p2569n8108k10030j08064l24464L848O4385J16333K3446m426
10996H73417j33536J44250n7905j56829k26219M6450J19225M0110K01175j57245
$$ plain form
10986 692893 377695 315729 104518 96800 42576 74636 95600 23238 -87566 -228414 78720
10975 78720 443262 713393 857544 766668 371048 117016 181292 216404 -135195 -279145
10965 -279145 -241110 -280550 -289282 -71118 403697 495013 429473 411472 237957 97102 72030
10954 72030 -1330 121583 380810 406660 191205 -55966 23953 248586 226032 340624
10944 340624 535023 856141 753548 394208 39983 23718 155074 221624 230172 262557
10934 262557 462458 715638 1015131 1101269 930719 1109545 1090080 740081 702741 621301
10924 621301 691321 781306 519494 209720 567143 1034144 1099939 796493 570649 446134
10914 446134 263804 126021 90123 34033 65277 302916 400297 351006 569346 651456 794046
$$ packed form
10986F92893l15198o1966k11211p718n4224L2060K0964p2362j10804j40848L07134
10975G8720L64542K70131J44151r0876l95620k54032O4276L5112l51599j43950
10965b79145L8035l9440q732K18164M74815R1316o5540j8001j73515j40855k5072
10954G2030p3360J22913K59227K5850k15455k47171P9919K24633k2554J14592
10944C40624J94399L21118j02593l59340l54225j6265J31356O6550Q548L2385
10934B62557J99901K53180K99493Q6138j70550J78826j9465l49999l7340q1440
10924F21301P0020Q9985k61812l09774L57423M67001O5795l03446k25844j24515
10914D46134j82330j37783l5898n6090L1244K37639R7381m9291K18340Q2110J42590
$$ plain form
10903 794046 753073 398249 212219 163158 325634 455225 490541 557411 377276 424628
10893 424628 630846 690085 611140 391674 406278 489043 368331 558604 447177 470359
10883 470359 422619 377377 374442 490102 262658 79407 74699 58268 5979 -2977 311957
10872 311957 306812 280659 314500 359816 238552 109552 217369 229006 460795 518560 304635
10861 304635 122600 -26542 111376 158978 231440 407580 475562 588311 766393 667964
10851 667964 174549 26565 -7817 157472 464846 648482 651836 453810 304114 505945
10841 505945 560058 749033 568289 504499 443486 519394 594130 307031 264645 487603 419018
10830 419018 492447 430549 404390 433266 657627 714738 571621 229605 120092 -17100
$$ packed form
10903G94046m0973l54824j86030m9061J62476J29591L5316O6870j80135M7352
10893D24628K06218N9239p8945k19466J4604Q2765j20712J90273j11427K3182
10883D70359m7740m5242k935J15660k27444j83251m708j6431n2289q956L14934
10872C11957n145k6153L3841M5316j21264j29000J07817J1637K31789N7765k13925
10861C04635j82035j49142J37918M7602P2462J76140O7982J12749J78082r8429
10851F67964m93415j47984l4382J65289L07374J83636L354j98026j49696K01831
10841E05945N4113J88975j80744o3790o1013P5908P4736k87099m2386K22958o8585
10830D19018P3429o1898k6159K8876K24361N7111j43117l42016j09513j37192
$$ plain form
10820 -17100 57274 204511 77441 88763 169655 386056 352751 84345 162742 155194 242483
10809 242483 283746 224400 95084 66870 94143 254087 552883 658366 452179 370163
10799 370163 251177 361313 385164 540173 476717 243656 154228 254966 223678 30080
10789 30080 207381 310211 638055 847933 778927 591524 463277 468743 473096 372457 396065
10778 396065 464551 470767 630288 684386 735184 693005 493153 432871 558016 683534 679045
10767 679045 614682 600736 592708 498310 613811 751050 815008 662931 613257 505129 515217
10756 515217 396640 370950 567652 800198 809035 839889 748084 563153 495204 728729 816747
10745 816747 751084 959394 1003523 1086635 1048363 834660 965607 1078261 1087947 1155008 1138778
$$ packed form
10820a7100P4374J47237j27070J1322Q0892K16401l3305k68406P8397p548Q7289
10809B42483M1263n9346j29316k8214K7273J59944K98796J05483k06187q2016
10799C70163j18986J10136K3851J55009o3456k33061q9428J00738l1288j93598
10789C0080J77301J02830L27844K09878o9006j87403j28247N466M353j00639K3608
10778C96065O8486O216J59521N4098N0798m2179j99852o0282J25145J25518m489
10767F79045o4363j3946q028r4398J15501J37239O3958j52077m9674j08128J0088
10756E15217j18577k5690J96702K32546Q837L0854r1805j84931o7949K33525Q8018
10745H16747o5663K08310M4129Q3112l8272k13703J30947J12654R686O7061j6230
$$ plain form
10734 1138778 1274855 1031997 1099836 1394302 1740503 1674841 1534404 1589947 1851672 1789061
10724 1789061 1724821 1833880 1924922 2090611 2335326 2148003 2039529 2066101 2394840 2343733
10714 2343733 2066551 1754208 1790321 1922567 2163022 2287336 2417574 2373221 2416784 2545322
10704 2545322 2595323 2899279 2987742 2937225 2785674 2520942 2329722 2431510 2492141 2534662
10694 2534662 2412205 2421681 2591488 2770628 2300719 1999795 1887566 1925708 2097298 2173897
10684 2173897 2112192 2151246 2084107 2172389 2111105 1942723 1838280 1670162 1693503 1787799 1855036
10673 1855036 1888192 1625541 1661403 1841045 1910225 2086486 2415962 2422542 2529131 2486032
10663 2486032 2456020 2609475 2865172 2901978 2540744 2392420 2437784 2678255 2934554 3164188
$$ packed form
10734A138778J36077k42858O7839K94466L46201o5662j40437N5543K61725o2611
10724A789061o4240J09059R1042J65689K44715j87323j08474K6572L28739n1107
10714B343733k77182l12343L6113J32246K40455J24314J30238m4353M3563J28538
10704B545322N0001L03956Q8463n0517j51551k64732j91220J01788O0631M2521
10694B534662j22457R476J69807J79140m69909l00924j12229L8142J71590P6599
10684B173897o1705L9054o7139Q8282o1284j68382j04443j68118K3341R4296O7237
10673A855036L3156k62651L5862J79642O9180J76261L29476O580J06589m3099
10663B486032l0012J53455K55697L6806l61234j48324M5364K40471K56299K29634
$$ plain form
10653 3164188 3498707 3976425 4494056 4448174 4207600 4179966 4195484 4211605 4285248 4061105
10643 4061105 3966841 4058605 3980616 4111327 4251977 4319183 4714884 5387355 6153207 6809201
10633 6809201 7727737 8364692 8819983 9499317 10192043 10844632 11515662 12450032 13565445
10624 13565445 15301470 17840745 21253462 25807762 31592021 39109106 48825362 60154251
10616 60154251 72088183 83278507 93085116 100823575 105666044 107097207 106521552 107076681
10608 107076681 111232266 121265586 137165406 157071831 177860251 196630671 212241517
10601 212241517 223525806 226892226 220579634 209166305 200222428 198803565 207132625 225086189
10593 225086189 249330575 273931659 294254184 309052996 316112033 310425963 289617261
$$ packed form
10653C164188L34519M77718N17631m5882k40574k7634J5518J6121P3643k24143
10643D061105r4264R1764p7989J30711J40650O7206L95701O72471P65852O55994
10633F809201R18536O36955M55291O79334O92726O52589O71030R34370J115413
10624A3565445J736025K539275L412717M554300N784259P517085R716256J1328889
10616F0154251J1933932J1190324R806609P738459M842469J431163n75655N55129
10608A07076681M155585J0033320J5899820J9906425K0788420J8770420J5610846
10601B12241517J1284289L366420o312592j1413329q943877j418863Q329060J7953564
10593B25086189K4244386K4601084K0322525J4798812P059037n686070k0808702
$$ plain form
10586 289617261 261524243 236759337 221135394 215725223 219090145 227849670 237150866
10579 237150866 244163498 247183137 244600543 233377631 212961284 188814464 167422656
10572 167422656 152524758 144485186 141330860 140762061 140953282 139992837 137078301 131831990
10564 131831990 122809798 110548289 97129871 84937893 74740228 66783801 60845091
10557 60845091 56180803 52444720 49474273 47033610 44771341 42535116 40751114 39044948
10549 39044948 37704933 36271173 34793067 33688626 32720122 31588807 30601193 29770247
10541 29770247 28919286 28016098 27266092 26684173 25991302 25083528 24372076 23846165 23147179
10532 23147179 22509331 21886748 21210021 20664210 20347997 20000078 19535821 19204315 18882894
$$ packed form
10586B89617261k8093018k4764906j5623943n410171L364922Q759525R301196
10579B37150866P012632L019639k582594j1222912k0416347k4146820k1391808
10572A67422656j4897898q039572l154326n68799J91221r60445k914536n246311
10564A31831990r022192j2261509j3418418j2191978j0197665p956427n938710
10557F0845091m664288l736083k970447k440663k262269k236225j784002j706166
10549C9044948j340015j433760j478106j104441r68504j131315r87614q30946
10541B9770247q50961r03188p50006n81919o92871r07774p11452n25911o98986
10532B3147179o37848o22583o76727n45811l16213l47919m64257l31506l21421
$$ plain form
10523 18882894 18282489 17828943 17635949 17248615 16883519 16448811 15961956 15764337 15434078
10514 15434078 15165182 14773930 14381531 14060830 13712608 13267651 13121909 12948117 12691248
10505 12691248 12458214 12225636 12179502 12144347 12124513 12051900 11853159 11589296 11264987 10985038
10495 10985038 10884547 10750448 10511255 10004016 9661832 9683146 9731949 9876352 9781041 9509915
10485 9509915 9265701 9466050 9577328 9403241 9169459 8921663 8786961 8783076 8805792 8902390
10475 8902390 8908988 8880592 8788869 8792006 8595290 8305470 8120824 8025441 8020105 7736960 7696832
10464 7696832 7626399 7507263 7520548 7547339 7605785 7527732 7379993 7171566 7153617 7304736
10454 7304736 7165231 6981187 6885383 6857611 6821344 6569653 6227267 5891530 5821419 5770391
$$ packed form
10523A8882894o00405m53546j92994l87334l65096m34708m86855j97619l30259
10514A5434078k68896l91252l92399l20701l48222m44957j45742j73792k56869
10505A2691248k33034k32578m6134l5155j9834p2613j98741k63863l24309k79949
10495A0985038j00491j34099k39193n07239l42184K1314M8803J44403r5311k71126
10485I509915k44214K00349J11278j74087k33782k47796j34702l885K2716R6598
10475H902390O598k8396r1723L137j96716k89820j84646r5383n336k83145m0128
10464G696832p0433j19136J3285K6791N8446p8053j47739k08427j7949J51119
10454G304736j39505j84044r5804k7772l6267k51691l42386l35737p0111n1028
$$ plain form
10444 5770391 5637399 5406240 5193467 5118008 5010401 4952111 4893311 4998687 5203584 5148896
10434 5148896 4904830 4521876 4501574 4331496 4247626 4134390 3928230 3850260 3700319 3731180
10424 3731180 3619079 3425039 3488310 3375762 3277211 3184268 3392841 3704123 3701953 3410053
10414 3410053 3316417 3222990 3095125 2939078 2734931 2626371 2617893 2542792 2417232 2247190
10404 2247190 2285063 2106598 2090346 2049435 2103184 2190843 2125962 2159717 2354345 2411958 2422374
10393 2422374 2355750 2305249 2258449 2126102 1911655 1988429 2024296 1800563 2001591 1780193
10383 1780193 1666911 1884668 1922288 1825252 1761314 1734869 1743806 1765477 1954587 1752653 1680363
10372 1680363 1621977 1724926 1649526 1484150 1609137 1578287 1563144 1576087 1706858 1879188
$$ packed form
10444E770391j32992k31159k12773p5459j07607n8290n8800J05376K04897n4688
10434E148896k44066l82954k0302j70078q3870j13236k06160p7970j49941L0861
10424C731180j12101j94040O3271j12548r8551r2943K08573L11282k170k91900
10414C410053r3636r3427j27865j56047k04147j08560q478p5101j25560j70042
10404B247190L7873j78465j6252m0911N3749Q7659o4881L3755J94628N7613J0416
10393B422374o6624n0501m6800j32347k14447P6774L5867k23733K01028k21398
10383A780193j13282K17757L7620r7036o3938k6445Q937K1671J89110k01934p2290
10372A680363n8386J02949p5400j65376J24987l0850j5143J2943J30771J72330
$$ plain form
10362 1879188 1695334 1285557 1358278 1127604 969862 1197190 1193815 1219366 1267246 1207247
10352 1207247 1141974 1165736 1396977 1348449 1061764 1076901 1024965 979507 900313 925195 1052866
10341 1052866 1051604 1109170 1099593 1181785 1027174 770428 818295 948865 1104402 1167476 1049178
10330 1049178 1117137 911086 805149 761785 817985 977313 936017 706098 730745 864844
10320 864844 825925 634879 523025 769324 971941 882333 979520 739605 540137 533460
10310 533460 576399 805617 902859 844399 595228 537011 449296 392931 617100 903600 853317
10299 853317 791367 720307 576782 665933 591434 864676 1205173 1031597 791319 614208
10289 614208 681501 773492 913611 907285 861102 1133408 1639363 1741292 2167142 2619801
$$ packed form
10362A879188j83854m09777P2721k30674j57742K27328l375K5551M7880n9999
10352A207247o5273K3762K31241m8528k86685J5137n1936m5458p9194K4882J27671
10341A052866j262N7566r577Q2192j54611k56746M7867J30570J55537O3074j18298
10330A049178O7959k06051j05937m3364N6200J59328m1296k29919K4647J34099
10320H64844l8919j91046j11854K46299K02617q9608R7187k39915j99468o677
10310E33460M2939K29218R7242n8460k49171n8217q7715n6365K24169K86500n0283
10299H53317o1950p1060j43525Q9151p4499K73242L40497j73576k40278j77111
10289F14208O7293R1991J40119o326m6183K72306N05955J01929M25850M52659
$$ plain form
10279 2619801 2973144 3765136 4782480 6164456 7992919 10216984 12908473 15579723
10271 15579723 18220285 20679659 22626673 24097319 24526250 24120885 22972826 21447505
10263 21447505 19333862 16751486 14013582 11663936 9965859 8184394 6839202 5689898
10255 5689898 4887066 4428017 4205814 3968383 3645628 3595142 3492172 3221389 2977903 2999402
10245 2999402 2670296 2610166 2549506 2079817 1905095 1884773 1835738 1893022 1921504 1872664 1771414
10234 1771414 1621300 1584185 1915945 1873817 1834945 1933150 2045903 1885281 1344065 1115581
10224 1115581 1022084 1014568 1079757 1182212 909194 422253 719011 889441 772528 707176
10214 707176 832174 899388 1090722 952355 906633 911113 980075 1033322 982194 681343 728888
$$ packed form
10279B619801L53343P91992J017344J381976J828463K224065K691489K671250
10271A5579723K640562K459374J947014J470646M28931m05365j148059j525321
10263B1447505k113643k582376k737904k349646j698077j781465j345192j149304
10255E689898q02832m59049k22203k37431l22755n0486j02970k70783k43486K1499
10245B999402l29106o0130o0660m69689j74722k0322m9035N7284K8482m8840j01250
10234A771414j50114l7115L31760m2128l8872R8205J12753j60622n41216k28484
10224A115581r3497p516O5189J02455k73018m86941K96758J70430j16913o5352
10214G07176J24998O7214J91334j38367m5722M480O8962N3247n1128l00851M7545
$$ plain form
10203 728888 814085 830101 812951 736410 741632 630330 916099 966273 948684 1052255 899350
10192 899350 623885 428567 595944 709308 474913 345422 441847 589039 586681 704767
10182 704767 957179 938695 867951 772519 740108 771682 1115041 1300573 1208112 790439 884550
10171 884550 1093935 1335380 1326227 1327801 1414442 1558341 1594974 1568139 1542619 1579758 1388238
10160 1388238 1356442 1256786 1017932 1212231 1462008 1790692 2235788 2404690 2416808 2344054
10150 2344054 2002946 1553020 1400233 1452123 1363595 1094546 1369442 1506889 1671055 1898429
10140 1898429 1816785 1580669 1476350 1475712 1398868 1376779 1084895 1003708 1059814 1124995 1041268
10129 1041268 1068765 1125530 1255022 1283007 1262687 1040004 778099 624158 368989 255884
$$ packed form
10203G28888Q5197J6016j7150p6541N222j11302K85769N0174j7589J03571j52905
10192H99350k75465j95318J67377J13364k34395j29491R6425J47192k358J18086
10182G04767K52412j8484p0744r5432l2411L1574L43359J85532r2461m17673R4111
10171H84550K09385K41445r153J574Q6641J43899L6633k6835k5520L7139j91520
10160A388238l1796r9656k38854J94299K49777L28684M45096J68902J2118p2754
10150B344054l41108m49926j52787N1890q8528k69049K74896J37447J64166K27374
10140A898429q1644k36116j04319o38p6844k2089k91884q1187N6106O5181q3727
10129A041268K7497N6765J29492K7985k0320k22683k61905j53941k55169j13105
$$ plain form
10119 255884 191209 297451 308504 310993 299973 235265 269420 335260 102079 92210 130094
10108 130094 158700 95185 96750 147076 114 -161779 -131979 50805 71596 -124404 -97825
10097 -97825 40102 -5632 -24320 135998 103011 445116 365078 319002 210897 5567 -19941
10086 -19941 -158898 -135795 102162 5398 -60498 14426 -78424 22500 234702 182191 -186560
10075 -186560 -107736 140307 220066 380207 230851 3179 12819 17006 96942 32261 162807
10064 162807 183142 123103 324872 327399 174100 49548 -25888 61835 154843 296847 274024
10053 274024 33026 -41248 -11421 -165835 -96151 58903 -177883 -276870 -488199 -601425
10043 -601425 -295387 -7489 27363 -9367 111774 137931 -1385 -24958 -17609 -9208 93886
$$ packed form
10119B55884o4675J06242J1053K489j1020o4708L4155O5840k33181r869L7884
10108A30094K8606o3515J565N0326j46962j61893K9800J82784K0791j96000K6579
10097i7825J37927m5734j8688J60318l2987L42105q0038m6076j08105k05330k5508
10086a9941j38957K3103K37957r6764o5896P4924r2850J00924K12202n2511l68751
10075a86560P8824K48043P9759J60141j49356k27672R640M187P9936o4681J30546
10064A62807K0335o0039K01769K527j53299j24552p5436Q7723R3008J42004k2823
10053B74024k40998p4274K9827j54414O9684J55054k36786r8987k11329j13226
10043f01425L06038K87898L4852l6730J21141K6157j39316k3573P349Q401J03094
$$ plain form
10032 93886 230248 194530 156186 140380 206791 98656 201102 476970 253141 56975
10022 56975 -168531 -251500 -17663 114299 248730 286515 -42848 19915 133224 259336
10012 259336 138764 65932 -101747 -358578 -349243 17436 321545 291716 112651 -98252
10002 -98252 -341291 -305366 -129218 209745 117984 -274446 -289155 -279476 56881 183792 80122
9991 80122 94141 358753 475059 417797 412107 371734 -59702 -131977 168991 379844 13290
9980 13290 -262599 -239627 -221223 -233692 -232470 -108404 103247 265109 142644 22971 99152
9969 99152 121193 -81079 -123700 -127164 143895 332765 585293 618897 643029 656065 321998
9958 321998 111383 -145475 -269989 -137200 -164781 -106888 33098 -70220 99444 231518
$$ packed form
10032I3886J36362l5718l8344j5806O6411j08135J02446K75868k23829j96166
10022E6975k25506q2969K33837J31962J34431L7785l29363O2763J13309J26112
10012B59336j20572p2832j67679k56831R335L66679L04109k9829j79065k10903
10002i8252k43039L5925J76148L38963r1761l92430j4709R679L36357J26911j03670
9991H0122J4019K64612J16306n7262n690m0373m31436p2275L00968K10853l66554
9980A3290k75889K2972J8404j2469J222J24066K11651J61862j22465j19673P6181
9969I9152K2041k02272m2621l464K71059J88870K52528L3604K4132J3036l34067
9958C21998k10615k56858j24514J32789k7581N7893J39986j03318J69664J32074
$$ plain form
9948 231518 383968 240417 -138423 -395216 -69157 210261 251052 77356 24138 -54837
9938 -54837 97456 124962 64232 73989 43487 232628 391588 257387 499446 556473 666972
9927 666972 732086 607338 337445 -1319 -92736 -197568 -100091 126239 176582 123098 -818
9916 -818 261274 296186 154454 -60631 -340149 -418611 -192216 -141907 -133993 -215811 -206212 72651
9904 72651 96061 243327 247512 103370 214435 298636 126218 154689 -35559 -151239 -177641
9893 -177641 -232508 -537402 -567799 -386332 -113682 -155364 -194887 -86752 -16008 -53825 -7792
9882 -7792 44934 124686 -61808 -106878 -6438 -50485 287629 311415 129953 178331 122322
9871 122322 174113 205048 155212 280568 270084 -78338 -391931 -141442 -48896 -204719 -163666
$$ packed form
9948B31518J52450j43551l78840k56793L26059K79418M0791j73696n3218p8975
9938e4837J52293K7506o0730R757l0502J89141J58960j34201K42059N7027J10499
9927F66972O5114j24748k69893l38764r1417j04832R7477K26330N0343n3484j23916
9916h18K62092L4912j41732k15085k79518p8462K26395N0309P914q1818R599K78863
9904G2651K3410J47266M185j44142J11065Q4201j72418K8471j90248j15680k6402
9893a77641n4867l04894l0397J81467K72650m1682l9523J08135P0744l7817M6033
9882g792N2726P9752j86494m5070J00440m4047L38114K3786j81462M8378n6009
9871A22322N1791L0935m9836J25356j0484l48422l13593K50489R2546j55823M1053
$$ plain form
9860 -163666 -96925 -142165 -219552 -19491 -26056 160982 116550 -114894 -258019 -161160 46387
9849 46387 18591 -10300 244769 316953 241259 101256 111589 15840 -44325 -138752 -218740
9838 -218740 -351688 -338627 -7998 90453 148776 95994 -50001 -227489 -105768 -191817 -287352
9827 -287352 -230727 -186343 -284219 -252245 -248834 3781 199910 184855 203366 252939 144951
9816 144951 -19280 -194096 129433 323428 209589 -31597 -339405 -501626 -386950 -278501
9806 -278501 -195395 -166799 -315287 -247595 -94015 122656 135922 19390 -58145 -36140 114225
9795 114225 262600 336442 145534 32367 129545 136698 269559 179004 -23261 19592 16206
9784 16206 35087 157701 126626 222673 298881 130619 -59905 66548 152550 -166447 -178643
$$ packed form
9860a63666O6741m5240p7387K00061o565J87038m4432k31444j43125R6859K07547
9849D6387k7796k8891K55069P2184p5694j40003J0333r5749o0165r4427p9988
9838b18740j32948J3061L30629R8451N8323n2782j45995j77488J21721q6049r5535
9827b87352N6625M4384r7876L1974L411K52615J96129j5055J8511M9573j07988
9816A44951j64231j74816L23529J93995j13839k41186l07808j62221J14676J08449
9806b78501Q3106K8596j48488O7692J53580K16671J3266j16532p7535K2005J50365
9795A14225J48375P3842j90908j13167R7178P153J32861r0555k02265M2853l386
9784A6206J8881J22614l1075R6047P6208j68262j90524J26453Q6002l18997j2196
$$ plain form
9773 -178643 46157 -37433 -173363 -146445 -844 -101674 -78496 -82449 22339 -4624 23708
9762 23708 83503 169194 79133 -166915 -173801 -72412 -121159 -283567 -381595 -593263 -763852
9751 -763852 -644544 -405987 -163526 -59868 147667 281500 200027 219432 185354 159584
9741 159584 240215 285353 103577 96000 -96093 -270984 -134686 88537 103818 29517 83406
9730 83406 118749 171382 63676 -63987 -276677 -285689 -187570 -84806 30692 3870 81749
9719 81749 167575 134728 69224 57648 218293 112692 25300 -107438 -81870 15138 41519
9708 41519 42661 125208 431709 490294 446353 505945 354073 263019 323555 333356 434693 372538
9696 372538 322549 170785 32268 -110336 47954 294030 90161 -156565 -360131 -403584
$$ packed form
9773a78643K24800q3590j35930K6918J45601j00830K3178l953J04788k6963K8332
9762B3708N9795Q5691r0061k46048o886J01389m8747j62408r8028k11668j70589
9751g63852J19308K38557K42461J03658K07535J33833q1473J9405l4078k5770
9741A59584Q0631M5138j81776p577j92093j74891J36298K23223J5281p4301N3889
9730H3406L5343N2633j07706j27663k12690r012R8119J02764J15498k6822P7879
9719H1749Q5826l2847o5504j1576J60645j05601q7392j32738K5568R7008K6381
9708D1519J142Q2547L06501N8585m3941N9592j51872r1054O0536R801J01337o2155
9696C72538m9989j51764j38517j42604J58290K46076k03869k46726k03566m3453
$$ plain form
9686 -403584 -462627 -535086 -425212 -192548 64403 181863 156550 42743 -30061 150115
9676 150115 189447 366639 235276 109653 254399 153803 126307 96540 98840 207259 68301
9665 68301 57299 197625 93331 51345 67514 15583 -73368 -273801 -511322 -473027 -460971
9654 -460971 -406959 -407613 -395611 -378978 -294710 -320054 -225466 -297174 -446413 -459318 -230881 -103139
9642 -103139 -34233 48251 80864 22303 49207 54574 116429 -8301 -6432 -163281 -230297 -297167
9630 -297167 -255609 -34778 304291 296784 222041 65284 -155928 -192193 -23178 150629 -61394
9619 -61394 166634 290784 247381 289045 389052 467905 8895 -331533 -284672 -215747 -253862
9608 -253862 -46528 386005 420223 131235 60876 137010 287377 231719 -108514 -384685
$$ packed form
9686d03584n9043p2459J09874K32664K56951J17460k5313j13807p2804J80176
9676A50115L9332J77192j31363j25623J44746j00596k7496k9767K300J08419j38958
9665F8301j1002J40326j04294m1986J6169n1931q8951k00433k37521L8295J2056
9654d60971N4012o54J2002J6633Q4268k5344R4588p1708j49239j2905K28437J27742
9642a03139O8906Q2484L2613n8561K6904N367O1855j24730J869j56849o7016o6870
9630b97167M1558K20831L39069p507p4743j56757k21212l6265J69015J73807k12023
9619f1394K28028J24150m3403M1664J00007P8853m59010l40428M6861O8925l8115
9608b53862K07334M32533L4218k88988p0359P6134J50367n5658l40233k76171
$$ plain form
9598 -384685 -600178 -612103 -517252 -261688 -1705 138802 239846 -30011 -21840 269269
9588 269269 270531 36156 -36270 -82048 -27302 -196223 93123 361383 467485 411344 141871
9577 141871 55422 109578 -25711 -239381 -298297 -184756 -21738 66510 40803 48124 -187634
9566 -187634 -485570 -588711 -591017 -339650 -295561 -85416 160331 295280 274534 186778 31781
9555 31781 44482 148732 61999 -10887 -85708 -20658 -125100 -133071 -195726 -334706 -292371
9544 -292371 -302080 -277112 -130075 -103262 -212903 -257982 -87711 100198 -29330 91632 565945
9533 565945 528958 227956 -261625 -339352 -50046 243456 363341 370559 437010 599929 622895
9522 622895 458914 472846 376552 282541 31630 -154185 -125241 56373 -331494 -420598 -104449
$$ packed form
9598c84685k15493j1925R4851K55564K59983J40507J01044k69857Q171K91109
9588B69269J262k34375p2426m5778N4746j68921K89346K68260J06102n6141k69473
9577A41871q6449N4156j35289k13670n8916J13541J63018Q8248k5707P321k35758
9566a87634k97936j03141k306K51367M4089K10145K45747J34949k0746q7756j54997
9555C1781J2701J04250q6733p2886p4821O5050j04442p971o2655j38980M2335
9544b92371r709K4968J47037K6813j09641m5079J70271J87909j29528J20962M74313
9533E65945l6987l01002m89581p7727K89306K93502J19885P218O6451J62919K2966
9522F22895j63981J3932r6294r4011k50911j85815K8944J81614l87867q9104L16149
$$ plain form
9511 -104449 -4596 -97952 -89037 -225291 -109151 94629 187658 49435 173117 12077 -168454
9500 -168454 -343288 -216901 -126676 -160030 -355632 -236386 61851 264069 264054 54511 -4109
9489 -4109 -68554 -40792 81891 128992 163279 87502 -139820 -61579 100508 28451 134062
9478 134062 190061 244841 377266 113223 -34627 -214664 -159493 17257 199097 250876
9468 250876 140902 -6417 51293 -15590 -283580 -536252 -378188 -236119 -349594 -217784
9458 -217784 92830 178708 98800 208116 30318 24005 261615 222015 89792 230209 476813
9447 476813 267411 -30126 -227767 -153299 -102988 -16311 102936 79631 -65905 -226732
9437 -226732 -172588 -36233 32122 400916 458079 177529 -60691 -227862 -481963 -435997
$$ packed form
9511a04449R9853r3356Q915j36254J16140K03780R3029j38223J23682j61040j80531
9500a68454j74834J26387R0225l3354j95602J19246K98237K02218j5k09543n8620
9489d109o4445K7762J22683M7101L4287p5777k27322P8241J62087p2057J05611
9478A34062N5999N4780J32425k64043j47850j80037N5171J76750J81840N1779
9468B50876j09974j47319N7710o6883k67990k52672J58064J42069j13475J31810
9458b17784L10614Q5878p9908J09316j77798o313K37610l9600j32223J40417K46604
9447D76813k09402k97537j97641P4468N0311Q6677J19247k3305j45536j60827
9437b26732N4144J36355O8355L68794N7163k80550k38220j67171k54101M5966
$$ plain form
9427 -435997 -285726 -4520 -33902 63511 392499 465354 409702 399548 306443 312283 224933
9416 224933 119677 214810 110749 -126836 -257637 -148835 -80057 -209331 -291181 -198237
9406 -198237 -288364 -339320 -138898 73542 -76527 34084 68498 29160 105546 173004 257623
9395 257623 157574 -12756 -78563 4632 100117 -127182 32188 69376 -40894 -423297
9385 -423297 -450821 -491714 -263524 -87144 -211967 -245474 -334231 -517981 -273027 5655
9375 5655 16721 -102987 -91577 -50761 -264405 -310034 -228808 -276568 -223447 -92183 -87660 -156088
9363 -156088 -107821 -122696 121536 242206 75393 311791 347530 -40337 -182107 -91713
9353 -91713 -88200 88075 -26215 -297426 -326370 -257488 -134098 -128038 -32166 -19528 57594
$$ packed form
9427d35997J50271K81206k9382R7413L28988P2855n5652j0154r3105N840q7350
9416B24933j05256R5133j04061k37585j30801J08802O8778j29274q1850R2944
9406a98237r0127n0956K00422K12440j50069J10611L4414l9338P6386O7458Q4619
9395B57623j00049j70330o5807Q3195R5485k27299J59370L7188j10270l82403
9385d23297k7524m0893K28190J76380j24823l3507q8757j83750K44954K78682
9375E655J1066j19708J1410M0816k13644m5629Q1226m7760N3121J31264M523o8428
9363a56088M8267j4875K44232J20670j66813K36398L5739l87867j41770R0394
9353i1713L513J76275j14290k71211k8944O8882J23390O060R5872J2638P7122
$$ plain form
9342 57594 100289 118171 64622 30819 95208 -97962 8252 -131618 -252222 -396231 -254878
9331 -254878 -306214 -473673 -412003 -231392 -84459 -99077 61171 343064 328044 81456
9321 81456 51630 186815 85715 -10459 85071 -11743 -21592 -166682 16936 -24539 -245397
9310 -245397 -561187 -624664 -399552 -297646 -505070 -617737 -368628 -166078 9676 97389
9300 97389 83128 -109370 -269870 -227329 -269816 -140208 31832 -40556 -196019 -407918 -85455
9289 -85455 74804 94936 117846 98275 77909 -36644 -33513 124464 167255 179276 147998
9278 147998 219864 351083 150166 -252504 -183962 -26783 108565 182838 -62861 -356991
9268 -356991 -189821 -24346 -121570 -143034 -46683 -117498 125754 252406 327385 233813 288405
$$ packed form
9342E7594M2695J7882n3549l3803O4389j93170J06214j39870j20604j44009J41353
9331b54878n1336j67459O1670J80611J46933j4618J60248K81893j5020k46588
9321H1456k9826J35185j01100r6174R5530r6814r849j45090J83618m1475k20858
9310b45397l15790o3477K25112J01906k07424j12667K49109K02550J75754Q7713
9300I7389j4261j92498j60500M2541m2487J29608J72040p2388j55463k11899L22463
9289h5455J60259K0132K2910j9571k0366j14553L131J57977M2791J2021l1278
9278A47998P1866J31219k00917m02670O8542J57179J35348P4273k45699k94130
9268c56991J67170J65475r7224k1464R6351p0815K43252J26652P4979r3572N4592
$$ plain form
9257 288405 144986 80827 201260 215694 206990 126944 159657 354332 420790 61083 -349946
9246 -349946 -276509 -3680 133095 179703 -121950 -166518 -153920 -203276 62862 151216 51630
9235 51630 -173217 -213917 -216259 -306955 -292411 -70107 76165 157028 -68595 -157427 -171901
9224 -171901 -72805 42631 315812 255657 350792 378376 138306 152945 174726 181852 189632
9213 189632 65250 117160 223958 452377 494012 261587 237148 290867 282541 246152 99478
9202 99478 -129924 -38525 256025 515698 605596 630458 786931 569457 447673 311463
9192 311463 153375 171675 123354 -226351 -122224 42489 109602 243703 146983 76863 5962
9181 5962 -159367 -69446 53407 239041 281169 123204 -66750 -71739 4872 -66406 -123754
$$ packed form
9257B88405j43419o4159J20433J4434q704q0046L2713J94675O6458l59707m11029
9246c49946P3437K72829J36775M6608l01653m4568J2598m9356K66138Q8354r9586
9235E1630k24847m0700k342r0696J4544K22304J46272Q0863k25623q8832j4474
9224a71901R9096J15436K73181o0155R5135K7584k40070J4639K1781P126P780
9213A89632j24382N1910J06798K28419M1635k32425k4439N3719q326l6389j46674
9202I9478k29402R1399K94550K59673Q9898K4862J56473k17474j21784j36210
9192C11463j58088J8300m8321l49705J04127J64713O7113J34101r6720p0120p0901
9181E962j65329Q9921J22853J85634M2128j57965j89954m989P6611p1278n7348
$$ plain form
9170 -123754 -165182 250694 335509 -7996 3239 -22829 3086 263888 196679 97787 -299874
9159 -299874 -412961 -397804 -384822 -337336 -257260 66178 233005 290313 48223 -295948 33888
9148 33888 272413 355212 204692 58731 52893 -20573 270440 431521 261816 300350 371819
9137 371819 407831 374884 259829 381776 365538 86216 -64430 -220596 -176975 -218024 -328663
9126 -328663 -297841 102093 427991 341526 83096 16422 71861 26504 -85208 -216051 -299941
9115 -299941 -210485 -6937 186076 264083 401139 489820 181518 -51237 -142167 -208063 -220203
9104 -220203 -244566 -87194 12482 16836 157477 242332 271570 79755 62118 7792 -340030
9093 -340030 -147813 193197 -18026 -326202 -77535 -155554 -254323 -198977 -113817 -365552
$$ packed form
9170a23754m1428M15876Q4815l43505J1235k6068K5915K60802o7209r8892l97661
9159b99874j13087J5157J2982M7486Q0076L23438J66827N7308k42090l44171L29836
9148C3888K38525Q2799j50520j45961n838p3466K91013J61081j69705L8534P1469
9137C71819L6012l2947j15055J21947j6238k79322j50646j56166M3621m1049j10639
9126c28663L0822L99934L25898q6465k58430o6674N5439m5357j11712j30843q3890
9115b99941Q9456K03548J93013P8007J37056Q8681l08302k32755r0930o5896j2140
9104b20203k4363J57372R9676M354J40641Q4855K9238j91815j7637n4326l47822
9093c40030J92217L41010k11223l08176K48667p8019r8769N5346Q5160k51735
$$ plain form
9083 -365552 -114669 -33965 37529 162259 87713 -140782 -92073 -56745 -213062 -53652 -123623
9072 -123623 -316971 -225578 -129949 -14788 140188 212336 172853 227838 -42251 -55669 38781
9061 38781 -3976 -223163 -52605 60995 -36742 -171537 -117908 -58534 -158998 -315261 -510018
9050 -510018 -401755 -145872 -29300 30765 151048 148268 290857 382811 207839 -42500
9040 -42500 -146060 -332716 -216225 4681 318491 299209 245089 137094 39488 131728 173750
9029 173750 299100 486658 253448 59117 -63018 -240459 -372294 -352082 -191686 93607
9019 93607 227806 22550 -168980 -387550 -135732 -7939 -96365 -216532 -341244 -385451
9009 -385451 -353952 -313923 -144581 296338 342504 93393 -87711 -77357 -10930 63015 139238
$$ packed form
9083c65552K50883Q0704P1494J24730p4546k28495M8709L5328j56317J59410o9971
9072a23623j93348R1393R5629J15161J54976P2148l9483N4985k70089j3418R4450
9061C8781m2757k19187J70558J13600r7737j34795N3629N9374j00464j56263j94757
9050e10018J08263K55883J16572O0065J20283k780J42589R1954j74972k50339
9040d2500j03560j86656J16491K20906L13810j9282n4120j07995r7606R2240M2022
9029A73750J25350J87558k33210j94331j22135j77441j31835K0212J60396K85293
9019I3607J34199k05256j91530k18570K51818J27793q8426j20167j24712m4207
9009c85451L1499M0029J69342M40919M6166k49111j81104J0354O6427P3945P6223
$$ plain form
8998 139238 374113 354068 175818 108865 -18804 -50265 252460 268081 53272 -68969
8988 -68969 282 -38505 -216266 -321170 -270608 -179531 184265 372119 564434 502227 234265
8977 234265 184872 -94639 -153794 79506 262184 197380 142405 373051 391894 231823 204899
8966 204899 253802 98412 41383 -28313 -203126 -229534 -16092 132320 228414 205956 257111
8955 257111 253637 271511 200983 -54272 -103690 -171159 -349658 -327050 -264838 -77984 11153
8944 11153 -22410 -189777 -203070 -203040 -106040 111672 -21746 -178964 -331365 -346959 -252753
8933 -252753 -173175 104968 339494 175335 49190 -176215 -434956 -221649 -154486 -448809
8923 -448809 -542626 -482739 -300231 -37436 172188 262350 199434 238043 183548 -69617 -87140
$$ packed form
8998A39238K34875k0045j78250o6953j27669l1461L02725J5621k14809j22241
8988f8969O9251l8787j77761j04904N0562R1077L63796J87854J92315o2207k67962
8977B34265m9393k79511n9155K33300J82678o4804n4975K30646J8843j60071k6924
8966B04899M8903j55390n7029o9696j74813k6408K13442J48412R6094k2458N1155
8955B57111l474J7874p0528k55255m9418o7469j78499K2608O2212J86854Q9137
8944A1153l3563j67367j3293L0R7000K17712j33418j57218j52401j5594R4206
8933b52753P9578K78143K34526j64159j26145k25405k58741K13307O7163k94323
8923d48809r3817N9887J82508K62795K09624R0162o2916L8609n4495k53165j7523
$$ plain form
8912 -87140 -179117 -243703 -304841 -512377 -612429 -550558 -484936 -265627 -231839 -77313 195678
8901 195678 396243 170306 40585 -41423 -56454 8213 -190574 -313429 -185389 -204090
8891 -204090 -120381 -21704 20276 81497 -116753 -334166 -241101 -66470 79722 -28877 -68076
8880 -68076 -5600 -66395 -104136 99366 430998 155528 -174637 -361847 -263464 -388129 -410919
8869 -410919 -584109 -267625 -15342 70298 216905 245465 71103 71701 2273 94774 143826
8858 143826 75531 178006 414409 306805 24392 -27177 -22950 91981 264959 384242
8848 384242 213903 90728 247310 268507 121455 95893 284651 164508 -55956 146532
8838 146532 8781 -47762 218018 112225 -336735 -470249 -527726 -397439 -364926 -386033
$$ packed form
8912h7140r1977o4586o1138k07536j00052O1871O5622K19309L3788J54526K72991
8901A95678K00565k25937j29721q2008j5031O4667j98787j22855J28040j8701
8891b04090Q3709R8677M1980O1221j98250k17413R3065J74631J46192j08599l9199
8880f8076O2476o0795l7741K03502L31632k75470l30165j87210R8383j24665k2790
8869d10919j73190L16484K52283Q5640J46607K8560j74362N98o9428R2501M9052
8858A43826o8295J02475K36403j07604k82413n1569M227J14931J72978J19283
8848C84242j70339j23175J56582K1197j47052k5562J88758j20143k20464K02488
8838A46532j37751n6543K65780j05793m48960j33514n7477J30287L2513k1107
$$ plain form
8828 -386033 -267267 -285198 -118245 -94994 67109 84186 -64377 -9743 -104601 -182237 -122347
8817 -122347 -162878 -335400 -365308 -325588 -241664 -17377 62557 -49085 14127 74019 -98436
8806 -98436 -284696 -225280 -144748 61597 81549 21893 -136028 -126153 -151473 -131863 -132767 98795
8794 98795 66276 -86562 -187711 -170039 -294374 -392503 -220094 -279521 -259393 -58005 50542
8783 50542 6332 -201956 -325420 -271744 10649 333965 286320 189806 106858 235578 250735
8772 250735 211243 183037 115957 345742 463054 305006 242338 196851 174077 -87710 -273631
8761 -273631 -134052 77916 110711 196956 72263 -58405 -90593 -199061 -192374 -148034 -241743
8750 -241743 3302 172608 265572 423204 245474 171513 69021 -120826 -270901 -325755
$$ packed form
8828c86033J18766j7931J66953K3251J62103J7077j48563N4634r4858p7636N9890
8817a22347m0531j72522k9908L9720Q3924K24287P9934j11642O3212N9892j72455
8806i8436j86260N9416Q0532K06345J9952n9656j57921R875k5320J9610r04K31562
8794I8795l2519j52838j01149J7672j24335r8129J72409n9427K0128K01388J08547
8783E0542m4210k08288j23464N3676K82393L23316m7645r6514q2948J28720J5157
8772B50735l9492k8206o7080K29785J17312j58048o2668m5487k2774k61787j85921
8761b73631J39579K11968L2795Q6245j24693j30668l2188j08468O687M4340r3709
8750b41743K45045J69306R2964J57632j77730p3961j02492j89847j50075n4854
$$ plain form
8740 -325755 -29539 331935 742430 611425 437088 477260 528377 284889 -55700 111321
8730 111321 212075 184421 69794 29140 324910 426568 337728 88109 -82516 21090
8720 21090 350409 244277 29192 -163660 -246205 -3562 224159 495742 637247 812103
8710 812103 729547 545154 435557 495938 646782 504867 270941 296103 223195 1407
8700 1407 -181998 -59909 -13301 -26623 27789 148714 117890 117278 274588 348321 435360 544240
8688 544240 523441 490049 364461 299365 376193 483675 388652 276676 285181 125677 71779
8677 71779 3513 81192 245048 432558 365352 272386 160072 248141 380159 441675 504053
8666 504053 519463 507887 677292 723294 503383 245564 246240 312714 329999 330896 562775 546469
$$ packed form
8740c25755K96216L61474M10495j31005j74337M0172N1117k43488l40589J67021
8730A11321J00754k7654j14627m0654K95770J01658q8840k49619j70625J03606
8720B1090L29319j06132k15085j92852q2545K42643K27721K71583J41505J74856
8710H12103q2556j84393j09597O0381J50844j41915k33926K5162p2908k21788
8700A407j83405J22089M6608j3322N4412J20925l0824o12J57310P3733Q7039J08880
8688E44240k0799l3392j25588o5096P6828J07482r5023j11976Q505j59504n3898
8677G1779o8266P7679J63856J87510o7206r2966j12314Q8069J32018O1516O2378
8666E04053J5410j1576J69405M6002k19911k57819O76O6474J7285Q97K31879j6306
$$ plain form
8654 546469 551584 570586 464881 344986 153337 245512 150977 176588 504331 566149 530461
8643 530461 330824 259956 326726 458995 423136 553842 584598 622012 562306 571667 828221
8632 828221 1121322 941218 973138 942135 631133 687775 791435 811283 772348 536024 369039
8621 369039 267814 330544 425807 592356 763554 718362 706819 739345 492128 630431 737485
8610 737485 736316 920159 1171029 1158340 1083712 1043773 1200166 1326586 1486249 1546762 1285134
8599 1285134 1288471 1638875 1819466 1870994 1850024 1728281 1418933 1137750 1005285 1126729
8589 1126729 953971 967737 1466514 1787265 1665964 1566147 1483763 1243192 1073114 1035393
8579 1035393 1248802 1394481 1414469 1224217 1150333 899065 849321 898632 822877 778081 727405
$$ packed form
8654E46469N115J9002j05705j19895j91649R2175r4535K5611L27743O1818l5688
8643E30461j99637p0868O6770J32269l5859J30706L0756L7414n9706R361K56554
8632H28221K93101j80104L1920l1003l11002N6642J03660J9848l8935k36324j66985
8621C69039j01225O2730R5263J66549J71198m5192j1543L2526k47217J38303J07054
8610G37485j169J83843K50870j2689p4628l9939J56393J26420J59663O0513k61628
8599A285134L337L50404J80591N1528k0970j21743l09348k81183j32465J21444
8589A126729j72758J3766M98777L20751j21301r9817q2384k40571j70078l7721
8579A035393K13409J45679J9988j90252p3884k51268m9744M9311p5755m4796n0676
$$ plain form
8568 727405 701429 608199 696680 674927 652288 637596 726522 731650 497248 651396 1019850
8557 1019850 887829 840495 691198 431959 363375 416944 471488 488565 552261 546645 547161
8546 547161 606268 664614 402601 485786 555147 421530 409157 365628 203463 -104373 -133451
8535 -133451 291830 554888 500106 327969 363495 328564 323287 386686 328755 272033 341656
8524 341656 511169 504482 292293 367950 422467 456813 336825 80604 113854 185019 109165
8513 109165 407976 570756 436358 100157 43778 91600 12775 73271 -1169 -137722 -136116
8502 -136116 -242832 -33788 -117915 -381738 -277669 22699 33328 179710 335191 314917
8492 314917 149748 147021 18840 13831 218003 221043 150100 -53071 98 -6467 -104610 63664
$$ packed form
8568G27405k5976r3230Q8481k1753k2639j4692Q8926N128k34402J54148L68454
8557A019850j32021m7334j49297k59239o8584N3569N4544J7077O3696n616N16
8546E47161N9107N8346k62013Q3185O9361j33617j2373m3529j62165l07836k9078
8535a33451M25281K63058n4782j72137L5526l4931n277O3399n7931n6722O9623
8524C41656J69513o687k12189P5657N4517L4346j19988k56221L3250P1165p5854
8513A09165K98811J62780j34398l36201n6379M7822p8825O0496p4440j36553J606
8502a36116j06716K09044q4127k63823J04069L00368J0629J46382J55481k0274
8492C14917j65169k727j28181n009K04172L040p0943k03171N3169o565r8143J68274
$$ plain form
8480 63664 341864 284806 306072 424648 339354 305148 337908 362891 418388 398337 339872
8469 339872 296533 347266 546608 584042 480338 354477 234115 194078 253948 48596 -30201
8458 -30201 -155587 -314359 -327458 -313735 -145038 87217 166173 186587 243186 -31783 -236952
8447 -236952 -168884 3849 76570 346565 196208 84316 172576 241958 286727 277073 314290
8436 314290 249948 364273 359883 361468 234137 201126 -26247 -100973 -111911 -262532 -370805
8425 -370805 -195545 -153900 -170423 -190988 -61965 -128907 -61800 -45745 233945 449286 514526
8414 514526 441692 407496 273244 98639 129387 135592 174624 127480 116203 123229 293916
8403 293916 157497 75285 106460 262667 274130 245391 -110192 -103236 189764 280873 104810
$$ packed form
8480F3664K78200n7058K1266J18576q5294l4206L2760K4983N5497k0051n8465
8469C39872m3339N0733J99342L7434j03704j25861j20362m0037N9870k05352p8797
8458c0201j25386j58772j3099J3723J68697K32255P8956K0414N6599k74969k05169
8447b36952O8068J72733P2721K69995j50357j11892Q8260O9382M4769r654L7217
8436C14290o4342J14325m390J585j27331l3011k27373p4726j0938j50621j08273
8425c70805J75260M1645j6523k0565J29023o6942O7107J6055K79690K15341O5240
8414E14526p2834l4196j34252j74605L0748O205L9032m7144j1277P026J70687
8403B93916j36419q2212L1175J56207J1463k8739l55583O956K93000R1109j76063
$$ plain form
8392 104810 107759 111420 76522 82169 -10256 -99795 -1523 149606 270206 358375 397838 171567
8380 171567 274836 377912 401056 326452 238793 299748 210216 212679 324026 539612 531718
8369 531718 510836 268711 68133 218997 434592 512604 413325 93199 -139337 42339
8359 42339 38325 115396 116146 215683 383230 328047 96674 -3880 43810 122862 -27991 -32275
8347 -32275 -162480 -101762 -83130 61735 100538 139734 112144 15256 -55671 -156052 -139590
8336 -139590 -149774 -33481 228691 294378 308144 117471 -12958 -37417 61517 82936 132409
8325 132409 196613 358366 213805 244255 243849 215186 175366 163670 190905 -20616 -34512
8314 -34512 34129 117433 36854 69256 314643 318168 209052 181472 177179 291690 217745 375975
$$ packed form
8392A04810K949L661l4898N647r2425q9539R8272J51129J20600Q8169L9463k26271
8380A71567J03269J03076K3144p4604q7659O0955q9532K463J11347K15586p894
8369E31718k0882k42125k00578J50864K15595P8012r9279l20126k32536J81676
8359D2339m014P7071P50R9537J67547n5183k31373j00554M7690P9052j50853m284
8347c2275j30205O0718J8632J44865L8803L9196k7590r6888p0927j00381J6462
8336a39590j0184J16293K62172O5687J3766j90673j30429k4459R8934K1419M9473
8325A32409O4204J61753j44561L0450m06k8663l9820j1696K7235k11521j3896
8314c4512O8641Q3304q0579L2402K45387L525j09116k7580m293J14511p3945J58230
$$ plain form
8302 375975 380914 160073 203492 251087 457125 521845 557763 528896 328138 354894 347038
8291 347038 212335 288006 410884 359734 201727 70039 18265 -117537 75504 278873
8281 278873 219324 157770 78606 -154584 278 -18348 111664 194969 363 -52260 82345
8270 82345 176782 311950 75900 -47078 -272768 -61411 193698 261277 335789 374851 293533
8259 293533 199319 141457 329700 453733 264617 239529 337268 228238 212316 72036 50283
8248 50283 314490 296413 60848 -36791 181987 365987 229107 354198 437742 419330 271419
8237 271419 38368 -102871 6176 118291 67330 214525 288642 373337 288905 180106
8227 180106 153073 226080 7370 41422 159517 -11205 -148462 -53058 327189 220999
$$ packed form
8302C75975M939k20841M3419M7595K06038O4720L5918k8867k00758K6756p856
8291C47038j34703P5671J22878n1150j58007j31688n1774j35802J93041K03369
8281B78873n9549o1554p9164k33190J54862j8626J30012Q3305j94606n2623J34605
8270H2345R4437J35168k36050j22978k25690K11357K55109O7579P4512L9062q1318
8259B93533r4214n7862J88243J24033j89116k5088R7739j09030j5922j40280k1753
8248E0283K64207j8077k35565r7639K18778J84000j36880J25091Q3544j8412j47911
8237B71419k33051j41239J09047J12115n0961J47195P4117Q4695q4432j08799
8227A80106k7033P3007k18710L4052J18095j70722j37257R5404L80247j06190
$$ plain form
8217 220999 146537 -56502 -154774 -167284 -83108 193433 446909 256705 184399 -1392 -170696
8206 -170696 80579 168260 -119537 -132001 -109232 -1157 51976 -176619 -225434 -112955 -18495
8195 -18495 -218682 -39071 257029 10130 -97723 -56598 -54692 -103220 -137100 -88867 -66444
8184 -66444 -27540 -92822 -56661 -48597 -361910 -466601 -374414 -504365 -204554 143749 283005
8173 283005 102109 -109019 -129674 214608 185594 105025 50290 187120 -99398 -172739 -172379
8162 -172379 -82497 -77746 138250 80725 -101521 -46591 105724 317091 410634 431929 358328
8151 358328 121607 186282 112348 -9640 30644 225328 275467 305699 150447 -165820 -259108
8140 -259108 -305285 -259054 -87738 -70270 -55778 -78567 -94676 2551 309583 219901 116497
$$ packed form
8217B20999p4462k03039r8272j2510Q4176K76541K53476j90204p2306j85791j69304
8206a70696K51275Q7681k87797j2464K2769J08075N3133k28595m8815J12479R4460
8195a8495k00187J79611K96100k46899j07853M1125J906m8528l3880M8233K2423
8184f6444L8904o5282L6161Q064l13313j04691R2187j29951K99811L48303J39256
8173B83005j80896k11128k0655L44282k9014q0569n4735J36830k86518p3341L60
8162a72379Q9882M751K15996n7525j82246N4930J52315K11367R3543K1295p3601
8151C58328k36721O4675p3934j21988M0284J94684N0139L0232j55252l16267r3288
8140b59108m6177M6231J71316J7468J4492k2789j6109R7227L07032q9682j03404
$$ plain form
8129 116497 145261 33265 -80001 -179461 -118584 194011 395784 634588 535112 415732
8119 415732 252405 138424 231828 366558 361471 381226 396270 187972 33891 207325 224296
8108 224296 71673 -204735 -119809 123041 478841 431790 378277 252890 -113376 -166207
8098 -166207 251616 363960 512283 382653 -17858 -64758 80097 253002 141057 129879
8088 129879 53469 58972 247319 342256 256857 19122 -132676 -73100 6652 -87043 -134077
8077 -134077 -292556 -470020 -496152 -442253 -316221 -293279 -74115 142281 294886 118561
8067 118561 -36642 -209929 -162028 78569 99648 49409 199099 291137 378677 207640 34640
8056 34640 -64860 -269059 -154629 -47201 123601 69932 152849 183596 19206 65163 63783
$$ packed form
8129A16497K8764j11996j13266r9460O0877L12595K01773K38804r9476j19380
8119D15732j63327j13981R3404J34730n087J9755J5044k08298j54081J73434J6971
8108B24296j52623k76408Q4926K42850L55800m7051n3513j25387l66266n2831
8098a66207M17823J12344J48323j29630m00511m6900J44855J72905j11945j1178
8088A29879p6410N503J88347R4937q5399k37735j51798N9576P9752r3695m7034
8077a34077j58479j77464k6132N3899J26032K2942K19164K16396J52605j76325
8067A18561j55203j73287M7901K40597K1079n0239J49690R2038Q7540j71037j73000
8056C4640r9500k04199J14430J07428J70802n3669Q2917L0747j64390M5957j380
$$ plain form
8045 63783 103370 112224 122864 296596 270100 -7149 -118441 63352 260831 183124 -33740
8034 -33740 56644 157518 274196 533711 800360 702598 397320 106893 76290 146499 79140
8023 79140 162877 112802 50546 349793 625153 943288 808766 535881 744855 847864
8013 847864 580688 330067 236606 184575 346605 633239 835942 689817 530903 534545
8003 534545 596973 508933 333260 697596 811746 719166 512170 477311 559333 564006 669404
7992 669404 1071729 1175399 1423941 1613874 1549763 1794365 2234242 2365763 2223695 1889014
7982 1889014 1592418 1287593 1352225 1351204 1213673 949509 924367 918848 589054 536406 633769
7971 633769 673115 505328 369200 385406 417576 533054 658909 640167 744471 787659 562527
$$ packed form
8045F3783L9587Q854J0640J73732k6496k77249j11292J81793J97479p7707k16864
8034c3740R0384J00874J16678K59515K66649r7762l05278k90427l0603P0209o7359
8023G9140Q3737n0075o2256K99247K75360L18135j34522k72885K08974J03009
8013H47864k67176k50621r3461n2031J62030K86634K02703j46125j58914L642
8003E34545O2428q8040j75673L64336J14150r2580k06996l4859Q2022M673J05398
7992F69404M02325J03670K48542J89933o4111K44602M39877J31521j42068l34681
7982A889014k96596l04825O4632j021j37531k64164k5142n519l29794n2648R7363
7971F33769L9346j67787j36128J6206L2170J15478J25855j8742J04304M3188k25132
$$ plain form
7960 562527 667535 805236 845806 664954 715547 713830 789709 618949 543675 770672 783436
7949 783436 683961 871842 1529207 1860154 1915766 1814108 1834278 1725567 1642116 1659976 1490939
7938 1490939 1329532 1014206 906439 787377 678702 865910 925584 615255 531542 499640
7928 499640 424728 175961 164930 373347 442559 780697 608972 444185 334297 194810
7918 194810 214378 388827 523995 442073 547727 689527 893267 925143 930457 900310 760000
7907 760000 610891 820061 747692 429171 193849 281399 438145 436488 293250 525329
7897 525329 668369 502730 367681 262499 450969 570638 508042 578118 521658 479309
7887 479309 721054 848514 448997 245436 110274 -20238 -123958 10390 145790 82497
$$ packed form
7960E62527J05008J37701M0570j80852N0593j717P5879j70760p5274K26997J2764
7949G83436r9475J87881O57365L30947N5612j01658K0170j08711q3451J7860j69037
7938A490939j61407l15326j07767j19062j08675J87208N9674l10329q3713l1902
7928D99640p4912k48767j1031K08417O9212L38138j71725j64787j09888j39487
7918A94810J9568J74449J35168q1922J05654J41800K03740L1876N314l0147j40310
7907G60000j49109K09170p2369l18521k35322Q7550J56746j657j43238K32079
7897E25329J43040j65639j35049j05182J88470J19669o2596P0076n6460m2349
7887D79309K41745J27460l99517k03561j35162j30512j03720J34348J35400o3293
$$ plain form
7877 82497 -284546 -318554 -115631 135989 218902 232415 66283 -115581 -48385 -107161 -199102
7866 -199102 -67040 -69160 -287271 -566569 -331528 52519 55575 -7414 261285 459953 514388
7855 514388 380244 16438 -192248 59429 251661 -29809 -210122 -308742 -43029 109706
7845 109706 9500 -375970 -514451 -399332 -416403 -270887 -186331 -279232 -201379 42251
7835 42251 217231 36294 -82748 -6198 93767 216614 325800 291741 -73444 -54377 117044
7824 117044 -40150 -161105 -84923 122603 208723 291824 428248 411719 255798 276569 478377
7813 478377 507535 612819 619269 413879 246337 47319 -17851 85190 229826 274536 254527
7802 254527 -50446 -57486 -121555 -48454 -166962 -300128 -359573 -309396 -306440 -311588 -245717 -134412
$$ packed form
7877H2497l67043l4008K02923K51620Q2913J3513j66132j81864O7196n8776r1941
7866a99102J32062k120k18111k79298K35041L84047L056o2989K68699J98668N4435
7855E14388j34144l63806k08686K51677J92232k81470j80313r8620K65713J52735
7845A09706j00206l85470j38481J15119j7071J45516Q4556r2901P7853K43630
7835D2251J74980j80937j19042P6550R9965J22847J09186l4059l65185J9067J71421
7824A17044j57194j20955P6182K07526Q6120Q3101J36424j6529j55921K0771K01808
7813D78377K9158J05284O450k05390j67542j99018o5170J03041J44636M4710k0009
7802B54527l04973p040o4069P3101j18508j33166n9445N0177K956n148O5871J11305
$$ plain form
7790 -134412 79651 17369 -177596 -245134 -392819 -544844 -198520 354299 200531 -120000
7780 -120000 -100591 7308 173782 239564 175894 216051 308530 97126 -127099 -174547 -34280
7769 -34280 20085 225643 351830 204888 179455 249542 270737 111223 162966 292165 285575
7758 285575 -74439 -193825 -77126 -125321 -215317 -199200 5299 133028 212735 193132 189283
7747 189283 70463 -389207 -333449 -194654 -157956 34091 -33475 80801 112083 144660 131019
7736 131019 104470 199144 -67033 -168785 -59667 126051 179009 328375 477521 254991
7726 254991 -27861 -142201 -327041 -455192 -453979 18480 -32445 79317 143626 27601
7716 27601 -86995 -198214 -341152 -265193 -65922 -46889 -130979 -132796 -20871 131175 271533
$$ packed form
7790a34412K14063o2282j94965o7538j47685j52025L46324N52819j53768l20531
7780a20000J9409J07899J66474O5782o3670M0157R2479k11404k24225m7448J40267
7769c4280N4365K05558J26187j46942k5433P0087K1195j59514N1743J29199o590
7758B85575l60014j19386J16699m8195q9996J6117K04499J27729P9707j9603l849
7747A89283j18820m59670N5758J38795L6698J92047o7566J14276L1282L2577j3641
7736A31019k6549R4674k66177j01752J09118J85718N2958J49366J49146k22530
7726B54991k82852j14340j84840j28151J213M72459n0925J11762O4309j16025
7716B7601j14596j11219j42938P5959J99271J9033q4090j817J11925J52046J40358
$$ plain form
7705 271533 125942 -21658 11841 98107 74801 142701 26137 -64535 37591 131750 -140963
7694 -140963 -127198 -62319 -152966 -174344 -168140 -82200 50359 75444 118146 72404 71942 167744
7682 167744 160034 -140430 -230130 -364344 -565601 -376614 -298288 -144271 182512 174447 -45783
7671 -45783 -101712 173684 101186 -215898 -168758 -305063 -335692 -212852 -124742 -211151 -55041
7660 -55041 -9886 -90708 -133096 -150581 -233745 -367135 -275846 -125515 67505 217162 237693
7649 237693 341129 315629 137836 166365 155144 -164658 -300822 -379201 -508385 -229403
7639 -229403 -101915 -115835 -223749 -325872 -5258 68890 251353 201051 171687 86204 -146286
7628 -146286 -238843 -231688 -231056 -86900 -107003 -128827 -248232 -248260 23394 13650 86719 73647
$$ packed form
7705B71533j45591j47600L3499Q6266k3306O7900j16564r0672J02126R4159k72713
7694a40963J3765O4879r0647k1378O204Q5940J32559K5085M2702m5742m62R5802
7682A67744p710l00464q9700j34214k01257J88987P8326J54017L26783q065k20230
7671d5783n5929K75396p2498l17084M7140j36305l0629J22840Q8110q6409J56110
7660e5041M5155q0822m2388j7485q3164j33390R1289J50331J93020J49657K0531
7649B37693J03436k5500j77793K8529j1221l19802j36164p8379j29184K78982
7639b29403J27488j3920j07914j02123L20614P4148J82463n0302k9364q5483k32490
7628a46286r2557P155O32J44156k0103k1824j19405k8K71654r744P3069j3072
$$ plain form
7616 73647 -138242 -159800 -24411 223766 338677 552009 575123 556106 323038 -56914
7606 -56914 -33751 40393 -152140 -151931 -200861 -269305 -305174 -190694 -176138 -168593 -105875 17288
7594 17288 60989 182244 242080 131915 -94936 -253891 6987 238939 234348 134008 50260
7583 50260 31852 -51624 -245651 -406065 -291517 -279371 -206162 -16683 130296 170065 131711
7572 131711 -161315 -348774 -144585 -88992 35811 -90555 -334448 -163023 -13583 2133
7562 2133 -101608 -12919 172535 -22052 67902 185222 83983 -61323 -111925 -57146 -2034
7551 -2034 81180 -16826 -74265 -199613 -235174 -392150 -392839 -215397 -25060 -38522 -113281 -176601
7539 -176601 -232163 -196912 -367805 -563631 -576170 -730959 -690065 -408526 -177636 -76559
$$ packed form
7616G3647k11889k1558J35389K48177J14911K13332K3114j9017k33068l79952
7606e6914K3163P4144j92533K09m8930o8444l5869J14480J4556P545O2718J23163
7594A7288M3701J21255N9836j10165k26851j58955K60878K31952m591j00340q3748
7583E0260j8408q3476j94027j60414J14548J2146P3209J89479J46979L9769l8354
7572A31711k93026j87459K04189N5593J24803j26366k43893J71425J49440J5716
7562B133j03741Q8689J85454j94587Q9954J17320j01239j45306n0602N4779N5112
7551b034Q3214r8006n7439j25348l5561j56976o89J77442J90337j3462p4759o3320
7539a76601n5562L5251j70893j95826j2539j54789M0894K81539K30890J01077
$$ plain form
7529 -76559 286345 297301 123609 153659 250405 269275 167668 115465 57874 213345 146125
7518 146125 116009 149255 -47854 -242881 -340250 -2509 -39841 -357734 -712000 -607579
7508 -607579 -262124 -92076 -50413 86353 99390 -190752 -183530 -296323 -376089 -189749 -241007
7497 -241007 -300303 -209776 -114178 -194798 -36858 56994 38071 149394 108418 194875 305597
7486 305597 108198 11333 139395 308186 126737 144698 -64994 -92940 40216 175830
7476 175830 99153 -118618 -139695 -26353 138094 463775 543489 155518 -132499 -10587
7466 -10587 31647 149667 17986 10923 -57934 20402 91245 278250 72018 -169251 -202512
7455 -202512 -61632 -60118 32816 17364 57026 -171498 -367429 -106962 214069 283834 293950
$$ packed form
7529g6559L62904J0956j73692L0050R6746J8870j01607n2203n7591J55471o7220
7518A46125l0116L3246j97109j95027r7369L37741l7332l17893l54266J04421
7508f07579L45455J70048M1663J36766J3037k90142P222j12793p9766J86340n1258
7497b41007n9296R0527R5598q0620J57940R3852j8923J11323m0976Q6457J10722
7486C05597j97399r6865J28062J68791j81449J7961k09692k7946J33156J35614
7476A75830p6677k17771k1077J13342J64447L25681P9714l87971k88017J21912
7466a0587M2234J18020j31681p063o8857P8336P0843J87005k06232k41269l3261
7455b02512J40880J514R2934j5452L9662k28524j95931K60467L21031O9765J0116
$$ plain form
7444 293950 339808 183637 62382 -43450 -12471 -249 169417 120533 -42710 -125813 -10340
7433 -10340 850 -44450 -89120 9917 111814 40165 -97400 -182914 -191668 -235619 -185440 -153151
7421 -153151 -109398 -157811 -275240 -240889 -155068 -111106 -46783 -13183 37005 85866 5262
7410 5262 44568 208433 361501 362273 281591 137153 73609 -115944 -19051 106086 134722
7399 134722 77230 23224 208840 552752 699541 342638 166915 138744 143361 230802 308694
7388 308694 223773 146795 316490 405077 198077 42891 -24026 -201359 -43409 31893 -16717
7377 -16717 -89964 -165612 -176125 138199 148558 28941 -22653 50144 62546 11991 -128855
7366 -128855 -312615 -294991 -263542 -363862 -340415 -113778 -93412 -149621 -225699 -141432 -288601
$$ packed form
7444B93950M5858j56171j21255j05832L0979J2222J69666m8884j63243q3103J15473
7433a0340J1190m5300m4670R9037J01897p1649j37565q5514q754m3951N0179L2289
7421a53151M3753m8413j17429L4351Q5821M3962O4323L3600N0188M8861q0604
7410E262L9306J63865J53068P72q0682j44438o3544j89553R6893J25137K8636
7399A34722n7492n4006J85616L43912J46789l56903j75723k8171M617Q7441P7892
7388C08694q4921p6978J69695Q8587k07000j55186o6917j77333J57950P5302m8610
7377a6717p3247p5648j0513L14324J0359j19617n1594P2797J2402n0555j40846
7366a28855j83760J7624L1449j00320K3447K26637K0366n6209p6078Q4267j47169
$$ plain form
7355 -288601 -302377 -67697 -13137 5545 -89860 -145549 57453 37597 44038 -267813 -487472
7344 -487472 -525869 -391646 -95636 -230224 -393825 -278311 -329930 -314434 -21605 -3925
7334 -3925 -47760 -107119 -79225 -169138 -161597 -103295 9898 -24466 -127090 561 39509 51430
7322 51430 -5682 54219 290695 310166 132979 -122221 -20871 -112317 -121041 15260 181991
7311 181991 185593 178245 292929 217695 -21889 -147804 -231420 -218919 -206850 -96978 -297388
7300 -297388 -443386 -223912 38849 -9954 -141112 66582 417740 411129 45506 -75564
7290 -75564 -185009 -463334 -470999 -361986 -200361 -151074 -371801 -374361 -185709 -95164 -203066
7279 -203066 -385184 -347440 -136808 -165580 -196070 -122750 -253548 -196742 -108269 -77576 -162894
$$ packed form
7355b88601j3776K34680N4560J8682r5405n5689K03002j9856O441l11851k19659
7344d87472l8397J34223K96010j34588j63601J15514n1619J5496K92829J7680
7334c925m3835n9359K7894q9913P541N8302J13193l4364j02624J27651L8948J1921
7322E1430n7112N9901K36476J9471j77187k55200J01350r1446q724J36301J66731
7311A81991L602p348J14684p5234k39584j25915q3616J2501J2069J09872k00410
7300b97388j45998K19474K62761m8803j31158K07694L51158o611l65623j21070
7290g5564j09445k78325p665J09013J61625M9287k20727k560J88652R0545j07902
7279b03066j82118L7744K10632k8772l0490P3320j30798N6806Q8473L0693q5318
$$ plain form
7268 -162894 -132523 -345379 -547998 -359866 -135809 77238 170578 165502 145630 28708 -123080
7257 -123080 -40933 -6529 -90004 -201882 -271135 -360471 -322503 -77505 97700 78051 140641
7246 140641 -37791 -151463 -149728 -177705 -14388 20057 50332 159558 183886 38413 29916
7235 29916 -7312 34782 150841 -35082 -120191 18553 -19622 -38019 -142014 -109992 -233973
7224 -233973 -372542 -332001 -135078 16786 48496 -192565 -152866 -88015 -129024 -190273 -157969
7213 -157969 68013 44588 126826 232016 315067 212565 250111 201771 119947 186808 67806
7202 67806 80706 42523 65524 34979 -261940 -106291 -256178 -362505 -526339 -604493 -244155
7191 -244155 -145327 -223092 -172785 181844 225530 268525 7832 -189236 -130259 -248762 -315490
$$ packed form
7268a62894L0371k12856k02619J88132K24057K13047R3340n076j9872j16922j51788
7257a23080Q2147L4404q3475j11878o9253q9336L7968K44998J75205j9649O2590
7246A40641j78432j13672J735k7977J63317L4445L0275J09226K4328j45473q497
7235B9916l7228M2094J16059j85923q5109J38744l8175j8397j03995L2022j23981
7224b33973j38569M0541J96923J51864L1710k41061L9699O4851m1009o1249L2304
7213a57969K25982k3425Q2238J05190Q3051j02502L7546m8340q1824O6861j19002
7202F7806J2900l8183K3001l0545k96919J55649j49887j06327j63834p8154L60338
7191b44155R8828p7765N0307L54629M3686M2995k60693j97068N8977j18503o6728
$$ plain form
7180 -315490 -182370 -126131 -40504 -26252 -150950 -196527 -56598 -41653 -25039 45630 37683
7169 37683 -253364 -491812 -384932 -22740 88999 289645 210843 -11155 -203368 -423497
7159 -423497 -404815 -469227 -585164 -503612 -259526 -133527 -62965 -177772 -80759 152334 215680
7148 215680 121083 64506 31117 -182681 -304874 -28236 59390 224641 226121 66866 -88773
7137 -88773 103639 149666 -71916 58568 -12332 13488 -135528 -446729 -178411 113129
7127 113129 132224 -39655 -367377 -453015 -406238 -469702 -500017 -304158 7386 229860 446751
7116 446751 469648 579496 697867 347133 145499 24285 51015 189670 208368 181735
7106 181735 79791 937 21980 165516 -72603 -166946 -78498 -224660 -381641 -265863
$$ packed form
7180c15490J33120N6239Q5627J4252j24698m5577J39929J4945J6614P0669p947
7169C7683k91047k38448J06880L62192J11739K00646p8802k21998j92213k20129
7159d23497J8682o4412j15937Q1552K44086J25999P0562j14807R7013K33093O3346
7148B15680r4597n6577l3389k13798j22193K76638Q7626J65251J480j59255j55639
7137h8773J92412M6027k21582J30484p0900K5820j49016l11201K68318K91540
7127A13129J9095j71879l27722q5638M6777o3464l0315J95859L11544K22474K16891
7116D46751K2897J09848J18371l50734k01634j21214K6730J38655J8698k6633
7106A81735j01944p8854K1043J43536k38119r4343Q8448j46162j56981J15778
$$ plain form
7096 -265863 -300954 -239340 15926 195429 127892 4337 32210 194008 115472 -40673 -54267
7085 -54267 77657 90701 354327 493498 290509 131773 268660 588365 384353 270238
7075 270238 212830 214083 157904 6288 309892 315234 -15858 -149115 -317028 -281229 -66739
7064 -66739 25307 25134 146684 225694 110040 -63482 -268690 -158618 -204651 -409646 -312199
7053 -312199 69147 135781 114664 237209 150685 196275 66892 200153 228461 268663 174282
7042 174282 43919 142718 502562 420546 136052 172965 331399 326800 65310 -183847 -289029
7031 -289029 -344674 -420581 -265007 -88346 -202444 -274205 -224804 -77914 -82192 -125839 -123584
7020 -123584 -8247 -3082 -423495 -638210 -489045 -340420 -335472 -87038 21856 -311654
$$ packed form
7096b65863l5091O1614K55266J79503o7537j23555K7873J61798p8536j56145j3594
7085e4267J31924J3044K63626J39171k02989j58736J36887L19705k04012j14115
7075B70238n7408J253n6179j51616L03604N342l31092j33257j67913L5799K14490
7064f6739R2046j73J21550P9010j15654j73522k05208J10072m6033k04995R7447
7053c12199L81346O6634k1117J22545q6524M5590j29383J33261K8308M0202r4381
7042A74282j30363R8799L59844q2016k84494L6913J58434m599k61490k49157j05182
7031b89029n5645p5907J55574J76661j14098p1761M9401J46890m278m3647K255
7020a23584J15337N165m20413k14715J49165J48625M948K48434J08894l33510
$$ plain form
7010 -311654 -340694 -241298 -205224 -2513 80021 18548 107382 -108925 -354740 -580819 -368459
6999 -368459 -237248 -370000 -467009 -487182 -625123 -553075 -426818 -141366 4867 367335
6989 367335 594326 553059 423724 457207 327966 82713 -48580 68764 158011 64655
6979 64655 22416 247560 411793 434876 419983 391501 524592 632740 560644 744420 354744
6968 354744 98310 -6030 -31501 -17619 -86701 -231148 -282374 -165049 -120123 -35799 112038
6957 112038 -15806 -209190 -194850 -117134 -15771 42576 -70518 -186751 -193108 -316015 -355032
6946 -355032 -338596 -325784 -415766 -518671 -486433 -337070 -130132 -166949 -313410 -435986 -289130
6935 -289130 -82507 -103659 -139625 -45629 -246748 -329177 -142912 -84033 -196475 -42484 43670
$$ packed form
7010c11654k9040R9396L6074K02711Q2534o1473Q8834k16307k45815k26079K12360
6999c68459J31211j32752r7009k0173j37941P2048J26257K85452J46233L62468
6989C67335K26991m1267j29335L3483j29241k45253j31293J17344Q9247r3356
6979F4655m2239K25144J64233K3083j4893k8482J33091J08148p2096J83776l89676
6968C54744k56434j04340k5471J3882o9082j44447n1226J17325M4926Q4324J47837
6957A12038j27844j93384J4340P7716J01363N8347j13094j16233o357j22907l9017
6946c55032J6436J2812q9982j02905L2238J49363K06938l6817j46461j22576J46856
6935b89130K06623k1152l5966R3996k01119q2429J86265N8879j12442J53991Q6154
$$ plain form
6924 43670 173524 49101 283055 183997 -45314 93983 -20960 38749 153789 -239041
6914 -239041 -517447 -619740 -529622 -423536 -451436 -247433 -121234 -168207 -443624 -326270
6904 -326270 201393 184717 52792 118549 62856 238343 289574 489017 259101 53579
6894 53579 181160 197868 89523 -47249 -138208 -174737 -301815 -318725 -283308 -565224 -705869
6883 -705869 -639406 -358828 -355261 -248394 -247343 -193806 -117184 -50101 22749 -107882 26353
6872 26353 -46232 108874 74457 56085 -35629 -215368 -187324 90810 -59399 -443810 -443078
6861 -443078 -248915 -60108 172070 185397 74255 -31085 -274445 -284837 -152551 -70930
6851 -70930 -52865 -83296 -148349 -88294 -184961 -118751 10477 -205804 -466499 -412070 -317572
$$ packed form
6924D3670J29854j24423K33954r9058k29311J39297j14943N9709J15040l92830
6914b39041k78406j02293R0118J06086k7900K04003J26199m6973k75417J17354
6904c26270N27663j6676j31925O5757n5693J75487N1231J99443k29916k05522
6894E3579J27581J6708j08345j36772r0959l6529j27078j6910L5417k81916j40645
6883g05869O6463K80578L567J06867J051N3537P6622O7083P2850j30631J34235
6872B6353p2585J55106l4417j8372r1714j79739K8044K78134j50209l84411P32
6861d43078J94163J88807K32178J3327j11142j05340k43360j0392J32286Q1621
6851g0930J8065l0431o5053O0055r6667O6210J29228k16281k60695N4429R4498
$$ plain form
6840 -317572 -103697 26889 -38124 -701 3596 219946 109812 125728 -35237 -266390 -124947
6829 -124947 -228019 -122691 63163 224815 239858 47048 -78413 -199625 -198347 -80587
6819 -80587 370962 558853 442862 260683 215000 173720 132686 -9376 66353 103339 36318
6808 36318 258305 -125457 -200405 -229571 -336352 -251685 -89298 161041 22183 86795 177562
6797 177562 -83554 -162886 -52928 102899 191049 188206 117257 -8678 -121800 -161117 -103236
$$ packed form
6840c17572K13875J30586o5013L7423M297K16350j10134J5916j60965k31153J41443
6829a24947j03072J05328J85854J61652J5043j92810j25461j21212J278J17760
6819h0587M51549J87891j15991j82179m5683m1280m1034j42062P5729L6986o7021
6808C6318K21987l83762p4948k9166j06781Q4667J62387K50339j38858O4612R0767
6797A77562k61116p9332J09958J55827Q8150k843p0949j25935j13122l9317N7881
$$ [...]
##END NTUPLES=NMR SPECTRUM
##END=
