##TITLE=Analysis number 317429
Compound Code cc 28709
Book Reference 407/111
Project Code qc-cat
Chemist Name andyw
##JCAMPDX= 6.0         $$ Bruker NMR JCAMP-DX V2.0
##DATA TYPE= NMR SPECTRUM
##DATA CLASS= NTUPLES
##ORIGIN= Bruker BioSpin GmbH
##OWNER= nmr
$$ XWIN-NMR		Version 3.5
$$ Mon Feb 20 14:49:04 2006 GMT Standard Time (UT+0h)  MAYBRIDGE\nmr@NMR_250MHZ
##.OBSERVE FREQUENCY= 250.131544655141
##.OBSERVE NUCLEUS= ^1H
##.ACQUISITION MODE= SIMULTANEOUS (DQD)
##.ACQUISITION SCHEME= undefined
##.AVERAGES= 16
##.DIGITISER RES= 18
##SPECTROMETER/DATA SYSTEM= dpx250
##.PULSE SEQUENCE= zg30
##.SOLVENT NAME= CDCl3
##.SHIFT REFERENCE= (INTERNAL, CDCl3, 0, 16.4336)
##AUDIT TRAIL= $$ (NUMBER, WHEN, WHO, WHERE, WHAT)
$$ ##TITLE= Audit trail, XWIN-NMR		Version 3.5
$$ ##JCAMPDX= 5.01
$$ ##ORIGIN= Bruker BioSpin GmbH
$$ ##OWNER= nmr
$$ C:\u/data/dgb/nmr/ADRS/16330/pdata/1/auditp.txt
$$ ##AUDIT TRAIL=  $$ (NUMBER, WHEN, WHO, WHERE, WHAT)
(   1,<2006-02-20 14:48:17.22 +000>,<MAYBRIDGE\nmr>,<NMR_250MHZ>,
      <created by zg, POWCHK disabled, PULCHK disabled
       configuration hash MD5:
       84 BC 41 DB A1 6E 1D 46 DA 25 12 A5 C1 ED C5 3A
       data hash MD5: 64K
       8D 7B 00 31 8B A1 6A ED 7D F6 A4 12 6A 95 5F 2F>)
(   2,<2006-02-20 14:48:38.22 +000>,<MAYBRIDGE\nmr>,<NMR_250MHZ>,
      <Start of raw data processing
       ef LB = 0.3 FT_mod = 6 PKNL = 1 SI = 32K 
       data hash MD5: 32K
       BB 8C 5F 16 B7 39 1B EC F7 F3 1F 40 C6 72 6A 26>)
(   3,<2006-02-20 14:48:43.17 +000>,<MAYBRIDGE\nmr>,<NMR_250MHZ>,
      <apk 
       data hash MD5: 32K
       F2 0F 53 39 DA D4 3B D1 BD 2E EB E4 96 60 F9 6B>)
(   4,<2006-02-20 14:48:44.61 +000>,<MAYBRIDGE\nmr>,<NMR_250MHZ>,
      <abs ABSG = 5 
       data hash MD5: 32K
       A0 EE 1C E2 D0 A3 B1 31 2D 30 DF 40 B9 77 BE 60>)
$$ ##END=
$$ 
$$ hash MD5
$$ CB 3D 56 72 03 19 69 AA 16 B5 67 26 51 9E 00 2B
##$RELAX= 
##$RELAX= 
##$RELAX= 
##$RELAX= 
##$RELAX= 
##$RELAX= 
##$RELAX= 
$$ Bruker specific parameters
$$ --------------------------
##$DU= <C:\u>
##$EXPNO= 16330
##$NAME= <ADRS>
##$PROCNO= 1
##$TYPE= <nmr>
##$USER= <dgb>
##$AMP= (0..31)
100 100 100 100 100 100 100 100 100 100 100 100 100 100 100 100 100 100 
100 100 100 100 100 100 100 100 100 100 100 100 100 100 
##$AQSEQ= 0
##$AQ_mod= 3
##$AUNM= <au_zg>
##$AUTOPOS= <38 >
##$BF1= 250.13
##$BF2= 250.13
##$BF3= 250.13
##$BF4= 250.13
##$BF5= 500.13
##$BF6= 500.13
##$BF7= 500.13
##$BF8= 500.13
##$BYTORDA= 1
##$CFDGTYP= 0
##$CFRGTYP= 5
##$CHEMSTR= <none>
##$CNST= (0..31)
1 1 145 1 1 1 1 1 1 1 1 1 1 1 1 1 1 1 1 1 1 1 1 1 1 1 1 1 1 1 1 1 
##$CPDPRG= <>
##$CPDPRG1= <>
##$CPDPRG2= <>
##$CPDPRG3= <>
##$CPDPRG4= <mlev>
##$CPDPRG5= <mlev>
##$CPDPRG6= <mlev>
##$CPDPRG7= <mlev>
##$CPDPRG8= <mlev>
##$CPDPRGB= <>
##$CPDPRGT= <>
##$D= (0..31)
0 1 0 0 0 0 0 0 0 0.06 0 0 0 0 0 0 0.0002 0 0 0 0 0 0 0 0 0 0 0 0 0 0 
0 
##$DATE= 1140446895
##$DBL= (0..7)
120 120 120 120 120 120 120 120 
##$DBP= (0..7)
150 150 150 150 150 150 150 150 
##$DBP07= 0
##$DBPNAM0= <>
##$DBPNAM1= <>
$$ [...]
##$SUBNAM7= <"">
##$SUBNAM8= <"">
##$SUBNAM9= <"">
##$SW= 20.6930455092707
##$SWIBOX= (0..15)
0 0 3 0 0 0 0 0 0 0 0 0 0 0 0 0 
##$SW_h= 5175.983436853
##$TD= 65536
##$TD0= 1
##$TE= 294.16
##$TE2= 300
##$TE3= 300
##$TEG= 300
##$TL= (0..7)
0 120 120 120 120 120 120 120 
##$TP= (0..7)
150 150 150 150 150 150 150 150 
##$TP07= 0
##$TPNAME0= <>
##$TPNAME1= <>
##$TPNAME2= <>
##$TPNAME3= <>
##$TPNAME4= <>
##$TPNAME5= <>
##$TPNAME6= <>
##$TPNAME7= <>
##$TPOAL= (0..7)
0.5 0.5 0.5 0.5 0.5 0.5 0.5 0.5 
##$TPOFFS= (0..7)
0 0 0 0 0 0 0 0 
##$TUNHIN= 0
##$TUNHOUT= 0
##$TUNXOUT= 0
##$USERA1= <user>
##$USERA2= <user>
##$USERA3= <user>
##$USERA4= <user>
##$USERA5= <user>
##$V9= 5
##$VALIST= <valist>
##$VCLIST= <CCCCCCCCCCCCCCC>
##$VD= 0
##$VDLIST= <DDDDDDDDDDDDDDD>
##$VPLIST= <PPPPPPPPPPPPPPP>
##$VTLIST= <TTTTTTTTTTTTTTT>
##$WBST= 1024
##$WBSW= 4
##$XGAIN= (0..3)
0 0 0 0 
##$XL= 0
##$YL= 0
##$YMAX_a= 340116
##$YMIN_a= -586370
##$ZGOPTNS= <>
##$ZL1= 120
##$ZL2= 120
##$ZL3= 120
##$ZL4= 120
##$ABSF1= 16.43361
##$ABSF2= -4.25956
##$ABSG= 5
##$ABSL= 3
##$ALPHA= 0
##$AQORDER= 0
##$ASSFAC= 0
##$ASSFACI= 0
##$ASSFACX= 0
##$ASSWID= 0
##$AUNMP= <proc_1d>
##$AZFE= 0.1
##$AZFW= 0.1
##$BCFW= 0
##$BC_mod= 0
##$BYTORDP= 0
##$COROFFS= 0
##$CY= 12.5
##$DATMOD= 1
##$DC= 0
##$DFILT= <>
##$DTYPP= 0
##$F1P= 14.0000005364418
##$F2P= -0.99999901652339
##$FCOR= 0.5
##$FTSIZE= 32768
##$FT_mod= 6
##$GAMMA= 0
##$GB= 0
##$INTBC= 1
##$INTSCL= 1
##$ISEN= 128
##$LB= 0.3
##$LEV0= 0
##$LPBIN= 0
##$MAXI= 10000
##$MC2= 0
##$MEAN= 0
##$ME_mod= 0
##$MI= 0
##$NCOEF= 0
##$NC_proc= -5
##$NLEV= 6
##$NOISF1= 0
##$NOISF2= 0
##$NSP= 0
##$NTH_PI= 0
##$NZP= 0
##$OFFSET= 16.43361
##$PC= 1
##$PHC0= -118.565
##$PHC1= 8.61343
##$PH_mod= 1
##$PKNL= yes
##$PPARMOD= 0
##$PSCAL= 4
##$PSIGN= 0
##$REVERSE= no
##$SF= 250.130022108057
##$SI= 32768
##$SIGF1= 0
##$SIGF2= 0
##$SINO= 400
##$SIOLD= 32768
##$SREGLST= <1H.CDCl3>
##$SSB= 0
##$STSI= 32768
##$STSR= 0
##$SW_p= 5175.98343685301
##$SYMM= 0
##$S_DEV= 0
##$TDeff= 65536
##$TDoff= 0
##$TI= <Analysis number 999999
Compound Code 99
Book Reference 9
Project Code 9>
##$TILT= no
##$TM1= 0
##$TM2= 0
##$TOPLEV= 0
##$USERP1= <user>
##$USERP2= <user>
##$USERP3= <user>
##$USERP4= <user>
##$USERP5= <user>
##$WDW= 1
##$XDIM= 32768
##$YMAX_p= 302217889
##$YMIN_p= -472783
$$ End of Bruker specific parameters
$$ ---------------------------------
##NTUPLES= NMR SPECTRUM
##VAR_NAME=  FREQUENCY,     SPECTRUM/REAL,   SPECTRUM/IMAG
##SYMBOL=    X,             R,               I
##VAR_TYPE=  INDEPENDENT,   DEPENDENT,       DEPENDENT
##VAR_FORM=  AFFN,          ASDF,            ASDF
##VAR_DIM=   32768,         32768,           32768
##UNITS=     HZ,            ARBITRARY UNITS, ARBITRARY UNITS
##FACTOR=    0.157963299565203, 1,           1
##FIRST=     4110.53946176873, 0,            0
##LAST=      -1065.44397508428, 0,           0
##MIN=       -1065.44397508428, -472783,     0
##MAX=       4110.53946176873, 302217889,    0
$$ Real data points
##PAGE= N=1
##DATA TABLE= (X++(R..R)), XYDATA
$$ [...]
$$ plain form
19612 5042312 4932153 4950070 4842898 4855428 4761665 4744673 4595475 4422892 4469659 4471706 4352588
19601 4352588 4354169 4317219 4284847 4303121 4216829 4055976 4001182 4014357 3954688 3845549 3857038
19590 3857038 3831538 3755755 3887699 3948855 3866907 3817736 3754531 3648944 3658293 3700993 3755777
19579 3755777 3667696 3634795 3628604 3583531 3435246 3492157 3567254 3553768 3523351 3476029 3353502
19568 3353502 3299638 3376995 3232304 3185773 3242690 3256844 3133262 2999628 3067591 2969728 2992461
19557 2992461 3078753 2993377 3011412 3077415 3033788 2820321 2814923 2788225 2699908 2608364 2679076
19546 2679076 2769295 2733726 2685047 2618210 2776458 2761615 2655728 2489005 2309125 2288537
19536 2288537 2406767 2483210 2573754 2503821 2457974 2509686 2576712 2659980 2535754 2522947 2441442
$$ packed form
19612E042312j10159J7917j07172J2530r3763j6992j49198j72583M6767K047j19118
19601D352588J581l6950l2372J8274q6292j60853n4794J3175n9669j09139J1489
19590C857038k5500p5783J31944O1156q1948m9171o3205j05587R349M2700N4784
19579C755777q8081l2901o191m5073j48285N6911P5097j3486l0417m7322j22527
19568C353502n3864P7357j44691m6531N6917J4154j23582j33634O7963r7863K2733
19557B992461Q6292q5376J8035O6003m3627k13467n398k6698q8317r1544P0712
19546B679076R0219l5569m8679o6837J58248j4843j05887j66723j79880k0588
19536B288537J18230P6443R0544o9933m5847N1712O7026Q3268j24226j2807q1505
$$ plain form
19525 2441442 2266549 2263562 2284681 2250467 2321564 2276149 2256196 2233085 2125410 2083942 2082267
19514 2082267 2114131 2167973 2158174 2061041 2062354 2071085 2099179 2248869 2460816 2478898 2492532
19503 2492532 2478750 2387761 2299157 2128202 2092420 2232671 2111931 1971618 2011861 2159901
19493 2159901 2218031 2098193 2192838 2353445 2329846 2382064 2356529 2259399 2201384 2107264 2075713
19482 2075713 2081273 2061240 2007503 1958698 1936011 1858443 1892238 1885711 1851628 1917344 1921526 1866316
19470 1866316 1785913 1794593 1877695 1749182 1728533 1735813 1727185 1701702 1631052 1533331 1489236 1422204
19458 1422204 1512447 1611117 1578687 1491273 1473711 1397431 1344195 1405555 1328191 1252376 1307224
19447 1307224 1433429 1487821 1496806 1426660 1287676 1287240 1462498 1632106 1593618 1427431 1315296
$$ packed form
19525B441442j74893k987K1119l4214P1097m5415j9953k3111j07675m1468j675
19514B082267L1864N3842r799r7133J313Q731K8094J49690K11947J8082J3634
19503B492532j3782r0989q8604j70955l5782J40251j20740j40313M0243J48040
19493B159901N8130j19838R4645J60607k3599N2218k5535r7130n8015r4120l1551
19482B075713N560k0033n3737m8805k2687p7568L3795o527l4083O5716M182n5210
19470A866316q0403Q680Q3102j28513k0649P280q628k5483p0650r7721m4095o7032
19458A422204R0243R8670l2430q7414j7562p6280n3236O1360p7364p5815N4848
19447A307224J26205N4392Q985p0146j38984m36J75258J69608l8488j66187j12135
$$ plain form
19436 1315296 1215444 1222504 1286573 1304943 1342766 1414650 1276956 1178883 1337692 1328103 1384658
19425 1384658 1397933 1450222 1498952 1432322 1515380 1444941 1332046 1275884 1265177 1222514 1179783
19414 1179783 1243022 1251277 1247390 1283361 1350540 1363362 1239432 1154298 1233615 1201587 1097569
19403 1097569 1033272 1032358 1060249 1034024 964004 964470 1101975 1181406 1211550 1207239 1085945 1015329
19391 1015329 989947 1090713 1116883 1206573 1272620 1217814 1125821 941537 932934 959964 887293
19380 887293 769707 771323 767444 870185 894140 1029494 1014653 995408 1029903 1009193 1002805
19369 1002805 1002954 976967 920332 862826 792807 784603 816416 811502 715931 668245 680322 692342
19357 692342 734518 825494 943174 1037126 1001290 956437 901289 955232 1024012 1010541 1038682
$$ packed form
19436A315296r9852P060O4069J8370L7823P1884j37694r8073J58809r589N6555
19425A384658J3275N2289M8730o6630Q3058p0439j12895n6162j0707m2663m2731
19414A179783O3239Q255l887L5971O7179J2822j23930q5134P9317l2028j04018
19403A097569o4297r14K7891k6225p0020M66J37505P9431L0144m311j21294p0616
19391A015329k5382J00766K6170Q9690O6047n4806r1993j84284q603K7030p2671
19380H87293j17586J616l879J02741K3955J35354j4841j9245L4495k0710o388
19369A002805J49k5987n6635n7506p0019q204L1813m914r5571m7686J2077J2020
19357F92342M2176R0976J17680R3952l5836m4853n5148N3943O8780j3471K8141
$$ plain form
19346 1038682 962307 789622 845844 909161 876796 787546 848107 842993 804728 706784 561329
19335 561329 571747 484528 582179 698843 704288 697859 765667 750114 719320 716430 680147 745749
19323 745749 676079 619924 540809 586734 593283 490793 542553 642324 748625 698206 662972
19312 662972 697220 704530 715372 740282 749841 708652 605779 603737 656875 696684 627969 614121
19300 614121 581880 670910 754086 804249 885144 921112 786012 733808 755729 655004 591596
19289 591596 518032 516109 464313 596061 559201 476816 546546 547318 464567 427600 451152 513063
19277 513063 525513 504445 514982 603619 766193 866107 718964 608649 605710 553571 573743
19266 573743 492211 395053 421597 488972 474086 478716 567566 412879 272636 281758 322853
$$ packed form
19346A038682p6375j72685N6222O3317l2365q9250O0561n114l8265r7944j45455
19335E61329J0418q7219R7651J16664N445o429O7808j5553l0794k890l6283O5602
19323G45749o9670n6155p9115M5925O549j02490N1760R9771J06301n0419l5234
19312F62972L4248P310J0842K4910R559m1189j02873k042N3138L9809o8715j3848
19300F14121l2241Q9030Q3176N0163Q0895L5968j35100n2204K1921j00725o3408
19289E91596p3564j923n1796J31748l6860q2385O9730P72q2751l6967K3552O1911
19277E13063J2450k1068J0537Q8637J62574R9914j47143j10315k939n2139K0172
19266E73743q1532r7158K6544O7375j4886M630Q8850j54687j40243R122M1095
$$ plain form
19255 322853 298350 315565 351404 395501 406945 466750 543294 513424 443610 434607 615775
19244 615775 582475 497057 459518 419777 344203 331970 418717 436715 470267 410362 372995
19233 372995 396359 379146 473592 465617 449554 395927 417168 312089 248946 198409 217342
19222 217342 281842 359052 387629 369806 333989 511156 566696 581181 598966 600114 555064
19211 555064 520317 461588 388516 434401 388709 356799 388035 439435 479934 387977 298930
19200 298930 228824 238226 381416 474073 482856 403836 340678 281042 232099 273200 345323 358384
19188 358384 355244 360062 325386 341655 390994 425245 361957 408836 315656 254038 217122 227356
19176 227356 348196 192427 248441 232218 89913 96747 276662 289380 318543 356321 415382
$$ packed form
19255C22853k4503J7215L5839M4097J1444N9805P6544k9870o9814r003J81168
19244F15775l3300q5418l7539l9741p5574j2233Q6747J7998L3552n9905l7367
19233C72995K3364j7213R4446p975j6063n3627K1241j05079o3143n0537J8933
19222B17342O4500P7210K8577j7823l5817J77167N5540J4485J7785J148m5050
19211E55064l4747n8729p3072M5885m5692l1910L1236N1400M0499r1957q9047
19200B98930p0106R402J43190R2657Q783p9020o3158n9636m8943M1101P2123J3061
19188C58384l140M818l4676J6269M9339L4251o3288M6879r3180o1618l6916J0234
19176B27356J20840j55769N6014j6223j42305O834J79915J2718K9163L7778N9061
$$ plain form
19165 415382 455366 448819 411008 288122 235746 309865 288478 212929 280908 207944 248779
19154 248779 351090 323193 312178 228626 136505 183642 360168 370392 367486 464685 416750
19143 416750 388068 378236 278719 254946 302487 425135 379266 315439 319257 382839 379586 320571
19131 320571 289222 227074 203004 229806 284122 313373 376605 349197 275161 316159 287088
19120 287088 251962 230738 309316 378800 353229 375768 308797 356228 263275 123902 96737
19109 96737 241600 345866 393760 419304 253984 122102 260674 379460 340511 225839
19099 225839 133020 89669 79442 174281 224257 242150 251732 163709 135378 234176 284125 242230
19087 242230 210311 297572 284282 349191 344551 148281 94439 185659 114370 19557 24278 53355
$$ packed form
19165D15382L9984o547l7811j22886n2376P4119k1387p5549O7979p2964M0835
19154B48779J02311k7897j1015q3552r2121M7137J76526J0224k906R7199m7935
19143D16750k8682r832r9517k3773M7541J22648m5869o3827L818O3582l253n9015
19131C20571l1349o2148k4070K6802N4316K9251O3232k7408p4036M0998k9071
19120B87088l5126k1224P8578O9484k5571K2539o6971M7431r2953j39373k7165
19109I6737J44863J04266M7894K5544j65320j31882J38572J18786l8949j14672
19099B25839r2819m3351j0227R4839M9976J7893R582q8023k8331R8798M9949m1895
19087B42230l1919Q7261j3290O4909m640j96270n3842R1220p1289r4813M721K9077
$$ plain form
19075 53355 65014 14977 74244 137130 216810 351079 282417 188313 130376 97019 168415
19064 168415 145456 46373 74412 176405 150807 9882 -44868 28681 208147 239578 194966
19053 194966 117951 247179 279169 251670 223166 312575 200119 180668 107415 39039 15234
19042 15234 -95953 -64861 98288 157047 166379 90534 122189 184375 158180 193514 335791
19031 335791 287897 123591 42649 -30009 -90104 -80020 103830 157252 87589 118234 203963
19020 203963 195633 227912 233185 187893 236452 248936 183566 208934 259258 302315 388360 263383
19008 263383 164656 243858 241054 170124 159827 44186 68654 88440 163660 345052 384087
18997 384087 342408 286794 203699 329375 263437 232721 185768 195752 282689 224046 182855
$$ packed form
19075E3355J1659n0037N9267O2886P9680J34269o8662r4104n7937l3357P1396
19064A68415k2959r9083K8039J01993k5598j40925n4750P3549J79466L1431m4612
19053A94966p7015J29228L1990k7499k8504Q9409j12456j9451p3253o8376k3805
19042A5234j11187L1092J63149N8759R332p5845L1655O2186k6195L5334J42277
19031C35791m7894j64306q0942p2658o0095J0084J83850N3422o9663L0645Q5729
19020B03963q330L2279N273m5292M8559J2484o5370K5368N0324M3057Q6045j24977
19008B63383r8727P9202k804p0930j0297j15641K4468J9786P5220J81392L9035
18997C84087m1679n5614q3095J25676o5938l0716m6953R984Q6937n8643m1191
$$ plain form
18986 182855 169957 95093 -3351 -46458 -47942 122 45915 125797 87866 193460 25221
18975 25221 -27337 -102242 -132772 -202238 -121794 -149565 -91190 33444 56928 110242 278751
18964 278751 258660 303494 310779 238336 245949 158656 232712 189119 168415 127969 172202 165309
18952 165309 144272 127152 105346 182325 177198 189521 257930 229713 142377 100596 149014 101012
18940 101012 177094 149632 187436 179243 211882 265080 296856 243469 101541 92478 29614 120894
18928 120894 232859 265167 316044 211576 129702 124669 67800 -5180 -111745 -96598 -50444
18917 -50444 -33186 85730 238545 229888 203384 229932 216700 144997 69733 148693 103406
18906 103406 -29224 -103086 -58830 -51982 34314 155829 292050 286422 139391 47181 36895
$$ packed form
18986A82855j2898p4864r8444m3107j484M8064M5793P9882l7931J05594j68239
18975B5221n2558p4905l0530o9466Q0444k7771N8375J24634K3484N3314J68509
18964B78751k0091M4834P285p2443P613q7293P4056m3593k0704m0446M4233o893
18952A65309k1037j7120k1806P6979n127J2323O8409k8217q7336m1781M8418m8002
18940A01012P6082k7462L7804q193L2639N3198L1776n3387j41928r063o2864R1280
18928A20894J11965L2308N0877j04468q1874n033n6869p2980j06565J5147M6154
18917e0444J7258J18916J52815q657k6504K6548j3232p1703p5264P8960m5287
18906A03406j32630p3862M4256O848Q6296J21515J36221n628j47031r2210j0286
$$ plain form
18895 36895 111837 185812 140415 131493 165066 211517 280678 108227 185608 238237 237758 255814
18883 255814 198856 169286 191824 143207 228435 279437 253513 172774 212865 169374 76848
18872 76848 122302 155147 98461 20584 63627 49253 13105 42802 19406 -3400 -2035 122849
18860 122849 157215 125060 64235 -5692 51659 -18130 -74114 40742 -29302 -140604 -117639
18849 -117639 -139482 -68783 -53502 34550 88843 -49636 -41795 -13525 15643 20127 75825 158976
18837 158976 164055 150331 236314 284371 163243 173647 169412 126992 128637 151344 190913 117639
18825 117639 166647 281228 277892 283060 236675 223550 130396 87483 132888 127706 287580 386476
18813 386476 466317 495843 525467 612178 598449 537559 487188 581435 640939 654223 705184
$$ packed form
18895C6895P4942P3975m5397q922L3573M6451O9161j72451P7381N2629m79J8056
18883B55814n6958k9570K2538m8617Q5228N1002k5924q0739M0091m3491r2526
18872G6848M5454L2845n6686p7877M3043j4374l6148K9697k3396k2806J365J24884
18860A22849L4366l2155o0825o9927N7351o9789n5984J14856p0044j11302K2965
18849a17639k1843P0699J5281Q8052N4293j38479P841K8270K9168M484N5698Q3151
18837A58976N079j3724Q5983M8057j21128J0404m235m2420J645K2707L9569p3274
18825A17639M9008J14581l336N168m6385j3125r3154m2913M5405n182J59874R8896
18813C86476P9841K9526K9624Q6711j3729o0890n0371R4247N9504J3284N0961
$$ plain form
18802 705184 808690 906315 970985 879438 730463 672702 707678 646166 588385 503691 515064
18791 515064 533088 488822 472096 319493 159752 207550 249945 245544 262422 250929 176976
18780 176976 173126 265249 202272 -4483 -17337 11511 16360 204658 247699 240496 296453 357588
18768 357588 422364 395466 582772 777603 1068751 1367852 1386765 1163895 1047401 1117091
18758 1117091 1189995 1297206 1189334 1156760 1137480 1170388 1246852 1267239 1156728 1067863 1129298
18747 1129298 1184126 1158840 1107095 945730 819693 812490 632756 447538 369295 326318 417884
18736 417884 412139 362998 388094 213331 236169 171598 97825 143976 193834 236926 173650
18725 173650 210057 228846 215806 288835 92024 -22038 -11420 22817 -78463 -110518 -17989
$$ packed form
18802G05184J03506R7625O4670r1547j48975n7761L4976o1512n7781q4694J1373
18791E15064J8024m4266j6726j52603j59741M7798M2395m401J6878j1493p3953
18780A76976l850R2123o2977k06755j2854K8848M849J88298M3041p203N5957O1135
18768C57588O4776k6898J87306J94831K91148K99101J8913k22870j16494O9690
18758A117091P2904J07211j07872l2574j9280L2908P6464K0387j10511q8865O1435
18747A129298N4828k5286n1745j61365j26037p203j79734j85218p8243m2977R1566
18736D17884n745m9141K5096j74763K2838o4571p3773M6151M9858M3092o3276
18725A73650L6407J8789j3040P3029j96811j14062J0618L4237j01280l2055R2529
$$ plain form
18714 -17989 85813 169978 191652 137086 91975 294686 307045 326058 269470 247471 284681
18703 284681 233273 173332 170533 197110 320049 315751 244929 274648 259301 253247 168023 70067
18691 70067 4792 16158 35428 29536 460 110795 199164 276934 294801 322846 325317 327103
18679 327103 315696 280782 397096 520003 644094 746890 868724 1068980 1095555 979824
18669 979824 797060 603700 541899 562902 597902 471253 451548 425763 371755 514415 604266
18658 604266 777109 1016859 1137031 1158946 1200655 1255817 1291496 1445544 1379960 1230575
18648 1230575 1042925 901114 735123 604576 549424 633879 734736 640989 510445 578994
18638 578994 893137 1021305 973852 1027130 1063248 1115918 864321 677212 534699 406414
$$ packed form
18714a7989J03802Q4165K1674n4566m5111K02711J2359J9013n6588k1999L7210
18703B84681n1408n9941k799K6577J22939m298p0822K9719j5347o054q5224r7956
18691G0067o5275J1366J9270n892k9076J10335Q8369P7770J7867K8045K471J786
18679C27103j1407l4914J16314J22907J24091J02796J21834K00256K6575j15731
18669I79824j82764j93360o1801K1003L5000j26649j9705k5785n4008J42660Q9851
18658F04266J72843K39750J20172K1915M1709N5162L5679J54048o5584j49385
18648A230575j87650j41811j65991j30547n5152Q4455J00857r3747j30544O8549
18638E78994L14143J28168m7453N3278L6118N2670k51597j87109j42513j28285
$$ plain form
18628 406414 400400 241209 226702 222296 196619 165142 90251 77650 89594 227497 250891
18617 250891 129274 105446 135353 153366 66761 127705 118494 68914 66749 37275 39353 50132
18605 50132 188547 286959 285578 209804 105843 124858 146587 215026 292734 328426 313418
18594 313418 299353 213316 347696 522152 480515 344015 226708 82608 78179 39963 -22719
18583 -22719 -63426 -66360 81166 88633 -16316 -56672 50433 175084 267144 306034 307144
18572 307144 295069 180057 218822 338592 454828 550767 630612 713255 737745 682108 595693
18561 595693 608042 689960 615116 544859 532444 513296 458206 447509 379583 381328 351620 359661
18549 359661 398111 516010 439363 303954 304094 442266 369991 315342 334510 225441 13206
$$ packed form
18628D06414o014j59191j4507m406k5677l1477p4891j2601J1944J37903K3394
18617B50891j21617k3828K9907J8013q6605O0944r211m9580k165k9474K078J0779
18605E0132J38415R8412j381p5774j03961J9015K1729O8439P7708L5692j5008
18594C13418j4065q6037J34380J74456m1637j36500j17307j44100m429l8216o2682
18583b2719m0707k934J47526P467j04949m0356J07105J24651R2060L8890J110
18572C07144j2075j15012L8765J19770J16236R5939P9845Q2643K4490n5637q6415
18561E95693J2349Q1918p4844p0257j2415j9148n5090j0697o7926J745k9708Q041
18549C59661L8450J17899p6647j35409J40J38172p2275n4649J9168j09069k12235
$$ plain form
18538 13206 -47805 -29522 117361 100610 5380 -13795 12322 86995 78951 111115 217272
18527 217272 365147 490608 445190 564476 730236 805045 784388 822846 881526 804579 830998
18516 830998 879465 1047505 1306964 1387631 1320294 1170961 1107921 998808 829029 645120
18506 645120 645525 645759 664563 561905 533487 463355 432944 435460 390736 316797 280739 361689
18494 361689 466423 475765 473490 412366 289367 286538 285309 281691 147748 70030 90551 135749
18482 135749 153718 259073 379466 464315 351128 364060 424224 487292 537602 627438 718395
18471 718395 877961 991793 1127207 1148364 1216878 1204715 1128844 1035492 851611 741017
18461 741017 549880 424740 373368 348581 251498 218390 378948 367479 268935 236378 260499
$$ packed form
18538A3206o1011J8283J46883j6751r5230j9175K6117P4673q044L2164J06157
18527B17272J47875J25461m5418J19286J65760P4809k0657L8458N8680p6947K6419
18516H30998M8467J68040K59459Q0667o7337j49333o3040j09113j69779j83909
18506F45120M05K34J8804j02658k8418p0132l0411K516m4724p3939l6058Q0950
18494C61689J04734R342k275o1124j22999k829j229l618j33943p7718K0521M5198
18482A35749J7969J05355J20393Q4849j13187J2932O0164O3068N0310Q9836R0957
18471G18395J59566J13832J35414K1157O8514j2163p5871r3352j83881j10594
18461G41017j91137j25140n1372k4787r7083l3108J60558j1469r8544l2557K4121
$$ plain form
18450 260499 311947 327168 277108 386718 498151 532187 751838 748663 820601 873214 903030
18439 903030 997037 1075250 1075987 1160106 1214140 1186835 1218665 1254126 1346292 1359517 1262844 1031854
18427 1031854 953898 900192 889223 786654 762460 831826 782472 635453 498725 416273 395825
18416 395825 263176 324678 394961 366887 411152 500923 567318 583305 413279 382538 506510
18405 506510 676444 752668 826825 922887 1176729 1305440 1361157 1412642 1547450 1921132
18395 1921132 2207644 2493480 2847391 3108655 3283186 3265602 3236434 3257094 3321545 3309983
18385 3309983 3127654 2889635 2751250 2589020 2500714 2354803 2155875 1984858 1751635 1528536
18375 1528536 1390602 1390565 1315247 1278407 1206352 1235773 1203071 1084531 1078899 1210724 1170649
$$ packed form
18450B60499N1448J5221n0060J09610J11433L4036K19651l175P1938N2613K9816
18439I03030R4007P8213P37Q4119N4034k7305L1830L5461R2166J3225r6673k30990
18427A031854p7956n3706j0969j02569k4194O9366m9354j47019j36728q2452k0448
18416C95825j32649O1502P0283k8074M4265Q9771O6395J5987j70026l0741J23972
18405E06510J69934P6224P4157R6062K53842J28711N5717N1485J34808L73682
18395A921132K86512K85836L53911K61264J74531j7584k9168K0660O4451j1562
18385C309983j82329k38019j38385j62230q8306j45911j98928j71017k33223k23099
18375A528536j37934l7p5318l6840p2055K9421l2702j18540n632J31825m0075
$$ plain form
18364 1170649 1163057 1103894 949475 1002083 1158916 1277671 1389441 1362307 1211100 1269394
18354 1269394 1430753 1350459 1334550 1467769 1684198 1939783 2134706 2400663 2645414 2865562
18344 2865562 2960848 3099155 3337418 3607353 3792628 3910408 3896452 3813049 3883832 4042193
18334 4042193 3975050 4043020 3966006 3901249 3899827 3944496 4146562 4215058 4414439 4609262 4897281
18323 4897281 5307269 5690775 5998153 6571753 7170908 8062807 9247189 10809728 12789923
18314 12789923 15738441 20221823 26733988 35664825 46744019 58827959 70641180 81208109
18306 81208109 89231851 95712863 103519061 112992868 124199350 136399195 145217068 148379668
18298 148379668 146067712 139478908 131867948 125950440 121782001 118254581 112802346 103495846
$$ packed form
18364A170649p592n9163j54419N2608J56833J18755J11770k7134j51207N8294
18354A269394J61359q0294j5909J33219K16429K55585J94923K65957K44751K20148
18344B865562R5286J38307K38263K69935J85275J17780j3956q3403P0783J58361
18334D042193o7143O7970p7014o4757j422M4669K02066O8496J99381J94823K88019
18323D897281M09988L83506L07378N73600N99155Q91899J184382J562539J980195
18314A2789923K948518M483382O512165Q930837J1079194J2083940J1813221J0566929
18306H1208109Q023742O481012P806198R473807J1206482J2199845Q817873L162600
18298A48379668k311956o588804p610960n917508m168439l527420n452235r306500
$$ plain form
18290 103495846 91451638 78623813 66387579 56131851 48350551 42598176 38155638
18283 38155638 34504704 31472599 28807081 26705140 24861917 23280503 21792987 20628736
18275 20628736 19831208 19245959 18643537 18343145 18221094 18325806 18729316 19426986 20661838
18266 20661838 22647881 25785943 30447854 37567380 47944862 61553216 77130712 92890121
18258 92890121 108853341 123195730 134009843 144121682 156277340 169559041 184673340
18251 184673340 199799799 209860442 213251126 209817445 200977138 191216469 182589726 175195954
18243 175195954 168666450 159501901 145208914 128202543 110198319 92732305 77964077
18236 77964077 66748664 58195550 51601969 46278990 41552198 37484683 33799130 30612195
$$ packed form
18290A03495846j2044208j2827825j2236234j0255728p781300n752375m442538
18283C8155638l650934l032105k665518k101941j843223j581414j487516j164251
18275B0628736p97528n85249o02422l00392j22051J04712M03510O97670J234852
18266B0661838J986043L138062M661911P119526J0377482J3608354J5577496J5759409
18258I2890121J5963220J4342389J0814113J0111839J2155658J3281701J5114299
18251A84673340J5126459J0060643L390684l433681q840307r760669q626743p393772
18243A75195954o529504r164549j4292987j7006371j8004224j7466014j4768228
18236G7964077j1215413q553114o593581n322979m726792m067515l685553l186935
$$ plain form
18228 30612195 27788549 25285893 23224160 21326335 19670054 18169637 16685228 15253960
18220 15253960 13925919 12706721 11708622 10991545 10178299 9321409 8711304 8294602 7867459
18211 7867459 7329774 6893671 6487083 6065530 5914117 5706683 5432722 5270103 5083278
18202 5083278 5040078 5052162 5171534 5460334 5800745 6113766 6453600 6606436 6438617 6046385
18192 6046385 5587417 5051313 4588236 4360781 4047782 3855645 3689539 3752925 3877924 3913164
18182 3913164 3880867 3882305 3797275 3915824 4396907 4947315 5527262 6197957 6731994 7068217
18172 7068217 6966618 6266545 5675975 5336112 5058197 4891504 4648675 4340037 4087937
18163 4087937 3864141 3561693 3403377 3220539 3059394 2986745 3037448 2953913 2896409 2795108
$$ packed form
18228C0612195k823646k502656k061733j897825j656281j500417j484409j431268
18220A5253960j328041j219198r98099p17077q13246q56890o10105m16702m27143
18211G867459n37685m36103m06588m21553j51413k07434k73961j62619j86825
18202E083278m3200J2084J19372K88800L40411L13021L39834J52836j67819l92232
18192F046385m58968n36104m63077k27455l12999j92137j66106O3386J24999L5240
18182C913164l2297J438q5030J18549M81083N50408N79947O70695N34037L36223
18172G068217j01599p00073n90570l39863k77915j66693k42829l08638k52100
18163D087937k23796l02448j58316j82838j61145p2649N0703q3535n7504j01301
$$ plain form
18153 2795108 2613007 2445903 2416795 2446761 2482469 2580635 2632993 2731373 2807925 2865213 2978327
18142 2978327 3210455 3451732 3815857 4063199 4251567 4368938 4337436 4209538 4007650 3824281
18132 3824281 3786392 3811195 3816054 3729171 3837149 4164281 4510245 4937636 5380581 5719874
18122 5719874 6170909 6903292 7806868 8827947 9822377 10800030 11893496 13225136 14987471
18113 14987471 17215518 20319725 25173167 32585252 44261211 62854580 92105743 132320869
18105 132320869 173397781 186669483 160367733 125332829 103461355 95073293 97253012
18098 97253012 109146762 130030883 157232503 182194085 195078234 192611319 175596226
18091 175596226 149963766 124877910 106179524 94491424 88273453 86404610 88578147
$$ packed form
18153B795108j82101j67104k9108K9966L5708R8166N2358R8380P6552N7288J13114
18142B978327K32128K41277L64125K47342J88368J17371l1502j27898k01888j83369
18132C824281l7889K4803M859q6883J07978L27132L45964M27391M42945L39293
18122E719874M51035P32383R03576J021079R94430R77653J093466J331640J762335
18113A4987471K228047L104207M853442P412085J1675959J8593369K9251163M0215126
18105A32320869M1076912J3271702k6301750l5034904k1871474q388062K179719
18098I7253012J1893750K0884121K7201620K4961582J2884149k466915j7015093
18091A75596226k5632460k5085856j8698386j1688100o217971j868843K173537
$$ plain form
18084 88578147 95498664 108305041 128494971 156401264 188111482 216085651 235610682
18077 235610682 246789269 252535743 257066454 259626905 255362231 240707248 215423794
18070 215423794 186579712 163516793 150493253 148040328 155510699 172123396 195257340
18063 195257340 220475835 243467548 262392069 275582171 280001932 271642132 251168206
18056 251168206 222323014 188624369 156278205 130591461 111913342 98266602 87672461
18049 87672461 78904076 71293466 64695554 58858458 53571759 48933703 45217864 42235073
18041 42235073 39642104 37221085 34965041 32961061 31357333 30045855 28967608 28050195
18033 28050195 27356214 26811179 26384602 26258236 26852783 28165041 30473493 34304488 40145064
$$ packed form
18084H8578147O920517J2806377K0189930K7906293L1710218K7974169J9525031
18077B35610682J1178587N746474M530711K560451m264674j4654983k5283454
18070B15423794k8844082k3062919j3023540k452925P470371J6612697K3133944
18063A95257340K5218495K2991713J8924521J3190102M419761q359800k0473926
18056B51168206k8845192l3698645l2346164k5686744j8678119j3646740j0594141
18049H7672461q768385p610610o597912n837096n286699m638056l715839k982791
18041D2235073k592969k421019k256044k003980j603728j311478j078247r17413
18033B8050195o93981n45035m26577j26366N94547J312258K308452L830995N840576
$$ plain form
18024 40145064 49197536 62996805 83937834 114337463 154823786 200825307 243051440
18017 243051440 270890424 278688000 267489120 242922439 212868183 183311570 156793620
18010 156793620 133228431 112813128 96119355 83062362 72726521 64285752 57082183
18003 57082183 50975312 45870934 41442374 37708346 34586488 31974771 29820333 27930863
17995 27930863 26281434 24944488 23650748 22474718 21441116 20496768 19673361 18968675
17987 18968675 18295615 17608721 17059214 16676233 16323375 16315110 16579885 17099862 17962084 19537936
17977 19537936 22035572 25551706 30685324 38314894 49851393 67321468 93018575 127684320
17969 127684320 166736983 200532318 218184582 214890194 192769812 159925928 127295745
$$ packed form
18024D0145064R052472J3799269K0941029L0399629M0486323M6001521M2226133
18017B43051440K7838984P797576j1198880k4566681l0054256k9556613k6517950
18010A56793620k3565189k0415303j6693773j3056993j0335841q440769p203569
18003E7082183o106871n104378m428560l734028l121858k611717k154438j889470
17995B7930863j649429j336946j293740j176030j033602r44348q23407p04686
17987A8968675o73060o86894n49507l82981l52858q265K64775N19977Q62222J575852
17977A9537936K497636L516134N133618P629570J1536499J7470075K5697107L4665745
17969A27684320L9052663L3795335J7652264l294388k2120382l2843884l2630183
$$ plain form
17962 127295745 101857205 84547923 72924070 64828699 58821467 53890091 49823436
17955 49823436 46149677 42895620 40223788 38366849 37280229 36773653 37189630 38708866
17947 38708866 41431169 45981539 53397341 64783575 81246846 102601905 125560950
17940 125560950 144968667 162477670 185029515 210702996 226725463 229566420 233491480
17933 233491480 246792564 259636490 261652140 259642964 262908287 263052402 247654644 223024248
17925 223024248 202047280 184002595 161496192 135912092 113697293 97174910 84993057
17918 84993057 75299236 67193899 60614911 55259379 50610290 46322179 42495498 39188347
17910 39188347 36382876 34049546 32007081 30301557 28811262 27736297 26953413 26437332
$$ packed form
17962A27295745k5438540j7309282j1623853q095371o007232m931376m066655
17955D9823436l673759l254057k671832j856939j086620n06576M15977J519236
17947C8708866K722303M550370P415802J1386234J6463271K1355059K2959045
17940A25560950J9407717J7509003K2551845K5673481J6022467K840957L925060
17933B33491480J3301084J2843926K015650k009176L265323J44115j5397758k4630396
17925B23024248k0976968j8044685k2506403k5584100k2214799j6522383j2181853
17918H4993057r693821q105337o578988n355532m649089m288111l826681l307151
17910C9188347k805471k333330k042465j705524j490295j074965p82884n16081
$$ plain form
17902 26437332 26607196 27632313 29842777 33714783 39696553 48071326 57723511 66335557
17894 66335557 73759402 82630744 93570919 101290224 101874706 100663615 102619907 105591177
17886 105591177 104895787 101766864 100678896 100087909 94867853 86087984 78323123 71840487
17878 71840487 63752711 54202470 45717030 39175645 34272046 30505390 27409642 24869267
17870 24869267 22582818 20461264 18828032 17393271 16105499 14813849 13746753 12863840
17862 12863840 11942697 11124700 10415454 9679536 8970133 8409027 7868520 7232629 6687318
17853 6687318 6173896 5688991 5339680 5053482 4908244 4585021 4261027 4161001 4049425
17844 4049425 4038198 3915849 3799515 3598544 3361902 3170343 2998500 2812153 2721149 2606093
$$ packed form
17902B6437332J69864J025117K210464L872006N981770Q374773R652185Q612046
17894F6335557P423845Q871342J0940175P719305N84482j211091J956292K971270
17886A05591177o95390l128923j087968n90987n220056q779869p764861o482636
17878G1840487q087776r550241q485440o541385m903599l766656l095748k540375
17870B4869267k286449k121554j633232j434761j287772j291650j067096q82913
17862A2863840r21143q17997p09246p35918p09403n61106n40507o35891n45311
17853F687318n13422m84905l49311k86198j45238l23223l23994j00026j11576
17844D049425j1227j22349j16334k00971k36642j91559j71843j86347r1004j15056
$$ plain form
17834 2606093 2563091 2505701 2459469 2403591 2357800 2332007 2276066 2158941 2096463 2138035 2037520
17823 2037520 1909848 1898534 1882337 1809033 1736174 1725511 1684241 1671432 1704138 1820259 1908733
17812 1908733 1850322 1737951 1621923 1603350 1506212 1490379 1529847 1569134 1542284 1582483 1478166
17801 1478166 1509240 1536902 1491421 1461582 1479451 1443983 1603408 1715842 1840017 1856861 1885220
17790 1885220 1935144 2028619 2146763 2258156 2266520 2220436 2249624 2235510 2145900 2175514 2210161
17779 2210161 2118939 2047114 1838826 1701952 1691386 1727137 1695254 1635354 1621651 1688578 1858863
17768 1858863 2037120 2071888 1907940 1753026 1800890 1971973 2089977 1942377 1706574 1700137
17758 1700137 1767797 1821961 1794434 1673173 1715591 1735397 1649046 1709971 1770398 1950296 1975813
$$ packed form
17834B606093m3002n7390m6232n5878m5791k5793n5941j17125o2478M1572j00515
17823B037520j27672j1314j6197p3304p2859j0663m1270j2809L2706J16121Q8474
17812A908733n8411j12371j16028j8573r7138j5833L9468L9287k6850M0199j04317
17801A478166L1074K7662m5481k9839J7869l5468J59425J12434J24175J6844K8359
17790A885220M9924R3475J18144J11393Q364m6084K9188j4114q9610K9614L4647
17779B210161r1222p1825k08288j36874j0566L5751l1883n9900j3703O6927J70285
17768A858863J78257L4768j63948j54914M7864J71083J18004j47600k35803o437
17758A700137O7660N4164k7527j21261M2418J9806q6351O0925O0427J79898K5517
$$ plain form
17747 1975813 2048813 2075676 2083717 2182408 2142585 2114180 2271421 2341406 2237532 2265806 2232318
17736 2232318 2115483 2284092 2389653 2247279 2100938 1944109 2040339 2165569 2274851 2138542
17726 2138542 1887892 1730218 1580889 1301658 1025301 951449 1066130 1053104 1075850 1006293
17716 1006293 951574 837364 714345 713003 756636 657330 591011 559175 512696 641576 706065
17705 706065 666438 724193 577355 471239 517265 528352 464781 485094 491618 420313 333516
17694 333516 389539 467533 442202 460254 697002 749009 739684 690184 610799 553632 578576
17683 578576 676077 666867 608271 580789 528424 592940 610372 669259 522173 593542 491418
17672 491418 482393 543670 612012 558348 547668 472323 437295 452913 415421 467216 547136 668898
$$ packed form
17747A975813P3000K6863Q041R8691l9823k8405J57241O9985j03874K8274l3488
17736B232318j16835J68609J05561j42374j46341j56829R6230J25230J09282j36309
17726B138542k50650j57674j49329k79231k76357p3852J14681j3026K2746o9557
17716A006293n4719j14210j23019j342M3633r9306o6319l1836m6479J28880O4489
17705G06065l9627N7755j46838j06116M6026J1087o3571K0313O524p1305q6797
17694C33516N6023P7994k5331J8052K36748N2007r325m9500p9385n7167K4944
17683E78576R7501r210n8596k7482n2365O4516J7432N8887j47086P1369j02124
17672D91418r025O1277O8342n3664j0680p5345l5028J5618l7492N1795P9920J21762
$$ plain form
17660 668898 757537 607080 516523 606794 582008 578705 487997 535216 579317 572419 502339 454915
17648 454915 398562 427200 448480 411127 347680 433631 470016 362131 395544 387129 368302
17637 368302 338152 278014 209421 125760 113626 88426 110388 149335 150696 230313 287396 349246
17625 349246 429582 465519 500055 603587 628323 704509 637214 537418 464108 394111 254578
17614 254578 233217 256972 258156 180969 148300 247193 305410 334257 417939 508828 544696 519049
17602 519049 449831 193404 277351 436682 570227 531713 588410 649066 606846 471153 628226
17591 628226 677014 718421 652137 607459 526607 460347 547226 608452 613364 583470 560139 588298
17579 588298 449103 463316 398712 434319 444108 542229 439645 316300 375363 388923 377373
$$ packed form
17660F68898Q8639j50457r0557R0271k4786l303r0708M7219M4101o898p0080m7424
17648D54915n6353K8638K1280l7353o3447Q5951L6385j07885L3413q415j8827
17637C68302l0150o0138o8593q3661j2134k5200K1962L8947J361P9617N7083O1850
17625C49246Q0336L5937L4536J03532K4736P6186o7295r9796p3310o9997j39533
17614B54578k1361K3755J184p7187l2669R8893N8217K8847Q3682R0889L5868k5647
17602E19049o9218k56427Q3947J59331J33545l8514N6697O0656m2220j35693J57073
17591F28226M8788M1407o6284m4678q0852o6260Q6879O1226M912k9894k3331K8159
17579E88298j39195J4213o4604L5607R789R8121j02584j23345N9063J3560j1550
$$ plain form
17568 377373 423320 354329 375901 420604 386978 474285 480454 406160 541776 561053 453432
17557 453432 676821 812706 915759 1123213 1280028 1257879 1238937 1205549 1146925 1108841
17547 1108841 1002938 801765 633817 653498 566560 569060 528634 489512 546096 444151 265933
17536 265933 268382 311338 425593 430092 296501 200456 63151 183199 333752 428390 449260
17525 449260 436222 385121 407235 379792 361346 329993 250378 166023 197694 388960 617854
17514 617854 806182 1076085 1314195 1515390 1661627 1632919 1685639 1695453 1689937 1744974 1733799
17503 1733799 1778839 1885134 2011083 1978148 1749619 1827693 2040615 2161731 2118532 2153613
17493 2153613 2063317 2066996 2034150 1953577 1982395 1870242 1715757 1503083 1229284 1056045
$$ packed form
17568C77373M5947o8991K1572M4703l3626Q7307O169p4294J35616J9277j07621
17557D53432K23389J35885J03053K07454J56815k2149j8942l3388n8624l8084
17547A108841j05903k01173j67948J9681q6938K500m0426l9122N6584j01945j78218
17536B65933K449M2956J14255M499j33591r6045j37305J20048J50553R4638K0870
17525D49260j3038n1101K2114k7443j8446l1353p9615q4355L1671J91266K28894
17514F17854J88328K69903K38110K01195J46237k8708N2720R814n516N5037j1175
17503A733799M5040J06295J25949l2935k28529P8074K12922J21116m3199L5081
17493B153613r0296L679l2846q0573K8818j12153j54485k12674k73799j73239
$$ plain form
17483 1056045 977301 1103941 1084672 1065871 1064924 1129657 1305710 1437104 1490227 1433598 1407944
17472 1407944 1370361 1246631 1036087 942150 894401 771624 801508 908016 972512 926285
17462 926285 738340 664152 699305 672868 633345 769476 848624 812754 924300 1021687 1043601
17451 1043601 1011799 1007020 1041151 1095003 1036671 1074963 1216125 1315741 1386193 1486458 1740305
17440 1740305 2229195 2548891 2688758 2611240 2466209 2321492 2112950 1863484 1644676 1372009
17430 1372009 1258443 1356442 1373764 1233633 910267 638873 599532 691892 707250 749848
17420 749848 686563 642029 468993 397129 316366 337392 390318 557236 608517 477452 504828
17409 504828 586397 631478 573783 482233 336825 454930 564867 644697 727347 888876 978044
$$ packed form
17483A056045p8744J26640j9269j8801r47O4733J76053J31394N3123n6629k5654
17472A407944l7583j23730k10544r3937m7749j22777K9884J06508O4496m6227
17462I26285j87945p4188L5153k6437l9523J36131P9148l5870J11546R7387K1914
17451A043601l1802m779L4131N3852n8332L8292J41162R9616P0452J00265K53847
17440A740305M88890L19696J39867p7518j45031j44717k08542k49466k18808k72667
17430A372009j13566R7999J7322j40131l23366k71394l9341R2360J5358M2598
17420G49848o3285m4534j73036p1864q0763K1026N2926J66918N1281j31065K7376
17409E04828Q1569M5081n7695r1550j45408J18105J09937P9830Q2650J61529Q9168
$$ plain form
17398 978044 1045849 1102336 1197812 1362130 1311777 1238795 1273775 1244702 1222815 1300093 1393861
17387 1393861 1305772 1211641 1236460 1261205 1134264 1112817 1142071 1060800 1007597 952183 832343
17376 832343 728547 602081 549748 593900 694364 609246 649040 600360 529469 465590 411755
17365 411755 440070 431838 426100 483296 425968 376795 347616 366163 349919 302652 280144 312884
17353 312884 359385 337572 498310 634393 641493 660875 553066 535537 602518 580532 527632
17342 527632 483793 571770 556854 538253 442594 393164 280987 320143 497241 552038 471028
17331 471028 413088 422722 407658 397713 561922 564090 561335 628454 548955 597803 674346 665148
17319 665148 654236 582456 678174 813843 836037 884590 834717 819433 941056 920678 674184
$$ packed form
17398I78044O7805N6487R5476J64318n0353p2982L4980k9073k1887P7278R3768
17387A393861q8089r4131K4819K4745j26941k1447K9254q1271n3203n5414j19840
17376H32343j03796j26466n2333M4152J00464q5118L9794m8680p0891o3879n3835
17365D11755K8315q232n738N7196n7328m9173k9179J8547j6244m7267k2508L2740
17353C12884M6501k1813J60738J36083P100J9382j07809j7529O6981k1986n2900
17342E27632m3839Q7977j4916j8601r5659m9430j12177L9156J77098N4797q1010
17331D71028n7940R634j5064r945J64209K168k755O7119p9499M8848P6543r198
17319F65148j0912p1780R5718J35669K2194M8553m9873j5284J21623k0378k46494
$$ plain form
17308 674184 609129 705302 740388 797662 806903 799878 833552 859488 884691 790667 689348 529735
17296 529735 470283 559496 684119 770715 860362 835395 742947 878570 985784 957450 998419
17285 998419 973380 992847 961268 775347 744214 606312 609052 614286 667619 622721 676391
17274 676391 626413 570109 757220 837915 744008 827292 873007 911189 887191 981788 1089578
17263 1089578 1221815 1238842 1054898 1016494 1036057 1304691 1569016 1685190 1596902 1555277
17253 1555277 1601890 1680394 1795140 2008751 2166899 2601105 2994607 3165076 3499778 3866509
17243 3866509 4183817 4600324 4882179 5232281 5778303 6417888 7152315 8053728 8801725
17234 8801725 9765348 11045859 12765013 15031001 18006044 22151355 28317401 37434739
$$ packed form
17308F74184o5055R6173L5086N7274R241p025L3674K5936K5203r4024j01319j59613
17296E29735n9452Q9213J24623Q6596Q9647k4967r2448J35623J07214k8334M0969
17285I98419k5039J9467l1579j85921l1133j37902K740N234N3333m4898N3670
17274F76391m9978n6304J87111Q0695r3907Q3284M5715L8182k3998R4597J07790
17263A089578J32237J7027j83944l8404J9563K68634K64325J16174q8288m1625
17253A555277M6613P8504J14746K13611J58148M34206L93502J70469L34702L66731
17243C866509L17308M16507K81855L50102N46022O39585P34427R01413P47997
17234H801725R63623J280511J719154K265988K975043M145311O166046R117338
$$ plain form
17226 37434739 51052084 70088233 92970538 112784916 119443117 114083635 109030951
17219 109030951 112737428 124957632 138838276 143305258 134868935 124513331 121949245
17212 121949245 129286062 143377364 156436407 159160326 153649033 151784258 161412306 183275880
17204 183275880 210937067 229650384 226875559 205072046 179576050 163691625 160899934
17197 160899934 167156297 172987105 167935420 153404878 140530857 136298730 141081495 151113566
17189 151113566 157446837 152329840 140343943 132253489 132675979 139181818 143040833 133938577
17181 133938577 113751190 92997185 76648521 64673190 55986012 49635247 44757199
17174 44757199 40765145 36926926 33260106 30021903 27174075 24721605 22615616 20698160
$$ packed form
17226C7434739J3617345J9036149K2882305J9814378O658201n359482n052684
17219A09030951L706477J2220204J3880644M466982q436323j0355604k564086
17212A21949245P336817J4091302J3059043K723919n511293j864775R628048K1863574
17204A83275880K7661187J8713317k774825k1803513k5495996j5884425k791691
17197A60899934O256363N830808n051685j4530542j2874021m232127M782765J0032071
17189A51113566O333271n116997j1985897q090454M22490O505839L859015r102256
17181A33938577k0187387k0754005j6348664j1975331q687178o350765m878048
17174D4757199l992054l838219l666820l238203k847828k452470k105989j917456
$$ plain form
17166 20698160 18828397 17302426 15960172 14753818 13565362 12566895 11676083 10854919
17158 10854919 10052232 9392974 8827871 8265184 7673014 7187171 6665746 6214983 5891687
17149 5891687 5620314 5196130 4897316 4715952 4492707 4256255 3931956 3845926 3644583 3394516
17139 3394516 3140261 2929339 2784434 2759000 2708658 2605053 2517276 2394047 2268532 2128437
17129 2128437 2121210 2110245 2088056 2005132 1917626 1679996 1639804 1584597 1638247 1552159 1505454
17118 1505454 1454538 1268364 1387433 1408945 1268031 1256126 1361726 1361857 1275944 1354801 1414556
17107 1414556 1288335 1274012 1570410 1600287 1380033 1350632 1383927 1360951 1361253 1482022 1558695
17096 1558695 1493960 1292567 1036804 1030449 1177199 1166545 1056622 984675 1021246 908186
$$ packed form
17166B0698160j869763j525971j342254j206354j188456r98467q90812q21164
17158A0854919q02687o59258n65103n62687n92170m85843n21425m50763l23296
17149E891687k71373m24184k98814j81364k23245k36452l24299q6030k01343k50067
17139C394516k54255k10922j44905k5434n0342j03605q7777j23229j25515j40095
17129B128437p227j0965k2189q2924q7506k37630m0192n5207N3650q6088m6705
17118A505454n0916j86174J19069K1512j40914j1905J05600J31q5913P8857N9755
17107A414556j26221j4323K96398K9877k20254k9401L3295k2976L02J20769P6673
17096A558695o4735k01393k55763o355J46750j0654j09923p1947L6571j13060
$$ plain form
17086 908186 881832 1053376 1110084 1150643 1175375 1082891 1133783 1060688 982882 1084623 1112446
17075 1112446 1141283 1047414 923813 940633 855864 830468 844918 909020 895399 825791 818641
17064 818641 855377 914102 852260 701101 671911 658965 694711 754140 639051 533702 598474
17053 598474 592998 679105 768576 767684 743984 773244 763725 648156 601337 614779 708499 701582
17041 701582 645397 552493 514166 540624 579701 517523 541381 546190 664831 658653 528486
17030 528486 459330 528705 612149 744892 711822 642967 646858 668290 547215 354671 270452
17019 270452 267277 297579 319863 318851 413455 462366 474866 510379 595453 663349 583191 576431
17007 576431 600371 575065 510250 547927 473185 495110 546823 544602 508317 489174 371000
$$ packed form
17086I08186k6354J71544N6708M0559K4732r2484N0892p3095p7806J01741K7823
17075A112446K8837r3869j23601J6820q4769k5396J4450O4102j3621o9608p150
17064H18641L6736N8725o1842j51159k9190j2946L5746N9429j15089j05349O4772
17053E98474n476Q6107Q9471q92k3700K9260r519j15569m6819J3442R3720o917
17041G01582n6185r2904l8327K6458L9077o2178K3858M809J18641o178j30167
17030E28486o9156O9375Q3444J32743l3070o8855L891K1432j21075j92544q4219
17019B70452l175L0302K2284j012R4604M8911J2500L5513Q5074O7896q0158o760
17007E76431K3940k5306o4815L7677p4742K1925N1713k221l6285j9143j18174
$$ plain form
16996 371000 414377 501212 600275 600933 680475 740851 789560 738534 596776 527159 424986
16985 424986 406958 409106 479936 582189 648041 734154 712783 729983 622463 621833 686037 732865
16973 732865 606751 516353 544960 482362 473436 491247 437311 305724 169910 111312 141737
16962 141737 164184 308068 295271 246848 297666 340581 321480 291292 366097 456001 428530
16951 428530 424554 319629 248757 309159 332391 326305 385347 347509 389284 471891 541918 456119
16939 456119 349732 270923 162205 207231 244872 278711 315168 325471 373909 445680 434234
16928 434234 548964 637027 538054 374351 342286 365428 345941 373194 514429 635490 714967
16917 714967 585341 519207 568270 644191 838156 920945 1022269 1377709 1903494 2283307
$$ packed form
16996C71000M3377Q6835R9063O58P9542O0376M8709n1026j41758o9617j02173
16985D24986j8028K148P0830J02253O5852Q6113k1371J7200j07520o30O4204M6828
16973G32865j26114r0398K8607o2598q926J7811n3936j31587j35814n8598L0425
16962A41737K2447J43884j2797m8423N0818M2915j9101l0188P4805Q9904k7471
16951D28530l976j04925p0872O0402K3232o086N9042l7838M1775Q2607P0027q5799
16939D56119j06387p8809j08718M5026L7641L3839L6457J0303M8438P1771j1446
16928D34234J14730Q8063r8973j63703l2065K3142j9487K7253J41235J21061P9477
16917G14967j29626o6134M9063P5921J93965Q2789J01324L55440N25785L79813
$$ plain form
16907 2283307 2365611 2133166 2051128 2187066 2283176 2360542 2299781 1929538 1409287 1094275
16897 1094275 881657 842620 851732 902709 873491 1010174 1103333 1209639 1448011 1798546
16887 1798546 2054304 2269997 2452751 2392534 2265866 2288816 2394527 2533533 2419971 2025385
16877 2025385 1786722 1433127 1150197 847115 836694 830408 654410 528623 435646 401756
16867 401756 371980 468010 408509 391639 308293 411110 519669 570007 490944 311132 243408
16856 243408 286549 246159 95329 126149 189954 143109 60881 125039 187205 214239 221032
16845 221032 171075 163836 275059 198322 121267 171465 151755 122366 122605 45538 71683 63121
16833 63121 105735 160078 184936 192039 240847 245462 95849 172630 261756 251724 290132 373849
$$ packed form
16907B283307Q2304k32445q2038J35938R6110P7366o0761l70243n20251l15012
16897A094275k12618l9037R112N0977k9218J36683R3159J06306K38372L50535
16887A798546K55758K15693J82754o0217j26668K2950J05711J39006j13562l94586
16877B025385k38663l53595k82930l03082j0421o286j75998j25787r2977l3890
16867D01756k9776R6030n9501j6870q3346J02817J08559N0338p9063j79812o7724
16856B43408M3141m0390j50830L0820O3805m6845q2228O4158O2166K7034O793
16845B21032m9957p239J11223p6737p7055N0198j9710k9389K39p7067K6145q562
16833F3121M2614N4343K4858P103M8808M615j49613P6781Q9126j0032L8408Q3717
$$ plain form
16821 373849 304557 149408 204342 352647 409234 358623 207830 107621 133737 217970 245037
16810 245037 301082 357018 346380 275892 173879 222252 291877 317696 327566 382266 289269
16799 289269 185260 100327 195530 186641 122087 144854 256174 298052 324320 194668 1439
16788 1439 41002 61026 39997 186668 262672 267799 234749 230747 132558 145537 186807 253856
16776 253856 217278 176535 145696 19028 31615 -53573 -38467 31855 -5883 -67779 32205
16765 32205 161250 207636 139502 101156 120051 31797 -57338 -77918 -57114 -54916 -61747 -51682
16753 -51682 -66586 -14133 33067 5665 -18528 -40356 -156790 -164400 -203220 -194520 -158619 -165293
16741 -165293 -163125 -132509 -144791 -155372 -40301 -51767 -83888 -32292 -30037 609 56607 -110486
$$ packed form
16821C73849o9292j55149N4934J48305N6587n0611j50793j00209K6116Q4233K7067
16810B45037N6045N5936j0638p0488j02013M8373O9625K5819R870N4700r2997
16799B89269j04009q4933R5203q889o4554K2767J11320M1878K6268j29652j93229
16788A439L9563K0024k1029J46671P6004N127l3050m002r8189J2979M1270O7049
16776B53856l6578m0743l0839j26668J2587q5188J5106P0322l7738o1896R9984
16765C2205J29045M6386o8134l8346J8895q8254q9135k0580K0804K198o831J0065
16753e1682j4904N2453M7200k7402k4193k1828j16434p610l8820Q700L5901o674
16741a65293K168L0616j2282j0581J15071j1466l2121N1596K255L0646N5998j67093
$$ plain form
16729 -110486 -188823 -73815 -32212 -36918 -63276 -114125 -67763 23089 101571 76351 155453
16718 155453 100518 89810 122978 139078 60798 60025 232961 300233 222360 138306 197351 189570
16706 189570 93405 93545 197732 316347 421040 441197 323142 278905 202573 192300 138972
16695 138972 79601 122884 163044 133153 85889 53542 64815 116519 150408 106212 9018
16684 9018 91934 231404 260539 294148 343367 376687 179325 80112 123469 85463 115778
16673 115778 277361 480274 568348 680476 688285 670911 683798 715258 835192 879508 805530
16662 805530 703577 806949 911018 911895 932527 969598 888047 823233 907884 1013771 1193222
16651 1193222 1269796 1270555 1155280 987274 919443 808699 807865 850380 866306 906694 895178
$$ packed form
16729a10486p8337J15008M1603m706k6358n0849M6362R0852P8482k5220P9102
16718A55453n4935j0708L3168J6100p8280p73J72936O7272p7873q4054N9045p781
16706A89570r6165J40J04187J18615J04693K0157j18055m4237p6332j0273n3328
16695A38972n9371M3283M0160k9891m7264l2347J1273N1704L3889m4196r7194
16684I018Q2916J39470K9135L3609M9219L3320j97362r9213M3357l8006L0315
16673A15778J61583K02913Q8074J12128P809j7374J2887L1460J19934M4316p3978
16662H05530j01953J03372J04069Q77K0632L7071q1551o4814Q4651J05887J79451
16651A193222P6574P59j15275j68006o7831j10744q34M2515J5926M0388j1516
$$ plain form
16640 895178 901716 975132 1065736 1088128 921921 650140 619086 668147 632213 562557 604392
16629 604392 508732 493245 425322 378597 387373 343905 258920 171198 258175 199881 100628 83939
16617 83939 60907 -28684 -64027 89503 202436 111393 97239 -58077 -64389 -52955 16393
16606 16393 1405 -29984 -21791 115056 155646 48626 -37861 -98234 -3561 36420 23167
16595 23167 5074 -66402 -30154 60759 156828 229353 179954 -2981 -24399 -70687 -144522
16584 -144522 -229743 -104403 12129 67655 20154 -41867 -134494 -167046 -175791 -226779 -224159
16573 -224159 -147510 -177678 -119008 -10617 -28627 27919 109333 233727 239470 125891 -39844
16562 -39844 -13652 -12372 -14994 87047 140644 107927 60843 35742 20661 -18685 -25927 -196035
$$ packed form
16640H95178O538P3416R0604K2392j66207k71781l1054M9061l5934o9656M1835
16629F04392r5660j5487o7923m6725Q776m3468q4985q7722Q6977n8294r9253j6689
16617H3939k3032q9591l5343J53530J12933r1043j4154j55316o312J1434O9348
16606A6393j4988l1389Q193J36847M0590j07020q6487o0373R4673L9981j3253
16595B3167j8093p1476L6248R0913R6069P2525m9399j82935k1418m6288p3835
16584a44522q5221J25340J16532N5526m7501o2021r2627l2552q745n0988K620
16573b24159P6649l0168N8670J08391j8010N6546Q1414J24394N743j13579j65735
16562c9844K6192J280k622J02041N3597l2717m7084k5101j5081l9346p242j70108
$$ plain form
16550 -196035 -240477 -250966 -174650 -55255 -101684 -224252 -239895 -189120 -72995 40431 155872
16539 155872 124310 35370 31649 -6823 -68031 -71752 -101338 -108374 -24672 13392 -52399 -109961
16527 -109961 -137025 -131980 -57123 7013 69704 48322 -49240 -56182 10924 46832 1810 -8427
16515 -8427 -4365 59322 157029 150587 85404 -17145 -121834 -188229 -234278 -224880 -163513 -88639
16503 -88639 -16891 68873 38791 -11573 -93540 -170311 -123334 -46383 -31989 61864 112784 70499
16491 70499 130639 106933 74951 150588 71697 52683 -4665 -68751 -168894 -158736 -33308
16480 -33308 -53749 -160805 -144320 -103070 -46536 115434 17491 -41209 65382 69323 -78440
16469 -78440 -154951 -54052 -68269 -129080 -60623 -38965 57113 38932 105272 72130 -47050
$$ packed form
16550a96035m4442j0489P6316J19395m6429j22568j5643N0775J16125J13426J15441
16539A55872l1562q8940l721l8472o1208l721k9586p036Q3702L8064o5791n7562
16527a09961k7064N045P4857O4136O2691k1382r7562o942O7106L5908m5022j0237
16515h427M062O3687R7707o442o5183j02549j04689o6395m6049R398O1367P4874
16503h8639P1748Q5764l0082n0364q1967p6771M6977P6951J4394R3853N0920m2285
16491G0499O0140k3706l1982P5637p8891j9014n7348o4086j00143J0158J25428
16480c3308k0441j07056J6485M1250N6534J61970r7943n8700J06591L941j47763
16469g8440p6511J00899j4217o0811O8457K1658R6078j8181O6340l3142j19180
$$ plain form
16458 -47050 -70722 -102110 -44355 5420 78259 66459 -56556 28527 139535 88505 -55045
16447 -55045 -35395 66859 114701 166983 259861 215610 160098 158532 34114 -42207 -180507
16436 -180507 -221693 -237277 -141538 -17999 39380 52284 5515 10289 30893 56638 208001
16425 208001 258309 241196 240432 217626 152088 107561 48611 135265 95343 80381 154441 49664
16413 49664 -71126 -93746 35318 157592 203178 186442 5395 -161812 -208936 -78712
16403 -78712 45388 116430 39737 -57013 -477 80247 44961 53971 -2189 -11477 -24136 -35832
16391 -35832 11075 5101 -3171 -33758 -111853 -69615 33693 7529 66301 16887 -94834 15551
16379 15551 96674 65643 87862 -68565 -69725 -13382 -32321 14494 -32646 -109546 -74522 -80209
$$ packed form
16458d7050k3672l1388N7755M9775P2839j1800j23015Q5083J11008n1030j43550
16447e5045J9650J02254M7842N2282R2878m4251n5512j566j24418p6321j38300
16436a80507m1186j5584R5739J23539N7379J2904m6769M774K0604K5745J51363
16425B08001N0308j7113p64k2806o5538m4527n8950Q6654l9922j4962P4060j04777
16413D9664j20790k2620J29064J22274M5586j6736j81047j67207m7124J30224
16403g8712J24100P1042p6693r6750N6536Q0724l5286R010n6160r288j2659j1696
16391c5832M6907n974q272l0587p8095M2238J03308k6164N8772m9414j11721J10385
16379A5551Q1123l1031K2219j56427j160N6343j8939M6815m7140p6900L5024n687
$$ plain form
16367 -80209 998 -37211 -115187 -69909 -188258 -259810 -14424 104321 90011 96917 172228
16356 172228 154793 -7313 -190116 -349960 -241349 -108474 -14297 50101 62759 54588 106413
16345 106413 98789 66135 169416 293576 341936 275848 243425 171549 64326 126142 233896
16334 233896 142693 184065 262164 264374 154813 -17176 -214784 -183805 -112684 -4281 -14530
16323 -14530 -176577 -174277 -128974 -134585 -67750 -8438 9701 18957 21441 134 56430 24556
16311 24556 96774 101065 37239 69554 133123 85208 -20001 -129502 -138680 10654 155773
16300 155773 79095 43887 48127 59892 57673 28771 -20011 -118574 -91806 -67179 -21547 44885
16288 44885 34870 -32933 52799 -95308 -119875 -125740 -136356 -86937 -77729 -56979 -39091 -103604
$$ packed form
16367h0209Q1207l8209p7976M5278j18349p1552K45386J18745j4310O906P5311
16356A72228j7435j62106j82803j59844J08611J32875R4177O4398J2658q171N1825
16345A06413p624l2654J03281J24160M8360o6088l2423p1876j07223O1816J07754
16334B33896r1203M1372P8099K210j09561j71989j97608L0979P1121J08403j0249
16323a4530j62047K300M5303n611O6835N9312J8139R256K484k1307N6296l1874
16311B4556P2218M291o3826L2315O3569m7915j05209j09501r178J49334J45119
16300A55773p6678l5208M240J1765k219k8902m8782r8563K6768K4627M5632O6432
16288D4885j0015o7803Q5732j48107k4567n865j0616M9419R208K0750J7888o4513
$$ plain form
16276 -103604 -313121 -379587 -196190 -121488 -5583 45025 -27781 62962 56018 79308 -30350
16265 -30350 -8723 65128 105258 51692 18095 -14663 -51680 -141090 -139702 -125831 -85013 -65481
16253 -65481 5617 -98908 -73049 -27744 -81811 -130329 -62452 11244 25215 -73151 -96787
16242 -96787 -105071 -106526 -116465 -71278 -59429 -110133 -149595 -166671 -30433 -39581 -133013 -242479
16230 -242479 -380274 -365510 -198478 -124042 -83913 -105367 -90253 -112439 -152647 -70515 -92240
16219 -92240 -71948 -85102 -177676 -243203 -252690 -167025 -228809 -220691 -242071 -256435 -110254 -44959
16207 -44959 -68912 -68716 -43651 9663 49297 -18708 -166505 -112560 71954 113629 114895 211343
16195 211343 144632 -5632 -12922 -19966 -41270 -7182 23329 -12226 46980 18455 42522 87650
$$ packed form
16276a03604k09517o6466J83397P4702J15905N0608p2806R0743o944K3290j09658
16265c0350K1627P3851M0130n3566l3597l2758l7017q9410J388J3871M0818J9532
16253f5481P1098j04525K5859M5305n4067m8518O7877P3696J3971r8366k3636
16242i6787q284j455r939M5187J1849n0704l9462j7076J36238r148r3432j09466
16230b42479j37795J4764J67032P4436M0129k1454J5114k2186m0208Q2132k1725
16219i2240K0292j3154r2574o5527r487Q5665o1784Q118k1380j4364J46181O5295
16207d4959k3953J96K5065N3314L9634o8005j47797N3945J84514M1675J266R6448
16195B11343o6711j50264p290p044k1304L4088L0511l5555N9206k8525K4067M5128
$$ plain form
16183 87650 -78176 13278 60563 35893 13709 -65031 -41415 -66766 2074 41654 -26255
16172 -26255 -60895 45102 73850 -52884 -77718 -121873 -123735 -133073 -86363 -47745 -33292 -91886
16160 -91886 -89378 -48087 -89253 -188477 -158393 -147214 -66777 -70223 -51937 -116404 -216980 -269395
16148 -269395 -242124 -62727 -13307 -91703 -31521 19636 71277 51351 68439 15753 9815
16137 9815 -65271 -111492 -151685 -289356 -298314 -136426 -24040 59414 32943 -120330 -5503
16126 -5503 13482 -142630 -227436 -231241 -291124 -160564 -83339 -48984 -74040 -71873 -12246 39325
16114 39325 162329 49856 -58022 -220914 -403245 -365691 -233451 -103091 10261 -141557
16104 -141557 -131078 -103527 -6798 69319 -42163 3369 88604 56421 15322 64609 58929
$$ packed form
16183H7650j65826R1454M7285k4670k2184p8740K3616k5351O8840L9580o7909
16172b6255l4640J05997K8748j26734k4834m4155j862r338M6710L8618J4453n8594
16160i1886K508M1291m1166r9224L0084J1179Q0437l446J8286o4467j00576n2415
16148b69395K7271J79397M9420p8396O0182N1157N1641j9926J7088n2686n938
16137I815p5086m6221m0193j37671q958J61888J12386Q3454k6471j53273J14827
16126e503J8985j56112q4806l805n9883J30560P7225L4355k5056K167N9627N1571
16114C9325J23004j12473j07878j62892j82331L7554J32240J30360J13352j51818
16104a41557J0479K7551R6729P6117j11482M5532Q5235l2183m1099M9287n680
$$ plain form
16093 58929 -11720 26437 -56477 20201 -9782 -52690 -85154 28334 29169 -222 -108099 -143337
16081 -143337 -135519 -59174 31590 151783 196880 83037 -66480 -177879 -233629 -193309 -26605
16070 -26605 104181 57029 52516 84525 151262 133499 41085 167719 133704 87991 63830
16059 63830 33655 -1151 8895 -3618 38845 65362 40398 72261 -26706 -121235 -191506 -159571
16047 -159571 -89583 -53482 -4738 99363 85862 59915 31279 17980 63573 59813 -48734
16036 -48734 -112523 -103652 -108983 -178135 -274540 -271277 -54054 99881 198910 156040 66695 59320
16024 59320 -18348 -95942 -43075 20106 40567 34902 179706 194156 -2576 51662 176429
16013 176429 253730 149296 124236 117974 7646 -104588 -53613 58075 94825 142025 159945
$$ packed form
16093E8929p0649L8157q2914P6678k9983m2908l2464J13488Q35k9391j07877l5238
16081a43337P818P6345R0764J20193M5097j13843j49517j11399n5750M0320J66704
16070b6605J30786m7152m513L2009O6737j7763r2414J26634l4015m5713k4161
16059F3830l0175l4806J0046j2513M2463K6517k4964L1863r8967r4529p0271L1935
16047a59571O9988L6101M8744J04101j3501k5947k8636j3299M5593l760j08547
16036d8734o3789Q871n331o9152r6405L263K17223J53935R9029m2870q9345p375
16024E9320p7668p7594N2867O3181K0461n665J44804J4450j96732N4238J24767
16013A76429P7301j04434k5060o262j10328j12234N0975J11688L6750M7200J7920
$$ plain form
16002 159945 47012 35959 -17817 -55437 -642 18799 23300 -116350 -19280 193518 97032
15991 97032 64654 17421 127108 20111 36496 89134 80408 95865 70217 -91424 -121465
15980 -121465 -43383 -70429 -90973 -51499 -61189 -149771 -175078 -181911 -152637 -135498 -148833 -31093
15968 -31093 120782 126616 70110 84662 155754 99300 207111 217870 128971 110736 200812
15957 200812 211219 163553 81277 -139830 -230974 -70623 136589 149051 129099 113172 154662
15946 154662 76927 25220 34539 -29923 -102024 -164862 -100018 -76550 -23783 -50489 -205583
15935 -205583 -221634 -167916 -100208 -96318 29217 86684 28674 4425 -93136 -177898 -169847 -58125
15923 -58125 -1975 95403 85474 -1754 -67819 -113639 -173234 -176112 -78127 52526 90331 71849
$$ packed form
16002A59945j12933j1053n3776l7620N4795J9441M501j39650R7070K12798r6486
15991I7032l2378m7233J09687j06997J6385N2638q726J5457k5648j61641l0041
15980a21465P8082k7046k0544L9474r690q8582k5307o833K9274J7139j3335J17740
15968c1093J51875N834n6506J4552P1092n6454J07811J0759q8899j8235R0076
15957B00812J0407m7666q2276k21107r1144J60351K07212J2462j9952j5927M1490
15946A54662p7735n1707R319o4462p2101o2838O4844K3468N2767k6706j55094
15935b05583j6051N3718O7708L890J25535N7467n8010k4249r7561q4762Q051J11722
15923e8125N6150R7378r929q7228o6065m5820n9595k878R7985J30653L7805j8482
$$ plain form
15911 71849 -110761 -61194 22739 45067 106097 248843 234445 30716 -33589 -48335 -61321
15900 -61321 -60982 -107750 -152149 -181852 -127424 -105522 -112826 -136496 -132025 -47051 15213 7205 -42419
15887 -42419 55642 155714 111373 -76386 -212000 -248458 -202912 -293426 -291150 -235674 -170551
15876 -170551 8490 30160 -59957 -129858 -133196 -123728 -74432 -112817 -163299 -81569 -18990 53918
15864 53918 53360 40487 35536 62573 -42175 -121764 -235317 -195870 -108200 -149250 -168362 -29453
15852 -29453 166341 151290 -4743 -107038 -88895 -63659 -72087 -34097 57770 45297 78400
15841 78400 130999 139294 72527 113418 100722 -20737 -41962 49840 23852 -202745 -374646
15830 -374646 -303650 -241734 -200197 -157014 -77736 41516 -29142 -115792 -92879 -35383 -58888
$$ packed form
15911G1849j82610M9567Q3933K2328O1030J42746j4398k03729o4305j4746j2986
15900f1321L39m6768m4399k9703N4428K1902p304k3670M471Q4974O2264q008m9624
15887d2419R8061J00072m4341j87759j35614l6458M5546r0514K276N5476O5123
15876a70551J79041K1670r0117o9901l338R468M9296l8385n0482Q1730O2579P2908
15864E3918n58j2873m951K7037j04748p9589j13553L9447Q7670m1050j9112J38909
15852b9453J95794j5051j56033j02295J8143K5236q428L7990R1867j2473L3103
15841G8400N2599Q295o6767M0891j2696j21459k1225R1802k5988k26597j71901
15830c74646P0996O1916M1537M3183P9278J19252p0658q6650K2913N7496k3505
$$ plain form
15819 -58888 13009 35870 111165 98032 -28521 -189464 -168008 -153529 -235004 -86759 17778
15808 17778 47836 123013 126573 83779 -84609 -187735 -164107 -102027 -167508 -190758 -140066
15797 -140066 -179789 -152228 -152394 -70917 -20362 -161579 -99841 -60453 -115771 -89830 -56394 -103436
15785 -103436 -74952 -13491 16801 -276 -145560 -251527 -306221 -242110 -144118 -92320 -133016
15774 -133016 -101360 -164346 -211246 -162423 -8489 5384 -30199 -75803 -12320 -70328 -120242
15763 -120242 -209895 -253312 -187412 -154201 -195250 -30889 -6444 -37275 -96284 -24761 23723
15752 23723 -43505 -109785 -103174 -70011 49509 73073 -39808 5816 -49408 -253897 -230010
15741 -230010 -158754 -275764 -252278 -165163 -229367 -167554 -209119 -182254 -170637 -224807 -207828
$$ packed form
15819e8888P1897K2861P5295j3133j26553j60943K1456J4479q1475J48245J04537
15808A7778L0058P5177L560m2794j68388j03126K3628O2080o5481k3250N0692
15797a40066l9723K7561j66Q1477N0555j41217O1738L9388n5318K5941L3436m7042
15785a03436K8484O1461L0292j7077j45284j05967n4694O4111R7992N1798m0696
15774a33016L1656o2986m6900M8823J53934J3873l5583m5604O3483n8008m9914
15763a20242q9653m3417O5900L3211m1049J64361K4445l0831n9009P1523M8484
15752B3723o7228o6280O611L3163J19520K3564j12881M5624n5224k04489K3887
15741b30010P1256j17010K3486Q7115o4204O1813m1565K6865J1617n4170J6979
$$ plain form
15730 -207828 -122556 -25372 -54505 -45927 25073 -3624 22093 -9447 -11540 -29283 -71866 -77461
15718 -77461 -99824 -121827 -73059 -5324 -73073 -164851 -111465 -109138 -178118 -282036 -210257 -131270
15706 -131270 -151459 -174235 -125933 -79193 25722 101092 -17348 54888 298267 317661 276485
15695 276485 200872 119805 168052 156615 193107 181498 -8007 -60643 -83965 -65437 8130
15684 8130 10152 64000 70890 186295 165219 65383 69964 -20660 -238500 -152333 -79569 -94591
15672 -94591 -109187 -143010 -111209 -138164 -159377 -155346 -88963 22253 26774 -12798 70617 29791
15660 29791 -109919 -88704 -53379 -5249 43767 105460 -32224 -220489 -277861 -209273 -72241
15649 -72241 -30867 -680 -59195 -152798 -335682 -391482 -201945 -90380 -9656 103321 145112
$$ packed form
15730b07828Q5272R7184k9133Q578P1000k8697K5717l1540k093j7743m2583n595
15718g7461k2363k2003M8768O7735o7749r1778N3386K327o8980j03918P1779P8987
15706a31270k0189k2776M8302M6740J04915P5370j18440P2236K43379J9394m1176
15695B76485p5613q1067M8247j1437L6492j1609j89505n2636k3322J8528P3567
15684H130K022N3848O890J15405k1076r9836M581r0624k17840Q6167P2764j5022
15672i4591j4596l3823L1801k6955k1213M031O6383J11216M521l9572Q3415m0826
15660B9791j39710K1215L5325M8130M9016O1693j37684j88265n7372O8588J37032
15649g2241M1374L0187n8515r3603j82884n5800J89537J11565Q0724J12977M1791
$$ plain form
15638 145112 23652 -93763 -162175 -159455 -199298 -189531 -180784 -189791 -119748 -238879 -236025 -169167
15626 -169167 -193773 -228049 -173399 -118833 -237633 -135682 -62172 3608 11396 -54015 -70118
15615 -70118 -130250 40580 10672 -24218 45945 23836 3020 28261 -137557 -316081 -282850
15604 -282850 -345917 -314857 -147531 -97466 -152158 -169215 -153441 -129440 -156717 -203533 -186925
15593 -186925 -137704 -32829 -113065 -38409 25119 -25681 -18576 -18674 -90574 -51098 18190 18782
15581 18782 54184 23881 -67102 -143357 -45200 74723 118960 136781 177739 126607 52738
15570 52738 -24640 -37842 67734 128954 78511 126901 150513 179388 127981 -34221 -86116
15559 -86116 -29401 70649 33986 -15416 -120052 -166765 -82380 -38561 -58401 -112822 -54506
$$ packed form
15638A45112j21460j17415o8412K720l9843R767Q747r007P0043j19131K854O6858
15626a69167k4606l4276N4650N4566j18800J01951P3510O5780P788o5411j6103
15615g0118o0132J70830k9908l4890P0163k2109k0816K5241j65818j78524L3231
15604b82850o3067L1060J67326N0065n4692j7057J5774K4001k7277m6816J6608
15593a86925M9221J04875q0236P4656O3528n0800P105r8p1900L9476O9288N92
15581A8782L5402l0303r0983p6255R8157J19923M4237J7821M0958n1132p3869
15570E2738p7378j3202J05576O1220n0443M8390K3612K8875n1407j62202n1895
15559h6116N6715J00050l6663m9402j04636m6713Q4385M3819j9840n4421N8316
$$ plain form
15548 -54506 -100819 -78283 -114799 -64077 25569 53348 21334 45509 -21434 -22797 -47741 -40896
15536 -40896 -60306 -215297 -158512 15022 74592 71653 63968 51401 -55127 -159370 -264322
15525 -264322 -259941 -207714 -223506 -201299 -155779 -66299 -129727 -93516 74336 83756 86033 63646
15513 63646 -37130 -96004 -195428 -149347 -150255 -169415 -159581 -102884 -65145 -43606 -82138 -71879
15501 -71879 -161579 -213484 -118942 -153301 -232904 -193254 -170151 -174805 -29575 118659 89625
15490 89625 683 -89413 -86571 -37885 -194517 -99519 72090 164600 150927 42566 -116216
15479 -116216 -95592 -120002 25523 38051 44514 83654 124775 23822 -73198 -172610 -159720
15468 -159720 -74322 -106037 -117578 -186589 -274039 -236491 -163215 -82987 47392 13212 -95967
$$ packed form
15548e4506m6313K2536l6516N0722Q9646K7779l2014K4175o6943j363k4944O845
15536d0896j9410j54991N6785J73534N9570k939p685j2567j06528j04243j04952
15525b64322M381N2227j5792K2207M5520Q9480o3428L6211J67852R420K277k2387
15513F3646j00776n8874r9424M6081r08j9160R834N6697L7739K1539l8532J0259
15501g1879q9700n1905R4542l4359p9603L9650K3103m654J45230J48234k9034
15490H9625q8942r0096K842M8686j56632R4998J71609R2510j3673j08361j58782
15479a16216K0624k4410J45525J2528O463L9140M1121j00953r7020r9412J2890
15468a59720Q5398l1715j1541o9011q7450L7548P3276Q0228J30379l4180j09179
$$ plain form
15457 -95967 -89580 -86415 -150549 -67022 -17306 131923 114214 47398 97470 41691 24347 -18258
15445 -18258 3792 -2256 -32201 3256 27228 27925 113954 136437 57066 -12212 22707 121042
15433 121042 69422 80392 104367 92767 4171 67983 85560 63320 7216 -123518 -165273
15422 -165273 -111986 -134745 -193266 -254987 -244628 -216427 -51018 13202 21552 -1055 -13822
15411 -13822 -55477 69119 110146 119026 168383 261167 260086 205298 171291 60648 -79537
15400 -79537 -33279 -88301 -86301 -128532 8384 162611 128218 21137 -111549 -90365 -22033
15389 -22033 70532 99440 64471 -45005 -143480 -87563 -136984 -152775 -170073 30218 107502
15378 107502 67525 106248 -36755 -34803 -2926 44718 63858 56098 -52954 1314 -59832
$$ packed form
15457i5967O387L165o4134Q3527M9716J49229j7709o6816N0072n5779j7344m2605
15445a8258K2050o048k9945L5457K3972O97Q6029K2483p9371o9278L4919R8335
15433A21042n1620J0970K3975j1600q8596O3812J7577k2240n6104j30734m1755
15422a65273N3287k2759n8521o1721J0359K8201J65409O4220Q350k2607j2767
15411a3822m1655J24596M1027Q880M9357R2784j081n4788l4007j10643j40185
15400g9537M6258n5022K000m2231J36916J54227l4393j07081j32686K1184O8332
15389b2033R2565K8908l4969j09476r8475N5917m9421j5791j7298K00291P7284
15378A07502l9977L8723j43003J952L1877M7644J9140p760j09052N4268o1146
$$ plain form
15367 -59832 -88446 -90342 11593 25861 45975 947 -60820 4892 1949 -28215 14675 -11743
15355 -11743 -924 -31886 1294 -16492 41574 -29170 -92470 -13003 -12726 -40925 77815 70926
15343 70926 -68252 -67274 -50844 -80987 -128900 -40389 -87653 -195540 -217307 -216922 -218119 -216726
15331 -216726 -308123 -446928 -366355 -195065 -163343 -96223 -36522 -41272 10669 20012 -83850
15320 -83850 -95732 -60383 -62174 -68039 -94746 -106775 -148713 -137810 -144514 -247606 -270050 -263441
15308 -263441 -304978 -253758 -190225 -223562 -313116 -305480 -388731 -380002 -270538 -140410 -142644 -315706
15296 -315706 -373418 -278407 -234643 -166154 -66072 -35572 -116018 -118402 -149738 -89807 -48346
15285 -48346 -133200 -161858 -169243 -82132 -55325 -47474 -111624 -188469 22720 90304 -41702 -27333
$$ packed form
15367e9832k8614j896J01935J4268K0114m5028o1767O5712k943l0164M2890k6418
15355a1743J0819l0962L3180j7786N8066p0744o3300P9467K77k8199J18740o889
15343G0926j39178R78J6430l0143m7913Q8511m7264j07887k1767L85j197J393
15331b16726r1397j38805Q0573J71290L1722O7120N9701m750N1941R343j03862
15320h3850j1882L5349j791n865k6707j2029m1938J0903o704j03092k2444O609
15308b63441m1537N1220O3533l3337q9554P636q3251Q729J09464J30128k234j73062
15296c15706n7712R5011M3764O8489J00082L0500q0446k384l1336N9931M1461
15285d8346q4854k8658p385Q7111K6807P851o4150p6845K11189O7584j32006J4369
$$ plain form
15273 -27333 -13698 78961 9836 -206886 -189986 -73390 -117774 -13389 57249 2713 -72631
15262 -72631 103418 94133 90436 69794 61619 -15014 -84667 -41981 6432 20397 -32785 -73759
15250 -73759 -182088 -234104 -291425 -269937 -74171 -1613 -49064 -74534 -68454 -71157 -50189 -5702
15238 -5702 -42780 -109428 -182969 -253616 -183391 -117065 -168572 -188415 -121867 -131206 -232007 -338529
15226 -338529 -243575 -122927 50126 204107 149120 23956 20133 -79245 -142889 -107976 -92519
15215 -92519 -33784 33869 46086 14858 38895 13940 40859 12609 57811 -65286 -40999
15204 -40999 -7611 -107830 -80566 -133859 -124066 -70911 -30366 -42423 -42707 49776 233012 310328
15192 310328 186854 54749 -109867 -260689 -217725 -48380 -39346 -102401 -102532 -59858 -44475
$$ packed form
15273b7333J3635R2659o9125k16722J6900J16596m4384J04385P0638n4536p5344
15262g2631J76049r285l697k0642q175p6633o9653M2686M8413J3965n3182m0974
15250g3759j08329n2016n7321K1488J95766P2558m7451k5470O080k703K0968M4487
15238e702l7078o6648p3541p0647P0225O6326n1507j9843O6548r339j00801j06522
15226c38529R4954J20648J73053J53981n4987j25164l823r9378o3644L4913J5457
15215i2519N8735O7653J2217l1228K4037k4955K6919k8250M5202j23097K4287
15204d0999L3388j00219K7264n3293R793N3155M0545j2057k84R2483J83236P7316
15192C10328j23474j32105j64616j50822M2964J69345R034o3055j31M2674J5383
$$ plain form
15181 -44475 -157415 -242528 -235828 -190005 -152450 -214547 -168884 -115073 -65783 -87864 -80092 -42089
15169 -42089 -63357 -85726 22386 82577 69690 -18934 -126937 14624 122300 29211 -66106
15158 -66106 -88934 -2182 -32012 -45353 1971 46555 -94758 -218079 -223050 -244947 -168041
15147 -168041 19950 122552 2962 7920 71010 25415 125513 -13840 -76592 -9743 14081
15136 14081 -70643 -154945 -76494 18494 -4138 -184413 -261020 -133303 16759 15850 -54104
15125 -54104 -149176 -122724 -50931 -70109 -139109 -178816 -222321 -243102 -166856 -143162 -265507
15114 -265507 -326606 -292045 -334171 -308138 -199984 -264922 -324204 -241698 -228868 -354850 -308252
15103 -308252 -49502 -29696 -178019 -190755 -202851 -274999 -277144 -319417 -318188 -294215 -162078
$$ packed form
15181d4475j12940q5113O700M5823L7555o2097M5663N3811M9290k2081P772L8003
15169d2089k1268k2369J08112O0191j2887q8624j08003J41561J07676r3089r5317
15158f6106k2828Q6752k9830j3341M7324M4584j41313j23321m971k1897P6906
15147a68041J87991J02602j19590M958O3090m5595J00098j39353o2752O6849K3824
15136A4081q4724q4302P8451R4988k2632j80275p6607J27717J50062r09o9954
15125e4104r5072K6452P1793j9178o9000l9707m3505k0781P6246K3694j22345
15114b65507o1099L4561m2126K6033J08154o4938n9282Q2506J2830j25982M6598
15103c08252K58750J9806j48323j2736j2096p2148k145m2273J229K3973J32137
$$ plain form
15092 -162078 -221572 -322662 -203125 -184566 -251027 -144321 -68786 -111899 -210717 -130564 13702
15081 13702 -38205 -134815 -141263 -82310 -41919 -56261 -128369 -223619 -226191 -112314 -26359 31128
15069 31128 52969 -118974 -122901 -28928 -101267 -106833 -112022 -52592 -145089 -164937 -63486 -74814
15057 -74814 -140067 -12024 43308 85869 38773 -18830 43764 129071 120178 67081 -34055
15046 -34055 -199507 -30591 24268 -90661 -32493 129068 139770 142735 256545 293723 291402
15035 291402 164136 6512 41568 101555 180347 196865 154966 137854 66778 -10919 39507
15024 39507 123228 140660 220470 125399 -20773 44969 74514 100682 148020 138003 306436
15013 306436 317168 148422 178992 235319 212746 163184 217979 414896 598408 684831 836388
$$ packed form
15092a62078n9494j01090J19537J8559o6461J06706P5535m3113r8818Q0153J44266
15081A3702n1907r6610o448N8953M0391j4342p2108r5250k572J13877Q5955N7487
15069C1128K1841j71943l927R3973p2339n566n189N9430r2497j9848J01451j1328
15057g4814o5253J28043N5332M2561m7096n7603O2594Q5307q893n3097j01136
15046c4055j65452J68916N4859j14929N8168J61561J0702K965J13810L7178k321
15035B91402j27266j57624L5056N9987P8792J6518m1899j7112p1076p7697N0426
15024C9507Q3721J7432P9810r5071j46172O5742K9545K6168M7338j0017J68433
15013C06436J0732j68746L0570N6327k2573m9562N4795J96917J83512Q6423J51557
$$ plain form
15002 836388 815761 831642 933143 947807 1082594 1227276 1171613 1171011 1216720 1119965 1102742
14991 1102742 1251796 1302148 1350986 1301127 1234084 1232974 1307331 1314615 1213913 1243545 1292572
14980 1292572 1348923 1345688 1422188 1418686 1349926 1386669 1392642 1344331 1437843 1445474 1440387 1578707
14968 1578707 1669923 1579451 1573085 1555712 1573668 1528586 1394037 1297622 1227556 1087509 1059586
14957 1059586 1020800 990656 1035006 899752 725820 780971 813531 702384 615035 560569 450341
14946 450341 380207 416866 415972 470517 424875 430007 394988 401301 431969 307379 316004 367120
14934 367120 445961 314863 243947 343880 285686 136631 11977 68893 92393 -3396 -129718
14923 -129718 -105499 -51176 -25236 -23083 10528 -93961 -209819 -178678 -7380 129004 166449
$$ packed form
15002H36388k0627J5881J01501J4664J34787J44682n5663o02M5709r6755j7223
14991A102742J49054N0352M8838m9859o7043j110P4357P284j00702K9632M9027
14980A292572N6351l235P6500l502o8760L6743N973m8311R3512P631n087J38320
14968A578707R1216r0472o366j7373J7956m5082j34549r6415p0066j40047k7923
14957A059586l8786l0144M4350j35254j73932N5151L2560j11147q7349n4466j10228
14946D50341p0134L6659q94N4545m5642N132l5019O313L0668j24590Q625N1116
14934C67120P8841j31098p0916R9933n8194j49055j24654N6916K3500r5789j26322
14923a29718K4219N4323K5940K153L3611j04489j15858L1141J71298J36384L7445
$$ plain form
14912 166449 200947 215121 160560 145245 119772 110156 185892 322970 321258 330682 255858 209204
14900 209204 107281 97146 162356 153759 102286 -1758 -98216 -93962 -140692 -68258 -75562 -87146
14888 -87146 -67759 84264 127437 153620 23310 28010 200903 366394 409524 379005 436838
14877 436838 541466 502129 563579 609360 607699 647812 587603 546763 467483 509220 512086 482914
14865 482914 383060 296840 266461 340094 244835 101613 44677 189787 208516 -11733 -107347
14854 -107347 -65395 -39711 40424 142934 146105 -9646 9101 -36165 -270150 -315572 -309876
14843 -309876 -243138 -201071 -134243 -43675 -39485 -111382 -158293 -233994 -152724 -10016 57055
14832 57055 -25222 -48718 29029 53181 17438 84947 92857 115470 76924 84251 -9418 -40220
$$ packed form
14912A66449L4498J4174n4561j5315k5473r616P5736J37078j712R424p4824m6654
14900B09204j01923j0135O5210q597n1473j04044r6458M254m6730P2434p304j1584
14888h7146J9387J52023M3173K6183j30310M700J72893J65491M3130l0519N7833
14877D36838J04628l9337O1450M5781j661M0113o0209m0840p9280M1737K866k9172
14865D82914r9854q6220l0379P3633r5259j43222n6936J45110J8729k20249r5614
14854a07347M1952K5684Q0135J02510L171j55751J8747m5266k33985m5422N696
14843c09876O6738M2067O6828R0568M190p1897m6911p5701Q1270J42708O7071
14832E7055q2277k3496P7747K4152l5743O7509P910K2613l8546P327r3669l0802
$$ plain form
14820 -40220 19041 -31873 -82322 -17973 27532 -82166 -28186 93325 249963 246519 229637
14809 229637 278388 398401 439224 259887 118316 66905 124421 236257 350657 375005
14799 375005 382637 358123 361976 420433 407285 328060 229634 130986 212085 255776 320282 168954
14787 168954 -28737 3769 154175 156599 151423 210243 235255 145681 78218 32525 -356
14776 -356 16561 206163 178088 87371 50610 -11542 -54531 15704 39809 96779 187805 173962
14764 173962 190123 240129 290554 384142 374649 338193 211275 98090 28413 19230 63985
14753 63985 8459 41342 148638 164128 65167 -54466 -41582 -34767 -39836 -31840 20937 38811
14741 38811 197332 238956 173088 71783 134680 264736 305095 271775 295375 265965 134812
$$ packed form
14820d0220N9261n0914n0449O4349M5505j09698N3980J21511J56638l444j6882
14809B29637M8751J20013M0823j79337j41571n1411N7516J11836J14400K4348
14799C75005P632k4514L853N8457j3148p9225r8426r8648Q1099M3691O4506j51328
14787A68954j97691L2506J50406K424n176N8820K5012q9574o7463m5693l2881
14776c56J6917J89602k8075r0717l6761o2152m2989P0235K4105N6970R1026j3843
14764A73962J6161N0006N0425R3588r493l6456j26918j13185o9677r183M4755
14753F3985n5526L2883J07296J5490r8961j19633J2884O815n069P996N2777J7874
14741C8811J58521M1624o5868j01305O2897J30056M0359l3320K3600k9410j31153
$$ plain form
14730 134812 22697 -79403 31675 178774 225114 199452 211853 205530 199908 202557 182255
14719 182255 237601 197847 120866 61366 183701 198062 154030 41879 -35092 46515 225469
14708 225469 244225 129783 175710 263587 277575 230237 211687 117969 88019 159462 253724
14697 253724 266479 155277 171120 177416 262984 218510 236219 267556 236908 279629 214168
14686 214168 161590 126652 162152 181295 251769 391766 448729 408597 290278 243463 402876
14675 402876 417425 358913 333355 344800 378081 511755 510487 452975 350261 417879 469987
14664 469987 495493 583323 376273 302946 434812 484462 659670 687442 724783 653109 627645
14653 627645 726886 740233 730440 811943 945612 999539 971229 851364 891055 811425 733012
$$ packed form
14730A34812j12115j02100J11078J47099M6340k5662J2401o323n622K649k0302
14719A82255N5346l9754p6981n9500J22335J4361m4032j12151p6971Q1607J78954
14708B25469J8756j14442M5927Q7877J3988m7338j8550r3718k9950P1443R4262
14697B53724J2755j11202J5843O296Q5568m4474J7709L1337l0648M2721o5461
14686B14168n2578l4938L5500J9143P0474J39997N6963m0132j18319m6815J59413
14675D02876J4549n8512k5558J1445L3281J33674j268n7512j02714O7618N2108
14664D69987K5506Q7830k07050p3327J31866M9650J75208K7772L7341p1674k5464
14653F27645R9241J3347r793Q1503J33669N3927k8310j19865L9691p9630p8413
$$ plain form
14642 733012 742714 632345 660372 920097 1003866 989126 1035676 1045192 1095301 1201316 1282458
14631 1282458 1138012 977530 979592 994755 1020052 1028998 899425 1006274 1140976 1259761
14621 1259761 1341257 1353901 1369534 1369815 1357399 1301939 1304781 1288157 1286149 1434464 1560000 1630970
14609 1630970 1660284 1740436 1747384 1739401 1744067 1877776 2160360 2127241 2124642 2234061 2506433
14598 2506433 2708370 2802529 2895131 3096810 3300927 3479482 3639926 3900483 4228251 4488045
14588 4488045 4728814 5054467 5516622 5803900 6349542 7100374 7778481 8278433 8846035
14579 8846035 9588030 10393851 11279119 12332672 13669003 15156343 16646974 18288761 20226795
14570 20226795 22542632 25128859 27952557 31230495 34984652 39273060 44174239 49691119
$$ packed form
14642G33012R702j10369K8027K59725Q3769j4740M6550R516N0109J06015Q1142
14631A282458j44446j60482K062J5163K5297Q946j29573J06849J34702J18785
14621A259761Q1496J2644J5633K81j2416n5460K842j6624k008J48315J25536P0970
14609A630970K9314Q0152O948p983M666J33709K82584l3119k599J09419K72372
14598B506433K01937R4159R2602K01679K04117J78555J60444K60557L27768K59794
14588D488045K40769L25653M62155K87278N45642P50832O78107M99952N67602
14579H846035P41995Q05821Q85268J053553J336331J487340J490631J641787J938034
14570B0226795K315837K586227K823698L277938L754157M288408M901179N516880
$$ plain form
14562 49691119 55969305 63139425 71485177 80907126 91423191 103347780 116557143 130954113
14554 130954113 146536711 162872901 179652238 196340266 212585545 227695982 241283145
14547 241283145 252995892 262400081 269418733 273979038 276449636 277174824 276339617 274356768
14539 274356768 271660915 268412120 265188501 262081373 259158101 256740188 255031114 254089753
14531 254089753 253764282 253924153 255030829 257007022 259650348 263199388 267483432 272445699
14523 272445699 277990740 283719538 289293529 294352830 298587603 301377625 302217889 300917931
14515 300917931 297315496 291075239 282506901 271858155 259363810 245446705 230674872
14508 230674872 215555915 200230497 185093802 170748083 157283276 144554417 132694695
$$ packed form
14562D9691119O278186P170120Q345752R421949J0516065J1924589J3209363J4396970
14554A30954113J5582598J6336190J6779337J6688028J6245279J5110437J3587163
14547B41283145J1712747R404189P018652M560305K470598P25188q35207j982849
14539B74356768k695853l248795l223619l107128k923272k417913j709074r41361
14531B54089753l25471J59871J106676J976193K643326L549040M284044M962267
14523B72445699N545041N728798N573991N059301M234773K790022Q40264j299958
14515C00917931l602435o240257q568338j0648746j2494345j3917105j4771833
14508B30674872j5118957j5325418j5136695j4345719j3464807j2728859j1859722
$$ plain form
14501 132694695 121782711 111763135 102608547 94221495 86484292 79427644 73065165 67399345
14493 67399345 62142003 57297461 52959402 49013214 45409048 42127588 39119119 36430542
14485 36430542 34073261 31783520 29732266 27914532 26281107 24793320 23499469 22227461
14477 22227461 21003788 19838364 18857484 17979201 17027614 16143169 15501852 14776205 13968418
14468 13968418 13127461 12275929 11556050 10781415 10048077 9587911 9251187 8903639 8478980
14459 8478980 8000659 7617819 7387045 7118906 6735330 6163716 5911179 5766580 5512476
14450 5512476 5200358 5063361 4927380 4818579 4637397 4350354 4164271 3998401 3700233
14441 3700233 3477951 3320386 3304228 3305333 3195206 3150916 3249569 3254330 3164362 2964190 2840871
$$ packed form
14501A32694695j0911984j0019576r154588q387052p737203p056648o362479n665820
14493F7399345n257342m844542m338059l946188l604166l281460l008469k688577
14485C6430542k357281k289741k051254j817734j633425j487787j293851j272008
14477B2227461j223673j165424r80880q78283r51587q84445o41317p25647q07787
14468A3968418q40957q51532p19879p74635p33338m60166l36724l47548m24659
14459H478980m78321l82840k30774k68139l83576n71614k52537j44599k54104
14450E512476l12118j36997j35981j08801j81182k87043j86083j65870k98168
14441C700233k22282j57565j6158J105j10127m4290R8653M761q9968k00172j23319
$$ plain form
14430 2840871 2634371 2495483 2440355 2386382 2448442 2446418 2332115 2230481 2248575 2126312
14420 2126312 2130151 2051516 1932186 1828962 1850202 1753113 1795746 1787654 1759066 1648392 1626708
14409 1626708 1677139 1683430 1640737 1652780 1631060 1617752 1684533 1622662 1574254 1624036 1596767
14398 1596767 1561829 1414448 1327201 1327706 1358854 1441483 1471122 1518300 1533913 1566215 1612791
14387 1612791 1372679 1143515 1108279 1246994 1336799 1413379 1408716 1289243 1168435 1033652
14377 1033652 1054036 1070731 936488 1044368 1141705 1152219 1058647 921128 918738 968965 938657
14366 938657 917582 921271 881654 880278 878265 840976 957245 1048209 918560 803007 754992
14355 754992 806713 781013 811235 798214 714264 752453 902004 909694 862679 730479 609831
$$ packed form
14430B840871k06500j38888n5128n3973O2060k024j14303j01634J8094j22263
14420B126312L839p8635j19330j03224K1240r7089M2633q092k8588j10674k1684
14409A626708N0431O291m2693J2043k1720j3308O6781o1871m8408M9782k7269
14398A596767l4938j47381q7247N05L1148Q2629K9639M7178J5613L2302M6576
14387A612791k40112k29164l5236J38715Q9805P6580m663j19473j20808j34783
14377A033652K0384J6695j34243J07880R7337J0514r3572j37519k390N0227l0308
14366I38657k1075L689l9617j376k013l7289J16269R0964j29649j15553m8015
14355G54992N1721k5700L0222j3021q3950L8189J49551P690m7015j32200j20648
$$ plain form
14344 609831 548292 598970 731849 817578 752740 697530 631215 510073 500100 373648 336682
14333 336682 437864 548062 512936 568593 654456 674373 674150 753599 611938 471537 459702
14322 459702 539254 550952 591342 571028 696978 684439 645314 626440 657071 681331 753905
14311 753905 844408 783554 910525 894661 838716 841376 696184 667530 702429 735270 739689
14300 739689 695737 731557 571403 585992 629025 651664 624895 561135 587089 612141 725144
14289 725144 805499 816705 666869 665970 584200 570845 569290 570419 641784 673443 623890 613356
14277 613356 613440 599430 659802 655994 709165 725055 672102 615525 595300 610834 554619 486791
14265 486791 581713 601377 428479 331779 414114 507920 548549 621145 839134 826388 675546
$$ packed form
14344F09831o1539N0678J32879Q5729o4838n5210o6315j21142r973j26452l6966
14333C36682J01182J10198l5126N5657Q5863J9917k23P9449j41661j40401j1835
14322D59702P9552J1698M0390k0314J25950j2539l9125j8874L0631K4260P2574
14311G53905R0503o0854J26971j5864n5945K660j45192k8654L4899L2841M419
14300G39689m3952L5820j60154J4589M3033K2639k6769o3760K5954K5052J13003
14289G25144Q0355J1206j49836q99q1770j3355j555J129P1365L1659m9553j0534
14277F13356Q4j4010O0372l808N3171J5890n2953n6577k0225J5534n6215o7828
14265D86791R4922J9664j72898r6700Q2335R3806M0629P2596K17989j2746j50842
$$ plain form
14254 675546 559150 515643 444699 492493 590078 573200 496327 372816 441845 478493 414217
14243 414217 518051 580418 584026 574491 529825 502964 598393 709829 804839 854603 907593
14232 907593 909058 810794 731736 739272 577016 603783 582672 519582 510582 663520 750243 511353
14220 511353 410263 500319 568404 525186 497682 402178 327387 356544 389627 371000 498060
14209 498060 557015 552797 604173 604050 548398 539940 513893 445470 412139 323601 274958 345214
14197 345214 434785 455219 464072 378486 186484 113110 200984 306134 444541 397407 404718
14186 404718 469615 540484 556329 549352 394901 335663 362358 533401 495274 427008 498128
14175 498128 511903 536375 525654 570860 479734 581708 616924 575098 463275 392818 368936
$$ packed form
14254F75546j16396m3507p0944M7794R7585j6878p6873j23511O9029L6648o4276
14243D14217J03834O2367L608r535m4666k6861R5429J11436R5010M9764N2990
14232I07593J465r8264p9058P536j62256K6767k1111o3090r000J52938Q6723k38890
14220E11353j01090R0056O8085m3218k7504r5504p4791K9157L3083j8627J27060
14209D98060N8955m218N1376j23n5652q458k6047o8423l3331q8538m8643P0256
14197C45214Q9571K0434Q853q5586j92002p3374Q7874J05150J38407m7134P311
14186D04718O4897P0869J5845o977j54451n9238K6695J71043l8127o8266P1120
14175D98128J3775K4472j0721M5206r1126J01974L5216m1826j11823p0457k3882
$$ plain form
14164 368936 241509 276449 337248 377590 408259 351943 336306 366302 383116 455623 569146
14153 569146 599680 483717 333178 297550 347816 363860 302579 331986 284540 337573 403115
14142 403115 398605 492829 473165 354096 357252 306000 293354 316529 330603 490958 616264
14131 616264 564878 409215 403694 418684 451287 387108 299794 256463 419144 475145 359556
14120 359556 320154 345657 469267 518871 525677 396038 352025 495959 623225 587279 631493
14109 631493 655855 709276 688449 751746 732615 716702 840530 879139 1021021 1092007 1172223
14098 1172223 1161141 1238017 1241945 1202074 1446981 1677648 1740334 1784558 1858944 1831800 1823868
14087 1823868 1923574 1978106 1885022 1789476 1627516 1514540 1635220 1697622 1659061 1664949 1739316
$$ packed form
14164C68936j27427L4940O0799M0342L0669n6316j5637K9996J6814P2507J13523
14153E69146L0534j15963j50539l5628N0266J6044o1281K9407m7446N3033O5542
14142D03115m510R4224j9664j19069L156n1252j2646K3175J4074J60355J25306
14131F16264n1386j55663n521J4990L2603o4179q7314m3331J62681N6001j15589
14120C59556l9402K5503J23610M9604O806j29639m4013J43934J27266l5946M4214
14109F31493K4362N3421k0827O3297j9131j5913J23828L8609J41882P0986Q0216
14098A172223j1082P6876L928l9871K44907K30667O2686M4224P4386k7144p932
14087A823868R9706N4532r3084r5546j61960j12976J20680O2402l8561N888P4367
$$ plain form
14076 1739316 1717532 1636042 1608099 1626747 1478046 1490423 1507347 1637222 1699613 1658907 1593707
14065 1593707 1737860 1838324 1813665 1687588 1694890 1805366 1950795 1884755 1858956 1701396
14055 1701396 1566490 1525053 1402005 1372935 1239047 1039744 944782 1019163 1097445 1083219
14045 1083219 970703 959281 874540 795053 746141 685276 679675 673798 537020 469280 515638
14034 515638 551073 419682 314259 287704 268510 289688 279795 323725 396667 442078 395004
14023 395004 396396 319964 228017 190202 286552 300244 354986 373488 262317 196064 138776
14012 138776 213835 277020 308275 281234 242645 286383 283327 251038 291679 240050 165367 150783
14000 150783 206696 274284 332763 394130 297413 151501 165038 140431 40739 166729 287036
$$ packed form
14076A739316k1784q1490k7943J8648j48701J2377J6924J29875O2391m0706o5200
14065A593707J44153J00464k4659j26077P302J10476J45429o6040k5799j57560
14055A701396j34906m1437j23048k9070j33888j99303r4962P4381P8282j4226
14045A083219j12516j1422q4741p9487m8912o0865n601n877j36778o7740M6358
14034E15638L5435j31391j05423k6555j9194K1178r893M3930P2942M5411m7074
14023C95004J392p6432r1947l7815R6350J3692N4742J8502j11171o6253n7288
14012A38776P5059O3185L1255k7041l8589M3738l056l2289M0641n1629p4683j4584
14000A50783N5913O7588N8479O1367r6717j45912J3537k4607r9692J25990J20307
$$ plain form
13989 287036 330481 269460 322010 391781 374176 337747 232179 150638 242678 256721 244828
13978 244828 237745 211521 201006 273665 240672 299441 237963 56531 125207 283520 303616
13967 303616 326845 313889 231461 230198 209185 311140 384988 424619 313516 286626 245709
13956 245709 297003 356472 326005 306596 357557 359510 360335 399225 291094 102496 153151 269456
13944 269456 308060 295432 226591 250252 278925 345419 315897 277236 231112 172246 158275
13933 158275 240145 354814 505810 530379 509041 471784 381351 312880 272728 321931 301329
13922 301329 390574 445832 340917 222475 335341 415746 337726 196243 151431 225404 280660
13911 280660 212722 207140 217464 241131 314297 295272 198676 296887 488581 510568 355287
$$ packed form
13989B87036M3445o1021N2550O9771j7605l6429j05568q1541R2040J4043j1893
13978B44828p083k6224j0515P2659l2993N8769o1478j81432O8676J58313K0096
13967C03616K3229j2956q2428j263k1013J01955P3848L9631j11103k6890m0917
13956B45709N1294N9469l0467j9409N0961J953Q25L8890j08131j88598N0655J16305
13944B69456L8604j2628o8841K3661K8673O6494k9522l8661m6124n8866j3971
13933A58275Q1870J14669J50996K4569k1338l7257r0433o8471m0152M9203k0602
13922C01329Q9245N5258j04915j18442J12866Q0405p8020j41483m4812P3973N5256
13911B80660o7938n582J0324K3667P3166j9025r6596R8211J91694K1987j55281
$$ plain form
13900 355287 250225 203003 175959 256762 271833 299175 388973 467452 377782 356870 394490
13889 394490 309887 10312 12725 191549 304377 278049 199403 253236 286799 227642 275202
13878 275202 166101 71235 -9028 51841 27925 -65404 110905 338245 444369 498356 457428
13867 457428 368562 195385 119340 90899 179844 317179 379603 246529 71654 -6336 -45863
13856 -45863 47010 194739 122603 92701 156442 108699 44024 59326 41993 -59796 -50477
13845 -50477 -19286 -46493 17745 107375 144417 139141 148506 128044 149991 172248 142708 84112
13833 84112 112812 166928 153966 108919 73331 11580 -30915 63579 215675 280910 231677
13822 231677 236599 257033 210237 215736 300537 278008 226483 42531 51764 50067 157646 268235
$$ packed form
13900C55287j05062m7222k7044Q0803J5071K7342Q9798P8479q9670k0912L7620
13889C94490q4603k99575K413J78824J12828k6328p8646N3833L3563n9157M7560
13878B75202j09101r4866q0263O0869k3916r3329J76309K27340J06124N3987m0928
13867D57428q8866j73177p6045k8441Q8945J37335O2424j33074j74875p7990l9527
13856d5863R2873J47729p2136k9902O3741m7743o4675J5302j7333j01789R319
13845e0477L1191k7207O4238Q9630L7042n276R365k0462K1947K2257k9540n8596
13833H4112K8700N4116j2962m5047l5588o1751m2495R4494J52096O5235m9233
13822B31677M922K0434m6796N499Q4801k2529n1525j83952R233j697J07579J10589
$$ plain form
13810 268235 245838 241387 191484 225012 208441 202575 223265 343760 315945 263600 273068 219001
13798 219001 185731 197445 306549 346152 321685 339187 261705 182113 167242 160888 251773
13787 251773 162605 211201 382529 367531 299932 344001 396065 323561 343058 331184 223822
13776 223822 265419 334259 371600 457938 485468 260684 141094 158140 236057 281378 379967
13765 379967 393439 243242 192678 141931 136463 281763 224789 211869 159814 61787 124056
13754 124056 -36855 -19103 89948 114882 23247 -27826 -93886 -82630 -1225 80492 40820
13743 40820 -6557 26069 79688 148019 144333 172589 159324 230247 232384 120716 95238 137709
13731 137709 115371 13127 -79652 -49698 71603 136005 134592 181342 194932 51531 75922
$$ packed form
13810B68235k2397m451m9903L3528j6571n866K0690J20495k7815n2345R468n4067
13798B19001l3270J1714J09104L9603k4467J7502p7482p9592j4871o354R0885
13787B51773q9168M8596J71328j4998o7599M4069N2064p2504J9497j1874j07362
13776B23822M1597O8840L7341Q6338K7530k24784j19590J7046P7917M5321R8589
13765C79967J3472j50197n0564n0747n468J45300n6974j2920n2055r8027O2269
13754A24056j60911J7752J09051K4934r1635n1073o6060J1256Q1405Q1717l9672
13743D0820m7377L2626N3619O8331l686K8256j3265P0923K137j11668k5478M2471
13731A37709k2338j02244r2779K9954J21301O4402j413M6750J3590j43401K4391
$$ plain form
13720 75922 231189 220543 274941 339899 294082 151248 21548 25967 132577 69376 56351
13709 56351 53906 129271 209606 188989 196200 189816 202505 194692 96909 -5505 -52119 -41761
13697 -41761 42338 85340 139711 142793 97143 106101 30672 -24791 -128282 -209093 -109653 22050
13685 22050 -7688 -1141 -47515 -132943 -151675 -141815 -55009 17318 -26670 38767 25297 133090
13673 133090 278569 210031 239437 163650 61894 21063 -28395 93060 -11374 -35793 -23539
13662 -23539 -14580 -66907 -181491 -241780 -119823 172844 137445 -33649 -160079 -218571 -173138
13651 -173138 -100263 1023 65771 61848 43913 -58080 -114771 -33148 101459 -25589 -93069
13640 -93069 -37844 -27302 -7615 47968 241011 263293 218872 223375 157685 167855 191652 186467
$$ packed form
13720G5922J55267j0646N4398O4958m5817j42834j29700M419J06610o3201j3025
13709E6351k445P5365Q0335k0617P211o384J2689p813r7783j02414m6614J0358
13697d1761Q4099M3002N4371L082m5650Q958p5429n5463j03491q0811R9440J31703
13685B2050k9738O547m6374q5428j8732R860Q6806P2327m3988O5437j3470J07793
13673A33090J45479o8538K9406p5787j01756m0831m9458J21455j04434k4419J2254
13662b3539Q959n2327j14584o0289J21957K92667l5399j71094j26430n8492M5433
13651a73138P2875J01286O4748l923j7935j01993n6691Q1623J34607j27048o7480
13640i3069N5225J0542J9687N5583J93043K2282m4421M503o5690J0170K3797n185
$$ plain form
13628 186467 126961 156519 275356 249072 172226 97172 106541 62394 82283 38691 34065 159717
13616 159717 272752 151731 50550 31662 95480 183773 214786 265304 157109 39289
13606 39289 76640 -24430 -61472 -48749 -30461 721 -41541 -33900 141579 141265 27441 -159797
13594 -159797 -167707 -116023 -22336 16368 106318 162425 135673 94112 151039 66837 -4132 43411
13582 43411 -77450 -119421 -55016 31787 95096 121842 247064 241678 241580 200977 103426 -20058
13570 -20058 -32452 3627 90634 101106 121157 136197 64028 -33886 77624 181317 101649
13559 101649 132779 153545 135931 152714 103342 141384 206811 178117 119383 64992 57784 73864
13547 73864 66450 134191 127929 77796 -22095 -24946 26636 -65000 -12588 -8385 -6848 -55114 28741
$$ packed form
13628A86467n9506K9558J18837k6284p6846p5054R369m4147J9889m3592m626J25652
13616A59717J13035j21021j01181j8888O3818Q8293L1013N0518j08195j17820
13606C9289L7351j01070l7042J2723J8288L1182m2262P641J75479l14j13824j87238
13594a59797p910N1684R3687L8704Q9950N6107k6752m1561N6927q4202p0969M7543
13582D3411j20861m1971O4405Q6803O3309K6746J25222n386r8m0603r7551j23484
13570b0058j2394L6079Q7007J0472K0051J5040p2169r7914J11510J03693p9668
13559A01649L1130K0766j7614J6783m9372L8042O5427k8694n8734n4391p208J6080
13547G3864p414O7741o262n0133r9891k851N1582r1636N2412M203J537m8266Q3855
$$ plain form
13534 28741 45974 76824 75848 -4778 21376 10908 49254 15031 -7771 -55556 -44379 32552
13522 32552 41774 33956 -17844 -39959 74693 64985 -80468 -8779 36910 -26892 -54657 -22179
13510 -22179 -8260 56810 133049 158540 95395 39122 -15622 16391 192061 299603 292413
13499 292413 142518 30929 31119 65142 90514 88546 90900 100785 108197 64393 106879 122143
13487 122143 44345 48683 6207 -61160 -47876 45653 195061 87093 -51242 -67802 -200266
13476 -200266 -219907 -148793 -148389 -26818 22701 -56348 -26711 -48567 -11241 -116948 -255898
13465 -255898 -139394 17350 -138153 -139186 -180960 -157459 -98080 8829 82920 139039 144394
13454 144394 254432 344775 324135 205522 186989 235924 137240 57720 41002 44411 55056
$$ packed form
13534B8741J7233L0850r76q0626K6154j0468L8346l4223k2802m7785J1177P6931
13522C2552R222p818n1800k2115J14652r708j45453P1689M5689o3802k7765L2478
13510b2179J3919O5070P6239K5491o3145n6273n4744L2013J75670J07542p190
13499B92413j49895j11589J90L4023K5372j968K354R885P412m3804M2486J5264
13487A22143p7798M338m2476o7367J3284R3529J49408j07968j38335j6560j32464
13476b00266j9641P1114M04J21571M9519p9049K9637k1856L7326j05707j38950
13465b55898J16504J56744j55503j033m1774K3501N9379J06909P4091N6119N355
13454A44394J10038R0343k0640j18613j8533M8935r8684p9520j6718L409J0645
$$ plain form
13443 55056 69476 40174 78700 5805 22605 10335 -46686 23647 26412 -60209 -64432 -82203
13431 -82203 -143118 -101399 4431 -55898 -129555 -11503 -30872 49478 199834 270462 299820
13420 299820 414727 351867 102519 -96229 6949 25324 8156 -85144 -34723 75566
13410 75566 129916 115056 63769 123 38833 124421 203564 257741 250945 147979 124486 122907
13398 122907 125316 47131 74437 95042 -13227 -36877 -59185 -92474 -34449 91961 24199
13387 24199 -11138 28337 58159 20038 68438 114061 84749 94562 267423 250153 80223
13376 80223 -6014 -79809 -223345 -176243 -75992 -8618 -38445 -61623 -42173 121274 237011
13365 237011 333042 348635 170013 130151 142461 176942 80302 -58910 -97477 -153756 -86534
$$ packed form
13443E5056J4420k9302L8526p2895J6800j2270n7021P0333K765q6621m223j7771
13431h2203o0915M1719J05830o0329p3657J18052j9369Q0350J50356P0628K9358
13420B99820J14907o2860k49348j98748J03178J8375j7168r3300N0421J10289
13410G5566N4350j4860n1287o3646L8710Q5588P9143N4177o796j02966k3493j579
13398A22907K409p8185K7306K0605j08269k3650k2308l3289N8025J26410o7762
13387B4199l5337L9475K9822l8121M8400M5623k9312R813J72861j7270j69930
13376H0223q6237p3795j43536M7102J00251O7374k9827k3178J9450J63447J15737
13365B37011R6031J5593j78622l9862J2310L4481r6640j39212l8567n6279O7222
$$ plain form
13354 -86534 -32805 107180 42688 -14164 2905 90013 187295 186360 167164 72835 90177 213810
13342 213810 268955 190440 85360 6613 -13960 29708 95963 122745 143109 250742 203525
13331 203525 223802 143293 35135 49471 220970 192571 240148 160566 6080 -45075 -16896
13320 -16896 -35112 93748 90613 -15704 24972 41868 6529 -58896 -64889 -21262 50882 26676
13308 26676 106468 72994 41377 44562 59722 30242 -61681 -163684 -113613 -58257 -12168 168273
13296 168273 148890 54467 -24937 -70555 39906 74480 60094 118451 193187 202245 248110
13285 248110 212757 147151 213213 242436 308575 207930 22960 62447 166588 180060 224122
13274 224122 258679 174969 216057 226524 235082 99134 96204 141139 78654 214429 353617
$$ packed form
13354h6534N3729J39985o4492n6852J7069Q7108R7282r35j9196r4329J7342J23633
13342B13810N5145p8515j05080p8747k0573M3668O6255K6782K0364J07633m7217
13331B03525K0277q0509j08158J4336J71499k8399M7577p9582j54486n1155K8179
13320a6896j8216J28860l135j06317M0676J6896l5339o5425n993M3627P2144k4206
13308B6676P9792l3474l1617L185J5160k9480r1923j02003N0071N5356M6089J80441
13296A68273j9383r4423p9404m5618J10461L4574j4386N8357P4736R058M5865
13285B48110l5353o5606O6062K9223O6139j00645j84970L9487J04141J3472M4062
13274B24122L4557q3710M1088J0467Q558j35948k930M4935o2485J35775J39188
$$ plain form
13263 353617 292521 274852 288598 297003 243428 167987 123056 597 106976 214367 163477
13252 163477 168414 136257 101691 144873 218095 322779 333050 210485 229889 235285 195267
13241 195267 270266 344863 291326 284169 293216 266227 229317 110337 118325 206843 227228 89768
13229 89768 87376 269935 434507 352924 345418 571082 891810 1284964 1737866 2324894 2516921
13218 2516921 2374422 2010101 1619437 1256073 1019332 901085 676620 455353 516408 514151
13208 514151 381403 376452 464715 427261 429362 369425 274883 161274 275256 384052 374807
13197 374807 371684 312451 269817 253741 254380 392875 480013 341413 364698 553200 656969
13186 656969 640217 622160 627630 778203 928093 1075690 1132676 1571525 2282667 3407545
$$ packed form
13263C53617o1096j7669J3746Q405n3575p5441m4931j22459J06379J07391n0890
13252A63477M937l2157l4566M3182P3222J04684J0271j22565J9404N396m0018
13241A95267P4999P4597n3537p157R047k6989l6910j18980P988Q8518K0385j37460
13229H9768k392J82559J64572q1583p506K25664L20728L93154M52902N87028J92027
13218B516921j42499l64321l90664l63364k36741j18247k24465k21267O1055k257
13208E14151j32748m951Q8263l7454K101n9937r4542j13609J13982J08796r245
13197C74807l123n9233m2634j6076O39J38495Q7138j38600K3285J88502J03769
13186F56969j6752j8057N470J50573J49890J47597N6986M38849P11142J124878
$$ plain form
13176 3407545 4746128 6190119 7372952 7707712 6998416 5683554 4207388 3136694
13168 3136694 2647259 2271089 2151920 1913230 1688039 1514759 1373965 1247921 1064567
13159 1064567 982553 904829 822265 873647 747366 648563 665557 672416 550036 445846 449963
13148 449963 403983 387470 495531 545750 551042 644308 647261 549018 725846 802472 744269
13137 744269 810416 1051880 1289976 1686230 2366104 3329667 4553410 6110863 7486137
13128 7486137 7874707 7191171 5861575 4610559 3632994 3029446 2626376 2257822 2180075
13119 2180075 2016421 1678389 1495418 1408180 1366828 1330814 1239705 1081398 1083197 1163987 1202280
13108 1202280 1298756 1472406 1617583 1806615 2178960 2588326 3183582 4257287 5913734
$$ packed form
13176C407545J338583J443991J182833L34760p09296j314862j476166j070694
13168C136694m89435l76170j19169k38690k25191j73280j40794j26044j83354
13159A064567q2014p7724q2564N1382j26281r8803J6994O859j22380j04190M117
13148D49963m5980j6513J08061N0219N292R3266K953r8243J76828P6626n8203
13137G44269O6147K41464K38096L96254O79874R63563J223743J557453J375274
13128G486137L88570o83536j329596j251016r77565o03548m03070l68554p7747
13119B180075j63654l38032j82971q7238m1352l6014r1109j58307J799Q0790L8293
13108A202280R6476J73650J45177J89032L72345M09366N95256J073705J656447
$$ plain form
13099 5913734 8633359 12623287 17693343 22476820 23705018 20182978 15162548 11492805
13091 11492805 9145916 7595283 6641675 6057074 5768124 5729895 5762475 5676464 5409481
13082 5409481 4863953 4303455 3699663 3185434 2784776 2532807 2260655 1982165 1751329
13073 1751329 1622053 1419811 1465539 1288683 1035515 940384 794995 663672 641821 596836
13063 596836 435300 364635 337228 228524 211306 400040 435114 335003 283820 342937 447094
13052 447094 383451 353236 364143 388363 337921 332279 300785 134626 164788 313933 391459
13041 391459 318173 179262 138121 169417 -23762 -97344 81051 59567 98260 253855 251184
13030 251184 143566 28825 20488 11274 -60264 37379 71468 109546 187823 213588 238942
$$ packed form
13099E913734K719625L989928N070056M783477J228198l522040n020430l669743
13091A1492805k346889j550633r53608n84601k88950l8229L2580q6011k66983
13082E409481n45528n60498o03792n14229m00658k51969k72152k78490k30836
13073A751329j29276k02242M5728j76856k53168r5131j45389j31323k1851m4985
13063E96836j61536p0665k7407j08704j7218J88734L5074j00111n1183N9117J04157
13052D47094o3643l0215J0907K4220n0442n642l1494j66159L0162J49145P7526
13041C91459p3286j38911m1141L1296j93179p3582J78395k1484L8693J55595k671
13030B51184j07618j14741q337r214p1538R7643L4089L8078P8277K5765K5354
$$ plain form
13019 238942 266437 227942 157825 111785 11129 41424 117932 87103 -25888 -53170 58005
13008 58005 131184 192147 126523 173934 111777 60734 165636 346036 147910 19599 98848
12997 98848 158649 19934 -32857 -39351 -28462 -5379 41002 93577 34748 108 79592 97490
12985 97490 58027 32273 -186740 -324078 -151866 49989 162404 202372 345163 270484
12975 270484 233678 218573 112698 75457 45368 103246 151913 111996 -90498 3852 132657
12964 132657 210454 206197 193277 224003 96018 36142 64542 13845 -10398 -51348 -67234
12953 -67234 -10146 63463 48771 78290 104115 103535 123591 129735 151270 158673 195122 219871
12941 219871 269252 394266 510102 438641 275935 178360 236640 301133 394780 414380 351583
$$ packed form
13019B38942K7495l8495p0117m6040j00656L0295P6508l0829j12991k7282J11175
13008E8005P3179O0963o5624M7411o2157n1043J04902J80400j98126j28311P9249
12997I8848N9801j38715n2791o494J0889K3083M6381N2575n8829l4640P9484J7898
12985I7490l9463k5754k19013j37338J72212K01855J12415L9968J42791p4679
12975B70484l6806j5105j05875l7241l0089N7878M8667l9917k02494R4350J28805
12964A32657P7797m257j2920L0726j27985n9876K8400n0697k4243m0950j5886
12953f7234N7088P3609j4692K9519K5825n80K0056O144K1535P403L6449K4749
12941B19871M9381J25014J15836p1461j62706r7575N8280O4493R3647J9600o2797
$$ plain form
12930 351583 231538 180359 116064 140011 66158 -86932 -227227 -94914 134359 250280
12920 250280 299837 272151 197282 125686 22463 -47945 -59635 12141 138338 307999 314994
12909 314994 214555 107121 876 -49114 -33110 57287 87837 -3485 47722 22455 74126
12898 74126 77945 172163 148531 125764 171532 129240 133336 91238 142390 230710 357985 402870
12886 402870 422125 422647 287284 172142 148520 160255 161036 110205 16614 89043 103958 50636
12874 50636 -44596 2761 109079 119277 80288 74487 34487 46758 74730 32170 -99393
12863 -99393 -138025 -176566 -243381 -222031 -136840 -181558 -231260 -172755 -99367 -45321 34048 84328
12851 84328 58257 80513 51712 63885 9670 73442 237813 265725 234048 252049 188045
$$ packed form
12930C51583j20045n1179o4295K3947p3853j53090j40295J32313K29273J15921
12920B50280M9557k7686p4869p1596j03223p0408j1690P1776J26197J69661O995
12909C14994j00439j07434j06245m9990J6004R0397L0550r1322N1207k5267N1671
12898G4126L819R4218k3632k2767M5768m2292M096m2098N1152Q8320J27275M4885
12886D02870J9255N22j35363j15142k3622J1735P81n0831r3591P2429J4915n3322
12874E0636r5232M7357J06318J0198l8989n801m0000J2271K7972m2560j31563
12863i9393l8632l8541o6815K1350Q5191m4718m9702N8505P3388N4046P9369N0280
12851H4328k6071K2256k8801J2173n4215O3772J64371K7912l1677J8001o4004
$$ plain form
12840 188045 61001 -27888 -31067 -120048 -31645 61266 85666 21280 146541 147206 89146 220754
12828 220754 330683 345624 208298 112730 67512 -59892 -26998 -4385 58921 71700 -2474
12817 -2474 19044 27382 -47295 -62994 -94183 29287 55981 7556 138744 88678 -13889
12806 -13889 -63164 9745 30559 76758 141221 114424 94622 131004 60828 -38787 -207491
12795 -207491 -178541 -12956 -47725 -71660 -258430 -241808 -22642 80668 91773 53141 84282
12784 84282 36012 -27431 55333 149447 36796 56963 115110 121521 50129 -91773 -104077
12773 -104077 -47257 -44148 -85220 -43788 -18133 13105 47774 74341 82138 86117 12929 -102383
12761 -102383 -101128 -25576 -24435 -11589 55891 67787 45195 71727 178011 227217 198090 216039
$$ packed form
12840A88045j27044q8889l179q8981Q8403R2911K4400o4386J25261O65n8060J31608
12828B20754J09929J4941j37326r5568m5218j27404L2894K2613O3306J2779p4174
12817b474K1518Q338p4677j5699l1189J23470K6694m8425J31188n0066j02567
12806a3889m9275P2909K0814M6199O4463k6797j9802L6382p0176r9615j68704
12795b07491K8950J65585l4769k3935j86770J6622K19166J03310J1105l8632L1141
12784H4282m8270o3443Q2764R4114j12651K0167N8147O411p1392j41902j2304
12773a04077N6820L109m1072M1432K5655L1238L4669K6567P797L979p3188j15312
12761a02383J255P5552J141J2846O7480J1896k2592K6532J06284M9206k9127J7949
$$ plain form
12749 216039 245848 118853 116589 187075 144038 94315 184616 109683 -47395 43500 94238
12738 94238 186210 140886 26668 33422 137519 290603 429115 483118 576091 652395 534734
12727 534734 450675 328255 424751 510755 634593 607323 423781 270679 272390 316057 322279
12716 322279 253514 248652 219158 135602 179736 117876 125079 182198 157013 132331 146146 176266
12704 176266 223009 318275 184650 92475 59336 26479 12636 -24109 -59908 103279 137495
12693 137495 181538 181200 185672 139388 -86228 -158686 -132060 -153970 -49939 -16838 23150 49018
12681 49018 138297 221592 290519 209647 121506 119113 114967 -32609 -144334 -168873 -94545 351
12669 351 84502 124761 140107 141469 141420 154152 52863 34341 73451 325449 521556 824196
$$ packed form
12749B16039K9809j26995k264P0486m3037m9723R0301p4933j57078R0895N0738
12738I4238R1972m5324j14218O754J04097J53084J38512N4003R2973P6304j17661
12727E34734q4059j22420R6496Q6004J23838k7270j83542j53102J711M3667O222
12716C22279o8765m862k9494q3556M4134o1860P203N7119k5185k4682J3815L0120
12704A76266M6743R5266j33625r2175l3139l2857j3843l6745l5799J63187L4216
12693A37495M4043l38M472m6284k25616p2458K6626k1910J04031L3101L9988K5868
12681D9018Q9279Q3295O8927q0872q8141k393m146j47576j11725k4539P4328R4896
12669C51Q4151M0259J5346J362m9J2732j01289j8522L9110K51998J96107L02640
$$ plain form
12657 824196 932955 820887 808935 868040 1010830 1022972 859121 852714 618840 419276
12647 419276 354930 365629 252099 223562 201566 162955 144059 189150 49565 -15203 134826
12636 134826 395262 504676 447137 589128 713874 799488 1056087 1299278 1142237 814364
12626 814364 596295 534300 457427 269885 190503 174934 73737 90865 174584 206382 299362
12615 299362 337100 300995 314035 301410 321441 338554 191077 148510 171510 86391 19164
12604 19164 88903 60621 102267 124032 74146 -73665 -151696 -140531 -105845 3453 26078
12593 26078 81961 124982 46851 30319 1002 3179 -40966 -17607 -64522 3624 66006 36279
12581 36279 -13843 -45260 -23971 70345 306265 228311 53170 -72698 -103908 -38880 -82698
$$ packed form
12657H24196J08759j12068j1952N9105J42790J2142j63851o407k33874j99564
12647D19276o4346J0699j13530k8537k1996l8611j8896M5091j39585o4768J50029
12636A34826K60436J09414n7539J41991J24746Q5614K56599K43191j57041l27873
12626H14364k18069o1995p6873j87542p9382j5569j01197J7128Q3719L1798R2980
12615B99362L7738l6105J3040j2625K0031J7113j47477m2567K3000q5119o7227
12604A9164O9739k8282M1646K1765m9886j47811p8031J1165L4686J09298K2625
12593B6078N5883M3021p8131j6532k9317K177m4145K3359m6915O8146O2382k9727
12581C6279n0122l1417K1289R4316K35920p7954j75141j25868l1210O5028m3818
$$ plain form
12570 -82698 -24417 82117 67131 -6617 -126045 -93556 -36772 -24745 -6421 -48764 -74866
12559 -74866 -75102 -224244 -107235 -46217 -108675 -98330 -3381 223924 276901 181585 37333
12548 37333 12299 63879 93516 243576 99025 -27933 -49522 -41437 78333 167528 144405
12537 144405 -17324 -12417 40593 39853 103093 88056 57503 65695 145890 103389 4973 11047
12525 11047 169491 256048 190601 9870 -72350 -37548 82891 120630 24092 13061 90670
12514 90670 39299 31087 -19865 82303 165872 190017 131290 82377 50857 43790 60683 167985
12502 167985 162594 44421 -1425 112072 281667 222916 202604 261989 151021 22146 98897
12491 98897 134910 16881 -54714 -51672 18254 50828 -95123 -137751 -198330 -134757 -151829
$$ packed form
12570h2698N8281J06534j4986p3748j19428L2489N6784J2027J8324m2343k6102
12559g4866k36j49142J17009O1018o2458J0345R4949K27305N2977r5316j44252
12548C7333k5034N1580K9637J50060j44551j26958k1589Q085J19770Q9195k3123
12537A44405j61729M907N3010p40O3240j5037l0553Q192Q0195m2501r8416O074
12525A1047J58444Q6557o5447j80731q2220L4802J20439L7739r6538j1031P7609
12514I0670n1371q212n0952J02168Q3569K4145n8727m8913l1520p067J6893J07302
12502A67985n391j18173m5846J13497J69595n8751k0312N9385j10968j28875P6751
12491I8897L6013j18029p1595L042O9926L2574j45951m2628o0579O3573j7072
$$ plain form
12480 -151829 -145584 8940 68861 111767 67427 113701 60000 25136 92603 140922 91653
12469 91653 -22796 -45373 -130410 -123776 -24891 -42265 -154794 -67596 83574 169015 117589
12458 117589 -71710 -142751 -119967 -37033 15624 -14047 -96526 -145729 7462 63275 -33223
12447 -33223 -109694 -44417 -71551 -73867 -140533 -144578 -110907 -135928 -22054 6556 -10922 140512
12435 140512 190601 227024 182067 33048 -135843 -85200 -52989 -28322 9752 -9622 73080
12424 73080 175158 153520 211391 242454 187446 215582 216477 236467 105366 -2507 -44998
12413 -44998 75259 189901 195404 218935 196490 147792 116180 137817 138079 204311 208841 128200
12401 128200 10538 134025 -14251 12076 149700 167562 171986 84105 -8349 -74039 -86861
$$ packed form
12480a51829O245J54524N9921M2906m4340M6274n3701l4864O7467M8319m9269
12469I1653j14449k2577q5037O634R8885j7374j12529Q7198J51170Q5441n1426
12458A17589j89299p1041K2784Q2934N2657k9671q2479m9203J53191N5813r6498
12447c3223p6471O5277k7134k316o6666m045L3671k5021J13874K8610j7478J51434
12435A40512N0089L6423m4957j49019j68891N0643L2211K4667L8074j9374Q2702
12424G3080J02078k1638N7871L1063n5008K8136Q95J9990j31101j07873m2491
12413d4998J20257J14642N503K3531k2445m8698l1612K1637K62O6232M530q0641
12401A28200j17662J23487j48276K6327J37624J7862M424q7881r2454o5690j2822
$$ plain form
12390 -86861 -16720 51892 144574 209966 91518 -1637 58032 72045 129997 198618 149407
12379 149407 61956 -114111 -79369 53783 130115 125520 97037 59292 101629 35541 -46978
12368 -46978 -96467 -149279 -100802 53748 139436 108994 141778 252174 161297 135905 92228
12357 92228 86675 79327 41157 -27520 117900 161302 130736 93118 25846 35828 175209 149886
12345 149886 77935 -78534 -121003 -42230 -49274 -44857 -12301 -46078 -124582 -160165 -101975 -127108
12333 -127108 -217107 -226660 8920 310862 291707 189459 224298 283112 316132 406164 537263
12322 537263 389487 216874 165362 178356 173056 170635 87651 37541 139198 127849 93468
12311 93468 154744 87030 54223 172446 161726 57806 61457 59997 89980 113308 73104 -41875
$$ packed form
12390h6861P0141O8612R2682O5392j18448r3155N9669J4013N7952O8621m9211
12379A49407q7451j76067L4742J33152P6332m595k8483l7745M2337o6088q2519
12368d6978m9489n2812M8477J54550Q5688l0442L2784J10396r0877k5392m3677
12357I2228n553p348l8170o8677J45420M3402l0566l7618o7272R982J39381k5323
12345A49886p1951j56469m2469P8773p044M417L2556l3777p8504l5583N8190k5133
12333a27108q9999r553K35580L01942j9155j02248L4839N8814L3020R0032J31099
12322E37263j47776j72613n1512J2994n300k421q2984n0110J01657j1349l4381
12311I3468O1276o7714l2807J18223j0720j03920L651j460K9983K3328m0204j14979
$$ plain form
12299 -41875 -88240 -98251 -26272 -51066 -63323 23846 106675 128153 99170 149297 84723 37094
12287 37094 62853 62575 126993 129564 308949 357052 237185 198699 243149 348448 357598 334097
12275 334097 185360 98475 112030 145652 28808 24954 61309 15413 -63087 -52484 14233
12264 14233 -15858 -97580 -203311 -215082 -158594 -95124 -54116 -33129 89613 185070 61464
12253 61464 -51638 -172697 -163585 -257793 -127516 -110263 -30725 -62264 -15422 84358 236655
12242 236655 218157 74392 4131 89381 234898 245811 84814 15511 36585 61632 -45427
12231 -45427 -99958 -89466 -109403 -125261 -187801 -102476 731 15171 47082 182253 221504
12220 221504 95727 -57671 -138329 -93424 -45776 -97045 -142520 -51484 35259 71754 46503
$$ packed form
12299d1875m6365j0011P1979k4794j2257Q7169Q2829K1478k8983N0127o4574m7629
12287C7094K5759k78O4418K571J79385M8103j19867l8486M4450J05299R150k3501
12275C34097j48737q6885J3555L3622j16844l854L6355m5896p8500J0603O6717
12264A4233l0091q1722j05731j1771N6488O3470M1008K0987J22742R5457j23606
12253F1464j13102j21059R112r4208J30277J7253P9538l1539M6842R9780J52297
12242B36655j8498j43765p0261Q5250J45517J0913j60997o9303K1074K5047j07059
12231d5427n4531J0492j9937j5858o2540Q5325J03207J4440L1911J35171L9251
12220B21504j25777j53398q0658M4905M7648n1269m5475R1036Q6743L6495k5251
$$ plain form
12209 46503 93092 149033 -33960 -141561 -71134 -34864 79312 87549 34402 79654 112205
12198 112205 158490 166944 134031 105363 103826 51883 91979 134966 159396 56814 27030 -3047
12186 -3047 -37591 17829 42830 64087 2230 -71060 -221879 -302404 -221565 -92832 -78268
12175 -78268 40891 38067 -2671 36271 73458 95211 70910 31101 12522 -71816 -72080 29993
12163 29993 31260 -56412 -191712 -116971 -58745 -128132 -194867 -145068 -5657 27012 -4930
12152 -4930 -17072 -11726 4049 -34656 -13702 135293 165396 141165 95008 138580 3840 -91925
12140 -91925 -81060 22283 34436 -20358 -52660 10936 65162 132014 53140 72901 88003
12129 88003 -102155 -199978 -136366 -16716 48873 -14527 -31257 -57880 -95768 -57081 27938
$$ packed form
12209D6503M6589N5941j82993j07601P0427L6270J14176Q237n3147M5252L2551
12198A12205M6285Q454l2913k8668j537n1943M0096M2987K4430j02582k9784l0077
12186c047l4544N5420K5001K1257o1857p3290j50819q0525Q0839J28733J4564
12175g8268J19159k824m0738L8942L7187K1753k4301l9809j8579q4338k64J02073
12163B9993J267q7672j35300P4741N8226o9387o6735M9799J39411L2669l1942
12152d930j2142N346J5775l8705K0954J48995L0103k4231m6157M3572j34740r5765
12140i1925J0865J03343J2153n4794l2302O3596N4226O6852p8874J9761J5102
12129H8003j90158r7823O3612J19650O5589o3400j6730k6623l7888L8687Q5019
$$ plain form
12118 27938 35502 -34048 -8654 -2648 -10764 65642 69921 74138 -46894 -109725 -111458 -181616 -228282
12105 -228282 -272118 -217062 -112275 -69737 -14271 -16377 -32469 -46975 -28532 86935 103807
12094 103807 60717 -54060 -94078 -118179 -65016 -16246 17784 69514 105050 135226 -81597
12083 -81597 -107841 -47327 11436 998 -2361 -111330 -78904 -62643 -50660 -107512 -300758
12072 -300758 -249021 -115411 -64165 -103041 -175905 -174819 1718 138379 122438 101754 69480
12061 69480 1391 5855 -28108 -186641 -128840 -40892 -240471 -271669 -185350 -116327 -170929
12050 -170929 -150447 -173470 -49562 66598 -18412 -86210 -1378 -10624 13004 3800 17524
12039 17524 41128 32082 78288 99058 14540 -106091 -97821 -83572 -152626 -225017 -224747 -135368
$$ packed form
12118B7938P564o9550K5394O006q116P6406M279M217j21032o2831j733p0158m6666
12105b28282m3836N5056J04787M2538N5466k106j6092j4506J8443J15467J6872
12094A03807m3090j14777m0018k4101N3163M8770L4030N1730L5536L0176k16823
12083h1597k6244O0514N8763j0438l359j08969L2426J6261J1983n6852j93246
12072c00758N1737J33610N1246l8876p2864J086J76537J36661j5941k0684l2274
12061F9480o8089M464l3963j58533N7801Q7948j99579l1198Q6319O9023n4602
12050a70929K0482k3023J23908J16160q5010o7798Q4832r246K3628r204J3724
12039A7524K3604r046M6206K0770q4518j20631Q270J4249o9054p2391K70Q9379
$$ plain form
12027 -135368 -43255 26114 120343 112824 143193 53587 -10498 -44392 -35525 45140 90942 -19849
12015 -19849 -43051 45355 33014 -18497 -39945 -69922 -132245 -96389 -29413 66852 30424 3393
12003 3393 -54466 -104465 25040 63099 47982 -19797 125013 96121 -27871 49692 164341
11992 164341 77271 7556 8092 35356 181115 162956 140100 205376 147644 145595 183127 165887
11980 165887 53748 -11467 -68347 -15733 -82706 -130710 -69535 -51490 97239 44972 -115638
11969 -115638 -140481 -108572 9383 170931 181890 29635 120022 97633 78831 208013 264711
11958 264711 228317 202670 145943 118088 117354 10825 -41993 -61491 -17976 13081 -54225 -75349
11946 -75349 -43933 -87981 -41640 39535 67979 27000 14217 36661 82125 62211 37959 46620
$$ packed form
12027a35368R2113O9369R4229p519L0369q9606o4085l3894Q867Q0665M5802j10791
12015a9849k3202Q8406j2341n1511k1448k9977o2323L5856O6976R6265l6428k7031
12003C393n7859m9999J29505L8059j5117o7779J44810k8892j23992P7563J14649
11992A64341q7070o9715N36K7264J45759j8159k2856O5276n7732k049L7532j7240
11980A65887j12139o5215n6880N2614o6973m8004O1175J8045J48729n2267j60610
11969a15638k4843L1909J17955J61548J0959j52255R0387k2389j8802J29182N6698
11958B64711l6394k5647n6727k7855p34j06529n2818j9498M3515L1057o7306k1124
11946g5349L1416m4048M6341Q1175K8444m0979j2783K2444M5464j9914k4252Q661
$$ plain form
11934 46620 21544 -20571 -198490 -329939 -219045 -248913 -238175 -150272 117285 243680 210576
11923 210576 244544 101867 -68176 -183114 -198864 -9796 113867 129104 81285 58440
11913 58440 -9461 1656 18187 -71259 -97847 -54088 100906 146839 9667 -103522 -53717
11902 -53717 93910 148467 176515 1156 -133957 -88413 -69903 -42996 -142522 -159605 -75653
11891 -75653 -42871 51481 118914 40491 -187 40208 62625 -52683 -68623 -3703 -73107
11880 -73107 -129996 -74817 -16198 106209 94641 68782 14337 -3176 73699 65356 -1210 -74549
11868 -74549 -83672 -42103 -47388 -7046 39807 21248 -106131 -188734 -159815 -196418 -61008 -34891
11856 -34891 -14664 133300 120323 35144 -96294 -6912 -17325 -24992 -103897 -76951 -13292
$$ packed form
11934D6620k5076m2115j77919j31449J10894k9868J0738Q7903K67557J26395l3104
11923B10576L3968j42677j70043j14938j5750J89068J23663J5237m7819k2845
11913E8440o7901J1117J6531q9446k6588M3759J54994M5933j37172j13189M9805
11902e3717J47627N4557K8048j75359j35113M5544J8510K6907r9526j7083Q3952
11891g5653L2782R4352O7433p8423m0678M0395K2417j15308j5940O4920o9404
11880g3107n6889N5179N8619J22407j1568k5859n4445j7513P6875q343o6566p3339
11868g4549r123M1569n285M0342M6853j8559j27379q2603K8919l6603J35410K6117
11856c4891K0227J47964j2977q5179j31438Q9382j0413p667p8905K6946O3659
$$ plain form
11845 -13292 -100917 -204654 -141059 -46597 1836 -73526 -118829 -17127 13044 -53050 -64895
11834 -64895 -55225 -133686 -267351 -235171 -193657 -193523 -111444 -134568 -75222 33521 -37655 8249
11822 8249 -27738 -3295 3716 -75022 -118204 -230851 -171747 -168132 -176665 -143015 -122687 -73661
11810 -73661 -123206 -249278 -92151 -43979 30274 -105116 -255577 -213923 -231351 -273484 -229767
11799 -229767 -99024 -68091 -60558 -25079 -113591 -141945 -213401 -207328 -204557 -261380 -129364 -55031
11787 -55031 -52479 5647 51269 55051 187615 179731 76381 -3931 -73825 -13474 105874 137594
11775 137594 176141 179240 14784 -165445 -244606 -215895 -102666 -107800 7340 133881 159160
11764 159160 70856 70083 -9235 -51766 -37031 -112881 -172454 -179720 -210110 -123521 20909 51186
$$ packed form
11845a3292q7625j03737O3595R4462M8433p5362m5303J01702L0171o6094j1845
11834f4895R670p8461j33665L2180M1514J34Q2079k3124N9346J08743p1176M5904
11822H249l5987K4443P011p8738m3182j12647N9104L615q533L3650K0328M9026
11810g3661m9545j26072J57127M8172P4253j35390j50461M1654j7428m2133M3717
11799b29767J30743L0933P533L5479q8512k8354p1456O073K771n6823J32016P4333
11787e5031K552N8126M5622L782J32564p884j03350q0312o9894O0351J19348L1720
11775A37594L8547L099j64456j80229p9161K8711J13229n134J15140J26541K5279
11764A59160q8304p73p9318m2531J4735p5850n9573p266l0390Q6589J44430L0277
$$ plain form
11752 51186 35261 30850 30513 29998 10884 84264 82739 97107 91472 9960 18702 68581 59499
11739 59499 42807 -20500 -52991 -89183 -68372 -19520 -83565 -192912 -288202 -216527 -124378
11728 -124378 -54516 -73713 -50202 38370 56051 59532 41073 -9032 26930 100354 7357 -110525
11716 -110525 -64723 103840 88347 -66805 -80414 -61083 -86128 27050 67082 91656 3394
11705 3394 5496 -96171 -107764 -61795 15346 -32533 -25006 -57929 -220050 -341347 -357343 -260255
11693 -260255 -174225 -153892 -23611 162654 183754 140846 64133 -107126 -187002 -257193 -216260
11682 -216260 -69926 -98728 -5827 106851 54638 87758 143526 48277 86662 199957 167854
11671 167854 65085 40510 2370 58126 111306 100953 135037 192364 6715 -178472 -12443
$$ packed form
11752E1186j5925m411l37n15j9114P3380j525J4368n635q1512Q742M9879r082
11739E9499j6692o3307l2491l6192K0811M8852o4045j09347r5290P1675R2149
11728a24378O9862j9197K3511Q8572J7681L481j8459n0105L5962P3424r2997j17882
11716a10525M5802J68563j5493j55152j3609J9331k5045J13178M0032K4574q8262
11705C394K102j01667j1593M5969P7141m7879P527l2923j62121j21297j5996R7088
11693b60255Q6030K0333J30281J86265K1100m2908p6713j71259p9876p0191M0933
11682b16260J46334k8802R2901J12678n2213L3120N5768r5249L8385J13295l2103
11671A67854j02769k4575l8140N5756N3180j0353L4084N7327j85649j85187J66029
$$ plain form
11660 -12443 112289 210350 172899 -40699 -102852 -91686 -80523 33372 159739 94625 -4976
11649 -4976 131317 239024 165388 -3885 -181184 -109444 -88033 53569 45576 3312 -67903
11638 -67903 -88603 -52683 -97511 -248450 -257281 -121050 -93254 -156244 -155446 -21454 131332
11627 131332 127535 33952 -34592 -281570 -310828 -362347 -385249 -390056 -158266 7232 -79662
11616 -79662 -247310 -260049 -102794 30651 29540 60216 19286 114695 159759 100964 156032
11605 156032 112369 -16439 -21414 -35561 -160632 -207174 -92138 23576 151341 23123
11595 23123 -239875 -243174 -124858 -83758 -54896 26012 87363 143308 44629 5167 45946
11584 45946 -41799 -147150 -127710 -140006 -62988 -103973 -91059 -148419 -115612 -90554 -69743
$$ packed form
11660a2443J24732R8061l7451k13598o2153J1166J1163J13895J26367o5114r9601
11649d976J36293J07707p3636j69273j77299P1740K1411J41602p993m2264p1215
11638f7903k0700L5920m4828j50939q831J36231K7796o2990P98J33992J52786
11627A31332l797r3583o8544k46978k9258n1519k2902m807K31790J65498q6894
11616g9662j67648j2739J57255J33445j111L0676m0930R5409M5064n8795N5068
11605A56032m3663j28808m975j4147j25071m6542J15036J15714J27765j28218
11595B3123k62998l299J18316M1100K8862Q0908O1351N5945r8679l9462M0779
11584D5946q7745j05351J9440j2296P7018m0985J2914n7360L2807K5058K0811
$$ plain form
11573 -69743 -84706 -135597 -73049 27004 -18958 -137759 -64157 18816 113483 105398 161218
11562 161218 107587 43010 -74230 -15424 103073 48235 -3606 81863 30236 48989 1661
11551 1661 -6127 5013 27574 -50617 -79363 -130655 -117941 -104184 -116254 -175408 -225099 -160498
11539 -160498 -38247 -58856 -63970 -4548 -39602 -33770 45412 25073 -73930 -205336 -197289 -180793
11527 -180793 -37106 34304 54729 38351 -1080 -40691 13352 23512 -61149 29091 -23531
11516 -23531 -135705 -187983 -162522 -143966 -111653 -485 12764 23374 -63560 -148597 -302183
11505 -302183 -421191 -421100 -277780 -201557 -135327 -76608 -108653 -74167 -96283 -77024 -99611 -81944
11493 -81944 -225142 -296727 -371251 -371820 -146487 14517 9530 7945 103910 53266 28862 27808
$$ packed form
11573f9743j4963n0891O2548J00053m5962j18801P3602Q2973R4667q085N5820
11562A61218n3631o4577j17240N8806J18497n4838n1841Q5469n1627J8753m7328
11551A661p788J1140K2561p8191k8746n1292J2714J3757j2070n9154m9691O4601
11539a60498J22251k0609n114N9422l5054N832P9182k0339r9003j31406Q047J6496
11527a80793J43687P1410K0425j6378l9431l9611N4043J0160q4661R0240n2622
11516b3531j12174n2278K5461J8556L2313J11168J3249J0610q6934q5037j53586
11505c02183j19008R1J43320P6223O6230N8719l2045L4486k2116J9259k2587J7667
11493h1944j43198p1585p4524n69K25333J61004m987j585R5965n0644k4404j054
$$ plain form
11481 27808 47388 -47436 -31043 -24178 -25484 40444 10626 -10459 96360 75426 -24322 -102957
11469 -102957 -98975 11732 57470 19136 -84415 -163507 -266227 -328189 -316323 -290072 -247495
11458 -247495 -172232 -137902 -129078 -116750 33574 211063 172259 80331 25054 61706 97721
11447 97721 82461 34238 -25825 -39516 74364 82971 -97775 -169928 -129128 -154366 -324329
11436 -324329 -299508 -268955 -304369 -337878 -232673 -111730 -11227 16537 -120701 -194272 -118572
11425 -118572 -38951 28730 -1030 -19967 43277 107039 83997 130162 60704 -1963 -58729
11414 -58729 -9037 -28150 -25251 -30995 -75786 -56675 -234788 -224365 -134401 -93140 -66436 -82382
11402 -82382 -154040 -196905 -30479 -38157 -45064 -70125 -265080 -274277 -198947 -229101 -118972 -101386
$$ packed form
11481B7808J9580r4824J6393O865j306O5928k9818k1085J06819k0934r9748p8635
11469a02957L982J10707M5738l8334j03551p9092j02720o1962J1866K6251M2577
11458b47495P5263L4330Q824J2328J50324J77489l8804r1928n5277L6652L6015
11447I7721j5260m8223o0063j3691J13880Q607j80746p2153M0800k5238j69963
11436c24329K4821L0553l5414l3509J05205J20943J00503K7764j37238p3571P5700
11425a18572P9621O7681k9760j8937O3244O3762k3042M6165o9458o2667n6766
11414e8729M9692j9113K899n744m4791J9111j78113J0423Q9964M1261K6704j5946
11402h2382p1658m2865J66426p678o907k5061j94955r197P5330l0154J10129J7586
$$ plain form
11390 -101386 -155819 -93719 -26160 -97579 -111498 -28506 -75050 -186166 -235016 -115450 -113479
11379 -113479 -179913 -153343 -80067 -29963 -24955 23430 43315 -16497 -167519 -222752 -208555
11368 -208555 -155399 -88031 -18867 -24947 -4931 63847 2782 -55289 -60364 -103430 6350 -50208
11356 -50208 -191445 -184738 -56662 -124775 -95811 -64519 -132796 -183436 -136763 -1076 -60872
11345 -60872 -63047 -59391 -124031 -38505 -24419 -11005 29122 -27053 -89220 -109559 26745 87368
11333 87368 105708 68692 -59541 -35218 -100047 -249470 -198723 41546 61686 55861 160191
11322 160191 68045 53832 258452 331641 173874 94451 163016 153892 298044 358527 328260
11311 328260 236987 293438 259901 258563 344126 432393 394737 354986 380029 652113 945895
$$ packed form
11390a01386n4433O2100O7559p1419j3919Q2992m6544j11116m8850J19566J971
11379a13479o6434K6570P3276N0104N008M8385J9885n9812j51022n5233J4197
11368b08555N3156O7368O9164o080K0016O8778o1065n8071n075m3066J09780n6558
11356e0208j41237O707J28076o8113K8964L1292o8277n0640M6673J35687n9796
11345f0872k175L656o4640Q5526J4086J3414M0127n6175o2167k0339J36304O0623
11333H7368J8340l7016j28233K4323o4829j49423N0747K40269K0140n825J04330
11322A60191r2146j4213K04620P3189j57767p9423O8565r124J44152O0483l0267
11311C28260r1273N6451l3537j338Q5563Q8267l7656l9751K5043K72084K93782
$$ plain form
11300 945895 1059305 1043676 793159 511164 203839 45730 -21102 -57038 -33285 -24206 -7361
11289 -7361 59245 106535 102839 83429 73566 141231 258415 245187 255163 216617 63174 65754
11277 65754 87666 63304 129855 17495 -45580 97988 102628 29215 -44604 -147099 -209923
11266 -209923 -270475 -190697 -15881 34585 -79761 -104986 -84385 11546 -26433 -76707 -134404
11255 -134404 -213088 -281662 -177891 -115923 -62721 -95589 -146360 -213598 -190591 -89093 -69779
11244 -69779 -40287 5576 -39817 543 158685 118477 117889 230663 155577 145801 215931 191971
11232 191971 153467 130655 75360 147852 149877 184546 187933 61736 -26135 -22125 48926 134989
11220 134989 33856 39712 86242 63355 3240 42482 14195 58429 14830 29889 -18209
$$ packed form
11300I45895J13410j5629k50517k81995l07325j58109o6832l5936K3753R079J6845
11289g361O6606M7290l696j9410r863O7665J17184j3228R976l8546j53443K580
11277F5754K1912k4362O6551j12360o3075J43568M640p3413p3819j02495o2824
11266b09923o0552P9778J74816N0466j14346k5225K0601R5931l7979n0274n7697
11255a34404p8684o8574J03771O1968N3202l2868n0771o7238K3007J01498J9314
11244f9779K9492M5863m5393M0360J58142m0208n88J12774p5086r776P0130k3960
11232A91971l8504k2812n5295P2492K025L4669L387j26197q7871M010P1051Q6063
11220A34989j01133N856M6530k2887o0115L9242k8287M4234m3599J5059m8098
$$ plain form
11209 -18209 -68397 -205850 -46879 -16494 -12025 -140569 -38948 46042 129763 151928 165005
11198 165005 127762 -27175 -204562 -145977 -60744 -46923 -127169 -133387 -233421 -161014 -5810
11187 -5810 113964 111916 112968 23685 8172 -66260 -162898 -4804 50932 -35962 -36839 -124859
11175 -124859 -208782 -71797 -10645 36640 56557 8750 -115156 -279334 -244968 -146310 -196323
11164 -196323 -274770 -254496 -67902 -6253 42465 51102 137624 51222 -149575 -105784 -19470
11153 -19470 8705 -48197 -44300 -25905 -26034 -57216 25827 90218 816 -96646 -105206 -34934
11141 -34934 -50798 -133562 -60026 -12766 140982 378862 266292 134569 31207 29018 38603
11130 38603 14961 -103289 -140576 -126074 -98700 -66716 18273 -40783 -130823 -224432 -159283
$$ packed form
11209a8209n0188j37453J58971L0385M469j28544J01621Q4990Q3721K2165J3077
11198A65005l7243j54937j77387N8585Q5233J3821q0246o218j00034P2407J55204
11187e810J19774k048J052q9283j5513p4432r6638J58094N5736q6894q77q8020
11175a24859q3923J36985O1152M7285J9917m7807j23906j64178L4366R8658n0013
11164a96323p8447K0274J86594O1649M8718Q637Q6522q6402k00797M3791Q6314
11153a9470K8175n6902L897J8395j29l1182Q3043O4391q9402r7462q560P0272
11141c4934j5864q2764P3536M7260J53748K37880j12570j31723j03362k189R585
11130C8603k3642j18250l7287J4502K7374L1984Q4989n9056r0040r3609O5149
$$ plain form
11119 -159283 -114055 -67829 -102792 -98092 -38877 20344 -43594 -55866 -24142 4833 15248 15746
11107 15746 -1090 -67788 -79249 -101234 -77342 -64840 5571 25998 -22391 17340 -62706 -65108
11095 -65108 21173 -106147 -109451 -123790 -10807 82193 -19641 -28481 6084 120882 12407
11084 12407 -40191 19960 -49294 22650 62015 -17999 -52637 -165440 -116593 -69464 -135585
11073 -135585 -144292 -75548 -105055 -72355 -221547 -308745 -178978 -134596 -113656 20948 -43146
11062 -43146 -138931 -258224 -254355 -60924 -50776 -57852 -118110 -217444 -216058 -182136 -126982 -141275
11050 -141275 -173020 -130553 -119628 -51158 -52278 -125151 -141884 -110573 -34783 -36571 -14863 -121227
11038 -121227 -222982 -164787 -66529 -92487 -64496 82244 82493 79475 -16270 -114238 -75409 74419
$$ packed form
11119a59283M5228M6226l4963M700N9215N9221o3938j2272L1724K8975J0415M98
11107A5746j6836o6698j1461k1985K3892J2502P0411K0427m8389L9731q0046k402
11095f5108Q6281j27320l304j4339J12983R3000j01834q840L4565J14798j08475
11084A2407n2598O0151o9254P1944L9365q0014l4638j12803M8847M7129o6121
11073a35585q707O8744k9507L2700j49192q7198J29767M4382K0940J34604o4094
11062d3146r5785j19293L869J93431J0148p076o0258r9334J386L3922N5154j4293
11050a41275l1745M2467J0925O8470j120p2873j6733L1311P5790j788K1708j06364
11038a21227j01755N8195R8258k5958K7991J46740K49l018r5745r7968L8829J49828
$$ plain form
11026 74419 130098 59325 24902 14578 57450 22558 -40824 -46017 -20576 61458 -13551 -119646
11014 -119646 -170613 -99632 -130734 -122063 -90728 11514 101160 137185 85438 24273 44541
11003 44541 65315 40546 90679 4804 -152169 -239251 -318470 -403274 -354273 -285499 -172410
10992 -172410 -84250 -146105 -132301 -70739 -539 -23342 41936 -42026 -148710 -20592 -11262
10981 -11262 33307 133489 106077 61309 -25617 -94756 -196725 -346168 -359699 -338959 -185401
10970 -185401 -147352 -140050 -111063 -55623 879 120646 178525 166431 46559 -48740 -89655
10959 -89655 -43102 4275 -15539 -67045 9754 34322 -40547 2952 56005 41008 27033 1972
10947 1972 -139150 -128459 -50349 -78912 33599 189876 241935 206016 223121 142964 103903
$$ packed form
11026G4419N5679p0773l4423j0324M2872l4892o3382n193K5441Q2034p5009j06095
11014a19646n0967P0981l1102Q671L1335J02242Q9646L6025n1747o1165K0268
11003D4541K0774k4769N0133q5875j56973q7082p9219q4804M9001O8774J13089
10992a72410Q8160o1855J3804O1562P0200k2803O5278q3962j06684J28118R330
10981a1262M4569J00182k7412m4768q6926o9139j01969j49443j3531K0740J53558
10970a85401L8049P302K8987N5440N6502J19767N7879j2094j19872r5299m0915
10959h9655M6553M7377j9814n1506P6799K4568p4869M3499N3053j4997j3975k5061
10947A972j41122J0691P8110k8563J12511J56277N2059l5919J7105q0157l9061
$$ plain form
10936 103903 32951 -11979 41577 -28782 -23230 -103459 -157132 -207133 -158494 -144665 -124022 -57939
10924 -57939 -28402 26291 55699 -1408 43993 -16497 16217 10712 -44665 -72941 -104876 -246761
10912 -246761 -190839 -184257 -152880 -242961 -309789 -184722 -268144 -267933 -143158 -19349 12996
10901 12996 -65046 -47925 -374 89335 50274 -128970 13614 94315 -16523 4692 37487
10890 37487 -85641 -158167 -14104 122555 -10048 -19070 -191296 -173280 -159183 -116158 -89613
10879 -89613 -80796 -85236 -16411 66825 -25550 -14923 70595 138973 148365 145541 248103 153325
10867 153325 -1442 70885 91027 113975 108231 111933 109670 133611 74986 -95167 -177062 -52853
10855 -52853 19131 -46715 -115851 -53014 -79366 -55299 -149865 -180547 -117277 -117001 -55803 -48660
$$ packed form
10936A03903p0952m4930N3556p0359N552q0229n3673n0001M8639J3829K0643O6083
10924e7939K9537N4693K9408n7107M5401o0490L2714n505n5377k8276l1935j41885
10912b46761N5922O582L1377r0081o6828J25067q3422K11J24775J23809L2345
10901A2996p8042J7121M7551Q9709l9061j79244J42584Q0701j10838K1215L2795
10890C7487j23128p2526J44063J36659j32603r022j72226J8016J4097M3025K6545
10879h9613Q817m440O8825Q3236r2375J0627Q5518O8378R392k824J02562r4778
10867A53325j54767P2327K0142K2948n744L702k263K3941n8625j70153q1895J24209
10855e2853P1984o5846o9136O2837k6352K4067r4566l0682O3270K76O1198P143
$$ plain form
10843 -48660 49353 -39287 -62335 -44213 -117103 -84690 -101705 -132840 -94150 -155912 -174587 -137473
10831 -137473 -256034 -306304 -297355 -278444 -212850 1481 55747 -50749 -50223 -82041 -117050
10820 -117050 -58034 -52966 -180280 -149863 -109732 -5101 52501 81054 -73527 -200420 -196947
10809 -196947 -116019 34824 65150 42980 -23791 -19406 -64889 -159585 -162233 -192919 -159584 -136007
10797 -136007 -179490 -163069 -190451 -150550 -70849 -111985 -98329 -125321 -151454 23951 45304
10786 45304 56742 -6617 -31306 -17929 -62346 -81384 -14203 73531 84274 -54618 37099
10775 37099 82128 82823 15475 -57743 -80130 -86766 -24466 -84985 -154931 -210415 -119993 29502
10763 29502 31713 -65778 -161019 -161760 -95831 -125744 -88127 -48721 136343 253521 384252 497808
$$ packed form
10843d8660R8013q8640k3048J8122p2890L2413j7015l1135L8690o1762j8675L7114
10831a37473j18561n0270Q949J8911O5594K14331N4266j06496N26l1818l5009
10820a17050N9016N068j27314L0417M0131J04631N7602K8553j54581j26893L473
10809a96947Q0928J50843L0326k2170o6771M385m5483r4696k648l0686L3335K3577
10797a36007m3483J6421k7382L9901P9701m1136J3656k6992k6133J75405K1353
10786D5304J1438o3359k4689J3377m4417j9038O7181Q7734J0743j38892R1717
10775C7099M5029O95o7348p3218k2387o636O2300o0519o9946n5484R0422J49495
10763B9502K211r7491r5241p41O5929k9913L7617L9406J85064J17178J30731J13556
$$ plain form
10751 497808 514291 360243 248818 173689 39776 58341 169761 136179 150574 111889 97361
10740 97361 220728 262894 232184 149263 186164 142805 107748 63022 66363 40374 -46535 -115267
10728 -115267 -264407 -321218 -230632 -175494 -107951 -88285 -94202 -58634 -81989 -104972 36600
10717 36600 25013 -13554 -80296 -117910 54795 171860 96548 45584 84120 71887 32501
10706 32501 103913 144710 149326 138715 43564 -120971 -75635 -33708 -123142 -181414 -101776 4417
10694 4417 -16917 -32847 98401 100022 39150 -42325 -96672 -161137 -61566 -45202 -57522 -119792
10682 -119792 -119798 -87759 -44058 -5356 56701 192067 174618 132737 60025 -12157 32619 53357
10670 53357 -135286 -79902 -35846 -30698 -52230 -133433 -228493 -321420 -406605 -249357 -233182
$$ packed form
10751D97808J6483j54048j11425p5129j33913J8565J11420l3582J4395l8685j4528
10740I7361J23367M2166l0710q2921L6901m3359l5057m4726L341k5989q6909o8732
10728a15267j49140n6811R0586N5138O7543J9666n917L5568k3355k2983J41572
10717C6600j1587l8567o6742l7614J72705J17065p5312n0964L8536j2233l9386
10706C2501P1412M0797M616j0611r5151j64535M5336M1927q9434n8272P9638J06193
10694D417k1334j5930J31248J621o0872q1475n4347o4465R9571J6364j2320o2270
10682a19792oL2039M3701L8702O2057J35366j7449m1881p2712p2182M4776K0738
10670E3357j88643N5384M4056N148k1532q1203r5060r2927q5185J57248J6175
$$ plain form
10659 -233182 -203390 -81089 -42984 -94412 -153665 -207089 -91296 -33972 -20873 -53851 -142566
10648 -142566 -173092 -134150 -211103 -166946 -70033 18187 31734 2109 22430 51372 102918
10637 102918 141288 135701 190725 218857 235928 182519 293901 273797 158807 108152 51606
10626 51606 46660 150483 165139 -5030 -147935 -125084 -159559 -136152 -66666 -88267 -167812
10615 -167812 -225159 -237522 -164494 -148636 -73387 2301 -25738 -172841 -200774 -115456 -39842
10604 -39842 -127103 -147848 -85471 -16408 -147397 -185652 -168052 -215786 -244632 -211511 -168388
10593 -168388 -171691 -182582 -95165 170776 -34635 -95188 -36297 6011 49653 18990 -33444
10582 -33444 -220211 -213734 -170248 -211392 -237598 -226455 -269840 -136193 -120672 -214467 -200302
$$ packed form
10659b33182K9792J22301L8105n1428n9253n3424J15793N7324J3099l2978q8715
10648a42566l0526L8942p6953M4157R6913Q8220J3547k9625K0321K8942N1546
10637A02918L8370n587N5024K8132J7071n3409J11382k0104j14990n0655n6546
10626E1606m946J03823J4656j70169j42905K2851l4475K3407O9486k1601p9545
10615a67812n7347j2363P3028J5858P5249P5688k8039j47103k7933Q5318P5614
10604c9842q7261k0745O2377O9063j30989l8255J7600m7734k8846L3121M3123
10593a68388l303j0891Q7417K65941k05411o0553N8891M2308M3642l0663n2434
10582c3444j86767O477M3486m1144k6206J1143m3385J33647J5521r3795J4165
$$ plain form
10571 -200302 -127312 -222184 -235793 -115229 -114389 -123577 -143476 -155510 -138818 -169843 -266161 -331993
10559 -331993 -353702 -368173 -197932 -142177 -135477 -150920 -162626 -42843 -2660 -46919 -45222
10548 -45222 -38706 -32137 -138896 -252682 -238943 -106340 -51662 -81946 -54010 30085 -33253
10537 -33253 -98468 9865 63522 82368 28342 -106952 -243082 -182968 -104647 -105656 -113331
10526 -113331 -139127 -173803 -204244 -221648 -245958 -76784 -67860 -139335 -294278 -257758 -329536
10515 -329536 -271500 -246320 -186603 -137185 -115462 -65801 -73738 -98000 -29256 -28560 -84645 -63722
10503 -63722 70668 21956 94179 227907 230624 131205 21046 -201020 -229702 -162840 -204165
10492 -204165 -173979 -175968 -154227 -64180 38225 -101654 -298443 -193044 -78916 -114956 -66947
$$ packed form
10571b00302P2990r4872j3609J20564Q40r188j9899j2034J6692l1025r6318o5832
10559c31993k1709j4471J70241N5755O700j5443j1706J19783M0183m4259J697
10548d5222O516O569j06759j13786J3739J32603N4678l0284K7936Q4095o3338
10537c3253o5215J08333N3657J8846n4026j35294j36130O0114P8321j009p675
10526a13331k5796l4676l0441j7404k4310J69174Q924p1475j54943L6520p1778
10515c29536N8036K5180N9717M9418K1723M9661p937k4262O8744O96n6085K0923
10503f3722J34390m8712P2223J33728K717r9419j10159k22066k8682O6862m1325
10492b04165L0186j989K1741R0047J02405j39879j96789J05399J14128l6040M8009
$$ plain form
10481 -66947 -138460 -217397 -251623 -302243 -318992 -154727 -141064 -74799 -94018 -218657 -226521
10470 -226521 -265856 -197567 -138495 -211177 -123398 -164957 -215055 -192939 -156582 -134668 4199
10459 4199 23984 -31472 25026 89647 127039 112583 89445 -22262 -43615 -19454 -2707 18147
10447 18147 2462 -51248 -133665 -195489 -121336 -206778 -187975 -66353 64796 49748 35818
10436 35818 6288 -23838 -210489 -109437 -42950 -118598 -146250 -122741 -107152 -164738 -302275
10425 -302275 -343888 -320739 -150990 13190 -26558 -64971 -46168 -57688 -63889 13757 17015
10414 17015 42521 28752 -53191 -164930 -116188 -33314 -52749 -113960 -190205 -171885 -121607
10403 -121607 -110756 -20802 53385 -54846 -19223 132212 245069 319666 411952 452875 346646
$$ packed form
10481f6947p1513p8937l4226n0620j6749J64265J3663O6265j9219j24639p864
10470b26521l9335O8289N9072p2682Q7779m1559n0098K2116L6357K1914J38867
10459D199J9785n5456N6498O4621L7392j4456k3138j11707k1353K4161J6747K0854
10447A8147j5685n3710q2417o1824P4153q5442J8803J21622J31149j5048j3930
10436C5818k9530l0126j86651J01052O6487p5648k7652K3509J5589n7586j37537
10425c02275m1613K3149J69749J64180l9748l8413J8803j1520o201P7646L258
10414A7015K5506j3769q1943j11739M8742Q2874j9435o1211p6245J8320N0278
10403a21607J0851Q9954P4187j08231L5623J51435J12857P4597R2286M0923j06229
$$ plain form
10392 346646 186091 99389 37426 20238 -73431 -65729 -3544 95845 203542 149782 -48650
10381 -48650 -84690 -59034 -145936 -183603 -49187 -9518 11417 15941 -30088 -81427 -188808
10370 -188808 -155466 -140033 -68913 43137 195593 321905 361204 502802 596981 511817 502657
10359 502657 688586 690675 663025 593330 479324 389123 294047 279511 226666 86918 85996
10348 85996 103595 28180 6656 54870 109755 161768 51485 36864 13339 -37645 -73354
10337 -73354 -159906 -217906 -1234 184208 181540 45325 -39949 -58179 -106228 -245353 -217202
10326 -217202 -198167 -126020 -21069 -759 48918 14647 -116792 -229001 -215273 -111344 -159193
10315 -159193 -6868 123293 62062 25094 97357 48547 3196 99425 150930 180775 211466
$$ packed form
10392C46646j60555q6702o1963j7188r3669P702O2185R9389J07697n3760j98432
10381d8650l6040K5656q6902l7667J34416L9669K0935M524m6029n1339j07381
10370a88808L3342J5433P1120J12050J52456J26312L9299J41598R4179q5164r160
10359E02657J85929K089k7650o9695j14006r0201r5076j4536n2845j39748r22
10348H5996J7599p5415k1524M8214N4885N2013j10283j4621k3525n0984l5709
10337g3354q6552n8000K16672J85442k668j36215q5274j8230m8049j39125K8151
10326b17202J9035P2147J04951K0310M9677l4271j31439j12209J3728J03929m7849
10315a59193J52325J30161o1231l6968P2263m8810m5351R6229N1505K9845L0691
$$ plain form
10304 211466 183745 44673 82500 136444 121111 93597 141424 92259 -46995 -93760 -162267
10293 -162267 -141020 -64115 -51415 -123229 -289142 -366110 -121980 -60738 -73265 -52971 -175681
10282 -175681 -175228 -125298 -117104 -111839 -134556 -216546 -173136 -243211 -274407 -141083 36580 173343
10270 173343 115367 42544 -15012 23745 -149589 -142240 32604 33834 -175468 -111416 35153
10259 35153 142021 186700 167865 279543 423000 541838 632406 525884 478802 473287 651854
10248 651854 814892 711967 525333 436614 425006 410677 352606 293117 265419 253599 155965
10237 155965 108793 -22726 -84293 -163913 -49978 28397 56779 84316 77061 68988 -10349
10226 -10349 -153113 -64476 115958 161841 147942 157519 127449 -15917 -58922 55796 -26634
$$ packed form
10304B11466k7721j39072L7827N3944j5333k7514M7827m9165j39254m6765o8507
10293a62267K1247P6905J2700p1814j65913p6968K44130O1242j2527K0294j22710
10282a75681M53M9930Q194N265k2717q1990M3410p0075l1196J33324J77663J36763
10270A73343n7976p2823n7556L8757j73334P349J74844J230k09302O4052J46569
10259C5153J06868M4679j8835J11678J43457J18838R0568j06522m7082n515J78567
10248F51854J63038j02925j86634q8719j1608j4329n8071n9489k7698j1820r7634
10237A55965m7172j31519o1567p9620J13935P8375K8382K7537p255q073p9337
10226a0349j42764Q8637J80434M5883j3899R577l0070j43366m3005J14718q2430
$$ plain form
10215 -26634 -97388 -31458 -152680 -206376 -68747 -2965 -37304 -48461 -97480 -35822 -75311
10204 -75311 -46062 -93849 -117594 -205226 -253483 -205936 -163810 -215746 -137899 -123850 -155036 -129922
10192 -129922 17209 1883 55467 -1688 -63420 -73547 -244203 -134612 -39709 16171 -73809
10181 -73809 -62682 23047 -94790 -148408 -180152 -200555 -134611 -87277 -100214 -107522 -16109 13343
10169 13343 -16914 14779 -59564 -71020 -68677 26018 145106 74262 49697 65744 134059 201897
10157 201897 191254 202946 305441 476950 410697 242100 146680 166948 71576 13809 -17960
10146 -17960 29248 99418 153930 136479 165497 268400 164942 81949 24642 -68619 -42971
10135 -42971 -33475 14163 153575 227932 231520 178569 134053 126242 73415 27506 63638 137029
$$ packed form
10215b6634p0754O5930j21222n3696J37629O5782l4339j1157m9019O1658l9489
10204g5311K9249m7787k3745q7632m8257M7547M2126n1936P7847J4049l1186K5114
10192a29922J47131j5326N3584n7155o1732j0127j70656J09591R4903N5880q9980
10181g3809J1127Q5729j17837n3618l1744k0403O5944M7334j2937p308R1413K9452
10169A3343l0257L1693p4343j1456K343R4695J19088p0844k4565J6047O8315O7838
10157B01897j0643J1692J02495J71509o6253j68597r5420K0268r5372n7767l1769
10146a7960M7208P0170N4512j7451K9018J02903j03458q2993n7307r3261K5648
10135d2971R496M7638J39412P4357L588n2951m4516p811n2827m5909L6132P3391
$$ plain form
10123 137029 142317 114239 181059 134225 79736 -22378 -82037 -295558 -336564 -311260 -228536
10112 -228536 -191857 -172025 -86519 -120838 -106449 -58776 -41925 78548 178487 157751 99314
10101 99314 13603 -83959 -52330 -129221 -168491 -171732 -203516 -224991 -151842 -158171 -83538 42552
10089 42552 29446 13107 28977 -98940 -94707 -15049 -49440 28813 42171 2276 -53360 -133183
10077 -133183 -92708 150329 183856 72345 -13326 -35560 100758 150871 78659 143767 163188
10066 163188 55797 -21761 6226 170524 370299 476540 483143 434993 355947 236589 293255
10055 293255 265090 333910 288406 198748 122168 152870 181856 221403 164678 -47993 -133222
10044 -133222 -48479 -19028 106381 62906 56153 -23414 -5977 227959 218577 113082 79144
$$ packed form
10123A37029N288k8078O6820m6834n4489j02114n9659k13521m1006K5304Q2724
10112b28536L6679J9832Q5506l4319J4389M7673J6851J20473R9939k0736n8437
10101I9314q5711r7562L1629p6891l9270l241l1784k1475P3149o329P4633J26090
10089D2552j3106j6339J5870j27917M233P9658l4391P8253J3358l9895n5636p9823
10077a33183M0475K43037L3527j11511q5671k2234J36318N0113p2212O5108J9421
10066A63188j07391p7558K7987J64298J99775J06241O603m8150p9046j19358N6666
10055B93255k8165O8820m5504q9658p6580L0702K8986L9547n6725k12671q5229
10044a33222Q4743K9451J25409m3475o753p9567J7437K33936r382j05495l3938
$$ plain form
10033 79144 52077 -26236 -43539 44590 -49392 -126934 -134383 -146434 -156363 -275452 -268065 -214523
10021 -214523 -134520 -152364 -246568 -228644 -46897 -145567 -261360 -238258 -199045 -230089 -212390
10010 -212390 -315152 -393357 -308638 -259858 -175659 -84073 -76370 -193996 -228038 -100566 -35533
9999 -35533 60053 72931 153065 123364 158874 158822 135846 68930 107071 172020 176976 70494
9987 70494 106582 101210 48689 60254 -87928 -46087 45935 95192 32279 -45470 -137204 -246818
9975 -246818 -163261 -209909 -164956 -205182 -225536 -190216 -215086 -147444 -141182 -162998 -123653 79579
9963 79579 104139 -33530 -199435 -201853 -16227 141280 85285 -100232 -238955 -270671 -236357
9952 -236357 -214279 -57597 39592 36464 -54343 -129316 -37234 -61236 -181007 -209503 -162138
$$ packed form
10033G9144k7067p8313j7303Q8129r3982p7542p449j2051r929j19089P387N3542
10021b14523Q0003j7844r4204J7924J81747r8670j15793K3102L9213l1044J7699
10010b12390j02762p8205Q4719M8780Q4199R1586P703j17626l4042J27472O5033
9999c5533R5586J2878Q0134k9701L5510n2k2976o6916L8141O4949M956j06482
9987G0494L6088n372n2521J1565j48182M1841R2022M9257o2913p7749r1734j09614
9975b46818Q3557m6648M4953m0226k0354L5320k4870O7642O262k1816L9345K03232
9963G9579K4560j37669j65905k418J85626J57507n5995j85517j38723l1716L4314
9952b36357K2078J56682R7189l128r0807p4973R2082k4002j19771k8496M7365
$$ plain form
9941 -162138 -169690 -205260 -335256 -438674 -308348 -257515 -276786 -290255 -191846 -164970 -55327
9930 -55327 -17828 -156905 -155038 -119318 -184756 -191231 -91445 6113 12903 -121151 -113880 -51588
9918 -51588 -134470 -84891 -21351 -56023 -18833 -21050 -66724 -75107 51943 -9730 -31863 -12670
9906 -12670 144412 207010 131787 -7209 -44128 -139351 -160949 -92521 -74990 -18531 13593
9895 13593 114982 206085 162217 75668 114023 209031 233243 245299 316628 316192 405717 459846
9883 459846 465829 400532 304237 363893 540545 795805 903026 1026147 1297246 1563936 1937521
9872 1937521 2455218 3242418 4652048 6795359 10193342 15511031 22596581 30137891 34380268
9863 34380268 32830587 26797516 20107353 15215289 11925275 9699473 8206265 7278362
$$ packed form
9941a62138p552l5570j29996j03418J30326N0833j9271j3469R8409K6876J09643
9930e5327L7499j39077J867L5720o5438o475R9786R7558O790j34054P271O2292
9918e1588q2882M9579O3540l4672L7190k217m5674q383J27050o1673k2133J9193
9906a2670J57082O2598p5223j38996l6919r5223k1598O8428J7531N6459L2124
9895A3593J01389R1103m3868q6549L8355R5008K4212J2056P1329m36Q9525N4129
9883D59846N983o5297r6295N9656J76652K55260J07221J23121K71099K66690L73585
9872A937521N17697P87200J409630K143311L397983N317689P085550P541310M242377
9863C4380268j549681o033071o690163m892064l290014k225802j493208r27903
$$ plain form
9855 7278362 6469232 5784355 5255292 4643916 4212995 3638456 3127097 2756510 2377820 2130668
9845 2130668 1928805 1824163 1806221 1805183 1690778 1410995 1179965 1055191 1028969 921274
9835 921274 853395 813873 604980 605157 590873 553947 572357 510472 530846 481649 329025 307499
9823 307499 310627 276027 284383 190770 141344 76445 122711 252573 295944 230885 143658 116879
9811 116879 153365 114311 38386 -19968 88956 158801 6765 -188881 -227763 -193156 -106493
9800 -106493 17751 184221 196879 161236 79353 -64681 -32910 78366 1856 -97743 34942
9789 34942 20171 5491 -44313 -110217 -26858 -17468 -44631 32977 104332 247141 199039 147581
9777 147581 120802 88638 -59679 -80791 -62395 37748 54354 17306 98999 105067 -33414
$$ packed form
9855G278362q09130o84877n29063o11376m30921n74539n11359l70587l78690k47152
9845B130668k01863j04642j7942j038j14405k79783k31030j24774k6222j07695
9835I21274o7879l9522k08893J77j4284l6926J8410o1885K0374m9197j52624k1526
9823C07499L128l4600Q356r3613m9426o4899M6266J29862M3371o5059q7227k6779
9811A16879L6486l9054p5925n8354J08924O9845j52036j95646l8882L4607Q6663
9800a06493J24244J66470J2658l5643q1883j44034L1771J11276p6510r9599J32685
9789C4942j4771j4680m9804o5904Q3359R390k7163P7608P1355J42809m8102n1458
9777A47581k6779l2164j48317k1112J8396J00143J6606l7048Q1693O068j38481
$$ plain form
9766 -33414 -34991 -65100 10528 -51853 -205909 -205980 -34455 12123 8346 -13987 62743 95565
9754 95565 59342 -28959 -71286 -3750 119214 125114 -4852 -14156 24886 54380 55538 17223
9742 17223 31457 62866 9792 47161 31609 -36979 -43658 -47085 3129 -16951 -95911 -161366
9730 -161366 -267642 -408858 -397947 -176102 -48857 -129071 -34503 -40217 -39647 -1900 65359
9719 65359 -87478 -224460 -172424 -142499 -87403 108049 123384 175669 84987 -31130 -48712
9708 -48712 -45972 -230798 -324270 -285599 -206725 -97880 -51517 -67145 -144471 -81332 106129
9697 106129 215155 173453 92630 -80171 -50046 206666 236843 124663 146821 130878 154175
9686 154175 231873 256392 181592 111135 107671 286395 255899 105012 74550 72371 -46319
$$ packed form
9766c3414j577l0109P5628o2381j54056p1J71525M6578l777k2333P6730L2822
9754I5565l6223q8301m2327O7536J22964N900j29966r304L9042K9494J158l8315
9742A7223J4234L1409n3074L7369j5552o8588o679l427N0214k0080p8960o5455
9730a61366j06276j41216J0911K21845J27245q0214R4568n714N70L7747O7259
9719F5359j52837j36982N2036K9925N5096J95452J5335N2285r0682j16117j7582
9708d8712K740j84826r3472L8671P8874J08845M6363j5628p7326O3139J87461
9697A06129J09026m1702q0823j72801L0125K56712L0177j12180K2158j5943K3297
9686A54175P7698K4519p4800p0457l464J78724l0496j50887l0462k179j18690
$$ plain form
9675 -46319 -173584 -188382 -92322 26485 8897 -77152 -6728 181602 137687 -52944 -164045
9664 -164045 -171869 -117812 -179113 -160827 -133609 -51843 -39583 -47764 -28674 -1599 5916 -30905
9652 -30905 23537 67033 135132 72679 6748 -30338 -42829 2886 93244 26330 -60659 -133675
9640 -133675 -150479 -214440 -67408 3443 -33043 -82271 -194806 -214669 -112556 -83510 -153849
9629 -153849 -109749 10212 18482 90019 44505 27049 -18505 -62098 -69458 -120404 -157727 58283
9617 58283 79971 17443 -66108 -90137 16097 148750 195487 102579 -103386 -182103 -60233
9606 -60233 -20285 10176 145109 94438 258789 380618 290562 224834 186947 176380 210401
9595 210401 181425 151673 95211 35619 14846 14566 114927 183759 264251 234099 194347 238405
$$ packed form
9675d6319j27265j4798R6060J18807j7588q6049P0424J88330m3915j90631j11101
9664a64045p824N4057o1301J8286K7218Q1766J2260q181J9090K7075P515l6821
9652c0905N4442M3496O8099o2453o5931l7086j2491M5715R0358o6914q6989p3016
9640a33675j6804o3961J47032P0851l6486m9228j12535j9863J02113K9046p0339
9629a53849M4100J19961Q270P1537m5514j7456m5554m3593p360n0946l7323K16010
9617E8283K1688o2528q3551k4029J06234J32653M6737r2908k05965p8717J21870
9606f0233L9948L0461J34933n0671J64351J21829r0056o5728l7887j0567L4021
9595B10401k8976k9752n6462n9592k0773k80J00361O8832Q0492l0152l9752M4058
$$ plain form
9583 238405 313473 236406 79242 196173 323856 265006 273383 239561 177137 24110 -25308
9572 -25308 4497 -13592 -20183 -12452 -19946 2800 95956 179234 88832 158757 316832 342260
9560 342260 195420 46929 142724 221975 239595 198034 256281 313383 311821 287596 260405
9549 260405 340294 351287 354482 316416 338517 426216 424897 400667 453264 530461 599138 539377
9537 539377 510224 359533 493764 672020 634007 628417 731373 800320 689797 706345 695828
9526 695828 609176 571068 621192 777687 878732 952823 838300 782854 722234 818215 970659
9515 970659 1150004 1220698 1272555 1241209 1266012 1328172 1335589 1301738 1315002 1422058 1558766
9504 1558766 1682537 1989160 2149443 2259889 2284550 2299388 2381090 2656645 2842252 3068481
$$ packed form
9583B38405P5068p7067j57164J16931J27683n8850Q377l3822o2424j53027m9418
9572b5308K9805j8089o591P731p494K2746R3156Q3278r0402O9925J58075K5428
9560C42260j46840j48491R5795P9251J7620m1561N8247N7102j562k4225k7191
9549B60405P9889J0993L195l8066K2101Q7699j319k4230N2597P7197O8677n9761
9537E39377k9153j50691J34231J78256l8013n590J02956O8947j10523J6548j0517
9526F95828q6652l8108N0124J56495J01045P4091j14523n5446o0620R5981J52444
9515I70659J79345P0694N1857l1346K4803O2160P417l3851J3264J07056J36708
9504A558766J23771L06623J60283J10446K4661J4838Q1702K75555J85607K26229
$$ plain form
9494 3068481 3239564 3318166 3436883 3664628 3911389 4304439 4615075 4919845 5347528 5876777
9484 5876777 6418377 6954329 7578274 8351905 9035112 9779699 10634064 11590953 12738341
9475 12738341 13876492 15219795 16720269 18353119 20130999 22060868 24268754 26499937
9467 26499937 28802908 31201141 33638826 36152234 38870335 41397014 43782530 46095487
9459 46095487 48190863 50120871 51724668 53118564 54350458 55384887 56191586 56817311
9451 56817311 57520020 58108200 58618758 59207420 59799253 60471239 61262740 62133617 63162513
9442 63162513 64612585 66262995 68212772 70490831 73222892 76469332 80148860 84304198
9434 84304198 88928337 94015252 99714277 105794363 112274287 119083606 126033486 132494588
$$ packed form
9494C068481J71083P8602J18717K27745K46761L93050L10636L04770M27683N29249
9484E876777N41600N35952O23945P73631O83207P44587Q54365R56889J147388
9475A2738341J138151J343303J500474J632850J777880J929869K207886K231183
9467B6499937K302971K398233K437685K513408K718101K526679K385516K312957
9459D6095487K095376J930008J603797J393896J231894J034429Q06699O25725
9451E6817311P02709N88180N10558N88662N91833O71986P91501Q70877J028896
9442F3162513J450072J650410J949777K278059K732061L246440L679528M155338
9434H4304198M624139N086915N699025O080086O479924O809319O949880O461102
$$ plain form
9426 132494588 138291962 143118801 146621112 148564011 148822285 147549630 144821230 140938427
9418 140938427 136152912 130964371 125354247 119685376 114160321 108813007 103775736 99199029
9410 99199029 94953789 90957920 87271863 83931508 81000248 78325016 75851805 73716812
9402 73716812 71938255 70518825 69140168 67829450 66859103 66021528 65380313 64776199 64201038
9393 64201038 63674890 62994273 62108821 61159172 60215006 58896607 57394010 55781040 53923460
9384 53923460 51898597 49738334 47476056 45144231 42783531 40367733 38193788 35977943
9376 35977943 33721349 31650891 29710828 27835501 26029134 24301486 22797841 21368194
9368 21368194 20028607 18909506 17755514 16597986 15636396 14680632 13735951 12982238 12153224
$$ packed form
9426A32494588N797374M826839L502311J942899K58274j272655k728400l882803
9418A40938427m785515n188541n610124n668871n525055n347314n037271m576707
9410I9199029m245240l995869l686057l340355k931260k675232k473211k134993
9402G3716812j778557j419430j378657j310718r70347q37575o41215o04114n75161
9393F4201038n26148o80617q85452r49649r44166j318399j502597j612970j857580
9384E3923460k024863k160263k262278k331825k360700k415798k173945k215845
9376C5977943k256594k070458j940063j875327j806367j727648j503645j429647
9368B1368194j339587j119101j153992j157528r61590r55764r44681p53713q29014
$$ plain form
9359 12153224 11400382 10858370 10437539 9826174 9196364 8690984 8278875 8008286 7686284
9350 7686284 7234361 6845906 6406265 6123737 5891194 5661377 5512990 5438005 5181006 4939297
9340 4939297 4738124 4602337 4419194 4316991 4187632 3936139 3825874 3750470 3670843 3562496
9330 3562496 3498554 3405334 3206785 2982437 2934350 2977435 2935326 2828656 2735620 2718474 2666353
9319 2666353 2623217 2525737 2420332 2379426 2254685 2134244 2146680 2182934 2197067 2378784 2441817
9308 2441817 2284172 2221690 2239398 2243245 1990835 1919554 1929274 1951092 2002259 2065125 2135790
9297 2135790 2015058 2022032 1936624 1874607 1795945 1819411 1885538 1850352 1854850 1864129 1792032 1803823
9285 1803823 1930805 1939756 1850952 1872402 1944543 1927812 1851612 1842019 1996539 2096673 2173907
$$ packed form
9359A2153224p52842n42012m20831o11365o29810n05380m12109k70589l22002
9350G686284m51923l88455m39641k82528k32543k29817j48387p4985k56999k41709
9340D939297k01173j35787j83143j02203j29359k51493j10265p5404p9627j08347
9330C562496o3942r3220j98549k24348m8087M3085m2109j06670r3036j7146n2121
9319B666353m3136r7480j05405m0906j24741j20441J2436L6254J4133J81717O3033
9308B441817j57645o2482J7708L847k52410p1281R720K1818N1167O2866P0665
9297B135790j20732O974q5408o2017p8662K3466O6127l5186M498R279p2097J1791
9285A803823J26982Q951q8804K1450P2141j6731p6200r593J54520J00134P7234
$$ plain form
9274 2173907 2194972 2177415 2055211 2115287 2131596 2120257 2156208 2164951 2176212 2240248 2373240
9263 2373240 2400569 2371442 2337973 2451937 2638821 2777816 2905563 3118657 3220487 3400688
9253 3400688 3560986 3836637 4067792 4314122 4672992 4845110 5294077 5816099 6161767 6633835
9243 6633835 7210264 7905231 8781472 9633322 10714130 11769702 12826230 13726685 14620092
9234 14620092 15425256 16050768 16344334 16392967 16279352 15824831 15210502 14437421 13501884 12559012
$$ packed form
9274B173907K1065j7557j22204O0076J6309j1339L5951Q743J1261O4036J32992
9263B373240K7329k9127l3469J13964J86884J38995J27747K13094J01830J80201
9253C400688J60298K75651K31155K46330L58870J72118M48967N22022L45668M72068
9243F633835N76429O94967Q76241Q51850J080808J055572J056528R00455Q93407
9234A4620092Q05164O25512K93566M8633j13615m54521o14329p73081r35537r42872
$$ [...]
##END NTUPLES=NMR SPECTRUM
##END=
