##TITLE=Analysis number 314751
Compound Code cc 29902
Project Code adrs
Chemist Name endeavour
##JCAMPDX= 6.0         $$ Bruker NMR JCAMP-DX V2.0
##DATA TYPE= NMR SPECTRUM
##DATA CLASS= NTUPLES
##ORIGIN= Bruker BioSpin GmbH
##OWNER= NMR
$$ XWIN-NMR		Version 3.5
$$ Wed Oct 26 10:41:05 2005 GMT Daylight Time (UT+1h)  MAYBRIDGE\NMR@NMR_250MHZ
##.OBSERVE FREQUENCY= 250.131544655141
##.OBSERVE NUCLEUS= ^1H
##.ACQUISITION MODE= SIMULTANEOUS (DQD)
##.ACQUISITION SCHEME= undefined
##.AVERAGES= 16
##.DIGITISER RES= 18
##SPECTROMETER/DATA SYSTEM= dpx250
##.PULSE SEQUENCE= zg30
##.SOLVENT NAME= CDCl3
##.SHIFT REFERENCE= (INTERNAL, CDCl3, 0, 16.522)
##AUDIT TRAIL= $$ (NUMBER, WHEN, WHO, WHERE, WHAT)
$$ ##TITLE= Audit trail, XWIN-NMR		Version 3.5
$$ ##JCAMPDX= 5.01
$$ ##ORIGIN= Bruker BioSpin GmbH
$$ ##OWNER= NMR
$$ C:\u/data/dgb/nmr/ADRS/11410/pdata/1/auditp.txt
$$ ##AUDIT TRAIL=  $$ (NUMBER, WHEN, WHO, WHERE, WHAT)
(   1,<2005-10-26 10:40:24.99 +100>,<MAYBRIDGE\NMR>,<NMR_250MHZ>,
      <created by zg, POWCHK disabled, PULCHK disabled
       configuration hash MD5:
       62 19 C7 07 E1 42 D1 B7 37 6C 3D D0 77 39 F9 E6
       data hash MD5: 64K
       47 1D 0B BE 82 F5 7C 22 40 B7 E8 0B F8 D1 1A 66>)
(   2,<2005-10-26 10:40:41.99 +100>,<MAYBRIDGE\NMR>,<NMR_250MHZ>,
      <Start of raw data processing
       ef LB = 0.3 FT_mod = 6 PKNL = 1 SI = 32K 
       data hash MD5: 32K
       4F A5 79 55 83 62 7C B5 02 91 C6 DE 6C D6 94 55>)
(   3,<2005-10-26 10:40:46.14 +100>,<MAYBRIDGE\NMR>,<NMR_250MHZ>,
      <apk 
       data hash MD5: 32K
       15 BB 29 83 AA 03 42 91 86 EC 8F 64 00 A5 FE 96>)
(   4,<2005-10-26 10:40:47.55 +100>,<MAYBRIDGE\NMR>,<NMR_250MHZ>,
      <abs ABSG = 5 
       data hash MD5: 32K
       B5 06 8C 1A 42 1F F7 E6 6E 69 1A FC 1A E0 20 7A>)
$$ ##END=
$$ 
$$ hash MD5
$$ CE 2C 59 FF DD D5 D8 D0 D7 29 BF 88 8B 1D A1 86
##$RELAX= 
##$RELAX= 
##$RELAX= 
##$RELAX= 
##$RELAX= 
##$RELAX= 
##$RELAX= 
$$ Bruker specific parameters
$$ --------------------------
##$DU= <C:\u>
##$EXPNO= 11410
##$NAME= <ADRS>
##$PROCNO= 1
##$TYPE= <nmr>
##$USER= <dgb>
##$AMP= (0..31)
100 100 100 100 100 100 100 100 100 100 100 100 100 100 100 100 100 100 
100 100 100 100 100 100 100 100 100 100 100 100 100 100 
##$AQSEQ= 0
##$AQ_mod= 3
##$AUNM= <au_zg>
##$AUTOPOS= <47 >
##$BF1= 250.13
##$BF2= 250.13
##$BF3= 250.13
##$BF4= 250.13
##$BF5= 500.13
##$BF6= 500.13
##$BF7= 500.13
##$BF8= 500.13
##$BYTORDA= 1
##$CFDGTYP= 0
##$CFRGTYP= 5
##$CHEMSTR= <none>
##$CNST= (0..31)
1 1 145 1 1 1 1 1 1 1 1 1 1 1 1 1 1 1 1 1 1 1 1 1 1 1 1 1 1 1 1 1 
##$CPDPRG= <>
##$CPDPRG1= <>
##$CPDPRG2= <>
##$CPDPRG3= <>
##$CPDPRG4= <mlev>
##$CPDPRG5= <mlev>
##$CPDPRG6= <mlev>
##$CPDPRG7= <mlev>
##$CPDPRG8= <mlev>
##$CPDPRGB= <>
##$CPDPRGT= <>
##$D= (0..31)
0 1 0 0 0 0 0 0 0 0.06 0 0 0 0 0 0 0.0002 0 0 0 0 0 0 0 0 0 0 0 0 0 0 
0 
##$DATE= 1130319624
##$DBL= (0..7)
120 120 120 120 120 120 120 120 
##$DBP= (0..7)
150 150 150 150 150 150 150 150 
##$DBP07= 0
##$DBPNAM0= <>
##$DBPNAM1= <>
##$DBPNAM2= <>
$$ [...]
##$SUBNAM7= <"">
##$SUBNAM8= <"">
##$SUBNAM9= <"">
##$SW= 20.6930455092707
##$SWIBOX= (0..15)
0 0 3 0 0 0 0 0 0 0 0 0 0 0 0 0 
##$SW_h= 5175.983436853
##$TD= 65536
##$TD0= 1
##$TE= 295.16
##$TE2= 300
##$TE3= 300
##$TEG= 300
##$TL= (0..7)
0 120 120 120 120 120 120 120 
##$TP= (0..7)
150 150 150 150 150 150 150 150 
##$TP07= 0
##$TPNAME0= <>
##$TPNAME1= <>
##$TPNAME2= <>
##$TPNAME3= <>
##$TPNAME4= <>
##$TPNAME5= <>
##$TPNAME6= <>
##$TPNAME7= <>
##$TPOAL= (0..7)
0.5 0.5 0.5 0.5 0.5 0.5 0.5 0.5 
##$TPOFFS= (0..7)
0 0 0 0 0 0 0 0 
##$TUNHIN= 0
##$TUNHOUT= 0
##$TUNXOUT= 0
##$USERA1= <user>
##$USERA2= <user>
##$USERA3= <user>
##$USERA4= <user>
##$USERA5= <user>
##$V9= 5
##$VALIST= <valist>
##$VCLIST= <CCCCCCCCCCCCCCC>
##$VD= 0
##$VDLIST= <DDDDDDDDDDDDDDD>
##$VPLIST= <PPPPPPPPPPPPPPP>
##$VTLIST= <TTTTTTTTTTTTTTT>
##$WBST= 1024
##$WBSW= 4
##$XGAIN= (0..3)
0 0 0 0 
##$XL= 0
##$YL= 0
##$YMAX_a= 537663
##$YMIN_a= -393322
##$ZGOPTNS= <>
##$ZL1= 120
##$ZL2= 120
##$ZL3= 120
##$ZL4= 120
##$ABSF1= 16.522
##$ABSF2= -4.171173
##$ABSG= 5
##$ABSL= 3
##$ALPHA= 0
##$AQORDER= 0
##$ASSFAC= 0
##$ASSFACI= 0
##$ASSFACX= 0
##$ASSWID= 0
##$AUNMP= <proc_1d>
##$AZFE= 0.1
##$AZFW= 0.1
##$BCFW= 0
##$BC_mod= 0
##$BYTORDP= 0
##$COROFFS= 0
##$CY= 12.5
##$DATMOD= 1
##$DC= 0
##$DFILT= <>
##$DTYPP= 0
##$F1P= 14.0000005364418
##$F2P= -0.99999901652339
##$FCOR= 0.5
##$FTSIZE= 32768
##$FT_mod= 6
##$GAMMA= 0
##$GB= 0
##$INTBC= 1
##$INTSCL= 1
##$ISEN= 128
##$LB= 0.3
##$LEV0= 0
##$LPBIN= 0
##$MAXI= 10000
##$MC2= 0
##$MEAN= 0
##$ME_mod= 0
##$MI= 0
##$NCOEF= 0
##$NC_proc= -5
##$NLEV= 6
##$NOISF1= 0
##$NOISF2= 0
##$NSP= 0
##$NTH_PI= 0
##$NZP= 0
##$OFFSET= 16.522
##$PC= 1
##$PHC0= 144.934
##$PHC1= -6.145965
##$PH_mod= 1
##$PKNL= yes
##$PPARMOD= 0
##$PSCAL= 4
##$PSIGN= 0
##$REVERSE= no
##$SF= 250.13
##$SI= 32768
##$SIGF1= 0
##$SIGF2= 0
##$SINO= 400
##$SIOLD= 32768
##$SREGLST= <1H.CDCl3>
##$SSB= 0
##$STSI= 32768
##$STSR= 0
##$SW_p= 5175.98343685301
##$SYMM= 0
##$S_DEV= 0
##$TDeff= 65536
##$TDoff= 0
##$TI= <Analysis number 999999
Compound Code 99
Book Reference 9
Project Code 9>
##$TILT= no
##$TM1= 0
##$TM2= 0
##$TOPLEV= 0
##$USERP1= <user>
##$USERP2= <user>
##$USERP3= <user>
##$USERP4= <user>
##$USERP5= <user>
##$WDW= 1
##$XDIM= 32768
##$YMAX_p= 324479436
##$YMIN_p= -139846
$$ End of Bruker specific parameters
$$ ---------------------------------
##NTUPLES= NMR SPECTRUM
##VAR_NAME=  FREQUENCY,     SPECTRUM/REAL,   SPECTRUM/IMAG
##SYMBOL=    X,             R,               I
##VAR_TYPE=  INDEPENDENT,   DEPENDENT,       DEPENDENT
##VAR_FORM=  AFFN,          ASDF,            ASDF
##VAR_DIM=   32768,         32768,           32768
##UNITS=     HZ,            ARBITRARY UNITS, ARBITRARY UNITS
##FACTOR=    0.157963299565203, 1,           1
##FIRST=     4132.6476996994, 0,             0
##LAST=      -1043.33573715361, 0,           0
##MIN=       -1043.33573715361, -139846,     0
##MAX=       4132.6476996994, 324479436,     0
$$ Real data points
##PAGE= N=1
##DATA TABLE= (X++(R..R)), XYDATA
$$ [...]
22395 40678 68159 66972 56353 54400 39200 3675 -22535 -35150 -46549 -47417 -38584 -47089 -50228
22382 -50228 -39211 -26500 -10260 12933 5444 -250 -25969 -23839 -34545 -40178 -24475 15983
22370 15983 54566 58320 22444 6836 19583 5459 -12991 -4279 15437 39659 36522 26610
22358 26610 33638 36375 59136 16497 -7303 8231 6826 21761 36875 35531 30036 24984 17518
22345 17518 3138 -21200 15349 31937 34148 27476 26568 16207 18684 1155 -10605 28496 36356
22332 36356 33138 15530 21512 52672 50914 35037 56108 60717 46193 43495 30491 14582 38018
22319 38018 45638 28304 15085 24413 41202 8528 16067 323 20404 30800 18803 17549
22307 17549 26476 45036 52557 26503 26116 18182 12132 -12417 -38488 -29134 -12461 18059 48638
22294 48638 31965 31493 12375 -9766 -5025 1816 12718 34052 16050 19298 47726 41028 -5963
22281 -5963 -14388 9256 14690 4017 -12223 -15940 -20347 -6634 -11052 -7021 8747 40840 62065
22268 62065 58630 62949 66297 71620 73109 40347 10077 16802 4329 -13678 -9547 4597 16180
22255 16180 -13698 -10639 9218 2454 -709 -5371 -5634 -4223 -13350 -10956 -17937 -27358 -16406 -10543
22241 -10543 7985 7021 1644 2981 13207 11217 36034 31989 27761 13666 13241 11815 -1991 11738
22227 11738 30947 33845 23334 1607 8423 17900 38219 45560 37318 46740 19372 1851 10924
22214 10924 15633 24450 13420 8447 -3218 2028 2426 -466 -1300 34738 53027 36939 24244
22201 24244 14058 6576 567 5626 19154 18898 -21396 -13022 26241 50003 46132 36154 21643
22188 21643 12112 30643 50049 58026 50092 36389 41742 42120 10806 -20891 -10358 -3878 -8680
22175 -8680 -11054 -30963 2985 28360 -14785 -22790 21076 47186 20623 25365 6686 -9922
22163 -9922 -6615 -9061 -31808 -25677 -1935 -2974 7970 23854 39433 42301 43267 33707 29824 30183
22149 30183 21697 35302 30771 30178 18102 19134 16011 5247 23096 31711 63093 48771 14187
22136 14187 9728 23347 11340 -1446 945 15514 18040 15168 34668 35577 59458 51213 32961
22123 32961 34978 48763 58340 50577 43066 46790 42999 22203 28217 18630 -13112 -3766 -150 -6776
22109 -6776 -6385 -9764 1540 18920 7281 23800 22356 20103 14364 16736 8870 11430 17511 -4212
22095 -4212 -2735 -3878 -20515 -31277 -10310 340 18152 8542 -2275 1539 10478 13435 11016
22082 11016 20414 -9435 -12541 -12589 -19742 -18205 12787 -2136 -14077 -6224 -11481 -14345 -19812 -36275
22068 -36275 -37584 -20261 -8126 -406 10546 39489 37588 33250 42686 37725 42071 54487 35382
22055 35382 37131 37667 22299 21836 10680 739 -6003 -2833 11329 31643 33244 35289 32270 15394
22041 15394 -14881 -14011 6367 14339 8950 -15480 -3103 3937 5486 11545 24369 31845 21686
22028 21686 27154 19181 7946 -6950 -8668 -19843 6192 15043 -14030 -7991 3192 985 -8202
22015 -8202 6789 13104 16017 25181 1967 -13786 -28310 -22889 -10397 -19181 4344 8849 3711
22002 3711 -32630 -26303 -5413 7345 23047 20823 39496 29189 23803 4434 -6073 -4098 21993
21989 21993 31085 12367 15488 843 -7412 507 -9407 17521 11581 -9251 -2737 4452 -7588
21976 -7588 -8822 -9290 -14458 -8153 4854 -3311 -10881 -12342 -26779 -46420 -22317 4812 8451 24371
21962 24371 39455 30142 21800 20893 42023 44466 20703 16275 6641 -732 5363 8904 12888 6488
21948 6488 -20246 -18512 7512 9296 13423 -3450 -24461 -25214 -8502 -8616 -3087 -15031 -12100 -548
21934 -548 3736 -12971 -20349 -12830 -598 7513 25426 10746 -12261 8402 18200 24702 31638
21921 31638 40620 43075 37651 24121 27261 36610 25932 16482 18946 -282 -22035 -11411 6839
21908 6839 20650 18539 8322 -2628 -5917 -10735 7035 25815 36118 27659 21623 792 13180
21895 13180 32246 42296 49237 35438 51745 54485 33262 27768 34885 27297 14627 22531 24822
21882 24822 -13492 -2341 21449 7133 4529 12845 30225 26019 16031 6763 3722 -3283 8484
21869 8484 -2934 -167 8048 9123 506 12971 12895 10895 18554 3249 -21648 -27024 -3502 12115
21855 12115 30462 41911 28837 11527 19499 27247 12868 20618 47669 51476 46572 39302 8830
21842 8830 -17476 -22300 -15068 -1353 21033 27838 19037 27286 38256 3436 -6403 6254 5763
21829 5763 15092 10852 8194 18313 6129 -6530 8386 7153 1730 -28427 -11122 36010 37434
21816 37434 28516 30913 27531 24781 16118 6051 -8228 1825 26891 24228 616 -16692 -4556
21803 -4556 28820 25879 2937 -19509 4037 -8550 5977 37859 23134 17171 29841 16898
21791 16898 -3366 10916 29518 23103 10210 12649 26136 8854 -10077 -4196 5118 11958 9395
21778 9395 -19011 -54420 -27017 5855 6836 1591 11964 -8161 -9055 -12484 15783 13484 2657
21765 2657 4842 15791 283 29425 34443 765 -12710 -23773 -19985 -10969 9398 16748 7510
21752 7510 -3030 4041 9182 21911 6263 189 12616 10569 28360 32763 19919 14725 -847
21739 -847 -15020 -29560 -22843 -22429 -4844 -5686 -12209 -9137 -781 23633 39176 41604 42828 55339
21725 55339 31623 16425 14496 24699 -740 -10277 3564 6473 6922 30974 28544 31054 6465
21712 6465 610 11847 16597 28052 15040 -15375 16659 38930 50193 20688 13578 19270 24564
21699 24564 29958 36038 41102 7794 14501 17467 10728 -4910 15361 26025 41780 24925 5039
21686 5039 7959 30984 31575 29496 23777 22960 3021 -2089 8109 2882 -3477 -3940 1228 9755 18170
21671 18170 24122 27621 21540 19640 21787 29292 35100 37064 22892 23965 42077 29876 7407
21658 7407 3628 110 -8511 -38511 -31118 -6753 9499 8225 -16771 -22927 1154 13283 27349
21645 27349 5421 -34891 -12268 4654 2733 24213 23102 41946 44735 41824 35728 28287 16660
21632 16660 18441 8359 -2258 -14943 -32273 -2504 45760 78107 75488 72185 35243 38698
21620 38698 71436 86291 45190 32204 35170 55938 58609 22489 2688 -13371 -13716 -436
21608 -436 -6431 -18349 1072 -734 1244 -22978 -22577 -19566 -20890 -38842 -54704 -39460 -25113
21595 -25113 -37472 -37826 -37959 -36855 -11929 19709 16737 13531 3558 -14998 9847 21721 38700
21582 38700 42694 26698 16164 12987 -9106 -12081 -9678 962 -7751 -22361 -21005 -19340 -33574
21569 -33574 -47188 -55621 -39697 -21545 -1490 -13475 -34867 -34858 3412 40263 44151 37368 33766
21556 33766 5703 -7725 4163 11036 18861 26579 13432 32299 32258 4598 -5592 -17784 7852
21543 7852 10971 21812 26623 18751 16687 12586 5020 -13950 -17419 -10875 -6284 -11290 -13825 -26942
21529 -26942 -36137 -48615 -53294 -17350 4541 27000 25840 20795 18849 13658 16411 11699 4215
21516 4215 923 7919 9159 -6827 -18977 -19957 4619 18741 20849 31385 25797 -5646 -41334
21503 -41334 -31797 -5153 3871 30310 45233 33092 23497 32860 22996 35281 32553 14693 -8531
21490 -8531 -5758 14296 20019 39607 7534 -15934 -441 -2122 -16986 -12179 3024 -6094 4088
21477 4088 -8974 -40536 -27366 5072 10763 14324 39393 59312 77843 49821 43638 49432 48300
21464 48300 53129 47906 39994 30488 45669 53167 20474 -5435 698 14954 12677 10096 -819
21451 -819 11745 28459 34113 30369 38427 42412 36096 21966 16878 16629 38302 48424 55741 56123
21437 56123 45475 34133 39423 24958 115 -9804 -6112 1046 4259 12378 35462 32086 34594
21424 34594 33912 51574 11577 -15239 305 -5058 -3740 5401 -3543 6110 11505 -8568 -14194
21411 -14194 2949 -2030 9617 33530 18793 14821 8030 14815 9565 19271 5144 73 17330
21398 17330 28325 21764 14301 -13823 -22585 -44994 -41341 -21961 -19239 5995 17642 11431 21049
21385 21049 7939 6124 27590 -13747 -34249 -51759 -47777 -35346 1349 13294 -9530 -15701
21373 -15701 -998 -33622 -47860 -26542 -14692 -24868 -3019 -7831 -25828 -5692 6158 529
21361 529 -11354 -9114 15197 17082 17894 3449 -11022 -750 -12837 -16863 -6080 13040 4265
21348 4265 -9292 -1828 1166 11538 7813 -1547 -8261 19909 45008 25483 13264 -7883 -9347
21335 -9347 -16271 -14826 -8931 -9421 16220 26077 14931 19561 9745 19188 22869 9625 -12772 -7608
21321 -7608 17772 25415 7904 19723 13085 27579 12654 -29102 -24412 -5462 -5944 -2691 2357
21308 2357 12918 24893 18118 11752 30187 58936 22137 2833 -2551 -5977 4694 7877 16294
21295 16294 36375 30056 18694 27376 15155 -8457 -9511 -24778 -9937 1787 -4957 -11264 -19476
21282 -19476 -4614 10048 5167 2980 -23490 -32114 -47807 -23023 -13856 -23102 -13244 -964 17503
21269 17503 12170 26395 33492 15686 9006 -5069 -36864 -44390 -27443 1552 32684 49623
21257 49623 42317 40545 48166 39794 25682 27842 29489 25061 9772 15434 27705 52750 41697
21244 41697 19938 9647 11537 -3118 1503 20998 40969 34832 42420 38795 34141 12051 11413
21231 11413 18909 36135 47094 38669 21294 -5328 -5233 2852 -2416 2167 -2119 8448 9749 3473
21217 3473 9970 33353 23253 28115 36109 62763 88055 59482 17812 1927 13896 27467
21205 27467 20634 10916 3002 17366 16695 7561 -5159 5833 18404 10685 5097 -2529 11588
21192 11588 -987 -9019 -26333 -34833 -3844 1679 26667 42197 35180 21403 -18042 18202
21180 18202 45407 61357 62969 63332 46795 23392 16047 34277 39050 29961 18714 26444 20854
21167 20854 13583 1491 23824 48938 32129 14861 -4482 1566 5246 -6988 -23152 -26750
21155 -26750 -8104 -24003 -23767 -13569 -6992 2079 5468 -12043 -16883 -8710 -17007 11689 20219
21142 20219 2280 1671 -6512 2465 3118 2734 74 12152 -3176 -11041 2501 -2126 -5602 16874
21128 16874 26525 28024 15786 8138 15802 1167 -3292 -24146 -16228 -9394 19163 29300 37035
21115 37035 34098 22896 -3550 -3612 10983 14957 27853 15257 941 18035 31980 14930 -1866
21102 -1866 -10161 -34307 -34516 -30820 -22866 -9423 24040 25662 -3694 -2371 8540 14716 16023 19241
21088 19241 19561 21113 5104 13094 39005 11605 2602 13943 -2833 -21281 -18170 -56086 -53941
21075 -53941 -25535 -11715 -2777 15791 18739 10446 10944 4957 7672 3583 -20055 -31468 -30933 6697
21061 6697 11240 29611 42296 56401 65484 44209 30646 -10155 -37241 -27337 -6402 -6424 -15515
21048 -15515 -4338 10887 20239 22095 35788 41070 52614 48406 6811 -2542 -11764 -15014 -1860
21035 -1860 -12532 -15588 22927 29663 19231 6826 -23106 -34073 -33132 -19452 -7082 5987 27834
21022 27834 22008 6836 -17495 -29291 -11629 2306 -10582 -15444 8924 24034 33621 47217
21010 47217 52730 57793 45342 26307 -12920 -24395 -3203 20912 15009 4019 8849 -10204
20998 -10204 -39126 -39122 -48215 -48357 -36769 -11325 9589 -3143 10245 15554 14546 17738 7570 -16196
20984 -16196 -10351 16777 16080 9481 11037 37847 27947 30856 34859 4700 -11410 -22861 -32068
20971 -32068 -32407 -7435 3091 -3905 6237 -7918 -14964 -23594 -38644 -23886 3809 9059 -19088
20958 -19088 -15353 7022 -9215 -14778 -18880 -12886 -24475 -19532 13646 20929 9245 4944 -5962
20945 -5962 -8937 5421 26568 21445 -10728 -3830 -6227 -15545 -25069 -20163 -18403 -7592 -21985
20932 -21985 -23634 -13812 -1667 8672 -565 -2537 -6109 26963 37263 36554 19531 -641 16773
20919 16773 14280 4568 -16431 -45750 -20961 -9157 -6620 9523 36286 31557 15017 18620 5939
20906 5939 16403 22818 13017 -3184 2439 -2401 -14977 -7482 -11657 -15555 -23745 -19497 -5927 -671
20892 -671 -3185 10642 -9710 -10039 -10623 -25534 -20605 -31890 -42940 -33187 -37158 -23168 12078 12133
20878 12133 -9553 -11220 3781 9331 38744 42650 32534 41079 26271 17353 24058 62127 72828
20865 72828 59031 54626 38314 37658 20994 13721 16838 33260 23458 18824 30087 27307 31434
20852 31434 37311 43189 25727 8210 6104 -18589 -17670 14287 9991 17549 20275 257 -9856
20839 -9856 -2191 4877 -3052 -16546 -11866 -6017 8079 5759 7740 11173 10016 1959 -9468 -28345
20825 -28345 -35548 -39482 -21111 7574 22904 53267 55734 52859 34742 11095 -13190 -41507
20813 -41507 -32488 5107 -8533 -19825 -10723 15863 32676 31412 20883 11627 -4854 24991
20801 24991 26426 3159 -10706 -20906 -20445 -12130 -24671 -24342 -23183 -27828 -36387 -43227 -12229 7086
20787 7086 2641 -8533 -8430 -6231 5098 16752 32683 25831 37522 25218 24956 6983 -9912
20774 -9912 -21208 -32685 -9601 9237 9457 23574 -5432 -32666 -32993 -24105 -16304 -10924 5434
20761 5434 15703 32780 19263 11297 -1086 3037 4262 8286 22149 20905 8234 8481 18546
20748 18546 3273 -10167 5632 11304 4482 11924 25281 30778 19642 23340 13490 -4027 15632
20735 15632 17736 -21397 -20177 -8196 3581 -14677 -22623 1540 10400 3984 -16743 -28327 -23713
20722 -23713 -13131 2451 -3291 1137 20059 44401 28767 9683 11539 2057 18434 35556
20710 35556 31384 9385 11967 5889 212 10193 18006 -20 -16458 3720 30294 20458 8964
20697 8964 32454 21427 12606 -5950 -21911 -27284 -16379 3108 -15338 -15033 -8947 -9084 1846
20684 1846 11403 -1459 -2464 1322 22413 38677 27699 -1288 -23953 -32210 -25678 -6181 18047
20671 18047 18902 956 16907 17059 12149 18058 23439 46598 45975 10675 -6759 -19861 -9800
20658 -9800 4340 32652 31060 18528 3790 328 10914 11538 12100 25737 26380 35879 21175 16180
20644 16180 13365 8691 9622 -1563 -5038 -6900 -12037 -23098 -27979 -23006 3095 15160 19081 14759
20630 14759 23730 24990 12773 -10115 -850 9112 15573 20877 7255 5357 -12608 -11006 427
20617 427 2928 -1037 21001 30994 22364 12716 -5227 -20120 -7433 -4015 9729 -590 2829
20604 2829 9323 13041 11270 3270 -5729 -3661 13572 12607 25775 39390 36107 27525 13277 15470
20590 15470 19654 15321 13622 -12370 -34471 -39934 -54696 -43335 -13676 14904 24413 45134 41049
20577 41049 32215 66630 66983 40814 26195 39170 57358 52221 70532 63030 64849 67242 64538
20564 64538 51295 22798 1621 -13521 11052 35410 14760 -810 -4449 -2503 3602 8911
20552 8911 4981 3182 -1743 35068 59629 56821 39461 30315 35131 27539 9021 -23454 -29333
20539 -29333 -21833 -30516 -22783 -15677 660 10393 -815 -24808 -4764 11222 20681 -3667 -23223
20526 -23223 -20637 -40927 -24798 -27981 -16843 -18739 -898 5959 -13651 -8722 -7158 -20996 -15546
20513 -15546 22236 36201 23597 -1786 -7129 10048 16390 12053 8220 14034 13843 5723 -11351
20500 -11351 16079 26610 36326 54076 18878 12891 31504 43181 47212 26764 17416 39746
20488 39746 63941 49561 24392 39316 58055 31267 24669 27924 30003 18402 -10492 -21603
20476 -21603 -10092 -23785 -14290 -5549 -3167 -24478 -57174 -47289 -4419 -289 19813 13667 15362
20463 15362 18076 10326 34062 38006 34431 29168 9675 10989 34707 33677 14005 -5436 11197
20450 11197 23709 10938 -6664 -6992 -4002 -1253 14481 37095 28563 36571 43586 12609 -8057
20437 -8057 6600 18603 8811 -8056 -13991 -12517 -9777 6765 24571 54134 55206 19315 -20329
20424 -20329 -18872 30330 62351 63260 47631 21017 28608 30183 32074 6274 16688 30868 44335
20411 44335 11560 -1798 2616 19376 33522 15975 17405 35026 43936 21782 14178 10559 8258
20398 8258 6772 -757 22467 -30 -29149 -20667 -15067 -24659 -24138 -412 -2979 -1367 -9152 -16039
20384 -16039 2172 33419 37327 -5557 -40815 -26454 -18633 -25815 -34338 -26076 -12641 -1944 10332
20371 10332 16757 21696 18037 836 21339 15612 23769 362 -16245 -20012 5713 8500 -3935
20358 -3935 15757 39221 34552 14089 -11991 2379 40714 46395 28821 -6689 -15597 -4001
20346 -4001 12918 36675 45242 31293 38712 61251 69989 65743 48388 30301 4180 -28677 -21421
20333 -21421 -7469 17299 25010 30124 9540 5590 -4240 -5867 -9904 -40296 -43295 -39191 -32337
20320 -32337 -25852 5944 41928 46747 16205 -12940 -29084 -23097 -4134 -8098 -9554 -15022 -28518
20307 -28518 -61541 -57995 -42289 3176 10847 11224 1129 -28626 -26118 -14247 2448 11298 21072
20294 21072 39833 34274 31284 25817 12983 1504 6523 29072 39692 44462 48338 31019 15778
20281 15778 13235 4883 2273 4043 -16861 -17128 -37993 -67839 -37568 -10500 2576 3412 -19433
20268 -19433 -45511 -38302 -37802 -49602 -46657 -28343 -14374 -14193 -25763 -20977 -10806 -14005 -6153
20255 -6153 6065 15214 7862 13791 15737 3297 17550 22639 25609 12583 -11118 -22030 -2040
20242 -2040 -1569 -15977 -7465 31235 24002 16761 36754 32684 4175 -118 6779 13207 22707 23478
20228 23478 5602 -8529 -3089 2126 13207 24656 38508 27531 15530 19225 25878 27143 1405
20215 1405 -11029 -13396 -2876 -685 7204 13861 -16219 -24604 -3183 28664 23727 27471 19440
20202 19440 8666 19227 20346 27049 29307 41493 33827 32213 31598 10946 -15477 -56578 -70367
20189 -70367 -47085 -36427 -28861 -8788 -10006 -11614 4645 19030 -3474 -13701 -7769 3958
20177 3958 6296 -22989 -29676 -11853 -38993 -34049 -7421 1241 -14263 73 18747 31487 14374
20164 14374 12709 -4604 773 10063 531 5127 796 -27570 -24226 -25896 -14305 19703 20142 -6531
20150 -6531 -15077 -14377 -37112 -24502 4716 -9546 -5054 14943 21412 19720 33574 20245 14592
20137 14592 23976 20672 29714 20053 39077 39766 18401 324 2602 12509 23499 9085 -2705
20124 -2705 22049 20199 18553 25309 19050 -990 -19882 -19196 -33432 -41479 -64694 -48461 -33491
20111 -33491 -25254 -17960 -1644 3880 -3662 -4543 -8816 -7765 11063 5547 -16850 -15740 7408 7105
20097 7105 9865 3550 -11076 -1986 14556 32446 59798 61283 42609 11756 6093 25982 36278
20084 36278 12935 -372 13207 34753 15760 -19960 -30003 -20958 -13760 -8729 -5309 7636
20072 7636 8332 -9665 -19384 -7277 11630 23415 28384 24675 24949 19693 11340 7239 18223 -4170
20058 -4170 2422 6993 13364 8486 20240 23846 -300 -12890 -10533 2517 -14528 -15821 -242
20045 -242 -20641 -35940 -30042 -46487 -39001 -4455 2639 14141 21959 30763 24444 1012 -16536
20032 -16536 -9670 -4660 -28309 -48388 -62442 -34891 -16747 -39499 -37133 -17085 -7006 -4202
20020 -4202 -21762 -55190 -56230 -39651 -27412 -22000 -20816 -7420 1781 11890 20839 14752 6139
20007 6139 16006 13823 24570 25143 16924 15351 -5354 6123 15067 -379 12094 18531 4703
19994 4703 -4492 20084 30837 -2399 -68 3319 14754 19752 23533 -1793 -36567 -30811 -9629
19981 -9629 -2716 1950 9253 17992 23401 8249 -2068 -14117 -31647 -51529 -44340 -13506 -14515
19968 -14515 -16322 -25138 -12183 7398 5735 9995 9208 -14683 -1685 29200 32056 42459 34161
19955 34161 2657 3819 15968 -5155 -18881 2463 4689 20204 21018 -9834 -30435 -23047 -14134
19942 -14134 -17338 2004 -12284 -9567 2342 -11000 -11121 -17159 -14425 -8298 1527 -2429 30114
19929 30114 9806 -5988 7491 8358 4193 9568 -3098 -1089 6901 6061 29082 37403 35300 17711
19915 17711 18700 28884 11847 -13293 54 17407 13739 -11512 -2801 20309 32383 49545
19903 49545 45508 67481 73673 66247 21884 25748 43093 37837 24449 25365 -8324 -7587 2891
19890 2891 -6454 -13286 -8878 -11697 -21886 -58649 -63642 -41572 -29036 -27444 -30512 -13802 -7139
19877 -7139 -30860 -44306 -18094 7328 16626 33158 38510 9069 -10763 -13159 -4210 -16999 -12534
19864 -12534 1705 -1951 -3834 -1975 1640 7515 22875 23078 34109 28715 23894 15647 27392 48066
19850 48066 7648 3858 14082 43527 41668 13096 -640 -13360 -25159 -27039 8440 -3259
19838 -3259 -34702 -32883 -39715 -52076 -53615 -6120 5888 25953 33600 8105 -935 5478 5538 -9038
19824 -9038 -15286 -33737 -12274 31029 36191 17049 9932 10460 9657 3495 24456 58370 60766 42592
19810 42592 49877 39308 30596 27819 11407 -23700 -27867 -23472 -14294 -11918 -23920 -12276 -7769
19797 -7769 12163 17647 -4962 -23473 -25063 -13391 -7169 -15888 -2320 5334 -6238 24167 32541
19784 32541 15998 14707 13302 6490 18176 1085 10582 17722 7478 -23940 -30163 -32818 -60664
19771 -60664 -57428 -21787 21532 28721 8305 -7029 -8639 -13093 -24826 3025 11635 -8203 5778
19758 5778 37980 17363 22099 11065 8904 -5985 -30065 -22952 -5177 -10120 -25616 -2187 8204
19745 8204 1649 6162 6702 3715 -7230 -16981 -27637 -34241 -22340 -32062 -28184 -19420 -28780 -8183
19731 -8183 -34184 -26872 -23054 -18232 -26230 -37307 -21805 -15032 1587 21013 22140 11250 -9645
19718 -9645 -29542 -35044 -21889 -3245 -4266 -13168 -8126 -12492 179 30932 40684 32533 21163
19705 21163 43759 23965 12825 8887 -20415 -4399 7500 1203 -2998 -9908 -27814 -47084
19693 -47084 -33441 -12162 -12935 -20658 -22435 -21044 -23187 -23457 -6974 6516 2695 -17594 -21236 -24479
19679 -24479 -35696 -24834 23164 39210 12905 3167 12399 4513 -8893 -19460 -21017 -16709 -17767
19666 -17767 907 20091 17639 -7277 990 22545 10504 -14476 -7486 -14658 -16217 -14175 -4786
19653 -4786 6954 3175 -12996 -12859 3963 16063 22769 11042 2120 -658 -16006 -9255 3851
19640 3851 -19251 -23787 -22679 -16044 -20272 -32396 -45107 -34453 -30669 -17988 -27132 -8655 12869
19627 12869 31719 45780 20422 23143 30880 1414 -26863 -14416 10608 21859 14098 8904
19615 8904 -10877 -37294 -42924 -33553 1711 24069 27418 27794 3012 15912 40681 37241 48699
19602 48699 38272 13313 -13876 -19845 -16733 -11688 -18679 -18532 -29793 -33180 -45184 -37018 -39252
19589 -39252 -28714 -2662 17646 2940 -22493 -23593 -17020 5564 10367 1611 11088 31868 35525
19576 35525 38489 31465 1791 274 12201 11630 14852 5637 19244 7735 -24506 -48485 -42405
19563 -42405 -24573 -15267 -4892 1384 -4746 3109 -15571 -34848 -29116 -35775 -48625 -42133 -10882
19550 -10882 -4689 -18734 -23781 -11900 -6381 -28505 -25982 -13643 -1912 -22729 -21733 -20251 -896
19537 -896 -16547 -19022 -47592 -43786 -49144 -64425 -61435 -42949 -21383 8582 9666 16703 11605
19524 11605 15700 16889 46165 47356 54694 48331 34849 1549 -3722 7543 12015 31171 39649
19511 39649 33493 -17400 -47213 -21128 19848 36433 440 -20338 -24049 -37254 -30692 -830
19499 -830 -6096 -10125 17515 28161 35481 21344 20398 8314 16557 15127 12650 5553 -11376 -6059
19485 -6059 12400 15858 19667 26612 36840 29275 8783 11347 11824 6118 10723 35327 34218 44347
19471 44347 43236 44257 39818 28591 28386 9238 9905 30554 26158 26649 26801 30664 22131 10237
19457 10237 29558 45178 47780 27524 20557 8013 4420 -14007 -32393 -31795 -32221 -12184 -9602
19444 -9602 -8221 -26762 -29155 -28615 -18245 -4858 26571 21462 8002 1364 14604 -6322 -22808
19431 -22808 -20885 -8282 -22387 -4571 10526 26317 22616 9467 -807 16025 29754 20351
19419 20351 30814 41580 46029 12502 15611 30378 -14444 -24108 -23279 -9311 10440 10116 -5507
19406 -5507 -13511 -7930 12812 13652 14789 40774 45706 45130 14917 -5465 -28570 -15039 -6712 -13397
19392 -13397 -28614 -22782 -17889 -2084 -1969 2338 17552 6700 12231 16596 20958 -13582 -32749
19379 -32749 -24488 3452 4859 -3277 -2932 11335 32786 55033 33448 26854 1973 -5112 -30205
19366 -30205 -31181 -10016 -22832 1179 43167 56148 27109 7220 20647 25920 29943 37652 53689
19353 53689 31903 13594 11006 21655 9462 -7020 -20209 2870 21008 39442 34607 14521
19341 14521 -2106 -2300 27797 47291 35043 18865 19717 29159 10692 5021 -10289 -17003 3418
19328 3418 24391 19284 12292 27135 39996 28860 22415 30048 33973 43817 37966 27712 25676
19315 25676 37933 62025 55231 50071 17254 17085 1675 -29784 1347 32932 32417 40280 38060
19302 38060 34286 11181 13117 18648 1903 1667 26640 29859 28681 36725 52070 72365 62448
19289 62448 40203 34355 37160 14962 22907 14201 27267 29106 13335 6188 6617 -9971 -14
19276 -14 291 7610 -4694 -4712 5535 -16164 -15632 -22726 -5368 17152 -4646 -9006 6604 3117
19262 3117 7229 18963 18050 12466 17958 -8056 -528 7540 29229 30498 15816 27409 16870
19249 16870 11671 2186 -12359 3330 2884 -4200 -1536 -8118 -27763 -59843 -53701 -11587 16216
19236 16216 13813 -1889 -20673 -8510 -463 8179 18136 10570 -7030 -9562 -29356 -25150 -2111
19223 -2111 13656 -18581 -29088 -15307 2344 2161 4379 20441 46279 25461 21904 14044 -17201
19210 -17201 -30006 -32520 -3996 924 -5953 6697 -2768 1030 14649 4197 -18389 -3068 9745
19197 9745 -3329 -39143 -33896 -8785 -26888 -24982 -9697 -21007 -14021 -1326 8980 -11525
19185 -11525 -4819 21142 28926 39343 34200 33144 30040 15162 -11399 -26388 -49345 -18968 -15033
19172 -15033 5320 7043 23283 -2691 -22524 -22765 -8881 -11707 -2358 2764 -3254 -12653 -12355 -20895
19158 -20895 -13359 -549 -1849 16311 9213 -3846 21283 17503 13629 4136 -8922 -2968 -5268
19145 -5268 -24736 -40091 -38087 -10573 -9199 -1090 9019 -6594 -34314 -39480 -11114 -7570 -9452
19132 -9452 6990 8432 -8080 -6832 758 -1698 8209 17192 24593 26509 12334 20873 26450 15582
19118 15582 -2825 -14503 -7484 9505 1672 20743 32967 28799 20000 8196 406 12522 27732
19105 27732 21258 732 -16742 -2782 1632 6715 -7214 -29323 -29207 -17207 -22964 -23539 -8503
19092 -8503 -24368 -18748 -15428 -8404 32607 50164 9857 -16273 -12123 7861 25116 19884 9265
19079 9265 -1939 3628 -1532 10512 26463 6906 -12349 -7131 -12780 -16721 -26537 -46369 -60227
19066 -60227 -48000 -33672 -28200 -22110 -3805 16029 11712 -7724 -7294 4170 7918 12333 -2384
19053 -2384 -12525 -17500 -18615 -12037 -11210 -30100 -33923 -22078 6688 -13466 -33978 -29452 -237
19040 -237 -4599 -8509 13551 6041 14729 16997 9597 7401 5818 -7120 -5858 8862 14957 2075
19026 2075 -18082 -1836 -4748 -23113 -18807 -4284 16739 1876 3946 15150 -4701 -9783 2251
19013 2251 -5888 -9691 5944 3096 -2029 19496 25793 12332 13341 19154 19734 8796 -1513 -19062
18999 -19062 -22499 -54489 -56988 -29313 -3585 14239 25949 26238 33904 22991 -10246 -9547 3107
18986 3107 11043 1331 -521 -20139 -10082 -24375 -18995 -25809 -39191 -40077 -31400 -29719 -26582 2701
18972 2701 26129 -8809 -33211 -18247 243 4936 6323 -4952 7069 15964 20025 -30 -6978
18959 -6978 -16189 -26998 -32718 -43944 -34170 -18381 1039 5646 8964 -14364 -24929 -2077 -20873
18946 -20873 -38161 -40955 -35112 -41425 -40371 -39880 -16830 8555 4641 6932 8023 -12111 -30516
18933 -30516 -33471 -24547 -33715 -16722 4224 25836 7681 5045 -129 9226 16701 5730 -10774
18920 -10774 -20760 -22017 -12691 -6910 4230 -3648 2906 10809 6026 1432 8430 7627 -1103 -30597
18906 -30597 -38917 -5954 -9197 -38404 -49158 -39128 -35582 -22449 15001 29317 28351 32993 25738
18893 25738 12479 16272 -14253 7887 12840 1589 132 7206 -10866 -22229 -28785 -26845 -11153
18880 -11153 -1767 14253 30341 34906 34765 22540 -12237 -27398 -18175 -14200 -8320 -2576 905
18867 905 -22042 -13537 -24178 -42770 -36319 -35597 -17810 3838 -13342 -13216 1328 17100 24906
18854 24906 9447 607 28498 18071 3045 4541 34173 61718 55377 33538 11270 -3132
18842 -3132 -25614 -15285 -21035 -14569 2016 22347 27659 18386 -843 2955 14543 15739 9745
18829 9745 6933 17142 4583 -29951 -8221 -9684 -8924 2605 209 -13491 7674 23867 21226
18816 21226 1210 -13144 -1833 -3317 133 3836 2461 -9496 -22002 -5683 1276 -17399 158
18803 158 -8500 -28949 -30288 7732 5300 9135 5974 14633 25896 24853 8801 20369 29034 26680
18789 26680 24219 1101 427 -28097 -43632 -48985 -51891 -25766 5300 26300 28237 11215 5143
18776 5143 3699 3044 2742 21 3705 38264 70851 99795 156982 180282 156194 122531 83009
18763 83009 43299 -2883 -9066 -1713 -9071 1389 1317 -4988 -6231 10738 17255 51683 46098 49182
18749 49182 51322 45674 21836 -4844 -1951 3401 25408 31146 22333 -4147 -35590 -66219 -97055
18736 -97055 -72614 -41141 -12292 -23702 -42681 -40875 -36790 -6018 5196 30652 30023 4678
18724 4678 -11889 -8293 -15084 -27990 -50926 -55629 -31539 2478 2488 11217 19726 33659 41492 43239
18710 43239 44375 26964 22346 11303 18705 7432 -34 5870 -12852 -21929 -37496 -32687 -32504
18697 -32504 -35301 -20964 4752 198 -21874 -23633 -12053 19672 49162 33220 18839 28504
18685 28504 27922 15164 8715 -18875 -4576 16238 11474 886 10521 21338 34350 14460 -35645
18672 -35645 -27681 5601 10993 10476 31196 43810 51952 50929 18010 6480 15841 2133 -1620
18659 -1620 9064 1014 8103 16622 5666 -9846 -32214 -39452 -20929 -6652 -5024 -20290 -10568
18646 -10568 -6766 10961 20593 20194 17461 25173 48536 24029 424 -20580 -18039 -13849 -10948
18633 -10948 27014 57977 59868 36283 4996 -1039 -4429 -18883 -36496 -54151 -43665 -37388
18621 -37388 -33847 -21771 -1401 -17356 -18132 -28354 -23460 -33952 -43412 -36697 -20198 7127 11102
18608 11102 20790 17253 26422 31308 7678 -26466 -14628 14437 19579 20855 22140 4470 -4510
18595 -4510 -8942 -12174 -20649 -9681 -2471 -15727 -12392 -8866 -4165 3089 -5597 980 11969 -15
18581 -15 -10233 -13452 -11857 -20353 -26564 -17184 -7201 6884 20339 13608 -2437 -20343 -23092 -21073
18567 -21073 -11553 -30210 -32591 -39868 -29287 -14917 -33232 -38866 -15673 -13171 5225 5252 -9699
18554 -9699 14611 28651 26242 19696 -1703 -20386 -23166 -19582 7253 26899 17699 2168 3144
18541 3144 16735 23848 14024 29342 43977 32528 1275 -23832 -56229 -56788 -29441 -19426 -23500
18528 -23500 -23025 -156 -25387 -29286 -18270 -3413 -1687 2461 -5469 -32407 -21574 -38335 -47706
18515 -47706 -49798 -2102 380 12959 31414 25912 33386 31483 33578 9942 12541 20074 29182
18502 29182 38610 49860 52025 49697 25991 9220 18241 2854 -7452 -6710 10258 -8541 -16188
18489 -16188 -457 16785 -2843 -11178 -4246 564 21279 8779 -17257 -26528 -29249 2162 25251
18476 25251 24481 33783 35784 22759 8893 8694 -9033 -26236 -38815 -56886 -27440 18815 31640
18463 31640 39329 13421 12674 25640 15049 10966 -15121 -26599 -6664 10292 16240 8316 13157
18450 13157 22926 35492 16574 4203 19633 6305 -8015 -5096 -854 -4956 -21973 -16006 10183
18437 10183 -493 -26371 -36428 -27298 -11448 -7505 -11109 -6723 -3052 -4280 3228 14040 -8493
18424 -8493 -17837 -16641 -14818 -17500 -10576 1496 -2450 -12344 -4910 7341 21767 8429 10279 17225
18410 17225 -1878 -18914 -36815 -4421 46804 30686 1547 -666 4548 -13524 -22062 -31601
18398 -31601 -24373 -8652 -1794 7076 12540 14855 7035 3865 -6077 -9944 -1785 2462 -17287 -14824
18384 -14824 -25060 3223 -2674 -1118 -3931 5836 11062 11164 -8673 -13200 -15372 -28457 -55655
18371 -55655 -49360 -13153 3824 4325 23148 22499 11341 -7735 5243 28216 42291 50437 56574
18358 56574 25495 2369 -7344 -28299 -23856 -11984 -7758 4483 17216 17494 16607 31689 53246
18345 53246 43087 2733 -18628 -15888 10755 -11577 -18957 -14377 -24307 -41686 -45495 -42288 -57376
18332 -57376 -37867 10549 18595 -1407 -33258 -45788 -33151 -22447 -30350 -23470 -15886 -18629 -22193
18319 -22193 -24939 -25378 -20590 -23677 -2875 24948 44184 32405 26117 12456 12965 7904 13656 4151
18305 4151 -9333 -11843 1093 -20 -5146 -22888 -19296 3595 7751 15358 4506 -8455 -4730
18292 -4730 -24730 -32184 -38303 -55903 -84082 -58749 -26279 -6785 13953 12856 11289 -6784 -41037
18279 -41037 -34111 -29759 -33641 -27059 -44567 -32840 -8219 -3769 -18082 -25085 -5034 -21995 -28696
18266 -28696 -26323 -39697 -37526 -21980 -14581 12710 16144 -3791 -34617 -45679 -45833 -31759 -35511
18253 -35511 -40034 -18784 -5804 -29648 -34324 -57401 -61530 -63133 -35171 -7175 -7247 -22358 -5146
18240 -5146 18562 7160 14443 43784 29292 -8224 -16229 -6821 -16037 -28555 -34894 -41560 -32713
18227 -32713 -23705 -5490 -27637 -44381 -25053 6346 -7079 -38740 -28134 -8837 -4947 -46022
18215 -46022 -63636 -69600 -60321 -72736 -49018 -35932 -50293 -47126 -47469 -39102 -33057 -9773 -19104
18202 -19104 -17417 -17626 2438 -7362 -27676 -24049 9340 3894 -29301 -27789 -9329 -28501 -54612
18189 -54612 -64760 -58314 -47077 -21793 -20202 5120 9764 -15740 -14917 -24526 -66790 -90405 -89335
18176 -89335 -64458 -33451 -7882 1773 -22 -3455 -16360 -29639 -43474 -35619 -26207 -19402 10204
18163 10204 41963 16861 -11649 -6242 -13157 -19158 -23709 -16861 13614 10788 13332 8545 1830
18150 1830 24137 48006 56091 39825 42176 29314 43210 73777 75335 89000 71789 86823
18138 86823 82381 83330 91073 94578 108487 136883 199876 252389 286847 340264 404092 460187 486506
18125 486506 555679 660385 784444 939259 1123748 1329400 1644376 2029068 2450976 2980842
18115 2980842 3662750 4585976 5894544 7894732 11133735 17150965 27814245 39106866
18107 39106866 40459908 35350774 26714109 16885761 10598792 7190951 5211261 3927510
18099 3927510 3022730 2391384 1975616 1676737 1452294 1280380 1132044 1001138 902350 843868
18089 843868 802881 742946 670325 619483 597733 548945 499117 460912 448329 438811 407719 385215
18077 385215 363075 366027 342967 289914 231340 221753 246427 250650 256059 242301 245450 257725
18065 257725 242716 224415 190468 184884 184874 172632 163851 173435 185668 186438 167505 134649 118728
18052 118728 135194 118757 102702 72174 64695 82745 82456 80779 109491 138562 131256 106327
18040 106327 105680 96194 129721 137605 109092 117296 91339 71912 71579 84717 93345 82109 63984
18027 63984 59513 81229 59624 40098 49387 65915 71848 70595 67002 66772 77496 75475 82421
18014 82421 68207 73405 67141 52719 39555 26845 23983 29396 31938 24648 42894 28337 33522
18001 33522 46678 29837 33706 55577 59501 23257 -16103 -22141 265 10768 21399 62056
17989 62056 55123 49849 57526 67180 75756 74663 63920 65104 51836 41184 44626 43296 56845
17976 56845 58769 42685 34235 43733 72792 67740 56470 82403 75021 67053 63362 40435 37120
17963 37120 37314 53117 82193 103657 98236 89689 57978 48547 55176 60277 53707 58410 58549 55444
17949 55444 37343 30513 33577 47743 41060 43445 49255 60347 40876 26958 762 -9761 -6742
17936 -6742 -343 12081 -540 4818 48530 54587 40338 14158 19335 36987 23071 15683 11034
17923 11034 -7127 10589 31908 38384 43962 35119 37763 58087 55395 58807 53831 42224 25469
17910 25469 27183 36252 51320 44434 16204 -16387 -13058 -2467 -12767 -27504 -23341 -20658 -5259
17897 -5259 7140 5117 -12669 -20558 3571 8186 2050 6741 -4028 6831 6236 3324 12641 2499
17883 2499 5609 10514 30680 27854 29155 34151 27310 17630 11271 40599 58795 57449 34852 31247
17869 31247 32428 26657 38167 16551 19010 39551 41798 33326 46605 59092 29632 18060 16146
17856 16146 15341 14373 6069 -759 -12908 -18244 -26008 -20871 -9316 10972 34248 35838 13117 -19590
17842 -19590 -47956 -32408 -1702 18795 37586 30902 5227 -5288 13365 31304 51768 45354
17830 45354 40242 19985 -21238 -32495 -4025 23847 46873 13080 4926 14225 17035 13909 8285
17817 8285 5431 14789 8976 1679 12232 24898 32662 29749 21325 24413 12688 36048 75374
17804 75374 69623 39646 19420 -1440 -12340 -3943 -3376 -6392 1135 -2968 -7022 -32293 -30934
17791 -30934 -53752 -40221 -47731 -38142 -20725 -31807 -38539 -5355 20391 36454 42422 42405 46756
17778 46756 25987 -1074 -9937 -6557 -11103 13920 23230 9534 1581 8732 1222 -23750 -21663
17765 -21663 -5284 20022 43135 43212 33144 18132 8415 -10985 15748 32187 20643 41376
17753 41376 57009 61288 46233 56281 62539 40398 13850 4622 2263 22861 29958 27252 31571
17740 31571 18311 13424 28033 33031 14983 5128 -23097 -1625 40881 42588 32337 31585 25562
17727 25562 28264 22496 8440 -11558 -29382 -19481 -17040 6056 5148 -4922 -4878 17187 16125 -2194
17713 -2194 14290 12098 -2444 -55780 -64053 -19539 2654 12266 -11060 583 -2032 8662 25515
17700 25515 12426 -7329 -16913 1927 939 -417 -9262 -13768 9778 20604 -800 -27276 -10370
17687 -10370 -2255 -6670 -9912 -9037 5777 14634 9059 -12326 -40869 -48253 -49072 -29513 6526 15610
17673 15610 30009 27877 17159 20270 31239 48787 35866 5094 -17345 -23096 -29749 -5684
17661 -5684 23816 30042 36822 40764 35969 60753 62335 50066 41669 20294 4827 1746 -8956
17648 -8956 -1795 -1145 -17356 -7378 8371 3619 20396 12466 10614 11419 -445 -2071 3334 18600
17634 18600 14433 4178 -8084 -24720 -48504 -53847 -24218 -4028 -3267 -26630 -31737 -17940 -25379
17621 -25379 -27089 -27329 -8803 -1231 -8276 -29447 -23786 -9271 -39665 -32866 -5246 11749 36062
17608 36062 21887 -1012 -24082 -46664 -21577 7901 6091 -19252 -5031 21942 36406 9572
17596 9572 -12053 -29910 -31470 -31285 1458 15259 -2830 -37923 -31866 -22774 -6202 -9227 -5280
17583 -5280 24026 47276 36975 10606 -17563 -1542 5652 10161 8656 24220 9459 15365 -6568
17570 -6568 -41578 -30498 -17787 -11103 1053 18417 18684 -5920 -16007 -6614 8105 23128 4709
17557 4709 502 -14100 -26483 -23161 -330 27243 13182 13869 18283 -701 -9861 -18105 -22732
17544 -22732 -25598 13963 21493 12248 5626 9954 9974 -9657 -2072 7470 6501 21564 24470 18564
17530 18564 1791 -18701 -17736 -6070 1102 24843 33250 -6659 -18349 -23626 -32527 -30237 -21319
17517 -21319 -8715 4995 -96 -1393 -4707 8748 4323 9356 -11571 -17406 -19079 19834 19729
17504 19729 -2161 2330 50773 60316 62573 35942 23358 16851 15109 28114 20873 3570 18281
17491 18281 8927 -22197 -1154 47600 64308 55163 47888 26408 12197 -6285 -15857 -27726
17479 -27726 -1376 -10111 -25591 -26084 -20824 -6771 -7052 -3599 11672 14974 1229 -31759 -28068
17466 -28068 -18474 -426 20132 12804 12740 13269 1829 920 7706 9634 24471 27316 33263 27776
17452 27776 23721 16783 27011 42355 38450 28563 23657 47431 68856 82086 108201 170566 204361
17439 204361 198452 151660 85741 40067 28021 36822 42195 16616 3355 3206 -2674 8421 14242
17426 14242 11006 -9481 -23188 -34071 -11338 12032 13610 -11075 -6095 -2030 -20951 -28574 -32092
17413 -32092 -27355 -24052 6497 7703 12877 2762 781 17635 33729 12879 26725 19548 -1950
17400 -1950 6126 10410 -1991 -20092 -10747 17621 41893 26419 26695 37949 29050 9878 -24673
17387 -24673 -22844 -13000 -13220 -22692 -20030 -24044 -10334 -1251 -7085 -3129 3521 20544 -1828 -28534
17373 -28534 2765 31095 22441 16950 -3375 3805 4110 -3897 8337 12661 -115 7208 4641
17360 4641 7878 -6175 -22195 -7432 15044 15254 11563 4166 5713 -3368 18402 30166 40602
17347 40602 33661 37855 36836 25356 9757 21842 35884 45053 27747 31221 51162 44615 6400
17334 6400 -2724 -25446 -54826 -63520 -42952 -16861 -591 21199 36790 24298 11023 22287
17322 22287 42509 31978 34515 35901 21028 -5646 16455 33869 35336 22432 8615 -1248
17310 -1248 12217 23394 23339 10394 6526 -12028 7687 32607 33260 4075 -14444 -20752 -35423
17297 -35423 -37790 -9894 4598 11131 4082 8581 16610 9006 7360 -2763 -16114 -27592 -2077
17284 -2077 -16162 -23614 9303 21556 11763 3264 -13499 -36503 -49365 -36773 -37125 -36826 -30830
17271 -30830 -5915 28157 19248 -25 -24003 -43115 -51697 -53056 -50841 -46233 -49506 -59896 -40915
17258 -40915 -10338 13409 29377 27156 13429 25476 26529 6073 -7619 -41846 -57791 -28416
17246 -28416 -4969 -246 -9564 -10992 3490 11777 14735 26815 45776 67469 48531 62605 64177
17233 64177 44270 37196 35869 39717 13635 -14027 -24286 -19649 3642 -6128 -20150 1481 4356
17220 4356 -14332 -28177 -39279 -44628 2178 -2806 -11453 -22391 -33515 -41121 -38203 -20809 -22420
17207 -22420 -34103 -27159 -22745 -12007 11058 4352 -13166 16197 10111 -3495 -6582 -11740 -21049
17194 -21049 6949 18979 17976 1505 -23581 -10396 -607 -23602 -31973 4772 -4769 -25750
17182 -25750 -22926 -5110 -4040 -17349 -20165 -13508 22745 29239 20583 -12070 -30894 -46006 -51153
17169 -51153 -37508 -26266 -19857 -7208 3860 -7695 -27400 -20116 -26712 -21740 -7 9719 12388
17156 12388 36621 24868 -3966 -19151 -7413 -10239 -10026 4618 -4842 6643 -4464 3736 18316
17143 18316 2487 2456 -2506 -21293 -6929 6083 -5467 -10241 -11762 -5965 -3331 8559 24025
17130 24025 25339 23841 22863 40153 27521 7339 22773 19413 9396 -24 -18616 -18211 -24893
17117 -24893 -32717 -42654 -30516 6889 -9343 -16308 -17662 6306 20715 4412 -29738 -50236
17105 -50236 -35636 -45761 -57081 -36571 -20522 -13046 8886 -4116 -36343 -52246 -36896 -6557
17093 -6557 -4474 -6756 -9640 -20014 -10671 -4547 -10224 -9571 -22150 -24271 -19866 -36757 -52933 -39700
17079 -39700 -29931 -1724 9021 -4027 -2140 -26226 -49187 -15563 3189 -3632 -1434 -8416 -22290
17066 -22290 -26599 -19628 -28785 -41618 -10381 3840 -10913 2395 1904 732 -7766 -906 -9717
17053 -9717 15342 13817 1299 22176 -2986 -26446 -16073 -4165 5097 -7342 -13860 114
17041 114 -2628 -18943 339 31246 12284 -1561 4053 10921 -11724 -14931 5767 30639 8823
17028 8823 -4930 -1073 -22544 -27008 -29594 -16202 3286 892 3108 10279 10730 -12659 -45190
17015 -45190 -52990 -45547 -9103 -4931 -4886 2938 -10735 -21432 -16327 -14293 -4838 -19967 -36959 -40658
17001 -40658 -38896 -36371 -33030 -24288 -27339 -38695 -44392 -43841 -33819 -24706 2387 29705 40565
16988 40565 8757 -10854 -10979 -1170 17687 -2931 -28341 -17885 -6235 -13050 -20711 -20385 -227
16975 -227 7362 -14122 -25795 -24369 -25859 -29305 -24268 -28953 -25387 -21259 -9064 -21293 -2103 -1002
16961 -1002 -32081 -18161 -25842 -20617 -34030 -39421 -35476 -28927 -1612 7131 -8719 -24038 -4018
16948 -4018 12342 26074 8463 5374 15958 30498 36023 9768 4506 5074 6122 14345 33552
16935 33552 36939 12825 3166 14260 -5770 13540 32286 17629 -3123 -402 6437 4160 -2088
16922 -2088 8379 4146 -7006 2063 7603 -1943 -12 -1369 -1122 -18762 -5977 11535 10854 -2226
16908 -2226 -34883 -22719 -9608 -22116 -7370 -8890 3376 10941 41216 22118 -11317 -29237
16896 -29237 -31829 -7027 17598 38880 21575 5440 1097 -10703 -21330 -31330 -41889 -51187
16884 -51187 -32196 -24866 -42484 -37980 -14693 3083 10764 12842 3037 -10780 22108 30865 20251
16871 20251 30760 33464 66705 64085 26539 16326 9722 -11991 -28332 -37043 -36663 -44655 -40506
16858 -40506 -31476 -29991 -42834 -36082 -19778 -16362 -6957 -6630 -2704 -4811 -6210 -13649 -27939 -63311
16844 -63311 -47431 -24203 -46120 -62425 -69293 -74875 -64682 -57712 -51069 -45318 -21480 -10006 -33870
16831 -33870 -57002 -44344 -12867 20319 19461 27591 15366 -8405 -32326 -18548 -14182 -37155
16819 -37155 -41762 -20915 30035 36690 5193 -6521 -18366 -25169 -45149 -54155 -77049 -69590 -55901
16806 -55901 -62456 -67111 -63224 -52165 -37210 -52968 -59957 -29826 -25802 -37418 -49011 -46694 -34607
16793 -34607 -23022 -6783 -7114 -23330 -38341 -51323 -55113 -60535 -53076 -53282 -20962 -10627 -19650
16780 -19650 -8257 -9309 -5229 -16434 2072 16363 6419 3954 -12286 -30021 -9198 -17730 -45466
16767 -45466 -46871 -36951 -21829 -20654 -29505 -18606 -7476 22432 38361 16804 -5267 2076 3132
16754 3132 13738 24750 6383 -21848 -20932 -13569 -7464 -20289 -20364 -21344 -14696 -5353 -7234 -15498
16740 -15498 -16021 -20034 -14671 -13819 -6841 28240 56500 32688 22776 3644 399 -29736 -12293
16727 -12293 -7579 -21791 -13129 -24131 -30628 -38427 -39519 -31366 -16014 -10480 -13297 -12587 -20334 -10191
16713 -10191 717 4756 -9701 -16597 -6558 -14076 -11721 -34386 -39138 -52597 -63295 -48417 -28680
16700 -28680 -2072 1049 -6189 -12154 -52614 -44883 -22252 -25828 -21466 13173 26706 34850 5647
16687 5647 -8574 -20216 -20908 -21227 -10576 -18764 -48790 -63362 -66256 -36538 -3131 -12836 -24831
16674 -24831 -19358 -27823 -28625 -22639 -23677 -12626 902 5363 -4665 -19210 -5849 4603 25677
16661 25677 38000 -4466 -5345 16792 26957 29965 48273 38294 4761 -8007 -13106 5864 322
16648 322 -15961 -8208 4555 5338 -20339 -39538 -19244 4503 16530 20524 8281 20583 32483
16635 32483 46914 44094 39643 38571 34842 20687 4736 11835 15804 948 15970 56195 68604
16622 68604 48341 23787 12890 25674 34766 24253 30465 72207 54325 30475 17602 24440
16610 24440 27042 49880 50757 43953 48648 27081 3829 6434 799 13168 31833 2785 -2675
16597 -2675 -1557 28806 25489 1955 -16987 -16987 -20417 -16147 -1851 285 -5985 -38163 -48478 -32030
16583 -32030 -13983 -8090 -16854 -17294 -38603 -28736 -41574 -30822 -19126 -7905 -23257 -20867 -29725
16570 -29725 -59167 -61862 -47504 -40380 -43956 -47057 -39192 -47608 -46970 -18140 1155 13430 25058
16557 25058 28263 8822 -21207 -31489 -38104 -27129 -22826 -22501 209 -5928 -6255 -2595 3887 8017
16543 8017 -3752 -6247 -589 25570 32231 15692 1686 -10409 -2309 12549 20997 26945 14228
16530 14228 -5430 4424 -14675 -11177 -11374 -9142 -15387 -16758 -23431 -21924 -13010 -2232 -33664 -32451
16516 -32451 -18844 380 28685 19133 4638 3547 -31669 -60904 -68007 -47570 -10054 5857
16504 5857 -2444 -18250 -1896 4382 -7380 -11486 -45811 -36640 1031 32163 45268 20751 12428
16491 12428 14232 15722 21151 21440 639 -13340 -15213 -35107 -53306 -70818 -62754 -64427 -38914
16478 -38914 -14362 13768 35968 27554 4054 -28975 -21823 -5996 -9002 -44224 -26387 8719
16466 8719 19117 8537 -4122 -18917 -3859 12472 14642 -25696 -32505 -15706 4504 17311
16454 17311 14889 20046 -5256 -832 -5859 -23993 -28814 -14085 8425 11459 7627 -1226 1995
16441 1995 3710 1856 1373 11087 14846 9397 -6550 -33742 -15615 4836 3759 4784 3219 -5060
16427 -5060 -46432 -36890 -34355 -36169 -9753 9308 17771 11387 -4941 -3141 10790 4036 -1976
16414 -1976 -2202 -19598 -43011 -59676 -40799 -23862 -9375 5079 6225 10130 -17313 -34396 -13847
16401 -13847 -13380 18826 21283 39484 19735 3486 -13320 -2360 8641 -10357 -26932 -29050
16389 -29050 -11388 855 -8117 -4237 -11870 -10696 -16227 -16154 -8029 -14411 -20536 -3329 2823 -3681
16375 -3681 22102 3707 -25858 -52264 -44430 -55377 -76490 -40415 -34265 -46042 -19284 -3226
16363 -3226 4002 6930 14733 14694 25478 33845 9680 11290 13471 2056 -8015 -12783 -26435 -28772
16349 -28772 -16115 15211 18204 8392 34179 44170 33387 10173 -21108 -40404 -49474 -59898
16337 -59898 -45488 -30810 -32126 -34316 -29293 -28550 -32078 -48259 -27808 -3791 2244 -8091 -22995
16324 -22995 -26566 -15925 -11280 -17271 -18424 -24886 -22741 -24690 -43302 -59596 -42669 -39067 -35664
16311 -35664 -39967 -54812 -38075 -29274 -26605 -37871 -43814 -18652 -17376 -16718 -29532 -23210 -24516
16298 -24516 -32575 -29080 -23180 -18071 -5826 6749 -5461 -292 15301 3681 -20849 -11471 4255
16285 4255 9613 5421 9203 30073 42385 34377 24430 20639 18433 26614 25911 4150 -2611 -10842
16271 -10842 -22415 -24341 14036 9609 1777 -10511 -28322 -36370 -27013 -20269 -39411 -26584 -18045
16258 -18045 -3576 -6019 8461 18410 -16930 -23313 -21105 9559 23348 7184 1580 -3124 -1143
16245 -1143 9288 -3429 -18304 -22354 -25588 -32489 -18195 -3724 -12816 -35591 -37700 -44028 -30477
16232 -30477 -4561 3709 -11826 -15760 -2829 3408 8753 32359 50614 14331 -5631 -11652 3806
16219 3806 30627 23977 27844 9773 3523 -31260 -21835 -13096 2473 6787 2078 -8829 -8671 -25414
16205 -25414 -21031 -20448 -21171 -12145 -5259 -13076 -16763 -11595 11050 28206 16291 -9670 -43726 -29229
16191 -29229 -13974 746 3943 -11489 -25964 -29962 -10537 190 979 -4966 1275 -17829 -6186
16178 -6186 6605 1158 24830 27466 15491 2240 -12902 -37545 -51766 -56548 -48881 -59792 -79415
16165 -79415 -74817 -83858 -72704 -62701 -54675 -34515 -43009 -47114 -69750 -55456 -42724 -31153 -51166
16152 -51166 -41783 -14607 -29330 -51060 -41158 -14655 -19124 -20259 -7878 477 5811 -9729 -16050
16139 -16050 -10457 -9180 -35740 -51609 -39941 -19821 -17118 -51975 -48849 -24218 -12581 -28608
16127 -28608 -32526 -22437 -13116 -9301 -8008 -8268 -10993 -38959 -44179 -33658 -18612 -15693 544
16114 544 7966 3173 5417 -4708 -18852 -656 22131 25617 14899 6841 -2721 -4952 4487 2500
16100 2500 -3459 -10841 8518 13329 -6670 -25618 -19898 -17307 -3427 17382 11358 -2845 -41623
16087 -41623 -46077 -35953 -14013 -3469 -4560 -7423 -3384 -2498 12273 10609 -15821 -33806 -30804
16074 -30804 -20284 -122 6606 -19268 -46035 -50024 -23105 -6183 -3429 -1907 -6289 -6613 -3911
16061 -3911 -2094 -2922 15511 10020 3041 26962 24982 28228 49252 50696 48147 35155 38124 11456
16047 11456 -35400 -39040 -32132 -14609 4897 16384 23268 24842 406 -2682 15499 23188 28372
16034 28372 46136 44686 31305 44363 66638 71239 65983 36266 439 -323 -29781 -25635 -10196
16021 -10196 -25586 -50502 -51760 -17992 -22827 -45705 -37585 -47173 -47333 -51912 -62417 -44971 -59474
16008 -59474 -41757 -32068 -9498 4789 -32003 -57043 -19355 9748 5639 22571 37988 38835
15996 38835 10640 -3560 14270 20460 7733 -3482 8189 14277 12296 15744 32472 33975 10898
15983 10898 9725 -15249 -633 21796 11776 -5398 -4937 -3771 22941 37194 46035 27123 39380
15970 39380 33028 35139 14541 -6443 -10396 -11685 -15209 21144 71 -14134 -3747 1810 -17580
15957 -17580 -25771 -23787 -40519 -52886 -49694 -9435 24643 34217 23937 44488 1341 -20552
15945 -20552 -23715 -12646 -7524 -26603 -20324 -37889 -57805 -62504 -43015 -9257 -23165 -21303 -14736
15932 -14736 -19391 -28638 -31142 -31540 -42879 -54352 -59739 -67741 -50937 -46725 -62639 -46584 -44305
15919 -44305 -55541 -60126 -46326 -18822 -1040 -17854 -6859 -35435 -34316 -9762 10746 8449
15907 8449 -3602 -2452 -3420 -10592 -25677 -4930 -2312 -12478 -30970 -43488 -47404 -41054 -28342
15894 -28342 -33063 -30514 -3934 -2258 -9504 -10047 8893 38185 33361 931 -34674 -41004 -41983 -27754
15880 -27754 -13166 -2937 -15565 -19042 -27281 -28235 -28474 -28610 -42462 -40061 -26457 -34663 -48868 -58208
15866 -58208 -44045 -26775 -16500 -2215 -2990 -23082 -22294 -6007 14796 19183 19154 18001 11365 -15186
15852 -15186 -45772 -30947 -12061 -3657 -22 25229 15678 13065 16967 -12153 -35274 -33311 -11823
15839 -11823 3845 -10787 1619 8521 2268 -369 88 -1670 29379 35664 9181 -24210 -17336
15826 -17336 -17826 -9505 7217 -4426 -33069 -39342 -20010 -12008 -1714 -5086 -3597 12579 23204
15813 23204 47861 55023 40137 45153 33498 12106 3918 -11325 -42663 -58908 -33125 -17765
15801 -17765 -38460 -61545 -34904 4908 -1134 -15403 -10587 6028 2993 2576 3061 14331 11232
15788 11232 13862 -6451 -5525 -18201 -11653 -10766 -7459 -33615 -28865 -27875 -25867 -8670 13411 5124
15774 5124 -7041 -15658 -17554 -19863 -18477 -30687 -36345 -18784 -7835 68 -1358 -18961 -40362
15761 -40362 -49943 -49989 -37217 -16773 -12842 -4307 -4008 -30347 -22092 -30776 -53655 -83814 -74189 -50514
15747 -50514 -52941 -42698 -27641 -18848 -23555 -9332 -1771 -6416 -15639 -19618 -45459 -86136 -91113
15734 -91113 -50936 -39859 -37255 -43962 -25445 4006 -4896 -6816 -12688 -18194 -14873 -10986 3606
15721 3606 5008 -4916 -10100 -6042 -17605 -28358 -26943 -27394 -22148 -35657 -41527 -28265 -17357 720
15707 720 -10838 -17134 21568 35865 30316 37999 16900 811 -5396 -27902 -30981 -31183 -38153 -28044
15693 -28044 -8964 -13619 -11591 -31470 -4949 11712 -1159 -16585 -19392 -13978 -15905 -25310 -31278
15680 -31278 -41938 -46879 -27128 -14637 -33462 -43338 -19729 -24068 -54915 -45965 -20684 -11934 -7163
15667 -7163 -11122 -5786 -13088 -26889 -23771 -24713 -14350 5399 -1057 2489 16190 694 4986 8611
15653 8611 5546 6552 -2085 -3747 -11196 -41662 -62613 -53155 -20731 12321 -4538 -7900 -2099
15640 -2099 9344 667 14141 10055 12160 -13375 -24839 -9173 -2663 -14099 -29418 -7562 7048
15627 7048 13940 3729 -6708 -35730 -55026 -45362 -26933 -11140 -7604 -14822 -36543 -19982 -16486
15614 -16486 -27444 -47343 -57373 -58321 -46807 -35746 -13686 2930 18282 26292 9028 7192
15602 7192 -13017 -13562 -15145 -25967 -18566 -6111 2309 -14060 662 22452 7035 -23887 -40173
15589 -40173 -32069 -11198 -24983 -29698 -32953 -28261 -9094 1331 -8987 -15031 -50166 -40334 -11492
15576 -11492 11626 41258 64446 27892 -4976 -16874 -18006 -24933 -11945 12662 22654 28675
15564 28675 17485 10931 7473 4984 13909 -8629 -28955 -31805 -32093 -41271 -34447 -15353 -2206
15551 -2206 17260 12974 -26969 10341 28394 4219 4688 -8862 -21588 -31521 -22113 -20 6135
15538 6135 -14130 -27058 -28520 -6769 -7176 -16608 -28125 -19887 -12722 -31886 -49731 -40467 -29082
15525 -29082 -36680 -21525 -10917 -6856 -12648 -328 -1379 15772 7926 -5216 -10878 -8988 -10082
15512 -10082 2892 -4836 -14011 -20827 -37906 -39074 -16600 -16319 -16861 -16976 -8847 13939 22991 31591
15498 31591 22967 5738 5879 1914 -6182 -5867 -24940 -46166 -50592 -54398 -34285 -14190 -18083 3732
15484 3732 -5595 -11086 6965 23317 18902 30519 19012 -4150 -32136 -57039 -42665 -28499
15472 -28499 -20595 913 -18156 -21418 -12987 -16181 -27076 -40143 -55682 -46332 -8769 -934 -488
15459 -488 22660 35548 20354 4281 -14570 -18482 -11171 -26843 -79431 -91744 -68341 -61112 -50034
15446 -50034 -27936 -7591 1353 11109 20094 -1004 -15307 -10115 19574 20350 35771 50556 61245
15433 61245 39703 47187 25064 11653 7656 15383 6620 -21431 -47773 -58553 -62908 -23244 -35290
15420 -35290 -61914 -54149 -45675 -31142 -8172 -8706 -13729 -14344 -9253 -3620 -28399 -7012 -12091 -31817
15406 -31817 -36654 -16945 1815 13764 12007 10535 4121 -5001 -20486 -17513 11640 1388 16201
15393 16201 16929 -8208 -11904 1687 -1723 -1550 -7369 2102 -3168 -8134 -8682 5805 -4955 -29695
15379 -29695 -34599 -46084 -24520 -11855 -17910 -22418 -13986 -10685 -14191 -16592 -19326 -27070 -31876 -52988
15365 -52988 -59028 -51793 -38757 -30577 -32409 -10138 -5244 -29004 -32773 -13856 -20453 -25977 -25884 -23473
15351 -23473 -29132 -32850 -60303 -48272 -42599 -44059 -28852 -17966 13937 33167 32783 38775 36776
15338 36776 32011 41571 53035 39920 -9822 -48394 -22322 61 -9696 -6151 19291 21273 -12434
15325 -12434 -13697 24454 46730 33221 3141 -1088 -9061 -28658 -27600 -33125 -46846 -36922 -31415
15312 -31415 -20204 -10623 -14886 -38007 -41608 -41608 -33444 -39376 -46359 -61931 -50767 -22803 -5436 -16394
15298 -16394 -6267 12058 11683 14903 -19373 -35109 -54887 -64116 -34045 -23010 -41051 -55170
15286 -55170 -52992 -50512 -34601 -19392 -20742 -26240 -16055 -27713 -69512 -92238 -60633 -34192
15274 -34192 -6952 -8600 -24463 -30781 2123 24144 20557 -13022 -20851 -20860 -35012 -23297 -25769
15261 -25769 -34459 -26038 -12829 -11937 -30360 -46778 -32195 -5068 3606 -13574 -12748 -17194 -17688 -26840
15247 -26840 -28272 -14409 -23467 -12281 -33181 -50903 -37454 -2678 21118 25865 -4275 -12115
15235 -12115 12037 13064 -780 -18543 -43924 -30155 4001 19839 5520 6378 -23866 -32170
15223 -32170 -28722 -43771 -57456 -33798 -17774 13259 26722 13252 19595 10864 -12791 -29944
15211 -29944 -45530 -37819 -48884 -44258 -25996 -34110 -45109 -34897 -61149 -44822 -32063 -52780
15199 -52780 -90015 -71739 -57279 -58320 -30329 -5170 -30266 -46406 -59182 -76619 -70835 -25534
15187 -25534 -10040 -10372 -10523 -39578 -49461 -48449 -37716 -37089 -17159 20210 9001 1829 1207 5772
15173 5772 9930 14512 18532 24572 8888 -3615 2669 -1909 -17738 -979 -2018 -8429 -15797 -7708
15159 -7708 -14834 -11613 13454 17699 10683 -2010 -12148 -2482 -26289 -28105 -19567 -37040 -43449
15146 -43449 -34657 -20074 -10101 -11577 -16014 -3060 -17714 -19100 -12395 -13039 -14453 -16809 -507 -3633
15132 -3633 -24756 -4428 -18559 -17973 -15503 -32165 -22323 -17743 -11327 -15559 -13064 1830 -7881 -33294
15118 -33294 -43695 -48169 -33943 -32128 -46015 -41337 -16857 -5864 -4670 -2354 -18537 -30260 -34252
15105 -34252 -45371 -56613 -59653 -64499 -63402 -59255 -37799 -46566 -40045 -20279 -24954 -38135 -29435
15092 -29435 -25260 -26076 -19134 -6348 -33511 -34834 -39325 -41389 -4337 26756 25079 -895 6514
15079 6514 24905 -10689 -43199 -52912 -54339 -37391 -34533 -32619 -40036 -34184 -46901 -46784 -32218
15066 -32218 -34171 -28501 -39927 -38809 -48548 -49905 -28507 -19901 -6182 -7486 -16866 -12658 -14232 -24239
15052 -24239 -23186 -26424 -21249 -11243 -9877 -18173 -21291 19192 42332 18264 -10214 -24016 -16528
15039 -16528 -2603 -21915 -19214 -17543 -30282 -21683 -2603 -5632 -12672 -7718 -10100 -1311 3510
15026 3510 -16440 -16317 -8023 -7778 -6528 1237 11022 8885 -4930 6160 -23342 -46619 -38623 -7608
15012 -7608 -13497 -50229 -44429 -7631 24715 21709 -3931 -9587 -37035 -43542 4647 2499 -10133
14999 -10133 -25741 -39151 -32747 -27496 -8906 -20896 -16705 -14183 -38214 -50233 -30204 -7611
14987 -7611 3471 2458 8446 -6235 -8473 13694 29827 37087 44118 40777 10025 4146 8019
14974 8019 -20179 -15971 4404 1873 4988 -47 -6334 -34294 -42127 -52526 -63389 -52514 -42173
14961 -42173 -34539 -39489 -55497 -55672 -51555 -39232 -32012 -28040 -14708 -23600 -16103 737 17992
14948 17992 -2498 -17658 -27560 -55530 -70431 -66227 -53115 -49106 -45652 -29156 -21391 -24342 -27070
14935 -27070 -47867 -63049 -33791 -7687 1654 13380 23277 -6720 -12502 -8677 736 -12460 -28102
14922 -28102 -25571 -39034 -58860 -65083 -51146 -50789 -41852 -46960 -42001 -20447 10446 5273 -25397
14909 -25397 -53638 -56483 -49470 -51651 -33364 -33656 -24412 -23688 -29915 -57539 -62452 -37142 -40611 -45462
14895 -45462 -44200 -51727 -36800 -43003 -31310 -23180 -30528 -16440 -14716 12156 9755 -31167 -32045
14882 -32045 -27939 -25093 -22019 -40188 -38894 -16075 23336 11656 -24377 -23614 -10213 7039 1674
14869 1674 -22241 -32800 -3799 6318 19628 51611 60061 32686 26675 32689 -4361 -10869 -19376
14856 -19376 -32220 -24110 -32430 -55508 -45348 -8419 11989 5201 -14422 -14260 10242 11474 -12626
14843 -12626 -19126 -10045 -5835 2896 -1512 -22807 -16807 -16091 -8121 15679 3027 -12950 -22819 -20346
14829 -20346 -32160 -33671 -41176 -16198 -6741 -7256 3608 12848 31930 55731 34682 11311 8228
14816 8228 30550 23358 16008 13900 10275 -17460 -17137 8621 4486 5903 12279 -9919 -12661 -23517
14802 -23517 -27788 -34961 -35279 -45063 -41915 -22486 -8546 -23133 -28710 -28362 -16887 -6489 284 19777
14788 19777 14489 -5090 -17988 -2695 -9510 -26059 -39992 -22948 -20737 -29185 -47558 -58323
14776 -58323 -32566 2041 16819 38947 15579 -5905 362 10687 6512 -11069 -7644 1130
14764 1130 -902 -12500 -18726 -54343 -47759 -35288 -16135 -34530 -37608 -37913 -38036 -35883 -28973 -26594
14750 -26594 -28491 -9005 3619 -29198 -36347 -27421 3710 10464 7442 10048 4958 -1146 -12970
14737 -12970 -25374 -35632 -65985 -52626 -46102 -10527 -2193 1579 5337 -7376 6595 9849 16320
14724 16320 6092 -15637 -16288 -20462 -22916 -2584 15805 16957 -5966 -28203 -13269 -29911 -17117
14711 -17117 -9505 -5801 -18142 -24127 -23155 2926 12688 22609 -7340 -25459 -15199 -7884 4867
14698 4867 14427 24285 14894 -4718 -20711 -19986 -19714 -19370 -4900 24652 31923 39139 37144 6733
14684 6733 -9848 -9118 -17390 5100 24171 5891 -22661 -46096 -28724 6973 7346 -2380 -2544
14671 -2544 -7855 19222 30018 30113 18085 -23659 -53600 -52251 -46085 -26131 -11284 -17978 3844
14658 3844 13625 562 -19863 -19429 -13302 -17128 -12682 -35647 -17356 -1330 11 -6221 -15696 -24060
14644 -24060 -16617 14032 17711 22372 33801 32600 38 3674 22871 25428 15395 1202 13220
14631 13220 17564 12216 9510 -2352 -22467 -28383 -19910 -21205 -28298 -20417 -42630 -52623 -25893
14618 -25893 -18843 -14210 -6101 -17738 -48614 -73724 -56036 -39280 -7487 20405 3890 -4784
14606 -4784 -12887 -17577 -11706 -15385 -17776 -10746 -7187 -1487 7330 -190 -27271 -36916 -35917 -40033 -40216
14591 -40216 -9537 5127 26506 27696 25968 25689 39623 52639 68721 34060 4719 6028 10228
14578 10228 -5817 -26282 -43316 -37080 -15361 -9347 -24471 -2558 18977 11964 1051 21770
14566 21770 25741 36902 18484 3964 -19225 -19818 -22286 -10689 -1626 -2196 940 -4922 -662 4159
14552 4159 -6786 -23988 -37402 -39304 -45864 -49680 -23348 -11348 -11220 -16695 -22735 -31480 -39251 -27493
14538 -27493 -28661 -30187 -38745 -65240 -71817 -89751 -69062 -47787 -19133 11374 -6011 4141
14526 4141 -5636 -6098 -16789 -38046 -43381 -37223 -55872 -67801 -63438 -48365 -17371 -5290 -6193
14513 -6193 -24406 -34656 -15730 15316 45947 35639 1105 -18947 -10820 -6713 -14873 -36716
14501 -36716 -26239 -35431 -28552 -19504 -8977 24131 -2482 -23904 -29644 -33483 -51316 -63108 -28002
14488 -28002 -31969 -5982 12459 5676 -3078 -19200 -30613 -31655 -19660 -28496 -4286 2016 -26593
14475 -26593 -53388 -50404 -59595 -73097 -85170 -68334 -40150 -32964 -19840 753 5884 -22287
14463 -22287 -42493 -30731 -11283 -35007 -36799 -34848 -38417 -38732 -42530 -47147 -35785 -35388 -40704 -41676
14449 -41676 -40624 -45210 -37579 -36565 -24235 -10969 8291 15530 4825 -5559 12255 3702 4774
14436 4774 20985 22201 -6200 -12808 -8221 -27701 -11801 9888 27219 25356 24889 7431 -15189
14423 -15189 -23915 -50637 -39245 -55714 -61937 -46626 -76176 -52147 -43214 -29552 -5277 25587
14411 25587 41472 37909 18042 15615 261 4433 -8207 -24458 -5318 -6508 -27896 -30014 -41772
14398 -41772 -44936 -29223 -638 219 -6220 10495 6629 -1177 -24047 -15693 7902 12998 -11708
14385 -11708 -4745 11341 7972 24326 22083 28891 44663 19404 -11688 -32967 -42995 -24002
14373 -24002 -1871 -1749 -13447 -33657 -42579 -53685 -36730 -19899 -7198 13360 2857 -1311
14361 -1311 -1064 -4743 -8715 3903 46500 38290 -18178 -51589 -60212 -30470 -6167 -32827 -48616
14348 -48616 -50745 -56391 -57149 -39515 -8433 13958 22264 -193 5569 41743 52545 35828 23320
14335 23320 10921 -12624 -34250 -50355 -64035 -55852 -42966 -30163 -29771 -30129 -49073 -71461 -57672
14322 -57672 -28724 -22334 -38743 -17209 -13444 -21207 -29695 -39344 -54219 -68259 -62883 -24232 -28631
14309 -28631 -18159 -8652 -20562 -14408 -27114 -49816 -65171 -66661 -59607 -35843 -29999 -45581 -47134
14296 -47134 -3862 5988 -16910 -29608 -26404 -27644 -20977 -22421 -29922 -36139 -26553 -20696 -14938 -21572
14282 -21572 -12999 -24083 -29117 -9662 467 -12118 -48114 -55175 -59178 -64127 -60623 -18740 -6770
14269 -6770 -728 -26136 -41210 -45397 -27496 -11507 -29306 -55319 -59202 -55915 -52671 -64763 -58617
14256 -58617 -54687 -50970 -53988 -56445 -48024 -47558 -56930 -52880 -22331 -37412 -41316 -14408 14641 45199
14242 45199 52589 45305 49389 21115 -17735 -23615 -27969 -15338 -3200 -336 -28485 -33969 -8582
14229 -8582 3978 1826 -8905 2330 6006 -3446 -3480 25377 25275 -3715 -20272 -18753 -20197 -10012
14215 -10012 24713 30859 33938 27701 5811 -1847 -8347 2951 -9576 -12521 -14293 385 18613
14202 18613 35970 10892 10593 2694 23308 3637 -31997 -51185 -43841 -43509 -36098 -12555 -15756
14189 -15756 -5037 2973 11592 3906 19175 18528 5143 -3908 -5766 9264 -1001 -21949 -20210
14176 -20210 -45274 -65332 -59210 -39214 -21588 -34409 -32437 -27872 -37278 -69502 -82657 -84122 -70767
14163 -70767 -44488 -27662 -51544 -60854 -48897 -14158 -15459 9850 16540 16401 -4924 -10929 -7202
14150 -7202 -911 -7097 946 33874 27053 -2599 3764 -6247 12544 20148 -11850 -43330 -30395
14137 -30395 -25953 -34929 -32943 -16361 -18261 8044 11502 16547 24744 45009 39043 18869 36608
14124 36608 25544 29155 14554 -18650 -16718 -18583 -21884 -12541 -22302 -23140 -2812 -2275 -12002 -9760
14110 -9760 8176 1350 -21142 -24410 -19210 4494 685 -13833 -14384 -12302 -12489 -30069 -23303 -33962
14096 -33962 -32269 -48629 -46347 -46998 -22754 -16934 -17844 -13939 -415 -4659 -4187 14131 8173 839
14082 839 -3363 1868 19202 26706 18171 19831 18615 22612 7062 -6742 -4530 -34540 -33932 -5915
14068 -5915 -16340 -26899 -22134 -10050 -23014 -32549 -20863 -16413 -21802 -15956 -5167 -7751 -4808
14055 -4808 260 -3003 -8608 -22135 -17870 -24778 -25032 -35059 -40289 -33948 -17733 12144 2478 -18107
14041 -18107 -37107 -40326 -10614 8838 563 -21913 -17485 5838 -1514 6312 21285 23448 24504
14028 24504 26052 20681 -11640 -12986 38078 53052 44924 40357 32611 24043 -2558 -3010 -2919 -20978
14014 -20978 -32195 -14048 -23884 -33990 -52616 -59357 -45499 -19115 -33677 -44732 -23242 7733
14002 7733 -295 -17790 1361 23173 26209 27003 12713 5011 -12479 4855 5860 -55546 -82886
13989 -82886 -60203 -33139 -25279 -21059 -5522 6224 -14069 -20202 -16802 -8697 5685 -5878 5368
13976 5368 -25118 -26245 -38727 -71377 -77709 -59146 -38530 -12865 3758 -605 -11992 -26883
13964 -26883 -14794 190 -4952 -3392 -5491 9515 22874 57778 48770 13977 24797 -24130
13952 -24130 -29944 -23198 -16061 -7267 11957 -5684 -8859 6252 17217 -2173 -27661 -40633 -17263
13939 -17263 12899 20901 -11902 -34167 -1349 2774 -1770 -18262 -9933 2371 16621 14685 -14606
13926 -14606 -43199 -60163 -77023 -53073 -40480 -31803 -11881 -6814 -5878 11903 -7845 11914
13914 11914 27187 33153 11752 10095 345 -17823 -23871 -17866 7697 40402 19930 20345 46804
13901 46804 55965 45680 41283 53474 54626 39512 3500 -34283 -31429 -24129 -13637 -23338 -24355
13888 -24355 -4404 4664 -1257 16545 9077 -8372 -21358 -31104 -45056 -4393 15108 4651
13876 4651 531 -12046 -23226 -20257 5887 6918 18309 -5051 -29962 -39595 -14496 2462 -11081
13863 -11081 5275 32492 45818 43498 31667 26425 18302 -12998 -38666 -26542 -421 -16639
13851 -16639 -22341 -26236 -28064 -27830 -29926 661 12850 26492 32307 32101 10660 -2767 -10250 -19524
13837 -19524 -29948 -22389 -32797 -15134 7302 4129 -6455 -11008 -16315 -26512 -44134 -40490 -27222
13824 -27222 -15902 -3473 19797 7282 -22227 -38854 -24996 8709 -5467 -12776 -6213 9805
13812 9805 -19132 -25104 -46804 -38082 -5718 17287 39285 46969 50918 30624 21227 15950 3850
13799 3850 -8130 -7166 -15881 -24764 -25105 -39229 -44176 -41173 -28153 -24032 -30629 -48317 -50306 -54146
13785 -54146 -97390 -75823 -52883 -50181 -45914 -27357 5506 18243 19465 22496 48934 66120
13773 66120 50837 56500 72216 60869 50899 46603 56567 29422 14547 7687 20200 19673 18580
13760 18580 26588 28623 -3363 -6837 -10668 1156 19212 27597 7830 23113 36413 41901 30447
13747 30447 3908 12544 27613 24170 19115 3162 -34709 -64332 -64165 -50653 -57400 -61608 -44160
13734 -44160 -17139 14108 30662 25060 6863 -22602 -33109 549 20785 39540 24273 4779
13722 4779 -17463 -24533 -2262 17619 -1121 -5426 -24618 -17591 -37392 -53179 -30099 -15072
13710 -15072 -25585 -20044 -13585 -9233 3397 -6675 -13526 8497 34334 39243 53449 42203 40049
13697 40049 44126 39095 36970 34184 35663 43698 29571 37025 20304 -3170 -18983 -16347 -6366
13684 -6366 9106 2767 1978 -17110 -35544 -27126 -10659 9611 -788 25482 30675 60445 55901
13671 55901 33752 25217 32559 28901 20362 -3360 -10042 -18524 -881 1128 -5112 -8988 -5672 6090
13657 6090 16716 3731 18573 22733 23837 29429 63886 19574 -11860 -9339 -12269 -15581 -6206
13644 -6206 -5301 -41155 -47335 -40489 -22132 3923 25022 31749 38915 51662 50307 32601 -2735
13631 -2735 16673 38829 22478 -7559 -15418 12719 18079 27362 43006 44570 23295 23853 37106
13618 37106 34587 36395 60464 37323 38946 51426 43361 21670 7603 9124 -18167 -33187 -21480
13605 -21480 -3083 -15792 -16218 10712 32108 44123 37114 35866 37584 59512 62245 52337 42029
13592 42029 47232 89694 108265 105869 89515 33615 10372 10534 13960 8586 8738 33506 -10626
13579 -10626 -49832 -33106 -15898 -2927 5383 7338 3851 20597 35427 12085 -9949 3676
13567 3676 18604 29931 24940 34308 46987 41191 17889 16141 5297 9686 21968 23208 32586
13554 32586 30508 28818 41824 47292 55009 61995 68773 57438 60980 52555 36262 44647 53936 41571
13540 41571 25194 4164 370 20764 23808 22015 -4898 -28026 -27209 -5077 10020 8886 27288
13527 27288 43244 60644 63996 55404 38715 12051 12756 25399 8937 3031 15162 -10121 -20468
13514 -20468 5010 23765 19664 44770 74914 80688 84334 73156 101150 114597 91732 63511
13502 63511 54006 43184 34615 44662 51342 68933 51096 33663 52103 53615 36666 28760 22291
13489 22291 11235 -4890 13430 29039 32462 22570 20922 25136 19129 -12366 -11366 -817 27394
13476 27394 25456 26900 55261 64016 73280 74284 78103 82378 94562 97178 114002 112850 104074 122201
13462 122201 156652 170459 157317 136562 110844 106093 90129 73450 82942 91216 88424 88657 94015
13449 94015 109280 110005 88897 79815 93263 103680 98542 102073 119678 96226 94332 134912 191066
13436 191066 215415 236478 285587 379712 467645 537862 603217 685935 768471 810711 850024
13425 850024 848674 787551 712257 655034 610772 597838 610764 588329 579278 593258 604217 655666
13413 655666 688329 712589 751046 804447 858633 933394 980644 1019737 1063556 1100930 1115641
13402 1115641 1137214 1142396 1127038 1103650 1066640 993428 898969 796602 701897 642020 597557
13391 597557 563545 543034 508535 521600 551678 580406 605127 662930 695059 741062 803337
13380 803337 847893 829913 774462 723020 674533 607781 529773 449305 406042 348894 323425
13369 323425 294564 238593 214758 222296 226024 244499 286266 314100 342246 371625 438093 528474
13357 528474 589654 664447 752472 836809 903321 950663 995869 1022339 1008124 970686 885267
13346 885267 798529 738637 657431 626026 613019 617853 652481 708771 799505 886744 944403 1015778
13334 1015778 1093275 1167700 1208770 1225685 1247092 1267161 1292018 1297860 1288348 1261409 1209996 1162601
13322 1162601 1131468 1051343 967144 873001 779747 706322 645868 606302 580847 597529 638081
13311 638081 690965 756341 811626 856665 895175 913562 926224 895020 858686 812473 736654
13300 736654 653504 577555 502182 434159 359668 287071 256751 230414 220061 188675 133008
13289 133008 135575 160513 163498 148688 139037 129261 101016 88545 98241 124301 156907 186653
13277 186653 182959 167819 158331 153510 160172 183446 172904 167391 153317 132951 123704 107900 130952
13264 130952 160414 151510 128457 140657 151301 140877 132875 135212 137629 142827 156846 183069
13252 183069 181815 164845 145150 131355 152151 142211 117433 128886 115095 114172 109284 95455
13240 95455 89325 107014 110787 115973 119506 124070 151573 181996 183783 156248 151375 140463 134062
13227 134062 156220 135948 110297 113291 173513 243575 258418 226634 224292 250390 231703 213332
13215 213332 207213 206021 188932 168298 137845 164822 166975 179108 193184 198842 204220 189835
13203 189835 186088 199617 236029 256802 264879 286208 287668 266536 251905 240029 250524 248316
13191 248316 276193 266904 233907 221426 217521 217021 209656 208288 213408 220225 208062 214272 229677
13178 229677 234426 240817 248054 241186 240179 209017 229997 233166 226343 237120 241107 232167 222667
13165 222667 196603 159271 129187 141242 166397 184039 179496 176246 168426 153698 193567 195347
13153 195347 178949 200056 205960 218273 224346 233848 262990 251302 232222 216317 226668 253713
13141 253713 261315 264506 256325 258494 230338 208239 203625 214306 230700 230453 225493 226938 241853
13128 241853 259341 272924 282859 300101 333471 327441 361178 385848 371736 332181 325041 321971
13116 321971 291629 285370 289731 273727 259435 246029 240952 235028 223051 246590 278675 281972
13104 281972 301034 273702 254819 258237 271873 298426 306076 292676 327003 341870 337268 306653
13092 306653 276679 261439 241239 237318 223087 203922 195172 175918 203256 233537 247811 272795
13080 272795 265208 286472 308680 320682 312851 309446 311800 303988 301217 303558 294286 276288 245793
13067 245793 243419 235275 230782 227708 238056 258910 276476 302901 344827 353091 339375 358184
13055 358184 372050 371869 380812 379888 382661 399489 411925 428541 448925 444616 465445 482606 498695
13042 498695 505281 483718 485029 490370 506549 504105 524403 554586 581409 613266 633831 652723
13030 652723 655584 663101 674899 718484 780753 866549 932454 995347 1046263 1046823 1067587 1114403
13018 1114403 1114603 1111954 1126869 1119546 1129767 1143489 1160620 1185247 1232038 1310695 1430204 1574671
13006 1574671 1660107 1762300 1883176 2015977 2176269 2329917 2485929 2669507 2842664 3022882
12996 3022882 3240257 3521684 3832529 4176141 4558352 4946023 5387499 5819525 6250465
12987 6250465 6716608 7247072 7792162 8389225 9090795 9913647 10958378 12274105 13962442
12978 13962442 16051135 18557637 21532921 25066820 29502047 35429011 43684611 55070226
12970 55070226 69932413 87493707 105265979 120799434 132191229 138475659 140772958
12963 140772958 139717469 135503631 128712661 119510050 109206318 99335113 90906013 84996311
12955 84996311 82111699 82443268 86259645 93346362 102990342 114542939 127490575 141997156
12947 141997156 157287163 170666353 180843951 187174584 191108494 195379996 199950373
12940 199950373 203501916 203373243 198398252 189014366 177305419 165144979 152973311 140090099
12932 140090099 126761610 113543730 101750345 92835026 87293405 85417425 87010799
12925 87010799 91989437 99860614 109356431 119259894 128593837 137371269 145250960 150454233
12917 150454233 150719289 145232311 134721226 121253993 106402554 91358328 76660148
12910 76660148 63526424 53027631 45510517 40658186 37751144 36173760 35576307 36087419
12902 36087419 37901061 40992670 45282189 50869384 58414917 68887721 82314610 97780577
12894 97780577 114507438 131479586 148247270 163198945 173671271 177503664 174374351
12887 174374351 166232565 155612970 143973944 131863404 119949437 109684434 102507601
12880 102507601 99235097 100300651 105450793 114439776 126901619 142064256 158297661
12873 158297661 174042204 189108203 203741480 218078661 230922950 240103428 244067655
12866 244067655 242362405 237088321 232068550 226891416 220452925 210256784 194791824 177245914
12858 177245914 159276418 142519857 128082593 116090573 107114464 101624941 99573161
12851 99573161 101362116 106759564 115291453 126500079 138761050 150313302 159531197 165059090
12843 165059090 167400344 166674165 161759722 151885765 136502775 116487030 94923723 74719991
12835 74719991 57966331 45356142 36382183 30154369 25740802 22479379 19924757 17812840
12827 17812840 16072539 14686318 13616753 12840680 12248972 11748125 11321699 10906152 10482827
12818 10482827 10054319 9605672 9111461 8624459 8138339 7601912 7059101 6572097 6106062
12809 6106062 5679835 5324478 5033171 4772370 4568888 4425255 4335247 4219865 4142505 4085406
12799 4085406 4043314 4034620 4026378 3985560 3922421 3885079 3805703 3703012 3602821 3478821 3316679
12788 3316679 3163355 2999284 2861787 2758538 2658606 2575442 2494055 2419523 2378249 2342975
12778 2342975 2300264 2279473 2267108 2254300 2239617 2212140 2184787 2149407 2110253 2080747 2033570
12767 2033570 1978652 1961532 1915152 1866766 1814107 1767117 1741175 1730536 1699076 1672340 1653848
12756 1653848 1622359 1594254 1563143 1559772 1543963 1525453 1511914 1514726 1516961 1498175 1461124 1454597
12744 1454597 1474722 1482476 1455228 1434506 1406099 1429717 1442793 1419426 1380963 1321956 1287788
12733 1287788 1257720 1224610 1188369 1171155 1158384 1135868 1141490 1156004 1153283 1127518 1080787 1043698
12721 1043698 1040521 1059212 1064329 1080634 1095632 1075196 1050395 1043223 1019286 982691 950426 897529
12709 897529 883375 877120 865399 842925 817291 820662 841083 859499 864711 861100 839864 833159
12697 833159 837556 849408 834710 797494 796070 799756 778141 766220 777114 794274 791065 780632
12685 780632 739436 720538 745433 747161 740916 733369 759617 778908 747840 727110 715701 682363
12673 682363 656359 643313 656940 679483 690520 705386 701545 680580 656405 642231 658668 658521
12661 658521 668190 677238 677407 677454 674632 677107 688328 699802 683943 656189 659519 648562 635028
12648 635028 644589 658046 627331 598495 612527 590326 560657 577614 593700 578745 571172 568579
12636 568579 559486 549037 535328 537534 532757 535660 544925 541092 535239 521890 507193 520514 512708
12623 512708 505330 502907 493137 482021 481911 475662 467371 482133 478095 457143 471510 456999 429165
12610 429165 430047 462063 487066 475002 472055 465708 478314 476151 463678 493728 506965 521935
12598 521935 504542 498673 487494 465114 473226 457165 458773 469802 458521 430093 415030 418121
12586 418121 398578 385094 382537 376604 363679 380401 405272 431397 437498 420707 397277 388685
12574 388685 397349 389301 401375 416566 389256 374900 378871 383409 370633 365679 390053 408239
12562 408239 405562 398401 398269 376384 376662 387655 371123 377000 387355 391918 416377 470488 511535
12549 511535 551627 584757 644370 730080 836712 1045606 1272283 1463346 1603606 1574212
12539 1574212 1461508 1270089 1090827 983196 901527 841888 819569 811207 807406 853113 953784
12528 953784 1085141 1281376 1497465 1632891 1635799 1520258 1305010 1098999 942552 817795
12518 817795 723815 648254 623232 636058 612934 596528 590788 571088 556408 578941 574362 576673
12506 576673 607584 626501 677121 752971 831710 936896 1032593 1081733 1089638 1114882 1152586
12495 1152586 1170836 1160698 1123702 1082965 1055813 1044231 1023733 999189 971064 960823 975251
12484 975251 1011378 1071689 1146597 1245669 1370909 1471028 1587838 1747851 1905894 2110951
12474 2110951 2361684 2649743 2946149 3174799 3252047 3230182 3165359 3064213 2927522 2726062
12464 2726062 2480180 2252130 2071135 1973565 1953871 2001969 2106962 2278641 2504384 2694454
12454 2694454 2795331 2824749 2813665 2762707 2663867 2485504 2272358 2023569 1753519 1531846
12444 1531846 1377581 1244296 1114537 1015391 933053 848638 786688 745561 709782 688820 708627
12433 708627 704376 696332 729891 765103 836885 912533 999290 1108142 1237370 1355403 1457104
12422 1457104 1604409 1708521 1775391 1747542 1644534 1527311 1397576 1296975 1195333 1120524
12412 1120524 1083170 1079867 1099656 1147764 1184668 1233838 1317224 1427814 1579617 1722052 1871795
12401 1871795 2040653 2238543 2438461 2662695 2791535 2801642 2693139 2490264 2284636 2138815
12391 2138815 2019418 1921714 1785070 1674907 1591561 1529768 1499418 1540025 1666764 1851905
12381 1851905 1994797 2043889 2017022 1939927 1835877 1738679 1663124 1631232 1583476 1489462 1421286
12370 1421286 1333992 1251663 1129251 994574 870393 784457 728782 679528 659004 643937 620033
12359 620033 595603 593182 619895 645377 654663 627186 586021 563447 541162 516117 497340 489502
12347 489502 472790 474982 501699 538283 558013 582296 611553 603054 590704 577433 600046 607099
12335 607099 584398 546623 517020 466321 447526 463124 475823 473555 505614 514419 493181 460471
12323 460471 461699 450691 445196 431100 413104 433174 441171 439386 455772 428843 415588 387125
12311 387125 392449 386520 381224 365927 374913 399162 416115 404813 385551 383065 408680 417062 416757
12298 416757 398173 398563 417285 430101 446153 474382 511977 529056 536825 566953 591412 621523
12286 621523 628454 648388 667266 652331 622291 614465 619819 605365 591510 580487 570423 548693
12274 548693 554262 564160 567341 592414 602598 608958 633355 651592 650943 645605 604144 568898 531531
12261 531531 505122 495102 482552 497826 502008 478358 468790 472197 484461 466425 476736 472052
12249 472052 461803 471784 483533 488048 510244 525594 515551 496126 497816 502279 507552 507507 537349
12236 537349 549557 549856 571928 575214 566273 529380 491069 464003 473557 457802 455348 474488 468612
12223 468612 464025 454333 474370 533870 591865 642983 658996 669418 691698 729740 719328 724686
12211 724686 699513 669944 642302 619521 561123 528700 530950 560722 599677 629921 664378 693663
12199 693663 734673 777909 828943 843845 818763 799246 786083 747555 721936 694579 689838 727659
12187 727659 739559 751378 778092 793903 783731 780501 790032 816159 848763 880510 917568 933201
12175 933201 928079 895500 906274 918490 921928 927366 956654 1000135 1058426 1093750 1134021 1175324
12163 1175324 1195621 1241271 1293554 1320016 1333746 1369123 1365081 1331796 1320751 1318541 1319672 1350469
12151 1350469 1390389 1439771 1497763 1594923 1706668 1823633 1965622 2130817 2275533 2436685
12141 2436685 2587424 2676802 2774204 2876756 2951967 3006192 3115342 3229539 3382711 3568258
12131 3568258 3799360 4071789 4432371 4856685 5354431 5906691 6503325 7197113 7936072
12122 7936072 8714871 9587471 10630128 11871887 13385163 15272833 17675504 20730163
12114 20730163 24714062 29751275 35574534 41575234 47932680 55597185 66042347 81539904
12106 81539904 105185701 138378334 175046775 203643747 216158188 210095158 190915019
12099 190915019 165353574 139276532 117134433 100521140 90050426 85853975 87719854
12092 87719854 95363190 108008421 125251552 148150128 175733202 200909497 213850803
12085 213850803 208284677 185721976 153942254 121883468 95042139 75018829 60625709
12078 60625709 50026112 41866327 35416026 30357139 26340594 23067067 20339714 18024238
12070 18024238 16125293 14655686 13593894 12857050 12346084 11975279 11690090 11504456 11433114
12061 11433114 11508358 11731581 12124559 12625017 13102781 13587138 14134872 14767735 15533995
12052 15533995 16497100 17725140 19248060 21071054 23260880 26015735 29624570 34378672
12044 34378672 40364839 47134001 54015938 61289806 69889493 81017644 96437302 118793999
12036 118793999 151715418 196294196 243617699 280417116 302841872 313188254 317909960
12029 317909960 319598897 315805963 301966979 276867819 247103033 220501503 202648838
12022 202648838 195348792 197162520 207740043 229678043 261781916 294702998 317359798
12015 317359798 324479436 316831295 301437909 284406773 265446604 240657577 208120810
12008 208120810 171116159 135368276 105665779 83732603 68317330 57281504 48840304
12001 48840304 41875909 35908149 30835737 26645199 23338074 20819323 18897753 17416138
11993 17416138 16260413 15315705 14540040 13858677 13313284 12939159 12676291 12420499 12179170
11984 12179170 11960894 11839534 11839290 11927329 12042983 12252814 12592897 13082218 13760697 14706135
11974 14706135 16024315 17765730 19951727 22584095 25696595 29455984 34097343 39451232
11966 39451232 45060803 51222445 59244577 70986099 88130511 111603643 140978226
11959 140978226 170382444 191689755 196582893 182890910 159331609 134449345 113198870
11952 113198870 97216426 86240043 79855189 78438128 82299155 91856057 107111200
11945 107111200 126067021 146662271 168016357 185303920 191513240 180986015 154753329
11938 154753329 121850797 90894812 67321976 51758790 41908032 35629269 31248639
11931 31248639 27533527 23917990 20309659 17012193 14324508 12256151 10691833 9537708
11923 9537708 8655581 7934621 7363703 6849222 6367666 5954159 5603483 5317437 5095809
11914 5095809 4926161 4747587 4533455 4326936 4091867 3861443 3658263 3458521 3289608
11905 3289608 3182827 3096345 3010946 2916995 2856990 2804281 2745842 2704510 2677297 2640615 2624624
11894 2624624 2599522 2578260 2576012 2563595 2516769 2484763 2446229 2372785 2284229 2177823 2068418
11883 2068418 1984189 1904705 1847194 1783737 1750976 1758075 1759796 1766306 1744177 1692158 1649552 1643406
11871 1643406 1668258 1701604 1679500 1634495 1569703 1486670 1377384 1282257 1227696 1231246 1194308
11860 1194308 1178500 1195145 1208274 1230618 1263648 1269657 1265613 1234003 1214556 1217228 1171277 1096836
11848 1096836 1078390 1075570 1063813 1071818 1097329 1098563 1120224 1147190 1174827 1211300 1204321 1177715
11836 1177715 1172921 1177426 1150644 1163497 1151927 1151461 1133118 1097349 1087894 1063377 1041718 1041346 1037292
11823 1037292 1040923 1045509 1055708 1034768 1017234 1000338 990529 983157 972131 944903 926007 917424
11811 917424 903090 877665 876592 887953 878535 878972 894083 900800 900859 891824 857094 822802 844202
11798 844202 838915 831247 829902 832670 858673 889975 885188 891338 940458 976424 986512 994370 991241
11785 991241 954108 916119 897836 860428 829677 804315 761379 762983 747819 726296 750639 747530
11773 747530 730077 736885 748086 796935 848124 910260 974019 1018055 1052690 1082821 1127192 1159685
11761 1159685 1155689 1120922 1072866 990913 910067 869890 853486 809949 781303 787321 787939 801043
11749 801043 787428 753790 730675 716779 737684 754957 756343 793141 841919 868930 891753 937089
11737 937089 957524 944121 946106 942017 909724 852088 807734 778896 774099 785815 817450 810592
11725 810592 805399 824757 872397 949126 1006393 1102472 1154087 1144790 1102494 1041059 965187 873367
11713 873367 824367 792081 728262 734751 719142 686602 683437 687019 694552 681057 675636 698120
11701 698120 753680 818244 874655 956886 1082820 1240662 1434926 1589974 1694176 1713712
11691 1713712 1586577 1393816 1221098 1051307 920246 823040 799456 789435 777838 780223
11681 780223 783224 800135 796517 799715 834545 848649 842568 850577 866481 904720 985436 1070164
11669 1070164 1161728 1260822 1336954 1342706 1345017 1322416 1294576 1287549 1301082 1352904 1456477 1622159
11657 1622159 1801503 1929271 1970400 1908582 1791756 1678761 1563057 1496089 1455301 1402046
11647 1402046 1347585 1330206 1319648 1367391 1479146 1635455 1797574 1905398 1905297 1848327 1714234
11636 1714234 1533328 1346442 1229199 1124453 1072396 1048295 1058017 1073721 1105136 1172635 1260195
11625 1260195 1350246 1407927 1386160 1301698 1192593 1093757 1007407 939241 895427 888377 884897
11614 884897 846619 857810 894209 890093 898167 897782 889201 889533 895548 912855 952538 997295 1060253
11601 1060253 1126926 1179748 1251600 1277632 1319261 1312418 1282155 1288091 1316729 1385806 1471643 1597161
11589 1597161 1792020 2044387 2325942 2540965 2647306 2692167 2692222 2655807 2568271 2417170 2259476
11578 2259476 2118039 2007104 1949982 1934803 1958844 2058634 2249036 2443452 2597896 2710399
11568 2710399 2728002 2664414 2593216 2503198 2338882 2137657 1903893 1685769 1518182 1386066
11558 1386066 1313881 1256301 1187654 1121580 1064772 1041367 1034701 1022954 1022764 988400 941257 910840
11546 910840 914651 916096 921676 909416 902359 904414 914434 932271 952304 982448 1006105 1037032
11534 1037032 1054254 1065204 1060933 1059827 1061260 1056781 1037855 1000386 973476 969531 988012 1031263
11522 1031263 1077468 1105720 1120626 1173507 1229495 1267992 1319489 1435932 1616803 1803914 1936167
11511 1936167 2020994 1964580 1840005 1693435 1589641 1508604 1453876 1424928 1435497 1455609 1478149
11500 1478149 1524585 1569040 1669241 1837990 1985256 2073265 2039238 1873611 1676515 1448235
11490 1448235 1273004 1196559 1153795 1117942 1088626 1072196 1080743 1063794 1042330 1022465 1005031
11479 1005031 983230 981088 1002746 1028398 1017720 999492 977669 963434 967631 1010980 990425 992743
11467 992743 995638 990311 1001888 1033561 1024170 1020665 1031963 1051926 1065945 1058640 1026573 983629
11455 983629 959661 955067 949488 951843 925489 891234 896765 912426 959078 1005249 1027465 1007968
11443 1007968 1006386 994714 1007376 1023024 1032450 1055365 1108739 1140100 1151270 1149847 1150995 1148247
11431 1148247 1118755 1076374 1058879 1044387 1031166 1039590 1079701 1105053 1123699 1139426 1152211
11420 1152211 1163922 1177284 1185374 1198275 1234941 1244464 1267982 1302241 1377693 1426503 1471756 1501294
11408 1501294 1509386 1550605 1561471 1573219 1572641 1608167 1681186 1752606 1816184 1915803 2059615 2161011
11396 2161011 2294814 2425736 2546455 2652777 2816481 3045626 3302366 3621402 4038035
11387 4038035 4497311 5025005 5601257 6268054 7095576 8163225 9568209 11426397 14040705
11378 14040705 17849288 23336633 30509842 38324051 44946159 48199581 46948642 41751259
11370 41751259 34306463 26818675 20716910 16384506 13616371 11978731 11132715 10853586
11362 10853586 10989234 11431634 12117015 13023401 14174114 15651446 17666453 20434061 24281862
11353 24281862 29854162 37998285 49512137 63991646 79094024 90918336 95569062
11346 95569062 91364804 79774830 64405386 49248257 36812920 27833581 21865607
11339 21865607 18025502 15535168 13975575 13067479 12618349 12485056 12598955 12951769 13531351
11330 13531351 14417466 15775449 17765806 20655151 24854642 30717114 38057849 45748087
11322 45748087 52002625 54902702 53564672 48607818 41757275 34917393 29405110 25805346
11314 25805346 24089404 23967777 25249854 27969667 32473296 39403771 49721048 64001537
11306 64001537 81119141 97469689 106818309 105271021 94403488 77842211 60864628
11299 60864628 46802548 36668194 30038024 25983762 23743340 22798307 22842328 23630801
11291 23630801 24940606 26701221 28926864 31857960 35850277 41369656 49041100 60068808
11283 60068808 76476716 100527850 132069476 166434661 195089840 208237806 201130667
11276 201130667 176382411 141848755 107233094 78767273 58348421 44891597 36220917
11269 36220917 30562860 26939585 24762877 23617838 23206524 23290473 23776324 24711214 26294080
11260 26294080 28784746 32534904 38091504 46113114 57518842 72573523 89006706 102684520
11252 102684520 109041145 105609553 93701210 77200594 60833992 47160970 37117881
11245 37117881 30392155 26164452 23832703 23066020 23766249 26089383 30613684 37900096
11237 37900096 47251378 56622774 62895667 63239608 57884287 48312138 37824825 28947655
11229 28947655 22518169 18501653 16159634 14844976 14220879 14083150 14321624 14837429 15582360
11220 15582360 16622545 18018287 19933774 22617250 26375579 31800003 39889812 52103781
11212 52103781 69011751 88512387 106201492 115906576 113845572 101127536 81702696
11205 81702696 61632497 44932719 32933821 25135272 20143816 16878788 14749369 13434497
11197 13434497 12743988 12497107 12495441 12688845 13088912 13767030 14902967 16668905 19359062
11188 19359062 23475455 29688144 38065599 47452024 55632676 59796828 58363158 51794262
11180 51794262 42124588 32111244 23658495 17438660 13201099 10369627 8378286 6967452
11172 6967452 5968704 5258006 4771887 4403137 4056021 3732070 3414268 3123389 2857409
11163 2857409 2625583 2461023 2350948 2295262 2263248 2234155 2176220 2129179 2059355 1964327 1845065
11152 1845065 1727004 1595010 1485755 1389123 1328281 1290167 1244826 1195030 1151309 1150238 1160780
11141 1160780 1148918 1137876 1127472 1117507 1076794 1035895 977315 953214 949139 926835 909637 917732
11129 917732 913560 901909 886370 882259 885499 872564 849972 827071 796346 792379 772986 756517
11117 756517 745527 769784 787829 784296 784710 779808 760250 735166 694248 703392 713810 694241
11105 694241 673902 655630 667390 665692 670917 640971 622252 605682 586335 552523 553121 532289
11093 532289 520076 532270 540969 559517 580415 610994 622745 627588 634451 650634 643031 601165
11081 601165 573897 552821 522651 486918 491520 472258 460933 454500 474143 457794 462013 474361
11069 474361 477209 487734 490053 513546 534887 551194 556625 566295 591809 590462 563255 550679
11057 550679 516900 501888 479158 446564 422921 416600 402064 424933 450080 462358 465204 450194
11045 450194 435103 420191 417341 394351 375579 410691 449806 442416 435358 444545 436532 423585
11033 423585 428703 438744 413852 401414 395321 397254 376657 364175 371078 394179 403803 390054
11021 390054 392987 406705 399626 386208 355194 356092 367685 372033 379865 403964 371294 368586 347395
11008 347395 343902 366654 380554 400576 397135 372028 387265 413453 439816 434455 413139 410994
10996 410994 413519 395001 399347 370334 357069 340933 362020 374972 367900 363940 354663 333890
10984 333890 308237 288457 303424 321646 333316 365096 380963 358312 363776 374598 357390 324244
10972 324244 318906 318204 316998 316637 311674 308991 304359 329519 365798 362328 340299 317930 325155 331353
10958 331353 322545 333528 378306 406116 449813 495045 521080 547771 548968 516306 510280 484246
10946 484246 448770 413612 367995 360873 364991 360799 372248 393841 366639 362423 396215 428511
10934 428511 448453 464719 506055 520873 575225 652395 739108 790123 780533 755923 714400 643384
10922 643384 577566 506996 451915 403918 378970 382699 415326 416174 428973 478513 516768 530949
10910 530949 534654 523505 506067 508401 517357 511962 510435 519551 558361 577803 581439 563011 525249
10897 525249 486464 482210 485768 465141 453560 458613 433390 453191 495159 556373 637358 774333
10885 774333 912659 1023353 1112247 1144075 1091304 973642 875777 785754 692441 607097 547523
10874 547523 504922 473168 456096 447174 460018 484709 486887 500086 530802 546147 576735 654554
10862 654554 768014 892221 1036451 1210383 1379374 1479040 1469561 1368068 1191654 1016104
10852 1016104 880784 790202 747949 778310 837037 841503 822609 798339 782827 741193 690213
10841 690213 617752 592798 577242 575617 598180 630230 681490 732682 819129 866758 859228 837936
10829 837936 790439 729261 679119 642506 592821 590057 638004 681642 705947 772084 828280 914939
10817 914939 1006806 1115718 1192356 1184548 1138659 1025465 891664 758062 646319 560580 495379
10806 495379 439183 426934 425517 429850 441561 440936 438771 463990 446403 451330 481707 505785 543469
10793 543469 617391 703274 826948 963514 1082107 1191565 1236454 1186208 1108259 1016025 926129
10782 926129 840830 779211 728904 669635 610395 561597 532648 507883 502678 484331 427489 396763
10770 396763 391465 401591 414076 430953 481665 542863 588952 615474 641093 629261 597746 560940
10758 560940 526904 497585 487562 516924 564895 633317 672869 690405 677793 615876 536506
10747 536506 466576 420401 370500 330865 320377 316953 320384 313357 318417 332756 336886 327146 289252
10734 289252 305780 314673 312146 308900 302981 301015 285271 303337 327505 345369 382970 423473
10722 423473 448467 481670 500059 473305 433663 416778 374163 341990 338284 334710 311058 282926
10710 282926 293859 320015 321140 326125 358726 389676 411515 423010 451565 448811 444860 439119
10698 439119 395731 365566 345271 333978 361061 374378 370294 362349 379423 377473 361384 365484
10686 365484 381990 375625 380827 380958 390273 406050 424015 412713 420569 461485 490532 516743 550443
10673 550443 550023 541554 541217 548546 495796 468127 457049 426159 397238 390170 369059 365514 369347
10660 369347 356118 320133 310929 303713 324228 337054 333410 327199 320182 320875 331546 370770 394015
10647 394015 373706 390184 420963 442406 479944 473421 494819 543355 545922 572156 607213 655539
10635 655539 665921 639650 591313 535523 491884 475260 445198 402286 385348 389656 365094 350502
10623 350502 343320 356178 359069 354240 352425 356504 365592 400513 439562 450976 454158 505525 570492
10610 570492 649954 756472 844558 908730 916589 896672 840621 758834 640364 562968 529713
10599 529713 499389 457825 429546 419645 403111 378637 357935 366398 371664 384556 412749 416565
10587 416565 399789 393583 418034 437064 467089 474833 496145 527099 565114 599566 628385 633153
10575 633153 616432 612546 598489 546544 589622 615895 609427 595991 570677 535967 497897 460024
10563 460024 446145 406555 390531 396518 375448 346647 348508 376285 372487 357612 348910 330002
10551 330002 360101 382143 382137 391181 388313 409514 454001 490667 515997 561243 614833 685994 701594
10538 701594 667915 619585 557277 490442 455630 426222 429192 437818 406389 399552 374852 350897
10526 350897 348193 357572 352739 370115 396118 422947 387523 387161 417474 431103 406984 392686
10514 392686 394433 390427 454690 508659 523378 507802 469906 438213 405660 401151 401248 383192 366434
10501 366434 370935 397814 386349 388853 391314 391661 378621 373864 364241 343360 350318 368270 372429
10488 372429 351651 332673 355151 371780 379053 384495 372018 391887 395836 407251 410013 381402
10476 381402 370244 357642 365381 378316 381234 409587 421540 420239 409570 405429 398671 405137 391087
10463 391087 376749 373920 379489 357959 344731 345444 350845 367604 403442 408824 396784 386576 375288
10450 375288 352259 316637 300617 317700 335119 338859 344959 349550 341105 334868 357497 352703 342358
10437 342358 342573 330543 328666 358336 353056 343059 360516 379105 371121 384793 405390 407542 395903
10424 395903 382724 364505 354343 353941 371997 389625 394199 379664 341886 327050 340383 356336
10412 356336 372427 359865 381246 400973 408420 415142 388167 378876 385356 365926 381567 403055
10400 403055 390730 393426 373105 341184 365001 378333 377780 392778 398662 401810 415843 408193 386946
10387 386946 399076 426775 418641 398385 408500 423846 403926 396312 404174 390818 371252 378749
10375 378749 399002 405768 419968 413403 385640 373698 382803 391433 397911 399310 383148 379437 379840
10362 379840 394188 398436 386979 387458 395262 407476 413047 405095 395032 393179 433717 431723 432199
10349 432199 441918 432147 416682 434030 464572 447185 449488 444776 430745 436614 434958 401595 413140
10336 413140 448180 448182 449538 444551 417379 408808 403670 411671 411696 400116 404092 404397 411610 427755 427345
10321 427345 429505 441887 409085 401908 407386 413528 426814 462736 484298 473072 466086 448208
10309 448208 443307 445167 421796 414591 444004 448361 453441 472875 489948 478996 459944 449306
10297 449306 440269 424555 398466 403743 432086 439832 432871 419751 423031 421147 425551 422685 434597
10284 434597 452966 486922 485014 483740 481897 510000 548718 589988 636150 634944 655483 657744
10272 657744 645030 626365 614374 619007 617855 616678 621769 685009 732680 739179 762141 816045
10260 816045 876279 936942 979034 1018733 1051397 1059520 1030820 1000953 985902 985645 1019621 1037559
10248 1037559 1035389 1043315 1051344 1042554 1056026 1055564 1072014 1079172 1057797 1047915 1061009 1066266 1113948
10235 1113948 1108907 1087324 1096830 1088821 1085562 1082567 1080562 1070542 1069142 1055807 1011848 986718 960894
10222 960894 925409 935770 953803 961894 978173 991357 986222 986605 981293 934142 907351 868260
10210 868260 826483 788263 760603 743630 757952 757402 740178 766374 778358 784013 801407 814670
10198 814670 808827 792066 755296 733949 761768 764055 799167 833401 876789 950763 1018707 1001665
10186 1001665 995938 960435 915702 901059 926900 978288 1019965 1049804 1151089 1233409 1288828
10175 1288828 1344875 1394359 1442546 1485122 1533280 1534400 1504506 1487463 1475440 1481481 1504552 1542063
10163 1542063 1601636 1677379 1720621 1774537 1807945 1823315 1823781 1792315 1747428 1740733 1745521 1763030
10151 1763030 1749628 1759124 1746759 1727166 1710008 1714148 1735118 1725501 1712316 1706091 1667980 1584207
10139 1584207 1514654 1509114 1478001 1462953 1492089 1520930 1555385 1569756 1541046 1483596 1439970
10128 1439970 1389018 1340688 1267901 1198121 1161727 1108306 1047679 1035208 1046587 1081662 1110118
10117 1110118 1119506 1132178 1148030 1100135 1062308 1042473 978447 908061 882857 883166 857419 826100
10105 826100 824635 835005 825042 821652 814505 816577 816235 827826 825777 830833 821636 772723 761678
10092 761678 793021 803621 802230 803961 834299 834758 848795 854707 855680 832216 821505 816594 810186
10079 810186 813179 828160 848054 845826 855495 860151 832148 818189 831936 856351 870865 881923
10067 881923 882065 873837 878496 912394 907509 913628 924349 912874 911231 933791 918880 931469 927170
10054 927170 926388 963019 1025121 1053314 1077117 1089561 1136704 1195812 1283398 1438420 1626218
10043 1626218 1766111 1809779 1727317 1564212 1399718 1262270 1180612 1137023 1116786 1095997
10033 1095997 1090032 1068276 1058578 1049386 1048222 1054259 1049573 1051305 1089650 1117240 1164763 1208440 1236881
10020 1236881 1284895 1356927 1436887 1603905 1786986 1879248 1856853 1733968 1590847 1450116
10010 1450116 1349522 1280441 1209178 1205655 1213621 1187136 1165656 1176193 1144202 1081820 1079863 1095454
9998 1095454 1113917 1141496 1178767 1209945 1210990 1230013 1232871 1222177 1209631 1214650 1246758 1274744
9986 1274744 1277948 1297063 1322277 1317166 1340944 1392306 1483819 1582135 1676168 1844664 2117878
9975 2117878 2443422 2697740 2804903 2710721 2467497 2167494 1919898 1743474 1598627 1532138
9965 1532138 1511627 1494614 1504222 1526664 1567438 1622655 1699811 1792601 1860503 1859100 1805799 1777690
9953 1777690 1760335 1790898 1856762 1959012 2128753 2347518 2627413 2851124 2890532 2765577
9943 2765577 2514133 2250722 2026800 1888630 1831451 1776822 1726053 1714356 1739040 1743425 1774195
9932 1774195 1852610 1933971 1977740 1981317 1969133 1919731 1847435 1819949 1779185 1767737 1812362 1859711
9920 1859711 1889667 1913149 1915646 1925563 1925484 1943483 1993236 2078083 2120143 2170019 2215979 2291585
9908 2291585 2379865 2483498 2620321 2791207 2953829 3044574 3036213 2971987 2898018 2860105 2876553
9897 2876553 2908325 2965686 3080878 3198120 3331194 3502311 3703285 3979440 4209639 4405705
9887 4405705 4526719 4576496 4605823 4723865 4890985 5099486 5351683 5634257 6025399 6543472
9877 6543472 7098654 7722107 8381775 9058789 9904079 11072253 12642214 14575952 16827242
9868 16827242 19566871 22921345 26585941 30094398 33385208 36349406 38529465 39843591
9860 39843591 40402365 40772014 41857435 43899700 47118021 51603673 56256681 59436186
9852 59436186 61313391 62764275 64463674 67797959 73164854 79512050 85607598 90326807
9844 90326807 93161700 94499546 95655599 97414605 99950983 103340620 107816634 113207983
9836 113207983 117631653 119652240 118473889 114922676 111414990 109410633 109550071 110939647
9828 110939647 112194825 112413404 111269919 109672633 108601766 109232255 111592534 114798472
9820 114798472 117938068 120497304 121699677 120324435 117565765 113644299 108507214 103751096
9812 103751096 99827170 97170060 95890971 94889521 92598088 88491900 83733959 79910981
9804 79910981 76843538 73275054 69331744 64961651 60127848 55306042 51246770 48583471
9796 48583471 46982578 46010911 45980946 47264861 49187938 50264305 50415139 49743619 48209858
9787 48209858 46299804 44766770 44540341 46886849 52483888 60451310 68111968 74205609
9779 74205609 79172641 81874339 81962075 81526386 81798931 82867709 84654756 88252348 94659052
9770 94659052 103317742 112344550 121155417 129645154 136280343 141181872 146267119 152599563
9762 152599563 161125721 169605118 175715517 179169938 181275723 184581735 190727197 199239860
9754 199239860 207555022 215956994 222915680 225546420 225444555 222534061 216573296 208646236
9746 208646236 201293417 197337918 198174561 202477268 206765024 209367417 209743043 207217281
9738 207217281 203930961 203415065 206316139 209864860 211844396 209797427 203292321 195039747
9730 195039747 186894446 180389242 174955806 170864546 168606540 166633797 163739806 158361864
9722 158361864 150525006 141402117 131886110 123130426 116364518 110706695 103726317 95274115
9714 95274115 86231076 77404386 70270838 66074288 64919149 65727112 66600494 65754295 62823743
9705 62823743 58419071 52589747 45807215 38879866 32359696 26594780 21846508 18006505
9697 18006505 15018009 12796926 11148590 9939084 9046625 8338727 7761238 7314820 6920359
9688 6920359 6545505 6179512 5846441 5534075 5260914 5014676 4829695 4703113 4596921 4521491
9678 4521491 4453099 4398903 4328754 4260423 4211096 4188781 4178727 4195432 4249886 4277154 4336995
9667 4336995 4418035 4485782 4559392 4645132 4728134 4789636 4850235 4953859 5086708 5207326 5378861
9656 5378861 5613692 5897484 6289862 6796667 7389130 8115714 8972508 9853628 10706017 11564156
9646 11564156 12457738 13526769 14866116 16534410 18624610 21320676 24877443 29640868
9638 29640868 36021745 44091099 53699288 65449093 80600248 99342368 118519520 130553471
9630 130553471 131478075 123122267 107599443 90218017 74899516 62439974 52714338 44928443
9622 44928443 38489988 33231958 29359479 26780382 25305421 24822669 25242123 26477142
9614 26477142 28622000 31849937 36512260 42837980 50779690 59744194 69006118 79223079
9606 79223079 91408564 105629225 117802340 121052761 114686833 101691967 86374698
9599 86374698 73425090 64449296 58206097 52524635 45884913 38523671 31485055 25832014
9591 25832014 21907630 19430744 17958020 17193532 16949210 17073001 17512545 18243411 19128011
9582 19128011 20037644 20972219 21893429 22838900 23853139 24979840 26478079 28535489 31287030
9573 31287030 34922733 39685146 46052911 54770605 66654220 82080049 100270300 121086768
9565 121086768 145804854 175113397 205724488 226794306 229741167 216695392 192185098
9558 192185098 164352383 140572134 122940293 110816296 101671528 93469316 85819739
9551 85819739 79558287 75903351 75895360 79947071 87456750 97181338 107100260 114136157 117212095
9542 117212095 118651694 121110998 126886891 136809048 151495779 171639786 196914075 221990313
9534 221990313 234269392 228222827 208053181 179754073 152100368 130393333 114844831
9527 114844831 103481336 93679187 84324610 75762003 68680234 63997937 62291062 63538381
9519 63538381 67050421 71803333 75077419 74324743 69793539 62742718 55165632 48275434
9511 48275434 42210069 36944378 32631095 29469510 27489916 26577419 26584406 27380699 28808887
9502 28808887 30921324 34048743 38650894 45173128 53348456 62479415 72386676 83460417
9494 83460417 96063571 107597497 112779561 110318204 102477569 92029120 82984393 77431811
9486 77431811 75461735 76084138 77760597 79635016 81116965 82813774 86622826 94047766
9478 94047766 105487339 120330045 135655384 144435450 142685087 133173440 120275751 108957614
9470 108957614 102138433 99950137 102190638 108664261 118858337 128157135 129899289 123992735
9462 123992735 112107053 97494045 84645874 75477678 70425363 68761726 69054141 70319010
9454 70319010 71901488 74332751 79177988 87477371 98480310 111214795 122577165 125370722
9446 125370722 117881293 103168769 85384167 68801384 54973371 43734884 34766718
9439 34766718 27924098 22891704 19263708 16693331 14887845 13588410 12660592 12039695
9431 12039695 11647471 11425660 11247975 11028787 10806730 10564359 10337861 10203010 10196999 10346431
9421 10346431 10623058 11110237 11832539 12919344 14425229 16627951 19810967 23922193 28134269
9412 28134269 31438007 33985901 36447997 39625677 44405935 51045589 57699735 59887581
9404 59887581 56942747 50785069 43197035 36312397 30492827 25503405 21322080 17953730
9396 17953730 15410742 13701414 12686299 12204995 12152347 12458621 13114598 14231146 15868596
9387 15868596 18055714 20883117 24149150 27639143 31720964 36966059 43234738 49817212
9379 49817212 56663248 61477873 60435315 54181312 44985034 35263056 27341924 21288344
9371 21288344 16619168 12995151 10255118 8299927 6944233 6017052 5387286 4951361 4622350
9362 4622350 4354181 4157109 4000389 3771924 3491364 3213097 2983281 2822577 2722211 2655824
9352 2655824 2643532 2614889 2562154 2505108 2498033 2518877 2512395 2484023 2440729 2331843 2199614
9341 2199614 2064148 1982223 1920236 1874384 1892891 1934531 1975070 1990970 1966263 1956849 1953227 1904296
9329 1904296 1860816 1892552 1945495 1969655 1962744 1930273 1877082 1807949 1744020 1679807 1594375 1527891
9317 1527891 1468202 1403011 1334365 1243373 1173660 1121276 1106420 1097692 1089902 1135482 1171895 1143272
9305 1143272 1091797 1024469 984532 936218 855713 796321 693526 599221 529187 472813 437288
9294 437288 442152 446996 477400 531851 590225 604816 618081 629340 607223 565131 475102 397015
9282 397015 356608 284452 218310 205882 197740 195091 168733 163020 158723 171389 158466 138625
9270 138625 116554 83317 58627 48262 78022 108582 115368 138633 163907 170773 200430 223392
9258 223392 218700 205927 193318 173101 127583 74382 48704 41326 51182 57654 41281 30542
9246 30542 17928 13869 16223 19313 12667 6605 2523 158 30352 41178 30064 8231 12968
9233 12968 9148 -1185 -13739 -4838 3204 -2158 -6430 -26109 -29547 -15174 -6527 -10664 16078
9220 16078 35427 73513 133968 183490 278904 403250 539242 685358 760034 706863 566229
9209 566229 418382 314946 228824 181656 150965 124841 85432 67263 67437 62073 65507 46102
9197 46102 13063 19697 46615 48403 59264 109394 153839 211795 247718 304240 414071 556942
9185 556942 687171 730365 650732 515820 368450 229531 131297 69774 55975 40022 39125
9174 39125 43262 34240 16954 33174 30720 -4657 -23946 -34174 -22160 -15471 -29181 -49575 -53129
9161 -53129 -51134 -49840 -18081 -7070 20180 48032 50489 51509 76046 109117 147011 207032 264004
9148 264004 349374 493475 707748 952853 1185199 1373891 1405440 1245309 980840 727553
9138 727553 558457 418606 329576 283263 257478 227488 229685 267280 328865 402917 478535
9127 478535 520025 512660 461090 419303 413114 425975 463722 541250 648685 827315 1071307
9116 1071307 1293235 1435297 1390418 1195176 938294 703074 495593 363474 274555 205482
9106 205482 163933 129635 137722 177335 240042 327862 401373 413252 382718 318617 259560 181586
9094 181586 121029 72386 66237 65930 48933 17255 13336 30330 56135 72771 57447 57621 70582
9081 70582 92669 108173 138311 166589 238993 366685 508030 624579 683585 647507 561504
9070 561504 454525 338878 275326 248502 216699 191332 187164 230682 321226 407483 572342
9059 572342 746897 862454 874579 778268 648256 515937 432320 363986 319676 323845 362689
9048 362689 430458 521831 599871 618289 590988 504779 393610 294983 223225 201547 209931 245099
9036 245099 287245 331154 392524 462408 577391 704015 780889 764902 664960 484185 325670
9025 325670 237023 172294 131488 93825 44156 19805 15194 5819 2048 -10920 -24510 -39685
9013 -39685 -40243 -48623 -45430 -47111 -41762 -36375 -56265 -61670 -59135 -49134 -10566 -7751 -14495 -38213
8999 -38213 -37752 -29321 -24300 20818 51791 55756 69248 117292 151453 218433 306406 337295 320406
8986 320406 295376 213855 146822 98350 31150 -309 -15817 -50593 -48270 -30058 -17286 -6940
8974 -6940 -32738 -57267 -56063 -58552 -56630 -61051 -34018 -20436 -1290 46775 92277 153250 238922
8961 238922 313462 329346 298904 223282 150778 70806 33688 -4429 -51688 -73408 -71018 -59528
8949 -59528 -63464 -91838 -109300 -109804 -103364 -102866 -88172 -53993 -49401 -51607 -60608 -55044 -70608 -89623
8935 -89623 -106175 -102909 -85989 -92743 -98752 -86657 -81747 -87385 -91666 -85694 -84913 -82839 -79311 -79457
8921 -79457 -86072 -95882 -92180 -70387 -59047 -35576 -13881 -18850 -34481 -38190 -48546 -61729 -70272
8908 -70272 -66617 -68699 -83382 -84638 -100671 -115638 -109124 -121958 -106055 -103205 -84826 -34620 -30707
8895 -30707 -49519 -61707 -70502 -91654 -91031 -64044 -37827 -52960 -93813 -88306 -77306 -59081 -85205
8882 -85205 -118252 -137060 -112173 -69352 -59048 -31648 -38903 -83211 -79169 -59540 -63729 -71569 -75372
8869 -75372 -75140 -83413 -94258 -96798 -104058 -124596 -99425 -115617 -117823 -129882 -103660 -85262 -69557
8856 -69557 -80259 -93150 -104431 -108742 -93972 -82057 -72638 -65161 -59318 -70544 -73355 -74780 -83631
8843 -83631 -91558 -115587 -125218 -122865 -132973 -139846 -118252 -84410 -80495 -79281 -75343 -67539 -78308
8830 -78308 -70735 -46076 -49515 -58799 -45320 -34847 -17657 16003 -5083 -32623 -30753 -12783 -14804
8817 -14804 -15666 -14353 -18426 23858 109229 159646 164257 142870 97463 32103 -23032 -37761 -57449
8804 -57449 -89310 -78482 -72482 -63968 -84537 -73621 -49666 -41271 -49702 -60301 -39991 -56834 -68361
8791 -68361 -46510 -34445 -22545 -30751 -57052 -64632 -41506 -44064 -34938 -40702 -31090 -13679 -16302
8778 -16302 -20243 -21710 11749 48953 99781 118542 103348 79225 47122 21496 -6284 -34813
8766 -34813 -61087 -72018 -65488 -70369 -78269 -78274 -90263 -95343 -114981 -109706 -73579 -81941 -101847 -92081
8752 -92081 -79804 -56177 -49817 -21748 -23125 -14510 -9489 3081 1520 -10898 -21547 -17834 -34379
8739 -34379 -56953 -82317 -72044 -72081 -90971 -87156 -79362 -91873 -99166 -88879 -73858 -78621 -78313 -76982
8725 -76982 -43748 -28067 -43830 -46446 -33094 -42230 -44196 -45509 -13863 12312 26180 29542 11399
8712 11399 1578 -12974 -32624 -52686 -70667 -66517 -48278 -33273 -2852 12136 23160 18441
8700 18441 7711 364 -20985 -42595 -32926 -24839 -27575 -22283 -34765 -53922 -36115 -28986 -38643
8687 -38643 -33322 -27622 -29647 -34927 -35458 -47495 -41873 -26888 -46159 -61561 -72074 -61067 -52148
8674 -52148 -22228 -15731 -19294 -34521 -61268 -51652 -35878 -32492 -58733 -75539 -91845 -76399 -52870
8661 -52870 -79409 -82727 -67802 -50893 -46537 -56205 -71004 -59718 -37194 -19665 -29104 -40478 -37257
8648 -37257 -48488 -44177 -29118 -44827 -41219 -39492 -61868 -47303 -43622 -54999 -59607 -78906 -84924
8635 -84924 -69018 -64683 -69822 -67007 -77063 -75943 -56467 -47147 -56246 -67605 -95105 -127328 -110468
8622 -110468 -89980 -92846 -77799 -35466 -1619 8262 22259 19081 5340 -8576 -12993 -18618 -6345
8609 -6345 729 1183 -20611 -21911 -18627 -41064 -51845 -61690 -56458 -31302 -35319 -55447 -56354 -48770
8595 -48770 -57897 -64056 -68268 -69047 -59684 -58475 -55748 -30432 -30097 -23891 -15661 -16144 5195 -4030 3921
8580 3921 6730 -28811 -32952 -38810 -12528 8741 17866 26813 26369 15360 21872 57335 59175 39296
8566 39296 42907 68145 68632 91282 87936 58823 40132 19596 9646 579 -5024 -16082 -19618
8553 -19618 -4623 9707 18446 -6623 -14516 -28651 -23867 -32466 -17229 -5564 -871 25774 33837
8540 33837 21879 2466 -6844 10552 0 -26888 -47885 -24141 -23971 -32726 -34788 -37066 -27113
8527 -27113 -25366 -22913 -10455 -13065 -4087 13513 6607 -14681 -30884 -20992 -22370 -33082 -16717
8514 -16717 -15747 -44343 -44155 -14764 -18783 -38203 -28121 -34877 -42936 -36561 -26221 -38299 -38124 -12397
8500 -12397 -5002 -4320 2114 -13902 -30520 -36472 -36591 -53784 -58887 -57576 -75097 -79482 -63253 -22606
8486 -22606 -16848 -37391 -70273 -48902 -33687 -52217 -51059 -47233 -47353 -31718 -6599 -24831 -38667
8473 -38667 -32167 -23296 -39659 -52624 -91838 -87123 -60818 -69323 -78639 -47434 -25211 -44286 -69858
8460 -69858 -71692 -52586 -49995 -59663 -59484 -40300 -21438 -9723 14397 18308 12950 -105 -19808
8447 -19808 -31868 -31206 -39017 -12379 -9975 -24156 -13221 -27267 -30880 -35966 -51968 -85156 -66399
8434 -66399 -25162 -34693 -8670 -4409 -5236 -15998 -41117 -44723 -47267 -42152 -42556 -38485 -35399 -38771
8420 -38771 -40412 -64644 -60680 -47445 -62591 -78520 -82533 -77529 -61116 -39241 -20720 -14264 -7850
8407 -7850 -15897 -42076 -45777 -47562 -22090 -12929 -23062 -65499 -95448 -108888 -80051 -49799 -47535
8394 -47535 -33243 -43333 -35176 -31206 -29484 -36344 -54490 -48290 -44345 -53333 -61021 -46355 -29345
8381 -29345 -25913 -36377 -45998 -70137 -63976 -73379 -69683 -86050 -51014 -35307 -24869 -25239 -24630 -11109
8367 -11109 -22080 -12445 2115 1370 -10473 -10910 -15216 -6723 20080 31584 17975 -3162 -11420
8354 -11420 -9453 -12971 -20388 -10196 -7772 -28694 -51315 -36024 -26011 -65801 -80088 -91964 -82827
8341 -82827 -76468 -68371 -99496 -99578 -63195 -33461 -23833 -33630 -55432 -39988 5725 17708 9394
8328 9394 -7079 -15421 -21889 -34559 -8218 -13666 -4515 10654 6022 25107 27111 -3380 -16856
8315 -16856 12636 -13133 355 -5109 -23753 -27914 -30234 -14557 -27727 -36528 -55553 -35736 -4465
8302 -4465 -31591 -66756 -68179 -87228 -100064 -102009 -76908 -33596 -1739 -12083 -33263 -31867 -20855
8289 -20855 -25477 -31931 -36218 -53465 -64987 -53839 -22764 -5003 -25395 -28741 -32523 -31352 -42678
8276 -42678 -47803 -22416 1391 -15754 -10432 -2697 6502 -119 -747 6765 -6606 -14043 -28137 -19368
8262 -19368 -31165 -44383 -56774 -35434 -33599 -20892 -31150 -20108 -18399 -19450 -8274 -6509 -13328
8249 -13328 -32427 -57223 -59127 -32086 -14035 4480 25775 5350 8522 34999 52311 48223
8237 48223 25710 487 -5370 -35961 -48588 -56843 -53479 -30449 -20898 -11699 -2800 -4759 -2816
8224 -2816 -4180 -9943 -15477 -14777 -31540 -36660 -12874 1057 -10315 -3903 -18599 -32972 -34327 -29618
8210 -29618 -43337 -42831 -22565 -20051 -41722 -51570 -64023 -86906 -78370 -23478 -5706 -17714 7096
8197 7096 10154 -316 -10030 -38280 -63525 -52703 -65119 -68621 -48462 -17782 5376 4470 -14044
8184 -14044 -21347 -19784 -22371 -11660 14040 11546 26885 22284 14177 10685 -7022 -31978 -10408
8171 -10408 15025 708 -7149 8332 5893 17877 37215 50975 71470 43988 25124 24853 41538
8158 41538 28148 35237 21239 1622 27482 57497 26579 -5113 -32678 -49557 -46819 -28551
8146 -28551 -4477 -5620 -12199 -20201 -14280 13588 38572 60970 46873 19175 -15109 -14277 -12262
8133 -12262 -15613 -11948 7039 27459 31026 47756 40918 67614 65142 43584 20852 18834 823
8120 823 -8381 -30694 -14273 24445 36096 31708 5722 -18343 -12078 -24913 -26195 -10775 -124
8107 -124 -3942 -9691 -27139 -6769 41664 56154 43355 24574 25841 16870 27491 38234 25635
8094 25635 3306 -3841 -9616 -15352 -31774 -22214 -22665 -33641 -33432 -24494 -22382 -22915 -30886 1563
8080 1563 11002 5681 -7377 -27930 -36635 -32819 -24699 -41609 -43019 -50446 -44115 -14435 -4485 -24533
8066 -24533 -43260 -41514 -42921 -38385 -27283 -24436 -20527 -21052 -17781 -21676 -58191 -40641 -11282 14925
8052 14925 17765 24835 21379 -19113 -16416 26592 34274 15888 -17233 -48865 -54459 -54614 -30681
8039 -30681 -15581 -11868 -17481 -15107 7631 -8686 -49307 -33763 -6405 -26231 -32650 -50478 -57394
8026 -57394 -52200 -59847 -50799 -42092 -22581 651 12716 33627 7378 14533 12846 5167 18783
8013 18783 30387 42042 31792 18922 12921 21667 14256 7010 -39937 -67147 -54370 -42173 -20799
8000 -20799 -3785 -12002 -20825 -21638 2150 2913 7189 29507 21467 7786 8711 15244 12630 17195
7986 17195 26330 30365 31669 8406 -8436 -20163 -23391 -10520 28732 86268 113147 113399 95215
7973 95215 55337 45162 33732 45300 39944 8563 -11829 -28455 -17755 -2774 -2908 19603
7961 19603 20529 11490 5493 -27390 -20272 3552 21772 36480 37613 21563 5984 5142 16764
7948 16764 33230 13433 1502 15697 4958 5345 14800 18319 25566 34586 29261 13103 -29629
7935 -29629 -41542 -13526 27688 36713 18008 26120 43770 52752 62309 56026 53769 92103 107930
7922 107930 98314 78756 66692 45740 50254 39678 45393 42309 35999 41046 48499 72809 76331
7909 76331 61028 55130 37818 15584 -2913 7371 3197 -6312 14431 15289 12983 21235 22201 12436
7895 12436 33508 45102 34673 24278 22224 13829 19247 18380 24094 19079 22517 11219 3790 22847
7881 22847 74870 93075 97122 79021 65002 18116 -14756 -16297 -30844 -37194 -25839 -24605 -27126
7868 -27126 -33104 -36125 -31864 -13876 -6143 14005 48499 44030 52361 75091 65109 47018 39735
7855 39735 38034 20290 27784 32364 34115 7920 17768 11741 7583 10838 5220 8996 27902 24152
7841 24152 3779 -10224 -20707 -31019 -28799 -41928 -23679 -5537 19590 17926 36823 32342
7829 32342 10811 -5705 -9751 12117 2942 19082 9534 -585 -4744 19484 35124 28961 37070
7816 37070 33199 33894 4507 -23427 -16110 -13566 -3110 -13009 4988 13339 -12728 -34359 -32634
7803 -32634 -17920 -13077 -11892 -10215 -14895 -14936 -23218 -17337 -24883 -35591 -61183 -57132 -26575 -12428
7789 -12428 -5994 4096 -10062 -25944 -34313 -36037 -29109 -55422 -59424 -70476 -62348 -71504 -78095
7776 -78095 -50783 -36683 -39152 -11824 7252 7538 -16526 -32228 -25373 -28612 -16693 -17715 -13834
7763 -13834 5960 -5848 -35582 -32801 -31334 -26381 -7034 -11646 8585 22236 32818 33640 21427
7750 21427 -3272 -910 18028 9118 -5395 7767 -3645 -3465 1821 619 9108 28134 48371
7737 48371 44492 33194 18475 11084 4378 7443 9709 10435 27669 43401 44555 36075 -642 -12074
7723 -12074 -12885 -16135 -6042 -17651 -36988 -38183 -25218 -37335 -20663 -17298 -38257 -59854 -60524
7710 -60524 -44664 6052 23889 -25248 -55953 -64381 -44223 -31665 -48576 -53246 -28609 -7626
7698 -7626 8454 -348 -20767 -38877 -30058 -13315 4699 -5342 14062 37925 43533 37047 5535
7685 5535 -29200 -7119 20032 7462 -15384 -7375 -32636 -48525 -57656 -33585 -25834 -5118 9982
7672 9982 -8780 -3376 -12516 -54216 -47309 -42080 -22906 -4115 -6159 -27661 -12765 -7770 -39972
7659 -39972 -54876 -49290 -26767 -3448 -19291 -31424 -47663 -42078 -20304 -11805 -9937 17294 20423
7646 20423 7059 -4658 -12117 -13046 -17559 -24209 -27455 -55504 -59225 -51717 -19698 16449 -3272
7633 -3272 -14386 -11330 5387 -1570 8344 7138 -5593 -22332 -27690 -34726 -48858 -53697 -34670
7620 -34670 -34280 -9735 -1657 -11172 -31510 -42348 -2879 -12041 -39753 -63423 -49811 -27276 -12157
7607 -12157 -20073 -32275 -31099 -10142 28979 30540 17994 -5594 -2975 4129 -17899 -30921 -19372
7594 -19372 -1027 -22058 -44816 -38427 -17009 -15424 -7543 -21842 -20963 -37229 -60891 -50355 -48838
7581 -48838 -43957 -33792 -9958 -930 12542 33242 48013 44878 12202 -9942 -2517 -8983 12598
7568 12598 6987 -20496 -9496 -7087 -24545 -21610 -21980 -20915 -26574 -22824 -3659 -1323 -1960 -5888
7554 -5888 21541 23601 11359 9335 -11461 -26402 -17123 -22943 -40093 -14964 -4439 -12878 -13975
7541 -13975 1312 -23461 -53162 -52813 -54504 -31739 -21739 -15320 -14989 -8096 -1607 -21508 -22348 -1418
7527 -1418 -10118 -25077 -16957 -2935 -7410 -23927 -38131 -24323 -20450 -23843 -9438 -3446 6366
7514 6366 3704 -789 -14929 -8561 -20296 -7635 5516 -4461 22566 38375 38158 18684 -15215
7501 -15215 1677 15254 3336 2850 -5477 9030 17739 -13661 -29748 -34631 -5367 -12542 -9233
7488 -9233 -20513 -11482 -9428 -22661 9955 35591 56317 72127 66673 63509 57756 19913 -19687
7475 -19687 -30283 -12228 18401 2716 -14075 -11122 -12219 -11899 421 -5271 -20777 -14229 -8027
7462 -8027 7230 15436 14046 31257 17936 26912 22141 6043 -24055 -6716 12178 1004 1558
7449 1558 2841 -4643 9272 8051 13511 26515 653 8316 24765 11988 -4519 3285 -17477
7436 -17477 -36798 -34574 -31794 -26083 -22058 -12048 -10827 6833 7565 16591 27325 27806 28175 19251
7422 19251 -8859 -13139 5628 6526 7636 -701 -14987 -17180 -27346 -35886 -65491 -52380 -44883
7409 -44883 -12413 6932 -2228 -16307 -14162 -13436 -17379 -5446 18874 19092 -722 -2247 -5638 -16423
7395 -16423 -25200 -16871 -15329 -15490 -11873 -10733 -31255 -50648 -34225 -42679 -43785 -25799 -38703 -41698
7381 -41698 -37663 -21653 -21710 -7216 -6180 2801 16805 6529 -19161 -30463 -17269 -9441 -252
7368 -252 -3359 -30052 -39777 -36219 -7960 14155 16049 6660 30078 29641 -6770 -25758 -26051 -22988
7354 -22988 -21272 -1209 5486 14884 -13880 -24092 -30689 -53478 -52762 -29514 6677 401 -18938
7341 -18938 -16611 -459 -69 -8448 -15524 -6271 -27911 -23958 -2282 4940 -468 -9248 -24366 -13515
7327 -13515 -1408 -2617 -4882 -12918 -13249 -21102 -15023 -7996 -5103 -34125 -14682 -14706 -31072 -30826 -8887
7312 -8887 -2865 3563 -10787 -13693 -49727 -61621 -36199 -12283 -13660 -3975 18024 19710 -8181
7299 -8181 -18745 -58553 -66998 -23259 4150 24281 42595 27485 -17277 -32284 -30223 -16455
7287 -16455 -13395 -1350 18947 24962 10150 -13618 -33352 -38803 -44128 -39576 -24157 -3098 15571
7274 15571 7347 -4023 8158 6987 18657 52447 28108 -8209 -20557 -17291 -6571 2862 -20704
7261 -20704 -24269 -13037 -29107 -35800 -26079 -38982 -53357 -58704 -76380 -63789 -47399 -19483 -9132
7248 -9132 -32095 -59795 -78560 -68396 -73481 -74721 -58022 -40199 -19983 4446 -6309 -33398
7236 -33398 -6894 -6066 -25815 -6430 -3430 725 15497 -2062 -5122 1649 15243 8518 -4073
7223 -4073 -23033 -13443 -1508 12172 7202 20092 14153 24194 18768 1957 -23124 -29185 -41767
7210 -41767 -29892 -31354 -25636 -30641 -38952 -46389 -56233 -69213 -53326 -24316 -34683 -56066 -65998
7197 -65998 -66246 -79278 -67906 -58541 -41916 -30433 2293 5926 -14969 -14928 -11541 -17570 -7585 -11961
7183 -11961 4354 21043 37032 44655 -5028 -18374 -18271 -4483 22055 1761 -11238 11652
7171 11652 -6658 -8387 9479 3139 -11172 -13064 -19854 -28492 -23227 -3629 8960 22391 25419
7158 25419 11713 -8727 -23001 -26092 -21772 -13100 16489 38576 43855 41812 21025 27802 15961
7145 15961 -8510 -5878 -19714 2267 -3635 -23523 -29071 -7960 7832 19319 27548 326 -10816
7132 -10816 -12138 -21014 -19178 4770 6546 -11207 2043 23327 27752 4712 -25468 -54990 -65534
7119 -65534 -59025 -53819 -50934 -27180 760 20222 19771 12655 11375 5300 2368 -4210 1287 22450
7105 22450 38022 9542 -17278 -20353 -17845 -15978 -13744 -26739 -34453 -80082 -85813 -80044 -47791
7092 -47791 -31628 -41370 -52348 -33866 -20219 -11145 -8153 -19900 2673 34276 29179 23159 36800
7079 36800 20501 20135 12468 -18130 -7469 -3584 20183 40846 42664 12286 3079 8565 -4988
7066 -4988 7113 12607 -4461 -5679 -12694 -11885 -17887 -44690 -29945 -14778 -15779 2670 -6695 -17661
7052 -17661 -40464 -58452 -59904 -69358 -94087 -98898 -83097 -51405 -39177 -48003 -52268 -51854 -46522
7039 -46522 -53195 -53211 -40209 -15995 13348 4913 14598 23956 -4500 -13678 -11523 2673 -12394 -19008
7025 -19008 -12318 -24791 -30564 -23348 -17642 3838 -536 -5670 -11557 -17220 -18015 -9547 -7229 -6211
7011 -6211 1566 1180 2664 -20423 -15586 18903 -15246 -39177 -24156 -20678 18205 41711 32364
6998 32364 26345 5502 -3890 -8956 19221 -2633 -1619 7579 26766 7259 -3559 -22218 -9982
6985 -9982 8143 19423 12814 1912 -9078 17805 35178 1379 -11545 -879 -1121 -12499 -18575
6972 -18575 -3374 -18130 -31847 -37861 -42591 -35829 -22911 -1829 8352 24101 15851 5898 -3074
6959 -3074 1024 7896 33260 42420 -4415 -15436 17132 32544 7017 -10821 -24546 -31364 -33807
6946 -33807 -27173 4477 10053 1934 3396 5752 -13181 6714 2718 -18152 -7564 -23594 -30603
6933 -30603 -13141 -7806 578 1742 15221 18406 -15210 -20158 327 24786 9256 -9294 -6532
6920 -6532 -10105 -5709 -17849 -22210 -23780 -4237 8723 11511 32479 25817 2791 4315 6296 27191
6906 27191 37870 16353 17742 5379 -4659 -13824 -18381 -10325 5848 17428 8933 -7274 -28771
6893 -28771 -40201 -64720 -59992 -14345 9492 11845 2565 6913 14677 793 -18019 -21786 4255
6880 4255 25545 37692 32723 5110 -20648 -13835 4063 6829 11353 -5249 5451 -16232 -24016
6867 -24016 -17868 -12267 -2246 -28764 -5434 17680 35742 19589 18653 14182 22768 16874 15931 27611
6853 27611 22783 16864 10207 -12621 -38337 -30350 -7204 11994 5427 -8904 -13970 -18775 7645
6840 7645 14469 11978 25282 54374 32517 -14751 -25390 -25677 -24702 -28657 -25932 -10349 -19186 -29897
6826 -29897 -48526 -36345 -27872 -18272 3220 20063 46808 36804 5089 -17466 -20988 11280
6814 11280 3815 -7347 6690 7532 -4064 9460 24469 30191 40549 1335 -30885 -27838 -10047
6801 -10047 14449 5724 6153 22826 2593 -4353 -21302 -29882 -14343 -9543 -8740 -6378 -6753 -8808
6787 -8808 -9027 1875 17204 -377 8652 -953 -1910 26841 26201 16697 19148 22481 14288 14547 33877
6772 33877 47672 20892 17525 17438 15764 27056 50903 37275 41133 45975 30331 4648 -13292
6759 -13292 -13427 1747 11979 28554 19266 -8338 -35544 -29323 12728 31531 19477 12900 26353
6746 26353 28879 25205 37983 54324 63260 39304 34706 40667 60346 44695 34601 45415 50293
6733 50293 59992 31732 12285 12689 11529 22147 22504 -4885 -8387 14357 26549 34966 14026
6720 14026 19674 34541 21403 12547 14660 11528 -885 -2805 390 5780 10759 -652 -10589 -21146
6706 -21146 -32113 -15895 -5313 -13479 -25010 -29935 -31522 -26345 -18297 -13679 -599 1037 5472
6693 5472 -20387 -18476 11902 16721 37523 46321 35082 34084 17552 -2950 -8526 -38160 -50333
6680 -50333 -25868 2718 -6161 -20471 -32031 -27540 -13028 -8211 -25028 -33778 -26732 -29470 -26362
6667 -26362 -11801 -23412 -23927 -22781 -43568 -39603 -28103 -20112 -10607 996 13976 16541 32766
6654 32766 33262 15772 1078 6306 36528 37727 27243 9955 -7765 -4922 14323 23533 24676
6641 24676 7084 -11504 -13670 -24335 -2190 9967 5804 7473 25830 10043 13921 -9087 -25940
6628 -25940 -6211 21786 39088 42476 33793 31003 49228 53995 56790 68585 61709 25708 4027
6615 4027 2461 7208 22579 20316 21384 1186 -3372 15325 7969 -452 6682 6372 20444 11414
6601 11414 -9074 13681 31291 3843 1720 17357 28939 35089 36909 47753 27809 6511
6589 6511 -10036 15793 17824 23041 22466 34831 62908 49724 36089 25799 2284 -505 -10416
6576 -10416 -6288 6061 6222 33008 51958 37704 24820 7816 2347 -657 -10354 -19230 -29005
6563 -29005 -64235 -68400 -48570 -37822 -48924 -36724 -38913 -51291 -42164 -61406 -44888 -19801
6551 -19801 -1958 -8945 1424 20533 27919 2775 -5495 -21195 -49206 -39844 -13930 -4858 -10893
6538 -10893 -28159 -25163 -36854 -26381 10775 29989 12591 -18891 -29341 -9137 -4612 -25120
6526 -25120 -37326 -49141 -39864 -36521 -35934 -23152 -25674 -13099 904 6654 -12733 -27061 -7032
6513 -7032 9561 21453 16605 2166 57 -20305 -24836 -25068 -6639 -11317 -10108 -8893 -16489 4416
6499 4416 -15076 -32880 -38656 -32718 -6459 -6705 -12711 -15825 -34263 -12436 -3165 2190 -8206 -20838
6485 -20838 -17863 -20647 -1595 23371 12079 15248 25106 24847 7207 -2425 -7476 -18108 -33371
6472 -33371 -32402 -22786 -18636 10125 26635 8321 -17021 -21581 -12820 34207 54792 36394 19174
6459 19174 5206 11797 4199 -9215 -20693 -17631 -3360 -950 8349 18629 444 5065 14921
6446 14921 13235 -5714 32282 63577 28251 3526 -1710 21756 45525 36696 -17426 -27929
6434 -27929 -13875 -5156 -239 -132 5639 1943 753 13978 23596 15078 -1356 13105 37095 26740
6420 26740 17576 13270 18053 16445 9458 -18621 -17948 -1711 -12535 -36219 -29840 -340 5211 26958
6406 26958 15795 -4807 19205 47897 47642 31426 17892 8094 6921 12694 28172 18232 4213
6393 4213 34077 45546 38067 30760 34400 17643 -3581 -28948 -23424 -190 13185 30657 50938
6380 50938 50574 30644 50433 42814 13265 24734 38556 9798 -20004 -20527 1311 3785 10150
6367 10150 7446 -14661 -18514 -10076 8480 -15242 -16739 -1559 -5857 20471 20513 5816 -18435
6354 -18435 -19189 -3862 -35777 -54468 -9352 -3954 -6279 18223 25118 20544 29255 10939 -11676
6341 -11676 -13314 -30807 -25416 -30953 -34077 -24701 -30390 -4629 -9064 -9354 9131 20847 42155 46992
6327 46992 50468 64831 56921 36996 18472 16100 25309 4434 5527 -7743 4869 -6630 2126
6314 2126 6824 -7479 -12237 -10331 -3662 -7747 3564 22387 43577 46325 48619 38286 58158
6301 58158 32421 14193 10991 8267 -12575 5904 28878 18671 10776 5136 2328 454 10778
6288 10778 5332 6446 -4573 -11615 -15798 -7944 -7679 -4751 1984 -9112 -16934 -8911 -1048 18778
6274 18778 1705 -22745 -46454 -38439 -21341 -11126 -1571 -10854 -11269 2870 7059 11484 -8587
6261 -8587 -9109 -2157 12000 28100 1939 -11886 -9922 -4958 -8160 23066 38051 38427 17357 20171
6247 20171 25128 25944 45145 27028 -1488 17191 11987 -12190 -31238 -48408 -34199 -34599 -35170
6234 -35170 -19331 -7730 -7072 -10978 -3082 -17947 27479 29680 9818 10248 -6949 -25005 -10942
6221 -10942 -5106 -10872 -42218 -29082 -20035 -25570 -18176 1170 17862 25104 34553 30888 17165
6208 17165 731 -5078 13467 16773 8290 226 11741 7045 22271 36611 47080 11987 13548
6195 13548 17849 8719 4245 -34187 -25892 6976 -4208 -24306 -20006 -7100 7386 29367 11039
6182 11039 -4627 23343 33770 44304 54356 39293 14092 -28152 -23014 -32819 -23933 -48846
6170 -48846 -64387 -10158 9818 -3038 -47292 -42653 -34388 -11682 7846 11776 -2332 19865
6158 19865 23276 5951 -4298 -2764 3315 -6682 -12929 -32832 -20768 -39511 -47207 -26467 -11236
6145 -11236 -12557 18472 -2128 -40254 -44692 -41673 -40229 -36753 -4818 -14831 -30133 -23060 -21954
6132 -21954 -47638 -44931 -27970 -21420 -28308 -29465 -11730 2519 -14120 -30396 -17726 -7187 -7683
6119 -7683 -311 698 16679 10460 -5884 3371 24605 28305 18496 8806 11447 4621 7125 35269
6105 35269 40774 24427 -92 -24373 -47456 -24096 10061 6104 -4911 -1226 -5510 -10631 -1751
6092 -1751 9685 20846 -7541 -16833 -23386 -49306 -72166 -43487 -11117 -1819 -13220 -8635 -22646
6079 -22646 -3016 -2889 -1863 9146 9217 5606 -6252 2725 25808 41688 36918 13716 7024 27853
6065 27853 32824 23146 28753 27569 22554 1855 -14764 -22808 7045 30934 20556 37107 33600
6052 33600 23917 2579 -20651 -21552 -23700 -34806 -27231 -19079 -12934 10532 18120 13631 7537 28910
6038 28910 15402 1881 -7414 53 -4565 -16972 -10584 7583 8625 13247 7764 6866 -8963 -1130
6024 -1130 -1593 -26023 -44264 -47417 -58943 -41615 -38153 -37401 -45592 -26949 1924 19489 26139 27781
6010 27781 21077 -9140 -24458 -22691 -25622 -10162 9919 9160 7777 -647 -14343 -27703 -4242
5997 -4242 7566 31754 43307 38048 51765 39970 21486 15399 5383 8256 36 -18100 -37506
5984 -37506 -7793 30077 44865 24131 34621 30912 25441 14599 4324 13963 16795 17903 11886
5971 11886 10063 -9390 -4068 -7663 -12221 -3045 -2206 14 -13483 -46613 -35397 -10538 -2391 1218
5957 1218 8769 -12616 -35612 -31289 -39250 -51136 -19500 -3807 2347 12317 2346 -35550 -42320
5944 -42320 -48501 -47334 -36062 -17245 -3696 16476 6112 240 -9085 -3083 30703 44515 33440
5931 33440 8349 -31225 -35935 -26832 -27425 -21149 -16684 -8975 -5283 7996 4390 3322 -30137 -62646
5917 -62646 -40106 827 4978 -19752 -22098 -32051 -22818 -20440 -31984 -52769 -45473 -20765 -6362
5904 -6362 28885 27950 1801 -2740 -16966 -10769 -15195 -915 13684 14949 -1693 -28978 -21547
5891 -21547 -16130 -17726 -36270 -44963 -41232 -57168 -47268 -41908 -37670 -13361 16920 17217 20375 13604
5877 13604 9362 15743 3598 -13240 -23454 18877 20949 6617 16396 24989 28172 19430 31393
5864 31393 27182 -8379 -32482 -29623 -13167 11212 17022 26784 -31 -13922 -4329 16308 17336
5851 17336 21509 32777 17705 12411 8185 12594 446 5414 -1706 20034 40300 16089 11787
5838 11787 -801 1383 6032 18208 49045 33449 13722 -1442 -2382 -5863 -10315 -23313 -21000
5825 -21000 -11610 -12191 -21589 3754 9543 6268 12159 -13770 -20164 -23975 11874 19889 655 -6991
5811 -6991 -12689 -36453 -62613 -73114 -46150 -29014 -16730 -24671 -24536 -6868 8994 -5529 -13755
5798 -13755 -15319 -24770 -22358 -14344 -21958 -14679 -13001 -9313 -24141 -605 21133 4793 -8939
5785 -8939 -11028 -16306 -14504 -16157 -19414 -9008 4820 18809 13437 10395 13024 3093 5173 6408
5771 6408 14982 12685 12618 22308 25073 31798 21615 6227 16135 24368 15479 -5222 6518 18204
5757 18204 12083 9940 -3957 -16373 -17016 -11274 13670 13884 -5428 -11860 -7419 11287 -7417 -18891
5743 -18891 1703 1959 -208 661 11417 13841 -5148 12094 5636 10335 13815 -682 3331 40046
5729 40046 61647 43664 38326 37635 38605 54540 15484 -2345 -7634 -13379 4671 -3081 -7529 -6691
5715 -6691 -29303 -38335 -12049 -10254 -2175 -24020 -14466 19443 39238 11523 -9887 11518 521
5702 521 -13321 -8802 7184 21507 27796 19511 -1218 -7905 8879 -6626 -5788 -6129 10628 16440
5688 16440 -8664 -10031 -14243 -40749 -35279 -25514 -5357 -36 -18347 -49197 -36487 -3054 1870
5675 1870 -9616 -16947 -1066 -5005 -15488 -28136 -21292 -14800 24421 40552 32036 21676 7211
5662 7211 -2490 -26538 -16616 4893 14165 30844 8388 -7416 -31865 -44938 -29520 -1001 -7559
5649 -7559 1546 -10119 -45509 -46120 -26350 -40438 -27645 11443 25271 11733 2725 1769 -21917
5636 -21917 -52047 -31188 -25609 -32834 -27029 -32619 -17233 2503 18025 -4769 -6478 -1838 11079
5623 11079 28560 41557 65120 50307 31509 1765 -7598 3928 26149 35248 11073 12265
5611 12265 9217 13364 23403 8799 12156 1142 21222 55811 50705 12657 -13007 -13602 -2359
5598 -2359 8279 1915 -13987 -24658 -11496 -16041 -11172 -1774 11283 14097 -1085 -1752 2844 -10208
5584 -10208 -24335 -7492 17934 14015 -2617 3923 38944 44536 30155 16716 8479 4577 -1356
5571 -1356 -10605 -34527 -33380 -26729 -2356 3922 5701 5798 -15183 8751 25845 33959 32236 8049
5557 8049 -10990 -15886 -16650 -3558 25611 13296 -6515 -29373 -39198 -30007 1917 -4144 22540
5544 22540 24673 23269 17271 854 -7396 -1344 -4061 23316 20116 23710 11919 13254 20380 8984
5530 8984 3133 26026 29098 21381 23509 28487 35720 26754 15767 10374 -13396 -33730 -37428 -37053
5516 -37053 -32155 -13097 2170 14554 19589 17090 6167 4249 2060 543 2387 14542 30251
5503 30251 16869 221 -6446 1385 -11906 -56327 -74413 -47662 -28918 -33813 -41994 -37508 -25912
5490 -25912 -19986 -5930 6741 21517 18468 3081 -14000 12286 40654 54822 28757 26416
5478 26416 -10281 -39174 -7269 20304 47603 30092 20223 3466 -4544 -16136 -934 19387
5466 19387 8521 -13944 -949 21201 6993 -9897 -34644 -37396 -25226 -5893 6849 24932
5454 24932 14551 -6967 4224 2635 -23856 1606 12361 4460 898 -2799 8329 19379 37984
5441 37984 48664 38091 3832 -23219 5737 36364 62973 73201 51736 28936 14608 19324
5429 19324 34613 41386 23407 2167 -7506 25318 50125 23692 19811 2526 -24603 -38683
5417 -38683 -13051 -5844 -637 5310 8596 8908 -11626 -16710 23290 33148 28569 37626 19167 24010
5403 24010 40791 34002 17009 -98 -3443 -5242 -2053 11038 24567 27251 13135 3314 2151
5390 2151 9142 30484 33499 32793 24801 -26358 -31728 -24078 -17850 -22021 -39 -4880 13778 23225
5376 23225 24167 42294 23625 19037 5668 4368 4679 -6206 11680 11251 14208 -539 -49778 -63116
5362 -63116 -46101 -37401 -23834 -11178 -3986 5616 19756 2290 -16694 -16968 -16082 -389 -4871
5349 -4871 9475 22662 29001 16370 7656 3809 18637 24952 -13906 -45385 -24253 12356 2042
5336 2042 -18147 -8896 26706 48780 24117 -1950 10158 -2595 -12042 -12519 -17381 -2292 -16898
5323 -16898 -12833 -12937 -19961 -3268 38150 42505 12170 16478 12584 -19079 -39415 -37717 -11862
5310 -11862 2361 11144 1115 8648 21495 25162 -1383 -22036 -5142 -7685 -30891 -20257 -19031
5297 -19031 -13614 729 30667 59084 39681 7980 6114 2468 1436 6668 15855 30023 38453
5284 38453 45214 39020 14311 -16991 -41437 -33537 -9925 -727 -6413 584 -9827 5429 5115
5271 5115 -8669 -9311 5733 27939 43938 44019 44820 34517 20848 24781 24460 28184 24318 42852
5257 42852 54890 35431 25668 21776 10373 -4473 -33809 -32302 108 12600 7590 7264 17844
5244 17844 13426 4470 10762 11181 30046 42610 -5178 -26220 -10034 -15402 -38409 -32106 -16386
5231 -16386 -4154 5115 28551 44012 8185 -5286 -14170 3587 -6566 -17394 -35861 -51751
5219 -51751 -34528 -11107 259 7369 10139 12560 10997 -1831 -18872 -21294 -11104 -13578 11508
5206 11508 3900 -1801 -18462 -12337 -6355 6938 16056 19149 6918 -10726 -16108 -40469 -71169
5193 -71169 -51149 -25919 -8205 2798 2299 13244 13706 16126 13816 6934 -3959 9481 5615
5180 5615 4425 40012 48631 22271 -12751 -16723 -8278 -5892 -14535 -22626 -31033 -38928 -17011 -11443
5166 -11443 -6921 2555 22143 41977 43191 34371 31190 14703 -14837 -29977 3292 17386 43683
5153 43683 52963 28339 13180 -6748 -4088 -10918 -17702 -3948 18234 34318 1882 -1623 11553
5140 11553 -282 -6269 -10964 11385 44425 29445 -4604 3998 44533 38944 -2185 2632 36423
5127 36423 39933 21098 -8860 -31960 -4592 504 11561 39058 40656 49983 39625 18806 26686
5114 26686 10299 17319 37953 32823 36631 37302 4391 3481 11935 23728 18884 15010 22155 32826
5100 32826 37639 936 -34332 -40473 -27604 -23557 -15666 18076 40740 56663 24162 -12187 11419
5087 11419 41495 58762 54866 44077 30912 32158 46678 55219 44840 28096 1793 4760 10371
5074 10371 802 -6614 -13349 -30905 -56118 -41349 -19982 -37161 -34426 -14388 8363 12007 -5833
5061 -5833 -8374 14453 4458 19794 32100 10715 -11911 6599 4711 -6431 -25108 -18945 -20903
5048 -20903 -5214 -7211 -2414 9198 6553 -17747 -22876 -8934 -19849 -4783 10603 -7006 -451
5035 -451 -20907 -38290 -21167 -1479 3663 10049 16853 18607 12941 6796 -7822 -12844 -5112 10131
5021 10131 15289 -3758 -17065 -8237 -6509 3659 14747 15069 24677 -2252 -8716 -5530 -17433
5008 -17433 -5908 2033 25605 20981 11208 6830 14205 18635 23773 33972 39569 34735 1139 -2669
4994 -2669 -9030 300 -14289 -32989 -23001 -1434 -1004 -14279 -33797 -30662 -14035 20308 24751
4981 24751 10743 36141 36343 25659 29676 43094 19618 -5864 -4364 12138 34986 47976 29682
4968 29682 -11115 -16882 -14975 4522 13000 34622 24570 14386 30515 60268 81734 65979
4956 65979 31956 32312 30161 20636 25305 34215 47413 41885 37867 33895 14843 10149 12351 1680
4942 1680 -16411 -9514 2181 -18895 -34376 -17041 4767 7588 6021 -12124 -33407 -7948 30715
4929 30715 16323 1712 13970 5162 -19945 -39186 -37277 -31199 -34109 -20053 -2233 10190 11704
4916 11704 4468 -10540 -5995 26698 31219 45188 41710 20733 -16585 -37371 -49668 -25905 -18511
4903 -18511 -41118 -45608 -18767 6185 14248 31999 22164 17915 27033 31122 -2135 -29923 -22925
4890 -22925 -10005 -4598 -16057 -16187 -8935 1725 -10213 -4674 -16994 -10756 6430 10367 16431
4877 16431 17453 20921 22201 18972 9841 32146 30699 29552 21417 -2986 1361 3853 1827 27263
4863 27263 53052 32842 18906 13157 13602 -3000 -3707 19497 30709 33432 45516 48713 26588
4850 26588 32509 16045 1060 -3849 -20907 -2374 -3484 -8668 8062 -3837 -37203 -43239 -34806
4837 -34806 367 21139 17613 41168 51088 34434 14196 -7346 845 -9265 5865 7989 19254
4824 19254 24856 11056 15463 16786 -4822 -10302 1773 -5734 -3081 -13028 -10653 546 6325 12786
4810 12786 9089 9808 8832 9777 12166 18679 17905 7877 -11261 -8779 1131 9565 -18605 -37134 -5570
4795 -5570 24381 16503 9683 3450 14232 40047 36928 13157 732 9812 32749 15676 -10263
4782 -10263 -26487 -21337 9873 -3209 -1957 7773 2899 7358 8870 -25680 4239 22013 24585
4769 24585 15187 -938 -12262 -15354 -5728 42446 43291 14996 11824 2526 -11093 -4572 8754
4756 8754 -5960 -6352 -9794 -15014 -13491 -7 10520 8834 32854 21989 36772 57070 56691 44737
4742 44737 6066 8931 32917 19739 2588 3485 16978 34880 18205 421 5588 4030 6196
4729 6196 21300 13749 3420 24009 27969 39817 56616 50729 47516 7272 -18444 -13045 -20462
4716 -20462 -20260 -9110 3975 4343 27753 42816 47434 30954 24720 28812 11422 -6483 5592
4703 5592 -9125 5582 15607 16932 33966 16015 16296 14461 -986 10396 14515 13879 2897
4690 2897 20847 15905 -6350 -8572 5420 5390 -2183 -13804 -15811 11591 40159 35256 21353 5123
4676 5123 -8208 -4275 8910 13339 8569 6345 13152 -301 -21486 -2415 2326 -5282 -14055 -2531
4662 -2531 24467 12675 -13151 -15450 9778 31290 32220 19592 14204 -6658 -21044 -19677 15352
4649 15352 20783 27952 28250 6056 27082 31026 7419 1641 -15124 -20647 -36840 -31157 -13033
4636 -13033 20352 33569 24536 30630 9203 -16209 -31071 -20781 -784 7581 4831 -13973 -44306
4623 -44306 -56081 -39956 -17302 -5297 2855 22851 14821 21211 13085 -4270 11006 8842 2221
4610 2221 -16990 -11135 -5015 8521 21684 49596 37955 3984 16470 13595 9990 23186 45799
4597 45799 38969 7991 -4686 19825 38853 25914 21130 24623 43271 37664 2231 -5804 -22623
4584 -22623 -26478 -7228 14739 26095 19238 28021 36935 21841 22563 3810 -4321 6886 23693
4571 23693 17054 5136 -395 3379 3935 35542 48703 44864 43375 39398 37120 31626 28148 22241
4557 22241 26119 38423 21901 91 -1517 5550 3672 -6638 -8493 6223 393 -11168 -12690
4544 -12690 -9019 2997 19680 32745 34019 29948 13715 -1449 16941 -3929 12235 14877 4347
4531 4347 9586 2534 -2196 23069 46556 42093 18216 19572 9595 5592 16006 27118 16954
4518 16954 20505 12942 -1562 -7206 -7344 -14231 -14320 -10819 -28016 -28234 -21376 -35999 -51250 -42262 -15387
4503 -15387 10301 25079 31005 43049 36951 16506 4699 -10978 -13935 15365 17950 33608 35873
4490 35873 41656 22424 7624 15359 -12132 -36096 -45235 -21535 -2118 -6588 1478 8675 20774
4477 20774 49738 44610 26372 6985 6383 11760 -15057 -33643 -19530 18 19109 57918 58803
4464 58803 33535 28730 23235 24189 6511 -9267 -469 11650 -34725 -33297 -19244 -13654 -10686
4451 -10686 -2635 8296 2382 -2563 15360 36539 13965 -6543 -17802 -5429 9238 21545
4439 21545 19240 -3168 11718 24918 30664 42234 34430 29653 41849 30579 31725 23869 5249
4426 5249 14901 34336 24876 8016 -23664 -29275 -19054 19886 10385 6156 14510 13265 -2242
4413 -2242 -421 35727 68741 70593 48980 30538 9714 -17050 -10017 -2478 -6198 17479 53212
4400 53212 27942 7924 12405 35012 64925 71562 51991 54865 65940 58247 19254 5153 20729
4387 20729 20459 42247 43732 16663 29120 33021 -4130 -5568 -8380 -12778 14111 20824 41786
4374 41786 34101 36168 38976 13375 -20270 -16310 -18543 -29103 -33009 -35915 -13274 9311 25902
4361 25902 -21077 -48603 -42464 -25190 -2011 4383 -1820 -4157 -27834 -39806 -12864 -2440 -18908
4348 -18908 -37772 -30972 -23300 -15479 -17744 -20634 -13411 -12161 -14420 -12653 9160 4223 4539 -9991
4334 -9991 -6930 18908 36068 36147 23362 22166 20792 24973 24028 16761 14343 5006 2298 -39053 -47419
4319 -47419 -18439 -18716 -4650 -11619 -25890 -23536 -9100 5305 30893 34864 26048 44784 53051
4306 53051 51996 30823 27090 12134 -18872 -15458 23008 43630 59371 53684 55095 73987 68339
4293 68339 65257 52278 36960 44203 62435 58294 41973 24111 11246 -8180 -3380 1271 11949
4280 11949 45379 49658 10937 3914 14039 17083 31821 16790 17078 37917 26830 -8057 -12069
4267 -12069 -668 22099 17522 1683 10866 7024 -5800 -11968 -18224 -12727 -25268 -19849 -2069
4254 -2069 -8551 -12371 9262 8701 21686 11336 7385 42624 49468 7275 -18641 8220 12196
4241 12196 19358 7150 2770 15356 16989 4648 13016 11501 2510 8549 -141 -17412 -24073 -44238
4227 -44238 -47879 -48474 -52508 -27615 -1452 9664 -1827 9302 27566 29383 25227 16888 19361
4214 19361 16873 8364 -5481 -12685 -11766 -37142 -10852 3364 24373 29764 17178 -3924 -29366
4201 -29366 -9911 -6766 -13012 -6575 -4090 -18830 -22695 -12789 18149 27531 24099 50119 52050 54529
4187 54529 40125 14663 -449 -9035 -8034 -19440 -25275 -21181 -15108 -27950 -41563 -21164 -15750
4174 -15750 1222 16058 26743 21744 26511 25409 21416 11777 -21503 -32931 -39448 -54381 -55817
4161 -55817 -31751 12385 39292 39732 50941 37428 23015 38318 18167 28187 38175 43977 25569
4148 25569 41585 29844 12780 13610 13396 9486 -6958 -19246 -59416 -75001 -39478 -3759 9498
4135 9498 27518 29210 20492 20481 -2046 -12153 -10052 -934 -2766 -14039 -7385 4548 32558 15891
4121 15891 2863 4455 -39573 -24405 -2386 -1371 18333 5545 -8968 -3061 -18753 1113
4109 1113 32260 34208 27884 23884 21838 -203 -10422 -9692 10280 6369 -5991 -10600 -15180 -14772
4095 -14772 837 12152 22967 23711 26893 60738 66894 25535 11795 16859 36466 57717 36942
4082 36942 15030 17402 36086 28049 39493 51239 47804 45391 46361 29278 13809 -2565 16400
4069 16400 17094 32523 22896 -1518 -9679 -14384 3928 -5967 -25106 -24083 10151 26558 38928
4056 38928 48530 37198 30158 21454 25190 1331 13567 35957 48262 27626 13027 27025 46246
4043 46246 38277 9308 10212 28094 36103 28458 26175 10382 7474 20530 32716 37965 42425 22755
4029 22755 14266 14561 13697 19174 5826 -7840 -13510 -2597 3423 4773 8831 9925 7667 22318
4015 22318 40944 47870 35923 31618 19122 14243 38199 47485 41559 39203 31101 21683 37812
4002 37812 34693 33768 35975 57424 63890 33212 3514 33611 45862 30218 19839 16310 11097
3989 11097 -2070 -19884 -15265 -16336 4909 32965 45478 51879 33114 2717 -16051 -5335
3977 -5335 -9623 -2559 2670 -346 15300 24113 20658 -4784 -18403 -31917 -31965 -20672 -25411 -18886
3963 -18886 -7185 12649 4819 -4244 -14988 -24713 -32778 -33015 -28297 -16671 -1543 2746 1082 16983
3949 16983 22946 7783 10771 2575 -612 18521 45909 61670 62060 43591 28331 24241 21395
3936 21395 24577 22740 13469 17512 14937 33075 39129 61633 65491 54088 52794 20213 -7821
3923 -7821 -17586 -9279 -11794 9307 11445 26583 38062 34040 24114 7712 21986 40813 23032
3910 23032 -9924 -24084 9661 22792 15392 -5271 -24172 -27645 -21741 817 -9463 -19365 -13478
3897 -13478 -16654 -6169 -16033 -10690 -13574 -7543 1055 -3642 -12469 -12757 -3461 1446 15639 2220
3883 2220 17464 39266 32778 28450 27229 27085 25010 7487 -152 -18678 -22527 -34761 -40630 -33038
3869 -33038 -39809 -55068 -35006 -14687 -24316 -7515 -6557 5055 13382 -3112 8209 21489 30179
3856 30179 42967 16142 -22857 -44661 -32075 -30168 -32560 -25314 -1466 11009 11715 -219 5794
3843 5794 2014 2338 -9163 -21170 -11004 9890 14105 -3159 -22439 -13699 -15871 -9534 3964
3830 3964 6866 -8839 843 11638 25244 27822 31706 6139 993 -5244 -2459 -49571 -31663
3817 -31663 -1558 14821 21078 23910 22999 -4941 -30031 -25289 -24223 -29764 -22824 -4495 673 20488
3803 20488 33484 38864 12047 6347 -2476 10148 32320 31236 29369 57864 66860 37574 5967
3790 5967 -22909 -20014 -7460 -22349 -18714 -24599 -21325 3887 -216 -2145 19416 27452 37972
3777 37972 40654 40397 42079 49569 61538 48689 21988 5113 7537 -8935 -24962 -17580 9959
3764 9959 -8290 -18313 1614 -12682 -20412 7833 8549 30356 40110 15098 -19522 -22215 -19332
3751 -19332 -11460 12744 30900 25541 22768 48915 14948 2287 -15398 -25426 -13774 5599
3739 5599 -2461 -25072 -19179 11481 7924 -22922 -33071 -29776 -12301 840 -8457 1290 -1663
3726 -1663 -6495 -1732 -2244 3125 -1822 -9739 -27779 -49860 -35756 -8363 61 -7131 -16797 -26710
3712 -26710 -19087 -21026 -23027 -9273 353 21670 34657 25131 15836 -848 9193 38320 51460
3699 51460 21015 3961 18021 34651 41113 45244 38931 48574 40209 24111 25710 55130 69934
3686 69934 61742 46532 36082 29341 51385 75307 68334 45789 27964 54942 42625 39695 21964
3673 21964 0 3311 15441 919 -39694 -58989 -7149 11713 13237 21261 30781 -20537 -71995
3660 -71995 -54866 -16300 -20268 -53863 -36983 -31854 -24240 -35896 -12680 5466 15291 19625 5797
3647 5797 -12511 -29945 -41981 -46046 -44037 -29371 -22713 -28972 -26057 -1144 3884 7124 10698 -20300
3633 -20300 -17715 15356 31163 36916 44132 8291 -12657 -18414 178 3636 -21095 -37571 -48681
3620 -48681 -27792 -10374 -8055 -6248 -8095 -3212 -13984 -1822 1672 26140 56138 29311 -2541
3607 -2541 11640 14804 -884 -16775 -7675 13843 19724 9548 15130 20627 3443 -3896 -13253
3594 -13253 6070 40323 18295 -6512 -7237 -1997 10295 5705 7046 10674 4938 -1924 -7476 -14461
3580 -14461 -27108 -9018 1547 8676 -13398 -23570 -36358 -26999 4229 34381 46919 30248
3568 30248 26581 17860 41918 63462 58030 42447 30362 40749 19235 -1929 8877 12974 -4225
3555 -4225 -12321 15556 22140 -2130 -25309 -29500 -30669 -48222 -46500 -22850 -6476 3807 7962
3542 7962 -8011 -37557 -47045 -22083 -13779 -6380 -25447 -32296 -27844 -37924 -26576 -10890 -18337
3529 -18337 -18676 -18298 -12890 -17529 -13117 2533 -11548 -6754 17565 33430 43870 31695 -2018
3516 -2018 -10124 8352 3463 8057 -12341 -22489 -3315 -6703 -25107 -26368 -39305 -43436 -34347
3503 -34347 -18212 -15001 -16567 -7759 13924 6894 1861 8554 3948 -8336 -10004 -6123 -2906 11418
3489 11418 18817 22245 3132 -14416 -8462 -11614 2104 8653 38722 14490 -20417 -14657 -22181
3476 -22181 -32631 -27167 -37585 -39524 -36205 -29172 -13400 1512 -14974 -9779 18703 32238 35914
3463 35914 33327 28189 33191 40538 51574 26274 8795 19250 34147 37162 32192 29871 24908
3450 24908 38690 36499 14582 6768 30081 39559 20345 2624 910 4619 20457 15518 14087
3437 14087 26881 38640 31837 12673 -4281 6696 21446 24732 24325 18812 19945 18344 9450
3424 9450 20625 29114 36719 37311 31428 44129 26564 -2633 -12518 -3659 -23499 -16049 -12640 -13785
3410 -13785 -6950 18071 29640 33585 14191 1424 -6497 1909 29950 36162 7997 -7652 -1918
3397 -1918 9661 8928 4140 8389 -13626 -17470 -17326 8295 7755 -1937 -8654 -29818 -51491 -30545
3383 -30545 -17549 -18170 13321 6796 -28962 -35212 -31869 -29176 -30115 -29590 -34749 -31962 -10633 14773
3369 14773 36432 42009 32702 3062 -31528 -49755 -20589 4885 7673 -19830 -21491 8881 13944
3356 13944 4363 -35320 -61570 -12381 -6259 -2444 6347 9125 13642 21652 32391 17470 10339
3343 10339 1736 4857 18340 34675 28980 13140 -6707 -28510 -25958 9127 14854 1004 2153
3330 2153 -17135 -38151 -40342 -22729 -12909 -22797 -5994 22607 5065 -15426 -27439 -25559 -40298
3317 -40298 -32166 -9296 -3978 9737 23606 19561 8109 18112 17860 17609 30630 42890 49608
3304 49608 41639 19606 -11298 -24226 -28138 -14093 -10351 -10112 10570 18933 3547 4847 7256
3291 7256 -3456 -9376 -17398 -18953 -1675 -6721 1972 1082 -6436 -23572 -24190 888 3787 -13680
3277 -13680 -25980 -40062 -28675 -29485 -31361 -24331 -29213 -19624 -1660 17235 -3329 -6297 -7555
3264 -7555 -17731 -18092 -2685 -14365 -24731 -965 9121 19010 12853 26439 54493 64260 55418
3251 55418 16405 -25821 -50255 -33065 -22943 -10591 -31460 -35096 -20403 -47248 -30464 -17413
3239 -17413 16861 15622 21560 16064 13237 8297 7596 5532 -1419 -11378 -8210 6341 9494 9234 9764
3224 9764 7333 11932 223 -14229 11972 13512 -7358 -8598 10238 20270 35167 32316 8493
3211 8493 9624 21150 4681 -5810 9803 23960 54414 74553 67309 44290 32592 41974 25011
3198 25011 5801 2404 -8159 -10800 544 7826 -5819 6877 5236 -14537 -7606 -6742 -21937
3185 -21937 -13134 -23249 -15906 -14690 -14325 19516 30138 32092 34577 40142 34221 9247 9691 14842
3171 14842 7873 9207 -17036 -32071 -27057 -19792 -13966 -2448 8146 35938 44454 36336 18543
3158 18543 -12023 -16500 -10794 -17428 -35305 -47954 -32701 -12911 -10311 -8052 -3393 7433 13551
3145 13551 -10271 1284 2582 7543 35931 31250 26492 21332 6338 -2831 9683 10011 30248
3132 30248 47488 43811 21121 871 -39226 -50580 -37475 -14283 -4820 -5556 -17614 455 17246
3119 17246 -6213 -19098 -18771 -15167 -5493 -2256 -9623 521 10574 -4470 15732 -3303 3363
3106 3363 32208 34088 25613 855 8311 14915 50721 54843 16938 11026 12833 22272 51984 46009
3092 46009 26252 26356 15480 17495 20126 14458 19673 25631 14049 15044 19890 5916 -6250 -10564
3078 -10564 -12799 -23182 -25527 -13399 5447 18058 25032 5078 10626 27172 33793 13910 -1576
3065 -1576 -132 9277 12699 51791 73102 39424 -309 18833 26362 7144 10768 -883 -8567
3052 -8567 -10177 1036 18116 4680 -24576 -36922 -16757 2064 2347 -14912 13436 46673 36135
3039 36135 11504 -6270 -18310 -21525 -17809 -16030 -24684 -15269 31292 54708 24608 -1021 -13012
3026 -13012 -5760 6305 14876 14379 34601 27652 8776 12829 17959 30601 19585 17078 19028 10142
3012 10142 -5939 8548 22435 26639 8217 -13523 -32807 -27790 -27273 -24649 -2675 -2212 6213
2999 6213 23817 35580 30081 10257 12812 6114 583 47 -10370 -14205 -20692 -31698 -46996 -36837
2985 -36837 -25482 -40868 -21688 -16742 -33178 -35333 -26407 -17303 -12369 -11052 1888 17864 46726
2972 46726 2329 -36571 -29721 -31188 -24165 -10297 -22604 -5344 29352 40504 23398 21358 10282
2959 10282 -4627 -13244 1359 30698 45461 32086 15639 23736 14280 18560 26344 48340 53446
2946 53446 47965 32593 18977 17940 14947 26082 25179 18593 -4576 -8054 -1749 -12811 -36410
2933 -36410 -18567 -21897 -3032 35119 19834 4423 -11189 -16319 -17954 -24229 -15096 -3792 24689
2920 24689 62460 63997 36427 25880 21951 13435 2761 -5769 5236 16188 18054 1376 4843
2907 4843 39476 35410 16592 25131 29311 8102 -21330 -31349 -42185 -37780 -24122 -19708 -16980
2894 -16980 -34129 -61310 -44999 -38974 -26580 -26298 -7116 -4076 6926 2244 -8785 5414 9630
2881 9630 -5857 -12433 -28334 -34297 -35632 -24869 -15911 -20308 -14140 -11277 13049 24094 26138 16573
2867 16573 356 -28098 -26937 -23513 -25131 -28166 -26108 -48133 -31047 -11918 5277 4554 3300
2854 3300 10454 20955 34890 15409 20216 19270 7806 -8566 337 -13909 -31564 -7769 12114
2841 12114 18872 21528 31775 35877 20547 14411 3457 -6252 -935 -12671 -11717 -18387 -9411 -21474
2827 -21474 -18439 -488 11262 30768 4788 -18960 -19194 19770 11586 21642 56346 56712 23757
2814 23757 -20573 -21560 -34198 -32371 -12047 3969 19495 17778 -5097 -11675 2060 20519 53882
2801 53882 36194 17734 27780 12837 2314 7588 -1662 -7380 -11592 -11380 4359 16894 14382
2788 14382 9968 24140 -272 18623 4562 1201 -17141 -4693 -3 -16238 -27236 -30490 -39779
2775 -39779 -36722 -29825 -29957 -20052 -3309 4400 2199 11592 13869 1046 -6867 -5983 2926 3469 28289
2760 28289 49521 23754 -6343 -11329 -1705 -23905 -38090 -19660 -5922 4558 24402 41123
2748 41123 12734 7577 23609 23506 -552 -5482 -11458 -16832 9934 26509 24342 497 9212
2735 9212 6009 -11107 -5568 2214 1617 2250 11911 -8750 -8171 9071 -15979 -9658 9564 -7723
2721 -7723 -11181 -7972 12329 12434 373 -8403 -17757 1886 13655 20104 19818 26831 48373 35735
2707 35735 28210 25057 27012 22355 10381 -680 -19630 -12322 -3565 -11253 9477 29338 26593
2694 26593 12778 -5019 4398 8393 7340 22669 25735 65 -13369 -13144 3945 9621 16119
2681 16119 -4724 -23799 15024 27957 9807 31816 55067 44119 40437 50649 13679 -7168
2669 -7168 -3939 24194 39197 14742 7367 -12524 -31541 -34650 -34023 -24054 -3048 -12187 -58159
2656 -58159 -65570 -63802 -74109 -60830 -38668 -29067 -24612 -17301 -12905 21295 40566 35558 48633
2643 48633 46339 20933 6927 13459 21054 10882 -5598 -10836 -15737 11225 16735 28670 12743
2630 12743 -13835 -23928 889 2460 16111 14667 7841 5802 -839 -13948 -7426 190 7436
2617 7436 30139 9503 -20567 -5155 46637 72765 72815 46900 25529 25489 30125 33606 22616 -14931
2603 -14931 -11519 19038 59038 39464 23370 25069 20343 5539 -17345 1308 -23588 -22519 4197
2590 4197 222 -20634 -37415 -44846 -22651 7535 12555 -17334 -29208 -28360 -210 31935 43482
2577 43482 38966 16326 21646 24589 18651 -9067 -33807 -22410 16823 30241 43435 46643 50472
2564 50472 28691 9035 12155 11695 22351 32501 60982 76300 51887 29287 28184 46651 38806
2551 38806 18401 25950 25175 10287 2489 5762 -9119 -16583 -17876 -31579 -10224 6793 7059 12273
2537 12273 12232 16046 -15026 -22052 -16451 -30578 5580 7994 7367 1444 -12100 -8287 2324 474
2523 474 -12330 1552 21925 27813 12965 -3209 -18658 -6496 -416 503 -15180 -33665 -19882
2510 -19882 1994 6682 21670 23331 15946 9563 2624 -2802 -15347 -39542 -37955 -23790 -22778
2497 -22778 -12912 -3850 15274 18235 14293 32 6937 42758 40096 40613 60809 54664 50351 5152
2483 5152 -973 21201 9260 16855 17583 20883 16516 18933 17209 8199 16905 32431 28283 23837
2469 23837 29153 2792 -23252 -26583 -20447 298 14876 25696 -6804 -14144 10345 33464 47218
2456 47218 39150 19139 24541 35791 27541 19622 16054 9269 31106 22712 21568 15408 -7282 -1366
2442 -1366 7016 -6779 -2492 -23799 -42819 -26872 -17601 -5747 -13403 -30220 -43069 -25405 -6002
2429 -6002 16993 16894 29385 36937 17893 5136 10699 7486 13935 11798 6514 9657 31732 16957
2415 16957 -7166 -2490 16904 30238 35133 30824 33870 55021 67065 44215 -6841 -15374 -14701
2402 -14701 -8154 -29554 -35162 -28936 -44658 -38452 -69547 -59589 -34157 -21108 -23269 -8691 -25470
2389 -25470 -20225 -14440 -7867 -12675 -3946 8926 11595 22122 20785 12376 9983 -6165 16754 23192
2375 23192 6129 -926 16358 48337 67912 75982 54717 11750 -7857 -2559 17181 8972 -9556
2362 -9556 2346 6807 29013 19745 18920 27138 7197 -12546 23463 41665 23838 -1418 -5849
2349 -5849 -8238 -15073 -18868 -3536 8614 -780 -7967 672 7761 1142 -3867 1925 1523 2636 -5677
2334 -5677 8535 32168 22546 32206 32493 25733 25935 11415 655 5232 34456 24410 29809 41778
2320 41778 40250 26822 27556 41500 43644 38746 30577 38541 24236 10552 4771 5074 -7393 -12177
2306 -12177 -29309 -19049 -15930 -4002 8140 20701 16106 2088 4474 -5571 3394 12517 27270
2293 27270 21905 -3131 -20567 -12201 963 6285 -2492 -4320 9934 13361 -11035 -10505 -6553 -31193
2279 -31193 -53379 -36988 2265 12242 -10631 -31076 -17565 9598 48597 37250 24787 18452
2267 18452 36382 24685 40028 49604 23849 25690 23424 -1602 -396 3135 21952 22721 2246
2254 2246 -12468 -37326 -34238 -24649 -10343 6778 7786 7205 22798 35587 20992 8484 -12113
2241 -12113 -14584 -34107 -37172 -17341 10194 32619 24246 4029 19807 33889 43975 10625
2229 10625 -12113 -22647 -25646 -18585 -11401 -12158 -1055 4905 13566 23397 32667 60590 32054 15383
2215 15383 -1037 103 7777 26856 28653 2443 -16342 -16265 -12446 -4544 -186 -613 35172 22426
2201 22426 4658 -5270 6078 5308 -1761 -14913 -19875 -20127 4587 15159 20327 -2843 1442 32203
2187 32203 30726 29638 17260 28652 44407 30905 24044 14579 6767 -27067 -22622 5721 -4555
2174 -4555 18622 31988 39203 47109 17336 -6762 -22803 -34837 -24840 -2416 -11247 -16521 -10361
2161 -10361 11480 13807 37576 62499 48472 9924 -22328 -3788 1801 4182 5279 -8674 -12337
2148 -12337 2427 20833 21314 30439 14932 12965 27489 55505 48638 27936 27354 14575 6007
2135 6007 2891 -15856 -44978 -54501 -62711 -60240 -45419 -34450 -38578 -29465 -1988 4630 -4527 3690
2121 3690 -16743 -31103 -8913 7389 -2444 3753 10825 33201 35290 26507 24420 10993 16774
2108 16774 15109 11826 26368 15154 -5053 -13898 -26135 -22222 -8085 -10012 4228 15538 34825
2095 34825 34214 2456 -9701 -6413 11006 10826 22819 17581 10501 3803 11501 6971 -889 -17698
2081 -17698 -34290 5815 6621 15476 28169 16055 16521 -1351 -18699 -14637 -6134 6315 15171
2068 15171 23161 20816 24114 5505 -16582 -4834 20358 4376 -34847 -37398 -42839 -33538 1934
2055 1934 18299 -13021 -21606 -5511 -5531 26984 7413 -2851 23262 -531 -4732 18802 5205
2042 5205 5074 -9315 -24148 -17893 -9635 5560 25473 36950 35347 38037 48860 60832 57495
2029 57495 35343 20718 1048 8428 33095 46077 34363 12757 17863 19246 561 -23689
2017 -23689 -35528 -55662 -64560 -35828 -18258 -8444 -8240 -16192 -24416 -42254 -60791 -52858 -25905
2004 -25905 -8887 8377 29735 42820 44772 26053 -5604 7218 24219 8794 -16480 -24415
1992 -24415 -25624 -9211 -10860 -20890 -23225 8703 36277 60882 51279 33140 14646 12665 27994
1979 27994 30948 38381 38179 10103 -5840 4838 13242 6398 7279 -1229 10619 -1678 -14704 -10645
1965 -10645 -17581 -25407 -13738 -24886 -24877 -4212 -5790 -27267 -36165 -40715 -24762 -29217 -44771 -35624
$$ [...]
##END NTUPLES=NMR SPECTRUM
##END=
