##TITLE=Analysis number 315891
Compound Code cc 30039
Book Reference 436/164
Project Code adrs
Chemist Name williamk
##JCAMPDX= 6.0         $$ Bruker NMR JCAMP-DX V2.0
##DATA TYPE= NMR SPECTRUM
##DATA CLASS= NTUPLES
##ORIGIN= Bruker BioSpin GmbH
##OWNER= NMR
$$ XWIN-NMR		Version 3.5
$$ Wed Dec  7 09:32:14 2005 GMT Standard Time (UT+0h)  MAYBRIDGE\NMR@NMR_250MHZ
##.OBSERVE FREQUENCY= 250.131544655141
##.OBSERVE NUCLEUS= ^1H
##.ACQUISITION MODE= SIMULTANEOUS (DQD)
##.ACQUISITION SCHEME= undefined
##.AVERAGES= 16
##.DIGITISER RES= 18
##SPECTROMETER/DATA SYSTEM= dpx250
##.PULSE SEQUENCE= zg30
##.SOLVENT NAME= CDCl3
##.SHIFT REFERENCE= (INTERNAL, CDCl3, 0, 16.4518)
##AUDIT TRAIL= $$ (NUMBER, WHEN, WHO, WHERE, WHAT)
$$ ##TITLE= Audit trail, XWIN-NMR		Version 3.5
$$ ##JCAMPDX= 5.01
$$ ##ORIGIN= Bruker BioSpin GmbH
$$ ##OWNER= NMR
$$ C:\u/data/dgb/nmr/ADRS/13530/pdata/1/auditp.txt
$$ ##AUDIT TRAIL=  $$ (NUMBER, WHEN, WHO, WHERE, WHAT)
(   1,<2005-12-07 09:31:51.05 +000>,<MAYBRIDGE\NMR>,<NMR_250MHZ>,
      <created by zg, POWCHK disabled, PULCHK disabled
       configuration hash MD5:
       62 19 C7 07 E1 42 D1 B7 37 6C 3D D0 77 39 F9 E6
       data hash MD5: 64K
       3C 95 B4 46 F0 8B B8 01 C0 AE 35 FC 2F 48 A5 BA>)
(   2,<2005-12-07 09:32:04.74 +000>,<MAYBRIDGE\NMR>,<NMR_250MHZ>,
      <Start of raw data processing
       ef LB = 0.3 FT_mod = 6 PKNL = 1 SI = 32K 
       data hash MD5: 32K
       C9 D3 D3 53 12 E1 D0 00 3B 5C 12 93 24 AC 49 DD>)
(   3,<2005-12-07 09:32:06.56 +000>,<MAYBRIDGE\NMR>,<NMR_250MHZ>,
      <apk 
       data hash MD5: 32K
       1C 23 6F 44 AE 61 E8 A4 51 8E CB A2 7D 65 86 27>)
(   4,<2005-12-07 09:32:07.30 +000>,<MAYBRIDGE\NMR>,<NMR_250MHZ>,
      <abs ABSG = 5 
       data hash MD5: 32K
       94 D9 B2 4E 9E 5B 4C F2 C2 F7 07 DF E7 06 AC 2F>)
$$ ##END=
$$ 
$$ hash MD5
$$ 83 9B 85 4F 4D 51 A7 30 29 FA 53 98 5E 66 2B 11
##$RELAX= 
##$RELAX= 
##$RELAX= 
##$RELAX= 
##$RELAX= 
##$RELAX= 
##$RELAX= 
$$ Bruker specific parameters
$$ --------------------------
##$DU= <C:\u>
##$EXPNO= 13530
##$NAME= <ADRS>
##$PROCNO= 1
##$TYPE= <nmr>
##$USER= <dgb>
##$AMP= (0..31)
100 100 100 100 100 100 100 100 100 100 100 100 100 100 100 100 100 100 
100 100 100 100 100 100 100 100 100 100 100 100 100 100 
##$AQSEQ= 0
##$AQ_mod= 3
##$AUNM= <au_zg>
##$AUTOPOS= <4 >
##$BF1= 250.13
##$BF2= 250.13
##$BF3= 250.13
##$BF4= 250.13
##$BF5= 500.13
##$BF6= 500.13
##$BF7= 500.13
##$BF8= 500.13
##$BYTORDA= 1
##$CFDGTYP= 0
##$CFRGTYP= 5
##$CHEMSTR= <none>
##$CNST= (0..31)
1 1 145 1 1 1 1 1 1 1 1 1 1 1 1 1 1 1 1 1 1 1 1 1 1 1 1 1 1 1 1 1 
##$CPDPRG= <>
##$CPDPRG1= <>
##$CPDPRG2= <>
##$CPDPRG3= <>
##$CPDPRG4= <mlev>
##$CPDPRG5= <mlev>
##$CPDPRG6= <mlev>
##$CPDPRG7= <mlev>
##$CPDPRG8= <mlev>
##$CPDPRGB= <>
##$CPDPRGT= <>
##$D= (0..31)
0 1 0 0 0 0 0 0 0 0.06 0 0 0 0 0 0 0.0002 0 0 0 0 0 0 0 0 0 0 0 0 0 0 
0 
##$DATE= 1133947910
##$DBL= (0..7)
120 120 120 120 120 120 120 120 
##$DBP= (0..7)
150 150 150 150 150 150 150 150 
##$DBP07= 0
##$DBPNAM0= <>
##$DBPNAM1= <>
$$ [...]
##$SUBNAM7= <"">
##$SUBNAM8= <"">
##$SUBNAM9= <"">
##$SW= 20.6930455092707
##$SWIBOX= (0..15)
0 0 3 0 0 0 0 0 0 0 0 0 0 0 0 0 
##$SW_h= 5175.983436853
##$TD= 65536
##$TD0= 1
##$TE= 294.16
##$TE2= 300
##$TE3= 300
##$TEG= 300
##$TL= (0..7)
0 120 120 120 120 120 120 120 
##$TP= (0..7)
150 150 150 150 150 150 150 150 
##$TP07= 0
##$TPNAME0= <>
##$TPNAME1= <>
##$TPNAME2= <>
##$TPNAME3= <>
##$TPNAME4= <>
##$TPNAME5= <>
##$TPNAME6= <>
##$TPNAME7= <>
##$TPOAL= (0..7)
0.5 0.5 0.5 0.5 0.5 0.5 0.5 0.5 
##$TPOFFS= (0..7)
0 0 0 0 0 0 0 0 
##$TUNHIN= 0
##$TUNHOUT= 0
##$TUNXOUT= 0
##$USERA1= <user>
##$USERA2= <user>
##$USERA3= <user>
##$USERA4= <user>
##$USERA5= <user>
##$V9= 5
##$VALIST= <valist>
##$VCLIST= <CCCCCCCCCCCCCCC>
##$VD= 0
##$VDLIST= <DDDDDDDDDDDDDDD>
##$VPLIST= <PPPPPPPPPPPPPPP>
##$VTLIST= <TTTTTTTTTTTTTTT>
##$WBST= 1024
##$WBSW= 4
##$XGAIN= (0..3)
0 0 0 0 
##$XL= 0
##$YL= 0
##$YMAX_a= 473158
##$YMIN_a= -366216
##$ZGOPTNS= <>
##$ZL1= 120
##$ZL2= 120
##$ZL3= 120
##$ZL4= 120
##$ABSF1= 16.45184
##$ABSF2= -4.241333
##$ABSG= 5
##$ABSL= 3
##$ALPHA= 0
##$AQORDER= 0
##$ASSFAC= 0
##$ASSFACI= 0
##$ASSFACX= 0
##$ASSWID= 0
##$AUNMP= <proc_1d>
##$AZFE= 0.1
##$AZFW= 0.1
##$BCFW= 0
##$BC_mod= 0
##$BYTORDP= 0
##$COROFFS= 0
##$CY= 12.5
##$DATMOD= 1
##$DC= 0
##$DFILT= <>
##$DTYPP= 0
##$F1P= 14.0000005364418
##$F2P= -0.99999901652339
##$FCOR= 0.5
##$FTSIZE= 32768
##$FT_mod= 6
##$GAMMA= 0
##$GB= 0
##$INTBC= 1
##$INTSCL= 1
##$ISEN= 128
##$LB= 0.3
##$LEV0= 0
##$LPBIN= 0
##$MAXI= 10000
##$MC2= 0
##$MEAN= 0
##$ME_mod= 0
##$MI= 0
##$NCOEF= 0
##$NC_proc= -3
##$NLEV= 6
##$NOISF1= 0
##$NOISF2= 0
##$NSP= 0
##$NTH_PI= 0
##$NZP= 0
##$OFFSET= 16.45184
##$PC= 1
##$PHC0= 84.11328
##$PHC1= 6.994804
##$PH_mod= 1
##$PKNL= yes
##$PPARMOD= 0
##$PSCAL= 4
##$PSIGN= 0
##$REVERSE= no
##$SF= 250.13001754824
##$SI= 32768
##$SIGF1= 0
##$SIGF2= 0
##$SINO= 400
##$SIOLD= 32768
##$SREGLST= <1H.CDCl3>
##$SSB= 0
##$STSI= 32768
##$STSR= 0
##$SW_p= 5175.98343685301
##$SYMM= 0
##$S_DEV= 0
##$TDeff= 65536
##$TDoff= 0
##$TI= <Analysis number 999999
Compound Code 99
Book Reference 9
Project Code 9>
##$TILT= no
##$TM1= 0
##$TM2= 0
##$TOPLEV= 0
##$USERP1= <user>
##$USERP2= <user>
##$USERP3= <user>
##$USERP4= <user>
##$USERP5= <user>
##$WDW= 1
##$XDIM= 32768
##$YMAX_p= 442028443
##$YMIN_p= -142451
$$ End of Bruker specific parameters
$$ ---------------------------------
##NTUPLES= NMR SPECTRUM
##VAR_NAME=  FREQUENCY,     SPECTRUM/REAL,   SPECTRUM/IMAG
##SYMBOL=    X,             R,               I
##VAR_TYPE=  INDEPENDENT,   DEPENDENT,       DEPENDENT
##VAR_FORM=  AFFN,          ASDF,            ASDF
##VAR_DIM=   32768,         32768,           32768
##UNITS=     HZ,            ARBITRARY UNITS, ARBITRARY UNITS
##FACTOR=    0.157963299565203, 1,           1
##FIRST=     4115.09888958431, 0,            0
##LAST=      -1060.8845472687, 0,            0
##MIN=       -1060.8845472687, -142451,      0
##MAX=       4115.09888958431, 442028443,    0
$$ Real data points
##PAGE= N=1
##DATA TABLE= (X++(R..R)), XYDATA
$$ [...]
18886 450241 432216 482217 540636 593928 657292 728187 774218 814505 869917 965356 1089618
18875 1089618 1198794 1301264 1429617 1586184 1810926 2125469 2540034 3007056 3431643
18866 3431643 3739501 3914270 4070774 4226395 4444182 4794858 5238518 5896830 6944026
18857 6944026 8489557 10812439 14306656 18968604 23726323 26183248 25817338 24499179
18849 24499179 23325841 22055458 20161480 17748355 15410946 13662613 12550870 11898427
18841 11898427 11509597 11136247 10540901 9692295 8740552 7804277 6831489 5884576 5070238
18832 5070238 4386877 3897117 3524853 3207424 3016840 2854987 2752898 2695917 2647708 2620602
18822 2620602 2653155 2708229 2794531 2915342 3107906 3367226 3702202 4197032 4865637 5729212
18812 5729212 6803443 8021313 9089973 9788428 10181840 10548670 11067056 11849367 12990056
18803 12990056 14408879 15938432 17593029 19917038 23335702 27478870 30262434 29606301
18795 29606301 26573336 23276187 20206915 17042300 13785155 10918201 8772097 7266817
18787 7266817 6285407 5672869 5329831 5185041 5083314 4837130 4420019 3974853 3490559
18778 3490559 3049484 2705724 2363127 2067924 1833463 1668934 1517803 1384728 1271562
18769 1271562 1192676 1092638 968198 913156 963347 1032526 973291 873420 771347 655491
18759 655491 590432 517258 482136 419581 378421 353698 306919 295930 257748 264991 243884 233009
18747 233009 236236 224243 214223 182952 158826 159535 164262 149104 153608 138639 103934 90218
18735 90218 49466 21367 55112 68311 91616 97877 83857 81437 38365 32765 66230 87311
18723 87311 96406 88526 71509 32368 28948 19159 1026 17046 -7990 2901 34166 52203
18711 52203 59673 64137 41007 47999 65307 57024 75890 100165 90768 82859 72966 64558 59886
18698 59886 62520 50163 73693 92389 102147 69093 55594 63193 43315 33886 66680 71344 70122
18685 70122 51356 44681 46737 42903 8813 -15255 2182 7231 -1709 19808 28457 50904 78834
18672 78834 49438 16258 -5462 -46755 -45271 5615 46809 54464 55752 47397 81997 80137 83344
18659 83344 72401 48376 42038 38188 -1208 28293 59117 48226 54353 51377 50349 40703 54348
18646 54348 39984 36494 29194 12225 -98 -32628 -18059 14870 26577 45004 60087 16266
18634 16266 -26089 -51947 -52940 3993 34456 24265 32710 52374 57323 24605 -31376 -39400 -11879
18621 -11879 -1819 -45363 -85860 -67454 -30600 -4744 28640 66950 78182 41638 16932 982
18609 982 2737 26333 58247 75604 74562 83558 89349 97854 93114 77338 79620 77274 63065 38940
18595 38940 4305 -29829 -40035 -4036 7334 -309 -8348 -6289 1119 -9472 21114 60365
18583 60365 48603 -1759 -5554 7410 32277 78393 93060 77510 44105 28680 28336 26113
18571 26113 13052 -16590 -11918 -5542 -8334 9615 17234 58929 77636 59876 42611 26224
18559 26224 10811 33566 44346 8121 13364 34141 13965 2225 1214 -13914 19387 41603
18547 41603 54916 43166 53867 48184 16564 16613 23340 28131 22734 17932 20217 43494 36386 -1167
18533 -1167 -6687 18094 23665 28695 21691 20115 17678 30467 18121 18518 -1854 -17293 -17951 -20722
18519 -20722 -19929 -34038 -19802 8923 -5718 -4560 17608 36454 28912 8243 -2537 20511
18507 20511 -5681 -38286 -22392 6987 36272 23798 28245 51057 7496 -14890 6477 19660
18495 19660 9803 5606 9930 -3598 -9996 -12758 15370 24961 -33001 -37629 -21304 13213 16499
18482 16499 12538 12161 19033 5352 -3803 -7429 -1232 5799 55949 93296 76389 55105 43948
18469 43948 54113 89926 84374 72364 43219 17072 6856 -33309 -18218 -7495 -15497 -36662
18457 -36662 -24134 26963 3479 -19086 -5037 9370 -1845 -30441 -27176 -37201 -49923 -33998
18445 -33998 -11922 -7912 15955 37538 44234 68006 75923 47453 18630 35648 56949 80580
18433 80580 60449 61128 46298 51841 56315 40181 40554 38930 27528 11619 21544 57268 71569
18420 71569 18106 -33951 -17230 -4344 36707 56722 54147 46332 24977 -6051 -8059 -144
18408 -144 -4576 89 -3418 -16025 2169 28770 14725 -5157 -10793 -18020 -28616 -26324 -12596
18395 -12596 8817 -2594 -27519 -33650 -36127 -35838 -35743 -19194 -30118 -5707 13188 5946 -13997
18382 -13997 -16100 5447 4133 -21057 -20233 -4328 14339 21223 37828 76461 57669 8486 15280
18369 15280 10394 4770 8488 -14539 15175 2673 -9815 36881 72426 81396 42362 29961
18357 29961 29978 15309 10941 8512 40846 79198 108244 159532 163366 146569 153267 149837 117686
18344 117686 103452 98830 88448 64866 67741 95557 90666 50760 61491 75802 85681 88434
18332 88434 85790 88943 69254 47166 62490 25520 -14514 6113 31972 41787 31546 36535
18320 36535 72296 79827 69006 50679 59064 78730 45942 29590 47146 40177 30339 55742
18308 55742 66630 54714 41939 45749 46631 61560 77241 55247 56285 68468 70048 77634 79097
18295 79097 86219 86017 123416 136259 135535 130322 114088 129393 146537 130546 92790 65373 58605
18282 58605 61119 58383 43373 53719 47896 59247 60920 38183 50583 93776 115789 68440
18270 68440 23281 21680 48903 60372 47207 17306 -18832 -49918 -112639 -135575 -105348 -66450
18258 -66450 -36253 -27195 -22839 -27119 -20375 33698 13253 -13498 -73941 -81799 -50440 -17064 -7711
18245 -7711 -2799 14935 7626 23787 27796 44973 35751 -5330 -29106 -29985 -45365 -70345 -90636
18232 -90636 -98399 -55134 14640 57463 40474 41719 47691 80910 91345 83550 69316 68014 58231
18219 58231 41658 11175 14819 28592 13426 12381 22319 32813 53367 57354 56399 61866 64588
18206 64588 60895 68786 64147 49803 8443 10833 34939 44588 51041 64366 53033 35384 49194
18193 49194 72125 57322 52268 53066 54119 64704 46647 31904 29088 49206 83868 95894 89771
18180 89771 64365 68129 101289 121829 147627 136094 89511 100340 147188 150711 120099 68336
18168 68336 43876 66131 74442 69367 89635 87122 99726 120991 112366 98453 107921 143534 145507
18155 145507 103503 55485 68742 123144 161138 188982 229297 231463 210778 184913 179173 192855
18143 192855 223909 271485 265463 287353 289234 287318 311276 361956 383476 413471 414117 407489 459251
18130 459251 481803 491733 533437 557000 600348 665905 730348 820728 910899 1056060 1193980
18119 1193980 1359540 1610003 1873439 2173726 2605672 3184611 3984003 5066562 6572599
18110 6572599 8852228 12680861 20052157 34908408 56830305 60200405 46380900 37896767
18102 37896767 34405044 29510292 21694106 14138037 9219161 6571145 5068400 4091679
18094 4091679 3383828 2871171 2451238 2142510 1902872 1672381 1512051 1431452 1338669 1238929
18084 1238929 1145405 1061669 958343 869924 769730 699541 664941 598983 563658 521065 463237
18073 463237 426276 395151 365830 344477 322687 329116 318741 282829 230359 234800 238383 209259
18061 209259 200720 203422 173290 143171 140371 139912 79903 57926 93389 107390 136784 158778
18049 158778 171105 147251 153586 168261 167100 154795 135002 105583 87023 126800 133442 123055
18037 123055 134132 140824 140204 130412 108332 88427 88993 104174 111018 80429 69111 76019 98792
18024 98792 134757 168144 165642 133869 126931 102889 70823 60791 59755 40746 41862 37980 48809
18011 48809 50254 50578 73424 93396 78927 60545 85665 31297 16943 2091 -15678 -13406
17999 -13406 -21815 -7726 41060 47298 48824 65251 44620 44093 62218 86822 111539 112442 55063
17986 55063 34958 38916 24291 13038 43233 95301 120408 129102 148049 147036 135007 133272
17974 133272 142740 168733 151987 117984 84929 72051 47972 53356 45794 -5772 18017 44674
17962 44674 47289 7844 -34330 -33303 -25435 -12317 -15137 14725 5214 5221 2949 20736 73910 66850
17948 66850 88127 76164 58757 36879 20900 23866 32772 18192 28731 18554 -2660 -38033
17936 -38033 -10787 7016 -4214 32834 44644 17043 24273 34526 9640 -17640 -26687 -12280
17924 -12280 29574 31080 311 -2615 28566 21976 -9742 20091 43448 63720 66772 65469 58983
17911 58983 63977 44511 43313 22883 31814 38647 23706 6110 10336 13968 23539 -3144 -10333
17898 -10333 -30802 -20964 -19594 -28793 -41793 -34717 -19513 -18643 -26864 -34566 -1059 17087 3773
17885 3773 -32235 -40882 -52065 -40987 1322 -10356 1045 -19285 -20836 15606 43435 36626
17873 36626 -20858 -20190 -5029 -6659 -4777 -14097 -6950 -18190 10534 25108 -7589 26691 31626
17860 31626 -11224 -16444 -39469 -17901 32800 40889 19285 -8625 1848 37537 51715 29601
17848 29601 39335 7246 -16380 -31887 -32857 -19478 -29130 -9638 1168 -8092 -18961 -26806 -30437
17835 -30437 -16491 4940 29578 21033 24177 13979 -2941 4244 32619 41737 53683 47548 44716
17822 44716 48490 55103 15460 -4831 13396 3671 4686 27611 5511 23316 37311 42723 45092
17809 45092 56028 60974 22701 9315 7292 16328 17319 -10057 -186 30888 20594 -7967 -6589
17796 -6589 -25346 -12926 8480 -2071 -15034 22293 53250 67137 73429 83301 50748 -1255
17784 -1255 -17398 16655 6646 28984 77294 68449 48387 -4882 -7798 8096 19520 15707
17772 15707 3356 -945 27066 32306 -3385 -10089 -642 -12000 -30828 -17043 -19378 -47856 -44865
17759 -44865 -63232 -50668 2108 32048 33286 40247 20918 9220 11594 3964 24042 18398 8825
17746 8825 11102 -4330 -367 -7351 -11292 -16981 -372 -4834 -4757 -21920 -1517 4497 20056 45140
17732 45140 96140 74105 43614 38463 69507 82449 55932 34535 21073 5343 29710 35895
17720 35895 35731 42130 54093 42226 13081 15658 38794 22462 32555 50787 20077 13235 20411
17707 20411 4542 12210 1532 25245 16336 20229 30547 27443 11327 -24792 -19841 -22010 -12339
17694 -12339 -32582 -10633 -2056 -20401 -20196 2799 16481 -38482 -53920 -49334 -35667 -32759 -45727
17681 -45727 -26889 15227 17208 35030 47571 51570 31513 21314 22246 47898 26303 20776 20577
17668 20577 15630 27298 51733 52927 57401 41667 38957 54534 75642 81120 62095 54190 56466
17655 56466 39455 13932 14867 31795 55704 68666 79769 96372 49994 39833 47499 61136
17643 61136 34251 6956 -23049 -1178 39148 53427 51348 35708 37846 58296 60428 74709
17631 74709 77501 36017 40518 60169 82662 71551 76199 104919 136132 141050 151541 165071
17619 165071 185628 188564 181644 189151 165411 181521 197702 216243 235685 227440 197301 194753
17607 194753 207432 217655 221958 239765 277694 257543 208568 170013 153334 158568 164045 176488
17595 176488 224654 213809 214516 215312 178178 177275 198316 219576 260325 303495 290771 262211 280936
17582 280936 322637 364888 419330 452288 464356 483034 480634 486858 510717 550465 636976 668608
17570 668608 731829 820090 910296 1040715 1204700 1330677 1440720 1607288 1856383 2176075
17560 2176075 2577294 3049868 3572086 4034538 4319224 4492975 4635790 4792023 5005255
17551 5005255 5305412 5879612 6787047 8099651 10071811 12971906 17011605 21762998 25872019
17542 25872019 27814620 27565139 26360177 24919666 23154370 20949735 18489626 16171578
17534 16171578 14419868 13217890 12473160 12015226 11560308 10978939 10152762 9179476 8211025
17525 8211025 7237411 6296529 5402659 4663996 4064086 3591295 3259768 2984894 2771408
17516 2771408 2646744 2546508 2436954 2403625 2413646 2466487 2587404 2704334 2859209 3119640
17506 3119640 3465343 3931817 4565766 5362538 6360980 7475764 8499414 9234043 9711337
17497 9711337 10101803 10606782 11286570 12180786 13288932 14547322 16058478 18180241 21069221
17488 21069221 24314531 26662336 26830650 24959288 22200437 19369258 16460107 13532844
17480 13532844 10847755 8675619 7130110 6092454 5439240 5050106 4833611 4667275 4473443
17471 4473443 4187217 3796009 3362090 2973946 2622532 2292110 1974321 1721836 1540504
17462 1540504 1365613 1213046 1080048 979797 861749 774509 748635 691153 654669 605591
17452 605591 570971 564190 531302 495332 437130 391684 341482 337566 372033 349064 376508 443419
17440 443419 519014 554685 484787 446974 387079 335196 308642 281377 260654 198429 204508 182073
17428 182073 142896 149530 115612 102820 90691 109867 128623 133401 149382 151617 125152 132819
17416 132819 151688 126380 63698 33607 38352 68590 103603 135130 112212 78959 63909 61745
17404 61745 62622 71562 67856 77099 84598 64847 58399 48030 60468 45267 42125 41993 22909 37797
17390 37797 33380 15257 28403 53107 56763 26555 41048 35701 32833 36582 53755 88093 96840
17377 96840 104762 100022 72358 75415 58186 44788 66823 78045 76238 66417 81000 55829 28676
17364 28676 22436 23997 8380 15656 26040 45188 44567 49983 67895 83145 61793 63962 31273
17351 31273 -15885 -13280 1436 12641 12510 43944 38387 29638 44547 61462 60072 16707 2977
17338 2977 11568 37624 30468 14820 39815 31967 6789 2215 -14404 -3013 36050 28613 20064
17325 20064 19671 26227 56513 74401 50891 69423 102040 101935 49023 25324 35107 78728 84136
17312 84136 82717 38564 7857 -15160 -35323 -4682 43699 33065 63973 74060 41475 -13981
17300 -13981 -21021 -10563 -4346 -5203 12773 -1761 -12349 -6342 -2519 21030 39094 62875 58415
17287 58415 7177 -1577 22712 -606 16086 31764 53756 61614 48346 53941 73360 80000
17275 80000 82620 50711 26758 34561 13144 6348 4328 37264 57183 33093 37998 44814 51690
17262 51690 14198 1124 5641 13308 15261 -9335 -12960 -487 9152 -29235 -4707 11051 2526
17249 2526 5655 25391 33934 16096 3344 -30360 -40970 -45738 -26166 -7087 -11708 -10417 21617
17236 21617 24489 1792 -25777 -37086 -34740 -8262 -16286 -780 16025 5023 -2723 13237
17224 13237 11487 -13571 -9516 268 -28993 -9221 -14127 -54160 -73427 -35385 -13073 -21207 -10411
17211 -10411 6408 -35809 -49411 -13086 27311 23108 -5587 15537 37849 57535 21471 2836
17199 2836 -28050 -35609 -17933 -33158 -23304 -7593 10622 -18274 -41866 -46215 -9788 11759
17187 11759 -7178 -27005 -11998 -3120 8460 16265 -7079 -27149 -48539 -38582 -9902 8351
17175 8351 -9755 -32702 -45203 -39908 -20424 27056 32771 9046 -16937 -25901 -8832 -8772 -44340
17162 -44340 -56183 -63129 -48062 -39220 -29261 -19072 -34371 -44121 -35398 -19952 -48913 -35363 -24360
17149 -24360 -21727 -25222 -10624 -11593 -29900 -26024 1291 6097 -29095 -41908 -36854 -30019 -71785
17136 -71785 -86617 -70984 -46794 -11158 -3577 -59673 -74198 -70365 -73767 -67241 -55313 -29133
17124 -29133 -15276 24175 65280 44320 6597 16996 -13397 -35721 -21922 -18112 -10536 17562
17112 17562 24935 25472 24451 -2069 -28009 -26234 -11039 -6824 15474 52489 64966 50506 32123
17099 32123 19695 4395 -33176 -28748 -69960 -70117 -55985 -21897 -33131 -74827 -74827 -48928 -12032
17086 -12032 6395 15654 25484 23037 15406 12796 -3242 -39246 -46929 -27311 -18749 12893 20431
17073 20431 31310 5164 9116 -13415 -9249 -31775 -29675 -17874 -6246 9549 24435 28777
17061 28777 8938 21729 -901 28807 63996 55369 65773 56155 72555 73586 82943 114812
17049 114812 112148 58994 40172 26264 56658 87063 95646 75742 56369 59071 58525 60516 64666
17036 64666 104478 119478 113566 86574 109117 85748 104841 59122 -12091 -22614 -18959 -9433
17024 -9433 8180 -9683 -30884 -62049 -30000 -26823 -33184 -23326 -14725 -7421 -12471 -34777 -63892
17011 -63892 -23232 24187 14060 10386 48013 52193 49381 45460 69227 98679 75087 65348 92960
16998 92960 82397 59500 55732 46766 49314 65455 86281 68623 27440 17122 34684 24574
16986 24574 -2750 -1146 32998 66199 87516 81038 43906 69850 86870 35421 -4347 -37150
16974 -37150 -56335 -48550 -15023 -27190 -15980 -38231 -45620 -46475 -74130 -78339 -39464 10581 19314
16961 19314 17030 -4068 6784 20509 1611 3466 -9907 -13245 -17224 23831 35131 13486
16949 13486 -6897 -1962 10848 -7892 -38627 -58640 -46302 -63041 -38973 6090 -14238 -8297
16937 -8297 5340 6880 -21513 -3917 5987 3857 10343 -10864 -32966 -23549 -43439 -19970 -31993
16924 -31993 -40730 -13728 15603 -6444 -3125 -1350 8778 -7352 -31268 -51002 -51368 -27279 -4322
16911 -4322 6093 -34556 -50540 -36821 -46619 -21626 -12902 18939 42091 28458 9687 56610
16899 56610 86143 70662 28427 22241 1507 -1474 -8390 -1226 -23882 -7843 -24033 -16909 -13485
16886 -13485 -18078 -16923 -30755 -32049 -13131 -17507 7451 49118 46366 19372 -1087 -13273 -9232
16873 -9232 1658 -20136 -505 -13076 -41787 -45238 -68079 -24052 -10822 -62422 -26565 -6237
16861 -6237 17709 9366 -1290 -3853 16825 -6645 -26366 -47956 -14225 -4769 4478 44021 55159
16848 55159 38939 40440 8610 -35944 -35706 10940 44541 5200 -6454 -16404 -12052 24319 45750
16835 45750 9390 40222 36304 44597 30875 -10274 -16802 -12758 -11313 -7971 754 -22885 -30755
16822 -30755 -36904 -19785 -12752 -6891 -1334 -2525 -5434 -29741 -13071 36409 65186 47063 41532
16809 41532 37677 24800 20215 58012 71044 44474 42077 19219 -19786 4620 -25828 -49886
16797 -49886 -60660 -19130 25359 23129 18914 22221 23845 11518 5252 -4635 -15303 4672 20896
16784 20896 12060 -7475 -6453 -17828 -5145 -1191 -10408 -20665 -45022 -36138 -52993 -48303 -58482
16771 -58482 -54716 -21277 -1525 -19602 -24062 -10610 -37635 -34069 -39582 -43352 -22774 -8021 25894
16758 25894 18997 753 -35315 -37471 -48605 -43691 -19677 619 -5803 -15184 -27605 -31961 -25510
16745 -25510 -40463 7721 44552 -6598 -23201 -9974 -2403 -336 9016 22768 3294 40975
16733 40975 54369 41098 64166 79370 20720 -10741 -11286 6762 37238 26156 40080 47286
16721 47286 39008 60317 66135 68084 51351 17974 19332 27714 20519 5171 28227 16413 11770
16708 11770 -17468 -21973 23241 -5182 -34273 -24050 -18077 -20356 -29942 -8854 2841 5183 30407
16695 30407 45391 32254 1673 -19376 -15988 -18728 -4514 3602 6913 -3321 -4354 -12618 -44974
16682 -44974 -9970 88 -7810 -19441 -21199 -53994 -52044 -3838 -21461 -53391 -48592 -11656
16670 -11656 39325 49620 7045 -1794 -13292 -11249 -7118 12107 52605 40438 35559 42770 40794
16657 40794 16957 24283 43924 42398 24289 46664 30148 -4413 -27872 -4075 13076 24459
16645 24459 -18805 -36497 -18297 -24045 -21800 -27368 -31929 -26011 234 -1047 23078 19710 7698
16632 7698 33277 15156 2124 -17074 1038 16370 18235 26106 57825 67398 64092 66805 43496
16619 43496 16202 7360 6481 21851 30011 68675 58877 17625 -22951 10098 26810 35268 12027
16606 12027 18787 36681 31976 40405 1495 -19111 -16996 -16505 -27018 -31700 -9557 -36842 -8315
16593 -8315 -679 -11245 16040 35766 11484 -34398 -10217 24316 52193 68579 42836 49584
16581 49584 51191 14918 38963 44760 15857 -20331 -23085 -36916 -26553 -5965 -12029 4129
16569 4129 -13775 -37710 -55794 -46248 -14710 -8534 -18613 -32900 -9466 -14614 1849 10399 -29038
16556 -29038 -74480 -55189 -70104 -74883 -61206 -43018 -68344 -73898 -38267 -11509 -16255 -26324
16544 -26324 -19371 1825 1901 -15213 -12989 688 15504 23785 27124 27658 12580 -236 -5025 -60391
16530 -60391 -96141 -81353 -48670 -36587 -24378 -39017 -46797 -11892 55614 69290 42918 -10095
16518 -10095 -29435 -6491 43501 34788 26168 -969 -29422 -26856 -24380 -40876 -19475 -36040
16506 -36040 -32995 -18012 -30628 -17771 -4160 -20651 -9380 23056 31527 11364 13595 8132
16494 8132 -4585 11822 3014 7532 7150 -10762 -26779 -30299 -5223 -13043 -17177 -17175 -42649 -17158
16480 -17158 3811 -5501 -18212 -1621 39643 57889 58997 14189 -30524 -37716 2203 5249
16468 5249 369 -29743 -8688 -18619 -56835 -77537 -28857 -16440 -25081 -21437 20297 35517 53367
16455 53367 73498 83630 82676 52056 72803 66291 51832 23995 -21591 -35259 -22232 -38145
16443 -38145 -24338 17886 37069 9415 -47073 -60274 -47461 -50249 -18304 -25757 -18660 -5399
16431 -5399 -32155 -23332 -25715 -77793 -58536 -8839 -21888 -44914 -12417 6448 9072 -20313
16419 -20313 -30330 -3712 -2949 1596 6848 3367 -7188 -20924 -3706 -27023 -36539 -27319 -13862
16406 -13862 -38842 -66270 -70570 -50630 -22498 21053 37032 1236 -2840 -2810 -2172 -4903 -462
16393 -462 -10160 -3375 16394 8025 21651 32585 9720 -15248 -12525 -11967 -3495 32312 10723
16380 10723 5785 -11470 -8585 -664 -9641 -26208 -29936 -12619 -13689 -12086 8967 37750 48361
16367 48361 43479 11805 -2324 7107 -2571 -23937 -33719 -21576 -24044 -26358 -44070 -55074 -34284
16354 -34284 -24040 -29004 -52644 -44732 -29136 -27388 -31603 -23640 -25652 -54505 -46635 -23424 -6626
16341 -6626 26287 -13725 -34113 -24292 -38159 -16354 -1811 12324 10701 -3062 2014 44379
16329 44379 27140 -11282 -5375 19172 17220 18964 -19022 -21060 2770 23668 47878 42772 3036
16316 3036 -42136 -43361 -21317 -16385 -43720 -38563 -15790 -39491 -41319 -52417 -20335 18162 -6947
16303 -6947 -4682 -9493 10854 12336 -31233 -39642 -18881 -1409 41541 74775 59713 47957 9477
16290 9477 22292 32158 25736 4139 10851 5124 -21683 -16829 -17251 -39391 -4825 -5568 -14405 -10683
16276 -10683 -4802 -4294 -8138 13852 51572 47809 46598 10053 -25904 -64211 -47455 -40869 -27153
16263 -27153 -748 -13660 -32168 7207 20458 5806 4673 -21779 -52734 -78540 -57673 -52573
16251 -52573 -27839 -15091 13130 48465 47181 16458 2902 1311 3475 -11909 -5146 3103 21406
16238 21406 28391 37221 18412 7836 -2073 13212 49113 76698 30372 -9510 225 36538
16226 36538 46665 21124 14919 11134 -8789 2588 -2112 13068 21017 -23415 -38375 -9038
16214 -9038 -11581 5730 22115 3193 -44063 -69613 -57315 -33194 -22755 -9665 -851 4609
16202 4609 20856 29225 4257 -10408 9123 23894 42728 36378 22681 -11788 -20310 -26630 -39914
16189 -39914 -49211 -16791 13149 -12423 -46980 -42369 -32160 -37986 -25071 -13731 5333 5629 -21018
16176 -21018 -24729 -19324 -29502 -43444 -19705 -20499 -14628 -25408 -17824 -10497 -26880 -95 13724
16163 13724 21973 5220 -34942 -65722 -32926 -20631 1691 -7663 -25449 -37182 -42914 -32001
16151 -32001 -24601 -12109 33793 9173 -26442 10934 35898 43794 35740 22607 25573 9805
16139 9805 12591 -13584 -21522 -23444 -617 13080 -7117 -26270 -4745 -19623 -32563 -10060
16127 -10060 -15560 -10043 -12204 -28125 138 5680 -21920 -47757 -10777 -9575 -17963 -55642 -73299
16114 -73299 -65402 -44826 -9438 27164 32114 26359 8972 -14003 -5680 8781 19689 26703 14091
16101 14091 20199 27928 33031 15926 -744 -44960 -54959 -22865 259 -3517 14848 11767 26427
16088 26427 38432 28885 22416 33885 44126 14289 6881 14225 -9754 -14168 3963 59098 82621
16075 82621 55126 23017 8618 11806 -13699 -32631 -30443 4846 13574 -5943 2904 -9626
16063 -9626 16497 71540 64086 32651 28816 56336 62715 55779 50237 20130 -13185 -23607 -18147
16050 -18147 -4050 5214 -7577 -4124 -12169 -33641 -3939 -35005 -74459 -94863 -65988 -12516
16038 -12516 -28944 -40324 -41622 -56213 -21669 24012 35259 62785 51149 7696 12427 16586
16026 16586 -35398 -39451 -28953 -48396 -63643 -55500 -32829 -19980 -33404 -58759 -60103 -66699
16014 -66699 -67493 -55386 -63710 -47092 -21411 -17233 -35492 -29555 -37626 -27383 -22802 -806 31434
16001 31434 41701 7348 -27108 -19688 -11961 -28005 -25009 12176 15650 -1712 2087 -11503 -4285
15988 -4285 -10136 -30138 -47825 -69679 -45228 -1465 14043 -13813 -16764 -16749 -17054 -36767 -44878
15975 -44878 -27556 -26251 -11304 16015 -2597 -38407 -38060 -40035 -51017 -29291 -19319 -37760 -14070
15962 -14070 7731 -4757 -32339 -43453 -58869 -71989 -84531 -30410 -7717 26058 48857 41410
15950 41410 -17287 -69872 -41597 -27357 -15555 -21928 -50341 -60163 1058 6226 18183 16812
15938 16812 -8384 2081 -9888 15490 14509 -25415 -39591 -62996 -50384 -41040 -43259 -17076
15926 -17076 -16601 -33295 -31468 -72487 -84575 -48599 -20309 -10320 4982 22882 45369 41713 19861
15913 19861 -11687 -18821 -43788 -23044 -2885 -5238 -10481 -13880 -11640 -13927 -5831 -18990 -9522
15900 -9522 -21713 -55260 -71027 -34763 -29901 -45742 -77344 -117017 -101803 -70707 -64504 -55145
15888 -55145 -24020 -8475 -15420 -13969 -5862 5761 13394 39039 41021 27409 -26369 -43529 -73856
15875 -73856 -68151 -27192 -27002 -11930 -27391 -37384 5270 1434 -14981 -23199 -15103 2348 14565
15862 14565 -3081 -28340 -1648 -20406 -24155 -29047 -66742 -61073 -42614 -35977 -26138 -26725 -43918
15849 -43918 -25931 -11505 923 16618 20626 14532 6529 -11368 -14454 -6419 -4693 -4775 18357
15836 18357 19915 18644 34960 38401 23261 5215 -29824 -14002 11698 29219 -4371 -19303
15824 -19303 -39190 -41611 -7810 -22188 -49960 -49503 -69837 -90423 -100712 -101104 -67796 -53896 -22069
15811 -22069 -14567 -34664 -71022 -91618 -65308 -59912 -30453 -22805 -4619 9916 -16259 -11102
15799 -11102 31295 33341 28577 5953 14845 8424 -15616 -44939 -38636 -41855 -5747 16143 12144
15786 12144 12827 15260 38335 37953 7733 13779 3881 -4948 9688 7675 -19953 -6682 35057
15773 35057 27733 482 10247 44457 81999 72410 46229 6145 22699 48232 11579 -41582
15761 -41582 -11758 -19870 -55461 -84855 -66890 -13125 1688 15942 18721 32447 22288 4912
15749 4912 11881 -22728 -36338 10340 24027 10366 15095 8509 -3767 16733 1023 -47876
15737 -47876 -62091 -45341 -18801 7616 -815 -48626 -54432 -28121 -16952 -9967 -18534 -44836
15725 -44836 -49461 -70733 -35449 -15069 -45587 -67737 -72824 -79248 -67857 -40987 -27691 -4841
15713 -4841 19517 -23081 -56179 -54528 -61561 -76756 -52672 -49680 -39396 -24388 -24951 -3238 -6710
15700 -6710 37741 -6880 -41389 -45491 -15492 17196 12585 31744 13594 -11730 -9410 17526
15688 17526 12120 23280 1584 14275 18776 3421 -46703 -48114 -10023 -8622 -9118 -2034 -20005
15675 -20005 -22195 -33661 -69232 -50596 -28786 -29807 -38776 -24144 -18387 -33542 -4492 26217
15663 26217 28249 -3568 -3620 -9576 -19602 -6022 547 1682 9813 19781 -6595 -6709 8500 50243
15649 50243 56644 10374 -28752 -22567 6631 8969 39633 60075 37767 19021 -531 8618
15637 8618 13293 -1844 1626 22476 16548 -5731 1710 -11651 -19151 17030 36659 46282 23997
15624 23997 17938 8533 12340 4551 -19725 -6932 -14232 -51749 -35064 15024 27215 17142 28840
15611 28840 20125 26558 -4683 -60235 -45090 -17880 -36510 -24842 10953 16038 -15998 -22816
15599 -22816 -27477 -25976 -9997 23214 51608 52908 15746 -11333 1584 22348 36082 23163
15587 23163 4292 1868 -14291 -6807 13028 6667 -32195 -26471 -30869 -28582 6989 43379 44624
15574 44624 23623 -7696 -29357 -11277 -2161 -24504 -47896 -8227 25664 6922 1294 3526
15562 3526 20406 18398 16715 21390 6982 20584 42183 35871 36135 7098 -24124 -43555 -36883
15549 -36883 -30223 -8036 36294 7674 -25356 -29030 -32024 -60210 -75920 -67484 -21192 116
15537 116 -19549 -3884 -2445 -16588 -20327 -35805 -21585 -21505 -45627 -62198 -54886 -58222 -47394
15524 -47394 -50143 -22042 -3621 30859 45250 29667 17658 5537 -8320 -11207 -7797 -10433
15512 -10433 18678 33764 2195 11024 -8940 -25586 -9389 2341 137 3104 11288 852
15500 852 1123 3949 -7952 1968 29326 39165 36217 32188 9720 -1568 1361 -7232 -26047 -40665
15486 -40665 -17338 -17739 -42151 -49945 -39437 -14789 19202 14570 5787 15198 1678 -8683 -39039
15473 -39039 -41699 16477 29810 5788 3186 12123 18802 6251 -27947 -56453 -5565 26110
15461 26110 8895 -25287 -13455 13979 9891 8047 17296 18533 4355 1513 -4329 23527 54246
15448 54246 86914 55149 -386 -20411 -20678 -19462 -19569 -14661 2934 24005 -10898 -39003 -69897
15435 -69897 -59766 -35720 -180 3104 -5459 -36428 -65199 -40867 -18512 2469 6806 6022 -186
15422 -186 -20033 -40824 -39136 -68754 -34884 -4589 11883 -47664 -73632 -33238 17227 35179
15410 35179 7390 1240 -13518 -22642 -36410 -23327 -32526 -16820 -8053 -14064 -13910 2983 21491
15397 21491 25376 25054 22829 5756 -9381 -9089 3811 32938 41403 63166 74378 41316 27135
15384 27135 48577 37769 6046 2052 -3616 -5510 34649 22520 12411 459 -11266 6860
15372 6860 -6874 -40255 -3119 35935 50057 42471 37280 42241 48787 50847 35761 49573 74185
15359 74185 76530 76921 46390 24616 23195 30321 13979 21476 -1585 -24708 15142 47196 19820
15346 19820 -14541 8304 62927 72575 53123 39219 -3200 -54032 -64721 -35709 -29988 -28572
15334 -28572 -32968 -26113 -63694 -53297 -13780 204 -16566 -24654 -10770 -7727 5908 9338 14505
15321 14505 -10198 -39669 -54615 -26345 -21752 -9159 -2517 -13985 -19264 -37458 -21511 -22769
15309 -22769 -8642 4513 14651 15012 7194 -19346 -19313 -11783 24781 32757 34911 44685 24235 -19557
15295 -19557 -4178 -25139 -51243 -17134 308 -616 -22053 -33591 -16563 -11248 3511 -10712
15283 -10712 -29146 -61937 -61844 -56751 -48357 -10242 17017 49669 62906 82781 74998 73287 69409
15270 69409 72909 72313 63177 43914 -11114 -26972 -13863 -27026 -9729 16443 12397 27874 12084
15257 12084 -21023 -37311 -5892 8376 25665 -6861 -34338 -45369 -19414 7546 -2150 -20162
15245 -20162 -21415 9797 47156 29754 7384 -21861 -35876 -17194 -2465 8550 -12187 -35986
15233 -35986 -57374 -72309 -55365 -30183 -37321 -42448 -36443 -4572 19669 -11553 -11457 27184 41060
15220 41060 41223 30916 22006 39032 48373 45837 31911 47701 30288 9973 -15659 -3887 18512
15207 18512 5992 6403 37552 44205 51443 74086 76099 25994 17935 21758 9913 15527 1735
15194 1735 -13958 -21501 -51615 -71347 -65071 -56076 -63422 -49498 -35784 -14565 -4898 7014 -19207
15181 -19207 -27301 -9541 -26172 -28843 -30632 -42269 -59374 -55500 -44971 -39485 -66377 -85547 -53197
15168 -53197 -27511 -17706 -11481 1342 1891 -47955 -19419 -13449 15243 34276 10789 6580 7332
15155 7332 6200 -1070 -10220 -19305 -17887 6169 9293 2179 -30816 -24982 -14544 -28042 -29932 -31753
15141 -31753 -33154 -18388 578 -8947 -19227 13439 38991 30874 34475 21861 -4568 -18917
15129 -18917 -12353 -34022 -49033 -59193 -22035 -27380 -39657 -31628 -16932 -40237 -58199 -27183
15117 -27183 -38381 -30730 -26105 -38790 -72129 -102897 -62611 -22470 546 28352 12821 34138
15105 34138 39250 11301 21196 46996 45148 10336 -4382 7161 -48006 -76460 -44985 -2541
15093 -2541 -16366 -20673 -5362 2036 2366 -10764 -22781 -56312 -73204 -71857 -40785 2848 26476
15080 26476 23835 -2142 17867 25732 170 -10436 -7911 -12642 -19799 -26536 -35110 -51329 -43932
15067 -43932 -31616 -27204 -64142 -69857 -30652 13424 37101 21428 173 -20209 -2385 -677
15055 -677 31839 26899 14654 42986 20202 2154 10619 1713 -13060 -40294 -37258 -6864 5603
15042 5603 20773 30623 490 -22808 4019 38570 20337 -3072 -10914 -24753 -34946 -32973
15030 -32973 -28648 -28006 -21914 -15767 -8594 -3776 873 -5061 -991 8629 -18523 -44716 -19866 35527
15016 35527 30357 23179 9976 -10000 -20024 -47394 -43325 -12611 25143 44755 10376 25253
15004 25253 16080 -14715 -14302 12637 17321 1463 12866 10123 -27762 -32875 -36979 -53639 5699
14991 5699 28461 6390 7333 -13096 -11342 -493 -3133 1990 -907 -17261 -6483 -17500 -30791
14978 -30791 -46367 -65545 -60708 -40825 -5441 21037 13885 5964 -13999 -53844 -52784 -47011 -61472
14965 -61472 -36438 13384 12585 -9431 -3541 -20 -1539 8554 2893 28178 39288 31593 8701
14952 8701 -20745 -33513 -42570 -50595 -37331 -40732 -29059 -9898 -24577 -44328 -33415 -19475
14940 -19475 -18904 -49710 -58923 -39892 -19580 -40745 -34789 -7383 -2536 -10917 -9391 -9282 -4388 19106
14926 19106 9084 -13590 -16298 4320 12066 14311 27006 35614 46815 30121 -9991 -40717
14914 -40717 -23153 -17091 -11190 -23766 -20924 -7546 -7 -13053 -26933 -6814 -16857 -42072
14902 -42072 -70556 -94365 -98988 -85275 -27042 1639 -2128 -4166 34732 68576 69530 32107 -2056
14889 -2056 -21811 -5481 -3375 -34415 -50808 -37982 -36447 -40768 -33708 -66629 -75734 -63547 -26419
14876 -26419 -18500 -15170 -33811 -35057 -29479 -46539 -43960 495 -6584 -10227 -10882 -16134 7870 34077
14862 34077 43147 41168 14300 -16692 7799 10690 -27285 -46400 -56972 -50757 2475 2818 -42097
14849 -42097 -53547 -45708 -22914 -28034 -33206 -14070 -33976 -24030 13616 -4271 -2865 -6410 6167
14836 6167 6328 -27891 -23832 54 -24654 -56249 -23136 -7568 -26429 -18140 26381 9845 -4030
14823 -4030 14227 2449 20623 25013 -15475 -26135 -36630 -46444 -65349 -38510 -35301 -72272
14811 -72272 -67711 -67079 -52108 -41853 -31247 1186 49524 53103 37556 16575 -8036 -9841 -15955
14798 -15955 6422 16566 35261 37010 34038 20938 -40030 -52898 -9877 -6989 -53633 -29778
14786 -29778 -34730 -42363 -19904 6012 15555 464 -8971 -4983 -6553 18322 19897 17557 -3894
14773 -3894 -26671 4114 -17204 -44907 -65881 -32016 -2397 32941 37973 31365 11686 -35732
14761 -35732 -59642 -25162 12568 -13760 -11313 -342 -9552 -17196 -35410 -43492 -23891 -23345 -32478
14748 -32478 -53728 -53029 -23496 -32865 -26129 7103 36482 19697 17823 7233 32126 24294 55393
14735 55393 56629 21409 14958 27322 27087 -10669 -22282 -20015 2242 -4803 1264 -17182 -958
14722 -958 26553 -5149 -1645 4266 19329 21834 5490 13406 23612 35794 27151 15109 24862
14709 24862 2512 -51753 -56837 -36983 -40597 -63614 -85043 -115237 -100287 -64892 -32747 -16224
14697 -16224 9088 -13741 -51249 -49443 -34881 -9442 -11054 1271 -15472 2062 -12130 -29573
14685 -29573 -24030 2073 -9031 14074 -6641 -13724 -26348 -29265 2681 10854 -20458 -64702
14673 -64702 -59668 -3351 -12111 -905 29012 24387 -3644 -9586 33089 34531 36415 7290 21295
14660 21295 61743 52575 33661 23655 5322 20717 22164 23902 15219 -11753 5571 -9663
14648 -9663 -7340 -28486 -25882 -32057 -35487 -33513 -45473 -36915 -31574 -49559 -44300 -16724 -49239
14635 -49239 -37628 -5191 -3275 16368 24133 33198 43829 23531 12159 12922 1821 -5232 9679
14622 9679 20779 27231 5002 -10872 39333 47411 29367 35088 64343 50311 18083 1704
14610 1704 -18762 1470 22538 37888 19387 2309 -208 10805 13603 35739 30989 43882
14598 43882 19002 -12290 -17884 -54738 -71672 -60930 -33248 -49247 -51809 -37451 -23182 -4899
14586 -4899 -26906 -30403 -7466 12699 -8279 21743 20008 -22215 -15479 -27670 6738 25369
14574 25369 -17610 -28660 -25392 -14829 -11396 1816 25070 10930 22706 20492 -19893 -34674
14562 -34674 -51906 -46184 -3260 13666 3100 541 -10914 -9996 14442 32084 16856 59570
14550 59570 44406 19179 10651 -11745 -34495 -26933 -1507 42055 36625 -3215 -34258 -71009
14538 -71009 -67368 -39994 -19981 10726 -4215 -43176 -19338 -11537 -16112 -14712 11310 4792 6691
14525 6691 5746 10565 12373 12669 24058 21530 20106 30658 38043 12492 6194 -6697 -40918 -77655
14511 -77655 -74445 -60161 -59265 -68464 -41331 -23743 -9333 33847 23781 28568 43814 31958 4593
14498 4593 15135 18997 26501 47583 43953 29766 21880 261 -19365 -15987 16607 28223 14883
14485 14883 17259 56003 57878 37238 30113 1844 -17170 7508 30118 28005 1241 -13383
14473 -13383 26068 -7888 2840 11172 32361 32210 7627 -7643 -9032 -7841 17795 -8695 -12532
14460 -12532 13568 7569 7709 -37453 -55962 -26507 -6869 -16299 -28660 -53836 -28961 -20211 12134
14447 12134 -5778 -61435 -58184 -63466 -45629 -7130 2879 -24467 -12326 10171 14673 2642
14435 2642 -3935 6664 14949 23674 15689 18776 -3526 -2851 18168 39333 38429 39009 44995 34379
14421 34379 1200 -9686 -24866 -22874 -1411 -5020 -20240 -15199 -40224 -52449 -47870 -41917 -39910
14408 -39910 -15988 -2706 -10403 -14617 -4310 1331 14419 354 -3331 20312 16395 -5390 -9585
14395 -9585 919 -26174 -46372 2275 32080 17385 -6925 -9588 -41005 -55580 -26213 -5621
14383 -5621 5691 -20026 -45863 -46602 -40010 -44380 -24441 -19614 -37147 -61850 -58425 -51987 -35601
14370 -35601 -19921 6353 12515 27210 43071 19323 8893 17773 22028 -12154 -8360 -30493
14358 -30493 -19173 -12955 -6351 -13222 -28685 -20941 -13279 -25109 -29022 -7919 -18925 3903 35132
14345 35132 28407 4445 -22083 -60243 -44036 -6255 16134 17467 8885 275 -9704 181 10087
14332 10087 14584 32714 15592 -37704 -61528 -28793 6135 -13556 -4226 24906 34669 24081
14320 24081 17575 7518 -1572 17164 1508 8695 26750 7272 -2596 -8559 -17463 -11700 -14515
14307 -14515 1891 -13459 -22717 -40443 -56467 -29736 29499 49710 47081 14307 12093 42380
14295 42380 29850 12842 7463 5916 26603 30727 12159 1395 -18660 -40116 -27269 -17537
14283 -17537 9167 47483 58310 74132 63839 30028 -24852 -42072 -67074 -28385 -1083 -11193
14271 -11193 -10990 -3864 -32491 -21805 -6391 -40069 -46921 -8236 16687 8653 28119 46730 47362
14258 47362 22856 -25167 -10990 -2853 3239 -5478 18642 4153 -16189 -13272 15529 -3501
14246 -3501 1872 32789 5983 15558 41493 57337 38471 23489 31533 56774 24374 4050
14234 4050 -21845 -8375 10702 -24262 -27681 4572 21248 12968 4633 -32988 -51674 -20167
14222 -20167 -31124 -39200 -35246 -23753 -26126 11751 12858 -13298 -27757 -5509 36729 43325 30360
14209 30360 -1440 -16235 8622 37980 37488 14917 -5187 -19856 -22026 12393 5571 -15985
14197 -15985 2845 10928 9877 -6628 -8463 -16635 -31126 -7867 11743 -3201 -29242 -27347 -11045
14184 -11045 -40749 -38547 -37619 -6612 13958 21205 -5867 9514 5757 -12485 -20089 -33817 -51399
14171 -51399 -30284 3016 -2730 -42747 -61806 -73359 -69868 -36717 -34442 -23028 -3571 -2715 13366
14158 13366 25925 24509 32139 30617 -41062 -83567 -92699 -67961 -18631 8172 4969 2417 -9964
14145 -9964 -34948 -10000 11629 -9142 -56603 -25857 7838 -42965 -43814 -38230 -19719 -2600
14133 -2600 9142 23729 2668 -2994 7052 21019 43460 32192 10866 12441 -22066 -14169
14121 -14169 21518 16784 -23717 -5396 -91 2841 3120 3173 -27183 -44848 -57924 -43974 -21678
14108 -21678 -36873 -46585 -53090 -18700 32314 28557 27524 26241 15188 -10 -22040 -42649 -28871
14095 -28871 -19563 -30408 9536 23361 19154 22901 8316 10277 53780 34691 -1756 1228 8771
14082 8771 7205 7060 21095 9797 -12030 -10371 -9812 2450 20986 26102 2318 4529 -1261 -22716
14068 -22716 -39235 -34751 -24157 15181 34683 26248 6369 31146 43578 37483 28316 20407 -4895
14055 -4895 -32477 -14641 -18265 1892 -10868 -37914 -22595 -29773 -48503 -15336 8189 28656
14043 28656 24553 12395 371 3649 -22209 -28471 -12817 22953 6922 850 0 -8327 736
14030 736 -25043 -43971 -23969 -12351 -14579 -13246 14470 59244 56770 28287 382 -33932 -15074
14017 -15074 6022 27779 7410 10998 22798 -17681 -11122 12375 21594 18415 3495 8901 21384
14004 21384 37067 33271 6674 -3030 9229 -6147 30039 47638 35186 47625 18820 -10346
13992 -10346 16266 27563 -8344 -38840 -50716 -69889 -48439 -25236 -24394 16238 26070 59230
13980 59230 51569 32473 21930 2099 -36146 -59930 -54029 -34827 -22133 -10976 7913 -21417
13968 -21417 -7710 -7649 -32258 -15453 13364 34716 37059 16830 -2435 -9193 -27959 -45024 -24274
13955 -24274 21974 35535 8875 9984 9880 -420 45188 56335 28147 25510 20632 -3119 -18042
13942 -18042 -23271 24166 32959 14833 -2251 5408 14944 23715 8460 -23494 244 14293 -5002
13929 -5002 -42956 -53465 -29182 -4666 -18437 -22845 11296 16080 -2591 -50739 -62852 -32775
13917 -32775 2472 19781 2486 -26171 -1356 -546 -32022 -49517 -43046 -5735 6171 -7575
13905 -7575 -2416 11410 1091 -13219 10236 46961 19078 -848 11760 -10922 -10534 10712
13893 10712 4057 8848 21184 -15421 -11620 3375 6259 -18729 -41461 -14616 10235 10421 -13823
13880 -13823 -37803 -42895 -53248 -33007 4176 21469 28267 53682 43768 17256 -28423 -61916
13868 -61916 -43820 -8449 27681 33679 -745 -11345 -30095 -36376 -27145 -2730 -29116 -57702
13856 -57702 -36178 -29722 -27410 -15637 -44633 -48447 -38237 -3493 -39371 -60160 -24554 313
13844 313 10694 13459 9081 -12489 -37121 -58170 -74969 -73836 -66757 -54436 -36681 -4447 7872
13831 7872 21634 4560 -44264 -39946 -8344 -18467 -31192 -21654 -41983 -79339 -79694 -84009 -101200
13818 -101200 -86089 -69880 -78531 -41367 -27615 -38043 -41077 -27420 -19903 -26045 -21225 -9993
13806 -9993 24810 44305 48360 27437 11141 -24715 -35978 -19983 6348 25611 19925 9118
13794 9118 1686 -9992 -22382 -32613 -29945 -15930 -26283 -16944 -18643 -29503 -22256 -10862 17730
13781 17730 8872 11724 -17971 -25596 -23396 -21433 -18514 -4013 -32349 -53454 -38774 -41257 -47788
13768 -47788 -25159 -19161 6147 32738 49091 42455 1732 242 -26181 -34007 -46272 -36368 -65875
13755 -65875 -43704 -12647 -2650 3996 2704 -12925 -38464 -58160 -79792 -48318 -16513 24438
13743 24438 48755 35405 18451 19833 -6946 11226 30976 25051 42407 42019 50611 -4714 -85992
13730 -85992 -74591 -39735 -10612 -10588 -12791 -41081 -33907 18851 -8865 -52905 -46847 14118 13990
13717 13990 -5295 17961 -6474 -33145 -31200 -24586 3605 8404 24793 2351 -22250 -37291
13705 -37291 -42399 -62134 -20922 14813 37966 31065 29371 -8279 17139 51513 47048 13890
13693 13890 -3233 -24119 -7313 -3936 -7181 20210 42977 59242 12462 7247 -12717 9788
13681 9788 5658 -25153 -42130 -16580 25843 35505 38772 12962 -21395 -17213 -23422 -2651 11262
13668 11262 4924 25413 37690 25098 6574 -26956 -35099 -20124 -18891 -24393 -12754 9391
13656 9391 39408 52641 58139 52547 18469 42462 27178 49071 44632 37268 15768 25276 -13832
13643 -13832 -37790 -1165 34180 23369 30542 3516 24038 40588 21412 -4003 -31337 -27772
13631 -27772 -44825 -44847 -23394 17942 42155 18238 3708 -14767 -44565 -53112 -59769 -32637 -32932
13618 -32932 -52563 -52170 5541 46396 42980 154 14935 7463 -23158 -11334 -38555 -34856 -1705
13605 -1705 -1465 16651 17724 12438 -9199 -50330 -48074 -50489 -43652 -41064 -28184 -45910 -54644 -24883
13591 -24883 -8417 -27709 -42271 -33163 -1943 5322 -31557 -56639 -44532 -51994 -75896 -47424
13579 -47424 1052 1671 -38554 -37168 -192 21931 44263 19647 5285 29160 18554 18902 26455
13566 26455 41744 46333 38216 59507 49208 51932 56040 19841 13598 34087 64387 67721 76663
13553 76663 46707 33115 -6585 -10878 -30175 -39609 -9528 16445 20840 -5794 -19062 -25772
13541 -25772 -36273 -24426 1762 40703 56057 60794 67212 28443 -29571 -36988 5232 16582
13529 16582 9072 -6023 -27131 -68120 -65454 -48008 -30634 -11499 19775 24333 29764 67668
13517 67668 88036 87435 77227 32566 9291 -8943 -9022 -35059 -42353 -12260 -6553 -11931 -3281
13504 -3281 -9191 7110 25113 37257 -3953 -25942 -21768 -17497 4900 3601 10659 15467 1321
13491 1321 -20583 -412 40782 51636 62500 69831 29399 -25532 -35538 -35632 -56311 -68167 -57609
13478 -57609 -1167 1212 -21287 -30503 -40926 -47565 -37817 2046 2254 27761 7863 -16794 -4363
13465 -4363 -17604 -5642 -5035 -16953 -11852 -22576 -15326 -12928 -36812 -43557 -24183 34361 44793
13452 44793 -14518 -37641 -43610 -41591 -59836 -63505 -12800 8305 -11523 -20942 -27401 -10082 8869
13439 8869 -3906 -26535 -16210 26862 42141 68776 90216 68146 13654 9896 15393 -29052
13427 -29052 -4255 4490 -3149 21096 52902 64861 59656 37332 12661 -27584 -24270 -14482 -10916
13414 -10916 -22475 12841 34036 22029 12048 1614 -34048 -26661 19065 6825 -8165 -1554
13402 -1554 22434 28162 40982 62725 70484 57927 25048 -6300 5824 22401 -12269 -45086
13390 -45086 -34220 -46781 -54035 -55880 -55492 -67672 -42047 -13970 -2682 -4167 -12780 -17245 -10454
13377 -10454 6889 10702 -4513 -28296 -33613 -33750 -17883 -8488 13623 23289 12150 14444 3164
13364 3164 6396 12172 201 21732 16984 17677 19533 29223 22998 23692 37991 56577 37821 10775
13350 10775 38329 46530 14810 1641 -1749 14720 58973 60677 72369 63874 77049 64897
13338 64897 55968 35660 8556 33023 20198 19618 38837 57851 87005 71294 43771 23764
13326 23764 10790 -13199 -19597 10304 334 8242 59923 58000 27648 17078 8992 34856 26457
13313 26457 19215 19649 -18314 -28463 -12756 -24199 -36021 -37595 -32836 -33574 -32399 -15166 -8137
13300 -8137 -21930 -44258 -40337 -40251 -25018 -11040 -32474 -9449 6070 -151 -7885 -65494 -71326
13287 -71326 -32943 -44229 -65483 -43396 -13286 1243 -12145 -17040 -4888 19380 8086 10937
13275 10937 4019 2068 -14416 -64724 -46445 -6503 -513 -13447 4991 -10025 -11820 -14999 -29273
13262 -29273 -35902 -35041 -13963 1517 -17811 -35740 -57697 -78949 -65822 -66230 -72894 -80948 -78654
13249 -78654 -68665 -45105 -40054 -34914 -26560 -43534 -39060 -22799 -11097 11968 1985 -35715 -57174
13236 -57174 -40682 -20991 -25719 7178 30136 32815 1722 -24117 -20554 -14071 179 20644
13224 20644 26111 25908 38602 48535 44252 7434 19751 28911 538 -26548 -47838 -67457 -74464
13211 -74464 -26940 2386 -16971 -11828 20956 31080 34128 48399 52679 66693 71156 60103
13199 60103 46545 12051 -17415 3826 -1321 -8375 -40888 -22725 -1441 2167 3515 -23268
13187 -23268 -34470 975 18971 14005 17000 30850 20371 -54233 -63769 -75871 -38872 -24815
13175 -24815 -23705 -32438 -39597 -17071 -3238 21899 -4797 -26235 -25317 -15654 -8213 4218 10370
13162 10370 35001 58387 50896 62519 44041 24495 31968 35618 45516 63726 39181 14651
13150 14651 -11738 -34734 -11646 -13962 -31171 -28163 -12523 15224 3287 -20922 -36683 -19688
13138 -19688 6123 9990 3688 -9347 4440 35723 54653 52145 21318 34644 42141 42511 10890
13125 10890 -35812 -13913 -9183 -14242 -1880 2046 22660 9656 -5903 -15002 -2946 18341
13113 18341 24159 37824 23279 14382 22566 23308 4669 8382 22018 52298 79910 67712 13804
13100 13804 3857 29225 40709 4014 -23718 -32184 11654 46193 60026 26759 -34323 -40664
13088 -40664 -27657 -759 31149 5126 28287 62777 43930 27836 16250 27343 59958 51156
13076 51156 17989 10887 3603 -22079 -40909 -14548 15215 9223 -16386 -24775 33217 39093 16249
13063 16249 -12467 -25636 -40948 -32219 -32853 -37142 -50335 -27347 -20185 -22904 -15804 -842 12495
13050 12495 32443 21823 21803 6074 -30042 -28398 -3032 -23252 -41910 -12713 -16046 4924 37313
13037 37313 74983 66985 -8188 -34490 -23686 3437 30219 27608 -1083 -35105 -40927 -45239
13025 -45239 -59336 -42604 -2292 23928 -1274 -12159 2745 33651 -4375 -22963 23918 27755
13013 27755 8235 33737 56504 46629 38260 22532 -10976 -38742 -36981 -32295 -12529 -5615 -23263
13000 -23263 -6310 -24046 -42960 -30051 -23814 -14446 -5872 -41798 -78363 -66093 -19124 -27277
12988 -27277 -30370 -20804 -20551 1601 39552 53999 46859 15339 7096 -18131 -21048 -32135 -1005
12975 -1005 29962 30545 -892 -53687 -55018 -28463 -46197 -18970 -11814 321 -18218 -54750 -40650
12962 -40650 -12476 -2740 -29214 -29358 -39202 -22234 -8638 -24167 -18804 -40956 -52711 -25918 -7883
12949 -7883 11600 7326 -1605 4464 2247 8744 -3246 4335 -15286 1890 21246 21873 11330
12936 11330 23966 4935 3034 16166 22331 35265 42088 36146 5463 -30638 -12062 -11435 1371
12923 1371 32698 35538 7335 24785 54515 90733 103876 59656 -8957 -33457 -20095 -5550
12911 -5550 -9602 -22364 7335 27405 -16361 1565 1358 39632 11314 -13760 -8494 -1905 4531
12898 4531 -22728 3179 32255 9071 -27220 -26488 30266 13268 308 4456 1082 9637 17524
12885 17524 9098 5024 22330 23738 31757 38052 9752 -24829 -27678 -37385 -44808 -82983 -63279
12872 -63279 -28192 -17777 -24951 -7858 23298 24868 27180 28142 29432 -12475 -42860 -61232 -47504
12859 -47504 -27177 702 -19754 -19084 -7301 -13791 -15345 -20741 36122 60180 45364 49762 60584
12846 60584 45146 52204 58073 54145 65427 65712 45236 9335 -24067 -12006 -35677 -34091 -12359
12833 -12359 -23748 -31900 -20914 5549 -32176 -16285 16122 39167 58806 40683 18609 12999
12821 12999 10006 4949 -25361 -22819 -22576 12813 10532 27260 43266 28111 16482 23499 -4927
12808 -4927 -18346 13241 14375 16035 13077 -3340 -11446 -33979 -14038 54784 62368 75110 78724
12795 78724 17946 5718 -4486 -29940 -25564 23947 61462 63895 46359 39388 24975 27899
12783 27899 35963 43084 36069 5591 -12712 -33943 -19656 23008 50298 57754 20783 -19342
12771 -19342 -13375 18998 43128 26117 27394 39717 43975 20659 47137 89895 85550 49772
12759 49772 22710 22606 38303 48477 65201 41314 24420 23715 -9165 -4314 37316 58969 65910
12746 65910 47738 27116 34092 34924 55373 37449 38766 18325 27826 32285 45357 96528 95726
12733 95726 97000 108433 126247 104936 71927 84554 77336 91827 87311 83847 111021 143087
12721 143087 157794 141859 135402 114446 103827 90806 56718 34859 37288 65868 105598 101070
12709 101070 122129 104561 97621 120008 138794 166798 141410 119544 159611 160423 149118 144842
12697 144842 148951 174385 182996 148511 161182 183880 162734 96583 73921 85281 100532 135644
12685 135644 126651 131303 144081 131572 107719 111022 129855 115571 99363 84004 105477 89402
12673 89402 44111 24695 68360 118866 110340 101446 118165 150933 181163 187824 182651 177802 144504
12660 144504 128539 115307 85737 64027 54065 59999 83720 97462 92009 64043 26221 25848
12648 25848 35280 56605 70080 104056 79731 79313 73111 59337 45338 58033 49190 54013 54131
12635 54131 76988 65683 30752 16478 14745 27969 36183 50536 59903 86200 87364 48222
12623 48222 21885 20071 -1289 10128 32851 34275 47854 9631 -9751 -32896 -23744 19835
12611 19835 24887 3608 -11157 -3391 6856 59799 82684 76969 41907 28800 7683 -8979
12599 -8979 17542 62181 124973 137924 129195 75798 39762 34928 17717 -21148 -4684 45255
12587 45255 49909 50454 95491 74082 79033 61470 52483 67669 55039 30578 37873 48085 43868
12574 43868 24269 -1466 35594 48267 37452 42880 46283 48907 55396 48531 40259 26805 39133
12561 39133 45655 32390 67321 116947 95134 74467 52908 47054 45729 30884 53337 58937
12549 58937 1592 7314 26960 56912 71129 81899 61380 13841 -1444 19713 21000 40325
12537 40325 65693 82961 68387 57164 52703 72622 78769 67100 74841 94263 93343 79566 70025
12524 70025 73441 62366 42670 75854 136056 151224 144514 130771 95275 73044 62062 90253
12512 90253 116978 105560 73503 81117 50486 936 -17092 4582 12238 25537 39033 31680
12500 31680 57766 75147 27228 24889 27990 54295 78640 81449 75884 87188 87998 78624 77835
12487 77835 67769 36101 45315 72806 45710 20425 56455 74718 63797 66972 55550 81839
12475 81839 67641 29857 27191 62423 81358 67606 69760 106018 70966 53656 45333 46649
12463 46649 64304 61434 44499 49556 38571 44677 75237 96972 97382 62498 29195 19592 10435
12450 10435 11490 -13355 -24577 -45358 -43614 -60690 -47152 -7542 -5219 14276 43427 25909
12438 25909 9842 -10525 32519 45676 64651 94987 88948 67428 57189 67880 50978 64727
12426 64727 66871 53859 39844 55175 90933 105303 88635 82134 90190 96945 104234 118109 125799
12413 125799 106937 102704 129675 158411 177268 174350 133185 111675 80498 74249 71342 102538
12401 102538 125933 171567 232365 212860 155445 108057 143944 160663 176361 191966 172754
12390 172754 154340 150686 164240 197559 184727 184246 185168 197118 185986 212977 239020 221175
12378 221175 212166 223955 230341 210177 226257 219504 226001 216133 247751 275645 296729 268850
12366 268850 263633 249892 258295 287041 321445 347876 357603 354481 335633 367374 369458 375923 421869
12353 421869 395643 356686 396687 414383 429286 508537 537470 535065 519330 521463 555309 561362
12341 561362 559908 552399 552869 543371 556282 570633 569987 599708 648288 722219 771177 767882 807963
12328 807963 847545 914698 941122 958373 1006137 1068299 1133422 1187615 1243697 1328734 1424890
12317 1424890 1499875 1577878 1688427 1819810 1962595 2113840 2293683 2470481 2684648 2949444
12307 2949444 3240475 3599068 4020582 4467466 5005931 5672435 6486421 7408046 8502731
12298 8502731 9855635 11420109 13199297 15168826 17176647 19094374 20651031 21718546
12290 21718546 22246864 22144158 21525447 20544903 19337063 17994130 16703086 15556681 14602841
12281 14602841 13892747 13419905 13165999 13149645 13369277 13842288 14526613 15373301 16338704
12272 16338704 17364217 18435672 19589338 20795565 22043058 23255499 24488322 25661180
12264 25661180 26780158 27866644 28972934 29945639 30608337 31031321 31022633 30605899 29878515
12255 29878515 28906744 27802889 26720545 25701914 24841265 24183037 23682553 23245728 22812108
12246 22812108 22302519 21733929 21116107 20440771 19770643 19023173 18262327 17567606 16998717
12237 16998717 16538214 16211450 16114301 16310350 16795107 17616463 18755347 20230117 22033581
12228 22033581 23977642 25896270 27494526 28481235 28699464 28037193 26684936 24827274
12220 24827274 22654801 20308508 17955576 15726955 13720891 11925655 10421041 9108358
12212 9108358 7995005 7079613 6302838 5630717 5035091 4549012 4135858 3764225 3412169
12203 3412169 3143582 2881191 2622788 2417496 2257594 2123452 1980313 1864255 1756022
12194 1756022 1653762 1547019 1455102 1382829 1308810 1239963 1165777 1106556 1101371 1062140 998553
12183 998553 933141 899804 873605 839881 814092 751508 731751 725020 694608 645717 642943 647920
12171 647920 623417 612818 584597 554598 555945 591660 584291 564794 574471 534456 501695 510087
12159 510087 513076 497015 470644 481448 475662 465202 463961 455226 456159 459286 427384 386354 376289
12146 376289 382350 392424 383762 389471 379358 373225 393283 395385 362555 367365 394549 362582 342659
12133 342659 362723 370673 359311 367679 367053 355561 351930 343764 360004 346099 324170 319634 337622
12120 337622 345292 288207 258715 309363 337382 326063 340755 368561 352368 313835 264563 260602
12108 260602 311059 308359 324499 339806 329964 301829 327681 343988 339009 315081 307066 368075
12096 368075 405183 406085 375577 323943 312381 302032 305669 297430 265106 234859 194271 172077
12084 172077 148117 168700 155599 161001 163180 136949 142724 155660 205050 235685 193081 152975
12072 152975 140216 134424 102886 108526 112388 147352 159763 155568 181689 189979 185926 170565 169575
12059 169575 170226 156631 115192 83556 105552 119990 96916 77362 109174 127309 136053 136339
12047 136339 112753 99588 109750 139812 129296 115948 80010 93820 94678 113023 129746 151781
12035 151781 163976 160277 144028 139490 148558 140349 102358 72381 71772 92273 117320 105327 76866
12022 76866 45874 78851 122777 99967 64394 66404 97626 105493 95205 122584 117027 153488
12010 153488 158199 133204 109987 97223 46032 56128 73021 36884 26432 14266 50280 79518
11998 79518 89832 122132 108779 70466 73961 78192 61351 32295 11552 33486 61052 77458
11986 77458 98789 89716 86625 89329 110030 110074 107542 101756 123633 114850 102929 100226 62767 43367
11972 43367 60978 92217 68318 77847 110914 81672 92439 91028 120972 112398 74988 46447
11960 46447 62219 96162 117557 83608 61264 53694 40830 52110 55187 62538 67334 47399
11948 47399 75209 85617 107498 133790 151560 153629 124457 92736 102309 108282 99408 86850
11936 86850 86790 86450 63860 68085 71928 71770 54448 41104 68226 66686 41734 28618 35059 53546
11922 53546 78843 101490 112573 101090 95229 48668 26855 52793 59597 70883 56284 89127
11910 89127 122686 144570 123561 99987 109288 129690 105353 62035 48255 43928 77504 63120
11898 63120 56968 91510 99574 108995 83309 46833 40356 46791 50453 66386 96952 97072 116480
11885 116480 125353 106454 105880 97866 79896 61936 76359 104471 51509 66953 126255 171001
11873 171001 155726 139291 143910 124614 159185 201139 212161 184102 177023 184318 199729 212696
11861 212696 180997 179461 184417 213797 257082 294730 268215 229644 224002 238010 216978 235777
11849 235777 254597 252650 245905 227733 226002 196281 232243 295531 307070 281109 259717 265275
11837 265275 303299 316695 298227 315586 322074 319568 328763 342847 371752 366253 364159 363570 376162
11824 376162 403214 383172 384312 398745 421743 427576 417740 387865 392160 403157 414278 451671
11812 451671 438301 440967 481389 507404 515849 532461 558199 523680 520214 593961 619298 614241
11800 614241 634777 644292 662431 671117 711237 711277 763340 762906 775541 802751 848827 895217 906835
11787 906835 903439 927825 925612 940624 983350 1013420 1008279 1061864 1091853 1120431 1145447 1181875
11775 1181875 1220703 1236504 1260122 1288340 1327857 1369471 1403329 1466921 1547685 1646354 1747819
11764 1747819 1840520 1947148 2056170 2175648 2324832 2501613 2666683 2860253 3112232 3372207
11754 3372207 3691707 4053628 4450031 4910552 5437044 6018056 6689726 7470963 8375329
11745 8375329 9445957 10691681 12055778 13554965 15242426 17084142 18978219 20821059
11737 20821059 22435837 23676141 24481524 24846712 24732651 24177221 23260593 22150485 20943826
11728 20943826 19770314 18695015 17829124 17147012 16703210 16487974 16477614 16657833 16982901
11719 16982901 17466210 18077728 18718467 19340592 19948167 20531790 21074878 21549414 21998471
11710 21998471 22471849 22962794 23529266 24195159 24989165 25894932 26798938 27601239 28247770
11701 28247770 28687769 28841276 28774662 28485303 27955361 27308806 26560016 25699936 24723635
11692 24723635 23699203 22691218 21639016 20576482 19531964 18517961 17534581 16646350
11684 16646350 15849734 15164178 14615392 14249411 14072333 14089585 14290486 14642625 15178393
11675 15178393 15889347 16739911 17647417 18545385 19315685 19874339 20155265 20061469 19583266
11666 19583266 18787410 17681791 16362906 14946370 13556139 12220940 10952643 9770302
11658 9770302 8718766 7810853 6996354 6267846 5659168 5157164 4702655 4271287 3871879
11649 3871879 3581381 3316798 3077027 2849302 2680213 2498076 2276792 2133323 2022016
11640 2022016 1899398 1780493 1675442 1570332 1473252 1414985 1391557 1331132 1290515 1228985
11630 1228985 1198492 1147546 1045475 970768 920039 890761 868541 830824 822891 774119 701804
11619 701804 668986 665153 679763 664017 606641 599216 588397 567605 549503 542512 546748 547764
11607 547764 511066 478368 476317 505627 550928 554935 546689 533834 520615 549290 545403 503380
11595 503380 443137 429313 445144 443699 447283 434455 434640 406696 397091 397665 368490 357737 350130
11582 350130 332422 334945 349912 373185 387685 384068 375291 365290 385450 402071 383887 372127
11570 372127 348239 320790 323733 314051 308734 304624 308909 326960 318427 311306 314477 300667 280797
11557 280797 273319 280150 271661 266999 271535 272189 268017 237274 243077 258297 279741 279237 241579 230784
11543 230784 240295 251038 259056 261911 262349 270193 281942 300640 295098 273536 286940 319734 312982
11530 312982 303635 298868 252137 213883 211421 215466 210274 185233 161648 157645 163355 157431 156855
11517 156855 166447 180729 190413 158938 154994 152407 149872 147116 152652 169517 158124 176925 188606
11504 188606 150800 97289 108720 169888 171352 126589 101790 114142 113880 98931 83490 98801
11492 98801 108709 108968 117728 102968 69466 39530 20233 34271 27553 30475 41460 63205 83670
11479 83670 68071 40125 42574 63138 71602 94060 99806 77631 51185 64524 65811 62988 71894
11466 71894 92233 52244 37718 51861 48414 29383 48787 62942 34203 18205 39029 58291
11454 58291 71871 70275 70587 81414 64887 32738 29662 45220 38550 5831 37338 53342 56368
11441 56368 89347 90277 74994 50113 41630 19586 -3963 -6732 -7563 34020 61968 76147 65880
11428 65880 73971 59047 46159 53341 41549 44235 56807 65986 83653 102829 67665 30216
11416 30216 25365 32989 56137 78375 54843 79776 80419 63137 38935 36674 54997 55932 33334
11403 33334 16729 27954 28473 33358 13840 11096 23895 26443 134 26807 29999 65738 96974
11390 96974 69776 41397 25790 44920 15573 20249 30459 25355 43103 48029 50349 15896
11378 15896 48824 73283 33660 23144 44322 84748 55462 12875 1065 1014 -40521 -17806
11366 -17806 -41112 -44040 -7358 20172 43040 46610 79995 70309 41127 9002 30421 79683
11354 79683 49317 48052 31575 10032 18657 20409 28556 64338 104526 110417 66315 41456 60144
11341 60144 34432 9412 25269 11828 -6134 12692 6541 10627 26291 19914 -17616 8832
11329 8832 94750 77067 35510 15500 14301 19003 8571 10161 16821 64001 121331 87687 47050
11316 47050 58165 26600 22243 31126 51092 55496 54100 52888 47217 54322 64230 110048 119724
11303 119724 116064 135115 159218 133613 121854 122290 125533 103074 81431 52255 87274 96941
11291 96941 91665 93309 133616 124357 144709 165075 158517 141720 108673 95816 77549 112399
11279 112399 84082 46849 94468 142562 158835 140024 130461 126917 113554 117563 146161 144030
11267 144030 115654 122882 131668 138835 147816 139626 152933 167660 161517 169411 166879 123265 81315
11254 81315 87999 104484 97513 98165 86150 96031 108444 120587 100185 89703 78866 93904 109722
11241 109722 107949 97091 84442 97952 107836 112686 119833 111779 100652 83065 43379 62647
11229 62647 74397 90771 94442 61869 33259 34204 31101 43121 28322 -64 5510 16246 16123
11216 16123 23901 41370 86488 91810 65242 79018 75206 17963 774 17714 32829 10760
11204 10760 -116 24982 16905 25666 51427 29023 4575 -46982 -62726 -33235 -18947 -1280
11192 -1280 -15874 -13418 -1548 7761 3664 10964 -354 -16269 -25679 -23169 -38519 -40146 -51384
11179 -51384 -17725 -38813 -78843 -69673 -48483 -30431 -14663 -27857 -18472 -38131 -62790 -35122
11167 -35122 -41805 -42521 -73661 -79391 -47057 32932 39052 -4900 -12081 -20359 -9682 -137 -1989
11154 -1989 -2250 5029 21217 4133 -2898 -17609 -5318 2658 -4683 -36846 -19284 -30011 -42042
11141 -42042 -48500 -42767 -57343 -36160 -36503 -18601 -18060 -11145 -41670 -46374 -55869 -71156 -62201 -67240
11127 -67240 -58797 -38904 -31832 -40611 -54438 -48889 -59936 -72608 -51626 -11862 -14078 -30138 -28725
11114 -28725 -21074 3834 -11030 -37510 -32306 -24896 -48139 -42579 6462 21713 16171 6307 7739
11101 7739 -18607 -29602 -35022 -29181 -11257 -7467 -5523 -28970 -46352 -53829 -15310 -32064 -18049
11088 -18049 -8404 -27315 -5221 -12066 1099 39643 53145 32004 -16970 -35812 -7923 20343
11076 20343 6159 -5926 6830 37259 49639 46999 37081 -2343 -17106 -25057 -20597 -34671
11064 -34671 -27063 10925 14113 22318 5494 -42939 -67602 -77455 -51702 -9359 1982 20830
11052 20830 33788 7573 -23864 5128 22216 -9257 -43835 -73698 -73216 -34874 -15766 -40136
11040 -40136 -40000 -31633 -43989 -15942 -16587 -27345 -29239 -44537 -84317 -88410 -42220 -5544 -19970
11027 -19970 -67986 -86420 -70805 -63052 -94326 -79686 -59039 -27659 -23922 -16018 -39009 -59006
11015 -59006 -50859 -2185 37631 13422 -14963 -28256 -36637 -63791 -67249 -52886 -42573 -7850
11003 -7850 25827 36650 26366 9521 -9767 -2222 2440 3001 40660 17186 -15243 5132 19886
10990 19886 8242 1025 4349 -11179 -53290 -33529 14006 34557 16788 -11603 -30790 -61013
10978 -61013 -52066 -40124 -25548 -17066 -24428 -8131 4416 7510 -11690 -60845 -89660 -93921 -62744
10965 -62744 -60558 -83216 -80344 -36662 21131 33927 31974 6502 -29694 -47360 -14396 -21025
10953 -21025 -52327 -31053 -10065 -18404 -62661 -69309 -81097 -84338 -71567 -30318 -10410 -540
10941 -540 20067 36719 28182 13411 578 -15358 -49582 -25142 2535 16019 -28718 -6948
10929 -6948 43146 31672 11181 7878 -18321 3181 26612 38129 51772 44516 35308 37219 26311
10916 26311 52663 74809 64829 38365 -1377 -51107 -25993 -23217 -33905 5635 22437 12974
10904 12974 -8228 5794 11902 32624 52325 18594 13514 8027 12224 -4477 -29933 -35758 -20470
10891 -20470 -35191 -35931 -27025 -4342 14185 -11525 -44653 -68474 -75792 -58071 -53580 -30224 -24170
10878 -24170 -8191 1910 742 -27138 -35514 -51875 -36386 -18139 -8770 -28640 -36108 -31849 -70555
10865 -70555 -81214 -61003 -45251 -45974 -30822 -24812 -10999 2061 27646 45756 24799 -3284
10853 -3284 14680 15930 -10311 4062 47698 28444 -17880 -3694 5880 -14634 -43711 -51730
10841 -51730 -34645 -19536 -805 42898 62048 32571 -17203 -42010 -41331 -31209 -38610 -26025
10829 -26025 13277 -4267 -9715 12600 18160 44669 29200 3754 -2508 -8320 -10752 -16494 -29679
10816 -29679 -50908 -57288 -67343 -27050 6360 -21028 -57442 -85583 -71307 -47865 -7603 18229
10804 18229 4918 -7534 -4655 -11247 -6826 -13674 -18270 -8733 32639 45419 31425 -3999 6539
10791 6539 22691 22241 -6148 -42810 -17218 8279 6010 -1880 -29218 -49658 -24039 -595 3298
10778 3298 -35169 -49298 -55584 -45798 -22687 -53304 -57819 -21105 276 30198 27634 8234 -7412
10765 -7412 -16659 -14736 -18054 3922 -16059 -23278 -6924 -2478 -17138 -25883 -15416 17413 33673
10752 33673 32250 20922 21824 13264 11955 -3874 -14839 -17078 -44377 -77704 -58041 -22250 -7979
10739 -7979 -24784 -14376 -42592 -62233 -52621 -44596 -9176 36796 33589 15824 4645 -28430
10727 -28430 -39987 -33257 -52260 -30348 4127 -1477 -5215 1011 -1900 12840 22619 -3178 11503
10714 11503 49589 38221 26692 45985 40718 44459 42403 22188 19757 45026 36623 11586 -1109
10701 -1109 18969 16270 -23450 -13595 -22033 -13155 -36416 -33484 -47791 -57086 -52386 -48158 -34620
10688 -34620 -66945 -115081 -95263 -79182 -73925 -59983 -48149 -33625 -10565 -34529 -36553 -25954
10676 -25954 -13083 -5562 -36764 -71164 -47558 -8119 17915 54453 53679 38326 -6743 -29918
10664 -29918 -12745 16502 44023 4042 -34354 -12486 11688 11154 -39760 -54237 -39194 -10048
10652 -10048 10272 3725 -3655 8424 30374 25343 -2086 5331 -21985 -10323 -14825 24589 28354
10639 28354 -4486 -19437 -19333 -2279 4982 -35415 -26495 -328 -8353 6584 -6699 -32529 -17074
10626 -17074 -13982 -11523 2047 9482 40896 55439 36121 3056 4556 -22347 -13181 -428 -7047
10613 -7047 -23714 7784 -577 17424 48832 69139 37625 13808 -5084 22513 33909 33790
10601 33790 39487 32581 28775 5789 -15592 -23286 -6927 -31557 -59283 -63523 -10670 4309 -23124
10588 -23124 -38355 -49580 -24074 -5121 773 -5665 3228 4489 -19197 -35755 -16812 -15235 17305
10575 17305 21746 788 2772 22897 28435 17832 -4304 -27681 -21072 -10386 4778 22990
10563 22990 37862 11093 -7271 -29389 -35533 -36707 -13890 3624 19754 4635 -5290 -39727
10551 -39727 -28936 -6793 2143 12224 10762 -38980 -66078 -40820 9971 51034 45784 24398
10539 24398 33493 11895 -15625 -39801 -52475 -27024 -27029 -48957 -30840 -13391 15123 20915 19914
10526 19914 29222 25127 -20711 -64748 -32837 -21813 -15591 -8378 -25269 -37456 -32780 -17784 9549
10513 9549 21958 2446 -16204 -17886 6462 14968 621 -34961 -14524 13566 10384 15936 -7267
10500 -7267 322 30616 11428 -13328 -11492 7069 1842 -7622 -23398 -29050 -17188 8755 -1389
10487 -1389 -12688 28910 40696 3842 31534 50348 43970 64896 38565 35554 20463 -11740
10475 -11740 -18330 -485 -7892 -13888 -20380 -2851 3028 -34232 -30995 10315 34821 69485 41833
10462 41833 -5846 -26092 -7487 40926 55119 37714 23578 16680 19338 21681 11838 32968
10450 32968 47666 14916 -3344 23868 15739 19021 5829 -3578 35332 22357 2565 -47221
10438 -47221 -90222 -65834 -51664 -44575 -35087 -59863 -67989 -11254 254 -21657 -5251 10719
10426 10719 44409 8982 -17554 -8931 -37758 -28983 -6331 -12126 7193 -2061 -17950 -33894
10414 -33894 -35955 -58409 -89433 -63049 -1230 4936 -39536 -32122 -34297 -43378 -51969 -50058 -55342
10401 -55342 -37110 10707 23833 44675 27673 16581 18457 47636 48774 3911 -25228 -15086
10389 -15086 -9292 -14200 -33659 -8362 -4237 1656 2218 -2700 -1650 23893 691 10355 46595
10376 46595 16384 -4221 -514 -12927 -5644 -1003 15467 12966 1602 8875 34431 39190 42715
10363 42715 45054 14514 -9049 4274 27564 25135 58407 58951 35823 34697 17041 9959 15647
10350 15647 15989 17690 22023 17514 45886 45328 31760 37518 19804 3493 -22031 -19859 -6506
10337 -6506 14147 7737 -3105 -1202 3637 25879 42055 29362 3853 145 10152 12788 4022
10324 4022 11315 18784 26064 -9446 -60293 -54749 -53733 -61968 -35166 -11177 12667 -9439 7794
10311 7794 67877 48686 -25243 -59277 -37036 -40010 -6624 -3136 -24846 -51818 -51643 -50152 -42281
10298 -42281 -14898 371 8177 33816 81712 62662 36015 23972 9741 4731 -15432 -11007
10286 -11007 -18280 -901 9480 13915 14671 -15894 -29508 -14508 4244 533 16042 15026 5712
10273 5712 -19153 -54222 -58903 -50781 2720 7492 -12010 -10943 11981 21146 1019 -26793 -17189
10260 -17189 -2207 21319 28031 17330 37223 47631 2673 -17978 -15653 -13083 4985 16580
10248 16580 8306 -21505 -33493 -53768 -60330 -24318 -28678 14342 63115 60135 37259 8326
10236 8326 -27125 -40730 -48685 -39596 -42443 -43614 -16072 -5355 -37632 -33880 -34910 -17163 -9338
10223 -9338 -25847 -41970 -47902 -19204 -29045 -21374 -8589 -2831 -29691 -10588 44500 63339 47837
10210 47837 28840 36966 23822 14193 -12872 -13406 6275 27520 15276 6408 9853 28522 34558
10197 34558 -2284 -25660 -49681 -80319 -51650 -3398 -4716 -35484 -58493 -39106 -24677 -13981
10185 -13981 -18345 -3339 16345 10689 -29883 -24157 -15837 15126 13014 -5564 -23312 -14236 3708
10172 3708 -6016 -32735 -21599 -22181 -33227 -30878 -31334 -606 -5937 5971 16004 -333 8488
10159 8488 -23419 -59583 -31523 -6895 -30751 -22434 -38591 -14125 -13539 -15005 15927 29979 21491
10146 21491 -1918 6401 18282 33800 -1408 -32851 9584 7385 27344 34807 33425 41608 63383
10133 63383 75062 38852 -10734 -31869 -29417 -43300 -30861 -5114 11079 21678 26150 16212
10121 16212 5083 8103 5863 -3140 26262 66436 48879 25003 17883 35827 49154 39374 -3760
10108 -3760 -6859 -18614 -15520 -19557 -10181 3943 -17746 -4314 5027 -7932 -8109 16855 9761
10095 9761 -47112 -52365 -39073 -17100 -3264 6461 20385 22093 37939 66129 82539 24907
10083 24907 -49005 -94308 -85186 -25066 20985 8150 -35854 -53493 -72130 -66155 -60979 -61768 -87070
10070 -87070 -98894 -61077 -27892 -43005 -25129 -12120 -36582 -2442 14056 31757 25945 21691
10058 21691 9504 -21828 -26968 -12110 -18284 11160 30406 22465 41686 40018 34234 25719 16003
10045 16003 16901 -20548 -14788 -12250 11451 38342 47421 31610 60 -32208 -38614 -38282 -16150
10032 -16150 -15396 -8211 9610 -11092 -30316 5518 31301 28145 29404 10283 10170 23112 32579
10019 32579 19259 24823 25206 26729 -13529 6963 41459 35528 35833 20312 -7843 22446 18627
10006 18627 770 5766 25466 16609 17291 679 3680 35560 6809 -35381 -21978 5640 31738
9993 31738 12795 27226 26830 10179 21 -5115 8953 14141 16319 -11327 -31231 -34370 -38237
9980 -38237 -52236 441 29639 28648 3102 149 -12896 -38214 -61595 -71722 -77418 -70915 -49609
9967 -49609 -45998 -50787 -70394 -80449 -45530 -20610 18419 12364 -7713 -42737 -11968 -12853 14699
9954 14699 41986 56273 47420 1074 17365 64468 56999 32418 23944 30150 25478 44406 23700
9941 23700 44185 68927 54034 31860 41302 87462 79442 43656 -9976 6975 27504 28556
9929 28556 42833 55459 24272 4775 8451 -1348 -5897 13176 49513 58442 39858 25452 15591
9916 15591 -19840 -20014 167 15840 -256 -13 28309 39404 46066 42360 42214 42457 35670 40037
9902 40037 34467 26225 21520 15944 13014 -17741 -28064 -26196 -15633 -45290 -34982 18949 49671
9889 49671 45357 43000 39984 50678 40463 28701 20089 -3447 3880 18577 25593 38111 35874
9876 35874 7338 -29049 -18846 -12356 -28555 -28469 -14705 7509 30951 10115 -40295 -54311 -65433
9863 -65433 -63974 -56082 -35899 -8463 -19693 -9775 34518 66390 56805 88272 109601 145287 207751
9850 207751 285011 293082 268393 212132 175842 180192 147195 98593 76307 57529 48185 16543
9838 16543 36057 28743 15474 -9121 -14843 -4247 -9301 -8246 44442 48653 19341 26863 43292
9825 43292 5272 -31194 -49405 -32963 -18806 -10825 -16206 -16810 15705 5186 -7 -32491 -67430
9812 -67430 -54893 -57900 -51540 -52284 -67379 -72644 -60129 -43151 -26433 -20768 -1329 22941 20435
9799 20435 6699 -27836 -34273 -18062 -30162 -23078 -25387 -36521 -15999 -23561 -36305 -14438 -12840
9786 -12840 -35785 -38696 -29537 -38687 -68577 -69450 -51104 -12317 16018 58529 44652 13057 24631
9773 24631 30200 56816 55488 43340 16196 6983 9116 14292 23321 40134 11063 -8330 -18393
9760 -18393 -21984 1961 30281 25537 -6036 -6319 2791 -1184 -15006 4665 28602 33885 6965
9747 6965 -9474 2283 30876 47907 -10217 -13527 3174 7575 24260 57436 92764 109151
9735 109151 47457 -4075 5064 -6186 -14624 3266 36307 62667 9666 -10331 19559 32524
9723 32524 22991 -18159 -28283 -3924 39470 34736 1434 15815 32234 21700 38858 31183
9711 31183 -23122 -43614 -52838 -62883 9085 11950 -13491 -7867 -13183 12437 21233 -15662 -24163
9698 -24163 1341 29467 47145 42574 5982 27838 33800 56234 85795 62093 63127 71524 39324
9685 39324 27846 33514 17246 -17143 -9192 13670 -10714 -15072 -1646 23232 26401 997 -7276
9672 -7276 -23875 -20140 -22461 -12060 -8451 1365 26750 51210 11081 -25188 -18576 189 -4135
9659 -4135 -9778 -3197 -1413 19929 58631 61326 27515 16361 28666 24710 10887 -15829 -5677
9646 -5677 5297 -8881 2759 15790 16560 15258 -23954 -22126 -25082 -1270 11778 -12101 396
9633 396 48114 63788 67456 39697 31287 732 -37084 -27968 -6340 4524 585 -25781 -71579
9620 -71579 -113179 -71618 -55927 -61106 -17944 11050 24100 3982 -27469 -36369 -24822 4996
9608 4996 33174 47489 35919 -9891 -32104 803 44439 51649 20364 -8717 -31028 3371
9596 3371 29382 821 -14859 -995 24108 24816 753 15865 4160 -6070 -10823 -23657 -2809
9583 -2809 -2949 -18858 -13180 -50491 -40406 -35595 -39157 -47910 -19800 18376 29045 -14459 -3883
9570 -3883 22036 31553 42623 27787 6661 2865 10809 2394 9455 42051 38322 7042 12321
9557 12321 17134 -2563 -17297 -55821 -36792 15736 26201 9102 11756 42175 73745 72233
9545 72233 41272 3136 24833 75984 101294 89700 68871 91655 76490 10749 17977 -6497
9533 -6497 -23541 7450 35598 24713 20500 39272 70556 91447 103354 99403 86317 67373
9521 67373 54959 13116 6783 24782 43470 31824 -30985 -29065 17977 62422 76156 67881
9509 67881 13764 58973 71617 52468 17170 -13990 -8063 35621 71009 62591 39689 26362
9497 26362 54136 65510 75772 59692 29035 32732 36264 26078 58219 35907 54112 66200
9485 66200 30981 30047 51951 75221 75931 70171 21598 20331 53311 44613 44532 33541 7235 12172
9471 12172 9996 13626 -3115 -16534 -11965 -24803 9550 44709 42031 31348 51799 73322 66890
9458 66890 78895 61197 35914 34166 36112 22846 37088 61986 69603 55974 37787 67165
9446 67165 75002 89666 83847 85300 85128 73666 31908 28088 42479 33484 23565 22839 29550 61924
9432 61924 54711 41334 29572 58661 59317 62046 46762 41439 17125 16766 72315 91101 107665
9419 107665 66592 48368 40642 32255 25285 11762 7245 3092 38297 68961 56831 48986 16022
9406 16022 -5443 28925 66546 117505 123803 85352 63591 87812 108820 121973 97484 74209
9394 74209 67496 52599 35121 59271 34175 15119 13358 25732 35770 32136 34599 19660 7727
9381 7727 30822 54298 42638 7782 6333 55185 48437 28922 57422 85267 88291 53570 94808
9368 94808 95443 93966 127529 156561 160191 206429 229667 255034 248243 268711 348816 441794 538861
9355 538861 653524 745830 882249 1023445 1103431 1199753 1303646 1376780 1377588 1293638 1193130
9344 1193130 1087786 927407 839267 741848 627574 529609 461331 423473 379092 343807 300678
9333 300678 216756 211788 195499 187626 144674 139162 159139 171024 155284 143376 138934 144151 105268
9320 105268 90750 46766 52455 46088 19096 33817 36126 25618 5495 12967 37083 86461
9308 86461 95750 75438 76850 61518 65173 56702 52441 78376 78171 61411 51738 74516 89382
9295 89382 63782 66176 53432 52443 41489 8212 27369 48024 92422 117834 115168 71405 13516
9282 13516 18132 38466 47966 40100 29227 63441 104042 97454 80570 66863 40982 53837 49182
9269 49182 52967 38839 19649 33770 49716 61863 66681 59516 84314 73215 68555 109021 101936
9256 101936 103975 123872 142144 144947 144789 125684 121953 138665 169422 195939 191403 171584 167389
9243 167389 142221 95471 98090 119428 130974 163519 143761 97270 98139 89704 109024 120368
9231 120368 152307 153289 122181 117377 137812 167720 142171 107285 104101 63222 15892 51860
9219 51860 85006 88605 109303 101333 73807 91719 115341 166440 185177 183853 204017 242181
9207 242181 267819 248887 227328 264882 336318 350454 321480 282614 311236 319190 333206 308969
9195 308969 289262 276916 250388 206884 149728 119271 104060 73825 81270 128283 158788 188858
9183 188858 187336 157495 148710 143820 126392 111330 108468 122854 109261 89693 92641 122537 143488
9170 143488 164552 189364 209676 211415 172442 130551 169651 172019 187698 195524 168494 143831
9158 143831 138528 143062 158372 148536 129847 120371 160128 145363 117825 113372 132783 118786 104148
9145 104148 68317 41495 35990 65524 124061 185886 229209 322150 409211 462265 494650 498849
9133 498849 547265 561151 603410 646460 731065 832681 948387 1105988 1251693 1413648 1666199
9122 1666199 1970985 2364387 2889271 3655453 4800864 6378561 8168093 9489152 9679164
9113 9679164 9045497 8202179 7321479 6368935 5371508 4462321 3715659 3219143 3019291 2910117
9103 2910117 2767438 2588682 2449782 2280556 2102298 1873089 1646761 1470638 1333520 1200796
9093 1200796 1097198 1035784 943316 874074 778246 723710 708133 705571 702406 665258 622594 558485
9081 558485 484144 425267 355388 337416 381197 486820 580260 610927 580871 541426 566973
9070 566973 599114 575115 562246 536986 503694 472319 457833 457262 460452 476680 481639 481673 471419
9057 471419 490437 532678 557173 536208 491789 500937 545048 565944 568164 574441 552340 526689
9045 526689 533629 553862 555304 567508 598558 628240 642344 624117 613353 681678 721954 721281
9033 721281 724788 714240 723190 728615 738691 737131 763157 790980 839358 836127 861730 898833 906491
9020 906491 911741 982379 1014517 1056880 1124183 1161159 1211009 1267651 1274569 1308876 1378851 1477577
9008 1477577 1571797 1636006 1695810 1729188 1768165 1840561 1863577 1882139 1900473 1966887 2006537
8997 2006537 2051855 2094780 2154542 2231568 2331217 2432405 2564771 2691116 2777833 2877090 3010975
8986 3010975 3170594 3327543 3510881 3680146 3879745 4106495 4362343 4643112 4936862 5334905
8976 5334905 5826050 6377112 7008531 7702196 8528235 9486560 10593479 11913652 13540938
8967 13540938 15518830 17774884 20362520 23474389 27060359 30980601 35494651 41131281
8959 41131281 48563733 58188066 70760121 88272838 114191005 153822215 213689484
8952 213689484 293874388 365436229 380094101 345782494 304704104 268425658 228432076
8945 228432076 182639473 139048559 104989380 81352960 65431648 54426236 46557304
8938 46557304 40747663 36131578 32084241 28474015 25366066 22691809 20299127 18158431
8930 18158431 16247188 14596098 13152288 11921419 10865463 9975797 9226242 8518776 7872207
8921 7872207 7282940 6780833 6308439 5889990 5512738 5204021 4910678 4569265 4252977 3976684
8911 3976684 3752391 3522216 3319015 3141180 2953335 2789445 2584830 2395167 2253294 2137468
8901 2137468 2019616 1926881 1869703 1824922 1741956 1662657 1616998 1584702 1546521 1499913 1465104
8890 1465104 1453620 1431878 1361192 1264005 1207175 1148716 1099522 1060063 1017617 985298 995817
8879 995817 986805 941423 936641 926823 916045 854586 818950 838928 828916 795571 738381 663223
8867 663223 603073 534801 472488 361199 222755 129534 148915 161106 204024 298691 378079
8856 378079 423631 447202 447604 487924 503047 521188 535750 567149 603282 629776 646461 654799
8844 654799 663319 642692 633952 677702 694244 671507 624200 576721 515838 468225 475207 501917
8832 501917 598030 696148 749348 754444 739611 766079 839002 965944 1068678 1080581 1050912
8821 1050912 1016071 1001393 1033238 1027482 1008379 967681 951257 952887 916498 880004 870589 871347
8809 871347 908756 945241 945213 919999 932489 986545 1031067 1040969 1059592 1075359 1108199 1174619
8797 1174619 1307217 1487158 1627722 1622095 1580158 1553831 1503811 1453705 1391672 1359840 1347865
8786 1347865 1330471 1300651 1286217 1262760 1230081 1283420 1334095 1399885 1420469 1436749 1466506
8775 1466506 1505333 1532106 1536821 1596386 1649241 1694118 1758315 1809357 1867510 1937648 1974632 2014928
8763 2014928 2057939 2100279 2220130 2354219 2469777 2559260 2638860 2709865 2808309 2937464 3051106
8752 3051106 3130421 3206316 3368143 3575237 3770867 3965211 4191908 4434833 4710238 5094836
8742 5094836 5530342 5900548 6133517 6323034 6578762 6852141 7118147 7476330 7897721 8424149
8732 8424149 9062036 9844419 10764695 11759565 12909608 14265713 15842482 17684049 19829492
8723 19829492 22363538 25411871 29060233 33323884 38326058 44086469 50708272 58680647
8715 58680647 68614694 81515561 98710004 122110269 154806984 201119777 264859462
8708 264859462 342981843 413355813 442028443 423965612 385342401 343168857 297420657
8701 297420657 247090740 197503647 155412713 123476886 100426459 83775480 71311419
8694 71311419 61679438 54092297 47867701 42490920 37764480 33712641 30222019 27183446
8686 27183446 24498898 22127906 20039039 18242797 16691293 15334574 14159163 13062856
8678 13062856 12067253 11207760 10388780 9670040 9023906 8446915 7995774 7541924 7047254
8669 7047254 6601201 6180782 5788919 5445178 5097389 4837925 4602989 4390677 4184642 3971906
8659 3971906 3774341 3583154 3401330 3268561 3120162 2973529 2827540 2710116 2580176 2463644
8649 2463644 2363448 2252441 2154349 2046774 1948486 1901506 1795410 1680298 1591904 1551018
8639 1551018 1531660 1490563 1471925 1429767 1401834 1365289 1337274 1307274 1284005 1240539 1198246
8628 1198246 1155071 1124536 1068954 1038113 957450 911002 921312 941012 932396 934945 934321 904299
8616 904299 875287 861791 852050 818319 764273 760634 775660 810069 820608 811047 808403 814315 839049
8603 839049 857489 857164 858083 816308 743643 745569 723299 735846 741987 733940 733184 760983 757773 775432
8589 775432 740304 727705 722605 662836 605522 589133 593313 612710 697193 773057 810017 816227
8577 816227 831733 851840 833603 815072 779334 741345 687105 671451 609856 564310 552333 518551
8565 518551 551990 555710 563429 621941 669865 731378 792592 835085 904039 964646 1051502 1174716
8553 1174716 1305443 1546495 1803313 1980300 2065584 2114535 2141937 2092713 1992722 1895323 1759799
8542 1759799 1594187 1405703 1250420 1112416 984054 868861 787235 709508 656811 574730
8532 574730 523063 499842 469287 411135 367060 313073 319111 343779 338229 325022 308209 314969
8520 314969 311648 270751 312618 413999 502236 558880 521546 504245 481894 473456 421471 436574
8508 436574 443345 431416 421368 420278 389186 373905 363287 323937 266163 259815 259737 252638 236364
8495 236364 245547 237927 208269 189073 212934 238401 247572 267254 276113 291677 286133 236013 235166
8482 235166 227463 207356 185287 193777 195328 172307 189316 214936 201123 207307 206066 203008 187097
8469 187097 168191 147152 147231 152113 180629 209579 227509 276510 289712 261381 220221 184314
8457 184314 179703 156565 141533 150128 158630 141942 143315 131395 145316 148364 121885 90341 89698
8444 89698 78745 105866 125952 157857 202700 170750 188540 171708 131884 133348 130006 106108
8432 106108 108744 111304 147924 176560 153620 123323 126443 88983 77666 100050 83000 64359
8420 64359 76876 87405 109913 124313 116687 83620 75558 72862 64004 59589 82563 93929 71614
8407 71614 66757 25789 -9004 -14732 7917 32185 9523 14707 43271 66168 86733 96344 76878
8394 76878 77488 93356 116583 154095 139681 99766 94813 97122 79526 69208 60211 88596 75030
8381 75030 75379 106032 134560 117852 116705 114654 108131 110500 130121 113333 72302 70398 56117
8368 56117 76474 72550 67673 71802 91032 66978 49359 68127 90912 118918 117942 61547 49706
8355 49706 60681 46986 45123 44606 75915 62705 67916 98197 103029 71277 50384 61115 61805
8342 61805 97850 112325 105776 104837 99082 54526 97420 146674 153454 158374 148770 132058 126781
8329 126781 134469 117553 159223 177609 187792 202717 212648 231487 246846 282394 311606 348297
8317 348297 382388 366060 385428 450820 500658 543683 608283 744084 868871 997700 1190697
8306 1190697 1350311 1529624 1662393 1749282 1770796 1706048 1631315 1503616 1328020 1160020
8296 1160020 1010577 895270 780546 671302 578307 505116 460630 435810 403996 358514 316835
8285 316835 284684 251100 259799 266613 258515 222389 185239 162368 172491 159244 121918 121122 104551
8272 104551 96036 85600 94445 124056 117502 109813 90279 102913 119345 73687 4016 -61609
8260 -61609 -63459 8237 21665 33151 21864 12631 9493 14514 37976 79082 56613 44572 41951
8247 41951 43295 17539 60668 78742 97295 102411 127793 116026 91350 104238 97031 76273
8235 76273 92399 111004 90688 87226 73249 89526 55721 30103 39180 57512 96359 125166
8223 125166 105268 79565 42549 55804 68863 43297 38491 18302 15427 15552 47854 49973 71036
8210 71036 98902 87093 59268 45612 33264 23744 23064 35740 31832 -3944 130 18862 22543
8197 22543 13669 33350 44122 71158 72509 53035 17285 15835 61401 54404 35346 54120 72746
8184 72746 85936 98236 100976 82044 49988 53085 61069 63484 52994 13254 7461 -14114 19041
8171 19041 78542 71143 72056 73932 54245 63633 76584 73287 55622 52171 80474 100992 89179
8158 89179 81835 53438 52767 65400 93729 102179 72623 20261 25745 12096 -26096 -6736 -3830
8145 -3830 10865 21276 48341 51978 70708 55857 40369 21467 19893 19884 36939 53040 68254
8132 68254 49897 -5288 -30208 24346 37342 38840 29398 46731 39528 15009 22054 583 10785
8119 10785 27955 22021 30454 48974 78873 82017 63514 42414 44156 58752 57086 52720 12155
8106 12155 -15740 -26213 -25958 9987 35394 29442 34472 48110 101025 88038 69721 75659 76169
8093 76169 71668 47065 24044 47919 57460 50101 55210 43185 45978 36698 33836 45780 58703
8080 58703 62800 18998 -6183 17012 22730 -1908 -9870 -19987 -9588 -7635 -12465 0 26325
8067 26325 25570 19736 34054 11426 2419 1839 -13410 -3809 23450 49425 56008 44699 38405 75433
8053 75433 92461 78780 59984 83103 96579 52056 20801 28169 20809 38022 41384 39358 30519
8040 30519 12030 40395 8689 -1764 52964 78901 93235 75117 62761 3552 -12072 628
8028 628 756 24695 6873 12338 9426 -12647 13843 25653 24324 -1341 -20051 -8444 -13831
8015 -13831 5700 52828 48903 45010 37366 41327 63657 37381 38813 76783 97717 103322 94835
8002 94835 23279 2846 -10354 -1348 32836 32160 47730 46453 64890 95082 131660 101251 73511
7989 73511 72880 94149 83502 62893 80252 81865 98615 87491 62022 41923 79708 86764 93131
7976 93131 81192 79291 99574 121971 134012 112415 109437 123139 71578 53415 63501 89945
7964 89945 122148 134354 130871 117816 127977 134745 120360 86624 61571 61865 50125 88445 71632
7951 71632 27820 27478 29566 43826 50085 51937 62497 68503 68626 87306 67172 83947 121658
7938 121658 80838 -6014 -36664 -11511 24936 11599 2383 -18615 6565 15085 47142 82190
7926 82190 67659 65222 65892 54372 42898 44308 38091 43859 86010 108467 93682 110210 136609
7913 136609 117642 118106 117780 63005 41044 55049 63936 44444 29883 43176 39236 67975 61037
7900 61037 62690 24887 16412 44993 58170 21420 -21505 -16249 -5750 27014 65141 76811
7888 76811 91720 64022 31057 18999 11654 45450 69629 50804 24491 24209 5662 5904 7591
7875 7591 15289 19597 28569 40561 76653 85873 97260 91535 65313 53448 19904 -17416 -12338
7862 -12338 21838 30977 37272 27625 9048 21547 344 -46807 -55013 -33816 -20606 -5540 12206
7849 12206 23765 21138 6935 12214 11620 -8509 9279 16661 7193 -2509 -7074 13268 2221
7836 2221 -5497 -17126 -27913 -29348 -31834 -2402 -7317 -13337 -11988 -5910 -25623 -62021 -33141
7823 -33141 10848 34277 34873 38604 20855 -8564 -9905 -15410 -44621 -53465 -43855 -49881 -27702
7810 -27702 -25413 -8604 31810 11488 1982 -1246 2126 20920 24083 10944 252 -47352 -64249
7797 -64249 -26289 -4280 16950 22398 -2338 -9683 -3204 -32978 -70521 -87949 -59024 -29046
7785 -29046 -880 -1895 7869 -26267 -13143 -27017 -37455 -39152 -34236 -23579 -19886 -14342 -466
7772 -466 -4213 -14257 -28888 -25685 3677 9266 -13411 -13953 32944 49572 37224 14605 29317
7759 29317 13061 31191 26159 48149 40374 -2266 -11339 -19998 -32694 7210 36054 22550 1585
7746 1585 -9507 -7001 -31389 -9183 20526 47119 62413 56101 -6348 -14982 7550 26645 11984
7733 11984 -11941 -36235 -3028 31887 77045 35380 7586 18334 23108 -12184 25150 70418
7721 70418 78779 88928 75888 50899 27752 25438 11789 -6194 -34150 -72154 -78351 -59063
7709 -59063 -41127 -27544 -14126 3495 3181 63551 109111 102668 85976 72425 29825 3191
7697 3191 -2613 -14029 3766 13038 52061 52060 58482 113624 111490 38628 -29352 -20489 16735 16234
7683 16234 11442 15704 20629 19783 -2054 3396 -32770 -10867 1428 21953 3645 -3763 1638
7670 1638 -750 5193 2474 -4847 27259 13608 12985 45659 47236 39340 15802 -3203 3683 11142
7656 11142 22163 28418 48204 22769 17036 24899 30151 12031 -12586 -25010 -41809 -48089 -30528
7643 -30528 -5028 12006 5795 -15267 -28376 -40422 -42547 -31327 -33515 -47773 -46127 -5603 362
7630 362 -4108 -3109 -8793 2283 21179 22454 53261 69557 62875 58749 62314 58035 48168 7592
7616 7592 -32076 -37049 15306 29837 26554 12844 4491 30087 20517 22471 33964 44181 34762
7603 34762 23466 -14207 -21818 -7066 -21153 -14738 -1597 -14098 -17893 -17897 -24405 -45784 -39699 17108
7589 17108 36213 75082 66157 36351 13190 4700 -2510 -15425 -4425 12483 30196 42064
7577 42064 31762 36999 30581 -21875 -23574 13537 20494 47598 34451 11129 4777 16978 13655
7564 13655 11910 -26703 -58174 -49304 -14451 -1207 -34283 -31678 -9736 28243 19398 -6569 8003
7551 8003 13757 -25141 -27666 -26076 -52094 -35534 -10889 -1623 -53374 -53072 -29123 -3734 14290
7538 14290 -8907 -36773 -62079 -70165 -4248 15942 30960 53807 62376 33275 17932 25586
7526 25586 33240 49564 91342 65889 14529 20121 32399 4110 -15614 -19414 -35297 -37823 -27522
7513 -27522 -37699 -24356 -28117 -9805 -27053 -51238 -32605 -29799 -23897 -17284 3165 17845 1799
7500 1799 15080 -6123 -31752 -33355 -15555 -19201 -5523 12015 75 2028 490 2067 19938
7487 19938 36038 32712 40378 59003 42825 32808 19147 30837 24797 10775 -2597 15869
7475 15869 35213 67003 76132 35152 32975 17340 -1373 6124 -8761 31533 11151 -19602
7463 -19602 -14212 1793 -9526 -34286 -27680 -15861 12409 38380 64629 102160 95820 31306
7451 31306 52766 38295 14021 13029 -4529 -27733 -2032 46910 38544 12701 23329 48309
7439 48309 17316 -9478 -5113 -19339 17327 2947 -33414 -33732 -34899 -66896 -96393 -77848 -68019
7426 -68019 -49362 3164 43726 16871 9888 24466 29410 1387 -8038 -8527 3545 4328 14067
7413 14067 -3706 -2724 -16934 13162 29138 25422 -2044 -10436 -13120 3665 23787 -1023 -5357
7400 -5357 -15698 -13722 2593 15803 23334 49945 71413 51763 10352 -27729 -48232 -7331
7388 -7331 -12645 -42669 -48951 -29460 6781 7530 -2611 -977 6715 40815 33259 17424 20810 35694
7374 35694 46454 40448 26463 17516 18238 41789 45111 31861 9380 -4907 -25450 13371 8331
7361 8331 -12150 -46135 -35870 -17497 -10418 -27730 -5296 7414 1540 -7422 -5574 -2963 -9333
7348 -9333 69 29672 37007 36164 3919 -43936 -34463 -28301 -32192 -32623 12411 -9683 -38510 -43384
7334 -43384 -45597 -65907 -50548 994 22168 32495 -38519 -50621 -31698 -42212 -32402 -1080
7322 -1080 -1007 5443 17630 7954 11701 -18327 -28088 1038 24871 21330 -7730 -23882 -30203 -11861
7308 -11861 -11177 -3386 11377 14134 1522 -14310 -28305 -14989 14941 -10057 -32632 8702 18527
7295 18527 -5167 -5074 11998 24678 9612 -11968 -28212 -30510 -20380 -14452 6302 32107 3896
7282 3896 -49758 -64693 -54152 -48636 -16779 15389 -25283 -57652 -9240 24298 66769 60675
7270 60675 27443 20842 13328 31309 53500 9276 -708 -2794 -25773 -7640 -3646 -21949 -37666
7257 -37666 -63254 -36674 -15612 -32933 -61292 -82777 -76954 -35629 -37117 -21260 -17614 -43792
7245 -43792 -36864 -11411 -19444 7899 42873 16194 -10136 -373 12660 10314 19979 24622 -18233
7232 -18233 -50730 -17109 1410 -16086 -27317 -14686 14918 57275 34356 -8096 21469 14187
7220 14187 20032 26451 14291 20943 41931 32324 52531 44566 27897 19098 36862 23276 -5132
7207 -5132 -8733 2712 20821 16758 -17696 -80467 -69773 -58523 -74088 -62215 -48887 -19052
7195 -19052 -19437 -8042 -19070 -16765 -16751 -12488 18450 10382 -10006 -4241 -11561 -12694 -36161 -52638
7181 -52638 -58875 -75664 -96224 -51603 1738 -322 -41999 -53229 -74015 -45505 -15581 -6361
7169 -6361 12300 22986 4664 -4058 31411 51355 9210 -8857 -21588 -30786 -17412 11986
7157 11986 18297 27412 34308 35211 22381 54024 56658 42594 28095 35318 4411 18471 37789
7144 37789 24978 15767 -6030 4549 32331 19000 -27110 -32016 -36349 -42834 -22971 -26024 -20510
7131 -20510 1987 17713 23373 25100 13240 -15185 -34411 -72801 -70718 -9212 2383 -18629
7119 -18629 -37994 -31145 -17476 8338 6449 221 -12906 -7760 -18342 -12307 -19186 -31289 -41235
7106 -41235 -62304 -40712 6104 41859 33346 15332 9420 1445 -8114 -6458 -32532 -39829 -22135
7093 -22135 4444 18557 38343 28887 17025 9465 -11866 -42574 -15835 -4332 -4888 -16088 -22778
7080 -22778 -3521 -14985 -54536 -38663 -15334 -47695 -63863 -49127 -8242 -3424 -26163 -51428
7068 -51428 -24627 4917 -52279 -53050 -34381 -20696 -33682 -30492 -29376 -55839 -59721 -19982 -981
7055 -981 24172 37718 33510 -2600 -10250 -7719 -5888 262 -38878 -52047 -64112 -52107 4250
7042 4250 32330 22446 24921 30215 -3670 -11425 -22102 -29276 -16503 -20262 -23581 -34480 -49749
7029 -49749 -30752 -27541 -11341 -4295 -11560 -11604 18490 54009 54181 22707 -9209 -29478 -7958
7016 -7958 34714 59507 56246 41607 14576 21462 5641 5126 -11110 -5593 -1075 6794 6475 1571
7002 1571 1602 30386 40914 33345 26661 8327 24273 36571 31024 23021 -20781 -36264 -18874
6989 -18874 -3699 5184 -8404 -41815 -46984 -27073 -2739 1738 -28478 -35685 -25278 -26978 -19235
6976 -19235 -45819 -60773 -65672 -39676 -7055 -5127 -4533 -1021 12085 25346 28635 18176 -21637
6963 -21637 -63095 -64604 -25477 -14643 1682 8947 -14667 -9787 -35174 -32379 -48183 -52920 -67558
6950 -67558 -36995 3624 1873 -5949 -30652 -8369 23500 -2888 508 -3025 -9590 -18532 -34566
6937 -34566 -48499 -40648 -22374 11358 33558 14476 -22941 -27688 -20891 -20215 -14519 -21045 14546
6924 14546 28289 1002 11406 10630 -27014 -49936 -22926 -645 14102 -12793 -13872 -25198
6912 -25198 -43549 -50991 -71977 -53888 -60264 -64690 -34988 -15394 -949 32036 7323 12106 7575
6899 7575 1079 4660 29384 21470 31430 29224 14911 -18312 12809 36228 4398 -35486 -14768
6886 -14768 -6067 -57214 -86116 -89944 -94160 -71728 -71245 -59924 -12433 -87 8769 -11429 -13748
6873 -13748 7244 32123 24987 20133 35178 44035 60846 52362 27983 -4617 -12626 -21199 -18311
6860 -18311 -40076 -37529 -23194 -29476 5822 5116 -26896 -75746 -97826 -90621 -122246 -67470 -949
6847 -949 4684 -12481 -5196 25459 61690 72123 56764 35329 -8281 -18697 25337 12497 1980
6834 1980 -2238 -19353 -12965 -6356 3647 3186 25960 42330 49375 42551 32239 17108 -14858
6821 -14858 -29384 -12652 -3094 -26331 -31769 -28541 -20068 -12283 -18231 -20939 -3222 28393 41349
6808 41349 51832 39655 40274 48545 57619 6493 -72534 -89804 -95930 -85712 -55403 -23550 3482
6795 3482 51806 73727 52641 30097 8434 -13902 -28005 -35805 -1616 12102 5160 -4385 15963
6782 15963 31168 29841 20970 7506 -1359 -11675 14169 23916 -10458 11076 -9313 -28789 -18117
6769 -18117 -15730 -11128 1572 -2347 -16229 -9704 -294 593 -19996 -38489 -16372 257 -6800
6756 -6800 -10534 -40359 -13039 10679 9504 -25519 -33537 -28405 -59671 -57077 -24338 17302 50456
6743 50456 43374 33385 28981 22594 46177 56906 71451 91530 93429 84014 132764 137389 90539
6730 90539 79754 92875 64831 46169 46433 90158 117821 133132 174850 222387 299109 426169
6718 426169 657501 935446 1000833 827551 663278 582054 495988 367004 254424 182298
6708 182298 138736 142951 117570 107711 95078 50271 30295 44732 41357 37240 53441 18536
6696 18536 -2095 603 15634 52128 63877 29222 26709 -16841 -46028 -16044 7821 32988
6684 32988 20453 366 27706 48889 48359 39414 56360 34407 26936 36483 17446 8419 14550
6671 14550 28857 28863 28411 5733 7367 11328 24978 11218 -16938 -58280 -40172 -17746 -20872 -16450
6657 -16450 -12484 -8983 -8174 -33364 -14613 5813 25574 -6832 -18763 -21591 -3459 -29269 -38601
6644 -38601 -9678 -3071 20461 1394 -9933 -7094 41103 47473 -5348 -52646 -65241 -28074
6632 -28074 2148 27305 33362 43545 26907 16503 -70 -28406 -45557 -23736 -155 3928
6620 3928 1726 28368 16850 22223 33388 23840 -5190 -36606 -59613 -45083 -34207 -43415 -28516
6607 -28516 -44991 -41578 -23150 -21277 -43774 -68885 -74238 -74719 -57346 -19356 1907 -29613 -50068
6594 -50068 -14150 14191 264 -4064 -18688 -12424 -17441 -21410 -26155 4027 11034 -18307 -42327
6581 -42327 -25156 -8312 -15455 -3189 -3282 18891 18169 7928 -377 -5637 -23588 -35045 -8243
6568 -8243 -23021 -6509 33196 28402 15158 21173 -6187 -45180 -57931 -28838 -6996 -26196
6556 -26196 -27038 -36071 -56138 -46981 -27011 -39883 -38493 -28204 -29602 -22768 -21594 -23310 -20228 18125
6542 18125 33649 25995 -11477 -39212 -25673 -10773 -5101 8265 -12616 -34945 -30809 -38504 -10365
6529 -10365 29208 47834 10451 -11750 -3095 389 8476 -10865 -6630 3587 -22819 -44241 -63545
6516 -63545 -51829 -54102 -29332 -42202 -26649 -31901 -39834 -7080 -15077 -4581 34142 33323 35586
6503 35586 21032 24207 -13841 -27380 -17534 -15379 -3446 10681 -5604 -5980 -31364 -15484 -36988
6490 -36988 -47849 -20722 -26874 -39476 -46972 -36730 -3325 -18701 -20628 -17471 10668 17184 14797
6477 14797 -16231 12562 47753 19642 -18777 -29705 -11771 9527 8922 -37048 -46067 -39124 -36900
6464 -36900 -27353 19909 16769 -11204 -15835 -2334 24365 30140 27066 33795 62839 90572 83072
6451 83072 53586 28295 4155 -9454 -6192 9271 22769 91 -5806 -20091 -10761 -24246
6439 -24246 -32684 -52324 -76883 -26567 19268 -19086 -50749 -31798 -7479 -16828 -19828 -46160
6427 -46160 -45556 -16581 -5540 8667 3642 32759 53972 48657 12446 -9 -11418 -17748 -15428
6414 -15428 -6878 -36601 -40664 -11535 19929 59398 36449 -30294 -49009 -10755 -22619 -9372
6402 -9372 17368 14874 29049 25900 40331 46379 -6840 -18214 -16407 -21809 -31362 -2825 36763
6389 36763 38871 7641 -12932 -25866 1438 21259 7231 -14049 -32260 -56917 -74234 -69049
6377 -69049 -13444 4865 -17954 -40803 -44593 -51357 -24722 -5080 -13935 11793 38760 58289
6365 58289 24821 3530 10136 29089 43608 24311 -11791 -23252 -20295 -18738 10405 12835 26238
6352 26238 18208 -21786 -33960 -48974 -72891 -38964 -12370 -6666 7712 10566 -8440 -36162
6340 -36162 -16577 18206 34652 12398 -159 10890 46969 38693 27819 44154 27403 -6054
6328 -6054 -16045 -16548 -18260 3383 8582 17632 -11175 6039 26163 23962 4018 -5903 -3983 -16196
6314 -16196 -840 -5213 6352 -16767 -30303 -42954 -22276 -2394 -39013 -40909 -39144 -50557
6302 -50557 -68401 -119945 -140953 -116977 -83676 -55964 -15586 28633 33759 -9056 -53546 -46731
6290 -46731 -23914 -23983 -22700 -32195 -8856 654 -43149 -68884 -43551 6201 4787 8925 -8249
6277 -8249 -25113 -19944 -45347 -62407 -9558 4057 -38415 -44050 -10949 9207 -22160 -49080
6265 -49080 -37290 -41049 -25831 -31825 -42534 -38192 -17647 3213 24964 28529 29610 24319 23631
6252 23631 29549 45878 55913 24063 12073 15330 2625 -897 2638 29123 20567 4713 34239
6239 34239 52490 65728 54870 28741 11413 -44642 -36287 -6170 -25320 -58143 -56977 -9421
6227 -9421 7558 5165 15772 37020 45914 17560 4844 31265 46014 53376 26715 -21902 -28327
6214 -28327 -21172 -13449 11823 2868 10077 7023 -19949 -43199 -53022 -64267 -54317 -64443 -29030
6201 -29030 -20257 -26854 -39452 -18490 -34190 -34124 -25963 -50996 -76975 -56869 -81768 -106225 -73429
6188 -73429 -50130 -31881 -13652 4885 -42922 -74373 -64113 -4092 21309 47110 38742 10122
6176 10122 19300 42062 51055 9619 -9971 -36272 -57569 -27646 -61814 -97124 -121406 -120422 -142451
6163 -142451 -110646 -61342 -47210 -34025 -48234 -63553 -50532 -54191 -53412 -58214 -30469 6690
6151 6690 -21384 -42707 -20497 -26112 -12905 18429 2836 -39620 -90505 -87487 -66767 -39420
6139 -39420 -22220 14727 11600 4695 23868 29595 28170 22189 16725 -7810 -7999 34859 37675 27600
6125 27600 14823 15834 21381 15518 -3639 -31459 -44359 -38890 -67381 -62530 -68736 -61931 -45311
6112 -45311 -35603 -36622 -77324 -69916 -53228 -35051 -13456 13337 52709 29216 23474 35536 31236
6099 31236 9512 190 -8268 -3470 1100 11154 334 -39592 -48995 -31646 -7537 3840 -27794
6086 -27794 -47388 -37038 -22195 -69338 -119519 -104788 -59896 -53534 -33938 -16757 -15691 -440
6074 -440 7138 -43862 -54849 -16432 -11529 -30735 -15254 -321 2662 -19273 -24949 -27196 -5211
6061 -5211 39674 43152 12771 -6199 -56340 -19191 24554 -1739 -720 12175 21367 15916 23
6048 23 -20676 849 14426 10343 57021 65178 70117 39479 5261 15461 18144 25013 -2740
6035 -2740 -32038 -3972 23451 -4668 -28022 -19845 5544 13358 -4054 -8441 16522 35334 -6299
6022 -6299 -1066 5811 30903 32565 -24437 -30005 -31331 -19211 -5104 2601 11183 29219 22345 16346
6008 16346 -16934 -19346 -16762 -27249 -19577 14855 46718 50524 49882 29540 26739 30691 17569
5995 17569 -7650 -25331 6778 42930 23185 -19546 -14894 -9241 10552 24170 29937 48124
5983 48124 9537 -37827 -42813 -33771 -3793 -14123 -90454 -61340 -19958 -29190 -24247 -19011 282
5970 282 1469 1568 3282 18932 16492 -18997 -3939 10379 20761 -9628 -23121 -25335 -31940 -49577
5956 -49577 -39355 -34649 -29752 -24163 6810 13356 -21236 -5708 1918 -1725 -14232 -32569 -14951
5943 -14951 -30619 -29290 -3467 2186 18701 8149 -1306 -388 16062 14301 -25661 -46335 -27678
5930 -27678 -20241 -24180 -24722 -3919 15250 10457 22132 -1561 -25324 -18052 -17754 -29126 -41566
5917 -41566 -11678 33118 52700 32954 -4953 -12514 16031 25604 20575 16631 43348 73692 68234
5904 68234 69305 58237 40743 27264 21677 32490 54588 25169 7886 -11880 -18405 -266
5892 -266 20497 24523 -7243 -11579 -7098 -12011 -29952 -39331 -53475 -38299 -38117 -75851 -101997 -99808
5878 -99808 -47421 -38216 -27245 -27188 -47732 -53895 -53154 -44028 -39356 -10105 26987 40023 33307 -9273
5864 -9273 -15630 -34501 -42118 1800 45435 39497 -9482 -34108 -39505 -51740 -22124 -19491 -30383
5851 -30383 -19570 -2205 29599 20572 23774 34004 -2527 5805 -407 -5169 -562 -22662 -56765
5838 -56765 -42415 -9973 8344 15485 30613 36047 10471 16127 21584 27606 5324 -4130 -23165
5825 -23165 -5084 1158 11835 -7687 -14021 -23474 -36338 -11139 23091 -11316 -12010 12453 9173
5812 9173 15255 36918 14708 8778 15009 22403 12388 5235 -33210 -28393 -16414 5989 -14589
5799 -14589 -44292 -42405 -33708 -62395 -51335 -12333 -24673 -13336 -10668 -6362 -5001 -5617 5657
5786 5657 12956 16594 29377 13675 4534 8044 -7352 16969 16369 3218 -26089 -42191 -31435
5773 -31435 -30687 -35298 20679 44175 50270 62197 15572 -20423 -27879 7348 -11453 -30614 -13684
5760 -13684 -8164 7653 16900 17901 42556 48317 26832 22681 33154 13115 47775 90336 69186
5747 69186 8835 -38571 -41113 -27872 -29255 -54183 -72623 -44428 -33890 -17096 -12761 -39719
5735 -39719 -40612 -22408 6413 43336 76097 58806 48281 63408 72085 32070 -9668 12382
5723 12382 23093 11566 34386 52135 61277 73152 46473 30050 35515 20118 9259 3041
5711 3041 16219 -6280 -37750 -51307 -12343 -3281 -8890 -11687 -17741 -20180 -22513 -58614 -37985
5698 -37985 16783 39147 46687 28146 -3502 2788 11982 16775 20752 3283 -22293 -45010 -1867
5685 -1867 8268 -4441 1390 19016 16757 11013 20621 381 -9235 -32291 -204 35164 43467
5672 43467 43937 49143 42512 70430 44133 -11244 6271 1393 -18099 356 5071 -7448 -5686
5659 -5686 6456 -7082 -47931 -71558 -56940 -33015 -11794 -8721 18512 20132 290 -8505 -39733
5646 -39733 -32129 2484 3478 1453 6006 25908 49818 19787 -10732 -38493 -46359 -47531 -48026 -38810
5632 -38810 -42582 -30259 13163 26410 15326 36975 42924 9792 -15618 5073 12358 1974
5620 1974 -28216 -36202 -21796 -11674 -29502 -15828 6877 18632 17299 -8508 -31453 -15465
5608 -15465 -14376 25669 59940 10268 -26250 -10314 17899 23437 2914 -785 -11861 -8416 -21543
5595 -21543 -3709 -18739 -24180 -12681 32509 54318 56702 64922 72767 47959 28563 -1947 16343
5582 16343 26342 52515 68002 19955 -45869 -64104 -52014 -13634 -8553 -30478 -16804 -24154
5570 -24154 -28269 -19548 26279 31850 48877 43479 2876 -34728 -25800 -12332 8202 -9668 5464
5557 5464 20889 8635 16195 -31103 -85536 -87310 -77857 -57362 -82359 -70557 -41974 -59527 -77289
5544 -77289 -80305 -93072 -61349 -24855 -29415 -42154 -36506 -33175 -26811 -7263 -9170 -35917 -37107
5531 -37107 -15224 -11357 -37306 -55258 -70653 -52042 -20854 -3145 25333 12569 -6779 -42963
5519 -42963 -32028 4090 -8824 -7173 -12134 -21505 -22848 -42664 -17645 17609 41694 14186 24437
5506 24437 28330 12795 -1008 -48562 -78034 -93337 -61750 -3928 20834 54823 25993 -22004
5494 -22004 -51563 -12094 9417 12639 -24735 3615 11015 5925 -14223 -38831 -15163 23020
5482 23020 33181 42618 5551 -40808 -36260 -30916 -33863 -26993 -38792 -53273 -86931 -65207 -30512
5469 -30512 -18033 -25995 -11754 -16521 -46847 -52547 -45841 -59868 -71555 -42230 -14237 -8699 6519
5456 6519 -7520 -7619 11160 28284 38897 45579 31437 11070 10290 12674 42997 33399 22612 20106
5442 20106 28510 24567 9435 1705 -14013 -27369 -38641 -12189 3419 -35066 -15025 125
5430 125 3629 -3621 6579 8610 27465 5662 12044 10884 11577 -283 -6732 6969 8000 9974
5416 9974 11243 5344 -15992 -32789 -29622 -10406 28682 41152 -6495 -8294 -23759 -14585 2754
5403 2754 18725 24342 29191 49632 50766 42587 17092 -30185 -17737 -15720 -40240 -42140 7877
5390 7877 52363 38241 -1998 -17111 6518 11606 10411 49842 35217 17318 25266 44301 41019
5377 41019 33012 3774 -28158 -55997 -28523 -20643 -13878 -3442 21515 21907 30354 57035 62942
5364 62942 41936 51733 16687 -44406 -27884 2329 15168 40375 32788 6764 -22079 -52728
5352 -52728 -81457 -69907 -44968 -11453 6857 14099 -28400 861 -19349 -59703 -50703 -37763
5340 -37763 -18001 -13573 -19188 13731 1000 -36984 -69222 -60170 -65271 -74065 -21075 -635 -43687
5327 -43687 -41269 -47513 -46246 -50505 -43474 1412 1828 4476 -17581 -47713 -40577 -48134 -32482 4275
5313 4275 2809 18808 -16983 -17162 -12517 -33714 -24895 19090 5313 -5088 -17462 2816 5132
5300 5132 -18607 -21508 -12291 1616 17192 13573 11914 23190 32262 -8024 -30804 -31225 -44299
5287 -44299 -39257 -29379 -38872 -20761 -8149 -12758 -20913 -29794 -17250 -18805 -5434 -36744 -45660
5274 -45660 -15499 -26098 -26339 -18844 -36492 -59060 -72134 -59880 -32201 -26416 -15694 -17809 -22969
5261 -22969 -15060 -7276 -12454 -21425 -22098 -11424 -9969 -594 -3174 17701 -3116 -10914 -25327 -17895
5247 -17895 493 -14686 -12124 8957 21568 -18964 -34036 -6644 -32498 -30056 -6781 -6633 -18978
5234 -18978 -28554 -65204 -68650 -67905 -79678 -74452 -54074 -44835 -62442 -74535 -68866 -88544 -58410
5221 -58410 -24777 -11635 19158 -5453 -9293 44194 44583 42449 34510 25968 1136 14597 6121
5208 6121 -27120 -23232 -1552 -63961 -69418 -21020 -32011 -54205 -71545 -67442 -35528 -23627 -53805
5195 -53805 -56500 -38701 22284 10691 -3456 -2840 10803 46415 42290 -2481 -17910 -8989 -5507
5182 -5507 -10690 11067 19603 16773 12537 13350 -6048 13783 -9287 -22187 5264 12571 5549 -23895
5168 -23895 -50644 -45538 -48022 -42907 -57579 -53335 -49673 -63043 -72848 -56450 -33744 -21482 -21478 -25764
5154 -25764 -52514 -73229 -59195 -10373 35216 32517 -19573 -4361 21378 43786 60781 58667
5142 58667 75733 84939 86194 41495 12687 -9025 -3047 40763 51597 21933 18030 -20842 -10526
5129 -10526 -9883 -7811 -12434 -8317 22423 50283 55602 45532 44598 34510 30996 25387 30414 23265
5115 23265 -3149 -4284 -11222 -28676 -1993 -6491 -14524 -12143 -25176 -6588 -9648 -1466 -2545
5102 -2545 -16945 -46061 -38641 31026 48530 6218 13730 -5226 3107 48712 67303 45863 41474
5089 41474 13313 14980 10861 -15901 616 11006 30809 16918 -320 -8658 1608 8988 3810
5076 3810 18772 14619 18069 42420 71511 93883 86646 57641 29247 48954 47871 -271 -20367
5063 -20367 -59430 -69860 -65908 -40388 -6865 -4282 7638 32431 33571 14241 47874 43107 17299
5050 17299 24938 44421 8322 -55478 -63897 -44668 -70235 -91484 -85877 -49548 22552 44235
5038 44235 25904 12444 -18604 -39643 -48028 -53481 -39549 -1037 8700 -2991 -16564 -15572 -1266
5025 -1266 -12926 -27247 -40389 -2167 38176 23189 19129 34759 1591 -5325 -10655 -25022 -8896
5012 -8896 -1494 4376 4148 861 -23628 -51782 -17602 -24113 1555 3208 -6951 -9504 -23621 -72902
4998 -72902 -55800 -35599 -15040 26112 47700 21934 6035 -5763 -17224 325 21423 25462
4986 25462 33019 24185 29615 37620 4047 -5085 1709 8290 8098 30616 31752 44197 28359 11153
4972 11153 15745 25545 21098 35202 26011 35284 63494 42850 1404 -13378 -12686 14266 48520
4959 48520 24014 17086 6487 -4202 15015 14933 -21942 -50685 -32927 -30952 -24749 -26266 -14743
4946 -14743 -13510 -32527 -54642 -83878 -59066 -46118 -51461 -78263 -62279 -31014 -46570 -57216
4934 -57216 -46346 -17113 1316 -9272 -34222 -27716 12280 38061 24482 -23356 -24601 -35005
4922 -35005 6566 13469 -11643 -45252 -77414 -57610 -30564 9506 6520 -20787 -32027 -48484
4910 -48484 -49309 -37863 -3802 -6880 -29386 -27610 -29400 -57959 -44289 -27111 -12058 9596 19687
4897 19687 73428 92087 62314 -10005 -30422 -20306 15975 -8753 -38170 -30513 -2532 24035
4885 24035 29336 31758 46436 1574 -9121 -14201 -61831 -19162 423 -12634 -14869 -10962 -26247
4872 -26247 -19163 -888 -4870 12569 28323 39430 37551 -1349 -7157 -23581 -20951 -32132 -60596
4859 -60596 -45992 -32495 -9431 599 -39008 -33360 13179 36686 10514 35183 18082 -1765
4847 -1765 18411 42224 31123 11412 -7112 -19033 -35264 -25404 -37916 -67707 -62654 -36644
4835 -36644 -164 -6282 -17166 -12593 -9236 -37426 -44883 -15260 -25840 -35632 12683 34570 33925
4822 33925 20500 2837 24062 62904 61624 11346 -23597 -29158 4014 32902 53213 43673
4810 43673 29489 25267 27527 10486 48636 46329 6495 18444 39627 34233 16356 20776 4637
4797 4637 -24210 -29012 6590 22960 18400 30714 6971 -2128 10626 4307 8264 -12118 -24941
4784 -24941 -17090 6510 10510 -28099 -31826 -46735 -77401 -56337 -71129 -44933 -30991 -24711 -12779
4771 -12779 -10030 -36641 -49013 -8288 17172 27261 27882 34528 27880 49667 30269 -10330 -8980
4758 -8980 11957 20866 -35700 -53764 -23269 23265 33722 -16433 -26919 -24386 -25123 -29230 -13904
4745 -13904 -23648 -31017 -28778 -35846 -32128 9288 50848 45941 -7330 -22632 -38630 -56059 -36009
4732 -36009 -16621 -21587 -8792 25431 23393 1407 12318 45760 20739 -18704 -26116 -36528
4720 -36528 -13104 11636 28995 34757 36930 38397 37145 6675 -2697 -29045 -91282 -98160 -83668
4707 -83668 -55041 -26290 698 -31311 -20166 -7409 -1061 10474 35277 58027 28412 16416
4695 16416 1269 -11263 12921 -803 15929 18720 7294 222 9560 4781 1564 34718 63844
4682 63844 45245 52386 25407 30911 43382 55115 26849 -27413 -10107 -22843 -44336 -35234
4670 -35234 -30867 -983 -4288 -29550 5375 35651 34161 66371 59252 32938 14918 18165 17615
4657 17615 16394 -1695 -4915 -35814 -56878 -32883 -31678 -77656 -37452 -2695 -39560 -56091
4645 -56091 -17899 -11585 -30519 -30338 -7229 -20924 -18277 -21017 -15215 -25703 -20086 -11801 -38420
4632 -38420 -29381 -988 -20193 -51610 -48860 -15617 -10742 -9273 -12598 9083 15188 11021 -12052
4619 -12052 21642 21890 -5347 -16966 -41961 -46675 -22702 -16234 -23904 -13766 11206 34853 27640
4606 27640 13873 -9060 -32174 -30920 -35194 -13268 -12949 -8503 -5378 -12529 -18583 -36716 -28622 4006
4592 4006 -12531 -32977 9824 25337 -6122 -32145 -36241 -14788 35640 42916 22818 -6728
4580 -6728 -20476 -18206 -7447 -42648 -97919 -94473 -73078 -21081 -6200 3579 -5884 4187 13322
4567 13322 14682 20354 21402 28330 48017 62793 53741 72107 66400 55321 75103 115703 113721
4554 113721 76535 55392 54761 33298 911 -34549 -68789 -69887 -21486 22906 43242 28221
4542 28221 10650 25289 19427 -9939 -34982 -34872 -36956 -31764 -45976 -29387 12603 22988 1282
4529 1282 -13783 -22596 -18004 -27793 -39001 -11335 23527 -15247 -14843 2820 -30400 -65143 -48218
4516 -48218 -17320 -17144 -21236 -27409 -24078 -3525 22504 31910 41973 35982 26799 24763 24072 17586
4502 17586 -9176 -12257 -19616 -3747 1623 -7897 479 11387 12945 -26172 -58029 -33842 39762
4489 39762 40175 18372 -44314 -64590 -43835 -34845 -48413 -39364 -25995 -8487 6252 -2091 -29458
4476 -29458 -27616 -4640 6125 3089 -18447 -39368 -43257 -31651 -21603 -1482 -16041 -16742 -18630
4463 -18630 -1213 -6351 6561 18328 16891 40500 47080 42549 20280 24501 35670 1877 -30157
4450 -30157 -20560 2883 -9298 -15520 -22342 -22719 2464 -19332 -22307 15808 31170 31328 46763
4437 46763 51190 53105 56484 11332 16960 1594 -49102 -25378 28090 18742 4576 16612 12270
4424 12270 -12083 -43577 -68829 -76202 -58502 -34039 -26261 -8514 10432 36288 47917 32120
4412 32120 25020 17354 21546 17087 33977 52329 40984 25766 56888 63094 49074 27028 24269
4399 24269 33351 15532 -19109 -16231 -14000 -17105 -6683 -6661 358 -16412 -22782 -8639 10686 11046
4385 11046 9433 -6324 -45072 -62584 -40812 -31795 -30244 -47953 -50970 -59058 -42754 -19315 -4886
4372 -4886 -25269 -61098 -56641 -23125 3198 -2519 -31294 -22551 -11233 -15612 9962 19969 2471
4359 2471 10377 31872 22579 10763 3376 32696 25800 7486 -27243 9747 10134 -7433 13072
4346 13072 4025 37966 63741 22845 20583 34880 16530 7861 46489 45471 35379 -18244 -36019
4333 -36019 -883 18381 -26618 -26304 -26324 -77269 -67204 -49234 -26088 -29238 -35608 -24527 -13743
4320 -13743 -20010 -35299 -43297 -48058 -80904 -71137 -48546 -22901 -4653 -1343 -11857 -11556 -19243
4307 -19243 -51126 -51424 -18767 -13092 -33213 -47861 -36332 -1857 22114 20625 -22807 -82644 -101115
4294 -101115 -47073 -29090 -35494 -6344 -6996 -45991 -69904 -61570 -82975 -83563 -46009 -21300 830
4281 830 36877 54878 46608 14941 -16794 -4727 -5428 4124 39263 43629 29136 -6589 -31513
4268 -31513 -14378 -9453 22401 34778 -11434 5073 55136 54618 19461 -29112 -16040 -2187
4256 -2187 -47511 -36085 13267 25083 279 6425 42830 46804 8798 -18059 -37063 -32652 -35497
4243 -35497 -44163 -25063 3777 -8188 13000 22928 47292 41208 14994 14188 18017 10926 3894
4230 3894 8732 36559 52876 30649 7163 13690 42583 39247 35176 38370 31639 24865 8872
4217 8872 -36511 -50480 -51180 -41413 -22308 -21290 -7274 17474 13679 -12382 -31171 -23889 -60786
4204 -60786 -77114 -61785 -67261 -51734 -21760 -27067 -30996 -56657 -32259 11093 18632 17226 -9903
4191 -9903 -33774 -18777 16688 12467 -14710 -29288 -4562 34627 27760 38107 11904 -15416
4179 -15416 4228 -599 -9338 -14505 -907 15869 10802 9195 -27528 -59826 -73183 -105430 -81162
4166 -81162 -102331 -118654 -103387 -79487 -41542 -35477 -52909 -21153 -29474 -7196 -3504 -16465
4154 -16465 -20159 -39218 -27504 -28202 -38043 -21564 -21651 -48371 -43536 -34761 -15814 -18630 -8676 -5468
4140 -5468 -18471 4485 19973 32776 51147 63503 73405 31409 -14429 -8280 17982 -5576
4128 -5576 -8610 16035 40552 32160 10280 20338 60851 36434 7871 4970 18048 2249 -27568
4115 -27568 -43584 -8802 6808 12346 28693 28901 -5598 -32286 -33723 -56501 -42501 -186 32727
4102 32727 48226 10221 -17628 -10461 3049 33422 43584 26468 41089 48072 34760 14667
4090 14667 5217 -2789 -9567 -29462 -54133 -66410 -55037 -18229 8970 -2815 -13003 -39663
4078 -39663 -33232 -22993 -34294 -31222 7384 32931 68757 69451 29462 -6280 -6952 -38929 -45250
4065 -45250 -37411 -27832 -32926 -40673 -31304 -16009 -16834 -19168 -10575 9593 16866 -14482 -25694 -16239
4051 -16239 -18805 -4600 29520 50097 40478 30990 31823 4960 2816 -9477 -21942 -19924 7245
4038 7245 33107 33481 21584 26269 48936 46858 21601 35343 38179 36180 43443 24711 -3237
4025 -3237 -16221 -30349 -22651 39823 49998 10193 -15614 -8329 -26373 -25770 -11547 -26564 -47474
4012 -47474 -43767 -28103 41288 82521 68792 36632 40322 20134 684 6998 14608 -5701 -29619
3999 -29619 -27092 -15973 -15694 32864 66669 53640 20677 -18993 16409 57456 15149 -11113
3987 -11113 -16797 -3298 -10090 -13785 -18219 1034 -17328 -13139 -25726 -29538 -19579 -912 -16405
3974 -16405 -27246 8054 41520 41199 25005 -24580 -37198 -18077 -30548 -42848 -35684 -33162 -21637
3961 -21637 -693 -1490 935 15891 43034 26948 -15966 -27718 -8190 19722 37608 35548 29600
3948 29600 17942 -3351 -22766 -43071 -55340 -39764 19712 44498 22789 32293 56663 41027
3936 41027 24450 28540 558 -6300 -20466 -24388 148 18976 38011 55357 64705 81242 44577
3923 44577 21581 39789 33128 35419 15411 -2919 3911 -1789 -30195 -66755 -29593 10483 14976
3910 14976 -2787 -36296 -15488 -5260 -4093 18599 24986 9778 6820 -5038 -2865 -19123 -19432
3897 -19432 -3632 9303 -20376 -50486 -84413 -70450 -25847 -29960 -42148 -18307 6439 15500
3885 15500 29793 31881 51229 61945 50129 8803 3151 22699 28846 15664 -16223 -37142
3873 -37142 2900 38739 -6653 -26656 -4983 22563 19690 14057 10779 -2109 31053 25364 34758
3860 34758 5125 10293 -11376 -50978 -21857 2139 -7916 -15127 -8900 -3587 -1844 8174 24631
3847 24631 22760 3193 13356 33538 21470 -37396 -60676 -43080 -11411 -11118 -6215 -16130 -21830
3834 -21830 -41806 -39468 -64877 -68788 -66142 -22098 -11466 6051 16188 1047 -4982 29712 74887
3821 74887 33424 17250 9623 28539 32807 26450 25502 23181 27848 -7469 -35895 -56168 -61754
3808 -61754 -34712 -600 -9717 -12502 -37940 -47821 -26839 -28380 -24577 -3103 -3558 -11292 -7038 4035
3794 4035 8463 -13920 4468 41084 26354 6907 -1856 12525 23596 -7536 8626 37551
3782 37551 1432 6749 -16320 -51543 -31996 -45266 -16153 38239 43715 54984 44226 31764
3770 31764 2032 -7053 -9428 -5301 16314 30993 39417 29142 -8590 -27970 -2103 -8699 4755
3757 4755 1695 -12348 4573 25033 13892 -9513 4510 -4378 4496 23116 20925 40541 26493
3744 26493 -2304 -18312 -40040 -70031 -73143 -42852 -21104 10244 26181 37664 23657 17930
3732 17930 23021 15182 2276 -22929 -25365 -23172 -26077 6720 3316 -18383 -26283 -11407 11006
3719 11006 -8028 -19897 -18724 -6650 -8397 16217 40337 16434 31912 54341 51534 22652
3707 22652 19626 32668 55051 71956 79754 81640 44353 -25055 -25609 -692 25116 14408 3298
3694 3298 -25057 -14730 -20634 -23300 13406 15336 -7314 -34094 -39084 -18792 -39340 -20840 -12483
3681 -12483 -9628 9788 -8221 -51334 -29512 -7835 15005 23201 8129 -242 1046 -23827 -14651
3668 -14651 -13436 -25593 -19797 8848 -8736 -24520 -34548 -6229 -9822 -21463 -17518 -12971 -27417
3655 -27417 -39310 -16448 -5601 10177 36257 51568 60025 43807 42957 34743 10160 33622 63683
3642 63683 22754 10517 8609 2608 21394 55145 65258 68395 71011 48062 -11554 -14043 23136
3629 23136 38234 14923 34967 52908 30832 41987 74846 79293 77779 47796 24360 -19205
3617 -19205 -6351 18510 24708 40373 57060 54833 38878 17786 584 -22617 -22796 -12180 -1193
3604 -1193 14065 50633 20432 -16074 -10975 7662 8431 -22332 -16445 5023 14985 27637 32282
3591 32282 44144 61845 30787 -6634 19190 10622 -16592 -44629 -34603 4866 11428 28602
3579 28602 64520 63847 22715 58315 88846 57461 8748 -30470 -32326 6196 225 -29051 -3563
3566 -3563 -5663 7058 -6639 -22411 -2711 54057 91987 84153 45568 -5688 13557 16270 -27283
3553 -27283 -61487 -35883 -22651 43306 62381 33500 -944 3826 1968 3901 25770 35928
3541 35928 31218 48895 54228 36858 9709 -7324 10022 62791 61599 26442 11745 18336 2383
3528 2383 202 -26176 -43852 -93853 -72502 -19995 23947 46563 22724 23196 1332 17238 27329
3515 27329 30123 -12338 -12786 8561 28242 22134 30771 40492 34717 9775 11308 22959 12629
3502 12629 20216 7663 -289 38413 27023 13824 26807 17376 -5586 -1507 8907 17941 -2639
3489 -2639 -51518 -29858 -14565 6700 27483 21560 31288 16313 -13634 3356 -7147 -32132
3477 -32132 -81939 -57149 -38154 -25210 -7394 -10774 18578 18311 6337 416 1100 7120 82
3464 82 20237 25951 -242 -19055 6069 -12572 -25762 -14800 19954 22253 7438 -13557 -12789
3451 -12789 4607 24253 32915 35757 40901 49747 54826 40610 42514 9695 8015 28641 11105
3438 11105 -12312 -5907 17870 45210 37025 20405 25777 -11300 -48376 -28386 4709 7379 22306
3425 22306 61219 70247 68839 45061 20866 13880 36614 27008 14706 4838 -4825 -36998 -24948
3412 -24948 -1273 -27613 -35293 -6865 -18873 -40356 -20092 -11019 -36999 -50632 -54487 -34403
3400 -34403 15896 28121 29098 15228 3760 7605 -6450 -13659 7668 5150 -51245 -70905 -44892
3387 -44892 -23623 -30393 -42026 -31892 -12188 30116 52063 37541 51116 34330 29133 -5318
3375 -5318 -31758 -12906 8346 28039 49748 32008 27334 23415 17902 -3901 -26367 -39242 -28393
3362 -28393 -41679 -50974 -56588 -64435 -40784 -24790 -16179 12267 4559 21877 35609 22021 41158
3349 41158 50361 22923 -15465 -19180 16466 7781 23974 31652 7724 2437 -2958 -26138 -50262
3336 -50262 -22368 -1506 2078 -12886 -13648 -2431 -33685 -21293 -7694 -18374 -31160 -41602
3324 -41602 -22215 -36967 -82710 -73411 -28386 -29266 -53011 -50376 -41555 -34347 -30214 -51607 -48491
3311 -48491 -25740 -30474 -19895 -16165 12913 28105 40774 29227 11961 1287 11807 12824
3299 12824 8901 14353 965 -8500 -6119 14388 27109 16213 10221 -10857 -29363 -47264 -31236
3286 -31236 -28995 -16040 -17893 -11705 25664 18770 -4438 -23358 -16277 -7885 11803 -7896 -27582
3273 -27582 -20871 7257 13243 -7657 -12648 965 12969 33746 25757 41454 24909 -58 -24318
3260 -24318 13357 4061 -10356 -28765 -6922 28353 13118 -2988 3959 9793 18866 42445 39520
3247 39520 20403 -17202 -56840 -73597 -82627 -59257 -65988 -55259 -5660 -541 -50817 -101914
3235 -101914 -69957 -51446 -30975 25342 47505 18278 -39714 -51856 -25143 -21466 -60446 -51951
3223 -51951 -36568 21124 56681 22151 9509 9452 -4795 -13081 -43712 -67089 -56058 -60358 -66652
3210 -66652 -40573 -25559 -5574 -14099 7884 -664 14847 20260 8918 6383 -6138 -37978 -13315
3197 -13315 14970 -12013 -64471 -66842 -50025 -53485 -27706 -15055 -20867 -38022 -12556 24416
3185 24416 40046 15042 -9085 -14231 -10612 -19985 -39514 -48972 -31061 34347 72188 63498 22833
3172 22833 -526 12699 11427 5862 2035 29469 35152 -10111 -53891 -66749 -17674 -17770 -37526
3159 -37526 -57975 -47712 -53063 -45229 -45123 -48822 -24573 3410 11875 24087 31895 536 -5692
3146 -5692 -749 -15540 -23809 -35600 -34942 -21034 -10134 -26208 -57508 -8983 -1987 5639 16882
3133 16882 11976 2245 -17399 -48441 -53474 -26559 -31852 -17395 16499 62392 51702 -11156 -56027
3120 -56027 -22146 27517 2300 -10376 -12009 27710 17573 -3000 -2161 -41486 -36892 -756 17181
3107 17181 12645 16032 34492 31383 50904 76334 72430 82445 61611 16090 -4057 -35483 -19280
3094 -19280 14565 4789 2438 50424 75660 53341 4493 -20864 -25491 2103 -562 18970 29939
3081 29939 17994 23932 6755 -19260 -18034 -21600 -38323 -26602 2952 42633 42993 8673 -12901
3068 -12901 -1464 -4843 -9769 -23342 -29689 -37639 -12518 1159 3804 -6661 1116 14399 18245
3055 18245 6263 -26286 -46167 -41634 -12535 -27303 -42244 -56450 -44741 -16303 -4295 -10729
3043 -10729 -13408 -557 16175 13488 23168 40649 38576 11920 -14154 -58464 -89774 -46535 -8429
3030 -8429 20113 -2209 -18422 -21661 8214 44638 82552 68416 43898 76674 80963 19108
3018 19108 11529 17806 -23169 -35150 -12107 -27307 -18014 -14832 -11025 -42376 -55810 -17768 -11589
3005 -11589 2389 21962 -7818 -23543 -42004 -7705 7106 19429 -11337 -24649 -15804 17611
2993 17611 25395 16485 5171 14504 35523 16300 4530 -695 -32813 -61552 -48996 -19687 25434
2980 25434 26158 14171 34591 8884 5615 -5897 -29567 -67055 -60854 -48433 -25102 -25440 -17858
2967 -17858 -18954 -8197 18015 31582 -1487 -645 1148 25595 43493 30876 43317 23501 -614
2954 -614 2567 3081 8243 -24423 -5681 22404 -8095 -40163 -57800 -35323 224 -14486 -36360
2941 -36360 -58993 -15804 14353 24450 4973 -4213 15299 28473 -10359 -20740 -49188 -19445
2929 -19445 -14825 -19916 -35847 -30102 -41296 -9633 45455 62440 39214 2241 -23374 -28235 16180
2916 16180 53594 48217 34210 25467 17890 12261 14653 26132 17460 26530 4197 -18662 -28388
2903 -28388 -17447 15175 34951 38339 36711 58425 72685 83753 70939 24499 2326 -23710
2891 -23710 2805 27124 29115 -23378 -32748 -5340 6295 40035 32604 -3888 -21780 -14776 -21171
2878 -21171 -32562 -28963 -4626 18169 24359 28359 8340 -2682 -23603 -8256 19230 5688
2866 5688 4632 -18203 -13532 -7538 -27657 -24468 -12367 -1411 -3020 -14034 -23975 -17942 -12856 32855
2852 32855 46295 62031 39053 12425 -16966 -33945 -34877 -36605 -11935 4108 -11662 9748
2840 9748 19259 -6647 22454 49163 37102 39659 50478 17149 -16018 12681 41972 24643
2828 24643 16433 16788 988 -11814 -24331 -33530 -43884 -46201 -5285 12173 -13078 -25767 -70866
2815 -70866 -39510 20204 8064 7548 -10156 -32465 -48063 -7613 19800 11352 35507 29110 -9105
2802 -9105 -20114 -3394 6972 43310 35213 19450 4294 -22132 4432 20185 48097 59418
2790 59418 28895 3267 -5671 -20784 4564 14272 38888 44590 25710 -2536 -6853 14711 48236
2777 48236 47634 46994 58244 28393 29389 4328 -23406 -42407 -40367 -29084 366 37455 43592
2764 43592 8776 -867 -23967 -43925 -1231 -1827 -28654 -11396 -3614 47204 84494 69401 43115
2751 43115 50931 66077 49793 -4286 -10390 -48106 -41874 -17433 -222 -2737 810 -5964 -11109
2738 -11109 -30011 -20250 14638 38299 21568 12005 -12997 -49887 -47457 -29133 6771 6696 -26983
2725 -26983 -46023 -24812 48297 68460 38664 39645 12742 20254 36517 34125 31743 63929 84263
2712 84263 31714 6638 34326 27670 6238 7669 14276 14294 -9289 -16858 -5176 -3056 -27445
2699 -27445 -39543 -30776 -48777 -49257 -22618 -3881 6052 41953 42584 21452 19081 19435 4155 -14802
2685 -14802 -4444 -23178 -17687 32262 37287 31407 52099 27032 31690 44233 47681 19903 32678
2672 32678 46642 33571 18726 -6183 -17383 -26906 -8308 33594 70882 61917 12301 9081
2660 9081 27755 37315 17983 22181 18209 -1280 9379 39463 47122 23861 11130 15034 -8473
2647 -8473 -28735 -19192 -13708 -17847 21313 23895 -9504 2182 42096 27925 210 9954 -5907
2634 -5907 -20854 -27760 -13995 343 24169 10689 -35572 -14533 -31418 -60185 -78324 -73478
2622 -73478 -41266 -23806 -24915 -47336 -55203 -26697 18140 48271 50622 38434 6643 -15927
2610 -15927 -22902 -10551 24887 2997 -23069 -42491 -57862 -28009 1826 -9090 -16575 -20872
2598 -20872 -24370 4775 16440 10478 -247 -29273 -30871 -11934 43978 56250 66390 53131
2586 53131 21022 -16315 -35634 -33038 -12751 -37472 -64334 -65991 -23027 -30001 -43760 5083
2574 5083 33756 35604 41335 50456 86576 60880 46219 32340 11467 13574 22300 10917 15525
2561 15525 -1550 8637 7143 4441 -7841 -25167 -2153 -29019 -46303 -61994 -62684 -59918 -78973
2548 -78973 -45808 -29990 -20829 -23363 -30048 21514 47007 -11542 -17583 7667 10644 -8466 -37766
2535 -37766 -57532 -34382 -34028 -52708 -31841 -12843 -26827 2557 -5247 15280 29471 -330
2523 -330 6584 -19836 -42925 -26739 -7637 -8948 31376 12312 -19768 -28208 -19253 -4343 -15650
2510 -15650 -17238 1770 845 -604 190 -12012 -8266 -11138 -17663 21453 26681 -2298 2176 -3422
2496 -3422 -23568 6933 15400 33022 6025 -9894 1688 -31153 -70534 -31911 -4734 38382
2484 38382 54108 28178 -15285 -31491 -43780 -24677 20037 48232 43865 -19152 -15305 16795
2472 16795 10582 -4911 -8512 -1170 -17981 -17019 -53356 -53132 -35712 -4454 25077 23807 -22609
2459 -22609 -33208 -14543 -4212 -24904 -29031 -32453 -6418 19686 54972 45663 41015 61056 74164
2446 74164 39987 14028 34682 48205 9384 -40110 -15936 -26190 -53314 -50340 -47736 -27600
2434 -27600 -31062 -36669 8282 36150 31853 27685 39961 45434 34307 8369 33524 66840 39503
2421 39503 44663 42075 45532 9567 1977 -1990 -10718 17447 28049 -9798 26526 31161 7963
2408 7963 16502 3752 -7125 -13068 -14106 -14568 -32439 -31368 -5283 16368 1341 -54905 -42110
2395 -42110 -22373 -20304 -47189 -67312 -81240 -33224 20172 18908 3958 29639 25982 36459
2383 36459 34263 50510 42714 43127 45581 17782 -451 -4911 2359 292 -8340 302 -27316 -51102
2369 -51102 -7409 41999 82140 64970 28043 23360 33175 16511 7042 -11853 -43063 -29622
2357 -29622 18671 4979 5415 17503 14204 -11155 -55833 -59813 -38552 -25393 -45710 -48359 -28915
2344 -28915 8496 -501 -43743 -63485 -63921 -58551 -61619 -32826 2379 10719 20419 -26896 -62286
2331 -62286 -56684 -38612 -38304 -25659 -2965 8207 40098 50846 70891 55455 36308 32200 -1243
2318 -1243 -46726 -40540 -9870 -37364 -31553 -15844 -16978 -33494 -78182 -99043 -79279 -49966 -63478
2305 -63478 -44613 -38716 -33559 -33804 -22295 -26880 -43082 -32079 -12125 -20939 -40587 -12307 24920
2292 24920 49527 56201 38978 12763 -3859 5448 17339 -57138 -55577 -47628 -59182 -51927 -18286
2279 -18286 2902 14747 53507 71051 50510 28242 -5658 -31792 -16221 130 9552 20585
2267 20585 -3490 -12745 30655 53017 70020 70315 28300 1669 -51038 -68455 -59906 -63797 -34821
2254 -34821 -14599 -48373 -21975 19607 36831 35720 50321 45296 35013 31988 6327 -13057
2242 -13057 -26724 -3467 26413 24963 43192 35022 23500 17127 47671 67405 55762 13709
2230 13709 13307 18099 13222 2748 11221 3404 8172 11032 -7279 -25426 -9350 -6587 -22230 -19340
2216 -19340 16229 7476 -18164 3687 50608 56665 31129 -15557 -7373 29459 -96 -16189
2204 -16189 3753 27324 28037 25567 15443 -11618 -27969 -32429 17174 12044 10154 26687 18824
2191 18824 42788 49482 -916 -26625 -19957 39759 110183 73722 57058 57143 20970 -7869 -11947
2178 -11947 -37728 -61140 -36813 -3054 4689 13940 54950 74493 46403 36967 20954 32421
2166 32421 34354 5809 -3858 2133 18509 29397 21116 70774 78769 34229 -15571 -32330 -33838
2153 -33838 -33861 -49203 -37423 -20632 -18232 -46622 -57316 -51886 -48041 -20167 9714 14658 5502
2140 5502 -14517 -819 -11416 -30291 -17386 18931 21688 4785 14125 8505 -6200 -28963 14270
2127 14270 50002 55596 15955 10908 48099 31727 4016 -45804 -34774 -35800 -45046 -43890 -40025
2114 -40025 -42207 -36900 1530 4863 -16348 -26071 -29786 -6370 22321 20048 485 -8919 -29043
2101 -29043 -44217 -30199 -33315 -16302 15956 30396 54061 33539 5876 41183 41831 31646
2089 31646 21040 5886 2770 39020 36904 10839 16153 24273 20400 -12906 -40137 -14578 -20687
2076 -20687 -3675 2006 29410 61531 42770 24000 4827 -20340 3359 8470 -1099 21236
2064 21236 62264 80510 89743 39581 18123 -14701 14950 20698 10806 17035 -3920 -17396 4613
2051 4613 34024 27559 -44006 -55762 -19199 -27834 -88392 -65685 -53244 -27470 -9499 12949
2039 12949 4212 5241 39132 31040 35594 31260 3458 -5923 1478 -8006 -21269 -12724 -6126 -11957
2025 -11957 6092 41770 18518 39789 52541 36389 46334 46060 25934 13392 -4134 -1639 33467
2012 33467 36488 -12539 -41027 -27086 16240 31521 -22597 -62750 -51513 -15671 -26598 -38500
2000 -38500 -48470 -18877 -7958 30460 31154 8274 21423 29101 24545 41022 36954 40143 -4199
1987 -4199 -15881 -7587 -7292 -31752 -7632 -9392 24467 36177 16141 -12740 10528 27200 1038
1974 1038 -19239 -18372 -12531 26332 11830 -30149 -53374 -42239 -8284 3766 -8858 2351 4437
1961 4437 5956 19047 -4191 3537 -8853 -13789 6628 7726 3583 -12114 14494 23595 13452
1948 13452 -4346 -11614 -10804 6552 24195 29113 21942 1947 9251 25850 32422 36934 42832 12755
1934 12755 -1335 -13584 -12327 -19488 11931 39977 47427 18721 16841 52669 34973 8272 -49334
1921 -49334 -60235 -44805 -46412 -24624 -22528 -7291 11607 28999 65645 72979 43107 8927
1909 8927 8962 -20684 4113 32222 31411 26448 -13063 -45124 -50617 -29522 -25648 5198 -7919 6287
1895 6287 12887 -7299 -14943 8587 49745 1666 -9533 27709 12511 -964 -20337 -15912 37397
1882 37397 84626 53252 43617 21857 22168 34228 44103 68246 77624 85369 98438 93477 69219
1869 69219 37659 27782 27018 8483 -42353 -43295 -40909 -34373 -37756 -14629 44891 73134 79311 29342
1855 29342 8129 30604 58894 39931 21934 6565 18388 4547 934 -29016 -32459 -26476
1843 -26476 4924 23392 37937 30687 2052 -6429 13135 16132 5579 -9380 -18530 -19720 -21837
1830 -21837 -20630 -16920 -21548 -24165 -24061 1412 30848 27996 23564 -943 -25395 -18087 -3902 28175
1816 28175 40667 47168 12679 -30924 -37792 15242 12401 8194 16987 21670 19609 53815 33106
1803 33106 -6768 -11249 -8147 -14136 -16794 -19062 -15780 -1892 1268 13749 -16260 -45973 -35297
1790 -35297 -23155 -10050 4437 40917 30063 30260 45677 41531 49371 22102 1072 -11107 -18945
1777 -18945 -9543 -14940 -19655 -22452 -22373 -41473 -45729 -37825 9650 -1256 -15061 3148 3210 -22435
1763 -22435 -32658 -23596 -56073 -67294 -70083 -62677 -17462 -5126 -12041 -26253 -38464 -27731 -12766
1750 -12766 -23594 -32221 -14841 -6689 16898 904 552 26041 33479 1242 -8106 10713 37932
1737 37932 61490 34165 27867 -8709 1765 -11794 -65635 -62346 -49258 -16609 -8404 -26638
1725 -26638 -43017 -47441 -13545 24397 13591 -32088 -87275 -63415 -22544 -17061 -2580 14154
1713 14154 5633 5421 -2183 19769 41666 15258 20308 24678 -2267 9794 26108 48821 24366
1700 24366 4012 -18477 -3527 -15390 2950 10239 -6381 -10244 4430 22550 36547 52264
1688 52264 25968 -7686 -42969 -29139 -8519 -22052 32724 68220 31346 9420 2978 4101
1676 4101 -141 -7004 -7397 -29211 -5867 -16504 -20250 6438 -7376 -17943 -19621 -37044 -31453
1663 -31453 -29866 13997 67669 70325 46959 24897 39770 49173 28660 11930 6867 28792 31461
1650 31461 16589 3394 -6274 -6459 -2887 -11198 10514 5126 12613 19910 33895 33188 40850 40556
1636 40556 40116 5354 -2819 21647 1843 -23202 -10890 -16904 -14524 13312 40931 58158 55103
1623 55103 21809 -10194 8010 9554 25074 162 27705 25000 23129 -21419 -49670 -65757
1611 -65757 -36441 -1762 -7196 -17248 -3806 -32168 -65862 -87003 -96023 -54442 -50513 -74126
1599 -74126 -39990 2988 10766 -28605 -63762 -57795 -40369 -16343 9309 15163 22351 27957 29181
1586 29181 -4980 -27862 -42885 -46345 -38425 -7119 -2704 -47007 -42847 -29967 -34431 -33926 -19974
1573 -19974 548 -5869 618 9674 1631 -18253 4447 15811 17441 -25714 -60122 -72514 -42377
1560 -42377 -38607 -42414 -20272 -37437 -38581 -5981 16707 7929 -20544 -16653 -15459 -34134 -28221
1547 -28221 -29090 -37624 -15676 5674 880 3938 4683 1215 -3908 -9050 11194 4811 -9625 -34835
1533 -34835 -46608 -40145 -17476 1165 -14106 912 11212 13645 21673 6207 5603 11156 13819
1520 13819 56976 84553 44396 -9924 -3526 -2313 -4684 -14696 -25430 -23633 9725 -12307 -35703
1507 -35703 -46526 -49391 15199 31737 14164 15964 29748 35311 43439 18964 14452 11895 32448
1494 32448 31461 32823 44626 32025 22420 7024 -8892 18262 45542 42153 53270 39114 20568
1481 20568 11127 -4792 -10732 -9674 -43094 -67309 -39783 18623 18972 18454 21175 12530 16709 1481
1467 1481 8253 17650 17250 3145 3752 -5404 -29347 -15253 1762 -31194 -11526 -2943 15470 33970
1453 33970 38899 19314 30202 17012 16710 -3257 -18219 -2158 1141 6332 18032 -5037 -10354
1440 -10354 3241 16790 -23121 -8711 1160 14204 8981 10182 15284 4740 7525 10569 -21048
1427 -21048 -17574 10187 -8504 9700 11248 8092 22282 21565 33251 34930 50239 66288 78480
1414 78480 92641 58455 41836 46030 53754 75674 35883 9299 22897 25589 63162 80517
1402 80517 77665 44653 22349 3772 -14995 -28468 -44944 -77470 -55659 -40041 -31320 -21503
1390 -21503 -1676 -3637 4245 29113 17773 20901 10448 33847 34406 3045 1909 -2216 -53473
1377 -53473 -69949 -53364 -13789 -6022 7669 442 -10931 -15800 -38968 -32970 -22383 -18140 -33264
1364 -33264 -32134 -19283 -69807 -78739 -43147 -42222 6077 43106 64779 44142 40120 54125 27516
1351 27516 -4966 -6499 -22494 -19980 20827 20238 26489 39606 40602 45958 11087 -16380 14903
1338 14903 6524 15493 1338 -52253 -28505 -18085 -7841 -5168 -1748 -20314 -41878 -54364 -35478
1325 -35478 4300 4125 24615 28887 -9257 -41722 -11818 -7062 5700 -12304 -33620 -32371 -26007
1312 -26007 -24126 -25614 -43225 -48711 -20836 -1831 29079 38301 -12912 -42178 -27413 -13902 7425
1299 7425 1736 1656 -1007 -16263 -19936 -38284 -31226 25330 24770 1847 33813 35900 31593 21377
1285 21377 41585 23687 26038 44179 55482 46610 -1727 -35385 -36493 -54461 -49747 -19713 14787
1272 14787 36651 45147 35493 187 9476 34231 29244 24446 11323 -24742 -28227 -718 -5655
1259 -5655 -17073 -3246 8280 3911 17154 16239 -4858 -18719 -3276 -9188 19765 64911 57241
1246 57241 56965 87674 88293 46380 18212 67545 58580 15969 -1550 -13051 -5883 4547 27910
1233 27910 14628 19759 28839 16899 23699 38752 12542 17062 3018 -43958 -44719 -35256 10560
1220 10560 40278 65266 40869 19063 25088 1906 8084 24477 42383 62670 70281 52235
1208 52235 30425 37228 49930 17093 -33253 -19979 -1118 -5497 24026 53200 42361 69548
1196 69548 65470 33204 8321 13471 -4877 -32090 -57226 -51357 -13165 -12129 -34696 -49978 1420
1183 1420 -1231 21362 49276 26515 -19373 -24396 -25209 -12469 -21162 -21972 -30336 -28524 -30053 -36988
1169 -36988 -23829 5397 2854 8430 24101 13514 12267 24236 7817 6093 4964 1181 -11569
1156 -11569 -33597 -30765 -42440 -19851 -7606 -4125 -31315 -37829 -32095 -35149 1802 32073 66372
1143 66372 65802 55867 39838 54322 75051 68106 51309 -10118 -7405 2709 829 3835 17794
1130 17794 3881 -24646 -42896 -28013 4993 22243 16159 -21161 -50036 -52050 -14948 -9210
1118 -9210 -1362 83 9854 21439 29712 14543 5253 -12638 -15128 -8599 -10382 -23162 -3117 41766
1104 41766 89056 81531 44772 -19451 -53182 -62138 -40097 -407 35506 78911 105515 79419
1092 79419 -3286 -62783 -41973 -8094 2189 -15649 -8514 -4416 3068 11781 25605 -6145 -28472
1079 -28472 -48655 -52877 -12900 2519 5322 14283 15495 38230 37767 -11985 -7185 13444 33667
1066 33667 40502 23450 11974 14938 19222 16548 27211 37203 -5279 -46431 -17735 -15600 41504
1053 41504 41429 8462 -7778 22115 27248 36295 55002 36754 19383 12699 -37713 -66910 -82588
1040 -82588 -66510 -29992 -36314 -36770 -54456 -60730 -24332 5860 9367 -31206 -53025 -43070 -19488
1027 -19488 25331 50073 25532 -1204 2996 21208 33591 54448 56913 42784 6191 1532
1015 1532 18377 -5798 -17979 1967 1123 11540 53533 66369 62073 70693 44206 21374 10158
1002 10158 1632 3592 8255 31286 16308 4329 9257 20928 16637 33108 54701 40245 23136
989 23136 16270 23372 12100 -6582 -6450 37096 4428 -21375 -25724 -14291 -14430 -24936 -29740 -46418
975 -46418 -19623 -10719 -5235 1747 16889 46416 44897 38588 38987 19951 12294 26203 49795 45914
961 45914 32749 28582 -2576 -13212 2662 -8588 13349 5951 -22200 -22551 -18486 -13694 -6435
948 -6435 11876 48555 32439 1496 17238 36634 33270 16733 16488 -22698 -12528 19638 24257
935 24257 7780 -23626 -21383 -18715 -67534 -47851 -12294 6419 -3750 22737 51856 41692
923 41692 4180 -26874 -58200 -87342 -62475 -35742 -2744 -4673 16218 19382 8984 19336
911 19336 39232 46303 36239 52705 64849 48651 33085 15683 18500 23320 26227 26335 34709
898 34709 51290 33815 1913 -5885 -13425 -22488 3621 78 17672 27513 33717 9341 -7102
885 -7102 -6905 3571 5498 10470 7590 5103 3173 -3928 -13386 -8982 24954 759 -33314 -63659
871 -63659 -47077 -44850 -30564 -4856 -6128 -8526 -7087 22080 41672 48302 58669 48928 23062
858 23062 -7253 -33124 -50725 -37191 -54362 -47975 -38758 -10191 -30517 -32774 -6409 -25384 -31424
845 -31424 -29918 -12921 -41142 -59803 -5900 3086 5625 -18162 -23020 10142 9723 -3476 -13212
832 -13212 10086 50404 70138 81861 70367 26519 -10402 -25474 -26804 -24222 -11136 -11215 -2044
819 -2044 13276 26378 6092 -3820 29520 37188 27317 30576 20283 68945 97877 94656 84765
806 84765 74406 51937 8881 -5845 -10241 11201 48111 80409 96417 70721 81734 83304
794 83304 47905 43978 37512 52390 47935 12105 2535 12201 28840 35796 24430 12474 -10805
781 -10805 11824 59286 64470 58938 69017 88314 80985 64503 34037 16387 -4017 43675 75473
768 75473 68177 68584 38897 34270 26146 1191 -1177 31563 24382 -15221 -32458 -760 47929
755 47929 81498 91567 79882 87949 42961 33430 35315 15302 434 38356 60777 54542 24689
742 24689 15240 -11357 -49366 -59991 -22049 39711 52459 72351 104090 81067 78594 102149
730 102149 93832 55636 29279 10638 -24520 -19118 -18780 -7502 -1445 17224 51499 81306 72506
717 72506 93110 79016 35555 152 6611 16182 34155 35303 32826 21808 53076 56310 32411
704 32411 40904 43046 21782 2917 -293 -14714 -55496 -31964 20841 11952 -5108 30374 26326
691 26326 -10004 -2019 30503 61509 19597 862 12552 20075 53189 31567 22989 48149 70028
678 70028 49925 65089 81180 74122 104707 104376 81922 70924 70523 71375 53137 5288 -8901
665 -8901 22692 57473 61928 72650 99200 103095 80466 40129 51162 62846 66831 82578 74620
652 74620 42398 -8719 -30613 14932 31934 49011 60583 28171 24815 76430 80197 41623
640 41623 -7858 7649 26819 44056 56736 49529 34596 77252 94615 83035 66072 78930
628 78930 88646 64994 75269 90997 83137 31996 9973 30886 -2570 -13322 6830 45152
616 45152 40728 13785 12871 -22104 -8384 45355 25054 22875 10246 39192 48566 72200 66071
603 66071 70442 55267 19746 -752 28334 37431 36987 33614 36194 27380 29589 42128 57923 66989
589 66989 46272 65112 90722 69959 69039 81553 68687 43594 37392 40794 19266 21825 47585
576 47585 48165 45034 8969 22 9015 -29752 -43449 -40151 -16998 37804 80879 87567 67185
563 67185 60785 42189 70086 52930 22749 -15929 702 9969 32627 53604 64351 82066
551 82066 98190 53615 9116 -111 20715 37057 55697 58651 61001 49971 27446 24168 77634
538 77634 83250 45874 48385 27806 23661 41156 47666 22865 -5045 16473 18583 10099 -435
525 -435 11969 26630 31533 -726 1267 44619 55847 52968 44489 38999 16984 10007 2062 27932
511 27932 59900 39652 44077 41440 33612 41074 31808 29960 42311 69700 85115 69114 50859
498 50859 43846 28795 20774 18413 56895 64437 14830 -6296 17423 34899 22835 15199 15902
485 15902 45728 66138 79543 56988 34013 32011 20530 30373 39574 60019 28423 3736 27626
472 27626 18672 -25968 -42112 -10520 -1708 24701 47649 12066 877 32864 58422 48398
460 48398 28917 19421 12977 29086 58253 55628 51382 33857 22771 39019 54877 45582 58846
447 58846 25488 2504 -27514 -7624 30373 1712 36113 62520 64755 64982 69917 59313 84048
434 84048 94806 84108 44122 54850 66545 70074 79707 65148 60176 65482 67885 71128 88556
421 88556 74413 84232 94468 56778 44802 78405 95208 101125 103764 83663 66418 61683 53038
408 53038 64997 44371 41552 61982 86550 97376 95721 84571 73268 101613 127759 103129
396 103129 70294 57547 62125 54172 78557 109055 129084 111456 88066 61145 51608 49145 65254
383 65254 77579 85017 79187 64401 46969 14151 3981 37357 42686 18417 -12513 -24132 -16542
370 -16542 -12152 9606 27783 26573 20904 40417 56534 60259 53322 34574 33922 49147 61019
357 61019 56700 20593 -14815 -13979 -26766 -44009 -27710 156 4951 7877 13290 29863 25337
344 25337 13851 12294 -6638 28605 46930 8328 8430 29815 41853 32419 39059 27070 6830
331 6830 -3724 -2270 -15275 -7211 9043 20922 29752 45649 46622 47086 74595 92474 85576 82545
317 82545 71993 79269 82560 73075 68016 99766 69508 46108 28315 17373 42795 50026 23599
304 23599 9475 7073 6260 35743 49138 56439 61514 50958 24350 -5345 -1600 8240 34508
291 34508 31003 49270 65459 80430 48805 6677 3337 -4587 3154 37376 38404 56444 45871
278 45871 59185 62087 57855 71599 67734 77588 89603 85651 67028 21227 -3380 1317 23642
265 23642 37580 36357 26774 44731 63173 94932 94351 75239 50909 45924 37560 28039 44382
252 44382 80750 75255 50820 25738 31009 43699 19280 5611 22809 60509 61141 65789 80942
239 80942 39953 33762 9110 17977 61182 79469 89013 101155 70849 47550 43010 14868 19602
226 19602 28491 27873 29979 55111 16644 -28871 -35449 -6904 -5532 8837 43480 65738 62525
213 62525 27903 22873 4612 -12578 -21190 -25509 -26808 -7462 2589 42414 52334 36082 30978
200 30978 31723 15613 25684 33643 20275 24331 27308 23156 35846 61355 76929 48767 46336
187 46336 45027 54372 72141 63747 51807 51446 28830 25487 18480 18351 37428 28364 34672 57933
173 57933 65356 63451 65735 57166 63868 73321 59425 68334 88711 99555 94566 73578 61386 27043
159 27043 7619 14941 32753 15997 18010 45137 51407 35526 42818 23680 20082 18044 33596
146 33596 33267 30444 27124 29715 43127 26832 9310 19720 77675 84911 67073 67020 71928 66370
132 66370 53340 75253 62293 55143 53992 48147 64374 92450 85454 49686 20147 2199 17690
119 17690 14395 28087 36238 47261 65829 74374 60530 44458 44461 38144 47647 52711 49995 31530
105 31530 48679 66100 67109 54650 41275 31405 20685 34516 63332 69072 68390 63746 53298
92 53298 28035 23964 19862 23492 23764 36277 35913 36788 40498 57433 62263 59100 67596 66413 57304
77 57304 55058 51755 47757 39584 53290 65989 68559 50412 39944 52982 46072 62652 56216 63996
63 63996 48690 15532 28705 33132 30837 40747 39976 41237 26165 45709 54895 43864 38745 38289
49 38289 65337 70953 64928 51175 28686 9144 43778 70408 83315 79718 72574 66925 61583
36 61583 60691 66325 72384 48699 48395 56548 45556 56319 52163 52185 50464 42001 57005 75455 69626
21 69626 55350 67754 75118 67821 36535 21377 27842 13497 -5548 -7455 1764 12573 7708
8 7708 44465 66245 50672 30196 18138 4999 -15872 -6262
0 -6262
$$ Imaginary data points
##PAGE= N=2
##DATA TABLE= (X++(I..I)), XYDATA
32767 72338 48110 23566 13585 34875 31018 25049 28501 64398 67427 74728 56822 40558 46478
32754 46478 42171 33591 24394 36624 47395 72297 62400 42175 44926 25031 15646 22191 36276
32741 36276 26531 36502 56429 90116 103088 92201 87772 82994 88455 83577 49192 47132 66472
32728 66472 79725 79755 67752 54684 63224 68273 58291 71407 69188 63055 78285 66691 67667 58096
32714 58096 55572 69513 102659 113437 109013 117186 96452 81440 91467 72176 76563 67837 60170
32701 60170 71851 73201 77285 73564 70226 67691 86238 97681 95075 78491 72210 69969 90976
32688 90976 88007 66835 71684 92788 88659 92114 86772 87767 75145 74519 77781 75258 95329 103153
32674 103153 109811 109644 124790 139080 128927 106636 88786 91185 105737 108117 118268 139499
32662 139499 143365 119695 132856 113662 115096 124630 132034 105431 95734 105291 129988 119468 139926
32649 139926 148025 149126 134896 153898 165379 160994 154652 146871 134816 136406 152353 152011 163724
32636 163724 179081 171532 140199 131285 138595 134987 124561 141915 160760 183962 188659 162681
32624 162681 162987 147404 107064 99775 91943 103912 119285 136469 153590 176264 180089 179396 167587
32611 167587 164473 174324 189555 167337 146931 156288 138581 139254 118924 121435 152657 161330 156592
32598 156592 161875 165770 164536 182344 201512 182334 191359 202899 192237 188562 164013 176130
32586 176130 168661 149800 179568 194665 186449 166914 163756 154296 177943 180178 157641 164219 197194
32573 197194 195478 184257 188493 196167 195796 183247 198961 208500 203017 184966 166797 187489 210281
32560 210281 207426 212457 214144 208290 185242 186811 176968 197022 215784 211732 208994 212383 194768
32547 194768 176858 200172 197845 204887 216204 232559 243384 214666 212223 210066 227742 253486
32535 253486 226059 207142 243135 256387 209208 176553 171765 187423 217709 222959 201415 203167
32523 203167 209387 226209 234578 256006 269854 231309 225346 232470 219183 191684 201976 247961
32511 247961 245838 230093 240386 231441 211151 192914 212418 232566 228399 216343 194901 186866
32499 186866 178952 185298 214938 206452 197207 208314 223632 237856 215987 187543 198669 204825
32487 204825 194589 161615 156656 170600 180003 191234 204084 221987 231499 239875 242969 250196 260709
32474 260709 274475 257367 216088 184652 204863 208736 213885 203035 170553 180248 195252 205966
32462 205966 240095 260264 275515 257878 245420 243944 238027 244550 225541 224978 233907 254095 242013
32449 242013 241911 248708 265345 283322 282028 267766 253308 231261 208598 210514 191825 189292 189619
32436 189619 218899 222721 215944 212049 214126 232910 273629 264131 255825 248167 235384 258790 281778
32423 281778 257710 262655 272562 284474 256593 250236 278935 252968 233814 262947 267874 239518
32411 239518 247473 267589 263746 277620 315413 301032 304485 324025 292490 257626 251374 291434
32399 291434 319103 309748 295471 256972 232179 244950 253261 268424 262094 245219 234209 243212
32387 243212 250055 250467 259990 282096 285950 269564 276750 264232 250369 274950 281152 305164 332191
32374 332191 345040 341994 368448 382611 362404 316472 277009 261005 261318 277533 300942 307518
32362 307518 283709 269092 272238 243893 240691 226579 239459 265823 292205 280261 253235 274767
32350 274767 256228 263627 297604 297449 313638 309523 306002 294726 280885 248498 232885 225179 268081
32337 268081 289618 301307 287085 267892 233454 225447 255977 278344 277247 267359 307616 329988
32325 329988 302847 250805 242372 241197 239344 279304 319879 313768 279095 275960 295832 316767
32313 316767 313016 305321 289538 266454 262809 310521 301275 268607 238160 269123 303418 304911
32301 304911 325139 311928 274317 293551 320333 323691 337832 352312 340539 327180 302147 311020
32289 311020 274773 280885 278585 268545 273410 271849 268332 251213 282454 293245 242756 233107 275629
32276 275629 307604 293437 269556 247791 250777 241410 248600 270300 281411 247118 234361 260282
32264 260282 283894 278838 290360 267037 262744 251604 228471 224856 228721 231136 249045 260848
32252 260848 307077 326358 329218 329995 306678 326809 345360 340848 310762 282382 300967 308293
32240 308293 304912 331873 354645 344667 319350 274722 294653 320771 292356 279647 294821 328727
32228 328727 320253 322337 335299 336045 352198 338654 301194 307141 327620 336644 337655 329199 344682
32215 344682 361765 380215 360556 343748 344491 308819 326462 330055 330902 371441 377715 370743 347240
32202 347240 338733 335021 317039 297045 300782 332531 297776 296221 322616 319639 322153 327134 382686
32189 382686 403428 386125 368278 392728 395340 356361 340646 311846 334766 352646 333823 306260
32177 306260 277329 292882 288116 253047 270640 286947 292338 271620 265167 281504 291951 299837
32165 299837 288685 286036 280998 327087 375358 364745 308697 316850 324772 346647 354018 355498 327929
32152 327929 321989 333529 353208 338475 319100 291047 298737 304454 341412 346444 336393 341337
32140 341337 325733 268942 238160 273749 314528 292904 299747 306057 292231 303369 292919 288523
32128 288523 298235 300438 332137 320694 297671 294284 306018 274685 251901 267845 271818 268659
32116 268659 281166 294073 279683 281890 293086 339311 366542 385744 402218 397053 384602 364162
32104 364162 310757 290896 286459 296046 323658 304376 283069 297214 330376 326231 320352 349211
32092 349211 365997 307077 278805 306503 300865 295941 295655 301439 304567 308531 291697 263553 279162
32079 279162 308831 296514 304302 317367 310688 311776 255458 228828 245635 255553 287351 313616
32067 313616 318879 308957 324740 302094 250739 251877 282013 266779 287093 295752 288782 327171
32055 327171 350543 343289 317876 310185 289017 273472 282625 265141 245951 251877 292944 322584
32043 322584 331750 365267 379331 354216 328439 342868 333574 304109 296872 293505 307411 314938
32031 314938 344628 327074 289657 267569 289857 344900 370538 345248 323816 326707 299474 285905
32019 285905 289962 279675 287054 296647 304878 319377 296350 292742 300755 313082 299492 299612 328836
32006 328836 325139 350779 359868 329617 283848 232271 290524 345510 346797 365303 345844 327875
31994 327875 319181 293885 330714 321373 312562 296143 305572 340317 379351 351077 322344 332891
31982 332891 326891 319959 316960 302737 269372 272592 286500 263185 255244 266667 294985 312233
31970 312233 302754 330659 340473 317208 303550 287222 273264 282960 248586 238882 272928 301857
31958 301857 286857 266846 263650 291469 305747 312728 324468 299895 301277 302998 294062 289752 261640
31945 261640 243142 272350 301324 302937 303083 291447 264046 276779 301251 311274 330541 320213
31933 320213 301522 278752 324615 344879 327269 321592 338016 362702 301645 283395 285016 290867
31921 290867 287715 296509 311908 348770 354616 368134 364342 322391 328295 349570 335613 344173 345705
31908 345705 317906 285012 292620 332026 374726 364246 318232 280249 318033 307348 281507 294550
31896 294550 317673 318923 327112 314881 301622 327638 334981 305979 286192 277497 286134 295856 317043
31883 317043 323357 308116 317329 349773 352949 356162 327877 302694 304267 297685 271460 284006 299040
31870 299040 288995 300589 289019 315633 338964 335126 345063 337081 313688 296552 279535 296492
31858 296492 322131 310848 298729 275152 260386 275877 323083 303019 282022 285065 280059 281189
31846 281189 290076 311299 320461 322886 303250 303399 300625 292473 291235 305132 293376 290210 292201
31833 292201 301545 324501 353610 359930 375397 372623 342957 294399 291410 322219 339816 327090
31821 327090 327970 329026 319144 334633 339513 328376 345943 297872 276497 276494 301951 350188 356394
31808 356394 335827 317052 309851 313161 316935 298254 319858 307489 311578 316752 340687 359611
31796 359611 333241 359953 400582 402081 363313 337464 314451 330852 346815 336540 315746 288144
31784 288144 269961 307982 367141 372273 368337 374498 333122 318383 295925 293462 328632 331997
31772 331997 349703 356038 365113 358757 350882 333674 329257 341188 355785 325434 308625 329211
31760 329211 329924 337986 360738 368644 344387 351661 350272 359748 383565 389151 347160 317575 325031
31747 325031 309602 324060 327753 331237 300601 283677 271516 270547 287877 312010 350556 362787
31735 362787 366079 346516 351173 361757 346570 303390 283864 310123 324166 314222 308227 309625
31723 309625 296049 304697 293384 282324 299536 317430 329280 322928 315463 292385 301899 324774
31711 324774 325569 346758 336807 295837 292630 301156 348075 345985 327834 301852 304222 312322 297297
31698 297297 270158 284498 294268 299492 320943 309161 293561 297323 301035 311243 291846 294627
31686 294627 294888 295541 307830 312312 335752 348999 350254 345286 349812 346472 322595 329778 327906 304248
31672 304248 317261 316769 321220 345242 333860 327404 340406 337528 322931 309956 298806 297573 287846
31659 287846 272574 299861 296482 318401 332596 319348 309330 288264 317377 346488 346900 328424
31647 328424 288737 285909 304351 292627 303772 351642 345418 293622 318444 337606 347966 341393
31635 341393 356539 341451 314856 272784 269795 300194 323475 350883 353465 352558 334735 332729
31623 332729 317315 286570 275788 288301 259767 291426 321974 323701 326380 336787 357155 367815
31611 367815 327514 340450 370493 380713 359098 370775 356731 349502 313852 330398 315730 310087
31599 310087 323564 310489 301429 317164 333376 335562 314122 310754 282455 286168 289434 279425
31587 279425 296166 266429 250942 284628 275030 275229 306182 332361 332372 323534 324675 319959 332093
31574 332093 338903 340285 330025 333402 315934 312705 311181 325298 353597 346376 304115 293508 307943
31561 307943 331028 338965 328074 277202 270023 307435 305223 289940 322623 344310 312726 290338
31549 290338 292759 293548 311935 333378 306586 347248 361801 343484 319473 327666 350892 335628
31537 335628 310672 282561 272257 286899 290834 297585 275594 276333 272420 268211 289102 324674 354446
31524 354446 339924 337299 358343 333022 338055 326921 338942 333550 332989 340996 320152 321759 324286
31511 324286 326770 343094 324146 313914 307202 338781 346940 339024 339999 335020 345655 325180 316601
31498 316601 324562 340514 344889 332743 322975 321655 357346 345893 296305 281135 275203 305472
31486 305472 319241 308064 348038 383857 357895 309312 298181 339041 342056 308372 327652 333559
31474 333559 319484 341822 346644 340639 364080 366860 350396 339031 330604 315653 298991 295671
31462 295671 321583 347630 357819 363147 361237 325384 270594 293278 328197 320263 294815 286718
31450 286718 305148 309174 323967 345858 364857 369663 360668 323176 290270 248523 215291 223430
31438 223430 270927 289481 292785 328106 334949 329823 333916 337108 363191 366783 348636 343055 314645
31425 314645 310917 286053 262065 269543 294172 300807 308686 334241 291269 281875 299973 322044
31413 322044 343005 322851 290126 309725 325169 309339 335147 348702 370999 345510 300588
31402 300588 262014 278988 307963 331013 344082 331387 338421 314350 329354 339771 351668 347026
31390 347026 351549 348817 323030 312701 307504 305175 320037 313698 303168 309627 298987 298872 295129
31377 295129 284680 240239 226408 270521 284258 270644 296842 322499 301534 307489 313520 342530
31365 342530 371405 357252 351887 380409 362930 369319 378363 397756 421067 403728 380101 371102
31353 371102 352400 350535 335368 334675 330800 331026 319734 324509 337050 363768 403428 379842 332967
31340 332967 317446 339609 369031 363656 345393 294072 303591 328761 337747 373495 348580 365013
31328 365013 372966 399508 376213 345163 355093 353413 318014 284402 290808 286007 249341 232172
31316 232172 289682 290563 280375 312041 335842 335341 305312 312969 358956 333147 317482 322945 316886
31303 316886 325220 338920 346467 324676 325306 309736 306799 355213 378554 342577 312942 338549
31291 338549 313950 278470 305975 315084 316836 326453 318195 321909 329543 308742 308432 306988 317549
31278 317549 298863 291135 301126 308906 299448 259062 288119 303739 338513 351620 352880 334126
31266 334126 309407 354264 386152 392680 352902 337564 347667 326341 316969 321273 332898 342779
31254 342779 358721 350743 346811 333285 326560 330874 327788 311889 342171 337098 313096 301706 331562
31241 331562 338891 344417 355862 349063 339786 331536 332051 288843 285995 287967 290702 284776 305993 325968
31227 325968 317935 295662 270102 269349 266095 277009 305328 317633 296198 300410 269275 277829 272492
31214 272492 307698 290624 297013 328204 310475 301337 333813 345424 348254 370279 345992 313158
31202 313158 302092 328307 349341 386412 363345 369834 381332 354614 288893 239472 235547 286530
31190 286530 297118 275449 285225 313529 336466 355081 324885 323275 358530 383813 380671 340442
31178 340442 317348 326706 310947 330924 351921 351829 326374 323793 330489 322584 308978 301370 293244
31165 293244 264848 242484 270151 297670 325651 367510 358365 370112 348892 325747 321090 324404
31153 324404 341716 349804 325260 308274 309327 298649 273643 308655 331713 341194 362431 366024
31141 366024 362635 347132 343931 333146 293918 279416 309443 355410 386757 380671 358581 358397
31129 358397 366147 363590 332665 322881 324320 341030 338906 321148 319083 337561 353586 359965 374492
31116 374492 360461 337081 276629 265439 306687 278947 227165 259649 296841 311440 332347
31105 332347 355180 353672 356090 361178 360796 356385 335925 336517 355655 325090 319120 322547 340001
31092 340001 340322 325025 303637 292654 286055 287771 269914 290756 309165 330248 350153 348252
31080 348252 326513 361289 379053 392117 383026 355060 322980 352018 370007 358600 345757 354648
31068 354648 357862 345553 335284 354121 348079 314937 293269 328577 314934 300677 321678 291962
31056 291962 271181 308898 358142 346073 372312 389052 353596 332368 346367 341932 355713 385302
31044 385302 386911 371698 365186 347920 349632 372309 388036 391054 397167 375644 343717 340577 348593
31031 348593 330008 269520 277999 309195 323703 302366 288738 319660 350601 333623 335651 322674
31019 322674 309899 326656 335851 322960 327400 345221 330269 294640 280996 308051 361798 400050
31007 400050 409067 373333 317370 308572 291204 297387 273186 269176 303941 328063 353488 355707
30995 355707 378105 371329 323719 301491 281452 264198 273182 261886 271109 295484 316845 333151
30983 333151 327458 320797 317031 321921 328836 382935 398325 383722 377581 333985 321882 296312 256977
30970 256977 241546 273805 279870 293942 298187 300152 329368 356569 376353 385975 386447 346232 313543
30957 313543 271182 270344 294320 289052 262874 314891 328815 339247 331274 310618 336121 328104
30945 328104 307276 347368 377777 388673 357996 352509 313672 316657 316258 300824 321459 317036
30933 317036 342164 371155 327859 295247 298905 311114 356067 361901 348630 363120 355948 331733
30921 331733 325867 321259 313209 309234 297499 335644 379090 380093 369987 336374 323345 344996
30909 344996 342504 304101 301466 352092 381451 364237 365875 355138 356444 367935 367210 333730 332837
30896 332837 349830 361383 313857 275596 263099 260818 268290 285769 298737 321273 349746 346063
$$ [...]
##END NTUPLES=NMR SPECTRUM
##END=
