##TITLE=Analysis number 319775
Compound Code cc 33813
Project Code adrs
Chemist Name fudan
##JCAMPDX= 6.0         $$ Bruker NMR JCAMP-DX V2.0
##DATA TYPE= NMR SPECTRUM
##DATA CLASS= NTUPLES
##ORIGIN= Bruker BioSpin GmbH
##OWNER= nmr
$$ XWIN-NMR		Version 3.5
$$ Fri May 26 11:54:49 2006 GMT Daylight Time (UT+1h)  MAYBRIDGE\nmr@NMR_250MHZ
##.OBSERVE FREQUENCY= 250.131544655141
##.OBSERVE NUCLEUS= ^1H
##.ACQUISITION MODE= SIMULTANEOUS (DQD)
##.ACQUISITION SCHEME= undefined
##.AVERAGES= 16
##.DIGITISER RES= 18
##SPECTROMETER/DATA SYSTEM= dpx250
##.PULSE SEQUENCE= zg30
##.SOLVENT NAME= CDCl3
##.SHIFT REFERENCE= (INTERNAL, CDCl3, 0, 16.522)
##AUDIT TRAIL= $$ (NUMBER, WHEN, WHO, WHERE, WHAT)
$$ ##TITLE= Audit trail, XWIN-NMR		Version 3.5
$$ ##JCAMPDX= 5.01
$$ ##ORIGIN= Bruker BioSpin GmbH
$$ ##OWNER= nmr
$$ C:\u/data/dgb/nmr/ADRS/5320/pdata/1/auditp.txt
$$ ##AUDIT TRAIL=  $$ (NUMBER, WHEN, WHO, WHERE, WHAT)
(   1,<2006-05-26 11:54:06.56 +100>,<MAYBRIDGE\nmr>,<NMR_250MHZ>,
      <created by zg, POWCHK disabled, PULCHK disabled
       configuration hash MD5:
       84 BC 41 DB A1 6E 1D 46 DA 25 12 A5 C1 ED C5 3A
       data hash MD5: 64K
       E0 01 E5 EF A5 94 C8 8E 9C 38 09 CA CB 9F 11 39>)
(   2,<2006-05-26 11:54:27.56 +100>,<MAYBRIDGE\nmr>,<NMR_250MHZ>,
      <Start of raw data processing
       ef LB = 0.3 FT_mod = 6 PKNL = 1 SI = 32K 
       data hash MD5: 32K
       A6 69 CC 5B E7 E1 82 88 9F 40 77 D2 FD 28 0A 52>)
(   3,<2006-05-26 11:54:32.98 +100>,<MAYBRIDGE\nmr>,<NMR_250MHZ>,
      <apk 
       data hash MD5: 32K
       DB EA 39 88 B0 5A 9C 19 24 D9 E9 C9 E6 73 D9 28>)
(   4,<2006-05-26 11:54:34.56 +100>,<MAYBRIDGE\nmr>,<NMR_250MHZ>,
      <abs ABSG = 5 
       data hash MD5: 32K
       6E 9A 04 16 75 0F BA E9 55 CE 6E 82 C5 4F 47 A3>)
$$ ##END=
$$ 
$$ hash MD5
$$ 5A E6 04 AA 0F 1F 38 73 6A 99 0A 86 EB 1E 7D 4B
##$RELAX= 
##$RELAX= 
##$RELAX= 
##$RELAX= 
##$RELAX= 
##$RELAX= 
##$RELAX= 
$$ Bruker specific parameters
$$ --------------------------
##$DU= <C:\u>
##$EXPNO= 5320
##$NAME= <ADRS>
##$PROCNO= 1
##$TYPE= <nmr>
##$USER= <dgb>
##$AMP= (0..31)
100 100 100 100 100 100 100 100 100 100 100 100 100 100 100 100 100 100 
100 100 100 100 100 100 100 100 100 100 100 100 100 100 
##$AQSEQ= 0
##$AQ_mod= 3
##$AUNM= <au_zg>
##$AUTOPOS= <21 >
##$BF1= 250.13
##$BF2= 250.13
##$BF3= 250.13
##$BF4= 250.13
##$BF5= 500.13
##$BF6= 500.13
##$BF7= 500.13
##$BF8= 500.13
##$BYTORDA= 1
##$CFDGTYP= 0
##$CFRGTYP= 5
##$CHEMSTR= <none>
##$CNST= (0..31)
1 1 145 1 1 1 1 1 1 1 1 1 1 1 1 1 1 1 1 1 1 1 1 1 1 1 1 1 1 1 1 1 
##$CPDPRG= <>
##$CPDPRG1= <>
##$CPDPRG2= <>
##$CPDPRG3= <>
##$CPDPRG4= <mlev>
##$CPDPRG5= <mlev>
##$CPDPRG6= <mlev>
##$CPDPRG7= <mlev>
##$CPDPRG8= <mlev>
##$CPDPRGB= <>
##$CPDPRGT= <>
##$D= (0..31)
0 1 0 0 0 0 0 0 0 0.06 0 0 0 0 0 0 0.0002 0 0 0 0 0 0 0 0 0 0 0 0 0 0 
0 
##$DATE= 1148640844
##$DBL= (0..7)
120 120 120 120 120 120 120 120 
##$DBP= (0..7)
150 150 150 150 150 150 150 150 
##$DBP07= 0
##$DBPNAM0= <>
##$DBPNAM1= <>
##$DBPNAM2= <>
$$ [...]
##$SUBNAM7= <"">
##$SUBNAM8= <"">
##$SUBNAM9= <"">
##$SW= 20.6930455092707
##$SWIBOX= (0..15)
0 0 3 0 0 0 0 0 0 0 0 0 0 0 0 0 
##$SW_h= 5175.983436853
##$TD= 65536
##$TD0= 1
##$TE= 295.16
##$TE2= 300
##$TE3= 300
##$TEG= 300
##$TL= (0..7)
0 120 120 120 120 120 120 120 
##$TP= (0..7)
150 150 150 150 150 150 150 150 
##$TP07= 0
##$TPNAME0= <>
##$TPNAME1= <>
##$TPNAME2= <>
##$TPNAME3= <>
##$TPNAME4= <>
##$TPNAME5= <>
##$TPNAME6= <>
##$TPNAME7= <>
##$TPOAL= (0..7)
0.5 0.5 0.5 0.5 0.5 0.5 0.5 0.5 
##$TPOFFS= (0..7)
0 0 0 0 0 0 0 0 
##$TUNHIN= 0
##$TUNHOUT= 0
##$TUNXOUT= 0
##$USERA1= <user>
##$USERA2= <user>
##$USERA3= <user>
##$USERA4= <user>
##$USERA5= <user>
##$V9= 5
##$VALIST= <valist>
##$VCLIST= <CCCCCCCCCCCCCCC>
##$VD= 0
##$VDLIST= <DDDDDDDDDDDDDDD>
##$VPLIST= <PPPPPPPPPPPPPPP>
##$VTLIST= <TTTTTTTTTTTTTTT>
##$WBST= 1024
##$WBSW= 4
##$XGAIN= (0..3)
0 0 0 0 
##$XL= 0
##$YL= 0
##$YMAX_a= 598433
##$YMIN_a= -346588
##$ZGOPTNS= <>
##$ZL1= 120
##$ZL2= 120
##$ZL3= 120
##$ZL4= 120
##$ABSF1= 16.522
##$ABSF2= -4.171173
##$ABSG= 5
##$ABSL= 3
##$ALPHA= 0
##$AQORDER= 0
##$ASSFAC= 0
##$ASSFACI= 0
##$ASSFACX= 0
##$ASSWID= 0
##$AUNMP= <proc_1d>
##$AZFE= 0.1
##$AZFW= 0.1
##$BCFW= 0
##$BC_mod= 0
##$BYTORDP= 0
##$COROFFS= 0
##$CY= 12.5
##$DATMOD= 1
##$DC= 0
##$DFILT= <>
##$DTYPP= 0
##$F1P= 14.0000005364418
##$F2P= -0.99999901652339
##$FCOR= 0.5
##$FTSIZE= 32768
##$FT_mod= 6
##$GAMMA= 0
##$GB= 0
##$INTBC= 1
##$INTSCL= 1
##$ISEN= 128
##$LB= 0.3
##$LEV0= 0
##$LPBIN= 0
##$MAXI= 10000
##$MC2= 0
##$MEAN= 0
##$ME_mod= 0
##$MI= 0
##$NCOEF= 0
##$NC_proc= -4
##$NLEV= 6
##$NOISF1= 0
##$NOISF2= 0
##$NSP= 0
##$NTH_PI= 0
##$NZP= 0
##$OFFSET= 16.522
##$PC= 1
##$PHC0= 17.73305
##$PHC1= 4.760198
##$PH_mod= 1
##$PKNL= yes
##$PPARMOD= 0
##$PSCAL= 4
##$PSIGN= 0
##$REVERSE= no
##$SF= 250.13
##$SI= 32768
##$SIGF1= 0
##$SIGF2= 0
##$SINO= 400
##$SIOLD= 32768
##$SREGLST= <1H.CDCl3>
##$SSB= 0
##$STSI= 32768
##$STSR= 0
##$SW_p= 5175.98343685301
##$SYMM= 0
##$S_DEV= 0
##$TDeff= 65536
##$TDoff= 0
##$TI= <Analysis number 999999
Compound Code 99
Book Reference 9
Project Code 9>
##$TILT= no
##$TM1= 0
##$TM2= 0
##$TOPLEV= 0
##$USERP1= <user>
##$USERP2= <user>
##$USERP3= <user>
##$USERP4= <user>
##$USERP5= <user>
##$WDW= 1
##$XDIM= 32768
##$YMAX_p= 337287955
##$YMIN_p= -74578
$$ End of Bruker specific parameters
$$ ---------------------------------
##NTUPLES= NMR SPECTRUM
##VAR_NAME=  FREQUENCY,     SPECTRUM/REAL,   SPECTRUM/IMAG
##SYMBOL=    X,             R,               I
##VAR_TYPE=  INDEPENDENT,   DEPENDENT,       DEPENDENT
##VAR_FORM=  AFFN,          ASDF,            ASDF
##VAR_DIM=   32768,         32768,           32768
##UNITS=     HZ,            ARBITRARY UNITS, ARBITRARY UNITS
##FACTOR=    0.157963299565203, 1,           1
##FIRST=     4132.6476996994, 0,             0
##LAST=      -1043.33573715361, 0,           0
##MIN=       -1043.33573715361, -74578,      0
##MAX=       4132.6476996994, 337287955,     0
$$ Real data points
##PAGE= N=1
##DATA TABLE= (X++(R..R)), XYDATA
$$ [...]
18551D40564j4369l2989l8957l5314l8446l4972l0560k4824k3459j7081r883q551
18539A31159l462q727o9P009j1083p133l224j7205j951J1825m643k853M187l554
18525I0276k181p423j2514l861M148J5848K512m562P785R73m634j364J15J3107
18511I8225J5857K4985J1634J9489L9748L8187L0363K0015l888j0405j0785l6506
18499B36919l4227l6025l1338k5488m583m992j1131q871j502Q483K273q372q159
18486G2987k226j1j111N443J191m255M554P831k285Q01j448K78k323l443l045
18471G2938j2803k115K400j260p852L902Q768J947J136M03M426J1256P876n618
18457H5404M38j872l427r553J479R819m371q34LP633p736r55O021k770J48j197
$$ plain form
18551 440564 426195 393206 354249 318935 280489 245517 214957 190133 166674 149593 139710 131159
18539 131159 127697 118970 118901 125910 114827 107694 104470 87265 85314 97139 92496 89643 93830 90276
18525 90276 88095 80672 68158 64297 68445 84293 86805 82243 90028 91001 86367 85003 85118 98225
18511 98225 114082 139067 150701 170190 209938 248125 278488 298503 294615 284210 273425 236919
18499 236919 202692 166667 135329 109841 105258 100266 89135 80264 78762 87245 89518 81146 72987
18486 72987 70761 70750 69639 75082 76273 72018 76572 84403 82118 82919 81471 81749 79426 75983 72938
18471 72938 60135 58020 60420 59160 51308 55210 63978 65925 67061 67464 71890 83146 91022 85404
18457 85404 85842 83970 80543 70990 72469 82288 77917 77083 77086 84719 76983 76028 82049 79279 79427 78230
18441G8230q344N626L307J207J321q296N106K700N474p626j3729J1139J0159n138
18427H1136j335J2815M69j5613o877l126L833R093K938K310p285q586K545j0811
18413F1506o756j0766j115N400R424j488j272P6O038m682O677P535m338j647j0846
18398E3746r455J6165N649n869j0060J0127J2567K037m818P660J0118l847N106
18385H9126n55P808l167j1479j459M372Q113M079k543j3644M525M236r668p201
18371G2543o390J417m878p50J109J605O25q17R779K956K074o680j96Q946K463
18356H3806o496J775R51L221k577n448l987k505J0923J2398k460m620P63L691
18342H9435Q871k980r507Q614M962N851j243k40O430J08m917l823l424O902P374
$$ plain form
18441 78230 69886 75512 78819 80026 81347 73051 78157 80857 86331 78705 64976 76115 86274 81136
18427 81136 79801 92616 93085 77472 70595 67469 71302 80395 83333 85643 78358 69772 72317 61506
18413 61506 54750 43984 42869 48269 57693 56205 54933 55009 61047 56365 63042 70577 66239 64592 53746
18398 53746 44291 60456 66105 60236 50176 60303 72870 74907 70089 77749 87867 84020 89126
18385 89126 88571 96379 93212 81733 80274 84646 92759 96838 94295 80651 85176 89412 79744 72543
18371 72543 66153 67570 62692 61942 63051 64656 65281 64464 74243 77199 79273 72593 72397 81343 83806
18356 83806 77310 79085 80036 83257 80680 75232 71245 68740 79663 92061 89601 84981 85744 89435
18342 89435 98306 95326 85819 94433 99395 105246 104003 103763 110193 110301 105384 101561 98137 105039 112413
18327A12413l462J0555K2j697P874J0774J2604J3029K2261J1014j368O427R647
18314B10093j355j059P967K0191Q391P881J433K392o594j397p584m749k562R275
18300B42323m413r834j4585m817k337K720J5466Q474l720q632j1842q692n229
18287A94882L40q524j4013j9100j3747k46j3114n084J078J4462l724n823N268
18274A32655j473m541n264o897N049L675m429P93R038Q327j624M877N45M043N484
18259A50258l036R3o623L969M821K335l364Q440J8932q400p511P139J0098j933
18245A75218M500O784O22N757J1678K101p339l238L711O261P15J837J0001M557
18231B23165P061R729P690j331j1427o060l532K644R647j0456j3909j4865M501
$$ plain form
18327 112413 108951 119506 119528 117831 125705 136479 149083 162112 184373 195387 194019 200446 210093
18314 210093 208738 207679 215646 235837 244228 252109 253542 255934 249340 247943 240359 235610 233048 242323
18300 242323 237910 228076 213491 208674 206337 209057 224523 232997 229277 220645 208803 200111 194882
18287 194882 195222 186698 172685 153585 139838 139592 126478 121394 122472 136934 133210 127387 132655
18274 132655 131182 126641 121377 114480 119529 123204 118775 119568 128606 136933 135309 140186 140731 144774 150258
18259 150258 147222 147315 140692 144661 149482 151817 148453 156893 175825 167425 159914 167053 177151 175218
18245 175218 179718 186502 187124 192881 204559 206660 199321 196083 199794 206055 206770 208607 218608 223165
18231 223165 230226 239955 247645 246314 234887 228827 225295 227939 237586 227130 213221 198356 202857
18218B02857L318j1167l822O011Q475j388O91M199P490L106j1276n078M726Q183
18204B16325J0861R160P188J2292J6325L088K146J4276J6284L964Q223J1607l114
18191C28625J0253J6245P450K0942K6621L2077K7685K9713L6132K0631J1669J0823
18179E78866J3535j0249p715j6465j9181j7593j4386j8148k4968j5750j2696j5432
18167D19818m962m625q974m097Q31j4664L801N051J403O098J0485J2039K8654
18154D50858J9320K3128L5951L2557K6546J7992K2469K8565J1320K3380K9141
18143G21227L3284L9561N2178O4147P8697Q3842J08843J04786R1202Q0802O6364
18132A524933M3054J4425r194k5515k3714l684J8690M2423O2741R6985J40986
$$ plain form
18218 202857 206175 195008 191186 197197 205672 204284 204975 209174 216664 219770 208494 203416 208142 216325
18204 216325 227186 236346 243534 255826 272151 275239 277385 291661 307945 311909 320132 331739 328625
18191 328625 338878 355123 362573 383515 410136 442213 469898 499611 535743 556374 568043 578866
18179 578866 592401 582152 574437 557972 538791 521198 506812 488664 463696 447946 435250 419818
18167 419818 414856 410231 401257 397160 397991 383327 387128 392179 393582 399680 410165 422204 450858
18154 450858 470178 493306 529257 561814 588360 606352 628821 657386 668706 692086 721227
18143 721227 754511 794072 846250 910397 989094 1072936 1181779 1286565 1377767 1458569 1524933
18132 1524933 1567987 1582412 1573218 1547703 1523989 1520305 1538995 1581418 1644159 1741144 1882130
18121A882130J89324K59741L56615M80759O75858R64596J420473K116189L073567
18112A1419252M145198N034152N507854N616166N284258M318952K146407j021060
18104D2451179l141293m238143m663114o109085o284093m107824k490414j616066
18096I801147j129621q23350n96363m51598l32695k47241j68069j20458p7515
18087E854237m1354j29J7518R530j8972k9733o1773r9143j23049j32938j22963
18076E251231p2373m354J01128K21950L54019N30737P64536J086789J571145K332099
18066A2136907L426808M814795O318795P640617Q626050R185353Q746511P101220
18058F7997056M460353J779168r03347l898987o363218p631903p797587p727604
$$ plain form
18121 1882130 2071454 2331195 2687810 3168569 3844427 4809023 6229496 8345685 11419252
18112 11419252 15564450 20598602 26106456 31722622 37006880 41325832 43472239 42451179
18104 42451179 39309886 35071743 30408629 24299544 18015451 13907627 11417213 9801147
18096 9801147 8671526 7848176 7251813 6800215 6467520 6220279 6052210 5931752 5854237
18087 5854237 5812883 5812754 5830272 5839802 5820830 5791097 5729324 5630181 5507132 5374194 5251231
18076 5251231 5178858 5174504 5275632 5497582 5851601 6382338 7146874 8233663 9804808 12136907
18066 12136907 15563715 20378510 26697305 34337922 42963972 52149325 60895836 67997056
18058 67997056 72457409 74236577 73333230 69434243 63071025 55439122 47641535 39913931
18050C9913931p322313o179611m687244l271363k276439j646062j255991r77459
18042A2297449p64436o21678m95210l76907k71179k14145j70219j57724j46772
18033I079179j62296k07164k42601k71121k82921k93019k72236k43800j94792
18024F909229j23286l8185O2878J84941L31122N21521P75590J132569J692751
18015A1449130K588446L787491N083162O121569O585910O462479N511328L417893
18007E1007408M56982k638555m756833o193364o952394o391817n080632l572631
17999A5878164k412919j685597j241588r30302p15691n78029m70827l88927l30444
17990G123840k87269k46132k27121j78594j41317j22089j19166j26378j41713
$$ plain form
18050 39913931 32591618 26412007 21724763 18453400 16176961 14530899 13274908 12297449
18042 12297449 11533013 10911335 10416125 10039218 9768039 9553894 9383675 9225951 9079179
18033 9079179 8916883 8709719 8467118 8195997 7913076 7620057 7347821 7104021 6909229
18024 6909229 6785943 6747758 6810636 6995577 7326699 7848220 8623810 9756379 11449130
18015 11449130 14037576 17825067 22908229 29029798 35615708 42078187 47589515 51007408
18007 51007408 51464390 48825835 44069002 37875638 30923244 24531427 19450795 15878164
17999 15878164 13465245 11779648 10538060 9607758 8892067 8314038 7843211 7454284 7123840
17990 7123840 6836571 6590439 6363318 6184724 6043407 5921318 5802152 5675774 5534061
17981E534061j58238j88674k19710k32004k22594k07787j96288j72177j48515
17972C788074j20215j19061j14944j20359j22600j00441r8084j00986p8977o4710
17962B747697o8586p5206o1386n6649o4942p2032p2817p1102p4590p2493o5937
17951A991957p5469o1625n4802n1106m4417n6692m2210l4088l3997l1360l3553
17940A472638l1019m4965l6471k4930k8800k8944k4945k8050l3443j1328k1128
17929A158615k0449j1997j3834j6419p303j8149k5136j2644k232J27l402j0117
17917A017060r724j9526j9263k0995j3929k4593k5235j7924j8001k3092k8585
17906G96193j8659m0414m2977l1283k9116l7274j8423r841k583n849j7976r102
$$ plain form
17981 5534061 5375823 5187149 4967439 4735435 4512841 4305054 4108766 3936589 3788074
17972 3788074 3667859 3548798 3433854 3313495 3190895 3090454 2992370 2891384 2812407 2747697
17962 2747697 2679111 2603905 2542519 2485870 2420928 2348896 2276079 2204977 2130387 2057894 1991957
17951 1991957 1916488 1854863 1800061 1748955 1704538 1647846 1605636 1571548 1537551 1506191 1472638
17940 1472638 1441619 1396654 1360183 1335253 1306453 1277509 1252564 1224514 1191071 1179743 1158615
17929 1158615 1138166 1126169 1112335 1095916 1088613 1070464 1045328 1032684 1030452 1030579 1027177 1017060
17917 1017060 1007336 987810 968547 947552 933623 909030 883795 865871 847870 824778 796193
17906 796193 777534 737120 694143 662860 633744 596470 578047 568206 565623 559774 541798 532696
17894E32696K763O767O860j537q438l943J1671n6N897J7372J5829J7333K4393
17881F27607J8085J9010J3827Q180P59M020J2993N117j686N64o838p256l272O0
17867F91170j2518o511n131J822l522j2397j9909P49L13j4631j4517k0252j6906
17854E67760k4845k9863k5256j9683k0444k9947k6202p130j0911m259r787n779
17842C53654o891k880L869R756J1316J1679N809p29J1203J7956R483M455J285
17829D29965P890j754K509K979R374O384J4642J6952J6864J4754J6407J4773O895
17816E58634J475J1884K1214J1433K486O415J4238O375n423K80k888n931k638
17803F17554j8433j9004k6690k5617k3562l2400l6073k5134k3198j9501k4986
$$ plain form
17894 532696 535459 542226 549086 547549 539111 535168 546839 546783 552680 570052 585881 603214 627607
17881 627607 645692 664702 678529 686709 687468 691488 704481 709598 707912 708476 701638 694382 691110 691170
17867 691170 678652 672141 667010 668832 665310 652913 633004 633753 634066 619435 604918 584666 567760
17854 567760 542915 513052 487796 468113 447669 417722 391520 384390 373479 369220 359433 353654
17842 353654 346763 343883 347752 357508 368824 380503 386312 385583 396786 414742 424225 428680 429965
17829 429965 437855 436101 438610 441589 450963 457347 471989 488941 505805 520559 536966 551739 558634
17816 558634 560109 571993 593207 604640 607126 613541 627779 634154 628731 629011 626123 620192 617554
17803 617554 599121 580117 553427 527810 504248 471848 435775 410641 387443 367942 342956
17792C42956j6437j4146j5435m317N88j0761r860j377j1005j5229o670M436K030
17779B44773O017r011j7271O252J36k225J2233K1954J5671J6198Q865N157K0466
17766C29215M0111L7209L0426K8045L0348J6915R409J4060J769M294L806l212
17754E42395k1299j0259q186m497o12q441j8416j7647j0976r185k998l460j7260
17741D09159j3963p411l202j0811m528q919r259j6663j8724l582l865k2504k3108
17728B62620o110n591m688o889j526N709M52N283q481J499J919n232j0206n817
17714B22942J139P051J2320O718J876J0472Q164Q411l031P690J3622P437L605
17701C08416Q042J023K158M967R362k320n463m073J4813O014R188m516k171J8961
$$ plain form
17792 342956 326519 312373 296938 292621 293209 282448 272588 271211 260206 244977 238307 242743 244773
17779 244773 250790 241779 224508 230760 230896 228671 240904 262858 278529 294727 303592 308749 329215
17766 329215 369326 406535 436961 465006 495354 512269 521678 535738 537507 541801 545607 542395
17754 542395 521096 510837 502651 498154 497542 489101 470685 453038 442062 432877 429879 426419 409159
17741 409159 395196 387785 384583 373772 369244 360325 351066 334403 315679 312097 308232 285728 262620
17728 262620 256510 250919 246231 239342 237816 243525 243977 249260 240779 242278 244197 238965 228759 222942
17714 222942 224081 231132 243452 250170 252046 262518 270682 279093 276062 283752 297374 304811 308416
17701 308416 316458 317481 319639 324606 333968 331648 326185 322112 336925 342939 352127 347611 345440 364401
17687C64401J1425J0270J3363k079m520o072m207O701L258l151J723j751q248
17674C81113j816k123o679o48p387r085j2896r431J828l371L925q593o453q165
17660C10219j878m491p020m877j0750J240Q533M526M714J6725K8050L3180L5407
17647D13578L9546L0534K2714L2730K6808J9560j3842j2975j357p644k0295j9955
17635E09402j1526l684j5408l916l244j2600k290J1995R189M469R40M471M317
17622D92115R142P582R549L0912K9464K1141J2928J1215K6314J7188J8998L120
17610F89668N104J8273P329n480n054j5552k4908k5402j2210k1787j0980m778
17598E94223n943J225M334M634j820n801m159N25Q017r98j5290l346n16J255K538
$$ plain form
17687 364401 375826 386096 399459 397380 392860 386788 382581 389282 392540 389389 391112 389361 381113
17674 381113 379297 377174 370495 369847 362460 353375 340479 331048 332876 329505 333430 324837 318384 310219
17660 310219 308341 303850 296830 291953 281203 282443 290976 295502 300216 316941 344991 378171 413578
17647 413578 453124 483658 506372 539102 565910 585470 571628 558653 557296 549652 529357 509402
17635 509402 497876 494192 478784 474868 471624 459024 456734 468729 477918 482387 483327 487798 492115
17622 492115 501257 508839 518388 549300 578764 599905 612833 624048 650362 667550 686548 689668
17610 689668 694772 713045 720374 714894 709840 694288 669380 643978 631768 609981 599001 594223
17598 594223 588280 589505 593839 598473 596653 590852 586693 587218 595235 594237 578947 575601 575085 576340 578878
17583E78878J915j1971K263R457M289K449J4643K443k131M897J3121J8514J3817
17570F52584J6368K2789L2147L2741L4191M0293N7145O9539N4411N3593M7535
17559A113336K8533J8563L548j0053k5349l3508k4897j4648k4813j3044n701J218
17547A013185J1927J9754J4547K2515J8122J7451L3023L9557L1153M4888N1479
17536A317601M5580L8312L0196L9244N2069O0519O1217Q6063R0288J12850J41078
17525B075017J59819J60937J70677J89618K04881K18583K55106L05014L72253
17516D111905M77810O38599Q56286J138083J488419J890269K327190K786582L197904
17507A8913047L428057L453304L357307L212553K840876K302895J903968J794828
$$ plain form
17583 578878 580793 568822 571085 580542 584831 587280 601923 604366 602235 607132 620253 638767 652584
17570 652584 668952 691741 723888 756629 790820 831113 888258 957797 1012208 1065801 1113336
17559 1113336 1141869 1160432 1163980 1153927 1128578 1095070 1070173 1055525 1030712 1017668 1011967 1013185
17547 1013185 1025112 1044866 1059413 1081928 1100050 1117501 1150524 1190081 1221234 1266122 1317601
17536 1317601 1363181 1401493 1431689 1470933 1523002 1583521 1644738 1730801 1821089 1933939 2075017
17525 2075017 2234836 2395773 2566450 2756068 2960949 3179532 3434638 3739652 4111905
17516 4111905 4589715 5228314 6084600 7222683 8711102 10601371 12928561 15715143 18913047
17507 18913047 22341104 25794408 29151715 32364268 35205144 37508039 39412007 41206835
17499D1206835J830176J936847K224783K616991K980345L201369L178157K815107
17491F1990610K202066J528388Q04319R1131m96520r87119j224698j070242o76354
17482F2161581l26962n4598J12277J20221p9239o66579j738082k926730l713829
17473E2888060m237655m812400n103742m856924m272207l672177l078688k469313
17465B0384954j911825j455170j138695r28546p64827o58388n70949n05955m52862
17456A1997737m14690l81239l49719l21880k96584k66865k36030k13548j93549
17447I323633j58758j21660j04389p0887k3950K4219Q1949J66112K87266M81521
17437I885056P64721J153687J581356J928429K299364K878988L486472L615662
$$ plain form
17499 41206835 43037011 44973858 47198641 49815632 52795977 55997346 59175503 61990610
17491 61990610 64192676 65721064 66525383 66616514 66119994 65132875 63908177 62837935 62161581
17482 62161581 61834619 61780021 61892298 62012519 61933280 61266701 59528619 56601889 52888060
17473 52888060 48650405 43838005 38734263 33877339 29605132 25932955 22854267 20384954
17465 20384954 18473129 17017959 15879264 14950718 14185891 13527503 12956554 12450599 11997737
17456 11997737 11583047 11201808 10852089 10530209 10233625 9966760 9730730 9517182 9323633
17447 9323633 9164875 9043215 8938826 8867939 8843989 8868208 8950157 9116269 9403535 9885056
17437 9885056 10649777 11803464 13384820 15313249 17612613 20491601 23978073 27593735
17429B7593735L395161L531748L889299L851093L373542K926548K117172J509667
17421E2187965J569338J071596q96596k058222j427988j076054j845692k345469
17413D5178878k395845k434723k263606k213811k950163l551002l054229k439444
17405B3876055k297618k159942j682484j161716p55626m92802k94067r1118J33477
17396A5074159L83959P04770J193835J859513K660521L536133M424887N200516
17388C5038293N671215N683700N273895M753439M266209L548125K493081J705138
17380F8433095J566569J593967J060177M21991K26747L99915J167200J905267
17372G6774928J384156J86727J24069L10440p71436k337006l104681l522591l840745
$$ plain form
17429 27593735 30988896 34520644 38409943 42261036 45634578 48561126 50678298 52187965
17421 52187965 53757303 54828899 53932303 51874081 50446093 49370039 47524347 45178878
17413 45178878 42783033 40348310 38084704 35870893 32920730 29369728 26315499 23876055
17405 23876055 21578437 19418495 17736011 16574295 15818669 15325867 15031800 14940682 15074159
17396 15074159 15458118 16162888 17356723 19216236 21876757 25412890 29837777 35038293
17388 35038293 40709508 46393208 51667103 56420542 60686751 64234876 66727957 68433095
17380 68433095 69999664 71593631 72653808 73075799 73302546 73702461 74869661 76774928
17372 76774928 78159084 78345811 78469880 78780320 78008884 75671878 72567197 69044606 65203861
17363F5203861m105717m775895n784578n873887n240338m743894m324296l570936
17355B6784320k675619j979258j502581j172022r46827p75991o42672n37744m21585
17346A6130021k85125j15762O8439L35803P33168J278894J882912K497513L033090
17337B5558953L345059L351886L040068K479229J755963R27943J05817m85666
17329D0079252r20316j279465j532318j692776j727380j479271q93236j24904
17321C0429586O04479J152423J363251J250787Q76677L50650k48047p71712j184455
17312C3823639j562141j906858k251384k602189k832768k786085k520783k137602
17304A5223829j695186j288016r82311p67861o35464n21332m47992l90348l55861
$$ plain form
17363 65203861 61098144 56322249 50537671 44663784 39423446 34679552 30355256 26784320
17355 26784320 24108701 22129443 20626862 19454840 18508013 17732022 17089350 16551606 16130021
17346 16130021 15844896 15729134 15797573 16133376 16866544 18145438 20028350 22525863 25558953
17337 25558953 28904012 32255898 35295966 37775195 39531158 40459101 40564918 40079252
17329 40079252 39158936 37879471 36347153 34654377 32926997 31447726 30554490 30429586
17321 30429586 31034065 32186488 33549739 34800526 35677203 36027853 35779806 35008094 33823639
17312 33823639 32261498 30354640 28103256 25501067 22668299 19882214 17361431 15223829
17304 15223829 13528643 12240627 11258316 10490455 9854991 9333659 8885667 8495319 8139458
17295H139458l23240k99879k80860k74017k66936k58140k54629k34003k12672
17286E735082k02931k03622j89630j85932j71870j61920j62075j58566j28100
17277D170436j18704j22061j09827j02716j06593j04028r4895q4016q3673q8840
17267C155083q6709p5245p6539p9105o1278n4256o7011o5615p2233o4975n4336
17256B397781n8383o6972n9043p5436p1105p2178o9512n2115m5631n6688o6970
17245A703748n0821l8854n7537n6504m0747m5509m5343m8610k6374l8569l8872
17234A216008m1386l6732m0433l1148k2775l6826m1270l1539k6133j9887k1565
17223H66314j4012j6497k4378k0860j6820j7115J372k560k3197k1493j4098P38
$$ plain form
17295 8139458 7816218 7516339 7235479 6961462 6694526 6436386 6181757 5947754 5735082
17286 5735082 5532151 5328529 5138899 4952967 4781097 4619177 4457102 4298536 4170436
17277 4170436 4051732 3929671 3819844 3717128 3610535 3506507 3411612 3327596 3243923 3155083
17267 3155083 3068374 2993129 2916590 2837485 2776207 2721951 2654940 2589325 2517092 2452117 2397781
17256 2397781 2339398 2272426 2213383 2137947 2066842 1994664 1925152 1873037 1827406 1770718 1703748
17245 1703748 1652927 1614073 1556536 1500032 1459285 1413776 1368433 1319823 1293449 1254880 1216008
17234 1216008 1174622 1137890 1097457 1066309 1043534 1006708 965438 933899 907766 887879 866314
17223 866314 852302 835805 811427 790567 773747 756632 758004 755444 732247 710754 696656 697394
17211F97394r734p983p938j7569k1258j4576j3221j3964j0615j4703m637n380
17199E55816j0306j1170j3264j7548r640o044n704j0498l363n737p927k0431k0139
17186D14045j1845o187j3319r903j2949q147r276n902j467r514j7787j3713Q191
17173C02227J462j1709n865j1792j5401r380j0359j349L012k189j212j367m43
17160B35635l317p8j0374l271m796K066j708r573m530J486L186m31q636K270k842
17145A95087n263n871r940j762K467l47k336l210o617L286k170k773Q27N272m018
17130A62632j4840K824l706l639L329o999n277l32N07P55O088l477l180K888o953
17115A30620n347o637j022n561N780J4814L892n6o166j1302o320r765j4870j0176
$$ plain form
17211 697394 687660 679677 671739 654170 632912 618336 605115 591151 580536 565833 561196 555816
17199 555816 545510 534340 521076 503528 493888 487844 482140 471642 468279 462542 454615 434184 414045
17186 414045 402200 396013 382694 372791 359842 351695 342419 336517 335050 325536 307749 294036 302227
17173 302227 303689 291980 286115 274323 258922 249542 239183 237834 240846 238657 237445 236078 235635
17160 235635 232318 232240 221866 218595 213799 215865 214157 204584 200054 201540 204726 204295 195659 197929 195087
17145 195087 189824 183953 174013 172251 174718 174371 172035 168825 162208 165494 163324 160551 161378 166650 162632
17130 162632 147792 150616 146910 143271 146600 139601 134324 133992 134499 135254 141342 137865 134685 137573 130620
17115 130620 125273 118636 117614 112053 117833 132647 136539 136483 130317 119015 112695 102930 88060 77884
17101G7884M212q744K480l662o843JK194k626M942l759l927j069k724n787l900
17086D8672J8619R865K602L02k928r149m430J0194M690p395q937K455p290l141
17072E4129M670L295m182K357M003l829q584m980r902r990m79Q414R32J009l178
17057C3685j0228o131k197p545n064m81m641k249M88M579P514J1117N211j126
17043B2932K727j1084j5602P085l674k750M31J630J3185J6862K596L379L505j0175
17029C1047j0444M631J5567j192M198J3581J7948J6712K0104R725J3714R107R135
17016A53833J2121J5784J7735L2842J5884K985P819J1914k260L642J6817J0861
17004B99977P887O315J2589K5413P636K01q433m437j1093r908j9839k4316j5012
$$ plain form
17101 77884 82096 73352 75832 72170 65327 65328 67522 64896 69838 66079 62152 61083 58359 52572 48672
17086 48672 67291 77156 79758 80060 77132 67983 63553 73747 78437 71042 62105 64560 57270 54129
17072 54129 58799 62094 57912 60269 64272 60443 51859 46879 36977 26987 26508 34922 35854 36863 33685
17057 33685 23457 17326 15129 7584 2520 2039 -2602 -4851 -4363 216 7730 18847 24058 22932
17043 22932 25659 14575 -1027 6058 2384 -366 65 1695 14880 31742 34338 37717 41222 31047
17029 31047 20603 25234 40801 39609 43807 57388 75336 92048 112152 121877 135591 144698 153833
17016 153833 165954 181738 199473 232315 248199 251184 259003 270917 268657 272299 289116 299977
17004 299977 307864 314179 326768 352181 359817 360018 351585 347148 336055 326147 306308 281992 266980
16991B66980j8611j0439O395R754M142m48j6158j4421j6570k3083j8216k5483
16979A43842k9888j4699j6494j3073j981l285P548J5635M43j3805j2915k508r483
16966D9337j0256p592n97J236l430k159r579k305M948j323M295K464J6215J664
16952D2918L711m33r558j1998k463L77k817m852Q63l171j4062J193L873L347J328
16937H256L734R892k63j394J2212M806L859L239O044J4830J5324K6419L2078K9078
16923A68114K6411J4944J357M414K660M470j560J7341J6106J733p725j6555r625
16910B22085q958r711j8281j9240l091j411k494o630k6976k0429j8579j6195q037
16897F2053L552O334m061Q342Q611J4688J9065L4949J9801J3939J5397J5333N616
$$ plain form
16991 266980 248369 237930 244325 254079 258221 257773 241615 227194 210624 187541 169325 143842
16979 143842 113954 99255 82761 69688 67707 64422 71970 87605 88048 74243 61328 58820 49337
16966 49337 39081 31489 30892 32128 28698 26539 16960 14655 19603 18280 22575 25039 41254 42918
16952 42918 46629 46196 36638 24640 22177 22554 19737 14885 15748 12577 -1485 -292 3581 6928 8256
16937 8256 11990 21882 21619 20225 32437 37243 41102 44341 50385 65215 80539 106958 139036 168114
16923 168114 194525 209469 210826 215240 217900 222370 220810 238151 254257 255990 248265 231710 222085
16910 222085 213127 203416 185135 165895 162804 161393 158899 152269 125293 104864 86285 70090 62053
16897 62053 65605 71939 67878 76220 84831 99519 118584 153533 173334 187273 202670 218003 223619
16884B23619R985J0679J3224K731K878Q380J4280J2114K0113K2084J2061K3506
16872C75654K3387M971Q696K1275J1831j1956j5029j1521m183j9306l0504l1691
16860C21624k7519l2460l0072j7547j5375j7785j7819k2199j2236j7972r192j2673
16848H8775l412q696n797N890M776J197l800P549J1488P411J7721J7577J3467
16835A54146J9027K0859q76j764r193k484j005j720j2567m998p454n18r60R218
16821A59711J4500N001J011R940N859q820q7j0362j2054j0274j4006j2212j8437
16808A09770m853k547r620j9726k3527j2214m970l158o164m262j1939l992Q575
16795A1373n97n831L607L934J150k348j720L818q502l37r028K303J6002k752M291
$$ plain form
16884 223619 233604 244283 257507 260238 263116 271496 285776 297890 318003 340087 352148 375654
16872 375654 399041 404012 412708 433983 445814 433858 418829 407308 403125 383819 353315 321624
16860 321624 294105 261645 231573 214026 198651 180866 163047 140848 128612 110640 101448 88775
16848 88775 85363 76667 70870 76760 81536 82733 78933 86482 97970 105381 123102 140679 154146
16835 154146 173173 194032 193156 191392 182199 179715 178710 176990 164423 159425 151971 151453 150493 159711
16821 159711 174211 179212 180223 190163 196022 187202 187115 176753 164699 154425 140419 128207 109770
16808 109770 104917 102370 92750 73024 49497 37283 32313 29155 22991 18729 6790 2798 11373
16795 11373 10776 4945 8552 12486 13636 11288 9568 13386 4884 4547 -4481 -2178 13824 11072 15363
16780A5363O31j2191j1754o571m368r581K627M574k758j0443K764L884N798R607
16766a2418K965r222j1643O266K835m958r882m36L469J345M895O049Q837L965
16752g933j256k867n059m311p50o526l176l80l200K861O783J056N639n311K962
16737b1468o781L098O486q455m324Q454p798p542O422M948o195m180P313J1712
16723a8310M917k107o826q644j3101P723O011k919J749Q622K23m6j825r455j4890
16708d8878J1264J2434K674n102k243R75q13L041k755j0894O898j443p223n486
16694d7551j5113L719R637J3405M328m897n997m028k390K500m366Q095M001J6167
16680b2490L545j0078m760m4N119J153m778m036Q150J0118K811l839l176L632
$$ plain form
16780 15363 15994 3803 -7951 -14522 -18890 -28471 -25844 -21270 -24028 -34471 -31707 -27823 -22025 -12418
16766 -12418 -9453 -18675 -30318 -24052 -21217 -26175 -36057 -36493 -33024 -31679 -26784 -20735 -11898 -7933
16752 -7933 -9189 -12056 -17115 -21426 -22176 -28702 -31878 -32258 -35458 -32597 -25814 -24758 -19119 -24430 -21468
16737 -21468 -28249 -25151 -18665 -27120 -31444 -22990 -30788 -38330 -31908 -26960 -33155 -37335 -30022 -18310
16723 -18310 -13393 -15500 -22326 -30970 -44071 -36348 -30337 -33256 -31507 -22885 -22662 -22708 -24533 -33988 -48878
16708 -48878 -37614 -25180 -22506 -27608 -29851 -28876 -29689 -26648 -29403 -40297 -33399 -34842 -42065 -47551
16694 -47551 -62664 -58945 -49308 -35903 -31575 -36472 -42469 -46497 -48887 -46387 -50753 -42658 -38657 -22490
16680 -22490 -18945 -29023 -33783 -33827 -28708 -27555 -32333 -36369 -28219 -18101 -15290 -19129 -22305 -18673
16666a8673J193J757q856q056j757O173k196j0315J279K243N911o147l895O773
16652c4566J564r096m596P752k156N835O560R518r30j516L867L080q799o325N589
16637b4219k902J123P728m048o670N255l452j2910L180J0387m159o486m354P721
16623c3806k713M98n335l577K917J0074p76r809p901O653L88l346j072J2048N370
16608c0387M058L869r483l531J4424P212p033j4063j6312p242M996J5465N095
16595c2932j046k894j822O71o585Q371R280O137K512n173r130m44o300p87P136
16580c3006l409L125J1287l507n201K055l678L05o022o561Q385k396O215J2229
16566b0179J181q115M679K057P589O957j452r776n732LK752m869j1152L494R632
$$ plain form
16666 -18673 -17480 -15723 -24579 -32635 -34392 -28219 -30415 -40730 -39451 -37208 -31297 -37444 -41339 -34566
16652 -34566 -33002 -42098 -46694 -38942 -41098 -35263 -28703 -19185 -20115 -21631 -17764 -14684 -23483 -29808 -24219
16637 -24219 -27121 -25998 -18270 -22318 -28988 -23733 -27185 -40095 -36915 -26528 -30687 -37173 -41527 -33806
16623 -33806 -36519 -36021 -41356 -44933 -42016 -31942 -32718 -42527 -50428 -43775 -43387 -46733 -47805 -35757 -30387
16608 -30387 -26329 -22460 -31943 -35474 -21050 -13838 -20871 -34934 -51246 -58488 -53492 -38027 -32932
16595 -32932 -33978 -36872 -38694 -38023 -44608 -36237 -26957 -20820 -18308 -23481 -32611 -33055 -39355 -40142 -33006
16580 -33006 -36415 -33290 -22003 -25510 -30711 -28656 -32334 -32029 -38051 -44612 -36227 -38623 -32408 -20179
16566 -20179 -18998 -27113 -22434 -20377 -12788 -5831 -7283 -17059 -22791 -22788 -20036 -24905 -36057 -32563 -22931
16551b2931Q392o554j130l352m396K220N636J886Q500l707j211j014m145m80L036
16536a9250M128j1418r015J334J104J82o209J139J2594L397J156N047n394r857
16522c1062K330O363J470o825n20L700L074n29q519K264J6408O530j248p440q781
16507b2785n396J926p154k955J293M664N969j1274k0512q456J5802J3101N040
16494c0737l522l197J278j4524o597O704R201q75r94R25q530J540L482K496N948
16479c7402k252p790L149J0215O533M380M158l726k879M774l040p925p04k510
16465c5019K496Q03O53R497N221K138M181J127l253o279N458J834J332N82k592
16450a1821m491J49m149k742N581J3066L737q255j0991j533Q303j177n639M861
$$ plain form
16551 -22931 -14539 -21093 -22223 -25575 -29971 -27751 -22115 -20229 -11729 -15436 -16647 -17661 -21806 -22286 -19250
16536 -19250 -15122 -26540 -35555 -34221 -33117 -32935 -39144 -38005 -25411 -22014 -20858 -15811 -21205 -31062
16522 -31062 -28732 -22369 -20899 -27724 -28244 -24544 -21470 -21999 -30518 -28254 -11846 -5316 -6564 -14004 -22785
16507 -22785 -28181 -26255 -33409 -36364 -35071 -30407 -24438 -35712 -56224 -64680 -48878 -35777 -30737
16494 -30737 -34259 -37456 -36178 -50702 -57299 -50595 -41394 -42269 -43263 -42338 -50868 -49328 -45846 -43350 -37402
16479 -37402 -39654 -47444 -44295 -34080 -27547 -23167 -19009 -22735 -25614 -20840 -23880 -31805 -32509 -35019
16465 -35019 -32523 -31720 -31067 -21570 -16349 -14211 -10030 -8903 -12156 -18435 -12977 -11143 -9811 -9229 -11821
16450 -11821 -16312 -16163 -20312 -23054 -17473 -4407 -670 -8925 -19916 -21449 -13146 -14323 -19962 -15101
16436a5101O131j151l226k54J0937N650M525o012n505n111O290j256o099j5418
16422b5600m293M822K900j050P84j60M035J839p20R264P785p725n229o364p428
16407b7140p77P245K255k284l680N760N798K181M695n264n183m885K686J416j3765
16392c0942j0555K550L628K349Q331M46l703n982L192K80p352m649N071K817r907
16377d4426n539J2611k601p248O540Q932O19P838J367m356K584l409P015K677
16363a7396j130r421p629L551L579j978L78L715o662M678P731j746l873J0230
16349a5973K709o626q776o342J1132P617M153L410j072j0274n34n009O982O355
16335a2248j9296k29N563J7243m307q123k731n838p834j913J2911L440j1838r255
$$ plain form
16436 -15101 -8970 -10121 -13347 -13601 -2664 2986 7511 1499 -4006 -9117 -2827 -4083 -10182 -25600
16422 -25600 -29893 -25071 -22171 -23221 -22437 -22597 -18562 -16723 -17443 -8179 -394 -8119 -13348 -19712 -27140
16407 -27140 -27917 -20672 -18417 -20701 -24381 -18621 -12823 -10642 -5947 -11211 -16394 -21279 -18593 -17177 -30942
16392 -30942 -41497 -38947 -35319 -32970 -24639 -24193 -27896 -33878 -30686 -30406 -37758 -42407 -37336 -34519 -44426
16377 -44426 -49965 -37354 -39955 -47203 -40663 -31731 -31112 -23274 -21907 -26263 -23679 -27088 -20073 -17396
16363 -17396 -18526 -27947 -35576 -32025 -28446 -30424 -30046 -26331 -32993 -28315 -20584 -22330 -26203 -15973
16349 -15973 -13264 -19890 -28666 -35008 -23876 -16259 -12106 -8696 -9768 -20042 -20576 -25585 -18603 -12248
16335 -12248 -31544 -31773 -26210 -8967 -13274 -21397 -24128 -29966 -37800 -39713 -26802 -23362 -35200 -44455
16321d4455L84m335M834J3407K236q148p57P85o706L363O773L939Q179K649m202
16306b2054r472j850m944m267K724O655O096l643p43K509N350N378P35r105m590
16291c1221L600j62L640P549M155J861o562l396k841o534k0174O422J7405O324
16277a9934l973j33n891j596K334j129q467J0601L263M512J47R860K126n08j3635
16262b2423p511k365R898j802n478J1244k326n560N964L004J098m233m318J324
16248b3484M002o113j132L333R907k633j773j101p906l632M436J3j1500J294j768
16233c8057O201J7864J1213j6291L502R225n812Q3l507m442p325k67m050j1079
16219d2742n112J322M409r09r609K607L969q282J952P100P569J1177l549n086
$$ plain form
16321 -44455 -44071 -48406 -43572 -30165 -27929 -36077 -36834 -36049 -42755 -39392 -32619 -28680 -20501 -17852 -22054
16306 -22054 -31526 -33376 -38320 -42587 -39863 -33208 -27112 -30755 -31498 -28989 -23639 -18261 -17526 -26631 -31221
16291 -31221 -27621 -27783 -24143 -16594 -12439 -10578 -17140 -20536 -23377 -29911 -50085 -43663 -26258 -19934
16277 -19934 -23907 -24040 -29931 -31527 -29193 -30322 -38789 -28188 -24925 -20413 -20266 -10406 -8280 -8788 -22423
16262 -22423 -29934 -32299 -22401 -24203 -29681 -18437 -20763 -26323 -20359 -17355 -16257 -20490 -24808 -23484
16248 -23484 -19482 -25595 -26727 -23394 -13487 -16120 -17893 -18994 -26900 -30532 -26096 -26083 -37583 -36289 -38057
16233 -38057 -31856 -13992 -2779 -19070 -15568 -6343 -12155 -12072 -15579 -20021 -27346 -27613 -31663 -42742
16219 -42742 -47854 -46532 -42123 -43032 -52641 -50034 -46065 -54347 -52395 -45295 -37726 -26549 -30098 -35184
16205c5184p047p433J4335J0766n133m61l966K894J247m444o140P448K622j621
16191c2117r945m762M433R012K602M207K489P541R47n802q991k016L740Q388J874
16176a8400Q45j905m260j8953p282N833J3686O109M623m462j0923n096J497M103
16162c4585m057P276O538L234J0886o483k725j926Q601n907n048j497R4l174O843
16147b1930m610P401j489m808l81J390l369m267l457J2265N762m762j3230M787
16133c0698N944l227P89O626O35L996J4023r82o102n633Q97O84M30k831R40j764
16117a6273m40R172l656n512j0460o103p63q724L733Q232N519P680L549L693P16
16102i637Q306M719j014J1047J2857m736q706n665j8188j0925j877j296k299O291
$$ plain form
16205 -35184 -42231 -49664 -35329 -24563 -29696 -30157 -34123 -31229 -29982 -34426 -40566 -33118 -30496 -32117
16191 -32117 -42062 -46824 -42391 -33379 -30777 -26570 -24081 -16540 -15593 -21395 -30386 -32402 -28662 -20274 -18400
16176 -18400 -17555 -19460 -23720 -42673 -49955 -44122 -30436 -24327 -19704 -24166 -35089 -40185 -38688 -34585
16162 -34585 -38642 -31366 -24828 -21594 -10708 -17191 -19916 -21842 -13241 -19148 -24196 -25693 -25599 -28773 -21930
16147 -21930 -26540 -19139 -20628 -25436 -25817 -24427 -27796 -32063 -35520 -23255 -17493 -22255 -35485 -30698
16133 -30698 -24754 -27981 -27192 -20566 -19931 -15935 -1912 -2894 -8996 -14629 -13732 -13048 -12618 -15449 -14509 -16273
16117 -16273 -16713 -7541 -11197 -16709 -27169 -33272 -34035 -42759 -39026 -30794 -25275 -17595 -14046 -10353 -9637
16102 -9637 -1331 3388 2374 13421 26278 21542 12836 7171 -11017 -21942 -23819 -25115 -27414 -21123
16088b1123J1993J840o399j886L399J5694J9589M158L53p942p232j690n028j865
16074C861J841K651n050l372m939n561K053k082m50j382n731n941m08N538J706
16059a7266L888m738o467O278N303N572R129M115j2398j1610j146K448m801q22
16045b2515j141k920k660K617m430P506k670P283M581n816p712K546M736j930
16031b2525m9K971L868J169j171R70o441j5074J151L305O7M187R54M673n501l91
16015b7837n692K579k339m811M954R004N638j000M036m553j300P85q290j270k166
16000c2262n064m122J2232J0563J4082l806l439k313j955j2418k12L365L50K667
15986b2332k55p177k714R233j980N132m822J417L355p311k915L559k81m705M823
$$ plain form
16088 -21123 -9130 -7290 -13689 -15575 -12176 3518 23107 27265 27618 19676 12444 10754 5726 3861
16074 3861 5702 8353 3303 -69 -5008 -10569 -8516 -10598 -11048 -12430 -18161 -24102 -24510 -18972 -17266
16059 -17266 -13378 -18116 -24583 -18305 -13002 -7430 1699 5814 -6584 -18194 -19340 -16892 -21693 -22515
16045 -22515 -23656 -26576 -29236 -26619 -31049 -23543 -26213 -18930 -14349 -20165 -27877 -25331 -20595 -22525
16031 -22525 -22574 -19603 -15735 -14566 -15737 -14767 -21208 -36282 -35131 -31826 -31759 -27572 -26618 -21945 -27446 -27837
16015 -27837 -33529 -30950 -33289 -38100 -33146 -24142 -18504 -19504 -15468 -20021 -21321 -20536 -28826 -30096 -32262
16000 -32262 -37326 -41448 -29216 -18653 -4571 -8377 -11816 -14129 -16084 -28502 -28714 -25349 -24999 -22332
15986 -22332 -22587 -29764 -32478 -23245 -25225 -20093 -24915 -23498 -20143 -27454 -30369 -26810 -27091 -31796 -26973
15971b6973j853n271Q581N781N42J969J132q164p95R315m080j2204m023J1993
15957b4050M327n871l545R057p292j2713l301J2951J0382L28l820j832P627J0201
15943g551o910l643J070m55m035l057m047L00p437M025M384O83q618p433J2596
15928c0128P401P208R185j0006k656N39M020k833m239m373m889j4305o624J0724
15914d0976J3680Q922Q648n493r35o040o732K445R486K766M928M256k022k918
15900i985j0985p543p805J551L698o816L311O348j081k697L870j025L492L44N668
15885a9655Q344k795q964j535j163O581K1233k448j0389r222n35j939L283M782
15871a4422M968j494k862J136J536n830n401M283N00L316O727j093l843l147p207
$$ plain form
15971 -26973 -28826 -34097 -25516 -19735 -19193 -17224 -16092 -24256 -25051 -15736 -19816 -32020 -36043 -24050
15957 -24050 -19723 -25594 -29139 -20082 -27374 -40087 -43388 -30437 -20055 -19727 -23547 -25379 -17752 -7551
15943 -7551 -14461 -18104 -17034 -17489 -21524 -24581 -28628 -28328 -35765 -31740 -27356 -26673 -35291 -42724 -30128
15928 -30128 -22727 -15519 -6334 -16340 -18996 -18457 -14437 -17270 -21509 -25882 -30771 -45076 -51700 -40976
15914 -40976 -27296 -18374 -9726 -15219 -16154 -22194 -28926 -26481 -16995 -14229 -9301 -5045 -7067 -9985
15900 -9985 -20970 -28513 -36318 -34767 -31069 -37885 -34574 -28226 -29307 -32004 -28134 -29159 -25667 -25323 -19655
15885 -19655 -11311 -14106 -23070 -24605 -25768 -19187 2046 -402 -10791 -20013 -20548 -22487 -19204 -14422
15871 -14422 -9454 -10948 -13810 -12674 -11138 -16968 -22369 -18086 -17586 -14270 -7543 -8636 -12479 -15626 -22833
15856b2833n768M861O113N047m18k921L247R879N722o679r9j0249R81N611l094
15841a0600r898j6038q616Q289J7807K720n218p519j112k232J104M807K434k514
15827b6586m359R908Q09J837n932l674oM066J0386R703N742l015n678P784n774
15812d789j1541K09o413L264O672L641L113m013m590m441j5764n371M342N034
15798c0647K507l377O322L630k559q738j415J447K392L752Q726K740K60J933k45
15783a3272j4602j0390n995O111N756Q422P132N24n955m347k122N364K154K631
15769a8589M541J923J581n914K703Q419J312K459n639p177n642O372R82O614L611
15754b444m903j1770J603O076K715k761l593J234L332j958o547L30J387m19K646
$$ plain form
15856 -22833 -28601 -23740 -17627 -12580 -12998 -15919 -12672 -2793 2929 -3750 -3849 -14098 -13117 -7506 -10600
15841 -10600 -20498 -36536 -45152 -36863 -19056 -16336 -21554 -29073 -30185 -32417 -31313 -26506 -24072 -26586
15827 -26586 -30945 -21037 -20228 -18391 -24323 -27997 -28003 -23937 -13551 -3848 1894 -1121 -6799 985 -4789
15812 -4789 -16330 -16121 -22534 -19270 -12598 -8957 -5844 -9857 -14447 -18888 -34652 -40023 -35681 -30647
15798 -30647 -28140 -31517 -25195 -21565 -24124 -32862 -34277 -32830 -30438 -26686 -17960 -15220 -14960 -13027 -13272
15783 -13272 -27874 -38264 -44259 -38148 -32392 -23970 -16838 -16314 -22269 -26616 -28738 -23374 -21220 -18589
15769 -18589 -14048 -12125 -10544 -16458 -13755 -5336 -4024 -1565 -7204 -14381 -20023 -13651 -12669 -6055 -2444
15754 -2444 -7347 -19117 -17514 -11438 -8723 -11484 -15077 -13843 -10511 -12469 -19016 -18686 -17299 -17718 -15072
15739a5072M183j4515m737P573R444J2221n425L343q070j3360n030N973Q756J624
15725a3092M50M967J155o836r358j2077J516M496K492N953o730j20L436J123K491
15710b0134M170J833k992k102P996j1883p568j865k9P924N646Q196j017k358J792
15695a2391r56p709l755K079o95O24k095n08Q074P947J0163j393k281m438p241
15680a4575l795J366N429l869k608p55qM564k402j2350l389K891N354K627l546
15665b5066p28K407n232M943J5972L485j3667m086K100L494J298Q64j047J724
15651a3539l149m308j241l577p398N377J0620L904O587N28m987R77Q249j373j0828
15636a4158J521j0644m779N738M725J575j173L205K110l077j104M434M876K290
$$ plain form
15739 -15072 -10889 -25404 -30141 -22568 -13124 -903 -6328 -2985 -11055 -24415 -29445 -23472 -14716 -13092
15725 -13092 -12642 -7675 -6520 -13356 -22714 -34791 -33275 -28779 -26287 -20334 -27064 -27184 -23748 -22625 -20134
15710 -20134 -15964 -14131 -17123 -19225 -11229 -23112 -30680 -32545 -32574 -24650 -19004 -10808 -11825 -14183 -12391
15695 -12391 -13347 -21056 -24811 -22732 -23427 -22803 -24898 -25406 -17332 -9385 778 -615 -2896 -7334 -14575
15680 -14575 -18370 -17004 -11575 -15444 -18052 -18807 -18815 -14251 -16653 -29003 -32392 -29501 -24147 -21520 -25066
15665 -25066 -25794 -23387 -28619 -23676 -7704 -4219 -17886 -21972 -19872 -16378 -15080 -14216 -15263 -13539
15651 -13539 -16688 -20996 -22237 -25814 -33212 -27835 -17215 -13311 -6724 -6196 -11183 -10206 -1957 -3330 -14158
15636 -14158 -12637 -23281 -28060 -22322 -17597 -16022 -17195 -13990 -11880 -14957 -16061 -11627 -6751 -4461
15622d461j2584j0510l906Q147N103j556P454J130p859j0177l005Q010N328l236
15608b2122j880K1771J273j3204k089o614J269q695q314O27J2310O684k696K216
15594a9464J967l301N214l745p797N70r620P597P548N937o55m822L62R39K688
15579a6582N650k076J757l435P1J1097j0562j5817M89K242L078J0684M843q50
15565i411J383k833m710m571J0975Q167Q884k04q113j2862O866M689O30M173n265
15550b202l833j3973j1966O236Q331L772L86L449k441p216J798Q368K955j2635
15536a8971m2K259l77R108O210J334m247l970p344P184j763q774j0063o514M105
15521c1865J1912K2764j815j7085j1929j218L722M877L029l32J803j497J350o147
$$ plain form
15622 -4461 -17045 -27555 -31461 -23314 -18211 -19767 -12313 -11183 -19042 -29219 -32224 -24214 -18886 -22122
15608 -22122 -24002 -2231 -958 -14162 -16251 -22865 -21596 -30291 -38605 -37978 -25668 -18984 -21680 -19464
15594 -19464 -17497 -20798 -15584 -19329 -27126 -26556 -36176 -28579 -21031 -15094 -15749 -20571 -20209 -19270 -16582
15579 -16582 -10932 -13008 -11251 -14686 -14615 -3518 -14080 -29897 -29408 -27166 -24088 -13404 -8561 -9411
15565 -9411 -8028 -10861 -15571 -20142 -9167 -1000 7884 7680 -433 -13295 -6429 -1740 -1110 3063 -2202
15550 -2202 -6035 -20008 -31974 -25738 -17407 -13635 -13249 -9800 -12241 -19457 -17659 -9291 -6336 -18971
15536 -18971 -19013 -16754 -17131 -8023 -1813 -479 -4726 -8696 -16040 -8856 -10619 -19393 -29456 -35970 -31865
15521 -31865 -19953 2811 996 -16089 -28018 -29236 -25514 -20637 -17608 -17940 -16137 -17634 -16284 -22431
15507b2431m108k450j373r858M713J0249N309m226j3453j5J0782J3127m298q289
15493b6321M979M353k163m595r19l87L544k272p540O676J1806J1806l996n255
15479a0284q911L845O895n905j3835m901J1110J3100P893n658p850j811M97J388
15465a4427P418q048n235J495M830k67j0410O831J1591J0095l70j5303l051M522
15451a0329l64R280L035j1917NL600N59L746K192n703O566M955j0862K492N985
15436C240m847k185n240j915J147j084K639P117L184r924K880K675r546p204j406
15421b0469j84O252K605J842N691k072K579K569l534o825j497O009L688r964L316
15406i994J1731N221n048M41N085Q67j0087m710J95l659j2042m793J083K74J1493
$$ plain form
15507 -22431 -26539 -28989 -30362 -40220 -35507 -25258 -19949 -24175 -37628 -37643 -26861 -13734 -18032 -26321
15493 -26321 -21342 -16989 -19152 -23747 -24666 -25053 -21509 -23781 -31321 -24645 -12839 -1033 -5029 -10284
15479 -10284 -19195 -15350 -8455 -14360 -28195 -33096 -21986 -8886 -993 -6651 -14501 -16312 -15815 -14427
15465 -14427 -7009 -15057 -20292 -18797 -13967 -14234 -24644 -17813 -6222 3873 3503 -11800 -14851 -10329
15451 -10329 -10693 -1413 1622 -10295 -10290 -6690 -6131 -2385 -193 -5896 670 5625 -5237 -2745 3240
15436 3240 -1607 -3792 -9032 -10947 -9800 -10884 -8245 -1128 2056 -7868 -4988 -2313 -11859 -19063 -20469
15421 -20469 -20653 -14401 -11796 -9954 -4263 -6335 -3756 -1187 -4721 -11546 -13043 -7034 -3346 -13310 -9994
15406 -9994 1737 6958 1910 2351 7436 8303 -1784 -6494 -6299 -9958 -22000 -26793 -25710 -25436 -13943
15391a3943J13J015N266m506M005o395j0117R516J0082k998o583q20m615K342
15377a7638K435l152k556j386q296l05J4142K908k322k033K411K956M081K479
15363f276N54K123j196m896m651L810k873K090p888j1490P36J383j399R50M772
15348b4251P631K157o18l820K184K324n271r153Q053Q945k831j189K157K21l551
15333a7012n947L096L208M325K066M476p691o127m256J296N210J812M158N897
15319e489j549p972k963M997k692m894q61Q598p352J011r3K726O114R411Q919
15304G911J140P9M812q576o534J493L696P233M426l140o845r408q990j1146R571
15289a4278O826l869K819m1j274R380l048M988Q101m335n505M486o809j1416o822
$$ plain form
15391 -13943 -13830 -12815 -7549 -12055 -8050 -14445 -24562 -15046 -4964 -7962 -14545 -15365 -19980 -17638
15377 -17638 -15203 -18355 -20911 -22297 -30593 -30898 -16756 -13848 -16170 -18203 -15792 -12836 -8755 -6276
15363 -6276 -5722 -3599 -4795 -9691 -14342 -10532 -13405 -11315 -19203 -30693 -29957 -28574 -29973 -29023 -24251
15348 -24251 -16620 -14463 -15081 -18901 -16717 -14393 -19664 -28817 -20764 -11819 -14650 -15839 -13682 -13461 -17012
15333 -17012 -22959 -19863 -16655 -12330 -10264 -5788 -13479 -19606 -23862 -22566 -17356 -15544 -11386 -5489
15319 -5489 -7038 -15010 -17973 -12976 -15668 -20562 -21423 -12825 -20177 -19166 -19259 -16533 -10419 -1008 7911
15304 7911 9051 9130 13942 5366 -1168 325 4021 11254 15680 12540 5695 -3713 -12703 -23849 -14278
15289 -14278 -7452 -11321 -8502 -8543 -9817 -437 -3485 1503 9604 5269 -236 4250 -2559 -13975 -20797
15274b0797O527P680J8643Q808j0868j3899J34n622K354N286K526L92n594K085
15260b345Q59R19k646n022m990o429r561k902n293n098Q047R192J905j050q048
15245c2462m493O368J0337J689o391P709J2480q51l893n51J411k349l273J063
15231a3206j466M034l871j467J863K875k165L763k07q122O152L314N951O004j0903
15216g451j2825p284m278P291N912L699k603Q345O391J913q196n62M833k936K316
15201e435J0946l014j1190j624L771n545m938k752m809M033J1812p77l215N96
15187a2141j831N186K175J412K856P034P315M761j5561j3182j8403P529M912q24
15173a8762M752n882j877J1029N773J1845J1152k511m134o828p715l675q085r937
$$ plain form
15274 -20797 -14270 -6590 12053 20861 9993 -3906 -3772 -9394 -7040 -1754 772 1164 -4430 -2345
15260 -2345 -1486 -567 -3213 -8235 -13225 -19654 -29215 -32117 -37410 -42508 -34461 -25269 -23364 -24414 -32462
15245 -32462 -36955 -30587 -20250 -18561 -24952 -17243 -4763 -5614 -9507 -10058 -8647 -10996 -14269 -13206
15231 -13206 -14672 -10638 -14509 -15976 -14113 -11238 -13403 -9640 -9847 -17969 -11817 -8503 -2552 3452 -7451
15216 -7451 -20276 -27560 -31838 -24547 -18635 -14936 -17539 -9194 -2803 -890 -9086 -9648 -4815 -7751 -5435
15201 -5435 5511 2497 -8693 -10317 -6546 -12091 -17029 -19781 -24590 -20557 -8745 -9522 -12737 -12141
15187 -12141 -13972 -8786 -6611 -5199 -2343 4691 12006 16767 1206 -11976 -30379 -22850 -17938 -18762
15173 -18762 -14010 -19892 -21769 -10740 -4967 6878 18030 15519 11385 4557 -3158 -6833 -14918 -24855
15159b4855k775O280P31L672N928K449N226P001j176l752K542N956p482p181Q701
15144A265L952m686k69k221P71j2910o588m058j655K934J1158O519N570k174k623
15129e015k783M897l255L376L923o486k164q12m447J976O458L995m87k437O889
15114C628R880j756q700j0320k983L086J5317J324N474l23p495m985N152m159
15100C140j479l417J040N98L450k47j815J824k529j109m877j3727O554O12Q559
15085c423L410L375J093j6347r662J847N542o285m665N236Q638P253l628k09l12
15070h137L022J142j3348j895P338P516l440q272M115Q626q78R851J5844r00q751
15055A1833k1654n142L170M923q717k177L769L799j954m449j814J227M926J701
$$ plain form
15159 -24855 -27630 -21350 -20619 -16947 -11019 -8570 -3344 3657 2481 -1271 1271 7227 -255 -7436 1265
15144 1265 5217 531 262 -1959 -1188 -14098 -20686 -24744 -26399 -23465 -12307 -5788 -218 -2392 -5015
15129 -5015 -7798 -2901 -6156 -2780 1143 -5343 -7507 -8319 -12766 -10790 -4332 -337 -824 -3261 3628
15114 3628 13508 11752 3052 -7268 -10251 -7165 8152 9476 14950 14627 7132 2147 7299 3140
15100 3140 1661 -1756 -716 -118 3332 3085 1270 3094 565 -544 -5421 -19148 -12594 -11982 -3423
15085 -3423 -13 3362 4455 -11892 -21554 -19707 -14165 -20450 -25115 -19879 -11241 -3988 -7616 -7825 -8137
15070 -8137 -5115 -3973 -17321 -19216 -11878 -4362 -7802 -16074 -11959 -3333 -4211 5640 21484 20584 11833
15055 11833 -9821 -14963 -11793 -6870 -15587 -17764 -13995 -10196 -12150 -16599 -18413 -17186 -12260 -10559
15041a0559l409J095J472n84k255P858J049Q639l00j461K894P736m782m736j3296
15026a0639q405Q430N383L085l99J694j701o51l621n8l625O490n325q767Q37R035
15010h237J546J099J106M089j513r178J897L849j830L329K163O999Q816k780r199
14995B156r177j1046j0377O822M263J0519K609p669L981p25j005P39K238O432
14981b40o198m71M54k958j836N756L637n175j872p175m391P758O637R788p828
14966d114k237M393R855j783P574J915n294j6695n918Q545J903O748j1094q194
14952a4396M17K643o563M079O812j60J1594k933j0854m837J995L228k520k914
14938a4409N550L944j982L995O374J0193n294r423P87J8732P941q240r589j415
$$ plain form
15041 -10559 -13968 -12873 -11401 -11985 -14240 -6382 -5333 3306 3006 1545 4439 12175 7393 2657 -10639
15026 -10639 -19044 -10614 -5231 -2146 -2545 -851 -2552 -3203 -6824 -6882 -10507 -4017 -9342 -18109 -17272 -8237
15010 -8237 -6691 -5592 -4486 -397 -1910 -11088 -9191 -5342 -7172 -3843 -1680 5319 14135 11355 2156
14995 2156 -7021 -18067 -28444 -21622 -17359 -6840 -4231 -11900 -7919 -8644 -9649 -8910 -6672 -240
14981 -240 -6438 -6909 -6455 -9413 -11249 -5493 -1856 -7031 -8903 -16078 -20469 -12711 -6074 3714 -4114
14966 -4114 -6351 -1958 7897 6114 13688 15603 10309 -6386 -12304 -3759 -1856 4892 -6202 -14396
14952 -14396 -13979 -11336 -17899 -13820 -7008 -7168 4426 1493 -9361 -14198 -12203 -8975 -11495 -14409
14938 -14409 -8859 -4915 -6897 -2902 3472 13665 8371 -1052 -265 18467 26408 18168 8579 7164
14924G164K50Q974M355j0840j0104O875P839k212j0847m846k545r41l107M418
14910e567J1525J0263N15j830n259n159r333j110M155P02Q35M116N126l232j769
14895C978L480r917N55O968K264k112n518N16k352l82Q930k411q182N188M329
14880E334K998J1053N694O716J132J692j223j1264j0945l445l285J1636N100p080
14866A4113p913j6206j1135M196n156m369O837Q616o591r50R059Q74R53M505R028
14851E861k176K105J2138k411n179o282J83K813n690n486P02R132J847M598l700
14836H455J937m362p495q083K327o938r14L808k234J718L350O19m535j1322k18
14821b3887K027L839l278R818J8212J1763N966Q394m242j6298r589o317L789L084
$$ plain form
14924 7164 7414 16388 20743 9903 -201 6674 14513 12301 1454 -3392 -5937 -6878 -9985 -5567
14910 -5567 5958 16221 16736 14906 9647 4488 -4845 -5955 -1800 -1098 -263 3853 8979 5747 3978
14895 3978 7458 -2459 -1904 5064 7328 5216 -302 214 -2138 -2520 6410 3999 -4183 1005 5334
14880 5334 8332 19385 25079 31795 32927 34619 33396 22132 11187 7742 4457 16093 21193 14113
14866 14113 6200 -10006 -21141 -16945 -22101 -26470 -19633 -11017 -17608 -18558 -9499 -8625 -7672 -3167 5861
14851 5861 3685 5790 17928 15517 10338 4056 4239 7052 1362 -4124 -3422 5710 7557 12155 8455
14836 8455 10392 6030 -1465 -9548 -7221 -14159 -15073 -11265 -13499 -11781 -8431 -7812 -12347 -23669 -23887
14821 -23887 -21860 -18021 -21299 -11481 6731 18494 24460 32854 28612 12314 2725 -3592 197 3281
14807C281J0442J649m727K379L136j065q152K06p433r487M209M681l855J0773
14793F037K91j8320q058J2254O363N115K95r356j973J9027O190q249r930j091
14779a405J2574O091l751r517p156L157J9287N623j882l925J018r400m014r796
14765c096n022N195O244l69J148j3262J006P47Q555o160l766Q027l135k663R579
14750C028l26m547o041n36P490j613j890k252M089J1697j774o495M483o157k904
14735c748j798J0337m075m770m238N98J2472J58n219R48k249k88k598N67J1198
14720G295n01k755j057J185O606J407j3833r20l557L164Q351p941p477L317O648
14705f8M305L144n43r855K79M738P02M12r76n679J734O664L736k484k936r493
$$ plain form
14807 3281 13723 15372 10645 13024 16160 15095 6943 7149 -284 -9771 -5562 -881 -4736 6037
14793 6037 6328 -11992 -20050 -7796 -1433 3682 3977 -5379 -7352 11675 17865 9616 -314 -1405
14779 -1405 11169 17260 13509 3992 -3164 -7 19280 24903 23021 19096 20114 10714 6700 -3096
14765 -3096 -8118 -2923 3321 2952 4100 -9162 -8156 -7409 1146 -5014 -8780 -753 -3888 -6551 3028
14750 3028 2702 -1845 -7886 -8422 -932 -2545 -4435 -6687 -2598 9099 7325 830 5313 -844 -3748
14735 -3748 -5546 4791 716 -4054 -8292 -7694 4778 4936 -283 665 -1584 -1872 -4470 -3903 7295
14720 7295 6794 4039 2982 4167 10773 12180 -1653 -2573 -6130 -2966 5385 -2556 -10033 -6716 -68
14705 -68 4237 7381 6838 -3017 -2738 2000 2702 3114 2138 -3541 -1807 4857 8593 6109 3173 -6320
14689f320k026O805M747P4j0409N029J3755p1j2315k971L740M298K287r679j402
14674d458M884k967j483N367J5120J1875R51j1995r173J3356J125j0535j847Q631
14660A8851m641p312L778M880q598k651M382k978L429K447J590p256j7247L378
14646g948K842J930O125J0995k297J387j1468q178O25j71Q801N008J1585O526
14632B5762N928K530o41l563p747m997k512p127K927R662q60o859l307m287R63
14617E872J0902Q365l952k915q431J4J1432P906l034k455J764j4247K803Q529
14603B2553r394J1653R584j0513R45L237r761j0853m27P647j243k724o435N12
14589D781P764M673k917K495k670m18l239J938j603N871k244J638l871M220Q380
$$ plain form
14689 -6320 -8346 -1541 3206 3280 -7129 -2100 11655 11584 -731 -3702 38 4336 6623 -3056 -4458
14674 -4458 426 -2541 -4024 1343 16463 28338 29289 17294 8121 21477 22602 12067 10220 18851
14660 18851 14210 6898 10676 15556 6958 4307 8689 5711 9140 11587 13177 5921 -11326 -7948
14646 -7948 -5106 -3176 2949 13944 11647 13034 1566 -6612 -5987 -6158 2643 7651 19236 25762
14632 25762 31690 34220 33579 30016 22269 17272 14760 7633 10560 20222 19362 12503 9196 4909 5872
14617 5872 16774 25139 21187 18272 9841 9855 21287 29193 26159 23704 25468 11221 14024 22553
14603 22553 13159 24812 34396 23883 24828 28065 18304 7451 7024 14671 13428 10704 4269 4781
14589 4781 12545 17218 14301 16796 14126 13708 10469 12407 10804 16675 14431 16069 12198 16418 24798
14574B4798L817L310j6033j3638O885M123q617M300L408O443n762m364J4925P129
14560C0724j9411o936J3483K062o192r479L062N957L294K862o911l060K416j124
14546A0747n72R875J838j7662k219J724l368Q819Q255J428n272k450M516l29K690
14531A8020l26L53J07L114O506k7j3089m671r588j000K324p02R931L79Q795p900
14515A2226j0969L465K897J305n481O633N367o321j990j497M091P601J102n611
14501A2818P74j378m668K044o511p200L275l6k116J052N832Q664L754r104j0472
14486c272m579p785J1416R400L600m143K594k679P392Q889j0280r812k666M822
14472B897N683r20Q443l720K439L14q408O999O913J661j1885j5681O947K251K549
$$ plain form
14574 24798 28615 31925 15892 2254 9139 13262 4645 8945 12353 18796 13034 8670 23595 30724
14560 30724 11313 4377 17860 19922 13730 4251 7313 13270 16564 19426 12515 9455 11871 10747
14546 10747 10175 20050 21888 4226 2007 3731 363 9182 17437 18865 13593 11143 15659 15330 18020
14531 18020 17694 18047 18154 21268 27774 27747 14658 9987 399 -601 1723 1021 10952 11331 20126 12226
14515 12226 1257 4722 7619 8924 3443 10076 15443 9122 7132 5635 9726 17327 18429 12818
14501 12818 13592 12214 7546 9590 3079 -4121 -846 -882 -2998 -1946 3886 12550 16304 7200 -3272
14486 -3272 -7851 -15636 -4220 5180 8780 4637 7231 4552 11944 20833 10553 741 -1925 2897
14472 2897 8580 7660 16103 12383 14822 15136 6728 13727 20640 22301 10416 -5265 1682 3933 6482
14457F482p74K812R556l48m965p251l112l621J858R58P201J285P198P746p350
14442A7675q244k666K609J95r952j577o598q073J597J0064P689K245p94M023P048
14427A5241J230l022j1400J298J566O58j1527P11O341J660j46j809P564R249n854
14412A1760N592m694r613n013N767k587N161Q413j913m874j005K826k424J314
14398H710o396l603J817j675O154k65J158R20K455M97N418L203o866m013p77p372
14382f35j816O302M008L058L778o745p544J921Q428J955k676k801j394P071M588
14367A7498r268j0794m42K373P470M300M920k966K321O431j254R58l722m592K220
14352A5453K474K145N143p493n581M413O763M702n810o573j769K829N332j812
$$ plain form
14457 6482 5708 8520 18076 17728 12763 5512 2400 -1221 637 1595 8796 10081 17279 25025 17675
14442 17675 9431 6765 9374 9569 -383 -1960 -8558 -16631 -15034 -4970 2719 4964 4170 8193 15241
14427 15241 16471 13449 2049 3347 4913 5571 -5956 -5245 1096 2756 2610 801 8365 17614 11760
14412 11760 17352 12658 3045 -1968 3799 1212 6373 14786 12873 7999 6994 9820 7396 8710
14398 8710 2314 -1289 528 -1147 5007 4742 5900 6820 9275 9772 15190 18393 11527 7514 6737 -635
14382 -635 -2451 3851 7859 10917 14695 7950 406 2327 10755 12710 10034 7233 5839 12910 17498
14367 17498 8230 -2564 -3006 -633 6837 11137 16057 13091 15412 21843 20589 21547 17825 13233 15453
14352 15453 17927 20072 25215 17722 12141 16554 23317 28019 22209 15636 13867 16696 22028 20216
14338B0216p110k328k295K377J894j892q8O045Q008p818q174l68r42L543N247
14323A6315K035j2357P6P796N850n07j308N045K642J362j896P77o704j452N855
14308B3529r428K246j178R1R05j76O960Q184p914j2131q084j555J3676p569M77
14293H033Q594J261j468l859K081J838k99K085M453L26K981j273L319M924M596
14278C7592k776n300j7746q042J5795N162j453K874K165r228q975K284R776N273
14264B7401N568K400l366j8128j4428L139Q040J2576o378j0501M255J3737J672
14251B5987n734j0592l194Q257J2417r5j0132m640J469R535Q428o370j1569m700
14237I067J0631N773J386p394n184L31J1598k128j0946p700P875J052Mj10k914
$$ plain form
14338 20216 13106 10778 8483 10860 12754 10862 10774 16819 24827 17009 8835 8467 7525 11068 16315
14323 16315 18350 5993 6069 13865 19715 19208 17900 22945 25587 26949 25053 25830 19126 17674 23529
14308 23529 14101 16347 15169 15260 16165 15989 22949 31133 23219 11088 3004 1449 15125 7556 8033
14293 8033 16627 17888 16420 12561 14642 16480 16181 18266 22719 23045 26026 24753 28072 32996 37592
14278 37592 34816 29516 11770 3728 19523 24685 23232 26106 28271 19043 10068 12352 22128 27401
14264 27401 32969 35369 32003 13875 -553 2586 10626 23202 16824 6323 10578 24315 25987
14251 25987 20253 9661 6467 14724 27141 27046 16914 12274 13743 23278 31706 25336 13767 9067
14237 9067 19698 25471 26857 19463 14279 14610 26208 24080 13134 5434 13309 14361 14365 14255 11341
14222A1341O113l987J909r7N162j017k58j1077k19N526M054P047n73j26J152j255
14206B3695l604l261K266j076k114o177N913l536L915O971J817q08N017k764R402
14191C5656J012k621K695R381l676j0752K413M831R33k476K684Q731J2812l903
14177E7720q927q447q68J1186M589l935l650M247Q782N165k313Q452J5294M628
14163I1923L556N502K0538K5884K1756L2516L4048L3262K9335J6321J3736K2888
14151C51265N547N937J7037P087j486k12j0883j4001j0393q422p053k6605k0624
14138B87194k5764k9160k9249k8791j2976j2562n050q350r032n07j2237m964j0826
14125I7726k928j0724p307n917l663j783o110o527J0898O701Q57p26L89K095M427
$$ plain form
14222 11341 17454 13467 15376 15279 20441 19424 19166 8089 7870 13396 17450 24497 23924 23798 24950 23695
14206 23695 20091 16830 19096 18020 15906 9729 15642 12106 16021 22992 24809 24001 29018 26254 35656
14191 35656 36668 34047 36742 46123 42447 31695 34108 38939 39872 37396 40080 48811 61623 57720
14177 57720 48793 40346 39478 50664 55253 51318 47668 51915 60697 65862 63549 72001 87295 91923
14163 91923 95479 100981 121519 147403 169159 201675 235723 268985 298320 314641 328377 351265
14151 351265 356812 362749 379786 386873 385387 385175 374292 360291 349898 341476 334423 307818 287194
14138 287194 261430 232270 203021 174230 161254 148692 143642 135292 126260 125753 113516 108552 97726
14125 97726 94798 84074 76767 70850 67187 65404 59294 52767 63665 70366 71223 70497 70886 72981 77408
14110G7408k762r208m027k995J4p863P273J542j1835j337J2343o32L177l386q025
14095D9687l271K778k517K547p32j3980l635j619J0623Q720M737n341J449m95
14081D8951L415l3O661J018O911l949p925K587O478M52m016l501k093o793p703
14066D0460q165n117N97k95M895k803o687j9Q800J4198O138m090n627j6566k190
14051B3529J3268P119J74j3058j795P232n287k309K916N128J2j1175Q984J4163
14037D8901M167j0036q809M775K686m796m735j08J1023j521j751k860n646N93
14023C1883O876l57l91Q03Q758r166j0790P017O074J72n055M544q02o307m420
14008B8839o435Q226N663n719k70P880O906P353n440m157o979o027K856o444J1070
$$ plain form
14110 77408 74646 65438 61411 58416 58430 50567 57840 59382 47547 46210 58553 57921 61098 57712 49687
14095 49687 46416 49194 46677 49224 48492 34512 30877 29258 39881 48601 53338 47997 49446 48951
14081 48951 52366 52333 58994 60012 66923 62974 55049 57636 64114 64566 60550 57049 54956 48163 40460
14066 40460 32295 27178 27775 27480 32375 29572 22885 22866 31666 45864 52002 47912 42285 25719 23529
14051 23529 36797 43916 44090 31032 29237 36469 31182 28873 31789 36917 36929 25754 34738 48901
14037 48901 53068 43032 34223 38998 41684 36888 32153 32045 43068 41547 39796 36936 31290 31883
14023 31883 38759 38402 38011 38814 47572 38406 27616 34633 40707 40879 35824 40368 39566 33259 28839
14008 28839 22404 30630 36293 30574 30304 38184 45090 52443 47003 42846 35867 29840 32696 26252 37322
13993C7322Q394k660l130m406Q73P037m95j975j018o222k482R022K946k479p259
13978C3468k933R6k612o329k267J3249O535K641N534J0918O86l289q18j4798q404
13963C1677m68j854p05Q857J0911J131K711p152j3418O428O117k382K403K417
13949D6673q548j0923k562J2337K010K011O974P330L117m154m015j1346j1371
13936B7533J711R750k371K207m491o711K579m44O06R414J1696J860j2431k312
13922C8596O74J642K354N78O339N90o056j3106N205J3680J916l469Q189j33l010
13907E3989P79n451J784J0146J4661O40J828j389K120m65r91K28J2742Q392Q550
13892A07563J501j0520j2113j5875q897J924k478j0642j1602k822M159J2087O908
$$ plain form
13993 37322 45716 43056 39926 35520 36393 43430 42935 40960 39942 33720 31238 40260 43206 40727 33468
13978 33468 30535 30631 28019 21690 19423 32672 39207 41848 47382 58300 58986 55697 54879 40081 31677
13963 31677 31209 29355 28650 37507 48418 49549 52260 45108 31690 38118 44235 41853 44256 46673
13949 46673 38125 27202 24640 36977 38987 40998 47972 55302 58419 54265 50250 38904 27533
13936 27533 29244 38994 36623 38830 34339 27628 30207 29763 30369 39783 51479 53339 40908 38596
13922 38596 39270 40912 43266 43844 50183 50773 44717 31611 36816 50496 52412 48943 57132 56999 53989
13907 53989 54768 49317 51101 61247 75908 76548 78376 76987 79107 78642 77651 77879 90621 99013 107563
13892 107563 109064 98544 86431 70556 61659 63583 61105 50463 38861 36039 40198 52285 59193
13879E9193O220k938r890p437J471P382P078K397l192K209M728R495p555r665
13865E9496r818J673M288J532k967r123n830J825M009P544J526J517L919J1514
13851G1105K074p647n554k844j5784p206p771O164L253O994P252k38N925k495
13837E3228M890P267o600l425j1053j0932Q7L857J3797j739r225O597J2805N956
13823F5510o65j1149j2504n334m628j351J2468J3913q696p273q620q181R075R428
13809D1993J2886K457O413r70l231N542P171j1743j2062q053P68l302L999N147
13795D7015J6625R836k470n732j4211j6538o820j0354R273O568J1663K4087J3175
13782H2117L980P760p982j1433P430M72q759P266P841K916q328j5218q625k146
$$ plain form
13879 59193 65413 62475 52585 45148 46619 54001 61079 63476 60284 62493 67221 76716 69161 59496
13865 59496 49678 51351 55639 57171 54204 45081 39251 41076 45085 52629 54155 55672 59591 71105
13851 71105 73179 65532 59978 57134 41350 34144 26373 32537 35790 42784 50036 49798 55723 53228
13837 53228 58118 65385 58785 55360 44307 33375 33462 37319 51116 49377 40152 46749 59554 65510
13823 65510 64845 53696 41192 35858 31230 29879 42347 56260 47564 40291 31671 23490 32565 41993
13809 41993 54879 57336 63749 62779 59548 65090 72261 60518 48456 40403 41171 37869 41868 47015
13795 47015 63640 73476 71006 65274 51063 34525 27705 17351 26624 33192 44855 68942 82117
13782 82117 86097 93857 85875 74442 81872 82344 73585 80851 88692 91608 83280 68062 59437 57291
13768E7291K158J207k809n564M242R352J545n066j5358r261k50k341K1212J8620
13754G4978m534j0574j1150j1041J1153J8982J544j891n262P600J3724Q321J5618
13741A07468J4740J1387Q272k98o668k298k968n417j4021l866l515r10o950r072
13727H5884k6346r749K297O675P122J0698P735N730J948m990k031L465n0j93K340
13712I0535M107K363O176j025p430M12j98K153J190j6839o826M176K083J904M369
13697H7150l524j009o110K487k946q886q61L559K83j3695q75P395O461j5015p650
13682D6764J0740Q603m165k761M346L951M03m595J411P624J1158N545r339m415
13668G5270M384K414l425n906j0518j0341l875K147M913m922Q86k191P327R277
$$ plain form
13768 57291 59449 60656 57847 52283 56525 65877 67422 62356 46998 37737 37487 35146 56358 74978
13754 74978 70444 59870 48720 37679 48832 67814 69358 67467 62205 69805 83529 91850 107468
13741 107468 122208 133595 141867 141569 134901 132603 129635 124218 110197 106331 102816 101906 94956 85884
13727 85884 59538 49789 52086 58761 65883 76581 84316 90046 91994 87004 84973 88438 88388 88195 90535
13712 90535 94642 97005 103181 102156 94726 95138 94940 97093 98283 81444 74618 78794 80877 82781 87150
13697 87150 83626 82617 76507 78994 76048 67162 66301 69860 70143 56448 55573 62968 69429 54414 46764
13682 46764 57504 66107 61942 59181 63527 67478 67881 63286 64697 72321 83479 89024 79685 75270
13668 75270 79654 82068 78643 72737 62219 51878 48003 50150 55063 50141 51027 48836 56163 65440
13654F5440l061l848L838L150l174N310k785r08L278L833L146p498o445o234p167
13639D6875J92N732N318K32p452k953P547K181N731J2477j94m304L384O919k528
13624G9157o066L063J0553L084k480k739k665L520P691l417l181O850J183l846
13610I0707j97j686k439k300p95r368l905J3973N824m046P642o00N401M003l913
13595I8301o398l511N152m360K637R10m01R140R036q56j6307q913l659j099n766
13580G3906n106O964j880M337R083m593J966O665p960n325l099M912N505J10P507
13565I2992Q898K796k372n001o411R80L289j1635O347P260O839R506j535j463
13551A10490l333n516N34O756Q997j784j633J0118K220m449m40J1097R760j15
$$ plain form
13654 65440 62379 58531 62369 65519 62345 67655 64870 63962 67240 71073 74219 66721 60276 54042 46875
13639 46875 47067 52799 58117 58349 50897 47944 55491 57672 63403 75880 75686 71382 74766 81685 79157
13624 79157 73091 76154 86707 89791 87311 84572 81907 85427 93118 89701 86520 93370 94553 90707
13610 90707 90510 88824 86385 84085 83290 73922 70017 83990 89814 85768 93410 92810 98211 102214 98301
13595 98301 91903 88392 93544 89184 91821 92731 92330 101470 110506 109650 93343 84430 80771 79672 73906
13580 73906 68800 75764 73884 78221 87304 82711 84677 91342 83382 78057 74958 79870 85375 85485 92992
13565 92992 101890 104686 102314 97313 90902 91882 95171 83536 89883 97143 103982 113488 111953 110490
13551 110490 107157 101641 102175 108931 117928 116144 114511 124629 126849 122400 121960 133057 142817 142702
13537A42702N496J1545m719J108P104J2313r287r31m99j7170l782k888j7549k2233
13523A01210n446J4348O711Q90N989m965L061j236L052N20Q462P723p336P618
13509A40601o511j1970R285Q150N865J896k56J1905L713J045J805J1194N776j341
13495A81157o06r361j4986o341j0737P121p888K008j185J98j2822j2530J6058
13482A30086l27o011J532Q16m593j6799K010J2988j0136j465J1404L972l399j670
13468A18408j543q972l095k620k770K782K234Q072Q72n247J1067M63r260L038
13454A13429O534j304m218O901K337o728m245Q663R808l024l475O323L318p755
13440A26564k999l721n32N559J5140M078k889L082L585r499m176J913N062K953
$$ plain form
13537 142702 148198 159743 155024 156132 163236 175549 166262 165331 164832 147662 143880 140992 123443 101210
13523 101210 95764 110112 116823 117713 123702 118737 121798 120562 123614 124134 132596 140319 132983 140601
13509 140601 134090 122120 131405 139555 145420 147316 147060 158965 162678 163723 165528 176722 182498 181157
13495 181157 180551 171190 156204 149863 139126 146247 138359 140367 139182 139380 126558 114028 130086
13482 130086 129759 123748 125280 126096 121503 104704 106714 119702 109566 108101 119505 123477 120078 118408
13468 118408 116865 107893 104798 102178 99408 102190 104424 112496 113368 108121 119188 119651 110391 113429
13454 113429 119963 118659 114441 121342 123679 116951 112706 121369 131177 128153 124678 131001 134319 126564
13440 126564 123565 119844 119312 124871 140011 144089 141200 144282 147867 138368 134192 136105 141167 144120
13426A44120k947k304p40m217J473L780M657m974N651R956o738J239L891q359
13412A44488n928M707J1465J732m769r681o619o006J547L302O157J46n998j024
13398A33519k590k048P340J2282q574l400J1994J1990j070l450m545K951K267
13385A56666R004J511j00m023o259j7413o365Q419O023M660p124K619k577j11
13371A44930M597j292N866M202m477J056M227J162n214N943Q538P049r937j0822
13357A55828k025J1749J557m54p62l118k645k472L705K283K683M919J483O033
13343A78764R62r971Q47Q549Q757j911P25k94N443N459P568o44j374j7683n207
13328A79990J2385J2237j655M34j112J944k32n132k350j0925k642m899k463k713
$$ plain form
13426 144120 141173 138869 138129 133912 135385 139165 143822 138848 144499 154455 147717 148956 152847 144488
13412 144488 138560 143267 154732 156464 151695 142014 135395 129389 130936 134238 140395 140541 134543 133519
13398 133519 130929 128881 136221 148503 139929 136529 148523 160513 159443 155993 151448 154399 156666
13385 156666 165670 167181 167081 163058 156799 139386 133021 141440 147463 152123 144999 147618 145041 144930
13371 144930 149527 148235 154101 158303 153826 154882 159109 160271 155057 161000 169538 176587 166650 155828
13357 155828 153803 165552 167109 166655 165893 162775 160130 157658 161363 163646 166329 171248 172731 178764
13343 178764 179726 169755 170602 179151 187908 185997 186722 186428 191871 197330 204898 204254 202880 185197 179990
13328 179990 192375 204612 202957 203391 202279 204223 203991 198859 196509 185584 182942 178043 175580 172867
13314A72867J0429K320l786L393K196k528K886R891R638R880j153p087o123l847
13300A98976r445j683M472M783L088j584k234P713j234k973m643L178M303l467
13286A99250J766j007M012J322r953m196N111P395J814K709k76l598N984M705
13272B15038K601J120m138K75J17M246J018J829l198P50l361k79N937j69j141
13257B20645l132N563O359m608o358k111j901K825K813j5281k480M382l002J0356
13243B14070J912K87n837q731k403M570M792M298N862n014p706K701k434K371
13229B08738K924J6621o781j3842L579M613k956M34O722q521o028R010K689o17
13215B16585q994N716J0132O538N984J578M808K686O247n990o203r688m128q249
$$ plain form
13314 172867 183296 185616 181830 185223 187419 184891 187777 197668 207306 217186 216033 208946 202823 198976
13300 198976 189531 187848 192320 197103 200191 198607 196373 204086 202852 199879 195236 198414 202717 199250
13286 199250 201016 200009 204021 205343 195390 191194 196305 203700 205514 208223 207947 204349 210333 215038
13272 215038 217639 218759 214621 214896 215013 219259 220277 222106 218908 219658 216297 216018 221955 221786 220645
13257 220645 217513 223076 229435 224827 218469 216358 214457 217282 220095 204814 202334 206716 203714 214070
13243 214070 215982 216269 210432 201701 199298 203868 208660 212958 218820 213806 206100 208801 206367 208738
13229 208738 211662 228283 221502 207660 211239 215852 212896 213330 220052 211531 205503 214513 217202 216585
13215 216585 207591 213307 223439 229977 235961 237539 242347 245033 251280 245290 239087 229399 225271 217022
13201B17022l088O563J1910k20M38L147N300l251P632Q544M145q946j0029q352
13187B30815P99J5300J0565N030L848J866O401J4857K2138J9057J3751Q456K7921
13174C80804M0305M3928N4393Q4441R7189J05111R2357P0280M0285r821n2784
13163I46488q1750r4925p0929n7296m6796k8889j2866p330J0865K3361L0912K6857
13151F37702K2768K2146K8830M6415L5369J8221K6391K8871K1900L9879L4256
13140I62748L0708M4684N5782L6303L2493R152k0296l9044n5009m9784n2118k9793
13128I25826j6030n647k825q497j3668k0212j9408r244l0562k3559l2503l1581
13116G12090l2150j0319J8159J1468K2255N8378O6892R3146R2449P4768O1857
$$ plain form
13201 217022 213934 220497 232407 232187 232625 235772 241072 237821 245453 253997 258142 249196 239167 230815
13187 230815 231614 246914 257479 262509 266357 268223 274624 289481 311619 330676 344427 352883 380804
13174 380804 421109 465037 519430 603871 701060 806171 898528 968808 1009093 999272 946488
13163 946488 864738 769813 698884 641588 594792 565903 553037 545707 556572 579933 610845 637702
13151 637702 660470 682616 711446 757861 793230 811451 837842 866713 888613 928492 962748
13140 962748 993456 1038140 1093922 1130225 1162718 1171870 1151574 1112530 1057521 1007737 955619 925826
13128 925826 909796 904149 901324 892827 879159 858947 839539 830295 799733 776174 743671 712090
13116 712090 679940 669621 687780 699248 721503 779881 846773 939919 1032368 1107136 1168993
13105A168993K9751q835m7001r4407j05508r1374q9943p1598n3007l7193l2274
13094E67604k3970j5168j2062o867K078j723q70k224q16R197J7842J9288J2480
13081E64789L3340N6632P4172Q5903J23220J42525J65688J69335J61158J33578
13071A710340R8551M6382l083o1735j03348j32992j57938j63491j56844j26534
13061I49308j11472p9799n9744m2906j9189j8035j4315l832j1546k0379j9969
13050E48122k486q865j4515j3120m933o076l619q01o879j8445p66N683j1502o616
13036D55182j1930K41l887K338j736m809l920J1118J2638K927n548q816j5630
13023D28168J483N122n608q529J42j4598p798K982K322Q149j174J798k110K464
$$ plain form
13105 1168993 1198744 1189909 1142908 1048501 942993 851619 761676 690078 637071 599878 567604
13094 567604 543634 528466 516404 509537 511615 509892 509022 506798 505982 515179 533021 552309 564789
13081 564789 598129 654761 728933 814836 938056 1080581 1246269 1415604 1576762 1710340
13071 1710340 1808891 1855273 1852190 1790455 1687107 1554115 1396177 1232686 1075842 949308
13061 949308 837836 758037 698293 655387 636198 618163 603848 600016 588470 568091 548122
13050 548122 545636 536771 522256 509136 504203 498127 494508 493707 486828 468383 467617 473300 461798 455182
13036 455182 443252 443493 439606 441944 440208 435399 431479 442597 455235 458162 452614 443798 428168
13023 428168 429651 434773 429165 420636 420778 406180 398382 401364 403686 411835 410661 412459 410349 412813
13009D12813j136j5362j1781j902O022M0j0631l018J1954P099K477q02O318q643
12995C93448k543J413r052o038l727R76O205P071n56n534O562M140M018R394R802
12980D15579O255Q817J5209P570J1084N536J724J0382N184Jn94m370O281J0136
12966D98794N331n100o007n283j2089k107j704j3600j5035q809r268j5137j3717
12953C96269j187n15n30O435Q890J985J3360N85N342J0217J1057N954M506Q389
12939D70757J3789J1170M793K377j259R680J1713P137j661n078L570R671P547
12926E44206L653l489l938k983R039O367Q817j227q205n054J023k545R066O401
12912E61131J3899J9211J7910J8729J3695J6765J5856K0603K0730J6269J5164
$$ plain form
13009 412813 411677 396315 384534 382632 388654 388694 378063 375045 386999 394098 396575 395773 402091 393448
12995 393448 390905 392318 383266 377228 373501 374477 380682 387753 387197 381663 388225 392365 396383 405777 415579
12980 415579 421834 430651 445860 453430 464514 470050 471774 482156 487340 487341 486747 482377 488658 498794
12966 498794 504125 499025 493018 487735 475646 473539 471835 458235 443200 434391 425123 409986 396269
12953 396269 395082 394567 394037 400472 409362 411347 424707 425292 430634 440851 451908 457862 462368 470757
12939 470757 484546 495716 500509 502886 501627 511307 523020 530157 528496 523418 526988 536659 544206
12926 544206 547859 544370 540432 537449 546488 552855 561672 560445 552240 547186 548209 545664 554730 561131
12912 561131 575030 594241 612151 630880 644575 661340 677196 697799 718529 734798 749962
12901G49962K3164J2025r966o791l45K369o095p377j0589p021k697r588m759p704
12887G14588j9951r56o02p169N85n658o086l445K543J3271J3421J3358K177m785
12873G11291o809j5362j2396k193N111m176j1095K980j441M017Q155R351J2940
12860G00373K2225L2760L0643J1970M290J6997K3409J6515J2888P592P886J0467
12848H98015K6130J6774K8660K0426K1619K6347L2732L3565L4861M5046M2109
12837A226284L7212K8687K6616K0522Q134o681k3666l1756k1721r129j6765k0181
12825A217556j2973q803J6813K0660K3104J4340J2439R125R128K5796K9209J7336
12813A373730K1847K8855L0193K4465R040J2358J6879K4620K5519J7326K3022
$$ plain form
12901 749962 773126 785151 775185 768394 768049 770418 764323 756946 746357 739336 736639 727051 722292 714588
12887 714588 694637 693681 693079 685910 686495 680837 674751 671306 673849 687120 700541 713899 716076 711291
12873 711291 704482 689120 676724 674531 679642 675466 664371 667351 665910 669927 678082 687433 700373
12860 700373 722598 755358 786001 797971 802261 819258 842667 859182 872070 879662 887548 898015
12848 898015 924145 940919 969579 990005 1011624 1037971 1070703 1104268 1139129 1184175 1226284
12837 1226284 1263496 1292183 1318799 1339321 1347455 1340774 1317108 1285352 1263631 1254502 1237737 1217556
12825 1217556 1204583 1195780 1212593 1233253 1256357 1270697 1283136 1292261 1301389 1327185 1356394 1373730
12813 1373730 1395577 1424432 1454625 1479090 1488130 1500488 1517367 1541987 1567506 1584832 1607854
12802A607854K7889K6888K4765J8192Q104N464K5922J6934J0277K5913L7089L5422
12790A870713M6548N7158M4594M5020M4659M3715M1525M3067M7159M2245L8003
12779B364406L9409L7254L6213K5633K4064M1040L7631K4245J9330K4597L0440
12768B704262M5120N4490N9852O6731Q2531Q1545P6562P2870N7220N5203O0498
12757C416884N7911N8886O4627P7541R9028J10212J33378J41282J31118J39466
12747D430333J53178J67171J86000K02034K27488K66089L11730L50829L94093
12738F688945M47938N05659N83299O81876P85574Q90502J005160J180121J415730
12729A4184804J724771K174908K820875L756077N065942O914616R427871J2609844
$$ plain form
12802 1607854 1635743 1662631 1687396 1705588 1713692 1719156 1745078 1762012 1772289 1798202 1835291 1870713
12790 1870713 1917261 1974419 2019013 2064033 2108692 2152407 2193932 2236999 2284158 2326403 2364406
12779 2364406 2403815 2441069 2477282 2502915 2526979 2568019 2605650 2629895 2649225 2673822 2704262
12768 2704262 2749382 2803872 2863724 2930455 3012986 3094531 3171093 3243963 3301183 3356386 3416884
12757 3416884 3474795 3533681 3598308 3675849 3774877 3885089 4018467 4159749 4290867 4430333
12747 4430333 4583511 4750682 4936682 5138716 5366204 5632293 5944023 6294852 6688945
12738 6688945 7136883 7642542 8225841 8907717 9693291 10583793 11588953 12769074 14184804
12729 14184804 15909575 18084483 20905358 24661435 29727377 36641993 46069864 58679708
12721E8679708J6197932J9194831J9830979J7196815J2427711O880133J21008
12714A50529117q602603j6064717j8350147j6472698j2951029r246198n994358
12707F2847367l306649j088761Q69075K709817M405895N835258O896859P519261
12699H6688122P610930P066636O064499M936923L991341L640048M318983O098250
12691A30415732Q491662J0674597J1676704J0744745P892358L903613o67961n792554
12683A77338896j0497178j2535867j1401306q669860n634628l023416j142157
12676A24434484k16467k70028r89937k126284l559273n090668o205245o465254
12668I9511328n868176m509508k571531l23015K160448N055905Q624601J2915441
$$ plain form
12721 58679708 74877640 94072471 113903450 131100265 143527976 150408109 150529117
12714 150529117 141926514 125861797 107511650 91038952 78087923 68841725 62847367
12707 62847367 59540718 58451957 59321032 62030849 66436744 72272002 79168861 86688122
12699 86688122 94299052 101365688 107430187 112367110 116358451 119998499 124317482 130415732
12691 130415732 138907394 149581991 161258695 172003440 179895798 183799411 183131450 177338896
12683 177338896 166841718 154305851 142904545 134234685 128600057 125576641 124434484
12676 124434484 124218017 123947989 122958052 120831768 117272495 112181827 105976582 99511328
12668 99511328 93643152 89133644 86562113 86239098 88399546 93455451 102080052 114995493
12660A14995493J7588758K1962341K4998497K5709950K4268512K1664686J8634249
12653B69822486J5026789J1281322R348182R304564R877830Q480019M146763l636246
12645C33651709j1864619j9203180k5109069k9594856l1778845l0248344k6872360
12638A58980436k3031888j9187703j4461494j0366737p646962n960203m904248
12631G3421201m249857l825819l548732l317870l106369k884794k647053k420937
12623D7419770k216262k019620j852606j719321j624399j555384j467734j381772
12615C3582672j306161j219637j130422j024613r33633q64993p98223p46413p05074
12606B4853503p04597p20751o93665o80429o69793o44913o01921n58533n41262
$$ plain form
12660 114995493 132584251 154546592 179545089 205255039 229523551 251188237 269822486
12653 269822486 284849275 296130597 305478779 314783343 324661173 333141192 337287955 333651709
12645 333651709 321787090 302583910 277474841 247879985 216101140 185852796 158980436
12638 158980436 135948548 116760845 102299351 91932614 84285652 78325449 73421201
12631 73421201 69171344 65345525 61796793 58478923 55372554 52487760 49840707 47419770
12623 47419770 45203508 43183888 41331282 39611961 37987562 36432178 34964444 33582672
12615 33582672 32276511 31056874 29926452 28901839 27968206 27103213 26304990 25558577 24853503
12606 24853503 24148906 23428155 22734490 22054061 21384268 20739355 20137434 19578901 19037639
12597A9037639n16916n03601m96776m85490m90471m91417m76902m71435m61848
12588A4642783m50833m61686m34806m24907m32436m19761l86325l74502l52262
12579A0905265l24593l00607k82742k78672k58296k36321k21324k15844k12729
12570H574137j95682j99036k11193k13526k33851k39053k30212k36471k34624
12561F580489k14380k10384j85170j69520j57584j46791j39711j34038j30464
12552E092447j22143j26730j39477j20862j08482j00487q3658o9607p0535o0009
12542D090457m6768l8574l1219k1424l1052m5389m2081n4046p5566r3194j01722
12531C509422j05194j08955j26247j21073j16592j01633r7439q2037p8365q8903
$$ plain form
12597 19037639 18520723 18017122 17520346 17034856 16544385 16052968 15576066 15104631 14642783
12588 14642783 14191950 13730264 13295458 12870551 12438115 12018354 11632029 11257527 10905265
12579 10905265 10580672 10280065 9997323 9718651 9460355 9224034 9002710 8786866 8574137
12570 8574137 8378455 8179419 7968226 7754700 7520849 7281796 7051584 6815113 6580489
12561 6580489 6366109 6155725 5970555 5801035 5643451 5496660 5356949 5222911 5092447
12552 5092447 4970304 4843574 4704097 4583235 4474753 4374266 4290608 4221001 4150466 4090457
12542 4090457 4043689 4005115 3973896 3952472 3921420 3876031 3833950 3779904 3704338 3611144 3509422
12531 3509422 3404228 3295273 3169026 3047953 2931361 2829728 2732289 2650252 2571887 2482984
12521B482984q9310q8760r5878r7940r7266r5804r8558r0897p3066o2788o1770
12510A530947o0811m2377l2469k8560l5928j4655j8764l0345l8915l0651p940
12499A189532j4567m256k616J0867J5350L75n345j0037j9951m1846n3510m3420
12487A020576l6724j3915j3470q692j4252n911M889O439L731r025j5980j9400
12475H98266j6095n655M728K483l011j118m281L880R414J5809J6512J1779m129
12462I28582q346j5773j2349k0462k3462j3102l3685k5635k0244j3818j3080p485
12450G21141q585j1216k008J7552L1711M5070M5279K7015P815O732L346m3406
12438H40446q5542n2426k4366j0372q774k1135j5400r372J582M907j0989o468
$$ plain form
12521 2482984 2393674 2304914 2209036 2111096 2013830 1918026 1819468 1728571 1655505 1592717 1530947
12510 1530947 1470136 1427759 1395290 1366730 1330802 1316147 1297383 1267038 1228123 1197472 1189532
12499 1189532 1174965 1170709 1168093 1178960 1194310 1194685 1189340 1179303 1159352 1117506 1063996 1020576
12487 1020576 983852 969937 956467 947775 933523 927612 932501 938940 942671 933646 917666 898266
12475 898266 882171 876516 881244 883727 880716 879598 875317 879197 888611 904420 920932 932711 928582
12462 928582 920236 904463 892114 871652 848190 835088 801403 775768 755524 741706 728626 721141
12450 721141 712556 701340 699332 716884 748595 793665 838944 865959 873774 880506 883852 840446
12438 840446 754904 702478 678112 667740 658966 637831 622431 613059 614641 619548 608559 602091
12426F02091m47o935J64o704j8604j0704r456J958N138j500o311j949o005j4718
12412E26018k1532j9998j5586j0214j3258q893l058j0114o873j576R45J2092J8063
12399D46016J400K785O546R82m389R115Q300K716O254J0250m794l360j2085j3278
12385D56458L258j558p993j6705k1481j0654j0716k8199j4667j1880l651L000
12373C35212K494n017o01m926L566q440n138P17M305R689J1126J5481J7523J0929
12359C86920J8058J4784K4674L0175L3530L0362M0649N7949P3921R6891J41108
12348I49021J84464K24251K19531J52120R3609O3932l6318j83033k44337j89028
12338A234212j18044o5762m3429j2059J9009L4982L6573L7980L0619M9342O4447
$$ plain form
12426 602091 601644 594709 594873 588169 569565 558861 549405 551363 556501 555001 548690 546741 540736 526018
12412 526018 504486 484488 468902 458688 445430 436537 433479 423365 416492 414916 415861 427953 446016
12399 446016 447416 450201 456747 457729 453340 462455 470755 473471 479725 489975 485181 481821 469736 456458
12385 456458 459716 458158 450165 433460 411979 401325 390609 362410 347743 335863 332212 335212
12373 335212 337706 332689 332088 327162 330728 322288 317150 317867 322172 331861 342987 358468 375991 386920
12359 386920 404978 419762 444436 474611 508141 538503 579152 637101 711022 807913 949021
12348 949021 1133485 1357736 1577267 1729387 1822996 1886928 1850610 1667577 1423240 1234212
12338 1234212 1116168 1050406 1006977 994918 1013927 1048909 1085482 1123462 1154081 1203423 1267870
12327A267870L3427K5059L5586M9653O9938N4613K7533J4602L798j4579m678J9226
12315A582048M5948J00830J77323K74459L86902M60710M50898L97643K90892J17771
12305D285424j26812l57957m62135m74236l94569k69549j64924q9194l2496m90
12295A913062M06Q372J2717J040k4318n4550o9337p0092n5137m6189m0434m3604
12283A531936m1368l8404m3162n7538n4918j2168J4437M5749Q9792J34750J81039
12272A750145J89903J52551R7415M2784l3991j68427k46131k17098j18980l5104
12262A413067J2566J2498k722n758l2411q1070q9786q8929p9512p6164m6256l3218
12250I02305k1606j3252r189Q828J3097J5688K5951J7505K2947K4980K3571K0106
$$ plain form
12327 1267870 1301297 1326356 1361942 1411595 1481533 1536146 1563679 1578281 1582079 1567500 1562822 1582048
12315 1582048 1627996 1728826 1906149 2180608 2567510 3028220 3479118 3876761 4167653 4285424
12305 4285424 4158612 3800655 3338520 2864284 2469715 2200166 2035242 1946048 1913552 1913062
12295 1913062 1913468 1921840 1934557 1935597 1911279 1856729 1787392 1717300 1662163 1615974 1575540 1531936
12283 1531936 1490568 1452164 1409002 1351464 1296546 1284378 1298815 1344564 1434356 1569106 1750145
12272 1750145 1940048 2092599 2190014 2232798 2198807 2030380 1784249 1567151 1448171 1413067
12262 1413067 1425633 1438131 1435409 1429651 1397240 1316170 1226384 1137455 1057943 981779 935523 902305
12250 902305 880699 867447 858258 867086 880183 895871 921822 939327 962274 987254 1010825 1030931
12238A030931P794J8935K9452N6909N8269N4431N6716M3881L1057J2847K047M068
12226A407337N371K7449O1188R8585J38414J61174J55692J40658J09519O0562
12216B365949k907p1905j36544j63196j79527j94139j84178j46960j10583p4283
12206A101727l9835j7828J8705M7496O1353P1447O8117M6624P685l0511o4176
12195A270804j15427j30089j17804j07199q7585o4353n7124m4119m2717j6923
12185D87464j1929k2755k0309j2183n887j0256j4024j7895j4905j0009m794n602
12173C36916j4788p078n281j9170j6898l216M169k448l273p713j0513n384r616
12160B35707j0266p786O47k544m278p334o786Q773P090j2579j0838l135j0795
$$ plain form
12238 1030931 1038725 1057660 1087112 1144021 1202290 1256721 1313437 1357318 1388375 1401222 1403269 1407337
12226 1407337 1412708 1440157 1501345 1599930 1738344 1899518 2055210 2195868 2305387 2365949
12216 2365949 2363042 2291137 2154593 1991397 1811870 1617731 1433553 1286593 1176010 1101727
12206 1101727 1061892 1044064 1062769 1110265 1171618 1243065 1311182 1357806 1365491 1334980 1270804
12195 1270804 1155377 1025288 907484 800285 712700 648347 591223 547104 504387 487464
12185 487464 475535 452780 432471 420288 414401 404145 390121 372226 357321 347312 342518 336916
12173 336916 322128 315050 309769 290599 273701 270485 274654 272206 268933 261220 250707 245323 235707
12160 235707 225441 217655 218302 215758 211480 204146 197360 206133 213223 200644 189806 186671 175876
12147A75876M483N093Q079o012j3727J127n652J718L433j1330j2322k802J0380
12134A58344L865j727k551J232N091j5856q954j682o218l853l421L006N829l82
12120A32723k168j0776k425m762J0172L997k819r828o271m499p021j4146n85L329
12106H4921j327j094q80O520j134p149K053N433Q240L358J578J09k020m41K776
12091A00943q702Q50Q259J4228J2403k992m993p598m955K861J561J237M460N012
12077A22574Q255m220o343j2365L20N28J0000K925m074j809J6573J1623J2174
12064A56161J2684P120J3509K8807K3100M3810M2439N8678O8182P9861J02192
12053F36543J01090Q3597O1618M2379m849m4815q0835q6771p7118n9510n3973
$$ plain form
12147 175876 180359 185452 193531 187519 173792 174919 169267 170985 174418 163088 150766 147964 158344
12134 158344 162209 160482 157931 159163 164254 148398 139444 137762 131544 127691 124270 127276 133105 132723
12120 132723 130555 119779 117354 112592 122764 126761 123942 114114 107843 103344 96323 82177 81592 84921
12106 84921 83594 82500 81620 88140 87006 79857 81910 87343 95583 98941 100519 100628 98608 98167 100943
12091 100943 92241 93091 101350 115578 127981 124989 119996 112398 107443 110304 111865 113102 117562 122574
12077 122574 130829 126609 120266 107901 108221 108749 118749 121674 117600 115791 132364 143987 156161
12064 156161 168845 175965 189474 218281 241381 285191 327630 386308 454490 534351 636543
12053 636543 737633 821230 882848 925227 920378 875563 794728 707957 630839 571329 517356
12042E17356m3543k7648o213Q568K4107L1323L1032K7048J3207L4849L0611J0656
12030F51353P733k61J0540J1847J0343K9462M7454M8778P0154O3528M9555K9084
12018A029570R63j8131k7154m1166l3738l7127l2610j6154k3951l6156l6268l0594
12006F97484l1296m6176l7412j8212k2043o253j4400L55K39P963K8658M5920N1990
11993F56817N9803O8000N8950L1947K7362K58m2219n7839q3979q9822p7064o1284
11981D90930m2096l5789k4349j6397j7147n769j1702j1100n778j2720j4471P52
11969B94364m752n977k739l420K293j1099k852r119o509k013M023k51Q22J4640
11955B67411K495r318r939l150j4199j1188j1497r62j2797j564J854O175R389
$$ plain form
12042 517356 473813 446165 439952 448520 472627 503950 534982 562030 575237 610086 640697 651353
12030 651353 659086 658825 669365 681212 691555 721017 768471 817249 887403 950931 1000486 1029570
12018 1029570 1030533 1012402 985248 944082 910344 873217 840607 824453 800502 764346 728078 697484
12006 697484 666188 620012 582600 564388 542345 536092 521692 522047 522286 530249 558907 604827 656817
11993 656817 716620 784620 843570 875517 902879 903137 860918 803079 719100 629278 552214 490930
11981 490930 448834 413045 388696 372299 355152 349383 337681 326581 320803 308083 293612 294364
11969 294364 289612 283635 280896 277476 279769 268670 265818 256699 250190 248177 252200 251949 252771 267411
11955 267411 269906 260588 250649 247499 233300 222112 210615 209653 196856 195292 197146 203321 212710
11942B12710L712L611q301o578P840O173l393j2667j8027j2245n822l181j4589
11929A49243q105J5105J0809M091M745J1949K446k373M759K030j1397j5483K97
11916A68116L003p22M786K693O86n139Q59K185K725J1049j622n507r398p227k617
11901A63870l523n77k542n968j3382l540j370J6290Q264q034l620K169Q982J0071
11887A67090K126O866J3655J4921J3778Q948P68K73N43P003Q130P039O74K325
11873B54139k732j0051r379q820n417K952J708k214m143N649J3242Q653J1478
11860B55065J0579J636J0885R284N04M840l135L340J2139N243j425J2156Q186
11847C29297J774N616J926O744J8154P883o91j0606j0887k359r919m59K427K989
$$ plain form
11942 212710 216422 220033 211732 205154 212994 219167 215774 203107 185080 172835 167013 163832 149243
11929 149243 141138 156243 167052 171143 175888 187837 190283 187910 192669 194699 183302 167819 168116
11916 168116 171119 170397 175183 177876 178562 173423 174282 176467 179192 190241 188619 183112 173714 166487 163870
11901 163870 160347 159770 157228 151260 137878 134338 132968 149258 157522 149488 145868 148037 157019 167090
11887 167090 169216 176082 189737 204658 218436 227384 228152 228425 228968 235971 244101 251140 251814 254139
11873 254139 251407 241356 231977 223157 217740 220692 222400 220186 216043 221692 234934 243587 255065
11860 255065 265644 267280 278165 287449 287953 292793 289658 292998 305137 310380 308955 321111 329297
11847 329297 331071 336687 338613 345357 363511 371394 370703 360097 349210 346851 336932 336473 338900 341889
11833C41889K020j007n57J0577J989n452L934k035p050P272J4739k338R6P683
11819C71760Q765k848K452P513N263K396p785J222j0381j3708p710n408j4991
11806C36540Q76l624O738o828j1749m145M804P955J5651J0145k621K248j1124
11793C44866k98k878q134J4059J4562N676k434m419j010K065O804j0584l312r07
11779C54056N396N626m092O315J0333R333J1881K1051J9930J6901R022R023J8686
11766D93461J3706K616j0357J2625R201L469J6124K8125L3342K7150K7937L6975
11754F94374K6793L4374N2059N0040N0919N5292O4444O5522N7973O2398L6786
11743A250974K3542j0412l0876m8971o0220n2088k5640k6296j7811q980J1012
$$ plain form
11833 341889 343909 342902 342345 352922 354911 349459 353393 351358 344308 351580 366319 363981 364077 371760
11819 371760 380525 377677 380129 387642 392905 395301 387516 388738 378357 364649 356939 351531 336540
11806 336540 337416 333792 340530 333702 321953 317808 322612 330567 346218 356363 353742 355990 344866
11793 344866 344568 341690 333556 347615 362177 367853 365419 361000 359990 362055 368859 358275 354963 354056
11779 354056 359452 365078 360986 367301 377634 386967 398848 419899 439829 456730 465752 474775 493461
11766 493461 507167 509783 499426 512051 521252 524721 540845 568970 602312 629462 657399 694374
11754 694374 721167 755541 807600 857640 908559 963851 1028295 1093817 1151790 1214188 1250974
11743 1250974 1274516 1264104 1233228 1184257 1124037 1071949 1046309 1020013 1002202 993222 1004234
11732A004234J4818J6606J8864J1812n53J364K189R835Q323J6434J8661J3776
11720A136363J7499J6582K6976J1995N81J9337J1776L2492K5741J5245P784P365
11708A329736J7199J735J264K60J3914J1199J8089K2578L0151L0361K4271K9837
11696A530594L3061L2440K3135K4094K3914J4891O58Q405J5985M239M33J0045
11684A721894K1946K7095J8249K3521L2493M6705N3531N7120O4476Q2413Q9919
11673B239362R4087R0333R7257R0734R1141Q7995Q3213P7175Q9422R4541R9625
11662C234885J05538J21058J29675J44246J34149J48542J54496J77874K00263
11653D550726K21954K36844K80907L22419L58944M08551M75781N57416O67053
$$ plain form
11732 1004234 1019052 1035658 1054522 1066334 1065781 1067145 1069334 1079169 1087492 1103926 1122587 1136363
11720 1136363 1153862 1170444 1197420 1209415 1209996 1229333 1241109 1273601 1299342 1314587 1322371 1329736
11708 1329736 1346935 1348670 1349934 1350194 1364108 1375307 1393396 1415974 1446125 1476486 1500757 1530594
11696 1530594 1563655 1596095 1619230 1643324 1667238 1682129 1682787 1691192 1707177 1711416 1711849 1721894
11684 1721894 1743840 1770935 1789184 1812705 1845198 1891903 1945434 2002554 2067030 2149443 2239362
11673 2239362 2333449 2423782 2521039 2611773 2702914 2790909 2874122 2951297 3040719 3135260 3234885
11662 3234885 3340423 3461481 3591156 3735402 3869551 4018093 4172589 4350463 4550726
11653 4550726 4772680 5009524 5290431 5612850 5971794 6380345 6856126 7413542 8080595
11644H080595Q14715R70933J163776J409560J701520K054244K553932L234044
11636B1983319M203260N580156P510740J0114320J3400079J7002213J9832034
11629I9626121K0525149J8474435J4166371Q256930Q57078p488320j4615617j8159469
11621A21642678j7729088j4844534j1170577p593627m415084j602912Q77424L011458
11613F8175738M679767N839792O538355O733502O260507N058349L455695J959824
11605A08701529R43033O10027J111650K659561N289632Q641470J1815300J3599087
11597A53371289J3170464J0452816O064383O70426m914664r439596j1674566j1251673
11589A46448879q971725o119475l734801k419611k321474l145139m414618n625067
$$ plain form
11644 8080595 8895310 9866243 11030019 12439579 14141099 16195343 18749275 21983319
11636 21983319 26186579 31766735 39277475 49391795 62791874 79794087 99626121
11629 99626121 120151270 138625705 152792076 161049006 161906084 154417764 139802147 121642678
11621 121642678 103913590 89069056 77898479 70304852 65889768 64286856 65164280 68175738
11613 68175738 72855505 78695297 85233652 91967154 98227661 103286010 106741705 108701529
11605 108701529 109644562 110254589 111366239 114025800 119315432 127956902 139772202 153371289
11597 153371289 166541753 176994569 183058952 183729378 178814714 169375118 157700552 146448879
11589 146448879 137477154 131357679 127622878 125203267 122881793 119736654 115322036 109696969
11581A09696969o463372o938172p057146o679610n623522l980633j992479J27765
11573G1089800K393304M928107P845627J1084485J4116172J5867567J5267706
11566A42592768J2149875P299837J361988n473630j2472849j7598515j8983595
11559A08875879j7014186j3694444j0560090q090408o223200m824831l796003
11552D4672717l079629k586075k252455k023884j842006j667617j497042j335434
11544B8388575j205478j104660j015283r27277q88111q70602q72844q67346q58899
11535A9778075q16368p71711p22890o65139n98909n35300m95161m66040m59051
11526A4247506m46129m29020m16658m04356l85049l58742l44284l27188l16056
$$ plain form
11581 109696969 103233597 96295425 89238279 82558669 76935147 72954514 70962035 71089800
11573 71089800 73483104 78411211 86256838 97341323 111457495 127325062 142592768
11566 142592768 154742643 162042480 163404468 157930838 145457989 127859474 108875879
11559 108875879 91861693 78167249 67607159 59516751 53293551 48468720 44672717
11552 44672717 41593088 39007013 36754558 34730674 32888668 31221051 29724009 28388575
11544 28388575 27183097 26078437 25063154 24135877 23247766 22377164 21504320 20636974 19778075
11535 19778075 18961707 18189996 17467106 16801967 16203058 15667758 15172597 14706557 14247506
11526 14247506 13801377 13372357 12955699 12551343 12166294 11807552 11463268 11136080 10820024
11517A0820024l06453l14806k99181k93426k78356k58338k40554k38670k25126
11508H365114k15013k03884k12209k25571k37934k18937k17846k20361k20979
11499F392380k14513k03021j92932j91749j80612j74603j56300j69529j62342
11490D746779j41491j34027j27089j25073j15245j12992j19915j17070j16387
11481C637490r8423j03751q6880o8665o4496o6109n5596p6564p4507q0237r2035
11470B770227r0694q6164q4794q8189o7466n1702o7631n4743n9526p6346p0524
11459A972448n0685n2906n7083m8833l4683k8431k8782k6291k534M653K835k226
11447A647482J0113Q766j7588m1471n1237o1640p8921p7654o7054n4735n8609
$$ plain form
11517 10820024 10513571 10198765 9899584 9606158 9327802 9069464 8828910 8590240 8365114
11508 8365114 8150101 7946217 7734008 7508437 7270503 7051566 6833720 6613359 6392380
11499 6392380 6177867 5974846 5781914 5590165 5409553 5234950 5078650 4909121 4746779
11490 4746779 4605288 4471261 4344172 4219099 4103854 3990862 3870947 3753877 3637490
11481 3637490 3539067 3435316 3348436 3279771 3215275 3149166 3093570 3017006 2942499 2862262 2770227
11470 2770227 2679533 2593369 2508575 2420386 2352920 2301218 2233587 2178844 2119318 2042972 1972448
11459 1972448 1921763 1868857 1811774 1762941 1728258 1699827 1671045 1644754 1642220 1646873 1649708 1647482
11447 1647482 1657595 1666361 1648773 1607302 1556065 1494425 1415504 1337850 1270796 1216061 1157452
11436A157452o5307m2904l4119l9462m3502m0264k5587j9270j9040j3039k2349
11425G92609l7489k2843j7732k3501j8756J171q912j3584j1377o748m334J918
11413F30422o954j8479p30o252k1486j7262j1193q699r522j1920j1356o812n815
11400D93942j582M795m634K761j0513j5976o18J814J71M3q633j2008j4376r258
11386D25928m788q624j4856q416q304n20m939p629r347O343Q940K463o388N70
11372C70433Q410o990j1140j2193P992j3611p110j1398l580n199k263M7l629k893
11358C06876J688p941j1130q304j670p022n693m53L017k688p436k088K509l998
11344B55667O299j754j1737p44K153Q00J5945P758j0736j2974p956o431m081j0945
$$ plain form
11436 1157452 1092145 1049241 1015122 975660 932158 891894 866307 847037 827997 814958 792609
11425 792609 755120 732277 714545 691044 672288 673459 664547 650963 639586 632838 628504 630422
11413 630422 623468 604989 604259 598007 576521 559259 548066 539367 529845 517925 506569 499757 493942
11400 493942 492360 497155 492521 495282 484769 468793 468175 469989 470160 470203 461570 449562 435186 425928
11386 425928 421140 412516 397660 389244 380940 380420 375481 367852 358505 364848 373788 376251 369863 370433
11372 370433 378843 371853 360713 348520 356512 342901 335791 324393 320813 315614 313351 313398 309769 306876
11358 306876 308564 300623 289493 281189 279519 272497 266804 266351 269368 266680 259244 257156 259665 255667
11344 255667 261966 260212 248475 247731 249884 250684 266629 274387 263651 250677 242721 236290 232209 221264
11330B21264n837J153O075k558m573m940n848j2436q320l714O582o794k1331k4308
11316A34415J266k499o922p170n218J2780R694r979R05J2800N352k933p118n154
11302A30219K79j2465q656o641j009O669L476k561p301p615j4124j4038n81j2796
11288E2856j0844k598m05j2097k782j3758q595j191j399m494r415l926n447K121
11274b1974K355k38P421J776L323J1765J3241P375o647l854j0699j0115L399k955
11260e827j1281j297M146j0954j1330o376P918P171m50r416m842l625J3385J0079
11246b2699k511m651n235M552J5435n040l889L300L514l778q919o97M469N214
11232b0935r258p987N926j319q369K0974J1244K878J709m496J718K408O085r469
$$ plain form
11330 221264 215427 216580 222655 220097 215524 210584 204736 192300 183980 180266 186848 180054 158723 134415
11316 134415 135681 133182 126260 119090 113872 126652 136346 126367 127272 140072 145424 142491 135373 130219
11302 130219 130498 118033 109377 102736 101727 108396 111872 109311 102010 94395 80271 66233 65652 52856
11288 52856 42012 39414 39009 26912 24130 10372 1777 586 -813 -5307 -14722 -18648 -24095 -21974
11274 -21974 -19619 -19857 -12436 -10660 -7337 4428 17669 25044 18397 14543 3844 -6271 -2872 -5827
11260 -5827 -17108 -18405 -14259 -25213 -36543 -42919 -35001 -27830 -28280 -37696 -42538 -46163 -32778 -22699
11246 -22699 -25210 -29861 -35096 -30544 -15109 -20149 -24038 -20738 -17224 -21002 -29921 -30618 -26149 -20935
11232 -20935 -30193 -38180 -32254 -33573 -41942 -20968 -9724 -6846 -5137 -9633 -7915 -5507 578 -8891
11218h891l97k088P365j491q597O026J3877J7070J6916J5458K8537J9868Q697
11205A12350J9194L7893L9498M6831O0097P6078Q6708R6660R3500O0348L2030
11194G61187Q613k4791n7159o8161q1135p4968n9394l7217k2979j4272m460J4594
11182C39858K0253K8386L8993K4069L7026M1301J9271Q095P916N726K0379K0144
11170F11417L3183M4158L8621N8412N7507L2524J7961J95j8025m6682m2280l2003
11158G54988m2322l2326k3527j8680j2904j7226k1927j5947k0824k5536l6101
11147D87668k9126l3039j8437j4706o80N836K8287M1252M7054N7136Q3937P7930
11135G33112N3647K9084R464k8367o4221q8468q9838q0617p6673m1774m1151l7593
$$ plain form
11218 -8891 -9288 -11376 -4011 -5502 -14099 -8073 5804 22874 39790 55248 83785 103653 112350
11205 112350 131544 169437 208935 255766 315863 391941 478649 575309 668809 729157 761187
11194 761187 769800 745009 687850 619689 538554 463586 404192 366975 343996 329724 325264 339858
11182 339858 360111 388497 427490 451559 488585 529886 549157 557252 565168 570894 591273 611417
11170 611417 644600 688758 727379 785791 843298 875822 893783 893978 875953 829271 786991 754988
11158 754988 712666 680340 656813 638133 625229 608003 586076 570129 549305 523769 487668
11147 487668 458542 425503 407066 392360 391680 397516 425803 467055 514109 571245 655182 733112
11135 733112 786759 815843 825307 796940 732719 644251 554413 473796 397123 355349 314198 276605
11123B76605k6640k1497k2690r596j307r984j3720j9593j6773j1659q149l370
11111A11627j250J663p266q009m463p456j0073j2921L47K371o259j1256j6508
11098C0547L99J537J484J0907M590J29o618j7997j803J212p777o304P579j875
11084A6010j361J85J5965j0097j2939l468k140l182L574j5921K581M672p410L010
11070a0521p388j1054k348K198L024Q0k591Q001N393m391J805j609q145n221k704
11055c5471K041K239q393j3981K226P376p649l257K383m01N42J0896L144L560
11041c4745N591n554l514j274j233r07N154R604M353J638n486l172j98k127k974
11026c4844r338m747R71r69N791R226N836p209o829p44k16o410m084j020k532
$$ plain form
11123 276605 249965 228468 205778 196182 194875 184891 171171 151578 134805 123146 114997 111627
11111 111627 110377 112040 104774 96765 92302 84846 74773 61852 62199 64570 58311 47055 30547
11098 30547 30946 32483 33967 44874 49464 49593 42975 24978 23175 24387 16610 10306 17885 16010
11084 16010 14649 14834 30799 20702 7763 4295 2155 -1027 2547 -13374 -10793 -6121 -13531 -10521
11070 -10521 -17909 -28963 -31311 -29113 -26089 -26009 -28600 -20599 -15206 -19597 -17792 -19401 -27546 -32767 -35471
11055 -35471 -33430 -31191 -39584 -53565 -51339 -43963 -51612 -54869 -52486 -52887 -52345 -41449 -38305 -34745
11041 -34745 -29154 -34708 -38222 -39496 -40729 -41636 -36482 -26878 -22525 -20887 -26373 -29545 -29743 -31870 -34844
11026 -34844 -44182 -48929 -47958 -48927 -43136 -33910 -28074 -35283 -42112 -42856 -43072 -49482 -53566 -54586 -57118
11011e7118P98J1727O724j825j511q415r923l233M912J2820m399p428L944J474
10997e1453N56R917m713j461J607O221n83K45o642M706P033K337r212r813k743
10982e3998m469L978n216O076J55l851m513k984R941K0l946M436K788L022j821
10967e0382J0900K695N916k21j0147p301m553p777L253J366o233m626L831N262
10953e8017P689P843J750j0556j7195l492J821m421O35L36J3069J7231O42k037
10939d4702m552m585R337J523l350R809L660n70K515L408N436K935j1502q753
10925c9391p632j0695p843M516l118N788R484q68L598j531n487n585k888j2568
10911g4220N648P508o020P597J5264J2501k072q484n090J052M642N063R961Q06
$$ plain form
11011 -57118 -56320 -44593 -37869 -39694 -41205 -49620 -59543 -62776 -57864 -45044 -49443 -56871 -52927 -51453
10997 -51453 -50897 -40980 -45693 -47154 -45547 -39326 -39909 -39664 -46306 -41600 -34567 -32230 -41442 -51255 -53998
10982 -53998 -58467 -54489 -59705 -53629 -53474 -57325 -61838 -64822 -54881 -54861 -58807 -54371 -51583 -48561 -50382
10967 -50382 -39482 -36787 -30871 -31092 -41239 -48540 -53093 -60870 -57617 -56251 -62484 -67110 -63279 -58017
10953 -58017 -50328 -42485 -40735 -51291 -68486 -71978 -70157 -74578 -73943 -73607 -60538 -43307 -42665 -44702
10939 -44702 -49254 -53839 -44502 -42979 -46329 -36520 -32860 -33430 -30915 -27507 -22071 -19136 -30638 -39391
10925 -39391 -47023 -57718 -65561 -61045 -64163 -58375 -48891 -49759 -46161 -47692 -53179 -58764 -61652 -74220
10911 -74220 -68572 -61064 -67084 -59487 -44223 -31722 -33794 -42278 -47368 -46316 -41674 -36611 -26650 -25844
10897b5844r072o294R706K541o721j56Q356l336o006j827p639J0664o585m681
10883d6894n793k601L440N969k898n005O703O777J8J0837J1089L749p732m144
10869b6485r718q832j933K774l014J738K628p067q528m952l723N083P586M320
10855e0123J0111J0416o345n474j083K638N499n894j964M25j551J3297J2539J3544
10841c965n354n361j6006n421k293M225n539Pp851M536m2l851P671j5k277n410
10825d6946J710n791M873L556l796j19k894Q39J1030J212J66k7l725K13R18J178
10809c7603N811m196p069J408Q560j449q093k933J2150K461o420q366q851M667
10795d9923J0066l476k573J293q26l601j553rO15L384M217j373K084R169k357
$$ plain form
10897 -25844 -34916 -41210 -31504 -28963 -35684 -35840 -27484 -30820 -36826 -38653 -46292 -35628 -42213 -46894
10883 -46894 -52687 -55288 -51848 -45879 -48777 -53782 -47079 -40302 -40284 -29447 -18358 -14609 -22341 -26485
10869 -26485 -36203 -45035 -46968 -44194 -47208 -45470 -42842 -49909 -58437 -63389 -67112 -62029 -54443 -50123
10855 -50123 -40012 -29596 -35941 -41415 -42498 -39860 -34361 -40255 -42219 -41794 -43345 -30048 -17509 -3965
10841 -3965 -9319 -14680 -30686 -36107 -38400 -34175 -39714 -39707 -47558 -43022 -43064 -46915 -39244 -39259 -41536 -46946
10825 -46946 -45236 -51027 -46154 -42598 -46394 -46513 -49407 -48568 -37538 -36326 -36160 -36187 -39912 -39699 -38781 -37603
10809 -37603 -31792 -35988 -43057 -41649 -33089 -34538 -42631 -45564 -33414 -30953 -37373 -45739 -54590 -49923
10795 -49923 -39857 -43333 -45906 -44613 -45439 -49040 -50593 -50602 -49987 -46603 -42386 -43759 -41675 -32506 -34863
10780c4863l275L004k818n25M529J0236N980j193j82K199k016m396o098p811K178
10765c5051R65k426N33l967K60J3693J178o543N239R22L492J1761j0298o923l401
10750c0566k894l154J66j847n713N793M991l349P623Q497J93o181j866o591q106
10735d3004N769j849m862m109k881J0376N326l134k519Q695J1178K41j733r430
10721c1936k52N739L309K595j2296m334N656k36O39m771J236K268K87m508j129
10706c7733R289L829P01p808q366J5648K056q902j1114J1347K1323J4222Q225
10693A2717n735n60K518J399R92q655n434k714l353l214O80N798l113j2315o28
10678b1617R459p004r973J63J875j435L26L374R547j456Q4J324L378q85L756j836
$$ plain form
10780 -34863 -38138 -35134 -37952 -38477 -33948 -23712 -17732 -18925 -19107 -16908 -18924 -23320 -29418 -37229 -35051
10765 -35051 -34086 -36512 -35979 -39946 -39686 -25993 -24815 -31358 -26119 -25197 -21705 -9944 -20242 -27165 -30566
10750 -30566 -33460 -36614 -36448 -38295 -44008 -38215 -33224 -36573 -28950 -20453 -20260 -26441 -28307 -34898 -43004
10735 -43004 -37235 -39084 -43946 -48055 -50936 -40560 -35234 -38368 -40887 -32192 -21014 -20773 -22506 -31936
10721 -31936 -32188 -26449 -23140 -20545 -32841 -37175 -31519 -31755 -31116 -35887 -34651 -32383 -32096 -36604 -37733
10706 -37733 -28444 -24615 -23914 -31722 -40088 -24440 -22384 -31286 -42400 -31053 -9730 4492 12717
10693 12717 6982 6422 8940 10339 11331 2676 -2758 -5472 -8825 -12039 -11359 -5561 -8674 -20989 -21617
10678 -21617 -12158 -19162 -29135 -28972 -27097 -28532 -28206 -24832 -15285 -16741 -16657 -15333 -11955 -12840 -9084 -10920
10662a0920k175o479N011R2J0861K864j434r905j112k645p60L025j012L305j1952
10647b3236k745O485o552P011N790m171n041R5j258L235K976N002N018j0542j5260
10632c3193K261N383J004j794J1673N076o110m602N725Q810k605m238m938j0387
10618b7935l317k919m808l310p34J573O315R510j169R904l572M246J667P36n829
10603a9642j119J47K680P71j754J856j1723q899j887n918R77M103O794L961J0133
10588a9520J2108Q938n738m317k47q619o930l153J3649O643m378j171o548L502
10574a5781M274r15K252L962P642k618r14P563N181M193O257k198l134j4897j3666
10559a2799q853j0386q726m514J2136J9235N260N950M58o535l897R557Q635R382
$$ plain form
10662 -10920 -13095 -19574 -14563 -14471 -3610 -746 -2180 -12085 -13197 -15842 -16602 -13577 -14589 -11284 -23236
10647 -23236 -25981 -19496 -26048 -19037 -13247 -17418 -22459 -22364 -23622 -20387 -17411 -12409 -7391 -17933 -33193
10632 -33193 -30932 -25549 -24545 -26339 -14666 -9590 -15700 -20302 -14577 -5767 -8372 -12610 -17548 -27935
10618 -27935 -31252 -34171 -38979 -42289 -43023 -41450 -35135 -25625 -26794 -16890 -20462 -16216 -14549 -13813 -19642
10603 -19642 -20761 -20614 -17934 -17163 -18917 -17061 -28784 -37683 -39570 -45488 -44511 -40408 -33614 -29653 -19520
10588 -19520 -7412 1526 -4212 -8529 -8776 -17395 -24325 -27478 -13829 -7186 -11564 -12735 -19283 -15781
10574 -15781 -11507 -12422 -10170 -6208 1434 -1184 -2098 5465 10646 14839 21096 18898 15764 867 -12799
10559 -12799 -21652 -32038 -40764 -45278 -33142 -13907 -8647 -2697 -2239 -8774 -12671 -3114 5521 14903
10545A4903K419K76l094k143M558M242m679j5833j6869O959N437J6435R494o965
10531A5140o481r036j1865j3799m412J145J1455J7271J4456O329Q285N845M738
10518C9071q30Q449O293O542Q101J0636j522j2842j4061j2828r789J913k446p926
10504A8761n309J189l509Q273n408r066j7440j5092j3423L064J8284J4557O456
10491A337J4101J446j4485j1618m759K734K983l752L746J6713J5511J8609K1739
10478F4305J6039K0273L9548L5841L5492K8235J5562l33j7670n4502o3400m4628
10466G4762l0245j5277k2515j3332J6345J5915R879M011m346l956p176j538j3380
10453I147j1731j1786M94P268N295J2498J561p478N09L72r891M966N677P697j451
$$ plain form
10545 14903 17322 17598 14504 12361 16919 21161 16482 649 -16220 -9261 -3824 12611 22105 15140
10531 15140 8659 -377 -12242 -26041 -30453 -29308 -17853 -582 13874 20203 28488 34333 39071
10518 39071 38241 46690 52983 59525 67626 78262 76740 63898 49837 37009 27220 29133 26687 18761
10504 18761 13452 14641 11132 19405 13997 4931 -12509 -27601 -41024 -37960 -19676 -5119 1337
10491 1337 15438 16884 2399 -9219 -13978 -11244 -8261 -12013 -8267 8446 23957 42566 64305
10478 64305 80344 100617 140165 176006 211498 239733 255295 254962 237292 182790 119390 74762
10466 74762 44517 29240 6725 -6607 9738 25653 35532 39543 35197 31241 24065 22527 9147
10453 9147 -2584 -14370 -13876 -6608 -1313 11185 12746 5268 5777 6149 -3742 1224 6901 14598 13147
10438A3147l678n965m221O135N346O670K574k1976n827k153l229N917M681J681
10424h98M325K446N626l755p846j509J2331J505n911O538O112J762o280j049m182
10409I215p727k565N974r966N552R702k157m070P3k264j135J0323M448M714q454
10394A1663q290Q861L492p145j945n265l542m461o354n689O015R795J000N413
10380C548N666L110j044j2q041m641k521j249m640j0641j740J2563R179j04j1979
10365a2546k621P095M869J0542L572j028K275L361j4918r811o584J60j198L807
10351a3025Q195M236J14J966k607Q75O550P333l57o648k87n663l671M703L546
10336E260J073l060K204P866O970N289K922N090J1711J859L388m221j1234j1618
$$ plain form
10438 13147 9469 3504 -717 5418 10764 17434 20008 -1968 -7795 -9948 -13177 -7260 -2579 -898
10424 -898 3427 5873 11499 7744 -102 -1611 10720 12225 6314 12852 18964 20726 14446 13397 9215
10409 9215 1488 -1077 4897 -5069 483 10185 8028 3958 4031 1767 632 10955 15403 20117 11663
10394 11663 3373 12234 15726 8581 6636 1371 -2171 -6632 -12986 -18675 -12660 -2865 -1865 3548
10380 3548 9214 12324 11280 11268 3227 -1414 -3935 -5184 -9824 -20465 -22205 -9642 -463 -567 -12546
10365 -12546 -15167 -8072 -3203 7339 10911 9883 12158 15519 601 -9210 -15794 -15634 -16832 -13025
10351 -13025 -4830 -594 -480 1486 -1121 -246 6304 13637 13280 6632 6345 682 -2989 1714 5260
10336 5260 6333 3273 5477 13343 20313 25602 28524 33614 45325 47184 50572 46351 35117 23499
10322B3499N3K653o44k929k869j661L534L04q263p191J0926J934L492N428J256
10307B9522o962n778N443K332J204K45n328m351k208L338K527J048l462M190O214
10292B7974J1099N756O497O107J2372J3684K0345R202k728o673R007M127q327
10279A08442j3780j6931M312K584k089J1652K1044K3607J3302J5046J4117J4367
10267A95673L0907K1951j3659j1269j2728m871k1517l4090k3101j4502r707n50
10255A02537K208k638l664J992o060M967L677m779j0427k164J6190K07j7929r962
10241G4155n21O698R818J649o251j2512r630n629k048j4174j4772n853O726N814
10227C3470R917P993K429M78Q69q014N374l82M63p58n620J767q168M696j377j376
$$ plain form
10322 23499 23552 26205 25561 22632 19763 18102 21636 21940 13677 6486 17412 19346 22838 28266 29522
10307 29522 22560 16782 22225 24557 25761 26006 20678 16327 14119 17457 19984 21032 17570 21760 27974
10292 27974 39073 44829 51326 57433 69805 83489 103834 113036 110308 103635 112642 116769 108442
10279 108442 94662 77731 82043 84627 82538 94190 115234 138841 152143 167189 181306 195673
10267 195673 226580 248531 234872 223603 210875 206004 184487 150397 127296 112794 103087 102537
10255 102537 104745 102107 98443 100435 94375 99342 103019 98240 87813 85649 101839 102046 84117 74155
10241 74155 73634 80332 90150 91799 85548 73036 63406 57777 55729 41555 26783 20930 27656 33470
10227 33470 43387 51380 53809 54287 55156 47142 52516 52134 52597 51839 46219 47986 39818 44514 43137 41761
10211D1761J1633J590l530j593m105j901m913M257J926Q946J4878J0253K121P635
10197H8958R227J7641M5036N3347N6878N4962O9963O3355K5611J180J3549J1055
10185E10762l6772n8056m7627m3713n3911o0180m2577j5981j0192j8523r413p668
10173A06149l654j474K379j112q762K007N45n634r917r56l169j4868N239M758
10159G1531m909k025J2296M171m158j0138j6719l776L768J946N803L943R96j527
10145F1202N286K009j100l714m765P073j389j0854j363K268N04M245j3802o720
10131C8880r19j375J1944P930J4993L572q962l888l303m677P036j294l849q232
10117D7856P655K199O995m859n737K604O84j0852p243M05N407k598J226j46N927
$$ plain form
10211 41761 53394 54984 51454 49861 45756 43855 38942 43199 45125 54071 68949 79202 81323 88958
10197 88958 98185 115826 160862 214209 271087 326049 396012 459367 484978 486158 499707 510762
10185 510762 473990 415934 368307 324594 270683 210503 167926 151945 141753 123230 113817 106149
10173 106149 102495 101021 103400 102288 93526 95533 96078 90444 80527 79571 76402 61534 66773 71531
10159 71531 66622 64597 76893 81064 76906 66768 50049 46273 50041 51987 57790 61733 62729 61202
10145 61202 66488 68497 67397 63683 58918 65991 64602 53748 52385 54653 55157 59402 45600 38880
10131 38880 37961 36586 48530 56460 71453 75025 66063 62175 58872 54195 61231 59937 56088 47856
10117 47856 55511 57710 64705 59846 54109 56713 57397 46545 39302 39707 45114 42516 43742 43596 49523
10102D9523N252l745q775M23O136k894L272J322N220q586k363k393M915M320N157
10087E6784L617J674j2920J063J952m106J052M633q294j2329j0058N735M879n908
10073B7774N275Q025Q524N882j1243r409q505J802o82j857l975L056R750P797
10059D2214m827j1869J1212J481j1937O631Q146N46L952p151K724m219n478j888
10045B9537O338N932M113j557n014j2360q330P94L838O651N111j525m502j698
10031B7328M27Q10K440k415r01L751Q856J986p518n015J2020j042L280O142L747
10016E3896L492j2190j0463O898N983k894q869l611N685J2723P271m559o565j1604
10002C5193N878L052k697Q378O159J089j6761j3028j417P647O981K985K592m471
$$ plain form
10102 49523 54775 51030 42255 42678 48814 45920 49192 50514 55734 47148 44785 42392 47307 51627 56784
10087 56784 60401 62075 49155 50218 52170 48064 49116 53749 45455 33126 23068 28803 33682 27774
10073 27774 33049 41074 49598 55480 44237 34828 26323 28125 27443 25586 21611 24667 34417 42214
10059 42214 37387 25518 36730 38211 26274 32905 41051 41597 45549 38398 41122 36903 31425 29537
10045 29537 35875 41807 45920 44363 39349 26989 18659 19453 23291 29942 35053 33528 29026 27328
10031 27328 27755 28565 31005 28590 27689 31440 40296 42282 34764 29749 41769 40727 44007 50149 53896
10016 53896 57388 45198 34735 41633 47616 44722 35853 32242 37927 50650 57921 53362 46797 35193
10002 35193 41071 44123 41426 49804 55963 57052 40291 27263 25846 33493 40474 43459 46051 41580
9988D1580j0312N475M063l37J0715N057m598l773m107r333j3208J902O637O076
9974C5837N177l193r317K3Q376n743Q29N148M768R285j504l988j510m586p524
9959C2078n915k271Q077N243J330l447k699K172p263j247k182p010J2823q71N706
9944C4524O030k583o593l021L610O890K838K500k751m754J1485O533L574O303
9930F4585O826r04p981j8445j340k180j884J0770l749r995j678l327O139Q333
9916D5170l097q403Q120m17P61J469K041L865J4042J0254N276L889m035j069O73
9901G8539q266o219m290o229r708O812J4956J208j937l619O45j3191p470J140
9887D2371M114K660P179O568m199p675r587K583J0750N371n095q833o693P210
$$ plain form
9988 41580 31268 36743 40806 40469 51184 56241 51643 47870 43763 34430 21222 23124 29761 35837
9974 35837 41014 37821 28504 28527 36903 31160 31989 37137 41905 51190 49686 45698 44188 39602 32078
9959 32078 26163 23892 31969 37212 38542 35095 32396 34568 27305 26058 23876 16866 29689 28818 34524
9944 34524 40554 37971 31378 28357 31967 38857 41695 44195 41444 36690 48175 54708 58282 64585
9930 64585 71411 70507 62526 44081 42741 40561 38677 49447 45698 35703 34025 30698 36837 45170
9916 45170 42073 33670 41790 41373 42134 43603 45644 49509 63551 73805 79081 82970 78935 77866 78539
9901 78539 70273 64054 59764 53535 43827 50639 65595 66803 64866 61247 61892 48701 41231 42371
9887 42371 46485 49145 56324 62892 58693 51018 41431 44014 54764 60135 55040 46207 39514 46724
9873D6724K106K875l091j318O488L318M758K258j3567q84Q316k09m451l402L586
9858E3507J736m239M371m085j409R246l76j916L805j947o5k008m513M473J0807
9843F7387l125j214L081j0511l950L19n604M124P363k961m840J0919P700o820
9829F1868r59R452k778m944N015k570K123N980o382p211q76L501J3766J123L86
9814G7494J15k057k933m538o677o630K53O555l6J0413J1885J1382r69r994j0675
9799G3588k313N329N951P930P439M59R912Q064k915o957O322o44j724n823k843
9784A01775j3455j541M768K610K895j0315j1571J0147M854J030k833l936R31L623
9770H8982k737L531k714P080O748J2822Q746k645j109j738N283O203m398o423
$$ plain form
9873 46724 48830 51705 48614 47296 53784 57102 61860 64118 50551 49667 57983 57774 53323 49921 53507
9858 53507 55243 51004 55375 51290 49881 59127 58751 56835 60640 58693 58628 56620 52107 56580 67387
9843 67387 64262 63048 66129 55618 51668 51987 46383 50507 57870 54909 50069 60988 68688 61868
9829 61868 60909 70361 67583 62639 67654 65084 67207 73187 66805 59594 58718 62219 75985 77108 77494
9814 77494 77609 75552 72619 68081 61404 54774 55027 61582 61546 71959 83844 95226 94257 84263 73588
9799 73588 71275 76604 82555 90485 97924 98383 108295 116359 113444 106487 112809 112165 110441 104618 101775
9784 101775 88320 86779 91547 94157 97052 86737 75166 85313 90167 91197 88364 84428 85359 88982
9770 88982 86245 89776 87062 94142 100890 113712 122458 119813 118704 116966 122249 128452 124054 117631
9756A17631q489l599K302l614j2594l100R696J4732J038j1674m385k714k869j699
9742I0662l450J338o485k146P877K102P667R880l223q756Q621J756K09r180l679
9727I3193J0082J018m666K863L171j2385P73Q072K858j1361J309N590q368n577
9713H6572j167L987N385J2993l973q523l511K064N703L8K841M618j811p592M754
9698A02378K299J029P261J689p285q59J504J455k028m646n016l986K981O723P507
9683A11006l476m918K98r007P198O716n338k803N011j491l839L76L548M693l353
9668A04621M031J4234M54p614m32o24J0077r450o505l340L918K525k289l906P381
9653A13081k680p11n794J3085N301k251M0R023k702O524J092Q807k86n984K457
$$ plain form
9756 117631 109142 105543 107845 104231 91637 88537 98233 112965 114003 102329 97944 95230 92361 90662
9742 90662 87212 88550 82065 79919 87796 89898 97565 107445 104222 95466 104087 105843 106052 96872 93193
9727 93193 103275 104293 99627 102490 105661 93276 94049 102121 104979 93618 94927 100517 92149 86572
9713 86572 85405 89392 94777 107770 103797 95274 91763 93827 99530 99568 102409 107027 105216 97624 102378
9698 102378 104677 105706 112967 114656 107371 106512 108016 109471 107443 102797 97781 93795 96776 103499 111006
9683 111006 107530 102612 102910 93903 101101 107817 102479 99676 104687 103196 99357 99733 103281 107974 104621
9668 104621 108652 122886 123340 115726 115294 114670 124747 115297 108792 105452 109370 111895 109606 105700 113081
9653 113081 110401 109690 103896 116981 122282 120031 120071 129094 126392 132916 134008 142815 142529 136545 139002
9638A39002L313o948p276N798J1674j01k216K395j396J329j256L639L222M025
9624A55204L97j0219m547L524O469K233o029k979L030j790J263j651O30K311J623
9609A49469l95j1317o225R691Q262P914k264L579m581L231O116P040L132j521
9595A72131M708Q87k532N631M610m649N538j969m945j430J9692M725r662j002
9581A91733j556p70P555J495m470K664L286r558l48l034K142o847p99k732k730
9566A76031O419N307M099K314m254R993j061k348J087r82L206M939J38M844p646
9551B02086m72J3240J4024k071k060k16Q65Q268k664p268p069p644p736k260m542
9536A94481O180K2471J1053N34J40k504q001j969o021o820L45N331K289q798l178
$$ plain form
9638 139002 142315 135367 128091 133889 145563 145462 143246 145641 144245 145574 144318 147957 151179 155204
9624 155204 155601 145382 140835 144359 150828 153061 147032 144053 147083 145293 146556 144905 145535 147846 149469
9609 149469 149074 137757 131532 141223 149485 157399 155135 158714 154133 157364 163480 170520 173652 172131
9595 172131 176839 177726 175194 180825 185435 180786 186324 184355 179410 177980 197672 202397 192735 191733
9581 191733 190177 189407 196962 198457 193987 196651 199937 190379 190031 186997 189139 182292 181493 178761 176031
9566 176031 182450 187757 191856 194170 189916 199909 198848 196500 197587 196605 199811 204750 204888 209732 202086
9551 202086 201614 214854 228878 226807 224747 224531 225396 233664 231000 223732 216663 209019 201283 199023 194481
9536 194481 200661 223132 234185 234719 234859 232355 224354 222385 216364 209544 209889 215220 217509 208711 205533
9521B05533k284K164M807J1005l07J577J189j965l80J2262J971P089p002j2815
9507B22844O732N541m032p403M80m159n828o064k248R463M559j359l594O980l617
9492B18295j912L326k384n829m875q6O258N640K140L83N80n13m013n690R839J2258
9476B33417p262n216K201o649K083J016l5L061M770J1789R210M935q307o114o843
9461B32056j6117n180R750l990o918O364Q594j379K505j517j5886l36K3846J2921
9447B44713J2661P16o839J395j352o607M792R32P256O560n189p963N740J1943
9433B68758l403j3580n263J166J206J1222M974l100p655j084R927L873m947N135
9419B67229O446O631J6076P134Q616J3003J2635K199j275k400j3654j3496j3728
$$ plain form
9521 205533 203249 205413 210220 221225 220918 222495 223684 221719 221339 233601 235572 242661 235659 222844
9507 222844 229576 235117 231085 223682 224162 220003 214175 208111 205863 215326 219885 218526 214932 221912 218295
9492 218295 216383 219709 217325 211496 206621 206535 212793 218433 220573 220956 221536 221023 217010 211320 221159 233417
9476 233417 226155 220939 223140 216491 218574 219590 219555 222616 227386 239175 248385 253320 245013 238899 232056
9461 232056 215939 210759 220509 216519 209601 215965 224559 223180 225685 224168 208282 207946 231792 244713
9447 244713 257374 258090 251251 252646 251294 244687 249479 250411 257667 264227 259038 251075 256815 268758
9433 268758 265355 251775 246512 247678 248884 260106 265080 261980 254325 253241 263168 267041 262094 267229
9419 267229 273675 280306 296382 303516 312132 325135 337770 339969 338694 336294 322640 309144 295416
9406B95416k482J3227L012j5821q609k541p095n675K625N077L561O807R640M878
9392C02020q930r44N274k202L113J2219J7984J5381M731l097n878J6173J2775
9379C68619K0058K3451Q489J283R347M718j8691j6254j5240r604q287m311l679
9366C59899L527N159r268p553L405M576l471k200j4777m227l486M537O112J1750
9352C53983J452n74n981N066J5586N328L567J1299J1147J4080J2611J2316J1491
9339D51371n999j4m323k4526j7751K86l332m622R80j0233L464O384L160L056L515
9324D01416J184J3502n476j9002k394J6560P280L960J2432j97n71K298K009P43
9310D33744L642R867J5580k062k127P970M773R20n092l659O981M131K496j054
$$ plain form
9406 295416 292934 306161 309173 293352 284743 282202 275107 269432 272057 277134 280695 287502 297142 302020
9392 302020 293090 292146 297420 295218 298331 310550 328534 343915 348646 345549 339671 355844 368619
9379 368619 388677 412128 420617 421900 431247 435965 417274 401020 385780 376176 367889 363578 359899
9366 359899 363426 368585 359317 351764 355169 359745 356274 354074 339297 335070 331584 336121 342233 353983
9352 353983 355435 354861 348880 353946 369532 374860 378427 389726 400873 414953 427564 439880 451371
9339 451371 445372 445358 441035 416509 398758 399044 395712 391090 392070 381837 385301 391685 394845 397901 401416
9324 401416 402600 416102 410626 391624 389230 405790 413070 417030 429462 429265 428694 430992 433001 433744
9310 433744 437386 447253 462833 460771 458644 466614 471387 472307 467215 463556 470537 474668 477164 476110
9296D76110J1437L622q545j247M690R277K914L111J1751N230o750r036O158J0067
9282E18789J1464q613o438K88K170R44l374Q029K883M591J1110Q916J1718O636
9268E69113K437Q708J5971J3798K3321K1975K5606P721m312l674j0702j2121j6506
9255F41335j0287J181Q835k60k861J4925P866L090q605m088O238J1783O624J410
9241F77186P311Q396O341M962R109J4867J8160K1735K3426K1398L4774M2566N1076
9228I41307P3514J12945J47956J91105K32361K43712J91603J24041O2969l0953
9218B290560j44373k11472j94236j52887q9966k3149J9890L2276P6641J27969
9208A731253J57617J74842J69344J39876J00424N1590J2883k9219m8883n7966
$$ plain form
9296 476110 487547 491169 482624 481377 486067 495344 498258 501369 513120 518350 511600 502564 508722 518789
9282 518789 530253 521640 515202 515490 517660 518604 515230 523259 526142 530733 541843 550759 562477 569113
9268 569113 571550 580258 596229 610027 633348 655323 680929 688650 684338 680664 669962 657841 641335
9255 641335 631048 632229 641064 640804 637943 652868 660734 663824 655219 651131 657369 669152 675776 677186
9241 677186 684497 692893 699234 704196 713305 728172 746332 768067 791493 812891 847665 890231 941307
9228 941307 1014821 1127766 1275722 1466827 1699188 1942900 2134503 2258544 2321513 2290560
9218 2290560 2146187 1934715 1740479 1587592 1497626 1474477 1494367 1526643 1603284 1731253
9208 1731253 1888870 2063712 2233056 2372932 2473356 2524946 2537829 2508610 2459727 2401761
9198B401761m8160m5729m0112l6389q036J5191M3467J02208J86333K87683M24138
9187C282355N32436N37915M34986K85490J02244j03822l80465n84785n60777m26349
9177C119228k67554j53008q9021m4878J610K3109M3018M1688N6637Q2537R2031
9166B905397P0815M3102J3774k4894p2562j15086j53276j83895j69025j29881
9156B184469q2973l8815L701M4299J04257J49492J96917J90659J66927R9540L5296
9145C053769n3444j73054k37234k32700j80907j46855r6555n9102m7172k4872
9135A801874j5757j2284m671j4063j3642n197K905J912k097n594o661Q219P388
9122A742332J5998J0312J1030k818J971O910j865K0269K2163K2217J4687K0086
$$ plain form
9198 2401761 2353601 2307872 2267760 2231371 2223335 2238526 2281993 2384201 2570534 2858217 3282355
9187 3282355 3814791 4352706 4787692 5073182 5175426 5071604 4691139 4106354 3545577 3119228
9177 3119228 2851674 2698666 2609645 2564767 2566377 2589486 2632504 2674192 2730829 2813366 2905397
9166 2905397 2976212 3019314 3033088 3008194 2935632 2820546 2667270 2483375 2314350 2184469
9156 2184469 2101496 2062681 2066382 2110681 2214938 2364430 2561347 2752006 2918933 3018473 3053769
9145 3053769 3000325 2827271 2590037 2357337 2176430 2029575 1933020 1873918 1826746 1801874
9135 1801874 1786117 1773833 1769162 1755099 1741457 1736260 1739165 1741077 1738980 1733386 1726725 1734944 1742332
9122 1742332 1758330 1768642 1779672 1776854 1778825 1785735 1783870 1804139 1826302 1848519 1863206 1883292
9110A883292K7306L3535L1166L1703K3345M417k567k54R412Q200Q768J5876K4380
9097B098579K2887J1916K2095K4128K1234K0980L1983L0584K5177L1113L9402
9086B380078L1683K1581J5421L7833M3622L4758K4494K8452K9348K9038M1364
9075B717672L9896L7116L9766M7609M4962K8843K5316L8810M0361L1305M4123
9064C135779M3488M3462M6110N1536N1747M8971N4946O0390N5477N1104M3221
9053C686231M9604O8394N6830O0643P0983P9301O5085Q0704Q1557P4772P4176
9042D448280P4429P9538P6291R7185R6947Q1906Q9963J01261R8388J01160J06826
9031E452174J08087J12812J22686J24900J35673J28224J39542J44046J49625J58634
$$ plain form
9110 1883292 1910598 1944133 1975299 2007002 2030347 2034764 2032197 2031943 2041355 2049555 2058323 2074199 2098579
9097 2098579 2121466 2133382 2155477 2179605 2200839 2221819 2253802 2284386 2309563 2340676 2380078
9086 2380078 2411761 2433342 2448763 2486596 2530218 2564976 2589470 2617922 2647270 2676308 2717672
9075 2717672 2757568 2794684 2834450 2882059 2927021 2955864 2981180 3019990 3060351 3091656 3135779
9064 3135779 3179267 3222729 3268839 3320375 3372122 3421093 3476039 3536429 3591906 3643010 3686231
9053 3686231 3735835 3804229 3861059 3921702 3992685 4071986 4137071 4217775 4299332 4374104 4448280
9042 4448280 4522709 4602247 4678538 4775723 4872670 4954576 5044539 5145800 5244188 5345348 5452174
9031 5452174 5560261 5673073 5795759 5920659 6056332 6184556 6324098 6468144 6617769 6776403
9021F776403J69302J58035J63200J76164J86437J94910J95007K02218K23578K35149
9011H680403K37514K35621K50459K64455K69431K86287L06399L31428L40860L48648
9001A1551505L58245L84460L90219M08025M39727M73753M99438N09873N27568
8992A5542813N62264N94457O19368O47737O84648P18513P64597P90819Q27216
8983B1752432Q74637R36614R84241J040849J085439J147526J204034J265348J328959
8974C1620079J396884J456892J517041J583216J659050J710752J761639J828897
8966D4534450J881238J903239J948591J954319J947852J930452J887074J823920
8958E9811135J724685J617228J490591J336456J162092R53572P43869N12111K87139
$$ plain form
9021 6776403 6945705 7103740 7266940 7443104 7629541 7824451 8019458 8221676 8445254 8680403
9011 8680403 8917917 9153538 9403997 9668452 9937883 10224170 10530569 10861997 11202857 11551505
9001 11551505 11909750 12294210 12684429 13092454 13532181 14005934 14505372 15015245 15542813
8992 15542813 16105077 16699534 17318902 17966639 18651287 19369800 20134397 20925216 21752432
8983 21752432 22627069 23563683 24547924 25588773 26674212 27821738 29025772 30291120 31620079
8974 31620079 33016963 34473855 35990896 37574112 39233162 40943914 42705553 44534450
8966 44534450 46415688 48318927 50267518 52221837 54169689 56100141 57987215 59811135
8958 59811135 61535820 63153048 64643639 65980095 67142187 68095759 68839628 69351739 69638878
8949F9638878O2364j82482l97554o11140p98553r70755j142788j275189j372458
8940F2950323j464888j540360j583917j615176j623694j631416j630648j605052
8932E0255172j584949j549762j522675j485921j427674j380616j333944j296778
8924C8672853j258671j204708j166566j114514j069666j026943r96356r51170
8916B9884259r16083q78201q47763q10952p92284p59838p21640o88995o58234
8907B2810269o28715o10966o06987n81139n50264n33624n15791n02341m75308
8898A7805134m58992m53578m34418m25943m03547l87260l83081l70443l60845
8889A4127027l46396l25001l22336l10862k95255k90298k91419k92137k76147
$$ plain form
8949 69638878 69701242 69518760 69121206 68510066 67711513 66740758 65597970 64322781 62950323
8940 62950323 61485435 59945075 58361158 56745982 55122288 53490872 51860224 50255172
8932 50255172 48670223 47120461 45597786 44111865 42684191 41303575 39969631 38672853
8924 38672853 37414182 36209474 35042908 33928394 32858728 31831785 30835429 29884259
8916 29884259 28968176 28089975 27242212 26431260 25638976 24879138 24157498 23468503 22810269
8907 22810269 22181554 21570588 20963601 20382462 19832198 19298574 18782783 18280442 17805134
8898 17805134 17346142 16892564 16458146 16032203 15628656 15241396 14858315 14487872 14127027
8889 14127027 13780631 13455630 13133294 12822432 12527177 12236879 11945460 11653323 11377176
8880A1377176k66011k56457k40844k32249k17133k21140k09520j95759j82371
8871I355692j86366j77086j63486j66873j56529j56160j45810j28859j14061r1018
8861G869444m4299L6050J55929L12613M67619M53087K89006J39426L8919j56104
8851I561690o12494q73587p24191n02685l55069k74505k27377j95966j61283j34904
8841E499629j23110j21205j17922j21356j19174j19042j06290r3205r1963q5458
8831D400904r5006q9212p8372p9099p6498q3927p5123q0417r3364p3608n9917
8820C516361o5749p4213n5239m3690n8962n7180n4537n6226n5892n5334o0091
8809B879248n0363n0109n7201n7984m1963l5388m2279m4654l6633k4511k0152
$$ plain form
8880 11377176 11111165 10854708 10613864 10381615 10164482 9943342 9733822 9538063 9355692
8871 9355692 9169326 8992240 8828754 8661881 8505352 8349192 8203382 8074523 7960462 7869444
8861 7869444 7825145 7861195 8017124 8329737 8797356 9250443 9539449 9678875 9717794 9561690
8851 9561690 8949196 8075609 7351418 6848733 6493664 6219159 5991782 5795816 5634533 5499629
8841 5499629 5376519 5255314 5137392 5016036 4896862 4777820 4671530 4578325 4486362 4400904
8831 4400904 4305898 4216686 4138314 4059215 3982717 3898790 3823667 3743250 3649886 3576278 3516361
8820 3516361 3450612 3376399 3321160 3277470 3218508 3161328 3106791 3050565 2994673 2939339 2879248
8809 2879248 2828885 2778776 2721575 2663591 2621628 2586240 2543961 2499307 2462674 2438163 2418011
8798B418011k2946l4151l3572l3369l4542m2684l9668k4821l2174l6192j9579
8787B064313l3264l3324k4063k3384j9168l7158k7139k7361k6017k5916k9885
8776A757634k8994k0873j7979k1819k8948j9200p026k4201k5577r965j4509j1679
8764A526864j4737k0705l0441j4708j5646k2272q829j7433r404k4144j7824j6380
8752A314341j3860k3378j5584L205l107r447m376o370j9360k2187j3535j1589
8740A174753j2982l428p241j5817j7907m615j7515m405q996r095r912q995j3836
8727A040009k285k034K725m628j8152k4158j3660p775k304j3386q720j1845j2274
8714I21513k424p960j1206n29j3503q305L873j666M625j326j2355j5571j0483
$$ plain form
8798 2418011 2395065 2360914 2327342 2293973 2259431 2216747 2177079 2152258 2120084 2083892 2064313
8787 2064313 2031049 1997725 1973662 1950278 1931110 1893952 1866813 1839452 1813435 1787519 1757634
8776 1757634 1728640 1707767 1689788 1667969 1639021 1619821 1612795 1588594 1563017 1553052 1538543 1526864
8764 1526864 1512127 1491422 1460981 1446273 1430627 1408355 1399526 1382093 1372689 1348545 1330721 1314341
8752 1314341 1300481 1277103 1261519 1264724 1261617 1252170 1247794 1241424 1222064 1199877 1186342 1174753
8740 1174753 1161771 1158343 1151102 1135285 1117378 1112763 1095248 1090843 1081847 1072752 1062840 1053845 1040009
8727 1040009 1037724 1035690 1038415 1033787 1015635 991477 977817 970042 967738 954352 945632 933787 921513
8714 921513 919089 911129 899923 899394 885891 877586 881459 879793 884418 883092 870737 855166 844683
8701H44683K134j1168J079L9j6101j0569q063j1183j3166L372K628m159K995o527
8687G75994j6532j3596K133Q084r183j4048n648m59J289q194q658j5491Q697J944
8673G06332j825k20K400p270m224m975n973r589j254O92j3701j4729m139r81j767
8658F38777k418m650o171j939m419k289L408l999j0673j2076q295R67k22J22p610
8643E78513N210O262M232K809m088n104N878Q078J553N48m815L242J0085L077
8629F15480j3121n751L408M479q58L984K3517K5835L4919M0657L2152J1070J4641
8616G90412O704l7859n5449m1002k7342j4168n243J5327J9017Q476J4020J7120
8604F90013O388j620l128J1973J9653k127R657J8043K4908K5271K3569J9472L0208
$$ plain form
8701 844683 846817 835649 836728 836767 820666 810097 802034 790851 777685 781057 783685 779526 782521 775994
8687 775994 759462 745866 747999 756083 746900 732852 727204 726745 728034 719840 711182 695691 704388 706332
8673 706332 704507 704287 706687 699417 695193 690218 684245 674656 673402 674094 660393 645664 641525 640544 638777
8658 638777 636359 631709 625538 623599 619180 616891 620299 616300 605627 593551 585256 586223 586001 586123 578513
8643 578513 583723 589985 594217 597026 592938 587834 593712 601790 603343 603891 599076 602318 612403 615480
8629 615480 602359 596608 600016 604495 603637 607621 631138 656973 691892 732549 764701 775771 790412
8616 790412 797116 759257 703808 662806 635464 621296 616053 631380 650397 658873 672893 690013
8604 690013 696401 694781 691653 703626 723279 721152 730809 748852 773760 799031 822600 842072 872280
8591H72280M4434N2991N6080O5740O8184O6446P3695N9035M6180J6692j7430l7456
8579A366871m9689o4479p4300p9602p3477p3329o1556m3135m2281m2151l9385
8568G23487l0950k1408j9928j4383j2398j2764j0253p388j0438p192l777j432
8556E71176j0691j7758o103j760O392j025j5048j3460o129p987J2767Q297O309
8543E24980J1495q155j2436j0041j2018m95o123n331q665r619j0661j6822j0077
8530D26032M919K078p119q397M319P019j184O774P535K555J248J3730K2265K9268
8516E11042K0116K3902K0897J0204q507k5876l7893l3055j8095j7907j2012j2082
8504D20734r081j583j1335j7334k858J534r799j0864j1523j3625k725m01k372
$$ plain form
8591 872280 916714 969705 1025785 1091525 1159709 1226155 1299850 1358885 1405065 1421757 1404327 1366871
8579 1366871 1317182 1252703 1178403 1098801 1025324 951995 890439 847304 805023 762872 723487
8568 723487 692537 671129 651201 636818 624420 611656 601403 594015 583577 576385 572608 571176
8556 571176 560485 542727 536624 534864 541256 540231 525183 511723 505594 497607 510374 518671 524980
8543 524980 536475 528320 515884 505843 493825 493330 487207 481876 473211 463592 452931 436109 426032
8530 426032 430951 433029 425910 417513 421832 428851 427667 434441 441976 444531 445779 459509 481774 511042
8516 511042 531158 555060 575957 586161 577654 551778 513885 480830 462735 444828 432816 420734
8504 420734 411653 410070 398735 381401 378543 380077 370278 359414 347891 334266 331541 331140 328768
8491C28768n50K205n741L921n231r284q291k123J535J3444N398q238q1J473P215
8476C24420n250j3718q744j0843q336J1679R679p312o037m209j3940J916m001
8463B65304M247M67Q100K607k022K150J745P01n663M738l895r345j0010J0960
8449B70084R416m169N46j357R130J6288L972R18m096m252l386j5173j2877l57
8435B64687R036o463p841p871n223k03N07J6967J6883R438M286P273P554J380
8421C10410J940l277j2945j0860j2138k5261j2109j0354J3477P261j801j58j0208
8408B33977j0203J067L134K28j778l271k965M282j247k924p156o299m910l561
8394A98374K499j586J1502J0905m720j0320l985R84j731J1045k038k534m78k251
$$ plain form
8491 328768 328218 330423 324682 328603 323372 314088 305797 303674 305209 318653 324051 315813 315732 317205 324420
8476 324420 319170 305452 296708 285865 277529 289208 298887 291575 285538 281329 267389 269305 265304
8463 265304 269551 270018 278118 280725 278703 280853 282598 283299 277636 282374 278479 269134 259124 270084
8449 270084 279500 275331 275877 274520 283650 299938 303910 304828 300732 296480 293094 277921 265044 264687
8435 264687 273723 267260 259419 251548 246325 246122 246629 263596 280479 289917 294203 301476 309030 310410
8421 310410 312350 309073 296128 285268 273130 247869 235760 225406 238883 246144 244343 244185 233977
8408 233977 223774 224841 227975 228203 226425 223154 220189 224471 223224 220300 213144 206845 201935 198374
8394 198374 200873 199287 210789 221694 216974 206654 202669 203653 201922 212967 210929 208395 207917 205666
8380B05666N100r874o986l12N296l83l087n734O576P831l855j1234m057J136L120
8365A89203K724q730o609M521L597R850k218j8636j347O096J1071Q635M015K167
8351B04339J082J2556m287j4990j5644j2316L918O469o724l847L480P821J3770
8338A95627p820j2097o357m409k901n525K039K243N368J260l621p963o478k608
8324A46758j381L990j119m195M980r97M265o05N195Q127j96r52L403O035O73J750
8308A75731R18L233j5276n457k486m550R054M414k253j5727o445O155n61J278
8294A48028o499n461o198N777j802M30N987j347J175m375q210j305R660K001l17
8279A37544N565P563k147m89o208J376O481k54r578p158P601P745m313L313L025
$$ plain form
8380 205666 210766 200892 193906 193594 198890 198507 195420 189686 196262 204093 200238 189004 184947 186083 189203
8365 189203 191927 183197 176588 181109 184706 194556 192338 173702 172355 178451 189522 198157 202172 204339
8351 204339 205421 217977 213690 198700 183056 170740 174658 181127 174403 170556 174036 181857 195627
8338 195627 187807 175710 169353 164944 162043 156518 158557 160800 166168 167428 163807 155844 149366 146758
8324 146758 145377 149367 148248 144053 149033 148036 152301 151696 156891 165018 164822 163870 167273 173308 173981 175731
8308 175731 176649 179882 164606 159149 156663 152113 161167 165581 163328 147601 141156 147311 146750 148028
8294 148028 141529 136068 129870 135647 133845 134275 140262 138915 140090 135715 127505 126200 135860 137861 137544
8279 137544 143109 150672 148525 148036 141828 143204 149685 149431 139853 132695 140296 148041 143728 147041 150066
8264A50066j187k7l514J470j770N711k669l59L512N921L979j1253p736j611j0164
8249A30369M525J1019Q162J806m006Q20K687Q51M80q059p439P290O758M077J507
8234A60847J4511Q124j1610j1286J20N097j615j4432r490O958R299j499n185J5150
8220A64989P767O834J3087J4416o96m379q206L859n441r206o713j2071p05n688
8206A57847o273J931R686q391k923M828l747k273l094l650j906J2058K250P907
8192A64250M731j40p87m031O409J0963q095j449O066N525n935q761Q91j3339m233
8177A52065M707k176q107J957N036O46P956J4310P713J588k336m321p761r660
8163A61617L088l648l024K097O774L456m451j6762J105J0781N518L214L902K614
$$ plain form
8264 150066 148879 148852 145338 146808 145038 150749 148080 147721 151233 157154 161133 149880 142144 140533 130369
8249 130369 134894 145913 154075 155881 151875 152695 155382 156233 156713 148654 141215 148505 155263 159340 160847
8234 160847 175358 183482 171872 160586 160706 165803 164188 149756 140266 147224 156523 155024 149839 164989
8220 164989 172756 179590 192677 207093 206397 202018 193812 197671 192230 183024 176311 164240 163535 157847
8206 157847 151574 153505 163191 154800 151877 156705 152958 150685 147591 143941 142035 154093 156343 164250
8192 164250 168981 168841 168054 164023 170432 181395 173300 171851 177917 183442 177507 168746 169637 156298 152065
8177 152065 156772 154596 146489 148446 153482 154128 162084 176394 184107 185695 183359 179038 171277 161617
8163 161617 164705 161057 158033 160130 166904 170360 165909 149147 150252 161033 166551 169765 173667 176281
8149A76281J123K963J0584R364K985p476q571P96N236K976L171k52m717k941l59
8134A91163Q103J4577K1835K3017Q409L394N848r158m458p955j9781j4706j0864
8121B09424o47R39l899j845M39o76p31J433o175n994L533K157m559n094j0438
8106A77867l916Q453M383L630j0993J3291J8089l262l049N763j0263j2836L543
8093A90700p128l531j000L124J0526o36l400n338l483l913N506Q668o064N68J0503
8078A95102J208Q654Q437l607J749q023M822L687n053k798P206K976q686O819
8064B12493J2946o595j8261o200n675K235N064N327N314Q360n11J906L751J0322
8050B30476N157l319J963P610k185k726J3864O563j1186l45J201n497o197m433
$$ plain form
8149 176281 177404 180367 190951 200315 203300 195824 187253 188049 193285 196261 199432 199180 194463 191522 191163
8134 191163 199266 213843 235678 258695 267104 270498 276346 267188 262730 254775 234994 220288 209424
8121 209424 208777 209716 205817 203972 204411 203735 203004 204437 198262 192268 195801 197958 193399 188305 177867
8106 177867 173951 182404 186787 190417 179424 192715 210804 207542 204493 210256 199993 187157 190700
8093 190700 183572 180041 179041 182165 192691 192055 188655 183317 179834 175921 181427 190095 184031 184599 195102
8078 195102 196310 204964 213401 209794 211543 203520 208342 212029 206976 204178 211384 214360 205674 212493
8064 212493 225439 218844 200583 194383 188708 190943 196007 201334 206648 215008 214497 216403 220154 230476
8050 230476 235633 232314 234277 241887 239702 236976 250840 257403 246217 245872 247073 241576 235379 230946
8036B30946R953K412M854J4054R141L278N97j3750q276J0484N737j0715k180O501
8022B63036K896J0900J4329l948N000P582p337n120n157l963k950J859q196r125
8008B59806J42m49L806Q563R274k854J276M998J048q306Q104O595l07P317O818
7993C05831Q168J6383J6269J7916J2975N605P610M1k447j4425j0417o315j4548
7980C42646r306j9473j2799N417J289j2360j3381m230l346k117K733L181m825
7967B73429j471l572L826P402P010k013m208q951l467J3198K3466R451k300L849
7953C15649l221N185J4390l088p484j872K527m366m530o701l102l508r987j425
7939B88467l748r693p168n18j0416m471M490l918l361m136m390q409n988J385
$$ plain form
8036 230946 240899 243311 248165 262219 271360 274638 275235 261485 253209 263693 269430 258715 256535 263036
8022 263036 265932 276832 291161 287213 292213 299795 292458 287338 282181 278218 275268 277127 268931 259806
8008 259806 259948 259499 263305 271868 281142 278288 279564 284562 285610 277304 285408 292003 291696 299013 305831
7993 305831 313999 330382 346651 364567 377542 383147 390757 390798 388351 373926 363509 357194 342646
7980 342646 333340 313867 301068 306485 307774 295414 282033 277803 274457 272340 275073 278254 273429
7967 273429 271958 268386 272212 279614 286624 284611 280403 271452 267985 281183 304649 314100 311800 315649
7953 315649 312428 317613 332003 328915 321431 319559 322086 317720 313190 306489 303387 299879 289892 288467
7939 288467 284719 275026 267858 267340 256924 252453 256943 253025 249664 245528 241138 232729 226741 228126
7925B28126K713k455L646Q946N549q512K125K544p920o481L190J735j3030P673
7911B27849P885j049q147J517j2616j5004l606n887j296p934o411J24m923j0849
7897A59653l825L579L431l558l624J057L672l407P359J0760K726k08j1622j1373
7883A54620o129K614j4382m434p07P106O34J62J256l053o683J3897O751M576q891
7868A47337j5753l974R507o25j432L538p149r703K162k871n443M365k724o947
7854A10288N279m006r96M70q069j5233N011j309R128K759N864K855j6944r191
7840H5906Q014M560m589j2534n751N89k900N918O955n488r360J54P375M905O778
7825I0532p44J538K470n135l351p404q752J1684R535J947n045K784n298o74n106
$$ plain form
7925 228126 230839 228384 232030 240976 246525 238013 240138 242682 234762 228281 231471 233206 220176 227849
7911 227849 235734 234685 226538 228055 215439 200435 196829 190942 189646 181712 175301 175425 170502 159653
7897 159653 155828 159407 162838 159280 155656 156713 160385 156978 164337 175097 177823 177615 165993 154620
7883 154620 148491 151105 136723 132289 131582 138688 139322 139484 140740 137687 131004 144901 151652 156228 147337
7868 147337 131584 127610 137117 136492 135060 138598 131449 121746 123908 121037 115594 119959 117235 110288
7854 110288 115567 111561 110565 111035 102966 87733 92744 91435 100563 103322 109186 112041 95097 85906
7840 85906 93920 98480 93891 81357 75606 76195 73295 79213 86168 80680 71320 71474 78849 83754 90532
7825 90532 89788 91326 93796 88661 85310 77906 69154 80838 90373 92320 87275 90059 84761 84087 78981
7810G8981l741l012R097j1106n162L24P538P412r265j1888j794L288P977J9403
7796H8052j1149j0394N403K27j9203l520o866O933K478o077M391j1035q476M504
7782C5268K148k985J935j760K530j0180n865K865N692R158J265j859R803o305
7768D1710j1757k385K993K135m986L83J841N340j522J338L455J558j722K919l206
7753C8094o45j158l544P365Q249j1146j4463L23J4410J747j4170j0724j25r46
7739A3267J175R194J5043j84k03q36J044j789n816K639O705m684O0j355k259o50
7723C1351p579J308O023L009k339l107O45Q261M151M507n498J589O852M219m28
7708E2964K300o00j154J341m153k663j3227r180qO367P700j681n080P264J3103
$$ plain form
7810 78981 75240 72228 81325 70219 65057 65381 72919 80331 71066 59178 57384 60672 68649 88052
7796 88052 76903 66509 71912 72139 52936 49416 42550 49483 51961 45884 50275 39240 30764 35268
7782 35268 37416 34431 36366 34606 37136 26956 21091 23956 29648 38806 40071 38212 48015 41710
7768 41710 29953 27568 30561 32696 27710 28093 29934 35274 33752 35090 38545 40103 38381 41300 38094
7753 38094 37449 36291 32747 40112 48361 37215 22752 23075 37485 39232 25062 14338 14213 13267
7739 13267 14442 23636 38679 38495 38292 37456 38500 36711 30895 33534 40239 35555 35615 34260 32001 31351
7723 31351 23772 25080 31103 34112 31773 28666 29311 37572 41723 46230 40732 42321 49173 53392 52964
7708 52964 55264 54664 53510 54851 50698 48035 34808 25628 25620 31987 39687 38006 32926 40190 53293
7693E3293n247j2622l105K414j2913O99P323q723j1326K687o368P734o628P807
7679A5025Q355J445J364m657J84O120R346j3164k411m183P299P375l329j490J6300
7664D3579J2844P553J1203Q629J1042L120j0459j1699k1327j8763m004N077L640
7651D0435l967l346N195r82k67P468M20m198p951L215k422M4j105k814k016j180
7635B6529M623p547o323k944N685J60j870N30o44n522L566J787o277L47K965N757
7619B0822J330Q519M644J577J991M162K181k553m165p899m881M198M31l387l917
7604B3053r09n41r081j826o360L889r23p457L922M587J30r195J5J0684K658j0381
7588B265P94J6502J0524q439n002K154j186q542N888j250p88J419j4775o611J2397
$$ plain form
7693 53293 48046 35424 32319 34733 21820 22519 29842 21119 9793 12480 6112 13846 7218 15025
7679 15025 23380 24825 26189 21532 21716 27836 37182 24018 21607 17424 24723 32098 28769 27279 43579
7664 43579 56423 63976 75179 83808 94850 97970 87511 75812 54485 35722 31718 36795 40435
7651 40435 36468 33122 38317 37335 37068 44536 44956 40758 32807 36022 33600 33644 32539 29725 27709 26529
7635 26529 31152 23605 17282 14338 20023 20183 18313 18843 18199 12677 16243 18030 11753 12100 15065 20822
7619 20822 22152 30671 35315 36892 38883 43045 45226 42673 38508 30609 25728 29926 30357 26970 23053
7604 23053 22144 21603 12522 10696 4336 8225 7302 -155 3767 8354 8484 -711 -696 9988 12646 2265
7588 2265 3059 19561 30085 21646 16644 18798 17612 9070 14958 13708 12920 14339 -436 -7047 5350
7573E350Q212J425l645O304k109l527J31j701J197n002J602O220k322j626J679
7558A2188p347j1144j1294l838N137P896K495k763O642O371l859M960l266Q798
7544A0976L56j1519j7385n446j669J0633R077p04k669R220N183l562j857l060
7530b426K410K681p779k310M938j212O98K272m03j1561j1106Q63P841J298m68
7515a4264J424O756P075j0355L761k076R29p043l655Q843p433j0624L833M173
7501a8656K476l600r012J788J4523Q618n44K24Q235P710n660M12N563M045r459
7486F663r274l046N669k016q537l900l75P364M838o399q578m801j0341J70J1197
7471b1366J1007N898L802j1177j1009J878K423N457M168n297J611j1697l132o874
$$ plain form
7573 5350 13562 14987 11342 17646 15537 12010 12141 10440 11637 6635 8237 14457 12135 10509 12188
7558 12188 4841 -6303 -17597 -21435 -16298 -8402 -5907 -8670 -2028 4343 484 5444 2178 10976
7544 10976 11332 -187 -17572 -23018 -24687 -14054 -4977 -5681 -8350 870 6053 2491 634 -2426
7530 -2426 -16 2665 -5114 -7424 -2486 -3698 -3000 -728 -1131 -12692 -23798 -22935 -15094 -13796 -14264
7515 -14264 -12840 -6084 991 -9364 -5603 -7679 -6750 -13793 -17448 -8605 -16038 -26662 -22829 -18656
7501 -18656 -16180 -19780 -28792 -27004 -12481 -3863 -4407 -4183 4052 11762 6102 6514 12077 16122 6663
7486 6663 -2611 -5657 12 -2004 -10541 -14441 -14816 -7452 -2614 -9013 -17591 -22392 -32733 -32563 -21366
7471 -21366 -10359 -4461 -659 -11836 -22845 -20967 -18544 -13087 -8919 -14216 -12605 -24302 -27434 -34308
7457c4308J982J0455J242n683P228r56L063P345M689o964M963K4q638j905M602
7442a2861J69j4079r61Q304R986J5138P133n546j5597k120J5129Q386j4268l872
7428e059P400J0701p47m148o720m578q635N107P003M976M403k447o073n529m492
7413h838k692P276L851N439m312m447q39l812j3433k21J2681N424J385M228o295
7398d605K237L39n838j3224O45m18r817Q673R961N835O271N443m736m382l098
7383f714l378P166l972o036R48m92J647r691k880M933O523l28k144j0604j047
7368b6069J0945J331l599K867l92l68L520J709K931p47J547l65o231L979J1126
7353B184j231m171L916K578L852j1273o487l064m494n713J087N940k19J298M077
$$ plain form
7457 -34308 -32326 -21871 -20629 -26312 -19084 -20040 -16977 -9632 -4943 -11907 -6944 -6920 -15558 -17463 -12861
7442 -12861 -12692 -26771 -27732 -19428 -9442 5696 12829 7283 -8314 -10434 4695 13081 -1187 -5059
7428 -5059 2341 13042 12295 8147 1427 -3151 -11786 -6679 324 5300 9703 7256 1183 -4346 -8838
7413 -8838 -11530 -4254 -403 5036 724 -3723 -4562 -8374 -21807 -22028 -9347 -3923 -2538 1690 -4605
7398 -4605 -2368 -2029 -7867 -21091 -20446 -20864 -30681 -22008 -12047 -6212 59 5502 766 -3616 -6714
7383 -6714 -10092 -2926 -6898 -12934 -11986 -12478 -10831 -20522 -23402 -18469 -11946 -12274 -14418 -25022 -26069
7368 -26069 -15124 -13793 -17392 -14525 -14917 -15285 -11765 -10056 -7125 -7872 -6325 -6690 -12921 -8942 2184
7353 2184 953 -3218 698 3276 7128 -4145 -10632 -13696 -18190 -23903 -22816 -16876 -17095 -15797 -11720
7338a1720k932M170O188J586l497J204j605M521J891p847j32K45j1022n100M937
7323a9113J626N08p141p027j823K435n897R038N504O051J2027j168j720M324J235
7308a141k206n59p844J111J3517j206m222j0625N454P800n514j1984m851M527
7294a7743r50O567R09L687M274Q75J153M798q72L340p844K221M373n661o172j5406
7278b2451k95j580Q109j837l209k357n137r7K463n905N542M468J3433N910l089
7263f032l397M493o5l86J0415K622j0814m438o532R971L150j3495j0091l422L280
7248b4741J1724J1874p069q939K938J0964J3347k84j372O141n431k569j443O18
7234E758m656n241P401P962k906n794m743m096P186L208p551n365n770L46j721
$$ plain form
7338 -11720 -14652 -10482 -4294 -2708 -6205 -5001 -6606 -2085 -194 -8041 -8173 -7928 -18950 -24050 -19113
7323 -19113 -17487 -16979 -24120 -31147 -32970 -30535 -36432 -27394 -21890 -15839 -3812 -4980 -6700 -2376 -1141
7308 -1141 -3347 -3906 -11750 -10639 2878 1672 -2550 -13175 -7721 79 -5435 -17419 -22270 -17743
7294 -17743 -18693 -12126 -11217 -7530 -3256 -2381 -1228 3570 2698 6038 -1806 415 4788 -873 -7045 -22451
7278 -22451 -22746 -24326 -16217 -18054 -21263 -23620 -28757 -28854 -26391 -32296 -26754 -22286 -8853 -2943 -6032
7263 -6032 -9429 -4936 -5001 -5387 5028 7650 -3164 -7602 -14134 -4163 -1013 -14508 -24599 -28021 -24741
7248 -24741 -13017 -1143 -8212 -17151 -14213 -3249 10098 9814 8442 14583 9152 6583 5140 5758
7234 5758 1102 -4139 3262 11224 8318 2524 -2219 -6315 871 4079 -3472 -8837 -14607 -14261 -15982
7219a5982J0470N862k974r988N605N509p273k603o127j4373r96M490N112O421
7205a6847Q010M328n058l14m59k162L482j946k385L161l576Q52P916R530L308
7190G840o332q126p713k867J502J214R422J1588L675p704j5347m837R806O59n085
7175a2305r544O407P190p522M031O661m500m851m259R076Q637J380M045q429j3041
7160a7024K058j619P53J3492M06n035J812J874K724q919o999O829J1087p936j5479
7145b1976R319J7913k788O519N82r33n032M682r735j5916l621N011J0784N094
7131i7J5764j3023o086O016K995M976l053k867r912l588l107j1225j685J496j618
7116b5014O889N439p897p41J0225J1081j3073j3862M472K189k770n145n601N019
$$ plain form
7219 -15982 -5512 350 -2624 -12612 -7007 -1498 -8771 -11374 -17501 -31874 -32870 -28380 -23268 -16847
7205 -16847 -8837 -4509 -9567 -9881 -10340 -12502 -9020 -10966 -13351 -10190 -13766 -12914 -4998 4532 7840
7190 7840 1508 -6618 -14331 -17198 -15696 -14482 -5060 6528 10203 2499 -12848 -17685 -7879 -7220 -12305
7175 -12305 -21849 -15442 -8252 -15774 -11743 -5082 -9582 -14433 -18692 -9616 -979 401 4446 -3983 -17024
7160 -17024 -14966 -16585 -15832 -2340 -1934 -6969 -5157 -3283 -559 -9478 -16477 -9648 1439 -6497 -21976
7145 -21976 -12657 5256 2468 8987 9569 8636 3604 8286 -1449 -17365 -20986 -15975 -5191 -97
7131 -97 15667 2644 -3442 2574 5569 10545 7492 4625 -5287 -8875 -11982 -23207 -24892 -23396 -25014
7116 -25014 -18125 -12686 -20583 -21324 -11099 -18 -13091 -26953 -22481 -20292 -23062 -28207 -33808 -28789
7102b8789J0225R333J0188Q981j4265n730o134n03J098R521N045o429K579j255
7088f135M204P665o412q392l327J2805J03j4691J37j2314K380R095K907K939J113
7073g923p288j918K392L361l716l831P441J247L187O380q564R02M77j6802l701
7058b8356l441M112L725k750j158J016j77j062J2052m60m790N671K174j45r752
7043b3341o417J623l842m339l042K784J025K10L890J1234M269Q532Q784k623o914
7028h167p611K075N579m247J245K332o752K585r7n645O037O01j0842L986O762
7013a2159K407m21J1327P789n224j5095n562R95J911l9m837N55k910n10J3507
6998h266R325O347M219j767j4674p064N511n996j0357k068p344N028J3581O686
$$ plain form
7102 -28789 -18564 -9231 957 9938 -4327 -10057 -16191 -16694 -15596 -6075 -1030 -7459 -4880 -6135
7088 -6135 -1931 5734 -678 -9070 -12397 408 511 -14180 -14043 -26357 -23977 -14882 -11975 -9036 -7923
7073 -7923 -15211 -17129 -14737 -11376 -15092 -18923 -11482 -10235 -7048 -668 -9232 -8330 -7853 -24655 -28356
7058 -28356 -31797 -27685 -23960 -26710 -27868 -26852 -27029 -28091 -16039 -16499 -21289 -15618 -13444 -13589 -23341
7043 -23341 -29758 -28135 -31977 -36316 -39358 -36574 -35549 -35339 -31449 -20215 -15946 -7414 1370 -1253 -8167
7028 -8167 -15778 -13703 -8124 -12371 -11126 -8794 -15546 -12961 -13058 -18703 -12666 -12065 -22907 -18921 -12159
7013 -12159 -9752 -10173 1154 8943 3719 -11376 -16938 -15943 -14032 -14071 -18908 -18353 -21263 -21773 -8266
6998 -8266 1059 7406 11625 9858 -4816 -11880 -6369 -12365 -22722 -24790 -32134 -27106 -13525 -6839
6984f839o855j1083M009j056m795j240R409J2524J4231R16q087j0046l533M2l420
6969a5823J080m090P57j190K488Q293p35k408J653J825m816p074r876r944L577
6954c6283J3560L220m624M637J3901J0593k14R62N73q669P334l331j0207l802
6940a2350j850n287R192K63n99N829k937l894l150N067p89j020L434j851q676
6925a8618K106p72L400l860o723P738J4133k413l704K294O579m69k198n466k351
6910a0324M300j935m999N333j733J183J619Qj548P206Q263j2883n024n52j671
6895a2757q93O832L822m247J07j2339o573O817Q526N244M716l770L42L907K312
6880B046n816O015j1603l260Q969N948j0196j5470J0972P454r627j705Q014R344
$$ plain form
6984 -6839 -13694 -24777 -20768 -21824 -26619 -27859 -18450 -5926 8305 9221 1134 -8912 -12445 -12403 -15823
6969 -15823 -14743 -18833 -18076 -19266 -16778 -8485 -9220 -11628 -9975 -8150 -12966 -20040 -29916 -39860 -36283
6954 -36283 -22723 -19503 -24127 -19490 -5589 5004 4790 5752 6325 -2344 4990 1659 -8548 -12350
6940 -12350 -14200 -19487 -10295 -10032 -10631 -4802 -7739 -11633 -14783 -9716 -10505 -11525 -8091 -9942 -18618
6925 -18618 -16512 -17284 -13884 -17744 -24467 -16729 -2596 -5009 -8713 -6419 160 -309 -2507 -7973 -10324
6910 -10324 -6024 -7959 -12958 -7625 -9358 -8175 -6556 -6548 -8096 -890 7373 -5510 -10534 -11086 -12757
6895 -12757 -13650 -6818 -2996 -7243 -7136 -19475 -26048 -19231 -10705 -5461 -745 -4515 -4173 -266 2046
6880 2046 -3770 2245 -9358 -12618 -3649 2299 -7897 -23367 -12395 -4941 -14568 -16273 -8259 1085
6866A085K456K408J250j3313k688K063k918M46j782r849J647L61J2196L68m854
6851a1124j0848o722M730K498L571K928o701o546m24M474J592N445m697q566p728
6836c8118M827N567P011R493L09p49R907K960q767j1284J351o61N050K617K597
6821g890q837o526J012J829o162J062L713o672K618K081K052o524n523j896k43
6806c5906J968M53R840N151j588M142Q590n351j4022J3487J5774O706q054j202
$$ plain form
6866 1085 3541 5949 7199 -6114 -8802 -6739 -9657 -9211 -10993 -20842 -19195 -18834 -6638 -6270 -11124
6851 -11124 -21972 -28694 -23964 -21466 -17895 -14967 -21668 -28214 -28638 -24164 -22572 -17127 -21824 -30390 -38118
6836 -38118 -33291 -27724 -20713 -11220 -10911 -11660 -1753 1207 -7560 -18844 -17493 -18154 -13104 -10487 -7890
6821 -7890 -16727 -23253 -22241 -20412 -26574 -25512 -21799 -28471 -25853 -23772 -21720 -28244 -33767 -35663 -35906
6806 -35906 -33938 -33485 -23645 -18494 -20082 -15940 -7350 -12701 -26723 -13236 2538 9244 1190 -12
$$ [...]
##END NTUPLES=NMR SPECTRUM
##END=
