##TITLE=Analysis number 318196
Compound Code cc 33906
Book Reference 464/26/1
Project Code adrs
Chemist Name chrisr
##JCAMPDX= 6.0         $$ Bruker NMR JCAMP-DX V2.0
##DATA TYPE= NMR SPECTRUM
##DATA CLASS= NTUPLES
##ORIGIN= Bruker BioSpin GmbH
##OWNER= nmr
$$ XWIN-NMR		Version 3.5
$$ Mon Mar 20 11:50:24 2006 GMT Standard Time (UT+0h)  MAYBRIDGE\nmr@NMR_250MHZ
##.OBSERVE FREQUENCY= 250.131544655141
##.OBSERVE NUCLEUS= ^1H
##.ACQUISITION MODE= SIMULTANEOUS (DQD)
##.ACQUISITION SCHEME= undefined
##.AVERAGES= 16
##.DIGITISER RES= 18
##SPECTROMETER/DATA SYSTEM= dpx250
##.PULSE SEQUENCE= zg30
##.SOLVENT NAME= CDCl3
##.SHIFT REFERENCE= (INTERNAL, CDCl3, 0, 16.522)
##AUDIT TRAIL= $$ (NUMBER, WHEN, WHO, WHERE, WHAT)
$$ ##TITLE= Audit trail, XWIN-NMR		Version 3.5
$$ ##JCAMPDX= 5.01
$$ ##ORIGIN= Bruker BioSpin GmbH
$$ ##OWNER= nmr
$$ C:\u/data/dgb/nmr/ADRS/1000/pdata/1/auditp.txt
$$ ##AUDIT TRAIL=  $$ (NUMBER, WHEN, WHO, WHERE, WHAT)
(   1,<2006-03-20 11:48:29.46 +000>,<MAYBRIDGE\nmr>,<NMR_250MHZ>,
      <created by zg, POWCHK disabled, PULCHK disabled
       configuration hash MD5:
       84 BC 41 DB A1 6E 1D 46 DA 25 12 A5 C1 ED C5 3A
       data hash MD5: 64K
       AA 63 C8 71 EC C9 AF 04 3D 6E 3F 52 33 2E 9C B2>)
(   2,<2006-03-20 11:49:22.38 +000>,<MAYBRIDGE\nmr>,<NMR_250MHZ>,
      <Start of raw data processing
       ef LB = 0.3 FT_mod = 6 PKNL = 1 SI = 32K 
       data hash MD5: 32K
       EB 5D F7 07 7B 4A EF B8 83 C4 2E B1 EF 33 1D E2>)
(   3,<2006-03-20 11:49:30.24 +000>,<MAYBRIDGE\nmr>,<NMR_250MHZ>,
      <apk 
       data hash MD5: 32K
       02 B9 BD F6 D9 21 B7 62 67 10 93 54 99 CF 1F 43>)
(   4,<2006-03-20 11:49:33.59 +000>,<MAYBRIDGE\nmr>,<NMR_250MHZ>,
      <abs ABSG = 5 
       data hash MD5: 32K
       24 C3 79 EC D7 98 57 0C 24 90 3C 94 74 D7 B5 84>)
$$ ##END=
$$ 
$$ hash MD5
$$ 79 38 6D 7A C3 14 A8 7D 5F 43 33 53 F6 9F 0E 82
##$RELAX= 
##$RELAX= 
##$RELAX= 
##$RELAX= 
##$RELAX= 
##$RELAX= 
##$RELAX= 
$$ Bruker specific parameters
$$ --------------------------
##$DU= <C:\u>
##$EXPNO= 1000
##$NAME= <ADRS>
##$PROCNO= 1
##$TYPE= <nmr>
##$USER= <dgb>
##$AMP= (0..31)
100 100 100 100 100 100 100 100 100 100 100 100 100 100 100 100 100 100 
100 100 100 100 100 100 100 100 100 100 100 100 100 100 
##$AQSEQ= 0
##$AQ_mod= 3
##$AUNM= <au_zg>
##$AUTOPOS= <32 >
##$BF1= 250.13
##$BF2= 250.13
##$BF3= 250.13
##$BF4= 250.13
##$BF5= 500.13
##$BF6= 500.13
##$BF7= 500.13
##$BF8= 500.13
##$BYTORDA= 1
##$CFDGTYP= 0
##$CFRGTYP= 5
##$CHEMSTR= <none>
##$CNST= (0..31)
1 1 145 1 1 1 1 1 1 1 1 1 1 1 1 1 1 1 1 1 1 1 1 1 1 1 1 1 1 1 1 1 
##$CPDPRG= <>
##$CPDPRG1= <>
##$CPDPRG2= <>
##$CPDPRG3= <>
##$CPDPRG4= <mlev>
##$CPDPRG5= <mlev>
##$CPDPRG6= <mlev>
##$CPDPRG7= <mlev>
##$CPDPRG8= <mlev>
##$CPDPRGB= <>
##$CPDPRGT= <>
##$D= (0..31)
0 1 0 0 0 0 0 0 0 0.06 0 0 0 0 0 0 0.0002 0 0 0 0 0 0 0 0 0 0 0 0 0 0 
0 
##$DATE= 1142855302
##$DBL= (0..7)
120 120 120 120 120 120 120 120 
##$DBP= (0..7)
150 150 150 150 150 150 150 150 
##$DBP07= 0
##$DBPNAM0= <>
##$DBPNAM1= <>
$$ [...]
##$SUBNAM7= <"">
##$SUBNAM8= <"">
##$SUBNAM9= <"">
##$SW= 20.6930455092707
##$SWIBOX= (0..15)
0 0 3 0 0 0 0 0 0 0 0 0 0 0 0 0 
##$SW_h= 5175.983436853
##$TD= 65536
##$TD0= 1
##$TE= 294.16
##$TE2= 300
##$TE3= 300
##$TEG= 300
##$TL= (0..7)
0 120 120 120 120 120 120 120 
##$TP= (0..7)
150 150 150 150 150 150 150 150 
##$TP07= 0
##$TPNAME0= <>
##$TPNAME1= <>
##$TPNAME2= <>
##$TPNAME3= <>
##$TPNAME4= <>
##$TPNAME5= <>
##$TPNAME6= <>
##$TPNAME7= <>
##$TPOAL= (0..7)
0.5 0.5 0.5 0.5 0.5 0.5 0.5 0.5 
##$TPOFFS= (0..7)
0 0 0 0 0 0 0 0 
##$TUNHIN= 0
##$TUNHOUT= 0
##$TUNXOUT= 0
##$USERA1= <user>
##$USERA2= <user>
##$USERA3= <user>
##$USERA4= <user>
##$USERA5= <user>
##$V9= 5
##$VALIST= <valist>
##$VCLIST= <CCCCCCCCCCCCCCC>
##$VD= 0
##$VDLIST= <DDDDDDDDDDDDDDD>
##$VPLIST= <PPPPPPPPPPPPPPP>
##$VTLIST= <TTTTTTTTTTTTTTT>
##$WBST= 1024
##$WBSW= 4
##$XGAIN= (0..3)
0 0 0 0 
##$XL= 0
##$YL= 0
##$YMAX_a= 467998
##$YMIN_a= -510120
##$ZGOPTNS= <>
##$ZL1= 120
##$ZL2= 120
##$ZL3= 120
##$ZL4= 120
##$ABSF1= 16.522
##$ABSF2= -4.171173
##$ABSG= 5
##$ABSL= 3
##$ALPHA= 0
##$AQORDER= 0
##$ASSFAC= 0
##$ASSFACI= 0
##$ASSFACX= 0
##$ASSWID= 0
##$AUNMP= <proc_1d>
##$AZFE= 0.1
##$AZFW= 0.1
##$BCFW= 0
##$BC_mod= 0
##$BYTORDP= 0
##$COROFFS= 0
##$CY= 12.5
##$DATMOD= 1
##$DC= 0
##$DFILT= <>
##$DTYPP= 0
##$F1P= 14.0000005364418
##$F2P= -0.99999901652339
##$FCOR= 0.5
##$FTSIZE= 32768
##$FT_mod= 6
##$GAMMA= 0
##$GB= 0
##$INTBC= 1
##$INTSCL= 1
##$ISEN= 128
##$LB= 0.3
##$LEV0= 0
##$LPBIN= 0
##$MAXI= 10000
##$MC2= 0
##$MEAN= 0
##$ME_mod= 0
##$MI= 0
##$NCOEF= 0
##$NC_proc= -4
##$NLEV= 6
##$NOISF1= 0
##$NOISF2= 0
##$NSP= 0
##$NTH_PI= 0
##$NZP= 0
##$OFFSET= 16.522
##$PC= 1
##$PHC0= 173.2788
##$PHC1= 5.922647
##$PH_mod= 1
##$PKNL= yes
##$PPARMOD= 0
##$PSCAL= 4
##$PSIGN= 0
##$REVERSE= no
##$SF= 250.13
##$SI= 32768
##$SIGF1= 0
##$SIGF2= 0
##$SINO= 400
##$SIOLD= 32768
##$SREGLST= <1H.CDCl3>
##$SSB= 0
##$STSI= 32768
##$STSR= 0
##$SW_p= 5175.98343685301
##$SYMM= 0
##$S_DEV= 0
##$TDeff= 65536
##$TDoff= 0
##$TI= <Analysis number 999999
Compound Code 99
Book Reference 9
Project Code 9>
##$TILT= no
##$TM1= 0
##$TM2= 0
##$TOPLEV= 0
##$USERP1= <user>
##$USERP2= <user>
##$USERP3= <user>
##$USERP4= <user>
##$USERP5= <user>
##$WDW= 1
##$XDIM= 32768
##$YMAX_p= 274988081
##$YMIN_p= -114008
$$ End of Bruker specific parameters
$$ ---------------------------------
##NTUPLES= NMR SPECTRUM
##VAR_NAME=  FREQUENCY,     SPECTRUM/REAL,   SPECTRUM/IMAG
##SYMBOL=    X,             R,               I
##VAR_TYPE=  INDEPENDENT,   DEPENDENT,       DEPENDENT
##VAR_FORM=  AFFN,          ASDF,            ASDF
##VAR_DIM=   32768,         32768,           32768
##UNITS=     HZ,            ARBITRARY UNITS, ARBITRARY UNITS
##FACTOR=    0.157963299565203, 1,           1
##FIRST=     4132.6476996994, 0,             0
##LAST=      -1043.33573715361, 0,           0
##MIN=       -1043.33573715361, -114008,     0
##MAX=       4132.6476996994, 274988081,     0
$$ Real data points
##PAGE= N=1
##DATA TABLE= (X++(R..R)), XYDATA
$$ [...]
23629c8564N271j9504J763n866J705K0443J8399n020p8k4091j1974K9843q754
23616c6427n471K5131q675j3007N944k406R342L1844J562l4571l0357J1680K9337
23603a6074j1707N256r709k1311J2076M3972P503q906k330N515J5747K8345L5880
23590H4257M995J1377J9387k5090m2270k8820j9904k5796J455J8244P008l3073
23578b8230K188J6584j0287K7051P558r422L860o961N83L5052O817J3255K5790
23565H3838j4704l479k5624l3614M92O33j91k1790J2382J3253p082J169j0376
23552e093r309J0093L922J8574J6738j0932J083j093k4315J0278J1637k4907P017
23539C693p38k01k3998p002J9271J2565j182j5593L907K0409K3024j7448n152
$$ plain form
23629 -38564 -33293 -52797 -51034 -56900 -55195 -34752 -16353 -21373 -21451 -45542 -57516 -27673 -36427
23616 -36427 -41898 -16767 -25442 -38449 -32505 -34911 -25569 6275 7837 -26734 -57091 -45411 -16074
23603 -16074 -27781 -22525 -32234 -53545 -41469 2503 10006 1100 -1230 4285 20032 48377 84257
23590 84257 89252 100629 120016 94926 52656 23836 3932 -21864 -20409 -2165 4843 -28230
23578 -28230 -26042 -9458 -19745 7306 14864 5442 9302 2341 2924 37976 44793 58048 83838
23565 83838 69134 65655 40031 6417 6909 7542 7351 -14439 -2057 11196 4114 5283 -5093
23552 -5093 -14402 -4309 -387 18187 34925 23993 25076 23983 -332 9946 21583 -3324 3693
23539 3693 2955 2754 -21244 -28246 -8975 3590 2408 -13185 -9278 11131 34155 16707 11555
23526A1555J9286J5267J8110l5222k3944K235J1181r796o284P192r590j413L8420
23513C6997j5857l4126n638k0955K8986J0491j2595P032j0473k091k183K4811
23501D399J3483r188J4218p550r044J0524K0908j5035j444O3r783q877k9039l7655
23487f4020j0947M3850M403R031J6602Q728l318J4970P483R082P718j7068j0390
23474A6124L781k0497j6305j29L613j327K3717k2115j5549J3630j7578j4044R688
23461c6991K3594L2636K6300m096j9359q391j3724J6782j1017l6013m475L0011
23449d743O131j5982K436J818n032N135K0620N053J4615K2639K8763J0935l7481
23436E4907l1337o810n232K4582P207k2514j8243j1983k316k814q168R366Q454
$$ plain form
23526 11555 30841 46108 64218 28996 5052 7287 18468 8672 2388 9580 -10 -1423 36997
23513 36997 21140 -12986 -18624 -39579 -10593 -102 -12697 -5665 -16138 -18229 -20412 4399
23501 4399 17882 8694 22912 15362 6318 16842 37750 22715 21271 21334 11551 2674 -26365 -64020
23487 -64020 -74967 -31117 -26714 -17683 -1081 7647 4329 19299 26782 35864 43582 26514 16124
23474 16124 19905 -592 -16897 -17026 -13413 -14740 8977 -13138 -28687 -15057 -32635 -46679 -36991
23461 -36991 -13397 19239 45539 41443 22084 13693 -31 16751 5734 -30279 -34754 -4743
23449 -4743 1388 -14594 -12158 -10340 -15372 -10237 10383 15436 30051 52690 81453 92388 54907
23436 54907 23570 16760 11528 36110 43317 20803 2560 -9423 -11739 -14553 -22721 -13355 -4901
23423d901K7528j6049l4717K2636r869j3760J7858j6519p566L179R853O267l53
23410a6413J9399K890J8667J1281l7211j8933L5159Q067j9569l4098K3247J7099
23398I585O980O249M56k1099N989J5650J1831j3154l736J0134k3070k0572j4128
23385b8885j4749J1016k2264j2316L1288J8121J6382R049J5925o815k4234k8442
23373c5924J0340J2032K261k3839R291J3972j1255r516L7264R573J8010l1057
23361A152p868J2399o422m337L09j3393M58J2594L3114o792j0603j8634J6399
23348H376K9882j6454k4081O348k9577j4833J261O656J3292j3043l2919k955M0903
23335b7144J197j0459l035J1762K3864P722mR554l0332k8230J5354K1301M472
$$ plain form
23423 -4901 22627 6578 -28139 -5503 -15372 -29132 -11274 -27793 -35359 -32180 -22327 -16060 -16413
23410 -16413 2986 5876 24543 35824 -1387 -20320 14839 22906 3337 -30761 -7514 9585
23398 9585 16565 22814 23270 2171 8160 23810 35641 22487 18751 28885 5815 -14757 -28885
23385 -28885 -43634 -32618 -54882 -67198 -35910 -17789 -1407 7642 23567 16752 -7482 -35924
23373 -35924 -25584 -13552 -11291 -35130 -25839 -11867 -23122 -32638 4626 14199 32209 1152
23361 1152 -6716 5683 -739 -5076 -4767 -18160 -17702 -5108 28006 21214 10611 -8023 8376
23348 8376 38258 21804 -2277 4071 -25506 -40339 -39078 -32422 -19130 -32173 -65092 -68047 -27144
23335 -27144 -25947 -36406 -39441 -27679 -3815 3907 3903 13457 -16875 -45105 -29751 -8450 -3978
23322c978O669J0144l38j7764p182j706l051N399L4268L4692N185l4609j2440
23309A5289k7755J3254L0297p300m468l3687k8962j528N650L2907J1528K9413
23297C4638j212l0583J0027l0350l4968J5453j600p035L0762K5681k6393l1977
23285d7557j2467L844o124O200L1849K1097k5345j8588l318M2216M8848j0746
23273B9909k2219j9926n342J5639K1943j0917Q312J6966p789j1791k7798q016
23261b1029j1123mR295J651k292m96l956J3487r263j83J6665K713n657R053K5298
23246B4159J5061k9262j4384J9329J598k2347j2153K1862J9323k2083m0862J0951
23234b8808J0062q329j1168J4482K1509J564j9966J9408K4106o44k0527M940k6686
$$ plain form
23322 -3978 2691 12835 12497 -5267 -12449 -14155 -17206 -11807 22461 57153 62338 27729 15289
23309 15289 -12466 788 31085 23785 19317 -14370 -43332 -44860 -39210 -6303 5225 34638
23297 34638 33426 2843 12870 -17480 -52448 -36995 -38595 -45630 -14868 10813 -15580 -47557
23285 -47557 -60024 -56180 -62304 -56104 -24255 -3158 -28503 -47091 -50409 -8193 40655 29909
23273 29909 7690 -12236 -17578 -1939 20004 9087 17399 34365 26576 14785 -13013 -21029
23261 -21029 -32152 -32156 -22861 -21210 -23502 -23998 -27954 -14467 -23730 -23913 -7248 -4535 -10192 -1139 24159
23246 24159 39220 9958 -4426 14903 16501 -5846 -17999 3863 23186 1103 -39759 -28808
23234 -28808 -18746 -27075 -38243 -23761 -2252 -688 -20654 -1246 22860 22216 1689 6629 -20057
23221b0057j0758Q702L8222K9510P4j2491j4650l128k4957o250j0268k760L350
23208b5461p843P836N530K1814P938J5693k611J225J2508l293k5071j1859j6672
23195b0266r006J0927l890L2342O560k1786o297R423o591L1199J8034N803p541
23182C8911j2353p081j8070R45M303k198k1723k5181o686K2524M9887k337m022
23169A6919K3492M984k7880Q285k1410n2010p408J8593J3739j0877Q035N758j6323
23156c6103K485n190N731J7765M5219Q180j4666j9153O772j7876l2168k413O104
23143c5313M6113L5720k6057j8369L0056J8932n704q315j8302l848k2105M49j063
23130g806J6075j1380O840R490j2156j0059Q052j7481P140M146J3594L5935K2390
$$ plain form
23221 -20057 -30815 -22113 16109 45619 45693 33202 18552 15424 -9533 -15783 -26051 -28811 -25461
23208 -25461 -33304 -25468 -19938 1876 9814 25507 22896 24121 36629 33336 8265 -3594 -20266
23195 -20266 -29272 -18345 -22235 10107 16667 -5119 -11416 -1993 -8584 22615 40649 46452 38911
23182 38911 26558 19477 1407 2352 6655 4457 -17266 -42447 -49133 -26609 23278 20941 16919
23169 16919 40411 45395 17515 25800 4390 -47620 -55028 -36435 -22696 -33573 -25538 -19780 -36103
23156 -36103 -33618 -38808 -33077 -15312 29907 38087 23421 4268 11040 -6836 -39004 -41417 -35313
23143 -35313 10800 46520 20463 2094 32150 51082 45378 37063 18761 14913 -7192 -6743 -7806
23130 -7806 8269 -3111 3729 13219 1063 -8996 -944 -18425 -11285 -7139 6455 42390 64780
23117F4780m638j7149j4083J0556j1365k6807j4622L2481K4087j2825J884K888
23105C5187M724J3486k1297k7351k0976o138p280J7731L5036M338k3568K0749
23093B4641j5991J5460L95l6537J4564L3648k2917J1953J2927O4k3745l2080j3545
23080c1163K6334K7287p063J7607J9711l3088j7922j6896j2891L0403J5833J9614
23068C7766o020l204L861o852J6762j2645j3338k9088j6810p700R67J7937j0422
23055b8786o443L340L109J9028j8122P558r995m840J1219k570r745r050R00K6354
23041a8043J6663k3820k067K2584J6755J6103K7373K0610j2160j6675k6568J0814
23029C1569K5188j301n070O341k5621l0388P644L8888J3765r030k2500J0419K6091
$$ plain form
23117 64780 60142 42993 28910 39466 28101 1294 -13328 19153 43240 30415 32299 35187
23105 35187 39911 53397 32100 4749 -16227 -22365 -29645 -11914 23122 27460 3892 24641
23093 24641 8650 24110 24505 -12032 2532 36180 13263 25216 38143 38207 14462 -17618 -31163
23080 -31163 -4829 22458 15395 33002 52713 19625 1703 -15193 -28084 2319 18152 37766
23068 37766 31746 28542 32403 25551 42313 29668 16330 -12758 -29568 -37268 -36301 -18364 -28786
23055 -28786 -35229 -31889 -28780 -9752 -27874 -20316 -30311 -35151 -23932 -26502 -36247 -45297 -44397 -18043
23041 -18043 -1380 -25200 -27267 -4683 12072 28175 55548 76158 63998 47323 20755 31569
23029 31569 56757 55456 50386 56727 31106 718 8362 47250 61015 51985 29485 39904 65995
23016F5995o933m2802k8018L75n260k1675k0086J2133L4801K7696j1389k4046
23004a9209k7633j9998L4943K3919L527l511j7286J5343J0371l0868r892J4379
22992b5915m41L826J5234L7890p924j1878j3709K0167K0282l0220L085K795k483
22979A0709j3953j1404J052K6667K0719j4023m0249J0290J6874L2233j156l5057
22967B702k0989k3852P469K4730r705N294J998n312M214o891L700j1608R291K6467
22953G508j465j5669M025K5079r878l5478j7038J4045P005p602r979J5809l317
22940b6955j3638j079K707J7763j757j3036j4322J3719j785K2460J179L451l657
22927a4950j8954Q784J5088K758R462R160J0512r45J3152K233j9882O025L3143
$$ plain form
23016 65995 59062 16260 -11758 -11383 -16643 -38318 -58404 -46271 -11470 16226 4837 -19209
23004 -19209 -46842 -66840 -31897 -7978 -4451 -7962 -25248 -9905 466 -30402 -40294 -25915
22992 -25915 -26356 -22530 -7296 30594 22670 10792 -2917 17250 37532 7312 10397 13192 10709
22979 10709 -3244 -14648 -13596 13071 33790 19767 -20482 -10192 6682 38915 37759 2702
22967 2702 -18287 -42139 -34670 -9940 -19645 -14351 -12353 -17665 -13451 -20342 -16642 -28250 -18959 7508
22953 7508 6043 -9626 -5601 19478 9600 -25878 -42916 -28871 -21866 -29468 -39447 -23638 -26955
22940 -26955 -40593 -41672 -38965 -21202 -22959 -35995 -50317 -36598 -38383 -15923 -14744 -11293 -14950
22927 -14950 -33904 -25120 -10032 -7274 2188 11348 21860 20915 34067 36300 16418 22443 55586
22914E5586p250k7285j4113l810k7075n982K1119l636J8602J8687j5721l1219
22902b2097k5501R917L6425J2118j3843j3841P323K4859J3984k8100k8323j3578
22890d0657l912J2770j5627k3588m201L4932N537K936L8030J6605j1923j7055
22878f153k9033Q307J1728o333p69q288M165j5762l0114K573K2776J7968K1129
22865g806K4492J7187j7550j1769K509J7709P211M904k2002k0460P340j9418L801
22852a3852J5126K7124k904J1217j729k055L442J2780l7270n7273r966M2690K3870
22839A1200m667J4198J7772k357j3589J1113j8458k8458p590K3449N4474K4284
22827H1371m9241o907j3480J4894j0698p178J6230O012j2643k1289k9946K1223
$$ plain form
22914 55586 48336 21051 6938 3128 -23947 -29929 -8810 -12446 6156 24843 9122 -22097
22902 -22097 -47598 -37681 -1256 10862 -2981 -16822 -9499 15360 29344 1244 -27079 -40657
22890 -40657 -44569 -31799 -47426 -71014 -75215 -40283 -34746 -31810 6220 22825 10902 -6153
22878 -6153 -35186 -26879 -15151 -21484 -22253 -30541 -26376 -42138 -72252 -69679 -46903 -28935 -7806
22865 -7806 16686 33873 16323 4554 7063 24772 31983 36887 14885 -5575 1765 -17653 -13852
22852 -13852 1274 28398 25494 36711 34982 32927 36369 49149 11879 -45394 -55360 -12670 11200
22839 11200 6533 20731 38503 36146 22557 33670 15212 -13246 -20836 2613 57087 81371
22827 81371 32130 25223 11743 26637 15939 8761 24991 31003 18360 -2929 -32875 -11652
22815a1652L7870o266p803k8657J1360M0475J1590J604m22l672j7521P475j8692
22802A5689j2220L4952k4670q013R822M644L7916R239q760l6484l8057j0920O393
22789b0469n133J3322J5265K763j1193j1814j8461k324O678O969N430O804q052
22776b0215O979j4707j9027o655R429k4199K590p063J2326N0227Q033r249N128
22763f403O570j7780n0875J2199J9458J7405j6556j2218P685J6675J8054j9054
22751b4840n095J5831K6841m910J1640l041J6978M510q044J7128k8909k0489J6346
22738A3946k832k5829r745O203L0709p589J0514j682q639P913k5699L4259M9165
22725G0694j926k4786m1201j6043j323o666K3733j2481j0521R252L6096j7246
$$ plain form
22815 -11652 26218 19952 12149 -16508 -5148 35327 46917 48521 48099 44427 26906 34381 15689
22802 15689 3469 38421 13751 5738 15560 20204 58120 67359 58599 22115 -15942 -26862 -20469
22789 -20469 -25602 -12280 2985 5748 -5445 -17259 -35720 -38044 -31366 -24397 -18967 -12163 -20215
22776 -20215 -13236 -27943 -46970 -53625 -44196 -68395 -65805 -72868 -60542 -10315 -2282 -11531 -6403
22763 -6403 167 -17613 -68488 -56289 -36831 -19426 -35982 -48200 -40515 -23840 -5786 -24840
22751 -24840 -29935 -14104 12737 7827 19467 16426 33404 37914 29870 46998 18089 -2400 13946
22738 13946 11114 -14715 -24460 -18257 12452 4863 15377 13695 5056 12969 -12730 21529 70694
22725 70694 68768 43982 2781 -13262 -14585 -21251 2482 -9999 -20520 -11268 24828 7582
22713G582j1721q088J1060L132P685j7536J0608k7460k111L1067M567j083l5181
22700b7479j2541J8660K2843P733J4778o906k9198P009L83Q914j2799j5271J1898
22687a1976P090l112r082L3548n171n097k6372r615K7868K3706m949O287R147
22674C2272J280n218n3377q066Q815Q625j4468k95j0878K5779K925o513n034K441
22660b1712p890j0154M354n09J5894K654j5229p134N171K9489J4907L671Q250
22647B1762q828j9573p25j7269j2517R028R35J2685K1148J5535j9597N511J0999
22634A9094j0963N328Q771k646j1936j3189Q63O344P597r018J1323J4428j3498
22621A2498k5688k0526r06J4451J0337j1719j9316J054K6564K0191j0520k2311
$$ plain form
22713 7582 -4139 -12227 -1167 1965 9650 -7886 2722 -24738 -26849 4218 8785 7702 -27479
22700 -27479 -40020 -21360 1483 9216 23994 17088 -12110 -5101 -4718 4196 -8603 -23874 -11976
22687 -11976 -4886 -7998 -17080 16468 11297 6200 -20172 -29787 -1919 21787 16838 23125 32272
22674 32272 33552 28334 -25043 -33109 -24294 -15669 -30137 -30432 -41310 -15531 -12606 -19119 -24153 -21712
22660 -21712 -29602 -39756 -35402 -35911 -20017 -17363 -32592 -39726 -34555 -5066 9841 13512 21762
22647 21762 12934 -6639 -7364 -24633 -37150 -28122 -27187 -14502 6646 22181 2584 8095 19094
22634 19094 8131 13459 22230 19584 7648 -5541 -4678 1666 9263 245 11568 25996 12498
22621 12498 -13190 -33716 -34622 -20171 -9834 -21553 -40869 -39815 -13251 6940 -3580 -25891
22609b5891K853p117J5540n685q706M860J6086j0021m633j5844K5611K4688O026
22596A7767J4551J875k8007l6783J5292J9121j6051J1368j6432L818P354J6434
22584A0307k357j0456J6145k3406l6039k6127Q268L9693K6530K1413J3265k3036
22572A4200K040l3203P92K4738M1650J3896l9138k2473j6027Q626P860P970o377
22559D554j2352k0552k263j707l657J6874J5203J1875j5081l3165N334K6212J5938
22546G213j3416K9147K065j6875J226J3169l3505R303n680j2120J2586j4946N6
22533b1777J9553J650J2652j3638k7454k683m779K5764j1832k1720R557N4221
22521A9514j0562k1050K0732J6993k7425m949P233R558j1314m826J8522O676R938
$$ plain form
22609 -25891 -23038 -30155 -14615 -20300 -29006 -24146 -8060 -18081 -22714 -38558 -12947 11741 17767
22596 17767 32318 34193 6186 -30597 -15305 3816 -12235 -867 -17299 -13481 -6127 10307
22584 10307 7950 -2506 13639 -9767 -45806 -71933 -63665 -23972 2558 23971 37236 14200
22572 14200 16240 -16963 -16171 8567 50217 64113 24975 2502 -13525 -4899 2961 10931 4554
22559 4554 -7798 -28350 -30613 -32320 -35977 -19103 -3900 7975 -7106 -40271 -34937 -8725 7213
22546 7213 -6203 22944 25009 8134 9360 22529 -10976 -1673 -7353 -19473 -6887 -21833 -21777
22533 -21777 -2224 -574 12078 -1560 -29014 -31697 -36476 -10712 -22544 -44264 -34707 19514
22521 19514 8952 -12098 8634 25627 -1798 -6747 486 10044 -1270 -6096 12426 19102 29040
22508B9040J9172p757o083k2708j7718J5903l493j2161l3133K5234J9461J0888
22496A6645r998J2447O12J0447P109J6370k1279k3094j0762j3387K0438R045j6245
22483a652K144J4453J6734r163k2651j6825p516J7636N696P419k2144J4909L4545
22470C3585l663k6820n650N713r084j8941J8541L3121L320k3567j9399J7856J0961
22457A5973Q17k1962j8602n791R367j3006K6302L328L2117J1879K996r950k5005
22444H463l6047j451j8603N211j1712K4190L3578q370j7237L0962L8979Q500k6032
22431C0431l1820k6154n873P046K7966l4122Q383L0960k3551j8020K3669P508
22419c577m014j4434K230K0440L700l5739r064L7154Q547O718p223j5993l6840
$$ plain form
22508 29040 48212 40455 34372 11664 -6054 9849 6356 -5805 -38938 -13704 5757 16645
22496 16645 6647 19094 19706 30153 37262 53632 32353 9259 -1503 -14890 5548 14593 -1652
22483 -1652 492 14945 31679 22516 -135 -16960 -24476 -6840 -1144 6275 -15869 -960 33585
22470 33585 29922 3102 -2548 3165 -5919 -24860 -6319 26802 30122 6555 -12844 5012 15973
22457 15973 16790 -5172 -23774 -29565 -20198 -33204 -6902 -3574 28543 40422 43418 33468 8463
22444 8463 -27584 -29035 -47638 -42427 -54139 -29949 3629 -4741 -21978 8984 47963 56463 30431
22431 30431 -1389 -27543 -33416 -26370 1596 -32526 -24143 6817 -16734 -34754 -11085 -3577
22419 -3577 -7591 -22025 -19795 645 4345 -31394 -40458 -3304 5243 11961 4738 -11255 -48095
22406d8095j2506n529j9895J9552J2810k704o444M9431J1773j4348J0775J0664
22394E484J579j4860K6967j2181k175K9813j3481J8131J80l478k6982q538n274
22381d815J5334J0972l064J7796k0622L83J4081k5466l304J4864j3595j7019l984
22368a8439j3895J6045K5274j243j0585J950M926L573l170j7639j1662k607k560
22355c0032Q496L6431J318J23J2153r300J140k969k0572R112j8262j7455J0600
22342a9217r153k6375M27J2952L1655J6567J2322k537k7201R945J9279j1702m070
22329B892j4417r662J5697J2754J3297k3461k0393j1548R827J4989k1704p521
22317c9250M588J8956R851j6192k656J794L9081L8027J8230k4398n1240j3775
$$ plain form
22406 -48095 -60601 -66130 -86025 -66473 -53663 -56367 -62811 -13380 -1607 -15955 -5180 5484
22394 5484 7063 -7797 19170 6989 4814 34627 21146 39277 39457 35979 8997 459 -4815
22381 -4815 10519 21491 18427 36223 15601 15984 30065 4599 1295 16159 2564 -14455 -18439
22368 -18439 -32334 -16289 8985 7742 -2843 -893 4033 7606 4436 -13203 -24865 -27472 -30032
22355 -30032 -21536 14895 16213 16336 28489 19189 20329 17360 -3212 5900 -12362 -29817 -19217
22342 -19217 -28370 -54745 -54318 -41366 -9711 6856 19178 16641 -10560 -615 18664 6962 2892
22329 2892 -11525 -21187 -5490 7264 20561 -2900 -23293 -34841 -25014 -10025 -31729 -39250
22317 -39250 -34662 -15706 -5855 -22047 -24703 -22909 16172 54199 72429 48031 -3209 -16984
22305a6984j0711J9865J4745j3985l3539J5743L661j3101K162J2591l819J315
22293b2057K988K698J2094k1976k0496j6765L9940M6295J1178j0698r700p506
22281E995J0534r424R131J4899J6760k3172k839k5310J7064l493j6400K6605J8759
22268C9109l6559j8470J2105n639J3950j5605L397J6700l1817j295L3522m225
22256E173j5533J468L8336k0171k2590k1882J971K046J5917j2568r736o886k7072
22243g1527J6583L9194L4568J3089N264p898l7752l2683J5866J8840J894k5876
22231c0438j4011J4453R86p344L1201K6528N60k2118j4114J3915k3707j6116O304
22218c3901Q511J7019Q996O878j6417N126k714l0661j893J4043O946R813K952
$$ plain form
22305 -16984 -27695 -7830 6915 -7070 -40609 -24866 -21205 -34306 -32144 -19553 -23372 -22057
22293 -22057 -19069 -16371 -4277 -26253 -46749 -63514 -23574 22721 33899 23201 13501 5995
22281 5995 16529 7105 16236 31135 47895 24723 21884 -3426 13638 10145 -6255 20350 39109
22268 39109 2550 -15920 -3815 -9454 4496 -11109 -7712 8988 -22829 -24124 9398 5173
22256 5173 -10360 -8892 29444 9273 -13317 -35199 -33228 -31182 -15265 -27833 -37569 -44455 -71527
22243 -71527 -54944 -15750 18818 31907 37171 29273 -8479 -41162 -25296 -6456 -4562 -30438
22231 -30438 -44449 -29996 -29010 -36354 -5153 21375 21935 -183 -14297 -382 -24089 -40205 -33901
22218 -33901 -25390 -8371 625 7503 -8914 -3788 -6502 -37163 -39056 -25013 -18067 -8254 -5302
22205e302M75R363j5283N656j2192o271n293J4041J9710N97O632j5484j0332R152
22191d531j0055M591j5578p662K3307J6918n042k6691j5819p719q36Q544J9556
22178b1017Q881j1132j0502Q000J7380L5982j1348j3913j9167o584J0451j3731
22166b6700k856N274K1454P730j0345j303r939N696J8304k0434m748P834J7490
22153G457K437o968k270m259J0397J5300j4617q840Q773k031j3665L0977P929
22140C0620M179j726l0265j1943k106K189K210k284j0188K1889K0880P087Q752
22127C9294M130j7940j4961j6508J9076o187k1923J8598j9602j4530j0276M740
22115c6089K0108N560P173M80p083L6857j2996j0959J469k3941k4462K3934J1682
$$ plain form
22205 -5302 -4827 4536 -10747 -5091 -17283 -23554 -28847 -14806 4904 5501 12133 -3351 -13683 -4531
22191 -4531 -14586 -9995 -25573 -33235 -9928 6990 1948 -24743 -40562 -48281 -49117 -40573 -21017
22178 -21017 -12136 -23268 -33770 -25770 -8390 27592 16244 2331 -16836 -23420 -12969 -26700
22166 -26700 -29556 -24282 -2828 4902 -5443 -6746 -16685 -10989 7315 -13119 -17867 -10033 7457
22153 7457 9894 2926 656 -3603 6794 22094 7477 -1363 7410 5379 -8286 22691 30620
22140 30620 34799 33073 2808 -9135 -11241 -9052 -6842 -9126 -19314 2575 23455 30542 39294
22127 39294 43424 25484 10523 -5985 13091 6904 -15019 3579 -16023 -30553 -40829 -36089
22115 -36089 -15981 -10421 -3248 -2768 -9851 27006 14010 3051 4520 -19421 -43883 -19949 -8267
22102h267j062Q38J6715k2775j2911J9814P647J3409K2996j1477k6353O977N453
22089A1004r176k1712k069Q270M496M7261K4560q344L705J148K538l808j06J5463
22075G3230m013k5805j8881k1790k2676k9317M831J5912l285p548M836l849j760
22062d0115M5647J1454m243n266J0936K742K7207j0080o440k209k1841k168m587
22049A037N545q883R032M459R263j4674q944k616j4433J1683K5984J0070j5444
22036A2079J0665j585Q268M988K475j2783k456R202q990j4559j7216q775P91K0125
22022B229N266L636R186O801j428J305m148O010N912k6910j2022Q769k1490q314
22008b5198K3866j086k778J4657m290K4978r93k4835K185O065j8032Q322k3780
$$ plain form
22102 -8267 -9329 -8491 8224 -14551 -27462 -7648 -1 13408 36404 24927 -1426 5551 11004
22089 11004 1828 -19884 -21953 -13683 -9187 38074 62634 54290 57995 59143 61681 57873 57767 73230
22075 73230 69217 43412 24531 2741 -19935 -49252 -44421 -28509 -31794 -39342 -34506 -38355 -40115
22062 -40115 5532 16986 12743 7477 18413 21155 48362 38282 31842 29633 7792 5624 1037
22049 1037 6582 -2301 6731 11190 20453 5779 -3165 -5781 -20214 -8531 17453 27523 12079
22036 12079 22744 21159 29427 34415 36890 24107 21651 30853 21863 7304 -9912 -18687 -17896 2229
22022 2229 7495 11131 20317 27118 25690 26995 22847 28857 34769 7859 -4163 4606 -16884 -25198
22008 -25198 -1332 -2418 -5196 9461 5171 30149 29156 4321 6506 12571 -5461 2861 -20919
21995b0919k8016o458L3482J9502j3852j3888l79j1466j1769M5466J7463j7000
21983g834j7206j665J6654J4421Q165l1922k3080O838J2939K8703J61k2975l3899
21970e0700P253K6812J4268K2084J4175P729m6310p514j0864j749J0776o346K1741
21957A355J6675o902o622R175K4910l707k7100j6871M815K2507j6592k838m5J0408
21943I168K0794m773l4887J3170m165l0019p589K7031L1287J0474j794j7100K3293
21930C4890k786r061K244r213j200k2218J1794M558j1392K1850L0138l0609M739
21917B3734K5076k3443k1908O037k2450K1445M718p549k488L57j722m846j140
21904d179R717k0052q156L0096M6923k0342l1318Q60J2160K5369j1577j4703j3041
$$ plain form
21995 -20919 -48935 -55393 -21911 -2409 -16261 -30149 -30528 -41994 -53763 -8297 9166 -7834
21983 -7834 -25040 -26705 -10051 4370 12535 -19387 -42467 -35629 -22690 6013 6174 -16801 -50700
21970 -50700 -43447 -16635 -2367 19717 33892 41621 -4689 -12203 -23067 -24816 -14040 -20386 1355
21957 1355 18030 11128 4506 13681 38591 34884 7784 -9087 -4272 18235 1643 -1195 -1240 9168
21943 9168 29962 25189 -9698 3472 -693 -30712 -38301 -11270 20017 30491 28697 11597 34890
21930 34890 32104 23043 25287 16074 14874 -7344 4450 9008 -2384 19466 49604 18995 23734
21917 23734 48810 25367 3459 9496 -12954 8491 13209 5660 3172 3529 1807 -3039 -4179
21904 -4179 5538 -14514 -22670 7426 54349 34007 2689 3549 15709 41078 29501 14798 1757
21891A757N494J8286O072J3635k0730q476J1217j1689j2629J5430j3187K2810
21879B7990L1197j8402n1520r091k6334o629L0344K0310l0594k7347q34j531J3278
21866d9163J7316J7044l636O510l927J3705J9691J0103k948K0174k0193j8298
21854F378J441R460k4989q531O303J495J6275J6110k3172k5353L3277L5266l3107
21841A0853k6845Q785M548j467J1264r166j2851J4186J1975j3497j6287O790M1359
21828B9647j3131k9454p971R302L4776J0268J3975l3785k4345k0999O590J5476
21816i651J468l35M238K3531j5886j6554J2704Q349N038P59J9463q653J9388p340
21802C6519r813k0208j928M144R92lJ7110n690j3650j1559M828J5011J439O521
$$ plain form
21891 1757 7251 25537 31609 45244 24514 16038 27255 15566 2937 18367 5180 27990
21879 27990 59187 40785 -10735 -19826 -46160 -52789 -22445 -2135 -32729 -60076 -60910 -62441 -49163
21866 -49163 -31847 -14803 -18439 -11929 -15856 -2151 17540 27643 24695 44869 24676 6378
21854 6378 7819 17279 -7710 -16241 -9938 -8443 7832 23942 770 -24583 8694 43960 10853
21841 10853 -15992 -7207 -2659 -4126 7138 -2028 -14879 -693 11282 -2215 -18502 -11712 29647
21828 29647 16516 -12938 -20909 -11607 23169 33437 47412 13627 -10718 -31717 -25127 -9651
21816 -9651 -8183 -8518 -4280 19251 3365 -13189 -485 7864 12902 13661 33124 24471 43859 36519
21802 36519 26706 6498 4570 8714 9706 9703 26813 21123 7473 -4086 742 15753 17192 23713
21788B3713O523k9154q973l104o827J6968J3040p170p902P339J2494j9479j1026
21775a3558j1738K219O497K3159p41j7297M122J1479r015P943q621J884J5654
21762A1987p31o790n268n952l2230Q005J6133j3688J2065M7934J595j3853j7199
21749B008k714j215K492p865j7837j182R754J2181j2503J7510J4885J563K69O834
21735B4180P493k220O24l1454j0049M558k2216j0215L431l527R302K4474J2860
21722G241p24l5152j408Q448j6681K3905J8800K2108j2484j9757j757m280o142
21709a7883N38N13J4341j9357k4290K506J6454Q541j2183K6365J6861o140q846
21696b580k8811R597L0936L162J5420R972j7366J7008j8482m8042r216K7800K7066
$$ plain form
21788 23713 30236 1082 -7891 -10995 -17822 -854 12186 5016 -2886 4453 16947 -2532 -13558
21775 -13558 -25296 -23077 -16580 6579 5838 -11459 -7337 4142 -4873 3070 -5551 -3667 11987
21762 11987 11256 4466 -802 -6754 -38984 -30979 -14846 -28534 -16469 31465 33060 19207 2008
21749 2008 -706 -1921 571 -7294 -25131 -26313 -16559 -4378 -16881 629 15514 17077 17346 24180
21735 24180 31673 29453 30077 -1377 -11426 -6868 -29084 -39299 -35868 -39395 -30093 -5619 7241
21722 7241 6517 -28635 -30043 -21595 -38276 -14371 4429 26537 14053 -5704 -7461 -11741 -17883
21709 -17883 -17345 -16832 -2491 -21848 -46138 -43632 -27178 -18637 -30820 -4455 12406 6266 -2580
21696 -2580 -31391 -21794 9142 12304 27724 37696 20330 37338 18856 -29186 -38402 -10602 16464
21683A6464J3676o282j0256k1928O759J0841j1762o418K2594L942j5827P023J0544
21670A9370j7090j6227N57J9820P282n760j2735k8298l865J1080J4081j2083q259
21657c2127k2387M348Q797K9355J0669j5213j5479L1088j2001j5135j7965N359
21645d0691J8571n29l2969j7110j240j3160L270J6000J5114J6616K0717J8808
21633C397J7478l104j1096M112j0679j0805j572k331m98M647j7139o536M3627
21620I501K3288r008N02K6011r819m0605j8856K1967l3376n343O132O413J7611
21607e582K5131l31J3850j3172k4862p774O249N234J660r762K597p573J5455q079
21593f959j7957K4000O033j1295J736P960m114J6175J5742K3015K6187l8933j4198
$$ plain form
21683 16464 30140 23858 13602 -8326 -1567 9274 -2488 -8906 13688 17630 1803 8826 19370
21670 19370 2280 -13947 -13390 6430 13712 7952 -4783 -33081 -36946 -25866 -11785 -23868 -32127
21657 -32127 -54514 -50166 -41369 -12014 -1345 -16558 -32037 -949 -12950 -28085 -46050 -40691
21645 -40691 -22120 -22649 -55618 -72728 -73968 -87128 -83858 -67858 -52744 -36128 -15411 3397
21633 3397 20875 17771 6675 10787 108 -10697 -12269 -14600 -15098 -10451 -27590 -34126 9501
21620 9501 32789 23781 24283 50294 40475 -130 -18986 2981 -30395 -35738 -29606 -23193 -5582
21607 -5582 19549 19218 33068 19896 -4966 -12740 -6491 -1257 403 -9359 -6762 -14335 1120 -6959
21593 -6959 -24916 -916 5117 -6178 -4442 3518 -596 15579 31321 54336 80523 41590 27392
21580B7392j0265l0896j7639K6598K1100j2374j1438k3658l389R931M712J8047
21568a879J9484j4515j821J6079j3952j4846j3669L971M2749K5520l3582j9662
21556f123k0306k58R319k752K7004J4939m487j1076j440j7945j4946N184j5449
21543c8336j1787J5533N264K0719k497R931n142P372P157k3745k7462J9375J9697
21530c921J4425p485K6195M026l4030m206N371j8782J1237k985J5010K0824k2104
21517C575m390k464K0136J6319M593j3024R399J2604o217l406l9280l9586k3265
21504f5006J7941o456N608L7591L5972l533j0137n727P837j0809l342o036m716
21491a0813L909k775m531j5258L925K485N53J1874J4530j0665j0105p669q84J2073
$$ plain form
21580 27392 17127 -13769 -31408 -4810 16290 3916 -7522 -31180 -34569 -24638 -19926 -1879
21568 -1879 17605 3090 1269 17348 3396 -11450 -25119 -21148 21601 47121 13539 -6123
21556 -6123 -26429 -26687 -17368 -20120 6884 21823 17336 6260 4820 -13125 -28071 -22887 -38336
21543 -38336 -50123 -34590 -29326 -8607 -11104 -1173 -6315 1057 8214 -15531 -42993 -23618 -3921
21530 -3921 10504 3019 29214 33240 -790 -4996 375 -18407 -7170 -10155 4855 25679 3575
21517 3575 -815 -3279 16857 33176 37769 24745 34144 46748 40531 37125 -2155 -41741 -65006
21504 -65006 -47065 -53521 -47913 -10322 25650 22117 11980 6253 14090 3281 -61 -6097 -10813
21491 -10813 -6904 -9679 -14210 -29468 -25543 -23058 -22505 -10631 3899 -6766 -16871 -24540 -25424 -13351
21477a3351J6955J4428m095O896P275L067j4800n13j3983j0404m017j4444m1528
21464f8514R691K0923P876K7672R98J4452M710k7158M908R051m115K751K0058
21451B3303K0344k2285k0040l4354j0625L0022J3538K4550J6433l5928j6396P126
21439d312m86p013J1424M569j9738k6170O548K3152L5254K030q935k168O893n312
21425A5736Q64k7992k3664k613j1738J1565K1831K1329Q281j925n257k8783k8124
21412e0490L3817J7506r409L624l327o063o043J8084J3480P071J1530p181n201
21399A7398n669j5040k450o403K0065j2467j8679J8688M0975j9135m0074J2668
21387a0123L1113O356k0187j048q511l1698J0149j4211L850P704P826K6748p205
$$ plain form
21477 -13351 3604 18032 13937 20833 28108 31175 16375 15862 1879 -8525 -12542 -26986 -68514
21464 -68514 -58823 -37900 -30024 -2352 -1354 13098 17808 -9350 -4442 4609 494 3245 23303
21451 23303 43647 21362 1322 -33032 -43657 -13635 -97 24453 40886 4958 -11438 -4312
21439 -4312 -4798 -11811 -387 4182 -15556 -41726 -35178 -12026 23228 25258 16323 14155 21048 15736
21425 15736 16600 -11392 -35056 -37669 -49407 -37842 -16011 5318 13599 11674 6417 -22366 -50490
21412 -50490 -16673 833 -8576 -4952 -8279 -14342 -20385 -2301 11179 18250 29780 22599 17398
21399 17398 11729 -3311 -5761 -12164 7901 -4566 -23245 -4557 36418 17283 -22791 -10123
21387 -10123 20990 27346 7159 6111 -2400 -34098 -23949 -38160 -34310 -26606 -18780 7968 763
21374G63P020J1718O178J6926j2760n742j345j4576k0474j8442k2700K171L0081
21361b1182L990p110K7149j6335j3258n179J4103L679j457J2172K952M137P715
21348A1376R914q26j4809K311q764J4327M4316M380k1879j663O0l719r292O085
21334C1817k7167j8566p251J2767L041j1399J8698M36n075k3419J3468K8260L417
21321A9027k1647j7721p474J9757J4378L5929j8107k1109q048k9807k2797K006
21309e5613J1273k468K6428p409J0508k363j118j6901P328M3700M458j4380k1322
21296a7879j084o845K1330M842r634N777j1718m2775m813L7233L6863L5903J5173
21283F2373k7991L997j2340k4930k5445j0055R407K6297J1297m388N813O6871
$$ plain form
21374 763 7783 19501 25679 42605 29845 24103 22758 8182 -12292 -30734 -53434 -51263 -21182
21361 -21182 -17192 -24302 2847 -13488 -26746 -31925 -17822 -14143 -15600 -3428 -476 3661 11376
21348 11376 21290 20464 5655 7966 -798 13529 57845 62225 40346 38683 38743 35024 25732 31817
21334 31817 4650 -13916 -21167 -8400 -5359 -16758 1940 2376 -2699 -26118 -12650 15610 19027
21321 19027 -2620 -20341 -27815 -8058 6320 42249 24142 3033 -5015 -34822 -57619 -55613
21309 -55613 -44340 -46808 -20380 -27789 -17281 -19644 -20762 -37663 -30335 13365 17823 3443 -17879
21296 -17879 -18963 -25808 -4478 364 -9270 -3493 -15211 -57986 -62799 -25566 11297 47200 62373
21283 62373 34382 38379 26039 1109 -24336 -34391 -24984 1313 12610 8222 14035 80906
21271H0906l2443o0918j2864J9248J6015j8817j2241L001j1201j0796J1645J4720
21259a3745o712Q301J6101J9171J7811K8976r593j5128J6514N840l7344m3986
21247a3794m327L10R706J0744L553l2711j3911n446J8194J2677J157R312N656
21234A120Q933J1653k8750J3377P887l9822m1484m385J2115K2294K8111k44L547
21221e648K5657o705K9464J1651j5436n0786m406L5436j6303r087M414j6551k6599
21208d4899j8299J2571Q6M447M192P835M1454J4470J2141K2745N276l375k9509
21195B9135Q298l42k4382M075o994n985j1593q620L885N572L4860O996l4982l4944
21181c5021J1912L0095o152j7007j3649K3555J373M291K3561p177P434J29k9593
$$ plain form
21271 80906 48463 -12455 -25319 -6071 9944 -8873 -21114 -18113 -29314 -40110 -28465 -13745
21259 -13745 -20457 -12156 3945 23116 40927 69903 60310 45182 61696 67536 30192 -13794
21247 -13794 -18121 -17811 -8105 2639 6192 -26519 -40430 -45876 -27682 -15005 -13848 -4536 1120
21234 1120 10053 21706 -7044 6333 14220 -25602 -67086 -71471 -59356 -37062 -8951 -9195 -5648
21221 -5648 20009 13304 42768 54419 38983 -11803 -16209 19227 2924 -6163 -1749 -18300 -44899
21208 -44899 -63198 -50627 -50541 -46094 -41902 -34067 7387 21857 33998 56743 62019 58644 29135
21195 29135 37433 37091 12709 16784 9790 3805 -7788 -16408 -12523 -6951 27909 34905 -77 -35021
21181 -35021 -23109 6986 834 -16173 -29822 -6267 -4894 -603 22958 15781 23215 23344 -6249
21168f249j1487N487R64K114j4313j6324P029K3992o073r364j1122M047K5289
21155f010j9702j811L2599M004k3137k2371J0512q893n759K1160J9102M087j4393
21142a0612P134M177j4519k0054L620k1846J0010K6013J3432l833q459Q517j30
21129f550p491P080l689L8077K1921j8015l6541k2983J786J4078J4972O207J4690
21116B3542Q541l2638l5670K3614N636k1143K8P748o187O180K190J33J4540q423
21102a1909r798J692p288j89J153J3307J1927o467P136K7887Q308k2418p483j9684
21088a3826k5375k3080P354K475N890L254K0202q34N806J8375M865j1519K0072
21075A3659j514j5717m2577j5412K8865L8657K0368p651N295j3473r860j5863
$$ plain form
21168 -6249 -17736 -12249 -11285 -9171 -23484 -39808 -32779 -8787 -14860 -24224 -35346 -31299 -6010
21155 -6010 -25712 -27523 5076 9080 -14057 -36428 -25916 -34809 -40568 -19408 -306 3781 -10612
21142 -10612 -3478 699 -13820 -33874 -30254 -52100 -42090 -16077 -2645 -6478 -14937 -6420 -6550
21129 -6550 -14041 -6961 -10650 27427 49348 31333 -5208 -28191 -26405 -12327 2645 8852 23542
21116 23542 32083 -555 -36225 -12611 -6975 -28118 -28090 -20342 -26529 -20349 -18159 -18026 -3486 -11909
21102 -11909 -21707 -20015 -27303 -27492 -26339 -13032 -1105 -7572 -436 27451 35759 13341 5858 -13826
21088 -13826 -39201 -62281 -54927 -52452 -46562 -43308 -23106 -23940 -18134 241 5106 -6413 13659
21075 13659 12145 -3572 -46149 -61561 -32696 5961 26329 18678 23973 10500 640 -15223
21063a5223K65k2904j3956J7024L9737k307J741p303l545j2310K1982k662j2052
21050a1513j1443J9889K8682J2302j2190k5371j5463o726N098j6541J8753K5780
21038A1257L239K0425o423m3251J2392J4051j0322k7223M924J206m046N990N102
21025a2679r353K2000q180j7264n47J6032K417J0610p474m3119O36L6981j277
21012a1217j5204N165P209j5382r823j075J939L1735J5993j033j5426J3897L1477
20999C8255M597l616N275k2204l4745k1590j1465L3696L3138R012J307L7129R142
20986G7931l9855m0333j251J0276k2305L964K1127L5436k5823k0658j9113N972
20974a4632J2302j7621P437J6157O429K36J6607N009k2612k0080m152m401P723
$$ plain form
21063 -15223 -14958 -37862 -51818 -34794 4943 2636 4377 -2926 -6471 -18781 3201 539 -11513
21050 -11513 -22956 -3067 25615 37917 25727 356 -15107 -21833 -16735 -33276 -14523 11257
21038 11257 14496 34921 28498 -14753 -2361 11690 1368 -25855 -20931 -19725 -23771 -17781 -12679
21025 -12679 -22032 -32 -8212 -25476 -26023 -9991 -7574 3036 -4438 -47557 -46921 -9940 -11217
21012 -11217 -26421 -21256 -14047 -29429 -39252 -40327 -38388 -6653 9340 8307 -7119 6778 38255
20999 38255 42852 39236 44511 22307 -12438 -34028 -45493 -11797 21341 30353 31660 68789 77931
20986 77931 38076 -2257 -3508 6768 -15537 -11573 9554 44990 19167 -1491 -20604 -14632
20974 -14632 -2330 -19951 -12514 3643 10072 10308 26915 31924 9312 -10768 -14920 -19321 -11598
20961a1598q541J1754q24m0376n822J6638J5727j5543J7687j2224O616K4936L666
20948B096K7484J2457k5483k52K4899K5355l5442r879O946k1404j9911j1257J2138
20935a2253J2384R195j9900K3604k541R84k1985k419k0998j5115K5984M17R040
20922a3603R566P049r424j6741m937k1142J4145J5706J3520K3820K1354j3372
20910B5941k5163k354L129M296k7993J692Q207J172j716r523p913Q203J7493j6163
20896b0692J4113Q31k830J1025k55O803j8822J907J435Q43J8631j9629j5820l4493
20882e6953Q609J2710J0696q078O06L746k1960J6494j2019K9708P294K1021J6927
20869B8801j0527K754k4283q959N382j6974j405j280O011R028P071M490k8000
$$ plain form
20961 -11598 -20139 -8385 -9209 -49585 -55407 -38769 -23042 -38585 -20898 -33122 -26506 -1570 2096
20948 2096 29580 42037 16554 16302 41201 66556 31114 21235 28181 6777 -13134 -24391 -12253
20935 -12253 131 9326 -10574 13030 10489 11473 -10512 -12931 -33929 -49044 -23060 -22643 -13603
20922 -13603 -4037 3012 -6412 -23153 -28090 -49232 -35087 -19381 -5861 17959 39313 25941
20910 25941 778 -1576 1553 5849 -22144 -20452 -12245 -11073 -12789 -22312 -30225 -22022 -4529 -20692
20896 -20692 -6579 -5748 -8578 2447 2192 8995 -9827 -7920 -6485 -5642 12989 -6640 -22460 -56953
20882 -56953 -48344 -35634 -24938 -33016 -32410 -28664 -50624 -34130 -46149 -16441 -9147 11874 28801
20869 28801 18274 21028 -3255 -12214 -6832 -23806 -25211 -26491 -20480 -11452 -4381 109 -27891
20856b7891P918L0957j5128N049k8170k957O920R343M4350r540k1997o132l646
20843a0924q72J4240o868J4706J3827j2017m992P461l787j2556R682p400r542
20830i042k3998J7137K9957j6071l6986l7336K4603K4071J7801K0834R083j8939
20818A114k6928J696L568J4140O161N292o846N197j0693j0850l9928R783K8012
20805b0282J5024K4168l342r685j6177J452p597j0793j3319R100K8481j807n392
20792a0169k7417J375J5374R310K664r073k5935m580K875J6465j3036m311q891
20779e5349M59J1572k524J7460K5297K0792l08q579m201j4669j6631k0057J2851
20766c3887M133J7140N781Q717K929p291q10L400j814J2717J8597K9915q433j4006
$$ plain form
20856 -27891 -19973 10984 -4144 905 -27265 -30222 -23302 -13959 30391 20851 -1146 -7278 -10924
20843 -10924 -11796 2444 -4424 10282 24109 12092 7100 14561 10774 -1782 7900 500 -9042
20830 -9042 -33040 -15903 14054 -2017 -39003 -76339 -51736 -27665 -9864 10970 20053 1114
20818 1114 -25814 -24118 -20550 -6410 -249 5043 -1803 3394 -7299 -18149 -58077 -48294 -20282
20805 -20282 -5258 18910 15568 5883 -10294 -8842 -16439 -27232 -40551 -31451 -2970 -4777 -10169
20792 -10169 -37586 -36211 -20837 -11527 -8863 -17936 -43871 -48451 -45576 -29111 -42147 -46458 -55349
20779 -55349 -54890 -43318 -45842 -28382 -3085 17707 17399 8820 4619 -10050 -26681 -46738 -33887
20766 -33887 -29754 -12614 -6833 1884 4813 -2478 -3288 112 -1702 11015 29612 59527 51094 37088
20752C7088j9245R694q663k706N665O383M488n171j166K4829j8967k2901m144
20739E184J231J873N668J2298m913n109l06J1782j974l2049j177J8937J2303m427
20725A9321Q868N017m4646j3126n988n628K5484L417K2353m536L26M167L227r807
20711H449k811j0874j6271j3945l590j4305J3045K5542N13r791m126o296N771
20698b8689o10K2031K2764J2402k5867q524n009J0650K1514p510j3285j9530N443
20685a4220L6735j9013l2162n039k664J9238K5606j6919L151Q19O201P68J4008
20672A6509J0612O30j394j9227j3173k0526Q538K5544j252l3657r088K4926M900
20659f658J5356j645L692j0022j6375j9574J4703L211L3731K2636j2234N228m782
$$ plain form
20752 37088 17843 27537 18874 16168 21833 28216 32704 27533 26367 51196 32229 9328 5184
20739 5184 6415 8288 13956 26254 21341 16232 15926 27708 25734 -6315 -7492 11445 23748 19321
20725 19321 28189 33206 -11440 -24566 -30554 -36182 -10698 -7281 15072 10536 10862 15029 18256 8449
20711 8449 5638 -5236 -21507 -35452 -39042 -53347 -40302 -14760 -14247 -24038 -28164 -34460 -28689
20698 -28689 -29299 -7268 15496 27898 2031 -6493 -11502 -852 20662 13152 -133 -19663 -14220
20685 -14220 22515 3502 -28660 -33699 -36363 -17125 8481 -8438 -5287 -4468 1733 2501 16509
20672 16509 27121 27751 26357 7130 -6043 -26569 -18031 7513 6261 -27396 -36484 -11558 -6658
20659 -6658 8698 7053 10745 723 -15652 -35226 -20523 -17312 16419 39055 26821 32049 27267
20646B7267j8271j9729q139k6724L5492J3079k0261m472J6839N436j4984j002
20634a5469O82J0117q36o298K3128J6065o377p919j3687J3969J0882P194n676
20621B5775n994K7563p85n2023j1741K2306P660j0829k265j2957j3158J2032J4321
20608i5P126K7403K1124k7767l0215j9921l798k447l477K8744n399n112j0487
20595b4321J6297J7625k155q322J3613J964j0492L380K3071J8583j6117l7794
20583d668j9723k7091j0804o600l841J0824L5246K2376r766M801J2666N646j4193
20570e127o905J23L3850o63M730k0364r663P64J629p652L1194L1637j6527k5302
20556A1724l4311O88J0558j2729k6160j4002K1461K5898q423m178L5475J3794
$$ plain form
20646 27267 8996 -10733 -18872 -45596 -10104 2975 -17286 -21758 -4919 517 -14467 -15469
20634 -15469 -14787 -4670 -5506 -11804 11324 27389 21012 13093 -594 13375 24257 31451 25775
20621 25775 19781 47344 46559 -5464 -17205 5101 12761 1932 -333 -13290 -26448 -14416 -95
20608 -95 7031 34434 55558 27791 -2424 -22345 -26143 -28590 -32067 -3323 -8722 -13834 -24321
20595 -24321 -8024 9601 7446 -876 12737 14701 4209 7589 30660 49243 33126 -4668
20583 -4668 -24391 -51482 -62286 -68886 -72727 -61903 -26657 -4281 -14047 -9246 3420 9066 -5127
20570 -5127 -12032 -11909 21941 21278 26008 5644 -4019 -3255 -1626 -9278 21916 53553 37026 11724
20556 11724 -22587 -21899 -11341 -24070 -50230 -64232 -42771 -16873 -25296 -29474 6001 19795
20544A9795l931j972j2638M66L92j1935j14k2646R086M7490M38j7188Q282O234
20530B1759j9360J0643J0283n929Q652K5647j4162m212J0269k5224j0065j4865
20518f564J1476K2174J008l2716k8833n17P914N17j448J5001K0298l5005n470
20505c2165K972Q685m329J2779L5410J2427j4714q411J2023j1781j0812l980o116
20492h012K5397q131n16j420k8212J873j143K9031J2282L471J5133k1813k218
20479A5722j1560j2331k715p483K3850L7824p609L762p586k7197j7683K0368J4703
20466B2065j6266k3295R566L81k5115R790J4045j5332K8941j010k4908o434l018
20453c0590L985K4288j4045j2446K1596K8147P791p910k5190j7170J5118k5013
$$ plain form
20544 19795 15864 13892 1254 1720 2112 -9823 -9937 -32583 -23497 23993 24431 7243 15525 21759
20530 21759 2399 13042 23325 17396 26048 51695 37533 33321 43590 18366 8301 -6564
20518 -6564 4912 27086 28094 -4622 -33455 -33972 -26058 -25541 -26989 -11988 8310 -26695 -32165
20505 -32165 -29193 -20508 -24837 -12058 23352 35779 21065 12654 24677 12896 2084 -1896 -8012
20492 -8012 17385 9254 8738 7318 -20894 -19021 -20164 8867 21149 24620 39753 17940 15722
20479 15722 4162 -8169 -10884 -18367 5483 43307 35698 39460 31874 4677 -13006 7362 22065
20466 22065 5799 -17496 -7930 -7549 -32664 -22874 -8829 -24161 4780 3770 -21138 -27572 -30590
20453 -30590 -26605 -2317 -16362 -28808 -7212 20935 28726 20816 -4374 -21544 -6426 -31439
20441c1439j1957L6077N4357K284j7420j5589l785p372q520j4260m97J0029j6446
20428b4538l3544m053K0386K6182k243M824q628M989R410M271k415J2048M722
20415A1411J2056o844O939K4749O728j9274j790L430j3040n0038k9182J5754J6741
20402b2360J0518j4202l0360L1783M6765j0293j4998K706J29k6005j9362K3321
20390b2358L2769J1473k5512r284L387J4324K1343k944n495Q864j2542j6182L044
20377H87l426J5471l139K392j2530k269j2364M410L3865O525N351L787K8433K76
20363F7669j8382j6835m342m0170j3399L2880j664k8514k2487P224J2913N3766
20351B8659J9386l0121m995J365K488k1890j8633k3958j8204P908Q723K595L874
$$ plain form
20441 -31439 -43396 -7319 47038 49322 31902 16313 12528 5156 -3364 -17624 -18121 -8092 -24538
20428 -24538 -58082 -62135 -41749 -15567 -17810 -12986 -21614 -16625 -7215 -2944 -5359 6689 11411
20415 11411 23467 16623 23562 48311 55039 35765 33975 37405 24365 -25673 -54855 -39101 -22360
20402 -22360 -11842 -26044 -56404 -24621 22144 11851 -3147 -441 -312 -26317 -45679 -22358
20390 -22358 10411 21884 -3628 -12912 -9525 4799 26142 23198 17703 26567 14025 -2157 887
20377 887 -2539 12932 9793 12185 -345 -2614 -14978 -10568 23297 29822 35173 38960 67393 67669
20363 67669 49287 32452 28110 -12060 -25459 7421 5757 -22757 -45244 -38020 -25107 28659
20351 28659 48045 17924 12929 14294 16782 -5108 -23741 -47699 -65903 -57995 -49272 -46677 -42803
20338d2803O407J23K943K702O085K7195J7127l6917k0139J9747P402J0648K816
20325C336Q113j248j3788j2092K1458K5207M714j1448j3675K731r172J652k1410
20312a5622j1118j5814k1009K3450J2386j8256K3689J1378J379j3887p033K0022
20300a0435K7211q564j117q102m696J926q832Q518J6540J4376m969l994l912p934
20286F016K206J8135j6760k768N485r138k0303j6604j18P929r293J6160M5302
20273B6249J2701j6383l344p987j3586k901O81q714L697j6639M9o30j4466N464
20259c5809j8836K195L1964J8404j7253J6054J1377O222k3110K8012K4790l1710
20247A2300J2398J6088k4136k4600J6970j2902N460P621l2837k908Q02M837K0699
$$ plain form
20338 -42803 -36396 -36273 -33330 -30628 -24543 2652 19779 -17138 -37277 -17530 -10128 520 3336
20325 3336 11449 10201 -3587 -15679 5779 30986 35700 24252 10577 13308 4136 5788 -15622
20312 -15622 -26740 -42554 -63563 -40113 -27727 -45983 -22294 -10916 -9537 -23424 -30457 -10435
20300 -10435 16776 8212 7095 -1007 -5703 -3777 -12609 -4091 12449 26825 21856 17862 13950 6016
20286 6016 8222 26357 9597 6829 12314 3176 -17127 -33731 -33849 -25920 -35213 -19053 26249
20273 26249 38950 22567 19223 11236 -2350 -5251 -4570 -13284 -9587 -26226 -26177 -26807 -41273 -35809
20259 -35809 -54645 -52450 -20486 -2082 -19335 -3281 8096 14318 -8792 19220 44010 12300
20247 12300 24698 40786 16650 -7950 9020 -3882 1578 9199 -23638 -26546 -25744 -20907 -208
20234b08R259K5090J1671R076o975l3243k7335J8819m598k733K1755K8238k151
20221D6665j8176j9168J2519p122k5162O922K4701p052j008J4120m600k5248L865
20208A256r967p664J3279L478j1564K271n519j6629q794J5135K1316J2977j2423
20195b848l231j0650j2724K3683K4341p065m1313j2170J790L9964J2126n425j4745
20182h267n069m450K950O967N158j9172M906j4534R980j3164j7640j5367K3360
20169d4342L1698M4819K2271r738m4798k7259j4867J7023l758M66J6238K264N586
20156d397q824m532O737O076J5109O592L582j6650l095K5296L4102j7455r585
20143C2956n137j0799k9696J1821J2827q64J3222M649k3886k2920J5242k434J6845
$$ plain form
20234 -208 9051 34141 45812 54888 47913 14670 -12665 6154 1556 -1177 20578 48816 46665
20221 46665 28489 9321 21840 14718 -10444 -3522 21179 14127 13119 27239 22639 -2609 1256
20208 1256 -8711 -16375 -3096 382 -11182 -8911 -14430 -31059 -39853 -24718 -3402 9575 -2848
20195 -2848 -6079 -16729 -29453 -5770 18571 11506 -29807 -41977 -40187 -223 11903 6478 -8267
20182 -8267 -13336 -17786 -14836 -7869 -2711 -21883 -16977 -31511 -21531 -34695 -52335 -67702 -44342
20169 -44342 -12644 32175 54446 44708 -90 -27349 -42216 -25193 -28951 -28485 -12247 -9983 -4397
20156 -4397 -13221 -17753 -11016 -4940 10169 16761 20343 3693 598 25894 59996 42541 32956
20143 32956 27819 17020 -12676 -855 11972 11108 24330 28979 5093 -17827 -2585 -5019 11826
20130A1826L955l0091j4632J8406L5038P492l4111j193J5320j7306j5889P265
20118a3920N226M733J249k0284j9459j58J8148J6769J8704P052r535O86K830j957
20104A0084K3769L823j2737r489j8777l334M639j3023J944j219k9134J4524L6454
20091G524J129l5230k3023J2389J8258j5834m425M549l887q503j7175K7419L2378
20078d431n71k1158J8376J3449k6578l202k187K0166P356k0721n956O002J5784
20065c671P792j6286p185j6868P478P331K2349R96k2908o509J0679N873N188J5098
20051I357L877J1002K832k2234O23M172J1491m820l227k771j0202J083O566r734
20037a985q006P49k7162O31L0106o834J3241r004N297m921o216Q721p403k6027
$$ plain form
20130 11826 15781 -14310 -28942 -10536 24502 31994 -2117 -3310 12010 -5296 -21185 -13920
20118 -13920 -8694 -3961 -2712 -22996 -42455 -42613 -24465 -7696 11008 18060 8525 9211 12041 10084
20104 10084 33853 37676 24939 15450 -3327 -6661 -2022 -15045 -13101 -14320 -43454 -28930 7524
20091 7524 8653 -26577 -49600 -37211 -18953 -34787 -39212 -34663 -38550 -47053 -64228 -36809 -4431
20078 -4431 -5002 -26160 -7784 5665 -20913 -24115 -26302 -6136 1220 -19501 -25457 -19455 -3671
20065 -3671 4121 -12165 -19350 -36218 -28740 -21409 940 1936 -20972 -27481 -16802 -10929 -5741 9357
20051 9357 13234 24236 27068 4834 5457 9629 21120 16300 13073 10302 100 1183 7749 -1985
20037 -1985 -9991 -9242 -36404 -35773 -5667 -12501 740 -8264 -2967 -7888 -14104 -5383 -12786 -38813
20023c8813O227L1931N573j7589J5451L3774k8975j0094J4395O462m697j7556
20011c911K6106J3107p053k173j1788l437j6487J374K8425K1292J6394l8250l8159
19998a4560L683J2187R883j0760R145J0653k1842j7309M0295M913j054j7721k4783
19985a7270P229K3034l34j518r83k1731m635q700P146Q428M18L441j4959j8704
19971c9138k604K7704L850K6370Q993k9116N736L6082j3472k9647m358L871j8806
19958b4535K2290J088Q161R032J3618M53j9178j8535o874J9584j4466J0077j8419
19945a7704K686k550l096J5518n267j1949K3751k3442k6760J635J6966K3700K105
19932d407j0475j6586k833P208J5290J0146k6332M682J8420K2269j039m2128N505
$$ plain form
20023 -38813 -32586 -655 4918 -12671 2780 36554 7579 -2515 11880 18342 13645 -3911
20011 -3911 22195 35302 28249 26076 14288 10851 -5636 -4262 24163 45455 61849 23599 -14560
19998 -14560 -10877 1310 11193 433 9578 20231 -1611 -18920 21375 26288 25234 7513 -17270
19985 -17270 -10041 12993 12659 11141 10158 -11573 -16208 -24908 -17762 -9334 -8916 -5475 -20434 -39138
19971 -39138 -41742 -14038 -10188 16182 25175 -3941 1795 37877 24405 -5242 -9600 -5729 -24535
19958 -24535 -2245 -1157 7004 16036 29654 30107 10929 -7606 -14480 5104 -9362 715 -17704
19945 -17704 -15018 -17568 -20664 -5146 -10413 -22362 1389 -22053 -48813 -47178 -30212 -6512 -4407
19932 -4407 -14882 -31468 -34301 -27093 -11803 -1657 -27989 -23307 -4887 17382 16343 -25785 -20280
19919b0280J1910O928q020L3923L6559q652k6797j0416j064k231r55O433k0018
19906b680j2709l819j5009J1815L1204K5662m191p534Q706K0345j1312R266j8739
19893C1005j2419J1628O443j1622j1736J6556l894l3841l555q67J1450M100J1393
19880A4641J5276j991k3413k328L355j2606o522q384K5105l028k685J779j1j5386
19866a6198J5289K5293K0439r955j9179l946j9593m166J6976L0647l3420l746
19854a559M774J7889J830j985j4357l3512K2278l483o664N170q665n749J6444
19841g589k2191k3668q297J5380L2162L2917k0191l0273j095J0534O478j0010
19829b5843j7073K9660j379N911j7817k9418j9823J1176L4881J2690j2520L6191
$$ plain form
19919 -20280 -8370 -1442 -9462 24461 61020 52368 25571 15155 14091 11860 10905 17338 -2680
19906 -2680 -15389 -19208 -34217 -22402 8802 34464 30273 22739 31445 51790 40478 49744 31005
19893 31005 18586 30214 36657 25035 13299 29855 25961 -7880 -11435 -12302 -852 3248 14641
19880 14641 29917 27926 4513 2185 5540 -7066 -13588 -21972 3133 105 -2580 -801 -812 -16198
19866 -16198 -909 24384 44823 34868 15689 11743 -7850 -12016 4960 35607 2187 -1559
19854 -1559 3215 21104 22934 20949 6592 -26920 -4642 -8125 -14789 -9619 -18284 -24033 -7589
19841 -7589 -29780 -53448 -61745 -46365 -14203 18714 -1477 -31750 -32845 -22311 -15833 -25843
19829 -25843 -42916 -13256 -14635 -8724 -26541 -55959 -75782 -64606 -29725 -17035 -29555 6636
19817F636K0970k1022j0675J501J8368J6065M245q148k3705n657l681j1456n57
19804a7116K0L1276P192q533j9709K2698j0965j5735j1193M592K5249O099n386
19791H489q329J1657J1300M776Q846l2962j2429K7144J2686j6599j3616P356M1844
19778E0163K5403L317l8146j2730n500l618M143J2624j293J6679J768l920k9492
19765A9398l9832j8720j3360q182J6689J0915n068J2447L7835L5727n843M13j3183
19752B9236j5505j6342J0913M686l406J3214L47j6741j2317R213n211O091K2363
19739B6541o201l430j2012k9603N777J1320n220M437O685k6j7007q479q228j3961
19725d9407j709j572J2999J3854K2956j987j1985J2392J8760j7727q911K6841
$$ plain form
19817 6636 27606 6584 -4091 -2590 15778 31843 36088 27940 4235 -1422 -5103 -16559 -17116
19804 -17116 -17096 14180 21372 12839 -6870 15828 4863 -10872 -22065 -17473 7776 13875 8489
19791 8489 160 11817 23117 27893 36739 3777 -8652 18492 31178 14579 963 8319 50163
19778 50163 75566 78883 40737 28007 22507 18889 23032 35656 34363 51042 52810 48890 19398
19765 19398 -20434 -39154 -52514 -60696 -44007 -33092 -38160 -25713 12122 47849 42006 42419 29236
19752 29236 13731 -2611 8302 12988 9582 22796 23143 6402 -5915 3298 -1913 4178 26541
19739 26541 20340 16910 4898 -24705 -18928 -7608 -12828 -8391 -1706 -1732 -18739 -27218 -35446 -49407
19725 -49407 -51116 -52688 -39689 -25835 -2879 -4866 -16851 -4459 14301 -3426 -12337 14504
19713A4504K0958j2270j1185j2955r423j9739j1425j2325l339L3945K7540J706
19701E992Q182K0397K0362l6007l3533J1241o115P365J7562j1664k727k717J1668
19688A0006o919k0160l992K0074J2870J0800n664j4879p379O205N27k4070K6302
19675C721K7619k0595l2983j876J4133M548J8717K6336j817m24M552M747o075
19662D0603j7881K0918J2843k8785k0269j7890j625R261k0249j5177o447J4091
19650c0607J9892L651R002K9414K448j5884J7925j0984j3678j5406r982r078J0397
19637a2890L0163l753p818o341Q578l4933Q178M581j4416j1553J92Q493K6614
19624d905N313j8596k5297r619J5781K8150L1162q646j5781j024k751J4918j8249
$$ plain form
19713 14504 35462 23192 12007 -948 -10371 -30110 -41535 -53860 -57199 -23254 4286 5992
19701 5992 14174 34571 54933 18926 -14607 -3366 -9481 -2116 15446 3782 1055 -1662 10006
19688 10006 3087 -17073 -21065 -991 11879 22679 17015 2136 -5243 962 1489 -22581 3721
19675 3721 31340 10745 -22238 -24114 -9981 -5433 13284 39620 37803 37379 41931 46678 40603
19662 40603 22722 43640 56483 27698 7429 -10461 -12086 -2825 -23074 -38251 -44698 -30607
19650 -30607 -10715 -7064 1938 31352 33800 17916 35841 24857 11179 -4227 -14209 -23287 -12890
19637 -12890 17273 13520 5702 -639 7939 -26994 -18816 -14235 -28651 -40204 -40012 -31519 -4905
19624 -4905 408 -18188 -43485 -53104 -37323 -9173 21989 13343 -2438 -3462 -6213 8705 -9544
19611i544j4390j7449Q796K4525R528j4159m025n587K8202K7422Q853m946j8101
19598A9125m5521l3463J3766K9902J3388K0369j6030r164j8406k2666K9429L0057
19586A0786j0443k7890j8261j6586J217J7859K5211j0397J6400m308j7505k2829
19574e6746L930K4463L2977q061j8082K5383J0311k852j8558O394J0791q758n928
19561d736n7j7563l2413J278N115j98j7720Q376k7141j5722K1571N6276K6537
19548C603k8343J3675K4232k9148k2504j0642J6220K3475j359k3852J3825L4032
19536A3214j7851l3163j9174k435L4922n837q510J9119L731j8210k5891L3710
19524b6375o629J085k274N116O234k0448n053M5329P543k5788j7737K8170J6179
$$ plain form
19611 -9544 -23934 -41383 -32587 -8062 1466 -12693 -16718 -22305 5897 33319 42172 37226 19125
19598 19125 -26396 -59859 -46093 -16191 -2803 17566 1536 -7628 -26034 -48700 -19271 10786
19586 10786 343 -27547 -45808 -62394 -61177 -43318 -18107 -28504 -12104 -16412 -33917 -56746
19574 -56746 -52816 -28353 4624 -3437 -21519 3864 14175 11323 -7235 -841 9950 1192 -4736
19561 -4736 -4793 -22356 -54769 -53491 -48376 -48574 -66294 -57918 -85059 -100781 -79210 -22934 3603
19548 3603 -24740 -11065 13167 -15981 -38485 -49127 -32907 -9432 -10791 -34643 -20818 13214
19536 13214 -4637 -37800 -56974 -59409 -24487 -30324 -38834 -19715 -15984 -34194 -60085 -26375
19524 -26375 -33004 -31919 -34193 -29077 -22843 -43291 -48344 -3015 4528 -21260 -38997 -10827 5352
19511E352j7590j6258j7318K7635J0433k9562J1878L3661J546j5930K861J4219
19499A0927o140o447J3460J173j9940J2252N129j3643j6449J2969K4380J2784
19487C0455R808K699j1708N623p286l1755j6210J3433p182l1497r38J7685J0396
19474a6477n567k840J2846J0516K8221j4603j5741R865J0779k637j3613k4205
19462b3456M142P661J4485l0203l0918J8929P95O311L488j2394l036N0123L6423
19449D2350j8413l4905o368J6940L1863k3961l4956r349l342l3874J0661K3792
19437c9562O581m194j1461K1369M3560k641q546L0826l29k2478L915L8335l4712
19424B0663N633R881j3122j788j4311k8980l2750N33L7190K8334p551L044J5552
$$ plain form
19511 5352 -12238 -28496 -45814 -18179 -7746 -37308 -25430 8231 9777 -6153 -3292 10927
19499 10927 4787 -1660 11800 12973 -6967 5285 10414 -3229 -19678 -6709 17671 30455
19487 30455 40263 42962 31254 36877 29591 -2164 -18374 -4941 -12123 -43620 -44558 -26873 -16477
19474 -16477 -22044 -24884 -12038 -1522 26699 12096 -3645 6220 16999 14362 749 -23456
19462 -23456 -19314 -11653 2832 -27371 -58289 -39360 -38565 -32254 -28766 -41160 -44196 5927 42350
19449 42350 23937 -10968 -17336 -396 31467 7506 -27450 -36799 -40141 -74015 -63354 -39562
19437 -39562 -32981 -37175 -48636 -27267 16293 13652 5106 35932 35603 13125 17040 55375 20663
19424 20663 26296 36177 23055 21267 6956 -22024 -54774 -54241 -17051 11283 3732 6776 22328
19411B2328J3526N851j1652m2594n933R038p182J6693O358Q61J9461K796j9406
19398A0145o736J8165M042q863r831J0636l2704L293J2878p21l0179J0858m98
19385a9515K970K52j1732k141K0189L2392j678j6323k8638P487J3819p632l973
19372a4523L0841r8l2075l366P502J753K579J9201j5031k7244j0975J2764Q579
19359b0093k989J2882M322P461O193J6565k2855j7205j7554l080J3946J2443K756
19346g208J5934J5527o116j5462r941p428k0337K2414o148K3100J0985R284J3874
19333C8478j0178l453j0475m447J4057j3211l9191R432L2224k1088o142J0381
19321c613j2858k7000J142M69k060K2222J0847L710k0936J637J8364R214R230
$$ plain form
19411 22328 35854 41705 30053 -12541 -18474 -9436 -16618 75 6433 7294 26755 29551 10145
19398 10145 3409 21574 25616 16753 6922 17558 -15146 -11853 1025 304 -29875 -19017 -19515
19385 -19515 -16545 -16293 -28025 -30166 -9977 22415 20737 4414 -24224 -16737 -2918 -10550 -14523
19372 -14523 16318 16220 -15855 -19221 -11719 -9966 -7387 11814 -3217 -30461 -41436 -28672 -20093
19359 -20093 -23082 -10200 -5878 1583 7776 24341 1486 -15719 -33273 -36353 -22407 -9964 -7208
19346 -7208 8726 24253 18137 2675 -7266 -14694 -35031 -12617 -18765 4335 15320 24604 38478
19333 38478 28300 24847 14372 9925 23982 10771 -28420 -18988 13236 -7852 -13994 -3613
19321 -3613 -16471 -43471 -42329 -41860 -43920 -21698 -10851 -7141 -28077 -26440 -8076 1138 10368
19308A0368J816P660J9193l540j8271k0603j4515j3123m322R217K563O572J9746
19295B761j4622k0832M928k4998m328L2490J6547O389l8219J5702L134j5795o275
19282d3118J8095J1790N110j4619j8611J5215K6111p970p147J4656K4452J2884
19270C6848l3065r006J7747J4945j9580k903o048L762j2063l152J3981J4348P091
19257B2905l70K1715j9679l2845j6404K2277Q399k5566N358K4974j2147J4140
19245A2757L8465q866j3322m005p387k3725J973j049j177l451J2133J613J8301
19232B2260k7221l6847o114q5R323K9716n838n65Q64R884Q916k9958j960J3742
19218a3883N731J5260k0485j3959j0535j153J0882n091p379l248M080K9340K9986
$$ plain form
19308 10368 12184 19844 39037 35497 17226 -3377 -17892 -31015 -35337 -26120 -23557 -16985 2761
19295 2761 -11861 -32693 -27765 -52763 -57091 -24601 -8054 -1665 -39884 -24182 -21048 -36843 -43118
19282 -43118 -25023 -13233 -8123 -22742 -41353 -26138 -27 -7997 -15144 -488 23964 36848
19270 36848 3783 -5223 12524 27469 7889 4986 -1062 2700 -9363 -12515 1466 15814 22905
19257 22905 22535 44250 24571 -8274 -24678 -2401 5998 -19568 -14210 10764 -1383 12757
19245 12757 51222 42356 29034 25029 17642 -6083 -4110 -5159 -6336 -9787 2346 3959 22260
19232 22260 -4961 -41808 -47922 -48007 -38684 -8968 -14806 -15371 -14507 -4623 4293 -25665 -27625 -13883
19218 -13883 -8152 7108 -13377 -27336 -37871 -39024 -28142 -33233 -40612 -43860 -39780 -10440 19546
19205A9546O605k4842R699K5170l2198j4579Q003j3228k5078o742o009K2989L9293
19192H629J8825n211l3179n925n83j0334N457j3778j0271J6153J4751o116N903
19179a5679l0545j2063L7723L7281J5330j6819N149M353P63j5097j6957r495j4659
19166c0715j0427J2016k2791k9488J8235K1617P896K5056P382L752j2954n896
19154a6317J068J1927j1892j3604M748J4805M311l0173K2255J5722k8719j1219
19142c7088K7654J6653K226O944j3095k8199P6K3363R690j7580k0073m512J7546
19129a6395K035N858Q787L584j4672o35O262N23k187K7505J4738n060o851j3226
19115A0266o924m2O227J4522j7872O932l3013l9349J3698O616N995J9536J146
$$ plain form
19205 19546 26151 1309 11008 36178 3980 -10599 -2596 -15824 -40902 -47644 -53653 -30664 8629
19192 8629 27454 22243 -10936 -16861 -17444 -27778 -22321 -36099 -46370 -30217 -15466 -21582 -15679
19179 -15679 -46224 -58287 -20564 16717 32047 15228 20377 24730 25493 10396 -6561 -16056 -30715
19166 -30715 -41142 -29126 -51917 -81405 -63170 -41553 -33657 -8601 -1219 2533 -10421 -16317
19154 -16317 -15249 -3322 -15214 -28818 -24070 -9265 -4954 -35127 -12872 2850 -25869 -37088
19142 -37088 -9434 7219 9445 16389 3294 -24905 -24829 -1466 8224 -9356 -29429 -33941 -16395
19129 -16395 -14360 -8502 285 3869 -10803 -11438 -5176 -4653 -6840 20665 35403 30343 23492 10266
19115 10266 3342 3300 9527 24049 6177 13109 -19904 -59253 -45555 -38939 -32944 -13408 -12262
19102a2262j2841l4108k8100J2801L4479L7819o107k579N872O614j6960J6273
19090I01L083J44K1941j8823l7003l630K2239K4455J8711j3965k5932p926j5732
19077c1537k1172L191K7847K104j0061j1186k5513J1223J6992J0485n361o177
19065c9165K7540J1766J0578J358k6489j6531M0695n332N46K003k0041m362o853
19052b4287K5577J7759j7293N918J610J2284p485k868m550j1358j5821J6038L692
19039g84k296k811J1011j7046n284K5407J0748l3858l1620j84J515K5313K763
19026a7126J3184J7434n284k4406j8594k650K1909J1161J2142j2852l556o955
19014a5593j2090K1695K0739k5609k754J4350L509j1147k6301k3848M249L533
$$ plain form
19102 -12262 -25103 -59211 -87311 -74510 -40031 -2212 -8319 -10898 -5026 1588 -15372 901
19090 901 3984 4128 26069 7246 -29757 -33387 -11148 13307 32018 18053 -7879 -15805 -31537
19077 -31537 -52709 -49518 -21671 -19567 -29628 -40814 -66327 -55104 -38112 -27627 -32988 -39165
19065 -39165 -11625 141 10719 12077 -14412 -30943 9752 4420 4966 6969 -13072 -17434 -24287
19052 -24287 1290 19049 1756 7674 9284 21568 14083 11215 6665 -4693 -20514 -4476 -784
19039 -784 -3080 -5891 5120 -11926 -17210 8197 18945 -14913 -46533 -46717 -45202 -19889 -17126
19026 -17126 -3942 13492 8208 -16198 -34792 -37442 -15533 -4372 7770 -5082 -8638 -15593
19014 -15593 -27683 -5988 14751 -10858 -13612 738 4247 -6900 -33201 -57049 -52800 -49267
19002d9267J8542K796J3856N339p977l518J6238J4912Q854m127J798K309j4796
18989D959k0764J809O253K3481N428L588k3497m7262L5856J9117l675l790Q382
18976I885OJ5034k3081j3419J5050n091J5715r476j1815N39M58j1786j3767K8392
18962c356l725J9937Q586o387q952o133J5641L0656k3822J1765j0696l8144j7703
18949c2333J1042J3244L7162J3448K276l6989k2419j8431l147J6654k7P141m329
18936a6708J1655j2893o092M1k7109J5867L2441M2963J2467l571k2077k5356j6818
18923a5190l8435j6070K1582M2953J2895N74O973k152M3144j8866l0231k810K0069
18910B4436j0208p161l519M282P802K2751k8689q851J7991K4134K6723m265m7277
$$ plain form
19002 -49267 -30725 -27929 -14073 -8734 -16711 -20229 -3991 10921 19775 15648 17446 19755 4959
18989 4959 -15805 -13996 -7743 15738 21166 24754 1257 -46005 -10149 8968 5293 1503 9885
18976 9885 9891 24925 1844 -11575 3475 -1616 14099 4623 -7192 -6653 -6195 -17981 -31748 -3356
18962 -3356 -7081 12856 21442 15055 6103 -30 15611 46267 22445 34210 23514 -14630 -32333
18949 -32333 -21291 -8047 29115 42563 44839 7850 -14569 -33000 -36147 -19493 -19520 -12379 -16708
18936 -16708 -5053 -17946 -24038 -23997 -51106 -35239 -2798 40165 52632 49061 26984 1628 -15190
18923 -15190 -53625 -69695 -48113 -5160 7735 8309 15282 13130 56274 37408 7177 4367 24436
18910 24436 14228 7067 3548 7830 15632 38383 9694 843 18834 42968 69691 65426 18149
18897A8149l9663R552J2067l7095q372R86n85L5119P609J3926K924J206M337L3011
18883E3171J788k5466l6063j3270L2531J6388l649J3335O73m5927j48j905J725
18870f817L3453j8225k3000M629K388P340j950k6066K0228J8994j7218J1131J912
18857F799n1387M618J0829P965r218O085K0825k979K266K495j5086N540K1856
18844A0608J2644k6385j4039P479R740k2838J9423L0878j9475j7861L040K0413
18832A3627q776q645J7814K1424J2104k38j725j8164l2577Q324J9775M689j4027
18819A3605p173j2759L365N076j7555R446J1043p15M104P794J5863Q185m1111
18806h32K3551K0835k9737l2712j4743P315J8534n732q366J2078J7498j510q705
$$ plain form
18897 18149 -21514 -11962 105 -36990 -45362 -44376 -44961 -9842 -2233 11693 14617 15823 20160 53171
18883 53171 54959 29493 -6570 -19840 12691 29079 25430 38765 39438 -6489 -6637 -8542 -6817
18870 -6817 26636 8411 -14589 -9960 -7572 -232 -2182 -28248 -8020 10974 -6244 4887 6799
18857 6799 -44588 -39970 -29141 -21176 -30394 -24309 -3484 -6463 -4197 -1702 -16788 -11248 10608
18844 10608 23252 -3133 -17172 -9693 47 -22791 -3368 27510 8035 -9826 -6786 13627
18832 13627 4851 -3794 14020 35444 47548 47310 45585 27421 -5156 3168 22943 27632 13605
18819 13605 6432 -6327 -2962 2114 -15441 -5995 5048 4333 8437 16231 32094 40279 -832
18806 -832 22719 43554 13817 -18895 -33638 -26323 -7789 -13521 -21887 -9809 7689 6179 -2526
18793b526j2931q97L1456J6784P922k7220j0655Q16K1941R531L653N473o434j2468
18779B4445o436q87Q167j1491l6342n494N041J4139M3085J1648K4372R6466R5362
18766B62075r89n4084p5294j6596l9624k4148O112m379j722k93q987M039K1066
18753F7176J5023k453m1535j9277Q118J5828l2082j5051k296m489j1318j66J3215
18740i307L562O319J316J5964L305L748K1608j1206n3401l426M87k2693K5846
18727a7878N3940J030j8912M059J6657K868j6649j6913J0049m257j954j3392J2861
18714A1509M33P145m476J8455p203l377N254k3308r15J2341k0809l626J6772m862
18700C333j9111p795J4865j3965J2058J738Q980K2776K5156J4099l7515j907o013
$$ plain form
18793 -2526 -15457 -16354 15102 31886 39808 12588 1933 2749 24690 34221 37874 43347 36913 24445
18779 24445 18009 17122 25289 13798 -22544 -28038 -22997 -8858 34227 45875 70247 166713 262075
18766 262075 261086 207002 131708 115112 75488 51340 57452 53073 51351 51058 42071 46110 67176
18753 67176 82199 79746 38211 18934 27052 42880 10798 -4253 -6549 -11038 -22356 -22522 -9307
18740 -9307 -5745 574 1890 17854 21159 24907 46515 35309 -18092 -21518 -21031 -43724 -17878
18727 -17878 36062 37092 18180 22239 38896 41764 25115 8202 18251 13994 12040 -1352 11509
18714 11509 11942 19087 14611 33066 25863 22486 27740 4432 3517 15858 -4951 -8577 8195 3333
18700 3333 -15778 -23573 -8708 -22673 -10615 -8877 103 22879 48035 62134 24619 22712 16699
18687A6699j9110o923J530N992J5604J8433q745n974O221L4665J3130r591j1966
18674D9965l1571n5314j1258K1329P615J4989K2645l395q441j144k0284k1627
18662c6491n501L5317R121M239L43k1305j0796j0630j161L8675J6109l3590l4544
18649e0214L5264Q524m7723R187K8728L182J6516J3267j6199K3145r074k9794
18637a5191J2627J7510j7931K397K2524J2495j09j125k6850l6333R782L4415j6532
18624b321L164K2567J5380j9651R324J0746r798k2411J1024J364q757k1190n221
18611a5780O547J5789J4023j1599O906j444K301o816k883k2307j7242P905N0609
18598B6009R98m0697K046j6363K1990K3093q748j9903j718M0796L8283k3763l6127
$$ plain form
18687 16699 -2411 -9334 -7804 -1812 13792 32225 23480 17506 23727 58392 71522 61931 49965
18674 49965 18394 -36920 -48178 -26849 -19234 -4245 18400 15005 6564 5420 -14864 -36491
18662 -36491 -41992 -6675 2446 6685 7028 -14277 -25073 -35703 -36864 1811 17920 -15670 -50214
18649 -50214 -14950 -6426 -54149 -44962 -16234 -13052 3464 16731 532 23677 14603 -15191
18637 -15191 -2564 14946 -2985 -588 21936 34431 34322 33197 6347 -29986 -20204 14211 -2321
18624 -2321 843 23410 38790 19139 28463 39209 29411 7000 18024 19388 10631 -10559 -15780
18611 -15780 -9233 6556 20579 8980 15886 14442 16743 9927 7044 -15263 -32505 -24600 26009
18598 26009 27007 -13690 -11644 -28007 -6017 17076 8328 -11575 -13293 27503 65786 42023 5896
18585E896j7394j7929q354K7713j7725L7581K1116k7706m567R067N299J3320O31
18572B6948N731j6252m861j6447K6650Q042J1529M965l5048l4729R344n078k175
18559b1381M763j2892K320K986L0127K7800q557K583J0455l1660k2210m104j1482
18546c1252k3511J348K7516L5762O062K0803l2171m2226J1269L2818L3647j4882
18534B5183j8905p395k069O930l082L871K5343L802j3056k0796N643J6252J1290
18521C3011J2602M333j5995l274J627p619J2117J0454p795j5298L332M213l079
18508B8629k8342k3589K8706o394j0791R642L4820j1762l93k770k3958p710n283
18495a9195O597p836K2733L0229K443j4449J2282l502J7885K4067n351k0991p210
$$ plain form
18585 5896 -11498 -29427 -37781 -10068 -27793 9788 30904 3198 -1369 7698 12997 26317 26948
18572 26948 32679 16427 11566 -4881 21769 29811 41340 46305 11257 -23472 -14128 -19206 -21381
18559 -21381 -16618 -29510 -27190 -24204 5923 33723 25166 27749 38204 6544 -15666 -19770 -31252
18546 -31252 -54763 -53415 -25899 9863 15925 36728 4557 -37669 -26400 6418 40065 25183
18534 25183 6278 -1117 -3186 3744 662 4533 29876 33678 20622 -174 5469 21721 33011
18521 33011 45613 49946 33951 30677 32304 24685 36802 47256 39461 24163 27495 31708 28629
18508 28629 287 -23302 5404 -990 -11781 -2139 32681 20919 20526 17756 -6202 -13912 -19195
18495 -19195 -12598 -20434 2299 32528 34971 20522 32804 29302 47187 71254 65903 44912 37702
18482C7702k2281k3914k731k0187k7490M208J4766L1111K8108j7696j4381K051
18470a0734J3670J1149M135j1851O74K344o4538J180N3232L7694j3879k9384k6522
18457c2830K0153O08l0874j6667K6504L780O001J6754L4987k07k049K396j0520
18444A8036q851j0674R088j15j8962M630J9793j6034j499J8914P008K1948J7216
18431F0498j4488k1450O818q759j4085M371p171O284L1188J8998l2744O546j3563
18418B2443j0226J2324J9454m056J5484j4042k0438l436j345m933J494j2000l0031
18405b9308K1930J6167K6259J40k521n849l2512j1718J5162L6151K7146P959q204
18392F0802J787k1341k6263K62j2865N551J2786J8845l2902j4909M949r131j389
$$ plain form
18482 37702 15421 -8493 -11224 -31411 -58901 -54693 -39927 -8816 19292 1596 -12785 -10734
18470 -10734 2936 14085 18220 6369 7043 9387 -55151 -53971 -739 36955 23076 -6308 -32830
18457 -32830 -12677 -12069 -42943 -59610 -33106 -29326 -23325 -6571 28416 28209 26160 28556 18036
18444 18036 9185 -1489 7599 7484 -11478 -6848 12945 -3089 -4588 14326 21334 43282 60498
18431 60498 46010 24560 31378 22619 8534 12905 5734 12018 43206 62204 29460 36006 22443
18418 22443 12217 24541 43995 39939 55423 41381 20943 17507 16162 11229 12723 723 -29308
18405 -29308 -7378 8789 35048 35188 32667 26818 -5694 -17412 -2250 33901 61047 69006 60802
18392 60802 62589 41248 14985 15247 2382 7933 20719 39564 6662 -8247 -3298 -12429 -13818
18379a3818J2725L3197J8762K1178k4096l5411j821J8468n878P6J1171K3244j7542
18366D0255n635K734r329m124j4394k894j6307j23K6795k5475j0083L9723J6137
18353C7280Q110K687k0518l6869k8155J020k969j1791J1908K3254K056J3008J0887
18340I908K2599k3897J4102j3009k2889l868L741L1434K5515j3349o913J0622
18328C3996K1252J8098J2709k5399j4850K3323O861j1158j6921k5320j1820l6788
18316b6017O234q225J4336l452J6848K7665J262k9607o52o349L9274K9217q930
18303E1604K844m780r368j6217J0720P625J3244j567m4980j2276Q068J7511M2880
18290F5308L2600m0560j1078P815L322k3549m1217K9737Q212k638j3629m3825
$$ plain form
18379 -13818 -1093 32104 50866 72044 47948 12537 10716 29184 23306 23382 34553 57797 40255
18366 40255 34620 37354 28025 23901 9507 6613 -9694 -9817 16978 -8497 -18580 21143 37280
18353 37280 45390 48077 27559 -9310 -37465 -36445 -39414 -51205 -39297 -16043 -13987 -979 9908
18340 9908 32507 8610 22712 9703 -13186 -17054 -13313 18121 43636 30287 23374 33996
18328 33996 55248 73346 86055 60656 45806 69129 75990 64832 47911 22591 10771 -26017
18316 -26017 -19783 -28008 -13672 -17124 -276 27389 28651 -956 -1608 -7957 31317 60534 51604
18303 51604 54448 49668 40300 24083 34803 42428 55672 54105 9125 -3151 4917 22428 65308
18290 65308 97908 57348 46270 54085 57407 33858 -7359 22378 30590 27952 14323 -29502
18278b9502o271N374J4976K5517O653o417P282K2090j9529k753Q205J3469P803
18265D6897O378J4872r694j5618o578J0667J707j5136J3648Q390l1688n257K7382
18252D5970j1516R413j0662J9885m522l361P020J2298J794N829P326J2118R760
18239A01352p04k118Q49j3141l3257j076J3643k885K3682J0413k930M049q388
18226H9489k7362o329j3749l639P318L051J813R374m961j307n872l2722j5303
18213a99K734o948J0500L5728J8103M485k3555J1869P730L5230K0735R633L9171
18200A65216L087N2846N1772M146o346j041J7246L7854M6926M3797K8183l1962
18188D11724o3579m2322k7141k662J2868J0217k6345j4674J3257L3311P1193R2823
$$ plain form
18278 -29502 -35773 -30399 -15423 10094 16747 10330 17612 39702 20173 17420 25625 39094 46897
18265 46897 53275 68147 58453 42835 36257 46924 48631 33495 47143 55533 23845 18588 45970
18252 45970 34454 43867 33205 53090 48568 45207 52227 64525 66319 72148 79474 91592 101352
18239 101352 100648 98530 99379 86238 52981 51905 65548 62663 86345 96758 93828 97877 89489
18226 89489 62127 55798 42049 38410 45728 48779 50592 59966 55005 53698 47826 15104 -199
18213 -199 2535 -4413 6087 41815 59918 64403 40848 52717 60447 95677 116412 126045 165216
18200 165216 168303 221149 272921 277067 270721 269680 286926 324780 371706 415503 443686 411724
18188 411724 348145 305823 278682 276020 288888 299105 272760 258086 271343 304654 375847 468670
18176D68670N5428L7990q782n9158q9986o8757p2854l2223M0069O6332M2929j1305
18164C68353l4682l6367m9589j0612l1218k8258K077n885J3397P288J403J9424
18152B15331j754j7159k210K861K7954Q2010P4697L8653m001l4718m7258j5105
18140C19301l5762J1725K4722M4096L1164N3121J19555J31889L5110l8237o6505
18129F30179l3402N7829R4596J67790J49808M9350k3143l0306L2178J06907J58413
18118A360199K92256M13938N30162O72189J059117J868199L831534Q589025J6453369
18109C5069988J5193901J994699q730078j6637324j1466124n533909k919571j764462
18101E207120j191669q02640n61612m27969l16756k54617k02146j35428j35954
$$ plain form
18176 468670 524098 562088 553306 494148 404162 335405 262551 230328 270397 336729 379658 368353
18164 368353 333671 297304 247715 237103 205885 177627 179704 173819 187216 194504 195907 215331
18152 215331 213577 196418 194208 197069 225023 307033 381730 420383 416382 381664 334406 319301
18140 319301 283539 295264 319986 364082 395246 448367 567922 699811 734921 696684 630179
18129 630179 596777 654606 749202 916992 1066800 1116150 1093007 1062701 1094879 1201786 1360199
18118 1360199 1652455 2066393 2596555 3268744 4327861 6196060 10027594 18616619 35069988
18109 35069988 50263889 52258588 43528510 26891186 15425062 9891153 6971582 5207120
18101 5207120 4015451 3212811 2651199 2223230 1906474 1651857 1449711 1314283 1178329
18092A178329j18898j01399q2918p2850r6194m4677l3933k7366k1868k4085l8115
18081E16026p6464l6264k5549j9681q133R903o676m3794k9368j3779l2639l0780
18069B02802l6754j1002k1015r923R384J7586K1509J3536j4726m6191J867j6244
18057A10829k1683J7656q947O442K6806j547j9525L0189Q696j5227k8310q418
18045I6961R729j594N439m259p655L091P796P813k2751K8502K3375r824J2541
18032A49164k132j9786k5754R420J0373k2725m270K5013K7435R584o712J3856
18020A63466J1655l85k474J6177j0631k3419k8365k3708J6302K2803K0456J7853
18008A79730J2266n46j0653K2475N0845J9943J4596K7435L0091K8954R713l9607
$$ plain form
18092 1178329 1059431 958032 875114 802264 706070 661393 627460 600094 578226 554141 516026
18081 516026 439562 403298 377749 358068 349935 359838 353162 309368 280000 266221 233582 202802
18069 202802 166048 155046 134031 124108 133492 151078 172587 186123 171397 125206 127073 110829
18057 110829 89146 106802 97855 104297 131103 129556 110031 140220 148916 133689 105379 96961
18045 96961 106690 105096 110535 106276 98621 101712 109508 117321 94570 123072 146447 136623 149164
18032 149164 147032 127246 101492 110912 121285 98560 94290 119303 146738 156322 149610 163466
18020 163466 175121 174736 172262 188439 177808 154389 126024 102316 118618 141421 161877 179730
18008 179730 191996 191450 180797 203272 254117 274060 288656 316091 346182 375136 384849 345242
17996C45242l4657o536J0961J1119M7614L9785k4220J0081L335J162L398o342
17984D00942j004R114J7910n321l153j5752k6679o0954n6644k7630J6437L7863
17972B85129K1595n418P643r819k2521k273m5667k4740j4336j8249J3799P28m6228
17959A39643M638J5454J2508O770J84K5397M3115O7490P3166J1837j8885P865
17947C89182L0304m076j5701K1968P9793M7251M1126J2160R185j0069o6196o4845
17935D70082L1191L8377k8062m6439k5739k0580q038l5732l884L1343O4055L8069
17923E04643K9868K5994l7038n0690n5861r923j4698l439m9284l4555k4573k9376
17911B51068m5818N162k1993j0392r777k1359J89o484m221l7267k3005K8959O674
$$ plain form
17996 345242 310585 304049 315010 326129 373743 413528 389308 399389 402724 403886 407284 400942
17984 400942 399938 409052 426962 421641 418488 402736 376057 315103 258459 230829 247266 285129
17972 285129 306724 301306 308949 299130 276609 274336 228669 203929 189593 171344 185143 185871 139643
17959 139643 144281 159735 172243 179013 179197 204594 247709 315199 388365 400202 381317 389182
17947 389182 419486 415410 399709 421677 501470 548721 589847 602007 611192 601123 534927 470082
17935 470082 501273 539650 511588 465149 439410 418830 410792 375060 371176 402519 466574 504643
17923 504643 534511 560505 523467 472777 416916 406993 392295 388856 339572 305017 280444 251068
17911 251068 205250 210412 188419 178027 168250 146891 147080 140596 136375 99108 76103 105062 111736
17898A11736N175j5668L348j0132M092L0134n159P740J3392j1364L7788J5023
17886A86105k1063l9327r419J6098L644J204k0111j8527K2407O3598M7023L8781
17874B70413M1210M134j678k3122k4742k4571o3595l9917Q724J4578k7154k9566
17862A04714R124M255J6146r135J8545J461m314r368l3624j4654K980L5565J3479
17849A35174k6330k9611j1712J4883j602j4939K2759K9323Q073j328j2780r010
17837A02900k0833q9J8667J5115J6883J9278L4616J8318O872r612J1738J0126
17825B23979m9287n0696j8072l144M6509K8427Q821N3834P0937K5250k0736l4296
17813B81526l3128j3284q062p431J2079K1596l2071l6465J9149L1313q448j2304
$$ plain form
17898 111736 116911 101243 104591 94459 98551 128685 123526 131266 144658 133294 171082 186105
17886 186105 165042 125715 116296 132394 136038 137242 117131 98604 121011 184609 231632 270413
17874 270413 311623 315757 314079 290957 266215 241644 178049 138132 146856 161434 134280 104714
17862 104714 113838 118093 134239 125104 143649 145110 140796 131428 97804 83150 86130 121695 135174
17849 135174 108844 79233 67521 82404 80802 65863 88622 117945 126018 124690 111910 102900
17837 102900 82067 81978 100645 115760 132643 151921 186537 204855 211727 202115 213853 223979
17825 223979 174692 123996 105924 102780 149289 177716 186537 240371 311308 336558 315822 281526
17813 281526 248398 235114 227052 219621 231700 253296 221225 184760 203909 235222 226774 214470
17801B14470J5242M323k414j8651n3717j5498P898m206J458j92M303N1651K2483
17788B27150J889P058q127m0581n1664R292K4933Q789P839n720j0832N3175M7937
17775B71138M5106L5659J6947Q389j4322k6519j617K1664L4750R1677J18247J77286
17763G78405L90226Q19843J131228N11216k50740q73753r09990m77408k57622
17754H61405j43514r3684o0345l6790k7444p419j1704K0084j9717m4226K4196
17743D60842K3055K1904O883M0954M2403o705k9291j1071o833J3310k3196k1227
17731E11028p216J6146R390n239J9634N1519P8462M7585M852k6774p139J9882
17719G12130M3337O2425O0141N6494M9729N0858O2403O5170J39558J71940K09589
$$ plain form
17801 214470 229712 234035 231621 212970 159253 143755 151653 147447 148905 148713 153016 204667 227150
17788 227150 229039 236097 227970 187389 135725 145017 169950 178739 186578 180858 170026 223201 271138
17775 271138 316244 351903 368850 377239 362917 336398 334781 356445 391195 482872 601119 778405
17763 778405 1168631 1988474 3119702 3630918 3380178 2506425 1596435 1119027 861405
17754 861405 717891 624207 563862 527072 499628 492209 480505 500589 480872 436646 460842
17743 460842 483897 505801 512684 553638 596041 589336 560045 548974 542141 555451 532255 511028
17731 511028 503812 519958 529348 524109 543743 595262 673724 721309 726161 699387 692248 712130
17719 712130 755467 817892 878033 934527 984256 1035114 1097517 1162687 1302245 1474185 1683774
17708A683774L04015M48368M87401M09335M77608O92626J229893K188873K640541
17699A0562434J578760j81595j613136j962805j382251p56725k15069J95416N01616
17690F726645P86256J048017J414285J876407K686875M248465P259050J3347774
17682C9393774K4654255L6713131L1664630J2667561o137667j9276901j9742680
17675I9936103j9795653j9086624j5921481j0238967n693772k783718m10195K417748
17667B8423441O275307R894665Q788099J595779o359148j1209948j0248554o826675
17659B0332966m216573k612942j601273j001084o59366n64142n35517m27970j63601
17650H550498J04908L00921M42274M28224M46482N80675R68818J695491K835002
$$ plain form
17708 1683774 1987789 2436157 2923558 3332893 3810501 4503127 5733020 7921893 10562434
17699 10562434 12141194 11959599 10346463 8383658 7001407 6244682 6029613 6225029 6726645
17690 6726645 7512901 8560918 9975203 11851610 14538485 18786950 26046000 39393774
17682 39393774 64048029 100761160 132425790 145093351 138955684 119678783 99936103
17675 99936103 80140450 61053826 45132345 34893378 29199606 26415888 26005693 28423441
17667 28423441 34698748 44593413 53381512 54977291 48618143 37408195 27159641 20332966
17659 20332966 16116393 13503451 11902178 10901094 10241728 9677586 9142069 8714099 8550498
17650 8550498 8655406 8956327 9398601 9826825 10273307 10853982 11822800 13518291 16353293
17641A6353293M836911Q402827J3198774J4991381Q878556j164170r454969j1651371
17633D4391232q087814l894576o54301K020743M757458Q659945J5678424K7244617
17625I0115728L9769750M9532164N4364600L8919267K286572l6967853n9731759
17618A78288469n6623410l8133125k2778064j4104858r098697o017973m343749
17611B7188593l422806k699489j931070j139720j78204J240644L509066O027270
17603B8594284N592690J086914l878821o984293o245409l865668k273237j515089
17595A0511371j330573j296797j170359r16225o47388m79205m33707l63088l27970
17586C546059l32445k75943k50402j85469j30786j09034j05712o2133p1114j09316
$$ plain form
17641 16353293 21190204 29593031 42791805 57783186 66661742 65497572 56042603 44391232
17633 44391232 36303418 32408842 31754541 33775284 38532742 47192687 62871111 90115728
17625 90115728 129885478 179417642 233782242 272701509 274988081 238020228 178288469
17618 178288469 121665059 83531934 60753870 46649012 37550315 31532342 27188593
17611 27188593 23765787 21066298 19135228 17995508 17817304 19057948 22567014 28594284
17603 28594284 34186974 35273888 31395067 24410774 18165365 14299697 12026460 10511371
17595 10511371 9180798 7884001 6713642 5797417 5150029 4670824 4237117 3874029 3546059
17586 3546059 3213614 2937671 2687269 2501800 2371014 2261980 2156268 2094135 2023021 1913705
17576A913705j30021j53377j42321m6366k4303n0914m6869l665R11j411r489m4828
17564A261052l5616l4346k9978j5300j6397l0269j9900l231k2978m314J2183K1575
17552A082481J4649k1355l1667q417J3084J0825l764L4325L4671J0759K6447q847
17540A153191J241l794K9098Q5153P0939N7640N5894M9863O0958O9831M1521K7595
17528A699130O7356O4969J11136J12639J32282J83672K52255L31219L77486M23660
17518C755804M74032M92587M85717M68564L76661L68229N02915Q59214J393183
17509I176906K159585L161908M026356M211251L189506J155528j045315k418513
17501B3617212k628094j949218j004910m6503Q22717J669278K673040M051745
$$ plain form
17576 1913705 1783684 1630307 1487986 1441620 1417317 1366403 1319534 1315869 1316780 1315369 1305880 1261052
17564 1261052 1225436 1191090 1161112 1145812 1129415 1099146 1079246 1076015 1053037 1048723 1060906 1082481
17552 1082481 1097130 1075775 1044108 1035691 1048775 1059600 1055836 1090161 1124832 1135591 1162038 1153191
17540 1153191 1154432 1150638 1179736 1264889 1335828 1393468 1449362 1499225 1560183 1630014 1671535 1699130
17528 1699130 1766486 1831455 1942591 2055230 2187512 2371184 2623439 2954658 3332144 3755804
17518 3755804 4229836 4722423 5208140 5676704 6053365 6421594 6924509 7783723 9176906
17509 9176906 11336491 14498399 18524755 22736006 25925512 27081040 26035725 23617212
17501 23617212 20989118 19039900 18034990 17988487 18811204 20480482 23153522 27205267
17493B7205267O088256R120968J3741637K0331693K8268328L5022049L5993415
17486A75771613K7690335J1263948p626023k2480216k9898984l0225639k6102395
17479I8392639k0323439j4570281r695561n773781k454673N10851L104500M636669
17471E3826924M187456J473067k635694o293299q106451p881966o493349m851049
17463B3225639l505006k512998j779078j309534q93563o14205m26139l19855k64522
17454A1600739j95020r5775Q1713L90001P78830J352402K232602L429394M861515
17445B4436401O143930O340665M828041J778984j566478l741822m064025k892962
17437C1262734r94348J298398M053055P199584J0450103J3268733J4994103J5130140
$$ plain form
17493 27205267 33293523 42414491 56156128 76487821 104756149 139778198 175771613
17486 175771613 203461948 214725896 207099873 184619657 154720673 124495034 98392639
17479 98392639 78069200 63498919 53803358 48029577 45574904 46085755 49190255 53826924
17471 53826924 58014380 59487447 56851753 50558454 42452003 34570037 28076688 23225639
17463 23225639 19720633 17207635 15428557 14119023 13225460 12611255 12185116 11865261 11600739
17454 11600739 11405719 11309944 11391657 11781658 12560488 13912890 16145492 19574886 24436401
17445 24436401 30580331 36920996 41749037 43528021 41961543 38219721 34155696 31262734
17437 31262734 30268386 31566784 35619839 42819423 53269526 66538259 81532362 96662502
17429I6662502J2921623P167540j762352j1197630j7556658j8935094j6272630
17422E1027301j2219999q615717o000009m232356l031535k197204j657215j227900
17414A1845366p96769l97271j9933M15744O87703O65827K09530m96503j153220
17405A0960474j498316j476269j217548q87722o23327m29160l09212l33327l25239
17396C860354l24715l13405l21232k94075k85395k03237j83060j26834q6775q6649
17386A634977r9194j03269o0087q3206m1930l5374k9183l0754l8342l6160k2284
17375A055194q3319n8389j2067m533N892j255j6255l4910o2995p8638j9807o0164
17363F28754l1603k777j6956j8147k2252r133k168J5979k802K2177N57k1754m4028
$$ plain form
17429 96662502 109584125 116751665 114989313 103791683 86235025 67299931 51027301
17422 51027301 38807302 30191585 24191576 19959220 16927685 14730481 13073266 11845366
17414 11845366 11048597 10651326 10631393 11047137 11734840 12400667 12610197 12113694 10960474
17405 10960474 9462158 7985889 6768341 5880619 5257292 4828132 4518920 4185593 3860354
17396 3860354 3535639 3222234 2901002 2606927 2321532 2118295 1935235 1808401 1721626 1634977
17386 1634977 1535783 1432514 1372427 1289221 1247291 1211917 1182734 1151980 1113638 1077478 1055194
17375 1055194 971875 913486 901419 896886 902778 901523 885268 850358 787363 708725 688918 628754
17363 628754 597151 594374 577418 559271 537019 527886 525718 541697 538895 561072 561629 539875 495847
17350D95847j9320J1784K8721j9372l2628m1769k6450q875Q064P347k9832p455
17338C66062M562m7779j6201k5590o80k5515q619M3374L8498J1373R123m650k0456
17325C23502M455Q370Q070m0487m1722j5440k3280M553l235J3446K7527N550j2991
17312B58318J877k688n047j1335l3630k1488r924J2519J6219M690J0874j8467
17300B01918j1517m221j475L657k275r584K8566K1578j0756n86o120P009k868
17287B13326J5717J4256j93l7707K180j5535j2821n204j8258J0311L9550J843
17275B07465O810J4099P832m46j3934p249J024k6792k9729K14o054K576J4353
17262A70169J3671Q705n420j996l3879k2372j588p208j0564j3024Q138j3136q013
$$ plain form
17350 495847 476527 488311 517032 497660 465032 423263 396813 387938 396002 403349 373517 366062
17338 366062 370624 322845 306644 281054 280374 254859 246240 289614 328112 339485 348608 343958 323502
17325 323502 327957 336327 344397 303910 262188 246748 223468 228021 224786 238232 265759 271309 258318
17312 258318 260195 257507 252460 241125 207495 186007 176083 188602 204821 209511 220385 201918
17300 201918 190401 186180 184705 188362 186087 176503 205069 226647 215891 215305 209185 216194 213326
17287 213326 229043 243299 243106 205399 207579 192044 179223 174019 155761 166072 205622 207465
17275 207465 214275 228374 236206 235760 221826 214577 215601 188809 159080 159294 153240 155816 170169
17262 170169 183840 192545 187125 185129 151250 128878 127290 120082 109518 96494 104632 91496 83483
17249H3483J8820M3374K3624j5673j2049q226P785j2122j212j1267K3621N598
17237A45756l2035q906K3670K1728M293j9132k6877p759k728K6559K5444j6063
17225A33950r738J4499p626j5943R637k0694q876J4079j0194j6562P156j151k1870
17212F6667j3338K1282K8839L4791k0219J2790Q463j8008l296M031k4962J1868
17200A08908K5338q96k1436M859K7325M0488L2906j6679k4692m174j3496j4764
17188A43687Q865P196M292j468k1377Q663Q999N341J8142M2640Q0025P4339L0858
17175D10202m633R274q036L0672R0534J03965K6329q5589j35193j13152m2208
17164B82165J1286K6244L3391M30J5330Q1102M9054N336M360K9856N6846N6709
$$ plain form
17249 83483 102303 145677 169301 153628 141579 133353 141138 129016 127804 116537 140158 145756
17237 145756 113721 104815 128485 150213 154506 135374 108497 100738 98010 124569 150013 133950
17225 133950 124212 138711 131085 115142 124779 104085 95209 109288 99094 82532 89688 88537 66667
17212 66667 53329 74611 103450 138241 118022 130812 139275 121267 117971 122002 97040 108908
17200 108908 134246 133350 111914 116773 144098 184586 217492 200813 176121 171947 158451 143687
17188 143687 152552 159748 164040 162572 141195 149858 158857 164198 182340 224980 305005 379344 410202
17175 410202 405569 414843 406807 437479 528013 631978 658307 572718 437525 324373 282165
17164 282165 293451 319695 353086 353516 368846 449948 499002 504338 508698 538554 595400 652109
17152F52109l5850p8535j01415p4782l851K1230J9718J6886J4956k1167p2011
17141C37288j02194n7844j7545j506r694k7732k7176L0243N2954K0805k2886l5078
17129A39635k080K149L9609K7632L2862J6059L406L289j9993l3991J9717K4537
17117B52831k3034K795K2081Q1M8080P7747M2268j8598o0442m5196j1626J8281
17105C05268R0103P2057O691o0174p1831o3811l8516k3125N4900J07201M2271
17094D21034J9834n4340j10811m8882k7029r717j9317r879P021k1875k9315j9130
17082I7594l1084m5948O692K3964n801j8966J544K0471k207r821l623k1221R578
17069B1172L035Q951J2647J9477l451j3147n83j4379m7546J3427J0717L1490L2654
$$ plain form
17152 652109 616259 537724 436309 361527 357676 378906 398624 415510 430466 409299 337288
17141 337288 235094 177250 159705 158199 148505 120773 93597 123840 176794 197599 174713 139635
17129 139635 137555 139704 179313 206945 239807 255866 259272 262561 242568 208577 228294 252831
17117 252831 229797 232592 254673 254754 302834 380581 422849 404251 343809 298613 286987 305268
17105 305268 395371 467428 474119 413945 342114 278303 239787 216662 271562 378763 421034
17094 421034 440868 386528 275717 226835 199806 190089 170772 160893 167914 146039 116724 97594
17082 97594 66510 20562 27254 51218 45417 26451 27995 48466 46259 36438 32815 11594 21172
17069 21172 24207 33158 45805 65282 61831 48684 48101 33722 -13824 -397 10320 41810 74464
17056G4464j559j2980K168q980m0444j1315K1012l983k527P238j6146j4717N305
17043b464R033o112p707J8347R688L122L653K6941J0357J1187k7306l2641o401
17030I697K6734L2186j6801m736n034k7660j6263j016J2819J7109K6O518K8030
17017F1609K5572P609k429P682m788j7623j3214p474O969K8951K8717L1430l3294
17004A19717k6358R858K4248R706M4208R1986N9114M5627L4451J2041j3607k338
16992D08653J2794K3251l471k9685K98m549l9586k5739j0931r671K7012N8831
16980D07207K009R847L6057J6895o689l9283o1892n2419m8787m6617k5013k7222
16968A64093j2348k388J3616J1906K3527j6527m052k1405q064o654m327R20J2647
$$ plain form
17056 74464 72905 59925 62093 53113 12669 1354 22366 18383 15856 23094 6948 -7769 -2464
17043 -2464 6569 457 -7250 11097 20785 23907 27560 54501 64858 76045 48739 16098 9697
17030 9697 36431 68617 51816 47080 42046 14386 -1877 -2893 9926 27035 27061 33579 61609
17017 61609 87181 94790 92361 100043 95255 77632 64418 56944 63913 92864 121581 153011 119717
17004 119717 93359 103217 127465 137171 181379 273365 332479 378106 412557 424598 410991 408653
16992 408653 421447 444698 441227 411542 411840 407291 367705 341966 331035 321364 348376 407207
16980 407207 409216 419063 455120 472015 465326 426043 364151 311732 262945 216328 191315 164093
16968 164093 151745 149357 162973 174879 198406 181879 177827 156422 148358 141704 137377 138297 150944
16955A50944J5725O139l8614k5855K9680R399Q615j7104K2860O7439M2081M1358
16943C12667L5976L4921J7658k1700O075M6438N7895J8839l923m1785m0030n4809
16931C68222q3574n2715k2466j8632p945J7326J4724J1562M42L4262K5998K7968
16919C15172N8665O0743j150k1864k0923j8659l6468o6663m5262m2433m7955l3959
16907I9244j4507l2120J6568k496q115k870l663K683p365j2512J8455J6147q420
16894F1029j4627K90M598L0377K0077j5765k4858j0958r518k0801N266k722J2291
16881C4679K3455L969O16j6984j9229n168O933K5622m450j2266r172R65l658j9072
16867F240N25l0452K8699L3863l2255j137N1080K2469l3126m7597j9115K7044
$$ plain form
16955 150944 166669 172808 134194 108339 138019 147418 156033 138929 161789 229228 271309 312667
16943 312667 348643 383564 401222 379522 385597 432035 489930 508769 504846 463061 423031 368222
16931 368222 284648 231933 209467 190835 182890 200216 214940 226502 226944 261206 287204 315172
16919 315172 373837 434580 433430 411566 390643 371984 335516 268853 223591 181158 133203 99244
16907 99244 84737 52617 69185 66689 58574 55704 52041 54724 47359 34847 53302 69449 61029
16894 61029 46402 46692 51290 81667 101744 85979 61121 50163 40645 19844 25110 22388 34679
16881 34679 58134 62103 62719 45735 26506 21338 28271 53893 49443 37177 28005 28970 25312 6240
16867 6240 6765 -23687 5012 38875 6620 5483 56563 79032 45906 -1691 -20806 6238
16855F238J4800k3129Q290K2371M369m292L1078k0291k0395P579J911O619j9561
16842A5587j7244k0012p99K9086N403J602K426J9140j0481J4387J5056j5351l330
16829C5470r860j0534N557j3921k5924J8416J4725m475K7018P287j4426Q459J0171
16816D7963q064J277K9002m710q200k3966k4842k9393n560K3196R239J0957N2812
16803F9711L4957j4960l5785k9439m060n152J9609J6610M259l12k0043m254K663
16790C3804k323k784L154J5109l8768o096K2605j7529j1477J8770J7196r662l2847
16777a0848J043j2416K1086L2438l227j7123j3269k2560p118p151J2890L5252
16765H997K0192k407k4354j5831n35L0420J5829k678o801p073o852l144J2676
$$ plain form
16855 6238 21038 -2091 6199 28570 32939 28647 59725 39434 19039 26618 28529 35148 15587
16842 15587 -1657 -21669 -22468 6618 12021 13623 16049 35189 24708 39095 54151 38800 35470
16829 35470 25610 15076 20633 6712 -19212 -796 13929 9454 36472 43759 29333 37792 47963
16816 47963 39899 41176 70178 65468 57268 33302 8460 -20933 -26493 -3297 5942 16899 69711
16803 69711 104668 89708 53923 24484 20424 15272 34881 51491 55750 55438 35395 31141 33804
16790 33804 31481 28697 31851 46960 8192 2096 24701 7172 -4305 14465 31661 21999 -10848
16777 -10848 -9805 -22221 -1135 31303 28076 10953 -2316 -24876 -31994 -39145 -26255 8997
16765 8997 29189 26782 2428 -13403 -13938 16482 32311 29633 22832 15759 8907 5763 18439
16752A8439m056J9132M839r248r591J6492k3853l705K5685k7027j2582J9866J5537
16739B9928k3802p276K6480j502M436j1474m38j2382q843K8983K9708p678l1662
16726A4478N803J0869Q388j106P83j0239j463n079q131n343K1746j0748L201N473
16712B8632p444m033J4750J148J0155j1272p302N776j5684l714J4935o465J9722
16699C9204L2294l3756l9618L964L168K8087P072k3467k2244O097j5529j2816
16687b7544L126J8262k899p864m017J0717J9082K4060o490L531J2390L135m9851
16674d362P35J5378l757n983M177j289j460N404q295K6120L0734j0716r665j2917
16660B4104k736J4306j434R502J2359N226J5366k1370o965j2387j0930J6763j0749
$$ plain form
16752 18439 14383 33515 38354 29106 19515 36007 12154 8449 34134 7107 -5475 14391 29928
16739 29928 6126 -1150 25330 23828 28264 16790 16352 3970 -4873 24110 53818 46140 14478
16726 14478 20281 31150 39538 38432 39215 28976 27513 22434 14303 8960 30706 19958 23159 28632
16712 28632 21188 17155 31905 33053 43208 31936 24634 30410 14726 11012 25947 19482 39204
16699 39204 71498 37742 -1876 2088 5256 33343 40415 16948 -5296 801 -14728 -27544
16687 -27544 -24418 -6156 -9055 -16919 -20936 -10219 8863 32923 26433 29964 42354 45489 -4362
16674 -4362 -3627 11751 7994 2011 6188 4899 3439 8843 548 26668 57402 46686 37021 24104
16660 24104 21368 35674 34240 43742 56101 61327 76693 55323 48358 35971 25041 41804 31055
16647C1055k0753j526K2061M815q308J4458J3189m068k4958k0539l2481L83K3006
16634c666K2116O553j1205p23o963j6882P228J0195L5269K7399K696k7821j3066
16621C1130j1299P758n823j4297m598r41l4325j774J5055O499r192k546J2160
16608a2193m33l994j5445J7480M753k5936J024L1018j1615L79K6949J3485j3699
16595A1773l9792k761N1430j7767j9405K2821J118M188L91k4865j4267K0936J5706
16582I506L061j1331j5373M685J910N988j6506j3352K1663j7531K963J3203J1474
16569C60K9049K151j6853k7482l7148J4760N1833O266m736j7423k2549K316L5896
16556A6440Q438J6746k8236k4388P194K868r258n100p811J9949J6820J0585J948
$$ plain form
16647 31055 10302 8776 30837 35652 27344 41802 54991 50923 25965 5426 -27055 -26672 -3666
16634 -3666 18450 25003 13798 13075 6112 -10770 -3542 6653 41922 69321 72017 44196 31130
16621 31130 19831 27589 21766 7469 2871 1930 -32395 -34169 -19114 -12615 -21807 -24353 -12193
16608 -12193 -12626 -16620 -32065 -14585 -9832 -35768 -34744 -3726 -15341 -14962 11987 25472 11773
16595 11773 -28019 -30780 20650 2883 -16522 6299 7417 11605 11996 -12869 -27136 -6200 9506
16582 9506 12567 1236 -14137 -9452 -7542 -1554 -18060 -31412 -9749 -27280 -24317 -11114 360
16569 360 29409 31560 14707 -12775 -49923 -35163 16670 22936 18200 777 -21772 -19456 16440
16556 16440 24878 41624 13388 -11000 -3806 -938 -10196 -15296 -23107 -3158 13662 24247 26195
16543B6195j7385k3066o895k4705l454J5532K4088O524K794q58J208Q986K2987
16530C1951J4260l4948l4520r741Q286j0459j4400K5178K2852K683o60P42j8830
16517a7606j4581J8509P993R550J8758J859Q224k8164j9470j8156l814J6252O497
16504a4149m421K2554o779j0905L3725L9116K966p823k7948j3971j3183j7949
16492a8767k248Q971M1588j4349j4214n457k7654o880L881M276n806k1669j0767
16479f9095l647K3306R781N987O859R280L44M651j937O881J9287J0820j6232p241
16465i56j2237J303L1249J8170l9221j8409L147K2137N78j0303k2368J857L9729
16452A4676J681j3281j3614j3529P061J2781R390j003J6157p205O996l5107j9559
$$ plain form
16543 26195 8810 -14256 -21151 -45856 -49310 -33778 -9690 -3166 -372 -1230 -22 8964 31951
16530 31951 46211 11263 -23257 -32998 -24712 -35171 -49571 -24393 -1541 1142 482 1224 -17606
16517 -17606 -32187 -13678 -5685 3865 22623 24482 32706 4542 -14928 -33084 -36898 -20646 -14149
16504 -14149 -18570 3984 -2795 -13700 20025 59141 62107 54284 26336 12365 -818 -18767
16492 -18767 -21015 -12044 29544 15195 981 -4476 -32130 -39010 -35129 -30853 -36659 -58328 -69095
16479 -69095 -72742 -49436 -39655 -33668 -26809 -17529 -17185 -12534 -14471 -7590 11697 22517 6285 -956
16465 -956 -13193 -11890 19359 37529 -1692 -20101 -16954 5183 5761 -4542 -26910 -25053 14676
16452 14676 16357 3076 -10538 -24067 -17006 -4225 5165 4162 20319 13114 20110 -14997 -34556
16439c4556K1115J5166P545j1404k630l2980j0744J2234J6547p457M0510n611
16427G735j7054N045m0100m92J1032K5302J9505j1897O094M693K14L294j5231
16414a860j4174l8218n363K9824J1475L308j4302K8206J9962o446L337N987j3703
16401H033j8555K673M274j3113J0111L3338K3172J7678j3074l4911k1042j1983
16389a3399P56m295o141j5175j928K7344K7136L026Q294M608n996K4013j0001
16376C8242N006j8246Q349K6238n897J5878q034l7250j9792j1602k6713l957J8066
16363a9712N0624r13m327K824j3192j0161P393n660r86P740l793k627k8268J6393
16349d665K8523O868k8354j8376L1848P373j2425O189R656K9050k0045l0042r616
$$ plain form
16439 -34556 -13441 1725 9270 -2134 -4764 -37744 -48488 -36254 -19707 -27164 13346 7735
16427 7735 -9319 -4274 -44374 -44866 -33834 -8532 10973 -924 5170 9863 10077 13371 -1860
16414 -1860 -16034 -54252 -59615 -29791 -18316 -15008 -29310 -1104 18858 12412 15749 21736 8033
16401 8033 -10522 -7849 -3575 -16688 -6577 26761 49933 67611 54537 19626 -1416 -13399
16389 -13399 -12643 -16938 -23079 -38254 -40182 -12838 14298 17324 25618 30226 24230 48243 38242
16376 38242 43248 25002 33351 59589 53692 69570 61536 24286 4494 -7108 -33821 -37778 -19712
16363 -19712 30912 29999 25672 28496 15304 5143 12536 6876 5890 13630 9837 7210 -21058 -4665
16349 -4665 23858 30726 2372 -16004 15844 23217 10792 16981 26637 55687 35642 5600 -4016
16336d016J3054O353j7651r432J5008O114j709M565J945j9968o487k468j4579
16323b9271K1409N8105q48q897n957m533k2353k9747k8359J9209J4399N074J0270
16310a499L9333M832m82j4788l3058M936J9512j8383J2452o883k6102r120j259
16297c0509J6042O576O103J3307j0668Q033j1451j7621M326N783j5161J0242m016
16284a9014J6629J3358k2682j6462o86J5721J4209O149J1567l8883N307M849j5363
16271b5301J8888L682J9260L755k2176K671J9426J5364Q551P33m571J0568j4133
16258C6717k74l1614o605N842J1320K3276j1678o093l7080K498J7921Q108K4263
16245C6601K4972O081j9888j4735k3438j4194k8300K2108m667k0988K085o244
$$ plain form
16336 -4016 9038 15391 -2260 -11692 3316 9430 7721 12286 14231 -5737 -12224 -14692 -29271
16323 -29271 -7862 50243 49395 40498 34541 30008 7655 -22092 -50451 -31242 -16843 -11769 -1499
16310 -1499 37834 42666 42184 27396 -5662 -726 18786 403 12855 5972 -20130 -29250 -30509
16297 -30509 -14467 -7891 -1788 11519 851 8884 -2567 -20188 -15862 -10079 -25240 -14998 -19014
16284 -19014 -2385 10973 -11709 -28171 -28857 -13136 1073 7222 18789 -20094 -14787 -9938 -25301
16271 -25301 -6413 -2731 16529 20284 -1892 779 20205 35569 44120 44853 40282 50850 36717
16258 36717 36443 4829 -1776 4066 15386 38662 26984 20891 -16189 -13691 4230 12338 36601
16245 36601 61573 67654 47766 33031 9593 -4601 -32901 -10793 -15460 -36448 -34363 -40607
16233d0607j6676j071L174J3855M0645K4242j5642j5923J9275K5251K237J2103
16221E0863J8746j6662j0444j543J6006N235j4937l2258j1390l7348K518J3577
16209a7637K867J3000n153J533J9442o4n106q415j5578j4220J1531K592N411R084
16195g13J2423m844l35q921P271J4388M662r855J096k5364m6835k521Q552j592
16181e2588l2285n311J0240J3230J8946K6631k2607k3638L1545m27j8835K1440
16169c3659Q152L2875r804K581J8063N939r026j0429k9775k589Q029O415K1351
16156H123R902k1928j6182Q001P24r389J0244K3539k383j6927J4841k378k706
16143C481Q26j0896O781k9060j7871M9026J4943l1214j8174k4222L428J4016K3465
$$ plain form
16233 -40607 -57283 -58354 -55180 -41325 -680 23562 7920 -8003 11272 36523 38760 50863
16221 50863 69609 52947 42503 40960 56966 62201 47264 15006 3616 -33732 -31214 -17637
16209 -17637 -14770 -1770 -6923 -5390 14052 13988 8882 467 -15111 -29331 -17800 -15208 -9797 -713
16195 -713 11710 6866 6531 -2390 4881 19269 23931 14076 15172 -10192 -57027 -59548 -50996 -52588
16181 -52588 -84873 -90184 -79944 -66714 -47768 -21137 -43744 -67382 -35837 -36264 -55099 -33659
16169 -33659 -25507 7368 -2436 145 18208 24147 15121 4692 -25083 -27672 -19643 -13228 8123
16156 8123 18025 -3903 -20085 -12084 -11360 -20749 -10505 13034 10651 -6276 8565 6187 3481
16143 3481 4307 -6589 192 -28868 -46739 2287 17230 -13984 -32158 -56380 -52952 -38936 -15471
16130a5471K276q833k5787M072J4699J0126j4859j8411J5953K6406J9775J1000
16118B0946j6775j5426j8307Q390j2614J0522j4402j3548J8221l699m731M3313
16106A890K8097J8169j5567m8049M074K2565p318K957J3408K4604j4027j0993
16094A9810j2285j6022r776K1641j249j4219j1488q563j8854J8740K9863J8483
16082A6081j4694r455q035k4798L9856J8549j6714j9540n513K2201j1738r214
16070b3014L948p66Q202j5108K8429k9975j8862R564K6923o244k1252j1562L4671
16057a5046K7902K325j669j0776J245l3312k0625K2731j470j5686N4830L0449
16045D0898m537p57l1121j7358k429j7287j8461j241L0136K5444J7172J2597L745
$$ plain form
16130 -15471 -13195 -22028 -47815 -43743 -29044 -18918 -33777 -52188 -36235 -9829 9946 20946
16118 20946 4171 -11255 -29562 -21172 -33786 -23264 -37666 -51214 -32993 -36692 -41423 1890
16106 1890 29987 48156 32589 -15460 -11386 11179 3861 6818 20226 44830 30803 19810
16094 19810 7525 -8497 -18273 3368 2119 -12100 -23588 -32151 -51005 -32265 -2402 16081
16082 16081 1387 -8068 -16103 -40901 -1045 17504 790 -18750 -24263 -2062 -13800 -23014
16070 -23014 -19066 -19832 -11630 -26738 1691 -28284 -47146 -37582 -10659 -16903 -38155 -49717 -15046
16057 -15046 12856 15181 13512 2736 3981 -29331 -49956 -27225 -28695 -44381 10449 40898
16045 40898 36361 35604 4483 -12875 -15304 -32591 -51052 -52293 -22157 3287 20459 33056 36801
16032C6801j0561o229l1493k0725j3881K3971R809J532r349k14J6599O3005L5909
16019I5174k6833k5835k629k7767k4255K817q46L590k1621O7j0125J2466K6518
16006G21k1417l194J6798K207k1798o748j531o247K417k4400J527K1693L1722
15993h250J1377L825j650j150Q708K501J6308j0944l2217j1052L0528j094N90
15980G480j0978J0474k793l2970k134J5768O245l256j1633j2727N990L7170J7784
15967B4420N34j8088j9446r19k0738o148R767j1598K4577Q866n857j9510j3620
15954d7760M293L4535J0215j4202R867r882J2233R625L696J8509j203k0334J290
15941A0882K1188p539l878k028k8506k3916K995K9152j2292j1835J9575M0491
$$ plain form
16032 36801 26240 20011 -11482 -32207 -46088 -22117 -12308 -10776 -20125 -20339 -3740 59265 95174
16019 95174 68341 42506 39877 12110 -12145 -9328 -10174 -6584 -28205 -28138 -38263 -25797 721
16006 721 -20696 -23890 -7092 -4885 -26683 -33431 -34962 -41209 -38792 -63192 -61665 -39972 -8250
15993 -8250 3127 6952 5302 4152 12860 15361 31669 20725 -11492 -22544 7984 6890 7480
15980 7480 -3498 6976 4183 -28787 -30921 -15153 -8908 -12164 -23797 -36524 -30534 6636 24420
15967 24420 24954 6866 -12580 -13499 -34237 -40385 -30618 -42216 -17639 -8773 -14630 -34140 -47760
15954 -47760 -43467 -8932 1283 -12919 -3052 -12934 -701 8924 12620 31129 29926 9592 10882
15941 10882 32070 24531 20653 18625 -9881 -33797 -30802 -1650 -13942 -25777 -6202 34289
15929C4289K1758q257l3236k2983q035r99q117j2626P225K383K3224J8226k0624
15916g772j5599j7717k1247P748R314n369J2277K8685K2654J0776J8756m644r731
15903B8131m541M819J4504r114l6387k0325J1285M940L884k1371k8093j7252j3731
15890h3251K2094K1082R289K6043J35N522J2147j6843j3712M888L455k152l203
15877a4506j5069J4911M533L971N513K1517j6297n018Q844l219k781o522j0649
15864a4772N340K8243j1825j5784R058j1180K8596l19r308k4171j4091L093P032
15851b0088j5626O88J9398R412j8744J7382k1767r100J8688R372O810r789j3732
15838b7096M893J351p663K7566K0149k0438j5331N02k0093J5856Q298K5603J0361
$$ plain form
15929 34289 56047 47790 14554 -8429 -16464 -17463 -25580 -38206 -30981 -28598 -5374 12852 -7772
15916 -7772 -23371 -41088 -62335 -54587 -45273 -50642 -38365 -9680 12974 23750 42506 37862 28131
15903 28131 23590 28409 42913 33799 -2588 -22913 -11628 -6688 -2804 -24175 -52268 -69520 -83251
15890 -83251 -61157 -40075 -30786 -4743 -4608 914 13061 -3782 -17494 -12606 -9151 -11303 -14506
15877 -14506 -29575 -14664 -10131 -6160 -647 20870 4573 -445 8399 5180 2399 -4123 -14772
15864 -14772 -9432 18811 6986 -8798 260 -10920 17676 17357 8049 -16122 -30213 -27120 -20088
15851 -20088 -35714 -35026 -15628 -6216 -24960 -7578 -29345 -38445 -19757 -10385 -3575 -13364 -27096
15838 -27096 -22203 -20852 -28515 -949 19200 -1238 -16569 -16067 -36160 -20304 -12006 13597 23958
15825B3958l2756n282N968o572J4157J9733J5202P56J764k0496j4384J2973J7053
15812C2074p710m968P120J2622J5325o302o5575m1497J5588K7245J8649K821J8933
15799B4325j8979k7681j4330l4086m3257Q043R719J7519M9356L5647m505R301
15787A1072n77P488m378p970j2131J5926K1554j021l0411j844L0555M273j0596
15774B1940M615j898m741k0087J6328k068j4010j2311K8026k945q742k1762Q867
15761h788j6825o036L8198K2861j5919j2629k0727j0298q447M368J8261K6623
15749A0642K2239j3765k6392k7407o945J6384j573q801K0046J2391j1857k3358
15737c8396M365J0901J1731n202J7P306k4659J3615P828K6452j4133l8789J1715
$$ plain form
15825 23958 -8798 -14080 -8112 -14684 -527 19206 34408 35164 36928 16432 2048 15021 32074
15812 32074 24364 19396 26516 39138 54463 48161 -17414 -58911 -43323 -16078 2571 5392 24325
15799 24325 5346 -22335 -36665 -70751 -114008 -105965 -96246 -78727 -29371 6276 1771 11072
15787 11072 10495 17983 13605 5635 -6496 9430 30984 29963 -448 -2292 28263 32536 21940
15774 21940 26555 24657 19916 -171 16157 14089 79 -12232 15794 12849 4107 -17655 -8788
15761 -8788 -25613 -31649 6549 29410 13491 862 -19865 -30163 -38610 -34242 -15981 10642
15749 10642 32881 19116 -7276 -34683 -41628 -25244 -26817 -35618 -15572 -3181 -15038 -38396
15737 -38396 -34031 -23130 -11399 -16601 -16584 -9278 -33937 -20322 -12494 13958 -175 -38964 -27249
15724b7249J0279L26K048O760L4045K5730j4160p742J196k0627j2947q149r292
15711a9782J4061p30q684J3163K1249k186j7848P004N712K6143l3647l8879k5349
15698e9773K500N06n087j8998J1887M2723M987q899N540K1413o954k369K872K9682
15684B0030O382k9447r321J1756K2713k6655K1468l5j2995j9006r842k3715j770
15671e0437J3720K7799K2655r189j0448q359k50K776J182J1789l784r874k1643
15658c4063J8938Q878q812k9693j105J6120M655L203J8714J891r062R611J7130
15645A6405l8095j6889J7270M1302M230Q874J5302j0843j1427N240O845j5216
15633B2998m1755r878k498K3676M2664O778k0181k7937l2889L654K7531P206p031
$$ plain form
15724 -27249 -16970 -16644 -14596 -7836 26209 51939 37779 30037 31233 10606 -2341 -10490 -19782
15711 -19782 -5721 -6451 -15135 -1972 19277 17091 -757 6247 11959 38102 4455 -34424 -59773
15698 -59773 -57273 -56767 -61854 -80852 -68965 -26242 -21255 -30154 -24614 -3201 -10155 -12524 -9652 20030
15684 20030 26412 -3035 -12356 -600 22113 -4542 16926 16891 3896 -15110 -24952 -48667 -50437
15671 -50437 -36717 -8918 13737 4548 -5900 -14259 -14509 -11733 -10551 1238 -2546 -12420 -34063
15658 -34063 -15125 -6247 -15059 -44752 -45857 -29737 -25082 -21879 -3165 -1274 -10336 -725 16405
15645 16405 -21690 -38579 -21309 19993 24223 33097 48399 37556 26129 31369 38214 22998
15633 22998 -18757 -28635 -31133 -7457 35207 41985 21804 -6133 -39022 -35368 -7837 -631 -7662
15620g662J67j840Q142K7466n845J5295n683l4151n4378j6185J0212L531o40J7746
15606d3825J9358k351n581M732L2359K4610J912j7720r500j7747j3141J9314K2883
15593A5303j1442j5854o080j3750K9609J0657N288j6924k0070m274J5546o017
15581a8008J017o743o353m4814Q533K0268K3935J6103J7226O913k0743j1552o18
15568a4836m723j2317K1879R766K0779O88k0439K7497n8j4931m563n957n056K486
15554B15j3558J5367j616M180M099K755j5298o434K386J5243j1206r039M2662
15541B9756K416l3106j6515j5582J3424J1993J1406j8780J6568O390J8337J4281
15529D0588l0151o701K116p581P001K806J2542j6120l9029L510L0277K8299K1871
$$ plain form
15620 -7662 -7495 -9335 -1193 26273 20428 35723 30040 -4111 -58489 -74674 -64462 -60931 -61571 -43825
15606 -43825 -24467 -26818 -32399 -27667 4692 29302 31214 13494 3994 -13753 -26894 -7580 15303
15593 15303 3861 -11993 -18073 -31823 -2214 8443 13731 -3193 -23263 -27537 -11991 -18008
15581 -18008 -16991 -23734 -30087 -74901 -66368 -46100 -22165 -6062 11164 18077 -2666 -14218 -14836
15568 -14836 -19559 -31876 -9997 -231 20548 21236 797 28294 28236 13305 8742 2785 -2271 215
15554 215 -13343 2024 408 4588 8687 11442 -3856 -10290 -7904 7339 -3867 -12906 29756
15541 29756 32172 -934 -17449 -33031 -19607 -7614 3792 -14988 1580 7970 26307 40588
15529 40588 10437 3736 5852 -1729 5272 8078 20620 4500 -34529 -31019 -742 27557 49428
15516D9428l228j0926j5118K3363K028L585k1662j5021P590J5803K2946l228j6637
15503C8923l1353J756M555j0552q519K0166M4816k2374m1799j2606L157L880P007
15490b943J2533J5949l777j0786j4688J3702R070k1592j8382N653J5186m725l531
15477h331j3190M247j2666l681K5219R379p440K7375k678K1441J425N884J3759
15464F0743L297l3667j4217k931P411J2818K4393p812k5814K679j726r36P827
15451C2065K201k1735P78K3291j139j2761n866j3051j4124J3778P678N762o177
15438A0700k0564M1189r890J2002J3528j6712n8756K6488M6625j3654k7252r19
15426B785l599j3212o23P443o438k8620n895K4397m195j1680K5998L8374K5719
$$ plain form
15516 49428 46200 35274 20156 43519 45547 49132 27470 12449 20039 35842 58788 55560 38923
15503 38923 7570 9326 13881 3329 -5190 14976 59792 37418 -4381 -16987 -13830 -9950 -2943
15490 -2943 9590 25539 21762 10976 -3712 9990 19060 -2532 -20914 -15261 -75 -4800 -8331
15477 -8331 -21521 -17274 -29940 -33621 -8402 977 -6463 20912 18234 39675 41100 46984 60743
15464 60743 64040 30373 16156 13225 20636 33454 57847 50035 24221 26900 25174 24238 32065
15451 32065 34266 12531 13309 36600 35461 22700 16834 3783 -10341 3437 11115 16877 10700
15438 10700 -9864 31325 21435 33437 46965 30253 -28503 -2015 44610 30956 3704 2785
15426 2785 -814 -14026 -14649 -7206 -13644 -42264 -48159 -23762 -27957 -39637 -13639 24735 50454
15413E0454R482k7928k9499K0759k1509l7641q398K7190L8619J5455j0368j1663
15401A4953J0347J2239q32M846J6160J7314J2577j9647m4252j7056M448L078k1986
15388g811l8814j9125K0779L856J9243L0201J8072j2992j6152j325J7052p906
15376E078k1620o447r650J6296n982j4740j4754K3051J7069k6558l474Q450J7437
15363a5844J626O056J4258n580j3678J582k7897Q888k382Q387K0036J5970N752
15350A7174J6809J197j5285J0449J77k3792j1095P140j57j4527J6401l4595k5670
15337e5774k2009J2223K2627K0259K931l0522K2435M3292J287j497J2381K7849
15325E5482j7378m2251l3622J1731J8503m923o923L9727M320j7686j3167j2741
$$ plain form
15413 50454 59936 32008 2509 23268 1759 -35882 -44280 -17090 21529 36984 26616 14953
15401 14953 25300 37539 36707 41553 57713 75027 87604 67957 23705 6649 11097 14175 -7811
15388 -7811 -46625 -65750 -44971 -41115 -21872 8329 26401 13409 -2743 -4068 12984 5078
15376 5078 -16542 -22989 -32639 -16343 -22325 -37065 -51819 -28768 -11699 -38257 -41731 -33281 -15844
15363 -15844 -14218 -8162 6096 516 -13162 -11580 -39477 -30589 -32971 -24584 -4548 11422 17174
15350 17174 33983 35180 19895 30344 30521 6729 -4366 2774 2617 -11910 4491 -30104 -55774
15337 -55774 -77783 -65560 -42933 -22674 -19743 -50265 -27830 15462 16749 15252 27633 55482
15325 55482 38104 -4147 -37769 -26038 -7535 -12458 -19381 20346 24666 6980 -6187 -18928
15313a8928k904l991M7666K6598m2387k6885L800K2184J4818J56k3479J1307j0594
15300b639k1976l962N992K1201j2439J3348M3276N242j3993j8191j1792j7698
15288a3631k698j9617k481J1094J4014J8155r513j2552J9709J178k3878j1018
15276c1238K3747R840J895k7745j7367R379L4159J2292k2740l1566k3358J9541
15264d3161r419K184m96L7537L796j9942J3145M270l366M969J8957j6902k2965
15251c1393O693R957j7191r068K0181M1068j1147j8286K167Q637p670j6610J9612
15238c050j7931k0495P376J2672K1903L565k8560R481K8392k2426p448q775o078
15225c1374J3619K0406R180j3981n579k16p415J9508j1455j7783J9701J8612k5114
$$ plain form
15313 -18928 -21832 -25823 21843 48441 6054 -20831 -17031 5153 19971 20127 -3352 7955 -2639
15300 -2639 -24615 -28577 -22585 -1384 -13823 -475 42801 48043 34050 15859 4067 -13631
15288 -13631 -16329 -35946 -38427 -27333 -13319 4836 -4677 -17229 2480 3658 -20220 -31238
15276 -31238 -7491 2349 4244 -23501 -40868 -31489 2670 14962 -7778 -39344 -62702 -43161
15264 -43161 -52580 -50396 -50892 -13355 -9559 -29501 -16356 -12086 -15452 -10483 8474 -8428 -31393
15251 -31393 -24700 -14743 -31934 -41002 -20821 20247 9100 -9186 -7019 1618 -6052 -22662 -3050
15238 -3050 -20981 -41476 -34100 -21428 475 4040 -24520 -15039 13353 -9073 -16521 -25296 -31374
15225 -31374 -17755 2651 11831 -2150 -7729 -7945 -15360 4148 -7307 -25090 -5389 13223 -11891
15212a1891J4463J4089j5482k1000k3678p271r273n060n95J0961J4004J7952R659
15199a3122r291l6582O655J3596J5395K5866o626r634l436l270J2267o340n048
15186a9570J9041J6110k743O048k8148J856J6003k3016j781o661K2549M542N855
15173A0085j8606l2149J0897K8349J2454K414j8440j6845k0732R870L2019Q410
15161G726R362j6391k8129j6712M0097p625l3766O468K9202L8711J6464j3040
15149C2367j3611J9714J2200k2804j5933L987K918j118k8469n744L0021M947j4325
15136D150j4385K7201L5105j9642k7810k0024p674j5055J4021L7741J1235m1716
15124a6853m948r700J0481j4538l555L700q196j9316K5026J8863K2419Q000j9191
$$ plain form
15212 -11891 2572 16661 1179 -19821 -43499 -50770 -60043 -65103 -65698 -54737 -40733 -22781 -13122
15199 -13122 -22413 -58995 -52340 -38744 -23349 2517 -4109 -13743 -17179 -20449 -8182 -14522 -19570
15186 -19570 -529 15581 12838 18886 -9262 -7406 8597 -14419 -16200 -22861 -312 4230 10085
15173 10085 -8521 -40670 -29773 -1424 11030 13444 -4996 -21841 -42573 -32703 -684 7726
15161 7726 17088 697 -27432 -44144 -4047 -11672 -45438 -38970 -9768 28943 45407 32367
15149 32367 18756 38470 50670 27866 11933 15920 18838 17720 -10749 -16493 13528 18475 4150
15136 4150 -10235 16966 52071 32429 4619 -15405 -23079 -38134 -24113 13628 24863 -16853
15124 -16853 -21801 -31501 -21020 -35558 -39113 -35413 -43609 -62925 -37899 -19036 3383 11383 -7808
15111g808j1303J5094M080k0525k2593L479J010m630M4588J203J0947j47j3256
15098A39k785K8235J0522k0377j3138k4658q798R84K5574J6756j0050K0265Q541
15085C1210k0321N304q577M446k773j3370k8866J2837J3657p172L1164P741J4749
15072D0029k8m3719k559J9733k0580M69J0709Q297K673J825l7562k3560o465P377
15058d3361L968o215L6028J3032q783N079o196m215k0059J7L009k0915l040J3326
15044c8325J5247n985k3358L351N538l632R323K54l2438J3186N657P415L2343
15031a1424j382J6473o149K4420P963N763j6128O256k7181Q289j9515l5122j526
15018d9263j1947J4854Q284n340R77L3861k0524p192M6510L4233r354j9933j5739
$$ plain form
15111 -7808 -19111 -4017 63 -20462 -43055 -39576 -38566 -43196 1392 2595 13542 13395 139
15098 139 -2646 25589 36111 15734 2596 -22062 -30860 -29876 -4302 12454 2404 22669 31210
15085 31210 10889 16193 7616 12062 9289 -4081 -32947 -20110 -6453 -13625 17539 25280 40029
15072 40029 40001 -3718 -6277 13456 -7124 -6655 4054 12351 15024 16849 -20713 -44273 -50738 -43361
15058 -43361 -39393 -45608 -9580 3452 -5331 -252 -6448 -10663 -30722 -30705 -27696 -48611 -51651 -38325
15044 -38325 -23078 -29063 -52421 -49070 -43532 -47164 -37841 -37587 -70025 -56839 -51182 -43767 -11424
15031 -11424 -12806 3667 -2482 21938 29901 35664 19536 25792 -1389 6900 -12615 -47737 -49263
15018 -49263 -61210 -46356 -38072 -43412 -42435 -8574 -29098 -36290 10220 44453 35099 15166 -573
15005e73j0913J3375K7213k7354p34J092J0299m099j0639N90J0528l971m5607
14992d0793k2018L0915J0248N190l7939R692J7503k1406O95J8410M609K1237m591
14979h248K6972K218j7147q37R150j2159l3868M51K9017L804k5659r069Q933j9458
14965d5900K1795J7665j1870j7429J6170K3719J274N457j7109N250j2328j5049
14953b8355K5870J7064J3329L828p011J0133j249k4010M32k8639k1862J5317J2638
14940a2515J3530Q447P061r169l948j1316K6373K3032m4688j4160J8619j7830
14928a6564l589K8336J1092J9661J0500q519K033k1163k7280o3469k0776J6598
14916g3140L469L7629M3630Q879j2061k3979l614J9572j8134Q431K3258J7375
$$ plain form
15005 -573 -11486 1889 29102 1748 1014 2106 12405 8306 -2333 -1743 8785 4814 -40793
14992 -40793 -62811 -31896 -21648 -16458 -54397 -44705 -27202 -48608 -47913 -29503 -24894 -3657 -8248
14979 -8248 18724 20942 3795 2958 12108 -51 -33919 -33468 -4451 -647 -26306 -35375 -26442 -45900
14965 -45900 -24105 -6440 -18310 -35739 -19569 4150 5424 10881 -6228 -978 -13306 -28355
14953 -28355 -2485 14579 27908 31736 24725 34858 33609 9599 10031 -18608 -40470 -25153 -12515
14940 -12515 1015 9462 16523 7354 3406 -7910 18463 41495 -3193 -17353 1266 -16564
14928 -16564 -20153 8183 19275 38936 49436 40917 42950 21787 -5493 -68962 -89738 -73140
14916 -73140 -69671 -32042 11588 20467 8406 -15573 -19187 385 -17749 -9318 13940 31315
14904C1315j3715l4779k2593M434J0514J8368L588K0543J2143l0610j7432J3045
14892e179J4939k5048J1871K9309j6033J2631n132p186j327k8187n163j2450O707
14879c0248M209l517J7335O330Q164M9369j4161l0440N875J793n1927n176l109
14866d5503M45j319J0860K252J761J6811J2572p422L1554K7723j1617k7477J3737
14853B4377J5530L919J8070j6104j6739k8483j2417q909J5162j3807m029n06K881
14840b1055K7064j3959l1082l3134K1931K925n421O873J0290o472j092N58K0928
14827b1646K4923j6533k3872q914J6060K2945J8458J5173n488k2682j05R675l224
14814D770J0030Q401m505k0999R532J2279k0264j2840k266k0755J2280L3394M1501
$$ plain form
14904 31315 17600 -17179 -39772 -35338 -24824 -6456 -2868 17675 29818 -792 -18224 -5179
14892 -5179 9760 -15288 -3417 25892 9859 22490 17358 10172 8845 -19342 -24505 -36955 -30248
14879 -30248 -26039 -29556 -12221 -5891 2273 51642 37481 7041 12916 14709 -37218 -42394 -45503
14866 -45503 -45058 -46377 -35517 -33265 -31504 -14693 -2121 -9543 22011 49734 38117 10640 24377
14853 24377 39907 43826 61896 45792 29053 570 -11847 -20756 -5594 -19401 -23430 -23936 -21055
14840 -21055 6009 -7950 -39032 -72166 -50235 -47310 -52731 -45858 -35568 -42040 -43132 -42574 -21646
14827 -21646 3277 -13256 -37128 -46042 -29982 -7037 11421 26594 21106 -1576 -1681 7994 4770
14814 4770 14800 23201 18696 -2303 7229 19508 -756 -13596 -15862 -36617 -24337 9057 50558
14801E0558L411k4996j4692j476K4113K4390k0125k3164m53j858p215r320K152
14788A325j4967J1104j0840M144L2559J8956J1293k4717l790j2119j2302R951
14776A0597J7626L060m666k6504l424O1154j8698m0214j0335j0941Q961j3597
14764b6981J7224o739j2965L0449L592m53j9561j3015m155J524J4024J6791j279
14751a544j7048J8530J0852J379k252J1251j2210j4581J7067O010k9159L936l65
14738h134J681m241L3771j1128n026R845k6124j428J2139k4188K314J4230Q683
14725B394K601r755k2787K0666J5182j7131o059k1510j1946n99Q637R92R471m24
14711c0268j6177K2372L0702j1194q685K3752N045O604k0380p743M143M310r317
$$ plain form
14801 50558 53969 28973 14281 12805 36918 61308 41183 18019 17566 15708 8493 -827 1325
14788 1325 -13642 -2538 -13378 -9234 23325 42281 53574 28857 25067 12948 646 10597
14776 10597 28223 31283 26617 113 -3311 57843 39145 -1069 -11404 -22345 -13384 -26981
14764 -26981 -9757 -16496 -29461 988 4580 4127 -15434 -28449 -32604 -31080 -17056 -265 -1544
14751 -1544 -18592 -62 10790 12169 9917 21168 8958 -5623 11444 17454 -11705 -7769 -8134
14738 -8134 -6453 -10694 23077 11949 6923 16768 -9356 -10784 1355 -22833 -20519 -6289 2394
14725 2394 4995 -4760 -27547 -6881 8301 -8830 -14889 -36399 -48345 -48944 -40307 -39315 -29844 -30268
14711 -30268 -46445 -24073 6629 -4565 -13250 10502 15547 22151 1771 -5972 -1829 2481 -6836
14698f836K3984J4838q360j1284l8050P5j6804k3647J3549L939J8764J6644N155
14685h033l745j788N234p752k568N9O624K0324J7087k788m5247L887P598j5748
14671b6856n158J7304j7670k3222R568M0768k951o513q803K2485J1965Q678k8802
14658i207k251j6790L023m815j2765k119l660J4924j5660K0107J8188K464L061
14645e500j6163j040K8502N752j2602k1516N767J2852J8736K8556j6925j6849
14633I570k035j4873L399q780J4270P181P024j8525n435N686m763j617J2038j051
14619B089k4797n316J8217J0216j2445L527K231j8388L149J7217R759l008k3014
14606b0563j3053M57K1458j32k1095R297J3073K5457P12j6346o188O223K1990
$$ plain form
14698 -6836 17148 31986 23626 12342 -25708 -25633 -42437 -66084 -52535 -48596 -29832 -13188 -8033
14685 -8033 -11778 -13566 -8332 -16084 -18652 -18593 -11969 8355 25442 22654 -22593 -18706 -11108 -26856
14671 -26856 -32014 -14710 -32380 -55602 -46034 -5266 -8217 -14730 -23533 -1048 10917 19595 -9207
14658 -9207 -11458 -28248 -25225 -30040 -42805 -44924 -48584 -33660 -49320 -29213 -11025 -8561 -5500
14645 -5500 -21663 -22703 5799 11551 -1051 -22567 -16800 -3948 14788 43344 26419 9570
14633 9570 7535 -7338 -3939 -12719 1551 8732 15756 -2769 -8204 -2518 -7281 -8898 3140 2089
14619 2089 -22708 -28024 -9807 409 -12036 -8509 -6278 -24666 -21517 -4300 5459 2451 -20563
14606 -20563 -33616 -33159 -11701 -11833 -32928 -23631 -10558 14899 15611 -735 -6923 -700 21290
14593B1290K1384J4220q251k2651k7420j6548O953p815k548J8471K6855K8446
14581E2386j4426j4142r312O64J7651O454k2524j0129j344j4791K0401r911J3884
14568A4861M4130J2543k1632l1337j6408R014k3577l161J7002P655k3773o349
14556b1032J4081O528q769q105J4719J5578J1796J2318P912o836r829l8878k7374
14543c7891Q331N129L189j1975j8923K602O874J7924k28J695L8627Q993j4320
14530A0027j8124l485K5825j2923j837L3158J2872l952j7161j3035j2002J6544
14518A5907j402J3493K5931j7743k0401r327k1120J686K4539J473q129j542j3604
14505a0239n568J9627m819k147J7497n04m6745J39R126R606k0879k6060n339j6169
$$ plain form
14593 21290 42674 56894 48643 25992 -1428 -17976 -11023 -18838 -21386 -2915 23940 52386
14581 52386 37960 23818 14506 15170 32821 39275 16751 6622 5278 -9513 10888 977 14861
14568 14861 58991 71534 49902 18565 2157 11171 -12406 -15567 1435 9090 -14683 -21032
14556 -21032 -6951 -423 -9192 -17297 -2578 13000 24796 37114 45026 38190 28361 -10517 -37891
14543 -37891 -29560 -24431 -21242 -33217 -52140 -49538 -42664 -24740 -24968 -23273 15354 24347 10027
14530 10027 -8097 -11582 14243 1320 -517 32641 45513 41561 24400 11365 -637 15907
14518 15907 14505 27998 53929 36186 15785 6458 -14662 -12976 11563 13036 4907 3365 -10239
14505 -10239 -15807 3820 -999 -3146 14351 13847 -32898 -32759 -23633 -14027 -34906 -60966 -66305 -82474
14491h2474K2216J1582M332L7466J2334j4390K407M0965j0960k9983j9152K4979
14479f78m904L68k997j3908m384N518j0917J300L2222N567m536m955L198l838
14465b944q624N392l868j9463P534J6917j787J2591J416r077l1720k0913P516
14452d7030J6052J3943j003L004J6637k408j2697l4757J2276L1458J3890L78j2682
14439b939k616L081K722P165J7568l776n126j8171k7004R232J0406n233P296J3203
14425E808K8969K1011j3995L721j3266k1902q653M749N205r966j2437j4154j431
14412b6341j0852j4416P90L5390M1207k7065n88L562K2237J4229j3298j8985j733
14399D137j4425M919K6170k0661k4754j6100M033J3482P265K0807K888p287R577
$$ plain form
14491 -82474 -60258 -48676 -44344 -6878 5456 -8934 -6527 34438 23478 -6505 -25657 -678
14479 -678 -5582 -5214 -8211 -22119 -26503 -20985 -31902 -30602 1620 7187 2651 -2304 894 -2944
14465 -2944 -11568 -6176 -10044 -29507 -21973 -5056 -6843 5748 7164 -1913 -33633 -54546 -47030
14452 -47030 -30978 -17035 -18038 -15034 1603 -805 -13502 -48259 -35983 -4525 9365 9743 -2939
14439 -2939 -5555 -2474 248 7413 24981 21205 16079 -2092 -29096 -19864 -9458 -14691 -7395 5808
14425 5808 34777 55788 41793 45514 32248 10346 1693 6442 11647 1681 -10756 -24910 -26341
14412 -26341 -37193 -51609 -50819 -15429 25778 -1287 -1875 1687 23924 38153 24855 5870 4137
14399 4137 -10288 -5369 20801 140 -24614 -40714 -36681 -23199 -15934 4873 7761 474 10051
14386A0051K942q834j1832K560N242k5892j9751J0009L0617L0183l998k2289j9263
14373b0255k440R136j479J2266R202R986R402r845l276q047j7543k4854Q85o679
14359d3541j4639L0395K4140R198J6896n079j5985o252r865Q883K6752j1444p668
14346A791O485j0229j3239K5987N0635M670o575l6442P867J5815J044j3023k9533
14333E253J165n877J2777j7621j8388J5960J8103m239l6597k6397j358J3054O380
14320c7785J922J7453M897k8941q898P750K0823J0486j1752j3632L4673J4642
14308A1638J3913k6138l9896k2732k352k975m77K3388J0953P888L0876N640l6482
14295b6756J418p642M8307K7129n966j1514q612j7834r293K8913r327j6615l4492
$$ plain form
14386 10051 12993 4159 -7673 -5113 129 -25763 -45514 -35505 -4888 25295 21297 -992 -20255
14373 -20255 -22695 -13559 -15038 -2772 6430 16416 25818 15973 12697 4650 -12893 -37747 -36862 -43541
14359 -43541 -58180 -27785 -3645 5553 22449 17370 1385 -4867 -14732 -5849 20903 9459 1791
14346 1791 8276 -1953 -15192 10795 61430 66100 59525 23083 30950 46765 47809 34786 5253
14333 5253 6418 541 13318 -4303 -22691 -6731 11372 7133 -29464 -55861 -57219 -44165 -37785
14320 -37785 -35863 -18410 -13513 -42454 -51352 -43602 -22779 -12293 -24045 -37677 -3004 11638
14308 11638 25551 -587 -40483 -63215 -65567 -68542 -69019 -45631 -34678 -26790 4086 9726 -26756
14295 -26756 -25338 -32980 15327 42456 36490 24976 16364 -1470 -10763 18150 8823 -7792 -42284
14282d2284M566o023K0592L0784J1600K167r248n367O848p235K3701Q824J1011
14269D9936l126m5818j2191L536r694k7121j9450K5517K3040L0425O491j148k0055
14256C42j3914j9979j1282O43K4551R007K3824K4401k5993j8685K5926J4354k0685
14243A2510l1946k1688J7529m168j8119K7208J048j0026j1606p000k5697J1201
14231f0754L4338O4247J2966j3459q834m048l3304l0541P328J2389J4621k2793
14219b7844r728J2088Q252J5l487k2253k7058K3103J9496L3793P27K302l838j4641
14205i073k369L1046J0873K33l0822k0765k4126r650M366J6102N0065p520k7856
14192a9496m8248R856L6166M293k0631j8634n205J7199q220J3271R862o034j3095
$$ plain form
14282 -42284 -37718 -43741 -23149 7635 19235 21402 12154 6787 13635 6400 30101 38925 49936
14269 49936 46810 992 -11199 -7663 -17357 -44478 -63928 -38411 -15371 15054 21545 20397 342
14256 342 -13572 -33551 -44833 -44190 -19639 -10632 13192 37593 11600 -7085 18841 33195 12510
14243 12510 -19436 -41124 -23595 -27763 -45882 -18674 -17626 -27652 -39258 -46258 -71955 -60754
14231 -60754 -26416 37831 50797 37338 28504 24456 -8848 -39389 -32061 -19672 -5051 -27844
14219 -27844 -37572 -25484 -17232 -17217 -20704 -42957 -70015 -46912 -27416 6377 7104 9406 5568 -9073
14205 -9073 -11442 19604 30477 30710 -112 -20877 -45003 -54653 -50287 -34185 15880 8360 -19496
14192 -19496 -67744 -57888 -21722 -17429 -38060 -56694 -61899 -44700 -52920 -39649 -29787 -35821 -48916
14179d8916J0827Q322L0119K2611L904r604j4676K172K6283j9033n913K3395j5624
14166A3867n682R55m3780m7616N600J4041M4732J4651j3685k9485p453R210L4204
14153a0441M943k6248l309J1327J7712L227J0155J1486j2451l5387r634o400L398
14140d1622Q269J4957o681k9865K28l605M176m632L1184J0959J0829r232J4845
14127a90L256k8577M992L6006P238q326m042k3047J1674p41k1945J7275M0616
14114C4189j5437j8861J3025K6385j1936k8088j3807L16j3934K4541K0259l4580
14102a7928l3994j935K4608K5832R315O050O683k0342l042J7506j3030j0160J089
14089i348j2606m894j4647J7337K0889N197n859k0157O556L5733l680J620k033
$$ plain form
14179 -48916 -38089 -29767 352 22963 26867 17263 2587 4759 31042 12009 6096 29491 13867
14166 13867 8185 9140 -34640 -82256 -76656 -62615 -17883 -3232 -16917 -46402 -53855 -44645 -10441
14153 -10441 -5498 -31746 -35055 -23728 -6016 -2789 7366 18852 6401 -28986 -38620 -45020 -41622
14140 -41622 -33353 -18396 -25077 -54942 -54714 -58319 -54143 -58775 -27591 -16632 -5803 -15035 -190
14127 -190 3066 -25511 -20519 15487 22725 14399 10357 -12690 -1016 -1757 -23702 -6427 34189
14114 34189 18752 -109 12916 39301 27365 -723 -14530 -14214 -28148 -3607 16652 -17928
14102 -17928 -51922 -53857 -29249 -3417 5898 11948 18631 -1711 -4753 12753 -277 -10437 -9348
14089 -9348 -21954 -26848 -41495 -24158 -3269 1928 -3931 -24088 -17532 18201 14521 16141 14108
14076A4108j781J2683Q717j1524K700k1796p202k227J7245P887k1635k0241l1336
14063e4402J3878K1221K582k023m100k0666k9968j0450M698M737K7284L7048j5832
14050b5993J1087K917n770M293j2568j2807L0305M7973q043O21j4712j6332j9125
14037a8154l1208L1887K8835N37L897j0324j9901J934J7665j1843o268k398p321
14024b2662J4321L0936J0801j6120j1173L5882P337q672Q50k8270l7539R982j1495
14011b5822j3907J7148J6500m281j6793k572M5626J7682l0090k1400n952M5682
13999B1821O395k1696l5555J9876Q202j565l5285m484L8816j0437j4201j532L365
13986b6280K4204J7508m018J3462k896n963l0920l6838J1763R450K541L0456J3982
$$ plain form
14076 14108 12327 25010 33727 22203 24903 3107 -4095 -6322 10923 18810 -2825 -23066 -54402
14063 -54402 -40524 -19303 -16721 -18744 -22844 -43510 -73478 -83928 -79230 -74493 -47209 -10161 -25993
14050 -25993 -14906 -11989 -17759 -13466 -26034 -38841 -8536 39437 31394 32015 17303 971 -18154
14037 -18154 -49362 -17475 11360 11897 15794 5470 -14431 -12497 5168 -6675 -12943 -15341 -22662
14024 -22662 -8341 22595 33396 17276 6103 41985 49322 40650 41500 13230 -24309 -14327 -25822
14011 -25822 -39729 -22581 -6081 -10362 -27155 -29727 15899 33581 3491 -17909 -23861 21821
13999 21821 28216 6520 -29035 -9159 -957 -2522 -37807 -42291 -3475 -13912 -28113 -29645 -26280
13986 -26280 -2076 15432 11414 24876 21980 16017 -14903 -51741 -39978 -30528 -27987 2469 16451
13973A6451n014k598j2515j4213r2R140L0476o645p097j0394l690J9432o660K9354
13959C5935j580k5335k8098j8990K8456J6556o542l2820P766J4349K1040j1890
13947a153l0789J1110L2858L8659k224j8726k9566k8733K979M8263K6229q650
13935D0257K832r515j4691p758l2362q806k5958r501J8203K3054r351k6094l358
13922f3048K8916M208k373J4376L5953K5073j0999k6473j9994k041K4599q73m988
13909B336M112j6235j3497o742l728R653J7992p44K802N907l815O160K85j0256
13895e770N071R776K0847r195l2802m4147J3845M499J5116K3023J1651k2959k1772
13882c2817L1651K0575m6747R363j7392O198R780o551K1327L6312K7048j6540
$$ plain form
13973 16451 11437 8839 -3676 -17889 -17981 -8841 21635 14990 7893 -2501 -6191 13241 6581 35935
13959 35935 34355 9020 -19078 -38068 -9612 6944 402 -32418 -24652 -10303 10737 -1153
13947 -1153 -31942 -20832 12026 50685 48461 29735 169 -28564 -25585 22678 48907 40257
13935 40257 43089 33574 18883 11125 -21237 -30043 -56001 -65502 -47299 -24245 -33596 -59690 -63048
13922 -63048 -34132 -29924 -32297 -17921 18032 43105 32106 5633 -14361 -16402 8197 7324 2336
13909 2336 6448 -9787 -23284 -30026 -33754 -24101 -6109 -6853 -4051 1856 -1959 4201 4486 -5770
13895 -5770 -699 9077 29924 20729 -12073 -56220 -42375 -37876 -22760 263 11914 -11045 -32817
13882 -32817 -1166 19409 -27338 -17975 -35367 -29169 -19389 -25940 -4613 31699 58747 42207
13870D2207l2129O035K9390k4389Q0K5114k8305n2230J8566K381J0778K5098j261
13857B1335k3960k2207J5712o838J7011q408J8137K1549J0974k1005p073j2137
13845C090j6859j423R102l148Q210l560J0854M304j0830k0190J6806q989J1251
13832a382K797n621j9827k9189J1902J2339K2905K5369q835j929l20j0258o956
13819i005n114P220j1979l0437J2807K1946L468j0751L4088J036j0897k699J4513
13806A4196P158j4952k4959k039M369L030P913j2809j0431p294j7133J415P018
13793d4518K2920m97o078j5831l279R720l314l323Q703J4940k1230l667L0617
13780a4837K6724j130o82L450R824j109l5529l775N284j8346K98J2943J1487M02
$$ plain form
13870 42207 10078 16113 45503 21114 21194 46308 18003 -34227 -15661 -13280 -2502 22596 21335
13857 21335 -2625 -24832 -9120 -15958 1053 -7355 10782 32331 43305 22300 15227 3090
13845 3090 -13769 -15192 -6090 -9238 -1028 -4588 6266 10570 -260 -20450 -3644 -12633 -1382
13832 -1382 1415 -4206 -24033 -53222 -41320 -28981 -6076 19293 10458 8529 8209 -2049 -9005
13819 -9005 -14119 -6899 -18878 -49315 -36508 -14562 -11094 -21845 12243 13279 2382 -317 14196
13806 14196 21354 6402 -18557 -20596 -16227 -13197 -5284 -18093 -28524 -35818 -52951 -51536 -44518
13793 -44518 -21598 -22095 -28173 -44004 -47283 -37563 -40877 -44200 -35497 -20557 -41787 -45454 -14837
13780 -14837 11887 10757 10075 13525 23349 22240 -13289 -17064 -11780 -30126 -29828 -16885 -5398 -4996
13766d996P196j306K520j7982k645O337J4790O203l008j019K0275o332J5990m197
13752C1826k4195j7537j7505O031K6387N55j3420J6880n35j7749k9813p053j283
13739d7411P773P680j9199K8532K7052J9127J7899J3563k6265l6289j6020J3086
13727a0472J7453J6443m79j029j8871J1766j977j2860j0377O729K2476j0004m832
13714C966J6989k4143m184q477J0110J0642K119P956k2194M52J0484q602J3215
13701H333J5210m8703l1613Q172N0495J7853r902k4993J1333K7522J6379j2588
13689B7498k9301j8671J0760p544J7566n69p059o702k2317p59o775N070J8387
13676b0416q169k0164O592J529j3201R416m374J636M266J7241J0508j952K430
$$ plain form
13766 -4996 2200 894 3414 -14568 -17213 -10876 3914 10117 7109 6090 26365 20033 36023 31826
13752 31826 7631 -9906 -27411 -21380 5007 5562 -7858 9022 8487 -9262 -39075 -46128 -47411
13739 -47411 -39638 -31958 -51157 -22625 4427 23554 41453 55016 28751 -7538 -23558 -10472
13727 -10472 6981 23424 22945 21916 3045 14811 12834 -26 -10403 -3674 18802 8798 3966
13714 3966 20955 -3188 -7372 -15849 -5739 4903 7022 14978 -7216 -6764 3720 -4882 8333
13701 8333 23543 -25160 -56773 -48601 1894 19747 9845 -15148 -3815 23707 40086 27498
13689 27498 -1803 -20474 -9714 -17258 308 -261 -7320 -14022 -36339 -37098 -43873 -38803 -20416
13676 -20416 -28585 -48749 -42157 -40628 -53829 -44413 -48787 -47151 -42885 -25644 -15136 -17088 -14658
13663a4658N925l1408q910K1342M761O698J9467k2801k3495n586J9162L4138j132
13650C503k0276j2617J9622J0869j3855N563o969k0829J4643j5851k153J936R76
13637c5438Q859J2374Q59N432q387l062l098j7890j4562Q592J0751J3622N083
13624a6865J6202O952j1496J0905L5146m010k5176k8435j4238j5102L721J6328
13612b6068J4109K2480K9216k2541l5232P540N825J9470J0716j8868k8946Q982
13600a3317k1866r93n526J0752J0213o878J4780l614J9095P684K1841j279j1714
13587A9178o481l1588m2688M700P441Q650K7710p026k1963k4251k8156q861J1039
13574i2296J2355J5671j0322K3453j0789k500P484J8017J7337J8761J6765K3966
$$ plain form
13663 -14658 -8733 -40141 -49051 -27709 -22948 -16250 3217 -19584 -43079 -48665 -29503 4635 3503
13650 3503 -16773 -29390 -9768 1101 -12754 -7191 -14160 -34989 -20346 -36197 -38350 -36414 -35438
13637 -35438 -26579 -14205 -13346 -7914 -16301 -19363 -22461 -40351 -54913 -46321 -35570 -21948 -16865
13624 -16865 -663 6289 -5207 5698 40844 36834 11658 -16777 -31015 -46117 -42396 -26068
13612 -26068 -11959 10521 39737 17196 -18036 -10496 -4671 14799 25515 6647 -22299 -13317
13600 -13317 -35183 -36176 -41702 -30950 -20737 -27615 -12835 -16449 2646 10330 32171 30892 19178
13587 19178 12697 -18891 -61579 -56879 -49438 -40788 -13078 -20104 -42067 -66318 -94474 -103335 -92296
13574 -92296 -79941 -64270 -74592 -51139 -61928 -64428 -56944 -38927 -21590 -2829 13936 37902
13562C7902k0568R677m336k7967M26J8156P85O687Q564j4060k0523o161j747R388
13548c777M2624J082j8691p091k4353j9993j800j1733q097J5788J6722Q71p526
13535b5974R9L6049P459k0332N320M674M248K780r40K028j417j2887l3294O861
13521b5326K6458N547j1194j7219O943o577j2579k396K0953p813j8366J3150K4295
13508d124L0651N960R2J8141k570k0863j7063J7686R714j2105k6060k2873j2389
13495c5803j4497K3286L1157j9736r060J8376M26J301O906o379j6765k3150P312
13482c6626N104J402K8724K8139n930J0325K2198N690r336o571m6637k1069L7381
13469A2794j2057j3780j7012j4146j5612p43K0039K7073K2873k2121j4666O773
$$ plain form
13562 37902 17334 27011 22675 -5292 -4866 13290 14075 20762 29326 15266 -5257 -11418 -13165 -3777
13548 -3777 38847 39929 21238 14147 -10206 -30199 -31999 -43732 -51829 -36041 -19319 -18448 -25974
13535 -25974 -25875 10174 17633 -2699 2621 7295 11543 14323 13383 15411 13994 1107 -32187 -25326
13521 -25326 1132 6679 -4515 -21734 -14791 -21368 -33947 -36343 -15390 -23203 -41569 -28419 -4124
13508 -4124 26527 32487 32579 50720 48150 27287 10224 27910 37624 25519 -541 -23414 -35803
13495 -35803 -50300 -27014 4143 -15593 -24653 -6277 -5851 -4550 2356 -4023 -20788 -43938 -36626
13482 -36626 -31522 -30120 -1396 26743 20813 31138 53336 59026 49690 43119 -3518 -24587 12794
13469 12794 737 -13043 -30055 -44201 -59813 -60556 -40517 -13444 9429 -12692 -27358 -20585
13457b0585k4193j3961L7954K1665O184k3728p500j870N218M574J5057K0131l0341
13444a1395m036R465K8619K4417j8771k8646j3819o525q138n99J3583J1473j453
13431e825j0616K893l1500o056Q606K5186R086m03J1741j9697J0173J181L775
13418a456j6626M978Q641j5314k1300O782j96M328K0282j7183l60K3175j920o319
13404a2488q835m316j5073J0994O054J4970J1399q02J8316J1987j9420n1965J4497
13391b4682L2436o60J919k5789j6835J6431J7406j0443L50k121P671K4836M6188
13378F6707n333k9958J0886n148k2003R299l251j3518J0330k7202n617m260Q076
13365a0992l2279j283j1328N83j915O810K2939R271J2238J2247p166j3872m17
$$ plain form
13457 -20585 -44778 -58739 -20785 880 7064 -16664 -24164 -26034 -20816 -16242 -1185 18946 -11395
13444 -11395 -15431 -5966 22653 47070 28299 -347 -14166 -20691 -28829 -29428 -15845 -4372 -5825
13431 -5825 -16441 -13548 -45048 -51104 -42498 -17312 -8226 -8629 3112 -16585 -6412 -5231 -1456
13418 -1456 -18082 -13104 -4463 -19777 -41077 -34295 -34491 -30163 -9881 -27064 -27424 -4249 -6169 -12488
13404 -12488 -21323 -25639 -40712 -29718 -23664 -8694 2705 1903 20219 32206 12786 -39179 -24682
13391 -24682 7754 7094 9013 -16776 -33611 -17180 226 -10217 -9867 -11988 -4317 20519 66707
13378 66707 61374 31416 42302 37154 15151 24450 21199 7681 18011 -9191 -14808 -19068 -10992
13365 -10992 -43271 -44554 -55882 -55299 -57214 -50404 -27465 -18194 -5956 6291 -875 -14747 -15164
13352a5164k3424p093J003O34Q06Q691K5427r162j2189K4643K3205k2019J7436
13339A2794P631J4346m331J54q315k9048n802n10K709l346J0537o781M148J8426
13325A2612N486p78J2569j8361j653j795j9177O901K9913J0042k4818k6442j1196
13312b6697l389j9794p736L0171K3962l796K5348K70p136k4491j2975k057o674
13299c4994J4188L37j5474m838k070J1219L6457J0230m0079k3015m196J3519K7684
13286a1032N029j6519J8904P529j1153l70J472J3941k2650k550P82J54K8083K32
13272A1852j2050k2699J6143Q430l2196j8463k994K3849J7695L0180J9497k2719
13260A6525l759l2022n830K8254R451o336k2791k4016q32J9385J3082l974p532
$$ plain form
13352 -15164 -38588 -45681 -44678 -44044 -43238 -34547 -9120 -18282 -30471 -5828 17377 -4642 12794
13339 12794 20425 34771 30440 30594 22279 -6769 -12571 -13081 -10372 -13718 -3181 -9962 -5814 12612
13325 12612 18098 17320 29889 11528 9875 8080 -11097 -4196 25717 35759 10941 -15501 -26697
13312 -26697 -30086 -49880 -57616 -27445 -3483 -7279 18069 18339 11203 -13288 -26263 -28320 -34994
13299 -34994 -20806 -20469 -35943 -40781 -42851 -31632 4825 15055 -25024 -48039 -52235 -38716 -11032
13286 -11032 -6003 -22522 -3618 3911 -7242 -7612 -6140 7801 -14849 -17399 -16617 -16463 11620 11852
13272 11852 -198 -22897 -6754 1676 -30520 -48983 -51977 -28128 -10433 19747 39244 16525
13260 16525 12766 -19256 -25086 3168 12619 6283 -16508 -40524 -41356 -21971 -8889 -12863 -20395
13247b0395M759j3521J5170k622k286l1094m593j4101q199K4671M0849L6171N426
13234C0235q65k0489J0387k8821Q40J600q697l824P228Q311J011M426o128J0499
13220E713j084j8059r005j981J1486n853M065O864Q862l12j2705j6707j9577m525
13206e2818M3644M1016m770k788J7678k4597j2406o509j3090k460Q459J4325m668
13193A016j8877J7091J6469L1257n518m6563k6036K228n090J4892j1177M54q834
13180c8688K2989p79k699m175P263n15k5870k2714J2503J5340j360j1064J4319
13167c5450P527m074q946R651o13m288K2058j0769j2893J9839L8290K5358p891
13154C7799l0837J1501n640r897j1800N251J8739Q737j9283k5489k3187k98j1003
$$ plain form
13247 -20395 -15636 -29157 -13987 -16609 -18895 -49989 -54582 -68683 -76882 -52211 -11362 24809 30235
13234 30235 29370 8881 19268 -9553 -8713 -7113 -15810 -19634 -12406 -4095 -3084 1342 -4786 5713
13220 5713 4629 -13430 -22435 -24416 -12930 -18783 -14718 -7854 1008 696 -12009 -28716 -48293 -52818
13206 -52818 -9174 31842 27072 24284 41962 17365 4959 -1550 -14640 -17100 -8641 5684 1016
13193 1016 -17861 -770 15699 46956 41438 -5125 -31161 -28933 -34023 -19131 -30308 -29854 -38688
13180 -38688 -15699 -16478 -19177 -23352 -16089 -16604 -42474 -65188 -52685 -37345 -38705 -49769 -35450
13167 -35450 -27923 -31997 -40943 -31292 -31905 -36193 -14135 -24904 -37797 -17958 20332 45690 37799
13154 37799 6962 18463 12823 2926 -8874 -3623 15116 23853 4570 -20919 -44106 -44404 -55407
13141e5407O263J6524R148q711j2349L5058N505k327K394J0997J7133l3928J8424
13128H724m384m476r24j2318O867k9299j4227j7892P98K3702J5206k264Q477k6184
13114d8194K0527J9699r008J1466j0219J9595Q92J0718l379K223J7524R430J316
13101D2590j2050q710m054O158q556k9361j0460N540L2430J313M963M130j2533
13088A1400l8791k7937J2075J4918J1106K2105r301Q895M636j0838K755l0899
13076b9876j9050K2460J8358l596o75L1262J205k8121Q806k4385k3523l927o251
13063e7313n311L3539J8829j3407o234J2550L495J7143P333j1744k0895K1640
13051c75J6042j4290j5059J60J4032l5700O037J2250K2829K5042O443j1724l7913
$$ plain form
13141 -55407 -49144 -32620 -23472 -32183 -44532 -9474 -3969 -6296 -3902 7095 24228 -9700 8724
13128 8724 4340 -136 -1060 -13378 -6511 -35810 -50037 -67929 -67131 -43429 -28223 -30487 -22010 -48194
13114 -48194 -27667 -7968 -16976 -5510 -15729 3866 4758 15476 12097 14320 31844 41274 42590
13101 42590 30540 21830 17776 23934 15378 -13983 -24443 -18903 13527 14840 19803 23933 11400
13088 11400 -27391 -55328 -43253 -28335 -17229 4876 -4425 4470 9106 -1732 1023 -29876
13076 -29876 -48926 -26466 -8108 -11704 -12379 18883 20088 -8033 773 -23612 -47135 -51062 -57313
13063 -57313 -62624 -29085 -10256 -23663 -29897 -17347 -13852 3291 10624 -1120 -22015 -375
13051 -375 15667 1377 -13682 -13522 510 -35190 -29153 -16903 5926 30968 37411 25687 -12226
13038a2226J984J7981r019j0984M496R60j0049J3674l7155k3186K9297O670J2992
13025a4565k3718k8004O764L069k153j727L4881J0156J0722J6431N608j5596j595
13012B73q389j8740J9066J6957j3431O193Q461k235O219j8393m8462P681K4186
12999b0614K6789J8409Q237m6708k9194o007m899j7882O286K9960K8529J319k6614
12986c2389j0737J3464R990O134l1162j2306j3628J4654N0116K975l6922j1912
12974e1723J8951J1039n715J1093j5351J846J7017j1653j2825M542l634k3351
12962e9764k2042J7891O957K4310J4576j3432K1209Q383j2341N003r404K0491
12950A837K0813j5749n743j3639j208R419r804k651j3948O83O314j1325K1888
$$ plain form
13038 -12226 -10242 7739 -1280 -12264 -7768 -6808 -16857 -3183 -40338 -63524 -34227 -27557 -14565
13025 -14565 -38283 -66287 -59523 -56454 -58607 -60334 -25453 -15297 -4575 11856 17464 1868 273
13012 273 -8116 -26856 -7790 9167 -4264 1929 10390 8155 14374 -4019 -52481 -44800 -20614
12999 -20614 6175 24584 32821 -13887 -43081 -49088 -53987 -71869 -65583 -35623 -7094 -5775 -32389
12986 -32389 -43126 -29662 -19672 -13538 -44700 -57006 -70634 -55980 -5864 -2889 -39811 -51723
12974 -51723 -32772 -21733 -27448 -16355 -31706 -29860 -12843 -24496 -37321 -32779 -36413 -59764
12962 -59764 -81806 -63915 -56958 -32648 -18072 -31504 -10295 -1912 -14253 -9250 -18654 1837
12950 1837 22650 6901 1158 -12481 -13689 -4270 -14074 -16725 -30673 -29990 -23676 -35001 -13113
12937a3113M13k2305m005J0117J6402j7422J293k627k918J3982j4963k205N516
12924c1835J8024j1430J4025j4517k1634J0406N9645q316j2484k6288J2589J2909
12912A094o980O658j9667m463J1206L505k5084j7221K7936J3907j3820k6632k9774
12899g9335K0450L3087M3666k2991j2264K0192m841k0369m126K9057J7072l9043
12887a9445k284Q319J2685K1784m2K6032J5602j271J3331j4671j3121o874k7767
12874A2278k2819j4878K007K7800K6311n725O710L62o851j2277j6875k904J1520
12861D659J7373J8499j9355N984j5684M756j4149m421P069J725K7551o745p749
12848A9513j4835j426p639m821o498l682P916K0655J3517m985l8763k438K2831
$$ plain form
12937 -13113 -12700 -35005 -39010 -28893 -12491 -29913 -28620 -31247 -34165 -20183 -35146 -37351 -31835
12924 -31835 -13811 -25241 -11216 -25733 -47367 -36961 22684 14368 1884 -24404 -11815 1094
12912 1094 -5886 772 -18895 -23358 -12152 -8647 -33731 -50952 -23016 -9109 -22929 -49561 -79335
12899 -79335 -58885 -25798 17868 -5123 -17387 2805 -2036 -22405 -26531 2526 19598 -19445
12887 -19445 -21729 -13410 -725 21059 21017 47049 62651 61380 74711 60040 46919 40045 12278
12874 12278 -10541 -25419 -23412 4388 30699 24974 31684 32046 25195 12918 -3957 -6861 4659
12861 4659 22032 40531 21176 27160 11476 16232 2083 -2338 4731 6456 34007 27262 19513
12848 19513 4678 3252 -4387 -9208 -15706 -19388 -11472 9183 22700 17715 -21048 -23486 -655
12835f55M980M31l485l105Q242l952J1258Q068j2506n5J9577M01J5444p210l5753
12820A680j676M063k4821l8440k391j112k0013L8147R836j3963N595j2109j2747
12807f7951R62P271R962K6645J7935O453Q005O143O897k3990j484R199J5554L921
12793B5522j1216M296J6715J8148P2763N6945O5211N8813p39m6178p0532p9903
12781A09845p1188p346m657K311p499R27k2792p629N633j7226k1753L074n053
12768d3353L5491P540L1819J3278N362K274J64j0061l3350l3619j190R565K6372
12755A0292M4047n00m801O54k2980l0558J4891R248q96p79k4426j8423P405j7492
12741c4318j274J3217K9660j4749k609J5288q871j8183n59L2786P825o423l3557
$$ plain form
12835 -655 4325 4756 1271 -1834 6408 2456 13714 21782 9276 9221 28798 29199 44643 37433 1680
12820 1680 4 4067 -20754 -59194 -61585 -62697 -82710 -44563 -34727 -48690 -43095 -55204 -67951
12807 -67951 -66989 -59718 -49756 -23111 -5176 1277 9282 15425 22322 -1668 -3152 6047 21601 25522
12793 25522 14306 18602 35317 53465 126228 183173 248384 307197 306458 260280 189748 109845
12781 109845 38657 31311 26654 28965 21466 22393 -399 -8028 -2395 -19621 -41374 -38300 -43353
12768 -43353 -7862 -322 31497 44775 50137 52411 52575 42514 9164 -24455 -25645 -16080 10292
12755 10292 54339 53839 49038 49692 26712 -3846 11045 20293 19397 18618 -5808 -24231 -16826 -34318
12741 -34318 -35592 -22375 7285 -7464 -10073 5215 -3656 -21839 -22398 10388 18213 11790 -21767
12728b1767j467k2901k3224p47L3383K2404l902j2080l54l784j0243j449K8025
12715a8106L3808O27j4446J7997J8945J1986j4708k8277k5883j0099m808K2584
12703a0380K1037j2250j2881K3004R195k5522j664Q514k252n700K42J245J3591
12690F179Q986k3109J960m869k1565o705J7638L1510l514N958K988k29J8666N883
12676C9777R646k2191k1336M35q551l9637k2429J027L0387L4422J3806j2656J4977
12663A7677m602l181P247j6746r824M500l874j4604j3307L4799K2382J0016L836
12650C4319k1246k0234J851J6834R02J0056j0003J1827o134n929K301n85j101
12637A2858N659K44o849j594J3181P708l871J3959p009j9653J41j91N041j7416
$$ plain form
12728 -21767 -23234 -46135 -69359 -70106 -36723 -14319 -18221 -30301 -30655 -34439 -44682 -46131 -18106
12715 -18106 15702 16329 1883 19880 38825 50811 36103 7826 -18057 -28156 -32964 -10380
12703 -10380 10657 -1593 -14474 8530 17725 -7797 -9461 -947 -3199 -8899 -8657 -7412 6179
12690 6179 15165 -7944 -5984 -10853 -32418 -39123 -21485 10025 6511 12469 15457 15228 33894 39777
12676 39777 49423 27232 5896 6331 -2220 -41857 -64286 -63259 -32872 1550 15356 2700 17677
12663 17677 13075 9894 17141 395 -9429 -4929 -8803 -23407 -36714 -1915 20467 30483 34319
12650 34319 13073 -7161 -5310 11524 12426 22482 12479 24306 18172 12243 14544 13959 12858
12637 12858 18517 18761 11912 10318 23499 31207 27336 41295 34286 14633 14774 14583 19624 2208
12623B208J179L1845k2458l1537j0079M771O563J4251k736m978L6182n438j5587
12610D186k2607j5654J1403O004n821j715L1443m401J413j0808l9035j4875n103
12597f5570k719K5808K6792R209M0045K6595l3460l5988j5945j2015O108j8699
12585d9839j7475Q828K6355K7486K5860P552J0786J608l496j1984k0553j4835
12573i707j1232l939N842J5176J1953J40L512L48j2604p027P726j227J7201N966
12559B2128m5345l6183J1582M1289J92j7004k895J4514K0809J4227J173j1553
12547A2934k2670l1999k946n463q459K6037K6680J0236j8072n032J7211j349J8972
12534A6080k7491k7543J4768J9850K6405j0312j0881L8319q060k7334j3726j0613
$$ plain form
12623 2208 3387 35232 12774 -18763 -28842 -24071 -17508 -3257 -5993 -10971 25211 19773 4186
12610 4186 -18421 -34075 -22672 -16668 -22489 -24204 7239 2838 4251 -6557 -45592 -60467 -65570
12597 -65570 -68289 -42481 -15689 -6480 33565 60160 26700 -9288 -25233 -37248 -31140 -49839
12585 -49839 -67314 -58486 -32131 -4645 21215 28767 39553 41161 37665 25681 5128 -9707
12573 -9707 -20939 -24878 -19036 -3860 8093 8233 11745 12093 -511 -7538 188 -1039 16162 22128
12559 22128 -23217 -59400 -47818 -6529 -6337 -23341 -26236 -11722 9087 23314 24487 12934
12547 12934 -9736 -41735 -44681 -50144 -58603 -32566 -5886 4350 -13722 -18754 -1543 -2892 16080
12534 16080 -11411 -38954 -24186 -4336 22069 11757 876 39195 31135 3801 -9925 -20538
12522b0538J9568K6529j5516q696j7072N293j5013J8643Q535j7393M714J949j0807
12509a9804l5003k8020K8055L1665J6035j977K921M3211j6711j5867q008k889
12497f392j2423k6874L951J1845J1737J1721j2247k6346j2398r691K0053L574
12485d3490j5791k343J978J4691J1378J7050q738j9063K0125R198J0778K035j399
12472c591m588l996r396k3623m052K7386L6058L0806q624k0019J4465J6860k509
12459D5177r60k5911k4092k8071J5294J3924l543j6280N374J3441J8229P118O961
12446B6661M107o774J2493L729J6596p986m4523n523K2017J6019L516j0106J0709
12433D0935o331k2411L990m718j6313J5519K3772J6513K0020j8125j9622r314
$$ plain form
12522 -20538 -970 25559 10043 1347 -15725 -10432 -25445 -6802 1733 -15660 -10946 -8997 -19804
12509 -19804 -54807 -82827 -54772 -23107 -7072 -9049 -6128 37083 20372 4505 -3503 -6392
12497 -6392 -18815 -45689 -41738 -29893 -18156 -6435 -18682 -45028 -57426 -67117 -47064 -43490
12485 -43490 -59281 -61624 -59646 -44955 -33577 -16527 -25265 -44328 -24203 -15005 -4227 -2192 -3591
12472 -3591 -8179 -12175 -21571 -45194 -49246 -21860 14198 45004 36380 16361 30826 47686 45177
12459 45177 44217 18306 -5786 -33857 -18563 -4639 -8182 -24462 -19088 -5647 12582 19700 26661
12446 26661 30768 23994 36487 40216 56812 48826 4303 -1220 20797 36816 40332 30226 40935
12433 40935 34604 12193 16183 11465 -4848 10671 34443 50956 70976 52851 33229 23915
12421B3915l6474J1005J7226n085l810j5053N324K8772J8744J118j9670j7191
12409H821j3761j0640l6449o756R069o59P780K8084n681j5608J6085J8273K0502
12396A9060O386J3010k28J8082l383j3666J414j8966j1996K3673o394R96k6228
12383A760O246J6364l774P980J6253m0315l5303J3264J5543R422P944N938j2576
12370H746j8194R796K219j2139k488M1941m444m0762R744L1136k1035R819M84
12357A4823k3751M852j5736j8446K9474j3149k3097m827J3233p551l204O774K3908
12344a6697L4387K8542n803j5377R059j5730k9750r567L2247J0229k8597q509
12332a5566L4587L3169P880l9560j6240L339n584l9086J3123J7136R431J6102
$$ plain form
12421 23915 -12559 -1554 15672 10587 6777 -8276 -2952 25820 44564 45682 26012 8821
12409 8821 -4940 -15580 -52029 -58785 -49716 -50375 -42595 -14511 -20192 -35800 -19715 -1442 19060
12396 19060 25446 38456 38228 56310 52927 39261 40675 21709 9713 33386 26992 27988 1760
12383 1760 8006 24370 20596 28576 44829 4514 -30789 -17525 -1982 7440 15384 21322 8746
12370 8746 -9448 348 2567 -9572 -12060 29881 25437 -15325 -5581 25555 4520 14339 14823
12357 14823 -8928 -4076 -19812 -38258 -8784 -21933 -45030 -49857 -36624 -44175 -47379 -40605 -16697
12344 -16697 17690 46232 40429 25052 34111 18381 -11369 -20936 11311 21540 -7057 -15566
12332 -15566 19021 52190 60070 20510 4270 7609 2025 -37061 -23938 -6802 2629 18731
12320A8731K3060k7926J779K7604N289j636j1969j8698K825k471l3706p193J0371
12307a3940N414j238k909J7594J6839j2804k4035N066J8219m135m906K9863K8250
12294E7278k5073m20j7364m298l595K6806R823k3952j9838j1138P209K8555J0301
12281C4294J1453M022j967J6189J6594P606k2532k4778l148l384k6060K0939L65
12268B9593p26r572J1164K645j2693Q008L832P822j8110k7964J554J4897L2938
12255D3388L7579J6017k0453n1347j4695j3583j9825l4135J4270J3898N360k040
12243b5566J126J2477J6242J7554k2394N460K3777N767m869p866m970P286j9647
12230D377k7921K374k3679P372R743P651l397J6758J9813K6142K0941o957j9045
$$ plain form
12320 18731 41791 13865 15644 43248 48537 46901 34932 16234 19059 16588 -17118 -24311 -13940
12307 -13940 -8526 -9764 -12673 4921 21760 8956 -15079 -10013 8206 4071 -835 29028 57278
12294 57278 32205 31785 14421 10123 6528 33334 43157 19205 -633 -11771 -4562 23993 34294
12281 34294 45747 49769 47802 63991 80585 88191 65659 40881 37733 34349 8289 29228 29593
12268 29593 28867 19295 30459 33104 20411 28419 32251 40073 21963 -6001 -4447 10450 43388
12255 43388 80967 96984 76531 25184 10489 -3094 -22919 -57054 -42784 -28886 -23526 -25566
12243 -25566 -24440 -11963 4279 21833 -561 4899 28676 34443 29574 21708 16738 24024 4377
12230 4377 -23544 -21170 -44849 -37477 -27734 -20083 -23480 -6722 13091 39233 60174 53217 34172
12217C4172k1929l197J3329J1138J759K5976r82p80N278k6681l1917o227J9601
12204A9540o222K0143L2109J4936j5112m2995P007o756k93M4941J107l387J8456
12191H3474j1757L101j3875l0493k7001l408l184L9162j848l4254k519j6362k0304
12178c9268L1210L2079K9202l1560l0899j1066k317K8263K2776J5075P131M378
12166E5004j2162k0994j1538p359M9413M1022o4q639j4320Q977j4094K481k95
12153F7432R618K6028m563K847L6123k4327k3288K4038J1565m6811k8007J2763
12141F3418J2312J5059o545j8899j1135j5739K880j433l407J6732k6369j4885
12129A1989J8347k2341l4195J0215K5109J8145K6275r288O369p473r385Q331p12
$$ plain form
12217 34172 12243 9046 22375 33513 35272 61248 60266 59486 64764 38083 6166 -61 19540
12204 19540 13318 33461 65570 80506 65394 22399 29406 22650 22357 67298 68405 65018 83474
12191 83474 71717 74818 60943 30450 3449 41 -3143 36019 34171 -83 -2602 -18964 -39268
12178 -39268 -8058 24021 53223 21663 -9236 -20302 -22619 5644 28420 43495 50626 55004
12166 55004 42842 21848 10310 2951 52364 93386 93322 84683 70363 79340 65246 67727 67432
12153 67432 77050 103078 98515 101362 137485 113158 89870 113908 125473 78662 50655 63418
12141 63418 75730 90789 84244 65345 54210 38471 41351 39918 36511 53243 26874 11989
12129 11989 30336 7995 -26200 -15985 9124 27269 53544 44256 50625 43152 33767 42098 41386
12116D1386M859M6874k1650k1623J1314J5756J4078j6441j2736O3767o389j5796
12104A03399r3J1339j6468j6158j043J1132J4310J0556j7939Q951j0211o725K9107
12091A20157j5362k4683j5224J7393l395J3345K1836j7617k8362j595l252k0328
12079D2913q239J8235N758j8234M391P588O919J5448J6281l639m807l2816k453
12066D7345P208K0391l026K1623l0952O854L4588L797n652j3102l172j2491J5941
12053H9352p268j3594j4631M2605L2311J5541j3598m784K2397r185J4051N92r333
12040A44456L154k9498k7357p999P663j9722O429L7179J4624k7439L008j2419
12028I2079Q48L555n240K9284K9934k5752N63K9247M127K7338K0399L8302K6009
$$ plain form
12116 41386 46245 93119 71469 49846 61160 76916 90994 74553 61817 125584 119195 103399
12104 103399 103306 114645 98177 82019 80976 92108 106418 116974 99035 107986 97775 91050 120157
12091 120157 104795 80112 64888 82281 78886 92231 114067 96450 68088 66493 63241 42913
12079 42913 34674 52909 58667 40433 44824 52412 59331 74779 91060 87421 82614 49798 47345
12066 47345 54553 74944 71918 93541 62589 69443 104031 107828 102176 89074 85902 73411 89352
12053 89352 82084 68490 53859 96464 128775 144316 130718 125934 148331 139146 153197 153789 144456
12040 144456 147610 118112 90755 82756 90419 70697 77126 114305 128929 101490 104498 92079
12028 92079 92927 96482 91242 120526 150460 124708 125271 154518 158645 185983 206382 244684 270693
12015B70693N7347R0574Q8782R9229N9085O6866M5555K6087k7173J28j4709l8217
12003G24247m7192o5062k1325j3225l9246l0572j3078J7932l502l2332N602J4295
11991D96542j3011L632K1661M0755N3142O2368M5453L1059j548J2344P2316P5067
11979H99780M6061n568M0783J8978J2324J2134m827l0235m3371l3845l6012n2961
11967H23241n3087o3159l8960k8144m9379n6901j5806J3405R031l5636m0225j3021
11955D51359r657l9863r108Q221Q332K8920L5853K0377K8544O7591P5411R6589
11943G62569J07219Q4816P8548R015k1589l9635r4328r6052r0807p7016r5475
11932E27265r1181n6796l3650m1082l6234k5153j4438J3760j4349m1166k4868
$$ plain form
12015 270693 328040 418614 507396 606625 665710 732576 778131 804218 777045 777173 762464 724247
12003 724247 677055 611993 590668 577443 538197 507625 494547 512479 508977 476645 482247 496542
11991 496542 483531 487163 508824 549579 602721 665089 710542 741601 740053 752397 824713 899780
11979 899780 945841 940273 981056 1000034 1012358 1024492 1019665 989430 946059 912214 876202 823241
11967 823241 770154 706995 668035 639891 590512 533611 517805 531210 540241 504605 464380 451359
11955 451359 441702 401839 392731 400952 409284 438204 474057 494434 522978 590569 665980 762569
11943 762569 869788 954604 1033152 1042167 1020578 980943 886615 790563 699756 622740 527265
11932 527265 436084 379288 345638 304556 268322 243169 228731 242491 228142 186976 162108
11921A62108j7511J3951q064k140j4203m1356M889J2963L913O455O364j3220R598
11908A23747J482m508j1223j1276j5675j2401J4340J4202k2741O870Q558l5041
11896E6334n306L2967j980j4087J3752j7427J7020K0059L201n62K1899J8248l9032
11883A05086m3295J3360K7115j5521J6059J6206l8530Q638j1220j5458J7125K1325
11871A00890l678Q897Q074K6727J14l8215k0997K7502K115j7658j731n164Q65
11858H7741j8851L570K1493L7263j5224n1456k5098K4327J901m5969M278L2428
11846E6403J1401J8505J5505J3345K4819L3858N117k2329L438J1518m336P982
11834A75226L3380Q494m0917l9782k2905k3895J8087k113k0741K1447n639J258
$$ plain form
11921 162108 144597 158548 150484 148344 134141 92785 97674 110637 114550 121005 127369 114149 123747
11908 123747 125229 120721 109498 98222 82547 70146 84486 98688 75947 82817 91375 56334
11896 56334 51028 83995 82015 67928 81680 64253 81273 101332 104533 103971 125870 144118 105086
11883 105086 61791 75151 102266 86745 102804 119010 80480 89118 77898 62440 79565 100890
11871 100890 97212 106109 114183 140910 141024 102809 81812 109314 111429 93771 92040 86876 87741
11858 87741 68890 72460 93953 131216 115992 64536 39438 63765 65666 19697 23975 56403
11846 56403 67804 86309 101814 115159 139978 173836 178953 156624 160062 171580 167244 175226
11834 175226 208606 217100 176183 136401 113496 89601 107688 105575 84834 106281 100642 101900
11822A01900o874M999K6590J5358J4914Q219K9660K7240j1759k9731m243L2711
11810B08984N757L2537J5744o168j6474O014O63R061p014j2613j6699k4984O866
11797B01674J189j6030k0742r797L239R845k1137n348j3835p246M763L7652N4338
11784B18565J083j2957j7955j5142r298Q684K1002K3857J0189K2020Q331j1121
11772B47258Q155K3094P805j367l9840k0988j2725N852J163q560o993k0932J6490
11759A98412j4293k586j86P525p341j2304J8386L4725K5359R885O492j7432K7389
11746B74031j7828j7317J7484J7939J3674J8880K5136j474j8020k8056r598K584
11734B77435J8207j5602k0905J8247J2472Q894K328K1225J3747k8853M577K3978
$$ plain form
11822 101900 95026 100025 126615 141973 156887 165106 194766 222006 210247 180516 176273 208984
11810 208984 214741 247278 263022 256854 240380 246394 247057 256118 249104 236491 219792 194808 201674
11797 201674 202863 186833 166091 156294 159533 169378 148241 142893 129058 121812 126575 164227 218565
11784 218565 219648 206691 188736 173594 164296 172980 193982 217839 228028 250048 258379 247258
11772 247258 255413 278507 286312 284945 245105 224117 211392 217244 218407 209847 202854 181922 198412
11759 198412 184119 181533 181347 188872 181531 169227 187613 222338 247697 257582 264074 246642 274031
11746 274031 256203 238886 256370 274309 287983 306863 331999 330525 312505 284449 274851 277435
11734 277435 295642 280040 259135 277382 289854 298748 301076 322301 336048 307195 311772 335750
11722C35750K0445O30R032J1791L6171J4510J9937M366L4957K9195O875J0558
11710E34217L9777k7702k358J0370j317mJ0443j0149n288m38l3345j4164j467
11697D98575j219K3084k7823l3876j0415P35K3441j3959k4834M509J3465K1938
11685D73621J6097l253m296l0791k2396J7454O107J8882O206J647k347K2523N405
11672E04859m666P620O553J8303L3622p010k9994n490l743J5400J0229J7622J9179
11659E82484J4062J4397K7857K8445J1999Q75R905M557o241K4601j8866j880O4930
11646G57125L4947M0810K1262K9673K2685J3512J0096j8280J45M9640Q8393N8065
11634A108073N6443O5530P2972R0400M6866L1765M2682Q4643R1234O8465J11674
$$ plain form
11722 335750 356195 356825 365857 377648 413819 428329 448266 452632 487589 516784 523659 534217
11710 534217 573994 546292 543934 554304 552987 552983 563426 553277 547989 547551 514206 500042 498575
11697 498575 497356 520440 492617 458741 448326 449061 472502 458543 433709 438218 451683 473621
11685 473621 489718 486465 482169 451378 428982 446436 452543 471425 477631 479278 476931 499454 504859
11672 504859 500193 507813 514366 532669 566291 559281 529287 523797 520054 535454 545683 563305 582484
11659 582484 596546 610943 638800 667245 679244 680119 690024 694581 688340 712941 694075 692195 757125
11646 757125 792072 832882 854144 883817 906502 920014 930110 911830 911975 961615 1050008 1108073
11634 1108073 1164516 1230046 1303018 1393418 1440284 1472049 1514731 1599374 1690608 1759073 1870747
$$ [...]
##END NTUPLES=NMR SPECTRUM
##END=
