##TITLE=Analysis number 314883
Compound Code cc 34401
Book Reference 451/41
Project Code adrs
Chemist Name evam
##JCAMPDX= 6.0         $$ Bruker NMR JCAMP-DX V2.0
##DATA TYPE= NMR SPECTRUM
##DATA CLASS= NTUPLES
##ORIGIN= Bruker BioSpin GmbH
##OWNER= NMR
$$ XWIN-NMR		Version 3.5
$$ Fri Oct 28 12:45:03 2005 GMT Daylight Time (UT+1h)  MAYBRIDGE\NMR@NMR_250MHZ
##.OBSERVE FREQUENCY= 250.131544655141
##.OBSERVE NUCLEUS= ^1H
##.ACQUISITION MODE= SIMULTANEOUS (DQD)
##.ACQUISITION SCHEME= undefined
##.AVERAGES= 16
##.DIGITISER RES= 18
##SPECTROMETER/DATA SYSTEM= dpx250
##.PULSE SEQUENCE= zg30
##.SOLVENT NAME= DMSO
##.SHIFT REFERENCE= (INTERNAL, DMSO, 0, 16.522)
##AUDIT TRAIL= $$ (NUMBER, WHEN, WHO, WHERE, WHAT)
$$ ##TITLE= Audit trail, XWIN-NMR		Version 3.5
$$ ##JCAMPDX= 5.01
$$ ##ORIGIN= Bruker BioSpin GmbH
$$ ##OWNER= NMR
$$ C:\u/data/dgb/nmr/ADRS/11570/pdata/1/auditp.txt
$$ ##AUDIT TRAIL=  $$ (NUMBER, WHEN, WHO, WHERE, WHAT)
(   1,<2005-10-28 12:44:28.36 +100>,<MAYBRIDGE\NMR>,<NMR_250MHZ>,
      <created by zg, POWCHK disabled, PULCHK disabled
       configuration hash MD5:
       62 19 C7 07 E1 42 D1 B7 37 6C 3D D0 77 39 F9 E6
       data hash MD5: 64K
       A7 2C B9 F6 87 82 CC 30 6D 98 4A 50 35 90 E4 6A>)
(   2,<2005-10-28 12:44:44.86 +100>,<MAYBRIDGE\NMR>,<NMR_250MHZ>,
      <Start of raw data processing
       ef LB = 0.3 FT_mod = 6 PKNL = 1 SI = 32K 
       data hash MD5: 32K
       EE 63 58 A2 BB 3B 82 47 CF 25 53 D4 77 11 04 1E>)
(   3,<2005-10-28 12:44:48.97 +100>,<MAYBRIDGE\NMR>,<NMR_250MHZ>,
      <apk 
       data hash MD5: 32K
       7D 4D 12 03 67 78 F3 6E 44 84 A4 24 A8 F5 6E 46>)
(   4,<2005-10-28 12:44:51.39 +100>,<MAYBRIDGE\NMR>,<NMR_250MHZ>,
      <abs ABSG = 5 
       data hash MD5: 32K
       4F B4 0F DE BB DF A3 3F 36 D6 53 FB 4F 6B C4 78>)
$$ ##END=
$$ 
$$ hash MD5
$$ 67 68 D0 C5 4C 72 D3 AE D1 10 D4 50 B5 08 BE 8C
##$RELAX= 
##$RELAX= 
##$RELAX= 
##$RELAX= 
##$RELAX= 
##$RELAX= 
##$RELAX= 
$$ Bruker specific parameters
$$ --------------------------
##$DU= <C:\u>
##$EXPNO= 11570
##$NAME= <ADRS>
##$PROCNO= 1
##$TYPE= <nmr>
##$USER= <dgb>
##$AMP= (0..31)
100 100 100 100 100 100 100 100 100 100 100 100 100 100 100 100 100 100 
100 100 100 100 100 100 100 100 100 100 100 100 100 100 
##$AQSEQ= 0
##$AQ_mod= 3
##$AUNM= <au_zg>
##$AUTOPOS= <24 >
##$BF1= 250.13
##$BF2= 250.13
##$BF3= 250.13
##$BF4= 250.13
##$BF5= 500.13
##$BF6= 500.13
##$BF7= 500.13
##$BF8= 500.13
##$BYTORDA= 1
##$CFDGTYP= 0
##$CFRGTYP= 5
##$CHEMSTR= <none>
##$CNST= (0..31)
1 1 145 1 1 1 1 1 1 1 1 1 1 1 1 1 1 1 1 1 1 1 1 1 1 1 1 1 1 1 1 1 
##$CPDPRG= <>
##$CPDPRG1= <>
##$CPDPRG2= <>
##$CPDPRG3= <>
##$CPDPRG4= <mlev>
##$CPDPRG5= <mlev>
##$CPDPRG6= <mlev>
##$CPDPRG7= <mlev>
##$CPDPRG8= <mlev>
##$CPDPRGB= <>
##$CPDPRGT= <>
##$D= (0..31)
0 1 0 0 0 0 0 0 0 0.06 0 0 0 0 0 0 0.0002 0 0 0 0 0 0 0 0 0 0 0 0 0 0 
0 
##$DATE= 1130499866
##$DBL= (0..7)
120 120 120 120 120 120 120 120 
##$DBP= (0..7)
150 150 150 150 150 150 150 150 
##$DBP07= 0
##$DBPNAM0= <>
##$DBPNAM1= <>
$$ [...]
##$SUBNAM7= <"">
##$SUBNAM8= <"">
##$SUBNAM9= <"">
##$SW= 20.6930455092707
##$SWIBOX= (0..15)
0 0 3 0 0 0 0 0 0 0 0 0 0 0 0 0 
##$SW_h= 5175.983436853
##$TD= 65536
##$TD0= 1
##$TE= 296.16
##$TE2= 300
##$TE3= 300
##$TEG= 300
##$TL= (0..7)
0 120 120 120 120 120 120 120 
##$TP= (0..7)
150 150 150 150 150 150 150 150 
##$TP07= 0
##$TPNAME0= <>
##$TPNAME1= <>
##$TPNAME2= <>
##$TPNAME3= <>
##$TPNAME4= <>
##$TPNAME5= <>
##$TPNAME6= <>
##$TPNAME7= <>
##$TPOAL= (0..7)
0.5 0.5 0.5 0.5 0.5 0.5 0.5 0.5 
##$TPOFFS= (0..7)
0 0 0 0 0 0 0 0 
##$TUNHIN= 0
##$TUNHOUT= 0
##$TUNXOUT= 0
##$USERA1= <user>
##$USERA2= <user>
##$USERA3= <user>
##$USERA4= <user>
##$USERA5= <user>
##$V9= 5
##$VALIST= <valist>
##$VCLIST= <CCCCCCCCCCCCCCC>
##$VD= 0
##$VDLIST= <DDDDDDDDDDDDDDD>
##$VPLIST= <PPPPPPPPPPPPPPP>
##$VTLIST= <TTTTTTTTTTTTTTT>
##$WBST= 1024
##$WBSW= 4
##$XGAIN= (0..3)
0 0 0 0 
##$XL= 0
##$YL= 0
##$YMAX_a= 459785
##$YMIN_a= -394180
##$ZGOPTNS= <>
##$ZL1= 120
##$ZL2= 120
##$ZL3= 120
##$ZL4= 120
##$ABSF1= 16.522
##$ABSF2= -4.171173
##$ABSG= 5
##$ABSL= 3
##$ALPHA= 0
##$AQORDER= 0
##$ASSFAC= 0
##$ASSFACI= 0
##$ASSFACX= 0
##$ASSWID= 0
##$AUNMP= <proc_1d>
##$AZFE= 0.1
##$AZFW= 0.1
##$BCFW= 0
##$BC_mod= 0
##$BYTORDP= 0
##$COROFFS= 0
##$CY= 12.5
##$DATMOD= 1
##$DC= 0
##$DFILT= <>
##$DTYPP= 0
##$F1P= 14.0000005364418
##$F2P= -0.99999901652339
##$FCOR= 0.5
##$FTSIZE= 32768
##$FT_mod= 6
##$GAMMA= 0
##$GB= 0
##$INTBC= 1
##$INTSCL= 1
##$ISEN= 128
##$LB= 0.3
##$LEV0= 0
##$LPBIN= 0
##$MAXI= 10000
##$MC2= 0
##$MEAN= 0
##$ME_mod= 0
##$MI= 0
##$NCOEF= 0
##$NC_proc= -4
##$NLEV= 6
##$NOISF1= 0
##$NOISF2= 0
##$NSP= 0
##$NTH_PI= 0
##$NZP= 0
##$OFFSET= 16.522
##$PC= 1
##$PHC0= 67.06554
##$PHC1= 9.653914
##$PH_mod= 1
##$PKNL= yes
##$PPARMOD= 0
##$PSCAL= 4
##$PSIGN= 0
##$REVERSE= no
##$SF= 250.13
##$SI= 32768
##$SIGF1= 0
##$SIGF2= 0
##$SINO= 400
##$SIOLD= 32768
##$SREGLST= <1H.DMSO>
##$SSB= 0
##$STSI= 32768
##$STSR= 0
##$SW_p= 5175.98343685301
##$SYMM= 0
##$S_DEV= 0
##$TDeff= 65536
##$TDoff= 0
##$TI= <Analysis number 999999
Compound Code 99
Book Reference 9
Project Code 9>
##$TILT= no
##$TM1= 0
##$TM2= 0
##$TOPLEV= 0
##$USERP1= <user>
##$USERP2= <user>
##$USERP3= <user>
##$USERP4= <user>
##$USERP5= <user>
##$WDW= 1
##$XDIM= 32768
##$YMAX_p= 329881876
##$YMIN_p= -348377
$$ End of Bruker specific parameters
$$ ---------------------------------
##NTUPLES= NMR SPECTRUM
##VAR_NAME=  FREQUENCY,     SPECTRUM/REAL,   SPECTRUM/IMAG
##SYMBOL=    X,             R,               I
##VAR_TYPE=  INDEPENDENT,   DEPENDENT,       DEPENDENT
##VAR_FORM=  AFFN,          ASDF,            ASDF
##VAR_DIM=   32768,         32768,           32768
##UNITS=     HZ,            ARBITRARY UNITS, ARBITRARY UNITS
##FACTOR=    0.157963299565203, 1,           1
##FIRST=     4132.6476996994, 0,             0
##LAST=      -1043.33573715361, 0,           0
##MIN=       -1043.33573715361, -348377,     0
##MAX=       4132.6476996994, 329881876,     0
$$ Real data points
##PAGE= N=1
##DATA TABLE= (X++(R..R)), XYDATA
$$ [...]
$$ plain form
24512 -98613 -87940 -41905 -1214 -2919 -26819 39060 113442 107928 74361 47302 20732 210
24500 210 68650 142850 146328 87688 -45827 -47046 -100971 -67022 -92328 -24374 -65304 -136753
24488 -136753 -105267 104723 100224 32592 4537 -71501 -2373 9801 -126082 -201871 -153390
24477 -153390 -20698 30109 77161 -19367 -82499 -116481 -56944 -37552 -48130 -17951 -2661
24466 -2661 -36484 -28946 67463 35848 106777 -2386 -40064 -18352 -63764 -77930 5202 42074
24454 42074 -56950 -56687 -11549 -42068 -71020 -136780 -161346 -97179 -46761 -53412 -91726 -77404
24442 -77404 -45121 23971 40976 67868 25209 31091 109957 -1053 -87585 -104642 -117468 -53387
24430 -53387 113230 68220 -56017 -39232 -52278 -92698 -126305 -140019 -167164 -128851 -17264
$$ packed form
24512i8613J0673M6035M0691j705k3900O5879P4382n514l3567k7059k6570k0522
24500B10O8440P4200L478n8640j33515j219n3925L3949k5306O7954m0930p1449
24488a36753L1486K09990m499o7632k8055p6038O9128J2174j35883p5789M8481
24477a53390J32692N0807M7052r6528o3132l3982N9537J9392j0578L0179J5290
24466b661l3823P538R6409l1615P0929j09163l7678K1712m5412j4166Q3132L6872
24454D2074r9024K63M5138l0519k8952o5760k4566O4167N0418o651l8314J4322
24442g7404L2283O9092J7005K6892m2659N882P8866j11010q6532j7057j2826O4081
24430e3387J66617m5010j24237J6785j3046m0420l3607j3714k7145L8313J11587
$$ plain form
24419 -17264 48418 -14461 -44577 -65029 -25269 -35877 24569 13271 39280 55355 23133 -55698
24407 -55698 -126379 -96381 -33497 -22578 -17006 -17190 7799 84606 54143 -2726 -43134 -51910
24395 -51910 -96702 -82419 -43727 -192556 -234788 -143927 -14080 1935 -98152 -192070 -235183
24384 -235183 -155931 3766 90447 116127 61139 27698 15115 30097 -9095 -21779 -14415
24373 -14415 64054 152356 145438 60113 -54436 -107322 -35011 3043 -13970 2722 -11062 21068
24361 21068 -38086 -67920 -109664 -47892 -78442 15801 69603 -41331 -46300 21011 -2849 21881
24349 21881 131063 116495 79594 41510 46718 23433 61232 -10779 -111568 -53007 -61712 -87613
24337 -87613 694 6800 8645 13590 -12369 -32741 -138046 -110344 -58558 -28214 -52485 -149508
$$ packed form
24419a7264O5682o2879l0116k0452L9760j0608O0446j1298K6009J6075l2222p8831
24407e5698p0681K9998O2884J0919N572j84K4989P6807l0463n6869m0408q776
24395e1910m4792J4283L8692j48829m2232R0861J29847J6015j00087r3918m3113
24384b35183P9252J59697Q6681K5680n4988l3441j2583J4982l9192j2684P364
24373a4415P8469Q8302o918q5325j14549n2886P2311L8054j7013J6692j3784L2130
24361B1068n9154k9834m1744O1772l0550R4243N3802j10934m969O7311k3860K4730
24349B1881J09182j4568l6901l8084N208k3285L7799p2011j00789N8561q705k5901
24337h7613Q8307O106J845M945k5959k0372j05305K7702N1786L0344k4271r7023
$$ plain form
24325 -149508 -126254 -3891 21775 95293 102090 12360 -6096 -10344 -57868 -74648 -112436 -26257
24313 -26257 140 88760 212769 155189 110765 37844 68468 -12323 -97193 31458 104314
24302 104314 32506 51860 39141 2561 -80690 -70858 -100178 -57319 6092 -24432 -57919 -39846
24290 -39846 41335 -5659 -93455 -71190 -11743 -27617 11252 28642 8684 48898 33165 124808
24278 124808 101638 52100 31495 31415 49369 66669 33613 11373 19122 54948 88554 36451
24266 36451 113911 75864 -73175 -147971 -121641 -70504 20684 76609 21943 11878 133559
24255 133559 208552 88864 -59001 -31818 72745 78988 14642 -34502 12524 68778 52789
24244 52789 -27324 -81049 -122887 -70473 -13753 -2110 -43020 -47520 -30127 -148789 -181393 -144647
$$ packed form
24325a49508K3254J22363K5666P3518O797q9730j8456m248m7524j6780l7788Q6179
24313b6257K6397Q8620J24009n7580m4424p2921L0624q0791q4870J28651P2856
24302A04314p1808J9354j2719l6580q3251R832k9320M2859O3411l0524l3487J8073
24290c9846Q1181m6994q7796K2265N9447j5874L8869J7390j9958M0214j5733R1643
24278A24808k3170m9538k0605q0J7954J7300l3056k2240P749L5826L3606n2103
24266C6451P7460l8047j49039p4796K6330N1137R1188N5925n4666j0065J21681
24255A33559P4993j19688j47865K7183J04563O243o4346m9144M7026N6254j5989
24244E2789q0113n3725m1838N2414N6720J1643m0910m500J7393j18662l2604L6746
$$ plain form
24232 -144647 -208064 -178139 -92957 -88210 35200 -2125 -38267 -18176 -88523 -167905 -187054
24221 -187054 -76110 10012 13384 4048 64364 119248 207810 239479 209373 156786 73840 89572
24209 89572 112276 28722 -11561 -20078 -49345 -87123 -66677 -58710 -101664 -133139 -148505 -156940
24197 -156940 -159207 -189087 -171541 -134199 -41445 -59816 -66194 -109090 -140596 -41623 -77885 -61769
24185 -61769 -10862 -28909 -97090 3568 -21350 11810 58694 66864 25267 -26293 -65755 -66986
24173 -66986 -117970 -78456 -64277 -101346 -144590 -78258 -121259 -44364 28162 53421 53848 -18370
24161 -18370 -76710 -84405 -30722 120830 148568 33914 -184083 -158310 -186651 -187435 -125779 -183859
24149 -183859 -242211 -111897 -68430 -73110 -85325 -160627 -140403 -192512 -157775 -49200 76721
$$ packed form
24232a44647o3417K9925Q5182M747J23410l7325l6142K0091p0347p9382j9149
24221a87054J10944Q6122L372r336O0316N4884Q8562L1669l0106n2587q2946J5732
24209H9572K2704q3554m0283q517k9267l7778K0446P967m2954l1475j5366q435
24197a56940k267k9880J7546L7342R2754j8371o378m2896l1506R8973l6262J6116
24185f1769N0907j8047o8181J00658k4918L3160M6884Q170m1597n1560l9462j231
24173f6986n0984L9514J4179l7069m3244O6332m3001P6895P2526K5259M27p2218
24161a8370n8340p695N3683J51552K7738j14654k17997K5773k8341p84O1656n8080
24149a83859n8352J30314M3467m680j2215p5302K0224n2109L4737J08575J25921
$$ plain form
24138 76721 134348 101095 103785 39783 -30195 -136894 -155036 -112952 -64820 -98719 -50212 -60096
24126 -60096 -51188 11211 -23714 33592 -15710 12677 52226 -99492 -168168 -95920 -44144 28324
24114 28324 -1533 -24440 3467 -88169 -35661 -32902 -43746 -26844 -41792 -147578 -259423
24103 -259423 -201513 -35680 -9187 -152502 -225563 -163191 -109789 25620 28841 4000 111946
24092 111946 95864 4211 -35074 -39032 -41697 -12643 69220 110294 24381 -71046 -218086 -261333
24080 -261333 -214127 -109503 -28504 32781 88950 27657 -53753 -39286 -76335 -176511 -109653
24069 -109653 -59898 -46319 -97057 -142954 -189645 -99883 41529 -43925 -211142 -226004 -240743
24058 -240743 -169217 -66322 -58432 -41177 -25511 -88387 -53891 -29605 -886 -24111 21864
$$ packed form
24138G6721N7627l3253K690o4002o9978j06699j8142M2084M8132l3899M8507r884
24126f0096Q908O2399l4925N7306m9302K8387L9549j51718o8676P2248N1776P2468
24114B8324k9857k2907K7907r1636N2508K759j0844J6902j4948j05786j11845
24103b59423N7910J65833K6493j43315p3061O2372N3402J35409L221k4841J07946
24092A11946j6082r1653l9285l958k665K9054Q1863M1074q5913r5427j47040m3247
24080b61333M7206J04624Q0999O1285N6169o1293q1410J4467l7049j00176O6858
24069a09653M9755J3579n0738m5897m6691Q9762J41412q5454j67217j4862j4739
24058b40743P1526J02895P890J7255J5666o2876L4496K4286K8719k3225M5975
$$ plain form
24047 21864 20589 26826 -44961 -35937 -10981 -72721 -118042 -143294 -104309 17221 -29747 -31059
24035 -31059 12155 54482 47702 -19955 -72381 -71803 -92607 -157159 -132211 -61356 -21472 51381
24023 51381 67119 46921 75930 38115 46695 -13081 -81864 -68518 -64151 -24869 -34339 16903
24011 16903 26961 77424 94939 43751 -12428 -31763 -5986 -12853 -68321 -83995 -143712 -146264
23999 -146264 -235476 -231228 -133345 -53125 -37502 20029 140962 107053 5898 -15880 8833
23988 8833 -65686 -107075 -72934 -65566 -33651 -9799 55975 113118 147983 184117 173163 82103
23976 82103 26919 -35195 -29781 -7988 -24281 -57372 -83569 -195745 -225585 -93047 -34900
23965 -34900 5972 93709 77391 33103 59537 28718 -31629 16462 20260 22588 103989 214959
$$ packed form
24047B1864j275O237p1787R024K4956o1740m5321k5252L8985J21530m6968j312
24035c1059M3214M2327o780o7657n2426N78k0804o4552K4948P0855L9884P2853
24023E1381J5738k0198K9009l7815Q580n9776o8783J3346M367L9282r470N1242
24011A6903J0058N0463J7515n1188n6179j9335K5777o867n5468j5674n9717k552
23999a46264q9212M248R7883Q0220J5623N7531J20933l3909j01155k1778K4713
23988H833p4519m1389L4141P368L1915K3852O5774N7143L4865L6134j0954r1060
23976H2103n5184o2114N414K1793j6293l3091k6197j12176k9840J32538N8147
23965c4900M0872Q7737j6318m4288K6434l0819o0347M8091L798K328Q1401J10970
$$ plain form
23953 214959 229653 196346 120265 45916 13201 -78929 -104411 26302 63247 25058 -22307
23942 -22307 -32462 19672 -29677 60487 30942 -41890 80200 122479 259591 202013 29126
23931 29126 -26466 -23879 13783 126108 137935 85173 58705 -10537 36692 78216 109675 -17650
23919 -17650 -92723 -52688 -19082 -94691 -86216 -126656 -133519 -98916 -61727 -40012 56026 33345
23907 33345 15976 12437 -111128 -151203 -84427 -55356 1369 114334 40338 -3954 2593 -59903
23895 -59903 -30881 -39923 21884 100483 132451 45749 18975 46195 -72781 -23388 90415
23884 90415 121595 64566 -50256 -94117 -93435 -73155 -65589 13656 27643 -73119 -112288 -131176
23872 -131176 -116217 -13513 -50403 -42084 37568 28935 3653 -31123 14864 -1696 -47507 -161703
$$ packed form
23953B14959J4694l3307p6081p4349l2715r2130k5482J30713L6945l8189m7365
23942b2307j0155N2134m9349R0164k9545p2832J22090M2279J37112n7578j72887
23931B9126n5592K587L7662J12325J1827n2762k6468o9242M7229M1524L1459j27325
23919a7650p5073M0035L3606p5609Q475m0440o863L4603L7189K1715R6038k2681
23907C3345j7369l539j23565m0075O6776K9071N6725J12965p3996m4292O547o2496
23895e9903K9022r042O1807P8599L1968q6702k6774K7220j18976M9393J13803
23884I0415L1180n7029j14822m3861O82K0280P566P9245J3987j00762l9169j8888
23872a31176J4959J02704l6890Q319P9652q633k5282l4776M5987j6560m5811j14196
$$ plain form
23860 -161703 -104781 56197 71669 110123 85242 -41145 -114325 -106639 -58932 -2019 3447
23849 3447 -51017 -140539 -107727 23551 90720 10664 -39223 -88500 -129795 -77793 12898 40862
23837 40862 122087 52890 -32261 -102731 6698 140852 98248 16109 27794 -23168 -32707
23826 -32707 14578 43479 40586 63300 45559 67953 116419 23885 18596 180227 225702 225484
23814 225484 78225 1587 38129 -36918 -88322 -75812 -14260 -77224 -137570 -144813 -115571
23803 -115571 -29820 2084 -121734 -241456 -232170 -224348 -186387 -76504 -19974 2999 25817
23792 25817 94797 127975 98115 56520 69577 40993 -20387 -53605 -31806 36646 47002 -20097
23780 -20097 -1580 62024 61859 -3643 -29854 -48370 -22775 6562 64049 133101 121689 77677
$$ packed form
23860a61703N6922J60978J5472L8454k4881j26387p3180P686M7707N6913N466
23849C447n4464q9522L2812J31278O7169q0056m9887m9277m1295N2002R0691K7964
23837D0862Q1225o9197q5151p0470J09429J34154m2604q2139J1685n0962r539
23826c2707M7285K8901k893K2714j7741K2394M8466r2534n289J61631M5475k18
23814B25484j47259p6638L6542p5047n1404J2510O1552o2964o0346p243K9242
23803a15571Q5751L1904j23818j19722R286P822L7961J09883N6530K2973K2818
23792B5817O8980L3178k9860m1595J3057k8584o1380l3218K1799O8452J0356o7099
23780b0097J8517O3604j65o5502k6211j8516K5595K9337N7487O9052j1412m4012
$$ plain form
23768 77677 58954 34067 -702 65801 66761 -22167 -76833 -90142 -94033 19377 -30499 -56816
23756 -56816 -111177 -122468 -115210 -54651 -4897 -3630 12157 -13454 -75902 -192206 -205637 -92560
23744 -92560 -21735 -75003 -93071 -128551 -12771 102593 109084 98890 140588 117731 53756
23733 53756 -48299 -25127 24519 47354 35741 28452 79173 118692 41362 11621 -7546 -22054
23721 -22054 -81325 -49558 8943 -28929 -68149 -33862 -65735 -111821 -134782 -182128 -237286 -227517
23709 -227517 -68281 -75295 -105911 -113888 -94731 35949 123925 144993 167952 138163 91871
23698 91871 101074 24837 -34969 -81096 -112240 -119695 -138021 -14511 36100 22235 55379 66181
23686 66181 9833 1762 -10502 -10778 138209 168176 44864 38190 28936 -5929 -108037 -28821
$$ packed form
23768G7677j8723k4887l4769O6503R60q8928n4666j3309l891J13410m9876k6317
23756e6816n4361j1291P258O0559M9754J267J5787k5611o2448j16304j3431J13077
23744i2560P0825n3268j8068l5480J15780J15364O491j0194M1698k2857o3975
23733E3756j02055K3172M9646K2835j1613p289N0721L9519p7330k9741j9167j4508
23721b2054n9271L1767N8501l7872l9220L4287l1873m6086k2961m7346n5158R769
23709b27517J59236p014l0616p977J9157J30680Q7976K1068K2959k9789m6292
23698I1871R203p6237n9806m6127l1144p455j8326J23510N0611j3865L3144J0802
23686F6181n6348q071j2264k76J48987K9967j23312o674r254l4865j02108P9216
$$ plain form
23674 -28821 162767 250172 106433 -72484 -93278 -105089 -8120 148320 215674 127747 16806
23663 16806 58641 122900 124939 39036 -6748 -854 5316 60854 120833 140090 27557 -17412
23651 -17412 59267 2701 -4469 -74577 -173925 -131627 -37123 54804 90108 29633 53315 69534
23639 69534 72631 82809 95561 76619 33010 15089 -29685 -49797 -52692 -74990 -78701 -28828
23627 -28828 -44961 -13789 72081 77175 78966 -27811 -1607 -33713 -69568 -28665 28833 -98443
23615 -98443 -160059 -169822 -202424 -193902 -132027 -203214 -219990 -114166 -130138 -171547 -179500 -138560
23603 -138560 -124034 36276 43863 -289 -34440 -90509 -205299 -112258 48431 68132 -36814
23592 -36814 -105464 -125294 -148274 -210292 -217933 -131919 -28152 67246 35947 21413 56624 10871
$$ packed form
23674b8821J91588Q7405j43739j78917k0794j1811R6969J56440O7354q7927j10941
23663A6806M1835O4259K039q5903m5784N894O170N5538N9979J9257j12533m4969
23651a7412P6679n6566p170p0108r9348M2298R4504R1927L5304o0475K3682J6219
23639F9534L097J0178J2752j8942m3609j7921m4774k0112k895k2298l711M9873
23627b8828j6133L1172Q5870N094J791j06777K6204l2106l5855M0903N7498j27276
23615i8443o1616r763l2602Q522O1875p1187j6776J05824j5972m1409p953M0940
23603a38560J4526J60310P587m4152l4151n6069j14790R3041J60689J9701j04946
23592c6814o8650j9830k2980o2018p641Q6014J03767R5398l1299j4534L5211m5753
$$ plain form
23580 10871 -45884 -43474 -28100 57161 23430 -15332 -6095 -105134 -106978 -163603 -185954 -143563
23568 -143563 -180961 -150718 -46981 -72693 -89510 -62458 -94105 -44129 -26535 -60690 -69360
23557 -69360 -130895 -135888 -146488 -168212 -106405 -99914 -160639 -214588 -178343 -174505 -104100 -5290
23545 -5290 54215 89199 32902 28737 26093 537 -27676 -2992 -59109 -65064 -66942 -105877 -135649
23532 -135649 -28268 9927 36809 123065 103572 -16322 -118781 -56375 -53862 -52223 -89453
23521 -89453 -130974 -179062 -137150 -79071 -36560 32802 -156960 -198205 -115964 -70419 -17357
23510 -17357 -104286 -147038 -115961 -139004 -104347 -104430 -147744 -124188 40106 87790 119319 87695
23498 87695 72981 58221 7811 -117322 -94348 -161009 -271300 -268973 -127828 -36570 27131
$$ packed form
23580A0871n6755K410J5374Q5261l3731l8762R237r9039j844n6625k2351M2391
23568a43563l7398L0243J03737k5712j6817K7052l1647M9976J7594l4155q670
23557f9360o1535m993j0600k1724O1807O491o0725n3949L6245L838P0405R8810
23545e290N9505L4984n6297m165k644k5556k8213K4684n6117n955j878l8935k9772
23532a35649J07381L8195K6882Q6256j9493j19894j02459O2406K513J639l7230
23521h9453m1521m8088M1912N8079M2511O9362j89762m1245Q2241M5545N3062
23510a7357q6929m2752L1077k3043L4657q3m3314K3556J64294M7684L1529l1624
23498H7695j4714j4760n0410j25133K2974o6661j10291K327J41145R1258O3701
$$ plain form
23487 27131 31680 32145 -58627 -121764 -198460 -164858 -174029 -135687 -50133 70216 60447 -104551
23475 -104551 10565 73737 191150 231993 141728 134196 100896 32671 59676 60813 79588
23464 79588 28799 -28401 32251 -44145 -68331 -41233 19493 2892 -113499 -187251 -252911
23453 -252911 -155683 -80388 -121996 -205728 -203304 -54071 -40449 -19147 39744 92567 175243
23442 175243 142583 41927 28820 49849 80421 68769 82812 64903 45315 86454 117113
23431 117113 151673 82620 3806 -40659 -68017 -78118 -91764 -147320 -107246 -24269 -17544 53862
23419 53862 37663 64989 96808 -27437 -135485 -218895 -229802 -209094 -120782 -39245 -159116
23408 -159116 -207931 -202774 -209932 -148268 -76979 -64410 -40500 -94605 -28995 21819 -45342 -74980
$$ packed form
23487B7131M549M65r0772o3137p6696L3602r171L8342Q5554J20349r769j64998
23475a04551J15116O3172J17413M0843r0265p532l3300o8225K7005J137J8775
23464G9588n0789n7200O0652p6396k4186K7098O0726j6601j16391p3752o5660
23453b52911R7228P5295m1608q3732K424J49233J3622K1302N8891N2823Q2676
23442A75243l2660j00656j3107K1029L0572j1652J4043j7909j9588M1139L0659
23431A17113L4560o9053p8814m4465k7358j0101j3646n5556M0074Q2977O725P1406
23419E3862j6199K7326L1819j24245j08048q3410j0907K0708Q8312Q1537j19871
23408a59116m8815N157p158O1664P1289J2569K3910n4105O5610N0814o7161k9638
$$ plain form
23396 -74980 42417 58669 -31006 -146564 -160621 -117968 -54924 -23557 14969 41593 -57794
23385 -57794 -45375 -29672 -88374 -150429 -150917 -70760 -49810 1312 87299 53536 165194 189359
23373 189359 113943 58244 -50345 -55851 53964 92965 89574 163272 194363 23383 -14200
23362 -14200 -24381 -40851 60858 86648 98252 71201 -13230 -48510 -46595 -107005 -83977 -74323
23350 -74323 -89034 5916 25974 -46418 -132432 -89479 -15807 18183 -19472 7164 44548 -25028
23338 -25028 -110268 -16679 -19329 72034 207340 173319 88221 -10194 -70464 -115282 -89935 -62888
23326 -62888 -73883 -138475 -199195 -115292 86237 50269 2716 -43947 -45312 -114612 -122640 -60778
23314 -60778 -8455 49372 21193 -108010 -140320 -97123 -129810 -87746 -56785 -84614 -145891
$$ packed form
23396g4980J17397J6252q9675j15558j4057M2653O3044L1367L8526K6624r9387
23385e7794J2419J5703n8702o2055m88Q0157K0950N1122Q5987l3763J11658K4165
23373A89359p5416n5699j08589n506J09815L9001l391P3698L1091j70980l7583
23362a4200j0181j6470J01709K5790J1604k7051q4431l5280J915o0410K3028R654
23350g4323j4711R4950K0058p2392q6014M2953P3672L3990l7655K6636L7384o9576
23338b5028q5240R3589k650R1363J35306l4021q5098r8415o0270m4818K5347K7047
23326f2888j0995o4592o0720Q3903K01529l5968m7553m6663j365o9300q028O1862
23314f0778N2323N7827k8179j29203l2310M3197l2687M2064L0961k7829o1277
$$ plain form
23303 -145891 -116062 -113621 -132582 -46449 -70570 -134852 -142206 -119184 -21298 -56252 -80259 -16608
23291 -16608 25730 -20636 5772 -80248 -215129 -186053 -33424 13225 6147 -18509 -82222
23280 -82222 -86074 -74056 -72662 6475 8987 113081 110333 49512 59697 42498 11590 -35684
23268 -35684 24231 21604 -67348 72578 193194 203813 162290 134489 92888 50390 43939 83980
23256 83980 87949 48069 24308 22942 81583 35432 -1742 -109243 -25116 -20894 -57053 -85620
23244 -85620 -162389 -103516 -64445 12496 123348 62146 -53763 -72927 -139081 -59484 -20525
23233 -20525 20107 -17696 20660 54931 48999 69166 49581 -40010 -123160 -82026 34224 23743
23221 23743 -34642 -135987 -123187 -60811 -69397 -18837 66001 40664 -72762 -126977 -57116
$$ packed form
23303a45891K9829K441j8961Q6133k4121o4282p354K3022R7886l4954k4007O3651
23291a6608M2338m6366K6408q6020j34881K9076J52629M6649p078k4656o3713
23280h2222l852J2018J394P9137K512J04094k748o0821J0185j7199l0908m7274
23268c5684N9915k627q8952J39926J20616J0619m1523k7801m1601m2498o451M0041
23256H3980L969l9880k3761j366N8641m6151l7174j07501Q4127M222l6159k8567
23244h5620p6769N8873L9071P6941J10852o1202j15909j9164o6154P9597L8959
23233b0525M0632l7803L8356L4271n932K0167j9585q9591q3150M1134J16250j0481
23221B3743n8385j01345J2800O2376q586N0560Q4838k5337j13426n4215O9861
$$ plain form
23210 -57116 -26894 -30436 42984 -22895 -188766 -138182 -149615 -97306 -82458 -29241 113876
23199 113876 155615 156762 99509 69970 -567 -35943 -5359 -25839 -102067 -130949 -139292 -104774
23187 -104774 -38246 -8324 39127 -47354 -79655 7604 43910 43847 -27695 -96191 -129264 -41562
23175 -41562 41610 33731 86858 41996 -39520 -162919 -277773 -202322 -181852 -177400 -163275 -130528
23163 -130528 -96926 -52183 -104279 -132613 -49937 17652 22921 -74628 5039 132201 143803
23152 143803 156463 180567 207711 141192 56340 -20804 -91129 -139949 -74842 21405 44711
23141 44711 43453 15545 30526 -68356 -19555 -165 66949 65014 50017 39605 -4362 48784
23129 48784 71007 17805 -45039 -59936 78208 72377 -108 10607 51955 35874 10057 -25714
$$ packed form
23210e7116L0222l542P3420o5879j65871N0584j1433N2309J4848N3217J43117
23199A13876M1739J147n7253k9539p0537l5376L0584k0480p6228k8882q343L4518
23187a04774O6528K9922M7451q6481l2301Q7259L6306o3p1542o8496l3073Q7702
23175d1562Q3172p879N3127m4862q1516j23399j14854P5451K0470M452J4125L2747
23163a30528L3602M4743n2096k8334Q2676O7589N269r7549P9667J27162J1602
23152A43803J2660K4104K7144o6519q4852p7144p0325m8820O5107R6247K3306
23141D4711j258k7908J4981r8882M8801J9390O7114j935j4997j0412m3967N3146
23129D8784K2223n3202o2844j4897J38144n831p2485J0715M1348j6081k5817l5771
$$ plain form
23117 -25714 -34229 -25570 31548 -9097 -17351 -3168 2206 -46854 -117087 -95593 -2296 -19222
23105 -19222 -28605 14654 -9475 -130669 -118310 -90953 -19346 -14606 64358 121476 62679 38645
23093 38645 49140 100669 82454 38378 25564 -21464 -33290 16786 32254 68798 46654 2009
23081 2009 -1627 32928 -42231 -51013 -56564 -83344 -92832 -113224 -76163 -82988 -140434 -147494 -90282
23068 -90282 -583 -14399 5846 63714 61229 -79116 -249137 -242784 -140132 -50188 -133021
23057 -133021 -178210 -125555 -91485 -34837 12549 35261 58949 197353 160513 101013 -2063
23046 -2063 41135 111379 104626 127159 100358 14959 5636 -50475 -70062 -71432 -118014 -110929 -65236
23033 -65236 -51396 -24066 48406 144605 205935 175549 128157 91447 33317 -46366 826 63477
$$ packed form
23117b5714q515Q659N7118m0645q254J4183N374m9060p0233K1494R3297j6926
23105a9222r383M3259k4129j21194J2359K7357P1607M740P8964N7118n8797k4034
23093C8645J0495N1529j8215m4076j2814m7028j1826N0076J5468L6544k2144m4645
23081B009l636L4555p5159q782n551k6780r488k0392L7061o825n7446p060N7212
23068i0282Q9699j3816K0245N7868k485j40345j70021O353J02652Q9944q2833
23057a33021m5189N2655L4070N6648M7386K2712K3688J38404l6840n9500j03076
23046b063M3198P0244o753K2533k6801q5399r323n6111j9587j370m6582P085M5693
23033f5236J3840K7330P2472R6199O1330l0386m7392l6710n8130p9683M7192O2651
$$ plain form
23021 63477 41361 165507 144019 48958 72374 27322 16591 80164 146555 80397 76342 52330
23009 52330 68071 -5333 -65931 -961 25589 14970 10332 23280 814 63339 81135 59819
22997 59819 15984 27260 51717 1344 63312 51812 50413 54564 53412 54256 29434 -35602 -83193
22984 -83193 -51534 44306 40349 47100 37557 -46879 30470 -7343 -47511 58044 125181 94424
22972 94424 79402 -9939 -29047 -2292 -19653 5048 -38078 -84752 -8674 -19976 -126237
22961 -126237 -136247 269 3632 -75181 -102168 -187912 -186956 -188524 -196807 -176818 -117555 -67334
22949 -67334 3001 126544 141257 60117 -30114 -24715 -40561 -128270 -137667 -82103 -98807 -161117
22937 -161117 -177026 -158361 -126093 -95510 -25898 -9691 -94989 -107934 -106523 -201949 -288228 -199488
$$ packed form
23021F3477k2116J24146k1488r5061K3416m5052j0731O3573O6391o6158m055k4012
23009E2330J5741p3404o0598O4970K6550j0619m638J2948k2466O2525J7796k1316
22997E9819m3835J1276K4457n0373O1968j1500j399M151j152Q44k4822o5036m7591
22984h3193L1659R5840l957O751r543q4436P7349l7813m0168J05555O7137l0757
22972I4424j5022q9341j9108K6755j7361K4701m3126m6674P6078j1302j06261
22961a26237j0010J36516L363p8813k6987q5744R56j568q283J9989N9263N0221
22949f7334P0335J23543J4713q1140r0231N399j5846q7709r397N5564j6704o2310
22937a61117j5909J8665L2268L0583O9612J6207q5298j2945J411r5426q6279Q8740
$$ plain form
22925 -199488 -123201 -36295 1342 25612 56240 25318 75157 10760 -42473 -133369 -167160
22914 -167160 -124974 -8269 28132 8836 -12678 -40500 21258 74505 52943 20876 24691
22903 24691 147161 210990 170894 147848 133165 127392 54163 43512 25018 -35453 -74613 -21529
22891 -21529 -70146 -101106 -124277 -126794 -68361 -52328 -79025 -81038 -69175 88247 48127 53246
22879 53246 65508 -70566 -131581 -128559 -56446 -1874 -71526 -115869 -71435 -156907 -146106 -106699
22867 -106699 -52806 14796 29895 -51431 -137564 -143529 -122044 -118419 -181136 -161085 -131181 -60485
22855 -60485 -60540 -28326 30627 31619 43565 -49049 -109411 -94115 -76229 -46789 -118738 -89134 -62643
22842 -62643 -18775 2646 -28193 -27499 -96563 -91711 -74832 -40809 -3869 38590 116728 63845
$$ packed form
22925a99488P6287Q6906L7637K4270L0628l0922M9839o4397n3233r0896l3791
22914a67160M2186J16705L6401j9296k1514k7822O1758N3247k1562l2067L815
22903B4691J22470O3829m0096k3046j4683n773p3229j0651j8494o0471l9160N3084
22891b1529m8617l0960k3171k517N8433J6033k6697k013J1863J57422m0120N119
22879E3246J2262j36074o1015L022P2113N4572o9652m4343M4434q5472J0801L9407
22867a06699N3893O7602J5099q1326q6133n965K1485L625o2717K0051K9904P0696
22855f0485n5L2214N8953R92J1946r2614o0362J5296J7886K9440p1949K9604K6491
22842f2643M3868K1421l0839O94o9064M852J6879L4023L6940M2459P8138n2883
$$ plain form
22830 63845 -31790 -19313 51403 73432 46935 -17971 -42745 -58222 -87013 -16107 41688 82062
22818 82062 -11060 -66822 -121881 -110746 -108212 -136079 -182032 -132066 -73524 -44364 -12875 11384
22806 11384 -15076 -50567 -29852 85261 35991 -46660 -97652 -161396 -156997 -118897 14297
22795 14297 -23040 -121839 -91510 17613 137098 189934 77796 34566 -11131 -18051 -8813
22784 -8813 -3436 29391 8672 -105738 -116552 -8556 -22590 -108135 -75714 -30196 -10787 -18289
22772 -18289 18628 -48781 -40763 97655 173151 100685 -36234 -103104 -79663 -11712 -3097 -15783
22760 -15783 -35862 -139111 -72274 7339 -13916 -76323 -111682 -166705 -204003 -215299 -216505 -215101
22748 -215101 -196832 -190566 -109880 -104358 -92833 -61633 -19056 -17462 -1273 5144 2634 -10525
$$ packed form
22830F3845r5635J2477P0716K2029k6497o4906k4774j5477k8791P0906N7795M0374
22818H2062r3122n5762n5059J1135K534k7867m5953M9966N8542K9160L1489K4259
22806A1384k6460l5491K0715J15113m9270q2651n0992o3744M399L8100J33194
22795A4297l7337r8799L0329J09123J19485N2836j12138m3230m5697o920R238
22784h813N377L2827k0719j14410j0814J07996j4034q5545L2421M5518J9409p502
22772a8289L6917o7409Q018J38418P5496p2466j36919o6870K3441O7951Q615j2686
22760a5783k0079j03249O6837P9613k1255o2407l5359n5023l7298j1296j206J404
22748b15101J8269O266Q0686N522J1525L1200M2577J594J6189O417k510j3159
$$ plain form
22736 -10525 -21101 62119 50170 -27350 27369 53609 26009 11750 -50679 -79030 -100082 -118208
22724 -118208 -117099 -35950 27474 14176 -40558 -2628 28176 -40891 -47169 -72889 -48150 -42476
22712 -42476 -25146 22290 62190 -20864 538 11050 -16654 -5209 -33683 -166431 -179713
22701 -179713 -148770 -100302 -212924 -239120 -216481 -175743 -108720 -27390 59897 104180 93844
22690 93844 159260 173264 79686 -53340 -11424 36141 11487 22466 42997 45332 -10627 -53529
22678 -53529 -2634 -9360 -41929 -195482 -172760 -30015 34000 -14495 -54761 -78536 -131581
22667 -131581 -78896 -156428 -144654 -49262 -34739 28013 -42498 -42802 42860 64718 -35748 -117945
22655 -117945 -160635 -50992 -45547 6749 -3244 -55927 -71370 -138083 -120200 -63659 -146370 -136686
$$ packed form
22736a0525j0576Q3220j1949p7520N4719K6240k7600j4259o2429k8351k1052j8126
22724a18208J109Q1149O3424j3298n4734L7930L0804o9067o278k5720K4739N674
22712d2476J7330M7436L9900q3054K1402J0512k7704J1445k8474j32748j3282
22701a79713L0943M8468j12622k6196K2639M0738O7023Q1330Q7287M4283j0336
22690I3844O5416J4004r3578j33026M1916M7565k4654J0979K0531K335n5959m2902
22678e3529N0895o726l2569j53553K2722J42745O4015m8495m0266k3775n3045
22667a31581N2685p7532J1774R5392J4523O2752p0511l04Q5662K1858j00466q2197
22655a17945m2690J09643N445N2296r993n2683j5443o6713J7883N6541q2711R684
$$ plain form
22643 -136686 -36275 -47135 -117241 -134272 -154869 -124982 -92944 -106769 -41489 -93282 -118995
22632 -118995 -8766 70444 -4690 -83120 -73137 -22679 -30055 57356 121935 70737 -37853
22621 -37853 -218792 -223907 -185544 -114425 1169 6572 34655 105594 118505 97707 25365 -6713
22609 -6713 -64898 -37804 51319 79317 5741 -27084 22365 -26105 -84934 -148807 -39194 2600
22597 2600 -254 44203 38273 3088 -61976 -148304 -119969 -70404 -177845 -183407 -138533 -64502
22585 -64502 -40436 18979 5424 35832 -23068 -96515 -96245 -107206 -113256 -17030 -24024 -40919
22573 -40919 -90428 -31958 49517 124293 204120 84326 61742 14934 -90964 -150423 -92392
22562 -92392 -129590 -123420 -73437 -81812 -138748 -163525 -99396 -59274 -30336 -58334 -110702 -73345
$$ packed form
22643a36686J00411j0860p0106j7031k0597K9887L2038j3825O5280n1793k5713
22632a18995J10229P9210p5134p8430R983N0458p376Q7411O4579n1198j08590
22621c7853j80939n115L8363P1119J15594N403K8083P0939J2911k0798p2342l2078
22609f713n8185K7094Q9123K7998p3576l2825M9449m8470n8829o3873J09613M1794
22597B600k854M4457n930l5185o5064q6328K8335M9565j07441n562M4874P4031
22585f4502K4066N9415j3555L0408n8900p3447K70j0961o050R6226o994j6895
22573d0919m9509N8470Q1475P4776P9827j19794k2584m6808j05898n9459N8031
22562i2392l7198O170M9983q375n6936k4777O4129M0122K8938k7998n2368L7357
$$ plain form
22550 -73345 -84788 -35067 -60172 -139949 -34058 46418 22060 -39530 -108782 -62095 30963
22539 30963 49963 45555 4203 -48927 87835 -7086 -170870 -151519 -90707 -102856 -10645
22528 -10645 44713 30431 -44944 1866 3474 -14139 -18714 18527 -93183 -115545 -86746 -117836
22516 -117836 -121883 -150414 -179529 -89438 11646 -16635 -132907 -209689 -64970 -29434 -15787
22505 -15787 81686 50693 -21029 -12406 -104091 -103325 -30588 -6315 18244 104283 58905 -95342
22493 -95342 -147967 -107803 -7473 -3605 31509 52249 4384 19188 -39958 -47904 14895 -35720
22481 -35720 -144212 -268144 -303993 -225881 -103797 -59757 71912 24970 -67273 -120783 -97633
22470 -97633 -103431 -42450 -28836 -72288 26521 120952 41536 -123599 -148470 -124218 -60127 -42559
$$ packed form
22550g3345j1443M9721k5105p9777J05891Q0476k4358o1590o9252M6687R3058
22539C0963J9000m408m1352n3130J36762r4921j63784J9351O0812j2149R2211
22528a0645N5358j4282p5375M6810J608j7613m575L7241j11710k2362K8799l1090
22516a17836m047k8531k9115R0091J01084k8281j16272p6782J44719L5536J3647
22505a5787R7473l0993p1722Q623r1685P66P2737K4273K4559Q6039m5378j54247
22493i5342n2625M0164J00330L868L5114K0740m7865J4804n9146p946O2799n0615
22481c5720j08492j23932l5849P8112J22084M4040J31669m6942r2243n3510K3150
22470i7633n798O0981J3614m3452R8809R4431p9416j65135k4871K4252O4091J7568
$$ plain form
22458 -42559 8731 -10124 -33480 38218 145631 167651 194758 217139 272992 252214 152137
22447 152137 145462 135750 126164 52111 -32977 -15809 -2757 40742 22092 -11111 -142641 -130554
22435 -130554 -14035 -27929 -50200 -92843 -83255 -27310 31656 150835 265383 224322 221896
22424 221896 220076 151223 113182 50025 -9676 48548 140312 216723 222923 207312 193100 178489
22412 178489 72697 147102 196843 202541 102756 52392 49144 26429 48156 26997 -50127 -41074
22400 -41074 36183 -24515 -13758 66583 156718 217292 215371 232879 134319 34262 86733 23769
22388 23769 65514 28724 9666 5932 -63665 -23638 3199 -51031 -49326 -7063 96801 90710
22376 90710 95586 461 -9609 85432 100144 20894 -67137 -74074 -46919 -71699 -36779 -25190
$$ packed form
22458d2559N1290j8855k3356P1698J07413K2020K7107K2381N5853k0778j00077
22447A52137o675r712r586p4053q5088J7168J3052M3499j8650l3203j31530J2087
22435a30554J16519j3894k2271m2643R588N5945N8966J19179J14548m1061k426
22424B21896j820o8853l8041o3157n9701N8224R1764P6411O200j5611j4212j4611
22412A78489j05792P4405M9741N698r9785n0364l248k2715K1727k1159p7124R053
22400d1074P7257o0698J0757Q0341R0135O0574j921J7508r8560j00057N2471o2964
22388B3769M1745l6790j9058l734o9597M0027K6837n4230J705M2263J03864o091
22376I0710M876r5125j0070R5041J4712p9250q8031o937K7155k4780L4920J1589
$$ plain form
22364 -25190 -115504 -68786 -66587 -27911 -58798 -23350 -89249 -114857 -105245 -107003 -70622 -132583
22352 -132583 -24222 76957 34234 14868 33416 -28277 -11940 -16122 -87854 -124224 -166257
22341 -166257 -213236 -70262 18115 21452 89422 186928 147144 141950 119125 92011 164113 178076
22329 178076 98115 59550 166539 195797 219884 162743 116540 81790 76639 112159 34989
22318 34989 3181 -15479 85939 11241 -97007 -114152 -39367 -1156 31317 -7457 40173
22307 40173 62008 41256 -79335 -17801 100901 67521 -71335 -76685 -173593 -155817 -90897
22296 -90897 -93749 -5768 -2581 134996 143243 83848 -15682 85690 35762 -58496 -86752 -74521
22284 -74521 -51933 -38546 -28569 -43343 -17535 -1466 64774 67092 63267 58748 34116 -43527
$$ packed form
22364b5190r0314M6718K199L8676l0887L5448o5899k5608R612j758L6381o1961
22352a32583J08361J01179m2723j9366J8548o1693J6337m182p1732l6370m2033
22341a66257m6979J42974Q8377L337O7970R7506l9784n194k2825k7114P2102J3963
22329A78076p9961l8565J06989K9258K4087n7141m6203l4750n151L5520p7170
22318C4989l1808j8660J01418p4698j08248j7145P4785L8211L2473l8774M7630
22307D0173K1835k0752j20591O1534J18702l3380j38856n350r6908J7776O4920
22296i0897k852Q7981L187J37577Q247n9395r9530J01372m9928r4258k8256J2231
22284g4521K2588J3387R977j4774K5808J6069O6240K318l825m519k4632p7643
$$ plain form
22272 -43527 -46278 6874 86433 47829 -6702 -16392 -17994 -91962 -91765 -123856 -240650 -303488
22260 -303488 -200247 -8596 37176 6600 50562 -1427 -127745 -238637 -118499 57923
22250 57923 -5756 -100576 -7376 2384 -75858 -62298 -10039 -12276 -14849 -57127 -57945 -4109 21022
22237 21022 -54888 -130562 -64591 36386 76162 52754 -39193 -109400 -202192 -256043 -158783
22226 -158783 -50679 -92051 -133449 -119554 -4177 -65646 -163690 -87678 -8431 -130748 -188857
22215 -188857 -210575 -109629 -12533 -19345 74417 109833 76645 -44275 -69045 -69126 55343 74927
22203 74927 5013 -38639 -145550 -117801 -32889 12953 45592 19907 38627 114129 113434 83026
22191 83026 44696 13957 -60829 -55105 -20668 -93788 611 95855 73195 14675 78332 77469
$$ packed form
22272d3527k751N3152P9559l8604n4531r690j602p3968J97l2091j16794o2838
22260c03488J03241J91651M5772l0576M3962n1989j26318j10892J20138J76422
22250E7923o3679r4820R3200R760p8242J3560N2259k237k573m2278q18N3836K5131
22237B1022p5910p5674O5971J00977L9776k3408r1947p0207r2792n3851R7260
22226a58783J08104m1372m1398J3895J15377o1469r8044P6012P9247j22317n8109
22215a88857k1718J00946R7096o812R3762L5416l3188j20920k4770q1J24469J9584
22203G4927o9914m3652j06911K7749Q4912M5842L2639k5685J8720P5502o95l0408
22191H3026l8330l0739p4786N724L4437p3120R4399R5244k2660n8520O3657q63
$$ plain form
22179 77469 88804 103158 38085 107130 151550 165040 73154 9234 -23690 17812 6702 -107883
22167 -107883 -154029 -100966 -73303 -107736 -163272 -94404 -2456 54222 -15328 -111322 -182251
22156 -182251 -166403 -156581 -67081 -72103 -82033 -39684 -58386 -139821 -165427 -44878 -8695 -46397
22144 -46397 -73335 -38230 -26203 -77873 -131335 -186430 -153413 -65996 13473 59171 -7298 -141791
22132 -141791 -209230 -221136 -235643 -284990 -297153 -261911 -201838 -121800 -40886 7711 48740
22121 48740 8571 -68495 -20368 -37978 24593 64724 -1425 -46669 -37125 -108319 -118685 -19517
22109 -19517 27294 74647 142747 56775 -2302 -66530 -116842 -144507 -153389 -139255 -9600 8157
22097 8157 12930 28825 128183 127722 47548 678 -46269 -49472 -93174 -77964 -110891 -101326 -77492
$$ packed form
22179G7469J1335J4354o5073O9045M4420J3490r1886o3920l2924M1502j1110j14585
22167a07883m6146N3063K7663l4433n5536O8868R1948N6678o9550r5994p0929
22156a82251J5848R822Q9500n022r930M2349j8702q1435k5606J20549L6183l7702
22144d6397k6938L5105J2027n1670n3462n5095L3017Q7417P9469M5698o6469j34493
22132a41791o7439j1906j4507m9347j2163L5242O0073Q0038Q0914M8597M1029
22121D8740m0169p7066M8127j7610O2571M0131o6149m5244R544p1194j0366R9168
22109a9517M6811M7353O8100q5972n9077o4228n0312k7665q882J4134J29655J7757
22097H157M773J5895R9358m61q0174m6870m6947l203m3702J5210l2927R565K3834
$$ plain form
22084 -77492 -33274 -66657 -131388 -70600 87598 121377 59967 2640 56855 70803 11969
22073 11969 -87598 -131941 -118881 -160761 -100592 -103809 -114281 -124633 -103665 -79782 -106295 -83643
22061 -83643 -82369 -166097 -207315 -107144 33831 56867 28268 -68227 -38855 36687 130337
22050 130337 178180 156388 106310 164159 85877 75474 113761 137914 -13784 -111751 -86551
22039 -86551 -70522 -28084 -8765 -78500 -138166 -140303 -77939 -68820 -84649 -34801 -27634 -135952
22027 -135952 -221861 -129148 -119211 -99561 64008 20024 49408 39051 68220 73771 -19923 -83870
22015 -83870 -131064 -111831 -153462 -101324 -140898 -245590 -137101 -97032 -1 -14040 -187953
22004 -187953 -170802 -91216 25580 -42267 -119443 -88248 4246 2710 27910 119162 206293
$$ packed form
22084g7492M4218l3383o4731O0788J58198L3779o1410n7327N4215J3948n8834
22073A1969r9567m4343J3060m1880O0169l217j0472j0352K0968K3883k6513K2652
22061h3643J274q3728m1218J00171J40975K3036k8599r6495K9372P5542R3650
22050A30337M7843k1792n0078N7849p8282j0403L8287K4153j51698r7967K5200
22039h6551J6029M2438J9319o9735n9666k137O2364R119j5829M9848P167j08318
22027a35952q5909R2713R937J9650J63569m3984K9384j0357K9169N551r3694o3947
22015h3870m7194J9233m1631N2138l9574j04692J08489M0069R7031j4039j73913
22004a87953J7151P9586J16796o7847p7176L1195R2494j536K5200R1252Q7131
$$ plain form
21993 206293 104753 -55820 -82814 -116802 -61849 8599 -63891 -90406 -130806 -161407 -112031
21982 -112031 -74559 -28299 -34835 -129515 -98440 -83454 -83189 -62612 -88570 -69091 -53520 -68613
21970 -68613 -22205 23455 2122 77616 1553 -140032 -192655 -131537 -36694 -13979 -6871 27389
21958 27389 22511 -10233 29842 10905 -56665 5113 46594 16584 47750 12080 -16786 10986
21946 10986 101951 123600 80578 5938 -49858 -53357 24550 101988 88020 52353 -8010 50718
21934 50718 4208 -76286 -140183 -69201 -22706 -121433 -122146 -37268 -18281 -88694 -211161 -211519
21922 -211519 -199439 -166995 -81028 -30369 43174 -61113 -136717 -149956 -143266 1417 71324
21911 71324 95147 64925 776 -8221 -69568 -111599 -8452 39925 -77769 -184249 -170508
$$ packed form
21993B06293j01540j60573k6994l3988N4953P0448p2490k6515m0400l0601M9376
21982a12031L7472M6260o536r4680L1075J4986K65K0577k5958J9479J5571j5093
21970f8613M6408M5660k1333P5494p6063j41585n2623O1118R4843K2715P108L4260
21958B7389m878l2744M0075j8937o7570O1778M1481l0010L1166l5670k8866K7772
21946A0986R0965K1649m3022p4640n5796l499P7907P7438j3968l5667o0363N8728
21934E0718m6510q0494o3897P0982M6495r8727p13Q4878J8987p0413j22467l58
21922b11519J2080L2444Q5967N0659P3543j04287p5604j3239O690J44683O9907
21911G1324K3823l0222o4149q997o1347m2031J03147M8377j17694j06480J3741
$$ plain form
21900 -170508 -121862 -198599 -137003 -33579 -54977 -69782 -23458 5691 -62374 -68371 -100033
21889 -100033 -109694 30796 62653 24304 -97857 -54393 -71968 -32803 -9150 26327 60803
21878 60803 117413 65603 -88821 -69855 12710 46724 -5051 -47742 -62073 -33782 -34950 -140418
21866 -140418 -70817 29043 5591 -50487 -29373 -131488 -202550 -261826 -158176 -74159 -168531
21855 -168531 -177980 -79196 -25567 -10012 29121 36173 -95909 -116331 8158 118106 79978
21844 79978 178855 222237 212872 209898 104429 92600 99391 59214 33828 88695 31820 11071
21832 11071 -71407 14274 95341 21729 11663 65642 27907 95264 87499 59673 18103 -16590
21820 -16590 57925 63553 89784 91419 158078 133372 72984 15722 29823 75947 131764 101854
$$ packed form
21900a70508M8646p6737O1596J03424k1398j4805M6324K9149o8065n997l1662
21889a00033r661J40490L1857l8349j22161M3464j7575L9165K3653L5477L4476
21878F0803N6610n1810j54424J8966Q2565L4014n1775m2691j4331K8291j168j05468
21866a40418O9601R9860k3452n6078K1114j02115p1062n9276J03650Q4017r4372
21855a68531r449R8784N3629J5555L9133P052j32082k0422J24489J09948l8128
21844G9978R8877M3382r365k974j05469j1829O791m0177k5386N4867n6875k0749
21832A1071q2478Q5681Q1067p3612j0066N3979l7735O7357p765k7826m1570l4693
21820a6590P4515N628K6231J635O6659k4706o0388n7262J4101M6124N5817k9910
$$ plain form
21808 101854 -32660 -76864 -130601 -95195 -28030 53603 70672 31354 65126 63456 71935 6264
21796 6264 -38588 -46402 -112408 -141880 -93305 -98579 -107522 -117563 -73097 -42435 52132 48675 87070
21783 87070 74729 -21960 -20997 -47586 -115923 -77933 -49110 18921 -16099 -109026 -42991 -59768
21771 -59768 -105494 -133438 -172145 -166592 -82839 793 34167 -22557 -132740 -191231 -169506 -143642
21759 -143642 -110793 -32131 -7759 28548 49213 70961 160177 123087 38454 -30426 -26792 -20213
21747 -20213 -76336 -83186 -33693 23582 120903 152241 69243 -84738 -36667 15679 -3989 -25967
21735 -25967 -28129 -145096 -178022 -145728 -164600 -149962 -112255 -153070 -180295 -116568 -38635 88000
21723 88000 84601 130950 141469 144452 52769 -10412 -67488 -110100 -157423 -134317 -143497 -192004
$$ packed form
21808A01854j34514m4204n3737L5406O7165Q1633J7069l9318L3772j670Q479o5671
21796F264m4852p814o6006k9472M8575n274q943j0041M4466L0662R4567l457L8395
21783H7070j2341r6689R63k6589o8337L7990K8823O8031l5020r2927O6035j6777
21771e9768m5726k7944l8707N553Q3753Q3632L3374n6724j10183n8491K1725K5864
21759a43642L2849P8662K4372L6307K0665K1748Q9216l7090q4633o8880L634O579
21747b0213n6123o850M9493N7275R7321L1338q2998j53981M8071N2346j9668k1978
21735b5967k162j16967l2926L2294j8872J4638L7707m0815k7225O3727P7933J26635
21723H8000l399M6349J0519K983r1683o3181n7076m2612m7323K3106r180m8507
$$ plain form
21711 -192004 -224193 -211703 -189919 -141523 -66062 -70420 -66587 -24273 33731 -45157 -33565 -79390
21699 -79390 -90191 -67919 -83956 -87141 -117677 -92848 17979 -9444 -60333 -66471 21858 106208
21687 106208 133484 29033 -46524 -186731 -79467 -7742 -33117 -30362 -20563 -114056 -2924
21676 -2924 -96165 -127459 -70104 -38919 -46778 -30396 73750 79287 30313 9473 -92704 -23438
21664 -23438 29058 -67912 -210659 -169530 -184599 -112056 -25316 141294 155195 31339 -39098
21653 -39098 -90030 -14475 71889 -30723 -69206 13569 55092 42257 -16095 -29941 -52433
21642 -52433 -101653 -146190 -180200 -121883 -102584 32216 5839 1051 -78842 -186104 -141710
21631 -141710 -46380 9395 110359 65877 50222 71567 66228 2348 -127598 -260234 -214129
$$ packed form
21711a92004l2189J2490K1784M8396P5461m358L833M2314N8004p8888J1592m5825
21699g9390j0801K2272j6037l185l0536K4829J10827k7423n0889o138Q8329Q4350
21687A06208K7276j04451p5557j40207J07264P1725k5375K755R799r3493J11132
21676b924r3241l1294N7355L1185p859J6382J04146N537m8974k0840j02177O9266
21664b3438N2496r6970j42747M1129j5069P2543Q6740J66610J3901j23856p0437
21653c9098n0932P5555Q6364j02612l8483Q2775M1523j2835n8352j3846k2492
21642e2433m9220m4537l4010N8317J9299J34800k6377m788p9893j07262M4394
21631a41710R5330N5775J00964m4482j5655K1345n339o3880j29946j32636M6105
$$ plain form
21620 -214129 -161343 -96769 -142516 -221464 -232876 -149562 -129008 -89230 -58227 -100196 -63408
21609 -63408 -4448 118951 79163 60028 5512 -44669 -34602 18117 17842 3759 -24368 -57965
21597 -57965 -89403 -23737 11138 -28067 35633 7232 -56738 -32791 58009 60535 10517 -35913
21585 -35913 -99033 -44847 15776 -19531 -84118 -113078 3301 97069 8164 -50089 -72626
21574 -72626 -152008 -197119 -311244 -263094 -165774 -86867 -151223 -55030 31043 -44306 -75599
21563 -75599 -124289 -39378 23760 56788 -15787 -117911 -165847 -135576 -68889 -17377 -58578
21552 -58578 -126237 -138325 -85812 -80223 -71570 -112119 -250623 -348377 -247381 -87331 -5508
21541 -5508 -9595 -30292 21590 130695 68498 58018 56837 -38470 -16199 -59565 -27149 -55882
$$ packed form
21620b14129N2786O4574m5747p8948j1412Q3314K0554L9778L1003m1969L6788
21609f3408N8960J23399l9788j9135n4516n0181J0067N2719k75j4083k8127l3597
21597e7965l1438O5666L4875l9205O3700k8401o3970K3947R0800K526n0018m6430
21585c5913o3120N4186O0623l5307o4587k8960J16379R3768q8905n8253k2537
21574g2626p9382m5111j14125M8150R7320P8907o4356R6193Q6073p5349l1293
21563g5599m8690Q4911O3138L3028p2575j02124m7936L0271O6687N1512m1201
21552e8578o7659j2088N2513N589Q653m0549j38504r7754J00996J60050Q1823
21541e508m087k0697N1882J09105o2197j0480j181r5307K2271m3366L2416k8733
$$ plain form
21529 -55882 -107329 -10843 80619 54975 -64825 -27968 13279 -52488 -55169 -87043 -93405 -147393
21517 -147393 -45389 44583 84556 37677 -74373 -66747 18307 2628 -69100 -101786 -84956
21506 -84956 -109978 -208684 -292636 -220155 -79404 -42881 11128 -29998 -109021 -161736 -151080
21495 -151080 -3503 68468 38986 38339 12638 17455 -20040 -130760 -101114 -88302 -131041 -89052
21483 -89052 -88568 -65471 40652 116684 39206 -9646 66006 657 -76240 -67504 -103623 -75353
21471 -75353 70470 198747 191690 167281 80929 100212 147049 141544 56396 -4449 42598 104086
21459 104086 88599 74693 139027 44033 -11429 65216 46890 -39186 -25294 66657 59292 32179
21447 32179 6465 -39695 -144166 -117467 -31165 9328 1721 -3125 66309 95667 69255 35639
$$ packed form
21529e5882n1447R6486R1462k5644j19800L6857M1247o5767k681l1874o362n3988
21517a47393J02004Q9972L9973m6879j12050P626Q5054j5679p1728l2686J6830
21506h4956k5022r8706q3952P2481J40751L6523N4009m1126p9023n2715J0656
21495a51080J47577P1971k9482o47k5701M817l7495j10720K9646J2812m2739M1989
21483h9052M84K3097J06123P6032p7478m8852P5652o5349p6897Q736l6119K8270
21471g5353J45823J28277p057k4409q6352J9283M6837n505q5148o0845M7047O1488
21459A04086j5487j3906O4334r4994n5462P6645j8326q6076J3892R1951p365k7113
21447C2179k5714m6160j04471K6699Q6302M0493p607m846O9434K9358k6412l3616
$$ plain form
21435 35639 6880 -63061 -52038 -25294 -57257 29232 92014 49844 41880 60942 12777 -47317
21423 -47317 -49918 -7663 9853 17294 79052 -16372 -56969 25865 -36844 -20351 -16333 -45582
21411 -45582 -131561 -93052 -6155 -712 44781 -53734 -148412 -100784 -12673 -46802 -46365 -12042
21399 -12042 -27235 22203 84734 84608 34857 9023 36241 23327 -35086 81663 82796 13589
21387 13589 112245 135036 212367 139961 123145 89425 92778 32650 40384 54615 47757 43950
21375 43950 -92069 -112064 -62314 -112463 -162579 -182556 -161794 -165487 -46527 32432 -28473
21364 -28473 46700 83547 29212 -33773 -31984 -159071 -213363 -121670 977 78669 21322
21353 21322 -75330 -58265 1563 58542 15662 55537 25745 -60885 -10078 73691 80325 51169
$$ packed form
21435C5639k8759o9941J1023K6744l1963Q6489O2782m2170p964J9062m8165o0094
21423d7317k601M2255J7516P441O1758r5424m0597Q2834o2709J6493M018k9249
21411d5582q5979L8509Q6897N443M5493r8515r4678M7628Q8111l4129M37L4323
21399a2042j5193M9438O2531j26m9751k5834K7218j2914n8413J16749J133o9207
21387A3589R8656K2791P7331p2406j6816l3720L353o0128P734J4231o858l807
21375D3950j36019j9995M9750n0149n0116j9977K0762l693J18960P8959o0905
21364b8473P5173L6847n4335o2985J789j27087n4292R1693J22647P7692n7347
21353B1322r6652J7065N9828N6979m2880L9875k9792q6630N0807Q3769O634k9156
$$ plain form
21341 51169 30235 46388 67278 28846 -53350 -5583 35630 42646 65977 110726 97775 81791
21329 81791 168412 166412 26938 -133945 -161966 -98815 -142132 -121317 -238862 -242890 -176984
21318 -176984 -113651 -122113 -120721 -58659 -26351 1617 671 -83395 -32123 77509 98874 145300
21306 145300 127161 -11628 74670 124882 48625 56831 41329 84909 46992 121189 121548 160447
21294 160447 181604 196265 93532 -73826 -150550 -170309 -159305 -84142 -16951 92848 89848
21283 89848 19154 -68587 15228 -11493 43432 56408 79079 104954 1505 -39472 -81550
21272 -81550 -114447 -103851 -5380 70821 11604 -45730 2492 -12026 -22968 7042 67778 182347
21260 182347 199105 209844 152627 147759 49714 -40097 -16327 -12855 14791 -2220 -30644 -74846
$$ packed form
21341E1169k0934J6153K0890l8432q2196M7767M1213P016K3331M4749j2951j5984
21329H1791Q6621k000j39474j60883k8021O3151m3317K0815j17545m028O5906
21318a76984O3333q462J392O2062L2308K7968r46q4066N1272J09632K1365M6426
21306A45300j8139j38789Q6298N0212p6257Q206j5502M3580l7917P4197L59L8899
21294A60447K1157J4661j02733j67358p6724j9759J1004P5163O7191J09799l000
21283H9848p0694q7741Q3815k6721N4925J2976K2671K5875j03449m0977m2078
21272h1550l2897J0596R8471P6201n9217n7334M8222j4518j0942L0010O0736J14569
21260A82347J6758J0739n7217m868r8045q9811K3770L472K7646j7011k8424m4202
$$ plain form
21248 -74846 -68802 -142235 -225872 -241470 -253155 -58226 17652 61205 17161 -2506 2899 -16249
21236 -16249 -23002 -24868 -42958 -161452 -50442 366 -833 -54972 -124277 -154262 -82815 -2410
21224 -2410 -40280 -77878 86808 205405 253869 256669 184661 75915 -29789 -62432 -66106
21213 -66106 -59315 -59357 -24573 -78183 -66713 56418 193434 259455 252813 102630 -52353 -57706
21201 -57706 43361 55196 107992 115384 156486 60761 -23565 -53076 40916 80668 79282 111272
21189 111272 97771 -17074 -145109 -101673 23084 -35717 -132345 -63911 74348 137941 186919
21178 186919 122130 69242 132172 179599 185076 172567 124469 105740 95725 84145 21320 8811
21166 8811 46310 12406 -76735 -82631 14902 87760 76143 61026 -85639 -125418 -118324 -50335
$$ packed form
21248g4846O044p3433q3637j5598j1685J94929P5878M3553m4044j9667N405j9148
21236a6249o753j866j8090j18494J11010N0808j199n4139o9305k9985P1447Q0405
21224b410l7870l7598J64686J18597M8464K800p2008j08746j05704l2643l674
21213f6106O791m2L4784n3610J1470J23131J37016O6021o642j50183j54983n353
21201e7706J01067J1835N2796P392M1102r5725q4326k9511R3992L9752j386L1990
21189A11272j3501j14845j28035M3436J24757n8801r6628O8434J38259O3593M8978
21178A86919o4789n2888O2930M7427N477j2509m8098j8729j0015j1580o2825j2509
21166H811L7499l3904q9141n896R7533P2858j1617j5117j46665l9779P094O7989
$$ plain form
21154 -50335 -28746 -66114 -55281 -49157 -114417 -105538 -50079 -121165 -108973 52038 191676 83579
21142 83579 -10843 -37420 -36600 -64622 -17280 88890 53736 -61607 56327 125696 225346
21131 225346 212543 158800 165065 212911 165413 111766 45758 -31076 -28880 -20096 10141 -17052
21119 -17052 -12048 -6692 -33315 71748 114076 102985 4520 -58806 -156121 -109126 -24475 55164
21107 55164 46083 -25885 -7605 -15474 -75833 -85867 -57741 -61232 -16415 -61165 -88422 -5033
21095 -5033 80750 132573 97329 77036 93995 196391 169739 5991 -46385 -731 -3513 21220
21083 21220 35837 116 13974 -10966 72069 101270 131627 82427 42691 -46639 -110581 -88175
21071 -88175 -56394 6770 -23790 -48593 -47057 -116806 -194929 -220638 -192082 -72216 32394
$$ packed form
21154e0335K1589l7368J0833O124o5260Q879N5459p1086J2192J61011J39638j08097
21142H3579r4422k6577Q20k8022M7342J06170l5154j15343J17934O9369R9650
21131B25346j2803n3743O265M7846m7498n3647o6008p6834K196Q784L0237k7193
21119a7052N004N356k6623J05063M2328j1091r8465o3326r7315M6995Q4651P9639
21107E5164r081p1968J8280p869o0359j0034K8126l491M4817m4750k7257Q3389
21095e033Q5783N1823l5244k0293J6959J02396k6652j63748n2376M5654k782K4733
21083B1220J4617l5721J3858k4940Q3035K9201L0357m9200l9736q9330o3942K2406
21071h8175L1781O3164l0560k4803J536o9749p8123k5709K8556J19866J04610
$$ plain form
21060 32394 19400 30898 68627 78351 85467 -69221 -97252 20217 105916 66861 -47276
21049 -47276 43850 143252 139851 54302 -21500 -111738 -109187 -142602 -186115 -125429 -50416 -86377
21037 -86377 -19643 -28838 -13287 60151 154535 179868 94310 42595 25542 122429 111658 89648
21025 89648 167416 71028 15507 92499 113813 20448 -43074 -16862 13632 41933 111653 103584
21013 103584 77908 42806 -48135 -86443 -49756 -9841 89277 57630 38858 37166 -29604 -44922
21001 -44922 41822 117400 41182 -26277 70193 76764 24393 59029 125110 66070 23491 29343
20989 29343 79028 20030 -3144 36412 51136 -6563 -106266 -69176 -36359 37847 83492 107895
20977 107895 70778 91559 143486 15544 -83546 -139916 -82469 -122372 -20189 111712 40709
$$ packed form
21060C2394j2994J1498L7729R724P116j54688k8031J17469Q5699l9055j14137
21049d7276R1126R9402l401q5549p5802r0238K551l3415m3513O0686P5013l5961
21037h6377O6734r195J5551P3438R4384K5333q5558n1715j7053R6887j0771k2010
21025H9648P7768r6388n5521P6992K1314r3365o3522K6212L0494K8301O9720q069
21013A03584k5676l5102r0941l8308L6687L9915R9118l1647j8772j692o6770j5318
21001d4922Q6744P5578p6218o7459R6470O571n2371L4636O6081n9040m2579N852
20989B9343M9685n8998k3174L9556J4724n7699r9703L7090L2817P4206M5645K4403
20977A07895l7117K0781N1927j27942r9090n6370N7447l9903J02183J31901p1003
$$ plain form
20966 40709 -52399 -67039 15467 50003 -66152 -109329 -107364 -101391 -26543 27169 6658 -13122
20954 -13122 7637 143183 154620 49374 16081 22601 47119 71734 53916 12838 -2128
20943 -2128 49547 -18664 -17654 -77229 -103279 -42368 -32073 1040 17612 -22054 -101923 -43703
20931 -43703 70142 27208 -7678 -73496 9839 50368 43175 -638 -64958 -137668 -128280 2866
20919 2866 44504 42849 123113 89414 68462 131777 120659 124714 32682 12143 87263 64801
20907 64801 93310 182802 221092 214591 236784 209731 154955 168691 84429 -1763 6042 74202
20895 74202 137705 114275 -8859 -15089 57392 72603 92662 110020 144357 113208 49911 -2181
20883 -2181 85629 119243 95506 58807 68367 34000 35524 97950 117414 106437 7296 46285
$$ packed form
20966D0709r3108j4640Q2506L4536j16155m3177J965N973P4848N3712k0511j9780
20954a3122K0759J35546J1437j05246l3293O520K4518K4615j7818m1078j4966
20943b128N1675o8211J010n9575k6050O0911J0295L3113J6572l9666p9869N8220
20931d3703J13845m2934l4886o5818Q3335M0529p193m3813o4320p2710R388J31146
20919B866M1638j655Q0264l3699k0952O3315j1118M055r2032k0539P5120k2462
20907F4801K8509Q9492L8290o501K2193k7053n4776J3736q4262q6192P805O8160
20895G4202O3503k3430j23134o230P2481J5211K0059J7358L4337l1149o3297n2092
20883b181Q7810L3614k3737l6699R560l4367J524O2426J9464j0977r9141L8989
$$ plain form
20871 46285 143084 112328 68940 -1881 -92726 -134272 -22955 -34501 -35775 -44704 10265 117389
20859 117389 150217 150441 72411 24772 -46461 -50298 3450 -40612 -51265 73313 191873 243295
20847 243295 185388 140230 109771 88400 64738 -73520 -144189 -35937 43275 98811 171257
20836 171257 201613 203102 119535 97717 54654 26982 162319 173801 93904 -27705 -13018
20825 -13018 82197 92726 94587 126600 169658 74323 -20444 -2909 28801 40858 -36587 -117936
20813 -117936 -76842 -16143 -48512 -27677 107583 109554 52971 58323 68273 58125 51714 79316
20801 79316 -68273 -141983 -153350 -81583 -83869 -133267 -43529 97826 110430 84911 89959 63224
20789 63224 -11399 36364 52791 88766 72565 48815 48726 25466 53161 66294 30745 -109628
$$ packed form
20871D6285R6799l0756m3388p0821r0845m1546J11317j1546j274q929N4969J07124
20859A17389L2828K24p8030m7639p1233l837N3748m4062j0653J24578J18560N1422
20847B43295n7907m5158l0459k1371k3662j38258p0669J08252P9212N5536P2446
20836A71257L0356J489q3567k1818m3063k7672J35337J1482p9897j21609J4687
20825a3018R5215J0529J861L2013M3058r5335r4767J7535L1710J2057p7445q1349
20813a17936M1094O0699l2369K0835J35260J971n6583N352R950j0148o411K7602
20801G9316j47589p3710j1367P1767k286m9398Q9738J41355J2604k5519N048k6735
20789F3224p4623M7763J6427L5975j6201k3750q9k3260K7695J3133l5549j40373
$$ plain form
20777 -109628 -80446 -58848 -1922 -25951 -47174 71671 57859 -83895 -119220 -112520 7963
20766 7963 124927 210624 127499 39060 17958 -72254 -89865 -132132 -75181 -52929 17108 26217
20754 26217 74934 33591 -82905 -132674 -132544 -197822 -199959 -114735 -27067 35962 38513 46248
20742 46248 107472 111877 67168 72291 136559 894 -175489 -155795 -90112 -34999 1935 75285
20730 75285 117451 15651 -55696 -80976 -88421 -82968 -106334 -101388 -72768 -66844 -123628 -109971
20718 -109971 -98365 -87834 -81615 -10653 33222 -34317 -27590 3064 -119257 -106856 -11589 -141074
20706 -141074 -111579 -62074 11166 -74035 -124560 -61177 -26221 -66229 -37866 -87319 -139721
20695 -139721 -80335 -37343 -59132 34513 4668 89665 110688 9080 -164017 -172367 -93597
$$ packed form
20777a09628K9182K1598N6926k4029k1223J18845j3812j41754l5325O700J20483
20766G963J16964Q5697q3125q8439k1102r0212j7611m2267N6951K2252P0037R109
20754B6217M8717m1343j16496m9769J30o5278k137Q5224Q7668O3029K551P735
20742D6248O1224M405m4709N123O4268j35665j76383J9694O5683N5113L6934P3350
20730G5285M2166j01800p1347k5280p445N453k3366M946K8620N924n6784J3657
20718a09971J1606J0531O219P0962M3875o7539O727L0654j22321J2401R5267j29485
20706a41074K9495M9505P3240q5201n0525O3383L4956m0008K8363m9453n2402
20695a39721N9386M2992k1789R3645k9845Q4997K1023j01608j73097q350P8770
$$ plain form
20684 -93597 53293 116362 129499 97821 166197 171119 91019 -31424 -99920 -75332 -66652 -53645
20672 -53645 -127259 -152957 28465 49972 -30904 -59495 -206485 -273849 -109128 -28613 -137497
20661 -137497 -123122 -30611 28 37657 28756 26199 -2500 -1307 -39183 48156 174592 166686
20649 166686 145843 124208 19042 8787 96668 68485 -19253 -109411 -134968 -62596 17908
20638 17908 40553 25941 -16644 -11896 14489 17109 -1360 5610 -35117 -30180 -26431 -65065 -7740
20625 -7740 16223 299 -35714 -30503 -41200 -20351 26295 109392 111813 26979 -11531 -66296
20613 -66296 -25579 36039 58946 32421 69603 123685 113963 78618 54312 122417 -24353 -95287
20601 -95287 -24172 68020 173742 130306 107383 212757 223336 249628 149090 23830 -19518
$$ packed form
20684i3597J46890O3069J3137l1678O8376M922q0100j22443o8496K4588Q680J3007
20672e3645p3614k5698J81422K1507q0876k8591j46990o7364J64721Q0515j08884
20661a37497J4375R2511L0639L7629q901k557k8699J193l7876Q7339J26436p906
20649A66686k0843k1635j05166j0255Q7881k8183q7738r0158k5557P2372Q0504
20638A7908K2645j4612m2585M748K6385K620j8469O970m0727M937L749l8634N7325
20625g740K3963j5924l6013N211j0697K0849M6646Q3097K421q4834l8510n4765
20613f6296M0717O1618K2907k6525L7182N4082r722l5345k4306O8105j46770p0934
20601i5287P1115R2192J05722m3436k2923J05374J0579K6292j00538j25260m3348
$$ plain form
20590 -19518 1685 4504 -40989 -5052 38103 39546 54039 -18802 -41217 -148507 -116766 -76374
20578 -76374 17599 82079 107113 65692 67453 73150 107 -39911 -45875 -16889 -38473 21947
20566 21947 121551 92213 -3588 -53045 -55853 -46426 -26491 -2072 -58394 -27499 1170 15893
20554 15893 -13144 67231 32508 -75891 -143237 -176137 -138993 -652 29531 -44875 -82214
20543 -82214 -93388 12891 104229 106901 67888 27125 -59656 -38760 68999 141057 85255
20532 85255 81734 56504 44440 21674 -17132 77626 103665 -37026 713 42843 -7936 15630
20520 15630 14250 46542 26352 17716 43515 -5014 3856 117078 76870 17822 14106 -14522
20508 -14522 -1237 109726 103313 64361 83856 78758 17631 -41440 -92129 -109350 -82963 -30038
$$ packed form
20590a9518K1203K819m5493L5937M3155J443J4493p2841k2415j07290L1741M0392
20578g6374R3973O4480K5034m1421J761N697p3043m0018n964K8986k1584O0420
20566B1947R9604k9338r5801m9457k808R427J9935K4419n6322L0895K8669J4723
20554A5893k9037Q0375l4723j08399o7346l2900L7144J38341L0183p4406l7339
20543h2214j1174J06279R1338K672l9013m0763q6781K0896J07759P2058n5802
20532H5255l521k5230j2064k2766l8806R4758K6039j40691L7739M2130n0779K3566
20520A5630j380L2292k0190q636K5799m8529Q870J13222m0208n9048l716k8628
20508a4522J3285J10963o413l8952J9495n098o1127n9071n0689j7221K6387N2925
$$ plain form
20496 -30038 -12787 -48093 -124569 -119853 -106146 -129221 -131649 -93093 -60339 -19081 89900 100707
20484 100707 118355 33268 -16962 -37775 21766 139880 106034 16249 72543 11708 -49836
20473 -49836 -86002 -155689 -105957 -114571 -186152 -176867 -168995 -77100 19400 -28527 -46086 37415
20461 37415 39987 100887 -7016 -79284 -33442 80081 206652 163119 61561 75656 162233
20450 162233 67635 -22731 60401 98488 66944 132724 97747 -66860 -109465 8473 132315
20439 132315 253540 247454 93529 8045 48691 37340 8489 -13235 -14639 -5169 -38628 -86857
20427 -86857 -178271 -108505 18808 80992 128583 107716 23325 39849 4443 -8635 12390
20416 12390 -24182 -218465 -279569 -136443 55294 91078 14539 -79134 -89069 -18528 -39490
$$ packed form
20496c0038J7251l5306p6476M716J3707k3075k428L8556L2754M1258J08981J0807
20484A00707J7648q5087n0230k0813N9541J18114l3846q9785N6294o0835o1544
20473d9836l6166o9687M9732q614p1581R285P872R1895R6500m7927j7559Q3501
20461C7415K572O0900j07903p2268M5842J13523J26571m3533j01558J4095Q6577
20450A62233r4598r0366Q3132L8087l1544O5780l4977j64607m2605J17938J23842
20439A32315J21225o086j53925q5484M0646j1351k8851k1724j404R470l3459m8229
20427h6857r1414O9766J27313O2184M7591k0867q4391J6524l5406j3078K1025
20416A2390l6572j94283o1104J43126J91737L5784p6539r3673r935P0541k0962
$$ plain form
20405 -39490 -14323 -70442 -73051 -43285 33040 28250 -7543 -18835 35933 -15615 -41394 39984
20393 39984 87850 76089 83553 98597 67664 98155 103077 99593 83387 58757 42241 55649
20381 55649 -19338 -21543 43572 53101 -24142 43964 76354 80162 25547 -60769 15477 90743
20369 90743 78829 -55759 -133228 -100733 -97904 -58557 -55503 4899 59061 -19496 -94473 -88385
20357 -88385 -28011 57054 109848 27394 -116464 -223079 -233846 -67182 -65253 -76132 25096
20346 25096 73260 45985 -75607 -122073 3170 -34716 -41384 19795 -55578 -13644 94576
20335 94576 160476 121719 111190 80560 73966 132740 63817 -56420 17238 25403 60873 113589
20323 113589 168204 185277 107720 53317 141683 115999 98679 13160 -39660 -74124 -37168
$$ packed form
20405c9490K5167n6119k609K9766P6325m790l5793j1292N4768n1548k5779Q1378
20393C9984M7866j1761P464J5044l0933L0491M922l484j6206k4630j6516J3408
20381E5649p4987k205O5115R529p7243O8106L2390L808n4615q6316P6246P5266
20369I0743j1914j34588p7469L2495K829L9347L054O0402N4162p8557p4977O088
20357h8385O0374Q5065N2794q2454j43858j06615j0767J66664J929j0879J01228
20346B5096M8164k7275j21592m6466J25243l7886o668O1179p5373M1934J08220
20335I4576O5900l8757j0529l0630o594N8774o8923j20237P3658Q165L5470N2716
20323A13589N4615J7073p7557n4403Q8366k5684j7320q5519n2820l4464L6956
$$ plain form
20312 -37168 57065 8357 20401 78367 5894 -70593 -53173 -49502 18924 10619 -106313 -40764
20300 -40764 17009 55330 156259 217062 137575 17328 -107387 -5347 -2567 -10053 -37447
20289 -37447 -11063 64689 38725 19648 21438 33543 103646 131211 39238 -1660 -6746 7030
20277 7030 -49055 -30866 50723 82786 16151 -174873 -127086 -94293 -29922 68081 124169 91184
20265 91184 156555 -34195 -70930 41712 17525 -19035 19667 -59355 -85532 -102076 50682
20254 50682 100750 53036 66987 11521 46111 101682 90704 14604 34338 40176 16668 -27228
20242 -27228 26136 128691 168889 220977 150896 135776 167364 147629 166477 86096 83404 144544
20230 144544 112148 121055 164058 148589 169527 63902 -106604 -54273 -49474 -73396 -131220
$$ packed form
20312c7168R4233m8708J2044N7966p2473p6487J7420L671O8426q305j16932O5549
20300d0764N7773L8321J00929O0803p9487j20247j24715J02040K780p486k7394
20289c7447K6384P5752k5964j9077J790J2105P0103K7565r1973m0898n086J3776
20277G030n6085J8189Q1589L2063o6635j91024M7787L2793O4371R8003N6088l2985
20265I1184O5371j90750l6735J12642k4187l6560L8702p9022k6177j6544J52758
20254E0682N0068m7714J3951n5466L4590N5571j0978p6100J9734N838k3508m3896
20242b7228N3364J02555M0198N2088p0081j5120L1588j9735J8848q0381k692O1140
20230A44544l2396Q907M3003j5469K0938j05625j70506N2331M799k3922n7824
$$ plain form
20219 -131220 -106317 -133624 -127121 -15737 6012 45012 110749 80239 41463 56231 86800
20208 86800 17319 -97275 -233168 -215177 -171094 -158386 -113180 -113065 -95107 -8507 -73139 -133978
20196 -133978 -61816 -42364 -5516 1057 -42232 -97460 -119079 -51655 -67667 -7847 83364 199251
20184 199251 184941 170626 90920 69571 141579 164347 113631 100663 106381 40444 18272 6392
20172 6392 -11977 -34235 -3191 -5555 -53626 -23304 56821 71634 62099 38616 105406 99605
20160 99605 33536 -15971 -42701 -75724 -16740 61323 116066 78167 5349 -7373 -48148 71165
20148 71165 40693 50555 -44758 -115120 -89282 -20690 19728 27736 43026 51019 110238 26590
20136 26590 -55553 13969 157450 127128 335 -1515 19405 123997 124122 124886 29545 53638
$$ packed form
20219a31220K4903k7307O503J11384K1749L9000O5737l0510l8776J4768L0569
20208H6800o9481j14594j35893J7991M4083J2708M5206J15J7958Q6600o4632o0839
20196a33978P2162J9452L6848O573m3289n5228k1619O7424j6012N9820R1211J15887
20184A99251j4310j4315p9706k1349P2008K2768n0716j2968N718o5937k2172j1880
20172F392j8369k2258L1044k364m8071L0322Q0125J4813r535k3483O6790n801
20160I9605o6069m9507k6730l3023N8984P8063N4743l7899p2818j2722m0775J19313
20148G1165l0472R862r5313p0362K5838O8592M0418Q008J5290P993N9219q3648
20136B6590q2143O9522J43481l0322j26793j850K0920J04592J25P64r5341K4093
$$ plain form
20124 53638 104996 119022 85117 -17747 -43724 -8973 66255 68336 48149 -28561 -11581 98260
20112 98260 73801 16193 -27814 34638 -19267 -66697 -132995 -36884 -85445 -85484 -94941 -40908
20100 -40908 59021 130772 -26532 -8180 119481 195881 88979 134305 130909 74054 71568
20089 71568 133609 139063 161473 198089 71339 -39782 -77652 -62790 -95547 -118248 -22049
20078 -22049 108066 114085 54352 8978 64899 132069 -29040 -58854 -66424 -40222 -15286 -14280
20066 -14280 62190 65525 109005 95497 -5048 22463 -8298 -18895 -32442 -38663 -24969 6823
20054 6823 49212 -31922 -4280 37303 162253 228163 155550 31919 -5311 65879 80050
20043 80050 54127 48113 72881 148625 148663 141275 160182 111676 120370 105921 102495 171075 182129
$$ packed form
20124E3638N1358J4026l3905j02864k5977L4751P5228K081k0187p6710J6980J09841
20112I8260k4459n7608m4007O2452n3905m7430o6298R6111m8561l9r457N4033
20100d0908R9929P1751j57304J8352J27661P6400j06902M5326l396n6855k486
20089G1568O2041N454K2410L6616j26750j11121l7870J4862l2757k2701R6199
20078b2049J30115O019n9733m5374N5921O7170j61109k9814p570K6202K4936J006
20066a4280P6470L335M3480j3508j00545K7511l0761j0597j3547o221J3694L1792
20054F823M2389q1134K7642M1583J24950O5910p2613j23631l7230P1190J4171
20043H0050k5923o014K4768P5744L8p388J8907m8506Q694j4449l426O8580J1054
$$ plain form
20030 182129 121845 112714 127406 174776 184888 170711 168601 116560 112345 122343 69883 7852
20018 7852 -54481 -108665 -74063 -28263 -22680 -35407 28060 34697 53060 118155 242101 201909
20006 201909 171987 56702 53298 97392 104346 -10907 -112165 -108229 10767 42173 143014
19995 143014 142404 53214 -105917 -168219 -69220 43750 152005 192020 115642 50686 31263
19984 31263 90105 142880 106484 79753 111979 142987 142989 196258 167591 148832 246341 249307 196678
19971 196678 202039 243423 205790 158253 60111 51637 102926 127471 176712 148469 63788 65175
19959 65175 9721 83356 183442 201255 190636 71362 -70823 -101509 -43564 10570 68377
19948 68377 30514 -74664 -75409 -30617 17449 102723 29676 24465 -48880 -129144 -64622 61051
$$ packed form
20030A82129o0284r131J4692M7370J0112j4177k110n2041m215R998n2460o2031
20018G852o2333n4184L4602M5800N583j2727O3467O637J8363O5095J23946m0192
20006B01909k9922j15285l404M4094O954j15253j01258L936J18996L1406J00841
19995A43014o10q9190j59131o2302R8999J12970J08255M0015p6378o4956j9423
19984C1263N8842N2775l6396k6731L2226L1008KN3269k8667j8759R7509K966n2629
19971A96678N361M1384l7633m7537r8142q474N1289K4545M9241k8243q4681J387
19959F5175n5454P3635J00086J7813j0619j19274j42185l0686N7945N4134N7807
19948F8377l7863j05178p45M4792M8066Q5274p3047n211p3345q0264O4522J25673
$$ plain form
19936 61051 30708 58560 146360 164030 164383 146689 110702 128160 107212 53957 57532 4389
19924 4389 -17033 -25279 -20280 -56126 -65490 36606 135157 192449 107405 65718 48699 28494
19912 28494 18214 144973 209519 127971 76938 72081 -31367 -44756 -26822 49742 36099
19901 36099 82340 66605 3784 116033 159773 108357 80767 45515 16661 9707 22790 72856
19889 72856 60304 104130 103007 40764 3046 58745 96006 153409 205773 180601 113796 79235
19877 79235 123820 133352 120161 192161 269502 278320 226057 198281 236387 188300 159902 83493
19865 83493 41479 76731 198818 264256 257182 141519 133119 77953 -13406 -89081 -118612 -1468
19853 -1468 27027 -42164 37183 92182 51431 113387 50496 86758 157562 193001 206232 224163
$$ packed form
19936F1051l0343K7852Q7800J7670L53j7694l5987J7458k0948n3255L575n3143
19924D389k1422q246M999l5846r364J02096R8551N7292q5044m1687j7019k0205
19912B8494j0280J26759O4546q1548n1033m857j03448j3389J7934P6564j3643
19901C6099M6241j5735o2821J12249M3740n1416k7590l5252k8854o954J3083N0066
19889G2856j2552M3826j123o2243l7718N5699L7261N7403N2364k5172o6805l4561
19877G9235M4585R532j3191P2000P7341Q818n2263k7776L8106m8087k8398p6409
19865H3493m2014L5252J22087O5438p074j15663q400n5166r1359p5675k9531J17144
19853a468K8495o9191P9347N4999m0751O1956o2891L6262P0804L5439J3231J7931
$$ plain form
19841 224163 185383 190123 200154 113542 -15276 -107002 -52084 -23019 4080 -4311 55685 144393
19829 144393 102061 152306 151519 183688 120999 1850 24459 -37825 -69242 3041 144786
19818 144786 145406 115865 156139 209120 187773 233275 285813 290324 233488 216296 231180 331990
19806 331990 400043 429325 525479 649107 812041 851350 849971 817457 688681 538331 503453
19795 503453 581568 615503 661722 613826 572836 485436 481360 583251 627777 676857 633245
19784 633245 591432 604579 557538 555701 507472 356095 170835 133874 218648 248962 232655
19773 232655 283243 298366 306283 223455 189521 133435 83286 153244 288897 336482 353034
19762 353034 249570 248953 303950 418674 378109 270313 354875 389493 340361 425518 519498
$$ packed form
19841B24163l8780M740J0031q6612j28818r1726N4918K9065K7099q391N9996Q8708
19829A44393m2332N0245p87L2169o2689j19149K2609o2284l1417P2283J41745
19818A44786O20k9541M0274N2981k1347M5502N2538M511n6836j7192J4884J00810
19806C31990O8053K9282R6154J23628J62934L9309j379l2514j28776j50350l4878
19795E03453P8115L3935M6219m7896m0990q7400m076J01891M4526M9080m3612
19784F33245m1813J3147m7041j837m8229j51377j85260l6961Q4774L0314j6307
19773B32655N0588J5123P917q2828l3934n6086n0149O9958J35653M7585J6552
19762C53034j03464o17N4997J14724m0565j07796Q4562L4618m9132Q5157R3980
$$ plain form
19751 519498 496767 627879 737172 832165 1011915 984656 905945 937425 968828 888281 844805
19740 844805 825042 831739 860255 881957 853275 859923 755705 588894 590999 528323 309476
19729 309476 176983 253422 261811 272299 314424 293737 286821 233990 223910 214032 222677 233795
19717 233795 194698 146376 160391 79441 86847 105671 133043 106511 135269 122097 166639 217309
19705 217309 258929 250342 229605 178113 229705 193672 153598 170137 218502 275328 329673 234280
19693 234280 203392 253343 347545 419693 449921 554791 621023 634773 628297 680253 679801 698204
19681 698204 667475 574814 580052 617179 718823 922128 901876 807170 698942 712770 636290
19670 636290 593292 529593 487890 497139 422924 318523 166654 171549 205621 222318 168300
$$ packed form
19751E19498k2731J31112J09293R4993J79750k7259p8711L1480L1403q0547m3476
19740H44805j9763O697K8516K1702k8682O648j04218j66811K105o2676k18847
19729C09476j32493P6439Q389J0488M2125k0687o916n2831j0080r878Q645J1118
19717B33795l9097m8322J4015q0950P406J8824K7372k6532K8758j3172M4542N0670
19705B17309M1620q587k0737n1492N1592l6033m0074J6539M8365N6826N4345r5393
19693B34280l0888M9951R4202P2148L0228J04870O6232J3750o476N1956m52J8403
19681F98204l0729r2661N238L7127J01644K03305k0252r4706j08228J3828p6480
19670F36290m2998o3699m1703R249p4215j04401j51869M895L4072J6697n4018
$$ plain form
19659 168300 184860 149976 101393 95691 158291 146348 149241 111421 52128 53254 -9896 34064
19647 34064 113012 121582 202422 250442 302477 335505 164941 66624 54945 191418 346665
19636 346665 302334 377877 404410 453438 386846 221409 87777 45634 16640 49180 68466
19625 68466 49886 88371 55975 5435 70412 143020 213923 225519 233685 233311 195960 174590
19613 174590 148818 96130 55950 119925 201403 193451 204438 160908 141486 76194 56147 182430
19601 182430 221889 192313 98532 83086 123082 116283 101427 161621 266055 181926 77750
19590 77750 41474 883 -11243 34674 110464 202564 267026 217542 181611 -28955 -41895
19579 -41895 -51049 40734 58119 83507 126279 271930 360423 331606 245185 245738 302311 328582
$$ packed form
19659A68300J6560l4884m8583n702O2600j1943K893l7820n9293J126o3150M3960
19647C4064P8948Q570Q0840M8020N2035L3028j70564r8317j1679J36473J55247
19636C46665m4331P5543K6533M9028o6592j65437j33632m2143k8994L2540J9286
19625F8466j8580L8485l2396n0540O4977P2608P0903J1596Q166l74l7351k1370
19613A74590k5772n2688m0180O3975Q1478p952J0987m3530j9422o5292k0047J26283
19601A82430L9459k9576r3781j5446L9996o799j4856O0194J04434q4129j04176
19590G7750l6276m0591j2126M5917P5790R2100O4462m9484l5931k10566j2940
19579d1895r154R1783J7385K5388M2772J45651Q8493k8817q6421N53N6573K6271
$$ plain form
19567 328582 379945 424097 333911 230952 231463 253606 182070 312557 303346 322957 383102 247767
19555 247767 266612 421633 329745 338370 425430 502309 612652 722986 774570 647223 616802
19544 616802 633690 686131 606902 632472 736533 871909 904270 765339 803473 924276 996171
19533 996171 968234 894990 754996 592884 492969 434084 465984 561888 639901 554923 376566
19522 376566 334244 325421 303082 290167 237343 186185 235392 287673 254439 323456 399382 334749
19510 334749 265542 230587 297138 292225 292887 305942 317021 353277 474099 527398 635580 708418
19498 708418 704826 739156 828993 824624 933586 999548 1066646 1219644 1273837 1258495 1238406
19487 1238406 1153597 1088825 1068779 1057223 997047 999516 906424 944743 996206 1020956 952685
$$ packed form
19567C28582N1363M4152r0186j02959N11K2143p1536J30487r211J9611O0145j35335
19555B47767J8845J55021r1888Q625Q7060P6879J10343J10334N1584j27347l0421
19544F16802J6888N2441p9229K5570J04061J35376L2361j38931L8134J20803P1895
19533I96171k7937p3244j39994j62112r9915n8885L1900R5904P8013q4978j78357
19522C76566m2322q823k2339j2915n2824n1158M9207N2281l3234O9017P5926o4633
19510C34749o9207l4955O6551m913O62J3055J1079L6256J20822N3299J08182P2838
19498G08418l592L4330Q9837m369J08962O5962O7098J52998N4193j5342k0089
19487A238406q4809o4772k0046j1556o0176K469r3092L8319N1463K4750o8271
$$ plain form
19476 952685 849764 713973 554557 524796 504802 522381 384181 385768 508027 492342 436011
19465 436011 433423 391922 443297 493217 382093 365532 356307 321853 314466 251578 276091 252720
19453 252720 312907 311397 346322 354321 305049 335066 341176 301278 285430 343094 444025 448302
19441 448302 385721 311337 358680 358909 291165 318347 431853 480778 464066 431936 390157 403079
19429 403079 444202 464881 482209 486068 417678 481539 486124 400378 382283 373351 383051 476474
19417 476474 535624 506991 600481 586398 520928 460541 482443 459568 534270 552903 516962
19406 516962 590715 694215 698040 656509 670975 696174 665232 576981 565351 559607 550106 681019
19394 681019 717563 662554 699928 702424 703261 742261 710862 606330 624627 702442 679743 697912
$$ packed form
19476I52685j02921j35791j59416k9761j9994J7579j38200J587J22259j5685n6331
19465D36011k588m1501N1375M9920j11124j6561r225l4454p387o2888K4513k3371
19453B52720O0187j510L4925P999m9272L0017O110l9898j5848N7664J00931M277
19441D48302o2581p4384M7343K29o7744K7182J13506M8925j6712l2130m1779J2922
19429D03079M1123K0679J7328L859o8390O3861M585q5746j8095q932R700R3423
19417D76474N9150k8633R3490j4083o5470o0387K1902k2875P4702J8633l5941
19406E16962P3753J03500L825m1531J4466K5199l0942q8251j1630n744r501J30913
19394F81019L6544n5009L7374K496Q37L9000l1399j04532J8297P7815k2699J8169
$$ plain form
19382 697912 737685 664294 643712 627098 599565 563918 557402 572297 644361 628834 641367 704941
19370 704941 718309 799153 821288 758456 766901 775769 848912 880608 931622 984434 962961 1024285
19358 1024285 1091379 1099089 1172275 1288203 1305935 1459274 1540013 1509021 1596134 1622683 1460437
19347 1460437 1394405 1472712 1564133 1604741 1499202 1439230 1406777 1334485 1267100 1307461 1323091
19336 1323091 1262626 1247141 1255821 1305231 1307624 1255894 1318164 1371262 1396023 1365987 1443156 1487701
19324 1487701 1465508 1533155 1651082 1887508 2101093 2196877 2328188 2492868 2554687 2741795
19314 2741795 2966068 3213168 3580476 3964777 4270338 4616583 4988525 5355080 5725997
19305 5725997 6144452 6569306 7223950 8250402 9709387 11775474 14646477 18287643 22274242
$$ packed form
19382F97912L9773p3391k0582j6614k7533l5647o516J4895P2064j5527J2533O3574
19370G04941J3368Q0844K2135o2832Q445Q868P3143L1696N1014N2812k1473O1324
19358A024285O7094P710P3186J15928J7732J53339Q0739l0992Q7113K6549j62246
19347A460437o6032P8307R1421M0608j05539n9972l2453p2292o7385M0361J5630
19336A323091o0465j5485Q680M9410K393n1730O2270N3098K4761l0036P7169M4545
19324A487701k2193O7647J17927K36426K13585R5784J31311J64680O1819J87108
19314B741795K24273K47100L67308L84301L05561L46245L71942L66555L70917
19305E725997M18455M24854O54644J026452J458985K066087K871003L641166L986599
$$ plain form
19296 22274242 25712579 28028224 29596849 30797070 32286219 35426898 41809713 53091418
19288 53091418 71658786 98508863 128729730 153525670 168854640 175193234 171653776
19281 171653776 158156102 138988894 119050817 99893985 83151507 71514253 66134129
19274 66134129 65273115 65706640 64458027 60387782 53535374 44968075 36293111 28797122
19266 28797122 23075639 19109572 16359311 14581287 13563867 13007066 12566786 12422127
19258 12422127 12466452 12704908 12979262 13261392 13625386 14078772 14684162 15495440 16903015
19249 16903015 19146087 22506388 27543458 34743257 44326174 55526224 65788055 72873516
19241 72873516 76138571 76169801 74696369 74434293 78430303 89768672 110896465 141658876
$$ packed form
19296B2274242L438337K315645J568625J200221J489149L140679O382815J1281705
19288E3091418J8567368K6850077L0220867K4795940J5328970O338594l539458
19281A71653776j3497674j9167208j9938077j9156832j6742478j1637254n380124
19274F6134129q61014M33525j248613m070245o852408q567299q674964p495989
19266B8797122n721483l966067k750261j778024j017420n56801m40280j44659
19258A2422127M4325K38456K74354K82130L63994M53386O05390Q11278J407575
19249A6903015K243072L360301N037070P199799R582917J1200050J0261831P085461
19241G2873516L265055L1230j473432k62076L996010J1338369K1127793L0762411
$$ plain form
19233 141658876 178048591 215872685 251386698 274706189 275912837 255822452 221335662
19226 221335662 178817943 136398871 102325709 79343589 65980790 59374904 56288318
19219 56288318 53804904 50136541 44844271 38129807 31053869 24700668 19649626 15913095
19211 15913095 13241338 11267626 9938522 9085958 8479222 7949422 7487572 7021157 6451172
19202 6451172 5862639 5306349 4705538 4250413 3864916 3467683 3270509 3133415 2926139
19193 2926139 2669446 2396560 2177956 2120837 2040133 1894026 1858673 1822526 1759239 1693913
19183 1693913 1606049 1516565 1492108 1479151 1522512 1586976 1648222 1594705 1463730 1288030 1287699
19172 1287699 1271976 1360977 1347217 1253308 1119545 1084155 1066767 1046824 1048182 1039823 1043240 984764
$$ packed form
19233A41658876L6389715L7824094L5514013K3319491J206648k0090385l4486790
19226B21335662m2517719m2419072l4073162k2982120j3362799o605886l086586
19219E6288318k483414l668363n292270o714464p075938o353201n051042l736531
19211A5913095k671757j973712j329104q52564o06736n29800m61850m66415n69985
19202F451172n88533n56290o00811m55125l85497l97233j97174j37094k07276
19193B926139k56693k72886k18604n7119q0704j46107l5353l6147o3287o5326
19183A693913q7864q9484k4457j2957M3361O4464O1246n3517j30975j75700l31
19172A287699j5723Q9001j3760r3909j33763l5390j7388j9943J358q359L417n8476
$$ plain form
19160 984764 932668 967183 933821 872901 932148 971825 975115 1023990 1058481 981018 1004102 927414
19148 927414 898767 914808 855739 946029 1000539 1071874 1087229 1004004 962075 834910 832387
19137 832387 845811 805133 867231 899124 880972 890075 996576 1057053 1013250 954595 953297 1025527
19125 1025527 1072687 1177336 1143509 1049425 1018591 948366 928720 931164 1030633 1199407 1289498
19114 1289498 1350372 1306454 1320158 1327598 1396693 1452041 1574975 1618700 1544867 1595473 1656914
19103 1656914 1763461 1753669 1690663 1667205 1690979 1666168 1685377 1607434 1502151 1569017 1660142
19092 1660142 1661944 1711917 1862016 1927061 2026499 2114551 2228795 2287095 2415250 2544234 2751905
19081 2751905 2845900 3066222 3172730 3149140 3162980 3171733 3208660 3302243 3327809 3435519 3708512
$$ packed form
19160I84764n2096L4515l3362o0920N9247L9677L290M8875L4491p7463K3084p6688
19148I27414k8647J6041n9069R0290N4510P1335J5355q3225m1929j27165k523
19137H32387J3424m0678O2098L1893j8152R103J06501O0477m3803n8655j298P2230
19125A025527M7160J04649l3827r4084l0834p0225j9646K444R9469J68774R0091
19114A289498O0874m3918J3704P440O9095N5348J22934M3725p3833N0606O1441
19103A656914J06547r792o3006k3458K3774k4811J9209p7943j05283O6866R1125
19092A660142J802M9973J50099O5045R9438Q8052J14244N8300J28155J28984K07671
19081B751905R3995K20322J06508k3590J3840Q753L6927R3583K5566J07710K72993
$$ plain form
19070 3708512 3878523 4063439 4232656 4406194 4764279 5157958 5448040 5801449 6149073
19061 6149073 6398170 6805315 7422812 7942976 8406119 9144186 10019754 11007785 12243459
19052 12243459 13812230 15885085 18767155 22768350 28569706 37536403 51703984 72083660
19044 72083660 95871063 117189588 133430891 146284670 156571927 162435766 162944379
19037 162944379 160100856 156038580 152785933 154652595 164040068 177541809 190406704 203211766
19029 203211766 219469253 240625258 266404338 294502549 318326281 329881876 326335802
19022 326335802 308938342 279214741 241075764 200671783 163045511 130901738 106774865
19015 106774865 91683672 84539880 82701786 83096269 82531708 79084768 72286261 62881981
$$ packed form
19070C708512J70011J84916J69217J73538L58085L93679K90082L53409L47624
19061F149073K49097M07145O17497N20164M63143P38067Q75568R88031J235674
19052A2243459J568771K072855K882070M001195N801356Q966697J4167581K0379676
19044G2083660K3787403K1318525J6241303J2853779J0287257N863839N08613
19037A62944379k843523m062276l252647J866662R387473J3501741J2864895J2805062
19029B03211766J6257487K1156005K5779080K8098211K3823732J1555595l546074
19022C26335802j7397460k9723601l8138977m0403981l7626272l2143773k4126873
19015A06774865j5091193p143792j838094L94483n64561l446940o798507r404280
$$ plain form
19007 62881981 52473144 42572051 34412989 28345096 24051798 20917733 18855835 17469399
18999 17469399 16421730 15660291 15116291 14765212 14469917 14272336 14312752 14386984 14483671 14939610
18989 14939610 15800996 17107321 19329451 22899223 28023818 34947938 43368322 51725942
18981 51725942 58260737 61970231 63032456 62893005 63989502 69167153 80353176 96585287
18973 96585287 114955895 133603197 152237860 167822212 174678117 169870355 154840275
18966 154840275 132025854 105243984 79872297 60017676 46766893 38706129 34506107
18959 34506107 32460216 31075228 29447648 26818252 23572669 19934509 16378990 13416948
18951 13416948 11070592 9350073 8171960 7307938 6621037 6132647 5709209 5279672 4828512
$$ packed form
19007F2881981j0408837r901093q159062o067893m293298l134065k061898j386436
18999A7469399j047669p61439n44000l51079k95295j97581M0416P4232R6687M55939
18989A4939610Q61386J306325K222130L569772N124595O924120Q420384Q357620
18981E1725942O534795L709494J062225j39451J096497N177651J1186023J6232111
18973I6585287J8370608J8647302J8634663J5584352O855905m807762j5030080
18966A54840275k2814421k6781870k5371687j9854621j3250783q060764m200022
18959C4506107k045891j384988j627580k629396l245583l638160l555519k962042
18951A3416948k346356j720519j178113q64022o86901m88390m23438m29537m51160
$$ plain form
18942 4828512 4340279 3942003 3578442 3288449 3060787 2862447 2645352 2321049 2142298
18933 2142298 2030216 1912267 1826919 1653736 1551333 1509765 1487498 1418434 1279849 1281398
18923 1281398 1273897 1208937 1102429 983376 880929 823526 866880 879403 707209 758597 865729
18912 865729 923600 835133 709562 602688 609988 658446 756269 825141 697514 587043 610505
18901 610505 582105 498142 418610 442718 415081 375417 394554 347963 366996 355466 346125 393805
18889 393805 339038 250530 193908 119650 46883 18730 86213 166651 238970 221331 223970 243014
18877 243014 166767 170336 246118 257962 276054 265763 241413 249524 254912 133136 82542 198538
18865 198538 235869 222683 188707 236379 311581 240911 130712 125751 188544 181965 180905 201921
$$ packed form
18942D828512m88233l98276l63561k89993k27662j98340k17095l24303j78751
18933B142298j12082j17949q5348j73183j02403m1568k2267o9064j38585J549
18923A281398p501o4960j06508j19053j02447n7403M3354J2523j72194N1388J07132
18912H65729N7871q8467j25571j06874P300M8458R7823O8872j27627j10471K3462
18901F10505k8400q3963p9532K4108k7637l9664J9137m6591J9033j1530r341M7680
18889C93805n4767q8508n6622p4258p2767k8153O7483Q0438P2319j7639K639J9044
18877B43014p6247L569P5782J1844J8092j0291k4350Q111N388j21776n0594J15996
18865A98538L7331j3186l3976M7672P5202p0670j10199m961O2793o579j060K1016
$$ plain form
18853 201921 228856 168576 157747 201352 252451 188745 103663 96094 72480 78142 56139 -2021
18841 -2021 9555 59735 101620 111232 195423 257667 271012 248164 226362 194113 156747 21528
18829 21528 -44162 -78817 44765 63105 83296 128873 147444 119025 152856 207704 246481
18818 246481 236122 133948 -6202 -71739 11815 43270 3436 80108 248696 297226 186188
18807 186188 24488 43823 125156 157259 107201 -4455 -37225 -55443 -82757 -30041 -2313
18796 -2313 -116614 -142657 -112700 -53161 -6298 27201 -2985 -54118 -6144 -9053 -15642 2450
18784 2450 -23448 -9893 153707 269409 279751 234601 276782 265519 276345 336226 331126 295569
18772 295569 389558 471055 498883 527040 524661 667426 735730 667533 610909 638862 785869
$$ packed form
18853B01921K6935o0280j0829M3605N1099o3706q5082p569k3614N662k2003n8160
18841b021J1576N0180M1885R612Q4191O2244J3345k2848k1802l2249l7366j35219
18829B1528o5690l4655J23582J8340K0191M5577J8571k8419L3831N4848L8777
18818B46481j0359j02174j40150o5537Q3554L1455l9834P6672J68588M8530j11038
18807A86188j61700J9335Q1333L2103n0058j11656l2770j8218k7314N2716K7728
18796b313j14301k6043K9957N9539M6863L3499l0186n1133M7974k909o589J8092
18784B450k5898J3555J63600J15702J0342m5150M2181j1263J0826N9881n100l5557
18772B95569R3989Q1497K7828K8157k379J42765O8304o8197n6624K7953J47007
$$ plain form
18761 785869 858040 777744 758912 793020 868516 881434 876029 857191 774626 721473 630685 520292
18749 520292 441200 351105 272955 221380 150102 181162 212119 233750 199206 57287 34443
18738 34443 90817 74603 64928 65148 100314 57359 -16990 -3101 32745 -7459 -40435 -13732
18726 -13732 109853 223045 243720 222264 217365 214912 312897 319764 241696 228200 310662 472857
18714 472857 598919 689307 638977 571178 562933 560412 529393 397421 374614 349958 333907
18703 333907 294602 299029 381484 424405 419358 436410 429583 396501 274352 245759 192415 94786
18691 94786 45794 43691 35550 25090 26596 15474 46870 35524 46918 63026 8501 2393
18679 2393 20514 35947 84172 63169 45986 -20091 -87419 -16887 -133660 -167578 -112851 -57841
$$ packed form
18761G85869P2171q0296j8832L4108P5496J2918n405j8838q2565n3153r0788j10393
18749E20292p9092r0095p8150n1575p1278L1060L0957K1631l4544j41919k2844
18738C4443N6374j6214r675K20L5166m2955p4349J3889L5846m0204l2976K6703
18726a3732J23585J13192K0675k1456m899k453R7985O867p8068j3496Q2462J62195
18714D72857J26062R0388n0330o7799q245k521l1019j31972k2807k4656j6051
18703C33907l9305M427Q2455M2921n047J7052o827l3082j22149k8593n3344r7629
18691I4786m8992k103q141j0460J506j1122L1396j1346J1394J6108n4525o108
18679B393J8121J5433M8225k1003j7183o6077o7328P0532j16773l3918N4727N5010
$$ plain form
18667 -57841 -87955 -77147 -86833 -139782 -208732 -194374 -143102 -44098 -16693 32446 -9502 -1486
18655 -1486 20673 40951 46858 80892 66572 -40217 -33144 -16029 49632 168571 136387 36225
18643 36225 21938 68297 33800 -24969 -109265 -100514 111749 150842 109037 81783 23824 1540
18631 1540 23069 80910 139370 78178 47851 7509 -5995 56280 34229 5162 -127916 -85310
18619 -85310 -10011 -63805 -48371 -37057 -91916 -144815 -123494 -56082 3975 83332 47165 72042
18607 72042 104391 148115 184629 215060 173843 99844 21275 -75573 -96967 -88592 -24599 -23917
18595 -23917 -93375 -88811 27892 164903 152502 126452 161758 54710 -55840 -60453 96803
18584 96803 147777 152560 155400 104737 58860 100364 19300 -69882 -32320 -4787 -65869 -94818
$$ packed form
18667e7841l0114J0808r686n2949o8950J4358N1272R9004K7405M9139m1948Q016
18655a486K2159K0278N907L4034j4320j06789P073J7115O5661J18939l2184j00162
18643C6225j4287M6359l4497n8769q4296Q751K12263L9093m1805k7254n7959k2284
18631A540K1529N7841N8460o1192l0327m0342j3504O2275k2051k9067j33078M2606
18619h5310P5299n3794J5434J1314n4859n2899K1321O7412O0057P9357l6167K4877
18607G2042L2349M3724L6514L0431m1217p3999p8569r6848k1394Q375O3993O82
18595b3917o9458M564J16703J37011j2401k6050L5306j07048j10550m613J57256
18584I6803N0974M783K840n0663m5877M1504q1064q9182L7562K7533o1082k8949
$$ plain form
18572 -94818 -104931 -32447 -62026 -161337 -97519 -23176 12474 22752 59748 126510 -39059
18561 -39059 -41265 91257 29946 -81910 -54144 76515 60790 14985 43605 -40829 -143199
18550 -143199 -111834 -37978 8399 -39682 -16368 -41378 -19068 -50975 -39850 -97304 -35823
18539 -35823 -12326 -1610 -66963 -84966 -77465 -97235 -84538 21513 28046 -22172 13500 78313
18527 78313 116741 -11684 -46143 -22259 34185 182223 240533 217619 269057 347122 311834
18516 311834 406100 504269 555474 578980 613196 636915 622394 611162 703183 761114 817126
18505 817126 933745 854469 826295 964195 926332 881220 934542 974234 974757 908546 795884
18494 795884 771464 830102 834794 849747 766304 687716 524856 321513 292181 223526 147760
$$ packed form
18572i4818j0113P2484k9579r9311O3818P4343L5650J0278L6996O6762j65569
18561c9059k206J32522o1311j11856K7766J30659j5725m5805K8620q4434j02370
18550a43199L1365P3856M6377m8081K3314k5010K2310l1907J1125n7454O1481
18539c5823K3497J0716o5353j8003P501j9770J2697J06051O533n0218L5672O4813
18527G8313L8428j28425l4459K3884N6444J48038N8310k2914N1438P8065l5288
18516C11834R4266R8169N1205K3506L4216K3719j4521j1232R2021N7931N6012
18505H17126J16619p9276k8174J37900l7863m5112N3322L9692N23o6211j12662
18494G95884k4420N8638M692J4953q3443p8588j62860k03343k9332o8655p5766
$$ plain form
18483 147760 220267 210097 211845 267957 211682 220843 384300 392814 507810 552331 569812 599221
18471 599221 686691 801067 834857 854923 848105 773677 751598 729310 721835 745613 852351
18460 852351 814797 781345 662829 575590 538656 515587 480615 439734 360944 415957 550191
18449 550191 763879 817854 708475 573810 506558 428236 344529 235950 88958 95370 -7259
18438 -7259 -79927 -42941 107427 131258 122244 114958 77161 110017 44225 15800 -80039 -79419
18426 -79419 -49985 1800 -31281 20808 49779 31395 48202 61260 155188 151230 195536 167218
18414 167218 123983 67007 56492 71407 60750 14143 94316 85942 34005 81335 155903 205710
18402 205710 127458 -19638 -42356 40624 173158 159007 145929 178107 243073 403425 523794
$$ packed form
18483A47760P2507j0170J748N6112n6275R161J63457Q514J14996M4521J7481K9409
18471E99221Q7470J14376L3790K0066o818p4428k2079k2288p475K3778J06738
18460H52351l7554l3452j18516q7239l6934k3069l4972m0881p8790N5013J34234
18449E50191K13688N3975j09379j34665o7252p8322q3707j08579j46992O412j02629
18438g259p2668L6986J50368K3831r014p286l7797L2856o5792k8425r5839O20
18426g9419K9434N1785l3081N2089K8971j8384J6807J3058R3928l958M4306k8318
18414A67218m3235n6976j0515J4915j0657m6607Q0173q374n1937M7330P4568M9807
18402B05710p8252j47096k2718Q2980J32534j4151j3078L2178O4966J60352J20369
$$ plain form
18391 523794 582564 602867 626682 612716 624977 614698 612159 539536 486626 481917 628812 794900
18379 794900 728761 748795 773018 747731 746049 779777 736931 669532 552850 423930 232592
18368 232592 159675 207062 63423 51127 132422 29106 -8858 17286 36162 76048 74716
18357 74716 -38993 -31978 -48177 -38255 24271 70493 81581 110722 121444 126739 162953 111642
18345 111642 130862 89968 19498 10189 -18380 -77053 -37410 3884 -45319 -12224 -107145 -141123
18333 -141123 -84034 -18078 -29000 -65263 -34309 -33735 22957 78462 24640 -37884 -56187 56288
18321 56288 123126 121216 98056 89353 165954 44242 -70255 -8072 20765 -4053 -27120 -69862
18309 -69862 -70367 -83913 -123 52243 -62391 -18027 -62363 -31245 64882 17578 -57408 -3241
$$ packed form
18391E23794N8770K0303K3815j3966J2261j0279k539p2623n2910m709J46895J66088
18379G94900o6139K0034K4223k5287j682L3728m2846o7399j16682j28920j91338
18368B32592p2917M7387j43639j2296Q1295j03316l7964K6144J8876L9886j332
18357G4716j13709P015j6199R922O2526M6222J1088K9141J0722N295L6214n1311
18345A11642J9220m0894p0470r309k8569n8673L9643M1294m9203L3095r4921l3978
18333a41123N7089O5956j0922l6263L0954N74N6692N5505n3822o2524j8303J12475
18321E6288O6838j910k3160q703P6601j21712j14497O2183K8837k4818k3067m2742
18309f9862n05j3546Q3790N2366j14634M4364m4336L1118R6127m7304p4986N4167
$$ plain form
18297 -3241 87112 94784 83335 69954 56893 -43095 -123086 -217363 -107351 8039 61926 70146
18285 70146 278 -47700 69485 70404 117047 120543 -17369 -80132 -82233 6630 66369 138830
18273 138830 274018 266154 141912 1854 16123 -28185 -41617 -102500 -75976 -26616 -32424
18262 -32424 -77940 -106953 -53390 16090 -9045 -46782 -22477 6122 -15338 97501 220706
18251 220706 198454 69551 -39875 -54039 -21394 11247 8547 15923 -23308 -28820 -5329 13933
18239 13933 46022 -107030 -109881 -114381 -152274 -111789 -57303 -56025 2226 107999 98182 59876
18227 59876 74616 46801 24024 97494 130174 186336 198766 258734 329528 336629 290270 137687
18215 137687 122457 157086 179390 169938 130645 133240 144057 173920 178497 105311 23646 -27821
$$ packed form
18297c241R0353P672j1449j3381j3061r9988p9991r4277J10012J15390N3887Q220
18285G0146o9868m7978J17185R19M6643L496j37912o2763k101Q8863N9739P2461
18273A38830J35188p864j24242j40058J4269m4308j3432o0883K6524M9360n808
18262c2424m5516k9013N3563O9480k5135l7737K4305K8599k1460J12839J23205
18251B20706k2252j28903j09426j4164L2645L2641k700P376l9231n512K3491J9262
18239A3933L2089j53052k851m500l7893M0485N4486J278N8251J05773r817l8306
18227E9876J4740k7815k2777P3470L2680N6162J2430N9968P0794P101m6359j52583
18215A37687j5230L4629K2304r452l9293K595J0817K9863M577p3186q1665n1467
$$ plain form
18203 -27821 57945 74441 49231 84558 177614 271887 179576 114611 154573 130387 -32220
18192 -32220 -150437 -34352 118266 79550 37111 33236 48127 29678 74261 -8834 -23134
18181 -23134 -52537 -2495 108418 155027 125868 47812 144381 129411 73200 103974 93598
18170 93598 67176 99530 193314 186679 222922 267567 249515 223875 202390 200648 233249 171631
18158 171631 63134 57552 -4852 51538 140199 64209 90500 107579 100993 119962 66038 -14364
18146 -14364 -80860 -39970 -49080 -68020 -20826 148222 165704 119827 -6896 -139177 -146254
18135 -146254 -93814 -64614 33438 75972 127033 56714 34234 52886 129514 65863 59505 53706
18123 53706 147791 219297 233868 160851 44768 20072 26915 129768 38882 7586 85431
$$ packed form
18203b7821Q5766J6496k5210L5327R3056R4273r2311o4965L9962k4186j62607
18192c2220j18217J16085J52618l8716m2439l875J4891j8449M4583q3095j4300
18181b3134k9403N0042J10913M6609k9159p8056R6569j4970n6211L0774j0376
18170I3598k6422L2354R3784o635L6243M4645j8052k5640k1485j742L2601o1618
18158A71631j08497n582o2404N6390Q8661p5990K6291J7079o586J8969n3924q0402
18146a4364o6496M0890r110j8940M7194J69048J7482m5877j26723j32281p077
18135a46254N2440K9200R8052M2534N1061p0319k2480J8652P6628o3651o358n799
18123E3706R4085P1506J4571p3017j16083k4696O843J02853r0886l1296P7845
$$ plain form
18112 85431 50748 39756 51423 113928 135318 117653 90030 73347 102114 45447 9678 -3392
18100 -3392 12150 13552 22253 89949 84958 95608 174559 128818 -29549 -45010 20592 33966
18088 33966 36814 147844 254339 216989 199174 182410 157830 136840 81378 43992 96186
18077 96186 93388 105544 101766 83320 114951 148178 140538 31627 27849 45714 53923 69146
18065 69146 -3251 -1523 51883 30352 108770 183914 258006 368398 261228 135816 76312
18054 76312 105862 101963 72612 78077 94204 103865 55493 150346 117253 126771 91939 132495
18042 132495 152859 165226 265273 311525 268777 192540 199279 56251 -2598 93210 225527
18031 225527 264096 231654 158465 238054 267247 265509 179899 152081 92122 89956 200992 391637
$$ packed form
18112H5431l4683j0992J1667O2505K1390j7665k7623j6683K8767n6667l5769j3070
18100c392J5542J402Q701O7696m991J0650P8951m5741j58367j5461O5602J3374
18088C3966K848J11030J06495l7350j7815j6764k4580k0990n5462l7386N2194
18077I6186k798J2156l778j8446L1631L3227p640j08911l778J7865Q209J5223
18065F9146p2397J728N3406k1531P8418P5144P4092J10392j07170j25412n9504
18054G6312K9550l899k9351N465J6127R661m8372R4853l3093R518l4832M0556
18042A32495K0364J2367J00047M6252m2748p6237O739j43028n8849R5808J32317
18031B25527L8569l2442p3189P9589K9193j738q5610k7818n9959k166J11036J90645
$$ plain form
18019 391637 404955 436409 425083 417573 482107 503143 364801 195431 216825 309049 357229
18008 357229 384170 433908 455443 526498 495873 437696 366351 399426 553782 617566 589746
17997 589746 567426 579814 624680 592205 546415 537819 601412 559068 598596 692284 781690 775497
17985 775497 650016 695256 789940 877716 869243 920586 1034284 1171334 1364090 1491139 1602704
17974 1602704 1694172 1781605 1996000 2153914 2237132 2369398 2584157 2695280 2726246 2766856
17964 2766856 2912871 3129285 3444031 3606822 3891444 4129382 4507897 5022603 5558359
17955 5558359 6243841 7145225 8379121 9998999 11970728 14653228 18592231 24524896
17947 24524896 33710425 47598792 66033763 85757466 102009672 112930172 120066178
$$ packed form
18019C91637J3318L1454j1326p510O4534K1036j38342j69370K1394R2224M8180
18008C57229K6941M9738K1535P1055l0625n8177p1345L3075J54356O3784k7820
17997E89746k2320J2388M4866l2475m5790q596O3593m2344L9528R3688Q9406o193
17985G75497j25481M5240R4684Q7776q473N1343J13698J37050J92756J27049J11565
17974A602704R1468Q7433K14395J57914Q3218J32266K14759J11123L0966M0610
17964B766856J46015K16414L14746J62791K84622K37938L78515N14706N35756
17955E558359O85482R01384J233896J619878J971729K682500L939003N932665
17947B4524896R185529J3888367J8434971J9723703J6252206J0920500P136006
$$ plain form
17940 120066178 124252309 124489199 119478832 109300504 94716017 76917611 59054784
17933 59054784 44387985 34393003 28459719 25335855 24261538 24887027 27549444 33033780
17925 33033780 42730651 58012000 77943128 97845985 113068046 123019180 129216832
17918 129216832 132015163 130144501 122800972 110401800 93616706 74001123 55105984
17911 55105984 39939400 29309503 22376556 17646328 14227639 11740478 9973206 8627016
17903 8627016 7450240 6560961 5791528 5156342 4620168 4189347 3884259 3600403 3410804
17894 3410804 3248336 2939146 2753159 2745177 2655038 2445958 2434263 2419644 2370763 2306971 2179695
17883 2179695 2059222 1813144 1587760 1358484 1214446 1033414 946015 920505 924142 860949
$$ packed form
17940A20066178M186131K36890n010367j0178328j4584487j7798406j7862827
17933E9054784j4666799r994982n933284l123864j074317O25489K662417N484336
17925C3033780R696871J5281349J9931128J9902857J5222061R951134O197652
17918A29216832K798331j870662p343529j2399172j6785094j9615583j8895139
17911E5105984j5166584j0629897o932947m730228l418689k487161j767272j346190
17903H627016j176776q89279p69433o35186n36174m30821l05088k83856j89599
17894C410804j62468l09190j85987p982r0139k09080j1695j4619m8881o3792j27276
17883B179695j20473k46078k25384k29276j44038j81032q7399k5510L637o3193
$$ plain form
17873 860949 852100 809692 815545 713523 634178 658828 612658 579939 593948 634447 676741 673691
17861 673691 705948 648940 621272 496471 403724 401785 443723 476629 407070 279597 267380
17850 267380 293892 307507 301898 253667 129224 133484 103076 143487 158794 177494 303729
17839 303729 301785 347181 270847 220488 258717 275262 261126 261247 238612 196567 204173 189327
17827 189327 156871 135940 61702 5510 -52972 -35190 91465 175439 158377 191805 178727
17816 178727 58595 13843 165274 203561 270417 281610 244268 201109 110610 64848 176282
17805 176282 186903 119782 68300 102995 95600 83759 135949 202054 210229 181612 40850 -106734
17793 -106734 -134695 -25767 67663 132503 218073 174260 151876 131120 113771 -5628 15380
$$ packed form
17873H60949q849m2408N853j02022p9345K4650m6170l2719J4009M0499M2294l050
17861F73691L2257n7008k7668j24801r2747j939M1938L2906o9559j27473j2217
17850B67380K6512J3615n609m8231j24443M260l0408M0411J5307J8700J26235
17839C03729j944M5396p6334n0359L8229J6545j4136J21k2635m2045P606j4846
17827A89327l2456k0931p4238n6192n8482J7782J26655Q3974j7062L3428j3078
17816A78727j20132m4752J51431L8287O6856J1193l7342m3159r0499m5762J11434
17805A76282J0621o7121n1482L4695p395j1841N2190O6105Q175k8617j40762j47584
17793a06734k7961J08928R3430O4840Q5570m3813k2384k0756j7349j19399K1008
$$ plain form
17782 15380 89775 186690 198212 135493 99725 207272 352557 316377 217368 83257 95565
17771 95565 90347 -17063 -62877 -128342 -21535 2584 -8005 5284 77630 96771 -25280
17760 -25280 17267 14341 -23439 61651 47131 128107 197640 190206 149031 146104 192434 222434
17748 222434 176420 194147 273272 166397 169655 243353 179876 212277 218436 154878 210261 246152
17736 246152 201049 283455 307905 345345 429672 469631 490812 492389 370162 267361 305512
17725 305512 254546 255657 295600 376161 489370 530645 561885 551416 565340 436261 408386
17714 408386 359242 294962 238108 206886 263512 380983 461474 474003 343517 211764 75346
17703 75346 124557 172722 160883 214005 344695 412554 328382 238559 182768 54957 65354
$$ packed form
17782A5380P4395R6915J1522o2719l5768J07547J45285l6180r9009j34111J2308
17771I5565n218j07410m5814o5465J06807K4119j0589J3289P2346J9141j22051
17760b5280M2547k926l7780Q5090j4520Q0976O9533p434m1175k927M6330L0000
17748B22434m6014J7727P9125j06875L258P3698o3477L2401O159o3558N5383L5891
17736B46152m5103Q2406K4450L7440Q4327L9959K1181J577j22227j02801L8151
17725C05512n0966J111L9943Q0561J13209M1275L1240j0469J3924j29079k7875
17714D08386m9144o4280n6854l1222N6626J17471Q0491J2529j30486j31753j36418
17703G5346M9211M8165j1839N3122J30690O7859q4172q9823n5791j27811J0397
$$ plain form
17692 65354 95194 104306 131640 139707 138930 127852 101792 45463 78428 54507 172452 121772
17680 121772 7966 -59775 29880 202962 181099 193572 156190 126626 174751 159691 80091
17669 80091 29813 -82188 -45363 8415 77822 71641 46581 29343 -21369 -123126 -122310 38743
17657 38743 27739 -18678 -30777 -59678 -28140 31101 111155 150402 85276 26317 12315 45001
17645 45001 94438 41953 10466 86045 179413 140803 86500 97018 56644 9588 76434 175101
17633 175101 202058 135183 -54635 -74959 71676 176890 125122 22430 -13827 -53256 -95094
17622 -95094 -12134 35813 -22897 -31506 17411 -19718 -86202 -4953 32981 -5433 -424 -46360
17610 -46360 -31897 41647 140513 115720 90216 14569 -74296 -138462 -155702 -84039 11677 -60499
$$ packed form
17692F5354K9840R112K7334Q067p77j1078k6060n6329L2965k3921J17945n0680
17680A21772j13806o7741Q9655J73082k1863J2473l7382k9564M8125j5060p9600
17669H0091n0278j12001L6825N3778O9407o181k5060j7238n0712j01757Q16J61053
17657C8743j1004m6417j2099k8901L1538N9241Q0054L9247o5126n8959j4002L2686
17645D5001M9437n2485l1487P5579R3368l8610n4303J0518m0374m7056O6846R8667
17633A75101K6957o6875j89818k0324J46635J05214n1768j02692l6257l9429m1838
17622i5094Q2960M7947n8710q609M8917l7129o6484Q1249L7934l8414N009m5936
17610d6360J4463P3544R8866k4793k5504p5647q8865o4166j7240P1663R5716p2176
$$ plain form
17598 -60499 -91742 -136728 -60035 77702 4764 -94095 -147500 -122029 -57695 -42529 -52778
17587 -52778 -8524 90209 23721 -123152 -111772 -96366 -44079 -40485 -44977 -72022 -113678 -180085
17575 -180085 -96299 -53145 -149684 -63470 -33537 25955 48891 21360 109491 123374 134652
17564 134652 123996 67284 -112611 -156654 -178319 -146586 -223029 -181871 -96590 -51430 -69488
17553 -69488 -48203 -122892 -189351 -145279 -141066 -127358 -124295 -16837 -2703 -1997 -3995 -19856
17541 -19856 32288 9026 -76218 -40830 52215 89743 111458 125223 71419 -3974 6336 5192
17529 5192 28833 38856 32504 53118 63160 93601 55297 33360 44112 2695 40956 -101981
17517 -101981 -209660 -154832 -84362 -18007 60802 128824 163637 82421 52142 79409 -37522
$$ packed form
17598f0499l1243m4986P6693J37737p2938r8859n3405K5471O4334J5166j0249
17587e2778M4254R8733o6488j46873J1380J5406N2287L594m492k7045m1656o6407
17575a80085Q3786M3154r6539Q6214K9933N9492K2936k7531Q8131J3883J1278
17564A34652j0656n6712j79895m4043k1665L1733p6443M1158Q5281M5160j8058
17553f9488K1285p4689o6459M4072M213J3708L063J07458J4134P06j998j5861
17541a9856N2144k3262q5244L5388R3045L7528K1715J3765n3804p5393J0310j144
17529E192K3641J0023o352K0614J0042L0441l8304k1937J0752m1417L8261j42937
17517a01981j07679N4828P0470O6355P8809O8022L4813q1216l0279K7267j16931
$$ plain form
17506 -37522 -64200 -135144 -141123 -28719 83625 104837 63104 38049 27224 67009 57983 71948
17494 71948 89013 -53239 -90795 108987 195974 166790 179589 96446 2052 -23124 -39583
17483 -39583 6256 42893 -10774 -77365 -125459 -106952 -67001 -22805 -65283 -75919 -158553 -161944
17471 -161944 -140916 -162757 -135892 -147764 -7906 41662 -42085 -99967 -142732 -159411 -219086
17460 -219086 -181864 -122486 -80167 -100668 -108127 1169 73206 50296 -20590 8192 16549 -9121
17448 -9121 -24675 -11995 -32132 61361 38013 -112771 -123428 -45022 39623 59673 149127 275755
17436 275755 292994 292620 185164 93893 -12417 -80976 -89831 -50764 -15105 71495 -8782 -47916
17424 -47916 963 68306 35578 -66678 -96371 -196862 -259587 -190419 -141615 -83869 43733
$$ packed form
17506c7522k6678p0944n979J12404J12344K1212m1733k5055j0825L9785r026J3965
17494G1948J7065j42252l7556J99782Q6987k9184J2799q3143r4394k5176j6459
17483c9583M5839L6637n3667o6591m8094J8507L9951M4196m2478j0636q2634l391
17471a61944K1028k1841K6865j1872J39858M9568q3747n7882m2765j6679n9675
17460b19086L7222N9378M2319k0501p459J09296P2037k2910p0886K8782Q357k5670
17448i121j5554J2680k0137R3493k3348j50784j0657P8406Q4645K0050Q9454J26628
17436B75755J7239l74j07456r1271j06310o8559q855L9067L5659Q6600q0277l9134
17424d7916M8879O7343l2728j02256k9693j00491o2725O9168M8804N7746J27602
$$ plain form
17413 43733 90783 142543 83359 -23934 -50318 75793 118007 47678 47292 86047 100698 88842
17401 88842 102998 119649 115896 78250 53627 708 -32320 -174392 -216056 -107043 -2424
17390 -2424 98677 128138 119901 170541 228320 284012 410664 456968 505113 504905 507349 455586
17378 455586 499164 527568 453556 385364 166429 80941 145630 147481 218817 305861 284677
17367 284677 233821 170749 239546 374670 453593 467376 549303 650875 692248 606881 633446
17356 633446 634950 586128 477965 344957 264369 263662 182568 161850 144328 101805 118276 104129
17344 104129 82014 62875 99942 133829 34075 65462 137532 125853 -8543 -39246 8283
17333 8283 -11517 40936 58506 18186 -21926 36275 112001 166040 219446 191054 118224 160847
$$ packed form
17413D3733M7050N1760n9184j07293k6384J26111M2214p0329l86L8755J4651j1856
17401H8842J4156J6651l753l7646k4623n2919l3028j42072m1664J09013J04619
17390b424J01101K9461q237N0640N7779N5692J26652M6304M8145k08K444n1763
17378D55586M3578K8404p4012o8192k18935q5488O4689J851P1336Q7044k1184
17367B84677n0856o3072O8797J35124P8923J3783Q1927J01572M1373q5367K6565
17356F33446J504m8822j08163j33008q0588p07q1094k0718j7522m2523J6471j4147
17344A04129k2115j9139L7067L3887r9754L1387P2070j1679j34396l0703M7529
17333H283j9800N2453J7570m0320m0112N8201P5726N4039N3406k8392p2830M2623
$$ plain form
17321 160847 43180 -27259 30379 95546 10164 33204 71108 41445 65872 64136 42405
17310 42405 45097 65496 85665 67271 71205 48583 44996 121468 197233 122512 129043 241974
17298 241974 237983 311270 326261 165059 98393 136145 194786 103285 92688 57163 -41970
17287 -41970 -39657 36418 144076 247394 218023 149481 139327 151921 86602 71567 145224
17276 145224 242211 268125 121515 99881 121341 62990 -36924 64841 179525 165310 166163
17265 166163 145004 178365 256897 327951 330213 359956 167754 85690 129978 211237 223590
17254 223590 147455 77281 149827 171343 267699 329232 239101 134616 233484 210212 226271
17243 226271 245163 199149 117042 185013 208932 279336 297591 284368 288962 220505 223406 208480
$$ packed form
17321A60847j17667p0439N7638O5167q5382K3040L7904k9663K4427j736k1731
17310D2405K692K0399K0169j8394L934k2622l587P6472P5765p4721O531J12931
17298B41974l991P3287J4991j61202o6666L7752N8641r1501j0597l5525r9133
17287d1970K313P6075J07658J03318k9371o8542j0154J2594o5319j5035P3657
17276A45224R6987K5914j46610k1634K1460n8351r9914J01765J14684j4215Q53
17265A66163k1159L3361P8532P1054K262K9743j92202q2064M4288Q1259J2353
17254B23590p6135p0174P2546K1516R6356O1533r0131j04485R8868k3272J6059
17243B26271J8892m6014q2107O7971K3919P0404J8255j3223M594o8457K901j4926
$$ plain form
17231 208480 238557 371467 446858 451752 444660 346713 275735 318965 378417 500372 592581
17220 592581 608538 698349 735176 784426 755825 804867 803791 779695 884893 1012498 1165746
17209 1165746 1327514 1516863 1485262 1437761 1411375 1349653 1302683 1388192 1562682 1871132
17199 1871132 2181196 2450799 2599426 2690160 2722397 2787870 2932409 3126667 3388345 3810858
17189 3810858 4547410 5292526 6045363 6856433 7929715 9408690 11531583 14966873 20570558
17180 20570558 30212081 46652690 69635201 90789205 101132292 100496415 90663185 73973386
17172 73973386 56363359 44411627 39766351 41836920 51154016 67977283 87642099
17165 87642099 100681207 103388269 97220757 83678408 67172224 54226909 48692389
$$ packed form
17231B08480L0077J32910P5391M894p092r7947p0978M3230N9452J21955R2209
17220E92581J5957Q9811L6827M9250k8601M9042j076k4096J05198J27605J53248
17209A165746J61768J89349l1601m7501k6386o1722m6970Q5509J74490L08450
17199A871132L10064K69603J48627R0734L2237O5473J44539J94258K61678M22513
17189C810858P36552P45116P52837Q11070J073282J478975K122893L435290N603685
17180B0570558R641523J6440609K2982511K1154004J0343087o35877r833230j6689799
17172G3973386j7610027j1951732m645276K070569R317096J6823267J9664816
17165H7642099J3039108K707062o167512j3542349j6506184j2945315n534520
$$ plain form
17158 48692389 51525484 62874226 80204043 94764669 99891803 95869886 84303689
17151 84303689 67769464 52039478 41958168 38085295 40534285 50303106 67543839
17144 67543839 85967203 95857385 95107362 85584716 68866387 49295905 33512028 23251374
17136 23251374 16926404 12989535 10414060 8581153 7326301 6438249 5716861 5126495
17128 5126495 4668294 4198636 3733254 3380985 3152096 3035227 2929429 2883891 2750651 2615684
17118 2615684 2384378 2199806 2088195 1834980 1607436 1519307 1426667 1413969 1471083 1414254
17108 1414254 1287968 1234456 1186358 1153871 1106261 936220 811625 742471 678515 574933
17098 574933 524367 560289 562846 502983 424191 377648 266127 213608 261774 253906 165812 158876
$$ packed form
17158D8692389K833095J1348742J7329817J4560626N127134m021917j1566197
17151H4303689j6534225j5729986j0081310l872873K448990R768821J7240733
17144F7543839J8423364R890182p50023r522646j6718329j9570482j5783877j0260654
17136B3251374o324970l936869k575475j832907j254852q88052p21388n90366
17128E126495m58201m69658m65382l52269k28889j16869j05798m5538j33240j34967
17118B615684k31306j84572j11611k53215k27544q8129r2640j2698N7114n6829
17108A414254j26286n3512m8098l2487m7610j70041j24595o9154o3956j03582
17098E74933n0566L5922K557n9863p8792m6543j11521n2519M8166p868q8094o936
$$ plain form
17086 158876 271645 246799 145106 156941 345881 408001 314919 274645 281719 316937 269330
17075 269330 253336 129447 122669 213333 209973 193153 231731 243080 229502 233089 179130 251661
17063 251661 281745 270053 261432 199636 237293 285780 305784 215165 158255 164959 168659 134145
17051 134145 157469 252231 264105 273771 281314 129684 23648 -11217 -9203 -17958 2546 96211
17039 96211 126565 41038 32056 10663 14955 84470 31837 10390 -26332 -27759 37146 60967
17027 60967 9984 25884 2415 17220 95865 139997 133071 176221 219253 141870 56040 29813
17015 29813 54020 67176 -3348 116514 246688 275888 237129 207235 124487 126854 69462
17004 69462 68439 72402 85584 105882 69377 -23311 -21809 -34115 64007 45133 -43173 -36858
$$ packed form
17086A58876J12769k4846j01693J1835J88940O2120r3082m0274P074L5218m7607
17075B69330j5994j23889o778R0664l360j6820L8578J1349j3578L587n3959P2531
17063B51661L0084j1692q621o1796L7657M8487K0004r0619n6910O704L700l4514
17051A34145K3324R4762J1874R666P543j51630j06036l4865K014q755K0504R3665
17039I6211L0354q5527q982k1393M292O9515n2633k1447l6722j427O4905K3821
17027F0967n0983J5900k3469J4805P8645M4132o926M3150M3032p7383q5830k6227
17015B9813K4207J3156p0524J19862J30174K9200l8759k9894q2748K367n7392
17004F9462j023L963J3182K0298l6505r2688J502j2306R8122j8874q8306O315
$$ plain form
16992 -36858 -28504 -118933 -131613 -56305 -9972 43455 91928 10343 -19824 -63131 -85090 -75730
16980 -75730 -46291 -52828 -37392 14820 95895 16175 -5844 75779 101066 35700 -57767 -13300
16968 -13300 -58669 -54582 16361 37177 -14807 -41972 -52821 -607 -13264 -77000 -50888 -40074
16956 -40074 -65269 -32431 52485 78839 30903 7856 37050 -19902 -58169 -150164 -161321 -57771
16944 -57771 -3793 -49349 56164 41519 31889 61281 61155 -24195 -162713 -233870 -141374 -114689
16932 -114689 -99947 -65649 -140140 -77280 -41032 -71180 -93814 -10844 -29153 -107192 -99773 -91020
16920 -91020 -116181 -52835 -82740 -155909 -47743 6082 12024 92546 8070 -48039 -103266 -112188
16908 -112188 -22388 -45848 -116427 -124155 -78619 -20240 -22457 -13871 38047 -24635 -61721 22431
$$ packed form
16992c6858Q354r0429j2680P5308M6333N3427M8473q1585l0167m3307k1959R360
16980g5730K9439o537J5436N2212Q1075p9720k2019Q1623K5287o5366r3467M4467
16968a3300m5369M087P0943K0816n1984k7165j0849N2214j2657o3736K6112J0814
16956d0074k5195L2838Q4916K6354m7936k3047K9194n6952l8267r1995j1157J03550
16944e7771N3978m5556J05513j4645r630K9392j26q5350j38518p1157R2496K6685
16932a14689J4742L4298p4491O2860L6248l0148k2634Q2970j8309p8039P419Q753
16920i1020k5161O3346k9905p3169J08166N3825N942Q0522q4476n6109n5227q922
16908a12188Q9800k3460p0579p728M5536N8379k217Q586N1918o2682l7086Q4152
$$ plain form
16896 22431 91620 31187 -31807 71772 143774 60421 -10341 -13954 14336 -92153 -141388
16885 -141388 -134939 -19016 -23921 61666 93432 -14225 47214 133624 102148 85615 97023
16874 97023 117086 111166 77739 -2290 35051 111952 161485 121700 89731 77114 92102 77586
16862 77586 34635 -10751 -57980 -21196 -35349 -55166 4057 29393 -4771 14645 8700 -75876
16850 -75876 -59432 -6536 42662 12465 1087 -31072 -121874 -147535 -119269 -87658 -130001 -123904
16838 -123904 -41119 -30600 -40593 -84077 -161593 -96519 -9756 63848 33358 -19335 -3395 -73595
16826 -73595 -128238 -55960 25525 -36599 -71201 -69131 -107895 -56772 -30024 -88410 -16193 3443
16814 3443 -18531 -82499 -93481 -119089 -85656 -99041 -63552 -45858 -87876 -82278 -73341 -31845
$$ packed form
16896B2431O9189o0433o2994J03579P2002q3353p0762l613K8290j06489m9235
16885a41388O449J15923m905Q5587L1766j07657O1439Q6410l1476j6533J1408
16874I7023K0063n920l3427q0029L7341P6901M9533l9785l1969j2617J4988j4516
16862G7586m2951m5386m7229L6784j4153j9817N9223K5336l4164J9416n945q4576
16850g5876J6444N2896M9198l0197j1378l2159r0802k5661K8266L1611m2343O097
16838a23904Q2785J0519r993m3484p7516O5074Q6763P3604l0490n2693J5940p0200
16826g3595n4643P2278Q1485o2124l4602K070l8764N1123K6748n8386P2217J9636
16814C443k1974o3968j0982k5608L3433j3385L5489J7694m2018N598Q937M1496
$$ plain form
16802 -31845 -67552 -163814 -145520 -139192 -56188 -12887 -72996 -42276 28483 -36763 -138120 -86420
16790 -86420 -124506 -117568 -85565 -36607 -2883 3711 -25500 -53343 -27719 -1458 184 2486
16778 2486 36811 138123 131363 51342 -11810 -53080 2568 62208 4716 -108462 -142246 -53446
16766 -53446 13318 50281 14457 -5512 -103413 -71708 -47431 -91256 -42514 -10255 -24234 965
16754 965 60810 77803 66912 -3242 67101 116422 36213 6830 7517 21371 69268 62889 71097
16741 71097 400 -122085 -61616 -90936 -91306 -111242 -218428 -169482 -134704 -38078 -1542 23783
16729 23783 1862 40722 53772 39015 -40630 -76832 -77868 -128189 -70136 -35203 -56817 -117586
16717 -117586 -69863 -22470 -84206 -140956 -62169 -52794 50590 20016 -74349 -52897 -21609
$$ packed form
16802c1845l5707r6262J8294O328Q3004M3301o0109L0720P0759o5246j01357N1700
16790h6420l8086O938L2003M8958L3724O594k9211k7843K5624K6261J642K302
16778B486L4325J01312o760q0021o3152m1270N5648N9640n7492j13178l3784Q8800
16766e3446O6764L6963l5824j9969r7901L1705K4277m3825M8742L2259j3979K5199
16754I65N9845J6993j0891p0154P0343M9321q0209k9383O87J3854M7897o379Q208
16741G1097p0697j22485O0469k9320l70j9936j07186M8946L4778R6626L6536K5325
16729B3783k1921L8860J3050j4757p9645l6202j036n0321N8053L4933k1614o0769
16717a17586M7723M7393o1736n6750P8787R375J03384l0574r4365K1452L1288
$$ plain form
16706 -21609 -8581 -30246 -3143 -14529 -51025 -13351 -13724 52258 60250 39660 79030 18440
16694 18440 83401 103877 58797 1280 -37687 -61472 -125972 -137333 -131527 -43358 -73212 -131220
16682 -131220 -212983 -265580 -210354 -237781 -206557 -74350 -31072 -44772 -68421 1320 -56593
16671 -56593 -96513 -108790 -133997 -93934 -20846 -27895 37518 23639 9348 16927 -37795 -14669
16659 -14669 -134161 -159589 -100124 -54842 -40206 -92644 -79092 -64651 -35460 64335 25051
16648 25051 -19236 2267 25926 38793 -41394 -85360 -171860 -73787 -29440 -80469 -145975 -166271
16636 -166271 -103864 -197064 -140776 -62762 37466 6119 -27067 -53193 -18487 -31427 16102
16625 16102 103153 73676 13337 -6609 107829 244711 332948 319904 291936 351908 375200
$$ packed form
16706b1609J3028k1665K7103j1386l6496L7674l73O5982P992k0590L9370o0590
16694A8440O4961K0476m5080n7517l8967k3785o4500j1361N806Q8169k9854n8008
16682a31220q1763n2597N5226k7427L1224J32207M3278j3700k3649O9741n7913
16671e6593l9920j2277k5207M0063P3088p049O5413j3879j4291P579n4722K3126
16659a4669j19492k5428N9465M5282J4636n2438J3552J4441K9191R9795l9284
16648B5051m4287K1503K3659J2867q0187m3966q6500R8073M4347n1029o5506k0296
16636a66271O2407r3200N6288P8014J00228l1347l3186k6126L4706j2940M7529
16625A6102Q7051k9477o0339j9946J14438J36882Q8237j3044k7968N9972K3292
$$ plain form
16614 375200 448958 467778 472475 369159 303652 320577 369890 368077 388661 443358 532605 460688
16602 460688 431570 369284 393004 429147 341748 276155 301855 430206 430388 432997 480649 422549
16590 422549 312958 142492 120602 230867 378367 395254 313675 363172 436246 510772 483616
16579 483616 353723 229156 236098 305058 268363 150778 98892 100169 80483 74254 118076
16568 118076 189994 224727 205101 173876 42656 -75594 -130624 -16171 15735 -27535 -42266
16557 -42266 -25724 -34896 -70312 -110677 -134204 -32557 105469 161479 50247 -19657 -72006
16546 -72006 -21751 6535 3824 4964 -44899 -89290 -15910 -51974 53489 23470 -68876 -137539
16534 -137539 -127641 -96314 -96319 -151602 -88288 -71743 -89760 -117419 -110602 -42898 -181584 -323786
$$ packed form
16614C75200P3758J8820M697j03316o5507J6925M9313j813K0584N4697Q9247p1917
16602D60688k9118o2286K3720L6143q7399o5593K5700J28351J82K609M7652n8100
16590D22549j09591j70466k1890J10265J47500J6887q1579M9497P3074P4526k7156
16579D83616j29893j24567O942O8960l6695j17585n1886J277j9686o229M3822
16568A18076P1918L4733j9626l1225j31220j18250n5030J14453L1906m3270j4731
16557d2266J6542r172l5416m0365k3527J01647J38026N6010j11232o9904n2349
16546g2006N0255K8286k711J140m9863m4391P3380l6064J05463l0019r2346o8663
16534a37539R898L1327nn5283O3314J6545j8017k7659O817O7704j38686j42202
$$ plain form
16522 -323786 -280275 -187260 19801 127706 44743 -86908 -134019 -136722 -49992 -23799 -39459
16511 -39459 -22985 -39629 -62202 -61190 80065 120059 162690 146437 53125 -65087 -166821
16500 -166821 -102267 -24853 -39685 -51792 -87814 -74915 -6840 55894 38098 -19814 -174206
16489 -174206 -155803 -27329 51742 -5664 -36812 -75593 -99155 -100358 -50465 -74927 -56528
16478 -56528 30625 27212 -45272 -72620 -121109 -150842 -121508 -102824 -147612 -36257 -10807 -35566
16466 -35566 -56558 -89529 -192110 -199474 -186972 -137811 -163466 -128624 -58479 -37343 -8013 127248
16454 127248 161891 149496 63240 23406 -27818 7031 49531 19906 -23938 -56217 -21390
16443 -21390 -5341 33545 -36211 -40142 -71358 -91944 -101243 -110229 -201274 -142635 3670 62573
$$ packed form
16522c23786M3511R3015K07061J07905q2963j31651m7111k703Q6730K6193j5660
16511c9459J6474j6644k2573J012J41255L9994M2631j6253r3312j18212j01734
16500a66821O4554P7414j4832j2107l6022J2899O8075O2734j7796n7912j54392
16489a74206J8403J28474P9071n7406l1148l8781k3562j203M9893k4462J8399
16478e6528Q7153l413p2484k7348m8489k9733K9334J8684m4788J11355K5450k4759
16466c5566k0992l2971j02581p364J2502M9161k5655L4842P0145K1136K9330J35261
16454A27248L4643j2395q6256l9834n1224L4849M2500k9625m3844l2279L4827
16443b1390J6049L8886o9756l931l1216k0586r299q986r1045N8639J46305N8903
$$ plain form
16431 62573 121064 159103 28130 -133805 -83002 -5932 -18311 -28310 91716 167515 156909
16420 156909 110620 71860 45078 1416 -8543 -73092 -93054 -113695 -120711 -144429 -114476 9688
16408 9688 83061 84170 64172 32314 -23834 -36566 -59434 -32266 -51906 -99423 -173797 -175958
16396 -175958 -111374 -68579 -156637 -254441 -232609 -231124 -283300 -282332 -183048 -132846 -71365 -79886
16384 -79886 -48134 -91460 -140594 -175580 -210315 -240927 -186673 -160303 -119880 -159774 -221894 -202905
16372 -202905 -122196 18556 41997 79287 63453 -83703 -58876 80753 78352 74538 44623
16361 44623 27463 -97796 -154887 -218622 -171069 -146614 -97071 -35431 69776 133589 -31027
16350 -31027 -97144 -123102 -88286 -55953 60002 41157 -62834 -9504 10039 -3975 -16510
$$ packed form
16431F2573N8491L8039j30973j61935N0803P7070j2379r999J20026P5799j0606
16420A56909m6289l8760k6782m3662r959o4549j9962k0641p016k3718K9953J24164
16408I688P3373J109j9998l1858n6148j2732k2868K7168j9640m7517p4374k161
16396a75958O4584M2795q8058r7804K1832J485n2176R68R9284N0202O1481q521
16384g9886L1752m3326m9134l4986l4735l0612N4254K6370M0423l9894o2120J8989
16372b02905Q0709J40752K3441L7290j5834j47156K4827J39629k401l814k9915
16361D4623j7160j25259n7091o3735M7553K4455M9543O1640J05207O3813j64616
16350c1027o6117k5958L4816L2333J15955j8845j03991N3330J9543j4014j2535
$$ plain form
16339 -16510 -46554 -49480 20170 119511 263088 239256 146783 54370 -96835 -142203 -165188
16328 -165188 -107540 -77920 -32425 -82798 -94501 -101030 -59966 -17455 20385 89468 124242 61988
16316 61988 42999 27018 42536 51412 88542 35656 -3355 -117130 -186582 -87750 -59168 -84702
16304 -84702 -145118 -177279 -122676 8604 34085 59995 40186 -75053 -36678 -25209 25366
16293 25366 -29598 -126288 -81452 -43226 -64750 -44023 -39273 -125198 -75556 -13579 36020 20952
16281 20952 -80116 -118702 -135855 -149280 -4989 -72616 -53718 -30870 -2745 -31311 -18789
16270 -18789 -88451 -166352 -158974 -206762 -116526 -25983 17693 -445 -77712 -72523 -75403 18161
16258 18161 -27723 -63770 -1515 -28506 -197419 -207007 -33364 7597 19427 -74680 -103788
$$ packed form
16339a6510l0044k926O9650R9341J43577k3832r2473r2413j51205m5368k2985
16328a65188N7648K9620M5495n0373j1703o529M1064M2511L7840O9083L4774o2254
16316F1988j8989j5981J5518Q876L7130n2886l9011j13775o9452R8832K8582k5534
16304h4702o0416l2161N4603J31280K5481K5910j9809j15239L8375J1469N0575
16293B5366n4964r6690M4836L8226k1524K0727M750q5925M9642O1977M9599j5068
16281B0952j01068l8586j7153j3425J44291o7627J8898K2848K8125k8566J2522
16270a8789o9662p7901P378m7788R0236R0543M3676j8138p7267N189k880R3564
16258A8161m5884l6047O2255k6991j68913r588J73643M0961J1830r4107k9108
$$ plain form
16247 -103788 -127631 -129860 -87132 -62521 -161428 -175483 -180630 -233655 -184690 -228155 -252534 -166185
16235 -166185 -112993 -125569 -142287 -150864 -122851 -67781 23516 -103152 -72212 3897 -25267
16224 -25267 -44640 -138770 -167562 -175912 -111162 -75520 -133644 -107760 -68825 -17634 -25366 -15856
16212 -15856 -33406 -74656 -50456 18193 40771 114630 107112 42477 3450 -114845 -107692 -74280
16200 -74280 -22069 13704 26178 -3656 33269 -31760 -97168 -31394 -20073 -124154 -123835 -51340
16188 -51340 82282 108470 29863 29554 61228 25172 -71880 -91395 -54491 -47656 4808 9084
16176 9084 -42648 -50938 -90016 -119058 -128774 -36924 73006 34092 52042 53594 17378 -23836
16164 -23836 -107547 -102342 -35517 -7617 -14919 32810 21126 -70767 -29275 37423 85249 33513
$$ packed form
16247a03788k3843k229M2728K4611r8907j4055n147n3025M8965m3465k4379Q6349
16235a66185N3192j2576j6718q577K8013N5070R1297j26668L0940P6109k9164
16224b5267j9373r4130k8792q350O4750L5642n8124K5884L8935N1191p732R510
16212a5856j7550m1250K4200O8649K2578P3859p518o4635l9027j18295P153L3412
16200g4280N2211L5773J2474k9834L6925o5029o5408O5774J1321j04081L19P2495
16188e1340J33622K6188p8607l09L1674l6056r7052j9515L6904O835N2464M276
16176I084n1732q290l9078k9042r716R1850J09930l8914J7950J552l6216m1214
16164b3836q3711N205O6825K7900p302M7729j1684r1893M1492O6698M7826n1736
$$ plain form
16152 33513 -23496 26350 -67591 14361 102733 51889 120701 191601 72925 30347 118910
16141 118910 112670 51006 -71843 -131205 -189676 -217427 -148637 -78135 -70182 -43511 22455 63643
16129 63643 -107498 -71735 -58183 -35397 4096 90801 135668 46737 68530 53154 -54820
16118 -54820 -61786 -17167 10098 -20655 -68838 -55762 41003 84249 35912 -8473 37928 28680
16106 28680 37185 80509 -10696 -62945 -5726 -102822 -97474 -108237 -166718 -168247 -146916 -96938
16094 -96938 -103056 -79818 -13879 51665 30705 -48345 -86108 -40016 39849 46590 -112880 -194448
16082 -194448 -155200 -159425 -136464 -102165 -102332 -110564 -162714 -137262 -118551 -173207 -192001 -196338
16070 -196338 -156113 -98495 -156397 -97944 -71716 -123882 -172732 -152452 -119035 -99849 -26624
$$ packed form
16152C3513n7009M9846r3941Q1952Q8372n0844O8812P0900j18676m2578Q8563
16141A18910o240o1664j22849n9362n8471k7751O8790P0502P953K6671O5966M1188
16129F3643j71141L5763J3552K2786L9493Q6705M4867q8931K1793j5376j07974
16118e4820o966M4619K7265l0753m8183J3076R6765M3246m8337m4385M6401r248
16106B8680Q505M3324r1205n2249N7219r7096N348j0763n8481j529K1331M9978
16094i6938o118K3238O5939O5544k0960p9050l7763M6092P9865O741j59470q1568
16082a94448L9248m225K2961L4299j67q232n2150K5452J8711n4656j8794m337
16070a96338M0225N7618n7902N8453K6228n2166m8850K0280L3417J9186P3225
$$ plain form
16059 -26624 59778 137201 100184 60273 30379 6257 -29672 -29615 -47578 -83349 -91056 -43431
16047 -43431 32558 -30595 -25890 -21227 19163 -11014 -82065 -98472 -138708 -72364 -34678 -14486
16035 -14486 -17563 -70457 -102061 -259235 -250673 -197787 -103484 -90987 -91927 -97777 26856 51127
16023 51127 163774 184688 196999 123006 36000 12037 46225 -18090 -88438 -44980 -22796
16012 -22796 55173 81211 102411 101803 61259 56467 31150 52382 33271 -48883 -30691 -42087
16000 -42087 -79183 -133136 -128187 -145784 -165116 -168747 -109154 -68903 -157616 -142936 -129941 -82279
15988 -82279 -209389 -83785 33570 -66323 -132121 -95031 -29685 -34101 34365 35449 34628 42309
15976 42309 52439 18943 78098 119143 86591 -26362 -65231 -77373 -71857 -84484 -83444 -29592
$$ packed form
16059b6624Q6402P7423l7017l9911k9894k4122l5929N7j7963l5771p707M7625
16047d3431P5989o3153M705M663M0390l0177p1051j6407m0236O6344L7686K0192
16035a4486l077n2894l1604j57174Q562N2886R4303J2497r40n850J24633K4271
16023E1127J12647K0914J2311p3993q7006k3963L4188o4315p0348M3458K2184
16012b2796P7969K6038K1200o08m0544m792k5317K1232j9111q2154J8192j1396
16000d2087l7096n3953M949j7597j9332l631N9593M0251q8713J4680J2995M7662
15988h2279j27110J25604J17355r9893o5798L7090O5346m416O8466J084q21P681
15976D2309J0130l3496N9155M1045l2552j12953l8869j2142N516j2627J040N3852
$$ plain form
15964 -29592 110197 152139 206237 135627 131970 130719 83341 55082 -47630 -30812 117937
15953 117937 71566 -50189 -82623 -27717 67899 84236 44331 2583 -30225 47118 31676
15942 31676 17727 -12342 -24746 27187 40862 12530 -68587 7153 91334 5384 -48627 -62323
15930 -62323 -16610 59920 70482 -26900 -32627 -128497 -145697 -166775 -150554 -89728 -8335 6641
15918 6641 18200 43770 102168 117528 18335 515 31680 -31926 -96283 -24137 -75791 -93323
15906 -93323 -49543 -16958 -1718 14473 64310 -37292 -118662 -140307 -131725 -73596 -64219 -42007
15894 -42007 -31149 -65221 -73896 -10862 11226 -52284 -72216 -19689 -36476 -97054 -167621 -135523
15882 -135523 -46163 9479 -26055 -70824 -125054 -83718 -19331 -39752 -58063 -39807 -68715
$$ packed form
15964b9592J39789M1942N4098p0610l657j251m7378k8259j02712J6818J48749
15953A17937m6371j21755l2434N4906R5616J6337l9905m1748l2808P7343j5442
15942C1676j3949l0069j2404N1933J3675k8332q1117P5740Q4181q5950n4011j3696
15930f2323M5713P6530J0562r7382n727r5870j7200k1078J6221O0826Q1393J4976
15918F641J1559K5570N8398J5360r9193j7820L1165o3606o4357P2146n1654j7532
15906i3323M3780L2585J5240J6191M9837j01602q1370k1645Q582N8129R377K2212
15894d2007J0858l4072q675O3034K2088o3510j9932N2527j6787o0578p0567L2098
15882a35523Q9360N5642l5534m4769n4230M1336O4387k0421j8311J8256k8908
$$ plain form
15871 -68715 -113256 -69021 -33758 -56479 -21015 -6028 -72440 -116208 -43748 -26549 10615 80205
15859 80205 63460 -602 3531 -66478 -83758 -4500 28334 -34780 -68842 -54032 -31513 -34231
15847 -34231 -54002 -77393 -54725 -91433 -115893 -82365 18944 151735 163964 99337 -24563
15836 -24563 -84921 -66810 -16667 -31126 24120 -8439 -71948 -1494 100273 -4722 -100471
15825 -100471 -134823 -106532 -45846 -38351 -47165 -75363 -62242 26868 88615 102191 63191 -45438
15813 -45438 -63395 -28810 -126020 -162506 -170207 -131551 -108119 -138458 -106075 -61883 -94874 -75067
15801 -75067 -142073 -171503 -122378 -124274 -95670 -17895 41218 -75343 -119619 -184667 -248477 -224670
15789 -224670 -244790 -202522 -171628 -234161 -241362 -175988 -116169 -164630 -116765 -84659 -70063 -47007
$$ packed form
15871f8715m4541M4235L5263k2721L5464J4987o6412m3768P2460J7199L7164O9590
15859H0205j6745o4062M133p0009j7280P9258L2834o3114l4062J4810K2519k718
15847c4231j9771k3391K2668l6708k4460L3528J01309J32791J2229o4627j23900
15836b4563o0358J8111N0143j4459N5246l2559o3509P0454J01767j04995r5749
15825a00471l4352K8291O0686P495q814k8198J3121Q9110O1747J3576l9000j08629
15813d5438j7957L4585r7210l6486p701L8656K3432l0339L2383M4192l2991J9807
15801g5067o7006k9430M9125j896K8604P7775N9113j16561m4276o5048o3810K3807
15789b24670k0120M2268L0894o2533p201O5374N9819m8461M7865L2106J4596K3056
$$ plain form
15777 -47007 -78097 -99186 -103185 -101950 -45380 82238 141658 156505 943 -69730 -117333 -68801
15765 -68801 -57454 -99941 -73377 -75793 -90484 -226962 -191027 57806 157740 121595 79843
15754 79843 153231 171812 136780 55514 24048 -13654 29441 125511 97576 25998 29194 -80125
15742 -80125 -102530 -134972 -117263 -1064 44066 42096 -30735 -47915 -25476 -3437 55490 40600
15730 40600 -5409 -22284 -108796 -106967 -78859 -90410 -168663 -166601 -146208 -184452 -145208 21191
15718 21191 75804 91245 126105 121986 83014 137402 179382 202385 153368 41766 126796 53472
15706 53472 -25920 -36213 -9543 -88282 -97131 -93777 -160174 -194309 -120826 -127676 -137775 -123001
15694 -123001 -95041 -70225 -14258 -17897 45335 38578 58795 3102 -36638 -3241 35354 -1001
$$ packed form
15777d7007l1090k1089l999J235N6570J27618N9420J4847j55562p0673m7603M8532
15765f8801J1347m2487K6564k416j4691j36478L5935K48833R9934l6145m1752
15754G9843P3388J8581l5032q1266l1466l7702M3095R6070k7935p1578L196j09319
15742h0125k2405l2442J7709J16199M5130j970p2831j7180K2439K2039N8927j4890
15730D0600m6009j6875q6512J829K8108j1551p8253K062K0393l8244L9244J66399
15718B1191N4613J5441L4860m119l8972N4388M1980K3003m9017j11602Q5030p3324
15706E3472p9392j0293K6670p8739q849L354o6397l4135P3483o850j0099J4774
15694a23001K7960K4816N5967l639O3232o757K0217n5693l9740L3397L8595l6355
$$ plain form
15682 -1001 3684 102696 37441 59254 46401 19110 -22060 -147023 -156045 -185328 -186793 -107725
15670 -107725 -79329 -91164 -104312 -65180 25776 120989 109153 85687 81345 88320 -9358 -20910
15658 -20910 -68162 -93039 1904 -8424 26036 48525 23311 78889 157288 93864 162555 155517
15646 155517 104698 -29337 -66873 -27281 -9609 56727 38014 -50810 -40056 -29466 75585
15635 75585 58848 -22466 -46096 54505 77655 23005 46901 39495 106804 178042 195328 155670
15623 155670 82133 21181 -2399 6314 4573 -6833 101430 104493 78494 2636 -41434 -59858
15611 -59858 -79994 -91937 -173480 -137695 9845 53101 103813 71448 29177 19638 -26595 -40518
15599 -40518 35063 126857 30648 -22920 49454 92330 18554 -41576 -67349 -64623 -70136 -70805
$$ packed form
15682a001M685R9012o5255K1813j2853k7291m1170j24963r022k9283j465P9068
15670a07725K8396j1835j3148L9132R0956R5213j1836k3466m342O975r7678j1552
15658b0910m7252k4877R4943j0328L4460K2489k5214N5578P8399o3424O8691p038
15646A55517n0819j34035l7536L9592J7672O6336j8713q8824J0754J0590J05051
15635G5585j6737q1314k3630J00601K3150n4650K3896p406O7309P1238J7286l9658
15623A55670p3537o0952k3580Q713j741j1406J08263L063k5999p5858m4070j8424
15611e9858k0136j1943q1543L5785J47540M3256N0712l2365m2271r539m6233j3923
15599d0518P5581R1794r6209n3568P2374M2876p3776o0130k5773K726n513o69
$$ plain form
15587 -70805 -50370 18220 -46570 -84125 -12446 -33498 -91227 -177635 -251799 -184209 -159684 -72361
15575 -72361 -61348 -103048 -55079 -49652 -92474 -117396 -61549 -155974 -254417 -305950 -196792 -112279
15563 -112279 -99410 -34927 -18176 -96678 -28254 30182 10623 -49311 -43722 -43145 -16368 63456
15551 63456 137830 142207 35455 36712 4617 -86903 -104101 -107992 -124469 -137377 -135690 -149909
15539 -149909 -66126 -63959 -56324 -51184 -85242 4820 43779 26254 -9483 46305 44941 87841
15527 87841 32925 -46728 -67666 -9534 129575 166797 50435 -107914 -140442 -142225 -77897
15516 -77897 -68806 -42989 -48007 -84319 -92602 -99702 -10469 56432 114851 184685 128838 104301
15504 104301 105555 21085 -15352 -62859 -74413 -68010 -123063 -64705 -30970 -55762 -41358 72154
$$ packed form
15587g0805K0435O8590o4790l7555P1679k1052n7729q6408p4164O7590K4525Q7323
15575g2361J1013m1700M7969N427m2822k4922N5847r4425r8443n1533J09158Q4513
15563a12279J2869O4483J6751p8502O8424N8436j9559n9934N589N77K6777P9824
15551F3456P4374M377j06752J257l2095r1520j7198l891j6477j2908J687j4219
15539a49909Q3783K167P635N140l4058R0062L8959j7525l5737N5788j364M2900
15527H7841n4916p9653k0938N8132J39109L7222j16362j58349l2528j783O4328
15516g7897R091K5817n018l6312q283p100Q9233O6901N8419O9834n5847k4537
15504A04301J254q4470l6437m7507j1554O403n5053N8358L3735k4792J4404J13512
$$ plain form
15492 72154 51441 6623 8997 20683 -57870 -157014 -148294 -121099 -76991 -65712 -19580 -14938
15480 -14938 -12691 17252 -26094 -22969 -74393 -108742 41219 50016 81905 111744 83496 8372
15468 8372 -77594 -29312 -77337 -149147 5899 -64497 -73280 -91803 -107495 -105622 -68765 -61952
15456 -61952 -113790 -8090 22625 -36638 -62248 -120575 -108559 -66943 -38500 44663 19865
15445 19865 42379 13818 27583 49822 58210 49752 -80908 -142179 -143587 -166623 -194367 -313113
15433 -313113 -236430 -104497 -26605 -57774 -91781 -50498 30210 21730 36608 28034 79133 32206
15421 32206 -40074 -12068 -82736 -12883 24285 109207 78748 -67439 -115028 -120728 -67623 -25830
15409 -25830 -87932 -89796 -60187 -132521 -64167 57755 57462 76765 69231 -1906 -46345 -55143
$$ packed form
15492G2154k0713m4818K374J1686p8553r9144Q720K7195M4108J1279M6132M642
15480a4938K247K9943m3346L125n1424l4349J49961Q797L1889K9839k8248p5124
15468H372q5966M8282m8025p1810J55046p0396q783j8523j5692J873L6857O813
15456f1952n1838J05700L0715n9263k5610n8327J2016M1616K8443Q3163k4798
15445A9865K2514k8561J3765K2239Q388q458j30660o1271j408k3036k7744j18746
15433c13113P6683J31933P7892l1169l4007M1283Q0708q480J4878q574N1099m6927
15421C2206p2280K8006p0668O9853L7168Q4922l0459j46187m7589n700N3105M1793
15409b5830o2102j864K9609p2334O8354J21922k93J9303p534p1137m4439q798
$$ plain form
15397 -55143 -43575 -13120 -11618 -49724 -73905 -88286 -234565 -195747 -113475 17979 26887 -5797
15385 -5797 -44060 -117314 -87799 -6725 9281 -77489 -192251 -249478 -181269 -187294 -169792 -199347
15373 -199347 -163056 -106254 -105481 -101129 -92669 -225347 -231726 -166572 -54806 -81551 -22508 69071
15361 69071 114304 62756 -143685 -209241 -154582 -139628 -154223 -70784 5872 -22465 -86957
15350 -86957 -108015 -4903 48344 -21437 -19197 30890 45639 35011 -9572 70610 87675 76701
15338 76701 46932 16389 -65752 -40864 -8342 46026 -42368 -84153 -109840 -100658 -118236 -108716
15326 -108716 -26788 -3237 17321 -110223 -169971 -200743 -193632 -46799 34781 64281 65172 4466
15314 4466 -19964 -40926 -75471 -61276 -103700 -137422 -103973 -17800 78038 59133 133900 185872
$$ packed form
15397e5143J1568L0455J502l8106k4181j4381j46279L8818Q2272J31454Q908l2684
15385e797l8263p3254K9515Q1074J6006q6770j14762n7227O8209o025J7502k9555
15373a99347L6291N6802P73M352Q460j32678o379O5154J11766k6745N9043R1579
15361F9071M5233n1548k06441o5556N4659J4954j4595Q3439P6656k8337o4492
15350h6957k1058J03112N3247o9781K240N0087J4749j0628m4583Q0182J7065j0974
15338G6701k9769l0543q2141K4888L2522N4368q8394m1785k5687R182j7578R520
15326a08716Q1928K3551K0558j27544n9748l0772P111J46833Q1580K9500Q91o0706
15314D466k4430k0962l4545J4195m2424l3722L3449Q6173R5838j8905P4767N1972
$$ plain form
15302 185872 107879 -19850 -16062 72023 73561 -21036 -45507 -38309 -27342 -105161 -156554 -82590
15290 -82590 23865 14231 -61584 -84011 -36430 -5118 -35579 34058 3798 -58279 -58775 -25877
15278 -25877 81283 150965 65344 1300 -28773 -29846 -74140 -83575 -86855 10309 48076 -25483
15266 -25483 65894 38488 -7558 -51002 -165273 -199066 -112317 51742 135511 170888 134577
15255 134577 48088 12043 -52213 -116372 -50970 10629 -19342 -74769 -116348 -149533 -162715
15244 -162715 -102443 -82446 -123842 -83355 -115 83084 62857 43120 23891 50635 -20016
15233 -20016 -64312 -78179 -20594 46267 32234 -8926 9256 2437 -89943 -159400 -139156 -25946
15221 -25946 -53404 -30479 -43554 -109126 -122854 -159498 -202322 -246211 -178289 -122644 -77287 -27320
$$ packed form
15302A85872p7993j27729L788Q8085J538r4597k4471P198J0967p7819n1393P3964
15290h2590J06455r634p5815k2427M7581L1312l0461O9637l0260o2077m96L2898
15278b5877J07160O9682q5621o4044l0073j073m4294r435l280R7164L7767p3559
15266b5483R1377k7406m6046m3444j14271l3793Q6749J64059Q3769L5377l6311
15255A34577q6489l6045o4256o4159O5402O1599k9971n5427m1579l3185j3182
15244a62715O0272J9997m1396M0487Q3240Q3199k0227j9737j9229K6744p0651
15233b0016m4296j3867N7585O6861j4033m1160J8182o819r2380o9457K0244J13210
15221b5946k7458K2925j3075o5572j3728l6644m2824m3889O7922N5645M5357M9967
$$ plain form
15209 -27320 -109413 -145601 -105030 -80314 -87514 6957 82028 -651 -111908 -181012 -125352 -81534
15197 -81534 -70848 -1399 54552 82158 152950 212037 258662 231277 4035 -139332 -114502
15186 -114502 -78426 10362 9653 10125 -53255 -48210 -31288 -91150 -104066 -24796 -6870 -56722
15174 -56722 -75471 -119869 -96759 -132276 -231764 -241659 -174796 -168480 -146025 -30522 86546 128530
15162 128530 166802 209758 212403 175821 155269 134162 112219 111966 33580 -28560 15748 -49705
15150 -49705 -85276 -26858 -22469 -55294 1594 146361 196706 80239 -61704 -48040 74666
15139 74666 183116 157277 84045 8577 737 -74431 -75492 27269 73084 -9022 64033 140817
15127 140817 100024 42532 -68822 -57176 117373 194532 193432 121509 84732 67271 -8690
$$ packed form
15209b7320q2093l6188M0571K4716p200R4471P5071q2679j11257o9104N5660M3818
15197h1534J0686O9449N5951K7606P0792N9087M6625k7385k27242j43367K4830
15186a14502L6076Q8788p09M72o3380N045J6922n9862j2916P9270J7926m9852
15174e6722j8749m4398K3110l5517r9488r895O6863O316K2455J15503J17068M1984
15162A28530L8272M2956K645l6582k0552k1107k1943k53p8386o2140M4308o5453
15150d9705l5571N8418M389l2825N6888J44767N0345j16467j41943J3664J22706
15139G4666J08450k5839p3232p5468p840p5168j061J02761M5815q2106P3055P6784
15127A40817m0793n7492j11354J1646J74549P7159j100p1923l6777j7461p5961
$$ plain form
15116 -8690 -158461 -203451 -99688 17280 111015 142240 115151 122196 113371 56316 -59600
15105 -59600 -99422 3770 84597 36109 7233 17915 14643 6215 135 26417 73697 153764
15093 153764 63747 44313 64988 -13472 -8507 -28165 -67403 -70701 71 19612 -12798 -50562
15081 -50562 -77696 -71347 41725 73504 79722 91231 17128 -54423 -77197 -153072 -103213 -53714
15069 -53714 -78438 -135470 -95281 -39234 -38057 47670 120139 75775 -79028 -137567 -150097 -100738
15057 -100738 57537 142481 237765 205751 16896 -53592 99772 168290 197218 162680 65756
15046 65756 -8105 -74155 4622 -19246 -88375 -114063 -65283 -100750 -59993 -70153 -34399 -17546
15034 -17546 -63224 -75685 -62345 -36174 -49133 -38220 5642 -30059 -76488 -49027 -51981 -20223
$$ packed form
15116h690j49771m4990J03763J16968R3735L1225k7089P045q825n7055j15916
15105e9600l9822J03192Q0827m8488k8876J0682l272q428o080K6282M7280Q0067
15093A53764r0017j9434K0675p8460M965j9658l9238l298P0772J9541l2410l7764
15081e0562k7134O349J13072L1779O218J1509p4103p1551k2774p5875M9859M9499
15069e3714k4724n7032M0189N6047J177Q5727P2469m4364j54803n8539j2530M9359
15057a00738J58275Q4944R5284l2014j88855p0488J53364O8518K8928l4538r6924
15046F5756p3861o6050P8777k3868o9129k5688M8780l5467M0757j0160L5754J6853
15034a7546m5678j2461J3340K6171j2959J0913M3862l5701m6429K7461k954L1758
$$ plain form
15022 -20223 10743 35292 32383 18590 -45396 -83098 -23327 53105 85107 -6695 -32981 -59348
15010 -59348 -100995 -115801 -90785 -70556 -42698 -76219 -49678 52671 56835 3981 31900 3644
14998 3644 5601 -14427 29874 -48036 -207235 -262856 -161099 32441 63271 62438 19759 15685
14986 15685 16984 -57266 18027 33449 -47518 -52085 -89276 -100452 -88888 -24727 32159 58850
14974 58850 68706 95534 139427 81345 43488 98012 60627 46489 22588 -41664 -107468 -79336
14962 -79336 -47758 -12594 61264 19372 61055 136591 99549 43655 -25364 -50136 -94845 -46993
14950 -46993 -78801 6735 61811 12891 16210 10105 47174 133737 125741 60134 -21349 -7793
14938 -7793 -140237 -164804 -148866 -84110 -54947 -25212 -48888 -78676 -170715 -176812 -137483 -133042
$$ packed form
15022b0223L0966K4549k909j3793o3986l7702N9771P6432L2002r1802k6286k6367
15010e9348m1647j4806K5016K0229K7858l3521K6541J02349M164n2854K7919k8256
14998C644J957k0028M4301p7910j59199n5621J01757J93540L0830q33m2679m074
14986A5685J299p4250P5293J5422q0967m567l7191j1176J1564O4161N6886K6691
14974E8850R856K6828M3893n8082l7857N4524l7385j4138k3901o4252o5804K8132
14962g9336L1578L5164P3858m1892M1683P5536l7042n5894o9019k4772m4709M7852
14950d6993l1808Q5536N5076m8920L319o105L7069Q6563p996o5607q1483J3556
14938g793j32444k4567J5938O4756K9163K9735k3676k9788r2039o097L9329M441
$$ plain form
14926 -133042 -202999 -163096 13734 63042 -11854 -61177 -43427 -18188 -59584 -62437 -52521 -91793
14914 -91793 -71374 -46004 -4467 -34672 -60461 -48693 -106474 -86593 -175935 -100070 -76788 -81238
14902 -81238 -49446 -26927 -11133 -8394 870 -29321 55228 49596 33523 18657 -10030 55403
14890 55403 81725 86351 9500 -77899 -40497 -10992 -112012 -118820 -77764 -181145 -97614 -41724
14878 -41724 -87350 -71045 -30257 -20433 -27748 -10442 36460 -17704 61859 132877 61132 -5251
14866 -5251 -33801 -36817 -97405 -146162 -177226 -261013 -237732 -91842 24014 23091 -45398 -181715
14854 -181715 -253366 -245202 -171812 -203549 -262004 -189868 -33584 26150 72309 46939 36661
14843 36661 23920 4603 -61960 -89260 -66879 -122812 -121151 -47586 31704 70262 26949 -110320
$$ packed form
14926a33042o9957L9903J76830M9308p4896m9323J7750K5239m1396k853R916l9272
14914i1793K0419K5370M1537l0205k5789J1768n7781J9881q9342P5865K3282m450
14902h1238L1792K2519J5794K739R264l0191Q4549n632j6073j4866k8687O5433
14890E5403K6322M626p6851q7399L7402K9505j01020o808M1056j03381Q3531N5890
14878d1724m5626J6305M0788R824p315J7306M6902n4164P9563P1018p1745o6383
14866e251k8550l016o0588m8757l1064q3787K3281J45890J15856r23o8489j36317
14854a81715p1651Q164P3390l1737n8455P2136J56284N9734M6159k5370j0278
14843C6661j2741j9317o6563k7300K2381n5933J661P3565P9290L8558m3313j37269
$$ plain form
14831 -110320 -205309 -155144 -65199 35626 63247 52103 34798 25062 14187 -67080 -57061
14820 -57061 -49668 9987 -47975 -38951 -8395 22297 -108329 -94224 111360 169405 65891
14809 65891 -15677 948 -55870 -63085 -17182 6697 19918 -39564 -223574 -225540 -213397 -251919
14797 -251919 -223914 -185061 -138161 -43068 -2057 76033 74292 67885 9453 -16890 63525 69908
14785 69908 3202 -71248 -91013 -63091 -95925 -77882 -101279 -140088 -130818 -150906 -114520 -67945
14773 -67945 -34449 -45421 -29650 36549 38622 13436 -15451 -82716 -36027 -24447 -17940 51315
14761 51315 -22961 -127119 -126383 -191433 -110900 -9426 16662 -66208 -55510 -21401 -22618 -17195
14749 -17195 46531 28005 79072 -26550 -74066 -109265 -97116 -20161 -40315 -15554 -11051 -14104
$$ packed form
14831a10320r4989N0165Q9945J00825K7621j1144j7305r736j0875q1267J0019
14820e7061P393N9655n7962R024L0556L0692j30626J4105K05584N8045j03514
14809F5891q1568J6625n6818p215M5903K3879J3221n9482j84010j966J2143l8522
14797b51919K8005L8853M6900R5093M1011P8090j741o407n8432k6343Q0415O383
14785F9908o6706p4450j9765K7922l2834J8043k3397l8809R270k0088L6386M6575
14773f7945L3496j0972J5771O6199K073k5186k8887o7265M6689J1580O507O9255
14761E1315p4276j04158P36o5050Q0533J01474K6088q2870J0698L4109j217N423
14749a7195O3726j8526N1067j05622m7516l5199J2149P6955k0154K4761M503l053
$$ plain form
14737 -14104 -140392 -198950 -143842 -152933 -99371 -8021 -16253 24489 -43487 -32854 19679 26979
14725 26979 -10859 62907 11333 -24463 22429 64031 36284 -21380 -128301 -108266 -41285
14714 -41285 -114200 -124541 -72366 -108851 -72491 -29788 16593 67915 57279 7925 28678 -72565
14702 -72565 -90873 6706 50797 54718 80832 20479 -92505 -120045 -64697 -27034 427 63144
14690 63144 110064 -8280 -82668 -63536 -24045 -35930 -8676 -94140 -175344 -80669 -1770
14679 -1770 -92632 -138942 -81031 -51963 -43024 -47847 -63965 -61190 -26042 28075 9897 13675 -4336
14666 -4336 93902 71137 -10109 -75551 -126450 -34367 39341 -59284 -132011 -129191 -103958 -25178
14654 -25178 -98848 -88247 -20673 -4085 30471 78769 115735 52618 2901 -7271 -33386 -11239
$$ packed form
14737a4104j26288n8558N5108r091N3562R1350q232M0742o7976J0633N2533P300
14725B6979l7838P3766n1574l5796M6892M1602k7747n7664j06921K0035O6981
14714d1285p2915j0341N2175l6485L6360M2703M6381N1322j0636m9354K0753j01243
14702g2565j8308R7579M4091L921K6114o0353j12984k7540N5348L7663K7461O2717
14690F3144M6920j18344p4388J9132L9491j1885K7254q5464q1204R4675P8899
14679a770r0862m6310N7911K9068Q939m823j6118K775L5148N4117j8178L778j8011
14666d336R8238k2765q1246o5442n0899R2083P3708r8625p2727K820K5233P8780
14654b5178p3670J0601O7574J6588L4556M8298L6966o3117m9717j0172k6115K2147
$$ plain form
14642 -11239 -18892 -86456 -28180 116515 4867 29400 88646 81799 98535 90830 90722 90467 153584
14629 153584 173803 77847 -4746 -64713 -55783 10522 41729 -9625 -77946 -159534 -170801 -124984
14617 -124984 -110937 -20899 81602 138446 140010 141319 108296 -32743 -73242 -50703 -21154
14606 -21154 -17594 38095 -38951 -143798 -58665 32497 -6992 -7697 15832 -12373 1302 39208
14594 39208 166606 162159 -3657 -20785 2959 64465 69487 71464 63021 17668 4091 46946
14582 46946 66042 83488 866 10223 16265 -326 -6552 51616 -13517 -57573 10125 62597
14570 62597 46540 -39524 -33906 28600 38359 11166 12838 31531 25946 73819 77336 111923 32530
14557 32530 10275 -1953 -14562 46742 -9934 -16064 66645 134038 181417 95064 -23582 -30051
$$ packed form
14642a1239p653o7564N8276J44695j11648K4533N9246o847J6736p705j08k55O3117
14629A53584K0219r5956q2593n9967Q930O6305L1207n1354o8321q1588j1267M5817
14617a24984J4047R0038J02501N6844J564J309l3023j41039m0499K2539K9549
14606b1154L560N5689p7046j04847Q5133R1162l9489p05K3529k8205J3675L7906
14594C9208J27398m447j65816j7128K3744O1506N022J977q443m5353j3577M2855
14582D6946J9096J7446q2622R357O042j6591o226N8168o5133m4056O7698N2472
14570F2597j6057q6064N618O2506R759k7193J672J8693n585M7873L517L4587p9393
14557C2530k2255j2228j2609O1304n6676o130Q2709O7393M7379q6353j18646o469
$$ plain form
14545 -30051 -57565 -77711 -69610 -45242 -91132 761 43560 28161 -4978 48889 -44343 -67242
14533 -67242 -59230 -56098 -65400 -43724 -79381 -103592 -64016 41393 94165 -26284 -121249 -71213
14521 -71213 6495 78507 71986 8363 8330 -10364 -12916 -57365 24059 118306 -31256 -151696
14509 -151696 -180615 -200705 -183553 -16167 76239 77484 93781 79061 -55513 -33284 -33093 -26376
14497 -26376 -17308 60958 29983 -101902 -149314 -105187 -137908 -152991 -160327 -136020 -144791 -140059
14485 -140059 -105176 7820 84491 112668 19855 -62313 6729 27764 -46205 50883 40145
14474 40145 -4736 16038 44118 -12955 45986 89458 201804 165102 109662 20920 50470
14463 50470 46005 -13301 -60525 -158756 -150333 -174156 -200181 -189309 -212556 -154664 -143513 -39176
$$ packed form
14545c0051k7514k0146Q101K4368m5890R1893M2799j5399l3139N3867r3232k2899
14533f7242Q012L132r302K1676l5657k4211L9576J05409N2772j20449r4965N0036
14521g1213P7708P2012o521o3623l3j8694k552m4449Q1424R4247j49562j20440
14509a51696k8919k0090J7152J67386R2406J245J6297j4720j34574K2229J91O717
14497b6376R068P8266l0975j31885m7412M4127l2721j5083p336K4307q771M732
14485a40059L4883J12996P6671K8177r2813q2168O9042K1035p3969R7088j0738
14474D0145m4881K0774K8080n7073N8941M3472J12346l6702n5440q8742K9550
14463E0470m465n9306m7224r8231Q423k3823k6025J0872k3247N7892J1151J04337
$$ plain form
14451 -39176 -5580 50637 124165 115030 31488 15401 99175 74243 49083 103593 153018 177802
14439 177802 160258 190334 85917 48713 16939 -78285 -124009 -111823 -89365 -151525 -113428
14428 -113428 -62926 14592 54894 84920 95588 146928 212558 139568 42883 7471 -65348
14417 -65348 -54411 37491 82180 71963 4985 -136049 -142260 -136310 -85189 -138482 -108406 -135725
14405 -135725 -42918 12578 68296 97006 12966 -109361 -66329 -61163 -104219 -135928 -116665
14394 -116665 -25321 -103940 -53399 2798 8761 109594 146718 90215 94735 68162 2606 -37847
14382 -37847 -117261 -58889 -67851 -66828 86410 118243 87039 26876 -34269 -95408 -64278 -20878
14370 -20878 29969 81374 -42985 -125758 -109439 -51044 -8800 -38614 -16939 -11396 1220 -29912
$$ packed form
14451c9176L3596N6217P3528r135q3542j6087Q3774k4932k5160N4510M9425K4784
14439A77802j7544L0076j04417l7204l1774r5224m5724J2186K2458o2160L8097
14428a13428N0502P7518M0302L0026J0668N1340O5630p2990r6685l5412p2819
14417f5348J0937R1902M4689j0217o6978j41034o211N950N1121n3293L0076k7319
14405a35725R2807N5496N5718K8710q4040j22327M3032N166m3056l1709J9263
14394a16665R1344p8619N0541N6197N963J00833L7124n6503M520k6573o5556m0453
14382c7847p9414N8372q962J023J53238L1833l1204o0163o1145o1139L1130M3400
14370b0878N0847N1405j24359q2773J6319N8395M2244k9814K1675N543J2616l1132
$$ plain form
14358 -29912 -64398 -36753 -16223 -76210 -178946 -217926 -229304 -265252 -209486 -86865 -66204
14347 -66204 -25734 -6725 101975 140796 104038 -7095 -66826 -8167 -150136 -206296 -223158
14336 -223158 -194487 -222726 -146785 -67986 -66734 -56079 66305 18271 -119012 -88978 -105427
14325 -105427 -178511 -247421 -208216 -210971 -232881 -233468 -205839 -157668 -220233 -219166 -168184 -76711
14313 -76711 4018 -13322 18488 59244 76779 30466 -74041 -38326 -51109 -139914 -151086
14302 -151086 -60797 -59823 -101735 -143169 -135695 -117109 -58030 -23364 -8282 -55461 37088 37732
14290 37732 -88487 -146696 -51707 39036 148152 150858 113865 77915 -54183 -197610 -202029
14279 -202029 -155612 -132798 -42849 -21097 -165342 -168774 -74477 -43006 47886 23838 -75259
$$ packed form
14358b9912l4486K7645K0530n9987j02736l8980j1378l5948N5766J22621K0661
14347f6204M0470J9009J08700L8821l6758j11133n9731N8659j41969n6160j6862
14336b23158K8671k8239P5941P8799J252J0655J22384m8034j37283L0034j6449
14325a05427p3084o8910L9205k755k1910n87K7629M8171o2565J067N0982R1473
14313g6711Q0729j7340L1810M0756J7535m6313j04507L5715j2783q8805j1172
14302a51086R0289R74m1912m1434P474J8586N9079L4666J5082m7179R2549O44
14290C7732j26219n8209R4989R0743J09116K706l6993l5950j32098j43427m419
14279b02029M6417K2814Q9949K1752j44245l432R4297L1471R0892k4048r9097
$$ plain form
14268 -75259 -21890 -13867 21179 -4272 29415 43494 73731 56479 -15054 -8836 -87250 -133809
14256 -133809 -107904 -114883 -93398 -7517 44191 70601 -14972 -78107 -40826 -100294 -43599 -48780
14244 -48780 -46547 -66586 24128 128153 72756 55864 63093 70085 -20522 -85214 30957 31655
14232 31655 49048 49992 79094 132898 104031 7693 -75184 -77637 -169991 -134276 -56204 -2222
14220 -2222 -27940 -5977 -55861 -109700 -158196 -164166 -144545 -167858 -157142 -51787 -125080 -86983
14208 -86983 -31056 76656 91045 76034 8543 -10198 -50593 -49515 19925 85763 127989 219059
14196 219059 148082 40341 -43117 -118891 -53740 17941 -4786 -64775 -73465 -113593 -56401
14185 -56401 -17880 -95799 -50027 29328 52419 36293 1416 69864 108149 113495 48226 60864
$$ packed form
14268g5259N3369Q023L5046k5451L3687J4079L0237j7252p1533O218p8414m6559
14256a33809K5905o979K1485Q5881N1708K6410q5573o3135L7281n9468N6695n181
14244d8780K233k0039R0714J04025n5397j6892P229O992r0607o4692J16171O98
14232C1655J7393R44K9102N3804k8867r6338q2877k453r2354L5715P8072N3982
14220b222k5718K1963m9884n3839m8496n970J9621k3313J0716J05355p3293L8097
14208h6983N5927J07712J4389j5011o7491j8741m0395J078O9440O5838M2226R1070
14196B19059p0977j07741q3458p5774O5151P1681k2727n9989q690m0128N7192
14185e6401L8521p7919M5772P9355K3091j6126l4877O8448L8285N346o5269J2638
$$ plain form
14173 60864 105700 96918 10367 5573 -55525 -77881 -85312 35150 65424 122922 157119 28700
14161 28700 70168 61770 -66132 -44356 -31154 -20164 75314 177460 126022 41164 20158
14150 20158 22585 518 -26962 -43285 -15052 40646 21342 -59488 -140450 -142374 -146901 -84476
14138 -84476 -43784 12992 76352 112027 95566 35604 -49675 -36736 5580 36006 20885 -14673
14126 -14673 -3285 -91339 -78945 -10907 19341 -19852 -64642 81535 68641 89167 -55169
14115 -55169 -120311 -81245 -39902 22256 -28567 13614 112007 71123 13380 26791 -81448
14104 -81448 -152814 -112247 -118783 -38734 58266 86447 85564 69809 60809 19066 -50553 57858
14092 57858 146171 64572 -42997 -88595 -37676 -80841 -71180 -18948 4613 40350 145391
$$ packed form
14173F0864M4836q782q6551m794o1098k2356p431J20462L0274N7498L4197j28419
14161B8700M1468q398j27902K1776J3202J0990R5478J02146n1438q4858k1006
14150B0158K427k2067k7480j6323K8233N5698j9304q0830q0962j924m527O2425
14138h4476M0692N6776O3360L5675j6461n9962q5279J2939M2316L0426j5121l5558
14126a4673J1388q8054J2394O8038L0248l9193m4790J46177j2894K0526j44336
14115e5169o5142L9066M1343O2158n0823M2181R8393m0884n7743J3411j08239
14104h1448p1366M0567o536Q0049R7000K8181q83j5755r000m1743o9619J08411
14092E7858Q8313q1599j07569m5598N0919m3165R661N2232K3561L5737J05041
$$ plain form
14081 145391 123293 62911 54423 17528 -80846 -81651 -65919 43944 65748 106671 135247 118940
14069 118940 112705 -26127 -68482 -35310 -12929 10684 66419 36417 -58437 -7421 78579
14058 78579 69812 124796 67621 27479 8487 116038 85003 61404 -16916 -76164 -29239 50182
14046 50182 125990 122252 64889 21961 38678 30774 -20852 -15978 -10457 79 56444 131709
14034 131709 78229 21800 79403 39802 -50036 -145484 -226869 -146330 -117587 -20633 96282
14023 96282 60667 8152 -22366 -64407 -66766 -138242 -91480 -15246 -17447 -80261 -127926 -42624
14011 -42624 -32269 43221 83994 85016 56647 77377 -29429 -16132 -80214 -122801 -37125 45168
13999 45168 -12608 -37196 11606 -3727 24762 23910 -16305 -88926 -147535 -126676 -132293 -39305
$$ packed form
14081A45391k2098o0382q488l6895r8374q05J5732J09863K1804M0923K8576j6307
14069A18940o235j38832m2355L3172K2381K3613N5735l0002r4854N1016Q6000
14058G8579q767N4984n7175m0142j8992J07551l1035k3599p8320n9248M6925P9421
14046E0182P5808l738n7363m2928J6717p904n1626M874N521J0536N6365P5265
14034A31709n3480n6429N7603l9601q9838r5448q1385Q0539K8743R6954J16915
14023I6282l5615n2515l0518m2041k359p1476M6762P6234k201o2814m7665Q5302
14011d2624J0355P5490M0773J022k8369K0730j06806J3297o4082m2587Q5676Q2293
13999D5168n7776k4588M8802j5333K8489q52m0215p2621n8609K0859n617R2988
$$ plain form
13987 -39305 -76367 -99851 -141849 -136171 -101468 -30689 -50503 -86517 -69691 -21201 -25069 -18913
13975 -18913 82836 22477 106760 202052 109575 -6170 20802 65557 -7239 -87728 -155815
13964 -155815 -250900 -226662 -171419 -129931 -143337 -65941 37542 37715 -47606 -35806 -88265 -135257
13952 -135257 -72842 -95713 -104916 -83484 -123986 -59200 -51633 -145729 -211224 -121413 -71670 -83370
13940 -83370 -92287 -123384 -84558 -26726 -87088 -161352 -117032 -31546 -44257 -125170 -87304 -77776
13928 -77776 -7323 24466 36249 24314 20629 -39958 -39128 -19705 30331 39232 -19331 -74855
13916 -74855 -82545 -149029 -27260 78696 165417 84714 -80738 -109673 -57198 -76385 -102208
13905 -102208 -142167 -91332 5139 54826 5736 87406 153737 73529 -16297 -1706 90028
$$ packed form
13987c9305l7062k3484m1998N678L4703P0779j9814l6014J6826M8490l868O156
13975a8913J01749o0359Q4283R5292r2477j15745K6972M4755p2796q0489o8087
13964a55815r5085K4238N5243M1488j3406P7396J03483J73q5321J1800n2459m6992
13952a35257O2415k2871r203K1432m0502O4786P567r4096o5495Q9811M9743j1700
13940h3370q917l1097L8826N7832o0362p4264M4320Q5486j2711q0913L7866R528
13928g7776P0453L1789J1783j1935l685o0587Q30J9423N0036Q901n8563n5524
13916g4855p690o6484J21769J05956Q6721q0703j65452k8935N2475j9187k5823
13905a02208l9959N0835R6471M9687m9090Q1670O6331q0208q9826J4591R1734
$$ plain form
13894 90028 47774 -5062 -32145 16517 91635 135458 201111 262522 205000 137273 59884 -30297
13882 -30297 65884 76346 41675 23472 64372 75498 26272 33371 -17927 -44765 -70198 -30392
13870 -30392 -6407 -56030 -66632 20855 131155 133922 54737 35194 114750 117420 59506 -29398
13858 -29398 -174526 -120730 21077 94347 115392 116546 139948 110929 8750 -100634 -114090
13847 -114090 -94395 -72915 -6330 -73816 -93224 -77138 -185965 -287128 -177810 -92750 -107432
13836 -107432 -150601 -100942 26821 -31678 -47246 -40306 43582 126240 79762 -2412 -2350 45179
13824 45179 36855 29877 30769 28955 17944 24172 61222 32435 77707 139490 118619 72697 92790
13811 92790 174821 146988 -7583 -2031 -58546 -92503 -36650 63142 -21199 -69374 -15321 17045
$$ packed form
13894I0028m2254n2836k7083M8662P5118M3823O5653O1411n7522o7727p7389r0181
13882c0297R6181J0462l4671j8203M0900J1126m9226P099n1298k6838k5433L9806
13870c0392K3985m9623j0602Q7487J10300K767p9185j9543P9556K670n7914q8904
13858b9398j45128N3796J41807P3270K1045J154K3402k9019j02179j09384j3456
13847a14090J9695K1480O6585o7486j9408J6086j08827j01163J09318Q5060j4682
13836a07432m3169M9659J27763n8499j5568O940Q3888Q2658m6478q2174O2M7529
13824D5179q324o978Q92j814j1011O228L7050k8787M5272O1783k0871m5922K0093
13811I2790Q2031k7833j54571N552n6515l3957N5853R9792q4341m8175N4053L2366
$$ plain form
13799 17045 17227 8352 -97234 -188686 -132283 -21778 10159 20250 621 18510 515 87903
13787 87903 203861 124417 25217 -54723 -123938 -40341 17226 -5988 -53815 -46648 -74253 -93474
13775 -93474 -126266 -66566 -41564 -96669 -154895 -142872 -56811 -43747 77945 113859 50160
13764 50160 59833 256 64913 101976 134809 98053 58322 26731 42401 61306 142315 156696
13752 156696 84888 -7746 -9992 -33536 -51374 -108445 -105995 -73570 8603 -658 -35493 20736
13740 20736 67164 140537 144502 140982 22629 -122647 -127861 -35201 6720 7890 781 -41718
13728 -41718 20736 103509 66970 -100244 -70535 -25504 -96968 -92025 -94758 -108354 -106259 -6985
13716 -6985 -64285 -83137 -109769 -132702 -237467 -223278 -172765 -164161 -170018 -146913 -156662 -86561
$$ packed form
13799A7045J82q875j05586r1452N6403J10505L1937J0091j9629J7889j7995Q7388
13787H7903J15958p9444r9200p9940o9215Q3597N7567k3214m7827P167k7605j9221
13775i3474l2792N9700K5002n5105n8226J2023Q6061J3064J21692L5914o3699
13764E0160R673n9577O4657L7063L2833l6756l9731l1591J5670J8905Q1009J4381
13752A56696p1808r2634k246k3544j7838n7071K450L2425Q2173r261l4835N6229
13740B0736M6428P3373L965l520j18353j45276n214R2660M1921J170p109m2499
13728d1718O2454Q2773l6539j67214K9709M5031p1464M943k733j3596K095R9274
13716f985n7300j8852k6632k2933j04765J4189N0513Q604n857K3105r749P0101
$$ plain form
13704 -86561 -88184 -183671 -113792 -78553 -107814 -110287 -12422 -4223 -69208 -33669 -47563 -120380
13692 -120380 -161073 -255146 -240796 -211709 -155395 -107306 -86075 -220413 -250937 -209416 -154459
13681 -154459 -45361 -2931 59628 41761 -79301 -182808 -200861 -236808 -111128 -12436 -19821
13670 -19821 -79167 -31906 36493 57214 -66623 -100329 -86500 2712 18730 9596 -9925 -78286
13658 -78286 26048 111601 75791 121074 118459 73413 18680 -32700 -46335 -145818 -183435 -137308
13646 -137308 -127609 59544 69524 -28973 -141116 -181561 -118661 -112747 -55299 -24771 -88386 -143800
13634 -143800 -103782 -15309 -19588 -115994 -257308 -283585 -162375 -39388 -96776 -49042 21062
13623 21062 -35732 14232 2607 -71853 -164181 -128931 16570 -32422 -66101 8611 37946
$$ packed form
13704h6561j623r5487O9879L5239k9261k473R7865Q199o4985L5539j3894p2817
13692a20380m0693r4073J4350K9087N6314M8089K1231j34338l0524M1521N4957
13681a54459J09098M2430O2559j7867j21062j03507j8053l5947J25680R8692p385
13670a9821n9346M7261O8399K0721j23837l3706J3829Q9212J6018r134j9521o8361
13658g8286J04334Q5553l5810M5283k615m5046n4733n1380j3635r9483l7617M6127
13646a37308R699J87153R980r8497j12143m0445O2900N914N7448L0528o3615n5414
13634a43800M0018Q8473m279r6406j41314k6277J21210J22987n7388M7734P0104
13623B1062n6794M9964j1625p4460r2328L5250J45501m8992l3679P4712K9335
$$ plain form
13612 37946 47504 134671 103260 -53580 -45657 29811 33159 -27513 -51266 -140515 -154508 -138111
13600 -138111 -30424 127 -2589 105614 99223 3478 -51772 -15940 6277 30003 89969
13589 89969 96005 48714 9735 -37604 883 128933 261437 188295 51917 -28228 12040
13578 12040 -33146 -13763 -7391 -39776 -7512 -35658 -28649 43821 64751 127306 111992 -747
13566 -747 -46205 -63261 -123892 -158308 -202748 -180566 -72435 -51787 -50736 -102459 -122085 -97247
$$ packed form
13612C7946R558Q7167l1411j56840P923P5468L348o0672k3753q9249j3993J6397
13600a38111J07687L0551k716J08203o391r5745n5250L5832K2217K3726N9966
13589H9969O036m7291l8979m7339L8487J28050J32504p3142j36378q0145M0268
13578A2040m5186J9383O372l2385L2264k8146P009P2470K0930O2555j5314j12739
13566g47m5458j7056o0631l4416m4440K2182J08131K0648J051n1723j9626K4838
$$ [...]
##END NTUPLES=NMR SPECTRUM
##END=
