##TITLE=Analysis number 319811
Compound Code sb 01995
Project Code adrs
Chemist Name molekula
##JCAMPDX= 6.0         $$ Bruker NMR JCAMP-DX V2.0
##DATA TYPE= NMR SPECTRUM
##DATA CLASS= NTUPLES
##ORIGIN= Bruker BioSpin GmbH
##OWNER= nmr
$$ XWIN-NMR		Version 3.5
$$ Wed May 31 11:17:31 2006 GMT Daylight Time (UT+1h)  MAYBRIDGE\nmr@NMR_250MHZ
##.OBSERVE FREQUENCY= 250.131544655141
##.OBSERVE NUCLEUS= ^1H
##.ACQUISITION MODE= SIMULTANEOUS (DQD)
##.ACQUISITION SCHEME= undefined
##.AVERAGES= 16
##.DIGITISER RES= 18
##SPECTROMETER/DATA SYSTEM= dpx250
##.PULSE SEQUENCE= zg30
##.SOLVENT NAME= CDCl3
##.SHIFT REFERENCE= (INTERNAL, CDCl3, 0, 16.522)
##AUDIT TRAIL= $$ (NUMBER, WHEN, WHO, WHERE, WHAT)
$$ ##TITLE= Audit trail, XWIN-NMR		Version 3.5
$$ ##JCAMPDX= 5.01
$$ ##ORIGIN= Bruker BioSpin GmbH
$$ ##OWNER= nmr
$$ C:\u/data/dgb/nmr/ADRS/5440/pdata/1/auditp.txt
$$ ##AUDIT TRAIL=  $$ (NUMBER, WHEN, WHO, WHERE, WHAT)
(   1,<2006-05-31 11:17:08.57 +100>,<MAYBRIDGE\nmr>,<NMR_250MHZ>,
      <created by zg, POWCHK disabled, PULCHK disabled
       configuration hash MD5:
       E2 DF 36 D8 04 B2 41 60 5A D7 A3 38 5A 4B D0 FE
       data hash MD5: 64K
       62 C1 DB 4B 4C DE 9B AA 99 8F FF F6 E4 22 6A 7D>)
(   2,<2006-05-31 11:17:22.59 +100>,<MAYBRIDGE\nmr>,<NMR_250MHZ>,
      <Start of raw data processing
       ef LB = 0.3 FT_mod = 6 PKNL = 1 SI = 32K 
       data hash MD5: 32K
       67 F8 CA 5F 88 87 2D 99 E1 C1 33 E9 F6 F2 09 AD>)
(   3,<2006-05-31 11:17:24.48 +100>,<MAYBRIDGE\nmr>,<NMR_250MHZ>,
      <apk 
       data hash MD5: 32K
       F9 9B A9 94 66 68 60 64 75 FE C1 38 94 D8 78 1F>)
(   4,<2006-05-31 11:17:25.35 +100>,<MAYBRIDGE\nmr>,<NMR_250MHZ>,
      <abs ABSG = 5 
       data hash MD5: 32K
       6F F4 E8 09 3C 95 E2 41 7B C2 98 C0 65 AC 12 EB>)
$$ ##END=
$$ 
$$ hash MD5
$$ 09 7E 86 3C 97 3D 6F 09 FF 3A 52 8F A1 5E 42 33
##$RELAX= 
##$RELAX= 
##$RELAX= 
##$RELAX= 
##$RELAX= 
##$RELAX= 
##$RELAX= 
$$ Bruker specific parameters
$$ --------------------------
##$DU= <C:\u>
##$EXPNO= 5440
##$NAME= <ADRS>
##$PROCNO= 1
##$TYPE= <nmr>
##$USER= <dgb>
##$AMP= (0..31)
100 100 100 100 100 100 100 100 100 100 100 100 100 100 100 100 100 100 
100 100 100 100 100 100 100 100 100 100 100 100 100 100 
##$AQSEQ= 0
##$AQ_mod= 3
##$AUNM= <au_zg>
##$AUTOPOS= <7 >
##$BF1= 250.13
##$BF2= 250.13
##$BF3= 250.13
##$BF4= 250.13
##$BF5= 500.13
##$BF6= 500.13
##$BF7= 500.13
##$BF8= 500.13
##$BYTORDA= 1
##$CFDGTYP= 0
##$CFRGTYP= 5
##$CHEMSTR= <none>
##$CNST= (0..31)
1 1 145 1 1 1 1 1 1 1 1 1 1 1 1 1 1 1 1 1 1 1 1 1 1 1 1 1 1 1 1 1 
##$CPDPRG= <>
##$CPDPRG1= <>
##$CPDPRG2= <>
##$CPDPRG3= <>
##$CPDPRG4= <mlev>
##$CPDPRG5= <mlev>
##$CPDPRG6= <mlev>
##$CPDPRG7= <mlev>
##$CPDPRG8= <mlev>
##$CPDPRGB= <>
##$CPDPRGT= <>
##$D= (0..31)
0 1 0 0 0 0 0 0 0 0.06 0 0 0 0 0 0 0.0002 0 0 0 0 0 0 0 0 0 0 0 0 0 0 
0 
##$DATE= 1149070627
##$DBL= (0..7)
120 120 120 120 120 120 120 120 
##$DBP= (0..7)
150 150 150 150 150 150 150 150 
##$DBP07= 0
##$DBPNAM0= <>
##$DBPNAM1= <>
##$DBPNAM2= <>
$$ [...]
##$SUBNAM7= <"">
##$SUBNAM8= <"">
##$SUBNAM9= <"">
##$SW= 20.6930455092707
##$SWIBOX= (0..15)
0 0 3 0 0 0 0 0 0 0 0 0 0 0 0 0 
##$SW_h= 5175.983436853
##$TD= 65536
##$TD0= 1
##$TE= 294.16
##$TE2= 300
##$TE3= 300
##$TEG= 300
##$TL= (0..7)
0 120 120 120 120 120 120 120 
##$TP= (0..7)
150 150 150 150 150 150 150 150 
##$TP07= 0
##$TPNAME0= <>
##$TPNAME1= <>
##$TPNAME2= <>
##$TPNAME3= <>
##$TPNAME4= <>
##$TPNAME5= <>
##$TPNAME6= <>
##$TPNAME7= <>
##$TPOAL= (0..7)
0.5 0.5 0.5 0.5 0.5 0.5 0.5 0.5 
##$TPOFFS= (0..7)
0 0 0 0 0 0 0 0 
##$TUNHIN= 0
##$TUNHOUT= 0
##$TUNXOUT= 0
##$USERA1= <user>
##$USERA2= <user>
##$USERA3= <user>
##$USERA4= <user>
##$USERA5= <user>
##$V9= 5
##$VALIST= <valist>
##$VCLIST= <CCCCCCCCCCCCCCC>
##$VD= 0
##$VDLIST= <DDDDDDDDDDDDDDD>
##$VPLIST= <PPPPPPPPPPPPPPP>
##$VTLIST= <TTTTTTTTTTTTTTT>
##$WBST= 1024
##$WBSW= 4
##$XGAIN= (0..3)
0 0 0 0 
##$XL= 0
##$YL= 0
##$YMAX_a= 496574
##$YMIN_a= -398102
##$ZGOPTNS= <>
##$ZL1= 120
##$ZL2= 120
##$ZL3= 120
##$ZL4= 120
##$ABSF1= 16.522
##$ABSF2= -4.171173
##$ABSG= 5
##$ABSL= 3
##$ALPHA= 0
##$AQORDER= 0
##$ASSFAC= 0
##$ASSFACI= 0
##$ASSFACX= 0
##$ASSWID= 0
##$AUNMP= <proc_1d>
##$AZFE= 0.1
##$AZFW= 0.1
##$BCFW= 0
##$BC_mod= 0
##$BYTORDP= 0
##$COROFFS= 0
##$CY= 12.5
##$DATMOD= 1
##$DC= 0
##$DFILT= <>
##$DTYPP= 0
##$F1P= 14.0000005364418
##$F2P= -0.99999901652339
##$FCOR= 0.5
##$FTSIZE= 32768
##$FT_mod= 6
##$GAMMA= 0
##$GB= 0
##$INTBC= 1
##$INTSCL= 1
##$ISEN= 128
##$LB= 0.3
##$LEV0= 0
##$LPBIN= 0
##$MAXI= 10000
##$MC2= 0
##$MEAN= 0
##$ME_mod= 0
##$MI= 0
##$NCOEF= 0
##$NC_proc= -4
##$NLEV= 6
##$NOISF1= 0
##$NOISF2= 0
##$NSP= 0
##$NTH_PI= 0
##$NZP= 0
##$OFFSET= 16.522
##$PC= 1
##$PHC0= 16.34436
##$PHC1= 8.050264
##$PH_mod= 1
##$PKNL= yes
##$PPARMOD= 0
##$PSCAL= 4
##$PSIGN= 0
##$REVERSE= no
##$SF= 250.13
##$SI= 32768
##$SIGF1= 0
##$SIGF2= 0
##$SINO= 400
##$SIOLD= 32768
##$SREGLST= <1H.CDCl3>
##$SSB= 0
##$STSI= 32768
##$STSR= 0
##$SW_p= 5175.98343685301
##$SYMM= 0
##$S_DEV= 0
##$TDeff= 65536
##$TDoff= 0
##$TI= <Analysis number 999999
Compound Code 99
Book Reference 9
Project Code 9>
##$TILT= no
##$TM1= 0
##$TM2= 0
##$TOPLEV= 0
##$USERP1= <user>
##$USERP2= <user>
##$USERP3= <user>
##$USERP4= <user>
##$USERP5= <user>
##$WDW= 1
##$XDIM= 32768
##$YMAX_p= 382873990
##$YMIN_p= -49608
$$ End of Bruker specific parameters
$$ ---------------------------------
##NTUPLES= NMR SPECTRUM
##VAR_NAME=  FREQUENCY,     SPECTRUM/REAL,   SPECTRUM/IMAG
##SYMBOL=    X,             R,               I
##VAR_TYPE=  INDEPENDENT,   DEPENDENT,       DEPENDENT
##VAR_FORM=  AFFN,          ASDF,            ASDF
##VAR_DIM=   32768,         32768,           32768
##UNITS=     HZ,            ARBITRARY UNITS, ARBITRARY UNITS
##FACTOR=    0.157963299565203, 1,           1
##FIRST=     4132.6476996994, 0,             0
##LAST=      -1043.33573715361, 0,           0
##MIN=       -1043.33573715361, -49608,      0
##MAX=       4132.6476996994, 382873990,     0
$$ Real data points
##PAGE= N=1
##DATA TABLE= (X++(R..R)), XYDATA
$$ [...]
18844 -10080 -4425 -2689 -5 -3106 744 -2744 -12776 -20569 -13928 -10227 719 4883 1755 -708
18830 -708 -6612 -10090 -8263 240 2951 -2853 -2569 -8588 -7975 -2714 4357 888 -8385 -8194 -104 -7770
18814 -7770 -9321 -6275 -7456 -10074 -21419 -7688 88 -9411 -14518 -15217 -10425 -8331 165 17382
18800 17382 5774 -1263 -8195 -14338 -15627 -10266 -6361 -2822 -1551 -8553 -4362 -7036 -23938 -22220
18786 -22220 -20628 -21439 -16644 -15651 -21691 -13226 -1919 -2604 -8284 -16089 -15503 3655 12916 5401 9149
18771 9149 8375 17532 17178 14298 13516 8116 23377 40239 45481 45491 48066 50538 47992 22946 6152
18756 6152 5668 4878 13031 16640 6170 3360 5323 8409 2584 -1410 2661 -1366 -7429 -6323 -7798
18741 -7798 -11786 -11815 -13648 -19861 -25371 -19471 -22026 -21097 -14668 -11318 -16282 -15667 -4210 -3905 -576 -4995
18725 -4995 -6457 -10550 -7075 -1908 3761 5177 -1788 -3937 -369 -1191 820 -1880 -4507 -10128 -8543
18710 -8543 -3887 -9545 -2959 4012 6227 5727 -60 -2609 -3867 2399 -191 -5298 -8180 -14438 -10615
18695 -10615 -13246 -12394 -10687 -2416 -8804 -9593 -4431 3230 311 -1138 415 -1894 2722 -1102 -2282
18680 -2282 -3936 4127 6646 10911 7363 10306 8606 7222 -3491 -8988 -11451 371 3673 -4001
18666 -4001 -10274 -3704 -706 -5716 -11242 -19199 -14981 -15586 -13794 -502 1740 -5808 -17758 -17868 -18151
18651 -18151 -14047 1278 6818 341 -1014 -9248 -13084 -13576 -6980 -577 376 1741 9888 13759 11058
18636 11058 12504 23222 19217 1084 -8206 -1402 3501 9740 14100 6693 9155 16985 19219 14718
18622 14718 4419 1176 -10003 -14959 -5236 -4616 -4862 -669 -12756 -19303 -16544 -9719 -948 -6503
18608 -6503 -2543 4924 9635 16166 6535 -11535 -11975 -21116 -24267 -9708 -6640 -2152 -12058 -3990
18594 -3990 8509 7840 5499 7758 6041 -5171 -16529 -27042 -22796 -22166 -20026 -16039 -21254 -20565
18580 -20565 -14603 -4313 -3725 -2003 -778 -8903 -8332 -2125 -4779 943 11144 8458 8031 8990 2435
18565 2435 1694 6624 2488 -5705 -4494 -270 -3045 -3720 -5079 -2792 3249 288 -147 6322 8128
18550 8128 3587 6594 6261 -750 -9520 1647 -1187 -7219 -3420 -3554 4364 3986 5935 8415 10164
18535 10164 19299 17112 11633 -1809 -4135 -278 6122 6363 3406 -3192 -4450 5912 4612 -17361
18521 -17361 -23316 -10616 -1087 -2428 -4536 -1944 470 3588 -5686 -15391 -7840 -6105 -12099 -9563
18507 -9563 -19050 -12738 -2761 5649 6758 16331 25128 22517 10478 -1327 -5427 2244 6286 5153
18493 5153 8436 18367 17604 8514 -3194 -5301 -6024 995 -4258 -3037 -4223 1577 6944 -7382 -9045
18478 -9045 -1505 -10116 -6305 -4796 -3778 -5525 -3766 -16118 -16675 -25342 -24711 -20852 -7953 -7151 -20194
18463 -20194 -11560 -2407 -6712 -7563 -1854 1828 8463 6888 2801 -578 -3718 873 2973 6956 9557
18448 9557 14488 17684 8771 4891 -5527 -8753 -10630 -3159 5740 11739 3129 2057 2834 4821 790
18433 790 -6702 -11218 -17089 -16668 -10300 -6832 357 4110 3507 1790 -4335 -19079 -20461 -11512 -4084
18418 -4084 80 3783 10668 7161 -3601 -15664 -2150 -1902 -14810 -29206 -22701 -3037 8147
18405 8147 630 -8953 -5613 6057 7859 1763 1234 -12109 -12098 -6030 -5682 -12568 -10199 6136 4824
18390 4824 -4172 -10245 -17275 -12619 -8761 -6400 -16805 -9543 -15624 -19557 -14040 -6705 -8754 -9198 -7118
18375 -7118 -10159 -10185 -9532 -9995 -13635 -11597 -11506 -13609 -10452 -10217 3131 5262 -2852 -3873 -6573 -412
18359 -412 -924 937 -3898 -19107 -16728 -8097 -6265 -12123 -1058 3312 -2929 -3506 426 -3404 174
18344 174 -7151 -6242 -7939 -4392 -279 3441 2147 8788 16354 14584 1649 -992 -10948 -20803 -26065
18329 -26065 -29632 -24288 -15435 -8588 3230 2255 2941 8181 -3132 -8073 -6267 1272 8022 5203
18315 5203 -278 -9222 -12862 -2523 6232 4706 13769 1858 -5657 -4646 -14316 -7948 4877 918
18301 918 -8111 -13317 -20587 -20940 -14131 -12276 -13238 -8634 -13724 -14703 -17868 -8664 417 -5180 -12855 -14760
18285 -14760 -5996 4408 9723 6912 5933 -751 -10506 -15060 -10529 2105 5892 8337 2918 -14108
18271 -14108 -22269 -11827 -807 -563 2995 2291 -9070 -16763 -16353 -8266 -9883 -25687 -24064 -18098
18257 -18098 -19529 -16996 -8080 -3704 -2495 -10 -8154 -1524 6558 2385 5824 10308 19754 18086
18243 18086 14341 6637 4140 5266 14143 17260 8954 6358 5527 8846 5698 6348 9231 13944 8921
18228 8921 3078 279 11419 18855 14374 78 1618 3850 4322 4314 1997 1168 -897 -13544 -24061
18213 -24061 -23317 -17668 -4198 4422 3351 7312 15046 12352 1351 3919 6465 9691 7638 5785
18199 5785 5871 5418 4832 2175 6520 18942 24718 13050 800 4027 10134 9691 13102 17632 12775
18184 12775 5970 660 1143 9310 11225 10717 18517 27332 24516 21157 16471 15019 14951 17280 17953 27132
18168 27132 30940 35286 30857 26639 29267 27884 36396 42502 35693 35368 23123 23578 29751 31123 24530
18153 24530 25009 37351 50183 56034 53966 58660 51703 49810 55523 60266 65046 67521 69921 72865
18139 72865 75954 81453 89655 97764 104318 98496 104133 104392 105153 108571 107544 102356 102892 107690 130371
18124 130371 153338 174226 200247 222415 239195 250440 278429 312910 368435 432990 513994
18113 513994 618439 752873 942596 1210728 1628084 2334369 3597218 5641258 7338490
18104 7338490 7559680 7281574 6971864 7041920 7364441 6273439 4284236 2895539 2117685
18095 2117685 1651766 1350745 1144605 990099 863866 759699 688384 644767 604774 576660
18085 576660 544497 510658 475022 439408 412584 387112 366206 356111 342209 330523 319363
18074 319363 297600 286602 271276 262169 255166 247508 245837 238799 224339 220919 208917 197638 197513
18061 197513 199368 207042 207650 201294 189685 179546 166657 159177 164169 164388 162574 156594 152694 153653
18047 153653 153236 158782 164847 164247 159130 147806 150725 147617 141366 134631 135523 135720 128703 122030 121907
18032 121907 115771 111430 109239 96611 85995 81082 73311 75749 73745 71750 67773 67905 59943 52094
18018 52094 48171 39957 29038 22266 27352 32213 34085 37758 32739 35091 37369 32980 27550 26294
18004 26294 33093 36025 30295 34592 37667 33500 29895 30100 31174 24165 20002 16147 12276 15367 23560
17989 23560 23376 21607 19506 8962 10621 11515 3886 6772 6887 3257 -5130 71 1330 -5279 -7594
17974 -7594 -10000 -812 7013 10109 13408 6668 11925 1513 -5129 -560 6884 2933 -4856 -690
17960 -690 2666 8402 4810 12612 17079 9197 3290 -1906 6009 9231 2752 8212 7584 609 385
17945 385 6153 10753 14956 10874 7940 5786 -8921 -6859 -5175 -1620 -535 888 -4738 -6739 -5222
17930 -5222 -6201 -1519 13873 13987 10910 9793 13141 13055 13005 13920 3151 -190 2360 5929 12016 15767
17914 15767 17002 10663 1380 -12557 -4327 11130 11054 -3682 -1697 5346 3266 5772 4929 1207
17900 1207 1369 -4146 -6978 -7853 -13799 -13573 -7924 -6316 1342 2217 -7977 -14436 -17567 -20087 -14184
17885 -14184 -4906 -2559 -827 -3554 -4130 1043 -9761 -8064 -8745 -5590 -7029 -5884 -49 9519 6900
17870 6900 2508 -1388 -6625 -4463 3364 5296 -13929 -18543 -9845 -5829 -8324 -13522 -12910 -11837 -12340
17855 -12340 -14212 -15578 -5621 3525 -1507 -7278 -3868 -40 5710 -4337 -7327 4595 4080 3382
17841 3382 7261 5208 1444 -3968 1070 1554 -433 -650 6178 12355 4024 269 -9777 -6630 -4330
17826 -4330 -7273 -9341 -10413 -5474 -9995 -6540 -9191 -11761 -14390 -18090 -12251 -15502 -14166 -2862
17812 -2862 -5036 -15093 -15665 -5605 -4207 -13536 -8335 -1636 6702 1404 -2384 -11142 -10118 -13284
17798 -13284 -15103 -9850 -7331 -6499 -3975 -11191 -16250 -11560 -13859 -17435 -4060 2803 1575 3694
17784 3694 9418 7927 4727 3431 -3862 -16925 -4014 4188 7323 -1688 -1828 -6294 -6221 -7679 -13691
17769 -13691 -11199 -10426 -4139 -8599 -14685 -22287 -31379 -29228 -20853 -12778 -14630 -21858 -19760 -18985 -9370
17754 -9370 -3500 -1567 5337 6056 2003 3818 -7087 -3087 4437 -1139 -10137 -11202 -15614 -11889 -8361
17739 -8361 -4373 -5584 -9463 -9796 -215 -4391 -12108 -17271 -23998 -16371 -14904 -25875 -20292 -1018
17725 -1018 1273 3542 4020 -10653 -11604 -8958 -5035 -7091 -2236 -4367 2484 5747 -7853 -17176 -10038
17710 -10038 356 1054 -5831 -4240 -5403 -8397 4512 8744 5152 3367 -1385 -4316 -10371 -19373
17696 -19373 -15817 -13030 -13600 -9794 -4706 -2768 -10660 -8747 1097 5300 13360 18503 16345 3955
17682 3955 -10659 -9764 -10535 -14931 -12704 -8894 -3490 -722 -4007 -7847 -6784 -6469 -11348 -20797 -27729
17667 -27729 -19576 -13095 -14063 -5736 -1303 -6972 2159 -2862 -4025 3942 16320 -1574 -3306 936
17653 936 -5638 -5057 3898 4786 7342 4045 -3964 -11998 -19634 -12844 -6375 -3386 2684 -4432 -13169
17638 -13169 -8736 -15833 -28338 -26124 -25877 -15131 -3824 -1993 -10520 -12555 -16860 -14355 -10161 -11222
17624 -11222 -15209 -11861 -4771 1359 -2155 -11751 -7728 -11574 -15344 -15102 -10136 -16771 -13874 -17442 -20336
17609 -20336 -19149 -7013 1813 819 -8791 -13486 -9203 -5008 -7720 -3928 6735 15723 18336 13547
17595 13547 2054 -10282 -13409 -11001 -8753 -12484 -10853 -22687 -21128 -13192 -10692 -8560 -12154 -15712
17581 -15712 -14876 -15338 -7150 -9322 -17979 -5582 -7188 -18318 -19308 -17628 -17640 -11821 -15506 -12328 -2457
17566 -2457 1331 222 3002 -835 -10498 -11793 109 1239 -497 -1199 -1556 -3748 -9425 -5186 -603
17551 -603 -3955 -12060 -13007 -4066 -2546 -12214 -23573 -20287 -14065 -18666 -16596 -4573 6802 12057
17537 12057 5895 3792 7158 -2839 -14538 -21614 -19358 -18988 -17959 -17649 -23472 -20107 -21676 -14014 -10260
17522 -10260 -5789 -9114 -11812 -11258 -3680 406 -1529 -4617 -9843 -19701 -19604 -5520 1565 -3505 -9934
17507 -9934 -13453 -14352 -12535 -17737 -15270 -15062 -11752 -16732 -23595 -22188 -16726 -9944 -8487 -4212 -8047
17492 -8047 -21019 -23731 -12644 -12103 -8313 -7720 -10832 -11988 -13678 -13669 -18375 -21624 -21931 -13177 -11648 -17077
17476 -17077 -11648 -11044 -12079 -10712 -7402 -3412 -3796 -3791 -78 -6598 -12065 -8442 -8579 -14449 -23750 -20185
17460 -20185 -5241 -3253 2016 922 -1862 -1344 -12751 -15882 -14106 -10422 -2983 -2500 -1770 11053
17446 11053 13356 5952 -322 1298 9916 2873 -5979 -1818 13228 21520 30313 33933 31162 33439
17432 33439 36385 25055 14637 9553 2416 -3274 -4969 -5241 -10901 -4621 -120 -6475 -7986 -11847
17418 -11847 -13553 -8225 124 -1907 -5661 -6342 152 6605 -634 1118 1057 7320 9794 1468 -3220
17403 -3220 -15077 -13275 -9912 -7444 -10138 -7192 -3469 495 804 -7291 -6075 -1613 -11036 -9633 -6699
17388 -6699 -7866 -10838 -4670 -5900 -13285 -8646 5598 -3713 -21816 -23675 -18216 -11388 -8363 -10921
17374 -10921 -5390 -9802 -7441 -3346 -672 -4410 -9699 -19080 -17081 -8019 -8140 -7680 -3931 6270 12730
17359 12730 2277 -11758 -12641 -2582 4180 6346 -21 -4499 -9512 -14564 -12618 -10546 326 -5103
17345 -5103 -10381 -14064 -1731 -4083 3418 9339 8199 2231 8345 2732 -4723 -13524 -18134 -13668
17331 -13668 -7681 5213 5292 -1749 2016 8945 15713 19477 19212 15395 8749 12730 7775 -1640 -4692
17316 -4692 -11265 -11660 -2269 3431 3820 10363 -1395 -13023 -9430 -21505 -21252 -5924 -13223 -13062 -9979
17301 -9979 -11239 -11303 -3289 -7907 -13053 -7773 -4685 -1647 -10407 -23281 -19685 -12505 -11975 -5522 -3218
17286 -3218 -9510 -4108 6743 1857 1350 1917 -9580 -14028 -6690 -11254 -15347 -7971 -7272 -3112 -2500
17271 -2500 -8039 3274 3634 -10558 -6862 -261 2069 -2774 -4584 6466 6804 -3960 -11427 -17920
17257 -17920 -9983 -4006 1380 -2391 -16897 -9104 -3090 -5668 -8807 -8114 -6842 -9823 -10359 -14108 -15962
17242 -15962 -11921 -9253 3731 13947 7871 -2981 -605 -8779 -30071 -38890 -34071 -23967 -23630
17229 -23630 -26596 -36189 -29239 -22854 -14502 -13745 -26410 -39061 -40358 -31974 -17561 -15978 -19861 -26884
17215 -26884 -12988 -2524 -12154 -12019 -10308 -5059 -2806 -11150 -6974 -3547 -13323 -14463 -26620 -24593
17201 -24593 -17627 -17568 -12628 -3578 -2711 -7701 -4140 -10 3873 6581 -9395 -12487 -9830 -11944 -13503
17186 -13503 -16676 -11980 -15187 -21626 -33407 -23865 -10023 -8464 629 -3980 -12584 -8987 -4552 -3194
17172 -3194 -6760 -11233 -15490 -22145 -24311 -28139 -23887 -21509 -8619 -6625 -10471 -8119 -2558 -4385
17158 -4385 779 7421 15025 9634 -3919 -8842 -10965 -16731 -18186 -16267 -6569 6689 9074 -3730
17144 -3730 -10338 -2447 6022 13739 13905 11589 11420 7175 5561 -2709 -14984 -24393 -15838 -9650 -6888
17129 -6888 959 -1725 -8547 -8513 -3121 542 -4098 1374 9646 14725 11141 7324 -2884 -12167 -3730
17114 -3730 956 1409 -2441 -845 1445 -5277 -707 -11736 -12879 -10591 -5306 -2548 -1869 3797 9062
17099 9062 10182 9640 7763 9432 3953 -5607 -6351 -10951 -19752 -13769 -5623 -7767 -10376 -16039 -29192
17084 -29192 -23105 -9284 6269 6119 -6815 -6518 -4907 -867 -2267 -8576 -3418 -6022 -14060 -11224
17070 -11224 -9551 -8067 -5128 -417 -5635 -1002 -1271 -3280 -1054 -6160 -12055 -18407 -21965 -21361 -13158
17055 -13158 -7337 -5871 -4292 -8503 -9123 -8902 -4429 -6366 -11654 -15333 -14592 -14062 -9156 -2308 -4266
17040 -4266 -9074 -5874 149 -3818 -11521 -15357 -14442 -6296 -10249 -8080 -2266 1317 -2189 -10526 -17195
17025 -17195 -15561 -14305 -11758 -10876 -15744 -16404 -17802 -9126 2059 -2007 -11153 -18108 -8103 -9304
17011 -9304 -22487 -24615 -25949 -28591 -21318 -15089 -18698 -28371 -21063 -14910 -16955 -25093 -23811 -34858
16997 -34858 -42087 -40251 -30035 -21593 -24265 -27142 -21458 -8426 -8254 -17468 -22454 -22260 -28153 -25372
16983 -25372 -16529 -20612 -24683 -15615 -19141 -23404 -31552 -26581 -18218 -6238 -6147 -1863 6167 10938 1462
16968 1462 2309 1987 -11944 -13560 -8959 -1504 -1689 -2577 11117 467 -5774 -8530 -9320 515 -4358
16953 -4358 -3300 1329 3685 7660 6577 -3402 7526 -3601 -5304 -2302 -4882 -8308 -15071 -18230
16939 -18230 -12820 -17921 -19461 -13415 -10042 -11193 -9310 -14689 -12787 -16285 -20436 -19570 -19085 -14522 -11861
16924 -11861 -20062 -28317 -34337 -29262 -15492 -22223 -32237 -35500 -33859 -36466 -28993 -20923 -17337 -4534
16910 -4534 1199 -727 -3905 -9735 -14726 -14323 -11565 -14857 -10374 -8170 -16395 -14812 -1979 12655
16896 12655 9847 -4601 -6050 -8782 -11298 -15490 -9818 -3761 -10457 -8693 -8812 -11422 -2801 2912
16882 2912 3443 -916 2751 4003 4285 56 -8490 -11137 -15592 -20144 -16067 -5809 -5413 -11296 -11204 -27050
16866 -27050 -30693 -13425 -149 -6822 -10571 -12336 -20869 -15856 -16844 -30707 -34457 -21520 -6081
16853 -6081 3772 -1701 -1939 -891 -4959 -5452 -5523 -8649 -4514 8965 -1836 -5301 -2446 -12559 -10249
16838 -10249 -6825 -8355 -1814 -5560 -19788 -24260 -23532 -29558 -28052 -20807 -12884 -8215 -16497 -24986
16824 -24986 -26152 -13913 -3575 -5458 -6447 -10773 -10771 -15331 -25372 -20178 -4087 -7960 -11329 -14458
16810 -14458 -20842 -21240 -20947 -14594 -7180 -13681 -22197 -16101 -4669 -7418 -9143 -13409 -19909 -20292 -16265
16795 -16265 -9950 -440 -468 -11047 -21910 -24090 -15887 -20210 -22263 -26838 -27216 -22792 -21960 -22714 -22756 -17419
16779 -17419 -12196 -14308 -14494 -11133 -21055 -21938 -15544 -11405 -1215 1842 3393 9359 2812 1836 -6529
16764 -6529 -13932 -5924 4974 218 -7900 -17734 -18616 -17689 -14614 -11773 -17999 -13375 -1451 -9310 -16709
16749 -16709 -16495 -12791 -13102 -8668 -11642 -16401 -9369 44 739 3076 19577 14109 8587 -1403 -2128
16734 -2128 -1385 2792 -2490 -3710 4529 263 1982 -4277 -7809 -14352 -10324 -14603 -23375 -22003 -21423
16719 -21423 -20364 -11504 -3457 -5023 -6411 -8873 -3130 -660 -2132 -3366 -4731 -4971 -10825 -14471 -23529
16704 -23529 -24310 -17881 -16321 -21702 -20028 -13297 -7274 -7677 2347 5985 1764 -3428 4311 802 -8131
16689 -8131 -3431 -9602 -20602 -17443 -8051 -2831 -1721 1815 3420 8470 5143 -5320 -6392 -4925
16675 -4925 -11509 -8950 -3287 6691 11507 2958 -7167 -14021 -23193 -26471 -17875 -13369 -7059 -2908
16661 -2908 -8326 -14108 -15285 -9208 -4324 -378 -9 -3358 -9605 -11149 -15275 -14030 -8915 1994 -4163
16646 -4163 1113 7485 -1483 -11034 -7054 -1720 -1297 9606 8750 -1185 -13244 -16369 -6572 -11979 -18761
16631 -18761 -11221 1144 6046 1463 -12112 -9718 -10220 -20246 -27739 -30428 -13786 -4453 -213 -1159
16617 -1159 -3858 -9647 -11304 -7061 -4238 -1973 76 2757 3549 -4721 -3986 -1704 -2152 9244 8966
16602 8966 1428 -11981 -9024 -5157 -16967 -27194 -20941 -13328 -10205 -13231 -18456 -17219 -11218 -17160
16588 -17160 -15727 -3827 2943 -4268 -13628 -19775 -12130 398 2226 -6606 -12765 -6397 6419 13096
16574 13096 13080 19395 19916 16491 17730 5359 -199 -1500 9874 675 -9209 -15582 -18300 -13428 -15430
16559 -15430 -24637 -18755 -18888 -14330 -2645 -11313 -12405 1622 -11351 -17194 -11695 -12258 -13771 -17280
16545 -17280 -7190 -10166 -16272 -17747 -17895 -9604 -4934 646 -2727 -7110 -11067 -18519 -12001 -14614
16531 -14614 -17381 -16817 -10078 -7739 -12019 -6511 -1251 -981 -11243 -18808 -14081 -4397 -12402 -15200 -22207
16516 -22207 -24791 -25258 -25163 -15623 -4909 -3721 -8324 -14339 -535 4287 2756 -3128 -2128 -3358 -4066
16501 -4066 -2693 -9617 -6096 -1791 -3085 -896 -4326 -4118 -4778 1880 7179 -196 -7962 -22472 -16815
16486 -16815 -10863 -58 6068 4245 4022 6165 7584 1172 -13170 -15748 -5971 493 9655 7586
16472 7586 3251 1990 527 -2356 -8096 -5816 -3659 -5450 -12628 -15628 -10263 -16006 -13640 -5834 235
16457 235 1643 -4177 -12485 -16200 -11720 -15045 -19414 -11875 3867 7040 5616 6001 953 778 9592
16442 9592 6531 10011 7655 1915 -3272 2367 -3403 13 3060 6732 778 -5864 -8904 -5582 -13276
16427 -13276 -21184 -23462 -19694 -8080 -499 -9674 -2028 14597 17259 9810 4431 2159 -3431 -3403
16413 -3403 -6470 -17578 -22525 -15176 -8490 -15437 -11296 7930 10195 3692 19462 13439 8160 9782
16399 9782 3278 6425 6293 2682 7609 7651 23 -6198 6503 9775 20 -8520 -4243 -10295 -12316
16384 -12316 -5773 -3648 2402 2851 8935 5541 3690 765 8253 7058 341 -8492 -18605 -12839
16370 -12839 -9263 -9948 -11018 -11940 -16174 -15179 -8943 -1935 -4785 -93 5801 2074 3276 6784 -5925
16355 -5925 -14171 -13179 -9037 1163 -2928 -5701 -9814 175 12767 10205 7099 4715 6042 2469
16341 2469 1311 13321 14360 3993 3270 9519 9427 1742 -6671 -27988 -23356 -10581 -13009 -18835
16327 -18835 -28517 -30927 -25609 -11399 -2967 12440 14155 -940 -7197 -3948 41 194 7481 8293
16313 8293 8551 9206 7084 4650 4584 15471 24735 16074 2919 -9812 -19316 -12922 -21130 -15115 -13577
16298 -13577 -7616 -10086 -6832 -4347 -11306 -15422 -14984 767 9494 -1766 -8947 -5910 -4404 1976
16284 1976 -7665 -20412 -22034 -14826 -12538 -12954 -11957 -22201 -24342 -13523 -13711 -14400 -9068 -3392 -11516
16269 -11516 -16378 -12719 -6047 -1482 3020 6023 -1585 -8575 -17496 -20887 -21337 -23134 -23205 -21137 -23758
16254 -23758 -21676 -10361 500 1482 -7074 -12946 -11887 -16759 -23734 -21371 -16479 -13029 -2529 -4063
16240 -4063 -2779 -3943 -8566 -14559 424 7738 4863 8879 15863 11423 776 -705 -7072 -16729
16226 -16729 -20601 -18884 -15224 -2538 -4622 -9858 598 9151 13169 6136 3179 -11195 -11994 3415
16212 3415 5857 -838 6292 -4465 -7625 -13595 -7541 -3405 -817 -5207 -15830 -21626 -16251 -7259
16198 -7259 -6867 -5935 -7698 -10886 -607 14506 21770 6531 -4198 -10051 -8230 -6639 -6227 -5937 -2268
16183 -2268 -6537 -1242 -5081 -10253 -2244 -6545 -6235 2813 3896 16012 20811 12506 1845 -1390
16169 -1390 7519 7261 3693 -6098 -14444 -13361 -11719 -16040 -13898 -1226 3483 3880 -4004 1124 9289
16154 9289 8452 6844 1224 7893 11507 6782 2502 8683 15096 10080 2169 -3885 -10734 -1914 4440
16139 4440 6109 5680 -3000 -1114 -1833 -8164 -18067 -10502 -5876 -6430 -7747 -4367 -2090 -993 -3821
16124 -3821 -2795 957 2868 3846 5917 -1234 -2508 -10278 -15527 -21103 -16443 -19648 -21914 -16503 -11481
16109 -11481 -5377 -3984 -10842 -10432 4755 10660 14183 2497 -6238 1397 498 -2513 374 16113
16095 16113 19762 4748 -4433 -2346 8802 960 -3521 2671 -2754 -3051 5861 10539 4316 -10973
16081 -10973 -14174 -14779 -22148 -18208 -6887 -7438 644 16221 23971 17498 15727 17450 16010 9665
16067 9665 2391 3258 4218 -3344 -4208 -1742 -5026 -4980 -9829 -17262 -7309 2661 1618 -1422 -6302 -11569
16051 -11569 -9875 -12546 -20757 -19678 -20084 -14804 -10744 2139 -1082 -975 -10365 -4879 942 8287 1497
16036 1497 -1462 5398 4936 429 5315 -1372 408 785 1567 -11780 -8051 1044 6466 9661 6399
16021 6399 -4063 -204 3385 4913 4930 4270 -219 3406 4748 10138 3529 -2448 -3326 -4164 -12200 -15244
16005 -15244 -8408 -1573 -3787 1451 -3474 -10434 -10780 -5060 3275 5579 4969 4560 2445 2914 -1386
15990 -1386 -3254 -1684 -642 1670 -1234 522 3076 6725 1316 -8031 -9148 -16263 -11798 2744
15976 2744 14891 16712 13656 14278 17121 18075 8169 6566 3404 -7061 -8076 -3464 126 2295 6855
15961 6855 3671 9546 26066 20769 7496 -1633 -7947 -803 1464 -1616 -6093 -8401 -6350 -8012
15947 -8012 -10977 -4184 -3085 -8978 -6103 -1006 -6421 -4434 -11535 -16663 -18746 -16433 -13943 -16036 -19649
15932 -19649 -17789 -21867 -8805 1386 -6579 -8271 -11132 -18914 -17929 -11196 -9819 -19997 -23784 -19935
15918 -19935 -4952 -2204 314 -1040 -6619 -4089 -1056 2143 -6048 -12958 -16705 -19718 -19527 -19509 -23991
15903 -23991 -21393 -13322 -10358 -7088 -2097 768 -2230 -194 -3444 -26170 -29817 -24008 -8536 -8630
15889 -8630 -13379 -13470 -16149 -11573 -15230 -14119 -19296 -17750 -19653 -17141 -14469 -1847 12470 8606 8721
15874 8721 16877 11725 3908 -3071 -131 -1199 -1202 11896 24152 25696 20328 11227 -1781 -1642 -285
15859 -285 -4574 -10551 -17767 -14593 -6822 -1699 -927 -4198 641 -3215 -1307 -1046 -3921 -6219 -3791
15844 -3791 -3426 -8448 -14161 -9489 -9415 -21521 -26421 -17998 -17928 -12021 -9490 -9938 -8452 -3427 -7704 -6931
15828 -6931 -2534 12762 31621 35299 24780 10399 -7063 -14379 -16612 -12731 -4785 -1849 -1288 7929
15814 7929 8967 3864 -1997 -8964 -5134 1138 -5689 -9866 -2159 -6031 -660 9452 7710 3589
15800 3589 12154 9972 -3368 -9116 -8768 -4867 4468 3195 7524 10978 9162 -3723 -11681 -8700
15786 -8700 -14193 -26002 -18216 -5319 -7502 -17753 -14809 -9143 -9236 -5828 -6066 -542 -5166 -10722 -5550
15771 -5550 -3555 -10051 -6291 2386 1327 3546 10357 12848 11365 16503 19900 19769 16297 5753 168
15756 168 8676 4374 1596 3378 -2370 -13460 -15166 -11011 -20469 -20766 -18655 -13699 -15531 -26973 -29774
15741 -29774 -19712 -1259 12015 16139 14083 9747 7396 -2243 -10011 -15737 -15501 -12620 -9948 -6934
15727 -6934 -2671 5820 -2169 -11360 -3202 6368 6011 3891 238 -10891 -9678 -6913 1191 7510 -6942
15712 -6942 -10363 -8437 -4384 6668 4757 641 -8166 -16166 -20610 -28316 -18670 -4755 4057 4689
15698 4689 625 2470 3770 -959 -7289 -2733 3423 -661 -10682 -22070 -16542 -12820 -14472 -13943
15684 -13943 -4760 -1370 -1762 -5764 2615 6092 6795 1451 7134 10539 10408 19105 18203 15504 11338
15669 11338 4735 21754 17523 12842 8647 -2992 4396 10355 10900 3574 -4902 -5296 -3448 -9171
15655 -9171 -3987 -5374 -3446 -5500 -7328 -7884 -5372 5507 17459 15103 9169 3734 2958 1893 9309
15640 9309 18198 16012 7608 12621 7544 5872 -2099 -2192 1681 5279 3629 3745 1247 7804 826
15625 826 -12697 -20413 -23657 -15398 -6100 5661 4569 2887 -3445 -6969 -9163 -6731 -620 10102
15611 10102 11326 10513 13956 19264 21519 12023 10704 4256 5515 3769 -82 -5992 -8317 -7392 1359
15596 1359 -1285 6458 5343 1313 -4088 -774 4620 12870 16798 9482 6962 7560 14812 12132 -58
15581 -58 4425 7297 5 1200 7668 20722 12334 -1018 -3915 -8438 -3955 -2674 -949 -2052 -11206
15566 -11206 -10527 -5946 -2971 -3315 998 -841 1608 -11566 -11667 -4256 3549 7998 -2867 -7140 -13003
15551 -13003 -12415 -10536 -3948 202 -318 -2652 -8533 -1871 -9625 -20728 -17551 -1949 10979 12001
15537 12001 7189 -1176 -1991 -4108 -11010 -11687 -10730 -8687 -6417 -429 8097 9285 12943 6560 7197
15522 7197 2264 -4466 -4336 -64 -1190 10010 15617 15508 10755 4046 1471 1075 2698 6833 17524
15507 17524 21430 18994 22401 11968 6331 5791 938 -2497 6442 19198 19762 14713 12954 2376
15493 2376 -7660 -5472 -6942 -10695 -6735 -11897 -7891 -10044 -10202 -6132 -690 848 397 -5055 -9871
15478 -9871 -7370 -2391 3225 3555 -1257 -2281 1947 1091 -8382 -6484 -5914 -82 -5475 -4428 10205
15463 10205 21346 21582 19925 20476 18073 20068 20215 19092 12782 5028 13327 23997 35905 38965
15449 38965 36110 33354 32743 45350 68756 90389 124689 183918 286954 381676 402798 393885
15437 393885 380607 389295 399274 346901 257691 190199 139386 105673 84580 72561 60466 51538
15425 51538 52398 46098 45821 50648 54192 57771 50395 41775 47351 44141 47890 59908 67544 85907
15411 85907 108356 134916 182848 259446 362128 423838 419725 390679 373999 395926 389396 296262
15399 296262 205703 150753 118895 93732 83605 73856 62754 59587 54378 48019 44305 46750 40224
15386 40224 16009 18494 30141 33298 40627 36214 36844 31745 26116 23683 22443 25300 23621 24741
15372 24741 24084 34659 38174 35750 26161 16755 20367 29430 26627 30529 26018 36254 32934 32226
15358 32226 30374 36943 28127 25898 9027 12932 17948 16266 12779 19713 23665 15736 15452 22704
15344 22704 18212 11632 18961 16381 1948 -1273 -532 11933 19116 33331 19250 8563 6008
15331 6008 8919 16518 11760 2116 -1322 -4912 -4848 -7843 -5771 -1111 7480 11933 14210 10748 11566
15316 11566 8336 -1721 -7993 -3786 7622 14157 14534 7662 -526 1786 7994 7325 570 -3167
15302 -3167 -913 -4015 -869 1107 1133 -9 -2740 -2274 -3698 -837 6745 13165 16892 6330 2032
15287 2032 -3940 -2294 1752 -1536 2440 5131 4961 9055 7370 7246 8587 7469 2738 2890 6034
15272 6034 10672 9167 2243 -3683 -9491 -13720 -10366 -16452 -21772 -20318 -18291 -15214 -8545 1802
15258 1802 -1096 -129 1398 3140 -1319 -4959 -9673 -13585 -12520 -17250 -21343 -20205 -16954 -17311 -21767
15243 -21767 -18557 -6835 -1982 -10225 -19124 -12020 -2273 10757 -975 -19574 -15685 -12579 781
15230 781 11244 -1491 -13544 -19671 -12465 2260 -870 1648 18226 19425 9195 1587 -4806
15217 -4806 -14990 -7283 -2532 -2628 -7594 -9470 -4532 -8068 -17491 -6122 3280 -1613 -4882 5484
15203 5484 5708 7669 7320 12079 16055 12634 5204 4632 11762 16940 12043 4222 -98 918 -7291
15188 -7291 -3240 4378 -4991 -11376 495 3579 -5328 -7678 -14610 -1296 8111 9682 5045 2913
15174 2913 4656 2610 -1075 -745 5127 -1873 -1568 -7422 2624 8584 -1705 -9043 -6801 3172 4737
15159 4737 956 5122 5999 3133 8258 15905 14897 8782 8051 11177 5124 275 8805 8427 1017
15144 1017 5682 3487 -1164 3192 -3739 -6263 -1340 6493 2966 -3733 -6664 -3464 -6235 -16693
15130 -16693 -16097 -16356 -12488 -9713 -4927 -8085 -6078 -52 11793 13241 5499 11468 10371 12689 18742
15115 18742 19567 11410 -1050 10128 12922 2426 -8443 -14800 -12183 2008 2397 -6864 -8690 333
15101 333 3832 778 6340 -1554 -5333 -1817 -2798 -10846 -21000 -15716 -9733 -8654 -671 1522 1400
15086 1400 2907 7685 5773 -1106 -221 473 -3642 -5136 1916 5578 6779 102 -2987 887 8129
15071 8129 2647 5348 7286 6234 10133 1997 2396 2944 -417 -10180 -7373 -5127 -2229 -7617 -5745
15056 -5745 3468 16009 14258 3466 -8432 -12081 -12030 -8053 -3920 -878 -4307 -2004 -4983 -9064
15042 -9064 -3740 5489 6362 -6964 -13499 -5122 -2206 1214 11356 19006 15653 15114 9410 5417 3586
15027 3586 15365 16988 10872 -1622 -6074 -2396 6552 3733 -567 -627 1693 1966 -5071 -7087 -6963
15012 -6963 4550 7766 10619 11369 6627 13756 9109 3166 10818 14948 11979 12619 -3145 -15543
14998 -15543 -16430 -10829 -6895 277 6531 5045 -2125 4728 4837 3879 6083 5991 10924 16786 17889 6138
14982 6138 1640 10919 5744 -5150 3278 11786 14240 18166 13039 7164 7952 7943 7225 15961 14347 6068
14966 6068 6456 8193 9695 18129 14001 6959 217 -12063 -16569 -17258 -5000 1464 659 1271 4604
14951 4604 4954 13156 17572 20350 17920 14468 6562 11077 14532 12246 9224 4201 -4207 -8144 510
14936 510 3616 12051 13808 16388 15656 16559 20723 24305 9451 2923 5267 6180 7388 -2872 -6631
14921 -6631 -10301 -7401 -5531 -573 2976 1391 6413 3224 2144 5635 -1607 -4515 -1082 -1942 -409
14906 -409 4867 1731 -13338 -25798 -27416 -14723 -1557 -1512 -1636 6327 8717 9474 265 5217 5193
14891 5193 9541 8341 11365 18454 19082 19288 23613 24481 23922 16571 16523 11715 14431 9099 17532 21295
14875 21295 21637 12086 17164 24855 15661 11599 13567 8093 4177 6586 13374 13714 15163 18669 18793
14860 18793 17910 18248 10765 3126 6188 12456 13069 6130 17750 30480 24839 18615 19874 24743 39509
14845 39509 47667 40096 36556 35604 39184 46336 53953 59182 79253 101711 137403 182899 237720
14832 237720 320570 431328 548701 632597 669882 680818 680948 670098 612577 514842 403090
14821 403090 300872 237350 185167 156156 131518 112046 101071 100192 99968 74273 64403 61766
14809 61766 49440 44871 47790 47966 37562 31844 32612 43188 51816 55676 52140 54315 47868 34090
14795 34090 31891 29076 31645 32046 33434 31910 37045 32903 27446 28184 29986 33135 27628 28226 30063
14780 30063 34756 45638 48910 45580 37260 21012 13687 16563 13742 14272 1413 -7154 -4582 907
14766 907 -148 -3473 6371 19165 21542 17696 19188 21361 11594 9071 11524 11290 14129 12609 15558
14751 15558 19857 22191 17760 15630 12311 18903 13947 9036 12475 6329 4290 2403 -2723 -2013 -2995
14736 -2995 1760 -1618 56 6141 5016 8307 15601 20379 19260 24783 19811 21763 28286 25258 28289
14721 28289 33174 28402 25577 28602 22644 12521 10285 11733 14784 22093 31240 22150 25041 26719
14707 26719 18494 12019 20697 28950 38947 26577 15455 11022 14103 13259 9032 16121 16778 17977
14693 17977 17099 17225 18397 10000 6973 16447 22377 24237 20806 20822 24982 26206 29367 27210 27106 27447
14677 27447 31416 28592 26038 11444 14502 10484 16061 21419 20397 7444 4070 2816 12658 23688
14663 23688 22577 16602 19885 27663 31238 27536 18623 17638 17358 23262 29733 26884 21150 14245 14792
14648 14792 11578 10213 10401 13218 23391 30564 38709 36716 34308 41242 39134 27119 14645 11652
14634 11652 13878 19937 13958 14852 10353 12277 11790 24032 25804 33646 34019 32617 31087 21046 16095
14619 16095 18607 18082 14196 10128 -2920 -3400 3021 9112 22639 29068 21305 10720 5672 16442
14605 16442 26995 25354 28210 34940 42624 42591 42041 44079 36316 38417 46605 42758 34995 31379 36222
14590 36222 43990 50286 50513 32863 18505 18635 27918 38783 43359 42519 34181 34281 50804 58410
14576 58410 51565 40817 44646 57799 76674 87739 94354 100719 110444 120062 117637 102487 88323
14563 88323 91523 88342 70000 62301 65574 65423 60971 58399 50497 43164 42647 41134 44889 49111 53893
14548 53893 58899 57256 55043 49727 45049 44260 57508 57589 56853 42386 24755 21996 31803 40745 48087
14533 48087 63037 62195 65193 74096 75427 78170 88109 89600 87056 64688 42965 31362 33011 31687
14519 31687 30845 33892 39802 47147 50538 44315 37547 38102 41185 45101 44394 36260 45042 49063 44826
14504 44826 37553 32562 27458 15735 2164 -7056 411 21219 39250 47320 60799 66500 64235
14491 64235 55882 65762 77262 85739 85503 75513 64562 65482 71028 67281 53468 61793 61354 66265
14477 66265 66306 67033 75395 72129 56083 34372 18855 15448 18047 30726 45598 47153 53954 62015
14463 62015 60430 61982 76857 72565 59851 53744 50622 53133 65994 86587 91074 102694 105494
14450 105494 110404 122515 138050 148552 161192 187868 231425 283465 347287 409096 434105 441961
14438 441961 441145 427146 402948 365346 326834 288749 250620 219921 202043 204929 194272 179916
14426 179916 169242 180303 183714 186806 184782 178440 181983 186892 188760 191767 206612 220096 240124
14413 240124 269748 289792 305570 315002 327873 332537 334180 339609 345494 344823 331969 301624 292119
14400 292119 292496 284103 275384 274885 285556 300062 319960 331158 338383 339613 342089 352826 358969
14387 358969 369550 369821 374709 390918 407446 429103 437621 444072 444186 464189 489833 519512 532921
14374 532921 546982 550645 546637 524574 520283 517616 507191 510702 532977 586056 647290 692893
14362 692893 738781 797654 843577 883401 932247 944381 963873 991894 997927 992467 1000231 1017344
14350 1017344 1054486 1106756 1166746 1241346 1331594 1427476 1528783 1656469 1772451 1885686
14340 1885686 2003939 2130786 2274154 2456262 2683424 2954011 3303978 3755680 4306428
14331 4306428 4913381 5510142 6090495 6702938 7425150 8306162 9325770 10550037 12161483
14322 12161483 14435569 17817876 23051893 31463239 45134152 65648577 90753377 113019323
14314 113019323 125532406 128504700 127352742 125779238 121441813 108836943 87792347
14307 87792347 65272797 47614003 35931991 28518784 23662274 20331680 18006890 16361980
14299 16361980 15151183 14162107 13230751 12350753 11556027 10817749 10075561 9341476 8655217
14290 8655217 8044859 7527186 7088828 6710816 6378688 6064468 5780545 5535271 5304882
14281 5304882 5088876 4894662 4737290 4601207 4476822 4374525 4279164 4211695 4134880 4034181
14271 4034181 3934834 3831671 3743242 3654384 3566675 3473728 3377987 3282405 3206195 3133308 3063551
14260 3063551 3001935 2965059 2935839 2921599 2918193 2915339 2906356 2892342 2860688 2813977 2762506 2696823
14248 2696823 2609866 2517793 2402464 2278744 2159172 2047602 1956021 1874310 1801093 1728881
14238 1728881 1659272 1613146 1559531 1504026 1445599 1390651 1318189 1246191 1183435 1114598 1056159
14227 1056159 1022115 1001643 980406 958117 928227 912291 913419 904389 888710 869083 844737 810245
14215 810245 788941 777835 753223 720569 697429 671001 646682 620628 598683 573046 547768
14204 547768 535515 537054 542506 532615 518429 508004 497328 479810 462038 442773 405435 356889
14192 356889 312323 268481 231200 182547 151753 143959 141537 146863 155975 159613 157712 159239 163314
14179 163314 168078 177867 177688 175260 161287 152259 156759 163108 154885 144520 136457 140637 148649 146106
14165 146106 129149 124802 129567 135184 143867 152965 150053 148754 157794 169872 169846 168615 169451 167709
14151 167709 171586 177490 169003 160458 153836 137349 136731 152094 162822 165859 161212 149478 149228 153496
14137 153496 149595 135445 129990 129043 129140 121436 117229 115785 112251 111240 112722 127388 138188 148066
14123 148066 144499 134905 139378 142207 135599 129154 118373 115020 116258 117730 119660 108691 107512 110150
14109 110150 110685 108987 118075 125106 120290 113007 120616 128992 122657 103146 86025 86192 87019 80907
14095 80907 84059 90268 88797 96466 100311 106295 109641 107424 100407 94733 88565 86680 85030 73897
14081 73897 60839 59720 68527 74924 73466 70161 74679 77178 77568 84259 86164 90479 90831 87451 95838
14066 95838 90638 89897 81604 82700 84871 82494 87956 74355 71718 77888 87253 86656 80832 74246 60285
14051 60285 56570 51886 57577 67125 62539 50591 50201 48349 40748 43054 33148 30933 31763 37399 46428
14036 46428 52998 52244 50573 52720 47444 46134 50720 49500 46339 58067 66688 56555 56997 70073
14022 70073 76024 83604 92660 96729 92474 87303 84931 95363 103153 105706 125006 125372 119822 122997
14008 122997 118198 106033 87890 77348 60501 50295 44259 46159 39791 33497 34867 33704 38152
13995 38152 52878 60509 66312 68495 65410 58542 51336 51620 46366 32850 31671 32587 38385 30671
13981 30671 27995 24042 31565 42968 42695 37211 33854 24861 23576 31490 42885 39157 31982 29430
13967 29430 34262 38670 34805 18975 6149 18257 30219 35799 42853 44424 37127 37973 46067 49580
13953 49580 47772 47537 49575 46422 40811 36406 30186 31463 33474 40146 33053 29267 27600 28290 23779
13938 23779 22522 29614 30521 29825 25560 32398 32961 32421 35569 34737 50690 55636 47233 31527 39828
13923 39828 45349 45518 47586 50898 48305 46475 43303 49280 49337 44604 42861 43258 38543 33471 42348
13908 42348 56211 67232 57112 41737 45207 53393 55351 43186 43101 49028 57668 59939 58689 63346
13894 63346 68651 74741 80815 83659 89719 89963 113287 140113 160519 198301 255302 337584 421058
13881 421058 474792 479993 470280 465741 450368 401688 343920 292784 229860 183450 155786 136738
13869 136738 126452 119902 126954 125254 131356 133041 125741 116973 122901 123721 115555 108768 106039 119558
13855 119558 125335 139432 171479 199105 249115 316701 383605 437135 470340 474160 470296 469598
13843 469598 441534 395958 329288 255202 211296 198302 202759 212709 220407 217976 226410 244689
13831 244689 267059 293443 319764 307308 289526 269043 264879 259270 231429 201914 180021 156260
13819 156260 131817 118165 114742 100933 93635 94214 100224 98630 104035 109052 108898 105648 99816 111988
13805 111988 112897 120871 133261 149281 161807 171051 182798 200402 237409 306245 409229 530439
13793 530439 661311 755473 802648 815932 831011 835589 828343 809442 787436 787055 779537 742753
13781 742753 694524 661194 636046 606499 533408 431561 344973 293815 255634 222369 195975
13770 195975 171664 162572 170516 178745 170875 150311 147320 147855 131334 127247 123408 119574 108147
13757 108147 104988 109252 105863 103012 107383 120314 127430 117673 119654 128657 133955 151109 169473
13744 169473 182888 203175 231016 292382 376922 483121 567185 591112 591841 574497 567276 547389
13732 547389 484713 403285 330285 270911 229572 197396 175494 164094 155107 142190 131903 121903
13720 121903 114618 108171 102132 99275 101298 102650 102992 103800 97848 96875 90342 82076 80191 77214 77674
13705 77674 80243 71712 73846 78388 83820 92194 102337 117926 127458 125494 143020 171449 210009
13692 210009 227870 221286 220505 225150 221845 211236 184828 139872 124970 118943 107143 82194 76662
13679 76662 90168 86969 85771 85964 77678 73075 76765 75630 68335 62786 65180 71648 65188 50611
13665 50611 55279 48614 50613 48200 49627 51164 48947 42596 48157 52756 59020 67400 75293 79126
13651 79126 70955 60439 57763 52363 48610 59590 74618 65625 62585 63825 64742 64775 60448 63784
13637 63784 61826 58919 57241 58215 66744 74184 75772 75088 70900 60350 68269 71577 66911 70132 70071
13622 70071 63646 66083 65069 62060 68015 72215 62090 56884 62661 71722 68372 56818 46506 49978
13608 49978 60538 70714 79757 74847 73797 75430 80188 78891 77939 81232 81910 82238 85524 75336
13594 75336 75706 81934 84427 98330 111801 96330 80364 81279 80796 85778 91503 82493 74331 71055
13580 71055 82770 93864 94176 96378 103863 106524 103802 126868 138538 124104 115443 112384 104716
13567 104716 104492 98163 98998 96296 93105 85875 78348 78088 80654 91887 93473 95102 89216 84313 91318
13552 91318 97013 103774 102653 103848 101462 99194 98951 90716 95813 92665 94651 89484 88240 96236 99931
13537 99931 91733 81035 74515 80626 89889 109463 119614 139031 145228 137439 134767 139338 140770
13524 140770 138528 131966 131912 126012 114422 109403 110280 102906 98231 103076 107770 110931 110535 109466 106313
13509 106313 100705 98002 100768 103094 108006 103918 103007 121037 125463 121313 124788 135760 150602 156683
13495 156683 152459 161550 176290 186248 195388 205896 216085 226046 219360 216935 223317 235483 226241
13482 226241 209352 207069 206205 203958 194997 174944 165400 157594 148728 143902 137677 132322 146864 163060
13468 163060 156243 152626 153792 150161 148272 147793 160319 157860 163602 171399 185279 197782 212900
13455 212900 230647 243997 259199 279508 296134 296773 295206 325817 373628 427572 479295 510914
13443 510914 513347 510641 497550 495192 498163 490001 452202 419443 403117 388748 376019 361560
13431 361560 357976 347746 334691 333297 340561 351169 364473 374764 379788 374064 373447 387772 391169
13418 391169 398666 401627 410888 440457 475929 499234 511637 521226 537024 567939 593639 620808
13406 620808 640702 643220 647767 682468 731936 775348 827415 884475 935113 962656 975287 995776
13394 995776 1002211 1008170 1022528 1039204 1065499 1091428 1130589 1179255 1232884 1282532 1336567 1424464
13382 1424464 1528410 1653222 1795914 1969393 2166440 2389803 2646454 2953284 3342293
13373 3342293 3782820 4313934 4997221 5911575 7234503 9216887 12278151 16954760 23033940
13364 23033940 28330452 30721320 30913415 30478086 30314571 29763506 26684210 21310263 16280866
13355 16280866 12747593 10457957 8929573 7858625 7088358 6518666 6097017 5755264 5478142
13346 5478142 5261441 5090361 4958978 4870777 4822679 4820880 4866183 4957296 5082275 5237261
13336 5237261 5470542 5773517 6156434 6649649 7261204 8000179 8867034 9928570 11191379
13327 11191379 12718343 14644591 17207217 20833211 26236264 34583471 47598282 65905584
13319 65905584 84269264 93649609 94483257 92566132 91404593 90906907 84136069 67682081
13311 67682081 50445235 38238587 30429610 25318478 21772692 19192168 17257362 15766566
13303 15766566 14571314 13550454 12665063 11921594 11293847 10747281 10294640 9948231 9695420
13294 9695420 9505157 9374796 9316140 9349826 9469649 9684197 10012465 10462316 11067224 11821518
13284 11821518 12766049 13935751 15352975 17146373 19534694 22906362 27920012 35644373
13276 35644373 47736340 65312930 84659438 96309578 98241135 96334095 94659646
13269 94659646 94202805 89203769 73850999 55553765 41941421 33186999 27479514 23545626
13261 23545626 20685745 18548544 16890704 15551049 14423562 13430398 12555243 11788825
13253 11788825 11112857 10519246 10007801 9559002 9170147 8832147 8533557 8284755 8087404
13244 8087404 7950841 7862329 7824026 7844802 7933534 8110757 8367508 8731019 9232171 9922895
13234 9922895 10925155 12430596 14788951 18514966 24010273 30292238 34562240 35723796
13226 35723796 35276497 34668643 34351738 32768423 28108830 22116713 17280420 14020504
13218 14020504 11848407 10337062 9243164 8423814 7791043 7271826 6819485 6420840 6074812
13209 6074812 5756010 5452860 5189402 4947513 4713277 4486888 4277722 4079638 3915576
13200 3915576 3760983 3599992 3451265 3301957 3160145 3034350 2915762 2789866 2673568
13191 2673568 2567585 2481222 2401585 2330375 2265110 2217431 2161045 2098233 2045699 1992100 1953162
13180 1953162 1930658 1886393 1840628 1822161 1797213 1754333 1720488 1685371 1646618 1611174 1583195
13169 1583195 1559997 1539935 1518717 1491331 1472987 1446624 1415929 1389520 1367151 1344518 1311296
13158 1311296 1275517 1236627 1208256 1177928 1155011 1130933 1093354 1046468 1003607 960705 917643
13147 917643 882722 859969 846719 834089 818081 826039 840881 848301 858798 884579 922069 965101
13135 965101 1024345 1101292 1203347 1344876 1527945 1705177 1871820 2006103 2072221 2103611
13125 2103611 2081063 2002490 1882594 1731318 1562483 1393959 1252551 1120653 1018547 939233
13115 939233 884614 832071 785100 762148 747553 738645 702688 654256 618037 590953 569494 538173
13103 538173 496299 461981 435920 417983 412274 412833 410534 410526 403449 394204 399011 396313 387763 365878
13089 365878 366862 365779 345755 341705 337985 331069 319984 312930 310491 311261 307091 308638 308398 312415
13075 312415 303741 299966 299924 283966 280643 288073 289783 286005 288494 269793 270198 279478 284115 280058
13061 280058 277487 271440 267434 274479 265130 256945 251526 243407 237076 226233 220836 216976 213682 227543
13047 227543 230431 218321 219608 217579 210361 202269 195884 188629 184036 176661 166977 166913 173048 182586
13033 182586 190525 187834 186053 183090 180765 172402 177345 174585 161474 158172 160071 158527 168206 168691
13019 168691 155168 167848 183789 184431 190421 189364 176114 168374 164632 172534 177312 182384 186016
13006 186016 185752 196844 224475 259543 312044 367374 414158 442616 451851 448498 445618 438517 408137
12993 408137 355637 289647 233432 202963 191297 179722 170244 158039 150586 141324 143848 143531 140297
12980 140297 134133 127515 129314 123469 123792 127476 122206 122849 127752 132691 131580 135204 147461 151945
12966 151945 149154 150915 152654 152872 142864 127867 123074 121091 121923 112154 117072 115756 112913 109712
12952 109712 100203 92940 90032 96702 95838 96114 91560 100687 107011 114590 105128 94535 86156 89475
12938 89475 90208 91468 95388 83447 86231 94905 95886 101948 109909 112342 109054 113216 121970 134653
12924 134653 144119 161063 194159 211037 208402 194049 181080 174709 165779 156860 145130 130688
12912 130688 135412 141985 149155 169955 192432 206549 206724 200077 207103 215227 218685 217161 210379 172744
12898 172744 133947 133632 141179 150286 165748 203316 236303 260737 270836 274592 272722 277265 282052
12885 282052 275912 252006 212063 185578 182628 190805 208539 232258 255243 270175 267336 256051
12873 256051 256480 256731 253645 244197 246695 260730 288360 339457 398648 459700 534732 598605 632498
12860 632498 632586 627849 608555 583747 536335 478075 415212 357523 324944 323856 343157 378900
12848 378900 431164 505185 590489 650963 669758 661793 652073 644090 621064 556571 465246 400275
12836 400275 360271 325552 304301 288105 284463 294147 286927 292922 300424 302750 316817 332795 364646
12823 364646 404964 474289 560252 669539 769215 844636 900674 929933 926944 897702 836841
12812 836841 763867 686723 606943 530479 477702 444488 419962 419671 443507 493438 562496 647594
12800 647594 720852 739941 731049 731006 710106 671704 595746 497056 420178 358899 323997 299998
12788 299998 280238 265679 246134 239291 245015 250996 254048 265447 286373 305932 344300 410858
12776 410858 490505 569210 615807 642380 649038 659521 663293 618580 548454 486617 433921 381959
12764 381959 343375 323313 315842 323818 344919 368053 377677 390360 408477 431557 441992 432658
12752 432658 406591 381540 362564 334509 299204 267012 236950 217987 204783 201419 198608 190231
12740 190231 185371 186173 183962 182546 186364 202306 209772 219409 237239 262103 278425 279830 270669
12727 270669 279149 292418 282214 260531 237331 215537 196211 188795 190086 192105 196153 208919
12715 208919 228044 237259 237244 231304 224271 226815 218391 198241 186361 180863 170019 155306 143595
12702 143595 145737 149073 148298 145002 141672 144190 150346 142488 132207 127624 129219 123697 132512 137918
12688 137918 137238 145813 155921 150961 142112 142157 146942 147745 149331 153749 142314 129601 128334 129885
12674 129885 147748 154620 153391 163733 178103 190051 186872 191552 195605 201191 198405 186489 178630
12661 178630 184109 189909 184276 166264 171225 171291 168292 166569 172154 177316 191487 202434 195038 202354
12647 202354 218777 230378 223218 218513 214965 204113 189329 192585 184541 182319 179103 168502 154759
12634 154759 153397 158177 168112 170307 169451 174370 176031 183717 196431 203996 213754 225743 237415 244528
12620 244528 236591 233576 223084 215969 216666 216458 211221 208498 223267 235959 256774 268497 287793
12607 287793 321492 348324 369236 386629 397576 400194 401938 399507 375116 355183 347480 338491
12595 338491 335089 344958 370221 391840 400006 404047 409499 426332 442384 444790 425669 408811 405425
12582 405425 403623 399023 402080 404749 414597 416460 408527 399831 390172 394881 382177 376768 393719 398702
12568 398702 395701 416089 440020 461428 500157 539741 584393 629170 656976 665521 651441 640613
12556 640613 638167 639781 645741 646388 642181 655156 693712 748031 835328 945589 1012932 1045969
12544 1045969 1061249 1096057 1134523 1158432 1144615 1100998 1077683 1072253 1059996 1045413 1047761 1057050
12532 1057050 1050926 1061035 1089094 1125241 1184099 1264226 1354134 1496469 1702253 1997295 2445144
12521 2445144 3139571 4161334 5373875 6311361 6707500 6747972 6715487 6708874 6512571 5804484
12511 5804484 4773736 3879331 3266776 2860892 2590405 2425779 2327690 2288091 2304361 2348985
12501 2348985 2378259 2391019 2392862 2391319 2397178 2392350 2353330 2320262 2329940 2331357 2332182 2341021 2378644
12488 2378644 2442882 2521484 2621299 2745022 2925010 3166790 3476327 3863471 4367010 5037124
12478 5037124 5996351 7441380 9655796 12898660 16831098 19924452 21191541 21288626 21201737
12469 21201737 21325044 21003796 19042676 15993713 13537589 12267729 12016763 12688781 14411258
12460 14411258 17442187 21573355 25401605 27435369 27765221 27451801 27169902 26567924 24379204
12451 24379204 20515959 16575899 13626129 11635118 10282374 9338694 8684428 8231903
12443 8231903 7912712 7696681 7582984 7559744 7615572 7778161 8036928 8410219 8945652 9713196
12433 9713196 10823942 12482160 14984592 18631394 22957566 26410092 28086085 28743161
12425 28743161 29416077 30510305 31375656 31024247 30387233 31517011 35387397 41752416 49392969
12416 49392969 57778836 68259783 81398345 93564845 99337113 97732206 92650234 87965922
12408 87965922 83559027 75157749 61781320 48339130 38454672 31857968 27371587 24181422
12400 24181422 21840686 20083399 18689501 17574608 16661782 15952968 15409043 15001791 14722725
12391 14722725 14576802 14586929 14783539 15197544 15912755 17027328 18651040 20595571 22401411
12382 22401411 23904425 25424368 27332253 29882561 33100281 37182879 43262811 52973213
12374 52973213 67258467 84203586 98588248 108808466 118834202 131311724 142833265
12367 142833265 145624165 136576319 122478418 110888410 101926199 90406853 74973052
12360 74973052 60439410 50215116 43858576 39780199 36607694 33825233 31466206 29565259
12352 29565259 27951257 26191158 24109780 22116609 20542808 19352020 18464337 17806463
12344 17806463 17323703 16999456 16824793 16819518 16978891 17341193 17952452 18867402 20121931
12335 20121931 21793752 24117383 27464433 32456132 40004346 51229164 66009622 80344518
12327 80344518 88991835 92531962 95047512 98609475 101088218 96763546 84836492 71878443
12319 71878443 62454753 55842080 49733256 43795590 39532449 37864079 38340331 39134610
12311 39134610 38598196 37040492 35429660 34204782 32885689 30090628 25910385 22067632
12303 22067632 19317629 17417584 16035012 14983273 14161522 13494029 12965344 12548982 12228120
12294 12228120 12009877 11914335 11949122 12122296 12498230 13136271 14186845 15916627 18672631
12285 18672631 22714766 27354588 30726378 31920952 31792270 31427371 31194855 30104598
12277 30104598 26991514 22832408 19361224 17118779 15941807 15640154 16219230 17887971
12269 17887971 20778909 24185623 26369853 26654383 26020799 25393961 24971337 23757824 20647931
12260 20647931 16736391 13643752 11569869 10161633 9151715 8394095 7790063 7282156
12252 7282156 6840124 6444499 6074044 5739307 5448266 5187189 4948896 4734836 4539101
12243 4539101 4372832 4228470 4104387 3995422 3894204 3814834 3744776 3692935 3682388 3697153
12233 3697153 3733734 3799629 3882171 3969547 4106986 4333083 4698944 5303363 6236398 7443095
12223 7443095 8497707 8963602 8952070 8787115 8669551 8482709 7777655 6574031 5412606
12214 5412606 4566034 3984246 3585538 3297392 3070263 2899829 2741067 2602031 2469320
12205 2469320 2339441 2216649 2117505 2016694 1923884 1840775 1770317 1707130 1643720 1582949 1542544
12194 1542544 1507170 1471910 1433573 1391285 1353136 1319950 1295684 1268199 1241870 1214493 1193647
12183 1193647 1178861 1153696 1118864 1087976 1060128 1034387 1008673 990801 969111 950270 943600
12172 943600 938030 942899 934311 919850 915628 901846 881523 860515 855533 843651 826322 816306
12160 816306 802352 778187 750693 727386 710474 686695 659093 636140 625212 618100 609656 603000
12148 603000 592786 576381 560682 555470 537037 511325 506542 496414 475587 458101 449675 445990
12136 445990 437981 436238 448815 448388 448196 457088 470026 469182 469710 467297 462790 452795 445779 448125 441267
12121 441267 436362 433454 424463 411934 403884 399788 392469 393343 388255 373715 366384 359329 352845 343335
12107 343335 336254 331511 324035 318792 309944 299838 292655 283173 269656 270509 265867 264170 269547 271701
12093 271701 270014 278308 283781 272347 258121 249531 250850 246121 245378 241146 237595 235582 231650 232448
12079 232448 228123 223163 215231 222378 227427 221423 212734 201011 189836 196625 204532 198302 194536 192071
12065 192071 202448 206499 196893 197413 198522 202775 207898 197132 177066 171011 167119 150647 143493
12052 143493 131797 127324 128252 132176 134686 135799 139377 146199 142464 133085 134088 144315 137455 130082
12038 130082 120277 118093 122497 126300 126672 136493 133022 121543 112294 109620 107265 113980 112792 116415
12024 116415 115542 127373 141744 144868 147731 163343 176463 191625 211074 211750 196950 189241 186621
12011 186621 186470 174026 160973 152447 146379 148501 149059 152568 161843 173529 186070 194490 198376 204377
11997 204377 215773 227793 223617 211299 212891 200617 186154 178980 188150 202489 225795 238031
11985 238031 230835 219899 214803 211545 209420 193756 187552 179751 168784 163580 162726 174981 197887
11972 197887 221124 218598 219741 233114 234988 240553 248077 238961 248507 275655 303206 324887 351582
11959 351582 389896 438984 499443 557018 572961 552340 533213 514118 488240 455392 409780
11948 409780 360004 317458 283401 259347 243504 227476 215700 205549 191532 171661 154952
11937 154952 153922 166279 167639 171846 168321 171232 180312 187447 185538 178510 186886 200966 217014
11924 217014 217073 225929 250012 278472 317656 374319 440065 521537 568613 603363 637419 690758
11912 690758 739601 755369 741027 688026 632926 594500 557110 505427 434031 367718 320030
11901 320030 286803 264043 242229 221462 203084 190285 182694 178570 168759 160392 156723 158231 160400
11888 160400 166740 166102 161257 170906 171393 166069 164890 172701 180270 184743 196890 208209 226524 275537
11874 275537 340283 409575 470245 505163 514264 524226 531986 533258 518320 459042 396974 359106
11862 359106 326977 304928 280140 255708 242307 244612 238615 220725 200420 197925 196159 184784
11850 184784 161421 132569 117545 108040 104022 115131 106799 105374 105248 105188 101358 97856 95581 90200
11836 90200 86837 86704 93240 90396 95359 104539 122703 148468 176676 188962 189512 190743 185512 183229
11822 183229 166720 138862 114141 98948 96478 106217 94621 92961 106872 126965 142370 141707
11810 141707 130297 128372 127379 127991 108455 82447 72987 62774 57527 38177 42806 50959 49993 45957
11796 45957 47919 39473 31745 37343 41880 45857 43839 40935 46598 44793 41833 34961 24955 19540
11782 19540 21180 22373 20673 22825 17896 7743 6937 9901 12469 18933 25982 26565 24381 33446 34369
11767 34369 41732 49804 49326 50522 45351 40671 33101 23730 11137 3447 -4305 -5217 -7528 -234 10122
11752 10122 5497 -12209 -7506 5476 9702 6691 973 -8411 -8030 -6824 -18308 -21436 -14065 -9898
11738 -9898 -13491 -9624 -13224 -9135 -7654 -24379 -35853 -33525 -28763 -20351 -8167 -12321 -13883 -3354
11724 -3354 2265 3376 5956 7472 6489 -7355 -2024 -1489 632 3958 8291 13392 8085 4588 -3998
11709 -3998 -7730 -7914 -7423 3556 4595 6569 -4816 -8986 -6319 -837 267 -5653 -9499 -13811 -17312
11694 -17312 -13970 -4794 -3507 -1802 -1832 -8947 -16024 -20612 -27937 -28575 -21549 -18791 -20774 -15288 -11110
11679 -11110 -18272 -10354 -12428 -23219 -23881 -27086 -22559 -23992 -30686 -27364 -23331 -18861 -9458 -7941
11665 -7941 -11944 -16324 -12495 -2657 -8797 -19163 -14597 -14762 -1816 -1849 -2974 -11291 -9415 -9879 -25084
11650 -25084 -24012 -26326 -34301 -26191 -23168 -18012 -14724 -5969 -6724 -5875 98 1190 8018 350 969
11635 969 -4910 -7423 -16822 -30090 -25965 -18610 -17832 -22019 -17566 -9601 -5847 -17682 -16848 -19081 -13261
11620 -13261 -16655 -20067 -6149 3744 -6086 -17670 -24756 -32649 -30684 -12814 -7624 -11314 -5442 -10161
11606 -10161 -20387 -28826 -26589 -9745 -4277 -1014 -8661 -7727 -6244 -13804 -22765 -31808 -30863 -27285
11592 -27285 -14455 -7358 -7444 -6648 -19346 -17385 -11222 -12493 -11108 -11857 -24172 -20282 -14797 -21893 -26309
11577 -26309 -20662 -19664 -28149 -31144 -22616 -21761 -34141 -41149 -34216 -28218 -24572 -32710 -36053 -32129 -21684
11562 -21684 -19199 -23946 -22975 -27841 -28374 -25550 -42403 -42646 -33542 -26849 -17477 -13332 -23454 -22925 -26152
11547 -26152 -31306 -28121 -24723 -22527 -23849 -30959 -27282 -28501 -20496 -17607 -20841 -18929 -14655 -14317 -10172
11532 -10172 -8616 -15015 -25263 -29119 -31372 -19738 -20027 -15221 -7937 -7584 -14377 -17498 -13909 -9393
11518 -9393 -11516 -10278 -6416 -11188 -10920 -7433 -8368 -16601 -28866 -34589 -27625 -27631 -25660 -22284 -22023 -17472
11502 -17472 -14044 -23321 -22564 -18142 -19077 -28197 -27853 -24969 -27000 -24307 -29704 -28264 -16876 -16267 -10550
11487 -10550 -14214 -14939 -17520 -26885 -17281 -13421 -22019 -28696 -27308 -34076 -36086 -31813 -16084 -22400
11473 -22400 -28004 -32767 -33794 -25553 -21122 -20779 -15154 -12107 -8883 -6121 -21153 -30449 -41026 -34926
11459 -34926 -30922 -26969 -25376 -27134 -26946 -28478 -25468 -19203 -13804 -13923 -18854 -24760 -29030 -22869 -30962
11444 -30962 -40226 -32306 -23108 -21801 -16135 -17798 -31702 -31393 -31886 -26842 -20910 -12369 -28012 -36309
11430 -36309 -25801 -6837 -2271 -10337 -11390 -8712 -17299 -23756 -22171 -19450 -18234 -10856 960 6949
11416 6949 3483 -7512 -13008 -19188 -18393 -12217 -5729 -3923 -6505 -8259 -18834 -29709 -27726 -32215
11402 -32215 -36207 -36740 -35457 -28511 -16361 -7343 -9677 -7741 -14413 -7916 -6080 -19448 -28479 -25803
11388 -25803 -26739 -23036 -24641 -25396 -25735 -27135 -16567 -17436 -22661 -23149 -9443 -16767 -26269 -20884 -22020
11373 -22020 -23467 -14261 -14739 -9637 -8249 0 -596 -8006 -17928 -32881 -34431 -26115 -26194 -22162 -12681
11358 -12681 -7640 -7092 -14239 -19754 -14216 -21283 -22706 -13940 -16170 -12041 -10489 -5226 -3016 -2301 -6623
11343 -6623 -11039 -15037 -27402 -31448 -24128 -15937 -21594 -24699 -19005 -6977 -5850 -7273 -14499 -16923
11329 -16923 -25526 -21950 -26059 -21752 -24245 -34287 -33189 -31161 -27327 -26966 -20530 -17967 -18519 -27314 -29449
11314 -29449 -20269 -20782 -17261 -22007 -25054 -23126 -22578 -14794 -15404 -16959 -10664 -21185 -14264 -14271 -27776
11299 -27776 -29014 -21178 -23059 -23835 -20663 -23578 -27248 -29027 -24026 -18314 -16948 -21324 -21164 -14778 -8919
11284 -8919 -14166 -24711 -21279 -5977 4406 -9940 -15333 -7038 -3281 -17237 -19825 -16711 -22987
11271 -22987 -26618 -19228 -12868 -10754 -8431 -8809 2128 8441 4291 -7702 -15096 -15469 -9911 -12792
11257 -12792 -8221 -13600 -18130 -19122 -16115 -22600 -18350 -21624 -18144 -14391 -13053 -21448 -28609 -20506 -14382
11242 -14382 -9114 -6698 -6919 -6388 -6621 -8669 -15000 -8919 -9955 -9644 -12720 -13652 -13299 -19250 -27985 -33505
11226 -33505 -29067 -19180 -25387 -27544 -23583 -30678 -28275 -22410 -25055 -28589 -24923 -25158 -26244 -13347
11212 -13347 -7655 -10809 -15820 -21720 -23651 -19578 -17346 -13599 -19636 -22830 -18646 -18834 -23274 -20788 -23511
11197 -23511 -29210 -29671 -26355 -16216 -4663 -11597 -19047 -7028 -7423 -17952 -22304 -7246 7386
11184 7386 9212 -7584 -15887 -22029 -24827 -30062 -13746 -3728 -8041 -22261 -21883 -26459 -40529 -44004
11170 -44004 -31831 -20957 -22086 -31938 -31237 -30544 -24791 -17215 -13969 -9453 -9981 -9009 -7279 -6091 -5404
11155 -5404 -11433 -12537 -15986 -17108 -20496 -26837 -26945 -30038 -22737 -10739 -1220 1842 -3081 -5499 955
11140 955 4897 1118 -4156 -3199 -1822 -1422 -4204 -11477 -15530 -15516 -16905 -7055 -3080 -546 3588 -92
11124 -92 -13819 -12243 -17658 -28065 -31913 -23085 -10997 -4336 -7218 -6083 -11753 -21764 -30466 -28407
11110 -28407 -17022 -18001 -19223 -20021 -24519 -26168 -23763 -18531 -33093 -36848 -23934 -15145 -14444 -10806
11096 -10806 -1781 -7141 -16002 -19028 -32048 -33850 -26705 -26739 -18433 -9019 -4372 -8775 -22968 -31173
11082 -31173 -25145 -26326 -30190 -15214 -5767 1461 -4151 -10910 -20129 -19991 -22244 -28619 -33585 -29735
11068 -29735 -27862 -25608 -22841 -20473 -10319 -366 3951 -6723 -8616 -9645 -15580 -16454 -11083 -12139
11054 -12139 -17733 -4354 -5508 -6736 -4447 -2985 -9583 -10727 -12005 -11556 -14998 -14242 -7263 -10706 -15925
11039 -15925 -15114 -18009 -19683 -23049 -24982 -21864 -16621 -16385 -23866 -17288 -9036 -8836 -6749 -10659 -13912
11024 -13912 -16170 -17053 -8755 -16611 -26241 -30211 -27537 -21974 -22640 -18952 -11969 -13238 -9584 -2748 -6013
11009 -6013 -7734 -9990 -8815 -14842 -28886 -30991 -29613 -26217 -18895 -18893 -17588 -10046 -7932 -11660 -19347
10994 -19347 -24996 -22773 -13007 -4532 -12498 -14715 -12600 -19427 -32654 -27892 -23369 -12868 -4277 -4040
10980 -4040 -11996 -5294 -4894 -8049 -15529 -17200 -7364 -4213 -6828 -8114 1638 -4314 -4079 -2054 -4062
10965 -4062 -4998 -11159 -9869 -9472 -8589 -8977 -5503 -9603 -17522 -17698 -17134 -13462 -5567 -4647 538 -4340
10949 -4340 -18581 -18051 -23080 -19568 -12122 -15449 -14386 -25591 -27699 -23556 -16475 -8414 -5838 -2465
10935 -2465 -6086 -15844 -14118 -3006 -642 -119 -7609 -21833 -17870 -22548 -30061 -26541 -31869 -28866
10921 -28866 -15463 -18089 -16190 -11294 -10996 -18921 -27367 -24651 -20108 -23188 -22416 -20605 -12698 2208
10907 2208 4053 -7250 -18744 -19638 -12820 -12996 -12820 -23003 -19437 -13673 -13885 -4055 -5660 -18048 -19493
10892 -19493 -23635 -24258 -18783 -19647 -20797 -14007 -25765 -23974 -23374 -16997 -14021 -11173 -10132 -13016 -13799
10877 -13799 -12257 -13013 -6658 2936 -1444 -11664 -23863 -17988 -17442 -17921 -11096 -9766 -4943 -2684 -3003
10862 -3003 -12591 -22819 -28888 -33662 -26018 -18974 -6627 -729 1049 -479 -13140 -16260 -18354 -26893
10848 -26893 -15114 -10196 -18950 -13472 -1460 -2169 -3116 -1006 -4873 777 12355 12105 3436 -354
10834 -354 -1687 484 3502 -6837 -5032 -1196 -6829 -14155 -23302 -30730 -32902 -29378 -27388 -19197 -26260
10819 -26260 -23766 -16782 -12800 -6655 -7120 -11058 -5118 -9882 -22776 -29804 -22495 -20751 -13455 -5506
10805 -5506 -828 282 -1977 -5445 -3583 6122 2118 4198 12727 12794 13164 -1738 -15352 -20832 -20198
10790 -20198 -23999 -27124 -21994 -14349 -8497 -14370 -17729 -11939 -5022 -11192 -12937 -13819 -22096 -19496 4307
10775 4307 13923 15386 15219 14971 2602 -13088 -14554 -9372 -10493 -18783 -18129 -1714 15679 12276
10761 12276 7023 9763 11009 23189 21974 22351 17783 16448 20913 7125 -3595 -13455 -14264 -989
10747 -989 7682 16438 13322 7601 9060 9392 8631 9843 8195 10668 3932 4929 7969 19598 22202
10732 22202 18433 2322 1767 13652 16949 13133 5097 5497 1422 -2766 6748 4344 498 4884
10718 4884 767 -7152 -6148 -835 6385 12406 21409 15410 12380 5271 16411 25560 18549 10150
10704 10150 8886 8053 10084 3045 5571 6214 7634 24447 28768 24127 18093 9078 9420 8193 23416
10689 23416 22539 10542 6096 6856 4258 4372 6305 11298 21038 13468 16033 22971 22362 27287 33012
10674 33012 32198 24726 11677 10721 12571 3816 7054 16300 19642 14344 12935 13631 28026 31343 28009
10659 28009 21627 21689 18108 8783 9304 13226 14632 11651 9655 9078 9095 17148 23578 16836 19010 16179
10643 16179 12519 22646 21775 20485 20756 20559 15711 5093 -134 5593 539 -674 3721 4544 21669
10628 21669 39845 40284 32868 36255 35233 41505 49170 44236 42793 32336 16317 9811 6133 17492
10614 17492 22875 23295 16855 11448 14041 13749 16243 10838 9223 8104 6537 10550 6543 2385 545
10599 545 -951 20133 24694 18693 20872 16162 19232 21248 26004 30691 28380 35242 36136 28669 25337
10584 25337 22271 17899 12608 11132 8651 779 -1415 4175 2031 4928 7427 13780 19726 28479
10570 28479 25211 22486 28202 26134 27035 20664 10068 13404 15963 17038 14211 15458 22296 24480
10556 24480 26934 24227 7551 1084 664 4579 12618 18681 23395 32419 31803 26834 26168 33349 30214
10541 30214 22689 14070 14701 17887 17109 21589 29733 36954 37606 36572 38884 39185 35385 31656 30994 28852
10525 28852 34731 42812 39902 42956 40280 32076 36445 44436 38984 38129 34907 31938 24720 10410
10511 10410 12994 19330 19466 12024 14214 7999 6163 9748 4349 9816 11573 16167 24199 12334
10497 12334 3015 13589 17982 20577 31915 37128 42719 45475 49520 57985 50541 40150 26028
10484 26028 30468 27318 26453 23566 23595 16991 23943 19679 22882 26768 24197 24342 27326 24745 18543
10469 18543 22330 33193 39052 39197 35909 48271 50207 43939 34573 31244 31286 24417 17462 23947 31477
10454 31477 33654 39148 31746 18502 15499 18430 28525 26871 20196 28437 33032 27812 28016 21739
10440 21739 3555 6314 15914 24805 24105 30948 33088 28598 28865 28231 38271 38584 33847 36538 41799
10425 41799 28505 17937 12990 14165 5403 9663 17434 24762 10974 11696 18056 15736 8604 4082
10411 4082 4209 9057 9349 4503 9335 16764 10060 11814 6721 8359 6369 -3231 -2935 12762 9421
10396 9421 20120 19527 15428 25020 30184 27584 33416 27317 31318 26766 12738 12065 13184 7993 11926
10381 11926 2590 1394 4913 4876 6588 7312 16891 11694 8964 12258 13921 13195 12606 21757 15641 9011
10365 9011 12757 26182 22271 13123 10742 9112 7321 8517 11157 11344 9700 11563 10887 4591 4764
10350 4764 2019 -3517 6467 9218 -8726 -8493 1458 11133 13661 6693 10392 10327 7796 15887 23310
10335 23310 29755 23500 17021 12219 13075 18177 19479 20842 23050 10584 8351 16718 22495 17512
10321 17512 18190 21047 23049 28770 32260 20361 13918 21613 17740 8413 9436 17698 22247 11191
10307 11191 4315 10773 24519 28116 17488 11441 9850 11873 12778 10097 16275 19346 13607 6249
10293 6249 17917 27455 21200 19298 16351 22222 20456 16515 1997 1713 10696 7449 9110 15732
10279 15732 8626 7714 16800 18757 6625 -178 -1776 -5509 -8180 -10317 -5558 -982 3545 908
10265 908 4079 3995 9624 16631 20905 22218 15209 10941 1145 384 -2145 -2114 -17810 -22502 -15980 -6867
10249 -6867 -6536 -12105 -11793 -11771 -8132 -8946 -364 -1065 -10049 -12816 -6067 -3993 -4835 -743 1572 8774
10233 8774 7719 3939 -137 -10449 -13892 -9634 431 -4174 -9549 -10785 -7603 -4869 -12120 -7667
10219 -7667 -5349 5882 2209 1644 10626 4298 -3887 -4322 -7956 -10687 -5255 -8368 -8566 -5177 2430
10204 2430 6850 -2356 -3631 2558 -3962 -2401 2355 8122 11040 8830 1260 4773 10601 12154 10023
10189 10023 5986 7081 2943 614 -2499 -1589 -6237 -8218 -9126 -10077 -17322 -16425 -1424 3068 2934
10174 2934 -11845 -18100 -15870 -7790 -11556 -19997 -26250 -8770 6036 8223 15648 19515 20664 20669 21186
10159 21186 10890 8934 17482 17093 19819 16008 9336 7687 4685 9206 8799 13136 19200 13490 19814
10144 19814 20107 12728 2188 4645 5224 -3289 -9146 -13100 -10706 -5782 5591 14370 -4643 -5210
10130 -5210 266 -4789 -5556 -2137 2889 6964 9989 692 -2639 -9098 -445 17924 23448 15730 12676
10115 12676 10181 8293 5063 -4380 -6045 -1842 2258 -9027 -11180 -3208 -60 -6272 -7982 -8296
10101 -8296 -2323 6320 6087 17275 23315 19054 7233 -308 -2506 -3267 2643 10190 10236 8489 -1945
10086 -1945 -4013 -7016 -9499 -4900 -2035 -4164 -8706 -11266 -1191 3553 1478 -1334 -50 3540
10072 3540 8739 10754 8197 11331 10682 4779 5208 15697 10830 15982 16754 25422 23633 6743 5738
10057 5738 16783 18547 16791 12943 12568 -4316 -5307 6788 7408 14111 12050 21441 24390 19338 30086
10042 30086 28287 22463 12048 8745 11054 17747 21205 23308 18816 16157 12389 3787 -5386 -26
10028 -26 5042 -2100 1342 -1098 563 5605 6640 11155 21377 19258 9880 16735 24257 27327 38123
10013 38123 38966 41963 47671 41400 33158 29621 31977 34324 38776 50762 60393 67910 66702 77130
9999 77130 101996 138948 191142 304296 459430 536613 527751 500413 489000 514796 531438 422516
9987 422516 328969 293228 277419 262091 247179 231183 226376 225089 205835 175055 144251 123849
9975 123849 107128 92328 79917 65510 49137 51019 55585 51125 55532 54359 43544 32064 32571
9962 32571 35055 38907 37730 35901 38676 43836 35176 34295 27092 21206 25883 24986 21177 23947 24234
9947 24234 25729 37555 32211 20405 21043 21506 17391 20987 18074 24850 31921 22412 8586 7523
9933 7523 1807 6233 16583 21487 16851 17866 22226 21930 17804 17849 18981 22101 26814 20230 14909
9918 14909 18316 20856 27389 28783 27742 31348 28348 20455 14553 9087 13625 28963 30613 14325
9904 14325 15108 13314 12317 20203 25916 34480 35129 25568 18969 15847 5680 11483 13712 23938 38260
9889 38260 39947 40602 38742 36342 33461 38109 38328 29214 23208 31051 41369 41154 34066 29344 19418
9874 19418 20163 27466 26220 16725 13069 9669 14546 15912 17869 12534 13034 18223 15322 14028 19667
9859 19667 25045 17679 9086 10503 15998 13962 19674 20052 14329 12132 14067 20552 27734 34332 36928
9844 36928 32097 34379 41565 58523 61107 65489 67078 71885 79255 75403 66687 50450 49043 46339
9830 46339 38859 37561 24381 23559 21277 24650 29291 27540 21602 25501 38951 44502 41114 24683
9816 24683 7540 9492 14667 28911 42937 45695 46493 52719 61135 57666 58203 67076 52472 52967
9802 52967 57981 61325 71886 79210 79966 98078 119080 120114 118194 121836 117962 115110 110957 97722
9788 97722 90185 79567 65220 56451 63513 67768 58505 49609 53156 51411 50195 50555 43149 45066
9774 45066 48454 47207 41501 45013 45202 57231 56630 45180 35234 34908 36227 45803 41345 41583 44837
9759 44837 45034 48664 45907 48438 44883 48009 49191 46182 58708 65091 58352 46488 37074 36721 52259
9744 52259 48281 38605 35683 39348 44906 46235 49773 40427 49030 54915 40017 28316 31800 41531
9730 41531 41115 42729 48442 47517 50351 44686 53827 64668 64543 70649 70258 61372 63096 61073 70645
9715 70645 78233 64220 48355 43878 47100 41711 41923 47370 43763 48675 45068 50856 63719 65279
9701 65279 59692 52410 53237 58906 60240 66001 63593 57234 61929 59574 60739 56571 46343 52099 50389
9686 50389 60229 75210 72745 77934 79194 79116 79671 84664 81266 79374 79797 74277 72235 78514 78514 78611 80356
9669 80356 79308 74656 73312 70037 72014 75055 74863 74595 74897 71060 69577 77172 72086 67040 58095
9654 58095 63518 68665 83282 87267 84281 96971 100563 101617 104176 90739 81468 87150 89387 84138
9640 84138 82474 87658 91843 86383 81471 81907 82993 90578 106178 109488 89791 79631 77582 82145
9626 82145 82079 89609 102276 107396 111812 107725 104489 109180 109472 104280 104914 104868 88737 81978 85269 99490
9610 99490 106290 117694 130431 136336 133160 127594 132417 125095 122215 114995 109583 106809 106054 111518
9596 111518 120859 119855 113607 121319 115314 114501 122489 118584 109042 112341 125834 135396 132576 127108
9582 127108 127734 121219 116550 134251 137502 123067 109700 107166 103213 94765 89817 98269 111219 124799
9568 124799 132965 133734 131522 133047 129839 129432 132552 128260 133868 137498 143169 143870 139930 140424 149606
9553 149606 145114 131703 118096 117552 119069 117788 124795 132696 149846 155944 152265 152878 169123 189397
9539 189397 187010 189679 192145 191983 189019 175558 164498 160177 146168 137976 134272 144712 151976 149882
9525 149882 146863 155171 160208 151481 150651 150604 149305 144672 146961 145920 147558 153889 156146 155117 161172
9510 161172 167483 174563 170416 168278 159482 149022 139984 152909 163282 156767 158761 165688 162823 159241
9496 159241 167970 160712 159312 157221 160176 167255 162572 156471 157568 163243 165439 162125 163748 161892
9482 161892 154751 159927 167927 169970 165659 166092 170873 164973 154937 160064 164139 170310 174642 177040
9468 177040 180189 175861 172256 171664 184530 188916 181341 179881 174111 176122 179540 176173 171691 171862 169776
9453 169776 173098 177226 175221 171217 177574 179790 178157 175238 166802 166138 165326 165932 165788 166990 159084
9438 159084 160490 168112 173183 188675 199076 197880 189554 177417 174950 176766 184427 184244 175455 171413
9424 171413 169256 176696 184607 188749 194256 196008 183538 185839 179460 166496 164483 167660 171785 176082
9410 176082 172349 167813 177898 181828 183776 186156 183665 184630 182277 179902 171090 158542 162400 167742
9396 167742 168864 156698 147515 152843 167405 159782 158445 164746 159314 154366 156911 162922 160173 152032
9382 152032 150438 161565 157664 156881 165955 172428 160217 154619 153268 148381 158518 167745 170446 168290
9368 168290 170508 173679 182370 185769 183458 182995 190231 182880 182837 189222 187455 187049 188911 191243 186720
9353 186720 194685 207013 204138 207045 204185 196215 195705 200940 209155 199225 194312 194383 193795 184168 171847
9338 171847 174148 192868 199410 196413 208975 203461 202270 213415 216492 217402 206165 196387 198708 191002
9324 191002 188395 202112 204313 208201 214022 220272 225935 239424 244368 243852 248127 249744 254165 267537
9310 267537 280630 291867 295433 287439 288817 303513 324187 329177 330253 342684 349677 353546 347074
9297 347074 333776 325231 309408 292906 275059 254327 247818 239449 232342 235394 231539 233711 230691
9284 230691 220515 211936 203561 199146 205878 224666 235839 235351 242737 254664 265112 285832 311559
9271 311559 324726 340084 348404 347589 343962 330022 310443 297296 290325 289947 288054 288612 285202 280855
9257 280855 274310 264959 244438 235323 224578 214611 206255 204942 213411 212672 208156 212206 212797 208958
9243 208958 207985 214689 209921 200298 197624 195932 189198 191559 213347 230483 232762 239510 240374 237849
9229 237849 239164 243715 238335 222200 204908 199343 190347 176769 169224 171494 172139 172431 166103 161346
9215 161346 159820 168584 170796 159379 148013 152422 155441 157527 159034 160725 171901 188708 190759
9202 190759 176433 170136 176348 174391 172286 168212 165167 155263 148709 150289 148181 153079 161780 161366
9188 161366 154527 149424 165945 174371 164301 158493 159522 162466 168579 176246 171136 157477 147921 159428
9174 159428 169070 172872 172061 161196 158379 161788 155938 156651 152898 134193 118888 120303 122804 131625
9160 131625 138783 146297 150550 159301 155532 141677 144712 148256 154061 160835 164441 162224 158265 151614
9146 151614 147049 137305 135079 131973 135492 143985 134636 120971 119792 127101 131641 139933 136526 142252
9132 142252 143540 147462 140103 130628 143606 147211 145100 147161 152210 145251 140979 147862 154474 156461
9118 156461 145773 135034 131644 125549 134707 146456 145520 145182 151007 158927 167220 166301 166942 172547 172610
9103 172610 174405 167845 171858 169805 159973 155607 158098 167837 162031 167534 168081 174776 197338 218000
9089 218000 259072 335708 453346 567484 627261 639707 643038 651211 646302 614455 543882 459751
9077 459751 381524 323905 298333 282610 271786 273241 261935 250420 248335 231039 237480 241833
9065 241833 239358 235541 229918 229326 226733 210583 213193 230499 236800 239993 234486 221781 222139 233993
9051 233993 251416 256326 267243 279533 279160 298356 347534 409418 518875 706238 947121 1114727
9039 1114727 1160458 1151158 1155484 1175729 1147634 988509 779317 615979 500453 437747 408724
9028 408724 386493 360030 337736 331833 325211 320874 311141 299499 305112 305390 298570 285782 278857
9015 278857 274986 269320 283514 286004 282409 298178 303160 298147 292394 286019 279301 283639 294649 301415
9001 301415 317820 335508 384964 449346 548249 682017 815492 897664 967913 1078437 1251953
8990 1251953 1464403 1578449 1535799 1453734 1377520 1332276 1281439 1140365 932197 756187
8980 756187 622474 540484 483486 440145 412212 395349 377487 374645 377485 372771 363945 345484
8968 345484 327973 325600 334215 340897 335514 331752 332653 329510 352930 364828 373261 380251 384131 394231
8954 394231 406957 442300 478081 527526 607862 714339 862811 1111590 1482219 1921950 2221209
8943 2221209 2289255 2260934 2236868 2249930 2172698 1838053 1434373 1127065 924878 797707
8933 797707 701051 632279 585980 557793 529928 517320 509393 489250 478530 461073 440592 414767
8921 414767 407331 412004 414760 410636 408266 412834 425316 437891 453862 476530 487548 484806 475824
8908 475824 480262 504200 519022 536495 577028 650850 773455 951885 1150995 1282095 1316601
8897 1316601 1316936 1310959 1311128 1248204 1083520 903622 768972 663975 596545 539390 502510 477442
8885 477442 459572 447942 436803 423950 406786 396299 392271 395851 381176 367439 362154 352599
8873 352599 340692 331905 334540 330614 318280 330867 339928 354102 357420 350507 330675 325633 334695
8860 334695 348067 348995 342037 337203 330881 324799 333490 336971 349329 353788 351674 359219 370614 386436
8846 386436 394623 404796 421856 414778 388212 384548 368187 355885 359387 354703 350455 350910 362296
8833 362296 359080 354900 355268 369165 365873 366252 364941 357787 362002 384452 402573 403629 406810 416149
8819 416149 429807 450094 458569 467313 493230 528326 579138 621259 650671 663947 653243 619889
8807 619889 605352 619543 629503 629801 620975 624431 640612 641865 648029 636880 601494 577238 550007
8794 550007 525361 537589 547890 555455 562308 571888 584269 592712 595393 597402 588748 571274 565184
8781 565184 594550 619020 630435 634720 624941 624820 643156 677224 720197 753156 775805 815216
8769 815216 892373 987799 1093639 1170008 1213957 1212905 1153836 1131453 1143899 1119998 1061369 1020211
8757 1020211 991563 969527 962666 972885 983931 969995 964825 969607 976922 1001576 1030466 1063027
8745 1063027 1098318 1114471 1121186 1151303 1173306 1183286 1157987 1126483 1140563 1205985 1254176 1271701
8733 1271701 1307630 1356106 1436785 1521256 1570626 1602932 1650827 1715314 1781189 1862961 1945542
8722 1945542 2056751 2211612 2365211 2519981 2637643 2725272 2819021 2880597 2905621 2970225
8712 2970225 3056010 3108028 3129791 3190668 3297259 3441889 3604154 3804708 4032870 4304013
8702 4304013 4653317 5089930 5630947 6294320 7017789 7788968 8681054 9790144 11187908
8693 11187908 13012843 15471023 18933398 24049679 32002039 44760192 64028001 85584206
8685 85584206 97723841 99448089 97520862 96215773 96942967 92290647 75277323 55988861
8677 55988861 42106213 33313228 27708887 24024005 21483475 19639345 18326842 17330209
8669 17330209 16543634 16007513 15606492 15129740 14581384 14069027 13679323 13477704 13401090 13314008
8659 13314008 13293128 13435513 13743647 14255561 15006445 16013549 17161667 18412164 19908852
8650 19908852 21855311 24401025 27683981 31994821 38063498 47072456 61099166 83917177
8642 83917177 120285627 165328126 192801390 197043868 192792248 189033048 191455545 187516257
8634 187516257 155716622 115516227 85826864 66870177 54727386 46618181 40981817
8627 40981817 36966016 34074832 31959923 30329845 29111162 28217960 27408604 26511426 25524434
8618 25524434 24573356 23885155 23421477 22887251 22372622 22131153 22195178 22546041 23222505 24189581
8608 24189581 25298352 26531639 28027934 29947001 32317336 35154305 38680041 43466010
8600 43466010 50316964 60324367 75421253 98353651 129489161 161484085 191218650
8593 191218650 226693204 263376118 284078448 285867078 270937439 250380274 235982652
8586 235982652 215269391 176184580 135532163 105786235 86122046 73009982 63948984
8579 63948984 57438130 52634195 49072778 46332893 44014433 41922370 40001811 38314292
8571 38314292 36857176 35493517 34275518 33432346 33014125 33015689 33478326 34201006 34946197
8562 34946197 35911544 37256241 38980274 40994200 43204477 45941055 49832812 55189587
8554 55189587 62392946 72524411 87408321 109963314 145532943 202392249 283066364
8547 283066364 356115664 382873990 381001198 372380019 370979970 374935948 343450004 270324078
8539 270324078 201855041 154738959 124074120 103576847 89291599 78940362 71221086
8532 71221086 65444263 60920439 57105873 53765783 50792397 48127706 45630418 43180498
8524 43180498 40963389 39180546 37755678 36634602 35833231 35220900 34705987 34400651 34328733
8515 34328733 34484511 34841733 35370410 36287482 37886120 40313228 43780722 48853398 56536809
8506 56536809 68504854 87596504 117313797 156063921 187320013 197855897 196429394
8499 196429394 192660414 192045145 189622259 168278098 132275899 100966556 79603886 65545698
8491 65545698 55999833 49256504 44324981 40607292 37775541 35499111 33541890 31801627
8483 31801627 30202171 28737681 27302188 25837151 24437718 23156133 21962711 20872560
8475 20872560 19897580 19006562 18166710 17387809 16651331 15958883 15315535 14709881 14157736
8466 14157736 13666099 13242286 12864137 12499523 12149473 11866036 11636669 11432673 11235765
8457 11235765 11070268 10976576 10893360 10791824 10638912 10433357 10229568 10027815 9749286 9407453
8447 9407453 9069166 8781850 8553690 8371375 8205580 8048622 7923039 7807328 7697105 7575280
8437 7575280 7441090 7286132 7111030 6926761 6726650 6514481 6316404 6119169 5914332 5723830
8427 5723830 5541181 5334121 5104837 4873886 4650267 4441150 4277087 4145633 4044757 4003994
8417 4003994 4015976 4026857 3989478 3945784 3911784 3875626 3816240 3724556 3610186 3487717 3373983
8406 3373983 3270618 3196236 3123940 3035601 2945720 2853365 2777587 2721477 2655330 2582995 2528137
8395 2528137 2487211 2465063 2441284 2419739 2403910 2404893 2421529 2436423 2430394 2403330 2368502 2317344
8383 2317344 2269628 2204876 2106288 2001329 1890452 1793982 1707595 1653236 1614158 1573787 1537290
8372 1537290 1528260 1540534 1531991 1513478 1500425 1480208 1458588 1440503 1413382 1369906 1326399 1311495
8360 1311495 1331745 1335715 1313021 1302285 1301125 1295579 1288613 1268678 1267563 1260543 1225919 1196641 1185991
8347 1185991 1169287 1165699 1173771 1170631 1168959 1170789 1160388 1147601 1132242 1130729 1113478 1090471 1070848
8334 1070848 1065455 1051550 1021859 1006762 986020 968963 962741 952010 933302 923358 927535 921241
8322 921241 905434 895557 892244 880468 874139 861440 848467 834235 814308 806165 807645 802428 792200
8309 792200 770759 750526 749407 754289 752736 735115 725021 719678 719488 717982 707294 703929 711484
8296 711484 723536 723756 725990 730052 730164 724025 705191 706156 695993 687945 684177 693248 719772 764167
8282 764167 839078 939158 1023089 1060478 1059808 1041013 1038008 1024306 969118 868547 760906 698827
8270 698827 656562 611898 579864 556809 526544 513174 512720 499114 482124 471110 465763 469809
8258 469809 487350 479344 462924 465457 461191 448355 456258 479866 484984 471354 457363 469272 491606
8245 491606 512453 526568 529248 529755 545033 588410 646160 722467 863783 1074084 1275002 1361711
8233 1361711 1365315 1335315 1328651 1329091 1240209 1043806 835939 691404 593820 529087 489839 451598
8221 451598 431768 414907 400910 400947 391984 398434 407800 402352 404476 398142 385140 376555 371250 379271
8207 379271 387537 394400 403685 409444 409122 414710 418925 430828 445884 460279 477068 500923 544843
8194 544843 607263 703326 842780 1048577 1331906 1612016 1775723 1811607 1790286 1772263 1742221
8183 1742221 1612561 1356990 1089132 881928 738063 643915 575981 537733 506713 470571
8173 470571 443032 429980 426529 427216 426032 414000 403471 401893 397584 403137 401337 408430 416607 422288
8159 422288 424902 419224 416193 422302 435899 451660 472917 499352 529042 568178 631415 746106
8147 746106 919716 1208030 1632575 2064589 2290229 2325831 2281869 2252934 2252885 2108954 1745579
8136 1745579 1373672 1094875 898293 781281 692765 620947 571592 535387 500363 466311 440556
8125 440556 439086 425223 404366 387525 378682 372736 368179 364719 356812 350619 351443 351528 354654 357338
8111 357338 350239 342690 334530 352392 377487 401223 428179 450615 498581 589130 730333 930516
8099 930516 1126344 1230571 1241337 1223048 1213040 1198408 1109317 936797 770721 657071 582670
8088 582670 530263 495742 466311 440373 423441 407304 400343 395891 400479 408813 403703 397503 384839
8075 384839 366314 352274 336287 317420 300028 284546 267729 252028 246742 258101 261718 261442
8063 261442 257242 251134 238571 236638 243318 255390 261177 262391 257954 244651 251993 253090 262074 274080
8049 274080 273921 285204 313266 351684 393794 445449 501910 549227 577402 606631 626707 629885
8037 629885 623041 589400 542729 482412 429031 393398 364848 338686 319771 287502 265511 254704
8025 254704 250594 250449 239598 234609 240088 244687 240670 235554 241014 245622 246496 236928 227221 224424 237904
8010 237904 246197 234594 222415 216568 226859 245930 283055 339833 393367 440734 469653 477217
7998 477217 477420 487245 481499 455262 408983 370260 340212 316731 290064 264750 254421 242966
7986 242966 233592 225252 199678 190315 190431 182007 187557 188170 177592 177198 179478 181065 178559 173538 163013
7971 163013 148339 153251 165812 165433 156803 149555 140298 144849 147314 146916 153624 150707 138436 132734
7957 132734 124438 122262 134634 147891 144031 145774 149185 147714 134508 128054 128638 136425 145543 138699
7943 138699 137662 134592 122753 119748 122643 129805 133591 140624 144520 142287 141509 143455 137987 129582
7929 129582 134338 136840 129165 121571 121080 119140 110301 111934 108129 100013 105486 107812 101459 95462 93677
7914 93677 91695 82338 72837 79129 87872 102105 95507 89301 97550 93897 98949 106556 97011 92395
7900 92395 101766 110593 119667 114193 99186 90479 98847 103329 101111 100971 104493 108156 105674 114490 115598
7885 115598 101880 94461 96014 92180 80689 81362 82661 86121 89854 95895 100522 93919 88519 82557
7871 82557 81309 86455 94947 81655 66256 67812 72220 74574 79973 72909 71728 76202 67613 70066
7857 70066 74959 80597 79963 70721 63116 67273 65688 66097 70745 61072 56480 68450 65405 61436 66022
7842 66022 73417 70070 66711 72577 72959 68848 60831 48713 56112 55698 51440 50787 57546 69263 73147
7827 73147 72622 64008 56755 58881 54385 49735 44967 40156 41007 51299 55933 54076 48833 46422 36475
7812 36475 32500 41557 49579 58698 65563 64884 62508 57823 56621 65762 59924 49790 58968 56937 47675
7797 47675 49734 52251 58718 56781 54943 48103 53707 57204 60354 61772 65008 57799 41293 33453
7783 33453 36935 35688 41183 48884 47258 37170 36378 34596 39268 40852 38077 42442 45656 47087 54306
7768 54306 48912 46300 54281 53220 51575 51081 54015 57306 55133 54968 58461 53169 56201 52159 43769
7753 43769 45377 41369 38041 40561 47386 58486 60839 52747 50593 55472 56743 54895 49726 48711
7739 48711 45345 40173 37298 30527 27513 33070 27701 30840 37938 37907 32247 33709 35449 41909 49010
7724 49010 42639 44090 36845 30658 28225 34762 29475 28441 21257 28623 32970 38052 34386 35697 30543
7709 30543 26023 21618 33787 43136 35816 27054 36415 37653 27485 27146 33744 41165 42665 40699
7695 40699 36397 28247 13246 8891 8031 20138 35080 37654 41338 39389 40956 47586 47253 46762 53578
7680 53578 47549 43901 36093 26186 19620 5481 -3366 -3183 11198 13273 19108 23463 12082 8747
7666 8747 13577 18672 14826 22159 20613 12628 15192 21414 23193 30285 31282 22318 23653 25177 27626
7651 27626 29605 22884 34741 26749 9280 11414 29478 36350 35125 37332 33046 40889 48410 39170
7637 39170 31310 15308 7099 6927 4036 7592 19158 28865 32385 30148 18821 18898 19548 19673 12819
7622 12819 6265 7817 1957 4057 17195 9857 6817 21478 29036 19892 26909 34540 28851 12909
7608 12909 9013 12143 15556 17765 19359 30049 40246 37850 33184 30417 27215 28856 31201 31963
7594 31963 25768 14927 17179 19053 19002 15557 24019 25010 38949 45538 30879 27229 27911 21204 9163
7579 9163 1343 2420 4726 7391 15601 20698 25010 24955 24572 20871 12348 18275 12616 20540 21818 20877
7563 20877 26690 17297 20582 16479 12384 17601 21639 12431 7491 5959 4957 13729 16475 17628 17293
7548 17293 24258 30257 24746 24855 25535 31172 23787 23021 25536 24339 23362 22049 24083 23997 22180 26626
7532 26626 35629 34662 31671 16626 25619 29323 27505 29111 35005 30536 21995 13779 9750 7903 24064
7517 24064 24675 30502 23938 11128 14065 12446 11809 16331 19346 17239 23505 15972 16055 21423 17782
7502 17782 10693 13897 10865 15792 23156 19391 5965 8235 7860 -2920 -7781 -6867 -1150 2654 11875
7487 11875 10882 12691 21399 29649 23741 28842 34284 25704 20810 11388 14125 27642 29176 28504 31550
7472 31550 32161 24296 8555 6862 21303 26137 17883 13590 2322 -4706 126 644 -6185 -15054
7458 -15054 -13292 -10169 -13345 -12299 -9913 -11919 -7357 -3574 -90 2853 8099 12706 20378 23174 16602
7443 16602 6068 -804 437 7042 2969 4044 1968 -3725 -3700 960 -11190 -10770 -6548 -7123 -4298
7428 -4298 -2143 174 4426 12180 6008 9908 11840 6974 1573 7186 8975 3781 1175 -2975 -3289
7413 -3289 -890 -4499 -8731 -3214 -2512 -8092 -3137 49 840 7636 -985 -10902 -1819 103 5096
7398 5096 13704 16967 9804 10246 6959 3263 -7687 -12299 -8536 -4972 -436 7131 13527 17631 25064
7383 25064 28419 24470 19962 12436 16953 24991 15430 6405 18342 8459 5595 11179 12417 13179 15445
7368 15445 22799 32973 32620 30082 29269 29975 30206 24755 21609 17466 18728 21172 15511 12063 10429
7353 10429 9894 9007 14900 15654 19570 21023 16018 9325 13109 16115 24778 24926 28164 33426 40917 31473
7337 31473 18335 13647 9940 14525 4899 1722 2752 6057 3323 13032 20395 16061 14958 6093
7323 6093 2802 12532 28440 11070 2991 13376 15522 21385 17976 19079 23298 14995 8650 8982
7309 8982 21394 8577 6134 5358 -58 1693 1078 -4478 3686 23226 30749 29421 22279 17423 20058
7294 20058 12659 314 -3102 -5264 2574 18174 40833 40476 37669 31996 31300 22852 20902 21310 19651
7279 19651 -2765 -17737 -16034 -8815 -5336 3224 273 4707 4766 1659 2221 434 437 -4164 -4305 11547
7263 11547 18227 13641 7464 6262 5221 9614 7684 5156 8776 7993 11564 5541 3310 5687 8381
7248 8381 5170 5950 7685 8999 10330 8428 4771 6105 7653 14200 12354 12731 24744 20355 7622
7233 7622 11094 18619 17213 15279 14650 9523 8648 11211 12074 8685 9910 14232 11883 14394 17409 25905
7217 25905 21354 17733 19893 24487 25994 22874 19939 27065 28797 23335 25950 26811 10520 -2071
7203 -2071 395 9704 22289 27187 25594 17987 21973 26067 22083 17495 7144 2028 -181 497 3734
7188 3734 6944 10266 13715 20197 26680 23705 17355 16168 12362 11689 17439 11257 3988 5692 16374
7173 16374 17983 16588 13219 11804 20163 17710 11048 -6462 -5318 7474 15341 8715 7031 2141
7159 2141 -2166 858 -774 8913 16928 17917 17037 17027 17492 17436 20408 12028 3232 -5931 -6183 -2469 1515
7142 1515 16336 10158 2464 3753 8387 6243 6967 17316 24409 13703 15579 14666 17010 19707 13323
7127 13323 10143 2362 -3728 -2463 2511 7544 5252 5010 3166 -1467 4166 6689 12715 6517 9220
7112 9220 15849 17637 17093 9023 8801 10432 12086 13657 19610 19671 12306 3970 -990 -867 7267 4367
7096 4367 9355 11973 6114 -4305 -13687 -15503 -12010 757 6770 1810 7837 10215 13091 -38
7082 -38 -4372 -3958 -686 -1889 -13204 -11766 212 -3495 -5609 -3826 -12551 -17114 -3886 14257 23625
7067 23625 15932 13190 13299 8573 3797 3658 15775 19504 17315 19238 14543 13337 11719 15210 13878
7052 13878 13501 7857 12459 7447 3301 1592 5264 -2902 -1321 7315 19357 21052 15536 11853 15063
7037 15063 21346 26765 28186 29087 21554 17799 18914 17473 16213 8136 -408 -7384 -9318 -1719 -7810
7022 -7810 -13196 -7039 -3681 -6081 -2173 1250 2163 15128 17986 10955 1084 -3929 4680 3532 4588
7007 4588 -1650 4311 3843 2217 1657 1646 -12539 -21536 -19224 -13674 -2567 6425 -3266 -7203 -8279
6992 -8279 -7186 -6826 -2013 11997 7268 3466 1182 -7538 -16592 -10695 -10656 -12294 -10136 -5612 -6223 3875
6976 3875 7271 2708 426 8597 4226 -5033 -11014 -10768 -2239 9907 17430 10238 9394 12966 19546
6961 19546 15247 10038 3428 -6991 -15584 -12938 35 -440 -16794 -7206 6522 5608 -3598 -8944
6947 -8944 -17073 -9893 836 2224 -962 1880 -3044 -1095 -137 -2244 -12051 -1557 4185 15711
6933 15711 17404 6342 -3796 -2533 3494 9672 10977 9558 9890 13489 1174 -2642 -3557 -14239
6919 -14239 -16148 -7924 -31 7720 -3326 -15 6322 -525 -3698 -11693 -13901 -4823 -3129 2861
6905 2861 13197 18905 11474 -15008 -15870 -8575 -461 234 -7102 -699 2150 1487 5820 5217 4092
6890 4092 6868 6702 2057 -13574 -13959 4550 7320 4930 -1649 574 12591 14860 14926 18610 9244
6875 9244 10556 18048 31651 29471 13262 8422 2638 2059 3663 -495 4212 9912 15457 8762 7149
6860 7149 6468 8376 16976 12357 10032 682 -1463 3574 8855 8794 8696 13620 16125 10904 12719 12399
6844 12399 11529 3312 -1168 -8497 -11504 -12037 -10419 2351 13051 7735 139 -3627 -9821 -11051 -7433
6829 -7433 1415 10421 6114 2241 1451 -197 5854 13499 18457 6965 1487 6911 9508 13986 8930
6814 8930 2968 3901 2249 1083 1813 -10778 -8832 -5912 -7076 -6364 -5210 -5554 -2277 760 3281 5403
6798 5403 7413 -1372 2487 3159 583 -7494 4593 10201 4051 -2191 -6131 -2282 411 -1729 -980
6783 -980 7375 523 -611 1562 4373 -1325 -4070 -6733 102 7079 11227 7631 5676 11857 5669
6768 5669 8149 2031 -6740 -11054 -17598 -13330 -6884 -8851 -9927 733 8405 11705 14783 23554 17327
6753 17327 3037 -5746 4817 20818 15805 3469 -1671 -7355 -10326 -3802 5213 11635 12629 10678
6739 10678 13205 25696 35018 30771 24385 5660 3791 10328 13014 19390 26008 17541 18466 15829
6725 15829 -535 -8222 -5035 -8663 -11194 -12404 -6608 -4605 3006 2393 -59 -8688 -1926 7663 2049
6710 2049 -9952 120 4303 -4365 -3136 -1593 -3784 -5207 -6870 -9273 -6406 -16120 -23779 -21059
6696 -21059 -29113 -25863 -10672 -2894 -7619 -12884 -9866 -5584 -2884 -9520 -6271 -962 -594 -3990 -10997
6681 -10997 -9022 -2100 4168 8807 4762 6123 9327 1808 5780 8629 12840 11851 2099 -58 7645
6666 7645 9171 10787 10000 -2656 1323 14139 13853 14111 19472 17101 12788 11306 1890 -3591 -304
6651 -304 -4919 -7623 684 12120 14058 4595 5912 7415 134 -5415 -9808 -985 5562 3438 599
6636 599 -1947 -225 -4982 -7945 -9349 -7000 94 5450 -607 -3054 1869 5320 9105 7756 6774
6621 6774 -843 -3627 -2201 1958 6751 14962 16123 15320 20519 12537 10132 3786 -920 -9086 -11551
6606 -11551 -8759 -11248 -7923 607 9929 10475 21131 25039 16764 13706 16694 4950 2057 -2935
6592 -2935 -8132 -5601 -997 7039 3191 -6153 -8607 -20551 -13213 -8677 -11093 -16541 -10240 -5611 -10687
6577 -10687 -7970 2175 15311 17785 7775 3807 9131 5067 5605 4806 2532 3947 6753 2478
6563 2478 -309 5543 7734 3781 -1381 4410 595 -1882 9165 13417 11460 9585 730 728 1164 -6840
6547 -6840 1329 6460 -1907 -13600 -8111 -7552 -8429 -6935 -11524 -11583 -5305 -2956 190 13533 12981 9305
6531 9305 -2 4375 10172 3853 9261 18515 11856 10279 13092 13845 11423 6561 3508 -2873 -453
6516 -453 8593 14916 3763 3207 1668 -866 -9386 -13924 -6656 -6357 -7287 -7592 -20265 -14098 -3184
6501 -3184 2632 -2908 -9247 -10364 955 9458 3780 -4866 -10514 -5180 -2538 -2786 -15864 -19009 -3312
6486 -3312 -4127 -1528 2486 -7672 -11848 -12018 -6359 -1037 7253 9594 2731 -203 -7635 -13555 -3599
6471 -3599 8539 14079 8502 4542 422 -2881 -7933 -5438 -12649 -6736 4507 -5241 -9465 -8607 -18366
6456 -18366 -22893 -21355 -16030 -11524 -9171 -7857 8046 5096 -4626 -6332 -12583 -25863 -31106 -15513
6442 -15513 -5695 -34 1451 -11189 -21667 -17292 -14609 -4993 -4351 -16257 -22513 -12912 -7779 6361
6428 6361 10474 -2812 -15448 -10119 -10993 -7809 -2498 2408 5815 3688 10009 16495 16528 16106 17930
6413 17930 24404 31124 27621 21962 20880 3288 -18380 -23840 -16992 -16959 -14243 -13761 -18163 -17741 -15695
6398 -15695 -12383 -6208 172 -2242 -8089 -15914 -11916 -17674 -11623 -607 -4828 -6952 -8847 -6389
6384 -6389 -13234 -13555 -8116 -6315 -2533 -2241 7308 9355 2967 7727 7216 565 -307 799 -5593 -4684
6368 -4684 -1013 -4206 -3282 5500 5708 8189 717 -8052 -9141 -9229 -8316 -6017 -246 7061 5643 8344
6352 8344 12598 23527 17747 10966 8956 7704 2782 -3317 2159 1966 5070 2707 -1475 3357 5668
6337 5668 12726 15222 -767 -11115 -3193 -4872 -4589 -5747 -9484 3182 10172 -802 -3175 -13126
6323 -13126 -16813 -2844 6588 1528 -5135 2631 1439 3249 12207 2968 -5607 -5917 -11727 -7890 -11830
6308 -11830 -12925 -15818 -17812 -5656 -6296 -10528 -15396 -15486 -10052 -8599 -1724 1654 -2644 -7323 -3361
6293 -3361 -3853 -5385 559 6177 -1744 -7311 -11573 -7487 -1267 -9398 -19985 -4660 14682 14448 10329
6278 10329 4620 10458 9223 11615 -2250 -10165 -12490 -17899 -21736 -17482 -686 -800 -6368 -4320
6264 -4320 -3954 2582 7978 3486 -5982 -8597 -7780 7741 -501 -9729 -11390 -10761 -10459 -6935 -4329 -1654
6248 -1654 -10208 -12385 -6959 -1093 -3380 3600 10230 7809 12715 8530 7090 8151 908 -3002 2435
6233 2435 9680 -10052 -14398 -5326 -2612 -3736 -7352 1710 162 -8168 -4490 -7650 -16951 -7514 5110
6218 5110 -4614 -12486 -15661 -12962 -13929 -11746 -7345 -5186 -15007 -21108 -15256 -3316 -768 -2479 -12623
6203 -12623 -17583 -13171 -12863 -9767 -7649 -13940 -12652 -11294 -2991 -7043 -9379 -9369 -6515 -5337 -7236
6188 -7236 -13990 -17226 -17786 -14741 -16502 -9483 -2784 3438 262 -2731 -2572 -1733 -123 221 -12627 -23850
6172 -23850 -21633 -18431 -24549 -18118 -11122 -11612 -11763 -7105 -2518 -3438 -12691 -11256 -7481 -4250 -6162
6157 -6162 -13214 -12596 -5163 6790 6653 1891 -4800 -446 -1567 3857 13629 5085 -2637 -4206 -12251
6142 -12251 -18751 -11440 -2941 -4884 -8205 -8882 -9459 -5443 -5850 -12979 -12912 -14235 -9871 -13133 -4518 -2369
6126 -2369 4217 9470 10096 1850 -9798 -13448 -1669 11516 10297 -3912 -12621 -7151 -7500 -13687
6112 -13687 -6014 369 -1222 -1893 -1276 5625 89 -7877 -9578 426 3032 7694 9662 13254 14299
6097 14299 7873 -6586 1263 5098 7853 14318 12054 7226 3611 -2349 -5264 -6355 -1885 -2631 -6112
6082 -6112 -4859 3306 3767 -7251 -17406 -17495 -12063 -13476 -17721 -14654 -13665 -2809 10843 14897 6694
6067 6694 2288 -7365 -15917 -19346 -9770 3831 6603 6415 6717 1277 1827 -55 -10527 -2745 12364
6052 12364 12405 5418 1966 -5404 -8766 -13421 -13709 -6932 72 -4533 -11639 -9288 -4876 -143 9700
6037 9700 9516 -6385 -13008 660 8082 601 -13042 -25483 -21187 -11479 -3561 8553 8899 4262
6023 4262 -542 1391 -12058 -9684 -13086 -23093 -30440 -26797 -17519 -8563 -11337 -6664 -1357 -1013 717
6008 717 12545 15103 3961 1124 -105 5775 14582 9275 8434 5455 -6780 -12190 1472 4059
5994 4059 8685 9381 7891 -158 5980 5280 6913 -4360 -8651 -7795 -8441 -14160 -19987 -23866 -20788 -16259
5978 -16259 -12887 -2166 10081 15336 14672 12399 15443 11872 2719 7393 12280 868 -12682 -13033
5964 -13033 -7796 1865 4927 16652 1115 -22434 -27986 -25441 -22865 -19209 -20796 -21928 -22631 -21763
5950 -21763 -19162 -9400 -3694 -12189 -16609 -2547 7665 9170 4860 2673 -8243 -18821 -18823 -12052
5936 -12052 -20198 -21148 -12655 -2792 2943 1045 -2770 -10044 -6089 -12123 -16788 -7187 -4019 -16326 -21004
5921 -21004 -18639 -26843 -25329 -11283 2269 12795 9164 -2164 -7656 -7723 506 6222 8623 14162
5907 14162 23421 24027 21201 17603 13309 6494 -7092 -6843 11648 12483 8651 4685 4750 -2240 1663
5892 1663 8475 3786 -8153 -11700 -1852 6876 2070 9007 13046 1057 -1034 528 5983 -1248
5878 -1248 -5012 -6189 -8079 -3866 1392 -2229 -888 -13156 -19842 -21784 -29296 -29129 -7316 863 -8467
5863 -8467 -5371 -3294 -5794 -3888 12279 17405 17383 7683 6967 1737 -2754 -22098 -24556 -15726 -8009
5848 -8009 -7885 -11842 -2287 -2620 -6381 -4945 1500 -747 -12135 -18526 -11776 -968 5343 6479 -6123
5833 -6123 -15351 -22649 -19049 -14186 -13492 -2639 -6972 -9191 -1803 -1659 195 1887 2588 -3348 5720
5818 5720 6692 8240 12679 12165 7557 -2509 -9767 -20149 -25993 -25769 -19258 -7052 -876 4686 14103
5803 14103 16439 5753 -763 1389 6514 7470 -1212 -3189 5623 8888 12408 12781 5832 8019 -329
5788 -329 -1809 -7047 -18621 -22810 -14098 -9535 669 475 -2222 967 1986 -365 6838 12123 6706
5773 6706 4679 10004 5623 1701 4482 -351 -5357 -3085 -4014 -3376 2377 4777 -1773 -12232 -13890
5758 -13890 -15081 -2628 6515 751 -2374 -2586 6867 11744 15138 12096 7877 6997 8229 510 -5598
5743 -5598 1523 6428 -625 -18576 -26688 -15327 -8968 -9856 -12124 -11614 -12321 -16148 -26942 -23086 -15390
5728 -15390 -10851 -6714 -11109 -7882 -4803 -8647 -21445 -23667 -9724 518 -6237 -9606 -7081 4180
5714 4180 15530 8919 145 -13333 -12449 -7515 -7370 -4484 1180 3469 -1123 -6258 -2420 -6024 -17107
5699 -17107 -8123 -13023 -22007 -23309 -22579 -23586 -24336 -19623 -10968 -131 2030 2229 -3319 -9503 -8094
5684 -8094 -7608 -4789 -5705 2076 5342 5241 -7049 -9887 -9495 -16446 -25423 -8371 -775 -5340 -15799
5669 -15799 -20667 -15392 -2662 832 -7437 -8091 -69 -7769 -13752 -16012 -13501 -8280 1091 -2397 -3342
5654 -3342 1801 13429 11326 4050 3718 -2611 -6849 -12183 -14951 -13015 -6267 -8555 -5818 -5094 -587
5639 -587 -1999 6376 11517 10060 9330 13378 14239 15017 19921 14929 8136 19002 25250 28214 22924 17252
5623 17252 12636 23050 24720 16482 1173 -11566 -13182 -10463 -10466 -20249 -10970 -8805 -2715 5481 3549
5608 3549 5064 3664 12391 11670 19313 20177 18811 14429 -745 -4250 -1227 7460 4374 3113 -5898
5593 -5898 -8992 -19970 -17225 -8088 -3424 -1824 -2090 -8001 -8583 -8031 -16290 -12359 -6795 -3889 -11908
5578 -11908 -14661 -12106 -9209 -11255 -9729 -8683 -12553 -20149 -16212 -5581 -8090 -12975 -9487 -9744 -12597
5563 -12597 -8796 -6351 752 5605 -9552 -17439 -3715 -859 -16508 -23814 -14346 -3545 -13959
5550 -13959 -24893 -16830 -16533 -10904 1128 3565 6367 -3311 -4416 -4158 -7576 -4363 3635 -7256
5536 -7256 -1203 7426 7989 5686 1141 8845 11144 8772 -6430 -13351 -8658 -2697 -7331 -3657 -2135
5521 -2135 -260 -835 569 3785 -837 1479 6500 12056 7583 520 3852 14603 11133 9196 8593
5506 8593 9777 3387 5395 9516 1053 -1363 1602 2442 4780 11936 6830 2926 3365 4649 14434
5491 14434 15283 8883 6259 4137 1779 -7197 -9968 -7728 -6951 -8303 -8343 -12647 -19246 -19113 -9102 -3776
5475 -3776 -7173 -4031 -2453 -2102 896 385 3841 -2109 -8168 -15947 -24893 -32788 -34735 -28398 -16210
5460 -16210 -9468 8407 14715 6106 -645 -13818 -18939 -16684 -11946 -12342 -16805 -10343 -2167 3306
5446 3306 10393 14026 11895 5080 -1505 -159 -1290 -511 -4766 786 13278 17658 14158 5461 -2755
5431 -2755 -7963 -11586 -8320 -9185 -6826 -7997 -6405 2352 5618 4897 -2256 -5144 24 3515 2527 -2545
5415 -2545 -11092 -7715 2536 4081 -2259 -1225 10557 7732 -4718 -11202 -15305 -16519 -5364 -6807
5401 -6807 1189 2211 -11423 -16617 -14517 -12166 -12639 -9917 -5687 -4661 1232 500 -6653 -2307 -3806
5386 -3806 -7348 -5538 -4570 760 -1821 1437 3888 553 -1436 842 -5958 -10167 -17352 -15234 -8181
5371 -8181 -6174 2963 6775 482 -14397 -13663 -7773 -5365 -2084 -8060 -13957 -11591 -17060 -20813 -9435
5356 -9435 -5651 986 505 485 -3521 -5695 -3390 -4648 -5403 -5630 -18694 -21615 -14940 -10701 -8320 -19836
5340 -19836 -22063 -12627 -17773 -19245 -7337 -7780 -6643 2844 10332 1631 -3898 -10878 -16437 -11068 -2875
5325 -2875 -7238 -5545 2727 709 -3215 929 -4968 -11285 -2232 6134 1853 -5451 -5211 -5958 -3663
5310 -3663 -3075 -1068 6701 6414 1384 -1908 -1112 -13412 -15795 -22580 -19392 -19311 -30568 -34535 -35213 -22019
5294 -22019 -10714 -6932 -10674 -6837 -3801 -9726 -6872 -10489 -19249 -12238 -4029 -3724 -11099 -20923 -23851
5279 -23851 -20552 -15286 -7669 7218 13448 10574 6786 8457 7920 3253 5364 4904 4787 -3004 1861
5264 1861 12039 12534 5066 4397 1916 7428 1085 -4296 139 -16548 -18552 -19892 -15012 -20842 -15575
5249 -15575 -12194 -11579 -9239 -11980 -21642 -20053 -20395 -22818 -14075 -6590 -15688 -16716 -12744 -346 7737
5234 7737 3415 2631 12933 6348 -4012 -55 9872 5313 8724 11 -13660 -4806 -8812 -16277
5220 -16277 -14371 -11388 -10727 -4724 -4248 -817 3445 -4828 -13999 -7271 -12181 -22261 -20835 -15425 -6214
5205 -6214 -2170 28 -3345 1947 6983 5927 -2710 -399 5059 -3150 -7160 -8192 -5939 -10636 -6960
5190 -6960 -4438 -4016 -5506 -12744 -13917 -11398 -7055 -5849 -15205 -9695 -6030 3676 4701 1119 -1412
5175 -1412 -12013 -4387 5577 1831 3372 8117 7922 4844 -2797 -15475 -5579 8886 8157 -752 -8670
5160 -8670 -5317 -3040 406 5483 3412 -4510 -14412 -26443 -37397 -34091 -15311 -10081 -2268 7086
5146 7086 5974 2558 1788 -6475 829 -4019 -11170 -8226 -7479 -5382 8869 4178 -9904 -12564 -17648
5131 -17648 -19150 -4932 -2012 1343 4604 2426 -3304 -3492 10868 9066 6338 3173 2027 6461
5117 6461 2963 6942 12665 13664 5430 251 1713 -1270 968 7925 22078 18846 18774 19502 7635
5102 7635 7691 4538 5234 7429 741 -15196 -21208 -12236 -5418 -10972 -8395 -7410 -4621 2417 -582 -2070
5086 -2070 -2889 -2424 -5247 -1674 -4404 -4942 156 1451 7780 4508 -4500 -13186 -7024 -5067 -4106 -10080
5070 -10080 -4618 -270 -6788 -7834 -5489 -8469 -7622 -3540 -5683 -12883 -14253 -7246 -7362 -11715 90
5055 90 7130 2759 -880 -12726 -19205 -17283 -23556 -17466 -10364 -8245 -2477 -1067 -12366 -15532 -4412
5040 -4412 5914 6119 5602 -2343 -5041 -7321 -8597 -7450 -10077 -21691 -14058 -13446 -17912 -10031 -14081
5025 -14081 -16845 -13772 -15280 -21815 -24967 -15362 -8633 -5696 -4267 -16251 -22262 -14062 -9027 -9151 -4264
5010 -4264 -11226 -14890 -9085 -11294 -17327 -22996 -14565 -6335 1014 729 1055 4376 214 -2165 -10023
4995 -10023 -13341 -12954 -5110 1459 -11482 -15859 -17277 1378 7729 2705 2910 1825 -1949 491 49
4980 49 -2141 -2191 1670 945 -6899 -15278 -10944 -11367 -14326 -12976 -23565 -27256 -11828 961 8403 14065
4964 14065 1560 2320 3303 -5261 -2146 2 -3253 -4513 -585 -5784 -6224 -5612 -6926 -2057 -2263 -1973
4948 -1973 2304 -2650 -7860 -3301 3313 -2611 2520 -4840 -16262 -15559 -14634 -17696 -22986 -26902 -17609
4933 -17609 -10486 -25007 -29843 -26107 -17532 -15216 -14239 -1741 -4997 -5681 -11244 -10732 -7301 -20510 -16436
4918 -16436 -3258 -3112 -10512 -13171 -10996 -3764 -12038 -22700 -17965 -11028 -15154 -15751 -8114 6275
4904 6275 11030 14109 11446 11781 11914 4384 -4220 -7296 -4891 -3028 234 -601 -157 -4700 -13153 -17825
4888 -17825 -13978 -5355 -5112 -11854 -14697 -19741 -29527 -41308 -34045 -17805 -14236 -14986 -16843 -16751 -15973
4873 -15973 -12600 -1794 18000 19132 15013 -2661 -16627 -14529 -5381 -11112 -13287 1094 18762
4860 18762 22111 8423 -5174 -9880 -350 9076 3153 -8799 -22128 -31331 -30717 -7376 3956
4847 3956 10276 25026 19469 8749 6095 7616 6305 3197 5645 2055 -799 -3579 -6427 -5666 4170
4832 4170 8443 5992 -3119 -7123 700 2148 816 3216 -8198 -2066 2435 -3959 12707 9875
4818 9875 7323 10162 15877 11813 -6182 -11450 -9361 -14641 -18152 -12762 -15679 -24155 -17907 -9808 569
4803 569 3958 -78 -4074 -9182 -9842 -14540 -20965 -22329 -14118 -10004 -6296 -465 -881 -7239 -15464 -8526
4787 -8526 9637 5381 -7962 -20505 -19309 -16088 -7717 5366 17002 9345 8626 14035 8648 2829
4773 2829 15582 20367 26268 26811 18765 7617 14352 23413 23249 13174 15065 18538 21122 22147 11234
4758 11234 -8294 -14460 -3847 502 -7606 -7029 -16616 -16505 -13426 -9710 -5270 -248 1122 -3524 -11338
4743 -11338 -12918 -19065 -21910 -10041 -6969 -5929 -2240 -9346 -17147 -9470 -5087 -4265 -7898 -10461 -10948
4728 -10948 -4328 -426 8387 15500 10686 6226 13219 22318 21322 12401 3249 5086 11792 10232 -9193
4713 -9193 -20421 -11618 -10817 -9998 -17884 -21798 -14163 -7533 -15486 -10382 -2857 -7789 -6764 -4517 -2344
4698 -2344 -9867 -22458 -19957 -12111 -18754 -21518 -14571 -13521 -10157 -19169 -8750 -7445 -1231 -11554
4684 -11554 -21922 -13568 556 5080 7266 6235 9228 23104 29464 20379 10844 4040 -6929 -7136
4670 -7136 -7972 -10283 -11582 6788 174 -16764 -22523 -13401 -3496 -1108 1352 -7623 -14703 -21646 -23010
4655 -23010 -23527 -27247 -34519 -32244 -20518 -4505 -8334 -11204 -14758 -15345 -28257 -24809 -19042 -17030
4641 -17030 -29413 -34767 -33207 -16505 390 -771 -13041 -16726 -18595 -19594 -21403 -28015 -47707 -49608
4627 -49608 -40176 -22442 -16301 -20000 -12554 -7232 -8766 -14809 -14157 -22227 -17868 -10149 -1754 -1479 -6218
4612 -6218 -4474 3451 6183 -4087 -15269 -13349 -16782 -11413 -8646 -9813 -4119 1215 1976 -8327
4598 -8327 -12688 -12584 -8613 -8797 -16548 -14215 -16039 -26853 -29005 -31370 -25653 -24140 -30230 -21370 -16467
4583 -16467 -18841 -21775 -29515 -27645 -24823 -19230 -6324 5923 2246 1048 -2771 -7176 -11396 -26823
4569 -26823 -38646 -33102 -24036 -22984 -19978 -10817 4086 10478 -1727 -7602 -6948 -572 -4360 -15210
4555 -15210 -22493 -12669 -5437 -2103 -1460 -4458 -12331 -5315 -2481 626 -32 -1020 -7371 -11650 -14886
4540 -14886 -11097 -12501 539 -5045 -5363 8112 20310 12645 8351 -1259 -240 -2835 -13815 -16274
4526 -16274 -16001 -17355 -14630 -9820 -13276 -18695 -5917 2310 2107 -7421 -10867 -126 -419 -4673 -1435
4511 -1435 -7092 -13011 -13534 -13775 -7366 -1383 846 -2830 -2408 -4503 -7524 748 4922 -5390 -3878
4496 -3878 -1329 -5751 -18977 -16310 -7986 4088 1095 -4139 -4675 -3864 -13255 -17658 -12594 -3082 -6849
4481 -6849 -7181 -5361 -3241 -9586 1506 12429 2282 7607 3855 -11306 -19454 -19279 -20507 -20176 -11286
4466 -11286 -7276 1452 2990 -5343 -12992 -7851 603 1306 2980 -10434 -6159 5261 -142 -1354
4452 -1354 -8505 -5596 -10434 -7941 -3443 -2182 -825 -4542 -2768 -829 -5334 -4525 518 -4859 -2010
4437 -2010 13187 4956 -13942 -20567 -11744 -11828 -2766 14109 11090 556 -858 -961 -170 4033 1295
4422 1295 354 -2219 624 -973 -4619 4557 11503 12987 12541 10300 3834 -375 -2055 2477 412
4407 412 3563 12048 6656 2664 -1753 -8035 -5002 -5597 -4568 -4937 -13544 -6348 -16213 -22652 -18498 -14941
4391 -14941 276 16249 -3794 -10072 -5671 -8201 6204 6848 -6331 -21120 -25406 -14126 -2554
4378 -2554 4847 -15821 -14678 52 3759 3358 7499 -6242 -15887 -2317 -208 -10840 -17418 -19296
4364 -19296 -24968 -23875 -23977 -10163 -9290 -10860 -9916 -9701 -12432 -21135 -21588 -12183 2961 -2870 -7135
4349 -7135 -2019 -57 -3592 -14014 -6859 -10448 -11407 2701 -771 -3175 -6087 3794 4967 5564 5108
4334 5108 -10197 -17518 -16441 -8179 -21740 -24760 -19429 -8318 -5867 -5952 -1946 -6713 -11791 -8097 -6316
4319 -6316 1867 12254 10897 15278 15652 1550 -1620 -4340 -10383 -1323 2238 -3959 -6605 -917 9444
4304 9444 6711 -5004 -10578 -6217 6869 7447 -2169 -3445 -9026 -7714 -98 -8984 -22268 -20046
4290 -20046 -14103 -13737 -17876 -20114 -18624 -15230 -14892 -15251 -10717 -3884 -2961 2360 -148 -3960 -2260 1183
4274 1183 -5223 -7091 -3588 -4927 -11065 -11707 -9309 -11253 1143 -4191 -8335 -2174 -6663 -7615 -4246
4259 -4246 -2765 5781 7200 5540 -489 -10358 -11744 -14984 -15270 -13817 -4966 -3723 10186 11010 10565
4244 10565 4451 4479 3276 -2552 2994 -4013 -72 4181 -2519 -2441 -4948 -9834 -14840 -18905 -16099 -4946
4228 -4946 -11917 -16217 -12793 -6088 -5255 -6392 -12819 -17736 -13656 -4699 9491 5523 1002 1486 -5856
4213 -5856 -3702 -7075 -17022 -6300 10027 174 -12331 -18838 -20108 -10537 -15713 -17202 -21900 -24254
4199 -24254 -20591 -16098 -18985 -13880 -12352 -20019 -17027 -7262 1716 1892 11295 8432 -10107 -9958 -9738
4184 -9738 -10062 -22094 -21204 -20379 -25545 -27738 -29178 -26268 -17100 -4235 -7502 -15117 -10568 -5157 -379
4169 -379 2044 -2260 -2729 3696 -2683 -16805 -13800 -13832 -15135 -19586 -24290 -21470 -11877 -2221 -297 -3926
4153 -3926 1649 440 9533 7533 1406 2743 3969 1424 756 -6275 -3561 -5875 -23241 -26766 -18965
4138 -18965 -6331 -352 1433 1410 -4847 -11932 -9327 -3043 -7095 -14925 -5589 -3996 -8154 -7930 -14834
4123 -14834 -19286 -7276 953 2498 721 -2213 -7440 -15089 -4676 -7811 -13442 -10223 -3112 2523
4109 2523 -166 -7870 -13094 -12243 -9099 -1705 1950 3052 -3518 -8118 -1755 1606 -4077 -7578 -3486
4094 -3486 2593 12824 14324 7209 5661 4084 -2337 -17062 -20377 -17331 -20753 -18439 -18647 -4846
4080 -4846 5808 4596 3313 6926 -2885 -1774 17389 26592 19710 8430 -101 3815 11828 552
4066 552 -8239 -7365 -5692 -9497 -7808 -8637 -3282 4628 9749 1063 -5423 -9571 -3289 -5542 2054 -1926
4050 -1926 -6185 1037 3828 10091 6875 4181 7441 -6745 -14445 -15619 -24533 -27918 -29220 -21053 -4764
4035 -4764 -2552 -4173 4439 1189 1616 -5305 -5176 -628 6225 4329 -6263 -12220 -16149 -15176 -9798
4020 -9798 -2746 -2691 -1869 2208 -2340 4760 2505 3059 11474 6697 6566 13453 15403 14238 5867 -1084
4004 -1084 985 -6113 -9971 -13476 -13229 -17320 -18762 -4252 -3142 -7316 -4258 -14957 -26105 -18079
3990 -18079 -16172 -16947 -17583 -13007 -332 5278 9674 11625 10350 8110 -170 -7359 -55 12537 14461
3975 14461 10351 381 -983 -3157 -2942 -6360 -10873 -2616 1300 -11043 -10152 -20271 -17127 -18998 -5901
3960 -5901 -414 4388 196 -5725 -9783 -4854 9338 15121 5816 -12194 -10829 2095 -320 5046
3946 5046 10362 730 -9619 -5885 -358 -4230 -4450 -13602 -9834 -5684 -12437 -11592 -4241 697 -7472
3931 -7472 -10028 -9461 -20248 -19109 -2362 941 2479 607 2739 4341 4773 -672 103 -3764 -5829
3916 -5829 -7300 -1335 17150 23772 13271 8245 10559 16288 17339 4605 -11290 -21931 -28387 -21980
3902 -21980 -7252 -8193 -16690 -17703 -19351 -11043 -4325 -134 -297 -11726 4244 15864 17593 13597
3888 13597 8981 5563 6572 -277 -4872 -1505 544 -1444 -417 -154 -12037 -21326 -11847 -21083 -25632
3873 -25632 -27373 -22934 5582 20416 12059 10260 11775 16864 33083 29497 14920 7173 -6390
3860 -6390 -21184 -12268 -121 -712 -4472 -10255 -15853 -4687 864 626 -4251 -6123 -2879 -7816 -12455
3845 -12455 -21109 -21144 -12355 -7407 -9364 -11466 -19948 -27992 -25087 -20437 -3707 6828 -882 -10877 -8878
3830 -8878 -6399 -14348 -23402 -28561 -26101 -14229 3869 14543 17610 21183 22650 22911 23414 29764 19489
3815 19489 10327 7243 -7822 -7890 -6783 -7902 -1532 6150 4085 2507 8899 2429 -5014 -11102 -15989
3800 -15989 -17958 -17346 -8867 -4713 -1234 -6351 -17209 -18556 -6168 -8307 -9430 -7103 -854 -7393
3786 -7393 -9651 -9030 3356 13001 9114 5007 5680 -2054 -2943 8713 10014 19739 17640 10894 13122
3771 13122 18606 1732 -8020 -12055 -19711 -17603 -18076 -18241 -6844 242 4427 2467 4079 -2685 1125
3756 1125 2525 -1709 -5811 -1838 8922 10175 1624 -5510 -2724 -2281 -6175 -6568 -14801 -5535 1444
3741 1444 -4902 -595 -8335 -8273 -1165 -1613 -4076 -5503 3103 12375 14003 15852 9680 186 -12084
3726 -12084 -13150 -15928 -17741 -23966 -30251 -30105 -19189 -7467 -1347 -6271 -18863 -14413 -3875 -4816
3712 -4816 -3401 -5590 -5470 -8582 -11902 -5946 -6871 -3887 362 8418 5994 1408 2096 -3474 -13030 -22780
3696 -22780 -28294 -29855 -35278 -34785 -28052 -16783 -16594 -13499 -10121 -9784 -3933 562 -7796 -21780 -21934
3681 -21934 -27919 -29331 -28959 -12781 -10935 -8528 -14375 -21594 -12699 -10053 -9789 -3673 -12646 -4378 -4520
3666 -4520 -7047 -11651 -15445 -4927 9940 11069 5821 -3514 -5377 -11820 -3388 -1436 3972 7483
3652 7483 6379 -2665 -12782 -12675 -8709 -6805 -4165 2833 1191 -692 -5742 -9482 -6574 -3052 -3913
3637 -3913 -5625 4545 3328 -1391 -1714 -3685 -4876 5288 3242 1401 -727 -4804 -44 993 -1047
3622 -1047 -3745 -2686 -3980 -13937 -13050 -10137 -3353 3369 -5716 -16711 -14204 -4480 -3431 -6651 -1832
3607 -1832 -6369 -5739 -6768 -8918 -5773 -8990 -12092 -10542 -2855 -3228 -15322 -16992 -12751 -19805 -17399
3592 -17399 -17467 -6572 11996 5036 261 7867 18627 13626 -5116 539 6205 5585 4464 11569
3578 11569 8479 10001 8385 7081 7756 14418 15552 11150 7487 769 1738 -2653 -11221 -9993 -7781
3563 -7781 -15112 -21659 -25439 -16079 -8718 -8443 -15868 -9375 -3766 -361 -4663 -12749 -13922 -10225 -12437
3548 -12437 -12827 -6992 -8001 -4927 -9782 -19108 -11052 992 7305 2449 1800 -5530 -16785 -23809 -16643
3533 -16643 -7930 -924 1761 -899 -12300 -25286 -20464 -13231 -2242 673 -1333 3566 3776 -1208
3519 -1208 1927 10218 4737 365 11273 9058 7904 6483 -1325 -2195 4602 4932 3905 -7581 -16423
3504 -16423 -6436 -4064 -8057 -10955 -8573 -9782 -8645 -6674 7143 9867 8884 7861 -4783 -1725
3490 -1725 8036 10392 10439 9751 3484 10606 14660 21038 18435 3658 -9472 -5231 -8296 2188 14265
3475 14265 13750 2382 768 147 -7926 -14803 -14460 -21940 -21790 -18720 -11990 -7319 -1638 -2519 -7223 -4143
3459 -4143 -2686 -3588 -10376 -12732 -14016 -15924 -21166 -16265 -6333 -7207 -12243 -24722 -27461 -20916 -12279
3444 -12279 -11457 -18187 -17674 -7093 -1720 -4997 -7637 -10544 -5508 -10623 -13558 -12703 -3156 -4792 -3651
3429 -3651 -1414 -7881 -17381 -13510 5259 5311 -4387 -8308 -1969 -103 854 -6547 -9094 3081 9834
3414 9834 11339 2943 -2588 -1203 -2654 -5126 -646 2309 -11346 -17152 -14023 -3331 10737 13122
3400 13122 11445 10282 11358 8325 -2597 -7638 5494 12971 9819 -1139 -2855 1232 5175 -673
3386 -673 -2244 -1675 2496 3303 4265 14319 18162 11852 6846 11584 -2361 -9299 -14151 -10452 -4340
3371 -4340 -11186 -12859 -2077 2694 -10397 -14332 -6645 -4781 -1868 4732 5022 6290 -1243 -8703 -6485
3356 -6485 -11053 -16700 -17513 -13407 -9231 -15715 -14550 -6291 -452 6801 1536 -8043 -16901 -11639 -14363
3341 -14363 -12847 -13435 -9444 514 -627 -1855 -506 1703 33 -6842 -5468 -3150 -5095 -1650 152
3326 152 -4812 -18799 -25808 -27653 -20048 -13871 -18589 -27434 -23327 -10850 -5312 -8137 -11554 -11859 -10774
3311 -10774 -7644 -8099 -8147 -18137 -23173 -10303 -11616 -11561 -13205 -11411 -4214 -54 -859 -9149 -14384 -12787
3295 -12787 -14392 -23398 -23026 -16113 -7728 -8019 -4239 -4399 -11336 -18525 -12072 -2026 8894 3512 5823
3280 5823 -68 -3908 -9486 -12027 -7768 -5963 -15229 -11822 87 6999 -5369 -11123 -8196 -5547
3266 -5547 -4293 -4493 -6185 1778 -2971 -7769 1910 -2030 -14309 -9353 -8249 -4838 6183 4439 5878
3251 5878 6395 4411 740 -6428 -7624 -21502 -22529 -22400 -6758 7696 -4055 -9581 -8665 -8855 -7384
3236 -7384 -9128 3145 -1185 -7471 -3323 -8950 -10289 -12149 -16652 -12898 -13708 -14685 -11937 -8625 369
3221 369 8223 11166 11971 3974 -4007 -7267 -7355 -170 4608 11387 6420 -7872 -10946 -10712 -1745 5863
3205 5863 -3139 -2733 8 -1243 -11366 -16956 -7049 -3075 -12354 -15336 -489 218 4235 224 741
3190 741 11348 15983 -2595 -6220 -2341 -12652 -12887 -8690 60 -3819 -5402 -5664 -1060 1148 -1380
3175 -1380 2409 -1692 -18158 -20864 -5442 5379 9525 11691 5658 -358 -3548 3848 6180 7926
3161 7926 4080 -7535 -14613 -13247 -5338 -4661 -4248 -8728 -6242 -3753 -521 2975 7725 17660 18378
3146 18378 14926 9174 1882 1027 1107 2412 4466 4446 2726 3735 4152 -303 -4187 -5817 3289 1162
3130 1162 975 2753 1191 7683 12282 9358 -552 -11454 -16281 -14268 -10009 -4542 -628 -8551 -22304
3115 -22304 -16243 118 2298 -5424 -10394 -23664 -30957 -25010 -11976 -2900 -825 1176 6788 12113
3101 12113 1083 -8824 -11326 -1610 836 -2693 -9190 -9134 -14775 -17235 -13329 -4770 -1110 -2957 6925
3086 6925 15798 6362 4646 6337 2412 -241 -8415 -7087 -10467 -11543 -6235 -13298 -9078 3966 -77
3071 -77 -2804 -3357 2101 9284 5855 6398 -4862 -5709 -2043 -16429 -19126 -9428 4422 4754 734 -159
3055 -159 -926 -1546 -6267 -8517 -12397 -22772 -17500 -2345 10730 20379 12687 10320 2743 1424 2172
3040 2172 -2118 -16797 -19550 -15988 -10685 798 4334 4389 4092 -2714 -7550 -7185 -11131 -13350 -8275
3025 -8275 -2623 -524 -4391 -18204 -24502 -22202 -14247 -3921 -2891 -8053 -8511 -17475 -4983 -2
3011 -2 12217 19141 12937 -2665 -10284 1330 13869 18832 4507 -6244 -11610 -11996 156 12902
2997 12902 3609 -5767 -6684 -13144 -20078 -12360 2533 6980 5682 7964 12716 -2335 -8703 -4991
2983 -4991 -6332 -14865 -3053 -5322 -11112 -9047 -9015 -10648 -12499 -3537 7908 11852 15061 10613 737
2968 737 -3286 -449 2112 -5634 -21526 -25622 -31886 -26661 -21839 -18642 -19363 -27767 -25193 -7937 -3893
2953 -3893 930 2107 778 4220 6070 3675 -4500 72 1369 3278 7865 2129 3372 1916 3469
2938 3469 7402 8804 -812 -1889 -11 6425 14312 15053 3133 3809 1806 -712 -1433 2904 7571
2923 7571 11722 6307 -3219 -261 13222 18446 19440 17123 10124 12607 15475 15528 11964 2102 -2650
2908 -2650 4326 8394 8551 2191 3514 10561 7850 570 -6279 -284 -5519 2411 13566 19351 12456
2893 12456 11759 12262 14567 10065 1277 -7990 -8899 2822 18445 9984 -1765 -4774 -4454 -9137 -20926
2878 -20926 -14886 -7229 1668 14481 17461 20030 17101 22393 32144 30806 18302 10915 -2031 -11490
2864 -11490 -8688 -17040 -19240 -15337 -21133 -21625 -19734 -20706 -24710 -25619 -18516 -7935 -14196 -21668 -15828
2849 -15828 -462 8100 9574 7664 5372 6146 6699 5028 -120 -2350 -6212 -5124 -8357 3497 6949
2834 6949 10148 5007 -10591 -10911 4456 6673 12216 12027 2668 -1483 -1094 1568 -2048 338 -1217
2819 -1217 -7210 -11775 -9241 -13641 -18097 -20389 -17294 -23040 -24490 -13863 -7777 -9563 -14416 -5347 -1147
2804 -1147 -819 2232 2985 5879 7884 7039 1704 -6453 -15772 -20003 -16963 -1010 2643 269 3665
2789 3665 9557 19259 7354 5105 5274 870 2407 -321 3877 19957 36803 39228 28836 36948
2775 36948 36679 44074 42527 35451 34289 18889 8282 1861 -543 4660 4233 -1981 -3446 -11729 -3807
2760 -3807 -1398 -2611 -10252 -6357 -3416 -6128 -6436 -11038 -5777 -8897 -7163 -20593 -24898 -19562 -6693
2745 -6693 843 6324 13619 18094 12624 -4191 -13621 -12394 -16027 -9333 7985 10540 -6463 -7017
2731 -7017 154 5304 2374 7348 9393 -2573 -5996 -8966 -5858 6951 17959 9855 5471 5218
2717 5218 4389 6450 -2067 -16150 -17316 -11361 -10772 -7713 -12614 -14268 -12641 -10466 -14776 -16566 -16135
2702 -16135 -11745 -17160 -25043 -8564 2005 -7221 -13230 -8838 -11454 -11377 -5783 -11865 -24891 -39461
2688 -39461 -41222 -42735 -42886 -35386 -30611 -28674 -24088 -9774 -5878 -5298 -1756 2549 -6462 -18215 -20714
2673 -20714 -23103 -23745 -12789 2215 9934 9243 10521 10351 -656 8005 11128 4257 -5954 -6174 3951
2658 3951 12691 19512 9714 4295 3651 4784 6980 8344 19043 9970 11457 17761 18509 19597 10659
2643 10659 17741 25925 23951 3696 -5538 -3190 2228 2712 -4203 3633 9778 4805 6918 7792 9739
2628 9739 4449 -7390 -11387 -6637 -4209 938 9169 12800 -3448 -18243 -11512 -10948 -5536 5800
2614 5800 11834 14335 7526 7857 8579 2164 -414 1439 3976 5470 -7671 -12038 -3870 -1162 -688
2599 -688 9123 17191 15244 10246 8934 13223 15267 8170 1477 662 15941 23934 14836 -2567 -4248
2584 -4248 -833 7580 6805 11560 5003 23 -3897 612 776 5245 12266 -2987 -1873 3406 13095
2569 13095 11692 1116 -4698 3924 12892 13921 12211 13379 12907 17393 9609 -7804 -8398 -4818 -6710
2554 -6710 -375 2284 -3278 -104 -1993 -488 3670 6791 8688 16958 16385 3162 8226 9661 23008
2539 23008 28674 16254 8646 3472 894 2930 7698 12955 12430 3564 -7283 -3325 1622 -5313
2525 -5313 -853 2893 1420 750 -7892 -9976 -10092 -15194 -16492 -7122 266 -1968 -7378 1103 2603
2510 2603 7466 8553 7474 11301 10658 7394 -3 -4086 -11146 -14608 -21241 -25889 -28942 -20380 -21966
2495 -21966 -19742 -17221 -14142 -12529 -4060 -505 -4782 6636 12076 3529 4877 4678 -5489 -1274
2481 -1274 7906 5902 9102 1948 873 -5304 -5132 -944 4529 5542 902 3404 1210 -2407 1614
2466 1614 -5100 2968 13128 16884 6462 4223 13031 11118 10165 8329 4454 5650 10613 5586 -1703
2451 -1703 -3671 -7164 1694 3136 -5038 -12875 -17846 -9400 -9339 -11990 -7137 -2475 -3576 -12408 -7271
2436 -7271 2505 8303 8911 9225 1314 173 1705 -3841 -771 -3701 1388 -1340 -4632 4345 14059
2421 14059 7898 13897 11586 2637 3370 -12858 -14656 -10439 -17938 -19079 -4383 189 310 -1974 -5440
2406 -5440 -11985 -9562 -12993 -23710 -24537 -12876 1738 13607 11219 5267 5725 5532 7537 12815 9974
2391 9974 10214 7243 95 -6868 -1554 -3527 -238 4102 11896 14876 11542 6026 1343 -2824 1430
2376 1430 5517 11039 11614 10860 7812 741 3672 5841 -2693 -1656 -1347 909 7460 16633 6866 4261
2360 4261 12633 12972 -1125 -6105 -7666 -4031 5443 2541 -4509 -12271 -12373 -7617 -101 965 -1068
2345 -1068 8077 -3914 -23001 -28706 -20667 -10068 -4216 -6849 -9565 -11067 -4696 3297 4180 5081 5802
2330 5802 10775 5424 -2863 -7743 -18855 -32520 -21392 -6981 -8567 -4854 -9375 -4931 6907 602
2316 602 -9878 -3801 8176 16614 9327 3637 -8529 -9459 -8699 -691 -1449 -2845 6755 8205 1309
2301 1309 -7911 -7499 2151 -886 -217 -5610 -11111 -9141 -9916 -9357 -1041 -493 4571 3065 -5229 -4049
2285 -4049 -16045 -21642 -13549 -20368 -27064 -14315 -3321 32 3766 5651 14932 2032 -6692 -2024
2271 -2024 12945 14598 3958 2748 6386 3013 -4133 -1813 12309 11437 6911 8133 9549 11780
2257 11780 2129 8469 8477 2868 2780 3503 2064 5491 5142 4832 706 7147 15465 17915 13647 11939 -1235
2240 -1235 869 2418 10247 10018 6669 6847 -514 -352 14258 14651 8103 1993 2405 2821 1856 -1450
2224 -1450 -8918 -19860 -17807 -4992 -739 -4893 -2905 4311 3983 4772 7758 13499 4722 -1773 8411
2209 8411 11261 -2350 -2358 -4846 -3463 -2799 811 13948 10376 7766 7699 9539 351 -4971 3828 -3163
2193 -3163 -2699 -3916 -6996 -6924 -1739 -2877 -12351 -13347 -14092 -12982 -12639 -8513 226 10233 15578 15116
2177 15116 3580 -8750 -14068 -21395 -16740 -11358 -113 3224 -5090 -2281 266 -364 1263 8272
2163 8272 3211 -1089 -6622 -7417 -6976 -6997 -3569 -3951 2552 6863 -860 307 -514 -5841 -10892 -621
2147 -621 17408 19701 11964 16725 24023 31549 26657 17974 11254 4276 6701 11615 16967 19833 16561
2132 16561 18998 14707 9388 10174 9930 8340 7054 6531 12547 19743 18481 10851 -1580 -3642 -3724 -9902
2116 -9902 -11311 -9333 889 -3761 -9206 -9374 -3686 4468 10453 10053 14080 6800 2402 5493 10796
2101 10796 10098 15659 23514 24603 18861 10074 4147 12091 7879 3367 6466 -2320 -13903 -17906 -8344
2086 -8344 -873 -15044 -13879 -5248 -12128 -16348 -10659 2722 29 -1690 -4074 1054 10874 2864
2072 2864 -4432 -9355 -15938 -17895 -8471 -6588 -5371 -3882 -5012 -2543 -157 8071 4370 6840 12655
2057 12655 8115 3014 -9421 -12200 -12939 -14755 -5111 2361 -1091 -3324 -635 2641 -2485 821 1627
2042 1627 -2993 -4700 -972 5534 3921 3233 7143 10544 2830 -1835 -11234 -16003 -15739 -9027 -2734
2027 -2734 2581 701 4607 7084 -2927 3172 6913 6529 3627 4727 7594 4561 4151 2256 -6418
2012 -6418 -1405 2820 6446 10035 8325 9785 6842 4637 3021 -5913 8663 23384 13925 4360
1998 4360 17695 21237 13245 14637 2150 -8184 -15977 -15604 -14345 -11075 -12461 -24197 -20865 -10372
1984 -10372 -7743 -8919 -18359 -15291 -4950 -189 5087 16082 6789 -3922 -7409 -8836 -1453 5958
1970 5958 7725 8643 11217 6364 5446 10262 11777 2503 534 7745 16486 13457 3002 8909 26391
1955 26391 16215 8353 6107 -3772 -7790 -12404 -5234 -3471 -13174 -11682 -7970 -5131 7218 4081
1941 4081 -3782 -3037 -5356 -12514 -12575 -10194 -8504 -3203 -5350 -6313 -8521 -12919 -10492 1405 2955 -231
1925 -231 -4492 -2133 -593 -1479 651 12167 6904 -265 3322 6774 5799 3864 1772 -2256 2503
1910 2503 -3179 -10989 -1868 2638 5507 -7621 -17662 -2010 14552 19236 14403 8693 14406 21206
1896 21206 22304 12880 10792 624 2998 2602 1522 -6411 -2447 4472 11584 19377 20877 13992 8718
1881 8718 2946 -245 -7211 -13974 -8657 -2745 -4496 -2035 817 4405 4189 -8521 -12701 -6840 1025
1866 1025 4143 3372 -3113 -8069 -11520 -14112 -5576 -1930 -3937 -6700 -1363 7664 11886 -1057 1507
1851 1507 2934 2576 2234 12475 11492 5342 1588 -233 -1037 7953 11805 13262 9408 6890 8235 25203
1835 25203 28296 25680 15042 3128 11386 16696 13956 18139 13157 9020 5072 710 1347 3081
1821 3081 -1182 -3079 -4968 -12577 -14450 -17535 -14710 -13249 -12683 -11574 -10592 -12606 -15410 -6206 330
1806 330 -4320 -7236 -4706 -3649 -3619 -4647 -3361 -5997 -5519 -116 -191 13006 23884 21589 12172 12804
1790 12804 12664 3913 -3434 -14015 -12248 -2505 -8763 -10634 -3967 4252 4705 6942 10842 10497 8486
1775 8486 4042 -2798 2253 10296 9510 5427 16298 18582 17226 9087 8247 1425 2099 3202 3065 -1307
1759 -1307 -9851 -17051 -2614 4954 2469 -1643 2764 -6034 -6325 -7158 -5500 -8932 -1627 10359 18194
1744 18194 23128 14225 1360 109 2328 10807 7746 6704 5297 1194 -8040 -9025 2509 -4199
1730 -4199 -7463 -4517 -6984 -8672 -11608 -11333 -8264 -146 6581 5383 700 3437 6104 7523 12119
1715 12119 12554 3020 5106 7922 11221 -338 -5559 -1094 18206 16940 4638 6964 9845 11804
1701 11804 17772 9009 -7130 -7680 139 5283 20387 20307 16688 1074 -4779 3185 9535 6322 10104
1686 10104 3016 -5485 -12412 -19191 -11384 -6752 -7442 -11746 -1841 2644 2472 -10119 -18002 -19289 -14716
1671 -14716 -18043 -18028 -11728 -9514 -3342 -3231 531 -2990 -6728 -4932 -1230 12311 7145 524 5965
1656 5965 7323 5155 8037 9790 6579 -122 4903 4519 -12222 -9252 5344 16790 15896 11867 5612
1641 5612 -1843 -10670 -10356 -1942 6704 13293 -72 -6967 4901 11434 6314 7500 6274 19690
1627 19690 33219 32723 28018 23797 21837 11377 4011 3634 6182 6337 6310 8025 2336 -2017 2134
1612 2134 3631 1389 -2697 4891 10086 11406 10067 -1456 -6603 3873 8944 10636 10029 3800 -4028
1597 -4028 -2006 1249 4234 12572 14197 13256 10728 8232 4797 6964 12708 21679 15683 6593 12188
1582 12188 12591 7880 7225 10545 12344 14363 22752 26049 25240 25291 19373 16056 22585 22075 15787 12222
1566 12222 12637 5619 5935 6536 8381 9120 7704 13992 19543 23436 23255 17960 12240 14555 8125 3585
1550 3585 9028 10756 2599 -5229 -2496 9074 20667 11192 -2573 -11546 -8385 -6869 -3523 -5905
1536 -5905 -5265 -8165 -4366 -9358 -8213 211 -3784 -6919 -9023 -3972 2497 8880 2350 -3445 -4844
1521 -4844 5542 1279 -4190 -7614 -1368 455 -4945 -3020 5084 10165 19410 14521 7379 8704 13206
1506 13206 15290 8320 12343 12343 9756 3637 -420 7125 -403 -19477 -27753 -15454 -809 10730
1492 10730 1819 -10792 -10401 4523 16125 18443 11424 9241 4302 4741 14636 6873 10423 14417
1478 14417 10186 7346 11921 11823 12041 7592 11201 9222 5899 6762 3364 3937 5806 4192 -5632 -6686
1462 -6686 -6104 -5640 2776 10318 5776 5628 15652 15068 7287 -3388 -6197 -2973 3239 1832 -1711
1447 -1711 -6930 -10245 -6694 -3371 7717 15477 13632 14390 9186 8015 496 3488 4792 2080 6596
1432 6596 3180 -1926 -7225 -18679 -15900 -2309 1350 -9129 -20273 -20720 -9505 -5308 -3668 183
1418 183 9391 11211 -3783 -8960 -6711 -3074 2683 9111 4441 4444 4080 14326 25190 18377 4360
1403 4360 -3930 -5393 -248 -437 4968 10322 12355 16178 23076 19379 19337 7806 3766 6035 4657
1388 4657 -2790 -2397 -1874 -119 -3128 -10991 -9193 -1144 -2428 -224 -2082 -2802 3864 -6142 -9198
1373 -9198 -2396 12106 13351 4274 1319 1136 424 -3945 -1701 -2078 -512 -3673 3973 16352 18074
1358 18074 13337 8038 -3229 -2413 4008 8848 8189 6473 4330 8315 3959 -1318 -3702 6623 13130
1343 13130 13598 8197 10056 15652 3954 252 8664 5286 -2605 -6804 3035 -528 -11678 -1870
1329 -1870 13271 14704 10047 2055 606 8798 17999 16413 11035 3014 4768 13169 17023 7797 7702
1314 7702 12816 3109 736 -8913 -5396 3022 -4076 -6098 770 -9215 -10591 -5914 -4766 -10844 -20181
1299 -20181 -15394 1238 10849 7988 3429 9719 11657 10096 12213 11733 5260 440 -1725 -552 -7788
1284 -7788 -13594 -12327 -8010 -8328 -4132 -183 618 3979 2449 -9587 -12492 -7204 -8623 -809 -510
1269 -510 -8759 -7726 -12199 -16037 -9973 1532 8151 12596 15866 16658 11404 16922 14297 11002 9801
1254 9801 10888 12703 4420 3469 11857 16225 12676 -748 -12148 -5656 -327 2008 4789 9906 7732
1239 7732 4700 -1392 -15028 -10444 1114 12410 15669 10159 10636 21695 19997 17256 20154 20133 20704
1224 20704 28908 24096 9871 721 6876 19333 20241 10618 9576 10712 7432 7943 14395 8396 1975
1209 1975 7249 18048 19189 7852 11446 14840 3566 4933 5838 3599 -252 -2381 -8097 -3803
1195 -3803 -734 9018 17932 23453 24557 25092 21735 20351 18222 12080 -6537 -4062 576 5464 10714
1180 10714 10318 -3958 -13317 -11829 4667 14346 12108 4499 3964 3959 1566 699 2902 408 44 -384
1164 -384 -8519 -6627 1354 9336 1123 -10076 -14356 -4680 612 1776 2117 3742 6991 7311 -64
1149 -64 -1293 6892 11659 2142 264 2686 416 -444 410 10305 10057 11456 9502 13486 8058 -9335
1133 -9335 -10529 -3975 2772 478 4607 7415 5771 3155 7582 12216 -1294 -3794 -2632 1767 4781
1118 4781 680 5158 16088 17729 10273 3015 6718 9281 8232 16882 25809 26885 15638 7724
1104 7724 4596 -384 -11848 -8716 -6295 -2465 1505 147 7457 15007 5832 -11607 -20187 -11027
1090 -11027 939 -3184 -6960 6973 15025 17655 5402 3429 -4740 -2470 -5993 -2502 5022 5639
1076 5639 7438 -2141 -1556 3771 -3074 554 67 -1756 -4816 -10651 -14227 -6759 -4529 -6769 -2542
1061 -2542 9603 6801 5477 10715 5591 4109 3227 6793 7642 3472 -2657 855 9600 8453 -380
1046 -380 1200 -957 -4431 -3500 9402 10285 2146 11606 9919 -11993 -4078 16822 10178 1274 -9273
1031 -9273 -10491 -2896 2628 3909 2517 7497 1519 4858 7236 8610 4363 -6353 -4507 2511 -11561
1016 -11561 -7732 4163 16131 18360 10544 10900 14289 16809 13176 11416 5061 -1372 -2340 3571 2560
1001 2560 -357 -4776 857 6515 7705 13807 16819 14891 15858 14732 8459 49 -1390 7126 9598
986 9598 3706 8280 12617 11457 4638 1457 9289 20337 19636 9769 815 8094 5783 5873 -1699 3620
970 3620 7097 9525 5832 3079 2821 1897 3379 -4897 -9820 -8961 -1983 6638 -3966 -15141 -13739
955 -13739 -10266 -9574 -15245 1656 15241 2299 -7619 -21848 -28208 -26235 -6718 1462 -3468 -18298
941 -18298 -9814 -9585 -5101 6622 12272 132 -2265 -713 4503 6281 3189 4194 13252 25422
927 25422 31807 18355 5670 8786 11737 18580 23555 27862 16030 13627 14774 15378 21296 19455
913 19455 17417 13437 13985 6233 -1960 -5933 -13784 -10928 -2915 -1221 -3316 5117 2839 6130 12181
898 12181 10264 9853 14017 14464 15236 7616 5243 4658 -130 -5729 2448 10532 13305 7252 2349 -5883
882 -5883 1 8159 8551 6703 12128 10109 6865 8786 7042 7270 2072 14092 15798 8410 4803
867 4803 4746 5871 1537 9101 9500 913 -2909 -1013 6264 -296 -12129 -6307 -1305 5388 5539 5239
851 5239 9677 18204 18579 2818 -11665 -5787 5821 9997 2700 3517 6850 14197 12463 15499 24926
836 24926 15711 -875 -5605 642 7527 6601 -5094 -5119 -919 4837 10569 22780 22172 21832 13500
821 13500 14749 12501 -2489 4796 14312 27279 22669 14116 13788 14932 14215 12730 10894 13196 19406
806 19406 8883 10397 17143 22991 21394 1231 -507 9087 9763 5975 847 -584 -5482 -3357 -4509
791 -4509 -5874 -10812 -8847 -18723 -23306 -11402 -6113 -5344 -630 3170 -5766 -6690 -9495 -560 8483
776 8483 4331 -2567 7964 1291 282 14006 13653 5253 8163 6888 6794 18966 21235 21329 27937 22091
760 22091 16616 16463 16400 15685 3846 -1609 -4028 9710 17104 13301 7306 3541 287 -1885 1447
745 1447 -2725 920 7968 5413 10198 23905 24170 19509 15821 13625 24725 14563 -1162 -5770
731 -5770 -5222 8507 11204 8820 16247 18450 11314 3566 10982 12353 17861 15302 10276 9285 12306
716 12306 6992 11828 14778 3785 -6020 -8169 1571 4461 -1703 6382 20813 13755 16546 14181
702 14181 12111 14248 21763 22441 21146 6701 3377 2691 -5144 -7590 -4195 938 3706 4384 3465 11369
686 11369 6698 7767 12226 6461 576 -3315 9092 13785 10893 16830 10235 10889 19089 21715 16017
671 16017 2565 1917 -7357 -10226 -2784 835 2241 8251 14108 10730 8460 3967 5969 11909 11760
656 11760 14268 29729 31627 17364 7706 6671 6934 9897 7328 391 -2924 2721 13880 9479
642 9479 5701 7090 15351 10295 3945 1555 -951 5892 4876 -1454 -4062 -152 6170 658 6859
627 6859 11618 10688 18788 21650 23525 19347 6895 3867 805 -261 8208 12697 14128 17546 18209
612 18209 13310 21428 28951 29263 16935 11732 7900 3785 -1097 1590 -270 -1776 -1045 1811 3265
597 3265 13563 9251 3186 957 93 5174 900 -9837 -13805 -5490 8514 10861 8707 22670
583 22670 19809 14677 18443 19523 22403 21342 11608 12103 19463 17171 -371 -12081 -9696 -4167 -18
568 -18 964 1556 -969 117 -1206 2566 3909 6432 11419 16003 19088 15916 15587 7958 11589 15851
552 15851 11501 17911 15446 -733 -3641 -5571 -6687 2486 3968 4064 1786 11324 20549 21672 20450
537 20450 18534 14979 8460 4400 -1058 -430 3396 6125 4707 8381 10658 10427 5391 -2980 -3942 4958
521 4958 3571 744 -1524 8795 16283 10473 1198 -910 2473 17119 23504 14521 9897 13251 16398
506 16398 23886 29739 28169 22501 17970 7884 2206 4118 3231 -632 -6571 -6722 -7161 -6176 2945 789
490 789 6984 4116 -2036 257 1416 2706 11289 16137 11906 3993 7572 17715 16847 6404 4894
475 4894 -3766 -325 1752 -16 3283 -3793 -6593 -3818 -984 3614 1415 -3701 -9899 -13710 -13426
460 -13426 -13318 -5154 7574 10838 12252 11332 12094 12757 15371 16856 4293 5780 9839 8857 11303 14158
444 14158 15364 15314 8114 3646 -2483 -7229 -4040 -423 3891 7210 3297 1312 4320 -4125 -5699
429 -5699 -2468 1359 8954 11446 11142 5471 2031 -3277 -5026 -5690 -855 5983 777 7039 14914 16514
413 16514 18312 22653 15142 12367 20617 25807 18342 12248 7137 5928 4193 6422 10195 13590 14362
398 14362 11792 10238 11843 16618 27985 28743 30544 30442 31116 20048 12558 9717 2057 -5489 3877
383 3877 7490 17184 25395 20217 17625 17062 7846 602 7458 9391 8396 4211 12041 14799 -533
368 -533 -2562 412 -6557 -4700 -3218 4847 9079 13145 8469 5756 6643 4369 4908 6585 6726 3745
352 3745 15138 11864 3715 4424 4734 3722 3479 5971 10849 15449 20315 20989 13610 -260 -2625 1551
336 1551 297 -2201 -1466 7794 8758 1788 4870 13595 19551 9924 4114 14035 18433 12289 546
321 546 -5664 -2900 2214 -1672 -7268 -4473 1002 7776 2935 1577 -263 -5651 -5273 -2306 -8324 -2555
305 -2555 1830 -3021 -2487 2156 8201 10078 12001 14751 14219 18625 15461 22458 18879 10246 11992 20749
289 20749 22446 15161 12697 9806 5831 7047 10993 17695 15391 18966 18960 13362 10996 13534 15285 11216
273 11216 12056 2395 4534 5324 1306 2744 1635 2086 5284 3883 375 277 9134 10006 16243 20804
257 20804 23938 15623 8066 8694 11230 12463 4207 -4835 2162 2053 -968 1618 8652 18455 23470
242 23470 11311 12395 10056 11816 13810 11549 17046 16300 14140 19571 17040 12432 13061 13291 17641
227 17641 15854 12202 17046 18640 13210 13694 2222 -7984 -5883 5790 15434 11277 13959 16841
213 16841 10115 7165 2961 2892 3328 1481 -2838 1584 3533 743 13181 25124 19739 10392 6056
198 6056 6393 5240 10063 3929 -578 4491 13604 17605 18773 16756 14175 4797 4737 7185 11114 15137
182 15137 17660 9094 834 417 1062 -5060 -1080 4763 3069 10479 11726 12163 8618 7439 8793 5068
166 5068 2509 -2241 5201 11527 5821 7021 3640 3299 2439 -5665 -3115 -484 -2494 -598 -10124 -10957
150 -10957 -4501 -5602 -7967 -8526 8786 13995 12325 14852 11053 10610 8985 6180 10953 3785 1531
135 1531 5774 4208 7062 7004 6281 12685 13962 9964 6592 1435 -1787 9086 15807 11571 13721 18776
119 18776 14374 11031 15894 17505 14739 6577 9885 9961 8599 13062 14843 15981 16466 11458 5887 -394
103 -394 9224 6545 2815 2707 2782 4087 2203 1666 2734 -887 -10409 -7542 -6273 -11199 -8877 -3264
87 -3264 -28 5318 7320 9305 9013 12609 14385 13898 9531 6717 -945 4449 5997 -2758 -9199 -8594
71 -8594 -3970 4873 14552 22617 22417 14151 15050 19063 24647 17951 8629 7755 8053 15399 12299 8146
55 8146 9321 13459 5481 554 7049 14326 13842 11139 3581 4191 68 -520 3409 3767 1916 -3999
39 -3999 -6572 -756 1754 7443 8472 4813 3410 8879 12571 12145 12140 10407 10016 10823 9745 9104 3391
22 3391 2308 4904 11694 10845 13168 13875 17076 16561 6680 6405 10233 7120 7363 5754 9301 13014 15881
5 15881 10815 4871 7453 11134 8588
0 8588
$$ Imaginary data points
##PAGE= N=2
##DATA TABLE= (X++(I..I)), XYDATA
32767 64727 66893 72820 78517 78055 75881 73830 75610 75103 70293 70077 74113 82460 83940 84804 95245
32752 95245 99597 103595 97262 94351 99249 105043 107954 103684 103593 105693 99971 99149 102479 101639 105379
32737 105379 109927 108515 109306 114567 125173 131824 131257 126704 114537 117785 133172 134373 132971 130769
32723 130769 133456 133463 136521 138793 141287 149454 145402 133026 125781 132494 139784 148828 150227 147473 142142
32708 142142 141326 147206 152915 155504 159951 160806 167692 164681 165545 166435 162928 155449 151923 154167 164232
32693 164232 167273 168494 172293 169952 164892 170195 179280 178880 178170 177324 179359 181582 182466 180411 184301
32678 184301 185289 188795 197764 201314 204133 213155 215394 203937 197368 200999 202884 201918 196671 197344 204142
32663 204142 209916 215985 217208 215843 217058 209948 207711 212384 214766 214546 219116 223881 229595 224491
32649 224491 219732 219145 222565 228200 235917 243054 248669 250122 241265 238498 236201 242728 248550 247978 246931
32634 246931 247641 252576 256679 261107 262974 263199 262262 265438 266011 262492 266777 268071 273889 275788 277222
32619 277222 275188 280756 279605 279495 279108 277858 276349 275111 275968 279095 284251 283348 289063 289266 286859
32604 286859 287761 290698 291876 289831 288238 296873 295973 294158 301552 299807 298230 298436 297709 302294 310950
32589 310950 309999 306607 300875 289384 293610 296271 304136 308341 307883 308072 301779 300109 306536 310993 319001
32574 319001 314054 308991 311852 314524 310000 316017 322540 324590 325497 335344 333840 332660 325535 328109
32560 328109 336893 335266 328077 327676 327262 336931 340827 335399 334911 341033 344107 346738 340520 334614 336599
32545 336599 341399 343115 344477 337067 338313 343028 347889 355386 359745 354070 349334 350041 353809 361830
32531 361830 361141 362246 372697 369209 363509 361243 363326 369990 370880 371251 364954 367276 367543 363410 362833
32516 362833 364371 369620 379361 379734 383892 381404 383973 386797 382184 383636 377149 369351 375198 378658
32502 378658 381487 385845 392248 389759 394835 398147 392780 395197 394546 388353 387785 393789 399598 391615 385634
32487 385634 385853 394163 404341 402939 404381 401506 399271 415180 419723 417975 418651 411854 410148 409890
32473 409890 407197 406719 408263 407582 407278 410153 411753 418443 421747 421791 419664 420726 431252 432469 430680
32458 430680 430803 429921 434284 429442 428663 430080 427976 434295 436470 435573 431332 425513 434632 434034 429188
32443 429188 429018 431829 439417 440657 426875 421825 419111 418582 430003 442541 434769 426854 426473 431208
32429 431208 428569 429391 430007 440999 446880 443091 442603 434752 435986 450824 450436 449173 450949 443360 449533
32414 449533 449634 439394 447179 448152 443946 442599 449566 460817 463473 460000 463373 465117 465156 469654 461348
32399 461348 462745 462951 454753 445687 448896 446735 449546 451883 456227 454878 460653 461947 463702 467613
32385 467613 462201 466634 457988 452382 457794 466074 463952 468544 474822 485127 492243 490982 483577 480475
32371 480475 479423 475197 473458 476148 469858 462473 462052 466407 470618 474370 469216 462813 462548 456798 462651
32356 462651 472691 475290 479414 472006 466248 470282 474643 472353 470492 480767 494396 499519 493367
32343 493367 483451 476649 470266 472796 480357 486973 485702 486243 489621 490643 488623 474445 473219 484207
32329 484207 490124 479376 481285 482907 478486 479612 492006 490300 488897 486691 482636 482910 485643 496220
32315 496220 493189 487818 492914 494346 487499 482132 478276 484620 490793 490020 488503 488192 495212 491148 485383
32300 485383 488096 490555 498235 496187 494212 492598 494496 495450 498028 497912 492766 497110 500513 503938 506441
32285 506441 502378 507528 502969 510088 507450 506219 502481 502904 501599 493837 491386 498037 513007 511759
32271 511759 503795 503889 510786 514866 513504 515602 521536 518600 506018 505619 513658 522294 520742 521106 514050
32256 514050 507166 508612 502201 511265 514022 526137 522242 508186 509218 506258 511602 509421 506130 505076
32242 505076 507318 503050 502350 496673 500397 498849 495352 501603 504986 507453 509225 513809 519876 522678
32228 522678 522635 518949 514238 519137 506576 486971 488515 490861 505995 510328 501154 505451 509182 512973
32214 512973 514025 510567 512325 510172 507874 510204 516318 521492 526756 528480 521730 523648 516705 509484
32200 509484 500010 501085 502324 499959 496571 505191 509891 518230 517299 513776 507191 512934 512071 497828
32186 497828 502258 505231 509578 512161 515326 507352 501403 504437 510802 521604 510827 507232 506191 510375
32172 510375 519184 515557 515807 521906 518977 508735 513263 524185 523183 518874 516221 517747 514463 512689
32158 512689 524125 530140 534927 531322 527288 522427 517453 513155 520290 517989 518924 517131 508528 508027
32144 508027 510459 514442 521963 521135 522671 528823 522476 518680 525285 533761 534658 533937 528203 524361 532252
32129 532252 538159 540321 538959 536071 528619 522313 522762 536284 538456 524918 519722 515784 523064 533475
32115 533475 534160 525644 515287 512527 513814 512835 511162 512459 522808 521305 511653 508837 521770 517134
32101 517134 520834 530727 531194 517391 506261 505932 515997 518984 515183 522146 517246 522801 516049 509881
32087 509881 514763 523735 541197 547802 539410 531809 523009 522132 520753 525598 525102 524677 532631 528438 525899
32072 525899 539387 545016 545910 547667 539483 535443 531442 524169 516131 512527 509791 523229 537131 532339
32058 532339 530802 532086 533370 538357 528857 520627 522028 526815 523830 526794 531224 532591 530714 532570
32044 532570 541422 547242 532482 524738 531424 525724 512166 512661 517532 527954 533224 531539 520492
32031 520492 525531 529148 528113 525889 512727 509901 518086 523151 533750 527920 520976 511881 511839 522187
32017 522187 528012 525138 524151 531699 536497 522198 512266 510695 521807 525269 518927 524172 526085 523351
32003 523351 522190 529312 531204 535311 532252 531412 530721 516552 511590 515587 504619 496745 504763 506430
31989 506430 517571 521979 521469 530157 532223 538185 541362 528489 522631 526202 527136 527221 525646 533652 537123
31974 537123 528710 532502 537352 525314 519717 514456 507295 510475 513787 511726 523010 533372 530831
31961 530831 523587 528570 535546 539835 542321 540256 543569 543066 538721 537408 532059 529132 522018 519492
31947 519492 521576 524186 527387 528439 529129 524588 519391 516858 510240 516849 528320 529244 523486 527125
31933 527125 540201 538996 531977 536097 523886 527265 519871 516240 527424 528797 531672 539909 537081
31920 537081 536651 537221 532634 529075 529458 533671 529004 531249 526904 531727 535827 539802 531793 527125 518301
31905 518301 515612 524071 530592 540712 543463 545631 544370 544698 552574 556758 561887 562114 552615 537330
31891 537330 525511 529288 535014 531733 530679 524866 513462 514630 519779 521447 521665 524048 540158 539232
31877 539232 527290 518057 521176 518231 517362 521769 521435 530461 537801 545810 551843 545471 531636 538607
31863 538607 546436 530904 527331 529873 521082 510976 502735 507245 517280 531288 534858 527171 519820
31850 519820 530199 533416 528872 519784 519990 519532 522897 524960 521673 533601 537321 533911 529335 536612
31836 536612 538232 537579 545967 543173 541994 535216 527010 533495 533275 530023 521163 523366 531350 535647 534681
31821 534681 529510 525402 530305 523628 519648 523038 534999 546453 545334 546447 545554 533960 531372 531139
31807 531139 532645 521486 517738 527953 531889 536861 541882 549032 551384 553899 555735 545823 539973 545901
31793 545901 546941 546768 542311 544049 536983 523032 539098 544828 547219 552397 554213 551282 549503 544663
31779 544663 543466 535099 523237 521248 530508 539095 537395 526501 527567 533594 533150 530780 527386 535437
31765 535437 539016 548012 548583 538498 536673 540632 541219 550731 552471 542028 537467 535928 534700 534967
31751 534967 538907 536671 540961 540166 534756 531769 535595 537803 528614 523216 528252 528860 529701 535703 541132
31736 541132 541953 540323 540458 538450 532808 526928 534999 540288 540707 537123 532321 537249 543044 538973 526574
31721 526574 521672 514405 516578 512002 515298 519002 516116 524816 535930 534294 531762 520355 527338 528802
31707 528802 524259 534100 540189 537196 543699 543111 544595 546953 547343 536086 535297 537922 533944 527225 525060
31692 525060 536018 525346 523725 528174 537533 538688 543928 541657 543470 543380 538082 540135 530728 514623
31678 514623 521382 516947 516620 523634 525154 521907 529814 531091 535212 543609 542697 541914 543952 537330 533332
31663 533332 531956 524153 532011 528911 518601 514620 528483 540736 540495 526515 533414 538305 544928
31650 544928 545972 543203 550240 550541 542273 544596 545504 542081 547872 546771 543117 535896 534362 548291
31636 548291 553633 550535 545285 544439 547123 541940 535344 526117 528608 526989 538638 544371 546169 541119
31622 541119 530510 531947 531705 535303 533258 535003 540849 548682 555386 556378 542541 529184 524219 521008
31608 521008 532698 537898 534259 537908 539337 533107 534431 540588 540601 545668 548226 539766 529174 527810
31594 527810 535452 543652 538505 533711 538909 535469 536990 539953 531735 526666 536379 536038 545114 545764 542320
31579 542320 538094 533382 531316 532248 534815 540624 550347 552794 545863 536557 532492 533439 538445 543828 532751
31564 532751 518789 519016 537198 541534 537811 542914 536584 536113 539674 542135 540745 541473 538666 532996
31550 532996 533399 530796 517937 521204 529240 528684 533706 539262 536626 536876 541627 533242 526563 537478
31536 537478 541043 538060 534444 537324 542730 543078 541704 551967 553775 559072 549938 544837 544187 546537
31522 546537 541815 540072 537058 534355 532854 533311 535292 543042 547762 557370 559690 549687 550204 550170 542039
31507 542039 534726 533722 525295 523936 532706 538325 543794 541335 526566 529417 539814 548228 559583
31494 559583 563099 554057 557422 554457 547333 537926 535647 535633 527729 532640 529544 545562 560412 557562
31480 557562 545964 542877 549052 552891 549929 549454 549122 545850 541101 537489 538639 536867 537851 533578 537891
31465 537891 542427 536743 537482 543667 539765 530771 533668 536986 534392 527706 536303 549678 556763 546366
31451 546366 534664 535681 537630 543742 548552 544490 542283 539277 535042 542072 539289 538972 534327 529998
31437 529998 526870 519453 524477 535401 531590 527969 527449 526084 523645 524400 520770 533109 532016 537787
31423 537787 538132 525880 528291 526883 521579 528085 541352 541710 536249 530602 537173 545034 540870 539243
31409 539243 548004 551030 556182 555773 548300 543736 544730 552427 549872 540559 541949 545878 548773 547249 545141
31394 545141 551441 556891 555993 546487 547294 534363 525800 524040 529509 538172 536868 538039 532654 525610
31380 525610 519027 514820 530865 543721 545267 540044 553007 560789 556592 545883 535647 542305 550977
31367 550977 563567 569401 548767 540126 535558 534371 526270 516866 520354 529557 532697 526977 529750 538138
31353 538138 539598 546294 551992 540675 538614 537809 543867 546897 548457 541404 543531 539426 545991 542073
31339 542073 539224 544907 550158 545909 553330 558851 554105 547498 542905 545998 550042 553361 552243 543545
31325 543545 539735 540264 536093 537443 542308 534687 543040 549978 545678 542160 547730 545841 541573 539310
31311 539310 534662 529688 536445 542852 541931 552656 555863 548755 545956 541297 536665 536639 523391 520236
31297 520236 532107 530586 526852 526034 522563 528549 540048 539541 546082 551117 551007 551569 559461 552929 552190
31282 552190 546660 537920 543806 541997 534440 536709 534294 527823 514750 516597 517593 523878 538941 550085
31268 550085 543523 538425 546728 542099 537386 537369 546647 547693 541628 544239 558143 560651 546929 543310
31254 543310 544239 538447 536673 542989 548927 551603 547540 542859 545467 541974 535765 529180 525454 530128
31240 530128 532664 545598 558115 550324 534204 529306 532643 528151 530025 527786 519477 511695 510119
31227 510119 519095 535215 533584 532508 531037 540274 545826 548147 549979 550954 546015 539879 536063 536376
31213 536376 535964 529660 522125 529307 543639 547217 550353 553928 552762 551796 553867 552909 550092 559522 568779
31198 568779 573503 572411 581914 582984 570592 558081 547769 553011 554615 549162 542630 553004 561742
31185 561742 562053 558292 544584 541283 543079 542838 526352 527568 534218 537692 548197 552219 543813 540511
31171 540511 530908 532509 533234 531521 531573 538056 544607 546724 548973 554418 552300 542936 544163 546927 544250
31156 544250 541756 537480 543950 545636 548239 541966 539930 538802 549438 548727 549850 553923 543077 547746
31142 547746 554802 551677 541207 543587 549083 550775 549120 544080 535852 540077 538809 543149 547484 553854
31128 553854 556361 553435 546821 530605 529772 538334 542114 543723 549995 544535 538007 539113 539341 543077
31114 543077 550831 546766 547838 555544 559630 548231 544808 548236 546011 544915 554188 554167 541772 545492
31100 545492 551463 553765 554601 555229 543014 545159 541721 536594 536213 544765 559918 563755 548973 544100
31086 544100 548988 545146 551589 565400 560448 550990 555135 557762 563289 553028 557067 556298 556561 545850
31072 545850 544580 542591 539951 548270 545546 538324 536068 536558 543341 552139 553935 556293 557693 548551
31058 548551 542873 543915 543506 549458 557232 554003 541643 537988 544198 556349 556124 552866 549605 550151
31044 550151 551045 556401 564017 559684 561702 560732 563948 562410 567729 566774 567498 572181 571402 566368 564477
31029 564477 566804 560084 558653 554167 556557 547183 535497 555426 564898 560933 551791 554837 557120 553249
31015 553249 546207 549162 551693 554463 547332 544560 544187 531332 532001 548000 544541 546443 557307 566959
31001 566959 575446 561732 545842 536044 527438 536331 539278 537243 531916 533574 534757 532975 533416 540193
30987 540193 533962 535788 552528 549775 541422 547580 555031 548700 551948 550842 541753 543533 545768 539632
30973 539632 542278 548956 554343 557666 549601 541774 543528 542483 542149 559175 566072 554942 552239 555639
30959 555639 560990 557049 545792 544882 550509 556432 561517 556021 550169 557702 562540 565182 563577 558298
30945 558298 550315 549212 537121 529244 523595 523391 538301 545330 547032 548958 546153 546833 556938 568275
30931 568275 579045 570749 563339 559528 561482 558581 549306 536981 531564 537277 547126 546902 540856 548439
30917 548439 548646 559252 559982 555768 543810 548666 540427 539889 547623 554761 564314 559673 550890 554378
30903 554378 559674 554027 551791 546731 540113 538717 547249 555460 548775 546608 560770 562903 567380 574143
30889 574143 573807 570130 562388 561226 557896 554066 549911 553012 551865 558091 558326 565522 569091 559482 549706
30874 549706 549631 547233 546789 542439 536681 533294 546989 559397 559817 551503 543930 549684 554284 550507 549231
30859 549231 548443 542203 540886 548078 556537 557400 560350 561576 561303 559152 550749 538624 539311 548240 561139
30844 561139 567008 558941 560332 558943 556371 555939 563302 572325 566641 557675 562696 565751 557104 559602
30830 559602 559697 567544 568932 560061 554884 564914 569844 562847 568622 566955 562033 556922 550019 547012
30816 547012 547865 550010 549156 541554 545270 562473 566663 574181 575665 574562 560321 556802 551427 540719
30802 540719 548742 557423 549087 541878 548344 558743 560098 557697 559928 572788 589668 592163 577121
30789 577121 560387 555286 559660 565554 556260 559939 562557 560823 558639 555318 572497 580162 576756 560332
30775 560332 546768 543955 544106 552540 562174 561534 563078 568206 560764 565730 566559 566719 570416 579315 581638
30760 581638 571852 567928 562416 564350 564057 558679 551428 548209 558871 566544 561843 556301 551670 547826
30746 547826 557250 550299 555410 552677 550358 545382 544059 553878 557424 556029 562890 563208 560635 561361 554688
30731 554688 545264 550171 565025 573780 585956 581474 565426 554311 550851 554365 570363 572869 564630
30718 564630 564418 562225 558391 551347 561268 562815 561776 556009 555408 552686 550182 554313 557162 553073 557315
30703 557315 559540 554209 548654 550463 555528 551798 557064 553366 559528 570776 577911 574844 569585 553748
30689 553748 557545 562498 557441 564909 577855 576486 567443 565637 573753 572696 569424 564820 566512 560478
30675 560478 557668 544532 543515 546686 556126 564016 560264 561540 560742 556946 556208 567710 560710 560382
30661 560382 556442 561179 570317 569069 570607 572075 570610 565707 569607 581412 571762 562049 564074 559761
30647 559761 561132 563677 566985 568964 561679 564056 559422 559904 557814 562125 565219 565102 569083 566458 563772
30632 563772 568306 575238 565551 566478 571529 566058 569051 580706 578158 571623 565687 568521 557026 553787
30618 553787 551889 546983 552577 557381 562418 566058 563149 562957 574226 580291 571246 565774 556008 561908
30604 561908 571858 568830 557009 543658 553115 554119 561022 558969 554868 554729 562991 561808 556790 567632
30590 567632 561693 562698 564041 565088 565941 560056 560165 561047 559921 562874 566686 557186 556283 566089 557640
30575 557640 549245 546380 555241 558150 557910 548481 547573 549453 556702 575812 578140 571777 563518 564529
30561 564529 566643 576506 579476 578947 569407 558248 550247 548637 556301 555318 557696 559752 567829 574831
30547 574831 574736 570284 574028 571693 571944 581052 589042 596023 581994 565366 557632 558967 562000 568090
30533 568090 561638 560191 564019 558903 555490 556292 559798 568946 559869 555423 562975 577248 572731 564661
30519 564661 566076 572561 577547 571808 561514 564268 569045 575253 578256 572611 568845 578276 585081 588572
30505 588572 575530 567506 575373 576256 580473 585325 577047 567264 567946 562818 567747 575668 573431 561563
30491 561563 550756 558569 563779 565889 565055 568255 570615 582854 587706 586533 579073 575890 583841 589646
30477 589646 583798 579365 576908 575302 565654 557381 555283 554603 563270 570731 578113 573560 566179 565970 570175
30462 570175 576027 572482 563345 564380 564475 566586 567965 563839 557874 557288 563805 554009 560759 566651 565489
30447 565489 566857 567287 560931 567065 567633 570281 581679 583467 586846 597163 586793 576949 579804 576595
30433 576595 575990 575645 570633 568918 575864 592667 594780 588933 583875 574218 582262 593632 594539 589959
30419 589959 586153 579786 589343 587782 570020 562450 564860 559198 562430 560451 565090 574794 573061 562353
30405 562353 567292 570923 574058 580781 580596 569739 571778 564114 558072 563155 569231 570617 573099 558261
30391 558261 557107 559446 563894 565097 555513 543425 546900 557041 561019 565997 570854 569825 576405 570991
30377 570991 568939 570840 566085 561621 563212 568253 571690 564344 559509 563509 568096 560678 557552 559096
30363 559096 550680 546125 551946 551983 557599 569284 573816 570570 581771 585319 579581 578606 578692 582564 581218
30348 581218 569993 565683 573165 565371 570866 577116 568359 566159 566895 567176 554161 553059 553570 555711
30334 555711 560541 564789 562769 568303 566963 569878 562123 561627 560898 560376 561316 566584 572059 575068 565105
30319 565105 562185 571771 578331 584281 580432 577486 581307 578437 576195 578983 583940 579329 570797 561507
30305 561507 566910 568671 560360 561607 569213 575591 570084 564776 568682 570322 573536 597194 598717 585804
30291 585804 575363 571984 577336 574610 571420 572588 569785 572584 571474 572515 565879 563599 579184 581797
30277 581797 572675 575695 585137 586964 586011 579481 579019 579265 574454 580115 587388 584882 584576 578214 566500
30262 566500 565907 562178 558390 559178 560449 569395 583950 582556 583351 575160 571205 577548 577301 568467 558923
30247 558923 560399 569934 579977 590276 588983 586296 586080 581936 571392 572724 578528 571931 572282 568660
30233 568660 565644 572111 584653 586661 586342 577897 575936 586118 584869 585250 582734 579844 572857 569492
30219 569492 577848 578411 572504 576102 577914 578494 579906 580229 570394 564432 572614 576957 572181 567749 574365
$$ [...]
##END NTUPLES=NMR SPECTRUM
##END=
