##TITLE=Analysis number 318459
Compound Code sew 01637
Project Code adrs
Chemist Name fudan
##JCAMPDX= 6.0         $$ Bruker NMR JCAMP-DX V2.0
##DATA TYPE= NMR SPECTRUM
##DATA CLASS= NTUPLES
##ORIGIN= Bruker BioSpin GmbH
##OWNER= nmr
$$ XWIN-NMR		Version 3.5
$$ Wed Mar 29 13:42:37 2006 GMT Daylight Time (UT+1h)  MAYBRIDGE\nmr@NMR_250MHZ
##.OBSERVE FREQUENCY= 250.131544655141
##.OBSERVE NUCLEUS= ^1H
##.ACQUISITION MODE= SIMULTANEOUS (DQD)
##.ACQUISITION SCHEME= undefined
##.AVERAGES= 16
##.DIGITISER RES= 18
##SPECTROMETER/DATA SYSTEM= dpx250
##.PULSE SEQUENCE= zg30
##.SOLVENT NAME= CDCl3
##.SHIFT REFERENCE= (INTERNAL, CDCl3, 0, 16.522)
##AUDIT TRAIL= $$ (NUMBER, WHEN, WHO, WHERE, WHAT)
$$ ##TITLE= Audit trail, XWIN-NMR		Version 3.5
$$ ##JCAMPDX= 5.01
$$ ##ORIGIN= Bruker BioSpin GmbH
$$ ##OWNER= nmr
$$ C:\u/data/dgb/nmr/ADRS/1710/pdata/1/auditp.txt
$$ ##AUDIT TRAIL=  $$ (NUMBER, WHEN, WHO, WHERE, WHAT)
(   1,<2006-03-29 13:41:52.38 +100>,<MAYBRIDGE\nmr>,<NMR_250MHZ>,
      <created by zg, POWCHK disabled, PULCHK disabled
       configuration hash MD5:
       84 BC 41 DB A1 6E 1D 46 DA 25 12 A5 C1 ED C5 3A
       data hash MD5: 64K
       7B EF 0C 5F A0 B4 C7 59 4D 11 E4 FB 66 8E 9A D9>)
(   2,<2006-03-29 13:42:11.61 +100>,<MAYBRIDGE\nmr>,<NMR_250MHZ>,
      <Start of raw data processing
       ef LB = 0.3 FT_mod = 6 PKNL = 1 SI = 32K 
       data hash MD5: 32K
       F3 7C 5C D5 EA 94 6B D2 B5 2B C5 1F B0 C2 86 60>)
(   3,<2006-03-29 13:42:14.77 +100>,<MAYBRIDGE\nmr>,<NMR_250MHZ>,
      <apk 
       data hash MD5: 32K
       00 83 B1 E9 51 D3 89 73 69 32 D4 EC 22 36 E0 50>)
(   4,<2006-03-29 13:42:16.38 +100>,<MAYBRIDGE\nmr>,<NMR_250MHZ>,
      <abs ABSG = 5 
       data hash MD5: 32K
       D3 D1 D8 DD 48 4A A4 2B DF 45 F8 3B 63 DE 71 B4>)
$$ ##END=
$$ 
$$ hash MD5
$$ F3 02 9D 46 8D 4F FD 34 8E 31 58 6D 08 91 6A 3F
##$RELAX= 
##$RELAX= 
##$RELAX= 
##$RELAX= 
##$RELAX= 
##$RELAX= 
##$RELAX= 
$$ Bruker specific parameters
$$ --------------------------
##$DU= <C:\u>
##$EXPNO= 1710
##$NAME= <ADRS>
##$PROCNO= 1
##$TYPE= <nmr>
##$USER= <dgb>
##$AMP= (0..31)
100 100 100 100 100 100 100 100 100 100 100 100 100 100 100 100 100 100 
100 100 100 100 100 100 100 100 100 100 100 100 100 100 
##$AQSEQ= 0
##$AQ_mod= 3
##$AUNM= <au_zg>
##$AUTOPOS= <31 >
##$BF1= 250.13
##$BF2= 250.13
##$BF3= 250.13
##$BF4= 250.13
##$BF5= 500.13
##$BF6= 500.13
##$BF7= 500.13
##$BF8= 500.13
##$BYTORDA= 1
##$CFDGTYP= 0
##$CFRGTYP= 5
##$CHEMSTR= <none>
##$CNST= (0..31)
1 1 145 1 1 1 1 1 1 1 1 1 1 1 1 1 1 1 1 1 1 1 1 1 1 1 1 1 1 1 1 1 
##$CPDPRG= <>
##$CPDPRG1= <>
##$CPDPRG2= <>
##$CPDPRG3= <>
##$CPDPRG4= <mlev>
##$CPDPRG5= <mlev>
##$CPDPRG6= <mlev>
##$CPDPRG7= <mlev>
##$CPDPRG8= <mlev>
##$CPDPRGB= <>
##$CPDPRGT= <>
##$D= (0..31)
0 1 0 0 0 0 0 0 0 0.06 0 0 0 0 0 0 0.0002 0 0 0 0 0 0 0 0 0 0 0 0 0 0 
0 
##$DATE= 1143636110
##$DBL= (0..7)
120 120 120 120 120 120 120 120 
##$DBP= (0..7)
150 150 150 150 150 150 150 150 
##$DBP07= 0
##$DBPNAM0= <>
##$DBPNAM1= <>
##$DBPNAM2= <>
$$ [...]
##$SUBNAM7= <"">
##$SUBNAM8= <"">
##$SUBNAM9= <"">
##$SW= 20.6930455092707
##$SWIBOX= (0..15)
0 0 3 0 0 0 0 0 0 0 0 0 0 0 0 0 
##$SW_h= 5175.983436853
##$TD= 65536
##$TD0= 1
##$TE= 294.16
##$TE2= 300
##$TE3= 300
##$TEG= 300
##$TL= (0..7)
0 120 120 120 120 120 120 120 
##$TP= (0..7)
150 150 150 150 150 150 150 150 
##$TP07= 0
##$TPNAME0= <>
##$TPNAME1= <>
##$TPNAME2= <>
##$TPNAME3= <>
##$TPNAME4= <>
##$TPNAME5= <>
##$TPNAME6= <>
##$TPNAME7= <>
##$TPOAL= (0..7)
0.5 0.5 0.5 0.5 0.5 0.5 0.5 0.5 
##$TPOFFS= (0..7)
0 0 0 0 0 0 0 0 
##$TUNHIN= 0
##$TUNHOUT= 0
##$TUNXOUT= 0
##$USERA1= <user>
##$USERA2= <user>
##$USERA3= <user>
##$USERA4= <user>
##$USERA5= <user>
##$V9= 5
##$VALIST= <valist>
##$VCLIST= <CCCCCCCCCCCCCCC>
##$VD= 0
##$VDLIST= <DDDDDDDDDDDDDDD>
##$VPLIST= <PPPPPPPPPPPPPPP>
##$VTLIST= <TTTTTTTTTTTTTTT>
##$WBST= 1024
##$WBSW= 4
##$XGAIN= (0..3)
0 0 0 0 
##$XL= 0
##$YL= 0
##$YMAX_a= 505923
##$YMIN_a= -506390
##$ZGOPTNS= <>
##$ZL1= 120
##$ZL2= 120
##$ZL3= 120
##$ZL4= 120
##$ABSF1= 16.522
##$ABSF2= -4.171173
##$ABSG= 5
##$ABSL= 3
##$ALPHA= 0
##$AQORDER= 0
##$ASSFAC= 0
##$ASSFACI= 0
##$ASSFACX= 0
##$ASSWID= 0
##$AUNMP= <proc_1d>
##$AZFE= 0.1
##$AZFW= 0.1
##$BCFW= 0
##$BC_mod= 0
##$BYTORDP= 0
##$COROFFS= 0
##$CY= 12.5
##$DATMOD= 1
##$DC= 0
##$DFILT= <>
##$DTYPP= 0
##$F1P= 14.0000005364418
##$F2P= -0.99999901652339
##$FCOR= 0.5
##$FTSIZE= 32768
##$FT_mod= 6
##$GAMMA= 0
##$GB= 0
##$INTBC= 1
##$INTSCL= 1
##$ISEN= 128
##$LB= 0.3
##$LEV0= 0
##$LPBIN= 0
##$MAXI= 10000
##$MC2= 0
##$MEAN= 0
##$ME_mod= 0
##$MI= 0
##$NCOEF= 0
##$NC_proc= -1
##$NLEV= 6
##$NOISF1= 0
##$NOISF2= 0
##$NSP= 0
##$NTH_PI= 0
##$NZP= 0
##$OFFSET= 16.522
##$PC= 1
##$PHC0= 171.3428
##$PHC1= 1.506819
##$PH_mod= 1
##$PKNL= yes
##$PPARMOD= 0
##$PSCAL= 4
##$PSIGN= 0
##$REVERSE= no
##$SF= 250.13
##$SI= 32768
##$SIGF1= 0
##$SIGF2= 0
##$SINO= 400
##$SIOLD= 32768
##$SREGLST= <1H.CDCl3>
##$SSB= 0
##$STSI= 32768
##$STSR= 0
##$SW_p= 5175.98343685301
##$SYMM= 0
##$S_DEV= 0
##$TDeff= 65536
##$TDoff= 0
##$TI= <Analysis number 999999
Compound Code 99
Book Reference 9
Project Code 9>
##$TILT= no
##$TM1= 0
##$TM2= 0
##$TOPLEV= 0
##$USERP1= <user>
##$USERP2= <user>
##$USERP3= <user>
##$USERP4= <user>
##$USERP5= <user>
##$WDW= 1
##$XDIM= 32768
##$YMAX_p= 269796839
##$YMIN_p= -30179
$$ End of Bruker specific parameters
$$ ---------------------------------
##NTUPLES= NMR SPECTRUM
##VAR_NAME=  FREQUENCY,     SPECTRUM/REAL,   SPECTRUM/IMAG
##SYMBOL=    X,             R,               I
##VAR_TYPE=  INDEPENDENT,   DEPENDENT,       DEPENDENT
##VAR_FORM=  AFFN,          ASDF,            ASDF
##VAR_DIM=   32768,         32768,           32768
##UNITS=     HZ,            ARBITRARY UNITS, ARBITRARY UNITS
##FACTOR=    0.157963299565203, 1,           1
##FIRST=     4132.6476996994, 0,             0
##LAST=      -1043.33573715361, 0,           0
##MIN=       -1043.33573715361, -30179,      0
##MAX=       4132.6476996994, 269796839,     0
$$ Real data points
##PAGE= N=1
##DATA TABLE= (X++(R..R)), XYDATA
$$ [...]
25815C638J867p51j232Q446k804k247m812m002k688Q500J049k93l347m227M418
25800A515j939k394L252m134N358L745o808m831M736O427n595q486N71l740j243
25785a3566j059N577J159M345O903R421k667r157J129m424q68J283K478JL770
25770D325J753l164l994p62J108j645l172R91K507j332l854m768O512O738j482
25755b39J030q307J502L379M782k062j498M327n85J740o528K6K903o33j62n23
25739h48M74n47l487P245L476k463m180M6l72k056J187j157K596k729L384l37
25723B32m836Q924N79k836k029m039o396J626N439M498l72n643M091k347p73L22
25707c560P441P524j804n80j877J432J24o733J761L501j738r007o582O839N471
$$ plain form
25815 3638 5505 4754 3522 11968 9164 6917 2105 -1897 -4585 3915 4964 4671 1324 -2903 1515
25800 1515 -424 -2818 434 -3700 1658 5403 -1405 -6236 -1500 4927 -668 -9154 -8583 -12323 -13566
25785 -13566 -14625 -9048 -7889 -3544 3359 12780 10113 956 2085 -2339 -3207 -1924 554 555 4325
25770 4325 6078 2914 -1080 -1842 -734 -2379 -5551 -4560 -2053 -3385 -7239 -12007 -5495 1243 -239
25755 -239 791 -7516 -6014 -2635 2147 85 -1413 2914 2329 4069 -2459 -2433 470 -163 -325 -848
25739 -848 -374 -921 -4408 2837 6313 3850 -330 -284 -656 -2712 -1525 -2682 -86 -2815 569 232
25723 232 -4604 4320 4899 2063 34 -4005 -10401 -8775 -3336 1162 790 -4853 -762 -3109 -3882 -3560
25707 -3560 3881 11405 9601 9021 7144 8576 8700 1967 3728 7229 5491 -3516 -10098 -3259 2212
25692B212J812L48o678j12O540J6773K355j0499q467l216l934Q74N587M289r384
25677a500K158M423o285k744K811J130j547l534K01L987K304j334n562K675R560
25662F743Qo790j879O642K502j630m571m731L301n42N62M781J1020K302j0975
25647F743n397J243O646l248l376K348P56m294J029Q900P96l240n26r82o347j553
25631e02Q898j982l078K89q22o252M329M283j738n262p962M214R843M630q811
25616G7j123J510M254J254O15L065P39r822o550L217M800l702M497L41M97L43
25600D012l34N867l386l231r635j094l536M727L408R16j602K20O342L40K716j586
25584D144l378o302l130K66L363m9M293k030O66n69J973n194m196Q204J894L104
$$ plain form
25692 2212 4024 4372 -2306 -2418 4122 20895 23250 12751 4284 1068 -2866 -1992 3595 7884 -1500
25677 -1500 658 5081 -1204 -3948 -1137 -7 -1554 -5088 -4887 -900 1404 70 -5492 -2817 6743
25662 6743 6751 -39 -1918 4724 7226 5596 1025 -3706 -405 -947 -385 4396 15416 17718 6743
25647 6743 1346 2589 9235 5987 2611 4959 5715 1421 2450 11350 12146 8906 8380 7398 1051 -502
25631 -502 8396 6414 3336 3625 2803 -3449 880 5163 3425 -1837 -9799 -5585 4258 8888 77
25616 77 -1046 464 4718 5972 6587 9652 10391 569 -5981 -2764 2036 -1666 2831 3172 3669 4012
25600 4012 3678 9545 6159 2928 -6707 -7801 -11337 -6610 -3202 -2286 -3888 -3668 2674 3014 5730 4144
25584 4144 766 -5536 -8666 -8400 -5037 -5086 -793 -2823 -2157 -2726 -753 -5947 -10143 -1939 -45 3059
25568C059k55k334l861O007L813j622K79K802K898J255j1891q437q22O320J053
25553a736n726N138O768K013k521j355K91M048no302m233j173l509k550l704N080
25537i476O483N950K819M15j568k345K12l315k212k098p409J073P748J403m217
25522f537M226j78m686K353j195j661K756L928O674n233j2099o831O923O106P651
25507B197N809P95r676j419J1322J950L97r5m244j162l185k437j717j59N342R893
25491A3611p25o616m715l924Q57j160L085n741l382k676k011L641L003o688j806
25476a5247j035j98M781J0990P367Q64m531l294q858K934K042o461j342m33N36
25461a1885P758M29l183N933j384K395K824q105N68k45K972J397K014Q484m111
$$ plain form
25568 3059 2804 470 -3391 2616 6429 4807 5086 7888 10786 12041 150 -8287 -9109 -2789 -1736
25553 -1736 -7462 -2324 4444 6457 3936 2581 2872 6920 6915 613 -3620 -4793 -8302 -10852 -14556 -9476
25537 -9476 -2993 2957 5776 6191 4623 2278 2490 -825 -3037 -5135 -12544 -11471 -3723 -2320 -6537
25522 -6537 -2311 -2489 -7175 -4822 -6017 -7678 -4922 -994 5680 447 -11652 -18483 -11560 -5454 2197
25507 2197 8006 8801 -875 -2294 9028 10978 11375 11280 7036 5874 2689 252 -1465 -1624 3718 13611
25491 13611 12886 6270 1555 -2369 -1512 -2672 413 -5328 -8710 -11386 -13397 -9756 -6753 -13441 -15247
25476 -15247 -16282 -16480 -11699 -709 6658 7522 2991 -303 -9161 -6227 -4185 -10646 -11988 -12421 -11885
25461 -11885 -4127 -3698 -6881 -948 -2332 63 2887 -5218 -4650 -4895 -1923 -526 1488 9972 5861
25446E861n092K750r32k612m341j997o75j0N897j024m816l066J609K027J4185
25431G764K057p921N109o423j189O411O699L606k030n139j293o417M614R94K910
25416I752j380J141p769n052J980K821n707p058K563N201Q03K821j285k18K318
25401I31k575M055O094q443J053N194L75j849K082P033o057n06N042q564k237
25386A628L414O007r29p685k143p90q906r66L537J741m045K155O720O955l638
25371C055l161r132L52k848L219O740M171p632k439n140N002J4767M892k557n907
25356C382n08j873m79Q061r96q495l508J1113M787m887n324k201l936m86L359
25341a991k947Q453P375Q452r706j3465P806R2P47k471k738q39N08j56p208P301
$$ plain form
25446 5861 769 3519 2587 -25 -4366 -6363 -7038 -7048 -1151 -2175 -6991 -10057 -8448 -6421 7764
25431 7764 9821 1900 7009 586 -603 5808 12507 16113 14083 8944 7651 1234 5848 6842 9752
25416 9752 8372 9513 1744 -3308 -1328 1493 -4214 -11272 -8709 -3508 -2705 116 -1169 -1387 931
25401 931 -1644 2411 8505 62 1115 6309 6684 4835 6917 13950 7893 7387 12429 3865 1628
25386 1628 5042 11049 10120 2435 292 -498 -9404 -10370 -6833 -5092 -9137 -6982 -262 6693 3055
25371 3055 -106 -9238 -8886 -11734 -8515 -1775 2396 -5236 -7675 -12815 -7813 6954 11846 9289 3382
25356 3382 2874 1001 522 8583 7587 -908 -4416 6697 11484 6597 1273 -928 -4864 -5350 -1991
25341 -1991 -4938 3515 10890 19342 9636 -3829 3977 4069 4816 2345 -393 -1232 -724 -880 -8088 -787
25325g87Q937J577q131m367R500M586m059j704K922L650r338qK711j027K572K471
25309I505P94n558k22J894M350k79J11M943k011p386K85J551K961P436n196k552
25293A0626l136m758l942o11M350L679J0436J564r419M853M138r58l767m580l027
25278E448m701j183M507M306o129m078j870J0380k141k943l511k023N278l667
25264b327k349L496R487j685n681N20j204L101J574n161m015K773O788N190j347
25249I160n008J275k872j382k029M539R502l765l132L560K60j080N57j0039J616
25234A162L677Q055L002j2508J180l936l458l226K673j27q685l109P984K806N338
25219H28O077N150q747o387l746m373n51q38J190J792P491N790k198l339M478
$$ plain form
25325 -787 8150 9727 1596 -2771 6729 11315 7256 5552 8474 12124 2786 2778 5489 4462 7034 9505
25309 9505 10299 4741 4519 6413 10763 10484 10595 15538 13527 6141 6426 7977 10938 18374 13178 10626
25293 10626 7490 2732 -1210 -1821 2529 6208 16644 18208 8789 13642 17780 16822 13055 8475 5448
25278 5448 747 -436 4071 8377 2248 -1830 -3700 6680 4539 1596 -1915 -3938 1340 -2327
25264 -2327 -4676 -1180 8307 6622 941 1461 257 3358 4932 -229 -4244 -1471 5317 10507 9160
25249 9160 4152 5427 2555 1173 -856 3683 13185 9420 6288 9848 10108 9028 9585 -454 1162
25234 1162 4839 12894 15896 3388 4568 632 -2826 -6052 -3379 -3506 -12191 -15300 -7316 -4510 828
25219 828 6905 12055 3308 -3079 -6825 -11198 -11749 -12587 -11397 -9605 -2114 3676 1478 -1861 2617
25204B617M563K250n142j1473J46J646k143N339O192k525L63J18j681k322J423
25189f29l230o172Q07O370O854m626l477n305K388J835J338l076K627L979N065
25174D748o77M23J295l91k726m349l713L571k10k006Q000k429o09l017M130l733
25158a693J374Q617k286k259k526J367K399q415l160m797L95Q461r139N105N476
25143a081J368m492l073m98j694M588L094j91j548j193j120L870Q584P358l119
25128A0853j971J327m758l090J365k981p676p895L465P733L289k731k791L616
25114b245N763l420n652R159J834l325j923m05K389Q34j07J348j390l676o236
25099g052p41P16K90l70l242O093Q856j887l07j125n449o147R377R88k790P203
$$ plain form
25204 2617 7180 9430 4288 -7185 -7039 -5393 -7536 -2197 3995 1470 1833 1951 270 -2052 -629
25189 -629 -3859 -10031 -9224 -2854 4000 -626 -4103 -9408 -7020 -5185 -3847 -6923 -4296 -317 4748
25174 4748 4071 4494 5789 5398 2672 -1677 -5390 -1819 -2029 -4035 3965 1536 927 -2090 2040 -1693
25158 -1693 -319 8298 6012 3753 1227 2594 4993 -3422 -6582 -11379 -10984 -2523 -11662 -6557 -1081
25143 -1081 287 -4205 -7278 -7776 -9470 -4882 -1788 -1979 -3527 -4720 -5840 -1970 6614 13972 10853
25128 10853 8882 10209 5451 2361 3726 745 -6931 -14826 -11361 -3628 -339 -3070 -5861 -2245
25114 -2245 3518 98 -5554 3605 5439 2114 191 -214 2175 3009 2902 4250 2860 -816 -7052
25099 -7052 -7793 -7077 -6787 -7157 -10399 -4306 4550 2663 2356 1231 -4218 -10365 -988 0 -2790 4413
25083D413L965k959o790q383N648O000Q39j41K108m415r507m926Q09N818N103
25068b418L903k748K396n863P84J808Q09l67j59k657J307K108J54L32L952N739
25052I080k360j0207p646N556O569k901K11P20J036J363j582n80o36r38O565O05
25036D855j7296p272P970Q11N547L015O226J778J783o187R0N876n982j854M42
25021a98o06K280Q76K455R218M830Q73o169r111m729m099k792J184K62J0280j770
25005B784N20l955n591j098P023O30m13m64K324M76k517j2141j643O538N060N165
24989B698L017m932j8J192M014K543k49j949o141o201J1626M596n274m786m967
24974d831J143P475l71M735J279m69L00j249j982n919n25N488N708L030m787p192
$$ plain form
25083 4413 8378 5419 -1371 -9754 -4106 1894 2733 2592 4700 285 -9222 -14148 -13339 -7521 -2418
25068 -2418 1485 -1263 1133 -4730 -3946 -2138 -1329 -1696 -1855 -4512 -3205 -1097 -943 -611 3341 9080
25052 9080 6720 -3487 -11133 -5577 992 -1909 -1698 -978 58 1421 -161 -741 -1377 -2315 4250 4855
25036 4855 -12441 -19713 -11743 -10932 -5385 -2370 3856 5634 7417 1230 1320 7196 1214 -640 -198
25021 -198 -804 1476 2352 4807 14025 18855 19728 13559 4448 -281 -4380 -7172 -5988 -5726 4554 2784
25005 2784 3304 -651 -6242 -7340 -317 313 -100 -564 1760 2236 -281 -12422 -14065 -7527 -2467 2698
24989 2698 5715 783 765 1957 5971 8514 8265 6316 175 -6026 5600 10196 4922 136 -4831
24974 -4831 -3688 3787 3416 8151 9430 8961 9261 8012 6030 111 -414 5074 10782 13812 9025 1833
24958A833l341J187p730o299J383J690L583n10l492m235N100J0745J592M134q545
24943b905M569J331o880n614j888k556M254j99K59K452p48L538Q063L439K20k585
24927D750m288o239N981Q288l301k914J826O010MO626j79q584l094m071j621l863
24911d669m030J159O672N830L980j2219k148L938m679j139M751l827L538l607
24897f450q177J725L005j053k311M971K428K752J988P31J880N276Rm032M150J257
24881H149o278j868M832l135r973p35J2416K29m70k308J879m13j709p461K857
24866c988j061R121P984J965r612r698m185Q668L70K874M301m058l008R56k732
24851b103o786j219N643J641J480r20J259L4M896l182q222P611n552k405K855
$$ plain form
24958 1833 -1508 -321 -8051 -14350 -12967 -11277 -7694 -8204 -11696 -15931 -10831 -86 1506 5640 -2905
24943 -2905 1664 2995 -3885 -9499 -11387 -13943 -9689 -9888 -9629 -7177 -7925 -4387 3676 7115 7335 4750
24927 4750 462 -5777 204 8492 5191 2277 4103 10113 10117 16743 16564 7980 4886 815 -806 -4669
24911 -4669 -8699 -7540 -868 4962 8942 -3277 -5425 -1487 -6166 -7305 -2554 -6381 -2843 -6450
24897 -6450 -14627 -12902 -9897 -10950 -13261 -8290 -5862 -3110 -1122 -391 1489 6765 6774 2742 6892 8149
24881 8149 1871 3 4835 1700 -8273 -9008 3408 3637 3167 859 2738 2325 616 -6845 -3988
24866 -3988 -5049 4072 12056 14021 4409 -5289 -9474 -806 -436 2438 6739 2681 -327 629 -2103
24851 -2103 -8889 -10108 -4465 -2824 -1344 -2264 -1005 -971 3925 743 -7479 132 -5420 -7825 -4970
24836d970m149k63K854M739k235n670n38K918Q783k772k114l010n086N032M394
24821b087j737R33O000K280m844r686K977J0237J0727l0j1675o399O43m401q1
24806g143K802J745P436L577m597p383or77l868J782M784O418k032j80K94l364
24790g12M449j422l431r78M947l148p97R671K952k896r253K091m093M2N215k301
24774C36m211P05J864n56J30l357R6J193J256K116j24k041n268k827L03P201l331
24757f515k340n486N509L215J664O609j960o298k390J111J0056M48m396q28R1
24742a510J567L957n97j789k00j797l818l107Q68q90O65p26M45k533K179O718
24726e68N125N78j75q5L191p055j195j23r45K102m624M770j703k950N49K680n234
$$ plain form
24836 -4970 -9119 -9382 -6528 -1789 -4024 -9694 -10232 -7314 1469 -1303 -3417 -6427 -11513 -6481 -2087
24821 -2087 -3824 -2891 3109 5389 545 -9141 -6164 4073 14800 14770 3095 -3304 -2661 -7062 -7143
24806 -7143 -4341 -2596 4840 8417 3820 -3563 -3569 -4546 -8414 -6632 -1848 4570 2538 2358 2652 -712
24790 -712 3737 2315 -1116 -2094 2853 -295 -1092 8579 11531 8635 -618 1473 -2620 -2578 2637 336
24774 336 -3875 -3170 -1306 -1862 -1732 -5089 -4993 -3800 -2544 -428 -552 -2593 -7861 -10688 -10385 -3184 -6515
24757 -6515 -8855 -14341 -8832 -5617 -3953 2656 696 -5602 -7992 -6881 3175 3623 -773 -1601 -1510
24742 -1510 57 4014 3417 1628 1428 -369 -4187 -7294 -6426 -7316 -6651 -7377 -6932 -9465 -7286 -568
24726 -568 4557 5135 4960 4875 8066 1011 -184 -307 -1252 850 -3774 996 -707 -3657 -3108 -428 -5662
24709e662m098K427N133J0565J336j189m997o576L406j261Q013N644l172L108
24695A2677j680m680j0241k087O150p09R828j569j062m93n650k101l483J231J226
24680b643j219k611l845k765o33j007J0174L678M14Q44k079J27j971n784j1195
24665b0515L690L559P98L76N657Q237Q907L325l78m19n356o274l940j24j728L547
24649f38M358J069L446n887m53K025n998K968j756P957M8m437K062R52p471j68
24633a923M31O55K440L203J709K751n580l882n955q45N05O96P015k744l312k061
24617f897j656K594k367m89M492L574L79k077k912k440O809L677k671q580o335
24602a4899J023M986n362r033M714K054M724q56L961L479J147j853L56K384q663
$$ plain form
24709 -5662 -9760 -7333 -2200 8365 9701 8512 3515 -3061 345 -916 7097 12741 9569 12677
24695 12677 10997 6317 -3924 -6011 139 -570 9258 7689 6627 6134 484 -1617 -5100 -3869 -2643
24680 -2643 -3862 -6473 -10318 -13083 -13716 -14723 -4549 -871 -457 387 -1692 -1565 -3536 -9320 -20515
24665 -20515 -16825 -13266 -12468 -12092 -6435 1802 10709 14034 13656 13237 7881 1607 -2333 -2457 -4185 -638
24649 -638 3720 4789 8235 2348 1895 3920 -2078 890 -866 7091 7139 2702 4764 5716 -1755 -1923
24633 -1923 -1492 -837 1603 4806 6515 9266 3686 -196 -6151 -6996 -6491 -5795 1220 -1524 -4836 -6897
24617 -6897 -8553 -5959 -8326 -8815 -4323 -749 -370 -2447 -5359 -7799 -990 2687 16 -8564 -14899
24602 -14899 -13876 -8890 -14252 -23285 -18571 -16517 -11793 -12649 -8688 -5209 -4062 -5915 -5559 -3175 -11838
24587a1838J291N594j859L031J1885m146j0933L76l980L48J917P83q89J301M999
24572b120M315P75L037O642l91k023R00l546r870o941J2284P972M020k119o458
24557F477n136K997k576j572k075o749J673O640l803l442R89L906M482m734n995
24542h918m103M8j9M725K466L622P773m335r231M49M848L871R47l394j613J762
24526a102n101N23m483k760j264L104k012n621J169M033k401J69N554M354k077
24511g915J461N130p33L594M794M828o851Q65j54j597n065k923N234N353N405
24496A1426K383l901r626k957m238J101K264K288j452l771L885n53Q918L361L319
24481A2447m318q092j597K111l355n677P266K469p365j486J553j211k730N207
$$ plain form
24587 -11838 -10547 -4953 -6812 -3781 8104 3958 -6975 -6599 -10579 -10231 -8314 -7531 -8420 -7119 -2120
24572 -2120 2195 2970 6007 12649 12258 10235 11135 7589 -2281 -9222 3062 11034 15054 12935 6477
24557 6477 1341 4338 1762 190 -1885 -8634 -6961 -321 -4124 -7566 -6577 -2671 1811 -2923 -8918
24542 -8918 -13021 -12973 -12992 -8267 -5801 -2179 5594 1259 -7972 -7523 -2675 1196 2143 -1251 -2864 -1102
24526 -1102 -6203 -5680 -10163 -12923 -14187 -11083 -13095 -18716 -17547 -13514 -15915 -15746 -10192 -5838 -7915
24511 -7915 -6454 -1324 -2057 1537 6331 11159 4308 5173 5019 3422 -1643 -4566 668 6021 11426
24496 11426 13809 9908 282 -2675 -6913 -5812 -3548 -1260 -2712 -6483 -2598 -3151 5767 9128 12447
24481 12447 8129 37 -1560 551 -2804 -8481 -1215 1254 -6111 -7597 -6044 -7255 -9985 -4778
24467d778N829L086j201o928K064J2325P101k872m888n382n577N444R481L385
24453A7089p830j0461N904L336m831o263K914P011L741j078J66J778J225j266
24439A1435j221J681J641j431m589n586o570P78J2329M005m790q802k537N852
24425B195j8m793P41Q205Q391k552p801K972m667P32o053n094J677o574N816M941
24409a882l828K501N244J58k185J931L136m144K791O537m727p219j14O48n458
24394f611m732O514J688M70n67N133R234j413o187P68J261l448l310l221q96K095
24378c222k028M404J2296l863n123O334n171k009K730M827O672J366n318NK546
24363A4446l256n145j230j601p0J137P829L307k422p334r235o381q21J0949P073
$$ plain form
24467 -4778 1051 4137 2936 -3992 -1928 10397 17498 14626 9738 4356 -1221 4223 13704 17089
24453 17089 9259 -1202 4702 8038 3207 -3056 -142 6869 10610 9532 9698 11476 12701 11435
24439 11435 10214 11895 13536 12105 7516 1930 -4640 -3862 8467 12472 7682 -1120 -3657 2195
24425 2195 2177 -2616 -1875 6330 14721 12169 4368 7340 2673 3405 -2648 -7742 -6065 -12639 -6823 -1882
24409 -1882 -5710 -3209 2035 2193 8 1939 5075 931 3722 10259 5532 -1687 -1801 -1153 -6611
24394 -6611 -11343 -4829 -3141 -2671 -3238 1895 11129 9716 3529 4297 5558 2110 -1200 -4421 -5317 -3222
24378 -3222 -5250 -846 11450 7587 2464 8798 3627 1618 4348 9175 15847 17213 11895 11900 14446
24363 14446 11190 6045 4815 3214 3144 4281 12110 15417 12995 5661 -3574 -9955 -10776 173 7246
24348G246o000l173m259J591J458P63M098j390n53q427N606N03n9j889n021j022
24332a0528n344l333K918O07j488p60M415l88O082J1192q00k514m57J143j775
24317a030k699j427L386J721k865m000K84l548p12R53J390J714n990J917M220
24302f686m122j4466J523J0424K842N745K478p17K06p660q184j435Q936j698P090
24287e724j924m582O858K509M283L424K137J833o839k838K202K889L600q34m91
24272F503n910j815P023m302n298K235J820L552R729l996j964L618J2412J172
24258B4779m220o793o557m13n913r525p80J191o23j0784J404R770J11J185Q419
24243A251L552o677l134K229m68M605k265m803l701M860R49K854M604M084m838
$$ plain form
24348 7246 1246 -1927 -6186 -4595 -3137 -2374 1724 334 -219 -8646 -3040 -2537 -2596 -4485 -9506 -10528
24332 -10528 -15872 -19205 -16287 -15680 -17168 -17928 -13513 -13901 -7819 3373 2573 59 -398 745 -1030
24317 -1030 -3729 -5156 -1770 -49 -2914 -6914 -6630 -10178 -10890 -9937 -8547 -6833 -12823 -10906 -6686
24302 -6686 -10808 -25274 -23751 -13327 -10485 -4740 -2262 -2979 -2773 -10433 -18617 -20052 -11116 -12814 -5724
24287 -5724 -7648 -12230 -5372 -2863 1420 4844 6981 8814 1975 -863 1339 4228 7828 6994 6503
24272 6503 593 -1222 5801 1499 -3799 -1564 256 3808 13537 9541 7577 11195 23607 24779
24258 24779 20559 13766 7209 6796 883 -8642 -9422 -8231 -8854 -19638 -18234 -8464 -8353 -7168 1251
24243 1251 4803 -1874 -5008 -2779 -3247 1358 -907 -5710 -9411 -4551 -3602 -748 3856 7940 3102
24228C102p110N306P726N72n70p307P349N308j4878l340Q935J119O43N38l56o815
24212B22j129J790M155M953m366m862n499N81K817M774N217p713o034O20o13P961
24196B874M492m775N06j353m800n07k500R962O009r330p453j69P886P601O18n154
24180C907l856q66j888O781K518p003j0167R059N904n693o700k45K769M493J370
24165C83l960J281j23O598J66n778j870N504L116m633M89l156M9J064K646R49
24149B725m326k405m868L557L496l996J64K965j472k396J920K366j264k500J727
24134d307l205j207J775N812l015q638L809P417L588L099k927l777k373n575J302
24119h222M285O865N031l326k480r18n389j669R16k139P607K330m022k331J817
$$ plain form
24228 3102 -4008 1298 9024 9596 9026 1719 9068 14376 -502 -3842 5093 6212 6855 7393 7037 222
24212 222 -907 883 5038 9991 5625 763 -4736 -4155 -1338 3436 8653 940 -5094 -4474 -5087 2874
24196 2874 7366 2591 3097 1744 -3056 -3563 -6063 3899 9908 578 -6875 -7044 842 8443 9061 3907
24180 3907 51 -815 -2703 4078 6596 -407 -10574 -1515 4389 -1304 -8004 -8249 -5480 -987 383
24165 383 -3577 -2296 -2419 4179 4345 -1433 -3303 2201 5317 684 1173 -1983 -1934 -870 1776 2725
24149 2725 -1601 -4006 -8874 -5317 -1821 -5817 -5653 -2688 -4160 -6556 -4636 -2270 -3534 -6034 -4307
24134 -4307 -7512 -8719 -6944 -1132 -4147 -12785 -8976 -1559 2029 5128 2201 -1576 -3949 -9524 -8222
24119 -8222 -3937 2928 7959 4633 2153 1235 -4154 -5823 -4907 -7046 561 2891 -1131 -3462 -1645
24104a645M722J97j110J005K712p159r531l395n538L926P775N546O69l034L83
24089d477K758J834N24Q86Q19q61n510N409O6J342j808n248n75Q9N219J865M572
24072F904L3Q69q53p941k001l382j63q50J268R184O013k079k048J172m290K259
24056D095p73j0281r832J156J1739O448M365M69n224J981l20Q04N339n881r978
24041e893j172N637l672m009L186O591K980m061k930K11J608n210q499J727K688
24026a0818K321J024K564J0911J142j64k712q163N63J905J039n319r90J488M550
24011f59j594k114J080M783J72j912N542l225q709k649p92P450N294j962j0397
23996i692k225L492n589M618Q668K553j789L445l917k933K059K058m882K29k654
$$ plain form
24104 -1645 3077 3274 2164 3169 5881 -1278 -10809 -14204 -19742 -15816 -8041 -2495 -1826 -4860 -4477
24089 -4477 -1719 115 639 1525 2344 1483 -4027 1382 1448 2790 982 -4266 -4841 -4752 467 2332 6904
24072 6904 6937 7806 6953 -988 -2989 -6371 -6534 -7384 -6116 3068 9081 7002 4954 6126 1836 4095
24056 4095 3322 -6959 -16791 -15635 -3896 2552 6917 7386 2162 4143 3823 4627 9966 4085 -5893
24041 -5893 -7065 -1428 -5100 -9109 -5923 668 3648 -413 -3343 -3132 -1524 -6734 -15233 -13506 -10818
24026 -10818 -8497 -7473 -4909 6002 7144 6980 4268 -3895 -3332 -1427 -388 -5707 -6697 -5209 -659
24011 -659 -2253 -4367 -3287 1496 1668 -244 5298 2073 -6636 -9285 -10077 -2627 2667 705 -9692
23996 -9692 -11917 -8425 -14014 -9396 -728 1825 36 3481 -436 -3369 -1310 748 -4134 -3905 -6559
23981f559q19m533K332K584q16o49j219J078M073Q74K611J049r470j585k522O634
23965f937M548M3j186J879k594j783l262K273l263O490N733Q561p86L65J089j505
23949I665m820K401L426p431m942k529L08n51n10Q527J0830J009o038m53p06k966
23933E220n16K561N285p368q876J282n8J890K284p49o959M00M854M007m247k22
23917a212K441l173K898R268q497n178o556L325L707k137k132L554O977J21K927
23902F333J284L396n403n634M503K452o817M008k438r633k119k788j497M769P523
23887b061q053o835L309O264M281P65q15j738M30p91L554L848M545o159n435m342
23871i233k127o39L225M97O14M408N558m903j121P860L961k07l483k971J567M078
$$ plain form
23981 -6559 -7378 -11911 -9579 -6995 -7811 -8460 -9679 -8601 -4528 -3654 -1043 6 -9464 -11049 -13571 -6937
23965 -6937 -2389 -2346 -3532 -1653 -4247 -6030 -9292 -7019 -10282 -3792 1941 10502 9716 10081 11170 9665
23949 9665 4845 7246 10672 3241 -1701 -4230 -3922 -4473 -4983 3544 14374 15383 9345 8892 8186 5220
23933 5220 4704 7265 12550 5182 -3694 -2412 -2470 -580 1704 955 -6004 -5604 -750 3257 -990 -1212
23917 -1212 1229 -1944 954 10222 1725 -3453 -10009 -6684 -2977 -5114 -7246 -3692 3285 3406 6333
23902 6333 7617 11013 5610 -24 4479 6931 114 4122 1684 -7949 -10068 -12856 -14353 -9584 -2061
23887 -2061 -10114 -16949 -13640 -7376 -3095 -2330 -3145 -4883 -4453 -5244 -1690 2158 6703 544 -4891 -9233
23871 -9233 -11360 -11999 -8774 -8277 -7663 -3255 2303 -2600 -3721 4139 8100 7893 4410 1439 3006 7084
23855G084L828L597o205l155JN833J846n855j684p740j440K860j427j133j416
23840e006K244M25p18K965r87j742O42n538k654J803N093k674K864O496K237M530
23824I980J74l531M54j555j0330k810L921k808R08L408l150l795K086j346K973
23809e421O398j52L383o389j4436n041J0232J0309k70L371L850J432R32M448K822
23794A5468n810n484o944K204K878l467j243k177K562M50Q3l557O447L173j1269
23779f686J492K38n44l744k258L129l68O628N263k196M140M570P052m050q039
23764D627l583p124j396M426P190K977k765j283q58j884j437P975O174m164m294
23749D581l466k245n552M63K482p1K8L074j938R56k246k096P838N701p700J540
$$ plain form
23855 7084 10912 14509 8304 5149 5150 10983 12829 6974 5290 -2450 -3890 -1030 -2457 -3590 -5006
23840 -5006 -2762 -2337 -3055 -90 -1077 -2819 -2177 -7715 -10369 -8566 -3473 -6147 -3283 3213 5450 9980
23824 9980 10154 6623 7077 5522 -4808 -7618 -3697 -6505 -5597 -2189 -5339 -9134 -7048 -8394 -5421
23809 -5421 977 825 4208 -2181 -16617 -21658 -11426 -1117 -1387 1984 5834 7266 8198 12646 15468
23794 15468 9658 4174 -2770 -566 2312 -1155 -2398 -4575 -2013 -1563 -1480 -5037 1410 4583 -6686
23779 -6686 -5194 -4956 -5500 -9244 -11502 -8373 -8741 -2113 3150 954 5094 9664 16716 12666 4627
23764 4627 1044 -6080 -7476 -3050 4140 7117 4352 3069 2211 327 -1110 6865 13039 8875 4581
23749 4581 1115 -1130 -6682 -6219 -3737 -3808 -3780 -706 -2644 -1688 -3934 -6030 1808 7509 -191 1349
23733A349J699r67o1k282k160n340p426j778N21n112M529O898J269j880L863n77
23717g455m245O087N198J950l819j95P140Q8j680J338j596Q01n533K35K565n300
23701d421m020p090Q66N577N251O116J402P28J867K711n167j593j774M630N297
23686A0380j437L64K297r226j0267J559J640K968M565l10k683r265N607O900k995
23671I7p23J283R6j425j649j15J137L449k302J392m473Q02l64Q19j314L320M271
23654D301n44n321k944p31j183M659M805p482o847P032P232n258k672L020K59
23639a674p561J96k165M507p34M208J940j792J586N726j117J234O24L582j054
23624G506n401o031o116J476k715j77K272K00O21M955Q536M90R68o896l755j981
$$ plain form
23733 1349 3048 2081 2020 -262 -2422 -7762 -15188 -16966 -16445 -21557 -17028 -10130 -8861 -10741 -6878 -7455
23717 -7455 -11700 -5613 -415 1535 -2284 -2479 4661 4749 3069 4407 2811 3612 -1921 -1686 879 -4421
23701 -4421 -8441 -15531 -14665 -9088 -3837 2279 3681 4409 6276 8987 3820 2227 453 5083 10380
23686 10380 8943 9307 11604 2378 -7889 -6330 -4690 -1722 2843 2533 -150 -9415 -3808 3092 97
23671 97 -626 657 753 -672 -2321 -2436 -1299 2150 -152 1240 -3233 -2431 -2795 -1976 -3290 30 4301
23654 4301 3757 -1564 -4508 -5239 -6422 -1763 3042 -4440 -11287 -4255 2977 -2281 -4953 -1933 -1674
23639 -1674 -9235 -9039 -11204 -6697 -7431 -3223 -1283 -3075 -1489 4237 3120 4354 4978 8560 7506
23624 7506 2105 -3926 -10042 -8566 -11281 -11458 -9186 -8986 -8365 -3410 5126 5616 6584 -312 -4067 -6048
23608f048j138O295j383L267J2370q72l180r355K424J4175J2433O934M384L952
23594D4258r413j0453o870k704r202m628m775o805L532Q672k29K58J666J216m685
23579a62k018K970k941l835K259L597K333J809j008j445j06j204Q304N397l771
23564A0179m883j480k336J869J398J338j860n958M40K915O231P768n061n444o346
23549a230K257R172P121n291j234m011k162J37R948n22n406l812m239n021J59
23534d134l494Q50q59K277O550K362J488K639p812m054n88k450o22N261O458r76
23518B896J782o21m10n625j618l211p101P146K217K20Q698j64j1482m591J937
23503i927O962M572P89M979j049K64J912Q05M130j2538m169J38j536M677m974
$$ plain form
23608 -6048 -7186 -891 -2274 993 13363 12491 9311 -44 2380 16555 28988 35922 40306 44258
23594 44258 34845 24392 17522 14818 5616 988 -3787 -10592 -7060 1612 1383 1641 3307 4523 -162
23579 -162 -2180 790 -2151 -5986 -3727 -130 2203 4012 3004 1559 1453 249 8553 13950 10179
23564 10179 5296 3816 1480 3349 4747 6085 4225 -1733 -1293 1622 7853 15621 10560 5116 -1230
23549 -1230 1027 10199 17320 12029 10795 6784 4622 4759 14707 14185 8779 4967 728 -4293 -4134
23534 -4134 -7628 -6778 -7637 -5360 1190 3552 5040 7679 -133 -4187 -4775 -7225 -7847 -2586 3872 2896
23518 2896 4678 4057 3647 -1978 -3596 -6807 -13908 -6762 -4545 -4325 4373 4209 -7273 -11864 -9927
23503 -9927 -2965 1607 2396 7375 6326 6590 8502 9307 13437 899 -3270 -3132 -4668 9 -4965
23488d965K997J1112R503r511j1244R68L731l415M6o76k1J0329l029q651r71J7
23472c780k991j105K464o41n14m247l209J61n35J772K824O57O79J4r78L72P639
23455a418K868l469r65Q249K434J592q81q687j771k802p732m133Q67L171K046
23440a0631n894P782R74L41M550Q160L004m897k236q22L336K626j418n826k947
23425c898J119M865K124o708q19L612j535N354J587n184j907M321O75J034K546
23410G186Q71l610j5831J58K610L661P436O918j46l184K300J61j979j0527j0869
23395a4845j976J693q81M324K648L222p27j66K241O02K848K368J934M600K936
23380A0821M554p615l631k155k413k660n362m622L160P795P626m011j017j064
$$ plain form
23488 -4965 -1968 9144 18647 9136 -2108 -1140 2591 -824 -778 -1454 -1475 8854 5825 -2826 -3797 -3780
23472 -3780 -6771 -7876 -5412 -6053 -6567 -10814 -14023 -13862 -14397 -12625 -9801 -9144 -8465 -8451 -9429 -9057 -1418
23455 -1418 1450 -2019 -2984 5265 7699 9291 8410 -277 -2048 -4850 -12582 -16715 -15848 -12677 -10631
23440 -10631 -16525 -8743 -7769 -7428 -2878 5282 8286 3389 1153 331 3667 6293 4875 -951 -3898
23425 -3898 -2779 2086 4210 -2498 -3317 295 -1240 4114 5701 517 -1390 2931 3606 4640 7186
23410 7186 8057 4447 -11384 -11226 -8616 -4955 2481 9399 9253 6069 8369 8530 6551 -3976 -14845
23395 -14845 -16821 -15128 -16009 -11685 -9037 -5815 -6542 -6708 -4467 -3865 -1017 1351 3285 7885 10821
23380 10821 15375 7760 4129 1974 -439 -3099 -8461 -13083 -9923 -2128 5498 1487 470 -594
23366e94n282k252K099O107M74q37O057K604K414K887p92l080L589J664r748j1152
23350e842J053O038M457K022j614m524l073J01M656M037l260j384M64m290J105
23335e4q73p984l553K508l783L118n879o217O217O443k085p29R062K950n322m669
23319a0850M755J1362J401k884l507L99M22p59K052O912K089j584j790m768p946
23304d696j767p136j835R665R916J205n949m908j982j942k075O499j137j842J875
23289f109K790m652M173k137k022L311n704k815j170L662R251K1j146K525k672
23274b694K053M252k910m533M05m15m456n132q77Q453j111l921N398N127M805
23259D444J526q993k194M387j206M434L094K256o892q177p40M08L352K129L813
$$ plain form
23366 -594 -5876 -8128 -6029 78 552 -285 5772 8376 10790 13677 12885 9805 13394 15058 5310 -5842
23350 -5842 -4789 1249 5706 7728 6114 1590 -1483 -1382 3274 7311 4051 2667 3131 -1159 -54
23335 -54 -927 -8911 -12464 -9956 -13739 -10621 -16500 -22717 -16500 -10057 -12142 -12871 -3809 -859 -6181 -10850
23319 -10850 -6095 5267 6668 3784 277 676 1098 339 2391 9303 11392 9808 8018 3250 -4696
23304 -4696 -6463 -13599 -15434 -5769 4147 5352 -597 -5505 -7487 -9429 -11504 -5005 -6142 -7984 -6109
23289 -6109 -3319 -7971 -3798 -5935 -7957 -4646 -10350 -13165 -14335 -10673 -1422 -1401 -2547 -22 -2694
23274 -2694 -641 3611 701 -3832 -3427 -3842 -8298 -13430 -14307 -5854 -6965 -10886 -5488 -361 4444
23259 4444 5970 -3023 -5217 -830 -2036 2398 5492 7748 856 -7321 -8061 -7653 -4301 -2172 1641
23244A641N398L503M210m76j0373m602k070J2385k195L715n029k47J885j245j505
23229D995j0450m438R28N905M395K425j140n706m516N454L544m751o192Q30J913
23214f804O51M402M999k08o362J099l181N593o895m937J873M29K6m521P722M024
23198b090o58j159m125K771J214P935N828O52k73m922k150k513j737l500r91l606
23182i324K395O216k822K591j240k948N532J142M086P7q321m109K063J0063M568
23167I969o579k702J63m110l693N660N574o336k121k130P15K827J780N116J588
23152E721L095l922m809J246n761m211L438J950K209l639J51j653L180K428L32
23137b45K223O754O118o095j3205o385N25K373m97M226P600n581n36l791m281
$$ plain form
23244 1641 7039 10542 14752 14276 3903 -699 -2769 9616 7421 11136 6107 5860 7745 6500 4995
23229 4995 -5455 -9893 -8965 -3060 1335 3760 2620 -3086 -7602 -2148 1396 -3355 -9547 -8717 -6804
23214 -6804 -6153 -1751 3248 3040 -3322 -2223 -5404 189 -6706 -11643 -9770 -9341 -9315 -13836 -6114 -2090
23198 -2090 -2748 -3907 -8032 -5261 -4047 3888 9716 10368 10095 5173 3023 510 -1227 -4727 -5718 -9324
23182 -9324 -6929 -713 -3535 -944 -2184 -5132 400 1542 5628 5705 -2616 -6725 -4662 5401 9969
23167 9969 3390 688 851 -3259 -6952 -1292 4282 -2054 -4175 -6305 -5590 -2763 -983 4133 5721
23152 5721 8816 4894 85 1331 -4430 -8641 -5203 -3253 -1044 -4683 -4532 -6185 -3005 -577 -245
23137 -245 1978 8732 14850 8755 -4450 -10835 -10310 -7937 -8434 -4208 3392 -2189 -2725 -6516 -10797
23122a0797o39n72P44j288O807O392o128j904j9J214L03O02m134O769O272m606
23106i84n916M438K97M477Q22K206K206m826n984m783N845R753K846r798n635
23091e036n174K791M106j425J111L342K571j589j4984N411R793k72n951j786o041
23076a3133k115O626M889M799M379m162n816L98o74L045O097M122m027k667l504
23061a743l877k122J13L818p97L127L814k491J784o075r83Q557M412p569q423
23046h455M089N999j998m577l900K692M04l665o457m195L289R214O293P19K173
23031A625K210J007l130O231k598j059l048J770P489p100k969o302O840J1251
23017A2217l093n423l925M331R388q514m390L024K293J29k053K43m116l607L70
$$ plain form
23122 -10797 -11436 -12008 -11264 -12552 -5745 647 -5481 -7385 -7404 -6190 -5887 -5285 -9419 -2650 3622 -984
23106 -984 -6900 -2462 -2165 2312 3134 5340 7546 2720 -3264 -8047 -2202 7551 10397 599 -5036
23091 -5036 -10210 -7419 -3313 -4738 -3627 -285 2286 697 -14287 -8876 917 645 -5306 -7092 -13133
23076 -13133 -15248 -8622 -3733 1066 5445 1283 -4533 -4135 -4809 -1764 4333 8455 4428 1761 -1743
23061 -1743 -5620 -7742 -7629 -3811 -4608 -1481 2333 -158 1626 -4449 -5432 3125 7537 -32 -8455
23046 -8455 -4366 1633 -365 -4942 -8842 -6150 -5746 -9411 -15868 -20063 -16774 -7560 -1267 -548 1625
23031 1625 3835 4842 1712 7943 5345 4286 1238 3008 10497 3397 428 -5874 966 12217
23017 12217 9124 3701 -224 4107 13495 4981 591 3615 5908 6037 3984 4227 111 -3496 -3126
23002c126k381n48J973M687J1697L293m743o140m070j051N50l38L962j421l599
22987a255n421k517K026l248p740N120j114M372O48l36R225p451l347J932K074
22972g032M618N261M274m871q623m599P242K598l834L16J0465L479n691p841K678
22957a560L453n643k639K510k381j871L105J0061k292j385m846n251k70O819K272
22942H2M101P80m997l056m373r853k312M180J2110L029m430q383n452R709j17
22927h982o936j250O058Q629J545l463k071j679l774O293M633L836o31k774J573
22912A007p53j251m729m694J920N725O65m052n296p168j345N590r64K402R416
22897c527N870K072J852p534p140j722l19o354L033N097O845L993r26J175J468
$$ plain form
23002 -3126 -5507 -6055 -4082 605 12302 15595 10852 4712 642 -409 141 -197 3765 2344 -1255
22987 -1255 -6676 -9193 -7167 -10415 -18155 -13035 -14149 -9777 -9129 -9465 -240 -7691 -11038 -9106 -7032
22972 -7032 -2414 2847 7121 2250 -6373 -10972 -3730 -1132 -4966 -4650 5815 9294 3603 -4238 -1560
22957 -1560 1893 -3750 -6389 -3879 -6260 -8131 -5026 5035 2743 1358 -3488 -8739 -9009 -2190 82
22942 82 4183 4963 -34 -3090 -7463 -17316 -19628 -15448 -3338 -309 -4739 -13122 -18574 -8865 -8982
22927 -8982 -15918 -17168 -11110 -2481 -936 -4399 -6470 -8149 -11923 -5630 -997 2839 2208 -566 1007
22912 1007 254 -997 -5726 -10420 -8500 -2775 -2110 -6162 -11458 -18626 -19971 -14381 -15345 -12943 -3527
22897 -3527 2343 4415 6267 -1267 -8407 -10129 -10448 -16802 -13769 -8672 -1827 2166 1240 2415 3883
22882C883K755N374k44n516k171O269q362n032J326k874n469K179K444j19L179
22867b378M469M544k02j739j482j879p15m518K0M380K476m459j216q25p344j388
22851a2256L620J4626K085k153m183p210j18P052m859j4674p92Q184P459O659
22837C440Q372j450j3040p454Q06M563J389N72p046j140M087L091M617N24n487
22822d156p406m542K909L064K324m35n277j649L108M667k376J803M800N232k223
22807a57M27k526m483N227L929n312n597P46R325O167n051n911m323L424j878
22792e993p788M347N944K045m558J050N233p97k567l73j190m945M714R24K511
22777a443L549K821M535P35j2036o206M272N52O830J584o560K796m162o887N126
$$ plain form
22882 3883 6638 12012 11768 6252 4081 10350 1988 -3044 -1718 -4592 -10061 -7882 -5438 -5557 -2378
22867 -2378 2091 6635 6433 4694 3212 1333 618 -3900 -3880 500 2976 -1483 -2699 -3524 -10868 -12256
22851 -12256 -8636 5990 8075 5922 1739 -5471 -5589 1463 -3396 -18070 -18862 -10678 -3219 3440
22837 3440 11812 10362 -2678 -10132 -9326 -4763 -3374 -2802 -9848 -10988 -6901 -3810 807 1331 -4156
22822 -4156 -11562 -16104 -13195 -10131 -7807 -8242 -13519 -15168 -12060 -7393 -9769 -7966 -3166 2066 -157
22807 -157 270 -2256 -6739 -1512 2417 -2895 -8492 -7746 1579 7746 2695 -3216 -7539 -4115 -5993
22792 -5993 -13781 -9434 -3490 -1445 -6003 -4953 280 -517 -3084 -3457 -4647 -9592 -4878 -3954 -1443
22777 -1443 2106 4927 9462 10197 -1839 -8045 -3773 -3221 3609 5193 -1367 1429 -2733 -9620 -4494
22762d494P034K160N08j2472p457M814L808K568K215n160J2L233J709N235J0563
22747A4276o000q837J699L05n10m674n725N594Q476q99m604m207K960O735l44
22732D245n212L751J449N687o88q04l248J041m19p118o806K774N948j031l701
22717d132K630Q284l367q994j389L66P06Q211J1552L912q808n764k393O59m990
22702c517P87N901J096K238n36k403O964J930n095o662K148n929o341M433M347
22687f39j884n857L81N449J435K623P179n203q577j315n54n69n478M009J65N31
22671h304Q880L94J135j117m647k443K399J992J085k781J204J45M019L589P12
22656F262L415q759j1278r923k269R146R604J0470N214M70j243l462m413n029
$$ plain form
22762 -4494 2540 4700 5208 -7264 -14721 -9907 -6099 -3531 -1316 -6476 -6464 -3231 -1522 3713 14276
22747 14276 8276 -561 1138 1443 933 -3741 -9466 -3872 4604 3705 -899 -5106 -2146 4589 4245
22732 4245 -967 2784 4233 9920 9232 8428 5180 6221 5802 -1316 -8122 -5348 600 -431 -4132
22717 -4132 -1502 6782 3415 -5579 -6968 -6602 -5896 2315 13867 17779 8971 3207 814 1473 -3517
22702 -3517 -2730 3171 4267 6505 5969 3566 10530 12460 7365 703 2851 -3078 -9419 -4986 -639
22687 -639 -2523 -8380 -7999 -2550 -1115 1508 8687 3484 -5093 -6408 -6962 -7531 -13009 -9000 -8835 -8304
22671 -8304 576 970 2105 988 -3659 -6102 -3703 -1711 -626 -3407 -2203 -2058 1961 5550 6262
22656 6262 9677 918 -10360 -20283 -22552 -13406 -3802 6668 11882 12352 11109 7647 3234 -1795
22642a795J369k921L406j475m148M516O849J883n554k660q06j330n338k157j21
22627a0282L097n306N484N428K582K83j377l594o404N188j435j866N095J0480
22613G373Q719m09P76l05m39n183j0142k953L057J714L662k51k942k801O44p700
22597g180M099L875K603J104k921p31Q34J437M288n865o214l988J230Q05K634
22582c990R22J324l144p70L005k385o63J31O247N345n874M623L249k980n580j083
22566a623j370k626j996R118L338j0067k590P40O934P215J182j1082m879K622
22552e084O504M304j25k337J510L958l473n503k227j14J707J714J895n387p226
22537i884J537O2M617M258q19M71l898n558L518J568n231P580R86k212K756P231
$$ plain form
22642 -1795 -426 -3347 59 -1416 -5564 -1048 5801 7684 2130 -530 -1336 -2666 -8004 -10161 -10282
22627 -10282 -7185 -12491 -7007 -1579 1003 1286 -91 -3685 -10089 -4901 -6336 -8202 -3107 7373
22613 7373 16092 15683 16459 16154 15715 10532 390 -2563 494 2208 5870 5619 2677 -124 520 -7180
22597 -7180 -3081 794 3397 4501 1580 849 1683 3120 7408 1543 -4671 -8659 -7429 -6624 -3990
22582 -3990 -3068 -1744 -4888 -5658 -2653 -5038 -5701 -5570 677 6022 148 4771 8020 5040 -540 -1623
22566 -1623 -2993 -5619 -7615 1503 4841 -5226 -7816 -7076 -142 7073 8255 -2827 -7706 -5084
22552 -5084 1420 5724 5599 3262 4772 8730 5257 -246 -2473 -2587 -880 834 2729 -2658 -9884
22537 -9884 -8347 -8285 -3668 590 -229 242 -3656 -9214 -5696 -4128 -9359 -1779 -793 -3005 -249 6982
22521F982n231m714p37m948n948m147M929K608O473J902l394n544n723Q313Q798
22506c81l383p945L916O324J0627L263K560M96l780m076p596M158J884j630R46
22491E383L366K905J102J895L814r367r799n474J871L994M654l681q604n912K785
22476a1068J4224N266o484L06n916m530J203P183Q81j1024J102J2177L181l109
22462C392L26L731K227n493p691m708q24M939L409j585J776j884m674M109K337
22447f13m199P69K359N153l279r268L977K545m05K684m798J243J823l759N149
22432f19O483P77J263j0820l188k045K546L14k21l156J627j90L234o448n334Q803
22416f974k299j58Q151J018p111P92K870K902M859O15J605o53o618N530p139j0700
$$ plain form
22521 6982 1751 -2963 -3700 -8648 -14596 -18743 -13814 -11206 -4733 -2831 -6225 -11769 -17492 -9179 -381
22506 -381 -3764 -11709 -7793 -1469 9158 12421 14981 15477 11697 7621 25 4183 6067 4437 5383
22491 5383 8749 11654 12756 14651 18465 9098 -701 -6175 -4304 -310 4344 663 -7941 -13853 -11068
22476 -11068 3156 8422 1938 2244 -3672 -8202 -6999 184 1065 -9959 -8857 3320 6501 3392
22462 3392 3718 7449 9676 4183 -3508 -8216 -9040 -4101 -692 -2277 -501 -2385 -7059 -2950 -613
22447 -613 -4812 -4043 -1684 3469 190 -9078 -5101 -2556 -2961 -277 -5075 -3832 -2009 -5768 -619
22432 -619 5864 6641 7904 -2916 -6104 -8149 -5603 -5289 -5510 -8666 -7039 -7229 -3995 -10443 -15777 -6974
22416 -6974 -9273 -9431 -1280 -262 -7373 -6581 -3711 -809 4050 4665 6270 5617 -1001 4529 -2610 -13310
22400a3310k207Q804M57K742L048L5o503O02L478j279K708K389P42o058n396j602
22384a1350p79Q239L06K214l774k323m202L441J300n383j54l268K979O983J0279
22369D508p542m771j5J432M436K341l461p711k830n122J214P180L864m856P68
22354a0565M07R364N02K342l295r923p130P489R577m458k713M760L81L369l366
22339c259o196j989O329l117j183O842O924L221o966J25R569L181o134r814P032
22324D565Q657L47o245m692l614K623j773n648M24R085K422q282m467L007Q830
22309E239K784K320m872l158K289l703q287P33N804l6o82q162j791P686J763Q877
22293F804K201m983k924M856n622j498N039j482P519L685o391n195l499n43P264
$$ plain form
22400 -13310 -15517 -6713 -6256 -3514 -466 -431 -6934 -6332 -2854 -4133 -1425 964 1706 -4352 -9748 -11350
22384 -11350 -12129 -3890 -3584 -1370 -5144 -7467 -11669 -8228 -6928 -12311 -12465 -15733 -12754 -5771 4508
22369 4508 -3034 -7805 -7820 -6388 -1952 389 -3072 -10783 -13613 -18735 -17521 -10341 -6477 -11333 -10565
22354 -10565 -10158 -794 -292 2050 -1245 -11168 -18298 -10809 -1232 -5690 -8403 -3643 -3262 107 -3259
22339 -3259 -9455 -11444 -5115 -8232 -9415 -2573 4351 7572 606 731 10300 13481 7347 -2467 4565
22324 4565 13222 13569 7324 2632 -982 1641 -132 -5780 -5356 3729 6151 -2131 -6598 -3591 5239
22309 5239 8023 10343 5471 2313 4602 899 -7388 -6655 -851 -887 -1569 -9731 -11522 -3836 -2073 6804
22293 6804 9005 4022 1098 5954 332 -1166 3873 2391 9910 13595 7204 2009 -1490 -2033 5231
22278E231m936N538j617r823n955j894L917N771L745M154J675j0031p759N82L799
22263g603P432O882P39o52q23j2455j488l609N552M105L180P220K285m010l776
22248B979m096n458L847K105O434M386r683j1237N838M146j58J925m1J616L525
22233F128k924k26n74L673m425k71N604n211k902J0191l391k544l060l057L728
22218G39N753O56m206l945J916J872k41K487M480j851j47q77j156n916J006K03
22202G73m82l028l143o78k078j96J160M941M212m397K171m955M055N954j019l247
22186D3M02l194k512O933J176k405L42L505M72L315q890l318Q716M609Jn434o441
22169b680K190k451N36j075L253m563r058J949J637m433o910N846K573J482N950
$$ plain form
22278 5231 295 5833 4216 -5607 -11562 -13456 -9539 -3768 -23 4131 5806 -4225 -11984 -11402 -7603
22263 -7603 -171 6711 7450 6798 5975 -6480 -7968 -11577 -6025 -1920 1260 8480 10765 6755 2979
22248 2979 -1117 -6575 -2728 -623 5811 10197 514 -10723 -4885 -739 -897 1028 987 2603 6128
22233 6128 3204 2978 2404 6077 1652 1381 6985 1774 -1128 9063 5672 3128 68 -2989 739
22218 739 6492 7148 2942 -1003 913 2785 2544 5031 9511 7660 7513 6636 5480 -436 570 773
22202 773 291 -2737 -5880 -6558 -8636 -8832 -7672 -2731 1481 -2916 -745 -5700 -1645 4309 3290 43
22186 43 445 -2749 -5261 1672 2848 443 785 4290 4762 8077 -813 -4131 4585 9194 9195 3761 -2680
22169 -2680 -490 -2941 -2405 -3480 -227 -4790 -13848 -11899 -10262 -14695 -21605 -15759 -13186 -11704 -5754
22154e754L417j205K388J807l502j190j410r71l295N588R167j332k827j406l940
22139d465l116L056J0141M46j866k803J906N170J933j466j965q670l41P871L753
22124I584n857L234L737o056l700J342l387M99J721N005K85l519k304J379k933
22109i70k42N819k450j1958r608Q676N591l527n438l063m940O670P423r33n894
22094a4844o075L68K591K387L472j857J326L191Q271p30m882L44P144K338q805
22079e761m886M591J609j686o816J380K941R08J518J28r480P130J4228K383j858
22064F329K688j616K637M054m462q739q181P614J077O773M013L919k726J937j1717
22049C600j6403o101N151P687n652l790N781L991L549N564N992r271n932k063
$$ plain form
22154 -5754 -2337 -3542 -1154 653 -2849 -4039 -5449 -6420 -9715 -4127 5040 3708 881 -525 -4465
22139 -4465 -7581 -4525 5616 6062 4196 1393 3299 8469 10402 8936 6971 -1699 -2040 5831 9584
22124 9584 3727 6961 10698 4642 942 2284 -1103 -604 1117 6122 6407 2888 584 1963 -970
22109 -970 -1212 4607 2157 -9801 -19409 -10733 -5142 -8669 -14107 -17170 -22110 -15440 -8017 -8950 -14844
22094 -14844 -20919 -20551 -17960 -15573 -12101 -13958 -12632 -9441 -1170 -1900 -6782 -6438 706 3044 -5761
22079 -5761 -10647 -6056 -4447 -6133 -12949 -11569 -8628 -7720 -6202 -6074 -15554 -8424 5804 8187 6329
22064 6329 9017 7401 10038 14092 9630 891 -7290 324 1401 8174 12187 16106 13380 15317 3600
22049 3600 -12803 -18904 -13753 -6066 -11718 -15508 -9727 -5736 -2187 3377 9369 98 -5834 -7897
22035g897j924R306K266n509j512N889J95l641K36n72R998k47o456l857K402M924
22019C601J744m406L260M54r450K586N11J386j975J537O377j248k418J416M49
22004C824p549p36L928K49Q7p14k587K043P81P665L810n884n624j2560j251K503
21988a2015M219L543O573Q46k264j260n277n308J139J700L57L72Q463P734l9j896
21972F887k734p026K840r42l046K552Q473l372J586m342K528Q20k559m748J584
21957a499M911N22l634J769l278K025j171k09N582Q8R98m432m137o253Q38L40
21941g540J760k671K673k773q117K641l129M291J254m869M937N111j127j148L313
21926e394j501j606P457j547l501M749O836L556k059K563N995J380R27q599n67
$$ plain form
22035 -7897 -9821 -515 1751 -3758 -5270 619 814 -2827 -2591 -3163 6835 6588 132 -3725 -1323 3601
22019 3601 5345 939 4199 4653 -4797 -2211 -1700 -314 -2289 -752 5625 4377 1959 3375 3824
22004 3824 -3725 -4461 -533 -284 -197 -911 -3498 -1455 -674 6991 10801 4917 -707 -13267 -14518 -12015
21988 -12015 -7796 -4253 2320 3166 902 -358 -5635 -10943 -9804 -8104 -7747 -7375 1088 8822 8783 6887
21972 6887 4153 -2873 -33 -975 -4021 -1469 7004 3632 5218 876 3404 4224 1665 -3083 -1499
21957 -1499 3412 3934 300 2069 -1209 816 -355 -564 5018 5106 6104 1672 -2465 -8718 -7880 -7540
21941 -7540 -5780 -8451 -5778 -8551 -16668 -14027 -17156 -12865 -11611 -16480 -11543 -6432 -7559 -8707 -5394
21926 -5394 -6895 -8501 -1044 -2591 -6092 -1343 5493 9049 6990 9553 15548 16928 17855 9256 8689
21911H689l62k857l583p744j866O800M642K370N3l960k905L846j208l927p1N1
21895b032j404N785m034l101M079J355k047O182J523o754O84K229o886K663J2902
21880A1144J702p000o327N730O793J526n573r956l508m34K036K434M213l530K528
21865A778J689K90k657r9O086p463M80K560j306j97O358N86m573n732p581k210
21849a1991J116O390O585J07l811m638o185k101K29R28O297O015L983k657L611
21834C878J01j781M99N088M33r165p95J170k06m274j491K875P184m113q500L553
21818e544J157m030j668L661L170J602L63r251l919O908O765Q76n380L128R320
21803G158J1143n166j3780p052J813P11P51M608N551L366p534m018J1115M936
$$ plain form
21911 8689 8327 5470 1887 -5857 -7723 -923 3719 6089 6142 2182 -723 3123 1915 -2012 -2083 -2032
21895 -2032 -3436 2349 -1685 -4786 -707 648 -1399 4783 6306 -448 236 2465 -4421 -1758 11144
21880 11144 12846 5846 -481 5249 12042 13568 7995 -1961 -5469 -5903 -3867 -1433 2780 -750 1778
21865 1778 3467 3757 1100 1001 7087 -376 104 2664 1358 1161 7519 8105 3532 -2200 -9781 -11991
21849 -11991 -10875 -4485 2100 2207 -1604 -6242 -12427 -14528 -14299 -13371 -7074 -1059 2924 267 3878
21834 3878 3979 2198 2697 7785 8218 -947 -1742 -572 -778 -5052 -6543 -3668 3516 -597 -9097 -5544
21818 -5544 -4387 -8417 -10085 -6424 -3254 -1652 -1289 -10540 -14459 -7551 -786 90 -5290 -2162 7158
21803 7158 18301 13135 -645 -7697 -5884 -5173 -4422 186 5737 9103 1569 -2449 8666 13602
21789A3602p626J947n887l64m759k927m037j25K656m19J753n84J446L974N078
21774C728k548m6L723l767M554K175k331k490r83J440J205l967K590M166l4o866
21758E49k551J979J55J016K839N227l737j962j908N885R16l459k512J902Q46K246
21742G431m439q251K349K497m1r008j112P045J243N511K089l308o403n267m15
21727a0079L257L528L206P255K453k015o060k005l540m255j220j301L786L87J929
21712d674P514N815m182k839l455n688J250P837R834M698j1472q004L334K81J325
21697A574j111k054n762L76N178k295J583J881J738J1854l87m552L179j379q344
21682A479p135M955Q244o245p994m576n410Q469J0716J978n188N011n453q26l793
$$ plain form
21789 13602 5976 7923 2036 1672 -3087 -6014 -10051 -10176 -7520 -7939 -6186 -6770 -5324 -1350 3728
21774 3728 1180 1134 4857 1090 5644 7819 5488 2998 2015 3455 4660 693 3283 7449 7415 549
21758 549 -2002 -23 132 1148 3987 9214 5477 3515 1607 7492 8408 4949 2437 4339 5185 7431
21742 7431 2992 -5259 -2910 -413 -454 -9462 -10574 -3529 -2286 3225 5314 2006 -4397 -9664 -10079
21727 -10079 -6822 -3294 -88 7167 9620 7605 1545 -460 -4000 -8255 -9475 -10776 -6990 -6603 -4674
21712 -4674 2840 8655 4473 1634 -1821 -7509 -6259 1578 11412 16110 4638 -3366 -32 249 1574
21697 1574 463 -1591 -7353 -6977 -1799 -4094 -2511 -630 1108 12962 12575 8023 11202 9823 1479
21682 1479 -5656 -701 7543 1298 -6696 -11272 -16682 -8213 2503 4481 -707 4304 -1149 -1975 -5768
21667e768n9l950K992l616J186J483J913q36k127m497J601K985O0N285L720L990
21651D362K51p977j0312M890O427K973K453M491l267j998M119K948n566k317K760
21636D237R18l175K838J312m567M772j53m463O521o44j318j09m252Q97n04k096
21620B14O419n4o183o552l489K865l724K841L187L045O063n78n822l151O594P555
21604I230j350o863n788J092M417N183o026m116L485N92N112L675m725k424o554
21589e060L694K676j047n34k570j897K544K292Q37r30q743k57Q70P02N644o55
21573b434O510J095j1597N702Q106K14m031p021M271n539J46k528J824k689K902
21558e069N474O949Q13m626M660K510l253M15M531j23l346q945N523M507k188
$$ plain form
21667 -5768 -5827 -9777 -6785 -10401 -9215 -7732 -5819 -6655 -8782 -13279 -11678 -8693 -8633 -3348 372 4362
21651 4362 4613 -3364 -13676 -8786 -2359 614 3067 7558 4291 2293 6412 9360 3794 1477 4237
21636 4237 5155 1980 4818 6130 1563 6335 6182 1719 8240 7596 6278 6169 1917 2814 2310 214
21620 214 6633 6579 396 -6156 -9645 -6780 -10504 -7663 -4476 -1431 4632 4054 -1768 -4919 1675 9230
21604 9230 7880 1017 -4771 -3679 738 5921 -105 -4221 -736 -144 4968 8643 3918 1494 -5060
21589 -5060 -1366 1310 263 -271 -2841 -4738 -2194 98 935 5 -8738 -8995 -8125 -7423 -1779 -2434
21573 -2434 4076 5171 -6426 -724 7382 7596 3565 -3456 815 -4724 -4578 -7106 -5282 -7971 -5069
21558 -5069 405 7354 8167 3541 8201 10711 7458 7873 12404 12281 8935 -10 5513 10020 7832
21543G832l080k780M392j163j4275j0360M239M675R32M860P27J776m907p163Q094
21528f201R63l569M101J2469M789p005l571j335k43p465j566j58k604M373M029
21513b993M974l469q966p37k075P958R114O189L375J013L586l623o799q86J795
21498H456L761m960l110J754n749j246N170K807n305j5308l915K261N25N070l11
21483a0100q00n79l06q4Q317O399J287o795L366K687l938n902k158J133j74P206
21467d41P963l133n601K974M145J055k042l598J593K226L668M692p01O18n328
21452H090p065m774m83M402l307p24L814M358o680m667P785K202L254Q31L023
21437A0059p905r124j0904L935P325j860J125l80O204N872j119n417M21r96J183
$$ plain form
21543 7832 4752 1972 6364 5201 -9074 -19434 -15195 -10520 -9588 -4728 -4001 -2225 -7132 -14295 -6201
21528 -6201 -5238 -8807 -4706 7763 12552 5547 1976 641 398 -7067 -8633 -8791 -11395 -7022 -2993
21513 -2993 1981 -1488 -10454 -11191 -13266 -5308 3806 9995 13370 14383 17969 14346 7547 6661 8456
21498 8456 12217 7257 4147 5901 152 -1094 4076 6883 1578 -13730 -17645 -15384 -14859 -9789 -10100
21483 -10100 -10900 -11479 -11785 -11869 -3552 2847 4134 -2661 705 3392 -546 -6448 -8606 -7473 -7647 -441
21467 -441 7522 4389 -1212 1762 5907 6962 4920 1322 2915 5141 8809 13501 12800 13418 8090
21452 8090 1025 -3749 -4232 170 -3137 -3861 -47 4311 -2369 -7036 749 2951 6205 7036 10059
21437 10059 2154 -6970 -17874 -13939 -6614 -8474 -7349 -7729 -1525 4347 3228 -2189 -1768 -2764 -1581
21422a581n090n494O99N687O557K820M476l69j0078q508k744Q790L603L778N620
21407H166n77o527K656J820k684o680K889Q63k480L104J507J842P85N132K547
21392A2363r972n857L207Q315l182j7499j1285N133J1369j418L975K738p83J595
21378a301J614L477J877r19l58l678K575l908J788l318n493K906P303L345k213
21363C697k907Q92J096Q20M485K135o519o539Q075j345j0767Q19M835n27n796
21348g546k75P086L929M628k198q249j561k060M369Q294n04n361L28j659j301
21333b080L233m325k987o921M346P437M978j1561q719P826Q792j908j997O600
21319B714K620n359j700O56L033O235N88n11K606P7m832r047n391M833M557j221
$$ plain form
21422 -1581 -6671 -12165 -11466 -5779 778 3598 8074 7705 -2373 -10881 -13625 -4835 -1232 2546 8166
21407 8166 7589 1062 3718 5538 2854 -3826 -937 -74 -2554 550 2057 3899 4684 9816 12363
21392 12363 2391 -3466 -259 8056 4874 -12625 -23910 -18777 -7408 -8826 -4851 -2113 -2896 -1301
21378 -1301 313 3790 5667 4748 4390 712 3287 -621 1167 -2151 -7644 -4738 2565 5910 3697
21363 3697 790 1682 2778 3598 8083 10218 3699 -2840 5235 3890 -6877 -6058 -1223 -1750 -7546
21348 -7546 -7821 -735 3194 7822 5624 -2625 -4186 -6246 -1877 6417 5913 552 880 -779 -2080
21333 -2080 1153 -3172 -6159 -13080 -8734 -1297 3681 -7880 -16599 -8773 19 -1889 -3886 2714
21319 2714 5334 -25 -1725 -1069 1964 8199 8787 8276 10882 10959 6127 -2920 -8311 -3478 1079 -142
21303a42Q694P255n850o216j181L89l754M997k321l615j504L088J882l943k638
21288d859N023m829n33J267M340n50k83L814J4r637m045K899N592l662P51K137
21272b561j895M55P049N907k872L999j970l590o914m594k216j408O288M348j371
21257a345M182k783K746j985N48J739J775n2n498O485k501K9L912k96k930o168
21241b142N36p174k366J43O52n952q55Q184l85R255L034p248n294l565k38K199
21225a1216l214M012J0531r17j757J323l247k018Q04L092J689j438L939J0840
21211A2423K984l449j5128m561P390P461J339n398l00n01J099O589M427l987M72
21196A0860J80q89k464o874j650R92r31J497L461N34l241N53K168p262J045R164
$$ plain form
21303 -142 8552 15807 9957 3741 2560 2949 -805 4192 1871 -1744 -3248 -160 1722 -2221 -4859
21288 -4859 164 -4665 -5198 -3931 409 -141 -424 3390 3404 -6233 -10278 -7379 -1787 -5449 -4698 -2561
21272 -2561 -4456 -4001 3048 8955 6083 10082 8112 4522 -2392 -6986 -9202 -10610 -4322 26 -1345
21257 -1345 2837 54 2800 815 1363 3102 4877 4825 -673 5812 3311 3340 7252 6956 4026 -2142
21241 -2142 -1606 -8780 -11146 -11003 -10351 -16303 -17158 -8974 -9359 -104 2930 -4318 -9612 -13177 -13415 -11216
21225 -11216 -14430 -10418 113 -804 -2561 -1238 -4485 -6503 -5699 -2607 -918 -2356 1583 12423
21211 12423 15407 11958 -3170 -7731 -341 7120 8459 3061 2761 2260 3359 9948 14375 10388 10860
21196 10860 11040 10151 7687 813 -837 155 -776 721 4182 4716 1475 2028 4196 -3066 -2021 7143
21180G143Q69l162q47j648L352O68L926j425j2267m053L887O669m80K59N004l507
21164D388m166m338k042R360k014K94J915P175J811l272O7K542L699n960p805
21149A654j335p119J177j616p43J307L402O938j935n238l24L187N794J665L659
21134A0473n914r51M996o817l288M765K452m398m456p8L150M97Q206J633m217
21119F053M26j067m913K464N024n683l107r118p907L735J1076l029J078O377l63
21104A046l402l116L532j932k824k375q20J76M085O731m681o376m357k723K708
21089a4328K770O282l617M17J042q203k217K890P598l226n635m940N723J1275
21075d169M691J17o495K39K620n03n48K590k820o850L895L148o444K779l956L856
$$ plain form
21180 7143 8012 4850 4003 2355 5707 6375 10301 8876 -3391 -7444 -3557 3112 2632 2891 7895 4388
21164 4388 222 -4116 -6158 3202 1188 1482 3397 10572 12383 9111 9178 11720 15419 9459 1654
21149 1654 319 -6800 -5623 -7239 -7982 -6675 -3273 3665 1730 -3508 -3832 -645 5149 6814 10473
21134 10473 4559 3608 8604 1787 -1501 3264 5716 1318 -3138 -3216 -66 431 8637 10270 6053
21119 6053 6479 5412 499 2963 7987 2304 -803 -9921 -17828 -14093 -3017 -6046 -4968 1409 1046
21104 1046 -2356 -5472 -1940 -3872 -6696 -9071 -9891 -9715 -5630 1101 -3580 -9956 -14313 -17036 -14328
21089 -14328 -11558 -5276 -8893 -8476 -7434 -15637 -17854 -14964 -7366 -10592 -16227 -21167 -15444 -4169
21075 -4169 522 639 -5856 -5617 -2997 -3500 -4048 -1458 -4278 -11128 -7233 -4085 -10529 -7750 -11706 -7850
21059g850J1903N748K590j709n298p735m185k891R85L849J163q20K498N237K697
21044F182m352K138L704R407p57p624p881J768l235n774m243L692N160P484J82
21029E851k369j502J963k414j600J501q056M147M95N714p808j587J0095N156l789
21014E797K594k425l209Q78l509r543j228L629L783j91J777K301l420N876L845
20999F955k780k658P42K440m761k568l467l763O68L711K535Q0M505N008n471j793
20983f17j2212o409J5567R026J17m904p028m727N693k719l686P557K051L250M545
20968E504O118k671n328l403J0476J522k670l958M458k934J558M123P66P52P30
20953A5043r380j344j055L343j139l032N251N251j982K842q271k385k441m019
$$ plain form
21059 -7850 4053 9801 12391 10682 5384 -2351 -6536 -9427 -8442 -4593 -3430 -4250 -1752 3485 6182
21044 6182 1830 3968 7672 17079 16322 8698 817 2585 -650 -6424 -10667 -6975 -1815 5669 5851
21029 5851 3482 1980 3943 1529 -71 1430 -6626 -2479 -1984 3730 -4078 -5665 4430 9586 5797
21014 5797 8391 5966 2757 3635 126 -9417 -10645 -7016 -3233 -3424 -1647 654 -2766 3110 6955
20999 6955 4175 1517 2259 4699 -62 -2630 -6097 -9860 -9192 -5481 -2946 -2866 1639 6647 1176 -617
20983 -617 -12829 -19238 -3671 5355 5472 568 -6460 -11187 -5494 -8213 -11899 -4342 -2291 959 5504
20968 5504 11622 8951 3623 220 10696 12218 9548 5590 10048 7114 8672 12795 13561 14313 15043
20953 15043 5663 4319 3264 6607 5468 2436 7687 12938 10956 13798 5527 3142 701 -3318
20939c318j028N189K72k709k486K308r6L32K312j855J117j54L68r86p903r444
20923a8081K56M862j728P522j922j738K120N321l062p265J363L763j278J193J984
20908f690M388n82M469R973k431M5Q45l481k05J243O59j791O49q72K931l050Q99
20891F999k829j1466m651N616R578p425m243K111N736N285J520j068l010j101
20877A052j073r074P509K225j915l620N484N485P281n059m590O724l442J29l086
20862D030N061K470r224o67K760j043n028o631j147Q640M120j701k010L415m034
20847i89L411L764M277P99o507j2730p825N739P730N071j549l487l955o852l252
20832a6355K188R615Q857k533l138J0549p407j238R735J315J62J094l141m566
$$ plain form
20939 -3318 -4346 843 1115 -1594 -4080 -1772 -1868 -1536 776 -1079 38 -116 252 -734 -8637 -18081
20923 -18081 -17825 -12963 -14691 -7169 -9091 -10829 -8709 -3388 -6450 -13715 -12352 -8589 -9867 -8674 -6690
20908 -6690 -2302 -2884 1585 11558 9127 9172 10017 6536 6331 7574 8233 6442 7091 6219 9150 6100 6999
20891 6999 4170 -7296 -11947 -6331 3247 -4178 -8421 -6310 -574 4711 6231 5163 2153 1052
20877 1052 -21 -9095 -1586 639 -1276 -4896 588 6073 13354 8295 3705 10429 6987 7116 4030
20862 4030 9091 11561 2337 1670 4430 3387 -1641 -8272 -9419 -779 3341 1640 -370 3045 -989
20847 -989 2422 6186 10463 11262 4755 -7975 -15800 -10061 -2331 2740 1191 -2296 -6251 -13103 -16355
20832 -16355 -14167 -4552 4305 1772 -1366 9183 1776 538 10273 11588 11750 12844 9703 5137
20818E137o290K031J004j00p968q825k158N442Q168k118J694j488p74M331L752
20803A838m393L457P211o67k062p58n178K39j208m431K642K799l121k719L844
20788b507O027L036r636R57R965M640j0400Q99L917m916p168L967R577M126K361
20773A4845l630m395l591M122N679o205j1666j0739J620L460J613l811l102L666
20759a2134J1276J671q669k817Q77Q428j807q248j806m324K481J3788P64K978
20745B458L063k682k265p426k826L110l862j208M510P117N365m790l40o72P77
20730C29M895o83k077j898j0174J282O33J02R956l697J636K236l426k338O599
20715C375M896m919j0279M818M610m647r613O502J015j168q59N256n485m094J126
$$ plain form
20818 5137 -1153 878 1882 1782 -6186 -15011 -17169 -11727 -3559 -5677 -3983 -5471 -6245 -1914 1838
20803 1838 -2555 902 8113 7446 5384 4626 -552 -313 -1521 -5952 -3310 -511 -3632 -6351 -2507
20788 -2507 3520 6556 -3080 -2123 7842 12482 2082 2981 6898 1982 -5186 -1219 8358 12484 14845
20773 14845 11215 6820 3229 7351 13030 6825 -4841 -15580 -13960 -10500 -8887 -12698 -15800 -12134
20759 -12134 -858 813 -7856 -10673 -9796 -1368 -3175 -11423 -13229 -17553 -15072 -1284 -520 2458
20745 2458 5521 2839 574 -6852 -9678 -6568 -10430 -11638 -7128 -11 5354 564 224 -448 329
20730 329 5224 4541 2464 566 -9608 -8326 -7693 -7591 2365 -1332 304 2540 -886 -3224 3375
20715 3375 8271 3352 -6927 -2109 2501 -2146 -11759 -5257 -4242 -5410 -6269 -1013 -6498 -10592 -9466
20700i466J425L553K745k329r8j719N036j666L208P38k478n319n49n123r33L509
20684i466K467j173L240P14P527O655L13l678k602k822M39n784l554J924n93j551
20668g944K340N42r69j52j12P030k663J238L080N654m195N55j562l944K842K771
20652D511j87N206j1955K172J209n831O939J1348k005j2607k732k780m504l175
20638a4391M041L991P231P607j1692n202l542J826N478Q849Q38M355J320l755
20624F954j1213l296K455N412L247l325j536J447n941n27k024M911M355N661O481
20609A3061O35n060m412k012r28J617p861o33O160j434o941K374K194K136N284
20594D180l184l678m80M534K001M267O695j83n833p264l17j259q16j860Q678Q526
$$ plain form
20700 -9466 -8041 -4488 -1743 -4072 -4170 -5889 -853 -2519 689 1427 -1051 -6370 -6919 -12042 -12975 -9466
20684 -9466 -6999 -8172 -4932 -4218 3309 9964 10277 6599 3997 1175 1614 -4170 -7724 -5800 -6393 -7944
20668 -7944 -5604 -5062 -6031 -6183 -6295 735 -1928 -690 2390 8044 3849 4404 2842 -1102 1740 4511
20652 4511 4324 9530 -2425 -253 956 -4875 2064 13412 11407 -1200 -3932 -6712 -11216 -14391
20638 -14391 -10350 -6359 872 8479 -3213 -8415 -11957 -10131 -4653 4196 5034 9389 10709 6954
20624 6954 -4259 -7555 -5100 312 3559 234 -1302 145 -5796 -6323 -8347 -3436 919 6580 13061
20609 13061 13696 8636 4224 2212 1284 2901 -4960 -5593 567 -867 -7808 -5434 -3240 -1104 4180
20594 4180 996 -2682 -3162 1372 3373 7640 14335 14152 8319 1055 738 -521 -1337 -3197 5481 14007
20578A4007o452r046L247L880M574o268q034k483L838J780k652l41R15J68L117
20563B50K038K062J256j426L484j0799o07P127j330l715j658Q389N304n81J172
20548A0966N74M773k365J228M120j765p077n569j21N72J167k295m67k790N539
20533F490K297J685o133k125J459M397L10m851j0092k613R48l80R52N000J616
20518a040L743M807K30q978m324m99l680J815P747L087j000k04r809j0442K602
20503a5945R346K097L086M711L947n216P585M54j446L19k068n236J092L537O751
20488A3014L563n864K8N425O033l695q219J438j924p069L481l152p298N64K325
20473a350M081R015J40p26o32k234j710O802n4K10K120k200m523k91J015j0151
$$ plain form
20578 14007 7555 -1491 1756 5636 10210 3942 -4092 -6575 -2737 -957 -3609 -3950 -3035 -2867 250
20563 250 2288 4350 5606 4180 7664 -3135 -3742 3385 2055 -1660 -3318 5071 10375 9794 10966
20548 10966 11540 16313 13948 15176 19296 17531 10454 4885 4764 5336 6503 4208 3741 951 6490
20533 6490 8787 10472 4339 2214 3673 8070 8380 3529 -6563 -9176 -8228 -8608 -7656 -2656 -1040
20518 -1040 2703 7510 7740 -1238 -5562 -6061 -9741 -7926 -179 2908 1908 1704 -8105 -18547 -15945
20503 -15945 -6599 -4502 -1416 3295 7242 2026 9611 10065 8619 8938 6870 1634 2726 6263 13014
20488 13014 16577 10713 10741 16166 22199 18504 10285 11723 9799 2730 6211 3059 -4239 -3675 -1350
20473 -1350 2731 11746 11886 11160 10528 8294 6584 13386 13332 13542 15662 13462 8939 8648 9663 -488
20457d88n62m12r16L7j68J38n4k167j047N27J0947R686k428j2749l649L001M452
20440D148l500n870j396O356K158k647M718J0112R96l279J627N947k26p911l398
20425G835L31M624M22n576k364j384Q91o693J564L671J076l028J696J971P185
20410A2221k614q416n98j669L89P994J960l240J63m468N08N99J727n022o373k050
20394h889l076J86o66N363J3008K261n477J928Q88m127k253m676l239p69L792
20379e746J447o60j172N016N321k148j0337k337L098N348j150j1706o930M552
20365a7404J097K23O061l490l847j955O747O032j957M640L731l499k078q72K702
20350c869k764J523P946J579j766m42K158n292j434O66M891p72p57l087q610L7
$$ plain form
20457 -488 -1050 -1462 -2378 -2341 -2509 -2371 -2425 -4592 -5639 -5112 5835 15521 13093 344 -3305 -304 4148
20440 4148 648 -5222 -6618 -262 1896 -751 3967 14079 15075 11796 13423 19370 19144 11233 7835
20425 7835 8166 12790 13212 7636 5272 3888 4779 -1914 -350 3321 4397 1369 3065 5036 12221
20410 12221 9607 1191 593 -1076 -687 7307 9267 6027 6190 1722 2230 2829 4556 -466 -6839 -8889
20394 -8889 -11965 -11779 -12445 -7082 5926 8187 2710 4638 5526 1399 -854 -5530 -8769 -9538 -5746
20379 -5746 -4299 -4959 -6131 -1115 4206 2058 -8279 -10616 -7518 -2170 -3320 -15026 -21956 -17404
20365 -17404 -16307 -16084 -10023 -13513 -17360 -19315 -12568 -6536 -8493 -3853 -122 -3621 -5699 -6571 -3869
20350 -3869 -6633 -5110 2836 4415 2649 2207 4365 -927 -2361 -1695 3196 2424 1667 -1420 -10030 -9993
20334i993j460j527K450J0486O467P013n984q296j052K903R208l91K13m956n806
20319g25J115o158l02K012L481N371N874p018l111n729j152O416N25k285L140
20304A454M002k952k085K156K878j076K902J210J128k399L953n358k955l777m662
20289e581k310N076P90k093L3M137k467j219n782j531J2149k065k517P213M973
20274H806M09P04j859l549l656n258R851J777K534l335m766l40j677J594k799
20259a564n277n817k133J808J7480O464j601J28J109J377l446k974K412O135K59
20244A4360j0726p955K143O753Q866N604m469m718n642k305k58p106M882o27M265
20229C067J934m920N303j239q340J297N872l391N741M5n871l680O30O615n67l400
$$ plain form
20334 -9993 -11453 -12980 -10530 -44 6423 13436 7452 -844 -1896 1007 10215 9824 10037 5081 -725
20319 -725 390 -5768 -6070 -4058 -577 4794 10668 3650 539 -5190 -6342 74 599 -1686 1454
20304 1454 5456 2504 419 2575 5453 4377 7279 8489 9617 7218 11171 5813 2858 -919 -5581
20289 -5581 -7891 -2815 -2025 -4118 -4085 52 -2415 -3634 -9416 -10947 1202 -863 -3380 3833 8806
20274 8806 9215 9919 8060 4511 855 -4403 5448 7225 9759 6424 1658 1318 -359 1235 -1564
20259 -1564 -6841 -12658 -14791 -12983 4497 10961 9360 9488 10597 11974 8528 5554 7966 14101 14360
20244 14360 3634 -4321 -2178 4575 13441 19045 14576 9858 4216 1911 1653 -5453 -571 -1198 3067
20229 3067 5001 81 5384 4145 -4195 -2898 2974 -417 5324 5369 -502 -4182 -3552 3063 2496 -904
20213i04q577p512j203O103N571M132L543l035M616P999o349m698q726K117M194
20198b729p365o94j164J735N180K886K153j286l308J770N784O375R63n923j1968
20183g591j537N640M512M740l972m839q090O048J53k357P759L664O19J237l824
20168B162m647m634k512O509k46M883M220K924J339j443j787j160M494J890j0679
20153A313l805j928K546Q739K32Q64L512J740L738m325k642l651l381L59K375
20138E686O785K44K181L964p823q13J334o765n462L041j353m788N557M184L109
20123I081k6J317q703O39L129m372m954P789P073N834j3165l958K249k545N737
20108E125M117j5553J249M014M757j074j131K265k494n98l567n068j748M017O420
$$ plain form
20213 -904 -9481 -16993 -18196 -12093 -6522 -2390 1153 -1882 2734 10733 4384 -314 -9040 -6923 -2729
20198 -2729 -10094 -10788 -11952 -10217 -5037 -2151 2 -1284 -4592 -2822 2962 9337 10300 4377 -7591
20183 -7591 -9128 -3488 1024 5764 1792 -3047 -11137 -5089 -4936 -7293 466 4130 4749 5986 2162
20168 2162 -2485 -7119 -9631 -3122 -3368 1515 5735 8659 9998 8555 6768 5608 10102 11992 1313
20153 1313 -2492 -4420 -1874 6865 7097 7961 11473 13213 16951 12626 9984 6333 2952 3311 5686
20138 5686 12471 12715 14896 18860 11037 10224 11558 4793 -669 2372 1019 -3769 1788 5972 9081
20123 9081 9055 10372 1669 2308 5437 1065 -3889 3900 10973 16807 3642 -316 1933 -612 5125
20108 5125 9242 -6311 -5062 -1048 3709 2635 1504 3769 1275 677 -2890 -7958 -9706 -5689 731
20093G31k682K856M310p154j234P564N808m228J340L389m895j301m389l008O026
20078C133L248R729O898o527o552N466M67m787L784m473m677k028n313J581P330
20063G279M005l703k475L285o501o023K741M334N112M240p497J076L283m450j248
20048C458m014M165j288k072o075L653L45l722K327K635M44K822K508n322P17
20033E81M113M828k185l654O8Q33J612l000R788L619N353K4l256P36k866r995
20017F599N81L21o258R45J829OM604n026k605k522p26P0J029Q319p51j099N728
20000A1044K302l129k603O373l416q98M253n295r396R81n548J37n259o094l332
19985a9880Q154k988o488Q10J0589K601r03L612L221Q318n53p51J906K646n340
$$ plain form
20093 731 -1951 905 5215 -1939 -3173 4391 10199 5971 7311 10700 5805 4504 115 -2893 3133
20078 3133 6381 16110 23008 16481 9929 15395 15862 11075 14859 10386 5709 3681 -1632 -51 7279
20063 7279 11284 7581 5106 8391 1890 -4133 -1392 2942 8054 12294 4797 5873 9156 4706 3458
20048 3458 -556 3609 2321 249 -5826 -2173 -1828 -5550 -3223 -588 -144 2678 5186 -136 581
20033 581 4694 9522 7337 3683 3751 4584 6196 3196 12984 16603 21956 21980 18724 19460 16594 6599
20017 6599 7180 7501 1243 2188 4017 4023 8627 3601 996 -1526 -2252 -2182 -1153 7166 6415 5316 11044
20000 11044 13346 10217 7614 13987 10571 9673 13926 8631 -765 216 -5332 -5195 -10454 -16548 -19880
19985 -19880 -11726 -14714 -21202 -20392 -9803 -7202 -8105 -4493 -1272 7046 6493 5742 7648 10294 4954
19970D954o625J802K736J3537j919m854m493l196R11m637n130l457K317K593O63
19955d798J220P788l714m132K665N991J669r92j016J547L820Q310m085r562q360
19940c649n37N51M431P99p99J378J638r301j912J41M23J987L474P26N966JJ847
19923G164j211m958m216M49P632m59p04l560N066N479O59k375m703J127k686j037
19907A667N972m552m843N03k859m087K631K696J635M033j741O239M870K944l540
19892A1568m986k970j665q99k529O790P182n795J559J0262K969J925o641j0134
19878F636q059Q431O056k371p839k898m69N183o65l405j669N113N802p512K7L11
19862B672l534M407l859K93K728j297M846J189o594q93P03J454P988j313m955
$$ plain form
19970 4954 -1671 131 2867 16404 14485 9631 5138 1942 2853 -1784 -6914 -10371 -8054 -5461 -4798
19955 -4798 -3578 4210 496 -3636 -971 5020 6689 5697 4681 6228 10048 18358 14273 4711 -3649
19940 -3649 -4186 -3635 796 1595 796 2174 3812 -5489 -7401 -7260 -6837 -4850 -1376 -650 5316 5317 7164
19923 7164 5953 995 -3221 -2772 4860 4401 3697 137 5203 10682 11341 8966 4263 5390 2704 1667
19907 1667 7639 3087 -1756 -1253 -4112 -8199 -5568 -2872 -1237 2796 1055 7294 12164 15108 11568
19892 11568 6582 3612 1947 1048 -1481 5309 12491 6696 8255 18517 21486 23411 16770 6636
19878 6636 -1423 7008 13064 10693 2854 -44 -513 4670 4005 600 -1069 4044 9846 2334 2361 2672
19862 2672 -862 3545 -314 -21 2707 1410 6256 7445 851 -42 661 2115 10103 8790 3835
19847C835O299L036M824k32p272m933n987R43r63L62O42M572J0212L534k329l096
19831A3447m992j5633J418j538Q5j257M333j273n492m202L953J0202N160l490
19817G21L269j843l531J360j530J695O507L466P141k878p064M49K126n986J082
19802D984K796N462o079l776P611j219L592J031m850p48j032R08l59L530N837
19787A7688J135J26o570L658l054m976O245j244l28n998p453K661k458N22k606
19772b652K205N667M953n23l859N522m999n490L932N926l159j0285m541L427L269
19757f07P951P781l779q189j211K915M693Q409j076m036P76J110l388J851J573
19742A4773O301J032q563o950l590k091J550Q173n07l652j679j165m744o389M521
$$ plain form
19847 3835 10134 13170 17994 17762 10490 5557 -430 513 -450 -88 554 5126 15338 18872 16543 13447
19831 13447 8455 -7178 -5760 -7298 -7213 -8470 -4137 -5410 -10902 -15104 -11151 -949 4211 721
19817 721 3990 2147 -1384 -24 -1554 141 6648 10114 17255 14377 7313 7762 9888 3902 4984
19802 4984 7780 13242 7163 3387 10998 9779 13371 14402 9552 8804 7772 8680 8321 11851 17688
19787 17688 18823 18949 12379 16037 12983 8007 14252 13008 12680 6682 -771 1890 -568 -46 -2652
19772 -2652 -447 5220 10173 9650 5791 11313 6314 824 4756 10682 7523 -2762 -7303 -3876 -607
19757 -607 7344 15125 11346 3157 1946 4861 9554 17963 16887 12851 13627 14737 11349 13200 14773
19742 14773 21074 22106 13543 6593 3003 912 2462 10635 10128 6476 4797 3632 -1112 -7501 -2980
19727b980k001N635N621n098m423k476R576k219j508O380o839J106P017N402R557
19712B2750K407m991l353m990j0545N44J401j488rQ325K299j0289J551N908J464
19697A0984l410J749k482r017n77P775M822j29K210J832k034p993l174n917L70
19682d991J28K031Q696L854j1M666k983j691K353k250K426L455K969m615o299
19667G738n893M076m78J821L392j601M821P003M177q122j2166l507K272q06N35
19652C262L41N704r32J496j163l665k232J965m1l068j077L284K19N52o883M704
19636B466J02k057J837P514L351K022j78m230j0101N250L80j609j267l581m585
19621d686P22L924L552q694k125N280M61M107K182j398P883j304n358q50K651
$$ plain form
19727 -2980 -4981 654 6275 1177 -3246 -5722 3854 1635 127 6507 -332 774 7791 13193 22750
19712 22750 25157 20166 16813 11823 1278 1822 3223 1735 1726 10051 12350 2061 3612 9520 10984
19697 10984 7574 9323 6841 -2176 -2753 5022 9844 9715 11925 13757 11723 3730 556 -5361 -4991
19682 -4991 -4863 -2832 5864 9718 9707 14373 11390 9699 12052 9802 12228 15683 18652 14037 7738
19667 7738 1845 5921 5443 7264 10656 9055 13876 20879 25056 16934 4768 1261 3533 2727 3262
19652 3262 3603 9307 8375 9871 8708 5043 2811 4776 4735 1667 590 3874 4093 4645 -2238 2466
19636 2466 2568 511 2348 9862 13213 15235 15057 10827 726 5976 6356 4747 3480 -101 -4686
19621 -4686 -3964 -40 3512 -5182 -7307 -2027 -1566 2541 4723 3325 11208 9904 4546 3696 6347
19606F347l147j840J68m170j603j091k401J438O60N27J0019L718L36J861N277
19591A6099R17r88j372O493N915p939j634n20m262j841m376k983j965O427K428
19576A0399m578N11P037N097l38O95j0959m942J549M996m84n000k363M701P68
19561G089L837j704P532o660k957P49j881K649L516k341pO044K336p983l831M909
19545A1297K529K133j667j560J709L000J375k378j665O121q04J117j654q971q46
19530I736L62K26l016R776L265m084K582M135L013R251o10o715j766P89l435m823
19514A8686J006m176O52L868M926p52p240m780l199j493J812k183L18m076J889
19499E258k241n797N005J2662J446k106q575J432L684Q933L634o866k64p03N181
$$ plain form
19606 6347 3200 1360 1528 -2642 -4245 -5336 -7737 -6299 -5639 -5112 4907 8625 8961 10822 16099
19591 16099 17016 16028 14656 21149 27064 19125 17491 16971 12709 10868 6492 3509 1544 7971 10399
19576 10399 5821 6332 13369 18466 18128 18823 7864 2922 4471 9467 8983 3983 1620 6321 7089
19561 7089 10926 9222 16754 10094 7137 7886 6005 8654 12170 9829 9822 15866 18202 10219 6388 11297
19545 11297 13826 15959 14292 12732 14441 17441 18816 16438 14773 20894 20090 21207 19553 10582 9736
19530 9736 10098 10324 7308 17084 20349 16265 18847 22982 25995 35246 34636 27921 26155 26944 23509 18686
19514 18686 19692 15516 16168 20036 24962 24210 16970 12190 8991 7498 9310 7127 7445 3369 5258
19499 5258 3017 -2780 2225 14887 16333 14227 5652 7084 10768 19701 23335 16469 16205 15502 20683
19484B0683j070n830n897O28j20J0928R072M751k620q074m224M808k379k778m245
19469A3633J798m092K252M611N359k489M319O756n297n170o47N100J457L133q411
19454B2312r457k710j006j314K556P080N636L281l015m623J781J596K766q94J43
19439B4132l841m431m207K611J92J280n209q71l815k268J862Q37l228M118n551
19424A611M052K134O633J212l103j244P606j363q595K331J0710K594j483n275
19410A7820q031j760R57L067l47M650L594O034P162N656J517j844j4456n30j805
19395B1684l332O115l45M307J725P19j076q578p812Q305O592J0239L726j894N846
19380D6221R341J0783J0967L578Q087R369R174Q420P107M662J1699J0774J0337
$$ plain form
19484 20683 19613 13783 7886 8514 8394 19322 28394 33145 30525 22451 18227 23035 20656 17878 13633
19469 13633 15431 11339 13591 18202 23561 21072 25391 32147 26850 21680 21033 26133 27590 30723 22312
19454 22312 12855 10145 9139 7825 10381 17461 23097 26378 23363 18740 20521 22117 24883 23989 24132
19439 24132 20291 15860 11653 14264 14456 15736 10527 9656 5841 3573 5435 6272 3044 7162 1611
19424 1611 5663 7797 14430 15642 12539 11295 18901 17538 8943 11274 21984 24578 23095 17820
19410 17820 9789 8029 8986 12053 11706 16356 19950 25984 33146 38802 40319 38475 24019 23489 21684
19395 21684 18352 24467 24122 28429 30154 30873 29797 21219 13407 21712 28304 38543 42269 40375 46221
19380 46221 55562 66345 77312 80890 88977 98346 107520 115940 123047 127709 139408 150182 160519
19367A60519N841K874L080J6129K6665K9522M8645O4911O3725P8302J10533J24826
19355G35572Q8131O3353N3010N7518L2162N468q931p368K4422M2149N414k8606
19343A062294j8330k5440m8119q5002j06702j17653j06794r4217q4330p4246o0273
19332B41188m5517l4519k1162j5692r949p03j1784n136l626l844o922K571L952
19319H8857L25j3139o905R87p255k762p006j358R011R24j568J736k138j0198j0144
19304C9367p362J430M691m914l503M714N266J910j846m606l757Q6j068m093j973
19289B4342j436l274J1912J6950K106J042Q761K071o805r40Q48q16j090k129j990
19274D9552N690J341k390j1905o473j29o703q50k251j758n149O06J3230N783N684
$$ plain form
19367 160519 166360 169234 172314 188443 215108 244630 293275 358186 421911 500213 610746 735572
19355 735572 823703 887056 940066 997584 1029746 1035214 1026283 1018915 1043337 1085486 1090900 1062294
19343 1062294 1043964 1018524 970405 885403 778701 661048 554254 460037 375707 301461 241188
19332 241188 195671 161152 139990 124298 114349 113646 101862 96726 93100 89256 82334 84905 88857
19319 88857 89182 76043 69138 70125 62870 60108 53102 51744 60755 61679 60111 61847 59709 49511 39367
19304 39367 32005 33435 38126 33212 29709 34423 39689 41599 39753 35147 31390 31476 30408 26315 24342
19289 24342 22906 19632 31544 48494 50600 51642 60403 62474 55669 54729 55577 54761 53671 51542 49552
19274 49552 55242 56583 54193 42288 35815 35686 28983 28133 25882 24124 18975 19581 32811 38594 44278
19259D4278M619q882q402q88l409K083N463P576J5732J2666N649O924J2268J2687
19245A08364K435J9064Q232M855R756O385n906k062R71J792r430j003o76l522
19231A39255q073r033j2860p238o497j4193r564r422p636p260J070M501J435P84
19217E5269l090M111M886L148M535q82l518o616k339j256Q009L997K410O9k727
19202F6006L926K672N91l610l91J60n791L71O314K21J984K017p390o177j895K402
19186F1410L277m955j0209J540O608j931n625p73J266l932l208j92L484O568L384
19171E6712J1166n86m782l800r348l186O774l864j186J174m813M152k513k679
19157D3221O271J479p802j701N18J64m349l288J836R544M480n211L374L358l083
$$ plain form
19259 44278 48897 40015 31613 30725 27316 29399 34862 42438 58170 70836 76485 83409 95677 108364
19245 108364 110799 129863 138095 142950 152706 159091 153185 151123 152094 153886 144456 143453 142777 139255
19231 139255 131182 122149 109289 102051 95554 81361 71797 62375 54739 47479 48549 53050 54485 55269
19217 55269 52179 56290 61176 64324 68859 67977 64459 57843 55504 54248 62257 66254 68664 68733 66006
19202 66006 69932 72604 73195 69585 69194 69354 63563 63934 70248 70469 72453 74470 67080 60903 59008 61410
19186 61410 64687 59732 49523 51063 57671 55740 50115 49342 50608 46676 43468 43276 46760 53328 56712
19171 56712 67878 67292 62510 58710 49362 46176 52950 49086 47900 49074 44261 48413 45900 43221
19157 43221 49492 50971 43169 41468 41986 42150 37801 34513 36349 45893 50373 45162 48536 51894 48811
19142D8811k886K371K679j387j766n459l19J760O377l086j148K243K541n679K143
19127D7195P33j4O42M111k858k923M433P414j468K305Q0k136m523m906j298o659
19111D0128J138J984q321o829R070J662p422L253L038O60Q600J829N218M969R432
19096F8409O134K004J813r04j911l960o120n117R208N484m223m181L417O17N321
19081G5991J1098O135k386J348q97O950J6638M829j783j486l934M700P652J756
19067A26611J2076J3269O149P100L082M034J1059J6485Q875M697k633J896N376
19054B18076N301R920M819K710J7579J1717N708R638K496L259Q8r58j1636j5589
19040B63128j5424j4647k0192j6354k0603j1503p492k0454j1697j0215o215o139
$$ plain form
19142 48811 45925 48296 50975 49588 47822 42363 42044 43804 50181 47095 45947 48190 50731 45052 47195
19127 47195 47928 47914 48556 52667 49809 46886 51319 58733 57265 59570 59650 57514 52991 48085 46787 40128
19111 40128 41266 43250 34929 28100 37170 38832 31410 34663 37701 38361 46961 48790 54008 58977 68409
19096 68409 74543 76547 78360 77456 75545 71585 65465 60348 69556 75040 70817 66636 70053 70670 75991
19081 75991 87089 93224 90838 92186 91289 98239 114877 119706 117923 116437 112503 117203 124855 126611
19067 126611 138687 151956 158105 165205 168287 172321 183380 199865 208740 213437 210804 212700 218076
19054 218076 223377 233297 238116 240826 258405 270122 275830 285468 287964 291223 291311 290353 278717 263128
19040 263128 247704 233057 212865 196511 175908 164405 156913 136459 124762 114547 108332 102193
19028A02193j2188n66n246l628J459l050M784P056Q647P769q8r257q853P218J3262
19013A09512O842p86r704k531N640K364o71P068Q866J6093K2280J6900J6796J9150
18999B17819J8234J9314K0104J1478Q881Q807J379j6333j6887q179j9824l7471
18987B07322l1234k8104k4540k1609j1629o716k72q467m584J4546J2988l048O398
18974A01051J4676R830J132Q933J1520J347j400J5630Q407J0239Q930K7081L0897
18961B48273J3870M550J2412K9225J2751l768O195K3965K4487J4188J7019P328
18949D10495J110M82p051j6309k4491k2867j3641k0944j0804j7395k3032j2992
18937B42561K545m592j0611q100p189m140o174m315r606q368r63p469n721L262
$$ plain form
19028 102193 90005 89439 84193 80565 82024 78974 83758 90814 99461 107230 107142 97885 89032 96250 109512
19013 109512 116354 115568 105864 103333 108973 111337 110666 117734 126600 142693 164973 181873 198669 217819
18999 217819 236053 255367 275471 286949 295830 304637 306016 289683 272796 264617 244793 207322
18987 207322 176088 147984 123444 101835 90206 83490 83218 74751 70167 84713 97701 94653 101051
18974 101051 115727 125557 126689 135622 147142 148489 147089 162719 171126 181365 190295 217376 248273
18961 248273 262143 266693 279105 308330 321081 317313 323508 347473 371960 386148 403167 410495
18949 410495 411605 412087 405036 388727 364236 341369 327728 306784 295980 278585 255553 242561
18937 242561 245106 240514 229903 221803 214614 210474 204300 199985 190379 182011 181048 173579 167858 171120
18923A71120O220L422p163p225p718L731Q908J4683L300M801K710P492O267R398
18909B19946j313j495K809P425m264P764Q871J2764N655J2088K9272J4265Q740
18896C22527J3460L334j848N899l94m448l136O005J402J115j224l113O96P9L29
18881C40683J276L292O05J148j578J2471J2428P373K585R777Q371Q065J6511R683
18867D32690O071l209Q903J3923J2526N275J8484K7030K5529K6731K9827M0555
18855F44335L2133L6090M1556L4377L8085M9527M2221K3629M1533M7630M7718
18844A078834L9248M9320M8218N9798Q0358P6936P3289J09266J62125J90343K01092
18833B168827K62282L73627M18442L62370L98799N24309O18007M90945M95818
$$ plain form
18923 171120 177340 180762 173599 166374 158656 162387 171295 185978 189278 194079 196789 204281 210548 219946
18909 219946 218633 217138 219947 227372 223108 230872 239743 252507 258162 270250 299522 313787 322527
18896 322527 335987 339321 337473 343372 342978 338530 335394 341399 342801 343916 342692 339579 340275 340354 340683
18881 340683 341959 345251 345856 347004 345426 357897 370325 377698 380283 390060 398431 406496 423007 432690
18867 432690 438761 435552 444455 458378 470904 476179 494663 521693 547222 573953 603780 644335
18855 644335 676468 712558 754114 788491 826576 876103 918324 941953 983486 1031116 1078834
18844 1078834 1118082 1167402 1215620 1275418 1355776 1432712 1506001 1615267 1777392 1967735 2168827
18833 2168827 2431109 2804736 3223178 3585548 3984347 4508656 5126663 5617608 6113426
18824F113426O02246O83457P12814Q44706J053040J159381J481204J957209K611168
18815A7218651L598392N239893P923786J2814864K0782989K7266405K3884057
18808A18729037K3622322L5179531M6815903K6654144M124817O182203Q488882
18801B69796839l407966k6034607k8335367l3781319l1922117k8812696k5392478
18794I2110289k2922972j7874711j1575068p399230n129542l739989k837608k205947
18786A8425222j775824j438107j284248j249717j042566q31729p53976q46454
18778I202601p93048p23886o65757o36653n96032n58519n09743m38795l90428
18769C889740l52238l11999k71215k31009j99682j65603j61867j70067j64459
$$ plain form
18824 6113426 6715672 7399129 8111943 8956649 10009689 11169070 12650274 14607483 17218651
18815 17218651 20817043 26056936 33980722 46795586 67578575 94844980 118729037
18808 118729037 142351359 177530890 224346793 251000937 255125754 261307957 269796839
18801 269796839 266388873 240354266 212018899 178237580 146315463 117502767 92110289
18794 92110289 69187317 51312606 39737538 32338308 27208766 23468777 20631169 18425222
18786 18425222 16649398 15211291 13927043 12677326 11634760 10803031 10049055 9202601
18778 9202601 8409553 7685667 7019910 6383257 5787225 5228706 4718963 4280168 3889740
18769 3889740 3537502 3225503 2954288 2723279 2523597 2357994 2196127 2026060 1861601
18760A861601j44202j32597j25597j13149r7342o0106m5266n3134m8210l8270
18750A003728k2619l8080n0201m2392m1411m1315m3267l5635l4337l8060l9054
18739E77357j7276k3754k9248j5180j6807j9846k2879j1901p091j0928j5432q841
18727C78174p171p580o088l684l354k470q229j0499k034L965j3m551O999K0757
18713C54222J3311N53J827J1399K5547K6547J8551l174J478N344J4924m550k5897
18700D40082k3189l1080k8033l0539k6026k3468k3339j8414r581j4460j0797m464
18688A96692m638n157o93q284j153M229J039o804K461L794j651j3899j1570q372
18674A45994m426j1220j2069j3842r161J882r26K675O523M578J2445L647R642
$$ plain form
18760 1861601 1717399 1584802 1459205 1346056 1248714 1188608 1143342 1090208 1041998 1003728
18750 1003728 981109 943029 892828 850436 809025 767710 724443 688808 654471 616411 577357
18739 577357 560081 536327 507079 491899 475092 455246 432367 420466 413375 402447 387015 378174
18727 378174 371003 363423 357335 353651 350297 347827 339598 329099 327065 331030 331017 326466 333465 354222
18713 354222 367533 368086 369913 381312 406859 433406 451957 448783 450261 455605 470529 465979 440082
18700 440082 416893 385813 357780 327241 301215 277747 254408 235994 226413 211953 201156 196692
18688 196692 192054 186897 186204 177920 176767 180996 182035 175231 177692 181486 179835 165936 154366 145994
18674 145994 141568 130348 118279 104437 95276 97158 96232 98907 105430 110008 122453 126100 135742
18661A35742J4159m750j7879j2028j5442l215P956J1738L663N873J3111J6568
18649A55496j611j1529p851J6746Q917j4538k3119j1808n538p103q394o010O207
18636H9865J854J847l217p869K224k562m664j27N363J2451L901N468N116Q651
18622A18301Q969N001K531k054n316j862K564N543o999j8653j6818j0288k024
18609G8895j1409j0309O14K112n488n424o488J615l908N861k691q941j79M496
18595C8756L449o01m537l658P714L307l217k292k530L373M149n012m554k435K937
18580C4849J94r644m067L846m379k455l208n615o030P31M76K067j961M950N310
18565A5064k043m074p80N096R436R95k457K042Q280Q789O356o994J830M518L887
$$ plain form
18661 135742 149901 145151 127272 115244 99802 96587 104543 116281 119944 125817 138928 155496
18649 155496 153885 142356 134505 151251 160168 145630 122511 110703 105165 98062 89668 83658 89865
18636 89865 91719 93566 90349 82480 84704 82142 77478 77351 82714 95165 99066 104534 109650 118301
18622 118301 127270 132271 134802 132748 127432 125570 128134 133677 126678 108025 91207 80919 78895
18609 78895 67486 57177 57791 59903 54415 48991 42503 44118 40210 46071 43380 34439 34260 38756
18595 38756 42205 41604 37067 33409 41123 44430 41213 38921 36391 39764 43913 38901 34347 31912 34849
18580 34849 35043 25399 21332 25178 20799 18344 15136 9521 3491 4222 4698 6765 4804 9754 15064
18565 15064 13021 8947 8167 13263 22699 23694 21237 23279 31559 40348 46704 39710 41540 46058 49945
18550D9945R012J5428K7732L9227K9376K7804K8217N4477L8740N029j936J338
18538C24389P102k6736l4784l9329l7329l0252l2945k8402k7577k1720k989o003
18526D3425k167L134K283l153n753k535k259m880l436l695k394J754k002m199
18512A4123j275N44K442l056L175L137L080K633R717L90k731k058J841j217l523
18497B7222q633K5O659J428j1082l722M043j42j305j010M606N714J757n999k960
18482A6601J536K954M493m479k326M441R83q978j1485l286P725R058O131m356
18468A9012j489K501K952j663m760l769q5l287J05L20o092K561N750L0N716P962
18452B5764J883N076M54j828L117m578M398L115K750l425p765K162r27l286j11
$$ plain form
18550 49945 58957 74385 102117 141344 170720 198524 226741 281218 319958 324987 323051 324389
18538 324389 331491 304755 269971 230642 193313 163061 130116 101714 74137 52417 49428 43425
18526 43425 41258 44392 46675 43522 37769 35234 32975 28095 24659 20964 18570 20324 18322 14123
18512 14123 12848 13392 15834 12778 15953 19090 22170 24803 34520 34910 32179 30121 31962 30745 27222
18497 27222 18589 18614 25273 26701 15619 11897 15940 15798 14493 13483 18089 23803 25560 19561 16601
18482 16601 18137 21091 25584 21105 18779 23220 24203 15225 3740 454 8179 17237 23368 19012
18468 19012 17523 20024 22976 21313 16553 12784 12699 9412 9517 9837 3745 6306 12056 12086 17802 25764
18452 25764 27647 32723 33177 31349 34466 29888 34286 37401 40151 36726 28961 31123 30196 26910 26799
18437B6799j025j2682j0085p341L553R628M158l95K322k04p34l930M333M678n051
18422A4024q65p045O859M264j688k106K270n039m785l996r20K944R347O348l969
18407A5643L766J368N31L156j178j4771l345L67J187j760j551Q859k10k005k271
18392G786k747o210O208J1197P60n835O469L820K478q087p516M70k863j933O39
18377D636m908r055j354Q321Q574J3653J690r325j047m073N595M688L778R000
18363C0173J4474J1593M056P349J6556K1296J6955P942P537P682Q499Q38j4467
18350A40483j3542j1757j2195j4298j1005j1823j1974p396j2095l845m705p047
18338A8801j525q487r281r671k086r052k464k720k41M119O235K088L683Q572R659
$$ plain form
18437 26799 25774 13092 3007 -4334 -781 8847 13005 12610 14932 14728 13994 10064 14397 19075 14024
18422 14024 13159 6114 12973 17237 15549 13443 15713 10674 5889 1893 973 3917 13264 19612 15643
18407 15643 19409 20777 21308 24464 23286 8515 5170 5537 6724 4964 3413 12272 12062 10057 7786
18392 7786 5039 -1171 5037 16234 16994 11159 17628 21448 23926 15839 8323 8793 5930 3997 4636
18377 4636 -272 -9327 -10681 -2360 6214 19867 21557 12232 11185 7112 12707 17395 21173 30173
18363 30173 44647 56240 60296 67645 84201 105497 122452 130394 137931 145613 154112 154950 140483
18350 140483 126941 115184 102989 88691 77686 65863 53889 46493 34398 30553 25848 18801
18338 18801 17276 8789 -492 -10163 -12249 -21301 -23765 -26485 -26726 -22607 -16372 -14284 -10601 -2029 7630
18323G630J0065L126n176K777k328p204q514q512j576K465J898J2159J360l554
18309D616k93P08k720R74q388n368K458O419L964L690J405q203J017O581N542
18294A2402k677r890q877K859R114L684N92J136N757k236j779P439N937o298l424
18279A3739l143K399J381M556J7989R466Q098N451M000Q673j313J0005K9046M4693
18265A55040O2078Q2721P6727P3734J05242J25682P6868M7202M6039M9206L1421
18254I31960o571k0414k2797P609L2623l055l4519l2670j8255m0879q4903r4546
18242F13583r9376r7990p7509o7298n0852l9322l4116k5429j2109j9132n824n26
18230H4100m606j2284k2158j1966j846J950l682n915L099K209q518m540K867K221
$$ plain form
18323 7630 17695 20821 15645 18422 16094 8890 376 -8136 -9712 -7247 -5349 6810 8170 4616
18309 4616 4323 5031 2311 3285 -5103 -10471 -8013 -1594 2370 6060 7465 -738 279 6860 12402
18294 12402 9725 -165 -9042 -6183 2931 6615 7207 8343 14100 11864 10085 17524 23461 17163 13739
18279 13739 10596 12995 14376 18932 36921 46387 54485 59936 63936 72609 71296 81301 110347 155040
18265 155040 217118 299839 376566 450300 555542 681224 758092 805294 851333 900539 931960
18254 931960 925389 904975 882178 889787 922410 919355 884836 852166 833911 793032 708129 613583
18242 613583 514207 416217 338708 271410 220558 181236 147120 121691 109582 90450 84626 84100
18230 84100 79494 67210 45052 33086 31240 33190 29508 23593 26692 28901 20383 15843 18710 20931
18216B0931K374J363m454j0183r256Q19K338j790p25k019M338J132J142j326q82
18201C802M837K601O14J592n9J699k978O973M31j688k163o852j075J372J601K925
18185A3632O41o34p956L187MO265M912j3652n056O79K840m601r49O13k777J1K68
18168b573k12K53K750N933k232M743Q696N2o15k342m385K829O691q025q606M167
18152G124Q659m55k69L162L170j150o509j400l29j798M517n871J0944P910K814
18137C0519j001j47l215r740n85J3857J0529J2889M937l142o175P894O75R614
18123F6909J8360J5218K0492K4916K6522K2827L2520L8914M8110P1423J15905
18112E02116J66820K42768L50788N74133J048793K137630M188549M334671m47934
$$ plain form
18216 20931 23305 24668 20214 10031 775 1594 3932 2142 1417 -602 3736 4868 6010 4684 3802
18201 3802 8639 11240 11854 13446 13387 15086 12108 19081 19512 17824 15661 8809 7734 9106 10707 13632
18185 13632 14273 13639 5683 8870 8874 15139 20051 6399 1343 2022 4862 261 -688 -75 -2852 -2841 -2573
18168 -2573 -2785 -2532 218 6151 3919 8662 17358 17410 16795 14453 10068 12897 19588 11563 2957 7124
18152 7124 15783 15328 15059 18221 21391 20241 13732 12332 12003 10205 14722 8851 19795 27705 30519
18137 30519 29518 29371 26156 16416 15831 29688 40217 53106 58043 54901 48726 56620 57295 66909
18123 66909 85269 100487 120979 145895 172417 195244 227764 266678 314788 386211 502116
18112 502116 668936 911704 1262492 1836625 2885418 5023048 9211597 13546268 13098334
18103A3098334k010735l223192l363433j811373q93317m74967k84736j93102j49872
18094F93607j18161r3815p2827n5064m1251l4052l7726k6942j8432j7406j8427
18083A59504o122p929j4415j3542K266j448j4144r360l695o713j1014j1249l949
18070E8190j658n365l387p950l370N224j217m348p818m043n857k091l929l710
18056H671j305O877l693q524Q708M514l44n844K715J518J818K128r639l33J938
18041I205l42k540r21O6k013J514j331q269k315M523K225N859o76P136M831j667
18025A5285m817l580k143J113n22o000l100o734k09j223M437O189K841K531k036
18010B032n816J257N14r149J0932O702j569m111k631m16J429m68o36p561k488
$$ plain form
18103 13098334 11087599 7864407 4500974 2689601 1796284 1321317 1036581 843479 693607
18094 693607 575446 481631 408804 353740 312489 278437 240711 213769 195337 177931 159504
18083 159504 153382 145453 131038 117496 119762 118314 104170 94810 91115 84402 73388 62139 58190
18070 58190 56532 51167 47780 39830 36460 41684 40467 36119 28301 24258 18401 16310 12381 8671
18056 8671 7366 14243 10550 2026 10734 15248 14904 9060 11775 13293 15111 17239 7600 7267 9205
18041 9205 8863 6323 5402 5468 3455 4969 3638 -4631 -6946 -2423 -198 5661 4985 12121 16952 15285
18025 15285 10468 6888 4745 5858 5336 -664 -3764 -10498 -10707 -11930 -7493 -1304 1537 4068 2032
18010 2032 -3784 -2527 -2013 -11162 -230 6472 4903 792 -1839 -2255 -826 -1294 -1930 -9491 -11979
17995a1979N919O331J1372L259k922j982o044o48J724K315J316j0503j2008J746
17981a2104L139P439L275J670L070K19o196m302L607K380m81L417q268k593K828
17966b900M791K243Q15m087N401J549k772k418j270J699p234m06q19N581M776
17951D949L365n737k137J361K142J654P355p556n101Q359L823m213j909p2N808
17936A2091Q56n237m585L721K642q077p363l323L42j59M405J828J064J223n548
17921f120J523R1J545j464m061K084L684M468K787n112m43m609J560J557O69K324
17905D83P492M386j087JM789J197r662K413J251l907L27O302o659p650o660r994
17889a6978l76J364Q865N758j777j694P63l113k546K884M529R85n55j518k214
$$ plain form
17995 -11979 -6060 271 11643 14902 11980 9998 3954 3306 5030 7345 8661 -1842 -13850 -12104
17981 -12104 -8965 -1526 1749 3419 6489 6708 512 -3790 -183 2197 1716 5133 -3135 -5728 -2900
17966 -2900 1891 4134 4949 862 6263 7812 5040 2622 1352 3051 -4183 -4589 -5408 173 4949
17951 4949 8314 2577 440 1801 3943 5597 12952 5396 295 8654 12477 8264 6355 6283 12091
17936 12091 12947 7710 3125 6846 9488 1411 -5952 -9275 -8933 -9092 -4687 -2859 -1795 -572 -6120
17921 -6120 -4597 -4506 -2961 -4425 -8486 -6402 -2718 1750 4537 -575 -1018 -5627 -4067 -2510 -1841 483
17905 483 7975 12361 11274 11275 16064 17261 7599 10012 11263 7356 7683 13985 7326 -324 -6984 -16978
17889 -16978 -17354 -15990 -7125 -1367 -3144 -4838 -4075 -7188 -9734 -6850 -2321 -1336 -1891 -3409 -5623
17874e623R451k876K282n204K249m297q046j468L712O024N8m065j010O613R595
17859G395J760M130l377l057J350K540O830k166K745l858o911l393k334K447l614
17844D87L63j29J754k135LJ891l375l204l99l307M816J76q25J680j286J0430L519
17827A0459j987n019L59L384j761R15J657l116j2675n465M606o85P175J1903J086
17812A0836O560R202L535R98J4943J2936P575k626m684P255J984j316m53j414
17798F5331K375k848M513n547m848o954p323j687p090q815k865K568q633j4787
17784C390J342M113J647o435l382k395M81L263m517J336J591p314K531J0734L553
17769I938N572M059r308j0136K047n691M526N661l961L309o697q214m661m346
$$ plain form
17874 -5623 3828 952 3234 -1970 279 -4018 -12064 -13532 -9820 -3796 -3738 -7803 -8813 -2200 7395
17859 7395 9155 13285 9908 6851 8201 10741 17571 15405 18150 14292 7381 3988 1654 4101 487
17844 487 850 721 2475 340 343 2234 -1141 -4345 -4744 -8051 -3235 -3059 -3884 -2204 -3490 6940 10459
17827 10459 8472 3453 3812 7196 5435 6350 8007 4891 -7784 -13249 -8643 -9328 -2153 9750 10836
17812 10836 17396 26598 30133 31131 46074 59010 66585 63959 59275 66530 68514 67198 66745 65331
17798 65331 67706 64858 69371 63824 58976 52022 44699 43012 35922 27107 24242 26810 18177 3390
17784 3390 4732 8845 10492 4057 675 -1720 -1239 2024 -2493 -1157 434 -6880 -4349 6385 9938
17769 9938 15510 19569 10261 125 2172 -3519 1007 6668 2707 6016 -681 -8895 -13556 -17902
17755a7902L266K388L499M544K699K813J372m600n22K537j503n790L552K726N262
17740D341l319k136K649O2P967N384j1053j552j226l558k30n417L441J1449n42
17725F260p309j3381o834M708J1223P003P075m391q117K382Q499L622o350p465
17711c075K237P594K541k537n699k959M47m12k191K148m55L575L834R37j8574
17696a2589K19L879K15L085j360J832M577r34o018k80J146j589k57J0368N077
17681G371l764L956K27q432N50K992J092l218k111J084L04q659J333R153J745
17666C623j220J256m638K262J137J8k773K332p725q443L377O768P440l704K689
17651B399J0715J7090j204p689r149q000M129J693n753K269O063J454K775M632
$$ plain form
17755 -17902 -14636 -12248 -8749 -4205 -1506 1307 2679 -1921 -2443 94 -1409 -7199 -3647 -921 4341
17740 4341 1022 -1114 1535 1597 9564 14948 3895 2343 1117 -2441 -2671 -8088 -4647 6802 6260
17725 6260 -1049 -14430 -21264 -16556 -5333 1670 8745 4354 -3763 -1381 7118 10740 4390 -3075
17711 -3075 -838 6756 9297 6760 1061 -1898 -1451 -1863 -4054 -1906 -2361 1214 5048 5985 -12589
17696 -12589 -12370 -8491 -8276 -5191 -6551 -4719 -142 -1076 -7094 -7374 -6228 -7817 -8074 2294 7371
17681 7371 3607 7563 7790 -642 -92 2900 3992 774 -1337 -253 51 -8608 -7275 1878 3623
17666 3623 2403 3659 -979 1283 2420 2438 -335 1997 -5728 -14171 -10794 -4026 3414 -290 2399
17651 2399 13114 30204 29000 21311 12162 4162 8291 9984 4231 6500 12563 14017 16792 21424
17637B1424O891M887O634N391l544J942J0929Q323K234J243o05L883K010O149
17623G7791n853j347K184q55L351p068r583m913k071k042p022m316p167q330n930
17608A6829p795j2758j83O794K009n47o547o676N111P345L168M671o190l845R69
17593B355j988j0485m523J932P18J1173R427R154J469j724L414M279l673j482
17579B0046K336j157o037o60j156L165n08p003p428q46L359J657n942o205J703
17564d676M160M648L120j140n452k288j395p167n301r85O577N695J095J173m905
17549f841l28J158M544j211J981J877m836K140J768K429L513k131j950K130N292
17534I535M762K309m064j711M617l009m264o29k958j08P541O659J14l894n467
$$ plain form
17637 21424 28315 33202 39836 45227 41683 43625 54554 62877 65111 66354 65749 69632 71642 77791
17623 77791 71938 70591 72775 71920 75271 68203 58620 53707 51636 49594 42572 38256 31089 22759 16829
17608 16829 9034 -3724 -3907 2887 4896 4349 -2198 -8874 -3763 3582 6750 11421 5231 1386 2355
17593 2355 367 -10118 -14641 -12709 -11991 -818 8609 17763 19232 17508 20922 25201 21528 20046
17579 20046 22382 21225 15188 14528 13372 16537 16029 9026 1598 752 4111 5768 -174 -6379 -4676
17564 -4676 -516 4132 7252 6112 660 -1628 -3023 -10190 -15491 -16476 -9899 -4204 -3109 -1936 -6841
17549 -6841 -7169 -6011 -1467 -2678 -697 1180 -3656 -1516 252 2681 6194 4063 2113 4243 9535
17534 9535 14297 16606 12542 10831 15448 12439 8175 7546 4588 4480 12021 18680 18794 14900 9433
17519I433l713l412L089j0398l536J574m281l346L752N784P251P676l82j607o014
17504A870j2899m685P281j133j658n831N98P859K413r04r31j707k160n800k998
17489b0685N513J0983O896Q678o947m425n05L744L493K502J294k075L782o73n710
17474E865j0L110p400l28J685L67o374M503m22n904J338N361L106k63n977O34
17458g09N393K094J807j429l427r831o839N494N350l91m275J761O523j452k292
17443b223O938N240N307P609K3450K0183o242r099k1943j8679l592k306K504j04
17429G043k372l962m65m038J824L699K568j07j603l246r021N88N321K109N050
17414C388L731q068p802J0696O457j535j433p160j2034l709M553j872L47M973
$$ plain form
17519 9433 5720 2308 5397 -5001 -8537 -6963 -11244 -14590 -10838 -5054 2197 9873 9491 7884 1870
17504 1870 -11029 -15714 -8433 -9566 -11224 -17055 -16457 -8598 -6185 -7089 -8020 -9727 -11887 -17687 -20685
17489 -20685 -15172 -4189 2707 11385 4438 13 -492 3252 6745 9247 10541 8466 12248 11575 5865
17474 5865 5855 8965 1565 1237 2922 3289 -3085 1418 996 -4908 -3570 1791 4897 4634 -1343 -709
17458 -709 4684 6778 8585 7156 3729 -6102 -12941 -7447 -2097 -2488 -6763 -5002 1521 69 -2223
17443 -2223 4715 9955 15262 22871 46321 66504 60262 51163 29220 10541 6949 4643 7147 7043
17429 7043 4671 709 244 -3794 -1970 1729 4297 4190 2587 -659 -9680 -9092 -3771 -1662 3388
17414 3388 7119 -949 -8751 1945 8402 6867 5434 -1726 -13760 -17469 -12916 -14788 -14441 -9468
17400i468J0867M028J906o596Q493N577p43o540m60m157n280M212Q681J345m571
17385G294j457K592j277o750j3012K131K21K053k51m555l45o18N59J073K465O101
17369c776j138L004P22J494o466P320L392r90j539j015r692r124l67Q798M545
17354d832M610L454M835k631J511k147L92m63K770k351r580K401Q945r563n567
17339h216J3004K872j896p295J518L767q48n108q57M416M092j881k267l190N9
17324a830m312l743J315L114R227J932o757n599O800J928o0K272m433m297O592
17309B149J874J594n122o129m638L803m49l802r770j782P553J0801O529N662j849
17294F424R58l9l163k537K353J10L546m004O49j0127q780N613N207K786J555R791
$$ plain form
17400 -9468 1399 5427 7333 737 9230 14807 14064 7524 7064 2907 -2373 1839 10520 11865 7294
17385 7294 5837 8429 7152 402 -12610 -10479 -10258 -8205 -8456 -13011 -13356 -13974 -13415 -12342 -9877 -3776
17369 -3776 -4914 -1910 -1188 306 -6160 1160 4552 3562 2023 1008 -8684 -17808 -18175 -9377 -4832
17354 -4832 -222 3232 8067 5436 6947 4800 5192 4729 7499 5148 -4432 -2031 6914 -2649 -8216
17339 -8216 4788 7660 5764 -1531 -13 3754 2906 -2202 -3059 1357 5449 3568 1301 -1889 -1830
17324 -1830 -6142 -9885 -8570 -5456 3771 5703 -1054 -6653 147 2075 2015 4287 -146 -4443 2149
17309 2149 4023 5617 495 -5634 -10272 -6469 -6918 -10720 -20490 -22272 -14719 -3918 2611 8273 6424
17294 6424 7382 7343 4180 1643 3996 4106 7652 3648 4297 -5830 -14610 -8997 -3790 -1004 551 10342
17278A0342M472j0217r950P238N082L412L695J665o182L344o205n860l28O132
17264F640j848j486K761M426M988n274k975K886L070m114R301p551m766J095j229
17249E924n943J383J949J243k861L035L441L357m042m781j857n142m100Q417R166
17234I189O15o4j871k19o08r494k787l205J0040M60p061M77J094m881k269J578
17218i006J081P30J2320k304j1026N475P111L106L512o297J18n684l288k300L257
17203c195M47N591l367n540l329K077L249J94k932L990K250R9J81J168n843N79
17187d381M637n43l657l097o447p490Q769J3792k335J020J759m258p282o372K535
17172a3350J4196l559o225J192M980L424P322O84q91k850n990J737M655o406m461
$$ plain form
17278 10342 14814 4597 -5353 1885 6967 10379 14074 15739 9557 12901 6696 836 508 6640
17264 6640 4792 3306 6067 10493 15481 10207 7232 10118 13188 9074 18375 10824 6058 7153 5924
17249 5924 -19 1364 3313 4556 1695 4730 8171 11528 7486 2705 848 -4294 -8394 23 9189
17234 9189 9804 9740 7869 7650 7042 -2452 -5239 -8444 1596 2056 -5005 -4528 -3434 -8315 -10584 -9006
17218 -9006 -7925 -7195 5125 2821 -8205 -2730 4381 7487 10999 4702 4820 -864 -4152 -6452 -3195
17203 -3195 -2748 2843 -524 -6064 -9393 -7316 -4067 -3873 -6805 -2815 -565 -466 -285 883 -4960 -4381
17187 -4381 256 -287 -3944 -7041 -13488 -20978 -12209 1583 -752 268 2027 -2231 -9513 -15885 -13350
17172 -13350 846 -2713 -8938 -7746 -2766 658 7980 8664 7773 4923 -1067 670 5325 -1081 -5542
17157e542Q231R649j162p522K748K177r941m542L148k805j64j439l330L05Q219
17142a970P666l908n981J846k105J27j0448P31R181M549k296q079j259J565J415
17127h966k840J141k015n77N397K818j287k707R00K933P51K850k859l465j820
17112i746J2413j171m345n702k699Q226L176j840N959O022k841j630J195K437
17098I454l716q423p147p86K368M996L614k48j759m629O244N066l399M459j15
17083E979r712r107m266K254J256J289L54L56N75J260P723R277J546L80k059j989
17067E116q76N769l830q419k048O04K226k791l843L943Q156M185K413M958p081
17052H482J380n488q341J774l959J727M26Q102q88m439l316l436M450O431K338
$$ plain form
17157 -5542 2689 12338 11176 3654 6402 8579 -1362 -5904 -2756 -5561 -5725 -7164 -10494 -10189 -1970
17142 -1970 5696 1788 -4193 -2347 -4452 -4325 -14773 -14042 -4861 -312 -2608 -10687 -11946 -10381 -8966
17127 -8966 -11806 -10665 -12680 -13257 -7860 -5042 -6329 -9036 -8136 -5203 -4452 -1602 -4461 -7926 -9746
17112 -9746 2667 1496 -2849 -8551 -11250 -3024 152 -1688 4271 10293 7452 5822 7017 9454
17098 9454 5738 -2685 -9832 -10618 -8250 -3254 360 112 -1647 -6276 -32 5034 1635 6094 5979
17083 5979 -3733 -12840 -17106 -14852 -13596 -12307 -11953 -11597 -11022 -9762 -2039 7238 8784 9164 7105 5116
17067 5116 4240 10009 6179 -2240 -4288 -3684 -1458 -4249 -8092 -4149 4007 8192 10605 15563 8482
17052 8482 9862 4374 -3967 -2193 -6152 -4425 -3999 4103 3215 -1224 -4540 -7976 -3526 2905 5243
17037E243R20N01n540j1223L250J0889J970m648L705M991k232p741m834n745k708
17022a3202n132J049M999P109N529M194n644Q16J747N98j619l891r076j941M134
17007a0330l394R86k581P732M331n140m492k858N028P605K950n122p93O580j14
16992C88o306J996j120n771O330k110l191j136J444M764O919M154p133l420m0
16977d232P11q837j3119J768Q189L857O839Q144M772r885o393q1q96P084K704
16962F25o361m39L834q64j34k208M898l751P440L434j497J943m021p368k719Q14
16946f374l838j251L255M255N81M804j289o101J563M661p21J560J915L648n397
16931A271j942M280n10j230l25n576n664J31J295K380O310J990m145j841J669
$$ plain form
17037 5243 6163 6664 1124 -10099 -6849 4040 6010 1362 5067 10058 7826 85 -4749 -10494 -13202
17022 -13202 -18334 -17285 -12286 -5177 352 4546 -1098 -282 1465 2063 444 -3447 -12523 -14464 -10330
17007 -10330 -13724 -12738 -15319 -7587 -3256 -8396 -12888 -15746 -10718 -3113 -163 -5285 -6078 502 388
16992 388 -5918 -3922 -5042 -10813 -4483 -6593 -9784 -10920 -9476 -4712 2207 6361 -772 -4192 -4232
16977 -4232 -3521 -12358 -25477 -23709 -15520 -11663 -4824 3320 8092 -1793 -8186 -8267 -9163 -2079 625
16962 625 -5736 -6175 -2341 -3205 -3339 -5547 -649 -4400 3040 6474 4977 6920 2899 -4469 -7188 -6374
16946 -6374 -10212 -11463 -8208 -3953 -3372 1432 143 -5958 -4395 266 -455 1105 3020 6668 1271
16931 1271 -671 3609 3099 1869 1544 -4032 -9696 -9565 -8270 -5890 420 2410 -1735 -3576 -1907
16916a907R318K216q802n424l334K943J0953p500q917j913J0088L109l091p646
16902i907Q551R638m724n710l936N402m75q597M570k638o36l450J576L755n013
16887a1594L888k430j326K57k431k552M61K456O192L098n109J982R502J048o425
16872b983m180K714J976L657m610l598m656j40O152o696r9l105N348N652l414
16857g982k736L613r85K088M70j122n283n391K43j132l219K010P74O432J6835
16842D615q38k59j48J370n559L656r78n935p599O094R203m626R76k652j78L392
16826E34J289j0367o01J937J405m811J664L052K021J994m677q388l851j722l493
16811b4014K752N041P98R626Q098N487o949k325R63K284M881l000O03l192m205
$$ plain form
16916 -1907 7411 9627 825 -4599 -7933 -4990 5963 -1537 -10454 -12367 -2279 830 -2261 -9907
16902 -9907 -1356 8282 3558 -2152 -6088 -686 -1161 -9758 -5188 -7826 -8462 -11912 -10336 -6581 -11594
16887 -11594 -7706 -10136 -11462 -11205 -13636 -16188 -15727 -13271 -7079 -3981 -9090 -7108 2394 3442 -2983
16872 -2983 -7163 -4449 -2473 1184 -3426 -7024 -11680 -11820 -5668 -12364 -12463 -15568 -10220 -4568 -7982
16857 -7982 -10718 -7105 -8090 -6002 -5532 -6654 -11937 -17328 -17085 -18217 -21436 -19426 -18652 -12220 4615
16842 4615 3777 3518 3370 4740 -819 2837 1859 -4076 -11675 -5581 3622 -1004 -28 -2680 -2858 534
16826 534 1823 -8544 -9145 -7208 -5803 -10614 -8950 -5898 -3877 -1883 -6560 -14948 -18799 -20521 -24014
16811 -24014 -21262 -16221 -15423 -5797 2301 7788 839 -1486 -523 1761 6642 3642 4245 1053 -3152
16796c152P656O275n187n914j199j077Q93m78n858K395L058q43K244P372K727
16781H912j1315k711j839k637j661R51L940o29m761l808L074R383J654l414J870
16766b991K829J465J759j037q614j419K342p38O71K608m677o754J512J0369j57
16751b832J74o557j906k918M257K314l448J35L48l089n315L543P309P21j96p963
16735a5423K205P539N86J369J807o748r900L009P633L93K816p4J029j847K267
16720c339N471O549l682j664k224j092n620L518L3k642N488q768o636P170Q226
16705G88L566l131n858l772j296M020L658q95n589j0311M99Q297O452q45Q88R058
16689E529L145M596N774p207n172j0691q207K204p05m43P080Q215n84j947j3789
$$ plain form
16796 -3152 4504 10779 5592 -322 -1521 -2598 -1705 -2183 -8041 -5646 -2588 -3431 -1187 6185 8912
16781 8912 -2403 -5114 -6953 -9590 -11251 -10300 -6360 -6989 -11750 -15558 -12484 -3101 -1447 -4861 -2991
16766 -2991 -162 1303 3062 2025 -6589 -8008 -5666 -6404 -5733 -3125 -7802 -14556 -13044 -2675 -2832
16751 -2832 -2658 -9215 -11121 -14039 -9782 -7468 -10916 -10781 -10433 -13522 -18837 -15294 -7985 -7264 -7460 -15423
16735 -15423 -13218 -5679 -5093 -3724 -1917 -8665 -18565 -15556 -7923 -7530 -4714 -4788 -3759 -5606 -3339
16720 -3339 2132 8681 4999 3335 1111 19 -5601 -2083 -2050 -4692 796 -7972 -14608 -7438 788
16705 788 4354 1223 -4635 -8407 -9703 -5683 -2025 -2920 -8509 -18820 -18321 -10024 -3572 -4417 -3529 5529
16689 5529 8674 13270 19044 11837 6665 -4026 -12233 -10029 -10734 -11177 -4097 4118 3534 1587 -12202
16674a2202l659O125N655P895Q74Q75m610K058k861l990j691J679o62j323N315
16659e22J192l319l494L629L930j984j945o452m157m94L624L302M259P918J905
16644G392j410j0512n551J858M78k246M281M823N034J588n398r020m610k705M867
16629a1131m604M088R192J826J800J102p81n032k454L156M919J39m661j744R263
16614E078J904K14k03K939K701M680k183n46n889k76k161J467M42K043o72K622
16598A2160P831Q556k649m364K49K737n256l133K974Q832Q649N364L273K771L534
16583E1528o0K603Q846M992J135j422L225n944K642l564p394l376l284p333o884
16568C5710J152M887j710q029l591o685K08p53j996O103o058p966l046p319k895
$$ plain form
16674 -12202 -15861 -9736 -4081 3814 4688 5563 953 3011 150 -3840 -5531 -3852 -4514 -5837 -522
16659 -522 670 -2649 -6143 -2514 1416 -568 -2513 -8965 -13122 -13616 -9992 -6690 -2431 5487 7392
16644 7392 5982 -4530 -10081 -8223 -7745 -9991 -5710 -887 4147 5735 337 -8683 -13293 -15998 -11131
16629 -11131 -15735 -11647 -2455 -629 1171 2273 1492 -3540 -5994 -2838 2081 2220 -2441 -4185 5078
16614 5078 6982 7196 6993 9932 12633 17313 15130 14584 8695 8419 6258 7725 8167 10210 9538 12160
16598 12160 19991 28547 25898 21534 21783 24520 19264 16131 19105 27937 36586 41950 45223 47994 51528
16583 51528 51468 54071 62917 67909 69044 67622 70847 64903 67545 63981 56587 53211 49927 42594 35710
16568 35710 36862 41749 40039 32010 28419 21734 21942 21189 19193 25296 19238 11272 8226 907 -1988
16553a988n9l875P572P695l369q153k786k15m369L573K68P23J293j062Q80K033
16537a839K134l451K10O793k040r570n774K420R807L650p010N185N382m192k752
16522a047J80L002L42L673J26n249L01L454j935J359l93j1368k026n657K728L007
16506i503j666j687K027J044K780J780M978M711n868J193J477l090n224M974L600
16491A526j924J139p822j710O926O672k5N16j817j0747M66J738k738J973L887
16476a940O20o386J334K867J165K161m444l726M775J0423J0746l57p375k188n506
16461B169k453J55k825o415j816P211R083K042R985n743o122m137k456l562m589
16446i473k868P592J1587L399j380n622q670l78p067p374L107J0727R026j099
$$ plain form
16553 -1988 -2047 -5922 1650 9345 5976 -2177 -4963 -5178 -9547 -5974 -5706 -4983 -3690 -4752 -3872 -1839
16537 -1839 295 -3156 -2946 3847 1807 -7763 -13537 -11117 -1310 2340 -4670 515 5897 1705 -1047
16522 -1047 -867 2135 2477 6150 6276 1027 1328 4782 2847 4206 3813 -7555 -9581 -15238 -12510 -9503
16506 -9503 -11169 -12856 -10829 -9785 -7005 -5225 -247 4464 -1404 -211 1266 -1824 -7048 -2074 1526
16491 1526 -398 741 -7081 -8791 -1865 4807 4782 5298 3481 -7266 -6800 -5062 -7800 -5827 -1940
16476 -1940 -1320 -7706 -6372 -3505 -2340 -179 -4623 -8349 -3574 6849 17595 17238 9863 7675 2169
16461 2169 -284 -129 -2954 -9369 -11185 -3974 5109 7151 17136 11393 5271 1134 -1322 -4884 -9473
16446 -9473 -12341 -4749 6838 10237 8857 3235 -5435 -5813 -12880 -20254 -17147 -6420 2606 1507
16432A507L052J873L164j234r49k467k382p508Q21j482K98M402K069K8k882L594
16416A904l297j009l983j627Q86L354J269j1936j793N609K567r23N217J404K198
16401a60p458q761L355L255k15N484R213M342Q22l28L669M863k506j0110J290
16386F755o878l100j365n402N688K117j121J153P167Q807P323P25p119r926K55
16371E079K535K175J559K64Q853N995P76K525q778r737P90p429m870J0408k246
16356G899l053l580J264R098J137r971l195q350M909P641N128J635o516J299p89
16341D556m008k637Q11N000j055o568m195M908l29j302n610K689N197L833N237
16326F527r62K210r250L6O432j994l431o804k33q28l372J38N047Q328q379n240
$$ plain form
16432 1507 4559 6432 9596 8362 7413 4946 2564 -4944 -4123 -5605 -5307 -905 1164 1192 -1690 1904
16416 1904 -1393 -2402 -6385 -8012 -7126 -3772 -2503 -14439 -16232 -10623 -8056 -8979 -3762 -2358 -160
16401 -160 -7618 -16379 -13024 -9769 -9984 -4500 4713 9055 9877 9549 13218 18081 15575 5465 6755
16386 6755 -123 -3223 -4588 -9990 -4302 -2185 -3306 -2153 5014 13821 21144 21869 14750 4824 5079
16371 5079 7614 9789 11348 11612 20465 26460 27236 29761 20983 11246 12036 4607 -263 10145 7899
16356 7899 4846 1266 2530 11628 12765 2794 -401 -8751 -3842 3799 8927 10562 4046 5345 4556
16341 4556 548 -2089 -1278 3722 2667 -3901 -8096 -3188 -3517 -4819 -10429 -7740 -2543 1290 6527
16326 6527 5565 7775 -1475 -1439 4993 2999 -432 -7236 -7469 -8297 -11669 -11531 -6484 1844 -6535 -11775
16310a1775R996j031n117n977K298L161l028O585l740r338J788Q712P493K856
16296B883Q31n567m608K449L546o62p048K534j944m423j86Q87k458k398O728Q624
16280h12k106q72k39k106R5N75N582N700J444k558K529K560l849P22l292j842
16264A531o363J088N865K066p834j1929P227k622J314J250J409J695M900m79O003
16249E121j986n990L359J652J568l836M564N561J98O04l173j343o822k483K117
16234h89o338m917K964J016M39l031o530J159J0191l262J705N258P32m29j692
16219c624M424K330k22j900K343o302m882q731L812O873q89J322l69N763L78l171
16203b845j805M791L015K594m403n668r17j462N048Q13l642j12j202O057J297
$$ plain form
16310 -11775 -1779 -2810 -7927 -13904 -11606 -8445 -11473 -4888 -8628 -17966 -16178 -7466 27 2883
16296 2883 3714 -1853 -6461 -4012 -466 -1128 -8176 -5642 -7586 -12009 -12195 -11308 -13766 -16164 -9436 -812
16280 -812 -2918 -3790 -4029 -6135 -6040 -5465 117 5817 7261 4703 7232 9792 5943 6665 3373 1531
16264 1531 -4832 -3744 2121 4187 -3647 -15576 -8349 -10971 -9657 -8407 -6998 -5303 -403 -882 5121
16249 5121 3135 -2855 504 2156 3724 -112 4452 10013 10211 10815 7642 6299 -523 -3006 -889
16234 -889 -7227 -12144 -9180 -8164 -7725 -10756 -17286 -16127 -5936 -9198 -7493 -2235 -1503 -1932 -3624
16219 -3624 800 3130 2908 1008 3351 -2951 -7833 -16564 -12752 -5879 -6768 -5446 -5815 -52 326 -2845
16203 -2845 -4650 141 3156 5750 1347 -4321 -5238 -6700 -1652 -839 -4481 -4593 -5795 262 1559
16188A559l130l039k811M28P323L030K542m874n888n951j781O05L081J465m542
16173a1983l724L251N460K965l901J311R283K624l573q162m847L924O355K455
16159A438J759k718o350J763J449n149O924L118Q842J1k102j08q266m101M092
16144F02k098m945J044P119O006J398N626n709q496L171Q47l778N908k414j588
16129B693L115L302o455o805N262o365l729K465R59o649J631K915J0118J1522
16115A3979L21L493P482r189r061o989p406J458P696N655m277l093l295n201k275
16100a0702M767K170r502O05M214O732l07m717o35J784j815J202N636o219l133
16085i920l74j678k211J305L29P403N734N098j442p49l236k482K89L529N210l730
$$ plain form
16188 1559 -1571 -4610 -7421 -6993 330 3360 5902 1028 -4860 -10811 -12592 -11987 -8906 -7441 -11983
16173 -11983 -15707 -12456 -6996 -4031 -7932 -6621 2662 5286 1713 -6449 -11296 -7372 -1017 1438
16159 1438 3197 479 -5871 -4108 -2659 -7808 -884 2234 11076 11087 8985 8877 611 -3490 602
16144 602 -1496 -6441 -5397 1722 7728 9126 14752 9043 547 3718 4565 787 6695 4281 2693
16129 2693 5808 9110 2655 -4150 1112 -5253 -8982 -6517 -5558 -12207 -10576 -7661 2457 13979
16115 13979 14300 17793 25275 16086 7025 36 -7370 -5912 1784 7439 3162 69 -3226 -8427 -10702
16100 -10702 -5935 -3765 -13267 -12662 -8448 -1716 -2023 -6740 -7375 -5591 -7406 -6204 -568 -6787 -9920
16085 -9920 -10294 -11972 -14183 -12878 -12549 -5146 588 5686 4244 3495 259 -2223 -1934 1595 6805 3075
16069C075n6K9j512Q40J443k248p047l6N561K483n493j309k033O272j699L521
16053A791K929m41k92n011M36P325k60J328N529q44M956q146j0372K340J991j705
16037A554n596m223k21L475K203O2O518O919k373j2162j355O463p8k952L613L710
16021E557m846j129K017O436j621j636l554M17k482K551M705l138J878J824m602
16006B377m049l602J086n212M125O591P30m733O784M475l169q881j1404j411M2
15991a6251m103K950M114P208K282R57j025l01n585L092Q302M054J137p480q513
15976i162L942P587q92M968M315k739L189k129l479r762l933M361N322k815l97
15961a624L609o56n584N609M329m367r909N858J0255L929l704K203m786n033O038
$$ plain form
16069 3075 3019 3048 1536 2376 3819 1571 -5476 -5512 49 2532 -2961 -4270 -6303 -31 -1730 1791
16053 1791 4720 4279 3987 -1024 -588 6737 6477 7805 13334 12490 17446 9300 -1072 1268 3259 1554
16037 1554 -4042 -8265 -8486 -5011 -2808 -2746 3772 10691 8318 -3844 -5199 1264 1186 -1766 1847 5557
16021 5557 711 -418 1599 8035 6414 4778 1224 1641 -841 1710 6415 3277 5155 6979 2377
16006 2377 -1672 -5274 -4188 -9400 -5275 1316 2046 -2687 4097 8572 5403 -3478 -14882 -16293 -16251
15991 -16251 -20354 -17404 -13290 -6082 -3800 -2843 -3868 -4169 -9754 -6662 1640 5694 6831 -649 -9162
15976 -9162 -5220 2367 1475 6443 10758 8019 11208 9079 5600 -4162 -8095 -3734 1588 -1227 -1624
15961 -1624 1985 1329 -4255 1354 5683 1316 -8593 -2735 7520 11449 7745 9948 5162 129 6167
15946F167R3L382n233m871r69k201q77k14P96J737M159o67M71r85k180N594K416
15929F618j645r302l949M614Q523K878l706k002P277k028J165J781k526r184n914
15914g400n565k687L292O688Q069n846k708K881n977o162O160M415j02R14O441
15899B413q542o975K137N133L373R822m32j937j1920k339J82R84k721m105j307
15884a6234L476O827l160p695P912J0368J41r13j58o982j2446N3J0394N931J340
15869a146K324j136j529R91n84k991n361K775J985K426L928q51l523l569j306
15854g567K479K286M032o904L470M714j013L170k838M609J759l952M06O449J617
15839A2717q800J890l479p763l932l294L129M045L344M215K9M088q87r33j184
$$ plain form
15946 6167 6260 9642 4409 -462 -1431 -3632 -4509 -4723 -3927 -2190 1969 1302 1773 788 -1392 4202 6618
15929 6618 4973 -4329 -8278 -3664 4859 7737 4031 2029 9306 7278 8443 10224 7698 -1486 -7400
15914 -7400 -12965 -15652 -12360 -5672 2397 -3449 -6157 -3276 -9253 -15415 -9255 -4840 -4942 -4028 2413
15899 2413 -6129 -13104 -10967 -5834 -2461 7361 6929 4992 -6928 -9267 -9085 -8101 -10822 -14927 -16234
15884 -16234 -12758 -5931 -9091 -16786 -8874 1494 1635 722 564 -6418 -18864 -18811 -8417 -2486 -1146
15869 -1146 1178 42 -1487 -496 -1080 -4071 -9432 -6657 -4672 -2246 1682 831 -2692 -6261 -7567
15854 -7567 -5088 -2802 1230 -5674 -2204 2510 1497 4667 1829 6438 8197 4245 4651 11100 12717
15839 12717 3917 5807 2328 -5435 -9367 -12661 -9532 -5487 -2143 2072 2101 6189 5302 4369 3185
15824C185n962K712M27P15L166Q326r723m926j624L011N317J996l491o098l637
15809f606K139L814J179n996m529j791q92K331P608R858Q264M617j6323j0297
15795f624o82J872L825O940K787n97m654l038m600j891o258m90M875K684L02K113
15779c436M700m547J432L818L809j046l793l713Q021l309k322L000J998o153m44
15764a985N780P430K650p488m95P08l450p85m93K895M026k770j418j471n0k696
15748C88m012q91M565N567j117k374k851k57m40L982J503n80k867q38p731q89
15732h842L606q606J304P050P214N765J741k485m744K52O64J015m982k739j595
15717e382l800Q73R84N211n541M469l339r72j595l465j89O892L591K731J623p017
$$ plain form
15824 3185 -2777 -65 362 1077 4243 12569 2846 -2080 -3704 -693 4624 6620 3129 -2969 -6606
15809 -6606 -4467 -653 526 -5470 -9999 -11790 -12682 -10351 -2743 7115 15379 19996 3673 -6624
15795 -6624 -7306 -5434 -1609 5331 8118 7521 2867 -171 -4771 -6662 -12920 -13410 -8535 -5851 -5549 -3436
15779 -3436 1264 -3283 -1851 1967 5776 4730 937 -2776 5245 1936 -386 2614 4612 -1541 -1985
15764 -1985 3795 11225 13875 6387 5892 6600 3150 2365 1872 4767 8793 6023 4605 3134 3084 388
15748 388 -3624 -4515 50 5617 4500 2126 -725 -982 -1422 2560 4063 3483 616 -222 -7953 -8842
15732 -8842 -5236 -13842 -12538 -5488 1726 7491 9232 6747 2003 2255 2919 3934 -1048 -3787 -5382
15717 -5382 -9182 -8309 -7325 -2114 -7655 -3186 -6525 -7497 -9092 -12557 -12746 -5854 -2263 468 2091 -4926
15701d926p336P16K866m82p342m426P534J3257J3939n395k624l1k580K399L367
15686H936p941o286l757k249J696M77R155J722R69O159p627k471O95K554p82r071
15670g821l918J302k895m847M599M58L819M660J739O550J575m742n641j497n49
15655g208k819L876O849P0l839J685K020L307l4o989o644M365R013J37p006p491
15639a0708m830L202L744O541k55J223L9N904k556n409n998O185K010j060P799
15624E831P46q049M011P291N542p19j182o959q80o314k766o115m269O065J064
15609f703M473J1879j106k218M088m760p566M411L060K468J111m719q317p295
15595a1194J584J5272n52j841p82o410n44k002k862m934RL650M707L135L087J164
$$ plain form
15701 -4926 -12262 -11546 -8680 -9162 -16504 -20930 -13396 -139 13800 8405 5781 5750 3170 5569 8936
15686 8936 995 -5291 -9048 -11297 -9601 -9124 31 1753 2722 8881 1254 -1217 -522 2032 1250 -7821
15670 -7821 -11739 -10437 -13332 -18179 -13580 -13122 -9303 -4643 -2904 3646 5221 479 -5162 -6659 -7208
15655 -7208 -10027 -6151 698 768 -3071 -1386 634 3941 3907 -3082 -9726 -5361 3652 3789 -3217 -10708
15639 -10708 -15538 -12336 -8592 -2051 -2306 -1083 -1044 4860 2304 -3105 -9103 -2918 -908 -1968 5831
15624 5831 6577 -1472 2539 9830 15372 14653 13471 6512 5632 -682 -3448 -9563 -13832 -7767 -6703
15609 -6703 -2230 9649 8543 6325 10413 5653 -1913 2498 5558 8026 9137 4418 -3899 -11194
15595 -11194 -9610 5662 5110 3269 2487 -3923 -4467 -6469 -9331 -14265 -14256 -10606 -5899 -2764 323 1487
15579A487K3n666l405K832l952m873J189L270N939R758L275r18n126L428Q676
15564A5937k761l084k844N792N947o189m564p235Q49k336P70P51M978O001o286
15549E726m146j199l647p22K554N481O958q34q888K56P103j800j0772j82R040
15534D928p79O367o578k435j941J015L79R80J622m089j0719j946P194P42P858
15519B598J998m781k02N924k598k994N579M882j746k751k004k046r350n733K854
15504a0370M153M372m410l586l701m010P756Q314P908J143k460J539o53n820J330
15489A505l731j367m198j022j904K831N540O040P48L200k024n389n012m009Q005
15474g87M455N640k173j567N720N180p748o526n463M45R892L200L706j453o020
$$ plain form
15579 1487 1510 -4156 -7561 -4729 -8681 -13554 -12365 -9095 -3156 6602 9877 8959 3833 7261 15937
15564 15937 13176 10092 7248 13040 18987 12798 8234 999 1848 -488 282 1033 6011 12012 5726
15549 5726 1580 381 -3266 -3988 -1434 4047 11005 10171 1283 1539 8642 6842 -3930 -4112 4928
15534 4928 4149 10516 3938 1503 -438 577 956 1936 3558 -531 -11250 -13196 -6002 -5260 2598
15519 2598 4596 -185 -387 5537 2939 -55 5524 10406 8660 5909 3905 1859 -7491 -13224 -10370
15504 -10370 -6217 -1845 -6255 -9841 -13542 -17552 -9796 -1482 6426 7569 5109 6648 5995 175 1505
15489 1505 -2226 -3593 -7791 -8813 -10717 -7886 -2346 3694 4442 7642 5618 229 -4783 -8792 -787
15474 -787 3668 9308 7135 5568 11288 16468 8720 2194 -3269 -2824 7068 10268 13974 12521 6501
15459F501n564j997M121j704K815m496R23q890j0766O01K530J1136O028j006M352
15444D584k158r62p77l568P34M45L239m30l610r69J118L218N98m4j177k729L19
15427b169j766l022J305O768M129j393m78K679k889l942J045k772l06N514m527
15412a824p308k593O990o256m78k591k590K707J3819P702J727J937M191k664m223
15397H546k494J917n445j131j892p527M721R74l97k628k31M045k977K090j89L258
15381F40l16N008j723L323j583Jo652m288P557K056j522l533j681j1039o941J668
15365a9025P683N282K820P42j893j457N252N112M087k115k526k445l365J533M938
15350D623J99m061Q87n146l220L559P389N58m784q42O161j585j1693o544J861
$$ plain form
15459 6501 937 -1060 3061 1357 4172 -324 599 -8291 -19057 -18456 -15926 -4790 1238 232 4584
15444 4584 2426 1464 687 -2881 -2147 -1702 1537 1107 -2503 -3472 -2354 864 1462 1418 241 -2488 -2169
15427 -2169 -3935 -6957 -5652 1116 5245 3852 3374 6053 3164 -778 267 -2505 -2811 2703 -1824
15412 -1824 -9132 -11725 -4735 -10991 -11469 -14060 -16650 -13943 -124 7578 9305 11242 15433 12769 8546
15397 8546 6052 7969 2524 1393 -499 -8026 -3305 -2331 -2728 -5356 -5587 -1542 -4519 -2429 -2618 640
15381 640 324 5332 3609 6932 5349 5350 -1302 -5590 1967 4023 2501 -1032 -2713 -13752 -20693 -19025
15365 -19025 -11342 -6060 -3240 -2498 -4391 -5848 -596 4516 8603 6488 3962 1517 -1848 -315 4623
15350 4623 4822 761 1648 -3498 -6718 -3159 4230 4788 4 -838 5323 3738 -7955 -14499 -12638
15335a2638J225M437j900M869N324j025q81P828L431l884p678r137O15j664l28
15320a1406O534L389m219M304N115k069m273m559K281P76l000P710P495N41m783
15305C836J430K498l09p259L634L969K317m019r475m367K065M124J366O376j075
15290E111L290n644j0304j195K055M60P253n445p66L421j458L138L406q244m232
15275i154j109J2150n397m773l158J968L055n179l552J585Q727K028N098R846
15261A2135L277j1237k523m765o321l621J629L572L13P6j153o57J1174M315r72
15246E242K319K028l44m363q57j479k887o89l58j209p318m435J584K505Q649M091
15230B479l711K36k726O672M383r810j0033L661N942J232k725MN718m607O82L393
$$ plain form
15335 -12638 -11413 -6976 -8876 -4007 1317 292 -589 7239 10670 6786 -892 -10029 -9414 -11078 -11406
15320 -11406 -4872 -1483 -5702 -1398 3717 1648 -2625 -7184 -4903 -4127 -7127 583 8078 8619 3836
15305 3836 5266 7764 7455 196 3830 7799 10116 6097 -3378 -7745 -5680 -1556 -190 6186 5111
15290 5111 8401 2757 -7547 -8742 -6687 -6227 1026 -4419 -5185 -1764 -3222 -84 3322 -4922 -9154
15275 -9154 -10263 1887 -3510 -8283 -11441 -9473 -6418 -11597 -15149 -13564 -4837 -2809 2289 12135
15261 12135 15412 4175 1652 -3113 -9434 -13055 -11426 -7854 -7541 -7465 -8618 -9275 1899 6214 5242
15246 5242 7561 9589 9245 4882 4025 2546 -341 -1030 -1388 -2597 -9915 -14350 -12766 -10261 -1612 2479
15230 2479 -1232 -996 -3722 2950 7333 -2477 -12510 -8849 -2907 -1675 -4400 -4396 1322 -3285 -2603 790
15214G90j519l222j255L296J158J01O277J380P31o702q575N371k598l976N464
15199c279J1745m794J395j388p884M449J0162p967o564O578K306m55Q998J600
15185A4902q48m655P26p423K851j710K825j205K247k563o003k597k536O944O806
15170G761m806k525j374m174p67L372R506K493p101j548K025J941J965Q607L71
15155A5746n53o312j284r77l670m250k841J366N185Q16O48j1224J187K815K256
15140a092N747J2185J423j1191n654m03k255N64L254j268O431j233m117N328J145
15125H864q139q689L598J009j334K585M315j477o874o539j001N451Q21m022o682
15110a8114N54K394q79L137K314L081M552k66o48N797P329M227l816R31k520l28
$$ plain form
15214 790 -729 -3951 -5206 -1910 -752 -651 5626 7006 7737 1035 -7540 -2169 -4767 -8743 -3279
15199 -3279 8466 3672 5067 3679 -4205 244 10406 2439 -4125 2453 4759 4304 13302 14902
15185 14902 14054 9399 10125 2702 5553 3843 6668 5463 7710 5147 -856 -3453 -5989 955 7761
15170 7761 2955 430 -944 -5118 -5885 -2513 6993 9486 2385 837 2862 4803 6768 15375 15746
15155 15746 15193 8881 7597 6620 2950 -1300 -4141 -2775 2410 3226 3874 -7350 -6163 -3348 -1092
15140 -1092 4655 16840 18263 7072 1418 1015 -1240 -676 2578 1310 7741 6508 2391 7719 8864
15125 8864 725 -7964 -4366 -3357 -4691 -2106 2209 732 -6142 -12681 -13682 -8231 -7410 -11432 -18114
15110 -18114 -17560 -15166 -16045 -12908 -10594 -7513 -2961 -3227 -3875 1922 9251 13478 9662 10593 8073 7745
15094G745J46m079o541L6l35o687N729L371L641L60p625Q287L014J250J143n378
15078D077n174L27o363R7l037k755j609L812O104K967j574L295J63M042l44J490
15062E518J254m020K55k386j598J530p353k911m165P49J4751M133m612Ql824M39
15046b232N839L136k127o629p990P111P568j751j1812o279p72L334J3800M411
15032E607m639k511R072M200J059p394p731k173k665K292O327J782J059k533k24
15017A528k160M160K742p27l780m133K008K593J039l360N138j201o197L679K182
15002C511J857L976j977J57k199Q199J204n654k809k998p727l4m306M8p88M450
14986e090R50J248L644J601L577k843q103l268Q040K42o162J263K84j943P38N489
$$ plain form
15094 7745 7891 3812 -2729 -2693 -3028 -9715 -3986 -615 3026 3386 -4239 4048 7062 8312 9455 4077
15078 4077 -1097 -770 -7133 -7036 -10073 -12828 -14437 -10625 -4521 -1554 -3128 167 330 4372 4028 5518
15062 5518 6772 2752 3007 621 -977 553 -6800 -9711 -13876 -13127 1624 5757 1145 1153 -2671 -2232
15046 -2232 3607 6743 4616 -2013 -10003 -2892 4676 2925 -8887 -15166 -15938 -12604 1196 5607
15032 5607 968 -1543 7529 11729 12788 5394 -2337 -4510 -7175 -4883 1444 3226 4285 1752 1528
15017 1528 -632 3528 6270 5543 1763 -2370 -362 2231 3270 -90 5048 3847 -2350 1329 3511
15002 3511 5368 9344 7367 7524 5325 13524 14728 9074 6265 3267 -4460 -4494 -8800 -8752 -9540 -5090
14986 -5090 -4140 -2892 752 2353 5930 3087 -5016 -8284 -244 -2 -6164 -4901 -4617 -6560 -5822 -333
14970c33N641m99j139L538L76L721l39j739j193K239M251n005k228k746K145m18
14954F272m115j5707p97J0577L355L971N655k64l325L05K285m193m356k352k374
14939e063K701M170Q778j830j3661O0K742p3L195j837q05j735N09Q76J097L377
14923B501p83l969j475J0001Q153m114j798K398L888l817n609k496n121j794o981
14908a1016N251R544K944p681o920K060K437k779k62p01L531J090r21Q44M884
14893B305j563k694m478R085J1545j275m795q899k764L61Q270N908l88K24k958
14878G884j2736m989Q003j845J512M80J2001P105l178r863q581K614j24k031K6
14863c722l93O814N345q638J19n91k995p306J1387J948k096Q652j354k351m054
$$ plain form
14970 -333 5308 4809 3670 7208 7584 11305 10966 9227 8034 10273 14524 9519 7291 4545 6690 6272
14954 6272 2157 -13550 -14347 -3770 -415 3556 9211 8947 5622 5927 8212 4019 -337 -2689 -5063
14939 -5063 -2362 1808 10586 8756 -4905 -4845 -2103 -2176 1019 -818 -1623 -3358 -2849 -1973 -876 2501
14923 2501 1718 -2251 -3726 6275 14428 10314 8516 10914 14802 10985 5376 2880 -2241 -4035 -11016
14908 -11016 -5765 3779 6723 -958 -7878 -5818 -3381 -6160 -6422 -7123 -3592 -2502 -3423 -2579 2305
14893 2305 742 -1952 -6430 2655 14200 12925 8130 -769 -3533 -3172 5098 11006 10618 10842 7884
14878 7884 -4852 -9841 -1838 -3683 -2171 -1691 10310 17415 14237 4374 -4207 -1593 -1717 -3748 -3722
14863 -3722 -4115 2699 8044 -594 -475 -1066 -4061 -11367 20 1968 -128 8524 7170 4819 765
14848G65N984M650l063p04m292k711N47m071o707L707Q934L120K603n156L70k033
14832A943L375J829n847J364k671m023K302L091j530m629K188j328p758r00J0682
14817a912K097m110K391m383j68J291k799l195K464l819m2J773L504O450M615
14802D157n49o147Q154m28o446Ql242K56L86K580N406o474k952O281R714L70L025
14785A4099j0352j1205L823P822J659L808r43n510n983k076K611J1195j256l903
14771C789m316L094J408k25n349l793M878J566m42O088N484Q85m582l76o287p407
14755e585n294P391l87P754J0992j77o741j1124K345j932m158O406O09k252k996
14740e149n889J598R684j826k125J685N934o398k691q194n95J1003L647K366J131
$$ plain form
14848 765 6749 11399 8336 7632 3340 629 1176 -2895 -9602 -5895 3039 6159 8762 3606 3976 1943
14832 1943 5318 7147 1300 2664 -7 -4030 -1728 1363 -167 -4796 -2608 -3936 -11694 -12594 -1912
14817 -1912 185 -3925 -1534 -5917 -6085 -4794 -7593 -10788 -8324 -12143 -12185 -10412 -6908 -458 4157
14802 4157 3608 -2539 5615 5187 -1259 -1251 -4493 -4237 -3851 -1271 4135 -2339 -5291 990 10704 11074 14099
14785 14099 3747 -7458 -3635 4187 5846 9654 8711 3201 -2782 -4858 -2247 8948 7692 3789
14771 3789 -527 2567 3975 3750 -1599 -5392 -514 1052 610 6698 12182 13067 8485 8109 1822 -5585
14755 -5585 -10879 -3488 -3875 3879 14871 14694 7953 -3171 -826 -2758 -6916 -510 99 -2153 -5149
14740 -5149 -11038 -9440 244 -1582 -3707 -2022 3912 -2486 -5177 -13371 -13966 -2963 684 3050 4181
14725D181K708r78J806Q86q389r129K361Q577O747j549q77k27j359k552n171n283
14709h248m743Q738K00j310k752j096Q042j173l217Q777M206R52k929l12m618
14694E17O739J1747q534j0506n630l512Q741j943p150j253M655r5P612r88j603
14679a203k510q35L328L391o726k009K594n761K889M737l188n389k991K401M206
14664g066k500n87j299j575l14O294Q568Q22k731k703N523Q666L512O794Q87p704
14648A4587j0811q631j416L36q16r534Q995P605j690K442J050k345Q12l681K75
14633b822J498J744O799p9o169m085M395n491o720L263M643q009K869R239N979
14618G054N676J088L44L07m604k214j705j0472o143o117K865R243j499l30K133
$$ plain form
14725 4181 6889 5911 7717 8603 214 -8915 -6554 2023 8770 7221 6344 6117 4758 2206 -2965 -8248
14709 -8248 -12991 -4253 -4053 -5363 -8115 -9211 -1169 -2342 -5559 3218 7424 8376 5447 5135 517
14694 517 7256 19003 10469 -37 -5667 -9179 -438 -2381 -9531 -10784 -6129 -6224 1388 400 -1203
14679 -1203 -3713 -4548 -1220 2171 -4555 -6564 -3970 -9731 -6842 -2105 -5293 -10682 -13673 -11272 -7066
14664 -7066 -9566 -10153 -11452 -13027 -13341 -7047 1521 2343 -388 -3091 2432 11098 14610 21404 22291 14587
14648 14587 3776 -4855 -6271 -5935 -6751 -16285 -7290 315 -1375 1067 2117 -228 584 -3097 -2822
14633 -2822 -1324 420 7219 7140 971 -3114 1281 -4210 -10930 -7667 -3024 -11033 -8164 1075 7054
14618 7054 12730 13818 14162 14469 9865 7651 5946 -4526 -10669 -16786 -13921 -4678 -6177 -6507 -4374
14603d374K873M083j132l077K344l982N711J875J665k545k475r737L018P452L270
14588D969j382m244l837J161K911k46l549m816P26n5O093J706l62k365j545J840
14572b995j357L091m134J606N824r55r883K223p070m352k664J330O529M048O569
14557b190l608j660P174K903k821m038N138P273N326n955m010l516o434n859M56
14542a1821J575j451k006l141L726J1157J0613j066L946k145K320l209l549K356
14528G305J196k010K540j651k369o262k825J185J612J690j474l49J0207j444n350
14513B001k731L229K640J094p15L975M890k714q068l835K13J573o908k229l911
14498a1496m118N559J0523Q304o003r669k692m559K071N557J063l361Q770P885
$$ plain form
14603 -4374 -1501 2582 1450 -1627 717 -3265 2446 4321 5986 3441 966 -8771 -5753 1699 4969
14588 4969 3587 -657 -4494 -3333 -422 -668 -4217 -9033 -8307 -8362 -2269 -563 -925 -3290 -4835 -2995
14572 -2995 -4352 -1261 -5395 -3789 2035 1080 -8803 -6580 -13650 -18002 -20666 -19336 -12807 -8759 -2190
14557 -2190 -5798 -7458 -284 2619 -202 -4240 898 8171 13497 7542 3532 16 -6418 -12277 -11821
14542 -11821 -10246 -11697 -13703 -16844 -13118 -1961 8652 7586 11532 9387 11707 8498 4949 7305
14528 7305 8501 6491 9031 7380 5011 -1251 -4076 -2891 -1279 411 -1063 -1412 8795 7351 2001
14513 2001 -730 2499 5139 6233 5518 9493 14383 11669 3601 -234 -21 1552 -5356 -7585 -11496
14498 -11496 -15614 -10055 468 8772 2769 -6900 -9592 -14151 -12080 -6523 -5460 -8821 -51 7834
14484G834O07j183j095l258j2807m609N381Q873K237k615J044k512j740L108o389
14469g124o360m524J613M951M083L40Q19j391l528O448O410L58j324q108J697
14454e640Q695M101q95J000m272m568m694j0486O572O817M825l520p362o765M615
14439a1577O508K830N309m146p394k001j984J0675P653m69N444o683k428L268
14425E005J358o015l136k97J1146K251l210q68l717n266O450L157j297m110q148
14410f697l689L073P905O460J393k873j031k087Q29M555M770k769j460M609m85
14395A2503J423k146k283k145l253l014j181N896R42j888l565m985j059m529j552
14380a0836P137J270Q722J420o606K306l999m698K260k183K675P860o709k202
$$ plain form
14484 7834 8441 7258 6163 2905 -9902 -14511 -9130 -257 1980 -635 409 -2103 -3843 -735 -7124
14469 -7124 -13484 -18008 -16395 -11444 -7361 -7021 -6202 -7593 -11121 -4673 1737 2095 771 -7337 -5640
14454 -5640 3055 7156 6261 7261 2989 -1579 -6273 -16759 -10187 -3370 1455 -2065 -9427 -16192 -11577
14439 -11577 -5069 -2239 3070 -1076 -8470 -10471 -12455 -1780 5873 5404 10848 4165 1737 5005
14425 5005 6363 348 -2788 -3085 8061 10312 7102 6234 2517 -2749 3701 6858 5561 1451 -6697
14410 -6697 -10386 -7313 592 7052 8445 5572 4541 2454 3283 7838 12608 9839 8379 12988 12503
14395 12503 13926 11780 9497 7352 4099 1085 -96 5800 6742 4854 1289 -3696 -4755 -9284 -10836
14380 -10836 -3699 -2429 6293 7713 1107 3413 -586 -5284 -3024 -5207 -2532 5328 -1381 -3583
14366c583N290m480m484L92O946K958M423N218O73m552j460n316j0568j382R56
14351h969J891p34J054L3j740M86M927O870O638k332k962o68J592j13j330M420
14335I063j99K371m191K009O796l315o15P54m576j963k16M043N13r497j907n122
14319f052r667n885M384N625J065J491M45L576j24O749M361p466r674k412N94
14304a2990L902r50O813N558L635L981P041n406R78j525q430M285P700J620j371
14289A4841q157m893M659k160M05Q14K98M602l173m546J394m574j463m529o15
14274g097K628l51M6M004N000k076L87K988p332k800N897N656j94N02n35m736
14258A987k392J0442K769p868p370n224P011n343m06q83O311k017K83J376k5r46
$$ plain form
14366 -3583 1707 -2773 -7257 -6865 81 3039 7462 12680 13353 8801 7341 2025 -8543 -9925 -8969
14351 -8969 -7078 -7812 -6758 -6725 -8465 -7979 -3052 3818 10456 8124 5162 4494 6086 5973 4643 9063
14335 9063 8864 11235 7044 9053 15849 12534 11919 12673 8097 6134 5918 9961 10474 977 -930 -6052
14319 -6052 -15719 -21604 -17220 -11595 -10530 -9039 -8594 -5018 -5142 1607 5968 -1498 -11172 -13584 -12990
14304 -12990 -9088 -10038 -3225 2333 5968 9949 16990 11584 12562 11037 2607 6892 14592 16212 14841
14289 14841 6684 1791 6450 4290 4695 5509 5807 10409 7236 2690 4084 -490 -1953 -6482 -7097
14274 -7097 -4469 -4820 -4774 -770 4230 2154 2541 5529 -1803 -4603 1294 6950 6756 7258 6723 1987
14258 1987 -405 10037 12806 4938 -2432 -7656 -645 -5988 -6394 -7277 -966 -2983 -2700 -1324 -1349 -2295
14242b295K611J262M894j388J917M375j398j107L805l397l136M558P260k770k468
14227A2723o675K826M92k612k361L972K05P262P313k819l504l144o463J286K008
14212A0509R140O093J949n379m476l664l853l389m979m94M694L106R04J820o73
14197A1308n218j57L496K073L869M651k147k755L093n989p246p298l767M718J916
14182E47N824l486j27M707M701n952j816M95K167o02L400j523l479J997q089k713
14166c949O829M221o644k928n66J1666J4868n914j1215o224L543J861J566O769
14152A3883R02m883n419j13M292J048j853k201n975o184K857K094l298j65j780
14137f795J150J0127K06O305N740L951m053j3645q454L00r83M257P021M056L600
$$ plain form
14242 -2295 316 1578 6472 5084 7001 11376 9978 8871 12676 9279 6143 10701 17961 15191 12723
14227 12723 6048 8874 9366 6754 4393 8365 8570 15832 23145 20326 16822 13678 7215 8501 10509
14212 10509 19649 25742 27691 22312 17836 14172 10319 6930 1951 1457 6151 9257 10161 11981 11308
14197 11308 6090 5933 9429 11502 15371 20022 17875 15120 18213 12224 4978 -2320 -6087 -1369 547
14182 547 6371 2885 2758 7465 12166 6214 4398 4893 7060 6458 9858 8335 4856 6853 -1236 -3949
14166 -3949 2880 7101 457 -2471 -3037 8629 23497 17583 6368 144 3687 5548 7114 13883
14152 13883 14785 9902 4483 4370 8662 9710 7857 5656 -319 -6503 -3646 -1552 -4850 -5015 -6795
14137 -6795 -5645 4482 4688 10993 16733 20684 16631 2986 -5468 -5168 -6151 -1894 5127 9183 12783
14122A2783n153n73m36l144N721K676k623K84J973o06o303j265n03k343k380k056
14106c948L867M390l120n31J0588N480q23l154k359R898O057p926q069J925m54
14091A1821K693j959j878O151N180l614j397J277p567p264k405p82J624K268l408
14076G40k339M50j759N789N662p577k345L572L361K993P27M519j697p703J354
14061E747K351q76k158J423r09m632l429Q26K628k388n225R46Q01J535J03M253
14045I96m203L203M4p027q56N064O825L576L184K31K991k166l179j511o963q401
14029h192o31P585M064N64r48r00l334K849O036j671l725L201q230p796K597R35
14013g596m529M3L954J707O219J071L51L853P512K302n372k083l421L983J522
$$ plain form
14122 12783 7630 7057 6621 3477 9198 11874 9251 9535 11508 10902 4599 3334 2831 488 -1892 -3948
14106 -3948 -81 4309 1189 658 11246 16726 15903 12749 10390 20288 26345 18419 10350 12275 11821
14091 11821 14514 12555 10677 16828 22008 18394 16997 18274 10707 3443 1038 256 1880 4148 740
14076 740 -1599 -1149 -2908 2881 8543 966 -1379 2193 5554 8547 9274 13793 12096 4393 5747
14061 5747 8098 7222 5064 6487 5578 946 -2483 -1657 971 -1417 -6642 -5696 -4895 -3360 -3257 996
14045 996 -3207 -4 40 -6987 -7843 -2779 4046 7622 10806 11037 14028 11862 8683 7172 209 -8192
14029 -8192 -8823 -1238 2826 3390 2442 1542 -1792 1057 7093 5422 1697 4898 -3332 -11128 -8531 -7596
14013 -7596 -12125 -12082 -8128 -6421 -202 869 1220 5073 12585 14887 9515 7432 4011 7994 9516
13998I516j209J182j0924r516l360J516r9M941P99q80p57k444j104J864R336j975
13982c114P14L000n478q22Q869O563l115j240K332k944l014o039q589j757N672
13967h962K845P413r229J004O246N31k804R303J966m172J410K139j0535j0633
13953a3478n157L241J63N9p7L453J593L810j220L237o133k166L775K745j260O709
13937g06K607j4R4M401l21j788K549l875m903k298m787J130k48m33M949M813N833
13920G003j110r192q893j322J545Q376q29o460L17N648j034k630M58L65O44L369
13904c745K019q356m985J324J1215J0794K523m9J006o673j535p556n286K240l51
13889g415P17l309L796l025Q25O428O627p71n47o720K952O215l888j8451n031
$$ plain form
13998 9516 8307 9489 -1435 -10951 -14311 -12795 -12894 -7953 -7154 -8034 -8791 -11235 -12339 -10475 -1139 -3114
13982 -3114 -2400 600 -4878 -5700 3169 9732 6617 5377 7709 4765 1751 -4288 -12877 -14634 -8962
13967 -8962 -6117 1296 -7933 -6929 -683 -152 -2956 6347 8313 4141 5551 7690 -2845 -13478
13953 -13478 -18635 -15394 -15231 -15172 -15249 -11796 -10203 -6393 -7613 -4376 -10509 -12675 -8900 -6155 -7415 -706
13937 -706 1901 1887 1981 6382 6061 4273 6822 2947 -1956 -4254 -9041 -7911 -8159 -8592 -3643 1170 7003
13920 7003 5893 -3299 -12192 -13514 -11969 -3593 -4422 -10882 -10565 -4917 -5951 -8581 -8123 -7758 -7114 -3745
13904 -3745 -1726 -10082 -15067 -13743 -2528 8266 10789 10740 11746 5073 3538 -4018 -9304 -7064 -7415
13889 -7415 -6698 -10007 -6211 -9236 -8411 -1983 4644 3873 3326 -3394 -442 5773 1885 -16566 -21597
13874b1597P078K988M58M72M730J5523r4o336M246n579k087q61J864K235J290
13859D330k732o04L17J124l731o214j309O711J020M430O517N130l77n002p007
13844B603j4548K079J739N906J2352K043l599j851j01l988j316N681L060k874
13830G186p97K051m397l824J299J326m217k048M228j93l796O803M799n821Q19
13815C418Q87L240J439l29j883n597N68j7N636M416m117J334K869r201k29M503
13799F937J72k481n922o933n140K402M349M379n8J213P555K503p332j546L447
13784C545M46q08P222m521l379K220m424R29j978p5O605o212l513J086P538M351
13768I032k801k16J328j275l462l023N523K430j0193j838J836L559M098k583q018
$$ plain form
13874 -21597 -14519 -11531 -11073 -10601 -5871 9652 9558 3222 7468 1889 -198 -1059 805 3040 4330
13859 4330 1598 994 1311 2435 -1296 -7510 -8819 -2108 -1088 3342 9859 14989 14612 9610 2603
13844 2603 -11945 -9866 -8127 -2221 10131 12174 8575 6724 6623 2635 1319 7000 10060 7186
13830 7186 6389 8440 4043 219 1518 2844 -1373 -3421 807 614 -3182 3621 8420 2599 3418
13815 3418 4305 7545 8984 8655 6772 1175 1743 1726 7362 11778 7661 8995 11864 2663 2434 6937
13799 6937 7109 4628 -1294 -8227 -13367 -10965 -6616 -2237 -2295 -1082 6473 8976 1644 98 3545
13784 3545 3991 3183 10405 5884 2505 4725 301 1230 -748 -823 5782 -430 -3943 -2857 4681 9032
13768 9032 6231 6015 7343 6068 2606 -417 5106 7536 -2657 -4495 -2659 900 4998 2415 -5603
13753e603N924N003l497o991K347n210j888Q144K480J175n867J1286R488n625
13739A1166j0954m629j608J441N716N417l364k184K826o675j0124N50K983K927
13725f512P890K466j501l117o894l232J010J623m656j87p80J586R251O872l712
13710A07r948P840M929k923q414K664M011O466Q8K147L165N687J430r330l207
13695D712O81L447K485M05m462m907K511j646K681m305o10j568o720j600R368
13680D72o93K750m21l780p869K884P200O556n854n570P780J264o041R128m75p77
13664F554N862L794j188p404r347K111M766l909p404L177j30K767P382J205m979
13649C257n504j922n545j0593M026N986Q651l38K601l528n179L526k783J523P373
$$ plain form
13753 -5603 321 5324 1827 -5164 -2817 -8027 -9915 -1771 709 1884 -3983 7303 16791 11166
13739 11166 212 -4417 -6025 -4584 1132 6549 3185 1001 3827 -2848 -12972 -12422 -9439 -6512
13725 -6512 1378 3844 2343 -774 -7668 -10900 -9890 -8267 -12923 -13110 -13890 -12304 -3053 3819 107
13710 107 -9841 -2001 2928 5 -8409 -5745 -1734 4732 4820 6967 10132 15819 17249 7919 4712
13695 4712 5393 8840 11325 11730 7268 2361 4872 3226 5907 1602 992 -576 -7296 -8896 472
13680 472 -221 2529 2108 -1672 -9541 -6657 543 7099 1245 -4325 3455 4719 -1322 7806 7331 6554
13664 6554 12416 16210 15022 7618 -1729 382 5148 1239 -6165 -2988 -3118 -351 7031 8236 3257
13649 3257 -2247 -4169 -9714 -20307 -16281 -10295 -1644 -1982 619 -2909 -8088 -4562 -7345 -5822 1551
13634A551K314P435L38q445m513o212M383j120j023J0594l5r689l164M193P90
13619b603n539J824L839J19M19j244j565P914O236J01l260j864M009l970K887
13604G303L142m207N012K549j071p900n812p39n329k759J198L036O906K107L111
13589F547n310m783K883J256p883l504m095j036O640K826M446J882M071k90R53
13574D603l759r433k892r84j199M127R840Q579m865j0203j096Q64o137M9O374
13559f132M968O940O593N640p528j0818k487l698m20P392K285k141m622k292l072
13544i392N326L619j144m060J400k516M940N402p071j0510L11L193N296R656q6
13529D364k29K692k81J787n643L99m344m746M519R610j575k491L930j827o735
$$ plain form
13634 1551 3865 11300 11638 3193 -1320 -7532 -3149 -4269 -5292 5302 5267 -4422 -7586 -3393 -2603
13619 -2603 -8142 -6318 -2479 -2360 -1941 -3185 -4750 3164 9400 9501 6241 4377 8386 4416 7303
13604 7303 10445 6238 11250 13799 12728 4828 -984 -1723 -7052 -9811 -8613 -5577 1329 3436 6547
13589 6547 1237 -3546 -663 593 -7290 -10794 -14889 -15925 -9285 -6459 -2013 -131 3940 3650 4603
13574 4603 844 -8589 -11481 -12465 -13664 -9537 303 8882 4017 -6186 -7282 -6418 -12555 -12506 -6132
13559 -6132 -1164 5776 12369 18009 10481 -337 -2824 -6522 -6942 450 2735 594 -4028 -6320 -9392
13544 -9392 -4066 -447 -1591 -5651 -4251 -6767 -1827 3575 -3496 -14006 -13695 -10502 -5206 4450 4364
13529 4364 4135 6827 6546 8333 2690 3089 -1255 -6001 -1482 8128 6553 4062 7992 6165 -570
13514e70n366o628Q12N313J247K857m700K049K269L926L725J370M074m338K167
13499H207m893o725k32J1566K51r418N673k137r88L47L16K955k642Q26n927k395
13483e216J565l159L667O009J568k151n80L663L98O398l211m781l597O72N019
13468F264J402j004j766M855J48o459j616Pm05J319j692k066n753K713J64K953
13452i36J914n112l001j391m88j243p129N450O769O657R02j791j30J383j098L69
13436A125L623M259k441k330j42l571j455N225m543J568L494O277o102q445O05
13421b853K844k95J924k165L89O486n48O007L483l807L783L919k898k717m116
13406I436j600l911q635m077O144J4453M680k938P06k47m375N500o34r985p580
$$ plain form
13514 -570 -5936 -12564 -11752 -6439 -5192 -2335 -7035 -4986 -2717 1209 4934 6304 10378 6040 8207
13499 8207 3314 -3411 -3643 7923 8174 -1244 4429 2292 1304 1651 1967 4922 2280 3106 -2821 -5216
13483 -5216 -3651 -6810 -3143 2866 4434 2283 1703 5366 5764 12162 8951 4170 573 1245 6264
13468 6264 7666 6662 4896 9751 9899 3440 1824 1831 1426 2745 1053 -1013 -6766 -4053 -3889 -936
13452 -936 978 -4134 -7135 -8526 -9014 -10257 -17386 -11936 -5167 1490 2392 601 471 1854 756 1125
13436 1125 4748 9007 6566 4236 4094 523 -932 4293 -250 1318 4812 11089 4987 -3458 -2853
13421 -2853 -9 -304 1620 -545 -156 6330 5782 11789 15272 11465 15248 19167 16269 13552 9436
13406 9436 7836 3925 -4710 -8787 -2643 11810 16490 13552 14258 14011 9636 15136 14502 4517 -3063
13391c063O275J1858j455m623J499l368o259M952K594j265k788m018m981l695
13377h337O737P489m588k096P965k453n569j352o080n875O448J1731l802J138
13363A356J0123m123r627L57N605m783q222N671M0J580L739N312j083n704K429
13348B670L313M099p742L46L41r304l070O140K904r54J383L826k476M62j884j175
13332a121R34oN1Q887N54K857o755p739j215K297l762R020j221j626R34k352o64
13315i27P423N25q656m941l233p548J0677J2753P001r149m377l823J055j075Q34
13300c461k423J285L960L449k111k289n8n21n39M675L268n044J90K549j601j265
13284F4j82J041Q400o321p365n72k013M377r099n974J792P078l583J308N757M034
$$ plain form
13391 -3063 3212 15070 13615 8992 10491 7123 864 5816 8410 7145 4357 339 -4642 -8337
13377 -8337 -1600 5889 1301 -795 7170 4717 -852 -2204 -8284 -14159 -7711 4020 218 1356
13363 1356 11479 7356 -2271 -1914 3691 -1092 -9314 -3643 -3603 -2023 1716 7028 5945 241 2670
13348 2670 5983 10082 2340 2686 3027 -6277 -9347 -3207 -303 -1257 126 3952 1476 1938 54 -1121
13332 -1121 -187 -193 -142 8745 9299 12156 5401 -2338 -3553 -1256 -5018 4002 2781 1155 2089 -263 -927
13315 -927 6496 7021 -1635 -6576 -9809 -17357 -6680 6073 13074 3925 -452 -4275 -3220 -4295 -3461
13300 -3461 -5884 -4599 -639 2810 699 -1590 -1648 -2169 -2708 1967 5235 191 381 2930 1329 64
13284 64 -118 923 9323 3002 -4363 -4935 -6948 -2571 -11670 -17644 -15852 -8774 -12357 -11049 -5292 -1258
13268a258k50J295J390O225j13M92j577L825j478j794p389L408O054K648o14K387
13252A3251l434l455K074N096k404n434Q818K657p963o98J054R573K094r969p828
13237C432j598m173J188M36K09p51j366K37L644l0o747O23p76l38N487N682p37
13220D422j53K977K367l573q91L662J892k498K339n6M472m793j1478l390Q72J395
13204b434K226k881m122o86K113P327J0899p08k782n325j843L10M086K377r493
13189i36o634l682O111N214M771j748L71N07j26k404L772L512J192M000n50o790
13173F580j11M062M447j1376l223P81j462J615j34J43M557K574K010k072p890
13158E01k521M820P664l496j709n155M237j31o618J253J100O357M685k558l518
$$ plain form
13268 -1258 -1508 -213 1177 7402 7289 7781 6204 10029 8551 6757 -632 2776 8830 11478 10864 13251
13252 13251 9817 6362 8436 13532 11128 5694 14512 17169 9206 8508 9562 19135 21229 11260 3432
13237 3432 1834 -2339 -1151 -715 -506 -1257 -2623 -2386 1258 1228 -5519 -4896 -5672 -6010 -523 5159 4422
13220 4422 4269 7246 9613 6040 5149 8811 10703 8205 10544 10488 14960 10167 -1311 -4701 -3829 -2434
13204 -2434 -208 -3089 -7211 -7897 -5784 1543 12442 11734 8952 3627 1784 2094 6180 8557 -936
13189 -936 -7570 -11252 -5141 73 4844 3096 3467 3974 3848 1444 5216 8728 9920 13920 13370 6580
13173 6580 6469 10531 14978 3602 379 1160 -302 1313 1179 1322 5879 8453 10463 8391 501
13158 501 -2020 2800 10464 6968 5259 104 4341 4210 -2408 -1155 -55 6302 10987 8429 4911
13143D911m701N565M141O565m322j427J266l539j009K221j257q326m089M369K806
13128C174n243j572j071L699P276j187j851J719j758j0484n383k377L34N049O005
13113c670J234n848R140M473l344m742k083K412M831L204o981k247L024J311J54
13098H68N116M13q323q32M082j267K223L238J415j0471j085k994j293L369M216
13083a325J4848r100r11j7P302j974n954n694k994K8Q368O532J326J0559J2440
13068C3434O423N963K025n205j7342j1721j3481m149O705r16M480N628l895n227
13054B722n641l159j464mk768J374J0340k337k055M497K838k485L239m781p540
13039g224j903J008k563L271o75J483N581J242K309m79p079N029L154k319j371
$$ plain form
13143 4911 210 5775 9916 16481 12159 10732 11998 8459 7450 9671 8414 88 -4001 368 3174
13128 3174 -2069 -3641 -4712 -1013 6263 5076 3225 4944 3186 -7298 -12681 -15058 -14724 -9675 -3670
13113 -3670 -2436 -8284 856 5329 1985 -2757 -4840 -2428 2403 5607 -1374 -3621 -597 714 868
13098 868 5984 6397 -1926 -2758 1324 57 2280 5518 6933 -3538 -4623 -7617 -8910 -5541 -1325
13083 -1325 13523 4423 3512 3495 10797 8823 2869 -2825 -5819 -5791 2577 9109 10435 20994 33434
13068 33434 39857 45820 47845 42640 25298 13577 96 -4053 2652 1736 6216 11844 7949 2722
13054 2722 -2919 -6078 -7542 -7546 -10314 -8940 1400 -937 -2992 1505 4343 1858 5097 316 -7224
13039 -7224 -9127 -8119 -10682 -7411 -8086 -6603 -1022 220 2529 2050 -5029 0 3154 835 -536
13024e36o625m591N379J4099K533l357q008L401M068M549p70l956J930L682r52
13009A0846j107j301j2458J890K25o88J596J250j437n046P819N45n747k577N216
12994i74l456j509M548J479n454K053M269L268l442m922j179J804L654k442j069
12979c372N037k586m373q065K711J012Q27P492N636J066J315j0995p913O813q1
12964e476L69N386K017M3m773N717L24o99o689J863N816N184k019m687J041j528
12948A889q925n380k673J942K631N187m18l510K774J616N18J902k049l218K166
12933e548p39P679P597j52l266O021J454q942N86n738j583J534Qm462n006j866
12917a2423O125L511N792j164k537N254N166P282j938r651m183j761J354L616
$$ plain form
13024 -536 -7161 -11752 -6373 7726 10259 6902 -1106 2295 6363 10912 10142 6186 8116 11798 10846
13009 10846 9739 8438 -4020 -2130 -1905 -2593 -997 253 -1184 -6230 1589 2134 -3613 -6190 -974
12994 -974 -4430 -5939 -1391 88 -5366 -3313 956 4224 782 -4140 -5319 -3515 139 -2303 -3372
12979 -3372 1665 -921 -5294 -13359 -10648 -9636 -8809 -1317 4319 5385 6700 -4295 -12208 -5395 -5476
12964 -5476 -5107 279 2296 2339 -2434 3283 3607 2908 -3781 -1918 3898 9082 7063 2376 3417 1889
12948 1889 -7036 -12416 -15089 -13147 -10516 -5329 -5747 -9257 -6483 -4867 -4349 -2447 -4496 -7714 -5548
12933 -5548 -6287 1392 8989 8837 5571 11592 13046 4104 4690 -1048 -2631 -1097 -1089 -5551 -10557 -12423
12917 -12423 -6298 -2787 3005 1841 -696 4558 9724 17006 15068 5417 1234 -527 827 4443
12903D443L522o472Mk7n18M168m21J375n560o673J863P890M090p251o899n564
12887a2030l31j557O201K813m56O121K919j804k417m178m832j402M251O94K855
12872c153Q812K674m787K996L997L307O152J2462K3546M1298N7870K8738j5034
12859A68878l6074n1361l7125j9600j157m348j0185j0225o821O004O396j999m851
12846b468m019m777J0453O687K172j855n025n238j678P842L980n418N316k179
12832C793K214L002k255o95m839o610J75Q953Q968J589l086p924p757M452O978
12817F958n785n600J608J0183J0613m444n198r699J40q249j754k992j682R907
12803e994P465P659J452j204j2638p390J969K989J0648J483l179K225j878j821
$$ plain form
12903 4443 7965 1493 1497 1470 952 5120 4699 6074 514 -6159 -4296 3594 7684 433 -6466 -12030
12887 -12030 -12361 -13918 -7717 -4904 -5360 761 3680 1876 -541 -4719 -9551 -10953 -6702 -6008 -3153
12872 -3153 5659 8333 3546 6542 10539 13846 19998 32460 56006 97304 155174 183912 168878
12859 168878 132804 81443 44318 24718 23561 19213 9028 -1197 -8018 -2014 4382 2383 -2468
12846 -2468 -6487 -11264 -811 5876 8048 6193 1168 -4070 -5748 2094 6074 656 5972 3793
12832 3793 6007 9009 6754 6059 1220 -5390 -5215 3738 12706 14295 11209 3285 -4472 -20 6958
12817 6958 1173 -4427 -2819 7364 17977 13533 8335 -1364 -1224 -9473 -11227 -14219 -15901 -5994
12803 -5994 1471 9130 10582 9378 -3260 -10650 -8681 -5692 4956 6439 3260 5485 3607 1786
12789A786n522l69j761o77N440j06N208L672k884o83J565P95m8m634k069n948
12773f235J595K365k958M261j63M081k677j978j087k765j144J1857J347l200k163
12758A136l286l44k006l545N858M208L761n341J675K917n747m534L558j371k398
12743e459N429P24p680J707L008n6k399j004N663k230K403n149N6M347J876l286
12727b050q158M012L490k138j758K339l718P477N006L644j606O26j4373m177L265
12712h119k871l007l487K355K957L541K296P943K722l566M301L050J571j903l980
12697C803o093k987N282r96K007m023m151k573o90k443k077K025R23O534O098
12682F39j24K041J72J515J455n404L155J889n104q67l881Q731O202n199JM82M170
$$ plain form
12789 1786 -3736 -4105 -5866 -6543 -1103 -1209 3999 7671 4787 4104 5669 6464 6416 1782 -287 -6235
12773 -6235 -4640 -2275 -5233 -972 -1135 2946 269 -1709 -2796 -5561 -6705 5152 6499 3299 1136
12758 1136 -2150 -2494 -4500 -8045 -2187 2021 5782 441 2116 5033 -714 -5248 -1690 -3061 -5459
12743 -5459 -30 694 -6986 -5279 -2271 -2327 -4726 -5730 -67 -2297 106 -5043 -4987 -640 1236 -2050
12727 -2050 -10208 -6196 -2706 -4844 -6602 -4263 -7981 -504 4502 8146 6540 7166 -7207 -11384 -8119
12712 -8119 -10990 -13997 -17484 -15129 -12172 -8631 -6335 1608 4330 764 5065 8115 9686 7783 3803
12697 3803 -2290 -5277 5 -991 1016 -3007 -7158 -9731 -10421 -12864 -14941 -12916 -11993 -5459 639
12682 639 515 2556 2728 4243 5698 294 3449 5338 234 -633 -4514 4217 10419 5220 5221 5703 9873
12665I873J758r306p17k56r662o048N590L569n632k99o107N945M734j413k261
12650a0232l410O611K085K982q283m770j041L365j0007K030O609qP252O56J459
12635d702J637J884M991j508K39n325J130j373R617r93Q70j742n91P15m234l439
12619b824r854K461j383M382N250k671R332R77j311J805r282M213N643n58l771
12604B409k260n889J0576m190J587N835M055o233p675m40N622k580k271J70j658
12589b942n80K192K751j596j352k962l876N224N695K490l788m06k533K147O832
12574G296K432p449J025j071q25Q555K804j730k289n444n965k959N027j740o450
12559h783n814K156N533P524l757m694q398Q829J0742n730O916K140k228J792
$$ plain form
12665 9873 11631 2325 1608 1352 -8310 -14358 -8768 -5199 -10831 -11130 -17237 -11292 -6558 -7971 -10232
12650 -10232 -13642 -7031 -4946 -1964 -10247 -15017 -16058 -12693 -22700 -20670 -14061 -14069 -6817 -6161 -4702
12635 -4702 -3065 -1181 3810 2302 2541 -2784 -1654 -3027 6590 5597 6467 4725 4134 4849 615 -2824
12619 -2824 -12678 -10217 -11600 -7218 -1968 -4639 4693 5670 4359 6164 -3118 1095 6738 6180 2409
12604 2409 149 -5740 4836 646 2233 8068 12123 5890 -1785 -2225 3397 817 -1454 -1284 -2942
12589 -2942 -3522 -1330 1421 -175 -1527 -4489 -8365 -3141 2554 5044 1256 850 -1683 464 7296
12574 7296 9728 2279 3304 2233 1408 9963 12767 11037 8748 3304 -2661 -5620 -593 -2333 -8783
12559 -8783 -14597 -12441 -6908 616 -3141 -7835 -16233 -7404 3338 -2392 4524 6664 4436 6228
12545F228l89m348l111o641Q812O069M689l402k398J4627K531m779J224M599n199
12530A8512r033J765m532j197J133M76J733n230M43n538p163p637j666Q964J4312
12515E342J480l87m165l94k92j686N798L877j076o590r758r734j321N620O118
12500g168O289L503P0n313J820N74O205l954j285j785k430k478j521l026L349
12485g150L640j009o58n72l139K080j23K025L210N486j443m493l216N234K918
12470B790R22n044O86r611j304M225r63j140O650M476P259j0266l376M868R62
12455A134N52K781l512k48J420L855n782n398M362M728m483K306m91p999j322
12440h097K57m905m426K536Q597K030R28o88N266L362Q171J809n383k977J412
$$ plain form
12545 6228 5839 1491 -1620 -8261 551 6620 11309 7907 5509 20136 22667 17888 19112 23711 18512
12530 18512 9479 11244 6712 5515 6648 7124 8857 3627 4070 -1468 -8631 -16268 -17934 -8970 5342
12515 5342 6822 6435 2270 1876 1584 -102 5696 9573 8497 1907 -7851 -17585 -18906 -13286 -7168
12500 -7168 -879 2624 2694 -2619 -799 -225 5980 2026 741 -1044 -3474 -5952 -7473 -10499 -7150
12485 -7150 -3510 -4519 -5177 -5749 -8888 -6808 -6931 -4906 -1696 3790 2347 -2146 -5362 -128 2790
12470 2790 3712 -1332 -646 -10257 -11561 -7336 -8299 -9439 -2789 1687 8946 -1320 -4696 172 1134
12455 1134 1686 4467 955 707 2127 5982 200 -5198 -836 3892 -591 1715 1224 -6775 -8097
12440 -8097 -7840 -12745 -17171 -14635 -6038 -4008 -3080 -3768 1498 4860 13031 14840 9457 6480 7892
12425G892L057o512m786K751l395k224Q6p523k172L722M741K314j813J886k227
12410d203n254l74J165J0930J477n883K300O027K682r045j200l809k464K124L299
12395b228K287L108j483l644M552N499n447q918K503K037p275j476K541N986P90
12380a168m401n298K74J423k233N519K803j0393n436L026P414k252O05K599J917
12365e601L485J649m480O261j832j1349n89L760J1320L042n321m277p112q875
12351a9919o363N311N955k185J35J770P297r202l605J2199L252K162L232N641
12337E680j807m237n371P0l456M106N241o375K397N226l852m489m30P378M738
12322D819N32j143M51m956l418O238l980K46m900p62R062m699o024K213j135o658
$$ plain form
12425 7892 10949 4437 -349 2402 -993 -3217 -3131 -10654 -12826 -9104 -4363 -2049 -3862 -1976 -4203
12410 -4203 -9457 -9831 -8666 2264 3741 -2142 158 6185 8867 -178 -1378 -5187 -7651 -5527 -2228
12395 -2228 59 3167 1684 -1960 2592 8091 2644 -6274 -3771 -1734 -9009 -10485 -7944 -1958 -1168
12380 -1168 -5569 -10867 -10593 -9170 -11403 -5884 -3081 -13474 -18910 -15884 -8470 -10722 -10117 -7518 -5601
12365 -5601 -2116 -467 -4947 1314 -518 -11867 -12456 -8696 2624 5666 345 -3932 -11044 -19919
12351 -19919 -26282 -20971 -15016 -17201 -17066 -15296 -7999 -17201 -20806 -8607 -5355 -3193 39 5680
12337 5680 3873 -364 -5735 -5665 -9121 -5015 226 -6149 -3752 1474 -2378 -6867 -7297 81 4819
12322 4819 5351 4208 4659 -297 -3715 2523 -1457 -1211 -6111 -6873 2189 -2510 -8534 -6321 -7456 -14114
12306a4114J472K485L609O011J595n350M52R132Q42j33J944p130M342L015r961
12291a789j438k595k301J636J712M959L664M54k9j085K715M255l125N126n75m555
12275G029m866p617R33K029L88m684L194L965m401j325N56L53M930j050j868l114
12259e548j685n179M419N127P663J425r558k237L057K908n62l122j90J2891N647
12244A5056n729O93K274k075m784j566m131K093J347p598m31k86O734M034J306
12229F937r270p916M176O285m555j389j65j109r42m138N990K389o533K769M303
12214c168K929l907J450j700Q334k233j229j905K274R59K661j710r79q71k498
12199a593K344O335P168J609k082j484L519r676p349q279M856L395J544M328o772
$$ plain form
12306 -14114 -12642 -10157 -6548 -537 1058 -4292 -3840 5292 6134 6001 7945 815 5157 8172 -1789
12291 -1789 -3227 -5822 -8123 -6487 -4775 184 3848 4302 4273 3188 5903 10158 7033 12159 11584 7029
12275 7029 2163 -5454 -4521 -2492 -2104 -6788 -3594 371 -4030 -5355 -4799 -4446 484 -566 -2434 -5548
12259 -5548 -7233 -12412 -7993 -2866 4797 6222 -3336 -5573 -2516 392 -170 -3292 -3482 9409 15056
12244 15056 9327 10020 12294 10219 5435 3869 -262 1831 3178 -4420 -4851 -5137 1597 5631 6937
12229 6937 -2333 -10249 -6073 212 -4343 -5732 -5897 -7006 -7948 -12086 -6096 -3707 -10240 -7471 -3168
12214 -3168 -239 -4146 -2696 -4396 3938 1705 476 -1429 845 1804 4465 2755 1776 905 -1593
12199 -1593 751 7086 14254 15863 13781 12297 15816 6140 -1209 -9488 -4632 -1237 307 4635 -2137
12184b137q723L084L1l873o624M983P732J943L122M583P47M25J5451K365j6518
12169F591j0882l040R89l097J279M926L566j773p752M654N948L552j524n922j92
12154b677k882m564l93R431N673m92l627P81K287n232j751J863l924o401l782
12139a5690L896J353m258M346K344N37J868J560O16O059k356j80p077m051M572
12124f461M049l04J772N529m307M20M346K807n034J888k574q479O62j183o525
12109a3394Q490Q775M238j872m118k297L408n4j0757q351P616O394P055l856K613
12094C890K052K206r63n377m369Q450M426L233o235p736L25l470k731j225L610
12079c914Q039M405m246l232J178K755k071o112N874O06K593L070j470j143k96
$$ plain form
12184 -2137 -10860 -7776 -7745 -11618 -18242 -13259 -5527 -3584 -462 4121 4868 5293 20744 23109 6591
12169 6591 -4291 -7331 -6342 -9439 -8160 -3234 332 -1441 -9193 -4539 1409 4961 3437 -2485 -2677
12154 -2677 -5559 -10123 -10516 -1085 4588 4096 469 1250 3537 -1695 -3446 -1583 -5507 -11908 -15690
12139 -15690 -11794 -10441 -14699 -10353 -8009 -7472 -5604 -4044 -3428 2631 275 95 -6982 -11033 -6461
12124 -6461 -2412 -2716 -944 4585 278 698 5044 7851 2817 4705 2131 -6348 -5686 -6869 -13394
12109 -13394 -4904 3871 8109 6237 2119 -178 3230 3176 -7581 -15932 -8316 -1922 5133 1277 3890
12094 3890 5942 8148 7185 1808 -2561 5889 10315 13548 7313 -423 -98 -3568 -6299 -7524 -3914
12079 -3914 4125 8530 4284 1052 2230 4985 2914 -3198 2676 3282 5875 8945 7475 6332 6036
12064F036O946J464j880o538r48k515j434n602K057K30K980O72q38j744P88P152
12048F826m390n348R776N686M993J727m703k177L08J128k162n976L589m34n241
12033C602j755m117k166J676L231J502k553O17K137k389k886j940m414N028L214
12018a213N324m853r72N662n557K383L047n26k304J979P703J221m722k013k283
12003B876K47p146J945j595L524J1050o473p772j062k4L735O566r129o065R854
11988E31O273K920l362o780M361r27P78R805M53J933m973o866O92j213Q02j437
11972B990k441K368K123J857p550m251J622k781l11J4l510M2O129J54k349O282
11956C88O45L297K37l134q14K326K719p79k480n400J865j865L640j869L01M802
$$ plain form
12064 6036 12982 14446 12566 6028 5080 2565 1131 -4471 -2414 -2184 796 1468 630 -1114 -326 6826
12048 6826 2436 -2912 6864 12550 17543 19270 14567 12390 12698 13826 11664 5688 9277 8843 3602
12033 3602 1847 -2270 -4436 -2760 471 1973 -580 37 2174 -215 -3101 -5041 -9455 -4427 -1213
12018 -1213 4111 -742 -1714 3948 -1609 774 3821 3295 991 2970 10673 11894 7172 5159 2876
12003 2876 3123 -4023 -2078 -3673 -149 10901 4428 -3344 -4406 -4430 -695 5871 -3258 -9323 531
11988 531 6804 9724 6362 -418 3943 3016 3794 13599 14052 15985 11012 4146 4838 3625 4427 2990
11972 2990 549 2917 5040 6897 -653 -4904 -3282 -6063 -6374 -6360 -9870 -9828 -3699 -3545 -5894 388
11956 388 1033 4330 4567 1433 619 2945 5664 4885 2405 -2995 -1130 -2995 645 -1224 -923 3879
11940C879j601K194K248m872k481k144Q089l000q142J418J703L127l427k447N298
11925a58O025m947m688L129l550K577J575J402r990j227K678K896K51k345o221
11910a2593j93P090N465N467L126K401q071m025q108J351R18j796L679P772J891
11895D374m037K395P816Q2o845r246K493k282k13L589l170o47l084L780m81j245
11879f721j445m969k310L29K346P75N906J038m81J842L511m483k535K062N209
11864G4k511M769J494o02k81p6l303k309j245O452P434n469l146L529l559l107
11848a856J0171L408K998O363k722l647j2572m650Q58O05k111J799O324L140L876
$$ plain form
11940 3879 2278 4472 6720 1848 -633 -2777 5312 2312 -5830 -4412 -2709 418 -3009 -5456 -158
11925 -158 5867 920 -3768 -639 -4189 -1612 -37 1365 -8625 -9852 -7174 -4278 -4027 -6372 -12593
11910 -12593 -12786 -5696 -231 5236 8362 10763 2692 -1333 -9441 -8090 -7172 -8968 -5289 2483 4374
11895 4374 337 2732 10548 10630 3785 -5461 -2968 -5250 -5463 -1874 -5044 -5691 -8775 -4995 -5476 -6721
11879 -6721 -8166 -13135 -15445 -15116 -12770 -11995 -6089 -5051 -5532 -3690 -179 -4662 -7197 -5135 74
11864 74 -2437 2332 3826 3224 2943 2867 -436 -2745 -3990 2462 9896 4427 1281 4810 1251 -1856
11848 -1856 8315 11723 14721 21084 18362 14715 2143 -2507 -1649 -1044 -3155 -1356 4968 8108 11984
$$ [...]
##END NTUPLES=NMR SPECTRUM
##END=
