##TITLE=Analysis number 317814
Compound Code sew 04659
Project Code adrs
Chemist Name scafell
##JCAMPDX= 6.0         $$ Bruker NMR JCAMP-DX V2.0
##DATA TYPE= NMR SPECTRUM
##DATA CLASS= NTUPLES
##ORIGIN= Bruker BioSpin GmbH
##OWNER= nmr
$$ XWIN-NMR		Version 3.5
$$ Mon Mar  6 12:11:05 2006 GMT Standard Time (UT+0h)  MAYBRIDGE\nmr@NMR_250MHZ
##.OBSERVE FREQUENCY= 250.131544655141
##.OBSERVE NUCLEUS= ^1H
##.ACQUISITION MODE= SIMULTANEOUS (DQD)
##.ACQUISITION SCHEME= undefined
##.AVERAGES= 16
##.DIGITISER RES= 18
##SPECTROMETER/DATA SYSTEM= dpx250
##.PULSE SEQUENCE= zg30
##.SOLVENT NAME= CDCl3
##.SHIFT REFERENCE= (INTERNAL, CDCl3, 0, 16.4358)
##AUDIT TRAIL= $$ (NUMBER, WHEN, WHO, WHERE, WHAT)
$$ ##TITLE= Audit trail, XWIN-NMR		Version 3.5
$$ ##JCAMPDX= 5.01
$$ ##ORIGIN= Bruker BioSpin GmbH
$$ ##OWNER= nmr
$$ C:\u/data/dgb/nmr/ADRS/60/pdata/1/auditp.txt
$$ ##AUDIT TRAIL=  $$ (NUMBER, WHEN, WHO, WHERE, WHAT)
(   1,<2006-03-06 12:10:20.06 +000>,<MAYBRIDGE\nmr>,<NMR_250MHZ>,
      <created by zg, POWCHK disabled, PULCHK disabled
       configuration hash MD5:
       84 BC 41 DB A1 6E 1D 46 DA 25 12 A5 C1 ED C5 3A
       data hash MD5: 64K
       F0 2C C3 6D 41 ED 24 D6 6D 1A AE 82 56 9F EB 19>)
(   2,<2006-03-06 12:10:44.84 +000>,<MAYBRIDGE\nmr>,<NMR_250MHZ>,
      <Start of raw data processing
       ef LB = 0.3 FT_mod = 6 PKNL = 1 SI = 32K 
       data hash MD5: 32K
       21 02 4A 8E A4 C1 62 AA 70 2D C8 AB 13 0A 82 57>)
(   3,<2006-03-06 12:10:50.30 +000>,<MAYBRIDGE\nmr>,<NMR_250MHZ>,
      <apk 
       data hash MD5: 32K
       90 AC 5A 83 48 A3 90 CF D6 9E 0F 4B BF 41 D4 FA>)
(   4,<2006-03-06 12:10:51.48 +000>,<MAYBRIDGE\nmr>,<NMR_250MHZ>,
      <abs ABSG = 5 
       data hash MD5: 32K
       F9 DE 4D 0E C2 2B AE D2 C4 59 4E 9F 99 7D 52 BF>)
$$ ##END=
$$ 
$$ hash MD5
$$ C1 C6 61 4E 50 A0 AE 90 5F F1 96 89 FC 1E A3 26
##$RELAX= 
##$RELAX= 
##$RELAX= 
##$RELAX= 
##$RELAX= 
##$RELAX= 
##$RELAX= 
$$ Bruker specific parameters
$$ --------------------------
##$DU= <C:\u>
##$EXPNO= 60
##$NAME= <ADRS>
##$PROCNO= 1
##$TYPE= <nmr>
##$USER= <dgb>
##$AMP= (0..31)
100 100 100 100 100 100 100 100 100 100 100 100 100 100 100 100 100 100 
100 100 100 100 100 100 100 100 100 100 100 100 100 100 
##$AQSEQ= 0
##$AQ_mod= 3
##$AUNM= <au_zg>
##$AUTOPOS= <24 >
##$BF1= 250.13
##$BF2= 250.13
##$BF3= 250.13
##$BF4= 250.13
##$BF5= 500.13
##$BF6= 500.13
##$BF7= 500.13
##$BF8= 500.13
##$BYTORDA= 1
##$CFDGTYP= 0
##$CFRGTYP= 5
##$CHEMSTR= <none>
##$CNST= (0..31)
1 1 145 1 1 1 1 1 1 1 1 1 1 1 1 1 1 1 1 1 1 1 1 1 1 1 1 1 1 1 1 1 
##$CPDPRG= <>
##$CPDPRG1= <>
##$CPDPRG2= <>
##$CPDPRG3= <>
##$CPDPRG4= <mlev>
##$CPDPRG5= <mlev>
##$CPDPRG6= <mlev>
##$CPDPRG7= <mlev>
##$CPDPRG8= <mlev>
##$CPDPRGB= <>
##$CPDPRGT= <>
##$D= (0..31)
0 1 0 0 0 0 0 0 0 0.06 0 0 0 0 0 0 0.0002 0 0 0 0 0 0 0 0 0 0 0 0 0 0 
0 
##$DATE= 1141647018
##$DBL= (0..7)
120 120 120 120 120 120 120 120 
##$DBP= (0..7)
150 150 150 150 150 150 150 150 
##$DBP07= 0
##$DBPNAM0= <>
##$DBPNAM1= <>
##$DBPNAM2= <>
$$ [...]
##$SUBNAM7= <"">
##$SUBNAM8= <"">
##$SUBNAM9= <"">
##$SW= 20.6930455092707
##$SWIBOX= (0..15)
0 0 3 0 0 0 0 0 0 0 0 0 0 0 0 0 
##$SW_h= 5175.983436853
##$TD= 65536
##$TD0= 1
##$TE= 293.16
##$TE2= 300
##$TE3= 300
##$TEG= 300
##$TL= (0..7)
0 120 120 120 120 120 120 120 
##$TP= (0..7)
150 150 150 150 150 150 150 150 
##$TP07= 0
##$TPNAME0= <>
##$TPNAME1= <>
##$TPNAME2= <>
##$TPNAME3= <>
##$TPNAME4= <>
##$TPNAME5= <>
##$TPNAME6= <>
##$TPNAME7= <>
##$TPOAL= (0..7)
0.5 0.5 0.5 0.5 0.5 0.5 0.5 0.5 
##$TPOFFS= (0..7)
0 0 0 0 0 0 0 0 
##$TUNHIN= 0
##$TUNHOUT= 0
##$TUNXOUT= 0
##$USERA1= <user>
##$USERA2= <user>
##$USERA3= <user>
##$USERA4= <user>
##$USERA5= <user>
##$V9= 5
##$VALIST= <valist>
##$VCLIST= <CCCCCCCCCCCCCCC>
##$VD= 0
##$VDLIST= <DDDDDDDDDDDDDDD>
##$VPLIST= <PPPPPPPPPPPPPPP>
##$VTLIST= <TTTTTTTTTTTTTTT>
##$WBST= 1024
##$WBSW= 4
##$XGAIN= (0..3)
0 0 0 0 
##$XL= 0
##$YL= 0
##$YMAX_a= 536521
##$YMIN_a= -559457
##$ZGOPTNS= <>
##$ZL1= 120
##$ZL2= 120
##$ZL3= 120
##$ZL4= 120
##$ABSF1= 16.4358
##$ABSF2= -4.257372
##$ABSG= 5
##$ABSL= 3
##$ALPHA= 0
##$AQORDER= 0
##$ASSFAC= 0
##$ASSFACI= 0
##$ASSFACX= 0
##$ASSWID= 0
##$AUNMP= <proc_1d>
##$AZFE= 0.1
##$AZFW= 0.1
##$BCFW= 0
##$BC_mod= 0
##$BYTORDP= 0
##$COROFFS= 0
##$CY= 12.5
##$DATMOD= 1
##$DC= 0
##$DFILT= <>
##$DTYPP= 0
##$F1P= 14.0000005364418
##$F2P= -0.99999901652339
##$FCOR= 0.5
##$FTSIZE= 32768
##$FT_mod= 6
##$GAMMA= 0
##$GB= 0
##$INTBC= 1
##$INTSCL= 1
##$ISEN= 128
##$LB= 0.3
##$LEV0= 0
##$LPBIN= 0
##$MAXI= 10000
##$MC2= 0
##$MEAN= 0
##$ME_mod= 0
##$MI= 0
##$NCOEF= 0
##$NC_proc= -2
##$NLEV= 6
##$NOISF1= 0
##$NOISF2= 0
##$NSP= 0
##$NTH_PI= 0
##$NZP= 0
##$OFFSET= 16.4358
##$PC= 1
##$PHC0= 244.3873
##$PHC1= 6.905744
##$PH_mod= 1
##$PKNL= yes
##$PPARMOD= 0
##$PSCAL= 4
##$PSIGN= 0
##$REVERSE= no
##$SF= 250.130021560448
##$SI= 32768
##$SIGF1= 0
##$SIGF2= 0
##$SINO= 400
##$SIOLD= 32768
##$SREGLST= <1H.CDCl3>
##$SSB= 0
##$STSI= 32768
##$STSR= 0
##$SW_p= 5175.98343685301
##$SYMM= 0
##$S_DEV= 0
##$TDeff= 65536
##$TDoff= 0
##$TI= <Analysis number 999999
Compound Code 99
Book Reference 9
Project Code 9>
##$TILT= no
##$TM1= 0
##$TM2= 0
##$TOPLEV= 0
##$USERP1= <user>
##$USERP2= <user>
##$USERP3= <user>
##$USERP4= <user>
##$USERP5= <user>
##$WDW= 1
##$XDIM= 32768
##$YMAX_p= 296615473
##$YMIN_p= -192646
$$ End of Bruker specific parameters
$$ ---------------------------------
##NTUPLES= NMR SPECTRUM
##VAR_NAME=  FREQUENCY,     SPECTRUM/REAL,   SPECTRUM/IMAG
##SYMBOL=    X,             R,               I
##VAR_TYPE=  INDEPENDENT,   DEPENDENT,       DEPENDENT
##VAR_FORM=  AFFN,          ASDF,            ASDF
##VAR_DIM=   32768,         32768,           32768
##UNITS=     HZ,            ARBITRARY UNITS, ARBITRARY UNITS
##FACTOR=    0.157963299565203, 1,           1
##FIRST=     4111.08714652707, 0,            0
##LAST=      -1064.89629032594, 0,           0
##MIN=       -1064.89629032594, -192646,     0
##MAX=       4111.08714652707, 296615473,    0
$$ Real data points
##PAGE= N=1
##DATA TABLE= (X++(R..R)), XYDATA
$$ [...]
19816c45k822J459J158M529L371j979k131j04m584l292p759O481J2100k59q017
19801b194o145q31n237j376N554L50n226P322R441J927J140q5O067L13n836n860
19785f76k893M60K139j294J898n917O18n77l677J453N160J388K258M294k429l801
19769a596k353K110n822j629J5839J558p293p659k972M480L288L932K769M563
19755I215n964j2772j375m97j117M810J199J663J900K356k41L351L769m062J347
19740C582Q379o450j1660l849K028L956L422L327k54o998L220K163k578L824N612
19725G724L154j0038p47J884K627M676k939m426l055n683j202n86k086l525J826
19710a2396Q352N253j678KJ099j893k827j784N211M846o430n991l894Q60O350
$$ y = [-345, -3167, -1708, -550, 3979, 7350, 5371, 3240, 3136, -1448, -4740, -12499, -6018, 6082, 5823, -2194, -8339, -9170, -14407, -15783, -10229, -9879, -15105, -7783, 1658, 3585, 4725, 4640, 10707, 11020, 5184, -676, -3569, -3109, -970, -2264, -366, -6283, -5665, -6242, -9919, -8466, -3306, -1918, 340, 4634, 2205, -1596, -3949, -1839, -7661, -9290, 6549, 8107, 814, -6845, -9817, -5337, -2049, 1883, 4652, 9215, 3251, -9521, -10896, -11393, -12510, -7700, -6501, -4838, -2938, -582, -823, 2528, 6297, 2235, 3582, 11961, 5511, -6149, -9998, -7970, -4014, -592, 2735, 2481, -4517, -1297, 866, -1712, 2112, 7724, 10878, 840, 93, 1977, 4604, 9280, 6341, 1915, -1140, -6823, -8025, -8611, -10697, -14222, -12396, -4044, 1209, -469, -467, 632, -1261, -4088, -5872, -661, 4185, -2245, -8236, -12130, -11270, -4920]
19695d920j410l651O575k641K788N225R6L127R85m08M92j418P64q235k64P70l006
19678e131J011K762L99k907j636k115J365J0079M205m53K092J257M292R70o545
19663I645k347n599L99j661n31O819N46n132l462k081l803O938M01K651N225N937
19647A3945R8o993n955n899q79O404M207j270k442J461M87J266j088l067J129
19632A404J417j054j05o07r467q867J231R846L287j257l568j496P71J904J925
19617d636K513k97J102N94l48M4L381p91j178k684L259L695o513n445m053M215
19601g142O804j8J481J049o570J395Q585J401n472q343k911k166K382m097p108
19586b0730k08Q535N069J752M526N625J933j953m102j704J392n93P11J058j320
$$ y = [-4920, -6330, -9981, -3406, -6047, -3259, 1966, 2062, 5189, 6174, 5766, 6258, 4840, 5604, -2631, -2895, -2125, -5131, -4120, -1358, -959, -3866, -5502, -7617, -6252, 3827, 8032, 7579, 9671, 10928, 15220, 16190, 9645, 7298, 1699, 2098, 437, -94, 6725, 7271, 2139, -1323, -3404, -7207, -269, 132, 2783, 8008, 13945, 14043, 7050, 1095, -4804, -5683, 721, 4928, 3658, 1216, 2677, 3164, 4430, 3342, 275, 1404, 2821, 1767, 1662, 1055, -8412, -17279, -16048, -6202, -2915, -4172, -7740, -9236, -8465, -6561, -4636, -2123, -2420, -1318, -724, -1072, -1028, 2353, 1562, 384, -2300, 959, 4654, -1859, -7304, -11357, -7142, -338, -356, 1125, 2174, -4396, -3001, 5584, 6985, 1513, -6830, -9741, -11907, -9525, -13622, -20730, -20938, -12403, -7334, -5582, -1056, 4569, 6502, 4549, 447, -1257, 135, -458, 253, 1311, -9]
19571ikL60M422p62m269k236N242J423j994J846R72J500o24m193l401l879n454
19554a1058o12M340R99r571j568J0408O400L387m551n438J749Q590L433q954J18
19539b328p54N897j804n906n719j711K869L830k49L612Jk748M547P74J197J359
19523B867o776J936o16j714p313k295O744N098r03k878r63O382K347j889j303
19508a276L440r52P72r53n380K147J2122P321p007j588q120n196L32J0878O261
19493A2801r330K82P46p802k834O28P878Q51K93O795k654n567l976M348M622p13
19477F368j718j340K164M065p825k677L251J370k811k560k407J051p28O89m745
19462g853L402J669j030o859o442K984N551M903N412l937J830K106n927k787O024
$$ y = [-9, -11, 349, 4771, 4009, -260, -2496, 2746, 4169, 2175, 4021, 4993, 6493, 5869, 1676, -1725, -5604, -11058, -11670, -7330, -6331, -15902, -17470, -7062, -662, 2725, -1826, -7264, -5515, 3075, 6508, -2446, -2328, -3082, 2815, 1011, -4895, -10614, -12325, -9456, -5626, -5875, -2263, -2262, -5010, -463, 311, 1508, 2867, -3909, -1973, -2589, -4303, -11616, -13911, -7167, -2069, -2972, -5850, -6813, -431, 1916, 27, -1276, 2164, 1212, 1984, 1031, -4349, -2202, 9920, 17241, 10234, 8646, 526, -4670, -4338, 6540, 12801, 3471, 3753, 4499, -3303, -6137, -5509, 2369, 3220, 3513, 10308, 7654, 2087, -1889, 2459, 7081, 6368, 4650, 3310, 5474, 9539, 1714, -963, 2288, 3658, 847, -1713, -4120, -3069, -3797, -3108, -7853, -4451, -2782, -3812, -10671, -17113, -14129, -8578, -3675, 1737, -2200, -370, 1736, -4191, -6978, -954]
19447i54J594l628N088J882J387k359p449O783N713P09O715j461j0441o445k927
19432e793j563n480L054j585L610j643p76K058M877O106j85r208l8k998J725M513
19416c326j917p380k220M337J1112J051M329n784n111j681r286N146M030J413
19402e287K524k995j545P810l042l904k34K890M682K625l0O21M184o149n679j796
19386e325l835p26L974M077r44R064l226j453P045O553l244j411K688j1884o138
19371d785k113k815Q38N814R178M639k442K110o542p643j565M398n41n332Q292
19356A491K639n438p288m048N36O270J17J862L496L306J123k212k176N840K6k641
19340B903o193j393J955p066r74J422N470n897k957r27K0L495N360l94P577P434
$$ y = [-954, 640, -2988, 2100, 3982, 5369, 3010, -4439, 2344, 8057, 8766, 15481, 14020, 3579, -2866, -5793, -7356, -12836, -9782, -11367, -7757, -9400, -10176, -8118, -3241, 2865, 2680, -6528, -6566, -9564, -7839, -3326, -5243, -12623, -14843, -10506, 606, 1657, 5986, 202, -4909, -6590, -15876, -10730, -6700, -5287, -2763, -5758, -7303, 507, -2535, -6439, -6673, -3783, 899, 3524, 3494, 4115, 8299, 2150, -3529, -5325, -9160, -9886, -5912, -1835, -2779, 6285, 3059, 1606, 8651, 15204, 11960, 10549, 13237, 1353, -4785, -6898, -9713, -8875, -3061, 6117, 10756, 8314, 10424, 3882, -3761, -5326, -928, -1469, -6801, 1491, 4130, -1308, -8596, -12644, -12108, -5838, -5721, -3859, -363, 2943, 4066, 1854, -322, 5518, 5544, 2903, -3290, -4683, -2728, -9794, -10768, -9346, -3876, -9773, -12730, -13657, -13637, -10142, -4782, -5176, 2401, 9835]
19324I835n081m191o08m507R19K407q064k189N842l720P09j85N108K830O715L418
19308I238q438l31n600p617n626J0986N551m489p75L032K106p67O73M202P96m171
19292a230J544M521n609K79k653K551m40r47O270J108m72j294q40L57m112j679
19276b646M556l334p133q78Q251m836k725j171N622k533j799R805Q37r092l204
19261a0280P224l376n660J446Q482Q445J059m206J582R57q079M488N597j826j3969
19246h116O52K614M559Q05l560j637k175k529M121P66k579K987J164l540o892
19231a3360p267O20N046O546r3J0365K834k312K390l010l180J983O809l141n636
19216a406m578M567L179l641J552Q623k926j0265n043q88N008l397k101m1r03
$$ y = [9835, 4754, 563, -45, -4552, -3633, -1226, -9290, -11479, -5637, -9357, -8648, -8833, -3725, -895, 5820, 9238, 800, 469, -5131, -12748, -18374, -7388, -1837, -6326, -7101, -4069, -1963, -2730, -2057, 2145, 2941, -1230, 314, 4835, -774, -495, -3148, -597, -1037, -1984, 4286, 5394, 4922, 3628, 2788, 3145, -967, -2646, 1910, -1424, -8557, -9435, -1184, -6020, -8745, -9916, -4294, -6827, -8626, 1179, 2016, -7076, -10280, -3056, -6432, -12092, -10646, -2164, 6281, 7340, 3134, 4716, 5673, -2406, 2082, 7679, 5853, -8116, -7464, -4850, -291, 514, -3046, -4683, -6858, -9387, -5266, -4500, -7079, -4092, -2928, -6468, -13360, -20627, -20007, -14961, -8415, -8508, 1857, 4691, 2379, 4769, 1759, -1421, 562, 7371, 4230, -1406, -5984, -1417, 1762, -1879, -327, 8296, 5370, -4895, -9938, -10826, -5818, -9215, -11316, -11357, -12260]
19201a2260L642N686L992l184N229K697K184J052k174q068k42K859m476m953j985
19186a0001K997K610m830o625N323O944O21n450k146J642n381K57N110j200L514
19171f615P069j146L48l056n620l63J619M435L661K858q105j211L972J134P259
19156F239P511n19m126n893p316L457N437q16j271m12l980L47k873K168Q88n755
19140f914K648M675K356L444O95j055o794o760n52L305j351j971q20O322P013
19125D241j991o246Q188M408l808j512o089j927K1N976j032o479j24N975N507
19110E108k469K578L263L301o490o40M617l91q035n427k148P747K229o410k569
19095e736k451L861N893N428R64k885n18K357m252M384K171M813l027k184l503
$$ y = [-12260, -8618, -2932, 1060, -2124, 3105, 5802, 7986, 9038, 6864, -1204, -1446, 1413, -3063, -8016, -10001, -7004, -4394, -9224, -15849, -10526, -3582, -2961, -8411, -10557, -8915, -14296, -14039, -8929, -10129, -6615, 454, -692, -344, -3400, -9020, -9383, -7764, -3329, 332, 3190, -4915, -6126, -2154, -1020, 6239, 13750, 13231, 9105, 3212, -4104, -647, 4790, 3974, 2703, 2291, -1689, -1342, -4215, -2047, -1159, -6914, -4266, 409, 2765, 6209, 6904, 5849, -945, -7705, -8257, -4952, -6303, -8274, -9094, -2772, 4241, 2250, -3996, 4192, 8600, 4792, 3280, -2809, -4736, -4715, 1261, 229, -6250, -6374, -399, 5108, 2639, 5217, 8480, 11781, 5291, 4651, 9268, 8877, 842, -4585, -6733, 1014, 3243, -3167, -5736, -8187, -4326, 1567, 6995, 7959, 5074, 4556, 6913, 2661, 7045, 9216, 14029, 11002, 8818, 5315]
19080E315o64q19p067p13k685K244N862m219l304n90N275O163n64Lk69j439k846
19063c17l108k304m264L800P674P201p555j0669O772M464m490j534M067K322J362
19048C421Q503m034K798M60J046o633q019K421J348M047J366j773r98p514k018
19033e579K599L1L438J384n699o180N867j889j962P937N289j31P22L079L079j60
19017A1825k703N153N384k160K582r7p734n670r92m881n974m036j105R371M109
19002C072l743N903O297K976k034o894n953M584L125R56K589K507J147L619N655
18987B3806J3064J4598K699r725j4960o055K425L180M924k076m662P526L595L235
18973D1574J4014L506n170m237k376q407o329o903l758J905l789J366l664N553
$$ y = [5315, 4651, 3832, -3235, -3948, -6633, -4389, 1473, -2746, -6050, -6640, -1365, 4798, 4234, 4237, 3968, 2529, -317, -3425, -5729, -9993, -6193, 1481, 8682, 1127, -9542, -2770, 1694, -2796, -4330, -263, 2059, 3421, 11924, 7890, 10688, 11148, 12194, 5561, -2458, -37, 1311, 5358, 6724, 4951, 3953, -3561, -5579, -2980, -2949, 489, 1873, -3826, -10006, -4139, -6028, -7990, -53, 5236, 5105, 5827, 8906, 11985, 11825, 9122, 14275, 19659, 17499, 20081, 19984, 12250, 6580, 5588, 707, -5267, -9303, -10408, -1037, 3072, -671, 5232, 11529, 14505, 12471, 5577, -376, 4208, 7333, 8289, 10878, 13385, 14532, 18151, 23806, 36870, 51468, 54167, 44442, 29482, 23427, 25852, 29032, 33956, 31880, 27218, 34744, 38339, 41574, 55588, 59094, 53924, 49687, 47311, 38904, 32575, 25672, 21914, 23819, 20030, 21396, 17732, 23285]
18959B3285O482m604p895m771q30m36k900P27J0121K016n550m539j581M385Q191
18944B2101K681K242r31o98j539m762o32j313P731J5086J2846N165n711o601l576
18929D2089N57L681o978J101p662n676p51k300J1044J5430J2201l819j0621j1551
18915C6745j5545j2127p074M997M803R10L905l092K015K146J250n204r15n176
18901G638J171L51Q52Q438K55m237n785l172K729N803K015J218k810n043o71k250
18885F502j69n423o760L963L232M762l308J351L885m197j143N768n125k728M915
18870E525p17l381R50K187k325J873L113P08N487l418n991q146n66L48K265K526
18854D38l531n377L464O175k5j350L995j694M763K851m657m853N289J064j0794
$$ y = [23285, 29767, 25163, 17268, 12497, 11667, 11231, 8331, 9058, 19179, 21195, 15645, 11106, 9525, 13910, 22101, 24782, 27024, 26093, 25395, 23856, 19094, 18462, 17149, 24880, 39966, 52812, 57977, 52266, 45665, 42089, 42646, 46327, 39349, 40450, 32788, 27112, 26361, 24061, 35105, 50535, 62736, 58917, 48296, 36745, 21200, 9073, 1999, 6996, 11799, 12709, 16614, 13522, 15537, 17683, 18933, 13729, 12814, 7638, 8809, 9160, 10012, 18450, 18705, 14468, 8683, 5511, 8240, 14043, 16058, 17276, 14466, 9423, 8752, 6502, 6333, 910, -5850, -1887, 1345, 6107, 2799, 4150, 8035, 3838, 2695, 8463, 3338, 610, 5525, 4808, 1427, 2377, 4564, 2239, 4112, 7225, 7933, 13420, 10002, 4011, -4135, -4701, -4353, -2088, 438, -3093, -8470, -5006, 1169, 1144, -206, 3789, 2095, 6858, 9709, 5052, 199, 5488, 6552, -4242]
18839d242k712j269J799J733j772j000O272J0677J178n714k267o65L547N036j6
18824A0585n982J950N020j547m800l131J158n076j875l994L518M578N474j966
18810C912R85N297J886l717q843N298L082l763r10N625N701j273J812m114m355
18795F623K119N365J543k570j106m591m121J76O24m061j64j421L490L623K154
18780G683o41j48n3O042J75o967m776K042O388o89j848K293J0132K898Q379J6973
18764D7883L1667K1202N381J1635p444j6871j6638j5683j033k585o019j425j176
18751D8894N39J0490L740M791J3753J2097k775j4441j3182j7419j2249p67O443
18738C9914Q00M510j603N11l112p941p663N734r35l923n79P438N689Q306N124
$$ y = [-4242, -6954, -8223, -6424, -4691, -6463, -7463, -1191, 9486, 10664, 4950, 2683, 2018, 5565, 10601, 10585, 4603, 6553, 11573, 10026, 5226, 2095, 3253, -1823, -3698, -7692, -4174, 404, 5878, 3912, 4897, 10194, 12080, 8363, -480, 4818, 7900, 4137, 3227, 8852, 14553, 13280, 15092, 10978, 6623, 8742, 14107, 15650, 13080, 11974, 7383, 3262, 3438, 4062, 1, -163, -1584, 1906, 5529, 7683, 7042, 6894, 6841, 12883, 13058, 6091, 1315, 3357, 9745, 9056, 7208, 9501, 19633, 22531, 30910, 47883, 79550, 100752, 106133, 117768, 110324, 93453, 76815, 61132, 60099, 57514, 51495, 50070, 48894, 49433, 59923, 63663, 68454, 82207, 94304, 91529, 77088, 63906, 46487, 34238, 33471, 39914, 40714, 45224, 43621, 44132, 41020, 33079, 25416, 31150, 30215, 26292, 25713, 33151, 38840, 47146, 52270]
18723E2270j839N615O750m333r963l473k630O753J7949J6018L511j5397q617n950
18709E6664o845q00K774K164l494n876l703Q007K682J5229J2715o664j3948j6911
18695D1994q648j743l429n078l923N633p255j104N765M687k498k704Q331l577
18681B6451r981l649O481k317l873o317k855J122K227P580P321K367m065m514
18667A5978P78O201m261j432l793j0966k082O65M680M539n31n899Q250k762n598
18652C767P196k926m178K04k053l20K332k151n537j671M295j409K026M977K509
18637G061m570k009N83Q226q79K118k42M473j585n455j482l571n665M554O656
18622H213J19k566l33k494j184K316r40N894o26n013k19k516n259N855L135k373
$$ y = [52270, 50431, 56046, 62796, 58463, 48500, 45027, 42397, 49150, 67099, 83117, 86628, 71231, 62614, 56664, 49819, 49019, 51793, 53957, 50463, 44587, 40884, 48891, 51573, 66802, 79517, 72853, 58905, 41994, 33346, 31603, 28174, 23096, 19173, 24806, 17551, 16447, 22212, 26899, 24401, 21697, 30028, 26451, 16470, 12821, 19302, 16985, 13112, 6795, 3940, 5062, 7289, 14869, 22190, 24557, 20492, 15978, 16756, 22957, 18696, 17264, 13471, 2505, 423, 1088, 5768, 10307, 9776, 3877, 12127, 9365, 3767, 10963, 8037, 3859, 4063, 2010, 1690, 4022, 1871, -3666, -5337, -1042, -2451, -425, 4552, 7061, 2491, 482, 1065, 9291, 8412, 10530, 10288, 14761, 13176, 7721, 6239, 2668, -2997, 1557, 8213, 8332, 5766, 5433, 2939, 1755, 4071, 3131, 9025, 8399, 3386, 3167, 651, -4608, 1247, 4382, 2009]
18606B009J587M049n415p692m877L605P416K49o85k433j73l409k472L658N186
18591F03L79O437j166k269m055l615M811O773m278k740j126j568O82N007j169
18576B706o035o627M571M345l183p45L965J133J344M94J861k036L576k810K240
18561D799Q734K319l630k774m2n446q543m90J300L930J504L694O027R425M548
18546B5355j662o353J403m800Q94P805N72m452o154J801M149o039o233o304K763
18531B745N034j583k72o89j117k76J380j183m354k552P392J0208j29M537L730
18516B2871M164o891n995N389O386k524m975j40k014m339p789k420R256L759O424
18501B1162N75o070m456O39j701L161Q3l842k192m11L343K471M738j430k096J1715
$$ y = [2009, 3596, 7645, 2230, -5462, -10339, -6734, 682, 931, 246, -2187, -2360, -5769, -8241, -4583, 603, 982, 7419, 6253, 3984, -71, -3686, 1125, 7898, 3620, 880, -246, -1814, -1132, 3875, 2706, -3329, -9956, -5385, -1040, -4223, -4968, -1003, 130, 1474, 1968, 3829, 1793, 5369, 2559, 4799, 13533, 15852, 12222, 9448, 9406, 3960, -4583, -5073, -3773, 157, 1661, 5355, 11382, 20807, 25355, 23693, 17340, 18743, 13943, 14837, 22642, 23214, 18762, 12608, 14409, 18558, 12519, 6286, -18, 2745, 7779, 6196, 5924, 5235, 4118, 3842, 5222, 4039, -315, -2867, 4525, 14733, 14604, 19141, 22871, 27035, 20144, 14149, 19538, 25924, 23400, 18425, 18285, 16271, 11932, 4143, 1723, 10979, 14738, 21162, 21737, 15667, 11211, 11850, 10149, 13310, 13393, 9551, 7359, 6948, 10291, 12762, 17500, 16070, 13974, 25689]
18485B5689M795n083p802j917Q49o460l675m227M87N418K986O976j462n044m729
18470F801K364K036K816L848m514n267j0053o789J096R290Q386K198m259p827
18456A26O378N987k692l334L945K185k56n171k601M950K902N337M053l21K88L93
18440B2169k361K97K771M168n069l766n356J573L332J78k565k842N293P937l550
18425B2209m098p619L473l073J651k319k61R944M89n402M564J900j0749m224j028
18410E457M908J3078J73p010j518Q377M107p132kl494p85j262n515K156L663L530
18394A8731k677k039k997J1018R799L735k056j1309L905K475n46L771n122q480
18380A8208j356L695N221K451k290o410o427P508K441m924k259K325J61l981L256
$$ y = [25689, 30484, 25401, 17599, 15682, 16531, 10071, 6396, 2169, 2656, 8074, 11060, 18036, 16574, 11530, 6801, 9165, 11201, 14017, 17865, 13351, 8084, -1969, -8758, -7662, 1628, 10014, 12212, 7953, 126, 6504, 12491, 9799, 6465, 10410, 12595, 12339, 7168, 4567, 9517, 12419, 17756, 21809, 21488, 21776, 22169, 19808, 20105, 22876, 27044, 21975, 18209, 12853, 14426, 17758, 17936, 15371, 12529, 17822, 25759, 22209, 18111, 10492, 13965, 10892, 12543, 10224, 9963, 19907, 20396, 14994, 19558, 21458, 10709, 6485, 5457, 10365, 23443, 23616, 16606, 15088, 23465, 27572, 20440, 20438, 16944, 16159, 14897, 9382, 11538, 15201, 18731, 16054, 14015, 11018, 22036, 31835, 35570, 33514, 22205, 26110, 28585, 28039, 31810, 26688, 18208, 16852, 20547, 25768, 28219, 25929, 19519, 13092, 20600, 23041, 18117, 15858, 18183, 18344, 14363, 17619]
18365A7619Q108M543O08l180k371O1M160J1267l085q823o357o305P215L753l465
18350B3748N116K399k441m092L41r032l864m033R12o324O873M390M112l244J344
18335A6205q020M920Q740l480o587m156j648J3943o92m348O113j406j360K620
18321B0844Q535l354l091n990k043M025O833P356L726j706n95J483o185q313n591
18306A5934k25J831m205O201l592l083Q599K085k361K348N338P6o885l491L969
18291B2539k637n656j220n733ML821J093K892l753L714P609J92k847k840L10J295
18275A8783J077n428L148P329j007l871k41J1476Q253q348r06L168P153J0077
18261E0663k590m433J248N220o28j0130j3145q335j445K434M01k536l716Q483
$$ y = [17619, 25727, 30270, 30878, 27698, 25327, 25388, 29548, 40815, 37730, 28907, 22550, 16245, 23460, 27213, 23748, 28864, 31263, 28822, 24730, 25071, 16039, 12175, 8142, 9054, 2730, 9603, 13993, 18105, 14861, 16205, 8185, 13105, 21845, 18365, 11778, 7622, 5974, 19917, 19225, 14877, 20990, 19584, 18224, 20844, 29379, 26025, 22934, 16944, 14901, 18926, 25759, 33115, 36841, 35135, 34540, 36023, 29838, 21525, 15934, 15709, 17540, 13335, 19536, 15944, 12861, 21460, 23545, 21184, 23532, 28870, 28946, 22061, 18570, 22539, 19902, 14246, 13026, 7293, 7297, 11118, 12211, 15103, 11350, 15064, 22673, 22865, 20018, 17178, 17488, 18783, 19860, 14432, 17580, 24909, 23902, 20031, 19790, 31266, 39519, 31171, 30265, 33433, 40586, 50663, 48073, 43640, 44888, 50108, 49480, 39350, 26205, 17870, 16425, 18859, 19260, 16724, 13008, 21491]
18247B1491k416q956j939M937O119P29j628j139j469j1624p234J873k213J3502
18233A0033J1790J870J478N457P759J2871Q297K159L83j26m41m347o054m537M92
18218D7084r672m086N532J5046K363l02Q62K645j148o144j3462o411n698L062
18204B9671K528l752o969k464J412p77j942M423J614Q8l167L599L35o763LM35
18188A8274p82n57o405n426O913Q587O921j852j888R38J0314M907Q046j370l366
18173D3254K706r392n157j894k726J349J212J352k307O55m340l9R316p1L941l803
18157C4056m519r181l886R4P088N919L150j438l617L960P124O192K931m700m742
18142C8431p0n61l75J546L543J0544P679m200o604L357J2352q0r03J0119M384
$$ y = [21491, 19075, 10119, 8180, 13117, 19236, 19965, 18337, 17198, 15729, 4105, -3129, -1256, -3469, 10033, 21823, 23693, 25171, 30628, 38387, 51258, 59555, 61714, 62097, 61971, 61530, 57183, 51129, 46592, 47084, 37412, 33326, 38858, 53904, 56267, 55965, 56827, 59472, 58324, 52180, 38718, 32307, 26609, 29671, 32199, 28447, 21478, 19014, 20426, 19649, 17707, 22130, 23744, 23832, 20665, 24264, 24599, 17836, 17839, 18274, 17492, 16935, 10530, 5104, 12017, 20604, 27525, 25673, 23785, 24723, 35037, 39944, 47990, 46620, 43254, 45960, 36568, 31411, 29517, 26791, 28140, 29352, 30704, 28397, 29052, 24712, 24673, 33989, 33918, 37859, 34056, 29537, 20356, 16470, 16564, 23652, 29571, 32721, 31283, 27666, 31626, 38750, 44942, 47873, 43173, 38431, 38361, 37800, 37425, 38971, 42514, 53058, 60737, 56537, 49933, 53290, 65642, 65562, 64659, 74778, 79162]
18127G9162J394M370O313J5083J8004P376M494J4037J5351K7498L7148N0642O0022
18114C40894O9159J04349J48766K15253L30094N49220J023385K177582M207583
18105I166285L813708p85329k504478l386503k703592j383597p01424m10966k47032
18096H57072j63352j26625q4926o2852n0009m3057l7877k3029k6048k2893j1962
18085B04442j2415j6342j5123j2357j3686j5900r383j69n302q580m858p013k112
18072H1202k174m714n571q685r396Q79L731L333n124M091M710J790J866K160n08
18057F7590j325o238l965n937p263q611k177Q910L53P586K020j910j432m070p882
18042C5649J716K40O656K274n443l026m69K548j345k963o611n659p509K443Q560
$$ y = [79162, 80556, 84926, 91239, 106322, 124326, 131702, 136196, 150233, 165584, 193082, 230230, 280872, 340894, 410053, 514402, 663168, 878421, 1208515, 1757735, 2781120, 4958702, 9166285, 12979993, 12194664, 9690186, 6303683, 3600091, 2216494, 1515070, 1104104, 857072, 693720, 567095, 482169, 419317, 369308, 326251, 288374, 265345, 239297, 216404, 204442, 192027, 175685, 160562, 148205, 134519, 118619, 109236, 109067, 103765, 95185, 90327, 83314, 81202, 79028, 74314, 68743, 60058, 50662, 51541, 55272, 58605, 53481, 57572, 62282, 64072, 65938, 68098, 67590, 66265, 60027, 56062, 50125, 42862, 34251, 32074, 40984, 41337, 48923, 50943, 49033, 47601, 43531, 35649, 37365, 37605, 44261, 46535, 41092, 38066, 37597, 40145, 38800, 35837, 29226, 23567, 16058, 18501, 27061]
18027B7061m44r38J3356P245L564n593o952j218j462l666o716m002P299J3484
18013D1018K862k353M712m327o015j112o159n099N895M132L19P27J801K603J4135
17998E3139J1817J0285O343M273k630q004o770M241r77p918K516J1208O96k432
17984G5787K323R769K0268J3633J2803M1j1929n406p638q800j1182r234l640L660
17970H0455K741L234K0105L8920L7972K7335K5493J5227M381l068K009Q385q095
17957B55094j5959j4362j2824j1384j288J7488L1619L2084L3929M0474K5396R039
17945C89306J0513m268k5262l3212k8898j7003Q401K2753K4352M1008L5252J8600
17933D41542K884k0488l9697m0706l3708k9534p233J769J6762K7998J6607L639
$$ y = [27061, 26617, 25679, 39035, 46280, 49844, 44251, 37299, 36081, 34619, 30953, 24237, 20235, 27534, 41018, 43880, 41527, 46239, 41912, 35897, 34785, 28626, 23527, 29422, 33554, 33873, 34600, 36401, 39004, 53139, 64956, 75241, 81584, 85857, 83227, 75223, 68453, 72694, 71717, 63799, 66315, 77523, 78219, 75787, 78110, 87879, 108147, 121780, 134583, 134624, 122695, 117289, 109651, 100851, 89669, 80435, 76795, 80455, 83196, 86430, 106535, 145455, 183427, 210762, 236255, 251482, 255863, 252795, 254804, 263189, 255094, 239135, 224773, 211949, 200565, 199277, 216765, 248384, 280468, 314397, 354871, 380267, 389306, 399819, 395551, 370289, 337077, 308179, 291176, 299577, 322330, 346682, 387690, 422942, 441542, 444426, 423938, 384241, 343535, 309827, 280293, 273060, 274829, 291591, 319589, 336196, 339835]
17921C39835q651j7506k8527l5149k7944j2294p549P662K1372L0328M6695N6083
17909C64355N2589L0436J2459n348k2395k4251j8959n179m443N04j707p109M053
17896C75005N464k039R07l785m379m753j7483j7907l055J378m682j4366j7916
17883B92389k2601k3574l1845k7144j7298r163m962j0143j9251j9704l623m76
17871A02605J329P402J9092K0933K4663L531p086q710j5646j5234p939o243o557
17858A12140n684K498J0350J9967K0090K3310K2252O157j1146j9492k7592j8804
17846A34046j0392j0706o416j2178m935L449J0593J9969R595R36J278n058j2622
17833A17559j0062m453m874m730l716p25N037Q313m119j0469l879n44o548J177
$$ y = [339835, 331184, 313678, 285151, 250002, 222058, 209764, 202215, 209877, 231249, 261577, 308272, 364355, 416944, 447380, 459839, 454491, 432096, 407845, 388886, 383707, 379264, 379768, 378061, 370952, 375005, 380469, 378430, 379337, 375552, 371173, 366420, 348937, 331030, 327975, 329353, 324671, 310305, 292389, 269788, 246214, 214369, 187225, 169927, 160764, 155802, 145659, 126408, 106704, 103081, 102605, 103934, 111336, 130428, 151361, 176024, 179555, 172469, 163759, 148113, 132879, 124940, 118697, 112140, 106456, 108954, 119304, 139271, 159361, 182671, 204923, 211080, 199934, 180442, 152850, 134046, 123654, 112948, 106532, 94354, 89419, 92868, 103461, 123430, 133025, 133961, 135239, 130181, 117559, 107497, 103044, 98170, 93440, 89724, 88999, 94036, 102349, 98230, 87761, 83882, 83338, 76790, 77967]
17819G7967J058q58N828J6919J1040J991j29K796j748M947J599K01j156j438j092
17804A17925N432O950M258M349M324l94o183q618k632n162o419j524K117K900
17790A17323L819m659j268o382L978k492k232j2202k482J1965J2983J4306M498
17777A37155K135R09l836o60J915k938j4595p262l395j304J2703P561M757J3434
17763A46579K0553J1294L965L202m102J979L18n201j708j804M357K191J18m053
17749A77688L753m792j9256n546k618L094j550l466J467P247j624j0391m732P073
17735A46347J122M233n0p873q471m194m22Q515L022o561r751j187P616o422l01
17720A25623K295J8029N549m242r807p535r693o00O78P879J3923O974P115q26
$$ y = [77967, 79025, 78167, 83995, 100914, 111954, 113945, 113816, 116612, 114864, 119811, 121410, 121611, 120455, 119017, 117925, 123357, 130307, 134565, 138914, 143238, 142844, 136661, 128043, 125411, 120249, 113830, 112306, 114423, 117323, 121142, 116483, 115215, 108833, 112811, 110319, 108087, 95885, 93403, 105368, 118351, 132657, 137155, 139290, 140199, 136363, 135703, 137618, 134680, 120085, 112823, 109428, 108124, 120827, 128388, 133145, 146579, 167132, 178426, 182391, 185593, 181491, 183470, 183788, 178587, 176879, 175075, 179432, 181623, 181741, 177688, 181441, 176649, 157393, 151847, 149229, 152323, 150773, 147307, 148774, 156021, 154397, 144006, 139274, 146347, 147469, 151702, 151652, 143779, 135308, 131114, 130692, 139207, 142229, 135668, 125917, 124730, 132346, 125924, 125623, 127918, 145947, 151496, 147254, 137447, 129912, 120219, 119619, 120297, 128176, 142099, 149073, 156188, 155362]
17706A55362j421r473q141j658l427o629j639j2067q265J391M808N577P502P452
17692A29372L391l806k726m572k421K536J0701P80M492K358J4881L127j2109l794
17678A42210L993P88J424K993j498L943j245r297n770n269J357L577J927k563
17664A36570K932P133N290M659o731l422l952q893n798l70k455o146o53K236J2870
17649A33270K1041J6699R075N271M160m682o625L78Q738N141N691M720j16R184
17635B11945Q158L729R771P250p26k501k328O675J0185J686Q803k767o306j6576
17621B36998k1662k1459k0145j4794o278m801j2261p895k163L085j484j0796j324
17608A15021M756L181m37N258M232J1176O515p360o126o390l939l445J107J432
$$ y = [155362, 153941, 144468, 136327, 134669, 131242, 124613, 122974, 110907, 102642, 104033, 108841, 114418, 121920, 129372, 132763, 128957, 126231, 121659, 119238, 121774, 132475, 133255, 137747, 140105, 154986, 158113, 146004, 142210, 146203, 146991, 148415, 151408, 149910, 153853, 152608, 143311, 137541, 132272, 133629, 137206, 139133, 136570, 139502, 146635, 151925, 156584, 149853, 146431, 142479, 133586, 127788, 127418, 124963, 118817, 118164, 120400, 133270, 154311, 171010, 180085, 185356, 189516, 184834, 178209, 178587, 187325, 192466, 198157, 202877, 202761, 211945, 220103, 223832, 233603, 240853, 240127, 237626, 235298, 241973, 252158, 253844, 262647, 259880, 253574, 236998, 215336, 193877, 173732, 158938, 152660, 147859, 135598, 127703, 125540, 128625, 127141, 116345, 115021, 119777, 122958, 122521, 127779, 132011, 143187, 149702, 142342, 136216, 129826, 125887, 122442, 123549, 124981]
17594A24981k752N49p617l411O224J692O836J9401J5408J7647K0421K3276J5245
17581B37900J703m268l900j4016j0418j1117j4900j4804p595j5257j5604o470
17569A21254N746N024J812k404k936j2412j4259j4661k0393n296K178J6119J1039
17556I0811J1868N037k334k027m47K920n245k949o264P4M990j642J525O740J9974
17541A23031J4798J2244J4562j666j0171j046L106P157N704J452O738L874J2194
17528A91977J6324N871k375K039L614L763m277P987P219J1191O050K556L887Q997
17514B64823O358J1615Q815N405J8873J0920j4l639J894L471J1212J0721J8376
17501C68830K3712K4242K7541K5401K1953J7269J8799K0506L0289M2670N5919
$$ y = [124981, 122229, 122778, 115161, 111750, 117974, 119666, 126502, 145903, 161311, 178958, 199379, 222655, 237900, 239603, 235335, 231435, 217419, 207001, 195884, 180984, 166180, 158585, 143328, 127724, 121254, 127000, 132024, 133836, 131432, 128496, 116084, 101825, 87164, 66771, 61475, 63653, 79772, 90811, 102679, 107716, 105382, 103355, 102908, 105828, 100583, 97634, 91370, 91444, 96434, 94792, 96317, 103057, 123031, 137829, 150073, 164635, 162969, 152798, 151752, 154858, 162015, 167719, 169171, 175909, 179783, 191977, 208301, 214172, 211797, 213836, 217450, 221213, 216936, 224923, 232142, 243333, 249383, 251939, 255826, 264823, 271181, 282796, 291611, 297016, 315889, 326809, 326795, 323156, 325050, 328521, 339733, 350454, 368830, 392542, 416784, 444325, 469726, 491679, 508948, 527747, 548253, 578542, 621212, 677131]
17490F77131O7001J01180J44904K13922L33252M37482M34383M24521N29157M50038
17480C812971J73665J20820Q7666L1194J29039J60414N6390Q1677R2153j20504
17470D625485l14317l48010l84060l56419k70378j72222l9091J09219K71271M88555
17460C610033P36901R43537J109754J253734J258945J033850P84739P59033P79068
17451A2269594L63323Q716j16175m02193n03633l67279l3137N29509J319330K304992
17441A5373047L454646M677075O161202P893408J0192271J4237846J5373525J3770789
17433I1133809J4265647R883006r34071p911007j2280211j5578798j4893438j2927680
17425E0757257j0433633o620934l871437k529079j364029j00937R16295J888066
$$ y = [677131, 744132, 845312, 990216, 1204138, 1537390, 1974872, 2409255, 2833776, 3362933, 3812971, 3986636, 4107456, 4195122, 4226316, 4355355, 4515769, 4572159, 4653836, 4745989, 4625485, 4311168, 3963158, 3579098, 3222679, 2952301, 2780079, 2740988, 2850207, 3121478, 3610033, 4346934, 5290471, 6400225, 7653959, 8912904, 9946754, 10731493, 11490526, 12269594, 12632917, 12641633, 12525458, 12123265, 11619632, 11252353, 11219216, 11748725, 13068055, 15373047, 18827693, 23504768, 29665970, 37559378, 47751649, 61989495, 77363020, 91133809, 105399456, 115282462, 114348391, 106437384, 94157173, 78578375, 63684937, 50757257, 40323624, 33702690, 29831253, 27302174, 25938145, 25837208, 26753503, 28641569]
17417B8641569L237703L823291L458009L578895L014367J84062k504425l718852
17409C9714619m776381n252171m927217m123116k937414j681729o39180K88897
17401A5666308J133002J787359K563380L984849N064993N651971P333464Q326787
17393E1512113Q508184R189240J0681781R612142O720386N613761N49317l757159
17385I8629765l863503n844056p030672n860592o540153n715337l072794l41818
17377F0360840J710701L582219N274702K066080l101271o182343q359877r374671
17369D5976380q693734p001180m971716k916038j812482j509763j230212j059094
17361A6782161q48162o98603l20358n4231n73099r79595j040590j228714j244972
$$ y = [28641569, 31879272, 35702563, 39160572, 42739467, 45753834, 45937896, 43433471, 39714619, 34938238, 29686067, 24758850, 20635734, 17698320, 16016591, 15377411, 15666308, 16799310, 18586669, 21150049, 25134898, 30199891, 35851862, 43185326, 51512113, 60020297, 69209537, 79891318, 89503460, 96223846, 101837607, 102386924, 98629765, 94766262, 88922206, 81891534, 76030942, 69490789, 63775452, 60702658, 60360840, 62071541, 65653760, 70928462, 72994542, 69893271, 63710928, 55351051, 45976380, 37282646, 30281466, 25309750, 22393712, 20581230, 19071467, 17841255, 16782161, 15933999, 15235396, 14915038, 14860807, 14287708, 13308113, 12267523, 11038809, 9793837]
17352I793837j040992p28549k07874L61994O78793P16576R80068J026551M36127
17343A2016531K41136N87033J199585J923633K191160K293076Q61764r97161k123823
17334A8192934l196326k886550k076134j156811j60780Q36704J648701K040637
17326A3242375K337715K255529J133058K65975o30928j488096k143445k321576
17318A2650607k419186k173578j650275j106644n38265M963N25315Q68451R48859
17309G110247Q60022J46739n18409r87528j328275j187043r35375o61247m47644
17300B051487k98801k01644j51967j18409j01125j00201q9271p9302o3721l8992
17290H08054k9065l6239m0192m4626l8092l5224l1998l5531l2257k8113j0487
$$ y = [9793837, 8752845, 8024296, 7816422, 8178416, 8857209, 9573785, 10553853, 11580404, 12016531, 12257667, 12844700, 14044285, 15967918, 18159078, 20452154, 21313918, 20316757, 18192934, 14996608, 12110058, 10033924, 8877113, 8716333, 9553037, 11201738, 13242375, 15580090, 17835619, 18968677, 19234652, 18603724, 17115628, 14972183, 12650607, 10231421, 8057843, 6407568, 5300924, 4762659, 4767622, 5292937, 6161388, 7110247, 7970269, 8117008, 7598599, 6611071, 5282796, 4095753, 3160378, 2499131, 2051487, 1752686, 1551042, 1399075, 1280666, 1179541, 1079340, 990069, 910767, 847046, 808054, 778989, 742750, 702558, 657932, 619840, 584616, 552618, 517087, 484830, 456717, 446230]
17279D46230l247M834J3683J6379n104r042j5586k7375k7830j8299j8028j1016
17267C45599j0891j0215r318Q074Q288O372J1662L890j0396j840L003o56k42k753
17253C40577k0105m854q061j0802q241j984k202q158j1511j6470j7214k3461k2232
17240A85282j6913j1770k313J3219J6519J3915O891K889J725m34J56m944j06k778
17226B01338p03n677j0881k0754p897J10J2477J2189O303M302R58K583p275q435
17212A78638k476N00q217n956M2J2158O076r742j5430p793p879r400m241j5573
17198A10707q878j1574m599j910j1437j3102o444n516k70K768q652k92L066O02
17184D4469l370p583m256M516K80N590j836l87l009J158k77j219Q48M046O735
$$ y = [446230, 442983, 447817, 461500, 477879, 472775, 463733, 448147, 420772, 392942, 374643, 356615, 345599, 334708, 324493, 315175, 323249, 331537, 337909, 349571, 353461, 343065, 341225, 344228, 343572, 343330, 340577, 320472, 315618, 307557, 296755, 288514, 286530, 284328, 276170, 264659, 248189, 230975, 207514, 185282, 168369, 156599, 154286, 167505, 184024, 197939, 204830, 207719, 209444, 209010, 209166, 204222, 204116, 201338, 200635, 194958, 184077, 163323, 155426, 155536, 168013, 180202, 186505, 190807, 191765, 194348, 187073, 178638, 176162, 176662, 168445, 162489, 162531, 174689, 180765, 171023, 155593, 147800, 139921, 130521, 126280, 110707, 101829, 90255, 85656, 83746, 72309, 59207, 52763, 47247, 46977, 49745, 41093, 40801, 43867, 44469, 41099, 33516, 29260, 33776, 34056, 39646, 37810, 37423, 34414, 35572, 35295, 34076, 34924, 38970, 45705]
17169D5705K482K570O754J2591L942q149r344M76L206j72M207L613k595l999M52
17154F1739M073P232O584o73o544q226k237p351j0171o87O050l021j576M806P148
17139E7146L893k485k824J502o409o087k064K433n21m958p730K840J717M219O343
17124D7015N76j598N850L089N847K697m17p53q24r071o457M515L191m897k260
17109D6503r97k286k60N787Q020p275o264K139J075K630J826N69m530o741M175
17094D4371J465o907J852j668o956o27n996o893l296K338P241j371O79N196J728
17079C1156K096O161N706M162K696K968k7l953j1413n706K26n61L047m459p250
17064B4849n868j540Q069Q870P647O219j571k649J303k52k39p364l264K325J479
$$ y = [45705, 48187, 50757, 57511, 70102, 74044, 65895, 56551, 57027, 60233, 60061, 64268, 67881, 65286, 61287, 61739, 65812, 73044, 79628, 78955, 72411, 64185, 61948, 54597, 44426, 43739, 49789, 46768, 45192, 49998, 57146, 61039, 58554, 55730, 57232, 50823, 44736, 42672, 45105, 44584, 39626, 31896, 34736, 36453, 40672, 47015, 47591, 45993, 51843, 54932, 60779, 63476, 63059, 62306, 61482, 52411, 45954, 50469, 53660, 48763, 46503, 45506, 43220, 42960, 48747, 56767, 49492, 43228, 45367, 46442, 49072, 50898, 51467, 46937, 40196, 44371, 45836, 38929, 40781, 39113, 32157, 31530, 25534, 18641, 15345, 17683, 24924, 23553, 24232, 29428, 31156, 33252, 39413, 45119, 49281, 51977, 54945, 54918, 50965, 39552, 33846, 34072, 33511, 36558, 32099, 24849, 18981, 17441, 25510, 34380, 42027, 48246, 46675, 44026, 45329, 45077, 44838, 37474, 34210, 36535, 38014]
17049C8014j016K466n788l538J346M007l017n1q232j1371J70M460k622m239O167
17034A6756K065m714m285Q88L474n69m416M485K266K429M831n691m962M153M211
17019B0921m248L108K930m24L333L858o048n212o524L122o022K57M396m456m923
17004D068Q065M018K26m633p58J986L722j50K092K456K737q41m337l417Q251P678
16988C1163r889j64L149k062l074J797p420j0803K724L055M513J073M608j772
16974A6898r53J772p52l316p814q609j158J794O694J4R96K914N061l464O87K589
16958A3353L474n719r43j06O817r99k210n77K547M043J017m732n023M526K830
16943A8298M174N993m366J232O602N277j352k0q32M123l244%K108Q622P218Q242
$$ y = [38014, 36998, 39464, 33676, 30138, 31484, 35491, 32474, 32423, 24191, 12820, 12990, 17450, 14828, 10589, 16756, 18821, 14107, 9822, 10710, 14184, 13615, 9199, 13684, 15950, 18379, 23210, 17519, 12557, 16710, 20921, 16673, 19781, 22711, 22287, 25620, 29478, 23430, 18218, 11694, 14816, 8794, 9051, 13447, 8991, 4068, 12133, 16151, 16377, 11744, 10986, 12972, 16694, 16544, 18636, 21092, 23829, 22988, 18651, 15234, 23485, 31163, 21274, 21110, 24259, 22197, 19123, 20920, 13500, 2697, 5421, 8476, 12989, 14062, 18670, 16898, 15945, 17717, 16965, 13649, 5835, -2774, -3932, -2138, 4556, 4570, 5566, 8480, 13541, 10077, 10764, 13353, 16827, 11108, 10165, 10059, 16876, 15877, 13667, 13090, 15637, 19680, 20697, 15965, 10942, 15468, 18298, 22472, 28465, 24099, 25331, 31933, 37210, 35858, 35838, 35006, 39129, 35885, 35885, 37993, 46615, 53833, 62075]
16927F2075J2011J7681K5388L2226L3265L7166L5248J6742j982j8441k8385j5049
16915B07945n901K478O600J6761L6985N3330P5766O5839M0538N455j7937l8011
16903D49848o5552p1858n4455m2356k7122P597K0257J6326J9382K4681N763j2732
16891B69779k3137l1923l2743l7218l0575j9859j8674j4888m134p63L940p688
16879E2117k753N232P350N244P207J3598K4496K1551K8589K7316L6009L2734L7476
16866B96166M7376M2084K7912K521r022o014p744k2390k2666j6994k770P279J4750
16853C50488K3080L3274M7308M5486K1707j9579m1480m4227m7097n1575m6708
16842B70677m5041l3155k5147j6342m444j163M829R919n620r778j8155k2394k3140
$$ y = [62075, 74086, 91767, 117155, 149381, 182646, 219812, 255060, 271802, 269820, 251379, 222994, 207945, 202044, 204522, 211122, 227883, 264868, 318198, 393964, 459803, 500341, 505796, 487859, 449848, 384296, 312438, 257983, 215627, 188505, 196102, 216359, 232685, 252067, 276748, 282511, 269779, 246642, 214719, 181976, 144758, 114183, 94324, 75650, 60762, 56628, 55865, 59805, 52117, 49364, 54596, 61946, 67190, 74397, 87995, 112491, 134042, 162631, 189947, 225956, 258690, 296166, 343542, 385626, 413538, 416059, 407037, 401023, 393279, 370889, 348223, 331229, 328459, 335738, 350488, 373568, 406842, 454150, 499636, 521343, 501764, 460284, 416057, 368960, 317385, 270677, 225636, 192481, 167334, 150992, 146548, 145385, 150214, 160133, 154513, 144735, 126580, 104186, 81046]
16829H1046j8161j5560p026o033m570m5L660m815q003l259N431L033j32K393R43
16814B8902J70K506K368M968N981J3585K124M174K769m788p151q922n979o843
16800C3864L648R156J637J6457J8157K0307K2038O883J404j1411j9895k1940j9885
16787F0420j3768j1224N101j364k079J2864Q140l977P545J0548J453j2073j3594
16774D7992j4202j6299n113N614L912r567l541o22m270M70M669j142J763k299
16760G365k365J181L192P759M465J792j0491r049M834j603n019K971j422l431
16746A79q51k228K772k214Q40L975M580m060K951O694l297r4k338j292m028M545
16730F134M699k926k298L3K24q348j943k364l57Q339l017J338k019r069m675M582
$$ y = [81046, 62885, 47325, 40299, 34266, 29696, 29651, 33311, 28496, 20493, 17234, 22665, 25698, 25566, 27959, 28902, 29072, 31578, 33946, 38914, 44895, 58480, 60604, 64778, 67547, 62759, 55608, 46686, 40707, 33864, 37512, 46668, 48305, 64762, 82919, 103226, 125264, 132147, 133551, 122140, 102245, 80305, 60420, 46652, 35428, 40529, 39165, 37086, 49950, 58090, 54113, 61658, 72206, 73659, 61586, 47992, 33790, 17491, 12378, 17992, 21904, 12337, 8796, 8174, 3904, 4374, 9043, 7901, 9664, 7365, 5000, 6181, 9373, 17132, 21597, 23389, 12898, 3849, 8683, 7080, 2061, 5032, 3610, 179, -672, -2900, -128, -2342, -1502, 2473, 7053, 2993, 5944, 12638, 9341, 9247, 6909, 5617, 1589, 6134, 10833, 7907, 5609, 5642, 5866, -2482, -4425, -6789, -7146, 1193, -1824, -486, -2505, -11574, -16249, -11667]
16714a1667J6201L757L209k196l237r591k498P32j467K900R55j698J203j457j239
16699f093K578p35Q79K298j079L680J471n39J371J78n141j124J421P65K605L933
16683F468K140q01m683j026J609r06K380K92n7m614m271M764M505N457l118q702
16667e63j304L371J514M13J227M377J423p455l141l49j698m89O358l878m041K148
16651b087j63n578O251O636l566k655K376J185j208M469m083m006P24K665K455
16636C415n103q794l659L275R540J822k363k250O193K357l08j358k734k01J71
16621Cl329N599j424n063P289L985j353j819r597k758k427r49O84p09j489n77
16605a3934m216K237O480K714J263N603M440l396k330k446p203K922N86n126k897
$$ y = [-11667, 4534, 8291, 11500, 9304, 6067, -3524, -6022, -5290, -6757, -3857, -2902, -4600, -3397, -4854, -6093, -3515, -4250, -3371, -1073, -2152, 1528, 2999, 2460, 3831, 4009, -1132, -2256, -835, -70, 2535, 6468, 8608, 7807, 3124, 2098, 3707, 2801, 5181, 5473, 5416, 802, -3469, 1295, 5800, 11257, 8139, -563, -1867, 1504, 3018, 3431, 4658, 9035, 10458, 3003, -138, -487, -2185, -2674, 3684, -194, -4235, -2087, -2250, -7828, -1577, 5059, 1493, -1162, 1214, 2399, 1191, 5660, 1577, -2429, -1705, 960, 3415, -1688, -10482, -14141, -10866, -1326, 496, -1867, -4117, 2076, 4433, 4125, 2767, 33, -168, 3, -3326, 2273, 849, -4214, 3075, 7060, 5707, 3888, -5709, -8467, -10894, -11843, -11159, -11868, -13357, -13934, -18150, -15913, -9433, -6719, -5456, 147, 4587, 1191, -1139, -3585, -10788, -7866, -7280, -12406, -15303]
16590a5303O035K882J254l692L419j215m633j871K38M186K470o708m92N94m340
16575a7176R431O260N09o54J618K125k225q721O27L250R61l015j103k778K54J066
16559i571k48m190M854Q921J862K694L38n291O90q32l163J518J363N387k826J467
16543B973J615j486k108j754r076L052M159k094l429M017r81O964j819r479Q7
16528i359j812M731J1101k238l023L861N279m17n783j687n434l608M886N844o11
16513A730k888m971Q19M732j1j778n129O30M663L074Q63o664l442m099J314R351
16497a806r21j47n141N188k491n74P379R92k813K130L573O212J355o386o303n44
16481b97L26k539Q716o247r923m50J1448J0032l147o216R63l965O67L484l355
$$ y = [-15303, -9268, -6386, -5132, -8824, -5405, -6620, -11253, -13124, -12886, -8700, -6230, -12938, -13430, -12836, -17176, -7745, -1485, -976, -1630, -12, 2113, -112, -8833, -8206, -4956, -3995, -7010, -8113, -10891, -10637, -9571, -9819, -14009, -9155, -234, 1628, 4322, 4660, -631, 59, -773, -3936, -2418, -1055, 4332, 1506, 2973, 4588, 3102, 994, -760, -9836, -6784, -2625, -4719, -8148, -4131, -5112, 1852, 33, -9446, -9359, -11171, -6440, 4661, 2423, -600, 3261, 8540, 8123, 2340, 653, -4781, -8389, -3503, 2341, 1730, -1158, -6129, -5310, -578, -589, -2367, -7496, -6866, -2203, 871, 1734, -4930, -8372, -12471, -11157, -1806, -2727, -2874, -8015, -2827, -5318, -5892, 1487, 2479, -334, 1796, 5369, 11581, 12936, 6550, 247, -297, 29, -2510, 6206, -41, -9964, -10414, 1034, 11066, 7919, 1703, 2666, -1299, -632, 2852, -503]
16466e03m860q858L965Q969N7M202r87n288K390j502K686j316j488k201lM898
16450A61j877l082L197P958N64j384j452n764J573J236O85j769m146k250n705
16435a2055J035Q665k482K427M229m491R46Q019n957j0721J753j756k412j943
16421a4743O19P759M123k747L168m532j854O209k780n451P505M454p553R28J477
16406c418M870l233j619j590j054j547P088M215J440K366L97O5l49n478m253L380
16390A280J385k604k830Q17R48m147o889j256M32J610Q288L449K690j723k748
16375a298j791M10J016M632L91K558j767m092o122k764M778K501j195L428j722
16360a037K007p784L1K985q48K084J351p53N032r03o302Q1k306J881M455m043
$$ y = [-503, -5363, -14221, -10256, -1287, -1230, 2972, 1985, -3303, -913, -2415, 271, -1045, -2533, -4734, -4737, 161, -1716, -4798, -1601, 6357, 6921, 5537, 4085, -1679, -106, 1130, 1815, 46, -4100, -6350, -12055, -11020, -2355, -4837, -2410, 1819, -2672, -1726, 6293, 336, -10385, -8632, -10388, -12800, -14743, -14124, -6365, -2242, -4989, -1821, -6353, -8207, -1998, -4778, -10229, -2724, 1730, -5823, -4895, -3418, 1452, -1781, -3400, -4990, -6044, -7591, -503, 3712, 5152, 7518, 7915, 7980, 7631, 2153, -2100, 1280, 2665, 61, -2769, -1952, -1004, -5151, -12040, -13296, -12864, -11254, -2966, 483, 3173, 1450, -1298, -3089, -2679, -1663, 2969, 3360, 5918, 4151, 59, -6063, -8827, -4049, -1548, -2743, 685, -1037, 970, -6814, -6783, -3798, -4646, -2562, -1211, -1964, 3068, 2165, -4137, -4056, -6362, -4481, -26, -4069]
16344d069J80q93J407l256o54K292l634o667j824k14L436P041n015q54K772K590
16328g362R21K185J848l40j60K344J081L631j169p31N921R22j0457M494K546o362
16312f88r582j274M937L29o814Q094J913M64m277k133M168P218o665o832J089
16297a0053m12j910m564R020j636J739O574J97j82k711l705m619K296K697j366
16282h635kN149K412k110J849L178l656m989m94J455p24o930L507Q180o270K006
16266f074L201k964J19J0344J144j554n896l432L045N223j834q107p253K116L46
16251a1576k298J0480N235l609l593O313j418oj795n151J49l894J397Q179N181
16236C594L056m070m535q26K95K456o469R15L118j893k682J3099k988m366j445
$$ y = [-4069, -3889, -4782, -3375, -6631, -7285, -4993, -8627, -15294, -17118, -17332, -13896, -6855, -11870, -12724, -9952, -7362, -6441, -4256, -2408, -2748, -2908, -564, 517, 4148, 2979, 2248, 8169, 9091, -1366, 3128, 5674, -688, -10270, -11544, -6607, -6278, -13092, -4998, -3085, -2621, -6898, -9031, -4863, 2355, -4310, -11142, -10053, -10465, -12375, -16939, -7919, -9555, -7816, -1242, -1045, -1227, -3938, -7643, -12262, -9966, -7269, -8635, -8637, -3488, -1076, -3186, -1337, 1841, -1815, -6804, -7298, -5843, -6567, -13497, -9990, -1810, -8080, -6074, -2873, -5837, -5718, 4626, 5770, 4216, -1680, -5112, -2067, 3156, 1322, -6785, -14038, -11922, -11576, -13874, -3394, 1841, -1768, -5361, 952, -466, -472, -2267, -7418, -7269, -11163, -9766, -1587, 3594, 6650, 2580, -1955, -2781, -2486, -30, -6499, -5584, -2466, -4359, -7041, 6058, 3070, -1296, -2741]
16221b741k479L896N32K64N318K638J065k751m582J079j213L139O64o941k883
16206d995L899N768M519K958k251q306K499r03K91j779l508Q98k098k004L389
16191a623R70k33M916n447o310k305k053M085O375o888M598Q878M442q897m696
16176d188K44K36r00m765l49N461k49L166j16o775K783J1838M323J138p954p468
16160c575M420K338R53l636L465o455k063J0403L174k968R16m027L572O78o71
16145F524l423m549N667k155m502M205J169l155P211r14m107n303P47K857m23
16130a51J1340R22n711l580K585j245l999j727p03j134L547J529M206k281k590
16115A008N173J780P27l614l95m187l968P6L017m109M033m293m741L24l95J988
$$ y = [-2741, -5220, -1324, -792, -528, 4790, 7428, 8493, 5742, 1160, 2239, 1026, 4165, 4829, -2112, -4995, -1096, 4672, 9191, 12149, 9898, 1592, 4091, 3188, 3479, 1700, -1808, -910, -3008, -5012, -1623, -653, -886, 4030, -1417, -7727, -10032, -12085, -8000, -1625, -8513, -3915, 4963, 9405, 508, -4188, -3944, -3708, -4608, -9373, -9722, -4261, -4510, -1344, -1460, -8235, -5452, 6386, 10709, 11847, 3893, -3575, 845, 3183, 4136, 500, 3965, -2490, -4553, 5850, 9024, 6056, 6972, 2945, 6517, 7195, 6524, 3101, -1448, 4219, 2064, -2438, 1767, 2936, -219, 6992, 6078, 1971, -3332, -2585, 272, -151, 11189, 12111, 6400, 2820, 5405, 4160, 161, -1566, -2269, -3403, 144, 1673, 5879, 3598, 1008, 6181, 7961, 8688, 5074, 4679, 492, -3476, -3400, -383, -4492, -459, -4752, -9493, -9169, -9564, -7576]
16099g576P158j21N755P268l440j1422j3037l862K348M537Q567O156m829q843
16085a1341L084J1469l024o696P688N261q872l922K132K329j563j08n195q159
16071a6917j794M499R085O814j950n354l257n306J554L826L686n114o212M997
16057a1443j982K563L315j906n648k686N027l753k612N401M064N178K442L30m842
16042f552N168N861o501o395j521N16n296m439P25N366K986j56O508R25n630m162
16026a2597M084J337N43K928K2K727j572m321m518K638K951m677P90R545N489
16011E369R55K94l213L266Q414k827l790k73j214P35n246k72M539k403j365l679
15995g10p324k686J0230j225K608l546k699l865J558N626m199j552M356N888Q21
$$ y = [-7576, -418, -539, 5216, 12484, 9044, -2378, -15415, -19277, -16929, -12392, -3825, 2331, -2498, -11341, -8257, 3212, 188, -6508, 1180, 6441, -2431, -6353, -4221, -1892, -3455, -3563, -8758, -16917, -18711, -14212, -5127, 1687, -263, -5617, -8874, -14180, -12626, -8800, -5114, -10228, -16440, -11443, -13425, -10862, -7547, -9453, -15101, -17787, -12760, -16513, -19125, -13724, -9660, -4482, -2040, -1710, -6552, -1384, 4477, -2024, -8419, -9940, -9424, -14720, -19159, -18434, -13068, -10082, -10238, -3730, -2805, -8435, -12597, -8513, -7176, -6633, -3705, -3683, -956, -2528, -6849, -11367, -8729, -5778, -10455, -9665, -120, 5369, 6324, 6618, 3405, 6671, 15085, 12258, 8468, 8195, 6981, 7716, 2470, 2198, 6737, 4334, 2969, -710, -8034, -10720, -490, -1715, 893, -2653, -5352, -9217, -7659, -2033, -6232, -7784, -3428, 2460, 3281]
15980C281J426K9k308r778k689m281L552J1356L606j353r71M281j225p152P33
15965a493Q048j804r481n33M286O475l763k451j690R385P498o904o948J719j104
15950A240J552L202n611j802J205k55J170p991n774k44M480L91l532O326K086
15935c557p037n200K449P987n89m556M216L576Q01m287j109m157J116l369k760
15920a6476Q136O553k725m388L432J078o201o02k805j916l257J526M495J457R44
15905a0749K906L828j31M003O188K412J761Q4m453j0986K84J188M781L655o751
15890a980M85J190l878L113J779J219N311l493l407K921K231k747K640K66J028
15875F678m74l154j770K99n020j532L151L797n345K806K580k987n12L03L215k139
$$ y = [3281, 4707, 4736, 2428, -7350, -10039, -14320, -10768, 588, 4194, 2841, 1870, 6151, 4926, -2226, -1493, 6555, 4751, -4730, -5263, -977, 5498, 1735, -716, -2406, 6979, 14477, 7573, 625, 2344, 1240, 2792, 5994, 383, -1419, -214, -469, 701, -7290, -13064, -13308, -8828, -8437, -11969, -5643, -3557, -10594, -15794, -13345, -5358, -5947, -10503, -6287, -2711, -1910, -6197, -7306, -11463, -10347, -13716, -16476, -8340, -1787, -4512, -8900, -5468, -4390, -10591, -11193, -13998, -15914, -19171, -17645, -13150, -11693, -10749, -7843, -4015, -4146, -143, 6045, 8457, 10218, 10302, 5849, -5137, -4853, -3665, 1116, 4771, -1980, -1495, -305, -4183, -1070, 709, 1928, 7239, 3746, 339, 3260, 5491, 2744, 5384, 5650, 6678, 6204, 3050, 1280, 1579, -3441, -4973, -1822, 1975, -3370, -564, 2016, -971, -1483, -1180, 2035, -104]
15859a04j596Q57N364j320o939m018n359j338J420l8L031r64N586J826N71L83
15843b638K303L024j828m387n132P24L839O043j979n06L28Q608k013n354l542
15828b510k1n1Q06L135l705R70J747Q987N857P4k400j4013n618l455L949J0219
15812C971M362j716N49P2r89K799j509r24m945m629N643l437j105M387K758P676
15796A2963l446j0419k92N856P04K06J123p288m304m7l006k237J553L435P357
15781B158k596L071K404K328P66p00m318M982P739N064P092J0414P018K161L822
15766E1405Q956L663j960m875K867J86O974p243N540Q604r199o644p713j3606
15752C6955r868j3151q710n666K283j62L148K863p307q336J458k443r53p49K788
$$ y = [-104, -1700, -843, 4521, 3201, -3738, -7756, -13115, -14453, -13033, -13071, -10040, -11004, -5418, -3592, -3021, -2638, -335, 2689, 861, -3526, -8658, -7934, -4095, 1948, -31, -537, -209, 8399, 6386, 1032, -2510, -2531, -2582, -1776, 1359, -2346, -1376, 371, 9358, 15215, 15289, 12889, -1124, -6742, -10197, -6248, 3971, 8333, 6617, 7166, 7238, 6249, 9048, 7539, 6615, 1670, -2959, 2684, -753, -1858, 2529, 5287, 12963, 9517, -902, -1194, 4662, 5366, 5572, 6695, -593, -4897, -4944, -7950, -10187, -8634, -5199, 2158, -438, 2633, 5037, 7365, 8131, 7431, 3113, 8095, 15834, 20898, 27990, 38404, 45422, 47583, 51405, 60361, 64024, 62064, 57189, 60056, 60242, 67216, 59973, 65513, 74117, 64918, 58274, 50561, 36955, 27087, 13936, 5226, -440, 1843, 1681, 4829, 7692, 385, -7951, -6493, -8936, -9889, -10638, -7850]
15737g850N972n848j337M267m765j450R213j767j0372j0980M170R145K546m612
15723a3668m532M598J684M709o77q32L222N699K7n644L244P052M575K225N15r90
15707A1207j592m346k214k604j469O746M621L503k653N39k022o63l953L699j146
15692G653k058n52n444p037m255Q736M728K459M399j869n088J495l151n27M002
15677C491q737j878Q82o13J001k81q628L96J3457Q273j015K5k647m309K863j492
15661G88q10L204M953k636j953p099k787k230k99P619O283m257n270p74J310Q75
15645c083l201j327p564L810N708O06R476K557l323m246l421l289K519K875j961
15630c864j381K32m043r75J354j369J201j96O762M048k902n958k655J841k54J541
$$ y = [-7850, -1878, -7726, -9063, -4796, -9561, -11011, -1798, -3565, -13937, -24917, -20747, -11602, -9056, -13668, -18200, -13602, -11918, -7209, -7886, -8718, -5496, 203, 230, -5414, -2170, 4882, 9457, 11682, 12197, 11207, 9615, 5269, 3055, 451, -1018, 5728, 10349, 13852, 11199, 11738, 9716, 9053, 5100, 8799, 7653, 5595, 5043, -401, -7438, -11693, -2957, 1771, 4230, 8629, 6760, 1672, 3167, 16, -511, 3491, -5246, -7124, -6242, -6855, -5854, -6135, -14763, -14367, -910, 7363, 6348, 6373, 3726, -583, 2280, 788, -22, 3182, 8135, 5499, 3546, -3553, -6340, -8570, -8869, -1250, 5033, 776, -4494, -5268, -3958, -3083, -6284, -7611, -15175, -11365, -5657, -5051, 4425, 6982, 3659, -587, -4008, -7297, -4778, -1903, -3864, -5245, -5013, -9056, -10031, -8677, -10046, -8845, -9041, -2279, 1769, -1133, -7091, -9746, -7905, -8159, -6618]
15614f618J528K146J914K612p91k176l165K448Q888M226j0550K04K864r101L775
15599a796J330j898M702M764L680j200j43r054o86L5J189l136n051L213N381k160
15583h30K700j284J251K066j708n864K815J0563J209R90p818r741K294K246K422
15568A311J337q993K178L569J822O199M578n18P78k850k314l8L45j56K123l622
15552E749J011m726j254M829r67m203k865p985j826Q161L324L176Q38l404r84
15537a126N631l148K306k902j548O101j911p001q529k216p9L935K313L09j307
15522i172k194m333l698O52O371O891L145J119m478K846J641k05k100k279O16
15507e178O043n147L694O37M216O003N21o349j0200J645Q03k785m979k726M171
$$ y = [-6618, -5090, -2944, -1030, 1582, 791, -1385, -4550, -2102, 6786, 11012, 462, 666, 3530, -5571, -1796, -466, -2364, 2338, 7102, 10782, 9582, 9439, 385, -301, -266, 923, -2213, -7264, -4051, 1330, -830, 1870, 586, 1837, 3903, 2195, -3669, -854, 9709, 10918, 11908, 4090, -5651, -3357, -1111, 1311, 2648, -6345, -4167, -598, 1224, 7423, 12001, 11483, 12261, 9411, 7097, 7059, 7404, 7248, 9371, 5749, 6760, 2034, 780, 5609, 4642, 439, -2426, -10411, -12237, -4076, -752, 2424, 3262, -142, -1126, 4505, 1357, 3663, 761, -787, 5314, 3403, -3598, -12127, -14343, -14422, -10487, -8174, -7865, -9172, -11366, -15699, -19397, -18745, -12374, -5483, -2338, -1219, -5697, -2851, -1210, -1415, -3515, -5794, -5178, 865, -4282, -588, 49, 4265, 10268, 10789, 4440, -5760, -4115, -3312, -6097, -11076, -13802, -9631]
15492i631P338k213j422o02K696N298K316N01J329O947k841O6Q48k725l367l501
15476A037j364P539O494k00l285o606o027j547k88m831M195j152M583J465j467
15461a454k393j560p184J2591R134q699p46J624N345m581j668K318K383m601j322
15446h13L970J677k897m296o629L256R91j246M330M658K482L241M63M392N057
15431A8636J7936K1607N399L100R476N020j1162q626r009j9208j6656p17k525
15418A3271l441j546l808l131K334O713K742q39J247k205m020p163l672j93J0283
15403F572N549n526m485O395O158K215l40n780p381j134J762K296p49j5K393k029
15387E901m877k114J549J899m854p271L197J987L387N641J802j811q115q172O518
$$ y = [-9631, -2293, -4506, -5928, -6530, -3834, 1464, 3780, 4281, 5610, 12557, 9716, 9782, 10630, 7905, 4538, 1037, -327, 7212, 13706, 13506, 10221, 3615, -2412, -3959, -4247, -9078, -4883, -6035, -1452, 13, -1454, -3847, -5407, -12591, 0, 9134, 435, -311, 1313, 6658, 2077, 409, 2727, 5110, 509, -813, 3157, 4834, 1937, -2359, -8988, -5732, -4741, -5987, -1657, 3001, 5483, 8724, 9187, 13579, 18636, 36572, 58179, 63578, 66678, 76154, 81174, 70012, 61386, 52377, 33169, 16513, 15796, 13271, 9830, 8284, 4476, 1345, 3679, 10392, 13134, 12295, 13542, 11337, 7317, 154, -3518, -3711, 6572, 12121, 6595, 2110, 8505, 14663, 16878, 16538, 10758, 3377, 2243, 4005, 6301, 5552, 5537, 7930, 5901, 1024, -1090, 459, 2358, -2496, -9767, -6570, -4583, -1196, 4445, 6247, 4436, -3679, -11851, -5333]
15372e333P822M39m323k148o298k139j937k196M613P983J898O028k195M27k164
15357D77J04l98p90l373K238L411r088M670M992o67k786p080l011L469N958J909
15341C5L928M40o866n873J022l310N433K414O716n017Q72L21o71k088m280q7K140
15324d871N877k689l314J333O046l420m863J090m524j58O37L640M754n005q383
15309a3850k134K677M346L999L27n41k868p275j432J0517N92l626M220M933j03
15294b18J79k02K422O759n999q346J729N355J244M371j458J727L164o291n994
15279a558n21M653L241N18L327m552k459J249m899l4J660L166L056l610L309k56
15263F290n234k574l664J053K448K727j625K016l272J427j412J353K470L157J395
$$ y = [-5333, 2489, 2928, -1395, -3543, -9841, -11980, -13917, -16113, -11500, -3517, -1619, 4409, 2214, 2641, 477, 581, 183, -607, -3980, -1742, 1669, -7419, -2749, 2243, 1576, -1210, -8290, -11301, -7832, -1874, 35, 3963, 4403, -2463, -8336, -7314, -10624, -5191, -2777, 3939, -1078, -206, 115, -556, -2644, -6924, -7011, -4871, 1006, -1683, -4997, -3664, 2382, -1038, -5901, -4811, -9335, -9493, -8856, -5216, -462, -5467, -13850, -15984, -13307, -8961, -4962, -4635, -5176, -8044, -15319, -16751, -6234, -5642, -9268, -5048, -115, -218, -39, -241, 2181, 8940, 2941, -5405, -3676, 1679, 2923, 7294, 5836, 7563, 10727, 4436, -1558, -2079, 2574, 5815, 6333, 9660, 5108, 2649, 3898, -1001, -1035, 625, 3791, 6847, 3237, 6546, 6290, 1056, -1518, -5182, -4129, -1681, 1046, -579, 1437, -1835, -408, -1820, -467, 2003, 5160, 6555]
15248F555K250m210o024M793O665j774r36J524L8M727R754K814J907J874J082
15233C1039L033N990L140J908K541R530L02l402M517m796l820k741J436p36m621
15218D3320n825q462q175n792p51m545k255m57m815o041J281M356P97J551N8k738
15202A507K005j60r427l399n741p750J0030K864K177N270l538m011j23J580K819
15187e897k742M142j435q766L358N177M145N567p949o374k550l974K806R701P828
15172C037k022n136m928l035j769j347Q416J0391K214j509m810l116k407L749
15158b272O231O542j636M199J49k394o044P23K73K469J318q369l858k01O501R52
15142D583J958O223j156k098m971k777p972o187K270M983P979K593o036j462K827
$$ y = [6555, 8805, 4595, -1429, 3364, 10029, 8255, 7319, 8843, 8881, 13608, 23362, 26176, 28083, 29957, 31039, 34072, 40062, 43202, 45110, 47651, 57181, 57483, 54081, 58598, 53802, 49982, 47241, 48677, 47941, 43320, 37495, 29033, 20858, 15066, 14315, 9770, 7515, 7058, 2243, -3798, -2517, 1839, 2636, 4187, 4245, 1507, 3512, 3352, -6075, -9474, -15215, -22965, -12935, -10071, -7894, -2624, -6162, -10173, -10296, -8716, -5897, -8639, -4497, -5932, -14698, -11340, -6163, -2018, 3549, -4400, -10774, -13324, -17298, -14492, -4791, 3037, 1015, -4121, -9049, -12084, -13853, -15200, -6784, 3607, 5821, 4312, -498, -3614, -6021, -2272, 3959, 10501, 8865, 13064, 13213, 10819, 4775, 5498, 5771, 8240, 9558, 1189, -2669, -2870, 3631, 4583, 6541, 12764, 11608, 9510, 4539, 1762, -6210, -12397, -10127, -5144, 2835, 5428, -608, -2070, 757]
15127G57L896n289k956k378k836j161l284o001L293O230K260K623K287j366n99
15112d524L77K248L073K224l0J802k799N79N192K576r517k346R15L341M219m500
15096B830k603m536M143M241J524l792J536K1j611O476k202L203J547l43N45l244
15080G735k975k096p942j521J041M115K912l410L570K935M1k062l24M815J020
15065G854L7J96j1413m769M552l83l957k567M716N339l678o123M330J2192n465
15050H61j1995J237L876J648j196M170K745o98j798k97K080p347j102N641l690
15035e865j44O902M514k80M164k243o045j3189n495L834J2690M339M495j990q25
15020D862m678l346K836O512J011n045p852K876q76j1569l364k590m757N057J0943
$$ y = [757, 4653, -636, -3592, -5970, -8806, -9967, -13251, -19252, -15959, -9729, -7469, -4846, -2559, -3925, -4524, -4147, -1899, 1174, 3398, 3368, 5170, 2371, 2950, 8142, 10718, 1201, -1145, -230, 3111, 7330, 2830, 227, -4309, -166, 4075, 5599, 1807, 3343, 3364, 1753, 8229, 6027, 9230, 10777, 10434, 10979, 7735, 4760, 2664, -5278, -6799, -5758, -1643, 1269, -2141, 1429, 4364, 4405, 2343, 2019, 6834, 7854, 7891, 8087, -3326, -8095, -3543, -3926, -7883, -10450, -5734, -395, -4073, -10196, -5866, 6326, 861, -11134, -9897, -6021, -4373, -5569, -1399, 1346, 648, -1150, -1447, 633, -6714, -7816, -2175, -5865, -6009, 893, 5407, 5127, 9291, 7048, 1003, -12186, -17681, -13847, -1157, 3182, 7677, 5687, 4862, 184, -3162, -326, 6186, 7197, 2152, -5700, -2824, -3700, -15269, -18633, -21223, -25980, -20923, -9980]
15005i980M255k971P043N815M127j796L708M132r92l293r857j854k201J176J313
14990a375m352O262j748k657M249m336l723l194j200M354N9M85L797M06P930m566
14974C91n275K467l129n645o88N398P562J446k678l962p756K482Q765p974l688
14959a2284O79O879P564J0482J938j540r74m914n175R2J165K24l472q01P379N807
14943A3049J494r215K328l967p01k76j654m08M040Q044L034n64n992k129L312
14928A0395n968j628R827J5535J339m975q088p364P84j642k911m579n345j802
14914f422Q345R188j829k353P26k952m994K98O298K813K213m136l734o541k307
14899e387J1310L294j180l526K510J875N212k42j4942r935k644J1476M903l49
$$ y = [-9980, -5725, -8696, -1653, 4162, 8289, 6493, 10201, 14333, 13341, 10048, 191, -1663, -3864, -2688, -1375, -5727, 535, -1213, -3870, 379, -3957, -7680, -10874, -12074, -7720, -7661, -7176, -3379, -2973, 4957, 391, -4884, -2417, -5546, -11191, -11879, -6481, 1081, 2527, -151, -4113, -11869, -9387, -622, -8596, -12284, -11605, -4726, 2838, 13320, 15258, 13718, 12744, 7830, 2655, 2747, 3912, 4136, 664, -137, 7242, 13049, 14543, 5328, 7656, 3689, 2988, 2712, 1058, 650, 4690, 12734, 15768, 15204, 9212, 7083, 10395, 4427, 2799, 12626, 28161, 29500, 24525, 16437, 9073, 9857, 8215, 5304, 725, -4620, -6422, 1923, 11111, 9282, 6929, 7655, 4703, -291, 7, 6305, 9118, 11331, 7195, 3461, -3080, -5387, 5923, 9217, 8037, 4511, 7021, 8896, 14108, 13866, -1076, -11011, -13655, -2179, 2724, 2375]
14885B375n881j361n222L892J0568l872K920J120j013m145q2l379Q41L957m943
14870d225K939K250l412l899o304p567M665J0980J614J655J087r214p530K241
14856a4720K902r03j486O948O579N70k426l057k304k135o18P49K395N98K456J507
14840b945L802l456k946l234K409q05k813l661O64K423j351k556M037Q847K055
14825D70P276R228L258o689q423k452Q215M307j1994r681Q48J0410M567j1134
14811a794r784n283L565J749M196M00j698L563O158Q102Q8o323q246l626P482
14796a451O627N078n521j0145K119N86K16l47M457O1P27K218q76m459m111L092
14780a729L073R63M654m876m9M143k251m091M330r01p687K5N91k155j252j909
$$ y = [2375, -3506, -4867, -10089, -6197, 4371, 499, 3419, 4539, 3526, -619, -701, -4080, -3239, 718, -4225, -1286, 964, -2448, -6347, -12651, -20218, -15553, -4573, -2959, -1304, -217, -9431, -16961, -14720, -11818, -12721, -14207, -7259, -680, -110, -2536, -5593, -7897, -10032, -10650, -9901, -7506, -6908, -4452, -2945, 857, -2599, -5545, -8779, -6370, -7175, -9988, -13649, -12985, -10562, -11913, -14469, -10432, -1585, 470, 7746, 16974, 20232, 13543, 5120, 2668, 10883, 15190, 3196, -6485, -5637, 4773, 9340, -1794, -11578, -16861, -13296, -11547, -7351, -6951, -8649, -5086, 1072, 9174, 9262, 2939, -5307, -8933, -1451, 5176, 10254, 4733, -5412, -3293, -2707, -2491, -2838, 1619, 1680, 2407, 4625, 3749, -710, -4821, -1729, 1344, 2307, 6961, 2085, 2036, 6179, 3928, -163, 4167, 3266, -4421, -4396, -3805, -5960, -7212, -9121]
14764i121m092l709J241Q79O932P538k684n901k899K665j621N643N828P83j284
14749A98m964O879J983q188k243R270M745J702n018J726K805l662l297J239l60
14734B815l949K358J4K344O814M82l855m5l532q04l842o591j344N88k945N479
14718f013J2368j588o904n486K577M025n098m307J661K702n819n8L535O733O690
14703E018m149o173q029P389j275j589P83k679o07O68l831O61N893L995j708n87
14687f220J726P86l22j991P85P682r39k872J224j155P405j677K031K484n455o167
14671b675M28L835k993k430N43P221L826K010k169q60O903j218j0211l518l84
14656a692J172L748M009K877m481o580J860K392k486m029L172o566j855R336P11
$$ y = [-9121, -13213, -16922, -15681, -14802, -7870, -332, -3016, -8917, -11816, -9151, -10772, -5129, 699, 1482, 198, -4766, 2113, 4096, -4092, -6335, 2935, 7680, 9382, 4364, 6090, 8895, 5233, 1936, 3175, 2815, -1134, 1224, 1238, 3582, 10396, 10878, 7023, 6978, 3446, 2642, -1200, -7791, -9135, -8547, -11492, -6013, 6355, 4767, -2137, -7623, -5046, -1021, -6119, -10426, -8765, -6063, -11882, -11940, -8405, -1672, 5018, 869, -5304, -13333, -5944, -7219, -8808, -8025, -10704, -11311, -10643, -14474, -13813, -7920, -3925, -5633, -6220, -4494, -3708, -4030, -6021, -5236, 2446, 1507, -1365, -141, -1296, 6109, 4432, 6463, 8947, 3492, -2675, -2247, 1588, -1405, -3835, -3292, 3929, 7755, 9765, 7596, 6736, 13639, 12421, 2210, -1308, -1692, -520, 3228, 7237, 10114, 5633, -947, 913, 3305, 819, -3210, -38, -6604, -8459, 877, 1588]
14641A588m543p855K260P403P904J851n851j2799p77j064P003K268n264K480J142
14626d254k252J562K006n528j210P061j038L336N491n91K87m041l600n310J737
14611f344k306p44L050L380n508n052M664M558N348j071O147l8j509K06k792l452
14595a463L508j515n29K673K986J235P191K245n430j795j597n000l039M695j780
14580B385m135K69k691k742j931j145l760O706q19J027P911N050K68r238l487
14565f332k288M030O408n504P80k244N04J47m239M921J775O12R38l286k53O461
14549B430J570n862m450J292J378N556M779L533j530P30k411J419l016q100J477
14534a205o671m255J330O689L301l866Q504K821o207J53M582PJ158J225m141k788
$$ y = [1588, -2955, -10810, -8550, -1147, 6757, 8608, 2757, -10042, -10819, -11883, -4880, -2612, -7876, -5396, -4254, -6506, -4944, -2938, -8466, -9676, -2615, -3653, -317, 5174, 4583, 4870, 829, -2771, -8081, -6344, -8650, -9394, -6344, -2964, -8472, -13524, -8860, -4302, 1046, -25, 6122, 6084, 4575, 4781, 1989, -1463, 2045, 530, 1, 2674, 5660, 6895, 14086, 16331, 10901, 9106, 7509, 2509, -530, 4165, 2385, -1750, -1481, -4172, -6914, -8845, -9990, -13750, -7044, -7863, -6836, 1075, 6125, 6393, -2845, -6332, -8620, -4590, 1818, -3686, -2906, -5150, -4646, -4499, -8738, -3817, -2042, -1430, -492, -3778, -4031, 2430, 4000, -1862, -6312, -5020, -3642, 1914, 6693, 10226, 8696, 9426, 7015, 8434, 5418, -2682, -1205, -7876, -12131, -10801, -4112, -811, -4677, 3827, 6648, 441, 594, 5176, 5183, 6341, 7566, 3425, 637]
14518F37k20k909k159j354K499Q179L625P42q97k505n88l730n763n170r50M31
14502a0132K459M4L535m336n753J481K757O262J1058O425p063m474l407L497o719
14487d366k280L68o710P40j131J815J2946L922n697n03r32M641J137j072K687
14472E565R68j615j005l212L84J013L241r50n040J441k741P31R585p43L25l784
14456D163k888l700r019Q61L014j963O320k42M879J029j158j322m936n965J71
14441a0756P43m528M702L796O311M215L105q37l961m862l345L076P425L723N755
14426A4562J950n373j1288K522M424K45n699l042J524k52m859R29Q681J295j41
14411E478k507l895O88R347n514q469l600k777k056L865N71N398L505L94L99O319
$$ y = [637, 417, -2492, -4651, -6005, -3506, 4673, 8298, 9040, 8143, 5638, 5050, 1320, -4443, -9613, -10563, -10132, -7673, -7629, -4094, -8430, -14183, -12702, -9945, -3683, 7375, 13800, 6737, 2263, -1144, 2353, -4366, -6646, -6278, -12988, -12248, -13379, -11564, 1382, 5304, -393, -896, -1828, 2813, 3950, 2878, 5565, 6533, 4918, 3913, 701, 1085, 2098, 5339, 4389, -651, 790, -1951, -1220, 8365, 7622, 7947, 4163, 1275, -2425, -11444, -10583, -7569, -9532, -3212, -3454, 1425, 2454, 1296, -26, -4962, -10927, -10756, -10013, -14541, -9839, -6043, 268, 4483, 7588, 6751, 2790, -2072, -5417, -2341, 5084, 8807, 14562, 16512, 11139, -149, 2373, 6797, 7042, 1343, -1699, -175, -427, -5286, -4357, 4324, 5619, 5478, 2971, -924, -236, 9111, 3597, -4872, -8472, -11249, -13305, -9440, -8869, -3471, 34, 428, 827, 7146]
14395G146k371j071j7n88k10M131M276J154l6m719n009N4N081j480n120K45j201
14378B65k828k178n086L697n98K929K118q93L948J1438Q36n492k668j0058k689
14363g259P921O249J913k147o210j347n763j024L865N518N012j646O614M010m688
14348A1018j1242n043j238L342M984J0090p81p909J31q35n163K018q63M997J704
14333E210L67m107K302N695n679q574q803N955R597Q637k94o872k700M513k091
14318C156L468m605q198L204K528j040L408n12l154j988N6j549k392P523K385
14303B290m338n633K299M143l909k34O567O581K625L423q094J242j396r618J429
14288b623O527R77o009j3034p503N388P719O825j852K765r63o857m84K581P398
$$ y = [7146, 4775, 3704, 3687, 3099, 2889, 7020, 11296, 12450, 12414, 7695, 2686, 2740, 7821, 6341, 1221, 1466, 265, -2563, -4741, -9827, -6130, -6728, -3799, -1681, -2574, 1374, 12812, 13648, 8156, 5488, -4570, -7259, 662, 6911, 8824, 6677, 467, -880, -6643, -7667, -3802, 1716, 6728, 5082, 11696, 15706, 11018, -224, -5267, -6505, -3163, 1821, 11911, 11130, 3221, 3352, 2517, -2646, -628, -1491, 3506, 5210, 5577, 1470, 3772, 9467, 3788, -4786, -13589, -7634, 1963, 10600, 10306, 3434, 734, 5247, 3156, 6624, 2019, -6179, -2975, -447, -1487, 1921, 1409, -1745, -3733, -3677, -5226, -7618, -95, 2290, -2048, -7681, -5382, -1239, -5148, -5382, 1185, 7766, 10391, 13814, 5720, 6962, 5566, -4052, -2623, 3904, 4881, -1128, -14162, -21665, -16277, -8558, -1733, -3585, -820, -1783, -8640, -9124, -6543, 855]
14273H55M72K114O436J431o227l129n130L884J513K901N955j593r104j2072m569
14258a6263M373J1571j152J586j668K047m540N622J2664n955l460N521O084K104
14244A8534P624J0468M212l208j872m832j2152q792p597Q49P704q054j009R439
14230A1314j326j0317l673m620K93N385K206M854j091o419q011k459L280Q693
14216a891L90J564o82k022K234N226M69n369o121k748P527J0186O10j103n792
14201B478n905L884J0o06l428L838K465O465j836M157n1p820o369J866k573k459
14185e884n74O462M393l547j826J534N791J247o869q299l425J580J1335O303m943
14170C278k585J139k695L858L830k94l782J95k073N803J444n177l415R76k113
$$ y = [855, 1327, 3441, 9877, 11308, 5081, 1952, -3178, 706, 2219, 5120, 11075, 9482, 378, -11694, -16263, -11890, -319, -1471, 115, -1553, 494, -4046, 1576, 14240, 8285, 4825, 10346, 16430, 18534, 26158, 36626, 40838, 37630, 35758, 30926, 18774, 9982, 2385, 3234, 10938, 2884, 1875, 11314, 9988, -329, -4002, -8622, -8329, -2944, -738, 4116, 3025, -3394, -11405, -13864, -10584, -1891, -1501, 63, -619, -2641, -407, 4819, 5288, -81, -6202, -8950, -1423, 8763, 9373, 8270, 2478, -3427, 457, 467, -139, -3567, 271, 2736, 9201, 7365, 11522, 11471, 3651, -2718, -852, -3425, -5884, -6458, 4, 4397, 850, -976, 558, 6349, 7596, 727, -7572, -10997, -9417, 1918, 8221, 3278, 693, 1832, -863, 2995, 6825, 6531, 2749, 2944, 871, 6674, 8118, 2941, -474, 502, -1611]
14155a611J1516Q974J773n103q178k513l5n142m852k256l814M430N686l831K29
14140d727O56M082k223K536M941k754l008Q249j708k711K816l355p007k040q03
14125g056M22j497l578N412R221M975M002M353m550q813n443J079K667N255N407
14110A1856j0354q991J123O451M877L175o96j268j638n508n44J278K904K997M228
14095I890J974Q26j697n32k294l840o368N442O877N10l016j674l782j485J261
14080B092m103J753p29k386P40K024q68m55L742N81K596K757j516m628k440J120
14064B80N13J148Q651L4J476K893l048o60o217K765J269k609l51j285K494m18
14048F935l687k961l533Q384M311o065m462K750K325p488Q71K595J218L36n034
$$ y = [-1611, 9905, 18879, 20652, 15549, 7371, 4858, 4823, -319, -5171, -7427, -11241, -6811, -1125, -4956, -4727, -4071, 11, -2212, 324, 5265, 2511, -497, 7752, 6044, 3333, 6149, 2794, -4213, -6253, -7056, -6634, -8131, -11709, -6297, 2924, 7899, 11901, 16254, 11704, 2891, -2552, -1473, 1194, 6449, 11856, 1502, -7489, -6366, 85, 4962, 8137, 7441, 6173, 4535, -973, -1517, -239, 2665, 5662, 9890, 11864, 12690, 10993, 10461, 8167, 4327, -2041, 3401, 10278, 10788, 7772, 6098, 2316, 831, 2092, -2011, -258, -987, -3373, -2633, -609, -1477, -1932, 1810, 2391, 4987, 7744, 6228, 1600, -840, 280, 793, 1941, 10592, 10626, 12102, 14995, 11947, 11287, 5070, 7835, 9104, 6495, 6144, 4859, 7353, 6935, 3248, 287, -3246, 5138, 9449, 3384, -1078, 1672, 3997, -3491, -2620, -25, 1193, 1529, -3505]
14033c505J82M318l870m270k97N111M756M983l841o83q169l688P356R89l267l71
14017d266Q34O7P425j345j579p917N93M078M667J422j394n732L55L685O177M262
14001A1332L016j906n576J025l9j20n788q835m625J048k36J774J790L150O384
13986B394K950L952N953M754J2480K698q20r20J009J939o369j3378j1185m566
13972H91k532J094M277j592m313J424L315N859J666p323n186M831M120j337K98
13957E492N915n752L082M140Q90q267n575K879O953k87k965k22Q57q54j230k517
13941B539j284o7k080J730L192Q020M648k812l672j70N934K549j047r586r30k637
13925D327K438J456n953n945O229j939q14Q189O171n050j732N811L404k522K39
$$ y = [-3505, -3323, 995, -2875, -7145, -7442, -2331, 2425, 7408, 3567, 2884, -5285, -8973, -1617, -628, -3895, -4266, -3432, -3365, 4060, 2715, 1136, -6781, -6188, -2110, 2557, 3979, 2585, -3147, -2792, 893, 7070, 11332, 14348, 12442, 6866, 7891, 7852, 7732, 1944, -6891, -11516, -10468, -10704, -8930, -7140, -3990, 2394, 5344, 9296, 15249, 20003, 32483, 35181, 34361, 33441, 34450, 36389, 30020, 16642, 5457, 891, -1641, -547, 3730, 2138, -2175, -751, 2564, 8423, 10089, 2766, -2420, 2411, 6531, 5194, 5492, 11407, 5655, 8737, 12877, 13767, 5500, -75, 2804, 9757, 9470, 6505, 6283, 7140, 6286, 5056, 2539, 1255, 1188, -892, 838, 4030, 12050, 16698, 13886, 10214, 10044, 15978, 18527, 17480, 7894, 6964, 4327, 6765, 8221, 2268, -3677, 2552, 613, -201, 7988, 14159, 9109, 7377, 13188, 16592, 14070, 14309]
13910A4309k188j258m151P001R07o805j600k481N29m514l644M308M459K324p919
13895g23m540L604J274J307P79J902n160o926O19O853J0066K087k229m10j969
13880F534l219p9k661P55J691L88m428k324k557M148P855O53N076j3k641o96J750
13863A0232R79l244J735J475r501J024j545l343R295Q424J102k571k049o826q215
13848c028m339J2598J6101Q309r405q839J007j873m259p148j720P593K972n11
13834G458j820j408N239l495j953p678j832K912N768K890M19o44k30N270K387
13819A3283R66l50j211j618m035k961p73Q23k087Q156K572L40J300O414k556n079
13803A3184J215j470l133n339J432N430m12L154N91j0137j040J704k838p870o208
$$ y = [14309, 12121, 10863, 6712, 13713, 14620, 7815, 6215, 3734, 4263, -251, -3895, 413, 4872, 7196, -723, -5263, -1659, -385, 922, 1701, 3603, -1557, -8483, -7864, -1011, 9055, 11142, 8913, 8503, 6534, 3315, 3236, 575, 1330, 3021, 3409, -1019, -3343, -5900, -1752, 6103, 6756, 11832, 11819, 9178, 8482, 10232, 11211, 7967, 9702, 11177, 1676, 2700, 1155, -2188, 7107, 15531, 16633, 14062, 12013, 5187, -3028, -7367, 5231, 21332, 29641, 20236, 11397, 12404, 10531, 6272, -876, -2596, 4997, 7969, 7458, 5638, 4230, 9469, 5974, 4021, -3657, -5489, -2577, 3191, 6081, 6500, 5856, 5626, 10896, 13283, 14249, 13899, 12688, 11070, 7035, 4074, 3301, 4124, 2037, 10193, 12765, 13105, 14405, 20819, 18263, 13184, 14399, 12929, 9796, 4457, 5889, 11319, 10907, 14061, 14652, 4515, 3475, 5179, 2341, -5529, -11737]
13788a1737J555j615J265P193J3377J240l22K456o064n177K50P955k076p015k266
13773i81O03N583P20K53l33j2344l548P401O07m207J899M378R668J395m72m206
13757F416l24O886M557M055N419k806j3812j0312N316L259N14K296J816k289K417
13742A3408l308j450k012k515l693m81j191J762J316n567k668P71N428p953L017
13727e136N958J080K613M38l723P50L874j105L221M789k9p420o644k350j178r3
13711d955K130J156K25p71O040O235J42q08k26O562L181q253l224P140O504K73
13695B1351k254j586l954l951k943J0783l924m571J195m184n342l186J1269J0357
13681A9060l95p906L94n605n182k150m758L022M339K783J571K289R582L148j0112
$$ y = [-11737, -10182, -11797, -10532, -3339, 10038, 11278, 10956, 13412, 7348, 2171, 2421, 10376, 8300, 1285, -981, -378, 5205, 5925, 6178, 5845, -6499, -10047, -2646, -2039, -6246, -4347, 31, 9699, 11094, 10622, 6416, 6092, 12978, 17535, 21590, 27009, 24203, 10391, 79, 5395, 8654, 9168, 11464, 13280, 10991, 13408, 10100, 8650, 6638, 4123, 430, -51, -1242, 520, 1836, -3731, -6399, -5628, -200, -8153, -5136, 822, 1902, 4515, 4953, 1230, 1980, 5854, 4749, 7970, 12759, 12730, 5310, -1334, -3684, -4862, -4955, -2825, -1669, -1444, -2215, 3825, 10060, 10202, 9394, 9168, 15730, 18911, 10658, 7434, 14574, 21078, 21351, 19097, 17511, 13557, 9606, 6663, 17446, 13522, 8951, 10146, 5962, 620, -2566, 8703, 19060, 18665, 10759, 11153, 5548, 366, -1784, -6542, -3520, 819, 3602, 5173, 7462, 17044, 20192, 10080]
13666A0080k605J671k7P909R752P068O110J870p234n35L066j623k606p145j944
13651B3807J378k457r502k749R840j546r63On13M781l941P91N100m019P786P521
13635C5320K039r993r346o747L772N942J227O149j83K226R040O721q77L396J522
13620E0208j364k724o128Q00N801l828p350j2965n419M389J842j2810m728N826
13606A1550M251l029N724N164L587O88K58R213m304n585k867K020N30R61m00J0261
13590C8022M742N081O650J1106J5089M215R093J5819J3412K0735M6361P3099J11782
13577C75206J63257J99504K25912K63429K08317J13386O9843n9170j92702k10195
13567A156787k33583k41350j84799j38742j00728o5261m2251k4023p824m713n611
$$ y = [10080, 7475, 9146, 9119, 17028, 26780, 33848, 39958, 41828, 34594, 34059, 37125, 35502, 32896, 25751, 23807, 25185, 22728, 13226, 10477, 20317, 18771, 17808, 17814, 17301, 22082, 18141, 18932, 24032, 20013, 27799, 35320, 37359, 27366, 18020, 11273, 15045, 20987, 22214, 28363, 28180, 30406, 39446, 46167, 45290, 48686, 50208, 48844, 46120, 39992, 40792, 46593, 42765, 35415, 22450, 17031, 21420, 23262, 10452, 5724, 11550, 15801, 12772, 18496, 23660, 27247, 27935, 28193, 37406, 33102, 27517, 24650, 26670, 27200, 28161, 27761, 38022, 42764, 47845, 54495, 65601, 80690, 84905, 93998, 109817, 123229, 143964, 190325, 263424, 375206, 538463, 737967, 963879, 1227308, 1435625, 1549011, 1618854, 1559684, 1366982, 1156787, 923204, 681854, 497055, 358313, 257585, 192324, 150073, 126050, 118226, 113513, 107902]
13556A07902p770j1169q853p351o48Q897k875r242l899j957j848l561O24K165
13542F0415K878p347r492J100K375L385j894k75n330q202L694M33K358o31o450
13527C7017m555K129L407j660k008N920p90l595K404L125l389J50L999K608k564
13512D2198j305q627J559Q290O99k482P20L026o600o84J1123N799n366k382l59
13497D5609r38O6l691l045m347q507o108L991M976k874q103n227J925p36K322
13482A5313J0792J3110K381p751l803m476k777o658n839r472n047k341q204k799
13468a7571p805k713K58k380k820J0340O425o84J977J2640J3969J3966P88j355
13454B5035L002L493l691l933L941J037p062k878M654M797Q091R468j804Q078
$$ y = [107902, 100132, 88963, 80110, 72759, 72111, 81008, 78133, 68891, 64992, 63035, 61187, 57626, 58250, 60415, 63293, 55946, 46454, 47554, 49929, 53314, 51420, 51145, 45815, 37613, 41307, 41740, 44098, 43467, 37017, 32462, 34591, 37998, 36338, 34330, 40250, 39460, 35865, 38269, 41394, 38005, 38155, 42154, 44762, 42198, 40893, 32266, 33825, 42115, 42814, 40332, 41052, 44078, 37478, 36794, 47917, 53716, 48350, 45968, 45609, 44671, 44737, 41046, 38001, 33654, 25147, 19039, 23030, 28006, 25132, 17029, 11802, 13727, 12991, 15313, 26105, 39215, 41596, 33845, 30042, 25566, 22789, 16131, 10292, 820, -4227, -6568, -14772, -17571, -25376, -28089, -27831, -30211, -33031, -22691, -16266, -16950, -14973, -2333, 11636, 25602, 26390, 25035, 28037, 31530, 27839, 23906, 27847, 28884, 21822, 18944, 23598, 28395, 36486, 45954, 44150, 52228]
13440E2228N37n0K519k286m204l095m537m343j1178n462L169M792Q4j656J1265
13425C7783L937q01L986k624q93J52q387k620J0111N777L661Q383R046N434K684
13410G5629R730J4324J1895K2291K3964K2073J2203N312r75j4292q534j1909k2164
13397A39547j8474j1637j6065q777j0847j2098r382j835j0290o345m298j101j151
13384B7247p970P146Q076J1741J2956M842j290k150j2118k184Q70R550N040M591
13370F6347J7090J4849O740L086N799J2419N237k719k50J1410J2624j963J449
13357A52118J1424J6197R820J4730O954p31M629O02L752J6781Q926N521J1653
13344B62376O545k3328k6667l8840n1514m3872l6741m4317l0442j8273r230r225
$$ y = [52228, 52765, 52715, 55234, 52948, 48744, 45649, 41112, 36769, 25591, 20129, 23298, 28090, 28174, 26518, 37783, 41720, 40919, 44905, 42281, 41388, 41540, 33153, 30533, 40644, 46421, 50082, 58465, 67511, 72945, 75629, 85359, 99683, 111578, 133869, 157833, 179906, 192109, 197421, 196446, 182154, 173620, 161711, 139547, 121073, 109436, 93371, 84594, 73747, 61649, 52267, 50432, 40142, 33797, 29499, 28398, 27247, 19277, 26423, 34499, 46240, 59196, 64038, 62748, 60598, 48480, 46296, 47166, 56716, 61756, 66347, 83437, 98286, 105026, 108112, 113911, 126330, 131567, 128848, 128598, 140008, 152632, 150669, 152118, 163542, 179739, 189559, 204289, 211243, 210512, 215141, 215743, 219495, 236276, 245202, 250723, 262376, 268921, 245593, 218926, 180086, 128572, 84700, 47959, 3642, -26800, -45073, -54303, -63528]
13332f3528n677k654p100k906o060J641O216K460P835J0685M264P071o573j0360
13318f4686m476j502j0776j2639j5814k6470k7436j6402r806k639P855J8366K4721
13305a41704L5570L2432L8183K5145J2727R344k581l734J512j95n071J626O238
13292I492M981K187j118l45k617j576p250q354j4240R77J2359j190K0860K7377
13278D1543K2703L1688K3123J5173J7241R791K652p45L314J55J0183J0505m815
13265A82511Q7M112L041k23o427j0423o285o852j0877o506j908N994L416R459
13251A59119R015J1176Q384O302P683N612k550j635m343m819K030J2799J4872
13238B23645J0189N346J680M780k012m500Q46j492o106r558p63j333L417J6232
$$ y = [-63528, -69205, -71859, -78959, -81865, -87925, -86284, -80068, -77608, -69773, -59088, -54824, -47753, -54326, -64686, -69162, -70664, -81440, -94079, -109893, -136363, -163799, -180201, -190007, -192646, -184791, -166425, -141704, -106134, -73702, -35519, -10374, 2353, 11697, 9116, 5382, 6894, 6699, 1628, 3254, 9492, 14473, 16660, 15542, 15197, 12580, 11004, 3754, -4600, -18840, -17863, -5504, -6694, 14166, 41543, 64246, 95934, 119057, 134230, 151471, 161262, 163914, 163169, 166483, 166638, 176821, 187326, 182511, 182598, 186710, 189751, 189528, 183101, 172678, 166393, 159541, 148664, 142158, 140250, 146244, 149660, 159119, 168134, 179310, 187694, 193996, 201679, 207291, 204741, 203106, 198763, 193944, 195974, 208773, 223645, 233834, 239180, 240860, 245640, 243628, 239128, 239974, 238482, 232376, 222818, 222055, 220722, 224139, 240371]
13224B40371L630l111J5707J2587R616J8092J4313K225R918J7268J7148K0017
13212C77781K5148L6535L2323K6778K1059J4250J2404J0429R969M831J1592K4649
13200F07748K8182N0223M4691O0010O8551O7565O1013O6103N2631N6051O2364
13189A225132O2449P8270J02069J42765K05699K87972L47929L83876M79307M72788
13179C788256L82998L98646L49381K85629L65881M58878O33949P92728Q38078
13170H294424R74643R52897P85096Q18811Q22387R41691J414083K147612L294293
13161B0445937N177575Q415461J4350835K4596975L5468442L8143303M4621672
13154A91220200M9457287L0968926J6403177Q565883j8805470l4984827l8228026
$$ y = [240371, 244001, 240890, 256597, 269184, 278800, 296892, 311205, 313430, 323348, 340616, 357764, 377781, 402929, 439464, 471787, 498565, 519624, 533874, 546278, 556707, 566676, 571507, 583099, 607748, 635930, 686153, 730844, 790854, 859405, 926970, 987983, 1054086, 1106717, 1162768, 1225132, 1287581, 1365851, 1467920, 1610685, 1816384, 2104356, 2452285, 2836161, 3315468, 3788256, 4171254, 4569900, 4919281, 5204910, 5570791, 6029669, 6663618, 7456346, 8294424, 9269067, 10221964, 11007060, 11825871, 12648258, 13589949, 15004032, 17151644, 20445937, 25623512, 34038973, 48389808, 72986783, 108455225, 146598528, 191220200, 240677487, 271646413, 288049590, 296615473, 277810003, 242825176, 204597150]
13147B04597150m5242795m2209083l3488691k5419383j6263968r680585n979419
13140B6313226l887894k536768j638628j279743j047737q61674j097686j214952
13132A2748144j174262j305234j227926j002659q11786o14363l85669k29588k49385
13123E747272k56829k85869m29499m75068m74713m98824m35913l64436l13553
13114B212568k40703j95270j69296j43445j04701q9030o6311m8504m2158m2347
13104A070803l8330l6901n3754n7959n1094m6776n6637l8110j9211l0966k5740
13093F15325r282q104n419j4453j5261j1302j7274j3320j2335j4589j5284r012
13081D69690j1769j1621j4153m680l610j1898j5318j9671k4843j4277n702o492
$$ y = [204597150, 159354355, 117145272, 83656581, 58237198, 41973230, 32292645, 26313226, 22425332, 19888564, 18249936, 16970193, 15922456, 15060782, 13963096, 12748144, 11573882, 10268648, 9040722, 8038063, 7226277, 6611914, 6226245, 5996657, 5747272, 5490443, 5204574, 4775075, 4300007, 3825294, 3326470, 2890557, 2526121, 2212568, 1971865, 1776595, 1607299, 1463854, 1359153, 1270123, 1203812, 1155308, 1113150, 1070803, 1032473, 995572, 941818, 883859, 832765, 785989, 729352, 691242, 672031, 641065, 615325, 606043, 597939, 592520, 578067, 562806, 551504, 534230, 520910, 508575, 493986, 478702, 469690, 457921, 446300, 432147, 427467, 423857, 411959, 396641, 376970, 352127, 337850, 332148, 325656]
13069C25656j0469j6430j4020p337o410l445K122L5k409j1230j1243j4653n711
13056B24456j3133r336J859n509R09Q695J0871k209r387o520o839j5036k1114
13043A57707j4101j642j2252j4121j1788n463M237L976L693k456l397P451M978
13030A16822R232J3317J5068J9922K3809J9323K3167K9501J1424O313k555k0417
13018B64926j7389j5112j6692j1698q629J957o466l759m313m235o311n950K898
13005A69227L84l732o404M202K0581J9300K9484L5916K3184K7468K6191J2590
12993C58391J781n747k3420k7771k8250k1869j3913j0876r937j858k917l461K580
12980B12733L596O392L041Q010M863j0070n647n731n446j0581j6142j9198q889
$$ y = [325656, 315187, 298757, 284737, 277400, 270990, 267545, 269667, 269702, 267293, 256063, 244820, 230167, 224456, 211323, 201987, 203846, 198337, 199246, 207941, 218812, 216603, 207216, 200696, 193857, 178821, 157707, 143606, 141964, 129712, 115591, 103803, 98340, 102577, 106553, 110246, 107790, 104393, 111844, 116822, 126054, 139371, 154439, 174361, 198170, 217493, 240660, 270161, 281585, 287898, 285343, 264926, 247537, 232425, 215733, 204035, 195406, 197363, 190897, 187138, 182825, 178590, 172279, 166329, 169227, 169611, 165879, 159475, 163677, 184258, 203558, 233042, 268958, 292142, 319610, 345801, 358391, 360172, 354425, 331005, 303234, 274984, 253115, 239202, 228326, 218389, 216531, 213614, 210153, 212733, 216329, 222721, 225762, 233772, 238635, 228565, 222918, 217187, 211741, 201160, 185018, 165820, 156931]
12967A56931j6238k0063k1233m3925m7751m0384m5803m0172j3398j1744M127K0573
12955a19080J7680R612M311K372J123p67k580O279J8460R165N740O543K832j314
12941c9624O055j292j763Q828N540J1123P624J7452R024J0835J773J658n957K950
12927C4226L25L291M364q06K191Q360Q897O392j75k884k102rJ05J699n557n586
12911E2731k272k174l862N92K189K805M33k616L676N784K12j064R2J039K475K808
12895F2848J720K157j0767m588j077j986Q198J005l487n25R427k211j5755m479
12881D0480k260k309m426K501O755L626m627m731K933o56M519j169k935k579j0488
12866B4634n303J906q38K814M182M225O298N868R727M33K792o137p997r856l547
$$ y = [156931, 140693, 120630, 99397, 55472, 7721, -32663, -78466, -118638, -132036, -143780, -139653, -119080, -101400, -91788, -87477, -85105, -83982, -84749, -87329, -81050, -62590, -53425, -47685, -41142, -38310, -39624, -33569, -34861, -36624, -27796, -22256, -11133, -3509, 13943, 22967, 33802, 35575, 37233, 31276, 34226, 34551, 37842, 42206, 41400, 43591, 51951, 60848, 67240, 67065, 64181, 62079, 62070, 62175, 63874, 58317, 52731, 50459, 48285, 44423, 45015, 47204, 50009, 50442, 47826, 51502, 57286, 57498, 56434, 56526, 57565, 60040, 62848, 64568, 66725, 55958, 51370, 50293, 48307, 56505, 57510, 54023, 53498, 62925, 60714, 44959, 40480, 38220, 35911, 31485, 33986, 40741, 44367, 39740, 35009, 37942, 37286, 41805, 40636, 37701, 35122, 24634, 19331, 21237, 20399, 23213, 27395, 31620, 37918, 43786, 53513, 53946, 56738, 50601, 42604, 32748, 29201]
12851B9201l090k506O642L476K51K543J2204Q924P184J1670K105M503K83j013
12837H2377o235j1872o580K541j803q523j2725m794l511P8r01l235n317o410p41
12822A2349N484P310Q632J1865N672l619k344K017K714L272j2829j0823l956J15
12808B5859n631j674k901p775q384k163M211L525L601J2596L658k01J1470Q564
12794D4755K998k96N695O248K984K156m508k617l928n087q947k076R59o560J40
12779C1916k224J362j649J737M470M034o498j3344o333K256k654K016K506L332
12765B0927j51j355J0495K329Q474j908q707n287l714k273P292N739J2987J0435
12751E5283M000J936p097K622Q319P370K689j680k097J1186M210J34M851Q240
$$ y = [29201, 26111, 23605, 30247, 33723, 33974, 36517, 48721, 57645, 64829, 76499, 78604, 83107, 83390, 82377, 76142, 64270, 57690, 60231, 58428, 49905, 37180, 32386, 28875, 28953, 28052, 24817, 19500, 13090, 12349, 17833, 25143, 33775, 45640, 51312, 47693, 45349, 47366, 50080, 53352, 40523, 29700, 25744, 25859, 20228, 18554, 15653, 7878, -506, -2669, 1542, 5067, 8668, 21264, 24922, 24721, 36191, 44755, 47753, 47457, 53152, 59400, 62384, 64540, 60032, 57415, 53487, 48400, 39453, 37377, 38336, 31776, 31916, 29692, 31054, 29405, 31142, 35612, 39646, 33148, 19804, 13471, 15727, 13073, 15089, 17595, 20927, 20776, 19421, 29916, 32245, 40719, 38811, 30104, 24817, 21103, 18830, 26122, 31861, 44848, 55283, 59283, 61219, 54122, 56744, 65063, 72433, 75122, 73442, 71345, 82531, 86741, 86875, 91726, 99966]
12737I9966J5215K8051M0309O9423J18461J69982J92063K27282K63817K07379
12727A431948J12121N4008p0121j89383k14704k40768k28537j79418j37848q8496
12717B48802m6151k9414j8440q583o479r553j2890p112j292m839q829j1772p649
12704G5799j3150p880M02q48k831l046M130M858j2200r723l332L88n073o595j2535
12689H364j2937J198k765r515l983k909N905M375P29L054Q018j690J975L400K817
12674F036l333N299p642q56L03l906O543Q300J731K196M957L761k151K542J717
12659B5497p422n770J579n191l165j047L05k651O21K596J955n101k18N3J357n000
12643a602K266N371P852n59n970j175p61j1M127k687j504K708Q756K371o779n610
$$ y = [99966, 115181, 143232, 183541, 252964, 371425, 541407, 733470, 960752, 1224569, 1431948, 1544069, 1598077, 1527956, 1338573, 1123869, 883101, 654564, 475146, 337298, 248802, 202651, 173237, 154797, 146214, 139735, 130182, 117292, 110180, 108888, 104049, 95220, 83448, 75799, 62649, 54769, 55171, 54323, 51492, 48446, 52576, 57434, 45234, 35511, 32179, 32567, 27494, 20899, 8364, -4573, -3375, -6140, -15655, -19638, -22547, -16642, -12267, -11538, -8484, -466, -2156, -181, 3219, 6036, 2703, 8002, 360, -496, -193, -4099, 2444, 10744, 12475, 14671, 19628, 23389, 21238, 23780, 25497, 18075, 12305, 13884, 8693, 5528, 4481, 4786, 2135, 2756, 5352, 7307, 2206, 1988, 2041, 3398, -1602, 664, 6035, 13887, 13328, 7358, 6183, 5422, 5411, 9538, 6851, 5347, 8055, 16811, 19182, 12403, 6793]
12627F793K404n30N614L489j838n354P0m321R03l251M398O779M469l101j60L91
12611A6755M002l907j0016p297K773M006K327O640J702j804j721q036k09L726
12597H941P790K634J141p353p77Q383K72L063j780j847k755l046m179n424l118
12582A945P821L755j921r621l828J679J0105O984J759l428M376l648p088k261
12568F629O431P979j108o053m482k056J0129O398k479k590k094m647j294p63L078
12553A3078N013L08p553o859J685M971O637M690l056l894j37m125p37L290O169
12538A9480O229N256m05l973k983O013l38J096O821n305j933O793J044J561p703
12523C1653L23J0871L4766M7522N2690K9267J5361K4274K0421J3396N941j7293
$$ y = [6793, 9197, 8667, 14281, 17770, 15932, 10578, 10648, 6327, 7230, 3979, 8377, 15156, 19625, 16524, 16364, 16755, 20757, 16850, 6834, -463, 2310, 6316, 8643, 15283, 16985, 15181, 13460, 5424, 5215, 8941, 16731, 19365, 20506, 13153, 12376, 20759, 21031, 24094, 22314, 20467, 17712, 14666, 10487, 5063, 1945, 9766, 13521, 11600, 1979, -1849, -170, 9935, 16919, 18678, 15250, 19626, 15978, 8890, 6629, 13060, 21039, 19931, 13878, 9396, 7340, 17469, 23867, 21388, 18798, 16704, 12057, 10763, 10000, 13078, 18091, 18399, 10846, 3987, 5672, 10643, 17280, 21970, 18914, 15020, 14883, 10758, 10021, 13311, 19480, 25709, 30965, 30560, 26587, 23604, 29617, 29279, 30375, 37196, 31891, 29958, 36751, 37795, 39356, 31653, 31976, 42847, 77613, 125135, 177825, 207092, 222453, 246727, 267148, 280544, 286485, 269192]
12511B69192l7878l6304m2106l7062l0985k4163j2177q965j348o106r768k701
12499A9629L852L995l156n257j1056n166P992P729J162n846l490M563N232o157
12485A4026j205k18K413M278l87L489K477l940p245j0277r75L446Q253J291k768
12470A2658K146j837L142J720r859l344m55N79j643q873O26L413O163N596j599
12455H433l439L770L507J910j437j983O93k891J64M795j562j994k664L480k99
12440A0483J103P3k435j456n438k35K508L618k598r364L984R992L13M388m17o174
12424H345n402J110j349q8L658j715k134l157M847J36Q048M355l14L464N348J5621
12408D0773K0207K3905K1983J7640N433m672j3653j1458j0303k1742j7280j3602
$$ y = [269192, 231314, 195010, 152904, 115842, 84857, 60694, 48517, 39552, 38204, 32098, 22330, 19629, 23481, 27476, 24320, 19063, 8007, 2841, 10833, 18562, 19724, 13878, 10388, 14951, 20183, 14026, 12821, 12603, 15016, 19294, 18907, 22396, 24873, 20933, 13688, 3411, 2436, 5882, 14135, 15426, 12658, 14804, 12967, 16109, 17829, 7970, 4626, 4171, 4750, 3107, -5766, -5140, -1727, 4436, 10032, 8433, 4994, 8764, 12271, 14181, 12744, 10761, 11454, 8563, 8727, 13522, 11960, 9966, 7302, 10782, 10483, 11586, 11659, 9224, 7768, 2330, 2095, 4603, 8221, 5623, -3741, 243, 10235, 10548, 14936, 14519, 8345, 2943, 4053, 2704, 2616, 6274, 4559, 2425, -732, 4115, 4251, 12299, 16654, 16340, 19804, 25152, 40773, 60980, 84885, 106868, 124508, 129941, 125269, 111616, 100158, 89855, 68113, 50833, 37231]
12396C7231j1744n097K055L172l802m017r5K728p1m225m110K103J233L306K491
12381B1158p22p101m713O00N9m835r863O886N05j336l1j513O53j343J773O421
12365F598P780J216K294j659n950K41m749p546J969L763P756L033J12K103k646
12350A4315k872k525Q00k867n326m519m76L226j997J3572M74o106o704n877K019
12335d863L496j506m277N310m831j900k297K959K884j115K502p630P90P978O33
12320a867K881J352j722j535j38m78k57P825O528R99k700o595l214m554n663O434
12304b704J088j124Q25q67J0967R45j460L662R79Q47J044j156o395q488j830R79
12288b688L488L297K826J236N497J023o222o377l796n933j121J962K14q74M090
$$ y = [37231, 25487, 20390, 22445, 25617, 21815, 17798, 17703, 20431, 20360, 16135, 12025, 14128, 15361, 18667, 21158, 20436, 13335, 8622, 9222, 9281, 4446, -5417, 1469, 1974, 638, 607, -906, -253, -1596, 177, 6598, 14378, 15594, 17888, 16229, 10279, 10520, 5771, -1775, 194, 3957, 11713, 14746, 14858, 16961, 14315, 11443, 8918, 9718, 6851, 1525, -2994, -3470, -244, -2241, 11331, 11805, 5699, -1005, -6882, -4863, -1367, -2873, -7150, -1840, -6671, -8571, -10868, -7909, -5025, -6140, -3638, -11268, -10478, -2500, -1867, 1014, 2366, 644, -891, -1029, -1507, -1764, 6061, 12589, 13588, 10888, 4293, 1079, -3475, -9138, -2704, -1616, -2740, -1915, -2782, 8185, 9130, 7670, 11332, 12311, 13158, 14202, 13046, 6651, -1837, -3667, -2688, 800, 4097, 6923, 8159, 13656, 14679, 8457, 2080, -1716, -7649, -8770, -6808, -6594, -7468, -3378]
12273c378K935L885m654j671P968Q06l732p115q842K01M141N860o722R544q74
12258a648j536k479O679L791K449K076l660J928k620Q63l430K890M599k407r783
12243b288N333P91J875L146l067l655K679q07N757j451o759L668p12L6l140l749
12227b343k68L075Q403n225k308O463K087k322K765m721p666l067m65J0661N755
12212A0824l091j0823N851J353o193q793o20O561Q639m29l310m458k223M749K007
12197D4M704Q08J311k02k374m965L576L443P78j171J544p094j877L891K733m191
12181I58m146J78l880J212k154l243P62K670J849M192O319r27P25k563k829L63
12165e14P216l637m636k809k683P893O527q197o64M462M343p174o739O111P489
$$ y = [-3378, -443, 3442, -1212, -2883, 5085, 5891, 2159, -4956, -13798, -13597, -9456, -3596, -10318, -774, -1648, -3184, -5663, 1016, 4807, 7256, 9332, 5672, 7600, 4980, 5843, 2413, 5303, 9902, 7495, -2288, 3045, 3836, 5711, 8857, 5790, 2135, 4814, 4007, 9764, 8313, 1554, 5222, 4510, 4546, 1406, -2343, -2611, 464, 8867, 3642, 1334, 7797, 9884, 7562, 10327, 5606, -2060, -5127, -5592, 5069, 10824, 7733, -3090, 2761, 4114, -2079, -10872, -11492, -4931, 3708, 3279, -31, -4489, -6712, -1963, 44, 4748, 5556, 6867, 6665, 4291, -674, 2902, 6345, 7123, 5952, 7496, 402, -1475, 2416, 5149, 958, -3188, -3010, -6890, -5678, -7832, -11075, -10313, -7643, -5794, -1602, 4717, 3790, 4515, 1952, -877, -514, 6702, 3065, -1571, -4380, -7063, 830, 7357, -840, -1504, 2958, 7301, 127, -6612, -501, 6988]
12150F988J39P21K175k111m355R42J455J721N95k933k007o808l692J322m358l392
12134a3598k151K987J976L539N646k461J359L969r462m787P552P630N748J331
12120I278l711K262j662l90m038l304J701n599m635j206O254n02j044k145m200
12105a2941o46K195N467J0067K694j812K444J220k304P95l59l654M727l683n302
12090a092M937j909k928o130m53L551O180K983j222n71L694r05K232l020k148
12075C199n238j312n895N04K459N487k488m000m277J217P626N189L46J1173r64
12060A3026l03o260o530l592J281p121n718j836P321J0058q75l623J262M115N532
12045F737M113R69M87O72n345K555j585l460n43q320o487K272j70m87J4890N558
$$ y = [6988, 7127, 7848, 10023, 7912, 3557, 4499, 5954, 7675, 8270, 5337, 3330, -3478, -7170, -5848, -10206, -13598, -15749, -12762, -10786, -7247, -1601, -4062, -2703, 1266, -8196, -12983, -5431, 2199, 7947, 9278, 5567, 7829, 6167, 5777, 1739, -1565, 136, -5463, -10098, -11304, -5050, -5552, -6596, -8741, -12941, -13587, -11392, -5925, 4142, 6836, 5024, 7468, 8688, 6384, 7179, 6820, 3166, 7893, 4210, -1092, 3845, 1936, -992, -7122, -7575, -4024, 2156, 5139, 3917, 3346, 7040, 6135, 8367, 5347, 3199, -2039, -3351, -9246, -8742, -6283, -796, -3284, -7284, -11561, -10344, -2718, 2471, 2817, 13990, 13026, 12723, 6463, -67, -3659, -2378, -9499, -15217, -17053, -9732, 326, -549, -4172, -2910, 1205, 6737, 10850, 11819, 12306, 12978, 7633, 10188, 8603, 5143, 4600, -3720, -10207, -7935, -8105, -8592, 6298, 11856]
12029A1856p569J302O08k018lk283K445j847p282j98L607O795q970J83j844l841
12013i059l337Q001L912M983M75o831j862m522j82O759N895n53k350p807m030
11998a0508k597O36M897M995j81P982L555l180n280J993K215l422M815L91p228
11983i17j0616K410N294J447O24m796L619P430k310m071O470j869n452j336J448
11968b625o253j04J0181P20k440R9m466m752O526k581l827N988J938N114L521
11953G039m413j358J522k062R86M886J313j0545k957J671K249K666M345k365j813
11938A164L947j601k387M285o21j31O636j945o781l021O275O598N75o29m568l932
11922C864j318J59j504J698j647l138J29M321M059j894m209R89o945n804N746
$$ y = [11856, 4287, 5589, 6197, 4179, 4176, 1893, 4338, 2491, -4791, -4989, -1382, 5413, -3557, -3374, -5218, -9059, -12396, -4395, -483, 4500, 4975, -1856, -3718, -8240, -8422, -1663, 4232, 3679, 1329, -6478, -10508, -13105, -12469, -7572, -2577, -2758, 5224, 8779, 5599, 319, 2312, 4527, 1105, 5920, 6311, -917, -11533, -9123, -3829, -2382, -1758, -6554, -2935, 4495, 2185, -1886, 4584, 2715, -2737, -4073, -2625, -8878, -8982, 1199, 1919, -521, -422, -4888, -9640, -3114, -5695, -9522, -3534, -1596, 3518, 7039, 2626, 1268, 2790, 728, 1714, 6600, 7913, -2632, -5589, -3918, -1669, 997, 5342, 2977, 1164, 5111, 3510, 1123, 5408, 4787, 4656, 11292, 9347, 2566, -455, 5820, 12418, 12993, 12364, 7796, 3864, 2546, 2705, 1201, 2899, 1252, -1886, -1757, 2564, 6623, 4729, 520, 1509, -5436, -11240, -5494]
11907e494O250K460K145J417j1111K327P746O826J748j2095p100j340N406J004
11893A89O636R22n025M831m53l96l129l025n878l926P334J230p075L432L431k239
11877c141o400O322O368N57k831j655N665N899n202n746m764q73J940J154L362
11862F55O782L631k079q735n978K595J0404J343n990K10l76L836K234k313m598
11847A621j828o659K008M250k808m259K774L146n70R63K356L031M284l760o876
11832b327k870l724K407j232k463K13j8K156N143Q584m065r93m588n309R740M817
11816E471L246p612k342Q81N896j46Q51N164Q1K961L364k598p102m65o153M044
11800E541L276m096l39O17J464l685o639k498N06q89l30N209R295N071j299r43
$$ y = [-5494, 756, 3216, 5361, 6778, -4333, -2006, 5740, 12566, 14314, 2219, -4881, -6221, -815, 189, 6825, 7747, 2722, 7553, 7100, 6704, 3575, 550, -5328, -9254, -1920, -690, -7765, -4333, -902, -3141, -9541, -3219, 3149, 3706, 875, -780, 4885, 10784, 5582, -164, -4928, -5801, -3861, -2707, 655, 7437, 11068, 8989, 254, -5724, -3129, 7275, 8618, 2628, 2838, 2462, 6298, 8532, 6219, 1621, -207, -6866, -4858, -608, -3416, -7675, -4901, -1755, -2325, -1362, 994, 4025, 8309, 4549, -2327, -5197, -8921, -6514, -7746, -10209, -9996, -10014, -7858, -2715, 5869, 1804, 811, -3777, -9086, 654, 5471, 8717, 1105, -1237, -356, 5540, 5394, 6245, 11409, 11490, 14451, 17815, 15217, 8115, 7650, 1497, 5541, 8817, 4721, 4382, 4999, 6463, 2778, -3861, -6359, -5853, -6742, -7072, -1863, 7432, 12503, 11204, 10261]
11784A0261n436j978o609K031K477J98k84M307L55M208J331m617j103R08L203
11769I252j302o267n703o99n211k86Q50P635L998k66p29j425m895p769l990m69
11753a7276N051Q304K696k302l222K906l788l130N27r690K113M542R096J330j724
11738d567K322Q76n134k60M049n306j235N852r49L393J255J943k066L058N85r64
11722B852l919L882j092K761Q28n451p617l220M153L987p51N024K699l237M044
11707D943o574l317O19o566J1110K240j835O80K012J576L484l264l821N37k854
11692a030Q98N914r204N349j88k994k754m047M46R86P296N328j107K13j667l343
11676I6l709K383J941N423p593Q54Q158J871m454m523m222M042O187N020l450
$$ y = [10261, 4825, 2847, -3762, -1731, 746, 944, 660, 4967, 5322, 9530, 10861, 6244, 5141, 6049, 9252, 7950, 1683, -4020, -4719, -9930, -10216, -9366, -1731, 2267, 2001, 1272, -153, -5048, -12817, -16807, -17276, -12225, -3921, -1225, -3527, -6749, -3843, -7631, -10761, -10234, -19924, -17811, -13269, -4173, -2843, -4567, -2245, -1369, -6503, -6763, -2714, -8020, -9255, -3403, -4352, -959, 296, 2239, 173, 3231, 3816, 2852, -1067, 2815, 1723, 4484, 5312, -139, -7756, -10976, -6823, -2836, -3587, 1437, 4136, 899, 4943, -1631, -4948, -4329, -10895, 215, 2455, 620, 1300, 3312, 4888, 8372, 5108, 1287, 1824, -1030, -132, 5782, -3422, 1927, 1739, -1255, -4009, -8056, -7610, -6624, 672, 6000, 4893, 5106, 3439, 96, -3613, -1230, 711, 6134, -1459, -605, 7553, 9424, 4970, 447, -3775, 267, 6454, 11474, 8024]
11661H024l390j326n120m812k583j938J812o88J913L373J532m455j896M070L148
11646b336J700L060N095L443j233o154K04J273l575j044K985M303j38q712J111
11631a8l192M228J399l279n951o724Q090Q947n83l208J738q64k540j41m315O253
11615a60P667K147k016l140J225r35J087m54j275n903j475R208K994L10n563r165
11599e448L658Q357l616k854K249j644n630o331M183P702N748k229j349l689k602
11584c495N0K000o636n180j574R56J062Q191K051m437Q723N913M337j0395r593
11569h027J85k15O74M482P729P040n238J724K800m09o644l959j62j239l40J58
11553a441K149K482k416m700m309M095N874l50k795N40K436m18P911J567p385
$$ y = [8024, 4634, 3308, -1812, -6624, -9207, -11145, -9333, -10021, -8108, -4735, -3203, -7658, -9554, -5484, -2336, -636, 2424, 7519, 10962, 9729, 3575, 3779, 5052, 1477, 433, 3418, 7721, 7583, -1129, -18, -3210, 1018, 2417, -862, -6813, -13537, -5447, 3500, 2917, -291, 1447, 583, -1957, -2098, -6413, -160, 7507, 9654, 7638, 4498, 5723, 4788, 5875, 5421, 4146, -1757, -3232, 5976, 8970, 9280, 3717, -5448, -1790, 6567, 2951, 97, 2346, 702, -4928, -11259, -7076, 626, 6374, 4145, 2796, -893, -3495, -3445, -1445, -8081, -13261, -14835, -13879, -12817, -4626, -2575, -7012, 1711, 7624, 11961, 1566, -8027, -7842, -8057, -7383, -2901, 4828, 11868, 6630, 8354, 11154, 10745, 4101, 142, -20, -1259, -1599, -1441, 708, 3190, 774, -3926, -8235, -4140, 1734, 1384, -1411, -871, 1565, 1147, 9058, 10625, 3240]
11538C240p872J013L189n135O59r47Q9K670N760j207k675M185L399k768l84j757
11522A459O049l50J151r47m861q56k205N176m470l443Q116R09n161q24m411l924
11506h592k397L024J775K8J913k780j667M455L714K035q03n388k416l539K958
11491g680K927M696J99K212l017J12K756M541O440o778o286n079j128J632K37
11476d216l146j378J252K100N682k291K315K280j288p105K002o314l953N081j302
11461a0281K339P17j667J875J695J446N712L593j394q55k780L771J09o815N38
11446a997Q858J695j6061L03j244k178j88L718K172l7l861o09R350M980Q92n472
11430C21p490p596m444J637P989L608M588j019p752l078L213k178j487O944r5
$$ y = [3240, -4632, -3619, -430, -5565, -4906, -5853, -5764, -3094, 2666, 1459, -1216, 2969, 6368, 3600, 3216, 1459, 7508, 7158, 8309, 7362, 2501, 1645, -560, 4616, 146, -3297, 4819, 5728, 567, -257, -4668, -8592, -10989, -7965, -6190, -6162, -4249, -7029, -8696, -4241, -527, 1508, 705, -4683, -7099, -10638, -7680, -4753, -57, 142, 2354, -663, -551, 2205, 6746, 13186, 6408, 122, -4957, -6085, -4453, -4216, -7362, -8740, -7488, -5388, 294, -1997, 318, 2598, 1310, -5795, -3793, -10107, -14060, -8979, -10281, -7942, -7225, -8892, -7017, -5322, -3876, 1836, 5429, 4035, 3180, 400, 4171, 4280, -2535, -1997, 6861, 8556, -7505, -7202, -8446, -10624, -10812, -7094, -4922, -4959, -8820, -9429, -79, 4901, 5793, 321, -7169, -14765, -19209, -17572, -9583, -5975, -1387, -2406, -10158, -13236, -10023, -12201, -13688, -6744, -6839]
11415f839k28K972O210J274K199n02l008k800k538L06J488K294n310j0208K084
11400a2606J2613l573l743M505K862L227p1m196N379J956p918P69J1240k252n37
11385G655n872l476o716r65O018j667l165l853K589J050J277P647J592m084M385
11370B415j495K42o4n703L9o131o640O506m059M597M212J468N739M172k583m520
11354a805K669n279m652M148K991r64K947R319n728j0136k371N72J729R166p52
11339A854k906O253O815q81l048K817l322K128j283N373k05m140j0288r168l271
11324a3272N288L510n95k775R33m1j451L541K111Q751R656m160r826l482M62P005
11308E655L685m713o414l475O097M935J487r57j530J083m940k964J555K972Q191
$$ y = [-6839, -7067, -4095, 2115, 3389, 5588, 5086, 2078, -722, -3260, -2954, -1466, 828, -4482, -14690, -12606, 7, -3566, -7309, -2804, 58, 3285, 3214, -982, 4397, 6353, -1565, -796, 10444, 8192, 7655, 1783, -1693, -8409, -9374, -3356, -5023, -8188, -12041, -9452, -8402, -7125, 522, 2114, -1970, 2415, 920, 1162, 1098, -4605, -4566, -10697, -17337, -10831, -14890, -10293, -6081, -4613, 1126, 5298, 2715, -1805, 864, -4415, -9067, -4919, -1928, -2892, 55, 9374, 3646, -6490, -8861, -8289, -6560, 2606, 1854, -1052, 5201, 12016, 11135, 8087, 10904, 7582, 9710, 8427, 13800, 13595, 9455, -833, -10001, -13272, -7984, -4474, -5069, -7844, -6911, -6952, -8403, -4862, -2751, 6000, 15656, 11496, 1670, -1812, -1350, 5655, 9340, 4627, -1787, -5262, 835, 5770, 7257, 6300, 4770, 5853, 913, -2051, -496, 2476, 10667]
11293A0667J253l917o757l241K403J158q267l573N142O201k157l990n406k575
11279a3059L105L610q68N999K434p387L759L826k256M891J525j971m459j854K22
11264b483M542O300J647n303l706J797J962k753k176K284K790n808o836l212M051
11249f904l437o147L098Q080Q350N465M3n19Q47J489o161J226M21q673o937M868
11233d891J1223O109K179k012j403l88j306J313o081l298L9k479n949m447J2909
11218A518m251k543p40n96j515K269k275P7J1074M309o038m385J642L564O152
11203H262m84p518k143N01o881k001N916Q83n426o563L23P612o94J020J568j66
11187e791m23K490K490M264J927o364J593p22k603P115j122l215M725j794j903
$$ y = [10667, 11920, 8003, 1246, -1995, 408, 1566, -6701, -10274, -5132, 1069, -1088, -5078, -10484, -13059, -9954, -6344, -7212, -1213, 1221, -6166, -2407, 1419, -837, 4054, 5579, 3608, -851, -2705, -2483, 2059, 8359, 10006, 4703, 997, 2794, 4756, 2003, -173, 2111, 4901, -907, -7743, -10955, -6904, -10341, -16488, -13390, -5310, 3040, 8505, 8548, 8029, 8876, 10365, 4204, 5430, 5851, -2822, -9759, -4891, 6332, 12441, 14620, 12608, 11205, 10817, 9511, 10824, 4743, 1445, 1484, -995, -6944, -11391, 1518, -2733, -5276, -6016, -6612, -8127, -5858, -8133, -8056, 3018, 7327, 1289, -3096, -1454, 2110, 8262, 7778, 260, -1883, -1382, -8263, -10264, -4348, -3465, -8891, -15454, -15131, -7519, -8213, -7193, -5625, -5791, -6214, -3724, -1234, 3030, 4957, -1407, 186, -536, -3139, 3976, 2854, -361, 4364, 2570, 667]
11172F67k88M000M55o062j554K338k903k868R064J238M85n233k890O80N029j885
11156B73l82K792q717n806J342M109L775K607J944Q82J191O821O110K652p419
11141A2174p457j346R5p678K345k199j319j419Q930r64j0968j440O840L382k608
11126c632j644m939k762J268N422Q535L247M929j485o911m501p61K611N326L16
11111E019JM400K072L785n682o312R94n275J857O815M202K842m26O557m389J026
11095A7486q232p121j860J070P446k957L50k579Q71m427k749L145r70n519Q355
11080B309P317O081l174o903k785p20q516m878N080P33N742K905k471L535m95
11065C760o27m333p735k751j421M433M651J588O91j1526r786Q452J1407k291l905
$$ y = [667, 379, 4379, 4834, -1228, -2782, -444, -3347, -6215, 2849, 4087, 4572, -661, -3551, -2871, 2158, 273, -109, 2683, -6034, -11840, -10498, -6389, -2614, -7, 1937, 2819, 4010, 10831, 16941, 19593, 12174, 4717, 3371, 3466, -4212, -1867, -4066, -5385, -6804, 2126, 1162, -9806, -11246, -4406, -1024, -3632, -5276, -10215, -12977, -11709, -6287, 2248, 5495, 10424, 8939, 2028, -2473, -3234, -623, 4703, 5019, 5020, 9420, 11492, 15277, 9595, 3283, 4277, -998, 859, 7674, 11876, 14718, 14292, 20849, 16460, 17486, 9254, 2133, 273, 1343, 8789, 5832, 6182, 3603, 4474, 47, -2702, 443, -527, -6046, 2309, 9626, 15707, 12533, 5630, 2845, 2125, -6391, -11269, -6189, -5456, 286, 3191, 720, 4255, 3760, 3133, -1200, -8935, -11686, -13107, -8674, -4023, -2435, -1744, -13270, -23056, -14604, -3197, -5488, -9393]
11050i393P310p46M981J1320J742k92l861k378r890n485l334j292L215N916m160
11035f347q075P99N330L997J907L53Q226L090j054k086r756l81j3k030M752N898
11019D610K394K494N112j966m631l167j048j650k051l462J355K639k961K891L883
11004D442m405L717N414l631l935O677j64n53l362q916m19j522L776k994l14M37
10988e752J95K745N104Q038M648j2637j0119n22M862L942m073q4L764l346j49
10973c384K677j216l941J142j894M195K3o703k939k625j239K320P12M422k218
10958a0668L590M251N535Q803n216j89n613r356k333R924J875o918k085L195r50
10943f155J984m819N252L275O025J041K438r69Q1K215J694L090n463j532m037
$$ y = [-9393, -2083, -2829, 2152, 13472, 15214, 14922, 11061, 8683, -1207, -6692, -10026, -11318, -8103, -2187, -6347, -14422, -13623, -8293, -4296, -2389, -2036, 6190, 9280, 8226, 6140, -3616, -3997, -4010, -6040, -1288, 4610, 7004, 9498, 14610, 12644, 8013, 4846, 3798, 2148, 97, -3365, -2010, 629, -2332, 559, 4442, 37, 3754, 9168, 5537, 1602, 8279, 8115, 7562, 4200, -4716, -5135, -6657, -2881, -5875, -6189, -5752, -5557, -2812, 2292, 10330, 14978, 2341, -7778, -8300, -3438, 504, -3569, -3653, 111, -3235, -3384, -707, -1923, -5864, -4722, -6616, -2421, -2398, -9101, -12040, -14665, -15904, -13584, -12872, -8450, -10668, -7078, -2827, 2708, 11511, 6295, 6106, 493, -8863, -11196, -1272, 603, -6315, -8400, -5205, -6155, -4171, -8990, -3738, -463, 5562, 6603, 9041, 8072, 8153, 10368, 12062, 15152, 9689, 8157, 4120]
10928D120m831m315N393j116M25M003J394m790n476k537R860J465o927m622k351
10913a0305P861l009Q06L836J712j318K796J565o42J142j288o168O84l795k556
10898h679P820K159l129M560M142m688n311m758j565j082l686M328L136j599k773
10883a1125m337Lk437P902M900l019K475n98L991M935J055J165m449J66j320n121
10867e814l724j094J331j435R654M676m658j006L7P769P10L683m105k630j554
10852A840J24j81j0901n338M404L150N070L687K965N296m273l862O243M972q817
10837D379o487n837q62J0008J225J450J52l724r292j773N307N517r34j033m84
10822b388L696J109r145r537K613O32k258L420L610K882n45K010J283q30K637
$$ y = [4120, -711, -5026, 367, -749, -324, 3679, 5073, 283, -5193, -7730, 2130, 3595, -3332, -7954, -10305, -2444, -5453, -4647, -811, 901, -417, 2379, 3944, 3302, 4444, 3156, -3012, -2328, -6123, -8679, -859, 1300, -1829, 2731, 6873, 2185, -3126, -7884, -9449, -10531, -14217, -9889, -6753, -8352, -11125, -15462, -15459, -17896, -9994, -5094, -8113, -5638, -6236, -2245, 2690, 3745, 4910, 461, 627, -693, -5814, -9538, -10632, -9301, -10736, -1082, 3594, -1064, -2070, -2033, 5736, 6446, 10129, 6024, 3394, 1840, 1964, 1783, -9118, -14456, -10052, -6902, -1832, 1855, 4820, 10116, 5843, 1981, 8224, 13196, 4379, -2108, -7945, -8807, 1201, 2426, 3876, 4028, 304, -8988, -10761, -5454, 63, -871, -1904, -2388, 1308, 2417, -6728, -16265, -13652, -13020, -15278, -11858, -8248, -5366, -5911, -3901, -2618, -3448, -811]
10807h11M526M137n065J185j415k417J685n782k522R050R31o105L50N153k787
10792A13r09M025Q845M904K902n286m358m62K537O68l294n534j1024k477P101
10777b249L707J041J656k861j379L296k006N41M429J43K072m413J562p5j728n12
10761C224k20q26l564j646N153M173n713q139M61K915L349N566l779n368K911
10746a503Q110l565P57K973j675j744m507m936j141k481k182J2453K047n140J095
10731a439N131J697n85K775m156p151N826j368p492j164N343R037j114l208k647
10716e15p50k094k91J44J338N01K555J228m919m285P019O588n262j586J263M377
10700E311M48j249Q089O176j789k722p438j1045L67N32k165m467P92K156K257
$$ y = [-811, 3715, 7852, 2787, 3972, 2557, 140, 1825, -3957, -6479, 2571, 3502, -2603, -2253, 2900, 113, -796, 3229, 12074, 16978, 19880, 14594, 10236, 9774, 12311, 12979, 9685, 4151, -6873, -9350, -2249, 1458, 2499, 4155, 1294, -85, 3211, 1205, 1746, 6175, 6318, 8390, 3977, 5539, 5464, 3736, 3224, 3004, 2178, -1386, -3032, 2121, 6294, 581, -7558, -7097, -4182, -833, 4733, 954, -4414, -1503, 6607, 3042, 3799, 6772, 5097, 3353, -1154, -6090, -7231, -9712, -11894, 559, 2606, -2534, -1439, 3692, 5389, 4804, 7579, 3423, -3728, 2098, 730, -6762, -7926, -2583, 6454, 5340, 2132, -515, -1265, -3359, -3650, -3506, -2168, -1667, 888, 2116, -2803, -7088, -69, 6519, 1257, -329, 934, 5311, 5759, 4510, 12599, 18775, 16986, 14264, 6826, -4219, -3852, -3320, -5485, -9952, -9160, -7004, -4747]
10685d747J836l912L015q07J97L560P280N520j347o380j229n753l554P499l551
10670b373P100N16j494m623M927l109k731N297J074l418q945L787J738P96o417
10655g875P58K009j137MM441O712N838m576o702k761n11n2L297M371l283p168
10639f635Q513M420J108k964k764r045p88N437M829n553K914J123p003K264M197
10624E3n31j0313n391P367M888K821M329k852L299N303j136l324l369j807n982
10609f645K281N490J62o199K293k430k230P434N293j078j927m411L091K532l144
10594E12o519M264J90n134K348L358L308k818r1n178p038J363P156M716k711K536
10578B62J366K21j166l022J065l267j1719M964J4589K692r64M009j322k738k42
$$ y = [-4747, -2911, -6823, -3808, -4615, -4418, -858, 6422, 11942, 10595, 4215, 2986, -2767, -6321, 1178, -2373, 4727, 5243, 3749, -874, 4053, 944, -1787, 3510, 4584, 1166, -7779, -3992, -2254, -1458, -7875, -7117, -5108, -6245, -6241, -1800, 4912, 10750, 6174, -528, -3289, -3800, -3852, -555, 3816, 533, -6635, 1878, 6298, 7406, 4442, 1678, -7367, -8155, -2718, 2111, -3442, -528, 595, -6408, -4144, 53, -478, -10791, -16182, -8815, -3927, -1106, 3223, 371, 3670, 8973, 7837, 4513, 1144, -663, -6645, -4364, 1126, 1288, -4911, -2618, -5048, -7278, 156, 5449, 4371, 2444, -1967, 1124, 3656, 512, -6007, -1743, -1553, -6687, -4339, -981, 2327, -491, -582, -5760, -12798, -11435, -4279, 437, -2274, 262, 1628, 1849, 683, -2339, -1274, -4541, -16260, -11296, 3293, 5985, 5021, 9030, 7708, 4970, 4728]
10563D728m307O256K095m111l273K07J533j317K365l26J340J2882q565l155K18
10548F570M074P879J0821J2486R388R38j0006j0424r174l423q557M396n52n084
10534I332r040J638m447q265J21P756N886K542j288L921j246l260j572k578m11
10519i11K516J717k918L807L202K150l024m195l704L4M522M387m481L136P619
10504A3857K579m486j16o657k352Q70L828M541k128j318q726j544m13m483l408
10489i956K394l941j823J0100M406k479L655M677l014l931P51M98k758m239m038
10474i698O437O918K156p558j939J083n318j799L850N002M132j004k458m520p867
10459a2583j225L901J745p60P356N43n896N08J515P051J817O22M86o146K676P81
$$ y = [4728, 421, 6677, 8772, 4661, 1388, 1595, 3128, 1811, 4176, 3850, 5190, 18072, 9507, 6352, 6570, 10644, 18523, 29344, 41830, 51218, 52156, 42150, 31726, 22552, 19129, 10572, 14968, 14416, 9332, 292, 1930, -2517, -10782, -10661, -2905, 2981, 5523, 4235, 8156, 6910, 3650, 2078, -500, -911, 1605, 3322, 404, 4211, 7413, 9563, 6539, 2344, -1360, -1326, 3196, 7583, 3102, 6238, 13857, 16436, 11950, 11834, 5177, 2825, 3695, 7523, 12064, 9936, 8618, -108, -1652, -2065, -6548, -9956, -7562, -11503, -13326, -3226, 1180, -1299, 2356, 7033, 4019, 88, 839, 1337, -1421, -5660, -9698, -3261, 3657, 5813, -1745, -3684, -2601, -7919, -9718, -5868, -866, 3266, 2262, -196, -4716, -12583, -13808, -9907, -8162, -8922, -1566, -1023, -6919, -6411, -4896, 2155, 3972, 4594, 5080, -1066, 1610, 2391]
10443B391r980O18j302L582l117J370R366k814P827Q303l270o210j872k654K793
10428E031N79l585j0295n932K854Q282o60n828k684K230K427M038J0873M606j0903
10413A033l591K831K487l936o035j848l90N391N542N21p908M42J744r2J638L095
10397I24J44m059Q31k70l478J977M266K218N341L485K824J954o995q490m19N47
10381H00J34l556L00J137m979K172L399J435J964j157L450K296l600J455o154
10366i04o238m52J423k936q45l385r2M35j402L032N730J384j620N71Q09J262P009
10349C781n23M474m210q954M01j797Q624l87n740j7M217N469N99J244l400l110
10333F71K238K154n34q51J001K639J909p638l446j604O43k03K004J1462P84m106
$$ y = [2391, -7589, -6971, -8273, -4691, -7808, -6438, 2928, 114, 7941, 16244, 12974, 6764, 4892, 2238, 5031, 5610, 2025, -8270, -14202, -11348, -3066, -3726, -9554, -12238, -10008, -7581, -3543, 7330, 11936, 1033, -2558, 273, 2760, -1176, -7211, -9059, -9449, -4058, 1484, 2005, -5903, -5461, -3717, -3809, -2171, 924, 1068, -2991, -2160, -2430, -5908, -3931, 335, 2553, 7894, 11379, 14203, 16157, 9162, 672, 253, 800, 934, -2622, -2322, -1185, -6164, -3992, -593, 842, 2806, 1649, 5099, 7395, 3795, 5250, -904, -7142, -7594, -6171, -9107, -9952, -13337, -13429, -12994, -14396, -11364, -5634, -4250, -5870, -5299, -4490, -3228, 3781, 3258, 7732, 3522, -5432, -5031, -6828, 1796, 1409, -4331, -4348, -131, 5338, 5937, 7181, 3781, 671, 2909, 5063, 4529, 3678, 4679, 7318, 9227, 1589, -1857, -3461, -2818, -3021, -1017, 10445, 11229, 7123]
10317G123m171R6O508L710m626o364J476K125o138j2464J175L324l243p82o82
10302a2933L315M84J42R79O996l824n333m039o86J0880J265k312L105k497l009
10287g467p542n099Q433L000N26k115o626N27K901Q304K375J837J676R609m231
10272F108j0342m31j366k587K163j05M328L395r68k986j547r16K243J088L232
10257A309j266l485P044K280r549k37R760L325r657p160J372J570l511o631Q586
10242f250M617L910L371k091o470l627p052L088K994n126k874M84O715N996M69
10227a846L886O083j048k421j530k691k621J83j761m187k951j467o145K849Q612
10212g055N828j0501J50O635N531j121o564j611N498J801p159q654j497l8P123
$$ y = [7123, 2952, 3048, 9556, 13266, 8640, 2276, 3752, 5877, -261, -12725, -11550, -8226, -11469, -12251, -12933, -9618, -9134, -8992, -8013, -1017, -4841, -10174, -14213, -14899, -4019, -2754, -5066, -1961, -4458, -7467, -15009, -20108, -11675, -8675, -8149, -10264, -16890, -16363, -13462, -5158, -2783, -946, 730, 10339, 6108, -4234, -4665, -6031, -8618, -6455, -6560, -2232, 1163, 195, -2791, -4338, -5254, -3011, -1923, 1309, 43, -3442, 3602, 5882, -3667, -3904, 5856, 9181, -476, -7636, -6264, -4694, -8205, -14836, -6250, -1633, 2277, 5648, 3557, -2913, -6540, -13592, -10504, -7510, -12636, -15510, -15026, -8311, -2315, -1846, 2040, 8123, 7075, 4654, 3124, 433, -2188, -2005, -3766, -7953, -10904, -12371, -18516, -15667, -7055, -1227, -11728, -11578, -4943, 588, -533, -7097, -8708, -3210, -1409, -8568, -17222, -18719, -18757, -11634]
10197a1634Q475L463J251o332n408p01J624O714O621J421j159k469k042m528J660
10182c044L027j78k490m322l022M113O239m25j558J704M161k405q59O54m228j35
10166b768KM984m360m581J715K182M697O482J269m689p644J795K616l275m305
10151e880j416M989O043m977o246N346L948o810L635K800J2k384l523N229j016
10136b50p593l642L140L519L712K738J404M668r98O30L832j1059n980k471K140
10121f210M304K342M272P25M19q135J273J1095m01n796L725M997p5l037p4p03
10105H721M64o540J468Q19J767j022p727k709n026P75N90O213N766M249m783P8
10089C103O316n538n283J354r07l625n437O30M629O589J228p978k03R087k9j1813
$$ y = [-11634, -3159, 304, 1555, -4777, -10185, -10886, -9262, -2548, 4073, 5494, 4335, 1866, -176, -4704, -3044, -17, -195, -2685, -7007, -10029, -5916, 323, -102, -1660, 44, 4205, 1800, 941, 1595, -2633, -2768, -2766, 2218, -2142, -6723, -5008, -2826, 1871, 8353, 9622, 4933, -2711, -916, 1700, -1575, -5880, -7296, -2307, 3736, -1241, -7487, -2141, 1807, -5003, -1368, 1432, 1444, -940, -4463, 766, -250, -7843, -11485, -8345, -4826, -1114, 1624, 3028, 7696, 6698, 7328, 11160, 101, -5879, -8350, -6210, -1906, 436, 4708, 5433, 5852, -2283, -1010, 10085, 9684, 3888, 7613, 12610, 12535, 9498, 9424, 8721, 9185, 2645, 4113, 4932, 6699, 5677, -2050, -4759, -9785, -9010, -8420, -2207, 3559, 7808, 3025, 3103, 9419, 3881, -1402, -48, -955, -4580, -10017, -9387, -4758, 1831, 3059, -4919, -5122, 3965, 3936, -7877]
10073g877l251O733J223Q563p702p95L454j843j071N998k489k567j94l340j139
10058f297j994Q061M400o277K924P134K932o207r177m61M770P569M945N756K192
10043B0270p692o138m267j460l160k844L046L63J501J329o51j662N180N266n756
10028C325m729L726K827k614m643k009O10J2088M126p162m441M42Q43m392j436
10013c439Q394P288j854L382m955j298M15n548o696m144j056J197J1713k91n868
9998b760m131L815N729J495J255J595L00p26k556j008K111k761n67Q74q66r36
9982H63K302L201K11K113r74r21k723m186O95J343o93O73J685L114k140R71N23
9965F057l617L112j523k815j497K771O42n487l97M783P182p883j203N270n848
$$ y = [-7877, -11128, -4395, -3172, 5391, -2311, -3106, 348, -1495, -2566, 3432, 943, -1624, -1818, -5158, -6297, -8291, -230, 4170, -2107, 817, 7951, 10883, 4676, -4501, -4962, -192, 7377, 12322, 18078, 20270, 12578, 6440, 2173, 713, -2447, -5291, -2245, -1882, -381, 948, 297, -1365, 3815, 9081, 3325, -1404, 2322, 5149, 2535, -2108, -4117, -3507, 8581, 12707, 5545, 1104, 1546, 2389, -2003, -3439, 4955, 12243, 10389, 13771, 8816, 7518, 7933, 2385, -4311, -8455, -9511, -8314, 3399, 3108, -2760, -6891, -3076, 2653, 4148, 5403, 6998, 7298, 6572, 4016, 3008, 5119, 2358, 1791, 2665, 1799, 863, 3165, 6366, 6577, 8690, 7716, 6795, 4072, -114, 581, 1924, 1231, 1904, 3589, 6703, 4563, 5534, 6057, 2440, 5552, 4029, 1214, -283, 2488, 3130, -2357, -2754, 2029, 9211, 1328, 125, 5395, -453]
9950d53m855J666P574nr573q164J575J2138P207q07J762P581p257q11K589k267
9934G900j540q221l577L430l309O99P446L90j965J187j113K545r51J98l047k592
9918b520k551l15j18N737P139k587n4Q588j955o803j2097k937r54p3K382N531
9902c587j064K380L833p51J282j642K536j133j380j769L28Q338j909m824O84P17
9886B039n462j0888J197O064k809o77k18J999P136j04j692N147M117M571k811
9871G609m075n401j119J858Q435Q2J096n867J259l602m36K49p982o308j376K768
9855a2810P384R100L149l466J75L323p418j079O503n24m147n12l037J675M958
9840C274m233M275P266K836O53p904l95L902p05p892m22M119n46m17M431k00r581
$$ y = [-453, -5308, -3642, 3932, 3927, -5646, -13810, -12235, -97, 7110, 6303, 8065, 15646, 8389, 7578, 10167, 7900, 6360, -1861, -5438, -2008, -5317, -4618, 2828, 3218, 1253, 2440, 1327, 3872, 2921, 3119, 72, -2520, -5071, -5386, -5504, 233, 7372, 4785, 4731, 13319, 11364, 4561, -7536, -10473, -11427, -11500, -9118, -3587, -4651, -2271, 1562, 811, 2093, 451, 2987, 1854, 474, -1295, -967, 7371, 5462, 638, 1322, 2039, -3423, -14311, -13114, -7050, -9859, -10536, -10754, -8755, -1619, -1723, -3415, 1732, 5849, 10420, 7609, 3534, -1867, -2986, -1128, 7307, 7389, 8485, 2618, 3877, 275, -161, 88, -7894, -14202, -15578, -12810, -5426, 3674, 6823, 3357, 3532, 6855, -563, -1642, 4861, 4337, 190, -322, -3359, -1684, 3274, -959, 3316, 10582, 13418, 14071, 6167, 5772, 9674, 8969, 1077, 655, 4774, 4228, 3811, 8242, 8042, -1539]
9823a539n937J938l368m950N524r88L848K061L312M642j30J610k148q870m979
9808i974J670O529P253o58J005m642p12L362K115m447k097m206O137J202j617
9793I20j815N14n818n397L01M489Q445O07m806J2722O005o206m742Q73K435r83
9777G544o31J988R103l023o594p7J168l188R59J662r68m194l788m144K008J688
9761d87m621K350M051m032K464j574j896J115p89M378j089k909m411j483J104
9746g829P95L907k905M4K784M968J267N666Q775n991p585j296k983j678J518o48
9730a191j1l747J494M720j040j1320m571K858J707O490J2404L146o107k156l438
9715g62K782P590k724j4642k914J0277K707O0L42Q225L637J613m917n776k014
$$ y = [-1539, -7476, -5538, -8906, -13856, -8332, -9320, -5472, -3411, -99, 4543, 4413, 6023, 3875, -4995, -9974, -8304, -1775, 5478, 4820, 5825, 1183, 471, 3833, 5948, 1501, -596, -4802, 1335, 2537, 920, -895, -381, -6199, -11596, -11295, -6806, 1639, 2246, -2560, 10162, 16167, 9961, 5219, 6092, 8527, 7544, 6913, 8901, 18004, 14981, 8387, 8310, 9478, 6290, 7249, 8911, 7943, 3749, -39, -4183, -2175, -487, -5108, -2758, 1293, -2739, -275, -1849, -3745, -2630, -3419, 959, -130, -3039, -7450, -8933, -7829, -7034, -3127, -6032, -5988, -3204, 1764, 3031, 8697, 17472, 11481, 3896, 2600, -383, -2061, -543, -1191, -1202, -4949, -3455, 1265, 225, -11095, -15666, -12808, -11101, -4611, 7793, 10939, 4832, 2676, -762, 2020, 9610, 6886, -7756, -10670, -393, 2314, 2374, 2716, 10941, 14578, 16191, 11274, 5498, 3484]
9700C484K774L353k905o973O686n789j977L238j471M321K49l675K30K05K71N39
9684B560L294n357q43m89l985j448j81P266j311K168k835J060P90o544n583L734
9668g704M857M312K753J312j264N695k86o055N295L816J128j777m427l235o072
9653a652j906O861o115J396O273j644r431m456J890k835N068P013O934K840p408
9638B828k690j564r98L24M78N710J458J961j385K414j521j302N28n310n19j679
9622a267N287O766K493j84K706K481m858k662l85J77n264K391R967K259j1593
9607H314n306p305n73K659P248K767K96m997o574L557k459N173K295k046K416
9592E465j536k165p4N315K114L115J254n329J605P228m622k583L536o356q060
$$ y = [3484, 6258, 9611, 6706, -267, 6419, 630, -1347, 1891, 420, 4741, 4990, 1315, 1545, 1750, 2021, 2560, 5854, 497, -346, -835, -4820, -6268, -6449, 817, -494, 1674, -1161, -101, 689, -5855, -11438, -7704, -2847, 1465, 4218, 5530, 4266, 9961, 9675, 3620, 8915, 12731, 13859, 12082, 7655, 4420, -1652, -3558, 3303, -2812, -1416, 4857, 3213, -6218, -10674, -8784, -11619, -6551, 462, 7396, 10236, 2828, 138, -1426, -2424, -2100, -1622, 4088, 5546, 7507, 6122, 8536, 7015, 5713, 6241, 931, 412, -1267, 4020, 10786, 13279, 13095, 15801, 18282, 13424, 10762, 10377, 10554, 5290, 7681, 17648, 19907, 8314, 3008, -4297, -4870, -2211, 5037, 7804, 8100, 3103, -3471, 86, -2373, 2800, 5095, 3049, 5465, 3929, 1764, 1690, 7005, 9119, 12234, 13488, 8159, 9764, 16992, 12370, 9787, 13323, 6967, -1093]
9577a093l104J0706L54m998q897n274p665L167Q230p77J082R614O099k363p70
9562D311Q29L637k264N625O429n761n743l285j612j224J073R30k543L828N709
9547I939l577M810J003j2357p352O115P264J003O602K255o048l34l599N34J911
9532H169k267P74j829P15K571J509L693k623l751J150K909K264j662K71Q61m80
9516A2274p224r655M260N7K190O410J981k874j694R006M204K172j191k413j581
9501A5922n852m238k481Q80m45N9m698l205N899p00k478m68k989n654N872J0805
9485F229j287l38N436k321q862L88P812J8J764Q19j725K744M794L035L149p799
9469A3856k439l061m908n429Q98J729M343M837P186M336j2253n982P620K730l600
$$ y = [-1093, -4197, 6509, 6863, 1865, -7032, -12306, -19971, -16804, -8574, -9351, -8269, 1345, 7444, 5081, 4311, 5140, 8777, 6513, 12138, 18567, 12806, 7063, 3778, 2166, 942, 2015, 2945, 402, 4230, 9939, 6362, 11172, 12175, -182, -7534, -1419, 5845, 6848, 13450, 15705, 9657, 9323, 5724, 6258, 8169, 5902, 6676, 4847, 5562, 8133, 9642, 13335, 10712, 6961, 8111, 11020, 13284, 11622, 11893, 12754, 12274, 5050, -4605, -345, -288, 1902, 8312, 10293, 7419, 5725, 14731, 18935, 21107, 19916, 17503, 15922, 10070, 5832, 3351, 4231, 3786, 3845, -853, -4058, 1841, 1141, -1337, -1805, -4794, -10448, -4576, 6229, 4942, 4604, 10040, 7719, -1143, -755, 7057, 7075, 8839, 9658, 7933, 10677, 15471, 18506, 21655, 13856, 11417, 8356, 3448, -1981, -1083, 646, 4989, 9826, 17012, 21348, 9095, 3113, 10733, 13463, 9863]
9454I863l760O339K799P075J707q292m120l969k161P847O88J331J921J505o638
9439A2135M24J774j57N050k780J705j077m356m416M259M330m04j435l888k775
9424H389J342M581O547k421n294N734L014O362l387n595J294m578l451R782R769
9409C2088J229J166l954o938K885L733o038p690j113l420l048M021L533K930M590
9394B3974J410L648K698q786m207k363N700J0280O378m265q449M986Q789n600
9380C4193p544O38O132L274n327l768M468L584p692l438L756l93n866r49J090
9365B2158j35L868O051M681M325j899r422l369L059r3j431l372k581M019j881
9350B3978j377J293M759l38K862Q32L91L501K121J866J882q49L4K281n842L58
$$ y = [9863, 6103, 12442, 15241, 22316, 24023, 15731, 11611, 7642, 5481, 13328, 14016, 15347, 17268, 18773, 12135, 12559, 14333, 14176, 19226, 16446, 18151, 17074, 12718, 8302, 12561, 16891, 16487, 15052, 11164, 8389, 9731, 14312, 20859, 18438, 13144, 18878, 21892, 28254, 24867, 19272, 20566, 15988, 12537, 22319, 32088, 33317, 34483, 30529, 23591, 26476, 30209, 24171, 16481, 15368, 11948, 8900, 12921, 16454, 19384, 23974, 25384, 29032, 31730, 22944, 18737, 16374, 22074, 32354, 38732, 34467, 26018, 31004, 39793, 34193, 26649, 27287, 33419, 36693, 31366, 27598, 32066, 35650, 27958, 24520, 28276, 27883, 22017, 21068, 22158, 22023, 25891, 31942, 36623, 40948, 39049, 29627, 26258, 29317, 29224, 27793, 24421, 21840, 25859, 23978, 22601, 23894, 28653, 28315, 31177, 32009, 32400, 35901, 38022, 39888, 41770, 40921, 40955, 43236, 37394, 37752]
9334C7752J091M328j13m933J060O764j452k984O244J030l740j368M099j55l880
9319D3743l990N659L573m778k432N245N89Q37P43p658m324l604j748R117Q608
9304D9580n258n026J309K582R319P097J676J641N063q722m807L745L709l987p346
9289E0575J274J06j33K815L331K094n054k014j157J822P329J3579M737R43k866
9274G7381J296l014q029J079J555K398J94M72k714q32M03L793M071K8N9P720L449
9257H9309n338J035l23J100J150O217j998k799L59l228L232L623k82j515K023
9242I2565J163M270l198m785O90k08o196Q59N689L598L56l452l723N006L724n206
9226I1152l665Q428P536K604l761K092K690l664O739m3k067r19p558j0238N826
$$ y = [37752, 38843, 43171, 43058, 38125, 39185, 45949, 44497, 41513, 47757, 48787, 45047, 43679, 47778, 47623, 43743, 39753, 45412, 48985, 44207, 41775, 47020, 47609, 48446, 49189, 41531, 37207, 33603, 31855, 40972, 49580, 44322, 39296, 40605, 43187, 52506, 59603, 61279, 62920, 67983, 59261, 54454, 58199, 61908, 57921, 50575, 51849, 51955, 51822, 54637, 57968, 60062, 55008, 52994, 51837, 53659, 60988, 74567, 79304, 80247, 77381, 78677, 75663, 67634, 68713, 70268, 72666, 72860, 73332, 70618, 69786, 70189, 73982, 78053, 78081, 78140, 85860, 89309, 83971, 85006, 84683, 85783, 86933, 93150, 91152, 88353, 88712, 85484, 88716, 92339, 92057, 90542, 92565, 93728, 97998, 94800, 90015, 90705, 90497, 84301, 85160, 90849, 94447, 94803, 91351, 87628, 92634, 96358, 91152, 87487, 95915, 103451, 106055, 102294, 104386, 107076, 103412, 110151, 110108, 108041, 107122, 99564, 89326, 95152]
9211I5152J420K65L53J16m179l906R030N669O011m614j553k04J59k555m606n943
9195I0615q194R55Q780l749j4P018O196J977n215O957K583q374k223R548K049
9180A08909L11n501j690l013n419k891L1o631l439P045M31k494l340k454L861
9165H3716L8M948q962J355O877m14Q76M714O60p590k497O496o432j115j158j475
9149H0037J311j703m838l028K559m74m013q856n947N074O793L998K932j340q673
9134F3832N803L276o762k486J064q44K544k574l009k442p400J190K802p132O025
9119E3887J122L321l850K35M40n952j5l683j11l7k815J487J784k951j689m243
9103C6930M061J1682K742l016p474p886n847P959M728j659l070l443n156j502
$$ y = [95152, 96572, 96837, 97190, 97306, 93127, 89221, 98251, 103920, 109931, 105317, 103764, 103560, 103719, 101164, 96558, 90615, 82421, 83376, 92156, 88407, 88393, 95411, 101607, 103584, 98369, 105326, 107909, 99535, 97312, 106860, 108909, 109220, 103719, 102029, 99016, 93597, 90706, 90737, 84106, 80667, 87712, 88143, 85649, 82309, 79855, 83716, 83754, 88702, 79740, 81095, 87972, 87558, 88434, 93148, 93808, 86218, 83721, 90217, 83785, 82670, 81512, 80037, 81348, 79645, 74807, 71779, 74338, 73864, 69851, 60995, 55048, 60122, 66915, 70913, 73845, 72505, 63832, 69635, 72911, 66149, 63663, 64727, 63883, 66427, 63853, 60844, 58402, 51002, 52192, 54994, 47862, 53887, 55009, 58330, 54480, 54715, 55155, 49203, 49188, 45505, 45394, 45357, 42542, 44029, 45813, 42862, 41173, 36930, 40991, 52673, 55415, 52399, 44925, 37039, 31192, 39151, 43879, 42220, 39150, 35707, 30551, 29049]
9089B9049M224O651L22o23p82n40l947k959J342k544n41k553m05N027R113M047
9073D4881k756n10L695o510l125n750m047M473N628l689O40J391j181o665l482
9058B2993l082J600j437K347P105J973M57j710K746L287J625O38j229k267m552
9043C0494n466K479J393N8o554k295K673K562L5J550k762k240J856L630K469m041
9027B5841K110l379p84J935m055N33P764K924p858k161K136j977n270m681P74
9012A3852O168j275j39n770J053j478m491j887J529J554J3m803J0829R569J767
8997B6491l214o884o262M317M533J452m629j065p77j693j588m417K137O897K806
8982A8104j728L843k863K851K057q523P59m164n6O070J129l834j853M645L941
$$ y = [29049, 33273, 39924, 40246, 39623, 38841, 38301, 34354, 31395, 32737, 30193, 29652, 27099, 26694, 31721, 40834, 44881, 42125, 41615, 45310, 38800, 35675, 29925, 25878, 30351, 35979, 32290, 32930, 34321, 33140, 26475, 22993, 19911, 21511, 20074, 22421, 29526, 31499, 31956, 30246, 32992, 36279, 37904, 38542, 37313, 35046, 30494, 25028, 27507, 28900, 28958, 22404, 20109, 22782, 25344, 25379, 26929, 24167, 21927, 23783, 27413, 29882, 25841, 27951, 24572, 23788, 25723, 21668, 22201, 29965, 32889, 25031, 22870, 25006, 23029, 17759, 13078, 13852, 20020, 18745, 18606, 12836, 13889, 12411, 7920, 6033, 7562, 9116, 9129, 4326, 15155, 24724, 26491, 23277, 16393, 10131, 14448, 18981, 20433, 15804, 14739, 13962, 12269, 10681, 6264, 8401, 15298, 18104, 16376, 20219, 17356, 20207, 22264, 13741, 14500, 10336, 10280, 16350, 17479, 13645, 11792, 16437, 20378]
8967B0378j332j409m864l751n239j175M406P660P211n53o285o341m419k780m401
8952b894K502j687m164L647O199m792l347L117P216L767m888j386L348R11j60
8937G389K733j278j0866p41J0638Q500R068P511p50k514r079j1277m989O92k482
8922B555O77M473K111J909O396j625j694K94M795p779j207J469M378p31k110m271
8906I640J938m295L182M129l661o404o905j659M868K324N314K203M051R973o30
8891B4068k155o473j932J136R51n147m601k307Q099M176j4709q926N326Q22P168
8876E496R018N590N618J567P178L928o307k0910k823l694j839Q64L326M464j168
8861A0308m033o053n021O395N939m660J58j828K088p07M586L465q289p024J0360
$$ y = [20378, 19046, 17637, 12773, 9022, 3783, 2608, 7014, 14674, 21885, 21332, 15047, 8706, 4287, 1507, -2894, -392, -2079, -6243, -2596, 3603, -1189, -4536, -1419, 5797, 9564, 4676, 3290, 6638, 7549, 7389, 10122, 8844, -2022, -2763, 7875, 16375, 25443, 32954, 32204, 29690, 20611, 9334, 4345, 5037, 2555, 3232, 7705, 9816, 11725, 18121, 16496, 14802, 15096, 19891, 12112, 10905, 12374, 16752, 16021, 13911, 9640, 11578, 7283, 10465, 14594, 10933, 4529, -2376, -4035, 833, 3157, 8471, 10674, 14725, 24698, 24068, 21913, 15440, 13508, 14644, 15595, 10448, 5847, 3540, 11639, 15815, 1106, -7820, -2494, -1672, 5496, 14514, 20104, 25722, 27289, 34467, 38395, 32088, 11178, 8355, 4661, 2822, 3686, 7012, 11476, 10308, 6275, 222, -4799, 1596, 7535, 2875, 3033, 1205, 3293, 2586, 7172, 10637, 2348, -4676, 5684]
8846E684J6064J2619J894n097k697q737m401j824j0495m586L007N655k041l560
8832A485k847j462j37J427J827J829m805M274j06j431K906O062J211o936K697
8817E994j044L543m171l7O068r15n015j199M834L689O64j620L025N40J771M732
8801B0859L684j011N94k245m412k068p793J187L593M353L549K788p255p603L431
8786A1651K170K215M418m153j0876p45M502n515K108q681p531P722P012N65J624
8771F486M431J814o753p088N05K659n76k596n713j174L608k416N341l46K347P072
8755G601O63K839M276l299m357q62N366m781r866j134L091l639L934j66j155P28
8739g61J210n378R201R50p367j285L309O708K107K972L32P87O320L867l575n455
$$ y = [5684, 21748, 34367, 36261, 31164, 28467, 19730, 15329, 13505, 3010, -1576, 1431, 7086, 5045, 1485, -1362, -2824, -2961, -1534, 293, 2122, -2683, 1591, 1485, 54, 2960, 9022, 10233, 3297, 5994, 4950, 8493, 4322, 4285, 10353, 9438, 4423, 3224, 8058, 11747, 12411, 10791, 13816, 14356, 16127, 20859, 24543, 23532, 24126, 21881, 17469, 15401, 7608, 8795, 12388, 16741, 20290, 23078, 15823, 8220, 11651, 13821, 16036, 20454, 16301, 5425, 4680, 9182, 3667, 5775, -2906, -10437, -2715, 4297, 4862, 6486, 10917, 12731, 5978, -1110, -605, 2054, 1478, -1118, -6831, -8005, -4397, -6813, -1472, -1818, 529, 7601, 8264, 11103, 15379, 12080, 7723, 6861, 12227, 7446, -2420, -3554, -463, -4102, -168, -334, -1489, -761, 449, -4929, 4272, 5222, -2145, -3430, -121, 6587, 8694, 11666, 11998, 12785, 19105, 22972, 19397, 13942]
8723A3942n433k943j603n831J499k894M355j584K75N227k705l990O421J549M401
8708A0686K913l996o992l294Q04J909J662Q354N743k843n470Q66o224o974R640
8693F784k85j751J450L288K309n63K48K38k968k668p507N468L540K5r32m88p54
8676E434P10P2n34l076j512M781N042k724n438J441M8r35J635j178m206P001J1492
8659A8053J810n017k894j4578o967K588L220m444m607L689j791j79J2155J4058
8645A5096j101k880l253k38k63L878K76m830r700l010J447j311l24O199J1127
8630A1113K827n055r660j311P02n090j158M097M14N250K67J977R221M333Q48K620
8614B1395K961k281j1401n459l143J260m009j317L542j370j611K22K814Q080J46
$$ y = [13942, 8509, 5566, 3963, -1868, -369, -3263, 1092, -492, -217, 5010, 2305, -1685, 4736, 6285, 10686, 13599, 9603, 2611, -683, 121, 2030, 3692, 12046, 17789, 14946, 9476, 10342, 4118, -2856, 6784, 6499, 4748, 6198, 9486, 11795, 11232, 11480, 11718, 8750, 6082, -1425, 4043, 7583, 7608, 6676, 6188, 5434, 6144, 6216, 5682, 2606, 1094, 5875, 10917, 8193, 2755, 4196, 4244, 3309, 4944, 3766, -440, 6561, 18053, 19863, 14846, 11952, -2626, -9593, -7005, -3785, -8229, -12836, -9147, -10938, -11117, 1038, 15096, 13995, 11115, 7862, 7624, 7361, 11239, 11515, 6685, -3015, -6025, -4578, -5889, -6213, -14, 11113, 13940, 8885, -775, -2086, -1384, -6474, -7632, -3535, -3121, 2129, 2396, 4373, 13594, 17927, 18775, 21395, 24356, 22075, 10674, 5215, 2072, 3332, -677, -1994, 1548, 178, -1433, -1211, 1603, 9683, 9829]
8599I829j820K583J56p725q402M401N77K699Q3m689k636K91l779J073p21K524
8583e556L731O380R87l740p190l469R22J004m130k14O25Q515K624L84l348L982
8567A507O431O775k511m553l152r11M835j013m655j71K378J608L967q90m532k191
8551B922j505L825J605K872p440J509k751l617O100N013N273p059L27n137K16
8536B153J065n029l188j012P149Q040n865n769P730J570n703j387N87p35q088
8521h482k322P468K024K924N490J727j259n163Q48K029n453m646M353n297j776
8506g535J630j215k191M425J2315j584L881m621n371K926l144O7Q99O474J445
8491H401n419j634Q95N888K690l812j159J52K559O5k418k021J417N152M170n369
$$ y = [9829, 8009, 10592, 10748, 3023, -5379, -978, -401, 2298, 2381, -2308, -4944, -4653, -8432, -7359, -8080, -5556, -1825, 4555, 5542, 1802, -5388, -8857, -7935, -6931, -11061, -11275, -10650, -2135, 489, 873, -2475, 1507, 7938, 14713, 12202, 7649, 4497, 3586, 8421, 7408, 2753, 2582, 4960, 6568, 10535, 9645, 5113, 2922, 1417, 5242, 6847, 9719, 2279, 3788, 1037, -2580, 3520, 8533, 13806, 6747, 7074, 1937, 2153, 3218, -1811, -4999, -6011, 1138, 9178, 3313, -2456, 5274, 6844, 1141, -246, 341, -394, -8482, -10804, -3336, -1312, 1612, 7102, 8829, 7570, 2407, 3255, 5284, -169, -4815, -462, -5759, -7535, -5905, -7120, -9311, -4886, 7429, 5845, 9726, 5105, -266, 2660, -484, -417, 482, 6956, 8401, 2982, 1348, 2243, 8131, 10821, 7009, 5850, 6002, 8561, 8626, 6208, 4187, 5604, 10756, 14926, 9557]
8475I557r088m836l624N603K000j178k246L65O131l906l522L314J088l751l049
8460g142q36J587Q030K798R152o279r260l597L658J118R02M986j310Q55J766m851
8444A577n755J238Q09j585K009J713J893O076o439j618L020L731k55l457l882
8429i25k372M566P48J753j833j730J515j92m044K244M198O515K755J79k797p552
8413C028j0333J743R966q04n20O703j473J230l1L600p041o501r2M037K825r877
8397c540l314O202L895l164r877k47J226O501l693k147Q017N935K811l455k844
8382B306J669m630p445M172P168l377n702J305m70J389j608r51K821N744K103
8367D494j171m039K607J304j811O455J50P43o236n267j330N510m214k413M121
$$ y = [9557, 469, -4367, -7991, -2388, -388, -1566, -3812, -3447, 2684, -1222, -4744, -1430, -342, -4093, -7142, -7978, -6391, 1639, 4437, 13589, 7310, -1950, -5547, -1889, -771, 131, 5117, 3807, 4662, 6428, 1577, -4178, -2940, -2131, -3716, -1707, 6, 1899, 7975, 1536, -82, 2938, 6669, 6414, 2957, -925, -3297, 1269, 2017, 3770, 1937, 207, 1722, 1530, -2514, -270, 3928, 10443, 13198, 13377, 10580, 3028, -7305, -5562, 4404, 3600, 3080, 9783, 8310, 9540, 9509, 13109, 6068, -433, -525, 3512, 6337, -3540, -6854, -652, 3243, 79, -9798, -10045, -8819, -2318, -6011, -8158, -141, 5794, 8605, 5150, 2306, 3975, -655, -8100, -3928, 3240, -137, -5839, -4534, -5004, -3615, -5223, -6174, -3353, 2391, 4494, 3323, -716, 1891, 3195, 1384, 7839, 7989, 8732, 2496, -2771, -4101, 1409, -2805, -5218, -1097]
8352a097R424Q41j3391J669j049J208O63p019n24L454N220k462j350l698j661
8337i772n519O588K856m932n13M021m72K442J006k922N598R009J26l131k008Q31
8321C208l096q534R63M060N051k612n096l943N97N300L920l216K992m273J322
8306c357l22J0793j129r725r027J071R522Q296k713n518L843J841k946J601K277
8291D507j722N826L908K021k129O365K78O583k622j1434l210j26K778k654j678
8276F691n301L933J004L31M086K51p714m941j481N297K689k885j005L26j483j37
8260c39l961n525k526N514N437k511J416J367l13l308j139N089o049j1345O476
8245a1717L472N180M359p97m06L11n828j419k475l536k467J0443Q067J010j181
$$ y = [-1097, 8327, 9168, -4223, -2554, -3603, -2395, -1732, -8751, -9275, -5821, -601, -3063, -4413, -8111, -9772, -15291, -8703, -5847, -10779, -11292, -7271, -7743, -5301, -4295, -7217, -1619, 7390, 7516, 4385, 2377, 3208, 112, -8422, -7459, -3399, 1652, -960, -6056, -9999, -9402, -4102, -182, -3398, -406, -4679, -3357, -3679, 7114, 5985, -3740, -12767, -11696, -2174, 6122, 3409, -2109, 1734, 3575, 629, 2230, 4507, 2785, 8611, 12519, 14540, 12411, 18776, 19054, 25637, 23015, 11581, 8371, 8245, 11023, 8369, 6691, 1390, 5323, 6327, 6658, 10744, 10995, 3281, -1660, -3141, 2156, 4845, 1960, 955, 1281, -202, -339, -4300, -9825, -12351, -6837, -1400, -3911, -2495, -1128, -1441, -4749, -5888, -799, -6848, -18193, -11717, -8245, -3065, 1294, 497, 91, 402, -5426, -6845, -9320, -12856, -15323, -4880, 3187, 4197, 3016]
8230C016k462k118K174R76j688K225k197o568O92K602k397m903K385N846M952
8215B535L47N838l87k246m917q54j919m94o40N078O556o669k624L007K015l603
8199A023o264p39n531l816j984P643O349J0209r60k782j0840k220K155L752o578
8184a0583l320k438N9J411M200m79p321j386P632M924J830M873P251o20k910Q34
8168C957j966r379k849N241N987n57J809N679l184k941j8L131j7J979N855p197
8152E530j2187m796J22k670R16K542O83N109M671q7p086N408K217j317m262R27
8136d280M254j467q73K201p149j1422J659Q817P919J0344J0189j737j0115q561
8122b21M88N890l854n119n581m521K389N071K156L352K67j817K08J87n04j852
$$ y = [3016, 554, -1564, 610, 1586, -102, 2123, -74, -6642, -5950, -3348, -5745, -10648, -8263, -2417, 2535, 2882, 8720, 8333, 6087, 1170, 316, -1603, -2097, -2737, 2341, 8897, 2228, -396, 2611, 4626, 1023, -5241, -5980, -11511, -15327, -17311, -9668, -3319, 6890, 5930, 3148, -7692, -9912, -7757, -4005, -10583, -13903, -16341, -16282, -14871, -10671, -11150, -18471, -19857, -12225, -7301, -5471, -598, 6653, 6033, 3123, 3957, 1991, -7388, -10237, -4996, 991, 434, 2243, 7922, 4738, 1797, 1779, 4910, 4893, 6872, 12727, 5530, -6657, -11453, -11331, -14001, -13085, -10543, -9860, -4751, -80, -167, -7253, -1845, 372, -945, -5207, -4280, -26, -1493, -2366, -165, -7314, -18736, -17077, -8260, -341, 10003, 20192, 18455, 8340, -221, 267, 6157, 2303, -2816, -8397, -12918, -10529, -5458, -3302, 50, 317, -1500, -1292, -1105, -1609, -3461]
8106c461j869M09k051R478Q360M050K054l052j1003o644k071oM566m115q394N081
8090h668J5723J135l493k339O774k970j0287k189L628k474L123N813J015l18j890
8075B583k226J393J980L773J924J288R293J684n095j2342j972M488r40k00m841
8060G90j027N136J9j985p1m445O056N46l109r62K645n952k103J582j752j039J0897
8043E226j85n488j592n341n851J225R101K997J026l016p68K991J419k14O42j384
8027G88L222m828k023K348r63M04k660J335p65J862P436o9K689j118j461k480
8011C717N460N14p675j211j321J137L30j195k909j659J27N064Q182o81o386k309
7995h15n41k61m13m930m931Q07J542J1216K480K18L634J471m29k893o475j023
$$ y = [-3461, -5330, -4921, -6972, 2506, 10866, 14916, 16970, 13918, 2915, -3729, -5800, -5806, -1240, -5355, -13749, -8668, 7055, 8190, 4697, 2358, 9132, 6162, -4125, -6314, -2686, -5160, -2037, 3776, 4791, 4473, 2583, 357, 1750, 3730, 7503, 9427, 10715, 20008, 21692, 16597, 4255, 2283, 6771, 5831, 5631, 790, -237, 4899, 4918, 2933, 2862, -1583, 4473, 5019, 1910, 948, 3593, -2359, -4462, -2880, -4632, -5671, 5226, 5041, -447, -2039, -7380, -13231, -12006, -2905, 92, 1118, -1898, -2666, 325, 1744, 1530, 2172, 788, 4010, -818, -2841, -493, -1456, -1052, -3712, -2377, -3142, -1280, 6156, 6087, 8776, 7658, 6197, 3717, 9177, 9691, 2016, 805, -516, 621, 951, -244, -3153, -4812, -4685, 379, 8561, 7880, 1494, -815, -1356, -1617, -2030, -6960, -11891, -11084, -9542, 1674, 4154, 4372, 8006, 9477, 9048, 6155, -320, -1343]
7979a343K959N528N905K999p173r436j986N30M449l101n093n76l585N577N051
7964G05q075l844P182J595p350n305Q378L516K985l829L805J699K964L601o230
7949A797k787l05P649k710k577Q308N350j2298q073O995K796k669k473k292O447
7934C158L249Q60l31K27J291k871j412o45L414k181j124j25n917K076l663l031
7918g025n61N608O450K916k287j844j079L484Q454L325o39K299m320p731L805
7903A0855K474n668q614n259n613P930K388Q85L851l574L40P436L101j892L244
7888A1884j104j149o869K691n142q280J200J078j252L802N875R79j972k36O511
7873H016j529J23K348n6J468J679r949m767J18J702p651J746R572N081O11r680
$$ y = [-1343, 1616, 7144, 13049, 16048, 8875, -561, -2547, -2017, 2432, -669, -5762, -6338, -9923, -4346, 705, -7370, -11214, -4032, -2437, -9787, -15092, -6714, -3198, -213, -4042, -237, 1462, 4426, 8027, 1797, -990, -1295, 6354, 3644, 1067, 9375, 14725, 2427, -5646, 1349, 4145, 1476, -997, -3289, 3158, 6407, 7267, 6936, 7163, 8454, 5583, 4171, 3526, 6940, 4759, 3635, 3510, -2407, -331, -3994, -7025, -7586, -1978, 4472, 7388, 5101, 3257, 2178, 5662, 14116, 17441, 16802, 19101, 14781, 7050, 10855, 13329, 7661, -953, -6212, -11825, -3895, -1507, -622, 3229, -345, -5, 7431, 10532, 8640, 11884, 10780, 9631, 2762, 5453, 311, -7969, -6769, -5691, -6943, -3141, 2734, 3713, 1741, 1505, 8016, 6487, 6610, 8958, 8902, 10370, 12049, 2100, -2667, -2549, -847, -8498, -6752, 2820, 7901, 8512, -1168]
7857a168m955L441k686K267R929n069q279K089k629l385k76j767J4600K332j476
7842B968K28m56k749j136k28Q05J3q98J752J500K36l498k826J388K069K885j565
7825D88k141M215J465L676K817p661k967O204J3933R68k894j0177n008K015m678
7810B55k765J659l617J414L252p45k795L600Q281L406n365l063R3o250K385K785
7794B530l437m112k691m11K153M460K614K608Q352K285l816m160q731J176J690
7779E10j787K945M82q06l128k192m684j453L072L640k594K904m023O21o291n25
7763a3309P608N556m215p243K345Q930K347o38j703k016q467O622Q913j148o559
7748b977K83k072M865K487K40l764J29J254n167j397k724K108M664J471m539j314
$$ y = [-1168, -6123, -2682, -5368, -3101, 6828, 1759, -6520, -4431, -7060, -10445, -10721, -12488, 2112, 4444, 2968, 3196, 2740, -9, -1145, -1373, -568, -555, -1453, 299, 1799, 2035, -1463, -4289, -2901, -832, 2053, 488, -1653, 2562, 4027, 7703, 10520, 2859, -108, 6096, 20029, 20997, 18103, 7926, 2918, 4933, 255, -2510, -851, -4468, -3054, 198, -547, -3342, 258, 8539, 11945, 6580, 3517, 3610, -2640, -255, 2530, -907, -5019, -7710, -8121, -5968, -1508, 1106, 3714, 12066, 14351, 10535, 6375, -2356, -1180, 510, -1277, 1668, 2150, 1344, -1784, -3976, -8660, -10113, -7041, -3401, -5995, -3091, -7114, -6493, -12784, -13309, -5701, -145, -4360, -11603, -9258, -328, 2019, 1381, -322, -2338, -10805, -4183, 4730, 3582, -2977, -2694, -4766, 99, 2586, 2826, -938, -809, 445, -4722, -6119, -8843, -6735, -2071, -600, -5139, -6453]
7732f453l164l337L075J1196Q386o127m348n562N358O748K990j814l898n589Q11
7717a728Q32r268q238M286p3l29P02M977k029K124M465J10J006L508n964l579
7701i198L503L688l456p923j203M626L491J366o41K425j263n236o3k403O599M462
7685a226o899m346N47J451L285M610j285J830O520J73n7k934k638l032n149K114
7669g036N53m503P50L967M430L659M34m916K699J011J42j862k071L923k650L30
7653a140n282J268M511m332q37K568L3L201K696l379O681O729m442K66o068l021
7637e48k334l362J71p29N393l335r238P37M169J524J419O665K806k416n868l480
7621h426k833l381K54M393J889L227j465o81K994k38m885l086m131J375k320L74
$$ y = [-6453, -9617, -12954, -9879, 1317, 9703, 3576, -772, -6334, -976, 5772, 8762, 6948, 3050, -2539, -1728, -896, -10164, -18402, -14116, -14189, -14518, -13816, -8839, -10868, -8744, -4279, -4169, -3163, 345, -5619, -9198, -5695, -2007, -5463, -13386, -14589, -9963, -6472, -5106, -5747, -3322, -4585, -9821, -9884, -12287, -5688, -1226, -8125, -12471, -11924, -10473, -7188, -2578, -3863, -2033, 4487, 4660, 4603, 1669, -969, -4001, -9150, -7036, -6483, -10986, -10236, -6269, -1839, 1820, 2254, -2662, 37, 1048, 1190, -672, -2743, 1180, -1470, -1140, -6422, -5154, -643, -4975, -5812, -3244, -3211, -10, 2686, -693, 5988, 12717, 8275, 8541, 2473, -548, -2882, -6244, -6073, -6802, -1409, -4744, -13982, -13245, -9076, -7552, -6133, 532, 3338, 922, -4946, -8426, -11259, -14640, -14386, -9993, -8104, -4877, -6342, -7023, -4029, -4267, -9152, -12238, -16369, -14994, -17314, -16940]
7605a6940P480L420o050K250R898n590o366K928l8k536P09N010m86k46M638l57
7589b276L111j423o475j791P481L305J133P670j213p435m907m808J956j326n837
7574a2835o648N698J1669K657j593M769L94j0393L307L507n661j0328J959J175
7560a2323M449M227n43r99N272M57K625n808j479K609l944M57M923R029j382k909
7544D661l685N18M509L590m503l903K566P501J375j2825j670n04j998o332M619
7529f081P761r38l64o125M127R282k895p739N899K822j972j960m338J767Q829
7514H075M643l113J28m16q394m557O793K221j312O907P785q010m971o747j214
7499b182O35K225m934J936M563J784o397N328N562m54q104o00l067n55M361P813
$$ y = [-16940, -9460, -6040, -12090, -9840, 58, -5532, -11898, -8970, -9008, -11544, -10835, -5825, -6311, -6557, -1919, -2276, 835, -588, -7063, -8854, -1373, 1932, 3065, 10735, 9522, 2087, -2820, -7628, -5672, -6998, -12835, -19483, -13785, -2116, 541, -1052, 3717, 4111, -6282, -2975, 532, -5129, -15457, -13498, -12323, -7874, -3647, -4190, -5189, 83, 540, 3165, -2643, -4122, -1513, -5457, -5000, -77, 8952, 7570, 4661, 976, 1494, 6003, 9593, 5090, 1187, 3753, 11254, 12629, -196, -1866, -2370, -4368, -10700, -6081, 1680, 742, 378, -5747, -1620, 7662, 4767, -2972, 2927, 5749, 3777, 1817, -2521, -754, 8075, 12718, 9605, 9733, 9317, 923, -3634, 3159, 5380, 4068, 10975, 18760, 10750, 5779, -968, -2182, -1547, 678, -4256, -2320, 2243, 4027, -2370, 2958, 8520, 8066, -38, -638, -3705, -4260, 101, 7914]
7483G914L452p779o188N28R69L507l74L745L415o724p368J944K815j575k050J974
7467a795O0j2913n097L979k089k361r39J0343M060k229j483j969p89L122K879
7452g221J716k120k193J84P378J348K927K574m181k120l567K829M160K034n922
7437b174l501M174j618j085J781R40j021l688N727L441j396K214l14l961o707
7422g188m71m764J574L525l62l252N212P859P59r950o259j24J044N558N160O540
7406D861N840k627m056l03M892K385m734j0436l357J089Q284N005J658o478j500
7391E23N477l447L531L003n814n396J223J0481J739l733n408k607K49l577j223
7376d979J526J592k607L595q81o768l280j063N346Q12K953L552l51l534k205L235
$$ y = [7914, 11366, 3587, -2601, -2073, -1104, 2403, 2029, 5774, 9189, 2465, -4903, -2959, -144, -1719, -3769, -1795, -1735, -14648, -19745, -15766, -17855, -20216, -21155, -10812, -6752, -8981, -10464, -12433, -13222, -10100, -7221, -5505, -7625, -9818, -9634, -2256, -908, 2019, 4593, 412, -1708, -5275, -2446, 1714, 3748, -2174, -5675, -1501, -3119, -4204, -2423, -1483, -2504, -6192, -465, 2976, 1580, 3794, 3480, -481, -7188, -7659, -12423, -10849, -7324, -7686, -10938, -5726, 2133, 2892, -7058, -13317, -13441, -12397, -6839, -1679, 4861, 10701, 8074, 4018, 3715, 8607, 10992, 6258, -4178, -7535, -6446, 1838, 6843, 8501, 2023, 523, 6000, 2553, 6084, 9087, 3273, -2123, -900, 9581, 11320, 7587, 2179, -428, -179, -3756, -4979, -3453, -1861, -4468, -873, -1754, -8522, -11802, -12865, -7519, -6707, -3754, -202, -553, -4087, -6292, -3057]
7360c057P166o91J279O921K758J277k399n319j2460n01J645R21k658m53J097M410
7344f4O577P385R14K45N575N388K012O666o060j4610k263L559j648P260K222m694
7328A8464j0951q231m031J760J643K342o65K788l665R12K548n19j54k942K800
7313B099K119j418l75L62r036p042O839N593O77J308j742K47m703n223j424J899
7297i820j329k582P202J1567Q00k007J098N444k860K326j334m615k305k982r18
7282b315k277k739Q7K446j916J0756N933Mk180m386n337Q10R47j667k75J021M07
7265f81k932q00N774M120K686m506q523O92N900J357L015n134o488L210K3k561
7249d848k674P853J085N19n358q20l489o66O35M760J545l247k294N2l049l442
$$ y = [-3057, 4109, 3418, 4697, 11618, 14376, 15653, 13254, 7935, -4525, -5026, -3381, -2460, -5118, -5571, -4474, -64, 6513, 13898, 14812, 15057, 20632, 26020, 28032, 34698, 28638, 14028, 11765, 15324, 13676, 20936, 23158, 18464, 7513, -718, -4749, -2989, -1346, 996, 331, 3119, -546, 366, 2914, 2395, 2241, -701, 2099, 4218, 2800, 2425, 2787, -6249, -13291, -6452, -859, -182, 1126, -616, -369, -5072, -10295, -11719, -9820, -11149, -13731, -6529, 5038, 5838, 3831, 4929, 10373, 7513, 9839, 8505, 3890, 1585, -1397, -2315, -4592, -7331, -7244, -4798, -6714, 4042, 9975, 9979, 7799, 3413, -1924, -1114, -167, -1834, -2109, -1088, -681, -3613, -4413, 1361, 5481, 8167, 3661, -4862, -4170, 1730, 3087, 6102, 968, -5520, -2310, -2287, -4848, -7522, 331, 1416, 1935, -3423, -4243, -7732, -8398, -7763, -3003, -1458, -4705, -6999, -6947, -9996, -13438]
7233a3438K665N174m015m025o067M040M610j715M714Q474P347O848j391m007l779
7218E435K185J1062l669p445P99J627M264M260o665j3500K240R709K538j484p409
7203C947j0116r266J775N03N277O043p89p757K344o092L71J209k908N142L541
7188f776M690N792j355P46L108k061l64J447l749M303J653l185k310o165q570
7173a2796j901l55J1202Q669j603n588m474J382R944Q0k523j267j431k449P442
7158D332N407o359r28N773j656m92J612r17m975q468L45J399M247O03j041k937
7142d055m385L724O019o31m80k823O048M78l895r143k217J147N697L368J17L316
7126B285J504m209q474j228j958J857M121j27J360p62L70Q496r70r762p014J0718
$$ y = [-13438, -10773, -5599, -9614, -13639, -19706, -15666, -11056, -12771, -8057, 417, 7764, 14612, 13221, 9214, 5435, 7620, 18682, 15013, 7568, 8367, 9994, 14258, 18518, 11853, -1647, 593, 10302, 12840, 11356, 3947, -6169, -15435, -13660, -13157, -7880, -1837, -2626, -10383, -8039, -14131, -13760, -12551, -15459, -10317, -6776, -2086, 3706, 2351, 3097, 6205, 4144, 3780, 5227, 1478, 5781, 7434, 4249, 1939, -4226, -12796, -14697, -15052, -3850, 4819, 3216, -2372, -6846, -5464, 4480, 4560, 2037, 770, -661, -3110, 4332, 9739, 3380, 2452, 8225, 6569, 6077, 7689, 6772, 1797, -6671, -6326, -4927, -680, -77, -1118, -4055, -8440, -4716, 1303, 672, 192, -2631, 3417, 3895, 0, -9143, -11360, -10213, -4516, -1148, -1031, 2285, 3789, -420, -8894, -10122, -12080, -10223, -6102, -6229, -4869, -5631, -5261, 3235, 2265, -7497, -14511, -3793]
7110c793Q728N454J802n664p137L064q798k961o408M937R203K681K19l279o379
7095h331J04J213k226K681o20n059Q54N806M029Q198J901q213n116k107j686j565
7079a0137J540L016O561j544M085N858K47k577n479l857l069m453N945J2801l85
7064H552q005K69l621n402q93J695Q195J449Q34n581M404L973L876k567j1410
7049d232j326O94L131N349k93o340m231p037R26N647M829j730n051L025M256P81
7033a602L38l594k893N239J279O600M326o047o145J808K441M635Q98o215k834
7018a766P27p86j30L94k242M449M66k639L154L08k865r56J786j569J866j544j148
7001b495O742Q184q28m345k104k569n059J834O219J662n303l421k1m24k907o282
$$ y = [-3793, 4935, 10389, 12191, 6527, -610, 2454, -6344, -9305, -15713, -10776, -1573, 1108, 1327, -1952, -8331, -8227, -7014, -9240, -6559, -7179, -12238, -11384, -5578, -1549, 6649, 8550, 337, -4779, -6886, -8572, -10137, -8597, -5581, 980, -564, 3521, 9379, 9626, 7049, 1570, -2287, -5356, -9809, -3864, 8937, 8552, 547, 816, -2805, -8207, -9100, -7405, 790, 2239, 3073, -2508, 1896, 5869, 9745, 7178, -4232, -5558, -4864, -1733, 3616, 3323, -3017, -7248, -14285, -13359, -7712, -2883, -4613, -9664, -6639, -2383, -1602, -1264, -4858, -7751, -2512, -1233, 5367, 9693, 3646, -2499, -691, 1750, 6385, 7283, 1068, -1766, -1039, -1825, -1955, -1561, -3803, 646, 1112, -1527, 1627, 1935, -930, -1886, -100, -1669, 197, -1347, -2495, 4247, 12431, 11603, 7258, 5154, 2585, -2474, -640, 5579, 7241, 1938, -1483, -1504, -1928, -4835, -11117]
6985a1117m995J878J222Q187O961j804J678M02K083l938l645L924p176k377q86
6970i603J958k088q6j902M937M157J302k386J121L41m548q92K192K622M89L436
6954A050J433l279J26L02R23N122J857n378p508j526N969j805l670m0k10j460
6938h094k11J426r04Q596Q119M39q942O18K353L419m201J832K001J075J08J398
6922I032m589m855r75m951r52M263L027J372N079l949O470M109n373l885k61J759
6906E321J749l352J272O785L188O23j843l561k856P96l428N100R529k839l10l912
6890A2262p344L74Q358j375j105L228r16r660q069k673k844K966M059M466J134
6875B861O90J414m061m820J694K525O982l376J226O740j394j897m186K556K868
$$ y = [-11117, -16112, -14234, -13012, -4825, 2136, 332, 2010, 2412, 4495, 557, -3088, 836, -6340, -8717, -9603, -7645, -9733, -9819, -11721, -6784, -2627, -1325, -3711, -2590, -2249, -6797, -7689, -5497, -2875, -2386, 1050, 2483, -796, -670, -368, 555, 5677, 7534, 2156, -5352, -6878, -909, -2714, -6384, -6424, -6634, -8094, -8305, -6879, -7783, 813, 8932, 9371, 429, 1047, 3400, 6819, 2618, 4450, 6451, 7526, 7634, 9032, 4443, -412, -1387, -6338, -7290, -3027, 0, 1372, 6451, 2502, 8972, 13081, 7708, 3823, 3562, 5321, 7070, 3718, 4990, 11775, 14963, 15586, 13743, 10182, 7326, 8122, 4694, 9794, 19323, 16484, 16174, 12262, 4918, 5292, 13650, 12275, 11170, 14398, 13482, 3822, -4247, -6920, -9764, -6798, -2739, 1727, 2861, 3551, 4965, 904, -3916, -2222, 303, 7285, 3909, 5135, 11875, 10481, 8584, 4398, 6954, 9822]
6860I822m774q901J554l51p504J589N820L131j0104k650q69O824J463k067P170
6845A53P226R042M259m634o407l006j47r75J687N575L69k396K457n048o537l31
6829A287l494l830l942Q49L34Q565O668q021o799j675K978R010j39n061j87L550
6813I3k812j326O910M425j565j990k125l652M534k495q716Q985L902l493m609
6798c934j958o5o303O256J991K797M252L137j720k367n438j18n14O04N698K927
6782E245J133m15J147o132n029N869Q26M820N431m715k219O800J0291J356J074
6767B5482J0631O559q520j0363p027r263p450l94L584M866K220K583K487j447
6753A3948P481q55j161j525j823O516K0940J8103K9711M9267L0866O465r33k3332
$$ y = [9822, 5048, -3853, -2299, -2650, -10154, -8565, -2745, 386, -9718, -12368, -13237, -6413, -4950, -7017, 153, 7379, 16421, 20680, 16046, 9639, 6633, 6486, 5511, 7198, 12773, 13142, 10746, 13203, 8155, 1618, 1287, -2207, -6037, -9979, -9130, -8796, -231, 6437, -1584, -8383, -10058, -7080, 1930, 1791, -3270, -3457, 93, -2719, -4045, 2865, 7290, 5725, 3735, 1610, -2042, 2492, -3, -8719, 266, 4168, 675, -3934, -5892, -5957, -12260, -6004, -4013, -1216, 3036, 6173, 4453, 2086, -3352, -3470, -3984, -3380, 2318, 5245, 6378, 5963, 7110, 978, -4051, 1818, 2644, 7464, 12895, 8180, 5961, 12761, 23052, 24408, 25482, 36113, 42672, 34152, 23789, 16762, 7499, 49, -345, 3239, 8105, 10325, 12908, 15395, 13948, 21429, 20574, 19413, 17888, 16065, 22581, 43521, 61624, 91335, 140602, 171468, 177933, 177000, 153668]
6739A53668m0104l4995l3623j9321l658o971N691K434j0699m763K354n81j530
6726G902l708m37p532O385L30J476n152M633K138r8k91o353L970N631l50k189
6710F355R6O67m259J736j239O52J027k406l291o08M523O673J430j715n385q14
6694C442J469l349k299M997l236l012m451L438k25N659j301l281L917P827O394
6679A5989r347m428N107P62j820m44j937J025o668m196l183l278M244M756M335
6664I17O56k182K651j092L406l32l64j872l204K770N118k27K217k263q027l808
6648e636l324jk720k555K651k918l792k722M252M056j953p32N627N241r04N349
6632h1l538m990L366P708L931o90L034q540p758J992l449N427l422L907J333k24
$$ y = [153668, 113564, 78569, 44946, 25625, 21967, 14996, 20687, 23121, 12422, 7659, 10013, 9432, 7902, 4194, 3757, -3775, 2610, 2940, 4416, -736, 3897, 6035, 5937, 5646, -707, 3263, 8894, 8544, 6355, 6451, 7118, 2859, 4595, 3356, 4008, 5035, 2629, -662, -1270, 3253, 9926, 11356, 9641, 4256, 3442, 4911, 1562, -737, 4260, 1024, -1988, -6439, -3001, -3226, 2433, 1132, -2149, 1768, 9595, 15989, 6642, 2214, 7321, 8083, 6263, 5819, 3882, 4907, -1761, -5957, -9140, -12418, -8174, -3418, 917, 1573, -609, 2042, 950, 4356, 4024, 3660, 1788, -1416, 1354, 6472, 6245, 8462, 6199, -1828, -5636, -8960, -8961, -11681, -14236, -11585, -14503, -18295, -21017, -16765, -12709, -14662, -15394, -9767, -4526, -5430, -81, -3619, -8609, -5243, 2465, 6396, 5706, 8740, 200, -7558, -5566, -9015, -3588, -7010, -3103, -1770, -1994]
6616a994j942K510P607Q38P968M160k768n424l187n920l624O08P96L182J031k638
6600A203n327J289k560J592j699k476k893L365K365P06J923k769K426K137Rj42
6584h51K612M562r428l368N437K16L359j599j162j824K354p933N4k454K621J568
6568e836j624l70j188N000j598m472l60N415P492K690j733l279M09L770p06K385
6552E995j72l96j0198m363O801j662J05K305j315o907k534R132N863J013l55r36
6536B376j816K083l595L74K957l971J732K665O498l161k190l269j890l934n710
6521a0851M201K387j812N605l521K547l36O08M075k190o212k525M23J0360L265
6506F024J212n415l289P20Q59l530k640q38m0L965L527K062k613q573o365J700
$$ y = [-1994, -3936, -1426, 6181, 7019, 14987, 19147, 16379, 10955, 7768, 1848, -1776, -1168, -372, 2810, 3841, 1203, -4124, -2835, -5395, -3803, -5502, -7978, -10871, -7506, -5141, -4435, -2512, -5281, -2855, -718, -709, -851, 1761, 6323, -3105, -6473, -1036, -820, 2539, 940, -222, -2046, 308, -7625, -7571, -10025, -7404, -5836, -7460, -7830, -9018, -4018, -5616, -10088, -10448, -5033, 2459, 5149, 3416, 137, 546, 4316, 3610, 5995, 5823, 5427, -4771, -9134, -2333, -3995, -3890, -1585, -2900, -9807, -12341, -3209, 2654, 3667, 3312, 2376, 560, 2643, -952, -578, 2379, -1592, 140, 2805, 9303, 6142, 3952, 683, -1207, -5141, -10851, -6650, -4263, -6075, -470, -3991, -1444, -1780, -1172, 2903, 713, -5499, -8024, -7601, 2759, 6024, 7236, 1821, -1468, -748, 111, -3419, -6059, -6897, -6937, -2972, 555, 2617, 4, -8569, -14934, -13234]
6490a3234j16Q065k7K565L724J398j16K629l413l876m344j106L785P584k003n823
6474d308j570k791n91k602K237n30m372K965J600L710M775L494m616l872l547
6459a0018M140J59M817k360n459M820O786n467p562M530P194L220n014k151l20
6444b685l148K40O087N279n923j642K33M745l33m734j163K311L038l736l108N219
6428F80m895q83O259L347P14Q83o93m95j68K505k260p97n520k10N73J051n31m913
6410e353o439K763P455R239L815m285q000m678K397O082k563l850L943L474m525
6395e25N07M705n751o734k881l37M163K091M30K699j237N318l73m420K373k008
6379a980J59k226k270l535N599J712r27O649j474N80L530M79m570m96M910O582
$$ y = [-13234, -13350, -5285, -5312, -2747, 977, 2375, 2259, 4888, 1475, -2401, -6745, -7851, -4066, 3518, 1515, -4308, -5878, -8669, -9260, -11862, -9625, -10155, -14527, -11562, -9962, -6252, -1477, 2017, -2599, -6471, -10018, -5878, -5719, -902, -3262, -8721, -3901, 2885, -2582, -10144, -5614, 1580, 4800, -214, -2365, -2685, -5833, -5593, 494, 5773, -150, -1792, -1559, 3186, 2853, -1881, -3044, -733, 2305, -1431, -4539, 680, -4215, -5098, 1161, 4508, 5222, 6105, 5412, 4917, 4749, 7254, 4994, 4197, -1323, -1533, -960, 91, -440, -5353, -11792, -9029, -1574, 7665, 11480, 7195, -805, -5483, -3086, 2996, 433, -3417, 526, 4000, -525, -18, 4687, -1064, -7798, -10679, -11016, -6853, -4762, -4332, -1633, -2870, 2448, 2075, -2345, 28, -1980, -1821, -4047, -6317, -9852, -4253, -2541, -3468, 3181, 1707, 2287, 5817, 6296, 1726, 1230, 6140, 12722]
6363A2722m129p580n22p289l939N18O13J837M37K642J198J58K199M138l389k198
6347b584j17k587j279J747K90J404o799N160N481P359k505n387r96K562p194q68
6331f313P114l83m289o33o161l896L015Q856O940J408n10K786P74M32Q637M98
6315A8275r556r068k926P921J380l17J200L420m190q46k529k002J904%j168l415
6299a917j502K099K239J415j773j057J210Q99K72m488k090K146N442m354m22k767
6283d648j0248K816O319K000M74J901l389o097N537l340J590O221j444q282L807
6268f783P411P289l585l182m258P52L366K228Q95J814n957K68L525M267J697k879
6252F868J366j601j78k184r49m812l275o50j302N064O261L197K18l111r91l795
$$ y = [12722, 8593, 1013, 491, -6798, -10737, -10219, -9606, -7769, -7332, -4690, -3492, -3334, -1135, 3003, -386, -2584, -2701, -5288, -6567, -4820, -4530, -3126, -9925, -4765, 716, 8075, 5570, 183, -813, 1749, -5445, -6313, 801, 418, -3871, -4504, -10665, -14561, -11546, -2690, 4250, 5658, 5148, 7934, 8708, 9140, 17777, 18275, 8719, -349, -3275, 4646, 6026, 5709, 6909, 10329, 6139, 5293, 2764, 762, 2666, 2666, 1498, -1917, -3419, -1320, 919, 2334, 561, -496, 714, 1613, 1885, -2603, -4693, -2547, 2895, -1459, -1881, -4648, -14896, -12080, -5761, -3761, -3287, -1386, -4775, -10872, -5335, -8675, -7085, -864, -2308, -10590, -6783, 628, 7917, 4332, 1150, -3108, -2356, 1010, 3238, 4133, 5947, -10, 258, 3783, 8050, 9747, 6868, 8234, 6633, 6455, 4271, 3322, -1490, -4765, -5415, -6717, -1653, 4608, 7805, 8023, 4912, 3921, 126]
6236A26p473k568N498K083k492n465N489Q838O964j260n411k755o757J922j676
6221d937n450N385J0640O093j590l699l974j777k251k651o71M189l969k612l77
6206g651O006M372L16J280m279l179M862o259n223K00N105k731J196k94P049r76
6190b06q726j285L419j261m57O820l83n22l736j0007j045J0893L342l462n183
6175a1799k017P77J437o356j733M481J476M143N916j395J401M567J631n406L931
6160A054r43r256p103M381J0020q63m069L755J267n562K534O03l604j019J3748
6145D943L583l140m856k703k660J444j775L195P02l103k578O837K871N427j198
6130F989o353l523m804J643L028k754K056l86J420k249k589P944J99Q25k451j708
$$ y = [126, -7347, -9915, -4417, -2334, -4826, -10291, -4802, 4036, 11000, 9740, 4329, 1574, -5183, -3261, -4937, -10387, -5002, 5638, 11731, 10141, 6442, 2468, 691, -1560, -4211, -4882, -693, -4662, -7274, -7651, -1645, 2727, 3043, 4323, 44, -3135, 1727, -4532, -9755, -9555, -4450, -7181, -5985, -6279, 770, -206, -8932, -10217, -6798, -8059, -8516, -1696, -2079, -2601, -6337, -16344, -17389, -6496, -3154, -6616, -11799, -13816, -13039, -11602, -17958, -19691, -15210, -13734, -9591, -3675, -5070, -3669, 898, 2529, -2877, 1054, 111, -9145, -16248, -11867, -1847, -2710, -6779, -3024, -1757, -7319, -4785, -4182, -7786, -8805, 4943, 8526, 5386, 530, -2173, -4833, -3389, -5164, -1969, -1267, -4370, -6948, -111, 2760, 8187, 6989, 636, -2887, -7691, -6048, -3020, -5774, -3718, -4104, -2684, -4933, -7522, 422, 621, 1446, -1005, -2713]
6114b713K315M840j1004k867J052P64P162M719K62P53l636o226p230P195J010
6099c604k873L849j073K742Q705m040k35L038K161l690r455n988M200J1560Q744
$$ y = [-2713, -398, 4442, -6562, -9429, -8377, -7613, -451, 4268, 4530, 5283, 1647, -4579, -11809, -4614, -3604, -6477, -2628, -3701, -959, 7746, 3706, 3471, 6509, 8670, 4980, -4475, -10463, -6263, 5297, 14041]
$$ [...]
##END NTUPLES=NMR SPECTRUM
##END=
