##TITLE=Analysis number 314567
Compound Code sp 00224
Project Code adrs
Chemist Name ugmt
##JCAMPDX= 6.0         $$ Bruker NMR JCAMP-DX V2.0
##DATA TYPE= NMR SPECTRUM
##DATA CLASS= NTUPLES
##ORIGIN= Bruker BioSpin GmbH
##OWNER= NMR
$$ XWIN-NMR		Version 3.5
$$ Thu Oct 20 09:05:58 2005 GMT Daylight Time (UT+1h)  MAYBRIDGE\NMR@NMR_250MHZ
##.OBSERVE FREQUENCY= 250.131544655141
##.OBSERVE NUCLEUS= ^1H
##.ACQUISITION MODE= SIMULTANEOUS (DQD)
##.ACQUISITION SCHEME= undefined
##.AVERAGES= 16
##.DIGITISER RES= 18
##SPECTROMETER/DATA SYSTEM= dpx250
##.PULSE SEQUENCE= zg30
##.SOLVENT NAME= CDCl3
##.SHIFT REFERENCE= (INTERNAL, CDCl3, 0, 16.522)
##AUDIT TRAIL= $$ (NUMBER, WHEN, WHO, WHERE, WHAT)
$$ ##TITLE= Audit trail, XWIN-NMR		Version 3.5
$$ ##JCAMPDX= 5.01
$$ ##ORIGIN= Bruker BioSpin GmbH
$$ ##OWNER= NMR
$$ C:\u/data/dgb/nmr/ADRS/11060/pdata/1/auditp.txt
$$ ##AUDIT TRAIL=  $$ (NUMBER, WHEN, WHO, WHERE, WHAT)
(   1,<2005-10-20 09:05:28.66 +100>,<MAYBRIDGE\NMR>,<NMR_250MHZ>,
      <created by zg, POWCHK disabled, PULCHK disabled
       configuration hash MD5:
       62 19 C7 07 E1 42 D1 B7 37 6C 3D D0 77 39 F9 E6
       data hash MD5: 64K
       F0 65 7C 93 26 22 3D 11 B5 E4 E4 06 BF 88 BB 7C>)
(   2,<2005-10-20 09:05:44.28 +100>,<MAYBRIDGE\NMR>,<NMR_250MHZ>,
      <Start of raw data processing
       ef LB = 0.3 FT_mod = 6 PKNL = 1 SI = 32K 
       data hash MD5: 32K
       D7 1E 52 CC 73 AC 54 25 4F B1 FD CB 3E 64 11 BD>)
(   3,<2005-10-20 09:05:46.66 +100>,<MAYBRIDGE\NMR>,<NMR_250MHZ>,
      <apk 
       data hash MD5: 32K
       B0 9D 0D 17 F9 92 0C 3B CB F8 7F 9C 68 B1 38 C9>)
(   4,<2005-10-20 09:05:47.78 +100>,<MAYBRIDGE\NMR>,<NMR_250MHZ>,
      <abs ABSG = 5 
       data hash MD5: 32K
       4D 5E 5E D2 26 55 1D 4C 60 D6 76 BA E2 5D F3 4E>)
$$ ##END=
$$ 
$$ hash MD5
$$ DB 40 58 54 A0 EA 2D D8 AF 46 E9 E9 57 FD E1 AA
##$RELAX= 
##$RELAX= 
##$RELAX= 
##$RELAX= 
##$RELAX= 
##$RELAX= 
##$RELAX= 
$$ Bruker specific parameters
$$ --------------------------
##$DU= <C:\u>
##$EXPNO= 11060
##$NAME= <ADRS>
##$PROCNO= 1
##$TYPE= <nmr>
##$USER= <dgb>
##$AMP= (0..31)
100 100 100 100 100 100 100 100 100 100 100 100 100 100 100 100 100 100 
100 100 100 100 100 100 100 100 100 100 100 100 100 100 
##$AQSEQ= 0
##$AQ_mod= 3
##$AUNM= <au_zg>
##$AUTOPOS= <6 >
##$BF1= 250.13
##$BF2= 250.13
##$BF3= 250.13
##$BF4= 250.13
##$BF5= 500.13
##$BF6= 500.13
##$BF7= 500.13
##$BF8= 500.13
##$BYTORDA= 1
##$CFDGTYP= 0
##$CFRGTYP= 5
##$CHEMSTR= <none>
##$CNST= (0..31)
1 1 145 1 1 1 1 1 1 1 1 1 1 1 1 1 1 1 1 1 1 1 1 1 1 1 1 1 1 1 1 1 
##$CPDPRG= <>
##$CPDPRG1= <>
##$CPDPRG2= <>
##$CPDPRG3= <>
##$CPDPRG4= <mlev>
##$CPDPRG5= <mlev>
##$CPDPRG6= <mlev>
##$CPDPRG7= <mlev>
##$CPDPRG8= <mlev>
##$CPDPRGB= <>
##$CPDPRGT= <>
##$D= (0..31)
0 1 0 0 0 0 0 0 0 0.06 0 0 0 0 0 0 0.0002 0 0 0 0 0 0 0 0 0 0 0 0 0 0 
0 
##$DATE= 1129795526
##$DBL= (0..7)
120 120 120 120 120 120 120 120 
##$DBP= (0..7)
150 150 150 150 150 150 150 150 
##$DBP07= 0
##$DBPNAM0= <>
##$DBPNAM1= <>
##$DBPNAM2= <>
$$ [...]
##$SUBNAM7= <"">
##$SUBNAM8= <"">
##$SUBNAM9= <"">
##$SW= 20.6930455092707
##$SWIBOX= (0..15)
0 0 3 0 0 0 0 0 0 0 0 0 0 0 0 0 
##$SW_h= 5175.983436853
##$TD= 65536
##$TD0= 1
##$TE= 295.16
##$TE2= 300
##$TE3= 300
##$TEG= 300
##$TL= (0..7)
0 120 120 120 120 120 120 120 
##$TP= (0..7)
150 150 150 150 150 150 150 150 
##$TP07= 0
##$TPNAME0= <>
##$TPNAME1= <>
##$TPNAME2= <>
##$TPNAME3= <>
##$TPNAME4= <>
##$TPNAME5= <>
##$TPNAME6= <>
##$TPNAME7= <>
##$TPOAL= (0..7)
0.5 0.5 0.5 0.5 0.5 0.5 0.5 0.5 
##$TPOFFS= (0..7)
0 0 0 0 0 0 0 0 
##$TUNHIN= 0
##$TUNHOUT= 0
##$TUNXOUT= 0
##$USERA1= <user>
##$USERA2= <user>
##$USERA3= <user>
##$USERA4= <user>
##$USERA5= <user>
##$V9= 5
##$VALIST= <valist>
##$VCLIST= <CCCCCCCCCCCCCCC>
##$VD= 0
##$VDLIST= <DDDDDDDDDDDDDDD>
##$VPLIST= <PPPPPPPPPPPPPPP>
##$VTLIST= <TTTTTTTTTTTTTTT>
##$WBST= 1024
##$WBSW= 4
##$XGAIN= (0..3)
0 0 0 0 
##$XL= 0
##$YL= 0
##$YMAX_a= 475412
##$YMIN_a= -346345
##$ZGOPTNS= <>
##$ZL1= 120
##$ZL2= 120
##$ZL3= 120
##$ZL4= 120
##$ABSF1= 16.522
##$ABSF2= -4.171173
##$ABSG= 5
##$ABSL= 3
##$ALPHA= 0
##$AQORDER= 0
##$ASSFAC= 0
##$ASSFACI= 0
##$ASSFACX= 0
##$ASSWID= 0
##$AUNMP= <proc_1d>
##$AZFE= 0.1
##$AZFW= 0.1
##$BCFW= 0
##$BC_mod= 0
##$BYTORDP= 0
##$COROFFS= 0
##$CY= 12.5
##$DATMOD= 1
##$DC= 0
##$DFILT= <>
##$DTYPP= 0
##$F1P= 14.0000005364418
##$F2P= -0.99999901652339
##$FCOR= 0.5
##$FTSIZE= 32768
##$FT_mod= 6
##$GAMMA= 0
##$GB= 0
##$INTBC= 1
##$INTSCL= 1
##$ISEN= 128
##$LB= 0.3
##$LEV0= 0
##$LPBIN= 0
##$MAXI= 10000
##$MC2= 0
##$MEAN= 0
##$ME_mod= 0
##$MI= 0
##$NCOEF= 0
##$NC_proc= -3
##$NLEV= 6
##$NOISF1= 0
##$NOISF2= 0
##$NSP= 0
##$NTH_PI= 0
##$NZP= 0
##$OFFSET= 16.522
##$PC= 1
##$PHC0= -68.27477
##$PHC1= 7.785295
##$PH_mod= 1
##$PKNL= yes
##$PPARMOD= 0
##$PSCAL= 4
##$PSIGN= 0
##$REVERSE= no
##$SF= 250.13
##$SI= 32768
##$SIGF1= 0
##$SIGF2= 0
##$SINO= 400
##$SIOLD= 32768
##$SREGLST= <1H.CDCl3>
##$SSB= 0
##$STSI= 32768
##$STSR= 0
##$SW_p= 5175.98343685301
##$SYMM= 0
##$S_DEV= 0
##$TDeff= 65536
##$TDoff= 0
##$TI= <Analysis number 999999
Compound Code 99
Book Reference 9
Project Code 9>
##$TILT= no
##$TM1= 0
##$TM2= 0
##$TOPLEV= 0
##$USERP1= <user>
##$USERP2= <user>
##$USERP3= <user>
##$USERP4= <user>
##$USERP5= <user>
##$WDW= 1
##$XDIM= 32768
##$YMAX_p= 572930682
##$YMIN_p= -129770
$$ End of Bruker specific parameters
$$ ---------------------------------
##NTUPLES= NMR SPECTRUM
##VAR_NAME=  FREQUENCY,     SPECTRUM/REAL,   SPECTRUM/IMAG
##SYMBOL=    X,             R,               I
##VAR_TYPE=  INDEPENDENT,   DEPENDENT,       DEPENDENT
##VAR_FORM=  AFFN,          ASDF,            ASDF
##VAR_DIM=   32768,         32768,           32768
##UNITS=     HZ,            ARBITRARY UNITS, ARBITRARY UNITS
##FACTOR=    0.157963299565203, 1,           1
##FIRST=     4132.6476996994, 0,             0
##LAST=      -1043.33573715361, 0,           0
##MIN=       -1043.33573715361, -129770,     0
##MAX=       4132.6476996994, 572930682,     0
$$ Real data points
##PAGE= N=1
##DATA TABLE= (X++(R..R)), XYDATA
$$ [...]
19328C34035j2596k0122j7498l1425K6624O1864J2071j5457l3712j1979j6589
19317B75216J5654o783j4342K0704j5178L129n932j8394K2514J3325L8179k793
19305C25299j4724J8811J175l475J6890L6898K6261J1549K2985j7876j6119j0015
19293C97659K7891L3142L0347L238J0501K1971J2587K3104j072K7373M1993K7202
19281F55936J6533N2132R2224J65908K28541J95690M4944p3672p7859M489P4690
19270A379556J76591J76307O6773m5715j147L7090k5100j07374q9364M35J20661
19259A688713J85409J69227K9543m7490m3050L4702J04710J57368J77765J65448
19249B622345K10568K73157L22363L77679L38339L27549L91723M55583N19158
$$ y = [334035, 321439, 301317, 283819, 252394, 279018, 340882, 352953, 337496, 303784, 291805, 275216, 290870, 284087, 269745, 290449, 275271, 278400, 272468, 254074, 276588, 289913, 328092, 325299, 310575, 329386, 330561, 327086, 343976, 380874, 407135, 418684, 441669, 423793, 407674, 397659, 425550, 458692, 489039, 492277, 502778, 524749, 537336, 560440, 559368, 586741, 628734, 655936, 672469, 724601, 816825, 982733, 1211274, 1406964, 1451908, 1378236, 1300377, 1304866, 1379556, 1556147, 1732454, 1799227, 1753512, 1752365, 1789455, 1764355, 1656981, 1567617, 1568052, 1688713, 1874122, 2043349, 2072892, 2025402, 1982352, 2017054, 2121764, 2279132, 2456897, 2622345, 2832913, 3106070, 3428433, 3806112, 4144451, 4472000, 4863723, 5319306, 5838464]
19240E838464N72987O45072P54173Q59114R72383J105053J285505J563761K005346
19231A5601858K715692L987366O122415Q884916J0613370R058448L863513L86594
19223F1234172r74224n258558p139026l233764J796760O662059J1589104J4933311
19215G9609834J4317498J0125216O714593o00187j0701859j2339664j1979085
19208G5146346j3217257r583913l720468J520389O487495R498228Q096755J506566
19200G5734141l375568m922607j0104156j3395163j0214062o379294m176660k870897
19192B0295734k130503j633176j206830r90379r50227r07425q90810r26701r52949
19183I706734r14026q23290p54822o44503n51526n29453m74738m31627l43127
$$ y = [5838464, 6411451, 7056523, 7810696, 8669810, 9642193, 10747246, 12032751, 13596512, 15601858, 18317550, 22304916, 28427331, 37312247, 47925617, 56984065, 60847578, 61234172, 60259948, 55001390, 47862364, 44628600, 46425360, 53087419, 64676523, 79609834, 93927332, 104052548, 110767141, 110166954, 99465095, 87125431, 75146346, 61929089, 52345176, 48624708, 50145097, 56632592, 66130820, 74227575, 75734141, 72358573, 67435966, 57331810, 43936647, 33722585, 27343291, 23166631, 20295734, 18165231, 16532055, 15325225, 14334846, 13384619, 12477194, 11586384, 10659683, 9706734, 8792708, 7969418, 7214596, 6570093, 6018567, 5489114, 5014376, 4582749, 4239622]
19174D239622k02916k00627j88624k37456k67493k25742k15750j91918j38007
19165B371089j06368o7110n1433n8300m7694j1717k046q5511j70667j19263j43405
19154A507575j66592j18304k4885N537J8185K8635L613j8415m9143o2051p0568
19143A053587n8960m5404k3521j7610j2489l3398o228J8624K878L2410K8575J9627
19131I58091K1847P5306R9960N2037O6326K0690Q249M6277J01640Q7227M9896
19120A587546L3874N5512J19931J67046J95496J59259J38505J80924J94563J86147
19110C018803K07143K66733K36969K80653L70753M19206M24218M26855M87235
19101F138568N76717P06705R02517J192311J542530K034647K961045M706760P124332
$$ y = [4239622, 4036706, 3836079, 3647455, 3409999, 3142506, 2916764, 2701014, 2509096, 2371089, 2264721, 2197611, 2146178, 2087878, 2040184, 2028467, 2026421, 1940910, 1770243, 1650980, 1507575, 1340983, 1222679, 1197794, 1203331, 1221516, 1250151, 1253764, 1235349, 1186206, 1124155, 1053587, 994627, 949223, 925702, 908092, 895603, 862205, 855977, 874601, 877479, 909889, 938464, 958091, 979938, 1055244, 1155204, 1207241, 1273567, 1294257, 1302506, 1348783, 1450423, 1537650, 1587546, 1621420, 1676932, 1796863, 1963909, 2159405, 2318664, 2457169, 2638093, 2832656, 3018803, 3225946, 3492679, 3729648, 4010301, 4381054, 4800260, 5224478, 5651333, 6138568, 6715285, 7421990, 8324507, 9516818, 11059348, 13093995, 16055040, 20761800, 27886132]
19092B7886132Q371290N909613r52108n831483l898495P33730N133577Q028953
19084D5381209P372393K100266k557668j778784j790708n950169p516942m326383
19076C0933214k63056L186821M732527K460748l934597q215173o673751l953703
19068A8273030k371288j638159j252280r43482p12821n19457l61027k34736j76263
19059A0063517j63667j43794n0673O5229J32747J64401K40101L67976N69462Q34625
19049A2079924J154190J604167K264753L298219N261927P974874R296628O336812
19041D9271494j370756o562446m098957J121849N891761Q920430P969840K251362
19033F3394577k339605j613359k414621p410065q689093m672730K1595L811779
$$ y = [27886132, 36257422, 42167035, 41214927, 35383444, 31484949, 32218679, 37352256, 45381209, 52753602, 54853868, 52296200, 50517416, 48726708, 42776539, 35259597, 30933214, 30670158, 33856979, 38589506, 41050254, 37115657, 28900484, 22226733, 18273030, 15901742, 14263583, 13011303, 12067821, 11355000, 10835543, 10474516, 10239780, 10063517, 9899850, 9756056, 9705383, 9770612, 9903359, 10067760, 10307861, 10675837, 11245299, 12079924, 13234114, 14838281, 17103034, 20401253, 25663180, 33638054, 42934682, 49271494, 47900738, 41338292, 37239335, 38361184, 44252945, 53173375, 61143215, 63394577, 61054972, 59441613, 57026992, 49616927, 40927834, 36255104, 36276699, 40088478]
19025D0088478N180034J987164n521506r852369p735430m635569k912656k119932
19017A4478214j665319j299680j017114q13882o79758n91636o10749o35476o75397
19008F489203o35899n21128m23593l87752m01582l47333l29055k67091k84852
18999B890918k00680j58375j50462j83083j25597r0639j15574j25485j17687j19346
18989A503990q4925o8322m5077j763l5539m9828l9625o3201j09497j03823q8942
18978H13448m9277J7287K1227o475m8089m7778L815K784K5494K9982k0985k1008
18966G20425k3512p0505q8783p5186l6171k8757m7799L145L3300J1621J3158j9162
18954C91774j2790m1092m6504J4111J1558L938J1858j18j3849o132K4625J2865
$$ y = [40088478, 45268512, 47255676, 41734170, 31881801, 24146371, 19510802, 16598146, 14478214, 12812895, 11513215, 10496101, 9682219, 9002461, 8410825, 7800076, 7164600, 6489203, 5853304, 5332176, 4908583, 4520831, 4119249, 3771916, 3442861, 3175770, 2890918, 2690238, 2531863, 2381401, 2198318, 2072721, 1982082, 1866508, 1741023, 1623336, 1503990, 1419065, 1350743, 1305666, 1303903, 1268364, 1218536, 1178911, 1115710, 1006213, 902390, 813448, 764171, 781458, 802685, 796210, 748121, 700343, 704158, 706942, 732436, 762418, 741433, 720425, 696913, 626408, 537625, 462439, 426268, 397511, 349712, 352857, 386157, 397778, 410936, 391774, 378984, 337892, 291388, 305499, 317057, 320995, 332853, 332735, 318886, 312754, 337379, 350244]
18942C50244j8123R054k1854l4412p647j9852Q38J1430K4959L2887n492k6435
18930B95597j7379K6764J8765J0345K1749J3172M5111O7930P2379J09814Q2625
18919G46872L7277J504l9710o6144q9257r8611p3990l3918l2923m6044k337p124
18907B95595r515L359m359j4681J005j6207m6673q039q270J5407k0605K2318J1840
18894B21175J089k82o160l578k9764m9491k3612m762O624K1519L0381j5891m6247
18881A01001j7337J093K6356K7358J5891M3294K2297L3484L3609L4017N1819K6391
18869C99273J9044N989k3529p8974r2712l3585j4438J6604r707j028K2738J8666
18857B28341L8860l3260n0000m5845J962J7140L8079j2575l1905N231O441j7626
$$ y = [350244, 332121, 341175, 319321, 284909, 277262, 257410, 258248, 269678, 294637, 327524, 322032, 295597, 278218, 304982, 323747, 334092, 355841, 369013, 414124, 482054, 554433, 664247, 746872, 784149, 785653, 745943, 679799, 590542, 491931, 417941, 384023, 351100, 305056, 302719, 295595, 286080, 289439, 285080, 270399, 271404, 255197, 208524, 200485, 192215, 207622, 187017, 209335, 221175, 222264, 221982, 215822, 212244, 182480, 132989, 109377, 104615, 111239, 132758, 163139, 147248, 101001, 83664, 84757, 111113, 138471, 154362, 197656, 219953, 253437, 287046, 321063, 372882, 399273, 418317, 424306, 400777, 321803, 229091, 195506, 181068, 197672, 187965, 186937, 209675, 228341, 267201, 233941, 183941, 138096, 140058, 157198, 195277, 182702, 150797, 156028, 162469, 144843]
18845A44843j6415k6199J4836l624p04J9354L7194M1820M6284j55n5419l2220
18833A69595l4975l035R213l442O3306R746j7063j3037q271P185l4598L186K3934
18820A71744j1442o231J752N4730J1882O69j8417j8169o029j4827j4061r033K1289
18807A63857N658k8210j1540K0022M2205K4787N10N615J5529O254p595k5029r225
18794B02838J3883m085j1661j5130Q670Q076j7878j1461J7358L903L230J3191
18782B10934k5499J3326J245n144j5469j9012L1909L6544J6130r836J5562q007
18770B42683j5516O3175O6405O5694L3745l5288o8052n8246p3955l2113L0032
18759B18564P374o594K1101L3850Q41j4670j8771j9985L643J8583l59J3442k0457
$$ y = [144843, 128428, 102229, 117065, 113441, 112737, 132091, 169285, 211105, 257389, 257234, 201815, 169595, 134620, 131585, 140798, 137356, 200662, 210408, 193345, 180308, 172037, 179222, 144624, 147810, 171744, 160302, 154071, 155823, 210553, 222435, 223104, 204687, 186518, 180489, 165662, 151601, 142568, 163857, 169515, 141305, 129765, 149787, 191992, 216779, 217289, 222904, 238433, 244687, 237092, 212063, 202838, 216721, 212636, 200975, 185845, 194515, 202591, 184713, 173252, 190610, 194513, 197743, 210934, 185435, 198761, 200006, 194862, 179393, 160381, 192290, 228834, 244964, 235128, 250690, 242683, 227167, 290342, 356747, 422441, 456186, 420898, 352846, 294600, 220645, 188532, 218564, 225938, 219344, 240445, 274295, 275136, 260466, 241695, 221710, 225353, 243936, 243577, 257019, 236562]
18746B36562j9321K9748J1139m1452j3581K841j643K748L1984J2137K4335Q575
18734B84072j983O329q374l8343J3360K9163j791k076J6348l3051J7338J9628
18722C00620p616L307L1925j0870l1025j028K9563N2401J8453L3734K6649q553
18710D37560m456K1582M3966J3464M750N1007M5123N3272K715M979P1713R3855
18698H39530J13326J75932J80173K14238J21112k7817j00224n6423M9646J49859
18688A659352J80594J92735P1232K9136J34481K26406K33451J55938l1712r5120
18678B756493p814J05174K34971L02501K75103J79398Q2462J12488K41151L46924
18668D628851L65899M26359M44171N17364P16632J037315J485700K170960L340509
$$ y = [236562, 217241, 246989, 258128, 216676, 203095, 205936, 204293, 207041, 239025, 251162, 275497, 284072, 282089, 288418, 280044, 241701, 255061, 284224, 282433, 280357, 296705, 263654, 280992, 300620, 293004, 296311, 328236, 317366, 286341, 285313, 314876, 367277, 385730, 419464, 446113, 437560, 433104, 454686, 498652, 512116, 516866, 567873, 612996, 666268, 668983, 673962, 745675, 839530, 952856, 1128788, 1308961, 1523199, 1644311, 1616494, 1516270, 1459847, 1509493, 1659352, 1839946, 2032681, 2103913, 2133049, 2267530, 2493936, 2727387, 2883325, 2851613, 2756493, 2748679, 2853853, 3088824, 3391325, 3666428, 3845826, 3928288, 4040776, 4281927, 4628851, 4994750, 5421109, 5865280, 6382644, 7099276, 8136591, 9622291, 11793251, 15133760]
18659A5133760N167448O637597N638392N62940m693923l996412l63352L044853
18651B7131303N525655N367471R33837m914713m658624j89968L492129M344972
18643C7032062J129791m510258n732037k446418J057407L894260M734121J784388
18635C6943316m735983p741951n355756k892824j684203j211049j106471r56348
18627A1258731o10509k35190j8471L7351n4860k13171k84894j27887O1047K23353
18617A0035500L44707M64330O36667Q68863J200727J753841K543362L922617O206559
18608B7977173R338795J0912836P467307k370426q914575n652332J47008N073105
18600D3978891P972546O354363j301579p591430m456235K376549P028816O555655
$$ y = [15133760, 20301208, 26938805, 32577197, 33140137, 28446214, 24449802, 24086450, 27131303, 32656958, 38024429, 38958266, 34043553, 29384929, 29194961, 32687090, 37032062, 38161853, 33651595, 27919558, 25473140, 26530547, 30424807, 35158928, 36943316, 32207333, 24465382, 19109626, 16216802, 14532599, 13321550, 12215079, 11258731, 10648222, 10413032, 10394561, 10431912, 10377052, 10163881, 9878987, 9751100, 9812147, 10035500, 10380207, 10844537, 11481204, 12350067, 13550794, 15304635, 17847997, 21770614, 27977173, 37315968, 48228804, 55696111, 53325685, 44411110, 38758778, 38905786, 43978891, 51951437, 58305800, 57004221, 49412791, 44956556, 47333105, 54361921, 60917576]
18592F0917576q90828r506524q892112l178882J886327N651874N769779q8125
18584E1669085r087128j1043885p224131m335237k863715k062677j549242j182648
18576A2320422r15058q05325p93748p69966o85670n89830n79807o00325o04893
18567E975800n42269m66697m21030l33563k62913k50859l05364l18263k54515
18558B820327j89366j66744j66523j89724j97580j41790j20022j13402j03417
18549A431759o9423j04872m2753m5183n1836l7927n8021n3053k8566j8562k2690
18538H98873j6395L2944L8746L6993J6041J9568K1759l6990m4662J6823O8898
18527A052598Q4115Q0652L2215o8585o1139k7203R667O5998P2510Q0152Q475n3016
$$ y = [60917576, 60026748, 50520224, 41628112, 38449230, 40335557, 45987431, 51757210, 51669085, 42581957, 31538072, 24313941, 19978704, 17114989, 15052312, 13503070, 12320422, 11405364, 10600039, 9806291, 9036325, 8350655, 7760825, 7181018, 6580693, 5975800, 5433531, 4966834, 4545804, 4212241, 3949328, 3698469, 3393105, 3074842, 2820327, 2630961, 2464217, 2297694, 2107970, 1910390, 1768600, 1648578, 1535176, 1431759, 1362336, 1257464, 1214711, 1169528, 1117692, 1079765, 1021744, 968691, 940125, 921563, 898873, 882478, 915422, 954168, 991161, 1007202, 1026770, 1048529, 1011539, 966877, 983700, 1052598, 1136713, 1217365, 1249580, 1180995, 1119856, 1092653, 1102320, 1168318, 1240828, 1320980, 1329455, 1276439]
18515A276439p5924l6353n7238k8921R207k3347l5434l1855p565n4263l7785l8618
18503H58343n3781k1876j30K317K1415M63K0636j0597K1175O9155L9870J9944
18491I66934N4532M2333N0546J13908J44339J50070J31629J23208Q9783R1934
18481A959216N7411O7405J63219K20577K48424K80316L48512M85808M43100K74884
18471D548872J56730J84914P4392j3721R8895K16311L41117M96110O20292P75098
18461G499010R45632J125840J436099J937410K620110L664376N606836Q882974
18453C3718287J2631267J3850020R434556J204193k334379n229076j2914928j4607441
18445C5752499r551973n476959l315880k106583j407184r31233o57473n50170
$$ y = [1276439, 1200515, 1164162, 1106924, 1078003, 1087210, 1063863, 1028429, 996574, 989009, 934746, 896961, 858343, 804562, 782686, 782556, 784873, 806288, 806751, 827387, 816790, 837965, 907120, 946990, 966934, 1021466, 1063799, 1114345, 1228253, 1372592, 1522662, 1654291, 1777499, 1867282, 1959216, 2016627, 2084032, 2247251, 2467828, 2716252, 2996568, 3345080, 3830888, 4273988, 4548872, 4705602, 4890516, 4964908, 4951187, 5050082, 5266393, 5607510, 6103620, 6723912, 7499010, 8444642, 9570482, 11006581, 12943991, 15564101, 19228477, 24835313, 33718287, 46349554, 60199574, 69634130, 70838323, 68503944, 63274868, 50359940, 35752499, 26200526, 20723567, 17407687, 15301104, 13893920, 12962687, 12305214, 11755044]
18437A1755044n54254n29113n52391o09829o44196o06127n01059l54658j82910
18428G220507l5383J07736K54287L47529L82216L80523K40930O6775M161m6868
18418H922413p8251N0757K82552N04525O64838P93996J002164J340050J736031
18409A5219075K310267L119769M380882O497674J0065338J4610376J7699788J5845634
18401H9748803Q813640K008020n653079j3266189j6459974j6478250j2637617
18394C6075354p602338m576360k987169k067081j477347j159365j024733r64328
18386A4216633r58679j014844j049941j014797r30157q03810o46783m41295l02474
18377G053853j94448j00467n7045m3707q0259j64963k31763j74527j46664j85762
$$ y = [11755044, 11200790, 10671677, 10119286, 9509457, 8865261, 8259134, 7758075, 7403417, 7220507, 7185124, 7292860, 7547147, 7894676, 8276892, 8657415, 8898345, 8965120, 8969281, 8922413, 8844162, 8894919, 9177471, 9681996, 10346834, 11140830, 12142994, 13483044, 15219075, 17529342, 20649111, 25029993, 31527667, 41593005, 56203381, 73903169, 89748803, 98562443, 100570463, 94917384, 81651195, 65191221, 48712971, 36075354, 28473016, 23896656, 20909487, 18842406, 17365059, 16205694, 15180961, 14216633, 13257954, 12243110, 11193169, 10178372, 9248215, 8444405, 7797622, 7356327, 7053853, 6859405, 6758938, 6701893, 6658186, 6577927, 6412964, 6181201, 6006674, 5860010, 5674248]
18367E674248j20091k3639N2926J03849J72451K58546L76331N47991P67675J044774
18357H855061J456860K191257L511063N592839P469033P332617L710052n63509
18349C9555273j781030m624631q325654p199533m235901k498171j582652j074120
18341H233581q07521o38466n17488m62298m27386l92189m10042l94767l79147
18332C804277l54376l57893k64929k11654j68722j11090r5471j30472j52522j30383
18322A826765j00683j18368j42388r0972n9972n8514p2595o9442o8105n3951o3416
18311I28359o9053n8898q4022n4148l1204l6172j3010k2841j7385J7289J7969
18300E76884r454R373R113n071L82K700l2247l6628J659k8707m2481m9478j0240
$$ y = [5674248, 5554157, 5530518, 5583444, 5687293, 5859744, 6118290, 6494621, 7042612, 7810287, 8855061, 10311921, 12503178, 16014241, 21607080, 29076113, 36408730, 40118782, 39555273, 37774243, 33149612, 24823958, 17624425, 13388524, 10890353, 9307701, 8233581, 7426060, 6787594, 6270106, 5807808, 5380422, 4988233, 4578191, 4183424, 3804277, 3449901, 3092008, 2827079, 2615425, 2446703, 2335613, 2240142, 2109670, 1957148, 1826765, 1726082, 1607714, 1465326, 1374354, 1314382, 1255868, 1183273, 1113831, 1045726, 991775, 928359, 859306, 800408, 716386, 662238, 631034, 594862, 581852, 559011, 541626, 558915, 576884, 567430, 576803, 585916, 580845, 581227, 583927, 551680, 515052, 516711, 488004, 445523, 396045, 385805]
18287C85805j3423l3353L1221q311k0371k3069M187J9157J641q802k872P807O989
18274C46606M478j2704k3125j1175j5397l4376j4307k7279M906n676r148L6l0872
18261A71967j6017J2658K6641L397J5720N360l0595P084N575Q363k256J9457k4948
18248B02406l162J6676J6962J8259L698k3983j965j1570n1911J1466K1344o935
18236A91285J2778l757m3603l691K0467J8210K3731J3165l680j1088N147p468
18224B11496k0836J9272J2103k8359n130k9370J2187L9431j8193k7057r171J9744
18212A76117K1590N830J2928K0568K6420L95n34J4300J0544j0480q105J1321J6023
18199B96917j4399l3041j6286p517O129k9092o613Q163L9880J5570j9295j8111
$$ y = [385805, 372382, 339029, 370250, 361939, 341568, 318499, 322686, 341843, 343484, 334682, 331810, 339617, 346606, 351084, 338380, 315255, 304080, 288683, 254307, 240000, 212721, 217627, 211951, 202803, 202839, 171967, 155950, 168608, 195249, 198646, 214366, 219726, 189131, 196215, 201790, 210153, 207897, 227354, 202406, 199244, 215920, 232882, 251141, 254839, 230856, 228891, 217321, 165410, 176876, 198220, 191285, 204063, 200306, 156703, 153012, 173479, 191689, 215420, 228585, 224905, 213817, 218964, 211496, 190660, 209932, 222035, 193676, 188546, 159176, 171363, 210794, 192601, 165544, 156373, 176117, 197707, 203537, 216465, 237033, 263453, 263848, 263314, 277614, 288158, 277678, 269573, 280894, 296917, 282518, 249477, 233191, 225674, 231803, 202711, 196098, 204261, 244141, 259711, 240416, 222305]
18187B22305l685j0232l0546j3283L8682L7445J1469P420K0404K7117L0941L3910
18175C71947J2185L711k5956j6604k2941r185M942K1120J8759k5465l0761p965
18163B93787k473q084j0553N461K0726J5554k8043n695J835K3773J0202j5330
18151C01160j3561J0396j3018J4126J0220J0486M7664M9082J7893L6840N7243
18140E28531K9382J8339L8745L1742J4582N7009R2490J11537J22016R6297R3901
18129A234571J32563J44227J52326J50695J75654K10444K49634L31677L46292
18120C128083L56297L74041M63883N69248P49435J009366J392504K018288L291263
18111A3352408N888484R949155J2194782Q091477n362959j4801425j0865314n526186
$$ y = [222305, 218620, 208388, 177842, 164559, 203241, 240686, 252155, 259575, 279979, 307096, 338037, 371947, 384132, 387843, 361887, 345283, 322342, 313157, 318099, 339219, 357978, 332513, 301752, 293787, 291314, 283230, 272677, 278138, 298864, 314418, 286375, 280680, 282515, 306288, 316490, 301160, 287599, 297995, 284977, 299103, 309323, 319809, 367473, 416555, 434448, 471288, 528531, 557913, 576252, 614997, 646739, 661321, 718330, 810820, 922357, 1044373, 1140670, 1234571, 1367134, 1511361, 1663687, 1814382, 1990036, 2200480, 2450114, 2781791, 3128083, 3484380, 3858421, 4322304, 4891552, 5640987, 6650353, 8042857, 10061145, 13352408, 19240892, 29190047, 41384829, 49476306, 44113347, 29311922, 18446608, 12920422]
18103A2920422k943111j721362j141720q20963n81647m09073k98733k26995k34252
18094D542566l32918l76057l81239m06410l68367l00511k49341j92686j75912
18085A759125j21671j29333j24394j25560p4973r2748j07219o0446o4844j04044
18075G53893m5323j840J9977N265j4286l8929n6847p7864l5508R827J285R813
18063E29463j6638l8358k6900p181j7531j2710J2084k271n9897m0669k8930J3720
18051C04182N6781k943j8533k9703j5815p683k0641j9801k4481j461m343R106
18039B24665r234k6438j0678K0173J8364M800j2041j5484j6798j7538m452j0312
18027A45027l7223l1390k153J109K4973o954P764j5761k8901K5760K8098j5015
$$ y = [12920422, 9977311, 8255949, 7114229, 6293266, 5711619, 5302546, 5003813, 4776818, 4542566, 4209648, 3833591, 3452352, 3045942, 2677575, 2377064, 2127723, 1935037, 1759125, 1637454, 1508121, 1383727, 1258167, 1183194, 1090446, 983227, 922781, 857937, 753893, 708570, 706730, 726707, 731972, 717686, 678757, 621910, 544046, 508538, 518365, 519650, 529463, 512825, 474467, 447567, 440386, 422855, 410145, 422229, 419958, 360061, 319392, 290462, 304182, 360963, 358020, 339487, 309784, 293969, 286286, 265645, 245844, 221363, 219902, 215559, 224665, 215431, 188993, 178315, 198488, 216852, 221652, 209611, 194127, 177329, 159791, 155339, 145027, 107804, 76414, 74261, 75370, 100343, 93389, 101153, 85392, 56491, 82251, 110349, 95334]
18015I5334q841P910L3299K9501l7385l0339k942Q197k4684k557P65r249K3959
18002H2968J3427K0189J4961j8866K959J0539j8318l8186L1154L4442j6519j3786
17990A04964n38j4290q639o024J840J6617K7134J8784J4511K2878k0019k5353
17978A31865l1941k1036j5678k3314l3363j0896L0445M4642L2683j8957l6736
17967D7714P63J5502k189j7753k2704J7663N823k659K647J2565j7639n830N431
17954C9334M3048L2335L906p175r974L971p787o163M2826j423l4721j6112K2618
17941A04683j4047k1304n978K1844L1301J162M7671J5948K0668R1920M8256K3634
17929C65758q270k287n2964q3232k8134o1071j0740J6124l303k9067l2421n7311
$$ y = [95334, 86493, 94403, 127702, 157203, 119818, 89479, 86537, 94734, 70050, 67493, 68258, 59009, 82968, 96395, 116584, 131545, 112679, 115638, 126177, 107859, 69673, 100827, 135269, 118750, 104964, 104426, 90136, 81497, 75473, 77313, 93930, 121064, 139848, 154359, 177237, 157218, 131865, 99924, 78888, 63210, 39896, 6533, -4363, 26082, 70724, 103407, 84450, 47714, 48477, 63979, 61790, 44037, 21333, 38996, 44819, 42160, 44807, 57372, 39733, 33903, 39334, 82382, 114717, 118623, 111448, 101474, 105445, 97658, 91495, 134321, 132898, 98177, 82065, 104683, 90636, 69332, 63354, 85198, 116499, 117661, 165332, 181280, 201948, 293868, 342124, 365758, 357488, 355201, 302237, 219005, 190871, 129800, 119060, 135184, 131881, 102814, 70393, 13082]
17917A3082J3046M0370N377r096K3802R961j7511k4841l5033M74M1754M7567K3020
17904A31972J5031Q01Q050j2288k0681k011j1993q82R559J0849r246m553K0991
17891A35599M2673L7872J2719M4234P3985P8207Q2045J35701J57951M4304o94
17880H44596k6104p9468o6538n2273q0148j13481p5322n6463n1403j6519o3043
17869A63834m8248l494P735j4201q443j6067k7600o676Q096K7442J3449k5401
17857G0426k1587J6314L0632K5837q873j5498L4237q70n894R420k479j8570m915
17844A08180M173l0122k2722j3894N011j3387q306K4427L7590L4567K8239M5752
17832A99508P4134K6303J7999Q787k8808k4336l8868l7089m0350k7166O195J1976
$$ y = [13082, 26128, 66498, 71875, 62779, 86581, 96542, 79031, 54190, 19157, 19631, 61385, 108952, 131972, 147003, 147804, 155854, 143566, 122885, 120874, 108881, 107999, 117558, 128407, 119161, 114608, 135599, 178272, 216144, 228863, 273097, 347082, 425289, 507334, 643035, 800986, 845290, 844596, 818492, 739024, 672486, 620213, 540065, 426584, 351262, 294799, 243396, 226877, 163834, 115586, 112092, 119827, 105626, 97183, 81116, 53516, 46840, 54936, 82378, 95827, 70426, 48839, 65153, 95785, 121622, 112749, 97251, 131488, 130618, 124724, 134144, 131665, 113095, 108180, 112353, 82231, 59509, 45615, 50626, 37239, 28933, 53360, 90950, 125517, 153756, 199508, 273642, 299945, 317944, 326731, 297923, 273587, 234719, 197630, 157280, 130114, 136309, 148285]
17820A48285k7251j0882j0216k4026k034j2151o651m554K0951k5784o822o371
17808C2494J3047J1327j2841k5600l066K2063J8121L7405K7580j4400k2712J290
17796H4708l26l7084l0272o868j009K3389K1598j4174j8582p658l5669N082M3770
17783B6905J0661R442l0595k1307q044o541J8280L807p999J5106j4009l225k20
17770g739P495K6449N439j0954j5283k3302J5882L0314j776k0629k3737o224j1193
17757c5258R766J5626R439q229L3340M5455r920j2884j6760p597l0862R663J525
17744C304l848o046l155r468k434N520J2274K2705o268L286j6488j5288J6875
17731I69M507j0387k256J7003j004R663J4540j046R609K9979J1203r660k96K5131
$$ y = [148285, 121034, 110152, 99936, 75910, 73876, 61725, 55074, 50520, 71471, 45687, 38865, 32494, 45541, 56868, 44027, 18427, 15361, 37424, 55545, 92950, 120530, 106130, 83418, 84708, 84382, 47298, 17026, 10158, 9149, 32538, 54136, 39962, 21380, 13722, -21947, -16865, 26905, 37566, 47008, 16413, -4894, -12938, -19479, -1199, 2608, -5391, 9715, -4294, -7519, -7739, -244, 26205, 31644, 20690, 5407, -17895, -2013, 28301, 26525, 5896, -17841, -24065, -35258, -25492, -9866, -427, -8656, 24684, 70139, 60219, 47335, 30575, 22978, -7884, 1779, 3304, -544, -6590, -9745, -19213, -21647, -16127, -3853, 18852, 12584, 15870, -618, -15906, 969, 5476, -4911, -7167, 9836, 8832, 18495, 33035, 31989, 41598, 71577, 82780, 73120, 72824, 97955]
17717I7955r729J2865o421n8573l5250j5718J7959L3891j6204m3029K4374K8828
17705C0948j9247j7678l299j440k6516N244J0455J7156j3126m852j3074J4765
17693b0664J0541J208k3218J313J0309L1895J349N194N118L1409J3932j3918q404
17680D6064Q17j3265j5493J3153p116m932k7732J1668J0910r877n248l788J891
17667b948j439j6527k3029J0668L4856L6457Q610k4482N089J1654l354k2547k2405
17654i397K15K6097L839O852K4621j0198k1655l3024J3385K8241m264j4075j854
17641H783k058P690k0834l978Q474K9473j3285r234m918k2660J2241J2614J1321
17628A3629J5813N048o72J1379k73Q113j9343j3780K719O547r895k107N66k5104
$$ y = [97955, 88226, 101091, 94670, 36097, 847, -14871, 3088, 36979, 20775, -22254, 2120, 30948, 11701, -5977, -9276, -10716, -37232, -31988, -21533, -4377, -17503, -22355, -35429, -20664, -10123, -8915, -32133, -30820, -20511, 11384, 12733, 17927, 23045, 54454, 68386, 54468, 46064, 46881, 33616, 18123, 31276, 24160, 19228, -8504, 3164, 14074, 4197, -1051, -4839, -2948, -4387, -20914, -43943, -33275, 1581, 38038, 46648, 22166, 27255, 38909, 35555, 13008, -9397, -9182, 16915, 20754, 27606, 52227, 42029, 20374, -12650, 735, 28976, 24712, 10637, 8783, 6725, 14415, -6419, -10397, -1923, 27550, 14265, 5031, 113, -22547, -10306, 2308, 13629, 29442, 34490, 33818, 45197, 44924, 53037, 33694, 19914, 22633, 29180, 19285, 17178, 17744, -7360]
17614g360k4856K7811R826M882k582N267k5712q893l671J6167M96q409l629q118
17600b8781k293l1553K338K7337K3310K3449L840J5124j3441m041M2267L3811
17588I1367k1254j5344k9504l0048j4488J7075r601O694K0306o907J3671j5465
17576F502k6012j0182M915J6341J8844K2780O46k473j3595l031L5513o727m779
17563C8742l180j1846n4955r797J2666J0719q726L1378l986k151J690j0285J290
17550h441j7740j6246K8507J1527l5478j9841K8561L1005M027J0037k6613j7992
17538b8687j3019J1134O651L8737J5937j0482j2929j6047p27Q486J532j1413k9444
17525d0271N466Q177K9259k582l6196J4007J2480p287M696k7595k304L8703M6287
$$ y = [-7360, -32216, -4405, 5421, 10303, 7721, 12988, -12724, -21617, -25288, -9121, -8625, -17034, -20663, -28781, -31074, -62627, -60289, -32952, -9642, 13807, 17647, 32771, 19330, 15289, 57556, 91367, 70113, 54769, 25265, -4783, -19271, -2196, -11797, -5103, 15203, 8296, 21967, 6502, -19510, -29692, -24777, -8436, 10408, 33188, 33834, 31361, 17766, 14735, 50248, 43521, 38742, 35562, 23716, -31239, -41036, -28370, -17651, -26377, 5001, 1015, -1136, 554, -9731, -8441, -26181, -42427, -13920, -2393, -37871, -57712, -29151, 1854, 5881, 15918, -10695, -28687, -41706, -30572, -23921, 14816, 30753, 20271, 7342, -8705, -9432, -946, 586, -10827, -40271, -34805, -26628, 2631, 49, -36147, -22140, -9660, -16947, -12251, -39846, -42150, -3447, 42840]
17512D2840L112k7821r451j4144J0275L7117M1350L224o849l7957m5797J921R186
17499G006M6606L5823k1984n4574m9083o664K2123K4406L145m57j4305L895J6730
17486A2667j589K1081j0032r274J78j0895M282O812k562Q76J4622N584j8102k838
17472A0810l867k3589o190J5740N573K1156R362l517m723J2029j2913k3686N348
17459A533J8083N529r595j9956j1671r121L8413J7190j8518r833K3176J3209J4374
17446E2813J6655K5284M4182M9457O2633K8815o6481n5218m9872l7667m525O393
17434G2469k3005k8634q394k468l993O495K7000j9280n1041k088K6538K1597m63
17421A4733j4896J954q527J1068k10k436M722k8830J537J080J2186k2460N493
$$ y = [42840, 45952, 18131, 8680, -5464, 4811, 41928, 83278, 86502, 79653, 41696, -4101, -2180, 7006, 53612, 89435, 67451, 12877, -36206, -42870, -20747, 3659, 6804, 6347, -7958, -4063, 12667, 11078, 32159, 22127, 12853, 13031, 2136, 6418, 13230, 10668, 11544, 26166, 31750, 13648, 10810, 6943, -16646, -22836, -7096, -1523, 19633, 28995, 25478, 20755, 32784, 19871, -3815, 1533, 19616, 25145, 15550, -4406, -16077, -25198, 13215, 30405, 11887, 2054, 25230, 38439, 52813, 69468, 94752, 138934, 188391, 251024, 279839, 213358, 158140, 108268, 70601, 66076, 72469, 49464, 20830, 12436, 9968, 5975, 12470, 39470, 20190, -30851, -32939, -6401, 15196, 14733, -163, 1791, -6736, 4332, 4122, 1686, 6408, -22422, -20885, -19805, -7619, -30079, -24586]
17408b4586Q682j4070J5433L8204q514k9162j4857L0302L2184k355k2533l1499
17396b2771L1520J1526m0626j4933J5431p027L537K7273J2646Q975k647k9561
17384f657M307K1253r060J1923n324j4554l2294n849K0463L4956N887j773O360
17371B9638j0587j5784O577r998p249J5625N337R535l0952k7940q467k393r161
17358e5819R020L1201K964k3654n379N6250Q664M571J4907l840l5167k691J4607
17345A5634J3721r932p419l4179M26j0096J6083K5435M1520O876l7775j7283K9215
17332C2226j2682k8777l26Q628j7414J6133R660p817L218j8034K0685K2275j7836
17319I939j7395j798K0011j0864k2869j0909k0827K7834M9514j3352l3094j245
$$ y = [-24586, -15904, -29974, -14541, 23663, 15149, -14013, -28870, 1432, 33616, 31261, 8728, -22771, 8749, 20275, -20351, -35284, -19853, -26880, -23343, 3930, 16576, 25551, 22904, -6657, -2350, 18903, 9843, 21766, 16442, 1888, -30406, -36255, -15792, 19164, 25051, 23278, 29638, 19051, 3267, 9844, -154, -7403, 8222, 13559, 23094, -7858, -35798, -44265, -46658, -55819, -46799, -15598, -12634, -36288, -41667, 14583, 23247, 27818, 42725, 38885, 3718, 1027, 15634, 29355, 19423, 12004, -22175, -21749, -31845, -15762, 9673, 51193, 58069, 20294, 3011, 32226, 19544, -9233, -9559, -931, -18345, -2212, 7448, -369, 2849, -15185, 5500, 27775, 9939, -7456, -9254, 10757, -107, -22976, -33885, -54712, -26878, 22636, 9284, -23810, -25055]
17307b5055J8920J4034J2137Q99K9777j36p382J0298k5446k4739j7656J0397J1163
17294G211n49j0360j0943J2384j221L697k989j8593p349j73k1336j1240J4500
17281d6961J6122K2370n095l4099J7468K3356Q727j1995r239p499j2489j1213
17269e0547m076J3896j3339m2641Q801M3005M9130J2553J2653L889j4585J3844
17257C2583R350j7985j3780l4749K2998K0025J2698m913j7664O21k1996o896K9316
17244I608J495j6512p302M4599k0553k3162K806J3756K8962J520j745J8364K0873
17231G2709O964l6127j7203r07P484k1883P518J3968p311j6769Q750J7972k9768
17218E397k934l990J2194j774j3075l354r762M463N2441j006n273O869J1187j2793
$$ y = [-25055, -6135, 7899, 20036, 20935, 50712, 50576, 43194, 53492, 28046, 3307, -14349, -3952, 7211, 6662, -3698, -14641, -2257, -3478, 219, -2770, -21363, -28712, -28885, -50221, -61461, -46961, -30839, -8469, -13564, -47663, -30195, -6839, 1888, -10107, -19346, -26845, -39334, -50547, -54623, -40727, -54066, -96707, -87906, -44901, 4229, 16782, 29435, 33324, 18739, 32583, 41933, 23948, 10168, -24581, -1583, 18442, 31140, 26227, 8563, 9184, -12812, -19708, 9608, 11103, -5409, -12711, 31888, 11335, -11827, -9021, 4735, 33697, 35217, 33472, 51836, 72709, 79673, 43546, 26343, 25436, 32920, 11037, 18555, 32523, 25212, 8443, 17193, 35165, 5397, 2463, -1527, 10667, 8893, -4182, -7536, -17298, -12835, 39606, 38600, 33327, 40196, 51383, 38590]
17204C8590j5666q050Q987J5268J3049k4820j2294J925k1756j1177j1341K4969
17192b316R573J8301R885n726k3918j8690j7616k0382P054K986J1113R548K5193
17179E005K4528K5269q287j8264j3067J7503k8854p004K6112j4569l5103j3501
17167d0232j2802K9576K0778n5Q206j5889l7064J5434Q789K2734J7475j1963j4681
17154i694j006M616K46N669j0831j6056j2503K2737J2137P934K5384L0467o470
17141E2630r426M708j4348l685j0566O499N0279K3946j3109q279N989j780j0640
17128G2218L0808M632p94K196J638K0585K9681M2316k290K5515L7672L7781K0934
17115C22892L9428O2452M2897N6969P9265Q1460J16942J25554K30566L78002N98432
$$ y = [38590, 22924, 14874, 23861, 39129, 52178, 27358, 15064, 16989, -4767, -15944, -27285, -2316, 7257, 25558, 35443, 29717, 5799, -12891, -30507, -50889, -43835, -40849, -29736, -20188, 5005, 29533, 54802, 46515, 28251, 15184, 32687, 3833, -3171, 22941, 8372, -26731, -40232, -53034, -23458, -2680, -2735, 5471, -10418, -47482, -32048, -23259, -525, 16950, 4987, -9694, -10700, -6084, -5838, -169, -11000, -27056, -39559, -16822, -4685, 3249, 28633, 59100, 52630, 43204, 47912, 33564, 29879, 19313, 25812, 76091, 100037, 86928, 78649, 84638, 82858, 72218, 103026, 107658, 106864, 109060, 110698, 131283, 160964, 203280, 200990, 226505, 264177, 301958, 322892, 362320, 424772, 467669, 524638, 603903, 685363, 802305, 927859, 1158425, 1536427, 2134859]
17104B134859J016869J499232J481449M21167j251405j830009j228929o52937
17096A590296l61331j93951j37496j18517o5528l9491k8310n2824j7198l4659
17086E40991n3719p9653p8503l0988j8915k5469m8143j5164R672j3732m7273j4433
17074A24671o261k535o887o453j7631l0108j8735J2461M0613K6929N12P732k203
17061A22105j6604m400k98k1739j6539l602o298k0483r662k7612k338J8852Q444
17048A9826j9323J7458L095Q162J264r579j557N466j1883q30L5161j0668m6645
17035a0053j6262J7054j393N1455J135l8925l5540J6926K7025J163o357K7456
17023C3684j9979l966M100J7390r360J3141J6195r611m4626j6143J9181R73J1705
$$ y = [2134859, 3151728, 4650960, 6132409, 6553576, 5302171, 3472162, 2243233, 1590296, 1228965, 1035014, 897518, 779001, 713473, 673982, 645672, 592848, 575650, 540991, 487272, 407619, 329116, 298128, 279213, 253744, 205601, 190437, 200109, 186377, 139104, 124671, 118410, 115875, 108988, 102535, 84904, 54796, 36061, 48522, 89135, 116064, 116576, 124308, 122105, 105501, 101101, 100803, 79064, 62525, 58923, 52625, 32142, 22480, -5132, -7470, 11382, 19826, 503, 17961, 21056, 29218, 30482, 20903, 19346, 24812, 12929, 12099, 47260, 36592, -10053, -26315, -9261, -10654, 40801, 41936, 3011, -32529, -15603, 11422, 12585, 6228, 33684, 13705, 9739, 13839, 31229, 21869, 35010, 51205, 41594, -3032, -19175, 6, 979, 12684]
17010A2684K1572j4403l1333J0426L5379J7456n185R723K5597P751j0113l9119
16998D0435l5257O04k1871L725Q838M982J0371M19k9818j5156K554L583L0056
16985C465J6553J3188p03k579l3545k1922J2216j0428j9168L333L7379K7767o049
16972A9507o431j1448L1548K4124m4406n099q872J0832j6584j5795j1311J0494
16960b3441o309J1889K1650j6250p65j1173J3710J7691p870r614L5255L3265n806
16947E2232l0024n872K458j2384j8739n035J0495L85j8145q642j7738j5798K1813
16934d4994J5861L1425L0849K97N975k2098m354O32n207q915k2414J0745o54j9381
16920c2233j491J8778J0930L099L0946J9812k1589o419p536J3393j245l1433k631
$$ y = [12684, 34256, 19853, -11480, -1054, 34325, 51781, 46596, 56319, 81916, 89667, 79554, 40435, 5178, 5782, -16089, -12364, -3526, 1456, 11827, 12246, -17572, -32728, -30174, -26591, 3465, 20018, 33206, 32503, 29924, -3621, -25543, -13327, -23755, -42923, -39590, -2211, 25556, 19507, 13076, 1628, 33176, 57300, 12894, 7795, -1077, 9755, -6829, -22624, -33935, -23441, -29750, -17861, 3789, -12461, -13226, -24399, -10689, 7002, -868, -10482, 24773, 58038, 52232, 22208, 16336, 18794, 6410, -12329, -17364, -6869, -6484, -24629, -33271, -51009, -66807, -44994, -29133, 2292, 33141, 33438, 39413, 17315, 12961, 13593, 8386, -529, -22943, -12198, -12852, -32233, -33724, -14946, -4016, -917, 30029, 49841, 28252, 21833, 14297, 27690, 26445, -4988, -7619]
16907g619K7922J1849j2902k8437J6062J7723l6412l4360Q027K3906J0210j0765
16895a4796o188L4538J976P311J0526j660j5757n457j7021J330J8119n304m3312
16882c5695n217K3654K064l514J2367O914j8185j4583j8129j0817m306q918K7440
16869d6925J5384N049j0203J5303K0965k7346j7003M474J8198q976p742k1686
16857f0508k1777K1572P068R967O625J4236K7184k0460m540N91p828K311J7024
16844h535q107J0046L3903Q910j794k5366J0608J2753j547l743O584n87q264n28
16830B4333L456l0490k9031k872Q90L0150L0493j0642j3807r018Q787K810P867
16817A2926J5625J2019m4634m3337m359J0424j906N48J9076R418L154j1130L4162
$$ y = [-7619, 20303, 32152, 19250, -9187, 6875, 24598, -11814, -46174, -38147, -14241, -4031, -14796, -20984, 13554, 15530, 22841, 33367, 31707, 15950, 10493, -6528, -5198, 12921, 7617, -35695, -40912, -17258, -15194, -18708, -6341, 573, -17612, -32195, -50324, -61141, -65447, -74365, -46925, -31541, -26492, -36695, -21392, -427, -27773, -44776, -40302, -22104, -31080, -38822, -60508, -82285, -60713, -53645, -43678, -37053, -22817, 4367, -16093, -20633, -20042, -27870, -25559, -8535, -16642, -6596, 27307, 36217, 34423, 9057, 19665, 32418, 30871, 27128, 33712, 33125, 24861, 24333, 27789, -2701, -31732, -34604, -33714, -3564, 26929, 16287, 2480, -6538, 2249, 5059, 12926, 28551, 40570, -4064, -47401, -51760, -41336, -43242, -42694, -23618, -14200, -11046, -22176, 11986]
16804A1986L2455j9605j9079Q470J5743k0695J3057K9981j9864l8882j2489o272
16792b5194o033J6324K3230M1957j9907n0515R67J6587j793j2262M176j3636k970
16779b9069K0404L357q682k5898j6102K8985J7070J4776J8837L7530o595j1186
16767D3427Q831M567m7653J5909K8351K0444k7403k5617j1087Q324k2215j0508
16755a4630J6056l615j7279M243L7J2765r599j5723k4510l72K5946j6447N302
16742c7826L9298K761j4553j9782L590L0432Q667k7843p40q029K3269M2596J1043
16729E2883l0025l0933l1563n529K284K591K347j3726J8474L9077l8792j5320
16717d8232J1683K2741J6486R564J5569K5605m863l1896o5494k0764N6313M0004
$$ y = [11986, 44441, 24836, 5757, 14227, 29970, 9275, 22332, 52313, 32449, -6433, -18922, -25194, -31227, -14903, 8327, 50284, 30377, -20138, -19171, -2584, -4377, -16639, -12463, -26099, -29069, -8665, -5308, -13990, -39888, -55990, -27005, -9935, 4841, 23678, 61208, 54613, 43427, 52258, 56825, 9172, 25081, 53432, 73876, 46473, 20856, 9769, 18093, -4122, -14630, 1426, -2189, -19468, -15225, -15188, -2423, -12022, -27745, -52255, -52627, -26681, -43128, -37826, 1472, 4233, -10320, -30102, -26512, 3920, 12587, -15256, -15996, -24025, -756, 41840, 52883, 22858, -8075, -39638, -45167, -42883, -40292, -37945, -51671, -33197, 5880, -32912, -48232, -36549, -13808, 2678, 12242, 27811, 53416, 48553, 16657, -48837, -69601, -13288, 26716]
16705B6716j759K4431J1337j7424q070j61R910j4073q064R718L5846N740j5552
16692E8595j8143k6018k4976j7237l398J9219J2161n034l9086k7462n415k502
16680g9296L1981K505O856j3319j5149K1805L9697P317j0573J8605J3143J6632
16668D0204k2223n0947p624K3794K2734J4757p434l700p390R273K9452k643J2292
16655E0545K561P323l1357j5137k768j5763j1228J0811K0155o266K043J950J1546
16642B4415L893j3138l5870k877J4693J3917k9225l0617K2054L2258K7939r104
16630A8338k710k9716k5302K1202J4655J8646L814j6860Q7N277K914J0023J6011
16617C6379J4815j4712j7916R92l282l2323M2699J6795l368j2289J3712m903l2062
$$ y = [26716, 24957, 49388, 60725, 43301, 35231, 35070, 44980, 30907, 22843, 32561, 68407, 74147, 58595, 40452, 14434, -10542, -27779, -31177, -11958, 203, -4831, -43917, -71379, -76794, -79296, -47315, -44810, -37954, -51273, -66422, -44617, -4920, 2397, -8176, 10429, 23572, 40204, 17981, -32966, -40590, -16796, 5938, 20695, 13261, 9561, 2171, 11444, 40896, 38253, 50545, 53106, 60429, 29072, 13935, 11167, -4596, -15824, -5013, 15142, 8876, 10919, 12869, 24415, 28308, 15170, -20700, -23577, -8884, 5033, -24192, -54809, -32755, -497, 27442, 18338, 15628, -14088, -39390, -18188, -3533, 15113, 18927, 2067, 2154, 7431, 10345, 20368, 36379, 51194, 36482, 18566, 19558, 16276, -16047, 26652, 43447, 40079, 27790, 41502, 36599, 4537]
16604D537j2692l7666J1142J1673j113P170J1782j0015j74M085J1271n932l325
16591i257P316O763J0704m13k1533k6969j0278K4345J9526k0358L5640K9327k4279
16578B0534J4090K0469k1221p313j5575j510J3604J3197L4349Q020K014l7094
16566D3564n2425J391O268q644n219J0853P593R106J6126k6520J2687J0364M599
16553B9743L1291J4646J0650M772M841j928q970l4681k4365j7335q858L9288L9773
16540G8867j7251K423O166j4437p635n723p616p071M946J9829j2271j6454j2232
16527A1541j9604L173p415j1211r423J604K4968J700J6579M264j2517k6502k0531
16514d3374j1367K5213K0248j4225M414q267o163l3648R803R900J1774Q211J3945
$$ y = [4537, -8155, -45821, -34679, -23006, -24119, -16949, -5167, -15182, -15356, -11271, 0, -5932, -9257, -1941, 4822, 15526, 15113, -6420, -33389, -43667, -19322, 204, -20154, 15486, 44813, 20534, 34624, 55093, 33872, 26559, 10984, 9474, 23078, 36275, 70624, 78644, 80658, 43564, -8861, -7470, -1202, -9846, -15065, -4212, 3381, 12487, 28613, 2093, 14780, 25144, 29743, 61034, 75680, 86330, 91102, 95943, 94015, 85045, 50364, 25999, 8664, -194, 39094, 78867, 61616, 64039, 70205, 55768, 48133, 42410, 34794, 27723, 32669, 52498, 40227, 23773, 11541, -8063, -4890, -12305, -23516, -32939, -31335, -6367, -4667, 11912, 16176, 3659, -22843, -43374, -54741, -29528, -9280, -23505, -19091, -27358, -33521, -67169, -57366, -47466, -35692, -27481, -13536]
16501a3536M137m294J1769M534J6014l777l0006k1353O079J5407p954R57K622
16488a9401J3924n952J0315M7080p775L569k663Q168K71l3660k1868n689J0631
16475c050Q239p859j4599l822p623N5r88M276J0385K3392K4730j0336k5808k6731
16461b9739J0189J9140j5083k0320J6916K3174J2698k3758j1367J0804K9442J0945
16449C3041R615j7932l928J8925k5056l0156j2721j2374J6711J5510p459N582
16437a0242j5983l2726o833K0443J7618J3310Q557m436j4284n093N2703o363k7597
16424a0926p21n082m655J2043k1829j0055J3553N142p095m1024j8539K9313K5865
16411c4010K4603j0867R100M1245J6015k7329J009l0191J8755m284l2141n689
$$ y = [-13536, -9399, -13693, -1924, 2610, 18624, 14847, -15159, -36512, -30433, -15026, -22980, -22023, -19401, -5477, -11429, -1114, 45966, 38191, 41760, 39097, 47265, 47536, 13876, -7992, -13681, -3050, 5189, -2670, -17269, -21091, -28714, -28659, -29647, -25371, -14986, 8406, 33136, 22800, -3008, -29739, -19550, -410, -15493, -35813, -18897, 4277, 16975, -6783, -18150, -7346, 22096, 33041, 42656, 24724, 20796, 39721, 14665, -15491, -28212, -40586, -23875, -8365, -15824, -10242, -26225, -58951, -65784, -45341, -27723, -14413, -5856, -10292, -24576, -29669, 23034, 16671, -10926, -11647, -16729, -21384, -9341, -31170, -41225, -27672, -22530, -29625, -70649, -89188, -59875, -34010, -9407, -20274, -11174, 30071, 46086, 18757, 19766, -10425, 8330, 4046, -28095, -33784]
16399c3784J4000J1057k49K401L8444j292n1738J1260L1998l226k6921j9286K319
16386b5017J7702K528K6725J010j9811J0877K4786k2041N990J5820J6515o517
16374D8567j7893K932J5061k1938k9689m914P079j3601K8150J5332l3050J0667
16362F703L6818j65k6572K6186l633k3421K078Q91N948N830M835L081k0778k9868
16348a2067J653K0152n944j181k4292j1207J3286K6047j7050j0306j0936O805
16336b5040K3301J1928M526J6530j3969R501k2446j6843Q449M171p415m57L8517
16323C0753L82j6886Q794K893k482o75J0355n302m908K795k0406Q602R062j8628
16309D349j1194N115K033k838K152K770o041J2268k7470l1006K0621N691K6533
$$ y = [-33784, -19784, -8727, -8976, -6575, 31869, 30577, -21161, -9901, 22097, 18871, -8050, -27336, -25017, -7315, -4787, 21938, 22948, 3137, 14014, 38800, 16759, 22749, 38569, 55084, 48567, 30674, 33606, 48667, 26729, -2960, -7874, -795, -14396, 13754, 29086, -3964, 6703, 43521, 43356, 16784, 42970, 39337, 15916, 17994, 18885, 24833, 30663, 35498, 38579, 17801, -12067, -10414, 9738, 3794, 2613, -21679, -32886, -19600, 6447, -10603, -20909, -31845, -25040, -1739, 10189, 14715, 31245, 17276, 26777, 4331, -12512, -4063, 108, -7307, -7764, 30753, 31135, 14249, 23043, 25936, 23454, 22779, 33134, 27832, 22924, 25719, 5313, 13915, 22977, 4349, -6845, -1730, 303, -2535, -383, 2387, -3654, 8614, -18856, -49862, -29241, -23550, 2983]
16296B983J8231J4427j0458J0532n608R882j5509j6462j7572J432q713K345K8438
16283A3948J0806k5679j2655k1689j4567J100l163j993n606J1900M161O566L173
16270c3698J3234r647j3526K9037O574L0172P556j9779l2821J5192p56N92o370
16257a4240O02J0079J9509J0049J5611J0673p164l1541j7887l994j0045L967l9583
16244e3964l2913J7780R2j887K5310J9604j7201J42M49J942k5694j6599n447K6357
16230f2029J5218J1315k6788K4892M5629L405j2923k400J053K8352j7848j6702
16218h826q247k110J9397m770l7861j5215J8484K3803L1486j0834k1913j8724
16206c5330M002r811L896K367L7960K1068r172J0965j7775j9144j1999R186J0561
$$ y = [2983, 21214, 35641, 25183, 35715, 30107, 39989, 24480, 8018, -9554, -8122, -16835, -14490, 13948, 24754, -925, -13580, -35269, -49836, -48736, -51899, -53892, -59498, -47598, -43437, -36871, -33698, -20464, -30111, -43637, -14600, -8026, 22146, 29702, 9923, -22898, -7706, -8462, -7870, -14240, -13638, -3559, 15950, 25999, 41610, 52283, 45119, 13578, -4309, -8303, -18348, -14381, -53964, -86877, -69097, -69005, -70892, -45582, -25978, -43179, -43037, -42588, -40646, -66340, -82939, -88386, -62029, -46811, -35496, -62284, -37392, 8237, 11642, -1281, -3681, -2628, 25724, 7876, -8826, -17073, -19183, 214, -4556, -42417, -57632, -39148, -15345, 16141, 5307, -16606, -35330, -31328, -41139, -37243, -34876, 3084, 24152, 14980, 25945, 8170, -10974, -22973, -13787, -3226]
16193c226k33L7703J9912m0364k5626R630J0355J4854J2538k2998J360L8267k3077
16180B9095l3765k5966J5177K4191L785j787Q144k252M238J7680l5524r106L30
16167e760J5492J7566K8170j5703j7616k2520j2883J0588J3361j7176j7050q028
16155c1559J9170m378J2325K0964q2j5952J6618J1763J8114k0479j5172l16J802
16142A2818j0736l6589l2450J2428J7146M729p0J5429l2807P791J3667K1737J348
16129e559k597j4041o725L3346j669k7699K248J0930M134O69J244p129o746k1064
16115d0658K4736J9323k3102m4255K1349K5426P956j5053P433r8j1684q78P279
16102b2226L719J3361N764J384K4617n609j4297n519j624l0809P949q146J184
$$ y = [-3226, -3459, 34244, 54156, 13792, -11834, -2204, 8151, 23005, 35543, 12545, 13905, 52172, 29095, -4670, -30636, -15459, 8732, 12517, 10730, 18874, 16622, 20860, 38540, 3016, -6090, -5760, 9732, 27298, 55468, 39765, 22149, -371, -13254, -2666, 10695, -6481, -23531, -31559, -12389, -16767, -4442, 16522, 16440, 488, 17106, 28869, 46983, 26504, 11332, 11016, 12818, 2082, -34507, -66957, -54529, -37383, -32654, -32724, -17295, -50102, -42311, -28644, -6907, -5559, -8156, -22197, -28922, 4424, 2755, -24944, -22696, -11766, -7632, -6963, -5719, -12848, -19594, -40658, -15922, 3401, -19701, -63956, -42607, -17181, -9225, -24278, -16845, -16943, -28627, -29505, -22226, -18507, -5146, 618, 2002, 26619, 21010, 6713, 1194, -430, -31239, -23290, -31436, -30252]
16089c0252Q432K8637K597J0602J0258K013j8073k0559o327M350Q718L3096K7310
16076F0802l9599m4077k7669j0351K4490K1999M015K3835K0793j7584M534K8399
16064D9587k1243N125J9195k9159o601j9008J5612J8161q774j9597K4054J3813
16052D1165k0328k5259k1306r733J8424K9067j518P967J1406j1298j6038j9924
16040a7375k3356K000J6775L1970K4586K17q662N328k095j8416k1493J1053J9476
16027B0008J1160Q533j9613l958J0666J237K553J1871K1917O499j3530J998n119
16014E4222k1876m5756j1298o788J3303J5885K5792J9180j0597l0821q927Q261
16002E80l4441j5773J7852L2677R470m831m2728l014J2283J7627j0519j1445K5546
$$ y = [-30252, -21820, 6817, 9414, 20016, 30274, 32287, 14214, -6345, -12672, -8322, 396, 33492, 60802, 21203, -22874, -50543, -60894, -36404, -14405, -10390, 13445, 34238, 16654, 21188, 49587, 28344, 33469, 52664, 23505, 16904, -2104, 13508, 31669, 22895, 3298, 27352, 41165, 20837, -4422, -25728, -35461, -17037, 12030, 10512, 18479, 29885, 18587, 2549, -17375, -40731, -38731, -21956, 10014, 34600, 34817, 26155, 31483, 29388, 10972, -10521, 532, 20008, 31168, 39701, 20088, 16130, 26796, 28033, 30586, 42457, 64374, 70873, 57343, 59341, 54222, 32346, -13410, -24708, -31496, -18193, -2308, 23484, 42664, 32067, 1246, -7681, 580, -33861, -49634, -31782, 895, 10365, 5534, -37194, -40208, -27925, -10298, -20817, -32262, -6716]
15989f716n836k775j1734r914K4903L9282o09j0718l6344p879p653R711j2892
15976c9174K943q187K2329K4646P319M836k2589K272J935j2236K3029Q975j2826
15963C272o468L005K5789J6926K543l1061j8711J2357q576j2982R299J0013m866
15950E40k159J3845k719j6098J4506K0678j6119L2169K4678q522l7132p080j1690
15937D897K8654j2482m562j8293m961N444J5731K2340n9509k7386L0135L0536
15925A0544k0805l2331K6657P295m974J2371J9838R590l7460k616K3600K2328
15913C4037k867j6046j8039j900p087k605j9843J4798J0804L3342P616k9573l9830
15900c7193o080J6068j84K2304J3522j3492J4981J6685k0904l3089J1692O101
$$ y = [-6716, -12552, -15327, -27061, -36975, -12072, 27210, 26601, 15883, -20461, -28340, -35993, -26282, -39174, -36231, -44418, -22089, 2557, 9876, 14712, -7877, -5605, -3670, -15906, 7123, 16098, 3272, -3196, -191, 25598, 42524, 45067, 14006, -4705, 7652, -924, -13906, -4607, 5406, 540, -1619, 12226, 9507, -6591, 7915, 28593, 12474, 44643, 69321, 60799, 23667, 16587, 4897, 33551, 21069, 16507, -1786, -6747, -1303, 14428, 36768, -22741, -50127, -19992, 10544, -10261, -42592, -15935, -8640, -13614, -1243, 18595, 28185, -9275, -11891, 11709, 34037, 31170, 15124, -2915, -4815, -11902, -14507, -34350, -19552, -8748, 24594, 32210, 2637, -37193, -43273, -27205, -27389, -5085, 8437, -5055, 9926, 26611, 5707, -27382, -15690, -9589]
15888i589J3594Q856q364j1603Q690Q84k2441O248J7574j1588l945J1044J2712
15875A2072r533j6234K6773K6207M940Q658l196k3142j9803j9166P720J7044K9532
15862D1872j066k8555l5279J3128K624M829j683m2528L449j3659R798J4463k7142
15849e9749R708J1780J4474J1032M481J8196J3337r871L133J3328j9867l171J7316
15836B4127j150j3810K3602J5349k663P358k4968l771R515j9292N867J0508j8587
15823A2085k3736l0978J5983j746m634N781L842J0119J5528j5721j9634J8958
15811a4153J6566j0130j0005q255L896p773k2710P570q61L0109J2165j6040K42
15798a9379J1622L7785Q229o912K233M1128k8898m4338l8702J393M1762J7936
$$ y = [-9589, 4005, 12861, 4497, -7106, 1584, 2468, -19973, -13725, 3849, -7739, -11684, -640, 12072, 2539, -13695, 13078, 39285, 44225, 52883, 49687, 26545, 6742, -12424, -4704, 12340, 41872, 40806, 12251, -23028, -9900, -7276, -2447, -4130, -46658, -43209, -56868, -47070, -32607, -59749, -50041, -38261, -23787, -12755, -8274, 9922, 23259, 13388, 16521, 29849, 9982, 6811, 24127, 22977, 9167, 32769, 48118, 45455, 52813, 27845, 24074, 33589, 14297, 20164, 30672, 12085, -11651, -42629, -26646, -28392, -33026, -27245, -23403, -13284, 2244, -13477, -33111, -14153, 2413, -7717, -17722, -25977, -22081, -29854, -52564, -44994, -45855, -15746, -3581, -19621, -19379, -7757, 30028, 38257, 31345, 33578, 74706, 45808, 1470, -37232, -35839, 5923, 23859]
15786B3859j0997R555J0468k2150k3072k8241k1696R587J2949J673J2988N00l1633
15773e6210p539J9356J6981m310J0755k4642J2254j5055k5758P706L0526L1750
15761d186j4398j8790j9853j2463l364j1263K0202k620J5780M8712J0658j6072
15749g657l6238J2942l4528N240J1559K7641l6672K1659K927K662K0506J3191
15737C232k0791N640J1065j6435q870L4234p172m399J344N228m927l3457k1695
15724e7003k4872K0199L5188p40J863m7K5070L7365J8849k4826j2400j9067K972
15711B551K1446j0168J941j8024j0705o739j324J0394J118Q489J1078J358M515
15698A5930M489l097j682P117k1785L181r685l1407k0392O59K1686L5224o882
$$ y = [23859, 12862, 22417, 32885, 10735, -12337, -40578, -62274, -52687, -39738, -38065, -25077, -24577, -56210, -63749, -44393, -27412, -31722, -20967, -45609, -33355, -48410, -74168, -66462, -35936, -4186, -18584, -37374, -57227, -69690, -73054, -84317, -64115, -66735, -50955, -2243, 8415, -7657, -43895, -30953, -65481, -60241, -48682, -21041, -57713, -36054, -33127, -30465, -9959, 3232, -17559, -11919, -854, -17289, -26159, 8075, 903, -3496, -2152, 3076, -1851, -35308, -57003, -81875, -61676, -26488, -27228, -25365, -25412, -342, 37023, 55872, 31046, 18646, -421, 2551, 23997, 13829, 15770, -2254, -12959, -19698, -21022, -10628, -9510, -1021, 10057, 11415, 15930, 20419, 17322, 15640, 22757, 972, 4153, -5532, -36939, -57331, -56672, -34986, 238, -6644]
15685f644l389l7155j4075J1281K2796K7517M009j6988k1570J9253K3948k0975
15673a1992k523m730J3992j4820Q192Q603J4163p79k5996k8305J4464J3783O704
15660i244N973L065j1230p104o734J7829J4314m699j7825j8707L7120k702L078
15647C134N486k206J2330J7692k1101k3934j3682P407l435L576K3172J9909M789
15634C3137P92q932r299M680r601J107J0981o329n762k3076j3078n583M786k0825
15620d7002O130M4319K2604R310K0890j5732k1856J2304q143j8049j7199K1318
15608H894J2309j9143o286j0889p797M1774K1492j296m2244K586R32J9869Q883
15595B9084l1011k924J765R666P816M6192O948M295l1893j7708q033j334N383
$$ y = [-6644, -10033, -47188, -61263, -49982, -27186, 331, 4340, -12648, -34218, -14965, 8983, -11992, -14515, -19245, -5253, -20073, -11881, -3278, 10885, 10106, -15890, -44195, -29731, -15948, -9244, -3271, -206, -11436, -18540, -25274, -7445, 6869, 2170, -15655, -34362, 2758, 56, 3134, 8620, 6414, 18744, 36436, 15335, -8599, -22281, -14874, -18309, -14733, 8439, 28348, 33137, 33929, 24997, 15698, 20378, 10777, 11884, 22865, 16536, 10774, -12302, -25380, -30963, -26177, -47002, -40872, 3447, 26051, 35361, 56251, 40519, 18663, 30967, 22824, 4775, -12424, 8894, 21203, 2060, -4226, -15115, -22912, 18862, 40354, 39058, -3186, -600, 332, 20201, 29084, -1927, -4851, -3086, 6580, 14396, 60588, 67536, 71831, 39938, 22230, 14197, 12863, 18246]
15582A8246j5366r015K8061J622m433j6616j8616j5349j8204j4570J6877J7891
15570b9472j2565M084K3579J1013J2312o822j3363j3944J1533J5472j1216J8827
15558I438j8326k0297m2k4680j2255J9567K3283K2731J6318q825j0193j3190K0568
15545D097K2558J1171O111j6151k8157l573K968M3898J3913J5165k3003k3878
15533B5119k4960j7255k5803l822q570L5154K2582m1962L481J9807N636n115k2368
15520c8076l940K6665N385L59L2933J7447k1355l2246j7458J2732r367K285J0009
15507a4627r143J4128K7172j6595j4749L2192J9068K7674R236j3718j8681m8968
15495g011k9359Q106j709J1181l651l791K3757N0728j0663l0680j60J1773j46
$$ y = [18246, 2880, -6135, 21926, 23548, 19115, 2499, -16117, -31466, -49670, -64240, -47363, -29472, -42037, -37953, -14374, -3361, 8951, 2129, -11234, -25178, -13645, 1827, -9389, 9438, -8888, -29185, -29227, -53907, -66162, -46595, -23312, -581, 15737, 6912, -3281, -16471, 4097, 26655, 37826, 43937, 27786, -371, -3944, -976, 42922, 56835, 72000, 48997, 25119, 159, -17096, -42899, -46721, -55291, -20137, 2445, -39517, -36036, -16229, -10593, -15708, -38076, -42016, -15351, -9966, -9607, 23326, 40773, 19418, -12828, -30286, -17554, -26921, -24636, -14627, -23770, -9642, 17530, 935, -13814, 18378, 37446, 65120, 74356, 60638, 41957, -7011, -36370, -28264, -29973, -18792, -22443, -26234, -2477, 48251, 37588, 6908, 6748, 18521, 18375]
15482A8375k7689J1932j1966k4238J0331Q593M033K8286J190k0972k3007r601
15470c4733n835k7894J4646L5341K9588O104p091K4545m383j6137R021K3142j5766
15457C0548j9434k0655J1933L3914J8254k3727l1164K3507l270j033L220l7885
15445a5792r510K8541L624q006j0001j2935L582P713P326k1944N470j7947r026
15432d8905N273J9996M462o380j0635l2072J1846L6966L4136j7722j0340J8740
15420E365j9922O983l660J7727J5357j5222j7342K622P047J5575m2279q232O358
15407b9623j3408O12Q498l2351R845J7232j7276k6381K5205M5046M536k3036j3409
15394d4510P472l22M817j2001J4385J0731N664K1726j6137o325J8172J8812K6552
$$ y = [18375, -9314, 2618, -9348, -33586, -23255, -14662, -10629, 17657, 18847, -2125, -25132, -34733, -40568, -68462, -53816, -18475, 11113, 17217, 10126, 34671, 30288, 14151, 23172, 46314, 30548, 11114, -9541, 2392, 36306, 54560, 30833, -331, 23176, 19906, 18873, 22093, -15792, -25302, 3239, 6863, -1143, -11144, -24079, -20497, -12784, -5458, -27402, -21932, -39879, -48905, -43632, -23636, -19174, -25554, -36189, -68261, -56415, -19449, 14687, -3035, -13375, 5365, -14557, -7574, -11234, 6493, 21850, 6628, -10714, -8092, -1045, 14530, -27749, -35981, -29623, -43031, -42419, -33921, -66272, -56427, -39195, -56471, -82852, -57647, -12601, -8065, -31101, -44510, -37038, -37360, -32543, -44544, -30159, -19428, -13764, 7962, -8175, -14500, 3672, 22484, 49036]
15381D9036M284j9529o504M054J4620q514l916k9533k0859L360k1231r327J4980
15368b9079Q587k5279k272O51K107O251L2152K7844j6545M299K7765j9463l8536
15355b1518n923k4131j0588L2267M6854J6734n740k8561k0033J1867M80J0968
15343B676N907j3499j7484Q670M019j4184N630J4496J2896P699r391p606m468
15330d639J6070K7979N359m9183l7276j5342q247k2991J6711J5174J8186J7687
15318b0512J4335J1804n282N358M576L0976k4740j7259L999k4868j6284M84O091
15305c1322K316R64L3932K1721k5597j0870O951o855k5256q603p606J1191K0513
15292a8521r90j786J9300k814P363j9697J0675K2390J2391K477l0284l6631J9614
$$ y = [49036, 53320, 33791, 27287, 31341, 45961, 37447, 33531, 3998, -16861, -13501, -34732, -44059, -29079, -20492, -45771, -48043, -47392, -45285, -39034, -6882, 20962, 4417, 8716, 36481, 17018, -21518, -27441, -51572, -62160, -29893, 16961, 33695, 27955, -606, -20639, -8772, -8292, 2676, 8583, -4916, -22400, -13730, -9711, -23895, -18265, -3769, 9127, 16826, 7435, -171, -4639, 11431, 39410, 44769, -4414, -41690, -57032, -65279, -88270, -71559, -56385, -38199, -20512, -6177, 5627, 345, 5703, 10279, 41255, 16515, -744, 3255, -21613, -37897, -37413, -31322, -29006, -28042, 5890, 27611, 2014, -8856, -1905, -8760, -34016, -42619, -50225, -39034, -18521, -19511, -21297, -1997, -4811, 2552, -17145, -6470, 15920, 28311, 30788, 504, -36127, -16513]
15279a6513N794J1538L864j7276k084n05L1292k0205K684J7675M0933N180r119
15266E3258k0115k4285m697j9255j8521J1678L505j2418O318j1623L76N4896L4174
15253E3291k2553m6121k8318J8136K1652J0857o939k499j661L0361J8697R988
15241E4891j0772m0346k1963K3575L1368N80j6199l96k37j5867j5858j5421J6445
15228a0200k6049k4056L729j972k660K1379J636J5699J3604N337k2261k9039L031
15215e1822N4253Q9K334n206j2868j1797j7051O612K6699P142J8614P91o0O411
15201B4141R633K3076p131j6706k7743M268R536M54N268O785L150j908L41N91
15187C3755l4767j6559n032k5937J4500o908J0265R352R769J6806j4101o476K1595
$$ y = [-16513, -10719, 819, 4683, -12593, -14677, -15182, 16110, -4095, -1411, 16264, 57197, 62377, 53258, 33143, 8858, 4161, -15094, -33615, -21937, -18432, -30850, -24532, -36155, -35779, 19117, 53291, 30738, -15383, -43701, -25565, -3913, 6944, 5, -2494, -4155, 26206, 44903, 54891, 44119, 3773, -18190, 5385, 36753, 37333, 21134, 20738, 20501, 4634, -11224, -26645, -10200, -36249, -60305, -56576, -58548, -61208, -39829, -38193, -22494, -8890, -3553, -25814, -54853, -51822, 2431, 2520, 4854, -352, -13220, -25017, -42068, -35456, -8757, -1615, 16999, 17790, 17730, 24141, 33774, 56850, 49719, 33013, 5270, 9538, 19074, 19528, 24796, 31581, 34731, 32823, 33164, 33755, -1012, -17571, -22603, -48540, -34040, -40948, -30683, -21331, -11562, 5244, -8857, -15333, 6262]
15174F262p137M00M739K2520K0564k817m3179j5712J8086J926J6638j2209l0370
15161b0289p507M954O322p979k1904j1369r31n98M8967j5785k3518L1473j4080
15148c2244r820m688J0655J4906R313M642j1168R43L7448j6488k8826J6398L4127
15135B5198J5824m3908l0770K6495J7220J0896q133J1796R014J3664Q71k4250
15123B3917j4801l198P731J4201Q878l9419r267L8584K2815M50p799k744m7283
15110g935j5528m574k3164m732J5769n138J3605M2360M582J8685j2386k1932R212
15097H824P975M201j0186j1096o504k4295j7414K7781K958K0998N143K469k1262
15084a0408J9372L2812j3214J143K0455J0402j0109p305n119Q556j4777k6005
$$ y = [6262, -875, -475, 4264, 26784, 47348, 44531, 1352, -14360, 3726, 5652, 22290, 10081, -20289, -27796, -22842, -16520, -24499, -46403, -57772, -58703, -59301, -10334, -26119, -49637, -18164, -32244, -42064, -46752, -36097, -21191, -11878, -7236, -18404, -17461, 19987, 3499, -25327, -8929, 25198, 41022, -2886, -33656, -7161, 10059, 20955, 12822, 24618, 33632, 47296, 48167, 23917, 9116, 5918, 13649, 27850, 36728, -2691, -11958, 26626, 49441, 49891, 42092, 39348, -7935, -23463, -28037, -51201, -55933, -40164, -45302, -31697, 10663, 15245, 33930, 21544, -388, 8824, 16799, 21000, 10814, -282, -6786, -31081, -48495, -20714, -17756, 3242, 8385, 10854, -10408, 8964, 41776, 28562, 29705, 50160, 60562, 50453, 43148, 38029, 46585, 31808, 5803]
15072E803J8058m759l488k3844p039n675N982K7423J8976j6230J9356m715j1330
15059A8518J0074N106j689k9985M264m511J9408K0501j2179k5238k0850j7705
15047c4286M6489M9064M838j5997m5588j3505j3898o069L350J4705J1930L0136
15035C1169q831k7573k5577j0968J9546J4622K925J0401J7581J0870L0702o121
15023E8746k2316m9017k3066K9467J1350m0562j768J5265J5833n697J2334o299
15011e730J4537o45j9123R531j8028j023Q176J348l583L3399o08m2608l7799M846
14997e7310L0402Q161J6982J1305p165M484J6706P462K429j404n753k330k5444
14984a475j0821j8541l475J5987j458K211J9576M330O971K4171N980m0929m1654
$$ y = [5803, 23861, 19102, 15614, -8230, -15269, -20944, -14962, 12461, 31437, 15207, 34563, 29848, 18518, 28592, 33698, 32009, 2024, 6288, 1777, 21185, 41686, 29507, 4269, -16581, -34286, 12203, 61267, 66105, 50108, 4520, -8985, -22883, -28952, -25602, -10897, 1033, 31169, 22338, -5235, -30812, -41780, -22234, -7612, -4687, 5714, 23295, 34165, 64867, 58746, 36430, -12587, -35653, -6186, 5164, -35398, -37166, -21901, -6068, -11765, 569, -5730, 8807, 8162, -10961, -1430, -19458, -20481, -12305, -10957, -14540, 18859, 18251, -24357, -62156, -57310, -26908, -18747, -1765, 9540, 2375, 6859, 23565, 31027, 33456, 32052, 26299, 23969, -1475, -12296, -30837, -34312, -18325, -19783, -17572, 2004, 6334, 13305, 37476, 43456, 2527, -39127]
14971c9127p178K1511J7265K3201q880q216P571J1281K168m739j0489j8840K919
14958a1553j4016j7778P003N764K8273J7923J1710j6902o217n360r466p745J8402
14945C8K9814J1487k3278j9828K743J7923J1606j1424r319j6929K135n09Q19L841
14931h81J0677J7436j4198L28q784n025Q357Q042J3407J008l7769k797M27J5938
14917F166K4514j1321J84l1515k4147J6925L6912j3944o278q8K1526N331N907
14904C0172M930j6352k124L3463k156P755J384k4260k7647k6557j217J0611k00
14891a2198K6713k85p357k2157j6140K1463K8799P639j5113q257j4666q132q937
14878b8628L6417K1213j8454o339p257j1228k0100J1621j6594j4936J9199J2439
$$ y = [-39127, -46305, -24794, -7529, 15672, 6792, -1424, 6147, 17428, 19596, 14857, 4368, -14472, -11553, -25569, -43347, -36344, -30580, -2307, 15616, 27326, 10424, 4207, -1153, -10619, -18364, 38, 29852, 41339, 18061, -1767, 976, 18899, 30505, 19081, 9762, -7167, -5032, -5541, -4722, -881, 9796, 27232, 13034, 13362, 4578, -447, 7910, 15952, 29359, 30367, -7402, -10199, -9772, 6166, 30680, 19359, 19543, -11972, -36119, -19194, 17718, 3774, -2504, -2592, 18934, 24265, 30172, 35102, 18750, 16626, 50089, 47933, 55688, 57072, 32812, 5165, -21392, -22609, -11998, -12198, 14515, 14230, 6873, -15284, -31424, -9961, 18838, 26477, 11364, 3107, -11559, -19691, -28628, 7789, 29002, 10548, 4209, -3048, -14276, -34376, -22755, -39349, -54285, -35086, -22647]
14866b2647J525n195j2203K6202K0973k921p075j3370M925j3067l123K3007q809
14853a1778l557p073J103P24j9315j704L8199K3982l492p674j1151j6445K0138
14840A957K046r574K4781J5750j9722j9032j5136Q499N029r575L0423l396l666
14827H384k1517M32j0477K2894N522n924J2749j4661k8458l1149K1032K9353P601
14814d219o159Q080k7215J1523j129k1219J7985M4794Q706k9685n984l9374j5936
14801e9832L9412K9472p251j3368l8445n061J6707n516n709M7025K7755P23j6336
14788I576K6361k614k2761j0528l7916l4055K8339l133k794K6681J286l619J7848
14775g329J1342P643k7243q193j6143j0568L7747K2607j2529J666K627M113k0805
$$ y = [-22647, -21122, -26317, -38520, -12318, 8655, 5734, -1341, -14711, -9786, -22853, -25976, -2969, -11778, -15335, -22408, -21305, -20581, -39896, -41600, -3401, 20581, 17089, 9415, -1736, -18181, 1957, 4003, -5571, 19210, 34960, 15238, -3794, -18930, -10431, -5402, -14977, 15446, 12050, 8384, -13133, -12701, -23178, -284, 5238, -686, 12063, -2598, -31056, -62205, -41173, -11820, -4219, -10378, -2298, -29513, -17990, -19119, -40338, -22353, 22441, 31147, 1462, -4522, -43896, -59832, -20420, 9052, 1801, -11567, -50012, -55073, -38366, -43882, -49591, -2566, 25189, 25912, 9576, 35937, 33323, 10562, 34, -37882, -71937, -43598, -46731, -49525, -22844, -21558, -25177, -7329, 4013, 11656, -15587, -23780, -39923, -50491, -12744, 9863, -2666, -1000, 1627, 5740, -15065]
14762a5065n31K4680M0007L386l7143k6043L185k6086P393r038j041J5199L3305
14749A2208J3709M60k3017j4291O216k2159k827K2850n298q64o257J7765Q012
14736F507j2098j5650m12K4206q144j0046l4886l595N4273M04q425j9983j5605
14723d3454J994L5185L8013l729O174J230k3142k3545L6077j9757k0158p975K0622
14710b465K0116q332k0685K618K0432o211k116L7009R323l2229j9369j7028J07
14697a8830J329k8110L1931L4997K2876r529m7983j4729K9448p252k5545J9512
14685a1885k3282J330J223j1126j2582r468j002K0759l931J7930L4604R565O671
14672A8806p484M101l738j3955R141q39K4763M71j4274N818P30j8875j6671j291
$$ y = [-15065, -15596, 9084, 49091, 52477, 15334, -10709, -7524, -33610, -26217, -35255, -36296, -21097, 12208, 25917, 26377, 3360, -10931, -4715, -26874, -29701, -6851, -12149, -13013, -19270, -1505, 6507, -5591, -21241, -21653, 2553, -5591, -15637, -50523, -54118, 155, 559, -7866, -27849, -43454, -41460, -6275, 31738, 28009, 34183, 35413, 12271, -11274, 24803, 5046, -15112, -23087, -2465, 17651, 9319, -11366, -8748, 11684, 5473, 3357, 40366, 49689, 17460, -1909, -18937, -18830, -17501, -45611, -13680, 21317, 44193, 34664, -13319, -28048, 1400, -5852, -31397, -11885, -35167, -33837, -32614, -43740, -56322, -65790, -66792, -46033, -49964, -32034, 2570, 12135, 18806, 11322, 15423, 11685, -2270, 6871, 6032, 30795, 31266, 16992, 22810, 23540, 4665, -12006, -13297]
14658a3297j3210r927j0883K1755M6076J1117N707q756j1621k0374j4870j4030
14646c2313P244J9193N119o1015j7152L0025K0212K0238J391M637J3273k4590
14634a3738j7272l2538K0385L1496j72o307j2015J3112J6243o975k1663k1018
14622e0462j5715J9188J1919O944L45J3678j339N038J0758j3327j2634J2348L2767
14609A9508j9649j5846L1121N296j9063k2977J3367J8559n475k9667J6694k7173
14597c5305Q52N123R067K2801o519p66J0496Q962j7940J3857K8694j4947j7082
14584G293J5018J0630J450K3614m1811n6355R52K7576J6480J2514J3590l132N786
14571C3605o953J7017K890j3803K1516o755j4738K2562j9409o411N835J0356l3680
$$ y = [-13297, -26507, -36434, -47317, -25562, 20514, 31631, 37338, 28582, 16961, -3413, -18283, -32313, -25069, -5876, -757, -61772, -78924, -48899, -28687, -8449, -7058, -2421, 10852, -13738, -31010, -63548, -43163, -11667, -11839, -18146, -30161, -17049, -806, -7781, -29444, -50462, -66177, -46989, -35070, -28126, -27781, -14103, -15442, -10404, 354, -12973, -25607, -13259, 19508, -141, -15987, 15134, 20430, 1367, -21610, -8243, 10316, 4841, -24826, -8132, -35305, -34453, -29330, -20263, 2538, -3981, -4747, 5749, 14711, -3229, 10628, 39322, 24375, 7293, 22311, 32941, 34391, 58005, 16194, -40161, -39209, -11633, 4847, 17361, 30951, 27819, 33605, 26652, 43669, 46559, 32756, 54272, 47517, 32779, 55341, 35932, 29521, 35356, 45712, 12032]
14558A2032l0051Q921K9077j8332J6J752k4789r710M511r746p943o337K5381M0098
14544A4880J4557k4102R057m4472j4216K3746L884j0087l218q408R210J5864j3552
14531b6857m49m227J1842K7815J4340P314k2945m3713k3309J1053J1180P933K4363
14518e660r648j5718J361Q29J8756K8643K1088K81q180l8521k222p21K263R762
14504B313R591J552q751m0891n530R568q962k0567K3668J3335j9325J6082J6894
14491a1023j0268R941j3602K942J8089J2702n343j8588l9871n917J4497Q797K9238
14478h406N146J543k288j3766O694L7095K484j2851j4209J2473p48K5914P642
14465D6723N372k2682k3658R374p148m1351Q595K4428m637k6190j8935J4139K6019
$$ y = [12032, -18019, -9098, 19979, 1647, 1663, 3415, -21374, -31084, -26573, -36319, -44262, -50599, -25218, 14880, 29437, 5335, 14392, -30080, -44296, -20550, -16666, -26753, -29971, -38379, -29169, -13305, -26857, -27306, -31533, -19691, 8124, 22464, 29778, 6833, -36880, -60189, -49136, -37956, -30023, -5660, -15308, -31026, -29665, -28836, -10080, 18563, 39651, 39932, 31752, -6769, -8991, -9712, -7449, 2313, 11904, 13456, 4705, -36186, -41716, -32148, -41110, -61677, -38009, -24674, -43999, -27917, -11023, -21291, -11350, -24952, -22010, -3921, 8781, 3438, -15150, -55021, -60938, -46441, -37644, -8406, -3260, -1717, -4005, -17771, -11077, 26018, 28502, 15651, 1442, 13915, 13167, 39081, 46723, 52095, 29413, 5755, 15129, 7981, -33370, -24775, -347, -4984, -31174, -50109, -35970, -9951]
14452i951J6894N65l7965j466K4759L4743J0175r821k0579l463j1613K0484R846
14439B2608R807j0467k5252j5641J2513R169l535K56j8088M783J3464O992K7917
14426C4526K1022j1878j1783l261k7216j6882q051L131J4896J4442M043m0048
14414b7059j7103K1542Q705l228J2321J1888L0409J2650K4976l8791n2570k4242
14402d0502J6616K1390L40l6989J906R309o006J1636j2407K3083N480j6328j893
14389b4365k128K0998n768K02m361j1700r775p009J9868P254J6552l054Q449K4723
14375B9886N271k8025Q138M20P185k3474J2496k515P26o754j2771k0101J9521
14362i997J1789J2967j2023l5P852J3321j2201k004j5593M6229N204J7039o54
$$ y = [-9951, 6943, 7508, -30457, -31923, -7164, 27579, 37754, 27933, 7354, 3891, -7722, 12762, 22608, 32415, 21948, -3304, -18945, -6432, 2737, -798, -542, -18630, -13847, -383, 6609, 34526, 55548, 43670, 31887, 28626, 1410, -15472, -23523, -20392, -5496, 8946, 12989, -27059, -44162, -22620, -13915, -17143, -4822, 7066, 37475, 50125, 75101, 36310, -16260, -40502, -23886, -2496, -2156, -39145, -37239, -27930, -33936, -22300, -34707, -11624, -6144, -22472, -24365, -26493, -5495, -11263, -11061, -15422, -27122, -36897, -43906, -24038, -16784, -232, -3286, 5163, 29886, 35157, 7132, 15270, 15690, 22875, -599, 11897, 9382, 10108, 3354, -9417, -29518, -9997, 1792, 14759, 2736, 2701, 10553, 23874, 11673, 9669, -5924, 40305, 45509, 62548, 61894]
14349F1894k6715j8558k832Q097j6309l6436k1203J3703L1390J7714L752Q77j3449
14336A925n790p479m486J9036J8388m893k868J3895l419j8912M147K8351K6051
14323F3946P932j6343p643J3996o774o4134J231J8271o31k4944P185Q343J6934
14310A7369L2783K7781R565K4071K4533P5289R9823J08632J37814R1485L8821
14299F87966m5098j32680j15965q0740m4662l3999l1444m2507j5837l8135L413
14288A10312p354j7724L095j1765j0579j3503o632J5658J6259J6859q334l3667
14276E2625j9961j36k5421l4306q913J9165N5745P446l432j8554l6018l4523j0324
14263e6607R139N3348J3395Q505N816j6514j2896j8605j3865J1530L4156j6287
$$ y = [61894, 35179, 16621, 13789, 21886, 5577, -30859, -52062, -38359, -6969, 10745, 14497, 15374, 1925, -3865, -11344, -15830, 3206, 21594, 16701, 13833, 27728, 24309, 5397, 9544, 37895, 63946, 71878, 55535, 47892, 61888, 55114, -9020, -7789, 10482, 9851, -15093, -7908, 435, 17369, 50152, 77933, 87498, 111569, 136102, 211391, 311214, 419846, 557660, 649145, 687966, 642868, 510188, 394223, 313483, 268821, 234822, 203378, 160871, 145034, 106899, 110312, 102958, 85234, 88329, 76564, 65985, 52482, 45850, 61508, 77767, 94626, 86292, 52625, 32664, 32528, 7107, -27199, -36112, -16947, 38798, 46244, 42812, 24258, -11760, -46283, -56607, -47468, 5880, 19275, 27780, 33596, 17082, 4186, -14419, -28284, -16754, 17402, 1115]
14251A115l1626J553K1495K2332p639M059j4579q668N5198o704j8875m17K3974
14238D1218J8657j6840j1156j9154J3634L7220o520k1133n790L642o659R948j91
14225C6876j2476j128j6055P661K3684J0620j2424k2583q252j7101j958J7532
14213D396K0633O872j6372j3438j5648j7406M221Q968J567j1122L818p73J68J0786
14199a3330k022R587J6616q548r220k5396J9347J7074m502l047j5934k0540K2947
14186a6968k049K2651K7460L979M420L9840k0075p010k2625q606J873j0133m073
14173H684k874M0030M117j4540J1606k5118k1396R497M986j7614m136M992J1285
14160I519j0690j202J8345M529k421j0745l395l515R917J7394o367p617J6748
$$ y = [1115, -30511, -28958, -7463, 14869, 7230, 11289, -3290, -11958, 43240, 36536, 17661, 17244, 41218, 59875, 43035, 31879, 12725, 26359, 63579, 57059, 35926, 30136, 33778, 27119, 37067, 36876, 24400, 23272, 7217, 14878, 38562, 49182, 36758, 14175, 5923, -11178, -13136, 4396, 25029, 31901, 15529, 2091, -13557, -30963, -26742, -17774, -16207, -27329, -23511, -24284, -24116, -13330, -15352, -5765, 10851, 2303, -6917, -32313, -12966, 4108, -394, -3441, -19375, -39915, -16968, -19017, 3634, 31094, 35073, 39493, 79333, 59258, 52248, 29623, 21017, 22890, 12757, 8684, 5810, 45840, 49957, 35417, 47023, 21905, 509, 10006, 14992, -2622, -6758, -1766, 9519, -1171, -2373, 15972, 20501, 18080, 7335, 3940, 425, 10342, 27736, 21369, 13752, 30500]
14147C0500L6188K1402J4568p348k4070j8383O038J5921j0218k586J950J6270
14135H0232j9041k1699o933L642k5003k0200K5183L2837j4075n842k743r885j7532
14122a059K1955K8417J2440j0317P555k604j7335l498M290P278L201M805l89K0035
14108G4774r711K5168J9022K7674K1377O982J450l784l819M0550K6714M8160N5513
14095C30070N3364R0967J03045J32485J91520L33254N50144O88519M57610q9707
14085B841271o54155o80448m20961k57713j36133q6291p1154r907K9024k1707
14075E31826m7670k0064l5879o2566l5841l5584m8758o1028k3826j0515l7913
14064A12182r515k6732k0081k953J8031J8162o459k0562J5724j0972L147J8821
$$ y = [30500, 66688, 88090, 102658, 95310, 71240, 52857, 58895, 74816, 64598, 62012, 63962, 80232, 61191, 39492, 32559, 36201, 11198, -9002, 16181, 49018, 34943, 29101, 26358, 16473, -1059, 20896, 49313, 61753, 51436, 58991, 56387, 39052, 35554, 39844, 47122, 50323, 55128, 54739, 74774, 65063, 90231, 109253, 136927, 158304, 165286, 166736, 162952, 159133, 199683, 226397, 274557, 330070, 383434, 474401, 577446, 709931, 901451, 1234705, 1784849, 2473368, 2930978, 2841271, 2187116, 1506668, 1085707, 827994, 691861, 605570, 534416, 524509, 553533, 531826, 484156, 464092, 428213, 365647, 329806, 294222, 245464, 184436, 160610, 150095, 112182, 102667, 75935, 55854, 52901, 70932, 89094, 82635, 62073, 77797, 66825, 69972, 88793]
14052H8793j1187l2354l787j0749o156R833K5013L0119L314N871l8088k1315j9955
14039A9352J6979N010j6092j2652j8382R526J8881n33l625m252R516p359J4025
14026C0394J3162j5169k7725J4061o430K5690Q074O851k477l7579M242k4074J1212
14013B32M2758L303l6924r69k9592j1230K9327R769j0119k7197k2074J9928J9900
14000a2888K0099j2722j952J6413k6188J903P078P881O114N019O022R118j3170
13987A2727R607r67K0327q285l6787n32J6178J6619j0119r563k0360N60J8224
13974G629p406n269K6353J9823l5392k2483K6512L7702l5760J723K121m367j1617
13961d31k8233k3684L5100K5387j0732m52j4555J0759K3394J6735L917n264k4471
$$ y = [88793, 77606, 45252, 41465, 30716, 24560, 34393, 59406, 89525, 92839, 98710, 60622, 39307, 19352, 36331, 41341, 25249, 12597, -5785, 3741, 22622, 22089, 18464, 14212, 23728, 16369, 30394, 43556, 28387, 662, 14723, 8293, 33983, 42057, 48908, 46431, 8852, 13094, -10980, 232, 42990, 46293, 9369, 8400, -21192, -32422, -3095, 6674, -3445, -30642, -52716, -32788, -12888, 7211, -5511, -7463, 8950, -17238, -15335, -8257, -376, 5738, 10757, 16779, 25897, 12727, 22334, 21367, 41694, 33409, -3378, -3910, 12268, 28887, 18768, 9205, -11155, -10595, 7629, 223, -5046, 21307, 41130, 5738, -16745, 9767, 47469, 11709, 13432, 15553, 11186, -431, -28664, -52348, -17248, 8139, -2593, -3045, -17600, -6841, 16553, 33288, 37205, 31941, 7470]
13948G470M17k4151K8454L0552j109L242N282m0795k8560l4496o502r843J7453
13935e2586k335K407N2025K1681p670j7474K0860L3525k5038J2794j176n9147
13923b2134m5992n615K1748J5697m031M4052L5108j6629j7415L176n882j1845
13911i762M484L0290J988J814m899J0578r114j8759k3119m9558k8188L0620K2599
13898d1026K7222Q368q996m074K3072J2576o763K3805L3167K0869q575P623q394
13885G8874l8101j6958k6264o245n046l992J359j1113K8180P3959L1083j7788
13873H7948J5035K1475J6621k545K015K7710J6058J1908L3798J1782p185k8166
13861B06454m4411p1758l4984k9968p045o951j3212L3456p655j1515o395M501
$$ y = [7470, 7887, -16264, 12190, 42742, 41633, 44875, 50157, 9362, -19198, -53694, -60196, -70039, -52586, -54921, -52514, -489, 21192, 13522, -3952, 16908, 50433, 25395, 38189, 37013, -22134, -68126, -73741, -51993, -36296, -40327, 3725, 38833, 22204, 4789, 7965, 2083, -9762, -5278, 25012, 27000, 28814, 23915, 34493, 25379, 6620, -16499, -66057, -94245, -63625, -41026, -13804, -5436, -14432, -18506, 4566, 17142, 10379, 34184, 67351, 88220, 79645, 87268, 78874, 40773, 23815, -2449, -8694, -13740, -17732, -16373, -27486, 694, 74653, 105736, 87948, 102983, 124458, 141079, 138534, 140549, 168259, 184317, 196225, 230023, 241805, 234620, 206454, 162043, 90285, 55301, 25333, 18288, 11337, -1875, 31581, 23926, 12411, 6016, 10517]
13849A0517r740o321j0419K7375M1485J3604P040o947k8319j0896m300n613n574
13836A1892j60N4667L0887j6625m1776M953m250P398J9179L2617j9584J747k1144
13823E9801J5474K4480K2848J7861j1637O176j2651M61k1928q072J0636k8634
13811G4815m681J3636j477J0496J8160l811k2326J6098K9209P4315J7594l2432
13799A89596l0591j2152J2949L8021K2335k3038m3658j6399j9433j9286j5188
13788H3156k3949j1031J6534J9201j1515l5537j3155K5132K0618o081N809N033
13776G4215M279K2462L924k0393j2318k4123l0343j7394L823M0287O8651k4221
13764H8849l8620K8174K8595r466K452L1453J3600L5298L1587l2925m2526K2117
$$ y = [10517, 777, -5544, -15963, 11412, 52897, 66501, 73541, 66594, 38275, 27379, 23079, 17466, 11892, 11732, 66399, 97286, 80661, 38885, 43838, 39588, 46986, 66165, 98782, 79198, 80945, 59801, 75275, 99755, 122603, 140464, 128827, 135003, 122352, 122813, 100885, 92813, 103449, 74815, 70134, 83770, 82293, 92789, 110949, 107138, 84812, 100910, 130119, 204434, 222028, 189596, 159005, 146853, 159802, 197823, 220158, 197120, 153462, 137063, 117630, 98344, 83156, 59207, 48176, 64710, 83911, 72396, 36859, 23704, 48836, 69454, 63373, 69182, 74215, 78494, 100956, 104880, 84487, 72169, 48046, 17703, 309, 4132, 44419, 113070, 88849, 50229, 78403, 106998, 97532, 99984, 131437, 145037, 180335, 211922, 178997, 136471, 158588]
13752A58588K0379P567Q08l0178r475j1581J5426L7907J0623J330K804j862j1738
13739A90598q193n2761j3851L3253M6775M3966k1301k2970P965L7082J8715J2543
13727B71821L099L2088J8396J8449M9931P734k416Q782k6299O170L3868L578P540
13714D32741J8831J8494L969P765O453j2694J5386J9183o980O31J6964j395k5094
13701D94254k4258k6886K1841K312p979k4846k1549m809l9450k7823k0067L0959
13689C51699K8242j9210L765K9501K8483O8383O6396O5012o995q900N889M307
13677F16572j599O545J5105M2779J6300j744J2186M6000N9768O5670J9019l314
13665H93287L0565M0731L676L9326P0854R1667O4563P7012P7569J06616J18230
$$ y = [158588, 178967, 186534, 187342, 157164, 147689, 136108, 151534, 189441, 200064, 201394, 204198, 202336, 190598, 182405, 129644, 115793, 149046, 195821, 239787, 218486, 195516, 203481, 240563, 259278, 271821, 274920, 307008, 325404, 343853, 393784, 401518, 399102, 407884, 381585, 387755, 421623, 425201, 432741, 451572, 470066, 474035, 481800, 488253, 475559, 490945, 510128, 503148, 503779, 520743, 519348, 494254, 469996, 443110, 464951, 467263, 459284, 434438, 412889, 408080, 368630, 340807, 320740, 351699, 379941, 360731, 364496, 393997, 422480, 490863, 557259, 622271, 615276, 606376, 612265, 616572, 614973, 621518, 636623, 679402, 695702, 693958, 706144, 752144, 811912, 877582, 896601, 893287, 923852, 964583, 968259, 1007585, 1078439, 1170106, 1234669, 1311681, 1389250, 1495866, 1614096]
13654A614096J44385J52860J74566K26817K42630L04197L55934L94688M20465
13645D030638M37318M33334M03396L25410M14474N97510P14559Q13366R50998
13636I121003J078217J187937J274807J415201J508786J583886J652715J749559
13628B0572111K077332K426761K956491L610739M330960N155182N910964O453019
13620E3493559P079869Q737514J2057694J7357130K5998009M1804039P0702306
13613B37230120J11780947J33669394R0250221m0146437j49097656j32063139
13607B51623450p5602609m2250876k5242159j6224679j1105579p492549m694182
13600F9010817l040761k605074l518073m767528n324902n364039n154472m638802
$$ y = [1614096, 1758481, 1911341, 2085907, 2312724, 2555354, 2859551, 3215485, 3610173, 4030638, 4467956, 4901290, 5304686, 5630096, 6044570, 6642080, 7356639, 8170005, 9121003, 10199220, 11387157, 12661964, 14077165, 15585951, 17169837, 18822552, 20572111, 22649443, 25076204, 28032695, 31643434, 35974394, 41129576, 47040540, 53493559, 60573428, 69310942, 81368636, 98725766, 124723775, 166527814, 237230120, 349011067, 482680461, 572930682, 532784245, 383686589, 251623450, 176020841, 133769965, 108527806, 92303127, 81197548, 73704999, 69010817, 65970056, 63364982, 59846909, 55079381, 49754479, 44390440, 39235968, 34597166]
13592C4597166l995793l309603k855921k416008k005028j724723j541573j400280
13584A5348237j262399j140271r89862r25597r65266r20246q18343p07085n53880
13575G065288m24120l93168l86923m09297l75300l33342l42718l72436l27176
13566C700808k68666k57498k44595k02757j64843j52111j25542j32288j32294
13557B020214j35928j45415r8683o4209j05535m2560q698o6538j12061l5964l463
13546A201160k1695j0653j5166m7103l3997l2887k8488Q211r015m2927l0208R67
13534I38199j3481k0334j1373j0361l4455p4292m6641n4452k5552L275l5042m5757
13522E69734k259J9992L602J4297j8541k3737J6562k2587m2687l746L0026n694
$$ y = [34597166, 30601373, 27291770, 24435849, 22019841, 20014813, 18290090, 16748517, 15348237, 14085838, 12945567, 11955705, 11030108, 10064842, 9144596, 8326253, 7619168, 7065288, 6641168, 6248000, 5861077, 5451780, 5076480, 4743138, 4400420, 4027984, 3700808, 3432142, 3174644, 2930049, 2727292, 2562449, 2410338, 2284796, 2152508, 2020214, 1884286, 1738871, 1640188, 1575979, 1470444, 1427884, 1419186, 1352648, 1240587, 1204623, 1201160, 1179465, 1168812, 1153646, 1106543, 1072546, 1039659, 1011171, 1019382, 1010367, 967440, 937232, 938199, 924718, 904384, 893011, 882650, 848195, 773903, 727262, 672810, 647258, 650533, 615491, 569734, 567475, 587467, 591069, 605366, 586825, 563088, 579650, 557063, 514376, 510630, 540656, 534962]
13510E34962p599l6215n2603l8835L3241N3260j6759k2890k8322j8615J7052m372
13498D12305l3614k902n396l5644j3488L6919K3665j1320j792Q034J6006O1905
13486D54678K00211K03897M4716j12638j23633r6038p7962n9769k8343o592N085
13475D03612m128m3744l2211K3466L5463M4515Q644m794j4171J5212K7517J2886
13463D72267p651p660j8260k4462k3507l696J3374M1054R1827K668o3518m9371
13451D23065n0759l9074k1764l0629k1625j3453O377J3443K5162K1563M318J811
13439C18435m235l6673L963k268k9493k9017k0463l9009j9461n135j4202l4907
13427H7535j3068J9814L8020j1013l7664p4018n2682K2384M8536L4919J943k1505
$$ y = [534962, 527363, 491148, 438545, 399710, 432951, 486211, 469452, 446562, 418240, 399625, 416677, 412305, 378691, 375789, 370393, 334749, 321261, 358180, 381845, 370525, 368733, 376767, 392773, 454678, 654889, 858786, 903502, 790864, 667231, 571193, 493231, 433462, 405119, 398527, 403612, 399484, 355740, 323529, 346995, 382458, 426973, 435617, 430823, 416652, 431864, 459381, 472267, 464616, 456956, 438696, 414234, 390727, 387031, 400405, 441459, 533286, 535954, 472436, 423065, 372306, 333232, 311468, 280839, 259214, 245761, 252138, 265581, 290743, 312306, 316624, 318435, 314200, 277527, 281490, 279222, 249729, 220712, 200249, 161240, 141779, 136644, 122442, 87535, 74467, 94281, 132301, 121288, 83624, 9606, -43076, -20692, 27844, 62763, 64706, 43201]
13415D3201Q725L9654J9109J4314l2512k4837L269M2921J7529k7275m3753k7790
13403C2555o333K7848K2672N0697k3572m7615m473J1821M9666K0391J764N449
13391A40870p579j8203k2444r084j9440J0579K4883M1529J6923j1702J2991j0524
13379A48799k5177K490o333Q824k032K5388R066J4030j4783k8475J167k4558K930
13366A11336Q648K3340J6382J4036J0704k1092O532q806k8599J082k569k3924
13354A07070N920n462k3419J8049K0635P48M781j4583m440j0199N088K0156j4355
13341A09989J5554P679j751j9899M182P477J0526j6075K1177L1925J0077o1464
13329A19397j8823K4864K8569j3122j9825Q367K258J0050K717j5279j0540j0314
$$ y = [43201, 51926, 91580, 110689, 125003, 92491, 67654, 70923, 113844, 131373, 104098, 60345, 32555, 26222, 54070, 76742, 127439, 103867, 56252, 51779, 63600, 113266, 133657, 135421, 140870, 133291, 115088, 92644, 83560, 64120, 74699, 99582, 141111, 158034, 146332, 159323, 148799, 123622, 126112, 119779, 128603, 126571, 151959, 161025, 175055, 160272, 131797, 132964, 108406, 111336, 119984, 143324, 159706, 173742, 184446, 163354, 169886, 161080, 132481, 133563, 130994, 107070, 112990, 107528, 84109, 102158, 122793, 123541, 128322, 113739, 109299, 99100, 104188, 124344, 109989, 125543, 133222, 131471, 111572, 115754, 123231, 133757, 117682, 138859, 170784, 180861, 119397, 100574, 125438, 154007, 140885, 121060, 129427, 131685, 141735, 144452, 129173, 118633, 108319]
13317A08319j4561N787P450n163L154K6208N874p432m0556k9716K0442L5077J4448
13304A29331L8668K6374n4393m6337k6870l92J9707J8417n700k9936l6266K791
13292C5394M075O8062L5472j6927k1897m3810J2853M5228r582l1068J6447l442
13280I0805p598k0365p717J3251K7299J6568N946q308Q067l206j4270k221l5J810
13266A00026J1752q291k2933J1078K75o069j4620M028N389o972J5360R191n082
13253I3132l9697j783P569j1466J3037n83k3545j8371R561J7991K2796O713L655
13240G9009j9504l3938n398L4802J7313K4800R916K8521l849J3621M828l305l3230
13227A13586j5949K6912j939J223K7097j6270l6194j6765k5957J4696K8994k850
$$ y = [108319, 93758, 99545, 106995, 101832, 104986, 131194, 137068, 129636, 89080, 59364, 79806, 114883, 129331, 167999, 194373, 139980, 93643, 66773, 66381, 86088, 104505, 98805, 68869, 32603, 35394, 39469, 107531, 143003, 126076, 104179, 60369, 73222, 118450, 108868, 77800, 94247, 90805, 83207, 62842, 55125, 68376, 95675, 112243, 118189, 109881, 117948, 114742, 100472, 98251, 98216, 100026, 111778, 103487, 80554, 91632, 91907, 85838, 71218, 75246, 80635, 73663, 89023, 98214, 93132, 53435, 51652, 59221, 47755, 60792, 60209, 36664, 18293, 27854, 45845, 68641, 75354, 79009, 59505, 25567, 20169, 54971, 72284, 97084, 107000, 135521, 131672, 145293, 150121, 146816, 113586, 97637, 124549, 122610, 123833, 150930, 134660, 98466, 81701, 55744, 70440, 99434, 96584]
13215I6584j9781j0579K080k4787m2674L2615L0141K185K38J4430K0806j7785
13203H3473o581J2055J2172j2392o442m0299k0298J4644j4647k7493J8537L7167
13191D9896l230k4373j3861j104K3540o979j4471j1611J8981j3308L515P974Q466
13178B3435j1755J045L720j3547m254Q35l6926L716N4777K9029K2500K5141K280
13165I9996K024l8324j2598N5900N070k3369J7212J8291N300J78k844M570J2678
13152A44084J9087K2387K4864M3490N5457M1424J5395j0398l4699l3881l4785
13141B52425K7409K0728M5583L5053M8462Q4855R2193R8545J93918K94819M62150
13130A656140O71146O01557J41347n42217p41602n25581l32810j96916r3381p0695
$$ y = [96584, 76803, 66224, 68304, 43517, 843, 33458, 63599, 65784, 66022, 80452, 101258, 83473, 76892, 88947, 101119, 88727, 82285, 41986, 21688, 36332, 21685, -5808, 12729, 49896, 46666, 22293, 8432, 7328, 30868, 23889, 9418, -2193, 16788, 3480, 6995, 14969, 23435, 11680, 12725, 16445, 2898, -1356, -521, -37447, -33731, 21046, 50075, 72575, 97716, 99996, 102020, 63696, 51098, 106998, 112068, 88699, 105911, 124202, 129502, 129680, 126836, 131406, 144084, 163171, 185558, 210422, 253912, 309369, 350793, 366188, 355790, 321091, 287210, 252425, 279834, 300562, 346145, 381198, 429660, 514515, 606708, 705253, 899171, 1193990, 1656140, 2327286, 2928843, 3070190, 2527973, 1786371, 1260790, 927980, 731064, 637683, 566988]
13120E66988p0258l6519j1607k2682n615l953n5776l2423m3862o6346J172K0145
13108B39264o480l5223k0346l7861m1104R102J8954j1591k8015K3649K3617j2735
13096A21231l6174j4374K8447n51j5937j7551k7899j4530K7831M6127o074n659
13084H4887K1134J4234m3456l1090J449k1109k07L1788j3037n562j757J1402L5150
13071H3826P500N085J0549k7062l9390j5480K0315k4810J910l731j205M1838M3641
13058A02986l940j9816j0730k1698o898l8866O503L0414K9575K5325J4321k3224
13046H3952j3268J0602j065n010l2166J1934R866P972K9812M0936K1606J2701
13034A77872k091l6969j9915m1888j8219N237K5495K1607m3666k6612k4355j6824
$$ y = [566988, 496730, 460211, 448604, 425922, 420307, 416354, 360578, 328155, 284293, 217947, 219119, 239264, 232784, 197561, 177215, 139354, 98250, 107352, 126306, 114715, 86700, 110349, 133966, 121231, 85057, 70683, 99130, 98579, 82642, 65091, 37192, 22662, 50493, 96620, 90546, 84887, 106021, 120255, 76799, 45709, 47158, 26049, 25842, 57630, 44593, 39031, 37274, 48676, 83826, 91326, 96411, 106960, 79898, 40508, 25028, 45343, 20533, 22443, 18712, 17507, 59345, 102986, 99046, 79230, 68500, 46802, 39904, 1038, 7541, 37955, 67530, 92855, 107176, 83952, 70684, 81286, 80221, 75211, 43045, 54979, 64845, 72817, 102629, 143565, 165171, 177872, 175781, 138812, 118897, 77009, 58790, 64027, 89522, 111129, 67463, 40851, 16496, -328]
13022c28K1421K3963L6416J3646M121j1887k1956l1097j7742J5650N824j0276
13010B7755j1752J940J7130R178k3047p183j5253M3155L826j4433k963j799J0294
12997C6848r657k9479j4315J1714J543J0190K1952N461j889J8546r242k089K4310
12984F3893j4749j1491K191P802l8076O371p823R92J5367j0200l7080l0128P481
12971d5450M6579J8919j3061J7568K1450O326j5905j9008k5528j8821Q136M040
12959a4755K00j181Q097N758L2316M879m860j2362K1402n252k0759j3530o699
12946f746R360m642J0229J3452K8994j0097l411J00l7501J859P505K456k0304
12933h746r829K5335R167p670J0496Q309j5482J1803K2094K383q988j4541k0715
$$ y = [-328, 21093, 45056, 81472, 95118, 99239, 87352, 65396, 34299, 16557, 32207, 38031, 27755, 16003, 17943, 35073, 44251, 21204, 14021, -1232, 41923, 45749, 31316, 28353, 26554, 36848, 27191, -2288, -16603, -4889, -3346, 6844, 28796, 34257, 32368, 50914, 41672, 39583, 63893, 49144, 37653, 39844, 47646, 9570, 15941, 8118, 9110, 24477, 14277, -22803, -52931, -45450, 1129, 20048, 6987, 24555, 46005, 52331, 36426, 17418, -8110, -26931, -18795, -14755, -14555, -15736, -7639, -1881, 30435, 35314, 30454, 18092, 39494, 34242, 13483, -47, -6746, 2614, -2028, 8201, 21653, 50647, 40550, 37139, 37239, -262, 1597, 9102, 11558, -8746, -18575, 6760, 15927, 8257, 18753, 27062, 11580, 23383, 45477, 47860, 38872, 24331, 3616]
12920C616J1010j358Q360l4581r325K4522M1800R796J3735j0178Q21n233k0607
12907C2378k7211o341J1232j8517m4936j2804P085O0743N6403j5727l8835j4055
12895a0585k538K2106J4687l329O206r126k3082j6857N733N744K6898N42n473
12882A0926K1069j254J4900n76j6371j5493K1002N254P466J1202J943k5916p247
12869B6905j5781K6600k946j5411K0152O315K2701p939k9092j3179q511K0466
12857C0280J8379j2460k0089K6625j0635j1269M983Q19j8236J5591J0241N471
12845C9700j4476j1467P352q806k1912L5404L6463o689k2568J1192k6650l9877
12833b2334R067K6153m39J61j2542j2698J5531m850j6572L5813L4870k2776l3464
$$ y = [3616, 14626, 13268, 21628, -12953, -22278, 2244, 44044, 53840, 67575, 57397, 58218, 52985, 32378, 5167, -1174, 10058, -8459, -53395, -66199, -59114, 1629, 58032, 42305, 3470, -10585, -13123, 8983, 23670, 20341, 26547, 17421, -5661, -22518, -16785, -11041, 15857, 16399, 10926, 31995, 30741, 45641, 45065, 28694, 13201, 34203, 39457, 46923, 58125, 60068, 34152, 26905, 11124, 37724, 34778, 19367, 39519, 45834, 68535, 60596, 31504, 18325, 9814, 30280, 48659, 36199, 16110, 42735, 32100, 20831, 25814, 26633, 8397, 23988, 34229, 39700, 25224, 13757, 21109, 12303, -9609, 25795, 62258, 55569, 33001, 44193, 17543, -22334, -13267, 12886, 12447, 12608, 66, -12632, 2899, -1951, -18523, 17290, 52160, 29384, -4080]
12820d080k359P27N816m599q996K2322Q752J2621q34l3459K413J2697j3468k1579
12806b4026M173K3402J4417L2627m015k5825j3711J1691K5796j5273n622K3300
12794D6934L7434r633k4040k4668k9460j2933o093J675N841K8195L0149Q083m331
12781D7153j0603K0206j0134k202j1116k6317p10J2771m034j3211L3m755J3338
12768A0419J0320j4015P769J2504l9598l79L6385J580j3465j4454j9672P798k0459
12755c5267k266O256M211J0720k1412r435L5353R674P738J5179j4283j0349M0079
12742C6198K0363j4714j9348k3248k271K5518Q334J8894r698o532J7395R332p971
12729E2252l7687q653M058j8170j686L0620J3814j6918m353j3296K433r09O57
$$ y = [-4080, -6439, -5712, 104, -4495, -13491, 8831, 17583, 30204, 29370, -4089, -1676, 11021, -2447, -24026, -19853, 3549, 17966, 50593, 46578, 20753, 7042, 18733, 44529, 29256, 23634, 46934, 84368, 74735, 50695, 26027, -3433, -16366, -22459, -20784, -14943, 13252, 43401, 51484, 47153, 36550, 56756, 46622, 44420, 33304, 6987, 6277, 19048, 15014, 1803, 1836, -2919, 10419, 20739, 6724, 14493, 26997, -12601, -12980, 23405, 24985, 11520, -2934, -22606, -14808, -35267, -37533, -31277, -27066, -16346, -37758, -47193, -11840, -2166, 5572, 20751, 6468, -3881, 36198, 56561, 41847, 22499, -749, -3020, 22498, 30832, 49726, 40028, 33496, 50891, 60223, 52252, 14565, 5912, 9970, -8200, -9886, 20734, 34548, 17630, 13277, -19, 2414, 1505, 2162]
12716B162L034J8616J0260J0088O968j7914M38m660j0575k0707k0381P900P841
12703f930q241J51N936m375K290j910R462Q799J0879k590j5322Q463J1783p721
12689A0674j5433P945j6759q8M3391p511q249J9345j0716l3765m8224J7867o385
12676d7908J6937P766J1567J747j2648J9111M943m371N726K1186q540k5582l917
12663a3983L656l0039k3987J5006M0035J1436J0662L8287K761n2045J5478J2480
12651B9747Q675l1729J5202m347n0656K9939M1066j8748k1817j2526N535L2628
12639B2969n173p931q085J609K4842J5815L448j766j1832k1428M878k7588M331
12626e911K4112J9383J3591j7891k0737k7786K1245K2804j3679L207J9450J5807
$$ y = [2162, 5196, 23812, 34072, 44160, 51128, 33214, 33652, 28992, 18417, -2290, -22671, -14771, -6930, -15171, -15020, -9084, -13459, -11169, -13079, -3617, 5182, 16061, 13471, -1851, 6612, 18395, 10674, -4759, 3186, -13573, -13661, 29730, 22219, 13970, 33315, 22599, -11166, -59390, -41523, -47908, -30971, -23205, -11638, -9891, -22539, -3428, 1515, -2856, 2870, 24056, 15516, -10066, -13983, -10327, -40366, -64353, -49347, -9312, 2124, 12786, 51073, 53834, 1789, 17267, 29747, 38422, 6693, 21895, 17548, -33108, -3169, 37897, 19149, -2668, -15194, -9659, 22969, 17796, 9865, 1780, 3389, 28231, 44046, 47494, 45728, 33896, 12468, 17346, -10242, -5911, 18201, 37584, 51175, 33284, 12547, -15239, 6006, 28810, 15131, 18338, 37788, 53595]
12614E3595j582J474j5367K2607K701l3207K1063J7360k2743l8735j1534l961
12602h329N222j5350j7521K0003N1007J0991j5673j2795O517J5862l455J847J587
12589C9913J2919k3363J5634r401r354k1180M329K6942j5681l0669l736L618R038
12576i91J71q665J37L137K337K886j865K569J6642q262j0125k0303L848L2848
12562A4364l531R754J1087K739j6338j9783j6191p231j731Q981n972J4547o197
12549a5502J2799J3718J0351o688j0336O353O570r88J6315L835l1266j729K1198
12536B4630R853j2825j423J5732N068j0721J3013r732l1843k9220q093L2922L3954
12523C1315K5388j6044k5354q015O172o701J3442J8170j3332l2321K0359J1489
$$ y = [53595, 52013, 53487, 38120, 60727, 63428, 30221, 51284, 68644, 45901, 7166, -4368, -8329, -3107, -18457, -35978, -15975, 35032, 46023, 30350, 17555, 24072, 39934, 36479, 38326, 39913, 52832, 29469, 45103, 35702, 26348, 5168, 9497, 36439, 20758, -9911, -13647, -10029, -991, -820, -9485, -9348, -6211, -3874, -988, -2853, -284, 16358, 8096, -2029, -22332, -18484, 14364, 10833, 20587, 31674, 34413, 18075, -1708, -17899, -25130, -26861, -17880, -23852, -9305, -15502, -2703, 11015, 21366, 14678, 4342, 10695, 17265, 16277, 32592, 36427, 5161, 3432, 24630, 34483, 21658, 20235, 35967, 41035, 30314, 43327, 33595, 1752, -27468, -35561, -2639, 31315, 56703, 40659, 15305, 7290, 13462, 6761, 20203, 38373, 25041, -7280, 13079, 24568]
12511B4568P819J5039j9374n5750k171k8119j2153M8122L4967J3482N960j5386
12499A7004r488J8101Q542J4929J752j5369l3356j9602M2862K4771j8828l0678
12487F40J1406K0150j2860l3140L8259j1o197K0995J3806j7770J3135j0634m8684
12474a0905n715j536M810m91L4210K1275k2474l2324j3412J0761L6900J9352k2820
12461A7631J2651p440J3524j9852J7289j016J4362J7317k7450l0612R323J9840
12449C5567K740K3772m525p8j7685j6714K4154J4275q060k9821m336Q42k2621
12436b490r148M224j3010J6904k081l2975K0695J4802K8005M215j4444o109k521
12423F067J0358k4006j9959J8627J4945k9016j6128r032K0780L2462K8797J1239
$$ y = [24568, 32387, 47426, 28052, -27698, -29869, -57988, -70141, -22019, 12948, 26430, 32390, 17004, 7516, 25617, 34159, 49088, 50840, 35471, 2115, -17487, 25375, 50146, 31318, 640, 12046, 32196, 19336, -13804, 24455, 24444, 18247, 39242, 53048, 35278, 48413, 37779, -10905, -16620, -18156, -13346, -13837, 20373, 41648, 19174, -13150, -26562, -15801, 21099, 40451, 17631, 30282, 22842, 36366, 16514, 33803, 32787, 47149, 64466, 37016, 6404, 15727, 35567, 38307, 62079, 57554, 57476, 39791, 23077, 47231, 61506, 53446, 23625, 19289, 20131, -2490, -11638, -7414, -20424, -3520, -5601, -38576, -17881, -3079, 24926, 29141, 14697, 8588, 6067, 16425, -7581, -27540, -8913, 6032, -22984, -39112, -48144, -27364, 5098, 33895, 45134]
12411D5134J3274o12M08k9869Q652L237p935M41j3526j1546J1210Q025j2781k1526
12397g414j7392K2678K5516q889k3853j9067R000J0960K0669L9539P432q141j4901
12384C6137o076p82j8988r362J5778j0075j0587K8963J4984r092j4605k7796R951
12371a550P496J4606J1081J759P240k0968O837L0440k4938j6710K5571j0582j3088
12358A7194j4134l3654J5578L4252l459n150L3014K6671j0182k4362j5471J202
12346B1499L1030J5823q397J3202k8647k3332j4208L528j4905j3900o638M497
12334b0448J0706q76M1473R809K818l018j3973k4144L965L825R105q326J0217
12321B1133j3814j5729J488K5329o689j4992L619n090K0854M025j3325L3535K8871
$$ y = [45134, 58408, 57796, 58204, 28335, 36987, 40224, 32289, 32730, 19204, 7658, 18868, 26893, 14112, -7414, -24806, -2128, 23388, 14499, -9354, -28421, -19421, -8461, 12208, 51747, 59179, 51038, 36137, 30061, 29279, 10291, 929, 16707, 6632, -3955, 25008, 39992, 30900, 16295, -11501, -1550, 5946, 20552, 31633, 33392, 40632, 19664, 26501, 56941, 32003, 15293, 40864, 30282, 17194, 3060, -30594, -15016, 19236, 15777, 10627, 43641, 70312, 60130, 35768, 20297, 21499, 52529, 68352, 59955, 73157, 44510, 21178, 6970, 10498, -4407, -18307, -24945, -20448, -9742, -10618, 30855, 40664, 43482, 40464, 26491, 2347, 6312, 10137, 19242, 10916, 21133, 7319, -8410, -6922, 18407, 11718, -3274, 345, -4745, 16109, 20134, 6809, 40344, 69215]
12308F9215L116n3276q919o607k0039j8526J931J3552J2865M13K2132J073m2673
12295b5743q510M9571j7267k7069L221K613L7718L528l1866k145K3859K8390j5229
12282B1071J577j4832J2221q525l5794L701J1931k8117J4002j1903j4435J7604
12270c1499L2000K947j5062J862J2734K114k762J2731J276R334n08J9801p726
12257C7242q827k1093L0140M2551k640k4887m1387k0722l6934k0956R394M9509
12245h610j1918j5480L85L0476J1195k1801J602K7174J8484p369n0554J5332K3088
12232A2004j8318j1091J1961j989P719k6k0032n389R888K513P726J4902K3232
12219C3100K6217l677j3575J6004r556m8753m0106N180m134L2701L1338O257k6775
$$ y = [69215, 72331, 19055, 10136, 3529, -16510, -35036, -33105, -19553, -6688, -6275, 15857, 16930, -25743, -34253, 15318, -1949, -29018, -25797, -23184, 14534, 18062, -13804, -15949, 7910, 36300, 21071, 22648, 7816, 20037, 11512, -24282, -20581, -8650, -36767, -22765, -34668, -49103, -31499, 501, 3448, -11614, -9752, 2982, 5096, 2334, 15065, 16341, 25675, 25167, 44968, 37242, 28415, 7322, 37462, 80013, 77373, 52486, 11099, -9623, -46557, -67513, -58119, -8610, -20528, -36008, -35623, -5147, 6048, -15753, -14151, 13023, 31507, 24138, -26416, -11084, 12004, -6314, -17405, -5444, -7433, 286, 260, -19772, -25161, -15273, -12760, -5034, 9868, 33100, 59317, 55640, 42065, 58069, 48513, -240, -40346, -35166, -39300, -6599, 24739, 30996, 4221]
12206D221l1545K5975N52K2149j2770J5464O567n011r902j9326j8447J0761J4223
12193B911l523O62l398O286J4781j2041j1668L236J1406j4163K8040J1154o784
12180B6899k3277l4427K314J5438J7652k617o738n457j4895j0288p008J5888J0247
12167a6269Q019L409j3621J4740J8289n195j7417l0170M370J4031m782J1580L4977
12154B1961k2622n028p413K1011p444O728q633j4491n419O971j6885j70L684R006
12140a8744K891K3289J6800L0717k9062n0470L481L0652J5528J2500Q626K1990
12128F8198k7792m784j1048j4245j1512j1492l0694p641K0037J1048N624k5377
12116c9678j8149N7855L8090J5133k1031k3966K5146J5293p837l1271N389J7509
$$ y = [4221, -27324, -1349, -797, 21352, 8582, 24046, 30613, 25602, 15700, -3626, -22073, -11312, 2911, -612, 50, -3348, 2938, 17719, 5678, -5990, -2754, 8652, -5511, 22529, 33683, 26899, 3622, -30805, -28491, -13053, 4599, 1982, -4756, -10213, -25108, -35396, -42404, -26516, -16269, -8250, -4841, -18462, -3722, 14567, 9372, -8045, -38215, -33845, -19814, -24596, -13016, 21961, -661, -5689, -13102, 7909, 465, 7193, -1440, -15931, -21350, -14379, -31264, -31434, -27750, -18744, -15853, 7436, 24236, 54953, 25891, -24579, -21098, 9554, 25082, 37582, 46208, 68198, 40406, 35622, 24574, 10329, -1183, -12675, -43369, -51010, -30973, -19925, -14301, -39678, -57827, 28, 38118, 53251, 32220, 8254, 33400, 48693, 40856, 9585, 14974, 32483]
12104C2483K5440K419J0542l5273l6826j6284J6822K3301j0279j9259J4917K7600
12092C5603p835j9206j4089j199q773o887n353n494K3702n3j272J7577l593k0045
12078a6917k0854j3360J1807K3856L7589K062K3752J2131k0835l042J0111k2743
12066B3557j0478p307L31J2511j4992p112L8861J4840k3874k3476l4712M145m811
12053c2517J2732R953L395k415k3663k167J936J3455J0450L3393J1427m16J0338
12040D5901j697k0425m2440j6548N745j06P648K3367J5258Q690L670n567o242
12027A7254j7509k265J765j0659L421M538J7778J4682m257k1829r915m868O505
12014e359k696j665j5266j5235J5115J1354j6807j7480O103M6191p467r358n343
$$ y = [32483, 57923, 60342, 70884, 35611, -1215, -17499, -677, 22624, 12345, -6914, 8003, 35603, 27768, 8562, -5527, -6726, -15499, -22386, -27739, -33233, -9531, -9584, -10856, 6721, 3128, -16917, -37771, -51131, -39324, -15468, 22121, 24183, 47935, 60066, 39231, 36189, 46300, 23557, 13079, 5772, 6103, 18614, 3622, -3490, 35371, 50211, 26337, 2861, -31851, -27706, -32517, -19785, -9832, -6437, -8852, -32515, -34682, -32746, -19291, -8841, 24552, 35979, 35563, 45901, 44204, 23779, -18661, -35209, -29464, -29570, -21922, 1445, 16703, 25393, 29063, 23496, 17254, -255, -2520, -755, -11414, -7993, -3455, 14323, 29005, 24748, 2919, -6996, -11864, -5359, -8055, -9720, -24986, -40221, -25106, -13752, -30559, -48039, -41936, 4255, -3212, -12570, -17913]
12001a7913R90j0851K2066Q602L23J9059q51j6321M04K482n772P74r24n3487m0920
11986i2339J3421J5706L4K782K0605J4492R783J2528J1793L0677k3141l3580j0104
11973b7343J8804k836K7047L0324j175r152L893r149j2112j1605l7259K1848K9631
11960B0916l251R867K2939k3377N992L4099L409p382j2783l1744j6028l7138l2338
11947f6819M5182L8129k326N344Q047O620j2371k7191j1935o798l656K1357l162
11934i579j050J7872M389n746j1401J2317p089j5242O981L0436N777j4648j3368
11921c51K510K1964n615R322J1760j1304j8904q390q47P67J9241L3616j7522l7868
11907a621l722k997m690j5740J5308J6719J1514q801k3480K0194K3243P919P800
$$ y = [-17913, -16923, -27774, -5708, 2894, 3217, 22276, 21425, 5104, 5508, 7990, 2218, 2992, 2068, -51419, -92339, -78918, -63212, -63178, -60396, -39791, -25299, -15516, -2988, 8805, 39482, 16341, -17239, -27343, -8539, -11375, 15672, 45996, 44821, 35669, 39562, 30413, 18301, 6696, -30563, -8715, 20916, 17665, 27532, 50471, 27094, 33086, 67185, 70594, 63212, 50429, 18685, 2657, -34481, -66819, -21637, 16492, 14166, 19510, 27557, 34177, 21806, -5385, -17320, -24118, -27774, -6417, -9579, -10629, 7243, 11632, 5886, -5515, 6802, -287, -15529, -8548, 21888, 27665, 13017, -351, 2159, 24123, 18508, 27830, 39590, 28286, 9382, 992, 145, 912, 20153, 53769, 36247, -1621, -5343, -8340, -13030, -28770, -13462, 3257, 14771, 5970, -17510, 2684, 25927, 33846, 41646]
11894D1646J2236l2843o1757j6728K1279J4883K3277J3909N244J031q137k0738
11882f698K211k5024q597K3612k7268j764K1837J803J0578M65k2401K2651J1805
11869C210K0136l0534j5674J9148l1363Q37J4634M8256K1243l8395l8272k2367
11857d9141J040L6218K1295m072j5945j015J1679K7166j5398J1830L7718J4226
11845G5601l0869l6713J0442p343j0689j4189q072J6421K9770J3072j3347J0319
11833C4403j6213m750J5278n424j0299j6203N579K0795j4374J2999P3M00j0926
11820A1338j5400o525J3530L8711j8139m8008J729J5908o960k3065J1167N519
11808b0195j7064p83J9312J601l395k4948r175j981L488L0855N2824L9380j6161
$$ y = [41646, 53882, 21039, -40718, -57446, -36167, -21284, 1993, 15902, 21146, 22177, 14040, -6698, -4487, -29511, -38108, -14496, -41764, -43528, -21691, -19888, -9310, -8845, -31246, -8595, 3210, 23346, -7188, -22862, -3714, -35077, -34240, -19606, 28650, 49893, 11498, -26774, -49141, -48101, -11883, 9412, 5340, -10605, -11620, 59, 27225, 11827, 23657, 61375, 75601, 44732, 8019, 18461, 11118, 429, -13760, -21832, -5411, 24359, 37431, 24084, 34403, 18190, 13440, 28718, 23294, 12995, -3208, 2371, 23166, 8792, 21791, 21864, 22264, 11338, -4062, -10587, 2943, 41654, 23515, -24493, -22764, -6856, -13816, -36881, -25714, -20195, -37259, -38042, -18730, -17129, -20524, -45472, -54647, -56628, -53140, -22285, 30539, 69919, 53758]
11795E3758m7814l8028j120j1622K4154K0015j4206j0463R502L56J1674J1227
11783G433K7354K094j130j2100J0576k5086m056K1425J6687n914j2589q400M75
11770A6769J5845K830J7670K9505o350m2699m886K2211J2270j8389m6346k0942
11758b2512L0644J892J02P141J8399k2358j955j9286j4688n680J9271J3985K1777
11745B6732j4708p264K0863j0836j91K0754Q96q237L326k1475j4215p897L640
11732h612N472Q923l769j3965K1420L5108p519q508k4067l5353K1473r330j8457
11719c7184J8869P42k835l2334q683K6513k219K9913r10j4869J0642L0027j2623
11706E049l9758N85o902j5990o131J6898L5081j4808l5012j4968O834N319p407
$$ y = [53758, 5944, -32084, -33204, -44826, -20672, -657, -14863, -25326, -15824, -15468, -3794, 7433, 34787, 36881, 35751, 23651, 34227, 9141, 5085, 26510, 43197, 37283, 24694, 16294, 16769, 32614, 35444, 53114, 82619, 76269, 33570, 28684, 50895, 63165, 44776, -1570, -22512, 8132, 10024, 10126, 17267, 35666, 13308, 11353, -7933, -22621, -28301, -9030, 4955, 26732, 12024, 4760, 25623, 14787, 14596, 35350, 36246, 28009, 31335, 9860, -4355, -12252, -8612, -3140, 5783, 2014, -11951, 9469, 44577, 37058, 28550, 4483, -30870, -9397, -18727, -37184, -18315, -17573, -20408, -52742, -61425, -34912, -37131, -7218, -8128, -22997, -12355, 17672, 5049, -34709, -34124, -41026, -57016, -63147, -46249, -11168, -25976, -60988, -75956, -69122, -63803, -71210]
11693g1210R412L2950L5000j5805K069j349k259j6246j0377N0238M234l2778k276
11680a8397j5079j9693M302J1104j4733J1641J2710K1781J9762k053l5322m402
11668b8379J7228J0618l5048l270M2181Q297q934l684q971J6881K2844R840k4698
11655A4905N164K6528n231l359p00j5641m153j3197j105j9283j4237m487J1240
11642b3556L814n329m857K122R341J718O436J2652J6620J356l7375N420r496L25
11628b0809O861J9067J6624j7503N695O82k82P653j7027p33K0233Q299k2768m0590
11614c4598K3754J8401p509M242J6602N706k405o893Q808j3705n171l1401L4385
11601A0216k323J3018J1372q385m021q221j2114j5768n437J1552M279o155k4594
$$ y = [-71210, -61798, -28848, 6152, -9653, -7584, -8933, -11192, -27438, -37815, 12423, 16657, -16121, -18397, -33476, -53169, -48867, -37763, -52496, -40855, -28145, -6364, 13398, 11345, -23977, -28379, -11151, -533, -35581, -38851, 3330, 11627, 2693, -991, -9962, 6919, 29763, 39603, 14905, 20069, 46597, 41366, 38007, 37307, 21666, 17513, 4316, 3211, -16072, -30309, -34796, -23556, -19742, -25071, -29928, -27806, -18465, -16747, -10311, 2341, 18961, 20317, -17058, -11638, -21134, -20809, -13948, 5119, 21743, 4240, 9935, 10617, 10335, 17988, 961, 228, 20461, 28760, 5992, -34598, -10844, 7557, 48, 4290, 20892, 26598, 24193, 17300, 26108, 12403, 7232, -24169, 10216, 7893, 20911, 32283, 23898, 19877, 11656, -458, -16226, -21663, -10111, -5832, -11987, -36581]
11588c6581P471O836J8343R31l8716j1563J8774J7494j1873N902L24O415J1060
11575e183l9883k7545J9309m370Q121K3840K2655k3745n290L378J5628j0600k301
11562b5986J7839q692J4238l3269o522K928k492K6891J0945L1155J3337M14k0762
11549B0024l8324k2481J0689j3243o688K5135L0424r80r58j6151k0402l391j2597
11536d8943l253K0298K491P463K2625K894l950j0115j0815k3606J1809K1774n654
11523a6982k0254j8521J7320J43o977j0831J5308K451K9974J6391j5459l415j0
11510a0862l355k36j148k8990J151L5058N719J3Q44l409K6157n51N37K3498J4814
11495E9240j6946K491R282k689K3939J292l441j6211k1993r634k4703n549N943
$$ y = [-36581, -29110, -22274, -3931, -3000, -41716, -53279, -34505, -17011, -28884, -22982, -22658, -16243, -5183, -45066, -72611, -53302, -57672, -49551, -25711, -3056, -26801, -32091, -28713, -13085, -23685, -25986, -8147, -16839, -2601, -35870, -42392, -39464, -41956, -15065, -4120, 27035, 40372, 40786, 20024, -18300, -40781, -30092, -43335, -50023, -24888, 5536, 4556, 3598, -12553, -32955, -36346, -48943, -52196, -31898, -29407, -21944, 681, 3575, -375, -10490, -21305, -44911, -33102, -11328, -16982, -37236, -55757, -38437, -38294, -45271, -56102, -40794, -38343, -8369, 8022, -7437, -10852, -10862, -14217, -14453, -15601, -44591, -43440, -8382, -2663, -2650, -1806, -5215, 20942, 20391, 20928, 44426, 59240, 42294, 44785, 54067, 51378, 75317, 76609, 73168, 56957, 34964, 25330, 627, -4922, 1021]
11482A021r069o857l507r772n761k916J2084O683N349J0360Q206Q639Q483P350
11468C0293l397r967j1227r882L1065O720J9586m368n6249m788K6236N391O032
11455B5445K0889M903k0990k7079j3005j1571o737P847M467J2784M3555J3846
11443E4354l4887q852q599J9507M333J3289j1237K6959k3300k8148j1183J9722
11431A1958l063j56J5020M264k8842m5316j586J5650K8266j6209k867J4170q190
11418a6901K5297K0100j761k1763j0503m746K941K1053P343j3077k9180J4497
11406f700k0987p196J4728J6151J626j9749j4473p38K726q036L7800J5750M239
11393A5141K9380o949k1241j5316P957L3317k495k5977P662J8102j3626l3426
$$ y = [1021, -8048, -14905, -18412, -28184, -33945, -36861, -24777, -18094, -12745, -2385, 5821, 14460, 22943, 30293, 26896, 16929, 5702, -4180, 26885, 33605, 53191, 48823, -7426, -12214, 14022, 19413, 25445, 46334, 51237, 30247, 3168, -9837, -21408, -28145, -20298, -15831, -3047, 40508, 54354, 19467, 10615, 2016, 21523, 25856, 39145, 27908, 54867, 31567, 3419, -7764, 11958, 8895, 8739, 23759, 28023, -819, -46135, -47721, -32071, -3805, -20014, -22881, -8711, -16901, 8396, 28496, 26735, 4972, -5531, -10277, -7336, 13717, 21060, 7983, -21197, -6700, -27687, -34883, -20155, -4004, -2378, -22127, -36600, -37338, -34612, -42648, -4848, 10902, 15141, 44521, 37572, 16331, 1015, 8972, 42289, 39794, 13817, 21479, 39581, 25955, -7471]
11381g471k6808J5606K0538N629k1593j7863L202K4408K3897q977j510J7760n801
11368B1017j8027k378q287K731o147P230j731K6084M0067k0719o7403q096J9658
11355a6001J0386M961j843L0119N155O337r793l9948l4374P405M527L2542K2988
11342B2461j1429O434j5933j9812J7247n202L1033J4689k4487o834m086J7581
11330B1662J0138J878J721l5231k7397n910Q493P932J2812M2094J1909q820l7311
11317C970l6630r012P847k4475J7085K8892p400p867Q997J971R081K3379n110
11304A0728j753k0398k8022K743j4666L4573m1r151K2370K3952j4446j8478J0531
11291b058j204j4511j876J3541n280J821j1481M98L579K2824L182q758Q160M086
$$ y = [-7471, -34279, -18673, 1865, 7494, -14099, -31962, -28760, -4352, 19545, 10568, 9058, 26818, 21017, 2990, 612, -7675, -4944, -11091, -3861, -5592, 20492, 60559, 39840, -27563, -35659, -16001, -5615, -654, -2497, 27622, 32777, 39114, 29321, -10627, -45001, -37596, -33069, -527, 22461, 11032, 17466, 1533, -18279, -1032, -6234, 24799, 39488, 15001, 8167, 4081, 21662, 31800, 33678, 35399, 168, -27229, -33139, -24646, -16714, -3902, 38192, 50101, 41281, 3970, -32660, -41672, -33825, -58300, -41215, -12323, -19723, -27590, -18593, -16622, -7541, 15838, 10728, 8975, -11423, -39445, -36702, -51368, -16795, -16836, -25987, -3617, 20335, 5889, -12589, -2058, -3262, -17773, -19649, -6108, -11388, -9567, -21048, -20550, -16971, 5853, 9035, 277, 8437, 12523]
11277A2523l5557j2275K6874j735n166N946J5008q851L0611O988Q513L081j2599
11264C3361L091q578r09j5885Q9Q954p176j9797J688j8239j6892J0718K6857p678
11250a0396j1375k4643o919L0982L952j1950O280K8759Q185o565N069n287K0712
11237B6804J8404l5974r111o445K07R410J2874P492j8903k4451J9759N543j3090
11224g481j5992k5059L7929K7535j9588j4629Q286m273j4131j472J4867j9029
11212c3037j8127K4947L1434J1044k0758Q642o392j049J4292Q936R96n646N963
11199B1245q899k1733j4755j946O386K4288L8369M423l4756m1082K286Q417N569
11186a2188P739q752L30K6909L859j6054J7733J694j230K428n917l780K8785k1494
$$ y = [12523, -23034, -35309, -8435, -10170, -15336, -9390, 5618, -3233, 27378, 34366, 42879, 45960, 33361, 36452, 27874, 26965, 11080, 11169, 20123, 12947, -6850, -5162, -23401, -40293, -29575, -2718, -10396, -21771, -46414, -53333, -22351, -18399, -30349, -24069, 4690, 12875, 6310, 11379, 6092, 26804, 45208, 9234, 123, -6322, -6115, 3295, 16169, 23661, 4758, -19693, 66, 5609, -7481, -23473, -48532, -10603, 16932, -2656, -17285, -8999, -13272, -27403, -28875, -14008, -33037, -51164, -26217, 5217, 16261, -4497, 4145, -2247, -3296, 10996, 19932, 20928, 15282, 21245, 12346, -9387, -24142, -26088, -19702, 4586, 42955, 47378, 12622, -28460, -26174, -17757, -12188, -4449, -13201, -12871, 14038, 17897, 1843, 19576, 21270, 20040, 22468, 16551, 12771, 41556, 20062]
11172B0062j7617J6290k6274j8642j2838k555K077J1981k397J266N192M772j0795
11159b9478j2037l731K0780L6838q301r681N24Q165j5318p423L393P814M578K609
11145a268J6340J8385j5447j8089k5137k5589J8988L1855L5257R232k8409k8525
11133a2407P59P086M1387K848k0073k1147k279J6222j2279J1698O729j7566j736
11120g58N5K7744J1675l993L300l1147k8583k261K131L717k587N427J1475k3771
11106b7576k249L3606J6553k4080j0879n919j652N812O668k3803Q17L0603J593
11093e06k2357M81P220K1838j5805L592O751L091M270K179p362k3825J4147J0473
11079D187N251j4855l2520M586L6651M284k3765j4924J247j1821J6023J5945j4001
$$ y = [20062, 2445, 18735, -7539, -26181, -39019, -41574, -39497, -27516, -29913, -28647, -23455, -18683, -29478, -41515, -45246, -24466, 12372, 4071, -5610, -5086, 3079, -12239, -19662, -16269, -8455, -3877, -1268, 15072, 33457, 18010, -79, -25216, -50805, -31817, 38, 35295, 44527, 16118, -12407, -11648, -4562, 36825, 39673, 19600, -1547, -3826, 12396, 117, 11815, 18544, 978, -758, -703, 27041, 38716, 34723, 38023, 6876, -21707, -23968, -21837, -18120, -20707, -15280, -3805, -27576, -29825, 3781, 20334, -3746, -14625, -20544, -22196, -16384, -9716, -33519, -32702, -2099, -506, -22863, -22382, -15162, 6676, -9129, -5537, 1214, 4305, 8575, 10754, 3392, -20433, -6286, 4187, 9438, -5417, -37937, -33351, 3300, 7584, -16181, -31105, -29858, -41679, -25656, -9711, -23712]
11066b3712L524n592R504n102l451L2661L4083j0923l0484k7692r194m322J6091
11053b4609L9524K595k1334j3230l6015K1586N5795J0220j8509j5912p714l168
11041a0771k8998j9808K7577M1440j4840k5275j6954J210L3323L3806j384r358
11029I968R489J7302L2565j2920l506m6875l5635r42K9794M1133l0277j1724j5011
11016a6639j0263J7976m768k0152O833M577J2726o955j1360R703O415J028K436
11003h443J4754j4856q621J2956j4175M617J6344M43n32j2543l409k1937j84K0525
10989a5061K2386m750J3175J7957m3568m2723j5534J4759L0501J4578k361o540
10977a7181K2584j0360j3226O44J2270J6453K903q946l8933N571J9078k2928M79
$$ y = [-23712, -20188, -25780, -16276, -21378, -24829, 7832, 41915, 30992, 508, -27184, -36378, -40700, -24609, 14915, 17510, -3824, -17054, -53069, -31483, 24312, 34532, 16023, 111, -7603, -10771, -39769, -59577, -32000, 9440, -5400, -30675, -47629, -46419, -13096, 20710, 19326, 9968, 19457, 36759, 69324, 56404, 52898, 6023, -29612, -30554, -760, 40373, 10096, -1628, -16639, -26902, -8926, -13694, -33846, -27013, -22436, -9710, -16665, -28025, -18322, -11907, -10879, -8443, 6311, -8545, -17166, -4210, -18385, -13768, 2576, 3019, 2487, -10056, -13465, -35402, -35586, -15061, 7325, 2575, 15750, 33707, -9861, -52584, -68118, -53359, -22858, -8280, -10641, -17181, 5403, -4957, -18183, -17539, -5269, 11184, 14087, 5141, -33792, -28221, -9143, -32071, -31592]
10964c1592J0183k201j47N168j204O480n707K762J5679n76j4965j3120Q980K2862
10950B602K5264K8185K1938J797l7082k6718j068L13j9781J7864J159j6077K3331
10937B1727n125m975r043k8311j7770K3025L565k1353M9339j791k1968J5934N887
10924I141k1901j7423k4247k387M1271L9918O852r563R509k6922k2014j1919J1041
10911a8644L5353R415k0005o052l0089o292J8863j315M270k511J5736K4058J8130
10898D0917R747l7587J1001J4810r938L9L2941J5863m4274l7463k3019m547J3342
10885a8168J5821p169j0476k0424M004J7528j79j0194L5900j13J814M8738K2500
10872G9582m9805j8159M768k2391k3522J827N467K6632M91K9222j0442j1830j4015
$$ y = [-31592, -21409, -23610, -23757, -18589, -19793, -13313, -19020, -16258, -579, -1155, -16120, -29240, -20260, 2602, 27866, 56051, 77989, 79786, 42704, 15986, 14918, 15231, -4550, 13314, 14473, -1604, 21727, 16602, 11627, 2584, -25727, -43497, -20472, -16907, -38260, 11079, 9288, -12680, 3254, 9141, -12760, -30183, -54430, -56817, -15546, 24372, 31224, 21661, 31170, 4248, -17766, -29685, -18644, 16709, 26124, 6119, 67, -30022, -36314, -17451, -18766, -14496, -17007, -1271, 22787, 40917, 50664, 13077, 24078, 38888, 28950, 28989, 61930, 77793, 33519, -3944, -26963, -31510, -18168, -2347, -9516, -19992, -40416, -36412, -18884, -19063, -29257, 6643, 6530, 8344, 57082, 79582, 29777, 11618, 16386, -6005, -29527, -27700, -22233, 4399, 4890, 34112, 23670, 11840, -2175]
10859b175j0436p079j6507q096k1491M413K9477K4532k8060m11K5403J1875K0565
10846B2010N960j9408j7483r269n566N312P237N963j108J4887l2736J9487j9427
10833b4141k1282J0970j4292Q663K7127J6060r378J569Q186M354J1855p420q062
10820D209J7785q570j0047J8285K3293J715k2369n700K728L4629m203j0863O735
10807D7627M832k2497q848r664N306q454j3429O715J662k7997K1889K1874j0516
10794H500j066J7221O860l1794L58K7281K059k5099j5709M7411L2842k2913P088
10781E3039Q236K5829J1013l9289j8488j0843P367j1316J565J744l3809k0649
10769b5601Q51L8873Q080k022J32K5535j487j7089K3165K293R904L049m284K579
$$ y = [-2175, -12611, -19690, -36197, -44293, -65784, -61371, -31894, -7362, -35422, -35833, -10430, 1445, 22010, 27970, 8562, -8921, -18190, -23756, -18444, -11207, -5244, -6352, 8535, -24201, -4714, -24141, -45423, -34453, -48745, -40082, -12955, 3105, -6273, -4704, 3482, 7836, 19691, 12271, 4209, 21994, 13424, 3377, 21662, 44955, 46670, 24301, 18601, 21329, 55958, 51755, 40892, 47627, 52459, 29962, 21114, 11450, 16756, 8302, -5127, 1588, 3250, -24747, -2858, 19016, 8500, 7434, 24655, 31515, -279, 79, 27360, 29419, 4320, -11389, 36022, 68864, 45951, 53039, 61275, 87104, 98117, 58828, 40340, 29497, 36864, 25548, 27113, 28857, -4952, -25601, -24750, 14123, 22203, 20181, 20313, 45848, 44361, 27272, 50437, 52730, 62634, 65683, 61399, 63978]
10755F3978J6936M523p706L7889M1740p114m771K5595L3072J1432l458j9551k3226
10742A69339k0104L6732N2060J1613K1090L4712N4589O3359P7254J05422J39370
10731G45436J94858L11553N44924R00942J089778P08261m10906j257586j009770
10722A817490n72572k86743j77619j02714o3689o8188p3652k9079k21j7536o3272
10711C62205k8485m0682l7224k0367l7100j6328j2449k2449M291m105k7420m1629
10699G8258J4405J0401p640l8969l094K4751J5435J8305j1153k0529l0937P240
10687E6473P436M613k0196k6666L1641L3046n800l2650m4995j9090j536l085P315
10674a3494J077Q027R93J3282R384J0908K0294K0573r263p308O136N802m0536
$$ y = [63978, 80914, 85437, 77731, 115620, 157360, 150246, 145475, 171070, 204142, 215574, 212116, 192565, 169339, 149235, 185967, 238027, 249640, 270730, 305442, 360031, 423390, 500644, 606066, 745436, 940294, 1251847, 1796771, 2697713, 3787491, 4495752, 4084846, 2827260, 1817490, 1244918, 958175, 780556, 677842, 614153, 545965, 472313, 443234, 443013, 425477, 362205, 333720, 293038, 255814, 235447, 198347, 182019, 169570, 147121, 151412, 147307, 119887, 78258, 92663, 103064, 95424, 56455, 53361, 78112, 93547, 111852, 100699, 80170, 49233, 56473, 63909, 68522, 48326, 21660, 53301, 86347, 80547, 47897, 2902, -16188, -17724, -20809, -13494, -12417, -4390, -3397, 9885, 19269, 30177, 50471, 71044, 61781, 54473, 60609, 66411, 25875]
10661B5875m6252R321l667m679K8859L7764J8992k2632k6820J5742j7204k404
10649A2895o291k4769j7603Q704K5053K7268k7701l7593J6853N934j300k111K1599
10636I38P654J8995K1615r375K084j1181K3070j8109k6294J8154K0360l1003J6870
10623C3778J8809n906M938M070m1436j1450K982m492J4174j1782k6067L177K7627
10610H422M50r98r837O670q389k2988Q871l547Q528J8204k7147l77L9679r952
10596G589J6394M1412n854k4335p002J2517j2268j8454m895j0832k4738K9987
10584d79L2346m597P23m242j4341m8639k9468L3278J4593J3761N625N575j1557
10571g422l5132O981n221j99j1680Q560L0908j1657j5385j2431J0388K5649P111
$$ y = [25875, -20377, -11056, -14723, -19402, 9457, 47221, 66213, 43581, 16761, 32503, 15299, 12895, 6604, -18165, -35768, -27064, -2011, 25257, -2444, -40037, -23184, -17250, -18550, -20661, 938, 8592, 27587, 49202, 39827, 41911, 30730, 53800, 35691, 9397, 27551, 47911, 16908, 33778, 52587, 46681, 51619, 55689, 14253, 2803, 5785, 1293, 15467, 3685, -22382, -19205, 8422, 8872, 7874, -1963, 4707, -3682, -26670, -17799, -21346, -12818, 5386, -21761, -22138, 17541, 7589, 23983, 65395, 59541, 35206, 28204, 40721, 28453, 9999, 5104, -5728, -30466, -479, 31867, 27270, 27993, 23751, 9410, -39229, -68697, -35419, -20826, -7065, -1440, 4135, -7422, -42554, -35573, -40794, -40993, -52673, -44113, -13205, -24862, -40247, -52678, -42290, -16641, -9530]
10558i530Q533O852J2123K0180j5530l5291k0820k522j865j5262O043j5788K2860
10545d0017J1906k1100M368K9438q060r74J5204J0638j9831n123K7992J5779k0124
10532I6k4104o032N615L652J9497R194m2209l629P625j0445M999J0559N308P887
10518a1987J2597k6772l6018k179L8552K5529R191n292k7939o897J5654J6513
10506I52R827Q621j5392o693j4510l42j003j724K8860J0145j6637l604k48j7594
10492a9342j4694K0736J8631l1411p690R351M0145K8488J6043J4095l8540j7499
10480A8313J5954l981k7822L3632L305k3274j7056n658r323P017j2809n659L1390
10467D029K3819k626l0719p995J3530q154j3545N323n411R545l343Q133L004j4022
$$ y = [-9530, -997, 5855, 17978, 38158, 22628, -12663, -33483, -36005, -37870, -53132, -47089, -62877, -40017, -28111, -49211, -44843, -15405, -23465, -24439, -9235, 1403, -18428, -23551, 4441, 20220, 96, -24008, -30040, -24425, -20773, -1276, 7918, -34291, -37920, -30295, -40740, -35741, -25182, -19874, -11987, 610, -26162, -62180, -64359, -25807, -278, 8913, 3621, -24318, -31215, -15561, 952, 10779, 19400, 4008, -2685, -17195, -17537, -18540, -20264, 8596, 18741, 2104, -1500, -1748, -19342, -34036, -13300, 5331, -26080, -33770, -24419, 15726, 44214, 60257, 74352, 35812, 18313, 34267, 30286, 2464, 36096, 39401, 16127, -929, -6587, -15910, -8893, -21702, -27361, 4029, 27848, 25222, -5497, -13492, 38, -8116, -21661, -16338, -21749, -12204, -15547, -7414, -4410, -18432]
10453a8432p621J4085K6787O755l2914k2895K338j6927L029K0270j2402J5003
10441b2924K6502j9615j2393J3662K249n861j4988j7411m624L448J383L4287O799
10428i486j7115j1606J5524J5060J3046K8876j0311j8001R569K3941j6661k8174
10416e338O689o586L820J2166m088j1570m2676J2315k4069k2133K5630J3788J8348
10403b3704J4015j3830q817M93k5955p920J8568p747N082K7121L0312m789j9087
10390a6258J2710J0242o83J2400j5894j8914J5602K8636J718K3309m176k4902
10378B3790j0999j3934p10K6791L3721O122l7059k5772m992j4354p748J9770J9487
10365A4113j7969Q298N806L62J2372k3916j6857K4558J0369j2426J0067j5288
$$ y = [-18432, -26053, -11968, 14819, 21574, -11340, -34235, -31897, -48824, -45795, -25525, -37927, -22924, 3578, -16037, -28430, -14768, -12519, -18380, -33368, -50779, -55403, -51955, -50572, -16285, -9486, -26601, -38207, -22683, -7623, 5423, 34299, 23988, 5987, 15556, 39497, 22836, -5338, 1351, -5235, -1415, 10751, 6663, -4907, -47583, -35268, -59337, -81470, -55840, -42052, -23704, -9689, -23519, -32336, -31843, -57798, -65718, -47150, -54897, -49815, -22694, 7618, 2829, -16258, -3548, 6694, 6011, 18411, 2517, -16397, -795, 27841, 29559, 52868, 48692, 23790, 12791, -1143, -1853, 24938, 58659, 64781, 27722, 1950, -3042, -17396, -25144, -5374, 14113, -3856, 4442, 10248, 10610, 22982, -934, -17791, 6767, 17136, 4710, 14777, -511]
10353e11n317q889k866N813j3898k2618n45J6537k3309L2017J2481J2634J0120
10340A1649J4861j5120k5407j1936k1893N550Q980K2960m836j304p502j3765Q527
10327b9236M4837M726m258M0998N896o168k9336j9861K2298R326O023N37l460
10314D2322J2315q982q259j7207J8653M1180j3139l6438n917j6927l571J5564
10302A9594J2985m501j3581k2589k3295J4465Q639K9955m461j3402l414K5339
10290B5734J959k9628k4377J4177K5292P977j0748k6201L508j4047m259n309J2585
10277b3337J8817J372L1413J9888k1313R728l796k5839l2690n42P91Q602k3986
10264d0892Q900J7J1873K0116J0394j7079j8158L6259j5557l595o206j2148L830
$$ y = [-511, -5828, -14717, -17583, -11770, -25668, -48286, -48831, -32294, -55603, -23586, -11105, 1529, 11649, 26510, 11390, -14017, -25953, -47846, -42296, -33316, -10356, -15192, -16496, -23998, -37763, -29236, 15601, 20327, 16069, 57067, 62963, 56795, 27459, 7598, 29896, 39222, 45245, 45782, 42322, 54637, 45655, 37396, 20189, 38842, 80022, 66883, 30445, 24528, 7601, 4030, 19594, 32579, 28078, 14497, -8092, -31387, -16922, -8283, 21672, 17211, 3809, 395, 25734, 27693, -1935, -26312, -12135, 13157, 21134, 10386, -15815, -12307, -26354, -30613, -35922, -23337, -4520, -3148, 28265, 48153, 26840, 36568, 32772, 6933, -25757, -26299, -25508, -16906, -40892, -31992, -31975, -20102, 14, 10408, -6671, -24829, 11430, -4127, -7722, -13928, -26076, -22246]
10251b2246J6857J2812l0025j0937p658j0907j1547J7474N5691J1597m9662k3693
10239e2244K8669L7960l5m8923n078K4805L1509K6263j6796k8077J0784R350m047
10226A4140j0639J2672K4963N523j7035m248N226j6525l4077J1385L4254K34j4066
10213A1807k3967m643L3640P932m894l6021k159J8569K569J5648j2596l4438m9145
10200g7698k841J7079M70K0880P997K0531r723L2789M5801l1592l1882N573K0372
10187A7756J7272n482K19l629l7327j7055j687Q253o68L13L0365J5029N486k0219
10173H626k4681m3972j5442J8375J5561J5442R55L1781r332k4326J0693J3784
10161b536q293k579J2354j6942j1551K1070J025j6432L95L332L5935l540k6502
$$ y = [-22246, -5389, 7423, -22602, -33539, -41197, -52104, -63651, -46177, 9514, 21111, -28551, -52244, -23575, 14385, 14350, -34573, -39651, -14846, 16663, 42926, 26130, -1947, 8837, 18187, 14140, 3501, 16173, 41136, 46659, 29624, 25376, 30602, 14077, -20000, -8615, 25639, 25873, 11807, -12160, -16803, 16837, 24769, 19875, -16146, -18305, 264, 2833, 18481, 5885, -28553, -77698, -80539, -63460, -62990, -42110, -34113, -13582, -23305, 9484, 55285, 23693, -8189, -2616, 17756, 35028, 29546, 29765, 26136, -11191, -28246, -29933, -21680, -22348, -22035, 8330, 23359, 28845, 8626, -16055, -60027, -75469, -57094, -41533, -26091, -25136, 6645, -2687, -27013, -16320, -2536, -10829, -13408, -1054, -17996, -29547, -8477, -7452, -23884, -23489, -20157, 15778, 12238, -14264]
10148a4264j6870l3J9047j5562M069J8762o398O051N389O099n141j5449K175K4284
10134A2159j6014k2717J57j896p147K8963K1543L988j2366l2957m739J1725Q664
10121a0637J0413o558J7473o669q871J986J3072r564k0505k0491J0913O993l5632
10108e8077k4230K365j0318J4078K7806J3467p524j9761R655L9957K1536Q505
10096A7459J5965M087j0567k9584k4436R154r549J4283J8129J0573J8391p772
10084B6133k1185K920l1038j7764K0603M1217K9575k5912j6783Q264J868J525
10072A9423J0697n030j3171J8202P929l3751j5571o802K041P581j5868K7047J6710
10059A9437J8528q727j1463L2278R408j2313l2985j0600M7719l117J9921O1925
$$ y = [-14264, -31134, -31167, -12120, -27682, -23613, -4851, -11249, -5198, 191, 6290, 1149, -14300, -12125, 12159, -3855, -26572, -26415, -28311, -35458, -6495, 15048, 19036, 6670, -26287, -31026, -19301, -10637, -224, -6782, 10691, 4022, -4849, -2863, 10209, 645, -19860, -40351, -29438, -22445, -58077, -82307, -79942, -90260, -76182, -48376, -34909, -42433, -62194, -52539, -12582, 8954, 17459, 33424, 37511, 26944, -2640, -27076, -17922, -27471, -13188, 4941, 15514, 33905, 26133, 4948, 7868, -23170, -40934, -20331, 20886, 50461, 24549, 7766, 16030, 17898, 19423, 30120, 25090, 11919, 30121, 38050, 4299, -11272, -18074, -16033, -8452, -24320, 2727, 19437, 37965, 29238, 17775, 50053, 59461, 47148, 14163, 3563, 51282, 48165, 68086, 130011]
10047A30011N3116R0163J36498Q0335o2732j36664j12264o4838o577n693l7688
10036F3667r79k278k2385k8572k7355L5902J0261p058K1194L8143J1561j8849
10024G3252j3746j3771j7909j2164n796K2404K3309J5138l9324j9799P336j773
10012A7157j3438J4887j7559J0404J677q940k3529j0541o117j692M377l649K1128
9999a5835J1779J5308R015k0323k3067J841N695K3327J514K4719J2725j5940m2276
9986a1518k7842J9669p40j283J2323k695k921J0596L796o088m005j1669J2775
9973i602n030O786K1348J1061q857r328k4759k0656r41k5892k6433K8427N3648
9960a0228K0970R676l224j2985O482J5562K4446O032k90j2363j882R169p63k4905
$$ y = [130011, 183127, 273290, 409788, 490123, 427391, 290727, 178463, 113625, 107048, 101355, 63667, 62688, 60410, 38025, 9453, -17902, 18000, 28261, 21203, 42397, 80540, 92101, 73252, 59506, 45735, 27826, 15662, 9866, 32270, 55579, 70717, 31393, 11594, 18930, 17157, 3719, 18606, 1047, 11451, 13128, 4188, -19341, -29882, -35999, -37691, -33314, -36963, -15835, -4056, 11252, 20267, -56, -23123, -21282, -15587, 7740, 9254, 33973, 46698, 30758, -11518, -39360, -19691, -20431, -21714, -9391, -12086, -15007, -4411, -615, -6703, -10708, -22377, -9602, -14632, -7846, 13502, 24563, 15706, 6378, -18381, -39037, -39978, -65870, -92303, -63876, -10228, 10742, 20418, 17194, 4209, 10691, 26253, 50699, 56731, 56441, 44078, 42196, 51365, 50602, 25697]
9946B5697n350l7919l213P230r142j3802L702J0567J7969l730K5046Q313k5847
9933d79o660K1615L481n2498j5210K0596m748j2124L4114K4201k7576j7356l7569
9920g0213q502m978L4680L8537K5261P797j0151k3855k0599j432j3126r730J9149
9907c7162J6863M4164O063j0884k746J1277N417o710Q437j9394j6718j0J127r593
9893i869R530j7648P678L7191J323j5467p146k2353L961N86K8131k0578J0131
9880E470L3031O113k0846m89J7555J7235k2593j8324J61K7857K184j0888j4474
9867B1992p069j7488j5831K388o394K5001K2570J0443o448j523j7275j1922K165
9854F09q004j1838M755m768J3390L9436R476q473K244K3741j3183j2487j0522
$$ y = [25697, 20347, -17572, -20785, -13555, -22697, -36499, -32797, -22230, -4261, -7991, 17055, 25368, -479, -7139, 14476, 17957, -34541, -49751, -29155, -33903, -46027, -11913, 12288, -15288, -32644, -70213, -78715, -83693, -49013, -10476, 14785, 22582, 12431, -11424, -32023, -33455, -46581, -56311, -37162, -20299, 23865, 29928, 19044, 16298, 27575, 32992, 26282, 34719, 15325, -1393, -1403, -276, -9869, -339, -17987, -10309, 26882, 28205, 12738, 5592, -16761, -12800, -12214, 15917, -4661, 5470, 38501, 44614, 23768, 23279, 40834, 58069, 35476, 17152, 17313, 45170, 47354, 36466, 21992, 14923, -2565, -18396, -16008, -22402, 2599, 25169, 35612, 29164, 27641, 10366, -1556, 609, -7395, -19233, -14478, -19246, -5856, 33580, 43056, 34583, 36827, 60568, 47385, 34898, 24376]
9841B4376O204K479J211q609j7860k2197L2662L1255K385q537l3J4906k6080N102
9827C7264k8192m3189o858j398j1798N75J4378K2683j7044P6j2000P707J1669
9814b6127j972Q22K3121O543J105j0942K323j0462o110Q658Q391J0924K790j9128
9800a0064J6535J4862j7040l3767o257p825O097N6852k223L751r46j2705l65l425
9786C480o241l979m136J4363R820q354m289O94j5442M376J1004p086j8151J5118
9772h823J6861K0937k3381j3329j5898O168J9621J1847k0572j4546k3M508J4322
9759b308j1297o234J3440o802k731K0574k3021j5510J9892j6618J0272R412l1437
9746d2368N14O630m16K4741L8712m0712k2921J9831O939K100j0531j3082L462
$$ y = [24376, 30580, 33059, 34270, 25661, 7801, -14396, 18266, 49521, 51906, 43369, 43336, 58242, 32162, 37264, 9072, -34117, -40975, -42373, -54171, -53596, -39218, -16535, -33579, -33503, -45503, -37796, -26127, -28099, -27277, -4156, 2387, 3492, -7450, -5127, -15589, -21699, -13041, -4650, 6274, 9064, -10064, 6471, 21333, 4293, -29474, -35731, -43556, -37459, 19393, 17170, 20921, 19975, 7270, 6905, 3480, -2761, -6740, -10876, 3487, 13307, 4953, 664, 1358, -14084, -9708, 1296, -5790, -23941, -8823, 8038, 28975, 5594, -7735, -23633, -17465, 2156, 14003, -6569, -21115, -21138, -16630, -2308, -13605, -19839, -6399, -13201, -15932, 4642, -18379, -33889, -13997, -30615, -20343, -10931, -42368, -41854, -35224, -35640, -10899, 27813, -12899, -35820, -15989, -9050, -6950, -17481, -30563, -27101]
9733b7101m5416n801J9768J1877K0996L3474J480J9464J4196m687l3422j7470
9721a2642K1450J8600o562l90j3366j9216j4762n238L5059K0592j4250J6589O079
9708C1943J2999k776q868m767j6600r581J1428J554l4093k818K9171p335P964
9695H221J9169j1842j8986k7105J2977M325R066K2885m841m8490r140K6023J8230
9682D92Q748j1917j3089l7337k1502K4381M2419J7705k757J58k860L574j4323
9669f308j5345p801K571J3403L4438K4303j9098K665j3970n116j3594k594R640
9656C194J1663l0448k2290j2981J0464M3091J9877q255k111m186n664j225l1332
9643c0203k7182J9782K5215j3207P784l680Q529j2731j0361K248N821J9568K3707
$$ y = [-27101, -72517, -78318, -58550, -46673, -25677, 7797, 9277, 28741, 42937, 38250, 4828, -12642, 8808, 27408, 20846, 20456, 7090, -12126, -26888, -32126, 2933, 23525, 9275, 25864, 31943, 44942, 42166, 33298, 28531, 11931, 2350, 13778, 15332, -18761, -21579, 7592, 257, 8221, 27390, 15548, -3438, -30543, -17566, -13241, -4175, 18710, 13869, -34621, -43761, -17738, 492, 9240, -2677, -15766, -53103, -74605, -50224, -7805, 9900, 7143, 7301, 4441, 8015, -6308, -21653, -29454, -26883, -13480, 20958, 45261, 26163, 28828, 14858, 9742, -3852, -6446, 3194, 14857, -15591, -37881, -50862, -40398, 2693, 22570, 14315, 12204, 8018, 2354, 1129, -30203, -57385, -37603, -12388, -25595, -17811, -21491, -12962, -25693, -36054, -33806, -27985, -8417, 15290]
9630A5290k7960K2059P248P506K6397j0531K313J5507J2600k6534j9093j1976
9618A2826k9928L1763L4473j2730l4422L70j5705K2468m930k3659n700q262N549
9605b7887J9411J076k495J5639j9341K0542J1489k9280k7852o303p017q637M1354
9592a9301J4766q371l7475l82P350j199J1556l202J099M724j5057k6781Q662J078
9578f2533K2013J4547l4660R72P631K9753j2961j3081L4089L0763J2830j4537
9566A4826k1517k0322j2554J5215K5134n075J4398l586j1656M637r059j851l649
9553a5059L7729J3017j7150J4772j0258j6254j2817Q297j1728j8496J3979K1473
9541G505j2023M326K3168j776j6072N143j1902k0708J7695O66Q963R406j717j3565
$$ y = [15290, -12670, 9389, 16637, 24143, 50540, 40009, 42322, 57829, 70429, 43895, 24802, 12826, -17102, 14661, 49134, 36404, 1982, 2352, -13353, 9115, 4185, -19474, -25174, -33436, -27887, -8476, -7400, -9895, 5744, -13597, 6945, 18434, -10846, -38698, -45001, -52018, -60655, -19301, -4535, -12906, -50381, -50763, -43413, -44612, -33056, -36258, -35159, -30435, -45492, -72273, -63611, -62533, -40520, -25973, -60633, -59661, -52030, -22277, -35238, -48319, -14230, 16533, 29363, 14826, -6691, -27013, -39567, -24352, 782, -4293, 10105, 6519, -5137, -500, -9559, -11410, -15059, 22670, 35687, 18537, 33309, 23051, 6797, -6020, 2277, -9451, -27947, -13968, 7505, -4518, -192, 22976, 21200, 5128, 10271, -1631, -22339, -4644, -3978, 4985, 14391, 12674, -891]
9527h91j0397R592J7162J2345j9204j707n729l5713J5197M0231J5983m7526m1551
9514e2208k0557J5269n244j6487N847P143J5399K054K3846K5406O259O146J355
9501A4228l4585j9755j0362K6443L1538J7667L4815K8347j5013n8703m3367k6484
9489e5231J478l231k0118K4638K7119M6797K1165J0931j9872j3074j1975j7630
9477i003m531R72J2930p783l6316k0067K4254L8020J0003K546L491j5345k8471
9464b9300j4839k424p214J1012L4748j3841j2560O665J1423L006k0254m435n706
9451d3719R213R46k32K0671L0119j4029L361J3364k8533k4797j6656O512M225
9438c9555m380J906J3728K7287P678j7208j067n490r33J7011l520oj4958j5350
$$ y = [-891, -11288, -1696, 15466, 27811, 8607, 6900, 1171, -34542, -19345, 20886, 36869, -10657, -52208, -72765, -57496, -62740, -79227, -73380, -66237, -50838, -48784, -24938, 468, 6727, 12873, 14228, -20357, -40112, -50474, -24031, 7507, 25174, 59989, 88336, 73323, 14620, -28747, -55231, -53753, -56984, -77102, -52464, -25345, 21452, 42617, 53548, 33676, 20602, 8627, -9003, -13534, -12562, 368, -7415, -43731, -63798, -39544, -1524, 8479, 11025, 14516, -829, -29300, -44139, -46563, -53777, -42765, -8017, -21858, -34418, -27753, -16330, -13324, -33578, -38013, -43719, -34506, -33560, -33792, -13121, 16998, 2969, 6330, 19694, -8839, -33636, -50292, -43780, -39555, -43935, -42029, -28301, -1014, 6664, -10544, -11611, -17101, -18034, -1023, -4543, -4549, -19507, -34857]
9424c4857J233J4363J1356J9462J8549O180R028r565k2624l159k1889p491N168
9411a4246j7881Q866N4499K4992m8903k7616K8073R614k6920j8320J6798K7077
9399A6033L9704l135j6418k3565j4356k8696j5920n0J1523J5913J1994L1590j1316
9386A3301j7177j4093K2994P514j4360j5524k7215j3888J7559J5095K418l169
9374b6545J7062J9671j7116j0470m640j6166P073P940J6591J9058P802J735K7459
9361D9454Q726n280J5004l8370p233r706M835M916Q752J4894J6306q824o55O703
9347E9522j1231m0007k5659J4559k204j8500q677J8546J6598J4507Q981J530j2614
9334A5351l1629k3748L801n092L5718M2982J0562k1183l1243j4268j2025R126
$$ y = [-34857, -33624, -19261, -7905, 11557, 30106, 36286, 45314, 35749, 13125, 9966, -11923, -19414, -14246, -32127, -23261, 31238, 56230, 7327, -20289, 7784, 17398, -9522, -27842, -11044, 16033, 55737, 52602, 36184, 12619, -1737, -30433, -46353, -46403, -34880, -18967, -6973, 24617, 13301, -3876, -17969, 5025, 12539, -1821, -17345, -44560, -58448, -40889, -25794, -23376, -26545, -9483, 10188, -6928, -17398, -22038, -38204, -31131, -23191, -6600, 12458, 20260, 21995, 49454, 58180, 52900, 67904, 29534, 22301, 12595, 17430, 22346, 31098, 45992, 62298, 53474, 52819, 59522, 48291, 8284, -17375, -2816, -5020, -23520, -32197, -13651, 2947, 17454, 26435, 27965, 15351, -16278, -40026, -36225, -41317, -5599, 37383, 47945, 26762, -4481, -18749, -30774, -21648]
9322b1648J1502j3515k761L6774K3829j0001J8367J48j3718k2000K403O055n9764
9309d4329j0200K6082o95l974K2333L2889O552J7121O866j1403k9389j5602J570
9296b179Q426J0168O966o928j1608K598P123M92p968j7994K5289K4709m115M676
9282C9655p913J0518K7002N273j7086k0483n6136r365J6844J8425K0193K2656
9270D9583j5768l7544k2232j9805J2508K5843j797J8761O179Q488n539J7636K8862
9257F5175j0997k9667j2334j7441J1802k546J1667K6595P35m961j7218K991J4192
9244C7993O1269o569m241j5208j6256p38l2804O220L3596n009r797k4229k5488
9231a261j3132l038J6001K9504j8015O920J8704R540j1570J2141J5704l0694m4696
$$ y = [-21648, -10146, -23661, -26422, 10352, 34181, 24180, 42547, 42695, 28977, 6977, 9380, 15435, -44329, -54529, -28447, -29142, -33116, -10783, 22106, 28658, 45779, 52645, 41242, 11853, -3749, -2179, 6247, 16415, 23381, 16453, 4845, 7443, 14566, 15058, 7090, -10904, 14385, 39094, 34979, 39655, 31742, 42260, 69262, 74535, 57449, 36966, -19170, -28535, -11691, 6734, 26927, 49583, 33815, -3729, -25961, -45766, -33258, -7415, -9212, 9549, 15728, 24216, 18677, 36313, 65175, 54178, 24511, 12177, -5264, 6538, 3992, 15659, 42254, 42989, 38028, 20810, 23801, 37993, 99262, 92693, 88452, 73244, 56988, 56250, 23446, 29666, 63262, 58253, 48456, 24227, -1261, -14393, -17431, -1430, 28074, 10059, 16979, 35683, 45223, 33653, 45794, 61498, 30804, -13892]
9218a3892J0055L5009k8700n999n822K6857O331K0310O529J7445Q864j4453J382
9205F3916q284k0799Q469o508O752J751j069J1186L325j5970K834J621K5719k4230
9191D8713M1579J1223j8965Q061M4233J0475M794j3111p570J7717J3431Q345K152
9178A71077Q474K581J2226j9077k5216M2432m827n809J0675K9166K8681j786l2850
9165B15747l8654K2431K6847K5570J5493O201K2924N1053Q715k678O772L5812
9153C96233K3022J105L4881O3766L6306L6920o069J2641O1716R1407M3578L219
9141G98725M0781Q9660J03741P4906P8137Q4879Q5555J31881J32384J31318J19585
9130A871552J77978K13149K37206K56307K61977L04340L07740L26281L66109L62558
$$ y = [-13892, -3837, 31172, 2472, -3527, -9349, 17508, 23839, 44149, 50678, 68123, 76987, 62534, 63916, 55632, 34833, 43302, 36794, 43546, 45297, 44228, 55414, 58739, 42769, 45603, 47224, 72943, 48713, 90292, 101515, 82550, 90611, 134844, 145319, 150113, 137002, 129432, 147149, 160580, 168925, 171077, 179551, 182132, 194358, 175281, 150065, 192497, 187670, 181861, 192536, 221702, 250383, 248597, 215747, 177093, 199524, 226371, 251941, 267434, 273635, 296559, 347612, 356327, 353649, 360421, 396233, 419255, 420360, 455241, 519007, 555313, 592233, 586164, 598805, 660521, 751928, 795506, 798725, 839506, 929166, 1032907, 1107813, 1185950, 1270829, 1356384, 1488265, 1620649, 1751967, 1871552, 2049530, 2262679, 2499885, 2756192, 3018169, 3322509, 3630249, 3956530, 4322639, 4685197]
9120D685197M03720L41623K76083J53906R6149p205j47030k47626k97816l27441
9110D929560l52535l29196l27148l11179k82931k44819k07904k04975j80580k09221
9100B279072j72612j23169j19159j66048j28346j17065r8888r1995n6926m7205
9090A157659q1200p1764q7372o7513k8224l5123n2484p9634k6389k0230n5958
9079E51768l5805k9837p049J7002O555l1862m0867k9942N29j9499m8976l2720
9067B99297l040J969j9781m3235j8095K366J2877k0921q247K759P997j8247k4882
9054A70817q92k468k0478k8561J288j548L805J7902J4245j4397k620J0903j9270
9041A28726q596j5801j1912J8068J9100j4822m751J6481p569k3536K1639J3030
$$ y = [4685197, 5088917, 5430540, 5706623, 5860529, 5956678, 5949473, 5802443, 5554817, 5257001, 4929560, 4577025, 4247829, 3920681, 3609502, 3326571, 3081752, 2873848, 2668873, 2488293, 2279072, 2106460, 1983291, 1864132, 1698084, 1569738, 1452673, 1353785, 1261790, 1204864, 1157659, 1076459, 1004695, 917323, 849810, 821586, 786463, 733979, 654345, 627956, 607726, 551768, 515963, 486126, 479077, 496079, 502634, 470772, 429905, 399963, 400492, 380993, 332017, 299297, 296257, 298226, 278445, 235210, 217115, 219481, 232358, 211437, 203190, 205949, 213946, 195699, 170817, 169925, 167457, 146979, 118418, 119706, 118158, 121963, 139865, 154110, 139713, 137093, 147996, 128726, 120130, 104329, 92417, 110485, 129585, 114763, 110012, 126493, 118924, 95388, 117027, 130057]
9029A30057j4710l6790k0180n127q173J1169O520q821L169q294m850P42K09J2730
9015E7651J2191j436N967k6854J0763M0640O793j2330k3236j0790j744j4415o167
9002C7033j7804m675K6659J8174k9638j3160J8333r522p941q0j597L8384L8049
8989I2215j200k9122j5878o126l754J6149J8258P56p397k3684N498n566k0969
8976A9180r283J451j5583L346J0350J5064J7474R065k2296j8923J3364l579j8477
8963A153L15k02K7184J2667k2838R520K601J9744K6221q511k6670k8436j4707
8950a959j0556Q587J5122K5021K672L726R791J7137l946j7864j1787q338K116
8937B9722R774J4557j5336k6452N144j8049M674R229N754j7205j6615K1335J2985
$$ y = [130057, 115347, 78557, 58377, 53250, 45077, 56246, 62766, 53945, 57114, 48820, 43970, 44712, 44921, 57651, 69842, 68406, 74373, 47519, 58282, 98922, 105715, 93385, 70149, 59359, 57615, 43200, 37033, 19229, 14554, 41213, 59387, 29749, 16589, 34922, 25400, 17459, 17379, 15782, 54166, 92215, 91015, 61893, 46015, 39889, 36135, 52284, 70542, 71298, 63901, 40217, 45715, 40149, 19180, 9897, 11348, -4235, -889, 9461, 24525, 41999, 51064, 28768, 9845, 23209, 19630, 1153, 1468, 1266, 28450, 41117, 18279, 27799, 30400, 50144, 76365, 67854, 41184, 12748, -1959, -12515, -3928, 11194, 36215, 38887, 42613, 52404, 69541, 65595, 47731, 35944, 27606, 29722, 39496, 54053, 38717, 12265, 17409, -640, 4034, 13263, 19017, 1812, -14803, 6532, 19517]
8924A9517L975j573k2360R272O20k8680J1112j3079Q73J0887m881n816J636Q84
8910a7613Q609r612Q915J6119j3399k5862j056M2389K9540r035j7658M320j6942
8897a285k8593J8331L3640j5628j1295j7609j7077q637L7012N2819j0218k9881
8885A579L258J4259J7679k7813j2486J1388J1097j522K5859M060k2906m930R749
8872B9271n870K9224J4779l1081n68j0706k3529o165k2346j2134L3164k388M032
8859d317Q562K1884K5260M191m4065k0954J3702K7618j1296k2163P640J9107j3874
8846A1295q973k196m501M769K6259J0225j7002l113q699l724j3265K1453J2129
8833B4657j672l6682K64O126l1799j5486O236L6216M6846L0639K1245j76j6742
$$ y = [19517, 23492, 21919, -441, 8831, 9451, -19229, -8117, -21196, -20323, -9436, -14317, -20133, -18497, -17613, -9004, -18616, -9701, 6418, -6981, -32843, -33899, 8490, 38030, 28995, 11337, 15657, -1285, -29878, -11547, 22093, 6465, -4830, -22439, -39516, -48153, -11141, 41678, 31460, 1579, 4837, 19096, 36775, 8962, -3524, 7864, 18961, 17439, 43298, 47358, 24452, 19522, 29271, 23401, 52625, 67404, 36323, 35755, 25049, 1520, -4645, -26991, -39125, -5961, -8349, -4317, 4245, 26129, 51389, 55580, 11515, -9439, 4263, 31881, 20585, -1578, 6062, 25169, 11295, 2322, 126, -4375, 394, 26653, 36878, 19876, 16763, 8064, 4340, -8925, 12528, 24657, 22985, -13697, -13433, -7307, -39106, -54592, -48356, -12140, 34706, 65345, 86590, 86414, 69672]
8820F9672k1062j4091j3795k089M547q423K28j7459l2398l3482N009K8560K810
8807c1973R063M7765j9017j1732O8K344j0921P169J2048K0442ok2513k1025q165
8793b6453m21J3353K7968J3636J2134L255k5445j8217J8678p909l5281M239P5
8780b0388o310J0465R251r498R452K4494K4004j3107R392p258k2069K2464j3114
8767A7778j3366J761r939J4716J9973N412K115r52J7033R797M178j6679o280M185
8753D9732k8072j1031j1842k604K743k2092k396L4007J4468J1403j0471k8867
8741e022j1443O432J932J3992k3311j8902L239L7088N654j1139L2441j0113l4823
8728a3975j3497J408J692J1672k4699j6657K5580K6135K4650M448J6731o085k8156
$$ y = [69672, 48610, 34519, 20724, 18635, 23182, 14759, 14987, -2472, -34870, -68352, -63343, -34783, -31973, -22910, 24855, 5838, -5894, -5826, -3482, -14403, -7234, 4814, 25256, 25250, 2737, -18288, -26453, -26874, -13521, 14447, 28083, 40217, 43472, 18027, -190, 18488, 10579, -24702, -20463, -20388, -26698, -16233, -6982, -16480, -7028, 17466, 41470, 28363, 37755, 30497, 8428, 30892, 17778, 4412, 6173, -3766, 10950, 30923, 36335, 38450, 37498, 54531, 64328, 68506, 51827, 45547, 49732, 21660, 10629, -1213, -3817, -1074, -23166, -25562, 8445, 22913, 34316, 23845, -5022, -16465, -10033, -8101, 5891, -17420, -36322, -33083, 4005, 9659, -1480, 30961, 20848, -13975, -27472, -26064, -24372, -12700, -37399, -54056, -28476, -2341, 22309, 26757, 43488, 37403, 9247]
8715I247J5570J2793L0361N677n3876k6023r689k5355K5220L1689r346Q830o267
8702H831j9114j200n188j2273k2594m7M5786K2606k2128r581p352k0659O637P058
8688b9218j0523j349J6032J1423Q222j4383K6765L778j0215k3487j4873J0140
8676b7688K1590J2781O403r170P772J1124j4619j0960k5430j8158J7783K2901
8664e671l658j3700K5763J5070k3085R936M174k614L4199J7490q482l0098k8432
8651i108K1304L474j3268R197l3562O973K0382K8795j5162m699J3415M593l5537
8638c203p423K5750K6119N181K4187k2207l4121q669J7518M0572j1153J1725K8717
8625I2993m032j8489k8884j591P701n6005l9654L7M3520K8061j9390J3371K1989
$$ y = [9247, 24817, 37610, 67971, 73648, 19772, -6251, -15940, -41295, -16075, 15614, 6268, 15098, 8831, -10283, -11483, -16671, -28944, -51538, -51585, -5799, 16807, -5321, -14902, -22254, -42913, -36276, -29218, -39741, -41090, -25058, -13635, -5413, -19796, 6969, 10747, 532, -22955, -37828, -27688, -6098, 6683, 13086, 3916, 11688, 22812, 8193, -2767, -28197, -46355, -28572, -5671, -9329, -23029, 2734, 17804, -5281, 4655, 8829, 6215, 40414, 57904, 49422, 19324, -9108, 12196, 15670, 2402, 11599, -21963, -14990, 5392, 34187, 19025, 14326, 27741, 32334, -3203, -10626, 15124, 41243, 46424, 70611, 48404, 14283, 5614, 23132, 63704, 52551, 64276, 92993, 88961, 70472, 41588, 39997, 47698, -8307, -47961, -47924, -4404, 23657, 4267, 17638, 39627]
8612C9627R921p650l2181k6662J2335L0802J2829j9252n120L420J7850J9144L915
8599E8978q371j1834j1429j8925J0551l994l42j2507j343L451q863k186L5627
8586B8813N288r746R374m865l5937N13M4726L9356n011k7644m5931q010J2475
8573C401J9014O603K7171j6959o320o884J3761j3920l1114J2581j2031m5358l4711
8560h4766L498M5846K8936P619k3628J6533K4244l6305O167L6744J8672j677l2053
8547I830k7096j6608N386J6379k188J9925J8435Q473j9935j4420N024m701j4704
8534a6200j5013L728k807J6163N987J7226K625j6125k3347L482M345j277k634
8521b3847O21O469K4454P148k9788m856l082l252K8064p667l1616L3985K5008
$$ y = [39627, 49548, 41898, 9717, -16945, -4610, 26192, 39021, 19769, 14649, 18069, 35919, 55063, 58978, 50607, 38773, 27344, 8419, 18970, 14976, 14634, 2127, 784, 4235, -4628, -6814, 28813, 34101, 24355, 33729, 28864, -7073, -6560, 38166, 77522, 72511, 44867, -1064, -9074, 3401, 22415, 29018, 56189, 39230, 32910, 26026, 39787, 25867, -5247, 7334, -4697, -50055, -84766, -81268, -35422, -6486, 1133, -22495, -5962, 18282, -18023, -11856, 24888, 43560, 41883, 9830, -17266, -33874, -28488, -12109, -14297, 5628, 24063, 32536, 12601, -1819, 3205, -1496, -16200, -31213, -27485, -30292, -14129, -8142, 9084, 11709, -4416, -27763, -24281, -19936, -21213, -23847, -23226, -16757, 7697, 14845, -14943, -19799, -22881, -26133, 1931, -5736, -37352, -3367, 21641]
8508B1641J3267J3606j8136l2363J1786L5301o049k3846Q657J6961J4670r082
8496D6413j0849j7480J809j5323l4105j5549K1377q913j8480P561q617M428K4701
8483b3027N215K5348K333m625k728R477J3845o207m621k4101j0448K1211L1125
8470C2797M524k0110K1525r800j5960J7624L163l0964L3211J4482j6375m17j1316
8457B2384k7643m078P066J6460L5711K2604K4168j6434l8750k2043J877k9938
8445h616j1476N050l056k4962j4082J2449L3089l6K703j8061J8158J1116j3277
8432a1001K2942j4212J9676K0690k8342N384j021l0625K3046K8277J6830j6975
8420C4669m6102l9983Q101J7183j2017Q261J5047j6005N094o037R856q918N046
$$ y = [21641, 34908, 48514, 30378, -1985, 9801, 45102, 39053, 15207, 23864, 40825, 55495, 46413, 35564, 18084, 19893, 4570, -29535, -45084, -23707, -32620, -51100, -43539, -52156, -47728, -23027, -17812, 7536, 9869, 5244, 2516, 11993, 25838, 19631, 15010, -9091, -19539, 1672, 32797, 37321, 17211, 38736, 28936, 12976, 30600, 33763, 2799, 36010, 50492, 34117, 33700, 22384, -5259, -9337, -2271, 14189, 49900, 72504, 96672, 80238, 41488, 19445, 21322, -8616, -20092, -15042, -18098, -43060, -57142, -44693, -11604, -11640, -8937, -26998, -8840, 2276, -11001, 11941, -2271, 17405, 38095, 9753, 15137, 14116, -16509, 6537, 34814, 51644, 34669, -11433, -51416, -43315, -26132, -38149, -29888, -14841, -30846, -25752, -31789, -21933, -30851, -25805]
8407b5805M8976K0920l4375l0671q178J382J5220j0181K3205k543O278j2071J5668
8394G825P29P981m280j2005j5685l7019J9395K6618m496j761L423K4706j7104
8381a673k410j2197j093J0605q389n631J7205L3800m794l2863l5870O66J8552
8368b4092L0724J6725j9690l5628l0832k7423J8736J9478Q615K1436M2117J0100
8356C0266J7189k7118j2418o131J0259M206J5606q393K8238K0733j0892m3791
8344A7754q985M719J7228K3267K0888j8468j3493r584k1692r302J3867m143N185
8331A7241p316N345l129l010J2928k3723k6425L647L5283o207M119J8724o158
8318B1319j9879p266n025K5908k4952l1718O133K3806J6140J8216j9356p716k4
$$ y = [-25805, 23171, 44091, 9716, -20955, -29133, -27751, -12531, -22712, 493, -2050, 4228, -7843, 7825, 8554, 16535, 12255, 250, -15435, -52454, -33059, -6441, -10937, -12698, -9275, 15431, -1673, -4083, -16280, -17373, -6768, -15157, -20788, -3583, 30217, 25423, -7440, -43310, -42644, -24092, 6632, 23357, 3667, -31961, -62793, -90216, -71480, -52002, -43387, -21951, 20166, 30266, 47455, 20337, 7919, 1788, 12047, 16253, 31859, 23466, 51704, 72437, 61545, 17754, 8769, 13488, 30716, 53983, 74871, 56403, 42910, 33326, 11634, 2332, 16199, 12056, 17241, 9925, 15270, 12141, 9131, 22059, -1664, -28089, -24442, 10841, 4634, 8753, 27477, 21319, 1440, -5826, -10851, 15057, -9895, -41613, -35480, -11674, 4466, 22682, 3326, -4390, -4414]
8305d414J3776J2553K2886j3105l1929k1797k9280K1665q330J6953J2232N167
8293c623j0081J8951J1005j9561k8763J4897o938K0695O130M291N576l5486k9985
8280e2892R274n268M3916J0482J3340K0107M932r156j5299j7827k9817p646J9120
8267a6734p507k1370J2339O337M0882o12J295k6978O573M4048m44j0448k3479
8254C902k0815j239j5386l5504K1956K7816p509O952L395L416k2702K9873L1869
8241B6024j3401l4792K2458L0123K3389k7759m7492L8323J0882m8619j4558N936
8229b9486L6978j1889k0606J0607j2558k5635l780J9037K065K2141K1534q787
8217c79J1884J1919l412k2199l0348J5214K3075j7636l336m698J7727j4083n693
$$ y = [-4414, 9362, 21915, 44801, 31696, -233, -22030, -51310, -29645, -37975, -21022, -8790, -3623, -13704, 5247, 16252, -3309, -32072, -17175, -24113, -3418, 2712, 7003, 12579, -22907, -52892, -43618, -48886, -4970, 5512, 18852, 38959, 43891, 34735, 19436, 1609, -28208, -35854, -16734, -24241, -45611, -33272, -26935, 13947, 13335, 14630, -12348, -5775, 38273, 37829, 27381, 3902, -16913, -18152, -33538, -69042, -47086, -19270, -26779, -19827, -16432, -13016, -35718, -5845, 26024, 12623, -22169, 289, 30412, 53801, 26042, -21450, 16873, 27755, -20864, -35422, -29486, 7492, -4397, -25003, -14396, -26954, -52589, -56369, -37332, -35267, -13126, 8408, -379, 11505, 23424, 20012, -2187, -32535, -17321, 5754, -11882, -15218, -19916, -2189, -16272, -21965]
8204b1965K855k1632K0143J8601O70o46j0654l566J797p057q712M077J2554r17
8190a4452J4969J6201N312n548m168O71k6720k5973Q460J624K0495j710l7055
8177d7894R927K4176J3526k0282j1647L1486K6102J5498O314j8050K0010j4898
8165C4268k4503O971n495j2990o474J71q440k4444J4180N981O311K2002J3364
8152B0902J1865P780j9062l916J6671k4253j6486p284j7630j94K3205J7970L835
8139A3403k1517k3505P974j967r545P93K5473J1365k5167j5000P006J6560o457
8126b0584O997J0166o822M302O390J0889l889m2527j7504J4383J8662K2653j3036
8113i920N042k612J4389R042j8327O75J5392J2067M115k0244j6593M322L743j8946
$$ y = [-21965, -19110, -40742, -20599, -1998, -1328, -1974, -12628, -16194, -14397, -21454, -30166, -26089, -13535, -14452, 517, 16718, 22030, 16482, 12314, 12985, -13735, -39708, -31248, -29624, -9129, -10839, -47894, -37967, -13791, -265, -20547, -32194, -708, 25394, 40892, 47206, 29156, 49166, 34268, 9765, 16736, 11241, -1749, -8223, -8052, -16492, -40936, -26756, -20775, -14464, 7538, 20902, 32767, 40547, 21485, 17569, 34240, 9987, -6499, -13783, -31413, -31607, -8402, 9568, 13403, -8114, -31619, -23645, -25612, -35157, -34364, -8891, 2474, -22693, -37693, -30687, -14127, -20584, -13587, -3421, -10243, -5941, 449, 11338, 7449, -35078, -52582, -38199, -19537, 3116, -9920, -4878, -7490, 6899, 15941, -2386, -1711, 13681, 25748, 29863, 9619, -6974, -2652, 1091, -17855]
8099a7855j1222L2730K7710o816k4156J4411L2115k0540j7221j0659j9151q726
8087b9380O921J2264J8992J6218K664p591k7473J1705k543j7609P87l597Q888
8074i754K2397m328r274j2265J2439R17k758k240L7146J1111l9805j6268J8725
8061F043k9530m4394N09J8631L5311K3942l2950L836K8082K9873P569r181j2269
8048B5472K4083k451R207j4872k7845J868j0129l124J0737j2633j3631R936K0604
8035A7222J336j0564J6631j3193j0575P879j6588q103K0991K0135K694p376P505
8022B7994K2444k1539n433j178j2851n93J3109M4985J9562k1183j5128m684L032
8009D8537L0591J5945p252k9684q450M339M7004M351j0665L181N273K1038l010
$$ y = [-17855, -29077, 3653, 31363, 24547, 391, 14802, 46917, 26377, 9156, -1503, -20654, -29380, -22459, -10195, 8797, 25015, 27679, 20088, -7385, 4320, 1777, -15832, -15045, -18642, -9754, 12643, 8315, -959, -13224, -785, 132, -2626, -4866, 32280, 43391, 3586, -12682, 6043, -23487, -67881, -67372, -48741, -13430, 10512, -22438, -18602, 9480, 39353, 46922, 37741, 25472, 49555, 47104, 56311, 41439, 13594, 15462, 5333, 2209, 12946, 313, -13318, -3382, 17222, 18558, 7994, 24625, 11432, 857, 8736, -7852, -15955, 5036, 25171, 27865, 20489, 27994, 50438, 28899, 23466, 22288, 9437, 8844, 21953, 66938, 86500, 65317, 50189, 45505, 48537, 79128, 95073, 87821, 58137, 49687, 54026, 101030, 105381, 94716, 97897, 103170, 124208, 121198]
7996A21198o604k4990m3415k0727p298j5944o043L1033m320J2011K5337n424k176
7983E2638l6203j069k433J1695o726l2151K493l838j046L0986K2196J1426q180
7970C9788J9168K0882J2154r601o814l7925j9188j657K2810Q502k7465J6371q576
7957B8449N238j9633J2287r72r714j1907q985j1804J4837R220K67J1151J0777
7944B9211O754J704m191j7556Q113J985L935o95J4270j9274j4786K9750j488o917
7930C0815j6059J2668P761N55j6041j4938Q293K0135j2562l392j5271j7250j7537
7917c2823J7917K1568j6609m787L0162J0782L499J7036k8711k3287J7922J8281
7905C0950Q806j362k0875J3507J0715L840m343j9743j4150j5096L6836J2937k0398
$$ y = [121198, 114594, 89604, 46189, 25462, 18164, 2220, -3823, 27210, 22890, 34901, 60238, 54814, 52638, 16435, 15366, 12933, 24628, 17902, -14249, -11756, -15594, -16640, 14346, 36542, 47968, 39788, 58956, 79838, 91992, 82391, 75577, 37652, 18464, 16807, 39617, 48119, 20654, 37025, 28449, 33687, 14054, 26341, 25369, 15655, 3748, -5237, -17041, -2204, 7016, 7283, 18434, 29211, 35965, 37669, 33478, 15922, 24035, 26020, 29955, 29260, 43530, 24256, 9470, 39220, 37732, 30815, 14756, 27424, 35185, 35740, 19699, 4761, 13054, 33189, 20627, 17235, 1964, -15286, -32823, -14906, 6662, -9947, -14734, 15428, 26210, 29709, 46745, 18034, -5253, 12669, 30950, 39756, 38394, 17519, 31026, 41741, 45581, 41238, 21495, 7345, -7751, 29085, 42022, 21624]
7892B1624J01K050J3813l3010l332J3816N786q721J1842K6029J2070j6240k8798
7879A7030L830K0555k3183l2452j556L0421J1051n527K2230l350r492j9961j4523
7866d927P671p292j2303K0110J3892o810q719l848N307J1838j3579K3O277N038
7852A2678J327m892m4469j8695K7781J4217J2733K7746J0742r915j3310l996m5139
7839c3192l2089K0776K1697k58k195Q668L6102L1536J0003j3959k4785j7927j3218
7826h841j0617j3346j4587M822N967L087J8472l6025l60O320J2330L8459q833
7813c152j7813k2466p003k093J8618K178l387K289N77J5752L143N290k7190Q541
7799b6716L4861K57l087p62L278p510j7580N184L4650J8215j7526k5409k086Q526
$$ y = [21624, 21725, 23775, 37588, 4578, 1246, 15062, 20848, 12127, 23969, 49998, 62068, 45828, 17030, 20860, 41415, 18232, -14220, -15776, 14645, 25696, 20169, 42399, 39049, 29557, 9596, -4927, 2744, -4548, -16851, 3259, 17151, 10341, 1622, -2226, 3081, 14919, 1340, 1363, 7640, 12678, 14005, 9113, -35356, -54051, -26270, -12053, 680, 28426, 39168, 29253, 15943, 11947, -33192, -65281, -44505, -22808, -23066, -25261, -16593, 19509, 51045, 61048, 47089, 22304, 4377, -8841, -19458, -32804, -47391, -42569, -36602, -33515, -15043, -51068, -51428, -45108, -32778, 5681, -3152, -20965, -43431, -50434, -52527, -33909, -31731, -35118, -32829, -32252, -16500, -13357, -8067, -35257, -26716, 8145, 8402, 5315, 4553, 7831, 321, -17259, -12075, 22575, 40790, 23264, -2145, -4231, 4295]
7785D295r439J0674J009r87K766J0020l286k1736J742J5829o439o629j3178j8601
7771c3960o768r161j4433O038K0389L4838N646o029J9828o65j5353q76K8309J3263
7757D1066k8398l2166J5025J0291J1907J463j039k1934j4040m332k0817m923J6490
7744c1407L4846M422j5454r697m847O646K0533J2139n308j9298J4064p933m2473
7731d3767J3786J3982K4931m538n968J6813R704l1960j4459K7989J2049P532O112
7718C2206l45j0410R435j5109j3242k0599N526J1904R665N360k41k9558M713J4932
7704D237J1470J1313j2402k63n858J1099J7491j7982k5858k9585j2149m46O412
7691d2521K185M1026p661j1077K383N215j011N430m316J3240m159r750j0517K3290
$$ y = [4295, -5144, 5530, 6539, 5552, 8318, 18338, 15052, -6684, -4942, 10887, 4448, -2181, -15359, -33960, -40728, -49889, -64322, -58284, -37895, -3057, 2589, -3440, 16388, 15723, 370, -506, 27803, 41066, 12668, -19498, -4473, 5818, 17725, 19188, 18149, -3785, -17825, -22157, -42974, -47897, -31407, 3439, 7861, -7593, -17290, -22137, -15491, 5042, 17181, 11873, -7425, 6639, -1294, -43767, -29981, -15999, 8932, 4394, -1574, 15239, 24943, -7017, -21476, 6513, 18562, 26094, 32206, 31861, 21451, 30886, 15777, 2535, -18064, -12538, -634, 9031, 14391, 14150, -15408, -10695, 4237, 15707, 27020, 14618, 14355, 8497, 19596, 37087, 19105, -6753, -36338, -48487, -48933, -42521, -40336, 690, -6971, -18048, -15665, -10450, -11461, -6031, -10347, 2893, -1266, -11016, -21533, 1757]
7677A757n613j7476P264J3556m010J1449J4433l0804l378k0623m302j507l652
7664d2906R913J9543P06N723o480J739J0882j7426r719n749K8031P250M783j1041
7650d751N541P510l7780k1189Q208K4343Q745N451M291q70J050k8068k6233J3849
7636c9903K8371P844n046j0225o500K3890K0385j0545n20j6916j8186m056K967
7623b8440J6411K8723Q879l6625J812j3158L47p626j9073j4345r78K4991K9977
7610i105J0586M873O57l848M328K3625j9647J4586N102l1408j5963j7290J7688
7597a5816L1029j9179k2669R887L356j6826n144p314k4889K3250K3625M2502j246
7584B0566k6867j5355J5666J4634M1151j520p080M74P084R329l4958n7288L148
$$ y = [1757, -3856, -21332, -14068, -512, -4522, 6927, 21360, -9444, -12822, -33445, -37747, -39254, -42906, -32993, -13450, -12744, -7021, -13501, -11762, -880, -18306, -28025, -33774, -5743, 1507, 6290, -4751, 790, 8300, -29480, -50669, -42461, -18118, -9373, -3922, 369, -501, 549, -27519, -53752, -39903, -11532, -3688, -8734, -18959, -25459, -1569, 18816, 8271, 7751, -9165, -27351, -31407, -28440, -12029, 16694, 25573, -11052, -9240, -22398, -22051, -29677, -48750, -63095, -64073, -39082, -9105, 1481, 6354, 7011, 3163, 7491, 31116, 11469, 26055, 31157, -251, -16214, -33504, -15816, 15213, -3966, -26635, -16748, -13392, -30218, -35362, -42676, -67565, -44315, -20690, 21812, 20566, -6301, -21656, -5990, 8644, 49795, 48275, 41195, 41669, 48753, 58082, 23124, -34164, -31016]
7571c1016J0553k6730k665O5053P836N437K820J1070r064n630K848j072J71k228
7557B7383k864J1289l6526n794k377l1017r962L8652J8166p023l5968j838J6146
7544b1733J0122M647j4634j3957J2270K3411K0684M157j8768J5976J2103j1449
7532B2829j9048K8001p906k1394N160r177o28K9849K461o207j1652j5385k681
7519e778l364k0920o595O021r6M8033K4564j6802j2436j0492j2334j463j8423
7506c0085l0642M4512J7577p921k567K674L0429J8512j5031r539k9507L764P118
$$ y = [-31016, -20463, -47193, -49858, 15195, 23031, 28468, 31288, 42358, 33294, 27664, 30512, 29440, 29611, 27383, 24519, 35808, -718, -6512, -8889, -39906, -49868, -11216, 6950, -73, -36041, -37879, -21733, -11611, -6964, -21598, -35555, -23285, 126, 20810, 24967, 6199, 22175, 34278, 22829, 3781, 31782, 23876, 2482, 7642, -1535, -2163, 27686, 30147, 23940, 12288, -3097, -5778, -9142, -30062, -36657, -30636, -30732, 17301, 41865, 25063, 12627, 2135, -10199, -11662, -30085, -60727, -16215, 1362, -6559, -9126, -6452, 23977, 42489, 27458, 17919, -11588, -7824, -706]
$$ [...]
##END NTUPLES=NMR SPECTRUM
##END=
