##TITLE=Analysis number 315958
Compound Code tl 00418
Project Code adrs
Chemist Name melford
##JCAMPDX= 6.0         $$ Bruker NMR JCAMP-DX V2.0
##DATA TYPE= NMR SPECTRUM
##DATA CLASS= NTUPLES
##ORIGIN= Bruker BioSpin GmbH
##OWNER= NMR
$$ XWIN-NMR		Version 3.5
$$ Tue Dec 13 07:45:18 2005 GMT Standard Time (UT+0h)  MAYBRIDGE\NMR@NMR_250MHZ
##.OBSERVE FREQUENCY= 250.131544655141
##.OBSERVE NUCLEUS= ^1H
##.ACQUISITION MODE= SIMULTANEOUS (DQD)
##.ACQUISITION SCHEME= undefined
##.AVERAGES= 16
##.DIGITISER RES= 18
##SPECTROMETER/DATA SYSTEM= dpx250
##.PULSE SEQUENCE= zg30
##.SOLVENT NAME= CDCl3
##.SHIFT REFERENCE= (INTERNAL, CDCl3, 0, 16.522)
##AUDIT TRAIL= $$ (NUMBER, WHEN, WHO, WHERE, WHAT)
$$ ##TITLE= Audit trail, XWIN-NMR		Version 3.5
$$ ##JCAMPDX= 5.01
$$ ##ORIGIN= Bruker BioSpin GmbH
$$ ##OWNER= NMR
$$ C:\u/data/dgb/nmr/ADRS/13740/pdata/1/auditp.txt
$$ ##AUDIT TRAIL=  $$ (NUMBER, WHEN, WHO, WHERE, WHAT)
(   1,<2005-12-13 07:44:49.45 +000>,<MAYBRIDGE\NMR>,<NMR_250MHZ>,
      <created by zg, POWCHK disabled, PULCHK disabled
       configuration hash MD5:
       62 19 C7 07 E1 42 D1 B7 37 6C 3D D0 77 39 F9 E6
       data hash MD5: 64K
       4A D2 BC 4D 50 ED 42 22 9C A4 85 10 2F 96 00 93>)
(   2,<2005-12-13 07:45:07.62 +000>,<MAYBRIDGE\NMR>,<NMR_250MHZ>,
      <Start of raw data processing
       ef LB = 0.3 FT_mod = 6 PKNL = 1 SI = 32K 
       data hash MD5: 32K
       2C DE AC 57 E2 F4 6B 2B 33 F3 74 85 C5 B1 21 D1>)
(   3,<2005-12-13 07:45:09.95 +000>,<MAYBRIDGE\NMR>,<NMR_250MHZ>,
      <apk 
       data hash MD5: 32K
       4C 3B 69 B8 AD E3 41 33 21 D8 C2 E6 A5 71 8A 40>)
(   4,<2005-12-13 07:45:10.70 +000>,<MAYBRIDGE\NMR>,<NMR_250MHZ>,
      <abs ABSG = 5 
       data hash MD5: 32K
       04 90 49 13 84 64 DC 21 2E E1 95 81 CA 96 D4 6C>)
$$ ##END=
$$ 
$$ hash MD5
$$ B5 23 E9 78 94 06 B4 6F DB C6 19 5F 03 8F 13 1D
##$RELAX= 
##$RELAX= 
##$RELAX= 
##$RELAX= 
##$RELAX= 
##$RELAX= 
##$RELAX= 
$$ Bruker specific parameters
$$ --------------------------
##$DU= <C:\u>
##$EXPNO= 13740
##$NAME= <ADRS>
##$PROCNO= 1
##$TYPE= <nmr>
##$USER= <dgb>
##$AMP= (0..31)
100 100 100 100 100 100 100 100 100 100 100 100 100 100 100 100 100 100 
100 100 100 100 100 100 100 100 100 100 100 100 100 100 
##$AQSEQ= 0
##$AQ_mod= 3
##$AUNM= <au_zg>
##$AUTOPOS= <2 >
##$BF1= 250.13
##$BF2= 250.13
##$BF3= 250.13
##$BF4= 250.13
##$BF5= 500.13
##$BF6= 500.13
##$BF7= 500.13
##$BF8= 500.13
##$BYTORDA= 1
##$CFDGTYP= 0
##$CFRGTYP= 5
##$CHEMSTR= <none>
##$CNST= (0..31)
1 1 145 1 1 1 1 1 1 1 1 1 1 1 1 1 1 1 1 1 1 1 1 1 1 1 1 1 1 1 1 1 
##$CPDPRG= <>
##$CPDPRG1= <>
##$CPDPRG2= <>
##$CPDPRG3= <>
##$CPDPRG4= <mlev>
##$CPDPRG5= <mlev>
##$CPDPRG6= <mlev>
##$CPDPRG7= <mlev>
##$CPDPRG8= <mlev>
##$CPDPRGB= <>
##$CPDPRGT= <>
##$D= (0..31)
0 1 0 0 0 0 0 0 0 0.06 0 0 0 0 0 0 0.0002 0 0 0 0 0 0 0 0 0 0 0 0 0 0 
0 
##$DATE= 1134459888
##$DBL= (0..7)
120 120 120 120 120 120 120 120 
##$DBP= (0..7)
150 150 150 150 150 150 150 150 
##$DBP07= 0
##$DBPNAM0= <>
##$DBPNAM1= <>
##$DBPNAM2= <>
$$ [...]
##$SUBNAM7= <"">
##$SUBNAM8= <"">
##$SUBNAM9= <"">
##$SW= 20.6930455092707
##$SWIBOX= (0..15)
0 0 3 0 0 0 0 0 0 0 0 0 0 0 0 0 
##$SW_h= 5175.983436853
##$TD= 65536
##$TD0= 1
##$TE= 292.16
##$TE2= 300
##$TE3= 300
##$TEG= 300
##$TL= (0..7)
0 120 120 120 120 120 120 120 
##$TP= (0..7)
150 150 150 150 150 150 150 150 
##$TP07= 0
##$TPNAME0= <>
##$TPNAME1= <>
##$TPNAME2= <>
##$TPNAME3= <>
##$TPNAME4= <>
##$TPNAME5= <>
##$TPNAME6= <>
##$TPNAME7= <>
##$TPOAL= (0..7)
0.5 0.5 0.5 0.5 0.5 0.5 0.5 0.5 
##$TPOFFS= (0..7)
0 0 0 0 0 0 0 0 
##$TUNHIN= 0
##$TUNHOUT= 0
##$TUNXOUT= 0
##$USERA1= <user>
##$USERA2= <user>
##$USERA3= <user>
##$USERA4= <user>
##$USERA5= <user>
##$V9= 5
##$VALIST= <valist>
##$VCLIST= <CCCCCCCCCCCCCCC>
##$VD= 0
##$VDLIST= <DDDDDDDDDDDDDDD>
##$VPLIST= <PPPPPPPPPPPPPPP>
##$VTLIST= <TTTTTTTTTTTTTTT>
##$WBST= 1024
##$WBSW= 4
##$XGAIN= (0..3)
0 0 0 0 
##$XL= 0
##$YL= 0
##$YMAX_a= 492077
##$YMIN_a= -582714
##$ZGOPTNS= <>
##$ZL1= 120
##$ZL2= 120
##$ZL3= 120
##$ZL4= 120
##$ABSF1= 16.522
##$ABSF2= -4.171173
##$ABSG= 5
##$ABSL= 3
##$ALPHA= 0
##$AQORDER= 0
##$ASSFAC= 0
##$ASSFACI= 0
##$ASSFACX= 0
##$ASSWID= 0
##$AUNMP= <proc_1d>
##$AZFE= 0.1
##$AZFW= 0.1
##$BCFW= 0
##$BC_mod= 0
##$BYTORDP= 0
##$COROFFS= 0
##$CY= 12.5
##$DATMOD= 1
##$DC= 0
##$DFILT= <>
##$DTYPP= 0
##$F1P= 14.0000005364418
##$F2P= -0.99999901652339
##$FCOR= 0.5
##$FTSIZE= 32768
##$FT_mod= 6
##$GAMMA= 0
##$GB= 0
##$INTBC= 1
##$INTSCL= 1
##$ISEN= 128
##$LB= 0.3
##$LEV0= 0
##$LPBIN= 0
##$MAXI= 10000
##$MC2= 0
##$MEAN= 0
##$ME_mod= 0
##$MI= 0
##$NCOEF= 0
##$NC_proc= -3
##$NLEV= 6
##$NOISF1= 0
##$NOISF2= 0
##$NSP= 0
##$NTH_PI= 0
##$NZP= 0
##$OFFSET= 16.522
##$PC= 1
##$PHC0= 102.9211
##$PHC1= -29.73252
##$PH_mod= 1
##$PKNL= yes
##$PPARMOD= 0
##$PSCAL= 4
##$PSIGN= 0
##$REVERSE= no
##$SF= 250.13
##$SI= 32768
##$SIGF1= 0
##$SIGF2= 0
##$SINO= 400
##$SIOLD= 32768
##$SREGLST= <1H.CDCl3>
##$SSB= 0
##$STSI= 32768
##$STSR= 0
##$SW_p= 5175.98343685301
##$SYMM= 0
##$S_DEV= 0
##$TDeff= 65536
##$TDoff= 0
##$TI= <Analysis number 999999
Compound Code 99
Book Reference 9
Project Code 9>
##$TILT= no
##$TM1= 0
##$TM2= 0
##$TOPLEV= 0
##$USERP1= <user>
##$USERP2= <user>
##$USERP3= <user>
##$USERP4= <user>
##$USERP5= <user>
##$WDW= 1
##$XDIM= 32768
##$YMAX_p= 446596389
##$YMIN_p= -120812
$$ End of Bruker specific parameters
$$ ---------------------------------
##NTUPLES= NMR SPECTRUM
##VAR_NAME=  FREQUENCY,     SPECTRUM/REAL,   SPECTRUM/IMAG
##SYMBOL=    X,             R,               I
##VAR_TYPE=  INDEPENDENT,   DEPENDENT,       DEPENDENT
##VAR_FORM=  AFFN,          ASDF,            ASDF
##VAR_DIM=   32768,         32768,           32768
##UNITS=     HZ,            ARBITRARY UNITS, ARBITRARY UNITS
##FACTOR=    0.157963299565203, 1,           1
##FIRST=     4132.6476996994, 0,             0
##LAST=      -1043.33573715361, 0,           0
##MIN=       -1043.33573715361, -120812,     0
##MAX=       4132.6476996994, 446596389,     0
$$ Real data points
##PAGE= N=1
##DATA TABLE= (X++(R..R)), XYDATA
$$ [...]
24576A658q48j0346j8407k543M655K4180K081j3444M508Q780J6145N615J3388
24563C5422j6552k5122K6642K3260q235k9617j8394j2062m854q095P089k896k757
24550c6171M605J0512J3158k2769l045J0191J9907K1949K1689o767m856k6404
24538A999j9384K1701J7094J7886m632j9528j3290k383J991l448o530L509q65
24525e880M759K4355j2006l1382J778J6425J9862P064o979m593k2510j9585l697
24512c2389J6279J8480L0906j3949k7767m012j1719Q279J9535O706j5544k0977
24500b6172m879O094J874K2796p255j3685n959K3074L2891J5920J3735j7618k6393
24487A4423j6020j3132o451j290J5508n027j8671K0460K0084L993P674m445j1933
$$ y = [1658, 810, -9536, -27943, -30486, -25831, -1651, 430, -13014, -8506, 274, 16419, 22034, 35422, 18870, -6252, 20390, 43650, 35415, 5798, -12596, -24658, -29512, -37607, -30518, -33414, -36171, -31566, -21054, -7896, -30665, -33710, -23519, -3612, 18337, 40026, 33259, 28403, 1999, -17385, 4316, 21410, 39296, 34664, 15136, 1846, -537, 1454, -1994, -8524, -5015, -5880, -1121, 23234, 11228, -20154, -18376, -1951, 17911, 24975, 17996, 13403, -9107, -28692, -32389, -16110, 2370, 33276, 19327, -8440, -12452, -24171, -15892, 3643, 10349, -5195, -26172, -31051, -24957, -23083, -287, -7542, -21227, -27186, -4112, 28779, 44699, 58434, 40816, 14423, -1597, -14729, -21180, -22470, -6962, -11989, -30660, -10200, 9884, 13877, 21551, 17106, 5173]
24474E173j6229p173p106J0141N984K4590r472k0040j8001K5245L1853J7400l895
24461C8470l5577l533K3141j048j3639l5610k4325n99J5485J8735k789J8259J5254
24448A2224k3498k0872J2302o940k1899k292K4014K2986p928J5133K2161P235
24436C2626l458n241n233j1842j6618j8171j3921L45K2144j7567r717J5925O874
24423b3854j164k713n876J7850q764J4751J6938J4101k0742r538J0519K869j8759
24410a4382P202J4178J1367P90k7303l0101J3399L4041J5585M288j4508j1482
24398C074J6619k7291j1818J1641P68K112J0312k800j4884l5123j4029J7317J3537
24385c0565p792R711K9428l903L8757N859N728j0513l3688p193J3097j5444k843
$$ y = [5173, -11056, -18229, -25335, -15194, -9210, 15380, 5908, -14132, -32133, -6888, 24965, 42365, 38470, 2893, -640, 22501, 21453, 7814, -27796, -52121, -52720, -37235, -18500, -21289, -3030, 12224, -11274, -32146, -19844, -26784, -48683, -50975, -26961, -3975, -11903, 3230, 25391, 32626, 29168, 23927, 18694, 6852, -9766, -27937, -41858, -41513, -19369, -36936, -46653, -30728, -23854, -25018, -27731, -33607, -15757, -24521, -9770, 7168, 21269, 527, -9011, 1508, 4377, -14382, -7180, 6998, 18365, 19155, -8148, -38249, -24850, 9191, 24776, 29064, 14556, 3074, 19693, -7598, -19416, -7775, -7007, -4895, 5417, 2617, -12267, -47390, -61419, -44102, -30565, -38357, -28646, 782, -3121, 35636, 41495, 47223, 36710, 3022, -4171, 8926, -6518, -9361]
24372i361K509j215J3063j9412Q349o829P372J4033p331q033L917n735M232J2362
24358G921K0458p372j0544J2937r226k7914j3807N961J7961J657j4265J5949J6261
24345A5977j9983l3133j532L7465r967K1523J6307l046q760p887k1165o975n152
24332b6328p526J9539L0226p729k551o225k0035m2845o103R156L7698j8422J755
24319c9390n927K2484J6980K622J0287K2648R565j1199M178q90p481p39l266k7054
24305g182j6468L108J0289O565N671j6105M788k878j6659J5426J0683J3467J3650
24292B4355M063L923j7682r079l284n928L437q824n591N779m149K6550J1065n022
24278A9613j2093J7510l945m0250j2176K0449J0532k9126j0593M1544K5631l855
$$ y = [-9361, -6852, -8067, 4996, -14416, -6067, -12896, -5524, 8509, 1178, -6855, -2938, -8673, -4441, 7921, 28379, 21007, 10463, 23400, 14174, -13740, -27547, -21586, -3625, -1968, -16233, -284, 15977, -4006, -37139, -38671, -1206, -11173, 10350, 26657, 23611, 14851, 6964, -14201, -21176, -26328, -33854, -14315, 15911, 8182, 5631, -594, -20629, -63474, -69577, -60421, -22723, -41145, -39390, -45317, -22833, -5853, -3231, 7056, 29704, 39269, 28070, 32248, 31358, 23877, 23138, 19872, -7182, -23650, -20542, -10253, -3688, 1983, -14122, -9334, -12212, -28871, -13445, -2762, 10705, 24355, 28418, 32341, 14659, 5580, 2296, -3632, -195, -9019, -14610, -8831, -12980, 13570, 24635, 19613, 7520, 25030, 21085, -19165, -31341, -10892, -360, -29486, -40079, 1465, 27096, 23241]
24266B3241k2689l617J4783J2682k0567k490o861o355o002K086J1795j0169j2819
24253b6982j0397j5594j123J9368R017l378j2887m144K0147K7933J2510q94k6885
24240a3309K254M440L987J4602m368k0560j0636K770P703j9467K985K993R922
24227a6684K2935j2182k3479j3985J6937Q931K56j4597Q433J0178L837j2070k6169
24214d7659J1675M2630j4288l1039K4692J0428r444K4094J5360q771j7659o365
24202f346j872K806j5082Q454J7776K1751L777j502j4110K873R492L57l2106n443
24188i175O72r953J8200j6503j0491o455j2138J3242J5380p613j138R830Q428
24175g714N393J6698J673J540K1443l75m290j4883j5450j0251J7101P980m142
$$ y = [23241, 552, -3065, 11718, 24400, 3833, 1343, -5518, -11873, -17875, -15789, -3994, -14163, -26982, -37379, -52973, -54096, -34728, -25711, -29089, -41976, -46120, -25973, 1960, 14470, 13576, -13309, -11055, -6615, -2628, 11974, 7606, -12954, -23590, -20820, -13117, -32584, -29599, -26606, -16684, 6251, -5931, -29410, -43395, -26458, -17527, -17271, -31868, -23435, -13257, -9420, -21490, -47659, -35984, 6646, -7642, -38681, -13989, -3561, -13005, 11089, 26449, 17678, 19, -6346, -8218, -5412, -20494, -12040, 5736, 27487, 31264, 29762, 15652, 18525, 28017, 28374, -3732, -9175, -8503, -18456, -256, -16759, -27250, -33705, -45843, -32601, -17221, -24834, -25972, -16142, -7714, -2321, 14377, 16050, 17590, 39033, 38658, 34368, 19485, 4035, -6216, 10885, 18865, 14723]
24162A4723L882J8929j7566p068J2884n920k0341p56o297K0914j6278k7731k0427
24149e1052J2711J3443J7675j6919m0160J0462n385J1451J7914P714K346J0093
24137i707j4751N084K0206J501J3305l945l575j7775m109Q205Q955j4721l5103
24124d6430J2486J6018K0202L4694L958l6994P988J7199j8036j1150J7225M580
24112B1740K1484j662j4364l1209j4890j2491J8879M827J8028K3374l748j5521
24100A4447r526j9157M192j3602Q990K8046o37j4347n235o800O956J8368O471
24087A8166o794r486q694r138q432K6131K3117k3574L888J4756J7706q6p421k0542
24073I597o424L477K1832K9946j7892j8720j8433j6142N916J0448J4637j0573
$$ y = [14723, 18605, 37534, 19968, 12900, 25784, 19864, -477, -1233, -7530, 13384, -2894, -30625, -51052, -38341, -24898, -7223, -24142, -64302, -53840, -59225, -47774, -29860, -22146, -19800, -9707, -24458, -19374, 832, 2333, 15638, 11693, 8118, -9657, -13766, -5561, 3394, -11327, -46430, -33944, -17926, 2276, 36970, 40928, 3934, 11922, 29121, 11085, -65, 17160, 21740, 43224, 41562, 27198, -4011, -18901, -31392, -12513, -7686, 10342, 33716, 29968, 14447, 4921, -14236, -10044, -23646, -14656, 13390, 12753, -1594, -6829, -13629, -6673, 11695, 18166, 11372, 1886, -6808, -15946, -24378, 1753, 24870, 1296, 5184, 19940, 37646, 37560, 30139, 9597, 3173, 6650, 28482, 58428, 40536, 21816, 3383, -12759, -6843, 3605, 18242, 7669]
24061G669j5317n505j633J8245k572n765J2131k1110q814J5163J2691j141P472
24048A1514L6341L051j6915j2689q50k873k9685l3387n780K3399J2867l772J565
24035a7214J0995K5600J9253k2058p469J2111l29r444j2597k6850o122J3059o20
24022b1685J5263L0845Q044J0994k4360j6973K530j1272q022k1192j4411J2847
24010c7392K1918l673n182j4847K467K1556J1337J0786k838j1736k3940j0413
23998d1957N625N387r158K5552M915j5630o348J270P823j508K3177O119r505k5025
23984b9263m026J7314k0973j6140j2707J5458L7679K2982n088J144J1125k1781
23972d276m6212k109L8697K1654l607k6685L056K7614l728r547j028p600n813
$$ y = [7669, -7648, -13153, -14786, 3459, 887, -4878, 7253, -13857, -22671, -7508, 5183, 4042, 11514, 47855, 50906, 33991, 21302, 20452, 17579, -12106, -45493, -51273, -27874, -15007, -18779, -17214, -6219, 19381, 38634, 16576, 9107, 21218, 20889, 11445, -1152, -28002, -34124, -21065, -21685, -6422, 24423, 32467, 43461, 19101, 2128, 4658, -6614, -14636, -35828, -50239, -37392, -15474, -19147, -24329, -39176, -36709, -15153, -3816, 6970, 4132, -7604, -31544, -41957, -36332, -30945, -40103, -14551, -9636, -25266, -31614, -30344, -22521, -24029, -852, 5267, -4238, -29263, -33289, -15975, -36948, -53088, -65795, -50337, -12658, 10324, 5236, 6380, 17505, -4276, -50488, -52597, -13900, 7754, 4147, -22538, -19482, 8132, 4404, -5143, -6171, -13771, -19584]
23959a9584J9458J3771J960n820O24M827n291j3619j60k0402j9517O489J1187
23946b6077J4691J3331o896O183J7935R200k5688r190P531j445j0312l448J275
23933a2910R273l1631j8181L720L0786K7662N537j3298o929j199j762j5700o259
23920c0891J2313L9721J4351J2957L187j8713l2985l227l3799o746K552K0013
23908b1267j2985J3982Q468m232n727K4461K1635j2793n706J3611j8464k6943
23896b5960L943m443K754L0007L713j1577R733J5729M7n0803j8551J2648J9333
23883a3427J5393j5683p695Q555L1424R043j2487o712M987j6327k2450J5615J4979
23870E215L0620l221j3622l113J453q810j4766o26L5180J1789k034o79k7357l3759
$$ y = [-19584, -126, 13645, 15605, 9785, 10409, 15236, 9945, -3674, -3834, -24236, -43753, -37264, -26077, -11386, 1945, -4951, 1232, 19167, 28367, 2679, -6511, 1020, -425, -10737, -14185, -12910, -3637, -35268, -53449, -49729, -18943, 8719, 14256, 958, -5971, -7170, -8932, -24632, -30891, -18578, 21143, 35494, 48451, 51638, 32925, -60, -3287, -37086, -43832, -41280, -21267, -34252, -20270, -11802, -16034, -21761, 2700, 24335, 11542, 5836, 19447, 983, -25960, -22017, -26460, -23706, 6301, 10014, -1563, 8170, 23899, 23946, -26857, -45408, -32760, -13427, 1966, -13717, -21412, -12857, 18567, 27610, 15123, 8411, 13398, -2929, -25379, -9764, 5215, 35835, 32614, 18992, 15879, 17332, 8522, -6244, -6870, 28310, 40099, 38065, 37386, 10029, -23730]
23856b3730J0567J0071M939j0283n374n424J9690R240m881J5520m887n487j8859
23843h898n418O866J80J0836n279P563J2330P720l302N57p136o059j7952j3890
23829b1882J896K4894p674l0050k6682j6488L6312K0558K285Q118J3487n099J4672
23816A4347l658m2687k4957K0838M875J6964k4381k038K9760l470q386P093N796
23803i904O667l423k226j4235J8295J0986M205Q669r644K598R033N443J015j1729
23789A5750J3004p303p57j3041L428J1844j4197j8821n28P649J9565j6551O491
23776F533q205k1747M573K5091O211l2693j9103l085R475J7372P510j3451n846
23763b7365j644M09J5142K5632l674n50J3381L756j9077j7036m257J3142J9023
$$ y = [-23730, -13163, -3092, 1847, -8436, -13810, -19234, 456, 9696, 4815, 20335, 15448, 9961, -8898, -14316, -7450, -7270, 3566, -1713, 5850, 18180, 25900, 22598, 23155, 16019, 9960, -7992, -21882, -19986, 4908, -2766, -32816, -59498, -75986, -39674, -19116, -16831, -8713, 4774, -325, 14347, 10689, -31998, -56955, -36117, -31242, -14278, -38659, -40697, -10937, -14407, -22793, -15700, -9904, -3237, -6660, -8886, -23121, -4826, 6160, 10365, 19034, 9390, 11988, 21021, 26464, 27479, 15750, 28754, 21451, 20694, 7653, 11081, 22925, 8728, -10093, -10621, -2972, 16593, 42, 6533, -1672, -23419, -18846, 6245, 12456, -20237, -39340, -42425, -32950, -15578, -8068, -21519, -27365, -29009, -28600, -13458, 12174, 8500, 7950, 21331, 25087, 6010, -11026, -15283, -2141, 16882]
23750A6882l963j4562k3572J0342K29r315L2122J1791J651O84m061k3973j3636
23737a9381o095k3024j5910K919N1116J6450k1897j1464j1136M649K8354j3535
23725a8954k011J2459p207r060j0822J3254J6102J2947J2669O723k7235j0735
23713a1870n049j2321l921K54j90o716M423K0529q445j3027j4804J0319K4482
23700a6336j311j5360J4928M539L559M18j0397q502q925N818J2942N228j6684
23687c0083j2520j280K6902l814M4257J3442k8968k3073J066J5945j780o526k390
23674h822N103M24j4488k9177k265R938J8274j268o678J0271K3044l146j0309
23661i099j1035l907J2230R559Q927P518q628k2571L512K0023K000m951j0073
$$ y = [16882, 12919, -1643, -25215, -14873, -14644, -23959, 8163, 19954, 21605, 22289, 18228, -5745, -19381, -25476, -48500, -64410, -61491, -10375, 6075, -15822, -27286, -38422, -33773, -5419, -18954, -20965, -8506, -15713, -24773, -35595, -22341, -6239, 6708, 19377, 26100, -1135, -11870, -16919, -29240, -33161, -32907, -33097, -39813, -35390, -14861, -23306, -36333, -51137, -40818, -16336, -17647, -33007, -18079, -13540, -9981, -9563, -19960, -28462, -37387, -31569, -18627, -13399, -30083, -42603, -43883, -16981, -20795, 23462, 36904, 7936, -15137, -14071, 1874, 94, -6432, -8822, -3719, -3295, -17783, -46960, -49225, -39287, -21013, -22281, -28959, -18688, 4356, 1210, -9099, -20134, -24041, -11811, -2252, 6675, 14193, 5565, -17006, -13494, 6529, 8529, 3578, -6495]
23648f495m773L3701R003j3097K4507m25n6J3707L507k1330n330M561o280o351
23634B4849m4611j6732j7397N282K8352J7228q201K4061J8788j9188j6108K3183
23622A9506m497j111j3984j6083O368K6580J1635m7892j2043q530m93J3315J1147
23609a6082l625j2880L126L1186Q599j5656k3248Q178J2023J6808p318j3567J302
23596a1154K592J0630N552K0061k645k2033R020K1150M998l1473p675L302l429
23583a104j4916K3426J3703l507j9449q79J6380l335j4486q625p039J9920j2609
23570a2520l6516J8931k828k95m390j821J013L877L1056J6980j948r280L661M163
23556A0083M789k972K861j0144o832j9561Q871K8857M708j7758q554k107K0873
$$ y = [-6495, -11268, 22433, 31436, 18339, 42846, 42421, 42365, 56072, 59579, 38249, 32919, 37480, 31200, 24849, -19762, -36494, -53891, -48609, -20257, -3029, -11230, 12831, 31619, 12431, -3677, 19506, 15009, 13898, -86, -16169, -9801, 16779, 28414, -19478, -31521, -40051, -40544, -27229, -16082, -19707, -32587, -29461, 1725, 10324, -5332, -28580, -20402, -8379, 8429, 1111, -12456, -11154, -8562, 2068, 7620, 27681, 25036, 3003, 12023, 33173, 38171, 6698, -977, 2325, -1104, -16020, 7406, 21109, 17602, -1847, -2726, 13654, 10319, -4167, -12792, -19831, 89, -12520, -49036, -30105, -32933, -33228, -37618, -39439, -38426, -34549, -3493, 13487, 11539, 2259, 5920, 10083, 14872, 11900, 14761, 4617, -2215, -21776, -12905, 15952, 20660, 2902, -5652, -7759, 13114]
23543A3114N436j2693j6227R017K6144k372j8130M037j7840k2615Q835J3223l959
23530a4030m752k442j7679M697L6966J1104k1093k4530L402J6931L5540O097l330
23517B6881j5642k3494P441J5520k1693J1007j2332o213J8934M528j7636n962
23505a8661j719J2924R415m475k093j7700j5660J6954o983N923Q76n646m846o451
23491c8142k3232L274P515J5651P704J2058J0388j330J7039J9715P795j3649j897
23478B2889L5361M035j7500k2508j912j7778k6008m823j8170K1060M4976J2794
23466C2416r851J703k8892m4114N327K4977L0636K0479j1310q303K585P690p792
23453A5551L390n409J9136j3765k9021k5165K8809O526K414r143M267P094j8242
$$ y = [13114, 18550, 5857, -10370, -1353, 24791, 22419, 4289, 8326, -9514, -32129, -23294, -10071, -14030, -18782, -21224, -38903, -34206, 2760, 13864, -7229, -31759, -28357, -11426, 24114, 30211, 26881, 11239, -12255, -4814, 10706, -10987, 20, -12312, -18525, 409, 4937, -12699, -18661, -20380, -7456, 1959, -2516, -4609, -22309, -37969, -21015, -27998, -22075, -21199, -26845, -31691, -38142, -61374, -58100, -50585, -34934, -27230, -15172, -4784, -6114, 10925, 30640, 38435, 24786, 22889, 58250, 62285, 44785, 22277, 20365, 2587, -23421, -28244, -46414, -25354, 19622, 32416, 22565, 24268, -4624, -48738, -43411, -18434, 12202, 32681, 21371, 13068, 15653, 23343, 15551, 18941, 13532, 32668, 18903, -10118, -35283, -6474, 52, 2466, -6677, -2410, 4684, -13558]
23440a3558P140n751R595J8804j1422M725J5160P022N653J2735j0794j5566l4651
23427a0908r077k656J1942o736j266j3207j3410J922J7707K9542r504j2400o020
23414b4071Q300M935J1195o090O976J5548k69l5451J3395J874j8159M253r275
23401b6839l804K4715Q948j9186n73l43j01J8342J569l1758k3012J9400J0244
23388b2398N121M752Q515J6j8070L4551J3824p504j8185k6433j1146K9941N2416
23375D5400q901l0531k082L575j4580K4463M540j1362p276l108j8827J0554l278
23362a1413k0794J0549L4810J5789k4278j9224l2852k538K4961K9298L1761l5312
23350G57j3299q462m762j1633j0851Q769P222q221k785J1508J7764N821n801k120
$$ y = [-13558, -6418, -12169, -2574, 16230, 4808, 9533, 24693, 31715, 37368, 50103, 39309, 23743, -10908, -19985, -22641, -10699, -17435, -18701, -31908, -45318, -43396, -25689, 3853, -5651, -18051, -24071, -15771, -10836, 359, -5731, 1245, 16793, 16524, -18927, -5532, -3658, -21817, -17564, -26839, -30643, -5928, 3020, -16166, -16739, -17082, -17183, 1159, 2728, -29030, -52042, -32642, -22398, -17277, -12525, -4010, -3994, -22064, 12487, 26311, 18807, 622, -25811, -36957, -7016, 45400, 36499, 5968, 3886, 7461, -7119, 17344, 21884, 10522, 3246, 138, -18689, -8135, -11413, -32207, -21658, 13152, 28941, 4663, -14561, -47413, -49951, -24990, 4308, 36069, 757, -12542, -21004, -25766, -37399, -48250, -39481, -32259, -40480, -43265, -31757, -13993, -8172, -13973, -16093]
23336a6093j2412j253J6296J8914R997r71m278K821N89M495j0273j2989K488K8091
23322B5422J179l0423o376J0924M233N13K8370m60j8165p174n623l422p118R739
23308A619L244m142J4744o951L643j0137k830O248m810j3406N838J5232k1906
23295a3614k0794q127q081L764K1026Q892l872o386J0218J5431K320Q94J7789
23282A9460r26J435j95J0795j1598k8153j7223J7804J8962k3790J941k3965M181
23269c1272J2130K210J3620q947q539K0915J4044Q7R619K962j401r612j1330J592
23255F078N601m593j9546J3191j0133j7652K558N220k506m096J2830J0400k994
23242e642K115L866o245N965k7246M345K6646J8608j2535J2200n411l011K272
$$ y = [-16093, -28505, -29758, -13462, 5452, 15449, 14478, 10200, 13021, 13610, 18105, 7832, -5157, -2669, 25422, 26601, -3822, -10198, 726, 4959, 5472, 33842, 33382, 15217, 8043, 2420, -1002, -8120, 1619, 4863, 721, 15465, 8514, 12157, 2020, -810, 5438, 628, -12778, -6940, 8292, -13614, -34408, -42535, -50616, -46852, -25826, -16934, -20806, -27192, -16974, -1543, 777, 1671, 19460, 18534, 19969, 19774, 30569, 18971, -9182, -26405, -8601, 10361, -13429, -11488, -35453, -31272, -19142, -16932, -3312, -12259, -20798, 117, 14161, 14248, 23867, 26829, 25428, 15816, 4486, 6078, 11679, 7086, -12460, 731, -9402, -27054, -24496, -19276, -21782, -25878, -13048, -2648, -5642, -3527, 339, -5906, 59, -27187, -22842, 3804, 22412, 9877, 22077, 16666, 13655, 15927]
23229A5927K9277K0117j5561k3731j5627M594K7657K255J148P83l181k8644j3153
23216A861k2499L28l615Q066K2158L235n295j9458q053j3335p911J6150K8080
23203b88K8046J9781j7595k3542j6417k0051k4831K286j5202L0562J8235J686
23191a7330K2736J0061k3789j0251N933J2098K2945O069k3741j3818n493N191
23179i389K1154J7394j517j4342j8895j1350K0664J7987j9597k304Q584k886k1533
23166a6030P73K0627J1038O878n817j2830j3859L726l2325n521O865J3221K6286
23153C032q055l4346j6220j5804J3946L2886J4569k6096j5095M120M778q701L128
23140d7858J8097K2184J9592r564j539r16k158n297o300l572l871M733J9573J2175
$$ y = [15927, 45204, 65321, 49760, 26029, 10402, 14996, 42653, 44908, 46056, 46839, 43658, 15014, 1861, -20638, -20310, -23925, -15859, 6299, 9534, 4239, -15219, -23272, -36607, -44518, -28368, -288, 27758, 47539, 29944, 6402, -10015, -30066, -54897, -52611, -67813, -37251, -19016, -17330, 5406, 15467, -8322, -18573, -12640, -542, 22403, 28472, 4731, -9087, -14580, -9389, 11765, 29159, 27642, 13300, -5595, -16945, 3719, 21706, 2109, -195, 8389, 5503, -16030, -15257, 5370, 16408, 23286, 17469, 4639, -9220, -5494, -37819, -43340, -36475, -23254, 3032, -5023, -39369, -55589, -71393, -57447, -24561, -9992, -36088, -51183, -47063, -42285, -50986, -47858, -29761, -7577, 12015, 2451, 912, -4, -2162, -7459, -13759, -17331, -21202, -16469, 3104, 15279]
23126A5279j0623o758j2377j7270J0663K0902J8606k7859j2910L5941L104N970
23114B2668j1915k3891l4779l947J276M404L975M4012J8439k3962j0166M718l005
23101a2173J8708J6297K819j0101R425O2k6334j4752j5407K4267K9811j469m8533
23088b7380l6653J070L5590J8403P682L0235j134j3259j7404k0359n183k3275
23076e1667J1958K3097p555L8536M112j5465j340k6776k364J0326J9733J2256
23064A4851J5803j3385k1208p499J2876l017q874J4989n341K820j4271j1901o136
23051c0293J5667L506k868J2730k1402J1186L1235N818p594J392k4605o614K4084
23038A2242P162k2320L250j6703R273J6693L983k0918j9826k1686N172K597K9263
$$ y = [15279, 4656, -2102, -14479, -31749, -21086, -184, 18422, -9437, -22347, 13594, 16698, 22668, 10753, -13138, -47917, -51864, -50588, -46184, -42209, 1803, 20242, -3720, -13886, -9168, -12173, 6535, 22832, 25651, 15550, 24975, 25037, -1297, -16049, -31456, -7189, 22622, 21153, -27380, -64033, -62963, -27373, -8970, -1288, 28947, 27813, 14554, -2850, -23209, -28392, -51667, -39709, -16612, -24167, 14369, 18481, 3016, 1676, -25100, -27464, -17138, 2595, 14851, 30654, 17269, -3939, -11438, 1438, -1579, -10453, 4536, -805, 2015, -12256, -24157, -30293, -14626, -11120, -13988, -1258, -22660, -11474, 19761, 25579, 17985, 19377, -5228, -11842, 12242, 19404, -2916, 334, -16369, -7096, 9597, 13580, -7338, -27164, -48850, -43678, -41081, -11818]
23025a1818Q854L024o991L288j3490J2780L0565P954k1890J1246J5862o637j2674
23012B0073M261K67L952j6904p573Q841q4p782k5229l7058K123J658J31J7668
22998c5656P888J0103J4552o621R519O871l355J0325J6898K1444P169l355n557
22985E0225n493j3908j6600k955p583m0259j2551K0565J3365k8968K6468J4512
22973c182J6064p85j087R757j8300k8291j7513J4070K5044J4353O247P401k0254
22960C524j7812P083j0740p579n838R658J5781m522p831L77j4504l667J8358K513
22946a5199L911M0112J4032k2960j457K016O397J0558k2774k6368r352K638J4093
22933d353j2244J0619K37r362J2427N738l421O720K944m050k368l870J1093K034
$$ y = [-11818, -2964, 60, -6931, -3643, -17133, -4353, 26212, 34166, 12276, 23522, 39384, 32747, 20073, 24334, 24601, 28553, 11649, 4076, 12917, 12833, 5051, -20178, -57236, -55113, -53455, -53324, -35656, -27768, -17665, -3113, -9734, -215, 6656, 3301, 13626, 30524, 51968, 59137, 55782, 50225, 44732, 30824, 14224, 11269, 3686, -36573, -49124, -28559, -15194, -44162, -17694, -3182, 12882, 12097, 11010, 20767, 2467, -25824, -43337, -29267, -4223, 10130, 16377, 23778, 3524, -14288, -7205, -17945, -25524, -31362, -21704, -5923, -10445, -18276, -17899, -32403, -36070, -17712, -15199, -11288, 28824, 42856, 19896, 18439, 20455, 26852, 37410, 14636, -11732, -21084, -18446, -4353, -16597, -5978, -5741, -15103, -2676, 3062, -359, 6361, 9305, 5255, 2887, -983, 10110, 12144]
22919A2144Q219l277J1951j3675q775J3375k5422K376J0919q216K1108J4692l391
22906C2028j5174l1076k2117j936L3430L3986j765j8285j054J862k0103j4171
22894b4375q837K1517n161j2254m023J017M238P043n644J2349P159k365j372R931
22880g77K38k5650P208L12L1772P951j7690m528j83N204J0649q367K43K0110k6037
22865D55R133k065p587M78P55l4593k5463J7531J4260q981J2759R317J6940q435
22851e496j6196j7162L496J0387K172L0918l682n841k514o709J3858q684o928
22838a2381j353j3494J7570K7676J0942j4445n658l739n899Q580P121j3964j3970
22825a3014j5025j751K4351P542R591J5714r99j9220j868j003j6088j7866O137
$$ y = [12144, 20363, 17086, 29037, 15362, 6587, 19962, -5460, -3084, 7835, -381, 20727, 35419, 32028, 16854, -14222, -36339, -38275, -4845, 29141, 27376, 9091, 8037, 9899, -10204, -24375, -33212, -11695, -16856, -29110, -33133, -32116, -27878, -20835, -26479, -14130, -6971, -9336, -10708, -777, -539, -26189, -18981, -18669, 13103, 21054, 3364, -1164, -1347, 3857, 14506, 6139, 6382, 26492, 455, 9588, 7523, -64, 414, 1169, -33424, -58887, -41356, -27096, -36077, -23318, -14001, 2939, -5496, -21692, -38854, -35358, -24971, -22799, 8119, 4437, -1404, -3918, -10627, 3231, -5453, -12381, -13734, -27228, -9658, 18018, 28960, 14515, 8857, 5118, -781, 7799, 14920, 956, -13014, -28039, -29790, -5439, 2103, 11694, 27408, 26409, 7189, 5321, 4318, -11770, -29636, -23499]
22812b3499K8600q537q692K342j4417J6926O88K926J335K90p69J3770k8966j7433
22798c5436J9257L0041r813k2720N429j4231O848o386r600K7481n069j6449l612
22785c4260j8658k1544n88L1365M1449K2107K0021j032k0010l2814j5523M155
22773b5332J859r666K4792j7230K867J5335j0118J0713j1915L329K8136L568r078
22760G260k1778m229O165j1593k1436p44J3809o404N745J1482J6144q972j6296
22747c0847K79J4470Q705O788P647j220j896j2069k6601J7550J4348q417J540
22734i723m646J1071J7687J0282J8935r3o716j3294j5064o269j0968j185k1452
22721c1435K909K548R09N918Q697J845J7051J2385j1345o765k438k057k3030K5977
$$ y = [-23499, 5101, -3436, -12128, -9786, -24203, -7277, -6589, -3663, -2328, -2038, -2807, 10963, -18003, -35436, -16179, 13862, 4049, -18671, -13242, -27473, -20625, -27011, -36611, -9130, -14199, -30648, -34260, -52918, -74462, -75050, -43685, -2236, 19871, 39892, 38860, 18850, -13964, -29487, -25332, -23473, -33139, -8347, -25577, -22710, -7375, -17493, -6780, -18695, -15366, 12770, 16338, 7260, -14518, -18747, -12582, -24175, -45611, -46355, -32546, -38950, -33205, -21723, -5579, -14551, -30847, -30568, -16098, -7393, -605, 7042, 5822, 3926, -8143, -34744, -17194, -2846, -11263, -9723, -14369, -3298, 14389, 24671, 43606, 43513, 36797, 23503, 8439, 2170, -8798, -9983, -31435, -28526, -25978, -25069, -19151, -10454, -8609, 8442, 20827, 9482, 2717, 279, -1778, -24808, 1169]
22707A169m57K512r559j0736J7301J6081j725l5466o170n93l929K3082P330j9621
22693b0781j069J7143n2r949j188R050j6812k2368K508M0954J5773Q136O080j0680
22679A6745J5376J100k0556J2710j6996k2820M26q1J1183O707J8273p715l999
22666A0353j6050Q90l989J5753J1140j8079l0377k3181J7519J6621j8478P370
22654c0508K6270J0495j4941K898k6900n838P173J5863K7477j2549l079Q116k72
22641D205J518p257j6734j3278J9424K2944K2673o350k813j5581k1498q515o339
22628b7601J19Q872J6856P468l702k2350o634k875J4155J1180n119K3674K0189
22615C4232l2825j4807J824J6385q851k1710O493J5155L2395J6549k7260l3046
$$ y = [1169, 712, 3224, -6335, -17071, 230, 16311, 14586, -20880, -27050, -27643, -31572, -8490, -1160, -20781, -21850, -4707, -4759, -14708, -15896, -6846, -23658, -46026, -43518, -2564, 13209, 21345, 27425, 16745, 32121, 33221, 12665, 25375, 8379, -14441, -14015, -14096, -2913, 3794, 22067, 14352, 10353, -5697, -4807, -8796, 6957, 18097, 18, -30359, -53540, -36021, -19400, -37878, -30508, -4238, 6257, -8684, -5786, -32686, -38524, -31351, -15488, 11989, -560, -3639, 4477, 4205, 5723, -1534, -18268, -31546, -12122, 10822, 33495, 27145, 24332, 8751, -12747, -21262, -27601, -27482, -18610, -1754, 5714, 2012, -20338, -26972, -29847, -15692, -4512, -9631, 14043, 34232, 1407, -13400, -11576, 4809, -4042, -25752, -19259, -4104, 28291, 44840, 17580, -15466]
22603a5466J1982Q810k3453l8171m983K6355j083k963K3877J2076J5819j0778
22591B022J2391l435m707N981o247j0550l5418L303J6471K5507K829j9924j7810
22578b9587j381K9190J5059n629j8915p994N335o713m5222q524K6688K3768P958
22565a5967k239q572K232O68J5636m1578j9850L7188M694j418k491j4583k81L3546
22551a3015L6608l7574J1775J0321j2067m180k9K495K3465J9865l659P625k6921
22538A4709j6949k5034r267k844L4396j2421K0409K5018j5511k136k6593K195
22526a4028q478k1010J283L8618J2714k759j5768q828J1469j782j3213j105o558
22513b9445j8037n848m800J0325j874L9805J1728K1519J4655J0702j6239j0248
$$ y = [-15466, -3484, 5326, -18127, -56298, -61281, -34926, -36009, -38972, -15095, -3019, 12800, 2022, 14413, 10978, 6271, 12252, 6005, -4545, -39963, -36660, -20189, 5318, 8147, -11777, -29587, -30968, -1778, 13281, 7652, -11263, -19257, -13922, -20635, -65857, -74381, -47693, -23925, -15967, -18206, -26778, -24546, -23878, -8242, -49820, -69670, -32482, -27788, -29206, -31697, -46280, -46561, -13015, 23593, -13981, -2206, 8115, -3952, -8132, -8161, -5666, 17799, 37664, 34005, 41630, 14709, -2240, -27274, -36541, -39385, -4989, -17410, 2999, 28017, 12506, 10370, -16223, -14028, -22506, -43516, -42233, -3615, 9099, 6340, -9428, -18256, -6787, -8569, -21782, -22887, -29445, -47482, -53330, -58130, -47805, -49679, -9874, 1854, 23373, 38028, 48730, 32491, 22243]
22501B2243j126K809p091j1253L843k3158O31J4837k693N364R339j4155l2280
22488c2690P981n392K222J6023M928k992l4114J105J6078K2261J0862j5768j0884
22475b0380p528J0169P778J5037J8323k7908j5816J7484J1569M445j3561r603
22463i991q478k0244n96J2155K9274k0676k5004K2708J1767M858m914j1574K022
22450a8693L255q181Q670k1792l1835Q607L7333L2390n039j7246m2148j0619J8654
22437d6644L1106q018J540K0423j2080j3296P561k133j1259j0859J5579J2683
22425a5397p335J3814Q937J083N063J3462J234j1834j2335Q294J9874j3347k3106
22412a1593l319m817k8349k084J8043K372J2394K9453k2153k8484k2256o093R542
$$ y = [22243, 21117, 23926, 16835, 5582, 9425, -13733, -13102, 1735, -958, 4406, 13745, -410, -32690, -24709, -30101, -27879, -11856, -6928, -9920, -44034, -42929, -26851, -4590, 6272, -9496, -20380, -27908, -17739, -9961, 5076, 23399, -4509, -20325, -2841, 8728, 13173, -388, -9991, -18469, -38713, -39309, -27154, 2120, -18556, -43560, -20852, -9085, -4227, -9141, -20715, -18693, -15438, -23619, -14949, -36741, -68576, -59969, -22636, 9754, 4715, -12531, -54679, -65298, -46644, -15538, -23556, -22016, -1593, -13673, -26969, -19408, -21541, -32800, -43659, -28080, -15397, -22732, -8918, 19, 1102, 6165, 19627, 20861, 9027, -3308, 4986, 24860, 11513, -11593, -14912, -19729, -48078, -50162, -32119, -29747, -17353, 12100, -10053, -38537, -60793, -66886, -57344]
22399e7344P621J3735K0809J4514J5776L2057k2477j5606k3989o005L109J9324
22387A524j0157N430O211n223j4400q593J4288J5398j0923K028J0596j969j8885
22374a4675r351K0873P114k0175l275K3679J1145K3732j3350l1344n313j5906
22362b6846K5639R356K726q093k3994k646j2220j1679J5578K9378J695L18l694
22349d482k2568n641P051K7195j4906l4672o65L6045L1737J1092j7210o063j3337
22336f424j4481j0973K715K975K7220J0032j0357J3027k013j258p387j2305L742
22323e487J5526l9657L963J3635J9858K0555j3148j7739J2655O906M760P841J0938
22310D0606l2034l460J635K0646K2415n205k2452m635o092j9319k5355j1830K7775
$$ y = [-57344, -49723, -35988, -15179, -665, 15111, 47168, 24691, 9085, -14904, -20909, -17800, 1524, -8633, -3203, 3008, -2215, -16615, -25208, -10920, 4478, -6445, -4417, 6179, 4210, -14675, -24026, -3153, 3961, -16214, -19489, 4190, 15335, 39067, 25717, -5627, -10940, -26846, -1207, 8149, 10875, 2782, -21212, -23858, -36078, -47757, -32179, -2801, -1106, -788, -4482, -27050, -32691, -25640, 1555, -13351, -48023, -48688, -12643, 19094, 30186, 12976, 6913, -6424, -20905, -31878, -29163, -26188, 1032, 11064, 707, 13734, 11721, 10463, 3076, -9229, -5487, 10039, -29618, -25655, -12020, 7838, 28393, 15245, -2494, 10161, 17067, 21827, 29668, 40606, 8572, 5112, 6747, 27393, 49808, 44603, 22151, 17516, 11424, -7895, -33250, -45080, -17305]
22297a7305M7523K082k3839j0449L7359P596j269j4451J0541J6617j6624k9966
22285G815j1773r278m0767Q199L7123K7833l776n316M060m3089Q448L7196P02
22272A7377k5262M15O678R020j8913O78O284K369J1734k2283L088m384K936j095
22258a1358K2561K4384r331J9133P534k5565j5118R152J642j0995l2794Q021J4110
22245A376Q753j3408j924L561K510J6420j1312l193R561J4654p828m0789l4381
22232e6000j6852N767L461K9627K2800K0358j1546j6368l243N360k817L3767Q595
22219B2909j8471k535O257j7614k0578q623M34J3887M115N621J7279J4721k535
22206A4867L4021J0521j9872q492j4264l043J3320l303k1555R932q007j206j990
$$ y = [-17305, 30218, 32300, 8461, -1988, 35371, 42967, 41698, 27247, 37788, 54405, 37781, 7815, -3958, -13236, -54003, -45804, -8681, 19152, 15376, 10060, 14120, -28969, -20521, 16675, 17377, -7885, -7470, -792, 8228, -10685, -10007, -3723, -1354, 10380, -11903, -8815, -13199, -10263, -11358, 11203, 35587, 26256, 45389, 52923, 27358, 12240, 21392, 23034, 12039, -20755, -12734, 1376, 10129, -3279, -5203, -1642, 868, 17288, 5976, 2783, 12344, 26998, 19170, -21619, -56000, -72852, -67085, -63624, -33997, -11197, 9161, -2385, -18753, -21996, -16636, -19453, 14314, 22909, 4438, 1903, 8160, -9454, -30032, -38655, -38221, -24334, -20219, -14598, 2681, 17402, 14867, 48888, 59409, 39537, 31045, 16781, 13738, 27058, 23755, 2200, 12132, 4125, 2919, 929]
22193I29k7895q212J3397l568Q952K0591J9090K419j2129j4637N207K790K3529
22180C0463k3734k6311R491J4825M977m151J3106l210p628M257J0704K7114j7403
22167C2500r044R736O128l2570j9380N235j745K2403L86j9462k2563L71l719J4108
22153a7616J7387L19q553O214j4936q698j4059K6074K9975r524q663l1009m995
22140c8084k541J0843M986K527n880j4102J6757J8296J7700J2833N71l61j9683
22127C862p223L971Q837R961N016M636k2285k3667K294K6704O76r049O301j1583
22113a549m774n626j515J4830J0441k3123k2902K498K4975k652j3407j8190L946
22100c7048K341r151j984L862K0312K4894J0423n62r672j8397j4081m847O900
$$ y = [929, -26966, -35178, -21781, -25349, -16397, 4194, 23284, 25703, 13574, -1063, 4144, 6934, 30463, 6729, -19582, -10091, 4734, 9711, 5560, 18666, 15456, 7828, 12085, 22789, 49903, 32500, 23456, 33192, 39320, 6750, -12630, -7395, -9140, 13263, 13649, -5813, -28376, -28005, -31724, -17616, -229, 90, -8463, -2249, -17185, -25883, -39942, -13868, 16107, 6583, -2080, -33089, -38084, -40625, -29782, -24796, -22269, -28149, -42251, -25494, -7198, 10502, 23335, 23906, 23545, 3862, -3361, 610, 9447, 19408, 24424, 29060, 6775, -16892, -14598, 12106, 12782, 3733, 10034, -1549, -6323, -11949, -13464, 1366, 11807, -11316, -34218, -31720, -6745, -9397, -22804, -40994, -37048, -34707, -43858, -45842, -41980, -21668, 3226, 13649, 13087, 3415, -14982, -29063, -33910, -27010]
22087b7010j738j6796p184k888K6591J2862R707j532m736R480M798n003k2951
22074b6400J4227L4768J9059j2292q647K6942Q530k6335j3835L556j3708l0919
22062b5054n072L1914n753j8020O862K6075O087N387K5986k0976k3288J4092p834
22049A0406k3645m315J753K1733N101l8580Mj2101L632L6167J5010j9013k714
22036f562M399k3154P435J0916l4175l2562p235K9531L1151J0442R728k7358k8393
22023e5837q227J8539L4448J1992l580m496M4225K737j2837j7388j035j9555q318
22010a9332P164k8213q829J0095M0084J4654j4706P389n786m397j8216n377j0347
21997c5817J9021n921K1713J9254Q552n647R975m426P001j231j4936k8938l343
$$ y = [-27010, -28748, -45544, -52728, -55616, -29025, -16163, -6456, -7988, -12724, -3244, 1554, -3449, -26400, -12173, 22595, 41654, 29362, 20715, 47657, 56187, 29852, 16017, 19573, 5865, -25054, -30126, 1788, -3965, -21985, -15123, 10952, 17039, 22426, 48412, 27436, 4148, 18240, 10406, -13239, -17554, -15801, 5932, 11033, -27547, -27543, -39644, -36012, 155, 15165, -3848, -6562, -2163, -25317, -17882, -6966, -41141, -73703, -80938, -51407, -20256, -9814, -86, -27444, -55837, -64064, -45525, -11077, 915, -2665, -7161, 37064, 39801, 26964, 9576, 8541, -11014, -19332, -12168, -40381, -49210, -39115, 969, 15623, 917, 8306, 2520, -1877, -20093, -25470, -35817, -16796, -22717, -1004, 18250, 26802, 21155, 31130, 26704, 33705, 32474, 17538, -11400, -14743]
21984a4743P602l910k3198n786l097K1168M4322O071Q130j0597m846j1948j0840
21971a672J092n283k4108j3400K4159p507K2514K5929M791J38P119m265k404j0539
21957A6564j0565j776k706j2109r031J1996r025K261J2714J1884q365k5682n256
21944b9096j126J666P812P032K9275M87K854k6532j2760R424K868K022p073l7376
21930e0523p8L2948J3201j0240j5522j5822R314J424M476o67K0268J6549k423
21917B905j0639j3555p48j666J1887j2581k566N393R876O189J5749j2876k4320
21904b6952J4497Q421j2651j3098j6228l476Q024J8106k3889l27N910n127J3763
21891c3027J7522j2299r991K025J1035K3486N838j745n695p817O645J3633q03
$$ y = [-14743, -7141, -11051, -34249, -40035, -43132, -21964, 22358, 28429, 36559, 25962, 21116, 9168, -1672, -580, -5863, -29971, -43371, -19212, -26719, -4205, 21724, 26515, 26653, 33772, 29507, 27103, 16564, 5999, 4223, 1517, -10592, -19623, -7627, -16652, -14391, -1677, 10207, 1842, -23840, -29096, -30222, -28556, -20744, -13712, 15563, 16050, 18904, -7628, -20388, -10964, -8096, -6074, -13147, -50523, -50601, -17653, -4452, -14692, -30214, -46036, -36722, -35298, -30822, -31489, -11221, 5328, 2905, -7734, -21289, -22037, -23703, -11816, -24397, -26963, -21570, -11694, -5505, 10244, -2632, -26952, -12455, -4034, -16685, -29783, -46011, -49487, -41463, -23357, -47246, -47573, -41663, -46790, -33027, -15505, -27804, -37795, -35770, -24735, -1249, 4589, 2844, -2851, -10668, -4023, 9610, 8807]
21878H807j856P545o475J0841j6136k339j6045L252J9548k2683Q217j1219j2325
21865c0868r67J5526O93j7488J3370P492N571j1615J996J807K610O836J0071J3563
21851A8597J2759j399j6875k4259k7839k3795K0537K0931J3699J2169J7929J1242
21839C3696l150k4571K580P76j4811j7936q052j1446J8705J4009k381R096P608
21826D123J710L182k622J7599j7725k5460J7726P836k2171J8301N739l3803j0234
21813c5799M635j1037J0804K5416Q529K575K2391p454k5581M924j660L552n288
21800c993l646q719q884J020q442j2750m65m706K5887K3560K620L750o636j5611
21786a7015q306P912m771R009o902j1964m64Q369J6667Q707m726k82K618l1366
$$ y = [8807, 6951, 14496, 8021, 18862, 2726, 387, -15658, -12406, 7142, -15541, -7324, -18543, -30868, -31835, -16309, -15616, -33104, -19734, -12242, -6671, -18286, -16290, -14483, -11873, -5037, 5034, 18597, 31356, 29957, 13082, -11177, -39016, -62811, -42274, -21343, -7644, 4525, 22454, 33696, 30546, 5975, 8555, 9331, -5480, -23416, -31468, -42914, -24209, -10200, -12581, -3485, 4123, 5833, 9015, 6393, 23992, 6267, -19193, -1467, 6369, -15802, 2499, 8238, -25565, -35799, -31164, -42201, -31397, -5981, 2548, 5123, 27514, 20060, -5521, -597, -2257, 1295, -3993, -7639, -16358, -25242, -24222, -32664, -45414, -45879, -50585, -24698, -1138, 1482, 5232, -1404, -17015, -25321, -17409, -22180, -13171, -20073, -32037, -32501, -24132, -7465, 1242, -3484, -3766, -1148, -32514]
21772c2514l9482J2751L6646L57o623j0300r540J4283M0261K968L39K422J0640
21759B2208R308l1652o497j5379L629j2937j1151P960K6502j345K23N057n208
21746i282j117j3888j0858o157J9105J9669l646j580K446j6181k808L686L408
21733a7203N02j2092j1806M559Q170J7753j9325j5098O321O117J8337J9371J1072
21720A6678K2259r782P450j5352l1877q630N815P727N598M984j026J2616k8799
21707a2339j4645J9161J3735j4889j2291n627J6515N087m576o048r976j4398K2984
21694a7307J1880J858J3361K0134m698p868J6280o240r760l9185l938J9050N70
21681e863r24k4641j4178L484Q29r070K0062J4889j9234j854L148k9120j2921
$$ y = [-32514, -71996, -59245, -22599, -22242, -28865, -39165, -48705, -34422, 5839, 8807, 9146, 11568, 22208, 31516, -136, -6633, -22012, -18383, -31320, -42471, -34511, -8009, -9354, -9131, -4074, -9282, -10399, -24287, -35145, -41302, -22197, -2528, -6174, -7754, -5308, -21489, -24297, -20611, -17203, -16701, -28793, -40599, -36040, -27870, -10117, -29442, -44540, -38219, -32102, -13765, 5606, 16678, 38937, 29155, 36605, 21253, -10624, -19254, -13439, -5712, -114, 4870, 3844, 16460, -12339, -26984, -7823, 5912, -8977, -21268, -26895, -10380, -5293, -9869, -15917, -25893, -40291, -17307, -5427, -3569, 9792, 29926, 25228, 17360, 33640, 27400, 17640, -21545, -25483, -6433, -5863, -6787, -31428, -45606, -42122, -41293, -50363, -30301, -15412, -34646, -36500, -33352, -62472, -75393]
21668g5393k852J9481P854K1612M1231K0709k1503k4711j3163j4829P242q54o72
21655c5848J4891J0050J862l150n078K576L5097J1406k6935p051l147M407j2357
21642a3277q847o129r556K1642J5088O584Q18M238q358j145j0216p387J7600R140
21628A0195m310k9460j3673J8197K2332m707j5257j105q397J4496J4551L58l223
21615cP583k2452j4840R577k877j7499n293J1969J4648P300J1180P089m756l1894
21601c0268J1835r42M1471L0023j1227J3012k2973k6941p520J0910Q972k3542
21589g190j5857m6284P103L1424K7680o009P40J5598M301j174J777O448j2040
21576F517j3816j7699N107J5403r619P707K0435O753k8796n120p17J2073L675
$$ y = [-75393, -78245, -58764, -50910, -29298, 11933, 32642, 11139, -13572, -26735, -41564, -34322, -35176, -35848, -20957, -10907, -9045, -12195, -17273, -14697, 20400, 31806, 4871, -2180, -5327, -920, -13277, -22124, -28253, -37809, -16167, -1079, 5505, 6323, 10561, 2203, 1058, -9158, -16545, 1055, 10195, 5885, -23575, -37248, -19051, 3281, -1426, -16683, -17788, -26185, -11689, 2862, 3220, -3, 7580, -14872, -29712, -20135, -23012, -40511, -45804, -33835, -19187, -11887, -707, 6382, 1626, -30268, -18433, -19375, 22096, 52119, 40892, 53904, 30931, 3990, -3530, 7380, 16352, -7190, -23047, -69331, -62228, -30804, -3124, -9133, -8393, 7205, 11506, 10332, 12109, 18557, 6517, -7299, -24998, -19891, -4488, -14107, -6400, 14035, 20788, -8008, -13128, -13845, -1772, 1903]
21563A903j7645k0743n488J3327O872q716L027J0040K064K5205L3963j4398k8841
21550E70L928J0288n660J4316K1620j9448l3632R480J3622k7689j7350M107L328
21537b2520L939J6965r334j081J803J3139Q192n615k0768n248K8737J8995k6552
21524F52j2101M279n841N409k074J5981j3421p642M0411K6017o818j7317l4944
21511g409j5381J0102K0037J7547l2403l7960R942K7949K4120Q457r993j4077
21499I31j3046J836j1201K4160r155j1659m934k2502K2684M4718j2504j3852J6718
21486A2194K1260p807j096k0290j5472Q054J5639j1168J5369m097P137J333o766
21473A4290k1899j1454j4503J1605j2622j8530j5363L7027K3529J1566p13j5995
$$ y = [1903, -15742, -36485, -41973, -28646, -21774, -30490, -27463, -17423, -15359, 9846, 43809, 29411, 570, 4498, 14786, 9126, 23442, 45062, 25614, -8018, 1462, 15084, -12605, -29955, -25848, -22520, -18581, -1616, -10950, -12031, -10228, 2911, 11103, 5488, -15280, -20528, 8209, 27204, 652, -11449, -7170, -13011, -7602, -9676, 6305, -7116, -14758, 25653, 51670, 44852, 27535, -7409, -22790, -12688, 7349, 24896, -7507, -45467, -35525, -7576, 16544, 25001, 15008, 931, -12115, -10279, -21480, 2680, -6475, -18134, -23068, -45570, -22886, 21832, 9328, -4524, 12194, 33454, 25647, 24551, 4261, -11211, -3157, 12482, 1314, 16683, 12586, 19723, 21056, 14290, -7609, -19063, -33566, -21961, -34583, -53113, -68476, -31449, -7920, 3646, 2933, -13062]
21461a3062K1403Q759k1578o933n667J212N947J5475J326j7557m689P41J5677
21448A054P390n049J2008O037j8551k3089j460l8299P088o416J9027K2856J8239
21435H35P27j0008M107O036j0861P755P03n482J642m01K3046k836k5462k9675
21421c9874p975J780K6794M879l6680K941K7508K7258N124P482J060k2717j0340
21408a2760O113J9363J6793j0729l533Q553j6861j6342J3459J3346j170q788k841
21395D603j7836j9893N858J2750o758J5103N45j7302J1924l116n905p595j0503
21382c8125J7118K3171K3121j6312j675L297k8763K336J8332j4490k4575J424
21370c5141K9120p131o696J3533N129r286K891j8062k5574M435J5693J9294q86
$$ y = [-13062, 8341, 17100, -4478, -11411, -17078, -15866, -9919, 5556, 6882, -10675, -15364, -14623, 1054, 8444, 3395, 15403, 21440, 2889, -20200, -21660, -59959, -52871, -59287, -40260, -17404, 835, 1562, -8446, -4339, 1697, -9164, -1409, -706, -6188, -4546, -4947, 18099, 15263, -10199, -39874, -47849, -46069, -19275, -14396, -51076, -48135, -20627, 6631, 11755, 19237, 20297, -2420, -12760, -6647, 12716, 29509, 18780, 15247, 23800, 6939, -9403, 4056, 17402, 16232, 7444, 4603, -13233, -33126, -27268, -14518, -21276, -6173, -5628, -22930, -11006, -14122, -20027, -27622, -38125, -21007, 2164, 25285, 8973, 7298, 10595, -18168, -15832, 2500, -11990, -36565, -35141, -6021, -13152, -19848, -6315, -1186, -10472, -7581, -25643, -51217, -46782, -31089, -11795, -12681]
21357a2681k4789k4565K5843K5437k01k191r40J0330Q664P199j5918j1845m083
21344a9740K1541J91M916K5215n995k6863l892M495O5j3543K759J6971n56j0972
21330e408j4203q905J3217J5066L282j5624j6503j7362K596J9215M346K3421J5454
21317A8592j9436L413j33k2757k77L012O024J6673p595k4965j3868J5483P087
21304a8747J1783j0000J2038J6269J0846N143O422k4820J2392J6388J1563l810
21292D5467q861k7893r75J2241P2Q378j0948k4070o619j2770q484J4303L325j8164
21278c4998j000J916K552o090J4092Q959j6105r589K2616M964q182J3506K0088
21265A2729l6486q436J6489J242L879J3959O91o110K2642K1555k0282o852P574
$$ y = [-12681, -37470, -62035, -36192, -10755, -10956, -13147, -14087, -3757, 4907, 12106, -3812, -15657, -19740, 1801, 1992, 6908, 32123, 26128, -735, -4627, -132, -67, -13610, -10851, 6120, 5564, -5408, -19611, -28516, -15299, -233, 3049, -12575, -29078, -46440, -43844, -24629, -20283, 3138, 18592, -844, 2569, 2436, -20321, -20598, -17586, -11562, 5111, -2484, -27449, -41317, -25834, -18747, -6964, -16964, -4926, 11343, 22189, 27332, 33754, 8934, 21326, 37714, 49277, 45467, 36606, 8713, 7738, 19979, 20051, 28429, 17481, -6589, -13208, -25978, -34462, -20159, -16834, -34998, -35998, -34082, -31530, -37620, -23528, -14569, -30674, -40263, -17647, -12683, -20865, -7359, 12729, -23757, -32193, -15704, -14462, -10583, 3376, 4067, -2043, 20599, 42154, 21872, 15020, 22594]
21252B2594J5766J110j7874j3341l858M014j0152l4270K162j313o000M574L1279
21239e309J0606j1537j6857R579K0615m785j2090k4467K669K2373K8378j2057
21227G118k5130j6708J5930J816o447p729j588L1127J5772l6249k2762J7539M236
21214b3075R796J5858J6374P614j7152k6600K385K0105M652j1979o625j805o322
21201a6774q04l5824m045K3619L1440J5545J5970n576p372m734J7426J6305k9292
21188A5884j3003q946j7427l728K8219O985k237o267j3951L91j0594J2297J3096
21175G19q91J7294m543j3440r621J443K8515l9686r876K04J0951K8008Q614j6046
21161A645o783q267P862j222k2342n17L1511K3580k0208k5338R47k163l4620j003
$$ y = [22594, 38360, 39470, 21596, 8255, 4397, 8411, -1741, -36011, -33849, -35162, -41162, -36588, -5309, 5297, -6240, -23097, -13518, 7097, 2312, -9778, -34245, -31576, -9203, 19175, 7118, -18012, -34720, -18790, -16974, -23421, -31150, -32738, -1611, 14161, -22088, -44850, -27311, -23075, -13279, 2579, 18953, 26567, 9415, -17185, -14800, 5305, 9957, -2022, -8647, -10452, -16774, -17578, -53402, -57447, -33828, -2388, 13157, 29127, 23551, 16179, 11445, 28871, 45176, 15884, 2881, -6065, -23492, -27220, 999, 7984, 5747, -520, -14471, -14080, -24674, -12377, 719, -172, 17122, 12579, -861, -10482, -9039, 19476, -20210, -30086, -29882, -18931, 9077, 17691, 1645, -5138, -13405, -5543, -6765, -29107, -29624, 1887, 25467, 5259, -20079, -19132, -21295, -55915, -56918]
21147e6918P718J3527L1295m20k0419k1489N911J5973K54J1118J8560J5104j8160
21134B054l978K5529q137o622J3512K0151j7262l1502L898j6834j8127J0756K5350
21121a212J5137j6944j1782m125K4056J6407j8048k7354k3785o679K9327K6051
21109A049j046j2280j2602J3760j2654P947J894k7738K4000J8721l2269k8907
21097f0125j0142L6359J5221n141j4119r990m158n877L3096J3495O341j4268K5490
21084F182k000k9968j2617K9979R847q124K537J5765J4907j1123j1616r190j9333
21071b4754Q939J4190K094k8666j2422Q278j1594l604N566K4208j0726n436k804
21058c6731J7242K4541P370q000p162l972J4793n675R673J008J338m611j9710
$$ y = [-56918, -49200, -35673, -4378, -4798, -25217, -46706, -40795, -24822, -24568, -13450, 5110, 20214, 2054, -1924, 23605, 15468, 8846, 22358, 42509, 25247, -6255, -2357, -19191, -37318, -26562, -1212, 13925, -3019, -14801, -18926, 5130, 21537, 3489, -23865, -47650, -54329, -25002, 1049, 3, -12277, -24879, -11119, -23773, -15826, -13932, -41670, -17670, 1051, -31218, -60125, -70267, -33908, -18687, -23828, -37947, -47937, -52095, -57972, -24876, -11381, -5040, -19308, 6182, 4182, -25786, -38403, -8424, 1423, -6701, -4164, 11601, 26508, 15385, 3769, -5421, -24754, -15815, -1625, 469, -28197, -40619, -32341, -43935, -47539, -41973, -17765, -28491, -33927, -36731, -19489, 5052, 12422, 4422, -2740, -6712, 8081, 2406, 12079, 13087, 14425, 9814, -9896]
21045i896J6702L923K79O268p75l1892J194J5238K5959j5261l6931k1050r135
21032e5377K5628J3533k747J1889K3249q168k1465J8910L440j0949J851R575K0822
21019C0191O095p739k0595j1767j4849K9076Q326q984q051j2009j9346J7613R280
21006b759L728n117q489K8325J0233q270J0653r592j1151N942p187L42J4954j2269
20992I343k0488J8224J4761n755l3177j0515K0222p387O311j5285J6935J8041
20980A1230L2708K8167l7989k7266J338J2949Q231j743j402j053K386P61j9602
20967H715j178o488Q35K1978K16l551O508j1015l44l636L036k381k016j052j0505
20952h78j1825j619j5624P35J2147j8011k1549j5994K5766P879q447Q381m213
$$ y = [-9896, 6806, 10729, 11008, 17276, 16501, -15391, -14197, 1041, 27000, 11739, -25192, -46242, -55377, -29749, -16216, -18963, -7074, 16175, 8007, -13458, 5452, 8892, -2057, -206, 9369, 30191, 36286, 28547, 7952, -3815, -18664, 10412, 18738, 9754, 1703, -10306, -29652, -12039, -2759, 969, -4148, -12637, 15688, 25921, 17651, 28304, 18712, 7561, 13503, 6316, 6658, 21612, 9343, -11145, 7079, 21840, 16085, -17092, -27607, -7385, -14772, -8461, -23746, -6811, 11230, 43938, 72105, 34116, 6850, 8188, 21137, 29368, 27625, 26223, 25170, 27556, 28317, 8715, 7537, 1049, 1884, 23862, 24078, 20527, 27035, 16020, 15676, 12040, 15076, 12695, 10679, 9627, -878, -12703, -14322, -29946, -29211, -17064, -35075, -56624, -72618, -46852, -38973, -47420, -39039, -43252]
20939d3252K433J8789J5400J6790l1440j5578r700K5667M899r709M444J0799N199
20926e259M805J437J5003j4642J298N246k4201k2713J6679J0287j8400m083n65
20913c5108J2337Q386j741R797n16R060L875M051j4746n985K7587M972J077j8541
20899D505K255J3327J1815p517l6433r556P063J0537K9634r261l0473j0915K141
20886b2878J7552J2381O996K2980j0315j3437r190j5890J69J9470J9983M342j5753
20873A6410j0230j9005k000M124P708K1481j1603j4676m623R273P842l789q046
20860g134k869l26r565J7340N696O829k5480k197J0454J251m5405n816L6140K3372
20846B290K739m527J0334j2193m1160M12P037J6144R584O620n709M443j0072o729
$$ y = [-43252, -40819, -22030, -6630, 10160, -21280, -36858, -46558, -20891, -15992, -25701, -21257, -10458, -5259, -454, 983, 15986, 1344, 2642, 7888, -16313, -39026, -22347, -12060, -30460, -34543, -35108, -22771, -14385, -16126, -6329, -6845, 2215, 6090, 10141, -4605, -10590, 16997, 21969, 23046, 4505, 6760, 20087, 31902, 24385, -12048, -21604, -14541, -4004, 25630, 16369, -14104, -25019, -22878, -5326, 7055, 14051, 37031, 26716, 13279, 4089, -11801, -11632, 7838, 27821, 32163, 16410, 6180, -12825, -14825, -10701, -2993, 18488, 6885, -7791, -12414, -3141, 4701, 912, -7134, -10003, -10329, -19894, -2554, 3142, 9971, -15509, -17706, -7252, -6001, -51406, -57222, -21082, 2290, 5029, 502, 10836, -1357, -42517, -42105, -35068, -18924, -9340, -2720, -8429, -3986, -14058, -20787]
20832b0787k437Q660j574J9659P330m18j1607k3248P99j6432Q320M5635J2973
20819B6873L157k4844k2295m672K1620K1238N177O142n116k4955l0397k754Q179
20806b2647K6262j4765k0220J5531J5991J7208m44J8678k5167l3138j02m124Q954
20793a7983O573K095P385j8562r359K4160l674N843N445k6382P376Q286r526L443
20779a4880J8000J716Q553j1631p559O06p31j330J0972L827J039m295K1441j3667
20765A2061l5060M481K1018J7204p825l663j1192Q82n247n077j6847O275K3096
20752A06M30p54K0090L20L482N071j7377j2051L61J1998J5766o32l3509l2712
20738c9411n230N625L1087J0120j5191j3438K505J8443q890k593P863K1871J9096
$$ y = [-20787, -23224, -14564, -16138, 3521, 10851, 10433, -1174, -24422, -23623, -40055, -31735, 13900, 26873, 30030, 5186, -17109, -21781, -161, 21077, 26254, 32396, 27280, 2325, -28072, -30826, -22647, 3615, -11150, -31370, -15839, 152, 17360, 16916, 35594, 10427, -22711, -22813, -26937, -17983, -11410, -9315, -1930, -20492, -29851, -5691, -9365, -3522, 1923, -24459, -17083, -8797, -18323, -14880, 3120, 4836, 13389, 1758, -5801, -5195, -5926, -7256, 3716, 7543, 8582, 4287, 25728, 12061, -22999, -18518, 2500, 19704, 11879, 8216, -2976, -2094, -7341, -12418, -29265, -22990, 106, 536, -218, 19872, 20192, 23674, 28745, 11368, -683, -322, 11676, 27442, 26810, -6699, -39411, -44641, -39016, -7929, 2191, -13000, -26438, -23933, -5490, -14380, -16973, -9110, 12761, 31857]
20725C1857k0144r935o683o387p626J8577j474r449Q192K749j8542j9862P84L108
20711c4835Q108K6541L05k3789j530J0195J3491L670k024j7453l335m249q826
20698c3731M894J1480J282j5606J1767J3647K0902M005K577J2423j505J3563K7043
20685G2741P216l1554k3016j1106P381J3267l805k9235k5950q729J0150J3203
20673i437K509o57k6733L936q773L1671J9300j5324o853m994L2163K3087K084
20660D1979r373j2742l039Q792K77m671o651k0956j1785j0644o46J2049J1587
20647e823K2247P92k8626o419p587N35R284o265q424Q529P478P731l555p249J4990
20632b362N504k3487j2126O737L767J1140L1473K2j045k4542k876J2584P084J9048
$$ y = [31857, 11713, 1778, -4905, -11292, -18918, -341, -1815, -11264, -3072, -323, -18865, -38727, -37943, -34835, -26727, -186, 119, -23670, -25200, -15005, -1514, 2156, 132, -17321, -20656, -24905, -33731, -28837, -17357, -16075, -31681, -19914, -6267, 14635, 18640, 21217, 33640, 32135, 45698, 72741, 79957, 48403, 25387, 14281, 21662, 34929, 31124, 1889, -24061, -32790, -22640, -9437, -6928, -7585, -34318, -30382, -39155, -7484, 11816, -3508, -10361, -15355, 16808, 39895, 41979, 32606, 19864, 16825, 25617, 25894, 21223, 14572, -6384, -18169, -28813, -29459, -17410, -5823, 16424, 17216, -11410, -17829, -25416, -24881, -15597, -21862, -30286, -21757, -14279, -6548, -10103, -17352, -2362, 3142, -20345, -32471, -25734, -21967, -10827, 20646, 20668, 19623, -4919, -7795, 4789, 11873, 30921]
20618C0921K4850M855n396P250p195k1974q019J8372n041k1579k8843R848L2653
20605C0702L777q294m161k465m525j5693q906j9065m392L2092J9363K4100j9362
20592B3171j4013l882o254P000M134K1840j5511j4467M935j2367j5137Q589j316
20579a3278P05p372l2703J1938K4382j0033j0872j1995K8866L9446P88p52K829
20566B1949l220k1911j351L512j2866n766K538J0J2862K9874J1493l7474M605
20553D255Q583K1654p96l4962k5271n459K070P876K7015r839k0633K845J9260
20540c402k909k1773m488k3846J2228K8418J2891r962J9901P325K735P225J361
20527B5704k417j5083j4991j7798n637m260k6444j096K4369K9501J199P785Q472
$$ y = [30921, 55771, 60626, 55230, 62480, 55285, 33311, 25292, 43664, 38623, 17044, -11799, -1951, 30702, 34479, 26185, 22024, 19559, 15034, -659, -9565, -28630, -33022, -930, 18433, 42533, 23171, 9158, 5276, -978, 6022, 10156, 31996, 16485, 2018, 6953, -5414, -20551, -11962, -13278, -12573, -19945, -52648, -40710, -16328, -26361, -37233, -49228, -20362, 19084, 19872, 19120, 21949, 18729, -3182, -4533, -1021, -13887, -19653, -17115, -17105, -4243, 25631, 37124, -350, 4255, 12838, 34492, 33696, -1266, -26537, -31996, -29926, -22050, 4965, -4874, -25507, -22662, -3402, -6311, -28084, -32572, -56418, -44190, -15772, -2881, -12843, 7058, 14383, 17118, 24343, 25704, 23287, 8204, -6787, -24585, -30222, -34482, -60926, -62022, -37653, -8152, -6953, 832, 9304]
20514I304o503m038q672j2401K3467J7752j4315j5273J1310K1851J7865l560k110
20501C4677j4350n287j0805k7151O394K3807J8377p760j7605P35m235Q307j0926
20488e822j7158o782J7794m33j3076p786j9323p723j2636K0469L2574J3840J7283
20475A1221k9290j2738j7229j155K6409L994K727Q159M320j1134K5885J6104q951
20462A8322k392r281j3814J0273j9090j6388R168L512j834J8125L6102Q97o022
20449B7578P535j6009R547J0822j0997j8737j4558J2695M803k5108J6957m312
20437B16j9020o571k1580k7457J382K7541K1177J7425J5164P854j4897K64O359
20424G857M139r805j3277r903k7868N811J3139J4267J423L858L2358J0457J4379
$$ y = [9304, 2801, -1237, -9909, -22310, 1157, 18909, 4594, -10679, 631, 22482, 40347, 36787, 34677, 20327, 15040, 4235, -22916, -16522, 7285, 25662, 17902, 297, 1032, -3203, 5104, -5822, -22980, -29762, -11968, -12401, -25477, -33263, -52586, -60309, -72945, -52476, -19902, -6062, 11221, -18069, -30807, -48036, -49191, -22782, -18788, -16061, -7902, -3582, -14716, 11169, 27273, 18322, 15930, 6649, -7165, 3108, -15982, -32370, -23202, -19690, -21524, -3399, 32703, 33600, 27578, 35113, 19104, 28651, 39473, 28476, 9739, -4819, 7876, 12679, -12429, 4528, 216, -18804, -25375, -46955, -74412, -73030, -45489, -24312, -6887, 8277, 16131, 1234, 1498, 7857, 11996, 2191, -11086, -20989, -48857, -43046, -29907, -15640, -14217, -10359, 21999, 32456, 46835]
20411D6835j9749k1294N455J3779j5203j5251j404N975N177k0457j3799J0818
20399a9118N716n644j6792j256K2104J524j5588l2602K6239L9177Q244K3690M872
20386D0566j7264m027R687M78k527m707j2828j1398n84j7999r156p910J6920K2741
20372A992j3411j4994J3173J1372N857o62J5651j3843l0516k748J6003J1700j4730
20359a5156j0537R623j6536l650J9648p226r499N797J597J2366m5O177K2079k107
20345A2531j1099K595J0585J2903j8059J5147J2890k2591k4747j199Q317r00k312
20332e939r420J498j6369k1292j8726J5287J5140j937R569Q435q0P164P133J6981
20318G444Q083O166n091N749N060Q454k8207J870K1744n265l5734j0503K4926
$$ y = [46835, 27086, 5792, 11247, 25026, 9823, -5428, -6832, -857, 4320, -16137, -29936, -19118, -13402, -19046, -35838, -37094, -14990, -13466, -29054, -61656, -35417, 3760, 12004, 35694, 40566, 23302, 19275, 28962, 29440, 26913, 22206, 9378, -2020, -2604, -20603, -29759, -37669, -20749, 1992, -11419, -26413, -13240, -1868, 3989, 3327, 18978, 5135, -25381, -28129, -12126, -426, -15156, -25693, -16070, -32606, -36256, -16608, -23834, -33333, -27536, -25939, -13573, -13618, -7441, 14638, 12531, 1432, 4027, 14612, 27515, 9456, 24603, 37493, 14902, -9845, -11044, -2727, -3627, -5939, -15359, -13861, -30230, -51522, -70248, -54961, -39821, -41758, -32189, -23754, -23834, -16670, -9537, 7444, 15527, 21693, 16602, 22351, 27411, 35865, 7658, 9528, 31272, 26007, -9727, -20230, 4696]
20305D696J1245L556o286O783k098k776r741O24L6171P844j0773o286j6737j6883
20291f61K6636m057p923j4912r970L295o837r036k331J8339J4293N170K963K121
20277A7090n501r174p572R618J7002K346L067J6675l135j3579m154j4300Q9j7090
20263h618k845P765J566Q011M698J174k5171j0213N107p350M060K9906M6242p863
20249D6469k3271o316k0197j7312j5772J676K815R426j4925k8941J7445M6565
20237b338J3197r108k8027J8171K7713o416K4020l1805j4636J2043K1794j490
20225B3118j7426p526k8545M358J4233j4802M649K7696Q485n216L769P098l370
20212A6521o261q031R339N904l6317J222K468J2083l653j1875J3865J7097J6692
$$ y = [4696, 15941, 19497, 13211, 19994, 17896, 15120, 5379, 6003, 42174, 50018, 39245, 32959, 16222, -661, 25975, 21918, 13995, -917, -10887, -7592, -14429, -23465, -25796, -7457, 6836, 12006, 14969, 17090, 11589, 2415, -5157, 4461, 21463, 23809, 26876, 43551, 40416, 26837, 22683, 8383, 8472, -8618, -11463, -3698, -2132, 5879, 10577, 11751, -13420, -23633, -18526, -25876, -21816, 8090, 54332, 46469, 23198, 16882, -3315, -20627, -36399, -34723, -31908, -22482, -37407, -66348, -48903, -2338, 10859, 1751, -26276, -8105, 19608, 13192, 37212, 5407, -9229, 2814, 24608, 23118, 5692, -1834, -30379, -26021, -11788, -26590, -21941, 5755, 14240, 9024, 12793, 19891, 16521, 10260, 2229, 11568, 17472, -18845, -17623, -15155, -3072, -6725, -18600, -4735, 12362, 29054]
20199B9054J1227j3071j8342O569j0433n139O480r633O095J724J1938J1608K537
20186C0614Q069j8667k9309J41K349k6395j7745L6716K0694R197J9608K817P141
20173D5230j294k0396j8716q108j5509o789N534J4583l736n233L349J2015L493
20160D423R334k578K936R945m121k6051N075Q902K2641N503m32o738N502m173
20146C0168j1090q643r381J0834j5524j5948j0439L76o84M385l553K814J5840
20133a0845O419j0579J5557J5155o766l8957j183L7235J6812K600J095k9865j8843
20120b2165k969J7802J1460J4005K9736j610J178k3896M09O76K2131K331k4569
20107B4519l0140q425J1643L7553j0789k857j9259p012j1415j7470q246o504m861
$$ y = [29054, 40281, 27210, 8868, 15437, 5004, -135, 6345, -3288, 2807, 4531, 16469, 28077, 30614, 38683, 20016, -9293, -9152, -6803, -33198, -50943, -14227, 6467, 15664, 35272, 38089, 45230, 43936, 23540, 4824, -3284, -18793, -25582, -20048, -5465, -9201, -14434, -11085, 930, 4423, 13757, 11179, 14115, 24060, 19939, -6112, -1037, 7865, 30506, 36009, 35577, 28839, 34341, 30168, 19078, 10435, 1054, 11888, -3636, -19584, -30023, -29647, -30331, -25946, -29499, -26685, -10845, -4426, -15005, 552, 15707, 8941, -30016, -31199, 6036, 22848, 25448, 26543, -3322, -22165, -25134, -7332, 4128, 18133, 47869, 46259, 47437, 23541, 23950, 24626, 46757, 49088, 24519, -5621, -14046, -2403, 35150, 24361, 21504, 2245, -4767, -16182, -33652, -41898, -48402, -53263]
20094e3263J4771K7178J6007p438k760o954j4862P337K7722j1736k2761R881j1511
20081b8389P03J8080q295k3947K709K5505M45J402J533J7744j896K8668L227l2930
20067D559r616m119r153K214K6576n999k4066k867L5371K5934l3238n489M792
20054D899j0408P220J0652j6943j3586j0017J4704K1750l477k5746J9383R205
20042G636L3761r281k3296k2174o007j4088M524J3864O996J2517J2311N84k1137
20029c790j9216j8851J619K6305k641J5038J1770K6295O168l5375j0430J0116
20017G008J1133J0598p797m46l1044k3377k055L784o367J1718J3640K4951M357
20004A6103j5563l6223J7325K3605R002J6327q385J881r177l654l3016l3741J6728
$$ y = [-53263, -38492, -11314, 4693, -2745, -5505, -12459, -27321, -19984, 7738, -3998, -26759, -16878, -28389, -27686, -9606, -17901, -41848, -39139, -13634, -13189, -11787, -10254, 7490, 5594, 34262, 37489, 4559, -5057, -9176, -18329, -16115, 10461, 4462, -19604, -22471, 12900, 38834, 5596, 107, 4899, -5509, 1711, 12363, -4580, -18166, -28183, -13479, 8271, 4794, -20952, -1569, 7636, 41397, 32116, 8820, -13354, -19361, -33449, -28925, -15061, -8065, 4452, 16763, 17347, -3790, -23006, -41857, -40238, -13933, -16574, -1536, 10234, 36529, 42697, 7322, -3108, 7008, 18141, 28739, 20942, 20496, -10548, -33925, -35980, -32196, -38563, -26845, -13205, 11746, 16103, 540, -35683, -18358, 5247, 14249, 30576, 22191, 24072, 14895, 11241, -21775, -55516, -38788]
19991c8788L1499J9619O17j4467n960J1942L152L2196j7987n116Q066n229n134
19978A4410k1288L051m918J324J4493R48j3316K870J0251r613l978m408P106j3313
19964a6381j8579j524o728j1985K7540K4308K0351Q176j1983j2000J9321q192
19952A2324r06k8275n942K0150J6729R123k597p899O112k8759k2035L2456k590
19939b109l618L863r983o315j0871L36P835K6435q071N615R594n089o671R713
19925A0664J0479k1643l7963K1395K5384l402k4713r07J7685j9182r224J4486
19913a6941L0728K1158j5116l921k750j4132n697L440P425R51j6326N16J6428
19900E763j1777J8910K1397j3690j3562p779M181R650J2319J0301k7126j1799
$$ y = [-38788, -7289, 12330, 12947, -1520, -7480, 4462, 7614, 39810, 21823, 16707, 24773, 19544, 14410, -6878, -3827, -8745, -7421, 7072, 8020, -5296, -2426, 7825, -1788, -5766, -10174, -3068, -16381, -34960, -36484, -43212, -55197, -27657, -3349, 17002, 25178, 13195, 1195, 20516, 12324, 11418, -16857, -22799, -2649, 14080, 23203, 20606, 12707, 18819, -9940, -31975, 481, -2109, -5727, -1864, -11847, -18162, -29033, -28697, -20862, 5573, -2498, 3117, 12711, 7622, 951, 10664, 21143, -500, -38463, -17068, 8316, 4914, -19799, -20706, -3021, -22203, -31427, -16941, 13787, 34945, 19829, 15908, 13158, -974, -6671, -3231, 4194, 5145, -11181, -10665, 5763, -6014, 12896, 34293, 20603, 7041, -738, 3443, 13093, 25412, 35713, 8587, -3212]
19888c212J7529K631O048K1156Q950j9934k5163r457l044K6623Q668j8445m249
19875H101J7777m591k0013q321M57N321Q353r33j118K1997j510J7756J212k2011
19861B2477O408k4287k9609p828j911m712o343j0421j4253K0335O728j2728Q660
19848d7484K7872K6296P836J548q499R933k2657K170j6111J644P635P1J7739n397
19834B596j7672n623Q311j9044j5523K3981L6887j93q224j4008P123m605N674
19821c20O610L545l266k017j8526K7954j4221k322O078P52K6062K3465k5099j3196
19807A5499K4054o736k9788l488r311q012m100N755K3093l834k7716n063l297
19794c2944K2238l134J554k531R403K8859K6029p961l5554J4078R766j8719j6808
$$ y = [-3212, 14317, 16948, 22996, 44152, 53102, 33168, 8005, -1452, -4496, 22127, 30795, 12350, 8101, 25878, 21287, 1274, -7047, -6590, -1269, 7084, 6151, 5033, 27030, 25520, 43276, 44488, 22477, 28885, 4598, -25011, -32839, -34750, -39462, -45805, -56226, -70479, -50144, -43416, -56144, -47484, -19612, 6684, 14520, 16068, 7569, 17502, -5155, -2985, -19096, -17452, -9817, -9746, 7993, 2596, -15076, -20699, -12388, -31432, -46955, -22974, 13913, 13720, 5496, -8512, -1389, -5994, -320, 6290, 9835, 6569, 4552, -13974, 13980, -241, -2563, 3515, 4267, 30329, 53794, 28695, 15499, 39553, 32817, 3029, -459, -9770, -17782, -21882, -16127, 6966, 3132, -24584, -29647, -32944, -10706, -13840, -12286, -14817, -5414, 23445, 49474, 41513, 5959, 20037, 29803, 11084, -5724]
19781e724n73k64J2777r73j1597r59M742K3788Q208k0954o803l308J0424o020
19767B764l642N755K5081j0851N186M078p035J2319k0317j2285K0612j184J8285
19754C8766N413N09r303j8652k6014k7824j0760L1229K7106M93l0596j5792M1124
19741E699K2890J685p692j6260J5644o183M539n469k0073j9022k5997m940J7342
19728c7837R011m315m887J2129M397M546J9575J3198r743j2883J0919N944j9795
19715i741J4344N110n921l564J3687N793J0186j2451L567L4308J3722l7319r309
19702B2412R623k1095q623J7552k283k1218o182J6244M619L2575L578k9900j0700
19689F602n760r109L6524Q604l1308k440k3927j7781K1392Q022L691J1717J0989
$$ y = [-5724, -6297, -6561, 6216, 5243, -6354, -7313, -2571, 21217, 29425, 8471, 1668, -1640, 8784, 2764, -878, 4877, 29958, 19107, 24293, 28371, 21336, 33655, 13338, 1053, 21665, 20481, 38766, 44179, 44688, 35385, 16733, -9281, -37105, -47865, -16636, 10470, 10963, -19633, -35425, 5699, 28589, 30274, 22582, 6322, 21966, 15783, 20322, 14853, -5220, -24242, -50239, -55179, -37837, -28826, -33141, -38028, -25899, -21502, -16956, 2619, 15817, 6074, -6809, 4110, 10054, -9741, 4603, 9713, 3792, 228, 13915, 19708, 29894, 17443, 21010, 55318, 69040, 31721, 22412, 32035, 10940, 2317, 19869, 17586, -3632, -9814, 6430, 11049, 43624, 47202, 17302, 6602, 842, -8267, 28257, 36861, 5553, 3113, -20814, -38595, -17203, -9181, -5490, 6227, 17216]
19676A7216L745p445k851n75j5030K7586Q068j6312j2513j9274k929L900k4688
19663d1102k4042J7609K7168l104k661l013k483j8491J6198K6276J3356m966k804
19650b059L1312K1040m590l5966O011O586O940j9552p773o884j9922j4713J7899
19637b1671J9781P910j9304o81j2907j0061J764J9008k83q315Q559L731k789J7545
19623B287j249J430J2532j700J8283r855l4419j2338K0287P04j8813j0359J3642
19610a9568r573j3470J9915J7981N250K357k6362k4882J3729L9943P534j9060
19598f206k2338m600J7667K874L2606K6476j9169K09K574j3539m168J9191M464
19585C6041j3002j3035l055n994J0221K242q929K1556n417j2337k5080R050L9029
$$ y = [17216, 20961, 13516, 10665, 10090, -4940, 22646, 30714, 14402, 1889, -17385, -20314, -16414, -41102, -65144, -47535, -20367, -23471, -26132, -29145, -31628, -50119, -33921, -7645, 5711, 745, -2059, 29253, 50293, 45703, 9737, 15748, 22334, 29274, 9722, 1949, -4935, -24857, -39570, -21671, -1890, 6020, -13284, -13965, -26872, -36933, -35169, -16161, -16444, -24759, -16200, -12469, -15258, 2287, 1038, 2468, 15000, 13300, 31583, 21728, -12691, -25029, -4742, -4038, -22851, -33210, -19568, -29141, -42611, -22696, -4715, 535, 2892, -23470, -48352, -34623, 5320, 12854, -6206, -28544, -33144, -15477, -12603, 20003, 46479, 27310, 27519, 30093, 16554, 12386, 31577, 36041, 23039, 10004, 6949, 955, 11176, 13418, 4489, 26045, 20628, 8291, -16789, -7739, 31290]
19572C1290J3706k560j4805k9731r529O342k934j1689J6215J2373L0521K134j7760
19559B3573K2637J5976j4207k7007j468O615l3829j376j0125J8451k8018l246
19547c2024J0997J0115r298n619M024J1967j2554l702o642J2866J9470R072j6477
19534g805j1087k814J1491m075j8747J1004K4786J7862J6684k755P72j2575l253
19521A9488j1997J7187K0970N121j9029J16l813k7267p064o985l398J6556R473
19508I358N997J8241M988K0345m329l905l245r483j4906j9536K928L9233j5111
19495C0575k1190j3995k3240P428M8241K184N864r680j5532J0490p167k4570k728
19482a3320q455p623J1667K519j1171K796J9681J7594k383q707j938J5399k389
$$ y = [31290, 44996, 42436, 27631, -2100, -11629, -5287, -8221, -19910, -3695, 8678, 39199, 41333, 23573, 46210, 62186, 47979, 20972, 19504, 26119, -7710, -9086, -19211, -760, -28778, -32024, -21027, -10912, -20210, -25829, -21805, -9838, -22392, -26094, -32736, -19870, -400, 8672, -7805, -18892, -21706, -10215, -14290, -33037, -22033, 2753, 20615, 37299, 34544, 35316, 22741, 19488, 7491, 24678, 45648, 50769, 31740, 31856, 28043, 776, -6288, -13273, -16671, -115, 9358, 15355, 33596, 38584, 58929, 54600, 50695, 47450, 37967, 23061, 3525, 6453, 45686, 30575, 9385, -4610, -27850, -20422, 27819, 30003, 35867, 26187, 10655, 21145, 13978, -10592, -13320, -21775, -29398, -17731, -15212, -26383, -23587, -3906, 13688, 11305, 2598, 660, 16059, 13670]
19469A3670L0583L1634j6944j9059M534J758L365L110j6042k3309k226J3142L2884
19456E7100p438p607j2571K070K686o799J3460p79Q3q171L702m05k6579J0189
19442A8941m760P531Q250p459q858o989M884M510r896p387J6051P669Q636O116
19428C7239J5249k0432k1554j7023j1301m491J8857j230j3527P184j7334L362
19416b5001j5715J851P499K2766J6964K0142j731k3100q491K5734q268l512P557
19403A6695J548J4367L128n329l757J2699j1170l0211p38L2316l356Q832l9317
19390d293l7994M868L0370Q802J9189m203O535N271O64j1446k776j3404M666L6078
19376D2327o835k1995j7070J2682J8440Q93j6370j5747j3060N533k6351M533n253
$$ y = [13670, 44253, 75887, 58943, 39884, 44418, 46176, 49541, 52651, 36609, 13300, 11074, 24216, 57100, 49662, 42055, 29484, 31554, 34240, 27441, 40901, 40122, 40205, 32034, 35736, 35331, 8752, 18941, 14181, 21712, 29962, 22503, 13645, 6656, 11540, 16050, 6154, -1233, 14818, 22487, 31123, 37239, 52488, 32056, 10502, -6521, -17822, -22313, -3456, -4686, -18213, -11029, -28363, -25001, -40716, -38865, -31366, -8600, 8364, 28506, 26775, 3675, -4816, 20918, 12650, 9138, 16695, 18243, 32610, 35738, 30409, 26652, 39351, 28181, -2030, -2768, 29548, 26192, 35024, -4293, -42287, -37419, -7049, 1753, 20942, 16739, 23274, 28545, 29209, 17763, 14987, 1583, 6249, 42327, 35492, 13497, -3573, 9109, 27549, 28442, 12072, -3675, -16735, -11202, -37553, -33020, -38273]
19363c8273P259J0493K0269o180m991L5379P776j8592K604k1453J1932K895N168
19350A4286M599l912N79k29n092k1K238O785l725J5520M441j7672J0023K3514
19336E1334N804o376j9721M101N983j480m384l427J6530L3388k0251k2172L952
19323D3281j363L7348K0251k2964q781J0623P265L5607K968j1280j2280Q23Q78
19310A02376P264J2591k1259j2455k016j7169k1580j2067j6217n069L912J5989
19298C4300L7192J160n27p776n692k2923r063L2648q300L463j5330J3895J7093
19285G0140o985k1645l0107K1711j3769k8215p802j4192M694P842Q943N743J98
19272c444O151K4712K1424L314o11l0578j2058K469M311k920j3498J78K098m775
$$ y = [-38273, -31014, -20521, -252, -6432, -11423, 23956, 31732, 13140, 15744, -5709, 6223, 9118, 14286, 18885, 14973, 15552, 15323, 10231, 10210, 12448, 19233, 15508, 31028, 35469, 17797, 27820, 51334, 57138, 50762, 31041, 35142, 41125, 39645, 35261, 31834, 48364, 81752, 61501, 39329, 43281, 41918, 79266, 99517, 76553, 67772, 78395, 85660, 121267, 124235, 112955, 100675, 101498, 102376, 109640, 122231, 100972, 88517, 86501, 69332, 47752, 35685, 19468, 14399, 18311, 34300, 71492, 72652, 72125, 64349, 58657, 35734, 26671, 59319, 51019, 54482, 39152, 53047, 70140, 63155, 41510, 11403, 33114, 19345, -8870, -16672, -30864, -26170, -18328, -9385, -3642, -3444, 2707, 27419, 48843, 52157, 51546, 20968, 8910, 11379, 15690, 12770, -728, -550, 1548, -3227]
19258c227k3248J5464K9507J2006K177P292k5778k8265J2198R412M947j7519j2544
19245a7578n439n11K0072M7053J2451M443k2402n707J5452m476P508k2842k179
19232B5845j0006j5326n570Q894J249J0891N84q284l109J5485K6965j8979k7412
19219A227n066O546j0926m849k0698L467K3253K5015L385O418J3067P414J5468
19206F3721j0634k5198j5134J8596K6052J9189q695l3883k5210j8256j2098K1439
19194a11Q099O008K5690J8423j1260L317Q710j8143k7778j7602J057J800K611
19181H21m466q331P9L921j4421K8836J2819j9051J7827K5370m285p987J4507j891
19167D3748j2337K923K2774k4171o626Q393J9093R75K926l0613l3238P966J3518
$$ y = [-3227, -26475, -11011, 18496, 30502, 32679, 39971, 14193, -14072, -1874, 7538, 12485, -5034, -17578, -23017, -23528, -3456, 43597, 56048, 60491, 38089, 32382, 47834, 43358, 50866, 28024, 25845, 15839, 513, -5057, 3837, 5086, 15977, 16561, 8277, 5168, 20653, 47618, 28639, 1227, -3839, 2707, -8219, -13068, -33766, -30299, -7046, 17969, 21354, 27772, 40839, 48253, 63721, 53087, 27889, 12755, 31351, 57403, 76592, 67897, 34014, 8804, -9452, -21550, -111, 7988, 13996, 39686, 58109, 46849, 50166, 58876, 40733, 12955, -4647, -3590, -1790, 821, -3645, -11976, -11897, -7976, -22397, 6439, 19258, 207, 18034, 43404, 39119, 31132, 45639, 43748, 31411, 34334, 57108, 32937, 26311, 34704, 53797, 54772, 57698, 27085, -6153, 1813, 15331]
19154A5331J0155J619O736J9042J6104j609r908r413J453j4922K28n594k3798
19141E424q732K4087L0164J2347J8793M275j4680j7557p920j9355j105m625P974
19128B9090n614k6524j3211J0541o078K982N418N976K094j2407K2724R899j58
19115B4732J2115K330r457J2965J3904J7325p150k0811k1534Q848p2j2190J9722
19102D0727J4732j4212R097K0253r637M531K2498K4431O018L7629L6808L8388
19090B31263J03802K9623l8694j6974l2382M04P5423J55770K05905R0796n4815
19079G50121q9163j03194p8029j1492K3961J5418R796N7311J04672M7884l1960
19068F95325K6237J00919J56168L2206r6165j34840j43106j12349p0412n723N7619
$$ y = [15331, 25486, 27105, 33841, 52883, 68987, 67378, 57470, 48057, 49510, 34588, 34816, 29222, 5424, -3308, 20779, 50943, 63290, 82083, 86358, 71678, 54121, 46201, 26846, 25741, 21116, 29090, 23476, -3048, -16259, -5718, -11796, -8814, -3396, 2580, 4674, -7733, 14991, 24890, 24732, 36847, 39177, 29720, 42685, 56589, 73914, 66764, 45953, 24419, 33267, 33195, 21005, 40727, 55459, 41247, 50344, 70597, 60960, 65491, 87989, 112420, 118438, 156067, 192875, 231263, 335065, 364688, 325994, 309020, 276638, 277042, 352465, 508235, 714140, 804936, 750121, 660958, 557764, 479735, 468243, 492204, 507622, 517418, 574729, 679401, 727285, 695325, 721562, 822481, 978649, 1010855, 914690, 779850, 636744, 524395, 453983, 448260, 505879]
19057E05879J00069N7227o9150r7594q2500q7706q4621l2184k1129l8472j5683
19046A34136j4413j5246J9229J8534Q333K835J3459j72L7175R8275J14064J05052
19034E21261J2894n5031n0079q4242o3211j4034N4801M0800R3343K24783K01568
19023H82853J7441p6427n1404m5252n946J27413J55398J7740q6777j39925j20405
19012F74709r0271j1308P2614J79009J90321o1732j25004j45942j48543j08870
19002D24983o7254m3261J5529M8344m712n1191m7111l9597m2691j0875m2647m463
18990A35054M494r172j9162o807J1479j543m569j5724R796R162l4466k7265M501
18977E5778P025l7159r380K3893K5832j3689k1996O829P629q658k6587N990L3162
$$ y = [505879, 605948, 663175, 594025, 496431, 413931, 326225, 241604, 209420, 188291, 149819, 134136, 119723, 104477, 123706, 142240, 150573, 153408, 166867, 166695, 203870, 302145, 416209, 521261, 534155, 479124, 429045, 344803, 281592, 267558, 322359, 363159, 456502, 681285, 882853, 900294, 823867, 772463, 727211, 721265, 848678, 1004076, 1021816, 935039, 795114, 674709, 584438, 573130, 645744, 824753, 1015074, 953342, 828338, 682396, 533853, 424983, 357729, 314468, 329997, 378341, 373629, 322438, 275327, 235730, 193039, 182164, 139517, 135054, 139548, 130376, 111214, 104407, 115886, 114343, 109774, 94050, 103846, 113008, 78542, 51277, 55778, 62803, 25644, 16264, 40157, 65989, 52300, 30304, 37133, 44762, 36104, 9517, 15507, 48669]
18964D8669Q255j3368L81L220o227J4151j4454j2343K642J3008J2979k8447k490
18951B5976P902J4766J4883M0386k213j7023q35k9309o365J2177K296L496J9651
18938H5788l539k5127o190K302J6018J2377Q344q087l0389J833K1792j4062k6465
18925C4595L803L3675l97j3465j1834k77M7579N608j5514L2733j0583j1310l484
18912I1129q961j5734K4055J0925m911R281j5099j427k906O560M656l9854o235
18899E1479O39N610J0153J756k636k2024k863J0565j2290j216R00m603M240J4902
18885E4612J7390m769r568m356R484Q242J4068K644j0417k2443j6466j5523J1987
18872C4885J3854J5610L576r770L478J6411K1836j4571l6142j6926L07O130j78
$$ y = [48669, 56924, 43556, 43937, 47157, 40930, 55081, 40627, 28284, 30926, 43934, 56913, 28466, 25976, 33878, 48644, 63527, 103913, 101700, 84677, 83842, 54533, 48168, 60345, 62641, 66137, 85788, 82249, 57122, 50932, 53234, 69252, 81629, 89973, 81886, 51497, 53330, 75122, 61060, 34595, 38398, 72073, 71676, 58211, 46377, 46100, 93679, 99287, 83773, 116506, 105923, 94613, 91129, 82168, 66434, 90489, 101414, 96503, 105784, 90685, 89258, 86352, 92912, 97568, 57714, 51479, 52118, 57728, 67881, 69637, 67001, 44977, 42114, 52679, 40389, 39173, 40073, 35470, 39710, 54612, 72002, 67233, 57665, 53309, 62793, 71035, 85103, 87747, 77330, 54887, 38421, 22898, 34885, 48739, 64349, 67925, 58155, 61633, 78044, 99880, 85309, 49167, 32241, 32548, 38678, 38500]
18859C8500p144l408k2309J8494L6751l69k1094P478k967R262J5154j618p441
18846E9289j0747m783j6644K5373K6834j5406o164J7624J595j6993M256j4748
18834D9486J240J941PK3526l828j8520q470m031L1449L6163P609k4263j5620Q346
18820H5035N78j7009l761j631N445j650Q435J9441k6090j1043K6004j8960o214
18807E8580K4191J2615l184k1941r569N5343J4695J2170J9164M0561L4768K2142
18795B59535j8293k3744k511k5764m1881p180P350j7782j2841K1857K5324K4135
18783A88205L0944p267k6061k2726j8618r813l9585J0058n224o17J769J7223J5757
18770A34045J2259K938K2824L8504L9865L8605P3116J1423k3567k7807n6055m2960
$$ y = [38500, 31356, 27948, 5639, 24133, 60884, 60515, 39421, 46899, 43932, 53194, 68348, 66730, 59289, 48542, 43759, 27115, 52488, 79322, 63916, 57752, 75376, 76971, 59978, 64234, 49486, 50726, 52667, 52674, 76200, 72372, 53852, 45382, 41351, 72800, 108963, 116572, 92309, 76689, 85035, 85613, 68604, 64843, 63212, 68657, 67007, 75442, 94883, 68793, 57750, 83754, 64794, 58580, 82771, 95386, 92202, 70261, 60692, 116035, 130730, 142900, 162064, 202625, 237393, 259535, 241242, 217498, 214987, 189223, 147342, 140162, 147512, 129730, 116889, 138746, 164070, 188205, 219149, 211882, 185821, 163095, 144477, 134664, 95079, 105137, 99913, 99296, 101065, 118288, 134045, 146304, 149242, 172066, 210570, 250435, 289040, 362156, 373579, 350012, 322205, 266150, 223190]
18758B23190k5681k1375k7564k0835Q390J4384j0498J1724N1193L9824L6369K694
18746B81815j9735K0446K3145M5557M479k8571j9335L0436O272l1279l0264j1328
18734B71638k5703l7162p748K8638l210Q481o996k8251j5174j1898q592n341J2908
18721A71590L1866j6435l2426J6483J3857j9607j4034m860k3808k9406J7602M9269
18709A60091J611j3706q961q066N264J8197K064J452J7916L7024K2505j7751N203
18696B22843L2631J9257K0977j7250j6349j4292k0442j7444M851k0862j481P92
18684A93231l8717l1839N53K4644M5j5498Q406N1689K3114L1426R2532J269l697
18671C37158M4273l2504j4209N7823J6414q658k0262j7560k7784j8759j3210K16
$$ y = [223190, 197509, 176134, 148570, 127735, 136125, 150509, 140011, 151735, 202928, 242752, 279121, 281815, 262080, 282526, 305671, 351228, 355707, 327136, 307801, 338237, 344509, 313230, 282966, 271638, 245935, 208773, 201025, 229663, 226453, 234934, 227938, 199687, 184513, 172615, 164023, 158682, 171590, 203456, 187021, 154595, 171078, 184935, 165328, 151294, 146434, 122626, 93220, 110822, 160091, 161702, 147996, 139035, 130969, 136233, 154430, 156494, 157946, 175862, 212886, 235391, 217640, 222843, 255474, 274731, 295708, 278458, 262109, 247817, 227375, 209931, 214782, 193920, 192439, 193231, 154514, 122675, 123228, 147872, 147917, 132419, 140825, 192514, 215628, 247054, 339586, 340855, 337158, 381431, 348927, 334718, 392541, 408955, 400297, 380035, 362475, 334691, 315932, 302722, 302938]
18659C02938k5306R79L7835K9444n253N402L834l1274m0724l5445j713J7159K6906
18646B84782J3960P43K1188N7214P1833L5477J8710j5536n2078o7997l5620l6017
18634B96659m3475p804J1778L5822J3116K3108M8187K4618K2292K4940N853M352
18622D59446o373K985K0934J8710M7786N8180K6347m942P0818K0028l6827Q0407
18610G57499P2889k6036j0112j6317l9631k9265K7618N558K9061L9841K9102N5919
18598H96126L1093L3396j4439k8905k3822j5610M2375M1741M4553P0527J34780
18587A211815J13596Q5224J08033J21630J33107J39220J62010J81148L26095N76236
18577C158114O79285L67720J45884J74046K08501K51919K56857M00012P66676
$$ y = [302938, 277632, 278611, 316446, 345890, 340637, 346039, 349873, 318599, 277875, 242430, 240717, 257876, 284782, 298742, 299485, 320673, 377887, 449720, 485197, 503907, 488371, 436293, 368296, 332676, 296659, 253184, 245380, 257158, 292980, 306096, 329204, 377391, 402009, 424301, 449241, 455094, 459446, 453073, 456058, 476992, 495702, 543488, 601668, 628015, 623073, 693891, 713919, 677092, 757499, 830388, 804352, 794240, 777923, 738292, 709027, 736645, 742203, 771264, 811105, 840207, 896126, 927219, 960615, 946176, 917271, 893449, 877839, 920214, 961955, 1006508, 1077035, 1211815, 1325411, 1410635, 1518668, 1640298, 1773405, 1912625, 2074635, 2255783, 2581878, 3158114, 3837399, 4205119, 4351003, 4525049, 4733550, 4985469, 5242326, 5642338, 6409014]
18568F409014J409406K666407M971194Q168333P826212M45057l521732m400948
18560B3972943m891631l639408j726819k34368P94719J401763J519676J503406
18552A8700281K127896L385189N519525R074400J5228766K6829442M8569293Q5519106
18544B14953898J05501025L2822946k7800139l2676348m6495372o0219588m7788204
18537A38298218l3193405k4315193j5040978o407524J204825R350970J8777743
18530H8674656K4168802Q184578j2868129j8163233k0009050j8368690j2834599
18523C8784335p847239m849515k983592j746078j330768j252412r65878q29234
18515A6979619o88487m13761j40054L28626O53786N55824P02235J064658J749578
$$ y = [6409014, 7818420, 10484827, 15456021, 23624354, 31450566, 31895623, 28373891, 23972943, 19081312, 15441904, 13715085, 13480717, 14275436, 15677199, 17196875, 18700281, 20828177, 24213366, 29732891, 38807291, 54036057, 80865499, 129434792, 214953898, 320454923, 353277869, 325477730, 292801382, 246306010, 186086422, 138298218, 105104813, 80789620, 65748642, 59341118, 60545943, 69896913, 88674656, 112843458, 121028036, 108159907, 89996674, 69987624, 51618934, 38784335, 30937096, 26087581, 23103989, 21357911, 20027143, 18774731, 17808853, 16979619, 16291132, 15877371, 15737317, 16065943, 16719729, 17275553, 17977788, 19042446, 20792024]
18506B0792024L035366N391154R459372J6414204K6925031L0887192J0114321
18499A23018664r824262j4651213j6949923j4676689p879368l36862P679329J8166337
18491H4546013L3874349N0687553N2490645P1127727J04137061M9733041n5009795
18484C91586594p4468285p8505933p6245387n3411016l1154938j7916076j1070959
18477D8814000p296859n109657l634316k697610k524185k043963j056306L29253
18469B4780357K566831O040798R906670O501290l828888p001198p661032p700245
18461B3604583n659605l411216j946091j284742r68030o65075l22038j14584m51836
18452H781366r17365r11963r10861q12581n86689l95240k97579k55169k20876
$$ y = [20792024, 23827390, 29218544, 38677916, 55092120, 82017151, 112904343, 123018664, 113194402, 98543189, 81593266, 66916577, 59037209, 58700347, 66379676, 84546013, 118420362, 169107915, 221598560, 292726287, 396863348, 446596389, 391586594, 317118309, 238612376, 162366989, 108955973, 77801035, 59884959, 48814000, 41517141, 36407484, 32773168, 30075558, 27551373, 25507410, 24451104, 24780357, 27347188, 33387986, 43294656, 49795946, 45967058, 38965860, 31304828, 23604583, 17944978, 14533762, 12587671, 11302929, 10334899, 9669824, 9347786, 9233202, 8781366, 7864001, 6952038, 6041177, 5228596, 4641907, 4246667, 3949088, 3693919, 3473043]
18443C473043j90950j85556j83238j82786j40940p5950o8447p5923n5745l3597
18433B279911m5988j15752j25384q2230n8618o5441o8431l7439l9490Q641M1076
18422A690855L4360J0951R388P1597L6844k1422l8534K5665J1252J930k9058p7539
18410A726289o2167n6199m2374J3782j0951l6390n3361n565M3820O0882N3440
18399A631206M751o102j8614p404K6660j2618q9648j36104j19568j02653n8591
18388A111315m9583o7369r4006p6127l0352j3790l8495m0924j8671k0541o659
18377F54798k5011k9185R263r034J6035J8194K6926R008j0173j9257N096k5879
18365F20781j7286Q144K1782O5379J00093M3577P1J5147K8376J0820j580m9449
$$ y = [3473043, 3282093, 3096537, 2913299, 2730513, 2589573, 2513623, 2445176, 2369253, 2313508, 2279911, 2233923, 2118171, 1992787, 1910557, 1851939, 1786498, 1718067, 1680628, 1641138, 1649779, 1690855, 1725215, 1736166, 1745554, 1817151, 1853995, 1832573, 1794039, 1819704, 1830956, 1832886, 1803828, 1726289, 1664122, 1607923, 1565549, 1579331, 1568380, 1531990, 1478629, 1473064, 1516884, 1577766, 1631206, 1635957, 1629855, 1611241, 1603837, 1630497, 1617879, 1528231, 1392127, 1272559, 1169906, 1111315, 1061732, 994363, 900357, 824230, 793878, 780088, 741593, 700669, 681998, 661457, 654798, 629787, 600602, 609865, 600831, 616866, 635060, 661986, 670994, 660821, 641564, 646660, 620781, 603495, 611639, 633421, 698800, 798893, 842470, 842541, 857688, 886064, 896884, 895304, 845855]
18353H45855l8065J231J8126M3546K9404n084l0916l0009m252K3603K5667n288
18341H73818l5931o2550m563K4984j1953n6770o9660p0923m6814k6805K4907J4038
18329E51778j9047k8804j2082J828k3305k5611p017k8950k0430o568j2124J0818
18317C80486p42O652J1668k2541m5364k9062k223K308p790j7247N01K7027Q238
18304C11911K603J3290k6828l0787k5247j3409J1968J0970k238K4476M0106M3137
18292C59952L5735l901q048p539j4005j8235k9993j9143k1310P545L0223K2743
18280C34024j0197k5774p901J0829k212K1471K2308m956j3732k6368k5121j5929
18268B56442j8482j7735q352L194J1443J9815L2113K2870J149J3665r472J3495
$$ y = [845855, 807790, 809021, 827147, 870693, 900097, 895013, 864097, 834088, 829836, 853439, 879106, 873818, 837887, 775337, 770774, 795758, 783805, 727035, 657375, 586452, 539638, 512833, 537740, 551778, 532731, 503927, 491845, 493673, 470368, 444757, 437740, 408790, 388360, 381792, 369668, 380486, 379744, 386396, 398064, 375523, 330159, 301097, 298874, 301182, 293392, 276145, 276646, 303673, 311911, 314514, 327804, 300976, 270189, 244942, 231533, 243501, 254471, 252233, 276709, 316815, 359952, 395687, 391786, 383738, 376199, 362194, 343959, 313966, 294823, 273513, 281058, 311281, 334024, 323827, 298053, 290152, 300981, 298769, 320240, 342548, 337592, 323860, 297492, 272371, 256442, 237960, 220225, 211873, 215067, 226510, 246325, 278438, 301308, 302457, 316122, 306650, 320145]
18256C20145J6398J2072N893j3181j1723J1575M218o254N72L2639M0134J2838
18244D25326l3392m9631k2249j4605L258j071j812j5112J3024L4341K3164L3364
18232C94605j2727J2142M718J987P336k602J0304j3177j7871P725K755j3435o738
18219C75022j1076q778o20K3201o70k033K8729L5535K370p024j4366r813Q832
18206D19309j4250j4631r750R41j9781m3057l915J4398j1313j6341o575q705j6592
18193B69738j4567J7917k306M303k2331J1775L940M17j0140o405M3435K1629k0249
18180B97156r775l316J5147j3791r311l504K2373K7367j6502k0547J2192J614
18168B99103j4721l0948K391K6246L0171j4806k8748o841K2272K0347J5994J1784
$$ y = [320145, 336543, 348615, 354508, 341327, 329604, 341179, 345397, 339143, 339715, 372354, 412488, 425326, 391934, 342303, 320054, 305449, 308707, 307636, 305824, 290712, 303736, 338077, 361241, 394605, 381878, 394020, 398738, 400725, 408061, 405459, 415763, 402586, 384715, 392440, 395195, 381760, 375022, 363946, 355168, 354548, 377749, 377079, 375046, 403775, 439310, 441680, 434656, 420290, 410477, 419309, 405059, 390428, 380678, 381619, 361838, 318781, 314866, 329264, 317951, 301610, 295035, 286330, 269738, 255171, 273088, 270782, 275085, 252754, 264529, 268469, 268886, 258746, 252341, 295776, 317405, 297156, 287381, 284065, 299212, 285421, 276110, 272606, 294979, 322346, 305844, 285297, 297489, 299103, 284382, 253434, 255825, 282071, 312242, 297436, 268688, 261847, 284119, 304466, 320460, 332244]
18156C32244p74L672j0113j6065J7918J9856J0059K6448J9736R525J908J4457
18144D28871P900R415J895k324L287j0496J4375J7309K8533K2967J6026J645k3906
18131E15497k8047r3O581N6742L1549L9649M7726J5709K1950L8361O8990Q7279
18119I01893J15115J25635J49450J81971K36338L33412M61652P36879J194254
18110D436599J963350L546171O773409J3151196J6706092n5639q462932q004728
18102C0053518r595551p688697m426280k304833j338615q89806o29820m45621
18094B734295l68630k79794j91643j56187j39725j24596j23982j03918p9637p1519
18084A094664p2179o1375k9201m6856n1023k6385j9552k3470l4784m0386o503
$$ y = [332244, 331470, 335142, 325029, 308964, 326882, 346738, 356797, 383245, 402981, 412506, 414414, 428871, 436771, 446186, 448081, 445757, 449044, 438548, 452923, 470232, 498765, 521732, 537758, 539403, 515497, 487450, 487357, 493938, 550680, 582229, 621878, 669604, 685313, 707263, 745624, 814614, 901893, 1017008, 1142643, 1292093, 1474064, 1710402, 2043814, 2505466, 3242345, 4436599, 6399949, 9946120, 16719529, 29870725, 46576817, 46521178, 38058246, 30053518, 20457967, 12769270, 8342990, 6038157, 4699542, 3809736, 3179916, 2734295, 2365665, 2085871, 1894228, 1738041, 1598316, 1473720, 1349738, 1245820, 1166183, 1094664, 1022485, 961110, 931909, 885053, 834030, 807645, 788093, 764623, 729839, 689453, 682950]
18073F82950p390m3665l0042l4611j5530k0539j8176K6340J6742p343k3824k1380
18061E03532j5521n372j7706q529J634j534J1660l133j1923l3655k7769K0184
18049D11868J7862P418K987j4651j1683m405j5766J0859J3434L001K9356J6691
18037D66971M967l974M711J9197j5190k1317p300J7513k879M374J0007K8839N3511
18024E59430P8746J21623J41801J43411O2456k6742p0001o4811J0385Q265J07296
18013A071859J36816K1091k1472J996o8751l6486J8797K3481n287o6004p1106
18002A004934r7911q2944j5083Q495j8588j8543j8504k2425Q999m805L9266P4610
17990H57501O4769K8390O224k0487m4200k8738k1624M706J607p685k4008L491
$$ y = [682950, 675560, 631895, 601853, 567242, 551712, 531173, 512997, 539337, 556079, 548736, 524912, 503532, 488011, 482639, 464933, 456404, 458038, 456504, 468164, 465031, 453108, 419453, 391684, 411868, 429730, 437148, 440135, 425484, 413801, 409396, 393630, 404489, 417923, 420924, 450280, 466971, 471938, 467964, 472675, 491872, 476682, 455365, 448065, 465578, 462699, 467073, 477080, 505919, 559430, 638176, 759799, 901600, 1045011, 1107467, 1080725, 1010724, 945913, 956298, 964563, 1071859, 1208675, 1229766, 1208294, 1210290, 1141539, 1105053, 1123850, 1147331, 1142044, 1076040, 1004934, 907023, 824079, 808996, 817491, 798903, 780360, 761856, 739431, 748430, 743625, 782891, 857501, 922270, 950660, 956884, 936397, 892197, 863459, 841835, 846541, 848148, 840463, 816455, 819946]
17978H19946J0482M8252O5113K4601K3641J06430J98256K56122K00742K8009l2271
17967A749323k1153K024J16710L19747M05426J66786j60551k58791k58590k24167
17957A836764j75730p3768l0484P819P2179P3674J11867K07122K89525L20195
17947B639163K30268J8706n7391k7625q0902j36863j37550j45758j21418o0481
17937B120149j5703L0965O0426R8940J11726J48368J44302J69590J86799K52020
17927C307582L45739L44722K96022L07395L96012N75506Q76968J271679J553256
17918I274881J330626P64488O59942J164777K185905L295400K765658N92484l23670
17909B1710491j23065P83365K370874K653157R22952K30942R04054K594882N897084
$$ y = [819946, 830428, 878680, 943793, 968394, 992035, 1098465, 1296721, 1552843, 1753585, 1781594, 1749323, 1728170, 1730194, 1846904, 2166651, 2572077, 2738863, 2578312, 2319521, 2060931, 1836764, 1661034, 1587266, 1556782, 1564601, 1636780, 1710454, 1822321, 2029443, 2318968, 2639163, 2869431, 2888137, 2830746, 2803121, 2722219, 2585356, 2447806, 2302048, 2180630, 2120149, 2104446, 2135411, 2195837, 2294777, 2406503, 2554871, 2699173, 2868763, 3055562, 3307582, 3653321, 3998043, 4294065, 4601460, 4997472, 5572978, 6449946, 7721625, 9274881, 10605507, 11369995, 12029937, 13194714, 15380619, 18676019, 21441677, 22034161, 21710491, 21587426, 22370791, 24741665, 27394822, 28317774, 28548716, 29452770, 32047652, 37944736]
17900C7944736J0495963J4462880J3007605P482568P013913J1224929J9444890
17893A21077484L1174170K8422577O449731k606311j538200J686261J3310635
17886A97976347J6769394l156926j4400707j5821372j8086944j3485251n952969
17879A43841572n910045p540886j0629213j4423754j3985250j0143117m880170
17872G6329137j249379l526815p264932p783623p172848n426912l302879l005445
17864C7596304l792999l746163l387354k755071j737586o94623M03858J621519
17856B3507885K781823K979735J955432J598045K500548M553352P437487P847914
17848E5162221L675785J130694K054127M980430R170789J2272673J1613759Q988864
$$ y = [37944736, 48440699, 62903579, 75911184, 83393752, 90407665, 101632594, 121077484, 152251654, 180674231, 187123962, 184517651, 182979451, 184665712, 197976347, 214745741, 211588815, 197188108, 181366736, 163279792, 149794541, 143841572, 137931527, 130390641, 119761428, 105337674, 91352424, 81209307, 76329137, 75079758, 71552943, 64288011, 56504388, 49331540, 43904628, 40601749, 37596304, 33803305, 30057142, 26669788, 23914717, 22177131, 21482508, 21886366, 23507885, 26289708, 29269443, 31224875, 32822920, 35323468, 39876820, 47314307, 55162221, 58838006, 59968700, 62022827, 67003257, 76174046, 88446719, 100060478, 109049342]
17840A09049342M950798M312986O853954J0655799J8531415K0471043M931265
17833A79756602p123309p937657p023656K066410R361270l230897j8047275j9751029
17825A28070459j9390254j4648406p845266p463630j0647223j0937537j0403015
17818D6735128q739626n844064k925702r71524j098377k108319k112968j623542
17810B1311006p03404K69876k07099j679426k137887k049054j639421j021000
17802A2143591q01813j050187j195778j178840j082447q42146o20146m45075m26736
17793D500423m27928l76145k99173k55200k20353j97583k04977j72598j68887
17784B177579j76136j62087j13008r2930j01702p8930p4552j32370j02361n0816
$$ y = [109049342, 114000140, 118313126, 125167080, 135822879, 154354294, 174825337, 179756602, 172633293, 164695636, 157671980, 159738390, 169099660, 165868763, 147821488, 128070459, 108680205, 94031799, 86186533, 78722903, 68075680, 57138143, 46735128, 37995502, 32151438, 29225736, 28254212, 27155835, 25047516, 22934548, 21311006, 20607602, 20877478, 20670379, 18990953, 16853066, 14804012, 13164591, 12143591, 11341778, 10291591, 9095813, 7916973, 6834526, 5992380, 5372234, 4927159, 4500423, 4072495, 3696350, 3397177, 3141977, 2921624, 2724041, 2519064, 2346466, 2177579, 2001443, 1839356, 1726348, 1633418, 1531716, 1452786, 1378234, 1245864, 1143503, 1092687]
17774A092687o6497o7376m7307o0042o8806o1274l8222j5728q803l6395o4712
17763E57525n0359K224J3445k0234k7690m086j904j4103k3519n618j4999k453
17751D08229j3686r274j0277R164k879l1477j2573j0093M140l1127k4290k0120
17739B55737k2499p930K591J8640Q58k2887l5174j1171M589J1431J1867o311l9423
17726A60318J094K8544R00k2187q535J3357k848o966q013k16K71L375j0019k2818
17712A26257J0352P245J9741r04j1019m89K6210R355J064J245l0176j382O716
17699A64215m717M172J06o753k4165K0282o83j2747k1303m5071j0775K1824J6150
17686A00535k63K72l893k0455J8450J051L997l215N605J5013j1874L360J0632
$$ y = [1092687, 1026190, 958814, 911507, 851465, 782659, 721385, 683163, 667435, 658632, 622237, 557525, 507166, 509390, 522835, 502601, 474911, 470825, 468921, 454818, 431299, 425681, 410682, 408229, 394543, 385269, 374992, 384156, 381277, 349800, 337227, 327134, 331274, 300147, 275857, 255737, 233238, 225308, 227899, 246539, 247397, 224510, 189336, 178165, 182754, 194185, 206052, 199741, 160318, 161412, 189956, 190856, 168669, 160134, 173491, 170643, 163677, 155664, 155448, 155719, 159094, 149075, 126257, 136609, 143854, 163595, 162691, 151672, 151183, 177393, 186748, 187812, 189057, 158881, 157499, 164215, 159498, 163670, 163776, 157023, 132858, 153140, 152457, 139710, 118407, 73336, 62561, 84385, 100535, 100272, 100544, 96651, 76196, 94646, 95697, 99694, 96479, 102084, 117097, 105223, 108583, 119215]
17673A19215l1517p48N019k3852o665P561m554j0282o933j2096m503J1059J7813
17660E9517j027M564J2569r74l3863j8995R028L723j5753j0012m496O055J8479
17647B8815p49m709K8203J8217L038R048p638l0836J385m687r240P610J0126K0499
17633F9082J6739J0343p813m1588l93J7204J2949L385R446j702l0017k4264k3979
17620I392J693J856M070J5462j8198j9924K633L5262M040n764r569j393j6760
17607B800J388N200M4292L568j1224k6580l7011J5067n354L357J2258O160j8831
17594d910L266J041O830J5392j0953K7439N499N480K9252j7983k9584J0724R976
17581E1469Q512n645j7498n097J9851N180j5776j2377M15J8857L0150q218j1881
$$ y = [119215, 87698, 86950, 91969, 68117, 61452, 69013, 64459, 54177, 47244, 35148, 30645, 41704, 59517, 58490, 63054, 75623, 74649, 40786, 21791, 30819, 34542, 18789, 8777, 4281, 10336, 28815, 28066, 23357, 51560, 69777, 72815, 81863, 74225, 43389, 44774, 40087, 30847, 38457, 48583, 69082, 85821, 96164, 88351, 46763, 46370, 63574, 76523, 79908, 89354, 87652, 57635, 33371, 9392, 11085, 12941, 17011, 32473, 14275, -5649, -3016, 32246, 36286, 30522, 20953, 19560, 2800, 4188, 9388, 53680, 57248, 46024, 19444, -17567, -2500, -7854, -4497, 7761, 13921, -4910, -1644, -603, 6227, 21619, 10666, 38105, 43604, 49084, 78336, 60353, 30769, 41493, 51469, 59981, 54336, 36838, 31741, 51592, 56772, 40996, 28619, 29034, 47891, 78041, 69823, 57942]
17568E7942j5894l2521L2417O880l2777j5737Q853J4152m0645o615K0489j22J121
17555b457J9864k2193p177n57K5505O699j8509j5725k7270q605J9168J4586o569
17542b3240P58J5968L836p548n788R028K5424K4983k9507j6248J6347J110m417
17529A0706o66j1906J6030J0286o783K073P648P39N098K0230j9846j0224j6981
17516F404N552R837P814l735j2820J1392L957q831k3658J6749k997J1474J0632
17503C1770k281j6220k3612q058p471J1034m667J0167J1911K6247M171j87l6809
17490d005l0887Q890K0943j357K554J5640n836J647M668J6796j2405k7436P606
17477c182p517l1251L337K9715K5214j3046j6643K2890L7109j2847k6408o681
$$ y = [57942, 42048, 9527, 41944, 48824, 16047, 310, 9163, 23315, -17330, -23945, -3456, -3578, -2457, 17407, -4786, -11963, -12520, 12985, 19684, 1175, -14550, -41820, -50425, -31257, -16671, -23240, -22482, -6514, -2678, -10226, -16014, -6986, 18438, 43421, 13914, -2334, 14013, 15123, 10706, 10040, -1866, 14164, 24450, 17667, 19740, 27388, 28127, 33225, 53455, 33609, 23385, 6404, 11956, 21793, 29607, 25872, 13052, 24444, 28401, 19570, -4088, 12661, 9664, 21138, 31770, 29489, 13269, -10343, -18401, -25872, -14838, -19505, -9338, 2573, 28820, 32991, 32804, -4005, -34892, -26002, -5059, -6416, -3862, 11778, 5942, 7589, 12257, 29053, 16648, -10788, -3182, -10699, -41950, -38613, -8898, 16316, 3270, -13373, 9517, 46626, 33779, 7371, 690]
17465F90j1866j071q051L603K2751k1005p702K2603L1590l8743r792J6806J5673
17452A5486k3048r689l130K4690K5365j4100j1966j384J9082M1325L6467O8466
17440A67564R5404O233m4865l8401n6277o4973m0907J397l666j5851k4624q908
17428b7874P312J9214J3948k8895q054Q394K3237K4964K2354p083k2682P920k0578
17415A2177q528N705j3428J4629K8734K2328N280k0083j6389R945R855q673J9581
17402F1133m132r127r172N689P365k7821o429K1057r433j8987J2423J7583J1983
17389E2132j1211L0264L7209K6913J3070K9304L4169J7911Q58M5948K7820N503
17377C09890K2538M8399O7131O8673K9559j8247J4787M1190O4460O5367P574k6447
$$ y = [690, -11176, -12247, -20298, -16695, 6056, -14949, -22651, -48, 31542, -7201, -16993, -187, 15486, -7562, -17251, -20381, 4309, 29674, 15574, 3608, 2224, 21306, 62631, 99098, 167564, 262968, 269201, 224336, 185935, 129658, 64685, 23778, 25175, 21509, 5658, -18966, -27874, -20562, -1348, 12600, -16295, -24349, -15955, 7282, 32246, 54600, 47517, 24835, 32755, 12177, 3649, 9354, -4074, 10555, 39289, 61617, 66897, 46814, 30425, 40370, 50225, 41552, 61133, 57001, 47874, 38702, 44391, 51756, 23935, 17506, 38563, 29130, 10143, 22566, 40149, 52132, 40921, 71185, 108394, 135307, 148377, 177681, 211850, 229761, 230619, 276567, 304387, 309890, 332428, 380827, 447958, 516631, 546190, 527943, 542730, 583920, 648380, 713747, 721321, 694874]
17365F94874k6514j4972n151K2696L8990J3145o202m0691m753L5354K0263j4374
17353G12665l9924q0456m5501L742q564m4312l2255m5867n2681j8867Q058k0073
17341C35965k7834j9487k3316j4828m034O621q825j738k4614k9141n035K0610
17329B04344L1533j1601L76M5146L6097N4528O3705M3031l368M41K9951P4890
17317E69073Q8155M3562R48m6521m1683J94L5483j550n5376m8023m9762j2242
17305D82258J9137K2998j4853m3143n671K2206Q021J6451K0672m2361j2103J2073
17293D85685L2430K1404k8880m0220n2933l8841k3255j5055l9713n3509n3223
17282A93890m4201l5325k0698j0243j2936k0205j862J4461Q633l2108j7195k2752
$$ y = [694874, 668360, 653388, 648237, 670933, 709923, 723068, 716866, 676175, 671422, 706776, 727039, 712665, 672741, 592285, 546784, 550526, 541962, 497650, 465395, 419528, 366847, 347980, 356038, 335965, 308131, 288644, 265328, 250500, 246466, 253087, 244262, 242524, 217910, 188769, 183734, 204344, 235877, 224276, 224652, 269798, 305895, 360423, 424128, 467159, 463791, 464232, 494183, 569073, 657228, 700790, 701738, 655217, 613534, 613728, 649211, 647661, 592285, 544262, 494500, 482258, 501395, 524393, 509540, 466397, 460726, 482932, 490953, 507404, 528076, 485715, 473612, 485685, 518115, 539519, 510639, 470419, 417486, 378645, 355390, 340335, 300622, 247113, 193890, 149689, 114364, 93666, 83423, 70487, 50282, 48420, 62881, 71514, 39406, 22211, -541]
17270e41j9507L662r227K6786M4771Q547j1340k4085j3302j2577J0058J6805k0490
17257d40k9351K801l206P794j492L234L6602J0580q830J0780j3486P94J0658j
17243B6437k8699k0882K4274p930j056n860j7084K882J6712j251R867P633l0016
17230b4973J960K2463L288K829j5227p834J370J229J1836j7706L009J4995J1078
17217H317L079l645j8105J2171M302k526L18j7200J4101R279j8686R56o946k044
17203a6629k0353R644M134J0793K3343m659l0103j5369k193k222r944n926K6624
17190c2860L0585l39O815l408j2394J3220K5204k0499k8339K616Q885o076o518
17177b3108R000j9766l078j6182k7102n110M2718J4238K5907M052l4878O814J5101
$$ y = [-541, -20048, -16386, -25613, 1173, 45944, 54491, 43151, 19066, 5764, -6813, 3245, 20050, -440, -29791, -26990, -30196, -22402, -23894, -20660, 15942, 26522, 17692, 28472, 14986, 15780, 26438, 26437, -2262, -23144, 1130, -6800, -7856, -13716, -30800, -27918, -11206, -12457, -2590, 5043, -24973, -23013, -550, 2738, 5567, -9660, -17494, -16124, -14895, -3059, -20765, -17756, -2761, 8317, 11396, 7751, -10354, 1817, 6119, 3593, 3911, -13289, 812, 10091, -8595, -7639, -14585, -16629, -36982, -27338, -23204, -12411, 10932, 6273, -23830, -39199, -41392, -43614, -53558, -59484, -32860, -2275, -2614, 4201, 793, -11601, 1619, 26823, 6324, -22015, -19399, -10514, -16590, -23108, -14108, -33874, -36952, -53134, -80236, -85346, -42628, -28390, -2483, 1569, -33309, -26495, -11394]
17164a1394K955l066j0738K8405K0672m787m982j1384J332L629L84M13J4150r371
17150A6218j4669j0779j4823q863j678j2444j848j691J9616P461l350j968n904
17137c4722L525L5263J53J6636j160j0073j3115q618j1719J6492k188Q391K7836
17124B6701j4631m0413k8141P154J6679n822K0409j4559j4880J2115L6458J5583
17112A6653L07l081j0259l041J8805L2452j3810k1730j5625N77j0170p177K1219
17099E120M225R450q745j0799j236K933L378j5880j5075J6357K3955K231j845
17086A4069j2842j3966L502M1849J5759k0070j9333k0477M10R682k8264l803J4035
17073a9449J1690j485J2664R068k1055q354k76J5389J0083j426j1976k3465J6423
$$ y = [-11394, -8439, -11505, -22243, 6162, 26834, 22047, 17065, 5681, 7013, 10642, 11026, 11439, 25589, 16218, 1549, -9230, -24053, -32916, -34594, -47038, -48886, -50577, -30961, -23500, -26850, -28818, -34722, -31197, 4066, 4219, 20855, 19695, 9622, -3493, -12111, -23830, -7338, -9526, -1135, 26701, 12070, -28343, -56484, -49330, -32651, -38473, -18064, -32623, -47503, -35388, 1070, 16653, 16960, 13879, 3620, 579, 19384, 51836, 38026, 16296, 671, 1248, -8922, -16099, 5120, 9345, 18795, 10050, -749, -1985, 948, 4326, -11554, -26629, -10272, 13683, 15914, 14069, 1227, -12739, -9237, 32612, 48371, 28301, 8968, -11509, -11099, -1417, -29681, -33484, -19449, -7759, -9244, 3420, 12488, -8567, -16921, -17197, -1808, 8275, 6849, -5127, -28592, -12169]
17060a2169m181k1090J847K5739J9761j7406l1346j1216O504J3097K7604j9219
17048b2075l5876L595O337n921J8121K0230K6941m543k2626k728N509K933J7011
17035F908M0189j3574n5915j8095k2368j8038J1909K6635K1438o039j6445L2130
17023a1265K2003K0078Q288k2192k8636J265l055J982J2590p189p102q650j1429
17010c3312j4215j7311k1828K1689J2214J1258L1971K9943j930p622m691K754
16998H920J130M742k4964k3461K089M299j1894J1437K1089k1635N497K4252K6865
16985B8366Q619j8335k9150K057j0632j7741p190o43L458L4043K4758p0j7029
16972E11p898L007O224J329r225J2886J941k3555O800K4581j7427Q486L459k2962
$$ y = [-12169, -16350, -37440, -35593, -9854, 9907, -7499, -38845, -50061, -43557, -30460, -2856, -22075, -57951, -54356, -48019, -53940, -35819, -15589, 11352, 6809, -15817, -18545, -13036, -10103, 6908, 47097, 33523, -22392, -40487, -62855, -80893, -68984, -42349, -20911, -26950, -43395, -11265, 10738, 30816, 39104, 16912, -11724, -10459, -13514, -11532, 1058, -6131, -13233, -21883, -33312, -47527, -64838, -86666, -64977, -52763, -41505, -9534, 20409, 18479, 10857, 6166, 8920, 10050, 14792, -10172, -33633, -31544, -27245, -39139, -27702, -6613, -28248, -22751, 1501, 28366, 36985, 18650, -10500, -8443, -19075, -36816, -44006, -44649, -41191, -7148, 17610, 17540, 511, -7387, -4380, 1844, 3173, -6052, 6834, 8775, -14780, -7980, 16601, -826, 7660, 11119, -11843]
16958a1843r003q756L878j7898J0464K503J398k932K6224J6889J1717n955p353
16945I333j1769k5826k2564j7658k3155L5816K8282m572P226o400n936j0362K1980
16932b5605J8924r975L128J8528J0081O946j0798j2773N699K81r115l9850J5056
16919b9473K5915j851k0287k710J996m4298J1806J9105K9036j515p845j7986J6047
16906b2060K897o891j4722O195M4653K5099R734J633p709k8965j6300k961q03
16893a0200j9829J2478K705M1760l770m8783j049K0119K706n929k3371J67N156
16880b7840J1781M887R40J3620R479L17K6186j0264m1884k5144N328L7009R466
16867A3881k8884k4370k9452L4625M5911Q881k6274k1948M061p688K0688J3820
$$ y = [-11843, -20846, -29602, -25724, -43622, -33158, -30655, -29257, -32189, -5965, 10924, 22641, 16686, 9333, -2436, -28262, -50826, -68484, -91639, -55823, -27541, -32113, -24887, -31287, -37223, -47585, -25605, -6681, -16656, -13528, 5000, 15081, 22027, 11229, -1544, 4155, 4436, -4679, -44529, -29473, -3558, -5409, -25696, -28406, -26410, -70708, -58902, -39797, -10761, -12276, -20121, -38107, -22060, -19163, -26054, -40776, -34581, 10072, 35171, 44905, 46538, 38829, 9864, -6436, -9397, -10200, -30029, -17551, -14846, 26914, 23144, -25639, -26688, -6569, -3863, -9792, -33163, -32996, -27840, -16059, -11172, -10232, 3388, 12867, 13184, 39370, 29106, -12778, -37922, -32594, 4415, 13881, -15003, -39373, -68825, -34200, 11711, 20592, -5682, -27630, -23569, -31257, -10569, 3251]
16855C251k7775o342P959m601o780K1603J0998p698J3760R079j3036k7980k6629
16842e4191m430Q873K304K7446J7994j6123M584P150r909J6486K7487k3990k2720
16829a9039O579J0871q264k1399N748P761k931j4153j1098J0252M1176J117k5905
16816a9285j998J6964L368k2412q788J6771J6901j732J7286J774k2353j1061j1134
16803b5699j6058l70J7570P761r705j2169o612l325J6360K1857K0885j3367N175
16790B303n461j3987j2842k0532j375j2949J7954K7557M655J3865P808j2039J325
16777c718n105j3885K339l915J662L8568p142l794r695r814l080m168p403q181
16763c7331K5136J6620q301p17j4608K453j9002o944K7377R236J0835r89k1530
$$ y = [3251, -24524, -30866, -22907, -27508, -34288, -12685, -1687, -9385, 4375, 13454, 418, -27562, -54191, -58621, -49748, -47444, -19998, -2004, -18127, -13543, -6393, -16302, 184, 27671, 3681, -19039, -12460, -1589, -9853, -31252, -25504, -17743, -20674, -34827, -45925, -35673, 5503, 6620, -19285, -21283, -4319, -951, -23363, -32151, -15380, 1521, -211, 17075, 18849, -3504, -14565, -25699, -41757, -42127, -24557, -16796, -26501, -38670, -45282, -48607, -32247, -10390, 10495, -2872, 2303, -3158, -17145, -29987, -50519, -51894, -64843, -46889, -19332, -14677, -812, 6996, -5043, -3718, -8823, -22708, -20369, -24284, -22622, 15946, 8804, 5010, -4685, -14499, -17579, -21747, -29150, -37331, -12195, 4425, -3876, -4593, -19201, -16748, -35750, -42694, -15317, -6081, 4754, 3765, -17765]
16750a7765J301j7502N385J1949J3681J8677M136l7745j6000J1733P462j5580
16738c0268m877J1297J4717N03j2300k5337N505J68J4237J0418J1124J3928j3939
16725d824o557N688n961r433m121J1522j892j418m558j526J9167K6588J704l9279
16711a4900k4524j1326J2205J6510K2361L908j4133l6189P305K1904P171O311
16699c397j4394J3911o502n611j5368k820l114P463K7216q861M60n686K081n549
16685b0171J2013j976k2954j3430K4469Q384J2372l517k2025m220j1174j6358
16673e8587K4811L1337J198l5752l0J8740m307J2634M3217J1941q852j5114j1807
16660I429k6111j4869M493p306j5107k2362O114J1535j0799J2868j2149j0831
$$ y = [-17765, -16464, -33966, -28581, -16632, -2951, 15726, 19862, -17883, -33883, -22150, -14688, -30268, -35145, -23848, -9131, -8628, -20928, -46265, -40760, -40592, -26355, -15937, -4813, 9115, -4824, -11381, -5693, -11654, -21087, -25208, -13686, -15578, -16996, -21554, -23080, -3913, 22675, 24379, -14900, -39424, -50750, -38545, -22035, 326, 4234, -9899, -46088, -38783, -16879, -9708, -3397, -17791, -3880, -10382, -15993, -31361, -34181, -37295, -29832, -2616, -11477, -11017, -16703, -14622, -20171, -8158, -10134, -33088, -46518, -22049, -13665, -1293, -4810, -26835, -31055, -42229, -58587, -33776, -2439, -1241, -36993, -37023, -18283, -22590, -9956, 33261, 45202, 36350, 21236, 9429, -16682, -31551, -27058, -34364, -49471, -71833, -65719, -54184, -64983, -52115, -64264, -75095]
16648g5095O441J7918l611L788M610K7637M314J1141k792l285P456J4256q110
16635D668p717J1335k0756j0052L872J5871k4574j4459P617J2428j7116L977K0102
16622a4804O093K1787M066k7975k4838O865J1060K657l911L2636P471j8072M133
16609G168J3828p684j3847m341k007K3512j750j1871k549q439q649j6003J3739
16596a8893K8130r634j7845m979L788J540k5944j7671O708K4046J7747r269o524
16583b8800J7897J2338l1902l443K9172r247o613J6637J1368j2672k0011k3527
16571d8803J0130L9855J6771P15q992p519J6585j3462O632m534j4055j2737k4665
16558d4079O537L1218K6844j0934j7563K498m526k0934K5268J1835k3543J1291
$$ y = [-75095, -68654, -50736, -54347, -50559, -45949, -18312, -13998, -2857, -5649, -8934, -1478, 12778, 4668, -3049, 8286, -12470, -22522, -18650, -2779, -27353, -41812, -34195, -21767, -38883, -34906, -14804, -8711, 13076, 17142, -10833, -35671, -28806, -17746, -15089, -19000, 13636, 21107, 3035, 7168, 20996, 13312, -535, -4876, -6883, 16629, 14879, 3008, 459, -7980, -16629, -32632, -18893, 9237, -397, -18242, -23221, -19433, -17893, -43837, -61508, -54800, -30754, -13007, -22276, -28800, -10903, 1435, -30467, -33910, -4738, -13985, -20598, -3961, 7407, -5265, -25276, -48803, -38673, 1182, 17953, 18668, 9676, 2157, 18742, 5280, 11912, 7378, -6677, -19414, -44079, -37542, -6324, 20520, 9586, -7977, -5479, -10005, -30939, -5671, 6164, -17379, -6088]
16546f088k3121Q19J3063J83n737l245m071J7379J0735J7254j0564J3719p535
16533A2791k1074q577j513j4224j5710L632K661N217J8869J5889L669M062k6457
16520b0765l0631n316K3083L7190O3943P34l9161k2709j7515k430J0294j0478
16508a3761l625J7043j6718n438l228O132Q054p2K242j0965R093M726J716O313
16494A512N522J5077n532l209N771j5647k1358l802J6536J5165L7402K299r297
16481D0439j2254j1199j7352J1406J9340q41n010j3709n84P339J6838j8236k4609
16468h432r580K2907K7921r790n847m651n202j0996P36j1600p338j2708q075m401
16454d7056J3075J3388k2575j2940M693O010J5527j768m471n140N306J0053L2822
$$ y = [-6088, -29209, -28390, -15327, -15144, -20881, -24126, -28197, -10818, -83, 17171, 6607, 20326, 12791, -8283, -16860, -18373, -32597, -48307, -44675, -42014, -36797, -17928, -2039, 1630, 5692, -20765, -51396, -56712, -33629, 3561, 67504, 68238, 29077, 6368, -11147, -13577, -3283, -13761, -17386, -343, -17061, -22499, -25727, -19595, -11541, -11613, -9371, -20336, -11243, -6517, -4801, 1512, 7034, 22111, 16579, 13370, 19141, 3494, -17864, -21666, -5130, 10035, 47437, 49736, 40439, 28185, 16986, -366, 11040, 30380, 29539, 24529, 10820, 10236, 17575, 34413, 16177, -8432, -18012, 4895, 32816, 23026, 17179, 12528, 7326, -3670, -2934, -14534, -21872, -34580, -42655, -47056, -33981, -20593, -43168, -56108, -51415, -45405, -29878, -31646, -36117, -41257, -35951, -25898, 6924]
16441F924J9729j9218j6282J1925k477N228K6207M401q537j9221j2574N617L444
16428E166K038j0530j3626N895j3744M565J2736Q88j0985J4325J3327k639k1153
16415a3737M378J0087J1698k8381P637K5099J4149Q014j7727j057J4151J3568
16403D7879J052j6235k2738k0630o852K7157L4474k243n0615k2028j9817K2685
16391b7911M1615L572k0917p989r286M883k3634K1947K2685K318j9738j0142J1738
16378a0859K1604M354j6071J7527j193K617k6831o100P565J9119r259l661M930
16365C742l4602J888J3507L459p087J4038N969Q765j426p160J5123j2770j2037
16352h591K313j875o421m245j2176j4745J0994K338J4852j538n297J3816R762
$$ y = [6924, 26653, 7435, -8847, 3078, 601, 5829, 32036, 36437, 27900, 8679, -3895, 1722, 5166, 7204, -3326, -16952, -11057, -24801, -20236, -7500, -6612, -17597, -3272, 10055, 7416, -13737, -9359, 728, 12426, -15955, -8318, 16781, 30930, 38944, 21217, 20160, 34311, 47879, 48931, 32696, 9958, -10672, -17524, 9633, 44107, 41864, -8751, -30779, -50596, -27911, 13704, 17276, -3641, -11630, -20916, -16033, -39667, -17720, 4965, 7283, -12455, -22597, -10859, 10745, 15099, -972, 16555, 15362, 17979, -8852, -14952, -7387, 11732, 2473, -1188, 3742, -30860, -28972, -15465, -12006, -19093, -5055, 914, 9679, 8253, 1093, 16216, 3446, -8591, -6278, -8153, -14574, -18819, -30995, -45740, -34746, -32408, -17556, -19094, -24391, -10575, -813]
16339h13R911M036j6240q766K3999K5983j0680J6283K793j4200k7967k1924J7713
16326A28L1256k0031k3635q082J7196j475k098k1949k4349l97N450J5627M4878
16313A2519n644j0879j5465j7655L996k667K5638j352j0537n863l526M744J4576
16300a2115j8961k4506J7042R454l325O691J4533J3311n353J3944M735K1102J8926
16287E5478M515j9493j1598J0317J3169j2070j7618j6956j1989k327J4644J6554
16275B2626R486Q644n53k3293j3771J5985m66k7244j0161R472J3342N065Q4m053
16261E163M526P827J086J2498k9006j8306l756k7494n623L2481K1678l36j7375
16248a6637k2646N55p361K2223J1059J5119J6257j1177j0818K592Q809j4820L59
$$ y = [-813, 9098, 13134, -3106, -11872, 12127, 38110, 27430, 43713, 46506, 32306, 4339, -17585, 128, 31384, 11353, -12282, -20364, -3168, -4643, -6741, -28690, -53039, -53436, -47986, -32359, 12519, 6875, -4004, -19469, -37124, -33128, -35795, -10157, -11509, -22046, -27909, -31435, -26691, -12115, -31076, -55582, -38540, -29086, -32411, -25720, -11187, 2124, -3229, 10715, 15450, 36552, 55478, 59993, 40500, 28902, 39219, 52388, 40318, 22700, 5744, -6245, -8572, 6072, 22626, 32112, 40756, 40203, 16910, 3139, 19124, 18658, -8586, -18747, -9275, 4067, 9132, 9216, 5163, 9689, 17516, 18602, 31100, 2094, -16212, -19968, -47462, -53085, -20604, 1074, 738, -16637, -39283, -38728, -46089, -23866, -12807, 2312, 18569, 7392, -3426, -834, 7975, -6845, -6486]
16235f486n856j4723k3785p134N738J5275M658J6352J2783j8496k2475K0932J912
16222b1305j5386K7116J508n480p267j4294M399M210P535m477K1881K237M943
16209E620J2968j6854o980J1821j1992j8072j472R763K524Q74p942j7800J7030
16196b0512M5915j0365j149m448k6293j5799m396O197R017r706j2631J7857K1957
16183d356J3661k5948J261R1n503P058j397j0980K7490j1525k1311J8684m318
16170a7093o342p447j2389l157J0454K8911P882J4630m291r281r231J9131R026
16157B0803k506J245J593k2490r196R769L6912L3212k5144j2558J381k4840j6110
16144g929K589k506J2732p811n124j7000n572o430K3545J4277k2713J4241K721
$$ y = [-6486, -12342, -27065, -50850, -57984, -52246, -36971, -32313, -15961, -3178, -21674, -44149, -23217, -21305, -36691, -9575, -8067, -13547, -20814, -35108, -30709, -26499, -18964, -23441, -1560, 677, 5620, 18588, 1734, -5246, 6575, -5417, -23489, -24961, -15198, -12674, -11800, -19742, -37542, -20512, 25403, 15038, 13889, 9441, -16852, -32651, -37047, -30850, -21833, -31539, -44170, -26313, -4356, 9305, -16643, -15382, -15291, -20794, -13736, -15133, -26113, 1377, -10148, -31459, -12775, -17093, -23435, -30882, -43271, -46428, -35974, -7063, 819, 15449, 11158, 1877, -7354, 11777, 20803, 18297, 19542, 21135, -1355, -10551, -782, 36130, 69342, 44198, 31640, 33021, 8181, -7929, -5340, -7846, 4886, -2925, -8049, -25049, -30621, -37051, -13506, 771, -21942, -7701, -4980]
16131d980j677j574O247J2827p183j5062q235r338M271J0986K661k9844J6901
16118b4000L2639j5173K0998l795j3980k9205j6614K0941P756N989j072K751j1004
16105b3769k2967J5962K8069j907M024j1176j5245p39J5213J9001k1027K0516
16093E955L4743j9678j5292J2202j2705m89J589l861n343J1812J6344l194N702
16080B7785j394m4660k1444R482J9304J5770k0306j5647M105k303l85R751k6011
16067d5953q5L234M175l491O582K6866R964j4852j3647J3354k0221K5458K7343
16054A8727J0288k342j5620j3585j9375J87J9408K5854p319j9166R157k4164k498
16041b0448K7503L766J9919o343l018R048j65p937k3773K4669J1072k4091R397
$$ y = [-4980, -6657, -8231, -1984, 10843, 3660, -11402, -19637, -28975, -24704, -13718, -11057, -40901, -24000, 8639, -6534, 14464, 10669, -3311, -32516, -49130, -28189, -20433, -14444, -15516, -12765, -23769, -46736, -30774, -2705, -4612, -588, -11764, -27009, -27748, -12535, 6466, -14561, 5955, 40698, 21020, 5728, 17930, 5225, 4736, 6325, 2464, -2879, 8933, 25277, 22083, 27785, 26391, -18269, -39713, -30231, -10927, 4843, -15463, -31110, -27005, -29308, -29693, -19942, -45953, -46038, -42804, -38629, -42120, -35538, -8672, 1292, -13560, -27207, -13853, -34074, -8616, 18727, 29015, 26673, 11053, -2532, -21907, -21720, -2312, 23542, 16223, -2943, 6214, -17950, -20448, 7055, 10821, 30740, 24397, 21379, 30427, 30262, 22325, -1448, 23221, 34293, 10202, 19599]
16028A9599j1025j2062J4857N170l304N782K723N315l996J2799j6680K02J2434
16015C1814l022k6668k6567q791J5171J1839m372n846N426r532P469J050K58J7220
16001E449j3609j7642q087K8578q549j9615q654M5593J1446p509l4950j8069M317
15988d1301J3142K2651O324J6272M5337k3699k5385j2603j5379J7747P653j2585
15976a826m77J3187j769j5586j3001K0077l77Q479O557P18N457m730m004k4349
15962a1644j8541j0794m055J4567J4836J2825J2691j188p052n612k0170J592J2765
15949i780k2044M42K3900k915M58J835N427r133m787j4595R593L3867m964n900
15935A404J1034J9363R867k3718l463q668k8223N95N961M746L275p76P761q400
$$ y = [19599, 8574, -3488, 11369, 16539, 13235, 19017, 21740, 27055, 23059, 35858, 19178, 19380, 31814, 28792, 2124, -24443, -33234, -18063, -6224, -10596, -16442, -11016, -20548, -13079, -12029, -11771, 5449, -8160, -25802, -33889, -5311, -13860, -33475, -42129, 3464, 14910, 7401, -27549, -45618, -41301, -28159, -5508, 816, 17088, 62425, 38726, 13341, 738, -14641, 3106, 10759, -1826, -2303, 10884, 9115, -6471, -19472, 605, 228, 8707, 15264, 15982, 21439, 16709, 12705, -11644, -30185, -40979, -45034, -30467, -15631, -2806, 9885, 8697, 1645, -3967, -24137, -22545, -9780, -31824, -31382, -7482, -10397, -9939, -8104, -2677, -11810, -16597, -31192, -21599, 12268, 7304, 1404, 12438, 31801, 41668, 17950, 14487, 5819, -22404, -21809, -15848, -11102, -7827, -8603, -842, -9242]
15921i242P600J7943K521o678O133O836j0709j8728j3641O973J123k511J4762
15908B382j9171r58J5305J2402k1947j0913O717N737j8349j2089L0925J8558j4439
15895e840P492K7518Q88j6793J8399j2240j8194M636q486j396L553j6601O77r312
15881b5699j5334p001J7878K5348L0577J3361l1439j1761K2116K0824J1139m640
15869D5369l711k9623k059m245J0050R729j0290K45K183L214m417m3993K9169
15856A621K3528j8790m958k3966j9733Q450P178J9044J7287j895o566n162q138
15843a2100J0646K4768q873m758P245N144N235R523j5786j9120J1213J8573J205
15830C2915Q518k2998l7495k1637n447j6128j7828J8084J7803P112J5596K1282
$$ y = [-9242, -1642, 16301, 18822, 12144, 18277, 25113, 14404, -4324, -17965, -10992, -9869, -12380, 2382, -16789, -17747, -2442, 9960, -11987, -22900, -16183, -10446, -28795, -40884, -9959, 8599, -5840, 1652, 29170, 30058, 13265, 31664, 19424, 1230, 5866, -2620, -4016, -463, -17064, -16387, -25699, -41033, -48034, -30156, -4808, 25769, 39130, 7691, -4070, 18046, 38870, 50009, 45369, 41658, 12035, 9976, 5731, 15781, 25510, 15220, 15465, 17648, 20862, 16445, -27548, 1621, 25149, 6359, 1401, -22565, -42298, -33848, -26670, -7626, 9661, 7766, 1200, -3962, -12100, -1454, 23314, 14441, 9683, 16928, 22072, 27307, 36830, 21044, 1924, 13137, 31710, 32915, 41433, 18435, -19060, -40697, -46144, -62272, -80100, -62016, -44213, -37101, -21505, -223]
15818b23k144R784P01r642J6555l21j0414J6518j4286m13N374n488k8740j6170
15804c8909m525P411K1056OJ517R048r130J8j1257q980J8857j969j1778J1448
15790a7187M3711o317j8226k8782k3118K9074K0828r348J691J0828J168m323j2805
15777a2806q489J5840l532J0868K9986K2047k6356j5396L294Q961O544j8057k6553
15764a3649m268J2731L277j9142N648l301J5190J8868l5196j3273q864J9107M1567
15751A8695K9526K873m803l191N227j7313j609L723M85q947j2395m961P472J2796
15737B7578k7390l093K5835J93k6867m024l868K0801O478R31O309M68k6170K3584
15723B0765J9216r220j153j3048j4423M252Q75j6121p869l202P461n484k1940
$$ y = [-223, -2367, 7417, 8118, -1524, 15031, 14710, 4296, 20814, 6528, 6115, 11489, 6001, -22739, -38909, -43434, -36023, -14967, -14961, -13444, -4396, -13526, -13508, -24765, -33745, -14888, -16857, -28635, -17187, 26524, 20207, 1981, -26801, -49919, -20845, -17, -9365, -7674, 3154, 4322, -1, -12806, -21295, -5455, -8987, 1881, 31867, 53914, 27558, 12162, 15456, 24417, 30961, 12904, -13649, -17917, -5186, -1909, -21051, -15403, -18704, -3514, 15354, -19842, -33115, -41979, -22872, 18695, 48221, 51094, 46291, 43100, 48327, 31014, 29405, 33128, 33613, 24666, 12271, 7310, 14782, 27578, 188, -2905, 22930, 23123, -3744, -7768, -11636, 9165, 15643, 16574, 22883, 23351, -2819, 20765, 39981, 30761, 29608, 16560, 2137, 6389, 7264, -8857, -16726, -19928, -12467, -17951, -39891]
15710c9891J4979M960j471O923L5250M450l329J3066Q216k4967r503j2343q279
15697a1939J6742K2647M318P088J0886k1897j1618m025P453O525K4573k0984j3814
15684A5955j3359N412r034j8546j3208J2747L4556N173k9725j8985J3029O327
15672i658J4444M621j7700o777p338R465J9811Q017n460N056j0150j2040n324
15659a3033M138K8453Q782j8773o640j6975K1417J4683J817K654L471j6333l3044
15646a9383K4121P846n443K190m148K3195l959l090Q090Q574J335j4167k5447
15633b86j5549J2055K7899J2234q642j8121j9275L840K441k1814J5127J6922m602
15620B229p056k0554n291L3000M4585J6035k9874j0837P781j439K486n817j8994
$$ y = [-39891, -24912, -19952, -21423, -14500, 20750, 25200, 21871, 34937, 43153, 18186, 8683, -3660, -11939, 4803, 27450, 31768, 38856, 49742, 27845, 16227, 12202, 19655, 26180, 50753, 29769, 15955, 2596, 8008, -1026, -19572, -32780, -20033, 14523, 19696, -10029, -29014, -15985, -9658, 4786, 9407, -8293, -15070, -22408, -12943, 6868, 14885, 9425, 14481, 4331, -7709, -13033, -8895, 19558, 28340, 9567, 2927, -14048, 7369, 22052, 23869, 26523, 29994, 13661, -19383, 4738, 12584, 7141, 9331, 5183, 28378, 24419, 21329, 29419, 37993, 39328, 25161, -286, -15835, -3780, 24119, 36353, 27711, 9590, -9685, -5845, -3404, -25218, -10091, 6831, 2229, -4827, -25381, -30672, 2328, 46913, 62948, 33074, 22237, 30018, 28579, 31065, 25248, 6254]
15607F254j3793p509j8687j0145Q142P105J8292J3611J94J836R803N822j631J3613
15593C2907l39k0287r715p025m097J2249p440j8459l913k724K6438K0817k106
15580A6306N290J6371J5203q946j2352M522k745k1631p259r525K545j056j0205
15567a3482J4895N920j9212k644j939J05j669k9362k3699J575J3408m614K2390
15554c8328p340J8523K2880n336j4886L4133J7294j3484l7800j4784J6014J1820
15542a1294p853M73J6996j7842k5280Q780J4294l927j3223K1088K3658j108J3950
15529A8712j5614k0465o562j4191M805J5470J4350L956k5590J4844O670J95J8006
15516A4586k175l4810J7928L0136j9547M894j3441j6542r94N654N668R893j4566
$$ y = [6254, -7539, -15048, -33735, -43880, -35738, -28633, -10341, 3270, 3464, 5300, 15103, 20925, 19294, 32907, 32568, 12281, 2566, -4459, -8556, 3693, -3747, -22206, -26119, -28843, -2405, 18412, 16306, 21596, 37967, 53170, 44224, 31872, 36394, 33649, 12018, 4759, -4766, -2221, -3277, -13482, 1413, 7333, -11879, -14523, -16462, -16357, -18026, -47388, -71087, -69512, -56104, -60718, -38328, -45668, -27145, -4265, -9601, -24487, 9646, 26940, 13456, -24344, -39128, -23114, -11294, -19147, -18674, -1678, -19520, -44800, -36020, -21726, -25653, -38876, -17788, 5870, 4762, 18712, 3098, -17367, -23929, -38120, -33315, -17845, -3495, 461, -25129, -10285, -3615, -3420, 14586, 12411, -22399, -4471, 25665, 6118, 11012, -2429, -18971, -19965, -14311, -8643, 1250, -13316]
15503a3316k2468j2831L008L114p892L1146J9433N253p084p188m655o405J3244
15490f641M060r33M317n555J6161o07j0615l730J8096N440k3175k8715m217K5200
15476a0914K3607J5060m29K208Q773j1942j3153J7189P800q317m221k7636K261
15463B86M95k6520p028M639J0979L0670N65m765n927p29J4492L9329m359k2039
15449C0088q916L394k1274J0021n672j818k851K885o172M964j5322R981m507J1855
15435F656P74K360q718j0489K9899O212J096j5185j5083K3503M256j0918k5714
15422a1351q731L61J5216R077K2972j6034k9596N272J9294n265L906J0751l21
15409A5551q806m728k413n551j3302k687j365l188J1893K2209P363N617k2405
$$ y = [-13316, -35784, -48615, -45607, -42493, -50385, -19239, 194, 5447, -1637, -8825, -13480, -19885, -6641, -2581, -3514, 803, -4752, 11409, 10802, 187, -3543, 14553, 19993, -3182, -31897, -36114, -10914, 12693, 27753, 27324, 29532, 38305, 26363, 13210, 30399, 38199, 29882, 25661, -1975, 286, 781, -25739, -32767, -28128, -17149, 13521, 14086, 9321, 3394, 2665, 17157, 56486, 52127, 30088, 21172, 24566, 3292, 13313, 7641, 5823, 2972, 5857, -315, 4649, -10673, -692, -5199, 6656, 7430, 9790, 1072, -9417, 20482, 26694, 27790, 12605, -2478, 21025, 25281, 14363, -11351, -20082, -19721, -4505, 4572, 27544, 11510, -18086, -12814, 6480, 1215, 5121, 15872, 15551, 6745, 2017, -396, -5947, -19249, -21936, -23301, -26489, -14596, 7613, 14976, 20593, -1812]
15396a812k7718k53M988L3831P980k4172j04J8833r508o351j077j3509m867K3403
15382c36K6768K2175j1811k6959k411R043J4211J2413R086o566K624m237j5305
15369B8695j5579J524J1174o037k5203l22q678n272K939K6922j9561j2434M0597
15356A8765J5759j1816j9401k0119N436o876L0398J3643q498K799p988k2606r889
15343b0393K650J8437j096r752M130j911K257J1426k914o166j8746J0636J461
15330i981j0845m360K368K7944j745q962L2600p999k9481m985J0405J4258K379
15317A1596j5476p808J3884K8505J3422k1958J5586m038j4493J7222k399j7959
15305A6084k9455j6396N73o90J2117O846K06K6746k1261k4835m276j2693J6976
$$ y = [-1812, -29530, -29783, -24795, 9036, 17016, -7156, -7260, 11573, 2065, -4286, -5363, -18872, -23739, -336, 26432, 48607, 36796, 9837, 7426, 16469, 30680, 43093, 52179, 45613, 48237, 44000, 28695, 13116, 14640, 25814, 19777, -5426, -5748, -14426, -19698, -16759, 10163, -9398, -21832, 18765, 34524, 22708, 3307, -16812, -11376, -18252, 12146, 25789, 17291, 20090, 12102, -10504, -20393, -17743, 694, -402, -10154, -6024, -7935, -5678, 5748, 2834, -3332, -22078, -11442, -9981, -20826, -25186, -22818, 5126, 3381, -5581, 27019, 19020, -10461, -15446, -5041, 9217, 11596, -3880, -11688, 2196, 30701, 44123, 22165, 37751, 33713, 19220, 36442, 34043, 16084, -13371, -29767, -29194, -29884, -17767, -10921, -10715, 16031, -5230, -30065, -34341, -47034, -30058]
15292c0058J0427M547n287j7797j6704M601O144J6469J3814J7847J9010K6859
15280D9872j536k6662k8119k6574P918Q751j0810K4899O271j738k2907J3696K2254
15267A5315J247l817N052J865o247j3738Q946J6682Q13j4909J140o048j5M041
15253A0327j1772J0606J0581j4484M281j1402q853J0005m202O699r294l8310k6442
15240g2260K1482R059O343K8184J8408k2285j6538O400J6607K2085J9271j4739
15228B2017k1308j0370r988N937R599N977j6168R26n337N784J1853J059j6312
15215a6331p962j018K005o31l2301J7656K0864r28j6761R020J6013K3196q063
15202D759j6915J1885j2886J6167K5362n286j5355j2224P441M170J5498K150j6661
$$ y = [-30058, -19631, -15084, -20371, -38168, -54872, -50271, -44127, -27658, -13844, 4003, 23013, 49872, 48336, 21674, -6445, -33019, -25101, -16350, -27160, -2261, 4010, 2272, -20635, -6939, 15315, 16562, 12745, 17797, 19662, 13415, -323, 8623, 25305, 26118, 11209, 12349, 6301, 6286, 10327, -1445, 9161, 19742, 5258, 9539, -1863, -10716, -711, -4913, 1786, -7508, -45818, -72260, -50778, -41719, -35376, -7192, 11216, -11069, -27607, -21207, -4600, 17485, 36756, 22017, 709, -9661, -19649, -13712, -4113, 1864, -14304, -13378, -18715, -12931, -1078, -19, -16331, -24293, -25311, -23306, -23937, -56238, -38582, -17718, -18646, -35407, -26387, -10374, 12822, 4759, -12156, -271, -13157, 3010, 28372, 23086, 7731, -4493, 2948, 7118, 22616, 24766, 8105]
15189H105J0951J9767l268l2134o748j1633O070n390L2545r683k6864l5622L453
15176e0451J7864J1126J0277r737o799K6860O937k4462l909J0200m312l300j2389
15163c2095J1907R816Q166r12j1938k8366L823K3188J6019R995M685Q996J7415
15150D0699o079k8673N73K5016O963k5002j176q908M548Q140Q936k3530j356j0268
15136a0117j1368J945j0231j3662R211K1486R896j0192j4298j3573M719J4642
15124b1542K7391J985j9082K9053K9217r150l0388k1859r429K247J6228k0136
15112b5465j4970j510J573J207N315K2021K7398L100N13N531j9321j4136J3962
15099E218J1634r082R893L870k7118k1155Q028j0370K0349J2082n643n932o703
$$ y = [8105, 19056, 38823, 35555, 3421, -3327, -14960, -8890, -14280, 18265, 8582, -18282, -53904, -50451, -32587, -21461, -11184, -20921, -27720, -860, 6077, -18385, -22294, -12094, -16406, -19706, -32095, -20188, -10372, -2206, -3118, -15056, -43422, -39599, -16411, -392, 9603, 14288, 23284, 40699, 34620, 5947, 6520, 31536, 38499, 13497, 12321, 3413, 7961, 16101, 25037, 1507, 151, -10117, -21485, -19540, -29771, -43433, -34222, -12736, -2840, -13032, -27330, -40903, -36184, -21542, 5849, 7834, -11248, 17805, 47022, 37872, 7484, -14375, -23804, -21557, -5329, -25465, -40435, -41945, -40372, -39165, -33850, -11829, 15569, 18669, 19182, 24713, 5392, -8744, 5218, 16852, 7770, 17663, 21533, -5585, -26740, -18712, -29082, -8733, 3349, -2294, -8226, -14929]
15086a4929J9427J1632M223p969l6324p898K5714J9109P748m195j43R003k1530
15073C868K177r252N0554P344m1026j6534q676j1142l767j1254P291L7361L2793
15060C9737K1450k1983k3422K0092n27j1529P50k710k0307j3821k0660K424j8001
15047d8507K784L5489Q594J7735O641j3634j3627p215j357N227j0976j447R626
15034a0667k1650q599K2316J9110j388j7219J9089L255J504j2339J4710J5237
15022B3359q737m685K5176l621j8674N031K5581j1705j2951o129o249j750l064
15009A582j4395j9355n419K329J0586K1704K4902n973j0071q61q872j5593r975
14996b9411o519m499R278j784Q988R765q058o662K435J8558p1L802K2120O549
$$ y = [-14929, 4498, 16130, 20353, 12384, -23940, -31838, -6124, 12985, 20733, 16538, 16395, 25398, 3868, 6045, -3207, 47347, 54691, 13665, -2869, -11545, -22687, -26454, -37708, -30417, 6944, 39737, 61187, 39204, 15782, 35874, 35347, 23818, 24568, 21858, 1551, -12270, -32930, -30506, -48507, -45723, -10234, -1640, 16095, 22736, 9102, -4525, -11740, -13097, -7870, -18846, -20293, -10667, -32317, -40916, -18600, 510, -878, -18097, 992, 4247, 5751, -6588, 8122, 23359, 14622, 9937, 35113, 31492, 12818, 17849, 43430, 31725, 18774, 12645, 6396, 4646, 1582, -12813, -32168, -37587, -35258, -24672, -2968, 21934, 15961, 5890, 5029, -3843, -19436, -29411, -35930, -40429, -31151, -32935, -23947, -14182, -22240, -28902, -26467, -7909, -7980, -4178, 17942, 24491]
14982B4491j5725j2131R509J9271Q308k7940J9234j140k0862p370j3745J6067
14970b033k032J8605K509N05p052J0726j0187m2358k3601K0652l885J7141J2660
14957h350q749K937R774M33l081q633n428J7024k0206J7675J0902m409j364L3802
14943C2327O262k6912k3863p872R490J4232J0836J4427o38l402p860k614J897
14930A6310J584P465k4824j4518m598k228J8770k044J1122j3615o071j48k1908
14917c4703Q30K7238P01P639K889J398L153m372p862j8113K979K100J3432K3060
14903B0369j6959m083L1255m935k1072j048k929J138M865q471J8850J0005K5221
14890E2206m402j7968j9793J7961J4543j1272p757m781j4338R927J6737J0842
$$ y = [24491, 8766, -3365, 6144, 25415, 33723, 5783, 25017, 23877, 3015, -4355, -18100, -2033, -4065, 14540, 17049, 17554, 10502, 21228, 11041, -31317, -54918, -34266, -38151, -21010, -8350, -17099, -14162, -4388, -3955, -7036, -15669, -21097, -4073, -24279, -6604, 4298, -111, -1475, 32327, 38589, 11677, -12186, -20058, -10568, 3664, 14500, 28927, 28289, 24887, 17027, 14413, 16310, 17894, 25359, 535, -13983, -18581, -20809, -2039, -4083, 7039, -6576, -12647, -12795, -34703, -33873, -6635, -5934, 1705, 4594, 5992, 9145, 4773, -3089, -21202, -18223, -16123, -2691, 20369, 3410, -673, 30582, 25647, 4575, 3527, 598, 1736, 6601, -1870, 16980, 26985, 52206, 47804, 29836, 10043, 28004, 42547, 31275, 23518, 18737, 4399, 14326, 31063, 41905]
14878D1905k833j3841N766J52q368j1990j4659K045o25J2903K2608l654j4580
14865A4829o930J0407J3702j6189p387p845K4241R946J0032K344M053m650j3369
14852C3184q937J0614k2065k7221P501K587R074j0883j0988J0924J1036q639N524
14839A711N530K8784q652j8124l995J8270k2751L80K2654j5794j9078J2118M440
14826E493N983m024k103N123K399l5239k020M1690J4019N658J9867j3464l1557
14813A1825j7138j7980j232K9994K93j324J9967J506K906j5121K506R768k6615
14800f45j1849J2137L026r379l537K5758M5835L23R17P323l4962k2406m512j6138
14786h109j9220p01J6984l036J7485J545q489P924r798j7375K5957K6207K560
$$ y = [41905, 39072, 25231, 30997, 31149, 22781, 10791, -3868, -1823, -2448, 10455, 33063, 29409, 14829, 7899, 18306, 32008, 15819, 8432, 587, 24828, 34774, 44806, 47150, 51203, 46553, 33184, 24247, 34861, 12796, -14425, -6924, -4337, 4737, -6146, -17134, -6210, 4826, -3813, 1711, 7241, 36025, 27373, 9249, 5254, 23524, 773, 1153, 23807, 8013, -11065, 1053, 5493, 11476, 7452, 5349, 10472, 12871, -22368, -24388, 17302, 31321, 36979, 56846, 43382, 11825, -5313, -23293, -24525, 5469, 5762, 4438, 24405, 25911, 28817, 13696, 16202, 25970, -645, -12494, -357, 2669, -6710, -10247, 15511, 61346, 61669, 62586, 69909, 34947, 12541, 8029, -8109, -27329, -28030, -11046, -14082, 3403, 4948, -3541, 4383, -5415, -22790, 3167, 29374, 31934]
14773C1934j3313M659J933L555J2678j5667k6125O120l781p605J1916K5183k2890
14760H597j4504J7676K5199J4877j8677j041m489j1845j8191R63K285L758r876
14747e268n936K550J0131q091j1492N693R182l108J2960J2384J2625J51J397J3930
14733D7108j2198j7712j1082m778M520k9813m861J4653J6474J1412J3421K404
14721B9548K427j8618J4171R270k8394l914n269q63O602L747r102J9861K544l2732
14707a0722k4514J1187K8534L6352J0335Q73k4508l0534q78l32L1734j466K111
14694B8172j4631P916J4340k4809q430J4644k130K1613M122j5365p243N326m130
14681A9395o88J0415j5174p618M747n983K977p357L702q421N961J0541J9194N968
$$ y = [31934, 18621, 23280, 25213, 28768, 41446, 25779, -346, 5774, 1993, -5612, 6304, 31487, 8597, -5907, 11769, 36968, 51845, 33168, 32127, 27638, 15793, -2398, -1435, 850, 4608, -5268, -11204, -8654, 1477, -6614, -18106, -12413, -3231, -6339, 6621, 19005, 31630, 31781, 33178, 47108, 34910, 17198, 6116, 1338, 5858, -23955, -28816, -14163, 2311, 13723, 27144, 29548, 31975, 13357, 27528, 36798, 8404, 4490, -779, -1642, 4960, 8707, -395, 19466, 22010, -10722, -35236, -24049, 4485, 40837, 51172, 52045, 27537, -2997, -3875, -4207, 27527, 26061, 28172, 13541, 21457, 35797, 10988, 2558, 17202, 15072, 36685, 40807, 25442, 18199, 23525, 19395, 18707, 29122, 13948, 6330, 11077, 5094, 8071, 714, 4416, -4005, 1956, 12497, 31691, 37659]
14667C7659o919j5663Q424J2131J2101j2710q397J3222j7501j170K0507P306j0126
14654C8864k7504r361j2149P262J3060j428n630K740p534J1710N694K0864j3590
14641B2998j5006k4059j9229K0087L047J4488j24j7378O790J718J0685R417K616
14628A6050j0480j3042o825P986J4345M999j002J0509j0400j802p268r920J3647
14615F797l8925m153J7391n320Q819J7928k8652q231R572J8796m857Q88m524O767
14601g704q115J0557K5597r629k9995J1620J8226J1383P191q199r700o064L271
14588H439q52K6523j3437m115r329k7156j6220j7444J0554K4093K3650N166k1171
14575a1299P97j2393J1907J6842j2755k485J808l647r41k605n790r544J8246L8989
$$ y = [37659, 30740, 15077, 23501, 35632, 47733, 35023, 26626, 39848, 22347, 21177, 41684, 48990, 38864, 11360, 1999, -10150, -2888, 10172, 8744, 3114, 5854, -1680, 10030, 15724, 36588, 22998, 7992, -16067, -35296, -15209, -12162, 2326, 2202, -15176, -8386, -6668, 4017, 13434, 16050, 5570, -7472, -14297, -6311, 8034, 13033, 12031, 22540, 12140, 10338, 3070, -6850, 6797, -32128, -36281, -18890, -24210, -15391, 2537, -26115, -34346, -24774, -5978, -10835, -9947, -14471, -7704, -15819, -5262, 20335, 10706, -19289, -7669, 10557, 21940, 29131, 20932, 11232, 5168, 8439, 7587, 34110, 20673, 16558, 7229, -19927, -36147, -53591, -43037, -18944, 4706, 9872, -11299, -10502, -22895, -10988, 5854, -6901, -9386, -7578, -11225, -12166, -14771, -20561, -30105, -11859, 27130]
14561B7130N149k2602j9907O68j4224J619l338m587R83K1348L0730K327l275J6616
14547C8637Q735k8934k1698N393J6955J6394l0592k3674k4215j537J7888N966
14535b0682R425l13O421k4626J3145L5553P049k0663k4081r930o563J7811J030
14522a6424l507m4L435K647P57L947J1879K0397J3187j6484k4994k3201O0K2036
14508f309J2000L3735L1134n701j1494j846L275j753J528k8113j5696l471K3326
14495C0615o127r131P051J002j8495k7665j3510L2770J5107M736k110M059m615
14482A3687n359j0914L37K0634n210L377Q444l044k315J3095l0519o588m981K4836
14468A5480J8698l8152l4828J041K4890O481Q28j9997k986L25L1638o026Q185
$$ y = [27130, 32279, 9677, -10230, -9562, -23786, -22167, -25505, -30092, -29109, -7761, 22969, 25296, 22021, 38637, 47372, 18438, -3260, 2133, 19088, 35482, 4890, -18784, -42999, -44536, -26648, -20682, -11257, -11570, -5149, -29775, -16630, 18923, 25972, 5309, -18772, -28702, -35265, -17454, -16424, -19931, -19975, -16540, -13893, -13136, -9189, 2690, 23087, 36274, 19790, -5204, -28405, -28345, -6309, 5691, 39426, 70560, 64859, 53365, 51519, 54794, 53041, 54569, 26456, 10760, 7289, 30615, 24488, 15357, 22408, 23410, 4915, -22750, -36260, -3490, 11617, 16353, 14243, 18302, 13687, 8328, -2586, -2249, 18385, 13175, 16552, 24996, 21952, 19637, 32732, 2213, -4375, -9356, 15480, 34178, -3974, -38802, -37761, -12871, -6390, -5562, -25559, -28545, -28220, 3418, -2608, 5577]
14455E577R429k4011j5995P11P237J1426l744K7332q348k3033m288J8127J3304
14442A3724j4713p624J6797p196J0733o354j5813l88O306K716Q461J2349k8774
14429i776L866j028R786J9216j5976J4537j1334k0053K255J3664J3591j5817j504
14416A427O844l531l3279J2438L773r305J4928K1831J108l670j7409j8237N685
14403a7397J1608J9495K2028k4638j3318L324K810l642J3560j5171J220M213j9278
14390a5186M797R920J1442J1785j3748J3037n646o595K346k4479j1900R390J1136
14377c701M408j897K825K29R522O548K268q036J662j0315K6107J3931K300l7584
14363H267r64n015N985n18q502N979p32R066o409M247j640j8938l3124j6L3312
$$ y = [5577, 15006, -9005, -25000, -24289, -17052, -5626, -9370, 17962, 9614, -13419, -17707, 420, 13724, -989, -8613, 8184, 988, 11721, 5367, -10446, -10834, -4528, -1812, 6649, 18998, -9776, -5910, -6938, 2848, 22064, 6088, 20625, 9291, -10762, -8507, 5157, 18748, 2931, 1427, 8271, 4740, -28539, -16101, -12328, -21633, -6705, 15126, 16234, 12564, -4845, -23082, -17397, -5789, 13706, 35734, 11096, -2222, 1102, 3912, 270, 13830, -1341, -121, 4092, -15186, -10389, -469, 10973, 22758, 9010, 22047, 16401, 9806, 12152, -12327, -24227, -14837, -3701, 707, -1190, 1635, 1864, 11386, 17934, 20202, 12166, 13828, 3513, 29620, 43551, 45851, 8267, 7303, 2288, 8273, 7755, -747, 5232, 4500, 13566, 7157, 11404, 9764, -9174, -42298, -42314, -9002]
14348i002K4682R204k3512k87J4397M069Q808k1984o778k1442L591K261n403k0371
14334d1767M626O843M5684J9796j7833k3818J7592N520j0926p960O708P69j3654
14321h420j2413k614j8704K2220J8787j2873k1136q193M730J9953L40J01R714
14308h508L6360L6238l5838k7995j1433M2680L4052j0149l8518k5043j0609m536
14296b3299J1125K1812J0487l2119q526r761o788M176L6002k368k2202J0595K8962
14283A8096k0400R632J0813j525l165O122k7289m916J1675K7685J0482j0935M30
14270B6705j9968r7k3353k7355O660J8004J3865J1482j7297r249K4552r05j082
14257A962l8797j025K3887j331j1861J1095N276k199M72m481j4683k2488J4522
$$ y = [-9002, 15680, 24884, 1372, 1085, 15482, 19551, 28359, 6375, -403, -21845, -18254, -15993, -21396, -41767, -37141, -30298, 15386, 35182, 17349, -6469, 11123, 16643, 5717, -2243, 4465, 5234, -8420, -20833, -23447, -42151, -19931, -1144, -14017, -35153, -43346, -38616, -18663, -18323, -18222, -8508, 27852, 64090, 28252, 257, -11176, 31504, 65556, 55407, 16889, -8154, -18763, -23299, -12174, 9638, 20125, -11994, -20520, -30281, -37069, -32893, 3109, 741, -21461, -10866, 18096, -2304, 7328, 18141, 16616, 13451, 19573, -7716, -12632, -957, 26728, 37210, 26275, 26705, 6737, 6640, -16713, -44068, -37408, -19404, -5539, 5943, -11354, -20603, 3949, 3044, 1962, -36835, -37860, -13973, -15304, -27165, -16070, -10794, -12993, -12521, -17002, -31685, -54173, -39651]
14244c9651K4491k3597j4883J5925J9886L583K242J6175K314j6664R958j1440
14232a1661K2875J3447J0102k9181j4809R448L866J2868L137J512L560l117J307
14219B3354k0264p859j893P918k9660j0230J921J9643K7642M561j2188j4995n3687
14206f5737r53M3520L5382P292j8560N982j4k551K2359r801l5646j2469L640J5387
14192a2169r996P508L4782O882o885j6925M605Q398J1109m426j5603j0769j988
14179e477M111K9433q04k901r850j233k8012N554M0668M04Q260K729k4612n039
14165A3231J1651K11r933k6554L2666K4067k426P85k803j6968l670m9484J2104
14152a7123L9125k7970j8946J1219J0595r860p484m026K868J8172r093J4739J0071
$$ y = [-39651, -15160, -38757, -53640, -37715, -17829, -14246, -12004, 4171, 6485, -10179, -221, -11661, 11214, 24661, 34763, 5582, -9227, 221, 4087, 16955, 20092, 21604, 25164, 22047, 23354, 3090, -4769, -6662, 1256, -28404, -38634, -36713, -17070, 10572, 15133, 2945, -12050, -65737, -66690, -23170, 12212, 19504, 944, 6926, 6912, 4361, 26720, 16919, -18727, -31196, -27556, -12169, -22165, -14657, 20125, 27007, 20122, 3197, 7802, 16200, 27309, 22883, 7280, -3489, -5477, -1366, 28067, 27263, 24362, 14512, 13279, -14733, -9179, 31489, 31893, 40153, 42882, 18270, 13231, 24882, 25093, 15160, -11394, 21272, 45339, 42913, 43698, 40895, 23927, 20257, -29227, -17123, 22002, -5968, -24914, -13695, -3100, -12960, -20444, -24470, -21602, -3430, -12523, 2216, 12287]
14139A2287m999K2269O263N776m392k2473j6609P535O6k1926J267J445l524M041
14125a2974P656J5203J2404N976R780J3034k3736j3409n118k842J3772j3965m290
14112A491J3655J47j3193o546J7595J1970j2771k0816j706J2312K70q888P619
14099A139j4271k494P656J5883J3510K656O359j0879j4220j4151J0921J7100J063
14086B0272K559l6362Q267K5259M054j0125k0842O891j9999m9838q614L4552K3254
14073b0672n32K0507J0033k491L544j6382K422L253J6886M799K8099O88l5198
14060A4956k4323k704J1863K880r496J0823N50K0635j676k7344j5901Q643o96
14047a1790m5m718j3001J6474P374n913k3670p13m481j9328J615K6104L0584N727
$$ y = [12287, 7288, 29557, 35820, 41596, 37204, 14731, -1878, 5657, 5723, -16203, -14936, -13491, -17015, -12974, -5318, 9885, 22289, 28265, 38045, 51079, 27343, 13934, 8816, 5974, 19746, 5781, 1491, 15146, 15293, 2100, -4446, 13149, 25119, 12348, -8468, -10174, 2138, 2408, -6480, 1139, -13132, -15626, -7970, 7913, 21423, 24079, 30438, 19559, 5339, -8812, 2109, 19209, 20272, 22831, -13531, -5264, 19995, 24049, 13924, -6918, -27, -20026, -69864, -78478, -43926, -20672, -21204, -697, 9336, 6845, 10389, -5993, -3571, -318, 16568, 21367, 49466, 50154, 14956, -9367, -12071, -208, 2672, -6824, 3999, 4549, 25184, 23508, -3836, -19737, -11094, -11790, -11835, -16553, -29554, -13080, -5706, -11619, -35289, -36002, -40483, -59811, -58196, -32092, -1508, 4219]
14033D219k3058J039R604j6426J2141L556J4026J8490r122L181M065k0099l232
14020a616K1704j395k1764q742q8J8427k1655j0848N684J329J3848J3318K666
14007A0868j0911Q056o431K399J0454j6188j8551m219J8020N437J1212r76j4117
13994d947l354l960p624m620K5353n19j9096j1273O596K086K1843k3693Q752R650
13980d806j2170p796m113J2061J3034j385p973j6848O970J0463R412J3676n452
13967E073j0012m695R749Q733n302j6181k4568J0602m447J1618K3559q059p620
13954a1550J8851K0585P345j6392j5418j5399k5182j350L4223K1294o860O611
13942A6758m399J803j3923k3611P633J1766P944r165K9846p209q815M202K079
$$ y = [4219, -18839, -17800, -8196, -24622, -12481, -8925, 5101, 23591, 14469, 17650, 21715, 1616, -1616, 20088, 18693, -3071, -11813, -11901, 6526, -15129, -25977, -20293, -18964, -5116, 8202, 10868, -43, 8013, 1582, 3981, 14435, -1753, -20304, -24523, -6503, -1066, 10146, 9170, -4947, -8301, -12261, -19885, -24505, 848, 329, -18767, -30040, -23444, -21358, 485, -23208, -14456, -4806, -16976, -24772, -28885, -16824, -3790, -5175, -13148, -29996, -23026, -12563, -3151, 10525, 5073, -4939, -9634, 115, 8848, 3546, -12635, -37203, -26601, -31048, -19430, 4129, -3930, -11550, 7301, 27886, 35231, 18839, 3421, -11978, -37160, -38510, -4287, 17007, 10147, 16758, 12359, 14162, 239, -23372, -15739, -3973, 3971, -5194, 24652, 17443, 8628, 12830, 14909]
13929A4909l8308n598L0696K0020k8701p93j2228j4325M360J7806j8646j4306
13917d5114l488K0586Q751r288k852j4927J4892J2255j0813p124l467R422J302
13904b9865R403J0223P205k3203L997J1052K2991P306l0041l124k3761J6969J3398
13891g450M669k5246p665R797J0255J1889k2638J8908K0998m614K782j564o349
13878C772K0974R080J524k157j7619k390J1096N074j6068N556j9945j4586K0114
13865D425j249q824N65k5380M821l919j7399J5016O103r895J9277J2136l816q838
13851a6977J4167J5293m425k178K0381J873j943O946p466o836m155j8878J4685
13838A0487J293j7609j1132J726j4481L248J4372J4847J1033M05j2280j1868n779
$$ y = [14909, -23399, -28997, 1699, 21719, -6982, -7775, -20003, -34328, -29968, -12162, -30808, -45114, -48602, -28016, -19265, -28553, -31405, -46332, -31440, -19185, -29998, -37122, -40589, -31167, -29865, -20462, -10239, -3034, -26237, -22240, -11188, 11803, 19109, -10932, -14056, -37817, -20848, -7450, -2781, -28027, -35692, -25895, -15640, -3751, -26389, -7481, 13517, 8903, 11685, 10121, 3772, 24746, 33826, 35350, 33193, 15574, 13184, 24280, 29354, 13286, 18842, -1103, -15689, 4425, 3176, -5648, -5083, -30463, -25642, -29561, -46960, -31944, -25841, -35736, -16459, -4323, -8139, -16977, -2810, 12483, 8058, 5880, 26261, 28134, 26191, 33137, 25671, 18835, 14680, -4198, 10487, 11780, -5829, -16961, -15235, -29716, -26468, -12096, 2751, 13784, 14189, 1909, -9959, -15738]
13825a5738Q878J4666J1026J5317J0587o23j4242j5588k1808j4063j5959J4790
13813b2757M761K0151R980J2281k3657j6825J4849M115j9433N876J1001m381j717
13800e756r944J6081J2313J12m523O83n730o588q405j5505K1865k646k5713l871
13786c7627K1433J8271j9349j9569N309K781J0497J3767J0213N037M455l21O398
13773B1295q639k5377J6649N942j3426j8643n345l3L900K3669K1314l843r357
13760H106j2235J6815K975k3440l8928J847L3194Q542J0486r110j1673q685Q411
13747a3695o292m992O181m629J0057J1050L1214K0013O751l6659l5701M352K19
13734a2131J4679J5430n470k7901j073l58K3108M3J778p522J1525J9395J868n491
$$ y = [-15738, -6860, 7806, 18832, 34149, 44736, 44113, 29871, 14283, -7525, -21588, -37547, -22757, -17996, 2155, 12135, 24416, 759, -16066, -1217, 2898, -16535, -10659, 342, -4039, -5756, -15700, 381, 12694, 12806, 8283, 8966, 3236, -3352, -11757, -27262, -5397, -8043, -33756, -37627, -16194, 2077, -17272, -36841, -31532, -28751, -18254, -4487, 5726, 10763, 15218, 14897, 21295, 12656, -12721, 3928, 9870, -3556, -22199, -27544, -27577, -23677, -8, 21306, 17463, 8106, -4129, 12686, 15661, -7779, -46707, -44860, -11666, -3124, 7362, -1748, -13421, -22106, -13695, -19987, -24979, -18798, -23427, -13370, -2320, 28894, 48907, 55658, 18999, -16702, -12350, -12131, 2548, 17978, 12508, -15393, -16466, -16824, 6284, 6327, 8105, 583, 12108, 31503, 33371, 27880]
13720B7880j8107J2054J433M031J2011J1084j6656k8379k106K907k788j8329r222
13707b4187K0283J2539p10p265L280R18k8515J612J6157Q919j3239o934O448K3782
13693A3088r299k5379R733m155N424J2602m178l271J259J0027J9572R997J6814
13680E2234j3248k4287k2913J6673j0599j624K0071J3465k415k7708m0477j4597
13668e5425j223K7049K5170J0907q691J4423L912j5093M022j7380L2263J6497
13656C6431Q092q848q224J707L388j6278j4665j1410q196p711r184k0379j0597
13643f5874J6908M0888K2974J1344J662k749j1237j0512J3951R522k3963k5116
13631b2202j8349J9370K0762K1041o226k0546J57r281L691J0351n583k6363p12
$$ y = [27880, 9773, 21827, 23260, 27291, 39302, 50386, 33730, 5351, 3245, 6152, 3364, -14965, -24187, -3904, 8635, 7925, 660, 3940, 4858, -23657, -22045, -5888, 3031, -10208, -17142, -10694, 13088, 3789, -21590, -11857, -16012, -10588, 2014, -2164, -5435, -4176, 5851, 25423, 35420, 52234, 38986, 14699, -8214, 8459, -2140, -3764, 16307, 29772, 27357, -351, -40828, -55425, -56648, -29599, -4429, 6478, -2213, 12210, 16122, 1029, 5051, -12329, 19934, 36431, 44523, 35675, 27451, 29158, 32546, 16268, 1603, -9807, -18003, -25714, -34898, -55277, -65874, -48966, -8078, 14896, 26240, 27902, 25153, 13916, 3404, 17355, 26877, 2914, -22202, -40551, -21181, -419, 20622, 14396, -6150, -5993, -15274, -11583, -1232, -6815, -33178, -33890]
13618c3890L481J356O385o247N914K7049J4727P109L105j5108j8315Q930p793
13605c297j045J0425Q583O648J1532k2323r515j1180j277k2502M230K5133J0549
13592E961j6258j4303j2626K377K2210q240O7O092K8484N552l3744l002K0619
13579C189P255k2721k3512m44J3536P816K0530O172O682J9417o795l0631O939
13566G433L577J1093J4814l2804j5261J3758J9729R781n579j3320j1046M2j2571
13553a0354j8601k137j846J319J8858J7119r701p59O043j5815K277R940J093j0039
13539a2603p004M970o55J3555K9421M419k3960r465R382Q918j1237P360k2081
13526h980j2428J5814J7941J2993o891j7793J0366j553m3238p601K1130k571j4494
$$ y = [-33890, -30409, -29053, -22668, -28915, -23001, 4048, 18775, 25884, 28989, 13881, -4434, 4496, -3297, -4342, 6083, 14666, 21314, 32846, 10523, 1008, -10172, -11449, -33951, -29721, -4588, 5961, -10297, -24600, -37226, -34849, -12639, -20879, -20812, -14720, 13764, 19316, -14428, -17430, 3189, 10444, -12277, -35789, -36233, -22697, -14881, 5649, 11821, 18503, 37920, 31125, 494, 7433, 11010, 22103, 36917, 4113, -11148, 2610, 22339, 32120, 26541, 13221, 2175, 2217, -10354, -28955, -31092, -32938, -31619, -12761, 4358, -5343, -6102, -59, -15874, -13597, -3657, -2564, -12603, -19607, -14637, -15292, -1737, 27684, 32103, 8143, -1322, 8060, 16978, 5741, 13101, -8980, -21408, -5594, 12347, 25340, 18449, 656, 11022, 9469, -33769, -41370, -20240, -22811, -37305]
13513c7305K1095J7546j8818J1641L578k0258N084J0839K1267k328j6780m274
13501h713j7586P004K5427J6226K780K448k5247k5430P382J2322m153k7267k902
13488c7709j790K3408K8325J5076j8490k9798p675J4131L1447n933J5774j375
13476B5391k081j2647j2818n692K767j9767M259J068j2556P662K6136N478J4001
13463B1201J2794p273k1415l3742p043q33j0899K218K6742O562K0924M355o422
13450G169q309P159k655J2422Q843J0379m564k6353N505j5215j8369O1K702q502
13436b9727K0464K0957K2609J1362M774o474m3814Q40O130N838M361j3031j9792
13423a5503l407Q605j950m368O501R784J7914O688k5323l4028J405J0146K734
$$ y = [-37305, -16210, 1336, -17482, -5841, -2263, -22521, -17437, -6598, 14669, 12341, -4439, -8713, -26299, -19295, 6132, 22358, 25138, 27586, 2339, -23091, -15709, -3387, -7540, -34807, -37709, -39499, -16091, 12234, 27310, 8820, -20978, -28653, -14522, 16925, 10992, 26766, 25391, 23310, 10663, -2155, -7847, -5080, -24847, -20588, -19520, -32076, -24414, 1722, 7200, 21201, 33995, 26722, 5307, -28435, -35478, -36311, -47210, -44992, -18250, -11688, 9236, 13591, 7169, -1140, 6019, 3364, 15786, 24629, 35008, 30444, 4091, 9596, -5619, -23988, -23927, -21225, -29727, -9263, 11694, 34303, 45665, 50439, 43965, 151, 991, 7121, 12959, 17320, 4289, -15503, -18910, -10305, -12255, -16623, -10122, -338, 17576, 24264, -1059, -35087, -33682, -23536, -20802]
13410b0802j0517Q769L3802J1737j8012R15j1955J829o461N80J9567P563m563
13397A2452j7381q396K0746O595o305K1995j7343q475k0371j2036P147K231j053
13384b0194P900J1748m938j3292J1933m0870N374J5887J62P523q862j0703N986
13371c2346K8846j0922L636n966O018o122q706K1245O272j4814L3447K8737r658
13358C9667j7750o629j701l2616j3052K6846J452J434K0693J608k8429j4280J2986
13345i771j6958R881M7538J6716k3459j5405k636Q975p617R620M12L438j7806
13332B928J3781L957l961n216r142j3564L354M597m467P868J572j2807k1382J3137
13318a9345K5797J4524q852O04M345Q870J864p906K501j8136q86j1635j870L0123
$$ y = [-20802, -31319, -22550, 11252, 22989, 4977, 5892, -6063, -4234, -10695, -10115, 9452, 17015, 12452, -4929, -13325, 7421, 14016, 7711, 29706, 12363, 3888, -16483, -28519, -21372, -19141, -20194, -12294, -546, -5484, -18776, -6843, -47713, -42339, -26452, -26290, -18767, -27629, -38332, -32346, -3500, -14422, -10786, -16752, -10734, -16856, -25562, -4317, 1955, -12859, 20588, 49325, 39667, 21917, 15288, 13587, -19029, -32081, -5235, -3783, -2349, 18344, 19952, -8477, -22757, -9771, -26729, -16848, 30690, 47406, 23947, 8542, 5906, 14881, 7264, 16884, 17296, 20734, 2928, 16709, 20666, 16705, 11489, 2347, -11217, -7863, -3266, -7733, 135, 1707, -11100, -32482, -19345, 6452, 20976, 12124, 12728, 17073, 25943, 27807, 19901, 22402, 4266, 3380, -8255, -10125, 19998]
13304A9998j0412k6854N800J8830P566K9494J1767k5926O8M97l884k3674j8346
13291a5076N521K1830M00k1746L136N319j160M413R938j2119k3602n31j0471L648
13277c0500K2765J5561l050l4441j0090J8824L9052Q075N069K3071O230l0956
13265B9610o002l12k2918J918l718l6492k517K7320l391K623R451J6963j7458
13252d923k0777R797n881q955q237o572K316J8497J8972n286J23M909Q456j6223
13238a3784J784J1243J8115j8400j2851K2387j9443J96J7493o359k1236K625M679
13225a3551q217J948L897K0361J0341j6492m6724k1637L604M9670M3345K976j1467
13212A8054j504L582k2135l632n040o323J0370J0084q233J6358J7285r307j7223
$$ y = [19998, 9586, -17268, -11468, 7362, 14928, 44422, 56189, 30263, 30331, 30828, 26944, 3270, -15076, -9555, 12275, 12675, -9071, -5935, -616, -1776, 2637, 12575, 456, -23146, -23677, -34148, -30500, -7735, 7826, 4776, -29665, -39755, -20931, 18121, 26196, 31265, 54336, 60566, 29610, 23608, 23296, 378, 2296, -1422, -37914, -40431, -13111, -16502, -13879, -4428, 12535, -4923, -25700, -15903, -21784, -30739, -38976, -45548, -43232, -24735, -5763, -11049, -10926, -6017, 2439, -13784, -12000, -757, 17358, -1042, -13893, 8494, -10949, -10753, 6740, 381, -20855, -18230, -13551, -21768, -19820, -15923, 4438, 14779, -1713, -48437, -70074, -66470, -16800, 26545, 29521, 18054, 16550, 20132, -2003, -5635, -10675, -16998, -6628, 3456, -4777, 11581, 28866, 19559, 2336]
13199B336j5009j775N24K477m0809j2232K6602J6809K42J8098N887k566J143m410
13185b683r149K509m831O725J4732o229j0632r65K651M977O744j6199o278l569
13171b2197j3259J3859j3440P6K0285J1057L250j4715K285o8K293P085K0440J6170
13157C3121J8305l44j2930l847m022k3759k8328o215M273J8087J7707k629J4408
13144B3827K569j7706j5556P321M620J76O976L969j2597M04k788j1531K477J8632
13130A0793P389k331R405l018R175j2202l1363r008J3761J7448p581j6757j9476
13117c3765j8702K130J4090o52J2844Q405q368N884M325J3497q93p288j2389k581
13103b3463k9967j6204K3596K1380K881k7774n582K5018K3776K0532k956o115
$$ y = [2336, -12673, -14448, -13924, -11447, -52256, -64488, -37886, -21077, -20835, -2737, 3150, 584, 1727, -2683, -11832, -9323, -14154, -7429, 7303, 1074, -9558, -10523, -7872, -2895, 3849, -12350, -18628, -22197, -35456, -21597, -35037, -34961, -14676, -3619, -369, -15084, -12799, -12867, -10574, -3489, 16951, 33121, 51426, 51082, 38152, 34305, 30283, 6524, -21804, -28019, -23746, -5659, 12048, 9419, 23827, 26396, 8690, -6866, 455, 5075, 5251, 12227, 16196, 3599, 4003, 1215, -10316, -7839, 10793, 18182, 15851, 25256, 22238, 31413, 19211, -12152, -21160, -7399, 10049, 2468, -14289, -33765, -52467, -50337, -36247, -36899, -24055, -15650, -24018, -18134, -13809, -312, -1205, -8493, -20882, -23463, -53430, -69634, -46038, -24658, -21777, -49551, -55133, -30115, -6339, 14193, 11237, 5122]
13091E122J0203j7845k4578P219J2396Q76l380l39K1228J8323l5813l851L7295
13078B6856Q947j6251j5636k1310j1729K2418M128j1188j1392j2489k197k527
13066d2370J3871K559K7375k902N642j4756k9073K6448J9392L398q085J4297M417
13053B0213N949j2029O211j2066P720k525n31J2300q852J3028n312l430j0527
13040A0149k8437k2010J9307K6185k5270o646l846M954j565j03J7362P730n984
13027h174n974j209k6Q439n051J1919J1759r570N036m541k8375q230J4585K0854
13013A442J0497P945K6515Q715p665k2703j5731p472m753j5994k333K1266q166
13000h437j2665j8705j1365Q846M4389J4427k5203K66j0129j8222L051L9416K5772
$$ y = [5122, 15325, -2520, -27098, -19879, -7483, -6607, -9987, -10326, 10902, 29225, -6588, -10439, 26856, 35803, 19552, 3916, -17394, -29123, -6705, -2577, -13765, -25157, -37646, -39843, -42370, -28499, -25940, 1435, -1467, 4175, -10581, -39654, -13206, 6186, 9584, 1499, 15796, 20213, 26162, 14133, 20344, 8278, 15998, 13473, 12942, 25242, 16390, 29418, 24106, 20676, 10149, -18288, -40298, -20991, 5194, -20076, -26722, -30568, -25614, -27179, -27282, -9920, -2190, -8174, -14148, -15357, -15383, -6944, -11995, -76, 11683, 2113, 7149, 2608, -25767, -33997, -19412, 1442, 11939, 19884, 46399, 55114, 47449, 24746, 9015, 1543, -3210, -19204, -21537, -271, -8437, -21102, -39807, -51172, -42326, 2063, 16490, -8713, -8447, -18576, -36798, -33747, 5669, 31441]
12987C1441j1605q754L850P487l391j4819k472L2972M220l6668l8892k118m895
12974d3644P85K8724J3518q73l588J9970J0719m826l5865j5447N476J2306P703
12961e042j1370O272K0140K824k3818j1000K2274J2700p27l894j482j6041j0384
12948a9548o58K4676J3032p627l26L541J2949q284j3617J232j1958m29O673K1213
12934B0869j823M789N299J0662m737j5623j2028j0637o116M82K967J7345J6957
12921B8406q378j2500M804P996j730j4859m304l195j3738P099J0168j819r377
12908a1427k3590O560J2511L850k2629Q691N312R141j4316R045J767L206m774
12895a6653q010L460K529j261j5280J2350J2290j1326M501K1326J5230r217j0363
$$ y = [31441, 19836, 11082, 14932, 22419, 19028, 4209, 1737, 34709, 38929, 2261, -36631, -38749, -43644, -42859, -14135, -617, -1490, -5078, 14892, 25611, 20785, -15080, -30527, -25051, -12745, -5042, -16412, -10140, 10000, 12824, -10994, -21994, 280, 12980, 12253, 8359, 6877, -9164, -19548, -20206, 4470, 17502, 9875, 9549, 13090, 26039, 17755, 4138, 5370, -6588, -7017, -344, 20869, 19046, 23835, 29134, 39796, 35059, 19436, 7408, -3229, -9345, -8863, -5896, 11449, 28406, 20028, 7528, 12332, 20328, 18598, 3739, -565, -3760, -17498, -10399, -231, -2050, -11427, -35017, -28457, -15946, -12096, -34725, -26034, -20722, -11581, -25897, -16852, -15085, -11879, -16653, -24663, -21203, -18674, -19935, -35215, -22865, -10575, -21901, -17400, 3926, 19156, 9939, -424]
12882d24j3889P94p17J4494M324j0548j3609K3183J9693j5283l660P572j638O986
12868A7278n12k0314l2284p954m586P977j347J4342R256L6429J8338L148j5283
12855B4488j5182j5144n2k6428J6878J2278J539J7804O965j0576j9996K326J3376
12842H276Q578O929J4002l616o527l0157p324J6694P03R871J6907k8503j4496
12829h663n196j5177m74j964K3425L559j9179p088J1658J0065O188R150M14k596
12815D122N565p656J6109J9003K18j8882O383J6267j0490q539k2537n157J2438
12802F844K1716K662k351j4272j8358j0769k5212P553J3198Q584l102l046J9517
12789B964Q650r320p993j8295r151J2240J2731K373J459k0166l225j240J7040
$$ y = [-424, -14313, -13519, -14236, 258, 4582, -5966, -19575, 3608, 23301, 8018, 4358, 11930, 10292, 17278, 16766, -3548, -35832, -43786, -48372, -40395, -41742, -27400, -18144, 18285, 36623, 39771, 24488, 9306, -5838, -5890, -32318, -15440, -3162, -1623, 16181, 23146, 12570, -7426, -5100, 8276, 16854, 23783, 37785, 34169, 27642, -2515, -9839, 6855, 7558, 17429, 34336, 5833, -8663, -13859, -29036, -29510, -31474, -8049, -4490, -23669, -30757, -19099, -9034, -2846, 6304, 6718, 4122, 9687, 2031, 18140, 37143, 37361, 18479, 24862, 41129, 30639, 22100, -437, -5594, 6844, 28560, 31222, 28871, 14599, -3759, -14528, -39740, -32187, -18989, -10405, -13507, -16553, 2964, 11614, 2294, -5699, -23994, -33145, -20905, -8174, -5801, -4342, -24508, -27733, -28973, -11933]
12776a1933J5804j6559j6084K287O267j8173j3180j1617J7380K1272J0644L0296
12764A6404j7108q561Q318p711K5911K1047q478o734P280L721j9977O12R793r455
12750A5062O447K1833K9987j4167l9368k0278M398l906k4779J0549j1554J7587
12738h189J4727l887k652k1852J5483L5378j7319j9627l285r178j7295j514R844
12725b9366K1626j1868J5859J8681J4939j14J3402J496j7769m1640k509J4228
12713c035J5197L8640k6990j1514K3259J969l3274l39o943m006J9032m079p43
12700G174L6051l17m4432q388P121k222P7P958k7575K0336R134k0262J5482P784
12686G921Q012r239j6840l801R812k0799j8131j864K5692J3606q819n483j8905
$$ y = [-11933, 3871, -12688, -28772, -26485, -20218, -38391, -51571, -63188, -45808, -24536, -13892, 16404, -704, -9265, -947, -8658, 17253, 38300, 29822, 23088, 30368, 34089, 14112, 14724, 24517, 15062, 21509, 43342, 73329, 59162, 19794, -484, 3914, 8, -24771, -14222, -25776, -8189, 6538, 2651, -1, -21853, -6370, 29008, 11689, -7938, -11223, -20401, -37696, -39210, -29366, -7740, -19608, -3749, 14932, 29871, 29757, 43159, 44655, 26886, -14754, -17263, -3035, 12162, 50802, 23812, 12298, 35557, 37526, 4252, 3913, -3030, -7036, 11996, 7917, 7174, 43225, 42908, -1524, -9912, -2791, -5013, -4936, 3022, -24553, -4217, 4917, -15345, 137, 7921, 15933, 6694, -10146, -13947, -4135, -24934, -43065, -44929, -19237, -5631, -14450, -19933, -38838]
12673c8838k5532K1561J8040K9441J2059m400n607l77m703k7360k1630p038J3456
12660d0928K9241J2662j0772O046J915m484j0954l0747L243M4230L5509P612o777
12647C5796j5607r789o590k5501l445K6216P616l9759L893J6740J735m144o09
12634a3448J5558q895k1549L28K0217K2552J2772j8343j1872R233P717J4652q217
12621B0705k0604J1483O958J499j867k2519n229J6519L2711j5081j1579j246O668
12608A8418M559m291n823Q453L655m517K9821j1506m2750J5490J7592K678P158
12595C8937l0917n8168J565N1780L7732j3997k5201R041K4805J350k3237j3691
12583aJ063L223J2265M237R871m888l1838o322O591Q495o960n645m0l535J6344
$$ y = [-38838, -64370, -42809, -24769, 4672, 16731, 12331, 6724, 6347, 1644, -25716, -47346, -54384, -40928, -11687, 975, -9797, -3751, -1836, -6320, -17274, -48021, -44778, -548, 34961, 42573, 35796, 20189, 10400, 3810, -21691, -25136, 1080, 8696, -31063, -27170, -10430, -8695, -12839, -13448, 2110, -6785, -28334, -28006, -7789, 14763, 27535, 9192, -2680, 6553, 14270, 28922, 20705, 101, 11584, 18542, 20041, 18174, -4345, -9574, 6945, 39656, 24575, 12996, 11750, 18418, 22977, 18686, 12863, 21316, 24971, 20454, 50275, 38769, -3981, 11509, 29101, 31779, 38937, 8020, -50148, -48583, 3197, 40929, 26932, 1731, 10772, 35577, 36927, 13690, -1, 1062, 4285, 16550, 20787, 30658, 25770, -6068, -12390, -5799, 2696, -4264, -9909, -9949, -13484, 2860]
12568B860P406M592j1280K8929j7429j2952j0745j0785k0585J160K0565K5279
12556G015O150q105j890J8216m763j5419j0534o041O825K605o128m045P915J3147
12542D948K188J6820J38J0857J1263j5074k7161j1037j109l069k637K6184R404
12529B1715L231k8859M706J6527O198J7345O753k48J6558K3942k5429l9264n252
12516A7923O893j1600j236j798P209j0473j1786n419p728R845Q393J0502O263
12503A6988j3256K0234J2778j0585l0387q181J7685p412J0973J3820K7222j9373
12491C0506j9941j5320N414r957j1761l497J8942K0243k7463k7966m70J8859K7567
12478E156r027M665L494m459M819o827L477p655j036J0116M520j3111J0877L3564
$$ y = [2860, 10266, 14858, 3578, 32507, 15078, 2126, -8619, -19404, -39989, -38829, -18264, 7015, 13165, 5060, 3170, 21386, 16623, 1204, -9330, -15371, -8546, -5941, -12069, -16114, -8199, 4948, 7136, 23956, 24094, 34951, 46214, 31140, 3979, -7058, -8167, -11236, -13873, 12311, 21715, 24946, -3913, 793, 17320, 23518, 40863, 47616, 47368, 63926, 87868, 62439, 23175, 17923, 24816, 13216, 11980, 10182, 17391, 6918, -4868, -10287, -18015, -8170, 223, 10725, 16988, 3732, 23966, 36744, 26159, -4228, -12409, 5276, -2136, 8837, 22657, 49879, 30506, 10565, -4755, 659, -9298, -21059, -24556, -5614, 14629, -12834, -40800, -41270, -22411, 5156, -3871, 794, 4288, -171, 4648, -2179, 1298, -6357, -7393, 2723, 7243, -5868, 5009, 38573]
$$ [...]
##END NTUPLES=NMR SPECTRUM
##END=
